##TITLE=Analysis number 315336
Compound Code cc 46501
Book Reference 441/177
Project Code adrs
Chemist Name colinb
##JCAMPDX= 6.0         $$ Bruker NMR JCAMP-DX V2.0
##DATA TYPE= NMR SPECTRUM
##DATA CLASS= NTUPLES
##ORIGIN= Bruker BioSpin GmbH
##OWNER= NMR
$$ XWIN-NMR		Version 3.5
$$ Tue Nov 15 11:38:51 2005 GMT Standard Time (UT+0h)  MAYBRIDGE\NMR@NMR_250MHZ
##.OBSERVE FREQUENCY= 250.131544655141
##.OBSERVE NUCLEUS= ^1H
##.ACQUISITION MODE= SIMULTANEOUS (DQD)
##.ACQUISITION SCHEME= undefined
##.AVERAGES= 16
##.DIGITISER RES= 18
##SPECTROMETER/DATA SYSTEM= dpx250
##.PULSE SEQUENCE= zg30
##.SOLVENT NAME= DMSO
##.SHIFT REFERENCE= (INTERNAL, DMSO, 0, 16.522)
##AUDIT TRAIL= $$ (NUMBER, WHEN, WHO, WHERE, WHAT)
$$ ##TITLE= Audit trail, XWIN-NMR		Version 3.5
$$ ##JCAMPDX= 5.01
$$ ##ORIGIN= Bruker BioSpin GmbH
$$ ##OWNER= NMR
$$ C:\u/data/dgb/nmr/ADRS/12410/pdata/1/auditp.txt
$$ ##AUDIT TRAIL=  $$ (NUMBER, WHEN, WHO, WHERE, WHAT)
(   1,<2005-11-15 11:38:15.04 +000>,<MAYBRIDGE\NMR>,<NMR_250MHZ>,
      <created by zg, POWCHK disabled, PULCHK disabled
       configuration hash MD5:
       62 19 C7 07 E1 42 D1 B7 37 6C 3D D0 77 39 F9 E6
       data hash MD5: 64K
       74 9F F2 0C F3 32 80 E1 D4 C3 76 FD 96 D2 EB D9>)
(   2,<2005-11-15 11:38:31.15 +000>,<MAYBRIDGE\NMR>,<NMR_250MHZ>,
      <Start of raw data processing
       ef LB = 0.3 FT_mod = 6 PKNL = 1 SI = 32K 
       data hash MD5: 32K
       78 AE 3C 02 DA 31 94 BE C2 74 A1 70 1F 87 D7 6E>)
(   3,<2005-11-15 11:38:34.51 +000>,<MAYBRIDGE\NMR>,<NMR_250MHZ>,
      <apk 
       data hash MD5: 32K
       80 8F 99 05 85 10 9C 6C CB C5 12 75 F3 74 1B 03>)
(   4,<2005-11-15 11:38:35.70 +000>,<MAYBRIDGE\NMR>,<NMR_250MHZ>,
      <abs ABSG = 5 
       data hash MD5: 32K
       47 D6 43 34 FD EF 54 D1 0F C4 5F BE 15 5B EF DC>)
$$ ##END=
$$ 
$$ hash MD5
$$ FE DB 5A 28 1D 40 F8 FF D8 E7 B3 DF 2F AD 4D 25
##$RELAX= 
##$RELAX= 
##$RELAX= 
##$RELAX= 
##$RELAX= 
##$RELAX= 
##$RELAX= 
$$ Bruker specific parameters
$$ --------------------------
##$DU= <C:\u>
##$EXPNO= 12410
##$NAME= <ADRS>
##$PROCNO= 1
##$TYPE= <nmr>
##$USER= <dgb>
##$AMP= (0..31)
100 100 100 100 100 100 100 100 100 100 100 100 100 100 100 100 100 100 
100 100 100 100 100 100 100 100 100 100 100 100 100 100 
##$AQSEQ= 0
##$AQ_mod= 3
##$AUNM= <au_zg>
##$AUTOPOS= <24 >
##$BF1= 250.13
##$BF2= 250.13
##$BF3= 250.13
##$BF4= 250.13
##$BF5= 500.13
##$BF6= 500.13
##$BF7= 500.13
##$BF8= 500.13
##$BYTORDA= 1
##$CFDGTYP= 0
##$CFRGTYP= 5
##$CHEMSTR= <none>
##$CNST= (0..31)
1 1 145 1 1 1 1 1 1 1 1 1 1 1 1 1 1 1 1 1 1 1 1 1 1 1 1 1 1 1 1 1 
##$CPDPRG= <>
##$CPDPRG1= <>
##$CPDPRG2= <>
##$CPDPRG3= <>
##$CPDPRG4= <mlev>
##$CPDPRG5= <mlev>
##$CPDPRG6= <mlev>
##$CPDPRG7= <mlev>
##$CPDPRG8= <mlev>
##$CPDPRGB= <>
##$CPDPRGT= <>
##$D= (0..31)
0 1 0 0 0 0 0 0 0 0.06 0 0 0 0 0 0 0.0002 0 0 0 0 0 0 0 0 0 0 0 0 0 0 
0 
##$DATE= 1132054694
##$DBL= (0..7)
120 120 120 120 120 120 120 120 
##$DBP= (0..7)
150 150 150 150 150 150 150 150 
##$DBP07= 0
##$DBPNAM0= <>
##$DBPNAM1= <>
$$ [...]
##$SUBNAM7= <"">
##$SUBNAM8= <"">
##$SUBNAM9= <"">
##$SW= 20.6930455092707
##$SWIBOX= (0..15)
0 0 3 0 0 0 0 0 0 0 0 0 0 0 0 0 
##$SW_h= 5175.983436853
##$TD= 65536
##$TD0= 1
##$TE= 295.16
##$TE2= 300
##$TE3= 300
##$TEG= 300
##$TL= (0..7)
0 120 120 120 120 120 120 120 
##$TP= (0..7)
150 150 150 150 150 150 150 150 
##$TP07= 0
##$TPNAME0= <>
##$TPNAME1= <>
##$TPNAME2= <>
##$TPNAME3= <>
##$TPNAME4= <>
##$TPNAME5= <>
##$TPNAME6= <>
##$TPNAME7= <>
##$TPOAL= (0..7)
0.5 0.5 0.5 0.5 0.5 0.5 0.5 0.5 
##$TPOFFS= (0..7)
0 0 0 0 0 0 0 0 
##$TUNHIN= 0
##$TUNHOUT= 0
##$TUNXOUT= 0
##$USERA1= <user>
##$USERA2= <user>
##$USERA3= <user>
##$USERA4= <user>
##$USERA5= <user>
##$V9= 5
##$VALIST= <valist>
##$VCLIST= <CCCCCCCCCCCCCCC>
##$VD= 0
##$VDLIST= <DDDDDDDDDDDDDDD>
##$VPLIST= <PPPPPPPPPPPPPPP>
##$VTLIST= <TTTTTTTTTTTTTTT>
##$WBST= 1024
##$WBSW= 4
##$XGAIN= (0..3)
0 0 0 0 
##$XL= 0
##$YL= 0
##$YMAX_a= 562303
##$YMIN_a= -437555
##$ZGOPTNS= <>
##$ZL1= 120
##$ZL2= 120
##$ZL3= 120
##$ZL4= 120
##$ABSF1= 16.522
##$ABSF2= -4.171173
##$ABSG= 5
##$ABSL= 3
##$ALPHA= 0
##$AQORDER= 0
##$ASSFAC= 0
##$ASSFACI= 0
##$ASSFACX= 0
##$ASSWID= 0
##$AUNMP= <proc_1d>
##$AZFE= 0.1
##$AZFW= 0.1
##$BCFW= 0
##$BC_mod= 0
##$BYTORDP= 0
##$COROFFS= 0
##$CY= 12.5
##$DATMOD= 1
##$DC= 0
##$DFILT= <>
##$DTYPP= 0
##$F1P= 14.0000005364418
##$F2P= -0.99999901652339
##$FCOR= 0.5
##$FTSIZE= 32768
##$FT_mod= 6
##$GAMMA= 0
##$GB= 0
##$INTBC= 1
##$INTSCL= 1
##$ISEN= 128
##$LB= 0.3
##$LEV0= 0
##$LPBIN= 0
##$MAXI= 10000
##$MC2= 0
##$MEAN= 0
##$ME_mod= 0
##$MI= 0
##$NCOEF= 0
##$NC_proc= -2
##$NLEV= 6
##$NOISF1= 0
##$NOISF2= 0
##$NSP= 0
##$NTH_PI= 0
##$NZP= 0
##$OFFSET= 16.522
##$PC= 1
##$PHC0= 66.06092
##$PHC1= 7.549382
##$PH_mod= 1
##$PKNL= yes
##$PPARMOD= 0
##$PSCAL= 4
##$PSIGN= 0
##$REVERSE= no
##$SF= 250.13
##$SI= 32768
##$SIGF1= 0
##$SIGF2= 0
##$SINO= 400
##$SIOLD= 32768
##$SREGLST= <1H.DMSO>
##$SSB= 0
##$STSI= 32768
##$STSR= 0
##$SW_p= 5175.98343685301
##$SYMM= 0
##$S_DEV= 0
##$TDeff= 65536
##$TDoff= 0
##$TI= <Analysis number 999999
Compound Code 99
Book Reference 9
Project Code 9>
##$TILT= no
##$TM1= 0
##$TM2= 0
##$TOPLEV= 0
##$USERP1= <user>
##$USERP2= <user>
##$USERP3= <user>
##$USERP4= <user>
##$USERP5= <user>
##$WDW= 1
##$XDIM= 32768
##$YMAX_p= 278570234
##$YMIN_p= -109947
$$ End of Bruker specific parameters
$$ ---------------------------------
##NTUPLES= NMR SPECTRUM
##VAR_NAME=  FREQUENCY,     SPECTRUM/REAL,   SPECTRUM/IMAG
##SYMBOL=    X,             R,               I
##VAR_TYPE=  INDEPENDENT,   DEPENDENT,       DEPENDENT
##VAR_FORM=  AFFN,          ASDF,            ASDF
##VAR_DIM=   32768,         32768,           32768
##UNITS=     HZ,            ARBITRARY UNITS, ARBITRARY UNITS
##FACTOR=    0.157963299565203, 1,           1
##FIRST=     4132.6476996994, 0,             0
##LAST=      -1043.33573715361, 0,           0
##MIN=       -1043.33573715361, -109947,     0
##MAX=       4132.6476996994, 278570234,     0
$$ Real data points
##PAGE= N=1
##DATA TABLE= (X++(R..R)), XYDATA
$$ [...]
$$ plain form
18990 221692 216274 209081 203359 193165 201775 192022 183009 189133 200558 242453 270316 276517 268730
18977 268730 244092 206969 197218 199430 195750 191381 178533 182174 205532 210919 211836 201419 181452
18964 181452 167423 161186 163441 171529 165976 160782 155302 158647 156503 158054 143426 136582 125217
18951 125217 114044 112138 100943 98950 111688 129045 146166 136463 121048 116466 123071 128475 150898
18938 150898 151042 142682 144233 146448 148541 154103 146367 135586 138113 151062 158784 153446 159238 158583
18924 158583 153784 160475 168692 168033 165657 182655 190910 183505 174132 175688 179420 176517 171065 167843
18910 167843 161868 160324 150854 154070 159211 148599 153035 150438 139940 131474 128924 139452 126574
18897 126574 119181 109527 123366 121199 122460 121547 126590 130153 136682 139884 145692 132750 124938 126271
$$ packed form
18990B21692n418p193n722j0194Q610r753r013O124J1425M1895K7863O201p787
18977B68730k4638l7123r751K212l680m369j2848L641K3358N387R17j0417j9967
18964A81452j4029o237K255Q088n553n194n480L345k144J551j4628o844j1365
18951A25217j1173j906j1195j993J2738J7357J7121r703j5415m582O605N404K2423
18938A50898J44q360J551K215K093N562p736j0781K527J2949P722n338N792o55
18924A58583m799O691Q217o59k376J6998Q255p405r373J556L732k903n452l222
18910A67843n975j544r470L216N141j0612M436k597j0498q466k550J0528j2878
18897A26574p393r654J3839k167J261r13N043L563O529L202N808j2942p812J333
$$ plain form
18883 126271 131876 111855 112279 110876 115311 130883 142332 143788 128539 123623 126979 129315 139787
18870 139787 147824 150134 162938 162069 158417 156512 155385 154071 154921 149273 158380 158006 154448 145673 127983
18855 127983 139867 148016 149136 155934 162730 168461 162967 169467 162223 176839 190843 192306 181040
18842 181040 186095 196518 205854 195654 186182 169251 160417 157459 157886 158989 154839 156221 169199
18829 169199 182815 180562 171184 166100 158004 162964 164269 148855 153319 156608 169447 182022 199774
18816 199774 203098 211168 209412 198437 194000 200626 192316 173987 162715 175741 173074 185856 204866
18803 204866 195397 206198 194606 177126 180015 195718 199220 207292 204963 195129 191781 200626 205134
18790 205134 203253 200667 176824 181824 184344 182490 196997 219340 225735 236976 232642 231546 237679
$$ packed form
18883A26271N605k0021M24j403M435J5572J1449J456j5249m916L356K336J0472
18870A39787Q037K310J2804q69l652j905j127j314Q50n648R107l74l558q775j7690
18855A27983J1884Q149J120O798O796N731n494O500p244J4616J4004J463j1266
18842A81040N055J0423R336j0200r472j6931q834k958M27J103m150J382J2978
18829A69199J3616k253r378n084q096M960J305j5414M464L289J2839J2575J7752
18816A99774L324Q070j756j0975m437O626q310j8329j1272J3026k667J2782J9010
18803B04866r469J0801j1592j7480K889J5703L502Q072k329r834l348Q845M508
18790B05134j881k586k3843N000K520j854J4507K2343O395J1241m334j096O133
$$ plain form
18777 237679 233043 230652 235284 227423 219810 218594 231042 236024 238688 234216 240008 248498 251834 250756
18763 250756 251159 238751 248430 266580 278651 279159 276545 271246 261245 260487 250491 238448 237771 244627
18749 244627 269709 282223 288160 276787 285894 289695 296648 303505 304175 308819 312169 307576 292981
18736 292981 298191 303485 309576 323120 333812 347820 345814 334817 342892 339649 336275 328797 324931
18723 324931 337614 355671 368213 377230 363481 355221 365772 382945 397891 395835 398544 391680
18711 391680 387700 392068 392109 391020 410156 429356 442247 468101 489305 502463 528410 533523 520570
18698 520570 516814 518496 522393 528720 544428 571018 576688 584117 602991 606645 629228 690434 743637
18685 743637 780587 800033 808487 812542 812318 825682 859273 903636 952954 984813 1031513 1100871
$$ packed form
18777B37679m636k391M632p861p613j216J2448M982K664m472N792Q490L336j078
18763B50756M03j2408R679J8150J2071N08k614n299j0001p58r996j2043o77O856
18749B44627K5082J2514N937j1373R107L801O953O857O70M644L350m593j4595
18736B92981N210N294O091J3544J0692J4008k006j0997Q075l243l374p478l866
18723C24931J2683J8057J2542R017j3749q260J0551J7173J4946k056K709o864
18711C91680l980M368M1j089J9136J9200J2891K5854K1204J3158K5947N113j2953
18698E20570l756J682L897O327J5708K6590N670P429J8874L654K2583O1206N3203
18685G43637L6950J9446Q454M055k24J3364L3591M4363M9318L1859M6700O9358
$$ plain form
18673 1100871 1199647 1314231 1411856 1522130 1646339 1808616 2023945 2315610 2735017 3307063
18663 3307063 4046569 4874000 5780343 6892106 8357212 10344091 12666627 14583862 15485497
18654 15485497 15512396 15097629 14367911 13295593 12088422 11047754 10517647 10802334 11981030
18645 11981030 13718741 15273724 16334341 17091532 17611510 17887471 17846780 17375660 16614291
18636 16614291 15633227 14349128 12993251 11765537 10862627 10464120 10615127 11095618 11393791
18627 11393791 11143765 10423003 9541201 8834085 8567954 8878822 9912748 11791366 14514742
18618 14514742 17617980 20528138 23221757 25630469 27095286 27186689 26293322 25123038
18610 25123038 24234595 23820158 23921530 24883626 27303120 31585604 36985455 41728480 44497296
$$ packed form
18673A100871R8776J14584R7625J10274J24209J62277K15329K91665M19407N72046
18663C307063P39506Q27431R06343J111763J465106J986879K322536J917235R01635
18654A5485497K6899m14767p29718j072318j207171j040668n30107K84687J178696
18645A1981030J737711J554983J060617P57191N19978K75961m0691m71120p61369
18636A6614291r81064j284099j355877j227714r02910l98507J51007M80491K98173
18627A1393791k50026p20762q81802p07116k66131L10868J033926J878618K723376
18618A4514742L103238K910158K693619K408712J464817R1403q93367j170284
18610B5123038q88443m14437J01372R62096K419494M282484N399851M743025K768816
$$ plain form
18601 44497296 44616577 42159015 38347845 35055245 33883849 35911797 41189974 47886665
18593 47886665 53332958 55359785 52659030 46083104 37997131 30504453 24916874 21712383
18585 21712383 20500859 20233302 19905602 19393798 19049283 19033958 19164158 19144999 18760971
18576 18760971 18114760 17281365 16094870 14810434 13796001 13240011 13452412 14681869 16732717
18567 16732717 18566846 19014555 17810635 15548727 12982825 10756682 9230885 8400415
18559 8400415 8183358 8580443 9555940 10975204 12412283 13484542 13958299 13749172 13153620
18550 13153620 12719632 12793569 13287693 13628603 13301534 12388786 11247390 10265152 9785090
18541 9785090 9992126 10940082 12764042 15729638 20225749 26408282 33490519 39618996
$$ packed form
18601D4497296J19281k457562l811170l292600j171396K027948N278177O696691
18593D7886665N446293K026827k700755o575926q085973p492678n587579l204491
18585B1712383j211524k67557l27700n11804l44515j5325J30200j9159l84028
18576A8760971o46211q33395j186495j284436j014433n55990K12401J229457K050848
18567A6732717J834129M47709j203920k261908k565902k226143j525797q30470
18559H400415k17057L97085R75497J419264J437079J072259M73757k09127n95552
18550A3153620m33988P3937M94124L40910l27069r12748j141396r82238m80062
18541I785090K07036R47956J823960K965596M496111O182533P082237O128477
$$ plain form
18533 39618996 43325403 44650266 45026899 46008373 47806301 48647338 46573767 41622171
18525 41622171 35296156 29202493 24325513 20803657 18522297 17333338 17049286 17476486
18517 17476486 18066485 18038306 17013735 15232714 13161188 11221449 9706660 8719061 8230928
18508 8230928 8190850 8623260 9401272 10200265 10889994 11731809 13104839 15509196 19358684
18499 19358684 24418739 29205252 31845048 31709818 29498178 26487153 23884287 22526152
18491 22526152 22855816 24789917 27437717 29972011 32618583 36028930 40861820 46626826
18483 46626826 51421404 53554221 52177303 47234682 39811186 31923694 25107265 20123489
18475 20123489 17247993 16353075 17176473 19114492 20712181 21097486 20419794 18653449 16163841
$$ packed form
18533C9618996L706407J324863L76633R81474J797928Q41037k073571m951596
18525D1622171o326015o093663m876980l521856k281360j188959k84052M27200
18517A7476486N89999k8179j024571j781021k071526j939739j514789r87599m88133
18508H230928m0078M32410P78012P98993O89729Q41815J373030K404357L849488
18499A9358684N060055M786513K639796j35230k211640l011025k602866j358135
18491B2526152L29664J934101K647800K534294K646572L410347M832890N765006
18483D6626826M794578K132817j376918m942621p423496p887492o816429m983776
18475B0123489k875496q94918Q23398J938019J597689L85305o77692j766345k489608
$$ plain form
18466 16163841 13582212 11139893 9001499 7285138 5967178 4991474 4330018 3900458
18458 3900458 3651970 3564307 3622291 3842164 4258758 4985574 6112118 7694075 9497557
18449 9497557 11042092 11784027 11558811 10872084 10376090 10462037 10992869 11128598 10334331
18440 10334331 8926185 7331913 5931968 4909111 4146008 3498216 2933918 2439391 2036882
18431 2036882 1722153 1495919 1334195 1231740 1173810 1160854 1169636 1194557 1243928 1275223 1286671
18420 1286671 1286910 1276615 1274644 1341928 1520467 1828997 2224360 2584415 2849475 2997770 2929818
18409 2929818 2678404 2386452 2134137 2046924 2147339 2455495 2849733 3138588 3222486 3057596
18399 3057596 2702180 2284077 1881309 1549942 1321759 1201909 1216133 1317758 1464303 1504732
$$ packed form
18466A6163841k581629k442319k138394j716361j317960r75704o61456m29560
18458C900458k48488q7663N7984K19873M16594P26816J126544J581957J803482
18449I497557J544535P41935k25216o86727m95994Q5947N30832J35729p94267
18440A0334331j408146j594272j399945j022857p63103o47792n64298m94527m02509
18431B036882l14729k26234j61724j02455n7930j2956Q782K4921M9371L1295J1448
18420A286671K39j0295j971O7284J78539L08530L95363L60055K65060J48295o7952
18409B929818k51414k91952k52315q7213J00415L08156L94238K88855Q3898j64890
18399C057596l55416m18103m02768l31367k28183j19850J4224J01625J46545M0429
$$ plain form
18389 1504732 1393447 1183836 939161 708944 534184 418817 346115 289853 257664 238410
18379 238410 224981 209924 195954 191768 188925 179239 164013 150384 147299 145103 122588 118890 110815
18366 110815 94790 96568 97153 100136 83168 74312 82862 95257 88764 90071 75866 74640 71374
18353 71374 63708 54914 50871 51368 60365 61791 58105 41878 31005 34348 26735 17038 14291 13246
18339 13246 4782 -3395 7798 24259 32773 29944 30854 25983 16823 8124 3916 -4410 -457 2830
18325 2830 -7173 -4974 4038 -3798 -2787 12285 8875 -3974 -4538 -6837 -11939 -3426 4601 6915
18311 6915 2921 -18877 -23523 -26667 -27258 -28391 -29635 -30799 -32387 -21326 -16470 -26818 -9739 -8737
18297 -8737 -21328 -29539 -19320 -22644 -24958 -34584 -36202 -25586 -20319 -30302 -24452 -28224 -30124 -28326
$$ packed form
18389A504732j11285k09611k44675k30217j74760j15367p2702n6262l2189j9254
18379B38410j3429j5057j3970m186k843r686j5226j3629l085k196k2515l698q075
18366A10815j6025J778N85K983j6968q856Q550J2395o493J307j4205j226l266
18353G1374p666q794m043M97Q997J426l686j6227j0873L343p613r697k747j045
18339A3246q464q177J1193J6461Q514k829R10m871r160q699m208q326L953L287
18325B830j0003K199R012p836J011J5072l410j2849n64k299n102Q513Q027K314
18311F915l994k1798m646l144n91j133j244j164j588J1061M856j0348J7079J002
18297h737j2591q211J0219l324k314r626j618J0616N267r983N850l772j900J798
$$ plain form
18283 -28326 -29080 -49931 -62724 -51676 -43146 -47397 -41519 -33204 -24006 -12018 -11260 -19206 -21075 -23031
18269 -23031 -19544 -20153 -25743 -25525 -31840 -31400 -29717 -17429 -13425 -12023 -13906 -4641 3670 1905 2239
18254 2239 -22828 -36711 -18599 -1880 3475 3573 -9954 -19782 -3483 8523 5904 6664 11934 23460
18240 23460 14265 1437 -4875 -13497 -8947 -4349 -4252 -7131 -6043 -3454 -10506 -23139 -10512 2514
18226 2514 1929 -14188 -25694 -40878 -47438 -54904 -54111 -42325 -55084 -54985 -42462 -40936 -28328 -30796
18212 -30796 -32186 -17665 -6570 -6564 -5325 -1591 -2048 -454 -9976 -18434 -18905 -17428 -10288 -13987 -19104
18197 -19104 -6251 -7660 -17847 -14245 -11255 -21729 -23203 -13483 -4169 -9052 -11734 -16308 -21849 -19100
18183 -19100 -20762 -25852 -29619 -35298 -33827 -41001 -37851 -39894 -40763 -40757 -32175 -46895 -62914 -62419 -54763
$$ packed form
18283b8326p54k0851j2793J1048Q530m251N878Q315R198J1988P58p946j869j956
18269b3031L487o09n590K18o315M40J683J2288M004J402j883R265Q311j765L34
18254B239k5067j3883J8112J6719N355R8j3527r828J6299J2006k619P60N270J1526
18240B3460r195j2828o312q622M550M598R7k879J088K589p052j2633J2627J3026
18226B514n85j6117j1506j5184o560p466P93J1786j2759R9J2523J526J2608k468
18212c0796j390J4521J1095OJ239L734m57J594r522q458m71J477P140l699n117
18197a9104J2853j409j0187L602K990j0474j474R720R314m883k682m574n541K749
18183a9100j662n090l767n679J471p174L150k043q69OQ582j4720j6019M95P656
$$ plain form
18168 -54763 -43515 -22116 -12131 -14506 -16008 -11089 -15952 -42118 -48882 -44097 -36302 -27315 -26272 -25952
18154 -25952 -31200 -30218 -35359 -38091 -26127 -15237 -7399 -10194 -21377 -23447 -15432 16282 62064
18141 62064 95824 105799 110922 120938 125096 136657 137181 124720 122904 130085 141490 167450 169904
18128 169904 175378 165216 144742 130971 118143 118032 122891 127778 128466 123710 118053 107960 100460
18115 100460 88893 76145 65872 57296 41731 31581 52671 60785 61248 58950 60027 52850 43710
18102 43710 47220 51613 47726 42949 44107 42883 52518 73915 97839 108676 106798 110229 110001 114721
18088 114721 126297 131742 132499 133156 108463 98102 101407 111081 134206 149712 152938 140208 123027
18075 123027 99416 80923 62417 46095 71370 78787 83080 94477 102900 121838 126197 115116
$$ packed form
18168e4763J1248K1399R985k375j502M919m863k6166o764M785P795Q987J043L20
18154b5952n248R82n141k732J1964J0890P838k795j1183k070Q015L1714M5782
18141F2064L3760R975N123J0016M158J1561N24j2461j816P181J1405K5960K454
18128A69904N474j0162k0474j3771j2828j11M859M887O88m756n657j0093p500
18115A00460j1567j2748j0273q576j5565j0150K1090Q114M63k298J077p177r140
18102D3710L510M393l887m777J158j224R635K1397K3924J0837j878L431k28M720
18088A14721J1576N445P57O57k4693j0361L305R674K3125J5506L226j2730j7181
18075A23027k3611j8493j8506j6322K5275P417M293J1397Q423J8938M359j1081
$$ plain form
18063 115116 116597 115905 100135 92823 98345 89282 89122 92923 89413 77710 67991 69764 63131 62753
18049 62753 64189 58644 50168 39560 40797 47989 40223 45763 45935 26885 30670 52741 67915 50217
18035 50217 18061 26575 43628 68950 87021 89156 101656 114184 125733 142522 176969 191964
18023 191964 199881 213885 218102 226774 220039 212960 232277 240309 264876 308250 365486 440337 517415
18010 517415 566735 571718 509288 438545 352638 274859 225356 193266 170911 151131 149791 141145
17998 141145 126597 113986 117219 128928 132242 136888 126062 128355 114702 106548 108681 100174 89518
17985 89518 89207 87438 75769 69102 66320 61330 64788 79411 82956 102403 118202 111831 94857
17972 94857 79482 64063 63137 79141 74346 57594 35164 30176 37528 38498 40905 49585 53728 69592
$$ packed form
18063A15116J481o92j5770p312N522r063j60L801l510j1703r719J773o633l78
18049F2753J436n545q476j0608J237P192p766N540J72j9050L785K2071J5174j7698
18035E0217l2156Q514J7053K5322J8071K135J2500J2528J1549J6789L4447J4995
18023A91964P917J4004M217Q672o735p079J9317Q032K4567M3374N7236P4851P7078
18010E17415M9320M983o2430p0743q5907p7779m9503l2090k2355j9780j340q646
17998A41145j4548j2611L233J1709L314M646j0826K293j3653q154K133q507j0656
17985H9518l11j769j1669o667k782m990L458J4623L545J9447J5799o371j6974
17972I4857j5375j5419r26J6004m795j6752k2430m988P352R70K407Q680M143J5864
$$ plain form
17958 69592 81421 91579 93662 114495 125448 119385 101851 79059 71920 70973 81079 78687 73006
17945 73006 74905 72237 67519 66171 65388 55347 49320 45910 50193 58140 42349 30114 19086 24426
17931 24426 48130 49587 47848 42941 33251 22459 11128 -1723 -19741 -15997 -7114 -6786 -5633
17918 -5633 -5204 3719 -7209 -5518 919 -8920 -5461 14019 20605 17883 14036 2484 1985 7492
17904 7492 13460 25123 26988 24782 35011 31658 20803 14147 12482 9159 156 10493 19997 15328
17890 15328 28380 31689 30023 24741 11046 -23578 -42734 -34551 -3260 5502 -3122 -2623 8267
17877 8267 18955 8361 3409 14283 11724 8269 -4176 -15749 -3383 15090 7415 -207 -3548
17864 -3548 -8207 -4636 -7212 1539 -3128 -3984 -12409 -23712 -15638 2290 -9310 -14025 -8893 -3470
$$ packed form
17958F9592J1829J0158K083K0833J0953o063j7534k2792p139r47J0106k392n681
17945G3006J899k668m718j348p83j0041o027l410M283P947j5791j2235j1028N340
17931B4426K3704J457j739m907r690j0792j1331j2851j8018L744Q883L28J153
17918e633M29Q923j0928J691O437r839L459J9480O586k722l847j1552m99N507
17904G492N968J1663J865k206J0229l353j0855o656j665l323r003J0337R504m669
17890A5328J3052L309j666n282j3695l4624j9156Q183L1291Q762q624M99J0890
17877H267J0688j0594m952J0874k559l455j2445j1573J2366J8473p675p622l341
17864c548m659L571k576Q751m667q56q425j1303Q074J7928j1600m715N132N423
$$ plain form
17850 -3470 1162 -10198 -16759 -11589 -8156 -9965 -18998 -19021 -13895 -9713 -3399 -3096 -3863 -8656 6198
17835 6198 15710 14968 -4956 -23617 -17465 -3023 -383 3676 7226 3494 -723 -3712 -21001 -20447
17821 -20447 -2678 -1880 -3192 -11564 -26672 -34914 -35353 -18733 -19313 -28027 -30898 -33054 -36553 -48195
17807 -48195 -36083 -33778 -28377 -12543 -21644 -33183 -25626 -24491 -17801 -10775 -2155 5968 -424 -7751
17793 -7751 -26133 -34104 -29047 -21294 -15748 -10148 -11139 3436 11161 7214 6918 10967 2751 14296
17779 14296 7659 -10839 -9108 1084 10145 10494 10538 10701 2390 379 -3415 -2853 6647 14510 4724
17764 4724 9108 26701 21511 16259 17849 33234 50098 62929 52246 36455 6498 -444 -9501
17751 -9501 -23941 -22403 -14269 -3453 -11811 -21258 -22654 10 4321 105 -2387 -709 -4330 1405
$$ packed form
17850c470M632j1360o561N170L433j809r033k3N126M182O314L03p67m793J4854
17835F198R512p42j9924j8661O152J4442K640M059L550l732m217k989j7289N54
17821b0447J7769P98j312q372j5108q242m39J6620n80q714k871k156l499j1642
17807d8195J2112K305N401J5834r101j1539P557J135O690P026Q620Q123o392p327
17793g751j8382p971N057P753N546N600r91J4575P725l947k96M049q216J1545
17779A4296o637j8498J731J0192R061L49M4J63q311k011l794N62R500P863r786
17764D724M384J7593n190n252J590J5385J6864J2831j0683j5791k9957o942r057
17751i501j4440J538Q134J0816q358r447j396K2664M311m216k492J678l621N735
$$ plain form
17737 1405 8912 9106 10104 9748 -10120 -9772 -9196 -11679 -18401 -15748 -1351 3251 4350 5685 8319
17722 8319 7711 -4812 -11055 3999 22653 14252 -9610 -4773 5392 -5318 -17917 -10934 -20906
17709 -20906 -16975 -14088 -4119 17875 18979 34035 27293 15559 25106 11915 3455 14389 19783
17696 19783 17680 38652 60384 60061 34478 28432 22554 16992 17612 11256 3896 5260 5556 14165
17682 14165 21785 25139 26692 19997 14751 24958 34540 31764 19720 3175 -6939 -734 -7017
17669 -7017 1936 -4365 -16661 -12593 -13297 -12077 9534 14083 -1625 8776 6317 6894 3968 9467
17655 9467 7826 -2385 -5895 14698 30939 21676 2797 -19796 -11207 -889 215 -1462 -6808
17642 -6808 -1472 -10449 -31236 -28360 -10475 -9647 -9358 -14125 1469 14301 16293 21711 22187 28046
$$ packed form
17737A405P507J94R98l56j9868L48N76k483o722K653J4397M602J099J335K634
17722H319o08j2523o243J5054J8654q401k3862M837J0165j0710j2599O983r972
17709b0906L931K887R969K1994J104J5056o742j1734R547j3191q460J0934N394
17696A9783k103K0972K1732l23k5583o046n878n562O20o356p360J364K96Q609
17682A4165P620L354J553o695n246J0207R582k776j2044j6545j0114O205o283
17669g017Q953o301j2296M068p04J220K1611M549j5708J0401k459N77k926N499
17655I467j641j0211l510K0593J6241r263j8879k2593Q589J0318J104j677n346
17642f808N336q977k0787K876J7885Q28K89m767J5594J2832J992N418M76N859
$$ plain form
17628 28046 35859 35907 38561 51919 37453 35633 31786 16485 21079 35050 41213 30681 31211 40022
17614 40022 36330 33009 28941 30442 39695 44618 37600 33084 31656 27741 40694 48562 50101 54851
17600 54851 55206 56872 65068 76071 71650 71987 54341 35879 27453 42184 53857 38782 25161
17587 25161 27658 49828 50231 38015 39853 34890 46962 62014 71028 73338 68744 80731 101836
17574 101836 116107 119576 129465 135860 102629 82052 74339 53765 22836 15330 7957 4085 12758
17561 12758 31390 38163 38749 45561 50682 41063 21521 12332 14896 31350 53264 61313 54604 45919
17547 45919 36343 28269 23665 26826 40290 58069 65824 68069 56072 53179 55115 56463 44720
17534 44720 31667 33984 53302 63026 77118 81220 82598 90701 85267 93013 91382 82523 84490 79749
$$ packed form
17628B8046P813M8K654J3358j4466j820l847j5301M594J3971O163j0532N30Q811
17614D0022l692l321m068J501R253M923p018m516j428l915J2953P868J539M750
17600E4851L55J666Q196J1003m421L37j7646j8462q426J4731J1673j5075j3621
17587B5161K497K2170M03j2216J838m963J2072J5052R014K310m594J1987K1105
17574A01836J4271L469R889O395l3231k0577p713k0574l0929p506p373l872Q673
17561A2758J8632O773N86O812N121r619j9542r189K564J6454K1914Q049o709q685
17547D5919r576q074m604L161J3464J7779P755K245j1997k893J936J348j1743
17534D4720j3053K317J9318R724J4092M102J378Q103n434P746j631q859J967m741
$$ plain form
17520 79749 78305 75880 78284 97942 112840 122185 121182 117387 109404 105305 103089 107963 113324 121481
17506 121481 133088 140932 160414 185575 194962 195229 182351 180911 177052 177868 176981 166453 169902 194789
17492 194789 210941 220891 228284 243286 258871 287998 319725 356803 379087 394287 421548 435491
17480 435491 442579 468672 497009 545179 579540 617659 674054 747116 867549 1029683 1211459
17469 1211459 1349305 1420164 1429186 1441494 1499216 1615859 1745639 1890513 2083096 2340833
17459 2340833 2706340 3195737 3776127 4415848 5185311 6210796 7738598 10099388 13853114
17450 13853114 20025202 30235769 46803109 71695654 99276888 113421967 107034049
17443 107034049 87012659 62479675 41086005 26455812 17597065 12302405 9019238
$$ packed form
17520G9749j444k425K404J9658J4898R345j003l795p983m099k216M874N361Q157
17506A21481J1607P844J9482K5161R387K67j2878j440l859Q16q87j0528L449K4887
17492A94789J6152R950P393J5002J5585K9127L1727L7078K2284J5200K7261J3943
17480D35491P088K6093K8337M8170L4361L8119N6395P3062J20433J62134J81776
17469A211459J37846P0859R022J2308N7722J16643J29780J44874J92583K57737
17459B340833L65507M89397N80390O39721P69463J025485J527802K360790L753726
17450A3853114O172088J0210567J6567340K4892545K7581234J4145079o387918
17443A07034049k0021390k4532984k1393670j4630193q858747n294660l283167
$$ plain form
17436 9019238 6904509 5495624 4565512 3945693 3511958 3136740 2748583 2374113 2060053
17427 2060053 1822643 1633596 1472518 1320240 1200452 1127217 1099851 1116189 1170105 1204569
17417 1204569 1153819 1013341 851786 693593 538869 436154 371503 319633 281771 260627
17407 260627 243694 231444 222186 222742 204303 204502 211898 206302 191947 193189 198686 178219 160518
17394 160518 156344 148128 131773 121163 106662 94671 84692 78879 76006 66449 72176 99128 109108
17381 109108 107989 97547 69985 45829 43597 44936 48180 52223 54412 52728 37117 32735 37944
17368 37944 40457 27732 21452 24372 31200 27980 26377 38179 55219 45882 29929 15482 15958
17355 15958 19527 23697 21726 21273 8634 4624 -19383 -7536 25527 20593 7001 15603 14741 5677
$$ packed form
17436I019238k114729j408885r30112o19819m33735l75218l88157l74470l14060
17427B060053k37410j89047j61078j52278j19788p3235k7366J6338N3916L4464
17417A204569n0750j40478j61555j58193j54724j02715o4651n1870l7862k1144
17407B60627j6933j2250r258N56j8439J99P396n596j4355J242N497k0467j7701
17394A60518m174q216j6355j0610j4501j1991r979n813k873r557N727K6952R980
17381A09108j119j0442k7562k4156k232J339L244M043K189j684j5611m382N209
17368C7944K513j2725o280K920O828l220j603J1802J7040r337j5953j4447M76
17355A5958L569M170j971m53j2639m010k4007J1847L3063m934j3592Q602q62r064
$$ plain form
17341 5677 9106 16633 14492 19795 27938 23680 8058 9868 9074 9316 20197 18648 26226 30497 32030
17326 32030 33357 52148 61137 62406 69945 62168 46099 25983 7854 -5155 9300 5116 -10377
17313 -10377 -16188 -40251 -20304 -3337 -4641 -8509 -12327 -13772 3097 1763 -10409 -22658 -32237
17300 -32237 -40352 -35816 -36785 -22154 -16632 -30291 -23425 -25383 -25948 -22271 -44057 -72157 -74738 -58474
17286 -58474 -57481 -48011 -33689 -32736 -30169 -33950 -23132 -2928 -13959 -24719 -25012 -29283 -33812 -30647
17272 -30647 -32027 -39352 -37511 -33733 -33590 -32038 -36822 -50535 -40319 -22825 -18956 -23956 -23075 -28552
17258 -28552 -28058 -38117 -13561 5575 7119 12240 20872 29188 21926 15876 22108 30475 20484 7869
17244 7869 -11719 -23110 -36039 -48704 -52715 -39290 -23136 -10188 -21388 -45415 -52084 -50196
$$ packed form
17341E677L429P527k141N303Q143m258j5622J810p94K42J0881j549P578M271J533
17326C2030J327J8791Q989J269P539p777j6069k0116j8129j3009J4455m184j5493
17313a0377n811k4063J9947J6967j304l868l818j445J6869j334j2172j2249r579
17300c2237q115M536r69J4631N522j3659O866j958n65L677k1786k8100k581J6264
17286e8474R93R470J4322R53K567l781J0818K0204j1031j0760k93m271m529L165
17272c0647j380p325J841L778J43J552m784j3713J0216J7494L869n000Q81n477
17258b8552M94j0059K4556J9136J544N121Q632Q316p262o050O232Q367r991j2615
17244G869j9588j1391j2929j2665m011J3425J6154J2948j1200k4027o669J888
$$ plain form
17232 -50196 -33685 -20533 -19658 -29889 -31202 -21418 -10736 -23714 -27833 -18925 -22590 -35150 -29559
17219 -29559 -39015 -27625 -21349 -23161 -17916 -17145 -21773 -25498 -12015 -17254 -16965 -11471 -5794 -21105
17205 -21105 -23621 -23493 -30553 -37628 -31149 -6976 14032 12571 -7163 -18480 -26622 -13839 -20229
17192 -20229 -23954 -17527 -8332 -11692 -18907 -24164 -24774 -21993 -27804 -35313 -39052 -33777 -37621 -28648 -5517
17177 -5517 -3453 3168 9440 -12378 -30440 -30566 -16811 -19351 -17212 -11240 -8365 -18643 -23406 -22669
17163 -22669 -13714 -10362 -2813 1549 247 -1495 3312 7812 8185 10639 1804 -5335 -1926 -6818 -14629
17148 -14629 -3026 -105 -13135 -28426 -33303 -32903 -27013 -29873 -29145 -30096 -23720 -39033 -51779 -60117
17134 -60117 -76479 -85208 -85935 -80409 -71231 -63100 -62839 -67330 -64619 -44869 -36683 -45282 -35660 -16522
$$ packed form
17232e0196J6511J3152Q75j0231j313R784J0682j2978m119Q908l665j2560N591
17219b9559r456J1390O276j812N245P71m628l725J3483n239K89N494N677j5311
17205b1105k516J28p060p075O479K4173K1008j461j9734j1317q142J2783o390
17192b0229l725O427R195l360p215n257o10K781n811p509l739N275l844Q973K3131
17177e517K064O621O272k1818j8062j26J3755k540K139N972K875j0278m763P37
17163b2669Q955L352P549M362j302j742M807M500L73K454q835p139L409m892p811
17148a4629J1603K921j3030j5291m877M00N890k860P28r51O376j5313j2746q338
17134f0117j6362q729p27N526R178Q131K61m491K711J9750Q186q599R622J9138
$$ plain form
17120 -16522 -12163 -23195 -23603 -30990 -19613 -16102 -26898 -35759 -39734 -34512 -33558 -26786 -14256 -839
17106 -839 -2277 5532 2208 -10437 -9341 -7648 -15578 -24348 -5256 10063 -1177 -15422 -9251 -17512
17092 -17512 -16762 -5755 929 -13499 -22671 -34971 -37613 -17934 -14060 -20162 -25117 -24653 -20748 -23770
17078 -23770 -26966 -36113 -10544 8952 3701 5779 -9684 -29706 -20583 -18825 -17851 -3199 7482
17065 7482 1000 3620 1700 5113 11312 9451 -2938 -12357 -13331 -4103 -3811 -17318 -27020 -34323 -17690
17050 -17690 -8071 -5113 -12003 -22948 -23744 -17773 -15092 -27828 -24374 -27249 -34945 -32539 -18991 -10797
17036 -10797 -21481 -35466 -46200 -41761 -28671 -23416 -34595 -25534 -10761 -17303 -13450 -5635 -20914
17023 -20914 -22997 -16674 -7531 -13440 -12481 -2847 -6476 -10477 -19926 -9748 -12515 -13947 -17945 -28087
$$ packed form
17120a6522M359j1032m08p387J1377L511j0796q861l975N222R54O772J2530J3417
17106h39j438P809l324j2645J096J693p930q770J9092J5319j1240j4245O171q261
17092a7512P50J1007O684j4428r172j2300k642J9679L874o102m955M64L905l022
17078b3770l196r147K5569J9496n251K078j5463k0022R123J758R74J4652J0681
17065G482o482K620j920L413O199j861j2389r419r74R228K92j3507r702p303J6633
17050a7690R619K958o890j0945p96N971K681j2736L454k875p696K406J3548Q194
17036a0797j0684j3985j0734M439J3090N255j1179R061J4773o542L853P815j5279
17023b0914k083O323R143n909R59R634l629m001r449J0178k767j432l998j0142
$$ plain form
17009 -28087 -22871 -3724 10106 5362 -4548 -20994 -34222 -40443 -40794 -31557 -23723 -20303 -31767
16996 -31767 -29476 -30556 -33862 -24110 -34563 -29364 -46084 -42629 -27764 -25227 -13815 -10987 -5956
16983 -5956 -11062 -22097 -27835 -27848 -24708 -14762 -12666 -9226 -13158 -18835 -10589 -26586 -39649 -45258
16969 -45258 -37137 -14088 1862 -2322 -531 -1379 3732 -8777 -22902 -14236 -6769 -3717 -3951 -15239
16955 -15239 -26741 -17381 -5088 -18056 -33452 -30619 -27775 -30771 -27910 -28098 -28552 -25373 -8988 7283
16941 7283 11622 5762 -873 -16313 -18696 -21864 -32179 -26939 -19431 -12331 -9321 -14110 6618 8006
16927 8006 -4838 -24222 -28673 -28281 -27188 -30432 -33989 -44897 -37664 -25515 -14777 -15197 -35325 -36814
16913 -36814 -27195 -23784 -28176 -22367 -53168 -53793 -47428 -38921 -21119 -15197 -3237 3315 7707 3013
$$ packed form
17009b8087N216J9147J3830m744r910j6446j3228o221l51R237P834L420j1464
16996c1767K291j080l306R752j0453N199j6720L455J4865K537J1412K828N031
16983e956n106j1035n738j3L140R946K096L440l932n677Q246j5997j3063n609
16969d5258Q121K3049J5950m184J791q48N111j2509j4125Q666P467L052k34j1288
16955a5239j1502R360J2293j2968j5396K833K844k996K861j88m54L179J6385J6271
16941G283M339n860o635j5440k383l168j0315N240P508P100L010m789K0728J388
16927H006j2844j9384m451L92J093l244l557j0908P233J2149J0738m20k0128j489
16913c6814R619L411m392N809l0801o25O365Q507J7802N922J1960O552M392m694
$$ plain form
16899 3013 -3545 -2968 -9955 -16341 -2968 4301 5569 -13117 -6175 6581 11152 19473 25629 28211
16885 28211 33654 44414 61186 78224 91858 119904 154871 202666 274243 342942 392286 399921
16873 399921 364812 294603 212066 147838 98195 76659 56455 40875 31980 23362 30050 29580
16861 29580 13633 9074 7586 4339 -691 5473 -6873 -12520 -7105 -9001 -2985 -10354 -8463 1115
16847 1115 5470 12119 -1365 -872 825 -10663 -7148 5861 6536 -410 -15696 -27218 -25749 -34907
16833 -34907 -37962 -45663 -33869 -21721 -16100 -19644 -10256 -6067 -12886 -25011 -33332 -31029 -17287
16820 -17287 -15769 -21290 -9729 -69 388 -6612 -6009 -12740 -2657 1617 -14825 -15978 -4488 -2664
16806 -2664 -18098 -15124 -18800 -16706 -16519 -7934 -10795 -28985 -30481 -31709 -27127 -23124 -15374 -8134
$$ packed form
16899C013o558N77o987o386J3373P269J268j8686O942J2756M571Q321O156K582
16885B8211N443J0760J6772J7038J3634K8046L4967M7795P1577O8699M9344P635
16873C99921l5109p0209q2537o4228m9643k1536k0204j5580q895q618O688m70
16861B9580j5947m559j488l247n030O164j2346n647N415j896O016p369J891R578
16847A115M355O649j3484M93J697j1488L515J3009O75o946j5286j1522J469r158
16833c4907l055p701J1794J2148N621l544R388M189o819j2125q321K303J3742
16820a7287J518n521J1561R660M57p000O03o731J0083M274j6442j153J1490J824
16806b664j5434K974l676K094J87Q585k861j8190j496j228M582M003P750P240
$$ plain form
16792 -8134 -11443 -18145 -33015 -27290 -17239 -10556 -2733 -7627 -24485 -36803 -36346 -29346 -21809 -12527
16778 -12527 -11846 -10352 -17513 -8027 -22427 -35375 -28853 -31004 -32149 -23784 -31085 -30286 -24259 -26048
16764 -26048 -14847 -3993 -2256 -7113 -13484 -14269 -18494 -13208 -21417 -25069 -24755 -19127 -21825 -37025
16750 -37025 -47127 -35314 -12576 -11486 -1117 1361 -5907 -13787 -8767 -783 -5099 -8533 -9508 -8890
16736 -8890 -15376 -9092 -10392 -17124 -24176 -21596 -16494 -6012 -4036 2788 -3665 -11717 -11919 -11064 -20486
16721 -20486 -23898 -17766 -20369 -45289 -49874 -33877 -17707 -936 899 -5471 -15293 -25954 -28921
16708 -28921 -34799 -40535 -35948 -28210 -26817 -21713 -36365 -51380 -49474 -32703 -29338 -22647 -13255 -3478
16694 -3478 -3756 -5675 -1043 -1730 -2307 1640 -24603 -47603 -31592 -14831 -13701 -7836 4107 -6478
$$ packed form
16792h134l309o702j4870N725J0051O683P823m894j6858j2318M57P000P537R282
16778a2527O81J494p161R486j4400j2948O522k151j145Q365p301P99O027j789
16764b6048J1201J0854J737m857o371p85m225N286q209l652L14N628k698j5200
16750c7025j0102J1813K2738J090J0369K478p268p880N020P984m316l434r75O18
16736h890o486O284j300o732p052K580N102J0482J976O824o453q052k02Q55r422
16721b0486l412O132k603k4920m585J5997J6170J6771J835o370r822j0661k967
16708b8921n878n736M587P738J393N104j4652j5015J906J6771L365O691R392R777
16694c478k78j919M632o87n77L947k6243k3000J6011J6761J130N865J1943j0585
$$ plain form
16680 -6478 -17150 -9804 -9690 -2474 2402 -11682 -31644 -43330 -34162 -23829 -15425 -21898 -14257 6003
16666 6003 -3017 -21616 -33107 -38003 -28639 -23475 -34832 -59302 -52116 -45944 -36850 -30262 -21307 -30397
16652 -30397 -39564 -13052 10763 -2500 -15317 -27245 -29131 -21322 -30773 -30562 -20536 -22298 -20274
16639 -20274 -15494 -18174 -22707 -20227 -37896 -32861 -27589 -28527 -17024 -10731 -6198 -2602 -3718 -464
16625 -464 -14463 -23038 -22520 -8102 5236 -366 -1577 -2013 -9468 -3273 4015 -4341 -8842 -1915 -19463
16610 -19463 -29328 -22815 -23746 -23299 -19119 -12207 -5295 -3966 -10062 -17401 -104 -2388 -13173 -8324
16596 -8324 -8638 -20218 -35223 -30811 -19788 -27473 -36057 -32306 -24647 -13563 -10495 -26143 -22000 -13299
16582 -13299 -6345 -10676 -2782 3361 -9539 -11308 -11135 -16550 -21331 -15079 -2875 -7299 -11673 -11325
$$ packed form
16680f478j0672P346J14P216M876j4084j9962j1686R168J0333Q404o473P641K0260
16666F003r020j8599j1491m896R364N164j1357k4470P186O172R094O588Q955r090
16652c0397r167K6512K3815j3263j2817j1928j886P809r451K11J0026j762K024
16639b0274M780k680m533K480j7669N035N272r38J1503O293M533L596j116L254
16625d64j3999q575N18J4418J3338n602j211m36p455O195P288q356m501O927j7548
16610a9463r865O513r31M47M180O912O912J329o096p339J7297k284j0785M849
16596h324l14j1580j5005M412J1023p685q584L751P659J1084L068j5648M143Q701
16582a3299O954m331P894O143j2900j769J73n415m781O252J2204m424m374L48
$$ plain form
16568 -11325 -30482 -34374 -27100 -36730 -33941 -32726 -8753 4213 -6596 -12723 -11147 -5183 -8991
16555 -8991 -13004 -3780 -11489 2038 5102 9275 596 -8828 -9589 -20067 -27820 -22298 -18744 -17951 -21482
16540 -21482 -22360 -11214 2456 -3943 -18349 -8906 -6708 1180 -2259 -2849 -8516 -25781 -31794 -25751
16526 -25751 -1961 3040 -10095 -14162 -17642 -19704 -19118 -32509 -30836 -30643 -35091 -22401 -20718 -19081
16512 -19081 -14386 -10793 -12649 -13585 -18278 -22289 -30836 -36053 -37763 -24857 -16990 -19542 -28316 -28550 -28961
16497 -28961 -18609 -11436 -13589 -21467 -28410 -30784 -23629 -16208 -26230 -30580 -17836 -6837 -1167
16484 -1167 -8576 -19627 -16667 -15568 -22877 -23837 -10300 6975 6990 -4630 -9560 -10369 -10870 -11123 -13945
16469 -13945 -14508 -19790 -23223 -20227 -12727 -9547 -12603 -8495 1374 12103 2258 -11684 -12345 -8613
$$ packed form
16568a1325j9157l892P274r630K789J215K3973J2966j0809o127J576N964l808
16555h991m013R224p709J3527L064M173q679r424p61j0478p753N522L554P93l531
16540b1482q78J1146J3670o399j4406R443K198P888l439n90n667j7265o013O043
16526b5751K3790N001j3135m067l480k062N86j3391J673J93m448J2690J683J637
16512a9081M695L593j856r36m693m011q547n217j710J2906P867k552q774k34m11
16497b8961J0352P173k153p878o943k374P155P421j0022m350J2744J0999N670
16484a167p409j1051K960J099p309r60J3537J7275J5j1620m930q09n01k53k822
16469a3945n63n282l433K996P500L180l056M108R869J0729r845j3942o61L732
$$ plain form
16455 -8613 -3852 -21203 -29290 -17799 -14623 -11471 -18510 -30026 -24249 -20700 -14292 -23158 -29710 -32037
16441 -32037 -36272 -42804 -43563 -19979 -19954 -22676 -10644 -13794 -29933 -23865 -11836 -3715 -12257 -28283
16427 -28283 -34497 -21061 -16146 -18733 -14081 -24234 -24419 -22462 -25808 -20581 -15326 -12204 -8109 -11468
16413 -11468 -22208 -11546 -65 5912 13064 12817 4910 11250 -3926 -9324 -4044 -18573 -14168
16400 -14168 7852 10876 -4977 -18319 -9233 -13400 -9151 -12374 -6257 -9629 -16692 -9984 -7758 -20177
16386 -20177 -24712 -19529 -8294 -10898 -21020 -9754 -15713 -35824 -25970 -7770 -3272 -3998 -14510
16373 -14510 -18757 -17542 -7227 -4985 -5792 -20514 -23042 -18454 -8696 -10778 -19234 -10848 -18957 -23325
16359 -23325 -9607 3761 -982 -8471 -8362 29 -1350 2417 -5644 -13271 -22711 -18670 -23183 -26777
$$ packed form
16455h613M761j7351q087J1491L176L152p039j1516N777L549O408q866o552k327
16441c2037m235o532p59K3584K5k722J2032l150j6139O068J2029Q121q542j6026
16427b8283o214J3436M915k587M652j0153j85J957l346N227N255L122M095l359
16413a1468j0740J0662J1481N977P152k47p907O340j5176n398N280j4529M405
16400a4168K2020L024j5853j3342R086m167M249l223O117l372p063O708K226j2419
16386b0177m535N183J1235k604j0122J1266n959k0111R854J8200M498p26j0512
16373a4510m247J215J0315K242q07j4722k528M588R758k082q456Q386q109m368
16359b3325J3718J3368m743p489J09Q391j379L767q061p627r440M041m513l594
$$ plain form
16345 -26777 -22979 -11817 -9454 -9813 -21881 -26333 -34395 -36102 -24147 -19113 -16536 -6344 1610 -3045
16331 -3045 -7302 -12589 -10396 -16406 -15939 -21088 -15847 -5576 -5107 4049 10673 9404 15979 2884 -18508
16316 -18508 -17555 -13705 -18128 -21820 -21980 -15292 -17380 -23656 -30635 -22069 -9541 1218 9201 2447
16302 2447 3922 8355 13243 5499 3400 -4683 -20800 -17750 -16056 -17510 -22794 -23582 -26072 -19841 -9448
16287 -9448 -7438 1778 1846 -7174 -1828 705 3587 -1925 -3452 -299 16219 21912 -2823 -12032 -14044
16272 -14044 -16107 -10769 -8329 -6735 -6611 -5463 -12981 -8923 562 -5625 -18899 -31262 -24003 -3436
16258 -3436 -10382 -16521 -12984 -4559 -9467 -23260 -25975 -11278 -5625 -19127 -19936 -17824 5189 15323
16244 15323 4392 989 -5327 -17923 -15287 -19809 -17010 -19927 -24830 -40054 -36142 -24988 -22375
$$ packed form
16345b6777L798J1162K363l59j2068m452q062j707J1955N034K577J0192P954m655
16331c045m257n287K193o010M67n149N241J0271M69R156O624j269O575j3095k1392
16316a8508R53L850m423l692j60O688k088o276o979Q566J2528J0759P983o754
16302B447J475M433M888p744k099q083j6117L050J694j454n284p88k490O231J0393
16287i448K010R216O8r020N346K533K882n512j527L153J6518N693k4735r209k012
16272a4044k063N338K440J594J24J148p518M058R485o187j3274j2363P259K0567
16258c436o946o139L537Q425m908j3793k715J4697N653j3502q09K112K3013J0134
16244A5323j0931l403o316j2596K636m522K799k917m903j5224L912J1154K613
$$ plain form
16231 -22375 -21284 -22979 -25194 -25752 -19674 -10362 -11761 -8692 2187 2853 -5064 1611 3646 -8738
16217 -8738 -25784 -22859 -17192 -20784 -21179 -13528 -14754 -19066 -8730 -431 -5212 -22106 -46074 -51118
16203 -51118 -25116 -9370 -10840 -4772 -11128 -11591 -13420 -8541 -4731 -6967 6361 23690 12257
16190 12257 -8381 -6884 -6384 -9541 -26726 -31434 -21620 -13122 -10088 -12209 -10166 -5222 8196 4546
16176 4546 3722 5032 -3399 -3557 -18694 -12249 -12531 -12535 -11519 -3748 4760 16663 12705 10 -20911
16161 -20911 -36771 -26399 -22095 -14653 3030 4833 -5240 -4358 -11313 -13962 -7833 4185 -1323
16148 -1323 30 -1614 -9256 -11886 -11978 -18602 -27811 -34170 -32125 -28873 -23141 -9822 -3143 -9228 -12598
16133 -12598 -10680 -6228 -3352 1682 -1176 7256 14843 6107 1510 8015 8439 -5425 -8651 -3605
$$ packed form
16231b2375J091j695k215n58O078R312j399L069J0879O66p917O675K035j2384
16217h738j7046K925N667l592l95P651j226m312J0336Q299m781j6894k3968n044
16203e1118K6002J5746j470O068o356m63j829M879L810k236J3328J7329j1433
16190A2257k0638J497N00l157j7185m708R814Q498L034k121K043M944J3418l650
16176D546q24J310q431j58j5137O445k82mJ016P771Q508J1903l958j2695k0921
16161b0911j5860J0372M304P442J7683J803j0073Q82o955k649O129J2018n508
16148a323J353j644p642k630r2o624r209o359K045L252N732J3319O679o085l370
16133a2598J918M452K876N034k858Q432P587q736m597O505M24j3864l226N046
$$ plain form
16119 -3605 -454 -4846 -6639 -23124 -17473 -122 12432 20712 14314 8376 10336 -8219 -9984 -4460
16105 -4460 -8584 -19176 -11198 -3894 -12169 1283 13336 16819 11413 -23017 -41975 -36006 -27240
16092 -27240 -25508 -24882 -10058 455 427 4274 6469 -6114 -17097 -20460 -26868 -21694 -13386 1982
16078 1982 1134 -5094 -8673 -3605 -5092 -10088 -15730 -5453 -15365 -15711 -10967 -9951 -9293 -150 2843
16063 2843 2352 3136 2620 4107 -22 -16930 -22245 -28161 -16464 -20110 -22037 -16124 -17155 -4958 -16107
16048 -16107 -25334 -16682 -3037 -35 -5207 -3568 -7567 -3449 10415 4305 -4776 3410 13881 1442
16034 1442 -6540 10712 22555 7121 -1316 -6784 -10273 -16132 -1896 6374 3914 2498 -2264 -9827
16020 -9827 -16387 -1189 15078 12190 526 1463 -5540 -5006 6040 -5450 -18828 -13460 -3426
$$ packed form
16119c605L151m392j793j6485N651J7351J2554Q280o398n938J960j8555j765N524
16105d460m124j0592P978P304q275J3452J2053L483n406l4430j8958N969Q766
16092b7240J732O26J4824J0513k8L847K195j2583j0983l363o408N174Q308J5368
16078A982q48o228l579N068j487m996n642J0277r912l46M744J016O58R143K993
16063B843m91P84n16J487m129j6908n315n916J1697l646j927N913j031J2197j1149
16048a6107r227Q652J3645L002n172J639l999M118J3864o110r081Q186J0471j2439
16034A442p982J7252J1843j5434q437n468l489n859J4236Q270k460j416m762p563
16020i827o560J5198J6267k888j1664R37p003N34J1046j1490j3378N368J0034
$$ plain form
16007 -3426 -1812 -7434 -7004 439 -1558 -21888 -27499 -29700 -30830 -21304 -17790 -33603 -30890 -21319
15993 -21319 -16803 -13356 -10563 -4108 -15635 -24299 -33003 -36853 -29057 -25937 -31585 -41295 -34940 -26671
15979 -26671 -12889 -5503 -9560 -15947 -16972 -11628 -4367 5409 8263 -5105 -5687 -1573 -4868 975
15965 975 7955 -6555 -11155 -3639 1103 -8436 -16883 -14020 -21433 -31481 -22551 -13726 -13773 -5066 -18419
15950 -18419 -19530 -21270 -11009 -4454 -13204 -20717 -23990 -512 5643 -544 -208 4659 1432 7606
15936 7606 7652 326 6431 -2765 -8556 -7797 -120 2128 18416 21458 3523 -3239 -2278 -2243 -11232 -8610
15920 -8610 10508 21436 1483 -18726 -29413 -30711 -27519 -17201 -19248 -14456 1453 -23 -10052
15907 -10052 -11621 -7568 -18872 -28104 -22811 -32624 -33843 -16461 -607 -12948 -15573 -8339 -14492
$$ packed form
16007c426J614n622M30P443j997k0330n611k201j130R526L514j5813K713R571
15993b1319M516L447K793O455j1527q664q704l850P796L120n648r710O355Q269
15979b6671J3782P386m057o387j025N344P261R776K854j3368n82M114l295N843
15965I75O980j4510m600P516M742r539q447K863p413j0048Q930Q825m7Q707j3353
15950a8419j111j740J0261O555q750p513l273K3478O155o187L36M867l227O174
15936G606M6p326O105r196n791P59P677K248J6288L042j7935o762R61L5q989K622
15920h610J9118J0928j9953k0209j0687j298L192J0318k047M792J5909j476j0029
15907a0052j569M053j1304r232N293r813j219J7382J5854j2341k625P234o153
$$ plain form
15894 -14492 -19826 -22429 -13953 -3179 -6449 -918 5275 2273 13401 12616 10769 -188 -7945 -5847
15880 -5847 1067 -5168 -12381 -16721 -15333 -6695 -15134 -30060 -26335 -27655 -22231 -24489 -10267 -7113
15866 -7113 -803 7232 -591 -3220 2127 -12021 -10890 -14499 -20261 -17397 -16041 -10642 -7820 8326
15852 8326 23972 26468 13993 -1889 982 2443 2733 -5828 -17005 -19268 -10284 -2475 6159 6674
15838 6674 -2849 -11759 -11647 -6823 -17129 -28202 -23053 -17398 -6910 -12627 -2847 5902 11522 14544
15824 14544 19890 4988 5282 16568 11339 10179 8380 2339 1142 -1194 2927 7954 12435 19844
15810 19844 15404 6858 3945 13658 11208 1745 6405 8985 15492 14209 -5014 -7624 -14373 -24389
15796 -24389 -30023 -14862 3704 -773 -11528 -6984 -8973 -18638 -14569 -11621 512 4445 -2137
$$ packed form
15894a4492n334k603Q476J0774l270N531O193l002J1128p85j847j0957p757K098
15880e847O914o235p213m340J388Q638q439j4926L725j320N424k258J4222L154
15866g113O310Q035p823k629N347j4148J131l609n762K864J356N399K822J6146
15852H326J5646K496j2475j5882K871J461K90q561j1177k263Q984P809Q634N15
15838F674r523q910J12M824j0306j1073N149N655J0488n717R780Q749N620L022
15824A4544N346j4902K94J1286n229j160j799o041j197k336M121N027M481P409
15810A9844m440q546k913R713k450r463M660K580O507j283j9223k610o749j0016
15796b4389n634J5161J8566m477j0755M544j989r665M069K948J2133L933o582
$$ plain form
15783 -2137 -7189 -25528 -33227 -22222 -23074 -26603 -29004 -14773 7196 -3883 -8560 -444 2991 -5370
15769 -5370 -12761 -17640 -7529 -13235 -18249 -18403 -22664 -23447 -25553 -20524 -25829 -27974 -23538 -26648 -12731
15754 -12731 -294 7667 21446 4691 -4796 -4618 2116 -251 -5980 -12370 -18091 -13429 -5081 -6723
15740 -6723 -9592 -16369 -20130 -12713 -15212 -28374 -16134 -12142 -18253 -13564 -12999 -9705 -17065 -9950
15726 -9950 2308 -12949 -24130 -17051 158 385 -2696 -5526 -6948 -6698 -979 4417 9225 8113
15712 8113 -4335 -5152 -2787 -11866 -15121 -16903 -11905 -9508 -12327 -2862 -1014 3871 15964 182
15698 182 -8980 -10921 -13320 -2471 13469 8319 2890 -8110 -4336 -6771 2988 70 -8146 -6210
15684 -6210 2828 7869 -5648 3345 7757 3902 4562 -2760 2944 9138 9318 -7865 -17437 -27450
$$ packed form
15783b137n052j8339p699J1005q52l529k401J4231K1969j1079m677Q116L435q361
15769e370p391m879J0111n706n014j54m261p83k106N029n305k145M436l110J3917
15754a2731J2437P961J3779j6755r487J78O734k367n729o390n721M662Q348j642
15740f723k869o777l761P417k499j3162J2240L992o111M689N65L294p360P115
15726i950J2258j5257j1181P079J7209K27l081k830j422K50N719N396M808j112
15712H113j2448q17K365r079l255j782M998K397k819R465J848M885J2093j5782
15698A82r162j941k399J0849J5940n150n429j1000L774k435R759k918q216J936
15684f210R038N041j3517Q993M412l855O60p322N704O194J80j7183r572j0013
$$ plain form
15670 -27450 -19574 -26066 -26810 -25340 -20624 -6286 12217 2105 -3775 -11716 -8358 2929 2759 6226
15656 6226 7415 -7606 -8109 -5632 -11411 -14362 -10645 -7749 -5830 -20411 -19751 -12774 -11233 -16066 -2120
15641 -2120 -11589 -17288 -16639 -3701 -5804 -8002 2045 17062 4647 4368 15283 3974 3995 4819
15627 4819 -12346 -17712 -13696 -21868 -21803 -27275 -25764 -12632 2759 10163 17181 -1185 -2583 7453
15613 7453 -10136 -5456 -4849 -14259 -30412 -25857 -15498 -18902 -18972 -16840 -17065 -14562 -6798 -6517 -4387
15598 -4387 -130 -4107 -31340 -37346 -19088 -6514 569 5301 13848 2517 -5217 -10919 -23123
15585 -23123 -26844 -24671 -12914 -10232 -15620 -23330 -21680 -23156 -31510 -36731 -37486 -32053 -18065 -10936
15571 -10936 -7635 -6409 -11391 556 11145 16681 2182 4823 13319 13262 10919 10754 26742 41985
$$ packed form
15670b7450P876o492p44J470M716J4338J8503j0112n880p941L358J1287j70L467
15656F226J189j5021n03K477n779k951L717K896J919j4581O60O977J541m833J3946
15641b120r469n699O49J2938k103k198J0047J5017j2415k79J0915j1309K1Q24
15627D819j7165n366M016q172O5n472J511J3132J5391P404P018j8366j398J0036
15613G453j7589M680O07r410j6153M555J0359l404p0K132k25K503P764K81K130
15598d387M257l977k7233o006J8258J2574P083M732Q547j1331p734n702j2204
15585b3123l721K173J1757K682n388p710J650j476q354n221p55N433J3988P129
15571a0936L301J226m982J1947J0589N536j4499K641Q496n7k343j65J5988J5243
$$ plain form
15557 41985 49509 32240 32853 32684 10064 3835 11021 2189 -921 272 -12702 -5686 13777 28444
15543 28444 27088 5482 -11433 -16139 -20889 -25093 -16470 -9001 9638 10816 -3800 -11420 -15371
15530 -15371 -11928 -9661 -8113 -14942 -16045 -23571 -7237 5058 -2191 3643 9050 3597 1880 -1693
15516 -1693 2531 11039 6971 1721 6948 2899 -1750 -8069 -10560 -12129 -223 13743 6652 -7281
15502 -7281 -16496 -12392 8063 415 -7626 7337 15616 6989 -2657 -10523 -8613 -4260 186 -2003
15488 -2003 -2837 1993 5639 8006 15995 14451 -6264 -6131 116 111 8498 11324 2649 8640 26485
15473 26485 33112 33292 27443 27929 17978 -2353 -245 -3857 6151 2942 8467 8003 1686 5543 8640
15458 8640 7625 2268 -301 99 -15067 -10586 -9088 -9053 -27882 -19921 -3042 1760 -1586 -11285 -19467
$$ packed form
15557D1985P524j7269O13j69k2620o229P186q832l110J193j2974P016J9463J4667
15543B8444j356k1606j6915m706m750m204Q623P469J8639J178j4616p620l951
15530a5371L443K267J548o829j103p526J6334J2295p249N834N407n453j717l573
15516a693M224Q508m068n250N227m049m649o319k491j569J1906J3966p091j3933
15502g281r215M104K0455p648q041J4963Q279q627r646p866J910M353M446k189
15488b003q34M830L646K367P989j544k0715J33O247nQ387K826q675N991J7845
15473B6485O627J80n849M86r951k0331K108l612J0008l209N525m64o317L857L097
15458H640j015n357k569M00j5166M481J498L5j8829P961J6879M802l346r699q182
$$ plain form
15443 -19467 -16542 -14357 -2415 -3797 -4914 -15418 -7594 -6414 -4126 -19082 -27214 -26441 -14003 2398
15429 2398 3954 11205 12729 14294 9664 2200 8461 5871 -11648 -29056 -34983 -33810 -13501 2973
15415 2973 7469 10102 32387 30625 29224 24060 8221 625 -205 5433 1603 4283 3961 344 2744
15400 2744 -7055 -5225 -8545 -4861 -13408 -4715 -15142 -17964 -11863 -12192 -3691 7241 -3528 -15909
15386 -15909 -11251 -1739 7070 12769 13430 12159 12998 3941 -70 -812 2662 305 -6712 -9643 -10674
15371 -10674 -8236 -3455 -4701 5581 6697 -5459 -3133 -10652 -25324 -26409 -13919 -12441 -6989
15358 -6989 -1172 -1843 10063 7465 17149 12501 17295 20306 7068 -7702 -5017 -8559 -12433 -14337
15344 -14337 -18628 -11161 -5360 5315 468 -11947 -11488 -11520 -7515 2299 10459 21509 14232 9111
$$ packed form
15443a9467K925K185J1942j382j117j0504P824J180K288j4956q132P73J2438J6401
15429B398J556P251J524J565m630p464O261k590j7519j7408n927J173K0309J6474
15415B973M496K633K2285j762j401n164j5839p596q30N638l830K680l22l617K400
15400B744r799J830l320L684q547Q693j0427k822O101l29Q501J0932j0769j2381
15386a5909M658R512Q809N699O61j271Q39r057m011p42L474k357p017k931j031
15371a0674K438M781j246J0282J116j2156K326p519j4672j085J2490J478N452
15358f989N817o71J1906k598R684m648M794L011j3238j4770K685l542l874j904
15344a4337m291P467N801J0675m847j2415M59l2M005R814Q160J1050p277n121
$$ plain form
15330 9111 8516 10016 -5392 -9997 -8214 -10727 -4163 -21015 -26516 -18203 -18060 -30876 -24054 -8344
15316 -8344 -3571 -1836 8712 -1562 -8531 -14661 -20148 -23664 -22347 -15104 -16598 -12208 8884 5829
15302 5829 3245 1099 -7958 -1661 -17295 -16506 -11946 -8969 -1301 2327 -1565 -8041 -12657 -7714 5038
15287 5038 15122 31019 25125 6277 -17130 -19163 -20920 -17969 -19735 -18909 -12956 -19903 -21265 -18043
15273 -18043 -18735 -14440 -3046 -6591 -19666 -22285 -10542 -2265 -16636 -23165 -24441 -25001 -9238 -1322
15259 -1322 1499 -3814 -6891 1048 -12828 -29392 -24565 -17199 -15605 -16566 -4069 139 -8866 -5844
15245 -5844 -2303 -14620 -13875 -14672 -6905 -13411 -16865 -28628 -28116 -4077 1060 6787 18905 -3324
15231 -3324 -19783 -18296 -9648 -9580 -15177 -22027 -24633 -15067 -7192 14758 30872 19311 18767 16670
$$ packed form
15330I111n95J500j5408m605J783k513O564j6852n501Q313J43j2816O822J5710
15316h344M773J735J0548j0274o969o130n487l516J317P243j494M390K1092l055
15302E829k584k146r057O297j5634P89M560K977P668L628l892o476m616M943J2752
15287E038J0084J5897n894j8848k3407k033j757K951j766Q26N953o947j362L222
15273a8043o92M295J1394l545j3075k619J1743Q277j4371o529j276n60J5763P916
15259a322K821n313l077P939j3876j6564M827P366J594r61J2497M208r005L022
15245e844L541j2317P45p97P767o506l454j1763N12K4039N137N727J2118k2229
15231c324j6459J487Q648O8n597o850k606R566P875K1950J6114j1561n44k097
$$ plain form
15217 16670 14086 10532 7707 5409 3730 -10004 -2446 -7796 -2967 -3407 -2996 -9328 -8766 -4970 9900
15202 9900 27302 38699 39230 27180 20464 25560 24622 17949 22141 13984 -8198 -19155 -21993 -9653
15188 -9653 2336 6142 -1879 -9476 -8225 -4367 -4176 1340 2816 8225 6273 -7312 -25134 -29072
15174 -29072 -12067 1630 3229 4135 773 -5681 -10723 -6058 4725 162 -13034 -25954 -5077
15161 -5077 698 -2720 2351 -1262 -10066 4982 -6601 -15342 -11645 -15981 -6647 -13834 -11219 8694
15147 8694 24333 16995 6221 4642 -9822 -12795 -12337 5210 17685 16048 21411 32831 33718 15071
15133 15071 8486 4480 7553 -27 1237 8456 -40 5428 5942 -10869 -13359 -9068 -1424 -7119
15119 -7119 -15609 -21605 -15274 -8267 -10326 -8853 -6056 -19396 -20367 -15493 -1606 7716 -7940 7123
$$ packed form
15217A6670k584l554k825k298j679j3734P558n350M829m40M11o332N62L796J4870
15202I900J7402J1397N31j2050o716N096r38o673M192q157k2182j0957k838J2340
15188i653J1989L806q021p597J251L858J91N516J476N409j952j3585j7822l938
15174b9072J7005J3697J599R06l362o454n042M665J0783m563j3196j2920K0877
15161e077N775l418N071l613q804J5048j1583q741L697m336R334p187K615J9913
15147H694J5639p338j0774j579j4464k973M58J7547J2475j637N363J1420Q87j8647
15133A5071o585m006L073p580J264P219q496N468N14j6811k490M291P644n695
15119g119q490n996O331P007k059J473K797j3340r71M874J3887R322j5656J5063
$$ plain form
15105 7123 11744 4163 -461 1274 -966 -14431 -17904 -20404 -14695 -6751 -4228 5651 9042 -7872
15091 -7872 -32739 -33481 -23249 -18330 -23130 -8695 3672 -5687 -17968 -15193 -13165 -8756 4201
15078 4201 17396 15012 4500 -689 -3201 -16322 -18873 -25638 -9971 -2980 -1445 -4643 2157 10833
15064 10833 17325 41 -9003 -2114 -4140 -3104 -4503 14223 18791 6304 -3222 -1115 2806 6164
15050 6164 14802 20307 9091 1706 2114 -731 2932 4692 6751 9574 12620 23236 24182 29433 23851
15035 23851 21950 21707 21570 18190 621 -7888 -10752 -1199 -3953 7863 5421 -1649 -4426 -10325
15021 -10325 -9417 -471 -2773 -1 -6353 -15922 -23756 -12532 16208 27290 23158 4488 -9746
15008 -9746 -11113 -19641 -30006 -26948 -24571 -33546 -28559 -17370 -12361 -11262 -8369 -1230 583 688
$$ packed form
15105G123M621p581m624J735k240j3465l473k500N709P944K523R879L391j6914
15091g872k4867p42J0232M919m800J4435J2367r359j2281K775K028M409J2957
15078D201J3195k384j0512n189k512j3121k551o765J5667O991J535l198O800Q676
15064A0833O492j7284r044O889k026J036j399J8726M568j2487r526K107L921L358
15050F164Q638N505j1216p385M08k845L663J760K059K823L046J0616R46N251n582
15035B3851j901k43j37l380j7569q509k864R553k754J1816k442p070k777n899
15021a0325R08Q946k302K772o352r569p834J1224K8740J1082m132j8670j4234
15008i746j367q528j0365L058K377q975M987J1189N009J099K893P139J813J05
$$ plain form
14994 688 -11550 -17169 -4805 7562 8595 10114 3012 -4508 -15972 -19018 -9843 -371 3071 6176
14980 6176 -7409 -24475 -31390 -11285 8538 10402 5516 8910 8803 5314 -2640 10407 20084 17190
14966 17190 13583 8871 19540 17358 -163 -5926 1119 -1697 -11380 -9474 -9100 7490 10327 4744
14952 4744 6153 5549 -10769 -9929 2384 436 5058 415 -11244 -13929 -16330 -9236 283 704 7001
14937 7001 14237 12705 10258 11912 9861 2677 2539 8897 5339 -2147 -3411 -8230 2725 554 15292
14922 15292 17604 7318 -2120 7780 8605 8452 10177 12502 18371 27180 19903 1687 -5169 -19116
14908 -19116 -20264 1725 -1638 -17683 -14618 -4184 -1400 -4898 -2075 -3864 1205 10781 17779 6481
14894 6481 6817 10674 9767 -766 2666 -2938 -4045 -17383 -15889 -19469 -32112 -20698 -13583 -12750
$$ packed form
14994F88j2238n619J2364J2367J033J519p102p520j1464l046R175R472L442L105
14980F176j3585j7066o915K0105J9823J864m886L394j07l489p954J3047R677k894
14966A7190l607m712J0669k182j7521n763P045k816r683J906L74J6590K837n583
14952D744J409o04j6318Q40J2313j948M622m643j1659k685k401P094R519M21O297
14937G001P236j532k447J654k051p184j38O358l558p486j264m819J0955k171J4738
14922A5292K312j0286r438R900Q25j53J725K325N869Q809p277j8216o856j3947
14908a9116j148K1989l363j6045L065J0434K784l498K823j789N069R576O998j1298
14894F481L36L857r07j0533L432n604j107j3338J494l580j2643J1414P115Q33
$$ plain form
14880 -12750 -17322 -20589 -8211 5586 13890 2029 -14118 -5674 1536 6678 13492 -1388 -5702
14867 -5702 -1564 2144 -4611 -15686 -9532 9201 6140 3359 18720 25277 21028 19926 16501 6153
14853 6153 -4664 -18417 -23832 -14377 -4832 3560 1031 -9159 -10684 -9533 -19308 -10159 8153 10481
14839 10481 12466 2749 -6972 -1920 12940 19451 15141 16473 21321 16955 6132 10859 7687 10002
14825 10002 2278 7431 8231 5191 5418 16128 10361 19621 20424 25060 15854 22010 25607 18023 -2684
14810 -2684 -1565 -4382 -1005 1185 -3972 9961 9728 8098 -11039 -20361 -15447 -5516 8248 13544
14796 13544 14818 6481 11198 22861 15866 6821 6501 -1736 -8405 -1147 4251 79 973 3635 7520
14781 7520 3600 6289 -12478 -10751 4875 2922 5141 10747 5600 -2676 -7464 12914 26380 41163
$$ packed form
14880a2750m572l267J2378J3797Q304j1861j6147Q444P210N142O814j4880m314
14867e702M138L708o755j1075O154J8733l061k781J5361O557m249j102l425j0348
14853F153j0817j3753n415R455R545Q392k529j0190j525J151r775R149J8312K328
14839A0481J985r717r721N052J4860O511m310J332M848m366j0823M727l172K315
14825A0002p724N153Q00l040K27J0710n767R260Q03M636r206O156L597p584k0707
14810b684J119k817L377K190n157J3933k33j630j9137r322M914R931J3764N296
14796A3544J274q337M717J1663o995r045l20q237o669P258N398m172Q94K662L885
14781G520l920K689j8767J727J5626j953K219N606n147q276m788K0378J3466J4783
$$ plain form
14767 41163 46795 37272 26596 16730 13197 -1223 4079 12667 6182 -6770 -17270 -14786 -5077
14754 -5077 -5245 -5737 -2793 -2909 -118 -1116 -11398 -4356 13809 898 -9696 -4622 1453 -999 -16788
14739 -16788 -29309 -29543 -16051 -344 17667 18811 12639 3483 19912 27910 32117 36046 24142
14726 24142 3815 5468 3072 -1264 -2062 -7521 -6291 -8933 -2562 659 16394 24653 20717 14896
14712 14896 22189 21378 17183 16379 13027 491 -6034 -486 -6959 -1479 8101 9917 -2949 665
14698 665 16260 17325 6563 6748 20875 16643 6465 -7531 -16918 -15331 -4574 9657 36971
14685 36971 32632 28398 13681 18208 17543 8969 1444 11742 3490 6786 4923 2641 9827 -6440
14671 -6440 -11595 -11776 -7216 -11382 -4870 12165 17668 11964 4793 1658 -2964 -2487 -6756 -7999 -8431
$$ packed form
14767D1163N632r523j0676r866l533j4420N302Q588o485j2952j0500K484R709
14754e077j68m92K944j16K791r98j0282P042J8165j2911j0594N074O075k452j5789
14739a6788j2521k34J3492J5707J8011J144o172r156J6429P998M207L929j1904
14726B4142k0327J653k396m336p98n459J230k642O371L221J5735Q259l936n821
14712A4896P293q11m195q04l352j2536o525N548o473N480R580J816j2866L614
14698F65J5595J065j0762J85J4127m232j0178j3996r387J587J0757J4231K7314
14685C6971m339m234j4717M527o65q574p525J0298q252L296j863k282P186j6267
14671f440n155j81M560m166O512J7035N503n704p171l135m622M77m269j243m32
$$ plain form
14656 -8431 5060 11592 18182 22934 21957 16685 11153 -2386 14357 25181 24325 13609 5468 7929
14642 7929 8483 5391 13960 20573 16898 18022 11759 7651 -2053 -19439 -14535 -20218 -17370 -17185 -11251
14627 -11251 -2742 839 -2324 -9101 931 16524 35348 31218 16961 22474 15999 9966 7736
14614 7736 30239 28634 23683 31348 31503 30892 30574 17558 5839 5839 628 14850 29812 35182 49244
14599 49244 43795 23174 10716 9135 26421 31529 26281 3256 -11576 -1305 5143 7098 11697
14586 11697 12886 -1780 -14733 -11851 -7924 -10278 -7553 -983 11246 5365 -691 -8972 -17478 -7885
14572 -7885 5619 2048 9693 6220 -12475 -22561 -27141 -6212 28114 23589 28500 25494 12483
14559 12483 6685 298 4623 6883 6125 2847 7006 6068 -9771 -17133 -13591 -13061 -17226 -20024 -11182
$$ packed form
14656h431J3491O532O590M752r77n272n532j3539J6743J0824q56j0716q141K461
14642G929N54l092Q569O613l675J124o263m108r704j7386M904n683K848J85N934
14627a1251Q509L581l163o777J0032J5593J8824m130j4257N513o475o033k230
14614G736K2503j605m951P665J55o11l18j3016j1719%n211J4222J4962N370J4062
14599D9244n449k0621j2458j581J7286N108n248k3025j4832J0271O448J955M599
14586A1697J189j4666j2953K882L927k354K725O570J2229n881o056q281q506R593
14572g885J3504l571P645l473j8695j0086m580K0929L4326m525M911l006j3011
14559A2483n798o387M325K260p58l278M159r38j5839p362L542N30m165k798Q842
$$ plain form
14544 -11182 -191 17003 20482 16535 14477 835 -2981 12877 16092 10679 15101 16423 11863
14531 11863 5894 -2290 -5594 -8926 -3619 -6215 -7409 -145 -10192 -8877 -6674 3674 5827 13512
14517 13512 8795 8023 -6980 -17237 -27928 -35379 -22005 -11666 -5256 -2751 3584 -2010 -3197
14504 -3197 -2445 1631 12703 21591 17846 -16377 -25595 -18288 3072 2889 -8376 -12171 -12716 -3493
14490 -3493 7337 11960 27593 44272 41141 22597 595 -15858 -5971 303 -1803 9918 14732
14477 14732 4647 -6692 -2438 -4544 -22082 -20826 -11230 -2510 -21377 -19784 -10007 5342 -4005
14464 -4005 -4829 9463 15018 16953 16080 11730 23568 21844 12113 12241 11732 9864 10656 3201 8308
14449 8308 8814 3923 1172 16518 18706 15082 20520 22178 35485 40200 21724 22916 27477 11536
$$ packed form
14544a1182J0991J7194L479l947k058j3642l816J5858L215n413M422J322m560
14531A1863n969q184l304l332N307k596j194P264j0047J315K203J0348K153P685
14517A3512m717p72j5003j0257j0691p451J3374J0339O410K505O335n594j187
14504c197P52M076J1072Q888l745l4223r218P307K1360j83j1265l795n45R223
14490c493J0830M623J5633J6679l131j8544k2002j6453R887O274k106J1721M814
14477A4732j0085j1339M254k106j7538J256R596Q720j8867J593R777J5349r347
14464d005q24J4292N555J935q73m350J1838j724r731J28n09j868P92p455N107
14449H308N06m891k751J5346K188l624N438J658J3307M715j8476J192M561j5941
$$ plain form
14435 11536 895 8985 16169 14477 12035 4555 14945 13353 6878 6996 -87 -6015 -13558 -15859
14421 -15859 -7700 9220 29086 19347 -4036 -25931 -17648 782 14573 17373 13946 23237 18218
14408 18218 5975 13214 11196 1396 1400 -9730 -17405 -24040 -14683 -70 4572 26345 35921 15587
14394 15587 -923 6811 5562 16865 14716 22597 26680 10900 9422 11330 5199 -1150 -165 -2299
14380 -2299 12069 32305 37563 28065 29815 25005 21876 31125 37334 21149 5530 9341 9235 3997
14366 3997 10192 24164 16944 15942 21046 6603 9830 2697 2792 900 702 11727 21590 17353 10898
14351 10898 11151 2308 2446 13242 11739 16707 30701 26479 16134 3100 2167 13538 13845 9757
14337 9757 15726 16394 755 8650 11255 5615 6544 -2868 6512 12254 14771 16705 19754 16595 4776
$$ packed form
14435A1536j0641Q090P184j692k442p480J0390j592o475J18p083n928p543k301
14421a5859Q159J6920J9866r739k3383k1895Q283J8430J3791K800l427R291n019
14408A8218j2243P239k018r800Mj1130p675o635R357J4613M642K1773R576k0334
14394A5587j6510P734j249J1303k149P881M083j5780j478J908o131o349R85k134
14380b299J4368K0236N258r498J750m810l129R249O209j6185j5619L811j06n238
14366C997O195J3972p220j002N104j4443L227p133R5j892j98J1025R863m237o455
14351A0898K53q843J38J0796j503M968J3994m222j0345j3034r33J1371L07m088
14337I757N969O68j5639P895K605n640R29r412R380N742K517J934L049l159j1819
$$ plain form
14322 4776 17403 29301 14462 14108 16020 81 -2761 -5650 -20724 -17031 1315 8576 12165
14309 12165 7910 7818 16634 28683 14064 11238 5028 -5115 -2220 4270 7875 8392 -965 -13035
14295 -13035 -15598 -17501 2310 5178 1051 244 8536 -2302 266 2767 -7734 -9163 -10460 -7678
14281 -7678 -368 -354 -79 14617 18147 7723 9877 9084 11556 -331 -13943 -21496 -20938 -24505 -19366
14266 -19366 356 3655 1594 -9074 -8767 -278 13416 17996 21145 19853 7244 -17813 -38973
14253 -38973 -38444 -15904 -2367 3834 13443 16071 9243 19150 35733 9135 -4549 5454 2520
14240 2520 4398 14132 15893 15655 12078 11483 23082 23240 26122 17831 19149 19346 12707 9410 16473
14225 16473 21733 13414 13970 4148 4648 -6148 -6517 -745 10209 5686 11117 21393 19722 21720
$$ packed form
14322D776J2627J1898j4839l54J912j5939k842k889j5074L693J8346P261L589
14309A2165m255r2Q816J2049j4619k826o210j0143K895O490L605N17r357j2070
14295a3035k563j903J9811K868m127q07Q292j0838K568K501j0501j429j297K782
14281g678P310J4K75J4696L530j0424K154p93K472j1887j3612p553N58l567N139
14266a9366J9722L299k061j0668L07Q489J3694M580L149j292j2609k5057k1160
14253c8973N29K2540J3537O201R609K628o828R907J6583k6598j3684J0003k934
14240B520J878R734J761k38l577n95J1599J58K882q291J318J97o639l297P063
14225A6473N260q319N56r822N00j0796l69N772J0954m523N431J0276j671J998
$$ plain form
14211 21720 11367 9988 22178 12383 5556 14951 5851 -5650 -14639 -19073 -11828 -14019 -7759 -3189
14197 -3189 4510 6773 -6005 -4685 4212 11839 9675 355 -9645 -7823 -6448 -3521 2171 10409
14183 10409 4155 12400 20513 25463 27117 25459 12144 -1689 -3525 -5581 -7224 -7265 -4750 -2006
14169 -2006 -3984 7189 2461 -6101 5056 16306 16266 7608 16429 18205 9542 -9490 -19338 -19775
14155 -19775 1111 26021 20014 28018 28112 15583 -1227 -10752 -463 10855 -1154 -11537 -9403
14142 -9403 -15834 -7105 10052 13011 13227 23610 16740 19801 10235 18596 5381 -2006 12544 18003
14128 18003 6169 -5304 2479 17913 24854 20160 19101 8380 18362 12549 20290 24680 15079
14115 15079 13178 11701 3310 -7538 -3672 -2118 -2475 -9384 -9930 9421 13643 -3994 -14125 1600
$$ packed form
14211B1720j0353j379J2190r795o827R395r100j1501q989m434P245k191O260M570
14197c189P699K263j2778J320Q897P627k164r320j0000J822J375K927N692Q238
14183A0409o254Q245Q113M950J654j658j3315j3833j836k056j643m1K515K744
14169b006j978J1173m728q562J1157J1250m0q658Q821J776q663j9032r848m37
14155a9775K0886K4910o007Q004R4j2529j6810r525J0289J1318j2009j0383K134
14142i403o431Q729J7157K959K16J0383o870L061r566Q361j3215p387J4550N459
14128A8003j1834j1473P783J5434O941m694j059j0721R982n813P741M390r601
14115A5079j901j477q391j0848L866J554l57o909n46J9351M222j7637j0131J5725
$$ plain form
14101 1600 2539 8969 -3128 -22530 -15691 -6602 13417 26847 28790 33516 28039 30087 28797 16137
14087 16137 8492 -319 2888 4221 7745 -13715 -24904 -24358 -17445 -6679 -2473 -8411 -14914 -13678
14073 -13678 -5188 14228 23479 19586 14418 15428 15138 4366 -2185 415 -6254 -11597 -19919 -18846
14059 -18846 -27339 -13353 2274 6353 15235 16489 9303 13999 18204 13771 29989 36594 31725 7178
14045 7178 2123 14893 30142 31260 25855 26339 11828 26466 16984 15983 15154 4101 3102 5563
14031 5563 19820 26675 22107 33285 30457 24488 27504 27270 18574 26673 29515 30851 12225 6047
14017 6047 11010 11964 12152 8083 -9351 -8726 7943 21738 9374 -5166 -10713 -11043 -27741 -28202
14003 -28202 -13064 -17686 -11855 2416 9302 8710 -4546 -12814 -9263 -7311 -3083 6456 -4775 -796
$$ packed form
14101A600R39O430j2097j9402O839R089K0019J3430J943M726n477K048j290j2660
14087A6137p645q811L207J333L524k1460j1189N46O913J0766M206n938o503J236
14073a3678Q490J9416R251l893n168J010k90j0772o551K600o669n343q322J073
14059a8846q493J3986J5627M079Q882J254p186M696M205m433J6218O605m869k4547
14045G178n055J2770J5249J118n405M84j4511J4638r482j001q29j1053r99K461
14031E563J4257O855m568J1178k828n969L016k34q696Q099K842J336j8626o178
14017F047M963R54J88m069j7434O25J6669J3795j2364j4540n547l30j6698m61
14003b8202J5138m622N831J4271O886n92j3256q268L551J952M228R539j1231L979
$$ plain form
13989 -796 10231 16332 16714 6878 1278 -7006 -13805 1978 9219 -5888 44 -80 -1557 15317
13975 15317 18988 5965 7125 8740 13359 5036 -7037 -2890 5346 19231 5677 5263 5823 10687
13961 10687 9317 -4677 -12591 383 6047 7041 15627 12266 7814 4917 12611 25008 19748 21863
13947 21863 18320 17297 24729 23713 26229 30483 17603 14399 6017 4677 13397 24476 6711 3165
13933 3165 -6923 -15492 -7629 -3914 11398 29275 13361 644 9244 30411 35828 33772 27138
13920 27138 23619 15164 1186 13232 21568 10294 -6393 -4268 5737 3306 -2201 -2561 -3358 16272
13906 16272 29443 20072 21386 19596 9746 -15313 -30544 -11630 3550 18270 29965 22017 22727
13893 22727 18133 8363 14598 17034 10218 4003 7404 28079 20090 22992 30179 13821 8161 17719
$$ packed form
13989g96J1027O101L82r836n600q284o799J5783P241j5107N932j24j477J6874
13975A5317L671j3023J160J615M619q323j2073M147Q236J3885j3554m14N60M864
13961A0687j370j3994p914J2974N664R94Q586l361m452k897P694J2397n260K115
13947B1863l543j023P432j016K516M254j2880l204q382j340Q720J1079j7765l546
13933C165j0088q569P863L715J5312J7877j5914j2717Q600K1167N417k056o634
13920B7138l519q455j3978J2046Q336j1274j6687K125J0005k431n507l60p97J9630
13906A6272J3171r371J314j790r850k5059j5231J8914J5180J4720J1695p948P10
13893B2727m594r770O235K436o816o215L401K0675p989K902P187j6358n660R558
$$ plain form
13879 17719 15219 15657 12227 -6197 -3085 11891 21599 26345 36323 26194 7031 -313 2897 15184
13865 15184 23636 24851 16005 12982 19012 13896 10004 5919 -474 8083 15502 9143 11939 31051
13851 31051 40738 38088 26479 31784 17833 8360 8173 14181 7000 14908 34975 45475 47717 54018
13837 54018 65934 58804 43951 31961 26311 39520 43688 28719 25504 32912 25023 22227 26502
13824 26502 29546 20359 9995 552 -2672 6834 15185 4046 380 6979 19546 38390 32141
13811 32141 24201 20008 15737 15551 26614 23756 13330 7587 14318 12321 9920 17889 33536 39386
13797 39386 29458 34022 25271 10527 19993 21842 13381 6222 -9210 -2511 15600 20096 18188 10475
13783 10475 -2864 -6200 -8453 -1654 6814 19990 15304 12455 25700 36641 32603 27292 29916
$$ packed form
13879A7719k500M38l430j8424L112J4976R708M746R978j0129j9163p344L210J2287
13865A5184Q452J215q846l023O030n116l892m085o393Q557P419o359K796J9112
13851C1051R687k650j1609N305j3951r473j87O008p181P908K0067J0500K242O301
13837E4018J1916p130j4853j1990n650J3209M168j4969l215P408p889k796M275
13824B6502L044r187j0364r443l224R506Q351j1139l666O599J2567J8844o249
13811C2141p940m193m271j86J1063k858j0426n743O731j997k401P969J5647N850
13797C9386r928M564q751j4744R466J849q461p159j5432O699J8111M496j908p713
13783A0475j3339l336k253O799Q468J3176m686k849J3245J0941m038n311K624
$$ plain form
13770 29916 38449 34861 23299 16625 16596 19200 15841 18934 22301 13367 -2635 1465 -9337 -13865
13756 -13865 -7401 14040 23018 26956 23861 19987 19878 8468 2142 -310 -7822 8813 23953 17359
13742 17359 19938 23238 28705 28894 20688 21857 19779 34619 31354 24224 29854 23313 17565 30036
13728 30036 51361 51123 40705 18405 19148 23661 25686 26821 32143 42160 38431 30503 23664 18436
13714 18436 26218 34294 22609 14728 15393 18042 22281 15372 23812 13830 29347 28423 22646 23573 25035
13699 25035 13859 11933 25626 33344 33061 31970 31163 35620 38857 27271 9482 3843 7481 3636
13685 3636 10769 12620 8662 15436 34280 46387 32405 23401 14577 14381 21740 30353 41897 56018
13671 56018 49592 44862 22795 3328 1374 10283 21997 24843 18908 5662 -1394 4453 13406
$$ packed form
13770B9916Q533l588j1562o674k9K604l359L093L367q934j6002M100j0802m528
13756a3865O464K1441Q978L938l095l874j09j1410o326k452p512J6635J5140o594
13742A7359K579L300N467J89q206J169k078J4840l265p130N630o541n748J2471
13728C0036K1325k38j0418k2300P43M513K025J135N322J0017l729p928o839n228
13714A8436P782Q076j1685p881O65K649M239o909Q440r982J5517r24n777R27J462
13699B5035j1176j926J3693P718k83j091q07M457L237j1586j7789n639L638l845
13685C636P133J851l958O774J8844J2107j3982r004q824j96P359Q613J1544J4121
13671E6018o426m730k2067j9467j954Q909J1714K846n935j3246p056N847Q953
$$ plain form
13658 13406 24974 15804 -327 -487 6343 21107 26501 17726 19631 21734 20750 16405 19735 18890
13644 18890 17555 23807 20616 20184 17724 16933 13600 24214 22564 12800 14695 14794 23681 22263 7663
13629 7663 9538 14297 799 5723 24843 19933 5127 19602 40972 32375 18047 9712 12191
13616 12191 16758 26127 28063 20556 17890 22607 28101 32002 21657 19186 31395 30405 16273 16673
13602 16673 20204 35014 34138 26844 19001 22969 42318 37359 46195 46110 50338 46543 35967 16155
13588 16155 11017 19385 26534 30222 38066 45005 40572 41438 36157 24445 20856 22652 32668 19226
13574 19226 2832 6211 11397 10785 4628 -5864 1953 1075 -2137 7186 10530 14244 7885 13497
13560 13497 24379 30762 25256 24806 16913 8966 10508 11154 10914 17246 21245 35679 38911 31166 35817
$$ packed form
13658A3406J1568r170j6131j60O830J4764N394q775J905K103r84m345L330q45
13644A8890j335O252l191m32k460p91l333J0614j650r764J895R9Q887j418j4600
13629G663J875M759j3498M924J9120m910j4806J4475K1370q597j4328q335K479
13616A2191M567R369J936p507k666M717N494L901j0345k471J2209r90j4132M00
13602A6673L531J4810q76p294p843L968J9349m959Q836q5M228l795j0576j9812
13588A6155n138Q368P149L688P844O939m433Q66n281j1712l589J796J0016j3442
13574A9226j6394L379N186o12o157j0492P817q78l212R323L344L714o359N612
13560A3497J0882O383n506m50p893p947J542O46k40O332L999J4434L232p745M651
$$ plain form
13545 35817 41553 32928 30537 28450 22159 14910 8334 15147 22047 20084 9200 15279 20502 29135
13531 29135 28100 30919 40361 38255 50635 44985 26925 14570 23115 32736 25022 35974 27487
13518 27487 23649 31068 45469 43950 41485 43910 56570 40122 26589 28368 35994 34597 33175
13505 33175 32458 40517 36654 15620 20931 39824 41976 40751 39616 33485 23494 12332 12799 31941
13491 31941 32642 25026 27965 33709 27610 29302 25353 7636 8187 28521 39244 53621 62169 43918
13477 43918 26337 28929 35291 31744 30939 28006 29386 25932 17429 27284 31621 27259 32812 44691
13463 44691 52114 36155 21827 37211 27137 22178 23918 33475 34462 19097 18892 21514 40941
13450 40941 44698 34257 51620 61845 44142 30333 30145 15066 -7103 -3452 16153 24071 23214
$$ packed form
13545C5817N736q625k391k087o291p249o576O813O900j963j0884O079N223Q633
13531B9135j035K819R442k106J2380n650j8060j2355Q545R621p714J0952q487
13518B7487l838P419J4401j519k465K425J2660j6448j3533J779P626j397j422
13505C3175p17Q059l863k1034N311J8893K152j225j135o131r991j1162M67J9142
13491C1941P01p616K939N744o099J692l949j7717N51K0334J0723J4377Q548j8251
13477D3918j7581K592O362l547q05k933J380l454q503R855M337m362N553J1879
13463D4691P423j5959j4328J5384j0074m959J740R557R87j5365k05K622J9427
13450D0941L757j0441J7363J0225j7703j3809j88j5079k2169L651J9605P918q57
$$ plain form
13437 23214 22680 29578 30888 18133 22070 33836 33067 23811 15110 26605 22170 27922 27375 14900
13423 14900 6697 11129 11483 4909 13649 10212 11873 5075 6653 9170 37227 42786 43003 36154 46661
13408 46661 52245 43109 32186 31045 34614 32012 36569 46864 63235 75979 84228 73764 48903
13395 48903 39973 41352 40692 42038 34611 24734 25367 24574 13938 29779 40348 31401 31276 29673 32676
13380 32676 41732 49539 47143 33565 30040 29277 39913 29875 29924 35774 34365 35178 35141 46317 49026
13365 49026 31682 21808 9287 9564 16783 26498 29233 35071 36293 34330 29415 39684 44728 39469
13351 39469 33076 29773 42041 42557 28384 39571 44090 40132 36472 46344 39256 36163 32933 40629
13337 40629 57648 59743 28743 11555 21585 36004 37280 31576 32877 20491 10319 16421 25541
$$ packed form
13437B3214n34O898J310j2755L937J1766p69r256q701J1495m435N752n47j2475
13423A4900q203M432L54o574Q740l437J661o798J578K517K8057N559K17o849J0507
13408D6661N584r136j0923j141L569k602M557J0295J6371J2744Q249j0464k4861
13395D8903q930J379o60J346p427r877O33p93j0636J5841J0569q947j25j603L003
13380C2676R056P807k396j3578l525p63J0636j0038M9N850j409Q13l7J1176K709
13365D9026j7344r874j2521K77P219R715K735N838J222j963m915J0269N044n259
13351C9469o393l303J2268N16j4173J1187M519l958l660R872p088l093l230P696
13337D0629J7019K095l1000j7188J0030J4419J276n704J301j2386j0172O102R120
$$ plain form
13324 25541 33541 31010 30408 37761 38201 45056 43611 41929 48848 42047 35268 35160 45245 50499 47850
13309 47850 42814 45957 55987 56209 42878 27723 23160 23382 22352 41184 47902 42131 38676 56097
13295 56097 68733 53411 44928 48497 51761 44192 36922 42641 47097 56560 58856 56812 47880 38230
13281 38230 37714 63505 73403 79046 88750 87015 87644 90925 111674 123046 143369 176706 188077
13268 188077 214146 260697 319955 386163 471768 613898 805530 1035485 1281904 1431396
13258 1431396 1404462 1246784 1016191 777400 573655 429072 336865 275601 231385 202706
13248 202706 180028 145404 122364 117809 109936 95170 92875 84258 80955 87464 85803 77030 70150
13235 70150 82718 90163 98675 91772 70748 65768 60403 58981 56253 56791 50301 55708 52833 60609
$$ packed form
13324B5541Q000k531o02P353M40O855j445j682O919o801o779j08J0085N254k649
13309D7850n036L143J0030K22j3331j5155m563K22j030J8832O718n771l455J7421
13295E6097J2636j5322q483L569L264p569p270N719M456R463K296k044q932r650
13281C8230n16K5791R898N643R704j735O29L281K0749J1372K0323L3337J1371
13268A88077K6069M6551N9258O6208Q5605J42130J91632K29955K46419J49492
13258A431396k6934j57678k30593k38791k03745j44583r2207o1264m4216k8679
13248B02706k2678l4624k3040m555p873j4766k295q617l303O509j661q773o880
13235G0150J2568P445Q512o903k1024m980n365j422k728N38o490N407k875P776
$$ plain form
13221 60609 62216 52845 45551 32956 28697 40838 48120 46476 45712 48417 51866 41726 43293 50761
13207 50761 47316 57404 46092 43017 49014 54888 59024 45110 48656 59922 73758 68535 66915
13194 66915 61090 65708 72817 78734 77096 71828 77628 77173 67554 77580 79142 64971 50791 54370
13180 54370 49993 48619 46000 38026 44312 49931 48427 54619 29731 32906 52837 55601 52537 58795
13166 58795 61729 57261 51230 67833 66089 64540 66750 72901 85000 112581 116365 114934 103507
13153 103507 101605 108492 119240 113355 99752 86256 78745 78711 65635 69802 67733 72166 84699
13140 84699 98203 115338 110967 99943 92541 98615 102370 99214 113800 148971 160516 191949 205373
13127 205373 196734 176632 119409 81178 69802 65680 63240 67424 69102 61474 63391 56203 73414
$$ packed form
13221F0609J607r371p294j2595m259J2141P282j644p64K705L449j0140J567P468
13207E0761l445J0088j1312l075N997N874M136j3914L546J1266J3836n223j620
13194F6915n825M618P109N917j638n268N800m55r619J0026J562j4171j4180L579
13180E4370m377j374k619p974O286N619j504O192k4888L175J9931K764l064O258
13166E8795K934m468o031J6603j744j549K210O151J2099K7581L784j431j1427
13153A03507j902O887J0748n885j3603j3496p511l4j3076M167k069M433J2533
13140H4699J3504J7135m371j1024p402O074L755l156J4586L5171J1545L1433J3424
13127B05373q639k0102n7223l8231j1376m122k440M184J678p628J917p188J7211
$$ plain form
13114 73414 83077 71272 53066 40480 44370 53912 58091 48567 34350 45473 53885 60515 57058
13101 57058 51704 54117 69010 72792 74377 76696 84951 91346 86091 87474 93443 74622 63656 86447
13087 86447 94645 111225 106626 97479 101391 90254 104518 117265 133352 144985 136289 119080 112292
13074 112292 119272 121490 118463 116046 102229 104463 139198 176215 206345 217124 224322 213535 208466
13061 208466 195130 184517 163908 142767 127493 124943 116990 121345 119147 127927 122038 121201 116403
13048 116403 109306 103022 106079 99164 97401 99593 113814 131833 146193 152648 146677 144911 153959
13035 153959 146699 122296 122295 118974 121100 113794 103901 111797 124283 127009 127408 135518 127196 106949
13021 106949 103052 96757 96279 93397 84210 75189 48142 46406 43557 38615 34157 36533 43599 40613
$$ packed form
13114G3414R663j1805j8206j2586L890R542M179r524j4217J1123Q412O630l457
13101E7058n354K413J4893L782J585K319Q255O395n255J383N969j8821j0966K2791
13087H6447Q198J6580m599r147L912j1137J4264J2747J6087J1633q696j7209o788
13074A12292O980K218l027k417j3817K234L4735L7017L0130J0779P198j0787n069
13061B08466j3336j0613k0609k1141j5274k550p953M355k198Q780n889q37m798
13048A16403p097o284L057o915j763K192J4221J8019J4360O455n971j766R048
13035A53959p260k4403jl321K126p306r893P896J2486K726L99Q110q322k0247
13021A06949l897o295m78k882r187r021k7047j736k849m942m458K376P066k986
$$ plain form
13007 40613 46388 62995 88191 115278 128045 139123 154188 167981 182718 179091 169625 173138
12995 173138 173767 163907 164578 181005 191609 178203 163366 158570 155660 163334 170203 158997 169928
12982 169928 179342 198085 209310 219091 214287 205005 207061 211143 219811 233793 241235 249812 225463
12969 225463 192018 179552 182079 186516 181929 178442 201324 220377 226169 229147 232909 226477 224609
12956 224609 225040 233199 238028 238168 242929 248688 260298 254907 266755 287537 333971 396219 447122
12943 447122 441783 423089 393779 345494 294351 234950 195237 171540 159594 156912 153782 161905
12931 161905 176355 188164 205217 219378 223084 207352 190296 196414 201876 209402 225541 248704
12919 248704 240067 225287 213712 227488 237226 254129 272538 285236 303136 300641 296523 297896
$$ packed form
13007D0613N775J6607K5196K7087J2767J1078J5065J3793J4737l627r466L513
12995A73138O29r860O71J6427J0604j3406j4837m796k910P674O869j1206J0931
12982A69928R414J8743J1225R781m804r282K056M082Q668J3982P442Q577k4349
12969B25463l3445j2466K527M437m587l487K2882J9053N792K978L762o432j868
12956B24609M31Q159M829J40M761N759J1610n391J1848K0782M6434O2248N0903
12943D47122n339j8694k9310m8285n1143n9401l9713k3697j1946k682l130Q123
12931A61905J4450J1809J7053J4161L706j5732j7056O118N462P526J6139K3163
12919B48704q637j4780j1575J3776R738J6903J8409J2698J7900k495m118J373
$$ plain form
12907 297896 306011 311234 326554 347713 360400 366068 381985 396783 394787 399181 400850 419362 422359
12894 422359 415959 427522 440206 458395 482031 497373 500931 513146 534261 554288 553674 548839
12882 548839 547763 549041 556237 584518 623169 652148 691072 716857 747278 778762 809177 819999
12870 819999 829682 846187 862675 879848 892997 912454 948952 980757 1048491 1118823 1176479 1220834
12858 1220834 1288390 1372490 1467263 1552589 1640800 1725677 1810194 1890772 1991370 2119795 2231403
12847 2231403 2342193 2459475 2583341 2720258 2895159 3094787 3310130 3559981 3867464
12838 3867464 4230401 4660468 5179515 5789225 6500823 7315568 8263178 9379443 10740560
12829 10740560 12424169 14575738 17367933 21031006 25888843 32456055 41416267 53940709
$$ packed form
12907B97896Q115N223J5320K1159J2687N668J5917J4798j996M394J669J8512K997
12894D22359o400J1563J2684J8189K3636J5342L558J2215K1115K0027o14m835
12882E48839j076J278P196K8281L8651K8979L8924K5785L0421L1484L0415J0822
12870H19999R683J6505J6488J7173J3149J9457L6498L1805O7734P0332N7656M4355
12858A220834O7556Q4100R4773Q5326Q8211Q4877Q4517Q0578J00598J28425J11608
12847B231403J10790J17282J23866J36917J74901J99628K15343K49851L07483
12838C867464L62937M30067N19047O09710P11598Q14745R47610J116265J361117
12829A0740560J683609K151569K792195L663073M857837O567212Q960212J2524442
$$ plain form
12821 53940709 72162789 99248042 138812114 192011782 247879675 278570234 269767479
12814 269767479 232058180 181441817 132706425 95277770 69701876 52584487 40741380
12807 40741380 32193478 25827213 21022614 17371521 14598264 12445972 10749813 9377876
12799 9377876 8234435 7314093 6582027 5984959 5486771 5041235 4637429 4259107 3922419
12790 3922419 3601512 3300734 3024320 2780550 2565731 2383077 2213181 2070332 1915207
12781 1915207 1786949 1694300 1594715 1497120 1405721 1344457 1312225 1295377 1255189 1196738 1151077
12770 1151077 1119106 1079925 1043810 1005507 952032 892720 843957 788319 759181 734303 699483
12759 699483 657518 622337 588532 577309 584645 581951 581839 583802 584499 547761 500891 483789 460476
$$ packed form
12821E3940709J8222080K7085253L9564072N3199668N5867893L0690559q802755
12814B69767479l7709299n0616363m8735392l7428655k5575894j7117389j1843107
12807D0741380q547902o366265m804599l651093k773257k152292j696159j371937
12799I377876j143441r20342p32066n97068m98188m45536m03806l78322l36688
12790C922419l20907l00778k76414k43770k14819j82654j69896j42849j55125
12781A915207j28258r2649r9585r7595r1399o1264l2232j6848m0188n8451m5661
12770A151077l1971l9181l6115l8303n3475n9312m8763n5638k9138k4878l4820
12759F99483m1965l5181l3805j1223P336k694j12J963O97l6738m6870j7102k3313
$$ plain form
12746 460476 441956 434328 434785 417685 406348 391165 388751 361006 327222 330647 327753 310983 307445
12733 307445 318541 312695 314836 309826 300958 290799 283398 289847 286453 281974 276698 285238 281911 271251
12719 271251 266993 266818 247060 251202 250195 273626 283232 258793 247301 243463 244154 243085 241154 206900
12705 206900 200429 189828 186823 193853 217967 232246 231841 234479 237519 257833 309047 353917 360026
12692 360026 329892 288624 238478 184745 149725 139530 136068 123113 128623 116371 110585 95412
12680 95412 104982 121015 128742 122381 103956 90841 88545 93608 84960 71989 83040 106935 114824
12667 114824 117361 113860 119096 113404 82403 53463 31694 24995 24783 29037 38254 34937 25762 21642
12653 21642 33161 35695 38006 32043 48570 57526 70518 54422 62902 74131 52937 16538 -2592
$$ packed form
12746D60476j8520p628M57j7100j1337j5183k414k7745l3784L425k894j6770l538
12733C07445J1096n846K141n010q868j0159p401O449l394m479n276Q540l327j0660
12719B71251m258j75j9758M142j007K3431R606k4439j1492l838O91j069j931l4254
12705B06900o471j0601l005P030K4114J4279m05K638L040K0314N1214M4870O109
12692C60026l0134m1268n0146n3733l5020j0195l462j2955N510j2252n786j5173
12680I5412R570J6033P727o361j8425j3115k296N063q648j2971J1051K3895P889
12667A14824K537l501N236n692l1001k8940k1769o699k12M254R217l317r175m120
12653B1642J1519K534K311n963J6527Q956J2992j6096Q480J1229k1194l6399j9130
$$ plain form
12640 -2592 10322 9325 23005 36534 30275 35299 39796 43272 57034 49701 37288 40510 49805 79890
12626 79890 93128 101719 107646 119125 116591 101431 88314 82965 73170 77070 71814 63850 57310
12613 57310 47413 28344 40123 46253 56486 53667 39752 26290 24558 42233 52685 49730 68815
12600 68815 74614 88206 96948 88358 63691 39539 38294 34643 22544 14597 34949 47896 51907
12587 51907 50420 51353 55987 56489 53238 61719 51356 33672 32549 42241 49747 63371 59452 37908
12573 37908 33261 34167 22355 18245 12969 3391 2835 24066 35845 38627 53304 65229 51277
12560 51277 32778 49700 75200 78987 79974 72947 71380 62014 54676 49116 66591 78031 74475
12547 74475 59311 50248 45507 41503 49733 51407 63293 48398 41028 36116 32545 34258 38075 49162
$$ packed form
12640b592J2914r97J3680J3529o259N024M497L476J3762p333j2413L222R295L0085
12626G9890J3238Q591N927J1479k534j5160j3117n349r795L900n256p964o540
12613E7310r897j9069J1779O130J0233k819j3915j3462j732J7675J0452k955J9085
12600F8815N799J3592Q742q590k4667k4152j245l651j2099p947K0352J2947M011
12587E1907j487R33M634N02l251Q481j0363j7684j123R692P506J3624l919k1544
12573C7908m647R06j1812m110n276r578n56K1231J1779K782J4677J1925j3952
12560E1277j8499J6922K5500L787R87p027j567r366p338n560J7475J1440l556
12547G4475j5164r063m741m004Q230J674J1886j4895p370m912l571J713L817J1087
$$ plain form
12533 49162 56203 58021 64338 68438 74970 60480 57062 50363 59326 71520 75373 76477 65797 47803
12519 47803 45928 63175 70579 64720 49805 42926 37869 29770 29056 40041 47635 27149 -14728
12506 -14728 -55090 -93833 -109947 -103275 -80730 -51308 -37925 -31094 -28465 -24397 -19063 -3423 24706
12493 24706 33281 25806 22240 19721 14404 25143 26991 25416 22715 25607 33670 34129 38959 21963
12479 21963 27118 31124 34887 42990 48684 49425 40741 43118 56217 62794 63932 60387 53990 57375
12465 57375 60160 48501 44331 43183 53065 65238 77175 80225 70955 71476 73583 76331 63780 47499
12451 47499 38803 45859 57289 66433 86030 83468 59927 47867 48640 30770 29542 45868 52353
12438 52353 51939 63459 63088 55902 48922 31188 28463 16686 7103 23666 32313 48000 50426 41943
$$ packed form
12533D9162P041J818O317M100O532j4490l418o699Q963J2194L853J104j0680j7994
12519D7803j875J7247P404n859j4915o879n057q099p14J0985P594k0486m1877
12506a4728m0362l8743j6114O672K2545K9422J3383O831K629M068N334J5640K8129
12493B4706Q575p475l566k519n317J0739J848j575k701K892Q063M59M830j6996
12479B1963N155M006L763Q103N694P41q684K377J3099O577J138l545o397L385
12465E7375K785j1659m170j148R882J2173J1937L050r270N21K107K748j2551j6281
12451D7499q696P056J1430R144J9597k562k3541j2060P73j7870j228J6326O485
12438E2353m14J1520l71p186o980j7734k725j1777r583J6563Q647J5687K426q483
$$ plain form
12424 41943 40664 35247 23344 17768 12252 19751 39421 47463 43145 44855 43591 34583 29243 40197
12410 40197 50339 53570 59483 55701 53974 53817 51232 53317 46492 50593 66411 69709 63527 70309
12396 70309 64099 63223 76842 86473 89723 81059 72316 72830 77577 79947 76812 81980 93135 108054
12382 108054 122396 120817 130526 140584 157202 173090 186839 227649 271899 315948 368384 465834
12370 465834 596968 790966 1024911 1272203 1412393 1361616 1195992 977276 761608 584611
12360 584611 455818 354094 278387 260114 239607 192862 169007 160492 136803 130085 126651 109279
12348 109279 100576 103799 94161 93575 97221 89754 86307 85599 81644 85929 88238 84335 66863 66998 77420
12333 77420 80678 82374 83530 75426 75131 87006 94251 84533 79770 78549 75914 79849 85072 85175 96578
$$ packed form
12424D1943j279n417j1903n576n516P499J9670Q042m318J710j264r008n340J0954
12410D0197J0142L231N913l782j727j57k585K085o825M101J5818L298o182O782
12396G0309o210q76J3619R631L250q664q743N14M747K370l135N168J1155J4919
12382A08054J4342j579R709J0058J6618J5888J3749M0810M4250M4049N2436R7450
12370D65834J31134J93998K33945K47292J40190n0777j65624k18716k15668j76997
12360E84611j28793j01724p5707j8273k0507m6745k3855q515k3689o718l434j7372
12348A09279q703L223r638n86L646p467l447p08l955M285K309l903j7472J35J0422
12333G7420L258J696J156q104k95J1875P245r718m763j221k635L935N223J03J1403
$$ plain form
12318 96578 95348 99338 92073 86240 91588 99872 98680 96299 80396 70282 71768 90827 91970 95164
12304 95164 100403 113896 106950 100868 97803 104747 93292 79184 93552 101613 101159 101031 106719 108198
12290 108198 103528 127573 148100 145464 131507 122253 115331 103943 110709 113023 109325 97918 101729
12277 101729 114443 103740 103599 108182 107500 104517 102556 100974 101079 103241 115911 132571 133794 123272
12263 123272 121797 125106 120182 123945 121695 99972 91030 99345 115137 129755 128809 139932 126514
12250 126514 114059 123157 115251 105295 94901 103854 113327 120561 108999 85425 93760 113134 102853
12237 102853 97278 112333 128978 115236 117424 132113 137522 139938 150131 149767 141778 128439 125157
12224 125157 137815 153309 165958 173446 185009 191388 179732 166742 156898 161040 173966 167641
$$ packed form
12318I6578j230L990p265n833N348Q284j192k381j5903j0114J486J9059J143L194
12304I5164N239J3493o946o082l065O944j1455j4108J4368Q061m54j28N688J479
12290A08198m670K4045K0527k636j3957r254o922j1388O766K314l698j1407L811
12277A01729J2714j0703j41M583o82k983j961j582J05K162J2670J6660J223j0522
12263A23272j475L309m924L763k250k1723q942Q315J5792J4618r46J1123j3418
12250A26514j2455R098p906r956j0394Q953R473P234j1562k3574Q335J9374j0281
12237A02853n575J5055J6645j3742K188J4689N409K416J0193l64p989j3339l282
12224A25157J2658J5494J2649P488J1563O379j1656j2990r844M142J2926o325
$$ plain form
12212 167641 155459 155453 151494 141847 145952 144271 143702 157556 151656 153391 161330 163333 166488 170641 174290
12197 174290 165790 168476 177697 188025 189514 200859 196376 194648 195113 186404 176146 164380 151271
12184 151271 163226 187929 187196 180460 183397 180157 184266 201331 203509 197799 200937 201429 201455 217733
12170 217733 217728 204035 216655 218343 213825 206744 210141 204323 195947 202048 205364 214267 228027 229631
12156 229631 233484 232891 232546 229046 236597 252637 262241 261965 261642 248685 260994 274683 274652 284136 276317
12141 276317 276823 269014 268140 285612 283574 283558 292642 301963 304474 308574 296229 294446 303038 301564 312290
12126 312290 312160 314002 309101 321280 326682 324060 327737 322933 325389 332968 345819 347446 343810 336795
12112 336795 328270 318614 320318 332117 341539 353387 367685 373440 389687 390622 381928 393501 388116
$$ packed form
12212A67641j2182ol959r647M105j681n69J3854n900J735P939K003L155M153L649
12197A74290q500K686R221J0328J489J1345m483j728M65q709j0258j1766j3109
12184A51271J1955K4703p33o736K937l240M109J7065K178n710L138M92K6J6278
12170B17733nj3693J2620J688m518p081L397n818q376O101L316Q903J3760J604
12156B29631L853n93l45l500P551J6040R604k76l23j2957J2309J3689l1R484p819
12141B76317N06p809q74J7472k038j6R084R321K511M100j2345j783Q592j474J0726
12126C12290j30J842m901J2179N402k622L677m804K456P579J2851J627l636p015
12112C36795q525r656J704J1799R422J1848J4298N755J6247R35q694J1573n385
$$ plain form
12099 388116 393809 401835 409540 411092 417533 434831 456413 455412 453263 458598 464457 473518 491590
12086 491590 497410 497860 487870 471094 466980 483303 471951 464548 483573 500376 503157 508080 510915
12073 510915 510288 523995 531748 541011 554255 557386 570503 578261 573693 578904 597095 607150 625059
12060 625059 635296 632373 622834 644577 658090 651411 658747 670902 672016 685546 694673 698173 710320
12047 710320 730971 744694 753037 780565 783396 787877 797372 796414 798115 814124 836384 862629 881169
12034 881169 888646 908186 929568 930997 917933 922810 927197 927322 942500 963502 987717 998127 1000270
12021 1000270 1021629 1043615 1055862 1083779 1083630 1079101 1088609 1105573 1133914 1159354 1171146 1191876
12009 1191876 1186026 1191805 1212190 1238156 1247306 1253455 1273009 1292820 1323027 1344441 1350091 1354806
$$ packed form
12099C88116N693Q026P705J552O441J7298K1582j001k149N335N859R061J8072
12086D91590N820M50r990j6776m114J6323j1352p403J9025J6803K781M923K835
12073E10915o27J3707P753R263J3244L131J3117P758m568N211J8191J0055J7909
12060F25059J0237k923r539K1743J3513o679P336J2155J114J3530R127L500J2147
12047G10320K0651J3723Q343K7528K831M481R495r58J701J6009K2260K6245J8540
12034H81169P477J9540K1382J429j3064M877M387J25J5178K1002K4215J0410K143
12021A000270K1359K1986J2247K7917j49m529R508J6964K8341K5440J1792K0730
12009A191876n850N779K0385K5966R150O149J9554J9811L0207K1414N650M715
$$ plain form
11997 1354806 1360359 1383917 1402778 1424461 1440486 1468220 1496875 1533093 1563539 1591243 1613501
11986 1613501 1616562 1605256 1605047 1612198 1622827 1633989 1648306 1644492 1646198 1655495 1673767 1699548 1722386
11973 1722386 1731841 1752911 1759770 1756947 1749286 1755321 1773403 1799219 1798884 1794859 1800350 1831952 1843419
11960 1843419 1842750 1837441 1838416 1833376 1838007 1844912 1852293 1869552 1889422 1892311 1886223 1875131 1867835 1871061
11946 1871061 1888905 1938017 1967099 1935307 1920194 1902376 1878519 1858996 1833773 1802935 1785623
11935 1785623 1774391 1768310 1754150 1749531 1738575 1733113 1731373 1728957 1712319 1684396 1687861 1682095 1660395
11922 1660395 1641678 1636466 1613051 1593127 1583067 1565213 1551786 1523753 1503870 1490516 1473711
11911 1473711 1457203 1446879 1444816 1424895 1411309 1394139 1360622 1342957 1345239 1338942 1318685 1295143
$$ packed form
11997A354806N553K3558J8861K1683J6025K7734K8655L6218L0446K7704K2258
11986A613501L061j1306k09P151J0629J1162J4317l814J706R297J8272K5781K2838
11973A722386R455K1070O859k823p661O035J8082K5816l35m025N491L1602J1467
11960A843419o69n309R75n040M631O905P381J7259J9870K889o088j1092p296L226
11946A871061J7844M9112K9082l1792j5113j7818k3857j9523k5223l0838j7312
11935A785623j1232o081j4160m619j0956n462j740k416j6638k7923L465n766k1700
11922A660395j8717n212k3415j9924j0060j7854j3427k8033j9883j3354j6805
11911A473711j6508j0324k063j9921j3586j7170l3517j7665K282o297k0257k3542
$$ plain form
11899 1295143 1266311 1241129 1237535 1228211 1230133 1211924 1186445 1152652 1136622 1140490 1126316 1102824
11887 1102824 1075855 1064451 1045885 1021698 1007336 991086 991451 996721 984067 975344 965325 952265
11875 952265 938453 930195 922171 912228 877430 859384 842310 831467 830522 828316 828997 821102 820580 808716
11861 808716 801385 800210 787319 762418 737044 737132 729138 719840 710831 685801 672760 670975 657787
11848 657787 639937 623509 597594 605271 605208 618180 625325 625439 607747 589763 575666 568089 559887
11835 559887 551233 544193 536713 531163 526535 516986 515729 508149 514175 508000 497469 497990 489483 483664
11821 483664 478865 465118 449294 444956 437115 435142 431634 424110 422087 411125 408756 406979 415158
11808 415158 412243 403014 399602 384897 372650 372758 374430 385233 383091 378534 368551 356823 354286
$$ packed form
11899A295143k8832k5182l594r324J922j8209k5479l3793j6030L868j4174k3492
11887A102824k6969j1404j8566k4187j4362j6250L65N270j2654q723j0019j3060
11875I52265j3812q258q024r943l4798j8046j7074j0843r45k206O81p895n22j1864
11861H08716p331j175j2891k4901k5374Q8p994r298r009k5030j3041j785j3188
11848F57787j7850j6428k5915P677o3J2972P145J14j7692j7984j4097p577q202
11835E59887q654p040p480n550m628r549j257p580O026o175j0531N21q507n819
11821D83664m799j3747j5824m338p841j973l508p524k023j0962k369j777Q179
11808D15158k915r229l412j4705j2247J08J672J0803k142m557r983j1728k537
$$ plain form
11795 354286 350228 338897 340572 338007 333815 331500 328956 332309 347551 335915 327357 318002 318864 321054
11781 321054 317540 317794 320881 314562 311300 299963 289667 272812 265993 267431 261724 262003 274961 272044
11767 272044 272317 265449 264218 266626 260396 250814 251625 253017 248037 239501 232128 235679 241201 239785 238034
11752 238034 230488 233600 236582 231566 219566 216712 213182 203130 204276 190294 179082 174054 174824
11739 174824 184119 186159 186334 187287 191599 180396 172572 178346 188090 189164 192845 190739 197654 193183
11725 193183 194527 206428 211928 202263 196632 189245 179147 188300 195876 183980 175866 175124 172592 159391
11711 159391 155224 158928 158753 161408 151918 144427 153203 159476 149587 150042 152250 142943 142866 136659 128479
11696 128479 133135 130133 132686 131252 134477 143185 148985 154804 152927 148543 151540 131267 116027 122885
$$ packed form
11795C54286m058j1331J675k565m192k315k544L353J5242j1636q558r355Q62K190
11781C21054l514K54L087o319l262j1337j0296j6855o819J438n707K79J2958k917
11767B72044K73o868j231K408o230r582Q11J392m980q536p373L551N522j416j751
11752B38034p546L112K982n016j2000k854l530j0052J146j3982j1212n028P70
11739A74824R295K040J75R53M312j1203p824N774R744J074L681k106O915m471
11725A93183J344J1901N500r665n631p387j0098R153P576j1896q114p42k532j3201
11711A59391m167L704j75K655r490p491Q776O273r889M55K208r307p7o207q180
11696A28479M656l002K553j434L225Q708N800N819j877m384K997k0273j5240O858
$$ plain form
11682 122885 119868 110922 105788 110032 115995 111422 106403 106394 124044 110297 101854 103822 110009 120700
11668 120700 118118 104252 104631 86466 79043 81434 85937 85677 88999 99828 98148 92666 102325 109364
11654 109364 100925 106535 110126 99754 96128 104520 112702 101979 87118 86460 95097 93307 102253 96864
11640 96864 94961 111486 114423 94749 83460 78826 84351 91476 96590 95732 74575 79204 94112
11627 94112 92929 84452 92030 93903 81974 84336 68868 49421 51971 60533 61814 72639 79040
11614 79040 78535 88279 103134 104777 111672 108067 105103 103696 84801 70037 72296 80104 81976 81303
11600 81303 80222 64441 60216 62407 72672 81218 81661 75355 73027 65410 62534 72866 81895 66438
11586 66438 45095 37585 39759 38520 39424 60421 80150 84615 77868 75000 68879 72541 73482 56062
$$ packed form
11682A22885l017q946n134M244N963m573n019rJ7650j3747q443J968O187J0691
11668A20700k582j3866L79j8165p423K391M503k60L322J0829j680n482R659P039
11654A09364q439N610L591j0372l626Q392Q182j0723j4861o58Q637j790Q946n389
11640I6864j903J6525K937j9674j1289m634N525P125N114q58k1157M629J4908
11627I4112j183q477P578J873j1929K362j5468j9447K550Q562J281J0825O401
11614G9040n05R744J4855J643O895l605k964j407j8895j4764K259P808J872o73
11600H1303j081j5781m225K191J0265Q546M43o306k328p617k876J0332R029j5457
11586F6438k1343p510K174j239R04K0997J9729M465o747k868o121L662R41j7420
$$ plain form
11572 56062 48895 55878 66325 65015 55477 58106 69508 81727 83755 71844 52208 58389 73623
11559 73623 64466 57987 60818 48846 58483 66225 59884 49686 58949 59918 56257 64913 70042 63287
11545 63287 69925 75957 76732 79658 75751 69679 66557 65668 74570 75906 54793 54180 49958 47311 63969
11530 63969 63952 54392 63041 70310 75220 66808 55890 62637 50672 34911 23782 17734 20439 39589
11516 39589 52570 54505 43919 28364 30027 29088 41080 47563 42053 35474 34861 37327 45071 41971
11502 41971 40267 41551 43960 34803 28822 41004 45501 36617 21380 22287 22775 45607 47024 45883
11488 45883 35757 31653 33504 35794 32666 25354 20208 26052 25206 38946 44432 49320 41563 29585
11474 29585 20705 20133 33681 44084 46078 36300 24964 28072 24657 34646 36918 32891 24223 12298
$$ packed form
11572E6062p167O983J0447j310r538K629J1402J2219K028j1911j9636O181J5234
11559G3623r157o479K831j1972R637P742o341j0198R263R69l661Q656N129o755
11545F3287O638O032P75K926l907o072l122q89Q902J336k1113o13m222k647J6658
11530F3969j7r560Q649P269M910q412j0918O747j1965j5761j1129o048K705J9150
11516C9589J2981J935j0586j5555J663r39J1992O483n510o579o13K466P744l100
11502D1971j704J284K409r157n981J2182M497q884j5237R07M88K2832J417j141
11488D5883j0126m104J851K290l128p312n146N844q46J3740N486M888p757j1978
11474B9585q880n72J3548J0403J994r778j1336L108l415R989K272m027q668j1925
$$ plain form
11460 12298 6688 -972 2683 12054 16810 17898 25020 21903 11233 18384 39049 41609 34386 29497
11446 29497 34970 32993 32523 34955 52067 51808 42631 40400 36968 45637 53931 58690 59051 46184 31198
11431 31198 12863 13010 16568 15835 20245 12318 11669 11082 18335 27306 20335 20977 30040 47037 57916
11416 57916 57532 35132 16908 7347 2455 -2247 -10119 9644 9038 674 -988 14947 21772 29803
11402 29803 36261 40492 48519 41727 41427 30165 23644 29703 26441 16835 20087 20747 17624 4421
11388 4421 11304 23192 32451 32934 26226 22216 31482 36104 32932 33796 30394 34954 29033 27884 25213
11373 25213 18551 27810 25993 27024 31619 23590 32321 40498 38728 30317 25205 16009 18491 22804
11359 22804 23972 20813 30890 34414 19088 13037 20946 35478 35832 12561 13878 26017 38423
$$ packed form
11460A2298n610p660L655R371M756J088P122l117j0670P151K0665K560p223m889
11446B9497N473j977m70K432J7112k59r177k231l432Q669Q294M759L61j2867j4986
11431C1198j8335J47L558p33M410p927o49n87P253Q971o971O42R063J6997J0879
11416E7916l84k2400j8224r561m892m702p872J9763o06q364j662J5935O825Q031
11402B9803O458M231Q027o792l00j1262o521O059l262r606L252O60l123j3203
11388D421O883J1888R259M83o708m010R266M622l172Q64l402M560n921j149k671
11373B5213o662R259j817J031M595q029Q731Q177j770q411n112r196K482M313
11359B2804J168l159J0077L524j5326o051P909J4532L54k3271J317J2139J2406
$$ plain form
11346 38423 33813 18376 7422 11066 16406 18748 21291 11582 3478 -2359 24135 35290 25490
11333 25490 33035 20393 10459 -1585 4093 15368 20744 23735 25369 18283 22951 8466 2522
11320 2522 16017 17440 20112 27861 29445 34208 27374 13031 13952 7044 9941 -7507 1581 11768
11306 11768 12899 18520 17149 13935 33705 42391 25455 2864 -1582 2546 13044 9376 13007
11293 13007 6973 26573 31094 27270 34265 36243 17115 19731 24610 21178 16599 4378 -10367
11280 -10367 -12545 4564 28059 20175 13397 6210 -872 -3082 1098 -8842 -10227 -8773 -4090 4519
11266 4519 -113 4105 10858 22847 29751 32073 39453 33096 18293 9263 -4221 -17976 -13932 7596
11252 7596 1292 4160 5244 14810 26829 26617 13785 6419 5280 1444 4352 5673 8357 7931 4745
$$ packed form
11346C8423m610j5437j0954L644N340K342K543r709q104n837K6494J1155r800
11333B5490P545j2642r934j2044N678J1275N376K991J634p086M668j4485n944
11320B522J3495J423K672P749J584M763o834j4343R21o908K897j7448R088J0187
11306A1768J131N621j371l214J9770Q686j6936k2591m446M128J0498l668L631
11293A3007o034J9600M521l824O995J978j9128K616M879l432m579j2221j4745
11280a0367k178J7109K3495p884o778p187p082k210M180r940j385J454M683Q609
11266D519m632M218O753J1989O904K322P380o357j4803r030j3484j3755M044K1528
11252G596o304K868J084R566J2019k12j2832p366j139l836K908J321K684m26l186
$$ plain form
11237 4745 12078 11082 8644 9349 12082 26936 25019 16295 9228 16494 20786 21394 21211 13749 5447
11222 5447 7489 15299 21458 27053 24263 605 -6700 -11123 -3975 -6391 -7960 498 -4391 -5665
11208 -5665 21072 29485 27409 6625 12745 15813 10873 26007 34359 29134 15414 15531 21789 27262
11194 27262 27472 25305 26085 33927 33751 31544 19725 18769 20554 15617 11957 10645 7139 5389 17962
11179 17962 24397 24229 14312 13828 5651 8518 30425 32224 31169 32447 29212 14467 13905 20047 23581
11164 23581 16843 -6727 343 22746 25961 25754 20191 21183 22217 14038 1440 5827 16158 -1620
11150 -1620 304 -1109 -9203 -15527 -9395 -13446 -7418 5017 20575 43118 39658 34275 22037 10888
11136 10888 19428 1016 -7923 -5931 -3455 -9883 -14995 -12701 2138 11885 9251 5236 15353 21931
$$ packed form
11237D745P333r96k438P05K733J4854j917q724p067P266M292O08j83p462q302
11222E447K042P810O159N595k790k3658p305m423P148k416j569Q458m889j274
11208e665K6737Q413k076k0784O120L068m940J5134Q352n225j3720J17O258N473
11194B7262K10k167P80P842j76k207j1819r56J785m937l660j312l506j750J2573
11179A7962O435j68r917m84q177K867K1907J799j055J278l235j4745n62O142L534
11164B3581o738k3570P070K2403L215k07n563R92J034q179j2598M387J0331j7778
11150a620J924j413q094o324O132m051O028J2435J5558K2543l460n383j2238j1149
11136A0888Q540j8412q939J992K476o428n112K294J4839R747k634m015J0117O578
$$ plain form
11122 21931 12815 5238 -2363 -6513 888 25938 15840 -4989 7227 15536 19130 30355 30377 24245
11108 24245 14570 10630 19569 18848 31608 31643 18399 9256 15863 17947 325 -8193 3073 -3655
11094 -3655 -9684 3069 2472 -5524 -10315 -8210 5667 3935 -925 -822 3748 2231 17403 29766
11080 29766 17632 9125 1285 -2619 -4218 -2902 -9832 -19345 -14383 -5742 350 9150 18153 19558
11066 19558 24390 6527 11298 19797 25630 33408 42742 42430 35385 25503 21960 15947 8456 -3253
11052 -3253 -9188 7274 -1410 -7795 -3537 1597 10302 16986 19753 9608 17594 32233 43971 34965
11038 34965 28770 36803 51426 51231 43810 33754 27888 47465 66532 72014 69046 81810 99081
11025 99081 97909 108258 104569 87295 99788 89526 66504 61153 66373 81167 93455 110244
$$ packed form
11122B1931r116p577p601m150P401K5050j0098k0829J2216Q309L594J1225K2o132
11108B4245r675l940Q939p21J2760L5j3244r143O607K084j7622q518J1266o728
11094c655o029J2753n97p996m791K105J3877j732m860J03M570j517J5172J2363
11080B9766j2134q507p840l904j599J316o930r513M962Q641O092Q800R003J405
11066A9558M832j7863M771Q499N833P778R334l12p045r882l543o013p491j1709
11052c253n935J6462q684o385M258N134Q705O684K767j0145P986J4639J1738r006
11038C4965o195Q033J4623j95p421j0056n866J9577J9067N482k968J2764J7271
11025I9081j172J0349l689j7274J2493j0262k3022n351N220J4794J2288J6789
$$ plain form
11013 110244 122003 120412 105663 93733 88045 89239 82390 86829 83412 82299 96745 93637 84676
11000 84676 80060 78903 73980 66611 55460 54964 43593 55600 54893 53831 64061 58524 60809 57436
10986 57436 55694 39716 29482 35759 37202 30204 19130 26410 23639 28628 36579 32029 16365
10973 16365 2786 -12095 -1616 22102 34348 28144 24760 13549 20290 14038 17539 15005 26887
10960 26887 28126 22324 7752 -4546 -560 -4124 -5204 -6613 9526 5403 2100 5813 13761 5067
10946 5067 1422 6658 8463 -1748 -12511 2270 16611 20242 27757 18879 2914 -2654 -2876 -1102
10932 -1102 5626 5538 11018 8894 6819 22181 18711 12988 29047 35775 36982 33775 23963 27687 31799
10917 31799 27367 10830 4323 -778 3900 7693 14615 17115 28736 24595 33331 26565 16425 717
$$ packed form
11013A10244J1759j591j4749j1930n688J194o849M439l417j113J4446l108q961
11000H4676m616j157m923p369j1151m96j1371J2007p07j062J0230n537K285l373
10986E7436j742j5978j0234O277J443o998j1074P280k771M989P951m550j5664
10973A6365j3579j4881J0479K3718J2246o204l384j1211O741o252L501k534J1882
10960B6887J239n802j4572j2298L986l564j080j409J6139m123l303L713P948q694
10946E067l645N236J805j0211j0763J4781J4341L631P515q878j5965n568k22J774
10932a102O728q8N480k124k075J5362l470n723J6059O728J207l207r812L724M112
10917C1799m432j6537o507n101M678L793O922K500J1621m141Q736o766j0140j5708
$$ plain form
10903 717 3463 3242 4578 11404 6073 3926 18356 32159 33121 22358 13425 23287 29494 10244
10889 10244 10298 16582 24807 36075 20299 -4995 4321 16816 18147 26693 31664 17420 6672
10876 6672 4061 -2584 -14898 -5046 14190 21023 14261 -2135 -4169 11593 15007 10201 -3799
10863 -3799 -512 21098 26821 3359 -3769 -3936 20705 18715 30015 26800 23464 15248 30166 28038
10849 28038 17972 -793 -4320 -7421 -8475 3501 4120 22003 31250 31345 20830 25023 26669 30355
10835 30355 31015 31254 27066 31023 29593 32354 15789 3181 16733 34621 29329 25607 13673 11372
10821 11372 2261 7870 16139 13965 7801 2581 4151 13248 23998 15467 25732 26640 20476 27312
10807 27312 33120 27521 19314 21657 22496 30519 33264 22180 318 -3286 20130 25572 7240 4032
$$ packed form
10903G17K746k21J336O826n331k147J4430J3803R62j0763q933R862O207j9250
10889A0244N4O284Q225J1268j5776k5294R316J2495J331Q546M971j4244j0748
10876F672k611o645j2314R852J9236O833o762j6396k034J5762L414m806j4000
10863c799L287K1610N723k3462p128j67K4641j990J1300l215l336q216J4918k128
10849B8038j0066j8765l527l101j054J1976O19J7883R247R5j0515M193J646L686
10835C0355O60K39m188L957j430K761j6565j2608J3552J7888n292l722j1934k301
10821A1372r111N609Q269k174o164n220J570R097J0750q531J0265R08o164O836
10807B7312N808n599q207K343Q39Q023K745j1084k1862l604K3416N442j8332l208
$$ plain form
10793 4032 6970 11898 14148 6449 9971 2299 3407 -2337 10210 15139 8382 12588 25218 15654
10779 15654 3628 -4788 -8160 6747 7815 5597 21508 22597 51264 68063 48861 28767 26625
10766 26625 26212 5119 -8236 -6368 13028 16182 17383 23963 28202 28442 47603 59089 37820
10753 37820 40179 31687 18142 17103 16396 27142 29138 28967 25456 30210 37645 32428 21748 29111
10739 29111 57346 77018 62648 73276 62302 55069 52826 54056 54412 45346 40151 44883 46047
10726 46047 41839 33326 34038 28564 35161 28343 34167 31742 28417 31038 20317 30203 36603 42635
10712 42635 55527 46789 27783 31019 40567 43090 40576 28621 24607 34005 30859 45244 52571
10699 52571 40274 31476 14157 14519 3960 6106 14279 7282 13202 36295 40012 40133 43338 51994
$$ packed form
10793D032K938M928K250p699L522p672J108n744J2547M929o757M206J2630r564
10779A5654j2026q416l372J4907J068k218J5911J089K8667J6799j9202k0094k142
10766B6625m13k1093j3355J868J9396L154J201O580M239K40J9161J1486k1269
10753C7820K359q492j3545j039p07J0746J996j71l511M754P435n217j0680P363
10739B9111K8235J9672j4370J0628j0974p233k243J230L56r066n195M732J164
10726D6047m208q513P12n474O597o818N824k425l325K621j0721R886O400O032
10712D2635J2892q738j9006L236R548K523k514j1955m014R398l146J4385P327
10699E2571j2297q798j7319L62j0559K146Q173o997N920K3093L717J21L205Q656
$$ plain form
10685 51994 35645 23298 35735 38564 37988 35688 27414 20921 23321 29677 33320 26619 22820 28051
10671 28051 34993 38661 58482 57226 56557 47905 47145 42680 43842 41445 48699 55348 58182 60533 73355
10656 73355 83088 77562 71183 84621 94125 108840 113172 107580 99454 101519 108899 102354 104336 109169
10642 109169 108425 127385 133133 138764 154924 165473 176315 179845 166071 179400 195453 207465
10630 207465 226535 232802 248216 273119 304700 336317 384039 416531 452136 500564 562219 618221
10618 618221 689291 787393 923608 1113324 1360725 1685331 2138439 2736726 3523363 4482275
10608 4482275 5507882 6378028 6898135 7007904 6831630 6567165 6412670 6490177 6954952
10599 6954952 7885529 9321983 11212143 13266233 14866544 15470655 15045983 13975814 12759936
$$ packed form
10685E1994j6349j2347J2437K829n76k300q274o493K400O356L643o701l799N231
10671B8051O942L668J9821j256o69q652p60m465J162k397P254O649K834K351J2822
10656G3355R733n526o379J3438R504J4715M332n592q126K065P380o545J982M833
10642A09169p44J8960N748N631J6160J0549J0842L530j3774J3329J6053J2012
10630B07465J9070O267J5414K4903L1581L1617M7722L2492L5605M8428O1655N6002
10618F18221P1070R8102J36215J89716K47401L24606M53108N98287P86637R58912
10608D482275J025607Q70146N20107J09769j76274k64465j54495P7507M64775
10599F954952R30577J436454J890160K054090J600311O04111m24672j070169j215878
$$ plain form
10590 12759936 11834455 11476382 11810951 12903192 14748820 17185148 19675779 21292449
10582 21292449 21382600 19982152 17726037 15322118 13345878 12076695 11550124 11741525 12574035
10573 12574035 13818018 15016420 15565858 15062471 13609239 11683715 9782798 8227109
10565 8227109 7175142 6606954 6452802 6594477 6876988 7107992 7046159 6576425 5752431
10556 5752431 4756167 3780259 2919431 2253437 1774196 1416132 1165184 985641 830331
10547 830331 707828 616780 541657 473512 420892 377732 342886 319493 290108 270714 243041
10536 243041 218455 208607 202427 180700 168188 167809 156561 152728 134541 121617 130188 127443 114075
10523 114075 101213 109559 104968 101314 82177 75505 74777 85707 96657 88894 79248 80416 80287 85115
$$ packed form
10590A2759936r25481l58073L34569J092241J845628K436328K490631J616670
10582B1292449R0151j400448k256115k403919j976240j269183n26571J91401Q32510
10573A2574035J243983J198402N49438n03387j453232j925524j900917j555689
10565H227109j051967n68188j54152J41675K82511K31004o1833m69734q23994
10556E752431r96264r75908q60828o65994m79241l58064k50948j79543j55310
10547H30331j22503r1048p5123o8145n2620m3160l4846k3393k9385j9394k7673
10536B43041k4586r848o180k1727j2512l79j1248l833j8187j2924Q571k745j3368
10523A14075j2862Q346m591l654j9137o672p28J0930J0950p763r646J168j29M828
$$ plain form
10509 85115 80603 86623 90308 64483 56961 61545 61392 59448 50602 50195 50593 46472 58651 59832 47506
10494 47506 36887 19348 13105 18757 27776 35529 36752 25759 15557 31503 42033 39842 38648
10481 38648 22294 10747 24303 27382 21436 23517 24266 22943 29152 37113 35367 32222 18387 24030
10467 24030 29644 30680 16826 33014 50123 56536 49897 38644 21104 30219 24871 13854 9045
10454 9045 11575 25890 16340 50 52 -16163 -3166 8961 21829 15504 5154 10314 12761 4061
10440 4061 295 8646 -4313 -19089 -15624 -7663 -24994 -33198 -23732 -16256 -1234 -3269 -14094
10427 -14094 -24911 -22426 -33818 -39868 -23767 652 -8567 -11976 -17037 -19773 -7176 915 -5067
10414 -5067 -17728 -23205 -14485 -10029 -6439 4911 -911 -4298 403 11990 9979 11366 793 -11525
$$ packed form
10509H5115m512O020L685k5825p522M584j53j944q846m07L98m121J2179J181j2326
10494D7506j0619j7539o243N652R019P753J223j0993j0202J5946J0530k191j194
10481C8648j6354j1547J3556L079n946K081P49j323O209P961j746l145j3835N643
10467B4030N614J036j3854J6188J7109O413o639j1253j7540R115n348j1017m809
10454I045K530J4315r550j6290Kj6215J2997J2127J2868o325j0350N160K447q700
10440D061l766Q351j2959j4776L465P961j7331q204R466P476J5022k035j0825
10427a4094j0817K485j1392o050J6101K4419r219l409n061k736J2597Q091n982
10414e067j2661n477Q720M456L590J1350n822l387M701J1587k011J387j0573j2318
$$ plain form
10400 -11525 -9846 -14455 -9662 -6463 -6153 -3987 17216 29813 17318 10418 7674 5580 13039 22201
10386 22201 28523 21920 15267 9958 4676 -1051 -3950 6824 4974 6952 1104 985 8372 3014
10372 3014 5085 10842 6002 8135 16449 36412 41610 33213 9492 -9350 -6346 4456 13716 8093
10358 8093 10760 22087 24958 16287 3766 1796 3192 3406 -1171 -11634 -16372 -16489 -8056 918
10344 918 -6796 6527 3099 -4818 -17431 -19276 -30553 -34999 -18951 -4885 -381 -1909 11750
10331 11750 28152 11441 9424 10886 5890 8019 -1582 3623 7163 -438 -6711 -6183 -6704 -15735
10317 -15735 -19563 -17010 -17575 -17008 -16231 -7718 736 16721 37307 37213 24337 9853 -2688 -15459
10303 -15459 -5225 -4094 -6777 -16932 -18859 -11200 6606 -654 -9384 -4417 9832 1989 -3264
$$ packed form
10400a1525J679m609M793L199L10K166K1203J2597j2495o900k744k094P459R162
10386B2201O322o603o653n309n282n727k899J0774j850J978n848j19P387n358
10372C014K071N757m840K133Q314J9963N198q397k3721j8842L004J0802R260n623
10358H093K667J1327K871q671j2521j970J396K14m577j0463m738j17Q433Q974
10344I18p714J3323l428p917j2613j845j1277m446J6048J4066M504j528J3659
10331A1750J6402j6711k017J462m996K129r601N205L540p601o273N28n21r031
10317a5735l828K553n65N67P77Q513Q454J5985K0586r4j2876j4484j2541j2771
10303a5459J0234J131k683j0155j927P659J7806p260q730M967J4249p843n253
$$ plain form
10290 -3264 5101 -1803 -19362 -19701 11122 19306 17433 4878 -6244 -15054 -8801 -1764 -9156 -13502
10276 -13502 -12500 775 8195 7420 5992 15549 21245 11238 5891 -4848 -11950 -5305 -6641 -9821
10262 -9821 -4628 -2403 661 4525 1340 4532 185 -5246 -6600 15226 30865 21151 8695 -546
10248 -546 1116 4227 4778 344 -6512 -7274 -3334 6707 9416 12560 -4560 -18653 -36093 -40386
10234 -40386 -27367 -24258 -28114 -19705 -15013 -17642 -23088 -15739 -23234 -24884 -8378 -4854 -19481 -18296
10220 -18296 -13407 -640 19264 23246 15632 15314 24437 20106 12654 9113 5552 -6249 -14295 -11049
10206 -11049 -18578 -4568 -3131 -3897 -6400 -1496 -4020 -15004 -12548 1616 7193 -15 -19760 -16105
10192 -16105 -6808 -9194 -6857 -6829 -2888 -10222 -11161 -16662 -10468 -8633 -4747 1158 -5807 -4505 -4102
$$ packed form
10290c264Q365o904j7559l39L0823Q184j873j2555j1122q810O253P037p392m346
10276a3502J002J3275P420p75j428R557N696j0007n347j0739p102O645j336l180
10262i821N193K225L064L864l185L192m347n431j354K1826J5639r714j2456r241
10248e46J662L111N51m434o856p62L940J0041K709L144j7120j4093j7440m293
10234d0386J3019L109l856Q409M692k629n446P349p495j650J6506L524j4627J185
10220a8296M889J2767J9904L982p614l18R123m331p452l541l561j1801q046L246
10206a1049p529J4010J437p66k503M904k524j0984K456J4164N577p208j9745L655
10192a6105R297k386K337K8L941p334r39n501O194J835L886N905o965J302M03
$$ plain form
10177 -4102 3814 2303 1527 23777 44756 38067 17621 24091 38473 38858 40771 33379 21464 12323
10163 12323 13301 35192 57428 70150 78916 85544 84866 75086 67417 68075 66988 71544 74297 81977
10149 81977 108062 109827 109349 122185 127113 118987 100097 76604 69780 85776 75326 62804 60947
10136 60947 85771 88453 84101 76550 74858 68409 44046 31134 20757 20321 22841 31374 47398
10123 47398 60859 60827 66530 73459 53069 32572 32772 21680 13276 19341 12503 1644 11593 2557
10109 2557 578 -9256 -4176 -7108 -15952 -4088 -24 3597 3649 4157 -2729 -6733 -8032 5762 1621
10094 1621 -6976 -11412 -3462 -4539 -5986 -20212 -27006 -23857 -1856 11140 1843 -3424 -18915 -16253
10080 -16253 -3960 -8768 -91 2333 -3736 -5496 1853 13919 21124 16075 3000 -222 1336 3333
$$ packed form
10177d102P916j511p76K2250K0979o689k0446O470J4382L85J913p392j1915r141
10163A2323R78K1891K2236J2722Q766O628o78r780p669O58j087M556K753P680
10149H1977K6085J765m78J2836M928q126j8890k3493o824J5996j0450j2522j857
10136F0947K4824K682m352p551j692o449k4363j2912j0377m36K520Q533J6024
10123D7398J3461l2N703O929k0390k0497K00j1092q404O065o838j0859R949r036
10109B557j979r834N080k932q844J1864M064L621N2N08o886m004j299J3794m141
10094A621q597m436P950j077j447j4226o794L149K2001J2996r297n267j5491K662
10080a6253J2293m808Q677K424o069j760P349J2066P205n049j3075l222J558J997
$$ plain form
10066 3333 818 -6492 9034 -1554 -11707 -10247 -3016 12631 581 -11098 -10002 126 -14040
10053 -14040 -8384 -11276 -10026 -14518 -16100 -16002 143 -2403 3008 5620 7418 10402 15637 10809 6559
10038 6559 -1902 -19703 -1531 -222 -4953 -14735 -17875 -13499 -25147 -23402 -17130 -3697 -4129 -18849
10024 -18849 -28397 -29155 -21237 -7662 -8422 -19230 -20194 -20232 -35710 -18411 -10366 -14760 -1920 -1080 -5991
10009 -5991 3819 19990 722 3041 5380 1643 -5783 6780 23107 8293 3188 6798 205
9996 205 -18576 -28144 -13705 1769 4527 2419 241 4085 7566 19101 19416 11756 6594 -3810
9982 -3810 23 2344 9202 18758 9099 6694 -6687 -13315 5281 -4926 -14979 -9051 -4858 8354
9968 8354 12357 7026 5206 -4521 5736 12040 2154 1185 -12469 -16058 -7105 5660 19730 13748
$$ packed form
10066C333k515p310J5526j0588j0153J460P231J5647j2050j1679J096J0128j4166
10053a4040N656k892J250m492j582R8J6145k546N411K612J798K984N235m828m250
10038F559q461j7801J8172J309m731r782l140M376j1648J745O272J3433m32j4720
10024a8849r548p58P918J3575p60j0808r64l8j5478J7299Q045m394J2840Q40m911
10009e991R810J6171j9268K319K339l737p426J2563J6327j4814n105L610o593
9996B05j8781r568J4439J5474K758k108k178L844L481J1535L15p660n162j0404
9982c810L833K321O858R556r659k405j3381o628J8596j0207j0053N928M193J3212
9968H354M003n331j820r727J0257O304r886r69j3654l589Q953J2765J4070n982
$$ plain form
9954 13748 9879 13652 8784 12673 1937 13509 17738 7073 2513 13559 10639 -2010 -14808
9941 -14808 -18755 -20229 2656 4408 3642 -4097 -23592 -24582 -14942 -4207 -2192 -15239 -17342 -16114
9927 -16114 -16798 -11930 -2866 7959 16440 15972 26561 29274 42093 42037 26070 13596 2613 -12364
9913 -12364 -8014 -10157 1777 10064 16504 18266 12448 7963 -212 7282 4727 819 -9329 -15700
9899 -15700 -11712 -8143 -10487 -7467 -3483 8595 8986 12435 21570 22681 12879 17666 19104 20331 21371
9884 21371 29567 27786 15674 -3968 -16698 -17036 -16555 -21533 -22475 -22632 -40442 -44175 -34500 -19821
9870 -19821 -9054 -2549 19173 12152 -19470 -21629 -10708 63 10538 7564 -10044 -29372 -23818
9857 -23818 -15828 -13886 1183 -1829 2739 1678 5355 -682 -9662 1023 1533 -5827 4054 15227
$$ packed form
9954A3748l869L773m868L889j0736J1572M229j0665m560J1046k920j2649j2798
9941a4808l947j474K2885J752p66p739j9495r90R640J0735K015j3047k103J228
9927a6114o84M868R064J0825Q481m68J0589K713J2819n6j5967j2474j0983j4977
9913a2364M350k143J1934Q287O440J762n818m485q175P494k555l908j0148o371
9899a5700L988L569k344L020L984J2078L91L449R135J111r802M787J438J227J040
9884B1371Q196j781j2112j9642j2730l38M81m978r42j57j7810l733R675J4679
9870a9821J0767O505K1722p021l1622k159J0921J0771J0475k974j7608j9328N554
9857b3818P990J942J5069l012M568j061L677o037q980J0685N10p360R881J1173
$$ plain form
9843 15227 17019 5797 -6316 -8114 707 -13912 -28279 -12972 1751 -1582 -9461 -12862 -7134
9830 -7134 -3856 -5718 -23084 -15601 -12979 500 2459 -5028 -9262 -19838 -35672 -31048 -18921 -15666
9816 -15666 -1266 6575 9186 4344 -2534 -12262 -8645 -6770 -10017 -20492 -14462 -8207 1099 -1459
9802 -1459 -8956 -4922 -6260 -7961 -10789 -7727 -480 8775 15067 3405 -7499 -3903 -425 7257
9788 7257 14419 13119 10240 -6738 -7280 -4176 -13138 -14749 -9752 -3895 -1223 7123 2091 13426 18299
9773 18299 9277 -17025 -26036 -3115 632 -51 -6188 -4650 -9434 -11694 882 -4669 -3144 -1935
9759 -1935 3574 11346 8498 -2672 6396 16856 9451 4377 3503 3942 3519 4835 -1937 -5220 -10592
9744 -10592 -11435 -11504 -11490 -6565 14692 18885 11250 10551 5819 10740 5698 7413 6980 22991 15347 6545
$$ packed form
9843A5227J792j1222j2113j798Q821j4619j4367J5307J4723l333p879l401N728
9830g134L278j862j7366P483K622J3479J959p487m234j0576j5834M624J2127L255
9816a5666J4400P841K611m842o878r728L617J875l247j0475O030O255R306k558
9802a459p497M034j338j701k828L062P247R255O292j1662j0904L596L478P682
9788G257P162j300k879j6978n42L104q962j611M997N857K672Q346n032J1335M873
9773A8299r022k6302r011K2921L747o83o137J538m784k260J2576n551J525J209
9759a935N509P772k848j1170R068J0460p405n074q74M39m23J316o772l283n372
9744a0592q43o9J4M925K1257M193p635o99m732M921n042J715m33J6011p644q802
$$ plain form
9728 6545 -2256 -11652 -5945 7950 4148 10845 -4726 -23481 -23641 -32435 -21525 -9079 -8424 2996
9714 2996 7072 -12 1710 1408 -9503 -8109 -11318 -31081 -28121 -37434 -34742 -11957 -2850 -1510
9700 -1510 -10187 -6848 4541 16044 9529 -2192 -7408 -13237 -15278 1108 -3804 -6612 -8246 -17235
9686 -17235 -13464 -5446 3855 3516 -3338 -13478 -11215 -2486 11154 12311 5495 -8287 -16627 -15188
9672 -15188 -6624 -2446 7254 23417 24763 17589 -9262 -23790 -28099 -25880 -31998 -37370 -29629 -21501
9658 -21501 -21088 -15132 2967 13315 14521 13428 12046 5835 4040 1610 4692 16268 19234 37560
9644 37560 65207 72403 71985 70510 57627 37893 29158 37362 42840 28842 4252 -4934 -1993 13999
9630 13999 13025 8360 2970 3126 11144 11917 11666 18892 20910 14388 10135 13666 4960 -11147 -480
$$ packed form
9728F545q801r396N707J3895l802O697j5571j8755j60q794J0910J2446O55J1420
9714B996M076p084J722l02j0911J394l209j9763K960r313K692K2785R107J340
9700a510q677L339J1389J1503o515j1721n216n829k041J6386m912k808j634q989
9686a7235L771Q018R301l39o854j0140K263Q729J3640J157o816j3782q340J439
9672a5188Q564M178R700J6163J346p174k6851j4528m309K219o118n372P741Q128
9658b1501M13N956J8099J0348J206j093j382o211j795k430L082J1576K966J8326
9644C7560K7647P196m18j475j2883j9734q735Q204N478j3998k4590r186K941J5992
9630A3999r74m665n390J56Q018P73k51P226K018o522m253L531q706j6107J0667
$$ plain form
9615 -480 10330 2070 2042 14059 20574 16947 7793 7348 5131 -5064 7140 4689 -108 6072 17657
9600 17657 14296 2990 -5257 -2001 2000 4712 -1817 3662 17903 2209 -15444 -4869 16031
9587 16031 23485 10996 1107 -6872 -10162 -3654 -19017 -15834 -8252 8838 2383 -13464 -27532
9574 -27532 -29125 -17128 -29951 -18543 11 -14674 -11746 -2494 10180 1802 -7336 -10277 -14877
9561 -14877 -22287 -17793 -7016 -1233 14883 16092 2061 -1337 17374 7356 -7416 -4607 -10406
9548 -10406 943 4896 8653 17412 24895 17957 12566 8588 3014 -2467 -2363 6099 15979 11405 171
9533 171 -11000 -20037 -25247 -23869 -14138 -9244 -1486 2176 -2161 499 -7298 3129 -8250 -12234
9519 -12234 -16242 -18461 -13498 -8815 -6580 -878 259 789 -6925 -8153 -16332 -16671 -13920 -16234 -15566
$$ packed form
9615d80J0810q260k8J2017O515l627r154m45k217j0195J2204k451m797O180J1585
9600A7657l361j1306q247L256M001K712o529N479J4241j5694j7653J0575K0900
9587A6031P454j2489r889p979l290O508j5363L183P582J7090o455j5847j4068
9574b7532j593J1997j2823J1408J8554j4685K928R252J2674q378r138k941m600
9561a4877p410M494J0777N783J6116J209j4031l398J8711j0018j4772K809n799
9548a0406J1349L953L757Q759P483o938n391l978n574n481J04Q462R880m574j1234
9533A71j1171r037n210J378R731M894P758L662m337K660p797J0427j1379l984
9519a2234m008k219M963M683K235N702J137N30p714j228q179l39K751k314O68
$$ plain form
9504 -15566 -16143 -7564 -4058 15878 17396 952 -2624 1252 -5692 -8187 -19916 -25296 -28760 -32592
9490 -32592 -23416 -22377 -19753 -15321 -3861 1387 -13749 -20688 -6063 6693 15196 7786 8273 -2123
9476 -2123 -7487 7645 12502 -8511 -31629 -27421 -25730 -19242 -7383 771 3103 1306 -8735 -4851
9462 -4851 -7848 -13143 -13686 -469 -1420 490 5026 11775 4732 1452 -4529 -12793 -12976 -6481 -1504
9447 -1504 -16178 -27593 -22678 -6553 -3915 -16189 -6518 13856 20144 9626 -11237 -19705 -25032
9434 -25032 -25617 -13120 -16207 -8645 3203 11721 -5542 -14217 2067 5116 4978 -7624 -6723 -1153
9420 -1153 -14527 -9725 6830 11299 16008 8343 -20500 -36150 -35201 -19813 -3485 3774 13593 17142
9406 17142 19432 16075 5873 19577 19567 9932 11634 17822 14128 -2291 -14154 -13159 -4241 11665
$$ packed form
9504a5566n77Q579L506J9936J518j6444l576L876o944k495j1729n380l464l832
9490c2592R176J039K624M432J1460N248j5136o939J4625J2756Q503p410M87j0396
9476b123n364J5132M857k1013k3118M208J691O488J1859Q154K332j797j0041L884
9462d851k997n295n43J3217r51J910M536O749p043l280n981q264j83O495M977
9447a504j4674j1415M915J6125K638j2274R671K0374O288j0518k0863q468n327
9434b5032n85J2497l087P562J1848Q518j7263q675J6284L049j38j2602R01N570
9420a153j3374M802J6555M469M709p665k8843j5650R49J5388J6328P259R819L549
9406A7142K290l357j0202J3704j0r635J702O188l694j6419j1863R95Q918J5906
$$ plain form
9392 11665 7612 -3177 -13372 -17455 -19089 -24863 -10544 -7822 2512 -786 -5058 -9621 -11304 -19022
9378 -19022 -7279 -7229 -3125 9896 14755 7609 -247 1457 7389 8033 6341 -10093 1141 21621
9364 21621 2661 -10252 -10322 -11956 -14996 -14546 -21111 -18040 -11825 -13038 -18750 -3976 3368 -11187
9350 -11187 -18008 -10803 -13634 -19293 -34589 -36833 -33707 -39404 -44967 -20185 -7983 -11668 -5003 788
9336 788 -117 -4754 -4265 -4202 -4323 -16501 -17190 -6632 -1177 4287 -8979 1071 13901 22452 13737
9321 13737 -1405 1787 -1306 2743 7441 25377 18554 414 -6599 -11912 -26343 -27681 -23023 -9134
9307 -9134 1844 4341 1192 7324 -3582 763 8004 -5038 -10524 -10512 -8138 -5066 1326 3458 -396
9292 -396 13287 17371 13099 9317 -5125 -7556 -8603 6645 11376 4690 -9123 -16790 -17589 -17198 -7764
$$ packed form
9392A1665m053j0789j0195m083j634n774J4319K722J0334l298m272m563j683p718
9378a9022J1743N0M104J3021M859p146p856J704N932O44j692j6434J1234K0480
9364B1621j8960j2913p0j634l040M50o565L071O215j213n712J4774P344j4555
9350a1187o821P205k831n659j5296k244L126n697n563K4782J2202l685O665N791
9336G88r05m637M89O3j21j2178o89J0558N455N464j3266J0050J2830Q551q715
9321A3737j5142L192l093M049M698J7936o823j8140p013n313j4431j338M658J3889
9307i134J0978K497l149O132j0906M345P241j3042n486J2K374L072O392K132l854
9292c96J3683M084m272l782j4442k431j047J5248M731o686j3813p667p99L91R434
$$ plain form
9277 -7764 -3911 577 -3994 1465 5510 -2780 -20359 -29922 -23277 -30142 -33304 -24461 -23902 -28848 -23138
9262 -23138 844 6239 6143 -29 -15154 -35176 -39290 -24165 -7885 9673 13356 7295 -14773
9249 -14773 -20434 -33020 -39239 -34702 -21055 -7062 8180 12959 7063 4922 2393 7015 13837 20266
9235 20266 20540 25122 26709 18604 8724 7561 3306 -11370 -16701 -5868 8672 17025 9916 -3416
9221 -3416 7743 9934 9270 7514 13687 15622 10141 -7055 -10492 -9214 -20011 -20357 -20266 -35692 -46787
9206 -46787 -31305 -16556 -21784 -21386 -17924 -18404 -19606 -14764 -14761 -7159 -28 -8575 -18178 -9738 3957
9191 3957 14500 6153 3909 3545 -7264 -13058 -31813 -45813 -41069 -21032 -21257 -33205 -32084 -12873
9177 -12873 -6292 -19521 -18333 411 1199 4892 7526 398 3199 4546 -5820 -19857 -23653 -30585
$$ packed form
9277g764L853M488m571N459M045q290j7579r563O645o865l162Q843N59m946N710
9262b3138K3982N395r6o172j5125k0022m114J5125J6280J7558L683o061k2068
9249a4773n661j2586o219M537J3647J3993J5242M779n896k141k529M622O822O429
9235B0266K74M582J587q105r880j163m255j4676n331J0833J4540Q353p109j3332
9221c416J1159K191o64j756O173J935n481j7196l437J278j0797l46R1j5426j1095
9206d6787J5482J4749n228L98L462m80j202M842LP602P131q547r603Q440J3695
9191C957J0543q347k244l64j0809n794j8755j4000M744K0037k25j1948J121J9211
9177a2873O581j3229J188J8744P88L693K634p128K801J347j0366j4037l796o932
$$ plain form
9163 -30585 -10652 -7916 -8465 -5190 -6836 -2096 10728 4729 962 19077 22653 18804 13640 974
9149 974 -5019 -2012 -14775 -10311 -10629 -16048 -10663 -1764 -5045 -11345 -22644 -26353 -25049 -3683 3947
9134 3947 3222 3980 -834 -8263 1852 5387 -2222 -19172 -11394 -9725 -11002 -14772 6371 16919
9120 16919 23048 16822 10507 -258 -16947 -16032 -3207 6576 -11751 -4807 10004 18191 15177 19907
9106 19907 5944 697 12766 10942 -1900 -337 -2613 2952 2891 7770 -5583 2205 21697 19125
9092 19125 -5159 -18663 -15439 -6135 -10359 -6104 -2688 -15352 -24054 -20178 -14466 -8032 -2806 2942
9078 2942 -1095 -430 15645 2442 -11896 -20914 -33955 -32790 -27561 -28723 -24716 -22187 -11793 -1906
9064 -1906 -4802 -17259 -17709 -17981 -17249 -2446 1038 -2592 5559 -4680 -19626 -14922 -4505 -1830
$$ packed form
9163c0585J9933K736n49L275j646M740J2824n999l767J8115L576l849n164j2666
9149I74n993L007j2763M464l18n419N385Q899l281o300j1299l709J304K1366P630
9134C947p25P58m814p429J0115L535p609j6950P778J669j277l770K1143J0548
9120A6919O129o226o315j0765j6689R15J2825R783j8327O944J4811Q187l014M730
9106A9907j3963n247J2069j824j2842J563k276N565o1M879j3353P788J9492k572
9092A9125k4284j3504L224R304m224M255L416j2664q702L876N712O434N226N748
9078B942m037O65J6075j3203j4338r018j3041J165N229j162M007K529J0394R887
9064a906k896j2457m50k72P32J4803L484l630Q151j0239j4946M704J0417K675
$$ plain form
9050 -1830 -2416 4967 2094 -2751 462 11896 5371 -417 -7578 -3393 3980 15516 21200 -3485
9036 -3485 -18356 -22042 -13690 -14315 -21461 -27149 -24896 -2229 15833 23286 20564 17321 5585 12416
9022 12416 14109 4654 -10927 -14652 1910 13788 11766 13850 9316 6037 -9019 -12514 -22165 1021
9008 1021 7064 -3837 -5146 3775 2589 -645 -5359 -4113 -206 3203 5977 4584 8317 8259 4313
8993 4313 3140 -3123 -14015 -15853 -5541 5956 14816 8111 5396 3051 4353 18859 10212 728
8979 728 2357 10451 15264 21489 9198 4169 -301 1322 714 3451 14491 16473 3042 6961 4319
8964 4319 -4994 -4852 -4985 -5003 -17149 -12032 -5247 -7332 -14285 -13005 -11628 -1615 -932 6334 7639 6689
8948 6689 2156 2311 -7955 -13544 -15511 -14106 -1582 -11031 -15446 -9976 -3568 -1617 154 1618 -6442
$$ packed form
9050a830n86P383k873m845L213J1434o525n788p161M185P373J1536N684k4685
9036c485j4871l686Q352o25p146n688K253K2667J8062P453k722l243j1736O831
9022A2416J693r455j5581l725J6562J1878k022K084m534l279j5056l495r651K3186
9008A021O043j0901j309Q921j186l234m714J246L907L409K774j393L733n8l946
8993D313j173o263j0892j838J0312J1497Q860o705k715k345J302J4506q647r484
8979G28J629Q094M813O225j2291n029m470J623o08K737J1040J982j3431L919k642
8964D319r313J42j33j8j2146N117O785k085o953J280J377J0013O83P266J305r50
8948F689m533J55j0266n589j967J405J2524r449m415N470O408J951J771J464q060
$$ plain form
8933 -6442 -6491 -8130 -9234 -9270 -10157 -18817 -3351 9239 14170 10139 15881 11037 15306 642 -13145
8918 -13145 -3228 8924 17637 14558 5891 -6915 -9897 -15431 -14358 -12517 -7773 -10400 -4188 -7795
8904 -7795 -9259 4817 2048 -4603 -4210 5472 684 241 5763 1555 -10004 5025 24128 25310
8890 25310 13713 12611 2036 -18926 -35190 -39928 -8865 12816 17834 27310 17907 9282 7440
8877 7440 -14425 -12601 848 5312 9688 18799 16999 16129 17184 20101 11519 -873 -10944 -21224
8863 -21224 -15814 -19674 -13542 -10036 -11261 -20078 -17130 -5192 2617 3507 -3672 4970 8916 -15410
8849 -15410 -29909 -16866 -5166 -12164 -6540 -5613 -5586 -3000 -1689 1710 12280 2002 8062 9303
8835 9303 -22619 -25466 381 14464 12517 504 668 -512 12789 13072 -2905 -20982 -31213
$$ packed form
8933f442m9j639j104l6q87q660J5466J2590M931m031N742m844M269j4664j3787
8918a3145R917J2152Q713l079q667j2806k982n534J073J841M744k627O212l607
8904g795j464J4076k769o651L93R682m788m43N522m208j1559J5029J9103J182
8890B5310j1597j102j0575k0962j6264m738L1063K1681N018R476r403q625j842
8877G440k1865J824J3449M464M376R111j800q70J055K917q582j2392j0071j0280
8863b1224N410l860O132L506j225q817K948J1938P809Q90p179Q642L946k4326
8849a5410j4499J3043J1700o998N624R27K7K586J311L399J0570j0278O060J241
8835I303l1922k847K5847J4083j947j2013J64j180J3301K83j5977j8077j0231
$$ plain form
8822 -31213 -13012 -512 -1471 -3194 2091 -2755 -5814 -3610 2102 -4262 -507 -9691 -6636 282
8808 282 11310 11450 14975 13043 6185 3758 13890 15063 2737 146 8382 8975 8910 8884 -4462 -5079
8792 -5079 -628 -6541 -11184 -6196 -20306 -23928 -23077 -12987 -9352 436 -4183 -11794 -18342 -16314 -3131
8777 -3131 1492 -230 -843 8079 1365 -11236 -6576 -11976 -6906 -2100 -5022 -1703 -9957 -10091 598
8762 598 20294 28479 15782 15491 18156 14257 8558 2943 8084 7309 966 -10814 -23805 -21464 -9127
8747 -9127 -9101 -13970 -7917 -3627 4661 9927 6990 1567 -5219 -9382 6549 6280 1169 -7756 -10109
8732 -10109 6684 -567 -4844 -4955 5097 7091 4389 7963 8908 22991 29620 26312 6074 -7585
8718 -7585 -10173 -5787 -3845 -8275 3650 -507 5812 15888 12509 15017 9095 8093 2222 2870 -7183
$$ packed form
8822c1213J8201J2500r59j723N285m846l059K204N712o364L755r184L055O918
8808B82J1028J40L525j932o858k427J0132J173j2326k591Q236N93o5k6j3346o17
8792e079M451n913m643M988j4110l622Q51J0090L635R788m619p611o548K028J3183
8777c131M623j722o13Q922o714j2601M660n400N070M806k922L319q254j34J0689
8762E98J9696Q185j2697k91K665l899n699n615N141p75o343j1780j2991K341J2337
8747i127K6m869O053M290Q288N266k937n423o786m163J5931k69n111q925k353
8732a0109J6793p251m277j11J0052J994k702L574R45J4083O629l308k0238j3659
8718g585k588M386J942m430J1925m157O319J0076l379K508n922j002n871O48j0053
$$ plain form
8703 -7183 -2460 15235 14571 -3569 -10402 -10374 -142 9878 1453 1501 -2168 -7558 46 8501 18266
8688 18266 12484 10793 15568 19061 19070 23165 24710 4424 -3940 -9464 -2055 9283 11204 3257 14272
8673 14272 20799 18523 4488 -2539 3703 13590 3757 -2329 -6675 -6900 -13278 -9133 3177 7076
8659 7076 11309 3490 -948 -6441 -2016 6465 5573 7869 6091 16684 14389 2868 10476 240
8645 240 -6005 -6550 -15063 -20343 -32090 -35095 -27813 -18626 -9241 3360 -4397 -2465 -7542 -5933 -10750
8630 -10750 4737 5787 9278 14742 20720 19541 30650 32654 27047 6743 -6636 1981 9238 13631
8616 13631 14901 8826 6794 11734 -466 6597 4202 12765 28723 21798 7017 10471 9878 11355
8602 11355 13271 9866 13494 30718 36277 33140 40413 39709 23096 28075 38880 32829 27020 15924
$$ packed form
8703g183M723J7695o64j8140o833K8J0232J0020q425M8l669n390P604Q455R765
8688A8266n782j691M775L493RM095J545k0286q364n524P409J1338J921p947J1015
8673A4272O527k276j4035p027O242R887r833o086m346k25o378M145J2310L899
8659G076M233p819m438n493M425Q481q92K296j778J0593k295j1521P608j0236
8645B40o245n45q513n280j1747l005P282R187R385J2601p757J932n077J609m817
8630a0750J5487J050L491N464N978j179J1109K004n607k0304j3379Q617P257M393
8616A3631J270o075k032M940j2200P063k395Q563J5958o925j4781L454n93J477
8602A1355J916l405L628J7224N559l137P273p04j6613M979J0805o051n809j1096
$$ plain form
8588 15924 -12074 -30029 -16816 -5486 -2741 -2637 -4639 -4525 -5499 -1000 2467 7604 9851 11228
8574 11228 13859 10764 8227 5536 11404 26770 39938 34874 23257 26834 26443 17143 27799 31314
8560 31314 48007 41153 36760 28332 8235 -5818 20679 23352 18917 7766 5856 -7474 -17211
8547 -17211 -15981 -7257 -11997 -7 -6728 -17646 -15255 -10171 -4237 3387 891 -7358 -16802 -4504
8533 -4504 11657 19164 15222 26106 14260 -21010 -20821 -5157 -290 -7244 -6169 4111 13192 24438
8519 24438 20865 5542 14049 20672 13862 8158 12979 11918 13934 18702 10731 2958 18091 11540
8505 11540 12975 2904 -3467 3770 25277 23168 -422 -5811 -6754 -8492 -12577 -11281 -749 -11214
8491 -11214 -5332 -8717 -19684 -34820 -40569 -33775 -13164 -8163 -10798 3044 14105 19702 10353
$$ packed form
8588A5924k7998j7955J3213J1330K745J04k002J14r74M499L467N137K247J377
8574A1228K631l095k537k691N868J5366J3168n064j1617L577l91r300J0656L515
8560C1314J6693o854m393q428k0097j4053K6497K673m435j1151j910j3330r737
8547a7211J230Q724m740J1990o721j0918K391N084N934P624k496q249r444J2298
8533d504J6161P507l942J0884j1846l5270J89J5664M867o954J075J0280R081J1246
8519B4438l573j5323Q507O623o810n704M821j061K016M768p971p773J5133o551
8505A1540J435j0071o371P237K1507k109k3590n389r43j738m085J296J0532j0465
8491a1214N882l385j0967j5136n749O794K0611N001k635J3842J1061N597r349
$$ plain form
8478 10353 11630 10763 8884 12744 16386 16577 4196 -5664 -5126 -22842 -33327 -20958 -14497 -16314
8464 -16314 -16172 139 9540 1780 8079 7424 12556 5245 -11434 -27788 -21221 -17856 -17242 -20254 -15143
8449 -15143 728 -611 2656 3154 2459 1296 -3533 -11292 14197 28353 30372 24202 12217 6531
8435 6531 21891 28768 34876 34286 35212 4671 -5099 10976 10051 14651 22856 13872 15989 13720 6496
8420 6496 -1551 -7773 -3813 18142 28106 23333 17442 8699 9697 2731 3562 2 -11300 -1441 -814
8405 -814 580 -21035 -15986 -12582 3060 9154 3423 -5244 -8564 9028 12766 13297 1289 -1564
8391 -1564 -9738 -7768 -3211 13694 24359 44935 63579 82127 92695 89803 89389 77704 65566
8378 65566 48562 48334 35182 18746 5036 4589 664 1586 -5485 -4026 -22296 -16656 -8373 -12314
$$ packed form
8478A0353J277q67j879L860L642J91j2381r860N38j7716j0485J2369O461j817
8464a6314J42J6311R401p760O299o55N132p311j6679j6354O567L365O14l012N111
8449a5143J5871j339L267M98o95j163m829p759K5489J4156K019o170j1985n686
8435F531J5360O877O108n90R26l0541r770J6075r25M600Q205q984K117k269p224
8420F496q047o222L960K1955R964m773n891q743R98o966Q31l560j1302R859O27
8405h14J394k1615N049L404J5642O094n731q667l320J7592L738N31j2008k853
8391a564q174J970M557J6905J0665K0576J8644J8548J0568k892m14j1685j2138
8378F5566j7004k28j3152j6436j3710m47l925R22p071J459j8270N640Q283l941
$$ plain form
8364 -12314 -10503 -11559 -9846 -17114 -14108 -1835 18292 40807 38773 27008 18868 14673 12338 18790
8350 18790 21261 12023 228 -5277 -10841 -9562 412 12905 44137 85541 153925 195894 189355
8337 189355 152838 100576 55277 41060 40256 37218 36906 42189 33356 19482 15912 16208 17607 22242
8323 22242 20363 16233 20146 13943 9803 5863 -2721 -2927 36 6942 4391 5408 8163 8437 20234
8308 20234 25516 14328 13850 4635 3062 3401 -11207 -12644 -14624 -12515 4159 38204 52803 62685
8294 62685 68068 60098 53545 39322 29592 41318 45048 28911 32946 36504 27747 26321 24318 10037
8280 10037 587 -6052 -3125 -3712 -19916 -17895 -11349 -1028 2486 -11832 -5236 9888 3856 7998
8266 7998 12113 4481 5913 8634 10935 27093 29818 5753 -18904 -12015 15127 29495 28943 20865
$$ packed form
8364a2314J811j056J713p268L006J2273K0127K2515k034j1765q140m195k335O452
8350A8790K471r238j1795n505n564J279R974J2493L1232M1404O8384M1969o539
8337A89355l6517n2262m5299j4217q04l038l12N283q833j3874l570K96J399M635
8323B2242j879m130L913o203m140l940q584k06K963O906k551J017K755K74J1797
8308B0234N282j1188m78r215j573L39j4608j437j980K109J6674L4045J4599R882
8294F2685N383p970o553j4223r730J1726L730j6137M035L558q757j426k003j4281
8280A0037r450o639K927n87j6204K021O546J0321L514j4318O596J5124o032M142
8266G998M115p632J432K721K301J6158K725k4065k4657O889K7142J4368n52q078
$$ plain form
8252 20865 3364 -11896 -17231 -19452 -11446 -5185 13670 24150 29767 22277 23236 19910 5922 -17394
8238 -17394 -9054 -3557 13143 174 -8360 -10030 -7328 -7417 -18868 -13272 13144 19432 18295 12626
8224 12626 -2888 5065 10850 9541 13141 11306 3251 -1513 -13972 -10189 9575 19992 7563
8211 7563 -4108 -17182 -7799 -10246 -6374 -2749 -1857 1690 -10076 -8064 -479 328 -10274 -26954
8197 -26954 -31954 -16590 21675 29164 19266 7883 2490 13312 20935 20237 35400 38113 34675 18866
8183 18866 -1404 -3359 -2466 -5929 -17033 -26908 -20898 -11289 -11327 -17101 -28723 -31562 -18060 -9983
8169 -9983 -13467 -8857 -19823 -26862 -27753 -28933 -25872 -15745 -5373 -7875 -10928 -11305 -13000 -13654 -5977
8154 -5977 -6700 -16358 -16168 -4582 4550 4116 -15883 -8781 1089 1945 -2291 -14196 -4644 8091 2731
$$ packed form
8252B0865j7501j5260n335k221Q006O261J8855J0480N617p490R59l326j3988k3316
8238a7394Q340N497J6700j2969q534j670K702q9j1451N596K6416O288j137n669
8224A2626j5514P953N785j309L600j835q055m764j2459L783J9764J0417j2429
8211G563j1671j3074R383k447L872L625Q92L547j1766K012P585Q07j0602j6680
8197b6954n000J5364L8265P489r898j1383n393J0822P623o98J5163K713l438j5809
8183A8866k0270j955Q93l463j1104r875O010R609l8n774j1622k839J3502Q077
8169i983l484M610j0966p039q91j180L061J0127J0372k502l053l77j695o54P677
8154e977p23r658J90J1586R132m34j9999P102R870Q56m236j1905R552J2735n360
$$ plain form
8139 2731 9479 -3835 -3304 -4396 -6184 -2366 7862 11127 9827 -9306 -17775 -16758 -18253 -11580
8125 -11580 -1887 -4287 -9632 -18663 -13980 -27992 -21024 -1852 6235 6077 5910 6070 7329 870 -16089
8110 -16089 -5678 3484 -7043 -17824 -3055 -11614 -12619 -454 486 -6242 -9076 -6220 -9779 -19929
8096 -19929 -17807 -5137 6384 -17117 -27523 -9710 -11253 -27299 -9913 13868 14989 9061 14005
8083 14005 10064 7698 1984 -13319 1145 6175 -8011 -16599 -22975 -16181 -9026 -22082 -11004
8070 -11004 13336 6915 -3272 -2617 -1208 3161 19722 14267 6291 -14624 -39752 -43730 -27559
8057 -27559 -13502 -11430 -10436 -5912 5119 -5984 -9885 -1267 18700 26138 21777 3104 -530 7871
8043 7871 25598 33939 15704 4386 -2565 -19677 -13427 -1616 -5367 -7941 -4742 -3775 3755 8238
$$ packed form
8139B731O748j3314N31j092j788L818J0228L265j300j9133q469J017j495O673
8125a1580R693k400n345r031M683j4012O968J9172Q087j58j67J60J259o459j6959
8110a6089J0411R162j0527j0781J4769q559j005J2165R40o728k834K856l559j0150
8096a9929K122J2670J1521k3501j0406J7813j543j6046J7386K3781J121n928M944
8083A4005l941k366n714j5303J4464N030j4186q588o376O794P155j3056J1078
8070a1004K4340o421j0187O55J409M369J6561n455p976k0915k5128l978J6171
8057b7559J4057K072R94M524J1031j1103l901Q618J9967P438m361j8673l634Q401
8043G871J7727Q341j8235j1318o951j7112O250J1811l751k574L199R67P530M483
$$ plain form
8029 8238 2644 -9530 -20613 -13575 -12633 -11398 -9313 -1403 -7096 4345 18616 23035 31399 23321
8015 23321 22323 14589 -5345 -16947 -12173 -12763 1494 1995 -11693 -23431 -16160 -16316 -10202 -13359
8001 -13359 -21983 -16934 -10487 -1679 2954 -5861 14353 15456 1484 5530 8105 9682 4684 644
7987 644 10061 24610 27843 21318 16835 14215 17512 14453 9356 -7157 -13585 -3712 -13508 -31099
7973 -31099 -32379 -13328 -5643 10793 14648 21087 20420 11970 7860 -2983 -18657 -21261 -739 3675
7959 3675 1481 11123 12880 14487 8143 7065 16722 12194 20644 30959 39129 37057 20593 12799
7945 12799 14479 19441 409 -17888 -17302 -8779 -4238 7112 572 -6081 389 16483 14548 15327
7931 15327 16831 14197 9651 6247 2911 -10427 -17069 -19034 -23663 -20850 -18096 -25409 -14215 -14648
$$ packed form
8029H238n594j2174j1083P038R42J235K085P910n693J1441J4271M419Q364q078
8015B3321r98p734j9934j1602M774n90J4257N01j3688j1738P271j56O114l157
8001a3359q624N049O447Q808M633q815K0214J103j3972M046K575J577m998m040
7987F44R417J4549L233o525m483k620L297l059n097j6513o428R873r796j7591
7973c1099j280J9051P685J6436L855O439o67q450m110j0843j5674k604K0522M414
7959C675k194R642J757J607o344j078R657m528Q450J0315Q170k072j6464p794
7945A2799J680M962j9032j8297N86Q523M541J1350o540o653O470J6094j935P79
7931A5327J504k634m546l404l336j3338o642j965m629K813K754p313J1194m33
$$ plain form
7917 -14648 -9284 -12565 -8756 -15910 -9363 -2562 15562 10435 14303 22170 13309 -2426 -101 4951
7903 4951 -1131 -8037 -11029 -12385 -7363 5074 5174 7141 1686 -12460 -15910 3980 23004 25498
7889 25498 6525 -4504 -6967 -23603 -27710 -19372 -8233 -4277 2288 7706 816 -6894 7032
7876 7032 21249 20666 14347 -1626 -11996 -7321 145 5103 17055 18624 7121 10730 11994 7420
7862 7420 -2426 -17167 -19770 -19897 -14472 -15088 -6104 8691 21852 26348 25258 26322 24613 23269 21973
7847 21973 26822 21012 22245 22009 13161 2798 -1482 9861 11601 16895 18563 11877 -4758 3745
7833 3745 7480 8090 4414 -8905 -19387 -14922 -2031 10470 57 4305 20427 30180 30076 8684
7819 8684 -8189 -15380 -20532 -11701 -6023 14638 22890 21363 10763 4266 2748 5332 4330 -7936
$$ packed form
7917a4648N364l281L809p154O547O801J8124n127L868P867q861j5735K325N052
7903D951o082o906k992j356N022J2437J00J967n455j4146l450J9890J9024K494
7889B5498j8973j1029k463j6636m107Q338J1139L956O565N418o890p710J3926
7876G032J4217n83o319j5973j0370M675P466M958J1952J569j1503L609J264m574
7862G420r846j4741k603j27N425o16Q984J4795J3161M496j090J064j709j344j296
7847B1973M849n810J233k36q848j0363m280J1343J740N294J668o686j6635Q503
7833C745L735O10l676j3319j0482M465J2891J2501j0413M248J6122R753j04k1392
7819H684j6873p191n152Q831N678K0661Q252j527j0600o497j518K584j002j2266
$$ plain form
7805 -7936 -13029 -4410 3006 1860 -5553 -9827 -5653 -20421 -24720 -20842 -19563 -21749 -21513 -20359 -7962
7790 -7962 -4129 5332 9271 6402 5136 3482 -9327 -12620 -19490 -26558 -26329 -29041 -20128 -18642 -16007
7775 -16007 -11808 -8865 21924 13484 -2694 -13743 -12300 -2337 6505 -1092 -6325 -8487 -8905 -1921
7761 -1921 3642 -4304 1361 1421 -272 11802 16156 16301 24789 22253 12169 12120 12508 156 -2781 -3400
7745 -3400 -5544 -10907 -1724 1597 8055 2031 1676 -15019 -18862 -10977 -6104 -13672 -9874 -13926 -15557
7730 -15557 -5376 -6257 -12675 -10734 -12066 -14377 -1313 6740 1169 -4294 -13575 -14314 -10699 1482
7716 1482 4955 2343 -4283 4832 6273 10195 1389 -5719 -4941 -15057 -18924 -8636 -7657 -1007 -4895
7701 -4895 -9827 -5507 -9098 -13254 -9314 -1697 7641 11794 -2464 -8030 6246 10019 1707 -3918
$$ packed form
7805g936n093Q619P416j146p413m274M174j4768m299L878J279k186K36J154J2397
7790g962L833R461L939k869j266j654j2809l293o870p068K29k712Q913J486K635
7775a6007M199K943L0789q440j6178j1049J443R963Q842p597n233k162m18O984
7761a921N563p946N665O0j693J2074M354J45Q488k536j0084m9L88j2352k937o19
7745c400k144n363R183L321O458o024l55j6695l843P885M873p568L798m052j631
7730a5557J0181q81o418J941j332k311J3064Q053n571n463r281p39L615J2181
7716A482L473k612o626R115J441L922q806p108P78j0116l867J0288R79O650l888
7701d895m932M320l591m156L940P617R338M153j4258n566J4276L773q312n625
$$ plain form
7687 -3918 -951 -5935 -10751 -6660 -8618 2939 -11751 -17793 3524 12447 9389 2577 -16466 -26311
7673 -26311 -18382 -16583 -11430 -387 11259 7469 11888 2418 -2321 -9175 -18741 -27257 -28445 -15630
7659 -15630 -7340 10532 -845 -4512 6989 19397 12443 13509 17558 15140 20743 18455 11980 5844
7645 5844 3892 3557 -13209 -14983 -6238 2652 7316 3908 5612 -4142 -13493 322 12759 12428 2509
7630 2509 -7190 -9764 1803 -13236 -22861 -23200 -17015 -10302 -8507 -6881 5514 6983 7672 466 -14697
7615 -14697 -19075 -10721 -24802 -9974 4920 -1924 2982 7562 -1473 -11413 -16944 -2009 -4565 -3551
7601 -3551 1296 -592 -5819 -1376 -4900 -21612 -30227 -18598 -21001 -21751 -8073 -12609 -13371 -1415
7587 -1415 14899 6802 2401 1296 7451 10050 725 -4316 -14426 -15437 -5287 -4910 3447 1299
$$ packed form
7687c918K967m984m816M091j958J1557j4690o042K1317Q923l058o812j9043r845
7673b6311P929J799N153J1043J1646l790M419r470m739o854r566q516j188J2815
7659a5630Q290J7872j1377l667J1501J2408o954J066M049k418N603k288o475o136
7645E844j952l35j6766j774Q745Q890M664l408J704r754r351J3815J2437l31r919
7630B509r699k574J1567j5039r625l39O185O713J795J626J2395J469O89p206j5163
7615a4697m378Q354j4081J4828J4894o844M906M580r035r940n531J4935k556J014
7601c551M847j888n227M443l524j6712q615J1629k403p50J3678m536p62J1956
7587a415J6314q097m401j105O155K599r325n041j0110j011J0150L77Q357k148
$$ plain form
7573 1299 1770 10615 25903 14064 -6294 -22958 -9222 -13879 -21426 -4239 -962 -16712 -15198
7560 -15198 -5878 1641 4532 15034 4226 -1607 -8618 -1850 11999 8450 -2885 7602 15919
7547 15919 20593 16476 7119 8398 12373 12292 11815 -343 -3866 -9238 -21574 -22825 -17517 -18391 -28139
7532 -28139 -8522 -1630 1668 2977 12666 12376 10600 19663 29934 15829 -4071 -8295 -20623 -10214
7518 -10214 3728 4559 18419 22126 7260 -2361 4505 -336 911 7959 15163 10204 -8142 -6076
7504 -6076 1078 1960 2761 17516 21608 3216 -4708 3340 1309 -1489 -5060 -7793 -15300 -3737 5476
7489 5476 137 3719 -1774 -4664 1028 -277 -3564 -5512 -4919 -8526 7633 21002 26334 18707 2293
7474 2293 -6409 5526 -690 1847 5641 -5249 -1262 634 -11008 -12567 -14278 -9314 -3976 -12160
$$ packed form
7573A299M71Q845J5288j1839k0358j6664J3736m657p547J7187L277j5750J514
7560a5198R320P519K891J0502j0808n833p011O768J3849l549j1335J0487Q317
7547A5919M674m117r357J279L975q1m77j2158l523n372j2336j251N308q74r748
7532b8139J9617O892L298J309R689k90j776R063J0271j4105j9900m224j2328J0409
7518a0214J3942Q31J3860L707j4866r621O866m841J247P048P204m959j8346K066
7504f076P154Q82Q01J4755M092j8392p924Q048k031k798l571k733p507J1563R213
7489E476n339L582n493k890N692j305l287j948N93l607J6159J3369N332p627j6414
7474B293q702J1935o216K537L794j0890L987J896j1642j559j711M964N338q184
$$ plain form
7460 -12160 -11650 -420 -10513 -11453 1521 13539 6096 -5181 1826 -13679 -6638 10596 5171
7447 5171 -11142 -12843 -11533 -374 2951 2900 -5636 -442 4683 -7352 -18070 -4415 -15517 -11820
7433 -11820 1101 -1550 2740 19799 21384 9380 -5140 -10525 7106 2344 -6464 -2054 -1604 12670
7419 12670 5602 -4274 -15109 -22860 -31271 -12909 8242 6433 -3517 -10564 -8967 5564 18865
7406 18865 16324 -4226 -7275 -73 -2623 -15776 -14398 -1812 2791 -14128 -9333 8876 18893
7393 18893 21431 -5916 -16995 -12096 -18011 -14120 -21189 -18231 -11159 11729 14338 1841 -11818
7380 -11818 -17791 -13773 -7050 3054 1573 4328 2810 5543 -1477 1826 6237 5675 1400 -217 -11082
7365 -11082 -23364 -14413 -12809 -16949 -27907 -26050 -24335 -12973 -9479 -13746 -10409 -13362 -1630 -3697
$$ packed form
7460a2160N10J1230j0093r40J2974J2018p443j1277P007j5505P041J7234n425
7447E171j6313j701J310J1159L325n1q536N194N125j2035j0718J3655j1102L697
7433a1820J2921k651M290J7059J585j2004j4520n385J7631m762q808M410M50J4274
7419A2670p068r876j0835p751q411J8362K1151j809r950p047J597J4531J3301
7406A8865k541k0550l049P202k550j3153J378J2586M603j6919M795J8209J0017
7393A8893K538k7347j1079M899n915L891p069K958P072K2888K609j2497j3659
7380a1818n973M018O723J0104j481K755j518K733p020L303M411n62m275j617j0865
7365a1082j2282Q951J604m140j0958J857J715J1362L494m267L337k953J1732k067
$$ plain form
7351 -3697 -16568 -2479 -389 -3127 -12162 -26178 -22232 -4477 892 -9759 -9668 -2382 1079 -395
7337 -395 1903 -4316 4873 14714 15990 18692 27154 25080 12513 16955 12532 -15492 -19217 -26579 -29896
7322 -29896 -32251 -19807 -4883 -6932 -9250 -12214 -2605 11073 3528 -6204 -4909 1188 -10611 -9173
7308 -9173 -15423 -15802 6394 7303 16384 15297 22134 8738 5349 3543 -6753 -7343 -23694 -25973 -18334
7293 -18334 -16757 186 -5591 1140 6155 -1244 -6460 -10225 -1643 -3993 -7632 3427 -6517 -5949
7279 -5949 -3738 -13450 -13981 509 -5732 -10798 -19461 -12364 -4117 -10660 -24467 -28683 -19042 -26130 -22673
7264 -22673 -23163 -24510 -9772 11645 17466 13500 10008 -66 -17802 -27833 -19049 -9557 805
7251 805 13201 25158 16828 4460 1754 6037 -4548 -18606 -14190 -23102 -30986 -13481 800
$$ packed form
7351c697j2871J4089K090k738r035j4016L946J7755N369j0651R1P286L461j474
7337c95K298o219R189R841J276K702Q462k074j2567M442m423k8024l725p362l317
7322b9896k355J2444J4924k049k318k964R609J3678p545r732J295O097j1799J438
7308i173o250l79K2196R09R081j087O837j3396l389j806j0296n90j6351k279P639
7293a8334J577J6943n777O731N015p399n216l765Q582k350l639J1059r944N68
7279e949K211r712n31J4490o241n066q663P097Q247o543j3807m216R641p088L457
7264b2673m90j347J4738K1417N821l966l492j0074j7736j0031Q784R492J0362
7251H05J2396J1957q330j2368k706M283j0585j4058M416q912p884J7505J4281
$$ plain form
7238 800 -9127 -16143 -13614 -19450 -7020 7168 -3523 -17619 -17361 -20742 -10566 2585 10493 4218
7224 4218 -5395 -8724 972 -1423 -22255 -19803 -13416 -4765 -2647 -6682 -1515 1735 6100 -834 -23149
7209 -23149 -13345 -11109 -16729 -17226 -14011 -11625 -12542 -2807 527 2926 8800 7947 -6250 -7836 3997
7194 3997 20475 20881 8287 -3860 -4393 -6194 -1276 3218 2650 -2738 -15205 -11850 -10759 -569
7180 -569 3547 -1771 2301 -1855 -3890 979 -4242 -9140 -21627 -23821 -21979 -14768 -2078 15653
7166 15653 12780 2564 -7024 3748 2048 376 12796 28473 13714 1336 -2440 -4593 -3560
7153 -3560 -10002 -13870 -10243 1584 9072 4958 7251 10659 11885 7086 -8513 -14246 -7208 -15699
7139 -15699 -11426 -5187 4358 12074 15496 15930 16649 14365 9051 5311 2926 4770 9963 1204 -6453
$$ packed form
7238H00r927p016K529n836J2430J4188j0691j4096K58l381J0176J3151P908o275
7224D218r613l329R696k395k0832K452O387Q651K118m035N167L250M365o934k2315
7209b3149R804K236n620m97L215K386r17R735L334K399N874q53j4197j586J1833
7194C997J6478M06j2594j2147n33j801M918M494n68n388j2467L355J091J0190
7180e69M116n318M072m156k035M869n221m898j2487k194J842P211J2690J7731
7166A5653k873j0216r588J0772j700j672J2420J5677j4759j2378l776k153J033
7153c560o442l868L627J1827P488m114K293L408J226m799j5599n733P038q491
7139a5699M273O239R545P716L422M34P19k284n314l740k385J844N193q759p657
$$ plain form
7124 -6453 -6102 -9963 -7643 2001 17648 19769 16492 834 -21320 -40262 -46675 -27980 -9969 -1176
7110 -1176 -12353 -7800 -3523 -9359 -9877 -4660 905 5381 21857 5515 -1082 -4594 -9469 -5199
7096 -5199 -6009 -5881 -14298 -17534 -13263 -6654 5800 2282 -4234 -8244 3147 -5384 -10046 -5744 -1621
7081 -1621 -5897 2839 7279 906 964 -8189 -24799 -23806 -22538 -17835 -13889 -4248 -2165 6269 8027
7066 8027 8426 7517 3951 -96 -15589 -25283 -24860 -13315 -18226 -5364 -629 -13627 -19595 -26335 -25183
7051 -25183 -15469 -16274 -22381 -9449 -6383 -3836 -12248 -4483 -7361 -11746 -8103 8441 8578 10876 14000
7036 14000 8160 10450 14702 12740 831 -913 5398 -1437 -10795 -12032 -24482 -48246 -51661 -34986
7022 -34986 -18168 5026 5370 -4789 -2305 -11395 -759 -2968 1075 5348 4392 8043 -3004 -14795
$$ packed form
7124f453L51l861K320R644J5647K121l277j5658k2154j8942o413J8695J8011Q793
7110a176j1177M553M277n836n18N217N565M476J6476j6342o597l512m875M270
7096e199q10J28q417l236M271O609J2454l518o516m010J1391q531m662M302M123
7081a621m276Q736M440o373N8r153j6610R93J268M703L946R641K083Q434J758
7066H027L99r09l566m047j5493r694M23J1545m911J2862M735j2998n968o740J152
7051b5183R714q05o107J2932L066K547q412P765k878m385L643J6544J37K298L124
7036A4000n840K290M252j962j1909j744O311o835r358j237j2450k3764l415J6675
7022c4986J6818K3194L44j0159K484r090J0636k209M043M273r56L651j1047j1791
$$ plain form
7008 -14795 -10573 -8651 -2750 3091 5604 -7202 -8219 1570 2372 6676 4608 1308 5755 16762
6994 16762 15649 7042 657 -2329 -9055 -14845 -10540 -2628 -8072 -8503 3697 5467 6082 9295 1243
6979 1243 -12292 -8860 -2415 -10460 -13095 -8335 -6179 -4819 507 4848 9682 10358 10904 15129 22954
6964 22954 22227 11247 -3998 -6570 -11152 775 -2135 -114 -3924 -14580 -18715 -11334 -16211 -4024
6950 -4024 8203 12965 1365 -24441 -42496 -43270 -22730 -20072 -11013 -7455 -21419 -38898 -20365
6937 -20365 -13167 -8653 -10038 -6803 -8687 -24777 -28338 -25787 -33717 -24136 -5319 5523 8519 -4117
6923 -4117 1908 3008 -4123 -16905 -18830 -8098 738 -6212 6396 9262 2611 -9299 -9307 -4505 2127
6908 2127 -3355 -13688 -2332 -2772 -19633 -21611 -9743 -1036 5025 -2013 -5122 -3762 -412 -13999
$$ packed form
7008a4795M222J922N901N841K513j2806j017R789Q02M304k068l300M447J1007
6994A6762j113q607o385k986o726n790M305P912n444m31J2200J770O15L213q052
6979A243j3535L432O445q045k635M760K156J360N326M341M834O76N46M225P825
6964B2954p27j0980j5245k572m582J1927k910K021l810j0656m135P381m877J2187
6950d024J2227M762j1600k5806j8055p74K0540K658R059L558j3964j7479J8533
6937b0365P198M514j385L235j884j6090l561K551p930R581J8817J0842K996j2636
6923d117O025J100p131j2782j925J0732Q836o950J2608K866o651j1910qM802O632
6908B127n482j0333J1356m40j6861j978J1868Q707O061p038l109J360L350j3587
$$ plain form
6894 -13999 -595 12470 682 -5522 7578 13021 -3467 -11226 -5441 -4349 -2414 -4529 21990
6881 21990 28138 10556 346 -2965 4379 -497 3080 7608 6288 -3626 8073 17181 15785 9180
6867 9180 -1819 -17146 -21587 -22851 -11199 -13691 -26243 -27609 -13334 -1677 3284 -1398 -8775
6854 -8775 -20766 -17252 -14583 1932 -12483 -23640 -26337 -14309 -4786 -860 1536 -14348 -25047
6841 -25047 -19445 -3144 10613 14276 6450 8941 2074 -2023 9303 12380 11835 -4341 -3787 -12585
6827 -12585 -9510 -6465 -15032 -10228 -10200 -9041 -12522 -6447 2607 9286 18637 13400 -7612 -21889 -15219
6812 -15219 -16012 -8030 1934 17627 683 -314 -4812 -5178 4722 19537 15861 1770 -7046 422
6798 422 2155 -6724 -3408 -4686 1560 4002 -4236 2499 -6492 -11391 -7160 8078 16228 37 -13039
$$ packed form
6894a3999J3404J3065j1788o204J3100N443j6488p759N785J092J935k115K6519
6881B1990O148j7582j0210l311P344m876L577M528j320r914J1699R108j396o605
6867I180j0999j5327m441j264J1652k492j2552j366J4275J1657M961m682p377
6854h775j1991L514K669J6515j4415j1157k697J2028R523L926K396j5884j0699
6841b5047N602J6301J3757L663p826K491o867m097J1326L077n45j6176N54q798
6827a2585L075L045q567M804K8J159l481O075R054O679R351n237k1012j4277O670
6812a5219p93P982R964J5693j6944r97m498l66R900J4815l676j4091q816P468
6798D22J733q879L316j278O246K442q238O735q991m899M231J5238Q150j6191j3076
$$ plain form
6783 -13039 -16886 -14750 -3501 -8209 -14716 -5663 3066 869 11695 18019 15243 -7289 -16968 -27800
6769 -27800 -33991 -35802 -34399 -30927 -19438 -12140 -753 -125 -10000 -10083 -9705 -14184 -5367 2535 9824
6754 9824 11174 2685 -11005 -24315 -22916 -32226 -31168 -20125 -15353 -9522 9333 13601 8972 12644
6740 12644 17082 8766 3230 3168 -186 -2221 11352 14198 10805 1622 7493 29539 38239 23602
6726 23602 17603 7841 15325 25026 12701 -16598 -37991 -38559 -18916 -14016 -19784 -11997 -9446 -6085
6712 -6085 864 6513 10363 -2379 -2039 -2219 -12724 -7081 -2964 15224 19010 10978 -613 -13141
6698 -13141 -10801 -18060 -18762 -3330 6603 2977 7132 14495 10199 3254 98 994 7408 20142 26387
6683 26387 9639 8410 10416 -4444 -8165 -2177 2873 -3986 -11604 -16455 -19692 -11733 4398 19230
$$ packed form
6783a3039l847K136J1249m708o507R053Q729k197J0826O324k776k2532r679j0832
6769b7800o191j811J403L472J1489P298J1387O28r875q3L78m479Q817P902P289
6754I824J350q489j3690j3310J399r310J058J1043M772N831J8855M268m629L672
6740A2644M438q316n536o2l354k035J3573K846l393r183N871K2046Q700j4637
6726B3602n999r762P484R701j2325k9299k1393n68J9643M900n768P787K551L361
6712f085O949N649L850j2742L40j80j0505N643M117J8188L786q032j1591j2528
6698a3141K340p259p02J5432R933l626M155P363m296o945l156Q96O414J2734O245
6683B6387j6748j229K006j4860l721N988N050o859p618m851l237P959J6131J4832
$$ plain form
6669 19230 16249 14581 255 -6136 -17487 -8030 10722 13349 5450 -11784 -26025 -25568 -14642
6656 -14642 -7320 470 15181 24555 13858 13524 24414 7360 -10665 -24881 -14170 -4916 -668
6643 -668 -4795 -3544 -4617 2572 1966 436 6892 15959 24605 15146 7996 981 19635 21320 12387
6628 12387 28846 37339 24993 8345 -7937 -17981 -18833 -14533 -3302 12967 21375 23878 20634
6615 20634 6933 -15461 -21131 -13487 -9170 -6366 -2301 -11854 -17316 -4845 -2511 -1784 -1619 -5446
6601 -5446 -2432 -1384 -943 8848 14689 7861 5775 -2324 -10348 -5999 -10876 -12840 -9160 -17339 -24613
6586 -24613 -21178 -16870 5128 2867 842 16314 9721 -5504 -9561 -20751 -30062 -29625 -33950 -13618
6572 -13618 -7806 -8251 -7127 -12846 -16649 -15910 3793 13657 442 4846 12374 19216 31746 18621
$$ packed form
6669A9230k981j668j4326o391j1351R457J8752K627p899j7234j4241M57J0926
6656a4642P322P790J4711R374j0697l34J0890j7054j8025j4216J0711R254M248
6643f68m127J251j073P189o06j530O456R067Q646r459p150p015J8654J685q933
6628A2387J6459Q493j2346j6648j6282j0044q52M300J1231J6269Q408K503l244
6615B0634j3701k2394n670P644M317K804M065r553n462J2471K334P27J65l827
6601e446L014J048M41R791N841o828k086q099q024M349m877j964L680q179p274
6586b4613L435M308K1998k261k025J5472o593j5225m057j1190r311M37m325K0332
6572a3618N812m45J124n719l803P39J9703R864j3215M404P528O842J2530j3125
$$ plain form
6558 18621 11361 7839 975 4241 14464 14075 10035 -943 5639 3066 10087 11780 -490 -6443
6544 -6443 -11430 -2609 11141 18261 11669 16686 19351 21070 5637 4506 -8579 -12488 -4084 22433
6530 22433 28834 17287 15374 16537 16373 12656 17592 11207 -4794 -14955 -14407 1027 5589 -5298
6516 -5298 -9737 -12941 -13620 -6702 -19996 -26613 -38844 -29851 -17127 -11833 -1751 4895 1535 11106
6502 11106 14792 17752 17522 -2607 -14283 -14675 -1264 1364 13288 19909 15190 -2606 -13871 -6402
6488 -6402 -3627 -10533 5323 13025 16076 6264 8560 -9775 -20263 -15511 12101 14838 -10748 -20039
6474 -20039 -13756 -8439 -9511 -5908 -7560 -5809 -1825 -5574 -5384 5215 4477 -6270 -18264 -7728
6460 -7728 -12467 -11975 -10140 -8756 -17828 -10911 793 -11802 -25942 -19560 -4337 1493 -1780 -3100
$$ packed form
6558A8621p260l522o864L266J0223l89m040j0978O582k573P021J693j2270n953
6544f443m987Q821J3750P120o592N017K665J719j5433j131j3085l909Q404K6517
6530B2433O401j1547j913J163j64l717M936o385j6001j0161N48J5434M562j0887
6516e298m439l204o79O918j3294o617j2231Q993J2724N294J0082O646l360R571
6502A1106L686K960k30k0129j1676l92J3411K628J1924O621m719j7796j1265P469
6488f402K775o906J5856P702L051r812K296j8335j0488M752K7612K737k5586r291
6474b0039O283N317j072L603j652J751L984l749J90J0599p38j0747j1994J0536
6460g728m739M92J835J384r072O917J1704j2595j4140O382J5223N830l273j320
$$ plain form
6446 -3100 -5037 -12980 -14584 -21707 -14139 -10022 -15211 -14893 -2701 -6209 11235 22187 17629 2744
6432 2744 6712 10615 13581 7612 9271 3372 6429 2932 -7971 -10899 -4600 3542 -2001 -5238 -5000
6417 -5000 7195 -381 -18148 -6603 13842 22565 3826 12994 10122 8312 4295 -8184 8926
$$ packed form
6446c100j937p943j604p123P568M117n189L18J2192l508J7444J0952m558j4885
6432B744L968L903K966n969J659n899L057l497j0903k928O299Q142n543l237K38
6417e000J2195p576j7767J1545K0445Q723j8739R168k872j810m017j2479J7110
$$ [...]
##END NTUPLES=NMR SPECTRUM
##END=
