##TITLE=Analysis number 315393
Compound Code cc 46502
Book Reference 441/179
Project Code adrs
Chemist Name colinb
##JCAMPDX= 6.0         $$ Bruker NMR JCAMP-DX V2.0
##DATA TYPE= NMR SPECTRUM
##DATA CLASS= NTUPLES
##ORIGIN= Bruker BioSpin GmbH
##OWNER= NMR
$$ XWIN-NMR		Version 3.5
$$ Thu Nov 17 11:53:19 2005 GMT Standard Time (UT+0h)  MAYBRIDGE\NMR@NMR_250MHZ
##.OBSERVE FREQUENCY= 250.131544655141
##.OBSERVE NUCLEUS= ^1H
##.ACQUISITION MODE= SIMULTANEOUS (DQD)
##.ACQUISITION SCHEME= undefined
##.AVERAGES= 16
##.DIGITISER RES= 18
##SPECTROMETER/DATA SYSTEM= dpx250
##.PULSE SEQUENCE= zg30
##.SOLVENT NAME= CDCl3
##.SHIFT REFERENCE= (INTERNAL, CDCl3, 0, 16.4517)
##AUDIT TRAIL= $$ (NUMBER, WHEN, WHO, WHERE, WHAT)
$$ ##TITLE= Audit trail, XWIN-NMR		Version 3.5
$$ ##JCAMPDX= 5.01
$$ ##ORIGIN= Bruker BioSpin GmbH
$$ ##OWNER= NMR
$$ C:\u/data/dgb/nmr/ADRS/12560/pdata/1/auditp.txt
$$ ##AUDIT TRAIL=  $$ (NUMBER, WHEN, WHO, WHERE, WHAT)
(   1,<2005-11-17 11:52:40.54 +000>,<MAYBRIDGE\NMR>,<NMR_250MHZ>,
      <created by zg, POWCHK disabled, PULCHK disabled
       configuration hash MD5:
       62 19 C7 07 E1 42 D1 B7 37 6C 3D D0 77 39 F9 E6
       data hash MD5: 64K
       98 21 92 D3 01 59 CD 4C FF A0 0A 99 D7 09 FE CD>)
(   2,<2005-11-17 11:53:01.37 +000>,<MAYBRIDGE\NMR>,<NMR_250MHZ>,
      <Start of raw data processing
       ef LB = 0.3 FT_mod = 6 PKNL = 1 SI = 32K 
       data hash MD5: 32K
       28 DC B4 69 CF A0 6C A6 F2 9D EF 61 3C 26 A0 6A>)
(   3,<2005-11-17 11:53:06.15 +000>,<MAYBRIDGE\NMR>,<NMR_250MHZ>,
      <apk 
       data hash MD5: 32K
       56 60 9B 65 56 1D 6F 94 AC 99 A1 3A 8A 18 AD D6>)
(   4,<2005-11-17 11:53:07.46 +000>,<MAYBRIDGE\NMR>,<NMR_250MHZ>,
      <abs ABSG = 5 
       data hash MD5: 32K
       C7 97 F7 26 99 E0 EF C9 D1 A5 59 14 25 FD 9D 16>)
$$ ##END=
$$ 
$$ hash MD5
$$ 81 70 62 4D 2C E9 EF F9 09 EE F6 DF 56 E0 E2 B2
##$RELAX= 
##$RELAX= 
##$RELAX= 
##$RELAX= 
##$RELAX= 
##$RELAX= 
##$RELAX= 
$$ Bruker specific parameters
$$ --------------------------
##$DU= <C:\u>
##$EXPNO= 12560
##$NAME= <ADRS>
##$PROCNO= 1
##$TYPE= <nmr>
##$USER= <dgb>
##$AMP= (0..31)
100 100 100 100 100 100 100 100 100 100 100 100 100 100 100 100 100 100 
100 100 100 100 100 100 100 100 100 100 100 100 100 100 
##$AQSEQ= 0
##$AQ_mod= 3
##$AUNM= <au_zg>
##$AUTOPOS= <21 >
##$BF1= 250.13
##$BF2= 250.13
##$BF3= 250.13
##$BF4= 250.13
##$BF5= 500.13
##$BF6= 500.13
##$BF7= 500.13
##$BF8= 500.13
##$BYTORDA= 1
##$CFDGTYP= 0
##$CFRGTYP= 5
##$CHEMSTR= <none>
##$CNST= (0..31)
1 1 145 1 1 1 1 1 1 1 1 1 1 1 1 1 1 1 1 1 1 1 1 1 1 1 1 1 1 1 1 1 
##$CPDPRG= <>
##$CPDPRG1= <>
##$CPDPRG2= <>
##$CPDPRG3= <>
##$CPDPRG4= <mlev>
##$CPDPRG5= <mlev>
##$CPDPRG6= <mlev>
##$CPDPRG7= <mlev>
##$CPDPRG8= <mlev>
##$CPDPRGB= <>
##$CPDPRGT= <>
##$D= (0..31)
0 1 0 0 0 0 0 0 0 0.06 0 0 0 0 0 0 0.0002 0 0 0 0 0 0 0 0 0 0 0 0 0 0 
0 
##$DATE= 1132228357
##$DBL= (0..7)
120 120 120 120 120 120 120 120 
##$DBP= (0..7)
150 150 150 150 150 150 150 150 
##$DBP07= 0
##$DBPNAM0= <>
##$DBPNAM1= <>
$$ [...]
##$SUBNAM7= <"">
##$SUBNAM8= <"">
##$SUBNAM9= <"">
##$SW= 20.6930455092707
##$SWIBOX= (0..15)
0 0 3 0 0 0 0 0 0 0 0 0 0 0 0 0 
##$SW_h= 5175.983436853
##$TD= 65536
##$TD0= 1
##$TE= 294.16
##$TE2= 300
##$TE3= 300
##$TEG= 300
##$TL= (0..7)
0 120 120 120 120 120 120 120 
##$TP= (0..7)
150 150 150 150 150 150 150 150 
##$TP07= 0
##$TPNAME0= <>
##$TPNAME1= <>
##$TPNAME2= <>
##$TPNAME3= <>
##$TPNAME4= <>
##$TPNAME5= <>
##$TPNAME6= <>
##$TPNAME7= <>
##$TPOAL= (0..7)
0.5 0.5 0.5 0.5 0.5 0.5 0.5 0.5 
##$TPOFFS= (0..7)
0 0 0 0 0 0 0 0 
##$TUNHIN= 0
##$TUNHOUT= 0
##$TUNXOUT= 0
##$USERA1= <user>
##$USERA2= <user>
##$USERA3= <user>
##$USERA4= <user>
##$USERA5= <user>
##$V9= 5
##$VALIST= <valist>
##$VCLIST= <CCCCCCCCCCCCCCC>
##$VD= 0
##$VDLIST= <DDDDDDDDDDDDDDD>
##$VPLIST= <PPPPPPPPPPPPPPP>
##$VTLIST= <TTTTTTTTTTTTTTT>
##$WBST= 1024
##$WBSW= 4
##$XGAIN= (0..3)
0 0 0 0 
##$XL= 0
##$YL= 0
##$YMAX_a= 434700
##$YMIN_a= -392931
##$ZGOPTNS= <>
##$ZL1= 120
##$ZL2= 120
##$ZL3= 120
##$ZL4= 120
##$ABSF1= 16.45166
##$ABSF2= -4.241512
##$ABSG= 5
##$ABSL= 3
##$ALPHA= 0
##$AQORDER= 0
##$ASSFAC= 0
##$ASSFACI= 0
##$ASSFACX= 0
##$ASSWID= 0
##$AUNMP= <proc_1d>
##$AZFE= 0.1
##$AZFW= 0.1
##$BCFW= 0
##$BC_mod= 0
##$BYTORDP= 0
##$COROFFS= 0
##$CY= 12.5
##$DATMOD= 1
##$DC= 0
##$DFILT= <>
##$DTYPP= 0
##$F1P= 14.0000005364418
##$F2P= -0.99999901652339
##$FCOR= 0.5
##$FTSIZE= 32768
##$FT_mod= 6
##$GAMMA= 0
##$GB= 0
##$INTBC= 1
##$INTSCL= 1
##$ISEN= 128
##$LB= 0.3
##$LEV0= 0
##$LPBIN= 0
##$MAXI= 10000
##$MC2= 0
##$MEAN= 0
##$ME_mod= 0
##$MI= 0
##$NCOEF= 0
##$NC_proc= -3
##$NLEV= 6
##$NOISF1= 0
##$NOISF2= 0
##$NSP= 0
##$NTH_PI= 0
##$NZP= 0
##$OFFSET= 16.45166
##$PC= 1
##$PHC0= 81.54359
##$PHC1= 7.976666
##$PH_mod= 1
##$PKNL= yes
##$PPARMOD= 0
##$PSCAL= 4
##$PSIGN= 0
##$REVERSE= no
##$SF= 250.130017593283
##$SI= 32768
##$SIGF1= 0
##$SIGF2= 0
##$SINO= 400
##$SIOLD= 32768
##$SREGLST= <1H.CDCl3>
##$SSB= 0
##$STSI= 32768
##$STSR= 0
##$SW_p= 5175.98343685301
##$SYMM= 0
##$S_DEV= 0
##$TDeff= 65536
##$TDoff= 0
##$TI= <Analysis number 999999
Compound Code 99
Book Reference 9
Project Code 9>
##$TILT= no
##$TM1= 0
##$TM2= 0
##$TOPLEV= 0
##$USERP1= <user>
##$USERP2= <user>
##$USERP3= <user>
##$USERP4= <user>
##$USERP5= <user>
##$WDW= 1
##$XDIM= 32768
##$YMAX_p= 385463264
##$YMIN_p= -298455
$$ End of Bruker specific parameters
$$ ---------------------------------
##NTUPLES= NMR SPECTRUM
##VAR_NAME=  FREQUENCY,     SPECTRUM/REAL,   SPECTRUM/IMAG
##SYMBOL=    X,             R,               I
##VAR_TYPE=  INDEPENDENT,   DEPENDENT,       DEPENDENT
##VAR_FORM=  AFFN,          ASDF,            ASDF
##VAR_DIM=   32768,         32768,           32768
##UNITS=     HZ,            ARBITRARY UNITS, ARBITRARY UNITS
##FACTOR=    0.157963299565203, 1,           1
##FIRST=     4115.05404432152, 0,            0
##LAST=      -1060.92939253149, 0,           0
##MIN=       -1060.92939253149, -298455,     0
##MAX=       4115.05404432152, 385463264,    0
$$ Real data points
##PAGE= N=1
##DATA TABLE= (X++(R..R)), XYDATA
$$ [...]
18702A95892J9550j6135m1972j1486J0192q880n098O408J3123K9482r19k2728
$$ 195892 215442 199307 157335 145849 156041 147161 142063 148471 161594 191076 190157 167429
18690A67429l5852j3593j9160r58M860m225j6021M764K291J2361J0626N740r087
$$ 167429 131577 117984 98824 97866 102726 98501 82480 87244 89535 101896 112522 118262 109175
18677A09175J3890N658n159K7245Q5126K2380k3819l5473J9094k2373p003n50
$$ 109175 123065 128723 123564 150809 235935 258315 234496 199023 218117 195744 188741 188191
18665A88191K1430k6573l960J1869J2514L5509K1211J0695K4627r935o911k5658
$$ 188191 209621 183048 179088 190957 203471 238980 260191 270886 295513 285578 278667 253009
18653B53009m3979J114J2755P574k9398j2371j4217p045j1082K1499J9709q213
$$ 253009 209030 210144 222899 230473 201075 188704 174487 167442 156360 177859 197568 189355
18641A89355M0730N4769J6118q196q654L3582J0757K2850L597j8138J3861J1439
$$ 189355 230085 284854 300972 292776 284122 317704 328461 351311 354908 336770 350631 362070
18629C62070o405p143m881j1008M0274N8897L024J0698j2244K3939k1152l8042
$$ 362070 355665 348522 343641 332633 372907 431804 434828 445526 433282 457221 436069 398027
18617C98027j9472l5548o63J3276r04k3594P939M6290L3744L6919K7142n239l0926
$$ 398027 378555 343007 342344 355620 354716 331122 339061 385351 419095 456014 483156 477917 446991
18604D46991l885k2751k6942k5369J6113N7360J5477J7043M3337l698j4028K5769
$$ 446991 443106 420355 393413 368044 384157 441517 456994 474037 517374 513676 499648 525417
18592E25417M4366J3380M1436M1505q253j9502L5563M3804N8772N4347M2464M8282
$$ 525417 569783 583163 624599 666104 657851 638349 673912 717716 776488 830835 873299 921581
18580I21581L8099M9090J9046L8910J00187J62205L05434M24063K89751J30941
$$ 921581 959680 1008770 1027816 1066726 1166913 1329118 1634552 2058615 2348366 2479307
18570B479307J21852J53023J65615k2413j74529k16863j37779r9202p2353l5279
$$ 2479307 2601159 2754182 2919797 2897384 2722855 2505992 2368213 2269011 2196658 2161379
18560B161379R0557J39947K2568m2655n1457o0076p6839j24589j15682m1114K2907
$$ 2161379 2251936 2391883 2414451 2371796 2320339 2260263 2183424 2058835 1943153 1902039 1924946
18549A924946N6277J38189J35858J90993L15111M57402M94528N70057R32198J554679
$$ 1924946 1981223 2119412 2255270 2446263 2761374 3218776 3713304 4283361 5215559 6770238
18539F770238J728336J040404M86648J25656l2565k34752n75745o60104l49173
$$ 6770238 8498574 9538978 10025626 10151282 10118717 9883965 9308220 8648116 8298943
18530H298943j30662k33936j87686l8849J45140L10672M41030N11455M45371M84428
$$ 8298943 8168281 7934345 7746659 7707810 7852950 8163622 8604652 9116107 9561478 10045906
18520A0045906P50797J112065J471067K308268M039891O294749O842138N289074
$$ 10045906 10796703 11908768 13379835 15688103 19727994 26022743 32864881 38153955
18512C8153955K581731O68414k33738q93515j444736j022500K70463J969981L902860
$$ 38153955 40735686 41404100 41170362 40276847 38832111 37809611 38080074 40050055 43952915
18503D3952915L836867K803210J770517k40069j901386l260926m381416m568438
$$ 43952915 47789782 50592992 52363509 52123440 50222054 46961128 42579712 38011274
18495C8011274m254703l693775k832417j794964p03756O26144K263884M580815
$$ 38011274 33756571 30062796 27230379 25435415 24731659 25357803 27621687 32202502
18487C2202502P490566R857932J0922681J1519165J0544285P592227M710803L114378
$$ 32202502 39693068 49551000 60473681 71992846 82537131 90129358 94840161 97954539
18479I7954539M95838l085576m881722n911117o044316m494562j820862L087674
$$ 97954539 98450377 95364801 90483079 84571962 78527646 74033084 72212222 75299896
18471G5299896R012596J1442013J0293569P891782M516927M28393m116957q968777
$$ 75299896 84312492 95754505 106048074 113939856 118456783 118885176 114768219 105799442
18463A05799442j1499164j2058719j1992953j0990832r114283o997711n043832
$$ 105799442 94300278 82241559 70248606 59257774 50143491 43145780 38101948
18456C8101948l621680k333660p55841K27409L26251O26806M45131m45964j226103
$$ 38101948 34480268 32146608 31390767 31618176 31944427 32571233 33016364 32570400 31344297
18447C1344297j850084k021402j576731r60492o25094j096096j483734j511329
$$ 31344297 29494213 27472811 25896080 24935588 24310494 23214398 21730664 20219335
18439B0219335j495671j610490j899552k076336j802887j286973r40033p08423
$$ 20219335 18723664 17113174 15213622 13137286 11334399 10047426 9107393 8398970
18431H398970n37376l53517k14969j63244o1677K8361L7835J04029J09973Q1778
$$ 8398970 7861594 7508077 7293108 7129864 7068187 7096548 7134383 7238412 7348385 7430163
18421G430163K14740L84956K74822Q604r4943j28390k85529l58205m42903l43569
$$ 7430163 7644903 8029859 8304681 8313285 8218342 8089952 7804423 7446218 7003315 6659746
18411F659746n2190K95137N46789M31438J91203J64767K04432J55037M1698j28004
$$ 6659746 6607556 6902693 7449482 7880920 8072123 8236890 8441322 8596359 8638057 8510053
18401H510053j76186j11481q4321k4617N7034J51207M99961J184394J901863J897264
$$ 8510053 8333867 8222386 8138065 8113448 8170482 8321689 8821650 10006044 11907907 13805171
18391A3805171J233257N51770K01394N335j65531l31438j23957O86724K240318
$$ 13805171 15038428 15590198 15791592 15796927 15631396 15299958 15176001 15862725 18103043
18382A8103043M396311O563552P996271R111053Q679352O427631K723960m14810
$$ 18103043 22499354 29062906 37059177 46170230 54849582 61277213 64001173 63586363
18374F3586363j968000k291932k322911l701005n261056n059246l927948l009009
$$ 63586363 61618363 59326431 57003520 53302515 48041459 42982213 39054265 36045256
18366C6045256k670344k623645j674815J22941J182252J048324J010185J660191
$$ 36045256 33374912 30751267 29076452 29199393 30381645 31429969 32440154 34100345
18358C4100345K833946L588342K720684J138015J249400K619770K866291P78277
$$ 34100345 36934291 40522633 43243317 44381332 45630732 48250502 51116793 51895070
18350E1895070j206452j877416k159692k266028k613551l303472l605428l415104
$$ 51895070 50688618 48811202 46651510 44385482 41771931 38468459 34863031 31447927
18342C1447927k967872k196389j579201j651015j836790j492838r71309m18778
$$ 31447927 28480055 26283666 24704465 23053450 21216660 19723822 18752513 18333735
18334A8333735L11797J477048L549992N520389M888508K989735K147502J519007
$$ 18333735 18645532 20122580 23672572 29192961 34081469 37071204 39218706 40737713
18326D0737713m19677k730199m456233m796133m086134l331483k561523j059388
$$ 40737713 40318036 37587837 33131604 28335471 24249337 20917854 18356331 17296943
18318A7296943J043789L291395M208145K762119P89901k12801p89422j759692
$$ 17296943 18340732 21632127 25840272 28602391 29392292 29179491 28390069 26630377
18310B6630377l160149m110865l955293l054606k224200j679279j286342r20183
$$ 26630377 23470228 19359363 15404070 12349464 10125264 8445985 7159643 6239460
18302F239460o39321m54534l43711k78780k00483j40160m0134K5794r917p1214
$$ 6239460 5600139 5145605 4801894 4523114 4322631 4182471 4142337 4168131 4158214 4087000
18292D087000j32877k03035k39649k24217k30307j97439j39878j34753j83385
$$ 4087000 3954123 3751088 3511439 3287222 3056915 2859476 2719598 2584845 2401460
18283B401460j70661j16205j37667j17155j10266q5891r8080j42751j05044n1066
$$ 2401460 2230799 2114594 1976927 1859772 1749506 1663615 1565535 1422784 1317740 1266674
18273A266674n4638r3359r4094k3087k7441n7743p6036o0655n1452l7048k1561
$$ 1266674 1212036 1118677 1024583 1001496 974055 916312 840276 779621 728169 691121 669560
18262F69560k1089k6644o4093n2418j4420j9469m7954j8384o30P211N174l3817
$$ 669560 648471 621827 557734 505316 490896 471427 423473 405089 404459 411670 416844 383027
18250C83027l5827j3800N411K0056o3014n8434l9410j2568m110L834L0374J379
$$ 383027 347200 333400 338811 358867 295853 237419 198009 185441 181331 185165 215539 216918
18238B16918p887m3796k6452L1717K7580M0187K6794j411k2876j4742k4807r819
$$ 216918 209031 165235 138783 170500 198080 238267 265061 263650 240774 226032 201225 191406
18226A91406k189J1219N05n2329q3735Q967J94R849J9537K2947m795k5134m535
$$ 191406 189217 200436 200941 148612 64877 73844 74038 83887 103424 126371 121576 96442 91907
18213I1907J5874j1199M2808J9665J6484J7790j4359l6231K3749j2327j3159j6263
$$ 91907 107781 96582 139390 159055 175539 193329 178970 142739 166488 154161 141002 124739
18201A24739K5826M5021K0142j4761m671J0632N6544N5271O1239J17492J08864
$$ 124739 150565 195586 215728 200967 196296 206928 263472 318743 379982 497474 606338
18190F06338Q7478N5281l28l9980p3588p6017o4899j14223q4182l8236l7848l6348
$$ 606338 693816 749097 748769 708789 635201 559184 494285 380062 295880 257644 219796 183448
18178A83448n986K4958k1505K8240J2221J1255o512l269k2036k5842j6594r035
$$ 183448 177462 202420 180915 209155 221376 232631 226119 222850 200814 174972 158378 149343
18166A49343L2760K0333N173L2928j1319J4260j2967m916J0560j4529r23O1823
$$ 149343 182103 202436 207609 240537 229218 243478 230511 225595 236155 221626 220703 282526
18154B82526M2575N6673P0275O519L1289K7053N9409M6853K9317P9749M1528n637
$$ 282526 325101 381774 452049 458568 489857 516910 576319 623172 652489 732238 773766 768129
18142G68129n7443J6253L6376M107n4836l4664l3811l351o770J9507L9639L4511
$$ 768129 710686 726939 763315 767422 712586 677922 644111 640760 633990 653497 693136 727647
18130G27647p346J3677J7564j4828M0016Q5002M3894K8560Q5544R4671J08167
$$ 727647 720301 733978 751542 736714 776730 861732 905626 934186 1019730 1114401 1222568
18119A222568J35734J67223J77786K98156M48454N56099Q25023J179640J756365
$$ 1222568 1358302 1525525 1703311 2001467 2449921 3006020 3831043 5010683 6767048
18110F767048L098338O092052J1742201J3840226N113694M49676j195760j805225
$$ 6767048 9865386 15957438 27699639 41539865 46653559 47103235 45907475 44102250
18102D4102250l455551p162296r417767p428020m444267k654817j702413j142688
$$ 44102250 40646699 33484403 24066636 16638616 12194349 9539532 7837119 6694431
18094F694431p63549n90477m57624l53736k86378k64824k08363k33773k86710
$$ 6694431 5930882 5340405 4882781 4529045 4242667 3977843 3769480 3535707 3248997
18085C248997k28850k57122k81606l05096k69686j97327j63701j37558p9056k3573
$$ 3248997 3020147 2763025 2481419 2176323 1906637 1709310 1545609 1408051 1328995 1305422
18075A305422o7960q0195R609M1636J7914Q542j1231o4328p5962n3602p7391n7297
$$ 1305422 1237462 1157267 1166876 1208512 1226426 1234968 1223737 1159409 1083447 1029845 952454 895157
18063H95157n2930l1067K7250P4608O1378J06136K21427K79112K90726K10812
$$ 895157 842227 811160 838410 913018 974396 1080532 1301959 1581071 1871797 2082609
18053B082609J47393J00189Q5153m46r4994j57730j82217j92222j47508j24824
$$ 2082609 2230002 2330191 2415344 2414898 2319904 2162174 1979957 1787735 1640227 1515403
18043A515403j61443j63491j46767j39894p2321r4263r2893k6082J9621j4875
$$ 1515403 1353960 1190469 1043702 903808 831487 737224 644331 618249 637870 622995
18033F22995l7472m3952m3387l6960k4975k4404k1359n2175l281K6150k1022j6050
$$ 622995 585523 541571 498184 461224 436249 411845 390486 338311 335030 361180 340158 324108
18021C24108J2028q598J0662J6656P144j7J1201M483M408j0252n423K7494M6481
$$ 324108 336136 327538 338200 354856 362000 361983 373184 377667 382075 371823 366400 393894 440375
18008D40375L2263K5553O3809P8593O4257M1820K5014P1497P3750Q3624J13902
$$ 440375 472638 498191 562000 640593 704850 746670 771684 843181 916931 1000555 1114457
17997A114457J36836J40466J44417J87688K31796K36903K05649K44856J81783
$$ 1114457 1251293 1391759 1536176 1723864 1955660 2192563 2398212 2643068 2824851
17988B824851J49162J42019J38283J23986P8273K4597o8233o4282l5942j06300
$$ 2824851 2974013 3116032 3254315 3378301 3456574 3481171 3412938 3348656 3312714 3206414
17978C206414j73457k00856k67456k63622k26396k39118k26420j82021q4432j09231
$$ 3206414 3032957 2832101 2564645 2301023 2074627 1835509 1609089 1427068 1342636 1233405
17968A233405n8193m6313o0018k5387l5645o3952o7499j8939r397j7657k9426
$$ 1233405 1175212 1128899 1068881 1043494 1007849 943897 876398 857459 848062 830405 800979
17957H00979Q658L9708R2763M7306M9035J00734J18771N7519M8621N0833O0758
$$ 800979 809637 849345 942108 989414 1038449 1139183 1257954 1315473 1364094 1414927 1475685
17946A475685Q3645Q2986M7868L4124M1110N0863M3840j3348q311k202J0240j7661
$$ 1475685 1559330 1642316 1690184 1724308 1765418 1816281 1860121 1846773 1838462 1836260 1846500 1828839
17934A828839n3797l5073j6053p789n8345j49002j44667j31449j54123j32615
$$ 1828839 1775042 1739969 1723916 1716127 1657782 1508780 1364113 1232664 1078541 945926
17924I45926q6544j12281p5017o6271m0625o3518l9052N518K461n2932n2805j5723
$$ 945926 859382 747101 672084 605813 565188 501670 462618 468136 470597 417665 364860 349137
17912C49137J5099k8539M9795K4415k3114R224j7593j9295j1959j3828j6881q818
$$ 349137 364236 335697 385492 409907 386793 396017 378424 359129 347170 333342 316461 307643
17900C07643l1464R201P0469K8435o175P181l6919k9573j7141L3770j813K9088
$$ 307643 276179 285380 355849 384284 378109 385290 348371 318798 301657 335427 333614 362702
17888C62702K6235k184o0983m5871k9121M362j4370L4206J773k192J5497M0J0442
$$ 362702 388937 386753 325770 279899 250778 255140 240770 274976 276749 274557 290054 290094 300536
17875C00536J5485O680Q197n282J3361J076j391J1834J2437J726k742j3933j1623
$$ 300536 316021 322701 330898 325616 338977 340053 338662 350496 362933 364659 361917 347984 336361
17862C36361J188j2093K0336Q327j1143m7878j0835k1514r553k774J7987l3945
$$ 336361 337549 325456 345792 354119 342976 295098 284263 262749 253196 250422 268409 234464
17850B34464n7704o223m328J8174L9171j047P134J6388J753R470J8725K3230k4153
$$ 234464 176760 170537 166209 184383 223554 222507 229641 246029 247782 257252 275977 299207 275054
17837B75054j9526j5997n71k0885k399k6106j482M3916L2949P511j0631j113P463
$$ 275054 255528 239531 238960 218075 215676 189570 188088 232004 264953 272464 261833 260720 268183
17824B68183Q171P480q219M235r573p539l9273j1171P389J0757P080J4559K299
$$ 268183 276354 283834 275615 279850 270277 262738 223465 212294 219683 230440 237520 252079 254378
17811B54378k3372j3589k5118k4241k2623n667q071J6237l5r179R301K2335K8398
$$ 254378 231006 217417 192299 168058 145435 139768 131697 147934 147899 138720 148021 170356 198754
17798A98754k2691k4999j480K0105m9189L46K3776L203j8475k6344l4675M6366
$$ 198754 176063 151064 149584 169689 120500 120846 144622 147825 129350 103006 68331 114697
17786A14697N0838l144o2196k0885l1944l026m718k740q1L3438K5674L1469N017
$$ 114697 165535 162391 100195 79310 47366 44340 39622 36882 36801 70239 95913 127382 132399
17773A32399L3422P2758J4824l0024J6558k6961k3400l4005k3907m2408L516j5102
$$ 132399 165821 238579 253403 223379 239937 212976 189576 155571 131664 89256 92772 77670
17761G7670j5229p605k1953k9586L2293J4768j9429J9526o17K0377M994p609j5042
$$ 77670 62441 54836 32883 3297 35590 50358 30929 50455 49838 70215 75209 67600 52558
17748E2558J1182J2253L1004J1930o982J2607K3088K1899j6132j2657m0631J7336
$$ 52558 63740 75993 106997 118927 111945 124552 147640 169539 153407 140750 100119 117455
17736A17455o571p608K3297k2676j2243J6181j3080J1567K9698j0020j9009J8218
$$ 117455 110884 103276 126573 103897 91654 107835 94755 106322 136020 126000 106991 125209
17724A25209N3979O544m9170m4516l132K1216K9846j8457J1432R026N1645K1960
$$ 125209 179188 185732 136562 92046 88914 110130 139976 121519 132951 141977 193622 215582
17712B15582k2457K6719M0822J3625L1666J7861M7337O5340P4476J18673J83162
$$ 215582 193125 219844 260666 274291 305957 323818 371155 436495 510971 629644 812806
17701H12806L45277O18054R78696J055168P35139K52591p944j84405l59819n89717
$$ 812806 1158083 1776137 2754833 3810001 4545140 4797731 4789787 4605382 4245563 3655846
17691C655846p57369p47213n59758l90534k32666j33684j06131o3057o7734o9572
$$ 3655846 2898477 2151264 1591506 1200972 968306 834622 728491 665434 597700 528128
17681E28128r590j4426m6790j9482n2182j2517P186o954Q300J1960m742n2658
$$ 528128 518538 504112 457322 437840 385658 373141 380327 373373 381673 393633 388891 336233
17669C36233l4276j008N2295O164k5297n865J6846M2394J9505k0096m856L8454
$$ 336233 301957 300949 353244 359408 334111 328246 345092 387486 406991 386895 382039 420493
17657D20493M3295L1999k518J9699J2676J2883L3612N681M1004M1754M3593Q7820
$$ 420493 463788 495787 493269 512968 525644 538527 572139 577820 618824 660578 704171 791991
17645G91991J02344J49438J57925K03714K55830J91319J89391J69119J43370J57569
$$ 791991 894335 1043773 1201698 1405412 1661242 1852561 2041952 2211071 2354441 2512010
17635B512010J38679Q2046J90503K97293L61540N62083O72570Q04268R50851J245470
$$ 2512010 2650689 2732735 2923238 3220531 3582071 4144154 4816724 5620992 6571843 7817313
17625G817313J710323K466382L740448O155311J0629065J7487409K4135647K4436219
$$ 7817313 9527636 11994018 15734466 21889777 32518842 50006251 74141898 98578117
17617I8578117J6840408O587328q32795n860032j0912680j6364928j9595618j8373620
$$ 98578117 115418525 122005853 121173058 115313026 104400346 88035418 68439800 50066180
17609E0066180j3922180r293260n967213l843548k590220j847211j373176j113372
$$ 50066180 36144000 26850740 20883527 17039979 14449759 12602548 11229372 10116000
17601A0116000r46126p66165o75111o51831n98101n15277m51245l66537k83976
$$ 10116000 9169874 8403709 7728598 7076767 6478666 5963389 5512144 5145607 4861631
17592D861631k71724k38365k25821k84890k41087k52580k45193k37835k60687
$$ 4861631 4589907 4351542 4125721 3840831 3599744 3347164 3101971 2864136 2603449
17583B603449k65966j93685j62637j46708j56469j48646q7451o8277m5205o2856
$$ 2603449 2337483 2143798 1981161 1834453 1677984 1529338 1441887 1373610 1328405 1265549
17573A265549o1275q0168r0107p4181j7015m4165p4756k9178k0464l6635p9886
$$ 1265549 1204274 1124106 1033999 959818 942803 898638 823882 794704 774240 737605 657719
17562F57719l2425m8439j4920l0323k9680r973k0614l8054l9710j4776P562r105
$$ 657719 625294 576855 561935 531612 501932 491959 471345 433291 393581 378805 386367 377262
17550C77262Q029j2541o9198n3987J8327L1062J919j2574Q041j4808l0921k8718
$$ 377262 385291 372750 303552 249565 267892 298954 300873 288299 296340 281532 250611 221893
17538B21893m156l5350j1881k785l057k0256o037J4077j2048m466J1773j8070
$$ 221893 217737 182387 170506 167721 164664 144408 138371 152448 140400 135934 147707 129637
17526A29637m1791l7684j4809K7973L3450O867j276j091J4286n172k5598n154
$$ 129637 87846 50162 35353 63326 96776 103643 102367 101276 115562 110390 84792 79638
17514G9638M818M75m4629O31R05M425j7905Q929j0435m047m711l200J5756J8835
$$ 79638 84456 84931 40302 40933 41838 46263 28358 37287 26852 22805 18094 14894 30650 49485
17500D9485n917k7150K0285K829k0140r434J9851j8688J0030J8354M894q048j1893
$$ 49485 43568 16418 36703 39532 19392 9958 29809 11121 21151 39505 44399 36351 24458
17487B4458j3373K407L8741n664l1775J535N2848J7778m296k3597j1483M910k9547
$$ 24458 11085 13492 52233 46569 14794 16329 69177 86955 82659 59062 47579 52489 22942
17474B2942J2987L583M0785J2325j9334p755j1500k7505m2571j4479l4317l1423
$$ 22942 35929 39512 80297 92622 73288 65533 54033 26528 -16043 -30522 -64839 -96262
17462i6262l6596m366j700J149N669J0109N6250K0493K0531J5845j0922K8119
$$ -96262 -132858 -137224 -138924 -137775 -132106 -121997 -65747 -45254 -24723 -8878 -19800 8319
17450H319K9491j4133r157J604M353L2200J5171L8655O9261O0427O0935J8571
$$ 8319 37810 23677 14520 16124 20477 52677 67848 106503 175764 236191 297126 315697
17438C15697k5527O645l031k5220q8391n7780J8451J0583k01l3522l9941k8523
$$ 315697 290170 296815 293784 268564 180173 122393 140844 151427 151226 117704 77763 49240
17426D9240j4619Q316J3687j8310k8320j2599j6489J9J8718K4513p905k5850l3223
$$ 49240 34621 42937 56624 38314 9994 -2605 -19094 -19075 -357 24156 16251 -9599 -42822
17413d2822j5483K0378N424Q555J3917p467K6880J7646j9711m5472j7176l5472
$$ -42822 -58305 -37927 -32503 -23948 -10031 -17498 9382 27028 7317 -38155 -55331 -90803
17401i0803j331L990O577N665K6094M1443O687P093k8332k2427J8062L5965K2388
$$ -90803 -92134 -88144 -81567 -75902 -49808 -8365 -1678 5415 -22917 -45344 -27282 8683 31071
17388C1071P067j2226J9838l058p470J0532K8727K824o2729n4208J9229L3372
$$ 31071 38138 25912 45750 42692 35222 45754 74481 77305 14576 -39632 -20403 12969
17376A2969J6563l740J377m3647k4510J0444L6799R447k486j8052k6213j494M1301
$$ 12969 29532 25792 27169 -16478 -40988 -30544 6255 15702 13216 -4836 -31049 -32543 8758
17363H758K129J5217P160j0905N996j2357K5210j9415k8827M207n648K2538P238
$$ 8758 10887 26104 33264 22359 28355 15998 41208 21793 -7034 -2827 -8475 14063 21301
17350B1301J2075n788J6077k8167k7507r184p403N372j4227N842K5368Q716k7664
$$ 21301 33376 27588 43665 15498 -12009 -21193 -28596 -23224 -37451 -31609 -6241 2475 -25189
17337b5189j7304Q281p486J2998J3625j2948j937J6366K1453J7744n501n1666
$$ -25189 -42493 -34212 -41698 -28700 -15075 -28023 -29960 -13594 7859 25603 20102 -31564
17325c1564q91j179p603r073P014K6090J4707J5266l1175K70K5272p29j3910l974
$$ -31564 -32455 -33634 -41237 -50310 -43296 -17206 -2499 12767 -18408 -18138 7134 6405 -7505 -11479
17311a1479m156r285p621K2731K3944r611M53l1324J1906J7341J4626P246J8918
$$ -11479 -15635 -24920 -32541 -9810 14134 4523 4976 -26348 -14442 2899 17525 24771 43689
17298D3689K1686n893n248J1054o418l451j5239Q72j182k2817L1885n180k8432
$$ 43689 65375 59482 54234 65288 58870 55419 40180 41052 39870 17053 48938 43758 15326
17285A5326k2772K0763K8691J3210l718J8861k6201J0600j0664j6361j0576n091
$$ 15326 -7446 13317 42008 55218 51500 70361 44160 54760 44096 27735 17159 12068
17273A2068q658j5550k016J1521J1416m458k7277o613q516J833P98N814M470K7217
$$ 12068 3410 -12140 -14156 -2635 8781 4323 -22954 -29567 -38083 -36250 -35452 -29638 -25168 2049
17259B049M69m1484m080K3994M212J8673M93m465J2873j9777j8364K864Q531j4295
$$ 2049 2518 -38966 -43046 -19052 -14840 3833 4326 -139 12734 -7043 -25407 -22543 -14012 -28307
17245b8307J1966l850k0646J2168J3129J2062K2614n024l634k0693Q837M8298
$$ -28307 -16341 -20191 -40837 -28669 -15540 -3478 19136 14112 10478 -10215 -1378 46920
17233D6920j3675k9039l0480j9543R369J5479L7374L0792j461r101J2162r783
$$ 46920 33245 4206 -26274 -45817 -36448 -20969 16405 47197 45736 36635 48797 39014
17221C9014O893l3211l8469N231p399K364J7720j0560k3833J7508l6109k570K6796
$$ 39014 45907 12696 -25773 -20542 -27941 -25577 -7857 -18417 -42250 -24742 -60851 -63421 -36625
17208c6625L1552N3683j0589k3834J5740J6105k9102k9680r571K0526L8661K1861
$$ -36625 -5073 48610 38021 14187 29927 46032 16930 -12750 -22321 -1795 36866 58727
17196E8727k3717l1779O613r696k7175L5944J8794R072l2656k3507q452L7401
$$ 58727 35010 3231 9844 148 -27027 8917 27711 36783 4127 -19380 -27832 9569
17184I569K0426j1562m1411j8484J6293K3429J7653L049q990j2143K50R353j529
$$ 9569 29995 18433 -22978 -41462 -25169 -1740 15913 18962 9972 -2171 -1921 7432 5903
17171E903l743k238l6032q507Q109J7662r270Q999J8958J4052j3176J0658k7056
$$ 5903 2160 -78 -36110 -44617 -36508 -18846 -28116 -19117 -159 13893 717 11375 -15681
17158a5681j1070J998O466J8479P176J133n804K1531q104p322k2796J8455j5130
$$ -15681 -26751 -24753 -18287 192 7368 8501 2697 24228 16124 8802 -13994 4461 -10669
17145a0669r151p186J3469j9364J037q010K089q160J2914J9578J0873K0425o267
$$ -10669 -19820 -27006 -13537 -32901 -31864 -39874 -37785 -45945 -33031 -13453 -2580 17845 11578
17132A1578j8697k80l2726m2222J7276o6j0478J5190L8493J3097J9794q491o07
$$ 11578 -7119 -7399 -40125 -82347 -65071 -65137 -75615 -60425 -21932 -8835 10959 2468 1861
17119A861j342j8797K9426K8390l56k0927k0075K3641K4694n870j3776J8326J4916
$$ 1861 519 -18278 11148 39538 39182 18255 -1820 21821 46515 40645 26869 45195 60111
17106F0111k4336m8982k0748j5061O384K6297J8539j3740k3250L557K3443L6744
$$ 60111 35775 -13207 -33955 -49016 -42632 -16335 2204 -11536 -34786 -31229 -7786 28958
17094B8958K0581j5981K0452j5109k5654k758L292k3211k9135j088m683K8928
$$ 28958 49539 33558 54010 38901 13247 10489 13781 -9430 -38565 -39653 -44336 -15408
17082a5408j1806j6863o084M0610j1315l2012j479q343K4554J8227J709K3640
$$ -15408 -27214 -44077 -50161 -9551 -20866 -52878 -54357 -62700 -38146 -19919 -18210 5430
17070E430l0208j2053n11Q504J438N699L28j0580K4464j8699k6941J9717J6587
$$ 5430 -24778 -36831 -37342 -28838 -27400 -21701 -21373 -31953 -7489 -26188 -53129 -33412 -16825
17057a6825K003R663K5604k9491O681K2373l416r610j2788L8604K2996J2097K4180
$$ -16825 -14822 -5159 20445 -9046 -2365 20008 16592 6982 -5806 32798 55794 67891 92071
17044I2071Q261K0957O7106P2543J19023J18013J07880Q3308m331n0178n7094
$$ 92071 100332 121289 188395 260938 379961 497974 605854 689162 684831 634653 577559
17033E77559j00087j06980r1277o6598m2946o0446m6845j288k2475R65j1191J9357
$$ 577559 477472 370492 279215 212617 169671 109225 62380 61092 38617 39582 28391 47748
17021D7748J975Q1q90l9050P919L2520l187q655j4783k5430q229k09J8733L4074
$$ 47748 49723 49804 48914 9864 17783 50303 47116 38461 23678 -1752 -9981 -10190 8543 42617
17007D2617M820J4512j1977k2082L795k4520j6453J2377j2708J2775k823l1548
$$ 42617 47437 61949 49972 27890 31685 7165 -9288 3089 -9619 3156 333 -31215
16995c1215n596N430J3966J4110k6449l725K8918J7633j0422j7594K6655L2529
$$ -31215 -36811 -31381 -17415 -3305 -29754 -33479 -4561 13072 2650 -14944 11711 44240
16983D4240o119l2632j0772l0049L2765K8635M3474O935n1552l1054k6282j0163
$$ 44240 38121 5489 -5283 -35332 -2567 26068 69542 76477 24925 -6129 -32411 -42574
16971d2574p31K8477l494j27L1452K6518Q055J118l8190m0813o662K3540J6251
$$ -42574 -43305 -14828 -18322 -18449 13003 39521 47576 48694 10504 -30309 -36971 -13431 2820
16958B820k3431J2343L7741J1432j6096k5993j4226J9501j651j860l3007P850
$$ 2820 -20611 -8268 29473 40905 24809 -1184 -15410 4091 2440 580 -32427 -24577
16946b4577J6718P546P6k3961k0106m8206j0493O2010N9305K2035J0682k6610
$$ -24577 -7859 -313 -237 -24198 -44304 -92510 -103003 -40993 18312 40347 51029 24419
16934B4419j2877K4161k3244k6717N312j142O016R566k7733k4835J4651L4170
$$ 24419 11542 35703 12459 -14258 -8946 -10088 -4072 5494 -22239 -47074 -32423 1747
16922A747K9138L958m6767l2290J989J1817M470N941J2566o255K8655J7826j3377
$$ 1747 30885 34843 -11924 -44214 -42225 -30408 -25938 -19997 -7431 -13686 14969 32795 19418
16909A9418k728M542J7608J8042l2352j843l0529k1885K4747k1980N869K3965
$$ 19418 16690 21232 38840 56882 24530 22687 -7842 -29727 -4980 -26960 -21091 2874
16897B874O863q345l0112N446L3493J9779k9384l9082m127K6604J5805O862K234
$$ 2874 9737 1392 -28720 -23274 10219 29998 614 -38468 -42595 -15991 -186 6676 8910
16884H910j8798J0667K8022J4439k9012l0351P28J3028N309J4035r19J5066l885
$$ 8910 -9888 779 28801 43240 14228 -16123 -15395 -2367 2942 16977 16058 31124 27239
16871B7239J0323m084k0924j7501j3865Q19k50k9401O262K3846O881l7072j7391
$$ 27239 37562 33478 12554 -4947 -18812 -17993 -18243 -47644 -41382 -17536 -10655 -47727 -65118
16858f5118l016K3363L1452K1553k6399j4242L8839L4274k4578n77K581J247J2144
$$ -65118 -68134 -44771 -13319 8234 -18165 -32407 6432 40706 16128 15551 18132 19379 31523
16845C1523j4372j435m988l3664j0487N174P008Q124J2719K0279J3933K1635m3389
$$ 31523 17151 15716 10728 -22936 -33423 -28249 -21241 -13117 -398 19881 33814 55449 12060
16832A2060m2865J7455N689J320j3206n958j0024p2K2787J9434J1407k7345J3113
$$ 12060 -30805 -13350 -7661 -6341 -19547 -25505 -35529 -35601 -12814 6620 18027 -9318 3795
16819C795M187k2669k4428J7229K9232j9295k551l6419j1867J0185L7286L7130
$$ 3795 7982 -14687 -39115 -21886 7346 -11949 -14500 -50919 -62786 -52601 -15315 21815
16807B1815o773N82r08M093j3564k4898K2329Q239l590m5707k2390p605L744K0184
$$ 21815 15042 15624 14716 18809 5245 -19653 2676 10915 7325 -38382 -60772 -68377 -64633 -44449
16793d4449n675K1011j0719J1114K8165j8159p545K1145K6929m263j0092K333
$$ -44449 -50124 -29113 -39832 -28718 -553 -18712 -26257 -5112 21817 17554 7462 9795
16781I795K4454j4966m3904q518L1275n487j0501K6633J5970K26n498k2712L6926
$$ 9795 34249 19283 -24621 -33139 -1864 -7351 -17852 8781 24751 24977 19479 -3233 33693
16768C3693K7933k8230m0864j1208j8035p891j9454J7768K9218M698M0999J7356
$$ 33693 61626 33396 -7468 -18676 -36711 -44602 -64056 -46288 -17070 -12372 28627 45983
16756D5983j882j5551j2746k168P458J4299K39l0766J658k1678j5384K775j5231
$$ 45983 44101 28550 15804 13636 21094 35393 35632 4866 6524 -15154 -30538 -27763 -42994
16743d2994N073K5979N069J0079M40J4087k0837J1963l1948k0428p716N129j4750
$$ -42994 -37921 -11942 -6873 3206 3646 17733 -3104 8859 -23089 -43517 -51233 -46104 -60854
16730f0854j0943K7892j0296O901Q597k5202j2628K3465M6196p87j1863K2716
$$ -60854 -71797 -43905 -54201 -47300 -38703 -63905 -76533 -53068 -6872 -7659 -19522 3194
16718C194L8285q601k2689l6972k4277L7287K4059k1271K338j0008J5699J7253
$$ 3194 41479 32878 10189 -26783 -51060 -13773 10286 -10985 -8647 -18655 -2956 14297
16706A4297l5386J1999j5727P976Q492j004J2411K85J2348P225j6154m85j4165
$$ 14297 -21089 -9090 -24817 -16841 -8349 -9353 3058 3343 15691 22916 6762 6277 -7888
16693g888J0384k9886n734J1846j2968p506K6167l0118j5550K9378M7508L990
$$ -7888 2496 -27390 -33124 -21278 -34246 -41752 -15585 -45703 -61253 -31875 15633 19623
16681A9623M11Q437l5301j3714K423M228k4864J3155J8830k1240L3721L6931k9175
$$ 19623 20034 28471 -6830 -20544 -18121 -13893 -38757 -25602 -6772 -28012 5709 42640 13465
16668A3465l2491J1713O503k9427r68M0174K0219j1648N931j248O460k2466j496
$$ 13465 -19026 -7313 -810 -30237 -31205 8969 29188 17540 23471 22223 28683 6217 4721
16655D721j7645k8288J6314K3871k6292k6809L3619L779K607n008j8981j8549
$$ 4721 -12924 -41212 -24898 -1027 -27319 -54128 -20509 -16730 -14123 -19131 -38112 -56661
16643e6661j8425K3024K6688j90K7232K9313r413j7122J2072j4225n771K0895
$$ -56661 -75086 -52062 -25374 -25564 1668 30981 21568 4446 16518 2293 -3478 17417
16631A7417K7861j7549J1485L2117n003o506j9334k3361l0519j7889K7897J7136
$$ 17417 45278 27729 39214 71331 66328 59822 40488 17127 -13392 -31281 -3384 13752
16619A3752m4670p794O340L8682l0971k986M4048J030m138J4769J4601j8199m1498
$$ 13752 -30918 -38712 -32372 6310 -24661 -27647 16401 17431 13293 28062 42663 24464 -17034
16606a7034l3846j1556J2990M316L1118k5289j5063k524k0422K2283K9396L769
$$ -17034 -50880 -62436 -49446 -45130 -14012 -39301 -54364 -56888 -77310 -55027 -25631 -21862
16594b1862L2626M6280O254O157r309j6729l3409N222k5839R373j0521m687J2879
$$ -21862 10764 57044 63298 69455 60146 43417 10008 15230 -10609 -1236 -11757 -16444 -3565
16581c565q278j8607K1237L4778m172J4353n099k309K3138J282m5710l3553K6111
$$ -3565 -11843 -30450 -9213 25565 21393 35746 30647 28338 51476 52758 7048 -26505 -394
16568c94J7189J3725j9125k0164L0117r38k7612r075O2837k870l2494j4232j6826
$$ -394 16795 30520 11395 -8769 21348 20410 -7202 -16277 46560 43690 11196 -3036 -19862
16555a9862q098o530K1451N6183J1495l1494p029K6018k7026k7758k8615j1809
$$ -19862 -27960 -34490 -13039 43144 54639 23145 16116 42134 15108 -12650 -41265 -53074
16543e3074o567K5710O347k7985k993l830K482L6499M3398J8994j544k8832o940
$$ -53074 -59641 -33931 -27584 -55569 -58562 -62392 -59910 -23411 19987 38981 37437 8605 1665
16530A665J0636K082j8205m0155j0782K1199K4273P245J4780Q910Q751j1219k0648
$$ 1665 12301 14383 -3822 -43977 -54759 -33560 -9287 -2042 12738 21648 30399 19180 -1468
16517a468M65k186j650o342q470K3632j6775Q450J8675L2880k5551n490Q690K1069
$$ -1468 -1003 -3189 -4839 -11181 -19651 3981 -12794 -4344 14331 47211 21660 16170 24860 45929
16503D5929j6106l3597n339R611l3464n864J1774j3851Q452l974k9375M6375M3116
$$ 45929 29823 -3774 -9113 498 -32966 -38830 -27056 -40907 -32455 -36429 -65804 -19429 23687
16490B3687k4715n6263j0109M2388M1610L7407k903L8l164o0065n8012K3230K1003
$$ 23687 -1028 -57291 -67400 -25012 16598 54005 51102 51140 47976 -12089 -70101 -46871 -25868
16477b5868N756k572M804K1580O533J0511K448O83O48O079J269J3063M638k3745
$$ -25868 -20112 -22684 -17880 3700 10233 20744 23192 23875 24523 30602 31871 44934 49572 25827
16463B5827k8129L631j6805M3398M1162k0869m5808j0411q551k4236K3281p497
$$ 25827 -2302 1329 -15476 27922 69084 48215 2407 -8004 -16555 -40791 -17510 -25007
16451b5007L5021l134k1704j2042j9619k7805M988O018J7144K0607J9929J3529
$$ -25007 10014 6880 -14824 -26866 -46485 -74290 -69302 -63284 -46140 -25533 -5604 7925
16439G925j0590l649j6801l0339L265J9186J4808J545k1891K732p781R228M9079
$$ 7925 -2665 -6314 -23115 -53454 -50189 -31003 -16195 -14650 -36541 -33809 -41590 -32362 16717
16426A6717N658L790l3373J8127j0757j7176k0308L5560J8005l1247J439J0560
$$ 16717 22375 26165 -7208 10919 162 -17014 -37322 -1762 16243 -15004 -13565 -3005
16414c005K7470L4545k9797l2197o1193N101M894j9222R763J6183K1198K1126
$$ -3005 24465 59010 29213 -2984 -64177 -59076 -54182 -73404 -63641 -47458 -26260 -5134
16402e134k0594j8019p237J2527l590K793J5562N484J7243M6607m613m3474k5471
$$ -5134 -25728 -43747 -50984 -38457 -42047 -39254 -23692 -18208 -965 45642 41029 -2445 -27916
16389b7916k3693p682N6289J4240l9021j0020L1902L5612j7024j4691J1623N970
$$ -27916 -51609 -59291 -3002 11238 -27783 -37803 -5901 29711 12687 -2004 9619 15589
16377A5589J237l0830k0471J7525J624j3639J7116J4841R334k046k1994M355L2821
$$ 15589 16826 -14004 -34475 -16950 -15326 -28965 -11849 2992 12326 10280 -11714 -7359 25462
16364B5462L809l0311j9710j0345J0453J564r4n758O363j6108q26J8088q505j056
$$ 25462 29271 -1040 -20750 -31095 -20642 -19078 -19172 -24930 -18567 -34675 -35501 -17413 -25918 -26974
16350b6974K2071L731Q027k856j3777q368j3645k532J376K1810p888L951J785
$$ -26974 -4903 -1172 6855 3999 -9778 -18146 -31791 -34323 -32947 -11137 -19025 -15074 -13289
16337a3289l0649j703K1284K1715n1446k7900O521J9968N5537J5479Q37j8486
$$ -13289 -43938 -45641 -24357 -2642 -54088 -81988 -75467 -55499 38 15517 16354 -2132
16325b132k4763L7038N1794m4747m0623K1391k204j4291R14m3301m6990K8062
$$ -2132 -26895 10143 61937 17190 -23433 -2042 -4246 -18537 -17623 -60924 -107914 -79852
16313g9852N1480j316j159K0796j5510K848j3834K2941J6897k0872K395l000k0544
$$ -79852 -28372 -29688 -30847 -10051 -25561 -22713 -36547 -13606 3291 -17581 -15186 -18186 -38730
16300c8730J0589K2441j313J988j1671p284k8691K0508K5276J4020K9649N992
$$ -38730 -28141 -5700 -7013 -5025 -16696 -23980 -52671 -32163 -6887 7133 36782 42774
16288D2774j2149j2441l5567N029L0961n629k7672o891O390j5122k3869M6L3800
$$ 42774 30625 18184 -17383 -12354 18607 12978 -14694 -21585 -15195 -30317 -54186 -54140 -20340
16275b0340R828N012K6762Q406j3185k2394J077Q409o808l816J0319k624J129
$$ -20340 -10512 -5500 21262 29668 16483 -5911 -4834 3575 -3233 -7049 3270 646 1775
16262A775m1448j657K421n02Q049k5436J2317L6898q915K7170J4207J2848p8j6101
$$ 1775 -39673 -41330 -38909 -39411 -31362 -56798 -44481 -7583 -16498 10672 24879 37727 37649 21548
16248B1548j3131P841J0498j5645O762J1800j8136k7271n2202j4879L8912L9484
$$ 21548 8417 16258 26756 11111 17873 29673 11537 -15734 -67936 -82815 -43903 -4419
16236d419L2507L088m70K0666k0897q462p378k1887M2666J0481m7078j0079J3824
$$ -4419 28088 31176 30706 51372 30475 22013 14635 -7252 35414 45895 -1183 -11262 2562
16223B562j9452j84j4015J1456M983j7765k4179p815k4683j7087K308K9923K5205
$$ 2562 -16890 -17074 -31089 -19633 -14650 -32415 -56594 -64409 -89092 -106179 -103871 -73948 -48743
16210d8743K7605K6381r986L0438k8522j2808k9512L8973j8287L084J5950k8479
$$ -48743 -21138 5243 -4743 25695 -2827 -15635 -45147 -6174 -24461 -21377 -5427 -33906
16198c3906n6184K4930K0102M7583M4104l214k5770m171q173j1565l512m2778
$$ -33906 -90090 -65160 -45058 2525 46629 43415 17645 13474 5301 -6264 -9776 -52554
16186e2554L093J7649N6261r459j4429j749J0921k0330l0438k6142O047J9233
$$ -52554 -49461 -31812 24449 14990 561 -1188 9733 -10597 -41035 -67177 -61130 -41897
16174d1897M1734j6096l3910K1751L4375K1589j5819k2556l0280k5643j9607K9719
$$ -41897 -163 -16259 -50169 -28418 5957 27546 11727 -10829 -41109 -66752 -86359 -56640
16162e6640L0178l2436n0690j5773Q414N139J4662M9429K2219K3807M4152j5609
$$ -56640 -26462 -58898 -109588 -125361 -116947 -111808 -97146 -47717 -25498 -1691 42461 26852
16150B6852q382O064J3263K0347k4532j4046J534m5987k2660k5360J9662K2943
$$ 26852 18470 24534 37797 58144 33612 19566 21100 -24887 -47547 -72907 -53245 -30302
16138c0302k1485J5602J8477Q821J1141J4928L982r707K6045p56r705K074l6311
$$ -30302 -51787 -36185 -17708 -8887 2254 17182 21164 11457 37502 36746 27041 29115 -7196
16125g196j0702R593J7881K437j8829K6956J1660P557j4852j9910l554k489m15
$$ -7196 -17898 -8305 9576 12013 -6816 20140 31800 39357 24505 4595 1041 -1448 -1863
16112a863P209k9023l2879j5254J2480K7372Q073l9138j1036K7376J0959K9181
$$ -1863 5346 -23677 -56556 -71810 -59330 -31958 -23885 -63023 -74059 -46683 -35724 -6543
16100f543k9312k7099N340L5256m423Q999K2326J9643J0356M275k564k2129l6784
$$ -6543 -35855 -62954 -57614 -22358 -26781 -17782 4544 24187 34543 38818 36254 14125 -22659
16087b2659L736J6404m506K6876l1407k5057M907J9667o811j2808P736K5338j2256
$$ -22659 -18923 -2519 -7025 19851 -11556 -36613 -31706 -12039 -18850 -31658 -23922 1416 -10840
16074a0840l0646j0133J3770j6353k3689L135J4723M4759K7402n71K7987K9782
$$ -10840 -41486 -51619 -37849 -54202 -77891 -74756 -60033 -15274 12128 11557 39544 69326
16062F9326j6591k3940R81m022M86J2464O13k5970j5543j5619l677K6451K475
$$ 69326 52735 28795 29776 25754 26240 38704 39317 13347 -2196 -17815 -21492 4959 7434
16049G434k940L1055K3448l3923j7634p837J8543L0278J6892N323k354m4606n2443
$$ 7434 4494 35549 58997 25074 7440 -397 18146 48424 65316 70639 68285 23679 -28764
16036b8764K1281K6506K345m1401L110l4217L8086K9614l7611k9126J4645k2045
$$ -28764 -7483 19023 21368 -20033 -16923 -51140 -13054 16560 -21051 -50177 -35532 -57577
16024e7577o276Q125k5898J7964L2232L553K9446J0632N664j897K1272K9746l9171
$$ -57577 -63853 -55728 -81626 -63662 -31430 -27877 1569 12201 17865 15968 37240 66986 27815
16011B7815l3207j0197J4128k2690l5775M870N9436J3887j0716l329k6073j8392
$$ 27815 -5392 -15589 -1461 -24151 -59926 -55056 4380 18267 7551 4222 -21851 -40243
15999d0243J7013L6765l638L756K624k5186m2946j3223J7812N244n421o515K8273
$$ -40243 -23230 13535 9897 13653 16277 -8909 -51855 -65078 -47266 -42022 -47443 -53958 -25685
15986b5685K0768Q42m398P37J473l7972l483J2864J1504M9589M100q96P745l8417
$$ -25685 -4917 -4075 -8473 -7736 -6263 -44235 -47718 -34854 -23350 26239 30339 29443 37188 -1229
15972a229j016m869M763J3524K5703J8165k9464j3520l6445J9763L0439K9794
$$ -1229 -2245 -7114 -2351 11173 36876 55041 25577 12057 -24388 -4625 25814 55608
15960E5608L927m1347N177J2465l3243j546M409L42l40L1034K7630l131K9608
$$ 55608 59535 18188 23365 35830 2587 1041 5450 5792 5452 36486 64116 60985 90593
15947I0593n28k7309K3883k7647j6419J7045q134j8128L994j7823J3459J6237
$$ 90593 90065 62756 86639 58992 42573 59618 51484 33356 37350 19527 32986 49223
15935D9223j9581k105l2536j1875K0928j2514k0183k595K9694J9494K439k0631
$$ 49223 29642 27537 -4999 -16874 4054 -8460 -28643 -31238 -1544 17950 20389 -242
15923b42k4367q535k8903M873L3114J6587J3955J7136M8956O807j6055l9089l8834
$$ -242 -24609 -33144 -62047 -57174 -24060 -7473 6482 23618 72574 79381 63326 24237 -14597
15910a4597k2674R272k87Q009k7232j778l297J9029Q738j6275J0857L8112k3244
$$ -14597 -37271 -27999 -28286 -20277 -47509 -49287 -52584 -33555 -24817 -41092 -30235 7877 -15367
15897a5367j5055K8337P993k1570k398J2590K338l8003R473L6074K8616j3930
$$ -15367 -30422 -2085 5908 -15662 -18060 -5470 -3132 -41135 -31662 4412 33028 19098
15885A9098j1579l6190j4564n67j8616K5451K8768N916k8894J6659Q794K319J0339
$$ 19098 7519 -28671 -43235 -43802 -62418 -36967 -8199 -2283 -31177 -14518 -5724 -3405 6934
15872F934n980j3382m0257k3396o74J0214M7198n7941Q629J4696m29L2440K986
$$ 6934 954 -12428 -52685 -76081 -76755 -66541 -19343 -77284 -68655 -53959 -54388 -21948 -18962
15859a8962l5265J0290L1512l956j3442J9377P495L9212J2434l0633n9000l1113
$$ -18962 -54227 -43937 -12425 -16381 -29823 -10446 -2951 36261 48695 18062 -40938 -72051
15847g2051J5620J0468L1742J4949J4049K5971j8073k0529k3184k3507n273K2496
$$ -72051 -56431 -45963 -14221 728 14777 40748 22675 2146 -21038 -44545 -49818 -27322
15835b7322L2073K1665K6751k0069m0635j2913q133j6666m438K2113L7773K7787
$$ -27322 4751 26416 53167 33098 -7537 -20450 -28583 -45249 -49687 -27574 10199 37986
15823C7986k0659m0480j1023l067K1470p947m8218O378O1064J8294k4025J069
$$ 37986 17327 -23153 -34176 -37243 -15773 -23720 -71938 -65560 -4496 13798 -10227 -9158
15811i158p883M7578M9462l3850o153m1958m275k759j1196L1596J6838Q592l540
$$ -9158 -17041 30537 79999 46149 39996 -1962 -6237 -8996 -20192 11404 28242 36834 33294
15798C3294Q555j2123N0007j2888l5182m6441l0644J0317L6660J6169m5100l4176
$$ 33294 41849 29726 79733 66845 31663 -14778 -45422 -35105 1555 17724 -27376 -61552
15786f1552J4625K8516K3295j4540j8399K325n662j5964J1445j664l293k9599
$$ -61552 -46927 -18411 4884 -9656 -28055 -25730 -31392 -47356 -35911 -37575 -40868 -70467
15774g0467K6311J0967L324Q439m8339l1593q29L0643L0915J5305j7562o318n291
$$ -70467 -44156 -33189 -29865 -21426 -69765 -101358 -102187 -71544 -40629 -25324 -42886 -49204 -54495
15761e4495J4607M013p092L1727L5657k2707l0537j477k026K0743P590k9098J4756
$$ -54495 -39888 -35875 -42967 -11240 24417 1710 -28827 -30304 -32330 -11587 -3997 -33095 -18339
15748a8339L4224K8289m398k8949k9990J6205J0737M38J4743K6096K374K7395
$$ -18339 15885 44174 39776 10827 -19163 -2958 7779 8217 22960 49056 51430 78825
15736G8825L456l4387j1297J9416J8277j8678k2690k6974M899n15j0772J7689
$$ 78825 82281 47894 36597 56013 74290 55612 32922 5948 10847 10332 -440 17249
15724A7249K1099M274q61o3950j4569K5889l6582L0154r917K762K5911P533j5341
$$ 17249 38348 42622 41761 -22189 -36758 -10869 -47451 -17297 -27214 -24452 1459 8992 -6349
15711f349j6904j3164m724N847J2235L991j1339j9075J7394L4676j9728M348J926
$$ -6349 -23253 -36417 -41141 -35294 -23059 -19068 -30407 -49482 -32088 2588 -17140 -12792 -10866
15698a0866J4337K3949m196j041O416J1408j962p533q608q154j4871j1028K5621
$$ -10866 3471 27420 23224 22183 28599 40007 38045 30512 21904 13750 -1121 -12149 13472
15685A3472j3210j1340Q872J0222M954k5779J3165k0099j020L9729L0145J289
$$ 13472 262 -11078 -2206 8016 12970 -12809 356 -19743 -20763 18966 49111 50400
15673E0400p951k5063j1907j7224n326j3169o938J34L6587j4219k9162J1799K7262
$$ 50400 42449 17386 5479 -11745 -17071 -30240 -37178 -37044 -457 -14676 -43838 -32039 -4777
15660d777N575m5126K6728M1993J6067k8793j2822l580j2262k332J6264k5413
$$ -4777 798 -44328 -17600 24393 40460 11667 -1155 -4735 -16997 -19329 -3065 -28478
15648b8478O706J2213m399j3022M6032j1264j3224R396j9485r903K1775O022j2677
$$ -28478 -21772 -9559 -13958 -26980 19052 7788 -5436 3960 -15525 -25428 -3653 2369 -10308
15635a0308Q128k012k1199J2976N5301l466m4703k9084L6953K1274M958K0108
$$ -10308 -2180 -4192 -25391 -12415 42886 39420 -5283 -34367 2586 23860 28818 48926
15623D8926J3160k3862j1471l3384k0737j9153r704M6366K9584k7028j9404Q848
$$ 48926 62086 38224 26753 -6631 -27368 -46521 -56225 -9859 19725 -7303 -26707 -17859
15611a7859J3645l485M860K9579n695k971j6198K8539J6748o8275m0638O972K4387
$$ -17859 -4214 -7699 -2839 26740 21045 18074 1876 30415 47163 -21112 -61750 -54778 -30391
15598c0391M1665n820l950n86j2007L1101J3683n647k7878K1124J4411k4975n5232
$$ -30391 11274 5454 1504 918 -11089 20012 33695 28048 170 21294 35705 10730 -44502
15585d4502N5791M7801o824j5699J9935p755J3736j6033k5303l130K6523O31m9454
$$ -44502 11289 59090 52266 36567 56502 48747 62483 46450 21147 18017 44540 45171 -4283
15572d283k6091M457L5197L2100J9819O851l471m7453O44K1821n163p989l2034
$$ -4283 -30374 -25917 9280 41380 61199 68050 64579 17126 17770 39591 34428 26439 -5595
15559e595m0626J4075K3969n570M450J5826K4151k4751k5188k0485j279r984J5450
$$ -5595 -46221 -32146 -8177 -13747 -9297 6529 30680 5929 -19259 -39744 -41023 -51007 -35557
15546c5557K9375M2918J7133l4102q855Q857K0190j6767j3622j7778m879O969
$$ -35557 -6182 36736 53869 19767 10912 19769 39959 23192 9570 -8208 -13087 -6118
15534f118Q53K605L3425L3401m3712j1020J2j6831p423J428k664J6422L8474L3309
$$ -6118 -5265 -2660 30765 64166 20454 9434 9446 -7385 -14808 -13380 -16044 378 38852 72161
15520G2161J4565n1876p192K4876j3978q036k0004j8830M308J1136j6067k788
$$ 72161 86726 34850 27658 52534 38556 30520 10516 -8314 -4006 7130 -8937 -11725
15508a1725m206J1931R670m344j0431J4990k51m4108K6350K3743J909K431j615
$$ -11725 -15931 -4000 5670 1326 -9105 5885 5634 -38474 -12124 11619 13528 15959 14344
15495A4344J8366k855J5099M035k8473m9671L381n787l3041K0191M4973J298K5358
$$ 14344 32710 29855 44954 48989 20516 -29155 -25774 -31561 -64602 -44411 562 1860 27218
15482B7218K2805k1551k4201k842O106j6660k4703r669p471J8922n420k9557L4047
$$ 27218 50023 28472 4271 1429 7535 -9125 -33828 -43497 -50968 -32046 -37466 -67023 -32976
15469c2976L5929j5470j1015M502K3441r185k1448r488l2921j817K8579J868m5670
$$ -32976 2953 -12517 -23532 -19030 4411 -4774 -26222 -35710 -68631 -70448 -41869 -40001 -85671
15456h5671k5680N3830R928n614K1973k302k9723k2628K4193K8403J0907K2242
$$ -85671 -111351 -57521 -47593 -53207 -31234 -33536 -63259 -85887 -61694 -33291 -22384 -142
15444a42L3155K8453o555o0557p500k1246P843L8480q011q141j5373n09j7885
$$ -142 33013 61466 54911 -5646 -13146 -34392 -26549 11931 3920 -4221 -19594 -20103 -37988
15431c7988k5438O900k982j1029R812L1023M1856J9855K052l7798l5193J71N1456
$$ -37988 -63426 -56526 -59508 -70537 -60725 -29702 12154 32009 34061 -3737 -38930 -38759 12697
15418A2697q184j106k1277l4534J3545J107M8625l765j1849k0139l398o664j2254
$$ 12697 4513 3407 -17870 -52404 -38859 -37752 10873 7108 -4741 -24880 -28278 -34942 -47196
15405d7196J9486M8968J486l664m1668n030J5591K9387j8909m2591j7410R123
$$ -47196 -27710 21258 22744 19080 -22588 -27618 -12027 17360 -1549 -44140 -61550 -52427
15393e2427J7278M7282J0991l0544l881L1537k4825k5458J5779j6381M5709J8780
$$ -52427 -35149 12133 23124 -7420 -11301 20236 -4589 -30047 -14268 -30649 15060 33840
15381C3840j5622J9319k3136q221p175k0800j197J2424K3663L0725j5535n936
$$ 33840 18218 37537 14401 6180 -995 -21795 -22992 -10568 13095 43820 28285 22349
15369B2349n234O517k9046J3007K8214j7317O793k7255l1467J3876K5550j423
$$ 22349 17115 23632 -5414 7593 35807 18490 25283 -1972 -33439 -19563 5987 4564
15357D564j6163J3082L5558K1609j0837m3782J5395J2931l3813l5114P271k203
$$ 4564 -11599 1483 37041 58650 47813 4031 19426 32357 -1456 -36570 -29299 -31502
15345c1502o634J6231Q696Q648J4859l268J5711Q63K484p602J5897n333M846q101
$$ -31502 -38136 -21905 -13209 -4561 10298 7030 22741 23604 26088 18486 34383 29050 33896 25795
15331B5795k3477K4344J1836j0099k7l9980o95j815j9911Q449L928K531K109L989
$$ 25795 2318 26662 38498 28399 28372 -11608 -12303 -14118 -34029 -25580 -21652 -19121 -17012 -13023
15317a3023K0879j917l184J6134P103j0436k2701k6042J5732k510O173K6979k3838
$$ -13023 7856 5939 2755 18889 25992 15556 -7145 -33187 -17455 -19965 -13792 13187 -10651
15304a0651k4130J4748M0296m929l2091Q076r414k5118J3101L1290J4819K3188
$$ -10651 -34781 -20033 20263 15334 -16757 -8681 -18095 -43213 -30112 1178 15997 39185
15292C9185j1648k0458k9119N434j0282k923k5485L1185L2475O970K5484J2712
$$ 39185 27537 7079 -22040 -16606 -26888 -29811 -55296 -24111 8364 15334 40818 53530
15280E3530j3954k7812m3499J1912K0154m767k462J794j9747J6320J2781J8813
$$ 53530 39576 11764 -31735 -19823 331 -4436 -6898 -5104 -24851 -8531 4250 23063
15268B3063J0559M676p62j8232K0566K8180k3180l8171l1708N211N669k9459l2171
$$ 23063 33622 38298 37536 19304 39870 68050 44870 6699 -25009 -19798 -14129 -43588 -75759
15255g5759K1939M2784L156n103n265J649k804J8662k8552M426j4638j7369L728
$$ -75759 -53820 -11036 -7880 -12983 -18248 -16599 -19403 -741 -29293 -24867 -39505 -56874 -53146
15242e3146M560J3428L6703J2540j0844m059N4q44k995J2007p724j2503q861l879
$$ -53146 -48586 -35158 1545 14085 3241 -818 -764 -1608 -4603 7404 -320 -12823 -21684 -25563
15228b5563r235J7514J8388J1031l7216q516J2489O743L2617M1067n855k3454
$$ -25563 -34798 -17284 1104 12135 -25081 -33597 -21108 -14365 18252 59319 53464 30010
15216C0010j114K336k387k4894l961J16J8438J8877j4959R712k4612Q491K5910
$$ 30010 28896 31232 28845 3951 -10 106 18544 37421 22462 32174 7562 16053 41963
15203D1963k6852k2208p050m9672k5785j259L0972J1155M9685K6034l0115k5283
$$ 41963 15111 -7097 -14147 -63819 -89604 -90863 -59891 -48736 949 26983 -3132 -28415
15191b8415o664K7669L8287J67j7075j9771J7420l874q836j8502K1108K0749j8074
$$ -28415 -35079 -7410 30877 31044 13969 -5802 11618 7744 -1092 -19594 1514 22263 4189
15178D189P773o239j9354k5272J8394m552k2210J9921J7245k558j1019K1257r790
$$ 4189 11962 5723 -13631 -38903 -20509 -25061 -47271 -27350 -10105 -12663 -23682 -2425 -12215
15165a2215k5081k2582K5945L7285q722k5596j0264m915J594k945J6373K2428
$$ -12215 -37296 -59878 -33933 3352 -5370 -30966 -41230 -46145 -44551 -47496 -31123 -8695
15153h695K0312J8705J1134l5086l1236J612K013k3779L7816J3945k605k977j9419
$$ -8695 11617 30322 41456 6370 -24866 -23254 -21241 -45020 -7204 6741 4136 1159 -18260
15140a8260r591M0324J6877k6669r918J3312j7481j202J6869L808K192J4655r202
$$ -18260 -27851 12473 29350 2681 -7237 6075 -11406 -12608 4261 8069 10261 24916 15714
15127A5714k4961j899R604l571j7335J5559M326m2073M0896N0618K1249l1396
$$ 15714 -9247 -11146 -1542 -5113 -22448 -6889 -2563 -44636 -3740 46878 68127 36731
15115C6731j9458J5488k1993q647o848m580k40R142K5699o86l7226K630J5980
$$ 36731 17273 32761 10768 2121 -4727 -9307 -9547 -405 25294 24608 -12618 -9988 5992
15102E992L1687L832J1501j0980m519j8057k2729J0759j3312l4669j0783p764
$$ 5992 37679 41511 53012 42032 37513 19456 -3273 7486 -5826 -40495 -51278 -59042
15090e9042K1592J2280P520k426J2017p274o139j168K1887L5663k2166o8961R442
$$ -59042 -37450 -25170 -17650 -20076 -8059 -15333 -21472 -22640 -753 34910 12744 -56217 -46775
15077d6775J5415K4979K5286O314j2219j1927j5609k9597O795K8989J8768L203
$$ -46775 -31360 -6381 18905 25219 13000 1073 -14536 -44133 -37338 -8349 10419 13622
15065A3622J9781J4567J2406k84l2881l7469k2414r210k1888L5739K2068L1650
$$ 13622 33403 47970 60376 60092 27211 -10258 -32672 -41882 -63770 -28031 -5963 25687
15053B5687K3453l1784p800L5356J8734l8477L780J901k4660J9351K0314l5261
$$ 25687 49140 17356 9556 44912 63646 25169 28949 30850 6190 25541 45855 10594
15041A0594k4039k2123J8320J5601K9227j2517k3565j3093L3287k1073j8422j8666
$$ 10594 -13445 -35568 -17248 -1647 27580 15063 -8502 -21595 11692 -9381 -27803 -46469
15029d6469n667K0263q40L353J0827K6636j1149j2637J2639l758J7921R512K8261
$$ -46469 -52136 -31873 -32713 -29360 -18533 8103 -3046 -15683 -3044 -6802 11119 20631 48892
15016D8892p249j5142n654j6169k0668k985K0091J7852L5512o007k9747j6982
$$ 48892 41643 26501 20847 4678 -15990 -18975 1116 18968 54480 48473 18726 1744
15004A744m7754L972J5870R473O723J2266L3436R682J402K9440J6246k7820n590
$$ 1744 -46010 -42038 -26168 -16695 -9972 2294 35730 45412 46814 76254 92500 64680 59090
14991E9090l1130k396J3564L447J3071j2428j6853k3214l7231n022J6135K0934
$$ 59090 27960 25564 39128 42575 55646 43218 26365 3151 -34080 -39102 -22967 -2033
14979b033J0991M725L0380L886J927j5867l5130J8243J2980P411J4130k8209J151
$$ -2033 8958 13683 44063 47949 49876 34009 -1121 17122 30102 37513 51643 23434 24585
14966B4585J4623j0790m8350j5070l880q14r402L0094J2330q821M262J87r134
$$ 24585 39208 28418 -19932 -35002 -38882 -39696 -49098 -19004 -6674 -15495 -11233 -11046 -20180
14953b0180p879o44k1097j8795K7683j1830l207M2920J8576J6940J028j6651l6771
$$ -20180 -28059 -28703 -49800 -68595 -40912 -52742 -55949 -13029 5547 22487 23515 6864 -29907
14940b9907j1339l6379O761R509M5496L949P50J9449j4363j8073K2594J2044K0825
$$ -29907 -41246 -77625 -70864 -61355 -15859 -11910 -11160 8289 -6074 -24147 -1553 10491 31316
14927C1316p056n6828j6859J4933K8286l724n554r263L128k4774K4060M3851L524
$$ 31316 24260 -32568 -49427 -34494 -6208 -9932 -15486 -24749 -21621 -46395 -22335 21516 25040
14914B5040k5020P563L149k013k2175j3808J6038Q943n193k1516j4110R004J71
$$ 25040 20 7583 10732 8719 -13456 -27264 -11226 -2283 -7476 -28992 -43102 -34098 -33927
14901c3927l1184j4121J1159Q442N705Q375j4380k7911R324L8249J5142m230J5680
$$ -33927 -65111 -79232 -68073 -59631 -53926 -45551 -59931 -87842 -78518 -40269 -25127 -29357 -13677
14888a3677K4443j6102k6471j5012J5840k7156o8705o190N4756K2684J2162L6306
$$ -13677 10766 -5336 -31807 -46819 -30979 -58135 -126840 -133030 -78274 -55590 -43428 -7122
14876g122L5454l2667k1759K4883K534k7422k740q776j7319L2710N3495n819j3285
$$ -7122 28332 -4335 -26094 -1211 1323 -26099 -28839 -37615 -54934 -22224 31271 25452 12167
14863A2167k7664k5283K0423K210R68p13K334M5217n577l6922K426J5448k2605
$$ 12167 -15497 -40780 -20357 -18147 -17179 -17892 -15558 29659 24082 -12840 -10414 5034 -17571
14850a7571k7568j5962K6427Q052o942L8272j7252K8173M082P951L02l5239k3723
$$ -17571 -45139 -61101 -34674 -26622 -33564 4708 -12544 15629 19711 27662 27964 -7275 -30998
14837c0998j1223K4666k243M249p599j6609L1139Q387j4735J282j1213j9059n494
$$ -30998 -42221 -17555 -19798 -15549 -23148 -39757 -8618 -231 -14966 -13684 -24897 -43956 -49450
14824d9450M6216L1456R813r322q091m3680n5877n622K5231J8417k4015j6773
$$ -49450 -3234 28222 38035 28713 20622 -23058 -78935 -84557 -59326 -40909 -64924 -81697
14812h1697J4442K0050K4150K1579J7020J806p887J6754k8995k7107j5086J5649
$$ -81697 -67255 -47205 -23055 -1476 15544 17350 9463 26217 -2778 -29885 -44971 -29322
14800b9322Q563K1326q581M769K0785J2149l1404l9022L90J9992K8637O436k0556
$$ -29322 -20759 567 -8014 -3245 17540 29689 -1715 -40737 -40347 -20355 8282 14718 -5838
14787e838j4094j7515l0723J9418j5783L9252K5470j5680Q804L6646J2761j6529
$$ -5838 -19932 -37447 -68170 -48752 -64535 -25283 187 -15493 -6689 29957 42718 26189
14775B6189n6678j7287L5046J912l1136k2656N642J6549k131K4941o526p402j3778
$$ 26189 -30489 -47776 -12730 -10818 -41954 -64610 -58968 -42419 -44550 -19609 -26135 -33537 -47315
14762d7315L113N253l114l0541K5389O296J2869K342j3235J3263J9413k195K3433
$$ -47315 -44202 -38949 -42063 -72604 -47215 -40919 -28050 -25708 -38943 -25680 -6267 -8462 14971
14749A4971o067K446l13M565r538n23J7942L8351O680k4811o837j0642Q66k228
$$ 14971 8904 11350 11037 15602 6064 5541 23483 61834 68514 43703 36866 26224 27090 24862
14735B4862m7622m3604M4462N0436K2154m193k8397k2030j1559J5589J6880q239
$$ 24862 -22760 -66364 -21902 28534 50688 46495 18098 -3932 -15491 98 16978 8739
14723H739j0945k3625j726M0270K1693K7661n423j1188l6438l8253r421K3550
$$ 8739 -2206 -25831 -27557 12713 34406 62067 56644 45456 9018 -29235 -38656 -15106
14711a5106J7019l1174N144L054J639J9259l648j3876L3157k1465k6293l535J9571
$$ -15106 1913 -29261 -24117 -21063 -19424 -165 -3813 -17689 15468 -5997 -32290 -35825 -16254
14698a6254J2236p716j5124J0486r048j5840K0615J3158M33J9696P389n043r491
$$ -16254 -4018 -11734 -26858 -16372 -25420 -41260 -20645 -7487 -7054 12642 20031 14988 5497
14685E497r089j2646J0832K2589j9982j8599K0093K4577k0086j2895J2113M51
$$ 5497 -3592 -16238 -5406 17183 -2799 -21398 -1305 23272 3186 -9709 2404 2855
14673B855Q022j7087r106J8776N6200L9268k7718l0306j5851j6646p890K7407
$$ 2855 10877 -6210 -15316 3460 59660 98928 71210 40904 25053 8407 517 27924
14661B7924J5004m222j7467j0664j6605R915N6328K3148j7370o4175J012K1810
$$ 27924 42928 38706 21239 10575 -6030 3885 60213 83361 65991 1816 2828 24638
14649B4638l3652p785j3538n714N750M773O400L1183J7578j7887l0655l1676M327
$$ 24638 -9014 -16799 -30337 -36051 -30301 -25528 -19128 12055 29633 11746 -18909 -50585 -46258
14636d6258L9124K9485J4963l0839m1760M41L8228J0267l6312l1138J1024Q00
$$ -46258 -7134 22351 37314 6475 -35285 -34844 3384 13651 -22661 -53799 -42775 -41975
14624d1975O242L6400Q83q067m6020P901K2626K3994l0928j080o70J1966L1972
$$ -41975 -35733 667 1550 -6517 -52537 -44636 -22010 1984 -28944 -30024 -30694 -18728 13244
14611A3244j6036k9405j387P481M4019O4510J957l8549j7775j9733J7072K6260
$$ 13244 -2792 -32197 -33584 -26103 17916 82426 84383 45834 28059 8326 25398 51658
14599E1658j7134M213K9689n5610k9146j4093J9274R72J9140K3498m594j5939
$$ 51658 34524 38737 68426 12816 -16330 -30423 -11149 -10177 8963 32461 27867 11928
14587A1928l7162j2069o166o298J107K1020L9274n09l7229j1582J0517J9895K8726
$$ 11928 -25234 -37303 -43469 -49767 -48660 -27640 11634 11125 -26104 -37686 -27169 -7274 21452
14574B1452J6953o811Q842r015l3079m0589l36J9347Q176L6613R042k0083m7910
$$ 21452 38405 31594 40436 31421 -1658 -42247 -42583 -23236 -15060 21553 30595 10512 -37398
14561c7398J2769J830J1252l637J0456k881R91m635j9644m573j9263o330J4002
$$ -37398 -24629 -22799 -11547 -15184 -4728 -7609 -6618 -11253 -30897 -35470 -54733 -61063 -47061
14548d7061R096M419J6270L2799n853j5514L341P669J5199K8436J833j4829P994
$$ -47061 -37965 -33546 -17276 15523 9670 -5844 -2503 5166 20365 48801 50634 35805 43799
14535D3799j6029o929k8925o390j5130p513L6075l760k9040q62j2656L0610K0731
$$ 43799 27770 20841 -8084 -14474 -29604 -37117 -1042 -4802 -33842 -34704 -47360 -16750 3981
14522C981K9897J5977j2789J8492J4009K1530m5458m4055j4180j5905Q914K5037
$$ 3981 33878 49855 37066 55558 69567 91097 45639 1584 -12596 -28501 -19587 5450
14510E450Q169L515q580p683l5875l9529r714K8393J1987o997K0567K3493N728
$$ 5450 13619 17134 8554 871 -35004 -74533 -84247 -55854 -43867 -50864 -30297 -6804 -1076
14497a076J2659n390j8574J7004J2308J3679k2004j9560n55J1786J0058J3392
$$ -1076 11583 6193 -12381 4623 16931 30610 8606 -10954 -11509 277 10335 23727
14485B3727j1689J983j1152L821J6882J2736J4555l3634j3591J6414P995k7970
$$ 23727 12038 14021 2869 6690 23572 36308 50863 17229 3638 20052 28047 77
14473G7J0516J1422K99j9976j3023J5380O121j7101k558j5544K244M89l4269K6903
$$ 77 10593 22015 22314 2338 -10685 4695 10816 -6285 -8843 -24387 -22143 -21654 -55923 -29020
14459b9020P114J2010O921M820l38l1568L87M745K2508J8392r806m883M585k0523
$$ -29020 -21906 -9896 -2975 1845 1507 -30061 -29674 -24929 -2421 15971 6165 1282 5867 -14656
14445a4656J0649O456j7049j4145K9596J6045k9650J1701L5819J8520k7921k2303
$$ -14656 -4007 2449 -14600 -28745 851 16896 -12754 -1053 34766 53286 25365 3062
14433C062J0829k421r913m11J5087J6763P065Q33P913m3319m1770M1995L4075
$$ 3062 13891 11470 1557 1146 16233 32996 40061 40894 48807 5488 -36282 5713 39788
14420C9788j6223k0322J7620j0916o493J3436J595m569J0230K587P112O859k3908
$$ 39788 23565 3243 20863 9947 3454 16890 18485 13916 24146 26733 33845 40704 16796
14407A6796k4393r369j0319J7393P511j2084k7614k343K5117J4363m000Q978L0223
$$ 16796 -7597 -16966 -27285 -9892 -2381 -14465 -42079 -44422 -19305 -4942 -8942 36 30259
14394C0259k4434k2180j1121j0105J2295q705o834L2160k023k0566j2289J9916
$$ 30259 5825 -16355 -27476 -37581 -25286 -33991 -40825 -8665 -10688 -31254 -43543 -23627
14382b3627K4541K4579l0571l2874J1497j5460J4682L4290n050k7369J268p139
$$ -23627 914 25493 -5078 -37952 -26455 -41915 -27233 7057 2007 -25362 -24094 -31233
14370c1233k3910J2295K9912N105R233J9213K5649p62k2313m50r26K7060J4746
$$ -31233 -55143 -42848 -12936 -7831 1402 20615 46264 45502 23189 22739 21813 48873 63619
14357F3619j346k6900k4984o4247K6558L7805L0204p481Q751k4941k3921N254
$$ 63619 62273 35373 10389 -53858 -27300 10505 40709 33228 41979 17038 -6883 -1629
14345a629o777O69K1333R299l2179J0255K0409n246j5842q065j3402J502J8151
$$ -1629 -8406 -7737 13596 22895 -9284 971 21380 16134 292 -7773 -21175 -19673 -1522
14332a522K0437O444m367n4094n361J9623m898J3463n063N204J4393J6457K4363
$$ -1522 18915 25359 20992 -33102 -38463 -18840 -23738 -10275 -15338 -10134 4259 20716 45079
14319D5079o594K9540k0307m1518j1588R413J4319j857O228k4446m989o938k4609
$$ 45079 38485 68025 47718 6200 -5388 4025 18344 16487 22715 -1731 -6720 -13658 -38267
14306c8267M256J4233M502j0128Q633o950K8646K0727J3249O402l2609l9659Q26
$$ -38267 -34011 -19778 -15276 -25404 -16771 -23721 4925 25652 38901 45303 12694 -26965 -26139
14293b6139J6437K0203J2905J3528k073k9414M12J0484n112j8987p331M963R347
$$ -26139 -9702 10501 23406 36934 34861 5447 5859 16343 11231 -7756 -15087 -10124 -777
14280g77J7747K2215q317L1660q462l8294l7876m3152K5206K4590P212L0180J7416
$$ -777 16970 39185 30868 62528 54066 15772 -22104 -65256 -40050 -15460 -8248 21932 39348
14267C9348r439k5569J1117K0228J8761j4203q114m1388n360j5316M1627L8120
$$ 39348 29909 4340 15457 35685 54446 40243 32129 -9259 -14619 -29935 11692 49812
14255D9812j4308l5688J556N71q914j579l302K2089J2358J7497o150l02m2731
$$ 49812 35504 -184 1372 1943 -6971 -8550 -11852 10237 22595 40092 33942 33640 -9091
14242i091k5729J419K2631J9893K8287K618k713P703J178l6215j8433J0657K551
$$ -9091 -34820 -33401 -10770 9123 37410 40028 37315 45018 46196 9981 -8452 2205 4756
14229D756k0058Q245J0903Q805k882j2192j1829n267Q386l4881K9447M6743O140
$$ 4756 -15302 -7057 3846 12651 9769 -2423 -14252 -19519 -11133 -46014 -16567 30176 36316
14216C6316j510j6578k6011J1791N1601K099j6733m1491r696L2317j793l2027
$$ 36316 34806 18228 -7783 4008 55609 57708 40975 -516 -10212 22105 20312 -11715
14204a1715j6087J5765N577m501j7388K8636m663m82J2889J5236J4415j107j7514
$$ -11715 -27802 -12037 -6460 -10961 -28349 287 -4376 -4858 8031 23267 37682 36575 19061
14191A9061l4602j1059L8451K4495j8123p806j550Q405K908J6402n370k0896r35
$$ 19061 -15541 -26600 11851 36346 18223 10417 8867 17272 20180 36582 31212 10316 9381
14178I381N73K3496k7921j7590J5222j16j3133J0098q542M27K131Q901J6809j7057
$$ 9381 9954 33450 5529 -12061 3161 3045 -10088 10 -8532 -8105 -5974 2927 19736 2679
14164B679l0518m959P81J2085J8265m652l9356j5715O3108L8399k4841m328M186
$$ 2679 -27839 -32798 -32017 -19932 -1667 -6319 -45675 -61390 1718 40117 15276 10948 15134
14151A5134M115j8253o261p791J3070N357K5699P84N346k0386j3006K6834L121
$$ 15134 19249 996 -5265 -13056 14 5371 31070 31854 37200 16814 3808 30642 33763
14138C3763m7367Q365k0999L0098j59k810l153k5074k110j8541l8974L0914J8799
$$ 33763 -13604 -5239 -26238 3860 3701 891 -2262 -27336 -29446 -47987 -86961 -56047 -37248
14125c7248L7679J8084k116j2035j4634p490r434j4137M1895L6000K308K4601
$$ -37248 431 18515 16399 4364 -10270 -17760 -27194 -41331 564 36564 38872 63473
14113F3473k1654O956J514k0058j4777O589k1325J1001J1034M421l9987M203J8463
$$ 63473 41819 48775 50289 30231 15454 22043 718 11719 22753 27174 -12813 -8610 9853
14100I853J073q732j313k9403N220k7432n27J1616M7634J1557k2168j5858M507
$$ 9853 10926 2194 881 -28522 -23302 -50734 -51261 -39645 7989 19546 -2622 -18480 -13973
14087a3973r032M0878j0048L4510j0359j2088K987K0863p655l5186k5469l588
$$ -13973 -23005 17873 7825 42335 31976 19888 22875 43738 36083 897 -24572 -28160
14075b8160l9700J8277L5940j1087K4607N5749K1040K135k4993k5179k2411J9903
$$ -28160 -67860 -49583 -13643 -24730 -123 55626 76666 78801 53808 28629 6218 26121
14063B6121J4431K6653K695l4060k4831j9062J0160K3838J5897j4272k7301K3594
$$ 26121 40552 67205 69900 35840 11009 -8053 2107 25945 41842 27570 269 23863
14051B3863K8772R807n036J509l3030k4396j1931n630j995O909j8372m2198k76
$$ 23863 52635 62442 57406 58915 25885 1489 -10442 -16072 -18067 -11158 -29530 -71728 -72004
14038g2004J5697N0558J1391J0076J1942l856q711k631l3530m658L920n76l0473
$$ -72004 -56307 -5749 5642 15718 27660 23804 15093 12462 -21068 -25726 -21806 -22382 -52855
14025e2855m2437J3132N3094K0613l9037j3264K6098K4014J329l7258K7391J4041
$$ -52855 -95292 -82160 -29066 -8453 -47490 -60754 -34656 -10642 -9313 -46571 -19180 -5139
14013e139j3100j320J122P635k0948k583k4492J54K3121m952O775j9310L9315
$$ -5139 -18239 -19559 -18437 -10802 -31750 -34333 -58825 -58671 -35550 -40502 -33727 -53037 -13722
14000a3722K6220p391O7P972Q339Q049m2587j48J105n221J529j4809M894K3291
$$ -13722 12498 5107 5174 13146 21485 29534 -13053 -13201 -12096 -17317 -15788 -30597 -25703 -2412
13986b412q991j0428k707M1240j0955k0669K4534j150j1836L8922M3439o358J1469
$$ -2412 -11403 -21831 -24538 16702 5747 -14922 9612 8462 -3374 35548 78987 72629 84098
13973H4098k9338k8154n1113q795R8k2692J5863L1951k1522k2028L5476K6017
$$ 84098 54760 26606 -24507 -33302 -33204 -55896 -40033 -8082 -29604 -51632 -16156 9861
13961I861k1633j921L825k2308Q289j066r941M64J2204k8212j6405K4419J3382
$$ 9861 -11772 -13693 -9868 -32176 -23887 -24953 -34894 -34430 -22226 -50438 -66843 -42424 -29042
13948b9042M1355l410l372L2034Q122k4848k1923m2329j1829o485J7804J1312
$$ -29042 12313 8903 5531 37565 45687 20839 -1084 -43413 -55242 -61727 -43923 -32611
13936c2611K5318Q213k468j996K1324L46l085k1494P391J5434j9492p810J1137
$$ -32611 -7293 920 -1548 -3544 17780 18126 15041 -6453 938 16372 -3120 -10930 207
13923B07J8101L330p574K6261k5575J2424J0584O18k4295l3799K3687K36j4999
$$ 207 18308 21638 14064 40325 14750 27174 37758 38376 14081 -19718 3969 4205 -10794
13910a0794P67r500K8313K4097K3608J9004j3904L524Q718j563l0354j75P678
$$ -10794 -10027 -19527 8786 32883 56491 75495 61591 65115 73833 72270 41916 41741 49419
13897D9419J5192l8360l522m672l8818L1995M1726J1978j3572j9100l6797j2990
$$ 49419 64611 26251 22729 18057 -20761 11234 52960 64938 51366 32266 -4531 -17521
13885a7521L4459p476l852K3571J883K8516L389R02k9922j4322j9531R937j2424
$$ -17521 16938 9462 5610 29181 31064 59580 62969 63871 33949 19627 96 10033 -2391
13872b391O08J9527K1933R289n495o616j2176n0303J155J8488K028r15J3544J6614
$$ -2391 -1783 17744 39677 48966 43471 36855 24679 -25624 -24469 -5981 -3953 -4868 8676 25290
13858B5290J2633J9767P285j4944j7602q504k0653j1776j3718l362k342M570o157
$$ 25290 37923 57690 64975 50031 32429 23925 3272 -8504 -22222 -25584 -27926 -23356 -29513
13845b9513J0059m392q006O299L3545r419M593J070j4711J3169o153J4616K2707
$$ -29513 -19454 -23846 -31852 -25553 7992 -1427 3166 4236 -10475 2694 -3459 11157 33864
13832C3864M07r339N292r040K209J0537j4184k7006J5008j3904j7437k3860K8744
$$ 33864 34271 24932 30224 21184 23393 33930 19746 -7260 7748 -6156 -23593 -47453 -18709
13819a8709R453J3521j724J637j46P797k4564p770K4987L294R239N951J8494l3267
$$ -18709 -9256 4265 2541 4178 4032 11829 -12735 -20505 4482 7776 17015 22966 41460 8193
13805H193m514K7112r865p861J0681m806k9783L5790n761k5165r836R431K1590
$$ 8193 3679 30791 20926 13065 23746 18940 -10843 24947 19186 -5979 -15815 -6384 15206
13792A5206K5412J2844n793n8559m1957K9063J3925M0969P865l0870n978J8009
$$ 15206 40618 53462 47669 -10890 -52847 -23784 -9859 31110 38975 8105 2127 20136
13780B0136p380j8639R972K8653L18l5101l0794o51O38R369j5159J3883K5736
$$ 20136 12756 -5883 4089 32742 33060 -2041 -32835 -33486 -32848 -23479 -38638 -24755 981
13767I81k1334m6744o165K5070K4165K7961K7019J1751k9146k7680j0273q543
$$ 981 -20353 -67097 -73262 -48192 -24027 3934 30953 42704 13558 -14122 -24395 -32938
13755c2938J8315n3590j5499L9331J4138J9156O508k2293P177K8510k1083P398
$$ -32938 -14623 -68213 -83712 -44381 -30243 -11087 -4579 -26872 -19695 8815 -12268 -4870
13743d870n902K408J1864m0157k4215L9533J3632K1722q092j0940J7139K6773
$$ -4870 -10772 -8364 3500 -36657 -60872 -21339 -7707 14015 5923 -5017 12122 38895
13731C8895L1613j9665k2703l0055K8293K3490k3012j9001o78q929R389K6997
$$ 38895 70508 50843 28140 -1915 26378 49868 26856 7855 7177 -1752 7637 34634
13719C4634k0504l7750k113K7842J8887L7026j7215l1266K945j8740q419N753
$$ 34634 14130 -23620 -25733 2109 20996 58022 40807 9541 12486 -6254 -14673 -8920
13707h920l0652J5905L6147K4518n2707k3215K6698k230k5576J0379J5505K4368
$$ -8920 -39572 -23667 12480 36998 -15709 -38924 -12226 -14456 -40032 -29653 -14148 10220
13695A0220K1245R045j9486J707k4069k6695k1323J5119L6437J6723l5362j7166
$$ 10220 31465 40510 21024 22731 -1338 -28033 -49356 -34237 2200 18923 -16439 -33605
13683c3605J2752k5804k8651L2211N1364J4422K018K0196j1233k7326q514j938
$$ -33605 -20853 -46657 -75308 -43097 8267 22689 24707 44903 33670 6344 -2170 -4108
13671d108p228J6944O480j1189j6581K6601K6690m266k0151K178L5343J8044l3780
$$ -4108 -11336 5608 12088 899 -15682 10919 37609 33343 13192 15370 50713 68757 34977
13658C4977q816j1853l912O704P085P75K426M487J3014L017j8914k7318j4822
$$ 34977 26161 14308 10396 17100 24185 24960 27386 31873 44887 47904 28990 1672 -13150
13645a3150J9485J6717J0659q098k9870N215k396j3938J9096M3479k1634l3149
$$ -13150 6335 23052 33711 25613 -4257 958 -1438 -15376 3720 47199 25565 -7584
13633g584N004L6684k4191p344L3854K3612R009j6825j1406j4528p969j8060J5469
$$ -7584 -2580 34104 9913 2569 36423 60035 69044 52219 40813 26285 18316 256 15725
13620A5725K2972j408k6381L99j0507L244J528K4191j2115k5612L086n3072j1272
$$ 15725 38697 37289 10908 11307 800 4044 5572 29763 17648 -7964 -4878 -57950 -69222
13607f9222L2266M7310j9931K7730J056n2092m932L342J7443J8904J1922J917
$$ -69222 -36956 10354 -9577 18153 19209 -32883 -37815 -34473 -17030 1874 13796 15713
13595A5713J881K593K0606J8252l9156j5698M387O746J3631J176j9495n998l7652
$$ 15713 17594 20187 40793 59045 19889 4191 8578 15324 28955 30131 10636 4638 -33014
13582c3014k7457J4126J7870l5267K538L0653R302Q001R110L2060L955N2o617
$$ -33014 -60471 -46345 -28475 -63742 -61204 -30551 -21249 -13248 -4138 27922 31877 31929 25312
13569B5312l4164n1691r565J0035L7438L1193j6827j9802p814J3902N3213L4720
$$ 25312 -8852 -60543 -70108 -60073 -22635 8558 -8269 -28071 -35885 -21983 31230 65950
13557F5950k5627q531k2039j4784N4402M2865j3633k4677k2388k6432K654J2275
$$ 65950 40323 31792 9753 -5031 49371 92236 78603 53926 31538 5106 7760 20035
13545B0035O998O979J2093m1052j2363J763l1142l6290J3590J2998K3938j2884
$$ 20035 27033 34012 46105 5053 -7310 -5547 -36689 -72979 -59389 -46391 -22453 -35337
13533c5337J8423M6108j8049o869j4629K8148M9775q963l332j4468J8998K5287
$$ -35337 -16914 29194 11145 4276 -10353 17795 67570 58607 55275 40807 59805 85092
13521H5092Q083M1598K1203n323j3476o8246j5312l1237k8641R592k434J4094
$$ 85092 93175 134773 155976 150653 137177 68931 53619 22382 -6259 3333 899 14993
13509A4993K790k2304p158J0291N014q876K322J7669k101J5058j0488o319M0374
$$ 14993 17783 -4521 -11679 -1388 3626 -5250 -2928 14741 12640 27698 17210 10891 51265
13496E1265j0653k1951o578K0383J5569J2416o31l8981o486M7296K973k5730n497
$$ 51265 40612 18661 12083 32466 48035 60451 59820 20839 14353 61649 64622 38892 33395
13483C3395j687r415k7901n077J1410K3410K066q145o321R986o715j1760K7926
$$ 33395 31708 22293 -5608 -10685 725 24135 26201 18056 11735 21721 15006 3246 31172
13470C1172m057J8329j0065k8351J0968m1917j7497J4125M101L601q385K3142
$$ 31172 27115 45444 35379 7028 17996 -23921 -41418 -27293 -23192 -19591 -27976 -4834
13458d834J5440j9356J6515o079M120O229j6693m2150R958N1616L2849o72j4874
$$ -4834 10606 -8750 7765 1686 5806 12035 -4658 -46808 -36850 14766 47615 46943 32069
13445C2069k5137j2582j679j2589n606J9821J9440L138J2646M177L980J8434j1804
$$ 32069 6932 -5650 -7329 -19918 -25524 -5703 13737 16875 29521 33698 37678 56112 44308
13432D4308j2634R15J6538j4798K1368K1222j1635j6792q881K5771J6658P905
$$ 44308 31674 32589 49127 34329 55697 76919 65284 48492 39611 65382 82040 89945
13420H9945k6350m6469j806j3522L0060j0709j5534J9660p526M548J0127k0009
$$ 89945 63595 17126 15320 1798 31858 21149 5615 25275 17749 22297 32424 12415
13408A2415j1518K3384L0491j703k1424J2146j0290M283l492m440J3857N908k0418
$$ 12415 897 24281 54772 53069 31645 43791 33501 37784 34292 29852 43709 49617 29199
13395B9199m694L3386r496Q393Q539m1297J7500K386K2484N9801K2037N3837N7286
$$ 29199 24505 57891 48395 56788 65327 24030 41530 43916 66400 126201 148238 202075 259361
13382B59361Q1047P1736J34111K93677M64904M61165K34850O2768j6725j23299
$$ 259361 340408 412144 546255 839932 1304836 1766001 2000851 2063619 2046894 1923595
13372A923595j86187l12861l50351k87694k03344j18016p6203q4731n1716k7310
$$ 1923595 1737408 1424547 1074196 786502 583158 465142 388939 304208 252492 225182
13362B25182q469r114r74O702J3854o926l3710k8047l1433J3238K8214j7392k1079
$$ 225182 216713 207599 206625 213327 227181 220255 186545 158498 127065 140303 168517 151125 130046
13349A30046j2650k427m532l9352J1569l8379p1041k2279L2607k430o772M2472
$$ 130046 117396 114969 110437 71085 82654 44275 -26766 -49045 -16438 -18868 -25640 16832
13337A6832l66L5653K3147n5141r683K3810r438k293k5008J510J2234j8338O057
$$ 16832 16466 52119 75266 20125 10442 34252 24814 22521 -2487 -977 11257 -7081 -1024
13324a024L3323k0459q509J6976J660j3879m414K2012j7253J4369k646J0349l997
$$ -1024 32299 11840 3331 20307 21967 8088 3674 25686 8433 22802 20156 30505 26508
13311B6508j1326R295q697K9573j5766m6209K9322M7497j3903q172k631J7952
$$ 26508 15182 24477 15780 45353 29587 -16622 12700 60197 46294 38122 35491 53443
13299E3443L4295r111l4379l0761j2661P090L493k4271k1448O563J5779J3227
$$ 53443 87738 78627 44248 13487 826 7916 11409 -12862 -34310 -27747 -11968 1259
13287A259Q624n325P762P388k528J3313p096p323r855j0247k2845k225Q775M6401
$$ 1259 9883 4558 12320 19708 17180 30493 23397 16074 6219 -4028 -26873 -29098 -20323 26078
13273B6078k5883j3978J7421l5773k6913Q558L1772J9545L5587k2075N519K6139
$$ 26078 195 -13783 3638 -32135 -59048 -50490 -18718 827 36414 14339 19858 45997
13261D5997j8415j8262k1506p5905K964K9843K5276K8770J3872n430k0935M206
$$ 45997 27582 9320 -12186 -88091 -85127 -55284 -30008 -1238 12634 7204 -13731 -9525
13249i525K2950l011l9788o8204l7223J9011K327j4078L100M2309J0838O202r20
$$ -9525 13425 10414 -29374 -97578 -134801 -115790 -113463 -127541 -124441 -82132 -71294 -65092 -66012
13236f6012j0013J8039n434L1900N2252L0212K7978J6038m278p908J2094j1324
$$ -66012 -76025 -57986 -63420 -31520 20732 50944 78922 94960 90682 82774 94868 83544
13224H3544j9501k5223M425p150k8843K267L7676K7630k0438j4704K4241J3191
$$ 83544 64043 38820 43245 36095 7252 9519 47195 74825 54387 39683 63924 77115
13212G7115J5334N3436o136j3277j5782k8505j8668o731K021J7784k6849n531
$$ 77115 92449 145885 139749 126472 110690 82185 63517 56786 58807 76591 49742 44211
13200D4211J3403J3399m670k6698J2034m97L6877j4323l2571J1928M0326J5446
$$ 44211 57614 71013 66343 39645 51679 51182 88059 73736 41165 53093 93419 108865
13188A08865N6530M4349J7161J3511K0579K862m316J6728k9913k70J1886K3518
$$ 108865 165395 209744 226905 240416 260995 263857 259541 276269 246356 246086 257972 281490
13176B81490m6245l2536l6841m9067l9053J962P630Q962l734P802j7138K1591
$$ 281490 235245 202709 165868 116801 77748 79710 87340 96302 92568 100370 83232 104823
13164A04823j1451J2974n142k384k1342l3317J0557J2825J2215k8317m2956n314
$$ 104823 93372 106346 101204 98820 77478 44161 54718 67543 79758 51441 8485 3171
13152C171J1142J3585O756k178j4808j9329K7525M9290M2308O660j2654J7775
$$ 3171 14313 27898 34654 32476 17668 -1661 25864 75154 117462 124122 111468 129243
13140A29243J84O026P121j5709k2516K9992K0024j4710n260j229P382j1402l2655
$$ 129243 129427 135453 142574 126865 104349 134341 154365 139655 134395 133166 140548 129146 96491
13127I6491J7222K1763l617M0271N467k495j3531j5619k3887L613l5558l8540
$$ 96491 113713 135476 131859 172130 177597 175102 161571 145952 122065 125678 90120 51580
13115E1580l2899j1272K3963K839k7406l833N052M146K927O0866K2925k377p786
$$ 51580 18681 7409 31372 34211 6805 2972 8024 12170 15097 75963 98888 96511 88725
13102H8725j8015L0587N4193j6731n3929J9605j6802p568K9834J1786P041R0800
$$ 88725 70710 101297 155490 138759 84830 104435 87633 80065 109899 121685 128726 219526
13090B19526J19064J11612Q5314M7199J4183m892o280o0178o8699j10741q3813
$$ 219526 338590 450202 535516 582715 596898 592006 585726 525548 456849 346108 262295
13079B62295n2701k7115j5677n0807k1097R023j4952j1868m69J0213R709J2784
$$ 262295 209594 182479 166802 115995 94898 103921 88969 77101 76632 86845 96554 109338
13067A09338j429p162l5816l3776p16N5690J11326L5111N031Q3610Q9997M342
$$ 109338 107909 100747 64931 31155 30439 86129 197455 232566 237597 321207 411204 415546
13055D15546j16016o7315L6433O1460J0662m7780j8771k3761k3271J6559O336
$$ 415546 299530 232215 268648 330108 340770 292990 274219 250458 227187 243746 250082
13044B50082l6189l1880k938K4259L3089J2453m9051m6370L970J6277J2658R217
$$ 250082 213893 182013 179075 203334 236423 248876 199825 153455 157425 173702 186360 195577
13032A95577L321j6074N72K553M1525L3324j9663j8426k231M8303J5237K242j2790
$$ 195577 198898 182824 183396 185949 227474 260798 241135 222709 220478 268781 284018 286260 273470
13019B73470j039K3916n112k1810l21J2998J4106L0717K8152J3485r473R998n429
$$ 273470 272431 296347 291235 269425 269104 282102 296208 326925 355077 368562 359089 369087 363658
13006C63658K1776K7263r032l7550j2737j1304L6587M1726J0382J551J100J4368
$$ 363658 385434 412697 403665 366115 353378 342074 378661 420387 430769 432320 433420 447788
12994D47788L3614N0570M2836o506K4689R686L5415K8315N814r053p298M1230
$$ 447788 481402 531972 574808 568302 592991 602677 638092 666407 672221 663168 655870 697100
12982F97100k7290K1167N4948M4648O6097N5527J9173M1412O5840K1608M7062
$$ 697100 669810 690977 745925 790573 856670 912197 931370 972782 1038622 1060230 1107292
12971A107292P7217R3354R5565M9382R7206O2552N2741Q0838J28210J39909J78992
$$ 1107292 1184509 1277863 1373428 1422810 1520016 1582568 1635309 1716147 1844357 1984266 2163258
12960B163258K22496K30819K45941K66857K70173K95207L42563L73632M28605
$$ 2163258 2385754 2616573 2862514 3129371 3399544 3694751 4037314 4410946 4839551
12951D839551M95199N96887O50727P30908R33364J273304J560897J971296K567751
$$ 4839551 5334750 5931637 6582364 7313272 8246636 9519940 11080837 13052133 15619884
12942A5619884L366264M448009N875742P798994J0834110J6651808K8354624N1021206
$$ 15619884 18986148 23434157 29309899 37108893 47943003 64594811 92949435 143970641
12934A43970641Q2569903Q9641926N5209747J4071047n745221j6177768k9748437
$$ 143970641 226540544 316182470 371392217 385463264 379718043 363540275 333791838
12927C33791838n0863084o5983711o0865028m2926169k7038281j7218614j1387933
$$ 333791838 282928754 216945043 156080015 113153846 86115565 68896951 57509018
12920E7509018p772122n308827l268971j502648o97700j065319j694740k082723
$$ 57509018 49736896 44428069 41159098 39656450 38958750 37893431 36198691 34115968
12912C4115968k387946k718192l132916l312704k977473k368018j873268j519079
$$ 34115968 31728022 29009830 25876914 22564210 19586737 17218719 15345451 13826372
12904A3826372j238664j026129q79256p46371o85236o34921n58096m98088n06462
$$ 13826372 12587708 11561579 10682323 9935952 9250716 8615795 8057699 7559611 7053149
12895G053149m61393m77737m40622l70780l34409k84422k62410k24840k46620
$$ 7053149 6591756 6114019 5673397 5302617 4968208 4683786 4421376 4196536 3949916
12886C949916k20322j79795j79142j41863j41381j40536j17321j42632j90648
$$ 3949916 3729594 3549799 3370657 3228794 3087413 2946877 2829556 2686924 2496276
12877B496276j94255j43064j07483r7877r0321m1303k0583p1591p9959n8823m5326
$$ 2496276 2302021 2158957 2051474 1953597 1863276 1821973 1801390 1729799 1649840 1591017 1545691
12866A545691j00573r8524n6036k0465n6955j03407n5001n0633j0082m1434l2594
$$ 1545691 1445118 1346594 1290558 1270093 1213138 1109731 1054730 1004097 994015 952581 919987
12855I19987k6344j2005m9457n390k3181o4740m0380j6474k5742l4473p140k3584
$$ 919987 893643 881638 832181 826791 803610 738870 698490 682016 656274 621801 614661 591077
12843E91077p1468m6427J5313K1644j3464L73o409Q048J652l0939k4118p343k2154
$$ 591077 519609 473182 488495 510139 496675 497048 490639 498687 500339 469400 445282 437939 415785
12830D15785q92O577r565k1623l2862O835J0337j5255p5363k2080j509J1039K7649
$$ 415785 414893 421470 411905 390282 357420 364255 374592 359337 283974 261894 260385 271424 299073
12817B99073N926l8559j2948J782L3798p588J1298J1139Q525m751J5061M800r748
$$ 299073 304999 266440 253492 255274 289072 281484 292782 303921 312446 307695 322756 327556 317808
12804C17808L995L1939J0970k6091J2618j6347k4388j9561l613J5316J8258j4027
$$ 317808 321803 353742 364712 338621 351239 334892 310504 290943 287330 302646 320904 306877
12792C06877k1646l7956n1280M064L1607Q186J96r334k9003k4357l0528o0332
$$ 306877 285231 247275 195995 200059 231666 239852 240048 230714 201711 177354 146826 86494
12780H6494l4667q0030j59155r1972j0238q887J7506N0867N1916O4001O7168M7095
$$ 86494 51827 -28203 -187358 -279330 -289568 -298455 -280949 -230082 -178166 -114165 -46997 98
12768I8K7741N6756r50k5733K583J8633j9338j8373l4703J5331N5576M0012M3247
$$ 98 27839 84595 83645 57912 60495 79128 59790 41417 6714 22045 77621 117633 160880
12755A60880K7258k2271m866q071n667k021M8308L4187P111k3374J1746L5366
$$ 160880 188138 165867 161001 152930 147263 145242 193550 227737 234848 211474 223220 258586
12743B58586p686o2478p4567o3849o141J7734j4900m3981l9695P368l948K710
$$ 258586 250900 188422 113855 50006 43865 61599 46699 2718 -36977 -29609 -33557 -30847
12731c0847L4212j3237m561q512q590k4908N675L1008k1705J658O6742L6742l636
$$ -30847 3365 -9872 -14433 -22945 -31535 -56443 -50768 -19760 -41465 -39807 26935 63677 60041
12718F0041j3870k0059O818P794J0643L3918O609L9L1559l664j2112J1560j2343
$$ 60041 46171 26112 32930 40724 51367 85285 91894 91933 123492 119828 107716 119276 106933
12705A06933n7043l5429N727J4937J0589j0051K232K9015L4135N659j4409k3395
$$ 106933 49890 14461 20188 35125 45714 35663 37895 66910 101045 106704 92295 68900
12693F8900J3884K8982k7541l3277N328j8012l7186J9481O721K4094l364O021
$$ 68900 82784 111766 84225 50948 56276 38264 1078 20559 27280 51374 48010 54031
12681E4031L4070J3660L536K6010j1164o9851l9632o880J8047K0394k8749L968
$$ 54031 88101 101761 105297 131307 120143 50292 10660 3780 21827 42221 13472 17440
12669A7440J3167k8548p092K248L0720K8697M9779J2048l3788L967L0584k4068
$$ 17440 30607 2059 -5033 -2785 27935 56632 106411 118459 84671 88638 119222 95154
12657I5154n4587k5445l7209N480P079J7633l810j9467O480j4822o640M9711K6300
$$ 95154 40567 15122 -22087 -16607 -9528 8105 4295 -15172 -8692 -23514 -30154 19557 45857
12644D5857l409l7249l7415j0689L8584L881q828J5861J9306P800j0927q553L853
$$ 45857 42448 5199 -32216 -42905 -4321 -440 -9268 6593 25899 33699 22772 14219 18072
12631A8072Q87j9908M1545J4744n621K8941K7586O451N912K7791J9540Q781j7023
$$ 18072 18959 -949 40596 55340 49719 78660 106246 112697 118609 146400 165940 174721 157698
12618A57698J7126L6996J4091n6579k5793l3910j8584J7541m206K839N2470J9462
$$ 157698 174824 211820 225911 169332 143539 109629 91045 108586 104380 107219 159689 179151
12606A79151k7444p6787n347R74K3732R566J4327k921j2750p540R942K3508l2686
$$ 179151 151707 74920 69573 70547 94279 103845 118172 115251 102501 94961 104903 128411 95725
12593I5725q327n015l5266q994k0229Q008K7661Q551j3821k7856K5188J0591n457
$$ 95725 87398 82383 47117 38123 17894 25902 53563 62114 48293 20437 45625 56216 50759
12580E0759J200j4278J46k4618m574K1491K4868K2287Q946j0271M684p501j5335
$$ 50759 51959 37681 37827 13209 8635 30126 54994 77281 86227 75956 80640 73139 57804
12567E7804J055R643L6951J8623l7973j0704N195l5394o157l6488k5594K1969
$$ 57804 58859 68502 105453 124076 86103 75399 80594 45200 39043 2555 -23039 -1070
12555a070L5417L976O234m712J1252o25j1111Q800k929k4728K6254J5116K68J2680
$$ -1070 34347 38323 44557 39845 51097 50472 39361 48161 45232 20504 46758 61874 62142 74822
12541G4822Q345j0295n578k599l9662j688k232j6662o432K1100K2881K0944J99
$$ 74822 83167 72872 67294 64695 25033 23345 21113 4451 -1981 19119 42000 62944 63143
12528F3143l993L9524k7127j249J6629j270l7609j8648J7472L9497k831j414k9417
$$ 63143 59150 98674 71547 70298 86927 85657 48048 29400 46872 86369 83538 82124 52707
12515E2707k2188k6386j6221K0587Q973k2927k9031N684j5318L3017K6906K3425
$$ 52707 30519 4133 -12088 8499 17472 -5455 -34486 -28802 -44120 -11103 15803 39228
12503C9228Q542K4749R933r892l5117K0417O541Q323N008J124j0718L7179J7012
$$ 39228 47770 72519 82452 72560 37443 57860 64401 72724 77732 78856 68138 105317 122329
12490A22329J8081K6206J9843P3803J14043J44085K41932M02296M25594L28521
$$ 122329 140410 166616 186459 260262 374305 518390 760322 1162618 1588212 1916733
12480A916733J75799Q736n0667j46179k80984l68946l41825k25400j27508r6281
$$ 1916733 2092532 2101268 2050601 1904422 1623438 1254492 912667 687267 559759 463478
12470D63478r8342p3546o550J4538K605n5433k9762j8449k111J2562l3545R719
$$ 463478 365136 291590 285040 299578 302183 246750 216988 198539 196428 208990 175445 185164
12458A85164j383l4832l6899k5875j1220Q716J6502j7237j9269k0345l785J4191
$$ 185164 183781 148949 112050 86175 74955 83671 100173 82936 63667 43322 39537 53728
12446E3728L5624l120n033Q816j8616j0980j037Q131q558j7951n596J0477l0907
$$ 53728 89352 86232 81199 90015 71399 60419 59382 67513 58955 41004 35408 45885 14978
12433A4978k517J9454R199q806l0500k0365J2049K2628J5335J2444K87m212l2336
$$ 14978 12461 31915 41114 32308 1808 -18557 -6508 16120 31455 43899 44186 39974 7638
12420G638J2855j5121o024j4677o546O941j2959j1924M2341p65L3670J9102J2350
$$ 7638 20493 5372 -652 -15329 -21875 -14934 -27893 -39817 2524 1759 35429 54531 66881
12407F6881j3578j8463k4956l0540p640K8773L9890O248L622q371j2750k8969
$$ 66881 53303 34840 9884 -20656 -28296 477 40367 46615 50237 41866 29116 147
12395A47o60L2046J1177l8458o05J2346m845O093Q611p286J38l407j3606j4941
$$ 147 -513 31533 42710 4252 3647 15993 11148 17241 25852 18566 18704 15297 1691 -13250
12381a3250M3864p185j2513k9844k5927Q342L5841n486k572J2401J1135K6536
$$ -13250 30614 23429 10916 -18928 -44855 -36513 -672 -6158 -8730 3671 14806 41342
12369D1342j3133j0829J851N402J0337J1317L5533Q033l4333l7081k3R119K3802
$$ 41342 28209 17380 19231 24633 34970 46287 81820 89853 55520 18439 18416 27535 51337
12356E1337j5041J326j493j4309l302K2396j0500K9459O599k6135J8239j4124
$$ 51337 36296 37622 36129 21820 18518 40914 30414 59873 66472 40337 58576 44452
12344D4452k634k8877J1335J335P658P191q193p097k928J3631l3314n100J8239
$$ 44452 41818 12941 24276 25611 33269 40460 32267 25170 22242 35873 2559 -2541 15698
12331A5698K4284J2988j4170k569p367J8485k6854m7923M4041L6359j6686m1125
$$ 15698 39982 52970 38800 36231 28864 47349 20495 -27428 16613 52972 36286 -4839
12319d839m4409J2295j0716j0396J4485M1520M4887K5612j6909m8438j9357Q244
$$ -4839 -49248 -36953 -47669 -58065 -43580 -2060 42827 68439 51530 3092 -16265 -8021
12307h021L2390K1585k9481k3505J0825J9268j5285J8958M6393K674n3024l2923
$$ -8021 24369 45954 16473 -7032 3793 23061 7776 26734 73127 75801 22777 -10146
12295a0146M3637j7729R009R787n720K1696j332m4803j1515j3180J3091j2755
$$ -10146 33491 15762 24771 34558 28838 50534 49202 4399 -7116 -20296 -7205 -19960
12283a9960R807K6774J1756j8346K2047j259j9056J6852m786l400J4193q179k6399
$$ -19960 -10153 16621 28377 10031 32078 30819 11763 28615 23829 20429 34622 26443 44
12270D4k2505l6561K285O365j3963K7225m665j0913K274K6059J0201o881j0925
$$ 44 -22461 -59022 -56737 -50372 -64335 -37110 -41775 -52688 -50414 -24355 -14154 -21035 -31960
12257c1960P024m156m36K1314K9422k0156L1389J5650K515R22m4793n264n36K2525
$$ -31960 -24936 -29092 -29528 -8214 21208 1052 32441 48091 50606 51528 6735 1471 935 23460
12243B3460k457q159N096j0485r787K0384J3749J307n199L6394J1720k8118m3281
$$ 23460 21003 12844 17940 7455 -2332 18052 31801 33108 27909 64303 76023 47905 4624
12230D624j3003K4K2939K2606k281q04J685l480j1779k6660k4954L7458M5453
$$ 4624 -8379 -8355 14584 37190 34909 34105 35790 32310 20531 -6129 -31083 6375 51828
12217E1828J5741k5872l5433j4732K9227j1376P349k3003k2694L7767J9026j4145
$$ 51828 67569 41697 6264 -8468 20759 9383 16732 -6271 -28965 8802 27828 13683
12205A3683l6931k0106P135J9130J8029k0355o971r142k4197J3796N4334j8665
$$ 13683 -23248 -43354 -36219 -17089 940 -19415 -26386 -35528 -59725 -45929 8405 -10260
12193a0260j0958k5896K032J892K0723Q320p706j1942L5639J1356j8033l083k824
$$ -10260 -21218 -47114 -45082 -43190 -22467 -14147 -21853 -33795 1844 13200 -4833 -7916 -10740
12180a0740j8482p264o385L418K6643L2944j1480J381j3050r281l24J0126l619
$$ -10740 -29222 -36486 -42871 -39453 -12810 20134 8654 10035 -3015 -12296 -12620 -2494 -6113
12167f113k9510l4313J4735K2799K2138K1998k3318J8485L3759l9210o65K1131
$$ -6113 -35623 -69936 -55201 -32402 -10264 11734 -11584 6901 40660 1450 785 21916
12155B1916J4214j3410k1735k2585r80K9499J5300J1594j8409O594j1656k0302
$$ 21916 36130 22720 985 -21600 -22580 6919 22219 33813 15404 21998 10342 -9960
12143i960N283J3866o592K1966o52k848j9622K672p436k5647k7096K2550K4392
$$ -9960 -4677 9189 2597 24563 23911 21063 1441 4113 -3323 -28970 -56066 -33516 -9124
12130i124M939m828k2025k5448j5904L1266K9604J2722O247L655n196K719o324
$$ -9124 -4185 -9013 -31038 -56486 -72390 -41124 -11520 1202 7449 11104 5908 8627 2303
12117B303j9690m4488J802J8716O7578K2350k4180q604N396P556M59N064L4805
$$ 2303 -17387 -61875 -60073 -41357 26221 48571 24391 15787 21183 28739 29198 34262 69067
12104F9067n473r147k6452k0494k4651k1024O714J7233M8363p484L470j7237l9778
$$ 69067 63594 54447 27995 7501 -17150 -38174 -31460 -14227 34136 26652 30122 12885 -26893
12091b6893l2409J6141k325j2533L6656M3846J8772J1534L463l3583J3124m436
$$ -26893 -59302 -43161 -45486 -58019 -21363 22483 41255 52789 56252 22669 35793 31357
12079C1357J4665k1073j4260J3099K6581L4357J1655m6272k5791j2920r827R385
$$ 31357 46022 24949 10689 23788 50369 84726 96381 50109 24318 11398 1571 10956
12067A0956J0790k9815l8703k9519L568L6831N0481K5825J2160m7067l9807j4440
$$ 10956 21746 -8069 -46772 -76291 -72723 -35892 14589 40414 52574 5507 -34300 -48740
12055d8740J8592K4810L0137k8784j6735K8978J9058P450n930p49k6210p615J6518
$$ -48740 -30148 -5338 24799 -3985 -20720 8258 27316 34766 28836 28087 1877 -5738 10780
12042A0780m462r338k4904j0276N8897O503k729j3140j5892R170p141J1487j4489
$$ 10780 6318 -3020 -27924 -38200 20697 27200 24471 11331 -4561 4609 -2532 8955 -5534
12029e534J1845P467n942j1234j1681q381Q680J0405n116J1145K114l189O555
$$ -5534 6311 13778 7836 -3398 -15079 -23460 -14780 -4375 -9491 1654 3768 579 7134
12016G134J4726m6803k5480k1209l066N4150R660o638j9561M1577j2388q197L3992
$$ 7134 21860 -24943 -50423 -71632 -74698 -20548 -10888 -17526 -37087 4490 -7898 -16095 17897
12003A7897J2047j2846l3203k7617M401L2731R982j8163p745q662j8937R201J9787
$$ 17897 29944 17098 -16105 -43722 -39321 -6590 3392 -14771 -22516 -31178 -50115 -40914 -21127
11990b1127L524k3343P857j3752k0298q379M3469K0224L8876K9842p602l3881
$$ -21127 -17603 -40946 -33089 -46841 -67139 -75518 -32049 -11825 27051 56893 49291 15410
11978A5410k1698j7253O877L1602K8579K4289j528R640L865k6279k1722k4627
$$ 15410 -6288 -23541 -16664 14938 43517 67806 66278 75918 79783 53504 31782 7155
11966G155j3792l5691J0819J5744L300M462L303j0412k718Q391k512j4482R875
$$ 7155 -6637 -42328 -31509 -15765 -12465 -8003 -4700 -15112 -17830 -9439 -11951 -26433 -16558
11953a6558Q808L3790J8719j7941p138J0867l6031J2460m856J9138N8918L655
$$ -16558 -7750 26040 44759 26818 19680 30547 -5484 6976 2120 21258 80176 83831
11941H3831l6581k9733K2738J6014K299l4497K392J0497L0161j4753l689J9478
$$ 83831 47250 17517 40255 56269 58568 24071 26463 36960 67121 52368 48679 68157
11929F8157k545j784l9618m71m997n5621k3002J348L1165K7733k3435J5366J1206
$$ 68157 65612 63828 24210 23739 18742 -36879 -59881 -58533 -27368 365 -23070 -7704 3502
11916C502r776j6870R028J0390P981K7017O099l556M161l4911N93j8831k5105
$$ 3502 -6274 -23144 -14116 -3726 4255 31272 37371 33815 37976 3065 3658 -15173 -40278
11903d0278K2454N127Q480k8192m1196K9864M0419K1161J0421K0401l7675l6044
$$ -40278 -17824 -12697 -4217 -32409 -73605 -43741 -3322 17839 28260 48661 10986 -25058
11891b5058L0896R636K733q046k5325K3453J7625j0124l6152p55O370j9966n164
$$ -25058 5838 15474 18207 10161 -15164 8289 25914 15790 -20362 -21117 -14747 -34713 -39877
11878c9877P43K1854K3085j1018K3742n978m003N341j3293K026j560J4542J9486
$$ -39877 -39134 -17280 5805 -5213 18529 12551 8548 13889 596 2622 1062 15604 35090
11865C5090l3207o794k1127j9257L194J1961K7640j2295k7630L4230j3720m370
$$ 35090 1883 -4911 -26038 -45295 -42101 -30140 -2500 -14795 -42425 -8195 -21915 -26285
11853b6285R156L846Q08r58K6203L6804j0538n5509J21K753l2171K240K0579J1909
$$ -26285 -17129 -13283 -12475 -13433 12770 49574 39036 -16473 -16352 -13599 -45770 -43530 -22951 -11042
11839a1042J8534N569j6349k0169K507j063n755L8476J9686l0033J1444J7317
$$ -11042 7492 13061 -3288 -23457 -20950 -22013 -27768 10708 30394 361 11805 29122
11827B9122r754K1406K6028J3735j4006m1548m1824p451K0111K0701o145P699
$$ 29122 19368 40774 66802 80537 66531 24983 -16841 -24292 -4181 16520 10375 18074
11815A8074K2915J8723j8874l1226j644m387n944k4303j8652J1008J9956j4651
$$ 18074 40989 59712 40838 9612 7968 3581 -2363 -26666 -45318 -34310 -14354 -29005
11803b9005R175j1015j029M5693j641K8980p711k7032j4715O089n469j7227K7680
$$ -29005 -19830 -30845 -31874 13819 12178 41158 33447 6415 -8300 -2211 -7680 -24907 2773
11790B773K6773K9425j0881j2169j7384j8747O80M165p255R00J6442K5594K704
$$ 2773 29546 58971 48090 35921 18537 -210 470 4635 -2620 -1720 14722 40316 43020
11777D3020J2339m3577l2530L6283J6678k2154k3179K1507J2573K84j5019N060
$$ 43020 55359 11782 -20748 15535 32213 10059 -13120 8387 20960 21244 6225 11285
11765A1285Q121k2038m7245o823m766j44M1605L7935J4586k4813n7431m054J0973
$$ 11285 19406 -2632 -49877 -56700 -61466 -61610 -20005 17930 32516 7703 -49728 -53782 -42809
11752d2809J1323J4888l9047K1565J5720p99J149J2734k6958k4013j127L264J5536
$$ -42809 -31486 -16598 -55645 -34080 -18360 -19159 -18010 -5276 -32234 -56247 -57374 -54110 -38574
11739c8574L2188l908K4696n891l9546n758J1721J6803j1139j2148K7123k8004
$$ -38574 -6386 -10294 14402 8511 -31035 -36793 -25072 -8269 -19408 -31556 -4433 -32437
11727c2437j3641k1681J4619M6721N1535j8777m4036k6334j5135K0379J3323l3465
$$ -32437 -46078 -67759 -53140 -6419 45116 26339 -17697 -44031 -59166 -38787 -25464 -58929
11715e8929l391p416L263L6107K8162l9948j365L5062J9008K5791L90J4069J0970
$$ -58929 -62320 -69736 -66473 -30366 -2204 -42152 -43517 -8455 10553 36344 36734 50803 61773
11702F1773l4393o4152J4346K2263K5725l417m189O922l0723j2220M8756K898
$$ 61773 27380 -36772 -22426 -163 25562 22145 17956 24878 -5845 -18065 30691 33589
11690C3589j3240Q98k0164j8682K5324j90q721K2989k4514m474J751L575K8821
$$ 33589 20349 21247 1083 -17599 7725 7535 -1186 21803 -2711 -7185 -5434 -1859 26962
11677B6962j1444l6312k3200R780Q062n596J4549L1796Q187j7804M2305j7909
$$ 26962 15518 -20794 -43994 -34214 -26152 -31748 -17199 14597 22784 4980 47285 29376
11665B9376k1660l65o2475m7623J2592M0093J0570O973L2501m2320k8847K9836
$$ 29376 7716 7351 -55124 -102747 -90155 -50062 -39492 -32519 -18 -42338 -71185 -41349
11653d1349K4005L6901J1890p864j6748k5017l8787j2136J1252J249L2731K6246
$$ -41349 -17344 19557 31447 23583 6835 -18182 -56969 -69105 -57853 -56604 -23873 2373
11641B373j5923j1614N013M109j3609J4291k343L700K9388K3124l1274k6493L114
$$ 2373 -13550 -25164 -20151 -16042 -29651 -15360 -17703 -14003 15385 38509 7235 -19258 -16144
11628a6144J3250M8715q770l7809l4700k0941j8879K5208J1003L925L3765j9724
$$ -16144 -2894 45821 37051 -758 -35458 -56399 -75278 -50070 -39067 -35142 -1377 -21101
11616b1101J7875J971J1666J5776O264l1398J574M2389L3244J7571j0432p734
$$ -21101 -3226 -1255 10411 26187 32451 1053 2627 45016 78260 95831 85399 77665
11604G7665j1647l7068J6095J4152K096m869L989J9295j0828l3351J2712j6882
$$ 77665 66018 28950 45045 59197 61293 56424 60413 79708 68880 35529 48241 31359
11592C1359l141j9229K3831j501J6572j5454l0710L7332K605j8301k697J6023
$$ 31359 28218 8989 32820 31319 47891 32437 1727 39059 41664 23363 20666 36689
11580C6689J4552k8440k5746J1670L946p247R72k3987M4824K8479j6404L3003
$$ 36689 51241 22801 -2945 8725 12671 5424 6396 -17591 27233 55712 39308 72311
11568G2311j5869m36n600o61m1505n1213n52J7446L5291J7118R883k4698k294
$$ 72311 56442 56006 50406 49745 8240 -42973 -43525 -26079 9212 26330 36213 11515 9221
11555I221Q970J6884j7598l166o038j3455j1392j1080j1182K4603K099j0027K3581
$$ 9221 18191 35075 17477 14311 8273 -5182 -16574 -27654 -38836 -14233 -12134 -22161 1420
11542A420K5945J5380l664m9344J6143j5846j4394M234o825P90n275M1274j4438
$$ 1420 27365 42745 39081 -10263 5880 -9966 -24360 -20126 -26951 -26161 -31436 9838 -4600
11529d600k7892K0994j9323k0200k567K7872M3647k741q643K6664j4670j0478
$$ -4600 -32492 -11498 -30821 -51021 -53588 -25716 17931 15190 6547 33211 18541 8063
11517H063J1417k1110n887J4539J4210J5408l8676k0553n049K100j3679j4286
$$ 8063 19480 -1630 -7517 7022 21232 36640 -2036 -22589 -27638 -25538 -39217 -53503
11505e3503M251N2233K0507J4068K4711k5886K217P859j3251l4554J2724K9337
$$ -53503 -49252 2981 23488 37556 62267 36381 38598 46457 33206 -1348 11376 40713
11493D0713j4439m427j7777J8580M87k4951j8N095K042k0434J1853O47P138K7489
$$ 40713 26274 21847 4070 22650 23137 -1814 -1832 3263 5305 -15129 -3276 -2629 4509 31998
11479C1998k4699j1735L613M081o584k3405m61L9225J8765J7866k1089k0456N066
$$ 31998 7299 -4436 -823 3258 -3326 -26731 -27192 12033 30798 48664 27575 7119 12185
11466A2185n151l4399j3661J0944K8683L5784L6385L6798O506n734k389l297m0968
$$ 12185 7034 -27365 -41026 -30082 -1399 34385 70770 107568 114074 108340 105951 102654 61686
11453F1686n0540L232K3745k3311l7712j4817K0675l43K3455l6119l526j39J533
$$ 61686 11146 14378 38123 14812 -22900 -37717 -17042 -17385 6070 -30049 -33575 -33714 -32181
11440c2181j2194R688J6560J4623M7981J3092k6708q377k0250k0605k4381j1124
$$ -32181 -44375 -34687 -18127 -3504 44477 57569 30861 22484 2234 -18371 -42752 -53876
11428e3876j2138K422K3358J3934o43K669M9091j729j1096m4414P294n657n953
$$ -53876 -66014 -63592 -40234 -26300 -26943 -24274 24817 23088 11992 -32422 -25128 -30785 -36738
11415c6738R92M65L7937K9240M8044j0024k6357k5986k8627M651j4583M964l0634
$$ -36738 -35746 -35281 2656 31896 79940 69916 43559 17573 -11054 -6403 -20986 -16022 -46656
11402d6656M520Q034j9052j490L403K4117J6601k2803J4789K1612j8899j5757
$$ -46656 -42136 -34102 -53154 -54644 -51241 -27124 -10523 -33326 -18537 3075 -15824 -31581
11390c1581K3800k4794J0048K254J6437J8483Q004J4126k3644m7234r180k069
$$ -31581 -7781 -32575 -22527 -20273 -3836 14647 22651 36777 13133 -34101 -43281 -45350
11378d5350R317K1383K7371j3577M361J4356J2914o459K6943p506j3887p19q046
$$ -45350 -36033 -14650 12721 -856 3505 17861 30775 24316 51259 43753 29866 29147 21101
11365B1101p763j8682k859J581j260p501m3437k5517K4095J7319r035o988P859
$$ 21101 13338 -5344 -8203 -6622 -7882 -15383 -58820 -84337 -60242 -42923 -51958 -58946 -51087
11352e1087M0333N4422J2141l8120j2678n686p248O436j8600j9154M930l0764
$$ -51087 -10754 43668 55809 17689 5011 -675 -7923 -1487 -20087 -39241 -34311 -65075
11340f5075l7556L3860J2075p836J8294L4850L1533l621k9822o62J0422L5230
$$ -65075 -102631 -68771 -56696 -64532 -46238 -11388 20145 16524 -13298 -13960 -3538 31692
11328C1692k0737R304J4022Q992k3036k5796k5187l0544K8731P714J0536L4432
$$ 31692 10955 20259 34281 43273 20237 -5559 -30746 -61290 -32559 -24845 -14309 20123
11316B0123L0608j2324k6870j8140l1372p82j8045J1656J988l397L5818k2796
$$ 20123 50731 38407 11537 -6603 -37975 -38757 -56802 -45146 -43158 -46555 -10737 -33533
11304c3533j1972L0407J1213j0121p542k6077N294j539R626L8904L653p342L6787
$$ -33533 -45505 -15098 -3885 -14006 -21548 -47625 -42331 -43870 -34244 4660 8313 971 37758
11291C7758J0636j4843l107P897J7674K8844l6709j7091k6507k3124p844n31q599
$$ 37758 48394 33551 30444 38341 56015 84859 48150 31059 4552 -18572 -26416 -26947 -35546
11278c5546J7440L4744l4453p144M3708j2071j8740K867r355k1726M2506J7803
$$ -35546 -18106 16638 -17815 -24959 18749 6678 -12062 -9195 -18550 -40276 2230 20033
11266B0033J6866K381r275m4338M8191J1565k6252q746L581k3416m1466j1551
$$ 20033 36899 39280 30005 -14333 33858 45423 19171 10425 14006 -9410 -50876 -62427
11254f2427K1785L4102N3199L0152l5750k8998l0330O755J6144K1724j0393j014
$$ -62427 -40642 -6540 46659 76811 41061 12063 -18267 -11512 4632 26356 15963 14949
11242A4949q082j6779L276o786k5460O759Q028J345J4241o41J1006j0148n2928
$$ 14949 6867 -9912 -6636 -13422 -38882 -32123 -24095 -22750 -8509 -9150 1856 -8292 -61220
11229f1220k1280M2115K0118N250K184j4435Q083R05m4706l0374N087J6951M70
$$ -61220 -82500 -40385 -20267 -15017 -12833 -27268 -19185 -18280 -62986 -93360 -88273 -71322 -70852
11216g0852j0607K814K4117p545k0931M388M2424K7753J505J4689J0544L2327
$$ -70852 -81459 -78645 -54528 -62073 -83004 -78616 -36192 -8439 -6934 7755 18299 50626
11204E0626q447M481n1242k9358L1863o795j3219K1918O640N400L0007n114l3828
$$ 50626 42179 46660 -4582 -33940 -2077 -8872 -22091 -173 6467 11867 41874 36760 2932
11191B932o191j2901j7285p265J8378N375n178k002j3317n259N600K2397N0577
$$ 2932 -3259 -16160 -33445 -40710 -22332 -16957 -22135 -24137 -37454 -42713 -37113 -14716 35861
11178C5861J692O06p130q958k320K1016l4596N253j561k3505N843k2187J773K1492
$$ 35861 37553 38159 31029 22071 19751 40767 6171 11424 9863 -13642 -7799 -29986 -28213 -6721
11164f721J9465J1980m699o304N463L427p0991p586J4616L0382J1876k019O767
$$ -6721 12744 24724 20025 13721 19184 22611 -48380 -55966 -41350 -10968 908 -1111 5656
11151E656j0081k360j1686k4981j0952J4547L666J0449l7358j5970P895K5936
$$ 5656 -4425 -6785 -18471 -43452 -54404 -39857 -36191 -25742 -63100 -79070 -71175 -45239
11139d5239K3463K496J989K2791j4077k2441L25Q984k187k5022j364K9855K2834
$$ -45239 -21776 -19280 -17291 5500 -8577 -31018 -30693 -21709 -23896 -48918 -50282 -20427 2407
11126B407j3495p398Q549k3036R532M0197j5641l1573M628J9280Q728k205l8128
$$ 2407 -11088 -18486 -9937 -32973 -23441 16756 1115 -30458 -25830 -6550 2178 -27 -38155
11113c8155k835J974O590n51m612L9636L1143j3697k9903L723J6093j4268m1606
$$ -38155 -40990 -39016 -32426 -32977 -37589 2047 33190 19493 -10410 -6687 9406 -4862 -46468
11100d6468r628O685j630M179P152m689K315n393J6690l818o3570K3819O6688
$$ -46468 -56096 -49411 -51041 -46862 -39710 -44399 -42084 -47477 -30787 -34605 -98175 -74356 -7668
11087g668J3078k0098k3533l3157J2572l587L7994M0231J5127m1140l6046k9216
$$ -7668 5410 -14688 -38221 -71378 -58806 -62393 -24399 15832 30959 -10181 -46227 -75443
11075g5443J8383K3664J8343K932j8506j0665j0143J9532L5233m232j3123l5018
$$ -75443 -57060 -33396 -15053 -12121 -30627 -41292 -51435 -31903 3330 -902 -14025 -49043
11063d9043j9570J3637l62J5455L8248K276J0055j6623k2978J6601N903J7487
$$ -49043 -68613 -54976 -55338 -39883 -1635 641 10696 -5927 -28905 -12304 -6401 11086
11051A1086l645q197j0943q427q188K1405K3300L3792o644p6717l9306q421N4078
$$ 11086 7441 -756 -11699 -20126 -28314 -6909 16391 50183 43539 -33178 -72484 -80905 -26827
11038b6827J9244r286j360j3685Q912K623j6325l3011K1811j5222k1528p69L8075
$$ -26827 -7583 -16869 -18229 -31914 -23002 -20379 -36704 -69715 -47904 -63126 -84654 -85423 -47348
11025d7348K6299J9294j162K7097J3710j7374N718p439j8650j8550j5426R685
$$ -47348 -21049 -1755 -2917 24180 37890 20516 26234 18795 145 -18405 -33831 -24146
11013b4146L1080l6989K378L3001k9219K4762j8179j5371K6634L993n15j0850
$$ -24146 6934 -30055 -27677 5324 -23895 867 -17312 -32683 -6049 -2056 -2571 -13421
11001a3421K0601L3410J9717m0865l0022j616J5999L0770L1249k7236L977N419
$$ -13421 7180 40590 60307 19442 -10580 -12196 3803 34573 65822 38586 42563 47982
10989D7982j9663l5331r415k6989N663J87k8289K6981N4727J1086l20J9466k9887
$$ 47982 28319 -7012 -16427 -43416 -37753 -37566 -65855 -38874 15853 26939 26619 46085 16198
10976A6198r486K8347J1464o193k9381K6595m486m109j6652j4903P238k8880q257
$$ 16198 6712 35059 46523 40330 10949 37544 33058 28949 12297 -2606 4632 -24248 -32505
10963c2505M4313o165k1084J3373k5363l220J9995k130O109K5945k1394l3542
$$ -32505 11808 5643 -15441 -2068 -27431 -30651 -10656 -12786 -6677 19268 -2126 -35668
10951c5668P16J4079J7167j9321j7665J8541K7720J3401j2537l1084l6582k3562
$$ -35668 -34952 -20873 -3706 -23027 -40692 -22151 5569 18970 6433 -24651 -61233 -84795
10939h4795K103J0935M7467j52P062J7817K500m9756K4878J1145l998M505N18
$$ -84795 -82692 -71757 -24290 -24442 -17380 437 2937 -46819 -21941 -10796 -14794 -10289 -9771
10926i771J5430p576k7117K7094L7906J4987o624k3115M671P461q394J2849j5302
$$ -9771 5659 -1917 -29034 -1940 35966 50953 44329 21214 25885 33346 24952 37801 22499
10913B2499j7141k5066j7247K9303N0305K537l1830o12J205L704j7952k0038J5289
$$ 22499 5358 -19708 -36955 -7652 42653 45190 13360 12748 13953 17657 -295 -20333 -5044
10900e044J4884N095l1188j323J2660j6896J4883J4157j2253k0773k0104J920
$$ -5044 9840 14935 -16253 -17576 -4916 -21812 -6929 7228 -5025 -25798 -45902 -43982
10888d3982J3979K5266Q373k3866J1271k5947J7583L3451L0909J4040k3602k7534
$$ -43982 -30003 -4737 3636 -20230 -8959 -34906 -17323 16128 47037 61077 37475 9941
10876I941k3609o531N3239N083J3957j1865m0735q691K6316J3759l3690l5712
$$ 9941 -13668 -20199 33040 38123 52080 40215 -520 -9211 17105 30864 -2826 -38538
10864c8538J75j217j5148L2194K2961J6759J6990j525j6777m1849K818K0078k5869
$$ -38538 -38363 -39580 -54728 -22534 427 17186 34176 32651 15874 -25975 -23157 -3079 -28948
10851b8948L118J2459j6887L7310m235l2781K8308R545j3621q669m240o936j652
$$ -28948 -25830 -13371 -30258 7052 2817 -29964 -1656 7889 -5732 -14401 -18641 -25577 -27229
10838b7229L0017n76j5759K0537j0699j3531Q325J7382q586K0004J0990k5114
$$ -27229 2788 2212 -13547 6990 -3709 -17240 -8915 8467 -119 19885 30875 5761
10826E761k0738j0460M371J9577o796N480O839K1060J2052m5917l5910j0699K6958
$$ 5761 -14977 -25437 -21066 -1489 -8285 -2805 4034 25094 37146 -8771 -44681 -55380 -28422
10813b8422J3845j9601J6132j7284K0274L7702q955q62O401j9549J5760p954j4981
$$ -28422 -14577 -34178 -18046 -35330 -15056 22646 13691 12829 19230 -319 15441 7487 -7494
10800g494j2219q144K0403j4979N632q403L176M6147m567j3999n42J1718J7107
$$ -7494 -19713 -27857 -7454 -22433 -16801 -25204 -22028 24119 19552 5553 5011 16729 33836
10787C3836j5785J9088p60k0397j4489j7367K043l897n356L894J9836j4145J1483
$$ 33836 18051 37139 36379 15982 1493 -15874 -13831 -17728 -23084 -19190 646 -13499 -2016
10774b016m139m583r07j1616J5017K094K087j1880k9579K7334M341J2465k6685
$$ -2016 -6155 -10738 -11645 -23261 -8244 -6150 -4063 -15943 -45522 -18188 -13847 -1382 -28067
10761b8067m2372J4830J6026j6819m0902J610M8581M801J882j6468K1689J1117
$$ -28067 -70439 -55609 -39583 -56402 -97304 -95694 -47113 -42312 -40430 -56898 -35209 -24092
10749b4092L7027l615R044K864K042Q800J4128j6906k9274j3528K1063N810J3976
$$ -24092 12935 9320 18364 21228 23270 32070 46198 29292 18 -13510 7553 13363 27339
10736B7339R389k292p739j1642j5284k71n803K157P356L6826K8089l5540k1784
$$ 27339 36728 34436 26697 15055 -229 -500 -6303 -4146 3210 40036 68125 32585 10801
10723A0801M235k3661k5246j3236m2249l652O944L1841K1619j9788l842n2773
$$ 10801 15036 -8625 -33871 -47107 -89356 -93008 -86064 -54223 -32604 -52392 -56234 -109007
10711a09007n519O32L0337J2145J7461J1190K8085M4039J4224l2265k3541o876
$$ -109007 -114526 -113894 -83557 -71412 -53951 -42761 -14676 29363 43587 11322 -12219 -19095
10699a9095J5387K7110N636k9802k0187k4847m084M1423K9443J4097k1561k7853
$$ -19095 -3708 23402 29038 -764 -20951 -45798 -49882 -8459 20984 35081 13520 -14333
10687a4333j4324j4840q965J2950J8759N3517J8788L7439J4088o1656p361J6668
$$ -14333 -28657 -43497 -52462 -39512 -20753 32764 51552 88991 103079 41423 34062 50730
10675E0730q019k8675j4820K0928q496n4624j67K7191K4591m222m813k794K1674
$$ 50730 42711 14036 -784 20144 11648 -42976 -43143 -15952 8639 4417 -396 -3190 18484
10662A8484n106K7011k1910k0840O740j5190J1010K1358P3n557p236k0654K483
$$ 18484 13378 40389 18479 -2361 4379 -10811 199 21557 21630 16073 8837 -11817 -9334
10649i334l204K8891M6129j3967j7896J2201r102j0169k1900j1189k6043j4010
$$ -9334 -12538 16353 62482 48515 30619 42820 33718 23549 1649 -9540 -35583 -49593
10637d9593l279n838k1213J4699N1949J4869O107q731j4035J1218j5412j0907
$$ -49593 -52872 -58710 -79923 -65224 -13275 1594 7701 -1030 -15065 -3847 -19259 -30166
10625c0166n301k4051J861P251J5369p4J7387k2030J1941k5320l0147K3324K4378
$$ -30166 -35467 -59518 -57657 -50406 -35037 -35111 -17724 -39754 -27813 -53133 -83280 -59956 -35578
10612c5578J9859l06L545j4309J6295j6589K173Q511M4920L761k4406j7815K2185
$$ -35578 -15719 -16025 -12480 -26789 -10494 -27083 -24910 -16399 28521 32282 7876 -9939 12246
10599A2246K6529J877l0804l3395M097J9645j7896l4486J0956m929r901J3840
$$ 12246 38775 40652 9848 -23547 -19450 195 -17701 -52187 -41231 -46160 -56061 -42221
10587d2221K2826j9621p506J0034K5570P496J3297O796j1717p391J6332J9001
$$ -42221 -19395 -39016 -46522 -36488 -10918 -3422 9875 16671 4954 -2437 13895 32896
10575C2896J7464m608m0443j6295k2780J6407J7047o744L4686p109j7892K1465
$$ 32896 50360 45752 5309 -10986 -33766 -17359 -312 -7056 27630 20521 2629 24094
10563B4094J18j7826k7183j0580J4225k1693o76K703M299p236K3110J7743k5677
$$ 24094 24212 6386 -20797 -31377 -17152 -38845 -39521 -36818 -32519 -39755 -16645 1098 -24579
10550b4579L8466J1314k2379J7972J3781J751k180j3291j3698k6706J4653k5026
$$ -24579 13887 25201 2822 20794 34575 36326 34146 20855 7157 -19549 -4896 -29922
10538b9922o40K0272J2244L4527j6467k1396J9615J8342R765l1068k6380j8844
$$ -29922 -30562 -10290 1954 36481 20014 -1382 18233 36575 46340 15272 -11108 -29952
10526b9952k461K3589L5937J7483j3098j2248j665j9291j5462k826j2194P716
$$ -29952 -32413 -8824 27113 44596 31498 19250 17585 -1706 -17168 -19994 -32188 -24472
10514b4472J6364k1846l084r752L0962r067j6790O536O009L1399M6195j4253m0171
$$ -24472 -8108 -29954 -33038 -42790 -11828 -20895 -37685 -31149 -25140 6259 52454 38201 -1970
10501a970j5721p040L0913J7961m1857n180L6607q846k2880q86M574L0330J0944
$$ -1970 -17691 -24731 6182 24143 -17714 -22894 13713 4867 -18013 -18899 -14325 16005 26949
10488B6949l2052k3037N9610M802k3892j526n95l801j7625k9449j6526N723J6545
$$ 26949 -5103 -28140 31470 36272 12380 10854 10259 6458 -11167 -40616 -57142 -51419 -34874
10475c4874N8288L29J2853N500k6106n3255l3973O817R218r439J4736M5214J4495
$$ -34874 23414 23743 36596 42096 15990 -37265 -71238 -64421 -55203 -64642 -49906 -4692 9803
10462I803R179K6812k7405Q796q832k19q021K1203R462k4987J1311o600p20l6432
$$ 9803 18982 45794 18389 27185 18353 18134 10113 31316 40778 15791 27102 20502 19782 -16650
10448a6650m5292M4388k2646N48q255Q336J3582j9612K0276Q893J645J6066N939
$$ -16650 -61942 -17554 -40200 -39652 -47907 -39571 -25989 -45601 -25325 -16432 -14787 1279 7218
10435G218l2488p237M1930J2744q580j1633K300q88j6418K6530r019o365J1321
$$ 7218 -25270 -32507 9423 22167 13587 1954 4254 3366 -13052 13478 4459 -1906 9415
10422I415k9578k7630L1926M537J9258P219j2652j524j2724M968r363N385J5917
$$ 9415 -20163 -47793 -15867 -11330 7928 15147 2495 971 -11753 -6785 -16148 -10763 5154
10409E154n575p114L5974J9588l2080m0257l255K4065j9523j5981K1631L7777
$$ 5154 -421 -7535 28439 48027 15947 -24310 -27565 -3500 -23023 -39004 -17373 20404
10397B0404J8026k0658m54J6270P625k5162J4124p018J2438K1882k7035l6712
$$ 20404 38430 17772 17318 33588 41213 16051 30175 23157 35595 57477 30442 -6270
10385f270j1814K9994L4635N784q794j6175m9486j0702n447o945J1022L9078L2852
$$ -6270 -18084 11910 46545 52329 43535 27360 -22126 -32828 -38275 -45220 -34198 4880 37732
10372C7732k1717k0902q590j3012J9772L8421M8983k275K3800J8525l4666q035
$$ 37732 16015 -4887 -13477 -26489 -6717 31704 80687 78412 102212 120737 86071 78036
10360G8036L1410K2354J372J6855J318R322M8894K5264j375M0062J4728L6027
$$ 78036 109446 131800 133172 150027 151345 160667 209561 234825 233450 273512 288240 324267
10348C24267O9717O4649N8110J01361J39813K21172L53783N13594O53998P95578
$$ 324267 393984 458633 516743 618104 757917 979089 1332872 1846466 2500464 3296042
10338C296042R00606R78749R49666Q58811O77295N40631K61034m0036m02110o33870
$$ 3296042 4196648 5175397 6125063 6983874 7661169 8201800 8462834 8422798 8020688 7386818
10328G386818p17075p81543q64605q30151p59767o70714n50422m42420l28659
$$ 7386818 6669743 5888200 5023595 4193444 3433677 2762963 2212541 1770121 1441462
10319A441462k36816j49007r1840j22092o5127j8592o6369o6367j9152m7777n9374
$$ 1441462 1204646 1055639 963799 841707 776580 757988 691619 625252 606100 558323 498949
10308D98949o1509l9303j8605l62m9183l0173k7552j6756J3398j1014l2795k0938
$$ 498949 437440 398137 379532 379170 329987 299814 272262 255506 268904 257890 225095 204157
10296B04157m5617m3091J7309O5562N023j7725N416m8315l2129j2565n274n721
$$ 204157 158540 115449 132758 198320 203343 185618 191034 142719 110590 98025 92751 87030
10284H7030n1941l1399K9638J3562L2769L8611j5j1589k5024j9313j3021k3367
$$ 87030 35089 3690 33328 46890 79659 118270 118255 106666 81642 62329 49308 25941
10272B5941k1262p969j593J6686L4182J488j81J0516l3926k5249R325L314k4924
$$ 25941 4679 -3290 -4883 11803 45985 47473 47292 57808 23882 -1367 7958 11272 -13652
10259a3652m5912P305J3342L5027P847j0912K1121J3821m293P851j2229j9234
$$ -13652 -59564 -52259 -38917 -3890 3957 -6955 14166 27987 23694 31545 19316 82
10247H2k5893N515L3767M638j1312M3544L1935l7776l1063j8462k254P864j962
$$ 82 -25811 -20296 13471 18109 6797 50341 82276 44500 13437 -5025 -7279 585 -1377
10234a377l2227j3918q366J8167L382J4108J3561l216K3944K9770j5798J851K967
$$ -1377 -33604 -47522 -55888 -37721 -34339 -20231 -6670 -9886 14058 43828 28030 29881 32848
10221C2848J1097N818q402o134j8607j8957K101K1192O197l973k349p60k7581
$$ 32848 43945 49763 41361 35227 16620 -2337 -236 20956 27153 23180 20831 20071 -7510
10208g510O910J2146n413j4825O261J0858O526j8307L234L4860J498j4735K8403
$$ -7510 -600 11546 6133 -8692 -2431 8427 14953 -3354 -120 34740 36238 21503 49906
10195D9906J8109j4420l0632J3138k5596k6673n636J2144R182o959l0339j714
$$ 49906 68015 53595 22963 36101 10505 -16168 -21804 -9660 -478 -7437 -37776 -39490
10183c9490j77J5472J3117l3716J0295j0136J2202K7222J0284K163k1386L987
$$ -39490 -39667 -24195 -11078 -44794 -34499 -44635 -32433 -5211 5073 7236 -14150 -10163
10171a0163M586j6143K5354L3749K5748l0201j8696l2503k3803J0145J5161K6978
$$ -10163 -5577 -21720 3634 37383 63131 32930 14234 -18269 -42072 -31927 -16766 10212
10159A0212L1156J0705m6495n803j2027K0804j1281K848O095m708q04P014J0002
$$ 10212 41368 52073 5578 -225 -12252 8552 -2729 119 6214 1506 702 7716 17718
10146A7718J5510k0687n5287n292L7383K6115j2701k5592k2304L2486K1457K821
$$ 17718 33228 12541 -42746 -48038 -10655 15460 2759 -22833 -45137 -12651 8806 11627
10134A1627j7034M532J1616K8486K534l1294k7512n575M81L0894K3133J6519J0660
$$ 11627 -5407 -875 10741 39227 41761 10467 -17045 -22620 -22139 8755 31888 48407 59067
10121E9067m3435j9491J6188k0733k4907Q069J2258J8405L6055L1626o090r376
$$ 59067 15632 -3859 12329 -8404 -33311 -25242 -12984 5421 41476 73102 67012 57636
10109E7636L999k0700m4127q528L5306Q884N559k5616m2631l7221P433M7201N3130
$$ 57636 61635 40935 -3192 -11720 23586 32470 38029 12413 -30218 -67439 -60006 -12805 40325
10096D0325q33l0444j9248P98K2532l3716L085J3292J6356l33k0383o036P604
$$ 40325 39492 9048 -10200 -9402 13130 -20586 -17501 -4209 12147 11814 -8569 -14605 -7001
10083g001j8078j9448j1144J2623J3832l402N623j6776K7347J2294o255j9168
$$ -7001 -25079 -44527 -55671 -43048 -29216 -32618 -26995 -43771 -16424 -4130 -10385 -29553
10071b9553j3356K0848K1945m0273J0607J3849j7491K5388k2966J432L2835l4195
$$ -29553 -42909 -22061 -116 -40389 -29782 -15933 -33424 -8036 -31002 -29570 3265 -30930
10059c0930k4526J2273L1141J2521M213q06k5055j892J8456K5607J1960L548m6871
$$ -30930 -55456 -43183 -12042 479 4692 3886 -21169 -23061 -4605 21002 32962 36510 -10361
10046a0361K502K9757L894j5408K4381K2687j6181O396j1880j2115K0414j6645
$$ -10361 -7859 21898 25792 10384 34765 57452 41271 47667 35787 23672 44086 27441
10034B7441J9698L884k1042j3445L417J831k9465l9815j6660M9666L5620l5992
$$ 27441 47139 51023 29981 16536 19953 21784 -7681 -47496 -64156 -14490 21130 -14862
10022a4862J8510q168j5422k3862K6391j116L0815K9122l498j2612m7895k022
$$ -14862 3648 -4520 -19942 -43804 -17413 -18529 12286 41408 37910 25298 -22597 -24619
10010b4619l7k8119k841J5203Q230J7038o44J809j8448M706O3399K6918j4300
$$ -24619 -24656 -52775 -55616 -40413 -32183 -15145 -15789 -13980 -32428 -27722 35677 62595 48295
9997D8295O257j3834K140K0091J4484m2502l2294j3948M0683j9923m7745k5764
$$ 48295 54552 40718 42858 62949 77433 34931 2637 -11311 29372 9449 -38296 -64060
9985f4060K696k353L6121M6189J276J2704j6733l722J0742o03j1200j5939k270
$$ -64060 -61364 -63717 -27596 18593 19869 32573 15840 12118 22860 22257 11057 -4882 -7152
9972g152J0777k9955l4783l45Q328j1012l088P577o506J5587M0039R455n76K7770
$$ -7152 3625 -26330 -61113 -61458 -53130 -64142 -67230 -59653 -66159 -50572 -10533 -1078 -1654 26116
9958B6116K403l384n792j1874j6050p006k2942j4897N5409J2816L1442N388r451
$$ 26116 28519 25135 19343 7469 -8581 -15587 -38529 -53426 1983 14799 46241 51629 42178
9945D2178Q522j9119j8773J4676P410M2663J9290r708L985j1908l7340P245K7899
$$ 42178 50700 31581 12808 27484 34894 77557 96847 87139 91124 79216 41876 49121 77020
9932G7020m724J2849m185j7487R228j7319k2833J1902O537r618n792l4547M032
$$ 77020 72296 85145 80960 63473 72701 55382 32549 44451 50988 41370 35578 1031 5063
9919E063J5278J565j8266K5699L1292j034k955j6160K2181m9185m8022n484K4230
$$ 5063 20341 21906 3640 29339 60631 59597 56642 40482 62663 13478 -34544 -40028 -15798
9906a5798P750j6877M2842K4011m1928o415j5219J3028J6516k107k3804k2060
$$ -15798 -8048 -24925 17917 41928 0 -6415 -21634 -8606 7910 5803 -18001 -40061
9894d0061J3704J4822K7598k1205J978J0005m671p999J322J9821J5413k081K4090
$$ -40061 -26357 -11535 16063 -5142 -3164 6841 2170 -5829 -4507 15314 30727 28646 52736
9881E2736j1703J1775Q774J0456j3954j8186O598L8309q836l6427k149m2521m2462
$$ 52736 41033 52808 61582 72038 58084 39898 46496 84805 75969 39542 37393 -5128 -47590
9868d7590R853j8937J7305j0741j1005J8234J3105o853j202K4992M3823K2286
$$ -47590 -37737 -56674 -39369 -50110 -61115 -42881 -29776 -36629 -37831 -12839 30984 53270
9856E3270n4586l1185K9178Q299j7668J3575j9392K3437M6306j4253k491R764
$$ 53270 -1316 -32501 -3323 4976 -12692 883 -18509 4928 51234 36981 34490 44254
9844D4254q522J8470p92k1353Q232J6168j932j4659k2229Q617J5084n054o010
$$ 44254 35732 54202 53410 32057 40289 56457 54525 39866 17637 26254 41338 36284 30274
9831C0274q548n158L493l217m1516O323j4339J0177r936J132q033R439j0605p510
$$ 30274 21726 16568 20061 16844 -24672 -18349 -32688 -22511 -32447 -31315 -39348 -29909 -40514 -48024
9817d8024K4532m615Q030l6667P34J4838j934j095l02K678L895L8970J8389J1596
$$ -48024 -23492 -28107 -20077 -56744 -56010 -41172 -43106 -44201 -44503 -41825 -37930 1040 19429 31025
9803C1025m6823m4123J8434L2174J2521l4318J5265j0416l981J1684K924J4995
$$ 31025 -15798 -59921 -41487 -9313 3208 -31110 -15845 -26261 -30242 -18558 -15634 -639
9791f39j0336J7076R874N79j6497k7230r117k2804J2842J5160J6548O778K356
$$ -639 -10975 6101 15975 16554 57 -27173 -36290 -59094 -46252 -31092 -14544 -7766 -5410
9778e410k9398k7534J1810J0587J8056J1673N6103j0653P652O598m1701k3801
$$ -5410 -34808 -62342 -50532 -39945 -21889 -10216 45887 35234 42886 49484 7783 -16018
9766a6018Q21k1728L4458J8691j2083J2976M565J4501j4803j5145j8322K194K8200
$$ -16018 -15197 -36925 -2467 16224 4141 17117 21682 36183 21380 6235 -12087 -9893 18307
9753A8307J5930j449k5634k1749P886K4139P726k8681k7547j5344K1542K150j8926
$$ 18307 34237 32788 7154 -14595 -6709 17430 25156 -3525 -31072 -46416 -24874 -22724 -41650
9740d1650j6512K0926o425J0444K5830J8696M980L6355L3094k5448o8055l0162
$$ -41650 -58162 -37236 -43661 -33217 -7387 11309 16289 52644 85738 60290 -7765 -37927
9728c7927o700O643K7024J6643l0658j200M121J7873k3364N719r895J1223K1330
$$ -37927 -44627 -37984 -10960 5683 -24975 -26175 -22054 -4181 -27545 -21826 -31721 -20498 832
9715H32j308K767Q084m983L8193o556J971k2654j2962K7292m0553l010L60J2969
$$ 832 -476 2291 10375 5392 43585 37029 39000 16346 3384 30676 -9877 -12887 -12527 442
9701D42L4421P52k3942j9457n662r21M0677L3881k2650j9600J278k9538l6244
$$ 442 34863 35615 11673 -7784 -13446 -14367 26310 60191 37541 17941 19219 -10319 -46563
9688d6563l425J0334J0994J2199j5908J2722Q591k7075j8791O755m950M5048N669
$$ -46563 -49988 -39654 -28660 -16461 -32369 -19647 -11056 -38131 -56922 -50167 -55117 -10069 -4400
9675d400N000j8780K9886m5946J0005P752J480J191M4344k0284j4508m5185j596
$$ -4400 600 -18180 11706 -34240 -24235 -16483 -15003 -13812 30532 10248 -4260 -49445 -51041
9662e1041K8687O963j8967l50K6453k9158n956K4009K5697J0257K09K2706J2371
$$ -51041 -22354 -15391 -34358 -34708 -8255 -37413 -43369 -19360 6337 16594 16803 39509 51880
9649E1880j1080n762k1094J9233K1941J2863k0762l2908J0967k6125l1916R854
$$ 51880 40800 35038 13944 33177 55118 67981 47219 14311 25278 -847 -32763 -22909
9637b2909O307l4025k846M5420q86l6122j571O58O826M962P239M566p186K0107
$$ -22909 -16602 -50627 -53473 -8053 -8939 -45061 -46632 -45974 -39148 -34186 -26947 -22381 -29567 -9460
9623i460L2153j0112l4408p919P711j5967K5393Q944k2030L0827J3421N895J1974
$$ -9460 22693 12581 -21827 -29746 -22035 -38002 -12609 -3665 -25695 5132 18553 24448 36422
9610C6422j0863Q076J1575J2870k2801j4809j0305K8439j3074K1274o114n5901
$$ 36422 25559 33635 45210 58080 35279 20470 10165 38604 25530 46804 40690 -15211
9598a5211l7789J5652L0229K3937k1048l8699M736J4239Q126j73n735L9673Q174
$$ -15211 -53000 -37348 -7119 16818 -4230 -42929 -38193 -23954 -15828 -16001 -21736 17937 26111
9585B6111o87J4385J4971K3706K7384m2182n8114Q280K3252k1338j6508M0069
$$ 26111 25424 39809 54780 78486 105870 63688 5574 13854 37106 15768 -740 39329
9573C9329j9906k3127m756k2690J8627J7033k6585K8449K7462l4194m3484r913
$$ 39329 19423 -3704 -8460 -31150 -12523 4510 -22075 6374 33836 -358 -43842 -53755
9561e3755j3626M846M8500j1296l883J1247Q309J1881J7419L0567J0150p640P779
$$ -53755 -67381 -62535 -14035 -25331 -29214 -17967 -9658 2223 19642 50209 60359 52719 60498
9548F0498q252q871L495l283k3046j8844k4512K0400L4687j7816M617j3082m353
$$ 60498 52246 43375 46870 43587 20541 1697 -22815 -2415 32272 14456 19073 5991 1638
9535A638L275J3936P083k6760q497j4414K3046L0580l0933l9424k9391Q294K5703
$$ 1638 4913 18849 25932 -828 -9325 -23739 -693 29887 -1046 -40470 -69861 -61567 -35864
9522c5864m146k8969J8154M8158L8440n251L0483N497j9783j3148j1458j3286
$$ -35864 -40010 -68979 -50825 -2667 35773 30522 61005 66502 46719 33571 22113 8827
9510H827l0530l7888J6811K606Q892J7151M152R775L1885j6565j0101J5558N2211
$$ 8827 -21703 -59591 -42780 -40174 -31282 -14131 -9979 -204 31681 15116 5015 20573 72784
9497G2784k144j6835n0544m5252n171M0905L5641l2173k8608m312K0637Q763k7382
$$ 72784 70640 53805 3261 -41991 -47162 -6257 29384 -2789 -31397 -35709 -15072 -6309 -33691
9484c3691j2721N012Q835M4288n503L061K0930l153k9017n369K722q049P222J4960
$$ -33691 -46412 -41400 -32565 11723 6220 9281 30211 27058 -1959 -7328 -4606 -12655 -5433 9527
9470I527j6967j2394J7320O503L3078l267j0098j1653J0299K2138K2446L222k8062
$$ 9527 -7440 -19834 -2514 3989 37067 33800 23702 12049 22348 44486 66932 70154 42092
9457D2092j7085j1305r649K0091L3643K1387j5682J3591J0686k6818j1549J3820
$$ 42092 25007 13702 4053 24144 57787 79174 63492 77083 87769 60951 49402 63222
9445F3222j572l6956K5964j4803m3351M911K915J5834K1571J7785N087k4993J1376
$$ 63222 61650 24694 50658 35855 -7496 -2585 330 16164 37735 55520 60607 35614 46990
9432D6990k2641l0172R359P392j6335k2008N569j3421l293R889j7421j8339K4351
$$ 46990 24349 -5823 3536 10928 -5407 -27415 -21846 -35267 -38560 -28671 -46092 -64431 -40080
9419d0080L3409J2430K1966L3988j9479p80j5714j3112N207R412r772J0111j5486
$$ -40080 -6671 5759 27725 61713 42234 41454 25740 12628 17835 27247 17475 27586 12100
9406A2100J3399k703m5310j5800L5373O210O5J9007Q859l0782J9036L8819l5047
$$ 12100 25499 22796 -22514 -38314 -2941 3269 3334 22341 31200 418 19454 58273 23226
9393B3226m3500K858k09k1582m1863j159K8243R112L867J6982L8060J7969j2646
$$ 23226 -20274 -17416 -17625 -39207 -81070 -82229 -53986 -44874 -41007 -24025 14035 32004 19358
9380A9358o171k8833r271K3509L9545L337o071j9455j7516P814L8323K5769l0783
$$ 19358 13187 -15646 -24917 -1408 38137 41474 35403 15948 -1568 6246 44569 70338 39555
9367C9555j0650J0279M538J4881P930j6252l0331l2057j2359K0295K1732j0094
$$ 39555 28905 39184 43722 58603 66533 50281 19950 -12107 -24466 -4171 17561 7467
9355G467L4599L4198j2649j6849j0880n2556j1485j1841o798M5017K220m064J0431
$$ 7467 42066 76264 63615 46766 35886 -16670 -28155 -39996 -46794 -1777 443 -3621 6810
9342F810k9733P6K8903K0842J1672k2726j2459n124k0423l279N16n707K0940K7802
$$ 6810 -22923 -22847 6056 26898 38570 15844 3385 -1739 -22162 -25441 -24925 -30632 -9692 18110
9328A8110K9439j1371q946j9803J4738n230q217J603L7140L0239j3751l6667j7968
$$ 18110 47549 36178 27232 7429 22167 16937 8720 10323 47463 77702 63951 27284 9316
9315I316k2451J4090j3321l004j8253J9503L9996j9951j202M4100J4988j5571
$$ 9316 -13135 955 -12366 -15370 -33623 -14120 25876 5925 4723 48823 63811 48240
9303D8240l201j5242k2066k7399N083P283J2985K4141M773L55m263J9364J1407
$$ 48240 45039 29797 7731 -19668 -14585 -7302 5683 29824 34597 34952 30689 50053 61460
9290F1460q893m6073K725J1120K5340k4823j7921j7943k112K8364O195l254j1782
$$ 61460 52567 6494 9219 20339 45679 20856 2935 -15008 -17120 11244 17439 14185 2403
9277B403m6837K4765K8898K9745q760k5178m7003J129O5085L9300j9275l1762
$$ 2403 -44434 -19669 9229 38974 30214 5036 -41967 -40838 24247 63547 44272 12510
9265A2510J3002N5520L204k8306O089n128p062L28k8404k976Q174N1568K8352
$$ 12510 25512 81032 84236 55930 62019 56891 49829 50157 21753 18777 26951 78519 106871
9252A06871J8055n8438j7834Q991J3347K9046j5313l1146m47n0941K340L8386
$$ 106871 124926 66488 48654 57645 70992 100038 84725 53579 53132 2191 4531 42917
9240D2917J1599m93N250j1935o723q654N495J5264r433j0650J4170k8246J5305
$$ 42917 54516 54023 59273 47338 40615 31961 37456 52720 43287 32637 46807 18561 33866
9227C3866K5677J4422m658j6755j7462j4971j0538p589K5957L227l564J2088J1915
$$ 33866 59543 73965 69307 52552 35090 20119 9581 1992 27949 31176 27612 39700 51615
9214E1615k2627Q205Q81Q579l1630k6157M0923R787J8396L756j3551J2890L8951
$$ 51615 28988 37193 38074 46653 15023 -11134 29789 39576 57972 61728 48177 61067 100018
9201A00018J0737K9190k1752O003L930o681K0770L8855L6941n401k9931l0405
$$ 100018 110755 139945 118193 124196 128126 121445 142215 181070 218011 212610 182679 152274
9189A52274K2987o898k1720j1486J8002O7676M669q40o521Q925N317l678P045
$$ 152274 175261 168363 146643 135157 153159 220835 225504 224664 218143 227068 232385 228707 235752
9176B35752J1573J3348q779K1249N1725L8020k864j1788j5836M2449Q310L875
$$ 235752 247325 260673 251894 273143 324868 362888 360024 348236 332400 374849 383159 387034
9164C87034L0338N0529L5811K4304J5114O555P6201O8813M8683R2840J09325O7490
$$ 387034 417372 467901 503712 528016 543130 549685 625886 694699 743382 836222 945547 1013037
9152A013037Q4727J17612J25724J06411J34019J69262J65988J94226K41363K37918
$$ 1013037 1097764 1215376 1341100 1447511 1581530 1750792 1916780 2111006 2352369 2590287
9142B590287K53807K38905K74275K42740J62591J76069J80079J08902K1726l9600
$$ 2590287 2844094 3082999 3357274 3600014 3762605 3938674 4118753 4227655 4249381 4209781
9132D209781q8381j88609k30457k39456k27736j91303k35050k64134j97182j59441
$$ 4209781 4121400 3932791 3702334 3462878 3235142 3043839 2808789 2544655 2347473 2188032
9122B188032j63358j77500j66466j14585j11731j32808j45222q3754l6061n5992
$$ 2188032 2024674 1847174 1680708 1566123 1454392 1321584 1176362 1092608 1056547 1000555
9112A000555o7310o0002n9114o5500k4197l2562j5037k983k5450n0984n8262j7259
$$ 1000555 933245 873243 814129 748629 724432 691870 676833 673850 648400 597416 539154 521895
9100E21895K0634k0622l4795n7422l7044k6388j3760O041O095k3292l7313O617
$$ 521895 542529 521907 487112 429690 392646 366258 352498 358539 364634 341342 304029 310646
9088C10646Q103j4672K031j1566j3202j5829l8970K661J0782j8821k6186J754
$$ 310646 318749 304077 306108 294542 281340 265511 226541 229202 239984 221163 194977 196731
9076A96731R15J6882p578l0925n7859k8061K1130K3790L804J0244o380p624j967
$$ 196731 197646 214528 206950 176025 118166 90105 111235 135025 138829 149073 142693 135069 133102
9063A33102m453o883m1318k6163j3775o787O18K1298l932K4894K7295L7547o539
$$ 133102 128649 121766 80448 54285 40510 33723 34341 55639 51707 76601 103896 141443 134904
9050A34904j775j0180j1941p508k3056O707Q957K2593j0268k8511K4036J2633
$$ 134904 133129 122949 111008 103500 80444 87151 96108 118701 108433 79922 103958 116591
9038A16591l7059l133l76k4923J7107Q824K0054j3927j1806l618n60J9928K286
$$ 116591 79532 76399 76023 51100 68207 77031 97085 83158 71352 67734 67174 87102 89388
9025H9388k5806j415j9850J9117m71j0812j9466M040k06k2601j3653k510J4412
$$ 89388 63582 62167 42317 61434 60963 50151 30685 34725 34519 11918 -1735 -4245 10167
9012A0167j267L720J412k317J08L7585J1420l9462R102L3655K7003j6512j4445
$$ 10167 8900 12620 14032 11715 11823 49408 60828 21366 30468 64123 91126 74614 60169
8999F0169K4r25l4221j0454J3955n529K0906K496l0871k5273J3543l3211r60K2055
$$ 60169 60193 59268 25047 14593 28548 23019 43925 46421 15550 -9723 3820 -29391 -30351 -8296
8985h296L5826J4077l2863k1297N078J1072K117j9133O611M501K0895J6810l099
$$ -8296 27530 41607 8744 -12553 -7475 3597 5714 -13419 -6808 -2307 18588 35398 32299
8972C2299j7331k1926M987K64L5086M2015M139q785k6168Q836m2176m1376J4084
$$ 32299 14968 -6958 -1971 -1707 33379 75394 79533 70748 44580 53416 11240 -30136 -16052
8959a6052J5954k941Q35M680k757M4958j9160J1848K3127L0262p969n134K0757
$$ -16052 -98 -3039 -2204 2476 -281 44677 25517 37365 60492 90754 82785 77651 98408
8946I8408L9327P765l0213k5611K173l8137j7875j00n0842m1341j7857K7491M6577
$$ 98408 137735 145500 115287 89676 91849 53712 35837 35737 -15105 -56446 -74303 -46812 -235
8933b35Q563j2547j3257j6817L2091J4217J0180J9576O421j2681k7924r60j5037
$$ -235 8328 -4219 -17476 -34293 -2202 12015 22195 41771 48192 35511 7587 6627 -8410
8920h410K9716j3631k1365J8867K7881Q948k1705p230m911L050J1110M935l2013
$$ -8410 21306 7675 -13690 5177 33058 42006 20301 13071 8160 11210 22320 27255 -4758
8907d758l483Q568r904k1433L2605K1641N614K2308K330j5114j9661m975J638
$$ -4758 -8241 327 -9577 -31010 1595 23236 28850 51158 53488 38374 18713 13738 15376
8894A5376k1661M936J6595l1116O47K2623l9164o73L3219P457q17J1135l711n671
$$ 15376 -6285 -1349 15246 -15870 -15223 7400 -31764 -32437 782 8239 7422 18557 14846 9175
8880I175K8030j2330j2122J9544p318k384M0274n900k8716J3472k5648q942J2598
$$ 9175 37205 24875 12753 32297 24979 22595 62869 56969 28253 41725 16077 7135 19733
8867A9733q433k715L857L4426K331K724M939K2476m0014L33K2575L8558N132n0380
$$ 19733 11300 8585 12442 46868 49199 51923 56862 79338 39324 39657 62232 100790 105922 55542
8853E5542j4978R925k2848k6770K8583L1157p184k9659q289j4041k0216K7261
$$ 55542 40564 50489 27641 871 29454 60611 53427 23768 15479 1438 -18778 8483
8841H483J4598k5574j600q074j3124n705L7558L4041L2119j2999m8366r170M1180
$$ 8483 23081 -2493 -4093 -12167 -25291 -30996 6562 40603 72722 59723 11357 2187 43367
8828D3367j236j5827N054L521j184K708N389l0422p091j1124k9105k411K1070
$$ 43367 42131 26304 31358 34879 33695 36403 41792 11370 4279 -6845 -35950 -38361 -17291
8815a7291j3445Q327M0930K5054O913K7504o200M06j4059k4148J3675o538m1638
$$ -17291 -30736 -22409 18521 43575 50488 77992 71792 72198 58139 33991 47666 41128 -510
8802e10q413K4494J3893j2220j4609j6658J6126O537L4717J5416J1471q339m027
$$ -510 -8923 15571 29464 17244 2635 -14023 2103 8640 43357 58773 70244 61905 57878
8789E7878P028l9230J6334Q227p629j2003J7393L760l8479k6184j3169K3495j7764
$$ 57878 64906 25676 42010 50237 42608 30605 47998 51758 13279 -12905 -26074 -2579 -20343
8776b0343q312J4100L6157J4459j2073j6424J5075J348k8161J5048k086o0j343
$$ -20343 -28655 -14555 21602 36061 23988 7564 22639 23987 -4174 10874 8788 8728 7385
8763G385J8749k5632O528L9440J1512k9764R04j8336l0528k150J3795l2747l9432
$$ 7385 26134 502 7030 46470 57982 28218 29122 10786 -19742 -21892 -8097 -40844 -80276
8750h0276J2770J2813J8431K1417L0240O040J2697j8734o301K9078j0770k9221
$$ -80276 -67506 -54693 -36262 -14845 15395 21435 34132 15398 9097 38175 27405 -1816
8738a816j3548J1616M8111p39j1482J0063J6383j1046k1789Q456K7991n852m486
$$ -1816 -15364 -3748 44363 43624 32142 42205 58588 47542 25753 34209 62200 56348 51862
8725E1862K922q38m816k0676m65K315p854P921L9653K9815l2850m3466k7390l5723
$$ 51862 54784 53946 49130 28454 27989 30304 22450 30371 70024 99839 66989 23523 -3867 -39590
8711c9590r227O53N391J4803M392J4357K4640J1688p933L3630L275n609j9460
$$ -39590 -48817 -48164 -42773 -27970 -23578 -9221 15419 27107 19174 52804 56079 50470 31010
8698C1010M125J7685K0425k2463l6348m4318J6676J8395J6014J0643j0900K3343
$$ 31010 35135 52820 73245 50782 14434 -29884 -13208 5187 21201 31844 20944 44287
8686D4287L2355k2854l504K2266j051k0545k7091j632j9007L0191k2261K0329
$$ 44287 76642 53788 50284 72550 71499 50954 23863 22231 3224 33415 11154 31483
8674C1483K1693m5259j6464N3481M1849O4865j5754n4771l0680l5110l8750L8016
$$ 31483 53176 7917 -8547 44934 86783 151648 135894 81123 50443 15333 -23417 14599
8662A4599K1991j0810L5847J0054j8099n1090J2463K7682L9323k502l3171J248
$$ 14599 36590 25780 61627 71681 53582 2492 14955 42637 81960 79458 46287 47535
8650D7535j543l3324q510K2080K5025K0251J7065k5749l2212K2673j0625k9118
$$ 47535 45992 12668 4158 26238 51263 71514 88579 62830 30618 53291 42666 13548
8638A3548m559L1828O407J6702Q446J5793j7918j9366n4236l7859l729J2432N2764
$$ 13548 8989 40817 47224 63926 72372 88165 70247 50881 -3355 -41214 -44943 -32511 20253
8625B0253K6458q480q348N814K8342j959l885j1721j7781k2448J4916M1336L3257
$$ 20253 46711 38231 29883 35697 64039 62080 58195 46474 28693 6245 21161 62497 95754
8612I5754k3598k5783o635K510j8833J1551J6024o11j1861k7521L2570P3300L015
$$ 95754 72156 46373 39738 42248 23415 34966 50990 50379 38518 10997 43567 116867 119882
8599A19882k5666K507m246l1188Q780K2061R18K7079j1761L360r843j9964Q955
$$ 119882 94216 96723 92477 61289 70069 92130 93048 120127 108366 111726 101883 81919 90874
8586I0874j5682j7757M48K3333N79l1841l0307K908K5648J5661k2110m8191j757
$$ 90874 75192 57435 57883 81216 81795 49954 19647 22555 48203 63864 41754 -6437 -8194
8573h194J4141M17K5325J9369l1571O418O1576L5662j8968m0041k0578j730R757
$$ -8194 5947 6364 31689 51058 19487 25905 87481 123143 104175 64134 43556 41826 51583
8560E1583k514l6388k5278Q103K139L072K1101l6426l0930J0411N3906j2383Q105
$$ 51583 49069 12681 -12597 -4494 -2355 717 21818 -14608 -45538 -35127 18779 6396 14501
8547A4501j8628k9487K3862J2546J7935O895n880L011J0279J2441l627k0060l7224
$$ 14501 -4127 -33614 -9752 2794 20729 27624 21744 24755 35034 47475 43848 23788 -13436
8534a3436P50K7635M4752K6158J4367j267k6948j3472j9819L029j8349m4904J1226
$$ -13436 -12686 14949 59701 85859 100226 98959 72011 58539 38720 41749 23400 -21504 -10278
8521a0278o70l3169K4678N7663N829l7399k4435K7480P033J463O469l6124l2173
$$ -10278 -10948 -44117 -19439 38224 44053 6654 -17781 9699 16732 18195 24664 -11460 -43633
8508d3633o155N841J3092K7549P165J2418k8936l853P242M2632K7427j6325j8165
$$ -43633 -49788 -43947 -30855 -3306 3859 16277 -12659 -16512 -9270 33362 60789 44464 26299
8495B6299m1140n8112L609N4606O405O073n652L4692J9700M613k2328j8913l33
$$ 26299 -14841 -72953 -69344 -14738 -8333 -2260 -7912 26780 46480 51093 28765 9852 9519
8482I519J1472J6142J4011J692k6914j7089J3150J757j9156l0341n424K0998l437
$$ 9519 20991 37133 51144 52836 25922 8833 21983 23740 4584 -25757 -31181 -10183 -13620
8469a3620K0168m775L784P93k648Q747P79j1008K4335J8309M757P123l3728k1814
$$ -13620 6548 1773 5557 6350 3702 12449 13228 2220 26555 44864 49621 56744 23016 1202
8455A202N276K0722J5969J1870j5265N431M2478J4908m4317l995J7619P205k5114
$$ 1202 6478 27200 43169 55039 39774 45205 87683 102591 58274 54279 71898 79103 53989
8442E3989k7443l9587k8984k8047J4570J6967J479R795k8673m2355N713K5928
$$ 53989 26546 -13041 -42025 -70072 -55502 -38535 -37056 -27261 -55934 -98289 -92576 -66648
8430f6648L4451J2021J691l8210k5987L4664K1837j7566J7964j2218J0831K0787
$$ -66648 -32197 -20176 -18485 -56695 -82682 -48018 -26181 -43747 -25783 -38001 -27170 -6383
8418f383q750J7744p303l5002J3726L828J4334O506j511m966j8366j0381n495
$$ -6383 -15133 2611 -4692 -39694 -25968 -22140 -7806 -1300 -2811 -7777 -26143 -36524 -42019
8405d2019Q660j5018O235K591K3475O807L4394o2j5154l7513r819K5843J8373
$$ -42019 -33359 -48377 -42142 -39551 -16076 -9269 25125 25063 9909 -27604 -37423 -11580 6793
8392F793k1823J3475K4141P12j8460j3190k762k5314m77K9509J961l2050P442
$$ 6793 -15030 -1555 22586 23298 4838 -8352 -11114 -36428 -36905 -7396 -5435 -37485 -30043
8379c0043J9155L7738L41k0824J515O333j3425L455N463j1964j2315J5208L2085
$$ -30043 -10888 26850 27191 6367 7882 14215 790 4245 9708 -2256 -14571 637 32722
8366C2722K0057r950k4741K909L902j9229j6688k3767N929J9877J6022k5688J3505
$$ 32722 52779 42829 18088 20997 24899 5670 -11018 -34785 -28856 -8979 7043 -18645 -5140
8353e140K6999n216K1357L1153k0314m9077r293j9419j1332K2765o78K145J1084
$$ -5140 21859 16643 38000 69153 48839 -238 -9531 -28950 -40282 -17517 -18195 -16050 -4966
8340d966J6966l0511m4844L0183L4472o367J7797J9997r189m288K7932k5120J4955
$$ -4966 12000 -18511 -63355 -33172 1300 -5067 12730 32727 23538 19250 47182 22062 37017
8327C7017l6186l9860J0640P704R383L468J4091K0095k2184k3630o348M806P964
$$ 37017 831 -39029 -28389 -20685 -11302 -7834 6257 26352 4168 -19462 -25810 -21004 -13040
8314a3040P080l0514j169J2390K798J1279K6990M3890n141n4930m2642j7439K9000
$$ -13040 -5960 -36474 -37643 -25253 -22455 -11176 15814 59704 54563 -367 -43009 -60448 -31448
8301c1448K9740j1692K1005R998L0935J4687p388j6249j1414J5794O629l8966
$$ -31448 -1708 -13400 7605 17603 48538 63225 55837 39588 28174 43968 50597 11631
8289A1631k6694J1220N7149J5855k0544m1107m3169m3824q878L7395M7341M5769
$$ 11631 -15063 -3843 53306 69161 48617 7510 -35659 -79483 -88361 -50966 -3625 42144
8277D2144Q541l0651O68r688n7335k8515j2953M077R281J7227K1970J9509K9391
$$ 42144 50685 20034 20702 11014 -46321 -74836 -87789 -83712 -74431 -57204 -35234 -15725 13666
8264A3666Q694L582j6977k2784j3923Q979J7638N627M251l6510l078K6170l6322
$$ 13666 22360 25942 8965 -13819 -27742 -18763 -1125 4502 8753 -27757 -30835 -4665 -40987
8251d0987o447L8847K8551j576j1111J4182J2463R487l364q11l4393j0743L551
$$ -40987 -47434 -8587 19964 18388 7277 21459 33922 43409 40045 39234 4841 -5902 -2351
8238b351p427K534Q920P98K68M537J0966L735n417Q209K747m419N181k1124K6660
$$ -2351 -9778 -7244 1676 2474 2742 7279 18245 21980 16563 24772 27519 23100 28281 7157 33817
8223C3817K2962K0016j0466j0704j983J0068J2486j7062n6632n100r554J0564
$$ 33817 56779 76795 66329 55625 53642 63710 76196 59134 2502 -2598 -12152 -1588
8211a588J2852J1426j8128L2368K4383k306j8660j785k0458l8815m7650J800K1280
$$ -1588 11264 22690 4562 36930 61313 59007 40347 38562 18104 -20711 -68361 -66561 -45281
8198d5281J9373L9952p689l6529j5268K4907L5961J8723n801q104J502J2225N008
$$ -45281 -25908 14044 6355 -30174 -45442 -20535 15426 34149 28348 20244 21746 33971 38979
8185C8979m372q102J9282K0009k1551j3434M621N082L860J2120L336K1452p435
$$ 38979 34607 26505 45787 65796 44245 30811 35432 40514 44374 56494 59830 81282 73847
8172G3847j0619j5740l0069L181Q60J3077L2808l3385l1519k0507n434j0943J5449
$$ 73847 63228 47488 17419 20600 21460 34537 67345 33960 2441 -18066 -23500 -34443 -18994
8159a8994J1572j4428n671J7804rj27K3752O0715L6424l2967p267m014j1856N181
$$ -18994 -7422 -21850 -27521 -9717 -9726 -9853 13899 74614 111038 78071 70804 66790 54934 60115
8145F0115k9654m9684n4j87J3089r117n774M3906M647r310J2779J9784n169l9016
$$ 60115 30461 -19223 -19277 -19464 -6375 -15492 -21266 22640 27287 17977 30756 50540 45371 6355
8131F355n113q661K5320o105J9975q180j4635j4951N348r554M786k828j5141k931
$$ 6355 1242 -7419 17901 11796 31771 23591 8956 -5995 -647 -10201 -5415 -8243 -23384 -26315
8117b6315M4779J8200q544K1143Q925k66r955l7686J3692M969N213J4213O187
$$ -26315 18464 36664 28120 49263 58188 57922 47967 10281 23973 28942 34155 48368 54555
8104E4555k7400l3495K5991J4775j9013M5638j4859m0571J2594R915o425r43L6448
$$ 54555 27155 -6340 19651 34426 15413 61051 46192 5621 18215 28130 21705 20762 57210
8091E7210M0580m617l8343k8288K4889J3594k0840j5791R686o786K928J1216k258
$$ 57210 97790 93173 54830 26542 51431 65025 44185 28394 38080 31294 34222 45438 43180
8078D3180J185r648l235J9759j0207k4892j66n226m2214j367L2891k949l608M3701
$$ 43180 44365 34717 31482 51241 41034 16142 15976 10750 -31464 -32831 60 -2889 -6497 37204
8064C7204M8055j2437R271j7469j5866m945j6720M948M277n009J7022P733l5674
$$ 37204 85259 72822 82093 64624 48758 43813 27093 32041 36318 31309 48331 56064 20390
8051B0390j6332q324J9295L0029r28J5785L561k7960m4156J0720K3461J2196J332
$$ 20390 4058 -4266 15029 45058 44130 59915 63476 35516 -8640 2080 25541 37737 39069
8038C9069J683K4011K2573j8737j2937K0155M327o998j7512k4542K2436p557j8756
$$ 39069 40752 64763 87336 68599 55662 75817 80144 73146 55634 31092 53528 45971 27215
8025B7215k3307J5091K348K5620L0233l7465j6625J730l018m2384j1032n284J5572
$$ 27215 3908 18999 21347 46967 77200 39735 23110 24840 21822 -20562 -31594 -36878 -21306
8012b1306o410k0882n109L0138N6845P387l2728K1931o1J3991J3974p925J1328
$$ -21306 -27716 -48598 -53707 -23569 33276 40663 7935 29866 29805 43796 57770 49845 61173
7999F1173L30K3962R122q8j3360n311k3995q807Q555J2643j102k4984j0761R901
$$ 61173 61503 85465 94587 94499 81139 75828 51833 43026 51581 64224 63122 38138 27377 37278
7985C7278k3855l7398m7606K8626J5418K6037L139P885K8328k870k8872m2509
$$ 37278 13423 -23975 -71581 -42955 -27537 -1500 1639 9524 37852 34982 6110 -36399
7973c6399K0538K2112j3380q42L2156K2744J4224K419m772N150l5722j918Q319
$$ -36399 -15861 6251 -7129 -7971 24185 46929 61153 63572 58800 63950 28228 26310 34629
7960C4629M779j5768j4234L1603J032q385J4377J1432j8092j529L8583M743L0057
$$ 34629 39408 23640 9406 41009 42041 33656 48033 59465 41373 39844 78427 83170 113227
7947A13227J3034k3771l6851j4253k3596k335J7713J8912j8508p269N610q361
$$ 113227 126261 102490 65639 51386 27790 25455 43168 62080 43572 36303 41913 33552
7935C3552r145k1214J6993o174N198M353n1556j7318K4250L7077j159O20m2872
$$ 33552 24407 3193 20186 14012 19210 23563 -27993 -45311 -21061 16016 14857 15477 -27395
7922b7395k0060j740K133K0576J7813o800L7591J9183J5746J500m3300l1741L2294
$$ -27395 -47455 -49195 -47062 -26486 -8673 -15473 22118 41301 57047 58547 15247 -16494 15800
7909A5800O3565K0613k2669o190j3039j5247q551P314R384N95j0338j8047L08
$$ 15800 79365 99978 77309 71119 58080 42833 34282 41596 50980 51575 41237 23190 23498
7896B3498l5m0138L838L5224J2727l1900j1277Q750m356O644l139j0341J2905
$$ 23498 23463 -16675 -12837 22387 35114 3214 -8063 687 -3669 2975 -164 -10505 2400
7883B400L929k9393P959J4728K4428l321j7667K5789K3969q437j4711m425Q446
$$ 2400 6329 -23064 -15105 -377 24051 20730 3063 28852 52821 44384 29673 25248 33694
7870C3694l2215r495l471n392j0390p001R469J4393J0405m228K0514J9914j849
$$ 33694 1479 -8016 -11487 -16879 -27269 -34270 -24801 -10408 -3 -4231 16283 36197 34348
7857C4348j3739j0471N437J8532j2024j952J3868m1343j1467q006k5031j7413
$$ 34348 20609 10138 15575 34107 22083 20131 33999 -7344 -18811 -26817 -51848 -69261
7845f9261J2064K1797J0326K6976J1975j8868j7550k742M30K397q655J575J0590
$$ -69261 -57197 -35400 -25074 1902 13877 -4991 -22541 -25283 -24853 -22456 -31111 -29536 -18946
7832a8946K7427q388K1573L316J1898J3907j3034m5915J769j3248O221j4305L008
$$ -18946 8481 93 21666 24982 36880 50787 37753 -8162 -6393 -19641 -13420 -27725 -24717
7819b4717J9886J2298k3021O886K2651N8118q211l8373j5588l7691m012j549J6009
$$ -24717 -4831 7467 -15554 -8668 13983 72101 63890 25517 9929 -27762 -31774 -33323 -17314
7806a7314J639k7060o542M8125K9109O939k3024l2896r639K0200p95L043Q226
$$ -17314 -15675 -42735 -49277 -1152 27957 34896 11872 -21024 -30663 -10463 -11258 -8215 11
7793A1J6142L1635J2982M225n3819m3748l8689J204L1787K1270l0686K486j084
$$ 11 16153 47788 60770 64995 11176 -32572 -71261 -70057 -38270 -17000 -47686 -45200 -46284
7780d6284O121p583k5899L031k1297j167L5542R790J9639L2723J0757j483P147
$$ -46284 -40163 -47746 -73645 -70614 -91911 -93078 -57536 -47746 -28107 4616 15373 13890 21037
7767B1037j6967p307o797M863K2991j0801Q311R549j6481m426R638K4370J0215
$$ 21037 4070 -3237 -10034 -5171 17820 7019 15330 24879 8398 3972 13610 37980 48195
7754D8195j5387k8250k6109k9848O075J0757K1156L4051J3875m2416j1231J3048
$$ 48195 32808 4558 -21551 -51399 -45324 -34567 -13411 20640 34515 -7901 -19132 -6084
7742f084K6699j012l42j4345k2630J1205K4512K1688m94r551k5252n5125J670
$$ -6084 20615 19603 19261 4916 -17714 -6509 18003 39691 39197 29646 4394 -50731 -49061
7729d9061K4623J3585J7446K2384n8558j5816J403p691k5182J7841L5276K7825
$$ -49061 -24438 -10853 6593 28977 -29581 -45397 -43994 -51685 -76867 -59026 -23750 4075
7717D075k1703l1603l06o20P813M1032J6011j7059j3569L1432J1188m829k6101
$$ 4075 -17628 -49231 -49537 -50157 -42344 -1312 14699 -2360 -15929 15503 26691 21862 -4239
7704d239j4119l5801R472R476m797l228j4578J2397J9780K9855k8588j5350K1180
$$ -4239 -18358 -54159 -44687 -35211 -40008 -43236 -57814 -45417 -25637 4218 -24370 -39720 -18540
7691a8540j5318L363M792L535L8328J4173M071j1460J704j0073k8250K2316l284
$$ -18540 -33858 -30495 -25703 -22168 16160 30333 34404 22944 24648 14575 -13675 8641 5357
7678E357j003P144p433K1128J6289k61J4582o501j2728R862l1234j741j867l1420
$$ 5357 4354 11498 4065 25193 41482 41221 55803 49302 36574 46436 15202 13461 11594 -19826
7664a9826L553k4842l6370J9503O257n496L3364J5869r65O352P389k988L047K3216
$$ -19826 -16273 -41115 -77485 -57982 -51725 -57221 -23857 -7988 -8953 -2601 4788 1800 4847 28063
7650B8063j3398q926N012J8896M06k8227m6894j9095L6335J9727l079j0275j5479
$$ 28063 14665 5739 10751 29647 30053 1826 -45068 -64163 -27828 -8101 -11180 -21455 -36934
7637c6934K0426M223p717j4286J7655K490p418L3028k535m2151j9587j3909L569
$$ -36934 -16508 -12285 -20002 -34288 -16633 -14143 -21561 11467 8932 -33219 -52806 -66715 -63146
7624f3146j0045J6603J8047L2628L8160j2486k9305o094K2416O219k2995Q124
$$ -63146 -73191 -56588 -38541 -5913 32247 19761 -9544 -15638 6778 12997 -9998 -1874
7612a874J4192j5270k0455R305N513r509k3482K1101J1454M340j2520j3944M5492
$$ -1874 12318 -2952 -23407 -14102 -8589 -18098 -41580 -20479 -9025 -4685 -17205 -31149 14343
7599A4343K9093m2188k5330j1741k2448Q378J1140M4538K8591j3284l7976o777
$$ 14343 43436 1248 -24082 -35823 -58271 -49893 -38753 5785 34376 21092 -16884 -23661
7587b3661k5064o240K2971J640J6336Q278K719j8552J119n28L0301j058j8964
$$ -23661 -48725 -54965 -31994 -30354 -14018 -5740 -3021 -21573 -20454 -20982 9319 8261 -10703
7574a0703l1668K049K797j2035k6434M2406O878k9985l8601R261k050L1872p243
$$ -10703 -42371 -40322 -37525 -49560 -75994 -33588 -26710 -56695 -95296 -86035 -88085 -56213 -63456
7561f3456J358p708J7168J8714k8749p552N453K6444L0537L159K1118n663N58
$$ -63456 -62098 -69806 -52638 -33924 -62673 -70225 -64772 -38328 -7791 -4632 16486 10823 11381
7548A1381Q508j1426P594O574J1549l739j8024m1833K3300o830k4325J1875K7902
$$ 11381 19889 8463 16057 22631 34180 30441 12417 -29416 -6116 -12946 -37271 -25396 2506
7535B506N77l1426j094J6494k5312o113K800m897j8808R317N7596L853L530l240
$$ 2506 3083 -28343 -29437 -12943 -38255 -44368 -41568 -46465 -65273 -55956 1640 5493 9023 5783
7521E783J3741J7434n031M940r583k3443k199j4811N789k8011l781J5227L5375
$$ 5783 19524 36958 31927 36867 27284 3841 1642 -13169 -7380 -35391 -39172 -23945 11430
7508A1430m656q571J8452K0856j2390M876k6215J7109o490j5990m205L490R731
$$ 11430 6774 -1797 16655 37511 25121 29997 3782 20891 14401 -1589 -5794 -2304 7427
7495G427R618o524n4249M120K7376m473l3708l2492J4105K9048M6232m357j1528
$$ 7427 17045 10521 -43728 -39608 -12232 -16705 -50413 -82905 -68800 -39752 6480 2123 -9405
7482i405J0346n355j6105j8333R887j3055k5202P953o726k524M7719L6542j196
$$ -9405 941 -4414 -20519 -38852 -28965 -42020 -67222 -59269 -65995 -68519 -20800 15742 14546
7469A4546K973L317j5104j5923l3040J829m556r029M441J4840J1443n745m881
$$ 14546 17519 20836 5732 -10191 -43231 -41402 -45958 -54987 -50546 -35706 -24263 -30008 -34889
7456c4889K9416L0186M472m0890j5129J2746k0744j5656Q336J1050K7150j2705
$$ -34889 -5473 24713 29185 -11705 -26834 -14088 -34832 -50488 -42152 -31102 -3952 -16657
7444a6657J9309J876k3538J3279K3383l3015k1537J5603J2814k4530L420Kj8804
$$ -16657 2652 4528 -19010 -5731 17652 -15363 -36900 -21297 -8483 -33013 -29593 -29591 -48395
7431d8395Q716K2758P049j354L2533J5205q507j0946k5902k4215K1644p239j4566
$$ -48395 -39679 -16921 -9872 -11226 21307 36512 28005 17059 -8843 -33058 -11414 -18653 -33219
7418c3219Q614J4293j3921N97k3375k8202k134m777K3150R633J1262J2364K6507
$$ -33219 -24605 -10312 -24233 -23636 -47011 -75213 -77347 -82124 -58974 -49341 -38079 -25715 792
7405G92J3714l1l7328K2563j8557n7028M679J9862M4593N7327O235n48k9506n3010
$$ 792 14506 14475 -22853 -290 -18847 -75875 -71196 -51334 -6741 50586 56821 56273 26767 -26243
7391b6243Q933M095j4652k0202l938J9492M364J3226J5309o324O854K1102J3962
$$ -26243 -17310 -13215 -27867 -48069 -52007 -32515 -28151 -14925 384 -5940 914 22016 35978
7378C5978J3328k2164l5432j4370m2695n0989o004O8101N4718Q002j4056j1219
$$ 35978 49306 27142 -8290 -22660 -65355 -116344 -122348 -54247 471 8473 -5583 -16802
7366a6802L365N827J9227n100J0245o663K6111l4123j2534O640q526K5644K8639
$$ -16802 -13437 -7610 11617 6517 16762 10099 36210 2087 -10447 -3807 -12333 13311 41950
7353D1950j4956m7098j0835J6525O332N580j0231n352q107J6220k3238M432K8233
$$ 41950 26994 -20104 -30939 -14414 -8082 -2502 -12733 -18085 -26192 -9972 -33210 -28778 -545
7340e45n077j3749j4819L5480K3857j9131k6732l5252o136L3989n49k027r054
$$ -545 -5622 -19371 -34190 1290 25147 6016 -20716 -55968 -62104 -28115 -28664 -30691 -39745
7327c9745K2932J3685J2418Q84j1249k7609J2904L0721p952k5589j1399P103L7739
$$ -39745 -16813 -3128 9290 10174 -1075 -28684 -15780 14941 6989 -18600 -29999 -22896 14843
7314A4843L6609p873o468j4613j7237k0477n831J9846J9869m2957P081L1450K3595
$$ 14843 51452 43579 37111 22498 5261 -15216 -21047 -1201 18668 -24289 -17208 14242 37837
7301C7837l5562j2425j5992l0817P330L240N993R043r119J7820K0566l621l9775
$$ 37837 2275 -10150 -26142 -56959 -49629 -46389 -40396 -31353 -40472 -22652 -2086 -5707 -45482
7288d5482k6296L1035J8121j4052J0614J1089k4982K6039L1185J4425j4027l1619
$$ -45482 -71778 -40743 -22622 -36674 -26060 -14971 -39953 -13914 17271 31696 17669 -13950
7276a3950R863J2090J4933k914k7289r877K5444r814L629J4672j153l6876o943
$$ -13950 -4087 8003 22936 20022 -7267 -17144 8300 -1514 2115 16787 15634 -21242 -28185
7263b8185k0276M12K9456K4658n334j0999n0650l926K3529L3254M1700j2550n762
$$ -28185 -48461 -48049 -18593 6065 731 -10268 -60918 -64844 -41315 -8061 33639 21089 15327
7250A5327r963n379m0017m1489J4447N8999j6854k1895K8935K1714j8147K7672
$$ 15327 5364 -15 -40032 -81521 -67074 -8075 -24929 -46824 -17889 3825 -14322 13350
7238A3350r297l5765k4582k6965J70L4490L2092j4570J4700M3616q784m8257k788
$$ 13350 4053 -31712 -56294 -83259 -83089 -48599 -16507 -31077 -16377 27239 18455 -29802 -32590
7225c2590M421j6327J852P385K5910l9326Q039j1473q611M5813M736j6962n81
$$ -32590 -28169 -44496 -42644 -35259 -9349 -48675 -40636 -52109 -60720 -14907 -10171 -27133 -27714
7212b7714j0925P287j3586M3184K8911L6196L0669l6726l6696k0873l152N941
$$ -27714 -38639 -31352 -44938 -1754 27157 63353 94022 57296 20600 -273 -3425 2516
7200B516j4237l728k2837L954l537L2976L2106k3800j1029m1159R083M1808K7176
$$ 2516 -11721 -15449 -38286 -34332 -37869 -4893 27213 3413 -7616 -48775 -39692 2116 29292
7187B9292N077k2655O8K2740j643k4767M793Q122J8351q522j0655k235j8922J5276
$$ 29292 34369 11714 11782 34522 32879 8112 12905 21027 39378 30856 20201 17966 -956 14320
7173A4320M1666j4934k3495k2452R001K4757j756j3682r781j3994k640k4604M962
$$ 14320 55986 41052 17557 -4895 4106 28863 27107 13425 3644 -10350 -12990 -37594 -32632
7160c2632J1053J1146j1490R787r598m227J2676J7889l6764k7289J4544Q056j828
$$ -32632 -21579 -10433 -21923 -12136 -21734 -25961 -13285 4604 -32160 -59449 -44905 -36849 -38677
7147c8677J44K2480j2665L1983K4262j1434J4093K5420K1570o017j5805k0490
$$ -38677 -38533 -16053 -28718 3265 27527 16093 30186 55606 77176 71159 55354 34864
7135C4864j0194K845k1188M130L003r849n400j8363J1842Q336K0667j319j1241
$$ 34864 24670 27515 6327 10457 13460 3611 -1789 -20152 -8310 26 20693 19374 8133
7122H133K333j6676O066l3915Q286q510j3466J6338M2111K6426K634k806l2540
$$ 8133 10466 -6210 -144 -34059 -25773 -34283 -47749 -31411 10700 37126 39760 36954 4414
7109D414j2880m315J5301j7124j7931M3974K5063j9795l7985Q254l9915j5291
$$ 4414 -8466 -12781 2520 -14604 -32535 11439 36502 16707 -21278 -13024 -52939 -68230
7097f8230Q72J4125L5067k2654l422Q67K4552R032j1689j1255M9902j3899k713
$$ -68230 -67358 -53233 -18166 -40820 -44242 -43375 -18823 -9791 -21480 -32735 17167 3268 555
7084E55J3649M2078j9627n3152r451k6308J334J4781k446K6780j5919j1064j6900
$$ 555 14204 56282 36655 -16497 -25948 -52256 -50922 -36141 -38587 -11807 -27726 -38790 -55690
7071e5690j9296J5406J2145n119q137K250K0371K5944j1429j4452j8121k0551
$$ -55690 -74986 -59580 -47435 -52554 -60691 -58441 -38070 -12126 -23555 -38007 -56128 -76679
7059g6679R434O8292K9356k2019k1164k174N316M296j9775k3754J3999J4218J3927
$$ -76679 -67245 1047 30403 8384 -12780 -14954 -9638 -5342 -25117 -48871 -34872 -20654 -6727
7046f727J8769K4452o368l9901l7015P0248L8047l5722p964k1520k8432J7678
$$ -6727 12042 36494 30126 -9775 -46790 23458 61505 25783 17819 -3701 -32133 -14455
7034a4455M997J9301l256q624K708R72j2546K0284o399k304J5329j2740j1260
$$ -14455 -9458 9843 6587 -2037 671 1643 -10903 9381 2982 678 16007 3267 -7993
7021g993O294j0944m3429j6444M0646L0780L0246J0397m1594k0694P682l6238
$$ -7993 -1699 -12643 -56072 -72516 -31870 -1090 29156 39553 -2041 -22735 -15053 -51291
7009e1291J961J3005J8198K8155Q77m2120L0190l0174j265J0873P818n617j3444
$$ -51291 -49330 -36325 -18127 10028 10905 -31215 -1025 -31199 -32464 -21591 -13773 -19390 -32834
6996c2834k6114J6229Q359L06L5616J275k1842L238K93k1626K8870K381p942R211
$$ -32834 -58948 -42719 -34360 -34054 1562 2837 -19005 -15767 -15474 -37100 -8230 -5849 -13791 -4580
6982d580J0085q825K3118l96J045K0428M837j2487q159l4340p474K8782K035k7468
$$ -4580 5505 -3320 19798 19402 20447 40875 45712 33225 25066 -9274 -16748 12034 14069 -13399
6968a3399l0342J528j0935K3344K737K2689K3315k2043k4936K796L160K074M8888
$$ -13399 -43741 -42213 -53148 -29804 -27067 -4378 18937 -3106 -28042 -25246 -22086 -20012 28876
6955B8876K922R731O0672m94k5007K04l5077l6930k9025j0581L058L6101J0002
$$ 28876 31798 41529 102201 101707 76700 76904 41827 4897 -24128 -34709 -31651 4450 14452
6942A4452k1129j9095j2829M299K8168M6277Q103j7726k992N43k6009J2353L593
$$ 14452 -6677 -25772 -38601 -34302 -6134 40143 48246 30520 27528 28071 2062 14415 18008
6929A8008k9001l9693J0200L3652M2989K6601j308l3515l3134J1671j2559j3140
$$ 18008 -10993 -50686 -40486 -6834 36155 62756 61448 27933 -5201 6470 -6089 -19229
6917a9229j0101k54L0820K1953n653p065k373q310k9650K2599J8884O548p506
$$ -19229 -29330 -29584 1236 23189 17536 10471 8098 -212 -29862 -7263 11621 18169 10663
6904A0663j3780O410o068J7051J2150L161j1478m30k0885r665j0367n339L4214
$$ 10663 -3117 3293 -2775 14276 26426 29587 18109 17679 -3206 -12871 -23238 -28577 5637
6891E637k2438m365N080J3343j4832l1078K3123M2675K8437n267k6970R10J6771
$$ 5637 -16801 -21166 -16086 -2743 -17575 -48653 -25530 17145 45582 40315 13345 14255 31026
$$ [...]
##END NTUPLES=NMR SPECTRUM
##END=
