##TITLE=Analysis number 316495
Compound Code cc 46504
Book Reference 468/17
Project Code adrs
Chemist Name colinb
##JCAMPDX= 6.0         $$ Bruker NMR JCAMP-DX V2.0
##DATA TYPE= NMR SPECTRUM
##DATA CLASS= NTUPLES
##ORIGIN= Bruker BioSpin GmbH
##OWNER= nmr
$$ XWIN-NMR		Version 3.5
$$ Tue Jan 17 11:22:38 2006 GMT Standard Time (UT+0h)  MAYBRIDGE\nmr@NMR_250MHZ
##.OBSERVE FREQUENCY= 250.131544655141
##.OBSERVE NUCLEUS= ^1H
##.ACQUISITION MODE= SIMULTANEOUS (DQD)
##.ACQUISITION SCHEME= undefined
##.AVERAGES= 16
##.DIGITISER RES= 18
##SPECTROMETER/DATA SYSTEM= dpx250
##.PULSE SEQUENCE= zg30
##.SOLVENT NAME= CDCl3
##.SHIFT REFERENCE= (INTERNAL, CDCl3, 0, 16.4511)
##AUDIT TRAIL= $$ (NUMBER, WHEN, WHO, WHERE, WHAT)
$$ ##TITLE= Audit trail, XWIN-NMR		Version 3.5
$$ ##JCAMPDX= 5.01
$$ ##ORIGIN= Bruker BioSpin GmbH
$$ ##OWNER= nmr
$$ C:\u/data/dgb/nmr/ADRS/14830/pdata/1/auditp.txt
$$ ##AUDIT TRAIL=  $$ (NUMBER, WHEN, WHO, WHERE, WHAT)
(   1,<2006-01-17 11:22:13.71 +000>,<MAYBRIDGE\nmr>,<NMR_250MHZ>,
      <created by zg, POWCHK disabled, PULCHK disabled
       configuration hash MD5:
       62 19 C7 07 E1 42 D1 B7 37 6C 3D D0 77 39 F9 E6
       data hash MD5: 64K
       FE BE 02 57 DE 13 50 35 7F 50 90 C0 C6 20 0C A2>)
(   2,<2006-01-17 11:22:29.62 +000>,<MAYBRIDGE\nmr>,<NMR_250MHZ>,
      <Start of raw data processing
       ef LB = 0.3 FT_mod = 6 PKNL = 1 SI = 32K 
       data hash MD5: 32K
       68 42 4D 79 F2 A3 7B 7C 18 2F ED 53 0E DE 51 E1>)
(   3,<2006-01-17 11:22:31.60 +000>,<MAYBRIDGE\nmr>,<NMR_250MHZ>,
      <apk 
       data hash MD5: 32K
       60 BC B9 15 5F 7F DF FE 61 48 DC B5 D6 DA 7F 16>)
(   4,<2006-01-17 11:22:32.32 +000>,<MAYBRIDGE\nmr>,<NMR_250MHZ>,
      <abs ABSG = 5 
       data hash MD5: 32K
       3E 6A 69 87 34 AD 77 31 43 B9 B9 9C C6 5A FB 36>)
$$ ##END=
$$ 
$$ hash MD5
$$ 6B 8B FE CC 1D 85 35 7C B4 AA B9 C9 7D 4D D5 32
##$RELAX= 
##$RELAX= 
##$RELAX= 
##$RELAX= 
##$RELAX= 
##$RELAX= 
##$RELAX= 
$$ Bruker specific parameters
$$ --------------------------
##$DU= <C:\u>
##$EXPNO= 14830
##$NAME= <ADRS>
##$PROCNO= 1
##$TYPE= <nmr>
##$USER= <dgb>
##$AMP= (0..31)
100 100 100 100 100 100 100 100 100 100 100 100 100 100 100 100 100 100 
100 100 100 100 100 100 100 100 100 100 100 100 100 100 
##$AQSEQ= 0
##$AQ_mod= 3
##$AUNM= <au_zg>
##$AUTOPOS= <10 >
##$BF1= 250.13
##$BF2= 250.13
##$BF3= 250.13
##$BF4= 250.13
##$BF5= 500.13
##$BF6= 500.13
##$BF7= 500.13
##$BF8= 500.13
##$BYTORDA= 1
##$CFDGTYP= 0
##$CFRGTYP= 5
##$CHEMSTR= <none>
##$CNST= (0..31)
1 1 145 1 1 1 1 1 1 1 1 1 1 1 1 1 1 1 1 1 1 1 1 1 1 1 1 1 1 1 1 1 
##$CPDPRG= <>
##$CPDPRG1= <>
##$CPDPRG2= <>
##$CPDPRG3= <>
##$CPDPRG4= <mlev>
##$CPDPRG5= <mlev>
##$CPDPRG6= <mlev>
##$CPDPRG7= <mlev>
##$CPDPRG8= <mlev>
##$CPDPRGB= <>
##$CPDPRGT= <>
##$D= (0..31)
0 1 0 0 0 0 0 0 0 0.06 0 0 0 0 0 0 0.0002 0 0 0 0 0 0 0 0 0 0 0 0 0 0 
0 
##$DATE= 1137496932
##$DBL= (0..7)
120 120 120 120 120 120 120 120 
##$DBP= (0..7)
150 150 150 150 150 150 150 150 
##$DBP07= 0
##$DBPNAM0= <>
##$DBPNAM1= <>
$$ [...]
##$SUBNAM7= <"">
##$SUBNAM8= <"">
##$SUBNAM9= <"">
##$SW= 20.6930455092707
##$SWIBOX= (0..15)
0 0 3 0 0 0 0 0 0 0 0 0 0 0 0 0 
##$SW_h= 5175.983436853
##$TD= 65536
##$TD0= 1
##$TE= 294.16
##$TE2= 300
##$TE3= 300
##$TEG= 300
##$TL= (0..7)
0 120 120 120 120 120 120 120 
##$TP= (0..7)
150 150 150 150 150 150 150 150 
##$TP07= 0
##$TPNAME0= <>
##$TPNAME1= <>
##$TPNAME2= <>
##$TPNAME3= <>
##$TPNAME4= <>
##$TPNAME5= <>
##$TPNAME6= <>
##$TPNAME7= <>
##$TPOAL= (0..7)
0.5 0.5 0.5 0.5 0.5 0.5 0.5 0.5 
##$TPOFFS= (0..7)
0 0 0 0 0 0 0 0 
##$TUNHIN= 0
##$TUNHOUT= 0
##$TUNXOUT= 0
##$USERA1= <user>
##$USERA2= <user>
##$USERA3= <user>
##$USERA4= <user>
##$USERA5= <user>
##$V9= 5
##$VALIST= <valist>
##$VCLIST= <CCCCCCCCCCCCCCC>
##$VD= 0
##$VDLIST= <DDDDDDDDDDDDDDD>
##$VPLIST= <PPPPPPPPPPPPPPP>
##$VTLIST= <TTTTTTTTTTTTTTT>
##$WBST= 1024
##$WBSW= 4
##$XGAIN= (0..3)
0 0 0 0 
##$XL= 0
##$YL= 0
##$YMAX_a= 410377
##$YMIN_a= -359855
##$ZGOPTNS= <>
##$ZL1= 120
##$ZL2= 120
##$ZL3= 120
##$ZL4= 120
##$ABSF1= 16.45109
##$ABSF2= -4.242083
##$ABSG= 5
##$ABSL= 3
##$ALPHA= 0
##$AQORDER= 0
##$ASSFAC= 0
##$ASSFACI= 0
##$ASSFACX= 0
##$ASSWID= 0
##$AUNMP= <proc_1d>
##$AZFE= 0.1
##$AZFW= 0.1
##$BCFW= 0
##$BC_mod= 0
##$BYTORDP= 0
##$COROFFS= 0
##$CY= 12.5
##$DATMOD= 1
##$DC= 0
##$DFILT= <>
##$DTYPP= 0
##$F1P= 14.0000005364418
##$F2P= -0.99999901652339
##$FCOR= 0.5
##$FTSIZE= 32768
##$FT_mod= 6
##$GAMMA= 0
##$GB= 0
##$INTBC= 1
##$INTSCL= 1
##$ISEN= 128
##$LB= 0.3
##$LEV0= 0
##$LPBIN= 0
##$MAXI= 10000
##$MC2= 0
##$MEAN= 0
##$ME_mod= 0
##$MI= 0
##$NCOEF= 0
##$NC_proc= -3
##$NLEV= 6
##$NOISF1= 0
##$NOISF2= 0
##$NSP= 0
##$NTH_PI= 0
##$NZP= 0
##$OFFSET= 16.45109
##$PC= 1
##$PHC0= 84.45547
##$PHC1= 10.69631
##$PH_mod= 1
##$PKNL= yes
##$PPARMOD= 0
##$PSCAL= 4
##$PSIGN= 0
##$REVERSE= no
##$SF= 250.130017735816
##$SI= 32768
##$SIGF1= 0
##$SIGF2= 0
##$SINO= 400
##$SIOLD= 32768
##$SREGLST= <1H.CDCl3>
##$SSB= 0
##$STSI= 32768
##$STSR= 0
##$SW_p= 5175.98343685301
##$SYMM= 0
##$S_DEV= 0
##$TDeff= 65536
##$TDoff= 0
##$TI= <Analysis number 999999
Compound Code 99
Book Reference 9
Project Code 9>
##$TILT= no
##$TM1= 0
##$TM2= 0
##$TOPLEV= 0
##$USERP1= <user>
##$USERP2= <user>
##$USERP3= <user>
##$USERP4= <user>
##$USERP5= <user>
##$WDW= 1
##$XDIM= 32768
##$YMAX_p= 317703658
##$YMIN_p= -260127
$$ End of Bruker specific parameters
$$ ---------------------------------
##NTUPLES= NMR SPECTRUM
##VAR_NAME=  FREQUENCY,     SPECTRUM/REAL,   SPECTRUM/IMAG
##SYMBOL=    X,             R,               I
##VAR_TYPE=  INDEPENDENT,   DEPENDENT,       DEPENDENT
##VAR_FORM=  AFFN,          ASDF,            ASDF
##VAR_DIM=   32768,         32768,           32768
##UNITS=     HZ,            ARBITRARY UNITS, ARBITRARY UNITS
##FACTOR=    0.157963299565203, 1,           1
##FIRST=     4114.91139820737, 0,            0
##LAST=      -1061.07203864564, 0,           0
##MIN=       -1061.07203864564, -260127,     0
##MAX=       4114.91139820737, 317703658,    0
$$ Real data points
##PAGE= N=1
##DATA TABLE= (X++(R..R)), XYDATA
$$ [...]
$$ plain form
18514 8639106 8265312 7573444 6951513 6574486 6522284 6753852 7151924 7667545 8363835 9326601
18504 9326601 10644744 12318483 14435677 16783598 19462435 22632715 26266761 29558073
18496 29558073 31306168 30429639 27746701 24814302 23325404 23808668 25414837 26815920
18488 26815920 27268214 26517469 25794756 26181801 27050064 27527731 27112490 26219501 25572297
18479 25572297 25197867 24571706 23329628 21667988 20556326 20350643 21024191 22432371 24574318
18470 24574318 27677662 31969578 37625097 44704968 52339393 58831090 63306500 65517274
18462 65517274 66688852 67965743 68406830 67446002 65975173 64776789 64557719 65435146 68308215
18453 68308215 73956300 80620435 85950335 87536802 85100843 80036295 73572718 67284115
$$ packed form
18514H639106l73794o91868o21931l77027n2202K31568L98072N15621O96290R62766
18504I326601J318143J673739K117194K347921K678837L170280L634046L291312
18496B9558073J748095q76529k682938k932399j488898M83264J606169J401083
18488B6815920M52294p50745p22713L87045Q68263M77667m15241q92989o47204
18479B5572297l74430o26161j242078j661640j111662k05683O73548J408180K141947
18470B4574318L103344M291916N655519P079871P634425O491697M475410K210774
18462F5517274J171578J276891M41087r60828j470829j198384k19070Q77427K873069
18453F8308215N648085O664135N329900J586467k435959n064548o463577o288603
$$ plain form
18445 67284115 61201331 54883806 47268417 39331498 33396984 29709409 27732247 26979112
18437 26979112 27181024 28068094 29345486 30509915 31246785 30886430 29763527 28496373 27482609
18428 27482609 27070630 26674474 25808598 24333587 22999561 22380739 22222263 22264361 21991949
18419 21991949 21001156 19174677 16969082 15364500 14556863 14241582 14194779 14390561 14921548
18410 14921548 15565477 16057992 16230490 16015086 15647021 15555307 16034810 16941814 18214193
18401 18214193 19918498 21813632 23490699 24838605 25936302 27439146 30254014 34771706
18393 34771706 40766938 48211578 56329095 63298450 67313413 66562727 61333838 54514260
18385 54514260 47986477 42842010 39135107 36002374 33694171 32354543 31510816 30800060
$$ packed form
18445F7284115o082784o317525p615389p936919n934514l687575j977162p53135
18437B6979112K01912Q87070J277392J164429P36870l60355j122903j267154j013764
18428B7482609m11979l96156q65876j475011j334026o18822j58476M2098k72412
18419B1991949r90793j826479k205595j604582q07637l15281m6803J95782N30987
18410A4921548O43929M92515J72498k15404l68065r1714M79503R07004J272379
18401A8214193J704305J895134J677067J347906J097697J502844K814868M517692
18393C4771706N995232P444640Q117517O969355M014963p50686n228889o819578
18385E4514260o527783n144467l706903l132733k308203j339628q43727p10756
$$ plain form
18377 30800060 30580409 31406626 33373287 36169106 38989937 41073586 41629436 40940437 39814594
18368 39814594 38558363 37153599 35043181 32051610 29201545 27716240 27726891 28784820
18360 28784820 30111901 31068876 31134314 30134703 28717843 27002727 25142119 23435002 22104783
18351 22104783 21330028 20878233 20474053 19969181 19684431 20095080 21275214 23266966 26229505
18342 26229505 29988929 33600908 35863239 35690123 32674340 28439756 24305608 21004452
18334 21004452 19196080 18557916 18721059 19578418 21182998 23412035 25793108 27203125
18326 27203125 26794896 23953940 19831803 16227991 13823894 12427009 11539103 10972548
18318 10972548 10535565 10107192 9712461 9321526 8958811 8672493 8497427 8371215 8277680
$$ packed form
18377C0800060k19651Q26217J966661K795819K820831K083649N55850o88999j125843
18368C9814594j256231j404764k110418k991571k850065j485305J0651J057929
18360B8784820J327081R56975O5438r99611j416860j715116j860608j707117j330219
18351B2104783p74755m51795m04180n04872k84750M10649J180134J991752K962539
18342B6229505L759424L611979K262331j73116l015783m234584m134148l301156
18334B1004452j808372o38164J63143Q57359J604580K229037K381073J410017
18326B7203125m08229k840956m122137l603812k404097j396885q87906n66555
18318A0972548m36983m28373l94731l90935l62715k86318j75066j26212r3535
$$ plain form
18309 8277680 8219421 8123043 7971590 7645184 7230562 6859941 6617973 6459863 6267674 6062527
18299 6062527 5928580 5839517 5739025 5574345 5466803 5410694 5260773 5162896 5109995 5098029
18289 5098029 5065903 5094825 5161424 5126106 5090461 5023487 4852912 4734044 4628800 4530646 4426227
18278 4426227 4324804 4318875 4260612 4185566 4137030 4116755 4097315 4064717 4024146 4031193 3989330
18267 3989330 3943275 3889445 3868219 3813328 3724817 3649576 3541779 3475142 3471953 3469267 3398635
18256 3398635 3355032 3372578 3386506 3392351 3410343 3441748 3454086 3415149 3310186 3201532 3175391
18245 3175391 3109680 3017431 2987007 2954239 2898999 2905070 2914310 2884616 2825840 2761442 2734245 2705925
18233 2705925 2621266 2591943 2571486 2528101 2505806 2485156 2418553 2352611 2354839 2300204 2261504
$$ packed form
18309H277680n8259r6378j51453l26406m14622l70621k41968j58110j92189k05147
18299F062527j33947q9063j00492j64680j07542n6109j49921r7877n2901j1966
18289E098029l2126K8922O6599l5318l5645o6974j70575j18868j05244r8154j04419
18278D426227j01423n929n8263p5046m8536k0275j9440l2598m0571P047m1863
18267C989330m6055n3830k1226n4891q8511p5241j07797o6637l189k686p0632
18256C398635m3603J7546J3928N845J7992L1405J2338l8937j04963j08654k6141
18245C175391o5711r2249l0424l2768n5240O071R240k9694n8776o4398k7197k8320
18233B705925q4659k9323k0457m3385k2295k0650o6603o5942K228n4635l8700
$$ plain form
18222 2261504 2237811 2181866 2144051 2113036 2135232 2082997 2009305 1940633 1939167 1895765 1837081
18211 1837081 1842590 1777671 1716076 1692243 1662649 1644841 1635533 1580688 1516041 1508328 1536330 1499120
18199 1499120 1410321 1405738 1383191 1310028 1285523 1256195 1284126 1301986 1283564 1256391 1178127
18188 1178127 1133534 1107231 1051586 997344 943464 1012500 1023938 990555 930257 946276 969914
18177 969914 937405 965174 969166 1007962 976716 896522 793076 801034 819225 841177 871031 863489
18165 863489 821420 792693 787221 800058 820128 778843 756066 824889 816206 779587 814367 870867
18153 870867 810416 736385 768495 790270 740521 793989 845445 856711 868392 895616 912223
18142 912223 910254 935313 1025815 1154866 1180980 1277789 1347870 1494931 1646572 1776789 1899203
$$ packed form
18222B261504k3693n5945l7815l1015K2196n2235p3692o8672j466m3402n8684
18211A837081N509o4919o1595k3833k9594j7808r308n4845o4647p713K8002l7210
18199A499120q8799m583k2547p3163k4505k9328K7931J7860j8422k7173p8264
18188A178127m4593k6303n5645n4242n3880O9036J1438l3383o0298J6019K3638
18177I69914l2509K7769L992L8796l1246q0194j03446P958J8191K1952K9854p542
18165H63489m2069k8727n472J2837K0070m1285k2777O8823q683l6619L4780N6500
18153H70867o0451p4031L2110K1775m9749N3468N1456J1266J1681K7224J6607
18142I12223j969K5059R0502J29051K6114R6809P0081J47061J51641J30217J22414
$$ plain form
18131 1899203 2033776 2140327 2302320 2574167 2871281 3144866 3430041 3732284 4113376
18122 4113376 4590871 5147524 5884462 6748358 7933274 9542452 11624678 14241101 17702463
18113 17702463 22416598 29176227 38967387 52349624 65505293 70186086 65304800 48396148
18105 48396148 30044665 19720335 14617641 11811444 10038963 8663006 7487549 6473428
18097 6473428 5624861 4885418 4329142 3891524 3464608 3167662 2993176 2854721 2739449
18088 2739449 2587288 2414350 2305783 2248602 2148564 2093814 2053720 2012161 1980860 1943334
18078 1943334 1925054 1864416 1803802 1770829 1759607 1736910 1669532 1671476 1645078 1624415 1574894
18067 1574894 1525014 1495552 1536913 1519505 1468523 1468647 1489467 1417864 1358774 1359053 1375828 1371302
$$ packed form
18131A899203J34573J06551J61993K71847K97114K73585K85175L02243L81092
18122D113376M77495N56653P36938Q63896J184916J609178K082226K616423L461362
18113A7702463M714135O759629R791160J3382237J3155669M680793m881286j6908652
18105D8396148j8351483j0324330n102694k806197j772481j375957j175457j014121
18097F473428q48567p39443n56276m37618m26916k96946j74486j38455j15272
18088B739449j52161j72938j08567n7181j00038n4750m0094m1559l1301l7526
18078A943334j8280o0638o0614l2973j1222k2697o7378J944k6398k0663m9521
18067A574894m9880k9462M1361j7408n0982J24K0820p1603n9090K79J6775m526
$$ plain form
18055 1371302 1420646 1443479 1483572 1432003 1453175 1474002 1434760 1407162 1382699 1359556 1325469
18044 1325469 1294585 1281947 1261959 1225877 1224244 1287535 1276253 1208766 1187122 1175370 1149249
18033 1149249 1163760 1159255 1143993 1146294 1176628 1161647 1186310 1154845 1118136 1131454 1254947
18022 1254947 1288779 1215406 1220380 1257560 1329109 1356046 1363706 1269441 1315605 1301489 1324464 1390464
18010 1390464 1372451 1352010 1387384 1471232 1620569 1706209 1747363 1716112 1652729 1577284 1558077
17999 1558077 1457133 1382671 1358567 1353955 1343345 1330742 1340435 1353893 1362337 1371777 1389022 1377857
17987 1377857 1447911 1418351 1323778 1254595 1179971 1204310 1182523 1133106 1105285 1123491 1142271
17976 1142271 1152335 1173753 1099391 1066252 1109348 1157917 1187758 1152519 1093301 1069044 1042025
$$ packed form
18055A371302M9344K2833M0093n1569K1172K0827l9242k7598k4463k3143l4087
18044A325469l0884j2638j9988l6082j633O3291j1282o7487k1644j1752k6121
18033A149249J4511m505j5262K301L0334j4981K4663l1465l6709J3318J23493
18022A254947L3832p3373M974L7180P1549K6937P660r4265M6164j4116K2975O6000
18010A390464j8013k0441L5374Q3848J49337Q5640M1154l1251o3383p5445j9207
17999A558077j00944p4462k4104m612j0610j2603R693J3458Q444R440J7245j1165
17987A377857P0054k9560r4573o9183p4624K4339k1787m9417k7821J8206J8780
17976A142271J0064K1418p4362l3139M3096M8569K9841l5239n9218k4257k7019
$$ plain form
17965 1042025 1027012 995127 954170 977699 923707 905479 873267 812579 748688 712961 668540
17954 668540 628704 611055 597765 604522 632932 613661 602295 560111 518977 480875 472993 511211
17942 511211 533576 471069 450978 464961 437796 391847 393137 373303 364973 406406 435798 434524
17930 434524 417689 347957 355921 414553 428967 401489 364424 312566 326182 306211 300843 309782
17918 309782 357100 364870 312771 306360 308053 319286 317404 283622 201982 234394 288772 274451
17906 274451 249932 177863 185301 203000 194106 179048 198682 201501 172596 190054 200365 199134
17894 199134 183204 241089 281937 312112 345075 343452 382929 394134 363608 350066 309201 317189
17882 317189 340157 342682 386307 363367 326439 326374 320528 340724 391232 394095 367327 385396 399615
$$ packed form
17965A042025j5013l1885m0957K3529n3992j8228l2212o0688o3891l5727m4421
17954F68540l9836j7649j3290O757K8410j9271j1366m2184m1134l8102p882L8218
17942E11211K2365o2507k0091J3983k7165m5949J290j9834q330M1433K9392j274
17930D34524j6835o9732P964N8632J4414k7478l7065n1858J3616j9971n368Q939
17918C09782M7318P770n2099o411J693J1233j882l3782q1640L2412N4378j4321
17906B74451k4519p2069P438J7699q894j5058J9634K819k8905J7458J0311j231
17894A99134j5930N7885M0848L0175L2963j623L9477J1205l0526j3542m0865P988
17882C17189K2968K525M3625k2940l6928o5n846K0196N0508K863k6768J8069J4219
$$ plain form
17869 399615 396057 295899 237358 342981 375078 323784 254652 205774 213902 218461 153084 126849
17857 126849 170623 242645 243168 180679 216283 248140 298187 348325 386263 401730 393014 364988
17845 364988 359164 351478 367068 325307 326060 376553 377207 358025 327493 399087 412417 347692 309938
17832 309938 333497 340980 335596 341691 358736 412630 416064 325222 302993 297258 249943 256860 272798
17819 272798 301911 285305 258925 256294 238684 287333 344817 260204 219496 223972 253334 249036
17807 249036 269508 310995 265141 259388 255684 210279 249045 281817 258185 197569 152973 182613
17795 182613 298455 296898 235733 182557 132652 120623 123961 147260 154803 145989 137506 125256
17783 125256 168209 190425 200893 174923 106582 50166 106491 137216 157595 247608 265669
$$ packed form
17869C99615l558j00158n8541J05623L2097n1294o9132m8878Q128M559o5377k6235
17857A26849M3774P2022N23o2489L5604L1857N0047N0138L7938J5467q716k8026
17845C64988n824p686J5590m1761P53N0493O54j9182l0532P1594J3330o4725l7754
17832C09938K3559P483n384O095J7045N3894L434r0842k2229n735m7315O917J5938
17819B72798K9113j6606k6380k631j7610M8649N7484q4613m0708M476K9362m298
17807B49036K0472M1487m5854n753l704m5405L8766L2772k3632o0616m4596K9640
17795A82613J15842j557o1165n3176m9905j2029L338K3299P543q814q483j2250
17783A25256M2953K2216J0468k5970o8341n6416N6325L0725K0379R0013J8061
$$ plain form
17772 265669 217083 177360 118783 176549 163511 99329 61329 42955 125615 111926 104040 40795
17760 40795 91411 110400 89196 144012 76368 67840 17643 -9596 -10857 -39239 -28678 -16825
17748 -16825 -21292 30660 -17079 33222 96348 124352 132974 135183 142826 150770 183957 156305 80835
17735 80835 76421 91296 92523 95159 26361 -1554 -6362 -55573 -120263 -8698 46053 -1026
17723 -1026 -1723 -1397 16547 -3453 -7747 95896 142749 175230 157129 172370 204800 173845 151620
17710 151620 178045 183638 217762 204584 151821 140017 150816 78660 8355 104736 125540 121341
17698 121341 161844 91936 29077 14921 71269 76915 57085 87956 123133 172636 221859 166176
17686 166176 146881 156007 160092 163356 193993 153299 105373 93838 98321 65364 31261 -24968
$$ packed form
17772B65669m8586l9723n8577N7766j3038o4182l8000j8374Q2660j3689p886o3245
17760D0795N0616J8989k1204N4816o7644q528n0197k7239j261k8382J0561J1853
17748a6825m467N1952m7739N0301O3126K8004Q622K209P643P944L3187k7652p5470
17735H0835m414J4875J227K636o8798k7915m808m9211o4690J11565N4751m7079
17723a026o97L26J7944k0000m294J03643M6853L2481j8101J5241L2430l0955k2225
17710A51620K6425N593L4124j3178n2763j1804J0799p2156p0305R6381K0804m199
17698A21341M0503o9908o2859j4156N6348N646j9830L0871L5177M9503M9223n5683
17686A66176j9295R126M085L264L0637m0694m7926j1535M483l2957l4103n6229
$$ plain form
17674 -24968 -1258 22096 20690 15650 21773 53529 53514 12991 37383 53334 77068 42413 55625
17661 55625 64827 75195 66485 49840 24453 59507 68085 100365 106061 57223 -40008 -15997
17649 -15997 20064 6592 -9412 24101 681 -52869 -31837 14452 58504 53003 7117 15398
17637 15398 45864 21702 46558 89264 55038 69882 83899 107454 183675 199905 212709 192118
17625 192118 114399 56795 20854 31184 -1970 16988 80520 63518 -8854 16538 63186
17614 63186 101282 112623 130813 123798 115268 119077 156491 152077 83257 69554 44772 53182 137601
17601 137601 174092 139369 151901 232149 250220 271586 313844 252048 207971 215022 152728 161334
17589 161334 204990 207938 240635 332309 346363 329576 332892 316575 292690 267510 278357 278770
$$ packed form
17674b4968K3710K3354j406n040O123L1756j5m0523K4392J5951K3734l4655J3212
17661E5625R202J0368q710j6645k5387L5054Q578L2280N696m8838r7231K4011
17649a5997L6061j3472j6004L3513k3420n3550K1032M6289M4052n501m5886Q281
17637A5398L0466k4162K4856M2706l4226J4844J4017K3555P6221J6230J2804k0591
17625A92118p7719n7604l5941J0330l3154J8958O3532j7002p2372K5392M6648
17614F3186L8096J1341J8190p015q530L809L7414m414o8820j3703k4782Q410Q4419
17601A37601L6491l4723J2532Q0248J8071K1366M2258o1796m4077P051o2294Q606
17589A61334M3656K948L2697R1674J4054j6787L316j6317k3885k5180J0847M13
$$ plain form
17577 278770 268890 349052 448079 490352 470536 426825 439084 416153 409907 400635 399354 373613
17565 373613 363276 339235 309538 312001 306929 305138 389060 342848 311922 335151 332083 233207
17553 233207 160682 174800 242837 264254 228075 204363 136002 130359 202945 252109 207823 258082
17541 258082 265123 262220 290138 233252 199722 239163 244099 171299 130817 205964 218085 193049
17529 193049 163414 127507 135137 134928 98580 104377 153009 98796 61804 75793 39169 51349
17517 51349 151830 210853 213099 239867 285054 257477 312772 320798 296029 281317 237347 209925
17505 209925 159875 109260 145370 207126 276966 322426 334510 290169 326890 323688 256262 253059
17493 253059 299790 333520 413814 440970 422349 448596 412830 380690 416377 454319 518931
$$ packed form
17577B78770r880Q0162R9027M2273j9816m3711J2259k2931o246r272j281k5741
17565C73613j0337k4041k9697K463n072j791Q3922m6212l0926K3229l068r8876
17553B33207p2525J4118O8037K1417l6179k3712o8361n643P2586M9164m4286N0259
17541B58082P041k903K7918n6886l3530L9441M936p2800m0482P5147J2121k5036
17529A93049k9635l5907P630k09l6348N797M8632n4213l6992J3989l6624J2180
17517E1349J00481N9023K246K6768M5187k7577N5295Q026k4769j4712m3970k7422
17505B09925n0050n0615L6110O1756O9840M5460J2084m4341L6721l202o7426l203
17493B53059M6731L3730Q0294K7156j8621K6247l5766l2140L5687L7942O4612
$$ plain form
17482 518931 562926 511639 534635 614964 701388 724273 810123 903451 935503 942035 935603 1007680
17470 1007680 1114988 1200429 1354505 1537194 1732867 1991289 2312040 2586565 2834524 3123269
17460 3123269 3418422 3681050 3970299 4259471 4642164 5163794 5851747 6628232 7479764
17451 7479764 8392438 9476881 10833543 12532527 14817774 17801773 21755735 27081432
17443 27081432 34213453 43809708 56014839 69801266 82412400 90127448 89752498 80827798
17435 80827798 66106257 50000777 36230140 26553195 20494031 16644488 13952922 11956118
17427 11956118 10312661 9014414 7983327 7098256 6417473 5883608 5484505 5028772 4651931
17418 4651931 4400220 4127789 3888475 3663797 3513821 3493752 3522684 3446407 3406599 3337455
$$ packed form
17482E18931M3995n1287K2996Q0329Q6424K2885Q5850R3328L2052O532o432P2077
17470A007680J07308Q5441J54076J82689J95673K58422L20751K74525K47959K88745
17460C123269K95153K62628K89249K89172L82693N21630O87953P76485Q51532
17451G479764R12674J084443J356662J698984K285247K983999L953962N325697
17443B7081432P132021R596255J2205131J3786427J2611134P715048l74950q924700
17435H0827798j4721541j6105480j3770637r676945o059164l849543k691566j996804
17427A1956118j643457j298247j031087q85071o80783n33865l99103m55733l76841
17418D651931k51711k72431k39314k24678j49976k0069K8932p6277l9808o9144
$$ plain form
17408 3337455 3131739 2968245 2833451 2722845 2658458 2553283 2483412 2400976 2355107 2287195
17398 2287195 2258063 2172473 2123096 2044855 2003556 1999572 1992470 1995025 1975586 1962473 1930179 1957353
17386 1957353 1999823 1947295 1893012 1864351 1842512 1785127 1788576 1743428 1713223 1735330 1712362
17375 1712362 1646605 1593970 1595853 1624333 1629361 1584187 1575258 1591647 1618634 1620723 1535390 1449158
17363 1449158 1431117 1428433 1452353 1539876 1514535 1521477 1531025 1503958 1490362 1509293 1569868 1572513
17351 1572513 1574494 1569216 1563813 1494084 1454900 1522701 1532468 1505410 1560811 1611674 1620413 1618229
17339 1618229 1579789 1593566 1626373 1579139 1530659 1501937 1546845 1592835 1603092 1648676 1631657
17328 1631657 1680169 1689514 1736213 1741601 1681637 1620496 1648970 1685378 1680022 1708601 1718524 1718026
$$ packed form
17408C337455k05716j63494j34794j10606o4387j05175o9871q2436m5869o7912
17398B287195k9132q5590m9377p8241m1299l984p102K555j9439j3113l2294K7174
17386A957353M2470n2528n4283k8661k1839n7385L449m5148l0205K2107k2968
17375A712362o5757n2635J883K8480N028m5174q929J6389K6987K089q5333q6232
17363A449158j8041k684K3920Q7523k5341O942R548k7067j3596J8931O0575K645
17351A572513J981n278n403o9729l9184O7801R767k7058N5401N0863Q739k184
17339A618229l8440J3777L2807m7234m8480k8722M4908M5990J0257M5584j7019
17328A631657M8512R345M6699N388n9964o1141K8474L6408n356K8579R923m98
$$ plain form
17316 1718026 1611659 1578293 1562115 1564741 1522400 1501880 1425073 1321825 1323079 1357254 1401201
17305 1401201 1409752 1359192 1283410 1265819 1233895 1192311 1114739 1030830 1016265 1032880 968455
17294 968455 938849 925368 911317 809389 773234 773008 751266 700107 643609 633152 645240 585711
17282 585711 529947 499636 473861 482880 455888 483613 459163 434941 409840 353787 316129 337645
17270 337645 364384 308800 254429 223977 221117 228618 224971 210392 206954 195096 149157 106142
17258 106142 110764 151534 169477 147522 144589 108449 107435 105299 91016 51298 1705 -30401
17246 -30401 -63269 -5408 7881 81255 129369 117137 28532 -16021 30187 30287 -6350 3041
17234 3041 16202 33660 18363 21054 7210 24374 45728 26810 12910 -33986 -9279 2137
$$ packed form
17316A718026j06367l3366j6178K626m2341k0520p6807j03248J254L4175M3947
17305A401201Q551n0560p5782j7591l1924m1584p7572q3909j4565J6615o4425
17294I68455k9606j3481j4051j01928l6155k26k1742n1159n6498j0457J2088n9529
17282E85711n5764l0311k5775R019k6992K7725k4450k4222k5101n6053l7658K1516
17270C37645K6739n5584n4371l0452k860P501l647j4579l438j1858m5939m3015
17258A06142M622M0770J7943k1955k933l6140j014k136j4283l9718m9593l2106
17246c0401l2868N7861J3289P3374M8114j2232q8605m4553M6208J00l6637R391
17234C041J3161J7458j5297K691j3844J7164K1354j8918j3900m6896K4707J1416
$$ plain form
17222 2137 -29689 -25309 -62893 2032 58088 16011 16568 14099 -50880 -95750 -102753 -109030 -77080
17209 -77080 -87587 -57797 -12679 -31645 -6821 56373 95140 96578 68198 35465 37380 55152
17197 55152 53646 67880 71507 41058 47025 44538 38517 87421 37107 17340 20613 51270 100888
17184 100888 67999 88436 55285 72673 83284 43368 56062 43412 67345 79259 109780
17173 109780 179833 212833 188551 175594 202879 195078 184110 156320 113453 93640 146126 205506
17161 205506 154211 148498 175250 197743 180048 152010 217003 248516 211458 161057 107284 98698
17149 98698 105622 138478 141438 122782 131133 156529 107052 95351 66799 71850 51518 36637
17137 36637 63116 119300 110988 74807 89782 69123 106661 151172 100740 72248 90725 17931
$$ packed form
17222B137l1826M380l7584O4925N6056m2077N57k469o4979m4870p003o277L1950
17209g7080j0507K9790M5118j8966K4824O3194L8767J438k8380l2733J915J7772
17197E5152j506J4234L627l0449N967k487o021M8904n0314j9767L273L0657M9618
17184A00888l2889K0437l3151J7388J0611l9916J2694j2650K3933J1914L0521
17173A09780P0053L3000k4282j2957K7285p801j0968k7790m2867j9813N2486N9380
17161B05506n1295n713K6752K2493j7695k8038O4993L1513l7058n0401n3773q586
17149I8698O924L2856K960j8656Q351K5396m9477j1701k8552N051k0332j4881
17137C6637K6479N6184q312l6181J4975k0659L7538M4511n0432k8492J8477p2794
$$ plain form
17125 17931 69514 84908 61432 61274 85967 91966 95542 84015 17995 -42017 -7821 36214
17113 36214 102333 59381 85526 109271 61313 26821 41593 94403 105876 75084 87849 58021
17101 58021 56012 1424 -41353 -44093 -59985 -79629 -99655 -72527 -4467 55739 103001 105160
17089 105160 87001 61200 28977 51802 73704 34698 -66105 -72339 -29400 -57304 -47861 -63776
17077 -63776 -40682 -61528 -34394 4601 -4086 26732 23543 -45145 -50302 -67168 -107596 -9813
17065 -9813 28778 67576 53093 7636 1448 24470 -19772 -33456 -18049 -8731 6130 -54122
17053 -54122 -81051 4266 65151 46602 48422 56802 43814 13665 22919 26535 21770 27076 -33736
17040 -33736 -16953 7059 51672 102453 109880 78166 -17781 -25520 25873 90935 81656 99000
$$ packed form
17125A7931N1583J5394k3476j58K4693N999L576j1527o6020o0012L4196M4035
17113C6214O6119m2952K6145K3745m7958l4492J4772N2810J1473l0792J2765k9828
17101E8021k009n4588m2777k740j5892j9644k0026K7128O8060O0206M7262K159
17089A05160j8159k5801l2223K2825K1902l9006j00803o234M2939k7904R443j5915
17077f3776K3094k0846K7134L8995q687L0818l189o8688n157j6866m0428R7783
17065i813L8591L8798j4483m5457o188K3022m4242j3684J5407R318J4861o0252
17053e4122k6929Q5317O0885j8549J820Q380j2988l0149R254L616m765N306o0812
17040c3736J6783K4012M4613N0781P427l1714r5947p739N1393O5062r279J7344
$$ plain form
17028 99000 108346 75048 49257 66231 42800 -32429 -68450 -56031 12387 28122 46653 32427
17016 32427 69261 92061 109970 105532 123554 167611 120197 -1935 -14659 -14744 28810 111520
17004 111520 125114 119953 109998 21273 -21754 -43777 -59552 -71669 -30718 -16422 19819 31393
16992 31393 12237 32055 -22246 -13657 39351 54807 97024 83640 21579 -11112 23135 5670
16980 5670 11927 11803 68331 58837 28196 37669 15056 23344 -2054 31329 59678 28852 53899
16967 53899 57584 -23542 -69073 -43738 -40203 8471 23659 267 -22707 -5265 7050 22718
16955 22718 70868 54433 56710 11793 38688 33756 31161 46733 -72198 -97527 -80631 -41940
16943 -41940 -32737 -16896 -24338 -14989 637 26363 23951 50547 65097 40522 13374 20509 48767
$$ packed form
17028I9000R346l3298k5791J6974k3431p5229l6021J2419O8418J5735J8531j4226
17016C2427L6834K2800J7909m438J8022M4057m7414j22132j2724q5M3554Q2710
17004A11520J3594n161r955q8725m3027k2023j5775j2117M0951J4296L6241J1574
16992C1393j9156J9818n4301Q589N3008J5456M2217j3384o2061l2691L4247j7465
16980E670O257j24N6528r494l0641R473k2613Q288k5398L3383K8349l0826K5047
16967E3899L685q1126m5531K5335L535M8674J5188k3392k2974J7442J2315J5668
16955B2718M8150j6435K277m4917K6895m932k595J5572j18931k5329J6896L8691
16943d1940R203J5841p442R349J5626K5726k412K6596J4550k4575k7148P135K8258
$$ plain form
16930 48767 57226 62056 45976 -16598 -21487 10232 10081 15476 36661 -17649 -32257 -1958 56837
16917 56837 68021 79386 18497 -20821 22819 -45899 -29185 -30374 -47007 -39379 -31134 -75120
16905 -75120 -92176 -67676 -40023 -52266 -320 69166 48804 -10433 -20886 -21357 -112652 -137791
16893 -137791 -118473 -100519 -66856 -110677 -116016 -73937 -22847 -9221 -2397 -5854 25092 5775
16881 5775 11473 26054 16804 3186 -30623 11407 85252 112439 150017 127242 148420 229838
16869 229838 332254 409731 409276 479329 574363 528325 499372 380356 275835 227046 154319
16858 154319 100925 23597 -23331 -68546 14845 35216 46549 17271 -26088 -7395 -4903 -3998
16846 -3998 210 -57825 -33738 3013 -18806 13599 97101 151463 125211 69612 1854 23251
$$ packed form
16930D8767Q459M830j6080o2574m889L1719j51N395K1185n4310j4608L0299N8795
16917E6837J1184J1365o0889l9318M3640o8718J6714j189j6633P628Q245m3986
16905g5120j7056K4500K7653j2243N1946O9486k0362n9237j0453m71r1295k5139
16893a37791J9318J7954L3663m3821n339M2079N1090J3626O824l457L0946j9317
16881E775N698J4581r250j3618l3809M2030P3845K7187L7578k2775K1178Q1418
16869B29838J02416P7477m55P0053R5034m6038k8953j19016j04521m8789p2727
16858A54319n3394p7328m6928m5215Q3391K0371J1333k9278m3359J8693K492R05
16846c998M208n8035K4087L6751k1819L2405Q3502N4362k6252n5599o7758K1397
$$ plain form
16834 23251 42301 64294 34942 13082 80023 86109 110681 47058 -6737 9480 -37459 -74167
16822 -74167 -96114 -111000 -97810 -88608 -13980 -30689 -23491 -6413 -21510 -12641 -1565 -15604
16810 -15604 33501 78186 111405 54962 3625 -4894 -57895 -51443 -113866 -168378 -138026 -111104
16798 -111104 -162806 -118230 -20269 -29036 -25037 -43882 -52388 -69549 -27687 -21086 -26237 14722
16786 14722 24893 71423 94099 64536 35970 20905 4798 -5373 16949 28759 -97700
16775 -97700 -146231 -94166 -55268 -47217 -63733 -66952 -74056 -75798 15219 11500 -14839 -16791 -11175
16762 -11175 18648 46515 7868 -2351 -44534 -16668 -21237 -63043 -42287 10405 59394 66949
16750 66949 -4976 13558 -21760 -76413 -26236 -37786 -84375 -6686 -47276 -93710 -84335 -134897
$$ packed form
16834B3251J9050K1993k9352k1860O6941O086K4572o3623n3795J6217m6939l6708
16822g4167k1947j4886J3190R202P4628j6709P198J7078j5097Q869J1076j4039
16810a5604M9105M4685L3219n6443n1337q519n3001O452o2423n4512L0352K6922
16798a11104n1702M4576R7961q767L999j8845q506j7161M1862O601n151M0959
16786A4722J0171M6530K2676k9563k8566j5065j6107j0171K2322J1810j26459
16775i7700m8531N2065L8898Q051j6516l219p104j742R1017l719k6339j952N616
16762a1175K9823K7867l8647j0219m2183K7866m569m1806K0756N2692M8989P555
16750F6949p1925J8534l5318n4653N0177j1550m6589P7689m0590m6434R375n0562
$$ plain form
16738 -134897 -167208 -131889 -6308 73811 60533 -15126 -66494 -6389 47657 54685 31969
16727 31969 39043 -23680 -31916 -48955 -121786 -137285 -73883 -29033 -27693 -46910 -38525 -41757 -9449
16714 -9449 -12824 5465 -5867 -28975 4219 -16853 -30260 -63514 -103679 -159313 -127835 -59668
16702 -59668 -53362 -115669 -123852 -90951 -50140 -13065 -31108 -44435 29746 68209 45923 13113
16690 13113 -79945 -47100 1093 31356 35409 41284 98206 155302 95416 101548 95166 78102
16678 78102 70848 52416 93288 101607 70377 81725 93911 113708 147464 165920 189245 339129
16666 339129 553579 692037 745637 839145 895736 852774 680481 508178 428573 269924
16656 269924 167472 119044 128639 134759 121206 18229 -63886 -59595 -23215 5825 5859 10390
$$ packed form
16738a34897l2311L5319J25581Q0119j3278p5659n1368O0105N4046P028k2716
16727C1969P074o2723q236j7039p2831j5499O3402M4850J340j9217Q385l232L2308
16714i449l375J8289j1332k3108L3194k1072j3407l3254m0165n5634L1478O8167
16702e9668O306o2307q183L2901M0811L7075j8043j3327P4181L8463k2286l2810
16690A3113r3058L2845M8193L0263M053N875N6922N7096n9886O132o382j7064
16678G8102p254j8432M0872Q319l1230J1348J2186J9797L3756J8456K3325J49884
16666C39129K14450J38458N3600R3508N6591m2962j72293j72303p9605j58649
16656B69924j02452m8428R595O120j3553j02977q2115M291L6380K9040L4M531
$$ plain form
16644 10390 -41785 -48015 -67027 -95299 -104005 -86245 -1582 59605 27556 57845 94671 104998
16632 104998 39246 42696 45714 -1212 -22268 25587 80209 24414 1631 12201 2641 -9592
16620 -9592 -31255 -67749 -90341 -58752 -11902 13227 8725 26391 -13312 -56461 -13629 20481
16608 20481 40227 30491 72702 79092 42682 22215 16986 39240 56259 11791 7985 23508
16596 23508 50635 95678 39542 -45840 -43522 -18074 -50864 -66337 -63268 -9082 42662 46067
16584 46067 44464 39300 62952 75414 45946 -10302 -25308 -45501 -8767 11593 -47963 -135275
16572 -135275 -115461 -111485 -143868 -111465 -58905 -69054 -64455 -53477 5233 57347 87527 101813
16560 101813 54616 54758 12341 -15381 22536 17012 31440 99366 126300 146014 83217 8870
$$ packed form
16644A0390n2175o230j9012k8272q706J7760Q4663O1187l2049L0289L6826J0327
16632A04998o5752L450L018m6926k1056M7855N4622n5795k2783J0570r560j2233
16620i592k1663l6494k2592L1589M6850K5129m502J7666l9703m3149M2832L4110
16608B0481J9746r736M2211O390l6410k0467n229K2254J7019m4468l806J5523
16596B3508K7127M5043n6136q5382K318K5448l2790j5473L069N4186N1744L405
16584D6067j603n164K3652J2462k9468n6248j5006k0193L6734K0360n9556q7312
16572a35275J9814L976l2383L2403N2560j0149M599J0978N8710N2114L0180J4286
16560A01813m7197J42m2417k7722L7917n524J4428O7926K6934J9714o2797p4347
$$ plain form
16548 8870 -9984 -11238 -5154 -61597 -58237 6487 -1850 27234 85549 75942 71452 72137 63133 107453
16534 107453 105526 98268 57287 65452 69469 104986 85479 76662 59871 23034 -19154 -9479 -34938
16521 -34938 -29685 1005 65024 23235 -33471 -73411 -56922 -51248 -35256 -6406 57932 99105
16509 99105 56990 -9794 -21347 14866 27819 19194 16998 500 -73732 -28480 -21842 -26973
16497 -26973 -44282 -14416 28382 32770 -43373 -116646 -87766 -33842 -19339 -25529 -28746 -34009
16485 -34009 -39181 -14014 -11090 -44016 -59877 -83260 -60316 -29814 -40268 -13198 -46200 -54140
16473 -54140 12204 19063 -960 10586 -19178 -6951 -15615 -28300 -27078 -35851 -60637 -77960
16461 -77960 -18005 -19118 -98026 -142443 -81577 -37477 29354 45689 31350 11329 -4833 -505
$$ packed form
16548H870j8854j254O084n6443L360O4724q337K9084N8315r607m490O85r004M4320
16534A07453j927p258m0981Q165M017L5517j9507q817j6791l6837m2188R675k5459
16521c4938N253L0690O4019m1789n6706l9940J6489N674J5992K8850O4338M1173
16509I9105m2115o6784j1553L6213J2953q625k196j6498p4232M5252O638n131
16497b6973j7309K9866M2798M388p6143p3273K8880N3924J4503o190l217n263
16485c4009n172K5167K924l2926j5861k3383K2944L0502j0454K7070l3002p940
16473e4140O6344O859k0023J1546k9764J2227q664j2685J222q773k4786j7323
16461g7960N9955j113p8908m4417O0866M4100O6831J6335j4339k0021j6162M328
$$ plain form
16449 -505 -33769 -106068 -58538 -42850 -19574 -46619 -69097 -54761 -48093 15362 -1283 -2111 -34517
16436 -34517 -64655 -61497 -50241 -39449 -22197 -13339 24752 -1352 -40670 -77144 -84149 -59869
16424 -59869 -51823 13156 3699 53487 72381 -1238 -11268 22809 -4126 10697 -21966 -11034
16412 -11034 -25706 -30473 -45802 -44648 -79189 -81372 -65050 -116265 -112862 -95076 -81125 3759
16400 3759 22830 83746 135114 99298 33084 -32289 -5835 63761 57551 48427 59160 39412
16388 39412 37743 19116 -31080 3537 -5127 -3760 -19089 -14042 -43654 -76430 -70716 -43997 -72490
16375 -72490 -103523 -30059 -279 166 -16454 -61211 -90339 -76726 -19547 -16732 18801 34291
16363 34291 -36992 -88998 -45113 -42274 -79743 -74290 -19193 19920 -44869 -114560 -83783 -43185
$$ packed form
16449e05l3264p2299M7530J5688K3276k7045k2478J4336O668O3455j6645q28l2406
16436c4517l0138L158J1256J0792J7252Q858L8091k6104l9318l6474p005K4280
16424e9869Q046O4979r457M9788J8894p3619j0030L4077k6935J4823l2663J0932
16412a1034j4672m767j5329J154l4541k183J6322n1215L403J7786J3951Q4884
16400C759J9071O0916N1368l5816o6214o5373K6454O9596o210r124J0733j9748
16388C9412j669j8627n0196L4617q664J367j5329N047k9612l2776N714K6719k8493
16375g2490l1033P3464K9780M45j6620m4757k9128J3613N7179K815L5533J5490
16363C4291p1283n2006M3885K839l7469N453N5097L9113o4789o9691L0777M0598
$$ plain form
16351 -43185 -44061 23705 47635 -12080 -100168 -114807 -87918 -39199 -32538 -22542 -38686 -1114
16339 -1114 19198 -11149 26379 14648 -12043 -10419 -41100 -89026 -84894 -103661 -42540 19883
16327 19883 19955 -33400 -50872 -39034 8516 16371 66497 123724 76623 40355 401 -39505
16315 -39505 -67103 -89629 -83579 -36251 8830 22962 22977 31142 -46461 -47581 2771 -27480 -27142
16302 -27142 -10238 -239 -46499 -24588 -56404 -22135 7421 7524 -61881 -43428 7852 1626
16290 1626 -53718 -105398 -125300 -117051 -51838 -36364 -43753 -11364 -41956 -43348 -46427 -85330 -57517
16277 -57517 -60984 -115204 -111416 -99701 -70480 -79477 -92983 -119569 -93626 -98541 -113552 -70856
16265 -70856 -45812 -26093 -8083 4449 27318 84907 130619 110815 81437 34846 -26956 -69354
$$ packed form
16351d3185q76O7766K3930n9715q8088j4639K6889M8719O661R996j6144L7572
16339a114K0312l0347L7528j1731k6691J624l0681m7926M132j8767O1121O2423
16327A9883P2n3355j7472J1838M7550P855N0126N7227m7101l6268l9954l9906
16315c9505k7598k2526O050M7328M5081J4132J5Q165p7603j120N0352l0251L38
16302b7142J6904R999m6260K1911l1816L4269K9556J03o9405J8453N1280o226
16290A626n5344n1680j9902Q249O5213J5474p389L2389l0592j392l079l8903K7813
16277e7517l467n4220L788J1715K9221q997j3506k6586K5943m915j5011M2696
16265g0856K5044J9719J8010J2532K2869N7589M5712j9804k9378m6591o1802m2398
$$ plain form
16253 -69354 -23111 -26373 -1077 35298 -1158 -20864 -49401 -63722 -74437 -98058 -87328 -9935
16241 -9935 -2501 -27158 -44243 -72647 -63991 -1318 29883 25380 -9145 -45659 -17957 1072
16229 1072 -35224 -42892 -30657 -9849 3217 -23493 22174 17180 26099 -17072 -42946 -23774
16217 -23774 -21681 -54317 -93326 -66033 -42781 -47207 -64589 26459 60265 10412 -88476 -141845
16205 -141845 -151674 -82759 -82988 -70767 -44726 -17124 47461 92357 84637 79232 71340 35196 -51728
16192 -51728 -69270 -14531 48698 11637 -10932 -9584 -22880 -30616 -45419 -73048 -70640 -30214
16180 -30214 4413 53224 92890 44801 -20222 -10184 -52804 -79886 -108124 -139818 -109422 -26975
16168 -26975 -50519 -90420 -97987 -28263 31810 18670 59766 17051 -808 -5751 -44420 10665
$$ packed form
16253f9354M6243l262K5296L6375l6456j9706k8537j4321j0715k3621J0730P7393
16241i935P434k4657j7085k8404Q656O2673L1201m503l4525l6514K7702J9029
16229A072l6296p668J2235K0808J3066k6710M5667m994Q919m3171k5874J9172
16217b3774K093l2636l9009K7293K3252m426j7382R1048L3806m9853r8888n3369
16205a41845r829O8915k29J2221K6041K7602O4585M4896p720n405p892l6144q6924
16192e1728j7542N4739O3229l7061k2569J348j3296p736j4803k7629K408M0426
16180c0214L4627M8811L9666m8089o5023J0038m2620k7082k8238l1694L0396Q2447
16168b6975k3544l9901p567O9724O0073j3140M1096m2715j7859m943l8669N5085
$$ plain form
16156 10665 -15088 -10243 -45614 -78164 -54777 -78775 -76529 -51943 6758 55354 64693 51235
16144 51235 -1591 -21948 -45292 -1996 46978 27487 -15908 -1203 16901 8414 -20773 -9466
16132 -9466 -10801 20955 -4946 -87810 -125699 -83287 -86642 -74095 -50188 -11435 50162 -3305
16120 -3305 -65082 -69038 -26987 -33176 3973 22143 -54558 -40170 -45154 43466 70805 76533 52114
16107 52114 -2971 -21856 10271 52975 9592 -16847 -7751 -44202 -76242 -34503 -29496 13887
16095 13887 25010 -2093 15666 36766 38940 26118 -13854 4041 57604 76033 82432 15584
16083 15584 -33024 -89018 -118580 -67859 -11722 -44336 -67890 -53752 -100492 -39036 -33521 -8129
16071 -8129 34991 43945 73069 57464 40424 58810 31999 5269 13714 19725 -39386 -45102 -74048
$$ packed form
16156A0665k5753M845l5371l2550K3387k3998K246K4586N8701M8596R339j3458
16144E1235n2826k0357k3344M3296M8974j9491m3395J4705J8104q487k9187J1307
16132i466j335L1756k5901q2864l7889M2412l355J2547K3907L8753O1597n3467
16120c305o1777l956M2051o189L7149J8170p6701J4388m984Q8620K7339N728k4419
16107E2114n5085j8885L2127M2704m3383k6439R096l6451l2040M1739N007M3383
16095A3887J1123k7103J7759K1100K174j2822l9972J7895N3563J8429O399o6848
16083A5584m8608n5994k9562N0721N6137l2614k3554J4138m6740O1456N515K5392
16071h129M3120Q954K9124j5605j7040J8386k6811k6730Q445O011n9111n716k8946
$$ plain form
16058 -74048 -58361 -31599 -22889 -88163 -95548 -48080 -7857 -5058 7386 49417 46486 -16852
16046 -16852 -127329 -128112 -88320 -34763 -1693 -23316 -15697 -643 -33500 -32314 -17039 -9689
16034 -9689 44877 30302 4772 -56018 -70206 -79438 -39408 -2035 890 -3725 -35466 -35896 -4380
16021 -4380 -37255 -34424 14926 9119 -15149 34656 66639 68891 50766 53779 28813 -50698 -48810
16008 -48810 -34450 -64079 -103359 -94705 -80548 -92869 -71667 -65709 -118342 -165838 -153732 -33676
15996 -33676 9963 -6174 31124 34295 21663 25664 -24917 -52755 6601 -11120 -77543 -66744
15984 -66744 -44425 -43606 10423 -32324 -16542 38614 -16231 -18868 13807 -32614 -49162 -5961
15972 -5961 -6268 -25802 -25172 -19916 36759 4457 -36952 -17062 -28539 -57167 -90003 -46335 -3866
$$ packed form
16058g4048J5687K6762Q710o5274p385M7468M0223K799J2444M2031k931o3338
16046a6852j10477p83L9792N3557L3070k1623P619J5054l2857J186J5275P350
16034i689N4566j4575k5530o0790j4188r232M0030L7373K925m615l1741m30L1516
16021d380l2875K831M9350n807k4268M9805L1983K252j8125L013k4966p9511J888
16008d8810J4360k9629l9280Q654J4157j2321K1202N958n2633m7496J2106J20056
15996c3676M3639j6137L7298L171j2632M001n0581k7838N9356j7721o6423J0799
15984f6744K2319Q19N4029m2747J5782N5156n4845k637L2675m6421j6548M3201
15972e961l07j9534O30N256N6675l2302m1409J9890j1477k8628l2836M3668M2469
$$ plain form
15959 -3866 15115 -739 12098 -7381 -6543 -19100 -63729 -41899 -13961 -21873 -58676 -135737
15947 -135737 -171510 -139897 -135420 -105931 -63415 -16756 13084 -10110 -63566 -80702 -38275 26893
15935 26893 81981 107955 60018 21924 -1426 33505 41140 59931 10857 -57268 -92079 -92828
15923 -92828 -136178 -126829 -59484 -62891 -129222 -179929 -125593 -93780 -123928 -82271 -108943 -74777
15911 -74777 -13336 -33468 -15916 -16644 -36553 -39412 -37232 -23948 3549 -28819 -58224 -63811 -77467
15898 -77467 -113742 -78943 -71669 -63700 -64481 -32529 -61683 -49931 -45673 -80224 -82899 -56599 -72097
15885 -72097 -67571 -37541 -9571 -916 -18818 -20672 37471 45393 33626 26304 53570 31933 21702
15872 21702 63833 176460 176634 142518 140108 103661 57239 26881 63906 84439 26054 -35851
$$ packed form
15959c866J8981j5854J2837j9479Q38j2557m4629K1830K7938p912l6803p7061
15947a35737l5773L1613M477K9489M2516M6659K9840k3194n3456j7136M2427O5168
15935B6893N5088K5974m7937l8094k3350L4931P635J8791m9074o8125l4811p49
15923i2828m3350R349O7345l407o6331n0707N4336L1813l0148M1657k6672L4166
15911g4777O1441k0132J7552p28j9909k859K180J3284K7497l2368k9405n587j3656
15898g7467l6275L4799P274P969p81L1952k9154J1752M258l4551k675K6300j5498
15885g2097M526L0030K7970Q655j7902j854N8143P922j1767p322K7266k1637j0231
15872B1702M2131J12627J74l4116k410l6447m6422l0358L7025K0533n8385o1905
$$ plain form
15860 -35851 -37573 -27143 18753 52177 11738 -14411 -34350 -28681 -61517 -58160 -38367 -58764
15848 -58764 -97868 -21654 -2364 -26375 -11975 50286 -14300 -20366 -29756 9646 32316 -11429
15836 -11429 43293 49787 -16427 -50142 9307 3673 -36760 -71830 -45366 -14805 50463 13788
15824 13788 -25071 -34188 -3424 -11635 -56526 -33509 4558 61714 107739 101434 140651 64520
15812 64520 97969 55323 22844 -40153 -23621 -4536 -56891 -106975 -101461 -107808 -37074 49701
15800 49701 542 -50572 -86567 -60762 -11753 -26557 -52873 -65651 -47146 -52790 -110867 -105805
15788 -105805 -32428 36063 22168 -5617 26106 37197 10834 -41462 -59395 26909 106402
15777 106402 96423 86144 95573 39584 4753 -98558 -140070 -48373 -7238 -5088 10711 169
$$ packed form
15860c5851j722J0430M5896L3424m0439k6149j9939N669l2836L357J9793k0397
15848e8764l9104P6214J9290k4011J4400O2261o4586o066r390L9402K2670m3745
15836a1429N4722O494o6214l3715N9449n634m0433l5070K6464L0561O5268l6675
15824A3788l8859r117L0764q211m4891K3017L8067N7156M6025o305L9217p6131
15812F4520L3449m2646l2479o2997J6532J9085n2355n0084N514o347P0734Q6775
15800D9701m9159n1114l5995K5805M9009j4804k6316j2778J8505n644n8077N062
15788a05805P3377O8491j3895k7785L1723J1091k6363n2296j7933Q6304P9493
15777A06402r979j0279R429n5989l4831j03311m1512R1697M1135K150J5799j0542
$$ plain form
15765 169 -23292 -114641 -132924 -160938 -155000 -134857 -143687 -91215 -36618 -51688 -22145 -51287
15753 -51287 -29351 -10878 -19378 -49528 -73325 -73461 -76278 -75508 -54526 -59155 -65751 -68536 -83667
15740 -83667 -55972 48098 69857 692 -50842 -28934 13583 88861 124955 46966 -40609
15729 -40609 -88944 -96147 -60514 -10199 -33613 -43496 -51319 -71531 -54271 -70234 -71082 -32111 -5383
15716 -5383 55974 65092 44648 34576 9971 5726 20197 48573 34592 -9294 11356 -26770
15704 -26770 -56348 -47563 -51730 -12190 -51310 -110826 -87811 -68939 -58838 -72087 22022 70143
15692 70143 66597 39558 58868 74574 45637 -34383 -72585 -51356 -13505 19753 11657 -15587
15680 -15587 -72392 -39144 -43166 -132469 -125973 -88585 -109760 -150985 -190669 -203442 -159445 -142034
$$ packed form
15765A69k3461r1349j8283k8014N938K0143q830N2472N4597j5070K9543k9142
15753e1287K1936J8473q500l0150k3797j36k817P70K0982m629o596k785j5131
15740h3667K7695J04070K1759o9165n1534K1908M2517P5278L6094p7989q7575
15729d0609m8335p203L5633N0315k3414r883p823k0212J7260j5963q48L8971K6728
15716e383O1357R118k0444j0072k4605m245J4471K8376j3981m3886K0650l8126
15704b6770k9578Q785m167L9540l9120n9516K3015J8872J0101j3249R4109M8121
15692G0143l546k7039J9310J5706k8937q0020l8202K1229L7851L3258q096k7244
15680a5587n6805L3248m022q9303O496L7388k1175m1225l9684j2773M3997J7411
$$ plain form
15668 -142034 -133113 -126034 -98254 -101189 -81221 -4480 4743 -64212 -82015 -50190 -65103 -123168
15656 -123168 -106426 -79354 15518 49551 25717 20939 -53234 -50086 -14623 -28989 -38436 -9385
15644 -9385 2825 -7659 8860 5321 36153 24201 13378 33974 37962 -37597 -59064 -72639
15632 -72639 -83080 -34372 -75710 -66868 -4016 -39486 -39152 4459 27769 55051 14081 -933
15620 -933 -21278 -13313 -8205 21312 -22303 -27684 25036 43539 -496 -7354 -1561 -11610 9072
15607 9072 24476 -48670 -123601 -102849 -93447 -51907 -44649 -88580 -95664 -41552 19740 30402
15595 30402 31062 38556 -2528 -35054 -88639 -107403 -155466 -156858 -85898 -14844 -6256 -92825 -89936
15582 -89936 -88874 -109738 -61016 -40355 -40559 -20693 22886 20554 23 -3528 41541 4444 -29342
$$ packed form
15668a42034Q921P079K7780k935J9968P6741R223o8955j7803L1825j4913n8065
15656a23168J6742K7072R4872L4033k3834m778p4173L148L5463j4366r447K9051
15644i385J2210j0484J6519l539L0832j1952j0823K0596L988p5559k1467j3575
15632g2639j0441M8708m1338Q842O2852l5470L34M3611K3310K7282m0970j5014
15620i33k0345P965N108K9517m3615n381N2720J8503m4035o858N793j0049K0682
15607I072J5404p3146p4931K0752R402M1540P258m3931p084N4112O1292J0662
15595C0402O60P494m1084l2526n3585j8764m8063j392P0960P1054Q588q6569K889
15582h9936J062k0864M8722K0661k04J9866M3579k332k0531l551M5069l7097l3786
$$ plain form
15569 -29342 -80524 -107436 -58755 -45838 -36882 -16550 55255 50333 8657 -88995 -124242 -112565
15557 -112565 -110608 -50699 -21294 -11881 -25516 -37456 -13501 1074 -49882 -76311 -58318 -48269
15545 -48269 1930 21214 22481 29640 -23682 -18200 -19197 -17377 -693 9043 7106 9782 -24471
15532 -24471 -40378 -44836 -21385 -5558 9670 4164 38992 38672 70804 91756 16783 -95085
15520 -95085 -119641 -91264 -97246 -127191 -7814 92566 126587 48736 16023 16237 1456 18839
15508 18839 -4849 -1608 -24824 -22258 -23806 -32542 -1486 -34349 -38952 -57436 -19932 -4597 -61832
15495 -61832 -36557 -7000 -24692 -54782 -35930 4331 15550 13883 28954 40691 32826 70862
15483 70862 54528 -30828 -40987 -47255 -87593 -75441 -34752 36774 48623 -7433 -66518 -95089
$$ packed form
15569b9342n1182k6912M8681J2917Q956K0332P1805m922m1676r7652l5247J1677
15557a12565J957N9909K9405R413j3635j1940K3955J4575n0956k6429J7993J0049
15545d8269N0199J9284J267P159n3322N482r97J820J6684R736j937K676l4253
15532b4471j5907m458K3451J5827J5228n506L4828l20L2132K0952p4973j11868
15520i5085k4556K8377n982k9945J19377J00380L4021p7851l2713K14j4781J7383
15508A8839k3688L241k3216K566j548q736L1056l2863m603j8484L7504J5335n7235
15495f1832K5275K9557j7692l0090J8852M0261J1219j667J5071J1737p865L8036
15483G0862j6334q5356j0159o268m0338J2152M0689P1526J1849n6056n9085k8571
$$ plain form
15471 -95089 -50421 -41706 -11407 -58745 -79437 -88308 -56566 -46548 -24604 -3503 17012 -22374
15459 -22374 -53836 6032 42630 32522 3919 -1626 16451 25117 -27614 -37724 -11376 -52802
15447 -52802 -14937 11660 -12948 -30658 -47821 -8058 -28265 -67481 -64334 -67278 -40806 -45994
15435 -45994 -74345 -46316 -46854 -79713 -80222 -61063 -21739 16545 -43074 -52228 -49661 -24273 -60076
15422 -60076 -64123 -96870 -97933 -108122 -65622 -28402 -52782 -126168 -123472 -134554 -127871 -61499
15410 -61499 -66975 -58319 -102270 -83556 -12928 19289 3114 -47509 -10141 19383 28272 49787
15398 49787 45651 71358 45874 10165 6214 -31931 -51875 37284 45417 12411 73886 75643
15386 75643 46586 -19938 -49152 -71811 -77750 -65964 -55710 -36009 -136174 -141315 -102032 -54173
$$ packed form
15471i5089M4668Q715L0299m7338k0692q871L1742J0018K1944K1101K0515l9386
15459b2374l1462N9868L6598j0108k8603n545J8077Q666n2731j0110K6348m1426
15447e2802L7865K6597k4608j7710j7163L9763k0207l9216L147k944K6472n188
15435d5994k8351K8029n38l2859n09J9159L9324L8284n9619r154K567K5388l5803
15422f0076m047l2747j063j0189M2500L7220k4380p3386K696j1082O683O6372
15410f1499n476Q656m3951J8714P0628L2217j6175n0623L7368K9524Q889K1515
15398D9787m136K5707k5484l5709l951l8145j9944Q9159Q133l3006O1475J757
15386G5643k9057o6524k9214k2659n939J1786J0254J9701j00165n141L9283M7859
$$ plain form
15374 -54173 -21097 13381 -13093 -50080 -56069 9093 43831 84964 -2803 -128951 -160313 -161656
15362 -161656 -126402 -81287 -50674 -17327 -12650 -30274 -16141 9144 38706 23710 -26063 -9280
15350 -9280 -57916 -86233 -95419 -35398 17685 -715 -36704 -76573 -22256 41844 -11779 -48734
15338 -48734 -122835 -76731 -24552 12001 35540 22951 -45920 -26978 21858 17406 -41151 -54332
15326 -54332 -44036 -46661 -41730 -55760 -54373 -25902 47077 41764 27804 43322 70780 34551
15314 34551 27519 4637 15465 51947 -5672 -42307 -10940 51735 38235 -10521 -32189 -34852
15302 -34852 3197 -29881 -36304 25884 69636 19656 32692 99709 85556 58523 32610 -5001
15290 -5001 4960 42550 69113 55957 59978 58312 83102 36039 -6628 -19075 -54842 -11225
$$ packed form
15374e4173L3076L4478k6474l6987n989O5162L4738M1133q7767j26148l1362j343
15362a61656L5254M5115L0613L3347M677j7624J4133K5285K9562j4996m9773J6783
15350i280m8636k8317r186O0021N3083j8400l5989l9869N4317O4100n3623l6955
15338d8734p4101M6104N2179L6553K3539j2589o8871J8942M8836m452n8557j3181
15326e4332J0296k625M931j4030J387K8471P2979n313j3960J5518K7458l6229
15314C4551p032k2882J0828L6482n7619l6635L1367O2675j3500m8756k1668k663
15302c4852L8049l3078o423O2188M3752m9980J3036O7017j4153k7033k5913l7611
15290e001R961L7590K6563j3156M021j666K4790m7063m2667j2447l5767M3617
$$ plain form
15278 -11225 -22301 -43552 -23423 16735 -39771 -65669 -30661 7836 -15425 -2028 11784 1325
15266 1325 29442 18372 11026 -26493 -33512 -47100 -30856 -6704 -16053 -22964 -10168 -19096 -71994
15253 -71994 -128385 -118632 -140938 -147180 -124903 -79453 -98808 -89995 -58734 -47973 -26184 16030
15241 16030 12050 20358 -1573 -15779 -42707 -32880 -59337 -45064 -21213 -3439 -21943 -17626
15229 -17626 40422 60309 11086 -60789 -67734 -89572 -71922 3399 3868 19138 78883 32679
15217 32679 -63531 -79716 -10257 14547 34808 -10195 -42019 16517 49391 -46454 -50432 34808
15205 34808 118021 84329 5421 30328 92174 55994 50483 109533 58849 -43490 -31896 -18993
15193 -18993 -3215 -6885 -57297 -56093 -39108 -22229 -15549 -89379 -82848 -52743 -60487 -32521 -31144
$$ packed form
15278a1225j1076k1251K0129M0158n6506k5898L5008L8497k3261J3397J3812j0459
15266A325K8117j1070p346l7519p019j3588J6244K4152r349o911J2796q928n2898
15253g1994n6391R753k2306o242K2277M5450j9355Q813L1261J0761K1789M2214
15241A6030l980Q308k1931j4206k6928R827k6457J4273K3851J7774j8504M317
15229a7626N8048J9887m9223p1875o945k1838J7650P5321M69J5270N9745m6204
15217C2679r6210j6185O9459K4804K0261m5003l1824N8536L2874r5845l978Q5240
15205C4808Q3213l3692p8908K4907O1846l6180n511N9050n0684j02339J1594J2903
15193a8993J5778l670n0412J204J6985J6879O680p3830O531L0105p744K7966J377
$$ plain form
15180 -31144 -12218 -42570 -37897 78967 134252 83353 70780 71070 -33904 6418 6921 27356
15168 27356 70352 89739 132118 189116 133209 40565 72661 72452 29429 -3279 896 3810
15156 3810 22208 -13724 50816 64173 16268 -36829 -57459 -19532 27303 22201 41644 9088
15144 9088 -4318 -37403 -16735 -7222 -43366 -34050 -66493 -67715 -40964 -38001 -35389 -43747 -3927
15131 -3927 4208 -23030 19468 34731 46097 -42548 -93571 -43757 -677 -2503 33268 41746
15119 41746 12989 31027 -26559 -51712 -37672 -2185 15541 9999 -30363 -2230 52351 44271
15107 44271 44465 83096 62170 -2988 -10817 16339 44821 39439 39978 -29347 -32934 12805 -36087
15094 -36087 -60785 -56850 -12236 47239 41984 22033 1230 9176 -34300 -33615 15179 -13365 -33593
$$ packed form
15180c1144J8926l0352M673J16864N5285n0899j2573K90j04974M0322N03K0435
15168B7356M2996J9387M2379N6998n5907r2644L2096k09m3023l2708M175K914
15156C810J8398l5932O4540J3357m7905n3097k0630L7927M6835n102J9443l2556
15144I088j3406l3085K0668R513l6144R316l2443j222K6751K963K612q358L9820
15131c927Q135k7238M2498J5263J1366q8645n1023M9814M3080j826L5771Q478
15119D1746k8757J8038n7586k5153J4040L5487J7726n542m0362K8133N4581q080
15107D4271J94L8631k0926o5158p829K7156K8482n382N39o9325l587M5739m8892
15094c6087k4698L935M4614N9475n255j9951k0803P946m3476O85M8794k8544k0228
$$ plain form
15081 -33593 20924 21919 49203 76171 85643 83177 -29802 -50412 31495 60037 -6107 -28791
15069 -28791 23464 -50367 -130089 -134699 -128651 -95702 -57370 -42509 -73470 -71168 -63878 -101102
15057 -101102 -78486 -51279 -35442 -28001 -3863 24095 543 -61363 -58485 -66031 -18376 -36701
15045 -36701 -120924 -84032 -84230 -106207 -48361 77 -36918 -30170 44432 45537 11352 450
15033 450 -50838 -69298 -66868 -75769 -99607 -65491 -108418 -98951 -63696 -2955 42409 51006 52879
15020 52879 31410 54436 45952 20698 75209 94769 59571 -16858 -49426 -69078 -38075 25313
15008 25313 28289 -48421 -34239 -25842 -7883 -52381 -65901 -69520 -38330 -34586 -13794 -39767
14996 -39767 -75745 -29115 -33343 -113750 -158427 -95116 -36952 -27002 -9536 13481 40694 53468
$$ packed form
15081c3593N4517R95K7284K6968R472k466j12979k0610Q1907K8542o6144k2684
15069b8791N2255p3831p9722m610O048L2949L8332J4861l0961K302P290l7224
15057a01102K2616K7207J5837P441K4138K7958k3552o1906K878p546M7655j8325
15045c6701q4223L6892j98k1977N7846M8438l6995O748P4602J105l4185j0902
15033D50n1288j8460K430q901k3838L4116m2927R467L5255O0741M5364Q597J873
15020E2879k1469K3026q484k5254N4511J9560l5198p6429l2568j9652L1003O3388
15008B5313K976p6710J4182Q397J7959m4498j3520l619L1190L744K0792k5973
14996c9767l5978M6630m228q0407m4677O3311N8164R950J7466K3017K7213J2774
$$ plain form
14984 53468 24561 53855 37694 25611 -34151 -16416 47255 -21575 -52374 -6617 24462 31801
14972 31801 40756 -7767 -34532 -30124 -25924 -29444 -10272 -30122 -11180 -900 7767 -1977 17459
14959 17459 5137 -36721 -135287 -90672 -50879 18927 52297 -9557 -40262 -48245 -49174 -60757
14947 -60757 -40755 -812 12165 -49351 -107116 -68162 9427 62769 19972 -30011 -68191 -66221
14935 -66221 -33830 9088 21588 6432 67159 32207 19951 -27705 -19732 3821 -11535 -49670
14923 -49670 20152 87545 94679 56632 13771 -44265 31999 98358 29973 7869 -53803 -78788
14911 -78788 16197 21463 -38992 3141 34440 10673 24122 41189 24023 5398 -16357 50319
14899 50319 31824 -6754 -15315 -34451 -13546 33117 37391 17196 4019 -64126 -57749 -36937
$$ packed form
14984E3468k8907K9294j6161j2083n9762J7735O3671o8830l0799M5757L1079P339
14972C1801Q955m8523k6765M408M200l520J9172j9850J8942J0280Q667r744J9436
14959A7459j2322m1858r8566M4615L9793O9806L3370o1854l0705p983r29j1583
14947f0757K0002L9943J2977o1516n7765L8954P7589N3342m2797m9983l8180J970
14935f6221L2391M2918J2500j5156O0727l4952j2256m7656P973K3553j5356l8135
14923d9670O9822O7393P134l8047m2861n8036P6264O6359o8385k2104o1672k4985
14911g8788R4985N266o0455M2133L1299k3767J3449J7067j7166j8625k1755O6676
14899E0319j8495l8578q561j9136K0905M6663M274k0195j3177o8145O377K0812
$$ plain form
14887 -36937 -82747 -119537 -117252 -104072 -54897 -33141 5883 45886 27143 -35260 -63323 -32397
14875 -32397 12703 95861 76819 49876 25281 29988 33628 42097 22835 49957 45287 75905
14863 75905 87023 8464 6424 13507 16345 8553 7931 47419 41103 13092 50491 47288 54684
14850 54684 17005 30293 58099 24240 8742 -31092 457 47210 60407 67293 17613 -49431
14838 -49431 -112978 -114346 -61000 -2189 -18637 -12927 46507 -5482 -81138 -76844 -29393 14639
14826 14639 -26250 -57020 2340 20365 6669 -25822 -3719 6021 68663 38903 -17962 -65162
14814 -65162 -25686 -40489 -14032 1492 43148 89719 51765 26525 26618 -8100 -54300 -42785
14802 -42785 -70550 -30986 -51911 -67589 -64851 -44412 -12550 -20051 -72959 -34572 16699 -15014
$$ packed form
14887c6937m5810l6790K285J3180M9175K1756L9024M0003j8743o2403k8063L0926
14875c2397M5100Q3158j9042k6943k4595M707L640Q469j9262K7122m670L0618
14863G5905J1118p8559k040P083K838p792o22L9488o316k8011L7399l203P396
14850E4684l7679J3288K7806l3859j5498l9834L1549M6753J3197O886m9680o7044
14838d9431o3547j368N3346N8811j6448N710N9434n1989p5656M294M7451M4032
14826A4639m0889l0770N9360J8025j3696l2491K2103R740O2642k9760n6865m7200
14814f5162L9476j4803K6457J5524M1656M6571l7954k5240R3l4718m6200J1515
14802d2785k7765L9564k0925j5678K738K0439L1862p501n2908L8387N1271l1713
$$ plain form
14790 -15014 -57795 -87735 -87086 -81560 -136345 -111138 -46710 -37402 8964 65673 55408 9413
14778 9413 -64878 -41135 -32797 10794 28454 39272 -11799 -66860 -45691 35179 79536 112355
14766 112355 65705 25707 -913 -26836 12482 37509 -39477 -24771 55453 36969 -36586
14755 -36586 -79310 -46897 -23227 -30061 -37666 8513 91447 114375 94379 89802 111380 89113
14743 89113 88127 123920 77189 141710 192932 226115 344056 453377 581408 748754 1006023
14732 1006023 1244201 1498796 1743830 1732193 1542254 1298079 1066082 853710 643240 473814
14722 473814 402366 357118 271549 233543 152418 145511 148084 179564 162815 205885 165646 93545
14710 93545 63776 87211 98303 68752 70299 60867 82997 105249 81401 58004 22164 -13321
$$ packed form
14790a5014m2781k9940O49N526n4785K5207O4428R308M6366N6709j0265m5995
14778I413p4291K3743Q338M3591J7660J0818n1071n5061K1169Q0870M4357L2819
14766A12355m6650l9998k6620k5923L9318K5027p6986J4706Q0224j8484p3555
14755c6586m2724L2413K3670o834p605M6179Q2934K2928j9996m577K1578k2267
14743H9113r86L5793m6731O4521N1222L3183J17941J09321J28031J67346K57269
14732A006023K38178K54595K45034j1637j89939k44175k31997k12372k10470j69426
14722D73814p1448m5248q5569l8006q1125o907K573L1480j6749M3070m0239p2101
14710I3545k9769K3435J1092k9551J547r432K2130K2252k3848k3397l5840l5485
$$ plain form
14698 -13321 -7235 224 6406 4880 70164 114615 68852 818 -41375 25342 73877 -8013
14686 -8013 -59026 -61403 -13713 25167 -24125 -7235 47092 29970 34485 12933 24891 47531
14674 47531 53364 58146 72623 12423 -43633 -46065 76 51965 49726 -19984 -41434 -20448
14662 -20448 -31169 -30049 4997 55139 35598 -13907 -15851 -30582 -10212 26550 59700 27195
14650 27195 37924 57927 28159 4803 -13133 -48486 -39188 1456 67612 81867 48884 -50071
14638 -50071 -76513 -4374 22899 10328 41823 90946 52312 25307 -1777 -23689 24194 56669
14626 56669 71220 64128 71829 99669 71081 34896 -18709 1928 59645 30497 -43221 -19800
14614 -19800 19433 12139 24822 32015 56224 41449 38148 37722 17871 8125 43375 58007 83668
$$ packed form
14698a3321O086P459O182j526O5284M4451m5763o8034m2193O6717M8535q1890
14686h013n1013k377M7690L8880m9292J6890N4327j7122M515k1552J1958K2640
14674D7531N833M782J4477o0200n6056k432M6141N1889k239o9710k1450K0986
14662b0448j0721J120L5046N0142j9541m9505j944j4731K0370L6762L3150l2505
14650B7195J0729K0003k9768k3356j7936l5353R298M0644O6156J4255l2983r8955
14638e0071k6442P2139K7273j2571L1495M9123l8634k7005k7084k1912M7883L2475
14626E6669J4551p092P701K7840k8588l6185n3605K0637N7717k9148p3718K3421
14614a9800L9233p294J2683P193K4209j4775l301m26j9851r746L5250J4632K5661
$$ plain form
14601 83668 108896 90896 86725 54973 -13503 7263 60383 99853 136021 100242 20453 13741
14589 13741 8105 -9192 8400 -30548 -15462 16222 -29189 -15263 33065 29113 -15643 -55414
14577 -55414 -92442 -88963 -85831 -51037 -52449 -55664 -45841 -2988 16833 49151 55026 63030 43766
14564 43766 31328 -72287 -115490 -107223 -65744 -46946 -20602 34438 24335 -18804 -47000 -35740
14552 -35740 3987 6998 33132 62954 94910 63734 34857 11931 -39470 -128863 -93236 15387
14540 15387 17298 -32550 -30980 -53666 -49062 -52796 -54954 -8540 9142 64732 84738 31352 1851
14527 1851 -41222 -32253 -38412 -56503 -76065 -97400 -83229 -32831 -36968 -82288 -49254 -16457
14515 -16457 -25619 -40230 10300 30717 26044 -61505 -46209 -7224 -26549 -29888 2582 -8533
$$ packed form
14601H3668K5228j8000m171l1752o8476K0766N3120L9470L6168l5779p9789o712
14589A3741n636j7297J7592l8948J5086L1684m5411J3926M8328l952m4756l9771
14577e5414l7028L479L132L4794j412l215R823M2853J9821L2318N875Q004j9264
14564D3766j2438j03615m3203Q267M1479J8798K6344N5040j0103m3139k8196J1260
14552c5740L9727L011K6134K9822L1956l1176k8877k2926n1401q9393L5627J08623
14540A5387J911m9848J570k2686M604l734k158M6414J7682N5590K0006n3386k9501
14527A851m3073Q969o159j8091j9562k1335J4171N0398m137m5320L3034L2797
14515a6457r162j4611N0530K0417m673q7549J5296L8985j9325l339L2470j1115
$$ plain form
14503 -8533 7126 441 -46599 -78843 -105911 -92778 -90164 -58146 -17458 -5476 -18503 6568
14491 6568 -70583 -78043 -27353 -32334 -37342 -47901 -72612 -93396 -71215 -24671 12461 5158 1972
14478 1972 37908 18808 -30801 -13569 -5376 -44055 7268 -55606 -93209 -97020 -59810 -55892
14466 -55892 30162 85446 115296 62993 10827 31760 5621 8852 12278 -83 -38421 -56014
14454 -56014 -103115 -115998 -68596 -43448 -43401 46575 85720 116173 112653 78226 13472 -42496
14442 -42496 6316 82462 46647 -11835 11159 -29332 -81111 -52267 22651 108960 67730 16472
14430 16472 10668 42033 41502 44293 84735 98892 91723 71324 -16208 -48433 -34034 -56150 -122595
14417 -122595 -67705 -2234 58092 60532 5688 -4055 18173 -24308 -30735 -39002 -38916 -22715 52229
$$ packed form
14503h533J5659o685m7040l2244k7068J3133K614L2018M0688J1982j3027K5071
14491F568p7151p460N0690m981n008j0559k4711k0784K2181M6544L7132p303l186
14478A972L5936j9100m9609J7232Q193l8679N1323o2874l7603l811L7210L918
14466e5892Q6054N5284K9850n2303n2166K0933k6139L231L426j2361l8338j7593
14454e6014m7101j2883M7402K5148M7Q9976L9145L0453l520l4427o4754n5968
14442d2496M8812P6146l5815n8482K2994m0491n1779K8844P4918Q6309m1230n1258
14430A6472n804L1365n31K791M0442J4157p169k0399q7532l2225J4399k2116o6445
14417a22595N4890O5471O0326K440n4844r743K2228m2481o427q267Q6J6201P4944
$$ plain form
14404 52229 12932 -66589 -91537 -58217 -43177 -48376 -31859 24792 -24033 -44380 42033 97827
14392 97827 55930 25589 27060 -1093 41433 31381 -32439 -105261 -137475 -91349 -38782 -39976
14380 -39976 23641 28187 -63458 -112164 -109810 -86376 -58273 -44799 -43967 -38187 -57756 -61702 -56646
14367 -56646 -48544 -33695 -30500 -40464 -38418 13301 28492 35001 14504 15665 41029 18125 -2801
14354 -2801 -37367 -59613 -15578 -24680 -30516 -75069 -50448 -41370 -38417 -36657 23865 -6572 2177
14341 2177 58636 24574 3814 -36334 433 59528 35776 65570 77671 53630 35049 -24858
14329 -24858 -57706 -51837 -35046 24602 -27087 -50652 1099 88559 109175 146802 116873 109485
14317 109485 38657 20368 -4190 7670 21007 -1227 -93353 -116113 -102543 -94147 -9609 -13073
$$ packed form
14404E2229l9297p9521k4948L3320J5040n199J6517N6651m8825k0347Q6413N5794
14392I7827m1897l0341J471k8153M2526j0052o3820p2822l2214M6126N2567j194
14380c9976O3617M546r1645m8706K354K3434K8103J3474Q32N780j9569l946N056
14367e6646Q102J4849L195r964K046N1719J5191O509k0497J161K5364k2904k0926
14354b801l4566k2246M4035r102n836m4553K4621R078K953J760O0522l0437Q749
14341B177N6459l4062k0760m0148L6767N9095k3752K9794J2101k4041j8581n9907
14329b4858l2848N869J6791N9648n1689k3565N1751Q7460K0616L7627k9929p388
14317A09485p0828j8289k4558J1860J3337k2234r2126k2760J3570Q396Q4538l464
$$ plain form
14305 -13073 -42100 -72551 -84146 -70228 -19613 13728 4011 -13500 -66373 -42113 -19692 -16565
14293 -16565 23288 23889 26260 550 -25698 -15330 321 -10635 -52287 -16813 30234 39086
14281 39086 2576 -44898 -83359 -24436 48561 87584 78865 85252 50980 26196 27270 24342
14269 24342 26609 -21004 -20774 3163 42603 14120 288 -17418 -118620 -133175 -104422 -32022
14257 -32022 -14119 35349 66811 -1894 9265 -1914 -37795 -41150 -24600 -41863 -19438 -9609
14245 -9609 -8109 -35677 -18095 -2275 -25234 -87165 -150712 -186686 -169667 -144916 -121557 -100544
14233 -100544 -13858 14068 -11477 -53247 -5650 -17638 -20902 -66272 -96500 -54678 -47690 -57486
14221 -57486 8621 87125 51769 -4097 -7174 26539 15445 42433 6204 73542 92551 45413
$$ packed form
14305a3073k9027l0451j1595J3918N0615L3341r717j7511n2873K4260K2421L127
14293a6565L9853O01K371k5710k6248J0368J5651j0956m1652L5474M7047Q852
14281C9086l6510m7474l8461N8923P2997L9023q719O387l4272k4784J074k928
14269B4342K267m7613K30K3937L9440k8483j3832j7706j01202j4555K8753P2400
14257c2022J7903M9468L1462o8705J1159j1179l5881l355J6550j7263K2425R829
14245i609J500k7568J7582J5820k2959o1931o3547l5974J7019K4751K3359K1013
14233a00544Q6686K7926k5545m1770M7597j1988l264m5370l0228M1822O988r796
14221e7486O6107P8504l5356n5866l077L3713j1094K6988l6229O7338J9009m7138
$$ plain form
14209 45413 61266 37754 36535 22221 19188 19020 46856 23659 13320 18498 18883 13043 30139
14196 30139 52095 58042 73478 65924 20441 21180 39924 72485 66947 36573 63757 72213 63796
14183 63796 2869 22541 33440 3602 -34902 -78873 -61048 -19292 -5398 670 -2400 -38251
14171 -38251 -104359 -132018 -107750 -76219 -48891 13898 45974 361 7440 -34291 -44231 -44923
14159 -44923 8428 -1404 -7745 -11427 -15421 -11701 40893 38459 11349 -52104 -19800 28123 -25005
14146 -25005 -17525 9499 -5089 44527 53830 -21031 -50224 -63463 -26764 10020 -6692 -36038
14134 -36038 -56942 -54300 -27518 2140 -58385 -118454 -80358 -74066 -73653 -22876 -8941 -18440 3146
14121 3146 14822 56917 93481 59755 34346 -19354 -104713 -108891 -60352 -53288 8313 18883
$$ packed form
14209D5413J5853k3512j219j4314l033j68K7836k3197j0339N178L85n840J7096
14196C0139K1956N947J5436p554m5483P39J8744L2561n538l0374K7184Q456q417
14183F3796o0927J9672J0899k9838l8504m3971J7825M1756J3894O068l070l5851
14171c8251o6108k7659K4268L1531K7328O2789L2076m5613P079m1731r940o92
14159d4923N3351r832o341l682l994L720N2594k434k7110o3453L2304M7923n3128
14146b5005P480K7024j4588M9616R303p4861k9193j3239L6699L6784j6712k9346
14134c6038k0904K642K6782K9658o0525o0069L8096O292M13N0777J3935r499K1586
14121C146J1676M2095L6564l3726k5409n3700q5359m178M8539P064O1601J0570
$$ plain form
14109 18883 -19232 -29994 10467 29545 -7758 -17206 38265 51759 33571 16562 40972 26672
14097 26672 41756 26938 -37100 -58843 -76330 -30814 -42980 -51861 -15469 11824 -2168 44290
14085 44290 72850 21479 -8798 7667 -30945 -35934 -10000 -26214 -52146 -75015 -38865 -25402
14073 -25402 -89559 -144081 -137344 -73966 -5352 -21249 -72180 -46817 -50175 -63980 -47698 -15607
14061 -15607 86331 164594 125893 52520 32657 38382 6687 15617 6786 -19434 -81182 -7894
14049 -7894 44225 54430 -46338 -86694 -96783 -43171 -71263 -66872 9154 -20268 -50891 -38654
14037 -38654 23998 53120 24270 13101 5955 4253 22424 9322 63861 75450 13687 7316
14025 7316 -33712 -61076 -2452 52447 16824 -35670 -27897 7809 -15349 -639 9259 49646
$$ packed form
14109A8883l8115j0762M0461J9078l7303r448N5471J3494j8188j7009K4410j4300
14097B6672J5084j4818o4038k1743j7487M5516j2166q881L6392K7293j3992M6458
14085D4290K8560n1371l0277J6465l8612m989K5934j6214k5932k2869L6150J3463
14073b5402o4157n4522O737O3378O8614j5897n0931K5363l358j3805J6282L2091
14061a5607J01938P8263l8701p3373j9863N725l1695Q930q831k6220o1748P3288
14049g894N2119J0205j00768m0356j0089N3612k8092M391P6026k9422l0623J2237
14037c8654O2652K9122k8850j1169p146j702J8171j3102N4539J1589o1763o371
14025G316m1028k7364N8624N4899l5623n2494P773L5706k3158J4710R898M0387
$$ plain form
14013 49646 53244 67218 89055 101891 71819 -1929 2786 50043 107487 81721 14236 -34167
14001 -34167 -43196 -12902 18355 3678 11209 -18737 -28051 -31659 -26706 4765 8640 -5392 -24546
13988 -24546 -59901 -71472 1953 52571 51251 63419 59730 65156 17300 14221 6690 91195 33539
13975 33539 -31675 -39906 -10282 -28577 -45281 -26681 10938 -26415 -68318 -42298 -45708 -45906
13963 -45906 -53679 -60976 -91741 -21485 18853 24018 -4686 -26456 -68905 -68296 -17502 -45982 -28621
13950 -28621 -10783 -10231 12312 12888 -27118 -11730 -20661 -39209 -55300 -18273 -39871 -56731 -26052
13937 -26052 30035 28226 -41874 -111460 -102218 -53884 57751 52950 70301 81090 42004 37142
13925 37142 31628 12190 16048 43341 33214 -9700 -15288 -26549 -27442 -21835 -41515 -44562 -56995
$$ packed form
14013D9646L598J3974K1837J2836l0072p3748M715M7257N7444k5766o7485m8403
14001c4167r029L0294L1257j4677P531k9946r314l608M953L1471L875j4032j9154
13988b4546l5355j1571P3425N0618j320J2168l689N426m7856l079p531Q4505n7656
13975C3539o5214q231K9624j8295j6704J8600L7619l7353m1903K6020l410j98
13963d5906p773p297l0765P0256M0338N165k8704k1770m2449O09N0794k8480J7361
13950b8621J7838N52K2543N76m0006J5388q931j8548j6091L7027k1598j6860L0679
13937b6052N6087j809p0100o9586R242M8334J11635m801J7351J0789l9086m862
13925C7142n514j9438L858K7293j0127m2914n588j1261q93N607j9680l047j2433
$$ plain form
13912 -56995 -10363 25078 -28809 -68508 -17272 -14915 -59812 -69726 -20270 23397 49786 83324
13900 83324 37664 -37328 -24279 38343 43274 -6739 -47157 -32544 -52862 -48232 -47424 -54540 -25086
13887 -25086 -15058 11690 37249 93997 127865 156083 135424 122822 101160 19713 -11104 -19641
13875 -19641 8940 19819 46938 -17844 -38607 -6538 14011 32161 50904 71393 14561 -3044
13863 -3044 48925 -377 -118051 -153621 -100091 -17234 25269 44415 14012 6679 -36139 -22520
13851 -22520 7950 15083 31962 6856 -18884 -16313 -15879 8436 33123 -38351 -56312 -51151 24068
13838 24068 43526 -33544 -25423 -66965 -113961 -103376 -37800 -11761 26220 19384 -27542 -2679
13826 -2679 47214 74187 16245 -27537 11139 -16048 -56816 -37369 -57712 -37359 -36580 -48821
$$ packed form
13912e6995M6632L5441n3887l9699N1236K357m4897r914M9456M3667K6389L3538
13900H3324m5660p4992J3049O2622M931n0013m0418J4613k0318M630Q08p116K9454
13887b5086J0028K6748K5559N6748L3868K8218k0659j2602k1662q1447l0817q537
13875a9641K8581J0879K7119o4782k0763L2069K0549J8150J8743K0489n6832j7605
13863c044N1969m9302j17674l5570N3530Q2857M2503J9146l0403p333m2818J3619
13851b2520L0470P133J6879k5106k5740K571M34K4315K4687p1474j7961N161P5219
13838B4068J9458p7070Q121m1542m6996J0585O5576K6039L7981o836m6926K4863
13826b679M9893K6973n7942m3782L8676k7187m0768J9447k0343K0353P79j2241
$$ plain form
13814 -48821 -24048 -13264 20156 52999 78653 39325 72349 80003 52983 49076 106539 108359
13802 108359 28034 35653 56373 47311 36448 104654 104879 81429 71429 2667 -68931 -64078
13790 -64078 -43357 55790 117224 75381 17911 8181 25276 1984 5553 29643 71137 36717
13778 36717 62548 43672 -32110 -65918 -82687 -58044 -63368 -12866 16157 19423 21643 37147
13766 37147 37361 13861 24529 73076 94475 97156 66833 58611 68727 83200 20049 -9869
13754 -9869 -91904 -115186 -42044 -22051 -266 43205 13562 -26860 -29857 5036 48814 58751
13742 58751 47304 55302 41712 4424 10099 47824 84846 25704 21950 62339 92142 50147
13730 50147 33793 3806 -44713 12114 51738 3041 -61590 -20694 25041 2217 -46591 -26045
$$ packed form
13814d8821K4773J0784L3420L2843K5654l9328L3024P654k7020l907N7463J820
13802A08359q0325P619K0720r062j0863O8206K25k3450j0000o8762p1598M853
13790f4078K0721R9147O1434m1843n7470r730J7095k3292L569K4090M1494l4420
13778C6717K5831j8876p5782l3808j6769K4643n324N0502K9023L266K220J5504
13766C7147K14k3500J0668M8547K1399K681l0323q222J0116J4473o3151k9918
13754i869q2035k3282P3142J9993K1785M3471k9643m0422k997L4893M3778R937
13742E8751j1447P998j3590l7288N675L7725L7022n9142l754M0389K9803m1995
13730E0147j6354k9987m8519N6827L9624m8697o4631M0896M5735k2824m8808K0546
$$ plain form
13718 -26045 -9831 -24310 -40077 -58079 -82757 -112272 -15495 57830 47494 43498 32625 -19909
13706 -19909 -18066 23479 22927 48865 -88 -49044 -15850 -15555 -17102 62838 38225 -32915 -69582
13693 -69582 -42658 17211 46733 42979 2347 -80137 -110490 -74412 -60505 -22535 -41336 -42852
13681 -42852 -14940 -28029 -4564 77009 77360 86762 46643 23585 22476 68918 68444 107165 56335
13668 56335 9594 92587 120612 37185 -629 22564 79609 12509 -38698 -46163 -93346 -98005
13656 -98005 -115945 -75110 15297 36827 48651 31541 4561 -64197 -81770 -28050 -10980 -5322
13644 -5322 8834 4200 -34869 -8301 -4294 -24298 6309 964 47837 50680 24162 36163 34525
13631 34525 51977 40134 20162 -27116 -68977 -78835 -89526 -91059 -5909 7965 -24319 -31884
$$ packed form
13718b6045J6214j4479j5767j8002k4678k9515R6777P3325j0336l996j0873n2534
13706a9909J843M1545n52K5938m8953m8956L3194K95j547P9940k4613p1140l6667
13693f9582K6924N9869K9522l754m0632q2484l0353L6078J3907L7970j8801j516
13681d2852K7912j3089K3465Q1573L51R402m0119k3058j109M6442m74L8721n0830
13668E6335m6741Q2993K8025q3427l7814K3193N7045o7100n1207p465m7183m659
13656i8005j7940M0835R0407K1530J1824j7110k6980o8758j7573N3720J7070N658
13644e322J4156m634l9069K6568M007k0004L0607n345M6873K843k6518J2001j638
13631C4525J7452j1843j9972m7278m1861r858j0691j533Q5150J3874l2284p565
$$ plain form
13619 -31884 -21493 -44489 -11567 -46590 -49170 -16207 51701 40154 8983 -36664 -60320 -49928
13607 -49928 -18550 -5057 -13783 -17862 -2730 3795 -34048 -38239 7928 -2553 -3830 -8562 -75764
13594 -75764 -23210 20640 19939 -13617 -11280 9462 9464 2353 -4766 62660 89932 81411 73626 49494
13580 49494 -3879 -27352 8472 32806 78959 48358 -31373 -72060 -135804 -130407 -159828 -141486
13568 -141486 -40169 -17426 -10185 -78013 -74210 -30233 2177 -37560 9660 20547 6860 19743
13556 19743 -35008 -9155 17342 -25414 -40758 58 77312 104611 31231 -5160 21592 -47463
13544 -47463 -26643 35638 -4232 -10154 -30488 -65800 -93972 -71646 -75306 -82649 -46035 -84587
13532 -84587 -29058 21621 6497 -59424 -58929 1461 20905 -4543 -51112 -19107 3567 11976
$$ packed form
13619c1884J0391k2996L2922l5023k580L2963O7908j1547l1171m5647k3656J0392
13607d9928L1378J3493q726m079J5132O525l7843m191M6167j0481j277m732o7202
13594g5764N2554M3850p01l3556K337K0742Kp111p119O7426K7272q521p785k4132
13580D9494n3373k3473L5824K4334M6153l0601p9731m0687o3744N397k9421J8342
13568a41486J01317K2743P241o7828L803M3977L2410l9737M7220J0887j3687J2883
13556A9743n4751K5853K6497m2756j5344M0816P7254K7299p3380l6391K6752o9055
13544d7463K0820O2281l9870n922k0334l5312k8172K2326l660p343L6614l8552
13532h4587N5529N0679j5124o5921M95O0390J9444k5448m6569L2005K2674Q409
$$ plain form
13520 11976 8850 29613 -36804 -19236 -1247 7397 17997 24776 16080 17689 -28935 -23284 46573
13507 46573 48939 5794 63945 61214 28374 -41797 -72461 -62909 -18980 -44246 -26754 -8013
13495 -8013 -70846 -19034 -3843 -29521 -49249 -28276 -56976 -35036 9259 -25377 -88126 -46005
13483 -46005 75468 124897 80802 109893 63958 -41860 -70820 -71717 -63411 -30861 -37042 -52590
13471 -52590 -93250 -85587 -14887 -11438 -43250 -88260 -50119 -27260 11417 44948 82516 61690
13459 61690 31469 119759 94691 29169 18085 17024 59543 88189 93798 72563 22427 29015
13447 29015 67710 143783 138656 80809 80024 91929 91507 69452 87359 82524 89088 128170 109767
13434 109767 54245 116881 167053 182143 79723 10255 61911 97497 146023 108202 78818
$$ packed form
13520A1976l126K0763o6417J7568J7989Q644J0600O779q696J609m6624N651O9857
13507D6573K366m3145N8151k731l2840p0171l0664R552M3929k5266J7492J8741
13495h013o2833N1812J5191k5678j9728K0973k8700K1940M4295l4636o2749M2121
13483d6005J21473M9429m4095K9091m5935j05818k8960q97Q306L2550o181j5548
13471e2590m0660P663P0700L449l1812m5010L8141K2859L8677L3531L7568k0826
13459F1690l0221Q8290k5068o5522j1084j061M2519K8646N609k1235n0136O588
13447B9015L8695P6073n127n7847p85J1905m22k2055J7907m835O564L9082j8403
13434A09767n5522O2636N0172J5090j02420o9468N1656L5586M8526l7821k9384
$$ plain form
13423 78818 50845 25634 103435 92342 75190 69265 45461 17376 27251 76037 51770 -50971
13411 -50971 -87741 -55573 55160 33933 12662 -6354 -38464 -5194 29972 2312 16932
13400 16932 82419 91525 13352 -54340 -67799 -27646 -2437 -27824 -8269 25077 53919 35939
13388 35939 45011 29279 -21248 31920 43250 -6711 -17837 6377 14124 20145 41019 12772
13376 12772 -2595 49017 9970 1579 -14837 28582 88895 157761 135100 111706 127780 70570
13364 70570 123045 219311 292934 333101 419530 536244 678598 860089 1083483 1360636 1684191
13353 1684191 1753849 1621419 1257504 913001 695172 484079 311771 291190 336171 279655
13343 279655 208562 231788 189904 136771 168405 152570 150686 159524 158560 172163 149512 79799
$$ packed form
13423G8818k7973k5211P7801j1093j7152n925k3804k8085R875M8786k4267j02741
13411e0971l6770L2168J10733k1227k1271j9016l2110L3270L5166k7660J4620
13400A6932O5487R106p8173o7692j3459M0153K5209k5387J9555L3346K8842j7980
13388C5939R072j5732n0527N3168J1330m9961j1126K4214P747O021K0874k8247
13376A2772j5367N1612l9047q391j6416M3419O0313O8866k2661k3394J6074n7210
13364G0570N2475R6266P3623M0167Q6429J16714J42354J81491K23394K77153L23555
13353A684191O9658j32430l63915l44503k17829k11093j72308k0581M4981n6516
13343B79655p1093K3226m1884n3133L1634j5835j884Q838r64J3603k2651o9713
$$ plain form
13331 79799 34496 -12782 -4024 47359 61954 96325 140832 135525 128951 111905 73725 9480
13319 9480 13874 81078 136972 116075 129935 231182 199426 144953 156515 150585 140422 110062
13307 110062 135558 138200 130273 114334 154051 168763 163000 152528 105188 119461 128591 104797
13295 104797 95664 113833 175034 212021 121811 83587 86680 77295 36192 15394 44506 34239
13283 34239 27824 44713 106069 178921 134284 49663 77775 86920 61372 93054 50936 65136
13271 65136 145195 143821 136104 73761 60306 29954 25197 -11744 54821 76883 96961 129177
13259 129177 132280 106965 56363 65441 89742 61850 27077 20311 70385 75736 51608 67483
13247 67483 113041 93117 93186 108368 98467 61952 62774 42157 33401 10632 44775 110846 122924
$$ packed form
13331G9799m5303m7278Q758N1383J4595L4371M4507n307o574j7046l8180o4245
13319I480M394O7204N5894k0897J3860J01247l1756n4473J1562n930j0163l0360
13307A10062K5496K642p927j5939L9717J4712n763j0472m7340J4273R130k3794
13295A04797r133J8169O1201L6987r0210l8224L093r385m1103k0798K9112j0267
13283C4239o415J6889O1356P2852m4637q4621K8112R145k5548L1682m2118J4200
13271F5136Q0059j374p717o2343j3455l0352m757l6941O6565K2062K0078L2216
13259A29177L103k5315n0602R078K4301k7892l4773o766N0074N351k4128J5875
13247F7483M5558j9924O9J5182r901l6515Q22k0617q756k2769L4143O6071J2078
$$ plain form
13234 122924 68711 -32641 -69480 -12679 53797 77362 30233 -15245 29265 57688 54363
13223 54363 3862 -19549 3249 57446 69105 86228 88261 98078 80394 73456 108819 136802
13211 136802 111617 77739 165380 133545 123566 103319 117884 146585 165207 150490 141917 112438
13199 112438 113822 142901 161723 193737 203908 182552 185993 224294 197028 157039 179019 234519
13187 234519 287057 300631 342529 296557 291675 317322 332621 283812 274125 311400 320660 289048
13175 289048 210658 178212 218043 260870 302082 334295 310810 311664 327642 333452 303117 258341
13163 258341 210855 194792 229784 254699 300667 301918 221156 210414 200203 196791 166877 210018
13151 210018 200248 129861 109315 125553 154156 158877 107518 82255 122118 156731 187865 78595
$$ packed form
13234A22924n4213j01352l6839N6801O6476K3565m7129m5478M4510K8423l325
13223E4363n0501k3411K2798N4197J1659J7123K033R817j7684o938L5363K7983
13211A36802k5185l3878Q7641l1835r979k0247J4565K8701J8622j4717q573k9479
13199A12438J384K9079J8822L2014J0171k1356L441L8301k7266l9989K1980N5500
13187B34519N2538J3574M1898m5972m882K5647J5299m8809r687L7275R260l1612
13175B89048p8390l2446L9831M2827M1212L2213k3485Q54J5978N810l0335m4776
13163B58341m7486j6063L4992K4915M5968J251q0762j0742j0211l412k9914M3141
13151B10018r770p0387k0546J6238K8603M721n1359k5263L9863L4613L1134j09270
$$ plain form
13139 78595 82812 146732 123027 46080 56761 116689 89671 145939 150976 146339 165168 150330
13127 150330 105078 86796 35804 35220 38778 65133 41762 96386 150213 145086 136948 134851 114905
13114 114905 73777 51282 38240 61565 139534 155725 161970 156995 163658 236027 234253 255591
13102 255591 235033 270259 326116 361458 403276 362929 305071 268740 265910 264300 273111 263027
13090 263027 271909 296254 303523 208934 156120 142198 156652 221882 259282 311792 309346 248350
13078 248350 222497 194977 234877 250767 241305 308420 320784 377863 505955 594359 643549
13067 643549 643986 733333 678386 580786 535712 578017 671993 712738 780649 862246 879244 894259
13055 894259 931424 901640 926606 935349 963696 1018165 1031787 1049089 1077940 1089081 1091208 1121419
$$ packed form
13139G8595M217O3920k3705p6947J0681N9928k7018N6268N037m637J8829j4838
13127A50330m5252j8282n0992n84L558K6355k3371N4624N3827n127q138k097j9946
13114A14905m1128k2495j3042K3325P7969J6191O245m975O663P2369j774K1338
13102B55591k0558L5226N5857L5342M1818m0347n7858l6331k830j610Q811j0084
13090B63027Q882K4345P269r4589n2814j3922J4454O5230L7400N2510k446o0996
13078B48350k5853k7520L9900J5890r462O7115J2364N7079J28092Q8404M9190
13067F43549M37Q9347n4947r7600m5074M2305R3976M0745O7911Q1597J6998J5015
13055H94259L7165k9784K4966Q743K8347N4469J3622J7302K8851J1141K127L0211
$$ plain form
13043 1121419 1123194 1142301 1216976 1184214 1102972 1099420 1035111 973385 946626 869907 792512 748675
13031 748675 684281 661138 618550 587480 526773 523292 563981 569801 488867 429802 424178 395663
13019 395663 450875 498081 537750 469255 363701 357013 372489 341537 322146 365285 394492
13008 394492 381239 364199 373772 386951 329265 272061 273737 320200 332858 384018 397459 373940
12996 373940 353153 302031 333317 357225 326281 331278 389951 441300 449608 448932 476563 468710
12984 468710 470711 432902 512235 532037 509456 515419 548332 485864 487051 512934 499575 521769
12972 521769 521949 518938 559719 605394 689182 745361 800109 824177 805197 892598 965061 1108142
12960 1108142 1195828 1220115 1276965 1313571 1378677 1373379 1324991 1392207 1530656 1636819 1753769
$$ packed form
13043A121419J775J9107P4675l2762q1242l552o4309o1726k6759p6719p7395m3837
13031G48675o4394k3143m2588l1070o0707l481M0689N820q0934n9065n624k8515
13019C95663N5212M7206L9669o8495j05554o688J5476l0952j9391M3139K9207
13008C94492j3253j7040R573J3179n7686n7204J676M6463J2658N1160J3441k3519
12996C73940k0787n1122L1286K3908l0944M997N8673N1349Q308o76K7631p853
12984D68710K001l7809P9333J9802k2581N963L2913o2468J187K5883j3359K2194
12972E21769J80l011M0781M5675Q3788N6179N4748K4068j8980Q7401P2463J43081
12960A108142Q7686K4287N6850L6606O5106n298m8388O7216J38449J06163J16950
$$ plain form
12949 1753769 1912958 2055247 2193665 2337386 2528889 2739910 2905006 3147559 3470683
12940 3470683 3887241 4382124 4905507 5554481 6216585 6897923 7577469 8294950 9135167
12931 9135167 10128759 11203105 12552186 14092475 15815711 17835072 20271653 23062367
12923 23062367 26526505 30861014 36322635 43343786 52521949 64323501 79369357 99045595
12915 99045595 125855338 163140576 213499354 270522657 312322348 317703658 277486850
12908 277486850 205742442 138989371 97670357 75133363 61937844 52688294 45067801
12901 45067801 38325310 32634185 28064900 24466524 21566619 19209692 17362533 15892999
12893 15892999 14745145 13797303 12988552 12263831 11626718 11028952 10585448 10171253 9849281
$$ packed form
12949A753769J59189J42289J38418J43721J91503K11021J65096K42553L23124
12940C470683M16558M94883N23383O48974O62104O81338O79546P17481Q40217
12931I135167R93592J074346J349081J540289J723236K019361K436581K790714
12923B3062367L464138M334509N461621P021151R178163J1801552J5045856J9676238
12915I9045595K6809743L7285238N0358778N7023303M1799691N381310m0216808
12908B77486850p1744408o6753071m1319014k2536994j3195519r249550p620493
12901D5067801o742491n691125m569285l598376k899905k356927j847159j469534
12893A5892999j147854r47842q08751p24721o37113n97766m43504m14195l21972
$$ plain form
12884 9849281 9570197 9436615 9300569 9196670 9015941 8748736 8491986 8271379 8080163
12875 8080163 7881004 7683315 7557425 7413852 7235796 7043106 6918214 6757120 6564288
12866 6564288 6472710 6421900 6302962 6200173 6126194 6046862 5981839 5945460 5903940 5807696 5791818
12855 5791818 5740142 5707325 5692434 5670229 5656965 5649713 5562214 5493398 5424586 5406437 5347363
12844 5347363 5271209 5210227 5119914 5029962 4981056 4953931 4947556 4927122 4928665 4952564 4886748 4867773
12832 4867773 4856139 4790080 4745762 4738136 4753922 4756934 4788512 4778892 4765276 4783187 4734028 4723508
12820 4723508 4704643 4704011 4701557 4750131 4840548 4933937 4978999 5027824 5085134 5136876 5137774 5221688
12808 5221688 5267815 5246527 5271808 5282593 5283905 5243653 5276818 5302529 5363945 5379537 5339815
$$ packed form
12884I849281k79084j33582j36046j03899j80729k67205k56750k20607j91216
12875H080163j99159j97689j25890j43573j78056j92690j24892j61094j92832
12866F564288r1578n0810j18938j02789p3979p9332o5023l6379m1520r6244j5878
12855E791818n1676l2817j4891k2205j3264p252q7499o8816o8812j8149n9074
12844E347363p6154o0982r0313q9952m8906k7125o375k0434J543K3899o5816j8975
12832D867773j1634o6059m4318p626J5786L012L1578r620j3616J7911m9159j0520
12820D723508j8865o32k454M8574R0417R3389M5062M8825N7310N1742Q98Q3914
12808E221688M6127k1288K5281J0785J312m0252L3165K5711O1416J5592l9722
$$ plain form
12797 5339815 5382456 5355377 5347391 5412743 5471835 5497960 5466230 5378450 5311065 5233765 5065870
12786 5065870 4889552 4772968 4692066 4608600 4496177 4438642 4407130 4343380 4306046 4269650 4193094
12775 4193094 4173429 4156915 4136717 4055010 3911345 3753987 3625909 3531767 3401357 3306322
12765 3306322 3218931 3118565 3026450 2918846 2817321 2756044 2665684 2553864 2438828 2371236
12755 2371236 2351014 2324556 2338551 2549730 2823534 3117384 3556882 4031011 4472712 4516666
12745 4516666 4147168 3471952 2777461 2332506 2050968 1829765 1647502 1578033 1476933 1364097
12735 1364097 1239270 1129655 1037270 921855 887024 828746 741930 653883 579717 506077 478240
12724 478240 425329 434501 413564 320825 318379 358491 420047 465702 482874 463748 454605 479880
$$ packed form
12797E339815M2641k7079p986O5352N9092K6125l1730q7780o7385p7300j67895
12786E065870j76318j16584q0902q3466j12423n7535l1512o3750l7334l6396p6556
12775D193094j9665j6514k0198q1707j43665j57358j28078r4142j30410r5035
12765C306322q7391j00366r2115j07604j01525o1277r0360j11820j15036o7592
12755B371236k0222k6458J3995K11179K73804K93850M39498M74129M41701M3954
12745D516666l69498o75216o94491m44955k81538k21203j82263o9469j01100j12836
12735A364097j24827j09615r2385j15415l4831n8278q6816q8047p4166p3640k7837
12724D78240n2911R172k0937r2739k446M0112O1556M5655J7172j9126r143K5275
$$ plain form
12712 479880 404817 329065 294878 326946 358230 313070 292934 294801 317755 308145 254449 202359
12700 202359 218730 202869 174792 158673 149637 184367 291730 260775 234902 276793 280728 238626
12688 238626 187677 183072 220345 228172 194761 142104 146780 161425 197903 224410 228774 231744
12676 231744 283084 292202 293704 284233 306006 326570 318071 305353 315589 347735 391156 460537
12664 460537 404956 409217 449626 434125 416156 425800 437423 411587 367462 363164 424458 455014
12652 455014 508932 542992 549705 521137 522451 574689 584111 605444 649740 630321 554116 523303
12640 523303 501606 491144 543152 566897 550666 540538 561188 562455 591552 585895 577193 613169
12628 613169 574861 495674 474046 522621 549122 521307 522175 545620 552392 487258 448688 464672
$$ packed form
12712D79880p5063p5752l4187L2068L1284m5160k0136J867K2954r610n3696n2090
12700B02359J6371j5861k8077j6119r036L4730J07363l0955k5873M1891L935m2102
12688B38626n0949m605L7273P827l3411n2657M676J4645L6478K6507M364K970
12676B31744N1340R118J502r471K1773K0564q499j2718J0236L2146M3421O9381
12664D60537n5581M261M0409j5501j7969R644J1623k5836m4125m298O1294L0556
12652D55014N3918L4060O713k8568J314N2238R422K1333M4296j9419p6205l0813
12640E23303k1697j0462N2008K3745j6231j0128K0650J267K9097n657q702L5976
12628F13169l8308p9187k1628M8575K6501k7815Q68K3445O772o5134l8570J5984
$$ plain form
12616 464672 411192 400130 419778 427461 467407 557306 566971 529197 488605 427385 479840 474214
12604 474214 540666 593927 606846 516333 513882 502588 456465 447262 444833 411387 370415 343300
12592 343300 317299 304258 207128 217984 271083 296935 297605 272798 259747 209768 222713 241868
12580 241868 245723 274809 338227 251760 247708 238750 220008 219794 211590 156413 130518 167327 173852
12567 173852 190049 177405 141886 138745 136614 144277 115531 110392 111270 128412 76020 65907 118814
12554 118814 102228 100892 90964 132713 132421 123192 110413 167919 168042 170747 175120 160290 147378
12541 147378 153108 110955 35323 -20897 -17878 92330 99409 37753 33970 16332 -5612 49581
12529 49581 98092 85559 54297 91204 158884 195028 225494 160012 156739 121895 136162 92597
$$ packed form
12616D64672n3480j1062J9648P683L9946Q9899R665l7774m0592o1220N2455n626
12604D74214O6452N3261J2919r0513k451j1294m6123r203k429l3446m0972k7115
12592C43300k6001j3041r7130J0856N3099K5852O70k4807j3051m9979J2945J9155
12580B41868L855K9086O3418q6467m052q958j8742k14q204n5177k5895L6809O525
12567A73852J6197j2644l5519l141k131P663k8746n139Q78J7142n2392j0113N2907
12554A18814j6586j336r928M1749k92r229j2779N7506J23K705M373j4830j2912
12541A47378N730m2153p5632n6220L019J10208P079o1656l783j7638k1944N5193
12529D9581M8511j2533l1262L6907O7680L6144L0466o5482l273l4844J4267m3565
$$ plain form
12517 92597 95283 146617 155298 133675 102086 98922 152614 184416 180050 136766 103877 102608 163527
12504 163527 140687 110072 31780 6527 54211 71711 143964 158622 144439 136989 126470 143948
12492 143948 187317 146342 100527 34248 29371 106559 153315 148512 144734 136426 232228 261712
12480 261712 263437 277835 300039 253477 203734 231103 328349 333917 340504 401392 434893 510966
12468 510966 582769 666105 811915 949689 1143799 1487776 1811332 1921985 1777057 1442795
12458 1442795 1069496 779069 592602 454082 348060 305956 318993 343526 291389 332555
12448 332555 348266 298903 278380 220936 174792 117129 131621 122570 117717 170808 182680 221569
12436 221569 251656 234018 257611 241262 255197 247749 212092 194318 133221 104710 64974 -4973
$$ packed form
12517I2597K686N1334Q681k1623l1589l164N3692L1802m366m3284l2889j269O0919
12504A63527k2840l0615p8292k5253M7684J7500P2253J4658j4183p450j0519J7478
12492A43948M3369m0975m5815o6279m877P7188M6756m803l778q308R5802K9484
12480B61712J725J4398K2204m6562m9743K7369R7246N568O587O0888L3501P6073
12468E10966P1803Q3336J45810J37774J94110L43977L23556J10653j44928l34262
12458A442795l73299k90427j86467j38520j06022m2104J3037K4533n2137M1166
12448C32555J5711m9363k0523n7444m6144n7663J4492r051m853N3091J1872L8889
12436B21569L0087j7638K3593j6349J3935p448l5657j7774o1097k8511l9736o9947
$$ plain form
12424 -4973 -11961 29775 100980 166042 196703 186155 174028 165178 150926 221857 209355 183598
12412 183598 153555 93894 90031 108343 160821 139508 136541 119519 64695 122918 113253 44234
12400 44234 90791 94004 110043 105886 79804 150453 167651 135471 185877 118860 188556 257588
12388 257588 162717 -1092 -77496 -52125 3464 34866 29807 36182 34986 10176 -9731 29487
12376 29487 36258 17103 20564 24268 -250 10611 14435 32225 54435 55006 637 -31620 12236
12363 12236 43420 58939 62652 2897 -3269 9225 33474 115176 52532 -23447 -45233 -2120
12351 -2120 51358 71329 84563 114653 103424 71409 80447 56655 74846 45933 29024 751
12339 751 -31549 -61021 -32519 5460 -17768 39813 97930 96089 83321 79946 89962 63901
$$ packed form
12424d973o988M1736P1205O5062L0661j0548j2127q850j4252P0931j2502k5757
12412A83598l0043n9661l863J8312N2478k1313k967j7022n4824N8223r665o9019
12400D4234M6557L213J6039m157k6082P0649J7198l2180N0406o7017O9696O9032
12388B57588r4871j63809p6404K5371N5589L1402n059O375j196k4810j9907L9218
12376B9487O771j9155L461L704k4518J0861L824J7790K2210N71n4369l2257M3856
12363A2236L1184J5519L713n9755o166J2494K4249Q1702o2644p5979k1786M3113
12351b120N3478J9971J3234L0090j1229l2015R038k3792J8191k8913j6909k8273
12339G51l2300k9472K8502L7979k3228N7581N8117j841j2768l375J0016k6061
$$ plain form
12327 63901 6046 -7727 -31676 -84355 -76825 -59461 -51046 -7688 44818 26853 7312 35494
12315 35494 35941 19208 -3059 8739 71693 118154 140884 144551 78528 37013 43463 -12747
12303 -12747 -54032 39475 61782 33177 64028 91714 65162 85052 146166 86265 40628 29398
12291 29398 29496 19564 25713 19845 5188 41506 57103 36342 25829 6795 71358 59296 -3027
12278 -3027 -23031 -7826 21623 36261 29593 35582 59798 82009 108843 111416 132053 122465 117874
12265 117874 72731 61247 63635 97365 132786 143270 108042 64921 74161 77555 54082 28268
12253 28268 25290 8503 15630 42343 73530 114160 87423 29841 26837 27320 38361 25456 79190
12240 79190 109477 88075 112832 156364 181690 146980 116268 116337 74323 84193 91865 28596 -1492
$$ packed form
12327F3901n7855j3773k3949n2679P530J7364Q415M3358N2506j7965j9541K8182
12315C5494M47j6733k2267J1798O2954M6461K2730L667o6023m1515O450n6210
12303a2747m1285R3507K2307k8605L0851K7686k6552J9890O1114n9901m5637j1230
12291B9398R8r932O149n868j4657L6318J5597k0761j0513j9034O4563j2062o2323
12278c027k0004J5205K9449J4638o668N989K4216K2211K6834K573K0637r588m591
12265A17874m5143j1484K388L3730L5421J0484l5228m3121R240L394k3473k5814
12253B8268k978j6787P127K6713L1187M0630k6737n7582l004M83J1041j2905N3734
12240G9190L0287k1402K4757M3532K5326l4710l0712O9m2014R870P672o3269l0088
$$ plain form
12227 -1492 19846 -3585 -25857 -61965 -96264 -102325 -78886 -23601 30280 43580 76484 95390
12215 95390 47785 85655 138963 150928 34699 -47627 -70408 -100272 -51938 -8646 -28865
12204 -28865 8617 6969 27798 33501 5512 -58262 -17582 1876 -35189 17969 54229 7813
12192 7813 7758 10424 38207 17346 31967 69132 15151 -17931 8099 18492 7775 -53465 -83204
12179 -83204 -110570 -150011 -103861 -88711 -93319 -87096 -60411 -17999 -15034 20059 64835 24683
12167 24683 33899 41877 59406 61316 78054 116912 98090 63790 67480 25418 16446 75599 86516
12154 86516 80281 124366 125721 62403 34384 21565 34363 53544 42178 54380 114917 112916
12142 112916 63627 14523 43926 67395 -10121 -76128 -17063 -36559 15806 24741 6717 7030
$$ packed form
12227a492K1338k3431k2272l6108l4299o061K3439N5285N3881J3300L2904J8906
12215I5390m7605L7870N3308J1965j16229q2326k2781k9864M8334M3292k0219
12204b8865L7482j648K0829N703k7989o3774M0680J9458l7065N3158L6260m6416
12192G813n5K666K7783k0861J4621L7165n3981l3082K6030J0393j0717o1240k9739
12179h3204k7366l9441M6150J5150m608O223K6685M2412K965L5093M4776m0152
12167B4683R216P978J7529J910J6738L8858j8822l4300L690m2062q972N9153J0917
12154H6516o235M4085J355o3318k8019j2819J2798J9181j1366J2202O0537k001
12142A12916m9289m9104K9403K3469p7516o6007N9065j9496N2365Q935j8024L13
$$ plain form
12130 7030 8907 23664 46657 68592 83488 104843 125504 84603 50873 3731 -66478 -1787
12118 -1787 69819 -3660 -68094 -29900 -19724 -32811 -31114 1526 -202 -27673 -18236 -9530 -433
12105 -433 1133 28461 46390 8319 -21916 -60143 -22555 23975 33747 7573 -41074 -33563 21227
12092 21227 -21843 7083 -24238 -23972 -39133 -57185 -4285 11638 8079 -12554 -7511 1679 -13320
12079 -13320 74326 102253 79263 87376 15109 1025 -19323 39083 66916 108956 49408 -7903
12067 -7903 -16167 -28587 -38337 3411 52068 76347 20289 23914 26746 59022 75861 50155 19280
12054 19280 18760 -15664 -56383 -68707 -27221 -15402 7690 30549 39242 7003 53154 47504
12042 47504 19106 44021 54185 46851 83623 92557 103679 34949 62572 14703 17041 -47736
$$ packed form
12130G030J877J4757K2993K1935J4896K1355K0661m0901l3730m7142p0209O4691
12118a787P1606p3479o4434L8194J0176j3087J697L2640j728k7471R437Q706R097
12105d33J566K7328J7929l8071l0235l8227L7588M6530R772k6174m8647P511N4790
12092B1227m3070K8926l1321K66j5161j8052N2900J5923l559k0633N043R190j4999
12079a3320Q7646K7927k2990Q113p2267j4084k0348N8406K7833M2040n9548n7311
12067g903q264j2420r750M1748M8657K4279n6058L625K832L2276J6839k5706l0875
12054A9280n20l4424m0719j2324M1486J1819K3092K2859Q693l2239M6151n650
12042D7504k8398K4915J0164p334L6772Q934J1122o8730K7623m7869K338o4777
$$ plain form
12030 -47736 -30890 7773 66237 54019 48867 20852 -40007 -30610 11186 22993 27344 88230
12018 88230 86773 60504 33656 9339 -24768 -55207 -56665 -37553 -34926 51693 131959 83193
12006 83193 23386 -335 5608 62179 64822 39536 101236 95723 61191 9622 -42275 -24577
11994 -24577 -41414 -125147 -105696 -94783 -27434 19833 8501 16568 5899 -19647 43851 62667
11982 62667 23401 77019 68521 16517 -17073 -49347 -30448 -14918 -19718 7243 17079 -9978
11970 -9978 2683 42345 45805 23891 75299 128375 92055 35880 37318 45497 68878 89592
11958 89592 89986 87737 73947 61769 73228 71152 80607 137866 112706 53512 -21501 -1291 78124
11945 78124 102493 86420 19567 -5940 -14297 -75351 -100721 -123949 -117540 -60523 -41667 -48671
$$ packed form
12030d7736J6846L8663N8464j2218n152k8015o0859R397M1796J1807M351O0886
12018H8230j457k6269k6848k4317l4107l0439j458J9112K627Q6619Q0266m8766
12006H3193n9807k3721N943N6571K643k5286O1700n513l4532n1569n1897J7698
11994b4577j6837q3733J9451J0913O7349M7267j1332Q067j0669k5546O3498J8816
11982F2667l9266N3618q498n2004l3590l2274J8899J5530m800K6961R836k7057
11970i978J2661L9662L460k1914N1408N3076l6320n6175J438Q179K3381K0714
11958H9592L94k249j3790j2178J1459k076R455N7259k5160n9194p5013K0210P9415
11945G8124K4369j6073o6853k5507q357o1054k5370k3228O409N7017J8856p004
$$ plain form
11933 -48671 19658 46614 14899 38544 106689 106716 56632 -14196 -71824 -96705 -44831 -22983
11921 -22983 22448 65827 32660 -3883 -32822 -56014 -95979 -109023 -135806 -94149 -69759 -72810
11909 -72810 -91589 -61262 -56771 -38605 -26225 -31090 -38743 -33646 -22808 -17763 -42998 -53557 -21515
11896 -21515 13818 67630 111168 82213 41987 25152 -13347 -6128 68489 66260 23603 13529
11884 13529 34814 -19181 -44426 -50571 24582 25713 12314 -6854 -6287 19431 76416 90998
11872 90998 52147 46700 -4171 12083 9417 -56883 -68197 -4469 59005 107901 100218 78617
11860 78617 48056 15978 38901 50582 4136 -22531 -17565 -14119 422 75542 141192 121042
11848 121042 57304 54193 15519 -3409 -13552 -28580 41041 85934 50336 15785 -9335 22062
$$ packed form
11933d8671O8329K6956l1715K3645O8145K7n0084p0828n7628k4881N1874K1848
11921b2983M5431M3379l3167l6543k8939k3192l9965j3044k6783M1657K4390l051
11909g2810j8779L0327M491J8166J2380m865p653N097J0838N045k5235j0559L2042
11896b1515L5333N3812M3538k8955m0226j6835l8499P219P4617k229m2657j0074
11884A3529K1285n3995k5245o145P5153J131j3399j9168N67K5718N6985J4582
11872I0998l8851n447n0871J6254k666o6300j1314O3728O3474M8896p683k1601
11860G8617l0561l2078K2923J1681m6446k6667M966L446J4541P5120O5650k0150
11848A21042o3738l111l8674j8928j0143j5028O9621M4893l5598l4551k5120L1397
$$ plain form
11836 22062 57515 112260 124087 22721 -54496 -77311 -44161 -31437 -19686 25184 34792 2766
11824 2766 -14623 -48063 -56548 -61206 -44647 -29213 -25511 -58700 -75264 -74 55162 73585
11812 73585 26927 12148 -73276 -94802 -37779 -86161 -103002 -71332 19650 104755 135617 123707
11800 123707 148687 112164 55903 61849 38997 -20698 -30313 -18268 -66699 -19037 24028 2974
11788 2974 -9015 641 -7313 -72182 -71737 -16204 -29596 -37399 -47449 -81389 -55048 -5254 24890
11775 24890 -9251 -54628 -73450 -76888 -44284 -81612 -63980 -64301 -48812 -51327 -35549 12169
11763 12169 34867 12480 -46380 -31836 -22170 -41913 -24998 -14612 8449 91188 121753 97028
11751 97028 71283 37070 29235 -6146 -27246 -51956 -40636 27474 43174 -4508 -96421 -105452
$$ packed form
11836B2062L5453N4745J1827j01366p7217k2815L3150J2724J1751M4870R608l2026
11824B766j7389l3440q485m658J6559J5434L702l3189j6564P5190N5236J8423
11812G3585m6658j4779q5424k1526N7023m8382j6841L1670R0982Q5105L0862j1910
11800A23707K4980l6523n6261N946k2852n9695r615J2045m8431M7662M3065k1054
11788B974j1989R656p954o4869M45N5533j3392p803j0050l3940K6341M9794L0144
11775B4890l4141m5377j8822l438L2604l7328J7632l21J5489k515J5778M7718
11763A2169K2698k2387n8860J4544R666j9743J6915J0386K3061Q2739L0565k4725
11751I7028k5745l4213p835l5381k1100k4710J1320O8110J5700m7682r1913r031
$$ plain form
11739 -105452 -118871 -56080 34973 61014 11218 -53719 -37521 -10951 -11447 -26813 -13742 -57414
11727 -57414 -82646 -43147 207 87182 79055 132473 94105 23502 20601 14270 17695 21992 26245
11714 26245 26345 17027 86353 87144 29344 15734 60738 45903 64615 113385 119810 94650 14117
11701 14117 -96073 -136423 -114148 -80319 -44121 -30889 -18410 -11702 -14079 -9742 54101 42104
11689 42104 -17947 -29569 1249 43308 12577 -10266 -45907 -77303 20948 94868 114546 100398
11677 100398 29227 -48972 -60376 -14239 -7361 7084 7647 14268 23730 549 -20813 2175
11665 2175 25454 28655 -13074 -26306 -34948 -36146 -48010 -69087 -106540 -34655 -46778 -13649
11653 -13649 3184 -9588 -17147 15715 7460 -36189 -17511 12797 -47064 -100544 -86973 -22874
$$ packed form
11739a05452j3419O2791R1053K6041m9796o4937J6198K6570m96j5366J3071m3672
11727e7414k5232L9499M3354Q6975q127N3418l8368p0603k901o331L425M297M253
11714B6245J00r318O9326P91n7800j3610M5004j4835J8712M8770O425k5160q0533
11701A4117j10190m0350K2275L3829L6198J3232J2479O708k377M337O3843j1997
11689D2104o0051j1622L0818M2059l0731k2843l5641l1396R8251P3920J9678j4148
11677A00398p1171p8199j1404M6137O878J4445N63O621R462k3181k1362K2988
11665B175K3279L201m1729j3232q642j198j1864k1077l7453P1885j2123L3129
11653a3649J6833j2772p559L2862q255m3649J8678L0308n9861n3480J3571O4099
$$ plain form
11641 -22874 -331 -42469 -71146 -43363 -4850 -9297 964 48076 56524 82381 36425 -9460
11629 -9460 1970 20791 62274 68817 67974 41042 9802 -374 4318 40595 46233 27508 -7668
11616 -7668 30055 -3727 -79572 -66714 -90689 -79373 -71283 -46372 32047 75841 76693 25349
11604 25349 56030 74539 76425 49131 12924 -19530 -36177 -52910 -39719 -25361 -35258 -61763
11592 -61763 -46978 -56816 -19299 34081 47679 -24128 -7769 29828 33303 60986 36223 8961
11580 8961 -27767 5249 10968 40711 43235 10191 14825 -8040 -97057 -103225 -99039 -124876 -94093
11567 -94093 -44438 -8694 18637 20354 3471 -16725 -11657 51288 79127 59946 67565 67793 7901
11554 7901 -10736 -41858 -68418 -75767 -124610 -106784 -28057 -17103 -61911 -40930 -93777 -122310
$$ packed form
11641b2874K2543m2138k8677K7783L8513m447J0261M7112Q448K5857m5956m5885
11629i460J1430J8821M1483O543q43k6932l1240j0176M692L6277N638j8725l5176
11616g668L7723l3782p5845J2858k3975J1316Q090K4911P8419M3794Q52n1344
11604B5349L0681J8509J886k7294l6207l2454j6647j6733J3191J4358r897k6505
11592f1763J4785r838L7517N3380J3598p1807J6359L7597L475K7683k4763k7262
11580H961l6728L3016N719K9743K524l3044M634k2865q9017o168M186k5837L0783
11567i4093M9655L5744K7331J717j6883k0196N068O2945K7839j9181P619K28n9892
11554G901j8637l1122k6560p349m8843J7826P8727J0954m4808K0981n2847k8533
$$ plain form
11542 -122310 -91322 -37802 -3670 23893 35984 70994 84768 5037 13626 10638 -5487 -48702
11530 -48702 -51009 -114750 -150545 -110159 -68239 -10966 21407 24257 -29802 -64061 -98320 -72650
11518 -72650 -56966 -91503 -60338 -40157 17013 28037 -9666 5634 9610 2113 19813 21747
11506 21747 23761 -14930 -23544 -165 1790 3746 56078 15174 14888 4840 -6396 -62280 -56020
11493 -56020 35295 50244 16727 -27341 -1884 33900 108093 136235 68215 29448 74529 86913
11481 86913 69321 76683 23464 23118 38301 82074 100473 116750 121331 89166 49664 34487
11469 34487 62586 90935 57030 11436 28134 -7851 14627 5063 -11893 2402 -9929 -2458
11457 -2458 1375 36819 -15213 -7852 36595 83163 121397 103095 25614 54312 65311 12763
$$ packed form
11542a22310L0988N3520L4132K7563J2091L5010J3774p9731Q589k988j6125m3215
11530d8702k307o3741l5795M0386M1920N7273L2373K850n4059l4259l4259K5670
11518g2650J5684l4537L1165K0181N7170J1024l7703J5300L976p497J7700J934
11506B1747K014l8691q614K3379J955J956N2332m0904k86j0048j1236n5884O260
11493e6020R1315J4949l3517m4068K5457L5784P4193K8142o8020l8767M5081J2384
11481H6913j7592P362n3219l46J5183M3773J8399J6277M581l2165l9502j5177
11469C4487K8099K8349l3905m5594J6698l5985K2478r564j6956J4295j2331P471
11457b458L833L5444n2032P361M4447M6568L8234j8302p7481K8698J0999n2548
$$ plain form
11445 12763 -76216 -69406 -27569 -54208 -84999 -7418 -35351 -13630 22426 -2542 -52415 -64232
11433 -64232 -114439 -110763 -88275 -66979 -86752 -111403 -122685 -83353 -36878 -21812 -27818 -66380
11421 -66380 -96481 -45579 -37568 -62294 -34214 -757 -1368 -48630 -79551 -92143 -40235 -12678
11409 -12678 -66167 -64369 -128058 -106284 -34285 23167 86519 95807 55936 79611 105988 49611
11397 49611 4570 -60435 -66820 -68672 -59137 -2171 16260 26371 -26766 -71436 -64036 -81260
11385 -81260 -41669 10097 -13357 37523 49351 -6248 -6181 -1479 -106460 -133156 -85125 -69453
11373 -69453 -29740 -13553 261 -11704 10414 -17423 -40925 -34800 -33347 -16774 -32150 -48236
11361 -48236 -14472 -22862 -50092 -48004 -52108 -90713 -107767 -96236 -84646 -81963 -112923 -21801
$$ packed form
11445A2763q8979O810M1837k6639l0791P7581k7933K1721L6056k4968m9873j1817
11433f4232n0207L676K2488K1296j9773k4651j1282L9332M6475J5066o006l8562
11421f6380l0101N0902Q011k4726K8080L3457o11m7262l0921j2592N1908K7557
11409a2678n3489J798o3689K1774P1999N7452O3352R288l9871K3675K6377n6377
11397D9611m5041o5005o385j852R535N6966J8431J0111n3137m4670P400j7224
11385h1260L9591N1766k3454N0880J1828n5599O7M702j04981k6696M8031J5672
11373f9453L9713J6187J3814j1965K2118k7837k3502O125J453J6573j5376j6086
11361d8236L3764q390k7230K088m104l8605j7054J1531J1590K683l0960R1122
$$ plain form
11349 -21801 -13225 -39402 -70172 -90283 -111650 -53784 27393 9543 -36267 -50170 -26394 1426
11337 1426 14290 -1517 -33716 -26260 -3028 -6562 -24731 -59411 -93343 -115365 -75058 -62653
11325 -62653 -120899 -63155 -6599 -21232 -75865 -94769 -88276 -88108 -73508 -37371 -6451 -11667
11313 -11667 -2562 26269 57423 27572 3351 -11190 -72504 -121997 -40021 -19696 -56164 -85509
11301 -85509 -40280 12469 -31756 -24780 -71884 -168699 -154401 -86296 -26254 22180 67615 112353
11289 112353 85536 36279 47047 58050 44676 -7300 16785 29744 22032 -369 -53969 -30579
11277 -30579 -69283 -44962 -28489 -8248 -467 -28900 -46617 -74563 -40291 -9746 -17613 -121
11265 -121 87579 115295 56909 9857 28675 54482 21243 -41580 -48048 -23979 18078 -4766
$$ packed form
11349b1801Q576k6177l0770k0111k1367N7866Q1177j7850m5810j3903K3776K7820
11337A426J2864j5807l2199P456K3232l534j8169l4680l3932k2022M0307J2405
11325f2653n8246N7744N6556j4633n4633j8904O493J68J4600L6137L0920n216
11313a1667R105K8831L1154k9851k4221j4541o1314m9493Q1976K0325l6468k9345
11301h5509M5229N2749m4225O976m7104r6815J4298O8105O0042M8434M5435M4738
11289A12353k6817m9257J0768J1003j3374n1976K4085J2959p712k2401n3600K3390
11277c0579l8704K4321J6473K0241P781k8433j7717k7946L4272L0545p867J7492
11265a21Q7700K7716n8386m7052J8818K5807l3239o2823o468K4069M2057k2844
$$ plain form
11253 -4766 -37561 -43001 -52931 -68674 -92765 -45890 41701 2164 4519 61757 18792 -70123
11241 -70123 -80623 -46234 -32468 2635 -3291 5 19101 99 -43183 -33867 -48236 -119526
11229 -119526 -156619 -123579 -55630 44958 24047 -15969 43023 57154 81635 39425 44153
11218 44153 65952 74004 21840 -30101 -27725 25448 8312 -91494 -115690 -113904 -47306 -21466
11206 -21466 -21459 -9282 -33797 -39173 -17524 -10891 42631 109125 94807 102301 139485 117005 73872
11193 73872 21983 -85739 -157425 -105815 -34427 -28630 -83676 -93555 -51733 -74867 -155892 -91676
11181 -91676 -73536 -131852 -125707 -103062 -78819 -47539 -26818 -15410 -53868 -105999 -77543 -67571
11169 -67571 -19384 11328 44204 33760 -30827 49923 76989 29871 -23094 -69555 -39821 -52693
$$ packed form
11253d766l2795n440r930j5743k4091M6875Q7591l9537K355N7238m2965q8915
11241g0123j0500L4389J3766L5103n926L296J9096j9002m3282R316j4369p1290
11229a19526l7093L3040O7949J00588k0911m0016N8992J4131K4481m2210M728
11218D4153K1799Q052n2164n1941K376N3173j7136r9806k4196J786O6598K5840
11206b1466PJ2177k4515n376K1649O633N3522O6494j4318P494L7184k2480m3133
11193G3872n1889j07722p1686N1610P1388N797n5046r879M1822k3134q1025O4216
11181i1676J8140n8316O145K2645K4243L1280K0721J1408l8458n2131K8456R972
11169f7571M8187L0712L2876j0444o4587Q0750K7066m7118n2965m6461K9734j2872
$$ plain form
11157 -52693 1 39001 39502 44220 26210 58103 109981 54823 29213 82329 38533 8373
11145 8373 18816 66262 62272 18683 7917 -9334 5261 67989 110926 92412 25547 -2643
11133 -2643 12619 31622 16732 27556 35094 45372 -14534 -45416 -18141 -19566 -37236 -51557
11121 -51557 22100 -59389 -80042 -118379 -101911 -22359 -11832 -34319 -44360 -36870 42901 38535
11109 38535 35119 24917 10226 -20148 -97938 -81072 -110298 -60170 28505 19366 26263 15238
11097 15238 31588 65827 48493 87729 97883 54712 43502 13187 -52388 -18407 -16977 13231
11085 13231 -12739 -51981 -71183 -73203 -46805 -73813 -62398 -50506 -65417 -64578 -17511 -3870
11073 -3870 -13419 -46354 -14472 5063 60580 53774 40853 -40414 -87121 -66190 -88904 -51341
$$ packed form
11157e2693N2694L9000N01M718j8010L1893N1878n5158k5610N3116m3796l0160
11145H373J0443M7446l990m3589j0766j7251J4595O2728M2937j8514o6865k8190
11133b643J5262J9003j4890J0824P538J0278n9906l0882K7275j425j7670j4321
11121e1557P3657q1489k0653l8337J6468P9552J0527k2487j0041P490P9771m366
11109C8535l416j0202j4691l0374p7790J6866k9226N0128Q8675r139O897j1025
11097A5238J6350L4239j7334L9236J0154m3171j1210l0315o5575L3981J430L0208
11085A3231k5970l9242j9202k020K6398k7008J1415J1892j4911Q39M7067J3641
11073c870r549l2935L1882J9535N5517o806j2921q1267m6707K0931k2714L7563
$$ plain form
11061 -51341 -37432 -60623 -38321 -67715 -91372 -60971 -63460 -83727 -109359 -100170 -71323 -20235
11049 -20235 40734 56429 55971 33238 35694 12430 17440 15536 25542 40781 -4237 -49297 -33701
11036 -33701 16909 35056 41510 3819 39854 48190 21241 27741 12462 16581 52456 30168
11024 30168 -39261 -49904 -67156 -81793 -60689 1251 83710 82764 16793 22382 -9317 -31659
11012 -31659 -102418 -116338 -77539 -41672 -6624 1374 6144 -40251 -102739 -110080 -126020 -84520
11000 -84520 6624 -24093 -83186 -59032 -13011 -16708 -43916 -74838 -90859 -116743 -120939 -84871
10988 -84871 -3367 49788 44768 -21329 -73334 -47394 -89697 -82635 -27508 9287 -17972 -67069
10976 -67069 -73504 -71003 -65822 -25158 -12648 -62282 -83888 2940 -1523 4267 -34656 -63417 -62433
$$ packed form
11061e1341J3909k3191K2302k9394k3657L0401k489k0267k5632R189K8847N1088
11049b0235O0969J5695m58k2733K456k3264N010j904J0006J5239m5018m5060J5596
11036c3701N0610J8147O454l7691L6035Q336k6949O500j5279M119L5875k2288
11024C0168o9429j0643j7252j4637K1104O1940Q2459r46o5971N589l1699k2342
11012c1659p0759j3920L8799L5867L5048P998M770m6395o2488p341j5940M1500
11000h4520R1144l0717n9093K4154M6021l697k7208l0922j6021k5884m196L6068
10988h4871Q1504N3155n020o6097n2005K5940m2303P062N5127L6795k7259m9097
10976f7069o435K501N181M0664J2510m9634k1606Q6828m463N790l8923k8761R84
$$ plain form
10963 -62433 -51348 -44409 -110662 -59730 -47327 -58237 -72821 -100359 -6227 86797 65750 56666
10951 56666 57054 -9469 -45505 -60261 -58286 -16686 25638 36146 47695 45579 22203 17678 -573
10938 -573 23066 -3432 -31357 -6789 64554 86074 63465 96684 81688 4978 78120 76409
10926 76409 -14167 -50679 -38004 -32826 -73216 -87862 -79647 6730 81290 74286 78253 63578
10914 63578 13184 -4585 -38752 -55709 -63054 -79086 -42943 -15366 38795 46626 20508 -10137
10902 -10137 -5784 38298 51595 3753 -21406 -9410 -69481 -51952 -6340 -23566 -11321 12393
10890 12393 14849 6072 -4432 -33906 -31615 -530 50416 -43052 -144433 -171918 -95562 -77139
10878 -77139 -75633 -63832 -34392 -9766 -31433 -77975 -35096 -31050 -36469 19786 56999 43030
$$ packed form
10963f2433J1085O939o6253N0932J2403j0910j4584k7538R4132R3024k1047r084
10951E6666L88o6523l6036j4756J975M1600M2324J0508J1549k116k3376m525j8251
10938e73K3639k6498k7925K4568P1343K1520k2609L3219j4996p6710P3142j711
10926G6409r0576l6512J2675N178m0390j4646Q215Q6377P4560p004L967j4675
10914F3578n0394j7769l4167j6957p345j6032L6143K7577N4161P831k6118l0645
10902a0137M353M4082J3297m7842k5159J1996o0071J7529M5612j7226J2245K3714
10890A2393K456q777j0504k9474K291L1085N0946r3468j01381k7485P6356J8423
10878g7139J506J1801K9440K4626k1667m6542M2879M046n419N6255L7213j3969
$$ plain form
10866 43030 63710 39370 -67055 -104674 -32647 11998 25676 23669 4505 -35977 -81470 -61239
10854 -61239 -79478 -72778 2161 44170 83351 80371 38367 -22302 -76239 -96600 -83884 -36480
10842 -36480 43046 24631 -39836 -25948 -32540 -47086 -48945 -53380 -34948 39496 63298 36581
10830 36581 4131 -7124 -37994 -39543 -68010 -97311 -121641 -84718 -58521 -76805 -52973 18978
10818 18978 55707 60130 49551 2624 -46950 -23192 -73534 -169986 -170124 -159481 -104914 -81644
10806 -81644 -108781 -82978 -24508 -92 -63672 -114969 -80382 -49872 -98869 -95562 -110390 -71730
10794 -71730 -6423 41624 4317 3423 33621 50470 15103 -40756 -117968 -155456 -70327 -33994
10782 -33994 1116 57635 26276 -51406 -72463 -34266 -57271 -83689 -59477 10124 48576 71648
$$ packed form
10866D3030K0680k4340j06425l7619P2027M4645J3678k007j9164m0482m5493K0231
10854f1239j8239O700P4939M2009L9181k980m2004o0669n3937k0361J2716M7404
10842c6480P9526j8415o4467J3888o592j4546j859m435J8432P4444K3802k6717
10830C6581l2450j1255l0870j549k8467k9301k4330L6923K6197j8284K3832P1951
10818A8978L6729M423j0579m6927m9574K3758n0342r6452j38J0643N4567K3270
10806h1644k7137K5803N8470K4416o3580n1297L4587L0510m8997L307j4828L8660
10794g1730O5307M8047l7307q94L0198J6849l5367n5859p7212l7488Q5129L6333
10782c3994L5110N6519l1359p7682k1057L8197k3005k6418K4212O9601L8452K3072
$$ plain form
10770 71648 3011 -21380 37214 59795 104322 92413 -9852 -11979 51441 91456 63697 33201
10758 33201 5130 -13879 -33631 -73159 -91285 -69476 -54207 1528 29004 25459 70334 23287
10746 23287 13671 20589 6308 49270 94905 93925 81878 94580 23119 -47804 -48806 4455 25588
10733 25588 17720 17966 -5459 -2264 37139 91939 71799 -4244 -64057 -69350 -109510 -148734 -125454
10720 -125454 -93753 -64381 -1616 68561 96148 73417 7334 -76452 -58704 36118 61694
10709 61694 60498 89439 124089 84316 -10424 -8934 19867 52330 52420 4668 -48443 1148 -21512
10696 -21512 -37187 -35000 6756 -3898 -39399 -69754 -32726 -23965 -27206 -715 4304 -13956
10684 -13956 -29263 -52288 -43438 -36405 413 37260 15655 -18409 -29983 -84854 -63952 -52867
$$ packed form
10770G1648o8637k4391N8594K2581M4527j1909j02265k127O3420M0015k7759l0496
10758C3201k8071j9009j9752l9528j8126K1809J5269N5735K7476l545M4875m7047
10746B3287r616O918j4281M2962M5635r80j2047J2702p1461p0923j002N3261K1133
10733B5588p868K46k3425L195L9403N4800k0140p6043n9813n293m0160l9224K3280
10720a25454L1701K9372O2765P0177K7587k2731o6083q3786J7748R4822K5576
10709F1694j196K8941L4650l9773r4740J490K8801L2463R0m7752n3111M9591k2660
10696b1512j5675K187M1756j0654l5501l0355L7028Q761l241K6491N019j8260
10684a3956j5307k3025Q850P033L6818L6847k1605l4064j1574n4871K0902J1085
$$ plain form
10672 -52867 -54727 -13642 40083 -2253 -71271 -27080 -28250 -117577 -145817 -93570 -90374 -77824
10660 -77824 -28128 11215 -47078 -50662 -87894 -191169 -204082 -142516 -86592 -73999 -70665 -62048
10648 -62048 1130 23768 64881 79506 31556 -29369 12660 -3902 -43911 -6013 28655 45559
10636 45559 -11025 18049 47840 -18163 -36807 -58462 -111443 -103287 -73785 -65989 -105322 -105385 -116333
10623 -116333 -38593 -18965 12590 47776 10743 28271 -10267 -51547 -74868 -41712 13446
10612 13446 94125 79533 49264 -14463 45090 72013 31958 -20740 -39966 -48801 -16426 -20931
10600 -20931 -45176 -6234 -52703 -54731 -80738 -99856 -117303 -12838 -23810 -48666 -8969 -29389
10588 -29389 -69314 -39881 -14168 -39975 -80808 -125481 -101194 -47658 -57962 -30522 -43044 -39627
$$ packed form
10672e2867j860M1085N3725m2336o9018M4191j170q9327k8240N2247L196J2550
10660g7824M9696L9343n8293l584l7232j03275j2913O1566N5924J2593L334Q617
10648f2048O3178K2638M1113J4625m7950o0925M2029j6562m0009L7898L4668J6904
10636D5559n6584K9074K9791o6003j8644k1655n2981Q156K9502P796l9333o3j0948
10623a16333P7740J9628L1555L5186l7033J7528l8538m1280k3321L3156N5158
10612A3446Q0679j4592l0269o3727N9553K6923m0055n2698j9226q835L2375m505
10600b0931k4245L8942m6469k028k6007j9118j7447J04465j0972k4856L9697k0420
10588b9389l9925K9433K5713k5807m0833m4673K4287N3536j0304K7440j2522L417
$$ plain form
10576 -39627 -4236 26048 21172 6831 -72095 -77457 -69950 -88217 -56039 -51596 -77124 -46224
10564 -46224 -12425 18375 -15150 -5660 -25816 -95256 -103375 -54585 -55133 -158496 -166157 -106605
10552 -106605 -45010 -38651 -51208 -34578 -31150 -55309 -101542 -90909 -34970 46807 70261 68040
10540 68040 27068 12248 -14382 -75670 -109718 -142474 -169294 -138299 -133371 -104219 -64742 -72323
10528 -72323 -46346 -61230 4569 64649 36885 65613 69764 -13718 -91625 -71397 -62206 -40318
10516 -40318 -21210 20392 19273 54431 70278 47495 44359 45887 106862 126069 73030 56058
10504 56058 57127 -10757 -82525 -141074 -85265 -52071 -58025 -44475 7375 -12561 -42244 -24684
10492 -24684 -16899 -31206 -34761 1840 71422 45567 -2584 18393 23081 -26724 -55079 -14248
$$ packed form
10576c9627L5391L0284m876j4341p8926n362P507j8267L2178M443k5528L0900
10564d6224L3799L0800l3525R490k0156o9440q119M8790n48j03363p661N9552
10552a06605O1595O359j2557J6630L428k4159m6233J0633N5939Q1777K3454k221
10540F8040m0972j4820k6630o1288l4048l2756k6820L0995M928K9152L9477p581
10528g2323K5977j4884O5799O0080k7764K8728M151q3482p7907K0228R191K1888
10516d0318J9108M1602j119L5158J5847k2783l136J528O0975J9207n3039j6972
10504E6058J069o7884p1768n8549N5809L3194n954J3550N1850j9936k9683J7560
10492b4684P785j4307l555L6601O9582k5855m8151K0977M688m9805k8355M0831
$$ plain form
10480 -14248 -15037 -46631 -60971 -43407 -72506 -86128 -112909 -56820 -16597 17348 5674 23612
10468 23612 34898 38956 59910 33468 -43184 -64299 -71105 -27940 9963 35350 52499 55430
10456 55430 34609 43244 30603 11419 32111 69426 33226 -27885 -32287 -31422 -58657 -45201
10444 -45201 -18583 -27586 -65765 -116266 -106812 -29853 19596 -6709 -89486 -40885 32643 58607
10432 58607 52943 50479 19676 -46450 -29870 -662 39250 102452 101515 35110 -26819 -110235
10420 -110235 -102157 -66980 -27648 -32357 -95521 -61937 -11808 -8535 35329 32575 4232 -17886
10408 -17886 19031 57507 -1913 -36361 -8433 41735 10594 -11248 -19700 -12182 -26626 -10548
10396 -10548 41736 21886 -68642 -139906 -102968 -79124 -72613 -51672 -54028 -57673 -60395 -42284
$$ packed form
10480a4248p89l1594j4340J7564k9099j3622k6781N6089M0223L3945j1674J7938
10468B3612J1286M058K0954k6442p6652k1115o806M3165L7903K5387J7149K931
10456E5430k0821Q635j2641j9184K0692L7315l6200o1111m402Q65k7235J3456
10444d5201K6618r003l8179n0501R454P6959M9449k6305q2777M8601P3528K5964
10432E8607n664k464l0803o6126J6580K9208L9912O3202r37o6405o1929q3416
10420a10235Q078L5177L9332m709o3164L3584N0129L273M3864k754k8343k2118
10408a7886L6917L8476n9420l4448K7928N0168l1141k1842q452P518j4444J6078
10396a0548N2284j9850r0528p1264L6938K3844O511K0941k356l645k722J8111
$$ plain form
10384 -42284 -37192 -46113 13933 -8629 -4840 24302 -5923 2887 18931 27295 47169 62477 44562
10371 44562 54664 111837 35198 -25330 -34990 -50747 -10407 -21137 -21813 -14965 -61316 5547
10359 5547 85928 41315 22482 57581 63783 36357 18662 22259 -8858 -63512 -47820 42503
10347 42503 65240 -42152 -105952 -86930 -45902 -15396 -16436 4850 37644 67954 63084 -15151
10335 -15151 -45467 -29861 -35399 -55327 -7826 43021 7240 -17958 -12453 -37376 -10580 51781
10323 51781 62205 35080 43786 36891 30009 14591 24719 48869 55358 34415 47524 34294
10311 34294 76604 90297 28321 -18368 -58087 -62878 -26137 -24450 -905 26908 12973 50913
10299 50913 20569 -22120 524 54537 99125 83474 73655 45020 -28789 -17733 -6436 -3614
$$ packed form
10384d2284N092q921O0046k2562L789K9142l0225Q810J6044Q364J9874J5308j7915
10371D4562J0102N7173p6639o0528r660j5757M0340j0730o76O848m6351O6863
10359E547Q0381m4613j8833L5099O202k7426j7695L597l1117n4654J5692R0323
10347D2503K2737j07392o3800J9022M1028L0506j040K1286L2794L0310m870p8235
10335a5151l0316J5606n538j9928M7501N0847l5781k5198N505k4923K6796O2361
10323E1781J0424k7125Q706o895o882j5418J0128K4150O489k0943J3109j3230
10311C4294M2310J3693o1976m6689l9719m791L6741J687K3545K7813j3935L7940
10299E0913l0344m2689K2644N4013M4588j5651r819k8635p3809J1056J1297K822
$$ plain form
10287 -3614 -4288 -17467 30699 39644 35450 8552 -10848 -46322 -55536 -13040 17184 1193 22986
10274 22986 14029 -31172 -21225 -85550 -118886 -126448 -66814 -2942 -45060 -59461 -59868 -5660 3123
10261 3123 -63525 -72091 -12731 15769 -1676 -73667 -109530 -55540 -49701 -58495 -25223 -41514
10249 -41514 -93743 -8782 60308 44236 75015 48026 23135 25395 -13317 -55949 -41870 -54355
10237 -54355 -95831 -83555 -75046 -56579 -615 91927 99819 19914 2716 -26169 -69359 -75038
10225 -75038 -50931 -37536 -53400 -30933 4676 -16852 -77178 -45183 17369 -7464 -50028 -120442
10213 -120442 -189360 -158858 -126941 -72694 -35273 36597 56809 19580 13253 24502 44623 -54986
10201 -54986 -48504 -30984 -29405 -26316 -42440 -53012 -1381 27418 41803 19032 18976 44721 35812
$$ packed form
10287c614o74j3179M8166Q945m194k6898j9400l5474r214M2496L0224j5991K1793
10274B2986q957m5201R947o4325l3336p562N9634O3872m2118j4401m07N4208Q783
10261C123o6648q566N9360K8500j7445p1991l5863N3990N839q794L3272j6291
10249d1514n2229Q4961O9090j6072L0779k6989k4891K260l8712m2632J4079j2485
10237e4355m1476J2276Q509J8467N5964R2542P892p9905j7198k8885m3190n679
10225g5038K4107J3395j5864K2467L5609k1528o0326L1995O2552k4833m2564p0414
10213a20442o8918L0502L1917N4247L7421P1870K0212l7229o327J1249K0121r9609
10201e4986O482J7520J579L089j6124j0572N1631K8799J4385k2771n6K5745q909
$$ plain form
10188 35812 36229 14082 -46201 -72115 -68183 -68273 -18448 -14708 -43241 -71963 -77706 -63269 -114646
10175 -114646 -131360 -87446 -93161 -68778 -75268 -87635 -44742 9455 7220 -31572 -103479 -145503
10163 -145503 -92775 -5317 30525 3436 -42430 -6728 13466 -25195 -80196 -70555 -5112 -13306
10151 -13306 5098 12925 4591 3474 23119 -28787 -32534 3808 6426 -21542 -35204 -37265 5426
10138 5426 33378 29567 -9424 -12830 -43122 -29234 15928 55357 52985 26403 17657 13086 32743
10125 32743 -11458 -37967 -8434 -3 -54858 -52446 -87477 -28540 -14801 -63157 -28638 -57209
10113 -57209 -82656 -114468 -29052 -4242 -65794 -97916 -104341 -61253 3281 45010 11652 -11231
10101 -11231 32544 31566 23920 18183 21034 10553 42314 56595 -13451 -42185 11521 -21024 16437
$$ packed form
10188C5812M17k2147o0283k5914L932r0M9825L740k8533k8722n743J4437n1377
10175a14646j6714M3914n715K4383o490j2367M2893N4197k235l8792p1907m2024
10163a45503N2728Q7458L5842k7089m5866L5702K0194l8661n5001R641O5443q194
10151a3306J8404P827q334j117J9645n1906l747L6342K618k7968j3662k061M2691
10138E426K7952l811l8991l406l0292J3888M5162L9429k372k6582q746m571J9657
10125C2743m4201k6509K9533Q431n4855K412l5031N8937J3739m8356L4519k8571
10113e7209k5447l1812Q5416K4810o1552l2122o425M3088O4534M1729l3358k2883
10101a1231M3775r78p646n737K851j0481L1761J4281p0046k8734N3706l2545L7461
$$ plain form
10088 16437 19730 44659 55393 -10927 -34450 19618 19959 41223 -9730 11179 75226 35325
10076 35325 70306 88342 112673 91271 80666 64715 85969 83398 35085 26007 35233 7841
10064 7841 -44528 -15429 -11681 -26743 -10311 -44785 -32641 -55700 -91913 -89066 -30732 -13002
10052 -13002 -54101 -55660 6864 -12118 1041 -44413 -63935 -26151 -32609 -42054 15411 56180
10040 56180 42594 38075 -14800 -69355 -90785 -82603 -39085 -19491 10243 30932 33908 51225
10028 51225 83722 83763 72834 18237 1060 -923 -7226 -32338 -30896 11737 23772 -26854 -77099
10015 -77099 -50847 -85259 -130349 -127879 -95657 -99090 -110331 -104935 -67296 -42354 61943 68116
10003 68116 13793 13809 -1408 -2653 -12467 -15078 1451 -2394 4464 80145 131307 122801 143315
$$ packed form
10088A6437L293K4929J0734o6320k3523N4068L41K1264n0953K0909O4047l9901
10076C5325L4981J8036K4331k1402j0605j5951K1254k571m8313r078R226k7392
10064G841n2369K9099L748j5062J6432l4474J2144k3059l6213K847N8334J7730
10052a3002m1099j559O2524j8982J3159m5454j9522L7784o458r445N7465M0769
10040E6180j3586m519n2875n4555k1430Q182M3518J9594K9734K0689K976J7317
10028E1225L2497M1j0929n4597j7177j983o303k5112J442M2633J2035n0626n0245
10015g7099K6252l4412m5090K470L2222l433j1241N396L7639K4942J04297O173
10003F8116n4323J6j5217j245r814k611J6529l845O858P5681N1162q506K0514
$$ plain form
9990 143315 177257 162536 137045 76431 77594 142852 144376 128871 123460 88162 101200 124456
9978 124456 147274 157435 182368 170016 121239 103164 144210 222687 270737 318792 396472 558572
9966 558572 719746 902822 1144379 1514037 2018704 2579219 2994757 3115615 2836509 2200121
9956 2200121 1505815 968505 700665 551423 478918 354653 257226 243514 266615 260905 241185
9945 241185 249932 294334 270496 231979 176002 149264 140039 131010 119551 81568 33206 32770 33044
9932 33044 60636 82240 102845 139773 176948 162997 107376 66623 38264 76382 129873 122816
9920 122816 87733 32110 27482 47918 11864 27666 43455 94983 79965 72812 57786 8591
9908 8591 -40140 -58029 -39491 -53030 -17358 -7161 -1760 -44169 -51737 -20944 23647 43172
$$ packed form
9990A43315L3942j4721k5491o0614J163O5258J524j5505n411l5298J3038K3256
9978A24456K2818J0161K4933j2352m8777j8075M1046P8477M8050M8055P7680J62100
9966E58572J61174J83076K41557L69658N04667N60515M15538J20858k79106o36388
9956B200121o94306n37310k67840j49242p2505j24265r7427j3712K3101n710j9720
9945B41185Q747M4402k3838l8517n5977k6738r225r029j1459l7983m8362m36K74
9932C3044K7592K1604K0605L6928L7175j3951n5621m0753k8359L8118N3491p057
9920A22816l5083n5623m628K0436l6054J5802J5789N1528j5018p153j5026m9195
9908H591m8731j7889J8538j3539L5672J0197N401m2409p568L0793M4591J9525
$$ plain form
9896 43172 68029 92863 117032 118059 134076 139376 120218 72374 55255 54551 28956 17039 23247
9883 23247 43320 82565 77472 1338 -37177 32784 -13881 -64358 -31539 -6591 -37065 -35585
9871 -35585 -8664 2710 -13202 -39361 -24248 35091 63105 151488 172038 146544 73090 114190
9859 114190 126593 172193 176494 131761 75101 30502 56313 45240 47740 47773 9547 -9245 79467
9846 79467 94007 79540 41704 39569 22007 18499 -2510 34206 69510 39225 27930 1167
9834 1167 515 5374 32540 28549 62955 103411 78984 58857 52858 50959 46745 72079 59270
9821 59270 94559 105625 60253 35625 7657 -34080 13887 72394 53039 12185 35485 98130
9809 98130 116602 85714 58565 64498 57720 50687 -26920 -48286 -17138 33841 66275 58138 44098
$$ packed form
9896D3172K4857K4834K4169J027J6017N300j9158m7844j7119p04k5595j1917O208
9883B3247K0073L9245n093p6134l8515O9961m6665n0477L2819K4948l0474J480
9871c5585K6921J1374j5912k6159J5113N9339K8014Q8383K0550k5494p3454M1100
9859A14190J2403M5600M301m4733n6660m4599K5811j1073K500L3l8226j8792Q8712
9846G9467J4540j4467l7836k135j7562l508k1009L6716L5304l0285j1295k6763
9834A167o52M859K7166l991L4406M0456k4427k0127n999j899m214K5334j2809
9821E9270L5289J1066m5372k4628k7968m1737M7967N8507j9355m0854K3300O2645
9809I8130J8472l0888k7149N933o778p033p7607k1366L1148N0979L2434q137j4040
$$ plain form
9796 44098 10200 32590 43622 93277 78819 83811 94290 80202 75071 79516 73877 62621 56680
9783 56680 62473 49083 23057 -209 -13219 -22409 -42508 -35310 -35729 -31351 -43910 -34785 -1759
9770 -1759 -19014 -43974 -63647 -63514 -66769 -51979 7097 -15594 -21887 17478 50632 96729 86787
9757 86787 65753 74081 65578 7355 -3941 42831 48625 37959 -2949 -30814 -65484 -49506
9745 -49506 -26417 -3608 -21289 -53865 -70214 -86156 -92706 -70242 -20653 14501 -3211 11656
9733 11656 38611 85783 29341 -22034 20094 39435 17375 147 52523 4282 -38529 -62175
9721 -62175 -1566 58430 80384 111574 73552 -7889 26877 16351 72529 72317 51284 39615
9709 39615 -327 -2430 32709 48411 15848 16660 11626 -51154 -118702 -119293 -49850 -52274 -75741
$$ packed form
9796D4098l3898K2390J1032M9655j4458M992J0479j4088n131M445n639j1256n941
9783E6680N793j3390k6026k3266j3010r190k0099P198m19M378j2559R125L3026
9770a759j7255k4960j9673J33l255J4790N9076k2691o293L9365L3154M6097r942
9757H6787k1034Q328q503n8223j1296M6772N794j0666m0908k7865l4670J5978
9745d9506K3089K2809j7681l2576j6349j5942o550K2464M9589L5154j7712J4867
9733A1656K6955M7172n6442n1375M2128J9341k2060j7228N2376m8241m2811k3646
9721f2175O0609N9996K1954L1190l8022q1441L4766j0526N6178k12k1033j1669
9709C9615l9942k103L5139J5702l2563Q12n034o2780o7548n91O9443k424k3467
$$ plain form
9696 -75741 -87587 -60239 -4306 34407 22703 -18535 -11074 -11786 -49986 -18024 -37294 -10778
9684 -10778 19721 34721 36410 -8639 -36406 -51345 -47825 -4150 -59221 -143396 -104657 -85094
9672 -85094 -84876 -68181 -17561 13928 -16677 -39048 -90006 -46898 -31495 -80433 -49939 -22123
9660 -22123 11515 55997 -13310 -72158 -52854 -32436 -33636 -10619 15977 2834 31575 59151
9648 59151 108927 101757 68357 67018 63008 40199 -4544 -26693 -8385 -82205 -163042 -150274
9636 -150274 -68061 637 -18789 -35928 -9616 -25095 -8883 4608 8053 -92294 -114203 -52097
9624 -52097 -49386 -73473 -68221 -24781 27888 26118 31443 28442 185 -7374 34025 33173 54789
9611 54789 74097 -4239 1924 44929 100910 89548 54041 21354 15012 -33038 -32565 -6073 -33283
$$ packed form
9696g5741j1846K7348N5933L8713j1704m1238P461p12l8200L1962j9270K6516
9684a0778L0499J5000J689m5049k7767j4939L520M3675n5071q4175L8739J9563
9672h5094K18J6695N0620L1489l0605k2371n0958M3108J5403m8938L0494K7816
9660b2123L3638M4482o9307n8848J9304K0418j200K3017K6596j3143K8741K7576
9648E9151M9776p170l3400j339m010k2809m4743k2149J8308p3820q0837J2768
9636a50274Q2213O8698j9426j7139K6312j5479J6212J3491L445j00347k1909O2106
9624e2097K711k4087N252M3440N2669j770N325l001k8257p559M1399q52K1616
9611E4789J9308p8336O163M3005N5981j1362l5507l2687o342m8050M73K6492k7210
$$ plain form
9598 -33283 -64465 -129284 -90780 -42735 38092 51766 -6799 -41273 -2139 20651 20907 -35737
9586 -35737 -48284 10100 32854 13509 -32521 -78075 -72499 -52978 -5794 7466 15384 26328
9574 26328 -38004 -47469 -82908 -76737 -31148 -2603 -10347 17364 -8437 -19049 -30428 -63370
9562 -63370 -27463 -32831 -22689 2627 -27817 -93477 -113176 -34545 -26715 5440 4845 -9645 -69182
9549 -69182 -97867 -77018 -21319 41188 56991 79992 63836 85929 49538 -39583 -116979 -83900
9537 -83900 -21243 17612 -31405 -40015 -1486 -3563 -24288 -43904 -23988 7477 46373 5022
9525 5022 -26298 -34530 -34636 -6931 47748 15629 58702 54475 9776 516 27752 -5713 -38288
9512 -38288 -53849 -49201 -3262 37302 37457 61838 16107 788 7899 -3747 -39720 -41371 14210
$$ packed form
9598c3283l1182o4819L8504M8045Q0827J3674n8565l4474L9134K2790K56n6644
9586c5737j2547N8384K2754j9345m6030m5554N576J9521M7184J3260P918J0944
9574B6328o4332r465l5439O171M5589K8545p744K7711k5801j0612j1379l2942
9562f3370L5907n368J0142K5316l0444o5660j9699P8631P830L2155n95j4490n9537
9549f9182k8685K0849N5699O2507J5803K3001j6156K2093l6391q9121p7396L3079
9537h3900O2657L8855m9017q610L8529k077k0725j9616J9916L1465L8896m1351
9525E022l1320q232j06K7705N4679l2119M3073m227m4699r260K7236l3465l2575
9512c8288j5561M648M5939M0564J55K4381m5731j5319P111j1646l5973j651N5581
$$ plain form
9499 14210 1736 -7178 -6179 -74296 -38147 3723 -11388 18061 17567 18642 1024 -19668 20726
9486 20726 12713 -15164 -13120 -14293 -42670 -49085 -88987 -107574 -51874 -89410 -113750 -72355 -1403
9473 -1403 30198 9223 -33509 -61998 -48447 4277 51084 51873 60191 55645 66849 119149 108399
9460 108399 26674 -33961 -108421 -152378 -166589 -156399 -105590 -68744 -48582 -35719 -8378 -14959
9448 -14959 -15616 -56314 -33753 -51559 -46684 -12283 -87300 -46109 19499 38954 44089 53299 89438
9435 89438 27482 2643 -27173 630 43601 -17386 -85179 -66862 -52229 -53284 -30994 -9605
9423 -9605 -12834 8369 43069 19872 43354 5643 11649 83055 59151 65442 42226 35276 -39285
9410 -39285 -36354 -15830 -49092 -72240 -81313 -25149 41773 55885 17413 59640 135543 130754
$$ packed form
9499A4210j2474q914R99o8117L6149M1870j5111K9449m94J075j7618k0692M0394
9486B0726q013k7877K044j173k8377o415l9902j8587N5700l7536k4340M1395P0952
9473a403L1601k0975m2732k8489J3551N2724M6807P89Q318m546J1204N2300j0750
9460A08399q1725o0635p4460m3957j4211J0190N0809L6846K0162J2863K7341o581
9448a4959o57m0698K2561j7806M875L4401p5017M1191O5608J9455N135R210L6139
9435H9438o1956k4839k9816K7803M2971o0987o7793J8317J4633j055K2290K1389
9423i605l229K1203L4700k3197K3482l7711O006P1406k3904O291k3216o950p4561
9410c9285K931K0524l3262k3148r073N6164O6922J4112l8472M2227P5903m789
$$ plain form
9398 130754 70048 41685 23010 21384 8018 -68721 -49119 2331 -33446 -74197 -68955 -48946
9386 -48946 -61182 -27207 -21504 -19542 -39346 -21873 -25209 -17139 -11906 -35134 -32287 -34150 -91314
9373 -91314 -63252 -28696 -63973 -68380 -36424 -29386 -28879 -82202 -122808 -87387 15545 63177
9361 63177 532 -48146 -77518 -93072 -102124 -67339 -4820 15332 -66765 -91743 -67752 -57740
9349 -57740 32394 67211 51535 4396 -46629 -96227 -95683 -38180 15631 19314 -51738 -72446
9337 -72446 -19365 -1539 -4365 29 -30242 -64360 -71869 -73631 -3272 -9782 4108 37414 18340
9324 18340 -37869 1108 8972 44713 41012 28683 -12197 -72194 -84242 -112108 -94551 -59202
9312 -59202 -45939 -52268 -37119 -73276 -65600 -41863 -101889 -88588 -67292 -66108 -13346 65838
$$ packed form
9398A30754o0706k8363j8675j626j3366p6739J9602N1450l5777m0751N242K0009
9386d8946j2236L3975N703J962j9804J7473l336Q070N233k3228K847j863n7164
9373i1314K8062L4556l5277m407L1956P038N07n3323m0606L5421J02932M7632
9361F3177o2645m8678k9372j5554r052L4785O2519K0152q2097k4978K3991J0012
9349e7740R0134L4817j5676m7139n1025m9598N44N7503N3811L683p1052k0708
9337g2446N3081J7826k826M394l0271l4118p509j762P0359o510J3890L3306j9074
9324A8340n6209L8977P864L5741l701j2329m0880n9997j2048k7866J7557L5349
9312e9202J3263o329J5149l6157P676K3737o0026J3301K1296J184N2762P9184
$$ plain form
9300 65838 16046 -17229 74813 134274 82445 -10051 29598 60600 87061 58334 80864 145326
9288 145326 90043 8182 35039 43161 69450 43010 5417 1032 52102 53585 58703 94731
9276 94731 96955 62328 108177 152210 133910 157804 135788 126961 210342 191509 175756 193916
9264 193916 140020 126579 63609 30861 44286 107712 151865 174628 156440 185420 189086 51887
9252 51887 -36087 40155 81535 100916 171433 153184 59618 59108 117400 193883 190089 107194
9240 107194 65849 80843 140754 162799 126833 59404 28428 21691 61919 117770 105761 76852
9228 76852 49884 58906 111547 130196 129165 118594 117988 100598 57457 75984 102132 94377 55753
9215 55753 46946 9583 23660 17506 3 26448 -16728 -7357 60296 64575 50524 56229 124673
$$ packed form
9300F5838m9792l3275R2042N9461n1829r2496L9649L1002K6461k8727K2530O4462
9288A45326n5283q1861K6857Q122K6289k6440l7593m385N1070J483N118L6028
9276I4731K224l4627M5849M4033j8300K3894k2016q827Q3381j8833j5753J8160
9264A93916n3896j3441o2970l2748J3425O3426M4153K2763j8188K8980L666j37199
9252E1887q7974P6242M1380J9381P0517j8249r3566n10N8292P6483l794q2895
9240A07194m1345J4994N9911K2045l5966o7429l0976o737M0228N5851j2009k8909
9228G6852k6968R022N2641J8649j031j0571o06j7390m3141J8527K6148p755l8624
9215E5753q807l7363J4077o154j7503K6445m3176R371O7653M279j4051N705O8444
$$ plain form
9202 124673 116018 77058 43303 9426 -19009 4863 117997 156577 115076 83980 81885 63698
9190 63698 155314 193028 145248 112611 91828 66119 94382 101631 74732 146109 93785 51431
9178 51431 95887 106930 85231 98922 158576 141275 111103 128591 141126 141912 183006 289626
9166 289626 281350 284222 306101 327106 389091 428815 454738 515981 630810 722956 783797 886375
9154 886375 978607 1103235 1205682 1282718 1480423 1710668 1904688 2165460 2524856 2890815
9144 2890815 3334865 3918471 4650402 5670072 7013938 8652587 10759233 13510848 17070852
9135 17070852 20990304 23936166 24546993 22303655 17835567 13133550 9696296 7528587
9127 7528587 6147682 5120776 4268745 3645637 3242975 2866093 2451508 2108111 1863961
$$ packed form
9202A24673q655l8960l3755l3877k8435K3872J13134L8580m1501l1096k095j8187
9190F3698R1616L7714m7780l2637k0783k5709K8263P249k6899P1377n2324m2354
9178E1431M4456J1043k1699J3691N9654j7301l0172J7488J2535P86M1094J06620
9166B89626q276K872K1879K1005O1985L9724K5923O1243J14829R2146O0841J02578
9154H86375R2232J24628J02447P7036J97705K30245J94020K60772L59396L65959
9144B890815M44050N83606P31931J019670J343866J638649K106646K751615L560004
9135A7070852L919452K945862O10827k243338m468088m702017l437254k167709
9127G528587j380905j026906q52031o23108m02662l76882m14585l43397k44150
$$ plain form
9118 1863961 1726537 1533447 1387553 1315009 1298828 1242046 1156202 1107326 1064778 1008451 960582
9107 960582 947291 924884 941600 965216 914279 898531 871809 796410 785648 782871 789046 723467
9095 723467 607780 600203 581436 616492 665697 619635 599774 633025 600854 571440 546386 551476
9083 551476 553383 573543 544827 554732 535360 553931 631955 663208 617625 553194 479515 488389
9071 488389 487166 512087 538377 514778 534428 492928 432470 465315 430861 399127 443738 413740
9059 413740 421168 417798 427593 402390 442066 464121 505443 488871 481260 484447 434283 380485 392399
9046 392399 439135 469018 440622 407189 448185 431214 480443 488219 506783 570455 559679 533820
9034 533820 517750 485433 539701 591641 588696 559681 515003 513342 515160 419509 412672 369574
$$ packed form
9118A863961j37424j93090j45894p2544j6181n6782q5844m8876m2548n6327m7869
9107I60582j3291k2407J6716K3616n0937j5748k6722p5399j0762k777O175o5579
9095G23467j15687p577j8767L5056M9205m6062j9861L3251l2171k9414k5054N090
9083E51476J907K0160k8716R905j9372J8571P8024L1253m5583o4431p3679Q874
9071D88389j223K4921K6290k3599J9650m1500o0458L2845l4454l1734M4611k9998
9059D13740P428l370R795k5203L9676K2055M1322j6572p611L187n0164n3798J1914
9046C92399M6736K9883k8396l3433M0996j6971M9229P776J8564O3672j0776k5859
9034E33820j6070l2317N4268N1940k945k9015m4678j661J818r5651o837m3098
$$ plain form
9022 369574 342291 397527 424973 459386 452946 537124 593264 623784 630154 570436 532299 490652
9010 490652 436897 377735 372500 400563 387602 428261 452316 481316 420429 365099 444198 464397
8998 464397 431748 346741 314663 333422 350548 364671 352371 366456 386391 416800 404517 380115
8986 380115 302528 319563 328234 306005 242111 127666 108240 74334 12432 69857 132266 140721
8974 140721 153804 130292 166696 123780 94262 110269 65766 59472 90606 73446 89118 113574
8962 113574 70739 55037 94468 121280 123021 138033 117256 107979 74521 58453 68488 79184
8950 79184 57169 67979 51742 42468 20517 55855 141913 148965 93153 95051 166129 149657
8938 149657 152018 154179 58008 -36270 -32048 -45035 -32628 36804 68980 36125 21903 -34707
$$ packed form
9022C69574k7283N5236K7446L4413o440Q4178N6140L0520O370n9718l8137m1647
9010D90652n3755n9162n235K8063j2961M0659K4055K9000o0887n5330P9099K0199
8998D64397l2649q5007l2078J8759J7126J4123j2300J4085J9935L0409j2283k4402
8986C80115p7587J7035Q671k2229o3894j14445j9426l3906o1902N7425O2409Q455
8974A40721J3083k3512L6404m2916k9518J6007m4503o294L1134j7160J5672K4456
8962A13574m2835j5702L9431K6812J741J5012k0777r277l3458j6068J0035J0696
8950G9184k2015J0810j6237r274k1951L5338Q6058P052n5812J898P1078j6472
8938A49657K361K161r6171r4278M222j2987J2407O9432L2176l2855j4222n6610
$$ plain form
8926 -34707 -9755 42583 32282 57979 137617 119433 80591 100387 110342 96511 56195 53060
8914 53060 59404 31748 8746 -6995 39933 68415 60391 64681 44332 -14991 48530 56718 71206
8901 71206 81790 98296 96703 115184 95770 38770 43577 28574 -48541 -21388 14316 -27015
8889 -27015 -67128 -41626 -6023 17087 45494 89192 56507 33307 21667 -19539 -31154 -83234
8877 -83234 -59669 -46376 -26122 -2976 11681 1688 -4596 21017 38037 85532 91247 59463
8865 59463 58981 45773 24811 11730 70002 101198 85662 77116 48817 5871 -28482 -3966
8853 -3966 54947 59366 24905 10731 68639 90743 96150 123253 159431 63686 54219 97300 109440
8840 109440 82501 33699 47500 103928 66753 95624 145838 192127 178691 75817 -11236
$$ packed form
8926c4707K4952N2338j0301K5697P9638j8184l8842J9796R955j3831m0316l135
8914E3060O344k7656k3002j5741M6928K8482q024M290k0349n9323O3521Q188J4488
8901G1206J0584J6506j593J8481j9414n7000M807j5003p7115K7153L5704m1331
8889b7015m0113K5502L5603K3110K8407M3698l2685k3200j1640m1206j1615n2080
8877h3234K3565J3293K0254K3146J4657r993o284K5613J7020M7495N715l1784
8865E9463m82j3208k0962j3081N8272L1196j5536q546k8299m2946l4353K4516
8853c966N8913M419l4461j4174N7908K2104N407K7103L6178r5745r467M3081J2140
8840A09440k6939m8802J3801N6428l7175K8871N0214M6289j3436j02874q7053
$$ plain form
8829 -11236 38060 94633 103874 73616 103774 97020 26742 70025 147458 171439 97358 54128
8817 54128 59173 64339 33073 23556 31855 21029 32119 49449 77768 69096 95544 158452 131936
8804 131936 61955 2842 27492 68679 14657 -41268 -3840 32243 38903 45049 60524 27442
8792 27442 13035 43779 100852 144047 129832 98187 68564 33688 80396 119884 148366 125669
8780 125669 92060 107742 79960 77661 59821 43781 43997 31316 12111 92236 128396 147445
8768 147445 92662 41757 -69071 -117505 -25080 64098 98392 52911 -46140 -34711 -27430 -9380
8756 -9380 -29784 -18042 22488 12415 19749 51631 62846 1374 -55369 -46728 -40496 -59276 -49939
8743 -49939 -32050 22995 47773 15960 -1288 -69127 -14104 51018 90790 20559 26595 -3626
$$ packed form
8829a1236M9296N6573R241l0258L0158o754p0278M3283P7433K3981p4081m3230
8817E4128N045N166l1266r517Q299j0826J1090J7330K8319q672K6448O2908k6516
8804A31936o9981n9113K4650M1187n4022n5925L7428L6083O660O146J5475l3082
8792B7442j4407L0744N7073M3195j4215l1645k9623l4876M6708L9488K8482k2697
8780A25669l3609J5682k7782k299j7840j6040K16j2681j9205Q0125L6160J9049
8768A47445n4783n0905j10828m8434R2425Q9178L4294m5481r9051J1429P281J8050
8756i380k0404J1742M0530j0073P334L1882J1215o1472n6743Q641O232j8780R337
8743d9939J7889N5045K4778l1813j7248o7839N5023O5122L9772p0231O036l0221
$$ plain form
8731 -3626 -36070 10988 77852 97057 69381 59261 102831 123294 17562 -26470 -16991 33535
8719 33535 84737 66627 39565 20571 25320 95944 134134 109071 128487 149202 102921 42229
8707 42229 32887 110911 128122 169702 190956 143911 117635 164148 167386 151331 78777 56696
8695 56696 106285 102453 38811 33874 108522 75451 88975 101811 89047 70553 42872 37113
8683 37113 61036 36867 38838 17751 30775 55793 78225 54717 36389 22956 -46697 -48748
8671 -48748 37775 76529 23622 -35149 -22483 36188 57309 45048 35026 36188 -313 -35239
8659 -35239 3149 64372 64633 33788 -1114 -21769 29730 80146 64141 87662 42859 7774
8647 7774 24194 -1099 -26742 7472 58536 75283 61663 81731 105771 57801 13257 -15469
$$ packed form
8731c626l2444M7058O6864J9205k7676j0120M3570K0463j05732m4032R479N0526
8719C3535N1202j8110k7062j8994M749P0624L8190k5063J9416K0715m6281o0692
8707D2229r342P8024J7211M1580K1254m7045k6276M6513L238j6055p2554k2081
8695E6696M9589l832o3642m937P4648l3071J3524J2836j2764j8494k7681n759
8683C7113K3923k4169J971k1087J3024K5018K2432k3508j8328j3433o9653k051
8671d8748Q6523L8754n2907n8771J2666N8671K1121j2261j0022J162l6501l4926
8659c5239L8388O1223K61l0845l4902k0655N1499N0416j6005K3521m4803l5085
8647G774J6420k5293k5643L4214N1064J6747j3620K0068K4040m7970m4544k8726
$$ plain form
8635 -15469 -11293 23158 41208 60350 66716 25787 19199 27317 44398 68975 39083 5566 26470
8622 26470 -14913 -13393 21903 82316 84391 94818 64486 31851 42476 64162 31122 6870
8610 6870 74259 140786 96109 8272 23536 91125 158728 140570 99775 143692 123244 38263
8598 38263 -9513 -8163 24884 63611 96672 86004 120150 94171 31548 8794 -53852 -51240
8586 -51240 5605 29458 27407 -18718 -34289 -20704 -88564 -117000 -85618 -56107 -47107 16954
8574 16954 81898 39519 3599 51766 67532 110934 148842 104596 149171 87189 1767 -36666
8562 -36666 -57954 -16451 59129 60910 -19308 -64794 -45282 -7042 25937 69417 91599 85177
8550 85177 106466 109895 95398 42675 6056 -12192 9580 37216 23969 -32026 -37650 42338
$$ packed form
8635a5469M176L4451J8050J9142O366m0929o588Q118J7081K4577k9892l3517K0904
8622B6470m1383J520L5296O0413K075J0427l0332l2635J0625K1686l3040k4252
8610F870O7389O6527m4677q7837J5264O7589O7603j8158m0795M3917k0448q4981
8598C8263m7776J350L3047L8727L3061j0668L4146k5979o2623k2754o2646K612
8586e1240N6845K3853k051m6125j5571J3585o7860k8436L1382K9511R000O4061
8574A6954O4944m2379l5920M8167J5766M3402L7908m4246M4575o1982q5422l8433
8562c6666k1288M1503P5580J781q0218m5486J9512L8240L2979M3480K2182o422
8550H5177K1289L429j4497n2723l6619j8248K1772K7636j3247n5995n624P9988
$$ plain form
8538 42338 107114 65487 20310 8999 -29243 -71910 -86234 -88253 -43059 -39707 -31365 432
8526 432 50411 38038 -327 17305 19118 37911 -4681 -29611 -60417 -58359 -67131 -48569 -10982
8513 -10982 46522 71131 46985 52849 53502 23911 814 34781 34283 37989 47719 79716 93036
8500 93036 54618 55181 -5606 -54678 -50111 -16045 -5851 -55063 -54681 -81291 -47501 -17550 7554
8487 7554 36434 30184 71513 89507 90324 65896 35376 19585 -30293 -63047 29290 89610 84193
8474 84193 41276 57620 47943 18376 -6086 75461 96500 72260 42615 -19138 -38100 54696
8462 54696 91415 124341 63684 25979 -6948 -58109 -40714 -19972 -55376 -77495 -64949 -17709
8450 -17709 -16589 -63352 -84947 -44568 13292 35523 48641 51242 48986 -25599 -26314 20596 44246
$$ packed form
8538D2338O4776m1627m5177j1311l8242m2667j4324k019M5194L352Q342L1797
8526D32M9979j2373l8365J7632J813J8793m2592k4930l0806K058q772J8562L7587
8513a0982N7504K4609k4146N864O53k9591k3097L3967m98L706R730L1997J3320
8500I3036l8418N63o0787m9072M567L4066J0194m9212L82k6610L3790K9951K5104
8487G554K8880o250M1329J7994Q17k4428l0520j5791m9878l2754R2337O0320n417
8474H4193m2917J6344r677k9567k4462Q1547K1039k4240k9645o1753j8962R2796
8462E4696L6719L2926o0657l7705l2927n1161J7395K0742l5404k2119J2546M7240
8450a7709J120m6763k1595M0379N7860K2231J3118K601k256p4585p15M6910K3650
$$ plain form
8437 44246 -11795 -10285 44436 30970 6357 67049 59836 42797 -10363 -5334 36618 -4280
8425 -4280 35051 69922 38061 32370 -2785 -29130 -37117 -56413 -64809 -112633 -138470 -107216 -64869
8412 -64869 -21940 -53640 -88980 -68105 -68349 -28431 -4774 -34011 -14925 -72276 -75193 -53320
8400 -53320 -64206 -78303 -85372 -49619 -23157 -17082 -92616 -68268 2672 55054 -284 -41940
8388 -41940 -12617 66041 121686 66105 -2992 -27141 -3599 -25017 3044 56406 51968 52338
8376 52338 41283 -12497 -96753 -105523 -89474 -33641 -43397 -90998 -85950 -28588 9859 -14169
8364 -14169 -59950 8691 87801 92370 56229 10572 -45833 -77847 -46113 -74597 -119829 -101791
8352 -101791 -130481 -68583 -54630 -73812 -87502 -123856 -88002 -94223 -122673 -121140 -66654 -22241
$$ packed form
8437D4246n6041J510N4721j3466k4613O0692p213j7039n3160N029M1952m0898
8425d280L9331L4871l1861n691l5155k6345p987j9296q396m7824k5837L1254M2347
8412f4869M2929l1700l5340K0875k44L9918K3657k9237J9086n7351k917K1873
8400e3320j0886j4097p069L5753K6462O075p5534K4348P0940N2382n5338m1656
8388d1940K9323P8658N5645n5581o9097k4149K3542k1418K8061N3362m438L70
8376E2338j1055n3780q4256q770J6049N5833r756m7601N048N7362L8447k4028
8364a4169m5781O8641P9110M569l6141m5657n6405l2014L1734k8484m5232J8038
8352a01791k8690O1898J3953j9182j3690l6354L5854o221k8450J533N4486M4413
$$ plain form
8340 -22241 -15743 28672 23008 -16707 -45653 -83047 -66607 -17769 -12270 -17219 3734 -42130 -78392
8327 -78392 -50060 -4107 27089 55200 45130 43849 115260 116631 78591 33093 62826 72401
8315 72401 16272 5614 56009 29904 19690 89438 85495 73671 97146 65087 4308 -5436
8303 -5436 -302 14547 8894 -49181 -81464 -48220 -35403 35559 32128 41623 31116 -35719 -18
8290 -18 44909 53820 -28898 -44030 -15998 -20277 18251 32819 27768 45112 53668 35064 2309
8277 2309 -48610 -61712 -28763 33981 92434 131402 94325 63965 84697 108407 81846 11460
8265 11460 -47293 -49720 -15490 -40184 -115704 -105689 -48183 -40761 -26456 8978 30370 -6033
8253 -6033 -76830 -70493 -63694 -73237 -6489 35873 58104 55099 26787 38105 38456 37278 -14604
$$ packed form
8340b2241O498M4415n664l9715k8946l7394J6440M8838N499m949K0953m5864l6262
8327g8392K8332M5953L1196K8111j0070j281P1411J371l8040m5498K9733R575
8315G2401n6129j0658N0395k6105j0214O9748l943j1824K3475l2059o0779r744
8303e436N134J4849n653n8075l2283L3244J2817P0962l431R495j0507o6835L5701
8290a8M4927Q911q2718j5132K8032m279L8528J4568n051J7344Q556j8604l2755
8277B309n0919j3102L2949O2744N8453L8968l7077l0360K0732K3710k6561p0386
8265A1460n8753k427L4230k4694p5520J0015N7506P422J4305L5434K1392l6403
8253f033p0797O337O799r543O6748M2362K2231l005k8312J1318L51j178n1882
$$ plain form
8240 -14604 -35792 -48488 -1764 37229 43123 34683 65005 79150 52785 21489 74368 34166
8228 34166 44798 98840 163784 157516 135911 126467 82958 35954 12763 -41693 -8066 25290
8216 25290 21386 -46787 -78676 -65549 -33214 -3599 -14314 41225 70435 57495 8265 24399
8204 24399 42129 33911 10056 -35620 40949 115705 114210 95346 79868 37409 29901 -2087
8192 -2087 -30242 -5119 15602 18563 507 11147 60950 58809 45857 41121 25742 19730 3746
8179 3746 -36607 -69273 -106678 -56187 -19840 -24033 -38181 -34315 -54243 -52389 2796 24449 31318
8166 31318 -5955 49261 23309 5434 36282 76716 128262 48435 -13453 64260 91518 78479
8154 78479 52685 57913 77232 122553 78546 681 -18549 -6220 -30037 -2950 -12455 -32952
$$ packed form
8240a4604k1188j2696M6724L8993N894q440L0322J4145k6365l1296N2879m0202
8228C4166J0632N4042O4944o268k1605r444m3509m7004k3191n4456L3627L3356
8216B5290l904o8173l1889J3127L2335K9615j0715N5539K9210j2940m9230J6134
8204B4399J7730q218k3855m5676P6569P4756j495j8864j5478m2459p508l1988
8192b087k8155K5123K0721K961j8056J0640M9803k141j2952m736j5379o012j5984
8179C746m0353l2666l7405N0491L6347m193j4148L866j9928J854N5185K1653O869
8166C1318l7273N5216k5952j7875L0848M0434N1546p9827o1888P7713K7258j3039
8154G8479k5794N228J9319M5321m4007p7865j9230J2329k3817K7087r505k0497
$$ plain form
8142 -32952 -31012 -48898 2187 33990 3404 3283 -13094 2530 -25873 -30058 -20576 -5003 -21332
8129 -21332 -49210 -54004 -46095 601 -58897 -74762 -67865 -38125 -76816 -94167 -44072 834
8117 834 23514 57937 23712 -16460 -52655 -51668 -36605 -36751 -39541 6843 -17522 -13008 29906
8104 29906 37128 41241 35951 10920 -4359 20736 -24340 -34385 23231 20287 -26596 -14901 -18664
8091 -18664 30307 46841 45269 44984 64270 50534 -22917 -4099 23498 44144 48495 73574 120292
8078 120292 92102 36975 7513 90746 80072 12684 -40133 -56145 -12546 7395 26096 41421
8066 41421 98339 123421 139042 165869 183276 210135 116461 56643 29964 41531 33966 62172
8054 62172 123303 136144 89379 99833 136680 145066 93518 48598 66944 68770 29013 -4693
$$ packed form
8142c2952J940j7886N1085L1803l0586j21j6377J5624k8403m185R482J5573j6329
8129b1332k7878m794P909M6696n9498j5865O897K9740l8691j7351N0095M4906
8117H34K2680L4423l4225m0172l6195R87J5063j46k790M6384k4365M514M2914
8104B9906P222M113n290k5031j5279K5095m5076j0045N7616k944m6883J1695l763
8091a8664M8971J6534j572k85J9286j3736p3451J8818K7597K0646M351K5079M6718
8078A20292k8190n5127k9462Q3233j0674o7388n2817j6012M3599J9941J8701J5325
8066D1421N6918K5082J5621K6827J7407K6859r3674n9818k6679J1567p565K8206
8054F2172O1131J2841m6765J0454L6847Q386n1548m4920J8346J826l9757l3706
$$ plain form
8042 -4693 -14668 -3134 -66251 -89878 -80438 21524 50506 48347 11193 5461 48453 51499 92864
8029 92864 82475 52185 18237 -35563 -44839 32373 60273 101967 79647 51804 15980 24247
8017 24247 58357 109234 93818 71770 29693 7594 -36334 -39228 -39675 31038 118014 107745
8005 107745 98849 69527 47163 35671 33545 67748 61911 38481 8031 -11371 9497 95035
7993 95035 100735 73112 36908 69901 45175 -38867 -34675 -4958 46208 36029 69896 108154
7981 108154 85241 104856 96371 71404 86039 130761 119542 84954 93953 116565 87598 68250
7969 68250 57593 44510 -3445 34557 19279 2179 -63281 -86859 -24893 6658 37219 18506
7957 18506 -42085 -30529 -3875 19691 19141 50253 2040 -21252 20175 28607 47766 72111
$$ packed form
8042d693r975J1534o3117k3627R440J01962K8982k159l7154n732M2992L046M1365
8029I2864j0389l0290l3948n3800r276P7212K7900M1694k2320k7843l5824Q267
8017B4247L4110N0877j5416k2048m2077k2099m3928k894m47P0713Q6976j0269
8005A07745q896k9322k2364j1492k126L4203n837k3430l0450j9402K0868Q5538
7993I5035N700k7623l6204L2993k4726q4042M192K9717N1166j0179L3867L8258
7981A08154k2913J9615q485k4967J4635M4722j1219l4588Q999K2612k8967j9348
7969F8250j0657j3083m7955L8002j5278j7100o5460k3578O1966L1551L0561j8713
7957A8506o0591J1556K6654K3566n50L1112m8213k3292M1427Q432J9159K4345
$$ plain form
7945 72111 67211 84832 69095 28873 19461 -12972 19843 16364 19265 16105 38380 106208 120205
7932 120205 152197 95446 68726 42126 59819 82097 35458 32443 17152 -11015 58482 17074
7920 17074 -7543 -12595 39294 44443 -13801 -49787 -44779 -28047 -4968 24986 28118 5646 19370
7907 19370 38808 67942 28603 17397 53 10491 -25727 -51761 -79511 -115135 -84304 -35696
7895 -35696 -6240 -5368 6773 30241 79095 170731 184463 111944 91759 93215 97776 94626 107345
7882 107345 115441 139128 152196 88660 56329 70062 68512 80534 100117 103832 61486 23201
7870 23201 45351 118896 140189 68727 50524 24075 48180 100821 87765 23182 44899 8014
7858 8014 -33618 6546 76623 63935 52558 93822 57178 -24975 -48336 -6099 -17399 -58524
$$ packed form
7945G2111m900J7621j5737m0222r412l2433L2815l479K901l160K2275O7828J3997
7932A20205L1992n6751k6720k6600J7693K2278m6639l015j5291k8167O9497m1408
7920A7074k4617n052N1889N149n8244l5986N008J6732K3079K9954L132k2472J3724
7907A9370J9438K9134l9339j1206j7344J0438l6218k6034k7750l5624L0831M8608
7895c5696K9456Q72J2141K3468M8854R1636J3732p2519k0185J456M561l150J2719
7882A07345Q096K3687J3068o3536l2331J3733j550J2022J9583L715m2346l8285
7870B3201K2150P3545K1293p1462j8203k6449K4105N2641j3056o4583K1717l6885
7858H014m1632M0164P0077j2688j1377M1264l6644q2153k3361M2237j1300m1125
$$ plain form
7846 -58524 -24876 -19950 -62052 -7427 14586 33249 66221 67375 50258 76189 75492 115624 95127
7833 95127 27618 26327 38895 -9365 -27937 -46747 -63932 -112009 -99289 -67854 18432 117130
7821 117130 123066 56869 -5902 -23814 -61099 -68694 -24918 23069 59502 39252 2560 23315
7809 23315 1710 56738 18190 -13352 -73070 -64201 -21649 37730 43634 54921 96332 79832
7797 79832 -17763 -62077 -34221 -39696 -89663 -88224 -36743 1307 15291 2809 13917 66772
7785 66772 92283 78123 7173 -9072 21303 25240 -10548 18455 19925 21128 3225 -22628
7773 -22628 -43299 -74310 -82944 -125938 -63019 -26714 -76614 -82605 -68733 34519 62259 -15421
7761 -15421 -7437 45407 42749 -43432 -98649 -79110 -82726 -44578 -29706 25704 19311 55215 102868
$$ packed form
7846e8524L3648M926m2102N4625K2013J8663L2972J154j7117K5931o97M0132k0497
7833I5127o7509j291J2568m8260j8572j8810j7185m8077J2720L1435Q6286R8698
7821A17130N936o6197o2771j7912l7285p595M3776M7987L6433k0250l6692K0755
7809B3315k1605N5028l8548l1542n9718Q869M2552N9379N904J1287M1411j6500
7797G9832r7595m4314K7856n475m9967J439N1481L8050J3984j2482J1108N2855
7785F6772K5511j4160p0950j6245L0375L937l5788K9003J470J203j7903k5853
7773b2628k0671l1011q634m2994O2919L6305m9900n991J3872J03252K7740p7680
7761a5421P984N2844k658q6181n5217J9539l616L8148J4872N5410o393L5904M7653
$$ plain form
7748 102868 78824 48585 48071 -20625 -78414 -68990 -69045 -57606 -58497 10395 55059 21709 36939
7735 36939 25794 -63809 -41016 78199 103375 60532 63571 57959 -10710 -30528 -33987 24743
7723 24743 22971 -31012 -88752 -73644 -3424 44243 46442 3483 23968 -9109 -35648 -53478
7711 -53478 -37916 -27370 -58836 -54554 -24458 -12610 -82522 -42781 -6557 47769 67747 81600
7699 81600 63975 13980 3690 26235 48999 -7399 -20039 76734 126265 72285 52415 69355
7687 69355 50459 46314 38767 41757 37037 43884 41148 -17280 -29037 -5220 8176 34412 22177
7674 22177 -46924 -33771 30042 51233 94496 96776 55230 -52695 -73950 -69557 -92687 -85170
7662 -85170 -20183 -47477 -35722 -13001 1518 26092 65769 64625 42331 -22558 -32568 -40920
$$ packed form
7748A02868k4044l0239n14o8696n7789R424n5J1439q91O8892M4664l3350J5230
7735C6939j1145q9603K2793J19215K5176m2843L039n612o8669j9818l459N8730
7723B4743j772n3983n7740J5108P0220M7667K199m2959K0485l3077k6539j7830
7711e3478J5562J0546l1466M282L0096J1848o9912L9741L6224N4326J9978J3853
7699H1600j7625m9995j0290K2545K2764n6398j2640R6773M9531n3980j9870J6940
7687F9355j8896m145p547K990m720O847k736n8428j1757K3817J3396K6236j2235
7674B2177o9101J3153O3813K1191M3263K280m1546j07925k1255M393k3130P517
7662h5170O4987k7294J1755K2721J4519K4574L9677j144k2294o4889j0010q352
$$ plain form
7650 -40920 -28435 -41073 -46848 -15565 -48257 -106617 -112092 -93754 -77837 -111217 -99237 -51787
7638 -51787 -58239 -50433 -67485 -92508 -49377 -3082 40392 51321 73014 68577 77943 79552 16668
7625 16668 -64417 -61960 -38664 -12702 39429 67929 54490 2652 3287 -48963 -67455 -29057
7613 -29057 -39156 -81517 -89097 -85294 -48964 -29168 -35713 58238 108174 112166 77277 73482 85810
7600 85810 72371 30997 45869 24425 -7080 23259 83548 47882 -12152 -64688 -85387 -48691
7588 -48691 39518 33891 77060 27045 26919 45475 50079 41131 14001 -16866 36351 45594 5805
7575 5805 19118 41298 67289 61354 53834 11247 43951 118913 84271 50909 11707 -46427
7563 -46427 23077 67136 14328 -413 36523 55661 18256 33173 -35726 -76909 -3597 2019
$$ packed form
7650d0920J2485j2638n775L1283l2692n8360n475J8338J5917l3380J1980M7450
7638e1787o452P806j7052k5023M3131M6295M3474J0929K1693m437R366J609o2884
7625A6668q1085K457K3296K5962N2131K8500j3439n1838O35n2250j8492L8398
7613b9057j0099m2361p580L803L6330J9796o545R3951M9936L992l4889l795J2328
7600H5810j3439m1374J4872k1444l1505L0339O0289l5666o0034n2536k0699L6696
7588d8691Q8209n627M3169n0015j26J8556M604q948k7130l0867N3217R243l9789
7575E805J3313K2180K5991n935p520m2587L2704P4962l4642l3362l9202n8134
7563d6427O9504M4059n2808j4741L6936J9138l7405J4917o8899m1183P3312N616
$$ plain form
7551 2019 -53930 -56782 -18489 -49796 -73648 -33450 -25419 -37302 30938 77798 83309 54782 -35361
7538 -35361 -78763 -76204 -46705 -21920 5621 63875 35253 5709 82267 130961 55180 -19546
7526 -19546 -20923 1697 -8590 -43620 -66598 -56026 -21798 33249 5822 -32425 9025 32337
7514 32337 6063 -55179 -101052 -89197 -84007 -30483 16940 -8746 -36124 -56401 10453 62704
7502 62704 47425 -6675 -45304 -49230 59228 104023 60249 -23249 -27608 -17475 -10927 -19390
7490 -19390 -61744 -38800 -4410 2322 -20704 -74131 -97563 -70889 -87925 -97129 -86436 -95184
7478 -95184 -42199 -62815 -80214 -68388 -2945 -41966 -51126 -38743 -18257 -19213 -13931 -46883 -45796
7465 -45796 9534 30085 11893 -22440 -50693 -46752 -41684 -1685 9841 -7784 23265 27471
$$ packed form
7551B019n5949k852L8293l1307k3852M0198Q031j1883O8240M6860N511k8527r0143
7538c5361m3402K559K9499K4785K7541N8254k8622k9544P6558M8694p5781p4726
7526a9546j377K2620j0287l5030k2978J0572L4228N5047k7427l8247M1450K3312
7514C2337k6274o1242m5873J1855N190N3524M7423k5686k7378k0277O6854N2251
7502F2704j5279n4100l8629l926J08458M4795m3774q3498m359J0133O548q463
7490a9390m2354K2944L4390O732k3026n3427k3432K6674j7036r204J0693q748
7478i5184N2985k0616j7399J1826O5443l9021r160J2383K0486r56N282l2952J087
7465d5796N5330K0551j8192l4333k8253L941N068L9999J1526j7625L1049M206
$$ plain form
7453 27471 11936 29535 12657 -30240 -56123 -84987 -56698 -48490 -44446 -61759 -89908 -80122
7441 -80122 -76391 -46696 70150 124998 75626 44623 36756 13731 4106 82356 68818 59877
7429 59877 31155 -9573 -14114 -35606 -6319 -10995 3550 17910 20455 14585 -38704 -57069 -16450
7416 -16450 -26034 17012 108664 131288 83237 41451 30406 33855 52246 69934 20597 -57718
7404 -57718 -88170 -77769 -19977 -6227 54896 31109 1261 -27156 -32986 -104514 -81835 -24644
7392 -24644 -8597 -38226 -43301 20421 37002 -25677 -35762 -32326 -60045 -48642 18131 40170
7380 40170 9616 75285 83879 15807 -69946 -88033 -71516 -65806 -58256 37549 102852 115218
7368 115218 103370 59037 48308 39798 29108 41651 55992 10347 -36609 -29924 -14101 -76859
$$ packed form
7453B7471j5535J7599j6878m2897k5883k8864K8289Q208M044j7313k8149R786
7441h0122L731K9695J16846N4848m9372l1003p867k3025r625P8250j3538q941
7429E9877k8722m0728m541k1492K9287m676J4545J4360K545n870n3289j8365M0619
7416a6450r584M3046R1652K2624m8051m1786j1045L449J8391J7688m9337p8315
7404e7718l0452J0401N7792J3750O1123k3787k9848k8417n830p1528K2679N7191
7392b4644J6047k9629n075O3722J6581o2679j0085L436k7719J1403O6773K2039
7380D0170l0554O5669Q594o8072q5753j8087J6517N710P550R5805O5303J2366
7368A15218j1848m4333j0729q510j0690J2543J4341m5645m6956O685J5823o2758
$$ plain form
7356 -76859 -73301 -5998 18369 15722 -16981 -8034 9386 8702 -12622 -24263 2974 -29123 -22187
7343 -22187 5600 -304 -23578 -16095 18289 7966 -11134 -36757 -33604 -35683 -63556 -45530 -63515
7330 -63515 -77715 -35117 -39369 -46758 -9039 -44251 -79178 -97522 -118506 -113025 -78300 -18874
7318 -18874 -19761 1895 21583 31481 -8646 -3588 -35574 -50756 -65239 -93138 -120096 -87633 -18132
7305 -18132 -7334 -28254 -19308 21570 44316 70569 65684 1034 -39597 -78830 -104726 -63298
7293 -63298 -1281 48398 37432 1913 -38487 -320 4992 14475 46977 47084 -713 -15558 -13620
7280 -13620 4141 55417 64882 55374 26839 -36159 -57805 -43735 1911 -31059 -54472 -61473
7268 -61473 -26392 -11013 -24069 -40694 -93848 -137654 -101886 -67492 -36139 -68221 -153835 -209877
$$ packed form
7356g6859L558O7303K4367k647l2703Q947J7420o84k1324j1641K7237l2097O936
7343b2187K7787n904k3274P483L4384j0323j9100k5623L153k079k7873J8026j7985
7330f3515j4200M2598m252p389L7719l5212l4927j8344k0984N481L4725N9426
7318a8874q87K1656J9688R898m0127N058l1986j5182j4483k7899k6958L2463O9501
7305a8132J0798k0920Q946M0878K2746K6253m885o4650m0631l9233k5896M1428
7293f3298O2017M9679j0966l5519m0400L8167N312R483L2502J07m7797j4845J938
7280a3620J7761N1276R465r508k8535o2998k1646J4070M5646l2970k3413p001
7268f1473L5081J5379j3056j6625n3154m3806L5768L4394L1353l2082q5614n6042
$$ plain form
7256 -209877 -194165 -145019 -107773 -83545 -65635 -48534 -57875 -55905 -77980 -122599 -134536 -158417
7244 -158417 -176152 -160022 -102547 -74837 -55792 -46241 -45070 -90657 -113781 -110034 -129140 -73793
7232 -73793 -17145 -20816 -8799 -2493 -24952 -42120 -82150 -54051 -25457 -30757 -25146 -66453 -80601
7219 -80601 -40910 46582 86352 101489 120084 92455 65551 59816 7885 -11791 -32344 -21127
7207 -21127 2817 49082 32289 787 -31261 -25356 -58802 -109045 -36222 13512 -26606 27858
7195 27858 89993 52825 50192 12421 -25623 30762 90697 67959 -6489 -73196 -77592 -53799
7183 -53799 -112093 -63557 -12819 -10798 -52646 -69721 -20957 8468 79767 130639 97434 35665
7171 35665 22846 13063 51417 60787 36161 -28936 6300 19602 33090 7611 23310 26818
$$ packed form
7256b09877J5712M9146L7246K4228J7910J7101r341J970k2075m4619j1937k3881
7244a58417j7735J6130N7475K7710J9045R551J171m5587k3124L747j9106N5347
7232g3793N6648l671J2017O306k2459j7168m0030K8099K8594n300N611m1307j4148
7219h0601L9691Q7492L9770J5137J8595k7629k6904n735n1931j9676k0553J1217
7207b1127K3944M6265j6793l1502l2048N905l3446n0243P2823M9734m0118N4464
7195B7858O2135l7168k633l7771l8044N6385N9935k2738p4448o6707m396K3793
7183e3799n8294M8536N0738K021m1848j7075M8764K9425P1299N0872l3205o1769
7171C5665j2819r783L8354R370k4626o5097L5236J3302J3488k5479J5699L508
$$ plain form
7159 26818 34416 15164 4885 43124 30457 11944 -3707 -7672 -8318 -71429 -104377 -62531 -43542
7146 -43542 19223 28578 -19405 -121573 -31104 77530 57502 41992 33664 -4502 -64516 -50636
7134 -50636 -1526 -29588 -54742 -21502 20689 -24543 -73598 -64330 -21119 -24632 -48415 -92071
7122 -92071 -62712 12317 38572 101830 91921 37154 36714 35234 53329 38143 41681 16347 -16994
$$ packed form
7159B6818P598j9252j0279L8239j2667j8513j5651l965o46o3111l2948M1846J8989
7146d3542O2765R355m7983j02168R0469J08634k0028j5510q328l8166o0014J3880
7134e0636M9110k8062k5154L3240M2191m5232m9055R268M3211l513k3783m3656
7122i2071K9359P5029K6255O3258r909n4767m40j480J8095j5186L538k5334l3341
$$ [...]
##END NTUPLES=NMR SPECTRUM
##END=
