##TITLE=Analysis number 316425
Compound Code cc 46509
Book Reference 468/9/2
Project Code adrs
Chemist Name colinb
##JCAMPDX= 6.0         $$ Bruker NMR JCAMP-DX V2.0
##DATA TYPE= NMR SPECTRUM
##DATA CLASS= NTUPLES
##ORIGIN= Bruker BioSpin GmbH
##OWNER= nmr
$$ XWIN-NMR		Version 3.5
$$ Fri Jan 13 10:50:07 2006 GMT Standard Time (UT+0h)  MAYBRIDGE\nmr@NMR_250MHZ
##.OBSERVE FREQUENCY= 250.131544655141
##.OBSERVE NUCLEUS= ^1H
##.ACQUISITION MODE= SIMULTANEOUS (DQD)
##.ACQUISITION SCHEME= undefined
##.AVERAGES= 16
##.DIGITISER RES= 18
##SPECTROMETER/DATA SYSTEM= dpx250
##.PULSE SEQUENCE= zg30
##.SOLVENT NAME= CDCl3
##.SHIFT REFERENCE= (INTERNAL, CDCl3, 0, 16.522)
##AUDIT TRAIL= $$ (NUMBER, WHEN, WHO, WHERE, WHAT)
$$ ##TITLE= Audit trail, XWIN-NMR		Version 3.5
$$ ##JCAMPDX= 5.01
$$ ##ORIGIN= Bruker BioSpin GmbH
$$ ##OWNER= nmr
$$ C:\u/data/dgb/nmr/ADRS/14590/pdata/1/auditp.txt
$$ ##AUDIT TRAIL=  $$ (NUMBER, WHEN, WHO, WHERE, WHAT)
(   1,<2006-01-13 10:49:23.17 +000>,<MAYBRIDGE\nmr>,<NMR_250MHZ>,
      <created by zg, POWCHK disabled, PULCHK disabled
       configuration hash MD5:
       62 19 C7 07 E1 42 D1 B7 37 6C 3D D0 77 39 F9 E6
       data hash MD5: 64K
       42 43 19 B0 5E E8 91 56 84 9D ED B8 3B C1 B1 C1>)
(   2,<2006-01-13 10:49:44.01 +000>,<MAYBRIDGE\nmr>,<NMR_250MHZ>,
      <Start of raw data processing
       ef LB = 0.3 FT_mod = 6 PKNL = 1 SI = 32K 
       data hash MD5: 32K
       B2 17 50 43 DE A5 B2 00 CF 25 9F E6 20 7D F8 D4>)
(   3,<2006-01-13 10:49:48.70 +000>,<MAYBRIDGE\nmr>,<NMR_250MHZ>,
      <apk 
       data hash MD5: 32K
       3A B3 A3 36 BD 27 2B 39 AB B7 C4 09 76 CB 18 D5>)
(   4,<2006-01-13 10:49:50.12 +000>,<MAYBRIDGE\nmr>,<NMR_250MHZ>,
      <abs ABSG = 5 
       data hash MD5: 32K
       91 08 55 66 26 0D 4F BC 16 93 97 64 C3 4F 7F E4>)
$$ ##END=
$$ 
$$ hash MD5
$$ AB B4 F1 FD 90 47 74 15 85 7B 07 1F 39 CD E1 34
##$RELAX= 
##$RELAX= 
##$RELAX= 
##$RELAX= 
##$RELAX= 
##$RELAX= 
##$RELAX= 
$$ Bruker specific parameters
$$ --------------------------
##$DU= <C:\u>
##$EXPNO= 14590
##$NAME= <ADRS>
##$PROCNO= 1
##$TYPE= <nmr>
##$USER= <dgb>
##$AMP= (0..31)
100 100 100 100 100 100 100 100 100 100 100 100 100 100 100 100 100 100 
100 100 100 100 100 100 100 100 100 100 100 100 100 100 
##$AQSEQ= 0
##$AQ_mod= 3
##$AUNM= <au_zg>
##$AUTOPOS= <59 >
##$BF1= 250.13
##$BF2= 250.13
##$BF3= 250.13
##$BF4= 250.13
##$BF5= 500.13
##$BF6= 500.13
##$BF7= 500.13
##$BF8= 500.13
##$BYTORDA= 1
##$CFDGTYP= 0
##$CFRGTYP= 5
##$CHEMSTR= <none>
##$CNST= (0..31)
1 1 145 1 1 1 1 1 1 1 1 1 1 1 1 1 1 1 1 1 1 1 1 1 1 1 1 1 1 1 1 1 
##$CPDPRG= <>
##$CPDPRG1= <>
##$CPDPRG2= <>
##$CPDPRG3= <>
##$CPDPRG4= <mlev>
##$CPDPRG5= <mlev>
##$CPDPRG6= <mlev>
##$CPDPRG7= <mlev>
##$CPDPRG8= <mlev>
##$CPDPRGB= <>
##$CPDPRGT= <>
##$D= (0..31)
0 1 0 0 0 0 0 0 0 0.06 0 0 0 0 0 0 0.0002 0 0 0 0 0 0 0 0 0 0 0 0 0 0 
0 
##$DATE= 1137149361
##$DBL= (0..7)
120 120 120 120 120 120 120 120 
##$DBP= (0..7)
150 150 150 150 150 150 150 150 
##$DBP07= 0
##$DBPNAM0= <>
##$DBPNAM1= <>
$$ [...]
##$SUBNAM6= <"">
##$SUBNAM7= <"">
##$SUBNAM8= <"">
##$SUBNAM9= <"">
##$SW= 20.6930455092707
##$SWIBOX= (0..15)
0 0 3 0 0 0 0 0 0 0 0 0 0 0 0 0 
##$SW_h= 5175.983436853
##$TD= 65536
##$TD0= 1
##$TE= 294.16
##$TE2= 300
##$TE3= 300
##$TEG= 300
##$TL= (0..7)
0 120 120 120 120 120 120 120 
##$TP= (0..7)
150 150 150 150 150 150 150 150 
##$TP07= 0
##$TPNAME0= <>
##$TPNAME1= <>
##$TPNAME2= <>
##$TPNAME3= <>
##$TPNAME4= <>
##$TPNAME5= <>
##$TPNAME6= <>
##$TPNAME7= <>
##$TPOAL= (0..7)
0.5 0.5 0.5 0.5 0.5 0.5 0.5 0.5 
##$TPOFFS= (0..7)
0 0 0 0 0 0 0 0 
##$TUNHIN= 0
##$TUNHOUT= 0
##$TUNXOUT= 0
##$USERA1= <user>
##$USERA2= <user>
##$USERA3= <user>
##$USERA4= <user>
##$USERA5= <user>
##$V9= 5
##$VALIST= <valist>
##$VCLIST= <CCCCCCCCCCCCCCC>
##$VD= 0
##$VDLIST= <DDDDDDDDDDDDDDD>
##$VPLIST= <PPPPPPPPPPPPPPP>
##$VTLIST= <TTTTTTTTTTTTTTT>
##$WBST= 1024
##$WBSW= 4
##$XGAIN= (0..3)
0 0 0 0 
##$XL= 0
##$YL= 0
##$YMAX_a= 597057
##$YMIN_a= -466414
##$ZGOPTNS= <>
##$ZL1= 120
##$ZL2= 120
##$ZL3= 120
##$ZL4= 120
##$ABSF1= 16.522
##$ABSF2= -4.171173
##$ABSG= 5
##$ABSL= 3
##$ALPHA= 0
##$AQORDER= 0
##$ASSFAC= 0
##$ASSFACI= 0
##$ASSFACX= 0
##$ASSWID= 0
##$AUNMP= <proc_1d>
##$AZFE= 0.1
##$AZFW= 0.1
##$BCFW= 0
##$BC_mod= 0
##$BYTORDP= 0
##$COROFFS= 0
##$CY= 12.5
##$DATMOD= 1
##$DC= 0
##$DFILT= <>
##$DTYPP= 0
##$F1P= 14.0000005364418
##$F2P= -0.99999901652339
##$FCOR= 0.5
##$FTSIZE= 32768
##$FT_mod= 6
##$GAMMA= 0
##$GB= 0
##$INTBC= 1
##$INTSCL= 1
##$ISEN= 128
##$LB= 0.3
##$LEV0= 0
##$LPBIN= 0
##$MAXI= 10000
##$MC2= 0
##$MEAN= 0
##$ME_mod= 0
##$MI= 0
##$NCOEF= 0
##$NC_proc= -2
##$NLEV= 6
##$NOISF1= 0
##$NOISF2= 0
##$NSP= 0
##$NTH_PI= 0
##$NZP= 0
##$OFFSET= 16.522
##$PC= 1
##$PHC0= 81.9228
##$PHC1= 6.12293
##$PH_mod= 1
##$PKNL= yes
##$PPARMOD= 0
##$PSCAL= 4
##$PSIGN= 0
##$REVERSE= no
##$SF= 250.13
##$SI= 32768
##$SIGF1= 0
##$SIGF2= 0
##$SINO= 400
##$SIOLD= 32768
##$SREGLST= <1H.CDCl3>
##$SSB= 0
##$STSI= 32768
##$STSR= 0
##$SW_p= 5175.98343685301
##$SYMM= 0
##$S_DEV= 0
##$TDeff= 65536
##$TDoff= 0
##$TI= <Analysis number 999999
Compound Code 99
Book Reference 9
Project Code 9>
##$TILT= no
##$TM1= 0
##$TM2= 0
##$TOPLEV= 0
##$USERP1= <user>
##$USERP2= <user>
##$USERP3= <user>
##$USERP4= <user>
##$USERP5= <user>
##$WDW= 1
##$XDIM= 32768
##$YMAX_p= 282581457
##$YMIN_p= -393684
$$ End of Bruker specific parameters
$$ ---------------------------------
##NTUPLES= NMR SPECTRUM
##VAR_NAME=  FREQUENCY,     SPECTRUM/REAL,   SPECTRUM/IMAG
##SYMBOL=    X,             R,               I
##VAR_TYPE=  INDEPENDENT,   DEPENDENT,       DEPENDENT
##VAR_FORM=  AFFN,          ASDF,            ASDF
##VAR_DIM=   32768,         32768,           32768
##UNITS=     HZ,            ARBITRARY UNITS, ARBITRARY UNITS
##FACTOR=    0.157963299565203, 1,           1
##FIRST=     4132.6476996994, 0,             0
##LAST=      -1043.33573715361, 0,           0
##MIN=       -1043.33573715361, -393684,     0
##MAX=       4132.6476996994, 282581457,     0
$$ Real data points
##PAGE= N=1
##DATA TABLE= (X++(R..R)), XYDATA
$$ [...]
18752F8863n981p239M940K7568J2903k2027n531j5271K372J1641j668o063k481
18739F2026O662K0052J1578l47N503K923j3278k0820k726P562k254R043q829O251
18725H3346N709r530n30p704l036O338M873J1886J3340J6228j0553j4776o225
18712H9366l403K616m749R369l26p516j1799o740K443J3904R474M706l402k641
18698I1302r929J436R136o997J61Q032m433k680m479r202J960K4455J4169k081
18684A10850j838M358K378P43l612K802r834p105M914J5427P218m042r95j1606
18670A09658j2544j283L745J5034L537K23N422q549o268N01J1916m003n675k145
18656A09569J2395J2568n380q844k059J7150K965o368q297j0365o134j1392J5593
$$ y = [68863, 62882, 55643, 60583, 88151, 101054, 79027, 73496, 58225, 60597, 72238, 70570, 64507, 62026, 68688, 88740, 100318, 99971, 105474, 108397, 95119, 74299, 71573, 79135, 76881, 85924, 77095, 83346, 89055, 79525, 78995, 71291, 68255, 74593, 79466, 91352, 104692, 120920, 110367, 95591, 89366, 85963, 88579, 83830, 93199, 92873, 85357, 73558, 66818, 69261, 83165, 92639, 97345, 93943, 91302, 81373, 82809, 91945, 84948, 85109, 93141, 88708, 86028, 81549, 72347, 74307, 98762, 112931, 110850, 109012, 113370, 115748, 116491, 112879, 115681, 105847, 98742, 103656, 119083, 126301, 122259, 121264, 109658, 97114, 95831, 99576, 114610, 118147, 118370, 123792, 115243, 108975, 109476, 121392, 117389, 111714, 109569, 121964, 134532, 129152, 120308, 118249, 135399, 138364, 131996, 123699, 113334, 107200, 95808, 111401]
18643A11401j472J869n90J2823K2487K421P126J1829o005P291L949j825M543p223
18629A68624j4373j2542J662j970k583n471n961r462k008K467K698K1932M238
18616A47251N43K358n433p746J4529L157J61P65O478k72M755K449j1614k844M979
18601A59516K977J1670J4147m812o084P21k0433j6775J2443M990K275k640n074
18588A52921q912P8M904P068M5j020N614j3051j87Q660J692j1826k070k283R8
18573A41731L497j0231K706q743J0814K1774L1206K9743l677j8487Q315O626m177
18560B11097j4468k150Rm520N267J8911K0762L742j569J372R0n087j4160o828
18546B12468q374j4701k14M595J445m901L189K5207L2726K6742K8954J1256J8473
$$ y = [111401, 109929, 111798, 111208, 124031, 146518, 148939, 156065, 167894, 161889, 169180, 173129, 171304, 175847, 168624, 154251, 141709, 143371, 141401, 138818, 133347, 127386, 117924, 115916, 118383, 121081, 143013, 147251, 147794, 150152, 144719, 136973, 151502, 154659, 154820, 155585, 162063, 161791, 166546, 168995, 157381, 154537, 159516, 162493, 174163, 188310, 183498, 177414, 178135, 157702, 140927, 153370, 158360, 160635, 157995, 152921, 144009, 144087, 148991, 156059, 156104, 155084, 160698, 147647, 147460, 156120, 157812, 145986, 143916, 141633, 141731, 145228, 134997, 137703, 128960, 139774, 161548, 192754, 222497, 218820, 200333, 208648, 215274, 211097, 196629, 194479, 194488, 189968, 195235, 214146, 234908, 238650, 237081, 238453, 238543, 233456, 219296, 212468, 204094, 189393, 189179, 193774, 195219, 190318, 193507, 218714, 251440, 278182, 307136, 318392, 336865]
18533C36865M159l359o056k411J4409j1770p93n172p1q88J0732J5481J3244K0296
18519C84666K5611m89j8461K950j1545j7746k0522O857L4528M827k729L3410L0409
18506D51766K2846N572j3374J089N078J9729L6227J8374J6441K0790J0343K9581
18494F24462N0344M6755N3717N4325P7131J09833J71289K14638K23568K08786
18484A834848K29323L46509O02522P12339K71171k41591o30871o48428m62874
18475B012948k48038r4759K5751J43983K70041L41693L66123L05556J57185J67344
18465C447827L98461P81598J062551Q23333l08306r79857j049932o23228k03761
18456C348686k3683j26045k07018j38048L3788K46200M91549N51369K15396j16757
$$ y = [336865, 341024, 337665, 331609, 329198, 343607, 331837, 331044, 325872, 325801, 324913, 335645, 351126, 364370, 384666, 410277, 409788, 391327, 394277, 382732, 364986, 344464, 351321, 385849, 390676, 387947, 421357, 451766, 474612, 480184, 466810, 467899, 472977, 492706, 528933, 547307, 563748, 584538, 594881, 624462, 674806, 721561, 775278, 829603, 906734, 1016567, 1187856, 1402494, 1626062, 1834848, 2064171, 2410680, 3013202, 3725541, 3996712, 3755121, 3124250, 2475822, 2012948, 1764910, 1670151, 1695902, 1839885, 2109926, 2451619, 2817742, 3123298, 3280483, 3447827, 3846288, 4627886, 5690437, 6513770, 6205464, 5225607, 4175675, 3552447, 3348686, 3325003, 3198958, 2991940, 2853892, 2887680, 3133880, 3625429, 4176798, 4392194, 4275437]
18446D275437j72006M7130L16296N44259P76569Q82226N46193M05568P55731R54488
18436I331891J10741n72895q31217p32949l38801K17978R90044J623941J314475
18427A1113208K25507n87203n83322k2N17466o26q78318j176423q46133k50291
18417G533843K91573Q00697J414820K337419L423633L917299K950049J384568
18409B4053901L52154p92616j490524k353041l097359k845931j973253q89742
18401A0963589O1719R70584J724074J813616J428198J289756J413187J073412
18393B0738135K76880J64226J105753K229130J985521J188645J384800K620693
18385C1693783M293813O701904Q350114P038170O918247Q295345O296338j296321
$$ y = [4275437, 4103431, 4150561, 4466857, 5011116, 5787685, 6669911, 7216104, 7621672, 8377403, 9331891, 9442632, 8869737, 8038520, 7305571, 6966770, 7184748, 8174792, 9798733, 11113208, 11338715, 10751512, 10168190, 10168168, 10685634, 10685008, 9806690, 8630267, 7784134, 7533843, 7825416, 8626113, 10040933, 12378352, 15801985, 19719284, 22669333, 24053901, 24406055, 23613439, 22122915, 19769874, 16672515, 13826584, 11853331, 10963589, 11025308, 11995892, 13719966, 15533582, 16961780, 18251536, 19664723, 20738135, 21015015, 21179241, 22284994, 24514124, 26499645, 27688290, 29073090, 31693783, 35987596, 42689500, 51039614, 58077784, 64996031, 73291376, 79587714, 78291393]
18377G8291393q973972j0620783q159280o688867o683041n821989l744633j198542
18369B6400286J227395L815705O392705O444932J636860l946313o706005n970481
18361B9295084l676466j373268O09497K618395N096023P980979R432113R241430
18353E9223787Q540684O650636O533167M256474k964006r183693j0431229q774029
18345E3851791q469157q017256o226444l207205n86485R6977j84978L98670N82386
18336B8238299j676297l298679l239855k292392j881701j766223j450656o94815
18328A1937681K71650P40485J00488n20357m09825K87936P94882O66270N76528
18319A4445738J40326q58543j300625r88773n6028J212670K622026L148958J175962
$$ y = [78291393, 69317421, 58696638, 50537358, 43848491, 37165450, 31343461, 27598828, 26400286, 27627681, 31443386, 37836091, 44281023, 45917883, 41971570, 35265565, 29295084, 25618618, 24245350, 24854847, 27473242, 32569265, 40550244, 49982357, 59223787, 67764471, 74415107, 80948274, 85204748, 82240742, 73057049, 62625820, 53851791, 45382634, 37365378, 31138934, 27931729, 27345244, 27442221, 27257243, 27655913, 28238299, 26562002, 23263323, 20023468, 17731076, 15849375, 14083152, 12632496, 11937681, 12209331, 12949816, 13050304, 12529947, 12120122, 12408058, 13202940, 13869210, 14445738, 14586064, 13727521, 12426896, 11438123, 11382095, 12594765, 15216791, 18365749, 19541711]
18310A9541711j096097j880568j188522r99535j567769j727272j265123l54818
18302I462007M80513P52988R09741J276374R68781l95097j211377j183975o16435
18293A0443520j7999m04854j340046j730968j487621r69601n46155k45616O8136
18284C768796M07767N30246J29118j59465j34220J56788M71071L29240k39479
18275E259862n44761o52272p12540o81471n68838m01869k24575q8680p2017n0451
18265A262388p1108o3681o6384o2750l4857k0762j9638l8440k8694k6298k0279
18254H09497l5628k2176j78j1061Q55L1739K9400K1599M022l9331p5450q2881
18242F30407n7345m3804q590O13m0228p3762q3780n3090n414J1509P696K6995
$$ y = [19541711, 18445614, 16565046, 15376524, 14376989, 12809220, 11081948, 9816825, 9462007, 9942520, 10695508, 11605249, 12881623, 13850404, 13455307, 12243930, 11059955, 10443520, 10425521, 10020667, 8680621, 6949653, 5462032, 4492431, 3946276, 3700660, 3768796, 4176563, 4706809, 4835927, 4676462, 4542242, 4699030, 5170101, 5499341, 5259862, 4715101, 4062829, 3350289, 2668818, 2099980, 1698111, 1473536, 1384856, 1312839, 1262388, 1191280, 1127599, 1061215, 998465, 963608, 942846, 923208, 884768, 856074, 829776, 809497, 773869, 751693, 751515, 740454, 741309, 773048, 802448, 824047, 828069, 788738, 713288, 630407, 573062, 529258, 520668, 521281, 481053, 407291, 323511, 270421, 265007, 276516, 284212, 311207]
18230C11207J3051R400J483R082K4809J686j3459l1570j5447m494o59p84m600
18217B99705j6098k4924k1481k5993j7791j8957l1804k0149L147J037N197j396
18205A30493k3030o944J2797M341K3055J4964j6683l3298k6813k1805j3242P086
18193E0921N952O155J2361J3336J6502J1098J0812O347K4739J5665K791j7617
18181A59062k4957k2917j3039j9846q894j2603L350J2837J0899n00j4382j2866
18169E6144K590q269k1843n624L441K2442K2119Q201N749L478j5459j4321P568
18156F6216J6246m396j0232j6313N920K2767R363R085Q61N919N54m350L817J3413
18142A18870J3796K3076J3742k670L737N024L826O511K2396L7247J8576M1493
$$ y = [311207, 324258, 333658, 335141, 344223, 369032, 370718, 357259, 325689, 310242, 305748, 305089, 304305, 299705, 283607, 258683, 237202, 211209, 193418, 174461, 142657, 122508, 125655, 126692, 131889, 130493, 107463, 100519, 113316, 117657, 140712, 155676, 138993, 105695, 78882, 57077, 43835, 50921, 56873, 63028, 75389, 88725, 105227, 116325, 127137, 133484, 158223, 173888, 176679, 159062, 134105, 111188, 98149, 78303, 69409, 56806, 60156, 72993, 83892, 83392, 69010, 56144, 58734, 50465, 28622, 22998, 26439, 48881, 71000, 79201, 84950, 88428, 72969, 58648, 66216, 82462, 78066, 67834, 51521, 57441, 80208, 89571, 98656, 99517, 105436, 105990, 101640, 105457, 118870, 132666, 155742, 169484, 166814, 170551, 175575, 179401, 185912, 208308, 245555, 264131, 305624]
18130C05624O0319L3984K4086K9375O9551O7088P0890Q8467J11629J37820J64585
18119A163418K03656K83921L55407M37236N65184Q36715J319937K185965L919011
18110A1270450P499432J0591810J828263o259287r038033o641719l611816j945546
18102C693554j101976o71394m49863l19868k19580j75039j37367j03961q1982
18093D32524o4713o6382l6280k2211j8605m1241l7569k2428k2100j0436j0920
18082G9639L121Q38q069k1562j6085O700R295p031j2790l033l847j2494l919o782
18068C981L783R504L576k444L950P53J9080p621j9199k3987k695J676o650J903
18054a4390r90Q229k736j1932k853k3523M321R979j121p200J2979N671N832r585
$$ y = [305624, 365943, 399927, 424013, 453388, 522939, 590027, 660917, 749384, 861013, 998833, 1163418, 1367074, 1650995, 2006402, 2443638, 3008822, 3845537, 5165474, 7351439, 11270450, 18769882, 29361692, 31189955, 24930668, 15892635, 9250916, 5639100, 3693554, 2591578, 1920184, 1470321, 1150453, 930873, 755834, 618467, 514506, 432524, 367811, 301429, 265149, 242938, 224333, 183092, 145523, 123095, 100995, 90559, 79639, 82760, 83598, 75529, 53967, 37882, 44582, 53877, 46846, 34056, 31023, 27176, 14682, 10763, 3981, 7764, 17268, 20844, 18400, 22350, 23103, 42183, 34562, 15363, -8624, -11319, -9643, -16293, -14390, -15380, -7151, -9887, -21819, -24672, -48195, -43874, -33895, -35016, -42216, -29237, -23566, -17734, -27319]
18040b7319r94l464J0380Q214J8512J953j1527m190p78N086M98K933k0684j2936
18026c4316l954J8153j963j6689p329J5259J4123j1972O653m121q479O476j2L364
18012b4807j962k399j801N4J0206j362j1899k790J740j3179J2875J3463n762L966
17998b3657r506j510q320P209J0246j3320j4293q011J0442P742J5646R346R475
17985h511m280m7J7229L938j6956l195m446j1823O200n185M465O335R104q151
17971a5323j5174J107l804k4576q791L143K0042K1722J3896J0275j265r514j679
17958i941j7405j2183J289J5128r098o721L2062J4486K761J6809J2640O223j1995
17945C4055q926J182J4762K3938J4174J726l3170k5147j1177j8822j4381O522
$$ y = [-27319, -28313, -31777, -21397, -13183, 5329, 7282, -4245, -8435, -9213, -4127, -3629, -696, -21380, -34316, -38270, -20117, -22080, -38769, -46098, -30839, -16716, -28688, -22035, -26156, -34635, -28159, -28171, -24807, -26769, -29168, -30969, -30915, -20709, -22071, -33970, -36760, -35020, -48199, -35324, -21861, -27623, -23657, -33163, -34673, -42993, -35784, -25538, -38858, -53151, -61162, -50720, -42978, -27332, -17986, -8511, -12791, -12838, 4391, 8329, -8627, -11822, -16268, -28091, -21891, -27076, -22611, -16276, -7172, -15323, -30497, -29390, -33194, -57770, -66561, -63418, -43376, -21654, -7758, 2517, 1252, -8262, -9941, -27346, -39529, -38240, -23112, -32210, -38931, -6869, 7617, 10378, 27187, 39827, 46050, 34055, 25129, 26311, 41073, 65011, 79185, 80911, 47741, 22594, 11417, -7405, -21786, -15264]
17933a5264L2045j784q870Q809l3N04J4184K3059l582N195J3044m14j3433r577
17919D3883k0179m776O063p334K124K4652K0059R936K1279K5186m588j3414j7695
17906H5196k1773j9073n841k766K456J9171J0486J8729j446O530j269j91O669
17893I6878J0658N638P224J3625J5635k501m140k2402k3917j9014J0076O104K2220
17880A16084j843k9495j7876k747p900q781J4209J4325Q380J875J6485o465j5874
17867H0377o370m542K086j3210k597J1553J3620K6283J8764L3312K5267K387q934
17854A77996j2192j8889O59j6842l499J0210K6444M2863L4635K9445L3425J2172
17842C16427k8402k2387j8585j2793j8701K855L077L63n800k0284l2595k5219
$$ y = [-15264, 16781, 14997, 6127, 14936, 14903, 15407, 29591, 52650, 49068, 54263, 67307, 66893, 53460, 43883, 23704, 18928, 24991, 17657, 19781, 44433, 64492, 74428, 95707, 120893, 116305, 102891, 85196, 63423, 44350, 38509, 35743, 38199, 57370, 67856, 86585, 85139, 91669, 90400, 90209, 96878, 107536, 113174, 120398, 134023, 149658, 147157, 143017, 120615, 96698, 77684, 87760, 93864, 116084, 114241, 84746, 66870, 64123, 56223, 47442, 61651, 75976, 84356, 86231, 102716, 96251, 80377, 74007, 69465, 71551, 58341, 55744, 67297, 80917, 107200, 125964, 159276, 184543, 186930, 177996, 165804, 146915, 147574, 130732, 127233, 137443, 163887, 206750, 241385, 270830, 304255, 316427, 288025, 265638, 247053, 234260, 215559, 218414, 221491, 221854, 216054, 195770, 163175, 137956]
17830A37956q994n610k4233p128q972j8014j5476O335J1055o648j1164j2223m365
17817C2519O093N334J5514K3948K6530j13k596p723j1661J0376J2081K3167J4621
17804A48090K528p321n532L804Q660n648p485N769j2310p662R120j212l7172j0326
17790H3303p154k060p321k3910k95Q422J2552O822J766O651j9220l997r265j7561
17776B8733k7502j5769j920J5893J1729j5099n252k899O386J0792l406k6337j4660
17763c9311J5651R691J2595J3646j155k3406j8964r86J394k826Q89R368M23L9
17749b2952p65J411l165M33P985o628k915J1576J1154J214j1369r437p089L057
17735b7490P157o0n56q148N148J1760n008l949P492m4K041l845K608p093j555
$$ y = [137956, 128962, 123352, 99119, 91991, 83019, 65005, 49529, 55864, 66919, 60271, 49107, 36884, 32519, 38612, 43946, 59460, 83408, 109938, 109825, 107229, 99506, 87845, 98221, 110302, 133469, 148090, 150618, 143297, 137765, 141569, 150229, 144581, 137096, 142865, 130555, 122893, 132013, 130801, 93629, 83303, 76149, 74089, 66768, 42858, 42563, 50985, 63537, 70359, 72125, 78776, 59556, 55559, 46294, 28733, 1231, -14538, -16458, -565, 11164, -3935, -9187, -12086, -5700, 5092, 1686, -24651, -39311, -23660, -13969, -1374, 12272, 11117, -12289, -31253, -32239, -30845, -33671, -32782, -23414, -22991, -22952, -23717, -22306, -25471, -25038, -17053, -23681, -26596, -15020, -3866, -2652, -14021, -23458, -30547, -27490, -20333, -20393, -20949, -29097, -23949, -12189, -17197, -21146, -13654, -13698, -11657, -15502, -12894, -19987, -21542]
17720b1542J4472p495O38J1732M443k0375l923P759N931j293J0270L270o658m358
17706g129p624j4600n69J2353P413j424m305R139m777k1068j0487K1632J1075
17693a0371J448p072k84j004J515p554p33O663J1211j2331L10J7690k619j930
17679e061Q812k0456J2157L315q040P316J171j0229O334K1598j4532j9643M687
17666a2571k810n625j2131o318J406J216N252J5372O743k248M213J2558l527j8201
17652a6671m499k047J1269R514m717J7761J747m046j0206O021p684k2641j174
17639b7373J2290n772o49J0381m7n516o295k953N690J577K2772P947p695o105
17625a748j1257O218J1188p011n577K664m209k692l142K704P281j1802j3115p634
$$ y = [-21542, -7070, -14565, -13927, -2195, 2248, -18127, -22050, -14291, -8360, -9653, 617, 3887, -2771, -7129, -14753, -29353, -29922, -17569, -10156, -11580, -15885, -6746, -11523, -32591, -43078, -21446, -10371, -8923, -15995, -16279, -17283, -15768, -23322, -24055, -17392, -6181, -18512, -18202, -512, -3131, -5061, 3751, -16705, -4548, -1233, -9273, -1957, -786, -11015, -4681, 16917, 2385, -17258, -12571, -15381, -21006, -33137, -39455, -38049, -36833, -31581, -16209, -9466, -11714, -7501, 5057, 1530, -16671, -21170, -23217, -11948, -2434, -7151, 10610, 12357, 8311, -1895, 4126, -3558, -26199, -27373, -15083, -20855, -21504, -11123, -11170, -16686, -22981, -25934, -20244, -18667, 4105, 12052, 4357, -1748, -13005, -6787, 4401, -2610, -8187, -5523, -9732, -12424, -15566, -12862, -5581, -17383, -30498, -38132]
17611c8132M765K0291J1399j0697j9772J566J0088r233M040J4464j0681j736O692
17598a6946J4361r151j2209p547j6730L788J2203J3146J5750N919L419n667N81
17585I17k536n339R713j385r56j8238o775o588Q40J0475J938l493j4596l049Q489
17570c0583J4626L408n337J0964J986m361j934p531q115p017O979O566K3908L1089
17556C4648K5517J7369K1305o302l7407j6757m993m603j4203j9622o74M019j2594
17543a4297k196o463n790j016o806J909J8908O147j463R308J1193m354n584l933
17529d437j870l413J647l028O84J536n978r401J8628J2156K937L346K387j6785
17515a591j3801j6309P05J1017J698L660K719o605J2985J738j4032R216J140M936
$$ y = [-38132, -33367, -13076, -1677, -12374, -32146, -30580, -20492, -29725, -25685, -11221, -21902, -23638, -16946, -2585, -11736, -23945, -31492, -48222, -44434, -32231, -19085, -3335, 2584, 6003, 336, 917, -1619, -6958, 2755, 1370, 414, -17824, -24599, -31187, -30347, -19872, -17934, -21427, -36023, -39072, -30583, -15957, -12549, -17886, -6922, -4936, -9297, -11231, -18762, -26877, -33894, -26915, -20349, 3559, 34648, 60165, 77534, 98839, 92537, 55130, 38373, 33380, 28777, 14574, -5048, -5722, -1703, -14297, -16493, -22956, -28746, -29762, -36568, -34659, -15751, -9604, -11067, -1759, 9434, 5080, -504, -4437, -6307, -9720, -8073, -11101, -10417, -8881, -14859, -24260, -5632, 6524, 9461, 12807, 15194, -1591, -15392, -31701, -30996, -19979, -18281, -14621, -11902, -18507, -5522, -3784, -17816, -8600, -7460, -2524]
17501b524J6796l184p665J696j2741o770Q160N663J359J2420k441J2978l090j3207
17487G450j0710R881J2976N710N838j6161j6240j5309j2112p502J2575M713j992
17474b0883j0031K837M970P315J2220O040J9010n502l3070l87Q636k937j0873
17461b2655o855p11J337J341J1908n402q230P732M992J2368J2161l470j980L931
17447F467N038Q090K5475K3652L3978K6840r480k0705l9381l0974l1286j3733
17435a6019J2585K434j8320N423K662L679l804K626R011o765Q594k976n177q791
17421a4838J3426N309p915j2975j9355O775M837j275K786M497P898q842l954J0562
17407a3064Q982k7605Q777J4050R639k311p666R252j389j764R847M260n669j1636
$$ y = [-2524, 14272, 11088, 3423, 5119, -7622, -14392, -6232, -569, 790, 13210, 10769, 23747, 20657, 7450, -3260, 6621, 19597, 25307, 31145, 14984, -1256, -16565, -28677, -36179, -23604, -18891, -20883, -30914, -28077, -23107, -15792, -3572, 2468, 21478, 15976, -17094, -17481, -8845, -11782, -22655, -29510, -30221, -28884, -27543, -15635, -21037, -29267, -21535, -16543, -4175, 7986, 4516, 2536, 6467, 11505, 19595, 45070, 68722, 102700, 129540, 120060, 99355, 59974, 29000, -2286, -16019, -3434, -1000, -19320, -13897, -11235, -7556, -11360, -8734, 277, -6488, 2106, -870, -6047, -14838, -1412, 3897, -4018, -16993, -36348, -29573, -24736, -26011, -23225, -18728, -10830, -19672, -23626, -13064, -4082, -31687, -22910, -8860, 779, -1532, -9198, 54, -1335, -3099, 6748, 11008, 5339, -6297]
17393f297o782q092J6023J3248r877n118n423k0915N086O664N658r772P433J2543
17379e621r216m168Q483l68O017m495m769L29j8248r46J9837N96M49J503O785
17364c832k793j5561l845p953L366o090P150J4152O759m073l421L163N944J7360
17350A0326m660j1643m841J240R772P235m553j0658q741M480J5190p440o853l33
17336a1479N522l27J4026n074k1613j2357O852K927q373Q719J7447M951R82Q615
17322A0818j0384k1924M45P069J1805J0708l083Q270r041j4582N93j1038K024
17309a8320J951J1887M630O486J11j7484P94j0916K828K6019K768j6119j9008
17296b4373L139J4492R544j0945K480P577j0270m989O552M146L597r457R453M608
$$ y = [-6297, -13079, -21171, -5148, 8100, -1777, -6895, -12318, -33233, -28147, -21483, -15825, -25597, -18164, -5621, -14837, -19005, -10522, -10890, -4873, -9368, -14137, -13808, -32056, -33002, -13165, -12569, -12120, -10617, -3832, -6625, -22186, -26031, -33984, -30618, -36708, -29558, -15406, -8647, -12720, -16141, -12978, -7034, 10326, 5666, -5977, -10818, -9578, 194, 7429, 2876, -7782, -16523, -12043, 3147, -4293, -11146, -11479, -5957, -6284, 7742, 2668, -18945, -31302, -24450, -21523, -29896, -21177, -3730, 1221, 2203, 10818, 434, -21490, -21045, -13976, -2171, 8537, 5454, 13724, 4683, -9899, -9306, -20344, -18320, -16369, -4482, 148, 6634, 6745, -10739, -9945, -20861, -18033, 7986, 10754, -5365, -24373, -21234, -6742, 2802, -8143, -5663, 1914, -8356, -13345, -6793, -2647, 950, -8507, 946, 5554]
17282E554M960Q83r10j134o215j7379p368p847J8902Q17M965K582K978R9P133
17267H020J030j2012q869j3659l613j1651L831P952M796j0726J899J2453J1954
17254h595K1827j450K521j2692j376O826p231q344j868K742p41N751K713J424
17240A507M558Q251O75l074m685j539l839J02o592j0762R011J6952j2872j8184
17226b0491q728K1131j5223k505J8794Q840L624o072m48l755l52j079p583n455
17212a9302r312m461R632k582O065J0839N281n320m163J0044K963J61j4131j6305
17198c0591j612K3871R896n493k0002j7070J3178J1975M040m33p302j281k180
17185b3004J1210o338J981J3843o235o182J2248q428j9623P666M0018J2340o541
$$ y = [5554, 10514, 11397, 10487, 9353, 3138, -14241, -21609, -29456, -10554, -9737, -4772, -2190, 788, 887, 8020, 9050, -2962, -11831, -25490, -29103, -40754, -36923, -28971, -24175, -34901, -33002, -20549, -8595, 13232, 11782, 14303, 1611, 235, 7061, -170, -8514, -10382, -7640, -8381, -2630, 83, 1507, 6065, 14316, 14991, 11917, 7232, 5693, 1854, 1956, -4636, -15398, -6387, 10565, -2307, -20491, -29219, -8088, -23311, -25816, -7022, 1818, 5442, -630, -1078, -4833, -5185, -6264, -13847, -19302, -28614, -33075, -23443, -26025, -19960, -9121, -3840, -9160, -13323, -3279, -316, -155, -14286, -30591, -32203, -8332, 1564, -3929, -23931, -41001, -27823, -15848, -11808, -12241, -19543, -20824, -23004, -11794, -18132, -16151, -2308, -8543, -14725, -2477, -10905, -30528, -22862, 17156, 29496, 22955]
17172B2955j3436j1086n771k32J0646M333J1423o398m591Q321O581L535L623N666
17158C5569J8049N952N090J1478M0507O4524O1781N1662M9238M5850r354m9688
17146C30658p0208o4401o9188n7668n0335k4183M564K2541P841j1091j4196J0977
17134A5311Q69m390l08j4332k3205O70R429p649n336J9523K0224Q465j78j1082
17120H011m856k121L314n163j1523Q09J251p08J9373P503o374j8166j8022O049
17106b0623P151R716j59j1029R13L515J0324J3631m175p077j7526j5230r243J5286
17092b4526J5484L662m682k1675M62J9776M211J910l191J25R788p692P733j0049
17078h664k425k209m165Q42R069o99o139l189o177j3621j35L610J1799J8329J2202
$$ y = [22955, 9519, -1567, -7338, -7570, 3076, 7409, 18832, 12434, 7843, 16164, 22745, 26280, 29903, 35569, 53618, 59570, 64660, 76138, 116645, 181169, 242950, 294612, 343850, 389700, 380346, 330658, 260450, 196049, 126861, 69193, 18858, -5325, -761, 21780, 29621, 18530, 4334, 15311, 16180, 11790, 11482, -2850, -26055, -25385, -15956, -23605, -28941, -9418, 10806, 19271, 19093, 8011, 3155, 1034, 4348, -815, -12338, -11529, -10278, -10986, 8387, 15890, 9516, -8650, -26672, -20623, -13472, -3756, -3915, -14944, -14031, -10516, -192, 13439, 9264, 2187, -15339, -30569, -39812, -24526, -9042, -5380, -10062, -31737, -31275, -11499, -7288, -5378, -8569, -8444, 1344, -6348, 1385, -8664, -11089, -13298, -17463, -16621, -7552, -8251, -14390, -17579, -23756, -37377, -37512, -33902, -22103, -3774, 8428]
17063H428l086R64k420r104m944P212J2816m942n937O026K0134N141k464m581
17049B3243p703J1084l358j1449n279l57n074j945k476J3237J5238P410p980j7437
17035G154q243J4839R462O301K576q201j45N749j057m243k3644Q144J9293j806
17021B6179q54q830j0170J360j8277j1399R73q294j107P292J4344l184J2982J4365
17007A5380L154N013r052r780J875Q14O567P332L28p060j3960O085k186N156j2077
16992b411J34J8305K49L993L141L072n193j1983q3O774j851O430o340j6699Q03
16977a659J0139Q482P925l349o132l439J0822L028k108j8067o965J647Q027j286
16963G065j0319p847J6175J393j1747Q006N951p47n544J686q878K37r052n940
$$ y = [8428, 5342, 6306, 3886, -5218, -10162, -2950, 9866, 4924, -1013, 5013, 25147, 30288, 27824, 23243, 15540, 26624, 23266, 11817, 6538, 6181, 1107, -838, -3314, 9923, 25161, 32571, 24591, 7154, -1089, 13750, 23212, 29513, 32089, 23888, 23743, 29492, 28435, 24192, 548, 8692, 27985, 26179, 25325, 16495, 6325, 7685, -10592, -21991, -21018, -29312, -30419, -23127, -8783, -11967, 1015, 15380, 18534, 23547, 14495, 4715, 6590, 7404, 13971, 21303, 21631, 14571, 611, 6696, 4510, 9666, -2411, -2277, 16028, 16277, 20270, 23411, 26483, 21290, 9307, 9224, 15998, 14147, 20577, 14237, -2462, -1659, 8480, 16962, 24887, 21538, 15406, 11967, 22789, 25817, 23709, 5642, -1323, 324, 8351, 7065, -3254, -11101, 5074, 6467, -5280, 2726, 8677, 7930, 2386, 4072, -4806, -4569, -13621, -19561]
16949a9561O446O607K066L385J1870m630L66k269R196K4294J7401j583j046q812
16935D3730q260j8039q385J105o732j6928r012M550J2358K1998K2089n86j7609
16922B0279k0370l27J6017R176J625J2681O759q868l413m342n155j1601n295J1513
16908A8679R327Q155q162J29j1826j2514P640m969R679r684n459J2708J2314k672
16894B3345N218l077M71O854k669m296q511J997K353K842n650o511L607j2735
16880C238m217o186m583J864l634j1818O623r40o115J5067J3456m924N148p245
16866d266q71J2284J3597M676r105j6377J8648M755K234Q717P619O455j0552m145
16852C3669P176K196O421K243Q612N488q838j1452p449l654k0781n467l931p606
$$ y = [-19561, -13115, -6508, -4442, -1057, 10813, 6183, 6549, 4280, 13476, 37770, 55171, 53588, 52542, 43730, 35470, 17431, 9046, 10151, 3419, -13509, -22521, -17971, -5613, 16385, 38474, 37888, 20279, -91, -418, 15599, 24775, 26400, 39081, 45840, 36972, 33559, 29217, 24062, 12461, 7166, 18679, 28006, 36161, 27999, 28128, 16302, 3788, 11428, 6459, 16138, 6454, 995, 13703, 26017, 23345, 28563, 25486, 25957, 32811, 30142, 25846, 17335, 19332, 21685, 24527, 18877, 12366, 15973, 3238, -979, -7165, -11748, -9884, -13518, -25336, -18713, -19653, -25768, -10701, 2755, -2169, 2979, -4266, -5137, 7147, 20744, 25420, 16315, -62, 18586, 23341, 25575, 34292, 41911, 48366, 37814, 33669, 40845, 43041, 49462, 51705, 60317, 65805, 56967, 45515, 38066, 34412, 13631, 8164, 4233, -3373]
16838c373k679o0J1298J5494j2920L409P034J819J34j3288L312N96j2129P023
16824E670Q38J379j704l75L835m896k944j5073O489k635J2158l229j4269O752
16810h004J1985L654J3397J625L174K981L67J689k536n109L326J4775m050Q956
16796D6230J4010j5035j3631j8925j8862j7598P77J8709L180J5199K2246N745
16784D2045o304p002K353J5105L085q340k0241r057K961J4082J3495n097j4584
16771B2501K511J4215j169J252J886k1577j8970R720J4j225P590k51o81K4616
16757D0432L2486j089Q85K1910L0442K3931Q372j9132l0952k8583j9071O097n559
16744F0169j0029m99J596o437K560J3012O196q784J564P488O377p375r817P114
$$ y = [-3373, -6052, -6112, 5186, 20680, 7760, 11169, 18203, 20022, 20156, 6868, 10180, 10776, -1353, 5670, 6508, 7887, 6183, 5808, 9643, 4747, 1803, -13270, -6781, -9416, 2742, -487, -14756, -8004, 3981, 7635, 21032, 22657, 25831, 28812, 29179, 30868, 28332, 23223, 26549, 41324, 37274, 46230, 60240, 45205, 31574, 12649, -6213, -23811, -23034, -4325, -1145, 14054, 36300, 42045, 35741, 28739, 31092, 46197, 49282, 40942, 20701, 11644, 14605, 28687, 42182, 37085, 22501, 25012, 39227, 38058, 39310, 41196, 19619, 649, 10369, 10383, 9158, 16748, 16497, 15816, 40432, 72918, 71829, 72714, 94624, 125066, 148997, 157369, 138237, 107285, 78702, 59631, 65728, 60169, 50140, 49641, 51237, 44800, 47360, 60372, 66568, 57784, 59348, 66836, 73213, 65838, 56021, 63135]
16730F3135J290p571p452j6178j3797j1998j9115j5463n987N814J4361j715P650
16717g026M104J6999J8003M141N371J0021o723L2p05j24l240N332J114P930K5195
16702H0424J2034p046j4311o94J6808J7212J503m210k522j1723p212J654N878
16689H7795j2197O064M152L86p279J5189J4449R86m282Q299J2905J6357K120J66
16675A45110J4165K188o064L538Q989L156K1304K6204N895P850K9902N1662M5946
16662C59845P4542R4381P9195M2551j7152o7219p4970p5312n0519l4894l7041
16651B93407j8564O197J8634R706M412Q851J2767J5215K1032J7462L4689M8742
16639D72550O0553O9664P2161R8897J43859J77662J87436K47280K62452K45339
$$ y = [63135, 64425, 56854, 49402, 33224, 19427, 7429, -11686, -27149, -33136, -27322, -12961, -14676, -7026, -2922, 14077, 32080, 36221, 41592, 51613, 44890, 44922, 44217, 44093, 40853, 46185, 47299, 55229, 80424, 92458, 85412, 71101, 70407, 87215, 104427, 105930, 101720, 99198, 87475, 80263, 81917, 87795, 75598, 81662, 85814, 86200, 78921, 94110, 108559, 109545, 105263, 113562, 126467, 142824, 144944, 145110, 159275, 161463, 155399, 158937, 167926, 171082, 192386, 218590, 224485, 232335, 262237, 313899, 359845, 434387, 528768, 607963, 650514, 633362, 566143, 491173, 415861, 365342, 330448, 293407, 274843, 281040, 299674, 309380, 313792, 322643, 335410, 350625, 371657, 389119, 423808, 472550, 533103, 602767, 674928, 773825, 917684, 1095346, 1282782, 1530062, 1792514, 2037853]
16629B037853J57291k491j09176j55143j11221m1506J4089P3970Q9505P1815Q3133
16618B108119J11101J52297K29077L27111M22750N04259N56308N50991N45108
16609E507121N60754O78137R54196J391249K035054L120567M919308P804894J1265092
16600C8236372J2787866J2557755J0558157J827798o522835j1586824j3887612
16593D3970677j2903570j0160911o807097m217407k644414j720800j134603p81021
16585C600854n68274m00684k60812j80368j36563j68144j96678j88570j94886
16576A305875j64992j30471n7912p380l196o391n5039r2565j07361j03679q4999
16565D91890o7679o0189m2317l6351l3046k48r244k3404k0938J2204M261j9628
$$ y = [2037853, 2195144, 2192653, 2083477, 1928334, 1817113, 1775607, 1789696, 1863666, 1953171, 2024986, 2108119, 2219220, 2371517, 2600594, 2927705, 3350455, 3854714, 4411022, 4962013, 5507121, 6067875, 6746012, 7700208, 9091457, 11126511, 14247078, 19166386, 26971280, 38236372, 51024238, 63581993, 74140150, 75967948, 69445113, 57858289, 43970677, 31067107, 20906196, 14099099, 9881692, 7237278, 5516478, 4381875, 3600854, 3032580, 2631896, 2371084, 2190716, 2054153, 1886009, 1689331, 1500761, 1305875, 1140883, 1010412, 952500, 945120, 941924, 935533, 880494, 787929, 680568, 576889, 491890, 424211, 364022, 321705, 285354, 252308, 252060, 242816, 219412, 198474, 210678, 214939, 195311]
16553A95311l095p950k294j0237j2237k4616k3008n902j2481k9118j622J4971
16541G7722N968j367q010k1403k2957n728R265j328q285m0r98j0913M217J2672
16527B8815J1453J953j0520j0333q452j5578p092J0256Q407k4292p118J8744m602
16514h359j1374O980Q845L170J1895O668j4521j343Q991p481m767o543L19J9810
16500A2290j0299j2027J271J473L261k235K059m69P80J6908L922p205j0523q265
16486i059K744l153l407M370K967J999n580n066j585J4232J6893J1618J5699J3720
16472E6392J9236K177p641k2027j9047j4126j9417L421n178j2086Q700J7124q640
16459a112l2708j6151J0488n593P141J2080m647m113j1521p083m585m797r413
$$ y = [195311, 192216, 184266, 181972, 171735, 159498, 134882, 111874, 105972, 93491, 64373, 62751, 77722, 83690, 82323, 74313, 52910, 29953, 24225, 33490, 32162, 23877, 23837, 22839, 11926, 16143, 28815, 40268, 42221, 31701, 21368, 12916, -2662, -9754, 502, 8909, -15383, -22501, -3757, -8359, -19733, -12753, -3908, -738, 11157, 17825, 3304, 1961, 10952, 3471, -1296, -7839, -7520, 12290, 1991, -10036, -8765, -7292, -4031, -6266, -4207, -4676, -3896, 13012, 16934, 9729, -794, -9059, -6315, -9468, -12875, -8505, -5538, -3539, -9119, -14185, -15770, -1538, 15355, 26973, 42672, 56392, 75628, 77805, 70164, 48137, 29090, 14964, -4453, -1032, -6210, -18296, -9596, 7528, -1112, -33820, -49971, -39483, -45076, -37935, -25855, -30502, -34615, -46136, -53219, -57804, -62601, -72014]
16446g2014j0988k4289j9341p962K2619L7125K0828J2495J5698R341J1441J5954
16434A0907Q098q818k70n173L676n697j9173j722L163J3496J1643n691j0046p142
16420a2749m319j1430r078P942J327O674J691p661J06J3982J4338P367J3857p286
16406A4761N173j027p528j4871n241J2547k80j4321L019R084O340r606j5287p850
16392b5087N370m55k116l460K595K2327J2110K462n229j2128p901l352J380k711
16378a6195J2587N082J8848Q828l663L587j6605j0968O366N311l9m422l854k924
16364A939M243J0480j0410o584o006p826L21K492k588m826J1177J8986L269j568
16350A3099l344Q517l886k9110j238J1811k665o906q714p369r576L12K1827J0664
$$ y = [-72014, -83002, -107291, -126632, -134594, -111975, -74850, -54022, -41527, -25829, -16488, -5047, 10907, 19005, 10187, 9917, 4744, 8420, 2723, -16450, -18172, -15009, -1513, 10130, 4439, -5607, -12749, -17068, -28498, -37576, -29634, -28307, -21633, -19942, -27603, -27497, -13515, 823, 8190, 22047, 14761, 19934, 18907, 11379, -3492, -8733, 3814, 3534, -10787, -7768, 1316, 7656, -1950, -17237, -25087, -19717, -20172, -22288, -25748, -23153, -826, 11284, 13746, 8517, -3611, -11512, -14864, -13484, -16195, -3608, 1474, 20322, 29150, 25487, 29074, 12469, 1501, 7867, 13178, 13139, 8717, 4863, 1939, 6182, 16662, 6252, -332, -6338, -14164, -13843, -11351, -13939, -18765, -7588, 11398, 14667, 13099, 9755, 18272, 14386, -14724, -15962, -4151, -6816, -13722, -22436, -29805, -39381, -39069, -17242, -6578]
16336f578j383K685P922j262R356L19m687q660p0j65p531r716l908J1971Q998
16321b709J934m168r092K282J9781M945j2623j5200j0419n217L847N089J0231
16308a1319K692O331r114k2998m706M314O674J3638O790m486j0998j5298k237
16295d0717M140K813K402L396J7030q920M173Q382J942P351j400O615N936o520
16281F623m41j1133J6109K3773j854j4972j6931M802j990o554j5361m414M582
16268a7761Q217P731J27Q433j6696j122j0295m51M948J3485Q878m690k041L225
16254A988K286j4196k1861M702L902j533Q54K201J6529k108N64K673j4498j8997
16240c7494J3851K8803J702j549O618j1169k1173p222r866k586Q295J9768M674
$$ y = [-6578, -7961, -5276, 2646, 1384, 10740, 11059, 6372, -2288, -2358, -2523, -10054, -19770, -23678, -11707, -2709, -775, -4943, -14035, -11753, 8028, 12973, 350, -14850, -25269, -30486, -26639, -21550, -11319, -8627, -2296, -11410, -34408, -39114, -34800, -28126, -14488, -7698, -12184, -23182, -38480, -40717, -36577, -33764, -31362, -27966, -10936, -19856, -15683, -7301, -5359, 1992, 592, 7207, 13143, 6623, 6182, -4951, 11158, 34931, 33077, 18105, 1174, 5976, 3986, -2568, -17929, -22343, -17761, -9544, -1813, -1686, 6747, -9949, -11071, -21366, -21817, -16869, -3384, 5494, 804, -1237, 1988, 4274, -9922, -31783, -27081, -23179, -24712, -23858, -21657, -5128, -7236, -6672, -3999, -18497, -37494, -23643, 5160, 6862, 5313, 11931, 762, -20411, -27633, -37499, -40085, -31790, -12022, -7348]
16227g348J1590J4116m782j6349p166j0473Q066o143L602k7j777j8407l534K5677
16213a2955O071K5815J774k0284j0439m187j6119q03k780j2010O98J5629J8081
16200a1509R477l357j98o990l733J001N011J5692r849j2022j5617P013J333l016
16186b6764O903l290Q437P732o23J431p225j3892O676j0493K604J1436J271n179
16172b0976K114j179Q379p298l996Q897J1785P214K683m843j2067j4855q028J0492
16158b1678l413J0593o202o793m201J819J0921l352q048O102M680L383N196J069
16144i924q149L414K2286j2298j7525j2754P938J2339M470m294j807l867J663
16131a8508M619p0P517J0971L955J4147r22L990L006M958r65q233o371O125N168
$$ y = [-7348, 4242, 18358, 13576, -2773, -9939, -20412, -12346, -18489, -14887, -14914, -16691, -35098, -38632, -12955, -6884, 18931, 20705, 421, -10018, -14205, -30324, -31127, -33907, -45917, -45219, -29590, -11509, -2032, -5389, -5587, -12577, -16310, -15309, -10298, 5394, -4455, -16477, -32094, -25081, -23748, -26764, -19861, -23151, -14714, -6982, -7605, -6174, -13399, -27291, -20615, -31108, -28504, -17068, -15797, -20976, -18862, -20041, -11662, -18960, -22956, -14059, -2274, 4940, 7623, 2780, -9287, -24142, -32170, -21678, -25091, -14498, -20700, -27493, -31694, -29875, -18954, -22306, -30354, -24252, -19572, -16189, -10993, -9924, -18073, -14659, 7627, -4671, -22196, -34950, -27012, -14673, -10203, -14497, -16304, -20171, -18508, -13889, -13959, -6442, 4529, 8484, 22631, 21709, 25699, 28705, 33663, 32698, 24465, 18094, 24219, 29387]
16116B9387K530j5264J79L424p3m195r631j9323q231L141O461N705O076j1053
16102a0867q914l801J7557J3024J4074j0126o57K785j0587k0147K675J01n343
16089b0226Q298J3441J6245j0494r444r268O182O764J536j9876j4950P209J7232
16076g351R505J4867j779Q430j307j1001O713l908k209p2N043R932j2121M400
16062A9142N254j0028j5023o850J2221K3503Q695J812j3980L345L797l726J1462
16049C9624J0221J2620J4838K1023M4827L2160N1473O1086N7582K8831L952m4941
16037C33296n5557n5389n8989n4726l7776k4849j8162L284n035q813j3162J4007
16025A8129J6154J3305m773r913J0662L264K437K936p001j4398q794P059Q470
$$ y = [29387, 31917, 16653, 16832, 20256, 20183, 15988, 6357, -12966, -21197, -18056, -11595, -5890, 186, -10867, -19781, -23582, -6025, 6999, 21073, 10947, 10290, 13075, 2488, -17659, -14984, -14883, -20226, -11928, 1513, 17758, 7264, -2180, -11448, -5266, 1498, 3034, -16842, -31792, -24583, -7351, 2154, 17021, 15242, 23672, 22365, 11364, 18077, 14169, 11960, 11888, 16931, 26863, 14742, 19142, 24396, 14368, -655, -7505, 4716, 28219, 36914, 38726, 24746, 28091, 31888, 28162, 39624, 49845, 62465, 77303, 98326, 143153, 175313, 226786, 287872, 345454, 374285, 378237, 333296, 277739, 222350, 163361, 108635, 70859, 46010, 27848, 31132, 26097, 17284, 4122, 18129, 34283, 47588, 42815, 32902, 43564, 46828, 49265, 52201, 45200, 30802, 22008, 29067, 37537]
16012C7537j876j1856Q438J933o653L549J158k35j4703n152J3336J4205J1502
15999E1183R476k0300j0430J0767P208L769m332m834M767l722j2030N106O325
15986D2953R915k048J2348j352m331k362r186P764J6063N255N099o967N226j2733
15972F5644j9083o252j0460j8465O951K0806J1787j7770n930P018O359k889k1162
15959A6554J6067J2021j2143k5789j4371K263O597J3728P61O249N211k931r051
15946A5166M600o625K671J761N954J824p325j7933j3751j438J4504L569J612J3083
15932A7672J2608q209o91M771l86o082q240J292Q131o152k1020j0964Q179J4918
15918E827N696K0188K773K522n097P818j3523j3482k176j7122m09R956j340J81
$$ y = [37537, 35661, 23805, 32243, 34176, 27523, 31072, 32230, 31995, 17292, 12140, 25476, 39681, 51183, 60659, 40359, 29929, 40696, 47904, 51673, 47341, 42507, 47274, 43552, 31522, 36628, 42953, 52868, 50820, 63168, 61816, 57485, 55123, 45937, 53701, 69764, 75019, 80118, 73151, 78377, 65644, 46561, 40309, 29849, 11384, 18335, 39141, 50928, 33158, 27228, 34246, 40605, 37716, 16554, 32621, 44642, 32499, 6710, -7661, -5398, 1199, 14927, 15688, 21937, 27148, 24217, 15166, 19766, 13141, 15812, 17573, 23527, 25351, 18026, 93, -13658, -15096, -592, 2977, 4589, 17672, 30280, 22071, 21380, 26151, 25765, 19683, 11443, 12735, 20866, 14714, -6306, -17270, -9091, 5827, 11523, 31711, 34484, 37006, 31909, 39727, 26204, 12722, 10546, -6576, -6985, 2971, 1631, 1812]
15904A812q529m025Q231J9382M11R53p536k1774r550o663M507O234J877p198J774
15889b0094J4880J4838j1283j5009m609J424R016R769R315J3081m050m905j4229
15876a856q452J1527J8166r49p838r517j7629n077J3862J5246J0450K68j3879
15863D322q807O335J4183K870k2013j2613n840P948N240K190L69j0808m773J5075
15849f322J5045J124J6388J5237k865r989k3730n15p681n625P980p498j1383l563
15835b3397l41J9783P131p126j603r64k204J890R56K868K43j441r689Q166J6303
15820A0575n553j5463j1933O384Q475q158l423J025J3491J1042o243r197J3496
15807D518R961k4083j3223J3024j3147q233k289J2370K721K322J5510j0754j8195
$$ y = [1812, -6717, -10742, -2511, 16871, 17282, 18235, 10699, -11075, -20625, -27288, -22781, -16547, -14670, -21868, -20094, -5214, 9624, -1659, -16668, -21277, -19853, -10837, -1068, 8247, 21328, 17278, 12373, -1856, -10308, 1219, 19385, 18436, 10598, 1081, -16548, -21625, -7763, 7483, 17933, 18201, 4322, -4485, 1850, 16033, 18903, -3110, -15723, -21563, -13615, -8375, -6185, -5816, -16624, -21397, -6322, 8723, 9847, 26235, 41472, 38607, 28618, 4888, 4373, -3308, -8933, -953, -8451, -19834, -23397, -23738, -3955, 3176, -3950, -5553, -6517, -8721, -6831, -5875, -3007, -2764, -4205, -13894, -5728, 10575, 5022, -10441, -22374, -15990, -7515, -15673, -19096, -18071, -4580, 6462, 219, -8978, 4518, 14479, -9604, -22827, -9803, -22950, -31183, -33472, -21102, -18381, -16059, -549, -11303, -29498]
15794b9498o175q502K1108J7325J960j4409r684k382K9009J1376m529j1003O996
15781A592o743K274m661O4J2181P954m1j5591j9109N696Q162o81l600r447J0021
15766a1929L942O8M413L342l04p845j0828J945O506K537J0837N206p940m289p84
15751e123j786j3079N879N538O411L153k110K025j0490R030o42J932j4539n250
15737a9051Q107J7920J0453j393N461J97l493j0364q394O240O808K185K249m821
15723A2104n574L503j2887j3310m584K0055J8246J320J1048M864l775M261J6527
15710E1798k542k160j4145r165j240J0623L53K701K1707L0206K4907J5080o302
15697A21821R438K971M719K8188K4549J9751P119Q416j91j9090K105O61j344q963
$$ y = [-29498, -35673, -44175, -23067, -5742, -3782, -18191, -27875, -30257, -1248, 10128, 5599, -5404, 1592, -5151, -2877, -7538, -7474, 4707, 12661, 12620, -2971, -22080, -16384, -8222, -8903, -12503, -21950, -11929, -7987, -7919, -3506, -164, -468, -8313, -19141, -17196, -10690, -8153, 2684, 7890, -50, -4339, -5123, -6909, -19988, -14109, -8571, -2160, 993, -1117, 908, -9582, -552, -1194, 738, -13801, -19051, -10944, 6976, 17429, 16036, 21497, 21694, 18201, 7837, -557, 5683, 12491, 14676, 16925, 12104, 6530, 10033, -2854, -16164, -20748, -693, 17553, 18873, 29921, 34785, 31010, 35271, 51798, 49256, 47096, 32951, 23786, 22546, 33169, 33522, 36223, 57930, 88136, 113043, 128123, 121821, 131259, 134230, 138949, 167137, 191686, 211437, 218556, 226972, 226781, 207691, 209796, 210457, 209113, 200150]
15683B00150j9622k2702o264l356k3107j1859j4278j3974j0048m670k2653o983
15671D0634J2425J712j7253r013o319K088N168J507j5275N542J0946j6519j107
15658A4536N019l806o167Q007M187j677o258O86R677j356j2387M085l052K30l797
15643G927j0891J2099N885L734q387n667j253N953j2998o268n294j1293n91m359
15629c1403k439J2737j0217L796J4775O125L31Q177M016o976n468o522J232J596
15615a0240M437L342R73l213K044k709o094l784J1269J4087j2354j6805q818M699
15601b3166K905n140J6252m743o297O648J861m46R096r922j8758J3667P053k736
15587a3726o436j180J0198J4530l650j5028N364N605J0288m652j0825l324k244
$$ y = [200150, 180528, 157826, 151562, 148206, 125099, 113240, 98962, 84988, 74940, 70270, 47617, 40634, 53059, 54771, 37518, 28505, 22186, 24274, 29442, 30949, 15674, 21216, 32162, 15643, 14536, 19555, 15749, 9582, 17589, 21776, 20099, 13841, 14527, 24204, 22848, 10461, 14546, 11494, 11724, 7927, -2964, 9135, 15020, 18754, 10367, 4700, 3447, 9400, -3598, -9866, -15160, -26453, -27044, -31403, -33842, -21105, -31322, -27526, -12751, -6626, -6295, 1882, 5898, -1078, -6546, -13068, -11836, -10240, -5803, -2461, -1488, -4701, -2657, -5366, -11460, -15244, -3975, 10112, -2242, -19047, -27865, -23166, -20261, -25401, -9149, -13892, -20189, -13541, -11680, -12126, -3030, -12952, -31710, -18043, -10990, -13726, -20162, -21342, -11144, 3386, -264, -15292, -9928, -4323, 5965, 1313, -9512, -12836, -15080]
15574a5080k123J1988j0229j4885j667J6268J4908P742J3450r111r935q159m554
15561a1387k730k332q793K0166p59N29J0766p402k3969Q97P421J558J1521o84
15547e198N946J85n463P477m606J60J1017K29k368j0137r65N199K095n162q022
15532i613J0644Q902o40m339k1236r865N617J1248R515n44k1148m469q585Q839
15518b5674J3266J3232j130k0103J2347J920q666j3113p205m600K1587J2159k011
15505g991l530r051n730J0050P749P924J321K381K6591K689m207k6365j2028O264
15491c933K129N201r899j0304Q50M640P62P804j3933j4924M570K985Q859J2702
15477b491K953r989J934j6376J2208J2600O173M539K071j5804p027l531m374J157
$$ y = [-15080, -17203, -5215, -15444, -30329, -31996, -15728, -820, 6922, 20372, 11261, 1326, -6833, -11387, -14117, -16449, -25242, -5076, -5835, -5306, 5460, -1942, -25911, -25014, -17593, -16035, -4514, -5198, 748, 933, -4530, 2947, -1659, -1499, 9518, 9747, 7379, -2758, -3723, 1476, 3571, -1591, -9613, 1031, 9933, 9293, 4954, -16282, -26147, -20530, -9282, 233, -311, -21459, -25928, -34513, -25674, -12408, 824, -306, -20409, -8062, -6142, -14808, -27921, -35126, -39726, -18139, -5980, -7991, -11521, -20572, -26302, -16252, -8503, -579, 742, 3123, 29714, 32403, 28196, 1831, -10197, -3933, -1804, 3397, -6502, -16806, -15956, -11316, -10554, -2750, -16683, -31607, -27037, -24052, -15193, -2491, 462, -9527, -7593, -23969, -11761, 839, 7012, 11551, 13622, -2182, -9209, -12740, -17114, -15957]
15463a5957P417O423q096o027q224J3367J0540p290Q861N126k360k958q399k514
15449a0091m907n84J4188K5302m574j9450k473Q638L5J692m947m009J391j193
15435i82k218Q976k586n757l917j1869J0787J4187P472o230J0761k345p083m044
15421E152o321r52N931l529R93K382J0410J4857J0779j2696k3206j1309p263j0421
15407b5193j731J9974R952q019J1907L098n489R0m997j5483p855J207J0128l393
15393a5804r652J3725K1980m641o995L584j7843N995J2797j2947o143M594R935
15380a415j1744J8238K5110k859j0205L877l690m565p806K426R360q893j3761
15367e927j811L61o104r902L079J5558L339n318j0959Q002j0553o201J4796k643
$$ y = [-15957, -8540, -2117, -10213, -16240, -24464, -11097, -557, -7847, 1014, 6140, 3780, 822, -7577, -10091, -14998, -15582, -1394, 23908, 19334, -116, -2589, 6049, 6084, 7776, 2829, -1180, 211, -982, -3200, 5776, 3190, -2567, -6484, -18353, -7566, 6621, 14093, 7863, 18624, 16279, 9196, 5152, -1169, -2121, 3810, 281, 1274, 3656, 14066, 28923, 39702, 27006, 3800, -7509, -14772, -25193, -26924, -6950, 3002, -5017, 6890, 9988, 4499, 4589, -408, -15891, -23746, -22539, -12411, -15804, -25456, -11731, 10249, 5608, -1387, 2197, -15646, -9651, 3146, -9801, -15944, -11350, -1415, -13159, 5079, 30189, 27330, 17125, 21002, 17312, 12747, 4941, 7367, 16727, 7834, -5927, -7738, -7377, -13481, -23383, -20304, -4746, -1407, -6725, -17684, -9682, -20235, -26436, -11640, -14283]
15353a4283j3055K876M570r306L065P128j8j0518L157R147J7402J459j296p246
15339f918m704K1542P226o538j48J84P93j8489r764M70o860N466n444J0613R789
15324b782k215n500M241o934N630J542p483m393L929p647J2146N515j0739l964
15310a8654J8059N866L009j5532r978j198Q515P978p888o244P625O60L908r72
15296d846J0875J6593K449N8j707n768j3144k2182O95J6470O439q662j0447p620
15282b0797L251R207J0062R69q681k194R008j0237r037R565L703K369j0050l801
15268a6663N235M59M882Q299M043M366l121n408l798J0405J5131P157J699n586
15254B7100k558O075J2463o819j6828j2214k280J2600n032o127j6886P433J3799
$$ y = [-14283, -27338, -24462, -19892, -29198, -26133, -19005, -19023, -29541, -26384, -17237, 165, 1624, 328, -6918, -11622, 9920, 17146, 10608, 10460, 10644, 11437, -7052, -16816, -16346, -23206, -17740, -23184, -12571, -2782, -4997, -10497, -6256, -13190, -7560, -6018, -13501, -17894, -13965, -21612, -9466, -3951, -14690, -18654, -595, 5271, 8280, -7252, -17230, -18428, -9913, -1935, -9823, -16067, -8442, -7782, -3874, -4846, 6029, 22622, 25071, 25129, 23422, 17654, 4510, -17672, -16977, -507, 5932, -2730, -13177, -20797, -17546, -8339, 1723, 2692, -5989, -8183, 825, -9412, -18449, -8884, -5181, -2812, -12862, -16663, -11428, -10969, -6087, 2212, 6255, 10621, 7500, 2092, -1706, 8699, 23830, 30987, 32686, 27100, 24542, 30617, 43080, 36261, 19433, 7219, 4939, 17539, 12507, 6380, -10506, -3073, 10726]
15241A0726J021j6500J337K1469O451N78j0646q871J274o49Q14P39J1977m713
15227A5007r038R294j1878j0911Q93J0577K811M099J0904n202o963j3578M79P803
15213D297k048j1095J0939M997r024q156j0854P244L167Q466m146l209O190j938
15199e170j17p949j3392j770J1241k354m214m67O123P439J3408j0732L56J0346
15185B748N145J1006M678r870j0704n316J4048M534k1049N232q196j1872J1247
15172h369J4380P075Q60J729r109m524n76L780Q914O224Q77j2115j0145n246r99
15157g244J603l499J4316Q345L72n825j274l802k608k176q07j1274K906J4035
15143C068P01O799O425l53j0521o131L448R834k633M755N437R550r770j4717J6982
$$ y = [10726, 11747, -4753, -3416, 18053, 24504, 25082, 14436, 5565, 6839, 6190, 7004, 7743, 19720, 15007, 5969, 15263, 3385, -7526, -6633, 3944, 6755, 10854, 21758, 16556, 9593, -3985, -3506, 4297, 2249, -8846, 2093, 7090, -1934, -10090, -20944, -13700, -10533, -2067, -6213, -9422, -3232, -5170, -5287, -13236, -26628, -28398, -17157, -19511, -23725, -24192, -18069, -10630, 2778, -7954, -7598, 2748, 7893, 18899, 23577, 13707, 3003, -2313, 11735, 16269, -4780, 452, -7744, -19616, -8369, 6011, 13086, 13946, 15675, 6566, 2042, 1466, 5246, 14160, 20384, 21261, 9146, -999, -6245, -7244, -5641, -9140, 5176, 13521, 13893, 8068, 6794, 2992, 384, -1792, -2599, -13873, -10967, 3068, 3769, 10568, 16993, 16640, 6119, -12, 3436, 13270, 10637, 15392, 20829, 30379, 20609, 5892, 22874]
15128B2874O462l296Q701j1314j4000j2149j784Q613P490Q018n122k981K557l396
15114A0673j2427o968O578J83o243k256J4739K190k411q927P309O782M3Q504L278
15099B1047p977j4258O78Q567R547r090k0639q480k784O049n592J5214J1415O98
15085D395O601J580q508l780M409J178k0261Q752J3434o663k063l412J9637L085
15071A8384k409o735m77n025M772Q478n980L354J0048o90j8727j1140N499O649
15057F001N095k820o335K921k2987o111j319P088R229o975j477N67M179k850L168
15042a2626J4148m301Q679R145R390j917j2261n482j3635r758K775J3970Q701
15029F828l050j0390j4271L578K7330J2904j7384j3503j185k200O016R077O777
$$ y = [22874, 29336, 26040, 34741, 23427, 9427, -2722, -4506, 4107, 11597, 19615, 14493, 11512, 14069, 10673, -1754, -8722, -2144, -1961, -8204, -10460, 4279, 6469, 4058, -4869, 2440, 9222, 9265, 17769, 21047, 13070, -1188, -510, 8057, 17604, 8514, -12125, -20605, -23389, -17340, -22932, -7718, 3697, 4395, 10996, 12576, 4068, 288, 4697, 5875, -14386, -5634, 7800, 1137, -926, -4338, 15299, 18384, 15975, 9240, 8763, 3738, 8510, 16988, 11008, 14362, 24410, 23720, 4993, -6147, -648, 6001, 11096, 8276, 1941, 4862, -18125, -24236, -25555, -18467, -9238, -16213, -17690, -17123, -12944, -15794, -12626, 1522, -2779, 5900, 15045, 24435, 22518, 10257, 4775, -8860, -18618, -15843, -1873, 6828, 3778, -6612, -20883, -17305, 10025, 22929, 5545, -7958, -9143, -11343, -5327, 3750, 10527]
15016A0527M315m908q016N797n411q891jK6906J140k078J0602j049K468j3229
15002A8172k599P03j4304p114j1066J4211J2326m920j4438O181J3319R549l233
14989A6787j0418l847J0335J0762j1720P508J6254J206j4786j9325p279Q48J8561
14976A4886M098J0074n176j2941j1434j2814k364l702J7059J5828M452N127k912
14963B0181j4820j1857O845K024J5074M922k038J0875L567j3520o367m078o745
14950D063L917j1882j2160K2217J5251O617P284R903p540j1456J0446n971r935
14937B0754N578j4952l723P848N149m7j0464l709k3J0893r44L429q000M192M496
14922B0477K445l804m093j4155K848J073J895l73o245l835o457j042J3329r908
$$ y = [10527, 14842, 9934, 1918, 7715, 2304, -6587, -6588, 20318, 21458, 19380, 29982, 28933, 31401, 18172, 15573, 16276, 1972, -5142, -16208, -1997, 10329, 5409, -9029, -2848, 10471, 20020, 16787, 6369, 2522, 12857, 23619, 11899, 19407, 35661, 36867, 22081, 2756, -4523, -3675, 14886, 18984, 29058, 23882, 10941, -493, -13307, -15671, -19373, -2314, 13514, 17966, 23093, 20181, 5361, -6496, 349, 2373, 17447, 22369, 20331, 31206, 34773, 21253, 14886, 10808, 4063, 7980, -3902, -16062, 6155, 21406, 28023, 35307, 45210, 37670, 26214, 36660, 30689, 20754, 26332, 11380, 7657, 15505, 20654, 20607, 10143, 6434, 6411, 17304, 16360, 19789, 11789, 15981, 20477, 22922, 19118, 15025, 870, 3718, 4791, 6686, 6313, 68, -3767, -10224, -11266, 2063, -7845]
14908g845L131J2232Jj039r444l246J1355O291R667j686n015J187m019O735K795
14893B1100J2730m74j7187k881j2967j598P873m632J2861j519n888q935O52J9292
14879A8427N478J3878J0181k0952j0186j742j817M12n410R42j1077M379J3818
14866A6331j6591r224K0733r29j8819L166L831o439J5465n549j4700J4979k393
14853a39j6474R13J735L459O460M104r53O085k108J2135l874J467O497J3870n308
14838B7869k901o941n142o382J15m756r566J814J4091O910K285k759o94O197N922
14823B6062j362j992j8196q135n075P857m381j3618L437R872L53p598L902J2622
14809C748J328J636J9323j106j1485j4965q816n936J2774l981P351J3164m792
$$ y = [-7845, -4714, 7518, 7519, 6480, -2964, -6210, 5145, 11436, 21103, 19417, 14402, 15589, 11570, 18305, 21100, 33830, 33356, 16169, 13288, 321, -1277, 6596, 1964, 14825, 13306, 7418, -1517, -865, 18427, 23905, 37783, 47964, 27012, 16826, 15084, 13267, 13679, 8269, 9211, -1866, 2513, 16331, -260, -9484, 11249, 10320, -8499, -5333, -1502, -7941, 7524, 1975, -12725, 2254, -139, -16613, -15700, -13965, -10506, -4046, 58, -895, 5190, 3082, 15217, 11343, 12810, 19307, 33177, 27869, 24968, 18027, 12885, 6503, 6618, 1862, -7704, -5890, 8201, 15111, 17396, 14637, 13943, 20140, 26062, 24700, 22708, 4512, -3623, -8698, -841, -5222, -18840, -15403, -5531, -5178, -12776, -8874, 3748, 5076, 6712, 26035, 24929, 13444, -1521, -10337, -16273, -3499, -7480, -129, 13035, 8243]
14796H243P884P24k1415j6214j7697L164O818J7255J9818R326J1243P566J882
14783C8597O596M115k8793j1085J203J95R414l451o861j657K86M484J7897J509
14769C2449o407P147j5346o909J277R223N474n467P062q185j8733j609N188n928
14755g64M187J2390k222l8q2r777J1093J1953J8251N113j4454j7418K465J1410
14741C2107J2251J6756J3412Q407j786P54R529K4479K8420K8990M5208O7735J08029
14728C94291J22242J33485J18483O4730k7380j10509j50684j41372j23359q1914
14718A98013l8568k0451l5081l0219j6234K063j0130j253p334K351L083m041p296
14705C4903L963m138r568j6250j2381K859Q365P616L941n844K513n501j6580j054
$$ y = [8243, 16127, 16851, -4564, -20778, -38475, -35311, -28493, -11238, 8580, 17906, 29149, 36715, 38597, 45193, 49308, 20515, 9430, 10633, 10828, 20242, 16791, 9930, 8273, 8559, 13043, 30940, 32449, 26042, 33189, 17843, 10934, 12211, 21434, 26908, 21441, 28503, 20318, 1585, -24, 5164, -764, 3423, 15813, 13591, 13553, 13471, 3694, 14787, 26740, 44991, 50104, 35650, 18232, 20697, 32107, 44358, 61114, 74526, 82933, 81147, 81901, 91430, 115909, 144329, 173319, 218527, 286262, 394291, 516533, 650018, 768501, 833231, 805851, 695342, 544658, 403286, 279927, 198013, 159445, 138994, 103913, 73694, 57460, 59523, 49393, 48140, 40806, 43157, 46240, 42199, 34903, 38866, 34728, 25160, 8910, -3471, -612, 7753, 15369, 19310, 13466, 15979, 10478, -6102, -7156]
14691g156O985L454R340M870l8l415P161l152K172n998l268n620j075O227j0977
14676d90l997J948Q344K986J0398q890j0235j0697K480J0823M390J4131J2694
14663C3885J1692j6092j0339P931L473k186o156j8996j3573J3244j851k624K1340
14650A9748J4664j4346J337J3863N968K701m251j2486R748J1469j9929j7367J761
14637A2880o906O003J4536m899l58J9487o475R209P337j5044j2151J929j7701
14624G847j6116J2357P992J0580j1308q546P489K0376J7926L655j2020j837j3128
14611B5267o943J223R019J9347J2463q304j1484j4478l006j76j3975j8168j575
14598a0790J4611M15J1876R018K827l439k175n38M424j903o645j4342J0319k648
$$ y = [-7156, -171, 3283, 12623, 17493, 17455, 14040, 21201, 18049, 20221, 14223, 10955, 5335, 4260, 10487, -490, -4487, -2539, 5805, 8791, 19189, 10299, 64, -10633, -8153, 2670, 7060, 21191, 33885, 45577, 29485, 19146, 27077, 30550, 28364, 22208, 3212, -10361, 2883, 1032, -1592, 19748, 34412, 20066, 21403, 35266, 41234, 43935, 39684, 27198, 36946, 48415, 28486, 11119, 12880, 5974, 11977, 26513, 21614, 21256, 40743, 34268, 43477, 50814, 35770, 23619, 25548, 7847, -8269, 4088, 12080, 22660, 11352, 2806, 10295, 30671, 48597, 52252, 40232, 38395, 25267, 18324, 19547, 28566, 47913, 60376, 52072, 40588, 26110, 23104, 22928, 8953, -9215, -10790, 3821, 4236, 16112, 25130, 27957, 24518, 22343, 21805, 26229, 24326, 17681, 3339, 13658, 11010]
14584A1010l595l866r241k419K2662J2720P517Q434p93k656q028q287N232j3655
14570A5035Q4l150J2386R544R42p438J39R52j2179J1781P535q010q349q320J1872
14555B2824L145j0427r114J6018J4425q11M485J1458k531n512J8100j2922o304
14542D2834K0415M701J671l501K688P186J2339o57Q773J2445J0576N77J7564K0524
14528A58135J9095N738J6947J9193K7589J7338Q952J5368R182K4223Q900J5277
14516C45937J8917K252J0014J310l059j8343r202O388j2549j0005j0791L670P751
14503C32290J0459J3385M88J4662M8597M8329Q0730P8044R2717J18029J75696
14492A013426J96895J59286J09059J8660o9282j42106j93067j79185j63285j47843
$$ y = [11010, 7415, 3549, -5692, -8111, 14551, 27271, 34788, 43222, 42429, 39773, 31745, 23458, 28690, 15035, 15119, 11969, 24355, 33899, 34841, 27403, 27542, 28494, 16315, 28096, 35631, 27621, 19272, 10952, 22824, 25969, 15542, 6428, 22446, 36871, 36060, 40545, 52003, 49472, 43960, 62060, 49138, 42834, 63249, 67950, 69621, 66120, 68808, 75994, 88333, 87676, 96449, 108894, 119470, 120047, 137611, 158135, 177230, 182968, 199915, 219108, 246697, 264035, 272987, 288355, 297537, 321760, 330660, 345937, 364854, 367106, 377120, 378430, 375371, 357028, 347826, 354214, 341665, 331660, 320869, 324539, 332290, 342749, 356134, 356622, 371284, 419881, 468210, 548940, 626984, 719701, 837730, 1013426, 1210321, 1369607, 1478666, 1497326, 1428044, 1285938, 1092871, 913686, 750401, 602558]
14482F02558j31997r1133m8713l9845j9570k8451l5501k3439j2365j3524J208
14471A59228N68k0468j5637p486j2485m814j3303M07J8254J4844N304n796m203
14458A14413j4681J4319l686N285R604K9344K1810o638R191R339R268Q031K6467
14445B32066J5462K4434L5079L8189M4746N9991P5873J09296J28035J74597K24416
14434A162184K57100K62402J93180J00749l1357j51501k33922k73837k52085k05811
14424H27102j64427j11996o7700o6630o5020o5404l7789k76J0794Q765m732j7551
14412B45136j7132o83J9063K1365K6929K4363L9887N1860L8800J5937m1298o6035
14400C58192m7193n4729l2127j9174k8824k1593k1625j0799m859O964q444j4721
$$ y = [602558, 470561, 379428, 330715, 290870, 271300, 242849, 207348, 183909, 171544, 158020, 159228, 159796, 139328, 123691, 116205, 103720, 98906, 85603, 86010, 104264, 119108, 124412, 118616, 114413, 99732, 114051, 110365, 115650, 125254, 154598, 176408, 169770, 178961, 188300, 197568, 205599, 232066, 247528, 271962, 307041, 345230, 389976, 449967, 525840, 635136, 763171, 937768, 1162184, 1419284, 1681686, 1874866, 1975615, 1944258, 1792757, 1558835, 1284998, 1032913, 827102, 662675, 550679, 482979, 416349, 351329, 285925, 248136, 247860, 258654, 267419, 262687, 245136, 228004, 227321, 246384, 267749, 294678, 319041, 358928, 410788, 449588, 465525, 424227, 358192, 310999, 256270, 224143, 204969, 176145, 154552, 132927, 122128, 117269, 124233, 115789, 101068]
14388A01068k6918r92K444o962L89P746j4662m984J2821o877k1553j201N497P50
14374D6566j679k362J0731m748j9221J16K1488P350K2267J0748p871K93p33j5793
14360F7152p166O518M133J276m532j6581j4091J543P533J757k477Q220J6037J369
14346G0691K134o585r799J5881K997j2220p897R469J3691J1885k1324k172J5394
14333H2145r363j5895j425M840J2885J1321K355o3m997m527K0479J0167r273Q148
14319A06797r022m613Q898q260j6127L0220J7379j2191k5935m544j830n626j4267
14306F0879j1374L771O719ko240k381N93l173l513j155m993K720J982P059J359
14291E2251J1285O67k516P594J5779p129j8141j0901j6095p491J5162m942j962
$$ y = [101068, 74150, 73158, 75602, 68640, 69029, 76775, 62113, 57129, 69950, 63073, 41520, 40319, 45816, 46566, 44887, 42525, 53256, 48508, 29287, 29403, 50891, 58241, 80508, 91256, 83385, 83678, 82945, 67152, 59986, 66504, 70637, 71913, 67381, 50800, 36709, 38252, 45785, 47542, 45065, 53285, 69322, 70691, 72825, 66240, 56441, 72322, 75319, 63099, 55202, 64671, 78362, 90247, 68923, 66751, 82145, 72782, 56887, 55462, 60302, 73187, 84508, 86863, 86800, 81803, 77276, 97755, 107922, 98649, 106797, 97775, 93162, 102060, 93800, 77673, 107893, 125272, 113081, 87146, 82602, 80772, 75146, 60879, 49505, 53276, 59995, 59993, 53753, 51372, 51965, 48792, 45279, 44124, 39131, 41851, 43833, 50892, 52251, 63536, 64203, 61687, 69281, 85060, 77931, 59790, 48889, 32794, 25303, 40465, 35523, 33561]
14278C3561J4842N612N00o959J0395J0804K019j5570K454N2J1143J5547Q205q766
14264H3839j3628r431J6684J4783O243m94n35k0762j6064J2859n983m650Q758
14251G1619J0614J0916j3719R885J0666R149J271k673r01q261J908J8190k918
14238A15746j102J2796k393K161Q121J2314K55l106j5577m759R10J7615J7291
14225A60272R410K091O141M1n280N691K1990p228O677J863p024P85j4259J1295
14211A92465J6850j3570K356o155j3346q352Q772J8345M03k471r806M139n073
14198A84557N954l784j3117j5609l375p827M048M789l024j7478O395Q133O808
14185A56470J6520J4062o901j1679q450K025J3238J5620M183l428L268O726k981
$$ y = [33561, 48403, 54015, 54515, 47556, 57951, 68755, 70774, 55204, 57658, 57710, 68853, 84400, 92605, 83839, 70211, 60780, 77464, 92247, 98490, 97996, 97461, 76699, 60635, 73494, 67511, 62861, 71619, 82233, 93149, 79430, 89315, 99981, 109130, 110401, 107728, 106827, 98566, 100474, 118664, 115746, 114644, 127440, 125047, 127208, 135329, 147643, 147898, 144792, 129215, 124456, 125366, 142981, 160272, 169682, 171773, 177914, 177955, 172675, 178366, 200356, 193128, 199805, 201668, 194644, 195429, 181170, 192465, 209315, 195745, 198101, 191946, 178600, 170248, 179020, 197365, 197768, 195297, 185491, 189630, 184557, 190511, 186727, 173610, 158001, 154626, 146799, 150847, 155636, 152612, 135134, 141529, 149662, 156470, 172990, 187052, 180151, 168472, 160022, 162047, 175285, 190905, 195088, 191660, 194928, 201654, 198673]
14172A98673M585J1914J0021J4093J3068p032m307O343K325Q78J2081J4157J2060
14159B88859N342R59K153J4609N940R101J3463J2015J0021K0571J8318L1216K0246
14146D52813o977r133J3451K2887M582L044J5038K5273K0521L6807K7207J1227
14134F16740J6883J9957K0830K5189L6980L2272K8848K3789L0973M8490K8040
14123I28991N0647O7627M7716N2058N4202N8903N6035O9200Q0342P2453P4924
14112A613098Q4958J04911J11929J26254J29426J38906J31567J56630J89013J96807
14102B983499K03722K32806K49332K82111L04949L22933L48530L80081M21915
14093E729878M48191N05698N42529N97029O57368P35745Q20084R01387R90949
$$ y = [198673, 203258, 215172, 225193, 239286, 252354, 245322, 241015, 247358, 249683, 250561, 262642, 276799, 288859, 294201, 295160, 297313, 311922, 317862, 326963, 340426, 352441, 362462, 383033, 401351, 432567, 452813, 445836, 436703, 450154, 473041, 477623, 480667, 495705, 520978, 541499, 578306, 605513, 616740, 633623, 653580, 674410, 699599, 736579, 768851, 797699, 821488, 852461, 900951, 928991, 979638, 1047265, 1094981, 1147039, 1201241, 1260144, 1316179, 1385379, 1465721, 1538174, 1613098, 1698056, 1802967, 1914896, 2041150, 2170576, 2309482, 2441049, 2597679, 2786692, 2983499, 3187221, 3420027, 3669359, 3951470, 4256419, 4579352, 4927882, 5307963, 5729878, 6178069, 6683767, 7226296, 7823325, 8480693, 9216438, 10036522, 10937909, 11928858]
14084A1928858J086246J189051J291203J442758J578802J709545J855952J989711
14076B4072126K151344K290641K422223K505746K537471K533982K452668K280767
14068D3246968K001316J616228J144787O10471K1018n65195j123086j593505j990063
14059D3368939k313984k516162k615217k641607k591236k488356k372129k248612
14051B3581636k082670j897070j737687j584255j451861j309047j182792j094755
14043A1241499r68793q80452p80243p16056o62664o10077n40694m92629m34804
14034E155087l96131l66229l22903l06991k80767k48597k28944j98781j90507
14025B615237j63081j54978j59515j46378j25965j11069r8959r6353r6286q0625
$$ y = [11928858, 13015104, 14204155, 15495358, 16938116, 18516918, 20226463, 22082415, 24072126, 26223470, 28514111, 30936334, 33442080, 35979551, 38513533, 40966201, 43246968, 45248284, 46864512, 48009299, 48619770, 48640788, 48075593, 46952507, 45359002, 43368939, 41054955, 38538793, 35923576, 33281969, 30690733, 28202377, 25830248, 23581636, 21498966, 19601896, 17864209, 16279954, 14828093, 13519046, 12336254, 11241499, 10272706, 9392254, 8612011, 7895955, 7233291, 6623214, 6082520, 5589891, 5155087, 4758956, 4392727, 4069824, 3762833, 3482066, 3233469, 3004525, 2805744, 2615237, 2452156, 2297178, 2137663, 1991285, 1865320, 1754251, 1655292, 1558939, 1462653, 1382028]
14015A382028p8182p9606q4879n0913p8465p4904n0540n0257n4989m0801l2822
14004G05670k1653l9073n1645l0138k5312j425j9748m3663l1241l0038j9438k0085
13992C72211l1694l0216j2863r747l160k8081m096N516j1576j178P265j4667k0567
13979B17147r642J4132j5628n371q392j2173j0195l09M938j0688r171o626j1910
13966A36112j386m409j2535j0714k978M50P168Q445N196L53j0096j925j3791k2452
13952G7438J176R094l508P543L698o702M995J0078J232j953J700l923k2125j5535
13938F3208R262K935M179K306q00j7179j2426r779p564m377q375q316m424o224
13924B426j5027m747r396j8592n44O931Q387q983q603m00R082l213r290J215J0441
$$ y = [1382028, 1303846, 1224240, 1139361, 1088448, 1009983, 935079, 884539, 834282, 779293, 738492, 705670, 684017, 644944, 593299, 563161, 537849, 536424, 516676, 473013, 441772, 411734, 392296, 372211, 340517, 310301, 297438, 287691, 284531, 256450, 252354, 257870, 246294, 245116, 252381, 237714, 217147, 207505, 221637, 206009, 200638, 192246, 180073, 169878, 169569, 174507, 163819, 154648, 148022, 136112, 134726, 130317, 117782, 107068, 104090, 104540, 111708, 120153, 125349, 125702, 115606, 113681, 99890, 77438, 78614, 87708, 84200, 91743, 95441, 88739, 93734, 103812, 105044, 103091, 104791, 100868, 78743, 63208, 72470, 75405, 79584, 81890, 81090, 63911, 51485, 41706, 34142, 29765, 21390, 13074, 8650, 2426, -12601, -17348, -26744, -45336, -45880, -38949, -30562, -39545, -48148, -48548, -39466, -42679, -51969, -50754, -40313]
13909d0313J2691O389J103j2004j9746J0541K2029O542k081K096K748m13J6645
13896F227M860q139P552J210k483M095Q60P088J1584J128L438k187r707n773N441
13881B5194L09n661r035L970J0162q542r954J1344R464p14K996p189j1043k081
13867I220J3322q17Q49j8236j6527R370K3034J0788j1124O91j788P096J3776m274
13853C5380j5853o521q050J7919Q239k519o082R706m071l928j85n984j3960l038
13839A053J0116K6439P397j8147j3623k400O317j1996j0244J3054J410r54O904
13826A5326R467l667j4073K3451J3254M280j6396j5584N006p640l223J827k754
13813I274j2536M182J5319R061O076R377P824M280k547j7435j7520n079R417J1235
$$ y = [-40313, -27622, -21233, -20130, -32134, -51880, -41339, -19310, -12768, -14849, -12753, -10005, -10418, 6227, 11087, 2948, 10500, 11710, 9227, 13322, 14182, 21270, 32854, 33982, 37420, 35233, 25526, 19753, 25194, 25503, 19842, 10807, 14777, 24939, 16397, 6443, 17787, 27251, 26537, 29533, 22344, 11301, 9220, 22542, 21725, 22574, 4338, -12189, -2819, 20215, 31003, 19879, 20570, 18782, 25878, 39654, 35380, 19527, 13006, 4956, 22875, 31114, 28595, 22513, 32219, 28148, 24220, 24035, 18051, 4091, 1053, 11169, 37608, 45005, 26858, 13235, 10835, 17152, 5156, -5088, 7966, 9376, 8422, 15326, 24793, 21126, 7053, 30504, 43758, 48038, 31642, 16058, 21064, 13424, 10201, 12028, 9274, -3262, 920, 16239, 25300, 31376, 40753, 48577, 52857, 50310, 32875, 15355, 10276, 19693, 30928]
13799C0928J3765M360k8354j3282n904j9334J3069M367R969J974j0518J2022r096
13786C966m606J821j9180j6101P421k634n644L173R784J0266K266L023j1229p420
13772b5094J2963P829o119q000R112N65l522n369j084M23N518j5495m623M461
13758b8435J8433J8655R328j1224j6393k6020J2738J2505K332J0142J824l007
13746H78m696k8319j7171j335J7354J6413K408J0635J7897L050j0605M215j9075
13733h351o408N532J9472n885l855J7068l658j0544n207O700O930q205l2209J3044
13719a5576J8355O752j673J811p92j4977j4909k135J029J5574M081j5744L124
13706a5080N821m4P55J0502J853O648J1484J0910n289j8313j988K852j5883j4776
$$ y = [30928, 44693, 49053, 20699, 7417, 1513, -17821, -4752, -385, 9584, 11558, 1040, 13062, 3966, -640, 1181, -17999, -34100, -26679, -29313, -34957, -31784, -22000, -11734, -9468, -6445, -17674, -25094, -12131, -4302, -10421, -18421, -9309, -8744, -12266, -17635, -18719, -18296, -12778, -28273, -32896, -28435, -10002, 8653, 17981, 6757, -9636, -35656, -22918, -10413, -8081, 2061, 3885, 878, -3818, -32137, -49308, -50643, -33289, -16876, -14468, -3833, 14064, 17114, 6509, 10724, -8351, -14759, -9227, 10245, 4360, 505, 17573, 13915, 3371, -1836, 4864, 11794, 3589, -28620, -15576, 2779, 9531, 7858, 9669, 8877, -6100, -21009, -23144, -22115, -6541, -2460, -18204, -15080, -9259, -9303, -8548, 1954, 3807, 10455, 21939, 32849, 27560, 9247, 7259, 10111, -5772, -20548]
13692b0548p240R642L971K931P009M328N353R23n593P13n125M645L091L115n195
13677B020j4014M024P339n156m631J4041K191K726J67j272m438n472q331o49M246
13662g209j851j2838K122J8995O902N901Q844P285K150r624l61J0547k095j508
13648B7260L646J098j5629j2292J1906O200J4144R28j0347N958P279R770q615
13635D1306l766O390k711P757J6329N616r004L274J4461k865N757J5874J6831
13622A15249j758L345J0900O163J8638K0264J5954K0520J3056j918J1790K1217
13610B53420M269j96J5136j3682j5332m845J1492j0518r440j1455p367j0682j7782
13597A83018j4791j2029l1258j7375P234N337j8824j4056J4140r451j3519n380
$$ y = [-20548, -27788, -18146, -14175, -11244, -4235, 93, 5446, 6369, 776, 1489, -3636, 1009, 4100, 7215, 2020, -11994, -7970, -631, -5787, -10418, 3623, 5814, 8540, 8707, 7435, 2997, -2475, -10806, -11455, -7209, -9060, -21898, -19776, -781, 6121, 12022, 20866, 28151, 30301, 20677, 20316, 30863, 28768, 27260, 30906, 32004, 16375, 4083, 15989, 22189, 36333, 37261, 26914, 32872, 40151, 49921, 41306, 37540, 43930, 41219, 48976, 65305, 70921, 61917, 65191, 79652, 76787, 82544, 98418, 115249, 113491, 116836, 127736, 133899, 152537, 172801, 188755, 209275, 222331, 220413, 232203, 253420, 257689, 257493, 272629, 258947, 243615, 238770, 250262, 239744, 230304, 218849, 211482, 200800, 183018, 168227, 156198, 124940, 107565, 114799, 120136, 101312, 87256, 101396, 91945, 78426, 73046]
13585G3046l779k98K188l471r198O897J1770q759n278k1329k94Q46l307k550j8280
13570A8204o835N944N301M029q251P00p09N850R910K50m440J285O218N580M426
13555D7462J211j2017n824n951J848K767r696l874M867M045Q919K71l390j862
13541B8776m679p629K364k3499o724J1849n005j030J1533J408M797l13k600J4659
13527B3907p350j5844K956J2928J7298R224j2661p749o808j5839o863Q925q628
13514f504P000J5958K159N481K260j5488M822p63r32P521r430n862m835L123J0943
13499A5453P21P566N040j652j8968j5044P569j464M29M683R863J738P403j0161
13485A3176m475k627R895M399j1622p311k0986p468k01J5406L929J1857J2268
$$ y = [73046, 69267, 68969, 71157, 67686, 58488, 65385, 77155, 68396, 63118, 41789, 41495, 42341, 39034, 36484, 18204, 11369, 17313, 22614, 26643, 18392, 19092, 18383, 24233, 34143, 34393, 29953, 31238, 37456, 43036, 47462, 48673, 36656, 30832, 24881, 26729, 29496, 19800, 15926, 20793, 24838, 33757, 34028, 30638, 28776, 24097, 16468, 18832, -4667, -11391, 458, -4547, -5577, 5956, 7364, 12161, 11848, 9248, 23907, 16557, 713, 3669, 16597, 33895, 43119, 30458, 22709, 15901, 62, -6801, 2124, -6504, 496, 16454, 18613, 24094, 26354, 10866, 15688, 14925, 13993, 21514, 12084, 6222, 1387, 4510, 15453, 16174, 23740, 28780, 27128, 8160, -6884, 685, -779, -350, 4333, 14196, 15934, 23337, 13176, 8701, 6074, 15969, 20368, 8746, 1435, -19551, -27019, -27220, -11814, -7885, 3972, 16240]
13472A6240K2420l134k1551j2276j207N364K692l162j6547J012m673p244P165
13459a4901Q837J4428o528M188m797k656L794R403J963M450r967R778o572j9159
13445g739j3907K214J1398J6647R174j059o667J542q100K671L266p826k449j207
13431b042J0535K657q923j0849l705J0635J3887R130M044j4314j4096k664J7472
13418A1767J5814n587j4062j9495l682K2198r264R845J692j1605p428L511k191
13405h487m48P65k893L000P21J310N953L270n649j0261n835J0320K408P862M875
13390F911j460k091N689p372N668Q382q585n037j1812Q3P224o074l588k167j679
13375a5908J0105K867o826P846l56J1216o351r94r60l602Q926o109r932L439J4066
$$ y = [16240, 38660, 35526, 13975, 1699, 492, 5856, 8548, 5386, -11161, -10149, -14822, -22066, -14901, -6064, 8364, 1836, 6024, 1227, -1429, 2365, 11768, 13731, 18181, 8214, 17992, 11420, -7739, -21646, -19432, -8034, 8613, 17787, 16728, 10061, 11603, 3503, 6174, 9440, 1614, -835, -2042, 8493, 11150, 2227, -8622, -12327, -1692, 12195, 21325, 25369, 11055, -3041, -5705, 11767, 27581, 21994, 7932, -11563, -15245, 6953, -2311, 7534, 9226, -2379, -9807, -6296, -8487, -8935, -8170, -11063, -8063, -7342, -6032, -79, 3191, -2458, -12719, -18554, -8234, -5826, 2036, 6911, 5451, 3360, 9049, 1677, 7345, 15727, 7142, 2105, -9707, -9624, -2400, -8474, -12062, -14229, -15908, -5803, -2936, -9762, -1916, -2272, 8944, 2593, 1599, 639, -2963, 5963, -146, -10078, -6639, 7427]
13360G427K1392j958j341n638M097R813M354n497j1212j6977J0830P462j0659
13347A2093r367N436Q241M452J0630J14o146n686j366r9j8568k535j678l220j4032
13332b1731J5580J0983J1354K506N183L043p511J915Q38O858j2015r678k0049
13319a2724p546J342R005j1144O724q106j4031J1523J0256R914J6181J5390q860
13306A7924m978J998j1651J370J1159k596j837J632j1919J918o004j130J1815
13293G701R429P002J5208j7824j8530m416O615q79K039L910Q722J0089o881j6172
13279F013R00M875k981l891m250OJ0028m421K307O624n258j304j6827r564J6259
13264a484J4502o800O030L069J4063l20j0762M786N145n007j5171M00J1328j1682
$$ y = [7427, 28819, 26861, 25520, 19882, 23979, 33792, 38146, 32649, 21437, 4460, 15290, 22752, 12093, 2726, 8162, 16403, 20855, 31485, 31599, 25453, 19767, 18401, 18302, -266, -2801, -4479, -7699, -21731, -6151, 4832, 16186, 18692, 23875, 26918, 19407, 21322, 22160, 29018, 17003, 7325, -12724, -20270, -18928, -9923, -21067, -14343, -22449, -36480, -24957, -14701, -4787, 11394, 26784, 17924, 12946, 14944, 3293, 4663, 15822, 13226, 11389, 13021, 1102, 3020, -2984, -4114, 7701, 17130, 24132, 39340, 21516, 2986, -1430, 5185, 4306, 6345, 10255, 18977, 29066, 22185, 6013, 6913, 11788, 8807, 4916, 666, 672, 10700, 6279, 8586, 15210, 9952, 8648, -8179, -17743, -1484, 13018, 6218, 12248, 15317, 29380, 29060, 18298, 23084, 28229, 23222, 8051, 8451, 19779, 8097]
13250H097j0888m74n346j202J7643J5093r799J992K025j1174j5925J7112J694
13237H848m619j959O177J2640Q772j5841j31J5284p993j3256O42N651o742j4655
13223g182O606J1768n023J1588J4464q379K949J225L565k68N624K670J1386r415
13209D1578l824p299L138J4001K3676n86O35K7054L5767N4906N8195M2978j9186
13196B71033o2321q1555n5320j6863j5755p916j402r001k1189o558J2749M542
13184A0444p766r47p987j6248J1302J4065n609j0972j4324J4778L3892N0722N2788
13171A24138K7085J4047N230j275j527n371q414M356J2108J5630L0461K0535L9056
13158B76059O0411Q8292J47613K07016K14143J17641l839q8498o9623K7220J71394
$$ y = [8097, -2791, -3265, -8611, -9813, 7830, 22923, 13124, 15116, 17141, 5967, -9958, 7154, 8848, 4229, 2270, 8447, 21087, 29859, 14018, 13887, 29171, 21178, 7922, 8564, 14215, 7473, -7182, -576, 11192, 6169, 17757, 32221, 23842, 26791, 28016, 31581, 31313, 36937, 39607, 50993, 41578, 37754, 30455, 33593, 47594, 71270, 70684, 71319, 98373, 134140, 189046, 247241, 290219, 271033, 208712, 127157, 71837, 54974, 39219, 31303, 29901, 20900, -289, -6847, 5902, 10444, 2678, 1731, -6256, -22504, -11202, 2863, -2746, -13718, -28042, -13264, 20628, 71350, 124138, 151223, 165270, 170500, 169225, 167698, 162327, 153913, 158269, 170377, 186007, 216468, 237003, 276059, 336470, 424762, 572375, 779391, 993534, 1111175, 1107336, 1018838, 949215, 976435, 1147829]
13147A147829K88371J80018j00144l15642l54815k67359j68643r3002n8355m3841
13137B14417l6616j6870k2086j9958k2489k0165j0863R685J1903n054r934n266
13125F6704Q429L71J4949K7285P663j2935r024J1355N937J0372J9714L2632N0816
13112B34268P0735J01869J72662J91498J19558J243j35070k13908j72478j10480
13102B59897p2018m5248j9370k0188q464j4198k514j707J4241j851q004q317r269
13089F2990j9788j0245k000J578L22o310k000k370J0434q07K172J2163J4152J4134
13075G4425K3633K5968q717j3531j7541P361P036p54J8111L1107O0664N8591M8441
13062C14794L093m0261n9243m6209l6268l2732k0173j1016N921n310O1q501o469
$$ y = [1147829, 1436200, 1616218, 1516074, 1200432, 845617, 578258, 409615, 316613, 258258, 214417, 177801, 160931, 138845, 118887, 96398, 76233, 65370, 75055, 86958, 81904, 71970, 66704, 75133, 75504, 90453, 117738, 125401, 112466, 103442, 114797, 120734, 131106, 150820, 183452, 234268, 305003, 406872, 579534, 771032, 890590, 891833, 756763, 542855, 370377, 259897, 187879, 142631, 123261, 103073, 94609, 80411, 77897, 76190, 90431, 88580, 80576, 72259, 62990, 43202, 32957, 30957, 32535, 32857, 26547, 24547, 22177, 32611, 31804, 33976, 46139, 60291, 74425, 98058, 124026, 115309, 101778, 84237, 91598, 98634, 97880, 115991, 147098, 207762, 266353, 314794, 317887, 277626, 218383, 172174, 135906, 103174, 83001, 71985, 77906, 72596, 72657, 64156, 57687]
13049E7687m274Q292r649j5512o271k439M313J3434J2122Q093P20o918k316Q372
13035F5654J8617K621m731q716j3588k3315r146P719J5121O653K280k0307j5149
13022B3713O470j459j7100j9791p407L833J5691J7229J9479J7181O91O079N293
13009F9902m722J105o33n62L041Q188q426L086K0329m187j1808n156m424N336
12995G1069o269K71Q746q848J0471P805m85j9853O926Q186n300l564L497N440
12981G8092q752o784m047r156L827Q483o535o138K389r799J396R146N004J1548
12967F8674J6451L9207K3891J1886J648N089L512j563j684K5609K7223k10k8302
12954A91431l9799m4755l4634N14Q005p636l570l570n702j1503L696n571J437
$$ y = [57687, 53413, 61705, 52056, 36544, 30273, 27834, 32147, 45581, 57703, 65796, 66516, 59598, 57282, 65654, 84271, 86892, 82161, 73445, 59857, 36542, 27396, 35115, 50236, 56889, 59169, 38862, 23713, 30183, 28724, 11624, -8167, -15574, -11741, 3950, 21179, 40658, 57839, 58530, 64609, 69902, 65180, 66285, 65652, 65090, 68131, 76319, 67893, 70979, 91308, 87121, 75313, 70157, 65733, 71069, 64800, 65071, 73817, 64969, 75440, 83245, 82760, 62907, 69833, 78019, 72719, 69155, 72652, 78092, 69340, 62556, 58509, 49353, 53180, 61663, 55128, 48990, 51379, 41580, 42976, 52122, 57126, 68674, 85125, 124332, 148223, 160109, 161757, 166846, 170358, 168795, 167111, 192720, 219943, 219733, 191431, 151632, 106877, 72243, 72757, 80762, 73126, 69556, 65986, 60284, 48781, 52477, 46906, 48343]
12941D8343Q72K517O292L780m750J5929J951j7844L334k436n159j2068o429m327
12927C0005r715L78K0620J6692J3865M10M42r153K82Q546m468J1574J1369J7796
12913A08643K473n060J576J3854Q631J1709m724j306J4090K3628J0426M43m690
12900A79693J8596L3949M2286L0222J7118K745j1906l9127n4762l4197m317j6032
12888A64268k4682j3576n209O237Q866r482M359N530k036j1969J2720J5632j3936
12875A36722j9906M404o886k5683M011n899r281J142R008L3258L9473Q0205J33295
12862C73863J31372N8164l4342n7898o6619m7563k8098j8781K927k917j6815q506
12850B84787k032j1084j5943j7868k805J2255r205k4136k4294j5413l096K881
$$ y = [48343, 49215, 51732, 58024, 61804, 57054, 72983, 74934, 57090, 60424, 57988, 52829, 40761, 34332, 30005, 20290, 20668, 41288, 57980, 71845, 72255, 72697, 63544, 63826, 72372, 67904, 79478, 90847, 108643, 111116, 106056, 107632, 121486, 130117, 141826, 137102, 135796, 149886, 173514, 183940, 184383, 179693, 198289, 232238, 274524, 304746, 321864, 324609, 312703, 273576, 218814, 184617, 180300, 164268, 139586, 126010, 120801, 127038, 135904, 126422, 130781, 136311, 134275, 122306, 135026, 150658, 136722, 116816, 121220, 114334, 88651, 92662, 86763, 77482, 78624, 87632, 120890, 160363, 240568, 373863, 505235, 563399, 529057, 471159, 404540, 356977, 328879, 310098, 313025, 310108, 293293, 284787, 282755, 271671, 255728, 237860, 235055, 247310, 238105, 213969, 189675, 174262, 171166, 174047]
12838A74047n907J1212k752l0182n6040n5382k3470j378O409L1067M0362L8947
12826A26933L5542J4991J083k2812n545Q989L623m728o852J0501J5462J8442M871
12813B00500r928O637O601N233J2049Q763L170K8173K8207o634O773p040j4806
12800B67698J9138K0223J365k72j487j9674r775O957L1881J8822J7811J2624K3730
12787C89041J9693R554Q815J7518J2278K187m326o69R853P015K926Q174M477O251
12773D92787J6777J7023L2689J6073lR728j101J161K1253K0929L2312L1908K1209
12760G12745L1508L9088K0348M023J3628K6685L7619M9489K7497M3350P4769R6386
12748A177135J31743J57171J63045J82230J95764L02680M60719M87969K71341
$$ y = [174047, 168140, 179352, 176600, 146418, 90378, 34996, 11526, 10148, 16557, 47624, 87986, 126933, 162475, 177466, 178549, 155737, 150192, 159181, 162804, 158076, 151224, 161725, 177187, 195629, 200500, 190572, 197209, 203810, 209043, 221092, 229855, 233025, 261198, 289405, 282771, 289544, 282504, 267698, 286836, 307059, 308424, 308152, 306665, 286991, 277216, 284173, 316054, 334876, 352687, 365311, 389041, 408734, 418288, 427103, 444621, 456899, 459086, 454760, 454091, 463944, 470959, 473885, 482059, 486536, 492787, 509564, 526587, 559276, 575349, 575346, 585074, 583973, 585134, 606387, 627316, 659628, 691536, 712745, 744253, 783341, 803689, 807712, 821340, 848025, 885644, 935133, 962630, 1005980, 1080749, 1177135, 1308878, 1466049, 1629094, 1811324, 2007088, 2309768, 2770487, 3258456, 3529797]
12739C529797j02052k76472k34193j18468L225J05202J51480K11766K64352K99151
12729C833788L40896L64083L88328M75428N82452O95246Q15447R79263J181110
12720I656041J463389J772175K132146K715568L518871M621010O055450P954400
12712C9889050J0970156J6490252K6587785M3549268O3094325O2279412J9721209
12705B82581457l4631349o3602496o0691603m2588175k5861529j5334790r667173
12698C0204342o710664m970280l705286k746338k040530j504438j117127q62628
12690F547051o80814m89292l33514j81320m1356J17009L55538N11622L21412k14988
12680E911348p26118r30909q33743o34367m68627l51687k78250j80962j17421
$$ y = [3529797, 3427745, 3151273, 2917080, 2798612, 2801837, 2907039, 3058519, 3270285, 3534637, 3833788, 4174684, 4538767, 4927095, 5402523, 5984975, 6680221, 7495668, 8474931, 9656041, 11119430, 12891605, 15023751, 17739319, 21258190, 25879200, 31934650, 39889050, 50859206, 67349458, 93937243, 137486511, 200580836, 262860248, 282581457, 247950108, 184347612, 123656009, 81067834, 55206305, 39871515, 30204342, 23493678, 18523398, 14818112, 12071774, 10031244, 8526806, 7409679, 6547051, 5866237, 5376945, 5043431, 4862111, 4820755, 4937764, 5293302, 5804924, 6126336, 5911348, 5185230, 4254321, 3420578, 2786211, 2317584, 1965897, 1687647, 1506685, 1389264]
12671A389264j03011r7921j04950r8388o9692m2588k2110o030j2364l1015n4475
12660G46720n6097m3695k8780l8069o5790o1880m2764j4819j2499j1708q625J405
12648C63399k6565p025j6250j9800k3114j120J1683J0886o111L090l014j5607
12636B70452o041K214Q381N807J7253K2773K9373L8175N9782R6012J03248J40265
12624G87694K06725L22060M64848N91651N78294K44789k46501n56036o09688m80975
12614A302861l27255k25594j67964j13260j09209q4804n1699k7581k4438r967
12604A61090m223j5938k1021j3150o184J326Q051M538Q254q727n283n241k300
12591A01192k1394K469R077k7017p581O478M2930N2950N1837M7542K4807l161
$$ y = [1389264, 1286253, 1188332, 1083382, 984994, 915302, 872714, 850604, 844574, 832210, 801195, 746720, 690623, 646928, 618148, 580079, 514289, 452409, 409645, 394826, 382327, 370619, 361994, 363399, 336834, 329809, 313559, 293759, 270645, 269525, 281208, 292094, 285983, 289073, 286059, 270452, 264411, 266625, 275006, 280813, 298066, 320839, 350212, 388387, 448169, 544181, 647429, 787694, 994419, 1316479, 1781327, 2372978, 2951272, 3196061, 2949560, 2393524, 1783836, 1302861, 975606, 750012, 582048, 468788, 359579, 274775, 223076, 195495, 171057, 161090, 156867, 140929, 119908, 106758, 100574, 101900, 109951, 114489, 122743, 114016, 108733, 103492, 101192, 79798, 82267, 91344, 64327, 56746, 63224, 106154, 159104, 210941, 258483, 283290, 280129]
12579B80129l2264o0780n7525m7022j0889L727l171j4049q575j8427k2479j5550
12567f875j2383k0024m522o339j9830j0890j3261l0341j9159J721r001j5340l0597
12554a96841n1752o0829q1911k351Q5761J41310J26365P0684J6901P519Q683n956
12542E7583p493K157o848k3254j0679k569j995K005n703k983o137p854j2341P629
12528a8482q288o225J0832J4141l62K13j1275J169j3153P628K5446L9445M1961
12515H3050K4636O365j7695k9562m0124k2827j776p780k1480j2221r111j5971
12503f4496K4191K8436J2527o267r98K0547j380P678n33k1040L168K0202K030
12490B4065k0732J101J1918J9403J1735p046L530M387q23r839m264l739j8116
$$ y = [280129, 247865, 187085, 129560, 82538, 71649, 75376, 72205, 58156, 49581, 31154, 8675, -6875, -19258, -39282, -43804, -50143, -69973, -80863, -94124, -124465, -143624, -141903, -150904, -166244, -196841, -248593, -309422, -391333, -393684, -307923, -166613, -40248, 30436, 47337, 54856, 63539, 57583, 50090, 52247, 45399, 22145, 11466, 8897, 6902, 8907, 3204, 221, -5916, -13770, -26111, -18482, -26770, -32995, -22163, -8022, -8384, -8171, -19446, -18277, -31430, -23802, 1644, 41089, 83050, 107686, 114051, 96356, 66794, 26670, 3843, 2067, -5713, -27193, -39414, -48525, -64496, -40305, -11869, 658, -5609, -6607, 13940, 12560, 20238, 19705, -1335, 1833, 22035, 24065, 3333, 4434, 16352, 35755, 47490, 40444, 43974, 48361, 47538, 37699, 33435, 29696, 11580]
12477A1580n812R326j0468j8290j580J427p640R917k732J677J005o254N183J8061
12463E400M34j2777n475K1109K2336Q975k1849j7119p899J3132l820j3359O725
12450d187L105J77q336J4098J0814n077o556p071l491J0381O173j3047j1368m142
12436a8527O219n475j8758N212J8470P066k222l856J276o414k1942j1063j757
12423e1771J2562O263j714Q87L978o907q315J1149J7423R661j688L774l064k2057
12409b9819r290k52J595L903j580N021j5320N925j4908n373L992J7174M0089M9500
12395E0657K0769n604j1227l0754k8886j9099M927J989m892r744j0722K743K621
12382c7222M812l132N219J1308r665o9L737p010K757J0688R126J840r897j357
$$ y = [11580, 5768, 15094, 4626, -13664, -15244, -13817, -21457, -11540, -14272, -12595, -11590, -17844, -12661, 5400, 5834, -6943, -12418, 8691, 31027, 40002, 18153, 1034, -6865, 6267, 2447, -10912, -4187, -1082, -905, -9241, 4857, 15671, 10594, 4038, -3033, -6524, 3857, 10030, -3017, -14385, -18527, -12308, -17783, -36541, -31329, -12859, -5793, -8015, -11871, -10595, -17009, -38951, -50014, -51771, -39209, -32946, -34660, -33773, -29795, -36702, -45017, -33868, -16445, -6784, -8472, -4698, -7762, -29819, -39109, -39361, -37766, -33863, -35443, -30422, -45742, -39817, -54725, -60098, -56106, -38932, 1157, 50657, 71426, 65822, 54595, 23841, -5045, -24144, -19217, -17228, -22120, -31864, -42586, -39843, -37222, -32410, -35542, -30323, -19015, -28680, -28749, -25012, -32022, -29265, -18577, -9451, -7611, -17508, -18865]
12368a8865L065L994M295Q887j122o355m045j140m461P617j1565j9975O655J6241
12354a6774O29J474k625L024J1033Q494l190Q316m12j4407k971k867N50k285j68
12339a2179J1014J0017Q641k301m443k0470o851j198L404R559n604r520L485L194
12325a3252k940Q988k073m759R54m753p342p904J0377R167J1364J2292R976l623
12311A6472j0273j2262l157j9225j2548P116O489J3604J9824R573j3980j6304
12299a4671j6646J0517J7206M118O284j0398l650P736r416q289j2055J1348P466
12286a0450J1799K5936m372j0454M308l722j7157R434J7642K755K116K864K1098
12273E1797r339l214K5148J6126J0495K6723M1395O9917Q3191J11124J91281K93018
$$ y = [-18865, -15800, -11806, -7511, 1376, 254, -6101, -10146, -11286, -15747, -8130, -19695, -39670, -33015, -16774, -16145, -14671, -17296, -14272, -3239, 5255, 2065, 10381, 9969, -4438, -7409, -10276, -9726, -12011, -12179, -1165, 8852, 17493, 15192, 10749, -9721, -16572, -17770, -14366, -4807, -10411, -19931, -16446, -13252, -16192, -7204, -9277, -14036, -13082, -17835, -25177, -33081, -22704, -13537, -2173, 10119, 20095, 16472, 6199, -6063, -9220, -28445, -40993, -33877, -27388, -13784, 6040, 15613, 1633, -14671, -31317, -20800, -3594, 524, 6808, -3590, -7240, 496, -8920, -17209, -29264, -17916, -10450, 1349, 27285, 22913, 12459, 16767, 13045, -4112, 5322, 22964, 25719, 27835, 30699, 51797, 42458, 39244, 64392, 80518, 91013, 117736, 159131, 229048, 312239, 423363, 614644, 907662]
12261I07662L35800J80157j00530k84247l20577k50038j75228j07822n4246m0566
12251I0365l1740p613r200k5925r253j6600n111j1559k6855j9631q097L0356O4955
12238A4092M4819K6217p254q667m179q190j9024j0745K820J2737m029R66l294
12225C6269J0764r34j7113p890j2665j9615l746J092k015P59O413J5239R00q781
12211a323M836K3576M688k2461J61L725o553J0106j881p115Q861n627j8569r150
12197a6726o109P188J9235m255q017j208j532l643J7852J6005j4598n062J113
12184B43N369o474J0684J1112k0294n561J0852J0909L987L171N40j312j3166n564
12170D496M557m408M967l790O290r639j8308J2060r000j3949J0618j1406l63J3847
$$ y = [907662, 1243462, 1423619, 1323089, 1038842, 718265, 468227, 292999, 185177, 130931, 90365, 58625, 51012, 41812, 15887, 6634, -9966, -15077, -26636, -53491, -73122, -81219, -50863, 14092, 58911, 85128, 77874, 69207, 65028, 56838, 37814, 27069, 29889, 42626, 38597, 39563, 36269, 47033, 46099, 28986, 21096, 8431, -11184, -14930, -13838, -15853, -15094, -8681, 6558, 7458, -1323, 3513, 27089, 31777, 9316, 9477, 13202, 6649, 16755, 14874, 7759, 16620, 10993, -7576, -16726, -22835, -15647, 3588, -667, -8684, -9892, -11424, -15067, 2785, 18790, 4192, -870, 243, 5612, -862, 9822, 20934, 640, -4921, 5931, 16840, 20827, 23998, 24538, 23226, 10060, 4496, 9053, 4645, 9612, 5822, 12112, 2473, -15835, -3775, -12775, -26724, -16106, -27512, -27875, -14028]
12156a4028m293q480P047j030j1307J3783J8774k640Q83O091k338PJ388r494P869
12141B232j5399L36j3041O78N526O35Q692R761q147o972R472n621n711J03P905
12126i551R697j0599q572k681p808n791J9530O718j3931j4623P073J7064J0390
12113c084j1801o336M911l748j3146j112Q876l860R179n609M902J8491n736j8308
12099b6381J9674J4915L056j2949j2403J384J0993O100j585r118p4q552K135J698
12085a1107j5882q675J1673J434L811P232P157J4984M016k0922l050L064m481
12072a0746k857j973m242m021J2402J5864k434O735R273K556j9297k0433n896
12059b5069J560j884R908R309j7489m465L911K686J881q986K642R158k719J4181
$$ y = [-14028, -18321, -26801, -19754, -20784, -32091, -18308, 466, -2174, -1291, 4800, 2462, 2469, 3857, -5637, 2232, -13167, -12831, -25872, -25194, -19668, -19033, -10341, -580, -8727, -15699, -6227, -11848, -17559, -17456, -9551, 146, -10453, -19025, -21706, -29514, -35305, -15775, -9057, -22988, -37611, -30538, -13474, -3084, -14885, -21221, -16310, -20058, -33204, -34316, -25440, -29300, -20121, -25730, -20828, -2337, -8073, -26381, -6707, 8208, 11264, -1685, -14088, -12704, -1711, 4389, 2804, -6314, -6388, -14940, -12805, -11107, -26989, -35664, -23991, -22557, -18746, -11514, -4357, 10627, 14643, -6279, -9329, -6265, -10746, -13603, -15576, -19818, -23839, -11437, 4427, 1993, 8728, 18001, 20557, 1260, -19173, -25069, -23509, -25393, -15485, -6176, -23665, -28130, -24219, -21533, -19652, -28638, -25996, -16838, -19557, -5376]
12045e376o341J479j4104J0603M817M868K122k4449j6572J3756m60R520j174n463
12031b6774Q781J1767K043Q073k595L121q722m7N55j2780P181J608n115R948k31
12016c187j3237M986l889q305J960J1329Q624K791j124p726j2116J2004N134M434
12002A678P389p706k310J0494p653j4562j594N284J8692j0734n613k137N313j2270
11988a5729q015O365J3467R553m899j6857r953n12N537O458l542L449L212m877
11974a6343p867M787N999J8425r57j1635j1675L162P242R03l932N44J2453Q81
11960A987k959j4130J3797K963p334r279j9713q07O112q673J7065n497L147J2612
11946a0709P676K807l030P042k512M582L411j6259O25n606j3321L915M343Q539
$$ y = [-5376, -11717, -10238, -24342, -13739, -8922, -4054, -1932, -26381, -42953, -29197, -29657, -20137, -21311, -26774, -17993, -6226, -4183, 3890, 1295, 4416, -4306, -4353, -3798, -16578, -9397, -7789, -12904, -2956, -3187, -16424, -11438, -15327, -23632, -21672, -10343, -1719, 1072, -52, -7778, -19894, -7890, -2756, 1678, 9067, 1361, -949, 9545, 1892, -12670, -14264, -8980, 9712, -1022, -6635, -8772, -3459, -15729, -23744, -17379, -3912, 5641, 742, -16115, -26068, -26580, -21043, -14585, -18127, -14678, -11466, -16343, -24210, -19423, -13424, 5001, 4044, -7591, -19266, -16104, -8862, -7959, -11891, -11347, 1106, 1987, -972, -15102, -1305, 1658, -5676, -14955, -34668, -35475, -29363, -38036, -20971, -26468, -23321, -10709, -3033, -226, -3256, 3786, 1274, 5856, 9267, -6992, -6367, -11973, -25294, -21379, -17036, -8497]
11932h497l703N521L359j069n366K821k050j55P937K2185p349r083j2971q351
11918a6771J0288J4018L414j4015n132l548r662n299j898J0612J8521o143j5284
11905b0899j0821m986N925J0427M52n507o479L063P234j884l944O910j129J144
11891b0494O432K290l402K127R472n407L069J3130Q414L477r286J553N512l523
11877A3364N986m841o888m274K313M467R485P548j0124n742j4087j5629r536P799
11863b0159j986o929J3502J4666J854j86K0991J2925o394r104p597Q823j247l552
11849A5607n781j473J950q55O670N527m840j6700m558J0119n81n557J128L184
11835C840P763R490p437j4011l993j505O754l298n179o111J5490l028k1680K002
$$ y = [-8497, -12200, -6679, -3320, -4389, -9755, -6934, -8984, -9139, -1202, 20983, 13634, 4551, -8420, -16771, -6483, 7535, 10949, -3066, -8198, -11746, -21408, -26707, -28605, -17993, 528, -5615, -20899, -31720, -36706, -30781, -20354, -19902, -25409, -31888, -28825, -21591, -23475, -27419, -20509, -21638, -20494, -14062, -11772, -15174, -13047, -3575, -8982, -5913, 7217, 15631, 19108, 9822, 11375, 16887, 13364, 19350, 14509, 7621, 3347, 5660, 10127, 19612, 27160, 17036, 11294, -2793, -18422, -27958, -20159, -22145, -29074, -15572, -906, 948, 762, 21753, 34678, 28284, 19180, 11583, 20406, 19159, 15607, 9826, 8353, 10303, 9448, 16118, 21645, 16805, 105, -4453, 5666, 5085, -472, 656, 3840, 11603, 21093, 13656, -355, -4348, -5853, 901, -2397, -7576, -13687, 1803, -1225, -22905, -20903]
11821b0903P239k62J2908l81k1125m825J2051l313J5710J0661N296q994r483J535
11807c886R612J5970M026j4164p719p572K687R461j2010l197k665j6257K189R759
11793a3766N909P538K810J544r133j7762J0257J2953m914q813R283J0399J6560
11780B2865M634k4659j7317r784j6767L342J7588J8881j588m481r233k232m75
11767a9226N357P985j4636m413J8981J0950q384N829Q483M807N693L416j2468
11754A2374k599L418j2388J2780J5581J0132j668r312k2206k0404k483J6775L480
11741C480n181j597j954n622O662J3435J905J646j033l13K001m946J0419j798
11727A7104J010r113n309O848j0366j88j2198j1926n045J3372P339N519J938K0821
$$ y = [-20903, -13664, -13926, -1018, -1399, -22524, -27349, -15298, -18611, -2901, 7760, 13056, 4062, -5421, -3886, 5726, 21696, 25722, 11558, 3839, -3733, -1046, 8415, -3595, -6792, -9457, -25714, -23525, -13766, -7857, -319, 2491, 4035, -5098, -22860, -12603, 350, -4564, -13377, -4094, 6305, 22865, 27499, 2840, -14477, -24261, -41028, -37686, -20098, -1217, -2805, -7286, -16519, -18751, -19226, -13869, -5884, -20520, -24933, -5952, 4998, -3386, 2443, 10926, 15733, 21426, 24842, 12374, 9775, 13193, 805, 13585, 29166, 39298, 37630, 28318, 6112, -14292, -16775, 0, 3480, -1701, -3298, -5252, -10874, -4212, 9223, 11128, 12774, 11741, 11428, 13429, 8483, 18902, 17104, 18114, 9001, 3692, 10540, 174, -14, -12212, -24138, -29183, -15811, -8472, -2953, -1015, 19806]
11713A9806j3786j9238j566J4377J1675o298l122J775j5354r54J3555Q296n12
11700H654j0412o197q507J655R634J2022p457L912m711j346Q304p080n416J616
11686e329k573j3890O535J4783J0096J1906n319j236l083n419P133m419j4931
11673e746n61J2882O43n711r807n589j473o119Q545N564Q534P273P922p821j4086
11658e550K658K97k1028P863Q748J3105P604M163N285J4376R402j5626j2443q418
11644A0436j3980k2310J763J7153P385K140M985q517l989J4716O791j5394m560
11631c381J7792J156m588j0886m870K900P46J2383J219o032r453p166K423R609
11617A852p70r92P553j217N663K55j0056j473J1432N415k534k0722l406L518K266
$$ y = [19806, 6020, -13218, -14784, -407, 11268, 4970, 1848, 3623, -11731, -12685, 870, 9166, 8654, -1758, -7955, -16462, -14807, -5173, 6849, -608, 3304, -1407, -2753, 5551, -1529, -6945, -5329, -7902, -21792, -15257, -474, 9622, 21528, 16209, 14973, 11890, 6471, 13604, 9185, -5746, -6307, 6575, 7218, 1507, -8300, -13889, -15362, -21481, -12936, -7372, 1162, 8435, 16357, 8536, -5550, -2892, -2595, -23623, -15760, -7012, 6093, 13697, 17860, 23145, 37521, 46923, 31297, 18854, 10436, -3544, -25854, -24091, -6938, 447, 2587, 7572, -945, -4934, 9782, 16573, 1179, -3381, 14411, 15567, 10979, 93, -4777, -1877, -1131, 11252, 12471, 6439, -3014, -10180, -7757, 1852, 1082, 90, 7643, 6426, 12089, 12344, 2288, 815, 12247, 17662, 15128, -5594, -9000, -5482, -3216]
11602c216q013R516M387j1756Q891k046M972R349N795j6129q487p00J3879K3744
11588C0186m330k1230r235O01R762p661J6641N291p678j8359o48J2692M483o268
11574D247k807R08n699j600q085p359P76O827N368q33Q88m319j054O161j6205
11559b2786n842j0440p277R292J6083Q31n665j884J4206J4904m341p133m079M316
11545i815J3295n147j129k329J809P805P401N745n296j5413J3600J734P463o17
11531A9106m0k747q62r019J2569k1087j3109J0332J2082L957K0560M615j7903
11518A8454j9664j4615k942K1979L28M893j795q470l488j1475N12J2453J735Q207
11504F112p592j1228o196L531J0533J6010N933J1454k1445m960J1501O285j1421
$$ y = [-3216, -11229, -1713, 2674, -9082, -191, -2237, 2735, 12084, 17879, 1750, -6737, -7437, 6442, 30186, 25856, 4626, -4609, -4008, 5754, -1907, 14734, 20025, 12347, -6012, -6660, 6032, 10515, 4247, 1440, 2348, -3351, -4951, -13036, -20395, -19619, -12792, -7424, -8257, -7369, -11688, -12742, -6581, -22786, -28628, -39068, -46345, -37053, -20970, -20139, -25804, -27688, -13482, 1422, -2919, -10052, -14131, -9815, 3480, -1667, -2796, -5125, -3316, 4489, 11890, 17635, 12339, -3074, 10526, 12260, 19723, 19106, 19066, 16319, 15457, 6438, 19007, -2080, -15189, -4857, 7225, 11182, 31742, 36357, 18454, -1210, -15825, -18767, 3212, 3540, 8433, 6638, -1832, -5320, -16795, -16283, -3830, -2095, 6112, -1480, -12708, -18904, -15373, -4840, 11170, 17103, 28557, 7112, 2152, 13653, 19938, 8517]
11491H517o544j1810J2590J3496n168r63J889p724l024J3698r396q234J296j156
11477b533l006Q560O169n781o782M375L900J0502q404j4126P286K5103m137j2453
11463H673k217K233L879k466j971j0947O577J1413R918L904j3433o905P960J845
11449A8463r173q258j092K3548J793r727k096o338j4204k144L641k690l468L886
11435g859K846L448l192J7785M377o541p053l808q373K502P415L093N238J791
11421A1669O01l422R142p066j1508J4641P43k0414L108K600L257K783P492K063
11407A5689R663p642j7517j3028r93o646m353J1004k073K295l316R676K0305O970
11393B0034J867p977q632o99J9622K73j3387p468O235Q508l288m248j8680j8433
$$ y = [8517, 1973, -9837, 2753, 16249, 11081, 10118, 12007, 4283, 1259, 14957, 5561, -2673, -1377, -2533, -5539, 3021, 9190, 3409, -3373, 1002, 4902, 15404, 7000, -7126, 160, 25263, 21126, 8673, 6456, 8689, 12568, 10102, 8131, -2816, 3761, 15174, 25092, 28996, 15563, 8658, 16618, 18463, 9290, 1032, -60, 23488, 25281, 15554, 13458, 7120, -7084, -9228, -5587, -8277, -11745, -7859, -5013, -1565, -4757, 13028, 17405, 10864, 3811, 3, -8370, -5868, 1547, 4640, 9878, 11669, 12270, 8848, 17990, 10924, -584, 14057, 14800, -5614, -2506, 94, 3351, 6134, 13626, 15689, 25352, 17710, 193, -12835, -13828, -20474, -24827, -13823, -15896, -13601, -16917, -7241, 13064, 20034, 21901, 13924, 5292, 4593, 24215, 24488, 11101, 3633, 9868, 18376, 15088, 10840, -7840, -26273]
11379b6273M862J3267J7690Q047j664k765J746O875q002k652l98L502k884k233
11365I118k735R902J1656j6437J7306j01j5974N288L034J1230R975o667j4641
11352B0954n546L571j922Q888K157j2791j5214J0906J4449L641J2159m175j4098
11339B2979P261J0768n381M283O564N23r200n261L471O284j2166j7161m84J1941
11325B4421o211k485O80o375L132P867R41j0714M194K1509J9032K372k0819o427
11311C1117J0942k401P428j4763p863J73m174Q224l711J3326R419n280k4649o198
11297A1590O492R036m139J2698J8409P38j3862o135J903R153J1510N017m759k019
11283E5632k3256j8342J0279n043N104k814j79J5229M124l558M263j9748k678
$$ y = [-26273, -21411, -8144, 9546, 17593, 15929, 13164, 14910, 21785, 13783, 11131, 10733, 14235, 11351, 9118, 6383, 16285, 27941, 11504, 28810, 28709, 12735, 18023, 21057, 32287, 42262, 35595, 20954, 15408, 18979, 17057, 25945, 28102, 15311, 97, 11003, 25452, 29093, 41252, 37077, 22979, 30240, 41008, 35627, 39910, 46474, 46997, 37797, 32536, 36007, 42291, 30125, 12964, 12480, 24421, 18210, 15725, 16405, 10030, 13162, 21029, 21970, 11256, 15450, 36959, 55991, 58363, 37544, 31117, 42059, 39658, 47086, 32323, 24460, 24633, 20459, 28683, 24972, 38298, 47717, 42437, 17788, 11590, 18082, 27118, 22979, 35677, 54086, 54824, 40962, 34827, 36730, 45883, 57393, 62410, 57651, 55632, 32376, 14034, 24313, 19270, 24374, 21560, 21381, 36610, 40734, 37176, 41439, 21691, 19013]
11270A9013J4421J926J0479j994O819m757r282j156Q139J999l989Q889L071j1178
11256D2400r412O06O141Q427M660m487J0263J700j7059q930n265M482j732J1645
11242D3439j6807j4151J431Q596Q122m989J4017L243O688L66n140J542j421R8
11228D5034r55K415n315j3974n421p03R435J6531J6057o83j4714r330P565j4354
11214C1588k699M466Q724J511r22J4810k288N384L472r564k0920k941K754J9193
11200E2568J0813N644O586J3601J546j0772k0679j8859J6748O397O86Q409j8354
11187E4334j0889R585J1474K1259J3543n99j028j2230j4911o019J3525J2603k289
11174H8358m005J0806o342k8859k1195J4354J6102j101M307l68j1121N39K39j362
$$ y = [19013, 33434, 35360, 45839, 43845, 50664, 45907, 36625, 35469, 43608, 45607, 41618, 50507, 53578, 42400, 32988, 33594, 39735, 48162, 52822, 48335, 58598, 60298, 43239, 34309, 29044, 33526, 31794, 43439, 26632, 12481, 13912, 22508, 30630, 25641, 39658, 42901, 49589, 49955, 44815, 46357, 44936, 45034, 44079, 46494, 41179, 27205, 21784, 21081, 30516, 47047, 63104, 62421, 47707, 38377, 45942, 31588, 28889, 33355, 42079, 43590, 42668, 57478, 55190, 60574, 64046, 54482, 33562, 30621, 33375, 52568, 63381, 69025, 75611, 89212, 90758, 79986, 59307, 40448, 57196, 63593, 64279, 72688, 54334, 43445, 53030, 64504, 85763, 99306, 98707, 97679, 85449, 70538, 64519, 78044, 90647, 88358, 84353, 95159, 88817, 59958, 38763, 53117, 69219, 68118, 72425, 72057, 60936, 61475, 61714, 60352]
11160F0352j1418j599J2653J1652Q469J7150o122j5370J283l214j4519j5093M741
11147D8965J0325J119O505J2262J5343n552l649Q801K76j740R807j4371j5394
11134G2697J0369O831J2484J808j0310j925J6870p445j2872J3393L097j0150o718
11121H8129Q090j1580r509J0346J9778j027q176Q625R642Q29j2786J821J3332
11108A17514K0455j255m787J786o881p541l645O475N397L03M640Q044j534j2264
11094A26707j142K2544K183L655M333L259l607m487J179j908M95N207r711q921
11080A39786Q811K538O029N788J22J957J0943M507q741N230J1754r32P106p317
11066A87581q893J1108p67n386J0707l89j0584J1895J0175n17J4532o79Q79Q910
$$ y = [60352, 48934, 47335, 59988, 71640, 80109, 97259, 91137, 75767, 77050, 73836, 59317, 44224, 48965, 59290, 60409, 66914, 79176, 94519, 88967, 85318, 94119, 94395, 92655, 102462, 88091, 72697, 83066, 89897, 102381, 104189, 93879, 91954, 108824, 101379, 88507, 101900, 104997, 94847, 88129, 96219, 84639, 75130, 85476, 105254, 104227, 96051, 104676, 114318, 115147, 102361, 104182, 117514, 137969, 136714, 131927, 133713, 126832, 119291, 115646, 122121, 127518, 127821, 132461, 140505, 138971, 126707, 125565, 148109, 150292, 153947, 158280, 161539, 157932, 153445, 154624, 152716, 153211, 158418, 148707, 139786, 148597, 151135, 157164, 162952, 163074, 165031, 175974, 180481, 171740, 176970, 188724, 187792, 194898, 187581, 178688, 189796, 189029, 183643, 194350, 193961, 183377, 195272, 205447, 204930, 219462, 218783, 219662, 228572]
11052B28572q028p255R793L276l055J3401J2154p71o862K700J3711K343J117l45
11038B60751j605J370J0404J1296J353O7J1354K3183M509j817K963j725j7193
11025C04910k702K2132J6710j0228O820J1125K6284q35L709J983J2574J1266m894
11012C98854p727R932J3006j7226O887M484M121N637K2373R309Q720K4062J7513
10999D99945J745J5707K3794M677R531K5695J923K130M233J3781J1766J2817K6812
10986F54556J4986O360J4507L17J2813J4295J7778K7040K2859K5939P871K8191
10974H47512K8439L4747K6401L4829K9776J4376P487K2471L7340O4651L7158K9743
10962A214930L3109J8364M6297N3294K8323K4624N0365O2829O2004M7680M5697
$$ y = [228572, 220544, 213289, 223082, 226358, 223303, 236704, 248858, 248087, 241225, 243925, 257636, 259979, 261096, 260751, 259146, 260516, 270920, 282216, 283569, 283636, 294990, 318173, 322682, 320865, 323828, 322103, 304910, 302208, 324340, 341050, 330822, 337642, 348767, 375051, 374216, 377925, 379908, 392482, 403748, 398854, 391127, 401059, 414065, 396839, 403726, 408210, 412331, 417968, 440341, 449650, 458370, 482432, 499945, 501690, 517397, 541191, 545868, 555399, 581094, 583017, 585147, 589380, 603161, 614927, 627744, 654556, 669542, 675902, 690409, 690726, 703539, 717834, 735612, 762652, 785511, 811450, 819321, 847512, 875951, 910698, 937099, 971928, 1001704, 1016080, 1023567, 1046038, 1083378, 1148029, 1185187, 1214930, 1248039, 1266403, 1312700, 1365994, 1394317, 1418941, 1469306, 1532135, 1594139, 1641819, 1687516]
10951A687516N5592N4633M8766O1088P4290O4583N2798P3194R4221Q5030Q4149
10940B435860R3487Q3811R7305Q9135P9727Q4579J13929J08828R1703R8438R9637
10929C476439J13250J18422J34064J15270J25297J36094J25465J44756J39646
10920D628703J19937J11314J39824J44794J29052J47490J28646J36198J39657
10911E825615J23781J34631J39267J29804J19983J16953J23666J02208R8480R8759
10901G013147Q8279R8899Q9216O7928O4131M7643L0573L0234M3343M0108Q344
10890G621845L678j1415j9587k3583k9737l8649m7925o9989o9475p6044r6070
10879G143049r6636j25468j02290j08475j13755j11121j18041j37491j25653j18757
$$ y = [1687516, 1743108, 1797741, 1846507, 1907595, 1981885, 2046468, 2099266, 2172460, 2266681, 2351711, 2435860, 2529347, 2613158, 2710463, 2799598, 2879325, 2963904, 3077833, 3186661, 3278364, 3376802, 3476439, 3589689, 3708111, 3842175, 3957445, 4082742, 4218836, 4344301, 4489057, 4628703, 4748640, 4859954, 4999778, 5144572, 5273624, 5421114, 5549760, 5685958, 5825615, 5949396, 6084027, 6223294, 6353098, 6473081, 6590034, 6713700, 6815908, 6914388, 7013147, 7101426, 7200325, 7289541, 7357469, 7421600, 7469243, 7499816, 7530050, 7573393, 7613501, 7621845, 7625523, 7614108, 7594521, 7570938, 7541201, 7502552, 7454627, 7384638, 7315163, 7239119, 7143049, 7046413, 6920945, 6818655, 6710180, 6596425, 6485304, 6367263, 6229772, 6104119, 5985362]
10869E985362j44446j59864j38305j40250j16293j18955j41813j28900j12182
10860D784354j13813j27172j14602j09317j04010q9976j06359j21793j08769r8803
10850C689740j01367q9524r7490r7122p1360q7613j13011r1741p3563o8241o4812
10839B733896p2392o8309p4409o9977p1947o8110p4435p9356o8258o7092n9918
10828A959693l3160m5312o0679n8062n3979m0953n2518m6708o0070m9386m8223
10817A410643k8470l5013m4587l3771m7544j8477k0145l3638l8724l2344j6750
10806A061180l7000m1571m2767j2589j8586k0898k9305j2699r150p653k5567l5802
10794G67593j3729r008j4720k1957k7385l3127j0435j4252o785n512j6476k2141
$$ y = [5985362, 5840916, 5681052, 5542747, 5402497, 5286204, 5167249, 5025436, 4896536, 4784354, 4670541, 4543369, 4428767, 4319450, 4215440, 4125464, 4019105, 3897312, 3788543, 3689740, 3588373, 3498849, 3401359, 3304237, 3232877, 3145264, 3032253, 2940512, 2866949, 2798708, 2733896, 2661504, 2593195, 2518786, 2448809, 2376862, 2308752, 2234317, 2154961, 2086703, 2019611, 1959693, 1926533, 1881221, 1820542, 1762480, 1708501, 1667548, 1615030, 1568322, 1508252, 1458866, 1410643, 1382173, 1347160, 1302573, 1268802, 1221258, 1202781, 1182636, 1148998, 1110274, 1077930, 1061180, 1024180, 982609, 939842, 927253, 908667, 887769, 858464, 845765, 836615, 828962, 803395, 767593, 753864, 744856, 730136, 708179, 680794, 647667, 637232, 622980, 616195, 610683, 594207, 572066]
10782E72066j4981j8474j1820j5075o544k0207j7303L758k3568q122L870J4599
10770D58199p226j4804j2303r818j1215k877q182j5519j4588j2783l500j1166
10758C34218j292p405r25J662R847P901k6991j9416O010m946j2994n359K43j865
10744B78688r840K755q515r368q17j492r112o880k474R90N278n864k2072r464
10730B01813r624j52m786P138j4829M82r375L884P028N985n213p297q195o173
10716A60686L349o209o446R359J1973q148l4136p810K3820M190m955j3258r409
10703A23006J5225J0246k754J61j915m118m475k582m655M822j484j047J4148j5324
10689A29254j6526k171Q040p021j3122r552M129j1554O314K7845K2122N146j8500
$$ y = [572066, 557085, 538611, 526791, 511716, 505172, 484965, 467662, 471420, 447852, 439730, 443600, 458199, 450973, 436169, 423866, 414048, 402833, 399956, 391774, 376255, 361667, 348884, 345384, 334218, 332926, 325521, 324596, 326258, 336105, 344006, 317015, 297599, 303609, 298663, 285669, 280310, 280553, 278688, 268848, 271603, 263088, 253720, 252903, 251411, 242299, 235419, 232945, 233935, 239213, 233349, 211277, 201813, 192189, 192037, 187251, 194389, 179560, 180042, 170667, 174551, 181579, 187564, 182351, 175054, 166859, 160686, 164035, 157826, 151380, 160739, 172712, 164564, 130428, 122618, 146438, 150628, 145673, 132415, 123006, 138231, 148477, 145723, 145884, 143969, 139851, 135376, 132794, 128139, 132961, 131477, 130430, 144578, 129254, 112728, 110557, 118597, 111576, 98454, 88902, 93031, 81477, 87791, 115636, 137758, 142904, 124404]
10676A24404j8845j3678J35K5521K529N98k467j0278j2674k471J765R964O47j287
10662A03863j945j1308Q549J3421O648j571r991j2273k845o113k337M22M979M813
10648I4312J5244l787j2138k3773q079L167O179j1285J860O145K015J9557p88
10635H8629n386m881l239M533j9042J862L514J1251j2252k7722j366K7250J737
10622F4888r928P511J3374p374O726N592L338j017j6560m088J310Q520m430o475
10608F1387j996r880j4633O992N241j0570o160J0768J780J495j0186o559j007
10595B6672J743k169J0076R507o537o937J7879k789j8299P920K614n635M43O235
10581D0723N802J8882j981j4556p860m395O747n790J2565j0489j1715J876J5665
$$ y = [124404, 105559, 91881, 92016, 117537, 120066, 120664, 118197, 107919, 95245, 92774, 94539, 104503, 105150, 103863, 101918, 90610, 99159, 112580, 119228, 117657, 107666, 95393, 92548, 86435, 84098, 84520, 89499, 94312, 109556, 105769, 93631, 69858, 61779, 64946, 71125, 59840, 61700, 67845, 69860, 89417, 88629, 83243, 78362, 75123, 79656, 60614, 62476, 65990, 77241, 64989, 37267, 35901, 63151, 64888, 54960, 62471, 75845, 68471, 75197, 80789, 84127, 83110, 66550, 62462, 63772, 72292, 67862, 61387, 59391, 49511, 34878, 41870, 47111, 36541, 30381, 41149, 42929, 44424, 34238, 27679, 26672, 28415, 26246, 36322, 45829, 39292, 32355, 50234, 47445, 29146, 37066, 39680, 34045, 34488, 40723, 46525, 65407, 63426, 48870, 41010, 36615, 43362, 37572, 50137, 39648, 27933, 29809, 45474]
10568D5474p349j428j866j631N983J4838J0310j447O824n568j584o864j321k213
10554E2158P984l682L25r54l239K720Q465j5373j1262o957L385K554J950N446
10540D3520j416j2954j22k99r45R311n381m450J0326O344k439o938k662M27R347
10525D1669j9347m29J2497l003p998J335l861n626l302N504J6996P920P165p435
10511D2085Q038j4722j7760j907R624o124O783R525j1368p514Q964L503J13O953
10497C6193K599O58q42j1936rp526r012m78K15M099j249J3462M32o034j1516n601
10481C455q24K838p271j921P425J3202J2343R588o052j2725R700K927J0118K428
10467D5231l294n114j2881p150J6997O307p562m984K609L10o073o697j2745m129
$$ y = [45474, 38125, 36697, 34831, 33200, 39183, 54021, 64331, 62884, 69708, 64140, 62556, 55692, 54371, 52158, 60142, 56460, 56785, 55831, 52592, 55312, 63777, 48404, 37142, 30185, 33570, 36124, 38074, 43520, 42104, 29150, 29028, 28729, 27784, 37095, 31714, 27264, 37590, 43934, 41495, 34557, 31895, 32322, 41669, 22322, 21893, 34390, 31387, 23389, 24724, 20863, 15237, 11935, 17439, 34435, 42355, 49520, 42085, 50123, 35401, 17641, 15734, 25358, 19234, 26017, 35542, 24174, 16660, 25624, 29127, 29240, 36193, 38792, 39450, 38608, 26672, 26663, 19137, 10125, 9647, 9862, 13961, 12712, 26174, 26606, 20572, 9056, 3455, 2631, 5469, -1802, -3723, 3702, 16904, 29247, 38835, 32783, 20058, 29758, 32685, 42803, 45231, 41937, 36823, 23942, 16792, 33789, 40096, 32534, 27550, 30159, 30469, 24396, 17699, 4954, 825]
10453H25J3308k202j1685J604O047R403J0325j1388k182n476j4338R297J981M718
10439A0237o078n329l46J0287j208J942J5326K364k941O80j4341l62J831O460
10425A8522J4403M519l861L182K849N898M297k262j1296o659p143j5911r301J9128
10411A6365J9088l218k741L12n716j895m078n72L110P32N629q852k0216n113Q916
10396A751J1014L0118L237j5717j3650P4o22J2680q502L145j528m282q306L281
10382A2693J2436O972L1o305o875J967K139r710j1010P188L574K3994K155k1485
10368A7764o524J2877J9951R633m124j4146o496N585Q50l380o199o326k281M843
10354B2027p939k444N405K410q444k179Q095K085L987p534n26K2742k647j4160
$$ y = [825, 14133, 11931, 246, 1850, 7897, 17300, 27625, 16237, 14055, 8579, -5759, 3538, 5519, 10237, 4159, -1170, -1516, 8771, 7563, 9505, 24831, 27195, 24254, 24934, 10593, 10231, 12062, 18522, 32925, 37444, 33583, 36765, 39614, 45512, 49809, 47547, 36251, 29592, 22449, 6538, -2763, 16365, 35453, 32235, 29494, 29806, 24090, 22195, 18117, 17545, 20655, 21387, 27016, 18164, -2052, -7165, 1751, 12765, 42883, 46120, 30403, 16753, 16827, 16205, 28885, 20383, 23528, 22000, 17718, 9412, 12693, 25129, 32101, 32132, 25827, 18952, 20919, 23058, 13348, 2338, 9526, 13100, 37094, 39249, 17764, 11240, 24117, 44068, 53701, 49577, 35431, 28935, 34520, 35370, 31990, 25791, 19465, 17184, 22027, 14088, 11644, 17049, 19459, 11015, 8836, 16931, 19016, 23003, 15469, 14943, 37685, 35038, 20878]
10340B0878k2640p289Q929O187J1820r248j0392l02M783m055k538M059J031Q624
10326I847k615l060J3027Q406N547k433p120p990q745o094j372l578N175Q832
10312G827J2715j0932l869O893J1540J94r745r613p801M91M632J930k839J4371
10298A5794k656O089k525p317m347k0880j672M693K818M643N478J1728P964N083
10284B4893n776q624J1921j231j2834J3839J3027q031r243j835j76L366j770N845
10270B3371j639k594p129L909l275j5109j0967J8537J5800M166q660k71P063M040
10256B7242j0867j0181l18K2696K253j5323n497J52K928p28m903p846J252l079
10242b219L279r78q278L939j355q45J0823j427L162j896k388J1791K825j2858
$$ y = [20878, -1762, -9051, -122, 6065, 17885, 8637, -1755, -2057, 2726, -1329, -3867, 192, 1223, 9847, 7232, 4172, 17199, 25605, 31152, 28719, 21599, 13609, 4864, -1230, -2602, -6180, -1005, 7827, 20542, 9610, 5741, 12634, 24174, 24368, 14623, 5010, -2791, -2300, 2332, 4262, 1423, 15794, 13138, 19227, 16702, 9385, 5038, -15842, -17514, -12821, -10003, -5360, 118, 11846, 19810, 24893, 19117, 10493, 22414, 21183, 8349, 22188, 35215, 27184, 17941, 16106, 15930, 19296, 17526, 23371, 21732, 19138, 12009, 15918, 12643, -2466, -13433, 5104, 20904, 25070, 16410, 16139, 23202, 27242, 16375, 6194, 5876, 28572, 30825, 15502, 10005, 10157, 13085, 12357, 7454, -392, 860, -2219, 1060, 82, -8196, -4257, -5612, -6457, 4366, 2939, 6101, 4205, 1817, 13608, 16433, 3575]
10228C575j3993J4161J9497N95m587j5044l406J8782l364j4155K1269J5448M363
10215D3141k4011j7600J0777J666MJ0312P914R6k8147j107J2266K390j0520J324
10201H505K966r85p136r886N287J7467n229j73J891j665M78R503k78l093j1782
10186E870p089J0976j3337L99J7957N522L006m833m753j1349P244L780j3678m666
10172d951P325O729L217J0807m155l218N143n509r058q061J028j0045J1574P984
10158H810q330J5484k681j5467j194p110m696j977N720J5402M459M588l024j5053
10144e069p042J828P488K724J0580R255k403K28j4099O710j3447j701J4736M033
10130A3821j3210k5597N274K0604J9434l323o266q890m457J607J953Q409J500
$$ y = [3575, -10418, 3743, 23240, 23835, 19248, 4204, 798, 19580, 16216, 2061, 23330, 38778, 43141, 19130, 1530, 12307, 13973, 13977, 24289, 32203, 32299, 4152, 3045, 15311, 17701, 7181, 8505, 11471, 10486, 3350, -6536, -1249, 16218, 10989, 10816, 12707, 11042, 11520, 21023, 20745, 17652, 5870, -1219, 9757, -3580, -3181, 14776, 20298, 23304, 18471, 13718, 2369, 9613, 13393, -285, -4951, 2374, 9103, 12320, 23127, 18972, 15754, 20897, 15388, 6330, -1731, -703, -10748, 826, 8810, 480, 15964, 13283, -2184, -3378, -10488, -15184, -17161, -11441, 3961, 8420, 13008, 9984, -5069, -12111, -10283, -2795, -71, 10509, 19764, 17361, 17589, 3490, 10200, -3247, -4948, 9788, 13821, 611, -24986, -19712, 892, 20326, 17003, 10737, 1847, -2610, -1003, 950, 9359, 10859]
10117A0859R503o908o623p48n315J6005J1408m356Q173N018j282o498r389o587
10103A3260k0617R58O874K704k594M11L28L785n149L655P220o282j453O004O651
10088A5755r028j4004q604K97n942J2263J3660K216q73l941j000n74K532j1546
10074h789l478J6206L66r423L327J9718m638j0390O757J2521P158K401j0119n261
10060A6356o707j374J6139J293p414N163n200l714m783J1848K2315L3666M5414
10047A23002L1384j9560l4803k8919j5011k1287l971K111N805j0451r618k031
10035A6651P968j258q336m5l491R089J4411O051M183j1424K586O886j7156r115
10021A7000j5186o645o850m690R262J3282l729q849J2368n468M425J4178L432
$$ y = [10859, 20362, 13454, 6831, 6083, 768, 16773, 28181, 23825, 31998, 37016, 35734, 29236, 19847, 13260, -7357, -6399, 475, 3179, 585, 996, 1324, 5109, -40, 3615, 10835, 4553, 3100, 9104, 15755, 6727, -7277, -15881, -15584, -21526, -9263, 4397, 6613, 5740, 1799, 799, 225, 2757, -8789, -12267, 3939, 4305, -5118, -1791, 17927, 13289, 2899, 9656, 22177, 29335, 31736, 21617, 16356, 9649, 8275, 24414, 25707, 18293, 23456, 18256, 14542, 9759, 21607, 43922, 77588, 123002, 154386, 134826, 100023, 71104, 56093, 34806, 30835, 32946, 38751, 28300, 18682, 16651, 24619, 23361, 15025, 14980, 11489, 20578, 34989, 41040, 45223, 33799, 36385, 43271, 26115, 17000, 1814, -4831, -11681, -16371, -7109, 6173, 2444, -6405, 5963, 495, 4920, 19098, 22530]
10008B2530N852k81k132o154j1390j0163M718J2137j0922J7P763M905O246j136
9994B1990k0062J6714P756j0080Q139n054l579J0483k576n659n769J2451J148
9981B5902p877J107J1334J9391p748m691J0805j1718r851o052Q641J495K330L849
9967C6917J5800L0430J9257J2372K7581K8573L4284O0379P7521J30928K08856
9956F82898L47679M22542K50712j20312l82990m23838k85030j50272j01215o1473
9946A78701l8816k7740k1749o755j5012n797K184q17M76k0367l720J3117J2421
9933F6126R330J5843J585j0736j8212k1492j1932k275j1128j624K70o35n580n959
9919C581M424M904J9422R825l312l820r504p090Q053N803R640j959r56R400r856
$$ y = [22530, 28382, 28101, 25969, 19815, 8425, -1738, 2980, 15117, 4195, 4212, 11975, 16880, 23126, 21990, 1928, 18642, 26398, 16318, 24457, 19403, 15824, 26307, 23731, 18072, 12303, 24754, 25902, 18025, 19132, 30466, 49857, 42109, 37418, 48223, 36505, 26654, 20602, 29243, 30738, 33068, 36917, 52717, 83147, 102404, 114776, 142357, 170930, 205214, 265593, 343114, 474042, 682898, 1030577, 1453119, 1703831, 1583519, 1200529, 776691, 491661, 341389, 240174, 178701, 139885, 112145, 90396, 83641, 68629, 62832, 65016, 64199, 64675, 44308, 40588, 53705, 66126, 75456, 91299, 92884, 82148, 63936, 42444, 30512, 28237, 17109, 15485, 15755, 15120, 9540, 3581, 8005, 12909, 32331, 42156, 38844, 35024, 25520, 18430, 26483, 32286, 41926, 39967, 39011, 48411, 38555]
9904C8555m259k0714p766l403l646Q029R454J4621N271o952j1384O253k590O989
9890B8458J3224Q773Q061m677p055k0292J0135J3210J2836j9702k0420O63P202
9877C0416O607L618J7934J5840K644p530L566n913k35N552J2342J2098o4J1157
9863A08032L165Q350q307K4630K0467J8629K3553J9225M0362O0038P9103R9021
9851D96268J38221K27216L79855O86321J006262R38526J95412o36133j031671
9842B400277q93930n71655l13656j80017j00843o6976o3021l8176j8383j4056
9832A39564k4948k5609j9948Q758J8276j3892j9712J0952J1210j673p910o06j2491
9819F1971j2450j3046O632N500J5394o860o280J1707O813o510j6402l325k6139
$$ y = [38555, 34296, 13582, 5816, 2413, -1233, 6796, 16250, 30871, 36142, 29190, 17806, 24059, 21469, 28458, 41682, 50455, 58516, 53839, 46784, 26492, 36627, 49837, 62673, 42971, 22551, 23214, 30416, 37023, 40641, 58575, 74415, 77059, 69529, 73095, 67182, 66947, 72499, 84841, 96939, 96875, 108032, 111197, 119547, 111240, 135870, 156337, 174966, 198519, 217744, 258106, 318144, 397247, 496268, 634489, 861705, 1241560, 1927881, 2934143, 3872669, 4068081, 3431948, 2400277, 1506347, 934692, 621036, 441019, 340176, 273200, 210179, 172003, 153620, 139564, 114616, 89007, 69059, 77817, 96093, 82201, 62489, 73441, 84651, 82978, 75068, 74462, 61971, 49521, 36475, 43107, 48607, 64001, 57141, 50861, 62568, 69381, 62871, 46469, 43144, 17005]
9806A7005j4376M601J3017q09O356N472j3094M904J7899k180j8147J865O379N097
9792C3989l937M24j08o876O012R861K499j886J030p765N1o104p211L029N167R960
9776C8135J227j211r879J5985O463L371Q331K975m985P981l924j0869j4068Q07
9762D0339o63O264O173m039K501o802o152q238L797O380J0356l42j4436q416J3506
9747D0228K856n416j052J6144m510o167m976N983M427N185R03L73m559P205m464
9732E2160p050j498Q80o774j4429J574L0809K4875L94j8722k8782N172J4184p529
9718D5264j7257q176O747K0804J2147o995p342l610j4332p544q951O455J8015
9705C5225P700J0975O770j723j507K526M751J0047L688k35j3198r33Q784M212
$$ y = [17005, 2629, 7230, 20247, 19438, 25794, 31266, 18172, 23076, 40975, 38795, 20648, 22513, 28892, 33989, 30052, 30476, 30368, 23492, 29504, 39365, 41864, 39978, 41008, 33243, 33294, 27190, 19979, 23008, 28175, 38135, 39362, 38151, 28272, 44257, 50720, 54091, 62422, 65397, 60412, 68393, 64469, 53600, 39532, 40339, 39676, 45940, 52113, 48074, 50575, 43773, 37621, 29383, 33180, 39560, 49916, 49574, 35138, 26722, 40228, 43084, 37668, 36616, 52760, 48250, 42083, 37107, 43090, 47517, 52702, 53605, 53978, 49419, 56624, 52160, 45110, 43612, 44492, 37718, 23289, 24863, 55672, 80547, 80941, 62219, 33437, 38609, 52793, 45264, 28007, 19831, 26578, 47382, 59529, 52534, 45192, 41582, 27250, 19706, 10755, 17210, 35225, 42925, 53900, 60670, 58947, 57440, 59966, 64717, 74764, 78452, 78217, 65019, 64086, 72870, 77082]
9691G7082J609j5125l380J0713Q112K06k59R856j1716j1697J5456J6118k0506
9678G6469m316o283j2105J7534J1921N65l935L479k178p319j2847j5711O427P684
9664E9385p364L831R84J3564Q044k349L429j1444M800J0797P946J1214J0037Q726
9650A21600l374k2444n637j4214J8489O532k730N342k897k14n388M201J6303p939
9636A07630R84J0883O423M618O648k262M99P445n798q069r67p10j691Q796N679
9621A40108l70K1j3814L139k503l501L485K1009L960Q608J1123K781R92n57o861
9606A67620N465o8P011R749j1416j5684J9408P247R304P016J5121n591j215L069
9592B17036Q76q517K396N303k203j248O473n347P869J6390r450j7309J4194N574
$$ y = [77082, 78691, 63566, 60186, 70899, 79011, 79217, 78958, 88814, 77098, 65401, 80857, 96975, 76469, 72153, 65870, 53765, 71299, 83220, 83785, 79850, 83329, 81151, 73832, 60985, 45274, 51701, 59385, 52021, 55852, 56836, 70400, 78444, 76095, 79524, 68080, 72880, 83677, 91623, 102837, 112874, 121600, 118226, 95782, 90145, 75931, 94420, 100952, 98222, 103564, 100667, 100453, 95065, 99266, 115569, 107630, 108614, 119497, 125920, 130538, 137186, 134924, 135423, 142868, 137070, 129001, 128034, 127324, 125633, 134429, 140108, 139738, 139759, 125945, 129084, 126581, 123080, 126565, 147574, 151534, 160142, 171265, 174046, 175038, 174481, 167620, 173085, 173017, 180028, 189777, 178361, 162677, 182085, 189332, 198636, 205652, 220773, 215182, 213967, 217036, 217912, 209395, 211791, 217094, 214891, 213643, 220116, 214769, 222638, 239028, 229578, 212269, 226463, 232037]
9578B32037O350J2568J6569J5302J1156K435K901P641j879J1114J0065M191Q641
9565C39091J3214J3078R663m381L153O014O168J8840K0426J4526k533l947J1972
9552D45284P618P746J5424J5724J3823l950J4688K3334L1224R018N429j025P396
9539E91733K3918N284L3662L7822J7169P435J2206J6352J6538J2377K8195K5863
9527H28554K0957J1219N174K3340K1031M713j1457m452J1066L4262K9317K4089
9515I97813K0571L1936J4108J4613J6581J6959J75K7742K9281K0290M860Q36Q951
9502A204716J3588O58q315j2977k276R106J4574j2426j2982j2350j8201k3711
9490A139404j5764Q490k987j0984N350j0751j7464k6462j4549k4468j3831j8245
$$ y = [232037, 238387, 250955, 267524, 282826, 293982, 296417, 299318, 306959, 305080, 316194, 326259, 330450, 339091, 352305, 365383, 375046, 370665, 373818, 379832, 386000, 404840, 425266, 439792, 437259, 433312, 445284, 452902, 460648, 476072, 491796, 505619, 501669, 516357, 539691, 570915, 579933, 585362, 584337, 591733, 615651, 620935, 654597, 692419, 709588, 717023, 729229, 745581, 762119, 774496, 802691, 828554, 849511, 860730, 865904, 889244, 910275, 914988, 903531, 899079, 910145, 944407, 973724, 997813, 1018384, 1050320, 1064428, 1079041, 1095622, 1112581, 1112756, 1140498, 1169779, 1190069, 1194929, 1195765, 1204716, 1218304, 1218962, 1210647, 1197670, 1195394, 1204500, 1219074, 1206648, 1193666, 1181316, 1163115, 1139404, 1123640, 1132130, 1129143, 1118159, 1123509, 1112758, 1095294, 1068832, 1054283, 1029815, 1015984, 997739]
9478I97739k9337k7510j4236j4164j7015j0093q254k5550l6442k4529j6308o531
9466G67770j1881j5940j5839j9315l0624j7125M552r534r623j5210k4184l6239
9454E66808k2252j2087n180L899j9403r509j3943j9148j7320k5624j5774k235
9442D08232l20m317k2968j1255J6423n218k5079k535n315r346j26j5427j7201
9429C05548j3096n888m001j0389j0692N66k812j3700j5694P559l871j7591r356
9416B06583Q505L549p320L322N259j0085j4918k3987K87J7296k671Q321j0067
9403A84074q840N925m471J557r048j1580p804l116j4250j342J5517j200M339J340
9389A51101m154p381j7855O288O718m736J588p33l299p321j7780n254J3856J619
$$ y = [997739, 968402, 940892, 926656, 912492, 895477, 885384, 877130, 851580, 815138, 790609, 774301, 767770, 755889, 739949, 724110, 704795, 674171, 657046, 661598, 652064, 642441, 627231, 603047, 566808, 544556, 532469, 527289, 531188, 511785, 502276, 488333, 469185, 451865, 426241, 410467, 408232, 407912, 403595, 380627, 369372, 385795, 380577, 355498, 352963, 347648, 338302, 338176, 322749, 305548, 292452, 286564, 282563, 272174, 261482, 262048, 259236, 245536, 229842, 237401, 233530, 215939, 206583, 215088, 218637, 211317, 214639, 219898, 209813, 194895, 170908, 171195, 188491, 185820, 194141, 184074, 175234, 181159, 176688, 178245, 169197, 157617, 149813, 146697, 132447, 131105, 146622, 145422, 149761, 151101, 146947, 139566, 121711, 127999, 134717, 129981, 131569, 130836, 127537, 120216, 102436, 97182, 111038, 112657]
9375A12657q815j576k879n088n396j1371n17K932L886j0613j1331J3924p88m494
9361G0531J979Q385L975O88j6267j0926q38j7383J3027Q928n58M799J5963J1110
9347I3413k716j8647R162l258j5790k2829Q78K3153K3714m889k2857j2796M518
9334E1056j975n777J297J4094k509j2428m469J3088M909j0340j340r77m273m181
9320C6175J108K6703j283n691p157j0728k344M897k151N185p328p737j509J3101
9306D1241O822Q67M85K642p544J846n454j3880P495L739l99j860q217j1158q880
9291G745L24J5646l435q445K199J0010J0555P55K932j514O419l463j2213j9718
9277G797Q306J2302j9572K072P456O083n747l705N573Q722Q970M562j2025j1306
$$ y = [112657, 103842, 102266, 99387, 94299, 88903, 77532, 77015, 79947, 83833, 73220, 61889, 75813, 75025, 70531, 72510, 80895, 84870, 85558, 69291, 58365, 57527, 40144, 53171, 62099, 61541, 66340, 82303, 93413, 90697, 72050, 81212, 77954, 62164, 39335, 40213, 63366, 87080, 82191, 59334, 46538, 51056, 49081, 43304, 44601, 58695, 56186, 43758, 39289, 52377, 57286, 46946, 45606, 44629, 40356, 36175, 37283, 63986, 62703, 57012, 49855, 39127, 36783, 41680, 39529, 44714, 37386, 29649, 28140, 41241, 48063, 48930, 49415, 52057, 44513, 46359, 40905, 27025, 34520, 38259, 37860, 36000, 27783, 16625, 7745, 8069, 23715, 20280, 11835, 14034, 24044, 34599, 35354, 38286, 36772, 43191, 39728, 27515, 7797, 16103, 28405, 8833, 10905, 18361, 24444, 18697, 14992, 20565, 29287, 38257, 42819, 30794, 19488]
9263A9488k200l708j8246q405N806p169J5080K0309P724k939P706P849q556k37
9249C2502q527K441Q695j8772k3233k443J377l340P494K0023M396J147n793q867
9235G100R811l128o734N357R229M66N379m123j0580J807O015P297o01M603J0497
9220D2395j0188j6749J476Q438r505o573k2876o536O713N061J3310M037m74k619
9206E910r491p233P785J2283L096j2001J458R96P560K246J900l252m877L885K169
9191A2434j3152j3859P23K8770K0319l759m557j7270m109R453L871J2039l587
9178B7316r230k406P690m03j7987j2513R54J567R686o665o981J3896J2708R915
9164B7547r866j360k032k590j455M427K690j268M054J2987P674k3139l483J884
$$ y = [19488, 17288, 13580, -4666, -13071, -7265, -14434, 646, 20955, 28679, 25740, 33446, 41295, 32739, 32502, 23975, 26416, 35111, 16339, -6894, -9337, -7960, -11300, -3806, 16217, 20613, 21760, 15967, 7100, 16911, 13783, 7049, 12406, 21635, 22101, 27480, 23357, 12777, 14584, 20599, 27896, 27295, 31898, 42395, 32207, 15458, 16934, 25372, 15867, 9294, -13582, -20118, -13405, -8344, 4966, 9003, 8529, 5910, -3581, -10814, -3029, 9254, 12350, 349, 1807, 2803, 10363, 12609, 14509, 11257, 6380, 10265, 12434, -718, -14577, -13854, 14916, 35235, 31476, 26919, 9649, 5540, 14993, 18864, 30903, 27316, 18086, 15680, 23370, 22967, 4980, -7533, -6579, -5012, 4674, -1991, -8972, 4924, 17632, 27547, 17681, 16321, 14289, 11699, 10244, 14671, 17361, 16093, 20147, 33134, 40808, 17669, 14186, 16070]
9150A6070j6799J395J547l874m872j598j3346K128k666N523J2933m14K122o790
9136h641j5167o705k050J1503P797P630J1647M833L774j4920O049J5737P285j2451
9122A6321j4711R180J140L703j248J919J421J3905j1058r921O473R821k5335l332
9108a722k389J9948K487k1956k431n172n107O313N336r184p354m446j0614J8652
9094a7639J6500J5580j5103q803j819M542N836M114J753n498J6353p503j2499
9081d186m599N00J3588M048q162P543J1260J079l937n858k5627j2302J0049P407
9067i197l396K152J0480N039L392r186K941J3923J214l024O773j354j0533M779
9053A4003l769o188Q693J0263m595j1326P306P483K385p871j3865J5819O513L279
$$ y = [16070, -729, 666, 2213, -1661, -6533, -8131, -21477, -19349, -22015, -16492, -3559, -3973, -1851, -8641, -23808, -30513, -32563, -21060, -13263, -5633, 6014, 10847, 14621, -299, 5750, 21487, 28772, 16321, 1610, 10790, 11930, 15633, 14385, 16304, 17725, 31630, 20572, 10651, 17124, 26945, 1610, -1722, -4111, 15837, 18324, -3632, -6063, -11235, -16342, -10029, -4693, -13877, -21231, -25677, -36291, -17639, -1139, 14441, -662, -9465, -11284, -6742, -906, 3208, 4961, -537, 15816, 8313, -4186, -8785, -8285, 5303, 9351, 1189, 8732, 19992, 21071, 17134, 11276, -14351, -26653, -16604, -9197, -12593, -10441, 39, 5078, 8470, -716, 2225, 16148, 17362, 14338, 21111, 19757, 9224, 14003, 10234, 4046, 12739, 23002, 18407, 7081, 14387, 21870, 24255, 16384, 2519, 18338, 24851, 28130]
9039B8130m706j2988q945K2762J6351q641r650j0095q640k5697K480j365j575
9026b2579J855R875Q671l428q974P227J2023l075l560J8869m935m140M767k0771
9012h175p97O997o22K052N83R915j8744j3081J530J2953J476J2094J402o25m030
8997B928m477N664m834j1950L438L71n213J3532J5436r909J169M920j5150J0555
8983F480P554J1229j4023j7016n224k219o47l728P064Q359l617q912L580M61Q42
8968i817j4752r704Q001J3223K1998J5196j323j4188j5783J972O12j3681j502
8955a9748J6690k24P535o568l327M805l726R180J682P78j2206k339K922N19P382
8940C355p365L003K2132P628O40o86r892R191j8146p356m71m625Q303o707J0833
$$ y = [28130, 23424, 10436, 1491, 24253, 40604, 31963, 22313, 12218, 3578, -22119, -19639, -21004, -22579, -20724, -10849, -2178, -5606, -14580, -7353, 4670, 1595, -1965, 16904, 11969, 7829, 12596, -8175, -8972, -1975, -2597, -545, 38, 9953, -8791, -21872, -20342, -7389, -5913, 6181, 7583, 6958, 2928, -1549, 4115, -719, -12669, -9231, -8860, -14073, -541, 14895, 4986, 6155, 11075, -4075, 6480, 14034, 25263, 11240, -5776, -11000, -13219, -13866, -17594, -10530, -2171, -5788, -14700, -11120, -10659, -9817, -24569, -34273, -26272, -13049, 8949, 24145, 22822, 8634, -7149, -5177, -4565, -18246, -19748, -3058, -3282, 4253, -2315, -5642, -837, -4563, 4617, 6299, 7077, -5129, -7468, -4546, -4027, 3355, -4010, -1007, 21125, 28753, 29393, 28707, 18815, 28006, 9860, 2504, 2033, -2592, 5711, -996, 9837]
8925I837J221r013K20L379L0j0105k965P712Q955J557j3271r633N027O563L500
8910C014j1596j1950J3003J9735r340j2209q479J1056P025m313M887K12R644l740
8896F949Q917K889J836j1103r537j5720J1107P048J082J225k39P770q753j3778
8882a0307j3887j232q048j0709j227J4991L3266J6340j82p03l939R378J5609P714
8868D7064n057k3315k0084j6356j552K1603P743l968j2416o747M278o040p012
8855b1859o596J8636J1781N709J2005j0395q693j493J47o647j81l159L635Q128
8841A018K182o326q705l674J0642O474p189k561m699J2723M26l953L73j4871J974
8826a6166N104R397N133K549Q019M008j247N060N309K458k0440L98J7569K107
$$ y = [9837, 11058, 2045, 2265, 5644, 5674, -4431, -7396, 316, 9271, 10828, -2443, -12076, -7049, -486, 3014, -8582, -20532, -7529, 12206, 2866, -9343, -17822, -6766, 259, -4054, 833, 1045, 10689, 6949, 15866, 18755, 20591, 9488, -49, -15769, -4662, 2386, 3468, 4693, 4454, 12224, 3471, -10307, -24194, -25426, -33474, -44183, -45410, -30419, 2847, 19187, 19005, 18302, 14363, 23741, 39350, 47064, 42007, 18692, -1392, -17748, -19300, 2303, 10046, 6078, -6338, -13085, -8807, -14847, -21859, -28455, -9819, 1962, 7671, 19676, 9281, 588, -905, -758, -7405, -7586, -10745, -7110, 1018, 3200, -3126, -11831, -15505, -4863, 1611, -5578, -8139, -12838, -115, 311, -3642, -3269, -18140, -16166, -11062, -1665, 3468, 6017, 14036, 18044, 16797, 21857, 27166, 29624, 9184, 9582, 27151, 29258]
8812B9258p065j3238k0380r932J4228J5244J2026j0384q854r03j1907r63J1309
8799a561J769m182O575L880j3723o862J398J1054n683N870j1029k0435o547Q628
8785c0848R19J92N38K891j4244m147Q72J2547J6243J8408p846L431j049k408L886
8770f15o736m981m74J510J8276o513M544J231J158l279j3900J0326O82r021N654
8755b138J3451k861o518o450Q703J9470l544k4626k370P235m108j7518n454J7359
8741i369K2582J3113o022j2173j3675K69r516J5857J2106q90l890j9287N90k0128
8727c0433J4367K2630o409p394K446m812j2138K244P400N071Q714J2162L713J5092
8713C2653O835j5349j1770N324j0014k1987k628o658Q633K0182L449j2397K269
$$ y = [29258, 22193, 8955, -11425, -21357, -7129, 8115, 20141, 9757, 903, 0, -11907, -12870, -1561, 208, -3974, 2601, 6481, -7242, -14104, -12706, -1652, -7335, -1465, -12494, -32929, -39476, -30848, -29929, -29737, -29199, -26308, -40552, -44699, -43827, -31280, -15037, 3371, -4475, -1044, -2093, -4501, -615, -7351, -12332, -12806, -11296, 6980, 467, 5011, 6242, 7400, 4121, -9779, 547, 1229, -7792, -2138, 11313, 8452, 1934, -4516, 4187, 23657, 20113, -4513, -6883, 352, -3756, -21274, -26728, -9369, 13213, 26326, 20304, 8131, -5544, -5275, -14791, 1066, 13172, 12282, 8392, -10895, -10305, -30433, -16066, 6564, 155, -7239, -4793, -9605, -21743, -19499, -12099, -7028, 1686, 13848, 17561, 32653, 39488, 24139, 12369, 17693, 7679, -14308, -16936, -23594, -14961, 5221, 8670, -3727, -1458]
8700a458J1246J1529l642k728k020l737O738o0p297n529J519L999M191q029k405
8685B317o49j3710j4239P2k696L797L297P236J737N808k449j531j527P073K5664
8670B0200Q478j2939l135J0931m50j4499J527M228P837K2595R843j5308j7620
8657B1688R722K3274N043O797J7707J8772K1466K2266N4080P0593J00319K09213
8645E80940L05901J94883j08138k67199k60610j60556q0687n3069m6238k8439
8635G6788k0109q311k630K840n89q637J1313r802j2330r391m209p69l020J3401
8621B4545p88L916R445O843J0862j637J227J243M769P98k906J8315J7630K6522
8607A20784L0995L3956M9296R2167J24439J97604L29704N89238N31084j04066
$$ y = [-1458, 9788, 21317, 17675, 14947, 12927, 9190, 15928, 15868, 8571, 3042, 4561, 8560, 12751, 4722, 2317, 1668, -12042, -26281, -26209, -28905, -25108, -21811, -14575, -12838, -7030, -9479, -11010, -12537, -5464, 20200, 28678, 15739, 12604, 23535, 23085, 8586, 10113, 14341, 22178, 44773, 54616, 39308, 21688, 31410, 54684, 59727, 66524, 84231, 103003, 124469, 146735, 200815, 271408, 371727, 580940, 886841, 1081724, 973586, 706387, 445777, 285221, 204534, 151465, 105227, 76788, 56679, 48368, 45738, 48578, 47989, 39352, 50665, 40863, 28533, 19142, 14933, 14164, 11144, 24545, 23757, 27673, 37118, 43961, 54823, 53186, 54413, 55656, 60425, 61223, 58317, 76632, 94262, 120784, 151779, 185735, 235031, 327198, 451637, 649241, 978945, 1568183, 2099267, 1995201]
8597A995201m80332n41041l59745j94515j23558q6884m8400k1277k5451l1198
8587H2800j2739o98n455M653n534q917q403O635o008k6240l494L631J9626J5730
8573E5587N750k412j966n505l379j807j6007K091K9191L3303J0886r394k547K0754
8559A14545K8463N4302R2247J61809K50643K67202L1500j91355k64351k02623
8549C42382j25477p7730l9320k0813j4971j8284p973j0547K515L352m191n821
8537B3122m843N661j8672o8j02l913P527J6296J985n820J0526o427j2931q079
8523D262q472j2061J2078O725j3143P356j701j6910L149p680o019R855R076L641
8509i844J2358L378j4316j478J1713l641j0683R483j476K110K606L997R746j2720
$$ y = [1995201, 1514869, 973828, 614083, 419568, 296010, 209126, 160726, 139449, 113998, 82800, 70061, 69363, 63908, 68561, 63027, 54110, 45707, 52342, 46334, 20094, 16600, 20231, 39857, 55587, 61337, 58925, 56959, 51454, 48075, 46268, 30261, 32352, 61543, 94846, 105732, 96338, 93791, 114545, 143008, 197310, 289557, 451366, 702009, 969211, 1000711, 809356, 545005, 342382, 216905, 139175, 99855, 79042, 64071, 45787, 37814, 27267, 29782, 33134, 28943, 23122, 18279, 23940, 5268, 5200, 5098, 1185, 8712, 25008, 26993, 21173, 31699, 25272, 12341, 4262, -4210, -16271, -4193, 2532, -10611, -3255, -4956, -21866, -18717, -26397, -32416, -22561, -13485, -9844, 2514, 5892, -8424, -9902, 1811, -1830, -12513, -3030, -4506, -2396, 210, 4207, 13953, 1233]
8495A233r709l507J2165Q53k283M904j2654j7421j64J3094J6925k914q609o647
8481a4734R069O900K952J0551K2051M90k1474k126J0715j3675j1873K056J3656
8468A4558k353j2050J605j529j1143J3077R601N471j4863j1807l605N445P055
8455e38m080j0302j929O999M625j7391K282O433M02o745r157J2350J651J0674
8441d726J1202M4j6839k075J2323P835m482j520m267m077L792k755k571o830k999
8426a7945M166l880M665M675O509o319o226J0702r361l745n044Q093J3694L571
8412C555r585r916j689M995M000q214o936o655J5730J2231J473J8513o225o847
8398D430L392o80J775K335L044J129N16M375N621l66q203k1867j1532J619L888
$$ y = [1233, -8476, -11983, 182, 1035, -1248, 3656, -8998, -26419, -26583, -13489, 3436, 522, -8087, -14734, -5665, 1235, 4187, 14738, 36789, 37279, 15805, 13679, 24394, 10719, -1154, 902, 14558, 12205, 155, 1760, 231, -10912, 2165, 11766, 17237, 2374, -9433, -13038, -7593, -538, -4618, -14920, -16849, -9850, -5225, -22616, -20334, -13901, -13499, -20244, -29401, -17051, -15400, -4726, 6476, 6520, -10319, -12394, -71, 7764, 3282, 1762, -2505, -6582, -2790, -5545, -8116, -14946, -17945, -13779, -17659, -12994, -8319, -1810, -8129, -14355, -3653, -13014, -16759, -21803, -13710, -16, 3555, -6030, -15946, -17635, -12640, -8640, -16854, -23790, -30445, -14715, -2484, -1011, 17502, 11277, 4430, 7822, 7142, 8917, 11252, 14296, 15425, 15941, 20316, 25937, 25571, 17368, -4499, -16031, -14412, -10524]
8383a0524o984m301j4911K237K4469K3541n844R32N492j1027R06M493r542j3355
8369a4418J125J5752n275J779J8816Q536q746m277L470m776p307K679K81j69M344
8354A1814o535M696q920j5120M048M621K966k530J710J3427r068m36l158L622
8340A137Q16J0803o018j0982R63M771N660R939K929k66p283j5832j2988n663q125
8325c0139j0234O196J7727k549j1513m877N219K5983M721m161K857k214n722J4181
8311E475n674P803n429J1853O800j2398J866n755j4034n456J0165K216o68j478
8297d714o715q602R555J934M790k495K085L418O129R137L85o988m768P344R61
8282A1456q830l939J2462L143j8738p915m497O534j100o568j118J494R218K338
$$ y = [-10524, -17508, -21809, -36720, -34483, -10014, 13527, 7683, 8615, 14107, 3080, 3986, 8479, -1063, -14418, -13293, 2459, -2816, -1037, 17779, 26315, 17569, 13292, 16762, 11986, 4679, 7358, 7639, 7470, 11814, 5279, 9975, 1055, -14065, -10017, -5396, -2430, -4960, -3250, 10177, 1109, 673, -2485, 1137, 1953, 12756, 6738, -4244, -3281, 1490, 7150, 17089, 20018, 19752, 12469, -3363, -16351, -22014, -30139, -40373, -34177, -16450, -18999, -30512, -35389, -30170, -4187, 534, -3627, -770, -2984, -8706, 5475, -199, 7604, 2175, 14028, 20828, 8430, 10296, 4541, -9493, -14949, -4784, -2568, -3236, -4714, -11429, -20031, -10476, -8542, -3752, -6247, -4162, -744, 5385, 14522, 14907, 7919, 3151, 10495, 11456, 2626, -1313, 11149, 14292, -4446, -12361, -16858, -10324, -11424, -17992, -19110, -17616, -8398, -6060]
8268f060n414m409J2575n570o211O459O127P455K1152N861j9553j3265p622o539
8254a5014l086Q523J2397N158l780N329Q564p693p362k241m433j82J2181J3256
8240B1617j742j0204n232r505m890k034n181k328J1570J4779m757M481O04L935
8226A1113M663j2173m34J0121R69q341p833j4483o947K2531K2095k810o813q159
8212C499P404K128n794J1667k04o904j3046m450O298L765l306O269Q600j969m230
8197I727k933j1607o350J0620J1856p214J810m118p198J700m029r767m762J4881
8183g384N555o79J2306k657P826p463j2037L464m834R05L919M440j721p651k881
8168h892k1140k233o031l415L944O797j994Q609K2737J0464j3182k051q55o24
$$ y = [-6060, -11474, -15883, -3308, -8878, -15089, -8630, -2503, 4952, 26104, 31965, 12412, -853, -8475, -15014, -18100, -9577, 2820, 7978, 4198, 9527, 18091, 10398, 3036, 795, -3638, -3820, 8361, 21617, 19875, 9671, 4439, -5066, -9956, -11990, -17171, -19499, -7929, 6850, 2093, 6574, 7178, 11113, 15776, 3603, 3169, 13290, 14259, 5918, -1915, -16398, -23345, -814, 21281, 18471, 11658, 3499, 10903, 13031, 7237, 18904, 18700, 11796, -1250, -5700, 598, 4363, 1057, 7326, 15926, 13957, 9727, 6794, -4813, -11163, -543, 11313, 4099, 5909, 1791, -5407, -3707, -7736, -17503, -22265, -7384, -1829, -2508, 9798, 7141, 14967, 7504, -4533, -1069, -5903, -4998, -1079, 3361, 1640, -6011, -8892, -30032, -32265, -38296, -41711, -37767, -30970, -32964, -24355, -1618, 8846, -4336, -6387, -7242, -7866]
8154g866k576L686j664n64j405P801p899n481J0700L381M567N338p136j486P691
8139G087o007j1813k94J7896J9716l065r926Q270J4434l234j6030r110o579J979
8125C324L901j3124K74O96j4455M357R330K830K1439N308p648m022p105M859K440
8110A2404j269k4611r135O013O221m546J2890R623k263N182k664N346n366J4956
8096B2781j393j0901M680l960j6465o231o26J1111J0623l029N139J2512R512j4145
8082A9608m669L899Q85j284n237o22M303r355p380L801K134j4224j0318Q299J0955
8067G95J539p76q725j3416L057K881R171J1376K0243J436r358j544n179L895J4019
8052B9414o801j5146K712J7349j4974k1328Jn798M271P319P447K294m223j8404
$$ y = [-7866, -10442, -6756, -8420, -8984, -10389, -2588, -10487, -15968, -5268, -1887, 2680, 8018, 882, -604, 7087, 1080, -10733, -11027, 6869, 26585, 23520, 13594, 21864, 36298, 33064, 17034, 7924, 1345, 3324, 7225, -5899, -5625, -4929, -19384, -15027, -5697, -2867, 18572, 23880, 16232, 12210, 5105, 9964, 12404, 11135, -13476, -22611, -16598, -10377, -14923, -2033, 7590, 5327, 10509, 7845, 13191, 7825, 22781, 21388, 10487, 15167, 11207, -5258, -11489, -12115, -1004, 9619, 6590, 11729, 24241, 33753, 19608, 14939, 18838, 19723, 18439, 13202, 12580, 16883, 7528, 148, 3949, 6083, -8141, -18459, -10160, 795, 2334, 1558, -7167, -20583, -17526, -14645, -5474, 5902, 26145, 27581, 18223, 16679, 11500, 15395, 29414, 22613, 7467, 10179, 27528, 12554, -8774, -8773, -14571, -10300, -2981, 4466, 6760, 2537, -15867]
8038a5867N67Q371m982r137R88l24O80J0006J225j0469J59J5782J5391j2129j6123
8023a5862O627J5378p888p493j245J1519J2347l716R87n253q160n398K1432L652
8009A6927O508j7046j9481J122O478L389K408J1324n879r37j58O135q538j6970
7995a4718l714N903J1885N647j7430k5511N919J2394p707l415M991M383p77J2390
7981i760K144o121o572J1487L497K819R224N106J8221n336n174r679n156J0368
7967A5068N95j0914J092Q854j610M04k0440q877J3722k436q032K4758J3410j4106
7953A1488m705J2301n269j1387K316q239M776O078K957Q444r755j195q21l294
7939C695m325l811J0144M72j1693m34J1089k108K90j476J339J0243L82N5P16o400
$$ y = [-15867, -15300, -6929, -11911, -21048, -20060, -20384, -19704, -9698, -8473, -18942, -18783, -3001, 12390, 261, -15862, -9235, 6143, -1745, -9238, -10483, 1036, 13383, 9667, 10654, 5401, -2759, -8157, 13275, 16927, 23435, 6389, -13092, -11970, -5492, -2103, 305, 11629, 5750, 4813, 4655, 10790, 2252, -14718, -18432, -12529, -644, 5003, -12427, -37938, -32019, -19625, -27332, -30747, -25756, -21373, -22150, -9760, -7616, -13737, -20309, -8822, -5325, -2506, 6718, 11824, 30045, 24709, 19535, 9856, 4700, 15068, 15663, 4749, 5841, 14695, 13085, 13489, -6951, -15828, -2106, -4542, -12574, 12184, 25594, 11488, 6783, 19084, 13815, 2428, 4744, -3495, 1281, 7359, 10316, 18760, 9005, 7810, 6989, 3695, -630, -4441, 5703, 6175, -5518, -5952, 5137, 3029, 3319, 1843, 3182, 13425, 13807, 13862, 14578, 8178]
7923H178q178O028J2861K032k30j2078M808J8258n575j3003l176k22J1238r810
7909A1131l422j1490j904J5448l34Q827J4524j3094j8009j467Q119j772J6062
7896B2619j874j6931N053L704j164M533J7006l013k2734j1643M915j663p888k273
7882a1353M364p123Q138J0056n604K881J0911k181j4454M680J4074m885M174j0325
7868C353q679N240O757P898o453J721o252J855O095q268r398j538r06R628p574
7853f521L759p366P246J259K270M458k164o014K109n36L625k506n239K1097j849
7838A3628q259M683R477j0008R592M905n871L562n367j0465n689O243J3465j4478
7824E418p421J1988O815j070j281r300o086m713r590k501J8008k715o418n643
$$ y = [8178, 0, 6028, 18889, 20921, 20691, 8613, 13421, 31679, 26104, 13101, 9925, 9703, 20941, 11131, 7709, -3781, -5685, 9763, 9429, 18256, 32780, 19686, 1677, 210, 8329, 6557, 22619, 20745, 3814, 8867, 12571, 11407, 15940, 32946, 29933, 7199, -4444, 471, -1192, -9080, -11353, -6989, -14112, -5974, 4082, -1522, 1359, 12270, 10089, -4365, 315, 14389, 9504, 13678, 3353, -5326, -86, 6671, 14569, 8116, 9837, 3585, 5440, 11535, 3267, -6131, -7669, -8575, 1053, -6521, -2762, -10128, -2882, -1623, 647, 5105, 2941, -3073, -964, -1500, 2125, -381, -5620, 15477, 13628, 5369, 10052, 19529, 9521, 19113, 24018, 18147, 21709, 16342, 5877, 188, 6431, 19896, 5418, -2003, 9985, 16800, 15730, 14449, 5149, -937, -5650, -15240, -17741, 267, -2448, -8866, -14509]
7810a4509l990O463r346M684M050Q444J5588K233k628p529p01Q376k0131k581
7796a1577K479j6672j3832J3518J2987p837M805P400J0919O78K537p476j4752
7783a6823O747n771M258K12J0929R020j902r963O556m560j5297J621J6292L9m045
7768b687o592k0372L336K4615n274Q369j0909o182R849m887j349L087k039j0201
7754b1236j168l580K415Q373l219j683j0256l241m579R793O652k379K121J3192
7740h795O634n123q979o200J537J8374J4983Q246j2245j7021q34J555P708J2061
7726A1901j2394j2340J6671k543j190q664o376O774j032O999R873o922j506o10
7712a359k325O258l45n835J2327J2194j0118j5616r155J881O148P962J0167J470
$$ y = [-14509, -18499, -12036, -21382, -16698, -12648, -4204, 11384, 13617, 10989, 3460, 2759, 11135, -8996, -11577, -9098, -25770, -39602, -26084, -13097, -20934, -16129, -8729, 2190, 2868, 5405, -2071, -16823, -10076, -15847, -11589, -11377, -448, 8572, 6670, -3293, 3263, -1297, -16594, -14973, 1319, 1358, -2687, -9279, -29651, -26315, -1700, -6974, 1395, -9514, -15696, -5847, -10734, -12083, -8996, -11035, -21236, -22404, -25984, -23569, -15196, -18415, -20098, -30354, -33595, -38174, -28381, -21729, -24108, -21987, -8795, -2161, -7284, -16263, -22463, -20926, -2552, 12431, 20677, 8432, -8589, -9423, -7868, -160, 11901, -493, -12833, 3838, 1295, 105, -8559, -14935, -8161, -9193, -2194, 7679, 757, -749, -1359, -3684, 2574, 2229, -3606, 8721, 20915, 10797, -4819, -13974, -12093, -5945, 2017, 12184, 13654]
7698A3654j2798j7156K530j033K763k042k910J5966J6074q980p04m0j1366k370
7684h412j686J949J028q81J351L154n109m10n612n117j460N245Q403J528j429
7669g458J838N704j36q89R819j711l931l938q195m571J021n4L627Q378N29J601
7653A634j48L452O019o260J0447l455l626R592R337l58j3834l504L04o862q300
7638e562K180J0391n946o524o442P618k98Q54l609J3348K47l133n974r671J566
7623a0955q718N622K4993j7771j6132m958J3237K6520o285q810l723j2715l252
7610b2947J7148O240r454j1695k5916o361J2418K4023P751j8514L439K8302M658
7597I092j8003k118J4761P12j4489n592J065k508Q379J1877l22q133K098j0407
$$ y = [13654, 856, -16300, -13770, -14803, -12040, -14082, -16992, -1026, 15048, 6068, 5364, 5324, -6042, -8412, -10098, -8149, -7121, -8002, -6651, -3497, -8606, -9016, -14628, -19745, -21205, -15960, -7557, -6029, -7458, -5620, 84, -52, -941, 8878, 7167, 3236, -702, -8897, -13468, -12447, -12501, -8874, -496, 33, 1634, 1486, 4938, 10957, 4697, 15144, 11689, 8063, 17655, 26992, 26634, 12800, 9296, 9600, 2738, -5562, -3382, 7009, 1063, -5461, -11903, -4285, -4583, -3729, -7338, 6010, 6257, 3124, -2850, -12521, -10955, -19673, -14051, 10942, -6829, -22961, -27919, -14682, 11838, 5553, -3257, -6980, -19695, -22947, -5799, 441, -9013, -20708, -46624, -52985, -40567, -16544, -8793, -27307, -23868, 4434, 9092, -8911, -11029, 3732, 4444, -10045, -15637, -14572, -17080, -8701, 3176, 2854, -5279, -3181, -13588]
7583a3588j6313k685J6884J4556N041l100J3272k329N84P667l491o504l533j0139
7569c678k708O205J1254l404o996l553J78J604m225o465N583K358N328o498L94
7554d623j5732O4R463K392J3750o14q76j9557q444L085o17O756l340j4154l443
7539c5890J2502J6662K300l197j6280m336j386L070j631K5998R752p159J209m066
7525b452L367p762p687J449j456l94K884j0177n421J2725o910l326n685R50N712
7510b4183Q342J5845J8577j0180j262M948j976n857r323P429K8817o126j5783
7497I268k158j5277o57P198J2871P886k5437r440J6379J3963p808j670r194q186
7483a2262J481R689J3473P139o566j6007j2968J0169Q793p324K485P944r606m118
$$ y = [-13588, -29901, -32586, -15702, -1146, 3895, 795, 14067, 11738, 12322, 19989, 16498, 9994, 6461, -3678, -6386, -181, 11073, 7669, 673, -2880, -2702, -1098, -5323, -11788, -6205, -3847, 1481, -5017, -4623, -20355, -20291, -10828, -8436, 5314, 4700, 3824, -15733, -24177, -21092, -21709, -14953, -18293, -32447, -35890, -23388, -6726, -4426, -7623, -23903, -28239, -29625, -26555, -28186, -2188, 7564, 405, 1614, -2452, 915, -6847, -14534, -13085, -14541, -14935, -12051, -22228, -27649, -14924, -21834, -25160, -30845, -29895, -24183, -15841, 4, 18581, 8401, 7139, 12087, 10111, 4254, -5069, 2360, 31177, 25051, 9268, 7110, -8167, -8824, -1626, 11245, 19131, -6306, -15746, 633, 14596, 6788, 5118, -4076, -12262, -10781, -1092, 12381, 19520, 12954, -3053, -16021, -5852, 2941, -4383, -1898, 6046, -3560, -7678]
7469g678K883r161r948J0652R827O218o845K036J2116R129J166O935P431j5654
7455A9107j9983j3066Q953L165j1421K246j461q393m633M705J1841J1607m968
7442b301n393K2396J9987L979j3634p685r340m597r371r197R505Q57n185J081
7428h898M10K645k920K003R846J3436n985j3468j017M780o783l381Q756Q796o225
7413A995l029l389r128p803Q45J1138J2598j1199N231N786j4251J0119J5182k001
7399A2094m834r057J634P989N618j2139j0638J1038k270J4774r193n965J5280
7386A4331m4j1689p371K775O587N310J922p274j6609n441l303P422R523J3194
7372I333j3713q393j058m576P405J9136J513q563k457k296n078j1317J574J8445
$$ y = [-7678, -4795, -13956, -23904, -13252, -3425, 2793, -4052, -2016, 10100, 19229, 20395, 27330, 34761, 19107, -876, -13942, -4989, -1824, -13245, -10999, -12460, -20853, -25486, -20781, -8940, 2667, -2301, -7694, 14702, 34689, 38668, 25034, 17349, 8009, 3412, -5959, -15156, -5651, -4794, -9979, -8898, -8488, -5843, -8763, -6760, 3086, 16522, 10537, -2931, -3948, 832, -5951, -9332, -576, 8220, 1995, -1034, -4423, -13551, -21354, -20509, -9371, 3227, -7972, -2741, 3045, -11206, -1087, 14095, 12094, 7260, -1797, -163, 7826, 13444, 1305, -9333, 1705, -565, 14209, 5016, -949, 14331, 14287, 2598, -4773, -1998, 4589, 9899, 11821, 4547, -12062, -17503, -20806, -13384, -3861, 9333, -4380, -12773, -13831, -18407, -11002, 8134, 9647, 1084, -1373, -3669, -8747, -20064, -18490, -45]
7358d5J176M640M520j6472J1205l053j7556j6953J4140J2664q10j5005P347J9304
7344E102L337o847N469r426P716J437L306n061o987J4431r345j0025N45N404r160
7329a0104J0903j055n179J0251M15p350j434J2371J0555m762j2399j4192rN89
7315a1400Q129o84j1286r36j1396M803J2576n347J2356n327j8471q201M706J600
7301b8878L858l728j2248J3797K0418Q792q000N638R614R368m305j0186j9461
7288a5321O394J1731K893l889m150L031k051k124o499K813J1269j1208j0857j0630
7274b8598m407J0758Q65q10J3320J9463l032j0475p621N707K965n55m881k640
7260i941Q336J0377L85o257j4784N927O114j8245l201O84k34J87M070K442N797
$$ y = [-45, 1131, 5771, 10291, -6181, 5024, 1971, -15585, -32538, -18398, -5734, -6544, -21549, -14202, 5102, 8439, 1592, 7061, -2365, 5351, 6788, 10094, 5033, -1954, 12477, 3132, -6893, -6348, -944, -10104, 799, -256, -5435, 4816, 5231, -2119, -3553, 8818, 19373, 14611, 2212, -11980, -11989, -11400, -3271, -3955, -15241, -16177, -27573, -22770, -10194, -15541, -3185, -8512, -26983, -35184, -30478, -28878, -25020, -28748, -40996, -27199, -6781, 2011, -5989, -351, 9263, 18631, 14326, 4140, -15321, -8927, 2804, 5697, 1808, -2342, 689, -1362, -3486, -9985, -7172, 4097, -7111, -17968, -28598, -33005, -22247, -21382, -22192, -8872, 10591, 7559, -2916, -10537, -4830, -1865, -2420, -7301, -9941, -1605, 8772, 9157, 2900, -11884, -5957, 157, -18088, -21289, -20605, -20839, -20652, -16582, -14140, -8343]
7245h343J0222P52k663j6501j293J3001J2231o710k869k183M470o284J449k070
7231f791J0377j0957m262j920k5475k758J1714J6651M980J3330o94p995K757J0672
7217I629J1270j3287j710l315P973k924r687m455P607N381k903P729j3451j0176
7203a2319Q294o023L455R620o289j7407m325N025Q421J7822J5895q830j3991j3194
7189a3846J0401R622l124O125R416k222q868J597m250k4575n332K8335L328m603
7175B004n500q248q53M813K243k171Q182l400L653P916O982M229M496j4129O75
7160A0892n423K939l643j3490m853j2112q722k139r6N821p03J0201N942R185n733
7145a1934j0566K726M087P515K502J2393j459M144N693j2733L688M008j869r507
$$ y = [-8343, 1879, 2631, -32, -16533, -17826, -4825, 7406, 696, -2173, -4356, 114, -6170, -4721, -6791, 3586, -7371, -11633, -13553, -39028, -41786, -30072, -13421, -8441, 4889, 4195, -3800, -1043, 9629, 20899, 7612, 5902, 2587, 10560, 7636, -2051, -6506, 1101, 6482, 3579, 11308, -2143, -12319, -4025, -10048, -6593, 3027, -3262, -20669, -24994, -19969, -11548, 6274, 22169, 13339, -652, -13846, -3445, 6177, 3053, 9178, 18594, 16372, 7504, 9101, 4851, -19724, -25056, 3279, 6607, 2004, -3496, -11744, -12597, -7784, -5541, -7712, 470, -2930, 723, 8639, 15621, 19850, 24346, 10217, 10892, 5469, 8408, 4765, -8725, -13578, -25690, -34412, -36551, -36647, -30826, -31529, -21328, -15386, -6201, -11934, -22500, -19774, -15687, -8172, -5670, 6723, 5264, 9408, 15101, 2368, 6056, 10064, 8195, -1312]
7131a312N943l809j2094l104R091j728j215J8209J465n716n307j485L520L647
7117F105J1650j172k1184j0623l181J6460Q558M046l159n173n888O704J8472m517
7103A7098n813j682j0891l339k760k018L201J74j0881Q597r26J3258M689j1535
7089b828J177n746J1859J9414N812p971k3941j2145k347J977K227p991m205o845
7075c1553K896J5984K0195o421j2461J09J0955N359N282K1072j887p245j4486
7062G799J2294q70q029m644r188m163l825K587j1732p851L152j63j6646K587J5527
7047b3165J0802J0276r936q326N791J2643J2278O042J0688K70M70r239r921R418
7033A8091J3737r476l8236j2156j834J0426R91J4813J7233N708j5055j9901m619
$$ y = [-1312, 4631, 822, -11272, -14376, -5285, -7013, -8228, 9981, 11446, 5730, 423, -1062, 2458, 6105, 17755, 16583, -4601, -15224, -18405, -1945, 6613, 10659, 7500, 2327, -3561, 3143, 21615, 17098, 11285, 9603, -1288, -4627, -7387, -9405, -6204, -6030, -16911, -8314, -9240, 4018, 8707, -2828, -1651, -7397, 4462, 23876, 29688, 21717, -2224, -14369, -16716, -14739, -12512, -20503, -24708, -31553, -28657, -12673, 7522, 1101, -11360, -11251, -296, 5063, 10345, 31417, 29530, 22285, 7799, 20093, 19223, 11194, 6550, -2638, -6801, -10626, -8039, -19771, -27622, -24470, -24633, -41279, -38692, -23165, -12363, -2087, -12023, -20349, -14558, -1915, 10363, 16405, 27093, 27363, 27833, 18594, 8673, 18091, 31828, 22352, -15884, -28040, -29874, -19448, -18457, -3644, 13589, 19297, 4242, -15659, -20278]
7020b0278R498L743k221l042J0218L829j2023m84J1618n122k0910r295l19J1208
7006b3580J9002J2254j829j0153r487J0271R417k0272j1074J8967Q692n698N793
6993B303K081j882J5824P043k1400q616j7232N161J4397M939o197L781L09m554
6979d043J1986Q779j4268k0220r849J922J6821O453P470K540j819j5373m60l500
6965a3561l831J198l552P760p89J935r288j45R379J1842J2389J9977j818j1352
6951B0144o228j9974j1480l760J1682Q730J356j009j0160J7323q80j5899p248
6938a7403K909k728P564O061L331P522k490j1519p568L594j5239j0300J2786J6382
6924g098L478r99J9089j4230r082N972J597p987n819N324l346m659O980N58n012
$$ y = [-20278, -10780, -7037, -9258, -12300, -2082, 1747, -10276, -10760, 858, -4264, -25174, -34469, -34788, -23580, -4578, 7676, 5847, -4306, -13793, -3522, 5895, -14377, -25451, -6484, 2208, -3490, 2303, 4384, 2502, 18326, 25369, 3969, -4647, -21879, -16718, -2321, 2618, -3579, 202, 511, -4043, 7943, 16722, 2454, -17766, -27615, -25693, -8872, -2419, 5051, 7591, 5772, -9601, -10061, -13561, -17392, -16194, -19746, -11986, -12775, -10840, -20128, -20273, -10894, 948, 13337, 33314, 31496, 20144, 13916, -6058, -17538, -21298, -9616, -886, 470, -539, -10699, 6624, 5744, -10155, -17403, -14494, -17222, -9658, -3597, -266, 7256, 4766, -6753, -14321, -10727, -25966, -36266, -23480, -7098, -3620, -4619, 14470, 240, -8842, -2870, -1273, -9260, -15079, -9755, -13101, -17760, -10780, -10222, -15234]
6909a5234o927J2480J2853J0402r024j7427K576o497O150j430R291n38j3401o736
6895b3462J4084J6797L528m496j7950l482J3144J4248j1256n577P290m171j3j1929
6881a3245q303M003Q612J2126K074L54k4856j7968N948J4182K982O864N244j1306
6867a3289j1105J061R224k90P036O111Q111k61P079L320P775K13j3359K968J7709
6852C2303q685j3809k574o413J167q498p429k593J676Q980n25q65n47L271j0114
6837a4655j113R630P841Q594l409j52m539N53j465j1784r292j2877K040O844L282
6822b0502J9855J4735j181j3594J930l581m318m999L804K09R290J2768K935j2557
6808D794k6647L70J4567O918k115l387k170P908j225o186n101M482L156j552k343
$$ y = [-15234, -22161, -9681, 3172, 13574, 4550, -12877, -10301, -16798, -10648, -12078, -2787, -3325, -16726, -23462, -9378, 7419, 10947, 6451, -11499, -14981, -1837, 12411, 1155, -4422, 2868, -1303, -1316, -13245, -21548, -17545, -8933, 3193, 5267, 5621, -19235, -37203, -31255, -17073, -14091, -7227, -1983, -13289, -24394, -23333, -14109, -14399, -7363, -1252, 6859, 6598, 13677, 16997, 24772, 24985, 11626, 14594, 32303, 23618, 9809, 7235, 822, 1989, -6509, -13938, -16531, -14855, -5875, -6400, -7265, -7812, -4541, -14655, -15768, -6138, 1703, 10297, 6888, 6736, 2197, 2750, 1285, -10499, -19791, -32668, -30628, -23784, -20502, -647, 14088, 12907, -687, 1243, -2338, -6656, -11655, -7851, -7642, 1648, 14416, 17351, 4794, -21853, -21483, -6916, 2, -2113, -5500, -7670, 238, -987, -7173, -12274, -7792, -4636, -6188, -8531]
6793h531j4923P607O265J0277o791j437J0891O571L617j466l9Q048P15o504j2364
6778A936J3413J3413j7106j4751k691j1661q85m30j1005P971J5144n505R2P575
6764d490o619R719J1277j4411r071L284J5974l350J506m78l496q623q05J277P964
6749c42O650J3018q133p677n187R280R745J030o53k904O747L631j8316j9330j954
6734a4395Q031m567n112L936j1995L405j130P620l261o818J128R001j0067j925
6720b6149J4650M756n245J3821M901r899L175J080J4659R675j0754k401N988r501
6706H756l80j382K453N171M07j3213r048q309R163l388j0499l135J1206J1667
6692e31Q565q654l593n407j2547Q272K0898K354R548J8783o967k2049j8930O01
$$ y = [-8531, -23454, -15847, -9582, 695, -6096, -7533, 3358, 9929, 13546, 12080, 12041, 20089, 20804, 14300, 1936, 15349, 28762, 11656, -3095, -5786, -17447, -18332, -18762, -29767, -21796, -6652, -12157, -12065, -4490, -11109, -1390, 9887, -4524, -13595, -10311, 5663, 2313, 3819, 3341, -155, -8778, -9583, -8306, -342, 6308, 19326, 11193, 3516, -1671, 7609, 17354, 18384, 17731, 14827, 21574, 25205, 6889, -12441, -14395, -6364, -10931, -16043, -12107, -24102, -20697, -21827, -14207, -17468, -24286, -23158, -14157, -24224, -26149, -11499, -6743, -11988, 1833, 6734, -3165, 10, 1090, 15749, 25424, 14670, 12269, 18257, 8756, 8376, 6994, 9447, 14618, 15025, 1812, -7236, -15545, -6382, -9770, -20269, -23404, -12198, -531, 8034, -620, -4213, -9620, -22167, -13895, 7003, 9357, 18905, 37688, 30721, 8672, -10258, -9657]
6678i657K202K3553l024k1833J2561M663j4256J736J2352J073J0750o92j7365
6665B063j0631m951J4736k674j45l48j2210O648J2018o204m628J7216o899j8669
6651a4678P232O931L994j0903M95Q643p357p219K872J6194O692r413p619J656
6637b480N018n690m94M311r732p894J2807Q414j568j1903K087N982R833J072J066
6622A0829j1649q781K017J0417Q692J7423r67m499j5478j3268j0583O382k87M224
6608e528Q143j6876j1885J3200Q048N389m029k26P50k99N632q927r610J6722J3290
6593A3794o292k0012L481J3153M796r233k669J60k567j257m889M696P096j6756
6579a6499j337J8423N913j8618q237R659J6915n884j874O705J496l728n860o508
$$ y = [-9657, -7455, 16098, 13074, -8759, 3802, 8465, -5791, -4055, 8297, 9370, 20120, 19428, 2063, -8568, -13519, 1217, -1457, -1602, -1950, -14160, -7512, 4506, -1698, -6326, 10890, 3991, -14678, -7446, -515, 3479, -7424, -6929, 1714, -5643, -12862, -9990, 6204, 12896, 3483, -4136, -2480, 2538, -3152, -3646, 665, -9067, -16961, -4154, 4260, 2692, -9211, -7124, -1142, 8691, 9763, 10829, -820, -9601, -7584, 2833, 11525, 28948, 27981, 23482, 8004, -5264, -15847, -9465, -9752, -5528, 2615, -14261, -26146, -12946, -4898, 491, -3538, -3764, -3014, -3313, 2319, -6608, -16218, 504, 13794, 7502, -12510, -9029, 4124, 8920, -313, -2982, -2822, -5389, -6646, -11535, -6839, 257, -16499, -17836, 587, 6500, -12118, -20355, -10696, 6219, 335, -1539, 5166, 6662, 2934, -2926, -9434]
6565i434O063l684p972J1470n753k774N369K758l230P330J2366n865j776L666
6551H534l809M366l828N814J5325r556J4185J1538p606j4521o286m803p293O794
6537H854J001J0786O205j1864k335k515k515m614j0027q679l34j515l485J2699
6523h338J9891O982r17J3215l154q921k676j4704q133N474j793m355Q331J245
6509B147j32M946M010j6099l528L887k815N888K925o654J769K3728r233j4734
6495c895o08j3704O147J1084l933K176L368M492n70o350k891l171j342p67P54
6480i210K833k2983j4677J7412R927r627j0768O025o343N198N976J0194J8429
6467B386q763l420R909n28L953n537j2941k83P9J6163J7893m349j0871m11j3895
$$ y = [-9434, -3371, -7055, -15027, -3557, -9310, -12084, -6715, -3957, -7187, 143, 12509, 6644, 4868, 8534, 4725, 9091, 5263, 11077, 26402, 16846, 31031, 42569, 34963, 20442, 14156, 9353, 2060, 8854, 9855, 20641, 26846, 14982, 12647, 10132, 7617, 3003, -7024, -15703, -16037, -17552, -21037, -8338, 11553, 18535, 17618, 30833, 27679, 18758, 16082, 1378, -6755, -1281, -3074, -7429, 902, 2147, 2015, 6961, 10971, -5128, -8656, -4769, -7584, -1696, 1229, -5425, -3656, 20072, 10839, -3895, -4503, -18207, -12060, -976, -4909, -2733, 635, 5127, 4557, -1793, -4684, -7855, -9197, -9964, -9210, -6377, -29360, -44037, -26625, -16698, -26325, -37093, -31068, -37411, -32213, -26237, -16043, 2386, -6377, -9797, 112, -416, 3537, -2000, -14941, -15224, -15145, 1018, 18911, 14562, 3691, 3280, -10615]
6452a0615r16Q596M584r900j0615N532Q446J9276J4220l311o101k3273j2074R457
6438f694J2561o461k0798j3431o660l755j441O766J0700R138M181j0139j0111
6425c6144N592l642P155O643Q447m66N985R619j4434P402L809p543O752J0912
6411A0087J72p123q886j4766Q267N068J0132J0494l971n424q850j3523M838J7710
6397D225k93k2198n736J7062L658M00o31J0179K464J074m345q946K865K7197M144
6382C1119k0397j4411l758p27j1939m35j201R615j943R706K578j448l573l591
6368a0405O373m609n175R256R033J685k659j6534O278J4998r24m497j6494k102
6354a5776J0151P979J235j893p273q155J3084O542Q256j904j4385n722k958K5250
$$ y = [-10615, -11531, -2935, 1649, -8251, -18866, -13334, -4888, 14388, 28608, 25297, 19196, -4077, -16151, -6694, 5867, -594, -21392, -34823, -41483, -45238, -46679, -39913, -29213, -20075, -15894, -26033, -36144, -30552, -34194, -27039, -20396, -11949, -12415, -6430, 3189, -11245, -3843, -34, -7577, -825, 10087, 10259, 3136, -5750, -20516, -12249, -7181, 2951, 13445, 9474, 4050, -4800, -18323, -13485, 4225, 3932, -18266, -24002, -6940, -3282, -2882, -3513, 6666, 9130, 10204, 5859, -3087, -222, 26975, 31119, 10722, -3689, -7447, -8174, -20113, -20548, -21749, -12134, -14077, -4371, -1793, -3241, -6814, -10405, -4032, -8641, -13816, -4560, 4473, 6158, 3499, -13035, -6757, 8241, 7317, 2820, -13674, -15776, -5625, 2354, 3589, 1696, -5577, -13732, -648, 5894, 14150, 12246, -2139, -7861, -10819, 14431]
6340A4431Q180K309j2861q998q596M013L092j5509l919N755j4699j1362J2359
$$ y = [14431, 22611, 24920, 12059, 3061, -5535, -1522, 1570, -13939, -17858, -12103, -26802, -38164, -25805]
$$ [...]
##END NTUPLES=NMR SPECTRUM
##END=
