##TITLE=Analysis number 316918
Compound Code cc 46524
Book Reference 468/21
Project Code adrs
Chemist Name colinb
##JCAMPDX= 6.0         $$ Bruker NMR JCAMP-DX V2.0
##DATA TYPE= NMR SPECTRUM
##DATA CLASS= NTUPLES
##ORIGIN= Bruker BioSpin GmbH
##OWNER= nmr
$$ XWIN-NMR		Version 3.5
$$ Wed Feb  1 12:15:27 2006 GMT Standard Time (UT+0h)  MAYBRIDGE\nmr@NMR_250MHZ
##.OBSERVE FREQUENCY= 250.131544655141
##.OBSERVE NUCLEUS= ^1H
##.ACQUISITION MODE= SIMULTANEOUS (DQD)
##.ACQUISITION SCHEME= undefined
##.AVERAGES= 16
##.DIGITISER RES= 18
##SPECTROMETER/DATA SYSTEM= dpx250
##.PULSE SEQUENCE= zg30
##.SOLVENT NAME= CDCl3
##.SHIFT REFERENCE= (INTERNAL, CDCl3, 0, 16.4462)
##AUDIT TRAIL= $$ (NUMBER, WHEN, WHO, WHERE, WHAT)
$$ ##TITLE= Audit trail, XWIN-NMR		Version 3.5
$$ ##JCAMPDX= 5.01
$$ ##ORIGIN= Bruker BioSpin GmbH
$$ ##OWNER= nmr
$$ C:\u/data/dgb/nmr/ADRS/15470/pdata/1/auditp.txt
$$ ##AUDIT TRAIL=  $$ (NUMBER, WHEN, WHO, WHERE, WHAT)
(   1,<2006-02-01 12:15:07.66 +000>,<MAYBRIDGE\nmr>,<NMR_250MHZ>,
      <created by zg, POWCHK disabled, PULCHK disabled
       configuration hash MD5:
       84 BC 41 DB A1 6E 1D 46 DA 25 12 A5 C1 ED C5 3A
       data hash MD5: 64K
       2B B7 78 EB 4B 0E 4D A5 3F F3 2B 0C 98 A4 DD BC>)
(   2,<2006-02-01 12:15:20.15 +000>,<MAYBRIDGE\nmr>,<NMR_250MHZ>,
      <Start of raw data processing
       ef LB = 0.3 FT_mod = 6 PKNL = 1 SI = 32K 
       data hash MD5: 32K
       91 EF 03 B5 7A 0F 4F 65 D6 14 7D 71 1C BD 39 23>)
(   3,<2006-02-01 12:15:21.98 +000>,<MAYBRIDGE\nmr>,<NMR_250MHZ>,
      <apk 
       data hash MD5: 32K
       6A AB 6A 45 FD FB 09 ED DC 1B 43 06 E7 26 1F A0>)
(   4,<2006-02-01 12:15:22.71 +000>,<MAYBRIDGE\nmr>,<NMR_250MHZ>,
      <abs ABSG = 5 
       data hash MD5: 32K
       F1 C3 A8 0B FB 01 5D 38 2B AA 75 50 16 D5 F5 02>)
$$ ##END=
$$ 
$$ hash MD5
$$ 55 1C CD BE F9 70 A5 F0 94 2B 9B C3 F1 89 C7 22
##$RELAX= 
##$RELAX= 
##$RELAX= 
##$RELAX= 
##$RELAX= 
##$RELAX= 
##$RELAX= 
$$ Bruker specific parameters
$$ --------------------------
##$DU= <C:\u>
##$EXPNO= 15470
##$NAME= <ADRS>
##$PROCNO= 1
##$TYPE= <nmr>
##$USER= <dgb>
##$AMP= (0..31)
100 100 100 100 100 100 100 100 100 100 100 100 100 100 100 100 100 100 
100 100 100 100 100 100 100 100 100 100 100 100 100 100 
##$AQSEQ= 0
##$AQ_mod= 3
##$AUNM= <au_zg>
##$AUTOPOS= <9 >
##$BF1= 250.13
##$BF2= 250.13
##$BF3= 250.13
##$BF4= 250.13
##$BF5= 500.13
##$BF6= 500.13
##$BF7= 500.13
##$BF8= 500.13
##$BYTORDA= 1
##$CFDGTYP= 0
##$CFRGTYP= 5
##$CHEMSTR= <none>
##$CNST= (0..31)
1 1 145 1 1 1 1 1 1 1 1 1 1 1 1 1 1 1 1 1 1 1 1 1 1 1 1 1 1 1 1 1 
##$CPDPRG= <>
##$CPDPRG1= <>
##$CPDPRG2= <>
##$CPDPRG3= <>
##$CPDPRG4= <mlev>
##$CPDPRG5= <mlev>
##$CPDPRG6= <mlev>
##$CPDPRG7= <mlev>
##$CPDPRG8= <mlev>
##$CPDPRGB= <>
##$CPDPRGT= <>
##$D= (0..31)
0 1 0 0 0 0 0 0 0 0.06 0 0 0 0 0 0 0.0002 0 0 0 0 0 0 0 0 0 0 0 0 0 0 
0 
##$DATE= 1138796106
##$DBL= (0..7)
120 120 120 120 120 120 120 120 
##$DBP= (0..7)
150 150 150 150 150 150 150 150 
##$DBP07= 0
##$DBPNAM0= <>
##$DBPNAM1= <>
$$ [...]
##$SUBNAM7= <"">
##$SUBNAM8= <"">
##$SUBNAM9= <"">
##$SW= 20.6930455092707
##$SWIBOX= (0..15)
0 0 3 0 0 0 0 0 0 0 0 0 0 0 0 0 
##$SW_h= 5175.983436853
##$TD= 65536
##$TD0= 1
##$TE= 294.16
##$TE2= 300
##$TE3= 300
##$TEG= 300
##$TL= (0..7)
0 120 120 120 120 120 120 120 
##$TP= (0..7)
150 150 150 150 150 150 150 150 
##$TP07= 0
##$TPNAME0= <>
##$TPNAME1= <>
##$TPNAME2= <>
##$TPNAME3= <>
##$TPNAME4= <>
##$TPNAME5= <>
##$TPNAME6= <>
##$TPNAME7= <>
##$TPOAL= (0..7)
0.5 0.5 0.5 0.5 0.5 0.5 0.5 0.5 
##$TPOFFS= (0..7)
0 0 0 0 0 0 0 0 
##$TUNHIN= 0
##$TUNHOUT= 0
##$TUNXOUT= 0
##$USERA1= <user>
##$USERA2= <user>
##$USERA3= <user>
##$USERA4= <user>
##$USERA5= <user>
##$V9= 5
##$VALIST= <valist>
##$VCLIST= <CCCCCCCCCCCCCCC>
##$VD= 0
##$VDLIST= <DDDDDDDDDDDDDDD>
##$VPLIST= <PPPPPPPPPPPPPPP>
##$VTLIST= <TTTTTTTTTTTTTTT>
##$WBST= 1024
##$WBSW= 4
##$XGAIN= (0..3)
0 0 0 0 
##$XL= 0
##$YL= 0
##$YMAX_a= 444977
##$YMIN_a= -480962
##$ZGOPTNS= <>
##$ZL1= 120
##$ZL2= 120
##$ZL3= 120
##$ZL4= 120
##$ABSF1= 16.44616
##$ABSF2= -4.247013
##$ABSG= 5
##$ABSL= 3
##$ALPHA= 0
##$AQORDER= 0
##$ASSFAC= 0
##$ASSFACI= 0
##$ASSFACX= 0
##$ASSWID= 0
##$AUNMP= <proc_1d>
##$AZFE= 0.1
##$AZFW= 0.1
##$BCFW= 0
##$BC_mod= 0
##$BYTORDP= 0
##$COROFFS= 0
##$CY= 12.5
##$DATMOD= 1
##$DC= 0
##$DFILT= <>
##$DTYPP= 0
##$F1P= 14.0000005364418
##$F2P= -0.99999901652339
##$FCOR= 0.5
##$FTSIZE= 32768
##$FT_mod= 6
##$GAMMA= 0
##$GB= 0
##$INTBC= 1
##$INTSCL= 1
##$ISEN= 128
##$LB= 0.3
##$LEV0= 0
##$LPBIN= 0
##$MAXI= 10000
##$MC2= 0
##$MEAN= 0
##$ME_mod= 0
##$MI= 0
##$NCOEF= 0
##$NC_proc= -3
##$NLEV= 6
##$NOISF1= 0
##$NOISF2= 0
##$NSP= 0
##$NTH_PI= 0
##$NZP= 0
##$OFFSET= 16.44616
##$PC= 1
##$PHC0= 99.07642
##$PHC1= 9.436255
##$PH_mod= 1
##$PKNL= yes
##$PPARMOD= 0
##$PSCAL= 4
##$PSIGN= 0
##$REVERSE= no
##$SF= 250.130018968324
##$SI= 32768
##$SIGF1= 0
##$SIGF2= 0
##$SINO= 400
##$SIOLD= 32768
##$SREGLST= <1H.CDCl3>
##$SSB= 0
##$STSI= 32768
##$STSR= 0
##$SW_p= 5175.98343685301
##$SYMM= 0
##$S_DEV= 0
##$TDeff= 65536
##$TDoff= 0
##$TI= <Analysis number 999999
Compound Code 99
Book Reference 9
Project Code 9>
##$TILT= no
##$TM1= 0
##$TM2= 0
##$TOPLEV= 0
##$USERP1= <user>
##$USERP2= <user>
##$USERP3= <user>
##$USERP4= <user>
##$USERP5= <user>
##$WDW= 1
##$XDIM= 32768
##$YMAX_p= 469478804
##$YMIN_p= -111271
$$ End of Bruker specific parameters
$$ ---------------------------------
##NTUPLES= NMR SPECTRUM
##VAR_NAME=  FREQUENCY,     SPECTRUM/REAL,   SPECTRUM/IMAG
##SYMBOL=    X,             R,               I
##VAR_TYPE=  INDEPENDENT,   DEPENDENT,       DEPENDENT
##VAR_FORM=  AFFN,          ASDF,            ASDF
##VAR_DIM=   32768,         32768,           32768
##UNITS=     HZ,            ARBITRARY UNITS, ARBITRARY UNITS
##FACTOR=    0.157963299565203, 1,           1
##FIRST=     4113.67815337148, 0,            0
##LAST=      -1062.30528348153, 0,           0
##MIN=       -1062.30528348153, -111271,     0
##MAX=       4113.67815337148, 469478804,    0
$$ Real data points
##PAGE= N=1
##DATA TABLE= (X++(R..R)), XYDATA
$$ [...]
23025 46789 45260 31593 21427 17449 25630 31019 40170 50944 49886 25389 30913 15322 1742
23012 1742 -19839 -36044 -46621 -54994 -44689 -27450 1684 8810 -1096 -3498 17085 12341 -5114
22999 -5114 -12173 -13653 -21947 -33088 -36145 -2607 13902 42666 41179 41436 55269 42581 25670
22986 25670 4608 -17832 -25415 -27300 -6305 4950 -285 3185 -6924 -8465 -17861 -714 9798
22973 9798 -3524 -37024 -61254 -80216 -69700 -43147 -16796 -23260 -27632 -42845 -50634 -57612 -51205
22960 -51205 -39254 -27755 -33217 -45847 -38247 -27678 -33861 -34547 -45568 -15879 8927 35119 40623
22947 40623 41295 28446 23087 -1248 -5356 -45026 -73304 -58801 -29122 -21201 -27602 -11341 5065
22934 5065 10986 9735 -243 -12304 -7472 17861 23642 16451 -5373 8029 22669 51137 51971
22921 51971 34047 32426 38817 57610 56957 31158 21797 -1219 -10121 -13985 -10815 3806 12096
22908 12096 8624 2821 2338 -21573 -46875 -55371 -51675 -38680 -23315 -9144 13399 3686 -23372
22895 -23372 -16700 -30392 -44529 -25727 -5179 2846 -597 12257 7220 -31811 -61394 -37569
22883 -37569 -3148 21492 18771 2403 -3415 4106 4046 19072 22627 26895 53633 42399 20877
22870 20877 4790 3198 31259 42509 30826 16567 -3012 -16096 -16012 -10538 -25929 -34182 4661
22857 4661 -1780 -11930 -20524 -34119 -19530 18469 44597 35824 16271 16484 4555 41284 57657
22844 57657 30965 7359 5294 959 11372 41715 22567 -20737 -11868 22536 46935 30350
22832 30350 3310 27831 25918 684 -6803 13654 27842 31835 -12199 -44888 -30371 -27176
22820 -27176 -15121 5716 -4036 -3977 -13098 -22459 -20805 -24720 -35784 -20682 7028 -6500 -13348
22807 -13348 -17600 -56169 -52052 -38742 -23719 -35482 -23452 -28979 -15836 8274 12866 3270 13772
22794 13772 7957 8207 23306 18471 -2811 -10341 -5642 23439 17887 -3642 5494 22181 28545
22781 28545 39584 68225 36186 10419 9679 18700 18111 18930 9922 12342 -10082 -20614 -16424 -18282
22767 -18282 -5066 2024 -1222 -31682 -21985 10436 37142 42749 31699 26097 31232 55896 40255
22754 40255 24961 23513 44201 52121 50124 27864 917 -25117 -44660 -48592 -32926 -15805
22742 -15805 -14569 5571 -10427 10045 16669 5294 -6109 -10434 -7662 13037 11399 14733 14942
22729 14942 21731 19870 1553 -7931 -7047 1378 -16987 -16403 -32091 -47003 -41031 -40341 -43688 -61095
22715 -61095 -55688 -45281 3432 20569 38853 45633 30881 21227 8762 32423 22351 6693
22703 6693 10374 34053 44497 16632 -18778 -31614 -15646 21409 30570 20529 -8063 -41595
22691 -41595 -65694 -52235 -25372 -23512 -26851 -25254 -21120 2005 15792 35570 44470 131 12079
22678 12079 5524 -18405 -34326 -25385 9977 25267 40844 56666 74175 76810 53799 22619
22666 22619 3378 7308 29274 38185 48926 21548 10565 38751 45554 17222 -16008 -44567
22654 -44567 -2760 5289 3248 22204 31179 25844 47007 45346 56107 44559 21409 3839 32838
22641 32838 28938 1284 -14233 -13671 -35134 -40941 -39556 -50517 -32149 -10408 -20821 -3061 27113
22628 27113 19656 -4981 -33942 -73947 -62653 -28922 2293 -3808 -4084 -14442 -23514 -33398 -18195
22615 -18195 7796 3903 728 25677 20699 -2714 6312 31085 23001 5022 12946 37039 37577
22602 37577 55882 84412 74850 49154 12199 19302 13960 1697 3304 -946 32773 15936 -22395
22589 -22395 -56460 -65578 -54110 -39747 -35710 1805 5192 16447 -8464 -27523 -25625 -25428 -35366
22576 -35366 -39221 -24853 -17406 12295 16616 1912 -20126 -36230 -19701 5879 23260 38158
22564 38158 34976 4424 -38212 -37112 -33616 -36509 -9513 24045 39148 39211 13181 101 11752
22551 11752 -1046 -6377 -10818 -42361 -32518 -15388 -16435 6269 2710 -12009 -33392 -35568 -19716
22538 -19716 -24049 -33940 -35724 -42951 -35791 -26010 -26702 -33889 -23533 -25161 -9347 -10284 -24404 -2767
22524 -2767 3603 -9146 -3295 23421 16672 33092 27019 22856 26719 11944 56 -6114 -5590 28707
22510 28707 25155 1384 -9762 3892 35271 51917 35636 26082 16504 14366 7225 -790 -11282
22497 -11282 -5665 21185 19091 -25291 -32017 -19469 -42167 -51916 -30421 16348 52576 55897 36049
22484 36049 27799 22743 22852 -11242 -12207 -18414 -20564 -5511 8916 18937 -854 -2347 9080
22471 9080 -5852 -29083 -39232 -59627 -56757 -31961 -36950 -13860 40087 71617 31787 -12932
22459 -12932 -8121 5073 12604 32054 25559 -6154 -30866 -27865 -16712 -14133 -10736 -31146 -10415
22446 -10415 -11301 -30959 -19556 -29297 -6106 -7465 -8734 -19094 12617 48564 21262 4148 -3352
22433 -3352 -5480 16091 9431 -20636 -17849 -17633 -7069 -14440 1451 20304 9333 3621 10742
22420 10742 10282 1631 27106 8523 -10176 -1779 1891 9943 19180 18476 -7874 -32835 -41222 -23181
22406 -23181 7265 15745 6539 -16717 -24141 -23762 -29979 -21800 -13616 -38186 -31578 -20471 -18297 -45702
22392 -45702 -42669 2802 28076 36662 25947 -13052 -29416 -25991 -22349 -25435 -24901 13329 15386
22379 15386 -2554 5770 -4307 -18737 -9122 -187 7444 -4892 -15133 -19247 -10 16691 16051
22366 16051 16460 8103 -12193 16734 16566 -11919 -23288 -15651 -44637 -36514 -26014 -11895 -5964
22353 -5964 -1678 -387 17481 20231 12853 12961 13075 9296 9721 17502 31664 42867 34170 -1559
22339 -1559 -12798 20974 48377 52710 41826 58389 50972 12096 -1005 7967 23160 25903 12240
22326 12240 16291 31990 34289 38603 32267 40855 45508 25603 18301 24906 31874 23885 12332 -5515
22312 -5515 -24027 5209 -20066 -41041 -41167 -33752 -38297 -26756 -15479 13193 21914 5240 -12977
22299 -12977 -19206 -13104 -6976 -6835 9338 31769 42130 27347 -6326 -32055 -15665 21580 13167
22286 13167 -8977 3914 22150 24055 26745 7152 -9436 -14622 -24711 -30278 -22309 -37862 -70059
22273 -70059 -75324 -55829 -27796 -28216 -17421 -783 -13825 -29584 -17597 -16625 -21281 -22879 -11251
22260 -11251 -3351 -11181 -20544 -14267 -9947 -22791 4268 21283 4887 -6135 -1431 7419 13676
22247 13676 -19339 -22889 -15718 -34404 -28968 -20679 19968 19119 4183 24293 13369 -17413 -8614
22234 -8614 532 1758 6103 -5233 15312 -15875 -19327 3995 -1190 -2504 -3262 -1911 -4609 27483
22220 27483 -531 -28920 -18082 -13707 -25132 -10278 4532 -15269 -23320 -27349 -10047 13306
22208 13306 20845 19143 -14717 -24760 -1012 -446 5955 19301 20583 170 -13690 -28196 -8589
22195 -8589 10492 13723 20110 18153 7766 -13458 -18282 -1777 12539 19635 -3679 -1332 -5423
22182 -5423 -13115 -28460 -37854 -18837 3195 18708 48908 54181 43484 47562 17908 -3016 -13997
22169 -13997 -18683 -22669 -25868 -7405 9849 861 14781 31957 21347 18474 3421 9078 27345
22156 27345 32590 31051 7849 -3154 3628 -785 -27240 -22053 7147 6780 -8520 -28899 -24860
22143 -24860 -6653 6951 -1758 -15348 -17796 12271 5889 -918 -19807 -16703 -29457 -32296 -36282
22130 -36282 -37064 -21287 -15153 -932 -5979 -24924 -28730 -3612 -6448 2901 13468 8669 -4037
22117 -4037 -12965 -18220 6410 6719 7075 -7523 -16594 -19936 -3950 6456 -31838 -9045 25437
22104 25437 30450 32083 40235 55481 50688 30165 17433 632 6010 20357 -13981 -19765 -24737
22091 -24737 -17496 35844 53967 32500 32664 39741 18366 24684 7381 -17273 -20173 2157 -9349
22078 -9349 -38373 -9610 -22124 -28642 -17911 -9933 -17415 -17438 -4632 30008 31055 24997 24685 4256
22064 4256 -17047 13390 38310 22904 14145 30915 36451 37676 45402 7957 -16455 -5659 -8799
22051 -8799 -33780 -38853 -33405 -42850 -53000 -52117 -32255 1260 14046 10882 -19467 -27282 -32191
22038 -32191 -47677 -47920 -27756 -42951 -43306 -22723 25575 15282 14065 24853 9543 -1500 -2251
22025 -2251 978 2686 10998 23983 8104 -914 -9145 -14582 -10793 -5189 16810 4225 1355 15720
22011 15720 14812 1548 -2298 5176 18391 38696 34633 22821 30583 9226 3572 -15078 -15715
21998 -15715 58 2995 6486 -13491 -27944 -39452 -19160 -24409 -36362 -56174 -36913 -41128
21986 -41128 -51782 -35580 -16184 -14050 25178 48321 55274 36497 43696 34072 17848 15712 262
21973 262 -4497 -10830 -19981 -624 2509 -16088 -31270 -36584 -25683 -32115 -32488 -30310 -12589 -5732
21959 -5732 -31026 -31081 -6876 -6460 2608 24832 17843 14649 10819 -2384 -3701 -3216 2742 -32777
21945 -32777 -37902 -18378 -4332 -6326 -26776 -30250 -12580 17625 16184 27717 29007 25097 8194
21932 8194 20460 39059 22859 -8210 -24687 -26341 -43511 -38035 -57136 -34796 -26542 -10354
21920 -10354 4402 -3996 -11091 -26610 -14524 757 13550 15929 -2232 -6433 190 -10483 -30359
21907 -30359 -23426 -18578 -24155 -7540 29954 39901 21841 20388 9270 8490 -3010 10016 -2746
21894 -2746 -3626 -18793 -23180 -11636 -14488 -18631 5967 -3306 -20125 -29322 -38542 -33506 -20817 -26662
21880 -26662 4500 18691 -14743 -21751 -43110 -15407 -6878 -3946 -16637 -1809 9705 17210
21868 17210 4314 -6739 -4168 -25839 -32651 -20570 12941 19466 -958 -1285 -16784 -44158 -64971
21855 -64971 -62575 -56347 -70838 -59949 -44972 -23688 1399 5719 -2158 7188 2968 -3650 19024
21842 19024 11834 14591 14578 27815 9517 6952 17865 10263 -9707 105 17739 25122 28663 14704
21828 14704 115 11716 35747 26617 -9338 -7813 -15340 3960 11367 15814 14726 4127 -21690
21815 -21690 -15707 -3594 -26927 -44987 -35850 -55951 -61730 -32217 -10763 -2130 1769 -26393 -33894
21802 -33894 -42601 -24848 -7780 10781 24883 19690 7718 -17057 -48037 -39770 -24045 -1789
21790 -1789 10023 -13490 7660 7994 -2861 -14365 4389 -13332 7820 7980 -3439 9532 12132
21777 12132 16688 8782 19016 44602 59156 26803 49029 66644 51229 44308 27693 4474
21765 4474 16885 -14500 -32760 -34406 -5950 2675 25924 7414 -5226 -12079 -14804 -8907 8988
21752 8988 513 -10370 -15306 434 8642 -15828 -23106 6626 10118 -1314 -1573 10590 21170
21739 21170 6562 -9170 5920 -2788 -5467 8052 -23566 -40574 -10436 23275 30478 9948
21727 9948 25449 30477 23114 19091 16694 15195 35603 12357 -34404 -39589 -19995 4005 15632
21714 15632 -2784 -5643 9740 12905 19895 30854 37346 20258 8483 4311 2765 23534 43461
21701 43461 17875 16333 17732 -5924 -21811 -32842 -55499 -59761 -45984 1847 2300 11710 36750
21688 36750 41618 29108 23580 5815 -22831 -18268 -441 -10426 -49566 -43396 -47626 -39895 -3011
21675 -3011 10442 34075 34749 32018 39379 14862 17259 6225 -11995 2869 18130 28411 28232
21662 28232 34398 38046 17388 8658 4951 27141 55598 30143 14087 -5926 -3417 14929 24223
21649 24223 -1301 -12422 -11238 -7993 1004 14679 12370 4928 8461 15314 10426 -23179 -34708
21636 -34708 -35434 -14970 -21754 -28519 -14320 28592 37229 -7907 -2854 -449 -4723 -9453 -27672
21623 -27672 -23972 -10558 -2949 570 -23047 -36173 -24893 -10176 -9324 -25712 -25997 -30209 -25513
21610 -25513 -30724 -37391 -32716 -33298 -23706 -22811 -14412 -33210 -43606 -37961 -7723 -17087 -34090 -54152
21596 -54152 -34196 -28178 -10525 7460 38399 19439 -12215 -4208 950 17589 54609 24056
21584 24056 -5745 -7970 -3634 -29143 -15107 8150 -22502 -31732 -24434 -10807 -2929 -13149 -19891
21571 -19891 -18990 -15407 -10970 -18850 -36616 -36145 -51396 -46996 -15903 -8258 -37576 -40133 -39925 -18292
21557 -18292 -20104 13286 -11565 -40555 -54975 -43421 -58047 -47892 -56863 -64589 -39844 -38911 -73771
21544 -73771 -62199 -29338 -33919 -37474 -727 13933 -5361 -8914 4016 23908 20471 17340 -660
21531 -660 -6094 -2122 -25855 -27409 -19909 -19683 -28277 -8432 23460 15816 8172 12162 2900 32488
21517 32488 36091 12950 8548 6099 27373 -2589 -8719 3841 10985 -10278 3440 29940 35575
21504 35575 10162 11319 31290 27863 18908 26519 41411 3281 -13079 -13437 -1363 -21430 -27528
21491 -27528 -658 8355 -25985 -8070 2995 -4360 -20819 -12289 -4106 -12077 -22903 -22294 -16562
21478 -16562 -27508 -45651 -46717 -27851 -24416 -31433 -35867 -51960 -41981 -28741 -56927 -49030 -3316
21465 -3316 13937 20285 5243 4797 15642 -658 -873 19387 17500 23244 29768 22813 26790 -5505
21451 -5505 -13359 -8586 -18685 -18433 7876 4502 -17507 -14602 -22122 -33832 -4697 16700 -2327
21438 -2327 -4574 11382 8176 5060 10059 -16463 -20427 -32215 -26355 -5685 9078 4196 5754
21425 5754 14837 -2462 -33991 -17556 -3099 -4653 11604 33542 21910 19066 30361 39560 1762
21412 1762 -24065 -11597 -26258 -29805 -10956 -3421 -8045 -11855 -46192 -48500 -23332 -32400 -20181
21399 -20181 10285 26788 26300 20604 6307 -30622 -34150 -23629 -817 20859 22234 7940 -16957
21386 -16957 -22899 -2662 74 -14701 5641 20450 24470 -3594 -48474 -44798 -22505 -14297 -18668
21373 -18668 -31819 -9243 -22638 -29613 -8193 3041 20248 28918 21037 18233 17220 6317 -982
21360 -982 -19197 -26416 -17245 -17826 -15328 -8735 24468 56041 57267 26976 -20822 -34339 -24516 -36984
21346 -36984 -11735 1174 15877 32115 40905 35055 38775 43384 15983 -15043 -9121 16471 27098
21333 27098 10132 10072 28314 21225 13812 -3632 -9133 -7846 -4529 6527 9183 -4741 -38498
21320 -38498 -15564 -23889 -40251 4355 37453 21273 -2167 -13404 -4477 -9480 -21721 -23724
21308 -23724 -33049 -22266 7875 17003 -7266 -18770 -19442 -15532 172 40911 24776 -17028 -11398
21295 -11398 15830 48730 66025 32559 -22658 -30739 -11689 -40424 -59790 -92847 -70534 -22196
21283 -22196 -18916 -28834 -52862 -56975 -28856 -13125 12544 17401 15648 20882 10684 6412 32069
21270 32069 14611 -9668 -27352 -37606 -11203 18796 24677 7071 -3466 -13797 -36401 -38325
21258 -38325 -31316 -13158 -15180 -1366 -1541 2878 6657 35511 26185 -21423 -37946 -19720 -27452
21245 -27452 -39061 -31546 -31990 -40968 -37259 -10125 31826 31927 6572 -6136 6641 19710 -24401
21232 -24401 -28584 -30885 -4091 4885 -12249 -44255 -79677 -70045 -49968 -60777 -58446 -39531 -16139
21219 -16139 6504 9220 -3875 -33766 -37930 -8728 -4311 -35001 -44362 -31110 -14159 -5922 12643
21206 12643 27125 26931 23587 7335 9986 -2630 -12883 -11767 -12621 4396 3613 4947 11629 3568
21192 3568 -20751 -35172 -39112 -26522 1358 6380 11775 -5598 -13430 12718 15553 751 -25450
21179 -25450 -20310 -7115 -24165 -17271 -13043 17216 -6276 -19006 3139 21483 16517 19188 5926
21166 5926 21767 2783 -37002 -46138 -29908 -19747 2609 956 -182 -18998 -45327 -38571 -45756
21153 -45756 -30078 22212 42239 34362 2978 2434 -1095 -10246 -4313 15514 13213 13757 29461
21140 29461 30502 27340 13377 8971 18659 15646 25767 9774 2169 -14454 -12117 -5627 -20660
21127 -20660 2651 2646 -10168 -25186 -8188 14587 8271 -30126 -19111 3718 3349 -6112 15234
21114 15234 28120 36873 23374 -4020 -16377 12837 59449 88596 71058 51839 54206 26033
21102 26033 -3687 -9872 -8750 -17238 -18033 -19520 -24905 -50336 -34899 -793 1267 -21910 -26640
21089 -26640 -24343 -26265 -49385 -25577 -11969 -24391 -24572 -13585 -526 10313 13861 -5807 -14956
21076 -14956 -52213 -13021 840 -14616 -15297 -17560 -20989 9706 34461 35045 24130 -172 -11612
21063 -11612 2564 2223 -33057 -59396 -51748 -5204 -16274 -14051 -9713 11039 4427 -11025 -10244
21050 -10244 -8975 5597 18833 -1377 -3525 -3378 25572 31366 3976 3457 22173 37736 13807
21037 13807 -698 -5757 -851 13065 26723 10404 -14992 -20851 -4478 -9199 -33679 -32241 17121
21024 17121 54282 37102 31447 16274 -3140 22317 26511 -2849 5362 -5391 -7708 4729
21012 4729 30875 29541 5881 20417 35575 20722 -5738 -29319 -19365 -12962 -6392 -27845 -33762
20999 -33762 1305 25913 30917 20800 -10240 -32067 -50689 -46116 -44307 -22144 -42945 -42386 -55880
20986 -55880 -80872 -55136 -20495 -4977 -16866 -6941 -13968 -1834 5139 18335 39051 35581
20974 35581 20182 3517 9849 21396 20376 8702 21927 24285 15239 15874 557 -1651 -3807
20961 -3807 -24976 -3686 11767 10983 9699 -5193 -27940 4868 11465 -11975 -23197 -15802 -35272
20948 -35272 -45507 -29159 4184 7330 26373 36900 5897 27918 21202 9872 -17024 -22933
20936 -22933 -4114 3850 1375 -15642 -19658 -25065 -35668 -26908 -20161 -26987 -21161 -22633 -24437 -4035
20922 -4035 -5319 1353 -13657 -17924 -22560 -33801 -46040 -42024 -41707 -28791 -17341 -18266 3469 -214
20908 -214 -9767 3687 -3087 3060 -5285 -15544 -41124 -29367 8862 17234 12259 5823 -3018 -22893
20894 -22893 -27766 -23828 -15813 -39661 -35785 -34916 -13083 7360 -6330 -26677 -9028 6523 -14663
20881 -14663 -27552 -18081 18675 31702 50001 55436 2523 -23620 -31861 -23342 -15328 -20537 -30873
20868 -30873 -33866 -32564 -22657 -9644 14160 11108 18292 10132 -7736 8733 13451 13071 30011
20855 30011 26988 35940 50572 19816 20166 -788 8374 7534 -6222 -17446 -36265 -30991 -17510
20842 -17510 -23877 -52063 -75889 -39387 -35823 -33215 -42331 -68887 -51446 -50318 -42018 -39373 -19734
20829 -19734 2530 7812 -6193 1205 -19232 -42425 -66724 -67615 -29353 32418 55737 29042
20817 29042 -3092 -17761 -26078 -10609 20676 13516 -11823 -33080 -45110 -43122 -37449 -36866 -31458
20804 -31458 -24427 -28117 -26873 -26672 528 8306 2113 -29281 -39843 -8107 -8497 -22534 -33519
20791 -33519 -28510 -2749 5680 2244 -19189 -44215 -50390 -58046 -64897 -62162 -22284 -1805 8373
20778 8373 7603 2543 -519 -3620 3190 2002 -25741 -32414 -37232 -25490 -25327 -27687 -14761 -13854 11355
20763 11355 21987 20627 22312 9384 -898 6351 13424 14311 11418 -19542 9159 42394 25024
20750 25024 34791 37711 24203 -11346 851 7508 3320 -19113 -20510 11912 19469 4339 17374
20737 17374 15018 -8036 -6250 -16432 -5286 17402 21464 16023 -231 -33627 -35740 -15691 -9414
20724 -9414 -3058 -9584 -16429 -13009 27337 29446 36102 46085 33858 11531 8520 15645 29219 27585
20710 27585 44586 36791 35973 15655 7774 -26589 -37111 -24395 -11458 -524 -17907 -7043
20698 -7043 11507 11741 -553 3714 -25686 -33817 -11044 4296 11709 9785 10783 -98 -30295
20685 -30295 -45023 -17081 -3371 -12463 -13892 -7678 3711 -1192 -43223 -65575 -46579 -21549
20673 -21549 -10497 25996 44177 45526 14864 -7816 -18782 -23153 -7335 7273 16671 23837
20661 23837 -5406 -28627 -11287 911 13954 7071 -5716 -11311 -23303 12452 3890 -12534
20649 -12534 -17336 -2355 15543 16726 -26563 -44585 -36112 -45963 -34495 -29211 -30416 -27701 -23258
20636 -23258 10428 27353 9797 17972 26749 -8430 -31175 -46359 -50728 -32071 -14801 -5679
20624 -5679 6049 23628 -22491 -10680 8840 33424 15497 18555 17995 28316 31392 23157 -33353
20611 -33353 -29491 -18847 -7579 -3086 -20619 -43828 -43436 -39547 -11528 10977 8561 1840 -14564
20598 -14564 -2465 16248 2175 -19275 -15131 -4032 29596 34630 44953 34136 3841 -9944
20586 -9944 7724 -3879 7176 18108 20639 31 -19177 -15788 -28132 -31909 -38699 -24768 -9159
20573 -9159 15109 22740 8639 1222 -17746 -31675 -47003 -33571 -14589 3035 -23775 -20843
20561 -20843 4299 10640 25501 37467 30849 23747 14275 1564 -1328 -15735 -45233 -52468 -27657
20548 -27657 -193 -6636 -9790 -20375 3410 2012 -22050 -1260 -3724 13611 23894 34758
20536 34758 26460 333 -5214 -3326 14561 26240 25771 12025 -16709 -30228 -13850 -10688 13465
20523 13465 16309 -10711 -30466 -38284 -50587 -52032 -41455 -32570 -44523 -37613 -37158 -34823 -20482
20510 -20482 -5028 -7439 -14923 -23051 -25158 -13791 -15877 -10556 -438 -17849 -15717 -17674 -8930
20497 -8930 24342 38150 34284 8972 -7889 -6040 -2608 -12504 -7871 3734 4462 1028 4969 -4154
20483 -4154 -16185 -21758 -28023 -18236 12464 39972 10945 16723 26960 31934 12570 21520 33705
20470 33705 23480 3576 29604 37417 11018 -30522 -29891 -40872 -26035 -30959 -60990 -55315 -23473
20457 -23473 -17460 -22814 -11444 -2798 2785 12551 -1801 -20710 289 34624 54803 44170 42139
20444 42139 25538 6405 29034 44346 -818 -8502 -14585 -161 -6381 -13025 -20529 -32615 -9652
20431 -9652 24606 29229 -2464 -13722 -11683 9325 18995 -9827 -34014 -33876 -17663 -19876 -9469
20418 -9469 -14220 15969 14914 -7998 -4718 5610 29538 35054 34075 19691 1743 -1350 -17245
20405 -17245 -14912 -29305 -40277 -51537 -44422 -47952 -32778 -17340 10712 -4287 18661 12984
20393 12984 -9029 -7388 -13442 -37667 -32208 -31386 -21393 -31735 -29885 -17125 -12567 6340 25380
20380 25380 15551 -5355 -20114 9543 32257 30802 -14122 -24108 -32690 -18324 -5332 -12053 -15491
20367 -15491 -19673 12925 -3100 -15871 -16570 5372 -18402 -31773 6692 2529 -4139 16468 4389
20354 4389 -2839 9932 38000 30635 4016 10796 -1765 -9111 -10434 -16607 -20269 -10938 2691
20341 2691 7630 21371 31496 9155 6229 1356 -11562 -15396 -13801 392 21225 16243 2816
20328 2816 -10818 -20201 -17901 -6554 34657 51228 42706 34134 38311 60980 28831 558 7419
20315 7419 -21650 -50740 -36928 -28563 -38719 -47954 -26486 -19094 8157 9826 -20452 -21152 -13947
20302 -13947 -3762 14372 22889 12032 18868 22190 3265 -3682 -15118 -15787 4925 34856 29335
20289 29335 3055 -30133 -35468 -32818 -27518 -7997 9363 31568 33329 18859 18077 45704 32534
20276 32534 40824 48916 8063 4214 7004 14450 16593 13757 -445 -7597 -21362 -51799 -55835
20263 -55835 -22513 23115 31316 23556 31958 20364 2878 22640 8781 -20273 -16300 -40072
20251 -40072 -32831 -20385 -13693 -3637 -5777 4303 -2338 -19074 -13399 13828 26998 11762 1859
20238 1859 -4996 -2794 -28147 -16149 -30425 -23740 -5119 -15064 3142 26939 18627 -18652 -11154
20225 -11154 -19858 -27215 13885 23663 10130 32457 67192 91268 74953 58612 64996 51663
20213 51663 59302 33665 9519 4884 4793 -8133 8360 38661 56654 58836 35208 33442 38843
20200 38843 -1192 7714 33215 50016 56817 15265 -31791 -45672 -7538 2089 2348 -5633 11215
20187 11215 8633 4338 5946 -5177 -19087 -10030 21608 13179 6069 10650 18903 17598 21361 -3325
20173 -3325 17644 57520 41808 18721 19134 40533 50789 71247 46475 40286 49425 42732 32067
20160 32067 12345 -7789 -19167 -40128 -25254 -17636 -30582 -37130 -25011 -13556 -11572 -24100
20148 -24100 -21517 -9118 -12833 -12225 -23617 -10945 -16246 -4874 -8875 -5614 933 -16175 -31841
20135 -31841 -25819 -19339 -27986 -16913 5550 14473 -1116 21414 18842 -4815 -8744 3873 26079
20122 26079 17444 -10601 -24565 -27545 -28393 -25923 6140 32537 10120 -3809 -6525 1564 -14346
20109 -14346 -21596 -6930 -21304 -46128 -20550 8254 -8106 5618 7827 -8644 -22898 -11902
20097 -11902 20285 34290 12470 13051 -1926 -6064 10867 5699 -9386 -17836 -6988 -8403 -10505
20084 -10505 -18229 -12500 -7910 16348 36707 36425 16645 -6641 -49413 -24350 -11696 -10870 -3319
20071 -3319 3519 24 -4000 18675 25474 27891 27508 -944 -18996 -33213 -29856 3650 -12488
20058 -12488 -17234 11717 24553 9310 -8617 5420 20978 14904 -2075 -33158 -43677 -35859
20046 -35859 -29040 8643 28971 8264 283 -3212 -10879 -10159 -20478 -7304 4902 12142 34880
20033 34880 26868 6555 10568 11679 16633 -6885 -23526 15566 54479 38369 20866 13264 10125
20020 10125 942 -20588 -27583 -31339 -43821 -16084 25475 69182 61509 49838 32556 5144
20008 5144 2324 12957 38298 27185 1366 -6714 14058 23494 8773 23889 28847 39142 23775
19995 23775 6989 -18758 3371 25637 28332 -7256 -36959 -8582 10385 22645 27289 33970
19983 33970 37544 -5097 -21233 5311 6671 -10329 -4282 -25489 -34645 -36254 -55365 -76095 -63717
19970 -63717 -26216 -20027 -27543 -33406 -36357 -51168 -46539 -4904 25651 -3602 -20617 8321 5980
19957 5980 17793 31217 35162 31151 12237 -840 -9632 4186 21409 11175 9092 -12653 -25842
19944 -25842 -28666 -37510 -28162 -7152 -1634 13713 -1655 -3228 -14363 -24928 -7829 -13517 -507
19931 -507 41174 36496 27226 15216 -4253 5314 -6056 -4801 11134 -27564 -65490 -49798 -36314
19918 -36314 -13432 -8198 -2912 7037 24180 39266 31929 46933 22101 18300 6480 -20847 -33573
19905 -33573 -15400 6266 4302 -25946 -17995 -9077 -6316 -10259 -17684 -33089 -20604 -5422 -20838
19892 -20838 -9474 -24279 -44004 -25796 -15485 7787 -22471 -39354 -26975 -36539 -48073 -13166
19880 -13166 -22499 -40159 -33702 2751 16192 -15727 -35536 -19563 6023 30948 24561 20518
19868 20518 18623 21775 28999 14750 11578 22157 1190 -8406 -2250 -5352 -38253 -60861 -57039
19855 -57039 -63876 -50754 -37482 -26518 -24652 -18639 -17425 -29897 -2524 37203 16018 16980 4690
19842 4690 13124 19673 18486 34752 23726 16015 -6064 20178 15973 -10758 -22989 -23306 16322
19829 16322 16671 8267 21764 25391 10755 3870 18416 24085 35540 41957 25631 -14320 -43443
19816 -43443 -29065 14912 19275 8039 25976 -5511 -33056 -39572 5307 35490 41831 53361
19804 53361 57762 40014 21224 27849 25937 24689 4516 -8971 8637 23740 19871 14752 10752
19791 10752 2911 -2913 4029 12557 9584 11755 22309 12492 12327 -19592 -36222 772 15360
19778 15360 15371 -571 18470 900 7381 10868 -5436 -3669 -6957 10091 8055 -2206 18436
19765 18436 11980 24 15319 42947 20586 13288 249 -16519 -7136 33655 47272 28098
19753 28098 -212 -15771 -18946 -23794 20816 57068 60732 42771 42349 51975 72629 69711 33083
19740 33083 20309 31502 25437 -2637 2929 29153 40550 34009 25500 19891 6382 4971 -1422
19727 -1422 -11025 13483 23841 21386 3935 -4300 -5543 -3458 2744 15434 34738 57979 43773
19714 43773 18262 22372 10350 32506 4800 -31503 -35171 -38145 -21204 -5405 -13388 -18872 -14741
19701 -14741 -7440 19238 30156 28112 22244 5666 -5897 -14623 -3480 -7945 -6108 -4022 10147
19688 10147 14850 -14413 -4503 10469 64 8987 17912 -2243 -49898 -67746 -34991 -21495
19676 -21495 -19419 -13043 -11097 -12029 -8054 -13503 -7086 -22681 -43989 -45753 5972 45013 58417
19663 58417 28825 -1743 -1939 -12331 -19249 -11558 -3851 2782 -6704 -33727 -23259 -12897 -35696
19650 -35696 -47652 -49424 -63398 -48758 -49426 -41043 -9165 -3325 -20756 -19424 3982 -1968 12441
19637 12441 10882 25692 31808 18378 -21949 -25381 -16795 -8869 24081 38516 23692 33679 21771
19624 21771 8467 -17856 -9280 32801 47211 38275 16103 26192 29778 56294 45760 16622
19612 16622 19291 4248 -6969 -6051 -14462 -7740 1575 8547 24716 24661 20675 22116 57745 40090
19598 40090 13704 1263 -7920 14617 13615 4644 682 11669 14889 42333 49224 49496 41876
19585 41876 39732 43330 36253 8634 -5154 -27680 -40745 -25055 -11499 1018 16580 22411
19573 22411 19512 27529 39769 33969 31132 35895 6489 747 21231 42774 45318 15598 -27607
19560 -27607 -24536 -12319 -15253 15874 7221 -8920 -5637 22260 21169 2735 14878 34019 24981
19547 24981 32910 24150 31044 26643 26498 7935 18206 42765 31063 42718 16675 27527 30990
19534 30990 21682 760 -21691 -21283 -10419 -824 -15691 -9715 -20835 -6295 -4146 -7168 -22691
19521 -22691 -9383 28509 48061 29233 2875 7603 -4036 -13752 7551 6862 2070 3307 -6353
19508 -6353 17698 44688 -4290 -51127 -49246 -33266 -14936 3434 -4218 -4046 -6972 -13860 -2117
19495 -2117 10408 24138 42553 63993 76892 48381 29345 47316 60585 65304 56486 44223
19483 44223 21837 -408 -19600 -13823 -3994 -6869 -32801 -13261 12310 24450 5371 7773
19471 7773 19630 11693 -13567 -15211 20623 3108 -15197 -5692 2456 7203 23826 41315 28983
19458 28983 14028 -9646 -40877 -48309 -28592 -27352 -28128 -1357 -120 -9218 -17759 -22369 -10527
19445 -10527 5371 18186 22889 40890 41151 36725 12674 8924 -688 262 19966 21486 29766 3207
19431 3207 8539 11616 36008 52232 28318 20120 7948 21375 34692 21623 13261 322 -2376
19418 -2376 32337 52077 44933 33768 2905 2350 21299 34725 34856 9796 10320 -7998 -11769
19405 -11769 6469 11371 26529 34090 19511 23228 62561 88412 69936 51392 32068 38569
19393 38569 61349 63408 63800 40396 780 -12437 -8344 -10081 6149 11968 -11336 -11745 2917
19380 2917 18602 1646 15877 26185 26694 -10809 -31889 -36952 -17226 -2545 -15009 -11313 -17605
19367 -17605 8819 32256 24092 8347 33821 77665 90094 45499 32963 33102 27836 22627 28494
19354 28494 40095 16230 34887 53377 44175 14078 30126 34754 58565 67411 39967 20026
19342 20026 17258 21936 30365 22253 -4992 19106 30902 1519 3146 -1454 16956 53626 49846
19329 49846 34750 4154 -7155 9029 39979 36611 28236 38797 40915 40095 38826 30773 16901
19316 16901 27497 33917 43035 18005 15934 30647 44168 37773 14146 -12002 21365 24198 12649
19303 12649 9246 11905 11510 13711 29798 40844 34315 11493 1552 30984 70725 68419 49093
19290 49093 48616 44631 40739 28361 20772 32786 35075 31761 2361 -11494 1507 15929 7033
19277 7033 33004 33893 21577 25657 39085 26922 4047 8084 11833 17362 21651 38179 30140
19264 30140 27401 13538 -7682 24083 47985 76006 95618 77977 41196 10350 25873 23033
19252 23033 17024 38571 58355 67473 54071 59730 77781 73165 65010 66364 69139 69900 45062
19239 45062 15989 7879 15225 46228 57641 45793 49943 74634 73312 62841 47038 60992
19227 60992 33200 48526 39024 29877 -7794 -30264 -12981 22927 14242 -2194 -11686 -15518 4485
19214 4485 27713 53649 44231 69692 57004 22251 2529 -6747 -3526 -6170 8850 31002 35907
19201 35907 32619 1728 -19858 -14729 6523 31596 43371 62721 63960 51193 57897 55782 50751
19188 50751 52071 52687 45313 63464 55039 58669 103121 98289 49410 18236 10050 7616 12057 5666
19174 5666 15468 17816 33601 35503 37655 23280 18777 34905 38896 26342 50298 64436 59170
19161 59170 47374 52769 74085 57451 -3132 4360 50255 65020 48409 42244 46315 54467 58167
19148 58167 46782 29456 35867 52144 33597 38105 72660 59033 65188 96286 102607 96434 64936
19135 64936 37908 32835 63060 95165 104610 104565 98606 90090 81923 68630 44838 36092 44966 47985
19121 47985 53643 70140 68454 65412 66678 50733 27900 27514 20873 32679 46896 33141 52948
19108 52948 79479 104483 91428 50346 29358 63923 98718 108455 90805 56115 76637 107774
19096 107774 106893 76956 80129 69534 59727 60812 73872 38131 31656 55522 61676 68145 78266
19083 78266 76816 67657 69819 89186 82557 99630 87147 63561 72299 85853 83060 76632 90055
19070 90055 101230 104674 125233 114593 94835 79794 92374 115477 118305 107402 96469 83105
19058 83105 74275 45112 53679 94699 103698 102689 94246 84084 75598 55622 73526 97524 123779
19045 123779 140882 118421 92192 77983 28370 5948 27070 42733 55743 59904 63664 46992
19033 46992 39420 55632 54501 55761 79633 67316 32314 14722 24461 38652 48277 72368 66428
19020 66428 67840 82548 77821 69637 69919 68618 56211 50946 56142 52518 64213 79815 79119 68943
19006 68943 83319 105373 99558 91723 109424 147968 165494 141074 165356 178112 170600 161253
18994 161253 135874 152507 196571 244432 274647 315062 385555 434717 487486 538370 566907
18983 566907 577621 536594 491045 446588 451912 484876 571354 634365 697850 724026 686449 629368
18971 629368 555794 478943 415923 383375 363801 329629 291971 255989 274099 282767 280528 259026
18959 259026 241423 246074 228698 196684 158008 174496 188851 195507 213826 206109 235644 266243
18947 266243 290828 298122 322657 351801 391008 432585 463776 500464 484363 462689 501022 574748
18935 574748 607406 673004 798599 937333 1042043 1095058 1068923 994599 895976 813204 794914
18924 794914 817752 839364 824691 771168 726491 641598 523998 412714 361828 321820 298772
18913 298772 293745 288936 267645 268017 283580 286778 261127 257905 244173 232582 211953 205380 204939
18900 204939 198275 204000 234446 252798 229545 254685 322262 368978 364236 371412 401245 427602
18888 427602 433825 434036 429770 426124 404307 399900 403161 416568 432423 458500 511775 578243 619254
18875 619254 597191 546512 489361 467854 431851 373372 363292 384944 383697 391752 403070 399371
18863 399371 392605 377468 357050 360324 349869 335325 309699 300458 323710 334612 323761 316281
18851 316281 288625 300159 318396 340709 339528 329067 297595 264101 257914 285780 309283 307517
18839 307517 312375 340316 345632 351340 355521 363657 374870 384844 394331 386209 373747 357122 372246
18826 372246 381033 377155 399997 381789 370867 352068 346378 337081 307982 301185 296268 303371 329825
18813 329825 302463 282676 272704 245226 235561 202987 188920 182558 186504 178843 199952 204550 167547
18800 167547 152038 148739 152870 152707 144129 147337 139765 145659 152178 137133 140639 138934 147203 147952
18786 147952 134045 147876 147809 151418 128054 128113 134854 152861 139402 141457 184169 218596 189876
18773 189876 186406 216272 235827 257287 290459 326308 339511 330970 329832 277422 211831 194304
18761 194304 179198 177336 198589 188225 147760 136094 136242 147822 149655 171733 181289 193252
18749 193252 191617 190288 174657 146717 134841 146556 155744 168577 168959 142808 118013 125600 116373
18736 116373 135732 154102 140547 154939 153961 145753 147254 148956 140697 117128 123052 152844 167838
18723 167838 148505 131278 111550 102299 100402 105126 102170 88467 90282 129662 174926 190014
18711 190014 194609 183467 168966 146342 144368 154420 150954 143726 151490 135411 106909 115106 140129
18698 140129 156386 161579 176002 191663 188661 177431 157801 151149 162513 169337 195339 177729
18686 177729 161888 141034 157640 191194 209840 190762 182437 196041 192577 184248 176254 155855
18674 155855 187309 207434 216746 236058 213998 218896 232413 219931 202519 182047 186982 217522
18662 217522 221707 208887 180079 205797 225324 245390 262174 267261 248103 267182 277881 285585
18650 285585 290512 300976 313998 327058 349148 356262 351360 325953 287894 250689 241579 247544
18638 247544 255300 275504 273607 300916 299240 293889 288613 256536 276078 289513 288665 285485 306062
18625 306062 328007 370142 395665 405480 407072 394702 385531 350886 339642 351159 347377 348527
18613 348527 344285 334658 351290 395865 410247 377428 363975 368126 376086 346060 328173 325631
18601 325631 323581 359600 366630 359079 342356 312013 304169 301440 311831 355109 352704 340805 332158
18588 332158 356787 354858 339303 366978 393196 395015 419588 457017 444886 440468 438161 424457
18576 424457 403925 426701 449582 467108 466998 473375 459551 462405 458461 445448 458187 503056
18564 503056 509347 516324 537957 545255 558873 560239 551064 561344 545270 538988 533210 547043 549256
18551 549256 575259 629044 639715 633070 634755 613805 617626 661837 690092 682232 660239 666716
18539 666716 660548 666670 692573 713834 716826 736786 752045 764133 771863 828870 891968 928772
18527 928772 983337 1042699 1081529 1101958 1134402 1179721 1209878 1206977 1168100 1170615 1163294 1142565
18515 1142565 1134691 1154829 1155904 1179121 1212018 1235206 1289424 1370762 1467971 1599176 1800131
18504 1800131 2093038 2464336 2841917 3262425 3882857 4801514 5958786 6730250 6842866
18495 6842866 6495002 5640580 4642223 4023417 3774332 3795785 4014578 4316677 4673716 4891943
18485 4891943 4977378 5018881 5082330 5374603 6083532 7298540 8959831 10538690 11217490
18476 11217490 11029595 10317729 9001027 7674770 6790593 6158786 5710163 5537244 5714402
18467 5714402 6276341 7076321 7682744 7926304 7912019 7708202 7545201 7731262 8299553 9218726
18457 9218726 10343794 11766874 13594236 15507923 17270098 18109761 17861600 17224451 16488886
18448 16488886 16006692 16427374 17355662 18126285 18465243 18457926 18296206 18166907 18398742 18926602
18438 18926602 18756369 17827972 16580027 15040788 13924098 13781266 14646437 16579838 19811206
18429 19811206 24174459 28960425 33797742 38608029 42114987 43865437 43710865 40437282
18421 40437282 35406925 30204113 25430455 22557468 21914947 23246270 26502684 31276178
18413 31276178 36879037 42005876 44695478 45213719 45003389 45011231 46080736 47839337 49961245
18404 49961245 51958351 53433803 56544222 63549187 74460819 86893742 100058670 115636144
18396 115636144 131692374 144597728 150994637 146761029 131755054 110368022 88639105
18389 88639105 72023178 62825528 60043543 62567135 69335674 76583829 79583927 77948012
18381 77948012 72441857 63749401 55448068 49991143 47013823 46023958 47684929 52864652
18373 52864652 62377913 76168598 92847839 112065609 131536187 148252410 159848232
18366 159848232 160991542 152026844 137500514 117895159 97755212 81812356 69322625
18359 69322625 60568249 56877143 58353718 62695757 65012836 63406133 58821230 51638183
18351 51638183 44658110 40471764 37886704 35724643 33847835 32277928 31357574 30663842
18343 30663842 29674652 28525471 27222379 26359983 26889084 28595532 30503188 31650525
18335 31650525 31337374 29904454 28401805 27882313 29412805 31759233 32992847 33293871
18327 33293871 32728154 31360445 30478253 29952139 28604392 26391400 23935507 21794755
18319 21794755 21002393 21554179 22448424 23299024 24398041 25979678 27606141 28215992 27813534
18310 27813534 26442497 23918432 21095789 18528317 16188056 13994902 12095753 10828810
18302 10828810 10210650 10184619 10647743 11239293 11738798 12318320 12715705 12396726 11705389
18293 11705389 10875558 9814551 8996558 8520109 8075194 7534135 6856666 6115503 5450483
18284 5450483 4906479 4453201 4087703 3763725 3490386 3259377 3086904 2941939 2857950 2780895
18274 2780895 2742266 2676136 2567441 2429296 2313768 2221791 2114703 2051410 2029624 1977359
18264 1977359 1899855 1838494 1765633 1718086 1661000 1618170 1582046 1562998 1585081 1604442 1600198
18253 1600198 1641872 1668931 1670460 1695881 1698751 1620953 1528485 1435266 1323573 1195463 1090619
18242 1090619 1037258 996013 950901 921696 898879 893643 884272 848192 858884 829015 794645 789335
18230 789335 748226 732479 688108 618703 592974 572933 555306 556982 555472 524570 509524 469113
18218 469113 451104 438127 438899 431424 405437 387744 360391 336853 307723 305249 306756 325083
18206 325083 340250 373432 400512 373579 331549 319894 323565 333775 329603 359317 398685 431075
18194 431075 474565 479552 463238 412658 351161 360576 362693 377014 397029 403291 377956 350999
18182 350999 291389 242047 236416 217012 194812 180923 196197 219705 235228 260170 251432 216503
18170 216503 200097 196365 185843 178331 200328 225807 267495 289587 282965 240396 218900 199844
18158 199844 198589 215303 237791 264208 317868 373301 431693 476097 525255 553823 553712 560296
18146 560296 559948 505976 437785 388257 368045 337810 334672 325476 333402 361740 399081 419600
18134 419600 425976 424823 419069 438296 455815 489904 558121 622862 682292 717708 802560 913398
18122 913398 1083182 1305830 1574171 1912751 2353101 2938897 3832181 5177550 7225760
18113 7225760 10557197 16464626 26497344 37219776 40741083 39134577 33602638 22930073
18105 22930073 14152124 9521136 7075455 5602463 4624221 3949855 3464576 3073130 2756359
18096 2756359 2526621 2354245 2205943 2077704 1947474 1797726 1619729 1450957 1326891
18087 1326891 1248602 1148809 1010644 900284 837549 796530 769057 735890 689355 654487 628412
18076 628412 588366 542088 520482 510845 500398 493919 478710 476455 486865 483929 450792 426045
18064 426045 401757 382572 387517 380841 361560 335022 337720 340614 324255 331279 325525 310836 302129
18051 302129 304474 316204 317662 306055 309268 307208 288957 276178 257385 234204 233448 246083 221254
18038 221254 192622 188101 191104 199617 198994 181679 181451 197642 183279 151358 154476 149218 125994
18025 125994 107570 85060 56572 56502 96916 135541 144918 148968 139859 115656 112760 131210 128323
18012 128323 130341 128654 137626 120278 107653 117601 94567 92784 96873 101126 86721 69587 73677
17999 73677 81785 69085 35302 37905 55944 63554 66537 45284 50528 39826 42615 57842 55720
17986 55720 25806 6556 26085 41796 33848 30936 26827 50450 72407 21789 33286 42679
17974 42679 42620 60168 80396 89833 101442 107406 136468 180107 232024 208376 181443 189783 201803
17961 201803 186476 162626 173520 179588 183970 197696 224935 229928 220165 199882 202458 204784 175333
17948 175333 195225 218800 223179 216552 186926 182121 200940 236160 240290 237902 227221 235860 241964
17935 241964 243221 220872 197558 178533 177747 189424 199901 214679 247985 311057 344541 358050
17923 358050 325492 281151 267479 264650 279283 332681 380036 380994 397134 414139 414265 411831 394322
17910 394322 389514 424163 435153 471331 517949 541038 517221 492468 461994 439610 432766 376940
17898 376940 310867 292948 289899 271365 278667 299822 305698 318721 328989 324462 315561 282333
17886 282333 252547 266866 267775 288939 283310 265656 225969 233166 254062 276195 299410 324034
17874 324034 352461 399935 420803 439784 477144 485044 471547 445413 455090 449291 438098 467802
17862 467802 524617 580599 643465 690852 713898 733354 747198 776293 758504 677008 602028
17851 602028 500312 439113 437606 447570 404804 374683 333358 283248 268282 238490 216678 204072
17839 204072 168381 144826 132370 125773 136620 143478 152958 147624 142518 214485 246510 253422 286322
17826 286322 287551 249915 258781 259835 275795 280613 283354 295975 310433 346739 369884 347475
17814 347475 319413 278291 285095 315696 360152 354242 334393 326626 267217 203841 177292 156708
17802 156708 143223 154133 176884 203412 240127 252525 212455 169671 134877 93949 89216 86715
17790 86715 43426 29476 23868 40097 31736 37334 39054 19969 14604 28363 19019 25585 18821
17777 18821 29045 45840 39133 60928 44035 28676 22719 26200 37861 43139 5572 -25312
17765 -25312 -14528 -6749 7656 -396 -3555 -11655 -39738 -61658 -65984 -42680 -23912 3577 -5769
17752 -5769 -9081 -7939 3881 -8078 -4874 -14917 771 -11711 -13100 8726 33378 28587 -13618
17739 -13618 6623 37841 40472 12925 -9702 -9757 22446 29008 22212 3938 10689 3 4187
17726 4187 489 215 -3315 -9106 -15840 -24592 -18809 -2676 -19886 -32512 -45429 -53451 -27053 3671
17712 3671 6248 -18330 -41043 -19527 -8772 -7772 -10500 -23846 -15929 -2798 -22927 -4815 14034
17699 14034 4404 -6379 -33508 -88041 -99571 -82105 -42459 -8800 13719 11841 9036 -7992
17687 -7992 -27466 -19538 -21457 -20322 -15230 -7501 -13133 -10822 -3457 -1867 -25315 -34099 -39618 -9746
17673 -9746 1908 7244 8369 -1888 13105 14024 -20585 -33585 -24058 -21518 -15535 -40232 -51851
17660 -51851 -44874 -38906 -22305 -18279 -10593 25669 43543 17012 -578 13066 12249 -2129 -12676
17647 -12676 -20031 7250 31413 26293 14835 -8323 -35951 -42373 -44255 -34898 -26070 -7843 -3332
17634 -3332 -8061 -37334 -35219 -70950 -73502 -57022 -68424 -91966 -79751 -60004 -60181 -48099 -34248
17621 -34248 -11298 -15225 -22777 -51433 -66632 -65148 -65495 -53411 -30125 -44568 -50947 -28564 -38094
17608 -38094 -70623 -80697 -54744 -43063 -44231 -30015 -34515 -70648 -77549 -44069 -38868 -21532
17596 -21532 -41390 -46296 -44209 -42313 -26125 -47071 -38971 -23450 -19632 -5573 3759 -6689 -32499
17583 -32499 -72125 -78058 -72197 -82041 -80500 -59254 -50275 -35504 -41371 -52758 -34405 -18262 -15060
17570 -15060 -5971 -9539 -14217 6392 28712 15886 -1431 1668 -10871 -16110 -17557 -6868 -13861
17557 -13861 -26598 -31740 -21585 -29257 9257 49186 87940 49810 22401 -3232 -12668 -8169
17545 -8169 -24809 -10567 -36947 -56378 -77238 -75925 -63706 -41333 -26893 -14969 -10397 804
17533 804 -19736 -17115 -4405 -15905 -9402 2801 6562 -6431 -7217 16496 24194 5648 -460
17520 -460 -4672 -15129 4610 -467 12775 2645 -35544 -74308 -84484 -67340 -45329 -28519
17508 -28519 -32702 -42084 -40168 -46524 -42153 -45818 -29679 -35298 -41577 -38489 -31730 -17951 -5061 -7861
17494 -7861 25480 40912 3423 7392 -5330 -1228 -24122 -32270 3976 5825 -27124 -18731 -14456
17481 -14456 -27908 -39188 -35097 -5209 1935 -450 -27393 -27005 -7344 -28285 -18870 -30240 -24608
17468 -24608 -9210 -13199 -25712 -36628 -11957 -13177 -8415 -3864 -7669 -24417 -26618 -29699 -36261
17455 -36261 -15883 5592 17241 3004 -14245 -20342 -18382 22849 26175 49547 130898 193568
17443 193568 236780 237539 221343 153026 95348 70351 46893 46727 40769 35774 -403 -25096 -38149
17430 -38149 -18968 -37332 -24270 -21137 -38639 -39757 -19658 -1349 -35038 -48554 -50469 -34155
17418 -34155 -6471 -5597 2473 18703 14157 1141 -12163 -14777 -14816 -28352 -20067 -17783 -25771 -18498
17404 -18498 -14241 -9885 -2692 -32591 -32091 -37935 -79353 -99161 -59030 -17125 -7774 -8935 -14565
17391 -14565 -29911 -49089 -54720 -31871 -14040 -19582 -11775 -16470 -21065 -30500 -14690 750 7432
17378 7432 5686 9558 17467 -13979 -13838 -19224 -23493 -2774 10843 -16076 -27412 -3681 32314
17365 32314 56129 44472 8523 -23301 -36720 -30025 -23492 -1719 -11432 -53339 -53050 -39884 -6937
17352 -6937 23231 24248 -14948 -6799 -501 -15458 -20762 2967 13269 -5275 -7365 -16195 -7831
17339 -7831 4690 -3750 4686 -3990 -10259 1439 543 14985 20081 -11482 -29851 -33284 -37751 -25604
17325 -25604 -8629 -10056 20834 23591 37652 54565 39363 14019 5790 -11725 -2283 551 -7275
17312 -7275 -16983 -14443 2845 36339 46817 77041 86199 64068 56310 65090 74612 134082 124876
17299 124876 126593 112845 101675 103895 78351 58071 33524 31558 36390 43638 44208 61473 81109
17286 81109 86427 73799 79751 75163 74556 47430 19172 -7092 2991 24867 43815 50617 61311
17273 61311 40286 28183 48810 75421 79294 63132 70827 85432 94323 88791 95041 87193 101909
17260 101909 133536 156053 143050 134897 117851 142657 167864 199963 250629 328660 402736 508175
17248 508175 606903 727342 790266 795211 734945 631492 521472 393595 313697 251006 187547
17237 187547 159763 156742 142465 133691 121188 109149 125366 116533 86539 91011 96203 94265 100527
17224 100527 104346 96653 70303 64904 67873 54837 1894 -3704 20485 37229 54106 34531
17212 34531 5823 5217 -12399 -34580 -2044 37311 26334 -6407 -13457 -14538 -48236 -25577
17200 -25577 13667 2249 -24384 -14941 -16189 -13082 10445 9289 -18151 -8109 -5819 -3926 15155
17187 15155 13397 -8908 -10255 17865 52920 60966 62763 30009 -22835 -48169 -32024 -2287
17175 -2287 10279 40039 41958 14677 -5423 1181 34041 44995 33764 28867 15959 -12044
17163 -12044 -27178 -45086 -26889 -28319 -38341 -23464 -17301 6926 6965 -8028 -4891 1166 8469
17150 8469 3150 26197 73809 89384 75375 79557 78188 47762 17317 23225 11580 -449 -1676
17137 -1676 2180 8878 27200 14141 -1748 -26226 -46308 -46304 -27053 -11331 -15107 -34757 -35449 -31043
17123 -31043 -20651 -9135 -23595 -31578 -24232 -20069 -14884 -31722 -20649 -16519 -4926 1630 15563
17110 15563 38490 44894 29300 3266 10385 25283 11451 10862 14891 9712 33238 25047 36192
17097 36192 72114 86450 119167 153260 189061 243215 317018 442582 584302 753328 889824
17086 889824 967054 973486 923740 784612 616336 455893 342318 290791 233889 178255 164358
17075 164358 146351 128723 109777 105205 90181 43824 49641 38694 26320 20109 8389 -29658
17063 -29658 -51724 -35722 -15366 21570 42366 13824 1097 -6541 -37026 -52839 -38925 -1772
17051 -1772 5073 17822 5301 802 7142 4167 31743 52041 62130 35192 6682 -1894 3308
17038 3308 -11623 13599 36422 50602 51149 26137 18615 16368 30323 35434 22386 21423 25182
17025 25182 9344 5328 2699 11813 -1156 5580 12931 29121 52314 21567 -32123 -56152 -43307
17012 -43307 -3489 155 14271 20116 36095 37449 9934 -5169 -8591 -14486 4091 13348 37676
16999 37676 49571 40745 5362 -281 22567 39445 46120 27288 14172 2007 17600 39487
16987 39487 54276 39988 57647 80124 84325 64967 64862 59200 47947 32938 617 -11468
16975 -11468 16684 72936 67809 34867 41047 46702 39546 21265 6006 -10034 17632 34640
16963 34640 46867 20232 20925 32162 27575 14846 16590 26510 31617 23999 12594 22696 43880
16950 43880 47320 37031 40484 60892 94948 91933 99118 83875 64082 57886 67636 83790 50359
16937 50359 57944 62582 3959 -27225 -37254 -20745 6263 32351 34126 46238 42684 42041 40531
16924 40531 16111 11914 -1757 -29019 -41418 -23678 -14844 -13488 -1437 11111 27723 40138
16912 40138 26619 -6857 3667 3692 -3694 11274 22228 23266 25601 26641 51410 68279 34518
16899 34518 21965 12243 8213 24498 29735 40626 54821 54360 40632 28372 45099 45122 1560
16886 1560 -26666 -10525 -3394 -15650 -21124 -3849 -19642 -46872 -50127 -28785 -26753 -7941 9471
16873 9471 324 -865 -2120 -29355 -23013 4360 20669 19822 24766 56886 81006 76871 70082 38215
16859 38215 42373 77084 70576 64148 59932 58690 50474 36615 47076 57346 93107 106769 111496
16846 111496 91475 90953 88518 63333 31592 8600 -10895 -12098 15674 21781 22159 32577 61213
16833 61213 42875 52756 43798 42417 64544 79265 76743 89622 86727 92496 133915 166540 174024
16820 174024 181635 187541 199959 195485 180284 166727 124949 75283 62380 73532 69549 54607
16808 54607 53156 65096 90858 126190 102557 96258 107143 134725 142105 120260 83072 73878
16796 73878 41682 31124 47303 75247 87194 103741 117584 106731 61888 43669 25275 45510
16784 45510 62569 68857 80303 92677 98929 116662 127855 95467 93121 98412 85784 72007
16772 72007 49726 40614 51812 63323 74598 99614 102145 130911 163060 170650 150651 123781
16760 123781 130949 134467 179964 199563 208752 202641 215557 214711 211906 172409 176624 183227 193033
16747 193033 209233 208169 223679 249476 261343 276514 291556 311415 346524 375014 391796 415354
16735 415354 440839 471185 491054 514171 558052 605576 640643 671713 692269 711791 769799
16724 769799 818271 842855 878649 933905 1077296 1286474 1508257 1725960 1916292 2090264
16714 2090264 2255881 2386759 2477163 2598592 2827219 3122374 3535329 4014150 4611292 5318225
16704 5318225 6198296 7276789 8702271 10716867 13606953 17949733 24692679 35175357
16696 35175357 50669660 70598826 92919840 114866093 128896524 131004144 123194682
16689 123194682 105257811 82559754 61963846 44983013 32682584 24852977 19907200
16682 19907200 16639700 14404357 12824752 11706088 10905560 10273426 9673239 9093357 8457193
16673 8457193 7723724 7026856 6386987 5845779 5471431 5220476 4983926 4709660 4404321
16664 4404321 4057060 3678108 3292790 2939909 2646067 2425134 2272753 2083975 1941345
16655 1941345 1844494 1747946 1649050 1557348 1502965 1435345 1392675 1339674 1288731 1244262 1220045
16644 1220045 1200158 1155187 1136324 1099829 1095159 1063462 1052854 1041137 1013663 986583 949994
16633 949994 945274 954571 930613 910838 897610 860445 815568 733668 674519 649035 607165 580269
16621 580269 557826 547939 536267 512648 446903 424054 417757 416169 404544 389889 399508 413926
16609 413926 399995 356728 343479 343914 334294 316684 298380 287692 263935 237134 227573 217651
16597 217651 227601 218654 208049 192449 192592 176194 156386 158518 155153 131239 125071 137093 124535
16584 124535 130694 127741 107680 77077 77866 61703 34474 45931 60660 76599 82682 80793 71230
16571 71230 72417 38355 24928 -1035 -11931 -16311 -3249 -9528 -23543 3332 21560 29313
16559 29313 10771 4893 12697 14815 48468 52805 55328 46951 27702 22620 47739 62354 37912
16546 37912 30026 29252 34192 -9492 -15729 857 -34113 -80372 -86411 -78969 -47323 -23764 -34272
16533 -34272 -17908 -9218 -669 4028 16800 53068 46473 29247 8875 27819 47692 19947
16521 19947 -2584 -862 5025 12718 24125 37789 49650 33211 27820 7678 4762 -3317 38731
16508 38731 44905 36642 22517 18612 36574 37526 40276 13535 4196 -4673 -6871 16077 46751
16495 46751 55375 25081 18198 17848 6709 -8037 -3417 812 13899 26703 56580 83953 72512
16482 72512 107159 159554 228329 286148 351504 457902 590312 761136 929118 989674 968132
16471 968132 892477 743997 574941 430113 327310 282192 222440 166215 131866 113681 121444
16460 121444 108619 87413 68541 34163 2337 30254 42644 77580 87233 79486 42700 1068
16448 1068 -22543 3251 30527 39910 28838 11698 -7835 -15979 -33652 -49268 -34987 -27226
16436 -27226 -21640 -24544 1180 10561 18285 25303 2657 777 -7774 14475 18507 -124 -18720
16423 -18720 -39605 -59206 -59899 -28051 -19048 -39881 -23113 -25777 -16918 -31475 -39108 -21569 -13565
16410 -13565 -4678 9801 -7415 -23860 -28510 -27230 -41442 -57549 -51958 -13668 -5035 -768 13451
16397 13451 -347 5772 11082 3601 28969 35191 31741 46172 33458 -3512 -13870 2496 21411
16384 21411 40763 11595 -14432 -34579 -63365 -62564 -60057 -24328 -19527 -4402 -6691 -45327 -57113
16371 -57113 -35232 -16665 6477 18680 -185 -22087 -30499 -29711 -10427 2772 -2545 -26991
16359 -26991 -33787 -11302 4065 -4391 -6532 -29244 -36914 -13180 15863 12676 19780 24751 2996
16346 2996 -10440 -20269 -7000 -3835 9520 19594 53402 66451 62051 64896 86929 50502 19017
16333 19017 21293 -10614 -16298 -8613 -27770 -35648 -41601 -32394 -50712 -35946 -9857 -15660 -2459
16320 -2459 -12353 -20548 -22733 -37452 -57897 -46548 -26630 -6979 -23718 -42655 -44818 -53758 -42942
16307 -42942 -34139 -15965 -17536 -9751 1726 -31326 -31905 -18686 -44037 -63456 -49667 -26046 -10616
16294 -10616 -26483 -8832 -8731 -31375 -25898 -9987 8152 31825 61463 75832 71490 35881
16282 35881 -6685 -13433 -29446 -48419 -56708 -64383 -4411 2007 -6814 -16287 -31686 -33953 -23613
16269 -23613 -31213 -27494 -27665 8445 1377 -18774 -15602 -13715 -9867 -20392 -41564 -20390 -17906
16256 -17906 -24754 -4291 4191 -6077 -37845 -40868 -26856 -20714 -16232 -9176 -93 14619 1832
16243 1832 -7649 24445 20499 7709 11221 -10849 -55452 -81315 -74344 -43928 -33824 -42006 -52070
16230 -52070 -63361 -22122 8876 21106 -13827 -48396 -61471 -53557 -6524 15986 20915 -14483
16218 -14483 -38509 -17059 -32760 -44888 -11206 23978 21742 11954 3080 -9438 -9925 11372 19924
16205 19924 25092 33941 37589 22277 33534 48377 49568 32737 -2584 7344 32874 41624 9896
16192 9896 -17381 -35451 -12045 6341 -15522 -20850 12732 4110 -12342 -22371 -13660 35825
16180 35825 54334 66994 50934 84125 84121 54453 1952 -32415 1975 17613 18388 14633 3084
16167 3084 11053 7831 -12186 7806 993 -41271 -59856 -32983 -10455 -6593 -6152 -34286 -56226
16154 -56226 -31430 -2181 10393 30540 45029 31780 27542 46766 57972 33574 -2971 24186
16142 24186 48334 53678 60432 66144 78352 126855 169674 269776 373687 507496 637188
16131 637188 696726 681190 644169 559397 439959 316097 217074 175287 171364 146902 119561
16120 119561 118236 91523 39983 18398 10699 9477 -1215 2128 11151 23571 13670 -14690 -20719
16107 -20719 13146 8839 14905 24625 10801 24470 20397 -9724 -59418 -43043 -21677 -27776 -50523
16094 -50523 -66417 -54503 -45371 -37570 -23620 -4724 -19081 -10622 -2015 8475 6546 -26873 -15917
16081 -15917 20270 22918 16749 30499 26689 23166 25588 3888 -5563 -4230 -16441 -20002 -15596
16068 -15596 -3660 -16431 5502 32669 27591 13206 -28491 -39297 -10146 18110 40322 -2904
16056 -2904 -28294 -28281 -33177 -42778 -27796 -2730 14150 6972 8323 -468 -34804 -26152 -34770 -35445
16042 -35445 -27339 8827 15118 24241 24136 40460 19487 -6003 -30242 -9149 14699 6768 18918
16029 18918 16008 -4849 -2712 2475 14108 28698 29002 46244 67952 84969 93820 103810 54771
16016 54771 59938 76385 59638 49717 67326 112137 136326 126824 131809 131690 111803 88825 64625
16003 64625 38605 20468 3777 -19109 -36055 -2790 4457 -626 -13067 -1909 -3739 4589
15991 4589 5719 12682 5178 7253 10759 10809 24705 15063 -6384 -24547 -12038 -18495 -18582 -48225
15977 -48225 -51964 -51810 -37738 -9470 -14824 -15449 -8073 6202 4623 -36926 -64757 -29750 -7016
15964 -7016 -12089 -36317 -43965 -54001 -51489 -41612 -50871 -26902 -346 -15729 -29344 -6215 -16426
15951 -16426 -14259 4497 22526 10766 -7877 -15727 -50069 -39538 6215 22269 31436 17499
15939 17499 -7952 -9479 -22017 -21183 -1771 13293 23320 13220 -7338 -26884 -22729 -31949 -56420
15926 -56420 -55516 -43932 -41579 -31052 -14680 8981 20443 20705 12196 5117 1147 -7728 -1059 3455
15912 3455 18263 29991 6002 -17656 -23916 -196 -19935 -40995 -54319 -48702 -59683 -50782
15900 -50782 -10331 6506 9077 8047 557 -14505 -485 13549 31343 45116 39163 14636
15888 14636 -13186 -24478 -37203 -53052 -55001 -50027 -22483 -20127 -33426 -30617 -25438 -40631 -45373
15875 -45373 -39637 -39733 -57873 -45346 -25025 -17431 -8665 -15291 -19469 -6063 -21621 -50159 -79649
15862 -79649 -80001 -53997 -49812 -32690 -18167 -7560 -11710 -7051 -486 13122 -3082 -42387 -40337
15849 -40337 -28055 -26004 -16126 -29040 -42362 -25188 -11952 5397 -13388 -42487 -45557 -50995
15837 -50995 -64868 -79833 -81213 -73411 -36892 -25986 -7088 -194 -25145 -25849 -10928 -31300 -54689
15824 -54689 -23926 4487 -13745 -16483 -36848 -45713 -18526 -29202 -33183 -19911 -30679 -11936
15812 -11936 1323 25670 33849 2873 -17050 -2764 -10013 -23530 -2054 1218 -5367 -19981
15800 -19981 -48300 -53262 -35864 -26534 -26964 -36768 -18135 -9048 -8256 -31284 -28141 2291 18714
15787 18714 20802 4708 14465 38179 -1337 -16000 18656 -11589 -40935 -31315 -25913 -14152
15775 -14152 4067 18565 22902 22363 -23833 -68335 -69733 -55035 -14452 19233 -13663 -19260 -31600
15762 -31600 -19665 1805 34635 34210 38318 32227 11063 -9877 -56561 -58999 -52309 -42982 -23779
15749 -23779 -46256 -64382 -78340 -73769 -65489 -60369 -55641 -39338 -38811 -22553 -13818 -20874 -48061
15736 -48061 -31129 -7735 12119 13482 8993 -635 11409 2639 -6400 -55641 -59610 -55369 -71967
15723 -71967 -54268 -47330 -48150 -39359 -30190 -22268 -28809 -7785 -17914 -32713 980 3241 14110
15710 14110 11145 21899 31939 31200 40463 57666 13406 -36288 -61282 -62122 -46539 -13997 134
15697 134 26397 31737 28051 -3564 -24555 -33481 -30233 -26928 -22886 -17000 -30790 -15043 -10817 -33141
15683 -33141 -52384 -48545 -45775 -35455 -17203 -21549 4570 5304 -26219 -9407 -2301 -21350 -25702
15670 -25702 13157 8063 -6741 961 -5363 -7825 -9885 -868 8431 -13847 -18337 -6336 -1333
15657 -1333 -16636 -22598 -17638 -25725 -31173 -15277 -9286 -3612 17466 -2265 -48848 -43533 12859
15644 12859 17619 17847 7863 11378 13057 32963 13006 -7426 -19726 -29636 -32162 -49006 -86634
15631 -86634 -74113 -42346 -49541 -37640 -16926 -7997 -3756 -7471 -5528 6542 -10008 -15258 -13343
15618 -13343 -13660 -11487 6030 12215 8185 1864 -17288 6144 36994 28327 -14496 -15889 13603
15605 13603 17259 -6998 -20487 4087 -14413 -16400 -10450 -14307 -16278 -33061 -23069 -6719 25164
15592 25164 27173 7568 16124 3898 -14072 -12547 -7039 -17324 -14203 6960 19302 33698 29739
15579 29739 36917 12201 16453 13781 8995 -25881 -67408 -68140 -14841 10572 -18461 -22595 282
15566 282 -15074 -35122 -32572 -40990 -54547 -21283 -20636 -23666 -12035 -6894 -13788 -7206 -8183 -9674
15552 -9674 -30561 -26629 -14046 -42968 -47920 -43259 -49161 -43380 -16944 28669 22923 -10581 10461
15539 10461 15795 -5724 -5129 -13839 -21934 -21704 -19966 -39561 -43105 -23355 -30162 -21684 25258 30247
15525 30247 -2422 -18984 -13710 5737 9214 -1581 -20490 -31045 -12433 11119 27168 31224
15513 31224 17209 10043 14015 2223 -10403 -20969 -7241 14924 9776 20576 20954 -1762 -4977
15500 -4977 24733 26143 5709 -21139 -14680 -5490 -1142 -17506 -30331 -35543 -25136 -2258 13830
15487 13830 23445 11949 -19839 -24690 -24729 -41518 -41469 -25487 -19400 -29727 -12846 -4986 -339 27109
15473 27109 49731 31813 32203 33212 5452 15100 15354 -2284 -8010 3285 -8141 -28488 -25856
15460 -25856 -37181 -40986 -44909 -21840 -47439 -67757 -64636 -63718 -62743 -39934 -18778 -24037 -40046
15447 -40046 -41149 -29497 -48324 -37844 -32309 -54457 -47158 -43784 -32209 -20228 -17709 -22495 -41173
15434 -41173 -308 -12607 -13918 13508 2291 -16177 -34657 -25018 -36170 -53823 -67860 -85858
15422 -85858 -80572 -46669 -38078 -50034 -31130 -2839 -16498 -10384 -8064 -4187 -13268 -25969 -25204
15409 -25204 -41069 -48549 -35848 -5721 25 3369 -17929 -46610 -35062 -11136 2910 -23178
15397 -23178 -26833 -9597 8747 25216 1002 -31238 -19396 -19095 -227 -2072 -12111 -6549 -2274
15384 -2274 -15405 -50540 -51036 -59090 -63346 -66036 -53413 -42234 -17228 4992 -14535 -19831 5331
15371 5331 -581 -6751 -22184 -56375 -64528 -39412 -5344 7287 -17934 -15778 7654 -19222 -59519
15358 -59519 -59290 -60719 -65526 -60319 -31055 -28465 -10043 -21375 -34946 -62284 -33385 29914 23999
15345 23999 -2397 -34048 -31939 -3691 -10175 -23758 -34313 -41651 -9034 -9845 -675 22165 42387
15332 42387 36214 26271 26781 40484 25656 15393 32218 30601 46839 35207 10334 13965 23262
15319 23262 13419 17157 29410 18360 28575 24816 10324 8414 12927 16912 24388 27237 29076
15306 29076 23504 66597 85007 137440 165426 177554 235828 286376 354744 424299 535460 685436
15294 685436 875384 1117039 1384027 1560223 1667540 1680130 1628941 1449001 1198062 970167
15284 970167 787500 617257 472480 342301 264135 234890 210571 220222 217947 177425 163671
15273 163671 158065 118036 101536 126370 122005 105440 117465 98910 77556 78148 82199 53904
15261 53904 15687 14616 38463 49305 36725 44259 44394 33647 27064 33131 44520 12513 16877
15248 16877 43416 33074 4906 -15244 -49743 -55095 -35485 14220 36397 23572 541 -13502
15236 -13502 -42826 -40324 -36732 -7388 -28678 -41578 5921 25164 22294 12923 19058 20239 3359
15223 3359 -25618 -14640 -24120 -44192 -36173 -33049 -46044 -32572 -14919 -13360 -27621 -17869 5619
15210 5619 15747 14717 27960 26932 4609 2403 12970 42745 62980 73002 33285 4977
15198 4977 10412 -5289 10569 32403 33875 6313 5454 2603 1801 -933 -17395 -21759 16885 27395
15184 27395 14081 10074 22274 676 -15578 -15006 -20445 -6854 2687 13786 48779 61526 23416
15171 23416 14283 5383 15766 32202 28939 16564 11527 27805 20547 5808 -1439 -5351 -17073
15158 -17073 -19365 -19782 -29175 77 12788 13706 6934 10819 17514 -1824 -18490 -45808 -56683
15145 -56683 -51483 -22203 -2923 10278 14423 9182 14159 1661 -17016 -1939 -7910 -7955 -16116
15132 -16116 -10362 -4347 -42630 -58083 -11618 24226 29563 11582 8258 2603 -7188 -16023 -9344
15119 -9344 -44084 -53013 -38649 -61245 -80395 -83951 -90340 -58046 -42347 -45994 -51664 -21803 -9378
15106 -9378 4023 19729 31682 56528 39835 24693 977 23203 49715 39036 7004 -15220
15094 -15220 -22072 -55236 -87711 -72897 -39918 -4567 2918 -15263 -37042 -30882 -60698 -69697
15082 -69697 -57225 -11569 9894 7988 -18790 -33896 -65867 -75321 -61093 -54502 -48023 -39427 -18383
15069 -18383 -3797 -17805 -20236 -41200 -51729 -69300 -53440 -17222 -12536 -9684 -4985 -22948
15057 -22948 -29847 -44078 -47870 -5146 7186 18587 12438 10962 9342 11882 18283 2235 -24233
15044 -24233 -34250 -2135 -495 -8126 -32893 -66148 -61020 -57300 -33177 -9708 30549 20200
15032 20200 -1613 -20778 -24280 -32912 -35971 -10750 12068 25119 11323 -12282 -19186 -1629
15020 -1629 -5263 -6149 -18507 -42981 -14526 5568 28966 30537 -259 -38175 -19461 -13329 -12609
15007 -12609 -53438 -59851 -65531 -55599 -49561 -54309 -41310 -16760 -23022 -1018 -4412 2939 -9360
14994 -9360 -10243 2982 -19660 -8749 -7418 -2211 19845 22001 32060 2376 -9289 1196 10489
14981 10489 -22682 -54823 -53506 -54540 -59866 -37712 -768 17837 13265 -7542 -46796 -41033 -38213
14968 -38213 -16790 18583 19942 -19408 -33740 -43895 -47148 -51151 -60903 -70016 -44024 -52055 -54066
14955 -54066 -21196 -16998 -12329 -6992 22789 11828 -15413 -25666 -26295 -15619 5910 2723 -10106
14942 -10106 -36778 -34845 -32564 -40366 -43317 -33425 -2084 11493 28165 40215 22928 -8936 -38607
14929 -38607 -29183 -8987 -28317 -24508 -12440 -7870 -24723 26326 24028 -5044 -5460 -6730 -26880
14916 -26880 -28942 -66245 -65887 -26674 20587 27334 16124 -20363 -16943 2975 -7119 -26847 -26892
14903 -26892 -7159 16607 -6140 -25261 -14378 -650 -4720 -23773 -23106 7608 -10224 -28515
14891 -28515 -28218 -43441 -27184 -7131 14869 28847 60841 42701 27084 32832 21526 7007
14879 7007 6804 -9825 12314 24922 6575 -39703 -63079 -45524 -43143 -47538 -49293 -39849 -28588
14866 -28588 -2247 -20781 -18971 7868 16896 25881 8349 555 31775 67536 72288 32203 8205
14853 8205 10164 24451 9221 6478 6353 6191 17240 37571 24933 21402 16043 -5858 -14626 -22576
14839 -22576 6375 33377 29871 6562 -19063 -35123 -17484 -28542 -54367 -60081 -48274 -25127
14827 -25127 6593 27280 26094 16471 -10401 -1482 -35008 -48598 -46841 -51332 -28607 -19742 10882
14814 10882 35919 46051 35445 23051 -22597 -19393 -29926 -18377 -5791 -17371 -22514 -20075
14802 -20075 -16733 -5607 -653 12013 33711 29881 10369 4057 -5501 7931 17959 12397 44450
14789 44450 75265 46716 28374 9396 -17518 11329 22957 20840 29273 53025 60978 15863
14777 15863 46510 97223 100119 73154 73615 106699 79594 72536 59665 59916 63552 63433 82104
14764 82104 43012 27154 -5747 -29114 -36718 -6582 3623 20156 25569 20880 22986 30911 37182
14751 37182 11008 17937 34112 36042 45213 42075 65149 100549 109194 97989 112277 167160 290969
14738 290969 409738 539878 683684 826692 934898 949106 853104 712759 566161 457418
14728 457418 350104 277545 213464 197061 182361 167468 114491 71695 58271 42120 22147
14717 22147 35909 79116 88091 52323 5784 -17130 -17233 -6277 -6772 -8528 102 15598 16587
14704 16587 31249 30710 30393 33801 -11769 438 10981 16945 33766 40214 32470 72421 71755 30388
14690 30388 18805 18720 9287 6792 9852 24760 -8954 -12369 -3992 41882 55340 32250 14243
14677 14243 -134 -4892 3737 23415 32492 8891 9707 2274 -2725 -10104 -42087 -27983 -4085
14664 -4085 18722 50468 46694 39954 14894 6224 -6496 -6442 6322 8625 -7437 -27213 -26069
14651 -26069 -16505 18149 17331 12284 15033 -4250 -14013 -2070 24248 6007 312 18379 33181
14638 33181 26031 19812 14121 7986 4230 36373 47908 39146 33112 36130 42943 31569 26191 4768
14624 4768 3093 -17984 -23698 -5570 526 4893 11441 28795 51464 72256 47596 55270 75348
14611 75348 84230 69087 43275 26866 178 -7207 7833 12227 -1767 30532 50604 47765
14599 47765 58018 50993 41252 36832 25488 13022 12444 29802 38270 38331 22105 4999 5570 9597
14585 9597 8724 -13875 -4003 22179 25722 29977 19528 28321 27068 1627 -35373 -17522 -12284
14572 -12284 13574 5683 -46715 -38957 -28804 -15287 -4723 7843 -19113 -34129 -52669 -43116
14560 -43116 -35130 -19435 9308 -16413 -20454 -12440 -4414 8939 17193 7503 -4712 8616 5066
14547 5066 -24055 -9896 -18452 -18677 -10107 1040 7155 13154 8893 -10811 -23815 -52825 -61326
14534 -61326 -38933 -39067 -35281 -51220 -47682 -12876 -18407 2249 -256 -9064 -9191 -2376 -19755 -46962
14520 -46962 -43457 -44810 -28580 -14595 -17931 -19949 -29487 -23139 -8596 -22533 50 28855 27180
14507 27180 8910 2929 17814 15804 12246 10397 14956 -1431 -5054 -12838 -22477 1025 31587
14494 31587 23938 3877 -34465 -40521 -24798 -10448 468 -494 -15224 -13509 -20800 -15329 158
14481 158 668 -927 25212 58160 33449 16690 15836 11214 21518 6936 -28764 -13930 13034
14468 13034 52532 49351 -4989 634 4293 886 -5788 -7387 -3291 18781 1617 -7620 16960
14455 16960 41738 49414 50216 48793 53363 48571 16683 29216 17240 3561 14719 1136 3078
14442 3078 18716 38177 33043 27695 43307 75997 91959 106848 99832 116988 149220 201396
14430 201396 280893 345055 448661 598236 819923 1068428 1279454 1427451 1463802 1364580
14420 1364580 1175764 950860 728291 551058 416192 297768 216203 208717 197068 191163
14410 191163 175645 143103 90462 72503 77337 100272 92539 82928 86188 91756 96598 98860 102903
14397 102903 83090 88277 85193 76723 48910 51367 86792 109050 100267 82434 72318 57737
14385 57737 59803 70182 104499 103254 70727 91123 104504 65600 30312 23889 52120 64996
14373 64996 44222 40664 18671 12600 6650 5129 5273 -12713 -12890 -19961 -18849 16614 11547 -14503
14359 -14503 -23157 -6919 -8485 10057 34276 51978 82797 70339 16470 -11481 3899 34914
14347 34914 48054 46162 19703 19765 55709 86682 97900 97041 152147 209076 278250 333013 312575
14334 312575 267997 214201 165198 107405 106353 100695 108733 114206 87216 61119 44167 47763
14322 47763 69253 80121 99605 79699 68095 63284 59486 55184 17447 37112 67407 74480
14310 74480 56455 79763 92331 65305 23517 12380 17919 17812 12941 -17393 -5784 30420
14298 30420 39084 31738 47198 39452 47170 74584 65540 78891 62843 58526 56251 52069 36819
14285 36819 23151 9578 4849 22941 25138 21319 27376 35655 33300 40030 49653 30960 18287
14272 18287 21779 17823 25645 31176 53879 21687 21041 29372 63403 91988 109635 108892 89237
14259 89237 59449 48178 53761 52506 49660 33276 18058 42797 40081 33324 29333 44221 44477
14246 44477 45056 43494 44757 69992 52087 36423 39468 42738 30291 20484 34020 61676 65283
14233 65283 38679 29060 56634 79336 60367 77982 86858 46471 45492 61570 84706 115598
14221 115598 141651 132028 112976 104238 96248 68668 28524 48215 45847 36456 39981 36766 15427
14208 15427 26448 67728 105375 121202 151481 185982 238986 273541 252687 265824 267608 235076
14196 235076 206779 192207 191817 164875 125508 123542 128370 155642 154013 141169 140893 154096 142394
14183 142394 123226 99793 119209 139595 155895 168135 178164 182597 170810 133983 113165 129497
14171 129497 176175 185620 175512 178613 160096 164202 170558 174784 243832 288286 326899 369091
14159 369091 409828 468583 511860 556588 644295 785750 1010388 1333743 1673655 1921693
14149 1921693 2101604 2114012 1965982 1701031 1382103 1071459 849619 685727 572392 530435
14139 530435 479463 403449 380410 375035 363129 346744 317558 277663 243945 209703 183933 183387
14127 183387 157571 119900 128872 166412 165923 172230 182926 188021 173660 164232 159797 184933 206447
14114 206447 232655 249485 227275 209186 226450 236593 231129 230724 208858 228689 258333 270264
14102 270264 241687 217660 224151 230216 195931 156899 158251 176473 153881 126811 121591 142276
14090 142276 144911 164871 182879 186504 206805 218960 222949 201288 209477 201969 180610 151758
14078 151758 191922 262869 319390 391152 432590 468681 467915 401652 374863 356454 316249 258832
14066 258832 216317 229491 250654 260659 235267 204881 193081 210206 181906 175728 184987 215918
14054 215918 215553 170883 150407 171494 209983 219478 213499 187291 166634 157330 166286 150579 137528
14041 137528 171567 205880 206828 204971 235256 314213 379828 424940 472492 505677 513679 472966
14029 472966 411127 372672 362064 319864 293127 310033 307964 330410 335136 332891 341160 353471
14017 353471 367362 376146 387801 402751 444793 480390 470044 467146 453045 453306 488277 481107
14005 481107 491055 490542 460875 452860 467631 485483 501855 543302 603798 656046 688385 690054
13993 690054 709486 760072 808107 897468 962575 1022275 1109318 1218771 1364475 1554169 1803870
13982 1803870 2091204 2303385 2411305 2381973 2255735 2123140 2047743 2068712 2148427 2271006
13972 2271006 2449035 2634977 2830321 3041316 3279048 3588184 3988899 4484087 5195757
13963 5195757 6106425 7217668 8545463 10081294 11811903 13810751 16205513 19198203
13955 19198203 23135491 28683086 36804990 49085018 68367706 98542988 141504636
13948 141504636 191682773 238220890 270781916 278669374 257548444 216784248 168841399
13941 168841399 123265551 88121171 65321959 51282058 42305701 36218452 31875654
13934 31875654 28653369 26181243 24214512 22514645 20862888 19199614 17454743 15681947
13926 15681947 13999955 12476518 11198586 10106026 9186885 8389212 7710643 7117339 6596509
13917 6596509 6165730 5798582 5457934 5117286 4812108 4534066 4240553 4018571 3832312
13908 3832312 3641054 3475590 3334623 3228480 3116622 2993675 2887558 2819630 2735960 2676696
13898 2676696 2596153 2535679 2462739 2379121 2326279 2275263 2253760 2212413 2173693 2148877 2130106
13887 2130106 2106427 2076801 2018462 1975158 1919950 1865775 1785564 1704706 1620290 1544863 1458180
13876 1458180 1414050 1385604 1326265 1233800 1167090 1121268 1104302 1063027 998026 939355 906200
13865 906200 890650 871850 819400 759218 726261 692521 642760 626790 635851 582913 562239 563430
13853 563430 587302 588147 578943 564881 533580 536294 516743 481153 470803 419602 391816 395896
13841 395896 402220 386487 398878 361045 344024 339739 325308 315533 324758 315688 298391 292111 301518
13828 301518 310106 299481 273113 249658 242217 217867 179306 142028 86197 45387 15225 -17243
13816 -17243 -7312 43134 96488 137243 163709 178207 183467 169623 151052 124879 108558 117376
13804 117376 117395 132461 142628 160606 170506 165116 178999 183296 150852 128575 103522 62129 7829
13791 7829 -686 29178 64725 69378 81860 79713 89266 73477 71753 65542 49016 47829 53178
13778 53178 51286 61879 90077 118391 118344 118259 110705 109989 119724 126296 123585 125881 124905 121436 125031
13763 125031 123538 126515 131791 123126 122448 149594 150109 162295 148227 106987 124502 149394 141102
13750 141102 147096 122803 102596 80490 73187 80919 64688 26790 28584 52826 58071 52774 41310
13737 41310 43996 51941 47056 54876 69318 61940 57276 56449 66771 64855 59403 77960 89641 107875
13723 107875 130944 128421 114883 97050 73505 60361 35546 3944 26113 27930 21721 8759
13711 8759 17460 26447 25231 50654 47215 37282 49804 70576 60647 37990 29420 11241 -2199
13698 -2199 30641 29901 42215 29641 26273 33133 65095 89672 104420 87333 69270 64989 75703
13685 75703 42646 33678 52795 79532 77701 53791 37798 59159 100671 90857 43366 17468
13673 17468 10070 -14658 -3272 10085 10061 8055 26298 41636 70516 82786 92400 89002 83091
13660 83091 97933 101538 101295 118985 111539 140221 202183 259281 312400 394370 476544 524149
13648 524149 541882 523248 477611 429958 357557 269760 231957 215874 195028 181831 179268 171609
13636 171609 137505 91679 52813 83538 91502 67156 51726 73892 81844 78305 62070 53030
13624 53030 69871 64925 51035 41824 44907 60734 71468 82177 75730 65376 49780 36269
13612 36269 28208 26083 12525 11624 9610 3952 17302 8123 -9992 -29419 -17321 -16023 -6988
13599 -6988 -7141 -34905 -52698 -32732 7341 15504 24571 36880 23076 23613 20758 13370 -309
13586 -309 -2563 -4294 6130 543 8664 -4359 -5627 11459 31896 56212 63703 38689 23017
13573 23017 27397 35351 19614 17400 27172 13088 -8021 -10105 26588 35575 7989 22571 32694
13560 32694 41474 35789 3700 -3373 3572 22754 12348 -4828 3954 -12010 -4477 -11499 -18249
13547 -18249 -39631 -19552 -5000 -2285 -1071 25719 49609 35577 23073 30730 36851 41650 30420
13534 30420 22255 26930 10022 28428 40716 35187 6445 18674 51234 57621 12611 -23780
13522 -23780 -371 -1439 -3315 18496 21585 -5602 -344 25518 30757 55968 66242 48385 33357
13509 33357 31405 22450 -29510 -26733 -6820 19277 22355 5760 19145 14279 -10434 509 26640
13496 26640 21054 2480 16165 18443 33213 21968 3253 13491 28400 50290 18124 11123
13484 11123 49995 59735 38659 41593 54416 69641 103153 95205 91623 105355 95728 82523 89261
13471 89261 134543 177348 227676 278366 352236 507137 744126 978812 1215346 1414339 1510189
13460 1510189 1435454 1255282 983456 760167 585560 446090 359606 299577 255031 228943
13450 228943 203085 173286 144998 140211 158618 136995 101028 91536 66877 68462 56831 18780
13438 18780 23965 32227 28496 29227 42741 58663 57533 60508 46696 40789 17636 15562 9840 34640
13424 34640 65255 107099 92545 76583 62601 70094 65524 40015 29386 8729 -21198 -1792
13412 -1792 611 3369 9678 16405 13030 -6996 -5904 19044 35774 24104 30963 30691 40477 35382
13398 35382 44608 27030 33983 39876 16307 4541 13930 -1094 2948 11181 -13902 -11836 -31297
13385 -31297 -42217 -32893 -31822 -525 22646 28476 35575 34612 29801 51963 44440 37656 33698 39921
13371 39921 41106 22144 29994 16080 21384 23128 -820 30673 32045 35603 35473 7833 -11422
13358 -11422 1310 29307 13556 4337 24697 4966 6070 10249 10885 21867 19112 -7032 -3194
13345 -3194 -7175 -21481 -41650 -30879 19114 41181 53815 63855 60788 18728 8178 7622 17267
13332 17267 15527 15452 1142 -21101 -36500 -15034 -5697 -24632 -13962 11213 42722 25569 29091
13319 29091 15348 -25512 -58497 -74171 -78251 -76453 -28707 -14129 -6834 -32041 -32579 -39012 -27215
13306 -27215 14237 34792 32430 27584 24382 12803 21595 22745 3362 7231 5106 -9470 -9978
13293 -9978 -7185 19972 31748 27400 36191 33594 16678 -4527 -5651 9788 12789 -5287 -16824
13280 -16824 -6807 15493 26447 19351 29520 18585 16286 -2331 -20051 -45828 -39790 -7293
13268 -7293 2805 -7356 -24911 -28879 -19909 852 885 -565 -1425 -33984 -35309 -10590 -16413 980
13254 980 14773 12960 -230 -23139 14470 49637 54340 36485 17488 3710 11484 7425 11664
13241 11664 -9082 -10997 5906 36142 31773 14337 16155 8327 -3415 -6182 19708 36671 39417
13228 39417 51532 29304 -10299 3131 10506 1059 -11428 -14067 9553 22832 18661 9089 -7331
13215 -7331 -2518 16940 -6207 -15086 -24714 -44897 -34261 -36531 -33290 -50532 -15415 45400 57286
13202 57286 43385 34650 1669 -43845 -23590 6675 9155 27943 7443 45609 80646 57242
13190 57242 18484 9161 3267 -8327 20684 47340 46043 6497 -117 2813 34235 72883 82060
13177 82060 107360 112190 153582 212957 271351 357971 464219 648734 984177 1459058 1983852
13166 1983852 2372702 2491416 2294483 1846536 1330123 937919 672820 507503 377854
13157 377854 312043 298486 293065 274028 281310 260861 255347 240443 200999 185172 187943 180374
13145 180374 145307 136522 113245 81394 71764 75617 62035 59677 46150 38999 13589 3644 10196
13132 10196 22084 37335 41927 38837 30070 47181 30438 35379 55147 70722 84257 83101 97317
13119 97317 123823 111091 118828 115253 113947 116989 85157 72406 89520 104265 126704 114031
13107 114031 105695 74974 60710 31246 46906 59536 70144 83794 92394 64786 48378 40439
13095 40439 64011 82170 54180 46468 61205 69172 39832 35232 61064 88492 94383 80050
13083 80050 68185 58907 54958 36625 30715 57145 54662 54211 67676 55803 45631 68050 42665
13070 42665 29675 11701 12198 17192 4944 13727 48962 77473 75252 61385 55315 42128 51029
13057 51029 68003 49207 30265 12787 15324 35512 23417 939 3708 -2139 -5708 15288
13045 15288 20251 28127 76303 89508 94629 79394 45029 41775 60821 30544 31027 11920 -3850
13032 -3850 -2123 7652 18886 25754 21979 19386 40212 54008 58832 67951 62307 44914 56802
13019 56802 66923 83115 80262 65270 91185 103339 114314 122516 110674 81215 78355 91621
13007 91621 112273 105460 117333 142160 162062 176989 180263 198216 233484 287210 337977 409374
12995 409374 483605 511269 528250 521938 500839 462683 411878 369154 329775 324812 298034 268421
12983 268421 275158 318709 374547 423004 419211 381740 323694 300069 285788 243393 239133 247519
12971 247519 219788 172594 166664 159168 139371 140806 129339 136063 159004 156505 141030 123008
12959 123008 100987 90512 97043 109165 86593 70287 80043 85051 89716 52956 50901 54099 65712
12946 65712 77264 80572 92721 108304 121168 164312 223097 240785 268210 266797 241320 234959
12934 234959 226747 234211 240690 234084 234912 211306 195735 215458 225439 186214 176549 173394 143403
12921 143403 145648 145835 153879 133148 146338 140768 143027 180797 174654 145569 122441 122337 108379
12908 108379 56341 58200 62201 65607 100073 121124 141571 153548 169617 189267 212741 275650
12896 275650 366399 455836 514186 546025 559226 530470 504078 448190 412318 392224 411592
12885 411592 411084 375192 350248 377712 375971 372460 339831 317610 280922 208417 158009 114041
12873 114041 107235 84004 84083 105319 102248 107238 139473 178540 167652 172727 157253 207308 221561
12860 221561 192964 167644 153458 213717 344761 483161 593371 640416 617491 590743 555097
12849 555097 490181 452528 411359 364254 340541 333638 337844 309736 292577 283823 298486 286820
12837 286820 290191 284880 251662 244358 256680 269604 265995 268457 281496 296976 301987 276902 261132
12824 261132 244001 225047 225210 254921 272352 289442 303811 289948 274495 293691 304558 313123
12812 313123 306239 283617 270684 273558 303268 293650 267951 282814 306511 344628 365354 382924
12800 382924 385429 392051 399623 408598 411070 432201 442873 470544 511637 545757 583036 602220
12788 602220 593370 581371 554446 571981 610112 626986 618971 590927 583037 605195 650703 695047
12776 695047 773610 804715 843137 890227 954510 1053650 1154169 1258032 1351668 1402204 1443441
12765 1443441 1524270 1632233 1753635 1910024 2064883 2205029 2291732 2335016 2418474 2555322
12755 2555322 2732954 3030809 3326961 3711041 4189811 4750466 5323413 5770663 6060869
12746 6060869 6270684 6480643 6825889 7418944 8289666 9483357 11045019 12981780 15446657
12737 15446657 18610094 22744097 28331811 36043674 46607287 61254001 82409196 114627887
12729 114627887 166374872 247816212 352414996 438852828 469478804 445301418 373430889
12722 373430889 273418887 187045559 132174100 100132899 80135320 66481497 56487966
12715 56487966 48965121 43481997 39667891 37089183 35089949 33114324 30844287 28117205
12707 28117205 25044781 22119415 19672978 17665715 15982087 14527224 13254450 12156116
12699 12156116 11199015 10386884 9704933 9120829 8595733 8083304 7622097 7161632 6745676
12690 6745676 6352310 6049362 5834794 5597719 5354609 5145636 4909497 4684430 4503527
12681 4503527 4411995 4319118 4245440 4174503 4084253 3958904 3851023 3738861 3634406 3564326
12671 3564326 3513029 3476005 3435301 3386884 3327239 3289776 3277177 3290085 3265982 3201193 3091710
12660 3091710 2990822 2877498 2773384 2673448 2615662 2573699 2547744 2499569 2449776 2391416 2321994
12649 2321994 2248848 2203881 2258302 2410213 2685069 2911595 2968631 2805871 2495302 2116634
12639 2116634 1779493 1545730 1385880 1291129 1238661 1195539 1125942 1081412 1056658 1037825 1008325
12628 1008325 971052 924464 877645 827022 807821 745810 738085 734461 677555 596473 573012 557494
12616 557494 583810 568748 523312 518730 502819 490778 515412 525300 544579 523863 515818 484524
12604 484524 443770 405713 383807 353569 305658 195812 73476 60055 141340 255590 351935
12593 351935 376610 373654 343909 332975 316925 334754 338178 344677 338799 339675 359537 375701 394474
12580 394474 415019 444355 485690 498769 460897 414668 353202 318412 280330 231521 209379
12569 209379 252652 284095 259356 255288 293337 352011 400186 457108 523616 553145 553235 509267
12557 509267 449803 370211 299783 273803 282062 283582 331037 409945 478244 554700 675524 797794
12545 797794 990487 1216306 1353929 1358972 1278698 1089058 882125 731702 631466 559614
12535 559614 529493 517109 538298 622140 715094 790951 788612 758337 645669 490775 423164
12524 423164 405611 411790 417310 418666 414767 403913 378224 328296 295319 229033 185624 173469
12512 173469 169569 181402 208417 235047 245364 239752 234622 230405 215131 222573 237516 225533
12500 225533 194518 185606 162974 165088 170495 193130 176024 156392 154430 138685 124460 135645
12488 135645 152137 182535 193757 168772 150612 136254 144463 138762 129259 146768 178980 207078
12476 207078 247732 273905 276365 302723 354419 393549 416081 393003 372243 352213 321077 266406
12464 266406 230905 221408 230044 202577 192006 215668 234517 244891 237517 207396 178898 155124
12452 155124 130738 104043 89986 107586 110645 131442 137642 114235 120756 131734 151211 140230
12440 140230 104417 100596 108008 94585 79490 93348 96003 153147 200769 211836 198610 211502
12428 211502 231673 241327 282842 365600 502725 675733 855389 979428 993476 937653 774446
12417 774446 612122 488292 401547 330848 285890 258910 224662 178248 142133 147804 131121
12406 131121 116337 121465 116356 105271 115598 137419 126943 124097 120590 119540 106632 111074 108838
12393 108838 107538 91454 102304 136347 146243 162957 170940 168543 135299 103967 98797 125091
12381 125091 123319 81422 54670 60824 37348 70073 109811 92041 82236 106288 134347 144838
12369 144838 147050 176600 188469 178734 158346 143164 151807 132780 134853 124144 113285 106000
12357 106000 92919 85767 83029 80200 69583 80510 80728 65003 71557 89629 96929 99903 84582
12344 84582 110795 141674 100829 72251 54397 62199 86105 93197 68402 52974 37719 57289
12332 57289 67873 59400 66137 60396 33905 41509 63046 78294 74027 62032 80962 71829 86117
12319 86117 89220 86855 72388 64145 90537 77884 48315 53301 36929 34085 64813 100383 78894
12306 78894 59980 49094 59869 71828 108204 125597 95692 92739 93067 82041 92078 84476
12294 84476 64926 74592 99117 140110 149738 167574 194496 244088 325521 400410 490570 629085
12282 629085 905056 1351974 1910004 2360174 2502877 2372794 2028128 1501374 1048322 747596
12272 747596 562231 437894 352595 300916 265888 239585 234945 201281 183090 189868 213578
12261 213578 196149 132844 131473 154089 160408 155052 145365 158844 156892 111961 95148 118140
12249 118140 120977 113798 120108 115473 109012 83567 65434 56031 67603 74396 77198 89368 92443
12236 92443 73545 76197 79905 66608 59061 34194 40533 62639 46614 51794 62700 44192 46212
12223 46212 65633 61537 55382 51536 51113 43003 36423 57675 75834 76831 70027 70732 60087 53371
12209 53371 36447 25298 -3993 -28395 -44737 -21225 -6299 5207 -9819 -7447 10224 -8280
12197 -8280 -49 15760 32714 59101 65341 53781 55397 48643 56975 51947 56314 45005 1061
12184 1061 -19898 825 15507 8262 24317 38633 49889 66435 87504 97956 97242 96138 113560
12171 113560 127127 136802 158417 187594 238619 318148 450460 618571 795423 954950 1063802
12160 1063802 1093160 1022096 866674 637051 467567 380320 290332 231430 187452 136198 105850
12149 105850 91014 75024 45495 36981 57975 90630 102034 90945 76300 79458 54704 41765
12137 41765 40406 40763 46502 50581 22317 9208 37379 52656 56949 27631 8658 20053 51140
12124 51140 44365 32979 20833 9728 -2377 42717 34420 4518 -33700 -39068 -13954 -566
12112 -566 -40415 -40818 -31882 -6245 17483 27276 41531 64442 79734 71137 51774 52818 22520
12099 22520 -1959 7245 42720 39612 51829 67646 78961 75508 101250 91865 71978 49785
12087 49785 44289 43021 40699 52757 60372 51779 54049 49667 36688 26589 32707 24219 45
12074 45 -1571 16926 31894 48610 50524 22550 6476 2371 -9689 -4373 9917 885 315 6642
12060 6642 -20698 -8630 660 -26109 -30488 -33095 -38764 -10421 6688 16185 9208 -12966 -13093
12047 -13093 -28078 -23824 -1908 -9321 -19785 -5163 17167 39843 11683 -7517 14792 40516
12035 40516 29677 -3184 -28346 -33038 -16037 -13862 -22774 176 -10295 -6753 10167 13525 373
12022 373 8119 11534 6190 16743 17438 16192 34662 26811 25049 38539 16754 2666 3014 5274
12008 5274 -27398 -7845 17901 17366 17019 -8887 -41149 -32576 -12034 -396 28100 36989 13304
11995 13304 1108 -28104 -27274 -14150 8476 21357 -1241 10024 17665 -7277 -3105 8808
11983 8808 15505 35005 15976 39886 65019 55503 27441 17034 8516 7707 6165 10348 51849
11970 51849 74343 61104 44142 29503 -2198 -3665 13745 6151 -5522 2805 7598 11201 12378
11957 12378 11125 14926 1909 -4149 30008 18316 10974 6699 26133 31638 41859 47827 57397
11944 57397 31387 36267 55775 66127 33270 14557 33391 36141 -10718 -36575 -32258 -18632
11932 -18632 -39547 -30106 794 10464 25302 11931 5379 8220 19504 48721 34897 20885
11920 20885 3148 -2776 24800 25241 29815 38532 54290 18972 -4790 3250 -3213 -1251 7553
11907 7553 -15826 -20698 -11336 10037 23825 24279 12578 28894 26259 16115 -1703 -22388 2397
11894 2397 22798 14334 -16790 -13863 -2946 5815 12753 32792 49340 27122 4084 -14906 -8107
11881 -8107 9160 19031 15031 6812 8621 -4847 -24288 -17195 -4011 6686 1039 11219 26974
11868 26974 41140 38281 25247 15810 17482 32629 21295 12320 20513 39916 37017 33440 16972
11855 16972 30792 15660 2098 33219 28885 6441 23592 41477 20980 14428 15632 12634
11843 12634 32442 53914 52928 13440 16071 18943 -16754 -11058 -3012 -5796 -6840 17777 30052
11830 30052 16375 -19746 -6824 3595 4411 2956 6127 3670 964 -5940 -22055 -35598 -18245
11817 -18245 5952 41541 20605 2178 2600 9624 -5559 -14639 -19554 -18330 15626 22148 14364
11804 14364 -7923 -5286 -7083 13713 2004 -7853 -13890 -5242 -30815 -77899 -62667 -23413 6856
11791 6856 32218 20270 18953 20173 -9412 -41074 -36516 -35171 -35551 -24132 -13713 -29577 -10582
11778 -10582 36290 25240 -4437 -27098 -7235 -5830 -6519 -30195 -13456 -11564 -16473 -21173 -21010
11765 -21010 -27259 -10945 -38505 -52411 -23475 -21805 -11949 -20461 -44077 -41167 -30508 -1339 -6203
11752 -6203 -4635 -539 8363 33004 39607 30391 7699 -2069 -1070 20694 885 -9187 -16588 -14228
11738 -14228 -4342 -25382 -52097 -44867 -13286 1441 325 6463 -17361 -20829 -16095 -6954 -24650
11725 -24650 -39931 -50552 -69606 -95879 -111271 -82418 -51853 -43160 -22390 -7834 7966 11554
11713 11554 8764 -4016 7305 1091 -14134 -6112 -36449 -33628 -16266 7612 17116 12803 -9922
11700 -9922 -22142 -24037 -20758 -16712 8796 29600 37873 19994 6004 9603 5551 31145 40538
11687 40538 47322 4331 -34339 -11235 7761 -19996 -21322 -9019 -1240 -4470 -2695 -5892 1172
11674 1172 3217 -4712 -2686 25281 55140 38413 -4385 -17661 -8938 -13990 -38246 -51534 -30943
11661 -30943 -17282 -3684 -9134 -24629 -25411 -176 -26287 -50951 -30996 -36120 -33391 -16245 15038
11648 15038 21293 6396 -3748 -6827 -12943 -14862 -37933 -35148 2986 1283 1362 -5136 -6637 7392
11634 7392 20676 -1635 -31129 -43455 -16990 2555 17916 21211 25731 8379 4352 28558
11622 28558 37993 28402 13386 21221 8604 16022 30003 38947 30640 23564 -1150 -44550 -47261
11609 -47261 -20794 3430 38765 37659 12421 15709 33353 21828 -8271 -3748 5717 -148 735
11596 735 -16480 2928 355 -24408 -37117 -35680 -31038 -29637 -28148 -15094 -22934 -17193 13032
11583 13032 15635 15681 33518 34518 4220 -30962 -49010 -49803 -9002 -11169 -19226 6526 21403
11570 21403 13451 -14202 -30289 -29556 -3102 14201 26560 16918 9322 -11091 -27587 -32620 -7376
11557 -7376 -156 11509 16902 -16573 -28009 -41139 -30195 -29629 -41846 -33320 6979 17981 -19244
11544 -19244 -67716 -55586 -50290 -48618 -25698 -26029 13011 10097 -30971 -51073 -63771 -35023 -8069
11531 -8069 -20798 -20384 -14726 -33915 -25793 -5542 7328 1313 -32343 -32262 -14268 4019 -2859 10917
11517 10917 11997 11353 -6816 -40431 -45400 -60313 -73588 -52843 -20985 26671 61926 71040 60516
11504 60516 54911 35622 1572 -16867 -37973 -39021 -27661 -11359 -18907 -20552 -15491 7348 16555
11491 16555 -14275 -16636 2818 -19044 -3153 13584 9601 6835 -24460 -35483 -34618 6378 38810
11478 38810 34187 3072 -8044 -25947 -16795 -9716 -17268 -21336 -26570 -2738 5293 -4199 -16152
11465 -16152 -31384 -43665 -8736 -11505 -11796 -20379 -19709 -1797 -6554 24995 25968 -124 -30164
11452 -30164 -30892 -3481 7818 20358 4521 -22239 -24201 -14596 8580 -2334 -10543 -16944 -2330
11439 -2330 11966 10438 -1283 -3004 -15933 -15519 -1323 3531 18595 18307 -6192 -28249 -36135
11426 -36135 -38753 -15686 -5553 -15191 -44722 -67964 -41090 -17774 -17907 -30451 -29428 -23494 -26681
11413 -26681 -19664 -26234 -23972 -54065 -76603 -65332 -52487 -24307 6050 2687 24710 42779
11401 42779 33999 27346 15924 300 8669 30936 -4191 -16122 -27377 -24497 -28238 -3306 11857
11388 11857 -11274 -8225 32627 38579 41448 79201 68089 37998 23103 16361 7137 17696 42136
11375 42136 16180 -19524 -19450 -15577 -22250 14503 42173 34655 -2906 -13595 -6806 -14300 -13733 -15327
11361 -15327 -2368 14689 8833 17845 29786 20615 5496 907 -17136 -15059 -2401 111 389
11348 389 -24241 -39523 -12734 9638 11878 -22331 -31840 -14613 -6260 1030 806 -14502 -16780
11335 -16780 -26002 -10390 -1833 -21538 -16843 -10296 12059 38821 21130 -13862 -22927 -14717 2685
11322 2685 29849 42102 40475 40497 54917 63054 61337 45111 28365 -15155 -17693 2207 -968
11309 -968 -1647 3245 747 16633 6446 -11108 10213 20533 30003 24912 18222 20492 16611 35955
11295 35955 52504 50920 43605 33683 23529 9887 8188 12089 20606 -2702 -13533 -21069 -40922
11282 -40922 -45366 -46270 -23694 845 7492 16974 -2450 -14621 -10790 10422 -10652 -41188 -28897
11269 -28897 -4865 -11254 -20565 -44812 -61311 -40369 -36331 -43128 -31997 -43327 -46918 -61939 -56144
11256 -56144 -46745 -35517 -16191 18521 -1109 -22466 1964 -2318 -16241 3890 -22567 -39976
11244 -39976 -12394 39146 33259 6815 14881 27641 8804 -15230 -16739 -25940 -29321 -22412 23541
11231 23541 18445 -707 -29471 -21311 -25302 -27893 -46271 -18134 -5374 -27447 -3376 8948
11219 8948 5151 27646 48408 27874 7699 -2172 5208 12309 -3010 23644 47486 -24087 -61917
11206 -61917 -17657 -10154 -31366 -16514 1377 29675 29146 1596 -4404 1007 25459 33803 27913
11193 27913 22805 18471 9508 32298 36735 8750 -4194 -30245 -12306 14293 20674 -8908 -56472
11180 -56472 -36448 -2701 1491 13336 -5461 -32914 -27449 -21453 -15573 -34840 -43155 -30403 -15247
11167 -15247 -19798 -27957 -18161 -35913 -42510 -56463 -79312 -64623 -67248 -80300 -63207 -42610 -17289
11154 -17289 -7939 -39352 -20371 1473 4905 13553 5898 1356 -5576 2959 -1676 -566 -17314
11141 -17314 -7607 -13530 7463 14790 25099 48953 41341 18692 24120 10077 -12703 8083 12243
11128 12243 -5297 -271 1254 -1248 25347 36535 30026 23474 13864 5059 6337 -8840 -21833
11115 -21833 -8463 16303 19957 -15466 -42298 -36460 -23076 11998 14736 -22026 -12601 5518
11103 5518 8397 13317 88 2878 7823 6110 1504 -20361 6358 15719 6243 -1204 -27685 -43476
11089 -43476 -2527 3883 16514 -1134 7316 9308 -2278 -3394 -407 9994 11969 -1910 -13600
11076 -13600 -5179 -8602 3512 21372 7060 7506 -19575 -37642 -28902 -23478 -29626 -9749 11552
11063 11552 9358 2456 -3751 -5395 13222 23406 21800 12318 14983 12047 22425 29622 23281 35961
11049 35961 25095 3590 2957 27203 34047 27597 27384 28672 17840 20699 21821 41489 22200
11036 22200 -16748 -31034 -35341 -21070 -16644 -17558 3563 16931 19529 20310 25999 -6880 -8064
11023 -8064 27650 39081 31042 10303 13020 14153 -10872 1771 17329 119 -2748 -4339 -8176
11010 -8176 -10634 1868 20781 11752 -2971 19514 26087 28724 61879 60490 31821 6004 -28137
10997 -28137 -38914 -37858 -1795 -11096 -16834 -3673 13107 -9104 4255 11369 9563 -12251 -35506
10984 -35506 -25129 -14310 -8497 -6372 -10113 -20657 -35300 -4709 13299 -11215 -24918 -32181
10972 -32181 -12509 16071 8239 5190 11116 42478 38442 32974 19189 13036 10250 5419 16650
10959 16650 -3417 -5347 7883 -4774 -3590 7659 -807 -1452 1323 16371 2425 -12370 -39203
10946 -39203 -10317 5932 -1035 10495 4338 -17806 -18935 3765 5940 17121 23789 28375 30863
10933 30863 23122 2997 -8478 2835 -1152 -15764 -7205 -19623 -43937 -63320 -53625 -29748
10921 -29748 -18404 -6030 -18091 -5969 6644 -8624 -52403 -47209 -13881 -27330 -2341 -12955
10909 -12955 -4830 -16502 -32039 -28014 -24247 -4796 -6115 -28340 -16700 -14370 -12694 -32423 -37092
10896 -37092 -42408 -72300 -49648 -43271 -55259 -41020 -15235 -43634 -79410 -56196 -14921 16218
10884 16218 9458 -4887 825 38205 37388 46983 31265 4537 -14034 -4726 13654 20670 -1209
10871 -1209 6669 -6444 -4932 -21430 -16943 -3490 8395 16282 15975 -23686 -34560 -4660 -912
10858 -912 -3211 -18626 -30140 -25443 -12730 -26029 -35588 -42872 -52316 -23948 -10890 3360 -10319
10845 -10319 -8711 -27886 -35445 -29647 -24854 2793 -3801 -14707 -42351 -38999 -48261 -59255 -48113
10832 -48113 -38243 -17251 -15979 -36073 -28853 -21349 -37440 -44171 -65609 -63529 -42003 -35134 -15576
10819 -15576 6981 6733 -13746 -23393 2889 -10600 -40532 -41562 -29717 -5033 25265 37335
10807 37335 22511 18294 24369 8567 -1436 -8395 -11517 -11424 -27665 -38905 -20610 -13831 2861
10794 2861 -65 -14149 1509 22774 28522 -1655 -30110 -11670 -32343 -37175 -53754 -67017
10782 -67017 -44710 -17804 6087 20824 -17249 -25175 -2817 -1407 3957 21108 25684 28382 5273
10769 5273 -17456 -3811 9181 -7800 -12172 -14951 -2953 27393 24167 9517 22430 32516
10757 32516 -3229 -15628 -1192 -19736 8745 -20727 -36087 -17545 1172 23760 22625 11859
10745 11859 14882 1641 7047 16640 -194 11114 40000 29974 9407 -15835 1081 33367
10733 33367 54335 25354 13107 6821 27176 34373 26469 7983 -18383 -25220 -2921 -10478 -3982
10720 -3982 19951 45220 54626 67420 59818 52389 64545 49701 24169 -16229 -26287 -6831
10708 -6831 -4699 -3352 -1677 -18836 -27645 17723 34330 46184 33989 47194 37273 18383 27662
10695 27662 21123 15224 28049 16986 22039 24645 17411 5127 15396 11127 -11895 -17415 -9373
10682 -9373 -10672 -12008 10424 29062 11062 -15154 -27204 -17592 2719 -16461 -14230 -7117 -11804
10669 -11804 12629 -9750 -8873 12059 34135 29883 -5038 -27270 -41838 -18513 1167 -574
10657 -574 -1100 3829 13168 -4185 10289 17968 27331 24983 19098 22324 9561 -5226 -15114 -15319
10643 -15319 -15708 -3491 -15743 -15992 -30826 -9597 98 -8605 -19345 302 10222 8713 -4979
10630 -4979 -29551 -33413 -4663 5035 19338 14700 17491 -16898 -43104 -35141 -7911 26345 22900
10617 22900 21264 20119 -10816 -23963 -29655 -5978 484 7967 8172 18926 1003 -18901 -33847
10604 -33847 -41111 -36528 -18765 2891 -12922 -33720 -22311 -52989 -50217 -10871 -24923 -23216
10592 -23216 7651 -704 -33093 -2712 4214 -3677 -6649 3695 2404 -27681 -13957 -26840 -16374
10579 -16374 -4360 1731 -10039 14687 5350 -37451 -33053 -12132 -12090 23243 18997 -200 -10254
10566 -10254 17767 54255 75144 72861 75434 71925 69687 53748 48321 49102 59808 41935 21830
10553 21830 671 -22764 -31690 -11896 -1470 12002 40426 79194 50166 19555 -2360 -20790
10541 -20790 -24743 202 -8751 -42890 -45856 -39141 -35695 -26033 -24839 -29142 -16292 -21992 -31401 12557
10527 12557 43837 40611 28269 20981 31719 -10616 -13826 -5231 -17803 -33879 -30296 -24843 -32847
10514 -32847 -46178 -53004 -30623 -16034 -21286 1719 -6784 -27188 -41238 -54034 -51394 -43527 -32092
10501 -32092 -39724 -23368 -9142 -18954 -16988 -19859 -25676 -36276 -14966 -15860 -14487 -29406 -38047
10488 -38047 -10027 -8589 -5716 25016 19750 -18432 -36178 -38778 -48192 -46809 -38310 -23695 16923
10475 16923 17641 17752 7872 1205 12141 15218 23708 48452 87294 92937 36516 1666 12712
10462 12712 10474 -18145 -30733 -45845 -47591 -38897 -31730 -50012 -63290 -56544 -39048 -11844 -1505
10449 -1505 13988 23186 31716 9000 873 -6470 -9917 -20006 -14469 -11640 -5818 17312 15283 -2326
10435 -2326 -36100 -46262 430 -885 -2117 11845 8926 -7542 5781 2255 8741 16752 -11378
10422 -11378 -12523 -18210 -33019 -30482 -12788 7383 20749 35762 24939 18407 28134 35726 22140
10409 22140 12827 12740 5368 -2129 -4762 -12679 -17393 -15077 -16444 -3949 -20597 -12778 -842 -323
10395 -323 14691 25706 35506 32238 17680 15295 9640 7731 12477 26647 44721 48817 34452
10382 34452 33191 40554 9067 1527 21394 -4607 -43598 -61770 -23931 -3324 1459 6682 2615
10369 2615 -1935 -5618 6343 13846 -26521 -17494 -9335 17267 18869 -9917 -4107 -13528 -25285
10356 -25285 6930 23435 38186 52150 8951 1069 9515 14977 11984 -9908 24877 46794
10344 46794 74784 118917 154112 195203 227738 264202 282651 272433 246028 199468 167992 148059
10332 148059 105768 51193 25481 37910 39010 46175 25580 24522 34733 47959 27064 833
10320 833 2978 10303 2083 -267 34681 46022 7230 -16570 -2147 6932 4068 17540 19079
10307 19079 23730 26979 46213 36609 45044 58235 63492 64410 44029 43361 53174 64851 73297 60303
10293 60303 68613 53334 49746 37901 47864 55786 84459 84217 59951 67173 88788 124827 156065
10280 156065 199054 215076 218592 209398 177696 156031 151039 148410 122750 95493 63293 45159
10268 45159 64997 89896 75880 49789 63655 92992 92429 79450 66410 56199 36931 29978
10256 29978 27799 35985 47044 32448 22541 18346 59335 56373 12782 -5258 14536 -7735 -21488
10243 -21488 -39173 -38439 -4925 -2969 -13923 -12318 -18040 -14271 16410 38421 -7983 -32111 -16540
10230 -16540 -5015 -18903 -25273 -30627 -14552 -1915 26625 69847 67071 43863 36620 34819 18840
10217 18840 6775 1836 -6375 -2381 19030 29160 25323 26992 35123 26251 1216 -12143 -30448
10204 -30448 -28431 -28614 -21122 -31724 -33565 109 -4493 18390 24989 20793 -7084 -5454 -696 11122
10190 11122 20607 -8635 -6616 16083 17809 6492 5277 -18908 -31989 -12926 4914 -7963
10178 -7963 -3008 -15232 -25124 -27546 -27105 -3184 0 24321 54648 73454 75589 15211 -23314
10165 -23314 -51386 -65121 -39508 -15387 -10439 -22311 17009 31935 28724 10922 6286 -21919
10153 -21919 -25602 -16302 1432 4233 -5719 3070 4620 313 -13907 -9270 9611 5527 15043 28907
10139 28907 26586 26298 -12259 -2758 12533 24275 33390 44929 27925 10882 1570 19719 -9632
10126 -9632 -28356 -23391 -16340 -25215 -16443 7606 4283 804 3803 30087 39147 16057 -4085
10113 -4085 6455 30415 30084 349 -29986 -31497 -38107 -30467 -23573 -4520 4038 -7752 -10499
10100 -10499 -18917 -40392 -31489 -20392 4599 -12119 -10287 11505 10493 6171 9665 18990 3278
10087 3278 -11526 7235 -5969 -21333 -25926 -8021 37429 20451 -3524 6543 23043 10651
10075 10651 -5549 685 -18553 -18419 -1773 19529 4096 -24106 -13374 11245 29208 47709
10063 47709 55077 47381 40414 47582 37594 23036 2670 -13172 -23733 -4813 16598 13647 7594
10050 7594 16852 30682 10030 11485 17342 22413 25424 30476 29366 -9253 -16485 6653 22716
10037 22716 23392 26496 11748 8270 21806 8430 12117 13301 29628 43097 15421 -10332 -13359
10024 -13359 -8549 29989 37348 2024 -20308 -17155 -5926 7152 11855 26373 34698 8302 -1993
10011 -1993 -3261 -2633 25692 42241 35100 22837 45435 44322 21922 -52 4151 -4360 47806
9998 47806 58315 42812 40348 24546 17728 22592 28296 31658 31331 12847 21793 23618 -1996 7659
9984 7659 10454 2815 -194 9999 16952 36595 47076 72781 74978 63895 48911 42002 37235
9971 37235 39507 68241 109284 176835 272033 390576 590621 908754 1291709 1589444 1671841
9960 1671841 1563306 1293164 960122 646390 438855 340680 299417 272155 246143 210398
9950 210398 187170 163386 153423 143273 132327 106195 68464 39409 36422 62994 80152 98438
9938 98438 95377 78427 42154 15723 16098 5450 26827 32875 21921 29746 29348 16763 8392
9925 8392 -8856 -44011 -26178 1081 7510 -1603 2379 -8050 -4743 7674 15830 48617 39805
9912 39805 24275 20963 1185 3069 30171 12155 9257 11310 26556 37651 50288 29553 5563
9899 5563 -4671 5349 3053 23722 74341 59586 29635 49007 57903 65981 51341 45614 37464
9886 37464 40256 10951 6727 22183 53207 73162 49859 -22357 -29081 3395 35873 50856
9874 50856 41988 47782 29409 16659 30894 24952 22398 40333 71562 48731 46237 46790 35160
9861 35160 34797 15389 16550 23821 48599 62701 46202 36853 38722 38928 36565 33345 39834 63205
9847 63205 67590 63089 68431 49292 45853 53951 61534 76102 84874 77787 60198 56027 49771 42871
9833 42871 25783 16643 550 8471 -963 10243 31737 29218 45152 78641 92662 49176 19593
9820 19593 26397 51337 38130 24953 15638 22612 -13604 -24760 -22894 -33762 -13111 27749 41646
9807 41646 17302 3693 -5558 -19593 -17932 21182 21524 7785 -35262 -34940 630 930 -16155
9794 -16155 61 35377 19265 17439 -12166 -4995 10627 19063 13835 2213 2719 12770 -10206
9781 -10206 -3824 1104 1945 -9679 4315 22187 9161 -5582 -14415 14644 38296 57232 55777
9768 55777 38265 19309 34991 32877 9927 -8561 14016 23381 15140 -6499 11442 18280 19306
9755 19306 18151 22657 45553 44136 41225 59743 65876 52810 55057 59561 62999 49100 35825
9742 35825 44376 47757 57786 42187 14605 15418 24258 30389 36138 45585 36866 8811 -5286 1689
9728 1689 -14988 -29837 -8805 987 -9933 -22650 -5443 5777 24955 51424 67975 57365
9716 57365 36382 32841 21737 22187 43316 60341 65212 71246 64566 35346 9045 -21615 -12218
9703 -12218 33789 45360 30932 27965 30039 35677 42422 73463 82249 79115 60796 56447 68828
9690 68828 64113 44808 35621 41002 38759 30822 34092 24449 21058 -1232 -9476 5768 43319 57775
9676 57775 49613 33352 40057 40637 18262 43049 56549 25340 35634 45548 46354 29933 4077
9663 4077 4570 9175 8999 -7665 1843 9322 27819 34842 25245 11000 6640 25325 42224 40749
9649 40749 51073 38889 19549 7186 -10945 -16979 18722 55462 85080 83839 73574 54223
9637 54223 43954 16582 13984 32465 50524 46692 37265 30906 16872 38309 61891 77298 81930
9624 81930 77723 62849 37713 44326 60255 76004 94511 61359 70164 70576 101386 112478 79331
9611 79331 77851 68667 64186 76406 98740 73673 55261 63231 58284 44035 40876 32726 35139
9598 35139 41545 39643 49560 66009 71075 35575 29528 43719 85460 91437 79520 76867 77325 76142
9584 76142 87509 83748 87598 102485 107578 112070 97258 86565 104055 94603 105108 103769 107455
9571 107455 107363 117117 78546 86442 74891 75584 91129 80281 71589 69030 69729 82060 84216 70351
9557 70351 34586 33784 51197 50126 75617 79644 97291 110260 91081 77383 77369 69738 107525
9544 107525 146027 119068 120764 125641 124469 127015 130198 110320 114913 106858 84837 93941 126374
9531 126374 118896 80434 57844 48344 51441 61677 59719 76767 83519 98352 108607 116476 112501
9518 112501 79660 72177 96450 148387 158361 164316 146693 144463 175772 209010 183470 164576
9506 164576 153909 171086 173754 159504 143462 147334 148349 144749 133536 143869 150967 161114 168656
9493 168656 154362 155052 169626 160210 134434 139188 156271 166165 155903 152214 168896 182566 178150
9480 178150 194625 192162 204197 164457 156515 158966 174767 160754 176953 175757 169449 178677 156690
9467 156690 161907 187856 223580 227742 234105 245348 226990 222807 237615 262424 261712 244069 252127
9454 252127 248616 252084 265134 267309 256890 243796 225133 210349 204212 204815 237501 214542 207072
9441 207072 247795 261275 240567 236060 249926 250120 272485 289874 276446 270212 286361 268824
9429 268824 256371 228738 260296 288205 301223 322916 310787 290736 280692 297987 279913 282010
9417 282010 279808 294821 303956 295983 276322 305345 302965 291947 309497 363442 370058 351487 356146
9404 356146 351407 320342 332737 360157 371729 356739 326924 298884 310845 333051 315499 320235
9392 320235 313720 308823 298800 298885 326836 320904 285203 278601 305162 291786 287129 310760 299594
9379 299594 298235 275739 264973 307888 297994 274813 264735 269375 266546 265435 277164 283399 296408
9366 296408 272852 271219 260645 261289 289057 309484 319199 317979 283147 251836 252546 244549 235844
9353 235844 251957 283118 307442 292256 265547 268322 280302 283344 272929 261641 235347 246838
9341 246838 268851 256317 241138 229488 217107 200659 213662 230373 240916 238886 246578 257880
9329 257880 263119 257201 222137 223638 215255 216195 199856 204521 204882 206073 183862 201459 204490 190768
9315 190768 190176 219049 218185 184375 170938 166949 173970 191693 185342 172337 167008 149054 151486
9302 151486 179757 168938 163509 182429 180758 174654 165215 145478 157216 139790 136135 131173 136031
9289 136031 141165 136504 147188 140937 132714 129740 144826 140287 146664 155033 153881 170028 150342
9276 150342 153950 175751 168124 154126 130438 122198 134232 116026 108955 106215 107779 104357 125830
9263 125830 142915 136008 121694 123116 104119 82302 101461 96491 100429 127983 124672 104529 131280
9250 131280 139719 134995 147629 152840 139006 130371 139448 99828 101717 100387 101065 110295 107747 98791
9236 98791 89388 109309 114440 93053 111625 162620 189696 160077 128559 110753 113997 112808 111254
9223 111254 105472 89045 100510 104563 102322 100498 102693 117211 111789 117686 115771 90988 68970
9210 68970 60086 68653 84597 87138 85156 63884 66808 82972 59475 57704 53570 55838 61314 64396
9196 64396 63038 90628 99409 77704 70345 91357 102920 107992 94538 77349 71826 68326 77600
9183 77600 83122 71048 72593 71144 56023 86268 103397 72025 79687 71141 79589 76319 92055
9170 92055 88532 60419 39305 70301 79046 50522 34769 48919 67692 59260 90209 75617
9158 75617 75156 85517 77683 79689 98756 103980 81305 90413 80597 69770 67271 63849 63097 54625
9144 54625 49958 60409 85094 63398 65383 42209 42932 76998 72574 44046 20812 14977 14259
9131 14259 -6083 -14808 9049 -2135 -14491 3078 8338 2753 10766 40839 76214 62189 33062
9118 33062 28693 36250 32081 12916 27879 44582 43047 28274 49792 84366 64579 18441 19610
9105 19610 11705 14867 9415 12880 6418 20636 29603 60381 83593 61947 59406 45312 19989
9092 19989 23824 34570 20814 26141 43929 46860 30396 21506 44240 55101 67985 71645 36393
9079 36393 10706 -9507 -21673 -13254 -2993 9079 14148 46731 61379 57294 38080 40214 25453
9066 25453 24857 31770 17740 -18328 -21455 -8006 33953 36053 45728 28360 29040 30274 23587 4861
9052 4861 -7437 5445 3133 18404 3868 20641 21152 7011 -15283 -9202 4368 33375 56388
9039 56388 37912 22393 -7970 -26477 -15751 343 -16484 -35241 -33332 -42901 -46969 -32579
9027 -32579 -24108 -6014 8164 14891 5177 -20728 -16282 -17423 -20605 -13706 4819 2152 14389
9014 14389 19125 -17345 -52673 -10749 7005 135 -24996 -32581 -26592 -13424 9890 29214 34204
9001 34204 28183 13960 53755 58643 36798 18684 31566 14931 -1818 3800 40209 52677
8989 52677 41822 50053 53371 37305 12568 -6618 12896 52572 53554 1054 -9474 -5595 15079
8976 15079 32016 23745 -9020 -27497 -37105 -18972 509 -11738 -16244 -29257 -14411 -26549
8964 -26549 -34075 -32974 -7138 6871 422 13944 40297 25802 18646 23716 49122 30582 -900
8951 -900 14054 29523 25451 20316 20525 23827 46942 42375 25444 22639 32660 20981 3113 497
8937 497 4881 10460 18242 16999 23274 35602 39507 18238 2462 2529 -1761 -8646 10245 2431 -2205
8922 -2205 -17900 -35843 -11999 26337 11947 388 -19265 27 32373 23599 -913 21587
8910 21587 42895 5005 4531 33562 22704 -11163 -23389 1705 5249 10716 9810 6502 -778
8897 -778 4730 5938 22573 22902 47615 25844 26489 19724 14268 14226 10645 4658 -13308 -26590 -6922
8882 -6922 -4425 -18468 51 -5733 -5807 -3748 -13710 931 10366 4030 4468 11550 5745 29913 60560
8867 60560 63059 58956 30214 21868 21596 15169 27552 5824 17376 7400 7850 12165 -12984 -25188
8853 -25188 985 12457 10075 -5041 -17737 -30381 4482 38432 38577 18145 194 9506 -1952
8840 -1952 -34702 -1680 17752 23986 24257 12778 -6003 -9134 -32094 -44530 -31627 -15822 15138
8827 15138 30822 18137 13208 -3137 -10355 34157 47335 4551 -19640 -20730 -27215 -42071 -45720
8814 -45720 -65285 -47838 -19101 -8144 3336 -3983 -9288 -5469 -6531 -11605 -9512 -10629 -35305
8801 -35305 -50215 -51304 -51389 -29115 1776 34448 48035 38076 7092 -5337 -979 11798 14788
8788 14788 17467 6700 -23087 -27822 -12210 8781 5703 22860 22484 14927 32497 46449 48453
8775 48453 22782 13745 2983 -7484 -16068 -8725 -19910 -10044 4031 8621 24525 42005 48446
8762 48446 57991 72280 66021 19028 -27661 -21948 -20442 -1808 4323 2766 24545 33052 36008
8749 36008 25141 6251 18788 51555 48209 25614 5063 15231 9003 -8995 -11662 -14185 -13937
8736 -13937 7503 1140 1832 164 -3529 12437 16263 37561 41656 45459 68231 118318 173713
8723 173713 172722 145976 122995 90820 57814 44939 8013 -3217 1131 19202 32432 37981
8711 37981 29741 27880 21352 9600 19199 36265 31626 51428 59361 44467 32167 7892 -20565
8698 -20565 -29550 -11873 15816 12371 6937 -280 -883 -8837 -8168 -15167 -71 11297 29985 50991
8684 50991 54398 37761 20501 3056 17343 41206 55365 51330 61149 57590 83573 88929 49784
8671 49784 30696 45820 38687 34199 17171 17363 9693 8163 7174 -512 7344 15028 26898 44825
8657 44825 54089 55026 66519 83149 52996 71360 103741 97401 102167 122585 136781 150003 154632
8644 154632 162512 189906 192639 181880 159561 135784 152824 131747 118326 125024 120581 109841
8632 109841 117991 87596 65299 58394 62468 84088 83114 81613 80083 60069 56980 71030 73599
8619 73599 58028 62496 82836 96723 110455 95501 79201 86566 104249 123270 100745 118043
8607 118043 126343 129219 139769 122684 142040 205974 227895 249598 256326 262632 255702 260810 262648
8594 262648 225057 179232 147244 155240 174089 152035 146483 142497 143845 138058 120447 89336 73784
8581 73784 62394 53822 38153 54469 34016 -1029 -5929 877 12677 30582 26499 33055 55139
8568 55139 53576 31128 16833 25505 29269 35370 37714 23737 25554 -12244 -23077 1735 38500
8555 38500 65838 67421 69682 46933 32072 27949 19122 12220 14491 16604 18189 23551 23496 20008
8541 20008 26129 24977 17823 35052 57182 67583 63321 68385 48305 5688 -12527 6490 -16400
8528 -16400 190 60931 58855 18569 -17230 -32249 -12177 -3327 8602 31402 33524 17113
8516 17113 6379 6143 20713 33640 36398 35963 8585 1750 -15584 -4992 17019 29852 22447
8503 22447 6745 13116 12259 13419 6596 27295 47812 17998 -16969 -32122 -40810 -26370 10604
8490 10604 20873 37851 28580 23186 14234 12794 19103 17507 -8705 12507 34640 25402 12820
8477 12820 29447 21641 10742 8342 42988 38388 19222 8605 4248 -2249 -5882 -23899 -42839
8464 -42839 -851 1 -15985 -12242 28010 44743 23220 22176 35389 54332 27735 23338 14045
8451 14045 2191 15408 10439 -9779 -1949 14196 8323 10992 24262 13047 1007 18493 3990
8438 3990 3309 9373 8195 18253 8722 8465 27983 29391 1532 -15573 -15187 -5359 6957 28950
8424 28950 44356 48146 59712 48399 58924 73555 59079 27092 14203 32056 37303 43137
8412 43137 55606 59222 79952 55817 45221 28526 22540 39271 58771 79472 91107 72083
8400 72083 80951 93041 116457 190575 223239 263311 287155 263476 209002 161648 145118 115592
8388 115592 90942 35147 28934 51471 68384 67567 68711 68870 75617 96320 96958 35742 2763
8375 2763 30292 51990 72722 62773 49392 27328 34180 50989 92762 137694 134747 150628 193370
8362 193370 231283 227222 231901 232465 181430 105469 79366 65902 43333 44045 44014 49657 44943 37738
8348 37738 20688 18760 535 14310 25234 13444 3205 9707 3518 22038 17975 17939 1074
8335 1074 -18357 -15603 3623 -351 10904 25257 -10034 -7582 18008 31270 19725 6690 12506
8322 12506 17873 36116 39437 33463 23466 -20850 -26400 -25622 -25136 2360 -11310 -24985 -37696 -29723
8308 -29723 -27963 -1409 7193 -558 17447 33422 49782 56016 41894 42862 21042 -14082 -45297
8295 -45297 -40321 -30556 -22896 -38959 -36254 -19443 9107 33567 40193 21518 11278 12066 -3649
8282 -3649 -19793 -32619 -41897 7807 33924 24220 28921 23659 11222 -18655 -12966 3380 19160
8269 19160 41691 62512 61721 12806 13022 32269 19707 9738 1191 5727 -22676 -31289 -14374
8256 -14374 819 -4926 -20773 -8979 10443 43993 33718 -17339 -34804 -33079 -12752 -16915
8244 -16915 -18212 -28541 -1907 32635 47643 32201 10339 9795 1767 4511 -4193 -6133 -11345
8231 -11345 9585 23900 17396 5549 -26396 -33712 -31625 -3209 8410 22103 4002 -22599
8219 -22599 -20384 -6640 10616 6713 10150 -6406 -26281 -11095 -5110 3695 -21918 -17015 5725
8206 5725 -20862 -29824 -21033 -3903 2795 -17096 -37008 -52770 -36815 -16352 -14134 -26075 -43945
8193 -43945 -23871 -3647 5690 -7003 14383 18428 -10991 -18184 10083 38668 40803 34352 38768
8180 38768 2780 -17491 -22387 -29275 -39315 -42895 -32009 -8923 -10811 402 44005 44872 11593
8167 11593 -26075 -28582 1445 26100 11080 -16892 -14561 -8268 709 -837 1991 -14558 8505
8154 8505 -8624 -27706 -41628 -34158 -14139 -18741 -17277 -14143 -33881 -14321 35 1062 -5225
8141 -5225 -20691 -11315 7641 3646 104 2375 -7558 830 -687 -25932 -29285 -25297 -18119 -22316
8127 -22316 -9185 -2966 -22686 -44886 -35287 -28307 -1819 9447 14959 20334 24177 17350 12648
8114 12648 -809 -16733 8754 29532 15616 -3834 -20103 -39614 -26639 -35099 -27671 -37430
8102 -37430 -42876 -40420 -25599 12493 28904 7090 -15347 -2791 4410 14004 -12764 -6556 -23266
8089 -23266 -263 4029 -25209 -47305 -33755 -6284 22079 16642 12027 8877 33589 52440 58728
8076 58728 31742 38457 57163 57279 53788 60116 71730 134411 193251 264943 390521 584558
8064 584558 805208 946090 932488 807078 604232 410920 278521 186822 130806 125612 128565
8053 128565 130053 118240 100610 103549 124258 102022 96873 84902 91739 131502 101148 68972
8041 68972 40051 64183 70064 78915 101731 92197 102956 117065 127254 153154 150519 160757 191556
8028 191556 205616 236272 329601 501512 737979 1074641 1511241 2036363 2662221 3169609
8018 3169609 3297918 3036943 2542795 1896800 1299520 887082 646426 517293 407284 357247
8008 357247 345680 366037 371334 349288 345034 337055 298264 256398 227317 180187 141807 116035
7996 116035 99337 93167 78436 101416 133190 126514 101825 71561 79034 94748 84398 84545 101201
7983 101201 126482 117866 105847 85180 70415 56440 10693 16495 44285 73357 93322 107973
7971 107973 90392 69655 56506 65597 67160 102318 130186 97271 82466 73049 71285 76271 77636
7958 77636 42678 38273 47771 36488 58286 76725 52334 30477 55390 75402 83954 102871
7946 102871 93115 95275 120092 120628 113984 56173 22076 33609 46896 40591 53419 55546 68100
7933 68100 75148 58886 58121 58193 42561 20993 50720 70142 79745 63458 33773 10130 30159
7920 30159 48147 54827 39949 22598 9474 17924 53608 67534 81502 76930 72187 59071 54066
7907 54066 54147 47475 13289 -13712 -23067 -14503 -23235 -20468 -23325 -23861 1523 10010 29358 32255
7893 32255 -11727 -6994 6228 -1068 -4501 -7835 1664 27910 18624 10030 19987 11351 -1914 -11678
7879 -11678 280 6702 -1954 5148 -1315 -29781 -20501 -939 11017 6374 20704 28102 18615
7866 18615 12061 2199 1465 10361 10243 34658 39897 21514 9899 7197 -17235 -39628 -53608 -37445
7852 -37445 -1798 2082 -5913 3367 16393 21463 6273 -19494 774 20042 40447 52997 44732
7839 44732 24504 12370 -22255 -34579 -34998 -39678 -54635 -43968 -22654 -1484 3063 -17140 -7431
7826 -7431 28563 37963 41718 38273 16421 -6884 -17679 -31967 -28126 -51415 -29140 9885 1693
7813 1693 -21681 -24161 -28424 -31134 -22522 -9346 -14959 -14031 -707 -1861 -12338 -20165 -21073 -25450
7799 -25450 -21144 -28919 -20101 9123 11257 34313 33028 28693 4095 -1224 -27579 -24562 708
7786 708 5314 6554 27763 37887 47163 55818 49091 39884 35236 -4115 -10141 -5128 7258 9313
7772 9313 3582 -4974 -35374 -32395 -34385 -31085 -39091 -33399 -16848 4501 -7744 -19448 -1446
7759 -1446 23357 31398 30775 18823 6247 3576 -8355 -11450 2011 6020 -40109 -54475 -51504
7746 -51504 -24905 -7607 -5937 -15628 -15928 -2814 22468 29000 -17031 -21785 6110 -2881 536
7733 536 -21790 -52190 -47774 -19860 -16428 -13485 1571 -1790 -4280 -3327 -25910 -34176 -22307 25499
7719 25499 24942 6801 -5749 -1793 2206 -34750 -41692 -32954 -782 8864 19110 12646 -19577
7706 -19577 -28784 -29203 -32842 -30055 -4492 9406 25059 8077 -19664 -25915 -41054 -45701 -12383
7693 -12383 -1610 -14088 -32802 -32748 -49355 -50741 -46494 -17620 6761 -2401 -8612 -13321 -26960
7680 -26960 -17461 -11136 -16129 -11807 -12555 -22250 -10742 2819 33992 32764 -1097 15510 41358
7667 41358 11530 -13352 8313 40227 50596 18615 -18460 -49943 -65524 -53328 -64206 -52372
7655 -52372 -11368 -37018 -50336 -25317 -23391 -21350 -30682 -30706 -24465 -41143 -74121 -45862 -45025 -33123
7641 -33123 -4935 -6706 -7084 2133 -932 -21031 -25682 -23920 -11845 21170 51967 62603 44356
7628 44356 31418 38755 69412 68536 67594 36646 13767 12258 28377 32346 58449 56110 29900
7615 29900 19987 32374 25266 -5679 -26683 -11374 -4723 -15790 -38998 -32365 -25494 -16135 -233
7602 -233 23333 36081 28724 37283 38828 11551 4676 -10239 22339 13537 5488 -3662 22871 34092
7588 34092 23746 -688 -4771 -29322 -25509 -37526 -48756 -50280 -44077 -37530 -47620 -42497 -25867
7575 -25867 -6405 19878 20912 29753 43630 14549 -28160 -37425 -27281 -3867 3448 -5460 -29879
7562 -29879 -50482 6064 -9239 -11249 -13159 -16751 750 -537 15624 1100 -14697 -9132 6138
7549 6138 -18528 -35873 -42029 -19254 -32959 -13148 14305 9439 -7271 -45967 -44522 3849 -162
7536 -162 8471 20360 21598 14974 -20209 -33017 -15686 -18354 -14703 -13700 -19847 -12130 2652 9896
7522 9896 12114 9424 5585 -87 -22267 -56759 -50185 -30676 -5101 13909 25615 -6405 -28146
7509 -28146 -19419 1582 -234 -2261 -15134 -12553 -19069 -18494 -8547 -5696 994 16850 17107 38841
7495 38841 46530 24440 12886 6183 13485 21915 5738 -1022 38655 58037 24117 10096 43550
7482 43550 43679 43883 37397 16730 28982 38972 16544 -4865 -6818 837 -6641 4089 14276 14659
7468 14659 13644 27642 21628 43596 50723 16724 -981 -4364 -8051 -7108 7260 16012 -517
7455 -517 -18128 -24131 -26150 -19313 -33427 -41303 -37335 -27867 -22211 -46135 -49522 -45220 -22132 -4964
7441 -4964 6314 10827 9391 -20135 13379 37654 36317 3889 12789 15572 6389 -11903 22866
7428 22866 55125 69083 52589 42573 65471 78640 53452 39132 27811 3161 -8279 -21238
7416 -21238 -21423 -17474 -19637 -41709 -47866 -48822 -44583 -21205 -16270 -18619 -19248 6064 -6800 -25800
7402 -25800 -3892 1342 -8447 -12325 -1079 -7473 -31173 -30554 -35633 -21663 -31375 -20789 -13992 11194
7388 11194 -4520 1284 11613 19204 7164 4791 9657 11688 7080 -9046 -947 5314 1162 -4393
7374 -4393 -16574 -31544 -53812 -47552 -16550 -20968 -37743 -55864 -55011 -46484 -46646 -42850 -40311 -29325
7360 -29325 -14113 -26183 -24084 288 24738 29602 33606 11082 20438 18379 3794 -11284 11873
7347 11873 42572 43798 35400 16242 -6040 -17584 -36073 -43697 -51755 -16074 -3236 -10713 15514
7334 15514 33610 24693 9609 23360 12069 8749 1696 17838 14942 41297 30469 1992 -3255
7321 -3255 -11331 -10656 5961 27371 46044 26242 24434 25348 48555 48326 53566 46634 53062 42202
7307 42202 17357 16723 29901 12433 9487 -18449 1078 31843 17916 2581 -1526 21501 18595
7294 18595 -16228 -37205 -26721 -16832 -27505 -36562 -25251 -18253 10543 -4466 -750 22713 11615
7281 11615 -4976 -8126 -40019 -47970 -46587 -26819 -18223 -32567 -54698 -51390 -45398 -41781 -22832
7268 -22832 -13236 -11638 -3697 10658 -271 10528 21902 2337 -10715 -13139 -31572 12 22467
7255 22467 14094 -9801 -32483 -30925 -15573 -8555 5609 -19398 -31580 -8057 -22110 -22490 -10111
7242 -10111 -24402 -48510 -39487 -14663 14004 41384 31775 3543 9600 -23353 -57809 -58861 -53207
7229 -53207 -30569 -21436 -12952 -25428 6552 29133 -4887 -16218 -4974 10947 28513 31779
7217 31779 34504 29423 22008 9003 -16041 -1179 -20567 -31712 -33625 80 4896 41375 50102
7204 50102 10024 4621 18745 622 -1853 6043 -4480 22735 33314 -108 3206 23140 36081
7191 36081 32057 33270 24223 11307 3979 -16892 -25308 6822 45374 34373 -8111 -18091 -40693
7178 -40693 -33074 1956 34361 8083 2671 12589 18094 40657 43650 39227 35034 11941 -2929
7165 -2929 -15917 -14128 3764 -2703 -8184 -37459 -36700 -51434 -28755 -10025 -6039 -26117 -43202
7152 -43202 -43863 -22108 -18771 -29704 -38444 -42208 -60569 -41448 -36305 -41375 -27214 -7371 21066
7139 21066 22999 3448 -20198 -20844 -21284 -12332 21520 37150 34968 -18111 -34276 -44600 -58788
7126 -58788 -50304 -36811 -43069 -36262 -28372 -15921 -22902 -28295 -9120 15103 25085 23376 -7105
7113 -7105 -14115 3558 20174 27309 -2876 -37232 -51014 -41056 -17238 -1561 24074 37880 58702
7100 58702 62897 39564 37932 30399 24901 27980 18525 -21719 -50363 -34208 9019 44188 39353
7087 39353 14058 13198 23019 -7301 -9748 33836 50561 49974 47853 14752 901 -25610 -25495 -19811
7073 -19811 -25634 -12164 -5252 6047 27093 17351 -564 -8559 6135 15889 -10827 -21568 -7581
7060 -7581 16164 -4411 -6864 -2758 -9667 -4477 8007 6664 -1535 -8387 -15019 -8815 16404 22473
7046 22473 10324 7103 -9146 -27088 -24153 8997 1459 -14252 -13537 -15895 -34172 -35112 -40511 -33996
7032 -33996 -5674 12237 33465 17619 -27573 -23652 2179 9790 13594 5231 15685 -4700 -18199
7019 -18199 -13763 -20916 -10358 -5118 -27328 -28429 -17374 -18512 -18960 -33071 -53085 -46091 -15658
7006 -15658 -10535 -9672 5931 -8572 -22775 -29730 -35056 -33746 -26672 -38157 -40331 -46866 -28351 -23525
6992 -23525 -25672 -37081 -23979 20344 31753 18277 12540 -12955 -18123 -16767 -19490 9689 15269
6979 15269 4499 -6700 -21827 -5769 8992 20044 29305 37352 34248 -7286 -44314 -47735 -47515
6966 -47515 -76163 -60963 -34612 -29052 -17489 -32037 -20214 6408 22997 124 6694 -28317
6954 -28317 -19605 -18178 -10939 15472 20329 28672 37879 27599 2376 -2015 -2053 -20017 -10026 -9026
6940 -9026 -18721 -8206 -8600 -23919 -18238 -8167 1518 12909 27710 37533 -824 -20668 -27785
6927 -27785 -20237 12966 2675 -16803 -14053 13752 19225 9852 602 -27208 -58464 -66248 -56846
6914 -56846 -49083 -43060 -4398 18105 -11181 -22199 -4969 3315 42831 27541 -17744 -18593 9655
6901 9655 7221 -2349 -5948 -19288 -14462 -9188 -25083 -45879 -28815 -20295 -13376 -3523 -14990 -30799
6887 -30799 -17647 1598 97 -9766 -43131 -48086 -47878 167 27948 41890 10072 -10268 -6703
6874 -6703 -2373 9899 14672 23245 43278 49422 45419 27649 1105 -12376 -17933 -19123 -209
6861 -209 2932 17668 1700 -20861 -12719 9628 6004 21233 16669 -3312 -21078 3965 -2934
6848 -2934 -16809 -20065 -42928 -45845 -56938 -23076 -2903 -9132 -6203 -10524 -9602 -3294 8897 18012
6834 18012 12750 8098 8570 8182 37992 42880 26214 -22538 -25200 -7719 -13240 -11407 -4775 -11586
6820 -11586 -12326 -4543 13166 -6178 -14761 -4908 1469 14199 33150 12335 -25690 -34307 -37825
6807 -37825 -45433 -53592 -35171 -17656 -14198 9997 33114 21246 -9268 -15112 -4899 12410 14386
6794 14386 9033 27623 27167 28360 44203 54720 49320 24123 -5120 -16688 -19063 -25734 -6483
6781 -6483 -18961 -26861 -14794 -8062 15226 12897 -15928 4646 15395 -10248 -13279 -16959 -25141
6768 -25141 -29988 13314 32784 34979 27600 -8771 -27585 -18486 -8484 -9933 -12011 25071 35449
6755 35449 18753 20239 23395 36474 53919 65932 75286 82973 60528 45524 40573 47225 25320
6742 25320 -5216 -27086 -3967 40538 103596 129665 139420 132159 183725 249474 290427 369991
6730 369991 516623 728398 1045821 1418537 1694242 1751017 1606717 1292435 910756 624025
6720 624025 483501 378520 321623 262460 228945 185658 151494 142026 158927 144378 132952
6709 132952 122894 78031 71241 99500 108006 114638 136990 160167 156822 129802 102172 99172 65645
6696 65645 63751 58278 24799 -4421 5443 -3742 33278 48275 52236 4419 5696 19648 50684
6683 50684 26673 34467 29143 15794 32642 19661 9889 17761 49806 64040 47498 28743 15976
6670 15976 18259 40837 29886 -2051 172 7042 4992 39739 59456 97050 101057 49567 -7342
6657 -7342 -12974 12802 34468 14849 3933 8521 5824 6836 3314 -27080 -15915 -36261 -24958
6644 -24958 -14158 -10184 12645 14787 -6984 -18475 -16384 -13751 -15063 -13636 -39653 -17606 4113
6631 4113 -7478 -5891 -5261 2427 1890 -19749 -18881 9052 8153 -11397 -9140 -3417 -11041 -12504 -19097
6616 -19097 -35964 -45620 -64132 -71090 -56515 -30604 -10493 -13049 -199 9765 26520 16922 -14620
6603 -14620 -26689 -26309 -46310 -30586 4185 21145 30029 36580 52620 24869 3947 -9871 6145
6590 6145 -1466 -8206 -10471 -7468 8214 12474 5788 6384 251 -10550 786 30811 27184 22885
6576 22885 -9043 -32571 -3341 13553 -14099 -28529 -34912 -16640 -19399 4990 15307 12040
6564 12040 12579 15629 495 6907 25685 26613 48265 65041 44593 28567 32 -8179 20643
6551 20643 16423 11414 9439 -12122 -2403 1027 -23695 -48535 -15515 16144 8897 8190 -9676
6538 -9676 -31312 -26225 -1301 -8481 13589 50075 49386 39006 6208 -17452 -11521 7455 23399
6525 23399 11429 -13344 -19638 -20688 -17478 -47068 -55793 -18833 -8365 -6991 -11302 6446 -1563
6512 -1563 -38524 -53401 -35328 -34709 -34820 -50499 -14711 19434 8055 -9042 14201 8030 -7942
6499 -7942 -8319 -8212 -23487 -17211 -10653 14177 42700 42612 57721 45486 2978 -14516 -30011 -41963
6485 -41963 -72783 -57910 -26704 -7225 -2602 -12823 13274 28676 25774 17842 13939 24578 5191
6472 5191 -9701 -15057 -31348 -38679 -5460 39111 33335 6339 8728 5279 15846 10067 13411
6459 13411 19303 3408 -30542 -35064 -28046 -45014 -20762 16124 27319 22874 34372 47892 50227
6446 50227 51526 29013 22264 -34 -15421 1277 27680 13722 14486 7039 -3940 27294 41620
6433 41620 33695 -3125 2514 11317 9323 33165 47115 32686 52159 78573 65485 13834 21363
6420 21363 550 -30051 -29957 -56984 -64214 -30975 17886 41817 63994 82417 47069 26882 32092
6407 32092 35123 50658 35285 -4799 -22046 -36867 -26495 -8164 13971 -3011 7031 17247
6395 17247 196 -2565 8027 -16265 -25422 -17478 -13052 -5173 -25216 -54059 -58623 -33875 -16553
6382 -16553 -2076 -19664 -31560 -12028 -21529 -39885 -39695 -1888 9791 5433 20280 4356 -18396
6369 -18396 -14026 -20028 2917 -2243 -15675 -16496 -29854 -2428 -18577 -49281 -44351 -18461 -5259
6356 -5259 -14162 -10636 -2172 -18270 -15745 -17456 1998 25617 26124 32149 52522 24300 33 23467
6342 23467 51308 39051 44033 41242 52907 41267 22477 12981 -21534 -58924 -32986 -2114
6330 -2114 -5241 -17636 -3264 13693 11899 4305 10968 19872 18219 22485 31997 39454 23059 34631
6316 34631 45226 23651 23472 44343 37179 5004 3608 -16451 -35388 -31281 -47241 -41649 -24485
6303 -24485 -57624 -68971 -75143 -86358 -56599 5792 36339 20563 11636 10520 -13976 -19711 -11918
6290 -11918 -6742 434 -10965 -30035 -21475 -7889 -21108 -19417 -25572 -29027 -41336 -41341 -46106 -67894
6276 -67894 -60080 -29647 -15097 -27740 -15762 -26943 -33906 -14969 -25932 -14417 -16529 -27981
6264 -27981 -37392 -32408 -21876 -33001 -54649 -24633 -13976 -43342 -24554 -4794 -13692 -12074 6920
6251 6920 5956 -20198 -13426 -10132 4294 6734 5996 16372 13890 12889 26073 11643 6986 1381
6237 1381 31945 24117 -8870 -2612 9831 24221 3884 -27022 -24167 -46635 -47906 -30780 -39849
6224 -39849 -34059 -22516 -3281 28701 51419 29163 8051 -5270 9415 29371 30264 9301
6212 9301 11743 22170 18155 23245 32891 20433 -6818 -25355 -17739 -35769 -51384 -46314 -58114
6199 -58114 -20587 27337 32219 28000 20407 4966 11738 32260 26531 8775 -3381 -6623 -8674
6186 -8674 10269 26831 9549 -547 6 -8556 0 509 -28669 -37705 -32983 -48234 -71426 -50361
6172 -50361 -49860 -52100 -32112 -14316 -10943 -14586 -12776 18238 23594 12247 -17105 -27189 -268
6159 -268 13288 3223 -10716 -26274 -51602 -71022 -54962 -11233 10664 22098 -609 -31963
6147 -31963 -35727 -21516 -3626 19922 -7153 -21795 -16535 -1399 -9493 -29754 -5210 16193
6135 16193 34479 51086 4863 -18133 -5486 -17111 -43527 -42325 -39714 -48453 -29954 -43707
6123 -43707 -41472 -57169 -40987 -38277 -36193 -31171 9417 12223 -21866 -22885 21799 34279 11859
6110 11859 -1107 7686 -6928 -35262 -26587 -14948 -19685 -28869 -46229 -32259 -36691 -35062 -29467
6097 -29467 10018 20186 8424 7185 17305 7940 6646 -9339 -38720 -47481 -44043 -31128 -28933
6084 -28933 -40655 -53707 -22516 284 -26504 -22380 -15630 -21828 -17858 -23900 -31666 -48380 -31365
6071 -31365 2450 -13268 -25397 -14855 -24276 -55161 -47642 -50275 -41117 -30192 -35733 -28699 -28632 -29179
6057 -29179 -35736 -45579 -42122 -36765 -39290 -33974 -35678 -49926 -73682 -50057 -24832 -9253 -3862
6044 -3862 -1749 -25761 -49849 -58139 -49635 -19862 -29456 -16193 -19696 -46738 -31121 -8085 12010
6031 12010 5109 -901 21440 -655 3324 -3633 -6762 17161 32231 15086 848 27927 31328
6018 31328 14850 -19014 -34794 -37311 -48150 -35023 -16951 -17011 -19074 -17698 -26630 -26427 10280 18357
6004 18357 23691 11249 11507 -8214 -10791 32742 80891 57140 44237 47900 42530 14513 10388
5991 10388 3071 -2434 -12554 3470 -7115 -33548 -17604 5433 40281 18753 3210 -13002
5979 -13002 -11466 13251 -1122 -20976 -28040 -6835 42391 26142 -904 -29140 -4044 11867
5967 11867 13092 16618 11472 -9788 -31110 -10402 10823 18452 1943 -10756 -8410 -12292 -38354
5954 -38354 -17348 21672 33425 3281 -31594 -34718 -18701 -1023 2426 -17754 -27570 -28615 -32985
5941 -32985 -24123 -32804 -45471 -31861 -21110 -25000 -21467 -27569 -30205 -24991 -46877 -80965 -58890
5928 -58890 -37500 -35869 -29657 -20500 -26591 -38064 -34464 -46554 -29411 -15940 8407 29864 47368
5915 47368 36101 29530 20632 -6171 943 9445 -1114 -6799 -16644 -13808 -24117 -20288 -12352 2854
5901 2854 -7950 -15446 -46810 -39560 -8017 3702 -11995 -1934 31997 44526 38143 52361 36002
5888 36002 37426 21732 24001 39069 24664 4915 14451 17398 19356 3348 -32867 -58706 -59292
5875 -59292 -42123 -10478 -10958 -18551 -16465 -33000 -47092 -41770 -35874 3822 13801 -4751 -8169
5862 -8169 12840 12455 -10596 -9916 -21036 -28664 -28525 -16719 12803 5222 3016 1990 -3801 -19290
5848 -19290 -18406 -8761 -3370 25224 42592 42356 35024 5338 -10278 2490 -9834 -38251 -36452
5835 -36452 -57800 -60947 -44438 -11494 27129 14537 26341 13975 -3711 -5701 -12791 3983
5823 3983 31312 39767 39665 45786 24139 -16636 -21143 -15773 -32354 -20377 4566 -5897 -3261
5810 -3261 -23311 -28075 -10167 5671 11352 -16738 -26072 -24751 -25737 -42107 -39356 -11976 -3799 13748
5796 13748 25483 14663 -4372 5795 3920 3241 -10326 -15388 -7874 -12921 -14538 -13801 -19870 -20982
5782 -20982 -35726 -36271 -20234 4675 -16770 -26974 -43032 -41536 -757 6026 -3088 20172 24068
5769 24068 -6741 -32474 -52986 -56545 -42316 -24836 -22913 -31844 -19535 484 -8718 -19461 -18424
5756 -18424 -18125 9927 11158 126 7028 -3787 -7548 -17571 -36039 -57658 -44526 -45576 -5500
5743 -5500 1917 -19920 -20972 -15002 -16608 -21222 -16633 -5932 -4347 6018 8426 9152 -4709 17911
5729 17911 23781 9069 9648 -5527 -20931 -21040 -45117 -38375 8490 24402 5015 -10251 -30716
5716 -30716 -53689 -24106 -9726 -17390 -1401 23510 -2969 -17920 -11268 -5818 5168 4238 -13356
5703 -13356 -41204 -41873 -1664 24289 11232 -4901 -10663 -1218 -18161 -29366 -14998 -8747 -7087
5690 -7087 -16215 -22272 -24454 -31419 -26435 -9582 6102 11915 -26043 -19803 -7889 1982 -4063 11024
5676 11024 27355 19813 9138 14915 25252 5816 -21202 -19176 -14622 5586 35172 62812 62417
5663 62417 59520 37350 22121 3842 -4323 4941 -10686 -29920 -40748 -57593 1259 14479
5651 14479 1893 -21349 -11799 -18428 -30314 -28315 -38610 -24737 -13469 -3307 16014 32741
5639 32741 -9159 -45772 -36699 -38901 -8042 6730 8772 13139 20813 30535 21203 27546 23196 10302
5625 10302 -14044 -32810 -36942 -25712 -32064 -12510 37575 32340 3592 8420 34957 44795 53022
5612 53022 43869 10230 -8277 9814 6954 -22747 -25430 -12291 -17825 -800 27087 20002 -671
5599 -671 -12813 -26452 -17391 -6404 19475 35766 45373 23818 10546 -13068 -21614 -15320 -10501
5586 -10501 -33946 -45573 -33554 -30140 -29324 4572 8001 7810 16317 19638 12600 -12969 -30599 -3704
5572 -3704 11842 -11516 -9360 -11287 -5458 6707 -9786 6259 30669 34679 21557 -15375 -50413
5559 -50413 -24629 6176 -13964 -24117 -17609 -24004 -15483 -4384 -6254 -2999 -12594 -10182 -9950 -27519
5545 -27519 -29321 -14303 -13479 -7677 -12214 -26182 -34431 -497 -13154 -30662 -14241 397 498
5532 498 -7122 -21700 -29674 -41633 -23210 -11116 -3403 -26493 -41882 -35218 -47825 -56193 -31236
5519 -31236 -46804 -56765 -63484 -46193 -19821 -30081 -43061 -40804 -18767 -1135 -2128 -9747 -6199
5506 -6199 -957 15723 23255 1738 -11305 17402 49890 45874 25498 24336 22611 47425 56316
5493 56316 55079 51999 50513 35659 7650 -20587 -22449 4875 22641 7740 7818 -4857 -32008
5480 -32008 -28107 -25602 -7746 20078 3425 -20868 -15538 -6837 16526 6289 20828 -6403 -25970
5467 -25970 -10043 -22482 -19131 -14751 31933 26797 15172 12374 20094 16969 -3395 -35349 -68443
5454 -68443 -37956 -25071 -10801 -26767 -49640 -51002 -20818 -9788 -10376 -28250 -29655 -30677 -26913
5441 -26913 -29240 -18545 -35994 -25112 -12493 -24495 -43143 -45641 -15930 -11095 -25150 -32231 -19161
5428 -19161 -14508 -32800 -36740 -66185 -62704 -64861 -37210 -13328 1225 11309 13496 35600 29844
5415 29844 9080 -2463 -12363 12437 12691 -7754 7214 18767 -3408 -7348 -3779 15490 -4317
5402 -4317 3003 460 31531 70174 46980 31424 28677 17073 -5796 -15267 -6288 9389 23573
5389 23573 23680 811 -23117 -9678 -3768 4941 5251 -25826 -21817 -22190 -1421 18338 35718 24955
5375 24955 10997 42761 46353 37029 30707 9211 -18511 -27790 -35703 -36569 -34261 -29728 -17226 -7573
5361 -7573 9290 8302 8844 27160 15739 4408 7269 23204 49194 20334 -8971 -43119 -58588
5348 -58588 -49674 -19581 -17091 -35066 -18407 -47069 -47898 -45883 -38438 -11081 7267 18640 12168
5335 12168 -12646 -51707 -54787 -22304 769 -21511 -37197 -14734 3443 -8300 -14076 -6946
5323 -6946 19570 27068 18813 -5248 -8868 14176 10344 -26222 -47678 -59736 -36043 -34753 -26653
5310 -26653 -26426 -10444 -7690 812 8315 28471 36947 52685 55364 40891 10808 -6103 -21360
5297 -21360 -23043 -36682 -31680 -3704 -17526 -21060 -13379 -9037 -36783 -40830 -15383 7978 27361
5284 27361 47999 34007 16056 17037 17884 -10588 6549 11335 -14801 -25070 -37278 -35239 -21464
5271 -21464 -12027 2861 4983 26397 49351 37344 -3094 1214 2014 -1762 -4102 -1489 -4488 -1841
5257 -1841 -3127 -2045 377 32967 42016 40360 2009 5026 5310 30416 26799 3349 16753 65545
5243 65545 70636 25586 -7099 -22618 -25289 -13126 14978 31339 16840 19133 20188 3682 20789
5230 20789 17790 -13947 -24703 -5851 12896 19228 15774 9344 633 2552 8592 15258 8767 -5806
5216 -5806 2912 1738 -42517 -47805 -34903 -24804 1593 -32360 -12662 -12047 8392 17901 7406
5203 7406 -6456 -29293 -991 18443 -2078 3562 14963 19477 40504 42713 21085 25304 42931
5190 42931 36947 8018 -5428 784 11524 26114 12807 33264 36490 17736 27135 22039 31143
5177 31143 42165 -1958 -7440 -13475 -15548 13487 -4215 -31019 -7743 25268 46638 59980
5165 59980 83582 65978 57865 21440 5343 -667 14825 36128 24638 31231 28633 -277 -22430
5152 -22430 -26186 -16997 -21892 -10915 -12219 -18396 15078 26487 57992 60464 53630 45659 25275
5139 25275 16651 -16735 -28422 -28126 -20288 472 10793 5058 -11120 -15525 1955 40108 26733
5126 26733 -5015 -18132 -1686 9262 -24804 4480 38397 59546 49814 33109 18298 28365
5114 28365 36044 16351 -3227 -27596 -24815 -17795 -14573 -3651 -5552 20875 45867 23234 23749
5101 23749 35437 26109 20426 20710 11067 -10168 -44728 -53318 -37419 -28925 -34591 -35526 -12626 31169
5087 31169 29996 22585 10820 -15571 -3823 9771 8031 -12134 -35686 -31481 -12648 8827 2766
5074 2766 11389 15582 27396 23067 17827 28743 28895 38695 19849 -16006 -27382 -27821 -46058 -34812
5060 -34812 -31372 -47692 -56889 -25201 -28973 -5040 28289 10328 -583 2825 4610 -9306 -20972
5047 -20972 -20399 -1329 -18450 -30859 -33478 -39317 -31222 -12385 -2074 -16550 1860 38474 61389
5034 61389 19330 -14269 -14536 -30452 -23580 -30249 -32628 -173 -22430 -40282 -48650 -25463 -10020
5021 -10020 -5346 -11223 -28595 -18284 -4033 -12536 -30340 -20671 7627 20706 -1456 -31115 -26434
5008 -26434 -3601 626 26310 42264 410 -24413 -36524 -21383 -15512 -18144 -7449 -541 -3515
4995 -3515 -7393 -14889 11672 46858 43541 30860 14739 -2967 -23569 -5810 5288 -10349 -16743
4982 -16743 6260 20805 18419 23697 9269 6220 17615 33 2149 3995 11342 15105 14183 8606
4968 8606 -8210 10109 17445 39194 24736 13871 6083 16643 43308 53149 55255 52643 37083
4955 37083 39480 23791 -15667 -19392 1243 15555 -2744 -17398 -35377 -38661 -18868 -9355 -4155
4942 -4155 -17295 -36637 -31557 -27205 -19436 -30106 4559 4692 -9621 -42156 -44067 -20446 7194
4929 7194 11286 -769 -1173 7244 989 5189 11082 -2717 -15855 -6450 -7955 -22988 -27722 -23953
4915 -23953 -38830 -55961 -46449 -25718 861 23487 22702 -6812 -19702 -24994 -31306 -19820 -16
4902 -16 4873 17489 34869 34294 32766 17575 24041 7781 7757 15197 -12745 -16013 -30767 -36560 -17269
4887 -17269 -6306 -36346 -49149 -21857 15801 4910 -35804 -36300 -1777 2036 -2707 -15891 -26776
4874 -26776 -46437 -39175 -32680 -12191 1851 -21511 -30978 -50898 -31819 -37958 -40819 -49238 -33207
4861 -33207 -25566 -19612 -23552 -29437 -31261 -38508 -37733 -13260 -41274 -42480 -36178 -5904 -19302 -3045
4847 -3045 13566 14973 4093 9998 28018 39053 23110 4198 -15228 -12843 -27385 -32038 -27498
4834 -27498 -9566 -6994 -5865 -1940 -7900 -42075 -49921 -17803 -8950 -20619 -13361 26302 42143
4821 42143 42885 26320 5152 6196 15770 23265 15044 3145 -4675 -19865 10110 -5938 -22139
4808 -22139 -15853 -1475 9618 18519 34957 51624 18196 -16119 -7285 10593 40146 46676 24749
4795 24749 5919 -375 3435 12927 24281 2656 -4061 12494 19757 -6939 5954 316 -18606
4782 -18606 -24060 416 -12296 -58016 -53833 -21506 -17174 -25432 -27570 -15010 4675 -12883 -4254
4769 -4254 -8616 -20400 -6153 -20219 -43025 -28875 -25983 -22438 -31795 -52710 -47719 -47020 -33312
4756 -33312 -24712 -25999 -46257 -39244 -37482 -22701 4875 19143 6985 2449 20828 45843 35845
4743 35845 26033 30437 9214 3409 -6754 -39025 -52260 -55648 -40792 -21381 -31027 -50578 -63759
4730 -63759 -54741 -11910 29540 36315 6802 -12201 7672 7633 39817 63099 -1431 -47877 -40974
4717 -40974 -36112 -21691 -28810 -19634 -5981 -2000 -8350 -10444 -12798 -17869 -19028 4107 16492 5970
4703 5970 -1770 -1725 -17550 -13713 -4299 -13365 -43069 -32479 3534 41986 70975 83992 63905
4690 63905 50175 24743 16554 3997 -643 -11777 -37140 -41697 -34861 -23035 -33236 -40646 -42682
4677 -42682 -37971 -36623 -40310 -48451 -33669 -12658 -8606 -28408 -69872 -36129 -36249 -41608 -67277
4664 -67277 -40873 -10231 19884 30434 22875 34800 19412 11132 5673 5412 5938 -20584 -43846
4651 -43846 -30044 -12196 20376 25258 25133 10252 7146 -4955 -8740 -2041 2417 -17233 -51732
4638 -51732 -67586 -48137 -43548 -47731 -52055 -32286 8299 10856 -4568 -11347 -3603 -3865 -4895 -10586
4624 -10586 -245 -9757 -5087 -7240 -7739 5605 13765 1249 3477 12008 10496 -11873 -8885 10566
4610 10566 6416 1240 -9581 -28747 -30769 -10013 -2264 -18569 -41015 -42047 -17494 -29779 -37335
4597 -37335 -66416 -63648 -48023 -16079 3847 -5276 -20798 -20674 -2209 -4436 -16216 4918 6285
4584 6285 -12605 17188 45005 37526 18418 17802 7830 -1069 -5182 -8009 -14744 -5374 4806 17379
4570 17379 16084 19808 3718 4325 22289 35057 30984 14872 21916 -4124 -12871 -10505 -1707 -13361
4556 -13361 -35379 -36957 -13727 617 -11037 5750 17601 15811 29387 -3110 -3209 25191 30020
4543 30020 16406 -5158 -19206 -13410 -5890 4387 10625 3715 -26805 -20633 -34588 -20883 7689
4530 7689 24398 14199 -19052 12829 40077 26073 20758 27754 29592 36226 11165 10910 14146
4517 14146 -2626 -2645 11684 31584 21246 -17588 -6190 27292 46406 54114 42884 31945 13359
4504 13359 -11327 -58251 -61667 -33204 -8664 5768 -7245 -21551 -18986 -15483 1010 15995
4492 15995 30267 27337 11304 25676 11543 -734 20529 22876 13501 -4707 -8658 -2361 3906
4479 3906 -8815 -6966 -17608 -12965 -12299 -30946 -53987 -37994 -23966 -31160 -28719 3982 17889
4466 17889 11812 13801 -19918 -30403 -3894 21094 36372 38702 19301 9430 10554 22192 21960
4453 21960 23266 38473 28557 26452 15359 15272 -8743 -15484 -24209 -1534 2740 35500 38801 81
4439 81 12142 50985 73493 80243 49416 5043 -27952 -32219 -11755 -8266 1586 -2508 -9025 -16998
4425 -16998 -32340 -25460 -19161 -4621 -14055 -33975 -49994 -29082 -3794 -19132 -13022 -12963 -25745
4412 -25745 -16794 -25708 -65342 -90692 -78270 -70366 -49967 -47870 -64792 -44032 -29694 2559 16381
4399 16381 20585 15055 -7778 -10405 20217 40480 6608 -19695 -28439 -26317 -10738 -20307 -47323
4386 -47323 -45415 -20524 1032 5355 -4270 1624 -1463 -11936 -19418 -13739 -7185 -6963 23504 21028
4372 21028 13276 22578 57248 50585 2627 -2583 -105 3281 -1110 -298 20729 12681 15783 8588
4358 8588 -9820 -33316 -33551 -19085 -30045 -17559 -15431 -15989 -24398 -23028 -21218 -26650 -28270 -2360
4344 -2360 -12129 -29517 -26379 4973 -6685 -44745 -31640 -3662 4994 12068 12105 10439 39201 29187
4330 29187 19571 -7314 9832 26598 21888 15650 15838 10692 -869 3817 -170 -573 21737 34496
4316 34496 24850 19893 14647 -5729 -29813 -25347 16317 45116 45577 17389 17483 21160 2889 -2327
4302 -2327 -20050 -24690 -27380 -3571 -11585 -7558 12724 -21014 -23983 -8047 21868 12583 -4522
4289 -4522 4612 5471 1707 1821 11349 19787 29716 25125 45405 30397 4631 -8711 -15805 -35035
4275 -35035 -25873 -16917 -24588 -38504 -46484 -15310 3871 8291 8263 -6783 -41537 -54180 -13909
4262 -13909 -10210 -26049 -13633 -10869 -22565 5107 37115 -10458 -28159 -30930 -6581 19894
4250 19894 -2324 -1194 -8770 -8346 -21282 -36113 -12933 5118 12970 -7672 -37888 -48023 -47831
4237 -47831 -55371 -26472 4638 20267 2198 -8394 3719 29476 40913 45816 51945 33372
4225 33372 40298 38314 20202 7275 17498 45551 51719 62421 47806 31062 35694 17410 17840
4212 17840 27785 14690 4531 30589 49272 37598 -3666 -11133 5431 13779 -5788 -45407
4200 -45407 -41449 -40546 -43041 -33623 -20536 3354 -14219 -22543 -746 5084 16752 16744 13695 28552
4186 28552 20198 -31795 -60259 -14558 -9433 -32679 -13908 4691 9370 -9092 -26925 -40568
4174 -40568 -10850 -18900 -35234 -6175 -15370 -25173 -21099 -2296 20192 18671 13430 2609 4340
4161 4340 1103 -9153 -13088 -15088 -11543 14250 32383 22866 -7459 -20098 6557 5452 -13959
4148 -13959 -27247 -5302 11187 29540 23373 4560 1938 9644 -18346 -42710 -32451 -17213
4136 -17213 29856 33444 31133 47378 55685 19223 -7017 23803 59044 29195 5619 24946
4124 24946 28014 14508 4486 7224 21640 29287 -13879 -40679 -48729 -30891 -2800 17523 10341
4111 10341 5094 11142 13610 -15146 -46605 -36181 -4665 6330 11700 6194 23728 37821 49741
4098 49741 52103 43511 22176 12813 -11006 -6176 9198 -13555 -7437 9575 -3716 -20533 -27428
4085 -27428 -21778 -28393 -35664 4681 9611 -11059 -18676 -48005 -48743 -18164 -12310 1218 25719
4072 25719 1837 -24484 -31063 -23050 -6188 -23009 -16584 -20356 -29417 -23955 -858 15492 11210
4059 11210 22064 13183 -12051 -18481 -22149 -31189 -29243 -17324 -15154 -17932 -16444 -10626 16756 29933
4045 29933 -415 -16892 -22239 -8775 -9672 -2250 24169 16342 -2494 -12370 -17671 -32688 -16936
4032 -16936 307 -3033 -10590 2932 19193 14743 10357 18881 24205 27440 29324 6836 -127 -20922
4018 -20922 -24894 -17957 -6630 -7408 -2143 -484 -26649 -31517 -6282 5096 20325 6431 3638
4005 3638 7502 2773 14008 -5201 -55810 -48831 -26579 -15817 3638 28343 17837 -904 -1465
3992 -1465 22293 51290 32525 13988 29884 8345 -13719 -11944 15391 18170 35563 39369 40554
3979 40554 25326 20229 25198 31788 28933 9890 21026 16466 11461 -10550 18316 -4341 -33269
3966 -33269 -19554 14691 30441 12111 -21076 -32212 -19730 -146 -11588 -12325 3160 -4313
3954 -4313 -36476 -41637 -22999 -6003 6137 14275 5115 -7134 452 24296 33834 1190 -25913
3941 -25913 -22611 -17717 -8984 9308 2904 7853 10122 6952 2989 14810 27669 6374 3901 11894
3927 11894 -5194 -22317 -23824 -23422 -17978 25244 17371 -8532 -30694 -42077 -37883 -32440 -19526
3914 -19526 -32220 -51163 -26479 13298 440 8698 29715 21272 15148 20751 22669 -685 10685
3901 10685 -9023 4079 -1960 -4972 -11412 1912 18801 6675 11287 8762 13114 -6167 -11004
3888 -11004 3584 20773 34707 23741 -20893 -7169 5583 -38475 -34781 -24082 -9637 6713
3876 6713 -20854 -43958 -40137 -5508 15477 31217 45982 16853 -19519 -43715 -29132 -3441
3864 -3441 19371 30155 35762 20538 12188 -4701 14460 34540 19316 -6398 -15013 -3150 13654
3851 13654 32082 36551 31912 24452 27524 -1164 -13256 4481 751 -3873 4092 -8393 -24718
3838 -24718 -30715 -34502 -58422 -53713 -43589 -24397 -32779 -12971 13621 8334 -6851 -392 5899
3825 5899 21883 -11478 -11503 21556 32959 34331 24334 -20376 -35099 -42904 -63623 -72245 -53811
3812 -53811 -27674 -34727 -65245 -54010 -42960 -19978 -1248 -5621 26934 17200 1764 -12603
3800 -12603 -18314 -15737 -25945 -10513 24916 37314 30035 -2427 12074 40743 34328 36753 48402
3787 48402 25461 3787 14600 17399 -2624 -1292 1922 1637 5979 163 583 -12768 -4034 13964
3773 13964 9161 -12764 -26904 -16324 -9339 -29853 -38277 -33125 -7903 5994 -910 6836 2600
3760 2600 -3003 8645 26530 10168 18379 -7850 -20841 -24993 -36547 -31369 -40802 -49609 -39797
3747 -39797 -21795 -13668 -2106 19881 14905 -7002 -30689 -38304 -24699 -19928 -3732 2074 -4865
3734 -4865 17243 48569 63628 20456 -34997 -32200 -46350 -55946 -37704 -25748 -23749 -11956 14438
3721 14438 37877 53547 67480 43119 14145 3678 27856 54819 74232 44064 11655 32873
3709 32873 5841 -12719 -37402 -36285 -26058 -9891 -10006 -18246 -20030 -24204 -29524 -22270 -4909
3696 -4909 -14396 -18148 -15078 -20433 -5341 847 2128 12862 12392 -3212 5885 17838 21310 23389
3682 23389 7323 -27822 -30287 -37933 -33992 -32983 -27569 11717 2704 -6987 6366 -13892 -21391
3669 -21391 -6968 -17373 -20733 18273 -8733 -21922 -41103 -23216 -14353 -21228 -42550 -41870 -17418
3656 -17418 -8740 -47709 -77704 -65337 -54941 -17194 8195 10317 5595 -10372 -18087 -28567 -31591
3643 -31591 -30570 -28201 -42081 -38146 -14723 -33328 -50057 -51891 -44437 -23140 -2291 8304 -17522
3630 -17522 -27233 7792 7233 6751 26924 28735 38318 27593 12343 -16725 -6584 8224 -10848
3617 -10848 -14415 1346 5088 -4552 -7892 -15111 -17241 -35177 -39513 -17895 -20309 -40487 -32563 -22236
3603 -22236 6229 37700 -6921 -30162 -22681 -3390 18448 -2749 -18940 -14870 9068 36063
3591 36063 45876 52317 46081 19285 5103 26802 27592 12336 344 3250 27463 38948 12777
3578 12777 -13282 -36024 -54866 -43216 -44005 -19742 -68 3762 -2226 5740 18329 4666 -40941
3565 -40941 -65094 -34172 -7611 -12667 -40697 -49536 -31406 -11479 20294 28365 41366 33628 3661
3552 3661 -11658 -8592 -8506 -13206 -2744 -1960 28756 44529 47178 59111 46076 50239 49197 8882
3538 8882 13416 48477 36292 10105 -8176 7334 15989 9989 15813 26516 40835 27874 16203
3525 16203 13073 17390 16052 6071 -15393 -7004 -13902 -26779 -22740 -37125 -36225 -28286 -49916 -30141
3511 -30141 -16416 -25173 -37459 -23888 -13587 -3256 21027 468 -22542 -16006 -12386 18578
3499 18578 7639 2451 507 8132 630 10095 16873 9589 7877 23429 39577 40090 44473 36934
3485 36934 47393 50669 50449 36094 23507 25299 13855 -8937 -22626 -24907 6419 -48 -38781
3472 -38781 -12239 17055 15411 18181 5375 2145 32926 60298 64526 44425 13858 16535 6674
3459 6674 3728 21464 33064 -17595 -38122 -32881 -35369 -20582 12257 13385 11501 4191 -6878
3446 -6878 11366 33281 16177 17793 18709 23482 29957 18161 23860 -20060 -63654 -48807 -30402
3433 -30402 -13567 -6019 -142 -15501 -22666 -5219 15279 -687 -15490 -8273 -17805 -2564 3789
3420 3789 -2023 -8475 -22383 -24801 -30258 -47650 -35640 14030 23783 5792 24807 51629 38757
3407 38757 19634 4947 -4485 -12664 -10051 -10581 -22054 -18052 -52853 -51414 -49467 -28647 1405
3394 1405 5417 357 2136 21802 19265 11365 30452 25992 26299 6050 -24503 -16787 329 5660
3380 5660 -16244 -8714 -484 23519 30944 19569 25051 27925 6092 -31776 -43009 -12730 4112
3367 4112 -15145 -57419 -55972 -62281 -67636 -55521 -57929 -50173 -39222 -47451 -40119 -20760 -19396 -35599
3353 -35599 -27326 -15614 -47116 -40432 -7076 -12135 -37467 -70175 -43163 -202 22176 26209 -3617
3340 -3617 -43773 -40943 -23544 -20386 -7888 -5846 -34687 -45697 -28200 -24918 1710 -8431 -16469
3327 -16469 -23447 -3341 -555 17754 25831 9227 16421 17883 3362 26751 8907 8045 11415
3314 11415 -330 -14476 -4309 -17432 136 8180 1408 7909 23764 17855 1914 17150 24334
3301 24334 5936 -18409 -16199 5793 12560 13006 5893 -3778 10986 18373 21626 1702 -15239
3288 -15239 -14237 -5145 -18916 -38471 -31721 -30826 -22838 -21858 -41564 -43971 -40792 -25757 -14498 21073
3274 21073 18097 6092 -22914 -23180 7133 25159 14427 4333 17547 42638 66375 56147
3262 56147 10945 20551 36540 49942 38576 51211 67004 33851 63867 68610 56892 35773
3250 35773 24659 35484 26937 -11936 -22098 -8157 7664 -1568 -13484 -11902 -24418 -25327 -20748
3237 -20748 -8863 -21946 -38946 -28726 -30938 -21635 9226 20764 -1333 -12135 6256 22313
3225 22313 20270 23547 15377 9808 22395 7608 10047 -2064 -7589 12284 6237 -538 30125
3212 30125 37446 29712 10136 13932 9613 28557 22330 1602 4194 -321 9124 35362 51201
3199 51201 42060 2620 -22068 -2333 14686 10944 13907 7552 10 10387 12926 -3550 -11998
3186 -11998 8170 22925 35005 50741 73091 63778 33473 24362 22910 890 -5715 -8080 9807
3173 9807 39552 29038 4892 -18164 -19300 -8683 -6367 4808 9843 23291 33354 37388 25601
3160 25601 12159 -19588 -22348 -20116 772 18256 28960 53036 57053 64257 50189 24412 21744
3147 21744 21841 36925 17265 33291 39990 17391 -518 21753 24907 27606 13906 36141 32364
3134 32364 18073 32103 48801 23692 47144 64425 46487 44468 46323 17151 -4245 -49368
3122 -49368 -37783 -16999 -28454 -22189 -8369 12997 -13784 -18037 -15660 -29964 -25574 -8717 21712
3109 21712 17405 -12746 -36000 -47553 -17756 -6986 -13509 -14211 -45208 -54077 -22028 -37307 -47646
3096 -47646 -49191 -52016 -57675 -52189 -16836 -21221 -15337 -755 20958 23742 21583 5019 4661 -13959
3082 -13959 -26582 -16330 -14726 -13648 -12476 15407 9738 -17645 -17697 -46874 -56103 -59706 -47234 -20674
3068 -20674 -12853 -7791 -7950 -8986 -3464 8662 12244 21705 27365 20776 -3334 -13475 -4561 7336
3054 7336 5384 17368 36445 31658 7337 17565 10287 3205 -12412 -4754 2322 25693 25354 -7227
3040 -7227 -13080 -22250 -15349 8075 21067 22887 50280 78503 62347 25389 25034 25875 -13035 -37644
3026 -37644 -46448 -26894 -24050 -29501 -21046 -5873 -23019 -63030 -25929 -4162 -8135 2830 37682
3013 37682 56395 45752 35453 -3924 -25223 -28719 -42348 -50450 -24674 -11395 3769 23203
3001 23203 33505 37420 35722 38812 45478 56627 22414 -3219 -34745 -24675 -5152 -9100 -27016
2988 -27016 -4214 16434 37002 42239 42451 39262 36221 3740 -7834 -15693 13781 19016 22966
2975 22966 -20135 -22184 -14171 -22344 -5934 11110 -19355 -41544 -45081 -46291 -34914 -51824 -54858
2962 -54858 -59116 -34708 -6887 3779 5443 18518 29059 18191 296 23959 25508 25170 18761
2949 18761 15708 -1999 -45493 -42882 -22696 -15235 -37918 -30341 -10913 17857 6760 10518 36925
2936 36925 27947 31335 13453 -1333 3710 -26 16641 22514 15024 11340 43281 38353 7455
2923 7455 -15734 -58035 -36097 -8424 -13856 -21903 4401 12206 7463 -6315 -4204 -5218 -19754
2910 -19754 -33979 -32738 -21554 -20534 -29149 -26090 -37900 -16343 -1685 -7336 -18488 3247 16471
2897 16471 -21104 6640 27225 21729 23034 28026 18540 -2979 -1961 -16406 -50239 -28730 4360
2884 4360 3351 -8847 -18752 -23871 -42306 -61384 -45387 -21748 -14949 -22486 -39140 -4806 21972
2871 21972 34791 40506 27669 6575 -6762 -28739 -26576 -19285 -22165 -59751 -59905 -20667 22715
2858 22715 10121 -11995 -28925 -46563 -23614 8098 -5572 -19983 -22439 -23051 -31713 -5549 10234
2845 10234 18728 23415 18149 12684 14573 -9307 -8523 -21406 -28838 -26460 -34139 -34930 -42431 -62137
2831 -62137 -61570 -40088 -25358 -9058 -3169 -9536 -12834 -1082 -2714 -3691 10413 14095 37367 57819
2817 57819 49944 42447 26158 -2317 16241 22901 25096 35520 22647 28239 11086 -17007 -28069
2804 -28069 -19994 -11708 -20492 -27910 -22989 -11518 -35465 -42211 -45954 -18579 -5701 17917 21609
2791 21609 10918 7502 16954 43974 49608 50351 63308 63964 41393 9201 -8933 -1527 16765
2778 16765 -2639 -30555 -23097 -2331 7797 21678 13495 4205 -31640 -24120 24003 31341 10551
2765 10551 -11824 -501 2022 -9616 -20088 -12729 -13238 1281 22228 9377 -19866 -5503 13359
2752 13359 -1920 -2999 22747 19935 15756 369 -38755 -65723 -79475 -48904 -24382 -40519
2740 -40519 -35488 -3588 1413 -749 -864 -4473 -11567 -31879 -24584 2721 3826 -26658 -34843 -37049
2726 -37049 -52286 -40152 11269 23698 -1050 -9974 -26983 -14489 4267 -6666 -14328 -10020
2714 -10020 -5127 16538 3320 -677 -9823 -1474 4449 -6544 -15695 -17213 12355 26043 7339
2701 7339 10721 6275 -26657 -43585 -54415 -33456 -27804 -3114 796 -12044 -19642 -1886 -25009
2688 -25009 -2968 -6275 -13278 -13375 -43250 -58255 -55411 -43991 -12298 -9332 19706 37181 -225
2675 -225 -26043 -3928 16522 19289 13481 765 5091 22557 6953 26416 39058 38041 33338
2662 33338 8871 -34540 -48577 -26228 -32974 -46709 -67169 -62348 -23689 -1807 6385 -11491
2650 -11491 -14163 7630 10274 4018 -16072 -9823 -8715 -36395 -53683 -32515 -40855 -37537 -24559
2637 -24559 -19282 -321 40843 22843 3607 -9715 -1904 13146 19418 40747 34139 15806 -20808
2624 -20808 -16842 12181 23732 20084 -1968 -20764 -19826 -32153 -35419 9263 34661 31690 29109
2611 29109 26998 -12899 -45873 -55054 -67701 -36683 -4018 7232 -4333 -32056 -13611 -13965 -26161
2598 -26161 -50198 -44048 6035 4529 -4784 15716 -3392 -32020 -60335 -39056 -51059 -60372 -40913
2585 -40913 -5851 44227 40612 32473 5249 -25505 -21435 -12668 486 -4899 -25577 -8652 5977
2572 5977 20925 18244 6982 -10254 15927 23475 25217 -3519 -13031 -3056 28495 16913 -9929
2559 -9929 -27118 -30364 -33032 -29868 -31964 -21791 -3746 5632 16928 1458 5571 -5250 -10279
2546 -10279 -2301 13189 3434 24615 48852 46569 45573 46495 30808 9054 -5691 13317 20537
2533 20537 14970 16237 -775 -11486 -3146 5091 4778 -380 -11709 -20646 -8145 -210 -2622 3184
2519 3184 -7223 -17286 -11771 -1950 -27218 9483 3381 -26800 -35354 -14459 -7110 -9725 -21590
2506 -21590 -14400 -5650 -7526 -26963 11118 26280 8341 7143 23994 8629 -10396 -3282 27608
2493 27608 19683 7198 7137 27740 40173 30741 22991 19079 35616 35990 31635 33983 32437 5371
2479 5371 4855 27758 39297 33217 34065 46233 25581 15039 -7608 131 16286 20732 16973 27788
2465 27788 39954 37980 54484 50567 41189 32321 12897 14100 20898 20330 3531 1376 21241 57764
2451 57764 48509 47551 42850 34659 34447 15043 11522 26428 42990 36626 18342 -10484 -9853 10972
2437 10972 10714 5122 18063 25775 8385 8236 -7073 -14422 -29957 -42694 -43738 -27614 -20221 -25305
2423 -25305 -7600 -11841 5195 36463 46116 58236 55035 19370 3211 20611 34730 8359
2411 8359 -4438 8356 3566 -17125 -40707 -18491 4906 20179 36590 39909 3155 -18194
2399 -18194 6126 1468 3485 -1237 -7723 2764 5432 -21283 -49235 -69437 -68249 -52514 -34118
2386 -34118 -16334 -10772 -27811 -16538 -14020 -19253 -29583 7935 4817 -25876 -24455 -32013 -22518
2373 -22518 -13259 976 -135 -6126 -4875 17484 30084 30520 17314 -35628 -54742 -37263 -23282
2360 -23282 -15932 1139 -11864 -35433 -20346 6301 -4196 -12175 -30392 -20152 -10493 -18411 -47359
2347 -47359 -52771 -40524 -7374 6002 2012 3271 32870 33233 24721 15087 88 6580 -8954
2334 -8954 -9661 -13041 4939 21990 25329 7114 16625 10334 -39377 -45019 -17525 -2398 2318 29177
2320 29177 44727 25943 -513 5522 23628 35015 13648 4880 15067 36398 29349 12254
2308 12254 20476 27925 43021 67090 83580 44868 44852 50539 47977 21424 -10652 -12534 4278
2295 4278 9463 1615 4583 12592 13120 10498 12172 4991 12283 24869 24190 3542 -31862 -36835 -30707
2280 -30707 -34067 -11035 6994 -3731 -7938 7475 20600 13436 26378 17756 13723 25539 -790
2267 -790 -28384 -26857 -1213 2201 -1655 -12347 -11824 1859 4863 21731 35426 47942 57960
2254 57960 42914 50753 47666 28079 17231 4442 28104 33089 28651 23665 17250 12103 3888
2241 3888 9836 16036 25639 40467 31151 2810 -24804 -20961 -8282 -27153 -27030 -456 17594
2228 17594 38933 15636 -13635 -17307 18429 10918 -12895 -4376 7673 27806 15616 21105 49075
2215 49075 40981 8731 -32941 -41546 -27120 -26986 -32858 -24533 -19899 -35758 -29335 12459 21594 -817
2201 -817 -19668 -9326 -28319 -24427 2126 30179 40670 61370 42834 27990 5405 -3028 20107
2188 20107 10994 -13926 -9463 6824 4570 2759 2337 2827 18515 27617 5648 4748 -15703 -13808
2174 -13808 19642 12124 7518 -4647 -12715 -35831 -42552 -59143 -40710 -10135 3284 26444 19444
2161 19444 15179 26863 12670 16085 24524 24653 17298 30979 35460 25007 28545 26589 40524 25012
2147 25012 1525 -31285 -27798 2873 27735 19520 24263 44895 45611 12649 10533 -21629 -33429
2134 -33429 -29138 -22659 -16084 -4428 14015 27484 33427 2824 -5607 -13257 -26176 -56362 -35436
2121 -35436 -20348 -7281 2137 9455 18614 39783 54205 27936 18066 -5086 -22333 -4927 -2035
2108 -2035 -9161 -157 -1167 23293 33704 -550 -7556 6806 -7595 -1138 -3314 11559 27386
2095 27386 13201 -3993 11628 39980 16575 13002 36699 57890 43344 20294 19002 19294 19012
2082 19012 23363 15013 1450 14156 26479 22481 12488 -11722 -19538 -12516 8064 12395 4126
2069 4126 -21240 -21418 -38663 -38744 -59725 -51967 -13690 -7449 -34707 -50494 -47115 -37904 -43688 -40196
2055 -40196 -8084 13456 39402 51933 56914 17317 6644 8329 -5233 -19169 -11567 -10993 4707
2042 4707 19141 14624 12080 -6600 -25949 -21557 -16468 -8622 -8185 -21250 -13517 9091 -1433 -17440
2028 -17440 -17392 -33912 -32700 -31108 -11604 10539 -9872 -25228 -33593 -4480 13146 18661 50063
2015 50063 40539 10168 -6164 1015 -5072 120 3526 -1129 2093 4229 -15923 -11206 -14547 -17986
2001 -17986 -486 16060 2250 -10156 -17028 6675 18774 5107 26763 46692 23660 -7844
1989 -7844 -11290 1283 9603 -1409 -7710 11928 -2886 -7338 -7609 3816 12611 21752 -2162 -12510
$$ [...]
##END NTUPLES=NMR SPECTRUM
##END=
