##TITLE=Analysis number 315337
Compound Code cc 46601
Book Reference 441/175
Project Code adrs
Chemist Name colinb
##JCAMPDX= 6.0         $$ Bruker NMR JCAMP-DX V2.0
##DATA TYPE= NMR SPECTRUM
##DATA CLASS= NTUPLES
##ORIGIN= Bruker BioSpin GmbH
##OWNER= NMR
$$ XWIN-NMR		Version 3.5
$$ Tue Nov 15 11:47:15 2005 GMT Standard Time (UT+0h)  MAYBRIDGE\NMR@NMR_250MHZ
##.OBSERVE FREQUENCY= 250.131544655141
##.OBSERVE NUCLEUS= ^1H
##.ACQUISITION MODE= SIMULTANEOUS (DQD)
##.ACQUISITION SCHEME= undefined
##.AVERAGES= 16
##.DIGITISER RES= 18
##SPECTROMETER/DATA SYSTEM= dpx250
##.PULSE SEQUENCE= zg30
##.SOLVENT NAME= DMSO
##.SHIFT REFERENCE= (INTERNAL, DMSO, 0, 16.522)
##AUDIT TRAIL= $$ (NUMBER, WHEN, WHO, WHERE, WHAT)
$$ ##TITLE= Audit trail, XWIN-NMR		Version 3.5
$$ ##JCAMPDX= 5.01
$$ ##ORIGIN= Bruker BioSpin GmbH
$$ ##OWNER= NMR
$$ C:\u/data/dgb/nmr/ADRS/12420/pdata/1/auditp.txt
$$ ##AUDIT TRAIL=  $$ (NUMBER, WHEN, WHO, WHERE, WHAT)
(   1,<2005-11-15 11:46:34.25 +000>,<MAYBRIDGE\NMR>,<NMR_250MHZ>,
      <created by zg, POWCHK disabled, PULCHK disabled
       configuration hash MD5:
       62 19 C7 07 E1 42 D1 B7 37 6C 3D D0 77 39 F9 E6
       data hash MD5: 64K
       5B 27 AF A7 84 AC 7A 71 F7 F3 3C 2F B3 59 48 00>)
(   2,<2005-11-15 11:46:52.40 +000>,<MAYBRIDGE\NMR>,<NMR_250MHZ>,
      <Start of raw data processing
       ef LB = 0.3 FT_mod = 6 PKNL = 1 SI = 32K 
       data hash MD5: 32K
       3B EE A2 48 0D 8F 6B 61 12 C8 03 E6 4C 02 34 31>)
(   3,<2005-11-15 11:46:57.82 +000>,<MAYBRIDGE\NMR>,<NMR_250MHZ>,
      <apk 
       data hash MD5: 32K
       DB A2 FF E4 B6 0D 88 40 95 FE AE 8C F4 3C DD 12>)
(   4,<2005-11-15 11:46:59.75 +000>,<MAYBRIDGE\NMR>,<NMR_250MHZ>,
      <abs ABSG = 5 
       data hash MD5: 32K
       10 19 DE 25 76 EC 7C 19 C5 A5 90 57 6C F8 F4 D3>)
$$ ##END=
$$ 
$$ hash MD5
$$ CE DC 36 8D 2F F1 DC 3C D3 54 F1 C3 E2 BC A2 44
##$RELAX= 
##$RELAX= 
##$RELAX= 
##$RELAX= 
##$RELAX= 
##$RELAX= 
##$RELAX= 
$$ Bruker specific parameters
$$ --------------------------
##$DU= <C:\u>
##$EXPNO= 12420
##$NAME= <ADRS>
##$PROCNO= 1
##$TYPE= <nmr>
##$USER= <dgb>
##$AMP= (0..31)
100 100 100 100 100 100 100 100 100 100 100 100 100 100 100 100 100 100 
100 100 100 100 100 100 100 100 100 100 100 100 100 100 
##$AQSEQ= 0
##$AQ_mod= 3
##$AUNM= <au_zg>
##$AUTOPOS= <25 >
##$BF1= 250.13
##$BF2= 250.13
##$BF3= 250.13
##$BF4= 250.13
##$BF5= 500.13
##$BF6= 500.13
##$BF7= 500.13
##$BF8= 500.13
##$BYTORDA= 1
##$CFDGTYP= 0
##$CFRGTYP= 5
##$CHEMSTR= <none>
##$CNST= (0..31)
1 1 145 1 1 1 1 1 1 1 1 1 1 1 1 1 1 1 1 1 1 1 1 1 1 1 1 1 1 1 1 1 
##$CPDPRG= <>
##$CPDPRG1= <>
##$CPDPRG2= <>
##$CPDPRG3= <>
##$CPDPRG4= <mlev>
##$CPDPRG5= <mlev>
##$CPDPRG6= <mlev>
##$CPDPRG7= <mlev>
##$CPDPRG8= <mlev>
##$CPDPRGB= <>
##$CPDPRGT= <>
##$D= (0..31)
0 1 0 0 0 0 0 0 0 0.06 0 0 0 0 0 0 0.0002 0 0 0 0 0 0 0 0 0 0 0 0 0 0 
0 
##$DATE= 1132055192
##$DBL= (0..7)
120 120 120 120 120 120 120 120 
##$DBP= (0..7)
150 150 150 150 150 150 150 150 
##$DBP07= 0
##$DBPNAM0= <>
##$DBPNAM1= <>
$$ [...]
##$SUBNAM7= <"">
##$SUBNAM8= <"">
##$SUBNAM9= <"">
##$SW= 20.6930455092707
##$SWIBOX= (0..15)
0 0 3 0 0 0 0 0 0 0 0 0 0 0 0 0 
##$SW_h= 5175.983436853
##$TD= 65536
##$TD0= 1
##$TE= 295.16
##$TE2= 300
##$TE3= 300
##$TEG= 300
##$TL= (0..7)
0 120 120 120 120 120 120 120 
##$TP= (0..7)
150 150 150 150 150 150 150 150 
##$TP07= 0
##$TPNAME0= <>
##$TPNAME1= <>
##$TPNAME2= <>
##$TPNAME3= <>
##$TPNAME4= <>
##$TPNAME5= <>
##$TPNAME6= <>
##$TPNAME7= <>
##$TPOAL= (0..7)
0.5 0.5 0.5 0.5 0.5 0.5 0.5 0.5 
##$TPOFFS= (0..7)
0 0 0 0 0 0 0 0 
##$TUNHIN= 0
##$TUNHOUT= 0
##$TUNXOUT= 0
##$USERA1= <user>
##$USERA2= <user>
##$USERA3= <user>
##$USERA4= <user>
##$USERA5= <user>
##$V9= 5
##$VALIST= <valist>
##$VCLIST= <CCCCCCCCCCCCCCC>
##$VD= 0
##$VDLIST= <DDDDDDDDDDDDDDD>
##$VPLIST= <PPPPPPPPPPPPPPP>
##$VTLIST= <TTTTTTTTTTTTTTT>
##$WBST= 1024
##$WBSW= 4
##$XGAIN= (0..3)
0 0 0 0 
##$XL= 0
##$YL= 0
##$YMAX_a= 527057
##$YMIN_a= -406354
##$ZGOPTNS= <>
##$ZL1= 120
##$ZL2= 120
##$ZL3= 120
##$ZL4= 120
##$ABSF1= 16.522
##$ABSF2= -4.171173
##$ABSG= 5
##$ABSL= 3
##$ALPHA= 0
##$AQORDER= 0
##$ASSFAC= 0
##$ASSFACI= 0
##$ASSFACX= 0
##$ASSWID= 0
##$AUNMP= <proc_1d>
##$AZFE= 0.1
##$AZFW= 0.1
##$BCFW= 0
##$BC_mod= 0
##$BYTORDP= 0
##$COROFFS= 0
##$CY= 12.5
##$DATMOD= 1
##$DC= 0
##$DFILT= <>
##$DTYPP= 0
##$F1P= 14.0000005364418
##$F2P= -0.99999901652339
##$FCOR= 0.5
##$FTSIZE= 32768
##$FT_mod= 6
##$GAMMA= 0
##$GB= 0
##$INTBC= 1
##$INTSCL= 1
##$ISEN= 128
##$LB= 0.3
##$LEV0= 0
##$LPBIN= 0
##$MAXI= 10000
##$MC2= 0
##$MEAN= 0
##$ME_mod= 0
##$MI= 0
##$NCOEF= 0
##$NC_proc= -3
##$NLEV= 6
##$NOISF1= 0
##$NOISF2= 0
##$NSP= 0
##$NTH_PI= 0
##$NZP= 0
##$OFFSET= 16.522
##$PC= 1
##$PHC0= 72.89346
##$PHC1= 6.375633
##$PH_mod= 1
##$PKNL= yes
##$PPARMOD= 0
##$PSCAL= 4
##$PSIGN= 0
##$REVERSE= no
##$SF= 250.13
##$SI= 32768
##$SIGF1= 0
##$SIGF2= 0
##$SINO= 400
##$SIOLD= 32768
##$SREGLST= <1H.DMSO>
##$SSB= 0
##$STSI= 32768
##$STSR= 0
##$SW_p= 5175.98343685301
##$SYMM= 0
##$S_DEV= 0
##$TDeff= 65536
##$TDoff= 0
##$TI= <Analysis number 999999
Compound Code 99
Book Reference 9
Project Code 9>
##$TILT= no
##$TM1= 0
##$TM2= 0
##$TOPLEV= 0
##$USERP1= <user>
##$USERP2= <user>
##$USERP3= <user>
##$USERP4= <user>
##$USERP5= <user>
##$WDW= 1
##$XDIM= 32768
##$YMAX_p= 544112232
##$YMIN_p= -173623
$$ End of Bruker specific parameters
$$ ---------------------------------
##NTUPLES= NMR SPECTRUM
##VAR_NAME=  FREQUENCY,     SPECTRUM/REAL,   SPECTRUM/IMAG
##SYMBOL=    X,             R,               I
##VAR_TYPE=  INDEPENDENT,   DEPENDENT,       DEPENDENT
##VAR_FORM=  AFFN,          ASDF,            ASDF
##VAR_DIM=   32768,         32768,           32768
##UNITS=     HZ,            ARBITRARY UNITS, ARBITRARY UNITS
##FACTOR=    0.157963299565203, 1,           1
##FIRST=     4132.6476996994, 0,             0
##LAST=      -1043.33573715361, 0,           0
##MIN=       -1043.33573715361, -173623,     0
##MAX=       4132.6476996994, 544112232,     0
$$ Real data points
##PAGE= N=1
##DATA TABLE= (X++(R..R)), XYDATA
$$ [...]
18927B55088k2733N245K4300n5780k0303M4448M6651K0324L9179J1367R47K090
$$ 255088 232355 237600 261900 206120 185817 230265 276916 297240 336419 347786 348733 350823
18915C50823j934M8520L2581J9973N422j1358m4673l0416J6822K9459k1877L46
$$ 350823 348889 397409 429990 449963 455385 444027 399354 368938 385760 415219 393342 393688
18903C93688J5596j0255k1147L0573k974j7022J8049J3081n2652k2322L7085r233
$$ 393688 409284 399029 377882 408455 405481 388459 406508 419589 366937 344615 381700 372467
18891C72467o0881m1857J823l3533n3065j5018J7574K3710K6690k4449k2894J2911
$$ 372467 311586 269729 271552 238019 184954 169936 187510 211220 237910 213461 190567 203478
18879B03478P823l8429k8466L3746K7224K8814m009k8528m0791r921O5186O2428
$$ 203478 211301 172872 144406 178152 205376 234190 230181 201653 160862 150941 216127 278555
18867B78555M0071L8477M4741L8486j6454l7164n7599K1413K599P640K2697K2807
$$ 278555 318626 357103 401844 440330 423876 386712 329113 350526 353125 360765 383462 406269
18855D06269J1355J6811J3285m654n2545j9053q108n727j8355l1339Q2l5643n8674
$$ 406269 417624 434435 447720 443066 390521 371468 363360 357633 339278 307939 308021 272378 213704
18842B13704k2755O422j2337M2158j9128p5531j3116k5993j4113L2149J0299J0851
$$ 213704 190949 197371 185034 227192 208064 132533 119417 93424 79311 111460 121759 132610
18830A32610j2761k2000j4003K1461n247L84K4117r913L47r586P453K5553M107
$$ 132610 119849 97849 83846 105307 100060 100444 124561 114648 114995 105409 112862 138415 142522
18817A42522j1101K9574M2308J0147M0197o41m0933l1153O1026L7237L7504j5615
$$ 142522 131421 160995 203303 213450 253647 253006 212073 180920 241946 279183 316687 301072
18805C01072k4543J0673N205l4944l8912l9533j1721Q859k2233l098J8429j0460
$$ 301072 276529 287202 292407 257463 218551 179018 167297 176156 153923 150825 169254 158794
18793A58794L461k2042n4686J8200M2015m6656O704J6559j9937j8115L4393J1407
$$ 158794 162255 140213 85527 103727 145742 99086 105790 122349 102412 84297 118690 130097
18781A30097k8004k6316J1287L9862K3399l2207K787o104j3198J3017K8407j99
$$ 130097 102093 75777 87064 126926 150325 118118 120905 114801 101603 114620 143027 142828
18769A42828j3445J7234M8999L9630m6538l1026j007P273N506k255k0603L981
$$ 142828 129383 146617 195616 235246 188708 157682 156675 163948 169454 167199 146596 150577
18757A50577L4350P124j6966l3078m9513m116Q714K0894L5405K8361k0645k2639
$$ 150577 184927 192051 175085 142007 92494 88378 97092 117986 153391 181752 161107 138468
18745A38468N8493O1855q270k1980K3442N8214O8608P0243J11421J44451J63926
$$ 138468 196961 258816 250546 228566 252008 310222 378830 449073 560494 704945 868871
18734H68871O6780k8534r3419j38477j18032p9831m3463l2917Q473J6027m2844
$$ 868871 935651 907117 813698 675221 557189 477358 433895 400978 409451 425478 382634
18723C82634P121l1612n9620j196l8465p0227k7407l0857K1829p693j5207M8171
$$ 382634 389755 358143 298523 297327 258862 188635 161228 130371 152200 144507 129300 177471
18711A77471l823n2702j0629J211M4169K640p41j9107l897j6030j2109l5303j4196
$$ 177471 173648 120946 110317 111528 155697 158337 157596 138489 134592 118562 106453 71150 56954
18698E6954O59M2452J8121k9205Q701q102l4571j4894K823L2293M4973L2492l2672
$$ 56954 57613 100065 118186 88981 97682 89580 55009 40115 42938 75231 120204 152696 120024
18685A20024j3769j6015L8509J2014j9755l0710P21K895k1323j4656R747L2309
$$ 120024 106255 90240 128749 140763 121008 90298 91019 93914 72591 57935 67682 99991
18673I9991j5088J6343M9364m561j5682K6942j9274m6961m1501J4018N8710k524
$$ 99991 84903 101246 150610 146049 130367 157309 138035 91074 49573 63591 122301 119777
18661A19777m053J8301k202n67j3970k0026j5149p279K2942K3686L8249l246m450
$$ 119777 115724 134025 131823 131256 117286 97260 82111 74832 97774 121460 159709 156463 152013
18648A52013l4897k7846J8542N712p095o669r226q826j8117j505K8729K1281j6595
$$ 152013 117116 89270 107812 113524 106429 99760 90534 81708 63591 62086 90815 112096 95501
18635I5501k2161J7376N7407J4374l3592l6791j1662L1957O642J1486K0844j7109
$$ 95501 73340 90716 148123 162497 128905 92114 80452 112409 119051 130537 151381 134272
18623A34272j8714l3857K924M5169N1233K6706k8269n4741M1309K3472k5406l6954
$$ 134272 115558 81701 84625 129794 181027 207733 179464 124723 166032 189504 164098 127144
18611A27144M186P364L412P202l4478p348N103j909Q961j232k3713K6971k588
$$ 127144 131330 138694 142106 149308 114830 107482 112585 110676 119637 118405 94692 121663 119075
18598A19075n103M653J1079J529J459J136M0757o274k5809k080j9135p907j7236
$$ 119075 113972 118625 129704 131233 132692 133828 174585 168311 142502 140422 121287 113380 96144
18585I6144j1961L4838K0074j7004l4175Q991P302p155J8457L2278J957j2954
$$ 96144 84183 119021 139095 122091 87916 96907 104209 97054 115511 147789 149746 136792
18573A36792J4640n904m7550J030M6877K2175K348j294K8277J7512J817k036J7389
$$ 136792 151432 145528 97978 99008 145885 168060 170408 169114 197391 214903 216720 214684 232073
18560B32073p891j2374M1164N3791q888K5090j4524K420K561M4766M2163m651
$$ 232073 224182 211808 252972 306763 297875 322965 308441 310861 313422 358188 400351 395700
18548C95700K4505N968j025l5122k9504j9710j2466k3328k1059o048n7101l7336
$$ 395700 420205 426173 425148 390026 360522 340812 328346 305018 283959 277911 220810 183474
18536A83474K1696K282L3218J8963j758k6470j1616l7902j6567N4789M1619k0173
$$ 183474 205170 207452 240670 259633 257875 231405 219789 181887 165320 220109 261728 241555
18524B41555l3631n125K4532K6048J293k028O4326O5345J7839M0771P35J2489
$$ 241555 207924 202799 227331 253379 254672 252644 316970 382315 400154 440925 441660 454149
18512D54149M0522N6116p310M945L5231L1214l6756k6911L7408J6904l9973r639
$$ 454149 494671 550787 543477 548422 583653 614867 578111 551200 588608 605512 565539 555900
18500E55900m4649l2303J9296O990L718l7886J4151j2575J0623K3117K4000l174
$$ 555900 511251 478948 498244 505234 508952 471066 485217 472642 483265 506382 530382 527208
18488E27208q732j9m8106k9365j2989j3397m991j8762l2042n3846k7665L9367
$$ 527208 518476 518457 470351 440986 427997 414600 409609 390847 358805 304959 277294 316661
18476C16661J0640j928l7525k9193k592r69R7287Q8470m5328k1522j3116j0853
$$ 316661 327301 325373 287848 258655 256063 255094 352381 440851 395523 374001 360885 350032
18464C50032j0112K8516K0982P652p161o8535J579J5632J1741K0767K0089j5088
$$ 350032 339920 368436 389418 397070 389909 321374 322953 338585 350326 371093 391182 376094
18452C76094J8636M2343q596O1472M1738J3376K7924J5553J8942O7403P2995Q9879
$$ 376094 394730 437073 428477 489949 531687 545063 572987 588540 607482 674885 747880 837759
18440H37759Q6348P346p175L4776O2232P0579O8671R8027J34330J50563J57489
$$ 837759 924107 931453 924278 959054 1021286 1091865 1160536 1258563 1392893 1543456 1700945
18429A700945J12754R4040J26119J72357K50653L50370M78353P11010R89276J547642
$$ 1700945 1813699 1907739 2033858 2206215 2456868 2807238 3285591 3996601 4985877 6533519
18419F533519K175907K689505L002786L116977K977811J801697k40610j568092
$$ 6533519 8709426 11398931 14401717 17518694 20496505 22298202 22057592 20489500
18411B0489500j595156o67023J132862L466303N745190O398849L804387r89970
$$ 20489500 18894344 18227321 19360183 22826486 28571676 34970525 38774912 37784942
18403C7784942m858918o184316n703022m336593k737782j328957k10493O24821
$$ 37784942 32926024 26741708 21038686 16702093 13964311 12635354 12424861 13049682
18395A3049682J086378O89583m73265j482584j770488j722197j449176j020395
$$ 13049682 14136060 14825643 14352378 12869794 11099306 9377109 7927933 6907538
18387F907538o14300l39775j48273q4376Q0190K21182L22423N35543Q79107J282556
$$ 6907538 6293238 5953463 5805190 5720814 5801004 6022186 6344609 6880152 7759259 9041815
18377I041815J797592K233354K208259J807143J494743J451175J470245J787931
$$ 9041815 10839407 13072761 15281020 17088163 18582906 20034081 21504326 23292257
18369B3292257K836126M760209P324013R487867R863073R086279Q789661R019484
$$ 23292257 26128383 30888592 38212605 47700472 57563545 66649824 75439485 84458969
18361H4458969P532022J547009p009222j2449592j3130494j0886592p228442l357834
$$ 84458969 91990991 93538000 86528778 74079186 60948692 50062100 42833658 39475824
18353C9475824j37897J795191K114153O65606k215205n050007o319615o146320
$$ 39475824 39337927 41133118 43247271 43912877 41697672 36647665 30328050 24181730
18345B4181730n182190l921557k761575j933906j342303r52287o51097m32215
$$ 24181730 18999540 15077983 12316408 10382502 9040199 8087912 7436815 7004600
18337G004600k87669k75896j63066l7752m2431L3297K52776M41984O42606J025273
$$ 7004600 6716931 6441035 6277969 6240217 6197786 6231083 6483859 6925843 7568449 8593722
18327H593722J509388K235114L194684M151637M369332L116387J197561J07418
$$ 8593722 10103110 12338224 15532908 19684545 24053877 27170264 28367825 28475243
18319B8475243L66701K024520M876357Q209988R772392P625805L062322j161414
$$ 28475243 28841944 30866464 35742821 43952809 53725201 61351006 64413328 63251914
18311F3251914l245816l109117l595179o105734q128158q060067o876613n204781
$$ 63251914 60006098 56896981 53301802 47196068 39067910 31007843 24131230 18926449
18303A8926449l472035k052634j045239l74249k11381p07788j286751j465835
$$ 18926449 15454414 13401780 12356541 11982292 11770911 11063123 9776372 8310537
18295H310537j393381j135215p73746n26894l85770k94215k61024k13391k01500
$$ 8310537 6917156 5781941 5008195 4481301 4095531 3801316 3540292 3326901 3125401
18286C125401j49112j17730j18781p8123n5774o3415j6290N8187P7202R6992J04583
$$ 3125401 2976289 2858559 2739778 2661655 2605881 2542466 2526176 2584363 2661565 2758557 2863140
18275B863140J35570J84981K27547L35100M70534O73912J029697J542970K249734
$$ 2863140 2998710 3183691 3411238 3746338 4216872 4890784 5920481 7463451 9713185
18266I713185L243032M077044L788696J752878m79323j357632j071419J33709
$$ 9713185 12956217 17033261 20821957 22574835 22095512 20737880 19666461 19800170
18258A9800170K195630M658896P022802P070231K990436k638427n674098o033894
$$ 19800170 21995800 26654696 33677498 40747729 43738165 41099738 35425640 29391746
18250B9391746m805654k656616l36085J611286K130105K19652k548310l965015
$$ 29391746 24586092 21929476 21593391 23204677 25334782 25554434 23006124 19041109
18242A9041109m038526l427181k562258j770251j148407p74524m55254k66566
$$ 19041109 15002583 11575402 9013144 7242893 6094486 5319962 4864708 4598142
18234D598142j07166L142J57611K64470L89620P03607J158079J718141K231394
$$ 4598142 4490976 4494118 4651729 4916199 5305819 6009426 7167505 8885646 11117040
18225A1117040K113030Q78198o71504j436798j484625j111279n25898P8967P49600
$$ 11117040 13230070 14108268 13436764 11999966 10515341 9404062 8878164 8957131 9706731
18216I706731J493984K599884L986486N583047O775743P052811O508857M421697
$$ 9706731 11200715 13800599 17787085 23370132 30145875 37198686 43707543 48129240
18208D8129240k32433m950056o798958o887139o205468m997071l745517k764349
$$ 48129240 47896807 42946751 36147793 29260654 23055186 18058115 14312598 11548249
18200A1548249j902704j200141p58880l31644K4510M33988R40069J461228J603362
$$ 11548249 9645545 8445404 7686524 7354880 7379390 7813378 8753447 10214675 11818037
18191A1818037Q93282l03274r87688j185847j016249o26875j51075K20240M62075
$$ 11818037 12711319 12408045 11420357 10234510 9218261 8591386 8440311 8660551 9122626
18182I122626N68340Q90478J341773K061715L125292M796872P675753J2665665
$$ 9122626 9690966 10581444 11923217 13984932 17110224 21907096 29582849 42248514
18174D2248514K1411966L6092383N4381540N3095749J1949316l2211474m2955182
$$ 42248514 63660480 99752863 154134403 207230152 219179468 186967994 144012812
18167A44012812m0660446l1593686j9489828j0759396o302725n087632m926689
$$ 144012812 103352366 71758680 52268852 41509456 35206731 30119099 25192410
18160B5192410m393672l495606k468309j409886m45089l8976n36528j259262j721752
$$ 25192410 20798738 17303132 14834823 13424937 12979848 12940872 12404344 11145082 9423330
18151I423330j719990j348337r66406n41135l19793l77680m78914m40936l67696
$$ 9423330 7703340 6355003 5388597 4847462 4527669 4149989 3671075 3230139 2862443
18142B862443l03429k03738j78892j94243j49294j17877j43042r3544r3431j03888
$$ 2862443 2559014 2355276 2176384 1982141 1832847 1714970 1571928 1478384 1384953 1281065
18132A281065r7116p2849k2543l8826p2541p3486n7642j111j5387n2419j794n2720
$$ 1281065 1183949 1111100 1088557 1049731 977190 903704 846062 844951 829564 777145 775351 722631
18120G22631p2973J4022j8844l8960K2025J1732k2188k1824j2875j2992k4036
$$ 722631 649658 663680 644836 605876 627901 639633 617445 595621 582746 569754 545718
18109E45718m2109m1344j5919o085J397K5687N63N391j4644J8927J0072n1379
$$ 545718 503609 462265 446346 440261 441658 467345 467908 473299 458655 477582 487654 436275
18097D36275R1J0536l0228j8229p4070m5219P047L9859M0378n765m4406l2723
$$ 436275 436366 446902 416674 398445 324375 279156 286203 326062 366440 360675 316269 283546
18085B83546L5408L3937m3912K011j6863K320k5648j4040k4626J0027J5277m9856
$$ 283546 318954 352891 308979 310990 294127 296447 270799 256759 232133 242160 257437 207581
18073B07581M2979O2679J1276m0933J644N199k8640j7364J0515L5300M867j3151
$$ 207581 250560 313239 324515 283582 285226 290425 261785 244421 254936 290236 295103 281952
18061B81952l7412k4515j100l5196K504J4835L1134k1427J3537P688m4122l6449
$$ 281952 244540 220025 218925 183729 186233 201068 232202 210775 224312 232000 187878 151429
18049A51429J9834L7715M7988j0240n5588o2969m4986K3897R072Q944k1836o3685
$$ 151429 171263 208978 256966 246726 191138 128169 83183 107080 116152 125096 103260 39575
18037C9575k3484L6591Q0336M031j1907L3562L0189j2103n7390j8035l095M572
$$ 39575 16091 52682 133018 137049 125142 158704 188893 176790 119400 101365 98270 102842
18025A02842m4076j3941j2264k711N651K0660K5971R537r349K4813l042P176l2546
$$ 102842 58766 44825 32561 29850 35501 56161 82132 91669 82320 107133 104091 111267 78721
18012G8721j8290k1676J4268J2157J6923p280K5868j5542p828k3394L0482K447
$$ 78721 60431 38755 53023 65180 82103 74823 100691 85149 77321 53927 84409 86856
18000H6856M399p547j03M0608p132K937L0833l7569j8565Q792J9161j0420J5133
$$ 86856 91255 83708 83605 124213 117081 120018 150851 113282 94717 103509 122670 112250 127383
17987A27383L897K4936l5155j0027P5417O496k2147o68k6300j4439l0634l9592
$$ 127383 131280 156216 121061 111034 186451 192947 170800 170132 143832 129393 98759 59167
17975E9167l6852J434L00l5324L9132O7680K474j1537k0668K1924k4783J424M0962
$$ 59167 22315 23749 24049 -11275 27857 95537 98011 86474 65806 87730 62947 64371 105333
17962A05333K3477m7873l8494j7792J9849K1887K055P14j5334l5854K4957q065
$$ 105333 128810 80937 42443 24651 44500 66387 68442 69156 53822 17968 42925 34860
17950C4860j4274J2571j867l7944j7782L0598p954K9688N2612j7290k2822l3600
$$ 34860 20586 33157 31290 -6654 -24436 6162 -1792 27896 80508 63218 40396 6796
17938F796l336L8077R146k8027K3882k586L201J0224J1293N0070K7134n362o5820
$$ 6796 3460 41537 50683 22656 46538 43952 47153 57377 68670 118740 145874 140512 74692
17925G4692m5333K3221K233L4649o7k1871O516O293O052K0308j9974l2865K0083
$$ 74692 29359 52580 54813 89462 89395 67524 74040 80333 86385 106693 86719 53854 73937
17912G3937k8202J9413L418J9492Q115J3718M5753P990n703q379P62R139M1521
$$ 73937 45735 65148 68566 88058 96173 109891 155644 163634 157931 149552 150314 159453 200974
17899B00974Q146J9755j6903j4652Q342L640k3947M1241O629N240k3052m0619
$$ 200974 209120 228875 211972 197320 205662 209302 185355 226596 233225 238465 215413 174794
17887A74794k7499l0999m2608J5230J6968O004n873m0643n5172L2009P1763K0434
$$ 174794 147295 116296 73688 88918 105886 111890 106017 65374 10202 42211 113974 134408
17875A34408j7531J7462k3374m6457j5054M965L680k0080K9L1740K3319k0595
$$ 134408 116877 134339 110965 64508 49454 54419 58099 38019 38048 69788 93107 72512
17863G2512R948K0250K558k6444R1K0138R265P4210P0438P636L0215J4845j7114
$$ 72512 82460 102710 105268 78824 78915 99053 108318 182528 252966 260602 290817 305662 288548
17850B88548k7707J7897O5300K1187k0926j2428m9110m8681j4421J6703k5086
$$ 288548 260841 278738 344038 365225 344299 331871 282761 234080 219659 236362 211276
17839B11276j0079J9056L5395R427k6251m4175k6351l9382j9825P909l9914q905
$$ 211276 201197 220253 255648 265075 238824 194649 168298 128916 109091 117000 77086 68181
17827F8181n884n142J0925k2357J4445P595j535p937k3784J324N031q09n028O639
$$ 68181 62297 57155 68080 45723 60168 67763 66228 58291 34507 35831 40862 40053 35025 41664
17813D1664J3494O15j3642p611M7230O5344L1652j7246J9929J2199L025j968r971
$$ 41664 55158 55773 42131 34520 81750 147094 178746 161500 181429 193628 196653 194685 184714
17800A84714j807l9867l8428m1900J1690M4977N6232j5212n014N3581K0981j6741
$$ 184714 182907 143040 104612 62712 74402 119379 175611 160399 155385 208966 229947 213206
17788B13206m0355m4971j2175m2353m3398J6915J1105J2537j6145L6748K1551
$$ 213206 172851 127880 115705 73352 29954 46869 57974 70511 54366 91114 112665
17777A12665K6628k8473k0358k8901j417k2541l0327J3157K0923M455K3425j3458
$$ 112665 139293 110820 90462 61561 60144 37603 7276 20433 41356 45811 69236 55778
17765E5778j7584J4728K1953m3904n6473n132J5698k467J2312K9286L356M6843
$$ 55778 38194 52922 74875 30971 -25502 -30634 -14936 -17403 -5091 24195 27551 74394
17753G4394J6423P05k0554k6566L6453J4956K5144l2978l4937j4031p92K2885
$$ 74394 90817 91522 70968 44402 80855 95811 120955 87977 53040 39009 38217 61102
17741F1102J4901k1384m7366J3711J8348k517l0453j9945k1833R290N0351K5094
$$ 61102 76003 54619 7253 20964 39312 36795 6342 -13603 -35436 -26146 24205 49299
17729D9299M6560q765m1364L522L1717J7820n4004Q787l0921j0619l603R823K3455
$$ 49299 95859 87094 45730 49252 80969 98789 44785 53572 22651 12032 8429 18252 41707
17716D1707O0441L1140L7276n9677k5290K2839l570Q30J8964N4098L555j1159
$$ 41707 102148 133288 170564 110887 85597 108436 104866 105696 124660 178758 182313 171154
17704A71154p092k2980J6483M0699j4391j7320m6808j5182K5356J7713l7639l2084
$$ 171154 164062 141082 157565 198264 183873 166553 119745 104563 129919 147632 109993 77909
17692G7909n9263L359P050m844K8948K7221m8601r1842r635M0383q403J2959M1232
$$ 77909 18646 22005 29055 24211 53159 80380 31779 -60063 -69698 -29315 -37718 -24759 16473
17679A6473j5215L950J484l4085l0483M2767L8508N114k925j0664P934M801k0332
$$ 16473 1258 5208 6692 -27393 -57876 -15109 23399 28513 25588 14924 22858 27659 7327
17666G327k727k520R917M2728K3817L3358n435l7913q389O844k2767m933L9873
$$ 7327 4600 2080 11997 54725 78542 111900 106465 68552 60163 67007 44240 39307 79180
17653G9180M8819q393J8970l240k8389k6002k7638o0611j5900Q242J4797Q662
$$ 79180 127999 119606 138576 135336 106947 80945 53307 -7304 -23204 -14962 -165 8497
17641H497L2677K542p351k4141k0858K0797J1375k901m6527K5025j63k2864J3693
$$ 8497 41174 43716 36365 12224 -8634 12163 23538 20637 -25890 -865 -1028 -23892 -10199
17628a0199M5673j8375l8506J2113J6966L7490j6055l4073J3368L3526Q164j041
$$ -10199 35474 17099 -21407 -9294 7672 45162 29107 -4966 8402 41928 50092 49051
17616D9051l0591J3089M3378J1581J5090L9715J6506J0717J5199P3445L2572R035
$$ 49051 18460 31549 74927 86508 101598 141313 157819 168536 183735 257180 289752 298787
17604B98787O9418J34380J31364J08464J9150n4016j21053j20125o6060n8868
$$ 298787 368205 502585 633949 742413 761563 707547 586494 466369 400309 341441
17594C41441q1363q5721l6015k2323R125k3778k4816k8356Q25r021k0116l1159
$$ 341441 260078 174357 138342 116019 125144 101366 76550 48194 49019 39998 19882 -11277
17582a1277n850l108m057J8221K704L541K2436K8983k892L4962j8399k5753k0161
$$ -11277 -17127 -20235 -24292 -6071 -3367 174 22610 51593 48701 83663 65264 39511 19350
17569A9350l5583M3806k2191l2535J7953k892J7427Q55j5911k3662L7858J5997
$$ 19350 -16233 27573 5382 -27153 -9200 -12092 5335 6190 -9721 -33383 4475 20472
17557B0472K0178J978O250J2622N565n9782m218K079J3387O5353J2512n4987n4917
$$ 20472 40650 42628 48878 61500 67065 7283 3065 5144 18531 83884 96396 41409 -13508
17544a3508p860j0072j3792j791L4106N3320l805m0993n027J5604o568k1208J101
$$ -13508 -21368 -31440 -45232 -47023 -12917 40403 36598 -4395 -9422 6182 -386 -21594 -20493
17531b0493p320k0715J6711K1170M2414O705J0897j6852P065r530l1951N163j0199
$$ -20493 -27813 -48528 -31817 -10647 31767 38472 49369 32517 39582 30052 -1899 3264 -6935
17518f935n2419O361R249L2295P5655M1618j0202m3334j7667j051J442L424l8687
$$ -6935 -59354 -52993 -43744 -11449 64206 105824 95622 52288 34621 33570 35012 38436 -251
17505b51Q637Q227j2064l6596m76J7639K8978P679m1979r28k226L3946l38m2173
$$ -251 8386 16613 4549 -32047 -32523 -14884 14094 21773 -20206 -21134 -23360 10586 10248 -31925
17491c1925r293k4932L8355J5872j5520k0416l28P968P120P165l86L1040j2717
$$ -31925 -41218 -66150 -27795 -11923 -27443 -47859 -48187 -40219 -33099 -25934 -26320 4720 -7997
17478g997K486J4275J2136p036L6073j2983j7509j0485K952J1590j6318l5684
$$ -7997 -5511 8764 20900 13864 49937 36954 19445 8960 11912 23502 7184 -28500
17466b8500K3842J2786m127j6495l569J2844J2578K7789j8989k9680K3511N2233
$$ -28500 -4658 8128 4001 -12494 -16063 -3219 9359 37148 18159 -11521 11990 64223
17454F4223j2853p4160K2553R558k0J2896Q493J7109L2560R185r857j393j006
$$ 64223 51370 -22790 -237 9321 9301 22197 30690 47799 80359 89544 79687 78294 77288
17441G7288m2548m1093n1082j3410M0745J5967N742k328L4218r786n7799J9559
$$ 77288 34740 -6353 -57435 -70845 -30100 -14133 -8391 -10719 23499 13713 -44086 -24527
17429b4527J3744Q468K335J0126K3080P87J8472l8190k2684M7888K3298K8642
$$ -24527 -10783 -2315 20 10146 33226 34013 52485 14295 -8389 39499 62797 91439
17417I1439k0339l0969k2059j9889P895K9723j0603l3444L2833J165o1671M445
$$ 91439 71100 40131 18072 -1817 6078 35801 25198 -8246 24587 25752 -35919 -31474
17405c1474o922J7702J5524J3359j6581j3863J0246p045k0667j8649j1352K6083
$$ -31474 -38396 -20694 -5170 8189 -8392 -22255 -12009 -19054 -39721 -58370 -69722 -43639
17393d3639N7043K43n7574m9648K2834M9553K8239o2k1167J4095J1121q638j8380
$$ -43639 13404 13647 -43927 -93575 -70741 -21188 7051 6989 -14178 -83 11038 2400 -15980
17380a5980p532P930J1932l12o096J6692J8723l1372K2807J4661k4509k0841L4368
$$ -15980 -23512 -15582 -3650 -3962 -10058 6634 25357 -6015 16792 31453 6944 -13897 20471
17367B0471J9427m1279l9859Q764o824p78l0563M287J6985K5290J8224k622k5240
$$ 20471 39898 -1381 -41240 -32476 -39300 -40078 -70641 -66354 -49369 -24079 -5855 -8477 -33717
17354c3717r21k3190m020m3297K5583O7097M0727j5549j6152M1686J7681L572
$$ -33717 -34638 -57828 -61848 -105145 -79562 -12465 28262 12713 -3439 38247 55928 59500
17342E9500J1117j5795n5625J6394J6969l298j0730L393k6949k0929L539J5673
$$ 59500 70617 54822 -803 15591 32560 29262 18532 21925 -5024 -25953 -22414 -6741
17330f741j2239j6379J762K9663J5549m2967k0138m0972k5138J7993N0151O560
$$ -6741 -18980 -35359 -33597 -3934 11615 -31352 -51490 -92462 -117600 -99607 -49456 -42896
17318d2896l8247J832L1798M283M0675J5817J8377m721Q310o734R28o57j1323
$$ -42896 -81143 -79311 -47513 -43230 -2555 13262 31639 26918 35228 28494 29422 28765 17442
17305A7442l2472j9071J0641L8583K3620l2947J3008J7282m0394k1971j8156Q163
$$ 17442 -15030 -34101 -23460 15123 38743 5796 18804 36086 -4308 -26279 -44435 -36272
17293c6272K4612K609r053J4085k8746L6326j813l6103k416l985J8451J8079J8345
$$ -36272 -11660 -9051 -18104 -4019 -32765 3561 1748 -34355 -36771 -40756 -22305 -4226 14119
17280A4119Q98q484j0817l9121J0542K6361M624N556L0852O0677k1324r155j9424
$$ 14119 15017 6533 -4284 -43405 -32863 -6502 -1878 3678 34530 95207 73883 64728 45304
17267D5304m212J50j3167n879l3655k3897J8875k7851k2862J9391J9965L4211
$$ 45304 41092 41242 28075 22196 -11459 -35356 -16481 -44332 -67194 -47803 -27838 6373
17255F373j0067k672L848l0600J6981j5164M7041N3801J4966m2168k0042P269
$$ 6373 -3694 -6366 -2518 -33118 -16137 -31301 15740 69541 84507 42339 22297 29566
17243B9566j8167L7386k137M1175j5650q298j1252J8798N866k4294j0391K1789
$$ 29566 11399 48785 46648 87823 72173 63875 52623 71421 77287 52993 42602 64391
17231F4391j167j5720K5040J791q572k2017m658J831j8104m2287o4957N580P4272
$$ 64391 63224 47504 72544 74335 65763 43746 39088 40919 22815 -19472 -84429 -78849 -4577
17218d577o954k972j0057l3581k762M6031K3207r762l7547n9078K8002L9991l048
$$ -4577 -11531 -14503 -24560 -58141 -60903 -14872 8335 -1427 -38974 -98052 -70050 -30059 -33107
17205c3107P825J3800K6426P702l175o845k0015p938K1428l5739j1059o555K4899
$$ -33107 -25282 -11482 14944 22646 19471 12626 -7389 -15327 6101 -29638 -40697 -47252 -22353
17192b2353j2689j9301k1240K1635J5467J6567m309O298k1392L86L3612L0034
$$ -22353 -35042 -54343 -75583 -53948 -38481 -21914 -26223 -19925 -41317 -40931 -7319 22715
17180B2715k3690l3292k6546J8451L9715j3881j8363R321o76j773m4396J183k0733
$$ 22715 -975 -34267 -60813 -42362 -2647 -16528 -34891 -25570 -26246 -28019 -72415 -71232 -91965
17167i1965J9870J0709J6718K2604R082k851K1564K3240j9118k4257j738j9584
$$ -91965 -72095 -61386 -44668 -22064 -12982 -15833 5731 28971 9853 -14404 -16142 -35726
17155c5726j0179J4888L8397J7935l7411j9551R196j826n8951L9911N1231m0211
$$ -35726 -45905 -31017 7380 25315 -12096 -31647 -22451 -24277 -83228 -43317 7914 -32297
17143c2297k9307J3098m665L5562j3325l5483l06J6208K7540L896j6575o790J5370
$$ -32297 -61604 -48506 -53171 -17609 -30934 -66417 -66723 -50515 -22975 -19079 -35654 -42444 -27074
17130b7074M1219J2458n872j9836L769J9275L147l4912j5825O625J116j5927J0087
$$ -27074 14145 26603 20731 895 4664 23939 27086 -7826 -23651 -17026 -15910 -31837 -21750
17117b1750l8726l2321L6065L0904l6963J2199M1943J5308k0943J6162j7539l597
$$ -21750 -60476 -92797 -56732 -25828 -62791 -50592 -8649 6659 -14284 1878 -15661 -19258
17105a9258k8l5260j8134M7140J3014R741k3987j2503K912j8641L7263M3571r926
$$ -19258 -19286 -54546 -72680 -25540 -12526 -2785 -26772 -39275 -36363 -55004 -17741 25830 15904
17092A5904N83p018K04M7240L0054j8226l0486q8179k7623r070L5597K2370J898
$$ 15904 16487 9469 9673 56913 86967 68741 38255 -49924 -77547 -86617 -51020 -28650 -26752
17079b6752K0901n796J9260K4341k047m5677k119K6575J5918J255l1188m3072
$$ -26752 -5851 -11647 7613 31954 29907 -15770 -17889 8686 24604 25859 -5329 -48401
17067d8401J126l244m558L6766K8761K960M507j9011m1222l4577K8442K7967K9486
$$ -48401 -47275 -50519 -55077 -18311 10450 13410 17917 -1094 -42316 -76893 -48451 -20484 9002
17054I002P123J6958j1940P261M4916J69j959n91l0221o8421l7665K6718O8081
$$ 9002 16125 33083 21143 28404 73320 73489 71530 70939 40718 -27703 -65368 -38650 29431
17041B9431Q694j5539l0856J7869M2671O078m5061o799N170P592k7363J1272J853
$$ 29431 38125 22586 -8270 9599 52270 58348 13287 6488 11658 19250 -8113 3159 5012
17028E012K7295L9860k7234l3825l2012p58N666O751M579Q144p059J2283J6504
$$ 5012 32307 72167 44933 11108 -20904 -21662 -15996 -9245 -4666 3478 -3581 8702 25206
17015B5206N406j6848k323j2877M1711J6047n0190j9552L807k2204l5753J0326
$$ 25206 30612 13764 11441 -1436 40275 56322 6132 -13420 -9613 -31817 -67570 -57244
17003e7244j298l7086j1242J8556N0134o171r933j0778j4462K8052J4077J6401
$$ -57244 -58542 -95628 -106870 -88314 -38180 -44351 -54284 -65062 -79524 -51472 -37395 -20994
16991b0994m2006k9767O208q008k9146Q925K9902q520J0978M5287j9378M062K1895
$$ -20994 -63000 -92767 -86559 -94567 -123713 -114788 -84886 -93406 -82428 -37141 -56519 -52457 -30562
16978c0562J6117K8011j218O291J1827j7963l9812l3178k1521K3417K2233j7699
$$ -30562 -14445 13566 12348 18639 30466 12503 -27309 -60487 -82008 -58591 -36358 -54057
16966e4057J5998M0724J5359l7757J0639J7595J5951L371P223J3587K6466M71
$$ -54057 -38059 2665 18024 -19733 -9094 8501 24452 27823 35046 48633 75099 75570
16954G5570j8389m2792j4372k939O006N931K728K785n191j1535J4626K7649n348
$$ 75570 57181 14389 17 -2922 3084 9015 11743 14528 9337 -2198 12428 40077 34729
16941C4729k7893l1456M9570R743n4319j5626K5773j891J7706M450j4173p034
$$ 34729 6836 -24620 24950 34693 -19626 -35252 -9479 -11370 6336 10786 -3387 -10421
16929a0421M0459m977j9000n9214Q01K6687l5320o615J6459K268K4308L0350K9701
$$ -10421 30038 25061 6061 -53153 -52352 -25665 -60985 -67600 -51141 -48873 -24565 5785 35486
16916C5486j1205j0200j787M023p520k126l6785j2583L9639J3122q438o86r327
$$ 35486 24281 14081 12294 16317 8797 6671 -30114 -42697 -3058 10064 1626 940 -8387
16903h387k0489j5432j915K4116M1562M4426K5779N548l3637N80j280l547l6106
$$ -8387 -28876 -44308 -46223 -22107 19455 63881 89660 95208 61571 62151 60871 57324 21218
16890B1218n3952J699M5051k8609J1574p596j3809j3146J1012L5318o1584p9922
$$ 21218 -32734 -31035 14016 -14593 -3019 -10615 -24424 -37570 -26558 8760 -52824 -132746
16878a32746m0877N0810O5141J9629L2127L8264l5209k3073m484l1535k8535K2393
$$ -132746 -173623 -122813 -57672 -38043 -5916 32348 -2861 -25934 -30418 -61953 -90488 -68095
16866f8095L2965L2402k4650l7274K7814r20j8783K9746K0715p038N06k2841R872
$$ -68095 -35130 -2728 -27378 -64652 -36838 -37758 -56541 -26795 -6080 -13118 -12612 -35453 -25581
16853b5581n0913k9008M2818O02N502k5715r410M4743K1602n007l425J7575M528
$$ -25581 -76494 -105502 -62684 -62082 -56580 -82295 -91705 -46962 -25360 -30367 -33792 -16217 -11689
16840a1689l3560j8146K2409k0571o209q675J0831k2840j2852K8421N1179O172
$$ -11689 -45249 -63395 -40986 -61557 -67766 -76441 -65610 -88450 -101302 -72881 -21702 -15530
16828a5530J923K5150j7735l2299k6450J6873M6148M3225J5469K5594J4404n0893
$$ -15530 -13607 11543 -6192 -38491 -64941 -48068 -1920 41305 56774 82368 96772 45879
16816D5879m830J6136m2388m0517p391j7426j5191O5829K0450o680j6122p384
$$ 45879 41049 57185 14797 -25720 -33111 -50537 -65728 101 20551 13871 -2251 -9635
16804i635n57J0780o838m655j0914j5139j2663J3116O503K0877N0540j5523j4892
$$ -9635 -10192 588 -6250 -10905 -21819 -36958 -49621 -36505 -30002 -9125 41415 25892 11000
16791A1000K3553j4359K051K5336L998P072J2866j1853J1169J7181o3458k4695
$$ 11000 34553 20194 22245 47581 51579 58651 71517 59664 70833 88014 24556 -139
16779a39l2735J6148L0015m417J5650L1447J9266k7180n1070k6396Q678J3353
$$ -139 -32874 -16726 13289 8872 24522 55969 75235 48055 -3015 -29411 -20733 -7380
16767g380j4136o443k5999K8910K1801J5925n119m390j5614R640k4268k7516J7813
$$ -7380 -21516 -27959 -53958 -25048 -3247 12678 7559 3169 -12445 -2805 -27073 -54589 -36776
16754c6776R648L6029J2882k3376j483K837M0446Q102j8279J0413l8821n1562
$$ -36776 -27128 8901 21783 -1593 -3076 -239 40207 48309 30030 40443 1622 -49940
16742d9940j55J853R615J4433M2424K786l138J3580k5978n612J7350K828M6943
$$ -49940 -50095 -48242 -38627 -24194 18230 21016 17878 31458 5480 -132 17218 20046 66989
16729F6989R129j7052n2292k1942P806M149k426k1881k144M884m5178j2557L0671
$$ 66989 76118 59066 6774 -15168 -7362 -3213 -5639 -27520 -29664 -24780 -69958 -82515 -51844
16716e1844M9614j932J3879J7248Q982r679l5334L481J485p898O235l5505r184
$$ -51844 -2230 -4162 9717 26965 35947 26268 -9066 -5585 -4100 -11998 -5763 -41268 -50452
16703e0452N0630J0928k7823Q580J634k3924K6710R229j5815k305K0693j7441
$$ -50452 178 11106 -16717 -8137 -6503 -30427 -3717 5512 -10303 -12608 8085 -9356
16691i356L0726k7505k3679J7513M4443j867l1436m4322j7798M9358P5266j1222
$$ -9356 21370 -6135 -29814 -12301 32142 30275 -1161 -45483 -63281 -13923 61343 50121
16679E0121n2594j0774J1919K3873j136l191k0726k6604J2768l223k2543j6858
$$ 50121 -2473 -13247 -1328 22545 21409 18218 -2508 -29112 -16344 -19567 -42110 -58968
16667e8968j1845N6087J7735K5845J2553L221P23o774m6764l8464K4296p476K470
$$ -58968 -70813 -14726 3009 28854 41407 44628 45351 38577 -8187 -46651 -22355 -29831 -27361
16654b7361r22k9251m8326J6877L3583L8010K1837j1532j4639j7579j2238M5613
$$ -27361 -28283 -57534 -105860 -88983 -55400 -17390 4447 -7085 -21724 -39303 -51541 -5928
16642e928N8192o48m1854k8112j9703k6041J3803K6792l2571J410q304j5112M6607
$$ -5928 52264 51616 9762 -18350 -38053 -64094 -50291 -23499 -56070 -54660 -62964 -78076 -31469
16629c1469J9220k1151l1954l0898J0775N4124N2390K7982L0925J589m1356l2391
$$ -31469 -12249 -33400 -65354 -96252 -85477 -31353 21037 49019 79944 81533 40177 7786
16617G786n5390J6280L4074K041l1185M773K2614j6594j0624L0176J5472R302
$$ 7786 -47604 -31324 2750 4791 -26394 -21621 993 -15601 -26225 3951 19423 28725
16605B8725l2273k3791k6187J6542J0221K0759K8273J3900k473n691l2362O05
$$ 28725 -3548 -27339 -53526 -36984 -26763 -6004 22269 36169 33696 28005 -4357 -3752
16593c752J5376k2581J9696R472N100l0558k9991L513K3317n803l4673j2359l776
$$ -3752 11624 -10957 8739 18211 23311 -7247 -37238 -33725 -10408 -16211 -50884 -63243 -67019
16580f7019J7134K2914N782K7881m5660q64K4240L4663L640J304m4766j5880j6558
$$ -67019 -49885 -26971 -21189 6692 -38968 -39832 -15592 19071 22711 24015 -20751 -36631 -53189
16567e3189K3554k274j02P209M475O999J6041R759K1533j8181l9097O077L0088
$$ -53189 -29635 -31909 -32011 -24802 -20327 -13328 2713 12472 34005 15824 -23273 -17196 12892
16554A2892K8509L3405L8706n6391n8874k1700J5154J2615m094M052J8288M967
$$ 12892 41401 74806 113512 57121 -1753 -23453 -8299 4316 222 4274 22562 27529
16542B7529k8218l2346l370L6844j817J735p791l5219L9537M8081n609m5126K6005
$$ 27529 -689 -33035 -36405 439 -1378 357 -7434 -42653 -3116 44965 39356 -5770 20235
16529B0235K3607m1503j4809O61L194m4532m3684O6l3436L0768L9256j837K8634
$$ 20235 43842 2339 -12470 -11809 -8615 -53147 -96831 -96765 -130201 -99433 -60177 -62014 -33380
16516c3380r121J994P1995L1503j4917r466P642q1449k01K5685o309N828O568
$$ -33380 -42501 -40507 31488 62991 48074 38608 46250 -35199 -35400 -9715 -16024 -10196 -3628
16503c628K1596N662j3650Q493q660K657j4143j371J3560K053l4878J0778M5829
$$ -3628 17968 23630 9980 18473 9813 12470 -1673 -3044 10516 12569 -22309 -11531 34298
16490C4298K0735k9806J7026j5291k6818m240O765K7257K298r0843m1916K2861
$$ 34298 55033 25227 42253 26962 144 -4096 2669 29926 32224 -58619 -100535 -77674
16478g7674J9635j1921J5545j4115l8191K2976K8801J398p40J7957O2057n608
$$ -77674 -58039 -69960 -54415 -68530 -106721 -83745 -54944 -53546 -54286 -36329 25728 20120
16466B0120l6897K9066j010l0029K1301n067k2390J975N1230j3587j3159r930
$$ 20120 -16777 12289 11279 -18750 2551 -2516 -24906 -22931 28299 14712 1553 -8377
16454h377j1089L4111r402k2307L0558r036k9881j1016n900J383L4629K0229J1636
$$ -8377 -19466 14645 5243 -17064 13494 4458 -25423 -36439 -42339 -40956 -6327 13902 25538
16441B5538N074k1026k7506J7293j5308r762j5758m9730k3454N6748P7051K1894
$$ 25538 30612 9586 -17920 -627 -15935 -25697 -41455 -91185 -114639 -57891 19160 41054
16429D1054r673n5657K4470P349J5176j0821q903k66J5986n206o25J4666k9323
$$ 41054 31381 -24276 194 7543 22719 11898 2995 2729 18715 13509 12884 27550 -1773
16416a773L787J3776m468R68k8407k6809K7836L5846L0546K5607j0466n4037m0031
$$ -1773 2014 15790 11322 12290 -16117 -42926 -15090 20756 51302 76909 66443 12406 -27625
16403b7625j9987K8235L628P420K1697J3583m2219K2392J5224j0165k5746m3334
$$ -27625 -47612 -19377 -15749 -8329 13368 26951 -15268 7124 22348 12183 -13563 -56897
16391e6897n919k0282J4982J4680p83m603K5073J1835k969K711m7008k2395K1510
$$ -56897 -62816 -83098 -68116 -53436 -54219 -58822 -33749 -21914 -24883 -22172 -69180 -91575 -70065
16378g0065m7632K4437R2032j31l0010k763Q419J0367N902k3748J5275J0618K044
$$ -70065 -117697 -93260 -1228 -1359 -31369 -34132 -25713 -15346 -9444 -33192 -17917 -7299 -5255
16365e255J6172K5211q049j0623j499j4517o824k2189j3479J772L7792L1400J2704
$$ -5255 10917 36128 28079 17456 15957 1440 -5384 -27573 -41052 -39280 -1488 29912 42616
16352D2616m632K233L3936l643p1103j7241J3755m014l5254j348L0276j008K629
$$ 42616 37984 40217 74153 70510 -593 -17834 -4079 -8093 -43347 -44695 -14419 -15427 -12798
16339a2798M0284q373l2793L3618M0114l5468L352J0872L4883R785n1908k1240
$$ -12798 27486 19113 -13680 19938 60052 24584 27936 38808 73691 83476 31568 10328
16327A0328l5060p38J5642M69k845L0272q367L4388M480j5949l9570m2722J5088
$$ 10328 -24732 -25470 -9828 -9359 -12204 18068 9701 44089 48569 32620 -6950 -49672 -34584
16314c4584q181P652j4321k2194k448N766k5659j9603L6717L7155l020j8622L2715
$$ -34584 -42765 -35113 -49434 -71628 -74076 -68310 -93969 -113572 -76855 -39700 -42720 -61342 -28627
16301b8627K5028l9572K043L8801k3634J0961M7431r358k0982L381m2503j2051
$$ -28627 -3599 -43171 -41128 -2327 -25961 -15000 32431 23073 2091 5472 -37031 -49082
16289d9082j188L3175M2495J1776k9562r353J9912R768j7859l1032j9695O206
$$ -49082 -50270 -17095 25400 37176 7614 -1739 18173 27941 10082 -20950 -40645 -34439
16277c4439L162N6135L4942J2088k3234q574l4032L870L9501k5860j9521K4996
$$ -34439 -31277 24858 59800 71888 48654 40080 6048 9918 49419 23559 4038 29034
16265B9034K2622k0001k9122J2944K0403k5051r492K0459p586J9646j0923n250
$$ 29034 51656 31655 2533 15477 35880 10829 1337 21796 14210 33856 22933 17683
16253A7683q228M146J9740L9442j7916m7797k4740J7231p082k6713j2455J789
$$ 17683 9455 13601 33341 72783 54867 7070 -17670 -439 -7521 -34234 -46689 -44900
16241d4900P060L7510K1792k1310J0430L4038M7899m705L897m6152o1988l487
$$ -44900 -37840 -330 21462 152 10582 44620 92519 87814 91711 45559 -16429 -19916
16229a9916L6318M55k8016k9124k0509J7923K7332L2388l864K1045O392Q692j3132
$$ -19916 16402 16857 -11159 -40283 -60792 -42869 -15537 16851 12987 34032 40424 49116 35984
16216C5984k1231q1k2317j3367j0007j0695m2551j3239M4941M7287J624q401j482
$$ 35984 14753 14672 -7645 -21012 -31019 -41714 -84265 -97504 -52563 -5276 -3652 -12053 -13535
16203a3535k9330l6657K0736M5263M983k7978k252K4054m8645P557J4313M652
$$ -13535 -42865 -79522 -58786 -13523 -8540 -36518 -38770 -14716 -63361 -55804 -41491 -36839
16191c6839M407J2742q021K9356J7033n0119j4509M0995J1544k5640J3176M3036
$$ -36839 -32432 -19690 -27711 1645 18678 -31441 -45950 -4955 6589 -19051 -5875 37161
16179C7161L9879l7757m2181l7804j7748m6420j6672M1740O3061N6877k6110m8605
$$ 37161 77040 39283 -2898 -40702 -58450 -104870 -121542 -79802 -16741 40136 14026 -34579
16167c4579m775J7532j976J9274k3624m405M2840L1122L022j0320m4570O199l7733
$$ -34579 -39354 -21822 -23798 -4524 -28148 -32553 10287 41409 44431 34111 -10459 -4260 -41993
16154d1993k3261M3504L018j2796J1207p2595k3994N4280K7942L6530l367J8049
$$ -41993 -65254 -21750 -18732 -31528 -20321 -92916 -116910 -62630 -34688 1842 -1525 16524
16142A6524J400m2856o3990N0339L1789j1719r130L1404L2537m353k0974l8372
$$ 16524 17924 -24932 -88922 -38583 -6794 -18513 -27643 3761 36298 31945 10971 -27401
16130b7401k9412O929L7942M5781O353j9644K5248k7904j7501J5109M1009P767
$$ -27401 -56813 -49884 -11942 33839 40192 20548 45796 17892 391 15500 56509 64276
16118F4276J3045m7238j9031q359J1531m0081n55K555J281q196j2227k3491J1288
$$ 64276 77321 30083 11052 2693 14224 -25857 -26412 -23857 -22576 -30772 -42999 -66490 -55202
16105e5202K4735p041n1901J9296M5498j439K7785M1922l0839k3947j3156j152
$$ -55202 -30467 -37508 -89409 -70113 -24615 -26054 1731 43653 12814 -11133 -24289 -25441
16093b5441N993o794L2386L9841o112k5066n9145l7719j2374L6521O3219N1264
$$ -25441 -19448 -26242 6144 45985 39873 14807 -44338 -82057 -94431 -57910 5309 56573
16081E6573k174j0422l8188J2005j102K0069j8315m664j6780K474p103j5297k508
$$ 56573 54399 43977 5789 17794 16692 36761 18446 13782 -2998 -524 -7627 -22924 -25432
16068b5432r069K771j435p578J0756J686j5777j6548J4325j5920j3473R893N4195
$$ -25432 -34501 -31730 -33165 -40743 -29987 -28301 -44078 -60626 -46301 -62221 -75694 -65801 -11606
16055a1606L0112j3838J2958o960j2918j0596K5605j8692j8535Q946l048K2946
$$ -11606 18506 4668 17626 10666 -2252 -12848 12757 -5935 -24470 -15524 -18572 4374
16043D374M564M0739j2536o6940J4913J2950m23K2151m1283j3740K006M342K2401
$$ 4374 8938 49677 37141 -29799 -14886 -1936 -2359 19792 -21491 -35231 -33225 -28883 -6482
16030f482n1574J6477N2099Q699n8421K1796M9219Q198k1753j3423k801l7887
$$ -6482 -58056 -41579 10520 19219 -39202 -17406 31813 40011 18258 4835 2034 -35853
16018c5853O842J3199J0153j4370J4632M365J244N6205O164n4966m5752K5831
$$ -35853 -29011 -15812 -5659 -20029 -5397 -1032 212 56417 62581 7615 -38137 -12306
16006a2306k2553J7361J3179j6211K5576L3518j2141R584j5440m2542k5430J4515
$$ -12306 -34859 -17498 -4319 -20530 5046 38564 26423 36007 20567 -21975 -47405 -32890
15994c2890L2779j9173M8764K1095k2631q769K2884k5796p4300j271M1821K4803
$$ -32890 -111 -19284 29480 50575 27944 19175 42059 16263 -58037 -59308 -17487 7316
15982G316J9629L85L4961N3364j366n0709j8556q702Q092j862R693j953K351J3498
$$ 7316 26945 27330 62291 115655 114289 63580 45024 36322 44414 42552 52245 50292 52643 66141
15968F6141K9986J0201l9878k5872l1073l3176j7822k0781l030J428P049K7118
$$ 66141 96127 106328 66450 40578 9505 -23671 -41493 -62274 -65304 -63876 -56827 -29709
15956b9709p369K0006J082l8581j0134J4053l353O164J059O1291M9048j0403m164
$$ -29709 -37078 -17072 -15990 -54571 -64705 -50652 -54005 -47841 -46782 14509 63557 53154 48990
15943D8990j6551l0919k010P69J0834P533j2221J896o261j3789k1018J6970o967
$$ 48990 32439 1520 -490 279 11113 18646 6425 8321 2060 -11729 -32747 -15777 -22744
15930b2744m4360k6200j4685M5520L5504j6288K2732K0130q55R588O0520j4214
$$ -22744 -67104 -93304 -107989 -62469 -26965 -43253 -20521 -391 -1246 8342 68862 54648
15918E4648l1040K39j1512m7141j9704J6468J6432k8784l490J3973L1773L7897
$$ 54648 23608 23847 12335 -34806 -54510 -38042 -21610 -50394 -53884 -39911 -8138 29759
15906B9759M407m83p3842k8759L0300K9049l4487l9110J4559K1610M4261J9329
$$ 29759 34166 33683 -40159 -68918 -38618 -9569 -44056 -83166 -68607 -46997 -2736 16593
15894A6593j62k0748K0347j1041o169j6485l7339k5059K1657L7169K4232J5525
$$ 16593 16431 -4317 16030 4989 -1180 -17665 -55004 -80063 -58406 -21237 2995 18520
15882A8520k5186j7165M250L1552k3859k1458l3607J0143Q309O8484K7194m966
$$ 18520 -6666 -23831 -19581 11971 -11888 -33346 -66953 -56810 -48501 19983 47177 42211
15870D2211m946L024K0563M902l2516j3013J5670O061M0893k181l2652n6294l0461
$$ 42211 37265 40289 60852 65754 33238 20225 35895 41956 82849 80668 48016 -8278 -38739
15857c8739L5400L79j66m173j993M3336L5817q411m1976K9093J3104o607l9080
$$ -38739 -3339 -2960 -3126 -7299 -9292 34044 69861 61450 19474 48567 61671 55064 15984
15844A5984j4193j1744j342j7640R385J1549M3016j5602l7062K7147L809J5371
$$ 15984 1791 -9953 -11295 -28935 -19550 -8001 35015 19413 -17649 9498 13307 28678
15832B8678J174j0948j2026j6015k4315J6455K1561J2781k2716r149j4530K277
$$ 28678 29852 18904 6878 -9137 -33452 -16997 4564 17345 -5371 -14520 -29050 -26773
15820b6773k1521j5608K9480Q482m8119M098K2476j1472k3206q453J3748J3147
$$ -26773 -48294 -63902 -34422 -25940 -74059 -69961 -47485 -58957 -82163 -90616 -76868 -63721
15808f3721J6809n187J8236L9952J6520j8681j0074l239K0121J4792l4963j7750
$$ -63721 -46912 -52099 -33863 6089 22609 3928 -6146 -9385 10736 25528 -9435 -27185
15796b7185j4414J1725L6611R571o39k6082o004j2287k7135K1469j597P052j2097
$$ -27185 -41599 -29874 6737 16308 15669 -10413 -16417 -28704 -55839 -34370 -35967 -28915 -41012
15783d1012j6908k1346L397K8069k1421N350N285N1497M1926j6253r327R140m2156
$$ -41012 -57920 -79266 -75869 -47800 -69221 -63871 -58586 -7089 34837 18584 9257 18397 -23759
15770b3759j8327J9133k0099N466K7060j5450k5554j704K2193M4580L125k8483
$$ -23759 -42086 -22953 -43052 -37586 -10526 -25976 -51530 -53234 -31041 13539 16664 -11819
15758a1819m3160K322m696J4030M266J3136K1241l6504O275J1426k5537k112j3712
$$ -11819 -54979 -52657 -57353 -43323 -39057 -25921 -4680 -41184 -34909 -23483 -49020 -51132 -64844
15745f4844K0166J6598m1403J7730O527l3517J3768m053j0093L8088M6296J3369
$$ -64844 -44678 -28080 -69483 -51753 -45226 -78743 -64975 -69028 -79121 -41033 5263 18632
15733A8632o502J155m7306J4158K8148L534p663m1477r840K7286K2968K4490j7376
$$ 18632 12130 13285 -34021 -19863 8285 11819 4156 -37321 -47161 -19875 3093 27583 10207
15720A0207Q131L774N74j7845Q380J9090m7678k236m54M325j1396R288J4834k9210
$$ 10207 18338 22112 22686 4841 13221 32311 -15367 -17603 -18057 -13732 -25128 -15840 -1006 -30216
15706c0216k1751M413O0498j8715j4878m8447r066K8651L0062M1451L1315o3160
$$ -30216 -51967 -47554 12944 -5771 -20649 -69096 -78162 -49511 -19449 22002 53317 -9843
15694i843m3222J8873J4462K0419J6872j0798P707K8809M502M0705l8139p8790
$$ -9843 -53065 -34192 -19730 689 17561 6763 14470 43279 47781 88486 50347 -28443
15682b8443l8245K3564l269J7270M2475m1197m2215J7615K3634O218K2702K7353
$$ -28443 -66688 -43124 -46393 -29123 13352 -27845 -70060 -52445 -28811 -22593 109 27462
15670B7462l6343q126k0703k6168j0296n0120p343J4606K369n130k4665L6091
$$ 27462 -8881 -17007 -37710 -63878 -74174 -124294 -131637 -117031 -114662 -119792 -144457 -108366
15658a08366K0860K0559J2378J1110Q17J8803j656p281J6632K3279K2451j1918
$$ -108366 -87506 -66947 -54569 -43459 -42642 -23839 -25495 -32776 -16144 7135 29586 17668
15646A7668k1111k5250L270K3402k946K691J0906j4789J662j3160O2K6016k0683
$$ 17668 -3443 -28693 -25423 -2021 -4967 -2276 8630 -6159 -4497 -17657 -17595 8421 -12262
15633a2262M2595J0971m8677j5757J4828k9352k1971r863K1975J5995K852j1040
$$ -12262 30333 41304 -7373 -23130 -8302 -37654 -59625 -69488 -47513 -31518 -28666 -39706
15621c9706J3641K146j4617n717j7088J9785J1961q552J7304q823k5072l818M3850
$$ -39706 -26065 -23919 -38536 -44253 -61341 -41556 -29595 -38147 -20843 -29666 -54738 -58556 -14706
15608a4706L2673m0671j2910n715j2200M0742L5811J2930o072j8259L7653j2578
$$ -14706 17967 -22704 -35614 -41329 -53529 -12787 23024 35954 29882 11623 49276 36698
15596C6698k185K4167o730k8457R64j1913k0163J2364k1160j81K7314o140k3403
$$ 36698 34513 58680 51950 23493 24457 12544 -7619 4745 -16415 -16596 10718 4578 -18825
15583a8825J3663K3154p198k4739J9430L0911K43L3891P642m048k9640m3095m5378
$$ -18825 -5162 17992 10794 -13945 5485 36396 36639 70530 78172 74124 44484 1389 -43989
15570d3989j0461J429j449m441K5881J9343r235K0731L9051J889P558M330k4427
$$ -43989 -54450 -53021 -54470 -58911 -33030 -13687 -22922 -2191 36860 38749 46307 50637 26210
15557B6210p385j6614J3357o230j3319l614j3747j8385j5864M282M093K3937L4670
$$ 26210 18825 2211 15568 9338 -3981 -7595 -21342 -39727 -55591 -51309 -47216 -23279 11391
15544A1391J0240L1577J1315k3588j7320n3375R529K5126l2361n2225N166J1288
$$ 11391 21631 53208 64523 40935 23615 -29760 -20231 4895 -27466 -79691 -74525 -63237
15532f3237k7712K4431M7991M9633K0930m6303l2810l2308L215L6235p65k870
$$ -63237 -90949 -66518 -18527 31106 52036 5733 -27077 -59385 -56170 -19935 -20700 -23570
15520b3570k9330J4457L3825K724K5315K5935m4266k8559n850J7095L2799K1803
$$ -23570 -52900 -38443 -4618 -1894 23421 49356 5090 -23469 -29319 -12224 20575 42378
15508D2378J5510l0591j9598j3445J2147J8867p634J2753k8070k9950j0058J0207
$$ 42378 57888 27297 7699 -5746 6401 25268 17634 30387 2317 -27633 -37691 -27484
15496b7484J6325K3624Q849l0090M392L6067k6633j5672k7006K5956L2088q384
$$ -27484 -11159 12465 21314 -8776 -4384 31683 5050 -10622 -37628 -11672 20416 12032
15484A2032k9994j6207j296j8253J3818n032Q310K1669o411l5771o432K2621j012
$$ 12032 -17962 -34169 -35465 -53718 -39900 -44932 -36622 -14953 -21364 -57135 -63567 -40946 -41958
15471d1958M554K2039P684M767J4985j602l4560J7890K8130L4732l14l0755j8435
$$ -41958 -37404 -15365 -7681 -2914 12071 10469 -24091 -6201 21929 56661 56347 25592 7157
15458G157L726q88N032j3883j4551K8931L6177l2892J6698N3131K045l6436o731
$$ 7157 10883 9995 15027 1144 -13407 15524 51701 18809 35507 88638 90683 54247 47516
15445D7516m2777o0052J2835J7259k0217m147K2401O071k801L6639J5372q389
$$ 47516 4739 -55313 -42478 -25219 -45436 -49583 -27182 -21111 -23912 12727 28099 19710
15433A9710j7928j0886k5647l7169P256J9450k1670L918M1557n863K4080P746
$$ 19710 1782 -9104 -34751 -71920 -64664 -45214 -66884 -62966 -21409 -27272 -3192 4554
15421D554P184j4419j5123J1260j0932p100K1486j621p942J9501k3786q923K5213
$$ 4554 11738 -2681 -17804 -6544 -17476 -24576 -3090 -4711 -12653 6848 -16938 -25861 -648
15408f48L7303J7692J4946P098l1121j9980K0038j5026j7877j8760J4509J9697
$$ -648 36655 54347 69293 76391 45270 25290 45328 30302 12425 -6335 8174 27871
15396B7871n087L3530j4442n4376r28M9184Q636p0590j1354N2338m6966p5542
$$ 27871 22784 56314 41872 -12504 -13432 35752 44388 -26202 -37556 14782 -32184 -107726
15384a07726k3281L7677J0783K3362K7740J359J3664L7201j5072j0317R979Q117
$$ -107726 -131007 -93330 -82547 -59185 -31445 -30086 -16422 20779 5707 -4610 5369 13486
15372A3486j534k3974l1306K2538K462m4048N895K0674J1527K97P524j5816p916
$$ 13486 11952 -12022 -43328 -20790 -18328 -62376 -56481 -35807 -24280 -23983 -16459 -32275 -40191
15359d0191J230J4881l694J1553j649L929p801k6941q449K9235L9954J1636m1898
$$ -40191 -38961 -24080 -27774 -16221 -17870 -13941 -21742 -48683 -57132 -27897 12057 23693 -18205
15346a8205m1355j4357O051J9204J0916k0014m064J0928N802J0745p747j6185
$$ -18205 -59560 -73917 -67866 -48662 -37746 -57760 -61824 -50896 -45094 -34349 -42096 -58281
15334e8281k7834M8268L3392j1579K5557j8368J375M1792N357l4517n1576N6322
$$ -58281 -86115 -37847 -4455 -16034 9523 -8845 -7470 34322 39679 5162 -46414 9908
15322I908R431j8535J3787j9654P008N1883J6441n1414l5254K3056N016k2398
$$ 9908 19339 804 14591 -5063 1945 53828 70269 18855 -16399 6657 11673 -10725
15310a0725j2560M7148K5584l77P56N138l1290j9333r034N707K0141m3102l9693
$$ -10725 -23285 23863 49447 49070 49826 54964 23674 4341 -4693 1014 21155 -21947 -61640
15297f1640j3514K1261K5024K6932L2725r570j746J0412l456l2630m6689k4578
$$ -61640 -75154 -53893 -28869 -1937 30788 21218 19472 29884 26428 -6202 -52891 -77469
15285g7469J08149N4789k564p505j0477j1983J7617j9158J3585r884k9057K1016
$$ -77469 30680 85469 82905 75400 64923 52940 70557 51399 64984 55100 26043 47059
15273D7059J0657J671l7908m8016k4723K6524N1919O136J5646k8969l0676R903
$$ 47059 57716 59387 21479 -26537 -51260 -24736 27183 33319 48965 19996 -10680 -777
15261g77k6406j847K7228K3656o789l5653q224K2822J7214o224k3241o013K2176
$$ -777 -27183 -29030 -1802 21854 15065 -20588 -28812 -5990 11224 5000 -18241 -24254 -2078
15248b078j0439k1527n986K686J3043J0974J2984J0589o845r904j0541j0818J6554
$$ -2078 -12517 -34044 -40030 -37344 -24301 -13327 -343 10246 3401 -6503 -17044 -27862 -11308
15235a1308K7349O641j2902K3099p995l371R82p925J2127r399o56r751K5427j4300
$$ -11308 16041 22682 9780 32879 24884 21513 22495 14570 26697 17298 16642 6891 32318 18018
15221A8018l9946N114K203j5955l6799K3602N3291K8330J6972O759Q849J258j8033
$$ 18018 -21928 -16814 -14611 -30566 -67365 -43763 9528 37858 54830 61589 70438 71696 53663
15208E3663N550j7399n723m6083J4914K5438R436J5476J0706n4910m3269K234
$$ 53663 59213 41814 36091 -9992 4922 30360 39796 55272 65978 11068 -32201 -29967
15196b9967k909R842j124J248j1611j7607K3008J8908k7471k2760J6426J6860
$$ -29967 -32876 -23034 -24158 -22910 -34521 -52128 -29120 -10212 -37683 -60443 -44017 -27157
15184b7157R136l4431Q785l23J8674K1615j3829k7793k3977J4924J0027J5147
$$ -27157 -18021 -52452 -43667 -43990 -25316 -3701 -17530 -45323 -69300 -54376 -44349 -29202
15172b9202L4109K7896J7444J4200j2008j7494n7617l028K8391J4892q015j5751
$$ -29202 4907 32803 50247 64447 52439 34945 -22672 -25700 2691 17583 9568 -6183
15160f183P822P9l7065l0820J6135p675k0675K5223M9563p806k3678J8314p64
$$ -6183 1639 1718 -35347 -66167 -50032 -57707 -78382 -53159 -3596 -11402 -35080 -16766 -17530
15147a7530k0991Q539K5371P099k2156l8818R432M8782L1819J1231M0547j0569
$$ -17530 -38521 -29982 -4611 2488 -19668 -58486 -49054 -272 31547 42778 83325 72756
15135G2756n5381j0890q187K0093r73j6600j3589q291K4183R631M518l2631k5823
$$ 72756 17375 6485 -1702 18391 17418 818 -12771 -21062 3121 12752 17270 -15361 -41184
15122d1184Q382J5860K86j125j4476K60K7145J1872J2370j5574R834J7313k0687
$$ -41184 -32802 -16942 -16656 -17781 -32257 -31997 -4852 7020 19390 3816 13650 30963 10276
15109A0276k8580J5207R624L1175J6467j1975O597R627j4129m27r407j5911l5042
$$ 10276 -18304 -3097 6527 37702 54169 42194 48791 58418 44289 43862 34455 18544 -16498
15096a6498j3635M666K5334k0372n8716m007l784O890J285L3013J2937J8510q614
$$ -16498 -30133 -25467 -133 -20505 -79221 -83228 -87012 -80122 -78837 -45824 -32887 -14377 -22991
15083b2991k6493p007O3092J4227l391l3078j1229K0630M1080l1020P304L2435
$$ -22991 -49484 -56491 6601 20828 17437 -15641 -26870 -6240 34840 3820 11124 43559
15071D3559k9288P173L5710o6705n6704L1467P1236J8308j0497l5748m0248K8055
$$ 43559 14271 21444 57154 -9551 -66255 -34788 36448 54756 44259 8511 -31737 -3682
15059c682L888p388J0866m8775O025Q007m7120K2526J2811J8024L3647k3290P75
$$ -3682 206 -7182 3684 -45091 -39066 -31059 -78179 -55653 -42842 -24818 8829 -14461 -13686
15046a3686N9557K1339p431m5631m7143J5670j624L0065L8270m3979j4729J0390
$$ -13686 45871 67210 59779 14148 -32995 -17325 -18949 11116 49386 5407 -9322 1068
15034A068j0860L0229O477N715K165j6087k0412m2802K0269N1375J8187j4840
$$ 1068 -9792 20437 26914 32629 34794 18707 -1705 -44507 -24238 27137 45324 30484
15022C0484Q871k5283l1585j049r734L2026j7512l937q199j9712N934n038r170
$$ 30484 39355 14072 -17513 -18562 -28296 3730 -13782 -17719 -25918 -45630 -39696 -44734 -53904
15009e3904k0415M6L1941m58l7763L5392O6277k3070J1790l8219n1595L6428L3432
$$ -53904 -74319 -74273 -42332 -42790 -80553 -45161 21116 -1954 9836 -28383 -79978 -43550 -10118
14996a0118k2067J2426L4624l111l4842l3189N277L7913K9041p546j7648k5824
$$ -10118 -32185 -19759 14865 11754 -23088 -56277 -51000 -13087 15954 8408 -9240 -35064
14984c5064R542N285K572j6479K4685M475j0077J7904q721J9931j983J3448j0350
$$ -35064 -25522 -20237 -17665 -34144 -9459 -4984 -15061 2843 -5878 14053 12070 25518 15168
14971A5168j1977n3605O196J2288m755j6593K1225l3983L430J2761K8575J9252
$$ 15168 3191 -50414 -44218 -31930 -36685 -53278 -32053 -66036 -62606 -49845 -21270 -2018
14959b018m1976N5791M5825k1272p1647k3092N6410N0451L548l6653j5894M0968
$$ -2018 -43994 11797 57622 36350 -35297 -58389 -1979 48472 52020 15367 -527 40441
14947D0441j5289k614O137k7346O848L5331k8055m5819j306J021l6116J3877L7332
$$ 40441 25152 22538 28675 1329 8177 43508 15453 -30366 -31672 -30651 -66767 -52890 -15558
14934a5558j7308j2523M1751K011P647j6846n023K3588k0774P005L5052o141j3412
$$ -15558 -32866 -45389 -3638 -1627 6020 -10826 -15849 7739 -13035 -6030 29022 22881 9469
14921I469R298j572k6945j2505m1019r072L1182K1889J0661j1944j1478K1357
$$ 9469 18767 17195 -9750 -22255 -63274 -72346 -41164 -19275 -8614 -20558 -32036 -10679
14909a0679R645k276j6181m4585N15L0227J3852P101M4098J5946l2243l2841o163
$$ -10679 -1034 -3310 -19491 -64076 -63561 -33334 -19482 -12381 31717 47663 15420 -17421 -23584
14896b3584Q010r75L4060k794k6484N112j5002J7936K6541j345n2720n0813j0719
$$ -23584 -15574 -16549 17511 14717 -11767 -6655 -21657 -3721 22820 21475 -31245 -82058 -92777
14883i2777O1858L3309q719K0024J8035M739J0392L97l0333k0119m6726k1233
$$ -92777 -30919 2390 -6329 13695 31730 36469 46861 47258 16925 -3194 -49920 -71153
14871g1153K2849j515l7042L8761J7726n918K326O029p331m502N644j8443M1856
$$ -71153 -48304 -49819 -86861 -48100 -30374 -36292 -33966 -27937 -35268 -39770 -34126 -52569 -10713
14858a0713L1033N8266j1616o2363m6666N181j3025k0017K6182M7572L0952L222
$$ -10713 20320 78586 66970 4607 -42059 -36878 -49903 -69920 -43738 3834 34786 38008
14846C8008m0508j6146P10m066J938k7892j0650L835K9621L8574m3952R657j4904
$$ 38008 -2500 -18646 -17936 -22002 -20064 -47956 -58606 -54771 -25150 13424 -30528 -20871 -35775
14833c5775k7847J9471j5762k9301Q575K3800j6497P4085K3980m5l7359j8130
$$ -35775 -63622 -44151 -59913 -89214 -80639 -56839 -73336 749 24729 24684 -12675 -30805
14821c0805K4644j778n7886K368L8565M639j061r048J6483l181K7975J8819J1210
$$ -30805 -6161 -7939 -65825 -63457 -24892 -20253 -21314 -30362 -13879 -17060 10915 29734 40944
14808D0944J427k9784m534K3873J8829j533l8499j5950J0988L88n09j4424J786
$$ 40944 42371 12587 8053 31926 50755 49222 10723 -5227 5761 6149 5640 -8784 -6998
14795f998P136K6972l4326k9672M4346m516o1295j1595L3645m157R430l623J6930
$$ -6998 138 27110 -7216 -36888 7458 2942 -58353 -69948 -36303 -40460 -31030 -34653 -17723
14782a7723Q939J3731J5920K112L2155p526l2450k1741k0862L782k2882O444n054
$$ -17723 -8784 4947 20867 22979 55134 47608 15158 -6583 -27445 -23663 -46545 -40101 -45155
14769d5155k1295J8891L7688k4434j6018N618L3264K7472k635J1028k6L5456P692
$$ -45155 -66450 -47559 -9871 -34305 -50323 -44705 -11441 16031 13396 24424 24398 59854 67546
14756F7546n08j0762l3l27k0459K1991K3466n6156q427K9025J6799m2111o2272
$$ 67546 67038 56276 56243 55916 35457 57448 80914 24758 16331 45356 62155 20044 -42228
14743d2228J1279j9041m1655K6966N3755P379l2056R870j2024k5534M2982J5365
$$ -42228 -30949 -49990 -91645 -64679 -10924 -3545 -35601 -25731 -37755 -63289 -20307 -4942
14731d942n352l5298J4378J756J4304J2177j656l6331r709K1411l8578Q560O2935
$$ -4942 -10294 -45592 -31214 -29458 -15154 -2977 -4633 -40964 -50673 -29262 -67840 -59280 3655
14718C655L0052J0290K96n521K0075j0727n8740j7448j1135L3287K4702m8033
$$ 3655 33707 43997 44293 38772 58847 48120 -10620 -28068 -39203 -5916 18786 -29247
14706b9247R805P129J2495P4268K4107j4244m0200m2322J2592O773j5637k1558
$$ -29247 -19442 -12313 182 74450 98557 84313 44113 1791 14383 21156 5519 -16039
14694a6039j4417J9152J9777P20l328K8081O164j4822k9137J7062k3633j4655
$$ -16039 -30456 -11304 8473 9193 5865 33946 40110 25288 -3849 13213 -10420 -25075
14682b5075J8570Q582k6895J5805J7994p714M012j745L6267L6731J6978M369j9599
$$ -25075 -6505 2077 -24818 -9013 8981 1267 5279 3534 39801 76532 93510 97879 78280
14669G8280k2507J070j5358k6037k9946R634M867j4939j3164M389J5990K5113
$$ 78280 55773 56843 41485 15448 -14498 -4864 3 -14936 -28100 -23711 -7721 17392
14657A7392K9126K327O893k0091j6012l9159l8750n582n248M792J7943j4107m1538
$$ 17392 46518 48845 55738 35647 19635 -19524 -58274 -63856 -69104 -64312 -46369 -60476 -102014
14644a02014L223L1845j3451L8739J0808L175K0443l866J9937j8224K9817K9882
$$ -102014 -98791 -66946 -80397 -41658 -30850 -27675 -7232 -11098 8839 -9385 20432 50314
14632E0314k0332n2620j1147M7052r418j8132J4787q524l3586j541J1129L0437
$$ 50314 29982 -22638 -33785 13267 3849 -14283 504 -8020 -41606 -43147 -32018 -1581
14620a581j031m435q081M340L5060r666n1484L7641j0220m3785j0554M2660K6977
$$ -1581 -2612 -7047 -15128 -10788 24272 14606 -36878 763 -9457 -53242 -63796 -21136 5841
14607E841l4041j8317J5264Q106K9588J3143j1475m4701n7441L6547K0767K3148
$$ 5841 -28200 -46517 -31253 -23147 6441 19584 8109 -36592 -94033 -57486 -36719 -13571
14595a3571M2359k1656j6792j4736k3397q896Q86M8472K2922j0282j0886k6422
$$ -13571 28788 7132 -9660 -24396 -47793 -56689 -55803 -7331 15591 5309 -5577 -31999
14583c1999j6612J1410j7420m1684J8343N1827k3587N356k8111m08N7678K4628
$$ -31999 -48611 -37201 -54621 -96305 -77962 -26135 -49722 -44366 -72477 -72885 -15207 9421
14571I421k3290k7718J5173J2210l6345o790M5034N1074k2528l5822l0606J1372
$$ 9421 -13869 -41587 -26414 -14204 -50549 -57339 -12305 38769 16241 -19581 -50187 -38815
14559c8815j1733P329k3559k595L1023J9535l1344k2099N0891P01k7080J3695
$$ -38815 -50548 -43219 -66778 -69373 -38350 -18815 -50159 -72258 -21367 -20666 -47746 -34051
14547c4051K4392J2177j0978J4610m605l4827j6228k5674l5485N676K4593j645
$$ -34051 -9659 2518 -8460 6150 1545 -33282 -49510 -75184 -110669 -104993 -80400 -82045
14535h2045j3731L2587j2176L4157M8525N237m353j7112K89M7285J1830L423p405
$$ -82045 -95776 -63189 -75365 -41208 7317 12554 8201 -8911 -8622 38663 50493 53916 46511
14522D6511k6838p364J0846J727k3314J3534Q356J2522J0073j7499n0795j0149
$$ 46511 19673 12309 23155 24882 1568 15102 23458 35980 46053 28554 -22241 -32390
14510c2390Q965J3511Q550j9779j2931K2186K3903k2499l7418K5172L9039J773
$$ -32390 -23425 -9914 -1364 -21143 -34074 -11888 12015 -10484 -47902 -22730 16309 18082
14498A8082J9967k9426J5849k0014j4164M02l4516j9680R185j3665K0103L1108
$$ 18082 38049 8623 24472 4458 -9706 -9304 -43820 -63500 -54315 -67980 -47877 -16769
14486a6769K114K6817Q92Q542l316N618J9801J5251q319q765K7414m942l288k4928
$$ -16769 -14655 12162 13054 21596 18280 23898 43699 58950 50631 41866 69280 64338 61050 36122
14472C6122p7556k619N841L2232J3448m0236J4793O9804J6664k3592O029j5135
$$ 36122 -41434 -44053 -38212 -5980 7468 -32768 -17975 51829 68493 44901 50930 35795
14460C5795k0347j097J2629M746k4517k26M5596o245l7985j3920k9245l834K2103
$$ 35795 15448 14351 26980 31726 7209 6983 52579 46334 8349 -5571 -34816 -38650 -16547
14447a6547M7721J3026k5051l9559k9674L8343O8268k5189k8536L534j3875n4620
$$ -16547 31174 44200 19149 -20410 -50084 -11741 56527 31338 2802 6336 -7539 -62159
14435f2159P566n89Q182J9393j3749k6147K4360L6031k195R78K1302K925K8349
$$ -62159 -54593 -55182 -47000 -27607 -41356 -67503 -43143 -7112 -9307 -8329 12973 15898 44247
14422D4247K4084n8228k7559J8984Q910J8818j5959o6221M467N5074o205k7206
$$ 44247 68331 10103 -17456 1528 10438 29256 13297 -52924 -48457 6617 412 -26794
14410b6794L753K2254M171l0018k3914m4377L8328O0816J7956j8159j3853L8616
$$ -26794 -23041 -787 3384 -26634 -50548 -94925 -56597 4219 22175 4016 -9837 28779
14398B8779k1504j6261K2851K1252j4557r119L2437l9949k502l449l6109L6854
$$ 28779 7275 -8986 13865 35117 20560 11441 43878 3929 1427 -2022 -38131 -1277
14386a277P462j0038m8059k9714l0501L8968N0836J2304k687J9307J0322j2438
$$ -1277 6185 -3853 -51912 -81626 -112127 -73159 -22323 -10019 -12706 6601 16923 4485
14374D485j3683n765N913n145r959j2881L9961L3480M008l2870j4889M1172m1718
$$ 4485 -9198 -14963 -9050 -14195 -24154 -37035 2926 36406 40414 7544 -7345 33827 -7891
14361g891m3882j4029P967j9217Q184j9661j5320O6198P8354K4028R283K5714
$$ -7891 -51773 -65802 -57835 -77052 -68868 -88529 -103849 -37651 40703 64731 74014 99728
14349I9728n2509q1555k4064Q0654L9548n1326k0026K6627K1380j4704J727l549
$$ 99728 47219 -34336 -58400 22254 61802 10476 -9550 17077 38457 23753 25480 21931
14337B1931j0076K482O896k1552l6445o777M9479J5829j6485K0914j7738n1089
$$ 21931 11855 14337 21233 -319 -36764 -43541 5938 21767 5282 26196 8458 -42631
14325d2631l5077l2688j150K7724Q799L2324j4015J3403J9071Q545P451J3997
$$ -42631 -77708 -110396 -111546 -83822 -75023 -42699 -56714 -43311 -24240 -15695 -8244 5753
14313E753q766Q827L0953J5174J3581k664l2055k6725m3619L8129j2704q40o012
$$ 5753 -3013 5814 36767 51941 65522 62858 30803 4078 -39541 -1412 -14116 -14956 -20968
14300b0968l1112L453M6426J7157m280K2577j1911k6360l6817k6704P343L6024
$$ -20968 -52080 -48627 -2201 14956 10676 33253 21342 -5018 -41835 -68539 -61196 -25172
14288b5172N7538J0895m8620K45l2465j5075K5011K1795p473L6420J391L514n152
$$ -25172 32366 43261 -5359 -5114 -37579 -52654 -27643 -5848 -13321 23099 24490 28004 22852
14275B2852m6000j0376J3898J6012N223j9536k360n791p507J8433L3423J6918
$$ 22852 -23148 -33524 -19626 -3614 1609 -17927 -20287 -26078 -33585 -15152 18271 35189
14263C5189p384J2998J706k1048m4568m272k5054L4602L4528M492J2681J6333
$$ 35189 27805 40803 42509 21461 -23107 -27379 -52433 -17831 16697 21189 33870 50203
14251E0203K5490p0911l7714M8572O113l9664L2927J4361j7796k1254j9644J3521
$$ 50203 75693 4782 -32932 15640 21753 -17911 15016 29377 11581 -9673 -29317 -15796
14239a5796k0695j089J4537O017j3484N295r905k3459j7722r236Q684J7095J5622
$$ -15796 -36491 -37580 -23043 -17026 -30510 -25215 -35120 -58579 -76301 -85537 -76853 -59758 -44136
14226d4136J2469L754l654J0592m690K5761R466N722k5871k9272J3061N6453J9571
$$ -44136 -31667 -27913 -31567 -20975 -25665 96 9562 15284 -10587 -39859 -26798 29655 49226
14213D9226j5359l1930l0455k3469j369m635M0918P6369M704o4029Q072J0331
$$ 49226 33867 1937 -28518 -51987 -53356 -57991 -17073 59296 64000 -29 8043 18374
14201A8374k004K2869l6762j2729m780J5064L888J2970Q184j3063J7602R046j4609
$$ 18374 16370 39239 2477 -10252 -15032 32 3920 16890 25074 12011 29613 38659 24050
14188B4050j3359m7507j2262J494o762J018K3246k5657k1837O4849N5898r528
$$ 24050 10691 -36816 -49078 -47584 -54346 -53328 -30082 -55739 -77576 -12727 43171 33643
14176C3643K912q206N325m8568j3416L0608k1785l729Q664J3639O558k2893k1482
$$ 33643 36555 28349 33674 -14894 -28310 2298 -19487 -23216 -14552 -913 5645 -17248 -38730
14163c8730k2592L1471L3250J2019k5430q163J40J0250K2856K5760k0087q331
$$ -38730 -61322 -29851 3399 15418 -10012 -18175 -18035 -7785 15071 40831 20744 12413
14151A2413n684k3947k6100J4667N971K6161J902q025L449K3277j8205J112J0669
$$ 12413 6729 -17218 -43318 -28651 -22680 3481 5383 -2642 807 24084 5879 6991 17660
14138A7660l6547J315k5719J2982r430k2294J2721K9525j4211J7392j1318r30
$$ 17660 -18887 -17572 -43291 -30309 -39739 -62033 -49312 -19787 -33998 -16606 -27924 -28854
14126b8854J9983R842o123K3554m5444j045L5533P889m062L624l1432j3989o990
$$ -28854 -8871 971 -5152 18402 -27042 -28087 7446 15335 11273 14897 -16535 -30524 -37514
14113c7514L792P628l789J7399Q96j2938K121J6539J5875l4369l8724K3545O049
$$ -37514 -33722 -26094 -29883 -12484 -11588 -24526 -22405 -5866 10009 -24360 -63084 -39539 -33490
14100c3490J90J6599Q82K4837R346l6009k7216J2392J4799n665J4669o885K4919
$$ -33490 -33300 -16701 -15819 9018 18364 -17645 -44861 -32469 -17670 -23335 -8666 -15551 9368
14087I368K5196j9788k761L3678O191J1703k1235n01k1379q504L967L8050j6655
$$ 9368 34564 14776 12015 45693 51884 63587 42352 41851 20472 11968 15935 53985 37330
14074C7330k0072l2630j3691K500J6749L7895N292l5046q0865k9726N6921O3455
$$ 37330 17258 -15372 -29063 -26563 -9814 28081 33373 -1673 -82538 -112264 -55343 8112
14062H112o871K4661K6548O285o3546J7002j5797m673J2295M1237J3312J5794
$$ 8112 1241 25902 52450 58735 -4811 12191 -3606 -8279 4016 45253 58565 74359
14050G4359Q680k2735k0760M157n281k4845Q082K512j0664J2791O363o895j3070
$$ 74359 83039 60304 39544 43701 38420 13575 21657 24169 13505 26296 32659 25764 12694
14037A2694J4709J325J2411j6598J9302K0125J8802N70k1052m1302k5268k0306
$$ 12694 27403 28728 41139 24541 43843 63968 82770 83340 62288 20986 -4282 -24588
14025b4588l0288K9778j8738N639J9049q487k8537k3080N4847N0975R038k6685
$$ -24588 -54876 -25098 -43836 -38197 -19148 -27635 -56172 -79252 -24405 26570 35608 8923
14013H923k4666j7436J399J8405k185k2731p065M059j756O465o467J6817O19K2695
$$ 8923 -15743 -33179 -31780 -13375 -15560 -38291 -45356 -41297 -43053 -36588 -43055 -26238 -25619 -2924
13999b924L8148L691J0296m3770K666l89j5303O193L762k5424J782n385j1440
$$ -2924 35224 38915 49211 5441 8107 7718 -7585 -1392 2370 -23054 -21272 -26657 -38097
13986c8097j8127K5887L3425K2328k152P064J166P260j6527l5097j2692K1055
$$ -38097 -56224 -30337 3088 25416 23264 30328 31494 38754 22227 -12870 -25562 -4507
13974d507k0539k1758L857j2839M1008o013K5299M8672L88k9968J833K8122J6053
$$ -4507 -25046 -46804 -42947 -55786 -14778 -20791 4508 53180 53568 23600 25433 53555 69608
13961F9608j5865k2174m6589j1430N777J9336j1821K0950M7425K867j7086k1759
$$ 69608 53743 31569 -15020 -26450 -20673 -1337 -13158 7792 55217 58084 40998 19239
13949A9239m4222j514j4975J404M1633K4881k3302k7382J6588J1828K8401q4570
$$ 19239 -24983 -26497 -41472 -40068 1565 26446 3144 -24238 -7650 4178 32579 -51991
13937e1991r545M3654J6181j6757J76O698J9276n094K239L6958j2132l2696k6665
$$ -51991 -61536 -17882 -1701 -18458 -18282 -11584 7692 2598 4837 41795 29663 -3033 -29698
13924b9698K2441M4462R471k543N404l8304N845r521K015m1610j9161J8080K894
$$ -29698 -7257 37205 46676 44133 49537 11233 17078 7557 9572 -32038 -51199 -33119 -30225
13911c0225l7012M6243P5331J513j3539l0296J2374j8861P65J0202r162J849O7256
$$ -30225 -67237 -20994 54337 55850 42311 12015 24389 5528 6293 16495 7333 9182 76438
13898G6438L7301n3393m5330r586p97k776R252j643k2257k066M0458J7946K4418
$$ 76438 113739 60346 15016 5430 4633 1857 11109 9466 -12791 -14857 25601 43547 67965
13885F7965k0135n249K9449m9784m7985J4887l2947k538N1282K2665K2753M633
$$ 67965 47830 42581 72030 22246 -25739 -10852 -43799 -46337 4945 27610 50363 54996
13873E4996j7364o8972J31P4419m89J0021j047l8189r131n706J3339k9424k2167
$$ 54996 37632 -31340 -31209 43210 42721 52742 51695 13506 4375 -1331 12008 -17416 -39583
13860c9583k28j2790M327K7110M0107l297k006k6982k7276J3255j0947L7365K4253
$$ -39583 -39811 -52601 -48274 -21164 18943 15646 13640 -13342 -40618 -27363 -38310 -945 23308
13847B3308l00m8107K6285P677r165L3960J5930J354m2600m7247k7762J4856L8175
$$ 23308 23008 -25099 1186 8863 -302 33658 49588 50942 8342 -38905 -66667 -51811 -13636
13834a3636M1978M3850r675n7090J7084K0410J1743j7672K29k6191m1371j9898
$$ -13636 28342 72192 62517 5427 22511 42921 54664 36992 37221 11030 -30341 -50239
13822e0239J5433M39q024K2275L0028N205m3020l2096K0485K4480L6833J2549
$$ -50239 -34806 -34367 -42391 -20116 9912 15117 -27903 -59999 -39514 -15034 21799 34348
13810C4348J5709m4461n5822k641K8729L4011Q57Q787K0174l649J397N358L812
$$ 34348 50057 5596 -50226 -52867 -24138 9873 10730 19517 39691 36042 37439 42797 46609
13797D6609m5816P9K1159N438J6652K4485O730R077j3037k2221m0954j2226k2146
$$ 46609 793 872 22031 27469 44121 68606 75336 84413 71376 49155 8201 -4025 -26171
13784b6171L613L2628L2519m0977j6045q553L2063m339J3187k085j4843o162L5172
$$ -26171 -22558 10070 42589 1612 -14433 -22986 9077 4738 17925 15840 997 -5165 30007
13771C0007J2709J6418p528P693l058j2426j5530k1847j160J5714J8483j1892
$$ 30007 42716 59134 51606 59299 56241 43815 28285 6438 5278 20992 39475 27583
13759B7583pQ83K5460J6593r83k8209J6430k0587k0524J6527R825n825o848J3727
$$ 27583 27576 28459 53919 70512 69529 41320 57750 37163 16639 33166 42991 37166 30318 44045
13745D4045k9423o6289J9771P4831K9073k6580q367J5574p1777o9760L5682L0985
$$ 44045 14622 -51667 -31896 42935 72008 45428 37061 52635 -19142 -88902 -53220 -22235
13733b2235J7361K8349K9888L558j6493o9719k2339N6834K1744R99J9003p320
$$ -22235 -4874 23475 53363 56921 40428 -29291 -51630 5204 26948 27947 46950 39630
13721C9630k8059j399N079K2565M732n9805L439q877K2660M4036J9845q352k9197
$$ 39630 11571 10172 15251 37816 42548 -17257 -13818 -22695 -35 44001 63846 55494 26297
13708B6297q259J7109m6250j3979M8855m542l3001R640j1431J7564K5816M025
$$ 26297 18038 35147 -11103 -25082 23773 19231 -13770 -4130 -15561 2003 27819 31844
13696C1844J1652m1m0104j1375K8869n846q151l318J6436n907K5233J9807R426
$$ 31844 43496 43455 3351 -8024 20845 14999 6848 3530 19966 14059 39292 59099 68525
13683F8525K355n3194n1862J64m359K5559j146j9524r382k272J6925L0972O8786
$$ 68525 70880 17686 -34176 -34012 -38371 -12812 -13958 -33482 -42864 -45136 -28211 2761 71547
13670G1547R337k2985m272J5572N0647K6328m8994m3224k5241m5745K7853j021
$$ 71547 80884 57899 53627 69199 119846 146174 97180 53956 28715 -17030 10823 9802
13658I802L4304l4847j5351L7907M6950k0688q723j0457k0767N664J8007J6084
$$ 9802 44106 9259 -6092 31815 78765 58077 49354 38897 18130 23794 41801 57885
13646E7885J9491j8444k6852K3307k8374n2339J984P8869O16l009J6422K5801
$$ 57885 77376 58932 32080 55387 27013 -25326 -23342 55527 56143 53134 69556 95357
13634I5357k206n1570j5947L299J2094j0154k2522J411Q664j120q784K6104L0974
$$ 95357 93151 41581 25634 28933 41027 30873 8351 9762 18426 17306 8522 34626 65600
13621F5600M5066M1078J8861l919M1973M3175Q978k710K7887O3860N0458P8765
$$ 65600 110666 151744 170605 166686 208659 251834 260812 258102 285989 349849 400307 479072
13609D79072P9204J14220K09643L42259M37026N14545M34368K8196l29463m34387
$$ 479072 558276 672496 882139 1224398 1661424 2175969 2610337 2638533 2309070 1874683
13599A874683m27137l81598k87760j66047j05284o9508r6621r2441l8899K971
$$ 1874683 1447546 1065948 778188 612141 506857 437349 340728 248287 209388 212359
13589B12359j6384Q502j6259m0229q007K284k1594j1423K7474j610p173n2965
$$ 212359 195975 204477 188218 147989 139982 142266 120672 109249 136723 135113 127940 74975
13577G4975j5734l1m9954J8982p106L8154K7705l8232n420n725j856J7403j2921
$$ 74975 59241 59210 9256 28238 21132 59286 86991 48759 43339 37614 35758 53161 40240
13564D0240l026J0853j7785j1081L0581J2717r109J7179l2987m5921r460Q986
$$ 40240 37214 48067 30282 19201 49782 62499 53390 70569 37582 -8339 -17799 -8813
13552h813M8059L0551j8705j1138j2180k6920j5823j9018M9159Q319J8696L4789
$$ -8813 39246 69797 51092 39954 27774 854 -14969 -33987 15172 23491 42187 76976
13540G6976J9034L8337Q95o4606j5282J2353R842l0815J3978K3739Q980l4194
$$ 76976 96010 134347 135242 70636 55354 67707 77549 46734 60712 84451 93431 59237
13528E9237R033K4926k217j4432J2167n1330K6918J8726J422O792j3371p289m022
$$ 59237 68270 93196 90979 76547 88714 37384 64302 83028 84450 91242 77871 70582 66560
13515F6560n533l9920j3774j5353k0842q811J7290L0702O7860j572p871L52l5876
$$ 66560 61027 21107 7333 -8020 -28862 -37673 -20383 10319 78179 76607 68736 69088 33212
13502C3212n6122L3614L0648P57L3958k798O879K7297m89n0059k7539Q045k8963
$$ 33212 -22910 10704 41352 42109 76067 73269 80148 107445 106956 56897 29358 37403 8440
13489H440L27J267n456L3642M2867k9907q578J3295n055j2231k3265m315K4762
$$ 8440 8767 10034 4578 38220 81087 51180 42602 55897 50842 38611 15346 11031 35793
13476C5793J4684n2326j9166J8769n068P342P388N1870M2086L9424L1879M1079
$$ 35793 50477 -1849 -21015 -2246 -7314 28 7416 59286 101372 140796 172675 213754
13464B13754K8454m1226l5143n1743k4915l6932L3266N3293J7732l4688k1303
$$ 213754 242208 200982 165839 114096 89181 52249 85515 138808 156540 121852 100549
13453A00549P168K7093J6790o3624n829K8596P485J2620L998l1133m9781J050
$$ 100549 107717 134810 151600 87976 82147 110743 118228 130848 134846 103713 53932 54982
13441E4982j9910J7948J6603L3334K7545J1194O058j0382n0275m4188J8473L985
$$ 54982 35072 53020 69623 102957 130502 141696 147754 137372 87097 42909 61382 65367
13429F5367j7415k6092j3240n73m681J6920M0271P9533J5830O899J1472k255M605
$$ 65367 47952 21860 8620 8047 3366 20286 60557 140090 155920 162819 174291 172036 176641
13416A76641L9535M4458P547l2272k6157N632L7720l6675m2042j1018k741k0360
$$ 176641 216176 260634 268181 235909 209752 215384 253104 216429 174387 163369 160628 140268
13404A40268l0622R34J927j11l241m531k0587j7713J4966k2358j6619P184l6420
$$ 140268 109646 110580 112507 112396 109155 104624 84037 66324 81290 58932 42313 49497 13077
13391A3077J448J1956M4599K2374p812j7369J5513M6242K6940J4290j785j9418
$$ 13077 14525 26481 71080 93454 85642 68273 83786 130028 156968 171258 169473 150055
13379A50055k0324o4719j4472L692l1146K9241m235k6368l9338K3950M6462O032
$$ 150055 129731 65012 50540 54232 23086 52327 48092 21724 -17614 6336 52798 58830
13367E8830m4950O323j354j6115J3851K0976M7931J1781K2310M2661J0677l6680
$$ 58830 13880 20203 18849 2734 16585 37561 85492 97273 119583 162244 172921 136241
13355A36241m6061K3545J9105l0926m2917m4051k843M6388K7443l71k2508K4208
$$ 136241 90180 113725 132830 101904 58987 14936 12093 58481 85924 85553 63045 87253
13343H7253j6534K431K0093r7k3813k5427K3160M4082K162N1781j5330n4083p476
$$ 87253 70719 73150 93243 93146 69333 43906 67066 111148 113310 165091 149761 95678 88202
13330H8202L5535j4739n686R389k0814j9762J2526J2702K6022q239j2172O861
$$ 88202 123737 108998 103312 112701 91887 72125 84651 97353 123375 115136 102964 109825
13318A09825J7150k7734j7848M4355R5616P2645J9538l2689j172K2229J003K0464
$$ 109825 126975 99241 81393 125748 221364 294009 313547 280858 279686 301915 302918 323382
13306C23382k6396r591k5575n2875m9292M7898N2842r501K7684J0529m9774j8592
$$ 323382 296986 287395 261820 208945 159653 207551 260393 250892 278576 289105 239331 220739
13294B20739k3074L0168Q369J6430P8327O1332L4828R4665J03868J05183Q3072
$$ 220739 197665 227833 236202 252632 330959 392291 427119 521784 625652 730835 813907
13283H13907m2885j23165o5513j28385j25555l6755j1581j5585k0964j0732k683
$$ 813907 771022 647857 582344 453959 328404 291649 280068 264483 243519 232787 230104
13272B30104j1111n6779J0025L7858K2262O043K4189K9751Q207L7166J6077L2733
$$ 230104 218993 162214 172239 210097 232359 238402 262591 292342 300549 337715 353792 386525
13260C86525L1518l6095m4500l4463O4319j9596J0403J9473J9430J966j3442P481
$$ 386525 418043 381948 337448 302985 367304 347708 358111 377584 397014 398980 385538 393019
13248C93019j2634k4299k775R126J6934N3245M6758j6335K2622K6002l1470k413
$$ 393019 380385 356086 353311 362437 379371 432616 479374 463039 485661 511663 480193 477780
13236D77780K6391K0029n328k9058J860J3892M8747M6608N1168K4988L9272L4765
$$ 477780 504171 524200 518872 489814 491674 505566 554313 600921 652089 677077 716349 751114
13224G51114M9350L494k3195P1298O1540k0036j7943j5312j4503L4187N7827J14019
$$ 751114 800464 803958 780763 852061 913601 893565 875622 860310 845807 879994 937821 1051840
13212A051840J10178J19116N5994O3809Q4828P9498O9720K0057P675M8945J25743
$$ 1051840 1162018 1281134 1337128 1400937 1485765 1565263 1634983 1655040 1662715 1711660 1837403
13201A837403J55150P7703P3146J01552O7824J32427J16406J14651J02180R8175
$$ 1837403 1992553 2070256 2143402 2244954 2312778 2445205 2561611 2676262 2778442 2876617
13191B876617J46538J56510J90083K39034L46361L90535M33483M92881N26006
$$ 2876617 3023155 3179665 3369748 3608782 3955143 4345678 4779161 5272042 5798048
13182E798048N84921N91048O39623P42947P83689Q04076Q74069J060699J288587
$$ 5798048 6382969 6974017 7613640 8356587 9140276 9944352 10818421 11879120 13167707
13173A3167707J639228K068729K584963L366902M414012N789085P832535J0738196
$$ 13167707 14806935 16875664 19460627 22827529 27241541 33030626 40863161 51601357
13165E1601357J4865994K0956898L0761176M7279279P3803778J08247538J25106462
$$ 51601357 66467351 87424249 118185425 165464704 239268482 347516020 472622482
13158D72622482P1489750l1107949q9375142r7886236q9717128o6861575m5022505
$$ 472622482 544112232 513004283 423629141 325742905 236025777 169164202 124141697
13151A24141697l0302011k0969973j5063705j1188636q449738o382721m897639
$$ 124141697 93839686 72869713 57806008 46617372 38167634 31784913 26887274
13144B6887274l875424l139542k589435k191361j873896j556282j302269j166413
$$ 26887274 23011850 19872308 17282873 15091512 13217616 11661334 10359065 9192652
13136I192652r80284p50122n96823m86687l40926l31661k78891k81816k90501
$$ 9192652 8212368 7462246 6865423 6378736 6037810 5706149 5427258 5145442 4854941
13127D854941k47551k63317k94885k70493k41175k55751k56989k35967j60865
$$ 4854941 4607390 4344073 4049188 3778695 3537520 3281769 3024780 2788813 2627948
13118B627948j61897q2379r1320q5005m9071n7410j09984q5050o3538r7025o7218
$$ 2627948 2466051 2383672 2292352 2207347 2158276 2100866 1990882 1905832 1842294 1745269 1678051
13107A678051o8890l4486k0691j3416k4857k145L3238J8619k9233j23018r2970
$$ 1678051 1609161 1574675 1553984 1540568 1515711 1513566 1546804 1565423 1536190 1413172 1320202
13096A320202m5097m3184p6206k9051K065j4275j9534l954K0117l1386k3168j1887
$$ 1320202 1275105 1231921 1155715 1126664 1128729 1114454 1094920 1090966 1111083 1079697 1056529 1044642
13084A044642n2970l2101n7930o8930k2513p423l6711l4952l5527J5940k0238
$$ 1044642 991672 959571 901641 832711 810198 802775 766064 731112 695585 711525 691287
13073F91287m4763l0943K1552p533J7374M1768j4684m3426n3026k056J565k7763
$$ 691287 646524 615581 637133 629600 646974 688742 674058 630632 577606 575550 577115 549352
13061E49352M960K7479m1255m8472Q24k0332l4005K1764P193K5727N1529K7208
$$ 549352 554312 581791 540536 492064 492888 472556 438551 460315 467508 493235 544764 571972
13049E71972k6655J1393m133m4143o7360j3377o042J253n48K2495l2302L9965
$$ 571972 545317 556710 552577 508434 441074 427697 421655 422908 422360 444855 412553 452518
13037D52518O2397J1549j7299k8793j02196j04486q3182m8082m1561K23N79k6342
$$ 452518 514915 526464 509165 480372 378176 273690 190508 142426 100865 101088 101667 75325
13025G5325K1392O9485P4518Q988l7381j0518J804L5586J7819l2716k1718k6088
$$ 75325 96717 166202 240720 249708 212327 201809 203613 239199 257018 224302 202584 176496
13013A76496k9449p9952m942K8730O4895N245m8236k8011l500J4465O7591Q8283
$$ 176496 147047 67095 62153 90883 155778 161023 112787 84776 81276 95741 163332 251615
13001B51615J1419O314M092M1396J8513k5972k1303m832k7608j5681L329j8952
$$ 251615 263034 269348 273440 314836 333349 307377 286074 281242 253634 237953 241282 222330
12989B22330p736k356K563K696j8258j2119j0807J3303M5045J8278j282k8890
$$ 222330 214594 212238 214801 217497 199239 187120 176313 189616 234661 252939 251657 222767
12977B22767J7099J747K279K7743J1189l3683L4931j9874r086J2892l3502o0591
$$ 222767 239866 241613 243892 271635 282824 249141 284072 264198 255112 268004 234502 173911
12965A73911P09J7514q70l3047l4597o544j9008l0684k1479l0483o10J5946L9795
$$ 173911 174620 192134 191264 158217 123620 117076 98068 67384 45905 15422 14812 30758 70553
12952G0553N3532K2966L0355j2563k115J2205O720L4792J3466o668l1905l7656
$$ 70553 124085 147051 177406 164843 162728 174933 181653 216445 229911 223243 191338 153682
12940A53682Q822R242k1789k3578k1731k6761l0646N2298P261m0503k5491M73
$$ 153682 162504 171746 149957 126379 104648 77887 47241 99539 106800 66297 40806 41279
12928D1279O3032K8625n3910m0408j5856j8507K3979L0475L9929J5809l845j0347
$$ 41279 104311 132936 79026 38618 22762 4255 28234 58709 98638 114447 110602 100255
12916A00255Q752j6805q938K2099L0281j8385L7218O3522L4881o7938l5713O195
$$ 100255 109007 92202 83264 105363 135644 117259 154477 217999 252880 184942 149229 155424
12904A55424n973k1583p531k9105k0208l1622q268l5953N5330M3067j7705L354
$$ 155424 149451 127868 120337 91232 71024 39402 31134 -4819 50511 93578 75873 79227
12892G9227j6947M1312P189k2114o8492o7969L95O2390L5356O5894J2992k077
$$ 79227 62280 103592 110781 88667 20175 -47794 -47399 14991 50347 116241 129233 127156
12880A27156j2012l7431p874p517j248m660j5989M882q709L1914K6689j4329m1290
$$ 127156 115144 77713 69839 62322 61074 56414 40425 45307 36598 68512 95201 80872 39582
12867C9582N608L5960n414J7275m298r072r142R474k2921j3574m9642l0780N8525
$$ 39582 45190 81150 75736 93011 88713 79641 70499 79973 57052 43478 -6164 -36944 21581
12854B1581j7335k5511j5533o336K5859J029K1725K4893L1677L5390J3683R540
$$ 21581 4246 -21265 -36798 -43134 -17275 -16246 5479 30372 62049 97439 111122 120662
12842A20662K0730j9621J8191m702n4130k6005m616L8110l837k5138K0434M483
$$ 120662 141392 121771 139962 135260 81130 55125 50509 88619 84782 59644 80078 84561
12830H4561k5920k2711J0699L5467k932j0985J5944N5026L5989K9376m2172j8184
$$ 84561 58641 35930 46629 82096 79164 68179 84123 139149 175138 204514 162342 144158
12818A44158L1911O4668L1332m0866o4171p6007j3913L9623j9625L443K9367N184
$$ 144158 176069 240737 272069 231203 167032 91025 77112 116735 97110 100553 129920 135104
12806A35104n0767p7796n924N0364L1287m442l937n078J3529k6580J2146l2323
$$ 135104 84337 6541 617 50981 82268 77826 73889 68811 82340 55760 67906 35583
12794C5583m7602j6907K131L2450N3034J7108m3175m7951l5055M1742K6312k5678
$$ 35583 -12019 -28926 -26795 5655 58689 75797 32622 -15329 -50384 -8642 17670 -8008
12782h008r987O2008N4269j7766J5661j0173k533J6777n0344l6059J7580K5820
$$ -8008 -17995 44013 98282 80516 96177 86004 83471 100248 49904 13845 31425 57245
12770E7245K404p910k3140l5804P480L7625K5275O008J1574j700P479J8669J3117
$$ 57245 59649 51739 28599 -7205 275 37900 63175 69183 80757 79057 86536 105205 118322
12757A18322J8827l390k4288n972k2788m5372j9739q076J0744J9309J331J883
$$ 118322 137149 133759 109471 103499 80711 35339 15600 7524 18268 37577 38908 40791
12745D0791P809K6895m2982j764K154j6313M4139l436L3462K2356k0487l6323
$$ 40791 48600 75495 32513 30749 32903 16590 60729 57293 90755 113111 92624 56301
12733E6301K715J6260j8334J8330K1056L2810n445o5391k6795J5831L2353N5053
$$ 56301 59016 75276 56942 75272 96328 129138 123693 58302 31507 47338 79691 134744
12721A34744K7785j453p902r351K774O0894M0552N5322Q3255J24503K07608K59177
$$ 134744 162529 161076 153174 143823 146597 207491 248043 303365 386620 511123 718731 977908
12709I77908L75297N28721N61477K35805k11097m09551m53436m39111k90504k06522
$$ 977908 1353205 1881926 2443403 2679208 2468111 2058560 1605124 1166013 875509 668987
12699F68987j28396r3072o2521n5751l8687o2372j8363K4460O828p468k1750m6226
$$ 668987 540591 447519 384998 329247 290560 228188 209825 234285 241113 233645 211895 165669
12687A65669l7097l653J2157k1288L006J947p982l6855l619J2352K1491Q60K1854
$$ 165669 128572 124919 137076 115788 118794 120741 112759 75904 72285 84637 106128 106988 128842
12674A28842Q423m0115m1021j2794j8495N552k7542k5287j8243j5070J6134K2667
$$ 128842 137265 97150 56129 43335 24840 30392 2850 -22437 -40680 -55750 -39616 -16949
12662a6949N2249K5948L9826j5200J2435k6066j5772j5245O606L533L979K0427
$$ -16949 35300 61248 101074 85874 98309 72243 56471 41226 47832 51365 55344 75771
12650G5771O414K3795J670K745j5352K731p214K94L1090l0290R523M885K088r014
$$ 75771 82185 105980 107650 110395 95043 97774 90560 90854 121944 91654 101177 106062 108150 99136
12636I9136K195K370J8299m5483O443m5202L005j8098J0614L3108P579M946J6049
$$ 99136 101331 103701 122000 76517 82960 37758 40763 22665 33279 66387 73966 78912 94961
12623I4961j576k1218m2313n569k9678p575K2416J1861O368n9399L1982N4025
$$ 94961 93385 72167 29854 24285 -5393 -12968 9448 21309 27677 -31722 260 54285
12611E4285m0143m083J8271M6126K9234r040q968q218J3358k0854j2707M083L0935
$$ 54285 14142 10059 28330 74456 103690 94650 85682 77464 90822 69968 57261 61344 92279
12598I2279O610N294Q063J0103J141j8518k6411l0489k4542M4759K7795J9920
$$ 92279 98889 104183 112246 122349 123490 104972 78561 48072 23530 68289 96084 116004
12586A16004q008J2578k6024J498r363J1658j5133k4946m339J372n5962m9516
$$ 116004 107996 120574 94550 96048 86685 98343 83210 58264 53925 55297 -665 -50181
12574e0181M2167M8224J5655K8887M256j3406n0795l6713L0039M5205n385J2965
$$ -50181 -8014 40210 55865 84752 89008 75602 24807 -11906 18133 63338 57953 70918
12562G0918j7843j8617J6316J2955k7972M1389K9000J6744l0863m1537k3424K6718
$$ 70918 53075 34458 50774 63729 35757 77146 106146 122890 92027 50490 27066 53784
12550E3784K855j677m3718q361N8573J3014J0562O6m669j8496J5120K1408j7737
$$ 53784 56639 54962 11244 2883 61456 74470 85032 85098 80429 61933 77053 98461 80724
12537H0724n2681l9212K3635J5437K8438J3163j6684j5347K2571M8213p884j1132
$$ 80724 28043 -11169 12466 27903 56341 69504 52820 37473 60044 108257 100373 89241
12525H9241j2791k8756p501L053R663K3907o338l4930j279Q238J3656j7632K7867
$$ 89241 76450 47694 40193 43246 52909 76816 70478 35548 34269 42507 56163 38531 66398
12512F6398J0649q816m9632l6032J1473p938j3784J0058N1754j0206k392J3837
$$ 66398 77047 68231 18599 -17433 -5960 -13898 -27682 -17624 34130 23924 21532 35369
12500C5369P249N126M618k120J4710m443j1620j5359k6310M5995K5705K8875J8935
$$ 35369 42618 47744 52362 50242 64952 60509 48889 33530 7220 53215 78920 107795 126730
12487A26730j0714N453L0139j1581o2800k6430J3988j4015J1780J7594n157l5086
$$ 126730 116016 121469 151608 140027 77227 50797 64785 50770 62550 80144 74987 39901
12475C9901O564N5521j0157k1941K0244J1722K7653M1931q067m3682n5718k2745
$$ 39901 46465 101986 91829 69888 90132 101854 129507 171438 163371 119689 63971 41226
12463D1226m0040m7489P770L3071K0979K5919L2168K6763j9906q409k3688k988
$$ 41226 1186 -46303 -38533 -5462 15517 41436 73604 100367 80461 72052 48364 45376
12451D5376J7737l5643J2766J6290K124l278j8355o190R332K9790N3746k6718
$$ 45376 63113 27470 40236 56526 58650 55372 37017 30827 40159 69949 123695 96977
12439I6977l7220j4637R961L814J5511N1614K533m8561l9269L033l630j1426J677
$$ 96977 59757 45120 55081 58895 74406 126020 128553 79992 40723 43756 40126 28700 30377
12426C0377L2905J5075J7240K5645m1547m668K3558k561L3479l6184Q447R793
$$ 30377 63282 78357 95597 121242 79695 75027 98585 96024 129503 93319 101766 111559
12414A11559n4658m364M079j5981K7366K4739K5680J7860J71j9050J070p407j4505
$$ 111559 56901 52537 56616 40635 68001 92740 118420 136280 136451 117401 118471 111064 96559
12401I6559j724k3281L2403K5080j6085k5362p072N4r117L5791K7267l2889L896
$$ 96559 94835 71554 103957 129037 112952 87590 80518 80572 71455 107246 134513 101624 105520
12388A05520l3724j6071K340L2301n902k5320J0609J4333k0293j2287N1236K1554
$$ 105520 71796 55725 58065 90366 84464 59144 69753 84086 63793 51506 102742 124296
12376A24296k152j1597J5337j6468q878J1720R765j4763P647j9060l8184L1313
$$ 124296 122144 110547 125884 109416 100538 112258 122023 107260 114907 95847 57663 88976
12364H8976K3625M822j8152l9431j3358J7868J0051L5520N26l0719k6406L631
$$ 88976 112601 117423 99271 59840 46482 64350 74401 109921 110447 79728 53322 56953
12352E6953K013M8042q444K372O621J696J6151j3843q077L79M5273N4940J9818
$$ 56953 58966 107008 98564 100936 107557 109253 125404 111561 103484 103863 149136 204076 223894
12339B23894n7369n7955J1034J312j3039J1480k4438N187L8844k2658m6308J7046
$$ 223894 166525 108570 119604 120916 107877 119357 94919 100106 138950 116292 69984 87030
12327H7030R027j8867K4918J49P989L1178J4855K9890j1192M34l2808k4973M4582
$$ 87030 96057 77190 102108 102257 110246 141424 156279 186169 174977 175411 142603 117630 162212
12314A62212l1806P731j4580m9512j1128O9822J1574p032K2739J4190k5858k4592
$$ 162212 130406 138137 123557 74045 62917 132739 144313 137281 160020 174210 148352 123760
12302A23760J982J8091L5042L9347m3287m7855k7499J4225n272J4784J6182l695
$$ 123760 125742 143833 178875 218222 174935 127080 99581 113806 108534 123318 139500 135805
12290A35805L4111J4380m2616n040L4988k1861k8034P438N9814M0461m6027l6961
$$ 135805 169916 184296 141680 136640 171628 149767 121733 129171 188985 229446 183419 146458
12278A46458n4403l5992J6112J3240K9860J630L744J0715k599p3k6281J2588K4559
$$ 146458 92055 56063 72175 85415 115275 116905 120649 131364 128765 128692 102411 114999 139558
12265A39558j6070n4432k761P881L3413O739K7121j5838k7838J6683J8558N1113
$$ 139558 123488 69056 66295 74176 107589 114328 141449 125611 97773 114456 133014 184127
12253A84127n344j0739P028L7405M771m4888P79M1362K3507j9645n2626j0510
$$ 184127 178783 168044 175072 212477 217248 172360 173139 214501 238008 218363 165737 155227
12241A55227M3970j644n5138K0664Q5605K5514l0033j2366k8901j7061l0049L3335
$$ 155227 199197 197553 142415 163079 248684 274198 244165 231799 202898 185837 155788 189123
12229A89123N4116J4312j6812p678N203L1163k3470p076R008J742k5409P82k770
$$ 189123 243239 257551 240739 233061 238264 269427 245957 238881 247889 249631 224222 225004 222234
12216B22234j7808k3773L5536M1257q947l3926k977L5317J0972k6135k2329j2152
$$ 222234 204426 180653 216189 257446 248499 214573 211596 246913 257885 231750 209421 197269
12204A97269L1719K8327N489L944j6572k1415K4386K4176P152k8433l9300k2927
$$ 197269 228988 257315 262804 266748 250176 228761 253147 277323 284475 256042 216742 193815
12192A93815O539N8921N7576l9198l5111k3225J7317L1334L13k6903J1070J7790
$$ 193815 200354 259275 316851 277653 242542 219317 236634 267968 268281 241378 252448 270238
12180B70238R518K648J2629r757K200J6925J8519p6161j9152r821L1117l165K146
$$ 270238 279756 282404 295033 285276 287476 304401 322920 246759 227607 217786 248903 245738 247884
12167B47884K0334M6829P206N8111J231l8452K1819J2000j9830n142J3909J8187
$$ 247884 268218 315047 322253 380364 381595 343143 364962 376962 357132 351990 365899 384086
12155C84086N349j6926r0392k7981K9720N3124J2721L8517L5678l0467n5528J688
$$ 384086 389435 372509 282117 254136 283856 336980 349701 388218 423896 393429 337901 339589
12143C39589M3764J2384K5415L4692j9318m2753l1650K7147K4258J3155p270J1407
$$ 339589 383353 395737 421152 455844 436526 393773 362123 389270 413528 426683 419413 430820
12131D30820k6555L713K0946k5443n3044K7670K2672K5276L722J4000j1119o989
$$ 430820 404265 407978 428924 403481 350437 378107 400779 426055 429777 443777 432658 425669
12119D25669M2586L6237M3143P491K6190K6096m950j2271m8113k8929P496J7965
$$ 425669 468255 504492 547635 555126 581316 607412 602462 590191 542078 513149 520645 538610
12107E38610Q240M1570M292l6389m011K5784k0597J6897N1797M4632j2785m831
$$ 538610 546850 588420 592712 556323 552312 578096 557499 574396 626193 670825 658040 653209
12095F53209l059J9835M8950N1935K0126M8944M090l7572k8861j9126o177Q936
$$ 653209 650150 669985 718935 770870 790996 839940 844030 806458 777597 758471 752294 761230
12083G61230J7555l1152m5266J7439M442J6144q564Q926q68J7355O360K6247K8250
$$ 761230 778785 747633 702367 719806 724248 740392 731828 740754 739886 757241 763601 789848 818098
12070H18098K3990L3430j5890k9723J3662L5848L8113J5402L951M2241k3917k2751
$$ 818098 842088 875518 859628 829905 843567 879415 917528 932930 936881 979122 955205 932454
12058I32454M0288N3893M7379M3519k5276m4746K9215O5846K8141M3658m070N2192
$$ 932454 972742 1026635 1074014 1117533 1092257 1047511 1076726 1142572 1170713 1214371 1210301 1262493
12046A262493J00413j6750k7249k847k7951M885K2999O2406O1797N5165L3396
$$ 1262493 1362906 1346156 1318907 1316060 1288109 1292994 1315993 1378399 1440196 1495361 1528757
12035A528757N8107j2872j3333l4821l8678J1738M3982P7569J0255K7231L3948
$$ 1528757 1586864 1573992 1560659 1525838 1487160 1498898 1542880 1620449 1630704 1657935 1691883
12024A691883M8907j129L8773K6646K0279K5573L2168J4795O4210L5960J2639
$$ 1691883 1740790 1739661 1778434 1805080 1825359 1850932 1883100 1897895 1962105 1998065 2010704
12013B010704J8004J8876Q934N9140K5554L5880O8941J12662O0295Q727N7558
$$ 2010704 2028708 2047584 2056518 2115658 2141212 2177092 2246033 2358695 2418990 2427717 2485275
12002B485275Q2110Q8282O6316P1876L7268P0970M6139O3321J87953K23431J95129
$$ 2485275 2567385 2655667 2721983 2793859 2831127 2902097 2948236 3011557 3199510 3422941 3618070
11991C618070J28945R9599k5511o5610j7445m082M1464R8947R9376R9751P8706
$$ 3618070 3747015 3846614 3821103 3755493 3738048 3733966 3775430 3874377 3973753 4073504 4152210
11980D152210P4449R3855O4300P0059Q9578J04831J17194J26718J23612J32409
$$ 4152210 4226659 4320514 4384814 4454873 4544451 4649282 4766476 4893194 5016806 5149215
11970E149215J02096J58681J35724J21251J44318J32811J25637J35594J69408
$$ 5149215 5251311 5409992 5545716 5666967 5811285 5944096 6069733 6205327 6374735
11961F374735J64187J80529J80275J38185J88119J88637J39362J80274J62597
$$ 6374735 6538922 6719451 6899726 7037911 7226030 7414667 7554029 7734303 7896900
11952G896900K35287K56272K00131K58338K80025L09518J68003Q3811M6040J5075
$$ 7896900 8132187 8388459 8588590 8846928 9126953 9436471 9604474 9688285 9734325 9749400
11942I749400J1543N9658R0722R2714J11304J20621N9197N3074Q6567O3026Q3919
$$ 9749400 9760943 9820601 9911323 10004037 10115341 10235962 10295159 10348233 10434800 10497826 10581745
11931A0581745J6866r760O536m8355o1699l6649m2709o9416r1481p7443o8016
$$ 10581745 10598611 10588851 10595387 10547032 10485333 10448684 10405975 10336559 10245078 10167635 10099619
11920A0099619p1630o4087r2205j37210j53005j16762j55643j50337j64857j65193
$$ 10099619 10027989 9963902 9871697 9734487 9581482 9464720 9309077 9158740 8993883 8828690
11910H828690j37306j68750j77302j74857j31456j33007j50480j28876j36780
$$ 8828690 8691384 8522634 8345332 8170475 8039019 7906012 7755532 7626656 7489876
11901G489876j93797j88396j43774j80250j48798j52701j82838k11583j61652
$$ 7489876 7296079 7107683 6963909 6783659 6634861 6482160 6299322 6087739 5926087
11892E926087j47171j42031j50202q5915j45246j48904j24313j43137j60024j14313
$$ 5926087 5778916 5636885 5486683 5400768 5255522 5106618 4982305 4839168 4679144 4564831
11882D564831j01817j07362q1984r5889q6149r1823o4105n1890q7411j06244q3116
$$ 4564831 4463014 4355652 4273668 4177779 4091630 3999807 3935702 3883812 3796401 3690157 3607041
11871C607041q2812r8023q8519n9042q3375j18253l4580l3421o9245j02477q1682
$$ 3607041 3524229 3426206 3337687 3278645 3195270 3077017 3042437 3009016 2939771 2837294 2755612
11860B755612j9329k9545o5639p5769p8742o7996Q587k8277m3688n4956o4624
$$ 2755612 2736283 2706738 2641099 2565330 2486588 2418592 2427179 2398902 2355214 2300258 2235634
11849B235634k8440m3415m3269o5599l5678k0790p4605p1062n8449J995r837j1924
$$ 2235634 2207194 2163779 2120510 2054911 2019233 1998443 1923838 1852776 1794327 1796322 1786485 1774561
11837A774561k9411J9107k8774k5249o4542n5753o4459m6838j6057L5261k9854
$$ 1774561 1745150 1764257 1735483 1710234 1645692 1589939 1525480 1478642 1462585 1497846 1467992
11826A467992m7154m9936l0435M2799n878n3098l6001o109j8576k9594k5601K8336
$$ 1467992 1420838 1370902 1340467 1383266 1377388 1324290 1288289 1282180 1263604 1234010 1208409 1236745
11814A236745J2660q346q1942n0331P23l498k0583j2319n044j6992n6077n0375
$$ 1236745 1249405 1241059 1159117 1108786 1109509 1106011 1085428 1073109 1068065 1051073 994996 944621
11802I44621m2414K3950O7209o828l6991j2114P924m550k9495k4371J2922k0085
$$ 944621 902207 926157 993366 986538 949547 937433 945357 940807 911312 886941 899863 879778
11790H79778l5117l8877K9993k3692l2352k1171K5953J082k0858q954l8148k3814
$$ 879778 844661 805784 835777 812085 779733 758562 784515 785597 764739 755785 717637 693823
11778F93823J6392K9921k4589K9469o049m3047j4792M784j385j8971r715j1284
$$ 693823 710215 740136 715547 745016 738967 695920 681128 685912 684527 665556 655841 644557
11766F44557j026R779m2810m1442j0509J4488j1204l0235j3514j7027M21L0377
$$ 644557 643531 653310 610500 569058 558549 573037 561833 531598 518084 501057 501478 531855
11754E31855R533j8461J902n902Q589l1430j1841K0703K9423j137l2495j5196
$$ 531855 541388 522927 524829 518927 527516 496086 484245 504948 534371 533234 500739 485543
11742D85543k3358R50J8753k7047m3185l0946j2964L0686K979j4434q013P564
$$ 485543 462185 463135 481888 454841 411656 380710 367746 398432 401411 386977 378964 386528
11730C86528k853Q630j4996P26j5981Q636k374l6025J3143Q016L0258k9142j108
$$ 386528 383675 392305 377309 378035 362054 370690 368316 332291 345434 353450 383708 354566 353458
11717C53458k9328J2485j1303J7996K3395k842j412k0081J8504Q36k4978J718
$$ 353458 324130 336615 325312 343308 366703 363861 362449 342368 360872 361708 336730 338448
11705C38448m592m694j8115k2336M4834L2734l8971l5370l3401p565K9883j68
$$ 338448 333856 329162 311047 288711 333545 366279 327308 291938 258537 250972 280855 280687
11693B80687J4490L8686J0852K025j1182J0244n804l6472k1440k2552J0129L9211
$$ 280687 295177 333863 344715 346740 335558 345802 339998 303526 282086 259534 269663 308874
11681C08874l3348n3294j3054K7368l916k1488k4355K3563P8652k425l2482M070
$$ 308874 275526 222232 209178 236546 232630 211142 186787 210350 289002 286577 254095 258165
11669B58165Q801L66M82k3997n135r147l3132L7940L6329j1174n7515J7208R899
$$ 258165 266966 267332 267814 243817 238682 229535 196403 234343 270672 259498 201983 219191 229090
11656B29090l1751j6234k8699r444K4920K3294L6892M7519l964P17n6476n4634
$$ 229090 197339 181105 152406 142962 167882 191176 228068 275587 271623 272340 215864 161230
11644A61230N6358L8398n013m5747k7583J7591J6316L0636j989l1661l0572l0874
$$ 161230 217588 255986 250973 205226 177643 195234 211550 242186 240197 208536 177964 147090
11632A47090K685M7413l588l278r222K1536j7068j1413J4530L878j1706j6869
$$ 147090 149775 197188 193600 190322 181100 202636 185568 174155 188685 192563 180857 163988
11620A63988Q033k3021k5609J2726K1482R943k1223m9848M0589M7308k0346l6158
$$ 163988 172021 149000 123391 136117 157599 167542 146319 96471 137060 184368 164022 127864
11608A27864j5384R83P223o263R881M3056J6464l4976l0266K7808m6407J8052
$$ 127864 112480 113463 120686 114423 124304 167360 183824 148848 118582 146390 99983 118035
11596A18035L7572j7682l6810k552n415M0274M5196j4499l0820N435N5890K7416
$$ 118035 155607 137925 101115 98563 93148 133422 178618 164119 133299 138734 194624 222040
11584B22040m4740j9578Q23J6334K9233o943j7911l3689l772m179j976J1873Q137
$$ 222040 177300 157722 158545 174879 204112 197169 179258 145569 141797 137618 135642 147515 155652
11571A55652k8304O29n560m0307k5041r744j9730M4944K2336l4183J7917P268
$$ 155652 127348 127977 122417 82110 57069 47325 27595 72539 94875 60692 78609 85877
11559H5877j5607r981L2856r583m510R830j2110J286M5395j1835J2229k2982J3348
$$ 85877 70270 60289 93145 83562 79052 88882 76772 78058 123453 111618 123847 100865 114213
11546A14213K3858k0281k4922l319J9912J6507M7827K0579P966n0623o4287j6825
$$ 114213 138071 117790 92868 89549 109461 125968 173795 194374 202340 151717 87430 70605
11534G0605J3904p948l0815o392K1387L4789K9567l8420j6673L5146j1255Q18
$$ 70605 84509 76561 45746 39354 60741 95530 125097 86677 70004 105150 93895 94713
11522I4713k183j263o0007J1686J2367j0682K7785J3670N8758K0132j5835r858
$$ 94713 92530 91267 31260 42946 55313 44631 72416 86086 144844 164976 149141 139283
11510A39283j8117q353J1793k335m357j9213k653L1034P480j2362j7763K569K348
$$ 139283 121166 112813 124606 122271 117914 98701 96048 127082 134562 122200 104437 107006 109354
11497A09354L0652q905J720J1929j2164n1460o2960K5926J8572o196j332L2953
$$ 109354 140006 131101 132821 144750 132586 81126 18166 44092 62664 56468 55136 88089
11485H8089J7424K771j262K2273R450J0686l2215m4588M0646M5255m722n2309
$$ 88089 105513 108284 107022 129295 138745 149431 117216 72628 113274 158529 153807 101498
11473A01498j8756j3282j3298q229p499J320l3165l0695K0858L4794L6047K8507
$$ 101498 82742 69460 56162 47933 40434 41754 8589 -22106 -1248 33546 69593 98100
11461I8100J9634l4181n0047l0599K9250P5355J3113m1164J7179N907p973j1133
$$ 98100 117734 83553 33506 2907 32157 107512 120625 79461 96640 102547 94574 83441
11449H3441L7556j0368j7830l3508k9493j1287J2140L1424J817O654L2682J5614
$$ 83441 120997 110629 92799 59291 29798 18511 30651 62075 63892 70546 103228 118842
11437A18842L3044j3276m1431n3245j7170m776L935L2225L0354p660Q215r822
$$ 118842 151886 138610 97179 43934 26764 21988 25923 58148 88502 80842 89057 79235
11425G9235k2455k1973l8959K7653p453Q911M0336o426j1537Q034j1245J4820
$$ 79235 56780 34807 -4152 23501 16048 24959 65295 58869 47332 55366 44121 58941
11413E8941m565K7171M53j7936J2686l0667k5424K767n1601k8492O565M367L1177
$$ 58941 54376 81547 82000 64064 76750 46083 20659 23426 -28175 -56667 -50102 -45735 -14558
11400a4558K3143n80L90j7279L4171J7723k9886k7031L5632q612k195M9345m222
$$ -14558 8585 8005 8395 -8884 25287 43010 13124 -13907 21725 13113 10918 60263 56041
11387E6041M563k8096j0644K4651j4759L1293K8428k0106j2216j5935K9495J4488
$$ 56041 60604 32508 21864 46515 31756 63049 91477 71371 59155 43220 72715 87203
11375H7203m4636m0975j2063K2677p073l131j7397P056R640L6265q081l671k513
$$ 87203 42567 1592 -10471 12206 5133 2002 -15395 -8339 1301 37566 29485 25814 23301
11362B3301K1639k9443l5523J7463N0511K0067l0760k3007K061J1823J000m090
$$ 23301 44940 15497 -20026 -2563 47948 68015 37255 14248 16309 28132 29132 25042
11350B5042O159R972j4034o323l5198r421J3251L3282J6158M9396O207k3580P310
$$ 25042 31201 41173 27139 20816 -14382 -23803 -10552 22730 38888 88284 94491 70911 78221
11337G8221m1186L216Q329O835p359m1995P7J4612L466K0580L0002J5396j1342
$$ 78221 37035 40251 48580 55415 48056 6061 6138 20750 24216 44796 74798 90194 78852
11324G8852j8130m8726n6456j4779K6866L9791k335j4827j6180K3200L4083K8973
$$ 78852 60722 11996 -44460 -59239 -32373 7418 5083 -9744 -25924 -2724 31359 60332
11312F0332J5355k8917n1996l0967L374O9630N6251j8640l5524m0321j1050L5802
$$ 60332 75687 46770 -5226 -36193 -32819 36811 93062 74422 38898 -1423 -12473 23329
11300B3329k3139L3407K4525K610Q440k7042P866M03K8681k337J5793m139m1959
$$ 23329 190 33597 58122 60732 69172 42130 49996 50399 79080 76743 92536 88397 46438
11287D6438L114J3069k9877l0027k7148M6246K5456l869L6115M1148j6345N965
$$ 46438 49552 62621 32744 2717 -24431 21815 47271 43402 79517 120665 104320 110285
11275A10285r671K7504n839l5596l7369m2552l5425M8044M7008o015j6842k273
$$ 110285 100614 128118 122279 86683 49314 6762 -28663 19381 66389 60374 43532 41259
11263D1259m166j4117k702l700j3485K80L5208j396r051n5227m2156J1830M7766
$$ 41259 37093 22976 20274 16574 3089 3369 38577 37181 28130 -27097 -69253 -57423 -9657
11250i657N2209M0969K2792l3044k0785k5521l9465n0504P218P4163L9224O1448
$$ -9657 42552 83521 106313 73269 52484 26963 -12502 -63006 -55788 18375 57599 119047
11238A19047K4316l5266m6268m6208J8199J7942K0899L7357K0010j1641L1806
$$ 119047 143363 108097 61829 15621 33820 51762 72661 110018 130028 118387 150193
11227A50193J6148j8527p361l9012j1533k230l8664k6653M4438K4203j353m3342
$$ 150193 166341 147814 140453 101441 89908 87678 49014 22361 66799 91002 89649 46307
11215D6307j4472k5605J0224L5721j2565m641m201k1460p001k4362m4566L5274
$$ 46307 31835 6230 16454 52175 39610 34969 30768 9308 2307 -22055 -66621 -31347
11203c1347L7086K1710k807j4772j8317J922J7268K644J6846K5809j1990l7400
$$ -31347 5739 27449 24642 9870 -8447 -6525 10743 13387 30233 56042 44052 6652
11191F652L0649L3580j2335l0045l9086K8778R298l5173J0090M4430q210k4029
$$ 6652 37301 70881 58546 28501 -10585 18193 27491 -7682 2408 46838 38628 14599
11179A4599j4882j2036K2109l723K8536K1700q908J3347J914k4248k356k6900
$$ 14599 -283 -12319 9790 6067 34603 56303 47395 60742 62656 38408 36052 9152
11167I152l452j7652P031P228J1599J8946p803Q986m6154l4655K0339L2119k495
$$ 9152 5700 -11952 -4921 2307 13906 32852 25049 34035 -12119 -46774 -26435 5684 3189
11154C189K4324m8800n1427k383L5676K9245K490J5716M0286J7938K480J640m518
$$ 3189 27513 -21287 -72714 -75097 -39421 -10176 -7686 8030 48316 66254 68734 70374 65856
11141F5856j7878l6389l8454N358j7948m5131J5713J652O4768N8898Q56j506j317
$$ 65856 47978 11589 -26865 -21507 -39455 -84586 -68873 -67221 -2453 56445 57301 55795 54478
11128E4478o519j9519j7699l8549K371M9583k5139j9166k8980p404J9763K4327
$$ 54478 47959 28440 10741 -27808 -25437 24146 -993 -20159 -49139 -56543 -36780 -12453
11116a2453Q406L3941j0361j186K3266L7593k1020l2756j5515N8024N389K0781
$$ -12453 -4047 29894 19533 18347 41613 79206 58186 25430 9915 67939 73328 94109
11104I4109M843l0845n7374j913p348M163n0644k1620P60L5645L8124K7987j6492
$$ 94109 98952 68107 10733 8820 1472 5635 -45009 -66629 -65869 -30224 7900 35887 19395
11091A9395K4377J9548l2895p917j2637J5210m6368k734J602k5187k534N4152
$$ 19395 43772 63320 30425 22508 9871 25081 -21287 -24021 -22419 -47606 -50140 4012
11079D012M8806K7152j4897J9355k3671l7316j5766J2442m791J7136M2273l3140
$$ 4012 52818 79970 65073 84428 60757 23441 7675 20117 15326 32462 74735 41595
11067D1595k2327M8602k781k2535L712j2593m4594J173M5387N2260K3844O279
$$ 41595 19268 67870 65089 42554 46266 33673 -10921 -9748 35639 87899 111743 118022
11055A18022o601k1894J23j1649j4490P695j2291r551m5723q820L1996O1541J3832
$$ 118022 111421 89527 89650 78001 63511 71206 58915 49364 3641 -5179 26817 88358 102190
11042A02190j6935j0438q964j4837L3529N6424K815L948M316k3617j6754K0032
$$ 102190 85255 74817 65853 51016 84545 140969 143784 147732 152048 128431 111677 131709
11030A31709L8095K1463K9918N682Q3732K1237j1283l7625j1075n2380m1318J8983
$$ 131709 169804 191267 221185 226867 310599 331836 320553 282928 271853 219473 178155 197138
11018A97138K0942K4591P7216L7347J5403p240j1319l0466l1378j9329m1963j5899
$$ 197138 218080 242671 319887 357234 372637 365397 354078 323612 292234 272905 230942 215043
11006B15043n9746K0453N3801N3555j9180J4926N434k2476m3663o6128j5006m0582
$$ 215043 155297 175750 229551 283106 263926 278852 284286 261810 218147 152019 137013 96431
10994I6431l8104K6639P3285k6782J9866L7525l1157n0498k4759l5684j5323N1072
$$ 96431 58327 84966 158251 131469 151335 188860 157703 107205 82446 46762 31439 82511
10982H2511J9619l4672p0696L0514p482l8626J621K4172M9793M411l832Q357l7027
$$ 82511 102130 67458 -3238 27276 19794 -18832 -17211 6961 56754 61165 57333 65690 28663
10969B8663j626K010k5567l3052J7736Q902j285K555K8786j3448L4285k4738q427
$$ 28663 27037 29047 3480 -29572 -11836 -2934 -4219 -1664 27122 13674 47959 23221 14794
10956A4794K7751m084o877j8593l4126n888l6570J3366L1025K7265o918K3886
$$ 14794 42545 38461 31584 12991 -21135 -27023 -63593 -50227 -19202 8063 1145 25031
10944B5031M607j2112J0925k44k5326q16q394K7220l3269o6683M0458K3869m1070
$$ 25031 29638 17526 28451 28207 2881 2065 -6329 20891 -12378 -79061 -38603 -14734 -55804
10931e5804k4394J0267K3911J6038L0143K6914n749j4922N24Q231m9860N1360
$$ -55804 -80198 -69931 -46020 -29982 161 27075 21326 6404 6928 15159 -34701 16659
10919A6659O8675K518n6967m0440k0987Q582K5028K254P403J7455j0121j4004
$$ 16659 85334 87852 30885 -9555 -30542 -21960 3068 5322 12725 30180 20059 6055
10907F055L9800J6525P458J687j8065l9793k5896M3658J3509k986J3782Q748j9256
$$ 6055 45855 62380 69838 71525 53460 13667 -12229 31429 44938 41952 55734 64482 45226
10894D5226K7920J6940l1981k0680O19J225N68j404N5008J2347k7003l3775m890
$$ 45226 73146 90086 58105 37425 38044 39269 39837 38433 93441 105788 78785 45010 40120
10881D0120j1038m6250q047R920J7984l8785K4193O4674L0108J9351j2845m2323
$$ 40120 29082 -17168 -25215 -15295 2689 -36096 -11903 52771 82879 102230 89385 47062
10869D7062l687l7985M297J592J3123J6878P236k5008K7157k8264l6355J5932
$$ 47062 43375 5390 9687 11279 24402 41280 48516 23508 50665 22401 -13954 1978
10857A978j6963K843J9119L579o144j2692L5612j6711k1191N9930K6474r629j0256
$$ 1978 -14985 -12142 6977 10556 4412 -8280 27332 10621 -10570 49360 75834 66205 55949
10844E5949j8826J1707J5468q677l7785j4038K372J0462M7647M0297l559k6254
$$ 55949 37123 48830 64298 55621 17836 3798 6170 16632 64279 104576 101017 74763
10832G4763k8770J1640Q775j7308K7789L0654j8413l5883n81q956k8315r743L2413
$$ 74763 45993 57633 66408 49100 76889 107543 89130 53247 52666 43710 15395 5652 38065
10819C8065Q19j7483P219M225Q203J5505j3066j3228Q48l1641m5329L5308K2091
$$ 38065 38884 21401 28620 32845 41048 56553 43487 30259 31107 -534 -45863 -10555 11536
10806A1536J3837J8437J819k3862Q612J7022k1644j5829L886j619k5727R823K4309
$$ 11536 25373 43810 45629 21767 30379 47401 25757 9928 13814 12195 -13532 -3709 20600
10793B0600O57k6544k6809L5814M5042j5045R113K9532J2249K0228j0545n6166
$$ 20600 21257 -5287 -32096 3718 48760 33715 42828 72360 84609 104837 94292 38126
10781C8126Q26l429m2489j045N4788O7507R895k7607j8856j1150m4944J1596K9504
$$ 38126 38952 35523 -6966 -8011 46777 114284 124179 96572 77716 66566 21622 33218 62722
10768F2722j5720p689L2879j1382m3487N070j2855j9794K9049N208j3619L931
$$ 62722 47002 39313 72192 60810 17323 22393 9538 -10256 18793 24001 10382 14313
10756A4313R584j0318K2473M6745N8967m7151l4368q847l4457N948J1368J9032
$$ 14313 23897 13579 36052 82797 141764 94613 60245 51398 16941 22889 34257 53289
10744E3289K703k2284j9420j8518M939N1191o760m5003j3975L6262N46K09R961
$$ 53289 55992 33708 14288 -4230 709 51900 45140 137 -13838 22424 22970 23179 33140
10731C3140L166q656K7888J2345R827Q738J8062j9043K1219J0541p822m4080J248
$$ 33140 36306 27650 55538 67883 77710 86448 104510 85467 106686 117227 109405 65325 66573
10718F6573K5385k7078p964O3993k8067j2977L8767M0319M3313L966k9171k4532
$$ 66573 91958 64880 56916 120909 92842 79865 118632 158951 202264 206230 177059 152527
10706A52527k3887l5422j919m1744l8052j6985J3244K8526J9169L0871k5787m1174
$$ 152527 128640 93218 91299 49555 11503 -5482 7762 36288 55457 86328 60541 19367
10694A9367R706K3923j1219O524l240K1810j2219p942J963J8887K0247J4069m3453
$$ 19367 29073 52996 41777 48301 45061 66871 54652 46710 48673 67560 87807 101876 58423
10681E8423n8228k7892L1898J0391j2538j8353K7264O633j668r835m834r881Q153
$$ 58423 195 -27697 4201 14592 2054 -16299 10965 17598 15930 6095 1261 -8620 -467
10668d67j6164M7j4842L2505J3804M0247L6506J475J8178O162j0712L7294j4871
$$ -467 -16631 -16584 -31426 1079 14883 55130 91636 93111 111289 117451 106739 144033 129162
10655A29162l7931J0649N393m3144j6638J4676L5822M9276J6852m387O5344Q349
$$ 129162 91231 101880 107273 64129 47491 62167 97989 147265 164117 159730 225074 233423
10643B33423j7704K8103L9841L9828k7522O218M6611J6610m755J2985J5125O6564
$$ 233423 215719 243822 283663 323491 295969 302187 348798 365408 360653 373638 388763 455327
10631D55327M3305J8997L1458L4669M0396P5971R9498J36739J19986J28835J30517
$$ 455327 498632 517629 549087 583756 624152 700123 799621 936360 1056346 1185181 1315698
10620A315698J18016J40559K05525K78685L73614N06586O69355R53453J408808
$$ 1315698 1433714 1574273 1779798 2058483 2432097 2938683 3608038 4561491 5970299
10611E970299J810044K355669K954056L108269K423639J154411r9690p87222q91096
$$ 5970299 7780343 10136012 13090068 16198337 18621976 19776387 19676697 18889475 17998379
10602A7998379m49348L30450J443911K861097M506592N961475O181791M287389
$$ 17998379 17549031 17879481 19323392 22184489 26691081 32652556 38834347 43121736
10594D3121736R35271k132714l638661l565868k425470p57079J273261L576711
$$ 43121736 44057007 41924293 38285632 34719764 32294294 31537215 32810476 36387187
10586C6387187N952700P706741P539697M155185j078144n236932p021852o763231
$$ 36387187 42339887 50046628 57586325 61741510 60663366 55426434 48404582 41641351
10578D1641351n292400l186066j074126R88174K844373M079304L667593J126341
$$ 41641351 36348951 33162885 32088759 33076933 35921306 40000610 43668203 44794544
10570D4794544k341068m894018n769326n313740m112695k678569j326610k35715
$$ 44794544 42453476 37559458 31790132 26476392 22363697 19685128 18358518 18122803
10562A8122803O26311J035718P38218l66218j684227k644409k894623k723231
$$ 18122803 18749114 19784832 20523050 20156832 18472605 15828196 12933573 10210342
10554A0210342k290393j758559j305932r15368o70333m92863l76180l51648k46519
$$ 10210342 7919949 6161390 4855458 3940090 3269757 2776894 2400714 2049066 1802547
10545A802547j87789k06388j27921j24126r8615r1555p1645r2674j7204k4755
$$ 1802547 1614758 1408370 1280449 1156323 1057708 966153 894508 801834 784630 759875
10535G59875n8103o1280r6783k1395P294k3016k9545m7441m2314J338K9842K0616
$$ 759875 701772 640492 543709 522314 529608 506592 477047 429606 387292 388630 418472 439088
10523D39088p902m4562k2344j6465j6921k4916m9200P63K9941j7865k8101O670
$$ 439088 431186 386624 364280 347815 330894 305978 256778 257541 287482 269617 241516 248186
10511B48186k6089O862l521K2250k6606k6704k283k6493J5314L3550K1584K0132
$$ 248186 222097 228959 225438 247688 221082 194378 192095 165602 180916 214466 236050 256182
10499B56182P085l366m0752o0018j4914L3580K6749l2566m7439k4778O00K6785
$$ 256182 263267 259901 219149 159131 144217 177797 204546 171980 124541 99763 100363 127148
10487A27148K9658M8165P300k7492L2529k8542n5412l8638j5255K7850M063o587
$$ 127148 156806 204971 212271 184779 217308 188766 133354 94716 79461 107311 111374 104787
10475A04787J2891K7751n629K4026K236j4692k9860J5986J1373K5192k696N088
$$ 104787 117678 145429 139800 163826 166062 151370 121510 137496 148869 174061 171365 176453
10463A76453j1349J691q481n1112n6000q495K3139K520j1190j4187k8061m1966
$$ 176453 165104 166795 158314 107202 51202 42707 65846 68366 57176 42989 14928 -27038
10451b7038L4071L9657K1275J6537n9525r413M4644K6592l7117k8547j9607K7905
$$ -27038 7033 46690 67965 84502 24977 15564 60208 86800 49683 21136 1529 29434
10439B9434K9911K8438J9747l2438m2271J481j0625j0984Q018j385j250k8123
$$ 29434 59345 87783 107530 75092 32821 34302 23677 12693 20711 19326 18076 -10047
10427a0047r807K9626M6653j6345j6311K2951o887J2085k9793K1501M0235J1694
$$ -10047 -19854 9772 56425 40080 23769 46720 39833 51918 22125 43626 83861 95555
10415I5555q398j7915j9863K1411N1142P928k4231n2265J3593J4434K646k2618
$$ 95555 87157 69242 49379 70790 121932 129860 105629 53364 66957 81391 84037 61419
10403F1419J754l84l1235J3004O172j222K3389j9842k1274k4557r343j254K1745
$$ 61419 63173 62789 31554 44558 50730 49508 72897 53055 31781 7224 -2119 -3373 18372
10390A8372n780P930L6947l6997j1698J3681O11J1427L5567k2637j3827j9758
$$ 18372 12592 20522 57469 20472 8774 22455 23066 34493 70060 47423 33596 13838
10378A3838L1012K3637q462O283j2810M501n086j0041p217K501m4061M530M7074
$$ 13838 44850 68487 60025 66308 53498 57999 52913 42872 35655 38156 -5905 -1375 45699
10365D5699o38j4235K23K6297J3405j81r981n476L957k4337l1495j4311J055J2611
$$ 45699 45061 30826 31049 57346 70751 70570 60589 55113 59070 34733 3238 -11073 -10018 2593
10351B593l7868j0099L8296J2300J5506L506l8754j5882K2336K5784J1123o834
$$ 2593 -35275 -45374 -7078 5222 20728 24234 -14520 -30402 -8066 17718 28841 22007
10339B2007L1665k9364k1443P801k0076k192j8088J1579K9170o401o109K2779
$$ 22007 53672 24308 2865 10666 -9410 -11602 -29690 -18111 11059 4658 -1451 21328
10327B1328K1390L0892Q818j9079n4682K5404J7116k4813J8790Q986k3221r791
$$ 21328 42718 73610 82428 63349 8667 34071 51187 26374 45164 54150 30929 21138
10315B1138L0403k5170o8578j6073Q545l2579j9855J6523M031K4060J9304M0273
$$ 21138 51541 26371 -42207 -58280 -49735 -82314 -102169 -85646 -81615 -57555 -38251 2022
10303B022J06j8223N3588J2715l4056O73L2180J769k8583J3698o062L5383j8952
$$ 2022 2128 -16095 37493 50208 16152 16825 49005 50774 22191 35889 29827 65210 46258
10290D6258k4789N985m840k832Q355r094N360L1509L3091k7076k1618J3843L216
$$ 46258 21469 27454 22614 19782 28137 19043 24403 55912 89003 61927 40309 54152 57368
10277E7368l8365l0641m5541l0381M8968K5948M8107p947m6282l5610j7768J1714
$$ 57368 19003 -11638 -57179 -87560 -38592 -12644 35463 27516 -18766 -54376 -72144 -60430
10265f0430N0225J2057k3377R779K6760k5713K010K5160J5864K1656K9233l4031
$$ -60430 -10205 1852 -21525 -11746 15014 -10699 -8689 16471 32335 53991 83224 49193
10253D9193l3585K4098J7377J5133j524l9746j225J5831j963q980m0563k227Q287
$$ 49193 15608 39706 57083 72216 70692 30946 29721 45552 43589 34609 -5954 -8181 106
10240A06K3669J5979M744J2271M2955l336m5608m4411P728k3540N470j6524j0585
$$ 106 23775 39754 44498 56769 99724 96388 50780 6369 14097 -9443 -3973 -20497 -31082
10227c1082K4169J7164L87o3481n3417M1133P7224j2905l1885k5889L5842N7818
$$ -31082 -6913 10251 10638 -52843 -106260 -65127 12097 -808 -32693 -58582 -22740 35078
10215C5078j4338k0399l1344K9736L3070l5718j5787p208K2494j0920r664J0420
$$ 35078 20740 341 -31003 -1267 31803 -3915 -19702 -26910 -4416 -15336 -25000 -14580
10203a4580J7944o434j4554K3641j4605n1354K8870m702k0162L496L5532M4525
$$ -14580 3364 -3070 -17624 6017 -8588 -59942 -31072 -35774 -55936 -52440 -16908 27617
10191B7617k9703j7512k9806J7861K5552K9563M632m1090J3555N493n620J1141
$$ 27617 -2086 -19598 -49404 -31543 -5991 23572 28204 -12886 669 6162 542 11683
10179A1683Q1l144j9305J2478j2860n528L8324O1699K9204m2009o139N4130R691
$$ 11683 11764 8620 -10685 1793 -11067 -16595 21729 83428 112632 70623 64484 118614 128305
10166A28305J7182j6370M4941n177K2892M6461L7245K8841j3134j1252k8278j3299
$$ 128305 145487 129117 174058 168881 191773 238234 275479 304320 291186 279934 251656 238357
10154B38357l0834j9572j4637J2810K6347O9482N6101k0596m0254n5731j924o700
$$ 238357 207523 187951 173314 186124 212471 281953 338054 317458 277204 221473 219549 212849
10142B12849j2817k5821j0682O687k1181K8408L7325o064j2343k6754l3890L0223
$$ 212849 200032 174211 163529 170216 149035 177443 214768 208704 196361 169607 135717 165940
10130A65940j6812k7969j8676k335j2275k4922l153N7346N0328k0008o5763m6310
$$ 165940 149128 121159 102483 100148 87873 62951 59798 117144 167472 147464 81701 35391
10118C5391r794o298L1763N579J2460J0103M740j0009n8938j0174J0394K796j1027
$$ 35391 25597 19299 51062 56641 69101 79204 83944 73935 14997 4823 15217 18013 6986
10105F986J0445J1919l3202l31M3856J94J8066j2461J4984L0586p364k6985k0450
$$ 6986 17431 29350 -3852 -4183 39673 39867 57933 45472 60456 91042 83678 56693 36243
10092C6243n0966j0889J1844J1241j0065k6011K7481l5236j9131J6453J3382j8361
$$ 36243 -14723 -25612 -13768 -2527 -12592 -38603 -11122 -46358 -65489 -49036 -35654 -54015
10080e4015M3875J257q452K8361K7154j169r680o264K4578P830J9913M6916l2619
$$ -54015 -10140 -8883 -17335 11026 38180 37011 27331 21067 45645 53475 73388 120304 87685
10067H7685l6040l9986K366M7859O107j1685l5492m4476k7757K3470l1617O88
$$ 87685 51645 11659 14025 61884 67991 56306 20814 -23662 -51419 -27949 -59566 -58878
10055e8878K4657K1093R69L7363P832L1991m2558l6385j1720O4159L6939j0020
$$ -58878 -34221 -13128 -12159 25204 33036 65027 22469 -13916 -25636 38523 75462 65442
10043F5442o5649p2897K4661O9057O9861L3910l9705j6913j6067j219n2422l6741
$$ 65442 -207 -73104 -48443 20614 90475 124385 84680 67767 51700 50481 -1941 -38682
10031c8682K7133J6689J0944k7769k93M3687K0684m906p263K1996K917j5998m5231
$$ -38682 -11549 5140 16084 -11685 -11978 31709 52393 47487 40224 62220 65137 49139 3908
10018C908k905j2485j4268K3873K5357k4075l9534M962L0344r527l481K6648J9375
$$ 3908 1003 -11482 -25750 -1877 23480 -595 -40129 -35167 -4823 -14350 -17831 8817 28192
10005B8192j4212m1805k0083k2700Q643R361p304M2029P714m532K1079j4272l080
$$ 28192 13980 -27825 -47908 -70608 -61965 -52604 -59908 -17879 -10165 -14697 6382 -7890 -10970
9992a0970k5908k3051J8022J4630K861k598K8751J0544l4861k1566k3931m1125
$$ -10970 -36878 -59929 -41907 -27277 -24416 -27014 1737 12281 -22580 -44146 -68077 -109202
9980a09202j5213P941M8983R847k3216l3163O0219O1792K2238N662M331j9561
$$ -109202 -124415 -116474 -67491 -57644 -80860 -114023 -53804 7988 30226 35888 40219 20658
9968B0658j6534k4320m973J711p323P905K4698L015j7180j1548j9701l0128L2187
$$ 20658 4124 -20196 -25169 -23458 -30781 -22876 1822 4837 -12343 -23891 -43592 -73720 -41533
9955d1533M1324J1770r158q796k4929j2985K4762N5752L1905k2950o6597j9059
$$ -41533 -209 11561 2403 -6393 -31322 -44307 -19545 36207 68112 45162 -21435 -40494
9943d0494j1441l4344k5156k0418l702L8034L1567N1534M294j1556J0134j8183
$$ -40494 -51935 -86279 -111435 -131853 -135555 -97521 -65954 -14420 -10126 -21682 -11548 -29731
9931b9731k912m3693j4653M4727N0146Q123N60N0128R965j9430Q741j7323q501
$$ -29731 -32643 -76336 -90989 -46262 3884 12007 12567 62695 72660 53230 61971 44648 36147
9918C6147q457K4447k912k5173k8875K836j8749J8685M4786j8951k1066M094O289
$$ 36147 27690 52137 49225 24052 -4823 -1987 -20736 -2051 42735 23784 2718 6812 13101
9905A3101p969J0534m2538K762L693N893j3052M6754O2697l4751m8080L5927j0687
$$ 13101 5132 15666 -26872 -24110 -20417 -14524 -27576 19178 81875 47124 -956 34971 24284
9892B4284m3546J4233K2578J0642k6150N924m378l7333k2446Q109N6027N0747
$$ 24284 -19262 -5029 17549 28191 2041 7965 3587 -33746 -56192 -48083 7944 58691
9880E8691n445k5795r600K898j8373n9066j2022K3311J8532k6149J6167j656l4297
$$ 58691 53246 27451 17851 20749 2376 -56690 -68712 -45401 -26869 -53018 -36851 -38507 -72804
9867g2804L551m933n5681J3324M7883K2393J9824M761n1627n8259r88N8908Q1164
$$ -72804 -69253 -74186 -129867 -116543 -68660 -46267 -26443 -21682 -73309 -131568 -132556 -73648 7516
9854G516N0298k8326n0428N9K5250L7146j795k1949m6240o752M841k7420K3549
$$ 7516 57814 29488 -20940 -20881 4369 41515 39720 17771 -28469 -35221 -30380 -57800 -34251
9841c4251L2261K3349k0339m9085q922K3464N0466r24l5884n1001K314M0700J8571
$$ -34251 -1990 21359 1020 -48065 -56987 -33523 16943 16019 -19865 -70866 -68552 -27852 -9281
9828i281j4467r868K077j1577q54O350K0436J0983j3923j1455j1138Q508K1957
$$ -9281 -23748 -33616 -31539 -43116 -43970 -37620 -17184 -6201 -20124 -31579 -42717 -34209 -12252
9815a2252m702j0815l1315J9887J6582L1474k6650N757n893K4409J2277r431j4420
$$ -12252 -16954 -27769 -59084 -39197 -22615 8859 -17791 -12034 -17927 6482 18759 9328 -5092
9802e092M1956J9943m0472k8882j9999L5910M1865M815k4956l5711j102J267k2058
$$ -5092 36864 56807 16335 -12547 -32546 3364 45229 50044 25088 -10623 -11725 -10458 -32516
9789c2516q780J8446k2193k2875K5872M8430N314l507j7419m003p825k0801r58
$$ -32516 -41296 -22850 -45043 -67918 -42046 6384 11698 8191 -9228 -13231 -21056 -41857 -42815
9776d2815K9872R907K1129J5779J4873j2488n1544l091K7376J4894k1989N351
$$ -42815 -12943 -3036 18093 33872 48745 36257 -15287 -18378 8998 23892 1903 7254
9764G254j6360n863P849j9884k0195J9497r835n241k343J0968m513k115l9274
$$ 7254 -9106 -14969 -7120 -27004 -47199 -27702 -37537 -42778 -45121 -34153 -38666 -40781 -80055
9751h0055m401m530j0053m0625Q973Q8104J6869J8539j4993p971O732k9019j0992
$$ -80055 -84456 -88986 -99039 -139664 -130691 -42587 -25718 -7179 -22172 -30143 -23411 -52430 -63422
9738f3422l584r853j7909O4166L2083K8383k7959m0593J8743l0294m832k634R390
$$ -63422 -67006 -76859 -94768 -30602 1481 29864 1905 -38688 -19945 -50239 -55071 -57705 -48315
9725d8315L592J8942k6938p184j1303r758L2571N269J3303L0069j5776l3617j6917
$$ -48315 -44723 -25781 -52719 -59903 -71206 -80964 -48393 -43124 -29821 248 -15528 -49145 -66062
9712f6062J7399M9392j9937l4906n507L1650N497l622J4484j3183J2009j3489
$$ -66062 -48663 729 -19208 -54114 -59621 -27971 -22474 -26096 -11612 -24795 -12786 -26275
9700b6275m501K6069K4774K7394k7916j3304N476j7934m8304m4158l341K8729
$$ -26275 -30776 -4707 20067 47461 19545 6241 11717 -6217 -54521 -98679 -102020 -73291
9688g3291R063O3874J4482o4500j9374M1883r693j101O031N87M2992j270l416
$$ -73291 -64228 -354 14128 -50372 -69746 -27863 -37556 -38657 -32626 -32039 10953 9683 6267
9675F267J0344j9216k7001M366n931l2370n94P2201J5128k044j7324j2812r359
$$ 6267 16611 -2605 -29606 -25240 -31171 -63541 -64135 8066 23194 21150 3826 -8986 -18345
9662a8345J5261k246J567Q132L644k1777J710k1J33O3549l879j8690m9705L869
$$ -18345 -3084 -5330 -3763 4369 8013 -13764 -12054 -12075 -11942 51607 47728 29038 -20667 -16798
9648a6798L6355R5440N1866p829m7259n7957k5007k0812r245j3946p769J3776
$$ -16798 19557 114997 166863 159034 111775 53818 28811 7999 -1246 -15192 -22961 -9185
9636i185J5604m2640j0207K1915L6136N398n411J8801M0277K2710j2379J3911
$$ -9185 6419 -36221 -46428 -24513 11623 17021 11610 30411 70688 93398 81019 94930
9624I4930m3527p0951J140j142J6199K1293J0098j2275k413m1058k3313l574Q43
$$ 94930 51403 -19548 -18408 -19550 -3351 17942 28040 15765 13352 -27706 -51019 -54593 -53750
9611e3750k2314o55N894M4073p928r353j7620J8439l188n571M9083J8452K0343
$$ -53750 -76064 -76719 -70825 -26752 -34680 -44033 -61653 -43214 -46402 -51973 -2890 15562 35905
9598C5905j8505M0652J9700J8192j3270n1304l8877K0608k1278k1700L630r811
$$ 35905 17400 58052 77752 95944 82674 31370 -7507 13101 -8177 -29877 -26247 -36058
9586c6058J7927J3607J5817K5093K704J6850k412k9541r784j3516k1075k3110
$$ -36058 -18131 -4524 11293 36386 39090 55940 53528 23987 14203 687 -20388 -43498
9574d3498K4745q230P154l0963K6604L6004k2477q692p7P670M5253O305j0915
$$ -43498 -18753 -26983 -19829 -50792 -24188 11816 -10661 -19353 -19430 -11760 33493 39798 28883
9561B8883j3123m2027k5751l4279K2739P0185j1833J415O438j5702l7829J5419
$$ 28883 15760 -26267 -52018 -86297 -63558 6627 -5206 -3791 2647 -13055 -50884 -35465
9549c5465j5719R550M8559L9744k1302j6259n64m007J3231l1533l0780Q89j9048
$$ -35465 -51184 -41634 6925 46669 25367 9108 8544 4537 17768 -13765 -44545 -43656 -62704
9536f2704o464N0091J7043r903j7358j530j3613n0618j0089N8447J4116l0374
$$ -62704 -69168 -19077 -2034 -11937 -29295 -30825 -44438 -95056 -105145 -46698 -32582 -62956
9524f2956l55M1027K7560n736k0936n647k8190n843m417L0173L593P399J4983
$$ -62956 -63311 -22284 5276 -460 -21396 -27043 -55233 -61076 -65493 -35320 -31727 -24328 -9345
9511i345J1384j3008k4024K9251L8477j4044k3913k1305j1192M6076M5899m952
$$ -9345 2039 -10969 -34993 -5742 32735 18691 -5222 -26527 -37719 8357 54256 49304
9499D9304l0093j6318J200l2982k2538L3926j51P419m428K1135L1129J7468l9454
$$ 49304 19211 2893 4093 -28889 -51427 -17501 -17652 -10233 -14661 6474 37603 55071 15617
9486A5617j0700L3310k4606k4260M208M2197k983J7570Q411n3666k3659J6248
$$ 15617 4917 38227 13621 -10639 -6431 35766 32783 50353 58764 5098 -18561 -2313
9474b313K0951N5293k4031p711j6525o4081n7322N823M1759L7253j810l1907L3694
$$ -2313 18638 73931 49900 42189 25664 -38417 -95739 -89916 -48157 -10904 -12714 -44621 -10927
9461a0927L259n0130j415L6431j6055k0457o739J8774Q251l286j1892j3239L0145
$$ -10927 -7668 -57798 -59213 -22782 -38837 -59294 -66033 -47259 -39008 -42294 -54186 -67425 -37280
9448c7280L4789k0840K0678L6101l2787j6707R109r514k848j9841n114L5794K0279
$$ -37280 -2491 -23331 -2653 33448 661 -16046 -6937 -16451 -19299 -39140 -44254 -8460 11819
9435A1819l4257m3248J4819K4714P952k3015m321K1250k291l9037R852k3963J4255
$$ 11819 -22438 -65686 -50867 -26153 -18201 -41216 -45537 -24287 -26578 -65615 -55763 -79726 -65471
9422f5471J5025k8902j7204j8586K5013J6915J8052j5696L1880J059j8220k8057
$$ -65471 -50446 -79348 -96552 -115138 -90125 -73210 -55158 -70854 -38974 -37915 -56135 -84192
9410h4192J5957J9280J9836m50l0952j5716k891j1331j149L6318M2621L953K2594
$$ -84192 -68235 -48955 -29119 -29569 -60521 -76237 -79128 -90459 -91608 -55290 -12669 -8716 13878
9397A3878J6803j5700J0957K2774j1200k9103j470j1502j3129j8267k7425J8323
$$ 13878 30681 14981 25938 48712 37512 8409 6939 -4563 -17692 -35959 -63384 -45061
9385d5061K1602k008m9920K5174J8668P043K4089P661l527k6654j3766J9814K2020
$$ -45061 -23459 -25467 -75387 -50213 -31545 -24502 -413 7248 3721 -22933 -36699 -16885 5135
9372E135j1967r563n530j3887J0002L5462l6548K4944L2711n428l2101j6849K6178
$$ 5135 -6832 -16395 -21925 -35812 -25810 9652 -26896 -1952 30759 25331 -6770 -23619 2559
9359B559n972l4669n337r149J637K8021k0314n0238M5048M0516K4767k0990M667
$$ 2559 -3413 -38082 -43419 -52568 -50931 -22910 -43224 -93462 -48414 -7898 16869 -4121 546
9346E46K8050J370k2250m378j2657j5990j3286j7825J4093L4231L3424n484n3199
$$ 546 28596 29966 7716 3338 -9319 -25309 -38595 -56420 -42327 -8096 25328 19844 -33355
9333c3355l6780K445K0802J566M4942J7751l5719J1486P973k0652k3613K4780
$$ -33355 -70135 -67690 -46888 -45322 -380 17371 -18348 -6862 1111 -19541 -43154 -18374
9321a8374J3168o871p543Q287L2268J379l7894L610n032l2412J0230j9100J5186
$$ -18374 -5206 -12077 -19620 -11333 20935 22314 -15580 -11970 -17002 -49414 -39184 -58284 -43098
9308d3098J4914k6739J6749L7451l1122L1816j627m4540j6671J152M3857K6627
$$ -43098 -28184 -54923 -38174 -723 -31845 -29 -1656 -46196 -62867 -61715 -17858 8769
9296H769m188P82j4581q870j9233M747K6178k6289j6040K7893k779o789K1731
$$ 8769 4581 5363 -9218 -18088 -37321 -32574 -6396 -32685 -48725 -20832 -23611 -30400 -8669
9283h669j9092L3073j960m0337Q601K7717j13j7679J7301J8059j827l3842l6834
$$ -8669 -27761 5312 3352 -36985 -28384 -667 -780 -18459 -1158 16901 15074 -18768 -55602
9270e5602L0008K2887r496r28m3008J2619N1644J3070k6946l028J6183o359J848
$$ -55602 -25594 -2707 -12203 -13131 -56139 -43520 8124 21194 -5752 -8780 7403 1044 2892
9257B892k802J8196J0844J4564k7778q157l057J1469o792k8421m5761N945M7461
$$ 2892 90 18286 29130 43694 15916 7759 4702 16171 9379 -19042 -64803 -58858 -11397
9244a1397m880j176K1073O377J0844k5292J581J3104l7215j4375P966r535n446
$$ -11397 -16277 -17453 3620 9997 20841 -4451 -2870 10234 -26981 -41356 -33390 -42925 -48371
9231d8371J3061Q002J7058o285J7569L6J3642J6872n1204k6156o536l177L2911
$$ -48371 -35310 -27308 -10250 -16535 1034 1070 14712 31584 -19620 -45776 -52312 -55489 -22578
9218b2578N3054M798l0991l6925l5209n043K6702P298j0966k6918P318N2522n0862
$$ -22578 30476 35274 4283 -32642 -67851 -72894 -46192 -38894 -49860 -76778 -69460 -16938 -67800
9205f7800k7258K6734K9686J1335M684j9121K989o780J419k2686J7710L9415j1941
$$ -67800 -95058 -68324 -38638 -27303 -22619 -41740 -38751 -45531 -44112 -66798 -49088 -9673 -21614
9192b1614k9435L4526k3462j8777l7797m176L4487K4951l7714m361L7914M5795
$$ -21614 -51049 -16523 -39985 -58762 -96559 -100735 -66248 -41297 -79011 -83372 -45458 337
9180C37K685K803k1300l4554K047K8338K7923M1108J665l753j8529j3488L1064
$$ 337 3022 5825 -15475 -50029 -47982 -19644 8279 49387 51052 47299 28770 15282 46346
9167D6346n0686k4253J517K2370j0045j3836K26J6773J2154L2767L5848n3928
$$ 46346 -4340 -28593 -27076 -4706 -14751 -28587 -28361 -11588 566 33333 69181 15253
9155A5253p661j9033J2146J4064K207k3843k2671j2988M463K147J8202J0749l6338
$$ 15253 7592 -11441 705 14769 16976 -6867 -29538 -42526 -38063 -35916 -17714 -6965 -43303
9142d3303r835j0560j338L9863O6744j5252k6267p204P324k7137J7418j4264L2602
$$ -43303 -53138 -63698 -65036 -25173 41571 26319 52 -7152 172 -26965 -9547 -23811 8791
9129H791L3048r735m4834k9508J4704N4906j2872J813j6351J7418L9131k9907
$$ 8791 41839 32104 -12730 -42238 -27534 27372 14500 16313 -38 17380 56511 26604
9117B6604l4315k471R009N747m299J5495m1923n0878L4638M5781K2798o516j8715
$$ 26604 -7711 -10182 -1173 4574 275 15770 -26153 -77031 -42393 3388 26186 19670 955
9104I55j1356M8167J9076m5886k3030L6253p045j2487j7711Q345M6782M3604l8363
$$ 955 -10401 37766 56842 10956 -12074 24179 17134 4647 -13064 -4719 42063 85667 47304
9091D7304j8124N341q411m9063k9943R776L9859J7929L7167J4367R961k1552j6785
$$ 47304 29180 34521 26110 -22953 -52896 -43120 -3261 14668 51835 66202 76163 54611 37826
9078C7826l100l6953M439J774K646M140r055j1020K468K4780K5258l31k2250k8758
$$ 37826 34726 -2227 2212 3986 6632 10772 1717 -9303 -6835 17945 43203 42872 20622 -8136
9064h136l7435M3260K781l6191J1086Q064K2315L1705k9079p44J8268j8798n720
$$ -8136 -45571 -2311 470 -35721 -24635 -16571 5744 37449 8370 7626 25894 7096 1376
9051A376j144j2065K5511L0206J5797l1029j0388J9545J7054n7649m2897K535
$$ 1376 232 -11833 13678 43884 59681 28652 18264 37809 54863 -2786 -45683 -43148
9039d3148K2304J4325Q62n0694L0931J5677J8270j2699j690l4179j1140K5350
$$ -43148 -20844 -6519 -5657 -56351 -25420 -9743 8527 -4172 -5862 -40041 -51181 -25831
9027b5831M2630M3249k926j6160p7179j0668J0641J7231k128o794R855J8715l0514
$$ -25831 16799 60048 57122 40962 -36217 -46885 -36244 -19013 -21141 -27935 -18080 635 -29879
9014b9879k2731K0740j8319n769O124J6423L2130j1913L4453M004K0623R193Q277
$$ -29879 -52610 -31870 -50189 -55958 -49834 -33411 -1281 -13194 21259 25263 45886 55079 63356
9001F3356l7980j1071J340m5936m119K311n2627k9003M3637O2419K0991m1530
$$ 63356 25376 14305 15645 -30291 -34410 -32099 -84726 -113729 -70092 -7673 13318 -28212
8989b8212j2982j777M1294k7192m5724K6221N3419K9838K9936n272J860k7595
$$ -28212 -41194 -42971 -1677 -28869 -74593 -48372 5047 34885 64821 59549 61409 33814
8977C3814m3541J3470K8970l1417j6260l4090J8418M9778L5695k4290k2871j4744
$$ 33814 -9727 3743 32713 1296 -14964 -49054 -30636 19142 54837 30547 7676 -7068
8965g068k4489R948j6688K0747K2878l853O051k3078k4629K4955m826J7650r094
$$ -7068 -31557 -21609 -38297 -17550 5328 1475 7526 -15552 -40181 -15226 -20052 -2402 -11496
8952a1496J7744k0597l764l6753R823J2239O869J3591k3488k1078m3688M7341
$$ -11496 6248 -14349 -18113 -54866 -45043 -32804 -25935 -12344 -35832 -56910 -100598 -53257
8940e3257L3479k6876n2881N116J9190L8259J8452K2077k9646J777l0570k1251
$$ -53257 -19778 -46654 -99535 -94419 -75229 -36970 -18518 3559 -26087 -24310 -54880 -76131
8928g6131K4397N9244K3861l3454m3089k0971j7717J6247K8222M1492K2689J538
$$ -76131 -51734 7510 31371 -2083 -45172 -66143 -83860 -67613 -39391 2101 24790 26328
8916B6328J2256K9477m7794p6853j2832K4599J8577N518k3990J6416N9448J3949
$$ 26328 38584 68061 20267 -56586 -69418 -44819 -26242 -20724 -44714 -28298 31150 45099
8904D5099l2832j7505j0563R779j6377M3261o021n1584k3094M3759L2928k2957
$$ 45099 12267 -5238 -15801 -6022 -22399 20862 14841 -36743 -59837 -16078 16850 -6107
8892f107k3977P174L5625j6144l7175R636K9121K283j6180P30M957m581k1786
$$ -6107 -30084 -22910 12715 -3429 -40604 -30968 -1847 436 -15744 -15014 -10057 -14638 -36424
8879c6424l1349k725K7203l8858j2267N5803M9077J5764K243J1601n807L1706
$$ -36424 -67773 -70498 -43295 -82153 -94420 -38617 10460 26224 28467 40068 34261 65967
8867F5967K989j6004k6738j7925l0050j6023k9219j6123K6160K2584M4054J1924
$$ 65967 68956 52952 26214 8289 -21761 -37784 -67003 -83126 -56966 -34382 9672 21596
8855B1596k4524l7236N371K0911r735r015K3085O4832J6534m0l6050k4838k6461
$$ 21596 -2928 -40164 -34793 -13882 -23617 -32632 -9547 55285 71819 71779 35729 10891 -15570
8842a5570K0969o21l2392m264M6446o069O419k5354J2645K0663m933m421Q508
$$ -15570 5399 4778 -27614 -31878 14568 8499 14918 -10436 2209 22872 17939 13518 22026
8829B2026k3188j5488p472J4734J2832q165J0937j2545M354J5377M720l4934K710
$$ 22026 -1162 -16650 -24122 -9388 3444 -4721 6216 -6329 -1975 13402 18122 -16812 -14102
8816a4102m530P656j4061O622J1474l85j9288P297N618N2432O5202k6717j1760
$$ -14102 -18632 -10976 -25037 -18415 -6941 -7326 -26614 -19317 -13699 38733 103935 77218 65458
8803F5458K7330l8651k1527l8537M656p734k3371k173J2461Q923O27p580l2780
$$ 65458 92788 54137 32610 -5927 -1271 -9005 -32376 -34549 -22088 -13165 -12538 -20118 -52898
8790e2898j3399K3075n039J4005P270l7905J7003K8239j0309J6112k1204n4560
$$ -52898 -66297 -43222 -48261 -34256 -26986 -64891 -47888 -19649 -29958 -13846 -35050 -89610
8778h9610J3630O966J6852P59r3L8926K6965R792k3612K4833N769k959k1878j5068
$$ -89610 -75980 -69014 -52162 -51403 -51496 -12570 14395 24187 575 25408 31177 28218 6340 -8728
8764h728k509K6702J6709p169k6972k2303O5063k4451J6243K1672m1377m5646
$$ -8728 -11237 15465 32174 25005 -1967 -24270 40793 16342 32585 54257 12880 -32766
8752c2766j8826L0848K372l281L8820l0207m4035Q48R663M2180N771k0336J5757
$$ -32766 -51592 -20744 -18372 -21653 17167 -13040 -57075 -56227 -46564 -4384 1387 -18949 -3192
8739c192M1192M242J6121J3392p0901n2441R967j0108j545L7699J6705j5732j390
$$ -3192 38000 42242 58363 71755 854 -51587 -41620 -51728 -53273 -15574 1131 -14601 -15991
8726a5991J210m3487l8509J0323N8857N3001P121k7410j8784k0696J6638k2326
$$ -15991 -14781 -58268 -96777 -86454 -27597 25404 32525 5115 -13669 -34365 -17727 -40053
8714d0053n05M9985k59j410n2796l6390j8742J3511N5895j0413K3505L789N673
$$ -40053 -40558 9427 9168 7758 -45038 -81428 -100170 -86659 -30764 -41177 -17672 -13883 -8210
8701h210N304J080O596o540k745K7388k1733j8785q384N425Q21r593J5548J3458
$$ -8210 -2906 -1826 4770 -1770 -4515 22873 1140 -17645 -26029 -20604 -19783 -29376 -13828 -370
8687c70K3680K679j4181k0209n63L1964M1323K834l2981m8215k1259J2643l442
$$ -370 23310 25989 11808 -8401 -8964 23000 64323 67157 34176 -14039 -35298 -22655 -26097
8674b6097J9188J2962P226n561J179K1346l6631n061J0142O78R495R420J3904
$$ -26097 -6909 6053 13279 7718 8897 30243 -6388 -11449 -1307 -629 8866 18286 32190
8661C2190L565R239m5205M685J1586j1134l4836l6002q960O440K8012K5936o80
$$ 32190 35755 44994 -211 4474 16060 4926 -29910 -65912 -74872 -68432 -40420 -14484 -15164
8648a5164N0121J4830j5964m9644j7346J9377N4829p20l5816m1148R561K2096
$$ -15164 34957 49787 33823 -15821 -33167 -13790 41039 40319 4503 -36645 -27084 -4988
8636d988L6527J4027j4164J7375j4674J3271p270l0639l0290J7061j2302o552
$$ -4988 31539 45566 31402 48777 34103 47374 40104 9465 -20825 -3764 -16066 -22618
8624b2618R700O8713j9546k6475k3435k2722K0776K7940P824O104j1812L6961
$$ -22618 -12918 55795 36249 9774 -13661 -36383 -15607 12333 20157 26261 14449 51410
8612E1410J3064m9361j8465O989j0141N27J8431J6280k0514N8551J2866p2808
$$ 51410 64474 15113 -3352 3637 -6504 -5977 12454 28734 8220 66771 79637 6829
8600F829o5M091l1110n477J4639J3567k9261R541J1980K4347J4968j0821l9630
$$ 6829 6764 10855 -20255 -25732 -11093 2474 -26787 -17246 -5266 19081 34049 23228 -16402
8587a6402O60K0374K7627N6792k4105r89j0742J538J61l0764l5351j9624J700
$$ -16402 -15742 4632 32259 89051 64946 63957 53215 54753 54914 24150 -11201 -30825 -29125
8574b9125l7123K6715L5099r748N4960J3133j76l7690k220j0225l0954K5767L0780
$$ -29125 -66248 -39533 -4434 -14182 40778 53911 53735 16045 13825 3600 -27354 -1587 29193
8561B9193j2632k165J2383J8498l5336l106O706J8532j2182J714J0511J2538p09
$$ 29193 16561 14396 26779 45277 9941 6835 13541 32073 19891 21605 32116 44654 43945
8548D3945k0067J7433K4034o819l8514l6661j8069J7763N988M1854M8438j6990
$$ 43945 23878 41311 65345 58526 20012 -16649 -34718 -16955 -10967 30887 79325 62335
8536F2335k6152k7914l0994j8573K2378M4005J4121n699k2552j3915N243R08J8136
$$ 62335 36183 8269 -22725 -41298 -18920 25085 39206 33507 10955 -2960 2283 3191 21327
8523B1327J2354N119m217K1586K6401k0367k2522J9955L4757k0088j4948k8450
$$ 21327 33681 38800 34583 56169 82570 62203 39681 59636 94393 74305 59357 30907
8511C0907r181k3029k5614k9197N419P047L8961j1249l9703j9469K6626n8m2072
$$ 30907 21726 -1303 -26917 -56114 -50695 -43648 -4687 -15936 -55639 -75108 -48482 -48540 -90612
8498i0612L174M1920K9498j8979r559k020J3334K9870k9372k7281L6960K7848
$$ -90612 -87438 -45518 -16020 -34999 -44558 -46578 -33244 -3374 -32746 -60027 -23067 4781
8486D781M557J0432K3863M5837L0751n1455k9678l8703j7479K749O7950J5204
$$ 4781 9338 19770 43633 89470 120221 68766 39088 385 -17094 -14345 53605 68809
8474F8809j7769j4542j0663q50l1780k4158K3586o976m2573l1232n887L5567L2536
$$ 68809 51040 36498 25835 24985 -6795 -30953 -7367 -14343 -56916 -88148 -94035 -58468 -25932
8461b5932M5586K3452K6395N879l5372L2889J5376j4506j3410N902j5183j0402
$$ -25932 19654 43106 69501 75380 40008 72897 88273 73767 60357 66259 51076 40674
8449D0674M276j0608l7332J8967k341K1995L7526k3771k2962N414k2345K3447
$$ 40674 44950 34342 -2990 15977 13636 35631 73157 49386 26424 31838 9493 32940
8437C2940J7280M871q03j1307l227k1842O077K0640j3984k8088K0977O461o3912
$$ 32940 50220 55091 54288 42981 39754 17912 23989 44629 30645 2557 23534 29995 -33917
8424c3917L88K4372m182o042l7065J5627K6563L373j1662l473l4257M738p260
$$ -33917 -33529 -9157 -13339 -19381 -56446 -40819 -14256 -10883 -22545 -26018 -60275 -55537 -62797
8411f2797J590n82L4305K4090L3004M2178L2656j1206j5117l4392m7292Q225M4076
$$ -62797 -61207 -61789 -27484 -3394 29610 71788 104444 93238 78121 43729 -3563 4662 48738
8398D8738O954l6144k6620K9393J6641M8804K3867J3168J6324Q6322J39160J00943
$$ 48738 55692 19548 -7072 22321 38962 87766 111633 124801 141125 227447 366607 467550
8386D67550Q0060k9413q5344j31437r1474o3505l5428j8923l2601n9671j4498
$$ 467550 547610 518197 432853 301416 209942 146437 111009 92086 59485 -186 -14684
8375a4684J3892m7O024k5723J98j307j1189p47PO748P3516J8623J1464k5870M222
$$ -14684 -792 -839 5185 -20538 -20340 -21647 -32836 -33583 -33576 -26828 46688 65311 76775 50905 55127
8360E5127J6405J8853j6698j9011j1602k868k4478R219L0107P396J1239P835N6631
$$ 55127 71532 90385 73687 54676 43074 40206 15728 24947 55054 62450 73689 81524 138155
8347A38155N1655P8738R7728K97201M08965J88610j28501k30635k15823k01405
$$ 138155 189810 268548 366276 663477 1072442 1261052 1132551 901916 686093 484688
8337D84688q9932N933m7766m3043m8436l7741p8596n0868k0919j6674J090K9717
$$ 484688 394756 400689 352923 309880 261444 223703 145107 94239 73320 56646 57736 87453
8325H7453j1882k5068m2267L8776K0337j6663o2159J526O474j8098J2464J2256
$$ 87453 75571 50503 8236 47012 67349 50686 -11473 -9947 -3473 -21571 -9107 3149
8313C149k041J1791J8429m6186L2377K0870K2051J133J717L0711L635K0181N3775
$$ 3149 1108 12899 31328 -14858 17519 38389 60440 61573 63290 94001 97636 117817 171592
8300A71592J26727J78659J31151l268r1621j30085r4528J2288Q5695O3206j469
$$ 171592 298319 476978 608129 604861 513240 383155 288627 300915 386610 449816 448347
8289D48347p4818r8928n8680o0752m9531k9451j5886l8926R054J2070J1459R534
$$ 448347 373529 274601 215921 155169 105638 76187 60301 21375 30429 42499 53958 63492
8277F3492q169k3378n2148l1574J1781j7464k682M4524O0147L5266k257j2708
$$ 63492 55323 31945 -20203 -51777 -39996 -57460 -60142 -15618 44529 79795 77538 64830
8265F4830j2042Q251o1098J382o490l5963K2723K2812p758J6987n864l3175k0622
$$ 64830 52788 61039 -59 1323 -5167 -41130 -18407 4405 -3353 13634 7770 -25405 -46027
8252d6027K6863M9618J7169k9831Q2226J13701M9598n4327p9494l3654l2740o3273
$$ -46027 -19164 30454 47623 17792 100018 213719 263317 208990 129496 95842 63102 -171
8240a71O792J3825o1664m3663Q897J9714M7839K8718J5722j0135j7455l0864r112
$$ -171 6621 20446 -41218 -84881 -75984 -56270 -8431 20287 36009 25874 8419 -22445 -31557
8227c1557K461o464L8374N953j8172M223K2007r891K3155n470k8233j0550n959
$$ -31557 -29096 -35560 2814 8767 -9405 -5182 16825 6934 30089 24619 -3614 -14164 -20123
8214b0123m298j8683L8982K7316m645p022k273L432j2900k2414p650J7533j8539
$$ -20123 -24421 -43104 -4122 23194 18549 11527 9254 12686 -214 -22628 -30278 -12745 -31284
8201c1284M057R122k705l5085L077L5158Q598J7457Q893j7068J3175K0868m744
$$ -31284 -27227 -18105 -20810 -55895 -52818 -17660 -9062 8395 17288 220 13395 34263 29519
8188B9519p750k2435k7239l6788j6011L7387M4277N1514j3778j7374Q074k9026
$$ 29519 21769 -666 -27905 -64693 -80704 -43317 960 52474 38696 21322 29396 370
8176C70n2283k7239K9784j2839J6175M491j0716j4014K3640J0690J7739j4761
$$ 370 -51913 -79152 -49368 -62207 -46032 -41541 -52257 -66271 -42631 -31941 -14202 -28963
8164b8963j4016K8801n847M178M809j4557N097K8179M497L057J8375K2815l6501
$$ -28963 -42979 -14178 -20025 -15847 -11038 -25595 -20498 7681 12178 15235 33610 56425 19924
8151A9924j1741J6929l6940Q492L0504O6289j840n2382l7004k2945p714J9596
$$ 19924 8183 25112 -11828 -3336 27168 93457 91617 39235 2231 -20714 -28428 -8832
8139h832J5603p667j8962M971n54N2140L5141k5937l6264L6295k5446j6870L2506
$$ -8832 6771 -896 -19858 -14887 -15441 36699 71840 45903 9639 45934 20488 3618 36124
8126C6124R698r115J6583j926k2988m223n0795j7384J8639N8977J9693k19j8106
$$ 36124 45822 36707 53290 51364 28376 24153 -26642 -44026 -25387 33590 53283 53064 34958
8113C4958o943j025Q811J7995Q195m108k1480K0956M1892j7813m0378k9355j4006
$$ 34958 28015 26990 35801 53796 61991 57883 36403 57359 99251 81438 41060 11705 -2301
8100b301L8398r421k531J2100K6536O551J4811k9631m3301l0313K05j4086L810
$$ -2301 36097 26676 24145 36245 62781 69332 84143 54512 11211 -19102 -18897 -32983 -29173
8087b9173K7451J659l3396n6793J1234O8272M3961j708J7223L782j0914q2137
$$ -29173 -1722 -63 -33459 -90252 -79018 -10746 33215 31507 48730 52512 41598 -40539
8075d0539K2435r826k2352o10N528p59J514l376o695K3491J0201K3753j1441k0216
$$ -40539 -18104 -27930 -50282 -50892 -45364 -46123 -44609 -47985 -54680 -31189 -20988 2765 -8676 -28892
8061b8892K047J3298j2839l2239j814J1577K8743O445j4589J5222L2142K30j3775
$$ -28892 -26845 -13547 -26386 -58625 -60439 -48862 -20119 -13674 -28263 -13041 19101 19331 5556
8048E556l3446L90o26j2325J4292n9873k8909J0534M6431M6616r991j5988J0857
$$ 5556 -27890 -27500 -28126 -40451 -26159 -86032 -114941 -104407 -57976 -11360 -21351 -37339 -26482
8035b6482q146p803J6923L1258L3688j8040j6132K7494K940Q271l8906l0909J9757
$$ -26482 -34628 -42431 -25508 5750 39438 21398 5266 32760 35700 43971 5065 -25844 -6087
8022f087L6568j0736J1284J8257o525m3894k2636J7923N610J4023j6272j8922
$$ -6087 30481 19745 31029 49286 42761 -1133 -23769 -5846 -236 13787 -2485 -21407
8010b1407k9141m6963L1744O2475K4260p459r513j0043J3638m0097k0986M738
$$ -21407 -50548 -97511 -65767 -3292 20968 13509 3996 -6047 7591 -32506 -53492 -48754
7998d8754Q80K1619o077j2979k1016Q698M541J2230J2000J4340k1535k6171L7846
$$ -48754 -47874 -26255 -32332 -45311 -66327 -57629 -53088 -40858 -28858 -14518 -36053 -62224 -24378
7985b4378M9079o55k8514R922r622j2408j270j3777Q484J5290L5045L696l2553
$$ -24378 24701 24046 -4468 5454 -4168 -16576 -17846 -31623 -23139 -7849 27196 30892 -1661
7972a661l1721K871q125m2808K9725M3137K3439m6124k6363K6521K6506o892L7107
$$ -1661 -33382 -30511 -38636 -81444 -51719 -8582 14857 -31267 -57630 -31109 -4603 -11495 25612
7959B5612j0213o706K0973n338l7251R910j6292k616L0827K3203k1560m8107l309
$$ 25612 15399 8693 29666 24328 -12923 -3013 -19305 -21921 8906 32109 10549 -37558 -40867
7946d0867L3709k6581p343K1423k97m17j8430L9670K1354j2170j6079j4717l6187
$$ -40867 -7158 -33739 -41082 -19659 -19956 -20373 -38803 867 22221 10051 -6028 -20745 -56932
7933e6932j4737J6648K4715L907O7227O631p327q940n5755J4335J7769l3518p49
$$ -56932 -71669 -55021 -30306 -26399 40828 47459 40132 31192 -24563 -10228 7541 -25977 -26726
7920b6726L1666k5644P160k886j0075L1594J2492j6612r371O144j4475O019K3705
$$ -26726 4940 -20704 -13544 -16430 -26505 5089 17581 969 -8402 -2258 -16733 -10714 12991
7907A2991J9275j5075j6685L933J9427l9391p927Q017Q283r078j996L4428l9524
$$ 12991 32266 17191 506 4439 23866 -15525 -23452 -15435 -7152 -16230 -18226 16202 -23322
7894b3322k9940P1613K7850l7744j5109K3482j274l6582J1310M2324j8155j5451
$$ -23322 -53262 18351 46201 8457 -6652 16830 15556 -21026 -9716 32608 14453 -998
7882i98K4235J0177j4381l1667l9386j4431K7412J0168j7667L763R99o0422K7912
$$ -998 23237 33414 19033 -12634 -52020 -66451 -39039 -28871 -46538 -42775 -41776 -102198 -74286
7869g4286O3846J1675K8564K101n0086K3399N1370Q074k3120o5925n325P970J6934
$$ -74286 -10440 1235 29799 31900 -18186 5213 56583 64657 41537 -24388 -29713 -21743 -4809
7856d809j1426R582j4487L0079L3644l9965j4746J1299J8945J652j5760P962N374
$$ -4809 -16235 -6653 -21140 8939 42583 2618 -12128 -829 18116 19768 4008 11970 17344
7843A7344l969L071j4551k7442j063J6326K3344J1077J9472L1735j1571j5021
$$ 17344 13375 16446 1895 -25547 -26610 -10284 13060 24137 43609 75344 63773 48752
7831D8752o354j6298j695J9355K0306k3634j4115k294r018j3181k5048k0324n334
$$ 48752 42398 26100 24405 43760 64066 40432 26317 24023 15005 1824 -23224 -43548 -48882
7818d8882K0004m3609k2312K5196M1917J967Q033M512L5674J4589l7120m5859
$$ -48882 -28878 -72487 -94799 -69603 -27686 -25719 -17686 -13174 22500 37089 -31 -45890
7806d5890K1948m762o90K9985J3032K9167o103k1685k1950k4367M4946j2043L59
$$ -45890 -23942 -28704 -29394 591 13623 42790 36687 15002 -6948 -31315 13631 1588 1947
7793A947k8156q370K6457j2767J3439O646L711P818k5061k4878j6137K898J6530
$$ 1947 -26209 -34579 -8122 -20889 -7450 -804 2907 10725 -14336 -39214 -55351 -52453 -35923
7780c5923N909k1969M4240M0235j462k8059K615M616j0617P676J8260j5061k5401
$$ -35923 -30014 -51983 -7743 32492 31030 2971 5586 10202 -415 7261 25521 10460 -14941
7767a4941j820o35K252L1175j3305k9619M146j2271K1693N7960j9663o7401l08
$$ -14941 -16761 -17396 -15144 16031 2726 -26893 -22747 -35018 -13325 44635 24972 -42429 -42737
7754d2737J2962l317L3911R673j26K926m2103k8497K3106M0112j4205k3528k4605
$$ -42737 -29775 -33092 819 10492 10366 13292 -28811 -57308 -34202 5910 -8295 -31823 -56428
7741e6428J7525K4701o82m5288k230L4597l212J882L8413k1028n1731Q924l880
$$ -56428 -38903 -14202 -14884 -60172 -62402 -27805 -31017 -29135 9278 -11750 -63481 -54557 -58437
7728e8437K9238L7037Q283j3271k6957L621N7169L6770m6718n2965J267L8587
$$ -58437 -29199 7838 16121 2850 -24107 -20486 36683 73453 26735 -26230 -24963 13624
7716A3624l2001k8114J4089M3949J8417l9508l4716j7836J5773K8086J2047j3644
$$ 13624 -18377 -46491 -32402 11547 29964 -9544 -44260 -62096 -46323 -18237 -6190 -19834
7704a9834k6418Q851N543L2271L7545j1567J3228l177k1735R87k1914n001j0897
$$ -19834 -46252 -37401 -31858 413 37958 26391 39619 36442 14707 15694 -6220 -11221 -22118
7691b2118m8162J5994k852L2234K6681k2987j6913J223N1633J3295k2970m0139
$$ -22118 -70280 -54286 -57138 -24904 1777 -21210 -38123 -36900 14733 28028 5058 -35081
7679c5081k3954k027p6392p605K8246L9120M5711J1220r652P635N5076J3853q160
$$ -35081 -59035 -61062 -137454 -145059 -116813 -77693 -31982 -20762 -30414 -22779 32297 46150 37990
7666C7990l1242j8774j8680L254j8540j7225j3355R197J9859L3652L1067Q824
$$ 37990 6748 -12026 -30706 -27452 -45992 -63217 -76572 -67375 -47516 -13864 17203 26027
7654B6027k8474J7555J2590n5269m7902L1801J8470K308L116L1360P184J8689
$$ 26027 -2447 15108 27698 -27571 -75473 -43672 -25202 -22894 -19778 11582 18766 37455
7642C7455L2107m3399l8504j5236J7837R13J7046l6106l9326l2165L1885M6933
$$ 37455 69562 26163 -12341 -27577 -9740 -8827 8219 -27887 -67213 -99378 -67493 -20560
7630b0560J6401K8648j050n959k435n188n478l5627j9030P223j9335O5633M8164
$$ -20560 -4159 24489 23439 17480 15045 9857 4379 -31248 -50278 -43055 -62390 3243 51407
7617E1407k486m0188L917J4706m4674n0832L71J3914L1729k8094N32K8164L2343
$$ 51407 48921 8733 12650 27356 -17318 -68150 -67779 -53865 -22136 -50230 -49698 -21534 10809
7604A0809p584n2335o804M0935K5161l3786k3935N734M4831M0633r301j6188j4045
$$ 10809 3225 -49110 -55914 -14979 10182 -23604 -47539 -41805 3026 43659 34358 18170 4125
7591D125j7146K029k3506q586R871L0831L8823L6219l7734n0084O660q13j9828
$$ 4125 -13021 -10992 -34498 -43084 -33213 -2382 36441 72660 34926 -15158 -8498 -9311 -29139
7578b9139K0656J0388k9291O2454J5226o789j353J0280K6802l6689m4399K6245
$$ -29139 -8483 1905 -27386 35068 50294 43505 42152 52432 79234 42545 -1854 24391
7566B4391J0917j7026j8805L4621K044j5989l785L3936m1472k8349J7965k9130
$$ 24391 35308 18282 -523 34098 36142 20153 16368 50304 8832 -19517 -1552 -30682
7554c0682k9087J5808q991K4238K6956k201M08m5668p75l860k9467L983j031j0950
$$ -30682 -59769 -43961 -52952 -28714 -1758 -3959 -3551 -49219 -49994 -53854 -83321 -79338 -80369 -91319
7540i1319O1131K8333L5475J1087j0635k958K1121K601j9554j9737j7758k5197
$$ -91319 -30188 -1855 33620 44707 34072 31114 52235 54836 35282 15545 -2213 -27410
7528b7410J76l93r098l350J078J5418J3211K9901K6506j5222m5688o1005k7182
$$ -27410 -27234 -27627 -36725 -40075 -38997 -23579 -10368 19533 46039 30817 -14871 -75876 -103058
7515a03058L5120P4596L9946P937q154m4343p4467m9740L0800P5402L9217K8319
$$ -103058 -67938 6658 46604 54541 46387 2044 -72423 -122163 -91363 -15961 23256 51575
7503E1575J4353k5811k0910r66m2413j7939k4020J0042Q016J4503n929m662K9050
$$ 51575 65928 40117 19207 18241 -24172 -42111 -66131 -56089 -48073 -33570 -39499 -44161 -15111
7490a5111L9416K7863m292J6295K263j0290j6980q780J1565m62j4277K2353m847
$$ -15111 24305 52168 47876 64171 66434 56144 39164 30384 41949 41487 27210 49563 44716
7477D4716K2990N38p2828k9882m170j3497M1969M8368m353j5906K2911K383J048
$$ 44716 67706 68244 -4584 -34466 -38636 -52133 -10164 38204 33851 17945 40856 43239 44287
7464D4287j8131l0367l3521j3881K0323M8665q465l3290J1969L3698J2503k5340
$$ 44287 26156 -4211 -37732 -51613 -31290 17375 8910 -24380 -12411 21287 33790 8450
7452H450l1580m9152m2645L4318N7380p016J0577k7819j0785Q68l2452j9183o046
$$ 8450 -23130 -72282 -114927 -80609 -23229 -30245 -19668 -47487 -58272 -57404 -89856 -109039 -115085
7439a15085J4186j8771P796J6323M8730J4165K9094M0153J2921j6757k3924N947
$$ -115085 -100899 -119670 -111874 -95551 -46821 -32656 -3562 36591 49512 32755 8831 14778
7427A4778L1995J9219k5434j0533n999o0257L0567J5721l6275L1007N197p028
$$ 14778 46773 65992 40558 30025 24026 -36231 -5664 10057 -26218 4789 9986 2958
7415B958j3837K3541m155L2089l2973k0698l4030k9790J3857K0492L8002k6770
$$ 2958 -10879 12662 8507 40596 7623 -13075 -47105 -76895 -63038 -42546 -4544 -31314
7403c1314J2835L7314J9048N671P56K9204L303j9109j8734k8344K7627l5063l3009
$$ -31314 -18479 18835 37883 43554 44310 73514 76817 57708 38974 10630 38257 3194 -29815
7390b9815K4005L907K2586L1286N334k6536p086J3584L5187J1051n9308k4601
$$ -29815 -5810 -1903 20683 51969 57303 30767 23681 37265 72452 83503 24195 -406
7378d06J5642l871L5256j9469k5460j1158l299P882L1094l6958l781L6808K038
$$ -406 15236 11365 46621 27152 1692 -9466 -12765 -4883 26211 -10747 -14528 22280 24318
7365B4318l6602k4020k546k9453M7316K8079J0609O854k3076j5534J9767j2710
$$ 24318 -12284 -36304 -38850 -68303 -20987 7092 17701 24555 1479 -14055 5712 -6998
7353f998l855j7126j1759K1294L7844L825K7636m5079k9099L558K4781L3035O773
$$ -6998 -10853 -27979 -39738 -18444 19400 23225 50861 5782 -23317 -19759 5022 38057 44830
7340D4830k5539K761l0518l4657n982L5187m0744J5862Q107n8580J1242N7450
$$ 44830 19291 22052 -8466 -43123 -49105 -13918 -54662 -38800 -30693 -89273 -78031 -20581
7328b0581J8598K5737M851k736M5010L086l6177m7568K4807k9678l4652L1998
$$ -20581 -1983 23754 28605 25869 70879 73965 37788 -9780 15027 -14651 -49303 -17305
7316a7305M8581P832l7860r957m627Q475M976Q272m3195o0447N774O3431n41q664
$$ -17305 31276 39108 1248 -8709 -13336 -4861 115 8387 -34808 -95255 -89481 -26050 -26591 -35255
$$ [...]
##END NTUPLES=NMR SPECTRUM
##END=
