##TITLE=Analysis number 309777
Compound Code cc 06302
Book Reference 440/22
Project Code adrs
Chemist Name craigr
##JCAMPDX= 6.0         $$ Bruker NMR JCAMP-DX V2.0
##DATA TYPE= NMR SPECTRUM
##DATA CLASS= NTUPLES
##ORIGIN= Bruker BioSpin GmbH
##OWNER= NMR
$$ XWIN-NMR		Version 3.5
$$ Fri Jun  3 14:17:35 2005 GMT Daylight Time (UT+1h)  MAYBRIDGE\NMR@NMR_250MHZ
##.OBSERVE FREQUENCY= 250.131544655141
##.OBSERVE NUCLEUS= ^1H
##.ACQUISITION MODE= SIMULTANEOUS (DQD)
##.ACQUISITION SCHEME= undefined
##.AVERAGES= 16
##.DIGITISER RES= 18
##SPECTROMETER/DATA SYSTEM= dpx250
##.PULSE SEQUENCE= zg30
##.SOLVENT NAME= CDCl3
##.SHIFT REFERENCE= (INTERNAL, CDCl3, 0, 16.522)
##AUDIT TRAIL= $$ (NUMBER, WHEN, WHO, WHERE, WHAT)
$$ ##TITLE= Audit trail, XWIN-NMR		Version 3.5
$$ ##JCAMPDX= 5.01
$$ ##ORIGIN= Bruker BioSpin GmbH
$$ ##OWNER= NMR
$$ C:\u/data/dgb/nmr/ADRS/3740/pdata/1/auditp.txt
$$ ##AUDIT TRAIL=  $$ (NUMBER, WHEN, WHO, WHERE, WHAT)
(   1,<2005-06-03 14:17:14.06 +100>,<MAYBRIDGE\NMR>,<NMR_250MHZ>,
      <created by zg, POWCHK disabled, PULCHK disabled
       configuration hash MD5:
       62 19 C7 07 E1 42 D1 B7 37 6C 3D D0 77 39 F9 E6
       data hash MD5: 64K
       B2 B5 6C 16 79 3A 2B 2B 6D 03 20 7A 11 2E 34 16>)
(   2,<2005-06-03 14:17:26.71 +100>,<MAYBRIDGE\NMR>,<NMR_250MHZ>,
      <Start of raw data processing
       ef LB = 0.3 FT_mod = 6 PKNL = 1 SI = 32K 
       data hash MD5: 32K
       79 5A DD 12 AA B8 38 87 DA A5 CA CF 79 1C 9D EE>)
(   3,<2005-06-03 14:17:28.56 +100>,<MAYBRIDGE\NMR>,<NMR_250MHZ>,
      <apk 
       data hash MD5: 32K
       B6 07 AF 55 F1 70 FD 69 E9 09 B8 83 97 0F 08 3B>)
(   4,<2005-06-03 14:17:29.29 +100>,<MAYBRIDGE\NMR>,<NMR_250MHZ>,
      <abs ABSG = 5 
       data hash MD5: 32K
       BA A2 6F 67 C6 6B EA 65 4F 2D 83 A7 F6 20 18 3B>)
$$ ##END=
$$ 
$$ hash MD5
$$ C7 F8 23 13 C4 72 2F DC 00 9D 52 84 EC 0C B7 1F
##$RELAX= 
##$RELAX= 
##$RELAX= 
##$RELAX= 
##$RELAX= 
##$RELAX= 
##$RELAX= 
$$ Bruker specific parameters
$$ --------------------------
##$DU= <C:\u>
##$EXPNO= 3740
##$NAME= <ADRS>
##$PROCNO= 1
##$TYPE= <nmr>
##$USER= <dgb>
##$AMP= (0..31)
100 100 100 100 100 100 100 100 100 100 100 100 100 100 100 100 100 100 
100 100 100 100 100 100 100 100 100 100 100 100 100 100 
##$AQSEQ= 0
##$AQ_mod= 3
##$AUNM= <au_zg>
##$AUTOPOS= <24 >
##$BF1= 250.13
##$BF2= 250.13
##$BF3= 250.13
##$BF4= 250.13
##$BF5= 500.13
##$BF6= 500.13
##$BF7= 500.13
##$BF8= 500.13
##$BYTORDA= 1
##$CFDGTYP= 0
##$CFRGTYP= 5
##$CHEMSTR= <none>
##$CNST= (0..31)
1 1 145 1 1 1 1 1 1 1 1 1 1 1 1 1 1 1 1 1 1 1 1 1 1 1 1 1 1 1 1 1 
##$CPDPRG= <>
##$CPDPRG1= <>
##$CPDPRG2= <>
##$CPDPRG3= <>
##$CPDPRG4= <mlev>
##$CPDPRG5= <mlev>
##$CPDPRG6= <mlev>
##$CPDPRG7= <mlev>
##$CPDPRG8= <mlev>
##$CPDPRGB= <>
##$CPDPRGT= <>
##$D= (0..31)
0 1 0 0 0 0 0 0 0 0.06 0 0 0 0 0 0 0.0002 0 0 0 0 0 0 0 0 0 0 0 0 0 0 
0 
##$DATE= 1117804633
##$DBL= (0..7)
120 120 120 120 120 120 120 120 
##$DBP= (0..7)
150 150 150 150 150 150 150 150 
##$DBP07= 0
##$DBPNAM0= <>
##$DBPNAM1= <>
$$ [...]
##$SUBNAM7= <"">
##$SUBNAM8= <"">
##$SUBNAM9= <"">
##$SW= 20.6930455092707
##$SWIBOX= (0..15)
0 0 3 0 0 0 0 0 0 0 0 0 0 0 0 0 
##$SW_h= 5175.983436853
##$TD= 65536
##$TD0= 1
##$TE= 294.16
##$TE2= 300
##$TE3= 300
##$TEG= 300
##$TL= (0..7)
0 120 120 120 120 120 120 120 
##$TP= (0..7)
150 150 150 150 150 150 150 150 
##$TP07= 0
##$TPNAME0= <>
##$TPNAME1= <>
##$TPNAME2= <>
##$TPNAME3= <>
##$TPNAME4= <>
##$TPNAME5= <>
##$TPNAME6= <>
##$TPNAME7= <>
##$TPOAL= (0..7)
0.5 0.5 0.5 0.5 0.5 0.5 0.5 0.5 
##$TPOFFS= (0..7)
0 0 0 0 0 0 0 0 
##$TUNHIN= 0
##$TUNHOUT= 0
##$TUNXOUT= 0
##$USERA1= <user>
##$USERA2= <user>
##$USERA3= <user>
##$USERA4= <user>
##$USERA5= <user>
##$V9= 5
##$VALIST= <valist>
##$VCLIST= <CCCCCCCCCCCCCCC>
##$VD= 0
##$VDLIST= <DDDDDDDDDDDDDDD>
##$VPLIST= <PPPPPPPPPPPPPPP>
##$VTLIST= <TTTTTTTTTTTTTTT>
##$WBST= 1024
##$WBSW= 4
##$XGAIN= (0..3)
0 0 0 0 
##$XL= 0
##$YL= 0
##$YMAX_a= 342289
##$YMIN_a= -334062
##$ZGOPTNS= <>
##$ZL1= 120
##$ZL2= 120
##$ZL3= 120
##$ZL4= 120
##$ABSF1= 16.522
##$ABSF2= -4.171173
##$ABSG= 5
##$ABSL= 3
##$ALPHA= 0
##$AQORDER= 0
##$ASSFAC= 0
##$ASSFACI= 0
##$ASSFACX= 0
##$ASSWID= 0
##$AUNMP= <proc_1d>
##$AZFE= 0.1
##$AZFW= 0.1
##$BCFW= 0
##$BC_mod= 0
##$BYTORDP= 0
##$COROFFS= 0
##$CY= 12.5
##$DATMOD= 1
##$DC= 0
##$DFILT= <>
##$DTYPP= 0
##$F1P= 14.0000005364418
##$F2P= -0.99999901652339
##$FCOR= 0.5
##$FTSIZE= 32768
##$FT_mod= 6
##$GAMMA= 0
##$GB= 0
##$INTBC= 1
##$INTSCL= 1
##$ISEN= 128
##$LB= 0.3
##$LEV0= 0
##$LPBIN= 0
##$MAXI= 10000
##$MC2= 0
##$MEAN= 0
##$ME_mod= 0
##$MI= 0
##$NCOEF= 0
##$NC_proc= -3
##$NLEV= 6
##$NOISF1= 0
##$NOISF2= 0
##$NSP= 0
##$NTH_PI= 0
##$NZP= 0
##$OFFSET= 16.522
##$PC= 1
##$PHC0= -69.19538
##$PHC1= 5.860088
##$PH_mod= 1
##$PKNL= yes
##$PPARMOD= 0
##$PSCAL= 4
##$PSIGN= 0
##$REVERSE= no
##$SF= 250.13
##$SI= 32768
##$SIGF1= 0
##$SIGF2= 0
##$SINO= 400
##$SIOLD= 32768
##$SREGLST= <1H.CDCl3>
##$SSB= 0
##$STSI= 32768
##$STSR= 0
##$SW_p= 5175.98343685301
##$SYMM= 0
##$S_DEV= 0
##$TDeff= 65536
##$TDoff= 0
##$TI= <Analysis number 999999
Compound Code 99
Book Reference 9
Project Code 9>
##$TILT= no
##$TM1= 0
##$TM2= 0
##$TOPLEV= 0
##$USERP1= <user>
##$USERP2= <user>
##$USERP3= <user>
##$USERP4= <user>
##$USERP5= <user>
##$WDW= 1
##$XDIM= 32768
##$YMAX_p= 457972852
##$YMIN_p= -238357
$$ End of Bruker specific parameters
$$ ---------------------------------
##NTUPLES= NMR SPECTRUM
##VAR_NAME=  FREQUENCY,     SPECTRUM/REAL,   SPECTRUM/IMAG
##SYMBOL=    X,             R,               I
##VAR_TYPE=  INDEPENDENT,   DEPENDENT,       DEPENDENT
##VAR_FORM=  AFFN,          ASDF,            ASDF
##VAR_DIM=   32768,         32768,           32768
##UNITS=     HZ,            ARBITRARY UNITS, ARBITRARY UNITS
##FACTOR=    0.157963299565203, 1,           1
##FIRST=     4132.6476996994, 0,             0
##LAST=      -1043.33573715361, 0,           0
##MIN=       -1043.33573715361, -238357,     0
##MAX=       4132.6476996994, 457972852,     0
$$ Real data points
##PAGE= N=1
##DATA TABLE= (X++(R..R)), XYDATA
$$ [...]
19005C49363k8358l6973M4450K307n0551o6929k8393K89m2259j18921J678J9782
18993D5485L3469N3657L809J4361K0807K9385J1305m724L3582k2041k0008M52
18981A99539J4444r449k6906m7315l9163o1258J336J7555p974o0412K8905N3319
18969F2621P3579P480k5169K1808m1830j03283q667k0223j286N7147J9929J0741
18957E2847P8743J9565J5750l5620k8938o6853J2750J6267j347n6394n2470M155
18945d1545j7858m2406J4148L7089N5404k1149l9465K8256K5039M9102n9570q3104
18933i6059L9766N6168m421N6099O6520j5515P239j7680m7494l5854J9072M0090
18921F7931K3091n5491m895j551M583P39m0746Q611K0803j8324K908J9722J4977
$$ plain form
19005 349363 321005 284032 328482 330789 280238 213309 184916 185205 142946 24025 25703 45485
18993 45485 78954 132611 136420 150781 171588 200973 212278 207554 241136 219095 199087 199539
18981 199539 213983 204534 177628 130313 91150 29892 31228 48783 40809 -19603 9302 62621
18969 62621 136200 143680 118511 140319 98489 -4794 -13461 -33684 -34970 22177 42106 52847
18957 52847 131590 151155 166905 131285 102347 35494 48244 64511 63164 6770 -45700 -41545
18945 -41545 -59403 -101809 -87661 -50572 4832 -16317 -55782 -27526 -2487 46615 -12955 -96059
18933 -96059 -56293 -125 -4546 51553 118073 102558 109797 92117 44623 8769 27841 67931
18921 67931 91022 35531 30636 29085 33668 34407 -6339 2272 23075 4751 7659 27381 42358
18908D2358l1201K6913L0075l2391J0380l0894K750J4214L1933L612j8501m9297
18896d9K3404R854k6966M8914J934m893M3402N2820M9314p0750n9952P287l348
18883G0971j6078j9947O687j116k5496K4705N4631j9508o1307l8616P601K5413
18871G940K3921O6348K2498J4519O6216j0083o4958l2451M9873m494l9467l3911
18859F5951j9225J4121p3291k6219N5693k0291J4731L4929k4662j2148J5852k7792
18847b351L7533K6585N4770L8339J302m9452k320k0335M0024J600P242q907L215
18834A27245l4603o5094k5314L1866J5058l0960m5431O5895N8676p5953l2638
18823a1253j2841l5074K4655J5090L5618K3529L0623K2255L6180k3377p4730o717
$$ plain form
18908 42358 11157 38070 68145 35754 46134 15240 17990 32204 64137 67749 49248 -49
18896 -49 23355 33209 6243 55157 57091 52198 95600 148420 197734 126984 67032 74319 70971
18883 70971 54893 34946 41633 40517 15021 39726 94357 74849 13542 -25074 -17473 7940
18871 7940 31861 98209 120707 135226 201442 191359 126401 93950 143823 139329 99862 65951
18859 65951 46726 60847 -12444 -38663 17030 -3261 11470 46399 21737 9589 25441 -2351
18847 -2351 35182 61767 116537 154876 156178 106726 104406 84071 124095 125695 132937 124030 127245
18834 127245 92642 27548 2234 34100 49158 18198 -27233 38662 97338 21385 -11253
18823 -11253 -24094 -59168 -34513 -19423 16195 39724 70347 92602 128782 105405 30675 23958
18811B3958q8894k3154K6163J6853L5038M0310l1947M3051K5423L6525k4634l9265
18799C9427L5330L2306k2818k3165L667N1880k238o8428k460K6673k1005m075
18787D5094N7274J5901J4929r63k7437m607l5647J4549L4641P2438K4016j1652
18775A98536m8742R734J7102L0326J5691M2371J4539L4870N2854J23617Q4273
18764E75171j1946j09375p8651l5990O134q9530q2170n4955K577N265J31l9453
18752H7208j6509K4523J8518j6259k3731r396j0385L1430K8520o8806Q534O481
18740F0128k5209p3409L0071K2865m1156O6330K3331J2461J2175n1067m3567O640
18728d07J5863O1898P7393K5939n7040l4224J9434n952P139j3631m9593m6777
$$ plain form
18811 23958 -64936 -88090 -61927 -45074 -10036 30274 -1673 41378 66801 103326 78692 39427
18799 39427 74757 107063 84245 61080 64747 116627 114389 45961 43501 70174 49169 45094
18787 45094 102368 118269 133198 132235 104798 100191 64544 79093 113734 186172 210188 198536
18775 198536 149794 159528 176630 206956 222647 265018 279557 314427 367281 490898 575171
18764 575171 563225 453850 375199 339209 345343 255813 173643 118688 121265 126530 126661 87208
18752 87208 70699 95222 113740 97481 73750 64354 53969 85399 113919 45113 53647 60128
18740 60128 34919 -38490 -8419 14446 -26710 39620 62951 75412 87587 36520 -7047 -407
18728 -407 15456 77354 154747 180686 123646 89422 108856 102904 110043 96412 46819 42
18716D2j7671L5008N6238l8070J3236j0902o6039k6790K544K0626Q835l8049K8884
18703c2108P1025m5590q0943j3713k1049Q135J04116L3363Q871q917O66J8836
18691D2692R32K4583O686l0483l8598J5368k9769L832M7685K672K705r851j9891
18678A8563J8789M7494Q483n1882j1808Q754r778L1238O443J4812p4243k3035
18666a6170K3284J4242j1249N2546N1297K7757q519n9081J1457N2611j0125l4058
18654I3992n526l0213k5262L9413L8482r833P910L380O648m309M5617Q197K2349
18641A90845N6209K156o0503J598l368m4918K7625N2687n721O406K8334M8418
18629B99768J5497n5225j5193l672J4393n4562k3057N0633N3874q614J2221k1900
$$ plain form
18716 42 -17629 17379 73617 35547 48783 37881 -28158 -54948 -52404 -31778 -22943 -60992 -32108
18703 -32108 38917 -6673 -87616 -101329 -122378 -114243 -10127 23236 32107 23190 23856 42692
18691 42692 43624 68207 74893 44410 5812 21180 -8589 -4757 42928 45600 48305 38454 18563
18678 18563 37352 84846 93329 41447 29639 38393 28615 59853 66296 81108 6865 -16170
18666 -16170 7114 21356 10107 62653 113950 141707 133188 74107 85564 138175 128050 93992
18654 93992 88466 58253 32991 72404 110886 101053 108963 112343 118991 114682 160299 168496 190845
18641 190845 247054 249210 188707 190305 186937 142019 169644 222331 216610 223016 251350 299768
18629 299768 315265 260040 244847 241175 255568 201006 177949 228582 282456 273842 286063 264163
18617B64163k5986L1096L6715K5656O7838Q068l5543M2387O1062j1186o0612K4119
18605D27777P707J0939J00258L3033N1941K08486J75238J26963J66526K72221
18595A581089L72988L14610J69335p0285j93658q7071L8256J95326J89636k2364
18585B487862k71047l31544k55108k10131j42534l4618p0263m4695k0874L5729
18575A142777M4189R6438M704j3183j532J8094J8882R5875R6794P735Q8519L7485
18563A636777R5542J01136J18313Q7475R7435P5325J00112J68904K07099L08980
18553B997098M09135M16641M93641P07267R70403J390662J887700K256838K731224
18544A4260609L372690M338809N594903O128193M269862N83985j073892p098K305233
$$ plain form
18617 264163 238177 269273 305988 331644 399482 407550 372007 414394 475456 464270 403658 427777
18605 427777 435484 446423 546681 579714 631655 840141 1015379 1142342 1308868 1581089
18595 1581089 1954077 2268687 2438022 2367737 2174079 2087008 2125264 2320590 2510226 2487862
18585 2487862 2216815 1885271 1630163 1420032 1277498 1242880 1172617 1127922 1107048 1142777
18575 1142777 1186966 1283404 1288108 1274925 1273393 1291487 1310369 1406244 1503038 1510773 1599292 1636777
18563 1636777 1732319 1833455 1951768 2039243 2136678 2212003 2312115 2481019 2688118 2997098
18553 2997098 3406233 3822874 4316515 5023782 5994185 7384847 9272547 11529385 14260609
18544 14260609 17633299 21972108 27567011 33695204 37965066 38549051 37475159 37468061 39773294
18535C9773294M989842P219898P171988L941490m42495m290985o328388n112156
18527D6922488k303214P07318J854390k92479m177125n639250m502632k428213
18519C0141283k12420J764284L523592N343137P299433R687097J2897383J6131928
18511H6575717J6146358Q732832k831952q982036o843380o22840M999254M695544
18503A01869497m064769j4522694j7949142j5268810j0988811p347742m901168
18496B6826361l393971k483497j868542j437181j173382r75655p16165n87136
18488A4190832n23765m69178l84129l13561j03765j1128R8529K51631M36350O23064
18478A3794880O33696J82970n51193q60608o43110k69507J6971l4382m53342j018844
$$ plain form
18535 39773294 44763136 51983034 59155022 63096512 62654017 58363032 52034644 46922488
18527 46922488 44619274 45326592 47180982 46888503 42711378 37072128 32569496 30141283
18519 30141283 29928863 31693147 35216739 40559876 47859309 57546406 70443789 86575717
18511 86575717 102722075 111454907 108622955 99640919 92797539 92174699 97173953 101869497
18503 101869497 97804728 83282034 65332892 50064082 39075271 31727529 26826361
18496 26826361 23432390 20948893 19080351 17643170 16469788 15494133 14777968 14190832
18488 14190832 13667067 13197889 12813760 12500199 12396434 12385306 12483835 12735466 13171816 13794880
18478 13794880 14428576 14611546 14060353 13199745 12556635 12287128 12304099 12269717 11816375 10797531
18468A0797531j109123q75514p02821o24242n30646l69342l10142j96963j70863
18459E907875j55847j30668j25949k42920j63695j79682k55794j84038p1020j24877
18449D273385q1659r7557j15722m7791j0058L7612K03630K67517L70695N29556
18439E329608P19863P07643K59893o02345r91656q41889o43104m27755l29193
18430C181065k19062j66627j39304j23712p3981q4775p7026l6697K7749l0397
18420B257233M6102P3303J03210J57298K57943M18331O12619P61053R60985J330835
18410F978912J568635J976401K494887L040132L891023M416409K868368j322052
18402B5912715m633449m897871l798162k607907j636874j101706o62790l68683
$$ plain form
18468 10797531 9688408 8812894 8110073 7485831 6955185 6585843 6275701 6078738 5907875
18459 5907875 5752028 5621360 5495411 5252491 5088796 4909114 4653320 4469282 4398262 4273385
18449 4273385 4191726 4094169 3978447 3930656 3920598 3958210 4161840 4429357 4800052 5329608
18439 5329608 6049471 6757114 7017007 6414662 5423006 4581117 3938013 3510258 3181065
18430 3181065 2962003 2795376 2656072 2532360 2458379 2373604 2296578 2259881 2287630 2257233
18420 2257233 2303335 2376638 2479848 2637146 2895089 3313420 3926039 4687092 5648077 6978912
18410 6978912 8547547 10523948 13018835 16058967 19949990 24366399 27234767 25912715
18402 25912715 21279266 16381395 12583233 9975326 8338452 7236746 6573956 6205273
18394F205273r5370N0205L78507P30944R73486J356502J838728K245094K447874
18385A6131243K384646K372944J629015m33849k129391k207052j325545k44500
18377A6177511Q58381J779943J759182l74910k930464l433240k747435j893648
18369I195320j195528p24425m41831j88749Q2880K68668M82075O89712J089626
18360I257748J596053K055495K596515L165925L929501M972630N515454L790443
18352C6879764r00722n417278o640122n566187l934935k579439j695244j147328
18344H998509q15571n40711l11200j35097J85448M01576O72690Q96725J222835
18335A0575204J537595J938846K403162K666681J820422k97649j669684j502079
$$ plain form
18394 6205273 6109903 6160108 6538615 7269559 8243045 9599547 11438275 13683369 16131243
18385 16131243 18515889 20888833 22517848 22083999 19954608 17747556 16422011 16177511
18377 16177511 17035892 18815835 20575017 20200107 17269643 13836403 11088968 9195320
18369 9195320 7999792 7275367 6833536 6644787 6727667 6996335 7478410 8168122 9257748
18360 9257748 10853801 12909296 15505811 18671736 22601237 27573867 33089321 36879764
18352 36879764 35979042 30561764 23921642 18355455 14420520 11841081 10145837 8998509
18344 8998509 8182938 7642227 7331027 7195930 7381378 7782954 8455644 9352369 10575204
18335 10575204 12112799 14051645 16454807 19121488 20941910 20644261 18974577 17472498
18327A7472498n94912N68524J625712J661893l67070k814473l285585k727368
18319A1539219j968872j395991r70521o59293l83105k61830j33223J1292J67106
18310E944782K75220M46830O85086R69116J187899J598879K045477K042868O29042
18301A5825199j758125k722647k483965j846786j256243p81532n48616m71141
18293C956144l34115k52163k26084j39887j79873j38627j43201q9529j11326K5
18283B341364N131o7375j34554m5724o0350q8767o6788l4022N2749K5784L6771
18272A964219l438R7506J71760P9537m5882k20685k68404j96314j45127q7292
18262A345880o5743m9830n8560r7209r8412m8383k0876q820l7575p2680m8760
$$ plain form
18327 17472498 16877586 17446110 19071822 20733715 20366645 17552172 14266587 11539219
18319 11539219 9570347 8174356 7203835 6544542 6161437 5899607 5766384 5777676 5944782
18310 5944782 6220002 6666832 7351918 8321034 9508933 11107812 13153289 15196157 15825199
18301 15825199 14067074 11344427 8860462 7013676 5757433 4975901 4427285 3956144
18293 3956144 3622029 3369866 3143782 3003895 2824022 2685395 2542194 2452665 2341339 2341364
18283 2341364 2346495 2279120 2144566 2098842 2038492 1949725 1882937 1848915 1901664 1927448 1964219
18272 1964219 1960781 2058287 2230047 2309584 2263702 2043017 1774613 1578299 1433172 1345880
18262 1345880 1280137 1230307 1171747 1074538 976126 927743 906867 898047 860472 787792 739032
18251G39032J8348n7389o5160k1663j5692L4051j1639J2281N3683j2873m0625
18240F32354m0770l7119q468M4398k7261o8597L7551K5214M0993P588o0775o8394
18228D76714m1206k60k0685l1807n0667j6006L4003J994o764K2058J4948M2612
18216D24934P6912l2017p9589m9377k5920Q96L3372K7578n5335M041k093J3719
18204C37121k9362j6790K6961K6517J6156K6949K4384N5002n4686l1086j4620
18193C66546j3309j6085J9262N801m4252l8586j0511L3398K4417m931M8209l7069
18181C32890k5153K7495m457m566K2184j8516j4170m4211j4323K6035k9672K1353
18169B74889N1034P183l4680N901O4965j7585k5285r457J9365K7669O7904L8959
$$ plain form
18251 739032 757380 699991 634831 613168 597476 631527 619888 632169 685852 672979 632354
18240 632354 591584 554465 545997 590395 563134 494537 532088 557302 598295 605883 545108 476714
18228 476714 435508 435248 414563 382756 332089 316083 350086 352080 345316 367374 382322 424934
18216 424934 501846 469829 390240 340863 314943 315839 349211 376789 321454 325495 323402 337121
18204 337121 307759 290969 317930 344447 360603 387552 411936 466938 412252 381166 366546
18193 366546 353237 337152 356414 362215 317963 279377 268866 302264 326681 321750 369959 332890
18181 332890 307737 335232 330775 326209 348393 329877 315707 271496 257173 283208 253536 274889
18169 274889 325923 333106 298426 304327 369292 351707 326422 316965 336330 363999 431903 470862
18157D70862o5735k6577Q7166L268m6864n1235K8010J5933O4640Q5990r822P888
18145E63524k4773n2328n4653K2177n2360J6341J14674M7790n42K9429L7324J2120
18133F58723M8164L7040Q2729J06488J20175J24924J29073J03618K06573K59997
18123A877504K54276L10748M39404O23769Q56741J073234J433864J978223K830452
18114A1678215L969407N218639O419173P878260R988102J3432454J7259716J2832257
18106H8676223m553845j8828080j9048374j4221634r039679n599602l566034k423350
18098A1395625j817463j352891j021049p45415n55166m62354l74783l19364l15511
18089D431629k04084j20551j40181j35003j43346r0658j21845j31006j00380p5978
$$ plain form
18157 470862 405127 378550 465716 468984 422120 370885 398895 414828 479468 565458 555636 563524
18145 563524 538751 486423 431770 453947 401587 417928 532602 580392 579850 609279 646603 658723
18133 658723 706887 743927 826656 933144 1053319 1178243 1307316 1410934 1617507 1877504
18123 1877504 2131780 2442528 2881932 3505701 4362442 5435676 6869540 8847763 11678215
18114 11678215 15647622 20866261 27285434 35163694 45151796 58584250 75843966 88676223
18106 88676223 84122378 65294298 46245924 32024290 22984611 17385009 13818975 11395625
18098 11395625 9578162 8225271 7204222 6458807 5903641 5441287 5066504 4747140 4431629
18089 4431629 4227545 4106994 3966813 3831810 3688464 3597806 3475961 3344955 3244575 3168597
18079C168597K8417K5895j9296n5910K0035N7028r611l0062n2627r0376j25509
18068B916581j82167q6195p7829r4447j26737m5894o0839n1739o8495j28943r9685
18057A893611r0210r3057j19426m4914o1950r0574o8061l9164k0750o4897j07369
18046A093239k0289q0748n1558j8949n8998m6285k7504q0540m5519k1532o199
18035F35118N7800J7777m4810o4762q779k5089P936k6653J126k4450O07L5731
18023E61552J0566J5972N7392J2013j0512K4756O3558J1121j2781J3974k9292
18012G18319l5620L2215N4662p7983o2352l3951l1163o806m548l9779n7049l8458
18000D17487O7526K2992J2809N050p7858p0518P225M5855j3625R748j6430J2026
$$ plain form
18079 3168597 3197014 3222909 3203613 3147703 3167738 3224766 3215155 3185093 3132466 3042090 2916581
18068 2916581 2734414 2648219 2570390 2475943 2349206 2303312 2242473 2190734 2122239 1993296 1893611
18057 1893611 1803401 1710344 1590918 1546004 1484054 1393480 1325419 1286255 1265505 1200608 1093239
18046 1093239 1072950 992202 940644 921695 862697 816412 788908 708368 662849 641317 635118
18035 635118 692918 710695 665885 601123 592344 567255 575191 548538 549664 525214 525821 561552
18023 561552 572118 588090 645482 657495 646983 671739 735297 746418 733637 747611 718319
18012 718319 682699 714914 769576 691593 629241 595290 564127 557321 552773 512994 455945 417487
18000 417487 485013 508005 520814 525864 448006 377488 384713 430568 416943 426691 410261 422287
17988D22287K6533l3144l7579q626k5453m6573M6565N1745N3177j7566p1844q7583
17976B71939l1243N647P686l4615J9055N9366K3975M0064K4426q177o8007L5226
17964C45342J6846N8750R710l9907L5264o6430q5929l6180K5893O0053J4485l8808
17952B99089l6167m2927J1361M9853L1741o2039J0373Q569K7424J4106m4888k7466
17940B39029R4326N4280j2597q2425l5179k0416J3934M6639q9278k6894k8869
17929A52550n276j8050k6277k3203k4139l2078J2551L3979L0956L7762M1620l930
17917A76465k2638m4919o6195M2315N3745K8272J8386j9398j0241o649P0042J3474
17905B32659q2774J7022M797l609L7949J0945o8650J2772j9269l0567J25284K7614
$$ plain form
17988 422287 448820 415676 378097 369471 344018 297445 344010 395755 448932 431366 359522 271939
17976 271939 240696 246343 254029 219414 238469 297835 321810 361874 386300 378123 310116 345342
17964 345342 362188 420938 430648 390741 426005 359575 273646 237466 263359 323412 337897 299089
17952 299089 262922 219995 231356 281209 312950 250911 261284 269853 297277 311383 266495 239029
17940 239029 333355 387635 375038 292613 257434 237018 250952 297591 208313 181419 152550
17929 152550 147274 129224 102947 79744 55605 23527 36078 70057 101013 138775 180395 176465
17917 176465 153827 108908 42713 85028 138773 167045 185431 166033 155792 149143 219185 232659
17905 232659 149885 166907 171704 168095 206044 216989 148339 161111 141842 111275 236559 264173
17893B64173N913K7657l7608p0513k5113k8751Q0542L7132o7951l7889l4079k0281
17881I3232M2872j3349L4652R1952K8209R791l3879l6515J9764L7784n6196m1237
17869A77080m4953n8534J4715R442j4681l4877k1491L5979Q0252Q3452J3000n5771
17857A83613l0695L4830K12o06l2143j0493M86R713n8790p6229M515J979L2237
17844E8629R1525M6487J8065j6194O1781L6836k5008n8571o0836l6618l0093m4238
17832D1765J7282L1299J9349J7464j112k7765M2562P8411J6939n7232j0971P92
17820A68783J7707N3631n5602q2697l8358L4942J7899K2130q910j493k3510O657
17808A11179L7564M7374L4465p4836J4717K3004k1748k0664Q927Q066L2574j6742
$$ plain form
17893 264173 270086 297743 260135 189622 164509 135758 216300 253432 185481 147592 113513 93232
17881 93232 136104 122755 157407 249359 277568 287359 253480 216965 236729 274513 218317 177080
17869 177080 132127 73593 88308 97750 83069 48192 26701 62680 142932 226384 239384 183613
17857 183613 152918 187748 187960 187354 155211 144718 145204 154917 96127 19898 24413 26392 58629
17844 58629 150154 196641 214706 198512 260293 297129 272121 213550 152714 116096 86003 41765
17832 41765 59047 90346 109695 127159 126047 98282 140844 219255 236194 178962 167991 168783
17820 168783 186490 240121 184519 101822 63464 98406 116305 138435 129525 128032 104522 111179
17808 111179 148743 196117 230582 155746 170463 193467 171719 151055 159982 168048 200622 183880
17796A83880p2868j2290J9256Q489O9892j2727L952n8519l0973j6915j2400P527
17784G6304K3293N1324J8624n9634n7043k5448K384l3742k9352K0282j548p1714
17772h6270k6137J02903J07679k6666J8088K7995j9071n2088m1541k3334r661
17761b8103L4341N3875J3025k5099j1095M7145p340l1735p9294j7049k0908M1849
17749c0388N7024L34l9612K4392J3835o549L0027n645k1513j9008k1198M1772
17737B3471M732j1163p219J655l7067j2052O5287L3001J1080p14K9781j3537N5724
17724A42979J7619j01115q3684k9261J7060N8261J1102K0080J5999n666l0139
17713C3235k0004n0492L024M3525N8479L92j5847k5072P082K69J2641n0512l7641
$$ plain form
17796 183880 111012 98722 117978 126467 196359 183632 187584 129065 98092 81177 68777 76304
17784 76304 99597 150921 169545 109911 52868 27420 29804 -3938 -33290 -13008 -14556 -86270
17772 -86270 -112407 -9504 98175 71509 89597 117592 98521 46433 4892 -18442 -28103
17761 -28103 6238 60113 73138 48039 36944 84089 76749 45014 -34280 -51329 -72237 -30388
17749 -30388 26636 26970 -12642 11750 25585 19036 49063 43418 21905 2897 -18301 23471
17737 23471 28203 17040 9821 11476 -25591 -37643 27644 60645 71725 71011 100792 87255 142979
17724 142979 160598 59483 -24201 -53462 -36402 21859 32961 53041 69040 63374 33235
17713 33235 13231 -37261 -34237 9288 67767 68159 52312 27240 34322 34591 47232 -3280 -40921
17700d0921l0717L6600K8668Q6544m580m6274o5555J6019J3282R146Q3149K5214
17688A10575L737k7832j717q45o1085J751l9548j1154K5945r079N1681l6560J3929
17675A9798j8495j6133K3672K6699J3079o947j01436m2428j584N0021R849q335
17663e2240K0691O5196J2052J0080l3303P1377k1530l2659j0144n3045N5275J6925
17651D8675m1656j271J3127J0954P428k4878p8503M7060M4033Q1370L0518m8961
17639H7896p5300j6331j2754j7845L6422k043m911k736p422j4581Q8173M4174
17627A02742n6771m8324l7798J0666L6846L4574L389r5099J3179K9953M1305k6772
17615G890j13934J1736M3889L8318k1592j6543j5255p408L3164J8008J5770O037
$$ plain form
17700 -40921 -71638 -35038 -6370 80174 75594 29320 -36235 -20216 -6934 2212 85361 110575
17688 110575 114312 86480 84763 83918 22833 24584 -14964 -26118 -173 -9252 42429 5869 19798
17675 19798 1303 -14830 8842 35541 48620 41673 -59763 -102191 -103775 -53754 -43905 -52240
17663 -52240 -31549 33647 45699 55779 22476 93853 72323 39664 29520 -23525 31750 48675
17651 48675 7019 5748 18875 29829 37257 12379 -66124 -19064 24969 106339 136857 87896
17639 87896 12596 -3735 -16489 -34334 2088 45 -4866 -7602 -15024 -29605 58568 102742
17627 102742 45971 -2353 -40151 -29485 7361 41935 45324 -49775 -36596 -6643 34662 7890
17615 7890 -106044 -94308 -50419 -12101 -33693 -50236 -65491 -72899 -39735 -21727 -5957 80
17603H0J4117j8060l5689J7135M9331N2005l3682l4816M6434m315j9916o335M5445
17590G1734J074o3604k0981o729l4020J02762N1010n6609o4761N6920R3801l2893
17578I7704m103m236l0101k5003J9955L990J52k7644p3157j3036M2524J4698L7772
17565C9515Q3407j446j01836m2492N460L579j4970m8807m6544J1562J6861O7568
17553b8143N5980Q905M4252n2703n1189R8550l0289J684q407o7590j466K3240
17541g176N2955M755j3224J2643Q139l1820P590R704L1218M0310l7765k1249q0603
17528b4523l1343K8855P7121O0093n2393r797J5186J2890J0448q6630m6543M6951
17516C15o7771l2318L1268N2320N5681J5373O2141k1238o4653n5270N5080J0213
$$ plain form
17603 80 14197 -3863 -39552 -22417 26914 78919 45237 10421 56855 52540 32624 26289 71734
17590 71734 72808 9204 -11777 -18506 -52526 50236 101246 44637 -20124 36796 130597 97704
17578 97704 93601 89365 59264 34261 54216 58206 58358 30714 -42443 -55479 -12955 1743 39515
17565 39515 122922 121476 19640 -22852 -17392 -13813 -28783 -77590 -124134 -112572 -95711 -28143
17553 -28143 27837 36742 80994 28291 -22898 75652 45363 47047 38640 -28950 -30416 -7176
17541 -7176 45779 50534 37310 49953 58092 26272 33862 43566 74784 115094 77329 56080 -24523
17528 -24523 -55866 -27011 50110 110203 57810 48013 63199 76089 86537 -93 -46636 315
17516 315 -67456 -99774 -68506 -16186 39495 54868 117009 95771 31118 -24152 30928 41141
17504D1141r785j0797O0519K0247j4855n6245k2896L5681m0100n0906L634O02
17492d3760J1158L4343M3914nj4001R0582M2008P612M670q9012k3680K4534r91
17479H7372J5360J036k9663M962l2374J6360j9310K1005m0431l5017j1330J0977
17467a1053M9999M1731K664K8109k2707m2185m8285m272J9464Q8044j0577l163
17455H7769r09k1512l7961J3341K301j522J4457M5909K639j0284L1501P4468J36124
17442C36321J43533O5471K8065r5666j17045j29097j49963j21652K2537J08909
17432I1413k1210l7543P678k4328J6071J0882o7729l1759P6425m3989n8125O7627
17420a4587P630K9879M160L1953j7067R501K2207k6498K2025n9347l1721N5172
$$ plain form
17504 41141 31356 20559 81078 101325 86470 30225 7329 43010 2910 -47996 -44362 -43760
17492 -43760 -32602 1741 45655 45650 31649 122231 164239 171851 176521 87509 63829 88363 87372
17479 87372 102732 103768 74105 79067 46693 63053 43743 64748 24317 -10700 -22030 -11053
17467 -11053 38946 80677 83341 111450 88743 46558 -1727 -5999 13465 101509 90932 87769
17455 87769 86860 65348 27387 40728 43029 41507 55964 101873 104512 94228 125729 200197 336321
17442 336321 479854 545325 573390 477724 360679 231582 81619 -40033 -17496 91413
17432 91413 70203 32660 40338 16010 32081 42963 -24766 -56525 19900 -24089 -82214 -14587
17420 -14587 -6957 22922 27082 59035 41968 51469 73676 47178 69203 9856 -21865 33307
17408C3307P204k1790R398m1672j1562L7284M8231k594k0067n1001o3327J5549
17396f1040J0007l722R814j7147L3324j7496J961K3738K4538k8684M63K6895j0081
17383g430k7410p0750j7004j0274L2774L9222K9815K1723M4558j2208k1216L7939
17371C9739N8090j4566l3526J8558Q747k0419k8924J2231k5280n3679R588O4631
17359C5190K8295M832n0437K538m5521j9603k579P41O2529J9135k4454J3712j8677
17346E701M2487j092R236R764j330k2526K152N5638k1365n1216j0521j6808j9169
17333a9049l0198k415O168L3914K9841L2161n9500k2543M5962r324O907l3456
17321b1532l1765j4304k1381J2787O2608K520R336j5538m831O003M5628j4972
$$ plain form
17408 33307 40511 18721 28119 -13553 -25115 12169 60400 57806 37739 -13262 -76589 -61040
17396 -61040 -51033 -54755 -44941 -62088 -28764 -46260 -44299 -20561 3977 -24707 -24244 2651 -7430
17383 -7430 -34840 -105590 -122594 -132868 -100094 -60872 -31057 -9334 35224 23016 1800 39739
17371 39739 97829 83263 49737 68295 77042 56623 27699 39930 14650 -39029 -29441 35190
17359 35190 63485 68317 17880 20418 -25103 -44706 -47285 -46544 15985 35120 10666 24378 5701
17346 5701 48188 47096 56332 66096 64766 42240 44392 100030 78665 27449 16928 120 -19049
17333 -19049 -49247 -51662 -45494 -11580 18261 50422 -9078 -31621 14341 5017 11924 -21532
17321 -21532 -53297 -67601 -88982 -76195 -13587 -11067 -1731 -17269 -22100 -16097 29531 14559
17309A4559l54m4606n4235J8473K6026R4246L016j7097k97Q50K1400p161p98K8922
17295H2944m1571m2769L9704j7832m0024j0936L3909K0046K9296J3260j06695
17284d0668J7935O3518j1898o57l0751j1770M63P376k1175m9682K19Q65K5858
17271e0367o784J4925j6057J0961J7748O1788l3580j00467j7255P9684R0232j4796
17259C6032k6896K8178P0594q778n7924p3049m9040M3714L966j3950l2309K9729
17247d9733K3946N7648j3043k6939l9133J915J8641N208k5603J7609m560j1103
17235d5147l8018K5942L2330J658J1440L4142J1871J8979L3189m276r7400j4868
17223c0158l276J2500N6514L3337K4233J6867J0473l3319m8812l8997o1591L3648
$$ plain form
17309 14559 14205 -30401 -84636 -66163 -40137 54109 57125 40028 39731 40581 61981 54820 54022 82944
17295 82944 41373 -1396 38308 20476 -19548 -30484 3425 23471 52767 66027 -40668
17284 -40668 -22733 40785 28887 28230 -2521 -14291 -13828 -6452 -27627 -77309 -77090 -76225 -50367
17271 -50367 -57151 -42226 -58283 -47322 -29574 32214 -1366 -101833 -119088 -39404 50828 36032
17259 36032 9136 37314 107908 99130 41206 -31843 -80883 -37169 -33203 -47153 -79462 -49733
17247 -49733 -25787 31861 18818 -8121 -47254 -45339 -26698 -21490 -47093 -29484 -34044 -45147
17235 -45147 -83165 -57223 -24893 -23235 -11795 22347 34218 53197 86386 82110 -15290 -30158
17223 -30158 -33434 -20934 35580 68917 93150 110017 120490 87171 38359 -638 -62229 -28581
17211b8581O6447l9819n3389m6990M1411P6307l3838m4612o796Q0909N8175m761
17199F4463o3319j0979N3826J1143l8561m0006l5985J1765n6101j7102l2296K9006
17187a24146J48394J43483k5340j05540n5921j671j5354k9326K6543O0846k0397
17176A571l3259k766q358l5929J004M2008N4220j7963j5090j8816k6913j0871
17164g1162N7531M4006M2310n2960k2666R595K2261L8045l1686q1309k1358j0973
17152g8366M2195M4913J6197l483N9227j2403l7152j4366k4040l983j5891O6569
17140C9417L8742k112r369o8229J1747m2703P775L719j3647k5889N259K9078N428
17127b0784m679m3377J7140j581m3050K6327M5320L9418L4690n7155k8433K2035
$$ plain form
17211 -28581 37866 -1953 -55342 -102332 -60921 15386 -18452 -63064 -69860 11049 69224 64463
17199 64463 1144 -9835 43991 55134 16573 -23433 -59418 -47653 -103754 -120856 -153152 -124146
17187 -124146 24248 167731 142391 36851 -19070 -20741 -36095 -65421 -38878 21968 1571
17176 1571 -31688 -34454 -42812 -78741 -77737 -35729 18491 528 -14562 -33378 -60291 -71162
17164 -71162 -13631 30375 72685 19725 -2941 6654 28915 66960 35274 -46035 -67393 -78366
17152 -78366 -36171 8742 24939 21456 80683 68280 31128 16762 -7278 -11261 -27152 39417
17140 39417 78159 76047 66678 -1551 10196 -32507 -24732 -21013 -34660 -60549 -55290 -26212 -20784
17127 -20784 -25463 -68840 -51700 -53281 -96331 -70004 -24684 14734 49424 -7731 -36164 -14129
17115a4129M0280n8071l3547J4749J4767R1971L1549l9292j20037o2410P7611
17104e6559P2199K6206k3623l6213n9286n2571p367M9774L4838J8474L0157M4476
17092D0505K5063L6190k6829k7578n959J3973m859J1656R193j8458j0849o3295
17080b1247j5269L1013n067k5956j7834L199Q9785j2133q283K2083O010l8961
17068G340l8570L5318L5558j4187J7472o9825R611K202k9363k9972K2295L0464
17056b1657p867L887K4913o8087p402L2919Q7749L236k2174k3830L534j1264k4714
17043c0757L8280O7626j1579k9812K517Q940n9305o0823n803L0439K6179L1915
17031G817L2251l6037j1613j1434j7517R992M2159O1765L8438o475o0980m2506
$$ plain form
17115 -14129 26151 -31920 -65467 -50718 -35951 56020 87569 48277 -71760 -134170 -56559
17104 -56559 15640 41846 18223 -17990 -77276 -129847 -137214 -87440 -52602 -34128 -3971 40505
17092 40505 65568 101758 74929 47351 41392 55365 50506 62162 71355 52897 42048 -21247
17080 -21247 -36516 -5503 -10570 -36526 -54360 -51161 38624 26491 18208 40291 46301 7340
17068 7340 -31230 4088 39646 25459 42931 -26894 -17283 -15081 -44444 -74416 -52121 -21657
17056 -21657 -29524 -25637 -724 -68811 -76213 -43294 44455 47691 25517 1687 5221 -6043 -30757
17043 -30757 7523 75149 63570 33758 36275 45215 -14090 -74913 -80716 -50277 -24098 7817
17031 7817 40068 4031 -7582 -19016 -36533 -26541 15618 77383 115821 109346 48366 5860
17019E860L8140j2342l9183l0162K6051N0494l4831r1594l3261O0678Q3447N1147
17007G4444r488O0q374j881n931p1102K464M3262O903k3309j34245k0002P6034
16994g1165N1553N2391J4535l1876j0495m4833M35J8021R036M4841m3348K1196
16982A0291k0501j5215l1549j2814p52J2270K7310k1462m9789k1238l196M9166
16970g7479M2372K1653k9132M8373K4612n2349J1294J7330J5178j3934J6741j2538
16958A2121l151J7258R7945N2612p4387q7430k3971k5165m492K5023K6967M9389
16946F2719K7525l071o7387p5339O6969Q4072l3934j3301N3997n9365m8763k219
16934h097j942M6117K2510l3043p925J3363n6202K0918N1111J6269m2603o2726
$$ plain form
17019 5860 44000 31658 -7525 -37687 -11636 38858 4027 -87567 -120828 -60150 23297 74444
17007 74444 64956 65016 56642 54761 48830 -22272 -19808 23454 30357 7048 -127197 -147199 -71165
16994 -71165 -19612 32779 47314 15438 4943 -39890 -39455 -21434 -12398 32443 -10905 10291
16982 10291 -10210 -25425 -56974 -69788 -70540 -58270 -30960 -52422 -102211 -123449 -126645 -77479
16970 -77479 -35107 -13454 -42586 5787 30399 -21950 -10656 6674 21852 7918 24659 12121
16958 12121 8970 26228 124173 176785 102398 14968 -9003 -34168 -38660 -13637 13330 62719
16946 62719 90244 87173 19786 -55553 11416 95488 61554 48253 102250 42885 -5878 -8097
16934 -8097 -10039 36078 58588 25545 17620 30983 -25219 -4301 46810 63079 20476 -42250
16922d2250n093j7805L7391O7660M6501j01095n272k9689l6157M0096M2804O5244
16910F2335L0559l4047L1884j6757m4126n0269k4556K8849N9075J1151l5637l7852
16898a9391K324L1131k7006J2859J7016J2734o0466k2955k506K9781m9864j1866
16886h8209N6201K0554j7897K6441K630l1073N2295P7143L8227j9137j05995m7442
16874c6262K371J0682P3829N1625K516n5931n5804k6861O419k3394p7988j0971
16862a39769J00043L8977j648j7105L1127q672j2195K2221L7453k3879l090j0982
16850A2481j8683J3451Q7172m0322n5870q324J1811N0540Q718K1656J885O432
16838I0947n1101J201K6469l6087m2854k9682K0254P4674l9584k2395k729k0418
$$ plain form
16922 -42250 -47343 -65148 -27757 39903 86404 -14691 -19963 -49652 -85809 -45713 -2909 62335
16910 62335 92894 58847 90731 73974 29848 -20421 -44977 -16128 42947 54098 18461 -19391
16898 -19391 -17067 14064 -12942 -83 16933 29667 -30799 -53754 -56260 -26479 -76343 -88209
16886 -88209 -32008 -11454 -29351 -2910 -280 -31353 20942 98085 136312 117175 11180 -36262
16874 -36262 -33891 -23209 50620 102245 104761 48830 -6974 -33835 -27416 -50810 -128798 -139769
16862 -139769 -39726 -749 -2397 -19502 11625 2953 -9242 12979 50432 26553 23463 12481
16850 12481 -6202 7249 94421 54099 -1771 -10095 1716 52256 60974 82630 84515 90947
16838 90947 39846 41047 67516 31429 -11425 -41107 -20853 53821 14237 -8158 -10887 -31305
16826c1305k069k6355l3436L7876J8592l6015m714J9501J9801L8294L0843N1677
16814H2690j6550p6647n7286K6893j2840l0571M0K2393M8351m7609M3370J4169
16802c597j2836Q161K021M2431Q1232K9415n1519o4410p0408L235l434M8607K6914
16789C5812m4559K2823K2662k5797m4978p836k8351J914Q151N6265j315M8086
16777D2877N143L546q793l5346r1180J7123M2504P7570j8416j3819J314K622K1940
16764D7085N0729K190l0704l060k1550p183k494J5069J9452l7397o11n401K1265
16751D7390K7705k135j2974k981O2099N43l9433m9591q3414M890J2456N1361M8151
16738F4067J4740n4268m3617L8595M3148m5318j7383n020k2385L8545M4209p2016
$$ plain form
16826 -31305 -33374 -59729 -93165 -55289 -36697 -72712 -77426 -57925 -38124 170 31013 82690
16814 82690 66140 -10507 -67793 -40900 -53740 -84311 -84271 -61878 -13527 -61136 -17766 -3597
16802 -3597 -16433 -8272 -6251 36180 117412 146827 95308 30898 -39510 -36275 -39709 8898 35812
16789 35812 -8747 14076 36738 10941 -34037 -41873 -70224 -68310 -60159 -3894 -5209 42877
16777 42877 48020 51566 42773 7427 -83753 -66630 -24126 53444 35028 21209 22523 25145 47085
16764 47085 97814 100004 69300 66240 44690 37507 35013 50082 69534 32137 31526 26125 47390
16751 47390 75095 72960 59986 57005 119104 119647 80214 30623 -52791 -47901 -35445 15916 64067
16738 64067 78807 24539 -19078 19517 62665 17347 -36 -5056 -27441 11104 55313 -16703
16726a6703l9725n0036J2439K568l7071k3788L5934M4300J5991l8591k5177r521
16714a29380J2599N0830J23052Q569k2833k0790p4487k8079L2430J5963j7945
16703e0071k3443N265m639M4304J3376k8526j4168K3778P6238j1075o3341k9696
16691f1998j2723p6323M5403O7891k6636J126P3463O0751n1869K7443O8994j1738
16679A03784m6605q4646j3654L4988m561l81j4924P266L8183j0158n2336p2028
16667a15072k4780J2673N5003M5043O7961N6746J7445r980m9012q7118m215J8849
16655a6457j0901k4481L3426k698O623K7182J986k3455J6356k6718n1646m0723
16643a11506L2308L182J9705K6394m8246n6077L419n337L3112P6594M2124Q426
$$ plain form
16726 -16703 -56428 -106464 -94025 -91457 -128528 -152316 -116382 -72082 -56091 -94682 -119859 -129380
16714 -129380 -116781 -65951 57101 65670 42837 22047 -52440 -80519 -48089 -32126 -50071
16703 -50071 -73514 -68249 -72888 -28584 -15208 -43734 -57902 -34124 42114 31039 -32302 -61998
16691 -61998 -74721 -151044 -105641 -37750 -64386 -63260 10203 70954 19085 46528 115522 103784
16679 103784 57179 -27467 -41121 -6133 -10694 -11075 -25999 -18733 19450 9292 -43044 -115072
16667 -115072 -139852 -127179 -72176 -27133 40828 97574 115019 105039 56027 -31091 -35306 -16457
16655 -16457 -27358 -51839 -18413 -21111 -14488 12694 14680 -8775 7581 -19137 -70783 -111506
16643 -111506 -79198 -76016 -56311 -29917 -78163 -134240 -130821 -136158 -103046 -26452 15672 24098
16631B4098k371J3742K5361P621q744l040j3392j03439l7484L3243L9821L7058
16619A2474L10q31J4354J865K8742j6182r627l3888k9906L6501K5383k1245R6143
16606A04093j0079p1423j0677k2669j470L0656J0873j0761K8135L504m5448J6459
16594B1193J9000O10L253n2082J6283M9030j5037n0395k6828j2608o2891K2863
16582h7609N48O1212K7596K1766J5770K637M2610m446O018j9290J7242J0635m6184
16569D8505j3558n3624M045m396N4177J1958m5425J3352m509m459m1824L080p792
16556d0470l6190L1967O8862r810m7576r160l2896K2930K2972k0327k3304Q515
16544f4487k243M772J8408L1004M7717N594l7719L3617M0717l5506k0995O855
$$ plain form
16631 24098 21727 35469 60830 68451 59707 56667 43275 -60164 -97648 -64405 -24584 12474
16619 12474 12784 11953 26307 28172 56914 40732 31105 -2783 -32689 3812 29195 7950 104093
16606 104093 94014 22591 11914 -10755 -12225 18431 29304 18543 46678 50182 4734 21193
16594 21193 40193 40803 44056 -8026 8257 57287 42250 -8145 -34973 -47581 -110472 -87609
16582 -87609 -87061 -25849 1747 23513 39283 41920 84530 80084 86102 66812 84054 94689 48505
16569 48505 34947 -18677 -14632 -19028 35149 47107 1682 15034 10525 6066 -35758 -32678 -40470
16556 -40470 -76660 -44693 24169 14359 -33217 -42377 -75273 -52343 -29371 -49698 -73002 -64487
16544 -64487 -66730 -61958 -43550 -12546 35171 40765 3046 36663 77380 41874 20879 27734
16532B7734M52m2216n5229k0191L9254M7285j5660q32O639j8345K1885N4365K4062
16519F9203M07k0646j0864j1687p4154l0698j3097k0598J1419R4644M877j2057
16507a3251k7212K2186J880l7581J376L1159L6372M4923N643j1785r967N559r522
16494C9780Q187n6741k1533J0598M8883j9679j0227o500k8515J1791j3118j2671
16482d9745K7863J3204J3614l9130j0078N6641O0712J6238j211p9571n7721k2641
16470g1825j3488P6965K1383n6996J4290J6049l4978J8861M4765q0792J6656K6715
16458b2395l7747j2694N1038M3453L5477O09k5432j4344K6639o179n2974j1407
16446b5956L9077K0551p079n24j8289N112L058J2856k3848L2199r819r0889m1986
$$ plain form
16532 27734 28186 -14030 -69259 -89450 -50196 -2911 -18571 -19403 -12764 -31109 -9224 45141 69203
16519 69203 69610 48964 38100 26413 -47741 -78439 -91536 -112134 -100715 -6071 -1194 -13251
16507 -13251 -40463 -18277 -16397 -53978 -52602 -21443 14929 59852 65495 53710 43743 49302 39780
16494 39780 47967 -8774 -30307 -19709 29174 9495 -732 -7232 -35747 -23956 -37074 -49745
16482 -49745 -21882 -8678 4936 -34194 -44272 12369 73081 89319 88108 8537 -49184 -71825
16470 -71825 -85313 -8348 13035 -43961 -29671 -13622 -48600 -29739 15026 -65766 -49110 -22395
16458 -22395 -60142 -72836 -21798 21655 57132 57741 32309 17965 44604 38425 -14549 -25956
16446 -25956 13121 33672 26593 26069 7780 12892 15950 28806 4958 37157 27338 -63551 -105537
16433a05537N451M8347N1024M679j6536L0230P112l8728p817J5418o3083L345
16421f6095l663O7841r244n7717j7235O4047K7626l1688K8638k9818l6412N39
16409f3181J539j545M4881L3385o1874m1667J4558L4128K4503j2703k2765J376
16397d9365L1435J0065J1428n7680l2443l3530L3010J1437n4025J270J6093N4744
16385e7561O2965r747j7649K9945j242m7569J3148m0122l584l5042p53K6762J1887
16372f8562O010J2951K4491L0856J00771Q649o0387l1111k4843j7845k1534K4680
16360a5874K9992n4408m5615M1715J4842l4985M844K7421q0128R328N8063M9620
16348D815J5400j9070k0336K4922L292j3610k327L1184K760l6534l3311L128J0310
$$ plain form
16433 -105537 -100086 -51739 -715 3964 -12572 17658 24770 -13958 -21775 -6357 -69440 -66095
16421 -66095 -69758 -1917 -11161 -68878 -86113 -22066 5560 -26128 2510 -27308 -63720 -63181
16409 -63181 -61642 -63187 -18306 15079 -46795 -88462 -73904 -39776 -15273 -27976 -50741 -49365
16397 -49365 -17930 -7865 3563 -54117 -86560 -120090 -87080 -75643 -129668 -128398 -112305 -57561
16385 -57561 5404 -4343 -21992 7953 6711 -40858 -27710 -67832 -71416 -106458 -107211 -80449 -68562
16372 -68562 -62552 -49601 -25110 5746 106517 115166 54779 23668 -1175 -19020 -40554 -15874
16360 -15874 14118 -40290 -85905 -44190 -29348 -64333 -59489 -32068 -112196 -102868 -44805 4815
16348 4815 20215 1145 -19191 5731 9023 -4587 -6914 24270 27030 -9504 -42815 -39687 -29377
16335b9377Q292l1296k9835N1875M5829l3025k3625j4375m9539m8564K6365R5528
16323c1747K7123l7203k8880L7531J10928M792n2180o220L0517n5989l7390M102
16311c4616j5999l0683L4506N8130j7600o5245Q741L3023J0509K9266O89P40K2891
16298C4352M3533O216m159k1442l3007K3498j7213n7006m0969M407n1912L9317
16286g4385K9461R401K1832k2668L721n678j2248j6073j1250K4883P3660k5398
16274d742l5415K3107P4301k2445l5780L0787o9697j2393J680o665N2414k7948
16262c2796j7471J6718k148k2721j2274O2918K4691J2997o1093j0696L2467n869
16250a5277j2050l3657j7267j2500L9312Q285l9065k0414Q5759P6797L3021j9020
$$ plain form
16335 -29377 -21085 -52381 -82216 -30341 15488 -17537 -41162 -55537 -105076 -153640 -127275 -31747
16323 -31747 -4624 -41827 -70707 -33176 77752 82544 30364 24144 54661 -1328 -38718 -34616
16311 -34616 -50615 -81298 -46792 11338 -6262 -71507 -62766 -29743 -19234 10032 10721 11461 34352
16298 34352 77885 84101 79942 58500 25493 48991 31778 -25228 -66197 -61790 -113702 -74385
16286 -74385 -44924 -35523 -13691 -36359 -32638 -38316 -50564 -66637 -77887 -53004 20656 -4742
16274 -4742 -40157 -17050 57251 34806 -974 29813 -39884 -52277 -50597 -57262 -4848 -32796
16262 -32796 -50267 -33549 -35697 -58418 -70692 -7774 16917 29914 -31179 -41875 -9408 -15277
16250 -15277 -27327 -60984 -78251 -90751 -51439 -43154 -82219 -102633 -16874 59923 92944 73924
16238G3924m0227l7983j3729j5406k9207K7081K8689N7971k2449m4986k8883j5678
16226f0883n8691O740N8585K7577j3697m990J0620m53L8743o19K4814K2204k8361
16213B1589l0360J9139l2413o1243J4886M2259P0078o6726P82R467n6077l9220
16201a07839M7762L8315m437o305L344M909L9146J4755m6142p2838J3503N7638
16189a8189M4303j3348p3250Q019K7609N7212L951l602O573L2591l5484k9261
16177G124M5262n140k2728O306k6481L8790J9580j8505k0665k2841K9747l943
16165B6506k395K532k9135q5031L1898J1050O1904L2543R975J330K2362k3638
16153E9901l5830j5548k3396R3201J8977k6367K1569l9242K015j0086n800j3005
$$ plain form
16238 73924 33697 -4286 -18015 -33421 -62628 -35547 -6858 51113 28664 -16322 -45205 -60883
16226 -60883 -119574 -112834 -54249 -26672 -40369 -45359 -34739 -35192 3551 2932 27746 49950 21589
16213 21589 -8771 10368 -22045 -83288 -68402 -26143 43935 -22791 -22009 -12542 -68619 -107839
16201 -107839 -60077 -21762 -26199 -32504 -29160 -24251 14895 29650 -16492 -89330 -75827 -18189
16189 -18189 26114 12766 -60484 -52465 -24856 32356 36307 32705 39278 71869 36385 7124
16177 7124 52386 47246 24518 30824 4343 43133 62713 44208 23543 702 30449 26506
16165 26506 24111 26643 -2492 -87523 -55625 -44575 17329 49872 59847 61177 83539 59901
16153 59901 24071 8523 -14873 78328 97305 70938 92507 53265 55280 45194 39394 26389
16141B6389J7311K970l4680m6582p715J8935L119K6737p075l2685J0127K5109
16129A960J1962k4029J0940N7L4299j8978k62j4143J1077K9997o1929k8387N6741
16116I305O2819m3038l374J9773L4859J1599l1967j781r876M1820k8864k7831
16104C3444j5205k33N1747Q336L7924m802j7275p1995m9792r733j2399n9244K7338
16091h1889J0374r505j4066M6372L7319r42K6050q659j5104m1002J0793j538j4579
16078e6376K2136O2254P3662j3498q1845K2004M4792K9011m2775j2034M3772k9686
16066F1417n5769l5999M1504K6740l3138m2197q54Q998J2457J4330M9609J9424
16054F6522l7688J5710M4694m440o8302o8149q052K9321N9830J3692K3289L4429
$$ plain form
16141 26389 43700 46670 11990 -34592 -42307 -23372 -20253 6484 -591 -33276 -23149 1960
16129 1960 13922 -10107 833 890 35189 16211 15949 1806 12883 42880 -19049 -47436 9305
16116 9305 72124 29086 25712 45485 80344 91943 59976 58195 48319 90139 61275 33444
16104 33444 18239 18006 69753 78089 116013 111211 93936 21941 -27851 -37584 -49983 -109227 -81889
16091 -81889 -71515 -81020 -95086 -48714 -11395 -12337 13713 5054 -10050 -51052 -40259 -41797 -56376
16078 -56376 -34240 28014 101676 88178 6333 28337 73129 102140 59365 47331 91103 61417
16066 61417 5648 -30351 11153 37893 4755 -37442 -38296 -29298 -16841 -2511 47098 66522
16054 66522 28834 44544 89238 84798 16496 -51653 -59705 -30384 29446 43138 66427 100856
16042A00856k1698k5195j8204K2017j4239m3179o0378J1678p680N6655L117n4311
16030e0561J5905P8947l6710l8948J2083N4744J4302m4216p606l035p813N5561
16018D2653j8159l3155K5543L749k9539k4780j5242P3511k804j8277k5483k357
16006b4340r197L0061k2282j87M8858P6817J8420q4060m7645k9407k2765L2101
15994c3626q967m6380L5650O0660M0288j4968l0643J9823j4098R095n7475o296
15982d6937J8900k4758N1141Q417q3034K5118O436K9429l77M350q049L877K8278
15969A2791K466J4714q5291M271r4J9402P3402j2174k2112k4195k5403J4125M6872
15956A8774Q823l5356J409M0747m6317j3707j0256L989k2928l1225Q460L179L9255
$$ plain form
16042 100856 79158 53963 35759 57776 43537 358 -60020 -48342 -56022 633 3750 -50561
16030 -50561 -34656 44291 7581 -31367 -19284 35460 49762 5546 -2060 -5095 -12908 42653
16018 42653 24494 -8661 16882 20631 -8908 -33688 -48930 24581 21777 3500 -21983 -24340
16006 -24340 -33537 -3476 -25758 -25945 22913 99730 118150 34090 -13555 -42962 -65727 -33626
15994 -33626 -42593 -88973 -53323 7337 47625 32657 2014 21837 7739 16834 -40641 -46937
15982 -46937 -28037 -52795 -1654 6763 -76271 -51153 -44717 -15288 -15665 -11315 -19364 -15487 12791
15969 12791 15257 29971 -55320 -51049 -51143 -31741 41661 29487 7375 -16820 -42223 -28098 18774
15956 18774 27597 -7759 -6350 34397 -11920 -25627 -35883 -31894 -54822 -86047 -77587 -74408 -35153
15943c5153O0835p868m1460k0989O465j0594M0141R7874j0035j3419J3492j2654
15931F6635j3049l9510r5724l3077K0785l585J4479K1772K3380L1745M3318j7643
15919A9526K0786J6313l4841m4591j8461K5051P085J2589L3074L2594p3912o2258
15907f7045K4917L0867M5269K8269m6351o0256O582O162L459p614r015m1164L57
15894h5563N8455o14q188K1190J0513j9813n4074p012M6949j1373l5256k344r744
15881i6874O3153P8549N5770q6229l1496J771M3448N860k9623l5947n6442N3393
15869c4667O7104j1522k6371P757j4723l1264O125N611J0725J8521j1531k7173
15857d1408j1191J2965L3602Q0333Q15K296m3850l7774O882K6115m3890o0138
$$ plain form
15943 -35153 25682 17814 -23646 -44635 -38170 -48764 -8623 89251 79216 65797 79289 66635
15931 66635 53586 14076 -81648 -114725 -93940 -97525 -83046 -61274 -37894 -6149 37169 19526
15919 19526 40312 56625 21784 -22807 -41268 -16217 -9132 3457 36531 69125 -4787 -67045
15907 -67045 -42128 -11261 34008 62277 15926 -44330 -37748 -31586 -28127 -35741 -44756 -85920 -85563
15894 -85563 -27108 -27722 -35910 -14720 -4207 -24020 -78094 -85106 -38157 -49530 -84786 -87130 -96874
15881 -96874 -33721 44828 100598 14369 -17127 -15356 28092 33952 4329 -31618 -88060 -34667
15869 -34667 32437 20915 -5456 2301 -12422 -43686 -37561 -31950 -21225 -2704 -14235 -41408
15857 -41408 -52599 -39634 -6032 74301 75116 77412 33562 -4212 2670 28785 -15105 -75243
15845g5243L4092N2556k4766l2117k8179m6684M0095J363n338J00153J2945j7607
15833A1270J7877q623r662N8938J0408m5440j6767L502N564q3796L0561N808O719
15820a3641K7053R528J1132j9137L6599k7915n6515o6540J5292R77L4137L8280
15808a0750L0453N216l962J5826m8823m383r224L078p997k8088k8204K8653O6072
15795G867j1620L3777j4155l4665R427n125m4700j8602m1422J5594J193j4146
15783a16577L2718N5010Q316j4773j1206P4821K4444p005K1901l826o8029O199
15771A993R971o0961O988P3378j7121m1196J3798k7291j9082l3407l1016P445
15759a16501N5798J5283l0252L7258p258N8779L4124n6230k6663m5659L510M3764
$$ plain form
15845 -75243 -41151 11405 -13361 -45478 -73657 -120341 -80246 -78883 -84221 15932 28877 11270
15833 11270 29147 20524 10862 69800 80208 34768 18001 21503 27067 -56729 -26168 -20360 -13641
15820 -13641 13412 22940 34072 14935 51534 23619 -32896 -99436 -84144 -83167 -49030 -10750
15808 -10750 19703 24919 20957 36783 -12040 -16423 -25647 -22569 -30566 -58654 -86858 -58205 7867
15795 7867 -3753 30024 15869 -18796 -9369 -14494 -59194 -77796 -119218 -103624 -102431 -116577
15783 -116577 -83859 -28849 -20533 -35306 -46512 28309 52753 45748 67649 63823 -4206 1993
15771 1993 11964 -48997 -42009 31369 14248 -26948 -13150 -40441 -59523 -92930 -123946 -116501
15759 -116501 -60703 -45420 -75672 -38414 -45672 13107 47231 -8999 -35662 -81321 -77811 -34047
15747c4047O658L8391N7957k6485m4076L6467M1994K5798l0728j0013J3238o822
15735F8332J697l8068j5791J1008o8949k0416n1544K9305N7236K5279J662l2301
15723c2550j3138k621K5813m2680k1479n230R852J2886O1323K2446J330l1985
15711a6033n097J1282k8239l277l9549j194O9807k3997j4530J6498J2787j2777
15699c4319q636L2307J8593l795k6205M076J2645k3323j2463N0308L1689o9742
15687b8865m8105K9775O0264j9688m1151j1933N664J850J4753J630m3122J6046
15675f2882L0137L6778M6082q147J1620N1163L5653K2818m3591n4173p980j0101
15663D7377M7264J9622J3775j2997n0208o8816l4930l138M8998M3674j6426l1667
$$ plain form
15747 -34047 -27389 11002 68959 42474 -1602 34865 76859 102657 71929 61916 75154 68332
15735 68332 70029 31961 16170 27178 -41771 -62187 -113731 -84426 -27190 -1911 -249 -32550
15723 -32550 -45688 -48309 -22496 -65176 -86655 -91885 -82033 -69147 -7824 14622 15952 -16033
15711 -16033 -21130 -9848 -38087 -41364 -80913 -82107 -12300 -36297 -50827 -34329 -21542 -34319
15699 -34319 -42955 -10648 7945 4150 -22055 -17979 -5334 -28657 -41120 9188 40877 -28865
15687 -28865 -76970 -47195 13069 -6619 -47770 -59703 -54039 -52189 -37436 -35806 -78928 -62882
15675 -62882 -32745 4033 50115 41968 53588 104751 140404 163222 119631 65458 57478 47377
15663 47377 94641 114263 128038 115041 64833 -3983 -38913 -42051 6947 50621 34195 2528
15651B528j0545n131m0088O5585k0624m6871O855J9499k5565K2560k4376L7780
15639a8393R9761m912n1774l7522j9794j1120N4682M972l6532k6740m4262j255
15627i2889L2831N037K9079M981j6027K4065m570k8088O5465M5526K03J2469o3239
15614A4843n2903l686M1481P6099k7734q3142j8584O2620l3548m0202K1844J3199
15602b9713K7182L7227J8727k0615K1152K8697l9008j11845j7442M0823N0956
15591F141n997R079N217K5803O251l8129r212j7602j0194L5947j0061L1082N9430
15578H7755j6821j5765J1937m8749r231M3542j6751m0259J566k9382N0932k7777
15566i003n4827k9496L4177L6245P0488J4373l7857J6808N5537J4737k166l6419
$$ plain form
15651 2528 -8017 -13148 -53236 12349 -8275 -55146 -48291 -28792 -54357 -31797 -56173 -18393
15639 -18393 81368 76456 24682 -12840 -32634 -43754 10928 15900 -20632 -47372 -91634 -92889
15627 -92889 -60058 -55021 -25942 -20961 -36988 -12923 -17493 -45581 19884 65410 65613 78082 14843
15614 14843 -38060 -41746 -265 75834 48100 -35042 -53626 8994 -24554 -64756 -42912 -29713
15602 -29713 -2531 34696 53423 32808 53960 82657 43649 -68196 -85638 -44815 6141
15591 6141 144 9223 14440 40243 46494 8365 -847 -18449 -28643 7304 -2757 28325 87755
15578 87755 70934 55169 67106 18357 9126 52668 35917 -4342 -2776 -32158 18774 -9003
15566 -9003 -63830 -93326 -59149 -22904 47584 61957 24100 40908 96445 111182 109016 72597
15554G2597Q042J2101J1913o38k9301m1367n6243m1201j1186N8411M2882K2705
15542D8715k0304k6216J855K626J7977j7810J1747k9883l581j1526L6617J5641
15530B5858p0985j9663N8855J6741J3180l8608p9111M728O6046j2507l9033K4677
15518d9822N5373j4087j4350N3100k295n082l8135M656K2821N5037o0193l5999
15506b8976k2147N1928m713M3703K4770K1773K0319m9239L101q688o4201K0036
15494G666K2795q867k7857K4139l144k2835n824m4299l481K4699L3920K9596j6026
15481A0482l4428l1032Q000L8189M4165M0415p0197m5222l0767J0498J0907P124
15469d1866L4397J8226o1836J9125N1556r445j8838k3971K9996P204K1589L219
$$ plain form
15554 72597 80639 92740 104653 104015 74714 33347 -22896 -64097 -75283 -16872 26010 48715
15542 48715 28411 2195 4050 6676 24653 6843 18590 -11293 -14874 -26400 10217 25858
15530 25858 -45127 -64790 -5935 10806 23986 -14622 -93733 -89005 -22959 -35466 -74499 -49822
15518 -49822 5551 -8536 -22886 30214 27919 22837 -15298 -10642 12179 67216 7023 -28976
15506 -28976 -51123 805 -3908 39795 64565 86338 106657 57418 60519 51831 -12370 7666
15494 7666 30461 21594 -6263 17876 14732 -8103 -13927 -58226 -61707 -37008 -3088 26508 10482
15481 10482 -23946 -54978 -46978 -8789 35376 75791 5594 -39628 -70395 -59897 -48990 -41866
15469 -41866 -7469 10757 -51079 -31954 19602 10157 -8681 -32652 -2656 4548 26137 29356
15457B9356K2262l0957m3467k6129l207N1265K0973j1977r8448m17M5232n70K0963
15444b5121j3638j8873j1606L9960P1667L5244K2819m8065m7183o4571J8846N1911
15432A1390q802N3987k1108j9907l6952o4279k2174N1278j7307l3386M8302O2565
15420C607L5133L0992p486K7797l5853l5872j065m6112K2111l3808j3391r913
15408f3860M2769O0130n7263k8102q705l2584o375K2587r902j315Q985L8167p146
15395d2614K1871r430q636q474O012p108M9349M5315j138J8139l6675p2775m0547
15382h6711L3436P418O6357P3443k3975r1407j4256L127k3673K8169n8686m4917
15370a31675K4101O1567k1463k8223j2784O0911M5097L3681r621r431o1994k1162
$$ plain form
15457 29356 51618 20661 -22806 -48935 -52142 -877 20096 8119 -90329 -90746 -45514 -46084 -25121
15444 -25121 -38759 -57632 -69238 -29278 42389 77633 100452 52387 5204 -59367 -40521 11390
15432 11390 2588 56575 35467 15560 -21392 -85671 -107845 -56567 -73874 -107260 -58958 3607
15420 3607 38740 69732 62246 90043 54190 18318 17253 -28859 -6748 -40556 -53947 -63860
15408 -63860 -21091 39039 -18224 -46326 -55031 -87615 -93990 -71403 -81305 -82620 -73635 -35468 -42614
15395 -42614 -20743 -30173 -38809 -47283 -41271 -48379 970 46285 45147 63286 26611 -46164 -86711
15382 -86711 -53275 -45857 20500 93943 69968 -21439 -35695 -32568 -56241 -28072 -86758 -131675
15370 -131675 -107574 -46007 -67470 -95693 -108477 -47566 -2469 31212 21591 12160 -49834 -70996
15358g0996O3481M5453J4552j9178o884o7564m7497O483P292k699J6980N6707
15346c870N930M2080L1371l2551r3457j9626L3265L099k7205J2243m7132M0075
15334e5778J3786j9197M2910q12K5190J1890k1329k5971j4648K2255l3410p745
15322f2859L8995O4558M300k4219k2156J4527Q138j9436l111P709K1140P518n5533
15309b0429k8599J6026M0126j8423J5550L3185m717j129j1874n2414K0617L4329
15297B2248K9950l2453k7133K2103j0752o3167j6237M2113M3742l2968n2996j5662
15285i1212r112P7792P2818R982m5607j5543M2728q489R009L827j2860K9898p9099
15272a5868n1602j1204K5954J781j55K5273N4458K5045O888L255L340m5477n924
$$ plain form
15358 -70996 -7515 37938 52490 33312 26428 -41136 -88633 -82150 -74858 -77557 -60577 -3870
15346 -3870 2060 44140 75511 42960 -50497 -70123 -36858 -33759 -60964 -48721 -95853 -55778
15334 -55778 -41992 -61189 -18279 -19091 6099 17989 -3340 -29311 -43959 -21704 -55114 -62859
15322 -62859 -23864 40694 44994 20775 -1381 13146 21284 1848 -1263 6446 27586 35104 -20429
15309 -20429 -49028 -33002 7124 -11299 4251 37436 32719 31590 19716 -32698 -12081 22248
15297 22248 52198 19745 -7388 14715 3963 -59204 -75441 -33328 10414 -22554 -75550 -91212
15285 -91212 -100324 -22532 50286 60268 14661 -882 41846 33357 42366 46193 33333 63231 -15868
15272 -15868 -67470 -78674 -52720 -50939 -51094 -25821 28637 53682 60570 63825 67165 21688 15764
15259A5764l4301j5049J04157Q263q2530k6210M681J4238m1259j5935N6502R737
15247a942M512k5683q2884K9749K0458j3199J094O8479O3790l2174j1992K5989
15235D6197q478o2811r443N530L5613r72q901k189l9148o2074L8785Q3155p4541
15222e9277k9520J5846L429k344l0555K7817l5379N6261M7160K1401j9101q539
15210a2801k964R554M3758K3055J12J0480l0897j4207K3005M5515K5115j1804
15198A07921p3384J0564O8323J0635q839l0039m2441o5865m6946J8203J3539O8417
15186C0088K0497n7585K7445J0159n3728m5784j1242L7113N4915K9794m0865j1082
15174a0275l1460l4q440m9027J4122J3245r322L9826j0042K0576k1753j301q933
$$ plain form
15259 15764 -18537 -33586 70571 78834 -3696 -29906 -25225 -10987 -52246 -68181 -11679 -1942
15247 -1942 2570 -23113 -105997 -76248 -55790 -68989 -67895 584 64374 32200 20208 46197
15235 46197 37719 -25092 -34535 -29005 6608 5636 -3265 -5454 -44602 -106676 -67891 15264 -59277
15222 -59277 -88797 -72951 -69522 -71866 -102421 -74604 -109983 -53722 -6562 14839 -4262 -12801
15210 -12801 -15765 -6211 37547 60602 60714 71194 40297 26090 49095 94610 119725 107921
15198 107921 34537 45101 113424 124059 115220 85181 42740 -23125 -70071 -51868 -38329 30088
15186 30088 50585 -7000 20445 30604 -23124 -68908 -80150 -43037 11878 41672 807 -10275
15174 -10275 -41735 -41769 -50209 -99236 -85114 -71869 -81191 -41365 -51407 -30831 -52584 -53885 -62818
15161f2818L1993J0787r848l5163J6649K8424l2539r178k8632n2749R100K1801
15149a12173K4192n509k1467q471N0917K8876L9485o429P8672Q5162l5957m7024
15137G0274k4956m9784p4531K1109N6322k3876M3948k7091m3144n989o6K1221
15125c6563R0499M680l9509j4348M5834m4895n3043Q19K3459k8266J8397J5339
15113a7597q097K2180o4752m8914N7677L8280O871J4056j3892n8488k6614N9492
15101c9798m1189k4220K8519N9454m1176o8997q370M5476m368m0929l8044O8275
15089a05367P7127J4920j1140L0190M645j6709p5818M847J3365K6053K171k780
15077c8496L1638N2021k817m6631N649J5139K5138r548p3766k0882o220N2035
$$ plain form
15161 -62818 -30825 -20038 -29886 -65049 -48400 -19976 -52515 -61693 -90325 -143074 -133974 -112173
15149 -112173 -87981 -93490 -114957 -123428 -72511 -43635 -4150 -10579 68093 153255 117298 70274
15137 70274 45318 -4466 -78997 -57888 -1566 -25442 18506 -8585 -51729 -57718 -57784 -36563
15125 -36563 53936 58616 19107 4759 50593 5698 -47345 -46526 -23067 -51333 -32936 -17597
15113 -17597 -25694 -3514 -68266 -117180 -59503 -21223 -14352 -296 -14188 -72676 -99290 -39798
15101 -39798 -80987 -105207 -76688 -17234 -58410 -127407 -135777 -90301 -94669 -135598 -173642 -105367
15089 -105367 -28240 -13320 -24460 5730 10375 -6334 -82152 -77305 -63940 -37887 -35716 -38496
15077 -38496 -6858 45163 42346 -4285 1364 16503 41641 32093 -41673 -62555 -68775 -16740
15065a6740L1579j7850m2201n284J3648L8677N4626J2897n4845j7565j0504k4762
15053c8324J3543K4717J4021L495L2065k6729j17846j8238P0021l3869L5665M3809
15041B330O2056p636m165m1965l1094Q597K9659M6603J8951j7654j8480o472j4910
15028B5820k8117K0146K7274n1807k0228l3670L532P4780L5054r5717k7566N389
15016f5110k10L3985N4071L2342N1000n340j3151m6949m6584Q656K0408L0872
15004E3990p1744j7444J7155R264J6j8022j5091L455M46K4995n7832K5466j9926
14991f5272N7878m8045j6076R138K5670P744o8266k7315P0702J1291l8596L5995
14979d5152N4256l5451l7191J3875n706J9306q753M8467N015M374O2044J439l6190
$$ plain form
15065 -16740 14839 -3011 -45212 -50496 -36848 1829 56455 69352 14507 -3058 -13562 -38324
15053 -38324 -24781 -64 13957 17452 49517 22788 -95058 -113296 -43275 -77144 -41479 2330
15041 2330 64386 56750 52585 10620 -20474 -11877 17782 64385 83336 65682 47202 40730 25820
15028 25820 -2297 17849 45123 -6684 -26912 -60582 -57050 17730 52784 -42933 -70499 -65110
15016 -65110 -65320 -31335 22736 55078 106078 100738 87587 40638 -5946 2710 23118 53990
15004 53990 -17754 -35198 -18043 -8779 -8763 -26785 -41876 -38421 -37975 -12980 -70812 -45346 -65272
14991 -65272 -7394 -55439 -71515 -62377 -36707 -28963 -97229 -124544 -53842 -42551 -81147 -45152
14979 -45152 9104 -26347 -63538 -49663 -55369 -36063 -44816 3651 8666 13040 75084 76523 40333
14966D0333j9467N373l5527l4543M825Q7716L6063n0160p0464j0212J6619J2640
14954a6804K9683M676J6604K4317l1133l0330l0664j7618L8530l6741n0239k052
14942a01771P037J6232K0136M8497r519n2535j3623N0984L9591j2396L3672j3198
14930A3107l2782J6853k896M1480K869q933L4642q012l2363k1186M1342K1649
14918F5770m0035j6340r752L4951m8580O3074J9930l3246M5796J5001n0204o2634
14906a6269j8345P487N712j5533J8467L5537N6367J887j03811J9257O248j5948
14894a8944K709K7280K1970O2545J3917k9540n2543l8946l2273k079o0279m6160
14882a52343N0223N1954j398p456L9197J4617m5781p322J0388L15k6572P724L4675
$$ plain form
14966 40333 20866 26239 -9288 -43831 -39006 48710 84773 34613 -35851 -46063 -29444 -16804
14954 -16804 12879 17555 34159 58476 27343 -2987 -33651 -51269 -12739 -49480 -99719 -101771
14942 -101771 -94734 -78502 -58366 -9869 -19388 -71923 -85546 -34562 5029 -7367 26305 13107
14930 13107 -19675 -2822 -5718 35762 38631 29698 64340 56328 23965 2779 44121 65770
14918 65770 25735 9395 -357 34594 -13986 49088 69018 35772 81568 96569 46365 -16269
14906 -16269 -34614 -27127 -21415 -36948 -18481 17056 73423 75310 -28501 -9244 -2996 -18944
14894 -18944 -16235 11045 33015 95560 109477 79937 27394 -11552 -43825 -45904 -106183 -152343
14882 -152343 -102120 -50166 -51564 -59020 -19823 -5206 -50987 -58309 -47921 -47606 -74178 -66454 -31779
14869c1779O0239J7365l4015o0538J5407L895M4296O184O736l0890m59j9310J9804
14856c065K0005k7650n227O3853k2431K8252p614l3734j8721m3876k545M891L869
14843d3993l073N5795L2429K2363q4503j21015L797K2817k0817L2339L2305J070
14831g0486L9687r208J0210N5976J1765k3395o9860l6318q12o565K9345K6739
14819d2922m0217l1578Q7340J4417q729J3655L3360N3148n5434n9875j9129J0342
14807d5622L8818m4423k9312L9300N4833K7108J8874K5773l6089J1331l8240n766
14795A6585k8895L862O1571n458o3741O169N3229J391q062J8355K6494o4214l6956
14782a9670p7194m5200M8946P601q911p6293n9662N9771P4963K9560N0163K5395
$$ plain form
14869 -31779 28460 45825 11810 -48728 -33321 -29426 14870 21054 27790 -3100 -3559 -22869 -3065
14856 -3065 16940 -10710 -15937 47916 25485 53737 46123 12389 -6332 -50208 -52753 -47862 -43993
14843 -43993 -47066 8729 41158 63521 -20982 -141997 -138200 -115383 -136200 -103861 -71556 -70486
14831 -70486 -30799 -40007 -29797 26179 37944 14549 -55311 -91629 -92441 -99006 -69661 -42922
14819 -42922 -83139 -114717 -27377 -12960 -21689 -8034 25326 78474 23040 -36835 -55964 -45622
14807 -45622 -6804 -51227 -80539 -41239 13594 40702 59576 85349 49260 60591 22351 16585
14795 16585 -12310 -8448 53123 47665 -16076 -9907 43322 44713 36651 55006 81500 17286 -19670
14782 -19670 -96864 -142064 -93118 -85517 -94428 -170721 -230383 -170612 -95649 -66089 -15926 9469
14770I469L4119J4690j9103J593p7313K2445K7588p419O968K7655r935o6700j7642
14757e3585N0892N1455M8398M1723m5959l6645l4104N271P4874l3906l3887j4030
14745B0497k0353o2322m100R528k1184M9775N920M275J1569j7078P984P3143O2351
14732A20005M4611n3341r6886l21n33k5259k2097n875m329J8339J0361j995o712
14719b4032j2256j11102L0980O7439n477L431M0000N111Q222o9590o932K9869
14707d4337K1135K1244L0959J322K3128o0127J9208R748j9565m8811r49K4432
14695b2613J0046k00K1966O4522J6096j2490J7264q497j7088n8879j5250R590
14683D467l1714m7093L5977j138m3896J2758M679L7528j0815m2150p2981J3237
$$ plain form
14770 9469 43588 58278 39175 40768 -36545 -14100 13488 6069 13037 40692 30757 -35943 -53585
14757 -53585 -2693 48762 97160 138883 92924 56279 22175 27446 102320 68414 34527 20497
14745 20497 144 -62178 -66278 -56750 -77934 -28159 -22239 -17964 -6395 -23473 -15489 57654 120005
14732 120005 164616 111275 14389 14068 13535 -11724 -33821 -39696 -44025 -25686 -15325 -17320 -24032
14719 -24032 -36288 -147390 -116410 -48971 -54448 -51017 -11017 -5906 2316 -67274 -74206 -44337
14707 -44337 -23202 -1958 29001 30323 53451 -6676 12532 22280 2715 -46096 -47045 -22613
14695 -22613 -12567 -12767 9199 73721 89817 77327 94591 86094 69006 10127 -5123 4467
14683 4467 -27247 -74340 -38363 -39501 -83397 -70639 -65960 -28432 -39247 -81397 -154378 -141141
14671a41141Q2524N2762l490j8174n2369n6966k7753N5380k7282M497M3150L8184
14659e0678N0892J9896n6248N1401L4078l5179j6310n7723l0781Q211M4545N4042
14647A6146l660j9205K1440q0n4438k4236M7802K3123M1797O984K4737k3491l3633
14634B3286J0218K7157m6094m2073k8128L0758j892j7299J01402M0646p8093J200
14622B1088P4817J4056p4709n5261n0128o3529L8929O6697M7443k0727n5435j2212
14610f8971N9014M3628J9725r6909p3779M4601N4218J12994O125m103j5701o7551
14598A3291J1060k3112K4389O4556j9196j8705J0528M0635k9063j5213o5895K1302
14586A4577K8377P787m981l8628r87M6005k9010j5040k3435n250j06019p7234
$$ plain form
14671 -141141 -58617 -5855 -9345 -27519 -79888 -136854 -164607 -109227 -136509 -132012 -88862 -50678
14659 -50678 214 20110 -36138 15263 49341 14162 -2148 -59871 -90652 -82441 -37896 16146
14647 16146 12486 -6719 14721 14641 -39797 -64033 -16231 6892 48689 55673 80410 56919 23286
14634 23286 33504 60661 14567 -27506 -55634 -24876 -26768 -44067 57335 97981 19888 21088
14622 21088 95905 109961 35252 -20009 -70137 -133666 -94737 -28040 19403 -1324 -56759 -68971
14610 -68971 -9957 33671 53396 -43513 -117292 -72691 -18473 94521 100646 96543 80842 13291
14598 13291 24351 1239 25628 90184 70988 52283 62811 103446 74383 59170 -6725 14577
14586 14577 42954 50741 45760 7132 6145 52150 23140 8100 -15335 -20585 -126604 -203838
14574b03838J19177J36407R82l1961m3158p311K3577j4975k0105m2118l7056l734
14562a24113K8375L4511L4324K297Q914L8173k3912O698k1153k1073K2033j1939
14550b6865L2784J8490O1403k3043j15872J9189J04672Q2120k2929o6964m3257
14539A9728j285n239K8538L6665m41p41p224k612j5095m5924q927k2970J9809
14526e718P353K6884M3415Q666k4090k1740k8913k1686J9159j7599K2650K706
14514A1087L3153l9398l4226K9232o9291k0997J9766J9898o7033n7523M130P9379
14502i1823K6588K1664Q9180k0028J913J7524J0519j4645M494l0954m2708O8032
14490C9756o5p6163l8511K0378k8178o76L3688r80N023K3935R969L9313m792o033
$$ plain form
14574 -203838 -84661 51746 52728 20767 -22391 -29702 -6125 -21100 -41205 -83323 -120379 -124113
14562 -124113 -95738 -61227 -26903 -24606 -15692 22481 -1431 5267 -15886 -36959 -14926 -26865
14550 -26865 5919 24409 85812 62769 -53103 -33914 70758 152878 129949 62985 19728
14539 19728 18443 13204 41742 78407 77966 77225 70001 67389 52294 6370 -2557 -25527 -5718
14526 -5718 1635 28519 71934 80600 56510 34770 5857 -15829 3330 -14269 8381 11087
14514 11087 44240 4842 -29384 -152 -69443 -90440 -70674 -50776 -117809 -175332 -171202 -91823
14502 -91823 -65235 -43571 45609 25581 27494 45018 55537 40892 45386 14432 -28276 39756
14490 39756 39691 -36472 -74983 -54605 -82783 -83459 -49771 -50751 -45728 -21793 -11824 27489 22697 16664
14476A6664K0184L9316J126n3125n2365m5171L0451J1345k1500O6993K0792l4824
14464a14j2636l8963k4006O4947J9289J0971k192l7964N625M6224k5591m1929
14452c6339j3182j1440o6348J6073N4039K2686K5901M7575j3030p4M0699j164
14440F5396r605m2492J2257L8352k7512n7789m8009K8425M0511j4125l2533k3955
14428g1079K1850J2317K6820O1338j4771k3396N561M9241r66n0545l8249k3764
14416d5643k6975k6543k0392N0188J4535k2661o2191J3806K3128P2202P3138M270
14404D6862l7639j7181o335J4536k7171l0165l5714k636j1366m5490j2320J03223
14392f1396K1748l4094j6553M8293P4873k445n2212m481Q913M4707P862k0332
$$ plain form
14476 16664 36848 76164 77290 24165 -28200 -73371 -42920 -31575 -53075 13918 34710 -114
14464 -114 -12750 -51713 -75719 -10772 8517 19488 17296 -20668 -15043 31181 5590 -36339
14452 -36339 -49521 -60961 -127309 -111236 -57197 -34511 -8610 38965 25935 25861 66560 65396
14440 65396 55791 13299 25556 63908 36396 -21393 -69402 -40977 -466 -14591 -47124 -71079
14428 -71079 -49229 -36912 -10092 51246 36475 13079 18640 67881 66915 16370 -21879 -45643
14416 -45643 -72618 -99161 -119553 -69365 -54830 -77491 -139682 -125876 -102748 -30546 42592 46862
14404 46862 9223 -7958 -14293 243 -26928 -57093 -92807 -95443 -106809 -152299 -164619 -61396
14392 -61396 -39648 -73742 -90295 -42002 32871 30426 -21786 -26267 -17354 27353 35215 14883
14380A4883j00345p405L1176N609q305p3041J0054R4553N0736K9921j5951J5741
14368D7626n1796o3162L420L0244j2830l4754J1392K8384j4782L1770j6898J0288
14356c1098M7025j0092l2106M1281M4948k6066L133m5872M5240M1757o5516k3513
14344a0879l6900j1548N1930J9718J0279l010J3850o006J7742L9193l2490l4321
14332A7558l5748j9897K5751j2877k7522J7019P9750K5876l4858j489J1951O5717
14320A11231l7614o2612m356K0425j2514n557k8643k1149p681l5352l181j1188
14308i8191M8008K2216p6122l6940P7024L6738l0167j9119M4424Q843M9024N1902
14296G7640J2571m9488n4377m3281J2117K8881j7397N2464J2007p5568Q865j7296
$$ plain form
14380 14883 -85462 -92867 -61691 -56082 -64387 -137428 -127374 -32821 17915 47836 31885 47626
14368 47626 -4170 -67332 -63912 -33668 -46498 -81252 -69860 -41476 -56258 -24488 -41386 -31098
14356 -31098 15927 5835 -26271 15010 59958 33892 37025 -8847 36393 78150 12634 -10879
14344 -10879 -47779 -59327 -7397 12321 22600 19590 33440 27434 45176 84369 51879 17558
14332 17558 -18190 -38087 -12336 -25213 -52735 -35716 44034 69910 35052 33563 45514 111231
14320 111231 73617 11005 6649 27074 14560 9003 -19640 -40789 -48470 -83822 -87003 -98191
14308 -98191 -50183 -27967 -104089 -141029 -64005 -27267 -57434 -76553 -32129 -23286 25738 77640
14296 77640 90211 40723 -13654 -56935 -44818 -15937 -33334 19130 31137 -44431 -35566 -52862
14284e2862J294O0520N0439j8649o2282k1041m4165J114P1445Q0683J0650o2869
14272A4277O170l569n1730p757k8770p9334p325P1223O8888O372q0219n1212N8644
14259h4342M2584J4042K8085J8767M1223o4361k5012l8878o4247j7258N4362L4666
14247f0369N0474J3834L942k6010L3235j1824r3945k0927N7886j1396R547J2257
14235d3296L3204K2594K0019L1084l4351P704l0946m465O2732J9762m1789j9559
14223B2693L0830L4316m3020l1442k1661j5351r015L4544J1594l461K7974K4035
14211F2036k1546r5995K4720O0294O477j3414K8123k3715P671O4695J9238r7089
14199B1495L0747n801m2743Q0011j6568J0150l3395p0353o5751r647J596N9591
$$ plain form
14284 -52862 -51568 8952 59391 40742 -21540 -42581 -86746 -85632 -14187 66496 77146 14277
14272 14277 20447 16878 -34852 -42609 -71379 -150713 -158038 -86815 -17927 -11555 -91774 -142986 -84342
14259 -84342 -41758 -27716 369 19136 60359 -4002 -29014 -67892 -132139 -149397 -95035 -60369
14247 -60369 -9895 3939 7881 -18129 15106 3282 -90663 -111590 -53704 -65100 -55553 -43296
14235 -43296 -10092 12502 32521 63605 29254 36958 6012 1547 64279 84041 42252 22693
14223 22693 53523 87839 44819 13377 -8284 -23635 -32650 1894 13488 10027 38001 62036
14211 62036 40490 -55505 -30785 29509 35986 22572 50695 26980 34651 99346 118584 21495
14199 21495 52242 46441 3698 83709 67141 77291 43896 -26457 -92208 -101855 -100259 -40668
14187d0668N7844M9338k6341o942R622k3978l2796k9557J5846K5327L9726J5549
14175E2970L3411l5507m7988L764j5713k630L3674q726O335m9049o745L4792j5968
14162a7380K3131k5040K0160J0694P549k2014N0029M6786l1129K0075n8402o6360
14150d1901N1624j106K9997J4201l8903J894J0416K2009K281P0131j6131n6768
14138D7744m6088m0758r803O6887L930k7064R81l5841m6134O3460N2692m5259
14126a5253m4227M144N0528N350N7042K4467m730m6761p6439J6781N3602L7881
14114F2385J2028l8337l6460M47J4409J6081K7423l4608n0626k4053K943l2417
14102h0785n5468l634Q1077J7765P6015j6375j5432m33r6395m8339M6222O7548
$$ plain form
14187 -40668 17176 66514 40173 33231 42853 18875 -13921 -43478 -27632 -2305 37421 52970
14175 52970 86381 50874 2886 6650 -9063 -11693 21981 13255 19590 -29459 -36204 -1412 -17380
14162 -17380 5751 -19289 871 11565 19114 -2900 47129 93915 62786 82861 24459 -41901
14150 -41901 9723 8617 38614 52815 13912 15806 26222 48231 50512 120643 104512 47744
14138 47744 1656 -39102 -48905 17982 21912 -5152 -4171 -40012 -86146 -22686 30006 -15253
14126 -15253 -59480 -55336 -4808 542 57584 82051 77321 30560 -45879 -29098 24504 62385
14114 62385 74413 36076 -384 63 14472 30553 57976 23368 -27258 -51311 -48368 -80785
14102 -80785 -136253 -139887 -58810 -41045 34970 18595 3163 2730 -93665 -142004 -95782 -28234
14090b8234j5685N2614O629m3420j931j1868j5566k7380N9596P3666K6002M5189
14078A19612l5238o5868Q928O5550k696j3028M8262J0772r724n1485P667O593
14066H9345j3266j4630P125m4542j0556r4774l912N4741M4396O5632K5817M2842
14054A48218l1515l3674j1514k1148m1111j9146m1017m3169j3739L6225N0374
14043b1216r72l8593N7421L1268L6065K9625L3631J0530K1914p662m289L1074
14031A78796m4313n8246P712m3501r24l115o6809K3507L8723n0012k2600K4370
14019a6412k441l6789O485M757j4821P4208K2972l3076o856J7113j8632L8107
14007C4615J160j8089K7980j4691m7416O9152l0738j1327M0055J1005p0620l641
$$ plain form
14090 -28234 -43919 8695 15324 -28096 -30027 -41895 -57461 -84841 -25245 48421 74423 119612
14078 119612 84374 18506 27434 92984 90288 77260 125522 136294 126570 75085 82752 89345
14066 89345 76079 61449 68574 24032 13476 -81298 -85210 -30469 13927 79559 105376 148218
14054 148218 116703 83029 71515 50367 9256 -9890 -50907 -94076 -107815 -71590 -21216
14043 -21216 -22188 -60781 -3360 27908 63973 93598 127229 137759 159673 152011 147722 178796
14031 178796 134483 76237 83949 40448 39524 36409 -30400 -6893 31830 -18182 -40782 -16412
14019 -16412 -18853 -55642 -49157 -44400 -59221 14987 37959 4883 -1973 15140 -3492 34615
14007 34615 35775 17686 45666 30975 -16441 52711 21973 10646 50701 61706 -8914 -12555
13995a2555L0532l7436k0884J5162k5078n159k0415R4261K9862j1283j4161j8752
13983D094k8745L2378J3588m5113J7972O184L9523k0781l4263k6267K9167M9807
13971C7544O8452P1373k2735q8538l4007k9673q681l184O35M473j9813o261M0818
13958A0403L9951P306l7326Q692J7567l2860k862m185j7908j1301j5603k3451
13946f1577j2009J294n9847L1088O5477K3153L746K5557K7216j4579l2300J3587
13934A0806J3601m302Q250o0638o1153m04M6056M9971J1707K0901N6773p118m2109
13921D2341m9498K420P194o081L5413l2108L733O6914P814r69j3681p826m2946
13908A2720m1621L9960N8865n5042R27P6797N2325P758k6532o243l0247m4128
$$ plain form
13995 -12555 17977 -19459 -40343 -25181 -50259 -55418 -75833 18428 48290 37007 22846 4094
13983 4094 -24651 7727 21315 -23798 -5826 358 39881 19100 -15163 -41430 -12263 37544
13971 37544 105996 177369 154634 66096 32089 2416 -6265 -9449 -8814 -4341 -24154 -30415 10403
13958 10403 50354 57660 20334 29026 46593 13733 10871 6686 -11222 -22523 -38126 -61577
13946 -61577 -73586 -72292 -132139 -101051 -35574 -12421 -8675 16882 44098 29519 -2781 10806
13934 10806 24407 20105 28355 -32283 -93436 -93840 -47784 2187 13894 34795 91568 84450 42341
13921 42341 -7157 -4737 2457 -3624 31789 -319 3414 70328 78142 77173 63492 55666 12720
13908 12720 -28901 11059 69924 14882 15809 92606 144931 152689 126157 119914 89667 45539
13896D5539m5942O811M4633J8817K2603J9223j4420l7011N095L8744Q826j0004
13884A02914o32k1547n0421j00706l8829K4123q435N5961M8942j5547Q466j6928
13872a2639p943L025J9898K7329O666M9701Q2593k957m8915n321l5406J888K5756
13859A03675N8401k8765n5121m4575j205n178n090J647k5431J4482K2025j2066
13847B2799o3662o9825n527O3040M5690N174L715L863O0369Q1569q381r9332K856
13834D2348K8185J1078n6241J10L6953K4065l8690j458J9780k0756J0932Om2896
13821A3416K1755P1125m4637m0973j4612k016J0951P921m082O998q5735J3911
13809d5978N984J951J9078K4372K2410m1623j8613J2404L996N9116K6265p7864
$$ plain form
13896 45539 -403 6408 51041 69858 92461 111684 97264 60253 65348 104092 112918 102914
13884 102914 102282 80735 30314 -70392 -109221 -85098 -93533 -37572 11370 -4177 4289 -12639
13872 -12639 -20582 -17557 2341 29670 36336 86037 168630 165673 116758 111437 76031 77919 103675
13859 103675 162076 133311 78190 33615 32410 27232 22142 23789 -1642 12840 34865 22799
13847 22799 -40863 -110688 -116215 -53175 -7485 -2311 1404 5267 65636 147205 138824 39492 42348
13834 42348 70533 81611 25370 25480 62433 86498 47808 46350 66130 45374 56306 56312 13416
13821 13416 35171 106296 61659 20686 6074 4058 15009 22930 18848 25846 -59889 -45978
13809 -45978 -39994 -38043 -18965 5407 27817 -13806 -32419 -20015 -16019 43097 69362 -8502
13797h502K4594L2650q769J1784j8616k1789n44O6724K1112J3738Q7380J03930
13785C03692O2674P5960J69375K04178J45588K04935K94409M18485M10912K1509
13775B311717m56574n28128m50338k92438j39915p3534k8017M487m9542m2165
13765B55553q5831n090L8726k0185k9846q3j3193J2812M463N77j356m6620k465
13752A07462P5893n0261q4010K6581j506l4430k3983k6338L91M6864P2603M1256
13740A50522J4544p936k5395j4638m3443l0728L1547l6465K0713N5136k4853L505
13728I2509J4317j2864q829K8352N0263O483n2124k4841K3247l0638m7592j0843
13716B7440j2955j8502k3864O8298O5121K1079k1423J6571k3272j4788J934k4683
$$ plain form
13797 -8502 16092 48742 39973 51757 33141 11352 10808 77532 98644 112382 199762 303692
13785 303692 366366 442326 611701 815879 961467 1166402 1460811 1879296 2290208 2311717
13775 2311717 1855143 1327015 876677 584239 444324 370790 342773 347260 297718 255553
13765 255553 169722 164632 203358 183173 153327 153244 140051 152863 157326 157903 156547 109927 107462
13752 107462 183355 133094 49084 75665 74159 39729 15746 -10592 -10201 36663 109266 150522
13740 150522 165066 157130 131735 117097 73654 42926 74473 38008 58721 113857 89004 92509
13728 92509 106826 93962 85133 113485 163748 170231 118107 93266 116513 85875 38283 27440
13716 27440 14485 -4017 -27881 40417 105538 126617 105194 121765 98493 83705 85639 60956
13704F0956r692l5704k0149j7803q4948K0854L4119K0892Q203P358p894m2305
13692f6113j2612K6360K8455O1273J7602o800l9637j2107J088M2465R838k8267
13680B1545k1075k0550M2482o267j9871L5541M2502J4962o0711r037K2690J0869
13668E3080m8141P823K3826m2522o4987j6822L3956L1394M6093j2877M948k3584
13656g813K6786L0055O2918n745k3820l6502n9968K5426K9654j6479m58R180p9936
13643d6702o9581q2075l9999R548J5760K6603J3552j4085M0455J4572K1816J15653
13631E517M8159k2842k0712l6809k783L0242k1434l8223j7014m0878K6521J8343
13619g1913Q634P167K3813M3660m6583l406K093R0067M143p6775K08l129R194
$$ plain form
13704 60956 51264 15560 -4589 -22392 -107340 -86486 -52367 -31475 -23272 -15914 -23808 -66113
13692 -66113 -78725 -52365 -23910 37363 54965 48165 8528 -3579 -2491 39974 49812 21545
13680 21545 470 -20080 22402 16135 -3736 31805 74307 89269 28558 19521 42211 53080
13668 53080 4939 12762 36588 -5934 -70921 -87743 -53787 -22393 23700 10823 15771 -7813
13656 -7813 18973 49028 111946 106201 82381 45879 -14089 11337 40991 24512 24054 33234 -46702
13643 -46702 -116283 -198358 -238357 -228809 -213049 -186446 -172894 -186979 -146524 -131952 -110136 5517
13631 5517 53676 30834 10122 -26687 -29470 772 -20662 -58885 -75899 -116777 -90256 -71913
13619 -71913 -63279 -56112 -32299 11361 -35222 -38628 -36535 53532 57675 -19100 -18892 -22021 -12827
13606a2827L7456J1373K7514l252l9494l2034m4097P9390Q2435K0049K2765R1285
13594B40563O9904j2882R074P6891P4806p893m6381n1379J5724J10277k1057j10176
13582C47471j26117o7904J816j4472n0435j1841P039J4767J4577J5046l17n8464
13570G1166k2122k810K9101Q213J5643K6256M936M0113l7094o3795j5339m1964
13558A2304M6769k7945k7290O3506J3984m3214J1961K5199L852k1090q743M6070
13546I5363K7050l0603l0507m4805l3756M7089J4649j04454k7179M1692L8656
13535f805j596J2769l9955l189J2826O5530l951J7489K7563J4233q6115m3957
13523c5158k0555L1147L6583N6064m462J1314N490J2328m094J3891m6624o3596
$$ plain form
13606 -12827 24629 36002 63516 60264 20770 -11264 -55361 24029 106464 126513 149278 240563
13594 240563 310467 297585 306659 383550 458356 450463 404082 352703 368427 478704 457647 347471
13582 347471 221354 153450 155266 140794 90359 78518 85557 100324 114901 129947 129630 71166
13570 71166 49044 46234 75335 83548 99191 125447 130383 170496 133402 69607 54268 12304
13558 12304 59073 31128 3838 67344 81328 38114 50075 75274 79126 58036 49293 95363
13546 95363 122413 91810 61303 16498 -17258 29831 44480 -59974 -87153 -45461 -6805
13535 -6805 -8401 4368 -35587 -38776 -25950 39580 35629 53118 80681 94914 8799 -35158
13523 -35158 -55713 -24566 12017 68081 63619 74933 80423 92751 88657 102548 55924 -7672
13511g672j967L584L5889J2596L4051J8754j5235K5612m9443n1409j1788n1880
13499e8908j8603K257N3781O0454Q979K283O3168L7379k4809l6821k0788m8830
13487A9542m5061R602m7171L2657L6268Q084L2318l1901j8781j2636K1281M923
13475I125r494O8920N7188J4528m1396R37O6999N8868K5257O4647K928o252l9596
13462B72659l0243M3294K7786l776l2955j3473q194l1601O4253k3386o5161K0154
13450B19357k4172p6268R854j7301K4961M5386K7872l7153j2359j0188J495N0531
13438B02015m566l7475m1802M7283P2502o813j7262l0874J6684J2765o424k919
13426B03114J02200Q4369L3899L9950N8799M0019l2906m3832k561r008K5153N3066
$$ plain form
13511 -7672 -9639 -6055 29834 42430 76481 95235 80000 105612 56169 4760 -7028 -58908
13499 -58908 -77511 -75254 -21473 38981 47960 50243 113411 150790 125981 89160 68372 19542
13487 19542 -25519 -15917 -63088 -30431 5837 13921 46239 14338 -4443 -17079 4202 9125
13475 9125 -369 68551 125739 140267 98871 99808 166807 225675 250932 315579 318507 312255 272659
13462 272659 242416 285710 313496 309720 276765 263292 255098 223497 287750 264364 199203 219357
13450 219357 195185 118917 128771 111470 136431 181817 209689 172536 160177 149989 151484 202015
13438 202015 197449 159974 118172 165455 237957 231144 213882 183008 199692 212457 206033 203114
13426 203114 305314 389683 423582 463532 522331 562350 529444 485612 483051 474043 499196 552262
13414E52262j2373K6152K6096N1315Q8595j6466n2053p5503L649J20363O1343
13403G73380L0352j610l7433L8469R4329J6090N1595M4223J9018L7164o460k0287
13391A038830L1300N6256L6684O8823P5694R5725O9018k2973j2631J2832Q441
13380A457999M1926O8688N3519Q4087L1103J967N2488O3357L7493R6926J02905
13369B092458J33614J03657Q2164R1024J65767J82537J76639K18945K27812L24814
13359C799431L48760M21924M90391N53592O32604P10340Q79994J194360J468231
13350A0499627J750255K096566K708176L581544M743272O232901Q297123J1343049
13342E1252513J5570092K1091119K7245877L2940223M0034917N0704525O6721372
$$ plain form
13414 552262 539889 566041 592137 643452 732047 715581 663528 588025 591674 712037 773380
13403 773380 803732 802122 764689 803158 897487 913577 965172 1009395 1028413 1065577 1059117 1038830
13391 1038830 1070130 1126386 1163070 1231893 1307587 1403312 1472330 1449357 1436726 1449558 1457999
13380 1457999 1499925 1568613 1622132 1706219 1737322 1739289 1791777 1855134 1892627 1989553 2092458
13369 2092458 2226072 2329729 2411893 2502917 2668684 2851221 3027860 3246805 3474617 3799431
13359 3799431 4148191 4570115 5060506 5614098 6246702 6957042 7837036 9031396 10499627
13350 10499627 12249882 14346448 17054624 20636168 25379440 31612341 39909464 51252513
13342 51252513 66822605 87913724 115159601 148099824 188134741 238839266 305560638
13335C05560638Q3350198O9062016k964571q1114903r7866327p9721192n3763815
13328A42542044l3925049k1880535j5424186j1758852r180817o883021n150153
13321C8339431l814156k957129k413690k018953j523504j249042j100525r48653
13313B2313779q19986p65177o10508m83261l49769j95854j80055q4414k9211j40813
13303A8654731l13878k97599o6635J4563o9715k46068m92977p21889p78882q09347
13293A4872304r44716q13692o84536o80170n87289n72151n63848n09016m86188
13284I030698m86220m32747m57076l33357l24088l32474k91691l35791l07823
13275E729431k65001k40246j82590j62541j90335k58864k22307j65726j68274
$$ plain form
13335 305560638 388910836 457972852 455008281 373893378 276027051 196305859 142542044
13328 142542044 108616995 86736460 71312274 59553422 50372605 43489584 38339431
13321 38339431 34525275 31568146 29154456 27135503 25611999 24362957 23262432 22313779
13313 22313779 21493793 20728616 20118108 19634847 19285078 19089224 18909169 18824755 18795544 18654731
13303 18654731 18340853 18043254 17976619 17991182 17921467 17675399 17182422 16460533 15681651 14872304
13293 14872304 13927588 13113896 12429360 11749190 11161901 10589750 10025902 9516886 9030698
13284 9030698 8544478 8111731 7654655 7321298 6997210 6664736 6373045 6037254 5729431
13275 5729431 5464430 5224184 5041594 4879053 4688718 4429854 4207547 4041821 3873547
13266C873547j72777k15539j28351j15419j68681j02066j19508j48550p6362r1172
13256B535122j03810q4071j26620j41576q7685m3182p1937j48484j08946p7389
13246A541422q3381p5084l8529j5385K1151k5439k8763o3793m4164O8341j5117
13235A241259q7707n9875n4489j8742j3433k5645k1257Q547q4112p4423r5890
13224G14233m9248J5622L6493J2634K3345k2877M9871M866n248L7849O3117K3734
13212I04391o643L2205r2107j12137J958L7341M2222j8167m9311o9090o7873r8851
13200E03938r8399m0489K429J0718k1090j31q247l5183J2681L0325j931k9264
13188C25357m6973J7767L1690J6526q27K8624m286J6387j5245K977r336k6496
$$ plain form
13266 3873547 3700770 3485231 3356880 3241461 3072780 2970714 2851206 2702656 2626294 2535122
13256 2535122 2431312 2347241 2220621 2079045 1991360 1948178 1876241 1727757 1618811 1541422
13246 1541422 1458041 1382957 1344428 1329043 1350194 1324755 1295992 1232199 1188035 1256376 1241259
13235 1241259 1153552 1093677 1039188 1020446 1007013 981368 960111 968658 884546 810123 714233
13224 714233 664985 680607 717100 729734 753079 730202 780073 784939 779691 817540 880657 904391
13212 904391 897748 929953 837846 725709 727667 765008 807230 789063 739752 670662 602789 503938
13200 503938 405539 365050 367479 378197 357107 356976 348729 313546 326227 356552 354621 325357
13188 325357 278384 296151 327841 344367 343540 372164 367878 384265 369020 371997 362661 336165
13176C36165M8677J8362j6329L008P0806k2723m4087j6780o606J7515j5775M5086
13164D17319O1447j5624q7005j3215L3760M8185J4437p9828j9934P3810M4879
13153D78231k2807k3515l2878J4039O278l5245k512K4277M3431J201L7026k1097
13141D66429r4133n680K8876J7166O1386M5793O585p7564o3466l6459J167M7290
13129C97390O3320k6580J2891m0114q9178k4612K5963L3540k2547L088o0297o4605
13117B08259M7335k6087j6712m320l2461J7794J2523l8128R305O8645K7184K2127
13105B95464Q061Q621p3928l8514N520K569r348M3246j4316o0211k2674P6254
13093B20744p145n5977l1124M2938N0677p532o5078K4065J846L5316J06461O732
$$ plain form
13176 336165 384842 403204 386875 389883 460689 437966 393879 377099 370493 388008 372233 417319
13164 417319 478766 463142 376137 362922 396682 444867 459304 379476 359542 433352 478231
13153 478231 455424 431909 399031 413070 419348 384103 381591 405868 449299 450500 487526 466429
13141 466429 372296 366616 395492 412658 474044 519837 526422 448858 385392 348933 350100 397390
13129 397390 460710 434130 447021 406907 317729 293117 319080 352620 330073 333161 272864 208259
13117 208259 255594 229507 212795 208475 176014 193808 206331 168203 177508 246153 273337 295464
13105 295464 303525 312146 238218 199704 205224 207793 198445 241691 227375 167164 144490 220744
13093 220744 213599 157622 126498 169436 220113 212581 147503 171568 173414 208730 315191 321923
13081C21923m8998n7840l0916J446j9118J6001J6654r647M8360l6775k6047L3518
13069B08561n1948n5581R4664Q9655N883l4696k6913J1353k4361l5855l6114n2476
13057I2172L54L4785M9527k9894m4591j2750j0374R398J7854p580l0409j8979
13045D9513l1260M3249O2470k7810K0690J2592p531P432M5026p549j3511J9399
13033A72710l1131L462O6969J712M6729L2026J1084k3346r7937l0612j4526l8471
13021I8669j3047P006M3559o1202o0045K5704P8644M1789M9128L782n0483j17451
13009D6053j7179O3251l870K1280P1180q233o4233k045J6037q229K2891r159n89
12996A27155m798K1056O05p3221k80K6088k563j8295K8160m306O9293L2066k8126
$$ plain form
13081 321923 272925 215085 184169 185615 166497 182498 199152 189505 237865 201090 175043 208561
13069 208561 156613 101032 195696 285351 291234 256538 229625 240978 216617 180762 144648 92172
13057 92172 92526 127311 176838 146944 102353 89603 79229 88627 106481 98901 68492 49513
13045 49513 18253 61502 123972 96162 116852 129444 121913 129345 174371 166822 153311 172710
13033 172710 141579 145041 212010 213722 260451 292477 303561 280215 182278 151666 137140 98669
13021 98669 85622 92628 136187 74985 14940 40644 119288 161077 210205 213987 163504 46053
13009 46053 28874 92125 88255 109535 180715 172482 108249 106204 122241 114012 136903 127744 127155
12996 127155 122357 143413 144018 70797 70517 96605 94042 75747 103907 99601 168894 200960 172834
12983A72834m4218j8108J6057k5328o9441J3463L4606j3418q117k5944M2006N0149
12971A24541N5006r768q199k7379R610k0712p6275P349J0238J9992m7034K8000
12959F5369K7431k6852K0126K9447J4611p601k5990K8716k5777q89K4906K1159
12947A44656m0756R388m732n4738o6811J6975O1805K6370l0915k5882m0047P6449
12935G1762K4709l5290M860N5103K9088n0087l2922L4095R432n0704n975K3940
12923G8011j4048l232l7908O9713R4079j8038o0193j7800R2778J4036n8312j4824
12911A24262P652k0045j3118k3251N2847j6833j28786m7480O7768L195N0006j3380
12899D2837J4075O036N7939P9101l2163j3724J15869Q2656J23414J43230J75921
$$ plain form
12983 172834 128616 110508 126565 101237 31796 45259 79865 66447 58330 32386 74392 124541
12971 124541 179547 169779 161580 134201 143811 123099 46824 54173 64411 84403 37369 65369
12959 65369 92800 65948 86074 115521 130132 122531 96541 125257 99480 98591 123497 144656
12947 144656 103900 113288 108556 53818 -12993 3982 65787 92157 61242 35360 -4687 71762
12935 71762 96471 61181 66041 121144 150232 100145 67223 101318 110750 60046 54071 78011
12923 78011 63963 60731 22823 92536 186615 168577 108384 90584 183362 197398 139086 124262
12911 124262 131914 111869 98751 75500 128347 111514 -17272 -64752 3016 6211 56217 42837
12899 42837 56912 62948 120887 199988 167825 154101 269970 352626 476040 619270 795191
12888G95191J76560L22243L75914L83140K92278m7501l79220m43551l85664l25249
12878G64141k11875q1726r0671p9645n5946k3100K3329O488j4644q2153o956L1426
12866A78668P020J1426L8591q26k1530M103R957O601j7746q485l22j0410k5514
12853A71533M7377N118l3031n045n0010j4024j9224n5538m6649J3570J7056j3170
12841A7963j3974P0597P3135k7221m8525M131N2745K8054p524O90K680p344M3763
12828A89170l1070r3723K83j0252j0939O3719K4544m0389k6373K2787J358K1592
12816A10707k0539k5576r180l218L092l7178j2184Q823j1680l9649K3606K0215
12804G239Q496Q7403K4541l1408p3654m1916k877L2506K8519k1220j3858j5018
$$ plain form
12888 795191 971751 1293994 1669908 2053048 2345326 2297825 1918605 1475054 1089390 764141
12878 764141 552266 470540 379869 300224 244278 221178 244507 250995 236351 154198 147242 178668
12866 178668 185688 197114 235705 234879 213349 217452 227409 234010 216264 207779 207457 197047 171533
12853 171533 218910 224028 190997 185952 135942 121918 102694 47156 507 14077 31133 17963
12841 17963 3989 74586 147721 120500 71975 76106 128851 156905 149381 150071 152751 145407 189170
12828 189170 158100 64377 64660 54408 43469 107188 131732 91343 64970 87757 89115 110707
12816 110707 90168 64592 55412 52194 55286 18108 5924 14747 3067 -36582 -12976 7239
12804 7239 15735 103138 127679 96271 22617 -19299 -22176 10330 38849 17629 3771 -11247
12792a1247m420K6151L0612J1900L5730l772L749j9959j6606M2923p497M6509
12780A34073r933j1726P941k9469j2205L0195j0251k8137n3767J4746j5917j753
12768A3797q208P1443Q0646j7876l6094m5014r632j8671n1136j6450P9449o534
12756C5720l2517m0316J5799j1576L6930R54l1041j6962j6698J6323M5517M3077
12744D5210j4660m8446r727K8013K0749j8374l7983Q79j2391M6058k460N4988
12732E1856l071k9095l0561M4067K4875k3392m0548L6312K0217l2863m1460j9960
12720d3623R105j8743p171N5335J165J3958M2224L246K3684l5117p447n9994l823
12707b7201J3223M5264r018l4021k4080J4170K3209n3727K2782j522M4837M4614
$$ plain form
12792 -11247 -15667 10484 41096 52996 88726 84954 88703 68744 52138 95061 87564 134073
12780 134073 124140 112414 120355 90886 78681 108876 98625 70488 16721 31467 15550 13797
12768 13797 5589 77032 157678 139802 103708 58694 49062 30391 -20745 -37195 42254 35720
12756 35720 3203 -37113 -21314 -32890 4040 4994 -26047 -43009 -59707 -43384 2133 45210
12744 45210 30550 -17896 -27623 390 21139 2765 -35218 -34339 -46730 -672 -3132 51856
12732 51856 48785 19690 -10871 33196 58071 34679 -5869 30443 50660 17797 -23663 -43623
12720 -43623 -34518 -53261 -60432 -5097 -3932 10026 52250 55496 79180 44063 36616 -23378 -27201
12707 -27201 -13978 31286 22268 -11753 -35833 -21663 1546 -52181 -29399 -30921 13916 58530
12695E8530k6692l8682n3893l9257M4016L6739K6004n288l6174K8110N5394l9566
12683I241J6919M8117M0717p697o7268n0800m6978N4468K9944J9449m2290J364
12671E186n4317k4727O0238m902L06L8550n393j1620n4523j3400Q3736k1867o3168
12658f5901n3970j0830P9007O7032L1482P8859l0922m9696j0778k2010k0047M5238
12646C7464K927m5745M2331P2346q918n5757q978J2872k8628p3607k2214P892
12634f8015k967k3336P9037L8259k9513N3858N9747k08n0769n6735O662N337L7260
12621D8617j554k239J110k2349q857n5398K1224P6065K6547L2821l0031m3958
12609D1998l1673j052J798n1147P616M5730k2692M815N46j2825n6986J1977N4749
$$ plain form
12695 58530 31838 -6844 -60737 -99994 -55978 -19239 6765 1477 -34697 -6587 48807 9241
12683 9241 26160 74277 114994 107297 40029 -10771 -57749 -3281 26663 46112 3822 5186
12671 5186 -49131 -73858 -13620 -18522 -18216 20334 14941 3321 -51202 -64602 19134 -2733 -65901
12658 -65901 -119871 -130701 -51694 15338 46820 125679 94757 45061 34283 12273 -7774 37464
12646 37464 40391 -5354 36977 109323 100405 44648 35670 48542 19914 -53693 -75907 -68015
12634 -68015 -70982 -94318 -15281 22978 -6535 47323 107070 106862 56093 -642 6020 11357 48617
12621 48617 47063 44824 45934 23585 14728 -40670 -19446 56619 83166 115987 85956 41998
12609 41998 10325 9273 11071 -40076 -32460 13270 -9422 -4607 -4061 -16886 -73872 -61895 -7146
12596g146k9912j5107N61N2574K9696L6152J2635M3K1939K4547m490l4682n6375
12583C0435K2477J7778N8456K0331q0146q3962J4967j5261J579l059k3810r773
12571d9988j725L5263L2510N6174K5637K8056k1391l2699m1621J9191J2742k5008
12559C7141Q636P3812O857r3887k4939L3989M2873n3151q0127k2848J6309l2313
12547h7648o8757N401O6231L9644J747k9175J1971N9795J5965L8557j2086k6962
12535A4683L3053J7096k4078K8287p262m1258n7684Q914N232M5890J8301Q239
12523D9413k5338j0489N7414R085K241j3346j1536l2998K5585m220j7845k2861
12511E105m0726l125J7078L2150k2398O5K5697P1277J5455J6224l4689k7952n5277
$$ plain form
12596 -7146 -37058 -52165 -51604 970 30666 66818 79453 79496 101435 125982 121492 86810 30435
12583 30435 52912 70690 129146 149477 69331 -14631 336 -14925 -13346 -16405 -40215 -49988
12571 -49988 -51713 -16450 16060 72234 97871 125927 104536 71837 30216 49407 62149 37141
12559 37141 45777 119589 126446 32559 7620 41609 84482 31331 -48796 -71644 -55335 -87648
12547 -87648 -156405 -151004 -84773 -45129 -43382 -72557 -60586 -791 15174 53731 41645 14683
12535 14683 47736 64832 40754 69041 61779 20521 -37163 -28249 -23017 22873 41174 49413
12523 49413 24075 13586 71000 80085 82326 68980 57444 24446 50031 45811 27966 5105
12511 5105 -35621 -38746 -21668 10482 -11916 -11851 13846 85123 100578 116802 82113 54161 -1116
12498a116P363j894j938M5946l4621L536k351J7008L2179r950o273k0345K7914
12485E5458j6665R116k1883q841M1068J2989l8521j4962K891n3047n6714n3947
12473a43058L9576Q6088M4198p9789m0906M6712P7206N9174J6248l2119j0903
12462F2427k3476j3783L4421K728p967O70p1065R60j7211L1882L1293k0098k8058
12449a7277q385k1208J2882j0712j476J0344j6506l5868K9144J2365N8922J7128
12437B9353M5061q22l0320m026O0299J2665n0340j0626k883R890l4755J5720j905
12424C7311m8957n8298Q35j8354k6482N8723N8753q008k370K6722J6959l7017
12412a83j7676l4506j6862R6535K8271o9953M865J0961o4144k8817M0103L7900
$$ plain form
12498 -1116 6247 4353 2415 48361 13740 17276 14925 31933 64112 54162 47889 27544 55458
12485 55458 38793 47909 26026 17185 58253 71242 32721 17759 20650 -32397 -89111 -143058
12473 -143058 -103482 -17394 26804 -52985 -93891 -47179 30027 89201 105449 73330 62427
12462 62427 38951 25168 59589 62317 54350 55020 -16045 -15085 -32296 -414 30879 10781 -17277
12449 -17277 -25662 -46870 -33988 -44700 -46176 -35832 -52338 -88206 -59062 -46697 12225 29353
12437 29353 74414 73592 43272 39246 99545 112210 61870 51244 48361 58251 23496 39216 37311
12424 37311 -11646 -69944 -69109 -87463 -113945 -55222 3531 -4477 -6847 19875 36834 -183
12412 -183 -17859 -52365 -69227 27308 55579 -14374 -9509 1452 -62692 -91509 -51406 -13506
12400a3506K662N034j4317m9159J3277O3134M9246K968k4792l1109N682Q4647
12388I3767j2168n1354k0168J5437J2726K1952J055l6282k4125J4569M3509j3589
12376D5329j3896J9030j1505l2086j5492l0081P837M3399M0180N046j5359j8482
12364B3920j1396n6582k3184J8392L62J6355J1911j2803J9946N0582m904R684
12352D2283R4939M524q5320n4405J3338m1628j0923L332L9174L5394q957l5863
12340d112N5992P6163j9184j6450J3923l7565p4425n2082Q895O8696L2027k0446
12328C1432n4399k4919N9165K5546m3251k7762N5828L4547m327J3213J3831k7533
12316E1371l8510P2939O938k0464n8408K6118R3059J8545p306q2184l3829n5917
$$ plain form
12400 -13506 -10844 -5810 -20127 -69286 -56009 7125 56371 59339 34547 3438 9120 93767
12388 93767 81599 30245 10077 25514 38240 60192 61247 24965 840 15409 58918 45329
12376 45329 31433 50463 38958 6872 -8620 -38701 -30864 12535 52715 57761 42402 23920
12364 23920 12524 -44058 -67242 -48850 -48488 -32133 -20222 -33025 -13079 37503 32599 42283
12352 42283 137222 141746 56426 2021 15359 -26269 -37192 -33860 5314 40708 31751 -4112
12340 -4112 51880 128043 108859 92409 106332 68767 -5658 -57740 -48845 19851 51878 31432
12328 31432 -22967 -47886 11279 36825 -6426 -34188 21640 56187 51860 65073 78904 51371
12316 51371 12861 85800 92738 72274 13866 39984 133043 151588 144282 62098 28269 -27648
12304b7648p9870K3331q93L6158l55L8849O3214m8631l3278L0830J8462m4542
12292b4373q9333n85J05921K9486n3969k3792K302j7055r100R3117R0813k7269
12280G6163j12853J4075R3874L9120L8162n0505p5438m6758L4112K5020M1126
12269G6098m2694m9793j1459K1573j0974k6970J5135J9400M1111K2187J2027j8593
12257D7048L9052K2513K4422l9684p9113k5506L1089j7301K265L5345J9469j00620
12245d1021n0406L5825L9683J8176j4986j4932j7145l960M6494o361L2394k9045
12233e284J8996J7645q4935M245M33m0678L4032N5455K8984m3996n0862P027J410
12220e7528o02p613P3277M0820L0799m3991L605k0757l9537k5877K5138P5992
$$ plain form
12304 -27648 -107518 -84187 -85080 -48922 -49277 -10428 52786 4155 -29123 1707 20169 -24373
12292 -24373 -113706 -114291 -8370 21116 -32853 -56645 -54343 -71398 -80498 12619 103432 76163
12280 76163 -36690 -22615 71259 110379 148541 98036 22598 -24160 9952 34972 76098
12269 76098 33404 -16389 -27848 -6275 -17249 -44219 -29084 -9684 31427 53614 65641 47048
12257 47048 86100 108613 133035 93351 14238 -11268 19821 2520 4785 40130 59599 -41021
12245 -41021 -91427 -55602 -15919 2257 -12729 -27661 -44806 -48766 -2272 -8633 23761 -5284
12233 -5284 13712 31357 -53578 -49333 -48900 -89578 -55546 -91 28893 -15103 -65965 -58938 -57528
12220 -57528 -58130 -65743 7534 48354 79153 35162 38767 18010 -21527 -47404 -22266 53726
12208E3726M3922R100r3955j5077J170j7014n5990l6138L9813L6669L5931K6023
12196B8180M4112j6717J419K1126J9876o856j1992k9228l9892j1223k8079M6189
12184A6915k3810j7114l7317J1963M2015J3602K9386L3242l0657m3722M1463M6699
12172H2665j7098O186m1081J7444J2730l1880K0212j6983K4716N189m8244K8406
12160D2262L1319M001o0948o7456j2275P0543n1393n4955J015O3218J4823k404
12148b2250Q471J786n2863n0393L6435N9426N6358Q579m2705J5500K6636Q91j6131
12135B9740J494L3612K3046m9071l8828J230q068L9140O286M3558n778L5731k8140
12122H3952o9023o7307m0819p547J7352P9268M8951K0928n0189l0243m7339j0002
$$ plain form
12208 53726 97648 106748 12793 -2284 -1114 -18128 -74118 -110256 -70443 -33774 2157 28180
12196 28180 72292 55575 56994 78120 97996 91140 79148 49920 10028 -1195 -29274 16915
12184 16915 -6895 -24009 -61326 -49363 -7348 6254 35640 68882 38225 -5497 35966 82665
12172 82665 65567 71753 30672 48116 60846 28966 49178 32195 56911 62100 13856 42262
12160 42262 73581 77582 16634 -50822 -63097 7446 -43947 -98902 -97887 -34669 -19846 -22250
12148 -22250 -13779 -11993 -64856 -115249 -78814 -19388 36970 45549 2844 18344 44980 45871 29740
12135 29740 31234 64846 87892 38821 -7 1223 -6845 32295 38581 82139 76361 112092 83952
12122 83952 14929 -52378 -93197 -100744 -83392 -4124 44827 65755 15566 -14677 -62016 -72018
12110g2018L1002M1283k1458j2438p923M4423O8254R964k4462j6838r22m937K460
12097C6390L5094K6059k528k5333k7435n4835l4459L2872K2085n5448J11M1493
12085e934l1755Q4861P378k1612j6385k6214j0870K3297Q920j7938M8928N6738
12073I9414J6636p0710p5182m0298j3382M0140J8798j0024Q864J6677m1637J3842
12061c6862L2080m934J5104l6365M3631M7331m296k8667j05548m6796n190P0419
12049f0093M8467n033j64J8754P8991m871m3738L2973P6363j3563m5375k7559
12037E5152q6537K1885J4699J7702M6845K968j8892m4623K5203j119j823J6482
12025D7942k5333k2770L5669J9819n0988K0366R0126K9496k6073J9472r259p3391
$$ plain form
12110 -72018 -41016 267 -21191 -33629 -41552 2871 71125 81089 56627 39789 38867 33930 36390
12097 36390 71484 97543 95015 69682 42247 -12588 -47047 -14175 7910 -47538 -47427 -5934
12085 -5934 -37689 47172 54550 32938 16553 -9661 -20531 2766 11686 -6252 42676 99414
12073 99414 116050 45340 -29842 -70140 -83522 -43382 -24584 -34608 -25744 -9067 -50704 -36862
12061 -36862 -4782 -9716 5388 -30977 12654 59985 55689 27022 -78526 -125322 -130512 -60093
12049 -60093 -11626 -16659 -16823 1931 80922 76051 32313 65286 141649 128086 82711 55152
12037 55152 -31385 -9500 5199 22901 69746 72714 53822 9199 34402 33283 31460 47942
12025 47942 22609 -161 35508 55327 4339 24705 114831 144327 118254 137726 128467 55076
12013E5076m7917j8876N75o533l0172l0355n116K1784j3201k8973K2965R4170
12001A3427M5277m411q483K6468p576l2022p1003j1082o905j9066L0653M1253
11989c470K6124J0254O087J3097o0694k0043K1160m4853L1489l9124l7943j809
11977i9725M3826L2760J6902l028J2673O5603Q385Q352P614o412l3359J6434k6582
11964D3443j2787M9936m2010o8939K1760M6176k2395q653N623K284k1005n2935
11952e9502j2869O333N5379j4432l4981k6676l2738K6905K5059l3023o827O2424
11940d4948N2936m5703k0621M7581k9986J3054n5853j6572K9813K9753j2658L4458
11928a8746K2861q111j0295P6784k8096j1169L6723q0330k2128J0207o841m030
$$ plain form
12013 55076 7159 -11717 -11142 -17675 -47847 -78202 -83318 -61534 -74735 -103708 -80743 13427
12001 13427 58704 54293 45810 72278 64702 32680 -38323 -49405 -56310 -75376 -44723 -3470
11989 -3470 22654 32908 38995 52092 -8602 -28645 -7485 -52338 -20849 -59973 -97916 -99725
11977 -99725 -55899 -23139 -6237 -9265 3408 69011 77396 85748 93362 86950 53591 70025 43443
11964 43443 30656 80592 38582 -30357 -8597 37579 15184 6531 12154 14438 -6567 -59502
11952 -59502 -72371 -66038 -10659 -25091 -60072 -86748 -119486 -92581 -67522 -100545 -107372 -44948
11940 -44948 7988 -37715 -58336 -10755 -40741 -27687 -83540 -100112 -70299 -40546 -53204 -18746
11928 -18746 4115 -3996 -14291 62493 34397 23228 59951 -20379 -42507 -32300 -39141 -43171
11916d3171L022R620J9052K3914J0931j1299M9851j8052r1068j3427N235J9669
11904c5723q597L6636k095K6884K9854J2588l2431j2213k6816o4840L914R119
11892f3720R250L0189j6022o573k4149k18P221m047R803J9586j5665m7642k2209
11879a24196N5696M1785N4057P9868l7603r7786l6769J8003M0321L9581J9265
11868E2222J2339l4051l1821M3943L2189M272J1348r356J2380l7305n8947J9918
11856A7131N396m1760J1512K9549k7576m4628L914M8963L0334L5439K1474M6544
11844A36292k60j02437m7807k2458M6681K9377P3045p139n8989n3892R71P2503
11832F5887J3537J9764K400K134l111J3350l6491k6884K0007j5677P361J545n0845
$$ plain form
11916 -43171 -40149 -30529 -11477 12437 23368 12069 61920 43868 -47200 -60627 -55392 -35723
11904 -35723 -44320 -7684 -9779 17105 46959 59547 27116 14903 -11913 -76753 -72839 -63720
11892 -63720 -54470 -24281 -40303 -46876 -71025 -71243 -64022 -68069 -58266 -38680 -54345 -101987 -124196
11879 -124196 -68500 -26715 27342 107210 69607 -28179 -64948 -46945 -6624 32957 52222
11868 52222 64561 30510 -1311 42632 74821 79093 90441 81085 93465 56160 -2787 17131
11856 17131 22527 -19233 -7721 21828 -5748 -50376 -46462 2501 32835 68274 89748 136292
11844 136292 136032 33595 -14212 -36670 10011 39388 112433 105294 46305 -7587 -6616 65887
11832 65887 79424 99188 101588 103722 100611 113961 77470 50586 70593 54916 62277 63822 12977
11819A2977J0179L9347L4439l218l7984j7945l5788r2297R586K4182M0424K3999
11807G901o0450K414n432J9050O3280k0571r352j9821p3908j148J5625R682P2058
11794f72o3956k2434O4712j8834K9998R858J5207L8479J5432l3403p2662j4628
11782e2903J0895n1003M8636L9802m0M8137o368j2035k2223o688Q039j2884l2932
11769d1567l2500K8932J6857K2424M5660M4917p840q749o4607j2981J4339j0023
11757e138N5595k4513n631J9319j4532N3553j2626j10253k4951J6716K2725K7792
11745a944K8975l3744m6138k6214K2102L6318l2735m5390k4949J8462Q8879L7902
11733B1524j9217L0570l9306k1231J2241N220Q206j5207K2031L5634n0546K586
$$ plain form
11819 12977 23156 62503 96942 93724 55740 37795 2007 -90290 -80704 -56522 -16098 7901
11807 7901 -52549 -50135 -55567 -36517 26763 6192 -3160 -22981 -96889 -98037 -82412 -72730 -672
11794 -672 -64628 -87062 -22350 -41184 -11186 -1328 13879 52358 67790 34387 -38275 -52903
11782 -52903 -42008 -93011 -44375 -4573 -4613 43524 37156 25121 2898 -3790 4249 -8635 -41567
11769 -41567 -74067 -45135 -28278 -5854 39806 84723 76883 68134 3527 -9454 4885 -5138
11757 -5138 50457 25944 20313 39632 25100 78653 66027 -44226 -69177 -52461 -29736 -1944
11745 -1944 27031 -6713 -52851 -79065 -56963 -20645 -53380 -98770 -123719 -105257 -16378 21524
11733 21524 2307 32877 -6429 -27660 -15419 -10199 -1993 -17200 4831 40465 -10081 -7495
11721g495O9549P0563q5334j00940j0425N0584K6616J4394J5319M925m8602j4572
11709a5418m6830k5699M5331k0000j4717L9434N2565M2676L2807m6927l5435j186
11697F601O3249k1428j00324m132Q4837Q8849m6570q7196p8516o6493R8223Q7243
11685B4343N3710N0862p5388o1752p915k6361J7869M094M1197o405n2225k4547
11673f2518j6233M0328m1924J6693N6473J5055K217k485j8920J2006l2540m9967
11661h1815K0523O6260j0335o2348m206j0789J3164J6478j602J4721k3249k0186
11649h3384M6897O6569N75k5842n0911o6676J0015K3728O0933K1195k4585m0101
11637f1587O405k877J4030j2633K7434M5288K6639p216l9526J4065J392j3413
$$ plain form
11721 -7495 62054 132617 47283 -53657 -64082 -13498 13118 27512 42831 47756 -846 -15418
11709 -15418 -62248 -87947 -42616 -62616 -77333 -37899 14666 57342 90149 43222 7787 6601
11697 6601 69850 48422 -51902 -56034 28803 117652 71082 -16114 -94630 -161123 -62900 24343
11685 24343 78053 128915 53527 -8225 -16140 -42501 -24632 -20538 20659 14254 -37971 -62518
11673 -62518 -78751 -38423 -80347 -63654 -7181 7874 10091 7606 -11314 692 -31848 -81815
11661 -81815 -61292 4968 -5367 -67715 -71921 -82710 -69546 -53068 -54670 -39949 -63198 -83384
11649 -83384 -36487 30082 30657 4815 -46096 -112772 -102757 -79029 -18096 3099 -21486 -61587
11637 -61587 -55182 -58059 -44029 -56662 -29228 16060 42699 35483 -4043 10022 11414 -1999
11625a999k0353l0116J6720o868j478J5800K4065N660J5797j7802L2887o825k730
11612B2758j9912J8466J2616l0760Q025o265M7808N7548j5122J1569l584m3951
11600E9196j9617j6499j5478j4066N8691O3610n3894k7879J9318M7667n1716K636
11588E1969K0719j7630K0140k7109L650J7826k550n0n4345l7663l0040k580N2538
11575e125K5877m5212m3176M6389L9611m5578j6023J8279K3318j6754J0463K1518
11563A3587L0115j2350j3073j9452L6347K0175n406m0362R584p4M4572L1768N4413
11550A49844j1138l0797l8924k9610M983P262j740k3502j2095K2264P678o3518
11538a9293L6928l5966m3881P3293n239j5625j2547J6001j2628N7216P0136P218
$$ plain form
11625 -1999 -22352 -52468 -35748 -42616 -44094 -28294 -4229 1431 17228 -574 32313 25488 22758
11612 22758 2846 21312 33928 3168 11193 4928 52736 110284 95162 106731 103147 59196
11600 59196 39579 23080 7602 -6464 52227 115837 61943 34064 53382 101049 49333 51969
11588 51969 72688 55058 75198 48089 51739 69565 67015 66965 12620 -25043 -55083 -57663 -5125
11575 -5125 20752 -24460 -67636 -21247 18364 -27214 -43237 -24958 -1640 -18394 -7931 13587
11563 13587 43702 31352 18279 -1173 35174 55349 49943 9581 19165 19091 63663 95431 149844
11550 149844 138706 107909 68985 39375 44358 51620 49880 26378 14283 36547 44225 -19293
11538 -19293 17635 -18331 -62212 11081 5842 -9783 -22330 -6329 -18957 38259 108395 115613
11526A15613n9247l7598k6690k0844j861q86L3580l051o682j7556l2693L2677
11514b5238P5321n8947j9861M6581J1337O540k9609J1307r175K2128L7835J9985
11502H8204j6780o5756o8066k6821p0471O908P3360J3939M6095j246l9997R931
11490e0700J1278J0989J643K3536j3130K487L6473K0869P2367l5992q5458r283
11478a4921K8655m8523m2429K2923M4576M7500r138l8734m332m229J0289j8868
11466b7231K4443j6204k4198N511l6058Q6819N3860J6740K4962P870m2389l8469
11454C5656m8496j613J9418r254K2499j6822k7099K1370L3661M3171K252j4837
11442E9906q968n3760O126l1242j7158N2477L9818l0091k7026l0594O4346N4924
$$ plain form
11526 115613 56366 18768 -7922 -28766 -30627 -31513 2067 -984 -7666 -25222 -57915 -25238
11514 -25238 50083 -8864 -28725 17856 29193 35733 6124 17431 8256 30384 68219 88204
11502 88204 71424 5668 -62398 -89219 -159690 -152782 -79422 -65483 -19388 -20634 -60631 -50700
11490 -50700 -39422 -28433 -26790 -3254 -16384 -13897 22576 43445 115812 79820 -5638 -14921
11478 -14921 13734 -34789 -77218 -54295 -9719 37781 28643 -10091 -14423 -18652 -8363 -27231
11466 -27231 -2788 -18992 -43190 -37679 -73737 13082 66942 83682 108644 116514 74125 35656
11454 35656 -12840 -14453 4965 -4289 18210 1388 -25711 -4341 29320 72491 74743 59906
11442 59906 50938 -2822 3304 -27938 -45096 7381 47199 17108 -9918 -40512 23834 78758
11430G8758k0584l6193m2356K3907M7910L0615K0147q8707K159J1077J7184l4738
11418I179J687l4262j5626N0660o720l1313J7803k8304P018O6252j3962k6635
11406d223o0039k7516K0929M5685K9560L5531l576n6581j4223R886j0343O5488
11394C0578k288J857M9352K4418l8599l4867k6945J1787K1406Q171q248L5339
11382G1961J8503K655k4693n8077Q766p245j0875J2768r5527q6625P4578j1353
11370a05164K2777R0227K1179j1979J6305K9162o964l9362Q225J3937j4837k4397
11358h91l9576m9736K9326M1806l8649K2511K3127l5016o0598p551K2815P9951
11346a2481L8190q014K0980k051L0688q643j4693O709k1784o4685k6556P8937
$$ plain form
11430 78758 58174 21981 -20375 3532 51442 82057 102204 13497 15656 26733 43917 9179
11418 9179 10866 -23396 -39022 11638 4918 -26395 -8592 -36896 -29878 36374 22412 -4223
11406 -4223 -64262 -91778 -70849 -25164 4396 39927 36351 -20230 -34453 -24567 -34910 30578
11394 30578 28290 30147 79499 103917 65318 30451 3506 15293 36699 44870 36622 71961
11382 71961 90464 93119 68426 10349 19115 11870 995 13763 -81764 -168389 -93811 -105164
11370 -105164 -82387 7840 29019 17040 33345 62507 55543 16181 24406 38343 23506 -891
11358 -891 -40467 -90203 -60877 -19071 -57720 -35209 -12082 -47098 -107696 -115247 -92432 -12481
11346 -12481 25709 17695 38675 36624 67312 58669 43976 50685 28901 -35784 -62340 16597
11334A6597O0530L8329m5198m7679l5818K8057m1243j7629j4284L287N5473J8093
11322A8515j1894K1817j5624K8014j6362J0232k098m6128n2820J4464K8430n9530
11310h2984n99R4742P0623p3051q2941O046N6737M5487l4195p5967J0446M0447
11298b5209r578o306P6348K5889n0226J4430m896M8988j2444k4560n2004m7176
11286f6744L6717O5998K1434l0915k0698M351o7223m9598L2846j2219K2894K7467
11274c5690L0826l2484j7160K720N6118N203j8500M709M097M085R88M7025J9746
11261G1683r553K0465M459k0891p093j2102l6882l1438O0404O117j5216q244n3607
11248c1898L16L5236L2538m71m924J2222L6882K3189j2408L9462J0731m9898q7671
$$ plain form
11334 16597 77127 115456 70258 22579 -13239 14818 -26425 -44054 -58338 -55051 422 18515
11322 18515 6621 28438 12814 40828 24466 34698 32600 -13528 -66348 -51884 -23454 -82984
11310 -82984 -83583 11159 81782 8731 -74210 -68164 -11427 34060 -135 -76102 -65656 -25209
11298 -25209 -34787 -41093 35255 61144 10918 25348 20452 69440 56996 32436 -19568 -66744
11286 -66744 -30027 35971 57405 26490 5792 10143 -57080 -106678 -73832 -86051 -63157 -35690
11274 -35690 -4864 -37348 -54508 -51788 4330 9533 -8967 -4258 -161 3924 4912 51937 71683
11261 71683 62130 82595 87054 66163 59070 46968 10086 -21352 39052 45169 29953 21709 -31898
11248 -31898 -31582 3654 36192 35721 30797 43019 79901 103090 90682 130144 140875 90977 3306
11235C306o4791L6166M3054j3515j1488P797n184j2729J8105j2898j7295N0374
11223B0902j0150k114Q604J3728l1190n3153M3327K676j3498M6166N7040n559
11211G6779p2920k0933N3178m395M0996j8569p2198m8818L2166o5561l2460M9828
11199h2907L5535j7634N904N5237O5209L3062o9178l2335K247R167J8823j9249
11187C881L4075L2626k8858j7202J7980l1099p7304o6632j3384M9297K6333K9468
11175d0819l682j6487L0895R594K2110K7528n882k0604J3090n167n0488n9203
11163i9115l4179Q9977M3266J9230j1449O535j5150K837q6832n258N9164J5066
11151a5908k2557O812j5586K1576M991m4086K5403J10590K3977m8527j0148l3711
$$ plain form
11235 3306 -61485 -25319 17735 4220 -7268 529 -4655 -17384 721 -12177 -29472 20902
11223 20902 10752 8638 17242 30970 -220 -53373 -10046 -7370 -20868 25298 82338 76779
11211 76779 3859 -17074 36104 31709 72705 54136 -18062 -66880 -34714 -100275 -132735 -82907
11199 -82907 -47372 -65006 -59102 -3865 61344 94406 25228 -7107 -4860 4307 23130 3881
11187 3881 37956 70582 41724 24522 42502 11403 -65901 -132533 -145917 -96620 -70287 -40819
11175 -40819 -44501 -60988 -30093 -20499 1611 29139 23257 2653 15743 10576 -39912 -99115
11163 -99115 -133294 -43317 -51 19179 7730 14265 -885 1952 -84880 -90138 -30974 -15908
11151 -15908 -38465 -31653 -47239 -25663 -20672 -64758 -39355 71235 95212 46685 36537 2826
11139B826o0569l831L3719n151K7048M2189K1257l416j2715J1676K6402K6833
11127A06268J5468l7536l0921j5339m8027l9350L965M441J0743J9978J8215N2669
11115F0574P789J0474l3498o2416k8755q720M475J4388K0047K2359O370m5427
11103c2340l8534k9191o818N5499M0530J4605L802k8659k097J9623m7011k0579
11091g1170j7012k0006R766M0914K5629K8068m0614q372M1062L2845k9430m3812
11079e2132j8034K0150J8575L391n1021N592P4421K2552n7187J6814k8441K6758
11067a8562j7071O0534M7590l0169k916k9897J7754R928m8398n0587p116O7845
11055a065o423j0846J0531j1626l592Q01L992J0961K0580n1286o622L9962m550
$$ plain form
11139 2826 -57743 -61574 -27855 -33006 -5958 36231 57488 54072 41357 53033 79435 106268
11127 106268 121736 84200 53279 37940 -10087 -49437 -45472 -41031 -30288 -10310 7905 60574
11115 60574 68363 78837 45339 -17077 -45832 -54552 -50077 -35689 -15642 6717 13087 -32340
11103 -32340 -70874 -100065 -106883 -51384 -10854 3751 7553 -21106 -23203 -3580 -50591 -71170
11091 -71170 -88182 -108188 -98422 -57508 -31879 -3811 -44425 -52797 -11735 21110 -8320 -52132
11079 -52132 -70166 -50016 -31441 -28050 -79071 -73479 942 23494 -33693 -16879 -45320 -18562
11067 -18562 -35633 24901 72491 42322 39406 9509 27263 37191 -11207 -61794 -68910 -1065
11055 -1065 -7488 -18334 -7803 -19429 -23021 -22220 -18228 -7267 13313 -37973 -44595 -4633 -9183
11042i183l5197k1834L685l895k5283P449O207K9334M9187K1634k9296L4591K5985
11029E3384m5509j6393o4559k63K985L3888K7611M0177K6477n8112M456L3265
11017C7407K6413l4147K826N343r153k1738m8379k2292J9681n5785k3061o660
11005a29545L7428J00946j9481m3924K9106J1296l1979k8979k0173J3593O4020
10994a7692l0164N875M985l8469J1250O2100j3542J0106J2617m5333q12K789m7908
10981h4198j4484j183L6979L2643j1776k3756o083J2643O2774M567l9429k4128
10969e5431L4628Q896j0221o958P2310n663p7408M0346Q105K3874K155l8178k240
10956e785Q2815M5698n0089m9665o99L1494l261J9915k4637m969k2510k4892j0736
$$ plain form
11042 -9183 -44380 -66214 -62529 -66424 -91707 -84258 -78051 -48717 470 22104 -7192 27399 53384
11029 53384 7875 -8518 -73077 -73340 -70355 -36467 -8856 31321 57798 -314 4142 37407
11017 37407 63820 29673 32499 37842 28689 6951 -41428 -63720 -44039 -99824 -122885 -129545
11005 -129545 -92117 8829 -10652 -54576 -25470 -14174 -46153 -75132 -95305 -81712 -17692
10994 -17692 -47856 -41981 -36996 -75465 -64215 -2115 -15657 -5551 7066 -38267 -39079 -36290 -84198
10981 -84198 -98682 -99865 -62886 -30243 -42019 -65775 -71858 -59215 3559 8126 -31303 -55431
10969 -55431 -20803 -11907 -22128 -29086 43224 37561 -39847 499 8604 32478 34633 -3545 -5785
10956 -5785 77030 122728 72639 22974 22275 53769 50508 70423 45786 40817 18307 -6585 -17321
10943a7321o3280j1848O3258Q767N1452k0930o2582k2164Q2944N1811L543n2516
10931A1134Q168M8341k9511p5164m9976L337O1785l2823P507L5226j8321J3677
10919a6620L8681J1608p445L148M267K2421L993j7615n9658o9948j2849J8762
10907h1255j1882K7249J8688L3238O3306M866m8552J3070K8252j6822m9530l4128
10895e3500J6015M6362J4425j3980J7166l0465p170K1241K1243J4066j2247n2899
10883a9743j4186K7394j0067K3651j7606k6275M3732k2386o3739P0417k0502l9021
10871f8331J9345J5812J1331Q806j0035n5033n2412N921l1041P1559R4020k6038
10859a6096L5571M4215n8992k7927J7361J8130j844n444l3397M3795M2907L2388
$$ plain form
10943 -17321 -80601 -92449 -29191 -20424 31028 10098 -52484 -74648 8296 60107 63650 11134
10931 11134 19302 67643 38132 -37032 -87008 -83671 -21886 -54709 -47202 -11976 -30297 -16620
10919 -16620 22061 33669 26224 29372 33639 56060 60053 42438 -17220 -87168 -100017 -81255
10907 -81255 -93137 -65888 -47200 -13962 49344 54210 5658 18728 46980 30158 -19372 -53500
10895 -53500 -37485 8877 23302 9322 26488 -3977 -11147 10094 31337 45403 33156 -19743
10883 -19743 -33929 -6535 -16602 7049 -10557 -36832 6900 -15486 -79225 -8808 -29310 -68331
10871 -68331 -48986 -33174 -21843 -13037 -23072 -78105 -130517 -124596 -155637 -84078 9942 -16096
10859 -16096 19475 63690 4698 -23229 -5868 12262 10418 4974 -28423 15372 58279 90667
10847I0667Q28k9898o4710J8045J3390o201o780M595l275M54K3220L5655r690
10834F6300m0956k7182R825n6589m0100J4794j9119N2386M8179L241K7003O111
10822D3893k5197O9687J5860k6088l3620l1587O445N1719M0285m1460l8796J7333
10810D8474m9561R114l6620j4720j1898K7062m7529R184M3753n8242l3389o859
10798a21231O8018M1063q644q872j546R8862l9429m3424K5625j7560N647O1691
10786F0200k9556m3685j6940Q0362M3503p2395o9999M1378j8576k175P8600M5029
10774I5746P475j9209K0983n7300l332K7715j5378m8311m6968k2017r99K5198
10762c6397N0572K7854J865K0221l6702m5625k0815J00579L0527k0241m7753k7551
$$ plain form
10847 90667 91495 61597 -3113 14932 28322 22121 15341 19936 16661 17115 40335 75990 66300
10834 66300 25344 -1838 7987 -48602 -88702 -73908 -93027 -40641 7538 10779 37782 43893
10822 43893 18696 88383 104243 78155 44535 12948 19393 71112 111397 69937 31141 48474
10810 48474 -1087 8027 -28593 -43313 -55211 -28149 -75678 -66494 -22741 -80983 -114372 -121231
10798 -121231 -53213 -12150 -20794 -29666 -31212 67650 28221 -15203 10422 -7138 -1491 60200
10786 60200 30644 -13041 -29981 50381 93884 21489 -48510 -7132 -25708 -27883 50717 95746
10774 95746 103221 84012 104995 47695 44363 72078 56700 8389 -38579 -60596 -61595 -36397
10762 -36397 14175 42029 43894 64115 27413 -18212 -39027 61552 92079 71838 24085 -3466
10750c466M175M6212M6681o9594k9075j5684J5642K2444k0928l629M0900L1289
10738F4967J1784l9486n0258L1451K3858K0097l0290q182k1402l3318p923N9483
10726B0781M3786j8190l8522O8944K8626l3282p4279l7157K2151L9820l4254k227
10714a3803M6571m3846j9766k9610N7650R576J230K0616l2638M5901J6271K7118
10702H5270k8873j2691l4273l5916J7084J5530J6477j9369j4160k4225j8419K0203
10690c3362Q1434m706m7877L2704l569k4185K632l2929n1517K0244L7769N1057
10678B7695P595j9705P799J8781m4551k9363j9677m0616j295M4274M703L1335
10666a3025j0090n0875j4086k8203J0451j839O5121J16072J6625p929k0880m0973
$$ plain form
10750 -3466 709 46921 93602 24008 -5067 -20751 -5109 17335 -3593 -7222 33678 64967
10738 64967 76751 37265 -12993 18458 42316 62413 32123 23941 2539 -30779 -38702 20781
10726 20781 64567 46377 7855 76799 105425 72143 -2136 -39293 -17142 22678 -11576 -13803
10714 -13803 32768 -11078 -30844 -60454 -2804 6772 8002 28618 -4020 41881 58152 85270
10702 85270 56397 43706 9433 -26483 -9399 6131 22608 3239 -10921 -35146 -53565 -33362
10690 -33362 48072 43366 -4511 28193 24624 439 3071 -29858 -81375 -61131 -23362 27695
10678 27695 35290 15585 23384 42165 -2386 -31749 -51426 -92042 -93337 -49063 -44360 -13025
10666 -13025 -23115 -73990 -88076 -116279 -105828 -107667 -42546 73526 90151 82222 61342 20369
10654B0369k6255N8671j0657J659j2983n644l7817l7877o4061k2423P6392M9417
10642a1209J268k4453J0466M1681o083r440J6517J9726n7562l7952R1529J5172
10630D9660p031j9191o9348J2820O41j1873q687l6216K6672K5393o477j738j1904
10617e7279K5485K4013j3791K0865K5815Q615q6256o508j0338p5683K9299M4940
10605g0823k9107o6422L999M606M4384L0686m089j4056j332L0618J8151K318L5140
10592a5927k5735o0985j8339j148Q6342l386o536k203q4K6189k733k2296O941
10579c9900o7435K141O7328M9195l3580m0035N1800L0830k603k4921j108j0907
10567a9195k3708J6165j8k7047O4218L2658k9771k7p961j3811J3567Q302m8447
$$ plain form
10654 20369 -5886 52785 42128 43787 30804 25160 -12657 -50534 -114595 -137018 -60626 -11209
10642 -11209 -9941 -34394 -23928 17753 11670 2230 18747 38473 -19089 -57041 34488 49660
10630 49660 42629 23438 -45910 -33090 -32449 -44322 -53009 -89225 -62553 -37160 -43637 -45375 -57279
10617 -57279 -31794 -7781 -21572 -707 25108 33723 -52533 -59041 -69379 -145062 -115763 -70823
10605 -70823 -99930 -166352 -162353 -157747 -113363 -82677 -86766 -100822 -102154 -71536 -53385 -51067 -15927
10592 -15927 -41662 -102647 -120986 -122134 -35792 -39178 -45714 -47917 -48001 -21812 -24545 -46841 -39900
10579 -39900 -107335 -105194 -37866 11329 -22251 -62286 -10486 20344 17741 -7180 -8288 -19195
10567 -19195 -42903 -26738 -26756 -53803 10415 43073 13302 13275 5314 -8497 5070 13372 -35075
10554c5075M606N683k0056J8502R225j8904k2715J5739M6427K916k9912p266K3998
10541f832k6876L5369L609q878n194K1078p200m2856J4152p31M5691l6359l0049
10528d5076q351M1571j1575L526N7047j3748l7366n4064j7973l510O6111K4765
10516A357o7988L3409N1751k1439R591O0730J4804o8141l5364J1002j8972k7774
10504e7034N464M3166M1501P290J747n6414k3279M049j308K3981N633M4838k2136
10491A7498o90l1296n9773k5680l7668R168K7742J283J5191Q7010O4652j0342
10479E7095q5476o3021O9793K9879k1518N60R548L8701k6482J1027K1037k3178
10467A7965j3332J3750N5936P792p4398n3481j013M0226J716J5916k5150j1729
$$ plain form
10554 -35075 -30469 -24786 -44842 -26340 -17115 -36019 -58734 -42995 3432 6348 -23564 -30830 -6832
10541 -6832 -33708 1661 5270 -3608 -8802 12276 5076 -37780 -23628 -24359 21332 -15027 -45076
10528 -45076 -53427 -11856 -23431 -19905 37142 23394 -13972 -68036 -86009 -89519 -23408 1357
10516 1357 -66631 -33222 18529 -2910 6681 67411 82215 14074 -21290 -10288 -29260 -57034
10504 -57034 -51570 -8404 33097 40387 42134 -14280 -37559 -33510 -34818 -10837 -5204 39634 17498
10491 17498 16808 -14488 -74261 -99941 -137609 -128441 -100699 -99416 -84225 2785 67437 57095
10479 57095 -28381 -91402 -21609 8270 -13248 -12688 -3140 35561 9079 20106 41143 17965
10467 17965 4633 18383 74319 82111 7713 -45768 -46781 -6555 -4839 11077 -14073 -25802
10455b5802K9981O5309o736K6366l9324q979k0982k4910M5331K6260j7362n2716
10443c564L595j5826q868M8773J5663l5378n6853q627L1184N1925M0174k8624
10431C3574J5890m9053j6790M9311o806J4273l507L827q132r761n8462O224M7189
10418A7777L4223o777m9636m1911j581J8067o7204m8242J7021N8162l1295N4470
10406d6926q279L1474L7564M866M350j2290L4026J3872M828k705L1827L540o8577
10393B7570N196M3976l2501k7483m0787Q777K935K3354L5603o0228q1439l4594
10381a29621M4548K8650l7483k0832O7914k9610J312M2655M1657L5466K0631p050
10369E8237K7758k7627J150j9846l5394m0878K8425M7519L209K1300k7192r199
$$ plain form
10455 -25802 4179 69488 62752 89118 49794 40815 19833 -5077 40254 66514 49152 -3564
10443 -3564 31 -15795 -24663 24110 39773 4395 -52458 -61085 -29901 22024 62198 33574
10431 33574 49464 411 -16379 32932 26126 40399 36892 40719 32587 22826 -35636 -29412 17777
10418 17777 52000 45223 -4413 -46324 -47905 -29838 -97042 -145284 -128263 -70101 -101396 -46926
10406 -46926 -55205 -23731 13833 18699 23049 10759 44785 58657 63485 60780 92607 96147 27570
10393 27570 32766 76742 44241 16758 -24029 -15252 -12317 11037 46640 -13588 -95027 -129621
10381 -129621 -85073 -56423 -93906 -114738 -46824 -76434 -75122 -32467 9190 44656 65287 58237
10369 58237 85995 58368 59518 39672 4278 -36600 -8175 39344 42553 63853 36661 27462
10357B7462k1021k6714R208N6966M6805K1021P768j881J3198k6000N4860M6122
10345B07794L8507Q686K164R274L7024J09738R2581O1538K7018p0834j9869l8068
10333D65553m3902o1937j03143r2695o085o7095n0573N4217O4796l6365l1792
10322I0979k9096l328L262M2824L9391K066o805M0278J4468q4307l7848j9464
10310E2420j6629k7042J1421O582l2449k3922M838P0266J3732j362q757k9062
10298B0036o4680k3501L8518k1299P398J4517P84j6185K4834k4423r834j4290
10286f8125K4999j617l6038q925P144l9554j4161Q5039N3571j1626k8701Q946
10274b9048K2656o565J1155j3724k1914L8041l0703j6447j7848l367L0567O3809
$$ plain form
10357 27462 6441 -20273 -11065 45901 92706 113727 121495 119614 132812 106812 161672 207794
10345 207794 246301 254987 257151 266425 303449 413187 505768 567306 594324 523490 503621 465553
10333 465553 421651 359714 256571 163876 157791 90696 40123 94340 159136 122771 90979
10322 90979 61883 58555 61817 104641 144032 146098 139293 179571 194039 109732 71884 52420
10310 52420 35791 8749 20170 26752 -5697 -29619 -24781 45485 59217 57855 49098 20036
10298 20036 -44644 -68145 -29627 -50926 -43528 -29011 -28227 -44412 -19578 -44001 -53835 -68125
10286 -68125 -43126 -44743 -80781 -89706 -82562 -122116 -136277 -51238 2333 -9293 -37994 -29048
10274 -29048 -6392 -12957 -1802 -15526 -37440 601 -30102 -46549 -64397 -67764 -37197 26612
10262B6612q78m9296j1367j0072J1024N0172n487l5966J3451k2286n1736K7290
10250e8539N2109L70k6911j2813l3478O428Q9315M2338O220k628O0462j4173k3408
10237H5292k4639q93m0038k7169J8101j9718K4408l8853m9231M2067M6602N811
10225B1740K660k9978n5130k1839j0793M1714N1794K6496Q555j0914l1520k8307
10213c5522N649K6058k5171j7447q964K3834k5615M2224L2389k880j7980K4736
10201B1311J3394l9237n2316n1032L6727j4515K7436O13M068L4085j515o0696
10189h1677k1582M7926L1611M5153M1582n067j3787l2953j4981J5117K0246j9524
10177A2064n354O9001k4180j17266l2400J2969J05770n579o7157M9640p840L568
$$ plain form
10262 26612 25734 -23562 -34929 -45001 -33977 16195 10708 -25258 -11807 -34093 -85829 -58539
10250 -58539 -6430 -6060 -32971 -45784 -79262 -72834 16481 58819 65039 62411 122873 108700 85292
10237 85292 60653 59760 19722 -7447 10654 -9064 15344 -23509 -72740 -30673 15929 21740
10225 21740 24400 -5578 -60708 -82547 -93340 -51626 168 26664 35219 24305 -7215 -35522
10213 -35522 -29873 -3815 -28986 -46433 -55397 -31563 -57178 -14954 17435 14555 -3425 21311
10201 21311 34705 -4532 -56848 -107880 -71153 -85668 -58232 -57619 -53551 -19466 -20981 -81677
10189 -81677 -103259 -55333 -23722 21431 63013 57946 44159 11206 -3775 11342 31588 12064
10177 12064 6710 75711 51531 -65735 -98135 -85166 20604 15025 -52132 -2492 -10332 -6764
10165f764m0430q70O3219K3857m5840m5382K6642N8230M3015K290o1790j2288
10153C889J8964m1395q615j0029L7868k5508m1243N4472P2331j501m4877j4555
10141a99n6247M308L4872k9447k5835J8128N2935j283j9212K1304m6026l6781
10129h3483Q351M8594P942r816K3265r483k9569j4714m2446P541o503n775Q1921
10116b4175N0886j2008j7034K4766j9411J4438Q76N077K5002j0653m8666L4921
10104B4019L184p095L766m821p410o71J5958K2942N10K5851K3957q9740l9768
10091b9318J697l079M8383K5660j7732j2090J6041K7592K1178q215l0421k8459
10079A1237j9740J2984q017k3091K1968L6151j7256o497L7678j8632k5531l2190
$$ plain form
10165 -6764 -47194 -48064 15155 39012 -6828 -52210 -25568 32662 75677 77967 16177 3889
10153 3889 22853 -18542 -27157 -37186 682 -24826 -66069 -11597 60734 59233 14356 -199
10141 -199 -56446 -52138 -17266 -46713 -72548 -54420 -1485 -2768 -21980 -676 -46702 -83483
10129 -83483 -75132 -26538 -18596 -28412 -5147 -14630 -44199 -58913 -101359 -93818 -100321 -106096 -24175
10116 -24175 26711 14703 -2331 22435 3024 17462 18338 23415 48417 37764 -10902 24019
10104 24019 27203 20108 23874 19053 11643 10972 26930 49872 50382 76233 100190 10450 -29318
10091 -29318 -27621 -30700 17683 43343 25611 13521 29562 57154 78332 70117 39696 11237
10079 11237 -8503 4481 -3536 -26627 -4659 31492 14236 7739 45417 26785 1254 -30936
10067c0936m1006Q4477M753k8256J9458P4531k1767j32651q3727j9886J5176N7468
10055a02366J4366k7437j2235L1703L1500K071k7985L9380L1094M8188J4243j3839
10043B8683k447K5126O8604N3778m9491j7149m8242j8840R766J865k8325N828
10031B9156l2179l5121L3901K0385k380k4797L653J4732N3279m634l6635p0203
10019e0843L1634L7943J7338j394n9088M978K7499k9642j2725M2977P1142m668
10007G5151o7052l8151l8009M794O1276M9644m0453j8933Q571J4321j633O413
9995A5939R06o4508k8320j199R326J1335L2802r075l1549J4742l298n6348Q76
9982a08371O9948L3769o0363j7829O7453J8986m8620l6773K4507j5982K323K9736
$$ plain form
10067 -30936 -71942 12535 17288 -10968 8490 83021 61254 -71397 -155124 -175010 -159834 -102366
10055 -102366 -88000 -115437 -127672 -95969 -64469 -62398 -90383 -51003 -19909 28279 42522 28683
10043 28683 26236 51362 119966 173744 124253 107104 58862 40022 49788 51653 23328 29156
10031 29156 -3023 -38144 -4243 16142 13762 -11035 -7382 7350 60629 55995 19360 -50843
10019 -50843 -19209 18734 36072 34678 -24410 -19432 8067 -21575 -34300 8677 79819 75151
10007 75151 8099 -30052 -68061 -63267 -1991 47653 7200 -11733 -3162 11159 9526 15939
9995 15939 16845 -47663 -75983 -77182 -67856 -56521 -23719 -32794 -64343 -49601 -52899 -109247 -108371
9982 -108371 -38423 -4654 -65017 -82846 -15393 3593 -45027 -81800 -57293 -73275 -70952 -41216
9970d1216p719L124L4811L0520j5201o825j2784R65m505k6814M312J0811K3043
9957g478K183l4288l1873M8414K6943l4914k8325m6474K3786M8048k382J8179
9945a8181O3977L4603J4752l4096l2955p2303k4361Q81K736o224k3676L7042L6056
9932b1749j7499q2482K6226j1387P4904K0093n9632l5470M27p9385J475J551P0725
9919a12203L1314k1295k8377K6509Q7066K4732o376J77J0733m1797j6420L0293
9907a5644n4038j8312O6469M0783N927j02918l5704K7994L3478o1318k0191N7341
9895g6133Q6090R196j5822p0356n797M8659l403n603o3973R323O0522j3185L714
9882c6768N9089K6266m6650K3872K0796j0605N007j1523m3572n1054j9950P333
$$ plain form
9970 -41216 -48935 -45811 -11000 19520 4319 -2506 -15290 -14325 -18830 -45644 -41332 -30521 -7478
9957 -7478 -5295 -39583 -71456 -23042 3901 -31013 -59338 -105812 -82026 -33978 -36360 -18181
9945 -18181 45796 80399 95151 61055 28100 -44203 -68564 -67683 -64947 -71171 -94847 -57805 -21749
9932 -21749 -39248 -121730 -95504 -106891 -31987 -11894 -71526 -106996 -106569 -185954 -184479 -182928 -112203
9919 -112203 -80889 -102184 -130561 -104052 -16986 7746 1370 1547 12280 -29517 -45937 -15644
9907 -15644 -69682 -87994 -21525 19258 25185 -77733 -113437 -85443 -51965 -113283 -133474 -76133
9895 -76133 9957 19153 3331 -67025 -72822 -24163 -27566 -33169 -97142 -87819 -27297 -40482 -36768
9882 -36768 22321 48587 1937 25809 46605 36000 41007 29484 -14088 -65142 -85092 -77759
9870g7759M0091O1060P0049k7561o7228k4601K9042m0639J9659J8394n4282l0293
9858h4068K7779M2879L017o6310j2344n8408o687N2335r538j2472O232K6648M6025
9845d4912p055M5928K9838J7616K1655k9962l1208K154j2813n962k1791M1834
9833E322q660m2140P426O089L0817j1557m2698q441L1878N26O2433j8775m1810
9820b9590M71J3389j810J3454m419L4671r977J4461j5867n7661J6764M2202K3985
9807D0073O1165J8641p6356n9326j16090l7055M1392K8471K3703l047j7798K609
9795i3618P7966M8738l5877m8962K9392j5072k4565O6633M2529j5334J1509n9128
9783a5789k8900L5641o464k0040J6914J2469l5059o249J4297Q863k3937J5485
$$ plain form
9870 -77759 -37668 23392 93441 65880 -1348 -25949 3093 -37546 -17887 507 -53775 -84068
9858 -84068 -56289 -13410 -10393 -76703 -89047 -147455 -154142 -101807 -111345 -123817 -117585 -90937 -44912
9845 -44912 -51967 -6039 23799 41415 63070 33108 1900 4054 -8759 -14721 -36512 5322
9833 5322 -3338 -45478 -38052 -31963 -1146 -12703 -55401 -63842 -31964 -31438 30995 12220 -29590
9820 -29590 -29119 -15730 -17540 -4086 -8505 26166 16189 30650 14783 -42878 -26114 16088 40073
9807 40073 101238 119879 43523 -15803 -131893 -168948 -127556 -99085 -75382 -78429 -96227 -93618
9795 -93618 -15652 33086 -2791 -51753 -22361 -37433 -61998 4635 47164 31830 43339 -15789
9783 -15789 -44689 -9048 -15512 -35552 -18638 -6169 -41228 -47477 -33180 -24317 -48254 -32769
9771c2769P6844j6729k0625K693m4827K6744K2716R570j0972k4432p5779j3640
9759a01206M7584O1779K3641k9883n8989j0642k6754j2423K9621J815K2587K3517
9747b9353M9159M5139q278m654L408m957N0965n5966q7666o5468O0543j49K6040
9734b1237N1665L6617p1374n8447J6704r948k7350K156J4152N6018J9412M932
9722A3300j7497r395J4007j8718J0024N5935n297l6805K7382K715q3868o4735
9710a12952L4444N9692M3492k8557J983L4209o6058l0424j647K9698O260J9083
9698a0777m178m480J5604r27L0337M1004k7905o3549l2786L926n6919J273O3000
9685d6377K7185m1889j4635K8521n909j7674J4537L5571K2675k5273l1138O144
$$ plain form
9771 -32769 44075 27346 6721 9414 -35413 -8669 14047 23617 12645 -11787 -87566 -101206
9759 -101206 -53622 8157 31798 1915 -57074 -67716 -94470 -106893 -77272 -75457 -52870 -29353
9747 -29353 19806 64945 56667 52013 55421 50464 101429 45463 -42203 -107671 -47128 -47277 -21237
9734 -21237 30428 67045 -4329 -62776 -46072 -56020 -83370 -81214 -67062 -11044 8368 13300
9722 13300 -4197 -13592 415 -18303 -8279 47656 42359 5554 32936 35651 -48217 -112952
9710 -112952 -78508 -18816 24676 -3881 -1898 32311 -33747 -64171 -65818 -36120 -29860 -10777
9698 -10777 -14955 -19435 -3831 -4758 25579 66583 38678 -24871 -57657 -53731 -110650 -109377 -46377
9685 -46377 -19192 -61081 -75716 -47195 -53104 -70778 -56241 -20670 2005 -23268 -54406 -48262
9673d8262j3310l6498R5351N9064l7725J8702P151O002m5471m6818M7053P614
9661A2853k2836K0530k2685l2217R895p5139o902Q388j8338k4406O6322O5672
9649a8863m1298l7375P106K2762N1604K0360j3064k7218M1149L4119L9543L8458
9637A17283m4910p4636n8076j8148M3053K5268m455k3740J669Q4777K9917k6375
9625E1627l1945L3830j3179k7746l4351j3380J3978k4540M6260M5597J932m7187
9613H96q2353m3447k99P5369K5367J3294l4985q902K8972M8981k2544M1122j7248
9600B4223k866m12M006L0289n4384j7904J7586q737j3598J9358j0174p240K3450
9587C597N859J651l1965m360p7681L447L7280J03988J367j2397k2097M031R970
$$ plain form
9673 -48262 -61572 -98070 -2719 56345 18620 37322 44473 50475 5004 -41814 5239 12853
9661 12853 -9983 10547 -12138 -44355 -34460 -109599 -116501 -108113 -126451 -150857 -84535 -18863
9649 -18863 -60161 -97536 -90430 -67668 -16064 4296 -8768 -35986 5163 39282 78825 117283
9637 117283 72373 -2263 -60339 -78487 -35434 -10166 -14621 -38361 -36692 48085 78002 51627
9625 51627 19682 53512 40333 12587 -21764 -35144 -21166 -45706 554 46151 48083 896
9613 896 -81457 -124904 -125203 -49834 -24467 -11173 -46158 -55060 -26088 22893 349 41471 24223
9600 24223 21357 20945 24951 55240 856 -17048 538 -8199 -21797 -2439 -12613 -19853 3597
9587 3597 9456 11107 -20858 -25218 -102899 -99452 -62172 41816 43183 30786 8689 12720 22690
9574B2690j1369o005M2499M0510r830j6285k5871L2083k8642l2938j1040j0390
9562a4588q0822p5478q237O9766P0369L4030K7591M1129n4733K3774l4714o5492
9550f7405j3099M6246n960J5387l4666l2693n531N291O668K6378L2180j1736j6048
9537e4988K2392K1867j8001j037q462l7368K4574N4192K5880j1961j1981J5740
9525B0847K6089o914l0723K5534N1330l3177K9735l3506l6148o7759O025k5019
9513g3686p586O326J117J2801O9670k3148l1781j0997P3766L1809l3795N642J2920
9500C3058j3617j663r967j5883K4474N2275J5274J137L9309l3211q4501q8640
9488h1955Q937M8683L4508M6261m3579m1956m2957J174N4448K4225j14555j1628
$$ plain form
9574 22690 11321 5316 47815 88325 78495 62210 36339 68422 39780 6842 -4198 -14588
9562 -14588 -95410 -170888 -179125 -109359 -38990 -4960 22631 63760 9027 32801 -1913 -67405
9550 -67405 -80504 -34258 -40218 -24831 -59497 -92190 -97721 -92430 -85762 -59384 -27204 -38940 -54988
9537 -54988 -32596 -10729 -28730 -29767 -38229 -75597 -51023 3169 29049 17088 5107 20847
9525 20847 46936 40022 9299 34833 86163 52986 82721 49215 13067 -54692 -48667 -73686
9513 -73686 -81272 -74946 -73829 -61028 8642 -14506 -46287 -57284 16482 48291 14496 20138 33058
9500 33058 19441 17778 7811 -8072 16402 68677 83951 85088 124397 91186 6685 -81955
9488 -81955 -73018 -24335 10173 56434 12855 -29101 -72058 -70884 -16436 7789 -106766 -118394
9476a18394N3531K2609k1038k8578K0894J6667j393k1791P9069N46L4720L5964
9464G2806k4055p194m6205L7305k4127o296k446o2217m4638K0231J6667Q938m682
9451f5913N983K4984R717l2050m1455J5891N402M436P619q374K6674K4600j970
9438b4456J3862k4937j192k8960L0355J9583M4110m185j1466l0958n1545K040
9426f7749K0228l371J8091J2839P6136P49m7114P842n2880p427N990j0190j1222
9413e8078m1372O578l3037M2657P662k5614j6099K5557k2188J6911O8345P1147
9401D2469J0372j5847K4817r795K056J227m214Q874L2620n6141l8433j3752k1903
9388c7650P3103p1299q4472R35L7784K8566L0627p773k5892K0140J4836K2946
$$ plain form
9476 -118394 -64863 -42254 -63292 -91870 -70976 -54309 -55702 -77493 1576 2122 36842 72806
9464 72806 48751 41557 -4648 32657 8530 2234 -212 -62429 -107067 -86836 -70169 -61231 -65913
9451 -65913 -59930 -34946 -25229 -57279 -98734 -82843 -77441 -73005 -65386 -73760 -47086 -22486 -24456
9438 -24456 -10594 -35531 -36723 -65683 -35328 -15745 28365 24180 12714 -18244 -69789 -67749
9426 -67749 -47521 -50892 -32801 -19962 56174 56923 9809 17651 -35229 -42656 -36666 -46856 -58078
9413 -58078 -99450 -92872 -125909 -83252 -75590 -101204 -117303 -91746 -113934 -97023 -28678 42469
9401 42469 52841 36994 61811 52016 54072 55299 51085 59959 92579 36438 -1995 -15747 -37650
9388 -37650 35453 -35846 -120318 -119383 -81599 -53033 -22406 -30179 -56071 -35931 -21095 1851
9376A851K178j6003m5625j1195M1452K6162R486j9493Q347L653m5648n2131j6191
9363a13157M9885L9702J4635K4336r935J4687N3612M0035l1629l6308l4852o923
9351D088L9830K800j1617r5340o5720n4196Q5999N2353L1397L2922j265L878J3622
9338C8751L092l7626l4324K9075R0285K8694m8970m2460k5416n6299k5211j4149
9326i4558N293K5805J18041P7581N667J6537n6833j7845N0403M0328k3870l6761
9314A09788J6109l4327m5565M346J9977m1375n3725L6053k6531L6876o794k3776
9302h944j61L7263l3904K0199P8413j4723l4645j8291k9007l154L3595p666L7506
9289E6481Q970k0850K3688M3986o7151l7623P518M4226l9574j175O5732l3694
$$ plain form
9376 1851 4029 -11974 -57599 -68794 -27342 -1180 8306 -11187 -2840 813 -44835 -96966 -113157
9363 -113157 -63272 -23570 -8935 15401 5466 20153 73765 113800 82171 45863 11011 4088
9351 4088 43918 46718 35101 -60239 -125959 -180155 -94156 -41803 -10406 22516 21251 25129 38751
9338 38751 41843 4217 -30107 -1032 89253 117947 68977 26517 1101 -55198 -80409 -94558
9326 -94558 -89265 -63460 54581 132162 137829 154366 97533 79688 130091 170419 146549 109788
9314 109788 125897 91570 46005 50351 70328 28953 -24772 11281 -15250 21626 14832 -8944
9302 -8944 -9105 28158 -5746 14453 92866 78143 43498 25207 -3800 -6954 26641 18975 56481
9289 56481 65451 44601 68289 112275 45124 7501 15019 59245 19671 18496 84228 50534
9277E0534m2627l4445J7292J2318K8122k3675J1591L288L5658N1087j1348o6376
9265C1419m2428j8779J3438K9350O4082K900L4681K8839q1579n0098m5254n858
9253c9287J9690M6257K6046r548L014J8397p315m9623k5606K456Q27r817L6689
9240A2180N8541r089q163L9656M1159M6652q8962r3124K2376J4589j4476Q613
9228B9952k1238M3186N2148j9816O746n3270k3265O3472K7585M7107l8276k0066
9216I4265L0713m5194n3052k6894J4823N8926K9259j9707n2949j2760M1316N9341
9204A18087L7165L5346m5287k5504J5625J6504j09141q661O3907M0740j068J3586
9192A51299j761k283l8916m959K3279m2866m1447O2419P8479q358k476m5380l9774
$$ plain form
9277 50534 7907 -26538 -9246 3072 31194 7519 19110 22398 58056 109143 97795 31419
9265 31419 -11009 -29788 -16350 13000 77082 79982 114663 143502 61923 11825 -33429 -39287
9253 -39287 -19597 26660 52706 43158 46172 64569 57254 7631 -17975 -15519 -14692 -24509 12180
9240 12180 70721 61632 53469 93125 134284 180936 91974 -1150 21226 35815 21339 29952
9228 29952 8714 51900 104048 84232 90978 37708 14443 77915 105500 152607 114331 94265
9216 94265 124978 79784 26732 -162 14661 73587 102846 83139 30190 17430 58746 118087
9204 118087 155252 190598 145311 119807 135432 151936 42795 34134 98041 138781 137713 151299
9192 151299 149538 147255 108339 103380 126659 83793 42346 104765 183244 174886 172410 127030 87256
9179H7256l0310J142L9620L932j5081l5851J1203J4889L754J1455L0997K9652
9167A52658k3281R278J863J5026K8747N0395k385n9985k1554J0365K3080m9217
9155A34990k1876R12M4958O7793K2244k0101k8256p141O5174Q3770O09l0884l945
9142C08247k35j2949O2494J0945L9955K3017J7451M3387J21971j618J2956n5120
9130E70501L915N5178q340O6762M2479M2626N9343J1005N7953N2958N3690R2495
9118A100565J52334J05864Q6023N9062J02993J41980J79966K22548K22709K14567
9108B588611K90501L52672L56094L90779N14207N83792O23019O88477P77059R73821
9098H139032J080549J091529J116307J033802J019943Q52788O22758K19383j48271
$$ plain form
9179 87256 56946 58088 97708 101640 86559 50708 61911 76800 80554 92009 123006 152658
9167 152658 129377 138655 140518 155544 184291 234686 232301 172316 150762 161127 184207 134990
9155 134990 113114 114026 158984 226777 249021 228920 200664 193523 258697 342467 343076 312192 308247
9142 308247 308012 295063 357557 368502 408457 431474 448925 492312 614283 612665 625621 570501
9130 570501 574416 629594 621254 688016 730495 773121 832464 843469 901422 954380 1008070 1100565
9118 1100565 1252899 1358763 1444786 1503848 1606841 1748821 1928787 2151335 2374044 2588611
9108 2588611 2879112 3231784 3587878 3978657 4492864 5076656 5699675 6388152 7165211 8139032
9098 8139032 9219581 10311110 11427417 12461219 13481162 14333950 14956708 15176091 15027820
9089A5027820n41102q06144r49573j100487j092537j062500r20023q00461p51527
9080G003466o73998n69680n59014n14344l71511l04694k75514k13962j62267k40600
9070C117882k31206j85044j05175r1722j63259n3497l4624n7630j06335q8951
9060B000439j33028j03580m1681N8613m7158r4213J5307k1063r6907n4781j05392
9049A376556q4282M3078r5595r0249n4507K7757l2454m0138n2686q1711q2043
9038H33726l5322L6084M018n8493p789l5388o3472o0495j7986J3441n5172J595
9026E54747O101K276j7018o773k998n6297m3493L1740N0529m5490o2903K1524
9014D31945k2648r2939o8200K8756N8669M6469j7924J2185J2629o9813l7699m8913
$$ plain form
9089 15027820 14486718 13680574 12731001 11630514 10537977 9475477 8555454 7754993 7003466
9080 7003466 6329468 5759788 5200774 4686430 4314919 4010225 3734711 3520749 3358482 3117882
9070 3117882 2886676 2701632 2596457 2504735 2341476 2287979 2253355 2195725 2089390 2000439
9060 2000439 1867411 1763831 1722150 1780763 1733605 1639392 1654699 1633636 1536729 1481948 1376556
9049 1376556 1292274 1335352 1239757 1149508 1095001 1122758 1090304 1050166 997480 915769 833726
9038 833726 798404 834488 838506 780013 772224 736836 673364 612869 594883 608324 553152 554747
9026 554747 560848 563124 546106 539333 536335 480038 436545 468285 518814 473324 410421 431945
9014 431945 409297 316358 248158 276914 335583 382052 364128 376313 388942 319129 281430 232517
9002B32517n8498M8766K3713j5961M7146j8128j21398M84L6401K975l9829j1489
8990A26699k734l7388L2253O5740L3457O52k2816L0809o0705l8043n210L6071
8978A58785O1836L9738m3106j08913l3127P7177L4474n3398l9152R460M4473l3676
8966A14571o2542j3575M5519K6737p1080Q75L7333L411l0304p5270P867J00800
8954H4342J5382j3170j1338m751K1321p190k3905M085J7466l645Q774l2590m4570
8941A0211k0323K2895J0371j3493M8496p822l8661P3l1741j3240M0628j4815j3873
8928b1294j7848O0825N4637l560k7402K453j5573p9826l7371J0659J2654l661
8916f5307J3784J1397L1761L337p735M9281K582l309k6752m4798n418L5502M0824
$$ plain form
9002 232517 174019 222785 246498 230537 277683 259555 138157 138641 175042 178017 138188 126699
8990 126699 123965 86577 118830 184570 218027 218679 195863 226672 165967 127924 122714 158785
8978 158785 220621 260359 217253 108340 75213 152390 186864 133466 94314 103774 148247 114571
8966 114571 52029 38454 83973 110710 39630 40505 77838 81249 50945 -24325 -16458 84342
8954 84342 99724 86554 75216 70465 91786 84596 60691 64776 82242 78597 87371 54781 10211
8941 10211 -10112 12783 23154 9661 58157 50335 11674 11747 -19994 -33234 7394 -7421 -21294
8928 -21294 -39142 21683 76320 72760 45358 47811 32238 -47588 -84959 -74300 -61646 -65307
8916 -65307 -51523 -40126 -8365 -5028 -12763 36518 39100 35791 9039 -35759 -41177 -5675 35149
8903C5149O186l142K2946L4477M2161M777n6272l2389M6696N488K665m211p5387
8890B9144j257k7068L0795N7981M0280N230k6680j1697J6077p4928l3231R706
8878A4352J2560m112p853K5211N3873l1059L5876J901m6072q079j0401k0384j3677
8865B136P707l4266K7128M7205L8921J5701m8244m2192J8649N2432L6486K0516
8853A42179k2329l8703O086k5260k1001R438J1081l38l4838j8150O5192L0124
8841A03481n2630j8884K7686R473J323k0939O708P9746L6547j1165j6734m7050
8829I7562j2670K5086q0048j0379l8004j2065L0940m0604k0266L7026m519k5168
8817e3109P4145Q7394L4839k3138j9659n6509L9601L2817k7040K1010k3769j4286
$$ plain form
8903 35149 41335 38193 61139 95616 137777 142554 86282 53893 100589 106077 108742 104531 29144
8890 29144 27887 819 31614 89595 129875 135105 108425 96728 112805 37877 4646 14352
8878 14352 26912 22800 14947 40158 94031 62972 98848 100749 54677 46598 36197 15813 2136
8865 2136 9843 -24423 2705 49910 88831 104532 56288 14096 32745 85177 121663 142179
8853 142179 119850 81147 87233 61973 40972 50410 61491 61153 26315 8165 73357 103481
8841 103481 50851 31967 59653 69126 70449 49510 56218 135964 172511 161346 144612 97562
8829 97562 84892 109978 29930 19551 -18453 -30518 422 -40182 -60448 -23422 -27941 -53109
8817 -53109 21036 108430 143269 120131 100472 43963 83564 116381 89341 110351 86582 72296
8805G2296J4389j7191o5130l6680n786k407K4264M633k3623o1606k047O2648M0986
8792D746R696o0720j3837P7337m1370l2571k0072J5446N416k7973J0611N1077
8780b2214J9701l683N827M0546P943J0708J5249k9306n5017l0345O094L8357N8590
8767F2450J2332k9719J758M2473j9065K2619j7445q3945j2481O3514J7949j9802
8755D0638m9039L9215L2691n0496j5102j820M4142O5104l7041k6992L4063P150
8743H2513k2781M052q622m2937K7335O3593j6566m4651j3451l5948j1684l7701
8731e6848N215P2490Q0410l5581r655n0158k5146O4134k4486l8266O8669q373
8719D2405k643j0489m3584n2419k8328k0116j0354P964J04306L4386k1245k2641
$$ plain form
8805 72296 86685 69494 4364 -32316 -38102 -40509 -16245 -11612 -35235 -96841 -98888 -36240 4746
8792 4746 14442 -46278 -60115 17222 -24148 -56719 -76791 -61345 -55929 -83902 -73291 -22214
8780 -22214 -2513 -6196 -369 40177 48120 58828 74077 44771 -10246 -40591 -34497 3860 62450
8767 62450 74782 45063 46821 89294 70229 92848 75403 -8542 -21023 42491 60440 40638
8755 40638 -8401 30814 63505 13009 -2093 -3913 40229 105333 68292 41300 75363 82513
8743 82513 59732 63784 55162 12225 39560 103153 86587 41936 28485 -7463 -19147 -56848
8731 -56848 -51633 20857 101267 65686 56031 5873 -19273 44861 20375 -17891 50778 42405
8719 42405 39762 29273 -14311 -66730 -95058 -115174 -125528 -117564 -13258 21128 -117 -22758
8707b2758k281K348O323k3736j6205k8783j8407P0222J1653K2649l5771K929j1533
8694d3350J23k4045l5522j4773k2302K0588P2627Q2420j4326q353L750j7034J7860
8681A7663K7539J6317P2687O018n4434k7863K888J9061o759Q266j1880k7201m9872
8668g570P816m9628m8107O972N3341J1499k262L7483l9264k4372k7497p01L6837
8655d5453N3265n362k1131P36r620P647j884L1974m2100k6677M7953J7484j6334
8642i502J1432J9909L3121L1166J4296j8885N1088p5079n1870k2228j7018K5486
8630h084j7764J4692L0073O5789J8286m0089m1115N463L2359K8565k520K6169
8618A11824n555r849l1896j484o4631j918J2290M887M96j21J284K95k6052l6672
$$ plain form
8707 -22758 -25039 -22691 -16368 -40104 -56309 -85092 -103499 -33277 -21624 1025 -34746 -31817 -43350
8694 -43350 -43227 -67272 -102794 -117567 -139869 -119281 -46654 35766 21440 13087 16837 -197 17663
8681 17663 45202 61519 134206 140224 85790 57927 60815 79876 73117 81383 69503 42302 -7570
8668 -7570 246 -49382 -97489 -90517 -37176 -25677 -27939 9544 -29720 -54092 -81589 -82290 -45453
8655 -45453 7812 2450 -18681 -17945 -27565 -19918 -21802 10172 -31928 -58605 -10652 6832 -9502
8642 -9502 1930 21839 54960 86126 100422 81537 132625 57546 5676 -16552 -33570 -8084
8630 -8084 -25848 -11156 18917 84706 102992 62903 21788 27251 59610 88175 85655 111824
8618 111824 106269 96420 64524 63040 -1591 -3509 8781 13668 14164 14043 15327 15622 -10430 -47102
8604d7102P2060O3266j4630p1871n1553k2122J5573M2197k4385j6205Q066N1394
8592D688M2311K5010J0167L4191n4386j4555N36k2631l5322J5126K1148J2046
8580C8329J4124J0125J8011j7597L5242L3271N997o3846r1001M6902J4244n6810
8568a3009L612k1153L5145R094J6441j4313l2737O8314K9367n3281K5454j1608
8556D1326L9453Q286o8253l6193J7451M1945k5772k1495j5328M082j6368J6919
8544a3947L2308M4684n1599J6156M7837N072l9217M760o987K9482K5673k2373
8532G1849o8726n3897q0482J1436P5112M8342M893j5350K9005O8041l2956k5331
8520C1936j7955q1469J6085j9991n256J9500N336K3557M2148j7583O13K27K2874
$$ plain form
8604 -47102 24958 88224 73594 1723 -49830 -71952 -56379 -14182 -38567 -54772 -46706 4688
8592 4688 46999 72009 82176 116367 61981 47426 47962 25331 -9991 5135 26283 38329
8580 38329 52453 62578 80589 62992 98234 131505 137502 73656 -17345 29557 43801 -13009
8568 -13009 -9397 -30550 4595 13689 30130 15817 -16920 51394 80761 27480 52934 41326
8556 41326 80779 89065 20812 -15381 2070 44015 18243 -3252 -18580 -14498 -30866 -13947
8544 -13947 18361 63045 11446 27602 75439 80511 41294 46054 39067 68549 94222 71849
8532 71849 3123 -50774 -131256 -119820 -44708 3634 8527 -6823 22182 90223 57267 31936
8520 31936 13981 -67488 -51403 -71394 -76650 -57150 -51814 -28257 13891 -3692 -3079 -2852 20022
8507B0022M9573M1672j5794k0655m6016K1991m1909j04684k1106M1426L8020Q790
8495b8670k8918l1034K4232M7093O2653O110N800K59K0093O7221k3914q3327m0380
8482b782n1044M1483L294n652j3695n1084J8840O4724N1505m660Q50q081l6957
8469F741M66l1050m4862J7696M2175L0593l3372j8190M562L867l4899L5O1586
8456E348P615j8707Q180K5251J6948R9J9999j2307k3217p2325j4971K2739N212
8443c0136m0148M3140Q2219O6208j0158j8581K8138j8651j7047O795J1543m9157
8431E4165o7817L0162m0832j2018j2244l7307Q5946N4146l0271J3106o400o5535
8419c4899n5931j3999J4213J3424O0186L1114p5691N9O8697k8655j7635J6071
$$ plain form
8507 20022 69595 111267 95473 74818 28802 50793 8884 -95800 -116906 -75480 -37460 -28670
8495 -28670 -57588 -88622 -64390 -17297 45356 51466 57266 57525 77618 144839 120925 37598 -2782
8482 -2782 -53826 -12343 -9049 -14701 -28396 -79480 -60640 4084 55589 50929 51779 43698 6741
8469 6741 7207 -23843 -68705 -51009 -8834 21759 -11613 -29803 -25241 -21374 -56273 -56238 5348
8456 5348 12963 -5744 2436 27687 44635 44734 64733 52426 29209 -43116 -58087 -35348 -30136
8443 -30136 -70284 -27144 55075 121283 111125 92544 120682 102031 84984 91779 103322 54165
8431 54165 -13652 16510 -24322 -36340 -48584 -85891 55 54201 23930 37036 30636 -34899
8419 -34899 -90830 -104829 -90616 -77192 -17006 14108 -61583 -61524 7173 -21482 -39117 -23046
8407b3046M3540L6574M1291m4384o8899k3316j4690J7358K5201J140L157J4626
8395H552M8817l6178k6013l683n2077M084K8856k33M4690J1259N950N070M6487
8382H5581N8443P394l7444j3066l702l3P444J6056n4730p6026m45k1391M059K8879
8368A019J794o176M1180M9442J9781j6687n1372l2695J4037N5414O030p9765j2406
8355a0404M8005M2836L7119l9947j6010j503n6935P133K564j2345K946R721l849
8342I331l769o519j9236J706K2786O753l8631J9144N0650l9374n0867L728O8020
8329B3722J2507J4735M5167o2214l5565k7367R380k6474j8168j0791K5977K6064
8317b3027k4037m1528j2359M84K31m2518l7337M1185P8739K9100l1612M8930O1308
$$ plain form
8407 -23046 20494 57068 98359 53975 -14924 -38240 -52930 -35572 -10371 -9231 -6074 8552
8395 8552 57369 21191 -4822 -8505 -60582 -56498 -27642 -27875 16815 28074 34024 39094 85581
8382 85581 144024 151418 113974 100908 97206 97173 104617 120673 65943 -10083 -10528 -31919 -27860 1019
8368 1019 2813 -3363 37817 87259 107040 90353 38981 6286 20323 75737 81767 2002 -10404
8355 -10404 37601 80437 117556 77609 61599 60096 3161 10294 12858 513 3459 13180 9331
8342 9331 5562 -957 -20193 -18487 4299 11052 -27579 -8435 42215 2841 -48026 -44298 23722
8329 23722 36229 50964 96131 33917 -1648 -29015 -19635 -46109 -64277 -75068 -49091 -23027
8317 -23027 -47064 -88592 -100951 -100467 -100236 -142754 -180091 -138906 -60167 -31067 -62679 -13749 47559
8304D7559l807p272j4626M278l539n4995l7461L821n050J6536O7713R492k3721
8291a072j6825p189J4073J2077o1889p617O6198K0878p8494J009m1793K3736J398
8278g5510j7170N1503N2025N4620N9755K1693m4091j8469L2182j3041o6886N233
8266D1844J3714n250m5416j8739j0512K4920j9633n0431j4643M4617L7171K0668
8254A8310l2391P771R1948L4777k1872o4329l7378J4763j0598l6816n1453l8012
8242a25280K9896N035J9551K3832J0426o514k8562j1541J6947j1326k301k412
8230h2249l421L9881M8983n558j1500o2336K680Q4745l454l1425r6589J3842M5363
8217f1038J1976P968k5296L1401P7299p7725Q741K4537j7529J9197P0440k5483
$$ plain form
8304 47559 43752 36480 21854 26132 22593 -32402 -69863 -66042 -71092 -54556 13157 22649 -1072
8291 -1072 -17897 -25086 -11013 1064 -60825 -68442 -2244 18634 -59860 -58851 -100644 -76908 -75510
8278 -75510 -92680 -41177 10848 65468 125223 146916 102825 84356 116538 103497 36611 41844
8266 41844 55558 50308 4892 -13847 -24359 561 -19072 -69503 -84146 -39529 -2358 18310
8254 18310 -14081 -6310 85638 120415 98543 34214 -3164 11599 1001 -35815 -87268 -125280
8242 -125280 -95384 -90349 -70798 -46966 -36540 -43054 -71616 -83157 -66210 -77536 -79837 -82249
8230 -82249 -85670 -45789 3194 -2364 -13864 -76200 -73520 11225 7771 -23654 -120243 -106401 -61038
8217 -61038 -49062 -41094 -66390 -34989 42310 -35415 -26674 -2137 -19666 -469 69971 44488
8205D4488o3600j0381O445J480n4953j5217J8614K6733p158J8738K1244N077n645
8192a4135j2832M6323q431l1697j4198J6091O095q336m4150R032R262k3108O5492
8179d592N7470o483o6893j6521K3723J1586k446M2744k7015p2419r507O863j5273
8166g8763j5118J4277J8091N4216Q348o089M3795J11168k3395l3363k5897n204
8154F2066l5190J228L210o1560j1978K570K0361j3882o3850J6657R1209P5730
8142H6571j9560k5818k4795J0532J7941L4843L8061o057m5589l7835j8425P936
8130A7805K6981M3621j1718N641k0844k1838L0987m8918j254M0683j210k7741
8118C2195j4994J429J4625M9591Q675p5840m2312O275L989K6612K6285p811p6052
$$ plain form
8205 44488 -19112 -29493 -23048 -21568 -76521 -91738 -73124 -46391 -53549 -34811 -13567 -8490 -14135
8192 -14135 -26967 19356 10925 -20772 -34970 -18879 -12784 -21120 -65270 -56238 -46976 -70084 -4592
8179 -4592 52878 46395 -20498 -37019 -13296 -1710 -4156 38588 11573 -60846 -70353 -63490 -78763
8166 -78763 -93881 -79604 -61513 -7297 1051 -5038 38757 149925 126530 93167 67270 62066
8154 62066 26876 28104 31314 -30246 -42224 -39654 -19293 -33175 -97025 -80368 10841 86571
8142 86571 67011 41193 16398 26930 44871 79714 117775 111718 66129 28294 9869 17805
8130 17805 44786 88407 76689 82330 61486 39648 70635 21717 20463 61146 59936 32195
8118 32195 17201 18630 33255 82846 91521 15681 -26631 -20356 -16367 10245 36530 28719 -47333
8105d7333n7660j146O6145J0228j4410L7130j9754n0574k1449k7263L6400J8721
8093g0965P833p76P616R0853J227m2092J4197j9890o5174k332R734K8360n3308
8080i4717K7417P3103N8471j06218m8698p016L6457N6926K1487J7145K3280o922
8068E0715N3082L692k1899j0661m095k468m5256j9381K4928l2432j5811P5350
8056E5764J02227P1719k4365o2154p6813K8959P556p8243k4768M9363O5808j1305
8044A03748j9657l2473l0512L3198L3558M118n799o9147k148O0749L8147n0913
8032F2869o761M3111m1646l8611k2733M2634N6827k2093R727m1894o9117k9368
8020e7055k2450J1542L5666J7509L0572M1252l8142j5789L3190M5468K3113j6323
$$ plain form
8105 -47333 -104993 -106139 -39994 -29766 -44176 -7046 -26800 -77374 -98823 -126086 -89686 -70965
8093 -70965 -63132 -63908 -56292 34561 35788 -6304 7893 -11997 -77171 -79503 -69769 -41409 -94717
8080 -94717 -67300 5803 64274 -41944 -90642 -97658 -61201 -4275 17212 34357 57637 50715
8068 50715 103797 107489 85590 74929 70834 68366 23110 3729 28657 -3775 -19586 55764
8056 55764 157991 229710 205345 143191 66378 95337 102893 24650 -118 49245 115053 103748
8044 103748 84091 51618 21106 54304 87862 91980 86181 17034 14886 75635 113782 62869
8032 62869 56108 99219 57573 18962 -3771 38863 95690 73597 83324 41430 -27687 -57055
8020 -57055 -79505 -67963 -32297 -14788 15784 57036 18894 3105 36295 81763 104876 88553
8008H8553j9181J0674M8754N6775k5459m620k322n347M0922j8924k4473n0114
7996I5238l4083J7987J8013m0080k5009l4036k0820j7828J8747J8469O663M4397
7984D7658L62J9539O8518l358k5607L9786l6501j05777o7177O3853N8518k3432
7972C6382K8863L7859k9215o0084K2486k310k0551J685L895N528j0470Q830K9217
7959E2115M2409K6273K468m8338m0626M837L5386K7927n7421j6349J4198L2055
7947G4934L9105J8791j5367K1311k8769p1815j0820k5966k0431J3193J736J6892
7935A2794J4303p6883o0564N1681N2753O3967L5937J1585r638r9757n2775l0348
7923h6945j8833L5255O3970j629J4991N6252j9199n503o690J9136L0912O2851
$$ plain form
8008 88553 69372 80046 128800 185575 160116 155496 153174 147827 188749 169825 145352 95238
7996 95238 61155 79142 97155 57075 32066 -1970 -22790 -40618 -21871 -3402 3261 47658
7984 47658 48020 67559 136077 132719 107112 146898 110397 4620 -62557 1296 59814 36382
7972 36382 65245 103104 73889 13805 36291 33981 13430 15115 19010 24538 14068 22898 52115
7959 52115 94524 120797 123265 74927 34301 39138 74524 102451 45030 28681 42879 74934
7947 74934 114039 132830 117463 138774 110005 38190 27370 1404 -19027 -5834 -4098 12794
7935 12794 27097 -49786 -110350 -58669 -5916 58051 93988 105573 95935 -3822 -56597 -86945
7923 -86945 -105778 -70523 -6553 -8182 6809 63061 43862 38359 31669 50805 81717 144568
7911A44568K2793j2470j3775M6423l7216o290M946l5208l7774o1377m7378J7565
7899a5193O5408j2357K6759M6423n0174R520j46l7596q091l5867j0920r393k2309
7886e3936M2266P8557n3323m5264M0035j4312N5734j4586o0155p2133M1759M9846
7874e512M710l8603L2436K4388K5368K4361k4828l3815p0129k4943j864N6129
7862c2302N339j7867o746L7338J359j36K2634J6129J9542p2j4471p142j2570k362
7848H673j3997k4450K9866J8435N543M861K3419N6046o758o1303J7018L8390j8617
7835G7126k2997J0287o706r5084j6702k7887j3136L8885N4029K9628M7745L9070
7823A14258p0259n8582J2032K0890L4238J1821N819k5747l657k5247K3928p764
$$ plain form
7911 144568 167361 154891 141116 187539 150323 144033 148979 113771 75997 14620 -32758 -15193
7899 -15193 50215 37858 64617 111040 60866 70386 70240 32644 24553 -11314 -22234 -31627 -53936
7886 -53936 -11670 66887 13564 -31700 8335 -5977 49757 35171 -24984 -97117 -55358 -5512
7874 -5512 -802 -39405 -6969 17419 42787 67148 42320 8505 -61624 -86567 -88431 -32302
7862 -32302 -26963 -44830 -51576 -14238 -12879 -13015 9619 25748 45290 45218 30747 23605 11035 8673
7848 8673 -5324 -29774 92 18527 24070 28931 52350 108396 101638 40335 57353 95743 77126
7835 77126 54129 64416 57710 -37374 -54076 -81963 -95099 -56214 -2185 27443 75188 114258
7823 114258 43999 -14583 -2551 18339 52577 64398 70217 44470 40813 15566 39494 31730
7811C1730K365j5999k9055M0217O6145m5061r9246k4209L8189L1952N992n485
7799b465K274j1736M561k761J7756n255K7240k003k1815M4560M7175j4873j3703
7786F8955K5097l2983o7231j3667j8900K2652K5653N8900n077m4250J0493L3969
7774F3611n167k0941j2630l3550l971J6898r3130k9634O5966M7864N1726N983
7762E3025n3788k5430K755k1800l7775k7262M0774L3024J0438M4797N119M6807
7750G0684O182p791K3810m2460m4366k5041j8140J3133M7688K2083K0982n8758
7738H006o8263J2250J7532N844L084J6726j8405l3571M2051J7850n060L040J6809
7725A7893k873K1728J1145k0276p3835L8391N221L952L7276M0219L041n7146l2266
$$ plain form
7811 31730 34095 18096 -10959 29258 95403 50342 -48904 -73113 -34924 -2972 3020 -2465
7799 -2465 -191 -11927 -7366 -10127 7629 2374 29614 27611 5796 50356 97531 82658 68955
7786 68955 94052 61069 -6162 -19829 -38729 -16077 9576 68476 63399 19149 29642 63611
7774 63611 58444 37503 24873 -8677 -12648 4250 -88880 -118514 -52548 -4684 47042 53025
7762 53025 -763 -26193 -23438 -45238 -83013 -110275 -69501 -36477 -26039 18758 23877 70684
7750 70684 76866 69075 92885 50425 6059 -18982 -37122 -23989 23699 45782 66764 8006
7738 8006 -60257 -48007 -30475 -24631 -21547 -4821 -23226 -56797 -14746 3104 -1956 1084 17893
7725 17893 15020 36748 47893 27617 -46218 -7827 -2606 1346 38622 78841 81882 24736 -7530
7712g530J2017P052M1265J9381O03j7684m5098M9726j2983k0733j449k1129k7114
7699b3676L6217M3748j9338k189J1156N1651j0727o7577r4078L4253M4080J6041
7687A9561k1362l1504k2688L7357M4873j22457m0557M6352N2548j007m6299k1942
7675a07125J2129J3986P1444l4124l3646N2182o935j7968L5347J0213K9883l5102
7663i716k2748K3553M1271J3250j4724k5821p624k7688m2816l907L3251N691J4252
7650b3776J9217M346J5009J051J2913l5499j6600J1244P4442p515n3206j5439
7638a3813o6512m9764j0273M8790M2622L8552q971j6819M027N250p0578n5365
7626a52854O8857P0927J6264j3169K8318j5625n3652l9445l5489N3778N4538k0231
$$ plain form
7712 -7530 4487 11539 52804 72185 72788 55104 10006 59732 46749 26016 24567 3438 -23676
7699 -23676 12541 56289 36951 34762 45918 97569 86842 19265 -74813 -40560 3520 19561
7687 19561 -1801 -33305 -55993 -18636 26237 -96220 -136777 -90425 -37877 -38884 -85183 -107125
7675 -107125 -94996 -81010 -9566 -43690 -77336 -25154 -32089 -50057 -14710 -4497 25386 -9716
7663 -9716 -32464 -8911 32360 45610 30886 5065 -2559 -30247 -73063 -76970 -43719 -38028 -23776
7650 -23776 -4559 -213 14796 15847 28760 -6739 -23339 -12095 62347 54832 1626 -13813
7638 -13813 -80325 -130089 -140362 -91572 -48950 -10398 -19369 -36188 -32161 -26911 -97489 -152854
7626 -152854 -83997 -13070 3194 -9975 18343 2718 -50934 -90379 -125868 -72090 -17552 -37783
7614c7783j5174j2832K9034P193q701M775l6029k4769j2961J2018K1054J7562
7602e6613M0502j5965M320m039p67k8529K7962K0908n926K9612q31N0088l2988
7589B7734k9037l1744L9923K7831o5212o7733O16J46324P6147n1482J186m636
7577F9917J0846j4519k3141p313k4678Q866N3584N083k2685m0037L894K9117N545
7564E4479K4727r061L2127q566r70k5669Q073m3373r5595M9889M1312l313l6055
7551a1995k6712O2467O4930L2750m7907m3374N6304m8020p2737o540K3419J9411
7539A996N0959O202q5451k1566K3868J5750k2593K5129j5019l6991J1149L2748
7527a3819K0011m3743o2051K8854J6684n4424m1220k4602K4533K7755J8646M3530
$$ plain form
7614 -37783 -52957 -65789 -36755 -29562 -38263 -33488 -69517 -94286 -107247 -95229 -74175 -56613
7602 -56613 -16111 -32076 -27756 -31795 -32562 -61091 -33129 -12221 -18147 11465 10634 60722 27734
7589 27734 -1303 -33047 6876 34707 -30505 -98238 -97622 48702 124849 73367 74553 69917
7577 69917 80763 66244 43103 35790 11112 19978 73562 78645 55960 15923 19817 48934 54479
7564 54479 79206 70145 102272 93706 92736 67067 75140 31767 -63828 -13939 27373 24060 -11995
7551 -11995 -38707 23760 88690 121440 73533 30159 86463 38443 -34294 -40834 -17415 1996
7539 1996 52955 59157 -26294 -47860 -23992 -8242 -30835 -5706 -20725 -57716 -46567 -13819
7527 -13819 6192 -37551 -99602 -70748 -54064 -108488 -149708 -174310 -149777 -122022 -103376 -59846
7515e9846N4431K3314L0457k6852J0703j2330R998r814j6260l8627j4263j5690
$$ plain form
7515 -59846 -5415 17899 48356 21504 32207 19877 29875 20061 3801 -34826 -49089 -64779
$$ [...]
##END NTUPLES=NMR SPECTRUM
##END=
