##TITLE=Analysis number 307859
Compound Code cc 06323
Book Reference 440/8
Project Code adrs
Chemist Name craigr
##JCAMPDX= 6.0         $$ Bruker NMR JCAMP-DX V2.0
##DATA TYPE= NMR SPECTRUM
##DATA CLASS= NTUPLES
##ORIGIN= Bruker BioSpin GmbH
##OWNER= NMR
$$ XWIN-NMR		Version 3.5
$$ Mon May 16 13:29:45 2005 GMT Daylight Time (UT+1h)  MAYBRIDGE\NMR@NMR_250MHZ
##.OBSERVE FREQUENCY= 250.131544655141
##.OBSERVE NUCLEUS= ^1H
##.ACQUISITION MODE= SIMULTANEOUS (DQD)
##.ACQUISITION SCHEME= undefined
##.AVERAGES= 16
##.DIGITISER RES= 18
##SPECTROMETER/DATA SYSTEM= dpx250
##.PULSE SEQUENCE= zg30
##.SOLVENT NAME= CDCl3
##.SHIFT REFERENCE= (INTERNAL, CDCl3, 0, 16.522)
##AUDIT TRAIL= $$ (NUMBER, WHEN, WHO, WHERE, WHAT)
$$ ##TITLE= Audit trail, XWIN-NMR		Version 3.5
$$ ##JCAMPDX= 5.01
$$ ##ORIGIN= Bruker BioSpin GmbH
$$ ##OWNER= NMR
$$ C:\u/data/dgb/nmr/ADRS/3010/pdata/1/auditp.txt
$$ ##AUDIT TRAIL=  $$ (NUMBER, WHEN, WHO, WHERE, WHAT)
(   1,<2005-05-16 13:29:27.13 +100>,<MAYBRIDGE\NMR>,<NMR_250MHZ>,
      <created by zg, POWCHK disabled, PULCHK disabled
       configuration hash MD5:
       62 19 C7 07 E1 42 D1 B7 37 6C 3D D0 77 39 F9 E6
       data hash MD5: 64K
       37 A5 97 29 AE 5B 03 58 74 E5 71 5C 90 C1 0D 0C>)
(   2,<2005-05-16 13:29:38.52 +100>,<MAYBRIDGE\NMR>,<NMR_250MHZ>,
      <Start of raw data processing
       ef LB = 0.3 FT_mod = 6 PKNL = 1 SI = 32K 
       data hash MD5: 32K
       30 77 0D 3D F6 90 04 9F 98 D6 3C 62 6C 57 D7 2E>)
(   3,<2005-05-16 13:29:40.20 +100>,<MAYBRIDGE\NMR>,<NMR_250MHZ>,
      <apk 
       data hash MD5: 32K
       F0 B2 94 40 ED 6F 08 4B 1A 73 40 48 4D 5A C8 74>)
(   4,<2005-05-16 13:29:40.93 +100>,<MAYBRIDGE\NMR>,<NMR_250MHZ>,
      <abs ABSG = 5 
       data hash MD5: 32K
       DD 3B 7C 0D 27 1D F3 43 2A 4D D7 35 07 70 04 C5>)
$$ ##END=
$$ 
$$ hash MD5
$$ C5 85 72 AD 82 EB 81 D6 FD 1C 7D BD A0 A0 30 94
##$RELAX= 
##$RELAX= 
##$RELAX= 
##$RELAX= 
##$RELAX= 
##$RELAX= 
##$RELAX= 
$$ Bruker specific parameters
$$ --------------------------
##$DU= <C:\u>
##$EXPNO= 3010
##$NAME= <ADRS>
##$PROCNO= 1
##$TYPE= <nmr>
##$USER= <dgb>
##$AMP= (0..31)
100 100 100 100 100 100 100 100 100 100 100 100 100 100 100 100 100 100 
100 100 100 100 100 100 100 100 100 100 100 100 100 100 
##$AQSEQ= 0
##$AQ_mod= 3
##$AUNM= <au_zg>
##$AUTOPOS= <46 >
##$BF1= 250.13
##$BF2= 250.13
##$BF3= 250.13
##$BF4= 250.13
##$BF5= 500.13
##$BF6= 500.13
##$BF7= 500.13
##$BF8= 500.13
##$BYTORDA= 1
##$CFDGTYP= 0
##$CFRGTYP= 5
##$CHEMSTR= <none>
##$CNST= (0..31)
1 1 145 1 1 1 1 1 1 1 1 1 1 1 1 1 1 1 1 1 1 1 1 1 1 1 1 1 1 1 1 1 
##$CPDPRG= <>
##$CPDPRG1= <>
##$CPDPRG2= <>
##$CPDPRG3= <>
##$CPDPRG4= <mlev>
##$CPDPRG5= <mlev>
##$CPDPRG6= <mlev>
##$CPDPRG7= <mlev>
##$CPDPRG8= <mlev>
##$CPDPRGB= <>
##$CPDPRGT= <>
##$D= (0..31)
0 1 0 0 0 0 0 0 0 0.06 0 0 0 0 0 0 0.0002 0 0 0 0 0 0 0 0 0 0 0 0 0 0 
0 
##$DATE= 1116246566
##$DBL= (0..7)
120 120 120 120 120 120 120 120 
##$DBP= (0..7)
150 150 150 150 150 150 150 150 
##$DBP07= 0
##$DBPNAM0= <>
##$DBPNAM1= <>
$$ [...]
##$SUBNAM7= <"">
##$SUBNAM8= <"">
##$SUBNAM9= <"">
##$SW= 20.6930455092707
##$SWIBOX= (0..15)
0 0 3 0 0 0 0 0 0 0 0 0 0 0 0 0 
##$SW_h= 5175.983436853
##$TD= 65536
##$TD0= 1
##$TE= 296.16
##$TE2= 300
##$TE3= 300
##$TEG= 300
##$TL= (0..7)
0 120 120 120 120 120 120 120 
##$TP= (0..7)
150 150 150 150 150 150 150 150 
##$TP07= 0
##$TPNAME0= <>
##$TPNAME1= <>
##$TPNAME2= <>
##$TPNAME3= <>
##$TPNAME4= <>
##$TPNAME5= <>
##$TPNAME6= <>
##$TPNAME7= <>
##$TPOAL= (0..7)
0.5 0.5 0.5 0.5 0.5 0.5 0.5 0.5 
##$TPOFFS= (0..7)
0 0 0 0 0 0 0 0 
##$TUNHIN= 0
##$TUNHOUT= 0
##$TUNXOUT= 0
##$USERA1= <user>
##$USERA2= <user>
##$USERA3= <user>
##$USERA4= <user>
##$USERA5= <user>
##$V9= 5
##$VALIST= <valist>
##$VCLIST= <CCCCCCCCCCCCCCC>
##$VD= 0
##$VDLIST= <DDDDDDDDDDDDDDD>
##$VPLIST= <PPPPPPPPPPPPPPP>
##$VTLIST= <TTTTTTTTTTTTTTT>
##$WBST= 1024
##$WBSW= 4
##$XGAIN= (0..3)
0 0 0 0 
##$XL= 0
##$YL= 0
##$YMAX_a= 513179
##$YMIN_a= -510394
##$ZGOPTNS= <>
##$ZL1= 120
##$ZL2= 120
##$ZL3= 120
##$ZL4= 120
##$ABSF1= 16.522
##$ABSF2= -4.171173
##$ABSG= 5
##$ABSL= 3
##$ALPHA= 0
##$AQORDER= 0
##$ASSFAC= 0
##$ASSFACI= 0
##$ASSFACX= 0
##$ASSWID= 0
##$AUNMP= <proc_1d>
##$AZFE= 0.1
##$AZFW= 0.1
##$BCFW= 0
##$BC_mod= 0
##$BYTORDP= 0
##$COROFFS= 0
##$CY= 12.5
##$DATMOD= 1
##$DC= 0
##$DFILT= <>
##$DTYPP= 0
##$F1P= 14.0000005364418
##$F2P= -0.99999901652339
##$FCOR= 0.5
##$FTSIZE= 32768
##$FT_mod= 6
##$GAMMA= 0
##$GB= 0
##$INTBC= 1
##$INTSCL= 1
##$ISEN= 128
##$LB= 0.3
##$LEV0= 0
##$LPBIN= 0
##$MAXI= 10000
##$MC2= 0
##$MEAN= 0
##$ME_mod= 0
##$MI= 0
##$NCOEF= 0
##$NC_proc= -3
##$NLEV= 6
##$NOISF1= 0
##$NOISF2= 0
##$NSP= 0
##$NTH_PI= 0
##$NZP= 0
##$OFFSET= 16.522
##$PC= 1
##$PHC0= -74.74551
##$PHC1= 6.765082
##$PH_mod= 1
##$PKNL= yes
##$PPARMOD= 0
##$PSCAL= 4
##$PSIGN= 0
##$REVERSE= no
##$SF= 250.13
##$SI= 32768
##$SIGF1= 0
##$SIGF2= 0
##$SINO= 400
##$SIOLD= 32768
##$SREGLST= <1H.CDCl3>
##$SSB= 0
##$STSI= 32768
##$STSR= 0
##$SW_p= 5175.98343685301
##$SYMM= 0
##$S_DEV= 0
##$TDeff= 65536
##$TDoff= 0
##$TI= <Analysis number 999999
Compound Code 99
Book Reference 9
Project Code 9>
##$TILT= no
##$TM1= 0
##$TM2= 0
##$TOPLEV= 0
##$USERP1= <user>
##$USERP2= <user>
##$USERP3= <user>
##$USERP4= <user>
##$USERP5= <user>
##$WDW= 1
##$XDIM= 32768
##$YMAX_p= 424656883
##$YMIN_p= -58093
$$ End of Bruker specific parameters
$$ ---------------------------------
##NTUPLES= NMR SPECTRUM
##VAR_NAME=  FREQUENCY,     SPECTRUM/REAL,   SPECTRUM/IMAG
##SYMBOL=    X,             R,               I
##VAR_TYPE=  INDEPENDENT,   DEPENDENT,       DEPENDENT
##VAR_FORM=  AFFN,          ASDF,            ASDF
##VAR_DIM=   32768,         32768,           32768
##UNITS=     HZ,            ARBITRARY UNITS, ARBITRARY UNITS
##FACTOR=    0.157963299565203, 1,           1
##FIRST=     4132.6476996994, 0,             0
##LAST=      -1043.33573715361, 0,           0
##MIN=       -1043.33573715361, -58093,      0
##MAX=       4132.6476996994, 424656883,     0
$$ Real data points
##PAGE= N=1
##DATA TABLE= (X++(R..R)), XYDATA
$$ [...]
19190C1391L401P709K4550O354j0543j3309j5122p053m609P135Q463R148M140
19177E1655j1568J071L580l446o816p671L064j851J1189Q426k3535M463K1432
19164D9993J988j7814q644O32N805j2355q548J392P453J1682P939J796N98O805
19150D8722P185j2472j4007o932J2311J8108J825j094m681P104k240k545K167
19137E3451j2358O67L498j241j1142r10m516j1234K23P939Q420J0384J2707N936
19123F1824n167J516Q473k74Q671n743J3086N731n97j5663j600J8209L6475J8240
19109A43181O424k254J615L185J4855K7137K2908J6600R879n821k0069l3441j4349
19096A69850J76p178p253O76p705k243p708j0519p425j1537r640m993p472L284
$$ plain form
19190 31391 34792 42501 67051 73405 62862 49553 34431 27378 22769 29904 38367 47515 51655
19177 51655 40087 41158 44738 41292 34476 26805 29869 28018 39207 47633 24098 28561 49993
19164 49993 51981 34167 25523 26155 31960 19605 11057 12449 19902 31584 39523 41319 41917 48722
19150 48722 55907 43435 29428 22496 34807 52915 54740 53646 48965 56069 53829 51284 53451
19137 53451 41093 41760 45258 44017 32875 31965 27449 16215 16438 24377 32797 43181 55888 61824
19123 61824 56657 58173 66646 66372 75043 69300 82386 88117 87520 71857 70257 88466 124941 143181
19109 143181 149605 147351 148966 152151 167006 194143 217051 233651 243530 237709 217640 184199 169850
19096 169850 170026 162848 155595 156271 148566 146323 138615 128096 120671 109134 99494 94501 87029 90313
19082I0313j6153k6268K942N280p179J1878K836J56o531P602J8145J960O796R299
19068A01076j03m099j1504J3093L033j915K870L699K2343J7029J6320J8955J4826
19055A95623L0426K278J316K0986J8287O770l342L419n155l9428j6584M975r736
19042B09835k1379k2178k7774k7126j2869j3781Q167N123J1969o470Q923j2134
19030A00306R794P122K196M723R712K1339L5300L1394K1474J9975p234j9487j432
19017B35182J2217r584l3508l3139k0952k2919j1669p708m004j996J839o786k0576
19004G6397j5085R082J56r681J713Q15P740R388o440P205R114M648k583j915r8
18989I0456Q321p487j2493j258l944N38J963J962o553j7087N954J6682J1898q009
$$ plain form
19082 90313 74160 47892 50834 56114 48935 60813 63649 63805 57274 64876 83021 84981 91777 101076
19068 101076 100973 96874 85370 98463 101496 99581 102451 106150 128493 145522 161842 180797 195623
19055 195623 226049 228327 229643 250629 268916 275686 272344 275763 270608 231180 214596 219571 209835
19042 209835 188456 166278 138504 111378 98509 84728 92895 98018 109987 103517 112440 100306
19030 100306 110100 117222 119418 124141 133853 155192 190492 221886 243360 263335 256101 236614 235182
19017 235182 247399 237815 204307 171168 150216 127297 115628 107920 103916 101920 103759 96973 76397
19004 76397 61312 70394 70550 60869 62582 63397 71137 80525 74085 81290 90404 95052 92469 90554 90456
18989 90456 98777 91290 78797 77539 73595 74133 76096 78058 71505 54418 60372 77054 88952 80943
18975H0943l916o135R682L369J4461J0668L875L084J2549O678J9346K9792L6829
18962B21225K2022L798j3254k4359l974R153j4245k4099k4007k7970j0663n133
18950A08494M153N142Q618o274r23J8883L1594R973P832l296J2653K8171J1307
18937B36327O816J7400J9948J7542K13j2987j0622n491J4576o58Q201p939j8489
18924B64837j2755j2735j8554j4009j2890r395j3083q402j3683k1579r448m991
18912A13313o28M026J0729J494p684p17nJ3827J5642O020N705q49O775J3341K1904
18897B02893J3674N761J847P096K5792R873J81Q755N181R783m664m306J281J0613
18883B93760J9143K9742J4299o525M490P380k4931j0451J7839q7j0834l4046k1327
$$ plain form
18975 80943 77027 70892 80574 83943 98404 109072 112947 116031 128580 135258 154604 184396 221225
18962 221225 243247 247045 233791 209432 205458 214611 200366 176267 152260 124290 113627 108494
18950 108494 112647 117789 126407 120133 119210 138093 169687 179660 187492 184196 196849 225020 236327
18937 236327 243143 260543 280491 298033 298246 285259 274637 269146 283722 283064 291265 283326 264837
18924 264837 252082 239347 220793 206784 193894 184499 171416 163014 149331 127752 118304 113313
18912 113313 112685 116711 127440 128934 121250 120533 120528 134355 149997 156017 161722 160873 167648 180989 202893
18897 202893 216567 222328 224175 231271 257063 266936 267117 275872 281053 290836 286172 281866 283147 293760
18883 293760 312903 342645 356944 350419 354909 362289 337358 326907 344746 344659 333825 299779 278452
18870B78452j7666k0112p845j9430k3140K976n934j1226j7444l248j0101j4238
18858A31044n856L890m170p767L552m818R282J9587J22j1026P144J6390J8216
18845A75590J6320J6653L737q997p821p739J0696K830o22l733j1820j3046K426
18832A74474j4659r837q991j7874j0584r887O186J5407R033j1188j1807r891o030
18819I4352j0698J2556J0095q34k83J3831l023j2159r781O18R28N563J0000k163
18805A09002k3073p517J3396O156o82l036l142J2131L976j1910k471q090K779
18792H7519K070m999R33j356k799P017p157M781J4018O503l755O184Q66k423k511
18777A04891l092L160N027Q514J926P176J3450J724L140M478J5628L7460L3677
$$ plain form
18870 278452 260786 240674 232829 213399 190259 193235 187301 176075 158631 155383 145282 131044
18858 131044 125188 129078 124908 117141 120693 115875 125157 144744 144866 133840 140984 157374 175590
18845 175590 191910 208563 212300 203303 195482 187743 198439 201269 200647 196914 185094 172048 174474
18832 174474 159815 149978 140987 123113 112529 102642 108828 124235 133268 122080 110273 100382 94352
18819 94352 83654 96210 106305 105471 105188 119019 115996 103837 94056 94674 95602 101165 111165 109002
18805 109002 85929 78412 91808 97964 97282 94246 91104 103235 107211 95301 92830 84740 87519
18792 87519 89589 84590 85523 84167 81368 88385 81228 86009 100027 106530 102775 108959 109825 107402 104891
18777 104891 101799 104959 109986 118500 120426 127602 141052 142776 145916 150394 166022 203482 237159
18764B37159L412j9362l4515m2476k1251N550J200K552k9q696M82m494j4944M969
18750A09557K415O934L872k770j0946R659N59p565Q508l052R265J0292J3998O817
18736A57543J6284j020N002m276j0267j4216j2636j0764J5271R126m62O768Q52
18723A57205K823L109q31J6541P284K6281K7265N383j4476j5167j2927K338j8585
18710A86243o925O250P823J7767J7479J0041J4264p544j6650Q76n052j7780j0335
18697A96457R4J928k928n645P549J6227J6713J6487K1466L0465K7156J5156L4035
18684C75160K3627q710k6931j9659m592j2654j4320n389r086n234j8494j1316
18672B62402j040j3882q384j933P31J4236K4285K0544o393j5440j4873j6389j920
$$ plain form
18764 237159 240571 221209 186694 144218 122967 128517 129717 132269 132240 123544 124026 119532 104588 109557
18750 109557 111972 118906 122778 120008 109062 118721 119280 111715 120223 117171 126436 136728 150726 157543
18736 157543 173827 172807 177809 173533 163266 149050 136414 125650 140921 150047 149585 156353 157205
18723 157205 160028 163137 162306 178847 186131 212412 239677 245060 230584 215417 202490 204828 186243
18710 186243 179318 185568 193391 211158 228637 238678 252942 245398 228748 229624 224572 206792 196457
18697 196457 196551 198479 195551 189906 197455 213682 230395 246882 268348 298813 325969 341125 375160
18684 375160 398787 390077 363146 343487 338895 326241 311921 306532 297446 292212 273718 262402
18672 262402 261362 247480 239096 237163 237894 252130 276415 296959 290566 275126 260253 243864 241944
18659B41944M816R443q113R238J8139R583N7n943O361n076j8640K478J4507j4527
18645B64267o736j607J0467J0332j1897Q771J3542Q242J2661K1291K7832L7539
18633C94704L0855K1497O42j717j8844o233Q799m268p815j9539m171j2210k3017
18620C58683q585j0311j0374j6887j0796j7354j4523k158J86q064K407L539k596
18607B63167N897j800r945J4635P851n848J1612K405K245K631l368K250k661q114
18593B80957k051j5322n388k137J043j576J2425J2915N212L399j2846M278M722
18580B85631p273n648R937L483j7598j5827m335j299R300N406j403q126L850m454
18566B51644J0731J0937R495J644N366j166m855J4865J6201L536n445j87q907
$$ plain form
18659 241944 246760 256203 248090 257328 275467 285050 285107 279164 285525 280449 261809 264287 278794 264267
18645 264267 257531 255924 266391 276723 264826 273597 287139 295381 308042 329333 357165 394704
18633 394704 425559 447056 447698 445981 427137 420904 429703 425435 417620 398081 393910 381700 358683
18620 358683 350098 339787 329413 312526 301730 284376 269853 267695 267881 259817 262224 265763 263167
18607 263167 269064 267264 257319 271954 279805 273957 285569 287974 290219 292850 289482 291732 289071 280957
18593 280957 278906 263584 258196 256059 257102 255526 267951 280866 286078 289477 276631 280909 285631
18580 285631 278358 272710 282647 286130 268532 252705 248370 247071 256371 261777 260374 252248 256098 251644
18566 251644 262375 273312 282807 284451 289817 288651 283796 298661 314862 318398 312953 312766 303859
18553C03859k2263J243Q115J2095l141L419n168j4455q44M066K707Q753P638J5030
18539C21054l664M017L903N012K796O72J9292J1700P573R513r25J4794Q691J1231
18525D15659R106J2515J0074J2275j691r415l15J1886J1250K2218N496q120o234
18512D84704R577J6241J2938l824J1764K0962J7314M342m205m414O132R855J3116
18499E94502J8251K5637K2648J9554J1340O304M528J5085K6224K1523L0265K1625
18487H17486K1391M500N134J4347J5601L3356K0845K1490K0188J9272K1564J1150
18475A026324J0972K6748J3413Q118L7373K9150K8986L5826L4662J9294J7998
18464A288864M2414O9593P5523O8562O9792J06775J40526J43485J24753O6561
$$ plain form
18553 303859 281596 282839 290954 303049 299908 303327 298159 283704 282860 286926 289633 298386 306024 321054
18539 321054 317390 321407 325310 330322 333118 333790 353082 364782 372355 381868 380943 395737 404428 415659
18525 415659 424765 437280 447354 459629 457938 448523 448208 460094 471344 493562 499058 490938 484704
18512 484704 494281 510522 523460 519636 531400 552362 569676 574018 569813 565399 571531 581386 594502
18499 594502 612753 638390 661038 680592 691932 698236 702764 717849 744073 765596 795861 817486
18487 817486 838877 843377 848511 862858 878459 911815 932660 954150 974338 993610 1015174 1026324
18475 1026324 1037296 1064044 1077457 1085575 1122948 1152098 1181084 1216910 1251572 1270866 1288864
18464 1288864 1331278 1400871 1476394 1544956 1614748 1721523 1862049 2005534 2130287 2196848
18454B196848l749j9024K7108P6176R1457P7451K0929n4203l2228M779J2167L8228
18442B435939O2890R3418J02311J14209J15182J34424J40301J74429K32871K79362
18432C885336K72118K22933J71972J37962J77345K42651K66526K62473J89062
18423E828378J27791J45681K16156K87821L53569M24221N02835O32171P79691
18414I298314R32472J068011J193232J386970J677526K125015K770233L710997
18406B4162770N020625O711729Q142425Q635591P702621N033593K691236J651882
18398F9752472P47203N31802J365243J404560j276022m351792o799555q788562
18390E2585349q609363o619817m315367k422566r93881J43269J154812K325454
$$ plain form
18454 2196848 2193099 2174075 2201183 2277359 2368816 2446267 2467196 2412993 2380765 2385544 2397711 2435939
18442 2435939 2498829 2592247 2694558 2808767 2923949 3058373 3198674 3373103 3605974 3885336
18432 3885336 4157454 4380387 4552359 4690321 4867666 5110317 5376843 5639316 5828378
18423 5828378 5956169 6101850 6318006 6605827 6959396 7383617 7886452 8518623 9298314
18414 9298314 10230786 11298797 12492029 13878999 15556525 17681540 20451773 24162770
18406 24162770 29183395 35895124 44037549 52673140 60375761 65409354 68100590 69752472
18398 69752472 70499675 71031477 72396720 73801280 72525258 68173466 61373911 52585349
18390 52585349 43975986 37356169 33040802 30618236 29624355 29767624 30922436 33247890
18382C3247890L909976O004575Q275090R733334R755475P934983N097276L591776
18374H7550375L084240R00659k008552l382514m596134n366021n381284o107497
18366F4693272q722276j0552859r634567p405578n362927l894750k866527k153006
18358A4100782j680080j312233j022434q07859o37467n48319m80856l94252k77988
18349F939294j55348m1027J6761q881j83039l80228m30853k88308j55372j08220
18339E204779j28426k74158m14701m27465l47823k55497j86875j49478r0407n1308
18329B878641n2539m6549k6267J0104Q1026J82902L04657L51103K74244Q4043
18319D041365j64146k59299j66486l525J04703J04617o0404k97761m14041l89144
$$ plain form
18382 33247890 37157866 43162441 51437531 61170865 70926340 78861323 83958599 87550375
18374 87550375 90634615 91535274 89526722 86144208 81548074 76182053 70800769 64693272
18366 64693272 55970996 45418137 35783570 28377992 23015065 19120315 16253788 14100782
18358 14100782 12420702 11108469 10086035 9278176 8640709 8092390 7611534 7217282 6939294
18349 6939294 6783946 6742919 6759680 6750799 6567760 6187532 5756679 5468371 5312999 5204779
18339 5204779 5076353 4802195 4387494 3960029 3612206 3356709 3169834 3020356 2929949 2878641
18329 2878641 2826102 2779553 2753286 2763390 2844416 3027318 3331975 3683078 3957322 4041365
18319 4041365 3877219 3617920 3451434 3447909 3552612 3657229 3596825 3299064 2885023 2495879
18309B495879k95518k09877j51366j13444o4166n4431n6205o0696l9868l7240
18299A413068l2438k1472j3532q274k4029l2883l2762j3755P1q727n967K549j5869
18286A205980j8621O322K0515J3822J4092R754J2244M191K0059K0283K0824K5343
18274A354808L0742K1044L8311O9248O4236O3666O1078P4484R0742J13102J49139
18263B130600K29419L42034M67093O40189O91368N46773J70157l92205o61486
18254D163942n90449m28801k93311k02137j16819p6334l2706L144L9982N6570
18244B523081O3772Q7826J23887J46794J97296K52879L28132L86362M13927M64526
18234D988482N15162O32322R05052J316649J920793K730105L627512L931350L095739
$$ plain form
18309 2495879 2200361 1990484 1839118 1725674 1661508 1607077 1550872 1490176 1450308 1413068
18299 1413068 1380630 1359158 1345626 1337352 1313323 1280440 1247678 1233923 1233994 1225267 1219300 1221849 1205980
18286 1205980 1187359 1193681 1214196 1228018 1242110 1251864 1264108 1268299 1288358 1308641 1329465 1354808
18274 1354808 1385550 1406594 1444905 1514153 1578389 1642055 1703133 1777617 1868359 1981461 2130600
18263 2130600 2360019 2702053 3169146 3809335 4500703 5047476 5217633 4825428 4163942
18254 4163942 3573493 3144692 2851381 2649244 2532425 2456091 2423385 2426529 2466511 2523081
18244 2523081 2586853 2674679 2798566 2945360 3142656 3395535 3723667 4110029 4523956 4988482
18234 4988482 5503644 6135966 7041018 8357667 10278460 13008565 16636077 20567427 23663166
18225B3663166Q65305k414444m097809l784769k792176j928916j302408q57530
18217G350419n49852l01073r2819O5843K32862M02102N49888P35237R81463J297596
18207A0671666J650475J991279K373591L159176M377945M760318L607486L86253
18199C2978189l923550n829044n171624l763089k600892j818620j272491q78277
18191G720602n78820l55353j54874J7617J74553K95697L93985M94997O15800Q62225
18181I486429J288358J940342K831014L924413M779099M912715L464722N57406
18173C3184498k550168n011763n390429m369789l134492k194484j534415j066083
18165G932875p31695m72811k45657o9304O4902J83150K89120L80338N26698P89736
$$ plain form
18225 23663166 24528471 22114027 18016218 14231449 11439273 9510357 8207949 7350419
18217 7350419 6800567 6499494 6406675 6472518 6705380 7107482 7657370 8392607 9374070 10671666
18207 10671666 12322141 14313420 16687011 19846187 24224132 28984450 32591936 32978189
18199 32978189 29054639 23225595 18053971 14290882 11689990 9871370 8598879 7720602
18191 7720602 7141782 6786429 6631555 6649172 6823725 7119422 7513407 8008404 8624204 9486429
18181 9486429 10774787 12715129 15546143 19470556 24249655 29162370 32627092 33184498
18173 33184498 30634330 25622567 20232138 15862349 12727857 10533373 8998958 7932875
18165 7932875 7201180 6728369 6482712 6413408 6478310 6661460 6950580 7330918 7857616 8647352
18155H647352J198030J827353K756625L941489M730868M430807K457847j115086
18147B8875285m029415m871848m132970l048269k235757j733271j364105j014919
18139F444731o86217m38494k80610j53509o5770J0341P7487J60617K94209N18580
18129E881365Q37046J276452J824495K230614K022488J111013p38644k325333
18121A2119496k480751j873931j269448q45429n39210k87328j02927P2406L03863
18112E096741N77296R54455J604668K582233L506908L353675K192967q54124l777465
18103A5237354m027342k952266j937097j286810q62859o03875m18458k50751j33663
18094B764233l1189P256m2602j53503k82317l26602k69017k10964j49364j25119
$$ plain form
18155 8647352 9845382 11672735 14429360 18370849 23101717 27532524 29990371 28875285
18147 28875285 24845870 19974022 15841052 12792783 10557026 8823755 7459650 6444731
18139 6444731 5758514 5320020 5039410 4885901 4820131 4830472 4907959 5068576 5362785 5881365
18129 5881365 6718411 7994863 9819358 12049972 14072460 15183473 14444829 12119496
18121 12119496 9638745 7764814 6495366 5649937 5110727 4823399 4720472 4792878 5096741
18112 5096741 5674037 6628492 8233160 10815393 14322301 17675976 19868943 19014819 15237354
18103 15237354 11210012 8257746 6320649 5033839 4170980 3567105 3148647 2897896 2764233
18094 2764233 2733044 2740300 2697698 2544195 2261878 1935276 1666259 1455295 1305931 1180812
18084A180812j05059q1269p2440m6053m1511l7416l9532l6977k0553k7032j2927
18073F60043k0997k0025k0326j6058j2008l780j3708j9333k9599k1550l869j4167
18061D64623n251k707j8353j6221n883n184n826p120r226M717q408q674l962l295
18047C69230k211L762q86p310m829j0476o748n102P93p630p392j729j1544j2916
18033B95012k067j5795k754L268j5290j2209r217J6890K5825K3050l474j6860
18021B86379j8971j6251q458m825J704M7N297k430q540k084r416j4588o215J612
18007B03261j665O033O614o307k532j391r27n8P906o056j2625o309m937j1487
17993A69520n503o424j071P141N003J7923P07j0768j0464m054L372P791Q720K1385
$$ plain form
18084 1180812 1075753 994484 922044 875991 834480 797064 757532 720555 700002 672970 660043
18073 660043 639046 619021 598695 582637 570629 566849 553141 533808 504209 482659 478790 464623
18061 464623 459372 456665 438312 422091 416208 411024 405198 398078 388852 393569 385161 376487 372525 369230
18047 369230 367019 370781 369895 362585 357756 347280 340532 335430 336223 328593 321201 319472 307928 295012
18033 295012 292945 277150 274396 277664 262374 250165 240948 257838 283663 306713 303239 286379
18021 286379 267408 251157 242699 237874 239578 239625 244922 242492 233952 231868 222452 207864 201649 203261
18007 203261 201596 207629 214243 207936 205404 204013 203086 203028 210934 204878 192253 185944 181007 169520
17993 169520 164017 157593 156522 163663 168666 186589 187296 176528 166064 162010 165382 173173 181893 203278
17979B03278N606m604K904j0526r144j3560k0497K029J1525N735r354j2029j8377
17966A32986q530Q349Q002L354R474K63n273j0809j6240r16R674N076O546R312
17952A51268k043k729n946j4883o428P500l128j6315p148J9161J9841P267m37
17939A45980j0679k0246j0795R940J0070J3929J4682Q508J1304N252q041R533
17927A79437k090N673J3090J2335J7012K5456P733l997j5799m360J849j099p609
17914B27631J4002j2736j7405k7986j7110j1428j0493m764k477P225K0582R869
17902A74910o484R387O747J7820K6677J7252J9281J7802R887P028O270K5957K2998
17889C55532K305j0628k4898l000o528j2879j2524k5415o889J1604j445j7415
$$ plain form
17979 203278 208884 204280 207184 196658 187514 173954 153457 155486 167011 172746 163392 151363 132986
17966 132986 124456 132805 140807 144161 153635 153898 148625 137816 121576 120660 130334 135410 141956 151268
17952 151268 149225 146496 140550 125667 119239 126739 123611 107296 100148 119309 139150 146417 145980
17939 145980 135301 115055 104260 114200 124270 138199 152881 161389 172693 177945 169904 179437
17927 179437 177347 183020 196110 208445 225457 250913 258646 254649 238850 234490 236339 235240 227631
17914 227631 241633 228897 211492 183506 166396 154968 144475 139711 137234 144459 165041 174910
17902 174910 168426 177813 184560 202380 229057 246309 265590 283392 293279 300307 306577 332534 355532
17889 355532 357837 347209 322311 319311 312783 299904 287380 261965 255076 266680 265235 247820
17877B47820p740k335q758l350J0951J6365J4798J1796n521j7598l965j4983j9847
17864B17633Q775N834j1397k729j1452j2789j2429j6862j8706j1411K48o090o034
17851A22591j301J1668R053L367M33J3572J3571J0391J2711J3852R352K2952K4996
17838B67208n712K3180K7331m741l5875l6463j5412Q218n48n159k0550j2696L501
17825A92282m461o310r7r248p798j1365J5135j691j3034o309j1298j7913j6095
17812A01798p052R95M848N474M618m673j3557o656n805q406j0219o858k975O190
17798E7722J0377K704N329n027l223p121o188k956P16P223R577o643k0666k232
17784C9592J2975O010o737P812L030j461j746k812n661o085k537M958M943K064
$$ plain form
17877 247820 240080 237745 228987 225637 236588 252953 267751 279547 274026 256428 252463 237480 217633
17864 217633 226408 232242 220845 218116 206664 193875 181446 164584 145878 134467 134715 128625 122591
17851 122591 121290 132958 142011 145378 145811 159383 172954 183345 196056 209908 219260 242212 267208
17838 267208 261496 284676 312007 307266 271391 234928 219516 227734 227186 222027 201477 188781 192282
17825 192282 187821 181511 181414 172166 164368 153003 168138 166447 153413 147104 135806 117893 101798
17812 101798 94746 95741 100589 106063 110681 106008 92451 85795 79990 71584 61365 54507 51532 57722
17798 57722 68099 70803 76132 71105 67882 60761 54573 51617 52333 59556 69133 62490 41824 39592
17784 39592 52567 58577 51840 59652 62682 61221 59475 56663 51002 44917 42380 47338 52281 54345
17770E4345k957O252N048j25M486j7905o417J686Q42J7952J7140j6701j9420r234
17756C4992J2478K67J0263j0270L175R961o694j274J316J3674l566j4132r958
17743D0232lN883l607L061N109K783M937j5693R092N038j6193l948j5644K32N854
17728B7133l11K439J2236n748M206J9144P281J1798R597J4903K5203J5511j697
17715A41695j0098k0783j6277m239j4308j069r303j994o204P929J5544J6405r801
17702H7497o284K058J3311j425J2993J3925j302m946j0914l902J1356K340m333
17689A10374M094J2435l575r3j0987j0732k6019k1896L998R656j702j6252j004
17676D8297O834k057J3262J1130M865M562J1610J7169J6244J8381K7191J5761
$$ plain form
17770 54345 51388 57640 62688 62563 67049 49144 42727 44413 45255 63207 80347 63646 44226 34992
17756 34992 47470 47737 58000 47730 50905 60866 54172 52898 54214 67888 64322 50190 40232
17743 40232 40229 46112 42505 45566 50675 53458 58395 42702 51794 56832 40639 36691 21047 21279 27133
17728 27133 26822 29261 41497 35749 39955 59099 66380 78178 87775 102678 127881 143392 141695
17715 141695 131597 110814 94537 90298 75990 74921 65618 63624 57420 65349 80893 97298 87497
17702 87497 81213 83271 96582 95157 108150 122075 120773 115827 104913 101011 112367 114707 110374
17689 110374 114468 126903 123328 123235 112248 101516 75497 53601 57599 67255 65553 49301 48297
17676 48297 55131 53074 66336 77466 82331 86893 98503 115672 131916 150297 177488 193249
17664A93249j6907k1723k917k2568k6613p419k87k833J0228L072j3744j0267j3995
17651F7276o787M231J122m611J1203K3393J7215J3398R03j0611k3258j2366L62
17638H1470j03K492K0107J4430M013k4165j2996l186q64j5390j7450j076l007
17625D4275j6850n713p312O450J4347K241R03J8343L954P073K7203K327p242p984
17611H2015k2375j3035J0342O304n122q521p568J637q445N304m207j2499q9o651
17597A7090N162k348m711R824Q188r733p360m710n520J410j269K353k096P421
17583A3701P883M615n243J5832P517J051j0032j4245n119P558l871M363J342j3028
17569A2324l929j185L658O66r185j0816Q65J6833K768k380J147o467Q124j066
$$ plain form
17664 193249 176342 154619 151702 129134 102521 95102 94815 91982 102210 105282 91538 81271 67276
17651 67276 60489 64720 65842 61231 72434 95827 113042 126440 127343 116732 93474 81108 81470
17638 81470 81367 83859 103966 118396 122409 98244 85248 82062 81198 65808 48358 47282 44275
17625 44275 27425 21712 14400 20850 35197 37438 38341 56684 60638 67711 94914 97241 89999 82015
17611 82015 59640 46605 56947 63251 58129 49608 42040 43677 35232 40536 36329 23830 23741 17090
17597 17090 22252 19904 15193 25017 33205 23472 16112 11402 5882 7292 6023 8376 6280 13701
17583 13701 21584 26199 20956 36788 44305 45356 35324 21079 15960 23518 19647 24010 25352 12324
17569 12324 8395 7210 10868 11534 2349 -8467 -7602 9231 11999 9619 10766 4299 12423 11357
17555A1357r666J0466J146o238k824O631M26R956j540k802j6179N711R927N263
17541B1634K355m436q927j7749j4579N793J6905n665q7R37M143N258J733p721
17527d06J776L473j577M789J6120q395k2885r382P173Q550o40j881J0825P178
17513A4718N107k231o610j2363J416M83P54P226J2001R906p405j6916l249Q738
17499A1575O749j872k807J4809k47k09k096r958m430K006K593O321R37J93J474
17484B5038K773l980p588l666M110o938k139L961J1259k550p246L417M92M56l044
17469A4355n60l245p108p251j527P837L786j019j1189j4588p838N131N097J5084
17455c035K4799m25j3522N680N323r197L651P668M785K875K538l86J0906J7510
$$ plain form
17555 11357 1691 12157 13303 7065 4241 10872 11298 21254 19714 16912 733 6444 16371 21634
17541 21634 23989 19553 10626 -7123 -21702 -15909 996 -4669 -4756 -3819 324 5582 7315 -406
17527 -406 1370 4843 3266 8055 24175 15780 -7105 -16487 -9314 -764 -1404 -3285 7540 14718
17513 14718 19825 17594 10984 -1379 37 520 1274 8500 20501 30407 23002 6086 2837 11575
17499 11575 18324 16452 13645 28454 28207 27998 25902 15944 11514 13520 16113 22434 23371 23564 25038
17484 25038 27811 23831 16243 12577 16687 9749 7610 11571 22830 20280 13034 16451 16943 17399 14355
17469 14355 13795 10550 3442 -3809 -5336 2501 6287 5268 -5921 -20509 -28347 -23216 -18119 -3035
17455 -3035 21764 21339 7817 13497 18820 9623 13274 20942 25727 28602 31140 30754 41660 59170
17441E9170J5116M1096M5296O859l9787l6078k6358m6296l3770L78K3377J3865
17429B2868q446j1727L278M090K529k14o802j0867l19l121O79p982k38L288Q902
17414d082R944K572J3053O97j0630j3587q42n785r426mJ285J226P218N729K551
17399h1j543q341j0114J8443P845K753K053n292r86j0856L755O007o146l192J0467
17384D772k583r027J3404M899K788O397K101j0214K481k641Q29N175m37o029M555
17369A6470l821o572j875k48J08l451r020n28l821l267q158R016M179J070j0278
17354b0196k815J0244J0164o860r453J0669J2275p018m514O575N036r150k434
17341g477L397L559j209l310o285O199m552k036J2549K308p054Q421M432j5962
$$ plain form
17441 59170 74286 115382 160678 167537 127750 91672 65314 19018 -14752 -14374 9003 22868
17429 22868 14422 2695 5973 10063 12592 12378 5576 -5291 -5610 -8731 -8052 -16034 -16272 -12984 -4082
17414 -4082 5862 8434 21487 22184 11554 -2033 -2875 -8660 -18086 -18090 -16805 -15579 -8361 -2632 -81
17399 -81 -1624 -9965 -20079 -1636 6209 8962 11015 5723 4737 -6119 -2364 3643 -2503 -5695 4772
17384 4772 2189 -6838 6566 11465 14253 20650 22751 12537 15018 12377 13206 18381 17944 11915 16470
17369 16470 12649 6077 4202 3954 4062 611 -8409 -8937 -12758 -16025 -24183 -15167 -10988 -9918 -20196
17354 -20196 -23011 -12767 -2603 -9463 -18916 -8247 4028 -2990 -7504 -929 4107 -5043 -7477
17341 -7477 -4080 -521 -1730 -5040 -11325 -5126 -9678 -11714 835 3143 -3911 4510 8942 -7020
17327g020J0080J5786M169p225j4927P626J336R388p008j6367j6615O86J7344
17314b747N664k868P181J0040k2434r016q49K445J4968j370m929K690J77p309
17300h357q054n135N874J3747J4264Q392r580j7110j1716O337L887K008k524j5245
17286b3212K960J1945Q257J0995m336l45m23R830L010r439r775j1022j3472P868
17272a7159J6164j467r297J0321J661M71Q678K588L081R603p419j3856k772O995
17258G592Q531k809r050j5758J327N131K4951L472j7907q489k054j0162j6132
17245c1357O609K2575J0287o574Q396K197K540L780j1751j0779l456k166j933
17232a1632M556M44P467n326k1858N85P656J1876l419l886m778m729J2814Q410
$$ plain form
17327 -7020 3060 18846 23015 15790 863 8489 9825 19213 12205 -4162 -20777 -20091 -2747
17314 -2747 2917 49 7230 17270 -5164 -14180 -15029 -12584 2384 1014 -3915 -1225 -1048 -8357
17300 -8357 -16411 -21546 -15672 -1925 12339 20731 11151 -5959 -17675 -11338 -7451 -5443 -7967 -23212
17286 -23212 -20252 -8307 -50 10945 6609 6264 5841 15671 18681 9242 -533 -11555 -25027 -17159
17272 -17159 -995 -2462 -11759 -1438 223 694 9372 11960 15041 24644 17225 3369 597 7592
17258 7592 16123 13314 4264 -11494 -10167 -5036 19915 23387 5480 -3009 -5063 -15225 -31357
17245 -31357 -24748 -2173 8114 1540 9936 12133 14673 18453 6702 -4077 -7533 -9699 -11632
17232 -11632 -7076 -6632 835 -4491 -26349 -25764 -18108 -6232 -9651 -13537 -18315 -23044 -10230 -1820
17218a820p565q613J0120n478m370M447J4796J3419p542j3663j201L803K764L131
17204B228p15K670J3128n1r364o537n184J158L410Q578o390O209N929j385O599
17189B0283k344r455j3836j3896P368L070N312J3060n56q927j517K553J198m408
17175b095j6277q323j206L953R511M643r987L397J5708P731j8462r982J0623k240
17161a3006j589k164J1089M753N995r997Q375k49j3028L035N940L895l453M779
17147D375r332p227n620J1796P218O916r610n845j2504N461J4400K227O00J8586
17133B1441K497r483k1676K113J525Q32j448p89L295J0992K478j9649n347q083
17119b1302N991l881N140l703L589P179n579k244q668q120J424J9325J0333l236
$$ plain form
17218 -1820 -9385 -17998 -7878 -13356 -17726 -13279 1517 14936 7394 -6269 -7470 -3667 -903 2228
17204 2228 1513 4183 17311 17260 7896 1359 -3825 -2667 743 9321 2931 9140 15069 13684 20283
17189 20283 17939 8484 -5352 -19248 -11880 -8810 -3498 9562 9006 79 -1438 1115 2313 -2095
17175 -2095 -18372 -26695 -27901 -23948 -14437 -9794 -19781 -16384 -676 7055 -11407 -21389 -10766 -13006
17161 -13006 -14595 -16759 -5670 -917 5078 -4919 3456 3207 -9821 -6786 -846 3049 -404 4375
17147 4375 -4957 -12184 -17804 -6008 1210 8126 -1484 -7329 -19833 -14372 28 2255 2855 21441
17133 21441 23938 14455 -7221 -5108 -3583 -2751 -4199 -4988 -1693 9299 11777 -7872 -13219 -21302
17119 -21302 -15311 -19192 -14052 -17755 -14166 -6987 -12566 -14810 -23478 -31598 -30174 -10849 -516 -3752
17105c752o819K724M131m999J370J0418P268Q843j4169r712q58q571Q534J0798
17091E206J29j305N169N406L655j3102p444l529K236j282K738j634q828n617k637
17076b0839O380L363L362j474J147o874K12J4828J2514l280j2819l019o626m869
17062a7994P174K526K525l730M649k671m666K711Q356K526l592Q204p010j2351
17048a3343M701N701J901L219k461r63j4565N297R567p61Q339o124q899N765N655
17033C029j13o524K919j0737L374N619O461k277O379m717N627J0476n243j4297
17019b4L096J272l671J0371O266j4277j3361N909O098K027N163J763j2329j0298
17005a1995L422M023m832k67J4344Q399m075j4551k1573j6910P109L373k274J7639
$$ plain form
17105 -3752 -10571 -7847 -3716 -8715 -7345 3073 10341 19184 5015 -4697 -5555 -14126 -5592 5206
17091 5206 5335 4030 9199 14605 18260 5158 -2286 -5815 -3579 -4861 -2123 -3757 -12585 -18202 -20839
17076 -20839 -14459 -11096 -7734 -9208 -8061 -14935 -14723 105 12619 9339 -3480 -6499 -13125 -17994
17062 -17994 -10820 -8294 -5769 -9499 -4850 -7521 -12187 -9476 -1120 1406 -2186 6018 -992 -13343
17048 -13343 -8642 -2941 -1040 2179 -282 -1245 -15810 -10513 -946 -1707 6632 508 -8391 -2626 3029
17033 3029 2916 -3608 -689 -11426 -8052 -2433 4028 1751 8130 3413 9040 19516 14273 -24
17019 -24 3072 4344 673 11044 17310 3033 -10328 -4419 1679 3706 8869 10632 -1697 -11995
17005 -11995 -8573 -4550 -9382 -9649 4695 13094 9019 -5532 -27105 -44015 -36906 -33533 -35807 -18168
16991a8168J547P079K1804N905n024n932j9353m863J2323j2397l373J6289J4015
16978I852K720j9023j2149Q756J3953J2502k400j6068j6033p687l01O094j870
16965b1654Q092k428q652j493J6277L107l732k296R154K703k859j4796J319J1609
16951e649p401j3318N849P037K355j132L760J2j815n190J888q16K32n646L945
16936a5889O378P749k680M788r249q79L970J734M597P457P196j152K658p606q216
16921H56J775O394J848m396p761n654L24O429j6579J286J3225J3130K31j8304
16907g196q748L809R079J1169m446m714Q941j900j2061j1038R449K002p620P711
16893e563P657J3283M765n520k935o725J601R722J0645J17o904n400N578j0237
$$ plain form
16991 -18168 -16621 -9542 12262 18167 13143 7211 -12142 -17005 -4682 -17079 -20452 -4163 9852
16978 9852 12572 -6451 -18600 -9844 4109 16611 14211 -1857 -17890 -25577 -25878 -19784 -21654
16965 -21654 -13562 -15990 -24642 -26135 -9858 -6751 -10483 -12779 -3625 -922 -3781 -18577 -17258 -5649
16951 -5649 -13050 -26368 -20519 -13482 -11127 -12259 -8499 -8487 -10302 -15492 -13604 -14420 -14188 -19834 -15889
16936 -15889 -9511 -1762 -4442 346 -8903 -9782 -5812 -4078 519 7976 15172 14020 16678 9072 856
16921 856 2631 9025 10873 6477 -1284 -6938 -6614 -185 -16764 -15478 -2253 10877 11108 -7196
16907 -7196 -15944 -12135 -3056 8113 3667 -1047 7894 5994 -6067 -17105 -7656 -5654 -13274 -5563
16893 -5563 2094 15377 20142 14622 11687 4962 6563 16285 26930 27047 20143 14743 20321 10084
16879A0084j4837J0178Q587j026m752P320p977k7165j3293P135P362N229P414
16866e741J1362N802j7527j3474o680j1306M598L35P701J1281m051j0655n039
16853c3394N819J8641O322K437J1690k126j3621p044J2505k514J3835p973j5542
16840a0965l392L768r058Q743J5821j229j0076n767L983q176L000J5792M74k683
16826B35M837q23q783M204m412j0460m547J5324L668k428K434p543R04M783o489
16811i096J335m419N581k684j702L028M704k341r485j985K685r604K274J6858
16797d851P971M687l265q768o927J1099l595q543j3309O674J7127Q792j008Q77
16783F961k088q112j6024J4927J2015l017P425K049r317p716k064L826N705J1527
$$ plain form
16879 10084 -4753 5425 14012 12986 8234 15554 7577 -19588 -32881 -25746 -18384 -13155 -5741
16866 -5741 5621 11423 -6104 -19578 -26258 -37564 -32966 -32631 -24930 -13649 -17700 -28355 -33394
16853 -33394 -27575 -8934 -2612 -175 11515 9389 -4232 -11276 1229 -1285 12550 4577 -10965
16840 -10965 -14357 -10589 -19647 -10904 4917 3688 -6388 -12155 -8172 -16348 -13348 2444 2918 235
16826 235 5072 4249 -4534 -330 -4742 -15202 -19749 -4425 -757 -3185 -751 -8294 -7390 -2607 -9096
16811 -9096 -7761 -12180 -6599 -9283 -10985 -7957 -3253 -5594 -15079 -17064 -14379 -23983 -21709 -4851
16797 -4851 3120 7807 4542 -4226 -11153 -54 -3649 -12192 -25501 -18827 -1700 7092 6084 6961
16783 6961 4873 -3239 -19263 -4336 7679 4662 12087 14136 4819 -2897 -4961 -1135 4570 16097
16769A6097m172p947r000j1684O516k869r752P497J6703J686J0531O072L517J8092
16755D1287J1506M378l581r577r578j5377j1531k162j2721J06K715j022p213L508
16741i262Q250J2605O683j0487r723o952J0291P182p117n488j194k900l439M123
16727g428N717p886Q60n40k668n706j955K351k228J451q909P432J8266Q419r809
16712b633j6935j949Q104O343q798k511m903O921J2588N498P474Q0K185L642j316
16697A3790q761M766M302j5721l906L044q049o835k985J4352m23j7505j1933k909
16683c8773J118J3878J2940q861J1506q6m675P196n15j6180R12M354r180j5078
16669d1444R098K0701P13J719J666l641k885q51o886J1352J0879N81O73l840j34
$$ plain form
16769 16097 11925 3978 -5022 -16706 -10190 -13059 -22811 -15314 1389 3075 13606 19678 23195 41287
16755 41287 52793 57171 53590 44013 34435 19058 7527 5365 -7356 -7250 -4535 -5557 -12770 -9262
16741 -9262 -1012 11593 18276 7789 -1934 -8886 1405 8587 1470 -4018 -5212 -8112 -11551 -7428
16727 -7428 -1711 -9597 -8737 -9277 -11945 -17651 -19606 -17255 -19483 -18032 -26941 -19509 -1243 7176 -2633
16712 -2633 -19568 -21517 -13413 -7070 -15868 -18379 -23282 -16361 -3773 1725 9199 9279 11464 15106 13790
16697 13790 5029 9795 14097 -1624 -5530 -2486 -10535 -17370 -20355 -6003 -6426 -23931 -35864 -38773
16683 -38773 -37655 -23777 -10837 -19698 -8192 -8278 -12953 -5757 -6272 -22452 -21540 -17186 -26366 -41444
16669 -41444 -32346 -11645 -10932 -9213 -7547 -11188 -14073 -14924 -21810 -10458 421 1002 1675 -2165 -2299
16654b299L510r332k0855P170J8522O58j216K226O489j1440p608l028m242n116
16640b6561l985J099N955k6L579J2484O029j972q050r228N32R984M317L795j1002
16625a3050M238O202m936J26K873J1482n827o437L945K782j1951K931l644N710
16611e556n430n380P004q62n101L221N411q156K845Q858J805K349j686o87l313
16596d678P503j2701j6881M94K238Q036O247P927J1051o129l270j2455P906M351
16582c61R542j449k469q243j7477M671M195J804K96m542p178r582Q599M813j403
16567a8784o486J6104J309j7767n316J4912P671J992L331l600J0875j1917K042
16554e634M640k322j6795L04r01Q695M940n905n577L726j696j639M195O782Q212
$$ plain form
16654 -2299 1211 -8121 -28976 -21806 -3284 -2626 -3842 -1616 4873 -6567 -14175 -17203 -21445 -26561
16640 -26561 -30546 -29447 -23492 -23518 -19939 -7455 -1426 -3398 -11448 -20676 -20144 -10160 -5843 -2048 -13050
16625 -13050 -8812 -2610 -7546 -7420 -4547 6935 1108 -5329 -1384 1398 -10553 -7622 -11266 -5556
16611 -5556 -10986 -16366 -9362 -10224 -15325 -12104 -6693 -14849 -12004 -3146 -1341 1008 -678 -1365 -4678
16596 -4678 2825 -9876 -26757 -26263 -24025 -15989 -9742 -1815 9236 3107 -163 -12618 -4712 -361
16582 -361 9181 7732 5263 -2980 -20457 -15786 -11591 -9787 -9491 -14033 -21211 -30793 -22194 -17381 -18784
16567 -18784 -25270 -9166 -7857 -25624 -30940 -16028 -8357 -6365 -3034 -6634 4241 -7676 -5634
16554 -5634 -994 -3316 -20111 -19807 -20708 -12013 -7073 -12978 -18555 -14829 -16525 -18164 -13969 -7187 1025
16539A025p995p428j327J4153J180j0773j0214j6021j179p38K079J2343o474k29
16525c1598J1998J4219q785m27n206m385O688J437K021n808j1283l153R918J3841
16511a0523R880J0407K495o813k4889N628Q689J973k099m826r463L604Q707K0412
16497A3182l389j2525K139l097M135p183O233P211l452l521k442o390q315N476
16483a1938m432O631M454K380l790j6741J2302O024J2330M926O484q979j3512
16470c861M250N324n376k994k3j74P630j881r698J746l166M094N209l128q25J0662
16454G789o645n627n72n694p375J881M375O834k373L596j303q927l551M688q442
16439b1346K163M925l55q56o552M810J2137J3539J1325l026n542j4452q641J539
$$ plain form
16539 1025 -6970 -14398 -15725 -1572 -392 -11165 -21379 -37400 -38579 -39317 -37238 -24895 -31369 -31598
16525 -31598 -19600 -5381 -14166 -14593 -19799 -24184 -17496 -16059 -14038 -19846 -31129 -34282 -24364 -10523
16511 -10523 -643 9764 12259 5446 -19443 -13815 -5126 -3153 -5252 -10078 -19541 -15937 -7230 13182
16497 13182 9793 -2732 -593 -3690 445 -6738 -505 6706 3254 -267 -2709 -9099 -17414 -11938
16483 -11938 -16370 -9739 -5285 -2905 -6695 -23436 -11134 -5110 7220 12146 18630 9651 -3861
16470 -3861 389 5713 337 -2657 -2680 -2854 4776 2895 -6803 -5057 -8223 -4129 1080 -2048 -2873 7789
16454 7789 1144 -4483 -5055 -10749 -18124 -16243 -11868 -5034 -7407 -3811 -5114 -14041 -17592 -12904 -21346
16439 -21346 -19183 -14258 -14613 -15469 -22021 -17211 -5074 8465 19790 16764 11222 -3230 -11871 -10332
16425a0332N359P525o346l008p508j287p124J2448J1984Q396j913j3560k4386
16412b9752R58J1148Q089j522r749Q563J1534r68j3320l884k455J1126O372P55
16398c105O479K609l065o079k33l407n192j0238o995O16J5094J2014M987O552
16384A0037j7085j7027j078L70J5645Q828R462l203K080j0492j8718p785J1850
16371a7116L31J0703J1474p94q252l669l429Q24Q344l401j840q97p737Q181J2552
16356E274j7373j5632J0540J3220J6284j0753j3910o04J4645M777j2534p45L386
16343c425J1183O201r221l501J7180J5314l176j87r551j8697J079o262j6242Q290
16329a1015O782M465k050n289j0996j0025O136L699o090n671J7869P122O751j1282
$$ plain form
16425 -10332 -4973 2552 -3794 -6802 -14310 -15597 -22721 -10273 1711 10107 8194 -5366 -29752
16412 -29752 -28794 -17646 -9557 -11079 -20828 -12265 -731 -1699 -15019 -18903 -21358 -10232 -3860 -3105
16398 -3105 3374 5983 2918 -3161 -3394 -6801 -11993 -22231 -29226 -28610 -13516 -1502 3485 10037
16384 10037 -7048 -24075 -25153 -24783 -9138 -310 9152 5949 8029 -2463 -21181 -28966 -17116
16371 -17116 -16785 -6082 5392 4598 -3654 -7323 -10752 -9928 -1584 -4985 -6825 -7722 -15459 -7278 5274
16356 5274 -12099 -27731 -17191 -3971 12313 1560 -12350 -12954 1691 6468 -6066 -6811 -3425
16343 -3425 7758 13959 4738 1237 18417 33731 30555 30368 20817 2120 3199 -3063 -19305 -11015
16329 -11015 -4233 232 -1818 -7107 -18103 -28128 -21992 -18293 -24383 -30054 -12185 -5063 1688 -9594
16315i594r505J1056j306l66J124q717K058J1898L579l00p099r512m716M505O987
16300i908l219L60J1576n508j8529R74k821P731N96J628j1862j024P831m908J991
16285b5092J2340K856l831j2666M013p32k186J4283n614J3783N683n170p211m732
16271a4276j0561q446L325p51J2528L918p25R99k575P690J9800m309k138M418
16257H897J748J1558j2148k4165l335p88N010j904l847N1J6844P908Q457p161
16243G125m689o66l070m997J0636J077j6216j6536k419p137m267J1378J0571q644
16229b7854J0317L784n728j917O208k355j4735j862J396J2005Q304J2525K898
16216B986m901r26Q83M401j3530l727n508M249l614j884l37K005P727P646N716
$$ plain form
16315 -9594 -19099 -8043 -9349 -9715 -8591 -17308 -15250 -3352 227 -73 -7172 -16684 -21400 -16895 -9908
16300 -9908 -13127 -12767 -1191 -6699 -25228 -24254 -27075 -19344 -18748 -17120 -28982 -30006 -22175 -27083 -25092
16285 -25092 -12752 -9896 -13727 -26393 -22380 -23112 -25298 -11015 -16629 -2846 2837 -2333 -9544 -14276
16271 -14276 -24837 -33283 -29958 -30709 -18181 -14263 -14988 -13989 -16564 -8874 10926 6617 4479 8897
16257 8897 10645 22203 10055 -14110 -17445 -18233 -13223 -15127 -18974 -18923 -2079 5829 14286 7125
16243 7125 2436 1770 -1300 -6297 4339 5416 -10800 -27336 -29755 -36892 -41159 -29781 -19210 -27854
16229 -27854 -17537 -13753 -19481 -21398 -15190 -17545 -32280 -34142 -32746 -20741 -12437 88 2986
16216 2986 -1915 -2841 -1958 2443 -11087 -14814 -20322 -16073 -19687 -21571 -21908 -19903 -12176 -4530 1186
16201A186j072j1067k884M834M978O56o583r764j0229J4898l91n463K0699N242
16187E040j8762O55j01j0608j980k99J1241J1182M600m574j3687m847N343N065
16173a1732n37L692Q4L884M519j912n297J0515j616r681j548o902r872K174k654
16158b6883M03J0295M576L715P076M619K70P638q522j0898j602m339P527Q43o118
16143a1400K761Q97m783R80L581q307K0804L211k1009K789J8312L142l284L571
16129A1265m460j4767L242J3274O979l109j0577j6211k245m138p291j070n27K294
16115b7341P823p091N42L621L110J3303J2740j111j2948j2012j5679R9J5421j0608
16101c0131j3051J6210P486l436L601L270J0468M497o81o177J249P668N52k679
$$ plain form
16201 1186 114 -10953 -13837 -9003 -4025 -3369 -9952 -19716 -29945 -15047 -15438 -20901 -202 5040
16187 5040 -13722 -13067 -13168 -23776 -25756 -26055 -14814 -3632 968 -3606 -17293 -22140 -16797 -11732
16173 -11732 -12269 -8577 -8493 -4609 -90 -2002 -7299 3216 1600 -8081 -9629 -16531 -26403 -24229 -26883
16158 -26883 -26480 -16185 -11609 -7894 -818 3801 4071 11709 3187 -7711 -9313 -13652 -6125 -5282 -11400
16143 -11400 -8639 -7742 -12525 -11545 -7964 -16271 4533 7744 -13265 -10476 7836 10978 7694 11265
16129 11265 6805 -7962 -4720 8554 15533 12424 1847 -14364 -16609 -20747 -28038 -29108 -29635 -27341
16115 -27341 -19518 -26609 -26067 -22446 -19336 -6033 6707 5596 -7352 -19364 -35043 -34944 -19523 -30131
16101 -30131 -43182 -26972 -19486 -22922 -19321 -16051 -5583 -1086 -1767 -7944 -6695 973 1525 -1154
16087a154n85o764o144m647O682j695m359L896j0226j0105L898O193J1215J601
16073a2194q230P266J1170J621q713Q542j322o37l398n706J8379r47r210n355
16059h734l425Q884l635J650M418o594m775k165Q421j7920l065L014J848K55R584
16044a2239Q640r790o598Q126N587N183k885K399j4347N226k637q193m778j4983
16030d1289m992J9038P499n077J020p908j132J356J454J2321N786j762l61M495
16016i552P821J776J36N907l288Q29k430J196n637o602P637Q370J42j925l306
16001A074q086l879j1956n302R013J4280J306p600m866n893M835J86L629J020
15987a2239n798P787J0312m293p406q537o01J7249J933Q759k998k1460p011j887
$$ plain form
16087 -1154 -1739 -8503 -14647 -19294 -12612 -14307 -18666 -14770 -24996 -35101 -31203 -25010 -13795 -12194
16073 -12194 -20424 -13158 -1988 -367 -9080 -538 -1860 -2497 -5895 -11601 6778 5831 -3379 -8734
16059 -8734 -12159 -3275 -6910 -5260 -842 -7436 -12211 -14376 -5955 -23875 -26940 -23926 -22078 -21823 -12239
16044 -12239 -3599 -13389 -19987 -11861 -6274 -1091 -3976 -1577 -15924 -10698 -13335 -21528 -26306 -41289
16030 -41289 -46281 -27243 -19744 -24821 -23801 -31709 -32841 -31485 -30031 -17710 -11924 -13686 -14047 -9552
16016 -9552 -1731 45 181 6088 2800 3629 1199 2395 -3242 -9844 -2207 6163 6305 4380 1074
16001 1074 -7012 -10891 -22847 -28149 -19136 -4856 -3550 -11150 -16016 -21909 -17074 -16888 -13259 -12239
15987 -12239 -18037 -10250 62 -4231 -11637 -20174 -20775 -3526 -1593 7166 4168 -17292 -24303 -26190
15973b6190R284M230O903l810r54r055j0495P491L717K231K0712q371j1066k912
15959a8285Q619J1580L642j3861n804j15J020Q04O067O800k223l953l134r465
15945a8308o66K559R240r313Q20l803n373j0533M483J3988P392o397j885o106
15931b3902m119J3932l748L805J794q722o354K951o14j17K498R155R170j1042
15917a5313n002J2376J4903o342j1138L016k603n455k552N449M289J4352m373
15904A607j0030j5764r333O62J0285J6639J0357j3139j7107O615J4869L354j5410
15891a6395j6608r841l250J2081J7670N540m611j27J2049J16j4441jP324n292
15877a5786j0713O924j1958n799J2548J2910l214L497q617m386L384J0944k438
$$ plain form
15973 -26190 -16906 -12676 -5773 -9583 -10537 -19592 -30087 -22596 -18879 -16648 4064 -4307 -15373 -18285
15959 -18285 -9666 1914 5556 -8305 -14109 -14224 -13204 -12400 -6333 467 -1756 -5709 -8843 -18308
15945 -18308 -18974 -16415 -7175 -16488 -15668 -19471 -24844 -35377 -30894 -16906 -9514 -15911 -17796 -23902
15931 -23902 -28021 -14089 -17837 -14032 -12238 -20960 -27314 -24363 -24977 -25094 -22596 -13441 -4271 -15313
15917 -15313 -20315 -7939 6964 622 -10516 -7500 -10103 -15558 -18110 -12661 -8372 5980 1607
15904 1607 -8423 -24187 -33520 -32858 -22573 -5934 4423 -8716 -25823 -19208 -4339 -985 -16395
15891 -16395 -33003 -42844 -46094 -34013 -16343 -10803 -15414 -15541 -3492 -3376 -17817 -17818 -10494 -15786
15877 -15786 -26499 -19575 -31533 -37332 -24784 -11874 -15088 -11591 -20208 -24594 -21210 -10266 -12704
15864a2704k225j765P891p20R35K234j5845K090P622L587j787J670l083J2409
15850C09Q495j214p562j039m632J02r26j1437j0809K806J6447M293l102n8J2332
15835D005o080j0692n615J3752J3598j7973j1574O852J2508k011j9114p272Q466
15822b1150K104o982k501J0511j674J564q4j5968j4299J3707K5412J5678K256
15809H574o091n679j585J725J0947J0734m058j7503m786P979P570L649j1983m783
15795e290o276O813J1620n606P722j495p398j8562n404M448P633m930L821J898
15781a1006k606J3378j0352j305r000q666k220o380N257K382L522M402j4609k677
15767c9880J6109N472J957J9475J5223M088j1231o651k677j5690p046j839p584
$$ plain form
15864 -12704 -14929 -16694 -8803 -9523 -8588 -6354 -22199 -20109 -12487 -8900 -10687 -9017 -12100 309
15850 309 8804 7590 28 -1011 -5643 -5541 -6467 -17904 -28713 -25907 -9460 -5167 -8269 -8327 4005
15835 4005 -2075 -12767 -18382 -4630 8968 -9005 -20579 -13727 -1219 -3230 -22344 -29616 -21150
15822 -21150 -19046 -26028 -28529 -18018 -19692 -18128 -18212 -34180 -48479 -34772 -9360 6318 8574
15809 8574 2483 -3196 -4781 -3056 7891 18625 14567 -2936 -7722 257 7827 11476 -507 -5290
15795 -5290 -11566 -4753 6867 1261 8983 7488 90 -18472 -23876 -19428 -11795 -16725 -12904 -11006
15781 -11006 -13612 -234 -10586 -11891 -20891 -29557 -31777 -38157 -32900 -30518 -26996 -22594 -37203 -39880
15767 -39880 -23771 -18299 -16342 3133 18356 22444 11213 4562 1885 -13805 -20851 -22690 -30274
15754c0274n874l039K128p295M059J9911L787N638m850o447j1684r177L033M697
15740c5387j807J840J2153l245j3093m731J3087J7377o875Q890j3056j0670J0848
15727b4669N211J0335M502l585j0546J740K365R65m238P941J1439k190j0912m420
15713a6062m919n468J0621O667j6371j737J6183J5828q398l867O949K412q537
15700f699o511P532O88R138k940p714j0905K96O59j239N617J8981J483j3965j1231
15685a6810J347l977m050n34J0389M580O587P549M413M890J672j0681j4713r303
15671a8641P772P65L52L138J717K153j5593o001Q649K017m297K019J9135P483
15657A0668r850j9767p559Q128L350o811O220J2005J1193n81p139L840j070q424
$$ plain form
15754 -30274 -36148 -39187 -37059 -44354 -40295 -20384 -16597 -10959 -15809 -22256 -33940 -43117 -40084 -35387
15740 -35387 -37194 -35354 -23201 -26446 -39539 -44270 -31183 -13806 -20681 -11791 -24847 -35517 -24669
15727 -24669 -19458 -9123 -4621 -8206 -18752 -17012 -14647 -13682 -17920 -9979 1460 -730 -11642 -16062
15713 -16062 -20981 -26449 -15828 -9161 -25532 -27269 -11086 4742 -3656 -7523 -574 1838 -6699
15700 -6699 -13210 -5678 -4990 4148 1208 -6506 -17411 -17115 -16456 -17695 -12078 6903 8386 -5579 -16810
15685 -16810 -15463 -19440 -23490 -24024 -13635 -9055 -2468 5081 9494 14384 16056 5375 -9338 -18641
15671 -18641 -10869 -10104 -9752 -6614 -4897 -2744 -18337 -24338 -15689 -13672 -17969 -15950 3185 10668
15657 10668 818 -18949 -26508 -18380 -15030 -21841 -15621 -3616 7577 6996 -143 3697 2627 -5797
15643e797J89J9188J718m722L045r197j2126j4306L648J3570J127m567Q94J776
15629e560Q33o862n834o704J3885J2328o164n569J4858K692J296J0511n886k0169
15615f345o090J1937J323N004M044j745q372j4149r222j4793N996J2366L394L503
15601a3149O411R435j545j1432r793Q076K441p659j688m50j9793J795J1929P500
15587a7922J437m853j521j462O554M507M13k317K93j687p85j759m301Q101J6099
15572G97j0747n874L601J385N978j679j442o652n723J2659J6897p167q208n559
15558a1734L237M259n947l889L997L134j2262L070P244J446k028p277J0115O002
15544f33j884k471Q086N448k498n088n520k594M550j1499m284L073l0N810q78
$$ plain form
15643 -5797 -5608 13580 15298 10576 13621 4424 -7702 -22008 -18360 -4790 -3663 -8230 -7336 -5560
15629 -5560 -4727 -11589 -17423 -24127 -10242 2086 -4078 -9647 5211 7903 9199 19710 13824 -6345
15615 -6345 -12435 -498 825 5829 9873 8128 -244 -14393 -23615 -38408 -32412 -20046 -16652 -13149
15601 -13149 -6738 2697 1152 -10280 -20073 -11997 -9556 -17215 -18903 -19353 -39146 -37351 -25422 -17922
15587 -17922 -16485 -21338 -22859 -24321 -17767 -13260 -12847 -15164 -14871 -16558 -17343 -19102 -23403 -15302 797
15572 797 -9950 -15824 -12223 -10838 -4860 -6539 -7981 -14633 -20356 -7697 9200 2033 -6175 -11734
15558 -11734 -8497 -4238 -10185 -14074 -10077 -6943 -19205 -16135 -8891 -7445 -9473 -16750 -6635 -633
15544 -633 -2517 -4988 3098 8546 6048 960 -4560 -7154 -2604 -14103 -18387 -15314 -15344 -9534 -10412
15529a0412J847r294J046Q041J0169Q953l221o404L508q9k409J420N17J609n469
15514a88R381k474n071o900P683j2856p704N185Q384n389P700j949j2693l514
15500b0405j3241L65j778J3415J5246j181j1088o557J757K1615J5271j2865q364
15487g810j1748M090M174j1633q404J4043K2088K357o708j5982q387J7968J9126
15474A3174n731o703p759j6269N572j80P029L531K478k096j1522L838k228o377
15460b3243M265N303N176q902r153P46l161M433R689Q003q72K226M680j0456O014
15445e252J4391M145p133K794Q47j08RN030J0463p479q289o696K53j59p826j006
15429f016J229Q035K392k916L292J316J2279M518j6746j1206P784L42m591m855
$$ plain form
15529 -10412 -8565 -17859 -16813 -8772 1397 10350 7129 725 4233 4144 1735 3155 3672 5281 -188
15514 -188 9193 6719 1648 -5252 2431 -10425 -18129 -12944 -4560 -9949 -2249 -4198 -16891 -20405
15500 -20405 -33646 -33281 -35059 -21644 -6398 -7579 -18667 -25224 -23467 -1852 13419 554 -7810
15487 -7810 -19558 -15468 -11294 -22927 -31331 -17288 4800 7157 449 -15533 -23920 -5952 13174
15474 13174 7443 740 -7019 -23288 -17716 -17896 -10867 -7336 -4858 -6954 -18476 -14638 -16866 -23243
15460 -23243 -18978 -13675 -8499 -17401 -26554 -25808 -28969 -24536 -14847 -6844 -7716 -5490 -810 -11266 -5252
15445 -5252 9139 13284 6151 8945 9792 9684 9693 14723 25186 17707 9418 2722 2975 2816 -5010 -6016
15429 -6016 -4787 3248 5640 2724 6016 7332 19611 24129 7383 -3823 3961 4303 -288 -5143
15415e143q277l605j8750N640J7092k765l242J651l859K551P197R907Q380j2689
15401e912j8025O729R456R071J1199J7668k4910j4645p804k908J5825J5970J0558
15388B2272k001j1684j821J047k674j037q157j365J2533O458j1998L447M983K128
15374A2131j5646j2643l863r610Q531J3149J4151k079p699j2718o189J541J2807
15361h137k613q056q411L87o398J6203J5157l282N210p977j0860k460l697O423
15347a8511J6735J3266k735M69o185l612j4655k6888l698J0205n64j315J3166
15334b4322J2119J7761J1944o478k176O232r944j4144j885l865N396M80j0594
15321a9476K133N122n447L181P717L114N589R45j8055m767K72O456j512K060R512
$$ plain form
15415 -5143 -13420 -17025 -35775 -30135 -13043 -15808 -19050 -17399 -21258 -18707 -11510 -1603 6777 -5912
15401 -5912 -23937 -17208 -7752 1319 12518 30186 5276 -9369 -17173 -20081 -4256 11714 22272
15388 22272 20271 8587 6766 7813 5139 4102 -4055 -5420 7113 13571 1573 5020 10003 12131
15374 12131 -3515 -16158 -20021 -29631 -21100 -7951 6200 4121 -3578 -16296 -22485 -20944 -8137
15361 -8137 -10750 -18806 -27217 -26830 -33228 -17025 -1868 -5150 60 -7917 -18777 -21237 -24934 -18511
15347 -18511 -1776 11490 8755 9224 3039 -573 -15228 -42116 -45814 -35609 -36173 -37488 -24322
15334 -24322 -12203 5558 17502 11024 8848 15080 5136 -9008 -10893 -14758 -9362 -8882 -19476
15321 -19476 -17343 -12221 -17668 -14487 -6770 -3656 1933 2878 -15177 -19944 -19672 -13216 -14728 -12668 -3156
15306c156J3476o82j1764l49L235K836M86J565o321k236j1488j0796j2901j432
15292c9527J1688N319L855P842j379J4203J6356K423n514j4774j2222O780Q724
15279C774l076r443n71j682m043j0467j8345k642J9250K1168O076k568k094M353
15265c10M802k977K526l226q674p914n818l153J2970K084N786n949j0175n599
15251b5627J778J59P811M512l756O76O820O763J1965j497p18j077o394j3390k1123
15236c3098p827j875K2410J6625L038J3395P187k931m051M373M148K264j6852
15223F806j6856m072J4881L46M990k522m205r833m68q279J741K469j508n32O203
15208a0839Q498l193M180J2919j11j5857q148n465j520P971P316j937k276p343
$$ plain form
15306 -3156 10320 9638 -2126 -2475 760 3596 4082 5647 -674 -2910 -14398 -25194 -38095 -39527
15292 -39527 -27839 -22520 -18665 -10823 -12202 2001 18357 20780 15266 492 -11730 -4950 3774
15279 3774 698 -8745 -9316 -10998 -15041 -25508 -43853 -46495 -27245 -6077 -1 -2569 -4663 -310
15265 -310 4492 1515 4041 815 -7859 -15773 -21591 -24744 -11774 -9690 -3904 -9853 -20028 -25627
15251 -25627 -23849 -23690 -15879 -11367 -15123 -14447 -7627 -864 11101 9604 8886 7809 1415 -11975 -33098
15236 -33098 -40925 -42800 -20390 -3765 -727 12668 19855 16924 12873 17246 21394 23658 6806
15223 6806 -10050 -14122 759 1105 6095 3573 -632 -10465 -10933 -19212 -17471 -15002 -16510 -17042 -10839
15208 -10839 -2341 -5534 -1354 11565 11454 -4403 -12551 -18016 -19536 -11565 -4249 -6186 -8462 -15805
15194a5805P46O889L234m470P441J880j5003j491J68P208M196k831p41J1392j588
15179A225j099l249m086Q068r902l423J6n31k089O039j099J2113J2629J0369j919
15164B3062m56p01k80r540p925p920O034P389K770L236L461m339j1614r291q194
15149a4308j3513J1187P727R464q378m097m129L09O298k87r906J2543j595J170
15135g515L22j0585P233J2778k384r71p586M172n15Q231J1929M046j1500l615
15121D040K12j755O43l652K961j858J637R245k677o433j433J074K125j5876k0215
15106c1962m273J8473J2019N050J1241Q472L05l259O88l37O69N781j4846j2290
15092d269l132l80j5694M681J025q079J159Q505J7363N865L172N702J914j8027
$$ plain form
15194 -15805 -15059 -8170 -4936 -9406 -1965 -85 -15088 -16579 -16411 -9203 -5007 -7838 -8579 2813 1225
15179 1225 126 -3123 -7209 859 -9043 -12466 -12450 -12981 -15070 -9031 -10130 1983 14612 24981 23062
15164 23062 22606 21905 21625 12085 4160 -3760 2274 9663 12433 15669 19130 14791 3177 -6114 -14308
15149 -14308 -27821 -16634 -8907 557 -7821 -11918 -16047 -15738 -9440 -9727 -19633 -7090 -8685 -7515
15135 -7515 -7193 -17778 -10545 2233 -151 -1122 -8708 -4536 -5051 3180 15109 19155 7655 4040
15121 4040 4252 2497 3140 -512 2449 591 2228 11473 8796 2363 930 2004 4129 -11747 -31962
15106 -31962 -36235 -17762 -5743 -693 10548 19020 19325 16066 16754 16417 17086 22867 8021 -4269
15092 -4269 -7401 -7781 -23475 -18794 -17769 -25848 -24689 -16184 1179 7044 10216 15918 17832 -195
15078a95m952J821M094L393p689m419N608k790n521J9769m950p383j551l311n341
15063a3417N094J8649L6p254P1l919j6140K69J0081j780m737N551N961p353p296
15048a6184j988R678J2070j321n587k437o371j993o12j1898R585Q532J428J8565
15034A1467l279j4688M710Q813j1589j2936L791K1354J7486q475q674o405Q264
15021I839P698Q740J6182L406j0976M42p947k2453J180R079m787J983M924l144
15007A4166k620N009O545l024O59k2685l285Q695Q944n35m517Q437O979P81K245
14992B5794L092M933Q852P352k300k859O151M755n848L227R774R153Q795J3464
14978I4335J7095P174J1302J8998L3683N7121P4355Q5463J32126J83800K98364
$$ plain form
15078 -195 -5147 -3326 768 4161 -3528 -7947 -2339 -5129 -10650 9119 4169 -3214 -4765 -8076 -13417
15063 -13417 -8323 10326 10362 3108 3179 -740 -16880 -16611 -6530 -8310 -13047 -7496 -1535 -8888 -16184
15048 -16184 -18172 -8494 3576 2255 -3332 -5769 -12140 -14133 -14745 -26643 -17058 -8526 -7098 11467
15034 11467 8188 -6500 -1790 7023 -4566 -17502 -13711 7643 25129 16654 7980 1575 9839
15021 9839 17537 26277 42459 45865 34889 35331 27384 4931 6111 15190 10403 12386 17310 14166
15007 14166 11546 16555 23100 20076 20735 -1950 -5235 3460 12404 11869 7352 15789 22768 23549 25794
14992 25794 28886 33819 42671 50023 47723 44864 51015 55770 49922 53149 62923 72076 80871 94335
14978 94335 111430 118604 129906 148904 182587 239708 314063 399526 531652 715452 1013816
14967A013816L53111K93551J17257k25955m08527l39908k32400j60418r8506o2791
14957B49230n3466k8472k3288j2993k8335j3325q174j8856n559o459j2463l740
14945C4100m386p941k309m384o459j3408J668m138M515J3118j0520M470l66P767
14931A1727M133j486j2028r374N842J449j153J1856J3279r63o023r740j220k876
14917C423j507O488O954m911P428j8660n164r731j0375O299L218j981J4145k994
14903g368M428J717J04o569m461l786k794N095J0890L448m06k079p968n282R947
14888e084J8153l698j2489P188J5388j868n512k241J15p855p782M202J433J6807
14874A6757m451n791R478q344j6329O957K0387q668l294J2349O453o184J787J1186
$$ plain form
14967 1013816 1366927 1660478 1777735 1551780 1143253 803345 570945 410527 312021 249230
14957 249230 195764 167292 144004 131011 102676 89351 81177 62321 56762 50303 37840 34100
14945 34100 29714 21773 19464 15080 8621 -4787 -3119 -7257 -2742 10376 -144 4326 3960 11727
14931 11727 15860 14374 2346 -7028 -1186 263 -890 10966 24245 23282 17259 7519 6299 3423
14917 3423 1916 8404 15358 10447 17875 -785 -5949 -15680 -26055 -19756 -16538 -18519 -4374 -7368
14903 -7368 -2940 -1223 -1119 -7688 -12149 -15935 -18729 -13634 -2744 704 298 -1781 -9749 -15031 -5084
14888 -5084 13069 9371 -3118 4070 19458 17590 12078 9837 9952 2097 -5685 -1483 -50 16757
14874 16757 12306 6515 15993 7649 -8680 -1723 18664 9996 6702 19051 25504 19320 21107 32293
14860C2293j1850j2622p074o024R550P104k699r583M11r39M636M174q664N705
14846D418J4232k777j0730k0268j0728q59j044K0024Q788Q267n93O58J004k632
14832G760j351j0128L67j14n888L661Q026Q25M067J2444p272o181r54o574m38
14817a750n190J1875J9761J478R669j0325j6198j367r837j0689J2760L873j0695
14804f635j1571j427O350J031l245P46L525J4781m17j0046j8899j329M899K2977
14790G40J9792j257r298r082j079K186n187j5025l611J3834N201p451J450O510
14776b277j557l239m554N700o891M927k898j0047R528J176n747l718j132j310
14762b2039K1863R880j037m257j382j3606K435J431J4883K591j0512j8179m478
$$ plain form
14860 32293 20443 7821 747 -5277 4273 11377 8678 -905 -494 -1433 3203 7377 -1287 4418
14846 4418 18650 15873 5143 -15125 -25853 -26712 -27756 -7732 1056 9323 8730 9388 10392 7760
14832 7760 6409 -3719 -3352 -3466 -9354 -5693 2333 3158 7225 19669 12397 6216 5262 -1312 -1750
14817 -1750 -6940 4935 24696 26174 35843 25518 9320 7953 -1884 -12573 187 4060 -6635
14804 -6635 -18206 -19633 -13283 -12252 -15497 -14751 -11226 3555 3138 -6908 -25807 -27136 -22237 740
14790 740 20532 19275 9977 895 -184 2002 -3185 -18210 -21821 -7987 -2786 -10237 -8787 -2277
14776 -2277 -3834 -7073 -11627 -5927 -12818 -7891 -10789 -20836 -11308 -10132 -15879 -19597 -20729 -22039
14762 -22039 -176 9704 8667 4410 3028 -10578 -8143 -6712 8171 10762 250 -17929 -22407
14749b2407J4152O167l05J284K563N303N598O266o744j275o6l232q415O304r856
14734d663j5336P556J3703M059m979n469M727K632k400j9387l320j039N928j131
14720a9119O762J2244K13m854J0936k76n744j058M369o639j426J4683O803j3352
14706C542j0925k568k255m163J5219O284j0512j44K1574Q892j067l308p504j8056
14692d991M656Q679n815Q46J2888L893J407o348q789j6931L673M088K62k169k077
14677f728l146J0394R256L731j2403o82M048j2817J935Q290J0907N153k864m038
14663A1036J702J0266n620o475O052K225j0973j1963k446J7238o350p884P705
14650D513Q689Q115k958o107q255l08p290M726P607K135Q0K599M475R46j61J831
$$ plain form
14749 -22407 -8255 -2088 -2393 -1109 1454 6757 12355 18621 11877 10602 10536 7304 -1111 5193 -4663
14734 -4663 -19999 -12443 1260 5319 340 -5129 -402 2230 -170 -19557 -22877 -23916 -17988 -19119
14720 -19119 -12357 -113 100 -4754 6182 5906 162 -896 3473 -3166 -4592 10091 16894 3542
14706 3542 -7383 -9951 -12206 -16369 -1150 5134 -5378 -5522 16052 24944 23877 20569 13065 -4991
14692 -4991 -335 8344 2529 3375 16263 20156 21563 15215 6426 -10505 -6832 -2744 -2482 -4651 -6728
14677 -6728 -9874 520 9776 13507 1104 422 4470 -8347 -6412 1878 12785 17938 15074 11036
14663 11036 12738 23004 17384 10909 16961 19186 8213 -3750 -6196 11042 4692 -3192 4513
14650 4513 13202 21317 18359 12252 3997 3689 -3601 1125 8732 10867 10947 13546 18021 18967 18806 20637
14634B0637j9494q475l754L117K0907P279M537j877K444L064n668K679K609K975
14620C0980j0211r189j537j3480k041l587L981N065m933n350q296L557J1466Q923
14606E348m831L213J033o406M629k638M785m478O3J3592L730j4307L712J8255
14592B5700j5263r463k83J2408R924j679o047j3100p771Q634N009r029K894J1483
14578A3417m651p220J181L706O920N028R490j318l083L423j4990j0352M149M863
14564A0563J4280j7439k1538L259J940k098jN777o032r498l185J2107Q666J5791
14550A2592j482K0253J0310r557q891p769M758O70j6681J790J0659M074n664j5170
14536a08Q926J386N74j615j2287J5051q725P214O19r422K998J0396l219M620n492
$$ plain form
14634 20637 1143 -7332 -11086 -7969 12938 20217 24754 22877 25321 28385 22717 25396 28005 30980
14620 30980 20769 11580 10043 -3437 -5478 -9065 -5084 -19 -4952 -10302 -18598 -15041 -3575 5348
14606 5348 517 3730 4763 -1643 2986 348 5133 655 718 14310 18040 3733 7445 25700
14592 25700 10437 974 691 13099 23023 21344 15297 2197 -5574 3060 8069 -960 1934 13417
14578 13417 8766 1546 2727 6433 13353 18381 27871 26553 23470 26893 11903 1551 5700 10563
14564 10563 24843 7404 -14134 -10875 -8935 -11033 -11034 -5257 -11289 -20787 -23972 -11865 -3199 12592
14550 12592 11110 31363 41673 32116 23225 15456 20214 20884 4203 5993 16652 20726 15062 -108
14536 -108 8818 10204 10778 9163 -3124 11927 3202 10416 11035 1613 4611 15007 11788 16408 10916
14521A0916n082j667l691R368l096m103j0712O54K763O521Q617r122n740l675
14507h049m565R66m280J3012N531P928J7366O075j6925r058L414p05k020j325
14493G365j3735J839R138M615j612O444J305o224n159J2468q1j9601J547Q719
14479G028O087j536N742O280l73j0750o362j912j716P351N610J401P075L402o900
14464B0427L515k142J841L443L80q607j1345P138J1363R627j1941j6765r95o569
14450f30N382R143j869N120l054o581P049N757k685o944l157j1078o199J681L911
14435d154P883j098M682L303N44k939j528O445N326K299n734Q45l412J299O857
14420B0618P618o731O005j0554K537j0681n974r291k913J0910O273j918n319O095
$$ plain form
14521 10916 5834 4167 476 9844 6748 2645 -8067 -7413 -4650 1871 10488 1366 -4374 -8049
14507 -8049 -12614 -11648 -15928 -2916 2615 10543 27909 33984 17059 8001 11415 10710 8690 7365
14493 7365 -6370 -4531 4607 9222 7610 14054 15359 9135 3976 16444 16363 -3238 -1691 7028
14479 7028 13115 11579 17321 23601 23228 12478 6116 4204 2488 9839 15449 16850 23925 27327 20427
14464 20427 23942 21800 23641 27084 27464 18857 7512 14650 26013 35640 23699 6934 5939 -630
14450 -630 4752 13895 12026 17146 14092 7511 14560 20317 17632 10688 7531 -3547 -9746 -8065 -4154
14435 -4154 3729 2631 7313 10616 11160 8221 6693 13138 18464 20763 15029 15874 12462 13761 20618
14420 20618 28236 21505 27510 16956 19493 8812 2838 -6453 -9366 1544 7817 5899 580 6675
14406F675J5109l242o083J8043J1494k3481j1518J3708J675p094p025L600J423
14393A3284j8092O884J0471P27j926Q205O330J284j985O820J197l768L017J1412
14379D3860j290o827o380L794J7829J4456K1820J7311p980j3700k1234r012j8766
14366C3881r162O06n627N361Q252j4917L482J185j6188M75J2759J5138L790J4316
14352E3351k100q525n877R34j2976j3601K18K150m788N748J5718K980j4045r341
14338I846k046M138q363N608L676J2282Q284N915J978o497M90J1275L643j1144
14324C9085o374r305L162L838m567k0994L20K2078J0314J3641p022j0027J1809
14311D5958N995j2668j2297K731q139M956J0274P704R82J688K508R280n534j6573
$$ plain form
14406 6675 21784 18542 12459 30502 41996 18515 6997 20705 22380 15286 8261 11861 13284
14393 13284 -4808 2076 12547 13274 11348 19553 25883 27167 25182 32002 33199 29431 32448 43860
14379 43860 42570 35743 29363 33157 50986 65442 87262 104573 96593 82893 61659 52647 33881
14366 33881 24719 25325 19698 25059 33311 18394 21876 23061 6873 7348 20107 35245 39035 53351
14352 53351 51251 42726 36849 37783 24807 11206 11424 13574 8786 14534 30252 33232 19187 9846
14338 9846 7800 11938 3575 9183 12859 25141 33425 39340 41318 34821 35311 46586 50229 39085
14324 39085 32711 23406 26568 30406 25839 4845 5165 27243 37557 51198 44176 34149 45958
14311 45958 51953 39285 26988 29719 21580 26536 36810 44514 45496 47184 49692 58972 53438 36865
14297C6865M754J2068L049M643n344j1569j0471L187J1509J1383K2741K2251J3690
14284A18756L1576L4105R37K572k3958l0418l3017k615j783q619k289k1156o009
14271E8082j156p103K682m229m096N199J0107r026K080O019j252Q79K0034K382
14257H0602j0045r242N386M061N310M608r153K495N656K6146J8662P858P214J8027
14243A57585L4130L7800N3593N6198P6720O8874O3393P214n3658q7576q8902o9324
14231B56047m6892k5641k1302k5283r726p681j5596q973o052o469n166k455N622
14218H0433R590R371j642j0371l135q378o537k381L695p014p862k320J0891K0877
14204H5217Q336O086K0492J9391J3672J3637L5128L8632M3917N3846P2687P9838
$$ plain form
14297 36865 41619 53687 56736 61379 56035 44466 33995 37182 48691 60074 82815 105066 118756
14284 118756 150332 184437 185374 187946 163988 133570 100553 97938 96155 87536 85247 64091 58082
14271 58082 56926 49823 52505 48276 44180 49379 59486 50460 52540 58559 57307 58186 78220 80602
14257 80602 70557 61315 66701 70762 76072 80680 71527 74022 79678 105824 124486 132344 139558 157585
14243 157585 191715 229515 283108 339306 416026 484900 548293 555507 501849 414273 325371 256047
14231 256047 209155 183514 162212 136929 127203 119522 103926 94953 88901 82432 77266 74811 80433
14218 80433 90023 99394 97752 87381 84246 75868 69331 66950 70645 63631 55769 53449 64340 85217
14204 85217 93553 99639 120131 139522 153194 166831 201959 240591 284508 338354 411041 490879
14192D90879O1386K6078m1326r2357j03340p9171m4258l3427k8193k3920k1775
14181A10576J310o942j865k179K619P412j379R214o71q378j7854n759O019K144
14167I4267k966n44j578p367M318R765o982o509J3119N336n312R933M328K342
14153A12150J8438P129j259J5512K5694L2450L0570J5634k3081m4220l3690l5777
14141A19550k0360j2931L502m311q052O394J56j2334j055m01j3600M151J548K218
14127F4475O56J0942J3576J126j3037m984P206J2674n68m584K334O295o729k341
14113H7041L668j5734l791N727M387J545n383O738j2509j720K421Q936J3279O356
14099A00961M086L86j1976l711j5358j905R221J233L326o671l694Q911Q895K220
$$ plain form
14192 490879 552265 578343 537017 444660 341320 262149 217891 184464 156271 132351 110576
14181 110576 111886 104944 103079 100900 103519 110931 109552 118766 118095 109717 91863 86104 92123 94267
14167 94267 91301 90757 89179 81812 86130 95895 88913 82404 95523 100859 95547 105480 109808 112150
14153 112150 130588 137717 136458 151970 177664 210114 240684 256318 233237 189017 155327 119550
14141 119550 99190 86259 89761 85450 77398 83792 83948 71614 70559 70158 56558 60709 62257 64475
14127 64475 65131 76073 89649 90775 77738 72754 79960 92634 92066 87482 89816 96111 89382 87041
14113 87041 90709 74975 71184 76911 81298 82843 77460 84198 71689 69969 72390 81326 94605 100961
14099 100961 105047 105433 93457 89746 74388 72483 81704 82937 86263 79592 75898 84809 93704 95924
14085I5924n844O659J2595M644j2817j3035N190Q374J0154K495j1975k648M513
14072A04229k171k42q172r960q478N811Q804j17Q988P602K866j3737j1014K3495
14058A07904O553Q5j886l505J0400l498r093j3928m768J8896j59j2415K201K5967
14044A22754J233r142q363j371R743m79P99L114p46J389J0530P389J222j4855
14030A23217O277J1912N718N946J6689J1792n67o576o181k157m506p693r195l701
14016A40975p834l953k567k426J0579J5483N666q815j4129J3431J1150p097p025
14003A43438r892j1667J8784K1392l719J017J5456O640n068j6847K376k430j5458
13990A44022R090K0802J4118M686n6J749M814J6135L408K029j7121O841J0279
$$ plain form
14085 95924 90080 96739 109334 113978 101161 88126 93316 101690 111844 114339 102364 99716 104229
14072 104229 102058 101816 93644 83684 75206 81017 89821 89704 98692 106294 109160 95423 84409 107904
14058 107904 114457 114542 112656 109151 119551 116053 106960 93032 88264 107160 107001 94586 96787 122754
14044 122754 123987 114845 106482 105111 114854 114375 115174 118288 117542 118931 129461 136850 138072 123217
14030 123217 129494 141406 147124 153070 169759 181551 180984 174408 168227 166070 161564 153871 144676 140975
14016 140975 133141 129188 126621 124195 134774 150257 155923 147108 132979 146410 157560 150463 143438
14003 143438 133546 121879 140663 162055 158336 159353 174809 181449 176381 159534 161910 159480 144022
13990 144022 153112 173914 188032 192718 192662 194411 199225 215360 218768 220797 203676 210517 220796
13977B20796l678O386J3188m52N141J315j0561j867P666j2193o39N502J1074J1898
13963B53576m120o030J295o812L302M572L344j5694k0505q770L584J4500j1358
13950B10884O156J5314p126N997R058Q439J4173K4901J3732J640J74j665l381
13937B98296R703K1192K1431M265k095M088M251M701K2423K1856M473p428L061
13924D10217M843R461J5499J0672N4454O4857R6617J08513R4713Q2106L2069o0366
13912I23655j06595j02366o7989n4948l4205j1044k0299k2252j6905j9283j5067
13901D52702K413J3619M709K3138K7578K4869L8916L3910K2022m218P888M37j0504
13888F37479k893j0799j4908n69m02K0449J4983J1951J2451P443L677K5254L9937
$$ plain form
13977 220796 217118 223504 236692 236240 241381 242696 232135 230268 237934 225741 225102 230604 241678 253576
13963 253576 249456 243426 244721 237909 241211 245783 249127 233433 212928 204158 207742 222242 210884
13950 210884 217040 232354 225228 231225 240283 248722 262895 287796 301528 303168 303342 301677 298296
13937 298296 307999 329191 350622 354887 352792 356880 361131 365832 388255 410111 414584 407156 410217
13924 410217 415060 424521 440020 450692 505146 570003 666620 775133 869846 951952 984021 923655
13912 923655 817060 714694 646705 591757 557552 546508 526209 503957 487052 467769 452702
13901 452702 455115 468734 473443 496581 524159 549028 587944 621854 643876 639658 647546 647983 637479
13888 637479 634586 623787 608879 608310 607908 628357 643340 655291 667742 675185 678862 704116 744053
13875G44053N0612M6981Q940q719r964r974M480J2418J0054K2568K5384K6310
13863I23143J7671M7091M9952M3422M0311M4435K7411J1290K0186L2502M8372
13852A305786M6103M4278N0736N0955M3523N7681N5961N7628O4266R4731J04199
13841A975847J10424R8733J06646J23769J45498J65531K00497K56819K97799L69636
13831C851199M52851N14408N80107O47743P24474Q83944J202997J695124K390166
13822A2943013L398858M567162N285431M675164K371305j387740m532755n274944
13814B2045494m350285l079016k097847j484248j207120j124514r72341p71971
13806F958152n84679m33262l17466k29131j46379p7155k2888J6164O6736J31957
$$ plain form
13875 744053 794665 841646 850586 841867 831903 821929 826409 838827 848881 871449 896833 923143
13863 923143 940814 987905 1037857 1081279 1121590 1166025 1193436 1204726 1224912 1257414 1305786
13852 1305786 1351889 1396167 1446903 1497858 1541381 1599062 1655023 1712651 1776917 1871648 1975847
13841 1975847 2086271 2185004 2291650 2415419 2560917 2726448 2926945 3183764 3481563 3851199
13831 3851199 4304050 4818458 5398565 6046308 6770782 7654726 8857723 10552847 12943013
13822 12943013 16341871 20909033 26194464 30869628 33240933 31853193 27320438 22045494
13814 22045494 17695209 14616193 12518346 11034098 9826978 8702464 7730123 6958152
13806 6958152 6373473 5940211 5622745 5393614 5247235 5170080 5147192 5163356 5230092 5362049
13796E362049J37154J71188K06272K44292L11978L85726M70647N82434P17033
13787H588773Q87360J088959J312988J534380J788918K123415K637551L502758
13779B3465102M835055O844239R785198J3517365J6412181J5351889R121552k618696
13771I6713885j4473929j8155780j5415844j1214645p851439n479430l894374
13764B0228444k853468k175110j723460j413590j172567r36810p33444n64379
13756H655616m35761l53804k47559j47294r9637l5786J5656N5456J17390J89241
13746G713518K58145L50498M66668O19570P95997R94943J184897J429868J725980
13737A5540084K089932K608181L430679M693413O597181R422779J3113202J6367580
$$ plain form
13796 5362049 5499203 5670391 5876663 6120955 6432933 6818659 7289306 7871740 8588773
13787 8588773 9476133 10565092 11878080 13412460 15201378 17324793 19962344 23465102
13779 23465102 28300157 35144396 44929594 58446959 74859140 90211029 99332581 96713885
13771 96713885 82239956 64084176 48668332 37453687 29602248 24122818 20228444
13764 20228444 17374976 15199866 13476406 12062816 10890249 9953439 9219995 8655616
13756 8655616 8219855 7866051 7618492 7471198 7371561 7335775 7351431 7406887 7524277 7713518
13746 7713518 7971663 8322161 8788829 9408399 10204396 11199339 12384236 13814104 15540084
13737 15540084 17630016 20238197 23668876 28362289 34959470 44382249 57495451 73863031
13729G3863031J5993597J0381671q59989j3642264j8690095j6418759j2069642
13722C8557550q455291n935297m219672l058809k330289j861015j520623j273400
13714I903154j037829q30406o75557n75847m94813m25731l47768k79425k29720
13705E006058j60752j26824r0321o4646k0997K1890O6457J23780J86507K43120
13695E184272L13751M09597N05371O40481Q30876J096598J503259K133654L023745
13686A5641604M184946N222694N191580L509091N4292l980154n923879n497519
13678A8402655m185520l013738k154818j535154j113680q62107o81399n69919
13670D286320m72245l82706l21506k62775k29368j78170j65618j68670j48112
$$ plain form
13729 73863031 89856628 100238299 99378310 85736046 67045951 50627192 38557550
13722 38557550 30102259 24166962 19947290 16888481 14558192 12697177 11176554 9903154
13714 9903154 8865325 8034919 7359362 6783515 6288702 5862971 5515203 5235778 5006058
13705 5006058 4845306 4718482 4628161 4563515 4542518 4564408 4630865 4754645 4941152 5184272
13695 5184272 5498023 5907620 6412991 7053472 7884348 8980946 10484205 12617859 15641604
13686 15641604 19826550 25049244 30240824 33749915 33804207 29824053 23900174 18402655
13678 18402655 14217135 11203397 9048579 7513425 6399745 5537638 4856239 4286320
13670 4286320 3814075 3431369 3109863 2847088 2617720 2439550 2273932 2105262 1957150
13661A957150j20285r2366o2174n9096o9992o8459o7617o0301o3495o0906n6629
13650A175830k5540j6746j8721r395M156K010m058j1426j4268J577l169P56K7019
13637A108025N9521N9826Q5646J41463J73494K61480L29943L43448K54349k872
13627B814323l06720m26986l82626k84728j95042j37700q2850p8325o4434n4335
13617H00577m7825l6919k2118r829k0712k6227k1287k7349k1138l512r125j7746
13605E36790M212J5061J9552K5072o536j0303l2015k2558l0423k1584q74j023
13593D75371l876p280j0466j2888r811O431J369M50k594k1032j7013k001l00l107
13579C93253J6833q591k2730j9953k1969j0418l903K3698J8933q217p25k655K769
$$ plain form
13661 1957150 1836865 1744499 1682325 1623229 1553237 1484778 1417161 1356860 1293365 1232459 1175830
13650 1175830 1150290 1133544 1114823 1105428 1109584 1111594 1107536 1096110 1081842 1083419 1080250 1081006 1108025
13637 1108025 1167546 1227372 1313018 1454481 1627975 1889455 2219398 2562846 2817195 2814323
13627 2814323 2507603 2080617 1697991 1413263 1218221 1080521 997671 919346 854912 800577
13617 800577 752752 715833 693715 683886 663174 636947 615660 588311 567173 563661 554536 536790
13605 536790 541002 556063 575615 600687 594151 583848 551833 529275 498852 477268 476394 475371
13593 475371 471495 464215 453749 440861 431050 437481 438850 439300 436706 415674 398661 396660 396360 393253
13579 393253 410086 401495 378765 358812 336843 326425 322522 346220 365153 356936 356211 353556 356325
13566C56325j202m234k11j7348J062q167j96K4888J3638M670R497m567k2846L255
13552C54564p073j7115o106j717N785n488k1682o113K462R86p137k209O049O740
13538C01946K767j4271k483P132K2847n271q638K074J0571j2355j7442p706m741
13525B74430Q644J5174L305j1461r538j5907l516J820p303L609K9813J7826j3839
13512B93057J819N74m213q36k247Q975J3390K365M202J145j9272j9918k7351q199
13498B43491J2149M560j152j0550q148J7209N250o935j9757j2790K771j968Q670
13485B32800N890n560P208J478j3435M735J4278R273k239k769K801J2819j404
13472B65875j7565l689J0688j2542j6524k660M774p936L738J5712l203J7092Q143
$$ plain form
13566 356325 355123 350889 350678 333330 334392 326225 326029 350917 364555 369225 378722 374155 351309 354564
13552 354564 347491 330376 324270 322553 328338 322850 301168 295055 297517 298503 291366 289157 295206 301946
13538 301946 304713 290442 287959 295091 317938 312667 304029 306103 316674 304319 286877 279171 274430
13525 274430 283074 298248 301553 290092 280554 264647 261131 262951 255648 259257 289070 306896 293057
13512 293057 294876 295450 291237 290401 288154 297129 310519 312884 317086 318231 298959 279041 251690 243491
13498 243491 255640 260200 259048 248498 240350 257559 262809 255874 236117 223327 226098 224130 232800
13485 232800 238690 233130 240338 241816 228381 233116 247394 256667 254428 251659 254460 267279 265875
13472 265875 248310 244621 255309 242767 226243 223583 228357 220421 224159 239871 236668 253760 261903
13459B61903k844J2468K7019K2727J4984J3715J5512J0741L0332J6950O068q368
13447D21207L686K313J6174K2631L7074J7263k024l1381l5982k7404l1511k3569
13435C68477k8635k4020k0869k594J0026K3120R592R82J4848J4871L482P25q405
13422C61600j1776l369L289Q431J2123N725n901R83l165Q208J4486k898J7904
13409D05640K6876j252K3801M193l3045k7292k3772K433J6142J8756J8375M751
13397D35606m354J8870Q641j2734j8045L178N651p800q211m21p30j8668l0824
13384C70159k5393J752r71R120k77l637Q33P523J890p381j668k914n058j2008
13370C31970j9465r816j4690j8285k2257j633m673n497J9341j034K262K7826J8472
$$ plain form
13459 261903 259059 271527 298546 321273 336257 349972 365484 376225 406557 423507 429575 421207
13447 421207 424893 427206 443380 466011 503085 520348 518324 486943 450961 423557 392046 368477
13435 368477 339842 315822 294953 292359 302385 325505 335097 336079 350927 365798 369280 370005 361600
13422 361600 349824 346455 349744 358175 370298 376023 370122 371105 367940 376148 390634 387736 405640
13409 405640 432516 431264 455065 459258 426213 398921 375149 377582 393724 412480 430855 435606
13397 435606 431252 450122 458763 446029 427984 431162 436813 429013 420802 420381 419651 400983 370159
13384 370159 344766 346518 345547 354667 354390 350753 351586 359109 360999 353618 351950 349036 343978 331970
13370 331970 312505 302689 287999 269714 247457 245824 241151 235654 254995 253961 256223 284049 302521
13357C02521M1065M8688J7628J0131J4011J2724L2065L8617M8894M5980L6183
13346F48507J9902M324o583l1901m7239m3275l5982j9711J63l87J1455O958P297
13333E13528q880j1104q111J528K072Q802M819J4944P920K8563K8027J3254J6692
13320F12054J9859P376J10k0322p745K5968N6659P8424O6980M2815L9710L7450
13308I59338L8386K0325K7666N6500O2042O8398P3587O0965K3097n0570q9269
13297A250465p1387m8759k5214k0348N644O061j0785O854J4215O870J3721J7314
13285A144651J1473K5858K8971L6772L6287M0305M9625L7333L9989M2392M3636
13274A537292M1989M1350K9017K9476L7472K8022M2998K3759L0898M2627L8945
$$ plain form
13357 302521 343586 392274 409902 420033 434044 446768 478833 517450 566344 612324 648507
13346 648507 668409 672733 666150 634249 587010 543735 507753 488042 488205 487818 499273 506231 513528
13333 513528 504648 493544 485433 486961 489033 497835 502654 517598 525518 554081 582108 595362 612054
13320 612054 631913 639289 639399 619077 611332 637300 693959 772383 839363 882178 921888 959338
13308 959338 997724 1018049 1045715 1102215 1164257 1232655 1306242 1367207 1390304 1339734 1250465
13297 1250465 1179078 1130319 1105105 1084757 1090401 1096462 1085677 1092531 1106746 1113616 1127337 1144651
13285 1144651 1156124 1181982 1210953 1247725 1284012 1324317 1373942 1411275 1451264 1493656 1537292
13274 1537292 1579281 1620631 1649648 1679124 1716596 1744618 1787616 1811375 1842273 1884900 1923845
13263A923845L0807L4343P5589Q6069J26475J32700J28279J06072O4271k089o0133
13252B646228n3309l295O336J6772L2503P8173Q8535J06726J11045J11207R6821
13241C237742R8148J03504J00131J22853J39091J64587K03495K17943K20125J95971
13231D803590J77853J63132J93327K47475K90369L02931K87827K90455L17305
13222G074264L10682L30883L49837L78723M32271M96817N47436N67849O21079
13213A1109841P14365Q23150Q97012R33606J029588J160869J338509J602680J863148
13204B1472768K195766K656399L251398L865859M585482N544505O909600Q757371
13196E9239148J1226478J4755816J9910986K7895995M0838132N9271727P5272153
$$ plain form
13263 1923845 1954652 1988995 2064584 2150653 2277128 2409828 2538107 2644179 2708450 2706361 2646228
13252 2646228 2592919 2589624 2595960 2612732 2645235 2723408 2811943 2918669 3029714 3140921 3237742
13241 3237742 3335890 3439394 3539525 3662378 3801469 3966056 4169551 4387494 4607619 4803590
13231 4803590 4981443 5144575 5337902 5585377 5875746 6178677 6466504 6756959 7074264
13222 7074264 7384946 7715829 8065666 8444389 8876660 9373477 9920913 10488762 11109841
13213 11109841 11824206 12647356 13544368 14477974 15507562 16668431 18006940 19609620 21472768
13204 21472768 23668534 26324933 29576331 33442190 38027672 43572177 50481777 59239148
13196 59239148 70465626 85221442 105132428 133028423 173866555 233138282 308410435
13189C08410435P1410783M4835665j0825137o8111639q3484400o8564750m8280888
13182A45390069l3189527k3260335j7049161j3074164j0143806p804222n982480
13175C4886374m612452l614827k932245k451144k150188j912389j644140j413921
13167A4155068j233308j105251r63069q07581o98448o36475n85458n51684m81334
13158G092460m16226l95411l83383l59120l10262k77279k39335k20624j73787
13149D317033j44927j12991j23944j36923j47231j26680j05351r4650q1832p1058
13139C171446q5584o1304n7911q5598q6415o8652m7843k3558o749J8096M1414
13128B707342J9659q959n4014j07156j38650j49401j27449j19265r4158p1018
$$ plain form
13189 308410435 379821218 424656883 413831746 345720107 262235707 193670957 145390069
13182 145390069 112200542 88940207 71891046 58816882 48673076 40868854 34886374
13175 34886374 30273922 26659095 23726850 21275706 19125518 17213129 15568989 14155068
13167 14155068 12921760 11816509 10853440 10045859 9347411 8710936 8125478 7573794 7092460
13158 7092460 6676234 6280823 5897440 5538320 5228058 4950779 4711444 4490820 4317033
13149 4317033 4172106 4059115 3935171 3798248 3651017 3524337 3418986 3324336 3242504 3171446
13139 3171446 3085862 3024558 2966647 2881049 2794634 2725982 2678139 2654581 2647832 2665928 2707342
13128 2707342 2727001 2718042 2664028 2556872 2418222 2268821 2141372 2022107 1927949 1856931
13118A856931o6453n4634m6767m4096n1041o5412n4349p3073n9778k8970k0788
13107A291570k8752j4741l5299l8350k8456k995O186P300l476N757j3433J050
13095A146361k378j365n780j8521l172l271j026N175J6534K1032L5734O7330P1119
13082A327772N1947J8647l4850r6598j25585r0275p2284n2891m3759l0817k2625
13071H28682k2261k5733j7336k6178k8386j7657P129P6512J01449P5223K7686
13060I79130k8409n7338m3580l0879k7973j8238J1477J0316M136J0687O810j8748
13048G97391k1285j0603j6333j4634j8042k1473k79K10Q925K8387J5503O131p420
13035G46478k0282m8727n0605j7688j3729p64Q118L548J0589k121j2577j984m670
$$ plain form
13118 1856931 1790478 1735844 1689077 1644981 1593940 1528528 1474179 1401106 1341328 1312358 1291570
13107 1291570 1262818 1248077 1212778 1174428 1145972 1142977 1149163 1156463 1152987 1158744 1145311 1146361
13095 1146361 1143983 1142618 1136838 1118317 1115145 1111874 1110848 1116023 1132557 1153589 1189323 1256653 1327772
13082 1327772 1379719 1398366 1363516 1266918 1141333 1051058 978774 925883 882124 851307 828682
13071 828682 806421 780688 763352 737174 708788 691131 698260 774772 876221 951444 979130
13060 979130 950721 893383 849803 818924 790951 772713 784190 794506 798642 809329 816139 797391
13048 797391 776106 765503 749170 734536 716494 695021 694742 694952 703877 732264 747767 753898 746478
13035 746478 726196 677469 626864 609176 595447 594683 602801 606349 616938 614817 602240 600256 595586
13022E95586K305J3425Q903Q309K3306L2469L0289J8627O35k4790j2786N228o354
13009F95152N46n746p222m757k2905j169n247R021J8574K2512K2455K7259M9688
12996G98161P9474Q3780Q9539Q4910J02154J26427J83608K62775L76415N59624
12986B746867Q41435J229780J459870J267242N84116p10197j561513j517991j119797
12977C219812p45642n05828l59604k67721j76555j18386r2222p1624q3223q8361
12967G10646p4373n7996n1550k6751k7329m7118k4854j8861k1325j194k3403j7473
12955C18419m780p264n354j1877l073o728j3646J262J6077K1696J3585O662P986
12942C32965R430j3428j5284k0221k854J8635P865j0511k3528l5729j0488j190
$$ plain form
13022 595586 597891 611316 620219 628528 651834 684303 714592 733219 733854 709064 696278 701506 695152
13009 695152 695698 689952 682730 677973 655068 653899 648652 657673 676247 698759 721214 748473 798161
12996 798161 877635 961415 1050954 1135864 1238018 1364445 1548053 1810828 2187243 2746867
12986 2746867 3588302 4818082 6277952 7545194 8129310 7419113 5857600 4339609 3219812
12977 3219812 2474170 1968342 1608738 1341017 1164462 1046076 953854 882230 799007 710646
12967 710646 636273 578277 526727 499976 472647 425529 400675 381814 360489 359295 335892 318419
12955 318419 313639 306375 301021 289144 286071 279343 265697 266959 283036 304732 318317 324979 332965
12942 332965 342395 328967 313683 293462 290608 309243 317108 306597 283069 247340 236852 235662
12930B35662j0034j1466q131q004O452L390K895R24p491K526J0081J5204P113
12917B39121K177k37m014J4867J4923k591j4355o053j0864J1248J3278j0303j1701
12904B35496n999j2773j1538j356o851j177m194q48Q511r882j7755Q624L273R092
12890A92623j5311j0974K79m25J300p076L373j5135M28p95r352Q841J5815j2303
12876A51288j3900k4488j0744j1750J5592q79r452J3588K0415l070j1175L642
12864A19067J1851j8507j2010K0224K5140J1220r438Q501J097J202O864j034j5270
12851A48907j910p613j1013M602n032q5K712o460j4031l439O149P907k05R574
12837A30063l209j322J573P871m908j0486K010R50J0363Q101m866p659o7P819
$$ plain form
12930 235662 225628 214162 206031 198027 204479 207869 210764 211688 204197 206723 216804 232008 239121
12917 239121 241298 241061 237047 251914 266837 264246 249891 243838 232974 244222 257500 247197 235496
12904 235496 229497 216724 205186 203830 196979 195802 191608 190760 199271 189389 171634 180258 183531 192623
12890 192623 177312 166338 166617 166192 167492 160416 163789 148654 149082 148287 138935 147776 163591 151288
12876 151288 137388 112900 102156 90406 105998 105119 95667 109255 129670 126600 115425 119067
12864 119067 130918 112411 100401 120625 145765 156985 147547 156048 157145 158347 165211 164177 148907
12851 148907 146997 139384 128371 132973 127941 127856 130568 124108 110077 106638 112787 120694 120489 130063
12837 130063 126854 125532 127105 134976 130068 119582 121592 122542 132905 141006 136140 128481 128414 136233
12823A36233J1576N639l896j6439j457J48k961L354r40j624m683l930R37L091
12809A25048p651k2473n07J0982M516p864J0238j669j4945l895p207N620J6766
12796A06959k440p692M475J0404j0652n729J5349Q125K447q87R778o10o029m957
12782A18541k69j629P030J689J470l722n041m268j166j1460l263J1124k928k233
12768A03875N847M513R24O680l703J97K3242J2596K0321J6145J6321J5069J5249
12755B37276K0312K2102J5088J1774L4370K9717M0322N0585Q3741J13768J56227
12744H15282K39863L33456L85162L24070J32598j68713l90920m00866l17753k22833
12734G29346j36228q8833p5647p8372n3021k9258k8102j5551r923j1418j5782
$$ plain form
12823 136233 147809 153448 149552 133113 131656 131804 128843 132197 131257 129633 124950 121020 121957 125048
12809 125048 117397 94924 94417 105399 109915 102051 112289 110620 95675 91780 84573 90193 106959
12796 106959 104519 96827 101302 111706 101054 95325 110674 118799 121246 120359 130137 129527 123498 118541
12782 118541 118272 116643 123673 125362 126832 123110 118069 113801 112635 101175 97912 109036 106108 103875
12768 103875 109722 114235 115159 121839 118136 118333 141575 154171 174492 190637 206958 222027 237276
12755 237276 257588 279690 294778 306552 340922 370639 410961 461546 545287 659055 815282
12744 815282 1055145 1388601 1773763 2097833 2230431 2061718 1670798 1269932 952179 729346
12734 729346 593118 504285 428638 350266 297245 267987 239885 224334 214411 202993 187211
12723A87211l0749k1407p466j1748q800n051k072k652Q563j27j088P198p517N120
12709A09415J2090l072j3597j646m705k980k800n856m588J267P958j688j647J632
12695H9783J818O144m446J976j1429j4355J1308M484j081L275k822o613J2707
12682I0749K082j6179j1158L345q571o908R434O453J0143o161j5305q701N398
12669E4621m449R85K0223k529K432J0192l934K220J472N653l068k32m730J0450
12655H9306J4502j3516q291j355n63Q046J0539Q56m209r313j4601k1864l944P709
12641E3302P332l847k774J218J358l159M33M699J0134M344j221m247Q284p420
12627F8436r042Q155L303m329q084J1268N994n968j5533k280M445J1865P669M321
$$ plain form
12723 187211 156462 135055 127589 115841 107041 101990 99918 97266 105829 105702 104614 111812 104295 109415
12709 109415 121505 118433 104836 103190 98485 95505 92705 86849 82261 83528 91486 89798 88151 89783
12695 89783 91601 97745 93299 95275 83846 69491 80799 85283 84202 87477 84655 78042 90749
12682 90749 92831 76652 65494 68839 60268 53360 62794 69247 79390 73229 57924 49223 54621
12669 54621 50172 51157 71380 68851 71283 81475 77541 79761 81233 86886 83818 83586 78856 89306
12655 89306 103808 90292 82001 80646 80083 88129 98668 99524 95315 86002 71401 49537 45593 53302
12641 53302 60634 56787 54013 55231 56589 53430 53863 58562 68696 73040 71819 67572 75856 68436
12627 68436 59394 67549 70852 66523 58439 69707 75701 69733 54200 51920 56365 68230 75899 80220
12613H0220J602n710o941o701r796j2697o371N089O922J5215Q201k461j3296r049
12599D4227J198j289K379N990r550M191m14n678k337m933M984K603j6142R177
12585C4406J3883O722J1888J0001j2624o099P775k41L057k957k837j94p91m477
12571E7512J711K695K01j4322L210N021J390o888k062j300Q84K959m445L855l185
12556D7236l340J2210J3781L360k1721k4601j1237k250M083p12l674j209M650
12543A6576M238J2381M499P023p893m521p819j1389J1205O632p883L93K636j762
12529B4316N646P021J0929l49N208n105j0040J353m739P80M954O961L017k675
12515D7277J875R080O910P026m321j0437j6164R88P07J191j531q096M186m286
$$ plain form
12613 80220 81822 76112 69171 62470 52674 39977 33606 38695 45617 60832 69033 66572 53276 44227
12599 44227 45425 44136 46515 52505 42955 47146 46732 41054 38717 33784 38768 41371 25229 34406
12585 34406 48289 55011 66899 76900 64276 58177 65952 65711 68768 65811 62974 62780 61989 57512
12571 57512 59223 61918 62119 47797 51007 56028 57418 50530 48468 47168 48052 51011 46566 50421 47236
12556 47236 43896 56106 69887 73247 51526 26925 15688 13438 17521 16809 13135 11926 16576
12543 16576 20814 33195 37694 44717 36824 32303 24484 13095 24300 30932 23049 23442 26078 24316
12529 24316 29962 36983 47912 47563 52771 47666 37626 38979 34240 35020 39974 46935 49952 47277
12515 47277 49152 58232 65142 72168 67847 57410 41246 42234 42941 44132 42601 34505 38691 34405
12501C4405j4351j1728J2J3019P806J787M858m509l009k943k826M557J3858p96
12487D0140R80q241J628M682Q967j108N441j2784k0057l905N949K3126J0488K544
12473E7850q805j6256R62J285k359m254J4087J0046j5031m634j678L367P48k88
12459C5040j2181j1146k448M924J4316m212j0055M069R475L687k779L511M335
12446C6536o80j2431Q027Q124j8202j1481L685j274K319Q376O040l343l407J508
12432B3797n18Q938p804K266l73j2069J177k037P518K055m767J581K138Q638n700
12417B4840r653K042R419J2890N839l38k429N006P609l389o228j3562r524l849
12403A8673R952R755l345r470L695k330O313j926r14r072L820Q79O301O350k08
$$ plain form
12501 34405 20054 8326 8338 21357 29163 30950 35808 31299 28290 25347 22521 27078 40936 40140
12487 40140 41120 32879 34507 39189 48156 47048 52489 39705 19648 15743 21692 44818 55306 57850
12473 57850 49045 32789 33751 35036 32677 28423 42510 52556 37525 32891 31213 34580 35328 35040
12459 35040 22859 11713 9265 14189 28505 24293 14238 18307 27782 31469 28690 32201 36536
12446 36536 35856 23425 31452 39576 21374 9893 13578 12304 14623 22999 29039 25696 22289 23797
12432 23797 23279 32217 24413 26679 26306 14237 15414 13377 20895 22950 18183 19764 21902 30540 24840
12417 24840 15187 17229 26648 39538 45377 45039 42610 47616 55225 51836 45608 32046 22522 18673
12403 18673 28625 38380 35035 25565 29260 26930 33243 31317 30403 21331 25151 26030 32331 38681 38473
12388C8473p3m664L585j839m954N328n64m844q560Q353R7n328m045n83n597o0
12372A4725l234q478P946R834j1884J671J6922j1142m038Q919K070n533p500K614
12358A2892Q359Q706o860p632N391Q878M725l234j6378K189N260O228l855o361
12344A8308N923Q833k932J31L316p396n439k183r025n15j982q399K788P558j84
12329H802R801O402q761k052J1212q144Q48J1714O360n747j2527r836k411J8091
12315B3752J2619K529q586k1465J681Q645J0028j0275J1692L1444m48k2409k9828
12302I379j470J1916J4627m864k3340m854R629N142j1947k062P540m79K134l237
12288H114Q852M424j735k240m96k734j161k40J687R500Ql090O844p896k448Q043
$$ plain form
12388 38473 38400 33736 37321 35482 30528 35856 35292 30448 21888 30241 30338 25010 20965 20382 14785 14725
12372 14725 11491 3013 10959 20793 8909 10580 27502 16360 12322 21241 23311 17778 10278 12892
12358 12892 21251 29957 23097 15465 20856 29734 34459 31225 14847 17036 22296 28524 24669 18308
12344 18308 24231 33064 30132 30263 33579 26183 20744 18561 9536 9021 7039 -1360 1428 8986 8802
12329 8802 18603 25005 16244 14192 25404 17260 18108 29822 36182 30435 17908 8072 5661 23752
12315 23752 36371 38900 30314 8849 10530 19175 29203 18928 30620 62064 61616 39207 9379
12302 9379 7909 19825 34452 29588 6248 1394 11023 16165 4218 2156 9696 9217 11351 8114
12288 8114 16966 21390 19655 17415 16919 14185 13024 12784 14471 23971 23979 20889 27733 19837 17389 25432
12272B5432L118L097J314L375r655q375o207J0831N625p190k919j4764M403J4206
12258B2291N127K212l467j7877N26Q471k035J0598P488q805l218Q228J3076N6
12244D2671n719j5274r182J3169N581q095q596m688m755k230L920J0373n535Q618
12230B0258R619O904O551p64j3154j8169j1010K235J7552n614j5046N611P366
12217A2339J6042N461o51j5010J465m061p804O158N65J63j713M916J2395J8606
12203D8871P866p893j0508j1733m803k556K927k139p583L159L54j890J704p03
12189A5073o161O393N120o014k300j0923L167M380J936q251L241J260j1091q787
12175a2957M940L195K215R235O315m00p737q123P560n88j3549k665J0813n214
$$ plain form
12272 25432 28550 31647 32961 36336 26681 18306 12099 22930 28555 21365 18446 3682 8085 22291
12258 22291 27418 29630 26163 8286 8812 17283 15248 25846 33334 24529 21311 29539 42615 42671
12244 42671 36952 21678 12496 25665 31246 23151 14555 9867 5112 2882 6802 17175 11640 20258
12230 20258 29877 36781 43332 42568 29414 11245 235 2470 20022 14408 -638 4973 12339
12217 12339 28381 33842 33191 18181 19646 15585 7781 13939 14504 14667 12954 17870 30265 48871
12203 48871 56737 48844 38336 26603 21800 19244 22171 20032 12449 15608 15962 14072 15776 15073
12189 15073 8912 15305 20425 14411 12111 1188 4355 8735 10671 2420 5661 6921 -4170 -12957
12175 -12957 -8017 -4822 -2607 6628 12943 12543 4806 -3317 4243 3655 -9894 -12559 -1746 -6960
12161f960J837K545k826m659Q212J0280O760m832m665l052o855K352J0088J5645
12147B3870j0966j2062K2869J8488p559p254o004J726P665K669k102n837m094
12134B1409r545r322o196j982J0632P813j935p467k119O386J0586J457o02r838
12120I277J35N442J386M311o38p205q395j7417j4023J1365J6091J285M267N46
12106F427O08o471l785j2282J076O583P820J1793J1921L886j4020j3602Q309J509
12092I772q580Q21N441l040K987J0465O994j0403m767r519j801J6958K228J580
12078A9136j6173m473n750o97J2438o19m666R582p313l365J4524Q336J526j0852
12064A1634m547o617J427J3146M792j699j1115k364o811Q961p927qO735j7869
$$ plain form
12161 -6960 -5123 -2578 -5404 -10063 -1851 8429 15189 10357 5692 2640 -4215 -1863 8225 23870
12147 23870 12904 842 23711 42199 34640 27386 21382 23108 30773 33442 31340 25503 21409
12134 21409 11864 2542 -3654 -5636 4996 12809 10874 3407 1288 7674 18260 19717 19115 9277
12120 9277 9412 14854 16240 20551 19913 12708 4313 -13104 -27127 -15762 329 1614 5881 6427
12106 6427 7035 564 -3221 -15503 -14427 -7844 -24 11769 23690 27576 13556 -46 8263 9772
12092 9772 1192 2013 7454 4414 7401 17866 24860 14457 9690 171 -1630 15328 17556 19136
12078 19136 2963 -1510 -7260 -7957 4481 3862 -804 8778 1465 -1900 12624 20960 22486 11634
12064 11634 7087 470 1897 15043 19835 18136 7021 4657 -2154 6807 -1120 -1128 5607 -12262
12050a2262O684J8019p23k997k809j7231j1454m972P212K705J0336J5264o667
12037A105m283L938J6220p959L453P998j1039q698N766n066j137Q921J541n834
12023D926k122M001l843Q770j119j870J1051K684j3030k998J291R35J0219K725
12009B1620j5364j2314j582J0282L695O954q752j9215j1277P45o485l17l05J4821
11995a7494J4161Q73O272N613m724l292M038j35k390N735R698N53j700K418k966
11980A6660L172l700q635N017J0624L336P41K985q908q803K076q102o746J8646
11966A8363J5670m696j4998n332o474M279K834n953j7543O042J8259j808j0185
11953a542K57J779n437M264J7136O728l19p127j4998j169n564J0553J9494N144
$$ plain form
12050 -12262 -5578 12441 11718 8721 5912 -11319 -22773 -27745 -20533 -17828 -7492 7772 1105
12037 1105 -3178 760 16980 9021 12474 20472 9433 735 6501 1435 298 9219 10760 4926
12023 4926 2804 6805 2962 11732 10613 8743 19794 22478 9448 6450 7741 8676 18895 21620
12009 21620 6256 -6058 -7640 2642 6337 13291 4539 -14676 -25953 -25208 -31693 -32010 -32315 -17494
11995 -17494 -3333 -2460 3812 9425 4701 1409 5447 5312 2922 8657 18355 18908 17208 19626 16660
11980 16660 19832 16132 7497 12514 23138 26474 27215 30200 21292 12489 14565 6463 -283 18363
11966 18363 34033 29337 14339 9007 2533 6812 9646 3693 -13850 -7808 10451 8643 -1542
11953 -1542 -1285 494 -4943 -679 16457 23185 22866 15739 741 -428 -5992 4561 24055 29199
11939B9199j1981n548P906p57p854n156j6175j1942J4667n012K668Q374l601m704
11925i916J7966n681j5111k963J1304J1059N289j1107n714k624Q20J1488M439
11912I249N523l972k219M205n951j06k205J6366l487j5457k249Q139r836m761
11898f761J7358O138n150o255j861L634O395P71M102k336n508P953K63M047L316
11883B6106j3729k662j2933m071n252J318R330l365k170J5525R896o400N870o784
11869A0679r575p549J3296M23J767m653q44n034j991J842m542O210M816K134P447
11854A4426J1364p930r91j1672r082l033q029J3682J3477K318k995l566j137K54
11840G086N968l078k847q749j718K937M497M448m567l966j0020l973O940Q99P00
$$ plain form
11939 29199 17218 11670 19576 18819 10965 5809 -10366 -22308 -7641 -12653 -9985 -1611 -5212 -9916
11925 -9916 8050 2369 -12742 -15705 -4401 6658 11947 840 -4874 -7498 -6678 4810 9249
11912 9249 14772 10800 8581 12786 6835 6729 4524 20890 17403 1946 -303 7836 -2000 -6761
11898 -6761 10597 16735 11585 5330 3469 7103 13498 14269 18371 16035 10527 18480 18743 22790 26106
11883 26106 12377 9715 -3218 -7289 -12541 -11223 -1893 -5258 -7428 8097 17993 11593 17463 10679
11869 10679 1104 -6445 6851 7274 9041 4388 3544 -1490 -3481 -1639 -6181 29 4845 6979 14426
11854 14426 25790 17860 16869 5197 -3885 -6918 -14947 -1265 12212 14530 11535 7969 6832 7086
11840 7086 13054 9976 7129 -1620 -3338 -401 4096 8544 3977 11 -10009 -13982 -7042 -6143 -5443
11825e443J8762J8872k0150k6506l488J5112Q217R33j2747p314k838p502j401
11812b5493M172K3068J623q068m199q344J119L262L480J5946P142O51l22r720
11798D317j7285j608J932o361q266J08K692K0750J1815j873m557p997J54K867
11784c312o798Q657n869l536o23p582J0457M844O849O310r022N877J5366j1773
11770I845r474J5700J2854l661m586q522p976j1730M009L627N561o7n949J1790
11756A1421Q113n976j2150M178J4522K747p190j4775j0448K435j0274P201J3811
11743C615J278p620R127p981m011j526o844J2737L280L058J2438O08O859L797
11729B8815q42j7296p860l289o618M308r495K23L55m190r574M36o604J2575K3830
$$ plain form
11825 -5443 13319 32191 12041 -14465 -17953 -2841 5376 6309 -6438 -13752 -16590 -24092 -25493
11812 -25493 -21321 1747 3370 -4698 -8897 -17241 -16122 -12860 -9380 6566 13708 14359 14037 4317
11798 4317 -12968 -14576 -12644 -19005 -27271 -27163 -24471 -3721 8094 6221 1664 -6333 -6179 -3312
11784 -3312 -10110 -1453 -7322 -10858 -11481 -19063 -8606 -3762 3087 9397 375 6252 21618 9845
11770 9845 371 16071 28925 25264 20678 12156 4180 -7550 -3541 86 5647 5580 -369 11421
11756 11421 19534 13558 1408 5586 20108 22855 15665 890 -9558 -7123 -17397 -10196 3615
11743 3615 4893 -2727 6400 -1581 -5592 -7118 -13962 -1225 2055 5113 17551 18159 25018 28815
11729 28815 27973 10677 2817 -472 -7090 -2782 -12277 -12054 -11699 -15889 -25463 -25027 -31631 -19056 4774
11714D774j211p198L40m553N121l880J147N875R177M812N542j4099J74J1324O865
11699B4210N442p156j4650l369J701R589p073j042k8128L417O750j684k015l351
11685a7359p427N500L642N599K631Q801J2531J2264q289l609Q584k937j351l422
11671A5158q550o928l217O236N082N25k636Q587K307j3139k439k439j2389m433
11657a8275J8752J6009k301j0187m20K085M485r975m692L84R640J5408n172o598
11643I143r20N839m634j1213J3820R35P292O672l119n723k838k897L602j7071
11629a112k1500L470O214J3417O820R151n243o821J061J734J1602r352k014j0498
11615c071j3266N013O564p282j1298J2087p01n369n591J1495L1o797m50J0406
$$ plain form
11714 4774 3563 -3635 -3295 -7848 -2727 -6607 -5460 415 9592 14404 19946 5847 6021 17345 24210
11699 24210 29652 22496 7846 4477 6178 15767 8694 7652 -20476 -17059 -10309 -11993 -14008 -17359
11685 -17359 -24786 -19286 -15644 -10045 -7414 1387 13918 26182 17893 14284 22868 19931 18580 15158
11671 15158 6608 -320 -3537 2699 7781 8306 5670 14257 16564 3425 986 -1453 -13842 -18275
11657 -18275 477 16486 14185 3998 3578 5663 10148 173 -4519 -4135 5505 20913 15741 9143
11643 9143 8223 14062 9428 -1785 12035 12970 20262 26934 23815 18092 15254 12357 15959 -1112
11629 -1112 -22612 -19142 -12928 489 7309 16460 11217 4396 5457 7191 18793 9441 7427 -3071
11615 -3071 -16337 -11324 -4760 -12042 -23340 -11253 -11954 -17323 -22914 -11419 -11388 -18185 -18635 -8229
11601h229J0010O822K043k714j7227j0756J4816K048j2699P272J0019N31Q466
11588A0402J064j1488l028P450j2008n404N774n895L02J3168o355n976o779k76
11574a9049o738J154J5129K388J655O766o631J226J634j400L488J449q428J512
11560e845o145P519J6056o230k6379n430N611j2475K982M593j3404J5860J7604
11547e683o221J5M597N786P499K592J111k932k958j479O769J958Q832j4637j0268
11532e019K871j04M341J008l410o260o173J213L147j689o519q191K075k483J0754
11517a4439R000k757N097M62j780m709l046O423N516j267j877l588p143j90R880
11502d418L725j26l044j0498o121J322J1292N805p909Q616O387P08K300J962p351
$$ plain form
11601 -8229 1781 8603 10646 7932 -9295 -20051 -5235 -3187 -15886 -8614 1405 1936 10402
11588 10402 11466 -22 -3050 4400 -7608 -13012 -7238 -13133 -12831 337 -6018 -11994 -18773 -19049
11574 -19049 -25787 -24633 -9504 -7116 -5461 1305 -5326 -4100 -2466 -3866 -378 1071 -7357 -5845
11560 -5845 -11990 -4471 11585 5355 -21024 -26454 -20843 -33318 -30336 -25743 -39147 -23287 -5683
11547 -5683 -11904 -11889 -7292 -1506 5993 8585 9696 6764 3806 2327 9096 11054 19886 5249 -5019
11532 -5019 -2148 -2252 2089 3097 -313 -6573 -12746 -11533 -8386 -10075 -16594 -24785 -22710 -25193 -14439
11517 -14439 -5439 -8196 -3099 -2637 -4417 -9126 -12172 -5749 -233 -1500 -3377 -6965 -14108 -14298 -4418
11502 -4418 -693 -819 -3863 -14361 -20482 -19160 -7868 -2063 -9972 -1356 5031 5739 8039 10001 2650
11487B650j4034L940J5676r785j597k86l24J7635J2640j130K81p999q456j1103
11473a892n692Q015O713Q43q909j1679O582K4421m75o581O180j1101p802N720
11459D343Q767j340j7177q741R30N256P91O277o166O5L364P718K065m185P657
11444I624m421j3634k671j860J1730K468J3331P081j3480j6453p157n45p458J300
11430b2145O840L638m071O145R025O050j081J0243J3818p243l498l464m956J2651
11416B1952j1890m536L604m493R21q110o646l74P261m121k285l279N505l7j2246
11401a8774l531j458P134J0528J128M819q619N62P512q12O642L381j293k739J267
11386E747K497p9o680J740M496J386j5629j0655J547J8863M697j1144K352m466
$$ plain form
11487 2650 -11384 -7444 8232 -1553 -3150 -3436 -3760 13875 26515 25385 25666 17667 9211 -1892
11473 -1892 -7584 431 7144 7987 -922 -12601 -6019 18402 17927 11346 17526 6425 -1377 4343
11459 4343 13110 11770 -5407 -14148 -13218 -7962 -7171 -894 -7060 -6995 -3631 4087 6152 1967 9624
11444 9624 5203 -8431 -11102 -12962 -1232 1236 14567 21648 8168 -8285 -15442 -15987 -23445 -22145
11430 -22145 -15305 -11667 -15738 -9593 -568 5482 4401 14644 28462 21219 17721 14257 9301 21952
11416 21952 10062 5526 9130 4637 5558 -2552 -9198 -9572 -2311 -6432 -8717 -11996 -6491 -6528 -18774
11401 -18774 -22305 -23763 -16629 -6101 -4973 -154 -8773 -8211 -699 -1511 5131 8512 7219 4480 5747
11386 5747 8244 8165 1485 3225 7721 9107 -6522 -17177 -15630 3233 7930 -3214 -862 -5328
11372e328k852q00J5300N10q948r692j1790L2O359O339q336n343R486l170m210
11357b2443j840N849k95J0025j4028L379K643j0005k212O591J4032j820M48J0101
11343D25j2139m59K508j4987K276m667O353N57l841l841l126j113J2860N834j0759
11328b4119K8296J3739Q148r30j0247l710j3123j4560J889J31n649l986m995J9224
11314i892J0061J110p886k3434N134J8763p060l557n858p7J1239J1922L238N414
11300I117l953m791J161l652j3183j472J9177p189j0320k353M246J065L931J061
11286g155l637N194J144o494j449K556m758p895P278J361L351j207J0353M170
11272B812m18K566Q128Q947j7672k2795O614l776M967Q302L324p795j191J3069
$$ plain form
11372 -5328 -8180 -8980 6320 6830 -2118 -11810 -23600 -23568 -17209 -10870 -19206 -24549 -15063 -18233 -22443
11357 -22443 -24283 -18434 -18729 -8704 -22732 -19353 -16710 -26715 -28927 -22336 -8304 -10124 -9676 425
11343 425 -11714 -12173 -9665 -24652 -22376 -27043 -20690 -20133 -23974 -27815 -30941 -32054 -19194 -13360 -24119
11328 -24119 4177 17916 26064 25134 14887 11177 -1946 -16506 -14617 -14486 -20135 -24121 -29116 -9892
11314 -9892 169 1279 -6607 -30041 -24907 -6144 -13204 -16761 -22619 -22696 -11457 465 3703 9117
11300 9117 5164 373 1534 -2118 -15301 -16773 2404 -4785 -15105 -17458 -13212 -12147 -8216 -7155
11286 -7155 -10792 -5598 -4454 -10948 -12397 -9841 -14599 -22494 -15216 -13855 -10504 -11711 -1358 2812
11272 2812 2394 4960 13088 22035 4363 -18432 -11818 -15594 -10627 -2325 999 -6796 -7987 5082
11258E082M345K764L462O392j3574j6295M686J3124j0056O421J0822q576j3214
11245d617o978k295l138J8278M847m10L243K95r438m962j0811j3L141l099K767
11230a3190J7099Q846j934j0200j3080k5O274m140k549M025J6028j793O883R88
11216A3232L271k525n780l133j3m72K054m431r944K783L574j2891j966q025R361
11201a4905J4693K48n440o790R22q033J861k747j825R015N490r974j2395J2097
11187a7783J1578K171Q950n291o98j369N377o439j989o038Q165J5293j795j3382
11173c250k4511k224J4023J1758J1900K684m582l333o042R399N802M164P785O899
11159C0472j076q68j0974q871L843J5460K1592R247n65K036k056K206p058r029
$$ plain form
11258 5082 9427 12191 15653 22045 8471 -7824 -3138 9986 -70 6351 17173 8597 -4617
11245 -4617 -11595 -13890 -17028 1250 6097 5687 8930 9225 -213 -5175 -15986 -15999 -12858 -15957 -13190
11230 -13190 3909 12755 10821 621 -12459 -12484 -6210 -10350 -12899 -8874 7154 5361 12244 13232
11216 13232 16503 13978 8198 5065 5052 4580 6634 2203 -7741 -4958 -1384 -14275 -16241 -24266 -14905
11201 -14905 -212 36 -5404 -12194 -11272 -19305 -17444 -20191 -22016 -13001 -7511 -17485 -29880 -17783
11187 -17783 -6205 -4034 4916 -375 -1073 -2442 2935 -3504 -5493 -11531 -3366 11927 10132 -3250
11173 -3250 -27761 -29985 -15962 -4204 7696 10380 5798 2465 -3577 5822 11624 15788 23573 30472
11159 30472 29396 28528 17554 8683 12526 27986 49578 58825 58260 60296 58240 60446 53388 44359
11145D4359K651K665m215j5503N90M036j0899l001M516k464l232J577r18j9357
11131H05j4149q619m897J2574O913Q499o395R490j735j186J1289l03k146K415
11117A2555o962J0670n569p224j4062Q355P741j8310j652o818P484J0282J1234
11104G724O493m65J1094n098j1257N502j053r573j2061j2116o408J6811J9578
11091I171P380M692Q802k320K691K792J2511j0213j7243m815j908r788J2145L735
11077A7632m456j0244o054n307N391J3702J3098J871j3240M595p8q246p751N95
11063A508K2670L122r535j1548k15j1641M619N394L667K2063O574j760q987r427
11049A6504L351P891j3280l629J661J1239K484k059p887L064Q241q516j8145k0111
$$ plain form
11145 44359 47010 49675 45460 29957 30547 34583 23684 20683 25199 22735 19503 21080 20162 805
11131 805 -13344 -21963 -26860 -14286 -7373 1126 -5269 4221 2486 1300 12589 12286 10140 12555
11117 12555 5593 16263 10694 3470 -10592 -2237 5504 -12806 -14458 -21276 -13792 -3510 7724
11104 7724 14217 13752 24846 19748 8491 13993 12940 3367 -8694 -20810 -27218 -10407 9171
11091 9171 16551 21243 30045 27725 30416 33208 45719 35506 18263 13448 11540 1752 13897 17632
11077 17632 13176 2932 -3122 -8429 -3038 10664 23762 25633 12393 16988 16910 8664 913 1508
11063 1508 24178 27300 17765 6217 6002 -5639 -1020 4374 8041 30104 36678 34918 25931 16504
11049 16504 19855 27746 14466 10837 12498 23737 26221 24162 16275 19339 27580 19064 919 -19192
11035a9192M284J9053K104k991J0103N851O037j1029r134m597l886o37n480L86
11021i128R407R267q364n371K207P880l86O841j2817l207j1396j69J1651J5782
11007A2197N044j581n31l239k3717q635O483J7573J9855m569j6493k989j735J1549
10993I212J1311j0649o157j4358K669R989N557j1233j0530J4009L007N091j1164
10980c246q001l552J334J3307N387P459n780r442R58K308K503N023J842K066p647
10965D519j066l886Q22N06n793n748k290Q939R271r681o176N706q588Q022R338
10950C895l6j4785l68q670o244k33J0629J0602o09j328p056r50J0370J3201K206
10935A0624n915j998k406j4545n636O832J3964l23k1l323k710O584O694R38j0840
$$ plain form
11035 -19192 -14908 4145 6249 3258 13361 19212 25249 14220 5086 489 -3397 -4034 -9514 -9128
11021 -9128 279 9546 1182 -4189 -1982 5898 5512 12353 -464 -3671 -15067 -15236 -3585 12197
11007 12197 17241 15660 15129 11890 -11827 -20462 -13979 3594 23449 18880 2387 -602 -2337 9212
10993 9212 20523 9874 3717 -10641 -7972 2017 7574 -3659 -14189 -180 2827 7918 -3246
10980 -3246 -11247 -14799 -13465 -158 5229 12688 6908 -2534 -1576 732 3235 8258 10100 12166 4519
10965 4519 3453 -433 389 895 -4898 -10646 -12936 -3997 5274 -4407 -10583 -4877 -13465 -5443 3895
10950 3895 3859 -10926 -11294 -19964 -26208 -26441 -15812 -5210 -5819 -7147 -14203 -15153 -4783 8418 10624
10935 10624 4709 2711 305 -14240 -19876 -13044 920 597 576 -2747 -5457 1127 7821 8759 -2081
10920b081l540J0668K964j4240j6801K785J5753J3607M075j324p127Q402k354
10907A0787n945j0373l554K261Q690m232n97J4965R816o811r920j124n964K77
10893a724Q300L782r333j6482J897J3150N387m882J490k498k860q684K2820J2031
10879B2394k100j2558j2632M654n459p502N57O144l599J754O532r834r293J5373
10865e569m699l480J8649o340N960K928O247N485j5842j3428j256Q817R630k795
10851D307j024r67k421K607p918K901L339p726j0831J032J6830J0877r283j5573
10837a3850m832M10m384N79P496J188n503m910L092J6301o215L884J5272j186
10823G342j2046j4353j1980N177j569N610M062p26P875K012p088N153K544r092
$$ plain form
10920 -2081 -5621 5047 8011 -6229 -23030 -20245 -4492 9115 13190 11866 4739 13141 10787
10907 10787 4842 -5531 -9085 -6824 1866 -2366 -2963 12002 21818 15007 5087 3963 -2001 -1724
10893 -1724 6576 10358 1025 -15457 -13560 -410 4977 95 1585 -913 -3773 -12457 10363 22394
10879 22394 20294 7736 -4896 -242 -5701 -13203 -12646 -6502 -10101 -8347 -1815 -11649 -20942 -5569
10865 -5569 -10268 -13748 4901 -1439 4521 7449 13696 19181 3339 -10089 -11345 -2528 7102 4307
10851 4307 3283 2316 -105 2502 -5416 -2515 824 -6902 -17733 -16701 129 11006 1723 -13850
10837 -13850 -18682 -18272 -22656 -22077 -14581 -13393 -18896 -23806 -20714 -4413 -10628 -6744 8528 7342
10823 7342 -4704 -19057 -31037 -25860 -27429 -21819 -17757 -18483 -10608 -8596 -15684 -10531 -7987 -17079
10809a7079k679O667m804M39n281n70J1969J0038N166M436m439J351m418P063
10795G859J816n164j2684J4950K5656n228j5686j5368K742Q349j263j1898R96
10782d923q136j036K758q17j1097k389J0312J8408O284J1075j4064l1531j2544
10769c7700K180J6640J777K708R389j374n678N93k12K3333J0898o068k611j5161
10755a286k888P634q626p766J848O488O652O478K634l128j0168j5908O485J360
10741a0191l109N689N59K222J910Q046L733J927j0203n878m503l838r337q216
10727c1189N102J6820Q614R90k377l588m110P786P581M345j8469r538N088J456
10713a1489J3747p49j3146K345L756j0007R3O137m688l66m48L617J7907O700o804
$$ plain form
10809 -17079 -19758 -13091 -17895 -17456 -22737 -23307 -11338 -1300 3866 8302 3863 5214 796 7859
10795 7859 9675 4511 -8173 6777 32433 27205 11519 -3849 -1107 7242 5979 -5919 -4923
10782 -4923 -13059 -14095 -11337 -12154 -23251 -25640 -15328 3080 9364 20439 6375 -25156 -37700
10769 -37700 -35520 -18880 -17103 -14395 -5006 -6380 -12058 -11465 -11677 11656 22554 16486 13875 -1286
10755 -1286 -4174 3460 -5166 -12932 -11084 -4596 2056 8534 11168 8040 -2128 -18036 -11551 -10191
10741 -10191 -13300 -7611 -7052 -4830 -2920 5126 8859 10786 583 -5295 -9798 -13636 -22973 -31189
10727 -31189 -26087 -9267 -653 337 -2040 -5628 -9738 -1952 5629 9974 -8495 -18033 -12945 -11489
10713 -11489 2258 1509 -11637 -9292 -5536 -15543 -15450 -9313 -14001 -14367 -14815 -11198 6709 13409 6605
10698F605j861j9730j523J0741k373o029m408L590L474l804M081r398j896J460
10684b1071k309N394J400L426m286q616o144N760L495P16J0279J8497J0391j0825
10670F107l836q376K997K303N551J0386L107l360r516n912m268P082J1199m260
10656I204q571n248j1546j383J1271J849J2805j774p443p424k254J2549R395p290
10642D140p461j1013N276J255M749M941L944n573q351L027P244l127r280n36Q941
10627a824J0258m7J1894p353j1186n986J3190q32k893j2787J907N680p415n091
10613a2485L352Q039o393r473j1313m100R478O160o29J2991K344p305J941K971
10599d422m684n872O497m395K193j544j741N084l238J883R74L634j4305Q82K58
$$ plain form
10698 6605 4744 -14986 -16509 -5768 -8141 -14170 -18578 -14988 -11514 -15318 -11237 -20635 -22531 -21071
10684 -21071 -23380 -17986 -16586 -13160 -17446 -26062 -32206 -26446 -22951 -22235 -11956 6541 16932 6107
10670 6107 2271 -6105 -3108 -805 4746 15132 18239 14879 5363 -549 -4817 2265 13464 9204
10656 9204 633 -4615 -16161 -17544 -6273 -4424 8381 6607 -836 -8260 -10514 2035 11430 4140
10642 4140 -3321 -14334 -9058 -7803 -3054 1887 5831 258 -8093 -5066 2178 -949 -10229 -10765 -1824
10627 -1824 8434 8387 20281 12928 1742 -4244 8946 8114 5221 -7566 -5659 21 -7394 -12485
10613 -12485 -9133 -1094 -7487 -16960 -28273 -32373 -22895 -16735 -17364 -4373 -2029 -9334 -7393 -4422
10599 -4422 -9106 -14978 -8481 -12876 -10683 -12227 -13968 -8884 -12122 -10239 -9265 -5631 -19936 -19054 -18796
10584a8796J1553L145o555q936k31p2Q059q673j40Q061K560j3420j828J2517J1165
10569a591m763q053o15J4482P533p566O667M908l865J677p510l696q134J9608
10555I082L925n939m386o413O094p339L083N641J825p674J2604J511j1786j7335
10541a7107K711J0164k98M589L974N541j725K016k870M072o503k2786N180J1449
10527a593o048k7892o127K4811R821P304R240P270n799j5885K241P554N104r765
10513B36l389j2711o749J2249k971o504O366L566M461j651n339p46Q93m070j776
10498a8135P326P255q13O633L61p754L005r821l99J2302M665j081l350n989r565
10483a5360M878K5708P190j8655j8534n65J3472J7241J3187q543k0490j87K1287
$$ plain form
10584 -18796 -7243 -4098 -10653 -19589 -19820 -19892 -11833 -20506 -20646 -12585 -10025 -23445 -25273 -12756 -1591
10569 -1591 -6354 -14407 -15022 -540 6993 -573 6094 11002 7137 8814 1304 -2392 -10526 9082
10555 9082 13007 7068 2682 -3731 2363 -4976 -1893 3748 5573 -2101 10503 12014 228 -17107
10541 -17107 -14396 -4232 -4530 59 4033 9574 7849 9865 6995 11067 4564 -18222 -13042 -1593
10527 -1593 -7641 -35533 -41660 -16849 -7028 276 9516 16786 10987 -4898 -2657 4897 10001 236
10513 236 -3153 -15864 -22613 -10364 -13335 -19839 -13473 -9907 -5446 -7097 -12436 -13182 -12289 -16359 -18135
10498 -18135 -10809 -3554 -4367 2266 2627 -5127 -2122 -11943 -12342 -40 4625 3544 194 -5795 -15360
10483 -15360 -10482 15226 22416 3761 -14773 -15338 -1866 15375 28562 20019 -471 -658 20629
10470B0629j1017m912j1934j4116J463K2779R48K804o568j3587p448K663j895
10457b0191M644P615p142N414o154p982M884Q576K022k700J69n93J2548K209p395
10442d076R556J418J09l68m384k919j136k387l914q163k299M540J1974J3672m552
10427G071j4817n426P059n103P987R702L201o035p630K424N484J697J180K397
10413I191k0213j3099J037J2379M302P345M880j3020j1240J0078O836J347j0805
10400a0982p924Q947O71O73l74L778m132N683r805n08L287N49j038j7718q96J3133
10384a6656K0359o75m376j4372M472R871j976N167R047L411n414R557J078M612
10370B4105n641j7450l003o206N741J0147K141Q881j037m762Q24M048l432j5621
$$ plain form
10470 20629 9612 4700 -7234 -21350 -19887 2892 3840 6644 76 -13511 -20959 -18296 -20191
10457 -20191 -15547 -7932 -15074 -9660 -15814 -23796 -18912 -10336 -8314 -11014 -10845 -11438 1110 3319 -4076
10442 -4076 5480 6898 7007 6639 2255 -664 -1800 -4187 -8101 -16264 -18563 -14023 -2049 11623 7071
10427 7071 -7746 -13172 -6113 -11216 -3229 6473 9674 3639 -3991 -1567 3917 5614 6794 9191
10413 9191 -11022 -24121 -23084 -10705 -6403 942 5822 -7198 -18438 -8360 -1524 -177 -10982
10400 -10982 -18906 -9959 -9288 -8615 -8989 -5211 -9343 -3660 -13465 -13973 -10686 -10137 -11175 -28893 -29789 -16656
10384 -16656 3703 3028 -1348 -15720 -11248 -1377 -3353 1814 10861 14272 8858 18415 19493 24105
10370 24105 18464 1014 -1989 -8195 -2454 7693 9834 18715 17678 12916 13740 17788 14356 -1265
10356a265J665O754K404N861q932j4497n947N821L527l278L360l606n177n163
10342a8473o185m10L554J0871J0673k568P891J1710n323m596M603j1509M975M717
10328I930k0453L487J5745m34m796J420m69J026O227j379k014P43J0264J0031
10314B9328p587r864k232J5512J1043m5J3381K7256j132J085j1346j1469k670
10301E1260q814O244L499j426o162l0537p254j717j2271k606j3758J825J5162
10288f555M495M054m175j265O872N824J04R42Q11k808K340J852n277q822J1884
10273A0276K612l125K71k435Q81M833j787q508m274k925J3j993L989J1266k218
10258F876j6561P736k413j0505j0389J1494J4106O629k414J93L22j0938o836N268
$$ plain form
10356 -1265 400 7154 9558 15419 6487 -8010 -13957 -8136 -4609 -7887 -4527 -8133 -13310 -18473
10342 -18473 -24658 -25068 -21514 -10643 30 -2538 5353 17063 11740 7144 11747 238 5213 9930
10328 9930 -10523 -7036 8709 8275 3479 4899 4430 5456 11683 10304 8290 9033 19297 29328
10314 29328 21741 11877 9645 25157 36200 36155 49536 76792 75660 76745 65399 53930 51260
10301 51260 42446 48690 52189 50763 44601 14064 6810 5093 -7178 -9784 -23542 -21717 -6555
10288 -6555 -2060 1994 -2181 -3446 3426 9250 9354 10296 11107 8299 10639 12491 7214 -1608 10276
10273 10276 12888 9763 10034 7599 8480 13313 11526 3018 -1256 -4181 -4168 -6161 -2172 9094 6876
10258 6876 -9685 -1949 -4362 -14867 -25256 -13762 344 6973 4559 4752 5074 -5864 -12700 -7432
10244g432L658M701J3119J168p794j30R95J3866m453m432J103p926p555j9244
10230b0356k727P328J811P053J0872O586J639J7103L553r869J5275k241k284j9132
10216A4611p770J361n690k875P020L805K921P732r785L634O03q006n282L695r471
10201c497R709O830m990R387L126o159m47R154J1832N884N183K170j6218p55o678
10186B4531j106L727O22j2343q167k678N09r775M092j480K199l247J926M172N114
10171H096p612m239k103n666j205K020O267L891R383R046M743j4649k898M44P446
10156A2964K435o382j3935l837j795J0930N01J656O326l334o289N371j936j1965
10142i290j1765J0149Q627j4476M437Q255J0905O620j532N668l014j817R318J2183
$$ plain form
10244 -7432 -3774 927 14046 15214 7420 7290 8285 22151 17698 13266 14369 6443 -1112 -20356
10230 -20356 -23083 -15755 -13944 -6891 3981 10567 12206 29309 32862 22993 38268 36027 33743 14611
10216 14611 6841 8202 2512 -363 6657 10462 13383 21115 11330 14964 15567 7561 2279 5974 -3497
10201 -3497 6212 13042 8052 17439 20565 14406 13959 23113 34945 40829 46012 48182 31964 31209 24531
10186 24531 23425 27152 27774 15431 7264 4586 5095 -4680 -588 -2068 131 -3116 -1190 2982 8096
10171 8096 484 -3755 -5858 -11524 -12729 -10709 -4442 -551 8832 17878 22621 7972 5074 5518 12964
10156 12964 15399 9017 -4918 -8755 -10550 380 881 2537 8863 5529 -760 4611 2675 -9290
10142 -9290 -21055 -10906 -2279 -16755 -12318 -4063 6842 13462 11930 17598 14584 12767 22085 34268
10128C4268L848K021L995J979j1848j1999q079q866p772O661J0332J0058j2492
10115A2106j2811n470N513o781M201K159o26K18J0015P934J388j7895j3661O283
10101g427J2758J6541J5375k616q020p750m979M805N848o7l154j1192M51j5639
10087e066j253J9826J4024q682j561L526j0017o824l321p846Q439L212m804M404
10073D057l693n657J9318J633k1831j9441j4801N940Q220J933J1130k623o182
10060b1997J9337J0662L403j3958j2953j213J6168r37p048j1460J8485J9424P946
10047B5859l029m24m715j8351j1939R835J734j0690L534P210l047M468L034M603
10033H082j8620L363L004j298m128O08j1978m543J2110J0039k557m958P104q204
$$ plain form
10128 34268 38116 40137 44132 46111 34263 22264 14185 5319 -2453 4208 14540 24598 12106
10115 12106 -705 -6175 -662 -7443 -3242 -1083 -1709 -1491 8524 16458 17846 -49 -13710 -7427
10101 -7427 5331 21872 37247 34631 26611 18861 13882 18687 24535 24468 21314 10122 10573 -5066
10087 -5066 -6319 13507 27531 18849 17288 20814 10797 3973 652 -7194 1245 4457 -347 4057
10073 4057 364 -5293 14025 15658 -6173 -25614 -40415 -34475 -26255 -24322 -13192 -15815 -21997
10060 -21997 -2660 8002 11405 -2553 -15506 -16719 -551 -1488 -8536 -19996 -1511 17913 25859
10047 25859 22830 22406 17691 -660 -12599 -2764 -1030 -11720 -8186 -976 -4023 445 3479 8082
10033 8082 -10538 -7175 -4171 -5469 -9597 -8989 -20967 -25510 -13400 -3361 -5918 -10876 -3772 -11976
10019a1976n25P443N285J3843J1780K543L816M473M183M898K317k180j9119p486
10005A9295k838Q93q847k6973R687R879l965k5438o953Q657J6465n801J3987l929
9991e881l316N562K79k343J2395O229k430n252N005j425Q43l265l275k052m178
9976c104N342M958n916k115K155Q962K574j7307k719k408Q81N974N303K1165P790
9961C1535j2502l624J0857m601r026M4k844J6330l081j4127n108L549J0025p285
9947A0142j7270J1075P552m58p754j0187L0744K2598R117M100N038Q849r891l859
9933E9796M664Q978q034Q175J2594K3392M8442N1153N7188Q3875P7410O7137L3743
9920E28513o6871j12516r0070p0179m3430l2538k6762k3176j4855l440p037J63
$$ plain form
10019 -11976 -12501 -5058 227 14070 25850 28393 32209 36682 40865 45763 48080 45900 26781 19295
10005 19295 16457 17350 8503 -18470 -8783 1096 -2869 -28307 -35260 -26603 -10138 -15939 -1952 -5881
9991 -5881 -9197 -3635 -3356 -5699 6696 12925 10495 5243 10248 8823 9666 6401 3126 1074 -3104
9976 -3104 2238 7196 1280 -835 1320 10282 12856 -4451 -7170 -9578 -8697 -2723 2580 23745 31535
9961 31535 19033 15409 26266 21665 12639 12683 9839 26169 23088 8961 3853 7402 17427 10142
9947 10142 -7128 3947 11499 11041 3287 -6900 23844 46442 55559 59659 64697 73546 63655 59796
9933 59796 64460 73438 65404 73579 86173 109565 158007 209160 266348 350223 427633 494770 528513
9920 528513 461642 349126 259056 188877 145447 112909 86147 62971 48116 44676 37639 37802
9908C7802Q913J1891J274r538j0597m215K891L525O415k899J579j0099M930m52
9894D1420j5340j757L227R473J037L078j1140j4786M334R273P076l582L705k679
9880C3339j6769o675J6694J4815J4464q102N212J1020J8509Q185K682R526K0574
9867A23474n199q620m025j5103j4300j4260j2938j791j427J917J160O177p270
9854D7795j4538L726J4647R418J043J1021J0520j10k299L583N070Q959m60J2653
9840A11028J195l390K126J2069k33j046J2353J4582J6046M629K6468L6509K0140
9827B52476K1645L3731O1378Q5750J09192J71409K69148L45194L63971K87381
9817B001275O0862k26149l88187l70867k95088k12676j39582r6417o1987m3601
$$ plain form
9908 37802 46715 58606 59880 50342 39745 35530 38421 41946 48361 45462 47041 36942 41872 41420
9894 41420 26080 24323 27550 37023 38060 41138 29998 15212 19546 28819 35895 32313 36018 33339
9880 33339 16570 9895 26589 41404 55868 47766 52978 63998 82507 90692 93374 102900 123474
9867 123474 118275 109655 105630 90527 76227 61967 49029 47238 45811 47728 48888 55065 47795
9854 47795 33257 36983 51630 61048 62091 73112 83632 83522 81223 84806 89876 98835 98375 111028
9840 111028 112223 108833 110959 123028 122795 121749 134102 148684 164730 169359 195827 232336 252476
9827 252476 274121 307852 369230 454980 564172 735581 1004729 1349923 1713894 2001275
9817 2001275 2062137 1835988 1447801 1076934 781846 569170 429588 333171 271184 227583
9807B27583l0549k0100k3779j5705J54j132o834j4692j7694n133j4629o497r037
9794F1956O228N376p344o950j700R028p953j9980J872J1954N210k791j999l589
9780D9318n766j3573p364J2623J8336R191p553j3125k484R65L657N733K348R199
9766F1505p966L605O33o93j5283k3m207M25o915j996K495R79j413m11o760r302
9750A4673r173J1431J8792P317P139o09j2132j4279j1065j213L116P726r44M540
9736B5319J1326K103q874L383n593j3621j1728o063n6j58J0329L281Q257L940
9722B1845m590O685n78M289n24j075q624N906q843J848P105l878l032r386J437
9707H585J0107N28n184j756P763M027j4797j1241L671J2693J845J357K718k174
$$ plain form
9807 227583 197034 176934 153155 137450 137604 136472 129638 114946 97252 92119 77490 70993 61956
9794 61956 68184 73560 66216 59266 57566 66594 58641 38661 40533 52487 57697 54906 52907 49318
9780 49318 43552 29979 22615 35238 53574 62765 55212 42087 39603 40568 44225 49958 52306 61505
9766 61505 53539 57144 57777 57084 41801 41778 37571 37996 31081 29085 31580 32559 31146 30735 23975 14673
9750 14673 5500 16931 35723 43040 50179 49570 37438 23159 12094 10881 13997 21723 20779 25319
9736 25319 36645 38748 29874 33257 27664 14043 2315 -3748 -3804 -3962 6367 9648 17905 21845
9722 21845 17255 23940 23362 27651 27127 26052 17428 23334 14491 16339 23444 19566 16534 7148 8585
9707 8585 18692 19220 14036 12280 20043 24070 9273 -1968 1703 14396 16241 17598 20316 18142
9693A8142q895L177J435K881K018K136j209L572j4264p693J0463j459M965J0062
9679B5331N532J4849l804j834j1858j2374k09k88o61Q119p748p387o590N958J2010
9664A9046J349l526O969Q041L827j4384j2891M084P604p704k627p966N274J7253
9650B4349j505l523n71Q670J3261L172j2974k484k996r144J095K582p241J6525
9636B9216P427r339J1865O526k099k85j0076q207K421j352j2504n176J3510l147
9622A8780l902N583M714l086n472P600l564l042J068R079J6918J0578m665j4324
9608C6265j0138J4689L73k3023k885R690K167m463p462k201J2727J606Q93m224
9594B4014q329N589J2366O472j0385o601K41J2452R831o267l812n264q901O779
$$ plain form
9693 18142 9247 12424 13859 16740 18758 20894 19685 23257 8993 1300 11763 10304 15269 25331
9679 25331 30863 45712 41908 40074 28216 15842 15633 15345 14684 22803 15055 7668 1078 7036 19046
9664 19046 20395 16869 23838 31879 35706 21322 8431 12515 20119 12415 9788 1822 7096 24349
9650 24349 22844 19321 18750 27420 40681 43853 30879 28395 25399 16255 17350 19932 12691 29216
9636 29216 36643 27304 39169 45695 43596 43311 33235 25028 27449 26097 13593 8417 21927 18780
9622 18780 14878 20461 25175 22089 16617 24217 20653 17611 18679 27758 44676 55254 50589 36265
9608 36265 26127 40816 41189 18166 15281 24971 27138 22675 15213 13012 25739 27345 28238 24014
9594 24014 15685 21274 33640 40112 29727 23126 23367 35819 45650 39383 35571 30307 21406 28185
9580B8185j673p427k758n865K789J520J9603O373j7797L710N247P126n008J528
9566C5553q020o605R23k374J7320P737j0102m806M844o086n529k528K66n425M897
9551B0065N041P24R520o859Q83Q415J301j263m360j2379n751Q287O673p756K648
9536B5189L975P706P2j46r200k418l991J28J0557J4054J8123J2525r653r440L107
9521F0588M314m64j009o072m789K511q53p241p53N782j5224k678K439q82o316
9506B9353l695K337n386j0762L228N520P279K2308M667J1137m95n794j2086j6502
9492C1109K251P547O292N845Q626J0109K715m853n126J1036j946n474J8634R407
9478I6172Q161j1687j4289j3470j488k904N851N748J451j372j5061r016L84o136
$$ plain form
9580 28185 26512 19085 16327 10462 13251 14771 34374 40747 22950 26660 31907 39033 34025 35553
9566 35553 27533 20928 21851 19477 36797 44534 34432 29626 34470 28384 22855 20327 20593 15168 20065
9551 20065 25106 25830 35350 28491 29374 37789 39090 37827 33467 21088 15337 23624 30297 22541 25189
9536 25189 29164 36870 36942 36796 27596 25178 21187 21315 31872 45926 64049 76574 66921 57481 60588
9521 60588 64902 64438 63429 57357 52568 55079 54226 46985 46232 52014 36790 34112 36551 35669 29353
9506 29353 25658 27995 22609 11847 15075 20595 27874 50182 54849 65986 65491 59697 47611 31109
9492 31109 33360 40907 47199 53044 61670 71779 74494 69641 64515 75551 73605 68131 86765 96172
9478 96172 104333 92646 78357 64887 63399 60495 66346 72094 73545 72173 57112 48096 48480 42344
9464D2344L092R279r460J3245J0280K340L721P297P064J0576j076j2277j7773
9451F8652J0589J0324M436j768j976j08l799l262Q436k57k652L466L722R575J0024
9436A15402J4l954k688R603J2943m665q489M027O408Q851K875o523m785l871j4959
9421A10189k731J1640K013J2065J8670n302j0031Q661J0393J5473Q262J9131R826
9408B08259j276J3839N55j1498k916O005p90J1467J5837K3625M568O355R552K5594
9394C09176J2431J8931J6378J4614K9132M5353M9763P3126R4118J08611R5028
9383H66661N0425k0831p7387o8160n5480l7519j6879q827R626J6942K9161J8205
9371G05937K4334K1840M3274L4606K3151N1572O0855M7248N1233N5464O7745O4076
$$ plain form
9464 42344 45436 54715 45255 58500 68780 71120 74841 82138 89202 99778 98702 86425 68652
9451 68652 79241 89565 94001 92233 90257 90149 86350 83088 91524 91267 88615 92081 95803 105378 115402
9436 115402 115416 111462 108774 118377 131320 126655 118166 122193 128601 137452 140327 133804 129019 125148 110189
9421 110189 107458 119098 121111 133176 151846 146544 136513 145174 155567 171040 179302 198433 208259
9408 208259 206983 220822 221377 209879 206963 212968 212178 223645 239482 263107 267675 274030 283582 309176
9394 309176 321607 340538 356916 371530 400662 446015 495778 568904 663022 771633 866661
9383 866661 917086 896255 818868 750708 695228 657709 640830 632003 641629 658571 687732 705937
9371 705937 730271 752111 795385 829991 853142 904714 965569 1012817 1064050 1119514 1187259 1251335
9359A251335P2263O5866N6218N8148N7775M8345L3858K9317J2102L303j793k3433
9347A663304o586j3938k3560n404J3870M2208Q2366J22738J06066M0312q3232
9336A938144k20006k32137k16524j73178j32228r7889o8270n2962o3452n6145
9326F25353m1234k7747j5172m2108k1113k974j7053k6643j1154j9833r544m601
9314C86177j0219j3848N171p972j9314j7643j2761K99j288j0598k471Q122J0466
9301C14121Q827P640J9809N3408M8374N0100Q5605P3376N3079q786p9620r1204
9289E34729q8777n7583m3024l0129j2632q007m042k2502j5855l103n751j0090
9277B33234k0773j1951Q700o385R98J839q26j2662j470n648j829L442J8540R167
$$ plain form
9359 1251335 1323598 1389464 1445682 1503830 1561605 1609950 1643808 1673125 1685227 1688530 1686737 1663304
9347 1663304 1656718 1642780 1619220 1613816 1627686 1669894 1752260 1874998 1981064 2021376 1938144
9336 1938144 1718138 1486001 1269477 1096299 964071 866182 797912 744950 681498 625353
9326 625353 584119 556372 541200 499092 477979 475005 457952 431309 420155 400322 390778 386177
9314 386177 375958 362110 367281 359309 339995 322352 309591 309890 308602 298004 295533 303655 314121
9301 314121 322948 330588 350397 403805 452179 502279 587884 661260 714339 705553 625933 534729
9289 534729 445952 388369 345345 315216 302584 294577 290535 268033 252178 249075 243324 233234
9277 233234 212461 200510 209210 202825 203823 205662 204836 192174 190704 185056 183227 186669 205209 214376
9263B14376l158j1944r759m8N566M997O927l099n519k690M522J340k680m653J2698
9248B06876K0133J1579J3850o703j4007o996j8397j221K809J4039N454o60P190
9235B33946l607M905P162n556j3908q567j5562j1108K418q509p75k185J6145O571
9221B01370L959J098j0694L554J0925M772j3224j1957n681n439R976N483J3129
9208B07271J541P03p508m090J9201N073Q035J2914n818j98J353j0292Q728J3169
9194B50082J8832K3292J2119l484J313k3118j3283q739k634l215O43m595N994
9181B53207L002N063r057m677L927k279N005M036q659j498q574K093J1785j211
9167B52163l120n335o098K3o371n34m800j0132Q507J9953l61j43Q845L520O860
$$ plain form
9263 214376 211218 199274 189515 189467 195033 200030 206957 203858 198339 195649 200171 201511 198831 194178 206876
9248 206876 227009 238588 252438 245735 231728 224732 206335 205114 207923 221962 227416 226756 233946
9235 233946 230339 235244 242406 236850 222942 214375 198813 187705 190123 181614 180839 178654 194799 201370
9221 201370 205329 206427 195733 199287 210212 214984 201760 189803 184122 178683 188659 194142 207271
9208 207271 208812 209515 202007 197917 217118 222191 230226 243140 237322 237124 238477 228185 236913 250082
9194 250082 268914 292206 304325 300841 302154 279036 265753 257014 254380 251165 251808 247213 253207
9181 253207 256209 261272 252215 247538 251465 249186 254191 258227 249568 248070 239496 241589 253374 252163
9167 252163 249043 243708 237610 237633 231262 230728 225928 215796 224303 244256 243895 243752 252597 256117 262977
9152B62977R810L0269K2009K2204K1330k349J36j120m24l472J6582n082j0016
9139C62854l272j4176j0569o322q751m853N26J7621R862N074J1307Q347k234p8
9125C65336m620o428r005o352J343N744q507k5997M866J1503N610M35k110n539
9111C26279M803K1131K9655L4656K2540J1801Q795J1809J7413K1823K7739k725
9099E35719M211K234J227J1666O440r96k12j1250r186j990J358J064J3261O303
9085E59849J4476O906Q263J3993J2738J4368K8424K4494L6575N1310O5147O4787
9073I01330P6657P9824N2225N692m1266p2339o6260m4175o989K3061L7272L7238
9061I82270L6109R357j1756J9752J5756K4917J5008J8145K7186J3240J8844J2160
$$ plain form
9152 262977 272787 303056 325065 347269 368599 366250 366386 365266 364842 361370 377952 372870 362854
9139 362854 359582 345406 334837 328515 319764 314911 315437 333058 342920 347994 359301 367648 365414 365336
9125 365336 360716 354288 345283 338931 340274 346018 337511 311514 316380 327883 333493 333928 331818 326279
9111 326279 331082 352213 381868 416524 439064 450865 459660 471469 488882 510705 538444 535719
9099 535719 539930 542164 543391 555057 561497 560501 560289 549039 539853 537863 539221 540285 553546 559849
9085 559849 574325 581231 589494 603487 616225 630593 659017 683511 720086 771396 836543 901330
9073 901330 977987 1057811 1110036 1115728 1074462 1002123 935863 891688 884699 907760 945032 982270
9061 982270 1018379 1027736 1015980 1035732 1051488 1076405 1091413 1109558 1136744 1149984 1168828 1180988
9049A180988K7929J3536L1852M3968M2679L9283O2190N6791M9498M7929K7861
9038A624504K3652K1224J9398M1157N4113N4212R9698J23581J54719J86821K26814
9027B629893J94360J40189L6626o5190m7732j9428q423L0325O9019Q6299R3539
9016C139477R1078R7765J11690J28961J47365J75493J92838K00503K35044K57238
9006D777452K58748K83456L28488M12886M88348N57292O55978P97595R71403J142951
8996A0674597J257809J331597J496736J843081K383643L235440M486008O343236
8988C3052147R138709J2994270J6858307J7585128J3021678K256064j1495873
8981I3410430j8533784j7452783j3282880r413099o626474m721533l415736k532769
$$ plain form
9049 1180988 1208917 1222453 1254305 1298273 1340952 1380235 1442425 1499216 1548714 1596643 1624504
9038 1624504 1648156 1669380 1688778 1729935 1784048 1838260 1937958 2061539 2216258 2403079 2629893
9027 2629893 2824253 2964442 3001068 2935878 2888146 2868718 2860295 2890620 2959639 3045938 3139477
9016 3139477 3230555 3328320 3440010 3568971 3716336 3891829 4084667 4285170 4520214 4777452
9006 4777452 5036200 5319656 5648144 6061030 6549378 7106670 7762648 8560243 9531646 10674597
8996 10674597 11932406 13264003 14760739 16603820 18987463 22222903 26708911 33052147
8988 33052147 42190856 55185126 72043433 89628561 102650239 104906303 93410430
8981 93410430 74876646 57423863 44140983 34727884 28101410 23379877 19964141 17431372
8973A7431372j875430j379515j008253p22471n19290l97137l41754k90328k13492
8964A0683702q6249K8443J22295J99933K94094L97809N28260O76529Q41339J047085
8954A4733240J321676J627717J913350K137981K343040K684023L315937M347600
8946C4424564N919127Q234468J1705568J6956740K4692346L3411995L6187276
8939A71532084K8438336P836762k2063571l8245315l6336496k7488233j9391980
8932F4281587j3638327r739644p104293n264155l960701k976545k231113j690970
8924A7675839j325121j120108j063503j035879r03690p36877n81769m56220l31641
8915A0121031k14938j23981j3197P4767J68637K73601M22636N77121P39578Q72714
$$ plain form
8973 17431372 15555942 14176427 13168174 12445703 11926413 11529276 11187522 10897194 10683702
8964 10683702 10597453 10625896 10748191 10948124 11242218 11640027 12168287 12844816 13686155 14733240
8954 14733240 16054916 17682633 19595983 21733964 24077004 26761027 30076964 34424564
8946 34424564 40343691 48578159 60283727 77240467 101932813 135344808 171532084
8939 171532084 199970420 207807182 185743611 147498296 111161800 83673567 64281587
8932 64281587 50643260 40903616 33799323 28535168 24574467 21597922 19366809 17675839
8924 17675839 16350718 15230610 14167107 13131228 12227538 11490661 10908892 10452672 10121031
8915 10121031 9906093 9782112 9768915 9843682 10012319 10285920 10708556 11285677 12025255 12897969
8905A2897969J020231J200894J501402J994838K748607L844696N419892P777168
8897C8405697J1155582J5059283J6938900J4009734N456890p974019j7335303
8890G5716764j7954532j4161013j0137355p162695n127095l748002k793849k101711
8882A2530512j603618j226136r29080p41440o41371o03131n98591n60310m89393
8873E137442m07483l58306l14767k64645k35641k11160j82321j56187j43584j48971
8863B714377j40938j24723j21466r7594p1726o8408o3677p3779o2064n9853o1545
8852A768604m9453n4504o5045m1541k9722k5281j7361k1145k8175k6736l4496
8841A375145l1811k2765m8135k7703p305j5022k5859j8380j6863k5458k5691k6122
$$ plain form
8905 12897969 13918200 15119094 16620496 18615334 21363941 25208637 30628529 38405697
8897 38405697 49561279 64620562 81559462 95569196 101026086 93052067 75716764
8890 75716764 57762232 43601219 33463864 26301169 21174074 17426072 14632223 12530512
8882 12530512 10926894 9700758 8771678 8030238 7388867 6785736 6187145 5626835 5137442
8873 5137442 4729959 4371653 4056886 3792241 3556600 3345440 3163119 3006932 2863348 2714377
8863 2714377 2573439 2448716 2327250 2229656 2157930 2089522 2025845 1952066 1890002 1830149 1768604
8852 1768604 1719151 1664647 1599602 1558061 1528339 1503058 1485697 1464552 1436377 1409641 1375145
8841 1375145 1343334 1320569 1272434 1244731 1237426 1222404 1196545 1178165 1161302 1135844 1110153 1084031
8829A084031k9189l8879j4942j9778k0831j5335j9799j3629M54L456k3562k2720
8817H69277k0993k7028M973K8403L6334K6841K041k3804n0448k7098j5276j0298
8805G92924m559j3476j4076q175O772r152j6426K595j6639k7205k2294k9297j6371
8792F24621j5364r649N911m43j1520k5799r821n856j4122k1655n973L675N332
8779E19337q494q747Q056r770m988o766m693q942j3965J2383L0638L9455K6379
8766E69883J9359q621j8195j7857k0879j7664j6782k4276k6184j4998m459j4687
8754D04640p018j0308p006j3648l075j1716r496P385R535J2058o49q15n044r089
8740C55754k1659j2723k2953J214J1015K653j2657L26K438j1845j6592j4754r23
$$ plain form
8829 1084031 1054842 1015963 1001021 981243 960412 945077 925278 911649 912103 915559 891997 869277
8817 869277 848284 821256 826229 854632 890966 917807 919848 896044 845596 818498 803222 792924
8805 792924 788365 774889 760813 752638 759410 750258 733832 736427 719788 692583 670289 640992 624621
8792 624621 609257 599608 605519 605076 593556 567757 557936 552080 537958 516303 510330 514005 519337
8779 519337 510843 502096 510152 500382 495394 488628 483935 474993 461028 473411 504049 543504 569883
8766 569883 589242 580621 562426 544569 523690 506026 489244 464968 438784 423786 419327 404640
8754 404640 397622 387314 380308 366660 363585 351869 342373 349758 359293 371351 370702 369887 364843 355754
8740 355754 334095 321372 298419 299633 310648 313301 300644 300970 303408 291563 274971 260217 259294
8727B59294J5944J7962J4378K616o141r303q855J0391J5088j0890r913r102O898
8714B88367j2888j2056r887J810K745j868k75r619N04l439p648m632Q072J4802
8700B53988l900l771J613o3l232L307N927k065j841k186M738j2396j7143q30Q348
8685B30494j0419k686q906K101p956l822L027R138k389r84Q106j396J2354Q328
8671B34990m264j478o60l734R701J2734m472K812M285j2618j6906j4918K187J0416
8657B18075M126M704N55L199J431q106L594P478q604K2l175n750K1932J5993q86
8642B54588j429q108j1607k4709l845n95p577R519R266J3603J4507n51J119J4510
8628B58691j088Q799M480J8489J9888K4360K7269M6380P1240R2784R8259O5164
$$ plain form
8727 259294 275238 293200 307578 310194 304053 294750 285895 296286 311374 300484 290571 281469 288367
8714 288367 275479 263423 253536 255346 258091 256223 255948 246329 246833 243394 235746 231114 239186 253988
8700 253988 250088 246317 247930 247867 244635 247942 253869 251804 249963 247777 252515 240119 222976 222146 230494
8685 230494 220075 217389 208483 210584 202628 198806 201833 210971 208582 207598 215704 214308 226662 234990
8671 234990 230726 229248 228588 224854 234555 247289 242817 245629 249914 237296 220390 205472 207659 218075
8657 218075 222201 226905 227460 230659 232090 223984 227578 235056 226452 226474 223299 217549 239481 255474 254588
8642 254588 253159 245051 233444 208735 204890 204295 196718 206237 215503 229106 243613 243062 244181 258691
8628 258691 257603 266402 270882 289371 309259 333619 360888 407268 478508 571292 669551 734715
8616G34715k0413r1526j05452p7568m5955k5353k6821k3749j4557j1409j8702
8605B73210j5358j0976m336J0659L000K698p58k386R547N702o164K845K879J1894
8591B82456K7794J9738L458L2490L5814K9131N0333O7376O6957P6803J02264J13788
8579I08402J15783Q7261J8607Q785N1916J13245J35405R4227l3332k09220k42282
8568A048797j89723j49382j08648p0258o1407n2982l2150l4087l3426k1046j7532
8557B78156j5745j883m103j4520j1903K447K352M425J3774R195r01P300J7869
8544B86463K089J3649L0732L6397O0535Q0178P9270J19945J76347K00986J58074
8533A244665O7039o4264j35728j29035p0259j1259j8703m5520j01308j20704j13758
$$ plain form
8616 734715 714302 622776 517324 439756 393801 368448 341627 317878 303321 291912 273210
8605 273210 257852 246876 242540 253199 256199 258897 258139 255753 265300 271002 264838 267683 270562 282456
8591 282456 310250 329988 333446 365936 401750 430881 481214 548590 615547 692350 794614 908402
8579 908402 1024185 1111446 1130053 1138838 1190754 1303999 1439404 1533631 1500299 1291079 1048797
8568 1048797 859074 709692 601044 530786 469379 416397 384247 350160 316734 295688 278156
8557 278156 262411 260528 256425 241905 230002 232449 234801 239226 253000 262195 261294 268594 286463
8544 286463 288552 302201 332933 369330 429865 510043 589313 709258 885605 1086591 1244665
8533 1244665 1311704 1247440 1111712 982677 912418 901159 882456 836936 735628 614924 501166
8522E01166q5277n0081m7471m0805j7423k0277k6893j9528p991j2387j780o210
8510A65043o319M737N140k978o755k468q839r821P171L1481J5050J0255l371P396
8496B05722K9245J4747K1200L0080M6453O1210J02020P6780K0350l2079p7669
8485D98059r8086p2337m9458l4182l0653k4630j9896j0927j0822q612m22J32k498
8472A35668j4627o359l189r857r926l78Q49o109J1457J958j4628M23L161J933
8458I0376K799J789P804L647n660l633k656J160q385j0740J0766P665o514j1409
8444G7009l427j502p95o578p703N451M684K027J3001J1981k783j6248n345K646
8430G2418J9511K340j9193o911J0106J0835k588J088L418R735k258j9373n921
$$ plain form
8522 501166 415889 365808 318337 277532 260109 239832 212939 193411 185420 173033 171253 165043
8510 165043 158724 163461 168601 165623 158868 156400 147561 137740 144911 176392 191442 201697 198326 205722
8496 205722 234967 249714 270914 300994 347447 408657 510677 587457 607807 575728 498059
8485 498059 399973 327636 278178 243996 213343 188713 168817 157890 147068 138456 138034 138166 135668
8472 135668 121041 114682 111493 101636 91710 91332 92181 86072 97529 99487 84859 85282 88443 90376
8458 90376 93175 94964 102768 106415 100755 97122 94466 95626 87241 76501 87267 94932 88418 77009
8444 77009 73582 72080 71285 64707 57004 62455 67139 69166 82167 94148 91365 75117 69772 72418
8430 72418 91929 94269 75076 68165 78271 89106 86518 87606 91024 100759 98501 79128 73207
8417G3207M647K765J173r181r874N44l75P958l531R047O75Q05M908J65j2940J2286
8401H2279J6944J5987M409j7007j4328p669p166N391O332N28n063J063K831j1170
8387G3361p971Q819N520j1958m924k23J1319K408N334K675j7304j6418L674K1921
8373G6233l089j6133l829j0759r22J7469O428j557p809P748m701j1044J5173R16
8359F4124q75N427j0006j030K4035J5166M785p081j6588j1946j0873Q368M755
8346F8261k13J1524m528j143j2428o031M15K54N931q428j0172j213m177K2754
8332F0806R869j4342o977Q432J0363R582j0147k5937l260n403J3111J5479O752
8319F8328j3637p007K833N166O010p987k778O724J3352R333n425L275p975J176
$$ plain form
8417 73207 77854 80619 81792 72611 62737 63281 62906 70864 67333 76380 77055 77860 82768 82933 69993 82279
8401 82279 99223 115210 119619 102612 88284 80615 73449 78840 85172 85700 80637 81700 84531 73361
8387 73361 65390 74209 79729 67771 62847 62624 73943 76351 81685 84360 67056 50638 54312 76233
8373 76233 73144 57011 53182 42423 41501 58970 65398 63841 56032 63780 59079 48035 63208 64124
8359 64124 63249 68676 58670 57640 81675 96841 101626 94545 77957 66011 55138 63506 68261
8346 68261 68048 79572 75044 73901 61473 55442 55857 56111 62042 53614 43442 42229 38052 60806
8332 60806 70675 56333 49356 57788 68151 77733 67586 41649 38389 32986 46097 61576 68328
8319 68328 54691 47684 50517 55683 61693 53706 50928 57652 71004 80337 74912 78187 70212 71388
8305G1388k0617j0257J884L221n297l88J536Q059o066q859q593k832M954L057
8291C1190o665j39l348l645J527J4463K10j001L3927j423j9687p476J247Q086
8277D7266m534j5790n310r719n535J0051J4309P181Q931J0388J1478j5008k0305
8264C3403m102K120K695N317O465Q191J1293k8m467r074j1738P14K725R984R381
8249F2879j615n416m713M84o03P72n282m419o169j0599L104m562P224J1651n2
8234D2684j0051l792K0294M373R889j5452M408O566j9975j3947J0413L622Q20
8221C9852R520J2867j1664k697o96n51O16m212o942n762J340M94l62j0170l293
8206A8340N324J0643J0500L936J7326j424o511q208j5114j0456O854J5681L997
$$ plain form
8305 71388 50771 40514 42398 45619 40322 39934 41470 49529 43463 34604 26011 23179 28133 31190
8291 31190 24525 24386 21038 17393 18920 33383 33593 32592 66519 65096 45409 37933 39180 47266
8277 47266 42732 26942 21632 11913 6378 16429 30738 37919 46850 57238 68716 53708 33403
8264 33403 29301 31421 34116 39433 45898 54089 65382 65354 60887 51813 40075 40789 43514 53498 62879
8249 62879 61264 55848 51135 51619 51016 51788 46506 42087 35918 25319 28423 23861 31085 42736 42684
8234 42684 32633 28841 49135 53508 63397 47945 52353 58919 38944 24997 35410 39032 39852
8221 39852 49372 62239 50575 47878 47182 46631 47247 43035 36093 30331 31671 32165 31803 21633 18340
8206 18340 23664 34307 44807 48743 66069 64645 58134 49926 34812 24356 31210 46891 50888
8193E0888j9376j0181j281m401q21L28N301R296j1478n899J291o580j491J8038
8179B3634J7969N97P572o115j5253J2785J1435o117r68J1346Q348j4583k9189
8166B1461q68L238J2932j680L0o208J341M672K207J3205n750j3540J0939K784
8152D4763j0898n059N363l382K87P575J433j825J0138j443j2222N225P19j5629
8138B5045J0281l648r71K0407l620L17j1378k4892r799J3136K3960K467n633J928
8124C7600k900l24M357Q668M278j4548K664o720K500O315K196j583n854j197n059
8109C0393m901J1215N627J415R995K156K330p991q650r155k729K241J3777j122
8095D4601j219P32k574M548l900r769P191J1611l325n524r917r453P358J914k923
$$ plain form
8193 50888 31512 21331 20050 15649 14828 15156 20457 29753 18275 12376 13667 7087 5596 23634
8179 23634 41603 42200 49772 43657 28404 41189 52624 46507 45539 56885 65233 50650 21461
8166 21461 20593 23831 36763 35083 35113 28905 30246 34918 37125 50330 44580 31040 41979 44763
8152 44763 33865 28806 34169 30787 31074 38649 40082 38257 48395 46952 34730 39955 40674 25045
8138 25045 35326 31678 30707 51114 47494 47811 36433 11541 1742 14878 38838 41305 35672 37600
8124 37600 34700 34376 38733 47401 51679 37131 39795 33075 35575 41890 44086 42503 36649 35452 30393
8109 30393 25492 36707 42334 43749 53744 55900 58230 50239 41589 32434 29705 31946 45723 44601
8095 44601 43382 44114 41540 46088 42188 32419 39610 51221 47896 42372 32455 23002 30360 32274 29351
8080B9351o40J548j236M199J1066M813m622Q65o191l331o871P921M756O385N646
8065E3659l256q285m486N880j9Q86j295L579J172n614q904P926J0254J0490j5126
8050D6861j5355m276Q623J0962K136k0292p498M298P990J4127L639k149J278K507
8036E2851k08R175L159n262k882m323j818n08m365J635n91M109N045L752j406
8021E8363r318j079N518J2510J8407p486r094p581k55J2828O143J3233m615j5594
8007G1980q994j273J1877j404k618k043n307P41R652N500m342j1716q236j2714
7993D1103J3285K1882J146J2048m794j849p063M232K482N694J3013J6721R633
7980A27533Q849N005J533J146K288j606J77r245m961k0174N423r765k0577k534
$$ plain form
8080 29351 28711 30259 29023 33222 44288 49101 44479 45344 39153 35822 28951 36872 41628 48013 53659
8065 53659 50403 42118 37632 43512 43493 44379 43084 46663 47835 42221 33317 41243 51497 61987 46861
8050 46861 31506 27230 35853 46815 48951 28659 21161 25459 33449 47576 51215 49066 50344 52851
8036 52851 52643 61818 64977 59715 56833 52510 50692 50184 45819 47454 46863 50972 56017 59769 58363
8021 58363 49045 47966 53484 65994 84401 76915 67821 60240 59985 72813 78956 92189 87574 71980
8007 71980 62986 61713 73590 72186 69568 67525 62218 62959 72611 78111 73769 62053 53817 41103
7993 41103 54388 76270 77416 89464 84670 82821 75758 79990 82472 88166 101179 117900 127533
7980 127533 136382 141387 142920 144066 146354 144748 144925 135680 130719 110545 115968 106203 85626 83092
7966H3092j380j970J0282n261j1230j7839m474J24n959P150J1420J2653q311p482
7952F0815k638L489l746K35R374J2449j953o227m089q01J1203K996Q3r859Q026
7937G9357m826M609p73K023m206j605K466p684J8511J4095o186o898n959P68o998
7922G6694m47q789m960q445J0511m412j1514j3554n974m972J971J5197J3987o070
7908D9223q932O677M211l957K475p06J0082q405j4567J668K210m877K52O347N785
7893D7486J4199J0313J4077N001p207r955p325j1041j2243q902L405Q40o934o15
7879C1099j037J488J5701J8587J266M960N787j3696k4805K563P559j105j1479
7866C6888J016J1794n212k360r609m761m854j161m435M028l512R42J815O780o340
$$ plain form
7966 83092 81712 79742 90024 84763 73533 55694 51220 51344 45385 52535 63955 76608 68297 60815
7952 60815 58177 61666 57920 58155 67529 79978 78025 71798 67709 66908 78111 81107 81190 71331 79357
7937 79357 74531 79140 78367 80390 76184 74579 77045 69361 87872 101967 95781 88883 82924 83692 76694
7922 76694 76247 67458 62498 54053 64564 60152 48638 35084 29110 24138 26109 41306 55293 49223
7908 49223 40291 46968 51179 47222 49697 48991 59073 50668 36101 37769 39979 35102 35354 41701 47486
7893 47486 61685 71998 86075 91076 83869 73914 66589 55548 43305 34403 37808 38648 31714 31099
7879 31099 30062 31550 47251 65838 67104 72064 77851 64155 39350 41913 49472 48367 36888
7866 36888 37904 49698 44486 42126 32517 27756 22902 21741 17306 21334 17822 18764 20579 27359 21019
7851B1019m337M885J2946R723o690j915p78j4330N243O751K498o280L27j2328
7837A6734n231J5408L946k151L787j533o455j9433R2J6187K3893l59j1874j3743
7823A9268j6005n798J695P386J6527O66j1702j0785J5395j504q4j794p367O574
7809A2472P133N587o930j1764L657Q322j0982j3934R896K5057O29j2598j1784
7796D761M99l488j7181k041J0175K4021J1558n627K419K411l64P939L864j396
7782C7550j2622n597j1334m03J1242p374Q636l225j7999p70K1693J2075n639l510
7768B2723l898k857l052m214K831P600L973j475q628k003n317q462P388M57J0193
7753A5259L239j0862k3043k820J1933J0011K5282P604N11k407r863j9190k301
$$ plain form
7851 21019 16682 21567 34513 44236 37546 35631 34853 20523 25766 32517 35015 28735 29062 16734
7837 16734 11503 26911 30857 28706 32493 30960 24505 5072 5164 21351 45244 44885 33011 19268
7823 19268 3263 -2535 -840 6546 23073 23739 12037 1252 16647 15143 15059 13265 5898 12472
7809 12472 19605 25192 18262 6498 10155 18477 7495 -6439 3457 28514 29143 16545 4761
7796 4761 5260 1772 -15409 -17450 -7275 16746 28304 22677 25096 27507 27143 35082 38946 37550
7782 37550 24928 19331 7997 7594 18836 11462 20098 16873 -1126 -1896 19797 31872 26233 22723
7768 22723 18825 15968 12916 8702 11533 19133 23106 21631 13003 11000 5683 -2779 4609 5066 15259
7753 15259 18498 7636 -15407 -18227 -6294 3717 28999 36603 37114 34707 24844 5654 3353
7740C353J5104l084j1877N5K121J908J0080p7j3013k027N238L666Q805O09q030
7725A2831n621N620m623L813J1048M972m807M04r976j5591n836O499K0618L248
7711B2599j0596J903M719j5631n825M506L6j767O436K766k46j005K492P10n513
7696E584N449P955j1875q939n581R426J4040n032m896L367J999m369k193O509
7682A1444J1198M923Q226l396p297Q595J1653j6480j1589j2121J1042j2714j1628
7669h144j0142K138J5974J2703N461Q499N556J755L67J426r147n966O534J415
7655B8429q331k0157N08J0692k154l14j099q316R561Q93k805q147m408J1600j153
7640D799L898J3423m667q565K907r546R97N258m364l359o926R56J0072J810q527
$$ plain form
7740 3353 18457 15373 3496 3551 5672 7580 17660 17583 4570 2543 7781 11447 20252 20861 12831
7725 12831 7210 12830 8207 12020 23068 28040 23233 23637 13661 -1930 -7766 -1267 19351 22599
7711 22599 12003 13906 18625 2994 -2831 1675 1711 -56 6380 9146 8900 7895 10387 11097 5584
7696 5584 11033 18988 7113 -1826 -7407 2019 16059 11027 6131 9498 11497 7128 4935 11444
7682 11444 22642 27565 35791 32395 25098 33693 45346 28866 17277 5156 16198 3484 -8144
7669 -8144 -18286 -16148 -174 12529 17990 26489 32045 33800 34167 35593 26446 20480 27014 28429
7655 28429 20098 -59 449 11141 8987 8673 7574 -742 8819 9712 6907 -1240 -5648 5952 4799
7640 4799 8697 22120 17453 8888 11795 2249 3246 8504 4140 781 -6145 -5189 4883 6693 -1834
7625a834N856M07n695j2677Q034J4425J845l302J3627o932M172O958M906j1331
7611A8459m988M268K210J2943O276o240j0880q987m217L73N924n487r41l83J585
7596I915O207J560j487m817R76l353j827r505L064K0719j50p844j5067j1838k877
7581a6324J88J5958P770M487M700q553j6848R765q915k156K622J7450J6907n438
7567B1613m510p218m518P542m6P367L787j930m576J813O17j3908j1159q311P572
7552e865J4039n111n421j2453n812r31j135J9360J3741j5022J0011K0792n042
7539B1151o168n548L11J5565Q240j0090j0283k209N73O125P876k044j7010n844
7525F45M918N811n010j923k776L433J0795p575o904J430m645r148j5648l319J9417
$$ plain form
7625 -1834 4022 4429 -1266 -13943 -5909 8516 10361 7059 20686 13754 17926 24884 29790 18459
7611 18459 13471 17739 19949 32892 39168 32928 22048 13061 8844 9217 15141 9654 8713 8330 9915
7596 9915 16122 17682 16195 11378 12354 9001 7174 -2331 733 21452 21302 13458 -1609 -13447 -16324
7581 -16324 -16136 -178 7592 12079 16779 8226 -8622 1143 -7772 -9928 -7306 10144 27051 21613
7567 21613 17103 9885 5367 12909 12863 20230 24017 22087 17511 19324 19941 6033 -5126 -13437 -5865
7552 -5865 8174 3063 -2358 -14811 -20623 -21554 -22689 -3329 10412 -4610 5401 26193 21151
7539 21151 14983 9435 9746 25311 33551 23461 13178 10969 11542 17667 25543 23499 6489 645
7525 645 5563 11374 6364 4441 1665 5098 15893 8318 1414 2844 -1801 -10949 -26597 -29916 -10499
7510a0499J6256J7118j0690j6113o996j361J7766O638p248j6959P785J897O929
7497D523K520L734M896O169L817L700O88j4404n283j418N841k312J766n496l750
7482D991J2167L155M250l74p795j4399q837k523N627J1328j4977r027K498k800
7468a6716j760K0158J1794j649L07j2711p269J1387o201p417k077r5M364j848
7454i733m070N30J6011R10p648m407o405J5080N902K286p06o463l357j2766J124
7439a3712P939J3990J4565J651j1604q85K694j6869k083Q843p823m808j823J054
7425h871R904L423J503L913r018q066k667R767n61Q603M217j7367N029J3188n813
7410G184R563L873j2389k148m492o633k790J984J1140J6649n644L507M311k0326
$$ plain form
7510 -10499 5757 22875 12185 -3928 -10924 -12285 5481 12119 4871 -12088 -4303 -2406 4523
7497 4523 7043 10777 15673 21842 25659 29359 30047 15643 10360 8942 14783 12471 14237 8741 4991
7482 4991 17158 20313 24563 24189 16394 1995 -6842 -9365 -3738 7590 -7387 -16414 -13916 -16716
7468 -16716 -18476 1682 13476 11827 12134 -577 -7846 3541 -2660 -10077 -12154 -12249 -7885 -9733
7454 -9733 -13803 -13273 2738 3648 -4000 -8407 -14812 268 6170 8456 7750 1287 -2070 -14836 -13712
7439 -13712 -5773 8217 22782 24433 12829 11944 14638 -2231 -4314 4529 -3294 -8102 -9925 -8871
7425 -8871 1033 4456 5959 9872 854 -7212 -9879 -112 -673 7930 12147 -5220 -191 12997 7184
7410 7184 16747 20620 8231 6083 1591 -5042 -7832 -5848 5292 21941 16297 19804 24115 3789
7396C789l544N323J0872j72L689L751K981o928L923J1990j6012j4663j672n653
7382b326q045P653M169N461K594j10j0636n81k355K635M532o513O795R395K36
7367A2904p125j1801p131j164J1997J4542j0067j3Q127J5416p583q26O462k1503
7353B235j5299O905J978K288r43l015k2891j8019J6965J8070m892L788O830M765
7339a235j723m831J5209l829j6282m850M240R862M02J3749k485r774M306J68r994
7324g067j5170R157J5715M162J139n449P991m220o930l612j945K583l82L592O329
7309E893J3987N729j3943o471Q478n072o534n058r012j0410J2909R358J377J3588
7295A4819j3028r583L579N572K367o731L406N747m993j3617m990R661J948Q635
$$ plain form
7396 3789 245 5568 16440 16268 19957 23708 26689 19761 23684 35674 19662 4999 3327 -2326
7382 -2326 -10371 -2718 1451 6912 9506 9396 -1240 -1821 -4176 -1541 2991 -3522 3273 12668 12904
7367 12904 5779 -6022 -13153 -14317 -2320 12222 2155 2142 10269 25685 18102 17276 23738 2235
7353 2235 -13064 -6159 -4181 -1893 -2836 -5851 -28742 -46761 -29796 -11726 -16618 -12830 -6000 -1235
7339 -1235 -2958 -7789 7420 3591 -12691 -17541 -13301 -3439 -3037 10712 8227 -1547 2759 2927 -7067
7324 -7067 -22237 -13080 2635 6797 7936 2487 10478 6258 -672 -4284 -6229 -3646 -4028 -436 5893
7309 5893 19880 25609 11666 5195 13673 8601 2067 -2991 -12003 -22413 -9504 -146 1231 14819
7295 14819 1791 -7792 -4213 1359 3726 -3005 401 6148 1155 -12462 -17452 -7791 -5843 2792
7281B792J2387n078k1985j922M504J310l395l461m311Q056J1953r274K582N698
7267a44J1307N571k2000k319J6661R489o038k5304j2725J0378P294J0949M133
7254G252l119k799q427Q266p430N48P18k2J0917j0630r989N547L665P349K579
7239D425j1275R625Q137L557j3513p005L904J581k004J444L867L258M535m661
7225E875j4473P118P54k881J3842m560l86l323r183P417J4613k956k445j0q760
7210F42J093j029j1040j781N102p636o695k573M603M634O912J492m94l582J0744
7195C92J2620K528j2374j0903K561k362N038O213q903J018J5443L031J0426N852
7181C0580j5425J1159j0539j0428l142Q21L824n192l298J824N870j94m112J1412
$$ plain form
7281 2792 15179 10101 -11884 -13806 -9302 -7992 -11387 -14848 -19159 -11103 850 -8424 -5842 -144
7267 -144 11163 16734 -5266 -7585 9076 18565 12527 -12777 -25502 -15124 -7830 3119 7252
7254 7252 4133 1334 -7093 1173 -6257 -5709 -4991 -5013 5904 -4726 -14715 -9168 -5503 1846 4425
7239 4425 -6850 2775 10912 14469 956 -6049 -2145 -564 -2568 -1124 2743 6001 10536 5875
7225 5875 -8598 -1480 -726 -3607 10235 5675 5289 1966 -7217 200 14813 11857 9412 9402 642
7210 642 1735 706 -10334 -12115 -7013 -14649 -21344 -23917 -19314 -14680 -7768 -6276 -6770 -10352 392
7195 392 13012 15540 3166 -7737 -5176 -7538 -2500 3713 -5190 -4172 11271 14302 24728 30580
7181 30580 15155 26314 15775 5347 2205 3026 6850 1658 -1640 184 6054 5860 1748 13160
7167A3160O419l357j5589n219q279o47J514Q763p960j4292J2558N788J4764K006
7153I629l271m956k535M266m383N087L554N744O312p648o51K823j4615J0998J0186
7138B0540p841p658K150J127p164K053L400l789L807O137l148r174j2118K716
7124h962M832K976P062K287J0458N843j4003p167q178j1173K084P446Q345r458
7110g608J732K6554J691q525o250r987k500j0359P54K1108J901j1102j0325J1494
7096a422K426j1791M696J6809Q825M603N144n818k060J6053n824j0219L289O145
7082C0856j7822k3173q428K5538J8090r933n943L101Q288j817q890j4066o233
7069a0432J861Q399P033K361r469o290n495N759L071O483m171J52j2097L916P240
$$ plain form
7167 13160 19579 16222 633 -4586 -12865 -13512 -11998 -3235 -11195 -25487 -12929 -7141 7623 9629
7153 9629 6358 1402 -1133 3133 -1250 3837 7391 13135 19447 11799 11148 13971 -644 10354 20540
7138 20540 12699 5041 7191 8318 1154 3207 6607 2818 6625 12762 9614 440 -11678 -8962
7124 -8962 -4130 -1154 5908 8195 18653 24496 10493 3326 -4852 -16025 -13941 -6495 1850 -7608
7110 -7608 -5876 20678 22369 13844 7594 -2393 -4893 -15252 -14498 6610 8511 -2591 -12916 -1422
7096 -1422 1004 -10787 -6091 10718 19543 24146 29290 23472 21412 37465 31641 21422 24711 30856
7082 30856 13034 -10139 -18567 6971 25061 15128 9185 12286 20574 18757 9867 -4199 -10432
7069 -10432 -8571 -172 6861 9222 -247 -6537 -12032 -6273 -3202 3281 -890 -738 -12835 -8919 -1679
7054a679l429J2336R150p949j6732P291j3093q457J223K396J4792k208n306p335
7040a9000o557J54Q816j3093n608j630Q193M304M921M381k040M408O423m503p958
7025a8789r449r399Q402J3517j025P126K338J995J86j1405M385M656k768O736
7011c494J5416J0783R264N071j4612m590j2282j073K645j1509o148m943M070l664
6997a5066m07M541J7238j634j0379k80m753O617J1634p055K461L542O044J37j963
6982A0677p155L424r310J504j3832n153R086J224j1577M494J7947j313n8j143
6968a185r249M830l076M735K3j9899r595K2506M752J9706K888j2808k3789M566
6954a5595K220j086R9o105J2958J2594m290j9658p268m343K2298O21q212M109
$$ plain form
7054 -1679 -5108 7228 16378 8429 -8303 -1012 -14105 -22562 -21339 -18943 -4151 -6359 -11665 -19000
7040 -19000 -25557 -25403 -16587 -29680 -35288 -36918 -28725 -24421 -19500 -15119 -17159 -12751 -6328 -10831 -18789
7025 -18789 -28238 -37637 -29235 -15718 -16743 -9617 -7279 -5284 -5098 -16503 -12118 -7462 -10230 -3494
7011 -3494 11922 22705 31969 37040 22428 17838 5556 4483 7128 -4381 -10529 -15472 -11402 -15066
6997 -15066 -15473 -10932 6306 4672 -5707 -5987 -10740 -4123 7511 456 2917 6459 12503 12640 10677
6982 10677 3522 6946 -2364 -860 -14692 -19845 -10759 -9535 -21112 -16618 1329 16 -42 -1185
6968 -1185 -10434 -5604 -8680 -3945 -3922 -23821 -33416 -10910 -6158 13548 16436 3628 -20161 -15595
6954 -15595 -13375 -14461 -14362 -20467 -7509 5085 795 -18863 -26131 -30474 -8176 -7555 -15767 -11658
6940a1658Q45j7529L12L310K52O334J2851k533n369R798O555l613K814n737q065
$$ plain form
6940 -11658 -10813 -28342 -28030 -24720 -24468 -18134 -5283 -7816 -13185 -3387 3168 -445 2369 -3368 -11433
$$ [...]
##END NTUPLES=NMR SPECTRUM
##END=
