##TITLE=Analysis number 310645
Compound Code cc 07139
Book Reference 416/174
Project Code adrs
Chemist Name stevep
##JCAMPDX= 6.0         $$ Bruker NMR JCAMP-DX V2.0
##DATA TYPE= NMR SPECTRUM
##DATA CLASS= NTUPLES
##ORIGIN= Bruker BioSpin GmbH
##OWNER= NMR
$$ XWIN-NMR		Version 3.5
$$ Tue Jun 21 12:44:30 2005 GMT Daylight Time (UT+1h)  MAYBRIDGE\NMR@NMR_250MHZ
##.OBSERVE FREQUENCY= 250.131544655141
##.OBSERVE NUCLEUS= ^1H
##.ACQUISITION MODE= SIMULTANEOUS (DQD)
##.ACQUISITION SCHEME= undefined
##.AVERAGES= 16
##.DIGITISER RES= 18
##SPECTROMETER/DATA SYSTEM= dpx250
##.PULSE SEQUENCE= zg30
##.SOLVENT NAME= CDCl3
##.SHIFT REFERENCE= (INTERNAL, CDCl3, 0, 16.4472)
##AUDIT TRAIL= $$ (NUMBER, WHEN, WHO, WHERE, WHAT)
$$ ##TITLE= Audit trail, XWIN-NMR		Version 3.5
$$ ##JCAMPDX= 5.01
$$ ##ORIGIN= Bruker BioSpin GmbH
$$ ##OWNER= NMR
$$ C:\u/data/dgb/nmr/ADRS/4440/pdata/1/auditp.txt
$$ ##AUDIT TRAIL=  $$ (NUMBER, WHEN, WHO, WHERE, WHAT)
(   1,<2005-06-21 12:43:03.85 +100>,<MAYBRIDGE\NMR>,<NMR_250MHZ>,
      <created by zg, POWCHK disabled, PULCHK disabled
       configuration hash MD5:
       62 19 C7 07 E1 42 D1 B7 37 6C 3D D0 77 39 F9 E6
       data hash MD5: 64K
       BE 9C E0 6D 04 31 78 DB 37 E7 FF DD 83 81 7D FB>)
(   2,<2005-06-21 12:44:00.49 +100>,<MAYBRIDGE\NMR>,<NMR_250MHZ>,
      <Start of raw data processing
       ef LB = 0.3 FT_mod = 6 PKNL = 1 SI = 32K 
       data hash MD5: 32K
       3C EE 14 E8 5D AA 5E 52 2E 2E 46 20 A8 8B 42 01>)
(   3,<2005-06-21 12:44:04.99 +100>,<MAYBRIDGE\NMR>,<NMR_250MHZ>,
      <apk 
       data hash MD5: 32K
       61 EC F0 BB F1 8B EB B9 3B BE 16 07 73 E0 27 02>)
(   4,<2005-06-21 12:44:07.99 +100>,<MAYBRIDGE\NMR>,<NMR_250MHZ>,
      <abs ABSG = 5 
       data hash MD5: 32K
       58 4F 38 CC 50 92 3D E1 B9 C8 28 2A 2D 59 C5 14>)
$$ ##END=
$$ 
$$ hash MD5
$$ 30 39 E7 BE 48 E3 E1 15 7B 1E 00 25 71 85 27 9E
##$RELAX= 
##$RELAX= 
##$RELAX= 
##$RELAX= 
##$RELAX= 
##$RELAX= 
##$RELAX= 
$$ Bruker specific parameters
$$ --------------------------
##$DU= <C:\u>
##$EXPNO= 4440
##$NAME= <ADRS>
##$PROCNO= 1
##$TYPE= <nmr>
##$USER= <dgb>
##$AMP= (0..31)
100 100 100 100 100 100 100 100 100 100 100 100 100 100 100 100 100 100 
100 100 100 100 100 100 100 100 100 100 100 100 100 100 
##$AQSEQ= 0
##$AQ_mod= 3
##$AUNM= <au_zg>
##$AUTOPOS= <24 >
##$BF1= 250.13
##$BF2= 250.13
##$BF3= 250.13
##$BF4= 250.13
##$BF5= 500.13
##$BF6= 500.13
##$BF7= 500.13
##$BF8= 500.13
##$BYTORDA= 1
##$CFDGTYP= 0
##$CFRGTYP= 5
##$CHEMSTR= <none>
##$CNST= (0..31)
1 1 145 1 1 1 1 1 1 1 1 1 1 1 1 1 1 1 1 1 1 1 1 1 1 1 1 1 1 1 1 1 
##$CPDPRG= <>
##$CPDPRG1= <>
##$CPDPRG2= <>
##$CPDPRG3= <>
##$CPDPRG4= <mlev>
##$CPDPRG5= <mlev>
##$CPDPRG6= <mlev>
##$CPDPRG7= <mlev>
##$CPDPRG8= <mlev>
##$CPDPRGB= <>
##$CPDPRGT= <>
##$D= (0..31)
0 1 0 0 0 0 0 0 0 0.06 0 0 0 0 0 0 0.0002 0 0 0 0 0 0 0 0 0 0 0 0 0 0 
0 
##$DATE= 1119354177
##$DBL= (0..7)
120 120 120 120 120 120 120 120 
##$DBP= (0..7)
150 150 150 150 150 150 150 150 
##$DBP07= 0
##$DBPNAM0= <>
##$DBPNAM1= <>
$$ [...]
##$SUBNAM7= <"">
##$SUBNAM8= <"">
##$SUBNAM9= <"">
##$SW= 20.6930455092707
##$SWIBOX= (0..15)
0 0 3 0 0 0 0 0 0 0 0 0 0 0 0 0 
##$SW_h= 5175.983436853
##$TD= 65536
##$TD0= 1
##$TE= 295.16
##$TE2= 300
##$TE3= 300
##$TEG= 300
##$TL= (0..7)
0 120 120 120 120 120 120 120 
##$TP= (0..7)
150 150 150 150 150 150 150 150 
##$TP07= 0
##$TPNAME0= <>
##$TPNAME1= <>
##$TPNAME2= <>
##$TPNAME3= <>
##$TPNAME4= <>
##$TPNAME5= <>
##$TPNAME6= <>
##$TPNAME7= <>
##$TPOAL= (0..7)
0.5 0.5 0.5 0.5 0.5 0.5 0.5 0.5 
##$TPOFFS= (0..7)
0 0 0 0 0 0 0 0 
##$TUNHIN= 0
##$TUNHOUT= 0
##$TUNXOUT= 0
##$USERA1= <user>
##$USERA2= <user>
##$USERA3= <user>
##$USERA4= <user>
##$USERA5= <user>
##$V9= 5
##$VALIST= <valist>
##$VCLIST= <CCCCCCCCCCCCCCC>
##$VD= 0
##$VDLIST= <DDDDDDDDDDDDDDD>
##$VPLIST= <PPPPPPPPPPPPPPP>
##$VTLIST= <TTTTTTTTTTTTTTT>
##$WBST= 1024
##$WBSW= 4
##$XGAIN= (0..3)
0 0 0 0 
##$XL= 0
##$YL= 0
##$YMAX_a= 404184
##$YMIN_a= -397439
##$ZGOPTNS= <>
##$ZL1= 120
##$ZL2= 120
##$ZL3= 120
##$ZL4= 120
##$ABSF1= 16.44723
##$ABSF2= -4.245943
##$ABSG= 5
##$ABSL= 3
##$ALPHA= 0
##$AQORDER= 0
##$ASSFAC= 0
##$ASSFACI= 0
##$ASSFACX= 0
##$ASSWID= 0
##$AUNMP= <proc_1d>
##$AZFE= 0.1
##$AZFW= 0.1
##$BCFW= 0
##$BC_mod= 0
##$BYTORDP= 0
##$COROFFS= 0
##$CY= 12.5
##$DATMOD= 1
##$DC= 0
##$DFILT= <>
##$DTYPP= 0
##$F1P= 14.0000005364418
##$F2P= -0.99999901652339
##$FCOR= 0.5
##$FTSIZE= 32768
##$FT_mod= 6
##$GAMMA= 0
##$GB= 0
##$INTBC= 1
##$INTSCL= 1
##$ISEN= 128
##$LB= 0.3
##$LEV0= 0
##$LPBIN= 0
##$MAXI= 10000
##$MC2= 0
##$MEAN= 0
##$ME_mod= 0
##$MI= 0
##$NCOEF= 0
##$NC_proc= -2
##$NLEV= 6
##$NOISF1= 0
##$NOISF2= 0
##$NSP= 0
##$NTH_PI= 0
##$NZP= 0
##$OFFSET= 16.44723
##$PC= 1
##$PHC0= -73.94605
##$PHC1= 6.79651
##$PH_mod= 1
##$PKNL= yes
##$PPARMOD= 0
##$PSCAL= 4
##$PSIGN= 0
##$REVERSE= no
##$SF= 250.130018701461
##$SI= 32768
##$SIGF1= 0
##$SIGF2= 0
##$SINO= 400
##$SIOLD= 32768
##$SREGLST= <1H.CDCl3>
##$SSB= 0
##$STSI= 32768
##$STSR= 0
##$SW_p= 5175.98343685301
##$SYMM= 0
##$S_DEV= 0
##$TDeff= 65536
##$TDoff= 0
##$TI= <Analysis number 999999
Compound Code 99
Book Reference 9
Project Code 9>
##$TILT= no
##$TM1= 0
##$TM2= 0
##$TOPLEV= 0
##$USERP1= <user>
##$USERP2= <user>
##$USERP3= <user>
##$USERP4= <user>
##$USERP5= <user>
##$WDW= 1
##$XDIM= 32768
##$YMAX_p= 416901288
##$YMIN_p= -130777
$$ End of Bruker specific parameters
$$ ---------------------------------
##NTUPLES= NMR SPECTRUM
##VAR_NAME=  FREQUENCY,     SPECTRUM/REAL,   SPECTRUM/IMAG
##SYMBOL=    X,             R,               I
##VAR_TYPE=  INDEPENDENT,   DEPENDENT,       DEPENDENT
##VAR_FORM=  AFFN,          ASDF,            ASDF
##VAR_DIM=   32768,         32768,           32768
##UNITS=     HZ,            ARBITRARY UNITS, ARBITRARY UNITS
##FACTOR=    0.157963299565203, 1,           1
##FIRST=     4113.94579375131, 0,            0
##LAST=      -1062.0376431017, 0,            0
##MIN=       -1062.0376431017, -130777,      0
##MAX=       4113.94579375131, 416901288,    0
$$ Real data points
##PAGE= N=1
##DATA TABLE= (X++(R..R)), XYDATA
$$ [...]
$$ plain form
15053 -729 20473 23154 16698 18946 6918 -4895 1013 9224 11150 2529 5431 -1354 -14610 -23265
15039 -23265 -23864 -7091 -688 -1618 16578 22117 22625 26908 22367 23607 20827 7044 10463 16292
15025 16292 13311 2793 -14672 -7566 3981 5602 2220 -1882 -7186 -13823 -11605 -18116 -19162 3254
15011 3254 30059 43009 36868 18270 15956 8873 10154 -4458 2313 24783 14490 15386 6714
14998 6714 7926 16443 9724 4890 -3984 -26287 -26837 -13026 -3173 -6679 -12001 -3454 -15903 -22105
14984 -22105 -20916 -21814 -26552 -34098 -32407 -20264 1992 35946 27820 11867 -11999 -9553 -5622
14971 -5622 -25089 -33798 -21751 -8975 -21057 -23445 -6001 13189 11422 -8475 -16171 -3279 -7045
14958 -7045 -26097 -13506 6250 983 -12356 -18024 -30554 -24194 -23278 -13076 -15020 -30068 -23871
$$ packed form
15053g29K1202K681o456K248j2028j1813N908Q211J926q621K902o785j3256q655
15039b3265n99J6773O403r30J8196N539N08M283m541J240k780j3783L419N829
15025A6292k981j0518j7465P106J1547J621l382m102n304o637K218o511j046K2416
15011C254K6805J2950o141j8598k314p083J281j4612O771K2470j0293Q96q672
14998F714J212Q517o719m834q874k2303n50J3811R853l506n322Q547j2449o202
14984b2105J189q98m738p546J691J2143K2256L3954q126j5953k3866K446L931
14971e622j9467q709J2047J2776j2082k388J7444J9190j767j9897p696J2892l766
14958g045j9052J2591J9756n267j3339n668j2530O360R16J0202j944j5048O197
$$ plain form
14945 -23871 -342 15540 7636 -14205 -10809 -5535 -12023 -13162 -14774 2760 9705 -4381 -10318
14932 -10318 10427 4913 -2614 7464 -303 5481 3254 14107 15802 11830 10176 5120 -3108 6120
14918 6120 3522 16126 23702 30332 25208 12923 6138 17907 24926 27292 9000 -17122 -12839
14905 -12839 6199 6476 241 -8432 5608 26066 8446 -120 -3446 -4685 -22503 -33483 -26078
14892 -26078 -20078 6621 13346 -1030 -29980 -40998 -40027 -21125 -3011 -5898 -2094 9429 3676
14879 3676 -7819 -8771 2191 16907 33242 23643 6450 -10608 -4780 -4736 -8534 -17965 -9500 913
14865 913 312 -12076 -39155 -55214 -50241 -36169 -45066 -24268 -18048 -19064 -10748 -1479 5799 3280
14851 3280 2878 -2595 1412 -2704 8924 8681 15701 -5473 -21338 -17335 -13519 3021 23354 14306
$$ packed form
14945b3871K3529J5882p904k1841L396N274o488j139j612J7534O945j4086n937
14932a0318K0745n514p527J0078p767N784k227J0853J695l972j654n056q228R228
14918F120k598J2604P576O630n124j2285o785J1769P019K366j8292k6122M283
14905a2839J9038K77o235q673J4040K0458j7620q566l326j239j7818j0980P405
14892b6078O000K6699O725j4376k8950j1018R71J8902J8114k887L804J1523n753
14879C676j1495r52J0962J4716J6335r599j7193j7058N828M4l798r431Q465J0413
14865I13o01j2388k7079j6059M973J4072q897K0798O220j016Q316R269P278k519
14851C280m02n473M007m116J1628k43P020k1174j5865M003L816J6540K0333r048
$$ plain form
14837 14306 -3419 -19025 -18201 -19423 -21264 -27624 -17226 12486 8952 -5411 11762 45221 49218
14824 49218 25550 10334 19227 18741 4527 11556 -5394 -9422 7926 15242 11866 -5435 18393
14811 18393 29801 23862 13651 15761 18222 17924 12531 6312 25881 46574 37552 31204 16196
14798 16196 -3448 -20372 -37912 -16819 2450 -3087 6930 1468 544 2076 -11208 -10780 -19544
14785 -19544 -18762 -5903 10579 12495 10141 3345 5048 9027 10231 19777 13709 15316 1962 -3712
14771 -3712 -11903 -10772 -4196 -5757 5244 4475 -10415 -8839 2206 26743 36178 28905 14602 22259
14757 22259 18829 8761 -5231 -4080 3002 25932 15207 9665 12274 11731 10764 4281 -24 -1645
14743 -1645 -3222 -10548 -7050 -5821 -84 17933 16951 12308 -2874 -28965 -40239 -52002 -35607
$$ packed form
14837A4306j7725j5606Q24j222j841o360J0398K9712l534j4363J7173L3459L997
14824D9218k3668j5216Q893m86j4214P029j6950m028J7348P316l376j7301K3828
14811A8393J1408n939j0211K110K461k98n393o219J9569K0693r022o348j5008
14798A6196j9644j6924j7540K1093J9269n537J0017n462r24J532j3284M28q764
14785a9544P82J2859J6482J916k354o796J703L979J204R546o068J607j3354n674
14771c712q191J131O576j561J1001p69j4890J576J1045K4537R435p273j4303P657
14757B2259l430j0068j3992J151P082K2930j0725n542K609n43r67o483m305j621
14743a645j577p326L498J229N737J8017r82m643j5182k6091j1274j1763J6395
$$ plain form
14730 -35607 -14562 -17666 -9491 5457 13611 14055 1796 -1989 -14206 -28910 -17582 -4880 -21944
14717 -21944 -19206 -4704 -1050 -5460 -6896 -5590 9087 -1428 -8037 -17319 -15539 -8309 -3386 -10781
14703 -10781 -28355 -34851 -24501 -5497 -2157 -18313 -28286 -14639 -1311 5358 29262 19727 -10938
14690 -10938 -16269 -10074 -18028 -23488 -22762 -23209 2885 24431 24527 5567 -7678 -6998 1146 -10124
14676 -10124 -8623 -380 9652 8476 11795 24693 15900 8954 17424 12971 7461 10310 5943 3468
14662 3468 5577 -49 -14104 -17592 -37859 -35389 -48388 -18347 12459 14540 -4468 -16092 -34796
14649 -34796 -37604 -33512 -24191 -14538 -18256 -16969 -32480 -26406 -10076 -16794 4081 6546 11260 9683
14635 9683 268 -11569 -8160 -24201 -21915 3549 3768 -26399 -29002 -34908 -26874 -17816 1533 6090
$$ packed form
14730c5607K1045l104Q175J4948Q154M44j2259l785j2217j4704J1328J2702j7064
14717b1944K738J4502L654m410j436J306J4677j0515o609r282J780P230M923p395
14703a0781j7574o496J0350J9004L340j6156r973J3647J3328O669K3904r535l0665
14690a0938n331O195p954n460P26m47K6094K1546R6j8960j3245O80Q144j1270
14676a0124J501Q243J0032j176L319J2898q793o946Q470m453n510K849m367k475
14662C468K109n626j4055l488k0267K470j2999L0041L0806K081j9008j1624j8704
14649c4796k808M092R321R653l718J287j5511O074J6330o718K0875K465M714j577
14635I683r415j1837L409j6041K286K5464K19l0167k603n906Q034R058J9349M557
$$ plain form
14621 6090 4362 8862 -4278 -9061 -14673 -14838 -24045 -29728 -24377 -17219 -27752 -26212 -10853 -10040
14607 -10040 -2057 11583 12098 -4675 7533 8985 16908 26706 -14500 -9588 -4941 5079 -3241
14594 -3241 -34321 -27733 6202 14965 7628 -1112 7379 32139 26838 16183 -1416 -14819 -20104
14581 -20104 -22397 749 10411 12858 19452 25275 38738 24807 -265 -11960 -17553 -13115 7447
14568 7447 19168 18271 18407 11417 8127 13401 13720 9507 12123 9782 4717 -4199 -9344 -19688 -13523
14553 -13523 -3660 22170 21822 16839 9675 -4769 -10044 -4878 -4200 -7883 389 2314 -10625 -6844
14539 -6844 3633 -2865 -2529 -9551 -7426 -16437 -15250 -23013 -12107 27832 44495 42114 4113 -6553
14525 -6553 -791 6569 2902 12803 5798 8467 19023 25072 33372 28272 8654 -13717 -20764 -17608
$$ packed form
14621F090j728M500j3140m783n612j65r207n683N351P158j0533J540J5359Q13
14607a0040P983J3640N15j6773J2208J452P923R798m1206M912M647J0020q320
14594c241l1080O588L3935Q763p337q740Q491K4760n301j0655j7599j3403n285
14581b0104k293K3146R662K447O594N823J3463j3931k5072j1695n593M438K0562
14568G447J1721q97J36o990l290N274L19m213K616k341n065q916n145j0344O165
14553a3523R863K5830l48m983p164j4444n275N166O78l683Q272J925j2939L781
14539f844J0477o498L36p022K125r011J187p763J0906L9939J6663k381l8001j0666
14525f553N762P360l667R901p005K669J0556O049Q300n100j9618k2371p047L156
$$ plain form
14511 -17608 4901 16126 -919 -15568 -14513 -769 10380 4381 -9131 -8979 -10785 -18224 -14389
14498 -14389 -1961 -2487 -21286 -24105 -17435 -442 17222 -566 -6624 -11457 -16579 -15303 -28752
14485 -28752 -7022 -22608 -29050 -4822 3616 -8008 -8003 7893 2922 -7609 -11610 -1954 27337
14472 27337 34008 26943 25595 12012 -11343 -13119 -1152 -10283 -9102 2143 18534 13271 6351
14459 6351 22790 16597 15981 6413 -1836 18138 15396 3145 -16874 -26869 -7520 -2724 -11650 -30321
14445 -30321 -23186 -735 -1794 -7379 -37525 -52725 -25861 -14813 -19775 -21160 -18499 -22172 -5406
14432 -5406 917 5987 696 -3842 -12730 -15649 -9579 6218 18254 13002 15178 19586 7207 -3110
14418 -3110 8356 30919 28012 10106 -4620 -7123 -9978 -5149 4173 -7247 -18991 -22131 -38047
$$ packed form
14511a7608K2509J1225j7045j4649J055J3744J1149n999j3512J52j806p439L835
14498a4389J2428n26j8799k819O670J6993J7664j7788o058m833n122J276j3449
14485b8752K1730j5586o442K4228Q438j1624NJ5896m971j0531m001R656K9291
14472B7337O671p065j348j3583k3355j776J1967r131J181J1245J6391n263o920
14459F351J6439o193o16r568q249J9974k742j2251k0019r995J9349M796q926j8671
14445c0321P135K2451j059n585l0146j5200K6864J1048m962j385K661l673J6766
14432e406O323N070n291m538q888k919O070J5797J2036n252K176M408j2379j0317
14418c110J1466K2563k907j7906j4726k503k855M829R322j1420j1744l140j5916
$$ plain form
14405 -38047 -29650 -13839 -11830 -15912 -4698 270 -15344 -25193 -23094 -5939 25245 31681 26243
14392 26243 22794 3027 -3213 4135 10268 -1561 -21873 -35964 -40855 -40956 -28133 -2629 15697
14379 15697 29500 24268 18142 -10625 -17602 -12081 -16010 -22741 -17336 -6800 -6242 -1870 221 -7017
14365 -7017 -12298 -3802 -1119 -157 -623 -13580 -20795 -14130 -22341 -39606 -33436 -30584 -18657 -12908
14351 -12908 -30498 -20360 -496 11276 9058 -3066 -25951 -19310 -6465 3023 8296 6721 -17343
14338 -17343 -15397 -18305 -11428 -3703 15292 14839 -1901 -23846 -28340 -11731 -706 4582 23044
14325 23044 -2385 -7580 3302 10600 4394 -1422 3348 8571 12004 32404 26978 14180 -943
14312 -943 -21199 -26750 -12894 -16075 -10214 -14784 -30281 -26023 -7567 5533 -5847 -25066 -7412
$$ packed form
14405c8047Q397J5811K009m082J1214M968j5614r849K099J7155L1184O436n438
14392B6243l449j9767o240P348O133j1829k0312j4091m891j01J2823K5504J8326
14379A5697J3803n232o126k8767o977N521l929o731N405J0536N58M372K091p238
14365g017n281Q496K683R62m66j2957p215O665q211j7265O170K852J1927N749
14351a2908j7590J0138J9864J1772k218j2124k2885O641J2845R488N273j575k4064
14338a7343J946k908O877P725J8995m53j6740k1945m494J6609J1025N288J8462
14325B3044k5429n195J0882P298o206n816M770N223L433K0400n426j2798j5123
14312i43k0256n551J3856l181N861m570j5497M258J8456J3100j1380j9219J7654
$$ plain form
14299 -7412 31149 23611 14368 13799 27474 9997 -290 16794 21776 15829 3579 -15918 -40344
14286 -40344 -50409 -21782 3473 4807 -10520 -11322 4052 -3331 4080 1527 -21831 -19202 -9010
14273 -9010 5061 5634 -4273 11121 34024 33019 31716 29269 38788 41394 40409 40317 31506 10033 -7902
14258 -7902 -33736 -39737 -40365 -14640 -10707 -29504 -33289 -23503 -17644 10979 21124 -8923 -14148
14245 -14148 -1853 -1949 -10323 -6805 -8930 13106 15636 11667 12304 14185 -15668 -22882 -26982 -21563
14231 -21563 710 10550 -815 -19522 -16744 9170 -1711 -27006 -17105 -1007 -22526 -36842
14219 -36842 -35554 -14192 18502 39418 40805 6990 -17122 -39490 -42649 -30115 -20541 -7179
14207 -7179 -5596 4076 25958 30831 25026 22742 33537 44447 41692 43416 14796 -3729 10757
$$ packed form
14299g412L8561p538r243n69J3675j7477j0287J7084M982n947j2250j9497k4426
14286d0344j0065K8627K5255J334j5327q02J5374p383P411k553k3358K629J0192
14273i010J4071N73r907J5394K2903j005j303k447R519K606r85r2q811k1473j7935
14258g902k5834o001o28K5725L933j8797l785R786N859K8623J0145l0047n225
14245a4148J2295r6q374L518k125K2036K530l969O37J881k9853p214m100N419
14231b1563K2273R840j1365j8707K778K5914j0881k5295R901J6098k1519j4316
14219c6842J288K1362L2694K0916J387l3815k4112k2368l159J2534R574J3362
14207g179J583R672K1882M873n805k284J0795J0910k755J724k8620j8525J4486
$$ plain form
14194 10757 12559 21067 17946 22535 11684 25909 21593 13783 11298 13892 14543 20873 23328 18745
14180 18745 10841 2534 8394 1043 2959 -5434 -25793 -5781 3911 10006 -3732 -13272 -14578 -32378
14166 -32378 -35629 -46940 -50506 -41613 -28726 -32084 -21863 -4871 32179 46925 37008 10057 6403
14153 6403 4032 -6262 -12876 -9886 5701 21549 11139 -38487 -46142 -23766 -29464 -35015 -35635
14140 -35635 -21727 -19132 -14884 -22010 -19882 -10293 -2403 -16135 -33212 -17875 -22026 -30560 -25498
14127 -25498 -14405 13273 9363 10059 28978 13255 10221 8684 5853 17035 27894 50363 39747
14114 39747 11599 22170 32120 14719 17737 20332 28247 22636 5886 -8787 -17859 -23970 -7563
14101 -7563 3480 -3943 -575 -7445 -15330 -26288 -21252 15085 30787 15088 8571 17373 -8098
$$ packed form
14194A0757J802Q508l121M589j0851J4225m316p810k485K594O51O330K455m583
14180A8745p904q307N860p351J916q393k0359K0012R692O095j3738r540j306j7800
14166c2378l251j1311l566Q893J2887l358J0221J6992L7050J4746r917k6951l654
14153F403k371j0294o614K990J5587J5848j0410m9626p655K2376n698n551o20
14140c5635J3908K595M248p126K128R589P890j3732j7077J5337m151q534N062
14127b5498J1093K7678l910O96J8919j5723l034j537k831J1182J0859K2469j0616
14114C9747k8148J0571R950j7401L018K595P915n611j6750j4673r072o111J6407
14101g563J1043p423L368o870p885j0958N036L6337J5702j5699o517Q802k5471
$$ plain form
14088 -8098 -20460 -25355 -5782 8801 1122 16977 9021 910 -3061 -8287 -4664 25113 26718
14075 26718 36028 45127 23400 -8824 3473 -11038 -2897 9822 -20123 -17981 -18858 -21686 -10550
14062 -10550 15238 16485 2897 10430 23787 25744 14032 5823 -12052 -15475 -8774 -4448 -4533 -2445
14048 -2445 -2254 -11660 -1982 -3089 -5987 -13318 -36120 -37770 -31166 -22063 -24322 -26455 -21190 -23910 -28792
14033 -28792 -43155 -18183 -13009 -18043 -8464 15992 14692 11825 11704 5059 2079 1187 -379 19085
14019 19085 5064 6239 16141 11088 -12501 -588 17386 16301 16756 9902 -6226 -11304 -8123
14006 -8123 7992 17240 4495 -22740 -4078 -15045 -25520 -4055 14390 31767 39628 32394
13994 32394 8018 12610 36976 26993 16719 6221 623 -9463 -15756 -17624 -22723 -14348 -1489
$$ packed form
14088h098j2362m895J9573J4583p679J5855p956q111l971n226L623K9777J605
14075B6718R310R099k1727l2224J2297j4511Q141J2719k9945K142q77k828J1136
14062a0550K5788J247j3588P533J3357J957j1712q209j7875l423O701M326q5K088
14048b445J91r406R678j107k898p331k2802j650O604R103k259k133N265k720m882
14033b8792j4363K4972N174n034R579K4456j300k867j21o645k980q92j566J9464
14019A9085j4021J175R902n053k3589J1913J7974j085M55o854j6128n078L181
14006h123J6115R248j2745k7235J8662j0967j0475K1465J8445J7377P861p234
13994C2394k4376M592K4366r983j0274j0498n598j0086o293j868n099Q375J2859
$$ plain form
13981 -1489 5860 -397 -599 -1538 14845 20277 8636 18089 28098 22769 13712 12673 12201 17331 17587
13966 17587 18820 25948 14733 16815 13886 13126 4352 144 -911 -19688 -13807 14788 31754 2300
13952 2300 -29465 -31621 -16538 -21345 -1231 12992 23109 -828 3113 8885 512 -4761 -8162
13939 -8162 -2454 4533 5857 -3866 -1793 1957 14805 21245 25457 29148 27084 23572 16017 -3443
13925 -3443 -5511 -23363 -25709 -27621 530 18703 31354 43983 31592 8389 -4246 -16258
13913 -16258 -36109 -39273 -18632 -10267 -13698 -14294 -8449 618 2934 -14329 -5217 -10472 -17439 -27483
13899 -27483 -24003 -17702 -4417 -1546 5267 -1040 -13418 -8287 -6121 10455 29005 42619 6720
13886 6720 -14657 -11385 -11892 -13921 -253 14829 18583 -5158 -17478 -1280 13946 12881 -11236
$$ packed form
13981a489P349o257k02r39J6383N432j1641R453J0009n329r057j039m72N130K56
13966A7587J233P128j1215K082k929p60q774m208j055j8777N881K8595J6966k9454
13952B300l1765k156J5083m807K0114J4223J0117k3937L941N772q373n273l401
13939h162N708O987J324r723K073L750J2848O440M212L691k064l512p555j9460
13925c443k068j7852k346j912K8151J8173J2651J2629j2391k3203j2635j2012
13913a6258j9851l164K0641Q365l431n96N845R067K316j7263R112n255o967j0044
13899b7483L480O301J3285K871O813o307j2378N131K166J6576J8550J3614l5899
13886F720k1377L272n07k029J3668J5082L754k3741j2320J6198J5226j065k4117
$$ plain form
13873 -11236 -23851 -18569 -33362 -4807 3343 17290 25642 17270 -6320 -17944 -8519 8184 19249
13860 19249 26337 17090 1752 6699 18312 41089 38439 8012 -11771 -5031 -15595 -24581 -20786
13847 -20786 -33375 -34891 -18282 -28166 -20549 3502 11753 26345 17689 4065 21801 32438 27150
13834 27150 16082 23050 22979 -13303 -27687 -18961 -11480 -8665 -6385 -12134 -7657 17920 31471 20116
13820 20116 1226 -13527 -19203 -9772 -12168 -14683 -7300 -19593 -21043 -5569 10913 5935 -9480
13807 -9480 -16213 -9721 7262 933 4188 -6033 -48421 -51051 -22814 -6773 -284 3142 5192
13794 5192 -750 8584 18746 15688 15428 26054 34615 31499 17773 7427 5829 25976 24324 -1621
13780 -1621 -4737 -4840 -16041 -23234 -29436 -29036 -12311 -7410 1815 15165 14084 4340 -17515 -16246
$$ packed form
13873a1236j2615N282j4793K8555Q150J3947Q352q372k3590j1624R425J6703J1065
13860A9249P088r247j5338M947J1613K2777k650l0427j9783O740j0564q986L795
13847b0786j2589j516J6609r884P617K4051Q251J4592q656j3624J7736J0637n288
13834B7150j1068O968p1l6282j4384Q726P481K815K280n749M477K5577J3551j1355
13820B0116j8890j4753n676R431k396k515P383j2293j450J5474J6482m978j5415
13807i480o733O492J6983o329L255j0221m2388k630K8237J6041O489L426K050
13794E192n942R334J0162l058k60J0626Q561l116j3726j0346j598K0147j652k5945
13780a621l116j03j1201p193o202M00J6725M901R225J3350j081r744k1855J269
$$ plain form
13766 -16246 6320 14486 16599 15386 16959 26015 7977 -940 -167 6676 146 -7079 -14673 -4575
13752 -4575 -11038 -8768 -5782 -10981 -9865 -2292 1556 -11161 -16412 906 7871 15719 15709 -1693
13738 -1693 -16967 -26962 -32779 -55666 -39810 -10724 -618 -5355 -4483 -4762 -4421 -14363 -27749 -22425
13724 -22425 -6716 -9558 -1851 -2328 -4217 -2258 -2244 -16780 -12353 -734 564 13941 23999 23636
13710 23636 23237 43005 26539 6950 12068 14399 14976 15818 26414 21690 -9551 -20641 -6335
13697 -6335 -3445 -14696 -21254 -25515 -10108 10251 26004 22783 20180 3393 -4142 3838 16857
13684 16857 20638 21884 16445 2636 -5480 -8021 -21168 -2837 23524 20637 11414 -5985 -3525
13671 -3525 -1478 -1510 13272 34330 35860 20997 16252 30208 35366 35620 34676 20840 11120 26910
$$ packed form
13766a6246K2566Q166K113j213J573R056j8038q917P73O843o530p225p594J0098
13752d575o463K270K986n199J116P573L848j2717n251J7318O965P848j0j7402
13738a693j5274r995n817k2887J5856K9086J0106m737Q72k79L41r942j3386N324
13724b2425J5709k842P707m77j889J959J4j4536M427J1619J298J3377J0058l63
13710B3636l99J9768j6466j9589N118K331N77Q42J0596m724l1241j1090J4306
13697f335K890j1251o558m261J5407K0359J5753l221k603j6787p535P980J3019
13684A6857L781J246n439j3809q116k541j3147J8331K6361k887r223j7399K460
13671c525K047l2J4782K1058J530j4863m745J3956N158K54r44j3836r720J5790
$$ plain form
13657 26910 20666 15382 -1348 6627 11069 16903 19355 5549 -2397 -2220 -12117 -5729 -171 2399
13643 2399 -17324 -21169 -26092 -20477 -13712 -10846 11986 6429 6014 16007 28821 43115 44774 16824
13629 16824 -14048 -24204 -12129 -15448 -17078 -13435 -27293 -22546 -18322 -23205 -30959 -14561 -10783
13616 -10783 7074 9564 -1507 -17510 -16321 -17208 -4356 -13146 -20621 -11660 -4902 13768 19865
13603 19865 15174 847 -1293 -30031 -37920 -25386 -22681 -29158 -2460 8420 8850 -4536 -6424
13590 -6424 1905 25778 28281 25441 32825 35138 20057 5736 12231 8708 15456 31659 22381 -93
13576 -93 -11445 -18109 -23562 -20401 1034 -390 18892 22598 4088 9037 37887 42997 34015 27852
13562 27852 22958 8751 5550 552 -2635 -5995 -2385 -1393 13253 26509 27508 19155 3368 -16359
$$ packed form
13657B6910o244n284j6730P975M442N834K452j3806p946J77r897O388N558K570
13643B399j9723l845m923N615O765K866K2832n557m15R993J2814J4294J659k7950
13629A6824l0872j0156J2075l319j630L643j3858M747M224m883p754J6398L778
13616a0783J7857K490j1071j6003J189q87J2852q790p475Q961O758J8670O097
13603A9865m691j4327k140k8738p889J2534K705o477K6698J0880M30j3386j888
13590f424Q329K3873K503k840P384K313j5081j4321O495l523O748J6203r278k2474
13576i3j1352o664n453L161K1435j424J9282L706j8510M949K8850N110q982o163
13562B7852m894j4207l201m998l187l360L610R92J4646J3256R99q353j5787j9727
$$ plain form
13548 -16359 -29151 -30005 -30263 -25120 -13673 -11851 -19159 -43062 -47037 -39385 -9798 -9189 -29148 -10637
13534 -10637 3303 484 -15450 -19102 -18036 -26813 -12655 -8941 -22305 -16264 -13002 -15224 -25740
13521 -25740 -23042 -6365 -11023 -19108 -13832 -18922 -33467 -45247 -32023 -15517 -16569 -19639 -6491
13508 -6491 8347 9466 22688 23617 21184 34309 42891 42996 39288 35207 14088 -1277 -9770 12124
13494 12124 30261 34937 18711 24263 32158 21377 -7323 -3446 -2080 4962 2186 -16943 -31057
13481 -31057 -26650 -6857 600 25631 19548 9860 15095 23729 25837 21369 -1319 -13466 -18717
13468 -18717 719 12396 37835 41656 29779 15615 2432 -1691 2493 15824 22977 21312 36109
13455 36109 31589 15754 3759 -7351 1552 -17115 -15973 -3827 -8095 6279 6157 -17541 -19702
$$ packed form
13548a6359j2792q54k58N143J1447J822p308k3903l975P652K9587O09j9959J8511
13534a0637J3940k819j5934l652J066q777J4158L714j3364O041L262k222j0516
13521b5740K698J6677m658q085N276n090j4545j1780J3224J6506j052l070J3148
13508f491J4838J119J3222R29k433J3125Q582J05l708m081k1119j5365q493K1894
13494A2124J8137M676j6226N552P895j0781k8700L877J366P042k776j9129j4114
13481c1057M407J9793P457K5031o083r688N235Q634K108m468k2688j2147n251
13468a8717J9436J1677K5439L821j1877j4164j3183m123M184J3331P153j665J4797
13455C6109m520j5835j1995j1110Q903j8667J142J2146m268J4374j22k3698k161
$$ plain form
13442 -19702 3248 9379 -5053 -25003 -17065 8283 17094 44967 44285 23333 11926 10452 9988
13429 9988 26284 17315 14249 4344 6300 7856 511 -8892 -7908 -10368 -17853 -22493 -34466 -30507
13415 -30507 -17070 -7524 -8022 -17305 -30903 -38151 -32097 -15118 8101 40064 23646 8260 9060
13402 9060 11701 -592 7599 10772 -13332 -21295 -20718 -12646 -4143 -21200 -30088 -21483 -14989 -22782
13388 -22782 -14498 -21109 -45553 -41193 -2875 1299 -5362 10337 8865 3595 9033 7152 -8093
13375 -8093 -610 2957 -11087 -22523 -26649 -31166 -28993 -1865 1508 8028 28831 28944 28900 32917
13361 32917 18005 16283 32997 21271 11750 11189 8395 17833 26466 18074 28833 24678 10606
13348 10606 3077 -9864 3060 13013 -6918 -18013 -8239 -10766 -9541 -28202 -36623 -17008 -5343
$$ packed form
13442a9702K2950O131j4432j9950P938K5348Q811K7873o82k0952j1407j474m64
13429I988J6296q969l066r905J956J556p345r403R84k460p485m640j1973L959
13415c0507J3437R546m98r283j3598p248O054J6979K3219L1963j6418j5386Q00
13402I060K641j2293Q191L173k4104p963N77Q072Q503j7057q888Q605O494p793
13388b2782Q284o611k4444M360L8318M174o661J5699j472n270N438j881j5245
13375h093P483L567j4044j1436m126m517K173K7128L373O520K0803J13m4M017
13361C2917j4912j722J6714j1726r521n61k794R438Q633q392J0759m155j4072
13348A0606p529j2941J2924R953j9931j1095R774k527J225j8661q421J9615J1665
$$ plain form
13335 -5343 -2196 6533 8607 -13311 -23402 3647 28282 26541 17590 22603 21099 3860 -5054
13322 -5054 1020 7080 26015 34729 24754 10871 11555 13732 -13955 -13874 -23398 -25502 -8558 3452
13308 3452 -18983 -17488 -1781 7604 5745 1297 -138 -4795 10306 33247 39458 28930 22147
13295 22147 13852 5341 -12894 -18936 -5507 14241 -13849 -21714 -11292 -3980 5026 10563 18021
13282 18021 25371 1904 3423 -8280 -15182 -11270 7 15117 3499 1300 19052 24599 13618
13269 13618 1489 -20324 -15272 -28025 -33394 -40124 -43571 -27185 -30683 -33447 -26177 -32925 -35795
13256 -35795 -7730 10716 17137 10313 225 -2748 1158 -33317 -44798 -37585 -42182 -27472 -13717
13243 -13717 -18577 -18259 -5426 15163 8265 1339 6184 19909 28510 28703 24965 17555 17799 18881
$$ packed form
13335e343L147Q729K074k1918j0091K7049K4635j741q951N013j504j7239q914
13322e054O074O060J8935Q714r975j3883O84K177k7687Q1r524k104J6944J2010
13308C452k2435J495J5707R385j859m448j435m657J5101K2941O211j0528o783
13295B2147q295q511j8235o042J3429J9748k8090p865J0422P312R006N537P458
13282A8021P350k3467J519j1703o902L912J1277J5110j1618k199J7752N547j0981
13269A3618j2129k1813N052j2753n369o730l447J6386l498k764P270o748k870
13256c5795K8065J8446O421o824j0088k973L906l4475j1481P213m597J4710J3755
13243a3717m860L18J2833K0589o898o926M845J3725Q601J93l738p410K44J082
$$ plain form
13229 18881 25725 9893 112 -10040 -22343 -3877 4289 2959 -18653 -5764 -1149 4567 3291
13216 3291 -2845 -746 -15009 -6667 -1868 -5573 -199 6110 -8640 -11056 16374 -3348 -612 6126
13202 6126 -7329 -18084 -14665 -20836 -10796 -1118 -11984 -10447 -19979 -24766 -40638 -32636 -18281
13189 -18281 -3630 -3443 -533 -743 -13083 -29595 -30242 -39296 -43236 -26918 -10124 -13451 -24212 -5476
13175 -5476 596 2998 -21137 -20860 -26102 -12790 -5049 11244 -15321 -29160 -39854 -29326 -8796
13162 -8796 1978 -5572 -19397 -6264 -11717 -5692 21469 10988 5227 2378 -12187 -15252 -6882
13149 -6882 -9432 -5150 4994 3868 254 7414 5934 6195 7116 14164 29241 21340 10978 -10033
13135 -10033 -2995 -18786 -21733 -13871 -2633 3180 8803 10924 20956 20219 4607 10965 -16016
$$ packed form
13229A8881O844j5832r781j0152j2303J8466Q166j330k1612J2889M615N716j276
13216C291o136K099j4263Q342M799l705N374O309j4750k416K7430j9722K736O738
13202F126j3455j0755L419o171J0040R678j0866J537r532m787j5872Q002J4355
13189a8281J4651J87K910k10j2340j6512o47r054l940J6318J6794l327j0761J8736
13175e476O072K402k4135K77n242J3312P741J6293k6565j3839j0694J0528K0530
13162h796J0774p550j3825J3133n453O025K7161j0481n761k849j4565l065Q370
13149f882k550M282J0144j126l614P160j480K61R21P048J5077p901j0362k1011
13135a0033P038j5791k947P862J1238N813N623K121J0032p37j5612O358k6981
$$ plain form
13122 -16016 -23544 7122 24233 8029 1603 19960 17613 18712 -486 -11442 -11738 -20754 -24670
13109 -24670 -27308 -8172 470 -4884 4537 -4065 7301 10120 10615 25901 19412 -331 658 -1987
13095 -1987 -20360 -26344 -10489 -18454 -19098 -22272 -28796 -28443 -32546 -41081 -18452 13294 35851 26295
13081 26295 9752 15805 2087 -16481 -4633 -5507 -18836 -26077 -15544 -17595 -9567 10810 24805
13068 24805 10414 25659 31201 32621 20078 32794 47534 31519 26184 17490 2362 -25768
13056 -25768 -33844 -24849 -19419 -7036 -10318 -1466 -7378 -8667 11059 21472 30360 25862 19600 14955
13042 14955 -4884 -18585 -956 2095 -11987 -9556 1520 -6205 -12870 -24209 -24390 -29819 -41925
13029 -41925 -45095 -47472 -7691 17553 15857 8275 25360 32607 14958 3025 -17091 -40066 -37596
$$ packed form
13122a6016p528L0666J7111j6204o426J8357k347J099j9198j0956k96r016l916
13109b4670k638J9136Q642n354R421q602J1366K819M95J5286o489j9743R89k645
13095a987j8373n984J5855p965o44l174o524L53m103q535K2629L1746K2557r556
13081B6295j6543O053j3718j8568J1848q74j3329p241J0533k051Q028K0377J3995
13068B4805j4391J5245N542J420j2543J2716J4740j6015n335q694j5128k8130
13056b5768q076Q995N430J2383l282Q852n912j289J9726J0413Q888m498o262m645
13042A4955j9839j3701J7629L051j4082K431J1076p725o665j1339j81n429j2106
13029d1925l170k377L9781K5244j696p582J7085P247j7649j1933k0116k2975K470
$$ plain form
13016 -37596 -8854 12954 22569 19856 2488 4037 12594 33824 38198 40051 25217 -1658 2071
13003 2071 7187 -8272 -870 6981 9991 10393 -8013 -16137 11793 25774 19205 6018 9165 28835
12989 28835 23857 14291 23976 27234 27411 32483 41122 30561 13661 5677 -9278 977 25701
12976 25701 7381 -37487 -30691 -18350 2795 -22221 -20029 -5184 6114 -16729 -28353 -22007
12964 -22007 -6929 1433 -10707 -24716 -35509 -31232 -16004 -3670 2481 10081 27168 33380 2994
12951 2994 -14512 -6276 -5767 -20007 -23023 -6710 4718 22338 21132 13812 11847 17061 8772 -22519
12937 -22519 -49668 -43841 -40688 -32797 -27953 -22538 -7615 -1278 6495 27628 22220 -1992 -11526
12924 -11526 -8335 -1496 9164 4113 8527 -6175 6602 22436 6252 -10615 -5513 -21243 -18608
$$ packed form
13016c7596K8742K1808R615k713j7368J549Q557K1230M374J853j4834k6875L729
13003B071N116j5459P402P851L010M02j8406q124K7930J3981o569j3187L147J9670
12989B8835m978r566R685L258J77N072Q639j0561j6900p984j4955J0255K4724
12976B5701j8320m4868O796J2341K1145k5016K192J4845J1298k2843j1624O346
12964b2007J5078Q362j2140j4009j0793M277J5228J2334O151P600J7087O212l0386
12951B994j7506Q236N09j4240l016J6313J1428J7620j206p320j965N214q289l1291
12937b2519k7149N827L153P891M844N415J4923O337P773K1133n408k4212r534
12924a1526L191O839J0660n051M414j4702J2777J5834j6184j6867N102j5730K635
$$ plain form
12911 -18608 -7026 4085 15419 6687 10883 16992 35162 21872 21254 1368 -10257 901 8070
12898 8070 11025 18412 4073 24137 17982 18192 15162 22748 40473 51635 36038 22665 27924
12885 27924 13708 13783 18574 14554 -13826 -39076 -39226 -24630 -24476 -16157 -9265 -3538 -2899 -6402 -23311
12870 -23311 -16143 -14911 2672 15923 2059 7802 28978 21478 11434 26830 39906 30442 29643
12857 29643 34387 37035 15762 7902 11574 7477 11577 4528 24381 35882 28925 21092 2316
12844 2316 951 6094 -12102 -12971 -16314 -7660 6581 -3888 -19107 -17198 -27255 -16149 -9319
12831 -9319 -5388 5009 -10470 -16274 -7635 -8429 -33801 -44752 -26455 -4474 3309 -2736 -21867
12818 -21867 -20726 -14120 -5429 5600 -2116 11313 12028 4242 6100 515 -22130 -5567 5621
$$ packed form
12911a8608J1582J1111J1334q732M196O109J8170j3290o18j9886j1625J1158P169
12898H070K955P387j4339K0064o155K10l030P586J7725J1162j5597j3373N259
12885B7924j4216P5M791m020k8380k5250j50J4596J54Q319O892N727O39l503j6909
12870b3311P168J232J7583J3251j3864N743K1176p500j0044J5396J3076r464p99
12857B9643M744K648k1273p860L672m097M100p049J9853J1501o957p833j8776
12844B316j365N143j8196q69l343Q654J4241j0469j5219J909j0057J1106O830
12831i319L931J0397j5479n804Q639p94k5372j0951J8297K1981P783o045j9131
12818b1867J141O606Q691J1029p716J3429P15p786J858n585k2645J6563J1188
$$ plain form
12805 5621 1127 -2980 -445 -13521 -1085 29024 15735 9610 -1629 -5272 3203 17445 16607
12792 16607 13214 13290 -11450 -1489 17394 21173 11948 -12968 -7854 -1739 -6312 -10899 -12108 -18465
12778 -18465 -21603 -250 -9253 8632 22042 25172 15842 -8825 -16334 9039 18721 7516 4085
12765 4085 9821 4376 1824 16665 15537 -3557 -9670 -14465 -686 2976 8812 6254 -7891 -34280
12751 -34280 -49142 -48613 -39898 -28182 -91 31790 39417 27633 14342 18219 1204 -3159 -3561
12738 -3561 4008 4483 26302 45080 31526 -5513 -34857 -31204 -40092 -34000 -26574 -30992 -35022 -27499
12724 -27499 -1762 14695 17918 25225 18975 226 7600 8652 3714 177 -25363 -26599 -25277
12711 -25277 -25253 -22898 7458 19482 -14509 -19757 -14199 4443 13512 5988 6915 18759 16999 8771
$$ packed form
12805E621m494m107K535j3076J2436L0109j3289o125j1239l643Q475J4242q38
12792A6607l393P6k4740R961J8883L779r225k4916N114O115m573m587j209o357
12778a8465l138K1353r003J7885J3410L130r330k4667p509K5373R682j1205l431
12765D085N736n445k552J4841j128j9094o113m795J3779L662N836k558j4145k6389
12751c4280j4862N29Q715J1716K8091L1881P627j1784j3291L877j7015m363m02
12738c561P569M75K1819J8778j3554l7039k9344L653q888O092P426m418m030P523
12724b7499K5737J6457L223P307o250j8749P374J052m938l537k5540j236J322
12711b5277K4K355L0356J2024l3991n248N558J8642R069p524R27J1844j760q228
$$ plain form
12697 8771 -7589 -28851 -21917 -3853 3351 14829 20931 14085 -2189 4787 8796 -7997 4461
12684 4461 9694 -5281 -9987 3464 11216 4045 -4444 -2354 11209 -4430 -22951 -9833 2966
12671 2966 14186 7180 15850 31104 15700 -12063 -21336 -17205 -6740 4646 20347 33283 28808
12658 28808 16038 9556 15470 9292 5002 8106 -8050 -25134 -23598 -32603 -33099 -28280 -24342 -11276
12644 -11276 10234 16516 6634 12909 21364 22048 15026 835 12309 20575 20457 6719 -7002 -2689
12630 -2689 -4406 10180 8795 3912 8207 -11606 -13244 -16631 21058 32196 28659 6107 -851
12617 -851 -2314 8 7687 -1585 -9408 15674 22069 21024 12480 16927 18568 8909 -559 -3497 -25756
12602 -25756 -38492 -37143 -32031 -20385 -9345 1643 25832 28367 18630 6221 3912 9889 26976
$$ packed form
12697H771j6360k1262O934J8064P204J1478O102o846j6274O976M009j6793J2458
12684D461N233j4975m706J3451P752p171q489K090J3563j5639j8521J3118J2799
12671B966J1220p006Q670J5254j5404k7763r273M131J0465J1386J5701J2936m475
12658B8808j2770o482N914o178m290L104j6156j7084J536r005m96M819L938J3066
12644a1276K1510O282r882O275Q455O84p022j4191J1474Q266j18j3738j3721M313
12630b689j717J4586j385m883M295j9813j638l387L7689J1138l537k2552o958
12617h51j463K322P679r272p823K5082O395j045q544M447J641r659r468k938k2259
12602b5756j2736J349N112J1646J1040J0988K4189K535r737j2409k309N977J7087
$$ plain form
12589 26976 24152 30984 28226 20493 13814 2560 6003 10612 -48 -3003 11982 26260 37172
12576 37172 56952 39359 29411 18688 22278 21249 21791 15839 -5574 -6484 -4090 13694 11896 2194
12562 2194 24498 25866 9750 12465 2412 -14685 -1244 32036 57452 46816 43205 25812
12550 25812 4000 -11894 -29161 -27506 -15110 -2335 -2865 5564 12499 2418 -5847 -9970 -20913
12537 -20913 -14477 12664 21742 23937 33581 40674 41635 36624 41576 35676 25989 24788 13936 6341
12523 6341 6274 -7539 -13475 -28857 -3116 7706 -4816 -8779 -16121 -17213 -350 14875 -1986
12510 -1986 -7035 -15342 -39862 -31655 -38930 -29149 -23897 -15731 -5002 9043 -1845 1756 -10435
12497 -10435 -27540 -34233 -12427 15523 6683 -1199 7647 -12929 -10122 3295 -9859 -9511 -7810
$$ packed form
12589B6976k824O832k758p733o679j1254L443M609j0660k955J4985J4278J0912
12576C7172J9780j7593r948j0723L590j029N42n952k1413r10K394J7784j798r702
12562B194K2304J368j6116K715j0053j7097J3441L3280K5416j0636l611j7393
12550B5812k1812j5894j7267J655J2396J2775n30Q429O935j0081q265m123j0943
12537b0913O436K7141R078K195R644P093R61n011M952n900r687j201j0852p595
12523F341o7j3813n936j5382K5741J0822j2522l963p342j092J6863J5225j6861
12510a986n049q307k4520Q207p275R781N252Q166J0729J4045j0888L601j2191
12497a0435j7105o693K1806K7950q840p882Q846k0576K807J3417j3154L48J701
$$ plain form
12484 -7810 5143 3752 -14548 -10947 8826 16606 420 -12361 -43178 -44806 -35342 5208 15654
12471 15654 20928 35751 25150 9275 -8747 -10909 -5600 -5096 -3751 -15432 -5847 13568 6567
12458 6567 -11523 10789 34781 27439 17765 3952 5512 3473 -19951 -29893 -20775 -1257 -7831
12445 -7831 -11161 -18716 -4570 -1279 -3178 3818 7955 5874 11511 7664 16358 37945 40094 26200
12431 26200 10479 -5119 10375 10012 -3482 6999 11215 1022 2303 5526 8157 28657 25978
12418 25978 13218 -1737 -10835 -3951 -10254 -1641 -29992 -22047 -4824 -24965 -33111 -25364 -22520
12405 -22520 -15285 -9206 -17608 -15372 -21003 -19940 -14455 -15881 -18182 -10119 20271 37109 16819 -26781
12391 -26781 -30775 -13101 -94 -2425 4452 15415 34256 31409 48127 45046 10027 -262 -2713
$$ packed form
12484g810J2953j391j8300L601J9773P780j6186j2781l0817j628R464M0550J0446
12471A5654N274J4823j0601j5875j8022k162N309N04J345j1681R585J9415p001
12458F567j8090K2312K3992p342r674j3813J560k039k3424r942R118J9518o574
12445g831l330p555J4146L291j899O996M137k081N637l847Q694K1587K149j3894
12431B6200j5721j5598J5494l63j3494J0481M216j0193J281L223K631K0500k679
12418B5978j2760j4955r098O884o303Q613k8351P945J7223k0141q146P747K844
12405b2520P235O079q402K236n631J063N485j426k301Q063L0390J6838k0290m3600
12391b6781l994J7674J3007k331O877J0963J8841k847J6718l081l5019j0289k451
$$ plain form
12378 -2713 -4344 -1664 -19008 1751 18236 -4487 -27068 -5134 -9320 -8488 -7370 -25404 -5840
12365 -5840 973 9594 21484 34704 24034 16736 -3716 -11274 -5741 8261 26163 24899 5972
12352 5972 -4174 -20801 -24283 -17179 -6821 -11505 -1963 6248 19500 31470 27268 21492 5358
12339 5358 -15589 -24492 -9826 4104 8093 4604 284 695 -16086 -12371 -11675 -35377 -55844 -61394
12325 -61394 -43585 -32323 -34017 -38290 -32372 -24641 -17875 -30146 -33489 -13686 3964 -166 -5875
12312 -5875 -11564 9525 18832 1706 -9111 -18018 -27039 -25549 -14144 -13555 -22625 -22395 -18808 17686
12298 17686 16114 -3199 -39038 -26393 1426 993 -780 -3542 -5125 778 -17760 -4424 7692
12285 7692 16497 11757 6645 -13497 -40103 -37345 -30721 -22829 3513 13671 36718 52694 45836
$$ packed form
12378b713j631K680j7344K0759J6485k2723k2581K1934m186Q32J118j8034J9564
12365e840O813Q621J1890J3220j0670p298k0452p558N533J4002J7902j264j8927
12352E972j0146j6627l482P104J0358m684R542Q211J3252J1970m202n776j6134
12339E358k0947q903J4666J3930L989l489m320M11j6781L715O96k3702k0467n550
12325f1394J7809J1262j694m273N918P731O766j2271l343J9803J7650m130n709
12312e875n689K1089R307j7126j0817q907r021J490J1405N89r070K30L587L6494
12298A7686j572j9313l5839J2645K7819m33j773k762j583N903j8538J3336J2116
12285G692Q805m740n112k0142k6606K758O624P892K6342J0158K3047J5976o858
$$ plain form
12272 45836 26388 11666 14303 -2371 -14189 -7732 9045 2069 -12154 -22730 -30370 -31335 -19528
12259 -19528 9159 17953 23119 25881 22708 12247 18854 21985 21454 27394 27921 28570 8220 -19470
12245 -19470 -30234 -25815 -15102 -3989 2822 -11042 1879 -16098 -39971 -18503 936 5215
12233 5215 -24116 -32559 -24586 -10412 -1990 -4040 -23055 -28825 -13723 2479 14844 7704 19947
12220 19947 28904 30406 25611 24718 30654 45692 56757 61972 50280 26191 8561 569 19748
12207 19748 15080 -14629 1409 17831 1416 -1811 9635 18970 19264 18967 6411 7171 7028 972
12193 972 23369 24380 7578 8913 -2558 -1159 4750 11733 14208 10061 15652 -1858 -7842 -2432
12179 -2432 210 -8904 -9434 -6361 -8915 -9017 4405 18599 27614 16297 15099 12185 -21653 -19183
$$ packed form
12272D5836j9448j4722K637j6674j1818O457J6777o976j4223j0576p640r65J1807
12259a9528K8687Q794N166K762l173j0461O607L131n31N940N27O49k0350k7690
12245a9470j0764M419J0713J1113O811j3864J2921j7977k3873K1468J9439M279
12233E215k9331q443P973J4174Q422k050j9015n770J5102J6202J2365p140J2243
12220A9947Q957J502m795q93N936J5038J1065N215j1692k4089j7630p992J9179
12207A9748m668k9709J6038J6422j6415l227J1446R335K94k97j2556P60j43o056
12193I72K2397J011j6802J335j1471J399N909O983K475m147N591j7510n984N410
12179b432K642r114n30L073k554j02J3422J4194R015j1317j198k914l3838K470
$$ plain form
12165 -19183 -8889 2935 9147 -4584 -28232 -42935 -20808 -11103 4572 11337 8574 -7576
12153 -7576 -17722 -11707 -19564 -14008 -25110 -29653 -20130 -22464 -24370 -14480 -9281 -4369 12209 25525
12139 25525 43686 43333 24265 310 -19884 -30921 -22263 -23202 -23789 -12352 -8838 5527 -1188
12126 -1188 -7064 -18438 -20777 1384 16910 27414 38716 49095 37753 23000 13885 13350 20691
12113 20691 19990 19401 29410 47992 15765 -20415 -8226 1124 -7955 -12969 -19437 -24304 -17831 -20051
12099 -20051 -18842 -43 22790 24882 12845 -5790 -21177 -17597 10948 20338 7363 1550 -151
12086 -151 6167 10394 3892 15821 17182 -11945 -19056 -22884 -5297 7276 -9288 -17031 -5328
12073 -5328 -2850 952 8197 540 8004 -10619 -23420 -19410 -24458 -6114 6716 -9393 -9069 13457
$$ packed form
12165a9183J0294J1824O212j3731k3648j4703K2127R705J5675O765k763j6150
12153g576j0146O015p857N556j1102m543R523k334j906R890N199M912J6578J3316
12139B5525J8161l53j9068k3955k0194j1037Q658r39n87J1437L514J4365o715
12126a188n876j1374k339K2161J5526J0504J1302J0379j1342j4753r115n35P341
12113B0691p01n89J0009J8582l2227l6180J2189R350r079n014o468m867O473k220
12099b0051J209J8799K2833K092j2037j8635j5387L580K8545R390j2975n813j701
12086a51O318M227o502J1929J361k9127p111l828J7587J2573j6564p743J1703
12073e328K478L802P245p657P464j8623j2801M010n048J8344J2830j6109L24K2526
$$ plain form
12059 13457 30982 3390 -4077 -5162 -11589 -27081 -32156 -11088 -2463 12918 15249 2247 8755
12046 8755 18783 36341 39357 25442 3 -11982 6523 13032 -612 -663 1539 -8810 -20125
12033 -20125 -23023 -21542 -17557 -5800 10459 20046 7867 -1249 -14086 -17157 -30291 -19184 1285
12020 1285 3497 21691 14066 -5250 -6301 -2123 8033 12345 21898 25540 7107 2374 26890
12007 26890 31172 5412 5059 10787 -10767 -27196 -21014 -18663 -6100 411 14089 9585 -683
11994 -683 2543 19298 13398 -14288 -25619 -12931 -12948 1169 17581 14659 3094 -8027 7102
11981 7102 15021 19041 -208 -9001 -11397 -12516 -13116 -27416 -13625 -15860 -25261 -33291 -31193 -40226
11967 -40226 -45322 -38426 -30722 -21159 -6209 -9751 -10583 -2469 -12971 -17922 -8191 -13850 -17390 -14846
$$ packed form
12059A3457J7525k7592p467j085o427j5492n075K1068Q625J5381K331j3002O508
12046H755J0028J7558L016j3915k5439j1985J8505O509j3644n1K202j0349j1315
12033b0125k898J481L985J1757J6259R587j2179r116j2837l071j3134J1107K0469
12020A285K212J8194p625j9316j051M178J0156M312R553L642j8433m733K4516
12007B6890M282k5760l53N728k1554j6429O182K351J2563O511J3678m504j0268
11994f83L226J6755n900k7686j1331J2688j7J4117J6412k922j1565j1121J5129
11981G102P919M020j9249q793k396j119o00j4300J3791k235r401q030K098r033
11967d0226n096O896P704R563J4950l542q32Q114j0502m951R731n659l540K544
$$ plain form
11953 -14846 -16317 -12293 -10583 -18711 -27072 -11793 4710 -5744 5653 19020 29910 31918 21230
11940 21230 7826 -18245 -21154 -10831 14625 22163 17432 -1084 5418 13314 15181 13988 -11895
11927 -11895 -9980 150 -6352 -15571 -20016 -15625 18403 39143 25796 30551 44966 51731 32424
11914 32424 12678 -4362 -8135 -14508 -24350 -31792 -31540 -17820 -30844 -41489 -41640 -29273 -10780
11901 -10780 -10291 -13967 254 -5432 1599 -3635 -23145 -27466 -11706 1754 12853 18624 34543
11888 34543 39516 23146 6138 7565 7319 5180 17411 36539 40044 20266 20983 32125 19247
11875 19247 12225 17595 3275 724 1659 9570 -4659 2802 11612 6727 27619 35941 19517 17347
11861 17347 28587 23366 26345 20649 21068 34422 43273 37404 6167 4032 5936 11877 -1541 19554
$$ packed form
11953a4846j471M024J710q128q361J5279J6503j0454J1397J3367J0890K008j0688
11940B1230j3404k6071k909J0323K5456P538m731j8516O502P896J867j193k5883
11927a1895J915J0130o502r219m445M391L4028K0740j3347M755J4415O765j9307
11914C2424j9746j7040l773o373r842p442K52J3720j3024j0645j51J2367J8493
11901a0780M89l676J4221n686P031n234j9510m321J5760J3460J1099N771J5919
11888C4543M973j6370j7008J427k46k139J2231J9128L505j9778P17J1142j2878
11875A9247p022N370j4320k551R35P911j4229P461Q810m885K0892Q322j6424k170
11861A7347J1240n221K979n696M19J3354Q851n869l1237k135J904N941j3418K1095
$$ plain form
11847 19554 24310 21458 1423 -11182 -16712 -23225 -26610 -39995 -40038 -17776 -6786 -2292 -13996
11834 -13996 -16727 -18016 -17374 -23216 -20053 -2832 2074 -1736 -2871 -5043 -21140 -11953 -5526 10575
11820 10575 23484 39974 40156 37252 18851 6878 10745 3535 5788 15985 21946 20723 26087
11807 26087 23691 21376 23678 12849 1483 -704 8636 -7175 1777 7713 1962 14939 15145 1325
11793 1325 -10627 -18521 -1559 3659 16649 24866 2640 -29025 -56835 -37341 -22655 -13155 4340
11780 4340 20347 7699 -11069 -4371 11716 13590 4611 -4205 2077 -7030 -17058 -29276 -28127
11767 -28127 -25989 10238 19807 21982 21192 17190 21779 4870 13692 13597 21448 7855 -1873 1083
11753 1083 6086 11536 4927 12206 1720 -16748 12355 26534 16059 -17350 -17677 -1646 -5834
$$ packed form
11847A9554M756k852k0035j2605n530o513l385j3385m3K2262J0990M494j1704
11834a3996k731j289O42n842L163J7221M906l810j135k172j6097R187O427J6101
11820A0575J2909J6490J82k904j8401j1973L867p210K253J0197N961j223N364
11807B6087k396k315K302j0829j1366k187R340j5811Q952N936n751J2977K06j3820
11793A325j1952p894J6962N218J2990Q217k2226l1665k7810J9494J4686R500J7495
11780D340J6007j2648j8768O698J6087J874q979q816O282r107j0028j2218J149
11767b8127K138L6227R569K175p90m002M589j6909Q822r5P851j3593r728K956
11753A083N003N450o609P279j0486j8468K9103J4179j0475l3409l27J6031m188
$$ plain form
11740 -5834 -6818 13813 24513 24987 7562 -4857 -16458 -25575 -31389 -20590 -12809 261 11082
11727 11082 20819 33248 31529 8703 -6331 -13149 -12989 11566 17886 15513 4090 2858 5593
11714 5593 14539 25425 31316 20694 -3911 -30315 -23523 -11006 -10207 -14794 -11126 -648 11413
11701 11413 9765 4929 4178 -7163 -17006 -7150 -7627 -10616 -1621 1633 -2870 -2545 4390 -9194 -27456
11686 -27456 -22804 -17910 -10927 -2826 5154 9149 1973 -16839 -23111 215 19123 44292 46522
11673 46522 20452 11047 -12072 -19658 -8286 -3083 -11472 -6306 -9992 8327 25737 21850 12356
11660 12356 -651 7985 10490 1819 -6452 -10730 -6907 -2878 -3291 20267 30410 16300 -17176
11647 -17176 -38504 -23993 -15884 -19443 -37134 -32797 -7432 -7262 12803 29519 18034 -7251 -13146
$$ packed form
11740e834r84K0631J0700M74j7425j2419j1601r117n814J0799P781J3070J0821
11727A1082R737J2429j719k2826j5034o818J60K4555O320k373j1423j232K735
11714E593Q946J0886N891j0622k4605k6404O792J2517P99m587L668J0478J2061
11701A1413j648m836p51j1341r843R856m77k989Q995L254m503L25O935j3584j8262
11686b7456M652M894O983Q101P980L995p176j8812o272K3326J8908K5169K230
11673D6522k6070r405k3119p586J1372N203q389N166l686J8319J7410l887r494
11660A2356j3007Q636K505q671q271m278L823M029m13K3558J0143j4110l3476
11647a7176k1328J4511Q109l559j7691M337K5365J70K0065J6716j1485k5285n895
$$ plain form
11634 -13146 -1508 -12469 -28743 -28344 -15725 -10115 -8735 706 20674 19810 2734 19096 22263
11621 22263 18598 3868 -19420 -14446 -11454 -10491 12117 12574 10354 12958 13823 5677 -19307 -15904
11607 -15904 14104 29069 8514 4775 -1945 -15866 -27771 -31020 -23238 -34690 -42752 -42662 -29811
11594 -29811 -17707 -2439 12350 10749 -9563 -8184 -605 -8774 2483 -7759 -11729 -4993 12791
11581 12791 14634 19907 17544 17382 -7305 -1 2019 2102 5380 18516 19725 27551 31470 17884
11567 17884 -10910 -22794 -7529 -3187 1098 13512 39968 49151 31571 32001 25824 6532 25625
11554 25625 34860 7507 -19962 -25507 -11018 -734 -18055 -33924 -25211 -16241 6695 18183
11542 18183 18563 27840 19899 6715 -4962 -5722 -8305 -31440 -28518 -12921 -12312 -18634 1658 6638
$$ packed form
11634a3146J1638j0961j6274L99J2619N610J380R441J9968q64j7076J6362L167
11621B2263l665j4730k3288M974K992R63K2608M57k220K604Q65q146k4984L403
11607a5904L0008J4965k0555l739o720j3921j1905l249P782j1452q062R0J2851
11594b9811J2104J5268J4789j601k0312J379P579q169J1257j0242l970O736J7784
11581A2791J843N273k363j62k4687P304K020Q3L278J3136J209P826L919j3586
11567A7884k8794j1884J5265M342M285J2414K6456R183j7580M30o177j9292J9093
11554B5625R235k7353k7469n545J4489J0284j7321j5869Q713Q970K2936J1488
11542A8183L80R277p941j3184j1677p60k583k3135K922J5597O09o322K0292M980
$$ plain form
11528 6638 9589 4932 7250 14430 20114 38810 48651 32437 17507 37646 42360 35948 18569
11515 18569 33858 47288 43240 25911 915 4328 -5408 -13782 -16180 -5586 -21531 -24371 -20776
11502 -20776 -20253 -17741 -23545 -30298 -14952 649 7689 21783 27384 26274 14527 -595 -15704
11489 -15704 -17179 -7222 4516 -28421 -22566 3227 8309 1898 6469 -10433 -13967 -19291 -15840
11476 -15840 -15667 5254 7762 22082 14681 651 -7963 -7221 6878 26752 34746 18159 9552
11463 9552 -12263 -27399 -37967 -45693 -18733 4199 10279 -8765 -35805 -37026 -25841 -15729
11451 -15729 12716 22563 1332 -16524 -3607 15445 16086 12068 14342 901 -31881 -29316 -25620
11438 -25620 -29327 -29468 -21926 -28304 -31382 -15515 6329 9411 -19047 -50868 -50232 -35864 -25561
$$ packed form
11528F638K951m657K318P180N684J8696R841j6214j4930K0139M714o412j7379
11515A8569J5289J3430m048j7329k4996L413r736q374k398J0594j5945k840L595
11502b0776N23K512n804o753J5346J5601P040J4094N601j110j1747j5122j5109
11489a5704j475R957J1738l2937N855K5793N082o411M571j6902l534n324L451
11476a5840J73K0921K508J4320p401j4030q614P42J4099J9874P994j6587q607
11463I552k1815j5136j0568p726K6960K2932O080j9044k7040j221J1185J0112
11451a5729K8445R847k1231j7856J2917J9052O41m018K274j3441l2782K565L696
11438b5620l707j41P542o378l078J5867K1844L082k8458l1821O36J4368J0303
$$ plain form
11425 -25561 -28247 -11785 -13303 6204 5045 -3798 -11892 -15654 -16453 -20725 -28281 -16879 -6976 -3215
11411 -3215 -1856 -4604 -9394 -16537 -21826 -9084 -1835 -544 -11375 -2252 10607 8283 -9370 -18482
11397 -18482 -12041 -15200 -14042 -9672 -8568 2518 -6493 -18497 -19395 -985 4043 2799 1483 -9817
11383 -9817 -18610 -19786 5748 21612 40055 21212 8513 17445 24550 11599 -1712 5949 4637
11370 4637 9314 23185 20085 8903 35314 24486 12498 11369 12700 -6203 -3394 -11102 -16856
11357 -16856 -3153 -778 -288 -2747 251 -9243 -26154 -35911 -23783 -13143 1401 4206 2510
11344 2510 -3515 3351 5453 -2032 -7295 3045 9392 24997 16175 -7698 -8721 -11831 438 17697
11330 17697 782 -15103 -17734 -14633 -9859 3636 8383 -1129 -73 9316 16800 8715 -10798
$$ packed form
11425b5561k686J6462j518J9507j159q843q094l762p99m272p556J1402R903L761
11411c215J359k748m790p143n289J2742P249J291j0831R123J2859k324j7653r112
11397a8482O441l159J158M370J104J1086r011j2004q98J8410N028j244j316j1300
11383i817q793j176K5534J5864J8443j8843j2699Q932P105j2951j3311P661j312
11370D637M677J3871l100j1182K6411j0828j1988j129J331j8903K809p708n754
11357a6856J3703K375M90k459K998r494j6911r757J2128J0640J4544K805j696
11344B510o025O866K102p485n263J0340O347J5605q822k3873j023l110J2269J7259
11330A7697j6915j5885k631L101M774J3495M747r512J056R389P484q085j9513
$$ plain form
11317 -10798 -11547 19972 27638 23368 10837 -4158 -5033 12907 12608 3642 -1966 -4429 -14640 -40373
11303 -40373 -48470 -34348 -17072 -38127 -32493 -10602 -14399 -38043 -42213 -58332 -49106 -37492 -33715
11290 -33715 -12343 22067 21919 5242 3412 -8655 -7119 -18285 -20128 -7005 -996 2261 10239
11277 10239 13415 6474 -5330 -19621 -7148 -7612 -5449 -17895 -4572 7605 5566 -410 -16152
11264 -16152 -16259 -15710 -21300 -8288 -7367 -15211 -15995 -20262 -25886 -1117 12818 9558 -2656 -16242
11250 -16242 -7011 -2605 -901 6852 296 6731 6436 -3907 -22704 -21438 -15888 -19149 -3720 -5536
11236 -5536 4178 19108 24805 26210 24504 15758 655 -1469 -1261 4945 11351 3922 2514 -12386
11222 -12386 -13722 -20496 -2693 8542 -18107 -12923 -6918 2450 8580 13071 20870 17790 1311
$$ packed form
11317a0798p49L1519P666m270j2531j4995q75J7940k99q966n608k463j0211k5733
11303d0373q097J4122J7276k1055N634K1891l797k3644m170j6119R226J1614L777
11290c3715K1372L4410j48j6677j830j2067J536j1166j843J3123O009L257P978
11277A0239L176o941j1804j4291J2473m64K163j2446J3323J2177k039n976j5742
11264a6152j07N49n590J3012R21p844p84m267n624K4769J3935l260j2214j3586
11250a6242R231M406J704P753o556O435k95j0343j8797J266N550l261J5429j816
11236e536R714J4930N697J405j706q746j5103k124K08O206O406p429j408j4900
11222a2386j336o774J7803J1235k6649N184O005R368O130M491P799l080j6479
$$ plain form
11209 1311 -19078 -29222 -13765 -6059 1010 -5074 -13563 -7556 -9647 -8862 5181 176 2833 14266
11195 14266 -17265 -53732 -50324 -15799 18950 20698 2997 7725 -683 -21077 -29207 -27646 -9213
11182 -9213 -193 -15378 -11456 -11615 529 20070 20234 7302 12399 1698 -8899 -12058 3640
11169 3640 19030 38311 31345 24915 -1567 -12112 -15666 -6145 2386 10363 -9659 -18992 -31161
11156 -31161 -23982 -5417 4675 -4411 -24141 -34309 -26668 -5042 744 -3818 -5953 -14896 -10065
11143 -10065 10702 16621 16075 22500 27817 16091 9398 -20410 -10732 -3498 -5171 -13784 -18300 -22989
11129 -22989 -16156 -16684 -6615 -6096 -3575 1172 3351 12550 19889 7651 14595 -12389 -13694 -7708
11115 -7708 -11695 -5699 -21010 -27703 8103 24784 19909 -3157 926 -967 6480 17211 4075
$$ packed form
11209A311k0389j0144J5457P706P069o084q489O007k091P85J4043n005K657J1433
11195A4266l1531l6467L408L4525L4749J748j7701M728q408k0394q130J561J8433
11182i213R020j5185L922j59J2144J9541J64j2932N097j0701j0597l159J5698
11169C640J5390J9281o966o430k6482j0545l554R521Q531P977k0022r333j2169
11156c1161P179J8565J0092r086j9730j0168P641K1626N786m562k135q943M831
11143a0065K0767N919n46O425N317j1726o693k9808R678P234j673q613m516m689
11129b2989O833n28J0069N19K521M747K179R199P339j2238O944k6984j305N986
11115g708l987N996j5311o693L5806J6681m875k3066M083j893P447J0731j3136
$$ plain form
11102 4075 7327 24620 41705 23669 481 -13130 -18227 -13579 -17691 313 1855 -4815 1519
11089 1519 -3259 -6001 -9632 -22161 4250 -4184 -23307 -29236 -31406 -37598 -27869 -14072 -7420 -9632
11075 -9632 -4703 1590 7237 2774 -5858 -11614 -2816 -16962 -18530 -23865 -15101 -10221 -19748 -27135
11061 -27135 -34118 -20901 -10552 -15416 -10084 -12427 -9344 1430 8404 24283 7076 17901 24647
11048 24647 6864 -319 -15986 -23100 -15245 -19475 -10331 1920 -11649 811 23245 -215 -24977
11035 -24977 -21344 -7423 18267 19850 2845 -14395 -9014 -11074 -12728 -9215 -17870 -9786 7823
11022 7823 -3327 -17517 -29289 -7548 6173 1997 1730 -6037 1609 -18080 -5488 12399 11733
11009 11733 -1680 1297 2306 4987 1536 7628 -1817 -3662 -1032 -15363 -34892 -30668 -20388
$$ packed form
11102D075L252J7293J7085j8036k3188j3611n097M648m112J8004J542o670O334
11089A519m778k742l631j2529K6411q434j9123n929k170o192R729J3797O652k212
11075i632M929O293N647m463q632n756Q798j4146j568n335Q764M880r527p387
11061b7135o983J3217J0349m864N332k343L083J0774O974J5879j7207J0825O746
11048B4647j7783p183j5667p114P855m230R144J2251j3569J2460K2434k3460k4762
11035b4977L633J3921K5690J583j7005j7240N381k060j654L513q655Q084J7609
11022G823j1150j4190j1772K1741J3721m176k67p767P646j9689J2592J7887o66
11009A1733j3413K977J009K681l451O092r445j845K630j4331j9529M224J0280
$$ plain form
10996 -20388 887 -16001 -40977 -36177 -16889 -34702 -32755 -11101 11902 33716 17471 4075
10984 4075 30835 28354 31280 15888 -4642 -3500 8069 11484 16578 -1456 -21041 -10512 7946
10971 7946 -1195 -21868 -22803 -11028 -6352 11563 -4762 -19200 -13916 1870 17731 21750 -2430
10958 -2430 -16995 -16921 13184 31640 27334 35797 27024 22866 17680 23639 44823 50576 59326 53661
10944 53661 69168 85926 61881 36900 33490 26448 9902 -12860 -38203 -28612 -19255 -8753
10932 -8753 -5792 -12834 -7298 -17350 -5756 9793 16968 -24 -8978 8418 26942 30247 40230
10919 40230 48014 38408 6087 -25795 -41679 -12893 6306 -6208 -5161 -5845 -1971 586 -32677
10906 -32677 -35989 -27445 -19236 -4147 -7832 -27507 -31430 -12090 -2725 -1741 15196 6269 160 4904
$$ packed form
10996b0388K1275j6888k4976M800J9288j7813J947K1654K3003K1814j6245j3396
10984D075K6760k481K926j5392k0530J142J1569L415N094j8034j9585J0529J8458
10971G946r141k0673r35J1775M676J7915j6325j4438N284J5786J5861M019k4180
10958b430j4565P4L0105J8456m306Q463q773m158n186N959K1184N753Q750n665
10944E3661J5507J6758k4045k4981l410p042j6546k2762k5343R591R357J0502
10932h753K961p042N536j0052J1594J5549P175j6992q954J7396J8524L305R983
10919D0230P784r606l2321l1882j5884K8786J9199j2514J047o84L874K557l3263
10906c2677l312Q544Q209J5089l685j9675l923J9340R365R84J6937q927o109M744
$$ plain form
10892 4904 3623 -13007 -11417 3560 2079 13314 17831 16552 31452 27809 5270 -7829 -7957
10879 -7957 -17089 -6444 -19409 -17023 -14160 -12171 -13858 -20456 -24145 -18816 -24160 -14381 -9282 -4276
10865 -4276 -5390 -6537 -19968 -23980 -23625 -27805 -20917 6283 11519 6212 -688 -5407 -12250 -10993
10851 -10993 7304 1967 -18596 -13450 15784 18726 18796 25574 12103 -4148 1019 -3208 15355
10838 15355 19363 8678 10185 974 -16231 -29785 -27994 -15930 -3092 -4588 4274 23612 23571
10825 23571 10039 26557 11609 10937 -1603 -10217 -6730 -5445 -30553 -18466 -5235 1079 4365
10812 4365 -1423 -13317 -10817 -7439 -35110 -24798 -17991 -8182 -8114 -9217 -3467 10221 3750 -6329
10798 -6329 -16559 -5212 15260 17059 3428 11464 29812 23319 30274 35662 18154 -243 3166
$$ packed form
10892D904j281j6630J590J4977j481J1235M517j279J4900l643k2539j3099j28
10879g957r132J0645j2965K386K863J989j687o598l689N329n344R779N099N006
10865d276j114j147j3431m012L55m180O888K7200N236n307o900m719o843J257
10851a0993J8297n337k0563N146K9234K942P0O778j3471j6251N167m227J8563
10838A5355M008j0685J507r211j7205j3554J791J2064J2838j496Q862J9338m1
10825B3571j3532J6518j4948o72j2540q614L487J285k5108J2087J3231O314L286
10812D365n788j1894K500L378k7671J0312O807R809O8j103N750J3688o471j0079
10798f329j0230J1347K0472J799j3631Q036J8348o493O955N388j7508j8397L409
$$ plain form
10785 3166 -4555 4246 12347 11391 -5526 -3168 10408 20384 23982 12565 -8605 -14631 -7261 3232
10771 3232 -2429 -17854 -33305 -21035 10009 -558 -19926 -9607 14119 13183 -5726 -7853 -17149
10758 -17149 -27834 -35687 -31694 -14933 16852 38017 34564 11526 10366 57 -8694 2073 17576
10745 17576 25452 30709 46675 52485 39317 26668 6383 2373 -296 5210 5874 -1423 1660 36465
10731 36465 32620 20945 21313 16536 12859 21188 19852 27296 33777 5038 -10219 -102 5636 -5569
10717 -5569 -12754 -10219 -20245 -21886 9081 26083 26623 -7715 -34427 -25450 -15750 -41507 -46358
10704 -46358 -26480 -24650 -57520 -55425 -45659 -29150 -19111 -13135 -3171 2935 11587 8809 6994
10691 6994 14631 19794 22066 9388 2710 18603 23827 -2602 -7950 -9121 -16106 -659 7569 1950
$$ packed form
10785C166p721Q801Q101r56j6917K358J3576R976L598j1417k1170o026P370J0493
10771C232n661j5425j5451J2270L1044j0567j9368J0319K3726r36j8909k127r296
10758a7149j0685p853L993J6761L1785K1165l453k3038j160j0309q751J0767J5503
10745A7576P876N257J5966N810j3168j2649k0285m010k669N506O64p297L083L4805
10731C6465l845j1675L68m777l677Q329j336P444O481k8739j5257J0117N738j1205
10717e569p185K535j0026j641L0967J7002N40l4338k6712Q977R700k5757m851
10704d6358J9878J830l2870K095R766J6509J0039N976R964O106Q652k778j815
10691F994P637N163K272j2678o678J5893N224k6429n348j171o985J5447Q228n619
$$ plain form
10677 1950 -5462 -9420 4812 6468 6073 10817 21458 23360 18120 29286 5961 -7362 -9691 999
10663 999 -11131 -10518 4574 -144 -4848 -7610 379 4072 806 -7474 -2589 -7775 -3501 10026
10649 10026 20592 21737 32702 34885 28327 28050 13564 -16697 -33758 -18343 -21084 -24317 -22139
10636 -22139 12348 16356 19111 8647 -4012 -13399 -370 10793 -10918 -10522 6354 -5203 -19069
10623 -19069 -536 34501 35979 17907 8079 1217 -6561 11431 14158 3108 -5832 -13832 -31763
10610 -31763 -22196 -16599 -31820 -23994 -31463 -36663 -26330 -6917 22574 17337 -7169 -15292 -25841
10597 -25841 -15460 -13334 -24146 -39476 -17755 -2292 -6216 -22741 -6161 3301 1407 -12947
10585 -12947 -7708 -6234 -28649 -42531 -23918 -3865 11125 8281 15889 11221 12002 -3458 15172
$$ packed form
10677A950p412l958J4232J656l95M744J0641J902n240J1166k3325j3323k329J0690
10663I99j2130O13J5092m718m704k762P989L693l266q280M885n186M274J3527
10649A0026J0566J145J0965K183o558k77j4486l0261j7061J5415k741l233K178
10636b2139L4487M008K755j0464j2659r387J3029J1163k1711L96J6876j1557j3866
10623a9069J8533L5037J478j8072r828o862p778J7992K727j1050q940q000j7931
10610c1763R567N597j5221P826p469n200J0333J9413K9491n237k4506q123j0549
10597b5841J0381K126j0812j5330K1721J5463l924j6525J6580R462j894j4354
10585a2947N239J474k2415j3882J8613K0053J4990k844P608m668P81j5460J8630
$$ plain form
10572 15172 22727 20432 33130 46743 31869 11574 -2357 762 8616 11567 7283 21390 46412
10559 46412 43117 -1254 -17997 -6032 -3264 317 8474 10884 10684 22442 26261 23135 39486
10546 39486 29450 15243 5462 -32163 -47687 -29185 187 -4019 -17309 -12967 -11968 -21392 -14208
10533 -14208 25532 35927 46961 53442 43771 28734 35732 38873 31478 40101 26919 18001 -4014
10520 -4014 -17340 1930 12476 3054 -7762 -18507 -35084 -35644 -23070 -4075 -8909 -12332 -11138
10507 -11138 -11777 -10597 -28833 -22959 -21906 4875 -12207 -29899 -25141 -11284 -6931 -17292 -11794
10494 -11794 16413 42515 47324 33689 31225 24789 3652 -3917 -8805 -12576 -19980 -24147 -24601 -27073
10480 -27073 -13532 -10420 -17324 -15031 -14620 -629 -22462 -33425 -29043 -24374 -15761 -28249 -14803
$$ packed form
10572A5172P555k295J2698J3613j4874k0295j3931L119P854K951m284J4107K5022
10559D6412l295m4371j6743J1965K768L581Q157K410k00J1758L819l126J6351
10546C9486j0036j4207r781l7625j5524J8502K9372m206j3290M342R99r424P184
10533a4208L9740J0395J1034O481r671j5037O998L141p395Q623j3182q918k2015
10520d014j3326J9270J0546r422j0816j0745j6577n60J2574J8995m834l423J194
10507a1138o39J180j8236N874J053K6781j7082j7692M758J3857M353j0361N498
10494a1794K8207K6102M809j3635k464o436k1137p569m888l771p404m167m54k472
10480b7073J3541L112o904K293M11J3991k1833j0963M382M669Q613j2488J3446
$$ plain form
10467 -14803 -10529 -3847 7598 5590 -4273 18395 36892 18008 6425 219 2049 4543 37752
10454 37752 26561 5488 -886 12459 412 -30224 -37562 -34064 -31109 -26721 -21155 -15113 -11816
10441 -11816 3462 17018 8691 14570 25006 32484 22740 3735 -2356 -1878 -15350 -30517 -22551
10428 -22551 -10400 1075 17253 26784 3237 -8174 3474 -689 -17539 -23076 -27199 -18301 -12334
10415 -12334 -28126 -29266 -11419 -16081 -8214 -9561 -11333 -20379 -40648 -44313 -27945 -13360 10956
10402 10956 -11520 -7891 9376 24877 18874 19230 24746 17006 11751 -12302 -14405 -10252 -21442
10389 -21442 -37991 -23768 -12766 -7106 1203 3159 4391 -5953 -17197 -27380 -7152 -20757
10377 -20757 -22716 -10128 -6136 -17217 -30839 -28861 -19893 -22020 2907 7001 -6282 -11153 -14373
$$ packed form
10467a4803M274O682J1445k008r863K2668J8497j8884j1583o206J830K494L3209
10454C7752j1191k1073o374J3345j2047l0636p338L498K955M388N566O042L297
10441a1816J5278J3556q327N879J0436P478r744j9005o091M78j3472j5167P966
10428b2551J2151J1475J6178R531k3547j1411J1648m163j6850n537m123Q898N967
10415a2334j5792j140J7847m662P867j347j772r046k0269l665J6368J4585K4316
10402A0956k2476L629J7267J5501o003L56N516p740n255k4053k103M153j1190
10389b1442j6549J4223J1002N660Q309J956J232j0344j1244j0183K0228j3605
10377b0757j959J2588L992j1081j3622J978Q968k127K4927M094j3283m871l220
$$ plain form
10364 -14373 -5734 -6239 -22163 -1789 13041 -14175 -25982 -16274 1668 -6177 -13214 -575 6290
10351 6290 -4096 -9785 -18342 -18622 -24512 -27998 -20195 -1961 -5208 -8505 -14542 -14210 -6076 -1933 9263
10336 9263 -13685 -35598 -47698 -25280 -19267 -44232 -53329 -45743 -26603 -16644 6914 25727 33958
10323 33958 35716 27399 42192 47599 39375 38357 24269 11473 981 20054 28126 11947 -9061
10310 -9061 -36560 -41894 -26653 -11480 13274 22512 36356 17599 11380 19231 22009 20249 3908
10297 3908 -2616 -2015 -1187 497 13309 21164 35377 36403 26217 5695 -10481 -26206 -17737 -13921
10283 -13921 -10415 -19465 -30888 -20268 -11297 -485 1608 3396 5700 8738 2984 -10758 -33305
10270 -33305 -4268 32462 33716 11639 6533 14808 27488 21230 -13719 -20138 -21038 -12802 8771
$$ packed form
10364a4373Q639n05j5924K0374J4830k7216j1807R708J7942p845p037J2639O865
10351F290j0386n689q557k80n890l486P803J8234l247l297o037L32Q134M143J1196
10336I263k2948k1913j2100K2418O013k4965r097P586J9140R959K3558J8813Q231
10323C3958J758q317J4793N407q224j018j4088j2796j0492J9073Q072j6179k1008
10310i061k7499n334J5241J5173K4754R238J3844j8757o219P851K778j760j6341
10297C908o524O01Q28J684J2812P855J4213J026j0186k0522j6176j5725Q469L816
10283a3921L506r050j1423J0620Q971J0812K093J788K304L038n754j3742k2547
10270c3305K9037L6730J254k2077n106Q275J2680o258l4949o419r00Q236K1573
$$ plain form
10257 8771 15359 -2366 -13550 -26312 -2693 25586 33101 29953 17190 20178 27203 13613 8659
10244 8659 5694 16804 10000 7919 16435 12175 583 -13751 -6291 8896 10949 13553 1511
10231 1511 -7822 -11873 10409 29619 18029 16865 11362 12043 15829 1960 -19076 -114 9961
10218 9961 17130 20472 9404 -2443 -2103 -8210 -24670 -20999 2998 22105 31763 19953 25793
10205 25793 22617 21499 8773 21666 29438 25925 36233 27113 13289 13420 18114 13579 -14532
10192 -14532 -11688 876 -11640 -28081 -48447 -55031 -48611 -39337 -45178 -38223 -14152 20768 25747
10179 25747 5839 -18512 -17409 -3867 -1496 11740 34735 25029 -5384 -20785 -11631 -14450 -31407
10166 -31407 -15550 -2259 -360 -7870 1247 -4196 -20948 -14924 -9953 -12410 -9824 -1970 -3929 -5966
$$ packed form
10257H771O588j7725j1184j2762K3619K8279P515l148j2763K988P025j3590m954
10244H659k965J1110o804k081Q516m260j1592j4334P460J5187K053K604j2042
10231A511r333m051K2282J9210j1590j164n503O81L786j3869k1036J8962J0075
10218I961P169L342j1068j1847L40o107j6460L671K3997J9107R658j1810N840
10205B5793l176j118j2726J2893P772l513J0308r120j3824J31M694m535k8111
10192a4532K844J2564j2516j6441k0366o584O420R274n841O955K4071L4920M979
10179B5747j9908k4351J103J3542K371J3236K2995r706l0413j5401R154k819j6957
10166c1407J5857J3291J899p510R117n443j6752O024M971k457K586P854j959k037
$$ plain form
10152 -5966 -9290 -12609 8414 -3003 798 1993 -13675 -14928 -21038 -28383 -214 -8170 -11547 -19704
10138 -19704 -11399 -11726 -26199 -26879 -29654 -28705 -30807 -30113 -17890 -12136 -7420 8098 12867 19871 25763
10123 25763 27703 15945 13540 5732 -3624 2739 2777 25594 31151 44360 46688 32030 40975 34736
10109 34736 6645 576 -2803 -11811 -16367 -11450 -10735 -23037 -10584 -6360 5224 17246 7555
10096 7555 1875 -6816 14241 34156 47427 19320 7084 11825 17468 11681 -1656 -12949 5308
10083 5308 3808 5954 16803 20516 29413 34193 44081 32830 12437 11514 12260 30721 26246 22408
10069 22408 28153 22787 23156 27338 16743 37064 66161 59917 51751 46070 55578 80543 105714
10056 105714 127866 167614 255574 394296 470452 377893 253743 171658 122603 85883 71154
$$ packed form
10152e966l324l319K1023j1417L801J195j5668j253o110p345K8169p956l377q157
10138a9704Q305l27j4473o80k775R49k102O94J2223N754M716J5518M769P004N892
10123B5763J940j1758k405p808r356O363L8K2817N557J3209K328j4658Q945o239
10109C4736k8091o069l379r008m556M917P15j2302J2453M224J1584J2022r691
10096G555n680q691K1057J9915J3271k8107j2236M741N643n787j3337j1293J8257
10083E308j500K146J0849L713Q897M780R888j1251k0393r23P46J8461m475l838
10069B2408N745n366L69M182j0595K0321K9097o244q166n681R508K4965K5171
10056A05714K2152L9748Q7960J38722P6156r2559j24150q2085m9055l6720j4729
$$ plain form
10045 71154 65628 50359 64616 67187 76112 71141 62313 51257 38256 21513 32174 27147 23048
10032 23048 15593 21311 20309 17995 24039 23033 9224 -4101 5421 10026 21931 25104 40767
10019 40767 33440 34256 30627 -1845 -14900 11197 22557 34918 27768 31196 23841 12676 18964
10006 18964 34302 19104 5264 13338 2769 -6596 1812 427 6645 1884 23681 24669 13347
9993 13347 -12366 -24014 -10109 -18674 -20916 -15765 10891 25722 26564 34073 30238 23502 25268 8280
9979 8280 19661 42232 39988 39785 33587 20728 22857 21816 -757 -17970 -28868 -2206 32779
9966 32779 16210 -2497 -3627 -4934 13042 19931 33305 37691 30519 30994 32565 19418 14575 8327
9952 8327 -26410 -36032 -17985 -3519 12925 -2233 7703 833 6030 9485 2112 349 4253 -18411
$$ packed form
10045G1154n526j5269J4257K571Q925m971q828j1056j3001j6743J0661n027m099
10032B3048p455N718j002k314O044j006j3809j3325R522M605J1905L173J5663
10019D0767p327Q16l629l2472j3055K6097J1360J2361p150L428p355j1165O288
10006A8964J5338j5198j3840Q074j0569r365Q408j385O218m761K1797R88j1322
9993A3347k5713j1648J3905q565k242N151K6656J4831Q42P509l835o736J766j6988
9979H280J1381K2571k244k03o198j2859K129j041k2573j7213j0898K6662L4985
9966C2779j6569j8707j130j307J7976O889J3374M386p172M75J571j3147m843o248
9952H327l4737r622J8047J4466J6444j5158R936o870N197L455p373j763L904k2664
$$ plain form
9938 -18411 -35402 -8085 -5 -8974 2069 11524 11643 25641 24115 10055 4345 -561 -7635 -9602
9924 -9602 -24479 -19312 -12244 -22964 -15462 -24341 -21330 -21513 -26949 -40074 -37869 -20880 -8418 19973
9910 19973 27036 21699 7589 -4885 -7175 -4456 2590 10961 -10736 6405 16452 -691 3604
9897 3604 21100 26113 17088 -5934 -11555 -20739 -8918 4626 2968 6864 7729 -6454 -5419 33154
9883 33154 21845 9798 20713 22269 20291 9495 12773 5905 9889 1688 6442 6090 18182 5733
9869 5733 9475 26553 29936 22333 11637 -771 5451 14577 26065 47076 38558 32366 33386 17969
9855 17969 31560 49446 45373 28419 17892 15788 28434 40224 54410 30015 34346 44810
9843 44810 14604 1815 9847 19465 1869 -11144 -14753 -15106 1467 -4367 -6892 -3444 -5914 -18880
$$ packed form
9938a8411j6991K7317Q080q969J1043R455J19J3998j526j4060n710m906p074j967
9924i602j4877N167P068j0720P502q879L011j83n436j3125K205J6989J2462K8391
9910A9973P063n337j4110j2474k290K719P046Q371k1697J7141J0047j7143M295
9897C604J7496N013r025k3022n621r184J1821J3544j658L896Q65j4183J035L8573
9883C3154j1309j2047J0915J556j978j0796L278o868L984q201M754l52J2092j2449
9869E733L742J7078L383p603j0696j2408O222R126J1488K1011q518o192J020j5417
9855A7969J3591J7886m073j6954j0527k104J2646J1790J4186k4395M331J0464
9843D4810l0206j2789Q032R618j7596j3013l609l53J6573n834k525L448k470j2966
$$ plain form
9829 -18880 -36374 -25973 -17186 -14532 6479 21937 18290 24427 33024 28312 3298 -6687 -26223
9816 -26223 -35588 -36748 -14466 -12029 -9343 -2331 19320 36807 45420 21218 7712 2971 7552
9803 7552 20851 40608 36886 20661 32911 20506 16981 9344 -15602 -6756 -10315 -6124 27379
9790 27379 18003 -8478 -13555 -6447 -6253 10950 16527 5942 3424 20519 3191 -2303 6795 -10489
9776 -10489 -11902 -5265 -9593 -8277 9616 28674 36029 30039 7791 4333 14907 9089 14623 32190
9762 32190 28448 33530 45484 35503 15815 6386 12141 10139 11329 3545 -4155 8188 24763 18640
9748 18640 -5116 -15114 -11204 8160 11634 6458 9287 -868 15326 -1090 -9211 3676 6570
9735 6570 3667 12864 -310 -12684 -8771 4446 13033 26108 38712 43007 58859 54403 32958
$$ packed form
9829a8880j7494J0401Q787K654K1011J5458l647O137Q597m712k5014r985j9536
9816b6223r365j160K2282K437K686P012K1651J7487Q613k4202j3506m741M581
9803G552J3299J9757l722j6225J2250j2405l525p637k4946Q846l559M191L3503
9790B7379r376k6481n077P108J94J7203N577j0585k518J7095j7328n494R098j7284
9776a0489j413O637m328J316J7893J9058P355n990k2248l458J0574n818N534J7567
9762C2190l742N082J1954r981j9688r429N755k002J190p784p700J2343J6575o123
9748A8640k3756r998L910J9364L474n176K829j0155J6194j6416q121J2887K894
9735F570k903R197j3174j2374L913J3217Q587J3075J2604M295J5852m456k1445
$$ plain form
9722 32958 22736 20799 13255 1752 -17498 -14062 -1060 730 -12943 -29691 -31359 -18344 -12511
9709 -12511 -2237 4437 -19019 -28805 -29254 -41513 -34990 -20592 6130 13402 13853 30854 42580
9696 42580 24458 10183 687 -925 -20400 -11105 -8018 -5695 -13676 -4782 -11282 -15267 -23119 7038
9682 7038 7383 -26268 -56976 -27507 13551 30990 28630 -2288 6566 17782 23016 34317 57504
9669 57504 40631 23032 287 -11946 10708 -1497 -6291 -1180 -3618 -5388 5723 17571 15766
9656 15766 -12617 6033 22059 12713 -165 -13966 -14079 3693 28234 8167 5741 14817 28618
9643 28618 30925 35883 33572 19741 17626 1780 -6293 -1042 -12672 -12234 -2512 -42 -10594 -14036
9629 -14036 -21032 -25398 -2597 16259 26750 21342 30173 18923 18398 45181 55756 25211 19769
$$ packed form
9722C2958j0222j937p544j1503j9250L436J3002J790j3673j6748j668J3015N833
9709a2511J0274O674k3456r786m49j2259O523J4398K6722P272M51J7001J1726
9696D2580j8122j4275r496j612j9475R295L087K323p981Q894o500l985p852L0157
9682G038L45l3651l0708K9469M1058J7439k360l0918Q854J1216N234J1301K3187
9669E7504j6873j7599k2745j2233K2654j2205m794N111k438j770J1111J1848j805
9656A5766k8383J8650J6026r346j2878j3801j13J7772K4541k0067k426R076J3801
9643B8618K307M958k311j3831k115j5846q073N251j1630M38R722K470j0552l442
9629a4036o996m366K2801J8856J0491n408Q831j1250n25K6783J0575l0545n442
$$ plain form
9616 19769 14676 1213 7919 30713 43568 33592 35688 41579 24170 10774 1617 1883 299 820
9602 820 -1917 -13070 -18963 6273 24514 4252 10983 35930 32328 30806 21834 7848 7191 -8684
9588 -8684 -27596 -32149 -35711 -10356 -4307 -8435 17292 5141 938 799 1654 2463 20178 16625
9574 16625 10544 10161 21551 39613 57832 44868 47431 45173 41237 28584 26134 34648 30909 41182
9560 41182 30340 4856 6743 25784 38018 35978 20838 29922 21240 16311 21922 35041 25927
9547 25927 19877 19677 9529 14993 -1693 9506 28558 32226 39843 33310 37294 21993 17931 31120
9533 31120 29497 29898 46835 62228 70632 62434 53470 38145 41828 52379 45734 38477 42535 39995
9519 39995 22657 13729 20916 8688 -2805 7342 2025 -18856 -22490 -12843 -10703 20271 21603
$$ packed form
9616A9769n093j3463O706K2794J2855r976K096N891j7409j3396r157K66j584N21
9602H20k737j1153n893K5236J8241k0262O731K4947l602j522q972j3986o57j5875
9588h684j8912m553l562K5355O049m128K5727j2151m203j39Q55Q09J7715l553
9574A6625o081l83J1390J8062J8219j2964K563k258l936j2653k450Q514l739J0273
9560D1182j0842k5484J887J9041J2234k040j5140R084q682m929N611J3119r114
9547B5927o050k00j0148N464j6686J1199J9052L668P617o533L984j5301m062J3189
9533C1120j623M01J6937J5393Q404q198q964j5325L683J0551o645p257M058k540
9519C9995j7338q928P187j2228j1493J0147n317k0881l634R647K140L0974J332
$$ plain form
9506 21603 23052 37594 47346 55044 29218 7249 9081 19763 29684 21931 441 9868 10448 -4616
9492 -4616 6914 5483 -7824 -12174 7100 5250 6931 9906 19784 40304 47776 40551 14900 6037
9478 6037 17559 17819 12174 7287 10391 -2475 16367 11177 -8568 -19942 -24220 -1861 2121 117
9464 117 5445 15920 8471 6088 19436 20923 30843 29238 30903 23950 16713 25769 13939 -4577
9450 -4577 -15017 13237 34758 35172 34058 29366 35667 44629 40225 35278 32145 22531 13585 3215
9436 3215 1224 -467 -17471 -11663 3271 20903 13241 2952 5025 4972 -14272 -15654 -28467 -21324
9422 -21324 -6072 3218 3570 -4884 -2780 5857 9778 -5863 1261 10368 6383 -2960 3369 12822
9408 12822 7377 26629 43420 48312 30294 26151 13532 13963 13287 1489 -8893 -7181 -11720 -8598
$$ packed form
9506B1603J449J4542R752P698k5826k1969J832J0682R921p753k1490R427N80j5064
9492d616J1530j431j3307m350J9274j850J681K975R878K0520P472p225k5651q863
9478F037J1522K60n645m887L104j2866J8842n190j9745j1374m278K2359L982k004
9464A17N328J0475p449k383J3348J487R920j605J665o953p237R056j1830j8516
9450d577j0440K8254K1521M14j114m692O301Q962m404m947l133r614q946j0370
9436C215j991j691j7004N808J4934J7632p662j0289K073n3j9244j382j2813P143
9422b1324J5252R290L52q454K104Q637L921j5641P124R107l985r343O329R453
9408A2822n445J9252J6791M892j8018m143j2619M31o76j1798j0382J712m539L122
$$ plain form
9394 -8598 -7585 1406 12356 15922 30630 51045 57057 45217 16265 -9301 -8454 21198 28277
9381 28277 30925 45725 60341 51162 29036 19072 10571 21258 30154 19120 -6986 -2617 19127
9368 19127 12264 -1545 -6711 -6832 1829 9271 10588 23836 46427 30602 34966 48195 51437 22644
9354 22644 1165 -1172 13907 18083 19203 26852 30903 24887 30772 54196 59225 39087 31929 31610
9340 31610 14063 24310 21869 26673 35721 37160 44104 47536 41686 41777 40733 29061 7816 -1151
9326 -1151 1991 16215 35653 22725 28633 27820 35137 48978 48453 21011 362 2642 16288 3246
9312 3246 13723 2089 -656 26466 38713 19183 38698 40122 48162 51989 30582 28389 23976
9299 23976 10567 32354 33100 16622 15632 23458 5966 7546 24521 39407 49414 49276 40467 28142
$$ packed form
9394h598J013Q991J0950L566J4708K0415O012j1840k8952k5566Q47K9652P079
9381B8277K648J4800J4616r179k2126r964q501J0687Q896j1034k6106M369K1744
9368A9127o863j3809n166j21Q661P442J317J3248K2591j5825M364J3229L242k8793
9354B2644k1479k337J5079M176J120P649M051o016N885K3424N029k0138p158l19
9340C1610j7547J0247k441M804R048J439O944L432n850R1j044j1672k1245q967
9326a151L142J4224J9438j2928N908q13P317J3841n25k7442k0649K280J3646j3042
9312C246J0477j1634k745K7122J2247j9530J9515J424Q040L827k1407k193m413
9299B3976j3409K1787P46j6478r90P826j7492J580J6975J4886J0007j38q809j2325
$$ plain form
9285 28142 25357 22295 41914 67367 45954 33844 22826 4818 -1831 940 -6767 11465 26282
9272 26282 33881 27539 14788 10843 23324 21510 42342 35329 38542 29550 14519 21111 16604 34740
9258 34740 46513 50781 44171 25165 -5765 -8695 4426 32733 33682 12981 3398 14088 27745
9245 27745 19805 5327 -5303 -18014 -6027 23732 49440 67991 71831 79057 76301 71296 80077
9232 80077 81285 58719 56578 72930 77553 67100 48841 30149 44468 45864 42885 47165 42661
9219 42661 50125 56893 54858 45068 39386 50758 30198 2416 -1170 20100 38886 57806 72245
9206 72245 84793 99123 102888 97589 68195 53666 60160 72879 91309 84252 93475 92091 96256
9193 96256 102216 115536 126639 123121 119983 115727 146256 180397 225756 275632 323104 361373 422290
$$ packed form
9285B8142k785l062J9619K5453k1413j2110j1018j8008o649K771p707J8232J4817
9272B6282P599o342j2751l945J2481j814K0832p013L213q992j5031O592m507J8136
9258C4740J1773M268o610j9006l0930k930J3121K8307R49k0701r583J0690J3657
9245B7745p940j4478j0630j2711J1987K9759K5708J8551L840P226k756n005Q781
9232H0077J208k2566k141J6352M623j0453j8259j8692J4319J396k979M280m504
9219D2661P464O768k035r790n682J1372k0560k7782l586K1270J8786J8920J4439
9206G2245J2548J4330L765n299k9394j4529O494J2719J8430p057R223j384M165
9193I6256N960J3320J1103l518l138m256L0529L4141M5359M9876M7472L8269O0917
$$ plain form
9180 422290 509617 629248 763141 925059 1095785 1255736 1399552 1487485 1526410 1503945
9170 1503945 1425929 1284272 1118946 957340 840970 734786 652490 565225 477397 432945
9160 432945 408580 362978 341072 320849 293598 276031 274738 275394 255209 241399 247863 257790 254520
9147 254520 240262 215648 199314 195277 209497 203971 191497 192679 184378 179901 171579 176157 177088
9134 177088 187506 182714 171848 178380 170468 173810 173189 166614 169754 173833 162658 135900 141948 144767
9120 144767 155388 139702 131766 134583 162794 175353 161187 151138 159802 174818 193225 216317
9108 216317 242047 267097 265301 239506 247902 264918 264755 272638 291838 302782 327629 351944 416218
9095 416218 491230 573477 678034 824821 1034419 1302818 1697228 2263274 3142774 4634424
$$ packed form
9180D22290Q7327J19631J33893J61918J70726J59951J43816Q7933L8925k2465
9170A503945p8016j41657j65326j61606j16370j06184q2296q7265q7828m4452
9160D32945k4365m5602k1906k0223k7251j7567j293O56k0185j3810O464R927l270
9147B54520j4258k4614j6334m037J4220n526j2474J182q301m477q322M578R31
9134A77088J0418m792j0866O532p912L342o21o575L140M079j1175k6758O048K819
9120A44767J0621j5686p936K817K8211J2559j4166j0049Q664J5016J8407K3092
9108B16317K5730K5050j796k5795Q396J7016j63P883J9200J0944K4847K4315O4274
9095D16218P5012Q2247J04557J46787K09598K68399L94410N66046Q79500J491650
$$ plain form
9085 4634424 7040062 10423677 13372709 12454222 9496093 7040467 5129737 3798858
9077 3798858 2938807 2353958 1937189 1627681 1405765 1232498 1077996 956088 855061 781081
9067 781081 737686 704084 674359 636806 603557 586040 578883 565035 546359 515194 485941 508910
9055 508910 533945 539467 524658 500576 489793 469631 453513 467410 473975 474762 476502 481588 482519
9042 482519 477061 468112 444290 442001 447777 449968 459129 454364 464942 485357 508576 533526 571841
9029 571841 613074 621803 626516 608962 586026 569031 531783 480339 431523 399313 358738 326012
9017 326012 287056 270190 269191 272695 274762 255396 249532 239902 230791 217130 201498 182534 184189
9004 184189 172318 163010 140714 142012 130322 137904 144282 119402 99605 94741 93817 101708 110288
$$ packed form
9085D634424K405638L383615K949032r18487k958129k455626j910730j330879
9077C798858q60051n84849m16769l09508k21916j73267j54502j21908j01027p3980
9067G81081m3395l3602k9725l7553l3249j7517p157j3848j8676l1165k9253K2969
9055E08910K5035N522j4809k4082j0783k0162j6118J3897O565P87J740N086R31
9042D82519n458q949k3822k289N776K191R161m765J0578K0415K3219K4950L8315
9029E71841M1233Q729M713j7554k2936j6995l7248n1444m8816l2210m0575l2726
9017C26012l8956j6866r99L504K067j9366n864r630r111j3661j5632j8964J655
9004A84189j1871r308k2296J298j1690P582O378k4880j9797m864r24P891Q580
$$ plain form
8991 110288 113607 109619 122683 124516 143572 137387 123622 119725 112514 91648 93898 99096 107028
8978 107028 84059 63613 76899 93153 88553 100420 128104 148385 134657 113865 103511 104415
8966 104415 98478 69580 38969 37405 34410 35484 54538 79442 79592 91133 107887 104869 119961
8953 119961 145434 158626 166399 178087 186210 168843 136585 125699 124342 149995 149144 144833 165825
8940 165825 185138 180967 153801 146534 159309 154385 152584 142436 128443 134455 106079 87441 97269
8927 97269 95270 104526 130601 148501 173282 179449 181108 207634 202428 203645 221704 246554 235717
8914 235717 223096 231690 244016 284740 306424 317129 330741 359242 377519 399164 426259 459948
8902 459948 474027 473120 469244 491537 504858 505011 508805 519110 512076 478385 441916 425208 402225
$$ packed form
8991A10288L319l988J3064J833J9056o185j3765l897p211k0866K250N198P932
8978A07028k2969k0446J3286J6254m600J1867K7684K0281j3728k0792j0354R04
8966A04415n937k8898l0611j564k995J074J9054K4904J50J1541J6754l018J5092
8953A19961K5473J3192P773J1688Q123j7367l2258j0886j357K5653q51m311K0992
8940A65825J9313m171k7166p267J2775m924j801j0148j3993O012k8376j8638R828
8927I7269j999R256K6075J7900K4781O167J659K6526n206J217J8059K4850j0837
8914B35717j2621Q594J2326M0724K1684J0705J3612K8501J8277K1645K7095L3689
8902D59948J4079r07l876K2293J3321J53L794J0305p034l3691l6469j6708k2983
$$ plain form
8889 402225 373164 372103 369309 364815 352293 370941 357746 346503 342590 351773 361597 363537 409582
8876 409582 447123 447227 455364 466587 493030 513586 533639 543052 530216 535956 547496 550213 587972
8863 587972 655458 707051 715091 743427 790038 804596 824044 858269 884969 924152 971773 1006653
8851 1006653 1031532 1057964 1092468 1111221 1112531 1136317 1161025 1182337 1225215 1260008 1270371 1299034
8839 1299034 1312416 1317460 1313047 1341221 1376411 1411529 1467155 1524285 1591693 1681157 1767106 1863163
8827 1863163 1934750 2003433 2086774 2175172 2247924 2290919 2297525 2306982 2341559 2408048 2482033 2559259
8815 2559259 2651358 2740063 2839324 2939367 3071050 3213802 3372978 3529444 3692369 3907454
8805 3907454 4154591 4427506 4733276 5087257 5513146 5985028 6510030 7098427 7756239 8508841
$$ packed form
8889D02225k9061j061k794m494j2522J8648j3195j1243l913R183R824J940M6045
8876D09582L7541J04Q137J1223K6443K0556K0053R413j2836N740J1540K717L7759
8863E87972O7486N1593Q040K8336M6611J4558J9448L4225K6700L9183M7621L4880
8851A006653K4879K6432L4504J8753J310K3786K4708K1312M2878L4793J0363K8663
8839A299034J3382N044m413K8174L5190L5118N5626N7130O7408Q9464Q5949R6057
8827A863163P1587O8683Q3341Q8398P2752M2995O606R457L4577O6489P3985P7226
8815B559259R2099Q8705R9261J00043J31683J42752J59176J56466J62925K15085
8805C907454K47137K72915L05770L53981M25889M71882N25002N88397O57812P52602
$$ plain form
8795 8508841 9382299 10389884 11552133 12937137 14628216 16762845 19474245 22769780
8787 22769780 26589988 30952887 36083177 42490578 50968192 62650886 79166928 103162745
8779 103162745 138805768 191515684 264941015 351859964 416901288 410266898 346706006
8772 346706006 274785369 212577581 164194255 128992759 104053898 86365018 73683587
8765 73683587 64394571 57185065 51209104 46265306 42206790 38674549 35394090 32427864
8757 32427864 29826734 27606881 25759609 24287898 23179737 22301189 21695661 21420583 21521039
8748 21521039 22006171 22779397 23196023 22479341 21148559 19936126 18930872 18196565 17754748
8739 17754748 17522528 17409137 17308512 17045511 16554699 15883704 15148342 14386835 13638260
$$ packed form
8795H508841Q73458J007585J162249J385004J691079K134629K711400L295535
8787B2769780L820208M362899N130290O407401Q477614J1682694J6516042K3995817
8779A03162745L5643023N2709916P3425331Q6918949O5041324o634390o3560892
8772C46706006p1920637o2207788m8383326l5201496k4938861j7688880j2681431
8765G3683587r289016p209506n975961m943798m058516l532241l280459k966226
8757C2427864k601130k219853j847272j471711j108161q78548o05528k75078J00456
8748B1521039M85132P73226M16626p16682j330782j212433j005254p34307m41817
8739A7754748k32220j13391j00625k63001m90812o70995p35362p61507p48575
$$ plain form
8730 13638260 12930557 12209970 11530928 10896935 10334272 9816470 9356731 8918426 8522518
8721 8522518 8156184 7792158 7457424 7124794 6801722 6485297 6178041 5916259 5649057 5390707
8711 5390707 5158105 4920999 4692580 4468965 4272453 4084886 3921671 3757983 3592632 3423578
8701 3423578 3272572 3136367 2979444 2848646 2735802 2625452 2536449 2438014 2323764 2244352
8691 2244352 2173688 2077781 1979428 1908627 1832973 1757458 1691712 1639602 1552170 1495466 1424646
8680 1424646 1367026 1322509 1250327 1203015 1163023 1100650 1045823 1003829 983158 968495 958428
8669 958428 949690 959384 933652 889305 851749 827950 795516 781623 770334 757979 735803 710003
8657 710003 682076 670166 670433 714031 770904 840803 867353 862985 837253 753513 687315 674622
$$ packed form
8730A3638260p07703p20587o79042o33993n62663n17802m59739m38305l95908
8721H522518l66334l64026l34734l32630l23072l16425l07256k61782k67202k58350
8711E390707k32602k37106k28419k23615j96512j87567j63215j63688j65351j69054
8701C423578j51006j36205j56923j30798j12844j10350q9003r8435j14250p9412
8691B244352p0664r5907r8353p0801p5654p5515o5746n2110q7432n6704p0820
8680A424646n7620m4517p2182m7312l9992o2373n4827m1994k0671j4663j0067
8669I58428q738R694k5732m4347l7556k3799l2434j3893j1289j2355k2176k5800
8657G10003k7927j1910K67M3598N6873O9899K6550m368k5732q3740o6198j2693
$$ plain form
8645 674622 646696 638300 588444 514490 475585 455490 430934 407167 404518 384635 370772 341092
8633 341092 322361 309792 278084 245698 254717 275779 273522 262763 274806 300532 314806 308835
8621 308835 302229 316927 317881 312727 311410 283903 280403 291263 294747 294171 319047 329148 321753 333354
8607 333354 365172 386912 424821 448406 444331 431851 417769 403810 426406 434435 449511 481346
8595 481346 498572 505286 513522 521918 520266 519671 513298 508572 509046 512113 493090 478354 469912 448042
8581 448042 433509 392833 374574 356985 371215 407739 399487 414309 435614 431544 439905 451345
8569 451345 441027 418688 380688 354175 332605 325713 325466 317165 299832 295207 291402 301082 313448
8556 313448 328943 316261 308219 314684 311561 291074 245684 226929 220321 212644 213192 212562 209854 206130
$$ packed form
8645F74622k7926q396m9856p3954l8905k0095k4556k3767k649j9883j3863k9680
8633C41092j8731j2569l1708l2386R019K1062k257j0759J2043K5726J4274n971
8621C08835o606J4698R54n154j317k7507l500J0860L484n76K4876J0101p395J1601
8607C33354L1818K1740L7909K3585m075j2480j4082j3959K2596Q029J5076L1835
8595D81346J7226O714Q236Q396j652n95o373m726M74L067j9023j4736q442k1870
8581D48042j4533m0676j8259j7589J4230L6524q252J4822K1305m070Q361J1440
8569D51345j0318k2339l8000k6513k1570o892k47q301j7333m625l805R680J2366
8556C13448J5495j2682q042O465l123k0487m5390j8755o608p677N48o30k708l724
$$ plain form
8542 206130 187975 171969 180432 185195 184087 178325 174139 172582 164764 173375 188448 191044 211369
8529 211369 213981 235432 241485 206351 190282 184023 168594 165686 202324 216746 200507 179701
8517 179701 199688 208869 190145 182879 146529 105723 120107 126165 113748 107994 110561 113230 122031
8504 122031 121498 117160 132893 115531 104838 102291 89377 85065 57570 47293 51740 50191 44813
8491 44813 29582 22232 32209 29615 28123 34902 60253 75011 100473 100373 94984 94785 77025 80219
8477 80219 71733 60993 67000 78366 54469 73672 81532 88627 97120 104325 96410 77110 60656
8464 60656 43547 43439 49317 55999 51549 64472 89573 101608 94194 94590 89243 95864 112100 117194
8450 117194 101319 101240 107038 123913 111911 108365 91891 88731 92429 104480 99919 78097 92598
$$ packed form
8542B06130j8155j6006Q463M763j108n762m186j557p818Q611J5073K596K0325
8529B11369K612K1451O053l5134j6069o259j5429k908L6638J4422j6239k0806
8517A79701J9987R181j8724p266l6350m0806J4384O058j2417n754K567K669Q801
8504A22031n33m338J5733j7362j0693k547j2914m312k7495j0277M447j549n378
8491D4813j5231p350R977k594j492O779K5351J4758K5462j00n389j99j7760L194
8477H0219q486j0740O007J1366k3897J9203P860P095Q493P205p915j9300j6454
8464F0656j7109j08N878O682m450J2923K5101J2035p414L96n347O621J6236N094
8450A17194j5875p9N798J6875j2002l546j6474l160L698J2051m561k1822J4501
$$ plain form
8437 92598 116641 114917 125672 124302 113060 112246 121686 123681 122087 114300 114751 120754 114425 99764
8423 99764 97740 109985 104998 107488 111223 105492 119510 109545 105736 90495 90819 104055 109504 108031
8409 108031 92678 90998 68013 57934 64800 69601 56674 55732 83545 71630 77070 64842 72406
8396 72406 89805 95529 85059 85887 99101 94261 80993 97723 128749 153729 169659 211183 242454
8383 242454 269624 310724 347176 411755 518144 630932 755847 925304 1095102 1239650
8373 1239650 1392564 1478711 1502607 1482280 1395414 1280713 1120539 975928 837240 693547
8363 693547 565378 481354 418634 368011 346076 305552 272248 267985 245758 210306 163461 149342
8351 149342 150682 160253 165461 155871 143828 140179 161639 160588 160819 158851 145695 157291 149709 149094
$$ packed form
8437I2598K4043j724J0755j370j1242q14R440J995j594p787M51O003o329j4661
8423I9764k024J2245m987K490L735n731J4018r965l809j5241L24J3236N449j473
8409A08031j5353j680k2985j0079O866M801j2927r42K7813j1915N440j2228P564
8396G2406J7399N724j0470Q28J3214m840j3268J6730L1026K4980J5930M1524L1271
8383B42454K7170M1100L6452O4579J06389J12788J24915J69457J69798J44548
8373A239650J52914Q6147K3896k0327q6866j14701j60174j44611j38688j43693
8363F93547j28169q4024o2720n0623k1935m0524l3304m263k2227l5452m6845j4119
8351A49342J340R571N208r590j2043l649K1460j051K31j968j3156J1596p582o15
$$ plain form
8337 149094 176027 154752 135096 114049 131958 132958 125894 151254 156169 158902 144668 106553
8325 106553 87292 73406 66290 71092 81412 89787 69614 61050 68322 83947 73103 70604 79829
8312 79829 55709 29533 32902 49205 62477 71072 62148 61548 69935 68612 72731 73815 59716 65299
8298 65299 73051 44815 21041 18883 25905 22675 8644 18061 29344 47691 57221 64967 41705
8285 41705 38065 45005 35857 27375 46744 54569 47278 52431 54271 25692 14404 24682 60864
8272 60864 71697 79049 49725 36105 45345 44292 31551 27703 6025 7470 7864 28859 50644
8259 50644 55600 40972 27749 17064 6509 8212 19115 -5876 -21299 -14174 14144 2556
8247 2556 -3630 13678 23697 25589 17522 29206 32059 31474 22501 -3 -5679 -2558 14227 21436
$$ packed form
8337A49094K6933k1275j9656k1047J7909J000p064K5360M915K733j4234l8115
8325A06553j9261j3886p116M802J0320Q375k0173q564P272J5625j0844k499R225
8312G9829k4120k6176L369J6303J3272Q595q924o00Q387j323M119J084j4099N583
8298F5299P752k8236k3774k158P022l230j4031R417J1283J8347R530P746k3262
8285D1705l640O940r148q482J9369P825p291N153J840k8579j1288J0278L6182
8272F0864J0833P352k9324j3620R240j053j2741l848k1678J445L94K0995K1785
8259E0644M956j4628j3223j0685j0555J703J0903k4991j5423P125K8318j1588
8247B556o186J7308J0019J892q067J1684K853n85q973k2504n676L121J6785P209
$$ plain form
8233 21436 34738 37015 41700 31509 20188 33266 31948 8542 21127 20240 10304 -1705 7054
8220 7054 20691 18481 20377 15367 10266 13549 30854 30190 34608 54111 52759 40390 26885 20965
8206 20965 8033 24516 17460 5161 7263 8385 22057 25963 26835 25534 35381 34674 21722 24539
8192 24539 38610 23259 21923 46447 58116 59859 33998 3800 29988 28705 -2684 -12816
8180 -12816 5878 21376 10205 19258 37172 32491 17235 5638 -723 -6496 -12262 6477 30285
8167 30285 33768 20906 -1921 11442 34611 50726 42624 27726 44744 33698 23561 19702
8155 19702 29056 12147 5768 3246 4280 -5971 10093 16977 27543 33805 19573 7778 3595
8142 3595 38436 37290 27511 10040 6403 6637 -20056 -41627 -56326 -46125 -27251 -3278 21464
$$ packed form
8233B1436J3302K277M685j0191j1321J3078j318k3406J2585q87r936j2009Q759
8220G054J3637k210J896n010n101L283J7305o64M418J9503j352j2369j3505n920
8206B0965j2932J6483p056j2299K102J122J3672L906Q72j301R847p07j2952K817
8192B4539J4071j5351j336K4524J1669J743k5861l0198K6188j283l1389j0132
8180a2816J8694J5498j1171R053J7914m681j5256j1597o361n773n766J8739K3808
8167C0285L483j2862k2827J3363K3169J6115q102j4898J7018j1046j0137l859
8155A9702R354j6909o379k522J034j0251J6064O884J0566O262j4232j1795m183
8142C595L4841j146r779j7471l637K34k6693k1571j4699J0201J8874K3973K4742
$$ plain form
8129 21464 30016 20705 34436 29504 24408 10618 184 3305 28863 30353 21861 6804 4377
8116 4377 16368 38666 44768 45047 44468 29700 42168 33317 22067 -5069 -16977 12362 17656
8103 17656 -2856 -11708 -4061 14031 31539 21942 21724 32150 18720 28187 8655 -4 10982
8090 10982 33942 18497 -924 13918 17515 19915 26501 34098 28135 22161 29456 14018 -12880
8077 -12880 -1795 -7967 2196 -1380 3251 -1789 17503 24072 34521 40153 41166 25538 10233
8064 10233 7337 111 -13243 -469 16098 48723 32855 10955 -1886 -16338 -24028 -23433 -19784
8051 -19784 -26005 -26632 2382 19724 18606 20007 -7362 -36513 -42293 -44855 -15236 -11943 -25449
8038 -25449 -22465 -6206 25371 19120 -13328 -8542 15431 21806 -18346 -34856 -30969 -7999 10655
$$ packed form
8129B1464Q552r311J3731m932n096j3790j0434L121K5558J490q492j5057k427
8116D377J1991K2298O102K79n79j4768J2468q851j1250k7136j1908K9339N294
8103A7656k0512q852P647J8092J7508r597k18J0426j3430R467j9532q659J0986
8090A0982K2960j5445j9421J4842L597K400O586P597n963n974P295j5438k6898
8077a2880J1085o172J0163l576M631n040J9292O569J0449N632J013j5628j5305
8064A0233k896p226j3354J2774J6567L2625j5868k1900j2841j4452p690N95L649
8051a9784o221o27K9014J7342j118J401k7369k9151n780k562K9619L293j3506
8038b5449K984J6259L1577o251l2448M786K3973O375m0152j6510L887K2970J8654
$$ plain form
8025 10655 6573 9755 -2973 -11325 -24537 -27976 -28695 -16249 2282 1027 -3536 12160 -10605
8012 -10605 -42380 -28488 8983 36134 38738 -2670 2160 32545 34000 7222 -479 -14228 -40197
7999 -40197 -24466 12158 10944 5044 -1845 -4043 -10181 -16748 -21956 4635 22083 15433 20266 -1801
7985 -1801 -26046 -16815 5414 12981 4592 17135 21435 12018 -1360 -3483 -5705 -14541 -2761 12808
7971 12808 4643 -11218 -12057 -3950 15742 31971 27070 34711 54149 36840 23119 5026 9587
7958 9587 26797 18348 8915 13888 14445 17603 9229 -5525 -570 30783 49527 48311 36432 3550
7944 3550 -5015 15007 30434 30771 48746 52392 25660 23018 36269 32599 21996 14552 18773 16684
7930 16684 -8971 -26008 -22863 -13534 2816 -12349 -45215 -43111 -28817 -5168 14457 7620 -2839
$$ packed form
8025A0655m082L182j2728q352j3212l439p19J2446J8531j255m563J5696k2765
8012a0605l1775J3892L7471K7151K604m1408M830L0385J455k6778p701j3749k5969
7999d0197J5731L6624j214n900o889k198o138o567n208K6591J7448o650M833k2067
7985a801k4245R231K2229P567q389J2543M300r417j3378k123k222q836J1780J5569
7971A2808q165j5861q39Q107J9692J6229m901P641J9438j7309j3721j8093M561
7958I587J7210q449r433M973N57L158q374j4754M955L1353J8744j216j1879l2882
7944C550q565K0022J5427L37J7975L646k6732k642J3251l670j0603p444M221k089
7930A6684k5655j7037L145R329J6350j5165l2866K104J4294K3649J9625o837j0459
$$ plain form
7917 -2839 2143 8156 -18615 -25208 -12018 -9554 2522 1396 -16200 -21708 -9043 11746 9801
7904 9801 1108 -7768 -17824 -15040 -7114 5800 17027 31672 39130 40700 22212 10168 27821
7891 27821 21433 -4054 -16573 -10625 -7391 2473 5196 -13291 -8137 606 -1805 4426 -2145 2370
7877 2370 4136 -9342 -11213 -1104 -4082 -11486 7230 32468 19025 14492 20358 3259 -19892
7864 -19892 -31113 -26564 -34301 -26085 -16219 2886 5722 -8161 -20166 -11862 4918 9596 -16499
7851 -16499 -22144 870 7065 -9226 -20623 -7829 -12646 -20980 -11104 12979 23302 12163 -8589
7838 -8589 -13087 -4419 -2187 6492 -6493 -14147 -20718 -21162 -14954 -10551 -14112 -36101 -29799 -26180 -30794
7823 -30794 -14226 19225 40489 49030 58102 31614 -223 -3895 14407 20038 23214 23862 8301
$$ packed form
7917b839M982O013k6771o593J3190K464J2076j126j7596n508J2665K0789j945
7904I801q693q876j0056K784P926J2914J1227J4645P458J570j8488j2044J7653
7891B7821o388k5487j2519N948L234R864K723j8487N154Q743k411O231o571M515
7877B370J766j3478j871J0109k978p404J8716K5238j3443m533N866j7099k3151
7864a9892j1221M549p737Q216R866J9105K836j3883j2005Q304J6780M678k6095
7851a6499n645K3014O195j6291j1397J2794m817q334R876K4083J0323j1139k0752
7838h589m498Q668K232Q679j2985p654o571m44O208M403l561k1989O302L619m614
7823c0794J6568L3451K1264Q541R072k6488l1837l672J8302N631L176O48j5561
$$ plain form
7810 8301 3441 -17055 -23013 -3087 8471 22499 47929 32546 12883 14410 -504 1283 -11903
7797 -11903 -11866 -5936 -22909 -29576 -45659 -32976 -19703 -16645 -29976 -34507 -19905 -7695 16932
7784 16932 28086 1025 -18085 -6905 1453 -5582 -2376 5444 18340 4555 360 -3921 2656
7771 2656 2570 -10916 -24080 -28077 -19654 -3523 386 671 7396 2457 480 -7212 -7516 -12040 -22296
7756 -22296 -14413 4439 14760 23720 13827 4968 5175 -10957 -6190 10165 2055 -6231 -4308 -16866
7742 -16866 -15186 -5833 9377 -4940 -13531 -24672 -15771 -18466 -29424 -23886 -17611 -28044 -28421 -22496
7728 -22496 -13641 -18357 -1049 9772 15171 34886 24293 10756 20878 6228 -13166 -20892 -5971
7715 -5971 7323 17 -8424 -10942 -10595 -15735 -17310 -3320 -2062 -6260 -17888 -16383 -13762 -2846
$$ packed form
7810H301m860k0496n958J9926J1558J4028K5430j5383j9663J527j4914J787j3186
7797a1903L7N930j6973o667j6083J2683J3273L058j3331m531J4602J2210K4627
7784A6932J1154k7061j9110J1180Q358p035L206P820J2896j3785m195m281O577
7771B656q6j3486j3164l997Q423J6131L909K85O725m939j977p692l04m524j0256
7756b2296P883J8852J0321Q960r893q859K07j6132M767J6355q110q286J923j2558
7742a6866J680R353J5210j4317q591j1141Q901k695j0958N538O275j0433l77N925
7728b2496Q855m716J7308J0821N399J9715j0593j3537J0122j4650j9394p726J4921
7715e971J3294p306q441k518L47n140j575J3990J258m198j1628J505K621J0916
$$ plain form
7701 -2846 -20922 -36251 -23404 -18766 -38700 -23493 -2718 24832 24156 30123 41015 40500 34663
7688 34663 31540 39446 42700 25544 14384 18613 11327 3510 2711 -8015 -832 5169 -3682 3815
7674 3815 1964 6421 15581 26933 -4229 12270 17440 8638 12444 432 -11020 -4886 7529
7661 7529 4374 -4164 -12061 -20672 -27838 -27299 -24932 -12946 -11038 -17754 -23620 -34116 -29626 -28514 -40735
7646 -40735 -25011 -14471 -20407 -13748 -4862 12773 28041 32124 33198 14761 12123 178 -11761
7633 -11761 -14926 -6532 7066 26824 15205 -1413 -414 -7382 -8809 -7095 -3321 -15533 4125
7620 4125 14857 17046 -1501 3062 5228 -12137 -13670 -8757 -9359 -23220 -50969 -61617 -60050 -37598
7606 -37598 -20290 -7737 15078 -101 4131 6806 11225 9184 402 -23277 -29780 -40948 -38585
$$ packed form
7701b846j8076j5329J2847M638j9934J5207K0775K7550o76N967J0892n15n837
7688C4663l123P906L254j7156j1160M229p286p817p99j0726P183O001q851P497
7674C815j851M457R160J1352l1162J6499N170q802L806j2012j1452O134J2415
7661G529l155q538p897q611p166N39K367J1986J908o716n866j0496M490J112j2221
7646d0735J5724J0540n936O659Q886J7635J5268M083J074j8437k638j1945j1939
7633a1761l165Q394J3598J9758j1619j6618R99o968j427J714L774j2212J9658
7620D125J0732K189j8547M563K166j7365j533M913o02j3861k7749j0648J567K2452
7606c7598J7308J2553K2815j5179M232K675M419k041q782k3679o503j1168K363
$$ plain form
7593 -38585 -2288 16810 -5040 -4695 -22989 -27256 -10465 -239 -1833 -3484 -10020 -19449 -25786
7580 -25786 -26135 -20752 -2439 -5693 6044 14658 2822 16312 37723 27261 21411 37009 11292
7567 11292 -16060 -3576 8543 26308 28608 -4574 -19350 -20434 -174 -4479 -4637 -2576 -2420
7554 -2420 -7511 3533 21324 24957 31947 3022 -24942 -25337 -39879 -30261 -15144 -21272 -16087 9453
7540 9453 12105 4430 -202 958 -8497 -3474 -17276 -21326 -8384 -1444 -156 -18 7740 3510 14523
7525 14523 21518 6561 376 6236 17726 12092 -202 3001 19499 5116 -8453 -1212 16654
7512 16654 14734 -3802 -2517 -1853 -14112 6614 35497 20301 6331 -15876 -23212 -14279 -3166
7499 -3166 -6315 -3470 -17754 -28195 -43380 -42692 -20711 -20322 -17587 -5923 3133 -36 -7827 -5937
$$ packed form
7593c8585L6297J9098k1850L45j8294m267J6791J0226j594j651o536r429o337
7580b5786l49N383J8313l254J1737Q614j1836J3490K1411j0462n850J5598k5717
7567A1292k7352J2484J2119J7765K300l3182j4776j084K0260m305j58K061J56
7554b420n091J1044J7791L633O990k8925k7964l95j4542R618J5117o128N185K5540
7540I453K652p675m632J160r455N023j3802m050J2942O940J288J38P758m230J1013
7525A4523O995j4957o185N860J1490n634j2294L203J6498j4383j3569P241J7866
7512A6654j920j8536J285O64j2259K0726K8883j5196j3970k2207p336Q933J1113
7499c166l149K845j4284j0441j5185O88K1981L89K735J1664R056l169p791J890
$$ plain form
7485 -5937 2882 12239 19571 19870 1984 4254 18872 13787 8871 4433 -2966 -484 -20951 -19705
7471 -19705 -12929 -25411 13925 39195 24798 10733 23703 14484 8185 6055 -5851 -17267 -12645
7458 -12645 -5729 7085 -10379 -820 4787 -17444 -17904 -11820 -6112 5567 12454 8534 12827 10065
7444 10065 19216 11409 8014 6376 5708 11592 9516 22389 41008 25436 5524 -13896 -15417 703
7430 703 6542 2745 9562 871 -5965 -6366 -4031 -2996 37247 35265 14604 12168 6497 -6932 -17166
7415 -17166 -28639 -34072 -41958 -23490 -6443 -16675 2960 -2486 -8021 -8822 -3051 1021 -11274
7402 -11274 -11121 11277 25620 15655 -698 -12488 -16972 -13289 -10234 -11380 -24690 -39710 -22481
7389 -22481 -3055 -17397 -28008 -38386 -16327 -24901 -24332 -20311 -8360 -15961 -32567 -29647 -25018
$$ packed form
7485e937Q819R357P332K99j7886K270J4618n085m916m438p399K482k0467J246
7471a9705O776j2482L9336K5270j4397j4065J2970r219o299k130j1906j1416M622
7458a2645O916J2814j7464R559N607k2231m60O084N708J1679O887l920M293k762
7444A0065R151p807l395j638o68N884k076J2873J8619j5572j9912j9420j521J6120
7430G03N839l797O817q691o836m01K335J035M0243j982k0661k436n671j3429j0234
7415a7166j1473n433p886J8468J7047j0232J9635n446n535q01N771M072j2295
7402a1274J53K2398J4343r965j6353j1790m484L683L055j146j3310j5020J7229
7389b2481J9426j4342j0611j0378K2059q574N69M021J1951p601j6606K920M629
$$ plain form
7376 -25018 -20712 -18338 -16829 3342 19420 33806 63115 51536 26074 13021 7080 11231 1653
7363 1653 10608 1219 -8323 -5045 9035 5211 -1556 -6441 -5105 410 8863 808 -2659 3449 16816
7348 16816 -2618 -34235 -18578 9348 3736 403 1881 -7948 -23319 -30232 -5617 7969 7265
7335 7265 -1887 -18871 -1473 37976 40928 16368 -8736 -15708 -17883 -19841 -20522 -18720 -9304 6419
7321 6419 19752 11932 14833 12885 -8349 -10766 -13519 9719 14066 4746 -3240 -1125 1743 -436
7307 -436 -6975 -3668 -331 8433 -11603 -9984 -8936 -1044 236 -13677 -20684 15204 21117 18304
7293 18304 25397 35000 16336 -4551 -23698 -27476 -17798 -6177 3727 10946 -4041 9560 20237
7280 20237 17951 18309 17537 4841 15557 7114 11989 4293 -6446 -11332 -30563 -32156 -29060 -20767
$$ packed form
7376b5018M306K374J509K0171J6078J4386K9309j1579k5462j3053n941M151r578
7363A653Q955r389r542L278J4080l824o767m885J336N515Q453q055l467O108J3367
7348A6816j9434l1617J5657K7926n612l333J478r829j5371o913K4615J3586p04
7335G265r152j6984J7398L9449K952k4560k5104o972k175j958o81J802R416J5723
7321F419J3333p820K901j948k1234k417k753K3238M347r320p986K115K868k179
7307d36o539L307L337Q764k0036J619J048P892J280j3913p007L5888N913k813
7293A8304P093R603j8664k0887j9147l778R678J1621R904P219j4987J3601J0677
7280B0237k286L58p72j2696J0716q443M875p696j0739m886j9231j593L096Q293
$$ plain form
7266 -20767 -19965 -28800 -36883 -37919 -33826 -19079 -13379 -6119 4616 7649 15303 31830 32347 7374
7252 7374 7847 15956 23245 4024 -20970 -18969 1941 -2289 -1834 1232 14793 24469 29086 33783
7238 33783 29802 9057 -1626 -9859 1959 3438 23732 30405 9070 6674 7357 -7595 -5398
7225 -5398 -12090 -37811 -23049 3405 342 -29827 -32105 -15777 7790 9321 -9781 -14230 -20540
7212 -20540 -4196 17711 24727 12787 1817 14960 27518 34998 42448 38553 20634 23472 25724
7199 25724 9143 -20829 -24904 -8648 -12647 -22442 2193 -1314 -7377 -21843 -17504 -18519 -15565
7186 -15565 -18771 371 -18738 -27733 -22679 -17445 -21018 -35004 -35603 -22972 -13443 -12468 -10644 -5287
7172 -5287 -23624 -26620 -11831 -21156 -34955 -32185 6068 12713 -11749 -19291 2647 22460 26649
$$ packed form
7266b0767Q02q835q083j036M093J4747N700P260J0735L033P654J6527N17k4973
7252G374M73Q109P289j9221k4994K001K0910m230M55L066J3561R676M617M697
7238C3783l981k0745j0683q233J1818J479K0294O673k1335k396O83j4952K197
7225e398o692k5721J4762K6454l063l0169k278J6328K3567J531j9102m449o310
7212b0540J6344K1907P016j1940j0970J3143J2558P480P450l895j7919K838K252
7199B5724j6581k9972m075J6256l999r795K4635l507o063j4466M339j015K954
7186a5565l206J9142j9109q995N054N234l573j3986n99J2631R529R75J824N357
7172e287j8337k996J4789r325j3799K770L8253O645k4462p542K1938J9813M189
$$ plain form
7159 26649 21831 11678 -1655 -5511 -1513 -17707 -34123 -16671 -7771 -13132 4795 12210 14294
7146 14294 23084 2542 -7447 -16271 -6698 196 5655 -1457 3873 7013 -4498 -596 14819 1420
7132 1420 -9527 -8127 4597 18247 9867 6130 1539 -4881 -584 11718 9430 13301 22029 17
7118 17 -47222 -41620 -3654 623 -52 5049 2748 -10989 -16123 -3070 -8513 -1569 -13023 -16679
7104 -16679 -6585 -13713 -11906 -12268 -8967 5957 3672 -2556 -4255 3442 -5979 -20994 -20891 -19647
7090 -19647 -18102 -19675 -2517 9403 18766 14694 -11418 -10501 -8065 -21875 -5978 14426 30824
7077 30824 20152 5934 4338 6605 9576 3611 9052 31319 45361 28610 23361 21771 25416
7064 25416 31664 24379 39248 22510 -307 2155 8432 -6402 -5354 17121 11888 -8579 -16471
$$ packed form
7159B6649m818j0153j3333l856L998j6194j6416J7452Q900n361J7927P415K084
7146A4294Q790k0542r989q824R573O894N459p112N330L140j1511L902J5415j3399
7132A420j0947J400J2724J3650q380l737m591o420M297J2302k288L871Q728k2012
7118A7m7239N602L7966M277o75N101k301j3737n134J3053n443O944j1454l656
7104a6679J0094p128J807l62L301J4924k285o228j699P697r421j5015J03J244
7090a9647J545j573J7158J1920R363m072k6112R17K436j3810J5897K0404J6398
7077C0824j0672j4218j596K267K971n965N441K2267J4042j6751n249j590L645
7064B5416O248p285J4869j6738k2817K462O277j4834J048K2475n233k0467p892
$$ plain form
7051 -16471 -17734 -25766 -30688 -17800 -6205 -658 4729 12369 13813 913 4261 8546 -6252 -5406
7037 -5406 -5143 -8067 3968 24169 33977 33605 27420 4735 -25533 -28061 -3367 20383 11998 -6993
7023 -6993 -3634 -8437 -28405 -19289 -35264 -27456 -19269 -39883 -46250 -31148 -32682 -15748 -10761 -16067
7009 -16067 -25465 -32060 -6757 2152 -1755 2784 11974 -1265 -20226 -4249 -2289 -9795 1536
6996 1536 15001 4972 2843 31440 29174 28495 23630 31368 31304 41602 34550 13313 16692 8136
6982 8136 121 -5767 -4813 -26568 -31526 -32317 -21104 535 -6544 -19664 -18506 -176 15673 7919
6968 7919 1600 -263 16624 20686 22708 12250 19268 50594 63200 37321 1406 -13429 -17001
6955 -17001 -1290 9856 -1824 8236 2495 8284 -3288 -21037 2185 23609 13363 -7625
$$ packed form
7051a6471j263q032m922J2888J1595N547N387P640J444j2900L348M285j4798Q46
7037e406K63k924J2035K0201R808l72o185k2685l0268k528K4694K3750q385j8991
7023f993L359m803j9968R116j5975P808Q187k0614o367J5102j534J6934M987n306
7009a6067r398o595K5303Q909l907M539R190j3239j8961J5977J960p506J1331
6996A536J3465j0029k129K8597k266o79m865P738o4J0298p052k1237L379q556
6982H136q015n888R54k1755m958p91J1213K1639p079j3120J158J8330J5849p754
6968G919o319j863J6887M062K022j0458P018L1326J2606k5879l5915j4835l572
6955a7001J5711J1146j1680J0060n741N789j1572j7749K3222K1424j0246k0988
$$ plain form
6943 -7625 -8011 -8960 -7829 -2983 -4498 -23963 -15183 70 -9078 3910 28080 24162 21319 15472
6929 15472 9800 5173 -5814 -1465 -2336 -18911 -9680 5386 -450 -4471 -10170 -3796 16962 6128
6915 6128 -16588 -32068 -31532 -22474 -21142 -21111 -12264 -23810 -25474 -32272 -14740 8478 6555 -6846
6901 -6846 -12607 -30042 -30567 -17482 -23836 -41202 -36392 -28450 -26339 -3249 -10739 -11978 -14263 -11702
6887 -11702 7353 5116 6243 -6090 -21296 -1945 3732 -265 -12616 -16077 1322 18070 24199
6874 24199 19788 9299 -4614 3362 -1828 -5570 -7214 -1975 -5206 -5184 -3796 -3052 -7827 869 9245
6859 9245 8815 9937 15064 -4976 -23185 -26980 -12139 -15164 -29784 -19186 -4953 -29782 -22612
6846 -22612 -861 -2369 -11652 -25704 -28107 -39456 -36555 -31829 -23204 -149 34078 34352 24011
$$ packed form
6943g625l86r49J131M846j515j9465Q780J5253r148J2988K4170l918k843n847
6929A5472n672m627j0987M349q71j6575R231J5066n836m021n699O374K0758j0834
6915F128k2716j5480N36R058J332L1Q847j1546j664o798J7532K3218j923j3401
6901f846n761j7435n25J3085o354j7366M810P942K111K3090p490j239k285K561
6887a1702J9055k237J127j2333j5206J9351N677l997j2351l461J7399J6748O129
6874B4199m411j0489j3913P976n190l742j644N239l231K2J388P44m775Q696Q376
6859I245m30J122N127k0040j8209l795J4841l025j4620J0598J4233k4829P170
6846b2612K1751j508r283j4052k403j1349K901M726Q625K3055L4227K74j0341
$$ plain form
6833 24011 6789 7043 3169 -3193 -5647 -10584 -6600 -10766 -20104 -19614 -22734 -28873 -20221 -2326 -1218
6818 -1218 -17849 -40038 -24403 -18477 -13141 -26093 -27056 -23861 -21898 -22509 -16069 -13787 -2327 9846
6804 9846 67 -13530 -27189 -43150 -47284 -42348 -8684 14608 9184 22254 32137 38451 45495
6791 45495 52123 29370 15381 7169 10674 5996 3063 -10747 -15957 -2536 394 -11997 -31045
6778 -31045 -26786 -28387 -18841 -14207 -17089 -32247 -11839 1868 -1592 -12578 -3404 4732 2620 -4858
6764 -4858 -804 -11178 -21629 -43364 -32776 -4002 -3901 -25698 -15391 -18070 -9563 2102 20847
6751 20847 38863 45966 49743 43995 31940 25768 6958 23565 43791 32226 36948 45886 35918
6738 35918 12743 39580 56029 49968 55966 82496 105871 110217 138656 196712 263696 365185
$$ packed form
6833B4011j7222K54l874o362k454m937L984m166r338M90l120o139Q652J7895J108
6818a218j6631k2189J5635N926N336j2952r63L195J963o11O440K282J1460J2173
6804I846r779j3597j3659j5961m134M936L3664K3292n424J3070R883O314P044
6791D5495O628k2753j3989q212L505m678k933j3810n210J3421K930j2391j9048
6778c1045M259j601R546M634k882j5158K0408J3707l460j0986R174Q136k112p478
6764d858M054j0374j0451k1735J0588K8774J01k1797J0307k679Q507J1665J8745
6751B0847J8016P103L777n748j2055o172j8810J6607K0226j1565M722Q938r968
6738C5918k3175K6837J6449o061N998K6530K3375M346K8439N8056O6984J01489
$$ plain form
6726 365185 514053 702968 878230 873259 702844 535879 402227 298774 234434 187664
6716 187664 150131 107738 94406 91523 85588 87531 75839 58939 69759 67861 74901 63928 53150
6703 53150 38366 47650 61681 48574 50432 61351 86740 73432 65384 58927 44491 43860 39499
6690 39499 41847 20486 18639 49212 43926 43930 32857 32827 56762 83993 57728 19996 26872 30403
6676 30403 14918 23203 10455 19101 22805 23401 27823 22523 31119 41972 44878 39837 15232 6399
6662 6399 9294 21445 29524 13041 15737 28275 14652 21370 11287 -21176 -26425 -5773 22256
6649 22256 16656 1143 -2058 -18867 -17047 -9884 -23764 -41699 -35302 -21256 -13311 -19002 -18903 1297
6635 1297 21242 37674 20323 -16670 -25153 -32794 -10628 -800 -15037 -29450 -6226 22306 24953
$$ packed form
6726C65185J48868J88915J75262m971j70415j66965j33652j03453o4340m6770
6716A87664l7533m2393j3332k883n935J943j1692j6900J0820j898P040j0973j0778
6703E3150j4784R284J4031j3107J858J0919K5389j3308q048o457j4436o31m361
6690C9499K348k1361j847L0573n286Mj1073l0K3935K7231k6265l7732O876L531
6676C0403j5485Q285j2748Q646L704N96M422n300Q596J0853K906n041k4605q833
6662F399K895J2151Q079j6483K696J2538j3623O718j0083l2463n249K0652K8029
6649B2256n600j5513l201j6809J820P163j3880j7935O397J4046P945n691R9K0200
6635A297J9945J6432j7351l6993q483p641K2166R828j4237j4413K3224K8532K647
$$ plain form
6622 24953 16836 19717 8365 -1778 4136 370 11208 -610 -5019 -8963 -16267 -16827 -20477 -25779
6608 -25779 -18207 -20523 -20230 -36390 -37697 -19075 -18836 -22498 -13478 10074 9721 27259 23332 -7758
6594 -7758 -6011 -4126 -9122 10637 4788 -5630 -4819 -14195 -26070 -34231 -30652 -21570 -9797 -2693
6580 -2693 -4364 3166 24300 29180 20670 20430 16991 23826 18782 22846 10038 3709 549 -27054
6566 -27054 -24577 -25288 -27091 -28974 -27512 -2958 6921 15143 13798 23345 16198 -3287 -9335 9894
6552 9894 25223 28045 24307 19678 877 -13681 -1947 -2113 -7032 -926 6382 2070 -10956 -3551
6538 -3551 6325 15230 4311 -19995 -27221 -7194 21437 34987 31882 19924 29658 16651 13722
6525 13722 -2049 -27394 -21735 -27383 -38700 -26145 -798 -5921 -1420 -1033 -4944 -20373 -21812
$$ packed form
6622B4953q117K881j1352j0143N914l766J0838j1818m409l944p304n60l650n302
6608b5779P572k316K93j6160j307J8622K39l662R020K3552l53J7538l927l1090
6594g758J747J885m996J9759n849j0418Q11r376j1875q161L579R082J1773P104
6580b693j671P530K1134M880q510k40l439O835n044M064j2808o329l160k7603
6566b7054K477p11j803j883J462K4554R879Q222j345R547p147j9485o048J9229
6552I894J5329K822l738m629j8801j4558J1734j66m919O106P308m312j3026P405
6538c551R876Q905j0919k4306p226K0027K8631J3550l105j1958R734j3007k929
6525A3722j5771k5345N659n648j1317J2555K5347n123M501L87l911j5429j439
$$ plain form
6512 -21812 -16645 13174 14143 -8965 -39916 -26193 19256 29738 15357 8990 2016 -5258 -1411
6499 -1411 -766 -7359 -18383 -28924 -37846 -21383 -8115 -19419 -16813 775 5299 -6573 -4921
6486 -4921 9872 8742 -9836 -8607 -11790 -12064 -189 14594 8559 14832 22108 35777 13748 4233
6472 4233 7031 -9655 -23944 -14966 9177 37082 57731 47201 32090 18322 1481 4272 6049
6459 6049 16868 11702 -1394 1137 -13590 -6480 6917 1487 -9658 841 -1979 10089 18108
6446 18108 6680 11016 10484 2314 1795 16884 16201 5671 -5376 -9819 -15750 -34855 -33549 -34513
6432 -34513 -30170 -24575 -19850 -9397 -7714 -8273 -16898 -24993 -24007 -7734 8662 12516 -803 8377
6418 8377 24651 16485 -3793 -13314 974 19034 42760 13213 3207 26537 12501 -4087
$$ packed form
6512b1812N167K9819R69k3108l0951J3723M5449J0482j4381o367o974p274L847
6499a411O45o593j1024j0541q922J6463J3268j1304K606J7588M524j1872J652
6486d921J4793j130j8578J229l183k74J1875J4783o035O273P276J3669k2029r515
6472D233K798j6686j4289Q978K4143K7905K0649j0530j5111j3768j6841K791J777
6459F049J0819n166j3096K531j4727P110J3397n430j1145J0499k820J2068Q019
6446A8108j1428M336n32q170n19J5089o83j0530j1047m443n931j9105J306r64
6432c4513M343N595M725J0453J683n59q625q095R86J6273J6396L854j3319R180
6418H377J6274q166k0278r521J4288J8060K3726k9547j0006K3330j4036j6588
$$ plain form
6406 -4087 14562 34602 38718 48777 38459 29700 25691 -4505 -847 7022 18391 29885 26887
6393 26887 9373 9873 -7374 -19299 -18110 -16770 -17409 -9708 -20475 -14368 -11331 -8669 -8100 -8052 -16584
6378 -16584 -29329 -20727 -6745 -653 -2814 -5678 -9447 -13954 11690 20571 24167 15774 21021 38993
6364 38993 35990 31234 8692 -5275 -1162 -8854 238 -9945 -26638 -28978 -9447 10749 -2521
6351 -2521 -8855 -2473 5252 31170 38021 19462 -28 -1965 2475 2604 15239 1562 6203 19019
6337 19019 -50 -20829 -35233 -34073 -26430 -24078 -9846 -5307 -3247 -4089 -12090 -9832 19037 24366
6323 24366 20791 39540 30248 17529 8455 -3324 352 -1138 -16784 -32515 -24110 -3122 -12682
6310 -12682 -33834 -21073 -1076 11223 -8631 -11346 2936 -18591 -19742 -3813 14642 13639
$$ packed form
6406d087J8649K0040M116J0059j0318q759m009l0196L658P869J1369J1494k998
6393B6887j7514N00j7247j1925J189J340o39P701j0767O107L037K662N69M8q532
6378a6584j2745Q602J3982O092k161k864l769m507K5644Q881L596q393N247J7972
6364C8993l003m756k2542j3967M113p692R092j0183j6693k340J9531K0196j3270
6351b521o334O382P725K5918O851j8559j9490j937M440J29J2635j3677M641J2816
6337A9019j9069k0779j4404J160P643K352J4232M539K060q42q001K258K8869N329
6323B4366l575J8749r292j2719r074j1779L676j490j5646j5731Q405K0988r560
6310a2682k1152J2761J9997J2299j9854k715J4282k1527j151J5929J8455j003
$$ plain form
6298 13639 2116 1841 2807 -7797 -29799 -17673 -19256 -21159 -21099 -41946 -37841 -25153 -26564 -19976
6284 -19976 -7089 -14190 -6645 1090 -3431 16882 17012 -5925 -25075 -36463 -23871 -17491 -4798
6271 -4798 -11402 -42635 -37249 -22816 -13569 -7636 3838 15948 31263 24844 -5599 -18890 -13569
6258 -13569 -20660 -16980 -16800 -22056 -13481 -7711 -4845 -15467 -15493 -18176 -22786 -30818 -13749 -117 -23598
6243 -23598 -27144 -25383 -16964 -7652 802 2763 -392 -13670 -22059 -6547 -3547 1489 1231 -873
6229 -873 3914 -41 -273 -1033 10831 9117 31032 35337 29883 11027 18159 25937 14442 4186
6215 4186 1444 9759 28780 21783 12207 18194 34231 14680 -1946 -15481 -25337 -17245 -6211
6202 -6211 -13370 -24549 -9770 8766 9886 9925 17825 -5834 -16553 -113 -10180 -8296 18026
$$ packed form
6298A3639j1523k75R66j0604k2002J2126j583j903O0k0847M105J2688j411O588
6284a9976J2887p101P545P735m521K0313J30k2937j9150j1388J2592O380J2693
6271d798o604l1233N386J4433R247N933J1474J2110J5315o419l0443j3291N321
6258a3569p091L680J80n256Q575N770K866j0622k6k683m610q032J7069J3632k3481
6243b3598l546J761Q419R312Q454J961l155j3278q389J5512L000N036k58k104
6229h73M787l955k32p60J1864j714K1915M305n454j8856P132P778j1495j0256
6215D186k742Q315J9021o997r576N987J6037j9551j6626j3535r856Q092J1034
6202f211p159j1179J4779J8536J120L9P900k3659j0719J6440j0067J884K6322
$$ plain form
6189 18026 34048 21480 -4338 -8541 -11174 -5051 14118 10615 16077 4530 -3097 6586 9166
6176 9166 -5725 -13291 -6293 14611 14524 16048 20251 808 -10368 -12496 -14460 -20475 -9008 -249
6162 -249 -963 10003 12374 10687 24421 16131 -8674 -18316 -14950 -7830 1826 10895 22160 13788
6148 13788 -3351 -16880 -37874 -38810 -25815 -13508 5758 -4925 13484 8274 1767 1857 6402
6135 6402 17303 10865 2487 22567 19897 -7400 -35142 -56384 -56018 -37778 -36128 -42338 -47020 -33328
6121 -33328 -9723 -11099 1561 15955 15965 2401 -469 -8192 -20148 -21389 5466 -6796 -22308
6108 -22308 -38926 -23879 -14381 -17430 -13019 -7329 -560 18282 13488 11562 17940 9768 -15800 -18067
6094 -18067 -29940 -28312 -30316 -28468 -39071 -40017 -5587 11440 13217 8486 -7304 -16205 3050
$$ packed form
6189A8026J6022j2568k5818m203k633O123J9169l503N462j1547p627R683K580
6176I166j4891p566O998K0904q7J524M203j9443j1176k128j964o015J1467Q759
6162b49p14J0966K371j687J3734q290k4805r642L366P120R656R069J1265q372
6148A3788j7139j3529k0994r36J2995J2307J9266j0683J8409n210o507R0M545
6135F402J0901o438q378K0080k670k7297k7742k1242L66J8240J650o210m682J3692
6121c3328K3605j376J2660J4394J0j3564k870p723j1956j241K6855j2262j5512
6108b2308j6618J5047R498l049M411N690O769J8842m794j926O378q172k5568k267
6094a8067j1873J628k004J848j0603r46L4430J7027J777m731j5790q901J9255
$$ plain form
6081 3050 4000 7459 20513 22851 25550 19652 3534 6050 -3886 -25995 -27534 -20138 -34182 -32337
6067 -32337 -22052 -12244 -23163 -25034 -2754 3702 2605 19193 25605 1320 6761 -6252 -27800
6054 -27800 -24707 -29382 -23802 -8823 1221 20419 40551 49144 28851 13857 10846 18738 15795
6041 15795 14549 3953 -21129 -11025 215 1413 -207 -15580 -27358 -19039 -4938 -9672 3424
6028 3424 16294 29627 15254 2984 8106 11887 4910 4547 7489 14566 21601 15980 -2194 336
6014 336 -386 2993 2423 -837 2508 990 -18964 -7403 13404 28173 22156 -13163 -17099 -4442
6000 -4442 -9190 -22242 -20234 -26717 -31636 -28789 -29037 -18079 -13526 -22474 -13894 -848 -2555 -2015 -2986
5985 -2986 -848 2625 -373 -638 -8444 -4637 -19677 -20785 -19326 -13600 -11861 -15566 -21333 -31241 -8808
$$ packed form
6081C050R50L459J3054K338K699n898j6118K516r936k2109j539P396j4044J845
6067c2337J0285R808j0919j871K2280O456j097J6588O412k4285N441j3013k1548
6054b7800L093m675N580J4979J0044J9198K0132Q593k0293j4994l011P892k943
6041A5795j246j0596k5082J0104J1240J198j620j5373j1778Q319J4101m734J3096
6028C424J2870J3333j4373j2270N122L781o977l63K942P077P035n621j8174K530
6014C36p22L379n70l260L345j518j9954J1561K0807J4769o017l5319l936J2657
6000d442m748j3052K008o483m919K847k48J0958M553q948Q580J3046j707N40r71
5985b986K138L473k998k65p806L807j5040j108J459N726J739l705n767r908K2433
$$ plain form
5970 -8808 6385 -3228 2350 6793 20596 -1492 -21261 -43502 -55587 -49206 -24716 -11861 -18944
5957 -18944 -24030 -34369 -41495 -20573 -9808 -12886 6532 20512 4236 3154 4000 -8598 -5544
5944 -5544 -2385 10226 -9895 -6507 20546 13364 -16867 -10128 -2407 11528 18923 3204 -2037
5931 -2037 824 3235 1262 -11546 -25510 -26037 -27000 -15998 -6898 -19832 -36039 -21503 -5799 -4245
5917 -4245 7092 -7685 9766 20121 34977 19043 264 831 2984 2342 1390 -17713 -24497 -8394
5903 -8394 -14205 -22400 -13836 -28803 -26016 -20134 -18662 -2903 -9964 -22776 -10599 332 -9710
5890 -9710 -21395 -18098 -10287 -2555 -16510 -32000 -16843 -10807 -16297 -14990 -13807 -3340 6447 -16916
5876 -16916 -40742 -49629 -39493 -20868 -10039 -13983 -5903 -20505 -24486 -34622 -25937 -13746 -11364
$$ packed form
5970h808J5193r613N578M443J3803k2088j9769k2241j2085O381K4490J2855p083
5957a8944n086j0339p126K0922J0765l078J9418J3980j6276j082Q46j2598L054
5944e544L159J2611k0121L388K7053p182l0231O739P721J3935P395j5719n241
5931b037K861K411j973j2808j3964n27r63J1002R100j2934j6207J4536J5704J554
5917d245J1337j4777J7451J0355J4856j5934j8779N67K153o42r52j9103o784J6103
5903h394n811q195Q564j4967K787N882J472J5759p061j2812J2177J0931j0042
5890i710j1685L297P811P732j3955j5490J5157O036n490J307J183J0467R787k3363
5876a6916k3826q887J0136J8625J0829l944Q080j4602l981j0136Q685J2191K382
$$ plain form
5863 -11364 -17283 -7555 3792 11254 20201 3226 -32010 -29250 -5793 -12624 -18894 -686 -8278
5850 -8278 -12436 -15842 -7129 21709 23393 23464 28765 9660 6556 35004 26025 918 -11039 -1728
5836 -1728 9165 9508 -17021 -28113 -19579 13356 25342 37270 39887 12985 -9426 -19528 15409
5823 15409 10168 -3858 19492 4430 -1696 -5498 23710 32256 26662 7539 11189 20344 16701
5810 16701 10518 987 16651 36616 20076 8259 26804 27384 19979 25771 50773 51997 20941
5797 20941 13239 35560 28461 17317 11660 12153 8146 11170 -1100 -22619 -31032 -5178 20144
5784 20144 23370 23121 6228 -502 16962 16555 835 1706 -7030 -11001 -17033 -21201 2398 23838
5770 23838 18526 6066 -4493 8804 36108 32957 24633 7585 21765 21996 13822 21475 8796
$$ packed form
5863a1364n919R728J1347P462Q947j6975l5236K760K3457o831o270J8208p592
5850h278m158l406Q713K8838J684P1N301j9105l104K8448q979k5107j1957R311
5836a728J0893L43k6529j1092Q534L2935J1986J1928K617k6902k2411j0102L4937
5823A5409n241j4026K3350j5062o126l802K9208Q546n594j9123L650R155l643
5810A6701o183r531J5664J9965j6540j1817J8545N80p405N792K5002J224l1056
5797B0941p702K2321p099j1144n657M93m007L024j2270k1519q413K5854K5322
5784B0144L226k49j6893o730J7464m07j5720Q71q736l971o032m168K3599K1440
5770B3838n312j2460j0559J3297K7304l151q324j7048J4180K31q174P653j2679
$$ plain form
5757 8796 9417 4330 -4324 -1859 9384 3102 -4992 -9106 -9307 -23636 -13295 -7234 12621 39151
5743 39151 19383 6259 -5119 -861 5046 -4307 -32280 -54468 -35690 -4741 9912 -3129
5731 -3129 2878 6465 19816 9058 -2670 -14618 -22490 -15146 -25149 -29357 -22507 -1827 7361
5718 7361 16778 22198 20240 12718 -10145 5501 2303 3924 5504 -5784 -4972 -15066 -12270 -6033
5704 -6033 7210 10866 15797 13448 24876 40412 23808 6058 173 25999 27333 18815 13310
5691 13310 -5498 -11043 -20938 7664 28803 28938 29678 31771 30173 25134 1546 -18544 -26598 -21096
5677 -21096 -9733 -17780 -19330 -12890 10501 5478 -18585 -32110 -19431 -8998 -2481 2469 12554
5664 12554 -7395 -23613 -18767 -1786 -18605 -25849 -4840 17623 23387 7239 10431 7938 -1795
$$ packed form
5757H796O21n087q654K465J1243o282q094m114k01j4329J0341O061J9855K6530
5743C9151j9768j3124j1378M258N907r353k7973k2188J8778L0949J4653j3041
5731c129O007L587J3351j0758j1728j1948p872P344j0003m208O850K0680R188
5718G361R417N420j958p522k2863J5646l198J621J580j1288Q12j0094K796O237
5704f033J3243L656M931k349J1428J5536j6604j7750n885K5826J334q518n505
5691A3310j8808n545r895K8602K1139J35P40K093j598n039k3588k0090q054N502
5677b1096J1363q047j550O440K3391n023k4063j3525J2679J0433O517M950J0085
5664A2554j9949j6218M846J6981j6819p244K1009K2463N764j6148L192k493r733
$$ plain form
5651 -1795 2574 4713 -12090 -17424 -24070 -20530 -10053 -12143 -8275 5895 10999 8592 37073 44420
5637 44420 22207 17730 14145 5463 37343 36942 9433 -4145 -2042 -10874 -23081 -16860 -20804 -6063
5623 -6063 17474 13873 5764 -9808 7914 21757 33900 25880 -5300 -11634 -14180 12253 7348
5610 7348 -8076 -6660 -11872 -21318 6823 42780 46464 19890 12155 8205 -687 13410 36133
5597 36133 33080 8298 18814 16602 -69 -9261 7550 24195 21122 35628 28893 23617 20593
5584 20593 9460 -3263 -3894 -4335 11461 22810 12026 2326 11595 12781 10875 -7065 -19882
5571 -19882 -5690 -5623 -8022 5453 -8392 -19042 -5988 -10823 -4614 2383 -19083 -31197 -20872
5558 -20872 -13850 -29263 -41010 -24252 -22629 -14732 -4604 -504 -895 -17860 13788 15842 12817
$$ packed form
5651a795M369K139j6803n334o646L540J0477k090L868J4170N104k407K8481P347
5637D4420k2213m477l585q682L1880m01k7509j3578K103q832j2207O221l944J4741
5623f063K3537l601q109j5572J7722J3843J2143q020l1180o334k546K6433m905
5610G348j5424J416n212r446K8141L5957L684k6574p735l950q892J4097K2723
5597C6133l053k4782J0516k212j6671r192J6811J6645l073J4506o735n276l024
5584B0593j1133j2723o31m41J5796J1349j0784r700R269J186j906j7940j2817
5571a9882J4192O7k399J3475j3845j0650J3054m835O209O997k1466j2114J0325
5558b0872P022j5413j1747J6758J623P897J0128M100l91j6965L1648K054l025
$$ plain form
5545 12817 30122 34018 42567 39422 26397 16741 3629 -11263 -14655 -23486 -31596 -15414 -10604
5532 -10604 -2033 -12206 -18240 -18473 -15115 4228 -12138 -7498 -266 4764 12508 6774 9740 -8649
5518 -8649 -22698 -22372 -35375 -37544 -21107 -16653 -13674 -13629 -12423 20640 -4661 -24514 -46110 -51400
5504 -51400 -41137 -31242 -22060 -1776 -4638 1448 8926 -93 -15508 -17290 -5071 -12813 -18237 -13565
5490 -13565 660 10556 -4599 -8302 -2693 4330 -5440 -24561 -22954 2557 2749 -627 -29899 -35360
5476 -35360 -20882 -1855 -17021 2953 1308 -3060 9061 5809 14273 -4821 6795 19247 22967
5463 22967 -1454 -7176 -2289 -69 -609 -8884 -6159 19654 13012 -3153 17221 12865 1031 -6862
5449 -6862 -11881 -19288 -16622 -13397 -18774 -36530 -33302 -15757 -16990 -21292 -2182 -14061 -18967 -12554
$$ packed form
5545A2817J7305L896Q549l145j3025r656j3112j4892l392q831q110J6182M810
5532a0604Q571j0173o034k33L358J9343j6366M640P232N030P744n734K966j8389
5518h649j4049L26j3003k169J6437M454K979M5J206L3063k5301j9853k1596n290
5504e1400J0263R895R182K0284k862O086P478r019j5415j782J2219p742n424M672
5490a3565J4225R896j5155l703N609P023r770j9121J607K5511J92l376k9272n461
5476c5360J4478J9027j5166J9974j645m368J2121l252Q464j9094J1616J2452L720
5463B2967k4421n722M887K220n40q275K725K5813o642j6165K0374m356j1834p893
5449f862n019p407K666L225n377j7756L228J7545j233m302J9110j1879m906O413
$$ plain form
5435 -12554 -16933 -12637 -20514 -22282 -17183 1885 1122 -23131 -39782 -22347 -7510 -24111 -24855 -5592
5421 -5592 3029 113 -6369 -21823 -22894 -19028 -26832 -44051 -19707 9686 713 -14173 -13445 3017
5407 3017 16229 5736 -8936 -7558 1786 -20917 -26388 -13399 -16712 -22554 2083 13823 19466
5394 19466 5472 -6467 -1228 18551 14277 4394 1856 3148 7940 30859 32056 9910 8524
5381 8524 9289 10463 3861 11113 27362 18990 -4811 -7077 -5823 13011 10765 3716 7217 875
5367 875 265 -3729 -11758 -643 13196 9313 -3661 -19385 -19526 -23254 -16430 -14917 -30196 -27439
5353 -27439 -19294 -11752 4165 5548 -4188 5961 -2285 -20875 -29754 -58857 -67229 -44756 -36749
5340 -36749 -33026 -15789 -29859 -23259 7387 21434 13920 -4112 -960 23225 39221 34810 17299
$$ packed form
5435a2554m379M296p877j768N099J9068p63k4253j6651J7435J4837j6601p44J9263
5421e592Q621k916o482j5454j071L866p804j7219K4344K9393q973j4886P28J6462
5407C017J3212j0493j4672J378R344k2703n471J2989l313n842K4637J1740N643
5394A9466j3994j1939N239J9779m274r883k538J292M792K2919J197k2146j386
5381H524P65J174o602P252J6249q372k3801k266J254J8834k246p049L501o342
5367H75o10l994q029J1115J3839l883j2974j5724j41l728O824J513j5279K757
5353b7439Q145P542J5917J383r736J0149q246j8590q879k9103q372K2473Q007
5340c6749L723J7237j4070O600L0646J4047p514j8032L152K4185J5996m411j7511
$$ plain form
5327 17299 10992 -5649 -5242 -4198 1839 15676 32169 55180 35776 22104 9535 6055 19845
5314 19845 8129 11855 3762 -16033 -753 5 -10757 5795 -10603 -17327 -7438 -4436 -12169
5301 -12169 -29245 -8467 10968 21632 20136 6277 19336 28730 36949 34822 10727 -11248 -16211
5288 -16211 -18796 -8865 -13189 -37911 -46793 -58695 -48951 -16177 1331 3395 3114 -10431 -11222 3848
5274 3848 -1163 -20104 -30154 -45392 -46254 -37752 -40231 -30396 -19011 -22648 -31375 -25792 -5059 -2855
5260 -2855 -5348 -17536 -20077 -10015 11567 8449 7428 19814 30469 35232 33633 23152 46722
5247 46722 45373 47758 58816 43553 27526 34319 21828 13694 9405 14069 6657 -14455 -17519
5234 -17519 -2912 18419 24057 18821 12406 10422 15274 12885 13703 25878 29059 25416 19696 13212
$$ packed form
5327A7299o307j6641M07J044O037J3837J6493K3011j9404j3672j2569l480J3790
5314A9845j1716L726q093j9795J5280P58j0762J6552j6398o724R889L002p733
5301a2169j7076K0778J9435J0664j496j3859J3059R394Q219k127k4095k1975m963
5288a6211k585R931m324k4722q882j1902R744L2774J7508K064k81j3545p91J5070
5274C848n011j8941j0050j5238q62Q502k479R835J1385l637q727N583K0733K204
5260b855k493j2188k541J0062K1582l118j021J2386J0655M763j599j0481K3570
5247D6722j349K385J1058j5263j6027O793j2491q134m289M664p412k1112l064
5234a7519J4607K1331N638n236o415j984M852k389Q18J2175L181l643n720o484
$$ plain form
5220 13212 -4112 -7428 -13665 3309 5203 -15984 -21042 -9475 -3537 3875 17064 -415 -707
5207 -707 15010 17407 3091 -5000 1711 -15833 -10923 -2524 -1891 3199 -1153 -29715 -1694 17881
5193 17881 30633 30732 -8161 -26350 -15898 -5463 -2026 508 -242 4565 12778 5735 -1243 -14030
5179 -14030 -4634 15019 8823 -12271 -27535 -21993 -11382 -993 7007 -4699 -23305 -39009 -13168
5166 -13168 10485 18545 24908 42264 22625 -5195 -19873 -24334 -11887 1200 286 1703 -3512
5153 -3512 15781 29711 18652 13228 7148 -8352 -17369 -7754 -5659 -27972 -33667 -24197 -10423
5140 -10423 12319 8815 -8712 -20596 -24147 -14633 -215 18591 8436 11570 11157 166 -4368
5127 -4368 -1379 -14885 -37016 -31695 -11893 1820 5550 8686 -11248 -21216 -12348 -847 4845
$$ packed form
5220A3212j7324l316o237J6974J894k1187n058J1567N938P412J3189j7479k92
5207g07J5717K397j4316q091O711j7544M910Q399O33N090m352k8562K8021J9575
5193A7881J2752R9l8893j8189J0452J0435L437K534p50M807Q213p043o978j2787
5179a4030R396J9653o196k1094j5264N542J0611J0389Q000j1706j8606j5704K5841
5166a3168K3653Q060O363J7356j9639k7820j4678m461J2447J3087r14J417n215
5153c512J9293J3930j1059n424o080j5500r017R615K095k2313n695R470J3774
5140a0423K2742l504j7527j1884l551R514J4418J8806j0155L134m13j0991m534
5127d368K989j3506k2131N321J9802J3713L730L136j9934r968Q868J1501N692
$$ plain form
5114 4845 -7067 -9758 -13001 -16789 -8873 5346 16942 20670 16011 1371 -4902 -14346 -22054 -15867
5100 -15867 -20215 -14980 -14392 -22724 -21920 -30965 -30160 -7764 -16043 1273 -3234 11483 15937 18451 9948
5085 9948 8004 3359 128 -11278 -15278 -26755 -34895 -15036 16843 19175 12438 4399 9309 26256
5071 26256 44630 26217 10317 -9845 -19356 -18693 588 -20640 -32586 -30651 -17078 -807 -16536
5058 -16536 -30604 -5402 41741 54279 26220 3754 -4118 -14643 -23599 -15772 -15969 -7005 -11866
5045 -11866 5767 9608 11384 8871 6863 -4564 2413 -11889 -22745 -10704 -5420 16162 7289
5032 7289 23690 47082 46352 35372 52806 56245 31942 21152 31291 18111 -15144 -26285 -19108
5019 -19108 -26168 -11611 -6123 -9438 -15799 -6967 6633 27281 31491 -6689 -2417 20436 13975
$$ packed form
5114D845j1912k691l243l788P916J4219J1596L728m659j4640o273r444p708O187
5100a5867m348N235N88q332Q04r045Q05K2396q279J7316m507J4717M454K514q503
5085I948j944m645l231j1406m000j1477q140J9859L1879K332o737q039M910J6947
5071B6256J8374j8413j5900k0162r511O63J9281k1228j1946J935J3573J6271j5729
5058a6536j4068K5202M7143J2538k8059k2466p872j0525q956P827j97Q964m861
5045a1866J7633L841J776k513k008j1427O977j4302j0856J2041N284K1582q873
5032G289J6401K3392p30j0980J7434L439k4303j0790J0139j3180l3255j1141P177
5019a9108p060J4557N488l315o361Q832J3600K0648M210l8180M272K2853o461
$$ plain form
5006 13975 16786 18407 29742 44698 18380 15923 24764 17083 15311 -7005 -398 -398 2747 3853
4992 3853 13092 2814 -6021 -10088 -5185 -11839 -17732 -13779 -1752 21006 28702 17365 -3709 -12976
4978 -12976 1823 7501 3111 155 -271 -16118 -25746 -28356 -22848 -7216 6067 -6567 -22701
4965 -22701 -30033 -23354 -21302 -11103 -15442 -27816 -9681 -11921 -6732 -10601 -11942 -10211 -22862 -16288
4951 -16288 -19702 -16692 -13560 6362 14791 24927 21395 6621 1540 58 -5319 -21132 -40476
4938 -40476 -40095 -26643 -20535 -19764 -1939 14112 17314 3691 944 18493 10760 -9619 -4086 -7743
4924 -7743 -34410 -39763 -30817 -22346 -7860 -8119 -30144 -39404 -32255 -16996 8359 2335 15828 27706
4910 27706 11348 17526 9496 11702 39152 18760 13023 10594 7956 19702 28427 39035 28922
$$ packed form
5006A3975K811J621J1335J4956k6318k457Q841p681j772k2316O607%L145J106
4992C853R239j0278q835m067M903o654n893L953J2027K2758P696j1337k1074r267
4978a2976J4799N678m390k956m26j5847r628k610N508J5632J3283j2634j6134
4965b2701p332O679K052J0199m339j2374J8135k240N189l869j341J731j2651O574
4951a6288l414L010L132J9922Q429J0136l532j4774n081j482n377j5813j9344
4938d0476L81J3452O108P71J7825J6051L202j3623k747J7549p733k0379N533l657
4924g743k6667n353Q946Q471J4486k59k2025r260P149J5259K5355o024J3493J1878
4910B7706j6358O178q030K206K7450k0392n737k429k638J1746Q725J0608j0113
$$ plain form
4897 28922 21098 8789 1202 4452 7287 -4614 9799 16500 22972 10959 -4017 -21289 -33256
4884 -33256 -21572 -19656 -17420 -5577 -21033 -23441 -621 12875 -4332 -24614 -15477 -9091 -12803
4871 -12803 -16976 -20870 -23029 -4039 5786 9692 30783 48116 11272 -24991 -30483 -15893 17455
4858 17455 27731 30881 17984 8088 17467 43419 50721 28317 3850 -1246 4362 -8228 8476
4845 8476 35430 9874 -2582 4612 4170 8561 3182 6681 -3225 134 25929 30139 24955 11690
4831 11690 9057 -10704 -30336 -33863 -25664 -39700 -36240 -12084 -14319 5338 2372 -4138 1512
4818 1512 9294 8638 2291 -13635 -5184 -567 10715 5909 24135 16914 15157 10503 -4124 -12122
4804 -12122 5940 11127 22256 11163 -24169 -17032 -8733 -6730 7160 21425 12828 11550 503
$$ packed form
4897B8922p824j2309p587L250K835j1901J4413O701O472j2013j4976j7272j1967
4884c3256J1684J916K236J1843j5456k408K2820J3496j7207k0282R137O386l712
4871a2803m173l894k159J8990R825L906K1091J7333l6844l6263n492J4590L3348
4858A7455J0276L150j2897r896R379K5952P302k2404k4467n096N608j2590J6704
4845H476K6954k5556j2456P194m42M391n379L499r906L359K5795M210n184j3265
4831A1690k633j9761j9632l527Q199j4036L460K4156k235J9657k966o510N650
4818A512P782o56o347j5926Q451M617J1282m806J8226p221j757m654j4627p998
4804a2122J8062N187J1129j1093l5332P137Q299K003J3890J4265q597j278j1047
$$ plain form
4791 503 -16029 3706 22952 14146 16957 25216 8227 17692 14989 14165 15913 19595 13532 -1826
4777 -1826 -10550 -14218 -23171 -22093 -3600 585 -142 -29592 -27848 -12329 -6142 -26385 -35634 -30400
4763 -30400 -11718 -16383 -23200 -6170 5375 -2696 -1993 -5628 -6949 8397 10792 -225 -5035 29363
4749 29363 35497 13019 -2886 -11842 -11550 -14630 -6126 13274 14102 5096 -6197 -15144 -22722 -20440
4735 -20440 -7136 22 20120 21012 28061 12347 -7040 -4130 -9861 -8572 -14805 13572 2740
4722 2740 8095 14932 26840 30864 16978 2606 -11445 -32261 -21119 -14800 229 2553 9895
4709 9895 15052 12106 1425 -8541 -10035 -6947 -7463 -1308 -11507 -8102 -13786 -46906 -38493 -29310
4695 -29310 -11874 -21683 -28268 -23967 -23853 -35679 -28623 -5330 -1255 -17445 -12647 9881 3886 -16854
$$ packed form
4791E03j6532J9735J9246q806K811Q259j6989R465k703q24J748L682o063j5358
4777a826q724l668q953J078J8493M185p27k9450J744J5519O187k0243r249N234
4763c0400J8682m665o817J7030J1545q071P03l635j321J5346K395j1017m810L4398
4749B9363O134k2478j5905q956K92l080Q504J9400Q28r006j1293q947p578K282
4735b0440J3304P158K0098Q92P049j5714j9387K910n731J289o233K8377j0832
4722B740N355O837J1908M024j3886j4372j4051k0816J1142O319J5029K324P342
4709I895N157k946j0681r966j494L088n16O155j0199L405n684l3120Q413R183
4695b9310J7436r809o585M301J14j1826P056K3293M075j6190M798K2528n995k0740
$$ plain form
4681 -16854 -23277 -26070 -16842 -17005 2443 -2979 -19375 -24749 -29897 -25757 -16883 -12158 -984 14511
4667 14511 15294 -13773 -29353 -29537 -32069 -35066 -38212 -26199 -14877 -3317 -424 -2104 438 -8990
4653 -8990 -8517 -3698 -7897 -11294 -14842 -24737 -20610 -15192 -1344 -6931 -13516 -14313 -12395 -31326 -38746
4638 -38746 -44078 -46333 -27949 -4470 18124 21854 4819 -13716 -5235 -9962 -7017 7308 40
4625 40 -747 870 4299 -14057 -8059 -7745 -8942 -4077 1178 -16401 -25076 -32270 -12699 8776 20504
4610 20504 23854 23287 6087 1140 2771 -5996 -1060 -6053 -10551 6366 6005 5974 6786 10139 24607
4595 24607 14887 15552 2045 2845 37916 32729 10367 17821 13336 20163 4006 -17820 -11469 -3600
4581 -3600 -7533 -22456 -10153 1965 -12157 -7643 14714 17991 16366 -3477 -1632 -21793 -41518
$$ packed form
4681a6854o423k793R228j63J9448n422j6396n374n148M140Q874M725J1174J5495
4667A4511P83k9067j5580j84k532k997l146J2013J1322J1560K893j680K542r428
4653h990M73M819m199l397l548r895M127N418J3848n587o585p97J918j8931p420
4638c8746n332k255J8384K3479K2594L730j7035j8535Q481m727K945J4325p268
4625D0p87J617L429j8356N998L14j197M865N255j7579q675p194J9571K1475J1728
4610B0504L350n67j7200m947J631q767M936m993m498J6917l61l1Q12L353J4468
4595B4607r720O65j3507Q00L5071n187k2362P454m485O827j6157k1826O351P869
4581c600l933j4923J2303J2118j4122M514K2357L277j625j9843J845k0161j9725
$$ plain form
4568 -41518 -31546 -41799 -50251 -49514 -53955 -33397 -9081 -8261 -10325 -663 3375 2324 -7509 -32104
4554 -32104 -47169 -45292 -25293 377 3237 4319 4357 -1125 -29585 -31020 -9602 -12743 -22565 -13978
4540 -13978 -8918 -4870 10282 10062 -4949 -6427 8782 8992 7105 -3042 -14225 -26057 -22269 -5459
4526 -5459 13433 15893 -2371 -6340 -14153 -15418 -13813 -8719 3694 1457 17561 32215 21961
4513 21961 5608 -5432 -22413 -12467 9267 13255 -1753 738 4785 -4880 -16332 -19486 -10327
4500 -10327 -23343 -29521 -26852 2191 12236 9955 16500 1791 -21366 -14693 -17414 -11872 -14456
4487 -14456 -5432 -620 -26798 -28192 -24249 -4148 7502 -17046 -42044 -30531 -6452 5666 18584
4474 18584 35688 18401 292 10097 37775 34684 23897 13019 9094 -7039 -11104 -11402 -13662
$$ packed form
4568d1518R972j0253q452P37m441K0558K4316Q20k064R662M038j051r833k4595
4554c2104j5065J877J9999K5670K860J082L8n482k8460j435K1418l141r822Q587
4540a3978N060M048J5152k20j5011j478J5209K10j887j0147j1183j1832L788J6810
4526e459J8892K460j8264l969p813j265J605N094J2413k237J6104J4654j0254
4513B1961j6353j1040j6981R946K1734L988j5008K491M047r665j1452l154R159
4500a0327j3016o178K669K9043J0045k281O545j4709k3157O673k721N542k584
4487a4456R024M812k6178j394L943K0101J1650k4548k4998J1513K4079J2118J2918
4474A8584J7104j7287j8109R805K7678l091j0787j0878l925j6133m065k98k260
$$ plain form
4461 -13662 -89 15090 19091 20519 32632 23498 26803 18092 8244 -11296 -298 12107 18217
4448 18217 35094 39746 36132 36307 7349 141 -9539 -2413 8021 -259 -9578 -9343 -14142 -4334
4434 -4334 19811 7872 -31531 -31136 -18966 1351 -3621 -17129 2391 1134 1675 -12645 -17977
4421 -17977 -18613 -18445 -13771 -14411 -2638 -4635 -10963 -34099 -41260 -39791 -32303 -29484 -32281 -31079 -10419
4406 -10419 2130 19475 -2324 -20854 -27915 -12214 -26725 -41693 -28020 -14917 -6247 -4147
4394 -4147 -10569 -3939 783 -16154 -5882 9014 -10972 -26498 -1037 -1142 -16754 -28543 -13311
4381 -13311 17691 19796 4263 -7672 1159 10421 -91 15554 28585 12904 8153 4263 -13420
4368 -13420 -18151 -4765 4111 -1724 -835 14362 26552 13495 -123 -15065 -2899 -6011 -20309
$$ packed form
4461a3662J3573J5179M001J428J2113r134L305q711r848j9540J0998J2405O110
4448A8217J6877M652l614J75k8958p208r680P126J0434q280r319K35m799R808
4434d334K4145j1939l9403L95J2170K0317m972j3508J9520j257N41j4320n332
4421a7977o36J68M674o40J1773j997o328k3136p161J469P488K819k797J202K0660
4406a0419J2549J7345k1799j8530p061J5701j4511j4968J3673J3103Q670K100
4394d147o422O630M722j6937J0272J4896j9986j5526K5461j05j5612j1789J5232
4381a3311L1002K105j5533j1935Q831R262j0512J5645J3031j5681m751l890j7683
4368a3420m731J3386Q876n835Q89J5197J2190j3057j3618j4942J2166l112j4298
$$ plain form
4355 -20309 -7894 -10054 -6530 -16011 -35346 -23978 -11923 -15111 -5921 -8345 -12286 -15120 -7936 -23881
4341 -23881 -26891 -10478 821 -4872 -7802 -1289 11677 5584 1350 4094 -17242 -34069 -18241
4328 -18241 7599 12406 16768 3214 -7088 -1763 16255 32551 25967 8300 5013 22120 -1290
4315 -1290 -8211 -8378 1498 -16538 -7026 6634 -3042 -2779 -4125 -11874 -17113 -5904 -22644 -18093
4301 -18093 -4020 -36 13381 1334 -8879 1772 3484 2251 -5354 17970 37705 48126 56251
4288 56251 42683 33458 12349 -18564 -19565 4084 7817 -21446 -7495 16531 28331 30207 25660
4275 25660 7338 -32799 -43925 -54545 -49575 -36719 -10312 3340 9703 3458 6135 17709 5430
4262 5430 5711 -9264 -26409 -11361 8516 8246 6952 18876 34147 27128 24473 25472 8319 -16121
$$ packed form
4355b0309J2415k160L524r481j9335J1368J2055l188R190k424l941k834P184j5945
4341b3881l010J6413J1299n693k930O513J2966o093m234K744k1336j6827J5828
4328a8241K5840M807M362j3554j0302N325J8018J6296o584j7667l287J7107k3410
4315a290o921j67R876j8036R512J3660r676K63j346p749n239J1209j6740M551
4301a8093J4073L984J3417j2047j0213J0651J712j233p605K3324J9735J0421Q125
4288E6251j3568r225k1109l0913j001K3649L733k9263J3951K4026J1800J876m547
4275B5660j8322m0137j1126j0620M970J2856K6407J3652O363o245K677J1574j2279
4262E430K81j4975j7145J5048J9877k70j294J1924J5271p019k655R99j7153k4440
$$ plain form
4248 -16121 -37148 -24490 -28592 -35991 -30318 -20567 -21462 -37349 -35394 4558 -3736 -9433 3903 -244
4234 -244 -14050 -41699 -43851 -19793 -19456 -7474 6850 2333 -18310 -17687 -11426 -16528 -1494 -21485
4220 -21485 -29981 -32574 -25558 -32826 -33642 -24997 -28620 -23026 -34835 -33798 -43232 -47965 -50911 -32516
4206 -32516 -22444 -17182 14001 29832 33446 22338 670 -13159 -1124 -4787 -18481 -5946
4194 -5946 -3300 -5656 -32016 -42483 -31694 -10248 -8287 -22805 -22716 -18641 -9783 -361 -10519 -3942
4180 -3942 9662 17262 15221 12022 11460 9889 -12889 -16163 1967 29153 36324 20949 10354 -975
4166 -975 -12706 -9978 -33336 -25943 -9551 -7844 1275 16110 6836 12775 24823 16333 -1492 -28730
4152 -28730 -13270 1214 -12296 -21665 -12274 -9555 617 -1765 -6465 2352 4878 -9790 -19919
$$ packed form
4248a6121k1027J2658m102p399N673R751q95j5887J955L9952q294n697J3336m147
4234b44j3806k7649k152K4058L37J1982J4324m517k0643O23O261n102J5034j9991
4220b1485q496k593P016p268q16Q645l623N594j1809J037r434m733k946J8395
4206c2516J0072N262L1183J5831L614j1108k1668j3829J2035l663j3694J2535
4194e946K646k356k6360j0467J0789K1446J961j4518Q9M075Q858R422j0158O577
4180c942J3604P600k041l199n62j571k2778l274J8130K7186P171j5375j0595j1329
4166i75j1731K728k3358P393J6392J707R119J4835r274N939J2048q490j7825k7238
4152b8730J5460J4484j3510r369R391K719J0172k382m700Q817K526j4668j0129
$$ plain form
4139 -19919 -22901 -1259 19654 26103 7126 -21284 -42031 -35082 -22191 -34998 -37592 -36103 -26332
4126 -26332 -34279 -42527 -26258 -25727 -40989 -56545 -42621 -6835 3557 11432 8393 4843 -2951
4113 -2951 9130 27502 9700 -4491 -14603 -14256 -14501 -15951 -8023 -1288 16399 16034 6814 14086
4099 14086 19943 12623 3133 -14841 -11895 -2399 -5090 -16259 -20303 -16557 -31118 -4589 -3066 -10952
4085 -10952 7592 11897 -6346 -22380 -36380 -25923 -30911 -22285 -749 1004 1616 -3545 11608
4072 11608 11620 3572 1583 16954 18579 2388 -20053 -13404 -25460 -34856 -29350 -11091 1468 -6005
4058 -6005 4401 13223 21825 46424 36546 20154 16602 -9887 -17930 -14411 -21886 -719 24537
4045 24537 21193 15416 -1334 4798 -3803 -5077 19961 4543 4691 11781 24163 19606 30329 5217
$$ packed form
4139a9919k982K1642K0913O449j8977k8410k0747O949J2891j2807k594J489R771
4126b6332p947q248J6269N31j5262j5556J3924L5786J0392P875l039l550p794
4113b951J2081J8372j7802j4191j0112L47k45j450P928O735J7687l65r220P272
4099A4086N857p320r490j7974K946R496k691j1169m044L746j4561K6529J523p886
4085a0952J8544M305j8243j6034j4000J0457m988Q626K1536J753O12n161J5153
4072A1608J2q048j989J5371J625j6191k2441O649j2056r396N506J8259J2559p473
4058f005J0406Q822Q602K4599r878j6392l552k6489q043L519p475K1167K5256
4045B4537l344n777j6750O132q601j274K5038j5418J48P090J2382m557J0723k5112
$$ plain form
4031 5217 3153 -6500 -2012 -1353 -13668 -8015 -904 4337 8662 -1722 -20858 -28471 -18644 -18410 -17794
4016 -17794 -5914 2226 -5917 3137 -3295 -13763 -31033 -8560 10851 936 -24237 -29747 -2039
4003 -2039 11453 -8736 -8087 -3891 15765 32303 32078 19590 28077 47402 26410 -777 -15427
3990 -15427 -25050 -18908 -5883 -4812 -26132 -13018 -4083 -5947 -14079 -4232 6321 -6567 -28995
3977 -28995 -48434 -40948 -21798 -23371 -22334 -7519 -940 -7088 1486 16427 12249 19312 22292 31928
3963 31928 24730 29715 29172 21773 3936 -12627 -18386 -25787 -4049 -4028 -10397 18576 21116 15081
3949 15081 16920 7932 10095 25297 36156 32697 22626 19475 22130 36945 49326 47178 24606
3936 24606 9610 8225 18308 -2502 -6791 19924 55083 66846 50763 21475 4978 -7047
$$ packed form
4031E217k064r653M488O59j2315N653P111N241M325j0384j9136p613R827K34O16
4016a7794J1880Q140q143R054o432j0468j7270K2473J9411r915k5173n510K7708
4003b039J3492k0189O49M196J9656J6538k25j2488Q487J9325k0992k7187j4650
3990a5427r623O142J3025J071k1320J3114Q935j864q132R847J0553j2888k2428
3977b8995j9439P486J9150j573J037J4815O579o148Q574J4941m178P063K980R636
3963C1928p198M985n43p399j7837j6563n759p401K1738K1o369K8973K540o035
3949A5081J839q988K163J5202J0859l459j0071l151K655J4815J2381k148k2572
3936B4606j4996j385J0083k0810m289K6715L5159J1763j6083k9288j6497j2025
$$ plain form
3924 -7047 5145 8235 -8697 -6583 -10286 -10470 335 -16167 -3290 -3055 -36654 -23341 -353
3911 -353 5487 14181 10743 -19167 -38982 -28357 -14454 -19523 -29854 -41602 -34239 -33332 -13846 288
3897 288 19721 15365 4274 6146 -3528 -17003 -27755 -30985 -21488 -4662 8154 7999 12448 5908
3883 5908 12616 11679 14401 6815 -3837 -9789 -13819 -10064 -11628 8531 34386 33618 7015 -18849
3869 -18849 -19854 -12391 -3062 -1258 -9871 -17459 -21481 -17120 -14348 15019 4237 -17916 -12983 -9671
3855 -9671 4689 14541 22990 -2243 -37457 -17286 8248 24335 1346 -20237 -7132 5328
3843 5328 24603 19207 -1768 -14595 -18557 -27505 -33797 -40705 -50008 -32887 -25939 -24938 -2137 10637
3829 10637 -586 3586 -3765 -15185 -10537 5007 616 6011 2933 1091 17261 34134 24539
$$ packed form
3924g047J2192L090j6932K114l703j84J0805j6502J2877K35l3599J3313K2988
3911c53N840Q694l438k9910j9815J0625J3903n069j0331j1748P363R07J9486J4134
3897B88J9433m356j1091J872r674j3475j0752l230R497J6826J2816j55M449o540
3883E908O708r37K722p586j0652n952m030L755j564K0159K5855p68k6603k5864
3869a8849j005P463R329J804q613p588m022M361K772K9367j0782k2153M933L312
3855i671J4360R852Q449k5233l5214K0171K5534J6087k2989k1583J3105J2460
3843E328J9275n396k0975j2827l962q948o292o908r303J7121O948J001K2801J2774
3829A0637j1223M172p351j1420M648J5544m391N395l078j842J6170J6873r595
$$ plain form
3816 24539 8163 12689 7746 4464 -890 4490 2935 11977 12428 17785 9058 -1082 -26988 -30431
3802 -30431 -22469 -8352 15221 14780 -348 864 -6349 -8663 8226 12245 21514 8422 7110 30076
3788 30076 33724 30324 24621 3751 16547 34109 20852 9008 7355 2376 -5699 -1086 5430
3775 5430 13605 20796 159 -5494 12378 40630 55677 44687 36237 29090 9373 11132 6069
3762 6069 7878 3 -11541 -11647 -3079 6194 3074 -9736 -11316 7805 12013 1086 23160 31465
3748 31465 4629 20384 22345 17960 11135 10017 1291 5620 3469 -10350 -11058 -6803 -2497 -3676
3734 -3676 -5176 6268 18259 27088 15118 16191 18409 19859 38388 33627 11865 1787 8665
3721 8665 7304 9914 3181 1561 -2848 9874 5160 -2750 -3896 -4076 9196 5415 -13461 -16634
$$ packed form
3816B4539j6376M526m943l282n354N380j555R042M51N357q727j0140k5906l443
3802c0431P962J4117K3573m41j5128J212p213k314J6889M019R269j3092j312K2966
3788C0076L648l400n703k0870J2796J7562j3257j1844j653m979q075M613O516
3775E430Q175P191k0637n653J7872K8252J5047j0990q450p147j9717J759n063
3762F069J809p875j1544j06Q568R273l120j2810j580J9121M208j0927K2074Q305
3748C1465k6836J5755J961m385o825j118q726M329k151j3819p08M255M306j179
3734c676j500J1444J1991Q829j1970J073K218J450J8529m761k1762j0078O878
3721H665j361K610o733j620m409J2722m714p910j146j80J3272l781j8876l173
$$ plain form
3707 -16634 -2707 -1283 4745 113 -4756 -20671 -28656 -26832 -8189 4300 10632 22561 20756
3694 20756 33978 25377 3898 -6746 4447 -12889 -30693 -31787 -16719 -29940 -29783 -23476 -2081
3681 -2081 -1239 -2469 -986 7547 25991 23550 9883 26218 32072 34495 12600 -20849 -34084 -34091
3667 -34091 -26798 -21585 -16101 -2642 11860 27197 21717 28894 28906 3083 -11292 170 -13355
3654 -13355 -15903 2693 35027 36760 4135 -3905 9995 -6409 -19799 -19544 -22543 -5729 5546
3641 5546 -4966 -9374 -11393 1242 -1350 -10482 -5304 -2896 -22654 -32862 -21743 -14098 10981
3628 10981 19342 8969 22261 23041 24470 22226 23741 17342 -3143 -23867 -15724 -19446 -4166 3020
3614 3020 -3836 -2012 -4623 -2978 8121 -1424 -10659 -2328 10707 10044 4779 7970 10863 17762 27625
$$ packed form
3707a6634J3927J424O028m632m869j5915p985J824J8643J2489O332J1929j805
3694B0756J3222q601k1479j0644J1193j7336j7804j094J5068j3221J57O307K1395
3681b081Q42j230J483Q533J8444k441j3667J6335N854K423k1895l3449j3235p
3667c4091P293N213N484J3459J4502J5337n480P177J2k5823j4375J1462j3525
3654a3355k548J8596L2334J733l2625q040J3900j6404j3390K55k999J6814J1275
3641E546j0512m408k019J2635k592r132N178K408j9758j0208J1119P645K5079
3628A0981Q361j0373J3292P80J429k244J515o399k0485k0724Q143l722J5280P186
3614C020o856J824k611J645J1099r545r235Q331J3035o63n265L191K893O899R863
$$ plain form
3599 27625 9801 7161 26463 23833 24962 17027 -4875 -9173 -10275 -16298 -16258 -19484 -39473 -38130
3585 -38130 -23194 -18435 -6870 -13363 -18287 -10877 -27617 -13870 -7827 2674 7167 20805 13620
3572 13620 9343 -8064 -14517 -15333 -12364 -3061 -17571 1738 14646 15873 11849 6687 -8025 -13486
3558 -13486 -3941 12668 10017 -12661 -8187 -11016 -26689 -27864 -16412 -4298 -390 -377 -615 15362
3544 15362 28218 36999 17096 6799 266 8205 13637 16644 -13026 -31552 -41639 -41447 -37535
3531 -37535 -5169 9422 230 -28481 -22963 256 8039 6657 612 -17170 -49946 -36087 -12292
3518 -12292 -6250 5055 12855 4376 -11294 -14375 4284 6033 19153 9167 13037 8105 -5446
3505 -5446 2048 3805 1714 -11250 2191 22261 23603 22715 28059 51 -22720 -11863 15469
$$ packed form
3599B7625j7824k640J9302k630J129p935k1902m298j102o023M0l226j9989J343
3585c8130J4936M759J1565o493m924P410j6740J3747O043J0501M493J3638p185
3572A3620m277j7407o453q16K969R303j4510J9309J2908J227m024n162j4712n461
3558a3486R545J6609k651k2678M474k829j5673j175J1452J2114L908J3k38J5977
3544A5362J2856Q781j9903j0297o533P939N432L007k9670j8526j0087J92L912
3531c7535L2366J4591r192k8711N518K3219P783j382o045j7782l2776J3859K3795
3518a2292O042J1305P800q479j5670l081J8659J749J3120r986L870m932j3551
3505e446P494J757k091j2964J3441K0070J342q88N344k8008k2771J0857K7332
$$ plain form
3492 15469 19624 -9875 -15158 -13607 -23658 -25076 -341 17747 17233 7156 12508 16982 8811 8016
3478 8016 14886 32410 13638 690 -2762 6429 6320 9529 -8069 -16114 -6954 1106 2386 15569
3464 15569 18976 26047 21385 13503 -3963 -17582 -27322 -15726 12133 21746 1262 -16159 -35297
3451 -35297 -36599 -44073 -33172 3814 10473 1567 5822 130 11104 21284 26476 13147 4169
3438 4169 -10321 -21289 -21706 -27771 -36433 -47492 -60452 -58478 -39596 -23437 -10452 -15137 -11743
3425 -11743 -3492 1973 3510 12239 7994 7491 18806 38443 27606 14879 19373 12285 -1296 5095
3411 5095 19299 21145 7301 -13093 -27757 -55813 -66788 -78701 -50997 -33643 -19635 -35691
3399 -35691 -36515 -20785 -4515 -17183 -11540 -19754 -19773 -7191 -3166 -9437 -580 -154 -20760 -18900
$$ packed form
3492A5469M155k9499n283J551j0051j418K4735J8088n14j0077N352M474q171p95
3478H016O870J7524j8772j2948l452R191j09L209j7598q045R160Q060J280J3183
3464A5569L407P071m662p882j7466j3619r740J1596K7859R613k0484j7421j9138
3451c5297j302p474J0901L6986O659q906M255n692J0974J0180N192j3329q978
3438D169j4490j0968m17o065q662j1059j2960J974J8882J6159J2985m685L394
3425a1743Q251N465J537Q729m245n03J1315J9637j0837j2727M494p088j3581O391
3411E095J4204J846j3844k0394j4664k8056j0975j1913K7704J7354J4008j6056
3399c5691q24J5730J6270j2668N643q214j9J2582M025o271Q857M26k0606J860
$$ plain form
3385 -18900 -5067 5764 -4889 3926 12273 -5615 -15002 -22371 -15010 -17676 -26149 -22225 -22831 -21332
3371 -21332 -31834 -17594 -17443 -15841 -8907 12884 -2365 -13277 -8831 -277 28173 19680 16698
3358 16698 10471 -10881 -40724 -47347 -24648 -6199 -9940 -5652 -1214 1326 35691 38491 22302
3345 22302 11274 -8726 -14759 -19114 -16983 -10603 -2106 13050 -695 -2315 -9732 -29208 -18853
3332 -18853 6564 406 6152 2916 -16840 1992 14631 10727 1830 -7127 -15242 -9765 -5606 -4795
3318 -4795 -8168 -31736 -42190 -21772 7406 5915 -1090 9331 15506 13348 27771 27786 23796 456
3304 456 -9938 -10449 -10027 2481 13255 -7799 -15339 -16963 -6943 8104 24439 30824 25952 16288
3290 16288 18373 12425 -32396 -36592 -30969 -25826 5925 9418 19783 671 -21453 -15241 -14576 -3370
$$ packed form
3385a8900J3833J0831j0653Q815Q347j7888r387p369P361k666q473L924o06J499
3371b1332j0502J4240J51J602O934K1791j5249j0912M446Q554K8450q493k982
3358A6698o227k1352k9843o623K2699J8449l741M288M438K540L4365K800j6189
3345B2302j1028k0000o033m355K131O380Q497J5156j3745j620p417j9476J0355
3332a8853K5417o158N746l236j9756J8832J2639l904q897q957q115N477M159Q11
3318d795l373k3568j0454K0418K9178j491p005J0421O175k158J4423J5l990k3340
3304D56j0394n11M22J2508J0774k1054p540j624J0020J5047J6335O385m872r664
3290A6288K085n948m4821m196N623N143L1751L493J0365j9112k2124O212O65J1206
$$ plain form
3276 -3370 2906 5873 6983 10443 39226 29982 21905 25550 16566 32776 14893 12908 8049 1252
3262 1252 -16970 -24903 -32704 -17386 -11494 9503 34140 18515 19846 11287 2931 -11681 -5492
3249 -5492 -12535 -8838 9202 26267 24668 20244 41344 29221 23387 29486 10439 222 -2840
3236 -2840 -11822 -3140 -5354 -1210 7955 3903 -2348 5475 -7213 -4551 13282 9316 15255 10753
3222 10753 3040 237 -28281 -50828 -31086 -3322 -4968 -2922 15133 10756 13820 6713 6372 3073
3208 3073 529 11311 8147 75 12921 39572 40164 13616 1129 -4508 -7606 -1506 -4365 -12998
3194 -12998 -4733 -17380 -24829 -9778 -14399 2510 18823 27575 23656 22776 17170 -7418 -16526 4075
3180 4075 -3273 -14602 -34011 -34225 -28380 -15247 -6632 -21556 -24560 -11195 15287 23671 16632 -4642
$$ packed form
3276c370O276K967J110L460K8783r244q077L645q984J6210j7883j985m859o797
3262A252j8222p933p801J5318N892K0997K4637j5625J331q559q356j4612O189
3249e492p043L697J8040J7065j599m424K1100j2123n834O099j9047j0217l062
3236b840q982Q682k214M144R165m052o251P823j2688K662J7833l966N939m502
3222A0753p713k803k8518k2547J9742K7764j646K046J8055m377L064p107l41l299
3208C073k544J0782l164q072J2846K6651N92k6548j2487n637l098O100k859q633
3194a2998Q265j2647p449J5051m621J6909J6313Q752l919q80n606k4588r108K0601
3180D075p348j1329j9409k14N845J3133Q615j4924l004J3365K6482Q384p039k1274
$$ plain form
3166 -4642 -27241 -16331 -18878 -31600 -42870 -28413 -1465 6535 8911 9886 21352 -8122 -842
3153 -842 -5715 -20888 -22251 -5329 -2415 2183 18300 25672 43007 26367 14223 12695 -1724
3140 -1724 -8933 -10625 302 6193 1546 3058 20859 15317 -1282 854 7593 28626 40468 30661
3126 30661 2922 -432 15013 14254 10575 9395 2425 2654 2648 13296 11899 -3807 -6340 11636 5170
3111 5170 -542 8082 -7509 -29308 -12609 6539 24721 7802 4162 -17248 -28151 -26514 -20151
3098 -20151 -35704 -43812 -60637 -32318 -6222 1439 8619 5592 16890 17966 13322 14509 24941
3085 24941 15958 5972 -13755 -2711 31245 24613 42722 49525 43752 52002 26458 2923 10773
3072 10773 9059 -1922 12665 26759 27065 7506 5222 -4372 -20697 -18928 -18332 -12823 -21300 -10576
$$ packed form
3166d642k2599J0910k547j2722j1270J4457K6948Q000K376R75J1466k9474P280
3153h42m873j5173j363J6922K914M598J6117P372J7335j6640j2144j528j4419
3140a724p209j692J0927N891m647J512J7801n542j6599K136O739K1033J1842r807
3126C0661k7739l354J5445p59l679j180o970K29oJ0648j397j5706k533J7976o466
3111E170n712Q624j5591k1799J6699J9148J8182j6919l640k1410j0903J637O363
3098b0151j5553q108j6825K8319K6096P661P180l027J1298J076m644J187J0432
3085B4941q983r986j9727J1044L3956o632J8109O803n773Q250k5544k3535P850
3072A0773j714j0981J4587J4094L06j9559k284r594j6325J769N96N509q477J0724
$$ plain form
3058 -10576 -8595 35307 35842 22468 11197 489 -1410 8723 8681 17112 9704 1271 1508 -2550
3044 -2550 -26726 -9479 -1675 -14811 -9125 7957 17797 7327 4949 2895 10072 19765 22270 3054
3030 3054 -8080 -13936 -16908 -24024 -20752 -10589 -1479 -6278 6429 9086 -7828 -14156 -1152 17417
3016 17417 2906 5118 15094 20545 21403 16575 16787 2839 1020 10026 9009 14729 12915 -8504
3002 -8504 2969 21601 39287 21568 4642 -3617 -10740 6895 -4888 -26942 -30016 -2546 4849
2989 4849 7166 17903 19623 -2805 12564 11725 -9697 -2965 -19156 -26831 -3245 15942 12345
2976 12345 7810 -1389 3186 17650 22192 12119 -1813 -5780 4704 13966 22684 15946 -7566
2963 -7566 -26528 -31217 -11972 -4051 -6669 -14170 -21346 -27007 -15843 10131 4494 33337 35630 24407
$$ packed form
3058a0576J981M3902N35j3374j1271j0708j899J0133m2Q431p408q433K37m058
3044b550k4176J7247P804j3136N686J7082R840j0470k378k054P177R693K505j9216
3030C054j1134n856k972p116L272J0163R110m799J2707K657j6914o328J3004J8569
3016A7417j4511K212R976N451Q58m828K12j3948j819R006j017N720j814k1419
3002h504J1473J8632J7686j7719j6926q259p123J7635j1783k2054l074K7470P395
2989D849K317J0737J720k2428J5369q39k1422O732j6191p675K3586J9187l597
2976A2345m535r199M575J4464M542j0073j3932l967J0484R262Q718o738k3512
2963g566j8962m689J9245P921k618p501p176n661J1164K5974n637K8843K293j1223
$$ plain form
2949 24407 757 3388 15303 16289 7107 13483 24602 21159 5162 -8696 -5147 17949 1697
2936 1697 5144 24607 17116 13063 297 -5158 -10604 -15288 -24056 -16904 -12908 -19464 -19936 -33154
2922 -33154 -32520 3551 36492 29706 25837 31307 36604 29255 25853 25995 10778 3270 2542 7113 17468
2907 17468 21627 16431 16730 32501 34333 11811 13566 2799 3133 2199 -4068 9476 12489 3247
2893 3247 27020 17884 -5138 -7099 -11727 -5042 2110 17336 23802 34529 13630 -12212 -6619
2880 -6619 -3846 42318 43060 10693 -14038 -11916 6510 -21227 -26299 -20772 -24441 -15256 5346 -5008
2866 -5008 8304 21188 12326 24270 17352 24423 1537 13943 21003 16796 6520 -10112 -28547
2853 -28547 -13029 -159 -1924 6218 -10575 -29300 -1087 13092 16024 -4875 -34151 -28285 887
$$ packed form
2949B4407k3650K631J1915R86r182O376J1119l443j5997j3858L549K3096j6252
2936A697L447J9463p491m053j2766n455n446m684q768P152L996o556m72j3218
2922c3154O34L6071L2941o786l869N470N297p349l402J42j5217p508p28M571J0355
2907A7468M159n196K99J5771J832k2522J755j0767L34r34o267J3544L013r242
2893C247K3773r136k3022j961m628O685P152J5226O466J0727k0899k5842N593
2880f619K773M6164P42l2367k4731K122J8426k7737n072N527l669R185K0602j0354
2866e008J3312J2884q862J1944o918P071k2886J2406P060m207j0276j6632j8435
2853b8547J5518J2870j765Q142j6793j8725K8213J4179K932k0899k9276N866K9172
$$ plain form
2840 887 -1081 -13597 -18058 -1381 1818 -799 7879 4014 4090 -2489 -4134 15934 30363 9183
2826 9183 4591 -4368 -11298 -9824 -7797 35838 27098 262 -3191 2427 13585 -5872 8990 13582
2812 13582 22608 9326 -2220 327 -14609 -18781 -14239 -2861 6437 -4005 -17175 -9110 -1815
2799 -1815 10376 17899 17293 12073 2245 -17270 570 14961 23210 7900 -8283 -19126 -17719
2786 -17719 1205 4914 -14279 -29392 -19449 -9237 2046 13801 14149 -8174 -14417 -18342 -22819
2773 -22819 -18660 -31034 -36079 -40465 -15078 -7963 -19183 -14937 -13948 6011 1181 5308 8325 29835
2759 29835 20215 -8447 -22542 -45497 -58861 -46391 -41648 -44571 -22684 -12097 -8074 8871 1212
2746 1212 20018 22577 -4837 -32502 -36801 -18263 -25750 -14040 -11730 -10088 -4794 13744 28666
$$ packed form
2840H87j968j2516m461J6677L199k617Q678l865P6o579j645K0068J4429k1180
2826I183m592q959o930J474K027M3635q740k6836l453N618J1158j9457J4862M592
2812A3582R026j3282j1546K547j4936m172M542J1378R298j0442j3170Q065P295
2799a815J2191P523o06n220r828j9515J7840J4391Q249j5310j6183j0843J407
2786a7719J8924L709j9193j5113R943J0212J1283J1755L48k2323o243l925m477
2773b2819M159j2374n045m386K5387P115j1220M246R89J9959m830M127L017K1510
2759B9835r620k8662j4095k2955j3364J2470M743k923K1887J0587M023J6945p659
2746A212J8806K559k7414k7665m299J8538p487J1710K310J642N294J8538J4922
$$ plain form
2733 28666 21032 21141 17987 6270 -16221 -11228 18232 19687 7728 18024 29331 13264 -7575
2720 -7575 4418 4572 -11203 -8309 377 -12005 -24687 -30644 -12103 -7888 3282 -3175 -21820
2707 -21820 -17436 -2558 -17755 -21998 -41412 -40370 -25910 -16124 -21122 -18752 -12271 -4282 15590
2694 15590 20955 15445 19027 8023 -7360 -16197 785 2011 -3758 5221 18216 21488 6757
2681 6757 -13517 -8056 -3549 7872 10425 5979 7430 -5005 -19908 -21983 -7344 7243 13466
2668 13466 32296 23353 2842 -13282 -22757 -29456 -32698 -15283 -1278 -4067 2742 -10526 -12894
2655 -12894 -8525 -9294 -18748 -7781 8258 11263 10638 -8587 -12695 -4240 5875 5421 872 9680
2641 9680 3214 -12939 -6034 9878 -7162 -24667 -23788 -17909 2038 16055 13669 15983 4982
$$ packed form
2733B8666p634J09l154j1717k2491M993K9460J455j1959J0296J1307j6067k0839
2720g575J1993J54j5775K894Q686j2382j2682n957J8541M215J1170o457j8645
2707b1820M384J4878j5197m243j9414J042J4460R786m998K370O481P989J9872
2694A5590N365n510L582j1004j5383q837J6982J226n769Q979J2995L272j4731
2681F757k0274N461M507J1421K553m446J451j2435j4903k075J4639J4587O223
2668A3466J8830q943k0511j6124r475o699l242J7415J4005k789O809j3268k368
2655a2894M369p69r454J0967J6039L005o25j9225m108Q455J0115m54m549Q808
2641I680o466j6153O905J5912j7040j7505Q79N879J9947J4017k386K314j1001
$$ plain form
2628 4982 5955 -13008 -11654 4995 -4822 94 15723 37731 42234 35460 12936 -21076 -14651 -17458
2614 -17458 3137 17383 -1558 -13884 -5398 -11813 -11217 -11086 -9576 -1865 -21578 -20783 -4883 -16214
2600 -16214 -25579 -21669 -8204 4166 -1586 15859 16389 17706 26291 38495 50301 57563 52272 40478
2586 40478 22343 3824 5383 7743 2859 -18063 -11175 16673 20172 1725 -5110 4535 -8224
2573 -8224 -12119 -6693 6300 4309 -3903 2815 16214 9829 13737 -10837 -33917 -24349 -27343 -20675
2559 -20675 1992 10860 16344 16209 3751 2843 12484 5693 -12802 10201 16920 17600 10764 13182
2545 13182 10383 21761 6875 11896 41585 31982 19966 5483 10346 -8591 -33839 -26902 -8746
2532 -8746 -3594 9605 7026 23215 37238 25115 17781 22772 38051 31005 17014 3854 -11124
$$ packed form
2628D982R73j8963J354J6649r817M916J5629K2008M503o774k2524l4012O425k807
2614a7458K0595J4246j8941j2326Q486o415N96J31J510P711j9713P95J5900j1331
2600a6214r365L910J3465J2370n752J7445N30J317Q585J2204J1806P262n291j1794
2586D0478j8135j8519J559K360m884k0922O888K7848L499j8447o835R645j2759
2573h224l895N426J2993j991q212O718J3399o385L908k4574k3080R568k994O668
2559b0675K2667Q868N484j35j2458r08R641o791j8495K3003O719O80o836K418
2545A3182k799J1378j4886N021K9689r603j2016j4483M863j8937k5248O937J8156
2532h746N152J3199k579J6189J4023j2123p334M991J5279p046j3991j3160j4978
$$ plain form
2519 -11124 -5041 -2432 6968 16049 37948 37564 8867 -3025 8476 4506 -1106 10823 33941
2506 33941 31649 22428 22892 24350 17795 -13347 -27070 -21465 -29641 -19360 -10339 -9406 -9921 -15377 -21154
2491 -21154 -10267 -22726 -21320 -25691 -15053 -29996 -29487 -36107 -41156 -29788 -10852 -22427 -27424
2478 -27424 -2551 3059 12016 15037 1758 -893 -14365 -2529 6643 -9132 -7164 -14477 -9709
2465 -9709 -885 -6154 -35818 -14309 5521 7034 7606 3975 -3798 -3895 3286 2903 10657 3571 -24104
2450 -24104 -55499 -41321 -35268 -29447 -5961 -4347 -2037 -5065 -9528 -13693 -14755 -21768 -29375 -27960
2436 -27960 -14318 -2240 -3338 -7447 -19081 -27155 4339 32990 21611 20564 32128 36754 25779
$$ packed form
2519a1124O083K609R400R081K1899l84k8697j1892J1501l970n612J1929K3118
2506C3941k292r221M64J458o555l1142j3723N605q176J0281R021R33n15n456n777
2491b1154J0887j2459J406m371J0638j4943N09o620n049J1368J8936j1575m997
2478b7424K4873N610Q957L021j3279k651j3472J1836R172j5775J968p313M768
2465i709Q824n269k9664K1509J9830J513N72l631p773r7P181l83P754p086k7675
2450b4104l1395J4178O053N821K3486J614K310l028m463m165j062p013p607J415
2436b7960J3642J2078j098m109j1634q074L1494K8651j1379j047J1564M626j0975
$$ [...]
##END NTUPLES=NMR SPECTRUM
##END=
