##TITLE=Analysis number 310511
Compound Code cc 07412
Project Code adrs
Chemist Name synnovation
##JCAMPDX= 6.0         $$ Bruker NMR JCAMP-DX V2.0
##DATA TYPE= NMR SPECTRUM
##DATA CLASS= NTUPLES
##ORIGIN= Bruker BioSpin GmbH
##OWNER= NMR
$$ XWIN-NMR		Version 3.5
$$ Tue Jun 21 08:31:58 2005 GMT Daylight Time (UT+1h)  MAYBRIDGE\NMR@NMR_250MHZ
##.OBSERVE FREQUENCY= 250.131544655141
##.OBSERVE NUCLEUS= ^1H
##.ACQUISITION MODE= SIMULTANEOUS (DQD)
##.ACQUISITION SCHEME= undefined
##.AVERAGES= 16
##.DIGITISER RES= 18
##SPECTROMETER/DATA SYSTEM= dpx250
##.PULSE SEQUENCE= zg30
##.SOLVENT NAME= DMSO
##.SHIFT REFERENCE= (INTERNAL, DMSO, 0, 16.522)
##AUDIT TRAIL= $$ (NUMBER, WHEN, WHO, WHERE, WHAT)
$$ ##TITLE= Audit trail, XWIN-NMR		Version 3.5
$$ ##JCAMPDX= 5.01
$$ ##ORIGIN= Bruker BioSpin GmbH
$$ ##OWNER= NMR
$$ C:\u/data/dgb/nmr/ADRS/4330/pdata/1/auditp.txt
$$ ##AUDIT TRAIL=  $$ (NUMBER, WHEN, WHO, WHERE, WHAT)
(   1,<2005-06-21 08:31:35.35 +100>,<MAYBRIDGE\NMR>,<NMR_250MHZ>,
      <created by zg, POWCHK disabled, PULCHK disabled
       configuration hash MD5:
       62 19 C7 07 E1 42 D1 B7 37 6C 3D D0 77 39 F9 E6
       data hash MD5: 64K
       FF 60 EF A5 89 1B BF 18 3F FA 22 D2 9A DB 6D C1>)
(   2,<2005-06-21 08:31:49.39 +100>,<MAYBRIDGE\NMR>,<NMR_250MHZ>,
      <Start of raw data processing
       ef LB = 0.3 FT_mod = 6 PKNL = 1 SI = 32K 
       data hash MD5: 32K
       9A 18 78 83 3F D2 BF 57 13 A4 FF 54 81 28 74 2B>)
(   3,<2005-06-21 08:31:51.64 +100>,<MAYBRIDGE\NMR>,<NMR_250MHZ>,
      <apk 
       data hash MD5: 32K
       12 4B 2D 59 19 EA 47 37 AB 38 0C F9 2D 0F B3 BE>)
(   4,<2005-06-21 08:31:52.43 +100>,<MAYBRIDGE\NMR>,<NMR_250MHZ>,
      <abs ABSG = 5 
       data hash MD5: 32K
       55 93 DC 00 B4 84 E1 92 D3 F7 DE 76 49 26 5F 35>)
$$ ##END=
$$ 
$$ hash MD5
$$ 92 EC A4 CB 84 70 83 3D 1D 08 52 20 D5 6B 79 67
##$RELAX= 
##$RELAX= 
##$RELAX= 
##$RELAX= 
##$RELAX= 
##$RELAX= 
##$RELAX= 
$$ Bruker specific parameters
$$ --------------------------
##$DU= <C:\u>
##$EXPNO= 4330
##$NAME= <ADRS>
##$PROCNO= 1
##$TYPE= <nmr>
##$USER= <dgb>
##$AMP= (0..31)
100 100 100 100 100 100 100 100 100 100 100 100 100 100 100 100 100 100 
100 100 100 100 100 100 100 100 100 100 100 100 100 100 
##$AQSEQ= 0
##$AQ_mod= 3
##$AUNM= <au_zg>
##$AUTOPOS= <2 >
##$BF1= 250.13
##$BF2= 250.13
##$BF3= 250.13
##$BF4= 250.13
##$BF5= 500.13
##$BF6= 500.13
##$BF7= 500.13
##$BF8= 500.13
##$BYTORDA= 1
##$CFDGTYP= 0
##$CFRGTYP= 5
##$CHEMSTR= <none>
##$CNST= (0..31)
1 1 145 1 1 1 1 1 1 1 1 1 1 1 1 1 1 1 1 1 1 1 1 1 1 1 1 1 1 1 1 1 
##$CPDPRG= <>
##$CPDPRG1= <>
##$CPDPRG2= <>
##$CPDPRG3= <>
##$CPDPRG4= <mlev>
##$CPDPRG5= <mlev>
##$CPDPRG6= <mlev>
##$CPDPRG7= <mlev>
##$CPDPRG8= <mlev>
##$CPDPRGB= <>
##$CPDPRGT= <>
##$D= (0..31)
0 1 0 0 0 0 0 0 0 0.06 0 0 0 0 0 0 0.0002 0 0 0 0 0 0 0 0 0 0 0 0 0 0 
0 
##$DATE= 1119339094
##$DBL= (0..7)
120 120 120 120 120 120 120 120 
##$DBP= (0..7)
150 150 150 150 150 150 150 150 
##$DBP07= 0
##$DBPNAM0= <>
##$DBPNAM1= <>
##$DBPNAM2= <>
$$ [...]
##$SUBNAM7= <"">
##$SUBNAM8= <"">
##$SUBNAM9= <"">
##$SW= 20.6930455092707
##$SWIBOX= (0..15)
0 0 3 0 0 0 0 0 0 0 0 0 0 0 0 0 
##$SW_h= 5175.983436853
##$TD= 65536
##$TD0= 1
##$TE= 295.16
##$TE2= 300
##$TE3= 300
##$TEG= 300
##$TL= (0..7)
0 120 120 120 120 120 120 120 
##$TP= (0..7)
150 150 150 150 150 150 150 150 
##$TP07= 0
##$TPNAME0= <>
##$TPNAME1= <>
##$TPNAME2= <>
##$TPNAME3= <>
##$TPNAME4= <>
##$TPNAME5= <>
##$TPNAME6= <>
##$TPNAME7= <>
##$TPOAL= (0..7)
0.5 0.5 0.5 0.5 0.5 0.5 0.5 0.5 
##$TPOFFS= (0..7)
0 0 0 0 0 0 0 0 
##$TUNHIN= 0
##$TUNHOUT= 0
##$TUNXOUT= 0
##$USERA1= <user>
##$USERA2= <user>
##$USERA3= <user>
##$USERA4= <user>
##$USERA5= <user>
##$V9= 5
##$VALIST= <valist>
##$VCLIST= <CCCCCCCCCCCCCCC>
##$VD= 0
##$VDLIST= <DDDDDDDDDDDDDDD>
##$VPLIST= <PPPPPPPPPPPPPPP>
##$VTLIST= <TTTTTTTTTTTTTTT>
##$WBST= 1024
##$WBSW= 4
##$XGAIN= (0..3)
0 0 0 0 
##$XL= 0
##$YL= 0
##$YMAX_a= 345925
##$YMIN_a= -320350
##$ZGOPTNS= <>
##$ZL1= 120
##$ZL2= 120
##$ZL3= 120
##$ZL4= 120
##$ABSF1= 16.522
##$ABSF2= -4.171173
##$ABSG= 5
##$ABSL= 3
##$ALPHA= 0
##$AQORDER= 0
##$ASSFAC= 0
##$ASSFACI= 0
##$ASSFACX= 0
##$ASSWID= 0
##$AUNMP= <proc_1d>
##$AZFE= 0.1
##$AZFW= 0.1
##$BCFW= 0
##$BC_mod= 0
##$BYTORDP= 0
##$COROFFS= 0
##$CY= 12.5
##$DATMOD= 1
##$DC= 0
##$DFILT= <>
##$DTYPP= 0
##$F1P= 14.0000005364418
##$F2P= -0.99999901652339
##$FCOR= 0.5
##$FTSIZE= 32768
##$FT_mod= 6
##$GAMMA= 0
##$GB= 0
##$INTBC= 1
##$INTSCL= 1
##$ISEN= 128
##$LB= 0.3
##$LEV0= 0
##$LPBIN= 0
##$MAXI= 10000
##$MC2= 0
##$MEAN= 0
##$ME_mod= 0
##$MI= 0
##$NCOEF= 0
##$NC_proc= -4
##$NLEV= 6
##$NOISF1= 0
##$NOISF2= 0
##$NSP= 0
##$NTH_PI= 0
##$NZP= 0
##$OFFSET= 16.522
##$PC= 1
##$PHC0= -85.96346
##$PHC1= 1.185445
##$PH_mod= 1
##$PKNL= yes
##$PPARMOD= 0
##$PSCAL= 4
##$PSIGN= 0
##$REVERSE= no
##$SF= 250.13
##$SI= 32768
##$SIGF1= 0
##$SIGF2= 0
##$SINO= 400
##$SIOLD= 32768
##$SREGLST= <1H.DMSO>
##$SSB= 0
##$STSI= 32768
##$STSR= 0
##$SW_p= 5175.98343685301
##$SYMM= 0
##$S_DEV= 0
##$TDeff= 65536
##$TDoff= 0
##$TI= <Analysis number 999999
Compound Code 99
Book Reference 9
Project Code 9>
##$TILT= no
##$TM1= 0
##$TM2= 0
##$TOPLEV= 0
##$USERP1= <user>
##$USERP2= <user>
##$USERP3= <user>
##$USERP4= <user>
##$USERP5= <user>
##$WDW= 1
##$XDIM= 32768
##$YMAX_p= 405238538
##$YMIN_p= -260515
$$ End of Bruker specific parameters
$$ ---------------------------------
##NTUPLES= NMR SPECTRUM
##VAR_NAME=  FREQUENCY,     SPECTRUM/REAL,   SPECTRUM/IMAG
##SYMBOL=    X,             R,               I
##VAR_TYPE=  INDEPENDENT,   DEPENDENT,       DEPENDENT
##VAR_FORM=  AFFN,          ASDF,            ASDF
##VAR_DIM=   32768,         32768,           32768
##UNITS=     HZ,            ARBITRARY UNITS, ARBITRARY UNITS
##FACTOR=    0.157963299565203, 1,           1
##FIRST=     4132.6476996994, 0,             0
##LAST=      -1043.33573715361, 0,           0
##MIN=       -1043.33573715361, -260515,     0
##MAX=       4132.6476996994, 405238538,     0
$$ Real data points
##PAGE= N=1
##DATA TABLE= (X++(R..R)), XYDATA
$$ [...]
26439F5912K6406l3277p5715q1750J018M8905K7393m2635J1386J04054k2379n5957
$$ 65912 92318 59041 -16674 -98424 -97406 -48501 -21108 -63743 -52357 51697 29318 -26639
26427b6639K5997n5865K0880k2911Q503J6324M5317K9938k3643k5388P9443k3931
$$ -26639 -642 -56507 -35627 -58538 -50035 -33711 11606 41544 17901 -7487 71956 48025
26415D8025j14947l6004m658n144j2656O2355M7658K0218K4211j0354J9592j0414
$$ 48025 -66922 -102926 -107584 -112728 -125384 -63029 -15371 4847 29058 18704 38296 27882
26403B7882j6813K5508k7939p4797P2499m1827N876L3721M3595j0094l5712K7254
$$ 27882 11069 36577 8638 -66159 6340 -35487 -29611 4110 47705 37611 1899 29153
26391B9153m4477l1988M9850M0662l3474k2350Q8095M6183k884k5777N1012q0535
$$ 29153 -15324 -47312 2538 43200 9726 -12624 75471 121654 118770 92993 144005 63470
26379F3470k6063J0396r829j0921J5324j2042o447p630k979l1511L0302N9518
$$ 63470 37407 47803 37974 27053 42377 30335 23888 16258 13279 -18232 12070 71588
26367G1588l3729j22J4639Q978J6022O6205M5740L867o205m5990o9563K6575L9417
$$ 71588 37859 37737 52376 61354 77376 143581 189321 193188 186983 140993 71430 98005 137422
26354A37422J9044j01535p8982j0787r690J5802M2618R218j7834M9718j953k167
$$ 137422 156466 54931 -24051 -34838 -44528 -28726 13892 23110 5276 54994 53041 50874
26342E0874n981n7646R98N1979Q0332r667j9634m9730q2383O2172J30493r616
$$ 50874 44893 -12753 -11755 40224 120556 110889 91255 41525 -40858 21314 151807 142191
26330A42191k6536K0511Q374m5337j2474J4670k2925p5666j720l1765Q5142N2366
$$ 142191 115655 136166 144540 99203 86729 101399 78474 2808 1088 -30677 54465 106831
26318A06831l6796m3640r159P658n6973m9062O73L3410L3197J8190K9549M743
$$ 106831 70035 26395 17236 24894 -32079 -81141 -80468 -47058 -13861 4329 33878 38621
26306C8621l0112J3362J1895Q96k9127K372P66o5093K4280Q6564k3206l9341r0204
$$ 38621 8509 21871 33766 34662 5535 7907 8673 -56420 -32140 54424 31218 -8123 -98327
26293i8327k1513M9381R202n3013j9510J5211L9724N7340p383l2458j4369l2490
$$ -98327 -119840 -70459 -61257 -114270 -133780 -118569 -78845 -21505 -28888 -61346 -75715 -108205
26281a08205k0492j1913m4524K0236O4353K4671o7101m8485q472N5833R0936Q154
$$ -108205 -128697 -140610 -185134 -164898 -100545 -75874 -142975 -191460 -199932 -144099 -53163 -45009
26269d5009K7760K4021K3979l5370o5156k3744M2117M1019L1664o533p969J624
$$ -45009 -17249 6772 30751 -4619 -69775 -93519 -51402 -10383 21281 14748 6779 8403
26257H403m2258r845j0169k556J464r384m690j914L4349N7201l629k7513L7323
$$ 8403 -33855 -43700 -53869 -56425 -54961 -64345 -69035 -70949 -36600 20601 16972 -10541 26782
26244B6782L9016k7846l7702j12110k734M5858P5228N1177L2247k8099J4141J1350
$$ 26782 65798 37952 250 -111860 -114594 -68736 6492 57669 89916 61817 75958 87308
26232H7308K5159l8684J1965J1412k4833J1584K6262j2245n9336M3685K0383M910
$$ 87308 112467 73783 85748 97160 72327 83911 110173 97928 38592 82277 102660 107570
26220A07570m5458k6693N138O5108N2856j0921M3886K9142q862m8500o9506m7080
$$ 107570 62112 35419 40557 105665 158521 147600 191486 220628 211766 163266 93760 46680
26208D6680l747K0317O1783L603K2911M2816L605m8073j9638L2178K3493K6854
$$ 46680 42933 63250 125033 128636 151547 194363 197968 149895 130257 162435 185928 212782
26196B12782n4724j19026m0943n6328k3555J36L3397k8132J4754L2138M3145L6305
$$ 212782 158058 39032 -1911 -58239 -81794 -81658 -48261 -76393 -61639 -29501 13644 49949
26184D9949J0393p5863O989M3250J5602p1093k6295N2873L4732K148p1435r0622
$$ 49949 60342 -15521 -8532 34718 50320 -20773 -47068 5805 40537 42685 -28750 -119372
26172a19372O1210R2311n063q1864K1681K3331k5551m9900J1586N6970L9414K7625
$$ -119372 -58162 34149 29086 -52778 -31097 -7766 -33317 -83217 -71631 -14661 24753 52378
26160E2378p1180J6456N5580L8817R169n5729q5192k7531K2335j1398j6731J4049
$$ 52378 -18802 -2346 53234 92051 101220 45491 -39701 -67232 -44897 -56295 -73026 -58977
26148e8977l6160K1916p847M5529q844l7345J134N5820J5836M4875l15k7209n714
$$ -58977 -95137 -73221 -81068 -35539 -44383 -81728 -80594 -24774 -8938 35937 35622 8413 2699
26135B699o7783k8629L8915q018L1107O0308J0316m7944k6713k8626M1167L5033
$$ 2699 -65084 -93713 -54798 -62816 -31709 28599 38915 -9029 -35742 -64368 -23201 11832
26123A1832j7683m3285k2331j141J6009k1962k2219O0797l1600j851J3256M6607
$$ 11832 -5851 -49136 -71467 -72608 -56599 -78561 -100780 -39983 -71583 -73434 -60178 -13571
26111a3571O193j9524J5855k657j8903k8747l0404K0882k6853M6583O1525R270
$$ -13571 -7378 -26902 -11047 -13704 -32607 -61354 -91758 -70876 -97729 -51146 10379 19649
26099A9649r890m2681L3330J1424n6422q495R7804m139m885P6148k466o0111o9458
$$ 19649 9759 -32922 408 11832 -44590 -53085 44719 40580 35695 111843 109377 49266 -20192
26086b0192N557L8282k6700J749m972K1405P669n5317p471r6r929K4644k3686
$$ -20192 -14635 23647 -3053 -1304 -6276 15129 22798 -32519 -39990 -40086 -50015 -25371 -49057
26073d9057L0379k541j295J6914j682n5912k4316Q390O5243J4630n7336J0038
$$ -49057 -18678 -21219 -22514 -5600 -7282 -63194 -87510 -79120 -13877 753 -56583 -46545
26061d6545M5167k8321m1305m3986R238L0920N8790J8309l5704L1705j7329q7826
$$ -46545 -1378 -29699 -71004 -114990 -105752 -74832 -16042 2267 -33437 -1732 -19061 -106887
26049a06887j8749O0904M152k0354j3308O9106J3136l5500p1076j2893P3816o74
$$ -106887 -125636 -64732 -60580 -80934 -94242 -25136 -12000 -47500 -118576 -131469 -57653 -58327
26037e8327K6407K521M6577J725J123P832q092k751o679J8905n2703p663J3101
$$ -58327 -31920 -29399 17178 18903 20026 27858 19766 17015 10336 29241 -23462 -31125 -18024
26024a8024M0132J0869p6290o8622m5378O7246P6206L1962J6851k212L0275L7715
$$ -18024 22108 32977 -43313 -111935 -157313 -90067 -13861 18101 34952 32740 63015 100730
26012A00730n8948p8919l5361r076q892J1200J5520m293N352R096j4614K6167
$$ 100730 41782 -37137 -72498 -81574 -90466 -79266 -63746 -68039 -62687 -53591 -68205 -42038
26000d2038J5348M4024k9169o2692l9902K4107J5973N1118J9341J3213J8405l9894
$$ -42038 -26690 17334 -11835 -74527 -114429 -90322 -74349 -23231 -3890 9323 27728 -12166
25988a2166n5047l3213K3154N9580J8219m2637l4691J1235K9240l9371m5520K7535
$$ -12166 -67213 -100426 -77272 -17692 527 -42110 -76801 -65566 -36326 -75697 -121217 -93682
25976i3682M3341j4771j3721L6946L8199L9904L4190J0275l3236m3448R117K4821
$$ -93682 -50341 -65112 -78833 -41887 -3688 36216 70406 80681 47445 3997 13114 37935
25964C7935q147l4215o0251j7602o6794k4777r186K1232R0091K8716q3908M1182
$$ 37935 29788 -4427 -64678 -82280 -149074 -173851 -183037 -161805 -71714 -42998 -126906 -85724
25952h5724J8673N8407M3889J7675j2176K3625k0768q4333J9754k1827O190j2157
$$ -85724 -67051 -8644 35245 52920 40744 64369 43601 -40732 -20978 -42805 -36615 -48772
25940d8772m9744Q8700Q1139M2267m9099p0806p4720J3523j395j2897R777k2299
$$ -48772 -98516 -9816 71323 113590 64491 -6315 -81035 -67512 -68907 -81804 -72027 -94326
25928i4326j596J0503M5213J6379K3926k0709j5350J10948R774r0081k5707P866
$$ -94326 -95922 -85419 -40206 -23827 99 -20610 -35960 74988 84762 -5319 -31026 -23160
25916b3160q222j0801R429L5731j9225j2508k402K9472M3318k0641l7673N10r195
$$ -23160 -31382 -42183 -32754 2977 -16248 -28756 -31158 -1686 41632 20991 -16682 -16172 -25367
25903b5367o6110J1965J1536L0755j7179K3247L0876K3994M7932o5114j4839P423
$$ -25367 -91477 -79512 -67976 -37221 -54400 -31153 -277 23717 71649 6535 -8304 -881
25891h81j0070L650r68l389m498J4067K7896J4813j2734O8856J6822n293q4384
$$ -881 -10951 -7301 -8269 -11658 -16156 -2089 25807 40620 27886 96742 113564 108271 23887
25878B3887j43014q8581J1582L0595N2491J03851K3342M588k595O172m9376n4733
$$ 23887 -119127 -207708 -196126 -165531 -113040 -9189 14153 18741 16146 22318 -27058 -81791
25866h1791q290K3472M4524l9985p3082m446R0282Q2805k5430o0566l844o1948
$$ -81791 -90081 -66609 -22085 -62070 -135152 -139598 -49316 33489 8059 -52507 -56351 -118299
25854a18299l9698k7491J2359M4462K1901L7073m1584O5826M2825l5021p05O0932
$$ -118299 -157997 -185488 -173129 -128667 -106766 -69693 -111277 -45451 -2626 -37647 -38352 22580
25842B2580K8361L2954r873l217m3212o0774l1518M0991p713l641l9999j2039
$$ 22580 50941 83895 74022 70805 27593 -33181 -64699 -23708 -31421 -35062 -75061 -87100
25830h7100M1974l3967m639j3278K6024N5278l403k4391j3461J3837M4119R532
$$ -87100 -45126 -79093 -83732 -97010 -70986 -15708 -19111 -43502 -56963 -43126 993 10525
25818A0525J2852L3844j5270l3277K6658k5753j0763l978j4431M3614J0329o8952
$$ 10525 23377 57221 41951 8674 35332 9579 -1184 -5162 -19593 24021 34350 -34602
25806c4602l9240p2065j414P0715J5326N0041M4918J0055r4224o6417q23O4646
$$ -34602 -73842 -145907 -147321 -76606 -61280 -11239 33679 43734 -50490 -116907 -117730 -53084
25794e3084J6004J0759m7088N59K4153k4630L833J57K735j6800l0106K4750L6916
$$ -53084 -37080 -26321 -73409 -72850 -48697 -73327 -69494 -69337 -66602 -83402 -113508 -88758 -51842
25781e1842k4303j9474L1173N7271Q3836n5875m4709o8158j4525L0205L9648J2332
$$ -51842 -76145 -95619 -64446 -7175 76661 20786 -23923 -92081 -106606 -76401 -36753 -24421
25769b4421j4299k1528k0899L6067M1621J5965O607J1898p974l2941j6648O4402
$$ -24421 -38720 -60248 -81147 -45080 -3459 12506 19113 31011 23037 -9904 -26552 37850
25757C7850R072q428J2483J1292K1252P671m9822j9790M0781k3602l7357q2475
$$ 37850 46922 38494 50977 62269 83521 91192 41370 21580 62361 38759 1402 -81073
25745h1073o9208R4419O2533K4597k2601K7381J0588j9997m8469l1336k701P1383
$$ -81073 -150281 -55862 6671 31268 8667 36048 46636 26639 -21830 -53166 -55867 15516
25733A5516r196K120J9861k3998O447L0646L8691L6161o9509m2302k6136K5779
$$ 15516 6320 8440 28301 4303 10750 41396 80087 116248 46739 4437 -21699 4080
25721D080J3708k2556k090o8810p2278M3905O4136p316n3194k4359N5767N1401
$$ 4080 17788 -4768 -6858 -75668 -147946 -104041 -39905 -47221 -100415 -124774 -69007 -17606
25709a7606q689l9139j548N3267j7122k1226n7285P551J4343j4145l8426J3752
$$ -17606 -26295 -65434 -66982 -13715 -30837 -52063 -109348 -101797 -87454 -101599 -140025 -126273
25697a26273L7566R7909j5924j5077K4606m592K3617r156K6075J784j24259n4474
$$ -126273 -88707 9202 -6722 -21799 2807 -1785 21832 12676 38751 40535 -83724 -138198
25685a38198J7112k6326K9173j8889p757L8257Q4335O4615n6435k6854L2359j681
$$ -138198 -121086 -147412 -118239 -137128 -144885 -106628 -22293 42322 -14113 -40967 -8608 -10289
25673a0289m3428j8197R0776P2987j16145q7753J0772J8023n8424Q898j6243J4705
$$ -10289 -53717 -71914 18862 91849 -24296 -112049 -101277 -83254 -141678 -132780 -149023 -134318
25661a34318J23138J27731L3974q9608p5025l8837R139J8937M4570j395R449J9828
$$ -134318 -11180 116551 150525 60917 -14108 -52945 -43806 -24869 19701 18306 27755 47583
25649D7583j6118k1512N2197j3460k7718M3407K757k5165l7295m1043j0342L1155
$$ 47583 31465 9953 62150 48690 20972 64379 67136 41971 4676 -36367 -46709 -15554
25637a5554J1862m6120j8206J5035J9868p2308o0012N5895N3357K0853M9138M5509
$$ -15554 -3692 -49812 -68018 -52983 -33115 -105423 -165435 -109540 -56183 -35330 13808 59317
25625E9317o1370m0981l7637N4686O0107J3689M926l3138J4966o973o5415j0645
$$ 59317 -2053 -43034 -80671 -25985 34122 47811 52737 19599 34565 27592 -37823 -48468
25613d8468M9625L325o3387P209m204J4288l595L0859p209k9434K2226p4986L6112
$$ -48468 1157 4482 -58905 -51696 -55900 -41612 -45207 -14348 -21557 -50991 -28765 -103751 -67639
25600f7639J465l106J5722P312k2443J0285Q154K5619N9675L3360n0850o8262
$$ -67639 -66174 -69280 -53558 -46246 -68689 -58404 -50250 -24631 35044 68404 17554 -50708
25588e0708l9594n5417L2811R7168P0404J3616p0695o9858P747L05J884L1702
$$ -50708 -90302 -145719 -112908 -15740 54664 68280 -2415 -72273 -64526 -64221 -62337 -30635
25576c0635P873r794K4694K6412l768l1545m8640N7649J319j3684k9383o1617
$$ -30635 -22762 -32556 -7862 18550 14782 -16763 -65403 -7754 -6435 -20119 -49502 -111119
25564a11119J4731M4036k6761L5693N4661K1313k5691J8024n5954m013M2573n978
$$ -111119 -96388 -52352 -79113 -43420 11241 32554 6863 24887 -31067 -35080 7493 1515
25552A515q4213k8111J14381J6667M86n960Q161j3840q454J9259K149k6055K9944
$$ 1515 -82698 -110809 3572 20239 20725 14765 22926 9086 632 19891 22040 -4015 25929
25539B5929m828L051k234p204n0080l7837M8627O649J8314o1582m0147q72M6527
$$ 25929 21101 24152 21918 14714 -35366 -73203 -24576 -17927 387 -61195 -101342 -102214 -55687
25526e5687P3627L155l0087l1963N3761J4325j2469k9694M386l7047k0580R447
$$ -55687 17940 21095 -8992 -40955 12806 27131 14662 -15032 -10646 -47693 -68273 -58826
25514e8826l043p0420L7728K0141k3920K4597j3092M8549K1004m1900m5376m525
$$ -58826 -61869 -132289 -94561 -74420 -98340 -73743 -86835 -38286 -17282 -59182 -104558 -109083
25502a09083R6786P2628j8522N855N434k5527o2728L3316K7540k0653j3872K6741
$$ -109083 -12297 60331 41809 47664 53098 27571 -35157 -1841 25699 5046 -8826 17915
25490A7915k684J5658m7904r1302r13P1700l2051M800j2148N745M118l8020J0285
$$ 17915 15231 30889 -17015 -108317 -109230 -37530 -69581 -64781 -76929 -71184 -67066 -105086 -94801
25477i4801J7310m730j6523J5784K2366n7060k7361Q1196M2117r1441m55M8347
$$ -94801 -77491 -82221 -98744 -82960 -60594 -117654 -145015 -63819 -21702 -113143 -113598 -65251
25465f5251K8343k5225K1840k3993l8359J5601j9089O0143j6560m2388k1832L3002
$$ -65251 -36908 -62133 -40293 -64286 -102645 -87044 -106133 -45990 -62550 -104938 -126770 -93768
25453i3768N7322K0511o6588m3680L611K9342K7578P558J1374R554j2833l7585
$$ -93768 -36446 -15935 -82523 -126203 -122592 -93250 -65672 -58114 -46740 -37186 -50019 -87604
25441h7604L962N804L9672J3872r340P581l1308j0632J7090K782N7315m8231q7828
$$ -87604 -83642 -77838 -38166 -24294 -33634 -26053 -57361 -67993 -50903 -48121 9194 -39037 -126865
25428a26865l8298p125K2193M0760O5511l3404R681M0575J4004j3219o2950n7790
$$ -126865 -165163 -172288 -150095 -109335 -43824 -77228 -67547 -26972 -12968 -26187 -89137 -146927
25416a46927K8080o0424m9920J21757k4878m6698L3716N9996J17882p656K8949
$$ -146927 -118847 -179271 -229191 -107434 -132312 -179010 -145294 -85298 32584 24928 53877
25405E3877o8171m1243N631J9567K3893k5205m1558L262l0942l4315k3968O7647
$$ 53877 -14294 -55537 -49906 -30339 -6446 -31651 -73209 -69947 -100889 -135204 -159172 -91525
25393i1525J8672j941j378J6644j0623K1741O4J4782k9093K0195j2181O231M2077
$$ -91525 -72853 -74794 -76172 -59528 -70151 -48410 -48346 -33564 -62657 -42462 -54643 -48412 -6335
25380f335L8901J1387p2941j1409J1902M658n25k202K6964J5534j183L222L7101
$$ -6335 32566 43953 -28988 -40397 -28495 -23837 -24362 -26564 400 15934 14751 17973 55074
25367E5074k981l349n3937o2532L1105n4390o2063j6712M5069m3114l7558n362
$$ 55074 52093 48744 -5193 -67725 -36620 -91010 -153073 -169785 -124716 -167830 -205388 -210750
25355b10750P5752P5507N6926p4870p162N4065k0697M226O680j4269L4599Q0120
$$ -210750 -134998 -59491 -2565 -77435 -84597 -30532 -51229 -47003 -40323 -54592 -19993 60127
25343F0127j5819p6395q2236J5027L2760L2407L0134K1617J1265L576m3201k6131
$$ 60127 44308 -32087 -114323 -99296 -66536 -34129 -3995 17622 28887 32463 -10738 -36869
25331c6869P2636j788j1074j5155k7215O6613j8980j9280J0871N0826N9864k0232
$$ -36869 35767 33979 22905 7750 -19465 47148 28168 8888 19759 70585 130449 110217
25319A10217L703P5535p0082l8161j0751o786n2606m4503k5327M7839k5188l9985
$$ 110217 113920 189455 119373 81212 70461 63675 11069 -33434 -58761 -10922 -36110 -76095
25307g6095K1527O4336M9734K1624r746M331k7192k6188m3741K1291j5852O3876
$$ -76095 -54568 9768 59502 81126 71380 75711 48519 22331 -21410 -119 -15971 47905
25295D7905O522k3144l5644q189l1100N3965j7787r322r003r162K444J3212m9429
$$ 47905 54427 31283 -4361 -12550 -43650 10315 -7472 -16794 -25797 -34959 -32515 -19303 -68732
25282f8732N1507J19811J4383k8413m8971m0310J6160M0964l3053m3205n2831
$$ -68732 -17225 102586 116969 88556 39585 -725 15435 56399 23346 -19859 -72690
25271g2690N4868M3633k9834n9508M1659K6084J0958k5212J0720j157L6163K4906
$$ -72690 -17822 25811 -4023 -63531 -21872 4212 15170 -10042 678 -479 35684 60590
25259F0590n7105o3558L0522m580j1382N0720l8596o6274p624L3991l3327j5627
$$ 60590 3485 -60073 -29551 -34131 -45513 5207 -33389 -99663 -107287 -73296 -106623 -122250
25247a22250R627J384j1001o507L7401J2035K4947l184M05J00265J7897l8895
$$ -122250 -112623 -111239 -122240 -128747 -91346 -79311 -54364 -57548 -57143 43122 61019 22124
25235B2124m8056N645m4585l1182j4027K89P0718Q7774J1716o5242p1761K6171
$$ 22124 -25932 -20287 -64872 -96054 -110081 -109792 -39074 48700 60416 -4826 -76587 -50416
25223e0416k0170j7887n2263M1614M4811N7865Q298M741k7500m6383k3106l2063
$$ -50416 -70586 -88473 -140736 -99122 -54311 3554 11852 16593 -10907 -57290 -80396 -112459
25211a12459O981J3130P5654K4813j3978p3054J9214Q6318N7986M595l4412N0438
$$ -112459 -105478 -92348 -16694 8119 -5859 -78913 -59699 26619 84605 89200 54788 105226
25199A05226k1529l7280j8040l8115j2168k6839p042P0568N0288M8889o5692p6211
$$ 105226 83697 46417 28377 -9738 -21906 -48745 -55787 14781 65069 113958 48266 -27945
25187b7945r9319j3537N6895K5405P2203J5559j4786n991n1217k4158m839K3874
$$ -27945 -127264 -140801 -83906 -58501 13702 29261 14475 8484 -42733 -66891 -71730 -47856
25175d7856L3863J811J0480k1638k1753J2757M2965J2045M4856k5863r5002p2701
$$ -47856 -13993 -12182 -1702 -23340 -45093 -32336 10629 22674 67530 41667 -53335 -126036
25163a26036P5572k5270J3535J2816L1606n6631j4708L2624O0904l79L0947n1738
$$ -126036 -50464 -75734 -62199 -49383 -17777 -74408 -89116 -56492 4412 4033 34980 -16758
25151a6758o2591r838N2498J2136j0449m2547L7671m5495J2537M0098J19J63L2580
$$ -16758 -79349 -89187 -36689 -24553 -35002 -77549 -39878 -85373 -72836 -32738 -32619 -32456 124
25138A24l0286l1316K44J5256K0621O406L009j0752J0119l5154L5430N7038M8090
$$ 124 -30162 -61478 -61234 -45978 -25357 -18951 -15942 -26694 -16575 -51729 -16299 40739 88829
25125H8829j2099q0625l1255O0450P3582l285j476p2518l0117m1291l4521M1520
$$ 88829 76730 -3895 -35150 25300 98882 95597 94121 21603 -8514 -49805 -84326 -42806
25113d2806k4328L8180O6617N0394L891l5135k5351o5540M5987K0145o7828l0064
$$ -42806 -67134 -28954 37663 88057 91948 56813 31462 -34078 11909 32054 -35774 -65838
25101f5838j5606L7212P8414n4442p7249l9542j3460j1385Q385M7561m680j6609
$$ -65838 -81444 -44232 34182 -20260 -97509 -137051 -150511 -161896 -153511 -105950 -110630 -127239
25089a27239k4747j3493M7064L3876R417L9462j9275Q373o113r602j7815Q8725
$$ -127239 -151986 -165479 -118415 -84539 -75122 -35660 -54935 -46562 -52675 -62277 -80092 8633
25077H633j109m8552l8466J3923j3783q8372L2861J3489k0206J0586J5075m754
$$ 8633 7524 -41028 -79494 -65571 -79354 -167726 -134865 -121376 -141582 -130996 -115921 -120675
25065a20675N5903P0117P0799n992o3103l6512P7014O457p029k4044Q73M4593
$$ -120675 -64772 5345 76144 70152 7049 -29463 47551 54008 46979 22935 23808 68401
25053F8401l741j4785l8348l9400K1313O936L0262R662k2724l7812N5504Q56n9805
$$ 68401 64660 49875 11527 -27873 -6560 376 30638 40300 17576 -20236 35268 36124 -23681
25040b3681l4104K0937P7158N095n3542q6306K0802M6087K0928l1605k4701j6449
$$ -23681 -57785 -36848 40310 45405 -8137 -94443 -73641 -27554 -6626 -38231 -62932 -79381
25028g9381m92M606K0859M3428L0063r348m453j5337q365k3484k8283p1767k2022
$$ -79381 -79873 -75267 -54408 -10980 19083 9735 5282 -10055 -18420 -41904 -70187 -141954 -163976
25015a63976O7090N8274N6586j402m3009J6056k3150J3729o7013m8993Q1591Q3898
$$ -163976 -96886 -38612 17974 16572 -26437 -10381 -33531 -19802 -86815 -135808 -54217 29681
25003B9681k4831N6290L1651n2745n9179L139n6496j7348M7172M2760J777j8823
$$ 29681 4850 61140 92791 40046 -19133 -15994 -72490 -89838 -42666 94 1871 -16952
24991a6952J504K8560l2550n0092p1947M533K82k5686K5353M1031N7289K7965
$$ -16952 -15448 13112 -19438 -69530 -141477 -136944 -136662 -162348 -136995 -95964 -38675 -10710
24979a0710j146K4213J2063m4705j7934o301L5458j5984l7487K1310j4772l0605
$$ -10710 -11856 12357 24420 -20285 -38219 -44520 -9062 -25046 -62533 -41223 -55995 -86600
24967h6600M0976M1301l5347o1919K6962Q8527j4027j6915l5927N9718J7854o7852
$$ -86600 -45624 -4323 -39670 -101589 -74627 13900 -127 -17042 -52969 6749 24603 -43249
24955d3249m0025M2640m5928J4123O977k7264m859j1613J6351J3860P5562L6709
$$ -43249 -83274 -40634 -86562 -72439 -65462 -92726 -97585 -109198 -92847 -78987 -3425 33284
24943C3284R990M7495L7043q2898k0186M473k0474m9515J8721j9352J2916N7087
$$ 33284 43274 90769 127812 44914 24728 29201 8727 -40788 -22067 -41419 -28503 28584
24931B8584J6833q9955p5983J5446K9974J9444j7292M1962K0590n4739k3411J5696
$$ 28584 45417 -44538 -120521 -105075 -75101 -55657 -72949 -30987 -10397 -65136 -88547 -72851
24919g2851J3548J9216N462K8694m6799o2928Q517N0248l1451O2121Q2298J1192
$$ -72851 -59303 -40087 -34625 -5931 -52730 -115658 -107141 -56893 -88344 -26223 56075 67267
24907F7267q1556o6076m5352j9932Q6949M7772m6500K0527O5921k413p4302k9517
$$ 67267 -14289 -80365 -125717 -145649 -58700 -10928 -57428 -36901 29020 26607 -47695 -77212
24895g7212M9352J6631q7023j4778J01941K2332k8417j5614k357M9980k6902l2466
$$ -77212 -27860 -11229 -98252 -113030 -11089 11243 -17174 -32788 -35145 14835 -12067 -44533
24883d4533j5710L2227M6518K7546J00450p826p4777o5719q0215m144J7717J5266
$$ -44533 -60243 -28016 18502 46048 146498 138672 63895 -1824 -82039 -86183 -68466 -53200
24871e3200K3850l9181n3073M2824J5839N7140J1766k7688L2376K0798l9501K6389
$$ -53200 -29350 -68531 -121604 -78780 -62941 -5801 5965 -21723 10653 31451 -8050 18339
24859A8339L7942k0808m0350l2597k0706K9917N9163P406n6473k7668j0873K1013
$$ 18339 56281 35473 -4877 -37474 -58180 -28263 30900 38306 -18167 -45835 -56708 -35695
24847c5695l3601l9903k6535K2931J8041J7611r967k6191j1832m059j9869M740
$$ -35695 -69296 -109199 -135734 -112803 -94762 -77151 -87118 -113309 -125141 -129200 -149069 -144329
24835a44329J04518O5735R53J277q993j8412J6217J2867J296l8452n6523p006
$$ -144329 -39811 25924 26877 28154 19161 749 16966 29833 31129 -7323 -63846 -70852
24823g0852L3418P146k0368M5302P725l5593O613k4375r253L204k308l1338k0769
$$ -70852 -37434 -30288 -50656 -5354 2371 -33222 -26609 -50984 -60237 -57033 -59341 -90679 -111448
24810a11448J9279L5979O9634l0915k0520N3185N6336l5606n4233Q983o175r081
$$ -111448 -92169 -56190 13444 -17471 -37991 15194 71530 35924 -18309 -9326 -15501 -24582
24798b4582R146J0654k5296J3215L8017j9997l451p52q374r775k5171K1515L3003
$$ -24582 -15436 -4782 -30078 -16863 21154 1157 -2294 -3046 -11420 -21195 -46366 -24851 8152
24785H152k5000l0099o0325P081l1832O18N4635P2662J9667j5765k2741k6428
$$ 8152 -16848 -46947 -107272 -100191 -132023 -131405 -76770 -4108 15559 -206 -22947 -49375
24773d9375M2872J3130j567j6063K4270J4252l3817J4514O1814M6808p2146p1483
$$ -49375 -6503 6627 5060 -11003 13267 27519 -6298 8216 70030 116838 44692 -26791
24761b6791j8867k2987N419k0900k8684p017P825M2048j976J2485P7304j2121
$$ -26791 -45658 -68645 -63226 -84126 -112810 -119827 -112002 -69954 -71930 -59445 17859 5738
24749E738k1304j2516J7364l915o453n1162J1954j3489j7100j5061k5631L4128
$$ 5738 -15566 -28082 -10718 -14633 -21086 -72248 -60294 -73783 -90883 -105944 -131575 -97447
24737i7447j508M9932O5244k6893k5460k0593k3478L7737j145n596n4434L0212
$$ -97447 -98955 -49023 16221 -10672 -36132 -56725 -80203 -42466 -43611 -49207 -103641 -73429
24725g3429j6857L2256L9504k9012o0493Q970Q848P7356L4338p9580j8901K6650
$$ -73429 -90286 -58030 -18526 -47538 -108031 -99061 -90213 -12857 21481 -58099 -77000 -50350
24713e0350n1834o108J4313K3457K3191L7776j933K9712p6751j5856P2049l7357
$$ -50350 -102184 -108292 -93979 -70522 -47331 -9555 -11488 18224 -58527 -74383 -2334 -39691
24701c9691q4478j9746O5659L1534K2049K9929j0501m9536j3480O2287L0018Q7577
$$ -39691 -124169 -143915 -78256 -46722 -24673 5256 -5245 -54781 -68261 -5974 24044 111621
24689A11621M1217p4722k9323p825L7669n8356N3863m5888k6468l23M3377L2885
$$ 111621 152838 78116 48793 40968 78637 20281 74144 28256 1788 1465 44842 77727
24677G7727J3113k2267k5364n9035L0941J3257m0532K0756n1403p428k8042l2287
$$ 77727 90840 68573 43209 -15826 15115 28372 -12160 8596 -42807 -50235 -78277 -110564
24665a10564P300M3978j1969n2988K9353J53927M9219m4664j4600j8823o1144
$$ -110564 -103264 -59286 -71255 -124243 -94890 59037 108256 63592 48992 30169 -30975
24654c0975P132K5681M9921J710k1259n1746M8609J4479q0244l7827O6123K957
$$ -30975 -23843 1838 51759 53469 32210 -19536 29073 43552 -36692 -74519 -8396 -5439
24642e439Q6118J437j630J7692k8675K6898M7557K9884n7983q1183K7895Q4234
$$ -5439 80679 82116 80486 98178 69503 96401 143958 173842 115859 34676 62571 146805
24630A46805q178k914k5673r4380m2241l2639k4910L4594m647j5196k3391K0024
$$ 146805 138627 135713 110040 15660 -26581 -59220 -84130 -49536 -54183 -69379 -92770 -72746
24618g2746J12588O737l4210M0248l0509p0521K6238k3661k2645Q3750M8194o0066
$$ -72746 39842 46579 12369 52617 22108 -48413 -22175 -45836 -68481 15269 63463 3397
24606C397n8968M542K9903O3184M6390n9492j8878L8504L8097l8289l6141K639
$$ 3397 -55571 -51029 -21126 42058 88448 28956 10078 48582 86679 48390 12249 14888
24594A4888k4762q075J0144L0058k1629j6517N623L3244K9968N277k2177L201
$$ 14888 -9874 -17949 -7805 22253 624 -15893 -10270 22974 52942 58219 36042 39243
24582C9243J890k0988M2014j1133o641L499O2658J2972N7110k5667l4203L69O4611
$$ 39243 41133 20145 62159 51026 44385 47884 110542 123514 180624 154957 120754 121123 185734
24569A85734o1223j2567J3715J6816L8229n9707R58K2612n6518L1368O3676r146
$$ 185734 124511 111944 125659 142475 180704 120997 121955 144567 88049 119417 183093 173947
24557A73947L079N9377P1707L1292k0693j0644o197k9652o505J9956q974j9905
$$ 173947 177026 236403 308110 339402 318709 308065 301868 272216 265711 285667 276693 256788
24545B56788J6243K1634O2870R43J3879L8382K1702J6444j098L8268L538l9117
$$ 256788 273031 294665 357535 358478 372357 410739 432441 448885 447787 486055 489593 450476
24533D50476k2093m7319j2627K0171L3383N733m1002K9718J5678L0662M6659m8178
$$ 450476 428383 381064 368437 388608 421991 427724 386722 416440 432118 462780 509439 461261
24521D61261p3628K0937m9421j34841l0771O4821K915j1596n9178K3571O2301
$$ 461261 387633 408570 359149 224308 193537 258358 261273 249677 190499 214070 276371
24510B76371L0863q647P542j0322J6117n8746J4116J9024O5961J6909l756o268
$$ 276371 307234 298587 306129 295807 311924 253178 267294 286318 352279 369188 365432 359164
24498C59164J161l0444J4050m963L0673m9532M810k2761k2580k3926o5836k7639
$$ 359164 360325 329881 343931 338968 369641 320109 324919 302158 279578 255652 189816 162177
24486A62177r767N1913m1013o9412K6109M2069N1701N0880L6653l1395j6489l3483
$$ 162177 152410 204323 163310 93898 120007 162076 213777 264657 301310 269915 253426 219943
24474B19943J9341n821n1082k1433K8501K4867j4422J1895n3869j9102J631M8070
$$ 219943 239284 233463 182381 160948 189449 214316 199894 211789 157920 138818 140449 188519
24462A88519n1792o734J11076O8582j0116k6531r398k336j5859L6463L105J1166
$$ 188519 136727 129993 241069 309651 299535 273004 263606 261270 245411 281874 284979 296145
24450B96145j4222o8726p1430q213M6027m484k5007o8446N3930J3635k6596J9848
$$ 296145 281923 213197 141767 133554 179581 175097 150090 81644 135574 149209 122613 142461
24438A42461n649m8929N570N3020l452n6813o114P4188M8996M03n282n5611j0571
$$ 142461 136812 87883 93453 146473 143021 86208 80094 154282 203278 203681 198399 142788 132217
24425A32217M8076j7482l8417K9309N3835q4945o7841j0456m250m9910r198M1603
$$ 132217 180293 162811 124394 153703 207538 122593 54752 44296 40046 -9864 -19062 22541
24413B2541Q3759N3754n1755o886k7166m0549J206J4925J06999O729p5035M8204
$$ 22541 106300 160054 108299 101413 74247 33698 34904 49829 156828 163557 88522 136726
24401A36726o348K063j5598M0737m9286k1600l238n995L8465j3560J0735m160
$$ 136726 130378 132441 116843 157580 108294 86694 83456 77461 115926 102366 113101 108941
24389A08941J8741Q18m6423j5198j572N4388n1239n0804J6319m4104K3657O6065
$$ 108941 127682 128500 82077 66879 65307 119695 68456 17652 33971 -10133 13524 79589
24377G9589L9298J7573j5520J4968k6796K8751q1220k5909N7384J9687L3305J5490
$$ 79589 118887 136460 120940 135908 109112 137863 56643 30734 88118 107805 141110 156600
24365A56600j2755r8476l7281j0955Q2345k2805L9609M6473p7254l7072J619n5217
$$ 156600 143845 45369 8088 -2867 79478 56673 96282 142755 65501 28429 30048 -25169
24353b5169R079M4629K439j0412p107K2510L4891k7980r203K5969M8498L4515
$$ -25169 -16090 28539 30978 20566 13459 35969 70860 42880 33677 59646 108144 142659
24341A42659l0306o6454m536l5681J5737N207l5165Q395Q7279J24184k4433p959
$$ 142659 112353 45899 41363 5682 21419 26626 -8539 -144 87135 211319 186886 178927
24329A78927J9874m7926l0422j7155l5699m5056n9813J1661K3499K6839n7989
$$ 178927 198801 150875 120453 103298 67599 22543 -37270 -25609 -2110 24729 -33260
24318c3260J4712O2786M2782K4007O5455k8213k4944m18l1618j1316m1341n010
$$ -33260 -18548 44238 87020 111027 176482 148269 123325 122907 91289 79973 38632 33622
24306C3622q9124k0709J4097J7834Q2000J03690L9785r125j01811n6283M809j2134
$$ 33622 -55502 -76211 -62114 -44280 37720 141410 181195 172070 70259 13976 18785 6651
24294F651l7855j2482k5164K0283n312n624J4516O322L1993M0225P6493Q264J9531
$$ 6651 -31204 -43686 -68850 -48567 -53879 -59503 -44987 -38665 -6672 33553 110046 118310 137841
24281A37841n0207j9245m1529L7932J7085j3242l2274j0333L5829K7751K205j0939
$$ 137841 87634 68389 26860 64792 81877 68635 36361 26028 61857 89608 91813 80874
24269H0874q6483k0434K3256L0645K3306p197J9156K0699l0056p0554k0118L4266
$$ 80874 -5609 -26043 -2787 27858 51164 43967 63123 83822 53766 -16788 -36906 -2640
24257b640M3413k3792p101M1164P4238L8954r74o0819k6435l4267O044K7436j0344
$$ -2640 40773 16981 9880 51044 125282 164236 163262 102443 76008 41741 47785 75221 64877
24244F4877j1620K7675L0094M1711L4963p3237r746J4228K9476o2828n9921K5298
$$ 64877 53257 80932 111026 152737 187700 114463 104717 118945 148421 85593 25672 50970
24232E0970p650J0126J80l2241j0286k5165J9960L3343O8387Q0954R518j6515
$$ 50970 43320 53446 53626 21385 11099 -14066 5894 39237 107624 188578 198096 181581
24220A81581q307o7043o3000P596M6560L1086k5322j0049J632k3852m2800j3038
$$ 181581 173274 106231 43231 50827 97387 128473 103151 93102 94734 70882 28082 15044
24208A5044K5721L1289J4270q5985l3513P3954R557L2440K8448J1231n6669j3605
$$ 15044 40765 72054 86324 339 -33174 40780 50337 82777 111225 122456 65787 52182
24196E2182j05765L0262J77411K3176J1136k3301k9974n3023L659M8737k8149
$$ 52182 -53583 -23321 154090 177266 188402 165101 135127 82104 85763 134500 106351
24185A06351J1920k8354M1971j4719m2739l7044J0789L4327l8833p690M6455M9812
$$ 106351 118271 89917 131888 117169 74430 37386 48175 82502 43669 35979 82434 132246
24173A32246m5671p5014L9833Q4180K8312P096J7793r068r9722N4487L6038K7273
$$ 132246 86575 11561 51394 135574 163886 170982 188775 179707 79985 134472 170510 197783
24161A97783L9636J2076p523m3830m5235m6899l3582l0144r666J8512j2378m641
$$ 197783 237419 249495 241972 198142 152907 106008 72426 42282 32616 51128 38750 34109
24149C4109N9619m5203m1365L1439J10277K0062l6055l5263m0552J6061m054Q3586
$$ 34109 93728 48525 7160 38599 148876 168938 132883 97620 57068 73129 69075 152661
24137A52661Q9654q136M231j01953j10010k0876K4427j2480Q4539M2355j2651
$$ 152661 242315 234179 238410 136457 26447 5571 29998 17518 102057 144412 131761
24126A31761M4251k7543J6048m6629o0953o395L3369L8519k7732n865M7630k5850
$$ 131761 176012 148469 164517 117888 56935 50540 83909 122428 94696 88831 136461 110611
24114A10611o1907k2398L928j2103L1428K7700m7426L3728N4480N5663M073n091
$$ 110611 48704 26306 30234 18131 49559 77259 29833 63561 118041 173704 177777 172686
24102A72686J2766L8824L5285J1884J2139m9319l7382p742j2216J0506K8118J3681
$$ 172686 185452 224276 259561 271445 283584 234265 196883 189141 176925 187431 215549 229230
24090B29230l5202n1066L7475N8632K6936j4823J6227n4632m8206k4909Q837Q240
$$ 229230 194028 142962 180437 239069 266005 251182 267409 212777 164571 139662 148499 156739
24078A56739J00489K5481K4793k3373m8385m1911J3423n432O441P5892N4610j4897
$$ 156739 257228 282709 307502 284129 235744 193833 207256 201824 208265 284157 338767 323870
24066C23870J0662m7153K6560J9134L5942M120m0324K8039J01283M0099M9640
$$ 323870 334532 287379 313939 333073 369015 373135 332811 360850 462133 502232 551872
24055E51872k5422n616M7755L9330J16403J29030j666n9952K6205P8810N1969
$$ 551872 526450 520834 568589 607919 724322 853352 851686 791734 817939 896749 948718
24044I48718L5679M8162O5097m1429j0479j8585J7633K9382M8295L3103N468l6055
$$ 948718 984397 1032559 1097656 1056227 1045748 1027163 1044796 1074178 1122473 1155576 1161044 1124989
24032A124989n7078j15304j796o8981o3578M7427K7151m3755l1026o5204M0868
$$ 1124989 1067911 952607 950811 881830 818252 865679 892830 849075 818049 752845 793713
24021G93713k2133n0041n0527o6725r18J1105j7967n7043P04R906r6288j9784
$$ 793713 771580 721539 671012 604287 603369 614474 596507 539464 540168 550074 453786 434002
24009D34002K140l2979J2600k3378p001o98l500k6192j7804K3102j958P1995l3564
$$ 434002 436142 403163 415763 392385 385384 384686 381186 354994 337190 360292 358334 430329 396765
23996C96765K9395j6397J956K3659K3751j3970p9107j285P004n0502j7849k1991
$$ 396765 426160 409763 411719 435378 459129 445159 366052 364767 371771 321269 303420 281429
23984B81429m1169p062l2738L0252M6921k7659j2410M7043j4537n3696L5733j6722
$$ 281429 240260 233198 200460 230712 277633 249974 237564 284607 270070 216374 252107 235385
23972B35385l4597K8912k6890k797K5460l0389m8342J1404O2258Q340L0119p57
$$ 235385 200788 229700 202810 200013 225473 195084 146742 158146 220404 228744 258863 258106
23960B58106L7197L0656l9915P848j3352o3327k5288j2556m9368o1011P641N3761
$$ 258106 295303 325959 286044 293892 280540 217213 191925 179369 130001 68990 76631 130392
23948A30392O0120k0503k3662N2137P7453j4924l3544l8047k6846m1308M8503
$$ 130392 190512 170009 146347 198484 275937 261013 227469 189422 162576 121268 169771
23937A69771K7418o105L338j4859j3261N245J1004k1202K2008N2694K4939K9080
$$ 169771 197189 191084 194422 179563 166302 171547 182551 161349 183357 236051 260990 290070
23925B90070l4555M11M071j4227L8571n3374p6587j319K9284m887M0013J775m3616
$$ 290070 255515 255926 259997 245770 284341 230967 154380 153061 182345 177458 217471 219246 175630
23912A75630n9642o9405k0073Q6765o856J0120q8316n1248J00024L4254n383J978
$$ 175630 115988 46583 26510 113275 106419 116539 28223 -23025 76999 111253 105870 107848
23900A07848Q42k5294L2613J6796l7158K2362n57q873M2501m8311o3639K2687
$$ 107848 108690 83396 116009 132805 95647 118009 117452 108579 151080 102769 39130 61817
23888F1817M5592M3416j9129j4347N7293P041q2257K4872P0245n9994o7518k5326
$$ 61817 107409 150825 131696 117349 174642 181683 99426 124298 194543 134549 67031 41705
23876D1705j2793Q770M2299N0380K3718p872O3853m2682P243k3031K0972r515
$$ 41705 28912 37682 79981 130361 154079 146207 210060 167378 174621 151590 172562 163047
23864A63047j4116p9341k6082R934p812L893n213J2628J0252J8204J3068J1492
$$ 163047 148931 69590 43508 53442 45630 49523 44310 56938 67190 85394 98462 109954
23852A09954O249m0450j5259r364N9909M7564m3258m0781p0927m6700Q0166K4782
$$ 109954 116203 75753 60494 51130 111039 158603 115345 74564 3637 -43063 37103 61885
23840F1885j4043R286O1694N8461k9494q3665J8513j2967j5540L5384m97L3609
$$ 61885 47842 57128 118822 177283 147789 64124 82637 69670 54130 89514 89017 122626
23828A22626j0771J5227m110N123k3796J0262K2219Q405K799j0660q1305J7942
$$ 122626 111855 127082 122972 128095 104299 114561 136780 145185 147984 137324 56019 73961
23816G3961O8883n0403J4283j250q0876o0881l496O5324Q8563L2013m0353l9056
$$ 73961 142844 92441 106724 105474 24598 -36283 -39779 25545 114108 146121 105768 66712
23804F6712k6128P430k7863k9247O2210K6112K6959j987m3199n631O2585N5865
$$ 66712 40584 48014 20151 -9096 53114 79226 106185 104198 60999 55368 117953 173818
23792A73818l1910n6121j0525N6284M4774k9393o6935j25L9953k3902J2434L6399
$$ 173818 141908 85787 75262 131546 176320 146927 79992 79867 119820 95918 108352 144751
23780A44751K6932N5476K2721j00405o0641k6777q284P056K109R499L9856k5513
$$ 144751 171683 227159 249880 149475 88834 62057 53773 60829 62938 72437 112293 86780
23768H6780m4324N9583k9642k1817M8563r911K5714K7147m3744J3902j8879p0138
$$ 86780 42456 102039 72397 50580 99143 89232 114946 142093 98349 112251 93372 23234
23756B3234j5382m4580N3691J071n8359K2832J1708k0878j9954M9567Q9899o927
$$ 23234 7852 -36728 16963 18034 -40325 -17493 -5785 -26663 -46617 2950 92849 85922
23744H5922m6322L3736K5394k5538j3465K7009l3514J3705k74M019m5984j2821
$$ 85922 39600 73336 98730 73192 59727 86736 53222 66927 66653 70672 24688 11867
23732A1867L6615L989R114l4105Q535R1552N983l4522K983j6498l931N833N966
$$ 11867 48482 52471 61585 27480 36015 127567 133550 99028 102011 85513 81582 87415 93381
23719I3381N8922l3041l95L8726n7280o0618m5061M6312K5297p0887o3682j0483
$$ 93381 152303 119262 118867 157593 100313 39695 -5366 40946 66243 -4644 -68326 -78809
23707g8809N8442O2470n0157R957N5756l4357l0614l4944j1226j6210j5108o4962
$$ -78809 -20367 42103 -8054 1903 57659 23302 -7312 -42256 -53482 -69692 -84800 -149762
23695a49762q27Q9101J08177P3361j6375j1204j8830l143j7489k1781r990J0187
$$ -149762 -150589 -61488 46689 120050 103675 92471 73641 70498 53009 31228 21238 31425
23683C1425j4843l5937L5579j4775L2668M6758N1627P4777p8911o6763n0358p5781
$$ 31425 16582 -19355 16224 1449 34117 80875 132502 207279 128368 61605 11247 -64534
23671f4534M7165O6899m7185m0777J3177j7729L6842l642Q253j6086J6920M8648
$$ -64534 -17369 49530 2345 -38432 -25255 -42984 -6142 -9784 -1531 -17617 -697 47951
23659D7951j8920o209P3558J0530o1124l5961J366p0961J5524L3552k4943l0435
$$ 47951 29031 22822 96380 106910 45786 9825 11191 -59770 -44246 -10694 -35637 -66072
23647f6072N7116L4884L99l7682J6347j3674J5332K6291m3958J9398K3921N0215
$$ -66072 -8956 25928 26327 -11355 4992 -8682 6650 32941 -11017 8381 32302 82517
23635H2517k5860n7784n4974l347N6266L4904L3851m5302n2300L9964R38k0799
$$ 82517 56657 -1127 -56101 -59448 -3182 31722 65573 20271 -32029 7935 8873 -11926
23623a1926N496M0609K1262L9853n1122m2486L3729Q8620m7279m8546Q186o2778
$$ -11926 -6430 34179 55441 95294 44172 1686 35415 124035 76756 28210 36396 -26382
23611b6382p1715O585K8403o2902K1581R0470O8533M558l6792n4325j4118L0201
$$ -26382 -98097 -91512 -63109 -126011 -104430 -13960 54573 59131 22339 -31986 -46104 -15903
23599a5903J4703l9332p150O022m2922k2768O688j1907L4863J23201N3767J3157
$$ -15903 -1200 -40532 -47682 -41660 -84582 -107350 -100662 -112569 -77706 45495 99262 112419
23587A12419q907K4429N689o4021j3580q2044L1735M2875m7689J489k0407m1616
$$ 112419 103512 127941 133630 69609 56029 -26015 5720 48595 906 2395 -18012 -59628
23575e9628l2725J7578N3136K342m0596L4719j906J0250M3408P2163M5165J0458
$$ -59628 -92353 -74775 -21639 -19297 -59893 -25174 -27080 -16830 26578 98741 143906 154364
23563A54364k3283J7319J1590n4175N4617J2883n1097j06261l7086K9047L1866
$$ 154364 131081 148400 159990 105815 160432 173315 122218 15957 -21129 7918 39784
23552C9784O0072k1237n5660K2643m8514n3941K4222l5417k091Q9697j4084J7767
$$ 39784 99856 78619 22959 45602 -2912 -56853 -32631 -68048 -70139 19558 5474 23241
23540B3241J5515m0532O177m0419Q190J6620J2163k3552J2487J2134K984q2669
$$ 23241 38756 -1776 4401 -36018 -27828 -11208 955 -22597 -10110 2024 5008 -77661
23528g7661K9007Q6180J5848K1315O4119l2114r5668j7474L8205M813j3464k5430
$$ -77661 -48654 37526 53374 74689 138808 106694 11026 -6448 31757 36570 23106 -2324
23516b324k6357k6766K8075K3020k4707j7164N1678K9420k314j3645k1930M4042
$$ -2324 -28681 -55447 -27372 -4352 -29059 -46223 5455 34875 32561 18916 -3014 41028
23504D1028J9657J5284n0855K3164j8212l9234j0284j9680L7093M6257J7030k276
$$ 41028 60685 75969 25114 48278 30066 -9168 -19452 -39132 -2039 44218 61248 58972
23492E8972q591n6724K5277O8008P0152n0854n013J1108K5371l6069q9088M289
$$ 58972 50381 -6343 18934 86942 157094 106240 101227 112335 137706 101637 12549 16838
23480A6838P3678L6312m9551K662K0468N2944K889m8927q4730k5344L1119n097
$$ 16838 90516 126828 77277 79939 100407 153351 156240 107313 22583 -2761 28358 23261
23468B3261m0787J5770Q469j7185m9511J0746M3885k5215L126j6744Q580L4117
$$ 23261 -17526 -1756 6713 -10472 -59983 -49237 -5352 -30567 -27441 -44185 -35605 -1488
23456a488k6189K0866M3463l210k4620n5643L5080R5056K2590l0788K3269J7467
$$ -1488 -27677 -6811 36652 33442 8822 -46821 -11741 83315 105905 75117 98386 115853
23444A15853n3897o8277k154P4419L1907L7043n569L0933m7173r3424j2783o702
$$ 115853 61956 -6321 -8475 65944 97851 134894 129325 160258 113085 19661 6878 176
23432A76k8885J851l628m8559L8773l9157m436P5563K260p410k6273K0953O4174
$$ 176 -28709 -26858 -30486 -79045 -40272 -79429 -83865 -8302 -6042 -13452 -39725 -18772 45402
23419D5402J6229K7378J5154k9568p5806k9638L5445M1203L7613L0790j7276k4317
$$ 45402 61631 89009 104163 74595 -1211 -30849 4596 45799 83412 114202 96926 72609
23407G2609n5236m3505K6764R3146R7504j8629l949o1204l1043K9954O5789j0029
$$ 72609 17373 -26132 632 93778 191282 172653 168704 107500 76457 106411 172200 162171
23395A62171K3239k3650L7070J8529k5194o383m8865p754J6855k0585m7632m9575
$$ 162171 185410 161760 198830 217359 192165 185782 136917 129163 146018 125433 77801 28226
23383B8226O4752L6871N65J8633L29J1095n2613O5140L202j21933n8432L1574
$$ 28226 92978 129849 130414 149047 149376 160471 107858 172998 176200 54267 -4165 27409
23371B7409M9923l601K5311L4003k2264n9385k955N1215J7789j3071O8420J8836
$$ 27409 77332 73731 99042 133045 110781 51396 48441 99656 117445 104374 172794 191630
23359A91630K6903J7556m2641j1304L8070L912O056j8329l862N5850j1429j9969
$$ 191630 218533 236089 193448 182144 220214 224126 230182 211853 207991 263841 252412 232443
23347B32443j1510j1652J7939J0470k5302n854J3070L904o7506L4475k2183m1948
$$ 232443 220933 209281 227220 237690 212388 206534 219604 223508 156002 190477 168294 126346
23335A26346j6676M0129M0032O280k6377m8159k3823L1907K4358k5638K4901l2496
$$ 126346 109670 149799 189831 196111 169734 121575 97752 129659 154017 128379 153280 120784
23323A20784J9280K4094o171J4704K4738n5971m1331m8615L0561J04564L0871
$$ 120784 140064 164158 157987 172691 197429 141458 100127 51512 82073 186637 217508
23312B17508j4183k1435p5195j2532L594j0936N771M0561Q9428P7463m9024j08660
$$ 217508 203325 181890 106695 94163 97757 86821 92592 133153 222581 300044 251020 142360
23300A42360n5416J1298j7065j3420Q457L7262K2106M6065L7887l620j0291m436
$$ 142360 86944 98242 81177 67757 76214 113476 135582 181647 219534 215914 205623 201187
23288B01187p3034k4372m6861q2432k8891M8608J3769m3337J7535L0136q979r186
$$ 201187 128153 103781 56920 -25512 -54403 -5795 7974 -35363 -17828 12308 3329 -5857
23276e857L7441O9556p6060J9587m464J4977K4016L2802O5098N9851m3399K6637
$$ -5857 31584 101140 25080 44667 40203 55180 79196 111998 177096 236947 193548 220185
23264B20185o8818o6065j9545L1953l0046n3647K6458P2721K369q271J8599N491
$$ 220185 151367 85302 65757 97710 67664 14017 40475 113196 115565 107294 125893 131384
23252A31384k6434l6603o6175K6098N1200N345N7880m1749n6005l6629M861j5969
$$ 131384 104950 68347 2172 28270 79470 84815 142695 100946 44941 8312 13173 -2796
23240b796j2036k8817K0973J8393J807J9509J07357L966l262m9853J4156k3041
$$ -2796 -14832 -43649 -22676 -4283 -2476 17033 124390 128356 125094 75241 89397 66356
23228F6356O0744M081o1167m5300j9289J4318k9908k1681k2444O2696L1434o7541
$$ 66356 127100 131181 70014 24714 5425 19743 -10165 -31846 -54290 8406 39840 -27701
23216b7701l6915J8797R8406M4765K0536M1925l5416r4624o0041r119K1148N7702
$$ -27701 -64616 -45819 52587 97352 117888 159813 124397 29773 -30268 -39387 -18239 39463
23204C9463J3732L9345l8596r295m1130k6818N182m0152J0274Q545M9516r574
$$ 39463 53195 92540 53944 44649 3519 -23299 -18117 -58269 -47995 -39450 10066 492
23192D92q4424j25P8503M3716N9796R229o3559k6516l5143j84k3689l9161J0256
$$ 492 -83932 -84057 -5554 38162 97958 107187 43628 17112 -18031 -18215 -41904 -81065 -70809
23179g0809K793o145J9371P4622L3731k5823k1641p503K0958k2425m4191K0161
$$ -70809 -68016 -74161 -54790 19832 53563 27740 6099 -1404 19554 -2871 -47062 -26901
23167b6901M8624J2190n8603n178L1991n6706r837K6560k3239m4385L4160N7650
$$ -26901 21723 33913 -24690 -29868 2123 -54583 -64420 -37860 -61099 -105484 -71324 -13674
23155a3674K1843P709K6208P07L7301J5155p7942j9234j7108m483R3896j4674
$$ -13674 8169 15878 42086 42793 80094 95249 17307 -1927 -19035 -23518 70378 55704
23143E5704o6704o77M7677k6325o453M1854L0872k7037m7741j05407N49M6607
$$ 55704 -11000 -11677 36000 9675 3222 45076 75948 48911 1170 -104237 -103688 -57081
23131e7081K7599J444j7563R011N1386k1639J1606L6954M0719J0938m0356m9645
$$ -57081 -29482 -28038 -45601 -36590 14796 -6843 4763 41717 82436 93374 53018 3373
23119C373r413K5396l7773l5600M3894J8726J7682o510p8311l4254K1811Q0341
$$ 3373 -6040 19356 -18417 -54017 -10123 8603 26285 19775 -58536 -92790 -70979 9362
23107I362n000K214j5808l8748K8098O4377K1303N21L0639L1751L7127l7369m8053
$$ 9362 4362 6576 -9232 -47980 -19882 44495 65798 66319 96958 128709 165836 128467 80414
23094H0414r2569J840N043q344L2216l2678l4482L8744M4887p854J5854j3774
$$ 80414 -12155 -10315 -5272 -13616 18600 -14078 -48560 -9816 35071 27217 43071 29297
23082B9297n8505p631N293N1427N5004J0895J3155j5584J3055m1493l6425l4238
$$ 29297 -29208 -36839 -31546 19881 74885 85780 98935 83351 96406 54913 18488 -15750
23070a5750m6324o966K2823K7571N1225j5814M4528R4916m5381n4245L5483P5917
$$ -15750 -62074 -69040 -46217 -18646 32579 16765 61293 156209 110828 56583 92066 167983
23058A67983j1623p8191n4392n1900m8354M130L3596J6574o9966K5834M3433n425
$$ 167983 156360 78169 23777 -28123 -76477 -72347 -38751 -22177 -92143 -66309 -22876 -28301
23046b8301j3794O0802J4354l4469j9877J2019q472M0566M7707O5826N693l4709
$$ -28301 -42095 18707 33061 -1408 -21285 -9266 -17738 22828 70535 136361 142054 107345
23034A07345j6134n5913j0184J4594j7159j0083K3904J4081j2946k7604K4594
$$ 107345 91211 35298 25114 39708 22549 12466 36370 50451 37505 9901 34495
23023C4495j8485l5644l6206k162j3790L5264k4072K5000K9789K2653p1798j5585
$$ 34495 16010 -19634 -55840 -58002 -71792 -36528 -60600 -35600 -5811 16842 -54956 -70541
23011g0541J4292j4023j1868N056l134l7065M9457K9447k124J1672k8413n316
$$ -70541 -56249 -70272 -82140 -77084 -80218 -117283 -67826 -38379 -40503 -28831 -57244 -62560
22999f2560L6834o43m850m7074N718M2569j1096m5529K2674j6082p785k568K6717
$$ -62560 -25726 -26369 -31219 -78293 -72575 -30006 -41102 -86631 -63957 -80039 -87824 -90392 -63675
22986f3675k4376l6742k9393N7887k535K1272P9083k4076n4163O939J350m5114
$$ -63675 -88051 -124793 -154186 -96299 -98834 -77562 1521 -22555 -76718 -69779 -68429 -113543
22974a13543p2593j1365O8940J8310J9456L056N8703M3508j4390R184j4862L8907
$$ -113543 -186136 -197501 -128561 -110251 -90795 -87739 -29036 14472 82 9266 -5596 33311
22962C3311N6646k5552p53m1656k6689l6718j6188P8107O5716m7119l6628P59
$$ 33311 89957 64405 63652 21996 -4693 -41411 -57599 20508 86224 39105 2477 3236
22950C236o029K5408l5056K4402O1745j0782M0911K5585l497o1630m1823J675
$$ 3236 -2793 22615 -12441 11961 73706 62924 103835 129420 125923 64293 22470 24145
22938B4145o1891k5460K3200j4036P513m340q417N331K7984K2914Q299j5623m6834
$$ 24145 -37746 -63206 -40006 -54042 -46529 -50869 -59286 -53955 -25971 -3057 5242 -10381 -57215
22925e7215j0316N383L4724K4594J7418k236n1326m1649M7478M4605m2991K8352
$$ -57215 -67531 -62148 -27424 -2830 14588 12352 -38974 -80623 -33145 11460 -31531 -3179
22913c179K0957k690J5132L3711j9390J6712m8225o5876k7241K8465O880L4728
$$ -3179 17778 15088 30220 63931 44541 61253 13028 -52848 -80089 -51624 -44744 -10016
22901a0016M6433Q96j3306K7328q918n5031n5994K112R948P4288K9097j077n1501
$$ -10016 36417 37313 24007 51335 42417 -12614 -68608 -66496 -56548 17740 46837 45760 -5741
22888e741N809O6968M8495o8357q9779m1033j5576k0361L0059N9251N8596j8948
$$ -5741 68 67036 115531 47174 -42605 -83638 -99214 -119575 -89516 -30265 28331 9383
22876I383l6670J276j6605P333j917n8873M943O6202O0713l8761l4273l4752O212
$$ 9383 -27287 -26011 -42616 -35283 -37200 -96073 -91130 -24928 35785 -2976 -37249 -72001 -65789
22863f5789K7532R1K0709O8388K2602p7544l4407j6401N061M9615J2780n1130
$$ -65789 -38257 -38166 -17457 50931 73533 -4011 -38418 -54819 -49758 -143 12637 -38493
22851c8493L687J79M2755j1275m7145m4246J9997J19520M2413n5875J516k72k9824
$$ -38493 -34806 -34627 8128 -3147 -50292 -94538 -74541 44979 87392 31517 33033 32761 2937
22838B937j0535j8260K9481O197O2184m032n7267K642N021k6152k904L1742o897
$$ 2937 -7598 -25858 3623 9820 72004 67972 10705 13347 18368 -7784 -10688 21054 14157
22825A4157L2065M9696l6825l9911p3003l9800J0460J1513J8063O3782M675J370
$$ 14157 46222 95918 59093 19182 -53821 -93621 -83161 -71648 -53585 10197 14872 16242
22813A6242q050n2971J5114K4563j682m6339r869j742M0223M7341K4103j35606
$$ 16242 8192 -44779 -29665 -5102 -6784 -53123 -62992 -64734 -24511 22830 46933 -88673
22801h8673r917P0247K1987J9963J9890n85m562l5634k6416m2298m098j6756j5129
$$ -88673 -98590 -28343 -6356 13607 33497 32912 28350 -7284 -33700 -75998 -80096 -96852 -111981
22788a11981M9238Q1908Q857M8224j068L189J2224n1468l2614l3740k4447N5319
$$ -111981 -62743 19165 28022 76246 75178 78367 90591 39123 6509 -27231 -51678 3641
22776C641J3334pO330r210K5541K5089K7523j7695m4652l8737K2694J709k8111
$$ 3641 16975 16968 23298 14088 39629 64718 92241 74546 29894 -8843 13851 15560 -12551
22763a2551L6824m449J021j6178J8743j9239j833j1155K7911j1932l8486j1555
$$ -12551 24273 19824 20845 4667 23410 4171 2338 -8817 19094 7162 -31324 -42879
22751d2879l1535o2876o5638P1267M2372j9447j3723J9629Q3412o3051m8241K4116
$$ -42879 -74414 -137290 -202928 -131661 -89289 -108736 -122459 -102830 -19418 -82469 -130710 -106594
22739a06594M6332J50068Q2589J6157k9523q3203k4723j5252n0218o4574P4431
$$ -106594 -60262 89806 172395 188552 159029 75826 51103 35851 -14367 -78941 -4510
22728d510M2696k3403m5255o1324M7293O8327J0356j7111L690k8612q4140k5116
$$ -4510 38186 14783 -30472 -91796 -44503 23824 34180 17069 20759 -7853 -91993 -117109
22716a17109J268j1531K2399N4655N1647J6310j8446k6405l3689J8819L4026K3952
$$ -117109 -115841 -127372 -104973 -50318 1329 17639 -807 -27212 -60901 -42082 -8056 15896
22704A5896L9067l2626L918k7155L1201k598M739Q0169k5291l1379k8593l6567
$$ 15896 54963 22337 26255 -900 30301 27703 32442 112611 87320 55941 27348 -9219
22692i219k3499P386k708K122j633p157L4880m586p7619l1362O0238P6501O9677
$$ -9219 -32718 -25332 -28040 -25918 -27551 -34708 172 -4414 -82033 -113395 -53157 23344 93021
22679I3021l3034k4223P370k9899l1302M0479K3406l2565j18488o4532L6541L1732
$$ 93021 59987 35764 43134 13235 -18067 22412 45818 13253 -105235 -169767 -133226 -101494
22667a01494O5435M2079L3577m1232K487O2882J3081n3520r4215l9860m6431N4511
$$ -101494 -36059 6020 39597 -1635 852 63734 76815 23295 -70920 -110780 -157211 -102700
22655a02700L2328M8536r595m6831l0760k3333M9654q012m4798J2545M912l5194
$$ -102700 -70372 -21836 -31431 -78262 -109022 -132355 -82701 -90713 -135511 -122966 -118054 -153248
22643a53248J9402K6610M2930L8374M6457o0058p027J9493n6464K0034R101J7474
$$ -153248 -133846 -107236 -64306 -25932 20525 -39533 -46560 -27067 -83531 -63497 -54396 -36922
22631c6922O0096m14l1108K0078k1245n4561n6763Q8706J01071j3182K6901o5125
$$ -36922 23174 22760 -8348 11730 -9515 -64076 -120839 -32133 68938 55756 82657 17532
22619A7532n1879K7504Q55n8805L717K9917K0493l1372o4825j8597J7471N3575
$$ 17532 -34347 -6843 -5988 -64793 -61076 -31159 -10666 -42038 -106863 -125460 -107989 -54414
22607e4414K6941O6695j8605o4641l3058M0174n6642M1924O6347j2220j6313K5341
$$ -54414 -27473 39222 20617 -44024 -77082 -36908 -93550 -51626 14721 2501 -13812 11529
22595A1529J1878L159k9639J6991j4657N385K6466k4852j8667l647j1701k5430
$$ 11529 23407 26566 -3073 13918 -739 4646 31112 6260 -12407 -16054 -27755 -53185
22583e3185M7323l2398j3502K7558K0503K9630J7055n0028m0505O1817j2827j7154
$$ -53185 -5862 -38260 -51762 -24204 -3701 25929 42984 -7044 -47549 14268 1441 -15713
22571a5713J5179J918J3888J5563j8065k3415k0233j5450j0250p5123K8896J06471
$$ -15713 -534 1384 15272 30835 12770 -10645 -30878 -46328 -56578 -131701 -102805 3666
22559C666K2119m5588j3586l3413j9889P4115R7234K1049p6100k5063n5895N940
$$ 3666 25785 -19803 -33389 -66802 -86691 -12576 84658 105707 29607 4544 -51351 -45411
22547d5411L5917m5930n459P0579M7793m334m724l2310l1016M7884J22294j52
$$ -45411 -9494 -55424 -60883 9696 57489 53155 48431 16121 -14895 32989 155283 155131
22535A55131k4951j10141o2382j9338O3581j3331p678N6067m2390O0542m972J742
$$ 155131 130180 20039 -42343 -61681 1900 -11431 -19109 36958 -5432 55110 50138 51880
22523E1880J12482n9450n8624j4158J5569n85l9577m4702m0239J4857J26485L5301
$$ 51880 164362 104912 46288 32130 47699 47114 7537 -37165 -77404 -62547 63938 99239
22511I9239j3209l8952m2096j0120j1955M4060J3735K4202J3168l1062l9280j544
$$ 99239 86030 47078 4982 -5138 -17093 26967 40702 64904 78072 47010 7730 6186
22499F186L2652N3744J9927m2614j7240n1147r6156j6673K0504L4176O7114K5033
$$ 6186 38838 92582 112509 69895 52655 1508 -94648 -111321 -90817 -56641 10473 35506
22487C5506J7961j8872p185K455l8895p3185j2369K5839L7229K0016M3056J5059
$$ 35506 53467 34595 27410 29865 -9030 -82215 -94584 -68745 -31516 -11500 31556 46615
22475D6615K8024m6870m0470k4248K478j7251j3550J558j5546K3209K0129K0513
$$ 46615 74639 27769 -12701 -36949 -34471 -51722 -65272 -63714 -79260 -56051 -35922 -15409
22463a5409J7655l7049j8039n7228M5813K3294l7842J8203Q3942O7713o0492j13831
$$ -15409 2246 -34803 -52842 -110070 -64257 -40963 -78805 -60602 23340 91053 30561 -83270
22451h3270J1113m059Q09Q5468L6321O239J1187m2923q2515J5353M1495L422J6321
$$ -83270 -72157 -76216 -75407 10061 46382 52621 63808 20885 -61630 -46277 -4782 -1360 14961
22438A4961M4868K4354m4012n21P322R1196j1181r1952j2198L4960J4174j8075
$$ 14961 59829 84183 40171 39650 46972 138168 126987 35035 22837 57797 71971 53896
22426E3896k3247M297J1152o5469k7292l6353O487r571p9981J3631P8886O1245
$$ 53896 30649 34946 46098 -19371 -46663 -83016 -76529 -86100 -166081 -152450 -73564 -12319
22414a2319K7483O9203J1598p5441j035m7287m1379K9876K7813j5667O075Q611
$$ -12319 15164 84367 95965 20524 19489 -27798 -69177 -39301 -11488 -27155 -21080 -12469
22402a2469M8602N5257J18632K3177j06584k5232Q901k1396j01747j0786N7197
$$ -12469 36133 91390 210022 233199 126615 101383 110284 88888 -12859 -23645 33552
22391C3552k3282q576L3554L87k2838L2865M1275l8199n6592M0551R201j5264
$$ 33552 10270 1694 35248 35635 12797 45662 86937 48738 -7854 32697 41898 26634
22379B6634l7416L3876K9665l2651k6860p300n943n6655r13K3562j7756L2380
$$ 26634 -10782 23094 52759 20108 -6752 -14052 -19995 -76650 -77563 -54001 -71757 -39377
22367c9377M1556j456N990N836N7512J1644J8029K7809k2620n729k7526n7430
$$ -39377 2179 723 6713 12549 70061 81705 99734 127543 104923 99194 71668 14238
22355A4238l9223K5106M040j2741L1385l3241M7605K9593N6448n3442p3368M9633
$$ 14238 -24985 121 4161 -8580 22805 -10436 37169 66762 123210 69768 -3600 46033
22343D6033K5076n5804n817K4715J5718P6075L749j30198l8980P2609L0133M3543
$$ 46033 71109 15305 9488 34203 49921 125996 129745 -453 -39433 33176 63309 106852
22331A06852K0291l6338q172M2940K5307m9895K4149J3452p3235p103M0630K952
$$ 106852 127143 90805 82633 125573 150880 100985 125134 138586 65351 58248 98878 101830
22319A01830n7391m974N0973J5175k8626k531M7027J3549K835J0946K6820m7084
$$ 101830 44439 39465 90438 105613 76987 74456 121483 135032 137867 148813 175633 128549
22307A28549j8978Q9984M1582k3569m6102r513L3683J3453k0355l0796J7473R508
$$ 128549 109571 199555 241137 217568 171466 161953 195636 209089 188734 157938 175411 184919
22295A84919J7107j6808j00988n5244N4349k9123N0068L4752k2541k2942O309
$$ 184919 202026 185218 84230 28986 83335 54212 104280 139032 116491 93549 99858
22284I9858K2784O2879M5678l979k9850j5960K4026M94l5253L638K6462j0888
$$ 99858 122642 185521 231199 227220 197370 181410 205436 205930 170677 174315 200777 189889
22272A89889n88J744M4487J952O959L1134L3129q0124l7840M9417N2584J9496
$$ 189889 189301 191045 235532 237484 244443 275577 308706 228582 190742 240159 292743 312239
22260C12239K2328J350M0841K1085j0699J7426n1953L571j6456m6169o5049m1541
$$ 312239 334567 335917 376758 397843 387144 404570 352617 356188 339732 293563 228514 186973
22248A86973O0074L7444J3533Q923k3388P9377j4224k4119J3111m9064J7184J0423
$$ 186973 247047 284491 298024 306947 283559 362936 348712 324593 337704 288640 305824 316247
22236C16247L2425K313j0974N5113N7096l989n5039j4657k7156o3540K7368J805
$$ 316247 348672 350985 340011 395124 452220 448231 393192 378535 351379 287839 315207 317012
22224C17012j3249n3839n2025k659M6046K7854m1511m6593k9510K6096N2325l8386
$$ 317012 303763 249924 197899 195240 241286 269140 227629 181036 151526 177622 229947 191561
22212A91561j0827J8132j7184m5M9241L2616k8294k5025L998l8393j4414k5480
$$ 191561 180734 198866 181682 181637 230878 263494 235200 210175 214173 175780 161366 135886
22200A35886n6807P3095N9550j1833K7356m0419Q7782Q4336q5626j06113p014
$$ 135886 79079 152174 211724 199891 227247 186828 274610 358946 273320 167207 160193
22189A60193l8395O861k178j8148m0925K1618L8362M0728L4973n163L7306P082
$$ 160193 121798 128659 126481 108333 67408 89026 127388 168116 203089 197926 235232 242314
22177B42314m1403K3288l592l4776J3414l2290j0127O886k6563L0244j411o618
$$ 242314 200911 224199 220607 185831 199245 166955 156828 163714 137151 167395 165984 159366
22165A59366o891l9263l8246j2967M1534m7723n5768J4218N1665K0309R4165J0684
$$ 159366 152475 113212 74966 61999 103533 55810 42 14260 65925 86234 180399 191083
22153A91083l7634o4343l0046k0485K9505P2378N3994j0051p0566m5802k2555
$$ 191083 153449 89106 59060 38575 68080 140458 194452 184401 113835 68033 45478
22142D5478N1334L2742K3257m409N853K7718J485j6073p8037p60J9455q131M3389
$$ 45478 96812 129554 152811 148402 154255 181973 183458 167385 89348 88588 108043 99912 143301
22129A43301J02647j6559l516M2015k0488P9439L5585k0415M6022L2760M8746
$$ 143301 245948 229389 225873 267888 247400 326839 362424 342009 388031 420791 469537
22118D69537O5097Q2338R8385J08646J32532J39125J54541J43305J34081P2925
$$ 469537 534634 616972 715357 824003 956535 1095660 1250201 1393506 1527587 1600512
22108A600512L7697R589n4749j21291j05860j35286j38106j61342j18122j06104
$$ 1600512 1638209 1647798 1593049 1471758 1365898 1230612 1092506 931164 813042 706938
22098G06938p8547o1961q3363q7321m8803O7992M2969l1762m8670k5114p298k982
$$ 706938 628391 566430 483067 395746 346943 414935 457904 426142 377472 352358 345060 342078
22086C42078Q0321l9406p3978k1824J482l9107p2325j4033o066N088j4882m6727
$$ 342078 422399 382993 309015 287191 288673 249566 177241 163208 157142 162230 147348 100621
22074A00621K9840Q5352K0245j1877n881j9489M553Q210l5853k024O963J2056
$$ 100621 130461 215813 236058 224181 218300 198811 203364 211574 175721 173697 180660 192716
22062A92716J0731m6878j00198l468o321l507j9037M3757M0958M805l7812l2258
$$ 192716 203447 156569 56371 52903 46582 43075 24038 67795 108753 113558 75746 43488
22050D3488n0438k1814K4214L0421Q2316L7301k9905l8849l0348P1409k889m2089
$$ 43488 -6950 -28764 -4550 25871 108187 145488 115583 76734 46386 117795 114906 72817
22038G2817j7583O4146M9293M843l7563m6422j11950l3538Q141Q2915l0930J4066
$$ 72817 55234 119380 168673 173516 135953 89531 -22419 -55957 -47816 35099 4169 18235
22026A8235k2676m5886K0122m39K0491L9746l9843M573M7008M0094m4494p2739
$$ 18235 -4441 -50327 -30205 -30644 -10153 29593 -10250 -5677 41331 81425 36931 -35808
22014c5808J0063L9831Q6478o4062r8949m1738M1940L618R491N9507K1754m0466
$$ -35808 -25745 14086 100564 36502 -62447 -104185 -62245 -58627 -49136 10371 32125 -8341
22002h341l3582J6128k5077K2284N851N3177M7157L9824K6834J8615j1186j5482
$$ -8341 -41923 -25795 -50872 -28588 -22737 30440 77597 117421 144255 162870 151684 136202
21990A36202k3816m3046K6154p0532K7101n2474q1201L6914P9659m4029p8901
$$ 136202 112386 69340 95494 24962 52063 -411 -81612 -44698 34961 -9068 -87969
21979h7969o0910k5721N1276O0483L0036M6957O8017P9082o5559q3117j6912J6091
$$ -87969 -148879 -174600 -123324 -62841 -32805 14152 82169 161251 95692 12575 -4337 11754
21967A1754M6393q1406R743J12772M0497l022q810O113k7285m5312J4920O3427
$$ 11754 58147 -23259 -13516 99256 139753 136731 127921 134034 106749 61437 76357 139784
21955A39784p932L0995O8608J6257N2994l9506l2877N4364K4786L4903j2193j512
$$ 139784 131852 162847 231455 247712 300706 261200 228323 282687 307473 342376 330183 328671
21943C28671p2389l945L0918k3232l5038p742l3519J8121L8461r804Q736J126
$$ 328671 256282 252337 283255 260023 224985 217243 183724 201845 240306 230502 239238 240364
21931B40364l3889l2594k7311l3911M9530J19123L9809L6172M0510j3668l2804
$$ 240364 206475 173881 146570 112659 162189 281312 321121 357293 397803 384135 351331
21920C51331K6399n4999l4312L708k6302m5595k5811p932R582L109m2467j7475
$$ 351331 377730 322731 288419 292127 265825 220230 194419 186487 196069 199178 156711 139236
21908A39236J06090K6384K5392r6759r4585L3107R5580J5511l0775R378j588K2299
$$ 139236 245326 271710 297102 200343 105758 138865 234445 249956 219181 228559 226971 249270
21896B49270k4564r1336k035P930O9399N9589P4480N4239N3002j7001J7689l6661
$$ 249270 224706 133370 131335 139265 208664 268253 342733 396972 449974 432973 450662 414001
21884D14001k7065O9678n0836k4429L6266q1067p4352R860O0648j8735j696J7469
$$ 414001 386936 456614 405778 381349 417615 336548 262196 272056 332704 313969 312273 329742
21872C29742J953L0361O5932K4135Q0052Q6858J2729K5602R0398M2639m5008K4881
$$ 329742 331695 362056 427988 452123 532175 619033 631762 657364 747762 790401 745393 770274
21860G70274K9734k2531l1735o3651m5114m64m179m6603m294L3494k3801o4728
$$ 770274 800008 777477 745742 682091 636977 636513 632334 585731 581437 614931 591130 526402
21848E26402P96J0632R458L9123L3419J4875r766N5261J01384N4797L9392j6775
$$ 526402 527198 537830 547288 586411 619830 634705 624939 680200 781584 836381 875773 858998
21836H58998Q201o317k8273N6879J28478J2448R4708J30920J83996K66491L01572
$$ 858998 867199 860882 832609 889488 1017966 1030414 1125122 1256042 1440038 1706529 2008101
21825B008101L73772M07210M00215L02121J75272N5108L4495R8773J00238J97129
$$ 2008101 2381873 2789083 3189298 3491419 3666691 3721799 3756294 3855067 3955305 4152434
21815D152434K25314J14482Q8671M90j05272k53333k08366r0377o8684j0542L5732
$$ 4152434 4377748 4492230 4580901 4581391 4476119 4222786 4014420 3924043 3855359 3844817 3880549
21804C880549k3052l8797k9272J9829L9064O3148P5164n4543j6278K6811k5942
$$ 3880549 3857497 3818700 3789428 3809257 3848321 3911469 3986633 3932090 3915812 3942623 3916681
21793C916681J1867J2137m8582L0598Q0688O2565P865M6629J23090L0976N1277
$$ 3916681 3928548 3940685 3892103 3922701 4003389 4065954 4073819 4120448 4243538 4274514 4325791
21782D325791P2700L7026k6214P83l9640l5431l4147p8558o9958j28937k77412
$$ 4325791 4398491 4435517 4409303 4410086 4370446 4335015 4300868 4222310 4152352 4023415 3746003
21771C746003k63635k02967k80784j97610j72667j28158o9981q7511q0229o3306
$$ 3746003 3482368 3279401 2998617 2801007 2628340 2500182 2430201 2342690 2262461 2199155
21761B199155P3286Q2198M0428M0321M412j9332p6050q6390j16076k60166k06266
$$ 2199155 2272441 2354639 2395067 2435388 2439800 2420468 2344418 2258028 2141952 1881786 1675520
21750A675520j07165q4851o6429q4690j11670r8003J0073j3716j0627l7231o1974
$$ 1675520 1568355 1483504 1417075 1332385 1220715 1122712 1132785 1119069 1108442 1071211 1009237
21739A009237l2558k2104J4195Q1564J1466J367Q1816J0101p0248p4960m7927
$$ 1009237 976679 954575 968770 1050334 1061800 1063167 1144983 1155084 1084836 1009876 961949
21728I61949j5435J00345j0493M7810K6966p019j398m6758l2003l756k8711o1475
$$ 961949 946514 1046859 1036366 1084176 1111142 1104123 1102725 1055967 1023964 1020208 991497 930022
21716I30022k6475j4912j1462p2316l1854M569l996J3951Q2820j14051n5121K7277
$$ 930022 903547 888635 877173 804857 773003 777572 773576 787527 870347 756296 701175 728452
21704G28452o031N9126O7626l1338K2031K0853m5698m2515k6902l7750l8103k4958
$$ 728452 722421 781547 849173 817835 839866 860719 815021 772506 745604 707854 669751 644793
21692F44793r6303p8730j8003K045L1620r279k8657j696m6427j0784M4993K2576
$$ 644793 548490 469760 451757 453802 485422 476143 447486 445790 399363 388579 433572 456148
21680D56148Q850j8622R898N446L8804P4910K9801l1715j7481M0250O8800N8804
$$ 456148 464998 446376 456274 461720 500524 575434 605235 573520 556039 596289 665089 723893
21668G23893L9287O9116P8970O8948R2871J26471J77472K02561J27476J16673
$$ 723893 763180 832296 911266 980214 1073085 1199556 1377028 1579589 1707065 1823738
21658A823738J87192K55844K06895J65298J36033O0339Q3562J03772N3869j9117
$$ 1823738 2010930 2266774 2473669 2638967 2775000 2835339 2918901 3022673 3076542 3057425
21648C057425L5029J783O1160K11753K46835K74735K19030P6988m4007j44277
$$ 3057425 3092454 3094237 3155397 3367150 3613985 3888720 4107750 4184738 4140731 3996454
21638C996454k76791l21497k38671j61033p4388m1257j22062r3415p8051j18547
$$ 3996454 3719663 3398166 3159495 2998462 2924074 2882817 2760755 2667340 2589289 2470742
21628B470742j43130j08170j8514q4444r3030q0562k1046j13755p6048j707O1038
$$ 2470742 2327612 2219442 2200928 2116484 2023454 1942892 1921846 1808091 1732043 1730336 1791374
21617A791374R2883R9056L4394p479j06413j23240j08415j73391j17886K301j796
$$ 1791374 1884257 1983313 2017707 2010228 1903815 1780575 1672160 1498769 1380883 1383184 1381388
21606A381388j16756j43292n4561l9229m2976q7790p0007j8635m4485j4411k7503
$$ 1381388 1264632 1121340 1066779 1027550 984574 896784 826777 808142 763657 749246 721743
21595G21743J1344M602o3401o0252n2583m56R396k3455j983n7706K1941K4920
$$ 721743 733087 737689 674288 614036 561453 560997 570393 546938 544955 487249 509190 534110
21583E34110r15J0324m4514L2735l8076p0766o2716q949j6613L3298R8086o3234
$$ 534110 533195 543519 499005 531740 493664 422898 360182 351233 334620 367918 466004 402770
21571D02770j04673n3059n6791O2735K6987m3387j7111O0668K0804M5188k909
$$ 402770 298097 245038 188247 250982 277969 234582 217471 278139 298943 344131 341222
21560C41222R4540J2968j3105K2931j859k1337K3915j6302m6640O638p871o1805
$$ 341222 435762 448730 435625 458556 456697 435360 459275 442973 396333 402971 395100 333295
21548C33295L4665P893l2188q5397p022m53j9474j9131J1291n3286L7758L6868
$$ 333295 367960 375853 343665 258268 251246 250793 231319 212188 223479 170193 207951 244819
21536B44819q1334m4406J6218J0139k0079L6000M3456K4614k655j8013J2849q0395
$$ 244819 163485 119079 135297 145436 125357 161357 204813 229427 226772 208759 221608 141213
21524A41213o8740N0576K0746K8758R032J4283m5687m0783k2725O8778L1016L0771
$$ 141213 72473 123049 143795 172553 181585 195868 150181 109398 86673 155451 186467 217238
21512B17238J423j8115m333k3252J202l0527K8336K4005k606M6165o9114m8282
$$ 217238 218661 200546 196213 172961 174163 143636 171972 195977 193371 239536 170422 122140
21500A22140J2510K4251k7314J2028k7251n60k8117o6540J0177K7842R796J9449
$$ 122140 134650 158901 131587 143615 116364 115804 87687 21147 31324 59166 68962 88411
21488H8411j9240M1309J09848l769l7770P54j1794J4495n9612n6453M6478L8156
$$ 88411 69171 110480 220328 216559 178789 179543 167749 182244 122632 66179 112657 150813
21476A50813L8131j0104k1465J9367K4142K2747N9977O2620J14079J35087N6787
$$ 150813 188944 178840 157375 176742 200884 223631 283608 346228 460307 595394 652181
21465F52181O0437N7431P1857J58752R9768P1403k0675r6682p0248q2237r3975
$$ 652181 712618 770049 841906 1000658 1100426 1171829 1151154 1054472 984224 901987 808012
21454H08012m9198j2225R526o227m3039K1508J25501J11738J19071M0797L7196
$$ 808012 758814 746589 756115 749888 706849 728357 853858 965596 1084667 1125464 1162660
21443A162660j3381m2061m0181j23953q1310j11970j17847j37070j00853J4790
$$ 1162660 1149279 1107218 1067037 943084 861774 749804 631957 494887 394034 408824
21433D08824J5863n3438L4553j589k5193j6101l9162K4011l9152K4575K0241k4460
$$ 408824 424687 371249 405802 404213 379020 362919 323757 347768 308616 333191 353432 328972
21421C28972j2273K7076M3713K5986L0684j10583j10231o1083q427K3849N8204
$$ 328972 316699 343775 387488 413474 444158 333575 223344 162261 153834 177683 235887
21410B35887m2043k4540N2977J6169k7463l398j4928L2242J2442k0871j8268O1056
$$ 235887 193844 169304 222281 238450 210987 207589 192661 224903 237345 216474 198206 259262
21398B59262J05216M7967O8522K6318l2260j3884N9582O5637O1831m0240K588
$$ 259262 364478 412445 480967 507285 475025 461141 520723 586360 648191 607951 610539
21387F10539L9265q0268q3265j6421j6946k1621j2445K4462k5390k444m4260J1953
$$ 610539 649804 569536 486271 469850 452904 431283 418838 443300 417910 415466 371206 383159
21375C83159l4848l6422m607K6314Q255M0312J4562p5002m0254K4067K5009M2858
$$ 383159 348311 311889 307282 333596 341851 382163 396725 321723 281469 305536 330545 373403
21363C73403K6466l9046J9379O2486k390l6701n8039k0916j4832L107J4765N3129
$$ 373403 399869 360823 380202 442688 440298 403597 345558 324642 309810 312917 327682 380811
21351C80811L8646P1260K3293l919K7184P354J1383M3650p730m2494o2153O7780
$$ 380811 419457 490717 514010 510091 537275 544629 556012 599662 591932 549438 487285 555065
21339E55065L0279l80J09523J22809J32556J62968J39003L46496L20212L19992
$$ 555065 585344 584964 694487 817296 949852 1112820 1251823 1598319 1918531 2238523
21329B238523K53662K47829K41655K42814J62875J08375Q7428j2994m9123j57917
$$ 2238523 2492185 2740014 2981669 3224483 3387358 3495733 3583161 3570167 3521044 3363127
21319C363127k83960k99736l65534l45534l38304k06222j36682j56389q0937p0920
$$ 3363127 3079167 2779431 2413897 2068363 1730059 1523837 1387155 1230766 1149829 1078909
21309A078909j36750p9665k9535m1094J2233J0654l5105L766j465J338J14248
$$ 1078909 942159 862494 832959 791865 804098 814752 779647 783413 781948 783286 897534
21298H97534J04824n7825P5632J42438J41177J33783K04922J17776J3378L4003
$$ 897534 1002358 944533 1020165 1162603 1303780 1437563 1642485 1760261 1773639 1807642
21288A807642P1635m8784o1172o907K2605q746N089N6869J01340k6768K4521J9393
$$ 1807642 1879277 1830493 1769321 1762414 1785019 1776273 1781362 1838231 1939571 1912803 1937324 1956717
21276A956717K1742M8529N2642K2917J41893N9320O5880J16756P1804N3590m1198
$$ 1956717 1978459 2026988 2079630 2102547 2244440 2303760 2369640 2486396 2558200 2611790 2570592
21265B570592r1868q3967q6678j98922j47354k0037j8516o6683J3961R8367k9446
$$ 2570592 2478724 2394757 2308079 2109157 1961803 1941766 1923250 1856567 1870528 1968895 1939449
21254A939449o4603p3324j19841j19560l3037m592j6171k9251r1677m4721R878
$$ 1939449 1874846 1801522 1681681 1562121 1529084 1524492 1508321 1479070 1387393 1342672 1352550
21243A352550k6722n695M4628O6672J10398M3962J59470J62818K47631K40719
$$ 1352550 1325828 1320133 1364761 1431433 1541831 1585793 1745263 1908081 2155712 2396431
21233B396431J92238J26797p29m8754j03325j90822k38723j55784j10571p9050
$$ 2396431 2588669 2715466 2714737 2665983 2562658 2371836 2133113 1977329 1866758 1787708
21223A787708j38157j66675l0518J6339l1507L9788P3759L1157L1478J01458K8250
$$ 1787708 1649551 1482876 1452358 1468697 1437190 1476978 1550737 1581894 1613372 1714830 1743080
21212A743080L4677N4041K7497p8651j03093n9575k567J4005P563J17104J45315
$$ 1743080 1777757 1831798 1859295 1780644 1677551 1617976 1615409 1629414 1636977 1754081 1899396
21201A899396K2791J85996L89398M32381L38418K17995K46303J24778O2388j12846
$$ 1899396 1922187 2108183 2497581 2929962 3268380 3486375 3732678 3857456 3919844 3806998
21191C806998j73820j17708J0170J04038K71629L81430M02813N49845Q05834R88403
$$ 3806998 3633178 3515470 3525640 3629678 3901307 4282737 4685550 5235395 6041229 7029632
21181G029632J282800J722529K305849L028958M013497N803491Q368048J1792800
$$ 7029632 8312432 10034961 12340810 15369768 19383265 25186756 33554804 45347604
21173D5347604J6539663K2629620K7640827K6860129K2522092J6369082M11502
$$ 45347604 61887267 84516887 112157714 139017843 161539935 177909017 178320519
21166A78320519j3571483j9154319k4946532k5381281k0322613j5514423j1678999
$$ 178320519 164749036 145594717 120648185 95266904 74944291 59429868 47750869
21159D7750869q564884o235221m649207l491891k614370j990719j555037j056965
$$ 47750869 39185985 32950764 28301557 24809666 22195296 20204577 18649540 17592575
21151A7592575q25146n87897m05381l44664l27017m19231m52051m11850l31388
$$ 17592575 16767429 16179532 15774151 15429487 15102470 14683239 14231188 13819338 13487950
21142A3487950l08093l06050k80704l89013l75027l86916l54462l30859l22896
$$ 13487950 13179857 12873807 12593103 12204090 11829063 11442147 11087685 10756826 10433930
21133A0433930l27191l43795l94406m30518l87620l88049l87710m27211k39007
$$ 10433930 10106739 9762944 9368538 8938020 8550400 8162351 7774641 7347430 7108423
21124G108423k34358k03286j62459k03673l18612l76336m00239l17400k83247
$$ 7108423 6874065 6670779 6508320 6304647 5986035 5609699 5209460 4892060 4608813
21115D608813k37790j94198j81934j79047k57471j03970j35171j07314j59107
$$ 4608813 4371023 4176825 3994891 3815844 3558373 3454403 3319232 3211918 3052811
21106C052811j35601j46918j52707j32582r4818p0729q0779q7408q4691j5628
$$ 3052811 2917210 2770292 2617585 2485003 2390185 2319456 2238677 2151269 2066578 2050950
21096B050950n4551p9724l9071l4680p3300n7082k3037m5202k3234l3761L6724
$$ 2050950 1996399 1916675 1877604 1842924 1769624 1712542 1689505 1644303 1621069 1587308 1624032
21085A624032P8114K0069k8635m1671l3141r4707m2132o6640n1400j3556l9441
$$ 1624032 1702146 1722215 1693580 1651909 1618768 1524061 1481929 1415289 1363889 1350333 1310892
21074A310892j4521j3896j0076m1927R204Q2212O5723m7819q290J0987r672m9558
$$ 1310892 1296371 1282475 1272399 1230472 1239676 1321888 1387611 1339792 1331502 1342489 1332817 1283259
21062A283259K740L4135q9109q5506n8554q418N0218n733m9263l3615j0231p3448
$$ 1283259 1285999 1320134 1231025 1145519 1086965 1078547 1128765 1123032 1073769 1040154 1029923 956475
21050I56475j18744n4592k7046p8296K248J3100j2486n6167L9510P9380K1559
$$ 956475 837731 783139 756093 677797 680045 693145 680659 624492 664002 743382 764941
21039G64941J4630m6041n7611N6095M7534O798l1856K2777J2442p6678r8608k6212
$$ 764941 779571 733530 675919 732014 779548 786346 754490 777267 789709 713031 614423 588211
21027E88211k064o5471j8925j7034Q154J1926k1935l5837m1474J1611j23592j8888
$$ 588211 586147 520676 501751 484717 492871 504797 482862 447025 405551 417162 293570 274682
21015B74682J6959k2982p4592k4513N7565J56543J07847J24247J87744P9373M7033
$$ 274682 291641 268659 194067 169554 227119 383662 491509 615756 803500 882873 929906
21004I29906q238k5211k3201L11L5353N680K1471M1821J3696j1903k6475L2699
$$ 929906 921668 896457 873256 873567 908920 914600 936071 977892 991588 979685 953210 985909
20992I85909n9550j2504k3441J2823J770k9209n0579L9782K9218l23q380O7924
$$ 985909 926359 913855 890414 903237 905007 875798 825219 865001 894219 893896 885516 953440
20980I53440N1034K3913j5176k7300Q2689P0551N1460Q1738J23896J31464K06864
$$ 953440 1004474 1028387 1013211 985911 1068600 1139151 1190611 1272349 1396245 1527709 1734573
20969A734573K08781K52151K68551L32019N07395P40396Q74957Q42932R19446
$$ 1734573 1943354 2195505 2464056 2796075 3303470 4043866 4918823 5761755 6681201
20960F681201P43130M20395J15414j76162m62436n56044n19098l99652k65922
$$ 6681201 7424331 7844726 7960140 7783978 7321542 6765498 6246400 5846748 5580826
20951E580826j11331M0233Q915l3569o2762k28579k42340k78445l62518m51661
$$ 5580826 5469495 5509728 5518643 5485074 5422312 5193733 4951393 4672948 4310430 3858769
20941C858769l41898l01242k47492j55208k4619q5565j47838r8538q2153p8838
$$ 3858769 3516871 3215629 2968137 2812929 2788310 2702745 2554907 2456369 2374216 2295378
20931B295378J5911Q3760J00329J10219P0531Q3741J00312N5986J25997J55819
$$ 2295378 2311289 2395049 2495378 2605597 2676128 2759869 2860181 2916167 3042164 3197983
20921C197983J75935K66767M07276N10281N64348O01187N43610O51316N90873
$$ 3197983 3373918 3640685 4047961 4558242 5122590 5723777 6267387 6918703 7509576
20912G509576L58377J71495P5307k68711l97009l36133k38642r6954P5239K86794
$$ 7509576 7867953 8039448 8114755 7846044 7449035 7112902 6874260 6777306 6852545 7139339
20902G139339M74724P49525J045790J326487J814682K275994K896878L789512
$$ 7139339 7614063 8363588 9409378 10735865 12550547 14826541 17723419 21512931
20894B1512931M949020O477078Q831728J2584824J8466107K7045617L8433021
$$ 21512931 26461951 32939029 41770757 54355581 72821688 99867305 138300326
20887A38300326N3971260P4418363Q1997026M6908583R642980o959416n2042704
$$ 138300326 192271586 266689949 348686975 395595558 405238538 398279122 346236418
20880C46236418p6282430o1655754m6510912l5646909k5824986j8428040j3407413
$$ 346236418 269953988 208298234 161787322 126140413 100315427 81887387 68479974
20873F8479974r956576p614804n911227m688469l810497l069519k592586k158420
$$ 68479974 58523398 50908594 44997367 40308898 36498401 33428882 30836296 28677876
20865B8677876j749038j417406j162013q33470n89870m30546l27797k58652o4553
$$ 28677876 26928838 25511432 24349419 23515949 22926079 22495533 22167736 21909084 21844531
20856B1844531J89271L16893L39114J98327J24102j24883n04873o34125p12507
$$ 21844531 22033802 22350695 22689809 22888136 23012238 22887355 22382482 21748357 21035850
20847B1035850q40111r97516j149880j085583r64125q97093q40795p07565o49759
$$ 21035850 20195739 19198223 18048343 16962760 15998635 15101542 14260747 13553182 12903423
20838A2903423o69715p01377n97100n46054n24618n10892m34580m10573m11443
$$ 12903423 12233708 11532331 10935231 10389177 9864559 9353667 8919087 8508514 8097071
20829H097071l07485k73023k75370k53266l20360l36388l07918k49765k09281
$$ 8097071 7789586 7516563 7241193 6987927 6667567 6331179 6023261 5773496 5564215
20820E564215k01068j58385j38730k36860k42709k78997j68140j47643j38489
$$ 5564215 5363147 5204762 5066032 4829172 4586463 4307466 4139326 3991683 3853194
20811C853194j90062j59411j15108j16429j45932q8775q4852j24129r7348j14731
$$ 3853194 3663132 3503721 3388613 3272184 3126252 3037477 2952625 2828496 2731148 2616417
20801B616417j15577o0832r0063j6953k3297n9134j4654m7754l9610r9033j16475
$$ 2616417 2500840 2440008 2349945 2332992 2309695 2250561 2235907 2188153 2148543 2049510 1933035
20790A933035o5150k1339o8044q0108n1771p2925Q838J6103j2472o0071n6796
$$ 1933035 1867885 1846546 1778502 1698394 1646623 1573698 1582536 1598639 1586167 1526096 1469300
20779A469300O897J2942m0342m5843n8471k6133j8411k7840k5369o1794M6077
$$ 1469300 1476197 1489139 1448797 1402954 1344483 1318350 1299939 1272099 1246730 1184936 1231013
20768A231013L7650J5518j7632l5335l6752O610K5688L3842P4549R1917P8695
$$ 1231013 1268663 1284181 1266549 1231214 1194462 1201072 1226760 1260602 1335151 1427068 1505763
20757A505763J69954K19522K27585K74742L27436L88393N02032N73102O30158
$$ 1505763 1675717 1895239 2122824 2397566 2725002 3113395 3615427 4188529 4818687
20748D818687Q19472Q53968O71797L98344J34535j71524m41847o78706p34779
$$ 4818687 5638159 6492127 7163924 7562268 7696803 7525279 7083432 6404726 5669947
20739E669947p47555o21665n28666m40342l50925k97044k47947j59915j37453
$$ 5669947 4922392 4300727 3772061 3331719 2980794 2683750 2435803 2275888 2138435
20730B138435j39346o4912o9603r1714m8202o5441l3977j5698n4103p409k1430
$$ 2138435 1999089 1934177 1864574 1772860 1724658 1659217 1625240 1609542 1555439 1548030 1526600
20719A526600l9130Q041L0639O0451M7179K3867p7893m4709J9616n1882k8788
$$ 1526600 1487470 1495511 1526150 1586601 1633780 1657647 1579754 1535045 1554661 1502779 1473991
20708A473991Q340J2846N0073l9771o7038J4308K2301m1642m3361j4485r090O242
$$ 1473991 1482331 1495177 1545250 1505479 1438441 1452749 1475050 1433408 1390047 1375562 1366472 1372714
20696A372714j442o4952m394k0822p1457n8152m5722J1967k823m4926k9163N614
$$ 1372714 1371272 1306320 1301926 1281104 1209647 1151495 1105773 1117740 1114917 1069991 1040828 1046442
20684A046442O7920m1609L0990n23m4126j0764k7811l672N0323J7979j13938j6083
$$ 1046442 1114362 1072753 1103743 1103220 1059094 1048330 1020519 1016847 1067170 1085149 971211 955128
20672I55128J2986j7321K1538L0450j1840j533L7643M442m3839k5044j4137N5988
$$ 955128 968114 950793 972331 1002781 990941 989408 1027051 1031493 987654 962610 948473 1004461
20660A004461J5851k8011p6501l9785k8203O8446N1661M46j4242J4890J3016p2839
$$ 1004461 1020312 992301 915800 876015 847812 916258 967919 968365 954123 969013 982029 909190
20648I09190J4820L6519J3090M7762n3575l2429m8637o2729k82J5904O8878R2792
$$ 909190 924010 960529 973619 1021381 967806 935377 886740 824011 823729 839633 908511 1001303
20636A001303L8598L0296k5023m2126Q470o9438j04970k8299K0165K6544K7289
$$ 1001303 1039901 1070197 1045174 1003048 1011518 942080 837110 808811 828976 855520 882809
20625H82809n1232J0251M897n9396l4627K6400M2497q342m8329P7156l163K3140
$$ 882809 831577 841828 846725 787329 752702 779102 821599 813257 764928 842084 838921 862061
20613H62061k7187j9835J5039l1M19L3389N661l0307n845L0779J6495R3013J24090
$$ 862061 834874 815039 830078 830047 830466 863855 869516 839209 833364 864143 880638 973651 1097741
20600A097741J18708k2106n2151j6851k9598J0265q5332q7040o7669K4004J2753
$$ 1097741 1216449 1194343 1142192 1125341 1095743 1106008 1020676 933636 865967 889971 902724
20589I02724L4214O1924K9362k251M3540M8402n3312n8097N5389K9897m1270K3242
$$ 902724 936938 998862 1028224 1025973 1069513 1117915 1064603 1006506 1061895 1091792 1050522 1073764
20577A073764m0920k593J7011O5927M7134K1137P4168K6765l8002J6094O866o2644
$$ 1073764 1032844 1030251 1047262 1113189 1160323 1181460 1255628 1282393 1244391 1260485 1267351 1204707
20565A204707o1758J734l310J5007K2893J941N048K2796Q232l8963Q978J4886
$$ 1204707 1142949 1144683 1141373 1156380 1179273 1181214 1186262 1209058 1217290 1178327 1187305 1202191
20553A202191L746j2175K3731J4843k5075K658l1034M6261P0964P9327k1436j5464
$$ 1202191 1205937 1193762 1217493 1232336 1207261 1209919 1178885 1225146 1296110 1375437 1354001 1338537
20541A338537N1647j6182m3347L076q751M3025R1363P0284J0702J8076J9405O6862
$$ 1338537 1390184 1374002 1330655 1333731 1324980 1368005 1459368 1529652 1540354 1558430 1577835 1644697
20529A644697J09334L7444N8920J44467J06486J14315L3479o118n5799l5764n3761
$$ 1644697 1754031 1791475 1850395 1994862 2101348 2215663 2249142 2243024 2187225 2151461 2097700
20518B097700p0824m9179q7363p7919k8138n4174R763P0796j4864M4833J015l4372
$$ 2097700 2026876 1977697 1890334 1812415 1784277 1730103 1739866 1810662 1795798 1840631 1841646 1807274
20506A807274L5730P98r535l6466k3290n3078L5446O3776J4836l1366L9510P3469
$$ 1807274 1843004 1843802 1834267 1797801 1774511 1721433 1756879 1820655 1835491 1804125 1843635 1917104
20494A917104j1675m2052j5837k304O9989Q9587O309o2j3450J030N5741N8925
$$ 1917104 1905429 1863377 1847540 1845236 1915225 2004812 2011121 2011059 1997609 1998639 2054380 2113305
20482B113305M8169n8509M9808M4578J8336j8270J2962Q6448j7141n5658Q0800
$$ 2113305 2161474 2102965 2152773 2197351 2215687 2197417 2210379 2296827 2279686 2224028 2304828
20471B304828P3899K2589J2399J36768O9967O6910k5866m1784l8461J2786M2068
$$ 2304828 2378727 2401316 2413715 2550483 2620450 2687360 2661494 2619710 2581249 2594035 2636103
20460B636103Q4364N9931O583M9349K1676M5245J29696P0405K8709Q8393L4227
$$ 2636103 2720467 2780398 2786981 2836330 2858006 2903251 3032947 3103352 3132061 3220454 3254681
20449C254681m4360P0023J16078Q8844N0868l773l968M2732J7158R9007J07503
$$ 3254681 3210321 3280344 3396422 3485266 3536134 3532361 3528393 3571125 3588283 3687290 3794793
20438C794793K970J23176J71960P7906N6085P9933K7597j1277R0026O9116P1891
$$ 3794793 3797763 3920939 4092899 4170805 4226890 4306823 4334420 4323143 4413169 4482285 4554176
20427D554176J20979O0975J01966J16117J29693J31825L9429O2280J37638R6497
$$ 4554176 4675155 4736130 4838096 4954213 5083906 5215731 5255160 5317440 5455078 5551575
20417E551575K8705M6846J64802J31298J35072J15969O0132J65387R8732N6450
$$ 5551575 5580280 5627126 5791928 5923226 6058298 6174267 6234399 6399786 6498518 6554968
20407F554968J14055J34127J26550J05111K01915J71380J69315J48823J57410
$$ 6554968 6669023 6803150 6929700 7034811 7236726 7408106 7577421 7726244 7883654
20398G883654J15254J59017R1395J92632K07872K09054K07299K57039K13160J67934
$$ 7883654 7998908 8157925 8249320 8441952 8649824 8858878 9066177 9323216 9536376 9704310
20388I704310K25101K41354K71703K10284K26504K99416L59081K80620K66041
$$ 9704310 9929411 10170765 10442468 10652752 10879256 11178672 11537753 11818373 12084414
20379A2084414K60617L11974L46295L54791L63707L32055L37321L32105L36721
$$ 12084414 12345031 12657005 13003300 13358091 13721798 14053853 14391174 14723279 15060000
20370A5060000L52571M51437M57905L88920M25846M50850N23024N61679M99958
$$ 15060000 15412571 15864008 16321913 16710833 17136679 17587529 18110553 18672232 19172190
20361A9172190N39466N21454N10735N72369O03976N90163O20287P26516O70017
$$ 19172190 19711656 20233110 20743845 21316214 21920190 22510353 23130640 23857156 24527173
20352B4527173O41315O71028P60793P79829P16790P33931P29209P13625Q39733
$$ 24527173 25168488 25839516 26600309 27380138 28096928 28830859 29560068 30273693 31113426
20343C1113426P87813O89625P54895P63174P79236P43769O49132P65658P78562
$$ 31113426 31901239 32590864 33345759 34108933 34888169 35631938 36281070 37046728 37825290
20334C7825290P16205O18548O56856O23711N16971M95688M92559M69180M71908
$$ 37825290 38541495 39160043 39816899 40440610 40957581 41453269 41945828 42415008 42886916
20325D2886916L90869L23502K71721K88762K26263N186L7316O1506J8846n3447
$$ 42886916 43277785 43601287 43873008 44161770 44388033 44393219 44430535 44492041 44510887 44457440
20315D4457440j49843k83558l84652m57564m61885n22394n21966n17071n77261
$$ 44457440 44307597 44024039 43639387 43181823 42719938 42197544 41675578 41158507 40581246
20306D0581246n89683n46455n24545n00793n43835n85010n95542n91616n72108
$$ 40581246 39991563 39445108 38920563 38419770 37875935 37290925 36695383 36103767 35531659
20297C5531659o66504p96024p62305p64656p67356p23480p02400o66857p06240
$$ 35531659 34865155 34069131 33306826 32542170 31774814 31051334 30348934 29682077 28975837
20288B8975837n77802o33166o25586n82555n71463n42109n53901o06916n57666
$$ 28975837 28398035 27764869 27139283 26556728 25985265 25443156 24889255 24282339 23724673
20279B3724673n39069m85918n10589m42940m56779n10547n09256m38573m39038
$$ 23724673 23185604 22699686 22189097 21746157 21289378 20778831 20269575 19831002 19391964
20270A9391964m57102m37578m49661l77210l49182l76992l90138l79368l88056
$$ 19391964 18934862 18497284 18047623 17670413 17321231 16944239 16554101 16174733 15786677
20261A5786677l29412k78822l21637l43092l44339l21244k42779k32417l25954
$$ 15786677 15457265 15178443 14856806 14513714 14169375 13848131 13605352 13372935 13046981
20252A3046981l18337k27402k34652k53577l26448k96081k64907j79476j99090
$$ 13046981 12728644 12501242 12266590 12013013 11686565 11390484 11125577 10946101 10747011
20243A0747011j38940j97238k23778j62293k60265k67507j47725j61502j32373
$$ 10747011 10608071 10410833 10187055 10024762 9764497 9496990 9349265 9187763 9055390
20234I055390j95047k33818j49743j97852j91702j75519j04010q0049j20457j35828
$$ 9055390 8860343 8626525 8476782 8278930 8087228 7911709 7807699 7727650 7607193 7471365
20224G471365j65892j51446q7038q1744j94717r2222q9130j69441j14165j04660
$$ 7471365 7305473 7154027 7066989 6985245 6790528 6698306 6609176 6439735 6325570 6220910
20214F220910j21644o4531j29137p4595j04683q2777r1113r4251q9351p0229n4550
$$ 6220910 6099266 6034735 5905598 5831003 5726320 5643543 5552430 5458179 5368828 5298599 5244049
20203E244049j3289j42613m6240q6226j13740r5368N3506J9790r7754j35563j32514
$$ 5244049 5230760 5088147 5041907 4955681 4841941 4746573 4800079 4819869 4722115 4586552 4454038
20192D454038q9732n7099j04158k2190m4949r5206l7138l0615J2136m3625m6452
$$ 4454038 4364306 4307207 4203049 4180859 4135910 4040704 4003566 3972951 3985087 3941462 3895010
20181C895010j13221l5233m6996p9655m6179j8883l8911j00341m1589L775q6889
$$ 3895010 3781789 3746556 3699560 3619905 3573726 3554843 3515932 3415591 3374002 3377777 3290888
20170C290888n4809m1990j4638o9303N567N0668l0012j01066j0424n5540m6375
$$ 3290888 3236079 3194089 3179451 3110148 3115715 3166383 3136371 3035305 3024881 2969341 2922966
20159B922966m5876k7777m563q0953p5909j2963n826O696M4730j0916P201r8771
$$ 2922966 2877090 2849313 2844750 2763797 2687888 2674925 2669099 2675795 2720525 2709609 2716810 2618039
20147B618039m4135M896m7788o2959L7174J2672n3241l4994r1599q6846J5099
$$ 2618039 2573904 2578800 2531012 2468053 2505227 2517899 2464658 2429664 2338065 2251219 2266318
20136B266318N3882M683j8343J2305r2051r2007n2489R907o087l7065j8476j6716
$$ 2266318 2320200 2324883 2306540 2318845 2226794 2134787 2082298 2092205 2086118 2049053 2030577 2013861
20124B013861K8663r054L0052m4411p4601K5515j259l7707J1723o4933r8774m5101
$$ 2013861 2042524 2033470 2063522 2019111 1944510 1970025 1968766 1931059 1942782 1877849 1779075 1733974
20112A733974j9625P3328M6355k4245o8593l1092j829j5295Q5862M8324m5192
$$ 1733974 1714349 1787677 1834032 1809787 1741194 1710102 1708273 1692978 1778840 1827164 1781972
20101A781972m5199k9418L6403m7211M8419j0357p453k5776o1394k7741m505k1414
$$ 1781972 1736773 1707355 1743758 1696547 1744966 1734609 1727156 1701380 1639986 1612245 1607740 1586326
20089A586326J4428J4384l7276n5109k2070l0882J1826R276j875k5794n8022l0717
$$ 1586326 1600754 1615138 1577862 1522753 1500683 1469801 1481627 1490903 1489028 1463234 1405212 1374495
20077A374495o701j2035j5805J133Q2996M90p7174l2352J4575r7129J1640l0704
$$ 1374495 1367794 1355759 1339954 1341087 1424083 1424573 1347399 1315047 1329622 1232493 1244133 1213429
20065A213429K9436q284m5317K9983j9430r109K2489q3815p8545J1770L6056K6389
$$ 1213429 1242865 1234581 1189264 1219247 1199817 1190708 1213197 1129382 1050837 1062607 1098663 1125052
20053A125052L6672L2515k1448l6396J3906P020p6797Q654K2013J4016J4432N996
$$ 1125052 1161724 1194239 1172791 1136395 1150301 1157321 1080524 1089178 1111191 1125207 1139639 1145635
20041A145635k361K6685j659j5624q7802k8225K9029L7070m0956o5469q016n8863
$$ 1145635 1143274 1169959 1168300 1152676 1064874 1036649 1065678 1102748 1061792 996323 988307 929444
20029I29444M9234O762M043K1408J7095l5983n144L4989k6510l8085o3173o9729
$$ 929444 978678 985440 989483 1010891 1027986 992003 986859 1021848 995338 957253 894080 824351
20017H24351l600N8502j0548K917k1692n5423K0939J8094j0743o773M6630l050
$$ 824351 820751 879253 868705 871622 849930 794507 815446 833540 822797 816024 862654 859604
20005H59604o2823m0114j7040k4060K4858J0469J5235M3141K3961l026j4089q8536
$$ 859604 796781 756667 739627 715567 740425 750894 766129 809270 833231 830205 816116 727580
19993G27580J9725M8526J0383N6718q455l1885l6198j6891j5544l1687j9612L9860
$$ 727580 747305 795831 806214 862932 854477 822592 786394 769503 753959 722272 702660 742520
19981G42520l4514J4139l845M9210l6557j36131J1193O8801P5967q802p5743k3033
$$ 742520 708006 722145 718300 767510 730953 594822 606015 674816 750783 741981 666238 643205
19969F43205M7495M6488j4235q992l9619O6024P540m0190k8195J8447K1597J6463
$$ 643205 690700 737188 722953 713961 674342 740366 747906 707716 679521 697968 719565 736028
19957G36028r2343n3020K8140l6288O449O7559m1375l6762k4832K7024M7933m2784
$$ 736028 643685 590665 618805 582517 588966 656525 615150 578388 553556 580580 628513 585729
19945E85729L479j1047l6070n233J09405N287m872k2371m9879q087k9509J6930
$$ 585729 589208 578161 542091 536858 646263 651550 646678 624307 574428 566341 536832 553762
19933E53762l3275m2479j6733P5483M6190J792l0185k8801O328L5176J8241m7243
$$ 553762 520487 478008 461275 536758 582948 584740 554555 525754 532082 567258 585499 538256
19921E38256l6914K2060O2774R389n3743k8692l990o464l3436J4832j7939L1759
$$ 538256 501342 523402 586176 595565 541822 513130 509140 502676 469240 484072 466133 497892
19909D97892K4050j6372o0327k0458r320P3629J8509m3950l6747K0462l4432j2067
$$ 497892 521942 505570 445243 424785 415465 489094 507603 463653 426906 447368 412936 400869
19897D00869P0205J3292p6357M986O6661J3010j4279M0728l5143m1751m2670L2795
$$ 400869 471074 484366 408009 412995 479656 492666 478387 519115 483972 442221 399551 432346
19885D32346O8057K6395l0956K361J4074n1886M1974n610j9808q1076l100j6518
$$ 432346 500403 526798 495842 498203 512277 460391 502365 496755 476947 395871 392771 376253
19873C76253l4048L2609k5719n0388n9673O7916M0760P4906P4741L5357o4057
$$ 376253 342205 374814 349095 298707 239034 306950 347710 422616 497357 532714 468657
19862D68657o0030L9784R0871j2714r9579r9712O578j8335l846J5969P9637M1144
$$ 468657 408627 448411 539282 526568 426989 327277 333855 315520 311674 327643 407280 448424
19850D48424m3851K3177J9999o8725j752K0148k5443j6695n4164m9568J5171J8973
$$ 448424 404573 427750 447749 379024 377272 397420 371977 355282 301118 251550 266721 285694
19838B85694R3231M3400Q6215n5405r899q2704o3359j9776j2736J4551N9567o1689
$$ 285694 378925 422325 508540 453135 443236 360532 297173 277397 264661 279212 338779 277090
19826B77090k7994n0358N8280N0403k9193j3788K2845M2346K5211j3792J5412
$$ 277090 249096 198738 257018 307421 278228 264440 287285 329631 354842 341050 356462
19815C56462l0966j0554J3706J9493l4330J3845N5199j2049l5322K4361K125k0053
$$ 356462 325496 314942 328648 348141 313811 327656 382855 370806 335484 359845 361970 341917
19803C41917o3367o9446m0925N1577O8454J2933l7077M1872P5273j8574j4117
$$ 341917 278550 209104 168179 219756 288210 301143 264066 305938 381211 362637 348520
19792C48520j0146j9273J9365J09171J7717j1286J9022O4386o6094m9791L6146
$$ 348520 338374 319101 338466 447637 465354 454068 473090 537476 471382 421591 457737
19781D57737L1985l3422m9316l9158l229J6067r636J9788M1682j5426k9510r489
$$ 457737 489722 456300 406984 367826 364597 380664 371028 390816 432498 417072 387562 378073
19769C78073n2410Q553J850L5817Q8890M0631P2577J8651J4891Q206K8993O0706
$$ 378073 325663 334216 336066 371883 460773 501404 573981 592632 607523 615729 644722 705428
19757G05428R791p413L9127O7635J4362J2664M5044J2451k0785j2314m7824J9815
$$ 705428 715219 707806 746933 814568 828930 841594 886638 899089 878304 865990 818166 837981
19745H37981J8621j6800j4119j7568j90K0509k5549k3958k2318M384M1385l6733
$$ 837981 856602 839802 825683 808115 807925 828434 802885 778927 756609 760993 802378 765645
19733G65645l9289N4301j9578O159K9986p3295p261K3670j2765o9996Q627J5243
$$ 765645 726356 780657 761079 767238 797224 723929 716668 740338 727573 657577 666204 681447
19721F81447m9505l9138m6069k8935p472J6186L2321K3323P204r2757l2613k0774
$$ 681447 631942 592804 546735 517800 510328 526514 558835 582158 589362 496605 463992 443218
19709D43218l8214M2066J835j6315l83l8009O2770K3988o0370M4782J0930m2664
$$ 443218 405004 447070 448905 432590 432207 394198 456968 480956 420586 465368 476298 433634
19697D33634j5598j2782k0746K243l104K9454K1094q716L3751k4188o4772m1724
$$ 433634 418036 405254 384508 386751 383647 413101 434195 425479 459230 435042 370270 328546
19685C28546k406p7084j3394L7561M2158N5241K6495n1470N711M6890p910m1994
$$ 328546 326140 249056 235662 273223 315381 370622 397117 345647 351358 398248 390338 348344
19673C48344M83k9520J275p626k3371K9053M5796K1887j4426j5330p339l825n1388
$$ 348344 348827 319307 320582 312956 289585 318638 364434 386321 371895 356565 349226 345401 294013
19660B94013J0246j6584o8890J0221L6029R969l1471q010M6828L6988K731j07908
$$ 294013 304259 287675 218785 229006 265035 275004 243533 235523 282351 319339 322070 214162
19648B14162J593K0685K3884J9272Q643M5261J1908n4800n1057l0341N4780L8502
$$ 214162 215755 236440 260324 279596 288239 333500 345408 290608 239551 209210 263990 302492
19636C02492n876L7152N2812P2285j9647o8400p4536n0752m6273L0231K023p9936
$$ 302492 296616 333768 386580 458865 439218 370818 296282 245530 199257 229488 231511 151575
19624A51575K7527P8338K4244L8917p521l3386k5020j7972n069M7284o370q0958
$$ 151575 179102 257440 281684 320601 313080 279694 254674 236702 231633 278917 272547 191589
19612A91589J586N7198K6150K9227j382r427q9608p6970k673L5497k3050K4518
$$ 191589 193175 250373 276523 305750 304368 294941 205333 128363 125690 161187 138137 162655
19600A62655k3226J0555L0452p529o5738J1934M7061J1022L6036q2994l0315L2613
$$ 162655 139429 149984 180436 172907 107169 119103 166164 177186 213222 130228 99913 132526
19588A32526J09264K0017n826p70j1365m7333k1780q367k3889j4662k6564L7060
$$ 132526 241790 261807 255981 255211 243846 196513 174733 166366 142477 127815 101251 138311
19576A38311N2376M0918M4629j7160q540o2405j0541K2261k3123j00848P45N5190
$$ 138311 190687 231605 276234 259074 250534 188129 177588 199849 176726 75878 76623 131813
19564A31813N8919J4236P788k8635J5035J7307l5926J907M720Q348j4566j0588
$$ 131813 190732 204968 212756 184121 199156 216463 180537 182444 187164 195512 180946 170358
19552A70358L57k2262K3889J3474k1555J1219R154p6365k3456k2645j1856O6456
$$ 170358 170715 148453 172342 185816 164261 175480 184634 108269 84813 62168 50312 116768
19540A16768K9327l8215l7497M9592Q9181K9255p381J6196r999n5420j0461p984
$$ 116768 146095 107880 70383 119975 209156 238411 231030 247226 237227 181807 171346 163362
19528A63362K241M0715O820j6416R540J8648j8451R80M127m0343K8091K3831q3482
$$ 163362 165603 206318 213138 196722 206262 224910 206459 207439 211566 171223 199314 223145 139663
19515A39663m3706O3543M8979j9291L8429K5463O8071k7375q7123j0738K9374
$$ 139663 95957 159500 208479 189188 227617 253080 321151 293776 206653 195915 225289
19504B25289m3082j00653J4763M6624L1308m34m1902j9292R8515K8524m2828j4614
$$ 225289 182207 81554 96317 142941 174249 173815 131913 112621 211136 239660 196832 182218
19492A82218j4388N290J9650L1112N397L7220m5379k8250n915M747k2751j8750
$$ 182218 167830 173120 192770 223882 229279 266499 221120 192870 186955 191702 168951 150201
19480A50201o4546j1242L817k1270k6833K683j4280M6715n8783k4883J1895P0579
$$ 150201 85655 74413 78230 56960 30127 32810 18530 65245 6462 -18421 -6526 64053
19468F4053P8107R5411K0976l8748o4152L5685m0771p914r843m5710O8317P0631
$$ 64053 142160 237571 258547 219799 155647 191332 150561 142647 132804 87094 155411 226042
19456B26042m960p1100N397M3573P681o6623j8158J6002J929o3223o6518N9174
$$ 226042 221082 149982 155379 198952 206633 140010 121852 137854 139783 76560 10042 69216
19444F9216J1247k3569N2079N2529l5542J9820k961L0957m594N039m8571k5083
$$ 69216 80463 56894 108973 161502 125960 145780 142819 173776 169182 174221 125650 100567
19432A00567j5742K0158J2045n8318j8579l6436K5018N8380J9158N5446k5308
$$ 100567 84825 104983 117028 58710 40131 3695 28713 87093 106251 161697 136389
19421A36389j2090K6577K518j9413j3545j4446k1528L6549L2955j3684l1456r255
$$ 136389 124299 150876 153394 133981 120436 105990 84462 121011 153966 140282 108826 99571
19409I9571J6996J6028m2500o8501J5932j3391J6294k7335j707N7683L8389k1427
$$ 99571 116567 132595 90095 21594 37526 24135 40429 13094 11387 69070 107459 86032
19397H6032J4234l2324k2090M2864L7153Q701l2091k6256n2691m3377J0039K374
$$ 86032 100266 67942 45852 88716 125869 134570 102479 76223 23532 -19845 -9806 -7432
19385g432K4555J51301M7991q5581k2851l8122j016M0225J1534L8415L5510k5583
$$ -7432 17123 168424 216415 130834 107983 69861 68845 109070 120604 159019 194529 168946
19373A68946J4335p4279n4377M8304N2954K7889L713L1245M3271l4275q9574j4764
$$ 168946 183281 109002 54625 102929 155883 183772 187485 218730 262001 227726 138152 123388
19361A23388L8358J7452P302N6602L9861m1128l1644K4731n0276k0810j7250M9948
$$ 123388 161746 179198 186500 243102 282963 241835 210191 234922 184646 163836 146586 196534
19349A96534L7006O2628M7815l4020n8826m9857J95K1550p210n1009m5079L0107
$$ 196534 233540 296168 343983 309963 251137 201280 201475 223025 215815 164806 119727 149834
19337A49834N8011L712k4473P5725J5717k6957l342r9734q3967K0859K1066n3073
$$ 149834 207845 211557 187084 262809 278526 251569 248227 148493 64526 85385 106451 53378
19325E3378M3066L4662k690j9383p9808J3091M7776N0762q112o1111o9991O7458
$$ 53378 96444 131106 128416 109033 29225 42316 90092 140854 132742 71631 1640 69098
19313F9098J3225r932K2880l050J7006j2697l4702l5469p2488k3194N2400L0267
$$ 69098 82323 72391 95271 92221 109227 96530 61828 26359 -46129 -69323 -16923 13344
19301A3344K1769J1166k8765j3912m316M6556P310L0470P5346J5352K2346o6835
$$ 13344 35113 46279 17514 3602 -714 45842 53152 83622 158968 174320 196666 129831
19289A29831o3078m5343k5658L8120M1845k0223l3160j7099k4237O2779L6052
$$ 129831 66753 21410 -4248 33872 75717 55494 22334 5235 -19002 43777 79829
19278G9829M3602L2680q811n2516n9385n7942p1J9278O070J01881L7017n604m0745
$$ 79829 123431 156111 147300 94784 35399 -22543 -22614 -3336 2734 104615 141632 136028 95283
19265I5283K5327k3901k7777q9802o175p20k1081K4227M1871L0185N5040N2951
$$ 95283 120610 96709 68932 -20870 -27045 -27765 -48846 -24619 17252 47437 102477 155428
19253A55428K3038M0806M2158n3030j0676n2146p3331j1509l6713j8665M454k243
$$ 155428 178466 219272 261430 208400 197724 145578 72247 60738 24025 5360 9814 7571
19241G571M6399l8920j9183M605M0266P90j4774K8323N684R371R27p038l5476
$$ 7571 53970 15050 -4133 472 40738 41528 26754 55077 60761 70132 71059 64021 28545
19228B8545r1771k640O8188Q5618K2951o5387o1126l1892K2324L7218K4376K9687
$$ 28545 -63226 -65866 2322 87940 110891 45504 -15622 -47514 -25190 12028 36404 66091
19216F6091N5463J4228j8819m465l4108k9103q3785n2477L8498N6686P6470j6231
$$ 66091 121554 135782 116963 112498 78390 49287 -34498 -86975 -48477 8209 84679 68448
19204F8448l7494k2848k4710J7111M609K744N3054J7127l9123m6540L8697k7603
$$ 68448 30954 8106 -16604 507 5116 7860 60914 78041 38918 -7622 31075 3472
19192C472p4481m0509Q7674L1418k0926q804P1427J23707k4211j19506L2529P055
$$ 3472 -71009 -111518 -23844 7574 -13352 -22156 49271 172978 148767 29261 61790 68845
19180F8845j3000k8718p429m0936J6290k531P9283J5378k1580l0523j1402j626
$$ 68845 55845 27127 19698 -21238 -4948 -7479 71804 87182 65602 35079 23677 22051
19168B2051K8903J9229n2069m9941L5974j0501L751N2243P1318J9286k2017m0578
$$ 22051 50954 70183 18114 -31827 4147 -6354 -2603 49640 120958 140244 118227 77649
19156G7649n8099l8902p60p3579J0788Q7774l3958n6183l5465O2625J01691M9047
$$ 77649 19550 -19352 -20112 -93691 -82903 4871 -29087 -85270 -120735 -58110 43581 92628
19144I2628K5088l6408k9514J8309R9329k3262n7065m203k0605O6258o2312l8752
$$ 92628 117716 81308 51794 70103 169432 146170 89105 84902 64297 130555 68243 29491
19132B9491L9417M557j6835J8495L2380K6293J7259j7489N383j05526n2224K5590
$$ 29491 68908 73465 56630 75125 107505 133798 151057 133568 138951 33425 -18799 6791
19120F791r358j3473k3777N8420P979k3895L0823J8266j1722N3979J1273n2491
$$ 6791 -2567 -16040 -39817 18603 26582 2687 33510 51776 40054 94033 105306 52815
19108E2815j4393k170N4159k5513q4524r284L6660N3014l545L495Q1147O776k9259
$$ 52815 38422 36252 90411 64898 -19626 -28910 7750 60764 57219 60714 141861 148637 119378
19095A19378K7186R611o6704j5984O9045j9733M0250R0729k1165L9970Q1259K7851
$$ 119378 146564 156175 89471 73487 142532 122799 163049 253778 232613 272583 353842 381693
19083C81693O0485J2268q6547r5555o5289p1956k5978L4640k058m6570J2946J2270
$$ 381693 442178 454446 367899 272344 207055 135099 109121 143761 141703 95133 108079 120349
19071A20349k2381Q414K7549Q611M0124l4396L1645R84j7228k6701j2560J0956
$$ 120349 97968 106382 133931 142542 182666 148270 179915 180899 163671 136970 124410 135366
19059A35366M4700K4649j284j7070j9568k625J42258J40271R6556K0209K1097
$$ 135366 180066 204715 203431 186361 166793 164168 306426 446697 543253 563462 584559
19048E84559M5916Q0646M3330j1073o5760L0448k7064o4382L7652l39j00835m7014
$$ 584559 630475 711121 754451 743378 677618 708066 681002 616620 654272 653933 553098 506084
19036E06084r7588j35801m1178j6789R533k6731n8474p8708J2883L0088M302J2335
$$ 506084 408496 272695 231517 214728 224261 197530 139056 60348 73231 103319 107621 119956
19024A19956O8554k653j1961K1828k6574k7898K5555R8533P4872p6915r8290L0488
$$ 119956 188510 185857 173896 195724 169150 141252 166807 265340 340212 263297 165007 195495
19012A95495Q4438M6628R744J14520K8687j4912q4602J277n4318j7029P7865J8984
$$ 195495 279933 326561 336305 450825 479512 464600 379998 381275 326957 309928 387793 406777
19000D06777n1694r4159m9544q391N5825q4220p5556N7615K2637m2208m1592l7663
$$ 406777 355083 260924 211380 202989 258814 174594 99038 156653 179290 137082 95490 57827
18988E7827k3347j8405j2813l8360M4015M1966J6034m4032R584Q1692J7273l1866
$$ 57827 34480 16075 3262 -35098 8917 50883 66917 22885 32469 114161 131434 99568
18976I9568n6412m9403O837M421P441J7932j9442M315J48K8037j7138O45L8747
$$ 99568 43156 -6247 590 5011 12452 30384 10942 15257 15405 43442 26304 26949 65696
18963F5696n2962k9540M6402K9686M0886L0759j5682l6547l0092J8728j7013n3185
$$ 65696 12734 -16806 29596 59282 100168 130927 115245 78698 48606 67334 50321 -2864
18951b864r078J9277j8328r504k2612n0041L8627O6125n3818j1089L3852L2758
$$ -2864 -11942 7335 -10993 -20497 -43109 -93150 -54523 11602 -42216 -53305 -19453 13305
18939A3305M8871N135L8364L244l9005k5213M7139J2807l3607j5643p4292n2668
$$ 13305 62176 67311 105675 108919 69914 44701 91840 104647 71040 55397 -18895 -71563
18927g1563P0261L4347o6224o204P6033l3074J0177M0170J7813L6896L6445o0246
$$ -71563 -1302 33045 -33179 -39383 36650 3576 13753 53923 71736 108632 145077 84831
18915H4831p3169l2154o108J5227o036M4775N3148K3407n0096j7403j1825k0472
$$ 84831 11662 -20492 -26600 -11373 -17409 27366 80514 103921 53825 36422 24597 4125
18903D125J2602j3043K0050j4854L8188j2432M7478j4043k6407K9529j4503j6274
$$ 4125 16727 3684 23734 8880 47068 34636 82114 68071 41664 71193 56690 40416
18891D0416K162m0227Q877L5685k9532l250K3270K133j07534r248L9116K0393
$$ 40416 42578 2351 11228 46913 17381 14131 37401 39534 -68000 -77248 -38132 -17739
18879a7739l595J02197q015k4080o2267J3175r43M173m790o3337q0273M8253P5411
$$ -17739 -21334 80863 72848 48768 -13499 -324 -1267 2906 -1884 -65221 -145494 -97241 -21830
18866b1830K3215p8477n0518R8584R0990M316k7194J8531M8607r316n4660J3951
$$ -21830 1385 -77092 -127610 -29026 61964 66280 39086 57617 106224 96908 42248 56199
18854E6199k0170l1483o7908K357M8682O1467P86l4558m458K82L414Q862n95K0964
$$ 56199 36029 4546 -63362 -61005 -12323 49144 49930 15372 10914 11196 14610 23472 22877 43841
18840D3841L8918M5368J9579m4665j8344p7122O352M3001K4902o1247n0044P662
$$ 43841 82759 128127 147706 103041 84697 7575 13927 56928 81830 20583 -29461 -21799
18828b1799K8570O3703k9677k651J2943m5327m3466o744J5049R204K7669N0365
$$ -21799 6771 70474 40797 38146 51089 5762 -37704 -44448 -29399 -20195 7474 57839
18816E7839J2457j5392j9745Q528o0540j0893k2156K248K3579L1716J6207j5031
$$ 57839 70296 54904 35159 43687 -16853 -27746 -49902 -47654 -24075 7641 23848 8817
18804H817j0281m4782j4268k6413L464O7043k7864L2996L8071k3628M0363p082
$$ 8817 -1464 -46246 -60514 -86927 -83463 -16420 -44284 -11288 26783 3155 43518 36436
18792C6436J3951j1209k4589k3149K1115N994K977J8086l42m7832j9269n1327
$$ 36436 50387 39178 14589 -8560 12555 18549 21526 39612 39270 -8562 -27831 -79158
18780g9158P13M6419M0731M4523R261j3189o2220n043o217L2100K6882o6585m6172
$$ -79158 -78445 -32026 8705 53228 62489 49300 -12920 -17963 -24180 7920 34802 -31783 -77955
18767g7955L0549N9955j5458k3962N2121J6698m5866l3565k0086k7675O5653l028
$$ -77955 -47406 12549 -2909 -26871 25250 41948 -3918 -37483 -57569 -85244 -19591 -22619
18755b2619o8418M2446J6584L867J2675P380N9871P1220r439l4788J6745l2603
$$ -22619 -91037 -48591 -32007 -28140 -15465 -8085 51786 123006 113567 78779 95524 62921
18743F2921M9734j1357j5122l601o592l7661l9061l9846K4152P7789n829l9956
$$ 62921 112655 101298 86176 82575 75983 38322 -739 -40585 -16433 61356 55527 15571
18731A5571m2424M8488J5983n6042k8856k6891l8174l6603J9619K9341Q8059l2539
$$ 15571 -26853 21635 37618 -18424 -47280 -74171 -112345 -148948 -129329 -99988 -11929 -44468
18719d4468m9596O3415R926m3126j6168l0363L3694L4608M3505l0783n7286M2158
$$ -44468 -94064 -30649 -20723 -63849 -80017 -110380 -76686 -42078 1427 -29356 -86642 -44484
18707d4484J3101K0039r7644j2828O8124K2938OL7584j8169k1447J1934J6472
$$ -44484 -31383 -11344 -108988 -121816 -53692 -30754 -30748 6836 -11333 -32780 -20846 -4374
18695d374L7156j0191J9674j4399K0125l2983l3856j1708k5650L2769M4280k1607
$$ -4374 32782 22591 42265 27866 47991 15008 -18848 -30556 -56206 -23437 20843 -764
18683g64l9901m5053K2872L3223j8016k3508J8092P2774j8459O639N382k4533
$$ -764 -40665 -85718 -62846 -29623 -47639 -71147 -53055 19719 1260 7899 13281 -11252
18671a1252P2273K6858j0959l9591l4252r605N9376Q490l2487o702l0033k9399
$$ -11252 61021 87879 76920 37329 3077 -6528 52848 61338 28851 22149 -7884 -37283
18659c7283o2033j4728K4249m4665k1366O0855L9518l8730n0026M6821p774k7936
$$ -37283 -99316 -114044 -89795 -134460 -155826 -94971 -55453 -94183 -144209 -97388 -105162 -133098
18647a33098K2755M1577q957L3781L3400J397j7566r2651Q8N633o5605L9724J219
$$ -133098 -110343 -68766 -77723 -43942 -10542 -9145 -26711 -119362 -119274 -113641 -179246 -139522 -138303
18634a38303l4836K2034L5847M6128j2886M1344k8161M8158J1100J4230p785n4601
$$ -138303 -173139 -151105 -115258 -69130 -82016 -40672 -68833 -20675 -9575 4655 -3130 -57731
18622e7731o19k2655l6529M6472j1258J1146J5168K9181J0183o538j6147l3690
$$ -57731 -58350 -81005 -117534 -71062 -82320 -71174 -56006 -26825 -16642 -23180 -39327 -73017
18610g3017Q298p0140m7878Q1301J32100P1442J517j6014k265N0503K6023n3217
$$ -73017 -64719 -134859 -182737 -101436 30664 102106 103623 87609 85344 135847 161870 108653
18598A08653j00079k6125o068m0270N1067p342J0002J7725m3277J83L4356l524
$$ 108653 8574 -17551 -23619 -63889 -12822 -20164 -10162 7563 -35714 -35531 -1175 -4699
18586d699L613K892k4966K7975M5751p0296m3679l2195m8770l085K7616O674L0578
$$ -4699 -1086 1806 -23160 4815 50566 -19730 -63409 -95604 -144374 -147459 -119843 -113169 -82591
18573h2591N5928M4442O2716M013k8302o0703J1639k3054l1776k3603l2606P6032
$$ -82591 -26663 17779 80495 84508 56206 -4497 7142 -15912 -47688 -71291 -103897 -27865
18561b7865N5962j9006k4062k966O408N4277L600n1384J2531n4391j9148l3918
$$ -27865 28097 9091 -14971 -17937 -11529 42748 46348 -5036 7495 -46896 -66044 -99962
18549i9962M3197o736N1168Q9072J0429l4716q3196o8639K105O204N067N9712
$$ -99962 -56765 -63501 -12333 76739 87168 52452 -30744 -99383 -97278 -91074 -86007 -26295
18537b6295M2190N5407k2496l6216o459L4030P960R352M4177J8540K4590p6839
$$ -26295 15895 71302 48806 12590 6131 40161 48121 57473 101650 120190 144780 67941
18525F7941k7265l029l7658j02903J9860K4116O7117J3255k8733N6871J9987M263
$$ 67941 40676 37647 -11 -102914 -83054 -58938 8179 21434 -7299 49572 69559 73822
18513G3822O219o491j05886n8540K7717O0996O0565J9971J1964q0471k8431R616
$$ 73822 80041 73550 -32336 -90876 -63159 -2163 58402 78373 90337 9866 -18565 -8949
18501h949M7128j5073p1265j1147L5712l9759n279N475m4859k9895J9258P5295
$$ -8949 38179 23106 -48159 -59306 -23594 -63353 -68632 -63157 -108016 -137911 -118653 -43358
18489d3358M2324M8936k4743p6498M8376K0254l3270n873j0421j1690l3372k6844
$$ -43358 -1034 47902 23159 -53339 -4963 15291 -17979 -23852 -34273 -45963 -79335 -106179
18477a06179K0350L9865L2301L7865k4183q769J3096K956k4778L6881M2166P5240
$$ -106179 -85829 -45964 -13663 24202 19 -8750 4346 7302 -17476 19405 61571 136811
18465A36811K3685o9483m1102K9516M0374k3953o4746p9159l2184R3425o1964
$$ 136811 160496 91013 49911 79427 119801 95848 31102 -48057 -80241 13184 -48780
18454d8780m8819Q588L6187K7844k8039l4829K0316l8554m0402O5238K3630P5559
$$ -48780 -97599 -89011 -52824 -24980 -53019 -87848 -67532 -106086 -146488 -81250 -57620 17939
18442A7939M1105k6626o1067o6674j18766q821K451R6361J23810P3877o5145n0446
$$ 17939 59044 32418 -28649 -95323 -214089 -222910 -220459 -124098 -288 73589 8444 -42002
18430d2002P409M6864p2908o27P2354L2406k351l969m0237m1016J9281J046j6377
$$ -42002 -34593 12271 -60637 -61264 11090 43496 41145 37176 -3061 -44077 -24796 -23750 -40127
18417d0127K8309K5873q179K1339l21L9495K7471r8578n7019p466N6963m675L4185
$$ -40127 -11818 14055 5876 27215 26894 66389 93860 -4718 -61737 -69203 -12240 -16915 17270
18404A7270j79l7998J9739J4260l0768j4390k5479L2527k1273j7609L7976M5362
$$ 17270 17091 -20907 -1168 13092 -17676 -32066 -57545 -25018 -46291 -63900 -25924 19438
18392A9438k5411k9935J9511O7947k340l4455K5204k7915l0868l954l0604K4980
$$ 19438 -5973 -35908 -16397 51550 49210 14755 39959 12044 -18824 -22778 -53382 -28402
18380b8402L7481K5584k2547j6504j2791K2528k1274k4678J0434L5378J5162J3861
$$ -28402 9079 34663 12116 -4388 -17179 5349 -15925 -40603 -30169 5209 20371 34232
18368C4232q347k7972O1600K4387n1433k7457l1906Q29L829k2965J7661K7123
$$ 34232 25885 -2087 59513 83900 32467 5010 -26896 -26067 -22238 -45203 -27542 -419
18356d19l8072m3686Q2078m4214l0898o832m723L2979m619n062M4419P074o257
$$ -419 -38491 -82177 -99 -44313 -75211 -82043 -86766 -53787 -58406 -63468 -19049 -11975 -18232
18343a8232L7441k3138K1627j4925o9367k6462J26826P4132l4399m2092l7745
$$ -18232 19209 -3929 17698 2773 -66594 -93056 33770 107902 73503 31411 -6334
18332f334j8309K5365M3218K1332l2605m9412k1680K7862j7666L8680M4848Q4865
$$ -6334 -24643 722 43940 65272 32667 -16745 -38425 -10563 -28229 10451 55299 140164
18320A40164l1179o4946J088j4471J0331L7242k6367L4475l2978q3114K0146K0840
$$ 140164 108985 44039 45127 30656 40987 78229 51862 86337 53359 -29755 -9609 11231
18308A1231j1779l5233L791M8243m941k5936q240P9152j0620n5322k8588J9431
$$ 11231 -548 -35781 -31990 16253 11312 -14624 -22864 56288 45668 -9654 -38242 -18811
18296a8811K8879O4506L2721k0222l1827l5761n630l7824k4247l926j8701L2007
$$ -18811 10068 74574 107295 87073 55246 19485 13855 -23969 -48216 -52142 -70843 -38836
18284c8836L9163K0961K3767r715q3239k2395p3413L9862J01946J8348p7947l8168
$$ -38836 327 21288 45055 35340 -47899 -70294 -143707 -103845 -1899 16449 -61498 -99666
18272i9666J7764L7855O1719o136j5547K2239j7878m9060l8684o063K9015P884
$$ -99666 -81902 -44047 17672 11536 -4011 18228 350 -48710 -87394 -93457 -64442 -56558
18260e6558k5445L7047R106j2391J8487n964J961K3521K3834J7749N059n9771
$$ -56558 -82003 -44956 -35850 -48241 -29754 -35718 -33757 -10236 13598 31347 36406 -23365
18248b3365j5566r315r5374r644L2022P989L8654O0926J701l6833q0009R902O5413
$$ -23365 -38931 -48246 -143620 -153264 -121242 -113253 -74599 -13673 -11972 -48805 -128814 -118912 -53499
18235e3499R245K816L6570J04072k7999q4085j5545P4028Q7715l1791L7857L3138
$$ -53499 -44254 -41438 -4868 99204 71205 -12880 -28425 45603 133318 101527 139384 172522
18223A72522K0016L5525J07508Q1179O6203Q0830k5920n6190j6048p6021q8237
$$ 172522 192538 228063 335571 416750 482953 563783 537863 481673 465625 389604 301367
18212C01367l9500m184k4031j8511j7224m5404j6451K5998m038K1681J8299j4576
$$ 301367 261867 257683 233652 215141 197917 152513 136062 162060 158022 179703 198002 183426
18200A83426l3914m7586r4280Q936l7858p5597L8856M4875Q4941L9392m9323p6171
$$ 183426 149512 101926 7646 16582 -21276 -96873 -58017 -13142 71799 111191 61868 -14303
18188a4303M5358M1417j5303o1785m4025N2242J9817M4218M2806j5161n2234n2734
$$ -14303 31055 72472 57169 -4616 -48641 3601 23418 67636 110442 95281 43047 -9687
18176i687m3760j4618P0601n119N2699K8145p1542p05J6375J103n541m2858k454
$$ -9687 -53447 -68065 2536 -2583 50116 78261 6719 6014 22389 23492 17951 -24907 -27361
18163b7361l940K9371j870K7237M1836p4650p7594o1107k6391M1469M7092N6089
$$ -27361 -31301 -1930 -3800 23437 65273 -9377 -86971 -148078 -174469 -133000 -85908 -29819
18151b9819m760p2106M0332K3880L9748M5626o2698J3911L2610l6806J03544N140
$$ -29819 -34579 -106685 -66353 -42473 -2725 42901 -19797 -5886 26724 -10082 93462 98602
18139I8602K1521k8644l7232L1817m2211k0487K2835N865l2689L6261j8884o4290
$$ 98602 120123 91479 54247 86064 43853 23366 46201 52066 19377 55638 36754 -27536
18127b7536m9868K5118J5242n1431O780Q3841P3430l1334m3199K1156M6359m8701
$$ -27536 -77404 -52286 -37044 -88475 -81695 2146 75576 44242 1043 22199 68558 19857
18115A9857q1223K5345Q2695m1103l4790j451N2099J3285l6894J5463o807m0412
$$ 19857 -61366 -36021 46674 5571 -29219 -30670 21429 34714 -2180 13283 6476 -33936
18103c3936l262N9936k5258j7895k6978j3748M5896j0919l1587L7926O630m0813
$$ -33936 -37198 22738 -2520 -20415 -47393 -61141 -15245 -26164 -57751 -19825 -13195 -54008
18091e4008n6179j5773r96J2259M5123P2983Q7810M5206L0249k7036j21760k8934
$$ -54008 -110187 -125960 -126956 -114697 -69574 3409 91219 136425 166674 139638 17878 -11056
18079a1056K4652n9537O019J6180K991m6350l81N3737J01302j22o3565l2797N7160
$$ -11056 13596 -45941 -39922 -23742 -20751 -67101 -67482 -13745 87557 87435 23870 -8927 48233
18066D8233L6891l9641k5258L2000l2148l4387N4551J9951R149l0877l5566n8062
$$ 48233 85124 45483 20225 52225 20077 -14310 40241 60192 69341 38464 2898 -55164
18054e5164n48K4912J03822l9562p5811l7360n1196J5836K8622K600M1894j1878
$$ -55164 -55712 -30800 73022 33460 -42351 -79711 -130907 -115071 -86449 -83849 -41955 -53833
18042e3833O790R4044J4571o1159q7438n2486K1704M9419K4858k5969j8452N1293
$$ -53833 -47043 47001 61572 413 -87025 -139511 -117807 -68388 -43530 -69499 -87951 -36658
18030c6658J1933K5897J7786k2877q4759n364N3840N9438n3382n4633M3674j746
$$ -36658 -24725 1172 18958 -3919 -88678 -94042 -40202 19236 -34146 -88779 -45105 -46851
18018d6851m495K4395L7980n0084l5841p397M988L5534k6008K355J9862k9486
$$ -46851 -51346 -26951 11029 -39055 -74896 -82293 -77305 -41771 -67779 -65424 -45562 -75048
18006g5048OK1429K8056R036J3173J9270k1439K3605L4499k8460p5184l1303R277
$$ -75048 -75042 -53613 -25557 -16521 -3348 15922 -5517 18088 52587 24127 -51057 -82360 -73083
17993g3083L2505l93L255j7516m8176J6450P3517q330k9579o388L7612O8185o009
$$ -73083 -40578 -40971 -37716 -55232 -103408 -86958 -13441 -21771 -51350 -57738 -20126 48059 42050
17980D2050K0024J6204k8876k8947J513J2722j7080l6573o6388o334N4419N3888
$$ 42050 62074 78278 49402 20455 21968 34690 17610 -18963 -85351 -91685 -37266 16622
17968A6622m7761J249L914N1279J212n3436o1827k3611K1522R2097j2276l2898
$$ 16622 -31139 -29890 -25976 25303 26515 -26921 -88748 -112359 -90837 1260 -11016 -43914
17956d3914J0523k0710n0017p4861P1983J30239O0438J0143j7246r1495K0730
$$ -43914 -33391 -54101 -104118 -178979 -106996 23243 83681 93824 76578 -14917 5813
17945E813M5073K3776J4672p56n5580p7361k6121k2627Q1431O5133R878M641N128
$$ 5813 50886 74662 89334 88578 32998 -44363 -70484 -93111 -11680 53453 63331 67972 73100
17932G3100n2162o8480K31L3874k0348m3512k9759K7698L4361N2643j0406n5420
$$ 73100 20938 -47542 -47311 -13437 -33785 -77297 -107056 -79358 -44997 7646 -2760 -58180
17920e8180K0668M7042L7603K9485K1019o8058n2031j1566j4850n1291P0986K3809
$$ -58180 -37512 9530 47133 76618 97637 29579 -22452 -34018 -48868 -100159 -29173 -5364
17908e364J6535M8327K3341M073L6541M1662j0128J5767K1332P222M4747J16133
$$ -5364 11171 59498 82839 86912 123453 165115 154987 170754 192086 199308 244055 360188
17896C60188J06119P1492k9530k0593j11581p0741r1215o8170k9945k9463o6449
$$ 360188 466307 537799 508269 487676 376095 305354 214139 145969 116024 86561 20112
17885B0112o0351O1133Q5454j0202m5337l9454N0313J9010j366o1577l1793j671
$$ 20112 -40239 20894 106348 96146 50809 11355 61668 80678 79312 17735 -14058 -15729
17873a5729M1325j273l5345L955o000J707j8516P7124M2133l6205J1078j1298
$$ -15729 25596 24323 -11022 -7067 -13067 -11360 -29876 47248 89381 53176 64254 52956
17861E2956n3585j7427k9584k1252j5803j9411P3234L8813Q712j0863m463k900
$$ 52956 -629 -18056 -47640 -68892 -84695 -104106 -30872 7941 16653 5790 1327 -1573
17849a573m4732r172J5025K2501O937M196L6827o107k2610J4718k7074O6817L9135
$$ -1573 -46305 -55477 -40452 -17951 -11014 -6818 30009 23902 1292 16010 -11064 55753 94888
17836I4888L5475M9244q9013l6396m4082q1923M0196K7428K4997m8049k3377L2027
$$ 94888 130363 179607 90594 54198 10116 -71807 -31611 -4183 20814 -27235 -50612 -18585
17824a8585K1948j628j3488j7245k7766o2646k5283N218O9189R5275k4626r2266
$$ -18585 3363 1735 -11753 -28998 -56764 -119410 -144693 -139475 -70286 24989 363 -91903
17812i1903M9356P5753J1532p8677o2928k2564P7379J16887O2387p1427r2052
$$ -91903 -42547 33206 44738 -33939 -96867 -119431 -42052 74835 137222 65795 -26257
17801b6257o0172K0506J8621P0040k1398p4176M1658M5496K3961m8009n7000j6081
$$ -26257 -86429 -65923 -47302 22738 1340 -72836 -31178 14318 38279 -9730 -66730 -82811
17789h2811l0766K460Q9565N749M507P458p1060n7864M9939N7923K4465O943M6027
$$ -82811 -113577 -111117 -21552 -15803 -11296 -3838 -74898 -132762 -82823 -24900 -435 6508 52535
17776E2535m5890m3886q5503m5397J2173N5953L1513K9663j4132M7984k9465L698
$$ 52535 6645 -37241 -122744 -168141 -155968 -100015 -68502 -38839 -52971 -4987 -34452 -30754
17764c0754k0654J2920r500J0377M7610K5294k7846N3997k8019m1364n6994o2223
$$ -30754 -51408 -38488 -47988 -37611 9999 35293 7447 61444 33425 -7939 -64933 -127156
17752a27156O3539O6615K1160r0756n6711K4178L559k0510K8572P69J3402L4488
$$ -127156 -63617 2998 24158 -66598 -123309 -99131 -95572 -116082 -87510 -86741 -73339 -38851
17740c8851m754J4970N2721k8702o846m6396q4373P9465l9257j063N5745k4793
$$ -38851 -43605 -28635 24086 -4616 -11462 -57858 -142231 -62766 -102023 -103086 -47341 -72134
17728g2134k5510j7925q555K1873L5450K2001K3355L429L1691j7982J9976M331
$$ -72134 -97644 -115569 -124124 -102251 -66801 -44800 -21445 -18016 13675 -4307 15669 20000
17716B0000J5508K81P080o2004n2516j7487o3068k2955Q7281J2349M6487K6607
$$ 20000 35508 35789 42869 -19135 -71651 -89138 -152206 -175161 -87880 -75531 -29044 -2437
17704b437p7726K3066N7079N2702k8970j07609p132N368Q860N0969O282p4920
$$ -2437 -80163 -57097 -18 52684 23714 -83895 -91027 -85659 -76799 -25830 -19548 -94468
17692i4468k1978M1457J3466J4260R643Q130m8808l1842k6961M4504N2324P3111
$$ -94468 -116446 -74989 -61523 -47263 -37620 -29490 -78298 -110140 -137101 -92597 -40273 32838
17680C2838k3872j6737N426n236o0641j5139L1780K0091L0682K9374k9485l2486
$$ 32838 8966 -7771 -2345 -7581 -68222 -83361 -51581 -31490 -808 28566 -919 -33405
17668c3405n5872n7951o7401M2107J10027Q3427L1252k2707P987J8603n4972n968
$$ -33405 -89277 -147228 -214629 -172522 -62495 20932 52184 29477 37464 56067 1095 -4873
17656d873L4519k6759J7706p2831K3765K7764L4315j7090l8530j0658O7583j3627
$$ -4873 29646 2887 20593 -52238 -28473 -709 33606 16516 -22014 -32672 34911 21284
17644B1284k3713J6390l922o4692L5961J2622m3717r4267K1126K8253J9769L4228
$$ 21284 -2429 13961 10039 -54653 -18692 -6070 -49787 -144054 -122928 -94675 -74906 -40678
17632d0678l5498o1124J1901L8004L4382N4560k049K6244k3914j2142k798q5826
$$ -40678 -76176 -137300 -125399 -87395 -53013 1547 -502 25742 1828 -10314 -13112 -98938
17620i8938m9530O1128M5319o791O4817Q0904K6325l9265l6016K8842q0932o2403
$$ -98938 -148468 -87340 -42021 -48812 16005 96909 123234 83969 47953 76795 -4137 -66540
17608f6540j8529P8885J04498k1426l6248n6583m034K5009J678J0149n447q4032
$$ -66540 -85069 -6184 98314 76888 40640 -15943 -19977 5032 6710 16859 11412 -72620
17596g2620j7142M9212L9169K9743m4912J4712K4334O8172L5637m7648j7278j06354
$$ -72620 -89762 -40550 -1381 28362 -16550 -1838 22496 90668 126305 78657 61379 -44975
17584d4975N342O0430L5322j0019J7289L8012R4215J00104N4642M0836P1944J07700
$$ -44975 -39633 20797 56119 46100 63389 101401 195616 295720 350362 391198 463142 570842
17572E70842R8739K6657J7674M5330O138k9985N3808O9811L0908J8861L2566k130
$$ 570842 669581 696238 713912 759242 765380 735395 789203 859014 889922 908783 941349 939219
17560I39219M99K0734N3543J15130M7921O025j13942p2858k9722j09477o6283
$$ 939219 939718 960452 1013995 1129125 1177046 1183071 1069129 996271 966549 857072 790789
17549G90789q5691r4749r2952o5254m1219j1889n55j884k8117o3636l3978k6941
$$ 790789 705098 610349 517397 452143 410924 399035 398480 396596 368479 304843 270865 243924
17537B43924k5331m5982n056j4475K5330J2239N0722o3063n373J6662j808l7345
$$ 243924 218593 172611 167555 153080 178410 190649 241371 178308 172935 189597 187789 150444
17525A50444m0607K6117q809n0250j7151k7686l9572k9099O63O4679n0255p7439
$$ 150444 109837 135954 127145 76895 59744 32058 -7514 -36613 -35950 28729 -21526 -98965
17513i8965j1493k6413O682o566Q6963M5673M0065N8950l3667k3928k154P5031
$$ -98965 -110458 -136871 -130189 -136755 -49792 -4119 35946 94896 61229 37301 35147 110178
17501A10178o7258p9292L4129M141J1191j8706n0644j3095J4235J634k2072k6595
$$ 110178 42920 -36372 -2243 1898 13089 -5617 -56261 -69356 -55121 -53487 -75559 -102154
17489a02154L3946k7940m1431o586K8833K1573n0399Q294J0256m3315K6686Q7943
$$ -102154 -68208 -96148 -137579 -144165 -115332 -93759 -144158 -135864 -125608 -168923 -142237 -54294
17477e4294M0703n0181j6687K2765M3293j4530K7761P4662n3048k1310N2034r168
$$ -54294 -13591 -63772 -80459 -57694 -14401 -28931 -1170 73492 20444 -866 51168 42000
17465D2000k0742l4015J7158J3364K5065k834n4247l5545n4766K0056l362J3844
$$ 42000 21258 -12757 4401 17765 42830 39996 -14251 -49796 -104562 -84506 -87868 -74024
17453g4024M6458P8968k852o268o216p2769p9439j2372M3747L1750L5090m1704
$$ -74024 -27566 51402 48550 42282 36066 -36703 -116142 -128514 -84767 -53017 -17927 -59631
17441e9631P993J975r688K7388L3874J7586l5460j5062r191m055M6178j0813l823
$$ -59631 -51638 -49663 -59351 -31963 1911 19497 -15963 -31025 -40216 -44271 1907 -8906 -12729
17428a2729k751K4243n1932r0681k3380L2494J6045O5435K7086L5276j5647j6392
$$ -12729 -15480 8763 -43169 -133850 -157230 -124736 -108691 -43256 -16170 19106 3459 -12933
17416a2933J3913k0296L1167j7477j5525P171p034k7825l2931L4813J3108k1006
$$ -12933 980 -19316 11851 -5626 -21151 -13980 -21014 -48839 -81770 -46957 -33849 -54855
17404e4855j5778M0987j6317R418O3856J11802J9625j08009k8875k1542o1546
$$ -54855 -70633 -29646 -45963 -36545 27311 139113 158738 50729 21854 312 -61234
17393f1234n743p740N302K4603J2761o3414J2105O1961q980l9846p4489L4583
$$ -61234 -66977 -74717 -69415 -44812 -32051 -95465 -83360 -21399 -30379 -70225 -144714 -110131
17381a10131l2856Q4202J8649M7437M0201K5497L8191k0689l1463k0143L3493
$$ -110131 -142987 -58785 -40136 7301 47502 72999 111190 90501 59038 38895 72388
17370G2388r050l1851l697J182j9138j1829L133l2857o5772K8889L2587R7321
$$ 72388 63338 31487 27790 28972 9834 -1995 1138 -31719 -97491 -68602 -36015 61306
17358F1306J0025q157K185q997o1208k6563N677O4201m6728r439l833M177J6861
$$ 61306 71331 63174 65359 56362 -4846 -31409 -25732 38469 -8259 -17698 -21531 -17354 -493
17345d93L4372l170K5823K6892j4529k98m6018k4349o4576K2001O9777K8345K1619
$$ -493 33879 30709 56532 83424 68895 68597 22579 -1770 -66346 -44345 25432 53777 75396
17332G5396k319m9578K530k791J3303L2279K3691k2725o3568j5409p1313J9031
$$ 75396 73077 23499 26029 23238 36541 68820 92511 69786 6218 -9191 -80504 -61473
17320f1473P7142l2091k6964k1167O57Q161M000J8150j1846j8416L4157M5070
$$ -61473 15669 -16422 -43386 -64553 -63896 -55735 -51735 -33585 -45431 -63847 -29690 15380
17308A5380P734o6018L4283J10600p1872r8393K2636M6452Q4895P7238L0669n5827
$$ 15380 23114 -42904 -8621 101979 30107 -68286 -45650 802 85697 162935 193604 137777
17296A37777l3438N8926L2498n1337j31041l4490m1124J4988Q2693M7654m2125
$$ 137777 104339 163265 195763 144426 13385 -21105 -62229 -47241 35452 83106 40981
17285D0981o7424j7710L8407k8996j1627k180l838K7329k6293L3441M4372j6283
$$ 40981 -26443 -44153 -5746 -34742 -46369 -48549 -52387 -25058 -51351 -17910 26462 10179
17273A0179K2970M7516J4044J2125k6314m9973O4095M6389n716m9422j7310K2944
$$ 10179 33149 80665 94709 106834 80520 30547 94642 141031 135315 85893 68583 91527
17261I1527L2902p5339J6771J0868K8322J6881k5944m3382n3990K916J02639P7279
$$ 91527 124429 49090 65861 76729 105051 121932 95988 52606 -1384 1532 104171 181450
17249A81450n1020l7160k1440n157l6820K9540L9739p2582K584l274k9826P7667
$$ 181450 130430 93270 71830 66673 29853 59393 99132 26550 29134 25860 -3966 73701
17237G3701K7646k0150L15L2244L4924m5708j4480m5788K5188O6779j8416n9686
$$ 73701 101347 81197 81512 113756 148680 102972 88492 42704 67892 134671 116255 56569
17225E6569k8409R40M3185l52L6944K7187j9508l8385k4345j0757M6461N8414
$$ 56569 28160 29100 72285 71933 108877 136064 116556 78171 53826 43069 89530 147944
17213A47944O684l6218L695J1071M6999n9805q896k4214j8813O025L5903j5127
$$ 147944 154628 118410 122105 133176 180175 120370 111474 87260 68447 74472 110375 95248
17201I5248n8824J6357k0564J05076k3383m8204K9622O1657m463J3763k3338j6367
$$ 95248 36424 52781 32217 137293 113910 65706 95328 156985 152522 166285 142947 126580
17189A26580l4856j6878k6582o274n793L74O0665N0250j4827L6123m4505M5117
$$ 126580 91724 74846 48264 41990 36197 36571 97236 147486 132659 168782 124277 169394
17177A69394J6973L612q622j3675n5551l3350K0752L8930p229l3477k4129L877
$$ 169394 186367 189979 181357 167682 112131 78781 99533 138463 131234 97757 73628 77505
17165G7505p9061o3258R7555L9381J9321L747J7876j2022q110l8262l1250M85
$$ 77505 -1556 -64814 32741 72122 91443 95190 113066 101044 92934 54672 23422 23907
17153B3907N7455L5925L603j02301N138N3409L7419k466N155J8771l1430k8493
$$ 23907 81362 117287 120890 18589 23727 77136 114555 112089 117244 136015 104585 76092
17141G6092q415N3891K5017l4165J5223K679J005R46o948o6358k7711K7909R2285
$$ 76092 67677 121568 146585 112420 127643 130322 131327 132273 125325 58967 31256 59165 151450
17128A51450J4746m3029R589n6625n0023J8126N1526m3307l0594l2756O3442M7972
$$ 151450 166196 123167 132756 76131 26108 44234 95760 52453 21859 -10897 52545 100517
17116A00517l24N2214L8339K7651j862J0738J415k5493K3979j7454q3883n9692
$$ 100517 100193 152407 190746 218397 216535 227273 228688 203195 227174 209720 125837 66145
17104F6145O582p499J4777o761j8811N1209M4469J8727k2930P09J7828q7176q6377
$$ 66145 72727 65228 80005 73244 54433 105642 150111 168838 145908 146617 164445 77269 -9108
17091i108O6198J17446J0003o797l1292k9883L9939j503j4448M4081j3850k814
$$ -9108 57090 174536 184539 177742 146450 116567 156506 155003 140555 184636 170786 167972
17079A67972k7316m3181o4062o986P2246P8019j7280n7424O824K7074J8611j5407
$$ 167972 140656 97475 33413 26427 98673 176692 159412 101988 108812 135886 154497 139090
17067A39090L7124j7728l0245j0025K650J9629j3633m2540m3046K1398N3472N7414
$$ 139090 176214 158486 128241 118216 120866 140495 126862 84322 41276 62674 116146 173560
17055A73560J7459n495k5698j5911k7041m023k6749l3959J6271N4999P0500J0597
$$ 173560 191019 185524 159826 143915 116874 112851 86102 52143 68414 123413 193913 204510
17043B04510k7101l1697N754O788J0140J4724k9776k4410O6927L999l0404k0530
$$ 204510 177409 145712 151466 158254 168394 183118 153342 128932 195859 199858 169454 148924
17031A48924N0561O740n6069l6260R609J7864N4390K5647M290n7361n9852J0803
$$ 148924 199485 206225 150156 113896 123505 141369 195759 221406 225696 168335 108483 119286
17019A19286j2166l455k8508L443L4692M9038J8196K9959J5464J2481N9486l2337
$$ 119286 107120 103665 75157 78600 113292 162330 180526 210485 225949 238430 297916 265579
17007B65579l1752l1521p901P6569L0608m3740m2812n4873k7826l2826J5063O6911
$$ 265579 233827 202306 194405 270974 301582 257842 215030 160157 132331 99505 114568 181479
16995A81479J56340O7838p6747j01723l4174J7983L1585p373k0121n1715q3159
$$ 181479 337819 405657 328910 227187 193013 210996 242581 235208 215087 163372 80213
16984H0213m292J9373N9416J01297M0651n7541l6886n128k9195K6094O061j8479
$$ 80213 75921 95294 154710 256007 296658 239117 202231 197103 167908 194002 200063 181584
16972A81584J7408m441j6077K82K8687k9685n8674l2448j5965M4985Q8673M7361
$$ 181584 198992 194551 178474 178756 207443 177758 119084 86636 70671 115656 204329 251690
16960B51690O6188J0695L2700l0447j8202o6380k4226q1759O866r457K673J6308
$$ 251690 317878 328573 361273 330826 312624 246244 222018 140259 147125 137668 140341 156649
16948A56649Q218l3790L7996J7436k9199L6051L7415o4907n3754N7065P0279r6264
$$ 156649 164867 131077 169073 186509 157310 193361 230776 165869 112115 169180 239459 143195
16936A43195M3009J1745m7000Q350K6004J234m5370K0027k286J151P83m3695k8068
$$ 143195 186204 197949 150949 159299 185303 186537 141167 161194 158908 160059 160842 117147 89079
16923H9079m4599M8927N6300L3882L2542M6381M4885j4468o8408o6785l1491l1103
$$ 89079 44480 93407 149707 183589 216131 262512 307397 292929 224521 157736 126245 95142
16911I5142J9568k9944M643K8691j071K6356K3298k4032n336l208N3580J2358
$$ 95142 114710 84766 89409 118100 117029 143385 166683 142651 137315 134107 187687 200045
16899B00045l3492m504K7402n2321p0597K91N9336J1428m8808l6270J7971Q356
$$ 200045 166553 162049 189451 137130 66533 66824 126160 137588 88780 52510 70481 78837
16887G8837N9620k326O772M5408J4830k9051J8511N8961k8831o2304J3414l1237
$$ 78837 138457 136131 142903 188311 203141 174090 192601 251562 222731 160427 173841 142604
16875A42604l7383L6761N9811k2867q620Q724j9689n9151r362N0068Q9073k6544
$$ 142604 105221 141982 201793 178926 170306 179030 159341 100190 90828 140896 229969 203425
16863B03425q3996l5620j5755o15L7556k5336K0951N9381j9819o4322q708j0181
$$ 203425 119429 83809 68054 67439 104995 79659 100610 159991 140172 75850 67142 56961
16851E6961R882k4628J9417Q0139M1802l4076l2006o605p090j8326l2989O787
$$ 56961 66843 42215 61632 141771 183573 149497 117491 110886 103796 85470 52481 59268
16839E9268P4669L2789m840m8717n6469n7269K595N2165L9535k614r200k0488
$$ 59268 133937 166726 161886 113169 56700 -569 2026 54191 93726 91112 81912 61424
16827F1424K7228j0317j1993l7436J302n0518J9435P0752j3922m4159k5759n0262
$$ 61424 88652 78335 66342 28906 30208 -20310 -875 69877 55955 11796 -13963 -64225
16815f4225M3613Q5518Q0894P1202m694o3592q4081L6586P1076N0132l3395q4186
$$ -64225 -20612 64906 145800 217002 212308 148716 64635 101221 172297 222429 189034 104848
16803A04848j7457o0284n4953O1819N3359K9794M3756j7936j6119p6212o038O8478
$$ 104848 87391 27107 -27846 33973 87332 117126 160882 142946 126827 50615 44577 113055
16791A13055m8425O25l5984r557N5137k0198j6764k195J7798K9916k299M3128
$$ 113055 64630 65255 29271 19714 74851 54653 37889 35694 53492 83408 81109 124237
16779A24237K8096m4615l4856j1941L5958l2548O179p7312k9703O0952J8441L8666
$$ 124237 152333 107718 72862 60921 96879 64331 70510 -6802 -36505 24447 42888 81554
16767H1554L4516q5252q8927K8223j9250j0182P6325M5376L2122l7299o149m0912
$$ 81554 116070 30818 -58109 -29886 -49136 -59318 17007 62383 94505 57206 51057 10145
16755A0145K325o115n9849J9693K1742M149K4197L0963j7250l1994K1957N0264
$$ 10145 12470 6355 -53494 -33801 -12059 -7910 16287 47250 30000 -1994 19963 70227
16743G0227o8714l6535M0556M0761J7149m3827o2324L4522k5828l5928Q8825P1464
$$ 70227 1513 -35022 5534 46295 63444 19617 -42707 -8185 -34013 -69941 18884 90348
16731I0348O680l3689M0810P5154j222q9961l7185R644q217r9026o2376J1139
$$ 90348 97028 63339 104149 179303 178081 88120 50935 60579 52362 -46664 -109040 -97901
16719i7901P2733L6417R354J7009M7484m885o3657k9961o5661L2197k8501P3603
$$ -97901 -25168 11249 20603 37612 85096 80211 16554 -13407 -79068 -46871 -75372 -1769
16707a769O796m2364j461L3394O2091Q147K946j9902m1167J8315J3815J5430m5374
$$ -1769 5027 -37337 -38798 -5404 56687 64834 67780 47878 6711 25026 38841 54271 8897
16694H897l8072k6783O2829R1943k879o619n0578j9020K6865J3754l7539n1957
$$ 8897 -29175 -55958 6871 98814 95935 89316 38738 19718 46583 60337 22798 -29159
16682b9159k4512j625m6148P16L4196L977o41M0454P1588K5880J3809R3097j0406
$$ -29159 -53671 -55296 -101444 -100728 -66532 -62555 -63196 -22742 48846 74726 88535 181632 171226
16669A71226k0163p9074k4611l2207j3863J9568j2848k2835M4422M8725L0487
$$ 171226 151063 71989 47378 15171 1308 20876 8028 -14807 29615 78340 108827
16658A08827j5912l3352l6306J2981J5864l3882k0877j1601k115J9722J5711N5523
$$ 108827 92915 59563 23257 36238 52102 18220 -2657 -14258 -16373 3349 19060 74583
16646G4583M567l0944m7135p0941M4777N5498j4391j3304N763n3947o5462M6737
$$ 74583 79150 48206 1071 -69870 -25093 30405 16014 2710 8473 -45474 -110936 -64199
16634f4199N0245j7447n9460J1314J14598O7065m5916n8055M2405r25j4801k0713
$$ -64199 -13954 -31401 -90861 -79547 35051 102116 56200 -1855 40550 39625 24824 4111
16622D111j687J9924j4939K8688l4924l9827m7223M2912P9051m4551n3931o9138
$$ 4111 2424 22348 7409 36097 1173 -38654 -85877 -42965 36086 -8465 -62396 -131534
16610a31534n4391N8724J58324O1009k3618k2329L0735L1725L770p5136j03042
$$ -131534 -185925 -127201 31123 92132 68514 46185 76920 108645 112415 37279 -65763
16599f5763k6188J7090L0703K1180k5268k9675L3573J23833j3267l0008j6893
$$ -65763 -91951 -74861 -44158 -22978 -48246 -77921 -44348 79485 66218 36210 19317
16588A9317o6628r334L533N8855O019l8600L0984N1793l0037o0143P497J025m502
$$ 19317 -47311 -56645 -53112 5743 11762 -26838 4146 55939 25902 -34241 -26744 -25719 -30221
16575c0221K0301K5100K2364j4854j04606j03048l4833J65244N3782p7705J172
$$ -30221 -9920 15180 37544 22690 -81916 -184964 -219797 -54553 -771 -78476 -77304
16564g7304R8907J1900J0573j187l441L3089j3941j2069K3478O045l6568p0503
$$ -77304 21603 33503 44076 42889 39448 72537 58596 46527 70005 76050 39482 -31021
16552c1021l6717O50K9566L403K8600K479J4931O9270j3183L7940q0609o1744
$$ -31021 -67738 -67088 -37522 -34119 -5519 -3040 11891 81161 67978 105918 25309 -36435
16540c6435j419l2932K6538PN2796K1941r470o8157J6578J0202L8125j9109j2440
$$ -36435 -37854 -70786 -44248 -44241 8555 30496 21026 -47131 -30553 -20351 17774 -1335 -13775
16527a3775J8302j3321l8147J2931J4680K6017j9388m3447l3490j1371N6257K3771
$$ -13775 4527 -8794 -46941 -34010 -19330 6687 -12701 -56148 -89638 -101009 -44752 -20981
16515b0981K2868m121M4987K4589k3285R86j6695k5154p282j2503j8477j4290
$$ -20981 1887 -2234 42753 67342 44057 45043 28348 3194 -4088 -16591 -35068 -49358
16503d9358R02J4406M1708N6808k8569k9385n6530k3097M3388K3725M9407o1002
$$ -49358 -48456 -34050 7658 64466 35897 6512 -50018 -73115 -29727 -6002 43405 -17597
16491a7597p3629l9154j8906k637J5565j1893J5603P1535o285n2918M4881M0485
$$ -17597 -91226 -130380 -149286 -151923 -136358 -148251 -132648 -61113 -67398 -120316 -75435 -34950
16479c4950o4384M1763J83827L6670o5308j29663p0606O9101J5847N270P91j9958
$$ -34950 -99334 -57571 126256 162926 97618 -32045 -102651 -33550 -17703 -12433 -11642 -31600
16467c1600j6052N358L8439j2437l344m8066j01183m0378O4064K4727K5903M5838
$$ -31600 -47652 -42294 -3855 -16292 -19636 -67702 -168885 -209263 -145199 -120472 -94569 -48731
16455d8731j1788k8599j7127j7354K2237M6368K6631k9353j7382M5420j6944j7404
$$ -48731 -60519 -89118 -106245 -123599 -101362 -54994 -28363 -57716 -75098 -29678 -46622 -64026
16443f4026J8851M3339q986N473q2965o1216j55J9356J1758M2734O0496m8379
$$ -64026 -45175 -1836 -10822 -5349 -88314 -149530 -149685 -130329 -118571 -75837 -15341 -63720
16431f3720n3577K6080J3306K7271l1399L0723L2789R017O6952k2041n2467m0985
$$ -63720 -117297 -91217 -77911 -50640 -82039 -51316 -18527 -9510 57442 35401 -17066 -58051
16419e8051L2997L6579j2312J4423k5409r7613J0663M1977M456K0875m2109m4624
$$ -58051 -25054 11525 -787 13636 -11773 -109386 -98723 -56746 -52290 -31415 -73524 -118148
16407a18148j471k5505k0458l584L9904M7164O1004K1026j0042q830j2224M4349
$$ -118148 -119619 -145124 -165582 -169166 -129262 -82098 -21094 -68 -10110 -18940 -31164 13185
16395A3185j9030K2832o537j5221p5377j5188R778N4479M584q3826K3766J1497
$$ 13185 -5845 16987 10450 -4771 -80148 -95336 -85558 -31079 -26495 -110321 -86555 -75058
16383g5058M737k6420K7008Q756m2366m1247L2039Q9100L0784o5960m2911l6552
$$ -75058 -70321 -96741 -69733 -60977 -103343 -144590 -112551 -23451 7333 -58627 -101538 -138090
16371a38090P720Q1566J8923j7837k8819N0592L0754O623k2803l0102K086K2568
$$ -138090 -130370 -48804 -29881 -47718 -76537 -25945 4809 11432 -11371 -41473 -39387 -16819
16359a6819M6965L2549j5297l7089R886j5257j6388l0376J9254J600j4848M1132
$$ -16819 30146 62695 47398 10309 20195 4938 -11450 -41826 -22572 -20972 -35820 5312
16347E312k8899l8775J8857J6834q8658n67L7509p929k4945k7321N6441Q7174
$$ 5312 -23587 -62362 -43505 -26671 -115329 -115896 -78387 -86316 -111261 -138582 -82141 5033
16335E033L6267l1946J958R774l4915k17O35l8971M3867J3343j5887K5010L3477
$$ 5033 41300 9354 11312 21086 -13829 -14046 -13411 -52382 -8515 4828 -11059 13951 47428
16322D7428l352j3568k4361L9046l1280j2611n446j1225J8633n215k8413Q440
$$ 47428 44076 30508 6147 45193 13913 1302 -4144 -15369 3264 -1951 -30364 -21924
16310b1924p915l569k6356P2056J5402l6663R975m600r884J1147M6327J0945k5697
$$ -21924 -29839 -33408 -59764 12292 27694 -8969 1006 -3594 -13478 -2331 43996 54941 29244
16297B9244j4594n4504q7021M9323R8808K8047n2117n8297p3071N7769J7603r2281
$$ 29244 14650 -39854 -126875 -77552 21256 49303 -2814 -61111 -134182 -76413 -58810 -151091
16285a51091m705K3680L5788P5661k362Q6830N1062j7829k6225o2516n2121K8948
$$ -151091 -155796 -132116 -96328 -20667 -23029 63801 114863 97034 70809 8293 -43828 -14880
16273a4880P2274k9869p9580n2694M6055Q2733K3322o1668o3034J0667L9072k20
$$ -14880 57394 27525 -52055 -104749 -58694 24039 47361 -14307 -77341 -66674 -27602 -27822
16261b7822J5107j941j05902K9564M2241m4850m9768L0821L6784j2997l2715Q7160
$$ -27822 -12715 -14656 -120558 -90994 -48753 -93603 -143371 -112550 -75766 -88763 -121478 -34318
16249c4318O3532p027o3570J5018M5478L198m7891K3508p5613n3091k8447N9128
$$ -34318 29214 22187 -41383 -26365 19113 22311 -25580 -2072 -77685 -130776 -159223 -100095
16237a00095Q568K318J5399j3588l4597K1852L6176J0039L5341J9154L5533j0195
$$ -100095 -91527 -89209 -73810 -87398 -121995 -100143 -63967 -53928 -18587 567 36100 25905
16225B5905q5822n3436J2842N8934m5730n1092M464J2929O9624k0009K7328Q1660
$$ 25905 -59917 -113353 -100511 -41577 -87307 -138399 -133935 -121006 -51382 -71391 -44063 37597
16213C7597k286J5260M329r031k5543m9452m4425K5349j1506J0305k3987l2274
$$ 37597 35311 50571 54900 45869 20326 -29126 -73551 -48202 -59708 -49403 -73390 -105664
16201a05664N0779M4606k6973n8697m3698K9588J7703k0151K5509J0906p144K0132
$$ -105664 -54885 -10279 -37252 -95949 -139647 -110059 -92356 -112507 -86998 -76092 -83236 -63104
16189f3104Q4074L838n9632k7393J6772M4614J6933J210k3038l004k5491M9239
$$ -63104 20970 24808 -34824 -62217 -45445 -831 16102 17312 -5726 -8730 -34221 15018
16177A5018l3595k7621K70N8747l4515r3970j7227J4875j6118J1264J1400p231
$$ 15018 -18577 -46198 -45928 12819 -21696 -115666 -132893 -118018 -134136 -122872 -111472 -118703
16165a18703M394j3185K7255O5917k478m0207l6027K6517O3444j4060K4003J613
$$ -118703 -114309 -127494 -100239 -34322 -36800 -77007 -113034 -86517 -23073 -37133 -13130 -11517
16153a1517j5516l372j5383N1j6405L2738j03m3190N300Q4724j9063j6359n7556
$$ -11517 -27033 -30405 -45788 -45737 -62142 -29404 -29507 -72697 -67397 17327 -1736 -18095 -75651
16140g5651r4741q8859K4843Q1019j6857J7989J4529P547K2713L1469Q3766L0107
$$ -75651 -170392 -259251 -234408 -153389 -170246 -152257 -137728 -130181 -107468 -75999 7767 37874
16128C7874j7878j5701K4285J4148k037n0816L1547l2890k5507j299J2749K7686
$$ 37874 19996 4295 28580 42728 40691 -10125 21422 -11468 -36975 -38274 -25525 2161
16116B161m2349l2385N0201k7147o4004K2555L9739L958l2796L9443J9019k5304
$$ 2161 -40188 -72573 -22372 -49519 -113523 -90968 -51229 -47271 -80067 -40624 -21605 -46909
16104d6909j16723r1919K0953J15434m155M4997j4932j7052K2935M2113K9640
$$ -46909 -163632 -255551 -234598 -119164 -123319 -78322 -93254 -110306 -87371 -45258 -15618
16093a5618p2558J4236O8367l1053j112p0012J273J01063L9041q4975m0635L4509
$$ -15618 -88176 -73940 -5573 -36626 -37738 -107750 -106477 -5414 33627 -51348 -91983 -57474
16081e7474J0176k6082k4069J1824M8331K4111j0840l1955j1512J8391m8867L330
$$ -57474 -47298 -73380 -97449 -85625 -37294 -13183 -24023 -55978 -67490 -49099 -97966 -94636
16069i4636q617K6028L118q1292k4550P296Q6452K6987o6429q78J0429L7585K0835
$$ -94636 -103253 -77225 -74107 -155399 -179949 -172653 -86201 -59214 -125643 -126521 -116092 -78507 -57672
16056e7672n6013n9363K3257L3044J4057L5j2536N037l8993n6787N8916K1166
$$ -57672 -113685 -173048 -149791 -116747 -102690 -102655 -115191 -110154 -149147 -205934 -147018 -125852
16044a25852o0526l2441P6147J03375J812L0967j7947j5152l286m6436n2879J1385
$$ -125852 -186378 -218819 -142672 -39297 -37485 -6518 -24465 -39617 -42903 -89339 -142218 -130833
16032a30833m336n6027J7316N6253L2247l65o512N9298L3058p514r0026k7842
$$ -130833 -135169 -191196 -173880 -117627 -85380 -85745 -92257 -32959 99 -7415 -97441 -125283
16020a25283p506l3729M3921n389L9259N9320J05560L0942l0086j3329r2970m1940
$$ -125283 -132789 -166518 -122597 -127986 -88727 -29407 76153 107095 77009 63680 -29290 -71230
16008g1230J0877N8143o0680p3427n8038O0698K2385K5938M6913M407o3779M1856
$$ -71230 -60353 -2210 -62890 -136317 -194355 -133657 -111272 -85334 -38421 -34014 -97793 -55937
15996e5937L0890M8967q317m255n1594k7325J9672k9216m9847P472M9307K7918
$$ -55937 -25047 23920 15603 11348 -40246 -67571 -47899 -77115 -126962 -119490 -70183 -42265
15984d2265m5037K1028K2025l8143n450l8340o1536j934P2608P4029M3929O224
$$ -42265 -87302 -66274 -44249 -82392 -87842 -126182 -187718 -189652 -117044 -43015 914 7138
15972G138q162j3965j3895j2203l2308o1968K3319N3960p0381o4734m4933J6747
$$ 7138 -1024 -14989 -28884 -41087 -73395 -135363 -112044 -58084 -128465 -193199 -238132 -221385
15960b21385M1523P1425P6164j6942J993l2154K813K3101o056J7886j4349l8773
$$ -221385 -179862 -108437 -32273 -49215 -47222 -79376 -76563 -53462 -59518 -41632 -55981 -94754
15948i4754m6416P7816R1387P001p3445o6357m242Q703k1366J0397N079N1599
$$ -94754 -141170 -63354 28033 35034 -38411 -104768 -109010 -100307 -121673 -111276 -106197 -54598
15936e4598N2205j0559j0348J5754M382m1336o1955J4084j2155p8001L8674N9081
$$ -54598 -2393 -12952 -23300 -7546 -3164 -44500 -106455 -92371 -104526 -182527 -143853 -84772
15924h4772K5800J6127o377r325l0398l3961L5594O5241l173L4j9709m1138j315
$$ -84772 -58972 -42845 -49222 -58547 -88945 -122906 -87312 -22071 -25244 -25210 -44919 -86057 -87372
15911h7372m9925N134j3039N8539K4714m0450k641P2908k1244j7910j4360j1601
$$ -87372 -137297 -132163 -145202 -86663 -61949 -102399 -105040 -32132 -53376 -71286 -85646 -97247
15899i7247K7902K2674p0851k5088N339j1775k6233k0774j627K4110K5696k5431
$$ -97247 -69345 -46671 -117522 -142610 -137271 -149046 -175279 -196053 -197680 -173570 -147874 -173305
15887a73305J5396k4054N3689J7459m6737K8176K8792N807Q763l6523O541K4954
$$ -173305 -157909 -181963 -128274 -110815 -157552 -129376 -100584 -94777 -86014 -122537 -115996 -91042
15875i1042M5189K3412l5620p4528n8404k6806P9837M5520M304N8663L1298m7627
$$ -91042 -45853 -22441 -58061 -132589 -190993 -217799 -137962 -92442 -88138 -29475 1823 -45804
15863d5804l9781J0653r676m7622N7078M6395M4427L1398n808j0402o36j11949
$$ -45804 -85585 -74932 -84608 -132230 -75152 -28757 15670 47068 41260 30858 30222 -81727
15851h1727L6440m6823l2110J2814P134R677l3445K1061M2408k3605l8896L4585
$$ -81727 -45287 -92110 -124220 -111406 -104272 -94595 -128040 -106979 -64571 -88176 -127072 -92487
15839i2487P450J1191J9501L6743k0196j3737K4381j7996K8733P0610k3763J7552
$$ -92487 -85037 -73846 -54345 -17602 -37798 -51535 -27154 -45150 -16417 54193 30430 47982
15827D7982l7225k3479k7594k0518L5670l7242J8344Q1160L0289o1540r2296o2471
$$ 47982 10757 -12722 -40316 -60834 -25164 -62406 -44062 37098 67387 5847 -86449 -148920
15815a48920n9818J2760K1212K6340L9489l520L2519R541P116k250k6844M431
$$ -148920 -208738 -195978 -174766 -148426 -108937 -112457 -79938 -70397 -63281 -65531 -92375 -87944
15803h7944J9431J9959n700k9744P355K0733K6515l3768M204m0297l882L9792
$$ -87944 -68513 -48554 -54254 -83998 -76643 -55910 -29395 -63163 -58959 -99256 -103138 -63346
15791f3346L362J3003p8748N3097k6927o154J1766J16905p804m1232K848m4932
$$ -63346 -59984 -46981 -125729 -72632 -99559 -105713 -93947 22958 15154 -26078 -23230 -68162
15779f8162m0867m7346J0047L3015P274j0831l0303m1520j4116J0020k9227Q4940
$$ -68162 -109029 -156375 -146328 -113313 -106039 -116870 -147173 -188693 -202809 -192789 -222016 -137076
15767a37076J00923N3121j5677l8620K2112p9984j23036P3740J24668J0958m0991
$$ -137076 -36153 16968 1291 -37329 -15217 -95201 -218237 -144497 -19829 -8871 -49862
15756d9862K5657K1358k2703J932N322M1415j5286m1734j4047K0617j2956m405
$$ -49862 -24205 -2847 -25550 -23618 -18296 23119 7833 -33901 -47948 -27331 -40287 -44692
15744d4692o4285J5442j6939j7170p525M6593k6360k8376K9700l3260n1231k1770
$$ -44692 -108977 -93535 -110474 -127644 -135169 -88576 -114936 -143312 -113612 -146872 -198103 -219873
15732b19873J8253P4234J02593n283p8188p9206L387K5045L2102L3466p752J3018
$$ -219873 -201620 -127386 -24793 -30076 -108264 -187470 -184083 -159038 -126936 -93470 -101222 -88204
15720h8204o311M2421J9652M9830P193J6597o603o5242J4713L4570q2054k3430
$$ -88204 -94515 -52094 -32442 17388 24581 41178 34575 -30667 -15954 18616 -63438 -86868
15708h6868M3963J3495L8511l2983j6993J5738O0338l6109j05242J6889P2559
$$ -86868 -42905 -29410 9101 -23882 -40875 -25137 35201 -908 -106150 -89261 -16702
15697a6702J2940p392J7923J756j7339N342M6535M3756k1363K8232p576m7975
$$ -16702 -3762 -11154 6769 8525 -8814 -3472 43063 86819 65456 93688 86112 38137
15685C8137m7553m1986m2461M5238k041J8647p752j2236m1537l8897m168l9602
$$ 38137 -9416 -51402 -93863 -48625 -50666 -32019 -39771 -52007 -93544 -132441 -136609 -176211
15673a76211K395N2677J4267J0652J7189J9936j3484N4374N8181k5611m4858Q304
$$ -176211 -173816 -121139 -106872 -96220 -79031 -59095 -72579 -18205 39976 14365 -30493 -22189
15661b2189J2945l3934O4359K3234q4432K9167J8139j404k2541p046L203q2109
$$ -22189 -9244 -43178 21181 44415 -40017 -10850 7289 5885 -16656 -23702 -20499 -102608
15649a02608K629M1668m9992o3862M1134L6991N8115Q129k7829l7165m281k4836
$$ -102608 -99979 -58311 -108303 -172165 -131031 -94040 -35925 -27796 -55625 -92790 -97071 -121907
15637a21907m2489m4785M7265L136M9677K0081j0343Q034K6745K2584J4121j0035
$$ -121907 -164396 -209181 -161916 -158780 -109103 -89022 -99365 -91331 -64586 -42002 -27881 -37916
15625c7916J7869l1668j545l5491L4966m1087r598K8574K5671O9328m3119n8121
$$ -37916 -20047 -51715 -53260 -88751 -53785 -94872 -104470 -75896 -50225 19103 -24016 -82137
15613h2137m3573j0724N2900K653L6902J05570M422m5771L900J3262o3843J661
$$ -82137 -125710 -136434 -83534 -80881 -43979 61591 66013 20242 24142 37404 -26439 -24778
15601b4778O2557k990O802m0189k8245j9256k8626P1484l7340j462O1700L954
$$ -24778 37779 34789 41591 1402 -26843 -46099 -74725 -3241 -40581 -42043 19657 23611
15589B3611n075o2225j5224K0745O0490M3020o3673o2292n2325N906J3380M4189
$$ 23611 18536 -43689 -58913 -38168 22322 65342 1669 -60623 -112948 -107042 -93662 -49473
15577d9473Q342n5480l3254p906K3506L1936K9430N4848m2888r8724L2513J9372
$$ -49473 -41131 -96611 -129865 -137771 -114265 -82329 -52899 1949 -40939 -139663 -107150 -87778
15565h7778r066q072k2432J03479m4157l4659M46l1353M7853M3830L5681k8456
$$ -87778 -96844 -104916 -127348 -23869 -68026 -102685 -102239 -133592 -85739 -41909 -6228 -34684
15553c4684n0051M4686P012m778P066j0787N7945n517m5753k8816j471K0483J6266
$$ -34684 -84735 -40049 -33037 -37815 -30749 -41536 16409 10892 -34861 -63677 -65148 -44665 -28399
15540b8399j719p942k40K3656l1928P241j0352m13m8444k5227O2853J3926L186
$$ -28399 -30118 -38060 -38300 -14644 -46572 -39331 -49683 -50096 -98540 -123767 -60914 -46988 -43802
15527d3802k842M5454N6341n1694j9615k7098K630n326K448P5204J9011n646m0991
$$ -43802 -46644 -1190 55151 3457 -16158 -43256 -40626 -45952 -43504 31700 50711 45065 4074
15514D074o783k8202j638L1031J0098k6077j9894K8527j5884n1683j2115j0428
$$ 4074 -2709 -30911 -32549 -1518 8580 -17497 -37391 -8864 -24748 -76431 -88546 -98974
15502i8974j0654M631R129K2821L4119K4742M2013j7947m3143L2235j8630l4367
$$ -98974 -109628 -104997 -95868 -73047 -38928 -14186 27827 9880 -33263 -1028 -19658 -54025
15490e4025M0428K4969J6231J1483j2142l9010p3642k7218N5752R1236L3016K1641
$$ -54025 -13597 11372 27603 39086 26944 -12066 -85708 -112926 -57174 34062 67078 88719
15478H8719m4946m4119p9132M5583N0837J919k2481l1086R144q3032l6821L8929
$$ 88719 43773 -346 -79478 -33895 16942 18861 -3620 -34706 -25562 -108594 -145415 -106486
15466a06486L989l4053k8384J9087k8169K0428N0329M5872R85J9749L2780M1794
$$ -106486 -102497 -136550 -164934 -145847 -174016 -153588 -103259 -57387 -56402 -36653 -3873 37921
15454C7921M521l5132n6635m9734M5419L0412l4014K8574K2666K90l4237L002
$$ 37921 42442 7310 -49325 -99059 -53640 -23228 -57242 -28668 -6002 -5712 -39949 -36947
15442c6947L3350M0581p025p604Q407j2111r5536j0804K2492l6465M1264N3514
$$ -36947 -3597 36984 29959 22355 30762 18651 -76885 -87689 -65197 -101662 -60398 -6884
15430f884J9251r130M1691l5672l3488J4053R512M985l3562n4828L1176r109J7186
$$ -6884 12367 3237 44928 9256 -24232 -10179 -667 4318 -29244 -84072 -52896 -62005 -44819
15417d4819k2493m4959K5037q908K3672J8900j606k0120J0352n661N9325M9812
$$ -44819 -67312 -112271 -87234 -96142 -72470 -53570 -55176 -75296 -64944 -70605 -11280 38532
15405C8532K756M458N540l0109n2322n9017k8330R6716Q7474N6781L445k3192
$$ 38532 41288 45746 51286 21177 -31145 -90162 -118492 -21776 65698 122479 125924 102732
15393A02732R461p6503j23587o4718P2014J0453K0808o7063n2241O5716K7510
$$ 102732 112193 35690 -87897 -152615 -80601 -70148 -49340 -116403 -168644 -102928 -75418
15382g5418m9030J3472j5814Q520R5047J6241k1566n5708l0353K9305n4130m7917
$$ -75418 -124448 -110976 -126790 -118270 -23223 -6982 -28548 -84256 -114609 -85304 -139434 -187351
15370a87351P291O764J8705J2183Q087K7006R206p487K7872o4552j0491P2571
$$ -187351 -180060 -173296 -154591 -142408 -134321 -107315 -98109 -105596 -77724 -142276 -152767 -80196
15358h0196J4578n6684L9707K1149l5624n9508l5812L9647J6099K0108M4223K351
$$ -80196 -65618 -122302 -82595 -61446 -97070 -156578 -192390 -152743 -136644 -116536 -72313 -69962
15346f9962k9258M0060L5773m0021k0571L2478N4169K490q3783m3793J7722k0368
$$ -69962 -99220 -59160 -23387 -63408 -83979 -51501 2668 5158 -78625 -122418 -104696 -125064
15334a25064M3408L0545k5069O351Q0910L528k8433r4082j6627J04640K7227j2063
$$ -125064 -81656 -51111 -76180 -69829 11081 14609 -13824 -107906 -124533 -19893 7334 -4729
15322d729k6277J0097J1428j2024P68j5322p6009j2705k5942n855m8290n5655
$$ -4729 -31006 -20909 -9481 -21505 -20737 -36059 -112068 -124773 -150715 -156570 -204860 -260515
$$ [...]
##END NTUPLES=NMR SPECTRUM
##END=
