##TITLE=Analysis number 309856
Compound Code cc 07506
Project Code adrs
Chemist Name stores
##JCAMPDX= 6.0         $$ Bruker NMR JCAMP-DX V2.0
##DATA TYPE= NMR SPECTRUM
##DATA CLASS= NTUPLES
##ORIGIN= Bruker BioSpin GmbH
##OWNER= NMR
$$ XWIN-NMR		Version 3.5
$$ Mon Jun  6 10:07:22 2005 GMT Daylight Time (UT+1h)  MAYBRIDGE\NMR@NMR_250MHZ
##.OBSERVE FREQUENCY= 250.131544655141
##.OBSERVE NUCLEUS= ^1H
##.ACQUISITION MODE= SIMULTANEOUS (DQD)
##.ACQUISITION SCHEME= undefined
##.AVERAGES= 16
##.DIGITISER RES= 18
##SPECTROMETER/DATA SYSTEM= dpx250
##.PULSE SEQUENCE= zg30
##.SOLVENT NAME= CDCl3
##.SHIFT REFERENCE= (INTERNAL, CDCl3, 0, 16.522)
##AUDIT TRAIL= $$ (NUMBER, WHEN, WHO, WHERE, WHAT)
$$ ##TITLE= Audit trail, XWIN-NMR		Version 3.5
$$ ##JCAMPDX= 5.01
$$ ##ORIGIN= Bruker BioSpin GmbH
$$ ##OWNER= NMR
$$ C:\u/data/dgb/nmr/ADRS/3840/pdata/1/auditp.txt
$$ ##AUDIT TRAIL=  $$ (NUMBER, WHEN, WHO, WHERE, WHAT)
(   1,<2005-06-06 10:07:03.40 +100>,<MAYBRIDGE\NMR>,<NMR_250MHZ>,
      <created by zg, POWCHK disabled, PULCHK disabled
       configuration hash MD5:
       62 19 C7 07 E1 42 D1 B7 37 6C 3D D0 77 39 F9 E6
       data hash MD5: 64K
       F9 ED FF 46 63 06 5D ED 39 4F 9B 0D 11 95 30 F1>)
(   2,<2005-06-06 10:07:14.90 +100>,<MAYBRIDGE\NMR>,<NMR_250MHZ>,
      <Start of raw data processing
       ef LB = 0.3 FT_mod = 6 PKNL = 1 SI = 32K 
       data hash MD5: 32K
       A2 F3 24 B7 98 2C 09 18 88 82 4D 63 01 CC 87 B4>)
(   3,<2005-06-06 10:07:16.71 +100>,<MAYBRIDGE\NMR>,<NMR_250MHZ>,
      <apk 
       data hash MD5: 32K
       9A 87 64 74 25 A5 88 CD 81 C9 E4 17 6A 53 75 9C>)
(   4,<2005-06-06 10:07:17.50 +100>,<MAYBRIDGE\NMR>,<NMR_250MHZ>,
      <abs ABSG = 5 
       data hash MD5: 32K
       8F D2 E4 24 11 B4 17 80 56 94 7F 49 26 32 B9 D6>)
$$ ##END=
$$ 
$$ hash MD5
$$ E6 F6 0A 79 3E 84 A7 07 45 FB F1 D4 54 CB 96 16
##$RELAX= 
##$RELAX= 
##$RELAX= 
##$RELAX= 
##$RELAX= 
##$RELAX= 
##$RELAX= 
$$ Bruker specific parameters
$$ --------------------------
##$DU= <C:\u>
##$EXPNO= 3840
##$NAME= <ADRS>
##$PROCNO= 1
##$TYPE= <nmr>
##$USER= <dgb>
##$AMP= (0..31)
100 100 100 100 100 100 100 100 100 100 100 100 100 100 100 100 100 100 
100 100 100 100 100 100 100 100 100 100 100 100 100 100 
##$AQSEQ= 0
##$AQ_mod= 3
##$AUNM= <au_zg>
##$AUTOPOS= <12 >
##$BF1= 250.13
##$BF2= 250.13
##$BF3= 250.13
##$BF4= 250.13
##$BF5= 500.13
##$BF6= 500.13
##$BF7= 500.13
##$BF8= 500.13
##$BYTORDA= 1
##$CFDGTYP= 0
##$CFRGTYP= 5
##$CHEMSTR= <none>
##$CNST= (0..31)
1 1 145 1 1 1 1 1 1 1 1 1 1 1 1 1 1 1 1 1 1 1 1 1 1 1 1 1 1 1 1 1 
##$CPDPRG= <>
##$CPDPRG1= <>
##$CPDPRG2= <>
##$CPDPRG3= <>
##$CPDPRG4= <mlev>
##$CPDPRG5= <mlev>
##$CPDPRG6= <mlev>
##$CPDPRG7= <mlev>
##$CPDPRG8= <mlev>
##$CPDPRGB= <>
##$CPDPRGT= <>
##$D= (0..31)
0 1 0 0 0 0 0 0 0 0.06 0 0 0 0 0 0 0.0002 0 0 0 0 0 0 0 0 0 0 0 0 0 0 
0 
##$DATE= 1118048822
##$DBL= (0..7)
120 120 120 120 120 120 120 120 
##$DBP= (0..7)
150 150 150 150 150 150 150 150 
##$DBP07= 0
##$DBPNAM0= <>
##$DBPNAM1= <>
##$DBPNAM2= <>
$$ [...]
##$SUBNAM7= <"">
##$SUBNAM8= <"">
##$SUBNAM9= <"">
##$SW= 20.6930455092707
##$SWIBOX= (0..15)
0 0 3 0 0 0 0 0 0 0 0 0 0 0 0 0 
##$SW_h= 5175.983436853
##$TD= 65536
##$TD0= 1
##$TE= 294.16
##$TE2= 300
##$TE3= 300
##$TEG= 300
##$TL= (0..7)
0 120 120 120 120 120 120 120 
##$TP= (0..7)
150 150 150 150 150 150 150 150 
##$TP07= 0
##$TPNAME0= <>
##$TPNAME1= <>
##$TPNAME2= <>
##$TPNAME3= <>
##$TPNAME4= <>
##$TPNAME5= <>
##$TPNAME6= <>
##$TPNAME7= <>
##$TPOAL= (0..7)
0.5 0.5 0.5 0.5 0.5 0.5 0.5 0.5 
##$TPOFFS= (0..7)
0 0 0 0 0 0 0 0 
##$TUNHIN= 0
##$TUNHOUT= 0
##$TUNXOUT= 0
##$USERA1= <user>
##$USERA2= <user>
##$USERA3= <user>
##$USERA4= <user>
##$USERA5= <user>
##$V9= 5
##$VALIST= <valist>
##$VCLIST= <CCCCCCCCCCCCCCC>
##$VD= 0
##$VDLIST= <DDDDDDDDDDDDDDD>
##$VPLIST= <PPPPPPPPPPPPPPP>
##$VTLIST= <TTTTTTTTTTTTTTT>
##$WBST= 1024
##$WBSW= 4
##$XGAIN= (0..3)
0 0 0 0 
##$XL= 0
##$YL= 0
##$YMAX_a= 451518
##$YMIN_a= -463372
##$ZGOPTNS= <>
##$ZL1= 120
##$ZL2= 120
##$ZL3= 120
##$ZL4= 120
##$ABSF1= 16.522
##$ABSF2= -4.171173
##$ABSG= 5
##$ABSL= 3
##$ALPHA= 0
##$AQORDER= 0
##$ASSFAC= 0
##$ASSFACI= 0
##$ASSFACX= 0
##$ASSWID= 0
##$AUNMP= <proc_1d>
##$AZFE= 0.1
##$AZFW= 0.1
##$BCFW= 0
##$BC_mod= 0
##$BYTORDP= 0
##$COROFFS= 0
##$CY= 12.5
##$DATMOD= 1
##$DC= 0
##$DFILT= <>
##$DTYPP= 0
##$F1P= 14.0000005364418
##$F2P= -0.99999901652339
##$FCOR= 0.5
##$FTSIZE= 32768
##$FT_mod= 6
##$GAMMA= 0
##$GB= 0
##$INTBC= 1
##$INTSCL= 1
##$ISEN= 128
##$LB= 0.3
##$LEV0= 0
##$LPBIN= 0
##$MAXI= 10000
##$MC2= 0
##$MEAN= 0
##$ME_mod= 0
##$MI= 0
##$NCOEF= 0
##$NC_proc= -4
##$NLEV= 6
##$NOISF1= 0
##$NOISF2= 0
##$NSP= 0
##$NTH_PI= 0
##$NZP= 0
##$OFFSET= 16.522
##$PC= 1
##$PHC0= 130.4632
##$PHC1= 7.274397
##$PH_mod= 1
##$PKNL= yes
##$PPARMOD= 0
##$PSCAL= 4
##$PSIGN= 0
##$REVERSE= no
##$SF= 250.13
##$SI= 32768
##$SIGF1= 0
##$SIGF2= 0
##$SINO= 400
##$SIOLD= 32768
##$SREGLST= <1H.CDCl3>
##$SSB= 0
##$STSI= 32768
##$STSR= 0
##$SW_p= 5175.98343685301
##$SYMM= 0
##$S_DEV= 0
##$TDeff= 65536
##$TDoff= 0
##$TI= <Analysis number 999999
Compound Code 99
Book Reference 9
Project Code 9>
##$TILT= no
##$TM1= 0
##$TM2= 0
##$TOPLEV= 0
##$USERP1= <user>
##$USERP2= <user>
##$USERP3= <user>
##$USERP4= <user>
##$USERP5= <user>
##$WDW= 1
##$XDIM= 32768
##$YMAX_p= 511075881
##$YMIN_p= -67939
$$ End of Bruker specific parameters
$$ ---------------------------------
##NTUPLES= NMR SPECTRUM
##VAR_NAME=  FREQUENCY,     SPECTRUM/REAL,   SPECTRUM/IMAG
##SYMBOL=    X,             R,               I
##VAR_TYPE=  INDEPENDENT,   DEPENDENT,       DEPENDENT
##VAR_FORM=  AFFN,          ASDF,            ASDF
##VAR_DIM=   32768,         32768,           32768
##UNITS=     HZ,            ARBITRARY UNITS, ARBITRARY UNITS
##FACTOR=    0.157963299565203, 1,           1
##FIRST=     4132.6476996994, 0,             0
##LAST=      -1043.33573715361, 0,           0
##MIN=       -1043.33573715361, -67939,      0
##MAX=       4132.6476996994, 511075881,     0
$$ Real data points
##PAGE= N=1
##DATA TABLE= (X++(R..R)), XYDATA
$$ [...]
29736 -778 1130 -1599 -5204 -16076 -20587 -12775 -9425 -11098 -11162 -12245 -7355 -2533 -2327 -1551 -2683 -8670
29720 -8670 -6870 1966 -5158 -6461 -6142 -5846 -3285 -3366 1 -824 -3618 -6346 -6052 -7829 -15520 -21564
29704 -21564 -19261 -9963 1975 4934 2015 -2440 691 -5 -6552 -5564 -1386 -5711 -5435 -5093 -1295
29689 -1295 -1315 642 2804 3 -5414 -8335 -9070 -7123 -358 -1652 2187 5262 -2570 -7005 -15552
29674 -15552 -11461 -4968 519 -699 -722 -1098 299 -550 -3044 -1265 3836 1649 4819 11753 7133
29659 7133 1411 -2869 -2759 -4295 -11711 -8062 -1439 5392 1948 -5869 -5251 2241 6404 6747 6526 15186
29643 15186 10144 3761 11066 9305 7674 4738 2999 2521 4937 3033 -866 -5653 -13815 -17453 -11982
29628 -11982 -6447 -6955 -10293 -13668 -13658 -15747 -13776 -5914 -7044 -9465 -9550 -7487 -5340 -7072 -6610 -3672
29612 -3672 -1754 2192 2815 1731 2947 4164 7375 8192 6377 738 3706 14313 12876 10463 13073
29597 13073 4428 -665 -4883 -7131 -3102 -395 -2169 1044 4544 1304 4034 6051 8747 8591 8679
29582 8679 410 -9030 -1924 1804 -293 -1303 4826 5278 2437 -461 -5915 -9410 -10303 -9165 -4991
29567 -4991 483 -5337 1401 146 1733 -1203 -1617 -308 -4583 -5565 -518 -6678 -12800 -18446 -14190
29552 -14190 -3433 -2020 -4748 -4318 -5619 -12409 -23639 -28861 -21424 -13324 -11331 -4135 -3885 -1898
29538 -1898 -2040 -8562 -13055 -6701 -573 -1662 -2170 -4302 -3360 -2817 -5246 -9950 -10382 -10744 -6336 -1822
29522 -1822 155 2714 4140 -1342 1791 7682 2099 -1257 -4243 -3586 -2347 -3102 -3008 -6410 -3363 2709
29506 2709 1301 -6498 -7766 -7356 -5830 -357 -6809 -6997 -2321 -1756 -6669 -8710 -8409 -7368 -401 -2242
29490 -2242 -525 -1723 -620 -2993 -1949 3258 2824 1593 -3679 -6466 763 -4836 -4438 -460 -1329
29475 -1329 -7337 1468 11859 17954 8679 -4344 -2338 1262 -2918 1682 7250 6505 256 -3189
29461 -3189 -7736 -7405 -6798 -9029 -6385 -8999 -6354 -1042 2080 1491 -853 2757 2084 1271 -6607 -9089
29445 -9089 -12698 -9629 -6028 -3845 -4367 -10657 -12586 -9436 -5904 -7262 -9518 -7412 -4840 3585 8773
29430 8773 9313 8160 9382 11812 5804 -2320 -6062 -8351 -8667 -968 -6765 -18412 -16429 -9973 -3002
29415 -3002 -704 164 3654 5472 6907 2561 -3013 1603 5559 4035 -3214 1609 5958 12495 10257
29400 10257 10097 9987 2015 -4000 -6001 15 -4071 -2349 3446 -4831 -9531 -9959 -6529 -6166 -5831 -5611
29384 -5611 -4698 5415 11100 10958 3502 6586 18622 17201 8780 9284 7401 5608 8725 12131 10735
29369 10735 8503 6152 3869 660 -3028 -216 5228 4304 1013 3330 1913 -5247 -2962 4105 3587
29354 3587 1141 -7756 -5235 -1073 189 -6465 -3930 -2451 5629 7344 7150 7298 7514 2793 -641
29339 -641 -1569 929 4671 6634 2790 5340 4345 385 -1852 -6942 -4570 -3547 719 927 2643 5739
29323 5739 4848 -160 -4215 -3962 -3409 1732 -166 3108 7774 3217 -2787 -4343 1406 2717 -5270
29308 -5270 -2794 -2034 407 4375 5549 743 -3486 -2946 2298 2397 -1024 -3925 -5394 -3460 2793 -3900
29292 -3900 -11482 -13994 -12431 -7567 -5684 -4593 -3873 -5951 -8716 -10701 -2215 2378 4045 -1346 -4353
29277 -4353 -1415 244 3900 2898 6495 7453 6441 7764 11651 9149 4467 -848 -1755 -3896 -8056
29262 -8056 58 7052 7847 5233 -2507 -10381 -15327 -14276 -11070 -11587 -7517 -423 3684 -2814 -5019
29247 -5019 -4444 -5903 155 -1529 240 689 2062 4920 7543 4561 -2424 -6684 -6856 -7524 -8397 -6705
29231 -6705 -4967 327 4823 8546 5650 4099 4406 1607 -6760 -4615 -2278 -4796 -6750 -2301 1396
29216 1396 8215 16261 15428 9748 6549 4179 5002 2862 940 -346 -2044 2475 832 -434 6219
29201 6219 2394 604 1558 1989 7829 12432 11576 9657 5160 10847 5538 -1771 -9053 -7412 -4472
29186 -4472 -8784 -10837 -4105 -3417 -3859 -1238 -259 -1273 -2569 -4970 -9248 -6388 -4344 -4443 475 1172
29170 1172 3147 4805 297 1417 2844 9344 7353 6871 2958 2573 6256 1654 5259 7207 6839
29155 6839 5061 14200 12528 3788 -879 59 4696 3418 6467 8400 3314 4581 7787 3456 941
29140 941 3781 3423 -2573 1352 1930 7576 7068 7218 5673 7097 8240 6280 -9346 -13754 -6427 669
29124 669 5176 6798 6312 9660 7291 5035 -488 5278 10454 783 -1556 -4326 -6565 -5746 4193
29109 4193 15217 13814 11015 5320 7500 468 2140 6873 5887 5034 5467 10612 11484 9698 4274
29094 4274 -80 -3327 -79 -3893 -14818 -17861 -12028 -5635 -6492 -9278 -10111 -10562 -8913 -14190 -10183
29079 -10183 -5199 -3960 -7726 -7937 -11340 -9578 -2719 -3147 -1177 -5626 -8160 -5927 -2220 2158 2433
29064 2433 1723 4162 3274 5299 -266 -4809 -1169 -4646 -3056 2137 -2702 2663 1344 -1764 -1508
29049 -1508 1865 3986 -1857 1207 6761 7738 3338 8054 9378 9374 4717 -690 7532 12680 3448 -5037
29033 -5037 -155 2118 -3205 -304 4958 3282 3941 -269 -4487 -5394 -3582 1222 10260 5461 -19
29018 -19 -5239 -1745 1781 1215 -3221 -5878 1493 10478 10716 897 -1650 -5189 1129 -2698 -2165 -3350
29002 -3350 -2954 2271 3459 2173 682 8605 11196 5890 1858 8852 12318 11061 8000 -25 -2240
28987 -2240 -156 -6369 -3719 1230 -1250 -3239 -4578 -5120 -5247 -10528 -10017 -6692 1841 7115 4743
28972 4743 370 -4691 -3233 2600 -1626 -7107 -8928 -8039 3893 6291 -1789 6815 8376 5153 3834
28957 3834 2264 3944 -837 -6137 -1079 7078 15147 10910 7501 7660 -100 213 -1259 -4957 -4660
28942 -4660 -6137 -7172 -710 3015 4900 7163 7439 3163 1705 -204 790 -7166 -5565 -7295 -11175
28927 -11175 -11292 -6391 -1163 -2503 -7399 -3781 -4651 -7694 -7761 -10189 -8228 -3789 -5102 -2117 -5506
28912 -5506 -6274 -2604 -6015 -8357 -10404 -8350 -6524 -2646 -2005 -1126 2852 5641 4629 2456 4584
28897 4584 3160 -1765 -560 7996 10222 4820 105 -2322 -2988 -7462 -3962 4526 7704 9587 4408
28882 4408 5145 2947 -1078 -3367 -4487 4066 2860 5535 11726 -1160 -9325 -17647 -12949 -4633 -2321
28867 -2321 -9974 -8856 -2164 -5979 -12443 -18163 -19494 -14326 -7276 -6879 -11523 -13988 -4753 5928 8125
28852 8125 -2264 -15350 -15191 -8021 -8330 -9853 -10589 -11006 -5234 4285 4441 -422 1056 1777 -1454 -6211
28836 -6211 -5703 -1948 -4769 -10412 -19526 -26316 -25166 -14636 -1148 5228 8972 5620 3360 -531
28822 -531 4124 13476 19710 22871 21986 26788 32840 41182 39068 33526 34579 33756 32406 33270 27188 22022
28806 22022 18483 7745 -7387 -16806 -18028 -12597 -4245 -735 4063 2111 -5489 -8673 -11350 -19962
28792 -19962 -22460 -20319 -18736 -14306 -17225 -25310 -29088 -27209 -18187 -12623 -2522 3306 6213 5739
28778 5739 3972 8233 9931 6149 4467 -252 -3831 3479 6157 4639 7809 7894 7128 13406 9568
28763 9568 4160 8565 7595 2377 1255 2304 -22 -2568 2222 2311 -2453 1994 4630 6539 5258
28748 5258 3220 1700 -3262 -6251 -6914 -11616 -4420 -901 -1014 2374 5499 6291 6202 -6171 -11649 -6719
28732 -6719 -5757 -6206 -4469 -351 -2677 -10311 -6699 -446 3891 5956 -1803 -8450 -7503 -5839 -10608
28717 -10608 -10774 -10745 -5701 -2811 729 2968 7848 1544 -4345 151 -2305 -1292 -39 -273 2158
28702 2158 5137 7543 5022 -635 -6856 -7563 4084 9558 5222 -4077 -5779 -12649 -16721 -18839 -12210
28687 -12210 -11173 -7341 -5985 -2905 -4201 -7674 -3411 -5152 -8887 -8343 -4950 1050 2720 -1431 -3353
28672 -3353 469 1933 -1116 -1823 2644 4996 5229 -889 -1403 -5827 -5208 -7645 -9670 -6549 -1383 -3357
28656 -3357 -2015 1683 -1835 -3725 -8292 -5512 -2147 3263 -198 -4606 -2582 5722 6193 2927 1962
28641 1962 -1705 -2004 3213 4807 8584 8543 8845 11691 14349 6922 -1855 -4403 2673 7767 2131 942
28625 942 1366 -1144 4311 8213 6374 1992 3559 -648 -5841 -5727 -1837 -8440 -6551 -4661 -9527
28610 -9527 -12317 -11276 -12197 -7659 -3701 -4198 -2244 -2026 -2764 -3896 670 557 823 2166 4067 8668
28594 8668 5668 1397 -2670 -656 -2423 -374 -1946 -10084 -3245 -4867 -3711 897 1366 -1124 9
28579 9 -4494 -3341 1358 2227 38 -2756 3484 8812 6919 -24 -6690 2232 10499 8630 2901 7890
28563 7890 8317 -52 1845 2027 -1316 842 1341 -785 -3593 545 -165 -5064 -10657 -12713 -11235 689
28547 689 -5126 -7898 -4110 -5173 -2534 -1224 -3741 -2398 756 2735 3089 3011 1964 -13855 -19822
28532 -19822 -16192 -7772 -6982 -5678 -1053 -1689 -1245 -430 1096 1892 3076 3792 1762 -1015 -3229 1478
28516 1478 1706 1131 8712 8936 5021 3746 -1444 31 -2284 -2246 2228 -2044 -6031 -8111 -7970 1220
28500 1220 2666 -4466 -6272 -9155 -3445 2168 226 -4519 -8904 -5336 2513 13191 16516 9710
28486 9710 -985 -8181 -8534 -5424 -2191 -5862 2731 6724 1837 781 -692 -6796 -8664 -1784 4157
28471 4157 6210 4044 -1971 241 7426 8330 6908 12044 7789 6844 5777 8999 7916 1741 -5508
28456 -5508 -3599 414 6539 6671 -4173 -10000 -5314 -4989 -1893 -2855 -5529 -5172 -5024 -2081 -4257 -4586
28440 -4586 -2645 6160 14969 17716 12584 13341 13879 2078 1547 7864 4888 545 -5914 -8992 -3935
28425 -3935 7969 7324 -4519 -3158 208 -162 -1520 -135 -2379 -7886 -6141 -1556 -4718 -2124 -186
28410 -186 -2875 -6166 -5197 -1909 -1224 -4131 -5558 -3259 -380 8148 10685 6119 3867 1202 -5592
28395 -5592 -10180 -1858 4048 7075 4649 6128 6101 2682 7989 11791 8646 1873 -744 656 1701
28380 1701 2131 7708 12680 18052 11741 778 2821 2963 618 6337 2825 -1979 -7894 -9775 -8556
28365 -8556 -5306 -624 -10243 -22339 -21592 -10385 -5968 -1744 -889 128 -821 -2273 -4429 -5572 -3690
28350 -3690 -6812 -13183 -8546 -7673 -4307 -2824 -288 514 -654 -86 2690 -1770 1321 7037 3526
28335 3526 3465 7964 16771 11033 8028 8740 7044 -4893 -10523 -9375 -5545 -6196 -4735 -6558 -4438
28320 -4438 -2059 -3204 -5719 27 2695 -531 -2803 -1057 4285 1528 -5831 -6351 -3705 -2070 -926
28305 -926 -1721 -3687 -10932 -3616 1597 -1492 -975 384 4390 5017 -1774 -3716 -3167 2692 -1642 -2451
28289 -2451 -1035 -4747 -278 1823 386 78 -1530 4627 3419 -1437 -4886 -3840 -3018 63 903
28274 903 4208 10355 7541 -572 -6233 -11467 -1000 4429 3876 384 3257 -1502 2606 7598 6945
28259 6945 2910 2987 7266 12648 1266 -259 419 233 -260 -8077 -9322 -6681 -4381 -5339 -2725 -4869
28243 -4869 -12790 -5637 -142 1463 961 2253 -93 4558 10966 10523 8479 2503 -4053 -9330 -8498
28228 -8498 -3112 2936 -136 -1079 153 897 4003 5026 1559 -992 -5050 -2387 -1055 -4518 -2939
28213 -2939 583 -2548 1005 11059 16432 7053 4104 5263 7140 13223 9742 1475 -3435 -5010
28199 -5010 1116 1651 3410 -3045 -2859 1 -2460 -4664 -5549 -8084 -6265 -3788 987 -143 2115
28184 2115 16517 19580 13861 7530 6495 7437 7214 7114 4752 3663 9555 11610 4086 1363 2548
28169 2548 -4319 -13738 -14044 -3852 2117 -2193 1189 -7787 -14781 -12219 -6229 -5527 -3254 57 3127
28154 3127 6316 6328 7238 4274 3999 5387 4390 2602 -1413 673 -3419 -10713 -9477 -10198 -17499 -14719
28138 -14719 -10559 -11207 -9866 -4257 -2194 -4229 -3649 -106 5954 5215 1758 -2039 -1514 -2504 -2662 -2286
28122 -2286 -3597 -4746 -4371 -3677 -2925 -7972 -5913 -2969 -4209 -8001 -5680 -923 -949 -3625 -2234 -7809
28106 -7809 -18957 -14360 -8597 -7470 -7060 -12436 -11125 -5673 -6202 -7804 -9623 -2816 4856 6934 -3308
28091 -3308 -6304 -5731 -749 -3609 -3360 -1018 1849 594 2788 6928 4713 2282 2340 5554 4602 3637
28075 3637 5560 11008 14003 15188 10109 10899 7504 5083 6697 5361 -3297 -3649 -3049 -1999 921
28060 921 4611 358 -9686 -14293 -9655 -6693 179 5458 3721 -4001 -1942 1143 1793 5031 143
28045 143 -3007 -2389 3132 8340 9038 8927 2926 907 5380 3480 2074 1036 141 74 276 -5376 -5616
28028 -5616 -5122 -5858 387 1945 8107 13800 7255 -1342 -4630 -2798 6822 8135 8814 5963 5468 8531
28012 8531 5836 2057 2332 2201 4121 810 -456 3637 5759 2253 3033 2704 6620 10217 7661 10367
27996 10367 8267 6713 684 -5528 -7996 -4768 -1819 -992 657 -4081 -13330 -14919 -13377 -10659 -9690
27981 -9690 -5080 -3131 -2870 543 6307 10037 8458 13393 14010 10658 11238 7657 -171 -1283 -3523
27966 -3523 4008 -8219 -13849 -6296 -2184 2232 -1318 -2887 5798 2540 4253 3061 -537 -1295 -5133
27951 -5133 -5683 -1528 2389 525 1587 1392 5936 6438 8239 9282 6861 8245 1734 -3357 -2056
27936 -2056 3053 6819 12265 5114 -1246 4841 3748 464 -699 1214 3327 1368 2141 6231 4688
27921 4688 6724 14990 10294 4537 64 -1733 -6466 -2459 -6940 -5014 2193 199 -3019 1198 8041
27906 8041 6529 -2680 -2995 724 233 2674 2365 -4605 -3180 1263 -1026 -3259 -4744 -5264 -4939 -4052
27890 -4052 7293 3770 1376 -605 -1264 -2813 92 -1729 -343 8244 8985 6690 7815 7274 3718
27875 3718 2203 -5185 -5900 -5326 -1341 -685 1998 -2279 -2303 -2611 -456 4320 8206 3975 2310 2104
27859 2104 3137 10275 12916 9448 6178 -651 643 7536 7152 11981 15071 17685 11528 9602 9678
27844 9678 11276 14999 14684 5236 5300 15719 13160 16348 17235 16105 15240 8347 1454 -2144 5641 14595
27828 14595 9092 3872 4097 2944 1115 3818 6548 11153 2579 -797 1588 -2718 -2214 3082 10849
27813 10849 12570 10654 13255 10156 655 -7606 -7744 -4421 4156 10173 6001 7769 19195 18290 13860
27798 13860 6918 1662 1875 -398 -4022 -3215 -21 551 359 -2074 -3833 330 8025 12687 17314
27783 17314 15531 6780 9232 5634 -928 3247 2569 863 1171 1958 1945 169 -9212 -9322 -4291 -1418
27767 -1418 -4497 -2552 -4308 -5351 -1766 5063 6546 3486 759 -3846 -3962 3828 -41 -4106 -4181
27752 -4181 -7710 -10775 -12981 -16481 -9639 -4853 -8635 -13730 -12758 -11660 -5740 3636 7210 12864 14171
27737 14171 3682 4100 4275 702 5209 10063 14052 9316 6787 8177 10261 9380 5224 5251 -243
27722 -243 -10138 -5486 -539 155 5949 7881 11119 4558 74 801 5020 1047 1723 5263 8520 3177
27706 3177 -2899 -1760 3432 9406 12508 10728 9872 7285 7101 19121 19053 12700 7592 5615 1837
27691 1837 -3389 3737 3201 2164 4681 2889 -3869 -7682 1679 4907 -3362 -7889 -7202 2606 8510
27676 8510 9157 4126 -2172 2378 10394 13267 6680 -123 -5284 -1830 1844 -3355 -5114 407 2776
27661 2776 2650 5197 8388 7877 1275 -3767 -6137 -10412 -4347 -1653 5972 8617 13852 9025 5561
27646 5561 2510 2166 -50 -1043 823 1496 6439 6905 2117 803 -56 1894 -1306 2568 3637 5730
27630 5730 1493 -3743 -4591 1316 7863 6964 4451 2375 3951 -507 -1597 -2995 -520 1487 5540
27615 5540 4025 -134 -1481 2837 5526 4209 1244 -2162 1354 2939 -1912 3108 7788 746 458
27600 458 3268 1576 2647 -1204 494 4662 6214 5513 4788 9766 11717 9695 1967 2496 7912 11293
27584 11293 13020 13186 15099 9585 -1642 2055 1558 1482 6131 5007 3050 6468 8103 8327 4428
27569 4428 4046 10077 13345 9766 12575 7327 4952 5428 -1132 -7930 -6744 -6425 4104 6883 5073
27554 5073 7868 5466 7297 5688 3454 -4574 -7394 -6372 -5631 -4191 -4279 1078 1813 10475 11602 12524
27538 12524 15129 4353 -4752 -1101 2817 4012 8029 2756 4718 5972 8796 6350 282 1298
27524 1298 -91 2830 3140 -3665 -7912 -2459 3145 4414 5346 7767 7390 7413 8316 3784 5260 2973
27508 2973 1945 -2967 -3917 -9370 -7951 -3406 -8536 -14735 -9527 -8654 -8932 -15179 -14477 -5855 -3533 -10413
27492 -10413 -15813 -14389 -8169 3431 6281 2759 1525 513 -381 1134 519 -2218 -4385 -845 838
27477 838 2830 1511 -5088 -10569 -5210 3335 9750 11254 -1165 -5704 -1336 3524 2068 -5378 -4639
27462 -4639 -5513 -5986 -4170 -6606 -7201 1529 747 -2494 1784 1847 -3515 -12646 -8778 722 5362 1381
27446 1381 -2042 434 1327 747 6368 9501 6485 899 -1780 2370 6274 14235 19854 20645 14796
27431 14796 8110 11506 6710 -3358 -2392 5106 6480 7713 8972 5301 8254 9765 7377 5613
27417 5613 8486 7959 6056 9175 7083 5679 298 -428 1627 2392 -1905 4663 12036 12461 7191 2094
27401 2094 -787 -221 5996 11845 13815 10122 4269 873 2216 5400 -1423 -3627 3539 1644 -103
27386 -103 -7684 -13290 -10397 -2594 -2478 -13418 -15579 -10158 -7681 -12863 -5502 4532 -7 -4550 -4732
27371 -4732 -2840 821 -2325 1495 8303 6691 6064 5572 2626 -364 -2331 -2509 7373 5301 7937
27356 7937 11297 15178 16483 15500 8182 -148 -6878 -8275 -3231 -6466 -1244 808 3836 8695 5944
27341 5944 372 2983 1956 4805 2864 325 -1764 -342 4698 5290 2279 5214 9989 10537 3328
27326 3328 1330 3598 4256 13609 20464 16091 3575 2355 2599 8957 6486 7001 3314 890 -777
27311 -777 -3596 -327 4744 11883 10347 7130 5569 5545 9591 12166 11373 9834 5833 4000 784 -280
27295 -280 -2590 2144 7004 10186 7789 1357 -1987 7803 12629 9989 4507 4371 5554 4254 -49
27280 -49 6829 12607 8462 7435 6122 8052 7768 12091 17872 9194 3198 -4305 -5639 -7497 -7000 -3180
27264 -3180 -1722 -1314 -2908 -805 6284 -363 -11287 -7119 1611 675 -8178 -4635 6650 11812 7869
27249 7869 10080 8394 7104 5143 3479 383 -1497 -215 -2767 -969 3205 4564 9245 11676 12389
27234 12389 11710 8285 5122 -1830 171 5594 2225 1203 -352 -3789 -4839 -3530 -3415 -7902 -9863
27219 -9863 -6506 -446 -1728 -7414 -5864 -4695 -5950 -9353 -5336 1638 6062 8370 6838 6168 10793
27204 10793 6786 -5295 -1764 -1232 -7323 -11700 -9055 354 9401 12805 6355 1611 2921 -826
27190 -826 1201 4568 4048 3026 4210 3947 1058 5241 4215 -4155 -2555 5667 11148 11446 12565 17113
27174 17113 20191 22260 16116 23030 26676 22161 10402 10464 9573 9426 10544 5975 7534 8192 599
27159 599 2084 -350 -148 4061 5324 8116 9455 9656 13572 14754 14547 19291 18064 17776 15702 16092
27143 16092 11602 1979 -2627 -1090 -969 -621 -1681 1038 2851 563 -994 2285 3848 -2157 -5838
27128 -5838 1027 6926 7478 7702 4016 -1908 -6801 -4187 -2657 -2033 8578 12275 9607 8605 767
27113 767 1570 150 176 4489 8924 6136 3987 10810 16722 12965 14471 11291 12574 15187 14275 16802
27097 16802 17096 10180 5355 8407 8389 7656 -1048 -5630 -6440 -9136 -2591 2845 9874 10058 7930 5061
27081 5061 1992 5213 6992 12633 13174 7223 3634 2564 3888 7722 12118 14476 7732 1911 2512
27066 2512 986 -7625 1025 7776 11044 11946 5460 5541 11836 7660 4349 5592 1480 -2214 3115
27051 3115 9617 4939 4852 13630 8498 2965 -6434 -2971 3547 462 270 449 -994 -5640 -3932 2588
27035 2588 3689 3017 -1031 2151 7504 13783 9276 3221 2909 6230 -1224 -10127 -11171 -13904 -15928
27020 -15928 -8502 3441 5272 1317 61 -10 -3952 -1660 4624 7910 -532 -5872 -4851 -2517 2387
27005 2387 12662 10810 7975 6931 9480 10551 16586 15014 3566 -349 -2992 -1620 -563 8054
26991 8054 11775 9776 9287 3721 3373 7990 10276 7568 1597 -2532 4038 8236 7633 8478 6943 6410
26975 6410 11140 11831 11561 13329 13159 12579 6754 3922 4570 13586 9999 4992 3153 5440 1571 6216
26959 6216 3188 -8172 -9113 -1699 4349 550 -1331 282 -4773 -1554 -1202 3083 7099 12219 11791
26944 11791 9831 3443 6428 3560 574 -3734 -1744 -6693 -8700 -11664 -10031 -4979 -1577 1610
26930 1610 -596 -1510 -2919 -998 7301 7845 1344 5681 7097 4897 3220 1096 1263 1924 3550 -422
26914 -422 -5943 -4035 878 4416 11264 7313 336 4811 5322 6376 2397 5090 -1133 -4406 -668
26899 -668 4706 13289 15558 14050 13572 14884 10785 4396 2641 3551 -511 -1211 2211 5545 860 -4466
26883 -4466 -5375 -4385 -4897 -5038 -4503 -1554 400 3274 1641 -85 -852 -3980 2730 2549 -424 -3969
26867 -3969 -29 4473 -2583 -2096 4060 4647 6967 7683 12446 12547 6037 3004 9997 14829 12837 9927
26851 9927 2349 2425 -1915 -456 3637 3901 2474 5378 13903 12964 4881 5280 3354 -4504 -9287 -12624
26835 -12624 -6571 103 -3381 -4845 -7798 -8047 -4213 227 3650 1033 -4735 -4868 -4711 3903 10220
26820 10220 6901 5120 5236 12151 16036 13676 1184 1525 1671 2643 3139 2793 -558 -9140 -12450 -9474
26804 -9474 -3346 5514 1202 -758 3751 2690 5159 9580 10003 9716 1140 -484 -593 -5197 -9995
26789 -9995 -11438 -11324 -9951 -12751 -11077 -10314 -9712 -9718 -6193 -7072 -4261 -3526 619 4677 3139 2427 -1019
26772 -1019 -1080 3439 1803 -2505 -1936 -1197 -57 3390 5286 1931 2002 -424 4342 5275 4190 5535
26756 5535 6835 9208 4760 3566 1509 -344 5074 12408 11241 5876 3336 6752 9173 3727 1251
26741 1251 1066 2443 7438 6501 4635 3049 3033 -5948 -1698 9332 5699 -829 1950 5549 4331
26726 4331 9907 14172 7789 -303 4958 7656 6546 9595 11790 12391 14352 9815 9066 10604 9928
26711 9928 6223 1687 -758 1346 9819 10956 9959 12859 7788 2882 963 -1538 -6339 -6187 -11974
26696 -11974 -15930 -1836 6394 4683 4156 -691 -6357 3392 5291 -4958 -4087 232 3141 1177
26682 1177 -1604 2641 6286 13792 14193 14887 14774 11377 7019 3878 4323 5430 6139 -2734 -3085 4112
26666 4112 15282 11667 5696 -1117 -10630 -11806 -9578 -7913 -4318 -39 4075 3321 127 1235 883
26651 883 -3070 -8947 -16855 -8534 -6397 -5707 -5178 -4051 953 6345 3787 7030 5352 4848 1798 6240
26635 6240 4713 6485 10257 8119 9061 5391 5705 5409 2609 -408 2013 2917 6895 3330 -1017 -3772
26619 -3772 -3336 -875 4026 7819 7742 11915 15640 14183 12135 9105 4638 1899 2664 5968 6322 1298
26603 1298 3037 1976 2151 1425 6603 7357 5434 -2825 -5079 74 5617 3784 4873 7744 9710
26588 9710 7305 1580 -8181 -7123 -10583 -5646 -2980 -4678 -1874 5112 6339 -766 -3939 4737 6204
26573 6204 7263 2180 -450 8132 5365 1104 2314 -1562 -1334 4335 7784 3132 6419 15732 11663
26558 11663 10626 7195 4299 8696 8647 14637 17924 12671 4516 3327 4410 6550 9068 4893 5150
26543 5150 2038 -8348 -9234 -627 3797 -606 -2725 -3724 -13942 -18753 -7694 445 2065 2640 -934
26528 -934 -1649 4586 6185 2923 6340 3317 9261 21113 12888 3437 5359 -2 2679 8320 8012
26513 8012 9308 5306 -2894 2698 7764 5104 2888 10793 11787 8520 7196 5636 1380 -499 4622
26498 4622 8813 12569 11626 8529 3041 2777 888 1789 -4062 -6421 -8377 -2973 1136 -7090 -13259
26483 -13259 -10268 -12769 -12254 -3582 -470 1465 -443 -1399 -1384 1324 2807 2251 11208 7054 2077 6186
26467 6186 4004 3490 9532 7980 325 -4505 -7671 -4331 -2774 -752 2886 5522 1223 -4700 -8291
26452 -8291 -7188 -3361 -1326 2748 6031 9721 10919 9319 10329 13001 12330 7159 1789 -2672 -6908
26437 -6908 -3491 1451 5171 4929 9834 18065 17232 11618 9678 11186 10075 6918 12090 13827 13615
26422 13615 14361 15504 16653 15292 13190 4877 5296 8054 3902 -4727 -5388 -3213 -14609 -11009 -7366
26407 -7366 -12705 -8911 -5794 -4771 3757 8646 5523 5329 4270 4581 8697 2551 -10367 -11503 -3969
26392 -3969 1412 7014 16035 20483 20996 15908 14575 10764 9844 11600 5733 577 545 -6039 -7661 -220
26376 -220 4008 8005 2294 -2978 4144 912 1685 1387 -5788 -12017 -7288 821 3667 4731 6436
26361 6436 7554 7561 3423 -3908 -687 143 -3906 396 7054 11596 9694 3232 2704 1879 -920 2593
26345 2593 12056 19821 11420 5187 3680 14715 27168 21709 9994 -3343 -8112 -7984 -6656 -3039
26331 -3039 -1273 -5299 -3041 -2077 846 1298 3112 302 -807 6276 8870 8732 11034 14337 6533
26316 6533 662 -6539 -8635 -9353 -6337 -6665 -8018 -5301 -6569 -10518 -5423 -6427 -6265 -2366 -2448 -811
26300 -811 -2115 -2122 -2814 1373 7049 1325 -5289 -2443 -769 -2769 -846 -1040 5833 7925 5086 -365
26284 -365 873 1486 143 541 3987 3524 -1825 -7173 -5116 5515 11146 13600 16703 11615 3357
26269 3357 936 -350 -6349 -2286 2711 1344 3765 6329 11079 4647 -5029 -6977 -8561 -8809 -8106
26254 -8106 -10369 -8298 -379 2128 7283 5267 6965 3968 -1712 91 2689 1214 3040 -1554 3529
26239 3529 1586 3063 5155 5577 4380 5755 1419 -762 -5318 -2123 1651 1811 8977 12060 3740
26224 3740 -1853 -4556 93 2986 6005 -1484 -6325 -4872 -1454 2703 2377 2687 4813 -263 -4172
26209 -4172 4026 7566 6327 5240 4983 -632 -2953 -3614 -1414 2973 5495 9976 4300 3386 8238
26194 8238 3472 2982 666 1882 -3068 -11166 -5098 3185 9170 8982 10325 10703 10187 9588 4871 5985
26178 5985 1710 -8117 -8398 -4976 -2564 -272 167 -564 -1180 814 8819 11430 8381 5015 5964 2035
26162 2035 -1279 -1309 -179 9455 6975 -2114 -4504 -4512 -3033 85 1454 2869 3034 3453 -442 -1012 -2143
26145 -2143 -2113 -1012 -3806 -4455 2942 -1412 -2224 1641 9384 7404 -2162 -12921 -12506 -14044 -7991 -2699
26129 -2699 3333 8564 6393 3917 6785 3090 -2040 340 3557 8855 9621 5695 8914 10455 12223
26114 12223 18007 18370 13383 10044 2159 2342 6973 5984 7732 5928 1202 2270 -446 -8152 -11917
26099 -11917 -7924 -8453 -3659 3663 5364 2528 2081 -3329 -8700 -9603 -4459 -2337 -4972 -6228 -3947
26084 -3947 -5458 -2732 -7519 -12319 -7827 -3797 -1645 -3514 -5996 -5022 -4596 -2673 -4321 -4050 -5128
26069 -5128 -8874 -6119 8034 9235 6612 -1001 -917 -1071 5557 11755 10421 4665 8122 10203 2724
26054 2724 3016 7555 14347 12758 5840 7316 7704 -752 -10704 -14376 -15492 -12539 -1082 4712 3660
26039 3660 -5078 -8447 -1271 -3816 -260 9696 8514 7001 8760 4070 770 -679 3994 1394 -600
26024 -600 -2093 595 -1596 -3035 -1990 -1137 -3946 591 8280 5053 -3982 4262 7309 4594 1308
26009 1308 -4465 -5135 1319 -419 -1587 10033 17957 21825 13922 6053 7926 4156 -854 -3786 2471
25994 2471 14249 15807 14380 6402 192 2465 7118 6489 7278 4540 8225 5522 278 562 2086
25979 2086 5977 12605 17930 14310 3375 -6770 -984 3569 5222 3798 8825 10339 12681 7688
25965 7688 52 3229 2990 -3519 -13644 -14541 -15558 -13838 -8307 -10486 -8233 -2933 -4506 -1985 -1352
25950 -1352 3711 4796 5879 8810 6653 1967 572 -1143 2291 1060 2900 2724 6418 11533 12174
25935 12174 6661 2261 693 6778 4248 -52 -1316 1279 3091 5803 5810 5666 4272 3503 5297 1016
25919 1016 -4006 -6779 -1405 2331 11737 9357 6892 13398 12068 10126 7303 9128 9560 7846 6835
25904 6835 10550 12523 8354 3461 10298 11629 12193 12559 11674 13197 10384 -5705 -12563 -8068 -4537
25889 -4537 3286 5396 8391 12167 9407 1435 1358 -1094 711 4580 4110 2191 3507 7199 13743
25874 13743 15751 9640 10469 8587 11221 12048 8706 16333 17035 18048 12184 6633 2903 -172 -1784
25859 -1784 1961 2988 5862 5461 5677 8456 15559 15829 9604 3666 -3075 -2261 -2427 -6793 -6136 -2244
25843 -2244 2580 3227 -4855 912 7974 7874 3483 5896 4349 6084 7051 7203 10251 1251 -3966 2123
25827 2123 3443 126 -5572 -4534 -360 -513 -2055 698 1854 1093 -3121 -1457 -446 615 4806
25812 4806 4130 -3549 -7195 -3790 -3100 -1625 1021 -2543 -2585 -1849 -2936 -302 -3007 -5938 -941 -212
25796 -212 -3708 -4527 -3375 4310 12652 8562 8334 4868 8356 5265 8881 8034 2552 3860 2669 1339
25780 1339 3728 -3342 -2128 1957 7716 10603 1727 -4375 -4894 -1376 2934 5934 2726 -4359 -2000
25765 -2000 -1718 8 -1495 -3532 -4878 -2659 -585 2146 2802 -581 -604 -3463 -561 3727 5053 12426
25749 12426 12631 5345 5054 11097 12165 13227 9938 5004 7684 7177 4252 -3347 -4903 -6343 -11647
25734 -11647 -2381 3128 -2396 -3992 -3280 212 5715 8243 9846 4276 -2165 505 -428 -251 5749
25719 5749 3536 475 -1949 1231 3367 909 2844 10587 13535 8698 -1424 -853 4499 -46 -3385
25704 -3385 3935 6644 10693 8543 4686 -2319 -3218 -2518 900 6203 10162 8600 6559 8086 3770
25689 3770 -1976 -6162 -6668 -9256 -7435 -4560 -5112 454 -1999 2251 8428 6604 4371 7848 10694
25674 10694 7848 5602 2192 -4138 -12993 -8834 -8142 -7070 -8570 -6861 -4513 121 2811 8142 7787
25659 7787 7739 5128 2329 -2495 -6536 -1711 -854 -2260 7553 12709 6647 2584 3690 7133 8907
25644 8907 3033 7955 15224 13199 9257 1024 2805 1952 -435 4591 10510 6423 92 1651 4964
25629 4964 9561 5113 -2462 -4526 -5423 -5182 -6202 -2267 -1473 3130 8475 10739 11406 3261 1688 5671
25613 5671 7116 2189 -441 3943 3785 3185 5704 6044 2121 -1791 -2955 3157 3482 92 3670 7520
25597 7520 1469 -3775 -3524 -7701 -6331 -4112 -2584 -531 1095 473 -927 1324 1870 -3734 1043
25582 1043 4876 6346 1596 -3275 -6050 -3628 -1059 -8033 -11423 -8838 -3535 -3370 -4534 -1500 1210
25567 1210 1951 6741 9672 5234 6447 4055 7605 13563 10189 12733 10002 5425 6078 11425 9846
25552 9846 8700 6089 -107 -2609 -1432 1525 -1712 817 -526 543 -4088 -5234 -4425 -1818 1700
25537 1700 2906 5774 8275 5530 2056 2014 5177 1052 2831 8655 1642 -2005 8910 11876 2801
25522 2801 -566 -5894 -8350 -6815 1108 5318 3877 81 2824 242 2473 7539 5867 -651 4676
25507 4676 4376 3999 7576 1777 -262 -4027 -3641 -6419 -8424 -2673 2612 3148 4518 3966 -81 -176
25491 -176 -9288 -10498 -7571 -8127 -10300 384 8183 5727 2502 -135 -1742 -1810 869 9078 9926 4993
25475 4993 4588 7795 3061 -6149 -7378 -4838 4351 9639 11213 11571 5422 3394 8842 7780 8260
25460 8260 12052 9569 6859 10614 11218 8380 10225 11496 10038 14175 10212 3647 -1362 -9183 -6576
25445 -6576 -2708 -1337 6248 11346 5168 2355 94 4253 7963 3276 2267 8442 11687 7140 4023
25430 4023 3512 -576 -6313 -5610 -461 1257 -925 -4955 -3197 -5974 -7304 -9479 -5090 -4111 -2323
25415 -2323 3724 3844 -800 -2834 -5053 -10035 -8805 3430 2756 -3528 -5705 -5846 -3650 -2886 -1470
25400 -1470 2482 6876 6528 -419 -705 -5934 -10955 -7807 -6994 -2769 -126 5352 6888 4863 6784
25385 6784 7639 -1812 -1936 -1843 2844 12093 10907 9070 4658 -1267 -7016 -3298 4183 5221 5713 8881
25369 8881 12100 13788 5449 -3012 -8506 -7555 -10222 398 9785 5399 7162 2779 -3566 1923 6816
25354 6816 4726 5792 11979 15016 20126 20492 15065 11194 11325 12542 6887 2571 8413 9888 7227
25339 7227 7986 2866 -3097 -999 4235 7427 154 817 2887 -6869 -6636 -1281 890 6880 10887
25324 10887 8645 7983 4495 -3860 -2834 -6316 -9135 -11646 -7001 -403 3020 10233 17917 23277 32904
25309 32904 30694 16778 1255 -18599 -28674 -23053 -294 13702 16231 13184 705 -18696
25297 -18696 -32931 -44184 -55572 -64155 -67939 -60814 -48244 -45919 -46475 -34579 -17596 -2648 9719
25284 9719 20295 31913 33145 29575 13473 1156 -5717 -8667 -3823 8636 10589 8262 5712
25271 5712 3413 9963 19781 25665 27029 33343 37883 35692 26225 22078 15566 9317 2940 706 68
25256 68 -1243 -5463 -6739 -5188 -6918 -2146 3984 9973 6501 2790 3859 1838 7084 13061 9073
25241 9073 2742 4683 6862 5268 10027 14237 17860 11967 4160 3895 2373 2472 7939 7355 2603 924
25225 924 1067 -90 759 313 -3143 -4144 -2416 -1759 -4840 -431 -1605 -3826 -729 7568 7886 3469
25209 3469 4343 5080 6524 9166 13185 13343 11877 5933 6498 7457 8354 1908 -2249 -5245 -6062 -1755
25193 -1755 -4511 -2077 -3973 -12573 -10654 -8850 -5722 1870 2620 176 -456 1979 -3906 -8535 -5981
25178 -5981 -4773 -3619 1281 2154 -3137 1145 4598 818 328 1578 702 -2443 -4522 -1821 -2168 1746
25162 1746 3959 5726 5805 1449 -630 2345 4786 2536 830 1101 5893 5458 6618 5547 6465 8803
25146 8803 4600 3816 1274 -1961 -8532 -9219 -4184 2349 -1910 -8580 -350 3774 9151 2478 2094
25131 2094 3216 -1385 -4725 -840 -5549 -7325 -5776 -7799 -11824 -5191 -6286 -9287 -11569 -11052 -2366
25116 -2366 -2584 -10724 -10130 -1515 3403 4554 6668 1451 -7285 -12309 -6767 4914 15732 15719 7934
25101 7934 1018 1118 3710 3524 11283 21027 20445 18920 14641 11425 6343 7228 7422 6153 5059 1084
25085 1084 10190 10532 5312 7334 3768 -1617 -6521 -3747 -2575 -3772 -6986 3097 4375 6634 12611
25070 12611 12094 14280 13907 20114 16488 8650 5058 835 -3271 -3963 -322 13922 13380 8040 8325
25055 8325 -2228 -5478 -582 -5412 -6504 -2160 1132 2038 -1044 1102 10481 18549 15264 15189 6403
25040 6403 1804 3019 2059 -943 -3172 -3145 -2292 -6489 -2969 -1168 -3872 -4223 -7619 -5313 -5065 -3922
25024 -3922 -175 -2569 -1083 1900 2135 -1181 -2224 2256 3616 -906 -4475 -6814 -6359 -3107 2495
25009 2495 4775 2204 3344 5686 3075 -103 -5492 -849 2805 445 -1833 -7669 -9892 -12623 -11096
24994 -11096 -4088 -268 1776 211 1085 2177 1838 6251 2584 3807 -1010 -7598 -1352 5124 2209
24979 2209 1082 -3692 -5634 1203 9476 2226 -1993 -3081 -5928 -2753 671 1571 -34 -2532 -1425
24964 -1425 1132 3615 7830 13176 8513 1532 -4526 -10048 -10170 -7285 1722 5923 565 639 3654
24949 3654 2974 1154 -4525 -462 2588 -898 -1094 -1892 -5004 -5286 -1545 546 2545 10706 14566 15299
24933 15299 13756 5628 5391 5284 3571 1536 -3095 -5154 -2941 -2307 -852 1109 3119 4096 1811
24918 1811 -3296 74 -395 4280 3373 1201 1278 4144 11647 11081 8283 -754 -9652 -11056 -8634 -5285
24902 -5285 -8345 -10385 -10261 -6629 595 4309 3394 -1944 -1532 4076 3321 -2339 -934 -1773 -2557 23
24886 23 4134 4883 6649 6083 5416 4450 12185 11513 10012 3611 5930 7138 5358 5262 4634 5127 3523
24869 3523 -5145 -4625 -5121 -6007 -10518 -5785 -5339 1649 353 -675 8191 12316 7024 286 5008 7282
24853 7282 795 -3388 2574 2646 -19 -5683 -5493 -5702 -11494 -12865 -1541 5297 11691 9278 6241
24838 6241 -250 -3073 -5299 -3705 -3758 2939 6876 4760 5821 2440 -3584 -1117 5397 4026 -970
24823 -970 -7653 -12792 -11464 -6685 -6762 -6465 -2574 -3212 -4730 -3988 1863 4669 -274 -2552 -134 6769
24807 6769 8036 10020 17972 14459 6598 -3181 -10001 -7773 -6580 -2649 3562 4329 -3881 -7571 -6262
24792 -6262 -7975 -8760 -4468 -3866 1722 4979 5635 8975 6996 4956 1218 -7178 -9304 -5409 -4824 -7982
24776 -7982 -8621 -7238 1228 3210 -811 -1239 -681 -4143 -2864 -2162 2314 8669 11483 12500 14488 9802
24760 9802 12989 10361 11119 2466 -1651 -533 -433 3680 4424 1655 468 -3584 -7059 -9737 -7640
24745 -7640 -3314 -6929 -14933 -17676 -15285 -10786 -6432 -6140 1435 2690 -324 -512 965 -1205 917
24730 917 4374 12870 16150 18187 16495 14034 17615 11848 3719 -1569 -5720 -1225 114 3895 1622
24715 1622 886 1907 619 1289 -3089 4365 4647 6559 7345 9967 4327 1089 -2704 -7793 -4530 -1018
24699 -1018 2879 4570 6666 9757 16094 11181 2697 97 -309 2102 3430 2088 -694 3855 7086
24684 7086 -4357 -10496 -7799 -5410 -2950 -4051 -6034 -436 457 3632 5312 6713 6313 4417 -2949
24669 -2949 -6878 -9028 -10512 -4938 7085 -557 -4317 -2477 -3779 4267 12389 11283 2336 -7499
24655 -7499 -1903 -4578 -7198 -1 10618 7238 6575 7267 8537 7216 8568 8230 11126 7116 6555
24640 6555 3947 5084 4581 2865 -3276 -2470 -6188 -6295 -4854 -1902 277 -8353 -12240 -7940 -4818
24625 -4818 3165 11949 12704 9185 7824 7824 8315 9231 4284 -454 483 333 -1122 -7453 -9836 -1051 4005
24608 4005 429 -4611 -3587 -1056 590 -1494 -6107 -18 5943 3866 -4973 -5251 -1759 -2298 -4951
24593 -4951 -6390 -2892 2212 78 2522 8365 7575 3197 -4870 -1913 4438 2715 7738 8764 5355
24578 5355 -2519 -6620 -4127 -3847 -10456 -9609 -4561 -3203 3415 4767 9849 2501 -2674 1455 5267
24563 5267 6431 4971 488 4047 8274 5577 4413 5038 11447 4110 -1748 677 3768 8481 1897
24548 1897 2863 1399 -1299 1892 3130 -3122 -9117 -9681 979 6156 5736 5264 2561 -856 598
24533 598 7285 3148 -1218 590 4919 7655 4676 6803 8061 7277 5056 4620 10711 13334 6254
24518 6254 3649 5592 3357 2715 603 1388 6024 7590 13996 17984 10097 8329 8656 14653 8730
24503 8730 4355 2738 4022 5651 7954 13612 15564 13224 16159 15399 5468 5935 12829 19207 15696
24488 15696 9762 6556 1174 -2120 727 -4364 -4121 -1154 404 5641 4792 7401 7984 5265 3633
24473 3633 2548 3939 2363 2555 -2492 -6173 -1386 1444 745 2042 5229 2247 -8148 -5301 3663
24458 3663 6627 4649 4813 3958 5790 2340 -6253 -10995 -7657 -5533 -7394 -2937 62 1598 -4974
24443 -4974 -6669 -1143 990 6777 1772 -656 -2711 -434 -2189 -5317 -1024 -301 2886 4127 6294
24428 6294 2020 562 -1105 -3818 3040 187 -4702 -9386 1441 6570 1445 -4231 -188 -853 185
24413 185 2946 8431 6497 6630 5612 954 3555 5832 9904 13842 10162 10054 3219 -1257 -2768
24398 -2768 -7210 -5105 1239 4087 4606 985 -2716 -9491 -16216 -11932 -5205 5018 6862 -264 -4320
24383 -4320 -776 2491 2986 3143 3650 7128 9764 10481 4393 -363 -3980 705 -3469 -1930 -2693 -3537
24367 -3537 -1 -47 -1246 3625 11500 8574 5112 2911 5137 -1457 -8113 -5236 -1993 -3539 -5967
24352 -5967 -4807 -5553 -3407 -3235 -743 -124 -3271 -5722 -7853 -3060 1612 -3045 -4971 -2163 -1057
24337 -1057 1170 3666 363 -1103 2991 5845 -17 -5055 -7760 -13279 -10253 -589 -230 -631 128
24322 128 4508 7662 2751 419 -734 -4921 -4635 -60 623 573 9162 13050 12075 8566 -2409 -7467
24306 -7467 -4303 2884 6458 -1823 -4081 -808 -2227 496 1457 4291 4714 -5416 -10742 -9465 -10951
24291 -10951 -7357 -9975 -6360 -1225 -3673 -7015 -9798 -11059 -8161 -7360 -3145 2446 3115 308 1643
24276 1643 6821 3883 4616 4212 1328 -2343 -3569 -33 7828 3017 1863 2594 -300 642 4642 9786
24260 9786 9933 7154 2827 -4816 -4960 -7996 -10784 -6492 -1597 -207 -165 767 5074 11981 16006 13604
24244 13604 10543 11803 13220 10543 9602 11805 13972 9463 851 -788 -1532 -9306 -7586 -7304 676
24229 676 7339 4654 -1928 -3910 -9352 -10862 -7430 -4487 -3244 -6441 -5264 -3181 -4713 963 2465
24214 2465 2764 3978 -5600 -11346 -13399 -10128 -4930 -2853 -233 222 1976 -3813 -8953 -6732 -7895
24199 -7895 -12846 -10198 -8378 -9967 -5419 -6961 -14756 -19866 -11217 -6238 -3161 -3102 800 2426 4000
24184 4000 7187 9447 11811 7987 7738 6528 7643 6611 2442 7689 6296 11228 10463 3480 2938
24169 2938 1752 699 -53 -7617 -2624 3183 3981 4739 -2486 -4740 -6290 -1390 -2612 -3527 1468 2215
24153 2215 -3093 311 6534 9226 5890 4006 -2173 -3819 -1761 -4559 -5532 -7088 -10118 -11561 -4650
24138 -4650 324 -2490 -612 -257 6022 9888 13905 15046 7387 -384 -4283 -1809 -1264 -3096 808
24123 808 -2901 -2153 -284 1990 -4467 -5217 4617 517 -7525 -8366 -9994 -13175 -11925 -6815 -3454 -3521
24107 -3521 -2999 1093 -722 -4254 -2223 4641 2582 -42 -1477 -2611 2662 4780 5949 6109 -27
24092 -27 -1847 -106 1437 4584 9215 11812 17621 14023 4136 4704 9108 8025 5336 10974 6087
24077 6087 11199 15208 13157 13927 14908 8089 3859 -1278 1331 4223 1646 3499 5127 5311 -85
24062 -85 3192 -1955 -9384 -6474 -1364 2970 7468 6444 2296 9997 14830 15969 16866 14149 10352
24047 10352 6013 5483 2942 -1860 -7236 -5009 -694 -3339 -7885 -3310 1479 4890 7247 9259 7192
24032 7192 5750 1866 723 -452 -2994 -1678 -2365 -830 -4424 -10873 -12437 -7621 -1843 -9418 -10143
24017 -10143 -9938 -15304 -15276 -9222 -8320 -3891 -1228 8387 -260 -6925 -4305 -1284 5346 6425 6596 7866
24001 7866 3711 3642 8883 5493 7740 10539 8061 5178 4316 5366 1341 4353 8346 8832 5915 475
23985 475 -1121 -2147 -4819 -5558 -3253 2487 9059 8417 5754 8480 10738 12671 4507 2180 4791
23970 4791 3759 7357 10801 5246 -5339 -9022 -684 6506 7575 9510 2368 -7378 -8281 -8428 -4428
23955 -4428 -3827 -1556 4079 2838 7273 5656 7819 7245 2173 -773 -5043 -2506 -796 -254 -3584
23940 -3584 -4075 392 4843 6787 3698 2513 -2364 -3429 -1475 -997 4830 3540 5621 5252 738
23925 738 546 776 -817 -1357 -4660 -7152 -5911 -2378 -3666 -3886 -4114 -1079 208 5377 7390 5298
23909 5298 6590 8483 6701 1505 -5416 3304 -1204 -4267 -2013 3255 5272 6737 2825 1488 3780
23894 3780 1440 -790 2153 3717 3600 4963 1702 -4692 2816 5309 3600 -1572 597 1173 1594
23879 1594 10209 9202 3967 6497 9572 1996 -7276 -11713 -3186 4989 3467 660 -4114 -5022 -3854
23864 -3854 -3090 -4365 1139 3674 -531 -2637 -4269 1270 4124 7643 10096 5760 1590 2393 3331
23849 3331 1151 3736 -2039 373 -552 -6656 -6022 -7117 -9069 -9248 -8020 -3416 -984 3347 3698 3626
23833 3626 3154 7001 2494 -1408 -5038 -4822 -404 5730 5682 2827 896 -3171 -11051 -8441 -9569 -13415
23817 -13415 -7538 -7 1865 -4586 -2698 -4001 -3341 -5890 -7866 -5345 -4656 -707 4348 8617 1744
23802 1744 5246 -792 -3367 3647 14898 15616 4734 -742 448 3673 4190 7169 6523 -834 -2310
23787 -2310 1347 3716 2209 2173 -2718 -965 -1432 -6582 -8491 -2598 6193 9281 13769 17026 14640
23772 14640 12287 11439 9618 2401 267 776 -603 -4602 -10253 -7666 -6386 -5978 2581 4753 119
23757 119 -92 1536 -3487 -9577 -7579 -7494 -11649 -16839 -11840 -10579 -5181 -6919 -8413 -806 5761 3696
23741 3696 7478 10012 9988 10326 12205 10024 1948 1152 3819 1999 3200 3134 -1141 -394 -858 -2258 -10175
23724 -10175 -6308 -509 4075 1744 -2004 -1806 2799 6300 5588 1752 -1109 -340 989 2313 5749
23709 5749 11531 9975 4775 1660 -2421 -1226 -1527 -4240 -1701 -2278 -5970 -7211 -5763 -7414 -11048
23694 -11048 -11312 -4508 -5661 -6288 -28 909 3434 7302 8040 -515 -6426 -6309 -5334 -4704 -11459 -11888
23678 -11888 -12962 -9738 -3975 3240 4645 7249 9175 5276 1346 5724 3969 443 -1828 453
23664 453 223 -5892 -6006 366 3868 4878 2601 3194 4741 3874 4029 7544 13025 12657 14259 6725
23648 6725 2806 116 -1803 -2096 -2707 -6344 -8174 -6021 -2175 788 2444 -4523 -5030 -7815 -11173
23633 -11173 -6919 1798 4416 -1197 127 3349 3880 1596 -1003 1767 -772 -6202 -13717 -10307 -8524
23618 -8524 -10107 -4986 -1709 -833 -4444 -1719 -706 -4325 -8991 -8163 -6866 -8710 -7629 -9837 -16710
23603 -16710 -19974 -20309 -13286 -9045 -3784 3419 3438 5031 4111 -250 599 4704 435 -5863 -9030 -10785
23587 -10785 -5826 -3183 -1399 1533 3668 8463 6570 1494 5753 7921 5811 716 -8155 -9607
23573 -9607 -3125 1841 2735 2108 -4497 -5581 -7249 -4560 -673 1645 3284 -1647 -1353 2036 2456 -2384
23557 -2384 -2807 -326 6474 9370 8062 6037 3343 5086 823 683 -93 2773 5599 373 1083 850
23541 850 3870 2428 8475 9453 7192 388 -4341 -2365 -2143 -3433 -4477 -8282 180 5314 2534
23526 2534 -3585 -9492 -15431 -20205 -19320 -11885 -3655 3 -344 -1390 2121 5644 6000 -427 -6545
23511 -6545 -13482 -13400 -4074 -841 -3713 -3468 5728 9900 12462 8045 3603 -1199 -2392 -19 -1352
23496 -1352 -138 -8535 -11056 -13640 -15621 -22399 -22752 -12857 -6409 -6838 -8197 -6160 -4996 -1951 4056
23481 4056 8287 6003 4070 5824 5460 3545 6669 3408 2511 2587 3269 -502 -10116 -10387 -4897 -3986
23465 -3986 -7594 -12348 -7804 -1430 -1469 4857 7254 3210 -2018 -1430 992 764 1191 -44 -4868 -7128
23449 -7128 -4959 -6474 -2892 1620 -1372 -5255 -1740 4504 8890 8901 6322 1620 -2855 -631 -1157
23434 -1157 3941 3300 -1097 -6248 -1769 -1785 -3746 -5963 -12059 -16642 -20755 -13864 -2675 4984 8696
23419 8696 6077 10809 16310 10656 4572 3850 1010 -2892 1997 -1083 -4102 6672 12168 10746 6022
23404 6022 -323 1904 -424 -5172 -3034 -8262 -8094 -7218 -3444 1773 -542 1074 -1730 927 2919
23389 2919 1756 9016 14066 7686 800 -1749 2409 -1962 -6851 -4178 -2281 -5854 -7028 1643 9104
23374 9104 -456 -8449 -3855 -6672 -12428 -13413 -6000 -7897 -10201 -4339 -2627 3642 218 -5893 -4558
23359 -4558 -6016 -5465 -15513 -13286 -5170 -9102 -16930 -15198 -4611 -4426 -1871 2324 -2179 -1757 5482
23344 5482 616 -2914 -75 3726 6655 6933 7876 8523 4313 1436 2108 7682 9914 6812 7551 -770
23328 -770 -9015 -11320 -6250 -9441 -10893 -6787 -3276 -6294 -4764 -2748 -2974 -7007 -10935 -10393 -7648
23313 -7648 -8259 -12003 -16225 -13510 -6162 -3178 -8744 -6697 1297 6734 -2312 -3477 4321 8699 2255
23298 2255 -3937 -5589 -7081 1868 5819 1652 -1235 2131 443 -2496 -6826 -6526 -7055 -16065 -13771
23283 -13771 -3124 -11876 -11423 -11909 -16694 -16808 -14726 -13632 -6860 -1160 2541 835 3217 5080 3840
23268 3840 -464 -1252 -4450 -937 3360 445 -4974 -4860 -5431 -3193 -7467 -14508 -13092 -10236 -15953
23253 -15953 -16590 -7779 -5331 -6142 -5400 -3688 -1236 52 -3961 -2323 3150 8690 3579 314 321 -2510
23237 -2510 -4516 -881 -6851 -9355 -11004 -8927 -6785 -2626 -6329 -12063 -5125 2863 -2076 -8511 -12854
23222 -12854 -14736 -9649 -4622 -1043 2743 6356 95 -2198 50 -1467 -3866 -2945 -5671 -1649 317
23207 317 6197 6624 5143 9115 8907 11118 11018 4910 1981 1870 5890 3330 3779 866 176 853 -3637
23190 -3637 -7782 -7763 -6895 -6170 -1802 8526 10664 6565 -2300 -5821 -5837 -10453 -10237 -5979 -863 1085
23174 1085 547 -1561 -5228 -9171 -3650 5986 11256 3584 2456 -168 -8200 -12606 -10163 -5959 -5008
23159 -5008 -2043 -781 1566 -53 918 -5432 -7737 -7657 -12451 -20418 -16412 -8955 1114 2733 5094
23144 5094 -81 -1922 4349 4583 6619 4342 3852 3462 4642 3066 6100 4934 -489 169 6554 472
23128 472 -2194 -893 -775 -4186 -3314 -1437 -4421 -429 -3678 3952 9168 5412 2257 1871 6008 7135
23112 7135 3331 -205 983 6933 4348 4841 873 -2082 494 -3084 199 -4245 -4117 -3010 2139
23097 2139 931 -2522 917 3602 6606 4061 2056 3410 3651 2233 -821 -2067 -829 2818 2109
23082 2109 -609 1987 -3955 -11150 -7598 -5258 -3688 -8704 -1671 6286 -2278 -4293 1130 -4720 -6709
23067 -6709 -3358 788 -5853 -9035 -6913 -8159 -5413 -10037 -15044 -12147 -11761 -14059 -17782 -16190 -17341
23052 -17341 -14438 -15698 -12521 -8443 -8081 -6124 -11465 -8821 -3492 -1697 2542 3775 919 -8767 -10976
23037 -10976 -3640 -1808 -4756 -4819 -8194 -6230 -185 -630 -10930 -14406 -16416 -9912 -4527 1912 325
23022 325 4629 -902 -7249 -10529 -18146 -21613 -18702 -9381 -4690 -2667 -5003 -4347 1019 1531 -4237
23007 -4237 -2473 -4984 -8815 -6820 -10618 -9960 -5901 1542 -2776 -5875 -6592 -1297 5224 100 -10083
22992 -10083 -4152 2158 -1433 -2010 -4867 -7046 -13822 -9775 -7596 -12492 -8802 -1910 3190 5082 1815
22977 1815 1854 -865 -6074 -14767 -17302 -17216 -12746 -2488 6359 8262 3459 3267 7955 1500 6411 5975
22961 5975 972 1142 4485 4675 2752 -2912 -5414 -5106 -6273 -5156 -4003 -8233 -13107 -12781 -7895 -2607
22945 -2607 4218 6300 5430 8267 -3456 -10901 -9869 -11902 -9134 -2770 -1437 -5093 -13857 -17776 -9500
22930 -9500 -1007 3145 -2962 -10167 -17012 -16460 -13021 -8242 -5230 -1292 1112 3995 -4279 -9344 -14446
22915 -14446 -12074 -4810 -3668 -1535 2258 5310 4467 4754 4454 119 -1185 228 1743 -667 4247
22900 4247 5363 -2516 -5761 -9033 -8627 -3680 -2210 2538 2499 -2472 -7877 -13525 -7091 -672 1791
22885 1791 2125 -4798 -12852 -11825 -3134 -753 4008 1467 6938 6149 211 -1339 -2298 -2698 -1721 -2273
22869 -2273 2607 3789 -1458 393 7025 5493 325 704 -4130 -1751 -470 862 -5257 -6867 -11325
22854 -11325 -11637 -9422 -10820 -8402 -6431 -5232 -1300 -2480 -361 3111 3778 3048 -165 5475 6097
22839 6097 6660 3756 1196 386 4849 2509 1274 -2520 -1881 1426 830 -120 -1918 -4320 -6758 -3717
22823 -3717 -3886 -8720 -4543 -9863 -13642 -11666 -5672 -6689 -5689 -3470 -3598 1257 299 -875 -9908
22808 -9908 -8675 1412 3513 2756 4220 739 -1869 4887 5260 -1295 -4112 -2202 -684 -1201 -4128
22793 -4128 -4061 2249 1260 -11308 -19649 -20011 -12408 -10034 -4265 -2423 -681 2595 554 -5009 -3164
22778 -3164 -157 -3912 -10552 -15106 -8258 667 -1063 -5541 -4672 -4478 290 -1613 -4471 -6544 -4949
22763 -4949 -4655 -4465 -4902 -10819 -14665 -8086 -9981 -12191 -7778 -3694 -2168 -6994 -8631 -5479 -8950
22748 -8950 -5577 -2044 -1909 -5206 -6492 -9204 -9659 -10859 -20572 -10917 -12829 -11905 -7268 -14389 -15087 -14789
22732 -14789 -6662 -7180 -6247 -8429 -9890 -10630 -9131 -9398 -15052 -19205 -22188 -21489 -23600 -16498 -11583 -9659
22716 -9659 -6476 -6987 -9739 -13275 -10220 -7928 -10036 -10132 -5717 -8553 -3375 -6029 -3935 -2233 -4657
22701 -4657 -7573 -6058 -7341 -8172 -9771 -14389 -14050 -9725 -1326 -322 7094 12042 8178 -3767 -6202
22686 -6202 1155 4044 -1918 -3935 -5760 -6978 -4878 -4063 2323 10374 5271 1588 -2373 -2242 -2132
22671 -2132 -5930 -5319 -7596 -7801 -7636 -8368 -7016 -1881 -3483 -1428 -7303 -9715 -7674 -8187 -6643 -10105
22655 -10105 -11392 -13196 -3892 -5632 -3294 -4221 -2492 -5898 -5955 -3231 924 -430 -4556 -10719 -9278
22640 -9278 -5797 -5264 -39 -3610 -6427 -3745 -833 1621 -1392 -5336 -525 2983 -3806 -5487 -6373
22625 -6373 1075 6315 4790 838 -8359 -17876 -15328 -10263 -2211 5469 50 -1847 2428 12432
22611 12432 15606 11560 8053 3794 5932 12031 7402 -6475 -10299 -11017 -11566 -1752 4862 7032 -2010
22596 -2010 -4850 -2590 966 5757 1536 -688 962 3185 1941 -207 944 8579 8429 5273 -2664
22581 -2664 -1445 -2518 672 -1326 -5325 216 554 -5145 -11307 -12578 -12775 -17050 -12019 -5637 -12116
22566 -12116 -15584 -9401 -8506 -11498 -10295 -17806 -13993 -5422 -1839 2122 8287 3578 -16 6610 2327
22551 2327 -1397 -478 -925 -739 -577 -2095 -7716 -9501 942 3650 4622 4637 2439 4953 918 3474
22535 3474 6835 2853 702 3139 -3786 -11671 -11318 -8337 -7755 -8819 -9423 -8932 -3282 5408 9432 5209
22519 5209 -1047 -1976 -2974 -9478 -9776 -6963 -5783 -10542 -15555 -12204 -8713 -11003 -13242 -15944 -19855
22504 -19855 -16709 -10515 -892 3783 7403 7572 8729 4455 3629 -728 3107 -1311 -7026 -4380 -2465
22489 -2465 -2537 -2227 -7093 -11565 -11598 471 11000 1865 -6102 -8597 -5072 -3445 -1762 -1678 -1869 -1738
22473 -1738 1712 -7185 -14139 -11787 -8556 -3973 2053 3418 -1679 -803 -632 -4874 -2036 2837 12509
22458 12509 20109 21616 21106 12209 2819 -6784 -5000 -2002 -495 -3061 -5862 -11433 -11206 -2625 562
22443 562 2367 3974 -4577 -8497 -4414 -7388 -8669 -10233 -1031 2646 -3194 1018 6454 8443 2238
22428 2238 -1581 -6400 -9467 -4136 9331 12013 7400 3261 2795 -1562 -9916 -11719 -10012 -11443 -4224
22413 -4224 -894 -1542 -4383 -6346 -5415 -2948 -1434 -478 -3933 -11689 -9703 -5494 -5500 -7757 -3271 -7981
22397 -7981 -12221 -7811 -7957 -187 -812 428 1543 920 8063 15422 16741 13616 694 -997 4722
22382 4722 4795 -3753 -6185 -2693 -801 286 1109 -4876 -6407 -6551 -506 4864 4093 -2046 -2372 -3799
22366 -3799 -6429 -4180 -5361 -5430 -1538 -2285 928 3102 -317 275 4600 4139 -3008 -1360 2031 -9670
22350 -9670 -15497 -14882 -15566 -8663 -6450 -9494 -11562 -16971 -16050 -8198 -8878 -17699 -26207 -23933 -14595 -6893
22334 -6893 -6710 -8921 -10174 -8855 -5708 -6786 -9679 -11946 -10083 -7201 -3171 -5850 -8693 -7957 -1533
22319 -1533 578 -5221 -4655 -3567 -3986 4727 7243 4436 594 -1292 -4329 -8495 -6192 764 2400
22304 2400 -523 1249 2266 2852 -3099 -4711 -144 -253 -2517 -2243 -4987 -5758 1484 8513 5889 3583
22288 3583 2115 -2114 4421 8364 6381 6095 -267 -4513 -3504 -305 -1624 5561 8115 791 698
22273 698 4236 7422 6326 1836 3131 1433 -640 -1315 -794 -7455 -11359 -8610 259 4198 3420 -47
22257 -47 -3952 -4293 -4959 -9973 -8825 -8141 -8379 -10207 -6899 -471 -334 -1954 1636 1493 -3847 -4901 -2766
22240 -2766 -1188 809 -16 -4569 453 632 2655 112 833 -717 -279 -2503 -5416 455 4150 4964
22224 4964 7407 7522 4345 -2771 -8413 -8421 -16807 -13210 -8818 -1589 11388 12005 4924 3780 5427 2499
22208 2499 2911 3452 1154 -4397 -7748 -10470 -10419 -2960 9690 13076 10770 5286 -6864 -7946 -7263
22193 -7263 -14756 -12971 -4840 -4793 -2777 -4482 -4864 -3762 -9309 -14330 -12472 -12810 -13224 -8896 -7420 -8812
22177 -8812 -8293 -6161 -3623 -4450 -1774 -2503 -9628 -16624 -15219 -5073 -2429 1695 2 -7084 -6173
22162 -6173 -8292 -9316 -6740 -8013 -9230 -9746 -8796 -11725 -12459 -8611 -8472 -17456 -19317 -17640 -4905
22147 -4905 -8373 -11221 -8908 -6258 -4453 -9283 -12341 -11530 -12271 -16462 -20976 -18935 -11133 -10944 -3606
22132 -3606 605 596 -2678 -11595 -12546 -10951 -10896 -11014 -10935 -3546 -1819 330 7575 8804 7767 5522 5624
22115 5624 7778 8418 -93 -6140 -7435 -5808 -4243 -2334 1515 -990 -9624 -13042 -5791 -9032 -5227
22100 -5227 4132 -287 -4357 -9306 -6055 -924 -1126 -5062 -6560 -5096 -8601 -8199 -7233 -4802 -2563
22085 -2563 -172 -1955 -404 -1021 -10564 -13705 -4001 -2686 -2302 -32 -1086 -6290 -9111 -8539 -7957 -10881
22069 -10881 -19974 -17031 -10967 -12409 -9770 -3216 -1914 283 -1539 -5120 -8853 -10758 -18536 -16760
22055 -16760 -18433 -14886 -5725 -3838 -7881 -10216 -11290 -6413 -276 -4484 -4944 -1420 6574 5150 -2707
22040 -2707 -5996 -292 -1769 -2194 2067 6247 6949 2987 599 -6663 -8589 -3440 -8212 -8663 -7818 -13539
22024 -13539 -13334 -10101 -2665 -1552 -3186 -3184 -8734 -9492 -375 3985 366 -6611 -9304 -8820 -11836 -16866
22008 -16866 -13201 -7030 -5233 -9628 -15970 -13597 -9886 3199 7188 -4471 -8804 -7657 -13410 -8655
21994 -8655 -1052 4533 11 -1893 1712 -2 -731 2172 3794 7060 13 -8175 -5722 -6089 -13073
21979 -13073 -15375 -11295 -4854 5380 5792 3255 6306 1854 -2143 -2442 4022 12463 10434 4419 5214
21964 5214 -423 -10514 -5962 4540 7624 7765 4705 -4790 -5947 -5083 -875 1898 -2589 28 -3787
21949 -3787 -6441 -9464 -12970 -12853 -15187 -8589 -931 3919 5893 2899 -4258 -1317 5017 1152 2702
21934 2702 -7185 -10713 -6677 -111 5796 3671 2791 4062 3359 -2012 -7449 -8985 -13058 -16045 -14676
21919 -14676 -17143 -15297 -15490 -11519 -8488 -7107 -14092 -17378 -15065 -16775 -13414 -10086 -11503 -9129 -3561
21904 -3561 -2460 -2591 5444 11387 9647 182 -4143 -4536 -9272 -13690 -12480 -7321 -9318 -8762 -8780 -14484
21888 -14484 -15425 -3599 -5247 -13988 -18182 -13433 -8036 -6432 -5861 -2917 -13327 -19557 -21755 -11341
21874 -11341 7250 11712 7812 7260 4248 2074 1686 -2049 -3233 -4122 -3012 -1133 -10067 -11188 -17453
21859 -17453 -14680 -9399 -7988 -7789 -3450 -634 -3845 -10671 -11574 -20056 -21675 -25009 -26188 -20496 -18642
21844 -18642 -13293 -5982 -4915 -3386 -4607 -15243 -13386 -4888 -3189 -11554 -13526 -12253 -17907 -24616
21830 -24616 -25761 -19810 -15794 -14835 -14572 -14292 -14541 -22203 -29201 -25060 -16875 -18164 -20580 -17864 -14499
21815 -14499 -12905 -10714 -9053 -8325 -5748 -4148 -9476 -11682 -13380 -20139 -19453 -14206 -12436 -17344 -8608
21800 -8608 -1327 8330 11917 7219 1572 -4993 -13179 -10021 -13238 -18960 -25428 -29346 -38028 -34073 -17975
21785 -17975 1064 19626 17043 -5998 -28044 -42108 -44138 -13491 31123 75313 106867 133143
21773 133143 145657 149419 153269 150281 131626 92953 38675 -14600 -53659 -56791 -43920 -22394
21761 -22394 -160 4430 -3317 -6576 -13440 -6592 10197 24223 15791 3561 -4071 -13188 -22350
21748 -22350 -27477 -30002 -38690 -42373 -35197 -37740 -35623 -27457 -13909 -7050 -3128 -546 -9311 -11093
21734 -11093 -9290 -10646 -7601 -4671 212 465 2254 8634 11419 9927 -2511 -17567 -18961 -17322
21720 -17322 -16388 -18127 -9469 -12234 -15734 -16190 -14300 -10009 -6001 -11238 -881 -3160 -3185 -4145 -8798
21705 -8798 -8794 -11164 -15663 -14298 -7060 -3462 -3888 -3965 -2617 2236 2212 -2294 -6978 -13145 -11273 -8256 -6924
21688 -6924 -5929 -8187 -7748 -8634 -13499 -22930 -18345 -12056 -4930 -2692 -3384 -9838 -9883 -12795 -12146 -10482
21672 -10482 -10466 -12476 -15226 -11733 -697 -1661 3415 6100 3238 3206 -5304 -10756 -8104 557 -5192
21657 -5192 -13942 -14473 -11005 -7655 -7205 -5070 86 -3308 -10716 -12379 -9879 -4061 2001 -766 -2527
21642 -2527 -7451 -16454 -18870 -17412 -13432 -6434 -2684 -833 -9247 -12478 -11904 -14826 -16817 -11006 -2258
21627 -2258 -394 4659 3835 4269 6607 -3746 -6559 -10244 -8997 -7907 -6839 -2761 -5204 -2385 -1364
21612 -1364 -3325 -3345 -15058 -14129 -3783 2175 2980 -728 -1823 2636 -2239 -3207 2752 3072 752 -4025
21596 -4025 -7720 -4176 -2232 -2907 -2262 -572 2885 -4119 -11894 -14729 -8978 -11875 -10332 -3240 -2758
21581 -2758 -2633 -887 -3266 -6977 -5915 -6700 -8558 -16569 -14673 -10458 -17290 -15913 -9013 -6002 -3524
21566 -3524 -6635 -6473 -4159 -9968 -13507 -9896 -8623 -4738 -7187 -2030 3748 -2260 -15094 -13265 -10024
21551 -10024 -7459 -13770 -8452 -4988 -10776 -10172 -5928 -6980 -5434 -4195 -3672 -4968 -8275 -14144 -7792
21536 -7792 -5938 -3962 -2288 -4328 -7324 -10840 -15845 -21649 -14077 -10537 -9762 -9739 -14171 -17117 -12327
21521 -12327 -3646 2994 9493 13153 9414 11680 10898 5103 -1576 -9258 -9554 -14312 -19183 -20973 -17265
21506 -17265 -8970 -6330 -5108 -6364 -9166 -10321 -18054 -14257 -12579 -8770 -3913 -4727 -1831 -2218 -3514
21491 -3514 -13 1822 -3582 161 3409 6710 8484 5189 -86 -4031 -5151 -2699 -1546 -1814 1575
21476 1575 -264 -7906 -7351 -6421 -4921 -12256 -12024 -3571 4641 128 -1792 -187 494 -1520 -3630 -4003
21460 -4003 -421 1803 -5084 -5747 -9437 -4845 199 2957 2040 -666 -2666 -5600 -3492 -2612 -1260
21445 -1260 2473 417 599 8330 7612 4665 5003 5795 -4762 -8713 -8342 -6672 -5550 -8484 -8977 -9392
21429 -9392 -7032 689 2292 2003 5908 2473 -2760 -7399 -3390 2476 0 -3712 -5444 -10383 -17767
21414 -17767 -13374 -2329 1990 -6737 -4271 -1773 -2658 2631 -832 -7928 -8430 401 -6651 -9570 -6124
21399 -6124 -4134 -6372 -6555 -7505 -7062 -9327 -14571 -15655 -15422 -15541 -10915 -7701 -11264 -15236 -15987 -10865
21383 -10865 -8712 -9951 -5853 -7301 -8906 -9721 -5591 -1907 -2257 -2093 -7027 -10670 -9344 -9068 -9767 -9474
21367 -9474 -4527 24 -3952 -7382 -11928 -6229 3142 4151 -155 1858 -5661 -12407 -11627 -11688 -14902
21352 -14902 -14268 -13208 -9397 -1807 4231 860 3455 -786 -3278 1972 609 -9222 -15898 -17711 -14672
21337 -14672 -10533 -13535 -11238 -6347 -6655 -8633 -8042 -8818 -10095 -9508 -2703 -4712 -493 -3406 -6496
21322 -6496 -11137 -11639 -10672 -10393 -5852 -8472 -10058 -3454 -1365 -5936 -11829 -8855 -9088 -9962 -10192 -6377
21306 -6377 457 -912 -3818 -7824 -6721 -6050 -8102 -10525 -8622 -3820 -5395 -5494 -8239 -8019 -8187 -3264
21290 -3264 -410 -7649 -6375 -4331 -1436 -4172 -5789 -12577 -15347 -17691 -22236 -20926 -17295 -11233 -5277
21275 -5277 134 -692 -3552 -9430 -13210 -10296 -4709 3656 4280 3317 -669 -5977 261 5668 7507
21260 7507 7759 7521 5445 5093 5539 8660 9816 7574 6458 11582 12682 12866 10909 6393 5774 10013
21244 10013 15793 18337 19639 16938 19083 21909 18915 11314 4927 -3340 -3776 -3706 -3941 3190 8015
21229 8015 7373 4083 802 3702 5472 7155 5215 5066 5931 6788 -729 -5449 -4608 -971 -2857 -3194
21213 -3194 -1495 4779 6538 116 1796 4540 3365 -2212 -9959 -10571 -2676 -7481 -6892 -4988 -3381
21198 -3381 -4563 -10609 -15181 -16583 -10565 -7073 -7452 -5302 -3726 -2026 -1499 5183 8442 7930 6071
21183 6071 -1592 -6705 -8928 -7115 -6347 3949 14173 14948 12449 13673 6692 -2711 -11282 -10862 -13726
21168 -13726 -9334 -5738 -3838 -2204 -3449 1110 -4413 -10043 -12530 -17956 -9434 -5179 -5203 -7786 -5828
21153 -5828 -4895 -5264 -5533 -3036 343 -6000 -12322 -16276 -9306 -5726 -4168 -6079 -10337 -13518 -11090
21138 -11090 -10843 -5128 1916 -1102 -6596 -15038 -18087 -18876 -18167 -10894 -6528 -10108 -5231 -2016 -1116
21123 -1116 -1933 -364 9630 13101 7400 -7815 -18548 -16071 -8292 -5218 -12839 -4956 -1314 -4887
21109 -4887 -11288 -16470 -11957 -9410 -8379 -4430 5604 10467 9740 10213 14529 7205 -587 -5636 -11511
21094 -11511 -12693 -14796 -21727 -21793 -18494 -11226 -4910 -9899 -17825 -12960 -11257 -12162 -10266 -12643 -16584
21079 -16584 -23969 -21587 -17350 -6391 -6512 -5440 -6474 -15025 -11825 -13143 -18529 -15155 -18948 -22076
21065 -22076 -25567 -27653 -24297 -18882 -12056 -2735 -5124 -10798 -6981 -784 -3228 -6237 -990 4685
21051 4685 517 -3124 -3928 -4490 -2717 -6332 -5313 -5807 -5590 -2356 1084 -900 -9108 -7891 -2165 -2808
21035 -2808 -5206 -8841 -9893 -3794 -4979 -9971 -12220 -4217 518 -2088 -7238 -6185 -3470 -7634 -11723
21020 -11723 -12234 -13443 -2532 103 -1764 -1228 -4203 -6487 -3449 6488 1294 -4402 -4735 -1907 -5192
21005 -5192 -10427 -4565 -5231 -7375 -4861 -1299 -3735 -5595 -4404 -4974 -6925 -9245 -9149 -8322 -8358 -10235
20989 -10235 -13902 -8195 -6257 -2582 -5248 -8469 -6591 -9034 -15561 -17071 -17440 -18975 -16350 -14166 -17900
20974 -17900 -18318 -10370 -1513 -3423 -4868 -1963 5348 3541 2031 -5420 -8067 -3774 7549 6144
20960 6144 -3861 -7693 -6162 -3025 3412 6655 8629 4054 -3528 -3611 -675 -2083 -7116 -10929 -7854
20945 -7854 -5318 -12127 -14028 -14783 -14854 -8613 -5078 -3161 -4316 -3739 -3649 -6383 -6030 -7639 -11075 -7403
20929 -7403 -12702 -13079 -12088 -12385 -13508 -16016 -15886 -5687 -5436 -13146 -12394 -8632 -7787 -14629 -13012 -4620
20913 -4620 -915 1324 -4564 -5406 -2783 -5469 -9485 -14235 -18989 -16094 -3267 5083 7175 12607 7115
20898 7115 2658 4311 6781 3013 131 6043 8534 5232 -9 3177 -2031 -5263 -5243 -5401 -3126
20883 -3126 -1189 -2813 -3102 -1836 -2756 -8057 -3004 5693 4356 -1204 2356 -9 -1391 569 -579
20868 -579 -7850 -4750 -6786 -973 -389 -5568 -13126 -9800 -3493 -1306 -729 -6702 -13293 -15539 -6859
20853 -6859 -433 -4531 -8029 -3355 1416 1047 1100 2464 -2480 447 3400 5001 2886 -1695 -5766
20838 -5766 -5596 -2748 -2314 -968 -3729 -5090 -3201 -1709 -5650 -227 -216 -7193 -14787 -16192 -8535 -3965
20822 -3965 -8037 -11223 -8396 -12155 -7416 -4641 -12699 -9575 -1758 -5977 -10635 -8205 -6440 -4102 -2925
20807 -2925 -357 3492 2456 163 -1580 -3684 -4500 -2661 -1323 -4557 -6057 -11356 -9194 -9000 -12042
20792 -12042 -13995 -18763 -12846 -9822 -13894 -14154 -13177 -3594 6452 3476 -2378 2408 5790 623 -4074
20777 -4074 -2856 -2257 -3536 -11202 -11407 -8065 -5985 -10125 -10614 -2180 7554 3308 -4728 -10046 -12256
20762 -12256 -9300 -9253 -7465 -6533 -9929 -5401 3426 3732 -4058 -7450 -4226 2664 1424 -5045 -12763
20747 -12763 -13679 -4682 -1001 -2809 -5909 -6211 -6770 -8635 -9501 -5361 -7765 -2990 4395 5169 -430 3554
20731 3554 -1086 -6530 -5578 -8611 -9743 -5311 -4798 -3432 85 -233 -7680 -7237 -5279 -6835 -9037 -7634
20715 -7634 -3117 -7061 -6386 -4792 -6889 -6634 6283 9457 6808 5292 2481 -4003 3245 13393 13040
20700 13040 8858 13664 13786 9921 3119 -327 691 1019 4146 996 -8500 -9596 -3183 2974 -4067
20685 -4067 -3499 1285 5665 1048 -6409 -7511 2172 3584 -5217 -6494 -2191 5782 6998 -3350 -9302
20670 -9302 -7561 -10233 -2738 -1231 -8073 -16144 -9510 -2009 -8057 -8925 -1492 -968 2864 3231 -1398
20655 -1398 -3204 -2261 -3629 -6060 -12656 -4346 -5134 -1623 1760 5785 -812 -1387 -1869 5577 11701 9286
20639 9286 -447 -6768 -17289 -16525 -9724 -6248 -4100 -3352 -1375 1988 5467 4434 3464 -2826 -4792
20624 -4792 -4521 4748 4346 1740 3461 1487 -2888 -2892 1975 5252 1394 3976 6174 137 1562 1441
20608 1441 7171 4863 4045 8500 5144 -3526 -9909 -4000 3661 2178 2004 2674 -2630 -5268 -1014
20593 -1014 3959 3744 6006 -131 -8579 -8271 -6662 -6991 -2594 6397 11006 6333 2965 -2514 -8349
20578 -8349 -16535 -16968 -10074 -3756 -6609 -12611 -12662 -8413 -6437 -7380 -2581 -4666 -10421 -11861 -12166 -9922
20562 -9922 -3491 1254 462 4815 3451 -4178 -12209 -10154 -7649 -8231 -12423 -15960 -13079 -10187 -12082
20547 -12082 -3957 2152 4405 -377 -3099 1816 2387 1964 -2877 -6380 -6562 800 6391 8367 1487
20532 1487 2687 395 -5535 -14068 -11874 -6787 -9504 -12100 -7261 -115 2974 324 -3781 -5950 359
20517 359 1994 -2566 -5598 -6340 -2878 -574 -2190 -7896 -14209 -18470 -17655 -15329 -11776 -9946 -13137
20502 -13137 -13626 -16748 -17481 -14102 -14402 -5863 -4094 -5897 -5325 -4770 -3433 1503 -462 -12178 -14083
20487 -14083 -6295 -2069 4181 10916 10280 -4151 -8892 -4192 5221 11163 3344 -597 -1453 -2505 110
20472 110 3985 4463 1925 2998 -209 -8354 -10759 -1980 3940 5481 -610 -6873 -11772 -10859 -1705
20457 -1705 3690 3209 2875 93 129 -5776 -9604 -4917 -7612 -11451 -10555 -11852 -10626 -11683 -9146 -622
20441 -622 3470 3710 128 2809 -2319 -10458 -9693 -1973 7293 7525 1441 -4121 3234 5762 -1307 -5063
20425 -5063 -5044 1702 -5182 -7957 -11181 -11580 -5666 -3216 -1449 -7839 -12074 -12131 -10053 6235 8471 436
20409 436 -337 1875 3652 2664 133 -9250 -15543 -16804 -19463 -14782 -8582 -7730 -2051 -910 -2022 1238
20393 1238 5143 762 1572 -975 -2696 -1823 2014 3496 4155 7972 2373 -7807 -15159 -20176 -13810
20378 -13810 -17980 -21623 -23982 -25605 -21909 -19578 -17674 -11714 -7934 -14 8991 14851 13843 7319
20364 7319 4791 2551 -2227 -7487 -7520 -5896 -5827 -2391 -5408 -10792 -12204 -9624 -4632 -3654 4396 9067
20348 9067 7243 1880 -4169 -1504 2332 -1717 -7120 -11713 -8151 -6139 -6737 -3946 -3861 2968 3945 -2362
20332 -2362 -3227 -6112 1426 5413 4514 -5970 -11062 -4609 4450 3547 -2707 -4528 -1236 7663 10179
20317 10179 2359 -4456 -3844 -2635 -4682 -1944 2631 -3131 -3475 4808 3307 12 -8974 -5826 -1740
20302 -1740 1160 -2603 -1874 -44 1289 1253 -811 3290 4588 -4980 -13018 -16303 -11153 -2583 -2255 -3525
20286 -3525 -1506 -3809 -2611 2009 -3418 -6881 -3723 4869 2697 4288 2793 -1973 177 3392 1272
20271 1272 -2746 4863 8832 9669 14381 14209 6729 167 6380 5909 905 -3036 -441 4011 3199 1326
20255 1326 2605 9416 15326 11699 7105 6589 1789 2603 11411 12346 11335 11410 10134 13284 13571 7361
20239 7361 8554 12783 14135 10016 11689 13218 13938 14862 10627 16686 15504 8462 10256 9000 15483
20224 15483 16035 14862 13504 15606 18407 17100 10270 12843 13766 11286 5918 6979 6890 3073 -2429
20209 -2429 -185 -94 -5741 -7851 -5137 131 -3584 -3871 -8149 -11414 -5646 -222 1811 5631 335
20194 335 605 -1526 -4799 -4214 -3220 -5485 -4215 -3422 -6370 -6473 -5040 -9490 -7797 900 1038 -557
20178 -557 -8640 -8941 -11227 -15767 -8953 -3418 -474 3546 7990 1989 -4644 -11609 -5420 -636 1107
20163 1107 815 -1409 -3965 -2390 -10413 -9269 -5878 -4656 -360 999 5129 3189 -4696 -7722 -5933
20148 -5933 -369 6103 7796 745 -2005 93 1436 2633 2241 3182 -5040 -4930 -5777 -8760 -9212 -7917
20132 -7917 959 7845 10405 4386 3767 1216 1293 -1006 -72 -5536 -3296 2220 2352 6632 3117 5325
20116 5325 -4273 -6567 -3892 1918 6211 4356 3190 470 -85 1046 -5018 -2798 763 -189 -860
20101 -860 1173 2956 -1000 1859 -300 792 1389 -7692 -13450 -9453 -10879 -9507 -13328 -18231 -18137 -10585
20085 -10585 -6925 -1205 5936 11544 8519 3126 -2796 -5071 -4803 -5948 -8145 -10064 -3974 3601 -1136
20070 -1136 -2042 1935 -928 61 2138 3053 -680 -6282 -7285 -8395 -4473 -7542 -13139 -16161 -10256
20055 -10256 -7709 -9289 -4116 1739 4113 3762 2756 5598 1987 4730 3210 -942 2844 6122 9700
20040 9700 6992 5597 6621 4054 5417 5547 -518 -4234 -6628 -5782 -6529 -1721 416 4043 5998
20025 5998 5424 2552 1454 4547 6243 3135 1825 -181 -7986 -9610 -1623 4819 5488 6530 14850
20010 14850 12162 -31 -6627 -7473 -10673 -4190 9251 8826 9798 12700 10778 4190 249 4452 -1241
19995 -1241 -2191 -58 -2520 -6906 -4286 -813 4582 1352 -4398 -8333 -1580 522 918 1724 2716 910
19979 910 3702 1244 1699 738 2704 6281 10193 12321 6607 1690 5195 6547 2764 807 -1667
19964 -1667 -4048 -664 5319 5957 5451 7516 4155 4477 12852 14523 13256 14662 12515 10811 13546
19949 13546 12199 5129 9235 13001 15774 11122 2880 -285 642 1609 2651 4248 1941 461 -5951
19934 -5951 -11691 -4781 -1377 -1078 -3188 -3645 -7299 -6748 -2138 -4235 -5199 -6207 -1578 -4149 -4338 -5595
19918 -5595 -6353 -1767 1100 4344 8404 5567 -922 183 6052 1522 -862 781 176 -3794 -4033
19903 -4033 -4209 -3391 -4684 1522 4347 7458 14800 6009 3825 8186 10640 7690 9257 4284 6816
19888 6816 918 -5649 -9819 -10307 -9347 826 338 -4437 -2047 -1668 1210 818 -1386 3149 6309 7800
19872 7800 3905 5441 4084 -4261 61 -457 -2923 -3165 356 -6139 -4453 -2817 -791 3894 6375
19857 6375 4527 1851 4545 -2297 -4068 -4433 2887 4676 359 2889 -700 1807 1665 -2507 -919
19842 -919 959 2633 2555 1100 -2060 -7359 -4779 -2634 -1300 35 -4760 -3540 35 2856 2371 2673
19826 2673 3558 12011 8597 3819 2666 5529 1984 7153 8828 -917 -14844 -15433 -4114 3324 7114
19811 7114 8038 1237 896 5471 5037 -2013 -3593 -712 -1642 2774 7225 4167 7338 8434 6321 633
19795 633 -6286 -2203 4665 5098 2715 1671 3173 4857 4149 10370 11780 11978 12835 5707 -2817 -1397
19779 -1397 -3088 -3076 -3556 -2201 4769 12999 11682 9889 5373 2750 -644 -8457 -5683 3590 5427
19764 5427 4594 3190 -428 -3466 -1847 2276 4157 6768 7287 4813 -1294 -1780 2659 9186 9786 5811
19748 5811 2858 4307 -4908 -4512 6396 7476 11909 10592 3365 1177 3581 4129 8298 12252 14475
19733 14475 13228 1383 1044 3396 5750 11338 15090 12702 15797 16465 12608 13801 13521 9514 8750
19718 8750 11919 7199 3778 1357 -1354 -67 1490 3517 3409 1416 -3617 -6476 -4409 8165 14148
19703 14148 5531 4614 10259 7477 6762 3777 2036 3138 4136 4277 3684 10918 13941 12885 11059 13527
19687 13527 13872 12067 10745 12028 10413 9337 12108 8568 10384 8958 6907 5180 8430 13623 3280
19672 3280 -2693 -3327 -4345 978 -618 -7914 -8208 -8026 -6757 -8385 -2959 4698 6824 2716 -4658
19657 -4658 -7123 2383 3427 8252 8979 2973 -315 4440 2733 2970 6348 8090 10919 7756 3915
19642 3915 2236 135 -3605 -5076 -5800 -7956 1900 -4431 -10486 -5045 1699 -47 -9209 -9612 -197
19627 -197 3813 2804 4277 -762 -978 3868 4650 3797 3794 56 -615 1293 4533 5367 6360 8773 14060
19610 14060 9895 -1990 772 4573 1627 82 -2735 5696 7350 5193 -1340 205 7069 11951
19596 11951 10558 1470 -2 -748 1239 3907 5411 6573 11653 10607 10292 7306 5720 10485 7845
19581 7845 3648 120 1694 2964 10524 20362 15167 6484 2289 7797 10693 3086 -2259 131 -877
19566 -877 2267 9399 6175 2889 10041 11976 10455 8452 6659 -4214 -9725 -2870 5263 7017 5509
19551 5509 5102 11972 8033 2692 4657 8729 8715 3087 -4748 -1143 -1170 -3307 1855 9975 10104 14050
19535 14050 17954 20880 16859 5100 1277 2826 8957 10930 4414 9393 7495 5290 1861 6598
19521 6598 13306 13467 10079 15703 16433 16526 18858 22291 21063 20763 20047 18117 17153 17430 12174 12710 8995
19504 8995 10721 9967 10295 13765 14414 12437 5427 7218 2807 8869 3652 -1965 -1098 6417 7210 3452
19488 3452 4769 3152 -1214 -5574 -2691 -966 2219 4993 7844 14199 9291 7433 10480 7738 3158
19473 3158 6844 10913 15874 15677 9325 11483 16015 10517 7445 6792 13039 15748 14850 16578 18972
19458 18972 20591 16525 14588 13130 15712 17901 14112 7578 7731 8728 10169 14724 27557 26496 16152
19443 16152 2307 -3610 -6378 -3840 -70 430 8250 5778 689 7069 11153 11901 12681 11079 12552
19428 12552 15778 14818 9437 11774 14655 5578 2481 8646 16847 17046 7857 4943 4849 6270 9322
19413 9322 9356 9171 6712 11740 10276 13506 11881 14061 23514 25254 21916 23249 26075 22917 16805
19398 16805 16916 17279 17623 21041 24841 20681 13096 12972 12303 5236 5053 8798 6691 10806 13231 14357
19382 14357 19208 22049 16444 13418 9374 1083 3433 6945 5067 8874 5016 6398 3808 10610
19368 10610 17541 20920 21434 22049 20792 19930 13573 14839 15346 11898 9743 15779 17308 15055 20639
19353 20639 18997 13448 13756 14326 11697 6241 9046 15233 11652 4334 7374 14968 18001 20009 13777
19338 13777 12766 18113 16007 7441 6109 7301 7737 8511 11360 13201 13332 16002 10214 9613 10368 14257
19322 14257 20561 23984 19317 15093 12581 8758 3618 -2949 -1818 5647 13062 14211 12026 13270
19308 13270 15894 17369 15319 17620 15326 16813 17460 13753 11361 15386 15521 21409 21993 20091 21499
19293 21499 17839 11923 11530 14040 12802 12761 13407 19515 24590 27659 27539 28469 29932 30977 20071 14055
19277 14055 11953 12275 17806 14997 15787 20693 16557 12785 14511 16380 17391 16014 21402 19168 15000
19262 15000 24723 24015 22962 20383 18708 20013 23323 20378 15737 10914 7983 10232 17162 27656
19248 27656 27371 20961 16519 17703 19446 14330 12799 4829 -3046 277 4824 9116 14335 15346 13527
19233 13527 15939 20908 27344 25818 28807 20763 18500 19134 22253 21639 23409 19961 15116 15917 15906 22493
19217 22493 20884 25413 31154 36587 31586 32077 35134 34756 32315 29982 21090 13623 13560 7924 7368 12230
19201 12230 16945 18925 23121 21535 22057 17458 18992 14047 17133 21580 24766 21159 17344 18543 21079
19186 21079 23068 17743 9496 11576 11543 12063 10365 9418 16340 20969 21624 23452 33502 35102 36575
19171 36575 34494 26784 24307 23467 18384 18618 16026 19712 19321 24778 25575 25118 25051 26946 26192 26356 24195
19154 24195 25976 18628 20129 16893 15457 21331 24041 26828 27282 30168 32531 27931 27257 25584 22845
19139 22845 20693 17855 22644 24090 21023 21286 14302 19860 25217 22944 28494 36193 37719 36113 35943
19124 35943 34856 34640 26608 25131 23393 25380 21658 18133 25279 26597 23508 25275 28351 28717 29617
19109 29617 31121 31434 36385 34190 33266 32245 29694 24087 29439 27125 25946 29222 30789 31850 34099
19094 34099 32939 31721 26481 24662 35823 36720 32468 28568 27614 28416 27692 31607 28046 27748 27921 27637
19078 27637 31686 32023 28316 27767 26352 32297 32191 29716 20639 16666 18810 23844 31046 29452 32522
19063 32522 37913 33738 37501 39128 38737 40094 32512 33016 34955 30455 27368 29403 31168 33123 29709
19048 29709 31477 34960 40691 40762 27659 26605 31344 36161 35937 31839 39647 43003 37093 29735 31510
19033 31510 36060 34780 37810 39480 34376 40584 40838 37945 31311 31943 33676 41943 46713 40339 40736
19018 40736 41255 37977 42191 43575 53908 60916 56144 51917 49872 43773 43002 40762 35178 34748 38263
19003 38263 41488 45932 52402 47705 36270 29175 31904 35755 41091 45647 49037 44741 38733 36698
18989 36698 37414 40735 45710 48905 44379 41041 37272 36059 36576 37282 37665 36768 35063 38269 35530 31567
18973 31567 28336 28398 34391 35370 35939 31987 38696 43860 47598 43582 34522 40941 46001 47471 51684
18958 51684 53756 52708 50611 46875 38604 40853 47544 49645 53140 53758 50787 49331 40624 35071 40346
18943 40346 45792 46259 48651 45768 43545 40772 36984 37532 40836 43943 47669 48771 51353 52116 47502
18928 47502 44929 43580 40194 37723 34089 32362 34336 43792 48028 49679 51351 56339 55906 55323 51997
18913 51997 51759 47710 46143 53612 56497 64596 64397 61051 58283 54386 49530 52149 48170 46200 46937
18898 46937 53572 51667 53961 57446 61715 67793 62877 60974 62608 65101 60509 55123 55001 60970 63585
18883 63585 67189 63521 64554 71425 71070 67449 69419 76851 78315 75134 74285 73848 75661 75004 69123
18868 69123 67518 70200 72580 74543 77770 81395 81883 81498 79346 82599 85696 87592 87168 85661 82287
18853 82287 79696 80318 75952 66274 66069 70768 71449 72598 74400 76276 78382 83126 84053 82177 74256
18838 74256 77967 85099 93292 93801 91433 92891 101548 115469 122456 134996 146533 160606 184586
18825 184586 213516 232718 247751 260750 260139 255538 251228 247033 256943 261644 263244 262493 257010 242304
18811 242304 232162 231463 239224 253806 271361 275619 270836 258535 238156 225266 212532 199278
18799 199278 188920 183494 181551 189177 201441 224787 246781 267054 299377 330432 358321 386615
18787 386615 407685 428812 458532 488423 523266 555590 593279 622413 642899 653756 666673
18776 666673 704378 755385 816975 885133 942879 975184 972233 932577 881390 829755 772872 708471
18764 708471 654539 620379 612500 626196 643866 673419 694165 709695 730764 742858 745979 738446
18752 738446 726757 704505 673730 634110 589340 554925 533766 525150 522354 514224 517271 536168
18740 536168 547851 563807 588000 612031 639426 671569 713854 758461 793859 821966 846373
18729 846373 870917 901286 932507 959350 973708 986313 996930 1003293 989569 967313 939336 896141
18717 896141 839330 776661 701592 624917 557760 496371 441800 402506 371700 355443 354674 355876
18705 355876 363620 380832 408144 428609 445770 457565 463319 457398 451554 443937 417321 379376
18693 379376 348698 326391 300132 276155 258765 240132 225702 214217 213458 210333 210610 214278 219239
18680 219239 229647 246809 264215 276604 287758 305133 313449 323291 330177 336440 345587 344913 332140
18667 332140 311702 281307 255956 235227 222181 208554 201421 197592 191915 189358 191189 186738 184998
18654 184998 188005 190130 193241 194961 200110 210733 223822 232592 241481 247615 245502 242228 235884 231841
18640 231841 219748 209433 199025 185625 171898 168727 166320 166441 166272 162829 161331 155241 153273
18627 153273 159651 162926 165959 179223 186401 184401 182154 183177 176796 172505 168618 164946 165694 165590
18613 165590 154554 140145 128713 123996 122792 124585 121783 123118 129841 135708 143137 144977 143577
18600 143577 143650 150982 167857 190094 194988 196569 193062 184861 176867 171169 169164 169841 164922 159863
18586 159863 156417 155414 157703 163434 169814 173582 177816 176368 170782 164549 166953 169483 173534 175869
18572 175869 168805 162350 160592 158081 158736 154073 146518 136272 134487 139730 151360 158031 164387 183043
18558 183043 188459 190611 194990 196739 191645 182975 172641 171419 181728 189711 198949 208396 218740
18545 218740 226736 229857 232291 236855 237997 242797 239389 242479 243444 233988 234980 246546 256005 257130
18531 257130 259737 271983 279509 280175 290635 295472 292405 295378 304949 316899 328231 346450 366951
18518 366951 388334 412876 444334 475832 494320 494213 487706 488783 505510 521607 541961 561500
18506 561500 578448 583993 577671 574039 569783 558328 551542 545808 519684 493039 479099 464372 445255
18493 445255 429399 405953 381505 362800 343998 330701 317895 311220 306323 293349 284833 286328
18481 286328 284351 279743 276547 269235 274657 284926 290914 298166 324734 344339 356708 374478 387374
18468 387374 388185 376993 369975 362093 355355 345100 336003 329613 317667 318175 329874 343240 358766
18455 358766 373013 382154 380065 366837 356619 356771 350486 349206 363207 396782 431806 461666 497137
18442 497137 519028 527840 533336 537782 550160 567643 567881 549276 531102 508828 485346 466855
18430 466855 446239 436973 434090 432756 438475 443221 452226 464207 477289 491653 501410 515965 522840
18417 522840 537945 555735 560198 575138 596552 610151 613049 627429 649176 673815 688019 691402
18405 691402 688449 674968 660504 636353 617493 606380 614277 623394 645275 677927 709728 744506
18393 744506 774838 809583 839692 856533 874463 893698 918343 943320 955953 956252 962617 988065
18381 988065 1015391 1029886 1044232 1053894 1046479 1023396 1003420 995522 995992 993017 991129 998637 1012686
18368 1012686 1040500 1076931 1124657 1178417 1225844 1276364 1330405 1394030 1458395 1529005 1592024
18357 1592024 1650884 1709049 1765620 1819895 1850676 1861869 1861903 1875628 1915757 1990382 2100280 2251041
18345 2251041 2455468 2727518 3070506 3498635 4036698 4572174 4849593 4862419 4772237 4733416
18335 4733416 4861675 5115663 5271740 5298983 5318473 5449223 5750275 6027250 6015967 5824045
18325 5824045 5580618 5363003 5218251 5143475 5152421 5257521 5434061 5569794 5605219 5604605 5637644
18314 5637644 5760296 5951392 6146117 6262616 6297156 6299072 6325279 6427342 6625023 6941582
18304 6941582 7388253 7975198 8692042 9511496 10441207 11582785 13100329 15153459 17805830
18295 17805830 20584666 22559303 23824460 25082261 26897251 29329031 31781106 33839738
18287 33839738 36125434 39472641 44364105 50320432 56374958 62926627 70474907 77849129
18279 77849129 83541437 86664656 87634300 86932925 83999111 79896294 76276495 74379910
18271 74379910 74331571 75095543 75293133 75322286 76489373 80231355 86191647 91932714 97773784
18262 97773784 105242539 115511225 129091956 145891208 166439743 194577313 236139091
18255 236139091 296353783 374223459 453340406 504161079 511075881 481175550 427079203
18248 427079203 361268459 295518494 237519925 191101735 156913973 133263731 117790976
18241 117790976 108546455 104023528 102684446 103232698 105587539 109123258 111951854 114283660
18233 114283660 116370961 116856940 114184919 108073711 99529633 90413602 82667103 76930904
18225 76930904 72873101 70374862 69145194 68824690 69528317 71479899 73892438 75051684
18217 75051684 74114198 71326629 67196793 62364868 57744376 54104325 51916597 51203779
18209 51203779 51341176 51292458 50573493 49044952 46700108 44184380 41880125 39967698 38737740
18200 38737740 38149137 37534427 36279519 34513520 32584121 30907288 29718188 28767745
18192 28767745 27806365 26897680 26120270 25496794 24901135 24146953 23241320 22369211 21779107
18183 21779107 21678852 22185220 23350821 25058220 26872268 28055507 28084552 27037789 25298652
18174 25298652 23410129 21862967 20839324 20292137 19886646 19007703 17659529 16156133
18166 16156133 14651570 13317284 12232527 11424524 10865540 10483672 10241236 10163625 10262328
18157 10262328 10451112 10664043 10866489 11070339 11205693 11104863 10847906 10584634 10350064
18148 10350064 10074456 9730208 9403578 9186453 9089314 8968451 8722449 8396955 8026518
18139 8026518 7689715 7365236 6986987 6571362 6179411 5873656 5667245 5542092 5527638 5643352
18129 5643352 5882318 6210381 6511481 6582055 6357528 5879270 5286257 4757359 4366177 4058812
18119 4058812 3809874 3623502 3493234 3411234 3382732 3413864 3534399 3779478 4163324 4738149
18109 4738149 5627147 7050873 9163494 11001635 10882818 9471698 7544748 5761543
18101 5761543 4498411 3655053 3081710 2679868 2380003 2171915 2042479 1952943 1884188 1837426
18091 1837426 1800584 1765742 1735377 1703250 1665061 1639424 1616103 1600363 1585482 1569049 1554766
18080 1554766 1543107 1536843 1535300 1530853 1521307 1508943 1483929 1453870 1425022 1400926 1371820 1343475
18068 1343475 1311509 1268919 1226549 1185406 1139661 1104113 1076282 1058547 1051079 1044360 1048787 1054567
18056 1054567 1059997 1064416 1067606 1053581 1029930 988900 949028 910063 882301 864070 854293 849783
18044 849783 846087 829215 817291 799443 784865 765784 745743 728212 712285 693607 677904 666545
18032 666545 656861 658577 666459 676596 688209 693009 698811 696407 685095 680557 669174 658419 649631
18019 649631 633980 624675 617562 616530 619533 616082 608482 611433 614432 615145 625761 637886 643736 635346
18005 635346 632305 630587 625666 625143 618940 610340 598790 579640 548700 532119 526822 512423 495080
17992 495080 472226 446642 421394 410044 398593 380500 372169 366797 359411 350864 346779 353196 358294
17979 358294 355379 345171 324375 308061 310559 309784 306319 309859 320898 336154 339725 336840 338196
17966 338196 334620 327975 319664 307269 298761 295325 291384 291086 292000 289893 284639 291511 301593 301091
17952 301091 307257 310545 305429 302664 313796 323205 333318 350094 371999 386993 393886 389897 373358
17939 373358 351616 337494 324617 321148 313727 309812 315648 315534 323501 325288 325544 324714 332940 335489
17925 335489 341818 352736 368533 386443 390347 388143 386194 386379 384932 381820 370296 358877 345032
17912 345032 326787 314018 298452 277182 274400 273014 268213 271213 270006 272771 280693 290535 292377
17899 292377 287658 282386 276774 270933 270944 268642 260553 252647 242727 236016 222962 215369 214239 207556
17885 207556 207506 205017 208453 218718 221031 213376 204850 201201 196686 198745 201373 209514 209165 209260 200823
17870 200823 199823 208029 212960 214505 202927 185054 174266 173479 183775 183672 176237 173315 174228 172988
17856 172988 174367 174388 164212 160830 165331 168019 165901 163773 165829 167477 161750 154170 147456 139394
17842 139394 134845 143506 144383 139863 139145 144392 146423 156493 170527 193899 223724 267656 325560
17829 325560 402152 501556 600976 681459 713748 687141 608505 516479 427887 360111 317614
17818 317614 292562 271344 255979 256799 266273 281399 295734 315901 342224 350396 347431 339232 343883
17805 343883 356699 380230 411406 429720 424196 404291 368927 346656 323521 310308 301266 296804
17793 296804 295447 302821 318045 331442 356509 380841 398149 410547 407426 405673 415619 441729
17781 441729 459133 482708 505158 534975 565940 602053 641199 684403 728082 765311 795241
17770 795241 816429 823118 826310 805950 760689 703395 633144 577166 543242 526992 522106 525514
17758 525514 543373 572078 602117 626532 635055 616636 581761 543687 510505 483970 461024 449210
17746 449210 453254 460177 472169 488291 525553 562150 598667 617091 624180 620721 605915 588706
17734 588706 573115 554742 543568 536286 538940 561369 584781 599072 615279 631495 655467 674672
17722 674672 679118 665457 654028 642638 625220 590588 549888 516155 497452 471670 442659 416670
17710 416670 392581 384815 377954 371726 376307 397108 421101 436330 452031 452629 435788 397175 343094
17697 343094 300156 265726 236087 217955 210607 212702 217357 223497 233890 238522 241850 250215 264892
17684 264892 279186 276370 263681 249259 226822 205368 190891 174960 166740 156078 151435 158372
17672 158372 169420 176451 184441 191851 195637 193940 193422 186980 178100 177952 165907 147873 126973 117819
17658 117819 111362 103381 99486 96831 101996 108042 105970 113078 122965 127422 123395 123154 126027 126485 127723
17643 127723 121039 110691 100525 88196 77847 69802 61088 52422 47497 56166 61236 66265 70107
17630 70107 67853 70705 72713 80047 80931 69980 59318 49679 43555 37710 38679 35397 29862 25084
17616 25084 22899 26792 33281 32583 26638 25128 25667 23616 20787 15530 10307 8914 8775 10277 1596
17601 1596 -2889 -1829 -7916 -4347 -260 4566 3832 -368 1798 -1020 -1478 -6221 -11328 -11807 -2817
17586 -2817 9824 8446 -2109 -9545 -18223 -17198 -14724 -8989 -11436 -10385 -7307 -3006 -3190 -13401
17572 -13401 -13435 -4976 -2868 -3126 -8994 -15011 -13856 -11350 -13810 -13892 -9672 -9143 -14351 -14522 -6494 -4474
17556 -4474 -10428 -14092 -11424 -15839 -13564 -9933 -12308 -11038 -13259 -17148 -19264 -16834 -19957 -24312 -27582
17541 -27582 -24345 -18847 -20249 -16571 -14882 -15856 -18169 -16734 -10583 -9303 -3200 -387 -1413 -1233 -1281
17526 -1281 -3155 269 -246 -6983 -8548 -7186 -9206 -8233 -8914 -8058 -7462 -5662 1413 4008 -345 -4562
17510 -4562 -6456 -9917 -13072 -11688 -6276 -5380 2455 7964 7704 2675 2113 1681 682 -77 -3021 -2032
17494 -2032 -4571 -14993 -16860 -18561 -16460 -12310 -10765 -16307 -15798 -17608 -21773 -22024 -21586 -25744 -25527
17479 -25527 -23406 -24870 -32733 -36424 -31419 -33059 -36451 -30325 -29385 -31742 -27558 -29146 -26880 -26506 -26578
17464 -26578 -25126 -28205 -28889 -30346 -25245 -24930 -26974 -23425 -16853 -21135 -23648 -21159 -28492 -27705 -25977
17449 -25977 -22908 -16432 -15863 -13700 -13032 -10881 -10040 -4764 2919 4288 13674 19723 21326 18257 12000
17434 12000 3265 -7895 -9197 -17065 -18563 -14120 -8486 -11680 -5736 -3483 -3850 -9813 -19085 -17096
17420 -17096 -10323 -2968 -3482 -8792 -18039 -14827 -7976 -6653 -2099 -259 -656 -1657 -13871 -22216 -19994
17405 -19994 -15404 -15094 -14674 -13096 -11192 -10737 -8718 -7086 379 6589 13096 10695 4781 2956 5364
17390 5364 4665 4904 226 -10831 -14131 -11897 -12653 -9266 -6099 -6200 -3740 -1023 2114 3909 -2556
17375 -2556 -11871 -10372 -2925 -6191 -8837 -10568 -11343 -13813 -21799 -32816 -32283 -25965 -25014 -30694 -24021
17360 -24021 -25630 -25592 -24892 -22595 -18229 -8222 -10203 -13903 -13950 -12526 -9583 -8233 -3728 -3523 -8166 -13456
17344 -13456 -16080 -9646 -5527 -4827 -4252 -6151 -8930 -9010 -8396 -10448 -10824 -5960 392 3478 -5269 -20472
17328 -20472 -20833 -14599 -12649 -12196 -12608 -14164 -10894 -13671 -10686 -7075 -9164 -5478 -8037 -12227 -9011
17313 -9011 -9518 -11970 -15342 -17562 -13384 -13985 -12334 -8903 -15443 -15796 -13020 -18980 -24081 -24494 -22113 -16214
17297 -16214 -16761 -22410 -25701 -27240 -28912 -28739 -33859 -31322 -21819 -17252 -22693 -25282 -27317 -30258 -31465
17282 -31465 -24090 -14656 -7593 -6098 -9152 -11671 -7712 -4485 -2845 -9007 -11290 -9120 -11198 -12016 -13526
17267 -13526 -14533 -16281 -12537 -11277 -12331 -12790 -11183 -4415 3967 9967 12907 12911 11223 458 -4897
17252 -4897 408 3351 9252 19101 22941 22012 20161 9855 6237 4454 2623 -4763 -2014 3340 6315
17237 6315 5863 -4583 -7600 -10616 -12902 -15621 -12888 -16151 -19475 -14022 -12280 -11368 -13800 -17239 -14498
17222 -14498 -16505 -13985 -8286 -6251 -9355 -12441 -2525 -7022 -15857 -9212 -85 2995 1658 1673 -1255
17207 -1255 -3100 -1179 302 4725 2648 4199 7382 5713 3925 3310 -4239 -6886 -9349 -13379 -14794
17192 -14794 -14859 -14111 -16203 -10692 -10012 -8719 -14173 -15528 -14048 -19911 -27998 -34786 -35247 -35200 -31303 -23034
17176 -23034 -20431 -26973 -22511 -18888 -12084 -13363 -17016 -19145 -23373 -25954 -23957 -20543 -26252 -22086
17162 -22086 -20202 -23477 -26472 -24154 -22215 -18891 -13576 -17482 -26734 -23761 -23535 -20591 -24499 -27943 -28078
17147 -28078 -24307 -18207 -19460 -24834 -22749 -18607 -22048 -20872 -16605 -19101 -24989 -30795 -32414 -27059
17133 -27059 -22781 -25272 -32183 -27629 -32517 -35628 -36491 -37258 -35854 -28524 -21213 -21052 -25637 -29642 -29368
17118 -29368 -31065 -27125 -24367 -28796 -27977 -22263 -21817 -25551 -31330 -34484 -33661 -38620 -38830 -39590 -45203 -46237
17102 -46237 -33717 -18436 -19189 -25582 -28310 -27992 -30881 -35687 -39678 -37743 -40064 -34600 -38136 -39350
17088 -39350 -36844 -38102 -40335 -36165 -37359 -34398 -36304 -40564 -33273 -29357 -33032 -33871 -28741 -27719 -32348
17073 -32348 -29888 -31767 -36137 -39963 -34176 -30301 -29015 -34568 -40235 -35500 -33372 -35709 -38160 -35441
17059 -35441 -33706 -28524 -24973 -28746 -34038 -37931 -30957 -31809 -38217 -41526 -41388 -37888 -34605 -30917 -39014
17044 -39014 -40277 -44423 -50347 -44363 -35902 -32219 -31911 -38516 -37379 -43504 -44221 -42186 -42490 -40040 -35808
17029 -35808 -33041 -35072 -35373 -43692 -49894 -39573 -33664 -36685 -38944 -41066 -38872 -37422 -33840 -32810
17015 -32810 -40526 -43488 -40547 -33823 -31680 -31975 -21836 -19608 -28147 -31672 -34506 -36671 -30573 -31786
17001 -31786 -25471 -25757 -25206 -23832 -26183 -26972 -27508 -26780 -30529 -35261 -37005 -32883 -38567 -32906 -26290 -25691
16985 -25691 -36115 -43713 -44776 -42640 -36655 -36105 -36950 -35120 -39171 -42126 -44104 -38352 -32869 -29127 -32122
16970 -32122 -35630 -34700 -29951 -45837 -54028 -48686 -39192 -35141 -30138 -30706 -37092 -41113 -37642 -37167 -42613
16955 -42613 -37716 -38466 -43631 -38661 -36327 -31987 -34733 -41841 -44121 -45475 -43627 -48496 -43711 -31821
16941 -31821 -34848 -43424 -44620 -37573 -39486 -44607 -35896 -32435 -30102 -27162 -32973 -34878 -34173 -31980 -31832
16926 -31832 -23683 -19193 -23041 -25842 -26550 -28292 -35931 -41846 -38397 -40837 -45908 -40888 -36382 -33737 -33777
16911 -33777 -33758 -34044 -36040 -34102 -36429 -36636 -41681 -42759 -40605 -36642 -41630 -40780 -44842 -48196 -42281 -32675
16895 -32675 -32884 -35378 -32688 -30631 -31832 -38099 -37841 -35683 -33166 -38900 -39309 -37440 -36407 -37183 -40364
16880 -40364 -42928 -38745 -35197 -36550 -35135 -36061 -33682 -34327 -28999 -33847 -32584 -34562 -38668 -39581 -29656
16865 -29656 -22202 -24962 -31313 -31310 -28710 -29772 -26308 -30283 -34251 -27444 -22854 -27344 -33747 -38547 -40037
16850 -40037 -34776 -34742 -34734 -34464 -34149 -32023 -29184 -32894 -29198 -30540 -33662 -36970 -32068 -34280 -41172 -49391
16834 -49391 -52262 -48640 -44658 -39883 -43823 -48866 -55296 -51863 -42027 -34001 -27154 -31396 -33373 -37483
16820 -37483 -40118 -35567 -30593 -26587 -31417 -39815 -43171 -38363 -35514 -33050 -31949 -32066 -38881 -50232
16806 -50232 -43939 -36404 -41997 -41427 -36093 -34521 -29401 -24775 -26247 -21867 -22798 -28316 -27853 -26266 -26792
16791 -26792 -26952 -26416 -27361 -24907 -29553 -32490 -32534 -28629 -30469 -27219 -18613 -19363 -26075 -20344 -22763 -27071
16775 -27071 -31060 -38527 -33809 -27488 -27089 -28839 -25545 -21585 -23534 -30817 -35072 -30436 -24871 -29588 -35283
16760 -35283 -42671 -43251 -40313 -33452 -27754 -30891 -34522 -38452 -37788 -39169 -36091 -34801 -30527 -25918 -20925
16745 -20925 -27355 -34701 -42895 -49330 -47325 -43478 -40426 -36185 -34162 -33572 -31814 -31161 -24648 -21479 -24073
16730 -24073 -27289 -29747 -32624 -25889 -22646 -24339 -29102 -32845 -32299 -31900 -31276 -27590 -31668 -35862 -30632
16715 -30632 -34694 -42279 -42214 -36884 -35623 -30157 -29186 -36875 -44402 -42776 -42666 -38894 -35588 -39107 -44572
16700 -44572 -41284 -38411 -33404 -34140 -33544 -25361 -24669 -33377 -39049 -34936 -33964 -33475 -20945 -18697 -22484
16685 -22484 -32728 -32622 -27355 -29329 -31346 -33351 -29551 -30944 -28160 -28203 -31753 -29256 -23434 -26253 -26856
16670 -26856 -28125 -28180 -20751 -15669 -18076 -25700 -36408 -43121 -38920 -36333 -33221 -26698 -28029 -30321 -30637
16655 -30637 -29261 -25396 -26948 -25874 -28082 -30771 -32051 -31878 -33814 -41522 -42635 -35998 -31602 -34594 -36383
16640 -36383 -37606 -37540 -39259 -33383 -27575 -31360 -26373 -25000 -26724 -23215 -22025 -27579 -27250 -24120 -23713
16625 -23713 -31883 -33794 -24515 -23405 -28744 -26266 -26085 -21093 -27277 -31283 -28024 -23869 -21543 -27304 -28179
16610 -28179 -29981 -36999 -38673 -36878 -40739 -41810 -37431 -36130 -37517 -38572 -37704 -32823 -38025 -37869 -31393
16595 -31393 -31488 -35971 -33412 -27345 -26042 -29580 -30585 -33779 -34673 -35178 -35494 -30498 -31836 -31299 -26986 -29995
16579 -29995 -33494 -35574 -31757 -24827 -16040 -16915 -24757 -32655 -30234 -30403 -30051 -29179 -31417 -35160 -37012
16564 -37012 -33063 -32042 -32762 -31125 -30481 -35185 -35112 -31514 -26933 -28930 -28029 -23021 -25867 -31584 -37012 -38697
16548 -38697 -41228 -40807 -43094 -39520 -39467 -36756 -27874 -27872 -31762 -28871 -29493 -27331 -25858 -32265 -35693 -37002
16532 -37002 -40778 -40537 -26854 -28828 -31735 -33228 -39597 -34207 -31132 -33135 -35156 -34998 -35610 -30898 -26622
16517 -26622 -29262 -29468 -32224 -30626 -25821 -20169 -21902 -29174 -30519 -24773 -20895 -24023 -31133 -30036 -31022
16502 -31022 -35127 -36756 -36572 -32769 -31022 -33143 -29112 -21875 -14069 -12708 -19387 -26799 -30234 -22762 -25054
16487 -25054 -32291 -32913 -25990 -26383 -30850 -30065 -22419 -20253 -25471 -23573 -21891 -25662 -27142 -31687 -37821
16472 -37821 -37225 -29652 -33362 -33435 -28478 -26050 -27257 -34095 -40064 -44511 -42670 -37324 -34321 -34129 -31863
16457 -31863 -29888 -32185 -32394 -27912 -21959 -17152 -22386 -20788 -22990 -25018 -24177 -25852 -33715 -30112 -21251
16442 -21251 -24724 -25545 -30060 -27522 -31858 -36710 -39367 -35245 -24658 -19821 -17930 -22417 -28879 -25083
16428 -25083 -22093 -26492 -28939 -31004 -27347 -30909 -40694 -44383 -41447 -34446 -30313 -27296 -25422 -27183
16414 -27183 -32309 -31909 -31774 -33978 -36844 -36467 -36611 -40502 -38244 -38370 -39117 -36731 -33350 -34182 -35010 -36146
16398 -36146 -29749 -26100 -27225 -24127 -27969 -32397 -34779 -29805 -32000 -29650 -30391 -35000 -29355 -25452 -27662
16383 -27662 -35118 -30265 -21752 -31910 -38274 -42164 -38006 -32316 -25075 -25171 -24011 -26933 -26229 -21560 -25840
16368 -25840 -31136 -33909 -32612 -37714 -37545 -28375 -27276 -24013 -21870 -19618 -20865 -23025 -33484 -33766 -33013
16353 -33013 -34822 -34077 -26508 -28003 -32489 -29992 -28665 -27647 -21979 -20837 -24502 -30346 -25903 -30818 -34329
16338 -34329 -26263 -20381 -14431 -19715 -24146 -30754 -26309 -22818 -25079 -25111 -29198 -30936 -25261 -24905 -23633
16323 -23633 -26504 -25946 -32468 -34513 -32403 -29582 -28325 -26994 -23925 -25215 -25833 -24246 -26693 -26070 -24454
16308 -24454 -32624 -37386 -36547 -32749 -28786 -27799 -32104 -34079 -32231 -38798 -35836 -33531 -36289 -34185 -35939
16293 -35939 -35891 -42922 -42932 -38707 -38629 -40328 -44326 -41153 -33229 -29673 -30897 -37743 -40816 -40895 -41352 -41670 -40504
16276 -40504 -35247 -35037 -36263 -41013 -41344 -28668 -19146 -21069 -23581 -25382 -30825 -31341 -29647 -23371 -21788
16261 -21788 -31602 -37646 -38829 -35268 -32629 -37983 -41018 -40179 -33188 -25485 -20911 -26556 -30865 -29744 -25837
16246 -25837 -24932 -27362 -28313 -31193 -35055 -32180 -31616 -28686 -29223 -27726 -26741 -23235 -22032 -21985 -25129 -32432
16230 -32432 -36836 -38947 -32489 -28533 -30656 -26144 -22162 -25068 -32067 -28852 -23296 -22827 -27872 -30687 -31921
16215 -31921 -29947 -32278 -36543 -38187 -40483 -39015 -37414 -33715 -38202 -41937 -35742 -27986 -24731 -21664
16201 -21664 -21589 -26137 -30156 -36011 -37078 -32042 -27948 -32352 -36408 -41100 -37220 -34109 -34948 -30104 -30483
16186 -30483 -31567 -32880 -32691 -35035 -33702 -30999 -34076 -33131 -29504 -24309 -24272 -23123 -23458 -19579 -15956 -21075
16170 -21075 -28405 -34853 -33703 -31030 -31385 -26806 -27060 -24393 -26997 -26844 -28632 -29801 -22633 -22039 -26451
16155 -26451 -32425 -32259 -35253 -39055 -33008 -29983 -30162 -26296 -24660 -30363 -26691 -17975 -17114 -20583 -21467
16140 -21467 -28397 -37536 -27963 -23364 -25653 -23417 -22451 -29490 -32284 -33866 -28910 -31765 -30809 -23742 -24340
16125 -24340 -23030 -27294 -30124 -24790 -21061 -29256 -37218 -38775 -36404 -30074 -22859 -18496 -26218 -30243
16111 -30243 -31314 -34667 -38619 -40571 -37474 -39845 -38887 -30638 -32487 -33951 -33304 -36146 -31232 -32334 -37499
16096 -37499 -41986 -38209 -34443 -40257 -42780 -33949 -29241 -30733 -26386 -23522 -20192 -20280 -34886 -36654 -31572
16081 -31572 -25481 -21582 -21460 -28348 -26871 -28989 -24394 -21861 -24577 -20851 -18174 -23467 -20407 -14231 -13762
16066 -13762 -18767 -15754 -12298 -16654 -20373 -14845 -12104 -12036 -19469 -22647 -23551 -22692 -21114 -19542 -18285
16051 -18285 -26546 -28880 -24048 -21894 -20854 -18629 -11915 -14658 -21878 -23044 -21232 -20443 -27005 -28590 -27335
16036 -27335 -26215 -22141 -18391 -15421 -17622 -20401 -29355 -35210 -32214 -27929 -27777 -29842 -27054 -20835 -20924
16021 -20924 -17253 -11642 -11324 -16777 -21843 -25670 -24893 -22880 -19508 -20645 -20832 -25146 -28355 -29489 -29385
16006 -29385 -24830 -19874 -20689 -20207 -25796 -29982 -33612 -32510 -32857 -32442 -27139 -27450 -30714 -31575 -27334 -27791
15990 -27791 -30713 -32811 -40227 -43806 -40999 -36720 -37081 -36735 -31699 -28809 -31305 -24255 -22695 -27411 -28043
15975 -28043 -16890 -10830 -10942 -10406 -9176 -5511 -2414 -12155 -13000 -11421 -20349 -21492 -17607 -23285 -26842
15960 -26842 -23826 -17670 -16436 -20651 -20525 -26815 -27075 -33212 -29946 -23977 -26964 -31161 -30038 -26881 -21866
15945 -21866 -14802 -15731 -20230 -20701 -17727 -16181 -23685 -26518 -20637 -22692 -22564 -20130 -20258 -12975 -12195 -12271
15929 -12271 -15934 -17897 -22203 -31567 -24199 -15726 -13449 -15627 -16940 -25447 -24257 -23510 -29882 -31351 -26124
15914 -26124 -23535 -27165 -29769 -30466 -30420 -26986 -19672 -15152 -14912 -15562 -19598 -16446 -12612 -5800 -5078 -6073
15898 -6073 5096 9039 1096 -2686 -4361 -1203 -733 -2369 4086 6423 2842 1928 3767 10791 10942
15883 10942 8019 6251 -92 -3403 -8396 -10165 -7318 -3799 -2032 1119 2394 5708 1610 991 -234
15868 -234 389 2588 -666 32 -4345 -1909 -5901 -7341 -6604 -8240 -6229 -1458 4072 8951 5951 5304
15852 5304 820 -3326 -2316 1682 -395 -8081 -7891 -9433 -8727 -4355 164 12052 15691 12790 6732
15837 6732 7430 10519 8516 5800 8476 11869 13738 12466 13225 12208 9467 11788 12197 4422 -2433
15822 -2433 -1201 3638 2187 -629 -198 3936 4722 6081 3622 8184 7578 2593 1154 2605 6179
15807 6179 3908 6958 8232 2595 1264 537 -1107 -7957 -6306 -4273 1070 6068 7828 11757 13119
15792 13119 8719 3674 3600 8669 10359 1158 -1174 -4572 -1725 1074 -1333 -921 1676 4877 5936
15777 5936 1644 -2605 -7873 -9887 -9856 -9378 -13776 -18439 -24506 -23618 -22362 -18132 -11576 -13024 -16999 -20971
15761 -20971 -25013 -25656 -22035 -23663 -24736 -23332 -17940 -13677 -20804 -26801 -27047 -31204 -31366 -32116 -29600
15746 -29600 -24068 -17617 -15010 -16587 -16751 -23584 -23894 -22809 -28703 -31693 -29128 -24574 -19715 -12210 -12919
15731 -12919 -11530 -9655 -6988 -8134 -6238 -9511 -9389 -12887 -19842 -26118 -26317 -19826 -15259 -20582 -28919
15716 -28919 -26578 -22564 -18409 -21646 -26239 -29566 -24950 -22262 -23000 -29268 -32684 -32492 -31544 -27221 -24000
15701 -24000 -25459 -21769 -23079 -26516 -30550 -33496 -30919 -26760 -23553 -17032 -10034 -16766 -18566 -12161
15687 -12161 -6293 -11173 -21062 -20251 -14249 -12603 -15471 -16161 -13376 -18471 -22037 -17174 -17081 -18313 -19495
15672 -19495 -22420 -19149 -16344 -15751 -16516 -18128 -16575 -19650 -27298 -26314 -26778 -22222 -16948 -15372 -17207
15657 -17207 -15363 -12073 -16076 -24474 -25561 -23912 -20117 -19659 -18652 -20603 -23767 -26389 -24340 -12110
15643 -12110 -7844 -15706 -13201 -6472 -5022 -5603 -5303 -461 714 -6218 -9491 -11487 -13580 -12852 -15202
15628 -15202 -18929 -19776 -20729 -18150 -21575 -23643 -20215 -21777 -23756 -23287 -24805 -30466 -24215 -15498 -19852
15613 -19852 -24903 -10925 -11239 -15363 -8445 -7778 -10305 -13657 -13882 -16776 -25145 -23776 -19947 -15531 -16877
15598 -16877 -15252 -12726 -9965 -18006 -19308 -20218 -22538 -20768 -24708 -28677 -24590 -19058 -13621 -17114 -18284
15583 -18284 -20007 -18863 -13624 -4647 -11765 -13792 -14703 -18749 -16111 -18276 -28886 -26038 -25012 -23622
15569 -23622 -19330 -19413 -18419 -17566 -17054 -13539 -15657 -14428 -19634 -19699 -17434 -21159 -16961 -21009 -18395 -15940
15553 -15940 -18747 -10091 -7508 -18376 -27823 -32155 -33665 -33835 -30599 -29605 -30529 -28626 -25601 -19928 -22445
15538 -22445 -17027 -16610 -18409 -20718 -19791 -16886 -19066 -21994 -18352 -20974 -17821 -10992 -10325 -16109 -22551
15523 -22551 -22984 -29610 -19665 -16043 -22718 -19600 -12084 -6536 -4944 -13119 -13051 -1325 -5709 -11982 -9586
15508 -9586 -13217 -11030 -5759 -4462 -8973 -10186 -13670 -16899 -22091 -26831 -20953 -16722 -16426 -14508 -15003
15493 -15003 -20214 -17241 -16961 -9569 -8314 -7365 -11000 -14540 -15617 -20960 -23169 -22383 -27030 -28285 -22477
15478 -22477 -12435 -7823 -9161 -14278 -16761 -15515 -13494 -9659 -7535 -17167 -23738 -18255 -17689 -14738
15464 -14738 -12473 -18246 -19372 -19523 -19381 -13071 -9046 -11477 -10082 -12600 -10015 -11652 -13172 -6272 -10083
15449 -10083 -14217 -8443 -9561 -11410 -11915 -8893 -11112 -13131 -18632 -17159 -15879 -16365 -14115 -11634 -13265
15434 -13265 -13966 -16471 -17082 -15771 -12871 -16313 -24048 -25939 -26480 -23902 -25036 -24644 -26328 -20797 -16663
15419 -16663 -13899 -12602 -16097 -14185 -16810 -12869 -12583 -9783 -8161 -6828 -244 5369 8522 4261 3701
15404 3701 24 -793 2077 3120 -205 -7384 -11532 -9173 -3348 -1129 1681 3812 8357 1325 -8434
15389 -8434 -8707 -10803 -9513 2734 15218 26759 22473 11798 12719 12362 7274 4073 -274 -1247 -9287
15374 -9287 -15848 -15293 -14265 -5257 -7187 -10552 -10837 -18725 -16635 -12828 -13209 -9264 -1973 4933 3072
15359 3072 2519 6023 5111 5481 20103 22965 16317 15086 17004 15597 15387 20476 25201 16173 2505
15344 2505 -6438 -5820 -1833 -467 4567 7273 8960 11522 8651 4597 3039 7170 8734 11928 16218
15329 16218 18953 21146 21241 18803 14896 7434 6687 4343 6081 2784 981 2044 10601 20131 23145
15314 23145 17242 8888 1465 -8183 -13660 -12339 -8731 -1003 5774 9404 6420 7032 7730 7220 1306
15299 1306 3644 5146 2141 6782 19263 22505 23662 27168 28090 28937 26287 20860 19629 20515 13457
15284 13457 13371 12787 10685 4159 -1089 5460 8893 1552 -779 2176 3619 4253 12999 18378 19283 22287
15268 22287 22248 16669 9802 10910 15908 17573 16340 18516 17065 13709 10867 14116 18457 18977 13478
15253 13478 14799 19471 29641 36637 29538 22583 20217 18147 19971 28595 30058 30499 36431 39988
15239 39988 39485 37291 35363 35242 28551 30830 35489 41551 39315 34988 40705 44894 38655 36016 38032
15224 38032 41308 43779 46061 48175 48781 53000 54514 58530 69529 83748 95793 107035 117043
15211 117043 129561 140962 165369 184214 213444 247811 281310 336600 402449 483960 594279
15200 594279 742740 927807 1149038 1382279 1601877 1750170 1788564 1698655 1522698 1304365
15190 1304365 1072038 850646 679717 550381 448760 386884 338103 302082 269814 244870
15180 244870 225787 205582 183363 173884 174360 171664 162603 154768 148162 139999 131515 119291 108248
15167 108248 103477 88045 76767 76081 80503 79855 85455 82659 80045 76061 76524 74325 72045 70494
15153 70494 69740 69019 73233 74829 63799 50454 54174 59230 58704 53613 52291 49213 48420 45615 43618
15138 43618 41411 42848 36524 33309 39219 36861 27611 29609 31797 28105 22287 17228 18158 16375 13577
15123 13577 14963 21348 25338 26928 23934 25874 32025 32826 37565 32416 26165 22370 25957 27504 26165
15108 26165 17598 26372 29617 29016 30464 25127 20559 26282 37823 48359 45699 39407 33313 28543
15094 28543 18018 9739 9054 5647 5230 3467 -2473 -3547 -2824 -4068 -2144 -3020 -3668 3486 12925
15079 12925 22319 27902 35017 39602 38997 43027 48923 56809 54841 39169 27757 26485 24415 24422 21666
15064 21666 16098 19382 22219 22048 25606 26869 25128 25220 21276 24493 30853 28100 22300 23288 16280
15049 16280 8620 8004 13286 8212 8302 13130 21534 24357 24627 28170 27134 31225 35214 33673 34675
15034 34675 34753 35108 33698 22219 21756 33096 44796 46815 45575 47240 48042 50013 48442 44326 43263
15019 43263 40733 36530 33284 37779 36618 33366 32866 31421 27911 29189 39869 43675 43823 42893 44763
15004 44763 43024 49577 64437 78644 95511 108304 127551 145394 164713 188009 201515 206888
14992 206888 210479 218123 232476 243179 254150 268949 283391 291496 293467 292875 288601 282643 276583
14979 276583 254487 231359 209399 188357 174958 163344 150809 137684 120595 108941 99596 86873
14967 86873 73635 65625 53795 45876 40199 33788 28230 24443 22324 23901 28703 35041 37284 45655
14953 45655 55251 65410 70615 78845 87243 86945 85178 88111 86280 82434 83095 73167 71199 73034 81535
14938 81535 92806 95544 100380 104361 114034 111135 99360 88457 74941 68820 74149 88588 104035
14925 104035 126713 151830 171427 180485 189118 197833 202020 204122 206090 196922 185641 179606 170805
14912 170805 161757 152765 141818 123261 114471 109159 106676 103732 110972 110873 110177 117004 122394 130245
14898 130245 135221 131618 128431 136730 149621 158163 166409 182646 194191 204138 215045 228747 236332
14885 236332 231032 225177 214173 196826 181153 174467 171027 169716 177386 187584 203327 216156 225114
14872 225114 234546 248501 269612 289306 313456 334638 350221 355804 357584 364986 380248 388183
14860 388183 391171 383628 368795 362039 360336 358393 350385 343322 343874 335883 338228 344265 355676 379592
14846 379592 420923 463262 497849 549368 618878 691510 758046 821454 873435 907868 913854 890787
14834 890787 845692 787743 722166 662280 621402 598138 590138 593090 598944 615464 639937 663341
14822 663341 698917 742912 796235 851552 908028 963643 1011743 1040084 1051731 1052540 1044807 1036467
14810 1036467 1030710 1025452 1020555 1025958 1037554 1052780 1069369 1081912 1095702 1114801 1135155 1169174
14798 1169174 1216687 1269541 1318471 1368578 1410103 1451144 1496653 1545803 1590141 1638878 1681065
14787 1681065 1724991 1762792 1798956 1833716 1880688 1934910 1997103 2064660 2129165 2191828 2262405
14776 2262405 2331102 2397627 2462193 2529713 2597179 2657315 2711151 2774652 2852680 2948736 3067304
14765 3067304 3226743 3408930 3619391 3846063 4082429 4330612 4619264 4950714 5336791
14756 5336791 5800736 6352194 7002731 7748794 8628177 9711405 11069367 12765413 14833943
14747 14833943 17294948 20155479 23448483 27279917 31802329 37271148 44120947 53104839
14739 53104839 65387733 82541298 106533236 139562900 183153799 235063026 285946116
14732 285946116 322341537 335338256 323719489 293798324 254962283 213768642 174346258
14725 174346258 139919343 112039473 90923274 75700450 64861410 56973851 50992051
14718 50992051 46231792 42279483 38875965 35881748 33227906 30879335 28817408 27013632
14710 27013632 25438404 24086596 22925394 21929831 21078601 20333902 19700314 19171709 18725822
14701 18725822 18377558 18117902 17944081 17848000 17796164 17716939 17536943 17216604 16753083 16169124
14691 16169124 15509699 14816210 14098684 13394186 12717402 12076706 11482098 10924474 10398486
14682 10398486 9903074 9446785 9020090 8609137 8206709 7817594 7436548 7076406 6735711
14673 6735711 6418628 6125683 5849983 5596072 5344486 5107964 4881980 4666446 4471882
14664 4471882 4290881 4131891 3979684 3826689 3672755 3515826 3361129 3208902 3059112
14655 3059112 2917872 2773099 2640131 2515607 2399066 2282358 2172398 2069025 1968816
14646 1968816 1872684 1786201 1720064 1653999 1595463 1537739 1492509 1445667 1390238 1340701 1297056
14635 1297056 1254307 1206827 1153387 1102986 1052283 1000594 938061 878620 835901 802471 767363
14624 767363 736905 716379 704415 690117 680008 683883 697781 711063 742889 777530 805196 835802
14612 835802 862222 871194 870777 875904 881821 886401 890935 875250 824404 756251 703254 663008 626415
14599 626415 579869 522809 472736 421063 383058 361349 337186 316908 299152 283406 275503 273589
14587 273589 278733 277375 277789 274538 275192 269605 263188 251898 232313 216951 202791 191295 194976
14574 194976 203757 212382 229620 246543 265169 279741 297504 306931 315952 327829 338409 350493
14562 350493 362820 377341 396030 409383 409008 408822 411185 410745 408529 404831 396611 379469 365076
14549 365076 351794 330607 317790 303395 294167 289275 285327 280666 281460 289490 299789 312293 329472
14536 329472 341975 351181 364949 369801 367290 349280 330413 323066 313067 307170 304277 297952 302718
14523 302718 300497 299979 298356 287443 274604 263757 253755 247702 238663 225635 221091 219225 222104
14510 222104 232480 240624 253283 256353 254494 249332 241836 233108 230713 227793 224036 220302 222921 217986
14496 217986 208280 200250 196472 182085 168360 161288 166973 172778 174718 169808 168147 176900 177810 178867
14482 178867 180543 176526 173310 164725 150555 142920 140593 135955 128785 122374 122519 124069 112397 99433
14468 99433 87874 82416 77239 76020 70921 66069 56595 54983 54385 56573 59167 58319 58775 57102 53203
14453 53203 57248 59139 51533 40023 35210 37204 32222 34461 40678 34359 33807 29763 28335 30692
14439 30692 24468 15434 13499 25884 36695 43720 46332 46033 49245 45615 43679 44322 46870 46759 55586
14424 55586 57165 57682 62589 72784 72346 68082 74251 81009 82064 80897 78238 76568 75805 70840 67135
14409 67135 64490 67574 72172 69415 67503 63956 56428 57091 67686 76240 75187 66943 60889 56028
14395 56028 54381 52252 51361 47015 44481 38006 32635 28436 26476 30440 43241 47317 47926 54734 64235
14380 64235 71322 71761 78456 79332 78966 80014 81651 78979 76678 72380 65465 59102 52041 46448 53575
14365 53575 53181 50332 50874 46243 45870 52267 52744 40330 41966 42296 35260 29745 39091 42524 45433
14350 45433 47113 41766 34133 24518 23230 25038 28357 26942 22222 17246 16411 14205 14066 15795 15609
14335 15609 18587 25758 25069 24602 23885 17032 17815 20159 20597 18078 13886 14709 9246 6193 7936 6225
14319 6225 8079 9786 4240 1877 4618 8974 9107 5919 8182 17157 23077 29448 30072 21980 20741
14304 20741 24458 30612 36663 41154 46845 49202 42818 41377 33638 32483 34405 33937 32259 29145 30723
14289 30723 27701 25417 35092 36074 37862 43282 49348 50871 60343 74072 82583 96254 115693 131682
14275 131682 137358 157602 183941 202945 233223 277448 325761 387678 477606 601800 759274
14264 759274 963141 1196674 1416054 1578207 1640366 1586721 1440914 1263222 1083876 907376
14254 907376 744334 610642 507326 423211 358078 310897 270168 234890 212884 202695 194056
14243 194056 183456 173868 160730 145238 137550 130107 123664 115930 108650 105800 113866 109093 100534
14230 100534 97598 89996 92414 94124 91957 88840 89760 83762 85577 81117 70424 63484 63884 63628 57838
14215 57838 55222 41618 41550 40193 36623 20100 15088 14859 16915 24598 20872 22510 21442 22117 27964
14200 27964 26760 26304 32719 34131 27855 19365 16317 23780 24147 23877 29072 21596 16731 13201 12826
14185 12826 4037 -3055 -7194 -3421 15 -2956 -2174 -358 -2779 -6193 -9138 -12395 -14231 -19727 -13852
14170 -13852 -12842 -18800 -14630 -7878 -9494 -11365 -10567 -9839 -309 4314 1211 2307 5960 7393 -1638
14155 -1638 495 7471 8430 10122 9061 5504 8014 9025 16051 15676 10776 11452 17013 26127 27273
14140 27273 28517 27717 40105 44901 51706 55910 59997 71869 78937 85794 99616 114094 118951 112808
14126 112808 113683 113723 105480 98358 86594 82067 75968 69879 65433 61249 57964 52262 50125 49135 41065
14111 41065 37709 37165 37312 35122 35281 36365 34377 34482 29353 29056 26330 27515 27494 33511 38664 41780
14095 41780 40845 46890 50189 52829 57429 63668 68434 78479 94291 102915 106432 119778 139684 162525
14081 162525 180798 185287 181868 181527 182171 193366 206187 210165 207247 195799 177298 156064 146079
14068 146079 139647 146315 147885 138368 117036 92170 71886 55283 44337 40252 39553 42549 40065
14055 40065 32810 29632 27298 21513 17926 18991 18312 17475 18026 16308 17420 18182 20243 8730 3799
14040 3799 5286 5402 5641 3341 1090 6798 12837 10510 5271 460 4005 4398 2260 4248 -587
14025 -587 -1845 -1412 12517 28013 33506 37792 33877 38342 49613 64030 77236 81247 84804 89114
14011 89114 91160 88162 81407 74879 77998 77225 77238 74617 67697 54708 44730 40038 37207 35822 30141
13996 30141 25427 22466 13457 3738 2347 -1336 774 857 -5352 -158 -4009 -3553 -10871 -11860 -9072
13981 -9072 -8104 -10661 -11456 -10762 -7868 -8285 -16313 -23184 -18114 -18689 -20514 -16578 -19997 -21506 -20777 -18774
13965 -18774 -17564 -22017 -19851 -16417 -18379 -25656 -23084 -19116 -17800 -19257 -20814 -19192 -18828 -14965 -12688
13950 -12688 -16688 -19144 -14179 -12315 -19606 -23852 -25379 -27019 -32312 -32264 -26904 -16848 -12773 -12762 -6585
13935 -6585 -7265 -10336 -14973 -19123 -17530 -26207 -30994 -28090 -16634 -8676 -7320 -14040 -23003 -25225 -28935
13920 -28935 -24222 -26154 -33626 -29903 -23106 -21506 -20607 -15703 -19907 -23423 -27124 -29402 -29542 -24420 -18602
13905 -18602 -17695 -21441 -24656 -25230 -22397 -14626 -16221 -20606 -21437 -13958 -14661 -18468 -22461 -16735 -15746 -15605
13889 -15605 -16011 -20224 -26619 -26286 -26921 -26933 -24804 -16300 -10970 -11690 -18222 -23305 -23377 -18514 -6155 2309
13873 2309 4254 879 7951 15381 16827 17137 26284 31188 43861 55072 83277 129275 189870 264597
13859 264597 358246 455452 509458 503785 447993 363358 275511 195506 133696 89685 61126 44848
13847 44848 34285 27091 28389 24636 17877 21125 18824 17197 13793 14841 10343 2498 9816 8454
13833 8454 10907 16796 16024 14513 18150 17100 12006 7809 7997 1672 11248 13606 2710 -3392 2372
13818 2372 4272 4089 2270 5864 13265 16955 13328 8773 8762 9796 6528 2396 6665 3986 -1337
13803 -1337 -6118 -10991 -8481 492 -1495 -6718 -13631 -14431 -11185 -2836 -2799 -4768 -4376 -11648 -17275 -14233
13787 -14233 -9784 -12680 -9071 -11858 -14037 -12828 -9776 -9297 -10656 -7919 -14225 -20965 -32488 -33250 -33114
13772 -33114 -30639 -24254 -25727 -23970 -22958 -26537 -27947 -23064 -21851 -18169 -14216 -18870 -24054 -25842
13758 -25842 -26226 -22205 -21761 -18965 -19065 -21824 -19500 -20348 -23524 -21369 -19343 -25124 -27685 -26502 -23986
13743 -23986 -24549 -28573 -26764 -27366 -26404 -19797 -22369 -18372 -21246 -30767 -29414 -19365 -12066 -18428 -23622
13728 -23622 -25749 -30065 -30408 -27095 -25271 -23149 -19245 -15111 -20056 -28113 -19746 -15874 -24574 -31379 -35146
13713 -35146 -31634 -32306 -27185 -17402 -21708 -17620 -18628 -21085 -18234 -15367 -14813 -16681 -14685 -12855 -16307
13698 -16307 -20792 -20710 -17248 -15613 -12228 -10709 -12504 -12706 -16689 -15756 -18275 -14947 -9495 -8623 -12820 -7038
13682 -7038 -9109 -8102 -13018 -26296 -27022 -23822 -10151 -10820 -20863 -21821 -16613 -9279 -8865 -13731 -9471
13667 -9471 -7885 -8492 -6138 2193 1763 -401 -4615 -8884 -10571 -16436 -20390 -17775 -11294 -9158 -8170
13652 -8170 -5549 -13972 -19447 -23181 -21514 -19000 -18304 -16450 -18923 -23936 -27228 -19034 -12263 -15257 -21603
13637 -21603 -24750 -21542 -19414 -15730 -14960 -7469 -375 -3445 -8237 -11058 -13569 -12714 -6455 -1684 -4719
13622 -4719 -4982 -8787 -10849 -4098 -226 -3277 1472 938 -5652 -5220 -8583 -11350 -7623 -5231 -2662
13607 -2662 -4898 -4080 -2538 -4428 -4798 -3337 -6609 -499 2551 6521 7869 4231 5956 6011 7518 12678
13591 12678 17954 21851 32339 47873 62186 71745 79675 94619 105282 113634 117635 120640 122484
13578 122484 118747 125147 129194 123493 119991 119077 117587 123881 125940 129370 127090 127562 131538 129178 119390
13563 119390 112890 110524 112588 110923 105930 107910 113547 118151 121557 125343 128850 126700 126984 120061
13549 120061 115260 117692 114805 115903 121288 117840 119933 117454 119224 117449 101244 92973 76900 66220
13535 66220 60342 49053 45246 45394 35498 24443 18542 22079 26097 29540 22036 23747 23834 16340 8124
13520 8124 -221 2928 11602 5921 1533 278 2024 5052 5944 2541 2577 3608 -1154 -6996 -8382
13505 -8382 -7263 -3833 666 180 -2256 -1629 2016 -3812 -5884 -139 3970 3009 10244 10774 -2171
13490 -2171 -10527 -13732 -12000 -11068 -14290 -20553 -17525 -15865 -17324 -16471 -12689 -7691 -3871 1483 -335
13475 -335 -2034 -4484 -9679 -10883 -10857 -9055 -11115 -9749 -4135 2655 6981 8147 4904 10819 16822
13460 16822 9467 5867 10737 12300 11392 9831 14890 16518 15989 18481 14835 10811 11902 18554 14712
13445 14712 5275 6520 6291 1650 -2588 -5211 -4394 -7793 -6731 -1958 -7974 -15593 -19571 -5857 -3740
13430 -3740 -9374 -13872 -11025 -13301 -9387 -8578 -5869 -4915 -11513 -12614 -7467 -5410 -6873 -15866 -18560
13415 -18560 -15270 -6693 963 -3912 -8372 -191 -535 -5506 -8723 -11810 -12335 -8513 -5350 -3679 -2589
13400 -2589 -2188 -1524 1151 2967 2459 -591 1026 -2858 -2558 774 6736 7783 2635 -1539 -5190 1499
13384 1499 5448 5928 287 2979 -1043 -5026 -6009 -6656 -7502 -2988 117 -1461 4817 5307 -2788 -4997
13368 -4997 -7527 -11418 -10796 -6595 -4148 -30 3631 3362 6494 2183 -3714 -3627 -6197 -6923 -2555 -4363
13352 -4363 -1538 -3437 -7221 -6967 3837 7067 7320 5400 103 3256 6698 2959 -3260 -6180 -10395
13337 -10395 -5811 -1829 -2704 2003 8409 8898 14274 18253 14319 9518 2514 444 3547 3653 -3175
13322 -3175 -8561 -9080 -8689 -14053 -9346 1340 4590 4382 7074 7877 5409 12071 7862 1482 -3842
13307 -3842 -4772 528 9275 12158 4928 1260 4496 -4611 -11228 -10024 -10830 -7193 -1051 3461 5845
13292 5845 7945 7511 12096 9775 5946 3169 2113 488 -3136 -2226 1512 -146 -4191 -7251 -9170
13277 -9170 -6610 1121 5705 9876 8274 9108 8332 6523 4696 9169 10602 16374 19017 16207 15442
13262 15442 14891 21091 26828 16380 7215 4408 9888 15087 20150 23644 16694 13785 14875 12478
13248 12478 9367 10996 9315 5203 12820 18531 24474 30673 35877 37268 42683 46999 51218 55268
13234 55268 55751 67308 76329 84299 94285 104187 106059 99741 88991 73084 59507 52282 55040 54851
13220 54851 49055 44413 45152 47367 51546 48643 49555 54544 54839 60576 62303 58636 56673 59475 60882
13205 60882 63153 65154 60394 58804 66797 68237 72806 73865 74699 80554 84418 84149 89484 107821 126136
13190 126136 138978 158511 193980 236146 286205 330756 362659 357568 324890 285875 256214 229629
13178 229629 209413 187295 171390 162235 155678 153960 158523 165933 168791 162827 155633 157189 155289
13165 155289 147218 147792 153837 161287 166505 164525 167542 173232 170209 174430 182399 193358 204659 205654
13151 205654 207338 212699 218500 231696 247771 260848 272762 294769 316322 352312 397089 446023
13139 446023 485461 479769 443408 401659 357866 328553 307258 289618 281415 279403 278398 279057 276650
13126 276650 271901 267965 261683 254244 253466 256539 266094 272343 278521 283024 285969 286518 289813 293713 294057
13111 294057 303289 314469 321740 323291 331190 339709 355312 369645 377051 383223 387638 390431 398181
13098 398181 409035 418372 437249 445889 454303 460210 455747 443989 420029 406090 399332 393295 392623
13085 392623 396228 401074 411982 416272 419369 424259 426117 428030 426668 431282 442506 448126 443604 438142
13071 438142 431639 432550 437143 435412 436056 435986 438349 440842 444030 442724 445076 442766 445581 445911 439532
13056 439532 436110 434806 430167 429748 427505 426683 422456 416014 404072 400890 398122 397169 404617 408536 410022
13041 410022 416357 426055 427018 418857 412153 418035 420325 421688 424248 422612 416215 408043 406048 407808
13027 407808 407443 402266 397368 397522 396306 393302 392161 392150 390045 385988 389010 391999 396051 392317 388967
13012 388967 389369 389007 389525 379887 377467 376124 371847 367000 367050 356939 343204 336445 333391 334393 337214
12997 337214 340820 341878 345045 345428 348218 356926 358408 358416 360986 362342 363413 370200 370530 365495 370580
12982 370580 382227 388529 389998 391018 382194 379351 376763 376194 373583 372264 369556 365919 357487 356636
12968 356636 362532 359409 357811 348970 342216 338396 342826 345373 340772 344584 352016 365434 376658 379552
12954 379552 374897 371188 369946 368658 361606 356399 343367 328234 320352 310949 309666 304582 300422 299465
12940 299465 297496 300196 302137 305678 311426 318548 324104 326845 335939 335441 332805 336046 332694 320379
12926 320379 314747 305258 293505 285624 280349 280632 286238 296404 302120 313330 333864 357573 377446
12913 377446 393352 403546 417877 438449 454543 458208 458426 462576 457987 446336 429739 411625
12901 411625 392099 369788 343397 316952 298522 280035 273966 269226 264618 262443 263312 262988 262696
12888 262696 265787 269157 279635 281665 283123 282897 288012 292424 302666 300570 294857 292046 284803 284358
12874 284358 279934 269393 250050 237062 232908 231922 223973 219194 210968 208727 200108 197327 199869 204966
12860 204966 209088 216161 225771 233044 241967 253248 262296 272090 277006 275760 277123 276498 268987 267852
12846 267852 273038 278045 284900 294521 314013 331700 353082 377452 393194 405187 416777 418419
12834 418419 415538 406747 401280 385692 366369 347621 328621 310278 295919 285598 278183 277490 271128
12821 271128 260893 259230 262575 271557 286685 309781 332388 345369 335273 314588 286474 266088
12809 266088 248884 251608 245210 240131 237968 243995 254299 257657 253511 246782 248049 255247 259473 265107
12795 265107 273875 279239 289041 299692 305248 301558 298266 300071 297032 300417 300344 303499 298035 302537
12781 302537 300646 298321 298395 299618 304799 310388 316009 318417 323451 327213 329344 339721 343062 345843
12767 345843 346129 347267 351487 359009 364931 373451 373239 369208 373463 379745 387294 394819 403818 410641 416214
12752 416214 421275 416795 417589 426234 427117 431651 445297 451574 458560 471533 482108 488492 497988 504236
12738 504236 513705 520109 533013 545327 553552 559026 572147 588053 593714 602504 622204 642545 656095
12725 656095 672166 687053 698934 713511 730907 745193 765404 781618 808010 826791 843240
12714 843240 865617 885532 909549 940035 968525 994725 1024220 1052036 1078990 1116909 1161201
12703 1161201 1196253 1227076 1269310 1308329 1352669 1403828 1457050 1508887 1558683 1617509 1679405
12692 1679405 1749251 1818543 1903833 1989505 2087646 2195606 2312215 2438040 2573679 2725031
12682 2725031 2890827 3077923 3286313 3507177 3758585 4047938 4375657 4747592 5170468
12673 5170468 5643298 6182372 6797659 7487548 8266197 9147572 10119700 11182395 12309423
12664 12309423 13476030 14645869 15788027 16862238 17836915 18672968 19353406 19842196 20132600
12655 20132600 20230314 20139496 19880918 19491359 19015053 18497631 18000210 17582967 17276762 17128330
12645 17128330 17160183 17387850 17806326 18399037 19141024 20006357 20945543 21923498 22895652
12636 22895652 23815259 24632477 25335539 25910921 26329905 26584433 26687729 26657478 26517255
12627 26517255 26308478 26084085 25903280 25797191 25815589 25961941 26206096 26511518 26833111
12618 26833111 27134631 27360630 27490240 27502699 27394128 27144494 26749428 26214822 25586629
12609 25586629 24880206 24133184 23403667 22737421 22179823 21766704 21536683 21506172 21666505
12600 21666505 22017534 22528436 23159993 23890146 24670067 25446318 26178049 26825542 27357168
12591 27357168 27751618 28003044 28118990 28089991 27935314 27680368 27350961 26998483 26672334
12582 26672334 26432827 26326168 26370515 26601892 27005004 27560500 28209994 28896174 29558088
12573 29558088 30142900 30611062 30932547 31092714 31076101 30885094 30522720 29997588 29346578
12564 29346578 28621954 27860652 27121459 26453354 25906836 25533900 25369365 25422189 25703399
12555 25703399 26210453 26916888 27791787 28774863 29796071 30806678 31751003 32590996 33311184
12546 33311184 33884040 34290918 34535280 34644709 34625486 34526124 34381810 34254013 34194006 34257855
12536 34257855 34481515 34899781 35514643 36308968 37251239 38310043 39408232 40442724 41289219
12527 41289219 41840159 41993245 41654649 40806488 39513406 37908040 36121536 34326626 32677232
12518 32677232 31294443 30235183 29527985 29181297 29185048 29523184 30197378 31191518 32487446
12509 32487446 34075155 35957275 38100757 40410791 42694504 44679177 46136548 46842269
12501 46842269 46583457 45323743 43224842 40503292 37427701 34271944 31270728 28578377
12493 28578377 26256787 24303249 22693150 21394769 20358884 19583511 19064543 18811677
12485 18811677 18863698 19255975 20055313 21278366 22886105 24823490 27008837 29224917 31145084
12476 31145084 32513198 33196264 33033286 31948874 30111627 27778104 25220051 22699685
12468 22699685 20430440 18549331 17116784 16106093 15461413 15122898 15049247 15249020 15753706
12459 15753706 16612249 17930261 19820235 22406223 25711235 29537375 33452494 37002189
12451 37002189 39738623 41129543 40839568 39001417 35994459 32254052 28291450 24572500
12443 24572500 21411371 18931279 17110793 15836496 15001428 14509833 14292963 14294324 14495814
12434 14495814 14963790 15801053 17103166 18887965 21071754 23474664 25888494 28066570
12426 28066570 29654545 30390471 30240763 29252482 27496096 25187978 22633249 20091770
12418 20091770 17726353 15684594 14002097 12693273 11728323 11035451 10558331 10261485 10122436
12409 10122436 10150900 10374076 10823915 11550584 12628507 14094228 15899430 17876689 19763755
12400 19763755 21339020 22351828 22537163 21847644 20455981 18577106 16462202 14371039
12392 14371039 12512849 11006211 9849728 9007364 8403211 7975908 7690884 7527705 7477266
12383 7477266 7560781 7800873 8221478 8824308 9581412 10420987 11206157 11824486 12158509 12104097
12373 12104097 11647575 10867176 9877986 8796861 7731401 6773985 5971103 5336570 4836424
12364 4836424 4435883 4110937 3846069 3617065 3412194 3229398 3061637 2912331 2771979
12355 2771979 2645399 2533280 2429075 2337239 2244555 2154915 2071479 1997646 1923579 1860873 1799418
12344 1799418 1742598 1691788 1650806 1606169 1567341 1532122 1500284 1469004 1430858 1397026 1358417
12333 1358417 1326075 1294882 1263416 1238907 1214708 1181422 1156826 1143518 1126103 1103734 1089132
12322 1089132 1087508 1073001 1041361 1003808 974411 933200 895878 859990 818188 780370 757527
12311 757527 734514 712001 700855 691803 689066 688727 690158 691836 699112 711102 718495 726372 737122
12298 737122 746714 746535 733754 701365 655607 609383 574434 542230 512110 490589 477520 467902
12286 467902 456343 446345 445355 438666 437622 439627 442281 448490 456558 458131 456780 460921 467706 474050
12272 474050 485298 496984 512768 526868 543738 555737 557878 547436 530424 519098 495644 465418
12260 465418 448147 441730 434095 418058 409498 404759 403012 404753 414125 423543 426782 441411 464860
12247 464860 485089 503683 517747 528246 531469 531030 524717 499345 472631 452495 444055 449592 456772
12234 456772 461390 454364 440291 430864 432831 428701 416899 403225 388192 379463 367848 362953 364070
12221 364070 364215 363388 358706 367792 378619 383926 397728 413944 432658 459861 478370 485262 486038
12208 486038 486163 469652 449133 433151 422170 405133 392740 381806 379718 374724 369518 356407
12196 356407 349904 344418 339656 338182 344757 352974 354328 354868 353985 358867 366727 379692 394535 420070
12182 420070 436189 442466 447983 459096 465589 464555 455480 441377 426663 415172 403833 386085
12170 386085 369852 364357 369420 364028 360224 361550 372724 379788 384019 390840 395098 404640 411609 421409
12156 421409 424115 421007 405762 392950 388546 380680 367900 355677 342997 338994 335854 340674 338819
12143 338819 327567 324014 319743 314239 314047 314201 315987 315714 314068 312847 310489 305814 309926 307793 304693
12128 304693 304291 308467 307018 307788 309900 306451 307594 308320 306512 304821 305051 305734 306911 303681 300431
12113 300431 297486 285514 283678 281416 271941 271061 275131 280831 284232 288608 287873 293007 293042 292508 293298
12098 293298 296844 295548 294771 304833 313694 310200 311968 321104 326163 325525 329801 327234 325661 328988
12084 328988 329341 326686 328725 328883 331252 334089 331695 335163 339334 343877 340483 337462 328358 326015 320345
12069 320345 317546 316734 323065 324084 328735 333703 334802 331699 330230 333970 334432 337768 335861 333932 334921
12054 334921 334139 333615 330954 337581 340732 331670 327207 329221 326687 322483 326749 323157 320371 319663 318445
12039 318445 316948 310665 297716 288952 280009 265477 250349 242043 232006 224708 217717 215962 208838
12026 208838 214255 223420 233355 243820 249533 251970 259099 270451 285541 302459 319285 332346 332134
12013 332134 331462 336525 326816 316573 304816 291531 283461 270153 258042 244165 240308 245183 253331
12000 253331 254204 265458 274527 278805 289597 305096 321732 341118 358269 375457 396740 424198
11988 424198 445452 450950 439888 430986 412140 385459 364172 337830 318561 305894 299735 293722
11976 293722 292561 301251 312939 318881 331299 341573 353903 373137 395346 407180 430703 455071
11964 455071 474518 485509 491505 490314 483931 474550 457632 440499 431636 422628 415642 414975 415694 414779
11950 414779 413769 428644 439364 455406 470116 480409 488245 500211 525171 551918 573015 593273
11938 593273 615487 634484 659491 669100 671664 674341 684972 692285 698705 705359 714883 724296 735648
11925 735648 747026 758870 777882 800182 822692 851308 887639 924553 957045 998717 1048776
11914 1048776 1097565 1148246 1210581 1279889 1353301 1434171 1531471 1625907 1736345 1868847 2029122
11903 2029122 2211272 2425507 2684484 3000770 3373160 3814838 4342359 4991443 5795002
11894 5795002 6793503 8043893 9619454 11611791 14140522 17326540 21259309 25890997
11886 25890997 30840651 35358790 38538326 39754511 38868987 36207493 32485207 28466151
11878 28466151 24752577 21657310 19266016 17526903 16349814 15662477 15412355 15575488
11870 15575488 16161368 17228955 18836562 21097413 24113415 27929525 32428912 37130875
11862 37130875 41174379 43704859 44265820 42801684 39594822 35272192 30597721 26210753
11854 26210753 22481431 19513288 17250727 15544726 14266115 13327310 12636247 12160348
11846 12160348 11862919 11715387 11720384 11878490 12212775 12762785 13571338 14697860 16235824
11837 16235824 18280899 20967115 24413948 28646671 33460330 38327823 42517162 45283194
11829 45283194 46042746 44594641 41313839 37023361 32578731 28600703 25376426 22943241
11821 22943241 21220429 20101686 19484709 19328338 19630054 20403384 21702301 23607631 26214999
11812 26214999 29573761 33643187 38167979 42639447 46453697 49065529 50069109 49363114
11804 49363114 47303290 44629174 42217278 40743634 40509191 41323289 42588577 43544185
11796 43544185 43597039 42474584 40192164 37019266 33392185 29782823 26534150 23829780
11788 23829780 21708759 20119964 19002152 18298118 17973685 18006524 18411831 19232502 20539608
11779 20539608 22413342 24912150 28023473 31520521 34891909 37415190 38479261 37877404
11771 37877404 35753098 32527353 28791033 25105250 21832556 19137469 17007822 15372915
11763 15372915 14112709 13141756 12399147 11841699 11426833 11154084 11003997 10968280 11051383
11754 11051383 11300270 11747184 12423391 13394599 14746698 16582963 19022307 22157636 25941311
11745 25941311 30044510 33869713 36812401 38350167 38087788 36018863 32645125 28741135
11737 28741135 24985680 21797398 19303846 17463172 16168701 15338224 14894822 14808956 15065001
11728 15065001 15695908 16748488 18294586 20409311 23147235 26452535 30066241 33454658
11720 33454658 35926693 36862419 35922540 33259433 29498681 25396349 21552619 18288465
11712 18288465 15669486 13619492 12021508 10764043 9751264 8924660 8240480 7664543
11704 7664543 7169549 6729901 6330763 5965437 5642659 5351654 5080355 4834450 4621531
11695 4621531 4423827 4246413 4092811 3953018 3828242 3714059 3610539 3525404 3450632 3373073
11685 3373073 3294871 3220417 3146607 3065376 2971803 2863271 2750993 2638128 2523010 2407900
11675 2407900 2303263 2204785 2110471 2019660 1934606 1855878 1781812 1709128 1630429 1554855 1497322
11664 1497322 1445193 1393889 1339778 1285202 1238062 1206357 1173483 1132433 1094718 1058230 1028353
11653 1028353 994194 960118 928175 904480 872826 848641 828987 802831 763220 726108 697549
11642 697549 672938 654974 638130 620616 604021 590925 577220 567743 562038 552062 537317 531873
11630 531873 519805 507681 498272 494192 484458 477248 468569 464521 455803 448730 437785 427376 415492
11617 415492 410315 401829 396812 381866 371272 367150 363727 356607 357559 359228 352276 342211 335692 336521
11603 336521 337339 342605 352625 353628 350749 346993 342208 339205 333200 322174 310916 309203 304873 303766
11589 303766 295687 285417 275165 264763 262091 260861 254222 247209 248543 252458 252655 252052 247946 247170
11575 247170 249632 249393 250497 249847 250329 248255 235189 232563 234468 226606 226209 223360 222139 221747 217876
11560 217876 220680 221745 228485 222676 211939 209456 212620 212274 208022 208051 212163 213988 221217 223286 223222
11545 223222 224969 227087 226304 222820 219219 214037 210168 206399 204109 196086 193268 195592 191570 189136
11531 189136 182738 174591 172957 171517 167021 164979 168985 172881 172435 165542 164425 163646 158449 159244 159697
11516 159697 164340 164996 157485 157914 160391 158514 158606 163752 167499 164895 161548 160998 164609 158834 147607
11501 147607 144268 148467 150466 148157 143526 137933 130688 125261 137827 145978 147470 140134 132096 131061
11487 131061 131731 134024 131679 126710 126819 137737 133448 122737 115984 111956 121230 118057 107640 113809
11473 113809 120294 115524 116627 118528 113144 111195 110267 108141 103919 99084 99082 101686 108690 110636 106393
11458 106393 105286 109625 113037 116988 120360 121822 126771 136222 139805 139905 146797 162550 175842 192703
11444 192703 211336 228668 247235 261970 275916 282637 276547 270566 253787 223878 208953 200676
11432 200676 191060 184616 179345 183747 192124 195917 198065 202265 213898 227885 239233 252318 269815
11419 269815 282682 292025 291532 288546 280779 270282 250570 227492 207830 196689 191614 187468 175773
11406 175773 165699 160732 155947 153315 149985 144189 141970 146424 153358 165486 168670 181403 191877
11393 191877 200912 206311 219998 243152 266270 284974 301413 311355 308995 301402 293237 279717 259467
11380 259467 244927 231853 220718 217935 216790 214359 211284 204904 213536 225250 234157 250485 272022
11367 272022 296149 314372 338208 355009 364366 365946 354398 342142 325353 313689 314380 324814
11355 324814 330383 334841 347765 355265 351290 341090 321478 309487 298649 282048 268774 267352
11343 267352 259130 256889 254523 257053 260230 267668 278148 287694 302119 323177 342926 361901 379372
11330 379372 389145 387727 381700 376811 363906 345061 327306 311087 307375 298896 285700 286717 291651
11317 291651 284853 281454 284221 277579 269499 265769 271381 272765 269306 265722 266396 279859 294290 306655
11303 306655 319602 342794 374138 392821 399367 399017 397167 379688 356876 329799 308461 286852
11291 286852 272003 278837 279092 271186 269557 273376 282390 290871 295180 300281 311135 334268 348475
11278 348475 359659 377772 394831 398306 393057 385711 367374 348999 336018 323536 312111 304737
11266 304737 307907 308401 313191 314606 308314 299656 292425 290359 301223 306914 306905 304780 310312 309658 300943
11251 300943 298538 300936 309925 316315 319931 322359 319368 327902 332282 331718 326797 329058 326052 325732 320656
11236 320656 308169 300469 295872 291886 298603 305301 297379 292895 282657 263202 259736 268673 280342
11223 280342 285364 282393 264818 240079 225358 221258 226651 237927 260147 276692 285484 289017 290081
11210 290081 278087 263890 241568 209238 176094 155990 153738 164461 175587 178062 171773 157152
11198 157152 148927 149955 149058 145678 144119 147193 146980 142061 140507 144329 148414 149643 156567 163468 162588
11183 162588 164756 164786 164822 164137 169837 170295 169576 172764 179169 181232 186933 187733 181073 181986 176427 172103
11167 172103 173116 176238 178932 179835 179017 178885 178233 178138 175444 171500 167747 167357 174795 181250 174293 168334
11151 168334 164247 161226 157347 149603 146309 144745 144689 132286 121965 120902 114936 105545 96113 94603
11137 94603 93696 91782 93260 95540 93098 90186 93618 89290 80557 73909 72049 74587 77493 63805
11123 63805 54473 48406 48120 55251 57947 57520 55675 55708 55139 48069 47170 39735 25470 27724 29006 32354
11107 32354 35624 40936 46493 40857 35287 32273 32357 31469 28613 26088 27017 33816 29795 23314 19907
11092 19907 17372 18676 22676 28784 25803 24767 21855 18964 19109 16207 17881 21248 19577 13291 16419
11077 16419 20974 21038 18974 15290 22361 21812 19437 18018 13952 11360 11165 14870 14421 12877 16908 12054
11061 12054 12690 13868 19041 19470 18327 16238 15257 21169 21434 20562 19874 12706 18365 22925 23383 25434
11045 25434 16958 13046 15586 20452 22979 12033 12539 14684 13211 14178 14859 17871 16923 16256 19555
11030 19555 18414 12021 6380 17783 19792 16625 16714 17149 13964 13822 17239 10998 9339 6007 6690
11015 6690 6754 4754 9943 16373 14595 11502 12859 11512 7111 3357 2366 9779 12785 3076 6929
11000 6929 4249 1195 4852 9381 10025 5439 3327 6473 6861 7574 5970 1918 1206 356 -145 1718
10984 1718 2244 -839 -6022 -7842 -10217 -10891 -7085 1162 1048 -3217 -3578 -5616 -5265 -750 4707 9563
10968 9563 11783 6259 -693 4035 10359 12831 12649 13659 13309 15599 21157 18532 16527 13426 16519
10953 16519 17575 10985 5566 2090 2868 -1798 -1444 520 5922 3372 2935 989 -2627 2352 10756
10938 10756 903 -6394 3148 1826 3657 2978 977 -7726 -11171 -5766 6574 944 -1335 47
10924 47 -2768 -17 -2856 153 940 6251 9685 7784 5731 8275 8241 -1177 -5297 -10185 -15363 -12738
10908 -12738 -6623 -2142 -3936 -9144 -11611 -8385 -2700 1604 701 -3083 -172 6700 5816 4172 3781
10893 3781 2478 -1649 1754 156 -5368 -6947 -2294 4160 7604 4477 -1288 -1791 -1142 2196 2877
10878 2877 2012 6397 8 -1659 -3143 -6410 -12035 -4864 6954 1743 -4201 484 2296 2393 -245
10863 -245 -4770 -5782 -5507 -6863 -7160 -6419 -2305 -3117 2285 5191 -1205 -4746 -5880 -5652 -10969 -13256
10847 -13256 -5980 829 2391 -2160 -7368 -357 758 1076 -1438 -699 4 -2583 -1414 -5366 -2437
10832 -2437 -6057 -7361 -8739 -9751 -11870 -15345 -18897 -16935 -12277 -9830 -7147 -14747 -13579 -15313 -14379
10817 -14379 -10469 -11209 -14922 -11078 -8392 -13096 -17717 -13052 -7973 -8775 -9754 -12608 -15028 -12960 -11452
10802 -11452 -14211 -15468 -13031 -10764 -10590 -14254 -8481 -6203 -6078 -10010 -10780 -8293 -6711 -2354 1293
10787 1293 -4996 -6810 -2648 -1288 -2539 -6120 -7773 -3839 -1617 -3919 439 -1868 -3780 -1350 5156
10772 5156 1136 -3636 -7774 -6685 -3365 -9383 -11047 -15953 -15081 -10808 -4997 -5362 -1362 666 4565
10757 4565 -364 -853 -4641 -6924 2355 2670 -1822 -3406 -5396 -7480 -4475 -7681 -9559 -6466 4337
10742 4337 12945 11865 10929 13960 20981 26848 18366 13239 4125 -5439 -5760 -5488 -472 2310 -2554
10727 -2554 -3630 -1682 -887 -3320 -3996 -2641 -980 2684 5709 3761 10747 11549 16842 20838 14561
10712 14561 6745 10875 10710 1811 -8084 -10029 -2103 -396 -5950 354 5053 5751 2662 2238 -100
10697 -100 -3885 -3302 -1074 -3303 -1928 2005 8485 11056 11634 12901 11404 10002 5776 7898 2558
10682 2558 283 0 -3324 -2946 645 4629 6 3440 7659 13786 20996 13761 15591 20563 17853
10667 17853 9339 4472 1742 -2224 -3488 -2086 1951 1803 5528 4802 1533 1169 -4267 2646 2651 3305
10651 3305 11184 21415 29253 27948 21435 16624 15708 18352 19104 17725 12976 6287 6625 8696 11200
10636 11200 14251 15880 13507 12024 11617 3782 -311 -534 -4203 -297 15202 27918 23859 22947 23557
10621 23557 21240 16082 9945 11889 8159 8369 10713 7969 1704 1787 5488 3296 11396 15503 13426
10606 13426 9125 4949 823 13149 25666 22644 21929 25268 27749 26059 21554 13876 19803 22159
10592 22159 23882 31027 32196 23943 23615 19228 19310 18677 18581 18561 20306 26435 39403 43197 42123 35355
10576 35355 30760 27444 16379 14495 20581 21181 26419 27148 24294 23636 29546 37624 36368 33896 28650
10561 28650 23106 21255 28617 29079 27515 27236 25751 25658 34400 37453 36032 36311 37179 33068 19193 18621
10545 18621 14777 19022 25561 23529 19799 17669 19496 24295 29797 29447 26660 22740 29540 35776 30846
10530 30846 31099 33151 39454 46456 48494 50443 52093 57760 62638 66830 69971 70691 68945 64584 68766
10515 68766 69745 63527 57458 50853 45140 42201 49252 53536 50585 51540 53545 49917 51286 50044 52399
10500 52399 60181 65618 78583 86749 94218 97729 97627 105385 104925 100349 94897 85157 70991 59088
10486 59088 59502 53552 51105 55316 55747 59729 59933 65467 66446 67292 66193 68737 75241 74395 75517 72887
10470 72887 75329 83876 86310 84399 84043 79961 76853 81541 82601 75858 67585 64641 68085 63848 58842
10455 58842 55622 54215 52821 49144 54046 64487 72888 78528 79158 75022 82418 85309 84708 72523
10441 72523 60238 50765 49599 51783 45710 40379 37369 41127 46045 51551 55706 59655 52734 52497
10427 52497 54973 48970 52376 59919 54763 52127 48194 34908 29642 28686 28194 31411 23345 23322 26669
10412 26669 24808 24979 22093 21093 18603 17618 24038 25971 22679 21021 29033 28155 23161 20756 20970
10397 20970 20708 18198 24343 27288 29780 26929 24527 17860 7209 137 687 4411 10732 -2879
10383 -2879 -12303 -8264 -10254 -8954 -5251 -11921 -7092 4356 9143 1641 3798 -8 2282 -2309
10369 -2309 -6631 -10511 -10574 -9575 -3874 169 2564 -1374 -4471 -10998 -13650 -13969 -13132 -4538 -4240 -10345
10353 -10345 -16588 -16014 -6036 835 -723 -5405 -8826 -8360 -4672 -1998 -7069 -4056 -2955 -1873 -425
10338 -425 448 4007 404 1955 4811 3073 3620 -3475 -13679 -8946 -10913 -8498 -7418 -7682 -6311
10323 -6311 -5064 -4126 -1887 -5535 -3714 -3539 -618 -4749 -8589 -13295 -10495 -11046 -6926 -5772 -8005
10308 -8005 -9556 -11398 -14121 -11224 -4442 -5946 -4033 -3845 -6824 -10430 -12843 -8378 -5635 -8348 -921
10293 -921 4982 11961 15261 18463 25434 21355 23456 21605 19843 25884 34896 42380 40770 30954 24872
10278 24872 23547 21683 24426 30786 43380 48520 57743 76711 99286 126459 161627 209172 269904
10265 269904 330534 378862 414672 436014 434526 406756 365478 310140 256479 216426 183739 147036
10253 147036 116856 97233 81817 71831 72474 70496 73739 70325 59320 55183 57832 53127 43946
10240 43946 44417 44350 39945 43165 37197 33469 37954 44900 51748 54694 53969 44875 43227 44158 38734 33236
10224 33236 41407 45273 41288 39586 34724 29042 26093 30684 33368 31068 27396 29446 32825 33744 35735
10209 35735 34266 29198 27807 27453 27347 32964 32724 31177 33099 32958 26412 26047 27394 27475 26140 29409
10193 29409 31265 29401 27407 28181 24249 20746 18922 22275 19702 15909 20237 24326 29466 26073 25879
10178 25879 25021 25560 33645 33522 32903 30068 28920 32626 34792 37054 39539 43629 47808 54130 57767
10163 57767 62167 75592 92318 117431 153003 192854 233668 279338 321857 359800 374902 365259
10151 365259 341414 295992 248196 200255 155327 117937 93772 78696 75467 77420 74579 60881
10139 60881 59994 59517 56462 54480 49398 49839 51724 51996 44549 39363 44730 48654 55533 55441 52102 54802
10123 54802 58906 55466 41516 34238 40084 50941 53120 50488 44607 46627 56627 56334 52835 51934
10109 51934 53682 53031 52725 56599 54059 56565 59838 59326 61923 62944 62792 59557 54859 52903 49477
10094 49477 46860 48843 56172 54064 55222 55547 59532 62117 68800 72171 77301 74245 71974 82707
10080 82707 90446 89976 90341 93192 93434 93588 90353 89384 92732 90072 95526 101455 104988 114638 120711 123819
10064 123819 121104 121993 122816 112427 112220 128538 134352 132551 139967 143774 148660 142700 141304 144542
10050 144542 144090 145790 148213 145783 139421 140589 139915 135510 138512 146721 152705 153723 155937 160442 159589
10035 159589 157374 154210 154435 154256 155918 154539 152749 155997 165624 167163 163412 159215 163221 172440 178930
10020 178930 192639 206273 213589 212405 208942 203764 198436 194059 185824 181578 183086 181232 177486 178332
10006 178332 179635 173453 173440 174055 182589 184024 182407 184727 193247 195435 197943 203325 206237 201846 199704
9991 199704 198953 199492 201125 203711 199533 197475 194700 189379 187766 195804 199438 203623 206598 211258 214071
9976 214071 214483 214899 212289 216808 214729 216607 211901 210888 210358 209459 214454 221042 211829 205712 213665
9961 213665 217627 218442 217041 216398 214996 218540 221737 225524 226071 222291 223460 218395 212657 217300 216233
9946 216233 209426 207196 200280 197858 201739 208290 215574 221327 217466 213099 216562 214983 211334 219724
9932 219724 224946 218882 215349 218292 216736 210075 209635 210710 210381 212454 208271 197066 202917 210205 207324
9917 207324 206417 203648 194751 184491 188497 183408 178632 178255 179886 184220 189604 191455 187119 186176 185849
9902 185849 178806 174115 174998 172578 173183 165128 161405 157352 149095 144956 152981 157355 153751 151560 150459
9887 150459 146756 151444 148616 153739 150944 150379 155799 149523 145047 142882 143700 141696 146066 147688 151927
9872 151927 151757 145037 144916 150612 159393 158747 157159 156095 160058 153316 151421 153423 152066 158327 164998
9857 164998 171061 173785 171316 162379 156642 153802 152641 154560 160912 159611 155624 161627 168341 167664 174040
9842 174040 180945 181713 183991 180572 174752 174868 177160 183171 187402 185392 182966 186594 193222 194640 199258
9827 199258 202884 204606 210500 211060 218183 223659 236090 242386 242445 240610 240597 240107 243620 247041 249557 251414
9811 251414 255736 259882 260348 260161 260378 262781 269829 274458 280108 284411 285890 285046 291847 291221 296244 299101
9795 299101 304658 312029 311740 315335 320753 337302 350867 356616 359337 367661 377685 383578 384298 388527
9781 388527 400944 410356 413388 416337 426621 438161 446528 456276 465634 477344 480794 484036 489952
9768 489952 505295 508758 515773 525284 538108 550795 559570 571395 582765 592043 600782 615025 634165
9755 634165 652276 671915 681684 692875 709135 717557 733362 762379 779319 801079 830716 860026
9743 860026 889264 914935 946073 985639 1021022 1070038 1118568 1180026 1257107 1335080 1429381 1543643
9731 1543643 1688327 1867595 2096842 2388008 2776976 3277213 3927886 4764928 5776194
9722 5776194 6840952 7613309 7764625 7292839 6443088 5516051 4702859 4066479 3596923
9713 3596923 3265646 3035638 2871563 2764027 2693025 2652257 2637641 2637550 2649863 2683114 2730270
9702 2730270 2789827 2848206 2909976 2991417 3089663 3187189 3299383 3433762 3576399 3727606 3894373
9691 3894373 4080810 4283705 4502885 4748034 5008070 5283846 5583294 5900079 6238191 6590188
9681 6590188 6958420 7334693 7709791 8095903 8490785 8891563 9289355 9673105 10040430 10394372
9671 10394372 10717040 11018024 11300418 11557290 11795389 12029970 12261471 12500455 12748088
9662 12748088 13021230 13335338 13687574 14077674 14501149 14955284 15436179 15952173 16484952
9653 16484952 17026440 17559262 18071456 18556178 18995813 19383469 19711654 19975365 20181158
9644 20181158 20347585 20477825 20569096 20642943 20701380 20772260 20855683 20941609 21057627 21212030
9634 21212030 21396236 21599541 21806194 22013254 22209107 22390323 22554245 22705524 22823457
9625 22823457 22909195 22966946 22989692 22981031 22966548 22945582 22930779 22931107 22951821 23008089 23099277 23230620
9613 23230620 23408514 23615203 23854340 24097458 24340903 24572358 24782012 24968317 25135330
9604 25135330 25277589 25399943 25501535 25596892 25686573 25776701 25877362 25998996 26141002 26310324
9594 26310324 26501670 26719478 26959234 27217691 27505036 27794382 28071379 28323360 28540929
9585 28540929 28731306 28888932 28998112 29067906 29117346 29148657 29177857 29231242 29299075 29406758
9575 29406758 29564933 29765671 30010009 30288657 30595216 30919293 31257682 31595424 31913308
9566 31913308 32199190 32443522 32639384 32778350 32853424 32861520 32813543 32727748 32605873 32464887
9556 32464887 32331115 32219031 32143450 32115881 32135914 32200517 32300731 32437202 32579576 32729765
9546 32729765 32870009 32975181 33029951 33025472 32969325 32860817 32699935 32500833 32277736 32034329
9536 32034329 31784101 31537171 31312052 31125546 30987560 30894183 30835722 30824806 30847850 30873143
9526 30873143 30900151 30887503 30826275 30708927 30503839 30204045 29814517 29326392 28766112 28145627
9516 28145627 27481060 26793115 26085820 25386126 24707172 24057341 23441140 22879948 22368573
9507 22368573 21910398 21489429 21107565 20758533 20424868 20092471 19750045 19395536 19018413
9498 19018413 18604412 18154883 17678231 17164590 16613296 16039202 15451174 14855392 14263055
9489 14263055 13664572 13077411 12505553 11943649 11403681 10897172 10415689 9958221 9517927
9480 9517927 9103845 8711361 8340842 7996699 7676160 7372305 7083248 6814500 6571977 6335541
9470 6335541 6105843 5886479 5673654 5481002 5302762 5132535 4967419 4806273 4648630 4498238
9460 4498238 4354144 4211454 4076978 3946870 3820796 3701016 3592100 3488495 3380398 3275587
9450 3275587 3172808 3076261 2983254 2887592 2800879 2721538 2640186 2563679 2498551 2429003 2354783
9439 2354783 2284994 2221229 2165967 2106460 2046811 1996585 1945386 1891086 1843608 1803893 1766747
9428 1766747 1724938 1676167 1645174 1616447 1575615 1534966 1502835 1472695 1431713 1401569 1381623
9417 1381623 1354912 1323768 1296530 1276970 1256078 1235943 1211652 1184259 1168567 1160928 1144701 1123123
9405 1123123 1104474 1093663 1085146 1070550 1053387 1042519 1034868 1023160 1015480 1010254 1006702 998089 986158
9392 986158 974832 961363 951832 947407 939670 930370 922098 915529 907703 894223 888965 891868 892142 883772
9378 883772 878265 876283 873592 876957 876148 877074 876022 871964 873714 873828 867539 862563 866891 874861 874934 871532
9362 871532 869255 862889 866135 867353 873675 886267 893259 895731 903936 915036 923041 933441 944941
9349 944941 952518 964310 969674 972967 975904 980244 982621 984635 993158 997995 1002818 1010999 1012938 1023499
9335 1023499 1040356 1048370 1057118 1071131 1082159 1089359 1110660 1127060 1138339 1158656 1187639 1208534
9323 1208534 1227321 1249686 1278511 1300305 1321004 1343218 1371040 1398330 1424361 1451733 1480128
9312 1480128 1504843 1542252 1571086 1607893 1644259 1684486 1724547 1765329 1813313 1871732 1931902
9301 1931902 1991136 2057335 2133834 2210431 2289085 2378740 2479218 2588463 2711768 2834226 2965047
9290 2965047 3115622 3283577 3463466 3656381 3867386 4096957 4351205 4630325 4936939 5272290
9280 5272290 5648790 6054082 6489938 6967579 7480741 8025280 8606717 9213208 9841623 10478794
9270 10478794 11104105 11700644 12248742 12725392 13122148 13430065 13634099 13735133 13745384 13680711
9260 13680711 13566414 13431209 13289262 13158183 13062378 13025659 13037485 13118135 13270921 13504419
9250 13504419 13794899 14142833 14542613 14977145 15434358 15884483 16310887 16676670 16971950
9241 16971950 17185623 17312471 17348983 17308807 17227080 17114968 16974205 16831665 16707594 16617210
9231 16617210 16576209 16614414 16732408 16928102 17218011 17610708 18106261 18700801 19380449 20146921
9221 20146921 20991830 21894444 22836819 23798332 24726629 25598363 26383199 27037026 27532572
9212 27532572 27847627 27991716 27986086 27832070 27568178 27243027 26894138 26561074 26275286 26073526
9202 26073526 25980772 26016408 26183804 26489746 26931999 27501945 28191014 28969936 29799700 30645073
9192 30645073 31468707 32227788 32873441 33371888 33707926 33874415 33866284 33698760 33385576 32932983
9182 32932983 32368790 31718036 31010598 30267656 29502581 28749049 28036487 27377202 26796900
9173 26796900 26323618 25957157 25703355 25575498 25562240 25654686 25848766 26121653 26454796 26826462
9163 26826462 27206446 27566929 27877446 28098600 28209680 28207150 28080897 27838285 27491609 27085926
9153 27085926 26635179 26174976 25733982 25334537 24996259 24748622 24601269 24562281 24631183 24815559
9143 24815559 25104744 25486270 25943908 26458698 27004538 27562009 28095387 28584103 29003501
9134 29003501 29349976 29601199 29732862 29752051 29652738 29425361 29068886 28600602 28023848 27351428
9124 27351428 26610346 25841057 25063466 24313340 23615755 22992561 22462703 22027705 21698696
9115 21698696 21475832 21352340 21325569 21380873 21497598 21664647 21848292 22017466 22152965 22215364
9105 22215364 22176325 22030731 21766677 21388774 20905072 20333208 19693681 19020162 18329814 17650659
9095 17650659 16992672 16375441 15809389 15300056 14854721 14472785 14160282 13909114 13717866
9086 13717866 13577361 13487209 13444436 13442448 13473589 13521729 13568669 13602129 13618141 13613110 13555430
9075 13555430 13445770 13276942 13057447 12794950 12494367 12170067 11849786 11539249 11248676
9066 11248676 10989978 10775500 10600746 10471651 10392295 10358225 10359642 10400513 10463123 10535138 10606749
9055 10606749 10661887 10685271 10677937 10607946 10465865 10262510 9998425 9678831 9316995 8931582
9045 8931582 8520413 8109392 7701845 7302285 6923453 6566792 6233217 5918429 5625766 5349932
9035 5349932 5090747 4854112 4642863 4443644 4249381 4070191 3908331 3761510 3619335 3471803
9025 3471803 3338373 3222284 3119306 3019430 2920661 2831593 2741029 2653870 2575417 2500496 2430162
9014 2430162 2360675 2296293 2233991 2160698 2091796 2032185 1977458 1923909 1866666 1807662 1757996
9003 1757996 1706553 1656079 1608119 1561998 1517197 1478163 1439108 1395146 1351704 1309397 1276184
8992 1276184 1249548 1219851 1186385 1156543 1128053 1106204 1087556 1065061 1035508 1009012 987719
8981 987719 960640 941987 923443 901711 880669 858900 840876 811106 792978 786240 772604 751213
8969 751213 732554 717233 706559 697302 685678 678782 670710 659454 643855 633225 620986 618761
8957 618761 616825 608669 598997 591811 580526 569742 553804 536817 532971 531639 531844 526078 518378 504776
8943 504776 488293 484621 486380 478263 462406 452945 456880 465819 470250 467667 462640 455772 453638 447798
8929 447798 430145 422068 424061 417264 407233 405104 404537 397637 385283 379759 372887 365656 359767 360379
8915 360379 356697 351853 345801 340026 340121 341611 339175 344101 340447 336403 325342 319638 317808 319456 323029
8900 323029 316503 310418 305287 298809 295428 293783 292523 301366 302209 292782 288491 284168 281490 277188 283092
8885 283092 288299 285817 282262 277840 274069 273570 277366 281478 281134 274640 264342 256268 262711 266132 264755
8870 264755 260652 254205 254558 259962 260230 257902 256580 258557 262141 261333 263623 265313 269375 279075 286447
8855 286447 287685 289257 290500 293493 300222 303152 296528 293289 290648 296173 298904 294155 288011 284293
8841 284293 280560 280942 271675 266076 265476 261674 267938 270268 274058 277998 274648 272306 270426 273943 274547
8826 274547 275363 272659 276857 277125 270585 268356 265487 267850 268238 271581 269398 257902 257409 254813 254282
8811 254282 260961 267170 268679 263688 265257 264215 263866 271778 277760 277175 282028 293868 301671 299961 299783
8796 299783 306907 309773 316120 319273 324545 332112 339169 353596 372970 390316 407785 422577 431505
8783 431505 423569 407591 387820 370736 356235 351651 351962 343271 338111 348099 353729 353380 356592 355319
8769 355319 350435 342553 336120 339100 340147 335407 328340 323904 316267 311795 313472 304133 294503 296886
8755 296886 300174 302301 311160 311763 313347 316400 315507 310677 314721 321208 329230 335947 356067 373340
8741 373340 392567 407373 423827 425818 404995 378170 351472 332607 318137 300288 287135 282287
8729 282287 279225 277444 278367 277266 276517 272353 272340 269696 265895 266804 269094 276554 283085 281215 276433 275258
8713 275258 275474 274876 275170 276527 282670 284519 280628 271528 270732 275340 273774 269440 264519 261870 258877
8698 258877 262781 257587 246839 244508 248556 245171 253745 257797 258471 255676 253394 256584 263054 261979
8684 261979 252561 245296 238695 235907 236368 234801 232348 228564 230995 236290 227988 224161 221983 223759 218366
8669 218366 215014 218325 214901 209907 208830 207011 209157 209344 211448 213802 215673 221500 225096 226178 224121
8654 224121 220553 216320 222544 227891 230376 234034 238743 239382 243836 246577 251004 256752 274492 293174
8640 293174 323655 363524 405497 461252 510776 518742 488938 439567 389500 355958 328052 319904
8628 319904 318573 314058 313900 320297 324355 329860 334050 343906 346366 352683 355053 353466 339856 317574
8614 317574 297311 281845 264062 247063 241842 241463 244144 239175 226557 215784 221561 235673 244061
8601 244061 242002 247942 247926 261988 285797 323479 366676 423295 505043 624029 726474 746275
8589 746275 690107 589083 482697 402416 340973 300048 280522 261377 253057 239566 224472
8578 224472 216420 206743 205286 206047 202736 194700 194602 195035 193632 192374 190458 188135 188249 188656 192125 201982
8562 201982 203682 202998 206610 208297 207993 211344 215104 216039 217961 220430 226661 236845 258917 287772
8548 287772 325795 372063 417136 437818 415867 360867 297921 252033 222712 193248 177459 164757
8536 164757 150167 139513 138833 140663 144636 140739 135263 130882 123124 117904 125199 126784 121867 115821
8522 115821 122276 130830 129236 127497 130060 128099 124996 131065 134434 139707 133823 129927 132803 130755
8508 130755 136157 138630 133930 134620 132421 125885 117065 114488 117003 127610 137684 129043 122632 121522
8494 121522 117899 117148 117707 117836 117690 113940 108550 119139 120982 123031 118816 119059 119118 117473 114122 114296
8478 114296 119937 116588 109115 106588 111308 108544 107980 100481 101361 101939 100406 95001 97995 98176 93890
8463 93890 92992 95552 95119 88324 78039 70416 72216 76878 76469 74448 68591 69203 63042 57253 50113
8448 50113 54386 56866 55387 62512 72382 71003 64024 55993 54902 57197 57318 56806 58660 64171 66743
8433 66743 67431 64316 57731 56287 58133 62547 62568 58188 56913 56359 58126 56056 48674 46263 43294 47128
8417 47128 51868 49417 40859 40382 45625 51666 54513 55498 52185 42279 39185 40636 41343 40945 42461 42824
8401 42824 40274 48606 52703 47619 46163 49801 47722 41505 42631 42617 34461 34415 32100 37588 42033 40998
8385 40998 34481 32641 33858 32777 28357 34173 38182 32213 30936 30070 29504 23588 27211 23894 21649
8370 21649 19151 21754 25974 31490 38272 39015 40004 42084 43070 46786 47360 41612 32085 24073 25083 21375
8354 21375 24198 27344 22626 16347 14131 13658 17805 20512 21637 24092 26914 33115 33149 33994 34415 30565
8338 30565 25006 24760 14246 16275 21355 16849 11237 8248 8747 5483 6157 11015 10931 9263 10265 11833
8322 11833 12314 12692 14989 14069 7284 1794 4194 8728 8587 17055 25584 34183 25484 27369 28408 21949
8306 21949 22942 16643 10210 7354 8378 4904 11908 15996 14827 16707 24535 19116 15982 15608 13082
8291 13082 11266 18719 26768 29312 30390 18677 8386 4301 2327 2790 11696 14416 15315 21331 29866
8276 29866 25099 24690 23565 22420 23393 17018 10750 4207 4916 9322 14689 11871 7930 9377 11881
8261 11881 14125 18701 21919 19526 17240 17262 19573 32618 37676 28737 19569 14562 5313 7527 6654
8246 6654 8406 10654 9318 7054 11759 8257 7130 7767 5165 6622 9683 5140 5495 10861 14048
8231 14048 16288 9640 4158 6235 9961 12381 14440 17355 25974 34475 36881 30134 24057 19005 9261
8216 9261 5173 6185 5684 14850 20486 29200 30653 23375 10522 7281 5734 9664 12909 21901 24111
8201 24111 19167 23116 26569 25242 23744 29341 27790 18949 4693 4342 12858 16103 12761 9428 8855
8186 8855 10700 12828 7439 6847 4846 6194 2105 -5281 -937 7941 11011 9029 11702 12760 20721
8171 20721 14210 9788 16567 20836 13368 12079 4852 7057 10633 7414 342 -1342 2881 -887 -5732
8156 -5732 3116 6243 2660 2318 696 1354 7293 10240 8912 1720 5985 11328 12471 15614 18117
$$ [...]
##END NTUPLES=NMR SPECTRUM
##END=
