##TITLE=Analysis number 312692
Compound Code cc 09010
Project Code adrs
Chemist Name hixia
##JCAMPDX= 6.0         $$ Bruker NMR JCAMP-DX V2.0
##DATA TYPE= NMR SPECTRUM
##DATA CLASS= NTUPLES
##ORIGIN= Bruker BioSpin GmbH
##OWNER= NMR
$$ XWIN-NMR		Version 3.5
$$ Thu Aug 11 10:03:07 2005 GMT Daylight Time (UT+1h)  MAYBRIDGE\NMR@NMR_250MHZ
##.OBSERVE FREQUENCY= 250.131544655141
##.OBSERVE NUCLEUS= ^1H
##.ACQUISITION MODE= SIMULTANEOUS (DQD)
##.ACQUISITION SCHEME= undefined
##.AVERAGES= 16
##.DIGITISER RES= 18
##SPECTROMETER/DATA SYSTEM= dpx250
##.PULSE SEQUENCE= zg30
##.SOLVENT NAME= DMSO
##.SHIFT REFERENCE= (INTERNAL, DMSO, 0, 16.522)
##AUDIT TRAIL= $$ (NUMBER, WHEN, WHO, WHERE, WHAT)
$$ ##TITLE= Audit trail, XWIN-NMR		Version 3.5
$$ ##JCAMPDX= 5.01
$$ ##ORIGIN= Bruker BioSpin GmbH
$$ ##OWNER= NMR
$$ C:\u/data/dgb/nmr/ADRS/7610/pdata/1/auditp.txt
$$ ##AUDIT TRAIL=  $$ (NUMBER, WHEN, WHO, WHERE, WHAT)
(   1,<2005-08-11 10:02:47.56 +100>,<MAYBRIDGE\NMR>,<NMR_250MHZ>,
      <created by zg, POWCHK disabled, PULCHK disabled
       configuration hash MD5:
       62 19 C7 07 E1 42 D1 B7 37 6C 3D D0 77 39 F9 E6
       data hash MD5: 64K
       F8 56 8F 74 3C F9 EB FB 3A 59 BF BB 97 75 81 73>)
(   2,<2005-08-11 10:02:58.70 +100>,<MAYBRIDGE\NMR>,<NMR_250MHZ>,
      <Start of raw data processing
       ef LB = 0.3 FT_mod = 6 PKNL = 1 SI = 32K 
       data hash MD5: 32K
       1A 3C C5 3A 1E 26 46 5F F5 DA C1 5A B4 16 84 C2>)
(   3,<2005-08-11 10:03:00.46 +100>,<MAYBRIDGE\NMR>,<NMR_250MHZ>,
      <apk 
       data hash MD5: 32K
       BA 3D BC 01 A9 9D CD 1C 19 E3 AB C4 C2 B3 CB 3B>)
(   4,<2005-08-11 10:03:01.15 +100>,<MAYBRIDGE\NMR>,<NMR_250MHZ>,
      <abs ABSG = 5 
       data hash MD5: 32K
       A7 38 00 4D ED 82 15 5A E9 54 5E 03 E0 C0 78 76>)
$$ ##END=
$$ 
$$ hash MD5
$$ 87 20 1B 81 E9 BB FC 26 FF 1E 58 11 BA 50 4D 95
##$RELAX= 
##$RELAX= 
##$RELAX= 
##$RELAX= 
##$RELAX= 
##$RELAX= 
##$RELAX= 
$$ Bruker specific parameters
$$ --------------------------
##$DU= <C:\u>
##$EXPNO= 7610
##$NAME= <ADRS>
##$PROCNO= 1
##$TYPE= <nmr>
##$USER= <dgb>
##$AMP= (0..31)
100 100 100 100 100 100 100 100 100 100 100 100 100 100 100 100 100 100 
100 100 100 100 100 100 100 100 100 100 100 100 100 100 
##$AQSEQ= 0
##$AQ_mod= 3
##$AUNM= <au_zg>
##$AUTOPOS= <10 >
##$BF1= 250.13
##$BF2= 250.13
##$BF3= 250.13
##$BF4= 250.13
##$BF5= 500.13
##$BF6= 500.13
##$BF7= 500.13
##$BF8= 500.13
##$BYTORDA= 1
##$CFDGTYP= 0
##$CFRGTYP= 5
##$CHEMSTR= <none>
##$CNST= (0..31)
1 1 145 1 1 1 1 1 1 1 1 1 1 1 1 1 1 1 1 1 1 1 1 1 1 1 1 1 1 1 1 1 
##$CPDPRG= <>
##$CPDPRG1= <>
##$CPDPRG2= <>
##$CPDPRG3= <>
##$CPDPRG4= <mlev>
##$CPDPRG5= <mlev>
##$CPDPRG6= <mlev>
##$CPDPRG7= <mlev>
##$CPDPRG8= <mlev>
##$CPDPRGB= <>
##$CPDPRGT= <>
##$D= (0..31)
0 1 0 0 0 0 0 0 0 0.06 0 0 0 0 0 0 0.0002 0 0 0 0 0 0 0 0 0 0 0 0 0 0 
0 
##$DATE= 1123750966
##$DBL= (0..7)
120 120 120 120 120 120 120 120 
##$DBP= (0..7)
150 150 150 150 150 150 150 150 
##$DBP07= 0
##$DBPNAM0= <>
##$DBPNAM1= <>
##$DBPNAM2= <>
##$DBPNAM3= <>
$$ [...]
##$SUBNAM7= <"">
##$SUBNAM8= <"">
##$SUBNAM9= <"">
##$SW= 20.6930455092707
##$SWIBOX= (0..15)
0 0 3 0 0 0 0 0 0 0 0 0 0 0 0 0 
##$SW_h= 5175.983436853
##$TD= 65536
##$TD0= 1
##$TE= 295.16
##$TE2= 300
##$TE3= 300
##$TEG= 300
##$TL= (0..7)
0 120 120 120 120 120 120 120 
##$TP= (0..7)
150 150 150 150 150 150 150 150 
##$TP07= 0
##$TPNAME0= <>
##$TPNAME1= <>
##$TPNAME2= <>
##$TPNAME3= <>
##$TPNAME4= <>
##$TPNAME5= <>
##$TPNAME6= <>
##$TPNAME7= <>
##$TPOAL= (0..7)
0.5 0.5 0.5 0.5 0.5 0.5 0.5 0.5 
##$TPOFFS= (0..7)
0 0 0 0 0 0 0 0 
##$TUNHIN= 0
##$TUNHOUT= 0
##$TUNXOUT= 0
##$USERA1= <user>
##$USERA2= <user>
##$USERA3= <user>
##$USERA4= <user>
##$USERA5= <user>
##$V9= 5
##$VALIST= <valist>
##$VCLIST= <CCCCCCCCCCCCCCC>
##$VD= 0
##$VDLIST= <DDDDDDDDDDDDDDD>
##$VPLIST= <PPPPPPPPPPPPPPP>
##$VTLIST= <TTTTTTTTTTTTTTT>
##$WBST= 1024
##$WBSW= 4
##$XGAIN= (0..3)
0 0 0 0 
##$XL= 0
##$YL= 0
##$YMAX_a= 265785
##$YMIN_a= -271460
##$ZGOPTNS= <>
##$ZL1= 120
##$ZL2= 120
##$ZL3= 120
##$ZL4= 120
##$ABSF1= 16.522
##$ABSF2= -4.171173
##$ABSG= 5
##$ABSL= 3
##$ALPHA= 0
##$AQORDER= 0
##$ASSFAC= 0
##$ASSFACI= 0
##$ASSFACX= 0
##$ASSWID= 0
##$AUNMP= <proc_1d>
##$AZFE= 0.1
##$AZFW= 0.1
##$BCFW= 0
##$BC_mod= 0
##$BYTORDP= 0
##$COROFFS= 0
##$CY= 12.5
##$DATMOD= 1
##$DC= 0
##$DFILT= <>
##$DTYPP= 0
##$F1P= 14.0000005364418
##$F2P= -0.99999901652339
##$FCOR= 0.5
##$FTSIZE= 32768
##$FT_mod= 6
##$GAMMA= 0
##$GB= 0
##$INTBC= 1
##$INTSCL= 1
##$ISEN= 128
##$LB= 0.3
##$LEV0= 0
##$LPBIN= 0
##$MAXI= 10000
##$MC2= 0
##$MEAN= 0
##$ME_mod= 0
##$MI= 0
##$NCOEF= 0
##$NC_proc= -5
##$NLEV= 6
##$NOISF1= 0
##$NOISF2= 0
##$NSP= 0
##$NTH_PI= 0
##$NZP= 0
##$OFFSET= 16.522
##$PC= 1
##$PHC0= -88.1313
##$PHC1= 9.862413
##$PH_mod= 1
##$PKNL= yes
##$PPARMOD= 0
##$PSCAL= 4
##$PSIGN= 0
##$REVERSE= no
##$SF= 250.13
##$SI= 32768
##$SIGF1= 0
##$SIGF2= 0
##$SINO= 400
##$SIOLD= 32768
##$SREGLST= <1H.DMSO>
##$SSB= 0
##$STSI= 32768
##$STSR= 0
##$SW_p= 5175.98343685301
##$SYMM= 0
##$S_DEV= 0
##$TDeff= 65536
##$TDoff= 0
##$TI= <Analysis number 999999
Compound Code 99
Book Reference 9
Project Code 9>
##$TILT= no
##$TM1= 0
##$TM2= 0
##$TOPLEV= 0
##$USERP1= <user>
##$USERP2= <user>
##$USERP3= <user>
##$USERP4= <user>
##$USERP5= <user>
##$WDW= 1
##$XDIM= 32768
##$YMAX_p= 391580747
##$YMIN_p= -825910
$$ End of Bruker specific parameters
$$ ---------------------------------
##NTUPLES= NMR SPECTRUM
##VAR_NAME=  FREQUENCY,     SPECTRUM/REAL,   SPECTRUM/IMAG
##SYMBOL=    X,             R,               I
##VAR_TYPE=  INDEPENDENT,   DEPENDENT,       DEPENDENT
##VAR_FORM=  AFFN,          ASDF,            ASDF
##VAR_DIM=   32768,         32768,           32768
##UNITS=     HZ,            ARBITRARY UNITS, ARBITRARY UNITS
##FACTOR=    0.157963299565203, 1,           1
##FIRST=     4132.6476996994, 0,             0
##LAST=      -1043.33573715361, 0,           0
##MIN=       -1043.33573715361, -825910,     0
##MAX=       4132.6476996994, 391580747,     0
$$ Real data points
##PAGE= N=1
##DATA TABLE= (X++(R..R)), XYDATA
$$ [...]
23198b08008J87080J66014k83665j01357J40646q8554K5025j4557Q3043l7941
23188a32274n8519J35750p998J55098Q1982m6162k43241M616J47350N447K19611
23177B61660J6135k6310q1714k67664L3696J87160K6778J3535L1538j165J33295
23166C26944l33729p8037J33444j30735j8132p9819K9330J6905K7763n4964j29164
23155b90194j73657K19097K6141J32431m0508R5521Q014J4497o1627J68571k7922
23144G0364j51184L6530q718j59133Q09j7385N8955J4409R2783P7427Q8867K27420
23132C31144J8803O722j70413k18928P4176P4315M0778k41122r8691J07378J55428
23121G9590P6938J22422p4604q7492n9004o7786P0209j59123N3159R7614J96509
$$ y = [-208008, -20928, 145086, -138579, -239936, -99290, -187844, -162819, -177376, -94333, -132274, -190793, -55043, -63041, 92057, 174039, 127877, -115364, -110748, 36602, 42049, 261660, 277795, 251485, 169771, -97893, -64197, 122963, 149741, 163276, 194814, 193649, 326944, -6785, -84822, 48622, -82113, -100245, -180064, -150734, -133829, -106066, -161030, -290194, -463851, -244754, -218613, -86182, -126690, -31169, -23155, -8658, -70285, 98286, 70364, -80820, -44290, -53008, -212141, -211332, -228717, -169762, -155353, -62570, 14857, 103724, 331144, 349947, 356669, 186256, -32672, 41504, 115819, 156597, -84525, -183216, -75838, 79590, 156528, 278950, 204346, 116854, 57850, -9936, 60273, -98850, -45691, 51923, 248432]
23110B48432j06838o5989m4480q2717p0601O5525M2774m2645p1243j92199Q0219
23099b39762R5782J04223N4973o3152J36765K5904m2850k04693q5631J18079P8610
23088b1752N199r6469j75479P3839P5320J41413p4795J38240K23302n6076j60327
23077G2415p6188M935j19912j78994P7792J59013j0944j24172j6545O4687K6902
23066a21011J33477P5992K3438o1759j48792j52976J32737m3919M2649j57189
23056b77353J28072n7446K29533J17137j13282j8091J239K1032k1248Q9548m7941
23045E1200Q58O3364Q636j30578j63072o2914j78131M3617K00698k9091p6372
23034b71785J71136J66607m925J4256j60869R9756J34304k7341N6449J5502J26597
$$ y = [248432, 141594, 75605, 31125, -51592, -122193, -56668, -13894, -56539, -127782, -319981, -239762, -143980, -39757, 15216, -47936, 88829, 114733, 71883, -132810, -218441, -100362, -21752, -16553, -113022, -288501, -214662, -139342, 2071, -72724, 65516, 288818, 232742, 72415, -3773, 1162, -118750, -297744, -219952, -60939, -71883, -196055, -212600, -147913, -121011, 12466, 88458, 111896, 50137, -98655, -251631, -118894, -162813, -120164, -277353, -149281, -206727, 22806, 139943, 26661, 8570, 9809, 30841, 9593, 99141, 51200, 52058, 115422, 124058, -6520, -169592, -232506, -410637, -367020, -166322, -195413, -271785, -100649, 65958, 61033, 75289, -85580, 14176, 148480, 121139, 177588, 193090, 319687]
23023C19687J73860J8895k63787l73425j1161j51204O5858K41270J27684J7022
23013A64699k34798j8644q6186p8243Q2931Q0124K6356J86885m4620j05312N1251
23002B4443N8895p1743L5668J3786j58668j18946J53711J36303q2907K9963l7173
22991a6668J66789k6265q9513Q1900j51670j36366o6795O6560M9869N0718J20410
22980D8969j5676m4494k6257k6173J20816m1960m7457K9638N9217P572J7915M7784
22968A29894J4827j47528k00870j69861N8229j30971j35227J25358k40L5172K87402
22957a33815j54190k9230L03631J55217j4074J05945o4090M4758j98723J26859
22947A42288L0534R5177J39526o3613m4994j21819k6660k07194j56568p7537J41571
$$ y = [319687, 493547, 512442, 248655, -124770, -135931, -287135, -221277, 19993, 147677, 164699, -70099, -88743, -174929, -253172, -170241, -90117, -63761, 123124, 78504, -26808, 24443, 83338, 11595, 47263, 61049, -97619, -216565, -62854, 73449, -9458, 20505, -16668, 150121, 123856, 34343, 116243, -35427, -171793, -238588, -172028, -122159, -71441, 48969, 33293, -11201, -37458, -63631, 57185, 15225, -32232, -2594, 56623, 64195, 82110, 129894, 144721, -2807, -203677, -373538, -315309, -446280, -581507, -456149, -456389, -421217, -133815, -288005, -317235, -13604, 141613, 127539, 233484, 169394, 214152, 15429, 142288, 172822, 267999, 407525, 343912, 298918, 177099, 150439, -56755, -213323, -290860, -149289]
22936a49289P8515j82264J5841l0254j32010K7853K9296P5772k15685j32647N8757
22925e56115O5213Q7224n872J85059J70375J00667o2680K9270K0749j74709j2956
22914a53775L2745m9923k5365J9637j73931R1915J35528P7316N2435J7594m8426
22903b4250P0742n7125R0886N8127P3381m5466j42533k16722Q547J06137M9450
22892b8826J430J2318l247m0029K1673O2459j38350n6902P3189q1368J97607Q6945
22880A06899J24759j00639j82950J93184R3415j11801j62958J63290O3142k22079
22870c5738k6827K45254n892J6053q890K3415l6731Q0581l14831k16732J529J5013
22858b63796O5874q7552J58512J83274J24408q8862l02331p8464k743M2932J40997
$$ y = [-149289, -70774, -253038, -237197, -267451, -399461, -371608, -342312, -266540, -482225, -614872, -556115, -490902, -403678, -409550, -224491, -54116, 46551, -16129, 13141, 33890, -140819, -153775, -121030, -170953, -196318, -176681, -350612, -258697, -123169, -45853, 6582, 24176, -24250, 46492, -10633, 80253, 138380, 211761, 166295, 23762, -192960, -184413, -78276, -28826, -27396, -15078, -18325, -58354, -36681, 25778, -112572, -169474, -96285, -177653, 19954, 106899, 231658, 131019, -51931, 141253, 234668, 122867, -40091, 123199, 186341, -35738, -62565, 182689, 176797, 192850, 183960, 207375, 170644, 251225, -63606, -280338, -278809, -263796, -197922, -285474, -126962, 56312, 180720, 91858, -210473, -288937, -291680, -248748, -107751]
22847a07751P0270R1839M5489j30877k51793j72266K75720J74048J27227j954
22837A19952k00706K3024K13782J4296j48134j47326p5300m2905M5541P1369o3254
22826a89661N2663O9395J2473J00145J67153j00599k37309P3009Q1689j9116r0768
22815h0926L2381O2768P9207q0420r7916n0506K5585O1544P4741N8809p7797J32624
22803A40094J5687N6717L9304j65229j29011k02045j23775J46750J36289M6307
22793c8912J25313M3764j08703n8857J14805M3672j48784k06286J17911M9338
22783f6739n4251l8594m8598Q9141j00986j6282L5591L81645l2613m9868j83527
22772h5081j30778O9957n4302K690O5310M3900j22122q6210k25426l2619J07893
$$ y = [-107751, -37481, 54358, 99847, -31030, -282823, -455089, -179369, -5321, 121906, 119952, -80754, -57730, 156052, 170348, 22214, -125112, -200412, -243317, -197776, -126407, -189661, -136998, -67603, -55130, 45015, 212168, 111569, -125740, -52731, 28958, 9842, -80926, -48545, 14223, 93430, 13010, -84906, -135412, -109827, -48283, 26458, 85267, 7470, 140094, 155781, 212498, 251802, 86573, -42438, -244483, -368258, -221508, -85219, -38912, 86401, 130165, 21462, -37395, 77410, 121082, -27702, -233988, -116077, -66739, -120990, -159584, -208182, -119041, -220027, -236309, -200718, 180927, 148314, 98446, -85081, -215859, -145902, -200204, -197514, -132204, -88304, -210426, -296636, -522062, -554681, -446788]
22761d46788M3706J25006L04782K8300j38386J64216P3219j33682q040M1325j67375
22750a13717n3690J93383J12247O4349p4111O263j64747n3920L36674O6806k72499
22739D7038N9306J00390j40946m0621P9960J65465j65958j52509J74865p5495
22729E1495j99975o139j25028R8781m6323j04847R1591J15973J14087j01535r1720
22718b03640P2359J39326j82882j5510q6599j18860J4217K55170O4595K4865R2850
22707E5891l4826j52901J19719r3993R754r9007Q1153M2226N2944o8952K1978
22696f6014L0275J03858O3040n5817p313P8709m5358j21630j81552K31457J70368
22685B00023m5657j97001n9211Q3851J12146k3547j6331j45809j23044p414J78395
$$ y = [-446788, -403082, -278076, 26706, 55006, -83380, 80836, 154055, 20373, 12333, 53658, -113717, -167407, 25976, 138223, 202572, 128461, 134724, -30023, -83943, 252731, 319537, 47038, 106344, 206734, 65788, 25167, 105127, 270592, 104634, -47875, 126990, 51495, -148480, -154619, -279647, -180866, -227189, -332036, -240445, -124472, -10385, -111920, -203640, -131281, 8045, -174837, -190347, -276946, -395806, -381589, -126419, -61824, -36959, 55891, 21065, -131836, -12117, -106110, -96356, -195363, -114210, -71984, -19040, -87992, -66014, -35739, 68119, 131159, 75342, 68029, 146738, 101380, -20250, -201802, 29655, 200023, 154366, -42635, -101846, -17995, 94151, 70604, 54273, -91536, -214580, -221994, -43599]
22674d3599o4380N2645K28766Q288M3217j18815l0565j31726j09692j00919J52495
22663a14285K02024r904m5658m7007j0488K6444n6740l1643M9649o2927o3088
22652a63623O944k214o4841O3701o9407L7626N1838M8786j2026n5989J62623j2103
22640h685l1708Q8436J15181j67727J73548K5328j14740j12380j6010K16722Q6627
22629B54592k04636j15606N4592K51705J5006K1771k59533k01594o4523O1405
22619a86821J09000K13562R0328j89050l88529K8938K6303J43793J86933k37118
22609b02661j81127j143L7659k05674K12309L4212r3864k4097R408J98202L6149
22598a80627J7720n2407j76381O2513J81584r1580r780K73871o2230R2790M1544
$$ y = [-43599, -107979, -55334, 173432, 181720, 224937, 106122, 75557, -56169, -165861, -266780, -114285, 87739, 77835, 32177, -14830, -25318, 1126, -55614, -87257, -37608, -100535, -163623, -156679, -158893, -223734, -160033, -229440, -191814, -139976, -91190, -103216, -159205, 3418, -8685, -40393, 48043, 163224, -4503, 169045, 194373, 79633, -32747, -48757, 167965, 254592, 49956, -65650, -11058, 240647, 255653, 277424, 17891, -183703, -248226, -186821, -77821, 135741, 226069, 37019, -351510, -322572, -296269, -152476, 34457, -202661, -383788, -384931, -347272, -552946, -340637, -306425, -400289, -424386, -414978, -216776, -180627, -162907, -215314, -391695, -329182, -147598, -239178, -248958, 24913, -37317, 55473, 97017]
22587I7017j78031j50739n2269l6993j35973m5647J75136j253J82991J31988q1126
22576i4899N4004J68280K8929k03165j84420P1013J89510J00215J26252m6612
22566B09107k71402j50976p2832J88856L8065j09862o7058K39308j5011J7525
22556E720k9089K4665r815j31919k66263j48201J19815Q1268M2208r4635J27443
22545b78803J17278m286J43L8447J27922O048k21R1316l8420K232P5041Q3336
22533B20033J649j0702l3289j09905J545o931j28546o691L772p9136j2324l752
22521a64277l9573R8734J286l8010Q2695J04649J22769j65942j79748l4809J64454
22510d7772Q6783K2081j3744J93132p6362O7089J47627r921n8283k28668m9761
$$ y = [97017, -81014, -231753, -284022, -321015, -456988, -502635, -327499, -328752, -145761, -13773, -94899, -40895, 127385, 156314, -46851, -231271, -160258, 29252, 129467, 255719, 209107, -62295, -213271, -286103, -97247, -59182, -169044, -236102, 3206, -11805, 5720, -23369, 1296, -8519, -140438, -406701, -554902, -435087, -353819, -311611, -406246, -278803, -161525, -165811, -165668, -127221, 701, 6749, 6528, 97844, 59424, 61656, 136697, 220033, 221682, 210980, 177691, 67786, 69331, 62400, -66146, -72837, -69065, -148201, -160525, -164277, -203850, -105116, -103830, -141840, -59145, 45504, 168273, 2331, -177417, -212226, -47772, 39011, 61092, 47348, 240480, 164118, 231207, 378834, 368913, 310630, 81962, 32201]
22499C2201o5273q8782o5288Q7745J98336k4193k0578j01518o5035K0427K8971
22488f2987J26071j41705L7653m3651q8970r9126j4156q2312J82775J58583j39991
22477a67816M3876q8435N0644j71352j4187o0395P4490R2275K2729K56784J80638
22466B19251q7435j4883q6620l0392q4477K1739Q2017q361P113j8760M9837J16714
22454A65743j846o523m3353j08852M2657P339k7736q4013j28929j4057Q4028J8372
22442i7170R6211K6278j33945j01862k9630J27228J79246P871l5719j37554l03074
22431d02120J03731K32183P9426Q1481J20221j48259j38763N7875l4325o993k3466
22420g9009J23440j28302Q92R0259K0171K00132J60497j35976j98520j2081K5152
$$ y = [32201, -33072, -121854, -187142, -99397, 98939, 74746, 54168, -47350, -112385, -91958, -62987, 63084, -78621, -40968, -84619, -173589, -272715, -286871, -369183, -186408, -27825, -167816, -123940, -212375, -161731, -333083, -347270, -407665, -333175, -240900, -218171, 38613, 219251, 131816, 116933, 30313, -79, -84556, -62817, 19200, 10839, 17952, -808, 49029, 165743, 163897, 157374, 114021, 5169, 47826, 55165, 27429, -56584, -185513, -199570, -115542, -97170, -959, 25319, -108626, -210488, -240118, -112890, 66356, 74227, 38508, -99046, -402120, -298389, -66206, 13220, 94701, 214922, 66663, -72100, -14225, -48550, -55543, -79009, 44431, -83871, -82979, 7280, 27451, 227583, 388080, 252104, 53584, 41503, 66655]
22409F6655l6965j57224k33812J20693R0928J094K9915r2652j11277J71054J7988
22398a33603m4486n0246K5841J2614o3750r8339J45039O1132j52451j28613L60441
22387f6421O2624m81137J708J11674L12075J81892p3623k2875L3703m9639L5024
22376D5005l1502q0381j14574J22453q158j75138n0385R1918J7864K5986k9695
22365a86607j06571n6874K35069J05998q450K3933Q2724j8612l7849J1027J46001
22354A89789L1138r3593r5861L0689p0193j98679P5002J53484N2637r563M6904
22343A11754k07699k2758j79731j06122N0408P7528J76671R4631j69874j51168
22333c26360j55993l141O2899J86944J55248j8965j93335j464J12106J28351k6644
$$ y = [66655, 29690, -127534, -361346, -240653, -149725, -148631, -118716, -211368, -322645, -151591, -133603, -178089, -228335, -202494, -189880, -253630, -351969, -206930, -145798, -298249, -426862, -66421, -3797, -484934, -483226, -371552, -59477, 122415, 48792, 25917, 59620, 9981, 45005, 13503, -66878, -181452, -58999, -67157, -242295, -292680, -200762, -182898, -156912, -186607, -293178, -350052, -114983, -8985, -17435, 6498, 89222, 70610, 32761, 43788, 189789, 220927, 127334, 31473, 62162, -8031, -206710, -131708, 21776, 74413, 64850, 111754, -95945, -118703, -298434, -404556, -354148, -276620, -99949, -5318, -175192, -326360, -482353, -485494, -422595, -235651, -80403, -99368, -292703, -294167, -182061, -53710, -80354]
22322h0354r2060k4421J00571K3506N0597K40406M7312N0079n982q8676l7834
22311A83144m9942j06789j01984o663k60736q5257K62111J42826r2647j66778
22301b82715L5550J64686Q4955k7972M9758k1744j35910J40331P1567m188k24012
22290a49694J57906J42593j00059L3577J03873O8560k23138j96012J27069r1022
22280a26347j41234L644K26204J3576j25139r1912m2731J11930j53537j25028
22270d50574k4130o3876J47670J06946J01210M0039n8447J35104n0970l0148N9470
22259h7706R6786l0562j3120J17176R3659P951j4132m0293k54734j91696O4875
22248b51796Q9059j15430J03679O3754q8540j88640J5703n8709o2654J7228K17260
$$ y = [-80354, -172414, -196835, -96264, -72758, -22161, 218245, 265557, 315636, 309654, 220978, 183144, 133202, 26413, -75571, -82234, -342970, -428227, -166116, -23290, -115937, -282715, -247165, -82479, 2476, -25496, 24262, 2518, -133392, 6939, 78506, 74318, -149694, 8212, 150805, 50746, 84323, 188196, 256756, 33618, -162394, -35325, -126347, -267581, -263937, -37733, -24157, -149296, -241208, -283939, -172009, -325546, -450574, -474704, -538580, -390910, -283964, -182754, -142715, -201162, -66058, -117028, -147176, -87706, 9080, -21482, -34602, 82574, 176233, 184184, 170052, 129759, -124975, -316671, -251796, -162737, -278167, -174488, -110734, -199274, -387914, -372211, -430920, -493574, -476346, -259086]
22237b59086K17607J14178P2942K4436m3596K8881j7719J3067N0339O3130j74931
22226H9248j62842j07951J02934N3147j09543m9499Q5512Q1700J97681r0461j38952
22215d9026q0332o1675j17591J17078K76131J04363j23765n1488K7076q4941j64269
22204b08439N7550j18545l5431K5654p1301P1025k3060J06567J42331N2228n8032
22193e9453J28221J25734o8535m4061J39817J08560L4656J05270j14807n0923
22183C04479r1385K0002j98453j46270l0652J66144N4344j50108J5816P5436R5935
22172A15288M8405k12275n2685j14864N9083K5134M439L0017k87253p3328J07974
22161c50065J37925o349o1181j4960J63255K03069J44918L0723r3143j66510M330
$$ y = [-259086, -41479, 72699, 145641, 170077, 126481, 155362, 137643, 150710, 201049, 264179, 89248, -73594, -181545, -78611, -25464, -135007, -184506, -98994, -17294, 180387, 89926, -49026, -129358, -191033, -308624, -191546, 84585, 188948, 65183, 13695, 40771, -44170, -208439, -150889, -269434, -304865, -279211, -350512, -279487, -302547, -195980, -53649, -1421, -59453, 68768, 194502, 125967, 81906, 221723, 330283, 364939, 470209, 355402, 304479, 213094, 233096, 34643, -111627, -142279, 23865, 78209, -71899, -56083, 19353, 115288, 163693, -48582, -101267, -216131, -157048, -131914, -127475, -97458, -384711, -458039, -350065, -212140, -218489, -279670, -294630, -131375, 71694, 216612, 247335, 154192, -12318, -7988]
22150g988P886m4484j16021J72499j4959j77286K5374j99340o3686J13604J38829
22139a65572m5323J926K34196J45096J1420j22359Q4866N8659j51716n0779M6830
22128D7244M4609l07072j65033K29672L8555q3049j59507n2161J20689L24202
22118C8149r2534k0989O6001J9880Q9384J02109o9788j33216o2089p1303j36689
22107b71085J20824J30916j7257j63778p9702J51977J30484l1262j4243O610J5831
22096b0685j50548M7658J37763k0085k9093O7798k48343j55251K19418J82754
22086C1386k9047j11019k10070r2913K13963J79128J23120N7110j53011j58189
22076a49542k47073o5917P4442J98649j49841j06300J09944L27691J42138N4183
$$ y = [-7988, -102, -44586, -160607, 11892, -3067, -180353, -154979, -354319, -418005, -304401, -165572, -210895, -208969, 25227, 170323, 181743, 59384, 144250, 202909, 51193, 414, 47244, 91853, -215219, -380252, -150580, -112025, -195074, -354581, -406742, -286053, 38149, -54385, -75374, -9373, 10507, 99891, 202000, 132212, -1004, -63093, -134396, -271085, -150261, -19345, -36602, -200380, -280082, -128105, 2379, -28883, -43126, -36516, -20685, -171233, -123575, 14188, -5897, -34990, 32808, -215535, -370786, -151368, 31386, 2339, -108680, -318750, -411663, -197700, -18572, 104548, 161658, 8647, -149542, -396615, -462532, -388090, -189441, -339282, -445582, -335638, -7947, 134191, 188374]
22066A88374Q6201J46347P4091j32742o3105j87417j00767J38845j8788P5629
22056B06668j35654j98954J65945j46858o1260j88482P3068O3089J05140M6957
22046g0341J03805r1663o1982J56532J47818j21869k06395j11810m6477M9636
22036b52746K72599J21085k32041j53042M0446N4756J87806N7544n370k79107
22026a88070l6324j8989j07911L3904J30381o432j91211Q4680J01621K9152j33018
22015c02217K5807K61542J83330j89367k23177L8321J04160P593L5248m235o0246
22004a23241j98955k1866J6096J82768J52076q8144K354J65926K549J5677J30815
21993B36055N9486j8894p9447j01142j11141M8774j6829j91439j7416J8464K4325
$$ y = [188374, 274575, 420922, 495013, 362271, 299166, 111749, 10982, 149827, 131039, 206668, 71014, -127940, 38005, -108853, -170113, -358595, -285527, -222438, -117298, -70341, 33464, -58199, -120181, 36351, 184169, 62300, -144095, -255905, -302382, -252746, 19853, 140938, -91103, -244145, -203699, -148943, 38863, 96407, 91037, -188070, -224394, -243383, -351294, -317390, -187009, -193441, -384652, -299972, -198351, -169199, -302217, -276410, -14868, 168462, -20905, -244082, -205761, -101601, -94008, -58760, -62995, -123241, -322196, -344062, -327966, -145198, 6878, -81266, -78912, 87014, 89563, 105240, 236055, 295541, 276647, 197200, 96058, -15083, 33691, 16862, -174577, -191993, -173529, -149204]
21982a49204l7820J6246O900O3653J77467m3912q1628J4458L595j9546O0571J44395
21970A55175K372j8740l2629j1986k42049j00718O1085J08850J19346J84334l0484
21959A94556p6175n639m0361K4831j5289j01506M6790Q938m3278j1650j27504
21948a46287M3324K9593R8903Q1090R7890J1466l4320J5624j77692j37020R1273
21937b6156j5337K12981M3924j20125j42468N2614k9867j50765r0509n6805O1660
21926b60853J71903Q5320p8234o2764M3717P5421L1066J94811P4956l56209j46697
21915b27563R4049J55472j9203K46613J10364j25852n398p9726m2734j53532p2708
21904a20218n3739p1740O9132P1819J6281m5263J25107J70535j11392K41855M0877
$$ y = [-149204, -187024, -170778, -163878, -100225, 77242, 33330, -48298, -33840, -30245, -49791, 10780, 155175, 157547, 138807, 106178, 94192, -147857, -248575, -187490, -78640, 40706, 225040, 194556, 118381, 112742, 72381, 97212, 81923, -19583, 27207, 36145, -7133, -18783, -146287, -102963, -73370, 25533, 106623, 204513, 215979, 181659, 197283, 19591, -117429, -26156, -41493, 171488, 215412, 95287, -47181, 5433, -24434, -175199, -265708, -322513, -260853, -88950, -3630, -81864, -144628, -100911, -25490, 5576, 200387, 275343, -80866, -227563, -133514, 21958, 2755, 249368, 359732, 233880, 228482, 148756, 106022, -47510, -120218, -173957, -245697, -176565, -104746, -88465, -133728, -8621, 161914, 50522, 292377, 333254]
21893C33254j46549j31764l4239K7595J19238l1099j87092j25135n3339K1236
21883b07894l4316j72525J55663L23029P9255m1107o7101j95233p746P7199n8230
21872a49006q2731L1694J75936J56571j25701j99669n744P3099l8206Q3074J65910
21861H5227L8594k885m6635j28689r3332O9761K5019K578R4569j82575m7944P8539
21849a07773J23280m7092K8461J05828j72978j30641m2058j5382j2198P9662K06781
21838A5890Q6474j62705R645L8136Q3364L0777K5596O9006j02434j43812j30961
21827a81024K3191K48862J45759j453J290L2684o5012j20160N3008J85232j25799
21816A96578l56244N2649L17778J31078r577k35941l1478J61773k28199l65488
$$ y = [333254, 186705, 54941, 20702, 48297, 167535, 136436, -50656, -175791, -229130, -207894, -242210, -414735, -259072, 63957, 143212, 102105, 35004, -160229, -167975, -90776, -149006, -231737, -200043, -24107, 132464, 6763, -192906, -198650, -125551, -163757, -80683, 85227, 123821, 120936, 74301, -54388, -147720, -77959, -52940, -50362, 44207, -138368, -186312, -107773, 15507, -31585, -3124, 102704, -70274, -200915, -242973, -258355, -270553, -190891, 15890, 102364, -60341, -50696, -12560, 70804, 101581, 127177, 196183, 93749, -50063, -181024, -157833, 91029, 236788, 235335, 236625, 269309, 204297, 84137, 137145, 322377, 196578, -159666, -107017, 210761, 341839, 332262, 96321, 64843, 226616, -1583, -367071]
21806c67071j64179Q5451K0095J21727N5489k7589M7663O6440K8117P2630K17472
21795A56245L3467p3130q8756o1021J07399R4506K60010m3708l58705J4162Q8994
21784A29463p4494j4218j45401J7648R3710o1913j76704J23862N8611N8770p1587
21773f2253P4859O7100j19674J51884J86584l5707r6780m4876M287o3551K8695
21762I0568J03689Q040j27783k22671j04306J32591n8795M7228j2865K26084K15196
21751B96976N1647j68625r2160p2720j02326q0331p7165R2977J26818r6400l0380
21740a51689J43870j85265N4475J95500j3522Q3541n659Q1833Q3547j51945k43926
21729a09240K3813J30077J59393P9982j18730j24597j70827m0143K70087q3669
$$ y = [-367071, -531250, -445799, -425704, -303977, -248488, -276077, -228414, -161974, -133857, -61227, 156245, 189712, 116582, 27826, -33195, 74204, 168710, 428720, 385012, 26307, 40469, 129463, 54969, 40751, -104650, -87002, 6708, -55205, -231909, -108047, -49436, 9334, -62253, 12606, 79706, -39968, 111916, 298500, 262793, 166013, 121137, 125424, 61873, 90568, 194257, 202297, 74514, -148157, -252463, -119872, -178667, -131439, -144304, 81780, 296976, 348623, 179998, 87838, 15118, -87208, -167539, -244704, -151727, -24909, -121309, -151689, -7819, -193084, -138609, 56891, 43369, 126910, 121251, 203084, 286631, 134686, -109240, -85427, 44650, 204043, 284025, 165295, 40698, -130129, -170272, 99815, 16146]
21719A6146m4756m6927n6698j99252k20024K03523K35179K29279k1444j14061
21709a9035k05658j56033K53806o57J25330Q9668R9173o7594j26286j88690n9503
21698b55479K14751J40401k60392m8616J53627o5484j25486l4602P632J18826
21688a54822M3743O7141k6820N5960R910l6776R2125n637j20595j28507N8624
21677a45654J08835j78238J23529J83945k5102R1064p8311j21014o5740j98933
21667c05619q2176J5916J34535J77664p1735Q2926l3106q9060j23142J27085N9293
21656a07419L0395r0422J67863J99711j72246j07966j55022j8381J41838Q4381
21646b7268R0938K21700J04385k78567j72161Q5198J05691N2022n8417r824M2889
$$ y = [16146, -28610, -75537, -132235, -331487, -551511, -347988, -112809, 116470, 95026, -19035, -224693, -380726, -126920, -127577, -2247, 87421, 186594, 119000, -7286, -195976, -255479, -40728, 99673, -160719, -209335, -55708, -121192, -246678, -281280, -273648, -154822, -111079, -43938, -70758, -14798, -4888, -41664, 50461, 44824, -75771, -204278, -145654, -36819, -215057, -91528, 92417, 67315, 158379, 80068, -40946, -106686, -305619, -387795, -371879, -237344, -59680, -131415, -48489, -81595, -170655, -293797, -166712, -107419, -77024, -167446, 417, 200128, 27882, -80084, -235106, -253487, -111649, -27268, 63670, 285370, 389755, 111188, -60973, 24225, 129916, 181938, 123521, 113697, 156586]
21635A56586j59160r3380o775L7042J18223O3466m0269j43918r3638j7394J92844
21624A3627J96392Q7114p0126k37768j08403Q644J8169J9886q1316n0560J21436
21613h2905p5733o7679j8553K65215Q8735j1524j76694J5171P0279j2309j31062
21602a37059K5051J87618l7114p8946Q3068M24256o1068j45150k34918j38472
21592a12734Q4506k4190J22973J52940P859l368k19973R6449j4094p8271j76106
21581a64009P4716K59676j46707k93857O2579J6944Q4023J57655K62121J14035
21571D27176j86501k30558j89555N8652O296r2353l0064K12582M8899J19701K86004
21560D30279n1489O1459n0996M4970p0142j29576k91026Q0610K5597L7083J69352
$$ y = [156586, -2574, -95954, -102729, -65687, 52536, 116002, 75733, -68185, -161823, -179217, 13627, 210019, 297133, 227007, -10761, -119164, -110520, -92351, -72465, -153781, -204341, -82905, -158638, -226317, -244870, 20345, 109080, 97556, -79138, -63967, 6312, -5997, -137059, -112008, 75610, 38496, -40450, 42618, 466874, 405806, 260656, 25738, -112734, -28228, -52418, 70555, 223495, 231354, 227986, 8013, 104462, 90368, 12097, -164009, -89293, 170383, 23676, -270181, -207602, -190658, -106635, 51020, 313141, 427176, 240675, 10117, -179438, -120786, -114490, -206843, -236907, -24325, 24574, 144275, 430279, 378790, 440249, 389253, 434223, 364081, 234505, -56521, 24089, 49686, 86769, 256121]
21549B56121k06083J9514J48297q2900q738j88155j81195J39715M7362k1358o2996
21538a40416J3668o9952M1233j91211N2010K76846P9131n6386J12286L8939O8556
21527B24704O4382q3906k54607j36040j37328o0297K72420n3000k9102K25580
21517C2806J32204j27172k75239j6721J89743J02849N7768j35175j80077J98597
21507b0417r6061j56764r5029n897J12522J51223l2540P0366K36181P9050r9905
21496A42729j20643j18518O2462M0783n6681p0777j94714j2059J48255J34460
21486d4703R5743q6778j78511p768P6378L9889J64475J66963j40221k34445Q0126
21475f8852L9588k7301N0390Q0047j43942q0197J36655J59408k3083j46675j31561
$$ y = [256121, 50038, 69552, 217849, 134949, 126211, -61944, -243139, -103424, -56062, -77420, -140416, -126748, -196700, -155467, -346678, -294668, -17822, 61309, 4923, 117209, 156148, 224704, 289086, 205180, -49427, -185467, -322795, -383092, -110672, -163672, -192774, 32806, 165010, 37838, -237401, -254122, -64379, 38470, 96238, -38937, -219014, -20417, -116478, -273242, -368271, -374168, -261646, -110423, -142963, -72597, 163584, 242634, 142729, 22086, -96432, -33970, 6813, -49868, -120645, -315359, -327418, -179163, -44703, 51040, -35738, -214249, -222017, -145639, -105750, 58725, 225688, 85467, -148978, -68852, -29264, -56565, -6175, 73872, -70070, -150267, -13612, 145796, 122713, -23962, -155523]
21464a55523m9058m8519M649J74532J50446k24953j51362j15711P7886K16119
21454a21494J88822j22234L3058Q9556k28150j96767O9206M6977j29160R631J9658
21443c40897J86520J60830L2265j49827p5945m0379n3239l8662L5237P4125P7791
21432a32181J03889N6696J11246j87345j28941R2763K03211O9303j73452j35818
21422a20629L03278P6988j65278j84600j6166J10477k5538j77253j13103J1310
21412c00514j2187j4624R3168R885L5898J61652o8267R6809J35079j40865Q2199
21401G8233r9079K1917J89178Q7721k2113j07788n3422J31858J66135k11193j89490
21390h043k03108l6643r387o6374J70000n0045J1606R4960k64797o982K35607
$$ y = [-155523, -204581, -253100, -248451, -73919, 76527, -148426, -299788, -415499, -337613, -121494, 67328, -54906, -21848, 67708, -160442, -357209, -288003, -241026, -370186, -360555, -340897, -154377, 6453, 38718, -111109, -187054, -227433, -280672, -319334, -284097, -209972, -132181, -28292, 28404, 139650, -47695, -176636, -83873, 119338, 188641, 15189, -120629, 182649, 259637, 94359, -90241, -106407, 4070, -21468, -198721, -311824, -300514, -312701, -327325, -234157, -224272, -188374, -26722, -94989, 1820, 136899, -3966, 78233, -20846, 1071, 190249, 277970, 255857, 148069, 94647, 226505, 392640, 181447, -8043, -211151, -247794, -257181, -323555, -153555, -203600, -191994, -97034, -361831, -368813, -133206]
21379a33206l0352n2368p6043j99046Q080P8678R521J13335K25327n8530M6624
21368f7980O3511J21581j6688j88410J8075r2389m8376M4042j31750R1246P1657
21357a35481k398J22492J45394p3002k20635q7678k5638J28417N5072o916r1293
21346a91666Q2871j446K5215N6286K9231K9363j36190m2052J94756M232p4737
21335b4137l1211l17412q9048J1506M1863J98564K97334N9789k30188j8506R6985
21324d461J10394m5719R355n8895n5918n5350r9139j16408O976O566k4705Q9842
21312b37462q8210K11997J00712j58675j95753J01426k6089J17018P6757j53958
21302b52237l5074J89292J48205n3865r8964J26276K21222k60718k22180l288
$$ y = [-133206, -163558, -215926, -291969, -491015, -482935, -404257, -394736, -281401, -56074, -114604, -67980, -4469, 117112, 100424, -87986, -69911, -162300, -210676, -166634, -298384, -207138, -135481, -137879, -15387, 130007, 57005, -163630, -251308, -276946, -148529, -93457, -100373, -191666, -108795, -110241, -85026, -28740, 491, 29854, -106336, -148388, 46368, 50600, -24137, -55348, -372760, -461808, -450302, -408439, -209875, 87459, 147248, -82940, -101446, -4461, 105933, 60214, 69569, 10674, -45244, -100594, -199733, -316141, -309165, -302599, -327304, -237462, -325672, -113675, -12963, -171638, -367391, -265965, -292054, -175036, -98279, -252237, -287311, -98019, 50186, -3679, -102643, 23633, 244855, -15863, -238043, -241331]
21292b41331K77844K34588p7170k04578k3802l0659j5715j8965K37803k19807
21282h1792j46485K4257K03642J31921o5961P8953o6216q7324k20503N9041J39890
21271c0577k6174r2313r5992l732k4726J20119J48627J41362R7490K7803j46977
21260A14910j48067k0903j22248J63646J21791k78669l1745J25359K21043J04071
21250B49188o4259j8932n5773q6614j03201J3852n6071j42658l5535K17997J78576
21239I6570j10004O7657n629L3349J10229J8119m5350m5226l3776k12922k36888
21228c63871J8293J08666o8010J78194J46464J8760j20284n1857J97603K1027
21218H4985n6780m401R1261Q3432J1975l33166K1232r9460N2485L6972j44592
$$ y = [-241331, 36513, 271101, 193931, -10647, -34449, -65108, -80823, -99788, 138015, -81792, -228277, -204020, -378, 131543, 65582, 144535, 78319, -9005, -229508, -170467, -30577, -56751, -149064, -245056, -248788, -273514, -153395, -4768, 136594, 234084, 261887, 114910, -33157, -54060, -176308, -12662, 109129, -169540, -201285, -75926, 145117, 249188, 184929, 165997, 110224, 23610, -79591, -65739, -121810, -264468, -300003, -82006, 96570, -13434, 54223, 48594, 81943, 192172, 210291, 164941, 119715, 85939, -126983, -363871, -345578, -236912, -304922, -126728, 19736, 38496, -81788, -133645, 63958, 84985, 28205, 23804, 115065, 198497, 210472, -122694, -101462, -200922, -148437, -111465, -256057]
21207b56057O0146J84981m2323J6404j68439o500J6538m2873m5957M1794J25234
21196a17052J26615k1246N803P466j7655L5087R2816k4502O9886p0167L7948K5314
21184A50313q6080k3910L413N3157K7632j46136l5233n762P6815l2991K9548J24741
21172A35507O7291n1875j7445J36280J1489L9700j18587j44601r5790K8302O6340
21161E6611j43890q786m110m7697k01123N2797K22469j36479m8734N0249K77378
21150F8685J05521j34425P3205L6402k46962O6837R971O3487j9832l3627j28114
21139a38852J01499J68954k9874j62858p079j4732l5336J34967P4322J53484Q5306
21128C29801j8388k03521k78419j19673k4532L5234j66266L3509J99976Q6343
$$ y = [-256057, -195911, -10930, -53253, -36849, -205288, -211788, -195250, -238123, -284080, -242286, -117052, 9563, -11683, -5880, 1586, -16069, 19018, 111834, 87332, 157218, 87051, 124999, 150313, 64233, 40323, 43736, 96893, 124525, -21611, -56844, -62606, 14209, -18782, 10766, 135507, 202798, 150923, 133478, 269758, 281247, 320947, 202360, 57759, -38031, -9729, 56611, -87279, -96065, -100175, -147872, -348995, -296198, -73729, -210208, -258942, -208693, 68685, 174206, 39781, 112986, 149388, -97574, -30737, -20766, 42721, 22889, -10738, -138852, -37353, 131601, 101727, -61131, -68210, -82942, -118278, 16689, 91011, 244495, 329801, 311413, 107892, -170527, -290200, -314732, -279498, -445764, -412255, -212279, -125936]
21118a25936J64258K16641J045J27348L3770j0672j52547j40286o7255k56927
21108b10561o5431J05314M1292j21089R3662K42706M1505j6165o5742l4647j22777
21097a11933K09386l7361O983K6638k72032p6915J23764Q8860J33503J33908j51493
21086G3308j33570K3862M5785j42195m7943L4826J55180R3550l4627J71192J9158
21075B58526k15j05263j14735k17987K7957l5162m6710K7165P605j30361M7935
21064b81245O9699J20077J57098P1111J23233K6904l8915m8191q1646j84943j59963
21053b26781N314K5967L08154K94856J69685m9763k72491q8886J57055q3581n505
21042B34024l41270N8221J89504j02198j67256p4072K74094K44152l2302r3143
$$ y = [-125936, 38322, 254963, 256008, 383356, 417126, 406454, 253907, 113621, 46366, -210561, -275992, -170678, -129386, -250475, -156813, 85893, 127398, 111233, 45491, 10844, -111933, 97453, 60092, 67075, 93713, -178319, -255234, -131470, -42610, 90893, 224801, 73308, -60262, -36400, 9385, -132810, -180753, -145927, 9253, 102803, 68176, 239368, 258526, 258311, 153048, 38313, -179674, -151717, -186879, -233589, -206424, -198819, -329180, -281245, -211546, -91469, 65629, 136740, 259973, 286877, 247962, 199771, 118125, -66818, -226781, -221467, -195500, 112654, 407510, 577195, 527432, 254941, 166055, 323110, 239529, 234024, -107246, -49025, 140479, 38281, -128975, -203047, 71047, 315199, 282897, 189754]
21032A89754j6268K0285J17885m8789j592j07854O1668l5390k70676n1144O3090
21021g9031J96735J8238l380J3143o4046N5052L436K835q0353K6147k1135r6346
21009b8705l8775l9617k91164k9742J98018J24656J80081J93869j39331j11662
20999A7628j15055Q7678K63700J29023k60352j32816K5535l00078j62641J81675
20989b65703K01007J49388j3994j1554J4165n8588K669O5915J07093N5324o5179
20978A80543j75132j72991l3006o2038o6910J40165k0732J35713J59307K206j77956
20967i0831n6588O5074n505J24670j641J6655j47224n6203M0097J1239l4045N1219
20955h3083m2936Q2120Q761k6426K7890J33947K3806k35380q0245Q440r0855l7862
$$ y = [189754, 173486, 193771, 311656, 262867, 261275, 153421, 215089, 179699, -90977, -142121, -79031, 117704, 135942, 132562, 145705, 81659, 136711, 140147, 142982, 62629, 88776, 67641, -28705, -67480, -107097, -398261, -428003, -229985, -105329, 74752, 268621, 129290, 17628, -97427, -9749, 253951, 382974, 122622, -10194, 15341, -284737, -447378, -265703, -64696, 84692, 70698, 59144, 73309, 14721, 17390, 83305, 190398, 245722, 180543, 5411, -167580, -200586, -262624, -329534, -189369, -210101, -74388, 84919, 87125, -90831, -147419, -82345, -87850, 36820, 35179, 51834, -95390, -151593, -111496, -100257, -134302, -83083, -126019, -43899, -35138, -61564, -33674, 100273, 124079, -111301, -191546, -183106, -273961, -311823]
20943c11823k3264J51560j22834J6453N2736m5890n3494N6773J24958J7696P0695
20932f6434q6246m0662Q1407K2893j47457k08987j14858j05461K40949O5967J12891
20921b45998J5793K3980L9837r6936N3708J17603n771J2769L5789n51Q614j12019
20909a53182q6490p5542K03810j40387O3436j0842R0391j54075k30486O0426J37697
20898b95244J20154L6920R5146k8568J72033L5785N7633j11098l08551r6965J64583
20887a58172o5985Q1775L08951K38676q8402p9490r9949o4669k1685m6866j98333
20876a94149L4435J77102J1868n360J8284n3738r7593P2172M259J04182j4589
20865E6873K5151p0935r0750n5638O8983J61672R114j41640j7369j3964R480j6710
$$ y = [-311823, -335087, -183527, -306361, -289908, -237172, -283062, -336556, -279783, -154825, -137129, -66434, -152680, -193342, -111935, -89042, -236499, -445486, -560344, -665805, -424856, -358889, -245998, -230205, -206225, -166388, -263324, -209616, -92013, -97784, -85015, -49226, -49777, -41163, -153182, -239672, -315214, -111404, -251791, -188355, -199197, -108806, -262881, -493367, -432941, -295244, -175090, -138170, -43024, -71592, 100441, 136226, 193859, 82761, -225790, -322755, -158172, -224157, -142382, 166569, 405245, 316843, 237353, 137404, 72735, 51050, 4184, -194149, -159714, 17388, 29256, 23896, 42180, -11558, -109151, -36979, -32720, 71462, 56873, 82024, 11089, -79661, -135299, -66316, 95356, 104470, -37170, -54539, -68503, -59023, -75733]
20853g5733o9205L4025N9345j14437q0555m923N7879J72306K20080K12222o1399
20842C49605j62928J94213n7399k00458o3690L7497j05777Q897l2324K9933n0406
20831e2837q0501L6982m635j68506O8314K74035k3803j19215l5535J57952J19231
20820A71482l7511k3990j51202j24452N2186J39443J23252Q4890N5894J5605k93014
20809A2583p4191J01588Q1754m7248j52108q9129o6366r8009l462K4286N1862
20798b58440J02122l3253K1381M358o7998K6658j8804J1632J6151J22846R1234
20787A7887j07852L7183J1646k0644J12192q2866R5935R7474N3698j51345j17144
20776e3836j69087n5783J8372M7371K6660P0685P305o3106J36262J02767J87236
$$ y = [-75733, -144938, -110913, -51568, -166005, -246560, -251483, -193604, -21298, 198782, 411004, 349605, 186677, 380890, 323491, 123033, 59343, 96840, -8937, -40, -32364, -2431, -52837, -133338, -96356, -100991, -269497, -201183, 72852, 49049, -70166, -105701, 52251, 171482, 133971, 109981, -41221, -165673, -113487, 25956, 149208, 234098, 289992, 305597, 12583, -61608, 39980, 121734, 74486, -77622, -166751, -233117, -331126, -334588, -310302, -258440, -156318, -189571, -168190, -163832, -231830, -205172, -223976, -212344, -196193, -73347, 17887, -89965, -52782, -41136, -61780, 50412, -32454, 63481, 160955, 214653, 63308, -53836, -222923, -278706, -260334, -212963, -186303, -115618, -108313, -171419, -35157, 67610, 254846]
20765B54846J16123n8546m45554j13031p9455J90251O9864J60106K04175n778
20755B93001n8075o0875k11813o7280n6735J27350J43066J97378j3242j52544
20745A40231k0872j42678j68987k1368O5176J05732k15282r5479O4702J30313
20735a58512J70876J53419j94000n5321j68766j92556J66547R0995r650j31411
20725c28379L7368J25124P3779j12935j4341J91840J09308J38165j13267k32608
20715a25946M4442J0069N845p0849j82407J02373J14939J112j1714M5218P5932
20704I014L1666m8023l7153o1671N5819m2406L5072J55675k0164j69726K65203
20693A73306K72554k53606l32324j15897J44032n9314p3693O6124J1946Q9142
$$ y = [254846, 370969, 312423, -133131, -246162, -325617, -135366, -65502, 94604, 298779, 293001, 234926, 174051, -37762, -105042, -161777, -34427, 108639, 306017, 292775, 140231, 119359, -23319, -192306, -213674, -148498, -42766, -258048, -353527, -288825, -158512, 12364, 165783, -28217, -83538, -252304, -444860, -278313, -187318, -196968, -328379, -291011, -165887, -92108, -205043, -219384, -27544, 81764, 219929, 106662, -125946, -81504, -71435, -65590, -136439, -318846, -216473, -101534, -100422, -112136, -66918, 9014, 40680, -7343, -44496, -106167, -50348, -92754, -57682, 97993, 77829, -91897, 173306, 445860, 192254, -140070, -255967, -111935, -171249, -244942, -178818, -166872, -77730]
20683g7730q0596r414j0885n6942k45913K6982R4515j12549M5805j3723K82877
20672a57573L51965L1884j766J4985k76222l19980J05906L39356J5022j07404
20662c827j83250j19433R9627J48149J64781l5712l7934l0448N5687R9873P7514
20651B35027j40773k19079n4940P0372j2765j52851j3630J95144P2806J26404
20641A05715J41321J00963q9028j76169j6856J13223N4359n9464J15118J13491
20631D02673j43692q6418j04082L3902k3965m529J66532J0315j37935N9722Q227
20620A80750n6842k90954k6252O7032l3104J44709J34168Q814n2738r3863j60996
20609a79276q8259M1075J30619J00795L40358J45045j25034j33567j35180O7494
$$ y = [-77730, -158326, -167740, -178625, -235567, -481480, -454498, -359983, -472532, -426727, -440450, -157573, 194392, 226276, 224510, 239495, -36727, -356707, -250801, 88555, 103577, -3827, -187077, -306510, -206883, -58734, 106047, 70335, 32401, 1953, 57640, 157513, 235027, 94254, -124825, -179765, -109393, -122158, -275009, -288639, -93495, -20689, 105715, 247036, 347999, 258971, 82802, 65946, 179169, 233528, 174064, 289182, 402673, 258981, 172563, 68481, 102383, 78418, 73889, 240421, 250736, 112801, 172523, 180750, 123908, -167046, -193298, -126266, -159370, -14661, 119507, 128321, 75583, -18280, -179276, -267535, -226460, -95841, 4954, 345312, 490357, 365323, 231756, 96576, 164070]
20599A64070o5634j01942j33155J7547K70068J87505r9945l3574j06889k90364
20589a92313P9043J32893J17954o6696J4342q0378J00329j18552o6304m4149K9820
20578i4011J24241r5393n25K20615m3969p1535j70869j23486q7696J48328J62513
20567c1787R1162o5295r298p4522j04436M8867N1744R0293M7384k5799J37884
20556A56197O4915j1150q8371j04804J02484J84663r7752j49887J0857k57081
20546a89929J40990J29275J04331l9060j57885p0696j15205J3249r0209J32160
20536a42979J16497l0079q0583K5413L6453q2066k4965J6658O8126J76015j03811
20525b5321k74173o7943L36170P0988q1829J50599J44175m6908l6680j14629j41485
$$ y = [164070, 98436, -3506, -136661, -119114, 150954, 338459, 238514, 204940, 98051, -192313, -113270, 19623, 137577, 70881, 85223, 4845, 105174, -13378, -79682, -123831, -94011, 30230, -65163, -65688, 154927, 110958, 39423, -131446, -254932, -342628, -194300, -31787, 59375, -5920, -15218, -89740, -194176, -145309, -93565, -3272, 44112, 18313, 156197, 221112, 209962, 121591, 16787, 119271, 303934, 206182, 56295, 67152, -189929, -48939, 80336, 184667, 145607, -12278, -82974, -198179, -184930, -275139, -142979, -26482, -56561, -137144, -111731, -75278, -157344, -182309, -165651, -97525, 78490, -25321, -299494, -367437, -31267, 39721, -42108, 108491, 252666, 205758, 169078, 54449, -87036]
20514h7036l0404O1574O7741J11017j6948k9244K8684j33956J12198O0646n2606
20503I1666j53189q7607o2936k8160P2798R2899j4102j08192o4058o6239Q8052
20492b39068O9590K33099k0289q0801M3758l3181j6568J17005Q1997N5657m5669
20481A65530j05412l06230J20507K23985k2013m4697O8765R4797J2298j12558
20471I4972k23218j77965q171L5890K29310O2018K90030r7298l29929m406k7045
20460a55812n4006J47411J00080N2621K0712R4971p6857j365j15516k23164L0883
20449a80042L0873m5538L7292K31105J13044j18814n9664p4947J2134j76899k2046
20438b53502M0253P0083Q4078j4940j05262j38918L05258J12385p0885K4099n9436
$$ y = [-87036, -117440, -55866, 11875, 122892, 105944, 76700, 105384, -28572, 83626, 144272, 91666, -61523, -149130, -212066, -240226, -167428, -74529, -88631, -196823, -260881, -327120, -239068, -169478, 63621, 43332, -37469, 6289, -26892, -43460, 73545, 155542, 211199, 165530, 60118, -246112, -125605, 98380, 76367, 31670, 100435, 195232, 207530, 94972, -128246, -306211, -314382, -278492, -49182, 12836, 302866, 205568, -124361, -128767, -155812, -209818, -62407, 37673, 90294, 111006, 205977, 129120, 127755, 12239, -210925, -180042, -149169, -194707, -157415, 73690, 186734, 67920, 8256, -66691, -54557, -231456, -253502, -213249, -143166, -59088, -74028, -179290, -318208, -12950, 99435, 28550, 52649, -6787]
20427f787q665k0828l1282J2217J65482j0985M6918J34096p5596k02185j39120
20416a36735j06405k1737N0356J00646K8384n6739K9918L8958j86890j3429J75290
20405i8383j04602M6267K49276L2084j15065k488o0546o3052j02473J27600J63219
20394G1837K9243j60330l6645k7909J5087O6051j05962J89197J29653q2398j12068
20383b4244j50199n9286K26273J65305m2315J28961m0693j72969j85866L8945
20373a16088Q9978J88351o1962k39238N5956Q8637Q1639j27093J52017R3067j79641
20362B5623k2763P1662j2754J02774k12712k50484O5997k0554J06736J47077r1653
20351i1051J8338j39432j42499R7678K31678j2323J59810J45062k21140l03492
$$ y = [-6787, -15452, -36280, -67562, -55345, 110137, 99152, 146070, 280166, 204570, 2385, -136735, -243140, -264877, -214521, -113875, -85491, -142230, -112312, -73354, -260244, -273673, -98383, -202985, -156718, 92558, 124642, 9577, 7089, -53457, -116509, -218982, -91382, 71837, 101080, -59250, -95895, -123804, -108717, -42666, -148628, 40569, 170222, 87824, -24244, -174443, -233729, -7456, 157849, 115534, 244495, 203802, 30833, -155033, -116088, -26110, 162241, 100279, -138959, -83003, 5634, 87273, -39820, 112197, 205264, 25623, 2860, 74522, 61768, 164542, -48170, -298654, -232657, -253211, -146475, 602, -91051, -72713, -212145, -354644, -256966, -25288, -37611, 122199, 267261, 46121, -257371]
20341b57371O1408K10212K5999k06596N9724K710k5517J47768J45654J13741l4068
20330B43664q949p5464r3170R0436j85296l45745N7200K01035J82197k2960N5261
20319I8209j7007j2606j93220N0946J24922M9652n7452j20737j14873Q9811J71171
20308F8816k980J66824p4672l09108p2687J32260J58104L8303j44792M8173R4864
20297A03105N1955m0854n8182L2661p2255l58482M9832K55752O6454J68912j3467
20286A85431K1831j42509k09932j46041Q7332K33097j12678j15190k1531j4815
20276b35005J61757R8972j34443l120J9079q8149Q4728J53249o2984J80494J38332
20265C12910j79953j02362j07620q4945K5624Q3015P8086K02939q3519k25368
$$ y = [-257371, -195963, 14249, 40248, -166348, -106624, -103914, -129431, 18337, 163991, 277732, 243664, 234715, 159251, 66081, 156517, -28779, -374524, -317324, -116289, 65908, 42948, 98209, 81202, 68596, -124624, -73678, 51244, 100896, 43444, -77293, -192166, -102355, 68816, 65836, 232660, 157988, -151120, -223807, -91547, 66557, 104860, -39932, 8241, 103105, 155060, 114206, 56024, 88685, 16430, -342052, -292220, -36468, 29986, 198898, 185431, 207262, 64753, -145179, -291220, -203888, 29209, -83469, -198659, -220190, -235005, -73248, 25724, -108719, -111839, -92760, -180909, -96181, 57068, -5916, 174578, 312910, 132957, 30595, -77025, -161970, -136346, -53331, 24755, 227694, 144175, -81193]
20255h1193l0358j74970k8148P2628J27132j06647M7404J50007l0589J23053j06284
20244c7965p1503q869P7952m6089J31427P203r3792n2912K1170n0519m479m2778
20232a71154l8148J34610R5909r408M8713k13018J74580P8595k72736p3975j14456
20221c60488j15867R6629K27564J32784l7269P52j13430Q6249N8500r8753K3540
20210i9789J11231n9888P530J54374k0284P3313P5710J00147J01492q2837j57438
20199B03561j27733j5341N4006Q3049o7086j43285o0562n7755j2495J82821J33357
20188A72537J80023l3092q4449k20258O0205P1360L40962J77280k48609k54023
20178A61936j15515J51920l4042k25248q3398N4760O4152n7153K5335L199M9616
$$ y = [-81193, -111551, -286521, -314669, -242041, -114909, -221556, -174152, -24145, -54734, 68319, -37965, -109468, -118337, -40385, -86474, 44953, 52156, -41636, -94548, -73378, -123897, -128376, -171154, -209302, -74692, 21217, 11809, 60522, -152496, 22084, 100679, -172057, -246032, -360488, -476355, -379726, -152162, -19378, -56647, -55895, -169325, -83076, -24576, -123329, -99789, 11442, -48446, -40916, 113458, 93174, 166487, 242197, 342344, 443836, 360999, 203561, 75828, 60487, 114493, 197542, 130456, -12829, -73391, -131146, -143641, 39180, 172537, 352560, 319468, 235019, 14761, 74966, 146326, 487288, 664568, 415959, 161936, 46421, 198341, 164299, -60949, -144347, -89587, -25435, -82588, -57253, -54054, -4438]
20167d438p7300R5443k9642J71065k7281p1868j01184m3221M5407K17621L9973
20156B14575j21383r5234J47912j4161p8909L7852n4972r4907J98018J02338m6328
20145A94801q7200L042j11672j34360R1513R636r610K00961K16086R7164j39186
20134C31175j94561N9036j72932k00700j1919J73194o3537O8821L773n3315J4141
20123d6824p6571n1488n6831m7967Q2180R7933M5851O1771k0595P9100R4324K00555
20111C61438k26124m8555p3283k3967p6566j09589k2006P9340L53488J44490n0331
20100C08335j05263j41652P9194j9062k33192j57411j20252k5323J6667N2233
20090c45726J95372K95685M8902j32867J31268L494J03418K3213k26646j04553
$$ y = [-4438, -81738, 13705, -15937, 155128, 127847, 55979, -45205, -88426, -43019, 174602, 214575, 93192, -2042, 145870, 131709, 52800, 90652, 35680, -59227, 138791, 241129, 194801, 107601, 110643, -1029, -135389, -43876, -34240, -43850, 157111, 373197, 470361, 331175, 136614, 195650, 22718, -177982, -189901, -16707, -80244, -11423, -7650, -60965, -46824, -123395, -174883, -231714, -279681, -197501, -99568, -53717, 8054, -12541, 66559, 160883, 361438, 135314, 86759, 13476, -10491, -87057, -196646, -218652, -139312, 214176, 358666, 308335, 203072, 61420, 140614, 121552, -111640, -269051, -389303, -414626, -397959, -345726, -150354, 145331, 194233, 61366, 192634, 196128, 299546, 322759, 96113, -8440]
20080h440j38086q2931J30177R9298k20565P5646J94240l0788j63693j00057L5399
20069b09800R2108q7808n5385P5404J52276j95388L8261K11213M2229q390l4751
20058A9969j55474j45303J7916O7774M4231m294j54758j36731K55159J59953o8576
20047a00134l533L5470q1378o4738j29706Q538K47287J20922J2916k34739L9528
20036a49567L5182k37821N2833L24740K52341J06536O9352j98571j47778K6653
20026A33900j42663k14940M6556J90652J48482j3396r3474j10427p4073M1513
20016h7870l0055j08791j0439j78303j2258K58059J40322J15824n2062k22211
20006a87784p3103j455Q0052L9129o6304L4589K14069O4788N9330m3152j22489
$$ y = [-8440, -146526, -229457, -99280, 18, -220547, -144901, 49339, 18551, -145142, -245199, -209800, -117692, -205500, -260885, -185481, -33205, -228593, -190332, 20881, 63110, 54720, 19969, -135505, -280808, -262892, -195118, -150887, -155181, -309939, -446670, -191511, -31558, -100134, -103667, -68197, -149575, -214313, -344019, -335481, -88194, 32728, 45644, -189095, -149567, -114385, -352206, -299373, 25367, 277708, 384244, 453596, 255025, 107247, 133900, -8763, -223703, -177147, 13505, 161987, 148591, 55117, -55310, -129383, -87870, -117925, -226716, -237155, -415458, -427716, -169657, -29335, 86489, 34427, -187784, -260887, -262342, -182290, -143161, -209465, -174876, 39193, 103981, 163311, 120159, -2330]
19995b330q17K3590K08166J07606P809k66294r7703j72440j16373N5299o7628
19984c21115j69004J38705K74296M049j18897q0416J01691n3130l6899J36776
19974a23944o0883k4340J20119J02481p9751j10664r5412P9791j91177J2588K60414
19963a10778j02411J42837O2681J49K0224n4459L8645j71056J05891K05047R9637
19952B36407p0223k23478K1065o8296j76522m2259R835K88492K06933J0353j54536
19941C7771q5277J29038j7740M2404j2331j47353j50086K25570L26607j1852k15018
19930A21733j66674k6J33903K38700j21585k85907k6138J99253J78641j63500
19920A08400k37891J12610O0026o6277j10299R8223Q9095P4860j04121K2751l6860
$$ y = [-2330, -3147, 20443, 228609, 336215, 344024, 77730, -19973, -192413, -308786, -253487, -321115, -490119, -351414, -77118, -73069, -191966, -272382, -170691, -223821, -260720, -123944, -184827, -209167, -89048, 13433, -66318, -176982, -272394, -192603, -383780, -371192, -110778, -213189, -70352, -7671, -7522, 12702, -41757, -3112, -174168, -68277, 136770, 236407, 166184, -57294, -36229, -104525, -281047, -323306, -313471, -24979, 181954, 192307, 37771, -47506, 81532, 63792, 106196, 93865, -53488, -203574, 21996, 348603, 336751, 121733, -44941, -44967, 88936, 327636, 206051, -79856, -105994, 93259, 271900, 108400, -129491, -16881, 43145, -23132, -133431, -35208, 53887, 128747, 24626, 47377, 10517]
19909A0517j1686j21209o9841O3584M8359J35160n3262j5637J45005J73217J9104
19898C23311k04226j53770jR928M0530j7651p5243K9168p974J84916O6354o3662
19886A31680P0705M1691m0065q2365J18433j09178N8479l2483o5121j0528r303
19875G1945n1915l6107j96202R1422K77724n210k84413j93700N4313n9688K07329
19864a24502j26932n1066Q0056K589J62301J09273K2980q0470J3567Q2510k3644
19853F6662j92590j30712J40578J72121p9937Q3719p881j6222p9920K7117J75725
19842A58660K7525o2962l6022j55500p9680o339l1999J06820K7159j65733J24867
19831i3204J69616k0579j39721j45919L8748M2085q0003q6512J48181O4175j6066
$$ y = [10517, -1169, -122378, -192219, -128635, -80276, 54884, 1622, -14015, 130990, 304207, 323311, 119085, -34685, -34686, -24758, 15772, -1879, -77122, -47954, -55928, 128988, 195342, 131680, 202385, 244076, 204011, 121646, 240079, 130901, 189380, 156897, 91776, 81248, 71945, 20030, -16077, -212279, -120857, 156867, 151657, -132756, -326456, -272143, -331831, -124502, -251434, -302500, -222444, -219855, -57554, 51719, 74699, -5771, 7796, 90306, 66662, -125928, -256640, -116062, 56059, -23878, 59841, 51960, 35738, -44182, -17065, 158660, 186185, 123223, 87201, -68299, -147979, -154318, -186317, -79497, -52338, -218071, -93204, 76412, 55833, -83888, -229807, -191059, -148974, -228977, -315489, -167308, -103133, -119199]
19820a19199K65620J44514r1419r7846m9057j68297o1472J11128M0897l1209k18153
19809b74493j2575K16K66078L7897j21458k5202O6219J37158r642Q4478j54476
19798e800M1929J01171K7319l2333j4640k2116K2381l5578J76372n9349l8030
19787A61326j66131j26181O7487J28552Q2917L4673Q7997j22839j33056J00208
19777A14953L6818M446J18974j33552j88971Q5039K0699p7113O69N0492L3989
19766F6443j6984j18474q7852J89360Q6428k8024O2345J36308k14611k02362r4088
19755b21511J00875K5522L748K6890L1631Q5589r4404k3415P8537J21327J2385
19744A47174O4975J63658j6334k47696j51442N7173o0060j39370L184J11261N5903
$$ y = [-119199, 146421, 290935, 199516, 101670, 52613, -115684, -177156, -66028, -25131, -56340, -274493, -287068, -286852, -20774, 17123, -104335, -129537, -63318, 73840, 64198, 148676, -5800, 36129, 137300, 164619, 132286, 117646, 95530, 117911, 82333, 258705, 199356, 161326, -4805, -130986, -63499, 65053, 147970, 182643, 270640, 147801, 14745, 114953, 151771, 156217, 275191, 141639, -47332, 37707, 58406, -18707, -18038, 32454, 66443, 49459, -69015, -156867, 32493, 118921, 90897, 153242, 289550, 74939, -127423, -221511, -120636, -95114, -91366, -64476, -32845, 52744, -41660, -65075, 13462, 134789, 147174, 212149, 375807, 359473, 111777, -39665, 17508, -42552, -181922, -178738, -67477, -11574]
19733a1574O4466Q4555K1157p9827j07939K1540K82877J3142r4728j85762j29977
19722a22070K9312L09628R6816k8801j71218k36756J1585K9534K6696J20115o462
19711E8379m8433k6159k1585j8724K8294J29461K16638J20080k5145j82105m0138
19700A90563j18003j03656j00598K8544o1839j50800P3792R4936Q2228K4779j57963
19689a98017J34300K60406K4989j32596o2461L2509O3039p6299j89205q5067K8685
19678a99717p6729q4402O7907K37446J14270k76590j08293J17346K18488k0721
19668a0995P0487J57506j68136q1828K1349R4924q6838j77523J90946Q5209l15618
19657b20517l4363p0637j746j7078m1178K68716K43949J06207l7097R2459q1818
$$ y = [-11574, 52892, 137447, 158604, 78777, -29162, -7622, 275255, 288397, 193669, 7907, -122070, -92758, 216870, 313686, 284885, 113667, -123089, -111504, -81970, -55274, 64841, 58379, 9946, -16213, -37798, -56522, -28228, 101233, 317871, 437951, 412806, 230701, 190563, 72560, -31096, -131694, -103150, -164989, -315789, -241997, -147061, -64833, -40054, -198017, -63717, 196689, 221678, 89082, 26621, 59130, 122169, 45870, -143335, -228402, -199717, -276446, -360848, -292941, -55495, 58775, -217815, -326108, -208762, 9726, -10995, 59492, 216998, 48862, -32966, -11617, 83307, -3531, -181054, 9892, 95101, -220517, -254880, -325517, -327263, -344341, -385519, -116803, 127146, 233353, 196256, 288715, 206897]
19646B06897j65291j15967o1015O6405J90572j00126j97166Q0133Q5962Q159k4852
19635b6289J93845l9513k59113M519J40419O2044J63870J26373J23912p242M0263
19624E23088J13334J79189l6778J29079J14330o0652k69585j80524q9147J77910
19614F00244J3248k87807j23L0408J3269k33450j04679J07520Q6528j21469M8191
19603A51880n4837n9431M3580j0698q0946P770O1954O7301K8660J3316L971n3683
19591A18837J8821j1105r6O27k02999k13681K9406K60530P436J55537k7499j54430
19579a8616M2692m0345q7785J59414K53099L9316r2347j16638k46743K2285J61444
19568G5776q6134j40619k9293K7133m0125l9551O1915j51957J80275L07915P5957
$$ y = [206897, 41606, -74361, -135376, -68971, 121601, 21475, -175691, -95558, -9596, -1437, -26289, 167556, 128043, -131070, -126551, 13868, 75912, 239782, 366155, 490067, 482825, 523088, 636422, 815611, 778833, 907912, 1022242, 961590, 692005, 511481, 422334, 600244, 613492, 325685, 325562, 355970, 369239, 135789, 31110, 138630, 225158, 103689, 151880, 97043, 37612, 81192, 70494, -10452, -2682, 59272, 126573, 155233, 168549, 172520, 118837, 137658, 126553, 126457, 127084, -75915, -289596, -260190, 340, 7776, 163313, 135814, -18616, 24076, -16269, -104054, 55360, 308459, 347775, 255428, 138790, -107953, -85668, 75776, -10358, -150977, -180270, -153137, -193262, -232813, -170898, -322855, -142580, 165335, 241292]
19557B41292j50803j71914k6325l2511J06026K15890P4399k47013J00375J71414
19547B80830J58714p093j9011j06882m023M3228K4801o7993n4059o180r9260J4325
19535A57397j0344k85227m6292p0860J80997l0664J65543O1777J75109m8170j45292
19524A03974j01069o0113K451P598J29809O4702j79267j47285l2671j5917R7731
19513a30057j47376k8554K16494l2673J05957j07880R4208l0278n0496k2067L4436
19502i8286K3960r8770J4881Q3796l3042N4774J05697r9408K0756P5877j4184
19491C6051n5302j80169k05527J01470j6640k7800J59342K09566r9093r3844j23396
19480b95342K03808Q6073L161l0562O963O4852L5052o4927J9262J09866M7618
$$ y = [241292, 90489, -81425, -107750, -140261, -34235, 181655, 256054, 9041, 109416, 280830, 439544, 432451, 413440, 306558, 302535, 345763, 370564, 302571, 248512, 242332, 143072, 157397, 147053, -138174, -184466, -255326, -74329, -104993, 60550, 122327, 297436, 249266, 103974, 2905, -57208, -54757, -47159, 82650, 147352, -31915, -179200, -211871, -227788, -130057, -277433, -305987, -89493, -122166, -16209, -124089, -29881, -60159, -110655, -132722, -98286, -74326, -173096, -158215, -74419, -107461, -52687, 53010, -46398, -25642, 50235, 36051, -19251, -199420, -404947, -303477, -320117, -347917, -188575, 20991, -78102, -171946, -295342, -91534, -5461, -2300, -32862, -25899, 38953, 74005, 9078, 28340, 138206, 185824]
19469A85824J35501j50023m0194J46930j59155j04103K38428J78819k21336j26541
19459H4150r0727R1522K27063P1418k3553K0915k9972j18406l18939j19022L540
19448b02011J86494O4212P3676k0186J04112q9301J6888N5049j09926R433J196
19437H9636o5669l4979o7657O6402J09939j2948o2270k0350J04958j05033j7549
19426a5520n0037P6677L10466l3146k9072N7388j29573j99433m6968j79715N0111
19415a88822Q7836Q9136l8328q6979p2953j15580P4512J99409Q3228o0184l9151
19404f7876J40194k6134J03329K652j02569Q1307j11879k24563m8620L8619J54900
19393f0640L06577o7009j36302M2075J8234L1238n5121P4974o8205p9176R9697
$$ y = [185824, 321325, 171302, 131108, 278038, 118883, 14780, 253208, 432027, 210691, 84150, -6577, 84945, 312008, 383426, 359873, 380788, 350816, 232410, -86529, -205551, -202011, -15517, 48695, 122371, 102185, 206297, 116996, 133884, 188933, 79007, 88440, 89636, 23967, -11012, -78669, -12267, 97672, 84724, 22454, 2104, 107062, 2029, -15520, -65557, 11120, 321586, 288440, 259368, 316756, 187183, -12250, -59218, -238933, -188822, -100986, -11850, -50178, -137157, -210110, -325690, -251178, -51769, 31459, -28725, -67876, 72318, 46184, 149513, 152165, 49596, 130903, 19024, -205539, -254159, -215540, -60640, 245937, 178928, 42626, 84701, 102935, 134173, 79052, 154026, 85821, 6645, 106342]
19382A06342J24473N3768k83010j87730J02765Q6031o4834J25049o3995o0435
19372f1576J64037L1351k36786j38614O4024J97541j20647Q1639J25253J7991
19362A24213R2257r9789p0162j14463O4963J2167J5001l6970m6360O4713J34218
19351A39788Q3633j78939j08747k8668J20341J8783j87625j58373K34483K21736
19341A56412K2269k5519j40811p4628n977L15879o5763K8790J305q4812j94522
19330f7377p0980J83321K54273L3241j52764K1283o4348r8325j99732K29450J71920
19319B39962j20756l0332M8073M2542o3785J69484J13324j60926r2797J6530j51907
19308I412R2384j31916j58765Q5867J81426Q7434J4891j17867j29901Q057J25458
$$ y = [106342, 230815, 284583, 1573, -186157, -83392, 2639, -62195, 62854, -1141, -61576, 102461, 133812, -102974, -241588, -177564, 19977, -100670, -19031, 106222, 124213, 216470, 116681, 46519, -67944, -2981, 9186, 24187, -12783, -59143, 5570, 139788, 223421, 44482, -64265, -92933, 27408, 46191, -141434, -299807, -65324, 156412, 178681, 153162, 12351, -62277, -68254, 247625, 181862, 210652, 211957, 127145, -67377, -138357, 44964, 299237, 332478, 179714, 200997, 136649, 38324, -161408, 68042, 239962, 119206, 88874, 136947, 179489, 115704, 285188, 398512, 237586, 144789, 161319, 9412, 101796, -30120, -188885, -103018, 78408, 165842, 180733, 62866, -67035, -58978, 66480]
19297F6480j40169Q2881O7979j07856J53277R5190J89781J13194j21217l087Q2139
19286D78592K4365o3457l40768k39357O2505L9800J32044L039m2004q6612j17596
19275a49449o3922O5076R1312J65126k956J20467k6257n6470L0854n0607L839
19264A27013r6789P5250l5819N329J1465O0917O1760J14138l9845Q20K635j73985
19252A12889m1034R7297K17798L6883J06584p887j73997p0930K999j02216j30440
19241D7946m3906R9019j2955J30256j10871k2476J88635K2675l13272n8375J16211
19230D2887J67025n7798j81253R9372k1026j30629J64620J64076O5338j37921
19220A74691j46607J36677m7295O8988j6319q5127o6864R8317J96918O6404l1662
$$ y = [66480, -73689, 9192, 77171, -30685, 122592, 217782, 407563, 520757, 399540, 396453, 478592, 502957, 439500, 98732, -140625, -78120, -38320, 93724, 96763, 54759, -31853, -149449, -213371, -148295, -56983, 108143, 105187, 225654, 199397, 142927, 173781, 123174, 127013, 30224, 105474, 69655, 74984, 86449, 147366, 209126, 323264, 283419, 284239, 286874, 112889, 71855, 169152, 386950, 423833, 530417, 522530, 348533, 277603, 280602, 178386, 47946, 4040, 103059, 90104, 220360, 109489, 87013, 275648, 298323, -14949, -73324, 42887, 209912, 152114, -29139, 70233, 49207, -81422, 83198, 247274, 312612, 174691, 28084, 164761, 117466, 186454, 170135, 85008, 18144, 116461, 313379, 379783, 348121]
19209C48121k9515l7335j99420r4871r1279p384R5880K12209O0854r3597P315
19198A70978j29097q7127J26172k7868r5297j4226J20584q0944q2596K33398K6918
19187A60895J0798J59917q8152j11109k891R7604j84883j5704k0939m4586k7807
19176f6857k7653J7502Q4425J29443p3655q4085q5770l3822J53583J36318J98012
19165C47441j59803n0964j0518k40716L9543J75517j236M7632K45586M2230j08346
19154C26366n6570R4313j12368l7418N8612r4227J14532n9009J61763J37435p9615
19143D53814q7928j29506j3103p8810J62595R5585r2312k2126P7811k3829k74097
19132F8094P7035O6436r77L6480J7162j38018K5762r4021J09000J21837r5455
$$ y = [348121, 318606, 281271, 81851, -13020, -104299, -111683, -15803, 196406, 257260, 163663, 170978, 41881, -45246, 80926, 53058, -42239, -56465, 64119, -16825, -99421, 133977, 160895, 171693, 331610, 243458, 132349, 129458, 227062, 42179, 26475, 5536, -39050, -66857, -94510, -77008, 7417, 136860, 63205, -20880, -106650, -140472, 13111, 149429, 347441, 187638, 136674, 126156, -114560, -75017, 100500, 99264, 146896, 392482, 434712, 326366, 269796, 364109, 251741, 214323, 272935, 178708, 293240, 234231, 395994, 533429, 453814, 365886, 236380, 223277, 144467, 307062, 402647, 310335, 288209, 366020, 342191, 68094, 145129, 211565, 210588, 247068, 264230, 126212, 151974, 57953, 166953, 288790, 193335]
19121A93335j21501J17525M7789o6274J24312J35456J0647M5859k25489q9738
19111A71921Q5537K18925L28458R1154k34091j74960N7838K32576J0995j63187
19101F25166r5980P756P3687j7339q3440N7120j10808l583J24405l0210J9593
19090E66367p3199j603J65681j21542j31279j8834j87567J11002K00882K7833
19080E37741k3880q4154k919K70062K47824J29584j4746L9k767L1733J57975J32158
19068A378650j36751j60693j27164K6249n7572o3696K63525m1089j13667J4852
19058I82644l3002O5012j02556j30149J1110Q5127K2217O0099j39618j61550R0736
19047G50070K1496k7410l8633O2926J67551J14545O8270K7465p8880j215Q9033
$$ y = [193335, 71834, 189359, 237148, 170874, 295186, 430642, 441289, 487148, 261659, 171921, 257458, 476383, 804841, 895995, 661904, 486944, 544782, 777358, 788353, 625166, 529186, 536942, 610629, 593290, 509850, 566970, 456162, 452579, 576984, 546774, 566367, 493168, 491565, 657246, 535704, 404425, 385591, 198024, 309026, 509908, 537741, 513861, 429707, 426788, 696850, 944674, 1074258, 1059512, 1059551, 1056784, 1088517, 1246492, 1378650, 1241899, 1081206, 954042, 980291, 922719, 859023, 1122548, 1081459, 967792, 982644, 949642, 1014654, 912098, 781949, 793059, 878186, 900403, 960502, 820884, 659334, 750070, 771566, 744156, 705523, 768449, 936000, 1050545, 1118815, 1146280, 1067400, 1066185, 1155218]
19036A155218K4303J24312K4511j42788q5493O3962j44135k76055Q5997J73806
19026A003638N6957o8382k69318J4548O8657J22818O9689P75k8450L2096j2028
19015I91000j5128J4756L3103q978l2614l3641Q1522r6347p9246Q8284L21664
19004A264375n9862k85063l30533K007J94971P5610k23372n2197J5100J06205
18994G07241R2078q7610k65185l6021J61091K1393k4715j34148j6049J62157J67569
18983G47801N3968o7269j67662r9348O4481O4135o1157j20816j17031O9784n1363
18972C15523K0146Q6057k2446J6378j09550l7003j93446Q5162l079J9545J25187
18961C02474J45546J89633M469k54829j66978p6123N9395J26179j13969Q948r4411
$$ y = [1155218, 1179521, 1303833, 1328344, 1185556, 1100063, 1164025, 1019890, 743835, 829832, 1003638, 1060595, 992213, 722895, 737443, 806100, 928918, 998607, 999382, 970932, 1003028, 991000, 975872, 990628, 1023731, 1014753, 982139, 948498, 1030020, 933673, 854427, 942711, 1264375, 1204513, 919450, 588917, 590924, 785895, 861505, 638133, 585936, 601036, 707241, 799319, 711709, 446524, 410503, 571594, 592987, 568272, 434124, 418075, 580232, 747801, 801769, 734500, 566838, 467490, 531971, 596106, 534949, 414133, 297102, 366886, 315523, 335669, 421726, 399280, 415658, 306108, 269105, 75659, 160821, 157742, 177287, 302474, 448020, 637653, 642122, 387293, 220315, 144192, 203587, 329766, 215797, 224745, 130334]
18950A30334j87003j3150j32635K14930K51659J01736J8454r9932j28244N3922
18940B10071J10961j14525J29749N8200M8423j8981N267j16006K917m2585q5660
18929A87831k9851Q7485J77915N3483j2285N1162j44223j74035k2994j3185n9266
18918A02037j45236O5778K97080J35735j34733j66274o4770R8248Q5523J04565
18908C77953K3899J31901n3174R0342j3121R99K8744j17753j80417J36389Q2554
18897E08316R2947r9850P4220N4020j39582k30036m0972K88076J51745j4232l8250
18886F06402r799j82104M3818R2036J3537j73184J56770L4979k8788J85553J2065
18875G51285j35967k7483O1119J77320K90728j00864j31138P9874j45296k10809
$$ y = [130334, -56669, -69819, -202454, 12476, 264135, 365871, 384325, 284393, 156149, 210071, 321032, 206507, 336256, 394456, 442879, 423898, 429165, 313159, 316076, 273491, 187831, 157980, 245465, 423380, 476863, 464578, 515740, 371517, 197482, 174488, 161303, 102037, -43199, 22579, 319659, 455394, 320661, 154387, 89617, 187865, 273388, 377953, 401852, 533753, 480579, 570921, 557800, 558799, 587543, 469790, 289373, 425762, 508316, 601263, 501413, 575633, 629653, 490071, 260035, 219063, 507139, 658884, 644652, 606402, 596603, 414499, 458317, 550353, 563890, 390706, 547476, 582455, 553667, 739220, 751285, 615318, 587835, 648954, 826274, 1117002, 1016138, 885000, 964874, 819578, 608769]
18865F08769j9273j0970o5932j2187K63280k10781J60803j640j57604j7988m365
18854E32112J05577j14465k23074J86397J39565K118k2166J7736n4147l1747q3853
18843D54053j15647l9602J03242M5380j06799j28868N6277R3951K01137k5509
18833E37615p7969R8235J0010P3397K2142M4795M219J28542J8022n8142J14065
18822I14931J61592k15171q6565l02154K5021Q4450r3419k8912L9886N2944n2500
18811E00103O4053m913k948J83558J39424m3788L8430P7340l8013j06685j94j00373
18799G05994j67382p640j01946K00922m013j2595m3384L6819L0983J14833j64115
18788E88476J30267P1157K80007Q2214N1610j25613K0072J8731l9058L1791O916
$$ y = [608769, 589496, 578526, 512594, 500407, 763687, 552906, 713709, 712069, 554465, 536477, 532112, 637689, 523224, 300150, 486547, 626112, 628230, 606064, 623800, 569653, 537906, 454053, 338406, 298804, 402046, 447426, 340627, 211759, 268036, 361987, 563124, 537615, 459646, 557881, 567891, 641288, 663430, 708225, 712444, 840986, 859008, 800866, 914931, 1076523, 861352, 774787, 472633, 497654, 582104, 488685, 459773, 499659, 552603, 500103, 564156, 559243, 556295, 739853, 879277, 835489, 873919, 951259, 913246, 806561, 806367, 705994, 538612, 530972, 429026, 629948, 625935, 613340, 569956, 606775, 637758, 752591, 588476, 718743, 789900, 1069907, 1152121, 1203731, 1078118, 1098190, 1116921, 1077863, 1109654, 1116570]
18777A116570l32090j45328K7302O5424J94447P3155J6077P550O1199N5949j51943
18766I88312j25039K28679J88765K1679K2098j00009j64244J164n9666l7611N0167
18755A014295o6880J9536O6341m1833o9817j8401l2785n5655m3279j19842j37372
18744E14308o3284K3749J40600J53025J20563l2503M258l3233l9236K9312R6100
18733I13659k2381J36174J6642j71150q0437J50256m0725n5542p9593J63825K8923
18722I59651o4703L4685L5124O5757J10458K9427K4572l5668J32264m4578J87114
18711A434103J37888m5178j55712n4863J0934N5777R0808j97266O9947l5563O1460
18700A372335R6354j42321M4388J76841M5459j3323q5065J1989J2675j14027k7856
$$ y = [1116570, 784480, 639152, 666454, 731878, 926325, 999480, 1015557, 1023107, 1084306, 1140255, 988312, 863273, 1091952, 1280717, 1302396, 1324494, 1224485, 1060241, 1061405, 1001739, 964128, 1014295, 947415, 966951, 1033292, 991459, 921642, 903241, 870456, 814801, 771522, 651680, 514308, 451024, 474773, 615373, 768398, 888961, 856458, 860716, 827483, 788247, 817559, 913659, 891278, 1027452, 1044094, 872944, 792507, 942763, 902038, 846496, 766903, 930728, 959651, 894948, 929633, 964757, 1030514, 1140972, 1170399, 1194971, 1159303, 1291567, 1246989, 1434103, 1571991, 1526813, 1371101, 1316238, 1327172, 1382949, 1473757, 1276491, 1346438, 1310875, 1372335, 1468689, 1326368, 1370756, 1547597, 1593056, 1579733, 1494668, 1506657, 1519332, 1405305, 1377449]
18689A377449Q575N2117R7863Q2162K13467J21775R9694k5331j31079p6769K02002
18678B021925L69028j3803j66222p126K84412L4259l9790q8409k85421q5062J28304
18667B152095r884K61767K08895J48773l6221j10624M7989O9434J40887N4823
18657B927934o5018O8453K33266J61460J27909j23568j07853L30071L8185k0246
18647C570593K17142O8424L1829q8675P8073R5506J71530l1127K08729J11389
18637D433413J86222J19880n1M3307J20492K87122K94919P9907k2540J51384J88333
18626E882388J58720j06461J42055K34159J46243J97433K31761M12447M96501
18617G795246L68507K53036J38189K01960L57685K07612J30363K13967N62186
$$ y = [1377449, 1386024, 1438141, 1536004, 1618166, 1831633, 1953408, 2053102, 2027771, 1896692, 1819923, 2021925, 2390953, 2377150, 2210928, 2203802, 2488214, 2522473, 2482683, 2394274, 2108853, 2023791, 2152095, 2142211, 2403978, 2612873, 2761646, 2725425, 2614801, 2662790, 2732224, 2873111, 2927934, 2862916, 2931369, 3164635, 3326095, 3454004, 3330436, 3222583, 3552654, 3590839, 3570593, 3787735, 3856159, 3887988, 3799313, 3877386, 3972892, 4144422, 4113295, 4322024, 4433413, 4619635, 4739515, 4739464, 4782771, 4903263, 5190385, 5485304, 5565211, 5542671, 5694055, 5882388, 6041108, 5934647, 6076702, 6310861, 6457104, 6654537, 6886298, 7298745, 7795246, 8163753, 8416789, 8554978, 8756938, 9114623, 9322235, 9452598, 9666565, 10228751]
18608A0228751K41288J44102L75723N54469O01663L30813M49879M45148N08767
18599A3880603M87732O46023Q10086R39349Q97737J012416J133684J286858J321027
18590B2415515J090382J293130J367355J465174J520031J723506J822138J783681
18582C4480912K149627J940972J690034J801220J496480J469092J250621J211288
18574D7490246J637856J757920K168738K906792L315121M027101M882512N492092
18566G3678378O353986P175851P662855Q340165Q593392Q560619P982217O639793
18558A34987256M892690K729273K45786j795347l013033l858796m178003m224894
18550A25784932l723460k696685j954125o74799O55348J876351L102781L898691
$$ y = [10228751, 10470039, 10614141, 10989864, 11544333, 12145996, 12476809, 12926688, 13371836, 13880603, 14368335, 15014358, 15824444, 16763793, 17661530, 18673946, 19807630, 21094488, 22415515, 23505897, 24799027, 26166382, 27631556, 29151587, 30875093, 32697231, 34480912, 36630539, 38571511, 40261545, 42062765, 43559245, 45028337, 46278958, 47490246, 49128102, 50886022, 53054760, 55961552, 59276673, 63303774, 68186286, 73678378, 80032364, 87208215, 94871070, 103211235, 111804627, 120365246, 128347463, 134987256, 139879946, 142609219, 142855005, 141059658, 138046625, 134187829, 130009826, 125784932, 122061472, 119364787, 117410662, 116735863, 117391211, 119267562, 122370343, 126269034]
18542A26269034M929187N636558N942826N793124M763038L370389J972726K77694
18534A58954576j293291k344927k607402k224010j667485o76377N25811J517219
18526A50184114K549781L429186L781227L486830K733484J519822k19262k103280
18518A65361902l993405n150022n554460n421773m937728l955028l312317k213045
18510A30824124q65981L43587J775593L209651M403746N504241O417276O572148
18502A58184385O143620N088455L002702M31746k407753n059546p419220r182158
18494A48782231j0082003j0450473j0321572r558154q695607p835027p223914
18487H4615481o119442n043886m240131l734187k798401k193583j652801j319179
$$ y = [126269034, 131198221, 136834779, 142777605, 148570729, 153333767, 156704156, 158676882, 158954576, 157661285, 155316358, 152708956, 150484946, 148817461, 148141084, 148666895, 150184114, 152733895, 156163081, 159944308, 163431138, 166164622, 167684444, 167465182, 165361902, 161368497, 156218475, 150664015, 145242242, 140304514, 136349486, 133037169, 130824124, 129958143, 130301730, 132077323, 135286974, 139690720, 145194961, 151612237, 158184385, 164328005, 169416460, 172419162, 172850908, 170443155, 165383609, 157964389, 148782231, 138700228, 128249755, 117928183, 108370029, 99674422, 91839395, 84615481, 78496039, 73452153, 69212022, 65477835, 62679434, 60485851, 58833050, 57513871]
18479E7513871j235366j316335j330209j565277k092753k348999k510655k600739
18471D2513538k506558k350870k189027j975019k075832j946131k008413j846997
18463B5614691j626886j535642j305166j203269j126347r72720r36438p71422
18455A6136801o44833o46627p89919q53369q26236o21525l42037l18637m17526
18446A0676092m17741k92088n10250l16760k78735j09444k31264l47365j61568
18437H010877k36066k42429k62278j52453q6145j38657j51110k78662l95723j73252
18427E894102j15475k21210O9137k0504l23646k68850q5543l5887L0948M5243
18417D968315j39005q4392k70807j14195K281k0867M600j89230p4481n9565N9089
$$ y = [57513871, 56278505, 54962170, 53631961, 52066684, 49973931, 47624932, 45114277, 42513538, 40006980, 37656110, 35467083, 33492064, 31416232, 29470101, 27461688, 25614691, 23987805, 22452163, 21146997, 19943728, 18817381, 17844661, 16908223, 16136801, 15491968, 14845341, 14055422, 13202053, 12375817, 11754292, 11412255, 11093618, 10676092, 10258351, 9966263, 9456013, 9139253, 8860518, 8751074, 8519810, 8172445, 8010877, 7774811, 7532382, 7270104, 7117651, 7031506, 6892849, 6741739, 6463077, 6067354, 5894102, 5778627, 5557417, 5626554, 5606050, 5282404, 5013554, 4928011, 4892124, 4923072, 4968315, 4829310, 4744918, 4474111, 4359916, 4362197, 4341330, 4345930, 4156700, 4082219, 4022654, 4081743]
18406D081743J4380j98062O766N2612j30879k16901P2186n1907m1104P5061n0446
18395C613449j79006J5649Q417K0143n7291k66967j36378J7026k62188R3860J29865
18384B996579j45336j60622n8028J88501K19855n2549k43383j11825N6409K40328
18374B929929k18570q4185Q4338k64340r7971o4893K01830J10206M235K3335j9604
18363B604310l6920m5661q6361J03758j7091p0719o221j6271J8872k98426l08125
18352A841145M8754K8155M2420L351m4163j20261j20139o3731K14917K25791J12025
18341B168264j05408j60733J1269O9677M0750n0741k02568K5828M6492j40968
18331A701862k46362J06743j72588p7374K69745j11182r2714K6571j7254j04448
$$ y = [4081743, 4096123, 3898061, 3904827, 3957439, 3826560, 3609659, 3681845, 3629938, 3588834, 3663895, 3613449, 3434443, 3450092, 3458509, 3478652, 3421361, 3154394, 3018016, 3035042, 2772854, 2866714, 2996579, 2851243, 2690621, 2632593, 2821094, 3040949, 2988400, 2745017, 2633192, 2689601, 2929929, 2711359, 2627174, 2711512, 2447172, 2349201, 2284308, 2486138, 2596344, 2600579, 2623914, 2604310, 2567390, 2521729, 2435368, 2539126, 2522035, 2451316, 2445095, 2428824, 2447696, 2149270, 1841145, 1889899, 1918054, 1960474, 1963825, 1919662, 1799401, 1679262, 1615531, 1830448, 2056239, 2168264, 2062856, 1902123, 1913392, 1983069, 2023819, 1973078, 1770510, 1796338, 1842830, 1701862, 1455500, 1562243, 1389655, 1312281, 1582026, 1470844, 1378130, 1404701, 1387447, 1282999]
18321A282999R0009J24152J73350J32447p6228j21991k4834n4325J32185N5822
18311A713586k45067j64501j76880L1573N4080l1764O9119K1482k7931j4613o1986
18300A167098r4297N3649K01990J12686r4434J15222l9516k12498j85938r085
18290A014877P834J28492K25767j33129r6866P9159R557R821K4626n3474k54374
18279I62290p6013J47991J28067j2083m3279N3256m3768j12241M3322M6053J01023
18268A194618L517O3087o3629p1619J1171k02250o8339J30121o1899k91711O1564
18257G04631J42919L7625J23958P5578m9275L6347j19034k1892O089j48700j87934
18246F00312p1793j09860R3993L34776J4406m306J42499P5707p9650n4683J49424
$$ y = [1282999, 1373008, 1497160, 1670510, 1802957, 1726729, 1604738, 1579904, 1525579, 1657764, 1713586, 1468519, 1304018, 1127138, 1158711, 1212791, 1181027, 1250146, 1271628, 1243697, 1229084, 1167098, 1072801, 1126450, 1328440, 1441126, 1346692, 1461914, 1422398, 1209900, 1023962, 1014877, 1022711, 1151203, 1376970, 1243841, 1146975, 1226134, 1235691, 1245512, 1270138, 1216664, 962290, 886277, 1034268, 1162335, 1150252, 1106973, 1160229, 1116461, 1004220, 1047542, 1093595, 1194618, 1198135, 1261222, 1197593, 1125974, 1137145, 934895, 866556, 996677, 934778, 643067, 704631, 847550, 885175, 1009133, 1084711, 1035436, 1071783, 952749, 930857, 936946, 788246, 600312, 528519, 418659, 512652, 847428, 861834, 857528, 1000027, 1075734, 996084, 941401, 1090825]
18235A090825J45255k33864j85616k7093J4060j36j91106L8106j25122l36550
18225A88759Q0049O3538j2726N8584J79693K14280L4500j35274j94343J49867
18215F26927J99340j0154J241j00994m8318l12706l34610Q6515J50289J86758
18205D44288O8376J13414O5387K6645j13511l1928J75258l2571o9026P780k0059
18194F34053K5666L8850m3077k13667k64185k09901J15892K34795J42854K22992
18184F84272J86220R713K6114p5539m4872k09855o7742N7526P5208J42980K75850
18173A059875O308O1892l4272O2428R9997J45266m5554j98832j76134Q4828l4241
18162A031561j4602o0463o9028Q4195j41473m1163J31178L49246K89033j11527
$$ y = [1090825, 1236080, 1002216, 816600, 789507, 803567, 803431, 612325, 650431, 525309, 188759, 268808, 332346, 319620, 378204, 557897, 772177, 806677, 671403, 477060, 626927, 826267, 816113, 817354, 716360, 668042, 355336, 20726, 107241, 257530, 444288, 512664, 626078, 691465, 718110, 604599, 572671, 747929, 715358, 646332, 654112, 634053, 659719, 698569, 655492, 441825, 177640, -32261, 83631, 318426, 461280, 684272, 870492, 880205, 906319, 830780, 785908, 576053, 508311, 565837, 641045, 784025, 1059875, 1066183, 1128075, 1093803, 1156231, 1256228, 1401494, 1355940, 1157108, 980974, 1065802, 1031561, 1016959, 956496, 887468, 971663, 830190, 789027, 920205, 1269451, 1558484, 1446957]
18152A446957l20316J34695J19922m3222J88152R3634n1949r7898J40454j89573
18142A420856k28592l134J08925Q7197J43429m6665k05653O5778L94685J31882
18132A868708l8997N1565J898J48670O0545J02200m1566n2947L4841R8412J40310
18121B373639O8138M1444J6674Q0628K02967K26735K38236N76456L20831R0354
18111D236102J53531J39224p111j32632R3050k1908P0925o3565J21213J00292
18101D689121K66108K96574L45790L15969K70049N22605N81291O22839Q94240
18092H804586J260017J712558K056030K608356L246665M014992N451538P393001
18084C6547743R574624J0289599P473260J629517l979483p634020q094532o369914
$$ y = [1446957, 1126641, 1261336, 1381258, 1338036, 1526188, 1619822, 1567873, 1469975, 1610429, 1420856, 1192264, 1189130, 1298055, 1385252, 1528681, 1482016, 1276363, 1342141, 1736826, 1868708, 1829711, 1881276, 1883174, 2031844, 2092389, 2194589, 2153023, 2100076, 2134917, 2233329, 2373639, 2441777, 2483221, 2499895, 2580523, 2783490, 3010225, 3248461, 3824917, 4145748, 4236102, 4389633, 4528857, 4521746, 4389114, 4482164, 4460256, 4531181, 4467616, 4588829, 4689121, 4955229, 5251803, 5597593, 5913562, 6183611, 6706216, 7287507, 7910346, 8804586, 10064603, 11777161, 13833191, 16441547, 19688212, 23703204, 29154742, 36547743, 46122367, 56411966, 63885226, 65514743, 61535260, 53901240, 45806708, 39436794]
18076C9436794m405097l039882j823686q54271m50117K14232J371735K301389
18068C2751097L021248L917879N116274O636583Q544259J1625301J6679756K5038258
18060A13330655L7367345N3854695P0333665P2309398M4384989l909062m5824209
18053C41847476o5413211o2701103m8476448l3843774k2805254j5391547j0205915
18046H3010224n827683k132965J647978N497422R816092J5748740K4454332L5863091
18038A68077231M8620733N4634836M0815453O927707k7413106m7136378m9189908
18031A95336568m0070522k8522676j8840489j1787305o476545j851411K425214
18024I0212834P389216J3453220K2210625L3354299M5890008N1583830L7340570
$$ y = [39436794, 35031697, 31991815, 30168129, 29313858, 28863741, 29077973, 30449708, 32751097, 35772345, 39690224, 44806498, 51443081, 59987340, 71612641, 88292397, 113330655, 150698000, 204552695, 274886360, 347195758, 391580747, 387671685, 341847476, 276434265, 213733162, 165256714, 131412940, 108607686, 93216139, 83010224, 77182541, 75049576, 76697554, 82194976, 92011068, 107759808, 132214140, 168077231, 216697964, 271332800, 312148253, 319075960, 291662854, 244526476, 195336568, 155266046, 126743370, 107902881, 96115576, 89639031, 87787620, 90212834, 97602050, 111055270, 133265895, 166620194, 212510202, 264094032, 301434602]
18017C01434602M001455k8450319m6127535m7216820l8501381k8188493j9357996
18010I7593513j3195272q909221n055006j939672O76693L791265P762675J2867959
18002I3592934K1391987L3227021M7208749N7959953N0224908J6596766k3302566
17995B96899752m9439004n5533612m7086681l4576261k3989123j6873394j2468693
17988E6932984r567898p267657n771604m123880l249921k312993j438930o06728
17980B2593373j0484N03573J031248J514596K363838L282003M185830M741656
17972D0205633L261658l5448l376898n352371n838316n460829m422173l310822
17964A5670434k550453j688428j412471j127315q40557n43578o16998n30489o10629
$$ y = [301434602, 305436057, 276985738, 230858203, 183641383, 145140002, 116951509, 97593513, 84398241, 75489020, 70434014, 68494342, 69171035, 72962300, 80724975, 93592934, 114984921, 148211942, 195420691, 253380644, 303605552, 320202318, 296899752, 247460748, 191927136, 144840455, 110264194, 86275071, 69401677, 56932984, 47365086, 40097429, 34325825, 30201945, 26952024, 24639031, 23200101, 22593373, 22582889, 23086462, 24117710, 25632306, 27996144, 31278147, 35463977, 40205633, 43467291, 43431843, 40054945, 34702574, 28864258, 23403429, 18981256, 15670434, 13119981, 11431553, 10019082, 8891767, 8051210, 7507632, 6890634, 6360145, 5749516]
17955E749516l55159l11466l26102k52528l65668k91080k03684j26402j66049
17946C351378J08294K0635j4736o752j48006j59699k01770k68146m8655R2427
17936B724970J35570j14960N4726J50128M5979J67367p0796k31759k24552m45063
17926B191610k31443k1571J55250n0998L0121K01930J70616r6392N8270K37103
17916B644496l224q981o5825o1860L4731K08423M4301j58093n3975n0197k11980
17905B317816j64991R9522l4028j47487j97705j80414Q7965J14330l23656j69898
17895A401454m8472J24642m7677j04332m7977p1146p148k3482j89118L6770K5187
17884A048701m2944Q0221P5978o7337l9870j07676r3977k2908M1862J48995K92837
$$ y = [5749516, 5394357, 5082891, 4756789, 4504261, 4138593, 3847513, 3643829, 3517427, 3351378, 3459672, 3480307, 3465571, 3458819, 3310813, 3151114, 2949344, 2681198, 2632543, 2724970, 2860540, 2745580, 2800306, 2950434, 2996413, 3163780, 3092984, 2861225, 2636673, 2191610, 1960167, 1938596, 2093846, 2042848, 2072969, 2274899, 2445515, 2349123, 2407393, 2644496, 2641272, 2632291, 2566466, 2504606, 2539337, 2747760, 2792061, 2633968, 2579993, 2529796, 2317816, 2152825, 2252347, 2218319, 2070832, 1873127, 1692713, 1780678, 1895008, 1571352, 1401454, 1352982, 1477624, 1429947, 1325615, 1277638, 1206492, 1199344, 1175862, 986744, 1023514, 1048701, 1005757, 1085978, 1161956, 1094619, 1054749, 947073, 853096, 830188, 872050, 1021045, 1313882]
17873A313882o9715P6884j4423R2131R9117J4064j4236P6703J08426J5525r8974
17862A599384l56820n6579K2213j06558K9875j34521k7988J0754J64122j08382
17852A035500J25766R3627J23117n968r8700P5416O6543j36116P0193k4902k37178
17841A087298l40547j74309j1392K5744L5523L1271j57124p2245r6491J31362
17831D59090Q3980J83039N7049L0323J5170j7101J6266j62319p8192n6998l899
17820E26408q7386o7378r6083J6425N31m5163O8862K56029K17871j19020j20828
17809E50268J84172J11898J64445o4445j84056k39202J6586k0681k12674j32417
17799A73894J12483N6653j19655j48105J34107R8451M2881J24166j22593q5237
$$ y = [1313882, 1244167, 1321051, 1306628, 1398759, 1497876, 1511940, 1497704, 1574407, 1682833, 1698358, 1599384, 1242564, 1185985, 1208198, 1101640, 1131515, 996994, 969006, 979760, 1143882, 1035500, 1161266, 1254893, 1378010, 1372042, 1273342, 1348758, 1415301, 1279185, 1349378, 1324476, 1087298, 746751, 572442, 561050, 586794, 622317, 653588, 496464, 424219, 327728, 459090, 543070, 726109, 783158, 813481, 828651, 811550, 827816, 665497, 587305, 530307, 526408, 439022, 371644, 275561, 291986, 292517, 247354, 316216, 572245, 790116, 671096, 550268, 734440, 846338, 1010783, 946338, 762282, 523080, 539666, 518985, 306311, 173894, 286377, 343030, 223375, 75270, 209377, 307828, 350709, 474875, 352282, 267045]
17789B67045Q5112q0359p3149j0616j06525O129j7066J25066K48779J08280j59215
17778C93481j96213J3062J11777m7868r0447j33312l2870q2135p4714M8072J69591
17767G8424P0067j02278J779M7520J643O116J91725O8724K1212o0178o1842j70125
17755I2787o6257J62021J09494J04771R063l3752J13141j07424j70529M6291k6238
17744B33368L7884l4110q4248P2296J8459L5960R642M0756r6789k04575l4531
17733e888Q8055O1027q8368n9384L3601J1794J52668K169j2973J41012j55757
17722A67956m4081m1265o9884M2413o1917p2392J2511Q3582Q0297J11802r7034
17711A11988j6677m9827L522J19955l7751j35164N9836O514j46452o022K70569
$$ y = [267045, 352157, 271798, 198649, 188033, 81508, 87637, 70571, 195637, 444416, 552696, 393481, 197268, 210330, 322107, 274239, 183792, 50480, 17610, -64525, -139239, -91167, 78424, 148491, 46213, 47992, 95512, 97155, 103271, 294996, 363720, 384932, 324754, 262912, 92787, 26530, 188551, 298045, 402816, 411879, 378127, 491268, 383844, 213315, 259606, 233368, 271252, 237142, 152894, 225190, 243649, 279609, 289251, 330007, 233218, 28643, -5888, 82167, 143194, 54826, -4558, 29043, 40837, 193505, 195674, 182701, 323713, 167956, 123875, 82610, 12726, 55139, -6778, -79170, -66659, 16923, 97220, 209022, 111988, 95311, 45484, 49006, 168961, 131210, -3954, 55882, 62396, -84056, -90078, 180491]
17700A80491K23603j07540j21831j14393j21941o357M5590j26836J36546K9578
17690A6910j17474m6322O4440N8893n188N7912l4133J36028J16058L7735P3799
17679C58658j80510n0637J9841j12631j77425j35136m1126P7362l7759j05803
17669c85166P9302J33195J23578q5747j01482N2369J0117R693O5911M3666M7882
17658f682K2050J87527J37196k05867j27517j9314K52672K45023k07514j37806
17648A39768k4979O38J58664J17563p8906m2584R715J29512o3921K4496K2447
17637C92413j87331k56946j34662O3515o7249M5754n593J307Q704P8561j82073
17626b43600J63787K37914k2389j00694J82075j2417j0370j33573n2522N6248
$$ y = [180491, 404094, 296554, 174723, 60330, -61611, -67968, -22378, -149214, -12668, 16910, -100564, -146886, -82446, -23553, -28741, 29171, -4962, 131066, 247124, 284859, 358658, 178148, 127511, 147352, 34721, -142704, -277840, -318966, -241604, -279363, -385166, -305864, -172669, -49091, -134838, -236320, -183951, -173834, -164141, -98230, -54564, -6682, 15368, 202895, 340091, 134224, 6707, -12607, 240065, 485088, 277574, 139768, 114789, 115427, 274091, 391654, 312748, 270164, 279879, 409391, 345470, 369966, 392413, 205082, -51864, -186526, -123011, -190260, -144506, -150099, -148792, -140088, -61527, -243600, -79813, 158101, 135712, 35018, 217093, 204676, 194306, 60733, 8211, 64459]
17616F4459K8219R0775p1163M5118J81071K4676Q332k87p0169p8023q489N3376
17604B67895J07868N6701j93891R720q0866n2670J44309j5960K61263J4410J00310
17593F19089P194j8062J802J4970j21371L2325J8823r4777O2223m5739j38742
17582C37735M7294J89750J4669R3933J7315j7980K71251M60678J67401k6608L2686
17571A588124K10554L0635j62129j34703j75838n5641P9334j60423l3699J75998
17561A362212J47j68103k19281L2926L6512p0958j92310p7920o4974j82610n8833
17550C96808J55o7648j15598J02968M2368J00361k172O6138j69496j37032l8669
17539A78183O7406L9066k8836N570Q063p8817k0156R9535M5256J92875P5493L3378
$$ y = [64459, 92678, 183453, 112290, 157408, 338479, 363155, 371487, 371200, 301031, 223008, 214519, 267895, 375763, 432464, 238573, 248293, 167427, 114757, 259066, 243106, 504369, 518779, 619089, 626283, 608221, 610023, 624993, 503622, 535947, 554770, 459993, 522216, 476477, 337735, 385029, 574779, 589448, 683381, 700696, 682716, 953967, 1414645, 1582046, 1555438, 1588124, 1798678, 1829313, 1667184, 1532481, 1356643, 1301002, 1380336, 1219913, 1186214, 1362212, 1362359, 1194256, 974975, 1007901, 1044413, 973455, 781145, 703225, 638251, 455641, 396808, 396963, 329315, 213717, 316685, 359053, 459414, 457242, 523380, 353884, 216852, 178183, 245589, 284655, 255819, 261389, 269452, 190635, 170479, 270014, 315270, 508145, 583638, 617016]
17527F17016K25277P9597O3280J78895J86868K5055j05996K58032K15493J00363
17517A843880J15047p1350j97067j28788q7879l7685P6488k64083j74095m9174
17507A025294k57120j69625J1131j00192j11846p4008k12920j70960j53543J39496
17497g4293J54972J57940O0050j20565K8556O4532j30179j09293n8354K9303j58946
17486a56277J14039K32297o3203m2528Q4899J56766o2935j9707J29307J31328
17476E03986M8514L9852J1869O494J41512r5312j99477P5466N3872J09069P5267
17465G71112m4917l5044n9032j50864j5550L4455r8575k03345j07736r5615N4006
17454D8895P9082j07796O2589Q6039j7333p5592j27761J42869k03480r7665J47844
$$ y = [617016, 842293, 921890, 985170, 1164065, 1350933, 1375988, 1269992, 1528024, 1743517, 1843880, 1958927, 1887577, 1690510, 1561722, 1473843, 1436158, 1512646, 1248563, 1074468, 1025294, 768174, 598549, 609680, 509488, 397642, 323634, 110714, -60246, -213789, -74293, 80679, 238619, 298669, 178104, 206660, 271192, 141013, 31720, -26634, 2669, -156277, -42238, 190059, 126856, 84328, 169227, 325993, 263058, 243351, 372658, 503986, 552500, 592352, 604221, 610715, 752227, 656915, 457438, 532904, 586776, 695845, 771112, 726195, 691151, 632119, 481255, 465705, 500160, 401585, 198240, 90504, -5111, 48895, 127977, 20181, 82770, 168809, 151476, 75884, -51877, 90992, -112488, -210153, -62309]
17443f2309J58074m1438J7474P2100L4043L2353k58144k43858m8382K52635J21561
17432C4109j3612j2691k7096M4329j03521j56729j4838P7570q2798N7325L2397
17421a65555l4563J1659j07014m7814J15542K7655K34666M2932q3832m4805j35259
17410a86388J77789N4993Q5845J2934k00465Q944J24231j34323p7362J3901N327
17399a14574Q0940P4243k8569p6159j82847k9052K10074R6330k191J06279J91134
17388C25608j48823j88598r7849J1789R2741J44251m7195n8807N5341M2727j03410
17377B7775O3484J48633J9463l7117j29993j30065m9102R009N7454J36586L2120
17366A48247l1234L4325q422N1135m7759j37003n4847p6473K0884Q1059P8485
$$ y = [-62309, 95765, 54327, 71801, 143901, 177944, 210297, -47847, -291705, -340087, -87452, 34109, 20497, 7806, -19290, 25039, -78482, -235211, -250049, -172479, -255277, -197952, -165555, -200118, -188459, -295473, -343287, -227745, -200090, 34576, 77508, -6324, -51129, -186388, -8599, 46394, 132239, 145173, -55292, -46348, 77883, -56440, -133802, -119901, -114574, -33634, 40609, 12040, -64119, -246966, -276018, -65944, 30386, 28195, 134474, 325608, 176785, -11813, -109662, -97873, -5132, 139119, 91924, 33117, 88458, 131185, 27775, 91259, 239892, 259355, 222238, 92245, -37820, -86922, -77913, -20459, 116127, 148247, 117013, 151338, 142916, 194051, 146292, 9289, -45558, -122031, -101147, -20088, 58397]
17355E8397J67873j10373k59285J25049k9636j9900J90081K7983r8234j42456
17345i0501P74J58703l1608j2304J225K6159j39199o9969Q4644O8998j62933n4391
17333b20402J14187J15936O0997Q8807J43435p3466k04581n5362j48028J10316
17323f8161J47530p5828q6707K4843j2151J42848j24081j76601n0868N3931Q5197
17312a40048J2094J22293J4561L1967K0898r7511n1118m2553M2935L8088j06031
17301a54425p2331p73Q114r9996L8724J69347L0196M9635J70030M2747J07882
17290B89150r8764k23971p8534j58751l7420J50922r720n9038p609o8342J7496
17279b84581N5556p6241r6117O3966J80334n4500J2329O4927j19294N3560L6028
$$ y = [58397, 226270, 115897, -143388, -18339, -47975, -67875, 122206, 150189, 51955, -90501, -89727, 68976, 37368, 25064, 26289, 52448, -86751, -156720, -72076, -3078, -166011, -220402, -106215, 9721, 70718, 159525, 302960, 229494, 24913, -30449, -178477, -68161, 79369, 3541, -83166, -58323, -70474, 72374, -51707, -228308, -279176, -225245, -140048, -127954, -5661, 8900, 40867, 61765, -35746, -86864, -129417, -86482, -48394, -154425, -226756, -227529, -219415, -319411, -280687, -111340, -81144, -31509, 138521, 181268, 289150, 190386, -33585, -112119, -270870, -308290, -157368, -167088, -226126, -233735, -302077, -284581, -229025, -305266, -401383, -337417, -157083, -211583, -199254, -134327, -253621, -200061, -164033]
17268a64033J25956J00868m7461j01853m5037P183n0511j10856P7596J20617l4502
17257a22033L0171O3107M9205J94143m6951k45346J2787Q1098L0308P7312j04069
17246A9732Q991O6276k95245q2523J52553R6943Q0432P5685K29939j15186j48126
17235H9471R2507P7715l5481l69357n4689J40975N3752q1301p2273J56563J35684
17224A33566k7451k19240j10712P1028K6776j62044K0236j34936J2172j03413
17214d94018J36566J56524L12646N1764j56840j28277O694J89943j0783j63885
17204i9666j54971j41109M2275J86127J15595k4347m645o9498L8421o902l6644
17193a55364N0842M6545K07830n4283j38500j71382J32211J14649J472k18740
$$ y = [-164033, -38077, 62791, 15330, -86523, -131560, -124377, -174888, -285744, -208148, -87531, -122033, -91862, -28755, 20450, 214593, 167642, -77704, -64917, 16181, 46489, 123801, 19732, 28723, 94999, -200246, -282769, -130216, -33273, 47159, 122844, 352783, 237597, 89471, 181978, 259693, 224212, -145145, -199834, -58859, -5107, -86408, -158681, -2118, 133566, 106115, -113125, -223837, -152809, -126033, -288077, -267841, -402777, -390605, -494018, -357452, -200928, 111718, 163482, 6642, -121635, -114941, 75002, 64219, -99666, -254637, -395746, -353471, -167344, -51749, -76096, -80741, -150239, -111818, -118720, -155364, -104522, -57977, 149853, 95570, -42930, -214312, -82101, 32548, 34020, -184720]
17183a84720j55565K7432K65708k4969k2998J20282Q2519J8223k258j07918j1737
17172C999J33394j07628p7872J20024M0062r4869M6807L4674p307j45963j56326
17161b11005j93772R973R2978J40047J19470j1858L103M5221m2670K31035j5669
17150A66853j84107r1398N9471K92850J09384k40800m5061J69560k343J05943
17140C40352p2584L1921j0233r7797j3388J14464o8242o075M87o0972j98295L9617
17128g45J66636k5522q1596M338j47482q2770n6355L5391J13097J49336j67026
17117i2698Q2461R1300p8015j01655m8200k6551K541J80098n7570r1367N1355
17106h8301p1118J31271M46013J20253j99453k05485J70915n7673j70462k2809
$$ y = [-184720, -340285, -312853, -47145, -72114, -95112, 25170, 107689, 125912, 123654, 15736, 3999, 137393, 29765, -48107, 71917, 111979, 17110, 63917, 98591, 91284, -54679, -211005, -404777, -394804, -301826, -161779, -42309, -54167, -51064, -5843, -48513, 182522, 166853, -17254, -108652, -49181, 243669, 353053, 112253, 67192, 236752, 234409, 340352, 267768, 299689, 289456, 191659, 178271, 292735, 224493, 218418, 218905, 157933, -40362, -745, 165891, 140369, 58773, 63111, -84371, -167141, -223496, -188105, -75008, 74328, -92698, -10237, 81063, 3048, -98607, -146807, -173358, -170817, 9281, -48289, -139656, -88301, -159419, -28148, 417865, 538118, 338665, 133180, 304095, 246422, 75960, 53151]
17096E3151J41800o1113l2396j25832m5738Q2485J85142J00520j05244n9216P1273
17085B04832j66678p9380K1066P7869J57878N122j38603o2134q0915j65003n4838
17074b80784j09176l2966K08474R6103o8385J62j38532N2307N7915J6819j3311
17063b11374m1443M3963J32549m9797p2039K29489j4444o1260j42682k6915N0851
17052a63102M7138j08020Q456J66422O3538P5294p5991K3086n4669K1555M0016
17041D3723M8445j0933Q3995K181k39605m7853J11035J56437J07086j13318q2935
17030E8258M2781k21796j75586j25430m1679K20916J16330N2313n3294N9635K9431
17019c8121O0518O8786p80L3619K8299J55626M3582o000m3001j47624L8077l322
$$ y = [53151, 194951, 133838, 101442, -24390, -70128, 12357, 197499, 298019, 192775, 133559, 204832, 38154, -41226, -20160, 57709, 215587, 220709, 82106, 19972, -60943, -225946, -280784, -389960, -422926, -214452, -118349, -186734, -186572, -325104, -272797, -214882, -198063, -211374, -252817, -208854, -76305, -126102, -198141, 31348, 16904, -44356, -187038, -213953, -163102, -115964, -223984, -215528, -49106, 14432, 89726, 13735, 36821, -17848, 3707, 43723, 92168, 81235, 165230, 167411, -72194, -120047, -9012, 147425, 254511, 141193, 58258, 101039, -120757, -296343, -421773, -463452, -242536, -126206, -73893, -127187, -67552, -38121, 22397, 91183, 90403, 124022, 152321, 307947, 351529, 345529, 302528, 154904, 192981, 189659]
17007A89659j9266j9573j00666J3147j46495j4526J21933J68788m2925j15520
16997C4556l15229o2066J46849J41007r5356r4036J51759R0205O5257j52735m0226
16986a30015J94835r5158n8037m2174O1457N0674J54023P3623l013q1262r3228
16975C1725j34652o652J14288l3651m8502o3079J69290N6712j33722k21621K63700
16964f164K71071L1547p1539j19541q7796k06632j36931L5814K20799M2386P7407
16953E0421r1145J78N9284l359O1951j51097j85835p3207P5974p988o425j2096
16941b83344q1605J44875o7278k8436J19537l0204L2143Q5096o6588j78576R3339
16930b61041N6960J2390J47898n7151J07833l9402R8598j27066k22117L7157J57908
$$ y = [189659, 170393, 150820, 50154, 63301, -83194, -97720, 24213, 193001, 150076, 34556, -280673, -342739, -195890, -54883, -150239, -244275, -92516, -2311, 62946, -89789, -130015, 64820, -30338, -88375, -130549, -69092, -18418, 135605, 209228, 206215, 124953, 31725, -102927, -109579, 4709, -28942, -77444, -140523, 28767, 85479, -48243, -269864, -6164, 264907, 296454, 224915, 105374, 17578, -189054, -325985, -290171, -69372, -26986, 50421, -40724, -40546, 18738, 15379, 77330, -73767, -259602, -332809, -256835, -264823, -271248, -283344, -364949, -220074, -287352, -315788, -196251, -226455, -194312, -109216, -175804, -354380, -261041, -204081, -191691, -43793, -100944, 6889, -32513, 66085, -60981, -283098, -245941, -88033]
16919h8033k7403L0674j4459J08096O8413m7912j51849j35808M6782J30189P2284
16908i026P456J63047Q5948j83407r7960P3783j05348k00899M573K06603R4970
16897C9740o6121J86951O6373k63720k4531m9940K29116J39799J05559Q0469m0265
16886D03430j85496l33750k10078M4571J07789J83650Q4242m5810l0914p6032
16876e8398J41520n7490K5514R1051j31809O945k1603p6342R6676L6057q2237
16865c0116j32056R3530J36551j2420j36058k9245p3132Q2928K40917P2945j50689
16854F3155M5318P8556M3713r1202l2148k6860M8191J3918k16850J2169q5797
16843a47837O0792o1872n4611P2615J27848Q4925K7263O6787L3245M0480L3073
$$ y = [-88033, -115436, -84762, -99221, 8875, 77288, 29376, -122473, -258281, -211499, -81310, -9026, -1570, 161477, 247425, 64018, -33942, 39841, -65507, -266406, -261833, -55230, 39740, -26381, 160570, 226943, -36777, -61308, -111248, 117868, 257667, 363226, 443695, 403430, 217934, -115816, -325894, -281323, -173534, 10116, 94358, 48548, 17634, -58398, 83122, 25632, 51146, 142197, 10388, 17333, -4270, -80612, 16064, 52121, -30116, -162172, -68642, 67909, 55489, -80569, -109814, -182946, -100018, 140899, 213844, 63155, 108473, 187029, 230742, 139540, 107392, 80532, 128723, 142641, -74209, -62040, -147837, -87045, -148917, -203528, -130913, -3065, 81860, 109123, 175910, 209155, 249635, 282708]
16832B82708m3183k42710Q573K18307N8683l0262j09208k66873q561o1988J38909
16821e5605P1969Q9167L6662j62265m6724Q5455q8977m3791p0901k44165j42786
16810e71961j671O4433J88357J40530Q7765p548p1893L8034N5614j44220q0231
16799c02791O8294o1J21681R444k6496J31043k17299p7294K02821L1352K7380
16788c1926j29550J00462n8684o0837n3691p065K21066J6283j89807J459J03285
16777h9005J48072k03479r2426J34172l9737m4776p616J6930R1878J30542L15895
16766C60450k3821k68093j52428J2945P1882N6244N8245o1213K981N0168M4959
16755A52319j09151K8821K24121j62194K77R0638J91290m8222k38847n2042O0692
$$ y = [282708, 239525, -3185, 5388, 223695, 282378, 252116, 142908, -123965, -132526, -194514, -55605, 16364, 105531, 142193, -20072, -66796, 18659, -70318, -114109, -185010, -429175, -571961, -573632, -509199, -320842, -180312, -92547, -100095, -171988, -133954, -78340, -222560, -302791, -234497, -234558, -112877, -103433, -129929, 1114, -216185, -293479, -90658, -59306, -31926, -161476, -61014, -119698, -180535, -234226, -241291, -20225, -3942, -193749, -192290, -89005, 59067, -144412, -236838, -102666, -142403, -187179, -194795, -177865, -85987, 44555, 360450, 336629, 68536, -83892, -70947, 935, 57179, 115424, 54211, 57192, 107360, 152319, 43168, 71989, 296110, 133916, 134193, 224831, 416121, 367899, 129052, 77010, 137702]
16744A37702J07998n8237j71577N3841l9861M0992q8273R5658J93513k3447k61968
16733a3659j88358j19284j2512l0725J97145K48085J72354P8168j61927j0942
16723A58345N8577J37485L9709j96692j91321j06068J23815l0147j77043P2728
16713a10612r656M2311N4305j03386n2688l394P0056K12637N4668j59198k10381
16702b15338J44749L61089k83495j92836J05053J19923M5476J43519O3316j76065
16692A15391J51599K8688j65756j95070l54924j2056L00696J39025m079r9346
16682i5832j66566j03303L8560n0931N4289K42047J77417M9832N8688l04736l0610
16671a31145j1498m3196J4972j9378j35657o910k3367R3338J97303J32060J34475
$$ y = [137702, 245700, 187463, 15886, 69727, 29866, 70858, -17415, 78243, 271756, 248309, -13659, -202017, -321301, -333813, -364538, -167393, 80692, 253046, 331214, 169287, 158345, 216922, 354407, 394116, 197424, 6103, -99965, 23850, -6297, -183340, -110612, -120268, -77957, -23652, -127038, -179726, -183120, -113064, 99573, 154241, -4957, -215338, -70589, 290500, 7005, -185831, -80778, 39145, 84621, 228140, 291456, 115391, 266990, 295678, 129922, -65148, -420072, -432128, -131432, 7593, 3514, -95832, -262398, -365701, -327141, -378072, -323783, -81736, 95681, 145513, 204201, -100535, -131145, -142643, -185839, -170867, -190245, -325902, -332812, -356179, -262841, -65538, 66522, 200997]
16660B00997j08441j89974K863j23519r125k340J26913J30096k7255m9571j2211
16649f1567R574o0403o739K1018J03562J74250R4644j83659k13109j31558j62832
16638d16819J92338K44597N2756n9802o9634M8868M2056J49322J02621j20292
16628A66011k97747j2477K74462J20418M0292L4094m0291j65p4295l0699j74537
16617E066j00923j00487J64241J69023k5824q244K43091j37507k76927k40609
16607c09100J9673L44112J51306j28393j22742Q9981K6608j29450j31160J26654
16597f2511K32721k03024j79343p6674r4829J10465R3884J71947j61670K2748
16587a46286J30264r125q0708J65275J24724k5203O1948l1051j12727j3442K1484
$$ y = [200997, 92556, -97418, -94555, -218074, -227199, -229539, -102626, 27470, 215, -49356, -61567, -51993, -112396, -119135, -98117, 5445, 179695, 274339, 90680, -122429, -253987, -416819, -224481, 20116, 72872, 13070, -56564, -7696, 34360, 183682, 286303, 166011, -131736, -144213, 130249, 250667, 290959, 325053, 284762, 284597, 210302, 179603, 5066, -95857, -196344, -32103, 136920, 111096, 102852, 345943, 208436, -68491, -309100, -289427, 54685, 205991, 77598, -45144, 44837, 71445, -58005, -189165, -62511, 170210, -32814, -212157, -288831, -383660, -273195, -179311, -7364, -169034, -146286, -16022, -25147, -105855, 59420, 184144, 158941, 220889, 189838, 77111, 63669, 85153]
16576H5153o8413j88495J18773K65730P0017k06036O1036j01956p2511K5239K42426
16565B30963k0484k55337J45613K31329r1799j7680l1109j57697k7214R8970L9299
16554A44854O6786N8075R6926j11534j11773j97432j03942J43581K01019r3383
16544I3177j20373O004J22324j36786O4171J05792j63733j96442P9523J8505J15554
16533a2284J65612O3872j02531n7022j20129N4118J77932Q3609j18956k8051l2042
16522G4128j64562j73342k14693J36191P3103j10643R6811R7674n5556m1306m2799
16511c24994J92214P7760J98149j85998L252M2040L3253J19297q1320k48236k43629
16500d18212J85257K12008o5849o604J45774J26886q5401J86566L31k22339j90772
$$ y = [85153, 16740, -171755, -52982, 212748, 282765, 76729, 137765, 35809, -36702, -11463, 230963, 210479, -44858, 100755, 332084, 240285, 222605, 191496, 33799, 6585, 105555, 144854, 211640, 269715, 366641, 255107, 143334, -54098, -158040, -14459, 186560, 93177, -27196, -21192, 101132, -35654, 28517, 134309, -29424, -225866, -146343, -127838, -12284, 153328, 217200, 114669, 57647, -62482, -8364, 169568, 253177, 134221, 106170, 74128, -90434, -263776, -478469, -342278, -269175, -379818, -283007, -185333, -240889, -282195, -324994, -132780, -55020, 143129, -42869, -39617, 2423, 35676, 154973, 73653, -174583, -418212, -232955, -20947, -86796, -93400, 52374, 179260, 93859, 280425, 280756, 58417, -132355]
16489a32355j3554N0067J59275K60269k3070l52704j96690J20969P7072K72959
16479B22238n6036j15558j1638L4396O3286N5893K1579k54186j74105j01650Q5067
16468b30714j0330J735J64295L16467J46692k06528k72203j87956J924j95058
16458d71676j53310K04352K44662J70171M2230J45829j48625l8462N8433q5474
16448c1870j04633k0843k5889K40419K12236j29428j80305o2610o7458L5374P5636
16437e9371Q3299M9224J9090k17558j08777j22837l0069J28111K43571K23728
16427B08411J59279r7355j88428k36890l7383R9230N7176n8374m4308k18910K512
16416c55040J58606J18731j07862j30091N1961P5895o972q2878o7482J07024J10532
$$ y = [-132355, -145909, -95842, 63433, 323702, 300632, -52072, -248762, -127793, -50721, 222238, 166202, 50644, 39006, 73402, 136688, 192581, 214160, -40026, -214131, -315781, -230714, -241044, -239309, -75014, 241453, 388145, 181617, -90586, -278542, -276618, -471676, -624986, -420634, -175972, -5801, 36429, 182258, 33633, -4829, 53604, -31870, -136503, -157346, -183235, 57184, 269420, 139992, -40313, -102923, -170381, -135007, -59371, 23928, 73152, 92242, -125316, -234093, -356930, -386999, -258888, -15317, 208411, 367690, 270335, 81907, -154983, -192366, -93136, -35960, -94334, -138642, -357552, -355040, -196434, -77703, -185565, -315656, -263695, -187800, -194772, -277650, -345132, -238108, -127576]
16405a27576j17295l9461k1822Q9520m0977o194J32098P5727K4008o8461n0509
16394a50942j25838K08966M3945j76222N7341J53919n8355r2240l5451k38092
16384d12969o8917k4543J20848K07053l3202J43141J57861P527K7319k96029l0305
16373b02216R0033o6118j79979L4917J29557J8485M9571o012k619J82251j14052
16362f6182j960k1668l657K85058K79607q4100k39970k30024q1926J36650K41652
16351B13480J20093j68561j08267o7486K4604J33857J0031j81873k7083R4939
16341D3734J57805k7106j20166J24702Q0239k77070j59135J29542J35915l7899
16331E0561j04016J28605P5444J75600k13429j92708j32507o286K25815j1750
$$ y = [-127576, -244871, -284332, -306154, -216634, -257611, -263805, -131707, -55980, -31972, -100433, -150942, -276780, -67814, -23869, -200091, -142750, 11169, -47186, -139426, -174877, -412969, -481886, -506429, -385581, -178528, -211730, -68589, 89272, 96799, 124118, -171911, -202216, -112183, -178301, -358280, -323363, -193806, -175321, -125750, -131762, -134381, 47870, -66182, -68142, -89810, -93467, 191591, 471198, 387098, 147128, -82896, -164822, -28172, 213480, 333573, 165012, 56745, -10741, 13863, 147720, 157751, -24122, -51205, 43734, 201539, 174433, 54267, 178969, 259208, -17862, -176997, -47455, 88460, 50561, -53455, 75150, 150594, 326194, 112765, -79943, -212450, -218736, 7079, -4671]
16321d671K6522M6932J5979r3691N4062r6906K95021R2525j42788Q7441j71141
16310A09285k64743j60215Q9730R5911O6619J43222p2720j6734j5641k43658L19021
16299E0077K69595j56040j71363J5330L44491j30690j86382K2908K05119L1643
16289B94688j9984n4836K417n5897q1434M0677r6264K82433j69152j66126j2305
16278c5783r0886J75109K525M4040M099k0321P7185l10013j76968J28539J70556
16267c1918P8436j93158j99184M2765K07262K9419M4997k8694o7118o2816j4647
16256a94656l5554J50662L5692j10199j47757L7727O8380m5991q1366L44R9651
16245b23067j38094J13536J60949K3824L2874r995l7160J42120O7009R7164q0023
$$ y = [-4671, 21851, 68783, 84762, -8929, 45133, -51773, 243248, 335773, 192985, 280426, 109285, -155458, -315673, -225943, -130032, -63413, 79809, 7089, -9645, -25286, -268944, 50077, 319672, 163632, -7731, 7599, 352090, 221400, 35018, 57926, 263045, 294688, 274704, 219868, 222285, 166388, 84954, 125631, 29367, 311800, 142648, -23478, -35783, -126669, 48440, 50965, 95005, 99104, 78783, 155968, -154045, -331013, -202474, -31918, 46518, -146640, -345824, -303059, -95797, -66378, -21381, -50075, -117193, -180009, -194656, -230210, -79548, -43856, -154055, -301812, -264085, -195705, -241696, -323062, -322718, -223067, -361161, -247625, -86676, -62852, -29978, -39973, -77133, 64987, 131996, 229160, 149137]
16234A49137o1880o2689k47374j16987J90582J33583J76214N9073J45985k2589
16224C43055j88593j61621m1998m1286j11255K09478J54491j80145j5595J81504
16214A48035J7037Q3921Q3971j33249j18215j3958k8471j07655Q00Q9877M4136
16203F6229n0488R9880J68125k13310k04979j14125J71258o5897j30266Q6098
16193a87475J20519j16755M0602K29870K5656O8617K19481J03771l0392k42544
16183B31350p4595q53l58814j91081J36292K27710j82516m6420J21273O16J947
16172a35091R1036o0162M2966n0315K3563J22336K28934j72189j42239j81395
16162b32556k0967J60264J27355L7098J1495j73460L99J6514O2026j3733Q1427
$$ y = [149137, 87257, 24568, -222806, -339793, -149211, -15628, 160586, 219659, 365644, 343055, 154462, -7159, -49157, -90443, -201698, 7780, 162271, -17874, -33469, 148035, 165072, 248993, 332964, 199715, 81500, 67542, 39071, -68584, -67784, 22093, 66229, 15741, 115621, 283746, 70436, -134543, -248668, -77410, -143307, -273573, -187475, -66956, -183711, -143109, 86761, 112417, 181034, 400515, 504286, 473894, 231350, 156755, 155902, -202912, -393993, -257701, -29991, -212507, -258927, -137654, -137038, -135091, -44055, -104217, -61251, -111566, -88003, 34333, 263267, 91078, -51161, -232556, -253523, -93259, 34096, 71194, 82689, -90771, -90372, -73858, -11832, -25565, 55862]
16151E5862k3004j841J26762P9556J2056j76252l70687l1159K09011j3169j0107
16140a42972N8113J3744J06769J24109j38077J0253r2873L3174P4629l9091j28227
16129a20449K6787R7469Q7740L5422j08183j95487J1609J04711K24832k7126j9423
16118A17902P3860J9429j00529K6007j9882j20786j96928n0944j6956K15304J77360
16107A23837r6539l06991j57399P3862K61304J16957K609K85245R5049k17252
16097A80682k43329j83803J23789R1643n561j40738N1597j12250o6307l4705J14923
16086b24059P0038J5472J01371J19072L9949r9073m592P6587j0452Q1533L5230
16075B01076j83419l4200j24941O5038r1084r4L35273J08491j56871m3945Q0678
$$ y = [55862, 32858, 31017, 157779, 237335, 249391, 73139, -297548, -328707, -119696, -132865, -142972, -84859, -71115, 35654, 159763, 21686, 31939, -60934, -27760, 46869, 7778, -120449, -93662, 3807, 91547, 126969, 18786, -176701, -165092, -60381, 164451, 137325, 117902, 191762, 211191, 110662, 136669, 116787, -3999, -200927, -251871, -268827, -53523, 123837, 27298, -279693, -437092, -363230, -101926, 15031, 17640, 302885, 397934, 180682, -62647, -246450, -122661, -31018, -36579, -177317, -125720, -237970, -304277, -338982, -224059, -154021, -138549, -37178, 81894, 121843, 22770, 18178, 94765, 84313, 165846, 201076, 17657, -16543, -141484, -76446, -167530, -167624, 167649, 276140, 119269, 75324, 156002]
16064A56002j60502L4780n5274N9486Q5159m6281K116L13136O1773k64750l6380
16053A49265p4797l04150p6082J60394J45303J54097R359J22426J06361o1240
16043C30936m5303n5152q267k05331j07543J51209q2336j43566J75457K77506
16033B87610J9246j15869k4164Q3993M1002J7466r8373j7314k02824j32048J51344
16022A0069J6744L0583j17211r5235r801J21331P5871L9279Q9578p7975n1983
16011C1250r3344N4962J05946K850M011o5585j59374j78053l7678j80243l5207
16000e50465K53501K86824J6123J26962O6608k3454j44023j21745r0506J15247
15990f4928J19589l9894P1758l843j20201k05078p0404J50112p1007M0068p4403
$$ y = [156002, -4500, 30280, -24994, 34492, 119651, 73370, 75486, 388622, 450395, 185645, 149265, 74468, -229682, -305764, -145370, -67, 154030, 163389, 285815, 392176, 330936, 285633, 230481, 222214, 16883, -90660, 60549, -21787, -165353, 10104, 287610, 306856, 190987, 166823, 250816, 291818, 309284, 210911, 193597, -9227, -141275, 10069, 26813, 57396, -59815, -155050, -164851, -43520, 32351, 71630, 161208, 83233, 31250, -62094, -7132, 98814, 101664, 105675, 40090, -119284, -297337, -335015, -515258, -550465, -296964, -10140, 5983, 132945, 199553, 176099, 32076, -89669, -180175, -64928, 54661, 14767, 86525, 82682, -37519, -242597, -313001, -162889, -233896, -193828, -268231]
15979b68231K87869M3783j8887r1377n253J9743l0641J2850J07572k0123k8306
15968H999l7592P6710o1114K4723j5134j27293l9734j53370j4392O0970j2994
15957b90221L14587R1668J26875N1522j45282j19344o4892k15931J25738J72521
15947D7241k4570j37335p7654L3172M4958J30295n3123k3314J61670r5202p7991
15936g1853m0187J80425J8172j90206j61154K25497J8111k45309j31872J80643
15926b17733P5942Q9498P1855j00232N3442j9622o8689j12438L2056O3048L6628
15915i6245o0971J3584N4402J53576k1082j00360o2449k30543k11712J19636J02363
15904c39801J49736P6638J64830M5831j04216L7218M0479n5396p0869l4093J22733
$$ y = [-268231, 19638, 63421, 44534, -46843, -52096, -32353, -62994, -50144, 57428, 37305, 8999, -28593, 48117, -12997, 11726, -3408, -130701, -170435, -323805, -338197, -277227, -290221, 24366, 116034, 242909, 294431, 149149, 29805, -35087, -251018, -125280, 47241, 22671, -114664, -192318, -159146, -114188, 16107, -37016, -60330, 101340, 6138, -71853, -112040, 68385, 86557, -103649, -264803, -39306, -21195, -266504, -398376, -217733, -141791, -52293, 19562, -80670, -27228, -46850, -115539, -227977, -195921, -132873, -96245, -157216, -143632, -89230, 64346, 43264, -57096, -119545, -350088, -561800, -442164, -339801, -190065, -113427, 51403, 97234, -6982, 30236, 70715, 15319, -55550, -89643, 33090]
15893C3090J18909j3695m2855m7824p7570O9300J14581j8864j20934l10937K2483
15882b74316J53512j0993l1540m6450o7097j65567n2172J80757Q0518J12487Q9755
15871c1106R194k16143j85104K37069N0499P5794N746k49349j14306O4414L29583
15860b3709K19586j34294k49220J2774J50072l5647m871K35270p3978j48395j04622
15849a57034j2888l357R3265Q6812k67821n2695j15765J8649J11476J38065K08501
15838D7208p9756l6786M6049J75250R652j45927n7843Q6883O0227J44898O452
15827B56307L4577K0798j33670k9962j02502m1301J55217M1951n906k1079j04122
15816G0308j04110j24161m0112R5313J34356k19432m0424J37886J50910O3382
$$ y = [33090, 151999, 138304, 95449, 47625, -29945, 39355, 153936, 135072, 14138, -296799, -274316, -120804, -131797, -163337, -209787, -276884, -442451, -494623, -313866, -233348, -120861, -31106, -21912, -238055, -423159, -186090, -135591, -59797, -54051, -303400, -417706, -353292, -23709, 195877, 61583, -187637, -174863, -24791, -60438, -65309, 169961, 95983, -52412, -157034, -169922, -173279, -80014, 6798, -261023, -313718, -429483, -410834, -299358, -161293, 47208, -32548, -69334, -23285, 151965, 161617, 15690, -42153, 44730, 104957, 249855, 256307, 290884, 311682, 178012, 148050, 45548, 4247, 159464, 201415, 195509, 174430, 70308, -33802, -157963, -198075, -102762, 31594, -187838, -228262, -90376, 60534, 123916]
15806A23916q943J07559p7320K0568j1599K0137o6874j4529j0380J48985J3655
15795B45175k03055p2333J3594k5117j10537n867k0844L6304J39362M1110n1432
15784a3640l5675o081J78770J18971j85896m4612p1081j78060J0861J42023O0545
15773b3875q7778Q5656n2830j3909J92070J65418j13846j26466p763m8247j14917
15762a46487j19818Q7687M3781J44598O2175n8414q9079j51935o1861N8298k29271
15751d60326Q930J52345J25861K61671P0483r752N901O3564J88455n2150j79045
15740A75937L6044P9222r8025j37383o9975N5198N4802j79348j77261J71199J33800
15729D4210K29163K29232j0288k52222L0221M2649j8711k18132r2968n5167q1001
$$ y = [123916, 114973, 222532, 145212, 165780, 154181, 174318, 107444, 92915, 82535, 231520, 245175, 42120, -30213, -16619, -41736, -152273, -158140, -178984, -142680, -3318, 37792, -13640, -49315, -55396, 123374, 242345, 56449, 11837, -59244, -237304, -226443, -84420, -23875, -111653, -25997, -78827, -92736, 99334, 264752, 150906, 24440, 16677, -31570, -146487, -266305, -178618, -134837, 9761, 71936, 13522, -75557, -227492, -289353, -231055, -460326, -451396, -299051, -173190, 88481, 158964, 149212, 155113, 218677, 407132, 354982, 175937, 211981, 291203, 193178, 55795, -14180, 41018, 95820, -83528, -260789, -89590, 44210, 273373, 502605, 492317, 240095, 270316, 312965, 294254, 76122, -16846, -72013, -153014]
15718a53014J23319r3699j25992k270O4090j70142p148K02726o4710p3500O2930
15707b37410j17764n0271l2537Q9555P070K53064J47485r22R6656q0391J09940
15696A84475J8060k6118q4100k9994j75178m8587P8407J70774j3524j33186K7038
15685c1933J21438J41737j00846n4926j04903J27362N7959P4705j46846j33781
15675e0034N1392R8790j41426J8440J9375L1506P6153q0973L5966j01920l3703
15664g6434j485l2596J39143K41745R2247j21960m419N5758k43328j97926N5690
15653i3565J68361J26297J77953p3862n021j20199j78879j5107r4415j98067J6252
15642b90252K30985O0476o9489j90650o4640M1774K2224K09928J38124K6200m6218
$$ y = [-153014, -29695, -123394, -249386, -251656, -187566, -357708, -364856, -162130, -226840, -300340, -237410, -355174, -405445, -437982, -348427, -341357, -88293, 59192, 58270, 154926, 74535, 184475, 202535, 176417, 92317, 62323, -112855, -161442, -83035, 87739, 74215, -58971, -31933, 89505, 231242, 130396, 75470, -29433, 97929, 155888, 230593, 83747, -50034, 1358, 100148, -41278, -22838, -3463, 28043, 104196, 23223, 59189, -42731, -76434, -77919, -110515, 28628, 270373, 362620, 240660, 236241, 291999, 48671, -149255, -93565, 74796, 201093, 379046, 305184, 300163, 179964, 1085, -14022, -108437, -306504, -290252, -59267, 1209, -68280, -258930, -323570, -281796, -259572, -49644, 88480, 114680, 68462]
15631F8462r5609k48351j0312R9923K11641R7815l8382l09047k9473k1457K1111
15620b53679j4975M3347r1929P5790J91930J63038Q9023J38707m5952l16901J7432
15609d169J1344j97495j58037L2651K37550l8030O6485k4073J31294j24994M9957
15598a7517N8491m4921j92810M0419n4917k8884P9264L3511j2976o6937j80718
15587c87995M2464J22468J51629j92009L9296J12835o0287O114J22093k5319M8024
15576b0687N0368o956p865l9656j0502l4504m825Q4824p6047j81048N6338R0998
15564i9562O6982p5627j14487l7514R4277K44102J83994q5996j19524N653k5901
15553C6397J96726J84672o3634k99874k42256J24195p2452J6461m0160p7783K5006
$$ y = [68462, -27147, -275498, -285810, -185887, 25754, 123569, 85187, -223860, -253333, -274790, -253679, -268654, -225307, -317236, -241446, -49516, 113522, 202545, 341252, 295300, -21601, -4169, 7175, -190320, -348357, -315706, -78156, -116186, -49701, -73774, 57520, -67474, -17517, 40974, -3947, -196757, -156338, -211255, -240139, -160875, -127364, -140340, -207277, -387995, -345531, -223063, -71434, -263443, -224147, -111312, -171599, -165485, -43392, -68711, -20687, 29681, 22725, 14860, -24796, -35298, -69802, -74627, 10197, -65850, -246898, -190560, -99562, -32580, -108207, -222694, -260208, -165931, 78171, 262165, 176169, 56645, 62298, 36397, 233123, 417795, 354161, 54287, -187969, -63774, -136226, -119765, -159925, -237708, -212702]
15542b12702J12256j28959l9689K16665N3310o0017J4840N2490j04680J17907
15532B1421k6366j04608l9250j66219R2230J99175P9436j29026J95160M9798l6046
15521A35705J5436J57397r4102k61543j62229O4680M8762j18060J33284J0257
15511g0413P3001M9989R8090o6068N1880J22577K5528J35927k1739j02443o8350
15500B27979p4820k5865m381j06486q4084l4151L390J24126R0499j16401N2910
15489E2716J48446r7540j47147n1044J06434J00465O4322r8971o9580J84922l1249
15478A61774o2431O6307j70541j02268m8604J805j48437P2786J31359q2840j98681
15467c79771Q2382K27489l8507k42721R5828j2969L19648J41872j13774k43114
$$ y = [-212702, -100446, -229405, -269094, -52429, 881, -59136, -44296, 8194, -96486, 21421, -4945, -109553, -148803, -315022, -222792, -23617, 55819, -73207, 121953, 171751, 135705, 151141, 308538, 214436, -47107, -209336, -144656, -95894, -213954, -80670, -70413, 2588, 52577, 150667, 84599, 136479, 259056, 284584, 420511, 398772, 296329, 227979, 153159, 127294, 122913, 16427, -67657, -101808, -98418, 25708, 116207, -194, 52716, 201162, 103622, -43525, -94569, 11865, 112330, 176652, 77681, 8101, 193023, 161774, 99343, 165650, -4891, -107159, -155763, -153958, -302395, -229609, -98250, -181090, -379771, -297389, -69900, -108407, -351128, -255300, -268269, 51379, 193251, 79477, -163637]
15457a63637j80837Q0129j05775J39917L6661p1852K16641J42538J12579M4964
15447B51328p9121Q75n3713j46848j536j04770j31342j3784K32797K38922j50920
15436D1888r0630l6543j11580N1408J72256J38372J79434J24340r9112j63158
15426B06675k5940M4190l5087j81926k03838J13457N5185j43653p8448J81548
15416f7837J52937K9173j31688j44352q1161k9371n7719K9201P6272m1932O663
15405b59814Q3632J72128l7945M988k2123k42009L9617Q7134q865o53m7644J77985
15393e3569L34007J5274j29440j2476j00645l743m8067l325J62344R1032J77205
15382D28597r1701l6919j02973p3580J14903k386j3610j85899l3035m5605K56047
$$ y = [-163637, -344474, -264345, -370120, -230203, -193542, -265394, -48753, 93785, 206364, 251328, 172207, 173082, 119369, -27479, -29015, -133785, -265127, -278911, -46114, 192808, 41888, -48742, -85285, -196865, -145457, 26799, 165171, 344605, 468945, 369833, 206675, 180735, 224925, 189838, 7912, -195926, -82469, -27284, -170937, -249385, -67837, 85100, 114273, -17415, -161767, -242928, -272299, -330018, -300817, -224545, -266477, -259814, -176182, -4054, -41999, -37011, -59134, -301143, -261526, -174392, -183257, -183910, -231554, -53569, 280438, 295712, 166272, 153796, 53151, 49408, 1341, -1984, 160360, 251392, 428597, 336896, 299977, 197004, 123424, 238327, 235941, 222331, 36432, 3397, -42208, 213839]
15371B13839n2225n3110k9053M3682r8505k8086M9684J6126M5744p3770K5774
15360F0100j51343k49112j66201J68559J75980m5493j25171j688r0683J25990
15350b99062N7650m6998K0028r1298J03321Q5520J30994J60823o368j03407p3605
15339f2402J7739N1370R4079J43832j13551n9918O5617r669K3660l1059k5554
15328I4144o8014J53903K3488j94777n1392K3422J3453l0387J7309N5442P5913
15317A12504Q586n9142j91924J58636Q8938M5407L7214n2290o2795K348J98506
15306B85988L9330O6694k9855o9030q3014l07900j47264N8957k0922R7652R8561
15295a0803l6318j02208J04900J43976M4676j32390j25358j03747J3025K03679
$$ y = [213839, 161614, 108504, 79451, 123133, 24628, -3458, 46226, 62352, 108096, 34326, 60100, -91243, -340355, -506556, -337997, -162017, -207510, -332681, -334369, -425052, -299062, -241412, -288410, -268382, -359680, -256359, -170839, -39845, 120978, 114610, 11203, -62402, -44663, 6707, 100786, 244618, 131067, 71149, 136766, 127097, 150757, 119698, 94144, 26130, 180033, 203521, 8744, -42648, -19226, -5773, -36160, -18851, 36591, 112504, 121090, 61948, -129976, 28660, 117598, 163005, 200219, 147929, 85134, 87482, 285988, 325318, 392012, 362157, 293127, 210113, -97787, -245051, -186094, -207016, -109364, -10803, -47121, -149329, -44429, 99547, 144223, 11833, -113525, -217272, -204247, -568]
15285e68K40057K8509j33408j23231N2563j48547J31874j806r2316J07238J67369
15274B27734Q1442m5934j14686j42975P7919N1360j00273M2058M5597p0748r3513
15263d2019J01684K29234j93421o0361J81002j42233J3991j11732q7315O7077
15253d4093O7569J88059K19865P6680j51449j28849j68740o0050j31415J43367
15243A0944j09567R8579J55589q6353r6200j65320P6568J36338j08121m6361k2122
15232a56026l2635m7776K69304J57491j94964j14497l1348r9406K4421R1505J25347
15221h584p696p896j7188L5971n1514j16758J7846o2000j0584j1848L7423J28110
15209g4718p7084J89724J09895j85166Q7198J34086l8533j3559k7503K6276K7938
$$ y = [-568, 239489, 267998, 134590, 11359, 63922, -84625, 47249, 45443, -46873, 60365, 227734, 309176, 263242, 148556, 5581, 83500, 134860, 34587, 76645, 122242, 51494, -42019, 59665, 288899, 95478, 35117, 216119, 73886, 87877, -23855, -111170, -44093, 23476, 211535, 431400, 508080, 356631, 227782, 59042, -1008, -132423, 10944, -98623, -44, 155545, 69192, -27008, -192328, -115760, 20578, -87543, -133904, -156026, -188661, -236437, 32867, 190358, -4606, -119103, -150451, -249857, -225436, -133931, -8584, -16280, -24176, -41364, -5393, -56907, -173665, -155819, -217819, -228403, -240251, -202828, -74718, -151802, 37922, 147817, -37349, 49849, 183935, 145402, 131843, 104340, 130616, 158554]
15198A58554p1503Q3771R9630j73734j61543j77048j49759O1917J32599J1206
15188a85910J09269j1642Q2314J01239M545J8888J17835K7155n092k04007j65907
15177a11313L04441K00604n4134j96574j88441m7412J58361K2135k5074r3568
15167c0975j06080k0977j05378M25L4528P1834N6510M8412k2617N0063M6252l6193
15155a4196P9914J4011K4117j14202m4423j09158O7752K42152R8364m1649l3062
15144A69620n0386m8462j14364L4575M9937j04531R3918J5409j02053j11324n6436
15133b24097J39610K7730J3705K38970J70906j17705q6028r1677J70267L9722
15123B81403J69075o5063m8857N5688j02542j49334Q6460J12474l4631k81573
$$ y = [158554, 87051, 170822, 270452, 96718, -64825, -241873, -391632, -329715, -197116, -185910, -76641, -88283, -5969, 95270, 99815, 118703, 236538, 263693, 258601, 54594, -111313, 193128, 393732, 339598, 143024, -45417, -92829, 65532, 87667, 62593, -30975, -137055, -158032, -263410, -262985, -228457, -156623, -100113, -51701, -74318, -24255, 21997, -14196, 65718, 79729, 103846, -10356, -54779, -163937, -96185, 145967, 244331, 202682, 169620, 119234, 70772, -43592, -9017, 40920, -63611, 30307, 45716, -56337, -167661, -224097, -84487, -56757, -43052, 195918, 366824, 249119, 163091, 71414, 241681, 281403, 450478, 385415, 336558, 392246, 289704, 140370, 226830, 339304, 304673, 23100]
15113B3100j40449l6900O1885k8681m2078q1277J20109N3632J6900j47538j22824
15102c24121O3753k2825N8344J92830q8641L6570n4080N2683P3328o2517R3680
15091A9004J34663o7547k03820l3791O7822n3840m9888N4132j00857l9888J53916
15080a20094K7540o3336P6792L8894n5119m3740j28181j66339K16818J88216o9583
15069i8132o6481K47658R5678J05765K9556J4176j43597n4078q7042j1460m5286
15058a3243j96020M436M4203J04667J62169J71849n8757q1801Q8884p707l38346
15047a19666q9455Q5089J47085J62907L0121k9659l3428p7016j8871j7036j50406
15036a10335J88855R2611n8549J1914J04678j73138o8866L2404J2507q4650L6898
$$ y = [23100, -117349, -154249, -92364, -121045, -163123, -244400, -124291, -70659, -53759, -201297, -324121, -260368, -283193, -224849, -32019, -120660, -84090, -138170, -85487, -12159, -74676, 19004, 153667, 86120, -117700, -151491, -83669, -137509, -187397, -133265, -234122, -274010, -120094, -92554, -155890, -79098, -40204, -95323, -139063, -267244, -433583, -216765, -28549, -98132, -164613, 83045, 178723, 284488, 314044, 328220, 184623, 130545, 43503, 32043, -13243, -209263, -204827, -160624, -55957, 106212, 278061, 219304, 137503, 226387, 218680, -119666, -209121, -124032, 23053, 185960, 216081, 186422, 152994, 75978, 57107, 40071, -110335, 78520, 171131, 112582, 124496, 229174, 56036, -12830, 19574, 32081, -52569, -15671]
15025a5671O5665j79614l9794J22520L0917N8518p3737M5806r0855j27043K50623
15014D7335N6400N1939J26240n04j25010J53959n0816k0533J13709J33228j8237
15003D67710j02952q2818k14262j67873M781Q6268R924P0013j11678k9477J65884
14992I5520j27748J93568J58559j13555j49563j09075j37730n6574L0671K51920
14982C5993k8621P3808P2018p4570J52801K1486l31394p8286J90029J57370m4032
14971A46602P608q0322N8960L1705p8073M6163j22295m8967J83440J65546j89021
14960A21346j5956p9503N164p7711J0604J32928J17667j4776j6395j20542K6533
14949H9359l5397j16021j44323M5111J32744J3618j83087l9374O0715M6074Q6375
$$ y = [-15671, 49994, -129620, -169414, -46894, -15977, 42541, -31196, 14610, -76245, -203288, 47335, 103735, 155674, 281914, 281410, 156400, 310359, 259543, 239010, 352719, 485947, 467710, 364758, 281940, 67678, -100195, -95414, -9146, 778, 70791, -40887, -70364, 95520, -32228, 161340, 319899, 206344, 56781, -52294, -190024, -246598, -215927, 35993, 7372, 81180, 153198, 78628, 231429, 252915, -78479, -156765, 33264, 190634, 146602, 154210, 73888, 132848, 164553, 86480, 132643, 10348, -38619, 144821, 310367, 121346, 105390, 25887, 31051, -46660, -36056, 96872, 214539, 199763, 183368, 62826, 89359, 53962, -62059, -206382, -161271, -28527, -14909, -197996, -237370, -176655, -130581, -44206]
14938d4206K35718j16380k18099J25707O5258r0021j12261K7j32127j32549J08841
14927c10092N5376J34733n2418l3961n7194o3445P1430Q6440K2161m8433J4929
14916a80474j14977J12473J63287K8028J04664k0851l1959o4757k3314m099M4912
14905A2933m2974j65739M9476l8149j36051o3974M0606N8574O3818k2514j32803
14894c76797q226L32645K98912P2005j54533k44838n5885K7700P8128j12383j46873
14883b90145J75333K00428q584J28924n114n2860l4769l0732j64909k22154q0201
14872c84783l3742K12911K14838j01489j36439n1941M3589Q1081j66478J93788
14862a28665K14986J76302Q1703k31784q5699J6920j63980n0512J49055O4636
$$ y = [-44206, 191512, 75132, -142967, -17260, 47998, -42023, -154284, -154257, -286384, -418933, -310092, -254716, -119983, -172401, -206362, -263556, -327001, -255571, -169131, -146970, -195403, -180474, -295451, -182978, -19691, 8337, 113001, 92150, 60191, -4566, -27880, -31979, 12933, -30041, -195780, -146304, -184453, -320504, -384478, -343872, -285298, -221480, -243994, -376797, -385023, -52378, 246534, 318539, 164006, -80832, -136717, -109017, -30889, -143272, -290145, -114812, 85616, 77032, 205956, 200842, 147982, 113213, 82481, -82428, -304582, -384783, -418525, -205614, 9224, -92265, -228704, -280645, -237056, -155975, -322453, -128665, 86321, 262623, 344326, 112542, 26843, 43763, -120217, -170729, -21674, 42962]
14852D2962q954q09m5110N4066R8282O1334J61179j9711j65301j12543o046j62585
14840a03236r7375Q9618J21828O3382m3029o9613o5276J6196O8564L9972N1911
14829G2942j57953N909p2210r2505n2430P7016J58311O6077j51869j05663J10245
14818a42130R1621N4525j28289K0887r0378J11708K81740L0182r2953q3075M7555
14807A01393k6697j34642K1383J01430R3950o7275k19350n2528k7640M0785J67800
14796a391Q3481K41451k04905q1595m6699r8704K2429k28946q7743L0308J49314
14785b23000K1522m451K46575J96004j08398j22166j65074n4006L7709j02639
14775b77924p223O8777j7149j19457R7832P1340J3157P7810j35872l0224K32828
$$ y = [42962, 34008, 33199, -11911, 42155, 140437, 201771, 362950, 343239, 177938, 65395, 59349, -103236, -200611, -110993, 10835, 74217, 31188, -38425, -103701, -87505, -18941, 21031, 72942, -85011, -79102, -151312, -243817, -296247, -219231, -60920, 5157, -146712, -252375, -142130, -50509, 4016, -124273, -103386, -193764, -82056, 199684, 229866, 136913, 53838, 101393, 74696, -59946, -38563, 62867, 156817, 89542, -129808, -182336, -209976, -169191, -1391, 82090, 323541, 118636, 37041, -9658, -108362, -85933, -314879, -402622, -372314, -223000, -201478, -205929, 40646, 236650, 128252, 6086, -158988, -212994, -175285, -277924, -285147, -216370, -233519, -352976, -255144, -183804, -170647, -92837, -228709, -258933, -26105]
14764b6105J6112J1450j70684q1246l4381n1471p2557k502J3546K68544J90497
14753F1203M4592M094j50335q793q880K34150q8579j04807K3311N3780P1373j16970
14741A4139l2138M5754j4995m356N6064k38911k73457k55822J23469J72389K55875
14730a51989K2487K29749J07547o4195k28936J8947P3694J23110j1180k0143R938
14719A09029J3589j43077J695K40024J20607r4893j15733m9134k0861O0990r7393
14708B4843j29087L3570J94801m0052j23086q7739J70232P2646q1924J08151P4168
14697B16523J02233j75876q2067l9444j13132N2067L6242O457j52236n5797J21283
14686h3747L6077q3455J88408J50366j10885j34965j1681q3015P4093J45685R8817
$$ y = [-26105, -9993, 1457, -169227, -250473, -284854, -336325, -408882, -411384, -397838, -129294, 61203, 105795, 109889, -40446, -49239, -58119, 176031, 87452, -17355, 5956, 59736, 131109, 14139, -17999, 27755, 12760, 8404, 64468, -174443, -447900, -703722, -580253, -407864, -151989, -129502, 100247, 207794, 143599, -85337, -66390, 7304, 130414, 119234, 99091, 109029, 122618, -20459, -18764, 221260, 341867, 246974, 131241, 82107, 61246, 122236, 24843, -104244, -70674, 124127, 84075, -39011, -126750, 43482, 116128, 34204, 142355, 216523, 318756, 142880, 60813, 21369, -91763, -39696, -3454, 3003, -149233, -205030, -83747, -47670, -131125, 57283, 207649, 96764, -38201, -49882, -132897, -58804, 86881, 185698]
14675A85698n7829p9200M4811j08303l6461j10129J08736J1031j32305R6346N6625
14664b0980J00876j12345m6581J99836j7371Q7834n2072j77732o9695J25364j0905
14653F229J41505j81660l6680J11526O9568J97850n6945j66798j04261m1963L6630
14642b4999L1217l9417L728M553j2688K7032l3585P2489J17170J17386J19911
14631C82797J46778p4864k55194j53274J07444n3311o2212p2020M825K0561m4463
14620e2933K85661J70285j39925k31828j66565l7613Q4097K2370R1683J78432
14610B03664m2585j43869p6037P4385J87213J51585m5067j94176R0128L8375J24688
14599C68304j50788l13930n5601J19362O234N442m7096K3152O5525R7453k15538
$$ y = [185698, 127869, 48669, 93480, -14823, -51284, -161413, -52677, -41646, -173951, -77605, -20980, 79896, -32449, -79030, 120806, 103435, 191269, 139197, -38535, -108230, 17134, 6229, 147734, -33926, -70606, 40920, 110488, 308338, 251393, 84595, -19666, -61629, -24999, 6218, -33199, -29471, -24918, -37606, -10574, -44159, 28330, 145500, 262886, 382797, 529575, 454711, 199517, 46243, 153687, 100376, 38164, -33856, -29031, -8470, -52933, 232728, 403013, 263088, 31260, -135305, -172918, -88821, -66451, 25232, 203664, 161079, 17210, -58827, 15558, 202771, 354356, 309289, 115113, 205241, 243616, 368304, 217516, -96414, -152015, -32653, -26419, -20977, -68073, -44921, 20604, 118057, -97481]
14588i7481k63722j34145J06474K40030l6844j8512p8766r0687l6985K86057J07469
14577a7112j75425j46042R7152N9954k8620N7116J92644J04181O8471r9064o5716
14566D7539r929P8586J09504o9026n2186J18701k8608j22217p3262o192P2610
14555F5520j67089n1776J6228K81365J93328L9026l8016o0494P56k03184k38989
14544a63325l3513o0474l5330J11762j8182J2504P4142J14626K16428O9180N7382
14533C45200q5191j49475j51172j06444p6168M6520k5019Q2343J3426L6893O9246
14522A59J20195O7299j34503j67028J97406Q4792j94513m8958k5319O7631J13410
14511H0571m3094L8848j55987j65655j43856j65103K11844N4888p1635J61952
$$ y = [-97481, -361203, -495348, -388874, -148844, -185688, -204200, -282966, -373653, -410638, -124581, -17112, -192537, -338579, -241427, -181473, -210093, -152977, 39667, 143848, 212319, 113255, 47539, 37610, 116196, 225700, 156674, 104488, 223189, 194581, 72364, -898, -7090, 65520, -101569, -153345, -137117, 144248, 337576, 376602, 338586, 278092, 278848, 75664, -163325, -196838, -257312, -292642, -180880, -199062, -186558, -112416, 2210, 218638, 287818, 345200, 260009, 110534, -40638, -147082, -223250, -176730, -201749, -119406, -105980, -69087, 159, 120354, 187653, 53150, -113878, 83528, 168320, -26193, -75151, -100470, -32839, 80571, 37477, 76325, -79662, -245317, -389173, -554276, -342432, -287544, -359179, -197227]
14501a97227o8727l4587K44611Q1862p1738J459j13400o0801k33385r146J7362
14490d43717K23475J91175K12944J07379K2872O7279M507q5671j43661j43467
14480A3115j36974k40150j48004J65348K19244k8165P8349J2816m0954Q4891O3663
14469D3179K05030n8221j74231o1990p0821L221J31520J6782O6295l502K7894
14458A25156N2763K6287j94726j63084k4113k9569P8472L1837K2328k6084p8741
14447a79474N8445O0976J83816P7535j2854m1541j00953q7497P1531j35317O4255
14436d1078K41085O079q8460J822j58211j28430J5468O9341J6840j70738j21873
14425c58155p5758q1846j10646K57338J42318P1657j4526q8927J22895m8874N655
$$ y = [-197227, -265954, -300541, -55930, 25932, -45806, -44347, -157747, -218548, -451933, -461079, -443717, -220242, -29067, 183877, 291256, 314128, 381407, 385914, 300243, 156582, 13115, -123859, -364009, -512013, -346665, -127421, -155586, -77237, -64421, -105375, -20484, 43179, 248209, 189988, 15757, -46233, -117054, -113833, 17687, 34469, 100764, 97262, 125156, 177919, 204206, 9480, -153604, -177717, -207286, -128814, -96977, -74649, -100733, -179474, -121029, -60053, 123763, 201298, 188444, 146903, 45950, -41547, 29984, -105333, -41078, 200007, 206086, 117626, 119448, -38763, -167193, -151725, -82384, -65544, -236282, -358155, -433913, -515759, -626405, -369067, -226749, -155092, -169618, -258545, -135650, -184524, -178869]
14414a78869J28277q2004n0385k7237j79996Q8306K06434K21050K4214o6201j20233
14403c6644n5026k9031p9124j60853O4548J28700J59770J26723O9522j58695k12753
14392a82863P3565o8720j29022Q4529J91148J31805r9712p3248J36273M6001k1655
14381H8101J39042J64331K1965k03945k40321N0995L1848L118R3342l1125j00087
14370A7264l3265o5598n9220p4120l3000j11238M5272J80389O2592K1498Q5122
14359C5696J53769r0703J59413J57163l5576k87400j06013k078n2729k9461l1559
14348a29478K9061N3410J32567n3845j11019j9801j92574Q4235J13256O4413J47043
14337A17268P1142j02080k28504K3142J98446N7589j65682J98486J54846J9795
$$ y = [-178869, -50592, -132596, -182981, -210218, -390214, -301908, -95474, 125576, 149790, 83589, -36644, -91670, -120701, -199825, -360678, -296130, -167430, -7660, 119063, 188585, 29890, -182863, -109298, -178018, -307040, -222511, -31363, 100442, 730, -72518, 63755, 109756, 88101, 227143, 391474, 413439, 209494, -30827, 20168, 52016, 55134, 148476, 117351, 17264, -16001, -81599, -140819, -214939, -247939, -359177, -313905, -133516, -70924, -49426, 35696, 189465, 98762, 258175, 415338, 379762, 92362, -13651, -15729, -68458, -97919, -129478, -100417, -47007, 85560, 31715, -79304, -99105, -291679, -207444, -94188, -29775, 117268, 188410, 86330, -142174, -119032, 79414, 137003, -28679, 169807, 324653, 344448]
14327C44448l0606j14617k18969o6893k2277K9005R6888J605j26199j6348K85988
14316A62025j17495j25697j99066k01218R5235J58222P8926P933o3552J79027
14306b5660J46461m354K47849O419j37661J01085J09102M0523j74938k31389l5784
14295D1653R7773Q1955l31964j33144J2735K12886O240p8802P4410k3075j24676
14284a64009K3835J09392m7413j57656J17486J49826l7778j10421l8453M0276
14274a14915K22829q5384j9174m0983O3499J97674J6756l4213j12952j572q8724
14263B841j00935J30979J58783r4262j91002K283J72741O6064K1908K0299p1083
14252A18616o8664M5442J18269O2772l6177m1666m7625k8365j62306j93J75774
$$ y = [344448, 313842, 199225, -19744, -86637, -108914, -79909, 16979, 18584, -107615, -123963, 162025, 44530, -81167, -280233, -481451, -386216, -227994, -149068, -141135, -204687, -25660, 120801, 116447, 364296, 370715, 233054, 334139, 443241, 483764, 308826, 77437, 41653, 139426, 221381, -110583, -243727, -230992, -18106, -11866, -90668, -16258, -39333, -164009, -140174, -30782, -78195, -235851, -118365, 31461, -6317, -116738, -155191, -114915, 107914, 22530, 3356, -37627, 25872, 223546, 240302, 206089, 93137, 91565, 2841, -98094, 32885, 191668, 97406, -93596, -91313, 81428, 147492, 169400, 189699, 118616, 49952, 95394, 213663, 276435, 240258, 198592, 150967, 122602, -39704, -39897, 135877]
14241A35877j65824j74784k29832p0941L35375j1602L1217J13716J52623J32166
14231B47991p0768L7060M1602k8980O0419j07194j66256j93310l1556J4933K46935
14220E0876K37295o2853j32556l1009j5302k9719k8630k456J6557M7669P4419
14209A24291K18195K097o0785K9060n4377k12218k15150J99720L52263L0525j26023
14198B87598K844J6230m1687j52699j23289r211J8762m9732l3542L4707p1607
14187a21626r6398l1449m1415m110K59515L04166j0636o9419j08988j06124p4977
14176a01461k3783j2524j64013Q851K37554L7441n5250n028r4374j2227p1992
14165b56806K51818J11729J53178p9671k73698R7044Q6939Q9465j81735j39990
$$ y = [135877, -29947, -204731, -434563, -505504, -170129, -181731, -150514, -36798, 115825, 247991, 177223, 214283, 255885, 226905, 287324, 180130, 13874, -179436, -210992, -196059, 50876, 288171, 225318, 92762, 61753, 46451, 16732, -11898, -14354, 2203, 49872, 124291, 342486, 344583, 283798, 312858, 258481, 46263, -168887, 30833, 383096, 413621, 287598, 290442, 306672, 264985, 112286, -11003, -20214, -1452, -51184, -84726, -50019, -121626, -218024, -249473, -290888, -294998, -35483, 268683, 258047, 188628, 79640, -26484, -101461, -125244, -137768, -301781, -292930, -55376, -17935, -73185, -78213, -172587, -184814, -256806, -4988, 106741, 259919, 180248, -93450, 3594, 90533, 179998, -1737, -141727]
14155a41727q0035L7017J58308L00900O8714k1304m9447m7932k91632j81745K547
14144b46336O231L85317J32078O8003j16840n0046o8851N3722M9582J52224q1036
14133B84048k85833o6130O5410m1766M9632J42653J25769J21166k40394j86071
14123c1516j35907j04369J71243O4146L4362l4625J09473p6410K4341M295n7671
14112c2638K226k87J5035j63118j06222J12721J0625j11888n5241J61434J08576
14101e8777O7800r7435Q2297M2280K6540J92315n9761m2203J77746k208r8371
14090B30223j05460k43940l6612j1715k3853n0690P9430J39421n412J48065J2003
14079A31460j47785K7924J96521M3318l21846p8269K67525J11094m0482j48245
$$ y = [-141727, -221762, -184745, -26437, 274463, 343177, 321873, 272426, 224494, -67138, -248883, -246336, -240105, 145212, 277290, 345293, 228453, 178407, 109556, 163278, 212860, 365084, 284048, -1785, -67915, -2505, -44271, 5361, 148014, 273783, 394949, 154555, -31516, -167423, -271792, -100549, -36403, -2041, -36666, 72807, -3603, 20738, 25033, -32638, -30412, -30699, -15664, -178782, -285004, -172283, -161658, -273546, -328787, -167353, -58777, 9023, -88412, -6115, 36165, 62705, 255020, 195259, 153056, 330802, 328594, 230223, 124763, -119177, -155789, -167504, -191357, -242047, -162617, -23196, -28608, 119457, 131460, -16325, 11599, 208120, 251438, -70408, -148677, 118848, 229942, 189460, 41215]
14069D1215N5424J31293R2365j95003j49770m9561j79511K13408K57223p8824
14059A38259k75586j8685p5060L87K16347J46690j17451p9426o5208P8786J72001
14048A21054M0844r2416n1165o8543k1098l1351J58825p3282j0004M8596r2960
14037g1500O6202l3452m2032l2002L6749k1515O5197j5103j61504J9264l1421
14026b21117o1948n4496J10796K76861J27066j29725q3196j33746j29005M2491
14016b56019Q8058N964J9592p8353m88J7045J93453J65090q1026J5586l5882N4534
14004A07554n8041N613k5292m7043J4923j25427O6845P7771r5465q327K5187k16993
13992b78695M3835J63903j4617k20238N7848P7845K92563J01670p7726j88091
$$ y = [41215, 96639, 227932, 320297, 125294, -24476, -74037, -253548, -40140, 217083, 138259, -137327, -156012, -231072, -230685, -14338, 132352, 14901, -64525, -129733, -50947, 121054, 161898, 69482, 18317, -50226, -71324, -102675, 56150, -17132, -27136, 21460, -71500, -5298, -38750, -80782, -112784, -76035, -97550, -32353, -47456, -208960, -189696, -221117, -283065, -337561, -226765, 50096, 177162, 47437, -35759, -169505, -298510, -256019, -167961, -161997, -142405, -220758, -221246, -204201, -10748, 154342, 73316, 88902, 53020, 107554, 49513, 55126, 29834, -17209, -2286, -127713, -60868, 16903, -78562, -86889, -61702, -278695, -234860, -70957, -85574, -305812, -247964, -170119, 122444, 224114, 146388, -41703]
13982d1703j95471K01168M6821l2113q4087O8485J17303o3037j53345L6574l585
13971a02990L2796j09378J46416K18485j67985q1782k6827j4503K2118o5172J63002
13960A4180J35979j05837r946K60264J88845N4453j47047j05074j37202q6494
13950F2121J27494j8546k2442J66193j58104j93935l693P3980N0015N5532J9733
13939A58348p1627k15868L5817J01430J11578M5571j29942q9772j3105J43715
13929G6145N2420J60171l2669o1456j56596m3592P4079P8703j5744n8962J61323
13918B33822j95772k54122q8010R7578J0219r9986K1112J85457M7058M728j7109
13907e5025j13217j07024j14K9624j22398k13637L7800K00642M2511J73413J23768
$$ y = [-41703, -237174, -36006, 10815, -21298, -105385, -36900, 80403, 17366, -135979, -99405, -102990, -70194, -179572, -33156, 185329, 17344, -64438, -91265, -105768, -83650, -148822, 14180, 150159, 44322, 34376, 294640, 483485, 537938, 390891, 285817, 148615, 62121, 189615, 171069, 148627, 314820, 156716, -37219, -40912, 33068, 83083, 138615, 158348, 86721, -129147, -93330, 8100, 119678, 165249, 35307, -54465, -67570, 76145, 128565, 288736, 256067, 194611, 38015, -5577, 68502, 147205, 131461, 72499, 233822, 38050, -216072, -304082, -206504, -196285, -296271, -275159, -89702, -42644, -37916, -55025, -168242, -275266, -275380, -245756, -368154, -581791, -543991, -343349, -300838, -127425, -3657]
13896c657N4890R6912J36233k2810q8760k9858O0710j31283k22546N3199p2918
13885a69888J33621m8087M5979J48861J18060j91276j75694j43058j95238J45770
13875c30950N7522K1342j42229J03827Q5095q8787N7383o0702J12952J64385J39845
13864A19683j32404J2788j48198L1424K24599j06213k21298K49906J73687l5417
13854A68557L311k527n8649K0460J3875j03263j22490j718R1304J12210P1983
13843A93053L4706j64423j44197j4349J48544j20904j35607J17262J38723l8304
13833A4504K6546K14799l8570j06165j73909R9386q6620j00325j4047Q9422j52180
13822b27159j22803o4832K2655J88936J26904J02870p6325p9874K2388o5923K4977
$$ y = [-3657, 51233, 148145, 284378, 261568, 172808, 142950, 203660, 72377, -150169, -96970, -169888, -36267, -84354, -38375, 110486, 228546, 37270, -138424, -281482, -476720, -330950, -273428, -252086, -394315, -290488, -205393, -294180, -236797, -297499, -184547, -20162, 119683, -12721, 67, -148131, -116707, 107892, 1679, -219619, 30287, 203974, 168557, 171868, 169341, 110692, 131152, 145027, 41764, -80726, -82444, 8860, 121070, 193053, 227759, 63336, -80861, -95210, 53334, -67570, -203177, -85915, 52808, 14504, 41050, 255849, 217279, 111114, -62795, 36591, -50029, -150354, -164401, -74979, -227159, -349962, -414794, -392139, -203203, -76299, 26571, -49754, -129628, -107240, -173163, -148186]
13811a48186J6055O9252q1684j58152k3819J90598k6121P2959M2823n871O160
13800d5986K5505k984R5084k10695r8060P4527J81195L9281K7714Q2117l2391
13789A35307p9767J6272o3252J67098L9923M6871j99895p982J41290k03847k6323
13778c4305J71796J0390J3072k0359r7742M8250O3174n3334N1539l668k16608
13767f7795j93323p3954Q7186O2068K9938J09826J60585l6629j2837J58132q0561
13756A42636j11845J9334R396j36234P2765K4636j49378J5827J02270L8223r2698
13745f5068k69607N2275J76623J36622Q4240o0319j42110m5387J4606N8559k7879
13734h7445J67648m2096j34695N6282L3394Q2882k08035L4328J33429j04328j54861
$$ y = [-148186, -132131, -62879, -144563, -302715, -326534, -135936, -162057, -89098, -46275, -52146, -45986, -20481, -23465, 71619, -139076, -237136, -162609, 18586, 57867, 85581, 167698, 135307, 55540, 71812, 8560, 175658, 215581, 262452, 62557, 54575, 195865, -7982, -34305, 137491, 147881, 160953, 140594, 42852, 91102, 154276, 100942, 152481, 148813, -67795, -261118, -335072, -247886, -185818, -155880, -46054, 114531, 77902, 65065, 223197, 142636, 30791, 50125, 59521, -76713, -3948, 20688, -128690, -112863, -10593, 27630, -65068, -334675, -282400, -105777, 30845, 115085, 54766, -87344, -132731, -118125, -59566, -87445, 80203, 38107, -96588, -40306, -6912, 75970, -132065, -97737, 35692, -68636, -223497]
13723b23497M4949j21943J38723M7610K14856J19907j62905k03040j65902L1261
13713b79981L5978j35117K1425R163J38919K18759o9765q9096P0147J36578L7954
13702I4964N6535r0109l53j3524q0336Q6753J52796n2198k34020q7121l2589K8789
13690a70413j65946M9075L12305o4696r882m1181M4286J22789J3486j00586j2313
13679b3076L06437j84618r547N1491K06987N1048j47297j54700q4783Q3965L9683
13668A35590j49429Q0393o8416J277P4594l1082p341o1465j60118L6537j4363
13657a63823k8670K7327o5710j33828J86598M2155j33821N7219K15047J9056N6413
13646G7963Q1073j27727j94224O9098j09689K11926J65057q5182r7267O2559L5326
$$ y = [-223497, -178548, -300491, -161768, -114158, 100698, 220605, 57700, -145340, -311242, -279981, -244003, -379120, -357695, -348532, -209613, 9146, -60619, -149715, -79568, 57010, 94964, 151499, 61390, 61037, 47513, -32823, 53930, 206726, 154528, -79492, -166613, -199202, -170413, -336359, -287284, 25021, -39675, -49557, -90738, -46452, 76337, 89823, -10763, -23076, 283361, 98743, 89196, 140687, 347674, 398722, 251425, 96725, 11942, 95907, 135590, -13839, 66554, -1862, -585, 74009, 42927, 35586, -25879, -185997, -149460, -163823, -192493, -165166, -230876, -364704, -178106, -135951, -269772, -212553, 2494, 21550, 77963, 159036, 31309, -162915, -93817, -203506, 8420, 173477, 88295, -8972, 53587, 88913]
13635H8913j58445q9110O4696Q7592J5903j28286P4312l21L9432k6380J2696r2825
13623a11823p9673J11358Q4544J67361J18187k10986l679N9776j22626M0120r1290
13612c8731j68570N2347j13437O8701P5645j26303n0207K05898J34491P6766k0634
13601I5966j74188N2342P9429M575K30961O4126j45924j02347L423j89966J24745
13590D3142M773O0454K06932q9472p7900j01243M0511j44623k94319j81284R7165
13579d35864J03288N0131J83312J13119N1686L3058j25021o1123p317M1104j7094
13568g0721j1293J0233J25281N4008J67915m6833k8480o6603r2331O559j3049
13557C4686J29009O7584J4356j16904j62487k93067L6156j72749Q980J03119m483
$$ y = [88913, -69532, -158642, -93946, -6354, 9549, -118737, -44425, -44746, -5314, -31694, -18998, -111823, -191496, -80138, 4406, 171767, 289954, 78968, 75289, 135065, 12439, 52559, -38731, -207301, -154954, -268391, -199690, -124045, -250348, -300555, -94657, 39834, 116600, 95966, -78222, -25880, 53549, 58124, 289085, 353211, 207287, 104940, 108363, -81603, 43142, 47915, 108369, 315301, 225829, 147929, 46686, 87197, -57426, -351745, -533029, -435864, -332576, -282445, -99133, 13986, 65672, 98730, -26291, -87414, -94731, -53627, -70721, -82014, -71781, 53500, 107508, 275423, 228590, 200110, 133507, 41176, 47735, 34686, 163695, 231279, 245635, 128731, -33756, -326823, -290667, -463416, -454436, -351317, -355800]
13546c55800J50272J0052J49563K8011n2255Q7854m8263k7492k7376N1028K990
13535c1416R8536J22765j0883K1467J6725j23957p8099l0249q8161R5513J09585
13524A01826j48165J7274J57772j33514n1226R4558Q6459k36144j02982p2258
13514b86400L7400n042j99820J76570J9428k6907R7595n9047K0319J37934j55410
13503b43380Q3074j61404k8783J34888J67713J53527k38598k06090J34044o3644
13493b68653J49772K8265j47455O0992J55304p912R1848j72232r2554k2214J02362
13482a22477J81012J98493J14044k2j09491l4893k6097L1959K4010l7295j49162
13471G0081j77786l8343p8012j35352p6433Q2551K9850L04877J39342O9612r3677
$$ y = [-355800, -205528, -195476, -45913, -17902, -70157, 17697, -30566, -58058, -85434, -34406, -31416, 67120, 189885, 179002, 200469, 217194, 93237, 15138, -15111, -103272, -7759, 101826, -46339, -29065, 128707, -4807, -56033, 38525, 124984, -111160, -214142, -286400, -249000, -254042, -453862, -277292, -257864, -284771, -187176, -246223, -225904, -87970, -243380, -160306, -321710, -350493, -215605, -47892, 105635, -132963, -339053, -205009, -268653, -118881, -90616, -238071, -177079, -21775, -29687, 62161, -110071, -202625, -224839, -122477, 58535, 257028, 371072, 371050, 261559, 226666, 200569, 232528, 256538, 219243, 70081, -107705, -146048, -224060, -359412, -435845, -353294, -323444, -18567, 120775, 190387, 96710]
13460I6710k27303J09682M63r8505L0726j4179R459l0852n5202n6766m1891Q497
13448b69161P6717J52722R6027K1535J51420j04890k91428r9183K41096k4855
13438e0000K6175N5209K0359R6106j77652p0736K825J62904M278j23100L8327
13427a5305J12081j89926j88064J22015J58408r3662j53461P7852K4618j37552
13417b82996M9542j50658P2042Q3289j38150L8610O8060K40429J60591k2990L8479
13406A56248M8763j94191r9060k8161p8142j24092n1833Q4133R8158J23744J07097
13395D2664J41678m2318o6055q685p8854j9043J3512j38717p5072J65760j70358
13384b35488k05130J17987P8580j163M0248N0634J089J63754K08480M5152l6389
$$ y = [96710, -130593, -20911, -20448, -118953, -88227, -102406, -92947, -123799, -179001, -235767, -277658, -269161, -192444, -39722, 56305, 77840, 229260, 124370, -167058, -266241, -25145, -50000, -23825, 31384, 51743, 147849, -29803, -100539, -97714, 65190, 69468, -53632, -15305, 96776, -93150, -281214, -159199, -791, -94453, -247914, -170062, -145444, -282996, -233454, -384112, -312070, -228781, -366931, -328321, -260261, -19832, 140759, 117769, 156248, 205011, 10820, -88240, -116401, -194543, -318635, -370468, -286335, -188177, -64433, 42664, 184342, 142024, 75969, 67284, -11570, -30613, -17101, -155818, -230890, -65130, -235488, -440618, -322631, -244051, -245214, -204966, -154332, -153243, 10511, 218991, 264143, 227754]
13373B27754k01215L9119M3747K5874l6571n6303j14941o869n4077K11169J18554
13362A96241N7606K2986R8640o7498j24348J14368M6826j81756r8001j01209j02128
13351a38273l0385J32429L64753r0374k09092j75921j5944J88687J07930o3732
13341G0078k39598j32228R2524L9841Q3790J0938J6456P3473l1837O4217r2153
13330d4499k504N491j54652P6376K6291R7513J32532o553J16007j6470j70488
13319E9044j46219j28574j36388J34286J00090R215O2411K7534L0188L4746n2530
13308f197J27762J95464N5798j60912j05636q0559M4157m3174K00J53430j03897
13297G6436q3980P2668J74477K1593n8994j54J5799j44276K9757K2763J30540
$$ y = [227754, 26539, 65658, 109405, 135279, 98708, 42405, -72536, -79405, -133482, 77687, 196241, 253847, 276833, 375473, 307975, 183627, 297995, 344821, 163065, 65064, -36145, -138273, -168658, -36229, 328524, 238150, 29058, -146863, -162807, 25880, 133810, 70078, -169520, -301748, -209224, -169383, -85593, -74655, -58199, 15274, -16563, 47654, -44499, -47003, -41512, -196164, -119788, -93497, 4016, 136548, 129995, 246002, 229532, 59044, -87175, -215749, -352137, -217851, -117761, -108546, -46135, -18601, 11587, 46333, -6197, 121565, 317029, 372827, 211915, 106279, 25720, 69877, 26703, 26903, 180333, 76436, -7544, 65124, 239601, 261194, 202200, 202046, 217845, 73569, 103326, 126089, 256629]
13286B56629j33546n9348o9841n4275J37307j02349j12484J92782j50164j01840
13276a97129J86350k3788r4016N4815j19981o2821J03010r0088r6236Q0562J34475
13265a24847O8844J05499J90202j44883q0570J7870o6850j33029j6906J16749
13255f7921K44325J50662l9144p4731r3659K8814K1051k3706O2869n6760j01289
13244E0511J07917j27483n4137p9050N5196O0776p6502k1051O8898K8508k0045
13233f462j01857N9999J3092k95646j27397M5616l560P755J33192K98549r7846
13222g4565j01643O7805j96910p9200R0593m1222J53176J09333M4083K06038j55692
13211B1796j79516P4383j23314j31737K05569J53164m738O0915K162o1588k88751
$$ y = [256629, 123083, 63735, -6106, -60381, 76926, -25423, -137907, 54875, -95289, -197129, -10779, -34567, -128583, -73768, -193749, -256570, -153560, -243648, -339884, -259322, -124847, -56003, 49496, 239698, 94815, 14245, 32115, -34735, -167764, -184670, -67921, 176404, 327066, 287922, 213191, 119532, 148346, 169397, 145691, 208560, 151800, 50511, 158428, 30945, -23192, -102242, -47046, 13730, -62772, -83823, -14925, 13583, -6462, -108319, -48320, -35228, -330874, -458271, -412655, -416215, -408460, -275268, 23281, -74565, -176208, -108403, -305313, -384513, -293920, -335142, -181966, -72633, -28550, 177488, 21796, -157720, -83337, -206651, -338388, -132819, 20345, 15607, 76522, 78684, 17096, -271655]
13200b71655k12842M3036J85088J56116r5575j0366J35905J9945J00064n3129
13190c413q2447J25980J69441J63567J91833j17040r7885Q28m7096k1019L3211
13179C15960J81653J03184q1454j22685l9308p8862j04009r3049J0470P0895J10113
13168B72908J46037j71056q6083J94485J33876r7592j12111r9062j39177j81162
13158a38937j07359o5459l2028K10587J97791J02911L7283K3628o3593j10726
13148E4098j64915q8311J42367P5032L6934j0604q3357J66560N870m5561m7062
13137D1051p8801r3128j72821l5134n1193j31372J95562L17290J45506J16883
13127B53843n9436j15672J37185O6295j67326j62726j2749j2468j16488J84973
$$ y = [-271655, -484497, -441461, -256373, -100257, -195832, -206198, -70293, -50348, 49716, -3413, -85860, 40120, 209561, 373128, 564961, 447921, 350036, 350864, 303768, 282749, 315960, 497613, 600797, 519343, 396658, 357350, 278488, 174479, 81430, 91900, 162795, 272908, 418945, 247889, 161806, 356291, 490167, 392575, 280464, 181402, 42225, -138937, -246296, -311755, -343783, -133196, 64595, 167506, 204789, 228417, 164824, 54098, -110817, -199128, -56761, 18271, 55205, 44601, -38756, 127804, 133674, 88113, 41051, -37750, -130878, -303699, -338833, -390026, -521398, -325836, -8546, 136960, 253843, 194407, 78735, 215920, 282215, 114889, -47837, -60586, -73054, -189542, -4569]
13117d569k2102p0717P4318N2852L9896L6485n8347Q4102L3075K02707L6791r5416
13105C09075j37945P5473p8319j87846J04608o1309j6033M193K3846j36691k6087
13094a27035j54418m1014j5939P417J53474J7833K8836k5667R5213J23351o7751
13083e700p867j5421j8841k7981r5844J65361R9841K6715p0700K8115m1564J05069
13071A41183J90378p850k6099j18123J1493J5929j49290j31828P0640L4289j52505
13060a21783M3359J03440M5115m7223l8261O7614j63852o3598l2349J8111R5790
13049i3637n9165K1424o6397j5874K48593K86178J47184k70138k68460J05603
13039C5311N5406j82679n4351L6040K17165J0273M7950R6044j52765j99007j04796
$$ y = [-4569, -26671, -97388, -23070, 29782, 69678, 106163, 47816, 131918, 164993, 367700, 404491, 309075, 171130, 246603, 168284, -19562, 85046, 23737, 7704, 11897, 35743, -100948, -127035, -281453, -322467, -338406, -330989, -177515, -159682, -130846, -156513, -61300, 62051, -5700, -13567, -28988, -47829, -75810, -171654, -6293, 93548, 120263, 49563, 77678, 36114, 141183, 331561, 323711, 297612, 179489, 190982, 206911, 57621, -74207, -3567, 30722, -121783, -78424, 25016, 70131, 22908, -15353, 52261, -111591, -175189, -207538, -189427, -93637, -152802, -131378, -197775, -213649, 34944, 321122, 468306, 198168, -70292, 35311, 90717, -91962, -146313, -110273, 106892, 117165, 165115, 261159, 108394, -90613, -195409]
13028a95409P1792J08279k44197j44447P0212m1809j625N1297K45073L15847K381
13017B37394j4733J13696j68820j48161k2955Q3374P3742K9420r8304j0154L9368
13006A13867K1304p4844j9477N0682M2447O9037j6442J32976J10110j71589j9652
12995B38419O552j52789r0175Q2525O8705J03322J28347M2368j18305j50195p5118
12984H3656p2542K02243J61333N0880r7351j40342p8162m9251l0129Q110q099
12973C0346L1919P0482P344Q8401k15370j79238J7173P5081Q015N2444J04879
12962I1476J18903o7650P2378Q8804o0717j01393j06867P1691K2114j32583N5033
12951E1189K1664o7089p6745J50863K74530K9271k63338k07321j4528L7317J13492
$$ y = [-195409, -123617, -15338, -259535, -403982, -333770, -375579, -377204, -325907, -80834, 235013, 237394, 222661, 336357, 167537, 19376, -3579, 79795, 153537, 182957, 84653, 74499, 113867, 135171, 60327, 40850, 91532, 133979, 203016, 186574, 319550, 429660, 258071, 238419, 244971, 92182, 2007, 84532, 153237, 256559, 384906, 427274, 308969, 158774, 83656, 11114, 213357, 374690, 425570, 328219, 187877, 109715, 60464, 30335, 38445, 30346, 62265, 132747, 140091, 228492, 13122, -166116, -148943, -73862, -65847, -13403, 91476, 210379, 142729, 215107, 303911, 243194, 141801, 34934, 106625, 128739, -3844, 51189, 72853, 5764, -70981, 79882, 354412, 383683, 120345, -86976, -101504, -64187, 49305]
12940D9305L0324K6463p8114j42228k42793n6596K72635K89527L9924j24954r740
12929E3753o8435J08076J89120j49993n4293Q8768j12424L1242O0763M7103n6894
12918A36786J90364J8501l2502l21595J4495J00792J61363J07571j9664r1458
12908B64653k9587L1978m0843l32059j21239J50566L2928J01254J22088q8229
12898I1510J075j31942q4053P2390l5016n5011O8482L1531L2023j82593r9485
12887b91089o489J68084R907k6881J42782k4903M6548R3438N5112o1239O8016
12876A73286K96889N17k22338K2320J18539j02738k50850n0872j53714J37644
$$ y = [49305, 79629, 106092, 27978, -114250, -357043, -413639, -141004, 148523, 188447, 63493, 53753, -14682, 93394, 282514, 132521, 78228, 166996, 54572, 85814, 146577, 193680, 136786, 327150, 345651, 313149, -8446, 6049, 106841, 268204, 375775, 356111, 264653, 235066, 267044, 226201, -105858, -227097, -76531, -43603, 57651, 179739, 91510, 92585, -39357, -123410, -51020, -86036, -141047, -72565, -41034, -9011, -191604, -291089, -297578, -129494, -119587, -146468, -3686, -28589, 17959, 111397, 166509, 105270, 173286, 470175, 470692, 248354, 270674, 389213, 286475, 35625, -15247, -168961, -31317]
$$ [...]
##END NTUPLES=NMR SPECTRUM
##END=
