##TITLE=Analysis number 307138
Compound Code cc 09104
Book Reference 332/180
Chemist Name craigr
##JCAMPDX= 6.0         $$ Bruker NMR JCAMP-DX V2.0
##DATA TYPE= NMR SPECTRUM
##DATA CLASS= NTUPLES
##ORIGIN= Bruker BioSpin GmbH
##OWNER= NMR
$$ XWIN-NMR		Version 3.5
$$ Thu Apr 21 09:12:51 2005 GMT Daylight Time (UT+1h)  MAYBRIDGE\NMR@NMR_250MHZ
##.OBSERVE FREQUENCY= 250.131544655141
##.OBSERVE NUCLEUS= ^1H
##.ACQUISITION MODE= SIMULTANEOUS (DQD)
##.ACQUISITION SCHEME= undefined
##.AVERAGES= 16
##.DIGITISER RES= 18
##SPECTROMETER/DATA SYSTEM= dpx250
##.PULSE SEQUENCE= zg30
##.SOLVENT NAME= CDCl3
##.SHIFT REFERENCE= (INTERNAL, CDCl3, 0, 16.4548)
##AUDIT TRAIL= $$ (NUMBER, WHEN, WHO, WHERE, WHAT)
$$ ##TITLE= Audit trail, XWIN-NMR		Version 3.5
$$ ##JCAMPDX= 5.01
$$ ##ORIGIN= Bruker BioSpin GmbH
$$ ##OWNER= NMR
$$ C:\u/data/dgb/nmr/ADRS/2000/pdata/1/auditp.txt
$$ ##AUDIT TRAIL=  $$ (NUMBER, WHEN, WHO, WHERE, WHAT)
(   1,<2005-04-21 09:12:32.49 +100>,<MAYBRIDGE\NMR>,<NMR_250MHZ>,
      <created by zg, POWCHK disabled, PULCHK disabled
       configuration hash MD5:
       62 19 C7 07 E1 42 D1 B7 37 6C 3D D0 77 39 F9 E6
       data hash MD5: 64K
       F0 58 06 DE D6 21 AF B3 4F 8C F6 6D 98 60 11 AF>)
(   2,<2005-04-21 09:12:44.43 +100>,<MAYBRIDGE\NMR>,<NMR_250MHZ>,
      <Start of raw data processing
       ef LB = 0.3 FT_mod = 6 PKNL = 1 SI = 32K 
       data hash MD5: 32K
       0E A7 BA FE 78 4B D2 81 C4 0D 86 0C 05 47 C3 8C>)
(   3,<2005-04-21 09:12:45.99 +100>,<MAYBRIDGE\NMR>,<NMR_250MHZ>,
      <apk 
       data hash MD5: 32K
       11 46 BB E9 B8 FD 71 03 C1 F8 A0 4A 52 E9 6D 6B>)
(   4,<2005-04-21 09:12:46.76 +100>,<MAYBRIDGE\NMR>,<NMR_250MHZ>,
      <abs ABSG = 5 
       data hash MD5: 32K
       B6 BF E8 FD B3 85 54 6B 9D 0C 50 D1 E1 F0 80 D2>)
$$ ##END=
$$ 
$$ hash MD5
$$ 1D 50 92 6F 10 B0 11 2B 31 D1 A2 F8 66 2F FE 14
##$RELAX= 
##$RELAX= 
##$RELAX= 
##$RELAX= 
##$RELAX= 
##$RELAX= 
##$RELAX= 
$$ Bruker specific parameters
$$ --------------------------
##$DU= <C:\u>
##$EXPNO= 2000
##$NAME= <ADRS>
##$PROCNO= 1
##$TYPE= <nmr>
##$USER= <dgb>
##$AMP= (0..31)
100 100 100 100 100 100 100 100 100 100 100 100 100 100 100 100 100 100 
100 100 100 100 100 100 100 100 100 100 100 100 100 100 
##$AQSEQ= 0
##$AQ_mod= 3
##$AUNM= <au_zg>
##$AUTOPOS= <2 >
##$BF1= 250.13
##$BF2= 250.13
##$BF3= 250.13
##$BF4= 250.13
##$BF5= 500.13
##$BF6= 500.13
##$BF7= 500.13
##$BF8= 500.13
##$BYTORDA= 1
##$CFDGTYP= 0
##$CFRGTYP= 5
##$CHEMSTR= <none>
##$CNST= (0..31)
1 1 145 1 1 1 1 1 1 1 1 1 1 1 1 1 1 1 1 1 1 1 1 1 1 1 1 1 1 1 1 1 
##$CPDPRG= <>
##$CPDPRG1= <>
##$CPDPRG2= <>
##$CPDPRG3= <>
##$CPDPRG4= <mlev>
##$CPDPRG5= <mlev>
##$CPDPRG6= <mlev>
##$CPDPRG7= <mlev>
##$CPDPRG8= <mlev>
##$CPDPRGB= <>
##$CPDPRGT= <>
##$D= (0..31)
0 1 0 0 0 0 0 0 0 0.06 0 0 0 0 0 0 0.0002 0 0 0 0 0 0 0 0 0 0 0 0 0 0 
0 
##$DATE= 1114071151
##$DBL= (0..7)
120 120 120 120 120 120 120 120 
##$DBP= (0..7)
150 150 150 150 150 150 150 150 
##$DBP07= 0
##$DBPNAM0= <>
##$DBPNAM1= <>
##$DBPNAM2= <>
$$ [...]
##$SUBNAM8= <"">
##$SUBNAM9= <"">
##$SW= 20.6930455092707
##$SWIBOX= (0..15)
0 0 3 0 0 0 0 0 0 0 0 0 0 0 0 0 
##$SW_h= 5175.983436853
##$TD= 65536
##$TD0= 1
##$TE= 294.16
##$TE2= 300
##$TE3= 300
##$TEG= 300
##$TL= (0..7)
0 120 120 120 120 120 120 120 
##$TP= (0..7)
150 150 150 150 150 150 150 150 
##$TP07= 0
##$TPNAME0= <>
##$TPNAME1= <>
##$TPNAME2= <>
##$TPNAME3= <>
##$TPNAME4= <>
##$TPNAME5= <>
##$TPNAME6= <>
##$TPNAME7= <>
##$TPOAL= (0..7)
0.5 0.5 0.5 0.5 0.5 0.5 0.5 0.5 
##$TPOFFS= (0..7)
0 0 0 0 0 0 0 0 
##$TUNHIN= 0
##$TUNHOUT= 0
##$TUNXOUT= 0
##$USERA1= <user>
##$USERA2= <user>
##$USERA3= <user>
##$USERA4= <user>
##$USERA5= <user>
##$V9= 5
##$VALIST= <valist>
##$VCLIST= <CCCCCCCCCCCCCCC>
##$VD= 0
##$VDLIST= <DDDDDDDDDDDDDDD>
##$VPLIST= <PPPPPPPPPPPPPPP>
##$VTLIST= <TTTTTTTTTTTTTTT>
##$WBST= 1024
##$WBSW= 4
##$XGAIN= (0..3)
0 0 0 0 
##$XL= 0
##$YL= 0
##$YMAX_a= 411705
##$YMIN_a= -305438
##$ZGOPTNS= <>
##$ZL1= 120
##$ZL2= 120
##$ZL3= 120
##$ZL4= 120
##$ABSF1= 16.45476
##$ABSF2= -4.238413
##$ABSG= 5
##$ABSL= 3
##$ALPHA= 0
##$AQORDER= 0
##$ASSFAC= 0
##$ASSFACI= 0
##$ASSFACX= 0
##$ASSWID= 0
##$AUNMP= <proc_1d>
##$AZFE= 0.1
##$AZFW= 0.1
##$BCFW= 0
##$BC_mod= 0
##$BYTORDP= 0
##$COROFFS= 0
##$CY= 12.5
##$DATMOD= 1
##$DC= 0
##$DFILT= <>
##$DTYPP= 0
##$F1P= 14.0000005364418
##$F2P= -0.99999901652339
##$FCOR= 0.5
##$FTSIZE= 32768
##$FT_mod= 6
##$GAMMA= 0
##$GB= 0
##$INTBC= 1
##$INTSCL= 1
##$ISEN= 128
##$LB= 0.3
##$LEV0= 0
##$LPBIN= 0
##$MAXI= 10000
##$MC2= 0
##$MEAN= 0
##$ME_mod= 0
##$MI= 0
##$NCOEF= 0
##$NC_proc= -4
##$NLEV= 6
##$NOISF1= 0
##$NOISF2= 0
##$NSP= 0
##$NTH_PI= 0
##$NZP= 0
##$OFFSET= 16.45476
##$PC= 1
##$PHC0= -63.79995
##$PHC1= -2.275055
##$PH_mod= 1
##$PKNL= yes
##$PPARMOD= 0
##$PSCAL= 4
##$PSIGN= 0
##$REVERSE= no
##$SF= 250.130016817374
##$SI= 32768
##$SIGF1= 0
##$SIGF2= 0
##$SINO= 400
##$SIOLD= 32768
##$SREGLST= <1H.CDCl3>
##$SSB= 0
##$STSI= 32768
##$STSR= 0
##$SW_p= 5175.98343685301
##$SYMM= 0
##$S_DEV= 0
##$TDeff= 65536
##$TDoff= 0
##$TI= <Analysis number 999999
Compound Code 99
Book Reference 9
Project Code 9>
##$TILT= no
##$TM1= 0
##$TM2= 0
##$TOPLEV= 0
##$USERP1= <user>
##$USERP2= <user>
##$USERP3= <user>
##$USERP4= <user>
##$USERP5= <user>
##$WDW= 1
##$XDIM= 32768
##$YMAX_p= 469341039
##$YMIN_p= -488614
$$ End of Bruker specific parameters
$$ ---------------------------------
##NTUPLES= NMR SPECTRUM
##VAR_NAME=  FREQUENCY,     SPECTRUM/REAL,   SPECTRUM/IMAG
##SYMBOL=    X,             R,               I
##VAR_TYPE=  INDEPENDENT,   DEPENDENT,       DEPENDENT
##VAR_FORM=  AFFN,          ASDF,            ASDF
##VAR_DIM=   32768,         32768,           32768
##UNITS=     HZ,            ARBITRARY UNITS, ARBITRARY UNITS
##FACTOR=    0.157963299565203, 1,           1
##FIRST=     4115.82929491814, 0,            0
##LAST=      -1060.15414193487, 0,           0
##MIN=       -1060.15414193487, -488614,     0
##MAX=       4115.82929491814, 469341039,    0
$$ Real data points
##PAGE= N=1
##DATA TABLE= (X++(R..R)), XYDATA
$$ [...]
29153c7294O4152Q2753j02851j5694L1419N4673K0366k4552j16591n9404Q4974
29142a8049q1777Q8803J19514j0169j92167j00475p7525k7161J16595J96946N930
29131B0465j8069O8346r1207J902j48189P5559J40538r0305j17592r7488J13061
29120a42979J42927L6085N3192l5295j18322j47946O8882P9638R0046q032o2044
29109d3848o477j4628N1964Q716K905p7781l0885M9056n544r6026R9455J53490
29097I0397r7304p5660Q4981J06911j07768p4219P3480J28529K6973n7540J0582
29086A09362l486M9548j5448o671O340L3396q8084j52456j55347l5854l4875J34933
29074a58642K6966j4134Q9735J3394J36226p500r827o592K0053n5789K2163K0541
$$ plain form
29153 -37294 26858 109611 6760 -8934 22485 77158 97524 72972 -43619 -103023 -18049
29142 -18049 -99826 -11023 108491 98322 -93845 -194320 -271845 -299006 -182411 14535 20465
29131 20465 2396 70742 -20465 -18563 -166752 -91193 49345 -40960 -158552 -256040 -142979
29120 -142979 -52 36033 89225 53930 -64392 -212338 -143456 -63818 26228 18196 -43848
29109 -43848 -50325 -64953 -12989 -4273 -1368 -79149 -110034 -60978 -66522 -162548 -63093 90397
29097 90397 -6907 -82567 2414 109325 1557 -72662 818 129347 156320 98780 109362
29086 109362 105876 155424 139976 133305 139645 173041 84957 -67499 -222846 -258700 -293575 -158642
29074 -158642 -131676 -145810 -56075 -42681 93545 86045 76218 69626 89679 33890 56053 76594
29062G6594o674O7274L6378m1846p4357j07958j15711Q8067M0786p2473j3120
29051a23040J01342J7531j3510j2756l4136J10590J58547p6490p2607j22038J3410
29040e3157J49701P6627N3455J6111M9297j03785r4068l3311l2654o5781K1493
29029a6072P5113J4887N6795M5732j40421j27756q5989p1228P204J34658L1000
29018g6077m5146P356m4164J40857R886k0466j2177j17393J9024J26872M5948
29007C4520O5121J3294M9480N4740j13154j86475K6566L3885R8017K0016n3340
28996D2670K90J1689l816L8265j3772n8337r32J09867j06756j34407L1919k462
28984h5782n7643p0811R20J37235O1917J32580K9770J5274o8643o8354N0835r684
$$ plain form
29062 76594 69920 137194 173572 131726 57369 -50589 -166300 -78233 -37447 -109920 -123040
29051 -123040 -21698 -4167 -17677 -30433 -64569 46021 204568 128078 55471 -66567 -53157
29040 -53157 96544 173171 226626 242737 292034 188249 94181 60870 28216 -37565 -16072
29029 -16072 59041 73928 130723 176455 36034 -91722 -177711 -248939 -241735 -107077 -76077
29018 -76077 -121223 -113867 -158031 -17174 -7288 -27754 -39931 -157324 -138300 -11428 34520
29007 34520 99641 112935 162415 217155 104001 -82474 -55908 -22023 75994 96010 42670
28996 42670 42960 54649 50833 89098 75326 16989 16057 125924 19168 -115239 -83320 -85782
28984 -85782 -143425 -214236 -213316 -76081 -14164 118416 148186 163460 94817 26463 77298 67614
28972F7614N5351P900j14477j59745m1720J30118L9967j5894k1653r4415L4353
28961a12601M4857P5135P7411j8813p8580j3799k5250o0275N8829K1524M1470
28950I908Q2950j10797j6566P6209Q1837K9453r0478o4201J0779J5419j1138k417
28938A0958q1362j13332p090J38916J73143q9455j08474K4587J22795O4608l33
28927A34961j3314l3486k1151l8734o9873p970N6776l4755n5953k9075M2520P3113
28915C059k2168o3374j7759K466N4280P77J19914l5677o7774j9822o6755m0191
28903a53024P4247M8203K2006L2566P1309j2067K454O6964K778o7229m2878K2980
28891F8309k4142n9082o697J39658N5554r7560Q2053M8061o2308j35142p9750
$$ plain form
28972 67614 122965 130865 16388 -143357 -185077 -54959 -14992 -30886 -52539 -146954 -112601
28961 -112601 -67744 7391 84802 65989 -12591 -26390 -51640 -111915 -53086 -31562 9908
28950 9908 92858 -17939 -34505 41704 123541 152994 62516 -1685 9094 24513 13375 10958
28938 10958 -70404 -183736 -190826 -51910 121233 31778 -76696 -52109 70686 135294 134961
28927 134961 121647 88161 67010 28276 -41597 -49567 7209 -27546 -83499 -112574 -70054 3059
28915 3059 -19109 -82483 -100242 -97776 -43496 -42719 77195 41518 -26256 -46078 -112833 -153024
28903 -153024 -78777 -30574 -8568 23998 95307 83240 85694 152658 155436 88207 45329 68309
28891 68309 44167 -14915 -21612 118046 173600 76040 158093 206154 143846 8704 -71046
28880g1046n8863M3847K12416J75498l5765M5951P6203n3462j24353k49887r3072
28869a32533L8007P9529N9138j80j07539J2989j8368L340J46572J34054j13912
28858A01097o6116r5315m5988O155R6254k5116O5509o7395j23669M5012m4856
28847a54428K9651P6964Q1042J5662n2996q699J2763L5135P3916p4731M7148J24295
28835B05722Q6559l2593l9713k47134k11962n3038P6199J52970Q0666k5795j0141
28824a8260P9570m4538M0902L0952k05202n8641Q1463P5508L9668J6068m5525
28813h035o972j023J5054N9113N5503Q3690R737o1758j46860p2398N1779M0220
28801A8050q334o2624p646J1693Q7915J2741m7140J13341j4743k8940k7464n0889
$$ plain form
28880 -71046 -129909 -86062 126354 301852 266087 312038 388241 334779 210426 -39461 -132533
28869 -132533 -94526 -14997 44141 43961 -63578 -50589 -68957 -65617 80955 215009 101097
28858 101097 34981 -60334 -106322 -100167 -3913 -29029 36480 -30915 -154584 -109572 -154428
28847 -154428 -124777 -47813 33229 48891 -4105 -12804 -41 35094 109010 34279 81427 205722
28835 205722 292281 259688 219975 -27159 -239121 -292159 -215960 -62990 17676 -8119 -18260
28824 -18260 61310 16772 57674 88626 -116576 -175217 -93754 -18246 21422 37490 -8035
28813 -8035 -15007 -16030 -976 58137 113640 197330 207067 145309 -1551 -73949 -22170 18050
28801 18050 9716 -52908 -60554 -48861 39054 51795 4655 117996 103253 74313 46849 -4040
28789d040j6070O7989O4449N7713J275p5857p6455j21538J0188R4491n9084j25214
28777a82153O376P4404q416k8155N8932o071J379L5408P2336J49471R8534k8850
28765B43195j34755l5458R9158o7501o9885Q7484l7114j22958l4488r5124P4871
28754i2575L8748j6011J9420m9621l3638O3583J09548l7670k8315o3222M1220
28743d8533J03078K8013o0783m6481M0946N1631J4001j13355o4309K1374M1423
28732c2995r8777l1043J15972Q1820j63760l4579j3509N6815r9130k7531j9500
28721b66217J07850J22611J5198r1664P8809P7117k7406n3797J5446j45260Q0940
28710h6373J46040o6013P916N3185O8203k894J9600K8283j06667M1330k890r2457
$$ plain form
28789 -4040 -20110 47879 112328 170041 171316 95459 19004 -102534 -92346 2145 -56939 -182153
28777 -182153 -175777 -101373 -109789 -137944 -79012 -85083 -83704 -48296 24040 173511 272045 243195
28765 243195 108440 72982 172140 104639 34754 122238 85124 -37834 -72322 -167446 -92575
28754 -92575 -53827 -69838 -50418 -100039 -133677 -70094 39454 1784 -26531 -89753 -48533
28743 -48533 54545 82558 21775 -24706 16240 67871 81872 -31483 -95792 -74418 -32995
28732 -32995 -131772 -162815 -46843 34977 -128783 -163362 -176871 -120056 -219186 -246717 -266217
28721 -266217 -158367 -35756 -20558 -112222 -33413 43704 16298 -37499 -22053 -167313 -86373
28710 -86373 59667 -6346 1570 54755 122958 120064 139664 167947 61280 102610 99720 7263
28698G263k8141p5712L9781P7296k0829N0439O667k7267K6572o4674n2137j5767
28686g6509j7991l9189p760L6412r617N5280r4693L7421J09264J3805O5915o3751
28674H587p179M2446M9514j02208j33760j8701J10013R8230J11599p0643n0291
28663C7607j7220Q084P8999k2223j83669p553L6079K7435L9933O8557l7210j48426
28651a19607M067M9327J05238L8142k2868o3682j55630L1997O6296P9688R9500
28640A12468J19740m7458m7081R1264j3961K4570j6512p1399j96780j26441O6925
28629a04665R3060j4790m8156K4677O2649J38859m6845r177L2478M8668J0641
28618A87399j06803j78821o0356R4653l4802N3382J7361J03674M0292p0459J0052
$$ plain form
28698 7263 -20878 -96590 -56809 20487 -342 50097 56764 29497 56069 -8605 -60742 -76509
28686 -76509 -94500 -133689 -141449 -105037 -114654 -59374 -154067 -116646 -7382 6423 72338 8587
28674 8587 1408 43854 93368 -8840 -142600 -161301 -51288 46942 158541 87898 37607
28663 37607 20387 28471 107470 85247 -98422 -105975 -69896 -42461 -2528 66029 28819 -119607
28651 -119607 -115540 -66213 39025 77167 54299 -9383 -165013 -133016 -66720 12968 112468
28640 112468 232208 184750 137669 228933 214972 239542 223030 151631 -45149 -171590 -104665
28629 -104665 -11605 -26395 -74551 -49874 12775 151634 104789 95612 128090 176758 187399
28618 187399 80596 -98225 -158581 -63928 -98730 -45348 -27987 75687 115979 45520 55572
28607E5572K4447R195K0068r829J1383r6461r454p0778n1892l3367J26378O5854
28595D1116P7211j07753r0122j42236N1040R5793J4862o3194o1783L8966L8458
28584a07642N3879M3590N2919P7149O7731p3696J3989m0027r1233j20577o264
28573a30182j2815l6133P4859R3272J19155J39539l2308k49165o7747P5044J39226
28562A12745Q6755k6058l7551m1327k3484J554M7949Q048n2610j4515N9507N2040
28550A73053J3498n8166p3239o009m4692p5727l2690P9427n8158m0232l5144O47
28538a57432N5252J702j6513j6759R7320N3146N5447R4449m1120j6793P3837J2494
28526A95030k5754m0474l0906N592j784q2285q964J62401L6078q9091o2323M4217
$$ plain form
28607 55572 80019 89214 109282 99453 110836 14375 4921 -65857 -117749 -151116 -24738 41116
28595 41116 118327 10574 -79548 -221784 -170744 -74951 -60089 -123283 -185066 -146100 -107642
28584 -107642 -53763 -10173 42746 119895 187626 113930 127919 87892 -3341 -123918 -130182
28573 -130182 -142997 -179130 -104271 -10999 108156 247695 215387 -33778 -101525 -26481 112745
28562 112745 199500 173442 135891 94564 71080 72634 120583 128631 76021 61506 121013 173053
28550 173053 186551 128385 55146 49137 4445 -71282 -103972 -24545 -82703 -122935 -158079 -157432
28538 -157432 -102180 -100478 -116991 -133750 -36430 16716 72163 166612 125492 108699 182536 195030
28526 195030 169276 128802 97896 103488 101704 19419 10455 172856 208934 119843 57520 101737
28514A01737n9185K9136P4015j11065j15256L6384l0490N9310k4012j36958r5127
28503b71511M2232J32029N5020J8196P6187j12781K0871k9940p7141K0794Q0487
28492d5557O2717K9063M9390m8260J21387J4852m5757k6573N4711L67k50255j37113
28480b21028L4334J63771J30856r0929j05905J1801O8464L8889j44932L2535J11249
28469B9105k9445r2047J37384R9095m1340p5734Q0348o1373j12050j80589l6321
28458b82967J15970N1573P4113j3270l6935j6198O4236N3651J08499L5476j52731
28447A417p359n8725j17431K5782J99311N6085j93904n6966L2538N3456Q1487
28436A5691R8687r7506j68857K01251J83727r1603m6827o3823k0110L1426M9320
$$ plain form
28514 101737 42552 71688 145703 34638 -80618 -44234 -74724 -15414 -39426 -176384 -271511
28503 -271511 -229279 -97250 -42230 -24034 52153 -60628 -39757 -69697 -146838 -126044 -45557
28492 -45557 17160 46223 95613 47353 168740 183592 137835 111262 165973 166340 -83915 -221028
28480 -221028 -186694 -22923 107933 17004 -88901 -77100 -8636 30253 -114679 -82144 29105
28469 29105 -340 -92387 44997 144092 102752 27018 107366 45993 -66057 -246646 -282967
28458 -282967 -166997 -115424 -41311 -54581 -91516 -107714 -43478 10173 118672 154148 1417
28447 1417 -5942 -64667 -182098 -156316 42995 99080 -94824 -151790 -119252 -65796 15691
28436 15691 114378 16872 -151985 49266 232993 141390 94563 30740 10630 42056 91376
28425I1376R4521o9509o0310n6853p4m5021O0508K3296M0774j6491m4119Q3532
28413A01630j00209L081J23622O7785l5032n5328j78204j32821N4712J64682J64026
28402A77944K5325q2621k3703K4369l8857j15574j19858L2414K3523O6783j6448
28391d6703k7551J7376J550J6155M4462m490m3004O021L3080M0277n5077l1334
28379d9238l748J23378k5889k2030R1003K2194n0827m6013n629p7888m7064L0563
28367f1188M6043L9899n3021o4218m3859L3747K1115n2007o8953P4053l683j48213
28355b80285N703L9229J78024L9510j7283M4323j9264J5563p820m3805l5719K1160
28343f0664J8697J1401M0422j753k7580p8533m6489j8040R4292J01369M551m5177
$$ plain form
28425 91376 185897 116388 56078 -775 -849 -45870 14638 37934 78708 62217 18098 101630
28413 101630 1421 4502 128124 195909 160877 105549 -72655 -205476 -150764 13918 177944
28402 177944 203269 120648 96945 121314 82457 -33117 -152975 -120561 -97038 -30255 -46703
28391 -46703 -74254 -56878 -55328 -39173 5289 799 -42205 -36184 -3104 37173 -17904 -49238
28379 -49238 -52986 70392 44503 22473 113476 135670 84843 38830 33201 -44687 -91751 -61188
28367 -61188 -15145 24754 -28267 -92485 -136344 -102597 -81482 -133489 -202442 -128389 -132072 -280285
28355 -280285 -274582 -235353 -57329 -17819 -35102 9221 -10043 5520 -2300 -46105 -81824 -60664
28343 -60664 -41967 -30566 9856 8103 -19477 -98010 -144499 -162539 -68247 33122 37673 -7504
28331g504J4634L3530J24753Q0079o7064o6819o9707q5612M6227O5431j11213
28320d3265n5995J00354Q3717M8134N6978J19506m0986l2688j8243p4548J6497
28309A59461p2707j9457n3242k1323m4072J3033P7604j15397L5178j6446M8740
28298h628J85210K1581j32535j18857K8272N2674k7299o7296J03109j10036j29148
28287b02953j8431j3509N6318R271K20235N2976L685j02091q4192r0378O3432
28276a05637M0793l1123l5426m6525o484O934J14736J9416J5054l3183J3564L1629
28264a6252k6101K1852m7667j4238R4200J01337n5635N870j02424J2831Q3158
28253E6931M512l9214l2238P3211m550q9586L2651J8762m4070K9951P5242l5173
$$ plain form
28331 -7504 7130 40660 165413 245492 178428 111609 41902 -43710 2517 67948 -43265
28320 -43265 -99260 1094 84811 132945 189923 309429 268443 235755 217512 142964 159461
28309 159461 86754 67297 14055 -7268 -51340 -38307 39297 -76100 -40922 -57368 -8628
28298 -8628 176582 198163 65628 -53229 -24957 27717 418 -66878 36231 -73805 -202953
28287 -202953 -221384 -234893 -178575 -169304 50931 103907 107592 5501 -78691 -169069 -105637
28276 -105637 -64844 -95967 -131393 -177918 -184402 -177468 -62732 -43316 -28262 -61445 -47881 -16252
28264 -16252 -42353 -20501 -68168 -82406 11794 113131 57496 63366 -39058 -26227 56931
28253 56931 61443 22229 -10009 63202 58652 -30934 1717 20479 -23591 6360 81602 46429
28241D6429P9795P0727m1990r5276q7141P5985O3336q4250j28732K7432N7778
28230a5907L959J17214J25461P7802L0205j23364j20678l4908n1237J83640j9390
28219A72797j05855j24997o9044R9453M1202l4012O6288o8988M2209j5177q9919
28208h6043j43081n3694J09563J77901J48769J73716j32349j03103o2881j12L9256
28197F7942m2567k6254L5225l1641r0953j8408L129M5996J64656l5690J1925n4295
28185B9065m6035L8199n3258K3569j4651M0257n9461l1266k191m2744j6493n3474
28173a88483M1515N0226N3961j20325M7175P1260p4057O7618J827J685J6014J31206
28161I9622j9329l56o8645j44615q0430o7267J53726J72610O1044K6263l2529
$$ plain form
28241 46429 126224 196951 154961 59685 -27456 48529 111865 27615 -101117 -73685 -15907
28230 -15907 -11948 105266 230727 308529 338734 215370 94692 59784 8547 192187 172797
28219 172797 66942 -58055 -127099 -27646 13556 -20456 45832 -23156 19053 3876 -86043
28208 -86043 -229124 -282818 -173255 4646 153415 327131 194782 91679 28798 28686 67942
28197 67942 25375 -879 34346 2705 -88248 -106656 -103527 -57531 107125 71435 83360 29065
28185 29065 -16970 21229 -32029 -8460 -23111 17146 -42315 -73581 -75772 -118516 -135009 -188483
28173 -188483 -146968 -96742 -42781 -163106 -115931 -44671 -118728 -51110 -49283 -47598 -31584 99622
28161 99622 80293 79937 11292 -133323 -213753 -281020 -127294 45316 106360 132623 100094
28150A00094p1651n2871j0796q1861o9648L6202J25594N0566O121P0626k9094
28139G3282L4520j7812q5904l0088O5174q8315K4127J6946M2732q059k1703M9141
28127E4041L0892N2318k8809O1852m8973o5971n4050L5943J8186M4191M3330m7115
28115I5835M7652j2580p0060N3695j5316r7214r4968K8283Q0617m5738j55580
28104a85374l5287Q3762m9824m7981J891Q0550P0077j11006l2406R3439J18501
28093a3658n9223J15532O3033o9603k4132P4910m2460r0866m7289P6477J2564
28082d715n2634K0683J7119J27J4655M2514m346L587j04737j12718m6610R7680
28070a29395O8644M9664Q079K0243N446j836J08517N333m7634Q4180N3171O2456
$$ plain form
28150 100094 28443 -24428 -35224 -117085 -186733 -150531 -24937 25629 31750 102376 73282
28139 73282 107802 89990 4086 -26002 39172 -49143 -25016 -8070 34662 26603 4900 54041
28127 54041 84933 137251 108442 170294 121321 55350 1300 37243 55429 99620 142950 95835
28115 95835 143487 130907 60847 114542 99226 2012 -92956 -64673 15944 -29794 -185374
28104 -185374 -220661 -136899 -186723 -234704 -232813 -152263 -82186 -193192 -225598 -132159 -13658
28093 -13658 -72881 42651 105684 36081 11949 86859 44399 -46467 -93756 -17279 -4715
28082 -4715 -57349 -36666 -19547 -19420 -4765 37749 33403 36990 -67747 -180465 -227075 -129395
28070 -129395 -60751 -11087 -3008 17235 22681 20845 129362 134695 87061 171241 224412 286868
28058B86868K4440j31634K177j2757p1119J2474p9122j25107l4377M0226Q6755
28047a176O2988q4850K7120k7163l6855m4211N0233Q3325j00196p1222P6178L6982
28035b8847N5567M0870l2507l6961R026l8485O335o0095n3762k047J3603q8313
28023b15616q4222Q7504Q7127N2840O0226j38266J2833M1979O1991L022n7548
28012h8130L9975J19343p0029j7200j6905J6080q442l1688L2495K2958N3823L8561
28000I0841Q308o4400j42216K3622J8430J553M8363K4432J18027M2159j2680r943
27988A46496j056j08482m0881R6042l6253n9676o221m7618j54047O4145J2277
27977a35274j28279M3348N0944J9649O0448l929j0347N0400N9223M2513M3027
$$ plain form
28058 286868 311308 179674 181851 169094 97975 110449 31327 -93780 -128157 -87931 -1176
28047 -1176 61812 -23038 4082 -23081 -59936 -104147 -53914 29411 -70785 -142007 -65829 -28847
28035 -28847 26720 67590 35083 -1878 7148 -31337 -25002 -85097 -138859 -140906 -127303 -215616
28023 -215616 -299838 -212334 -125207 -72367 -12141 -150407 -137574 -95595 -33604 -30582 -88130
28012 -88130 -48155 71188 1159 -16041 -32946 -16866 -25308 -56996 -24501 -1543 52280 90841
28000 90841 99149 34749 -107467 -83845 -65415 -63862 -15499 8933 126960 169119 156439 146496
27988 146496 145440 36958 -3923 92119 55866 -3810 -10031 -57649 -211696 -147551 -135274
27977 -135274 -263553 -220205 -169261 -149612 -89164 -93093 -103440 -53040 6183 48696 91723
27966I1723J0698J0917n8507j89874m3149K18087J69385j6583n1846r6215p7165
27955c2529j23981k996L1054J27465L1831Q3463p3410j70735j43647O0407J22505
27944i0573p362J5712R2181K5933Q7811j71891n0114M2486p1337J1943O8507N5044
27932H340J08432K9387N8306k7154O039j9316k2911j18436k3710M7100r9838q9650
27920a43411m3364J45549Q0922l3022n4508m6186O5810R948K108n2740O0813J03564
27908I5483k5409N8001P7269K0079l5013k4485j07960p5926k1830Q5146K7626
27897G2981J07126k9658j12265p0603o0635N6797K15042J26408p1074l5959o8367
27886A29793j03653R6315j0957r4027J17897L4062q116k9115j01908m155L2696
$$ plain form
27966 91723 102421 113338 54831 -135043 -178192 39895 209280 192697 140851 44636 -32529
27955 -32529 -156510 -159506 -128452 -987 30844 114307 40897 -129838 -273485 -213078 -90573
27944 -90573 -97935 -82223 9958 35891 123702 -48189 -98303 -55817 -127154 -115211 -46704 8340
27932 8340 116772 146159 204465 177311 183350 164034 141123 22687 -1023 46077 -53761 -143411
27920 -143411 -186775 -41226 39696 6674 -47834 -94020 -28210 -18262 -16154 -68894 -8081 95483
27908 95483 70074 128075 205344 225423 190410 165925 57965 -17961 -39791 45355 72981
27897 72981 180107 150449 38184 -32419 -93054 -36257 178785 305193 234119 198160 129793
27886 129793 26140 122455 111498 17471 135368 169430 161314 132199 30291 26136 58832
27875E8832J5172m7094L242N9525k8543l9072m1270K0451N7090L3615p0724o8845
27863d7621j8211J45216M4299P479M0619j4766j18315l9321J00864L4596k552
27852A32287l8208j12725l8544l4574n3420J23644J5005p0973l5657k1200j25923
27841b60288R5111J29829N9280J6811j8341K0889k578n4214K9280m9808j34896
27830a68925K2270L9292Q1813k8050K8913k7622j26506J07991K8032O0059N8525
27819G5792N5368m1441J3937n2895p5367j7565k1514J4991P9637m862j19083J7473
27807g5529J64138O8463m0105O349j1232r8509r7403k2995m6337m5971R1779l9523
27795a46875J9850R8479P5995P5836k7733n4393j20338p1889l563J60551P8895
$$ plain form
27875 58832 74004 26910 30152 89677 61134 22062 -19208 1243 58333 91948 21224 -47621
27863 -47621 -65832 79384 123683 131162 171781 157015 38700 -621 100243 134839 132287
27852 132287 94079 -18646 -57190 -91764 -145184 -21540 -6535 -77508 -113165 -134365 -260288
27841 -260288 -165177 -35348 23932 40743 22402 43291 40713 -13501 15779 -34029 -168925
27830 -168925 -146655 -107363 -25550 -53600 -24687 -52309 -178815 -70824 -42792 17267 75792
27819 75792 131160 89719 103656 50761 -24606 -42171 -63685 -48694 30943 26081 -93002 -75529
27807 -75529 88609 157072 116967 123316 112084 13575 -83828 -106823 -153160 -199131 -107352 -146875
27795 -146875 -127025 -28546 47449 123285 95552 41159 -79179 -151068 -154631 5920 84815
27784H4815q8770j11094O3207J8309j0933j7817R9580m0873r1697j6223M6894
27773f4602J3142n3266L4974P0641p6487r8243j6354R2157N8324M0055o5876r2501
27761a58036K4499j8580Q4444K3111k5306L9892J20700O38q22j14418n9373J2614
27749g0637k527j0009J4238L0220K4563n7266N2591j2041j45300o457Q1723O3264
27737c7638Q0887o6770j4524j463j499P8491Q0192j00645l4128n9840n5589r42
27725a33468L4884J13849J51673P7578j6410k3474q3150m5228n2132l2529J4159
27714E752Q0618k1902p8008R2326N3860l9455p1887O416J2867O3320l2257K9324
27702A00974K4418N986j09369K524R1553o4875M2151O5934l3841n3892m1777m5050
$$ plain form
27784 84815 -3955 -115049 -51842 -33533 -44466 -62283 37297 -3576 -95273 -111496 -64602
27773 -64602 -51460 -104726 -69752 889 -75598 -173841 -190195 -98038 -39714 341 -65535 -158036
27761 -158036 -133537 -152117 -67673 -44562 -69868 -29976 90724 91362 90540 -23878 -83251 -70637
27749 -70637 -73164 -83173 -68935 -38715 -14152 -71418 -18827 -30868 -176168 -182625 -100902 -37638
27737 -37638 43249 -23521 -38045 -39508 -41007 37484 117676 17031 -17097 -76937 -132526 -133468
27725 -133468 -98584 15265 166938 244516 228106 204632 121482 76254 24122 -8407 5752
27714 5752 86370 64468 -13540 78786 132646 93191 21304 27720 40587 103907 71650 100974
27702 100974 125392 131378 22009 24533 116086 51211 93362 159296 125455 71563 29786 -15264
27690a5264j2318M4045m0286j46723N5185P7846l2942o7455m0198R597q5802O5936
27678a88379J37249Q3857N2279J6130o8839l8495j31296J4852m714j8748k0944
27667a67048K6422k095J9567J17288N6057o7726q9915j72517J1680J78783N694
27656h3810j67576r810J29089O6312l880l4051r2407o3322K06961J10548p0854
27645a2800l1831J3378q516M3379k3613R2802p5736j88180o5737J18107J79801
27634D1054R4397J06633q6104q6539M8439J2456j08759k9434K107j04760k2517
27623a33027J20065J16734k3681p8412o8510L4627K7151R9975j11676n3794J9932
27612e0616K4826Q9383N7078L7710M9290j25271k31531M6773L8404o454M9573
$$ plain form
27690 -15264 -27582 16463 -23823 -170546 -115361 -37515 -70457 -137912 -178110 -168513 -254315 -188379
27678 -188379 -51130 32727 85006 101136 32297 -6198 -137494 -122642 -127356 -146104 -167048
27667 -167048 -140626 -142721 -123154 -5866 50191 -17535 -107450 -279967 -268287 -89504 -83810
27656 -83810 -251386 -261196 -132107 -65795 -69675 -103726 -196133 -259455 -52494 58054 -12800
27645 -12800 -44631 -31253 -39769 3610 -20003 72799 -2937 -191117 -256854 -138747 41054
27634 41054 135451 242084 155980 69441 117880 130336 21577 -7857 -5750 -110510 -133027
27623 -133027 -12962 103772 80091 1679 -66831 -32204 -5053 94922 -16754 -70548 -50616
27612 -50616 -25790 63593 120671 158381 207671 82400 -149131 -102358 -63954 -70408 -20835
27601b0835k9994Q1839P7412L5349m378J02083J03587n3675M5574q5953j07071
27590A43938p8882q4450M5617M1794J5976J9136m3189j23130j1242R8056K3557
27579D7181K279j7157L4916M856l974K7493o4890r1306K2648P4026J5822N9057
27567A10951O5338r3195j30406M7347M6297j2195J43168j1550j25544m5667n7930
27556f3386k2240n7989L6995P6171O8033j64426j64895J36441J20087k3939j7183
27545g6331J6935M7067L2096N1589P1971l2882j2984K5814p8677j9617j026p55
27533B3200R312o4256o8870N3553J371r9862j9542N0899n951L9496O9312J31576
27521A20238N1395k8739k1709L1604R094K7159J20850k2041j30025j12252l6385
$$ plain form
27601 -20835 -50829 31010 108422 143771 139393 241476 345063 291388 336962 251009 143938
27590 143938 65056 -19394 26223 68017 83993 103129 59940 -63190 -74432 23624 47181
27579 47181 49460 32303 67219 72075 68101 95594 30704 -60602 -37954 36072 51894 110951
27567 110951 176289 83094 -47312 35 46332 34137 177305 165755 40211 -5456 -63386
27556 -63386 -85626 -143615 -106620 -30449 37584 -126842 -291737 -155296 -35209 -59148 -76331
27545 -76331 -59396 -12329 19767 71356 143327 110445 97461 123275 44598 24981 23955 23200
27533 23200 32512 -31744 -100614 -47061 -45690 -145552 -165094 -114195 -120146 -80650 -11338 120238
27521 120238 171633 142894 121185 152789 161883 189042 309892 287851 157826 45574 9189
27510I189j1078j8716j7225N6998J5587L9426k8096J04390J2048P8426j9953j93591
27498B7405k6820N4481r389j91541l3127O0318K7173R5557N5389k9523p3243K9359
27486a3961J20265L663q7087P6827O680j26769J9873m6343r890K39021J03891
27475B86170j61614m1142j7551K0241l1822n7115n6632k7392K1569j92279J0857
27464b46710P3903K8824p372n5065l3295J44883P9844l762O6911O3694j25134
27453a3279j33375j2158O1441p9470K8741M5700p324j12526O4450P4557N4149
27442b9094M5435O9690q4787K4536O6299R1994j60627l3607o106l1934j59714
27431b07915O2236O8550n4842m7124N5123J21191K7086O6667J00820O9568q3677
$$ plain form
27510 9189 -1889 -20605 -37830 19168 34755 74181 46085 150475 162523 240949 220996 27405
27498 27405 585 55066 45677 -145864 -178991 -118673 -91500 4057 59446 29923 -43320 -13961
27486 -13961 106304 109967 22880 99707 106387 -20382 -509 -46852 -56742 182279 286170
27475 286170 124556 83414 65863 86104 54282 -2833 -59465 -86857 -65288 -257567 -246710
27464 -246710 -172807 -143983 -151355 -206420 -239715 -94832 -14988 -18750 48161 111855 -13279
27453 -13279 -146654 -158812 -97371 -176841 -148100 -102400 -109724 -222250 -157800 -83243 -29094
27442 -29094 16341 86031 1244 25780 92079 184073 23446 -10161 -16267 -48201 -207915
27431 -207915 -145679 -77129 -131971 -179095 -123972 -2781 24305 90972 191792 261360 177683
27420A77683p7328L8945o0573j27594J23825l1733p1610J9880P6308J046o8421
27409D28N4573J22212Q3344j89728q7044K5318R1743L6627m8545j3828L795k6371
27397E2524L7475l2342J3321l2112J6934L0466l8121J4112r2938k0324J70413
27386A19408Q285m6892J8795p4996L7659K1939M9245j13577q2084j18778m0094
27375b21090J17135J3573m772j1767n4799Q5933J35527j7059L0962m7971j09620
27364h3948q78m4031M9679R0356J4733k6502m5903O2313l0505o7328Q166M6626
27352b7222J30077M3559j01435K9361K8162j151J4312r1713p8366m9819l2945
27341a37180J02447J10921R9919N9968r6101p2242K8093k7310j56315k2714K5931
$$ plain form
27420 177683 100355 139300 78727 -48867 74958 43225 -28385 -8505 67803 68849 428
27409 428 55001 177213 260557 70829 -16215 9103 100846 137473 88928 75100 78895 52524
27397 52524 89999 57657 70978 38866 55800 86266 48145 62257 -30681 -51005 119408
27386 119408 127693 80801 99596 24600 62259 84198 133443 19866 -62218 -180996 -221090
27375 -221090 -103955 -90382 -95154 -106921 -161720 -75787 59740 42681 73643 25672 -83948
27364 -83948 -84826 -128857 -79178 11178 25911 -591 -46494 15819 -14686 -82014 -73848 -27222
27352 -27222 102855 146414 44979 74340 102502 101351 115663 23950 -54416 -104235 -137180
27341 -137180 -34733 76188 176107 236075 139974 67732 95825 68515 -87800 -110514 -84583
27330h4583K0913Q3389k5093M8970K7906j04274p9655Q7238J19523r360m8110
27319C6864M2038m1828o6802j13172N6994Q1262o3796m7754j06952M9860Q8640
27308h4646N192O9193k263r6384k2632J15459K4811o8852K4274n61q8467O9265
27296e5611P0423p4609j0938L4783j01833K571R4879K6192r423l3937o6955r9620
27284b24078K08264Q4509p0922k1698m0583o4024Q0659M3290J9296N0478M213
27273F9404r8229J0245k762O3163J37832l4638l141p5491m2249j20148l2052L6471
27261i1595M7737N7396n0117m5802M9694J34843L8192l7760N6393n8289k5114
27250G5578L8300j71447n0222J53467M7583k63456M1573O1195Q937O2352O3515
$$ plain form
27330 -84583 -63670 19719 -5374 43596 71502 -32772 -112427 -25189 94334 84974 36864
27319 36864 78902 37074 -29728 -142900 -85906 -4644 -68440 -116194 -223146 -173286 -84646
27308 -84646 -79454 -10261 -12524 -108908 -131540 -16081 8730 -60122 -35848 -36409 -124876 -55611
27296 -55611 14812 -59797 -70735 -35952 -137785 -135214 -40335 -14143 -23566 -57503 -124458 -224078
27284 -224078 -15814 68695 -2227 -23925 -64508 -128532 -47873 -4583 14713 65191 69404
27273 69404 -28825 -18580 -21342 41821 179653 145015 141874 66383 24134 -96014 -128066 -91595
27261 -91595 -43858 13538 -36579 -82381 -32687 102156 140348 102588 158981 100692 75578
27250 75578 113878 -57569 -107791 45676 93259 -170197 -128624 -67429 -58492 3860 67375
27239F7375O209n5624m4033q4043Q6342J68138P2818j28756j3056K6665j8445
27228H3590K1603m7321q746j9977J26809J5278j09700q3788M9822j0273j9666
27217b369P1522o1984J258K1939J01103L5198j7290q23j09983r1845j5440p180
27205g5894O5252J42008N2874r0216k37732j5453M244J2959J15323M8514m6246
27194b4367j17622L4015O6729P5682P0012q3044n3400k7133M2820J07339p9571
27183A1460M308l443j04106r8340j7219J00953K6439M682J5055j7795J07619o796
27171B2817r5832N8431O0669K3990o7528R558L334m3726O0680K2628N8475Q4899
27159A98395j29219L025j0960o6196J16774N3644k7337n4283p9693N1628K9065
$$ plain form
27239 67375 73584 17960 -26073 -110116 -23774 144364 217182 88426 75370 102035 83590
27228 83590 105193 57872 49126 29149 155958 171236 61536 -22252 27570 17297 -2369
27217 -2369 69153 7169 8427 30366 131469 166667 149377 148554 38571 -53274 -68714 -75894
27205 -75894 -10642 131366 184240 94024 -143708 -159161 -154917 -141958 -26635 21879 -24367
27194 -24367 -141989 -107974 -41245 34437 104449 21405 -31995 -59128 -16308 91031 11460
27183 11460 15768 12325 -91781 -190121 -207340 -106387 -79948 -75266 -60211 -78006 29613 22817
27171 22817 -73015 -14584 46085 70075 2547 12105 15439 -28287 32393 55021 113496 198395
27159 198395 69176 72201 61241 -4955 111819 165463 138126 83843 4150 55778 84843
27148H4843M5875O2742n9124j36345j2539M3034K3779L2877J2585o2380J6673
27137E2020n3403L4432L4798l2480N3496o5588o0138n4597K275K9471Q0841R3107
27125A14234m2567j5013j02001m2612O7006J1736q3782m5667r7143K3023J25306
27114h7480j7979P6367O0475Q6376k6500r6606K7974O6K3694J4227K5002m7541
27102C8075j00107n9087q440q535k7920O9773J01254J8073Q9580q0627j05448
27091g3409j0296k3460L0506j8268j905Q5474P0590j3055n6204m8978m5907P2628
27079c2284m3880N7693J48175j8661m2413P066N9928m0604j38527p9289L9154
27068h3642q906J496O7659P8722n1143L9382J38188L2231r4496q0283O321R6096
$$ plain form
27148 84843 130718 193460 134336 -2009 -14548 28486 52265 85142 97727 35347 52020
27137 52020 -1383 33049 67847 35367 88863 23275 -36863 -91460 -89185 -59714 21127 114234
27125 114234 71667 56654 -45347 -87959 -20953 -9217 -92999 -138666 -235809 -212786 -87480
27114 -87480 -105459 -29092 31383 117759 91259 -5347 22627 22693 46387 60614 85616 38075
27102 38075 -62032 -121119 -129559 -138094 -166014 -96241 5013 23086 112666 32039 -73409
27091 -73409 -83705 -107165 -76659 -94927 -96832 -11358 59232 46177 -10027 -59005 -104912 -32284
27079 -32284 -76164 -18471 129704 111043 68630 75696 135624 95020 -43507 -122796 -83642
27068 -83642 -92548 -91052 -23393 55329 4186 43568 181756 213987 119491 39208 45529 141625
27056A41625q6203m6721n5029j0381K6578q5022n5058j7726J20073n31j54110
27045b22505J20295J23367m5154m5456l4569l7672M9549J424j08750J33890J00398
27034C4817L0160L607j17394o7061J4408O3585l8739j5257n4187O8266J18912
27023D1117n3811N9999J7343k9934l9881r7235L1849L3633n422j5486P6581k3682
27011d929J26643P371j08805o0814j12213r287Q7740K5292j06802J7442N8863
27000g9499P1346l0920j71022k4010J76373J10347o1778m3103o4920R8914N5387
26989C7115k8449l8068L9589R903K9455K0468l0214l5363K9507N2487Q1597M0391
26977B08418o3952j11880O1082N9391J00520M5315l8022j49426p5521l3702J67454
$$ plain form
27056 141625 55422 8701 -46328 -56709 -30131 -115153 -170211 -187937 -67864 -68395 -222505
27045 -222505 -102210 21157 -23997 -69453 -104022 -141694 -92145 -90721 -199471 -65581 34817
27034 34817 64977 68584 -48810 -115871 -101463 -37878 -76617 -91874 -146061 -77795 41117
27023 41117 -12694 47305 64648 34714 -5167 -102402 -70553 -36920 -42342 -57828 18753 -4929
27011 -4929 121714 129085 20280 -40534 -152747 -162034 -74294 -49002 -155804 -138362 -79499
27000 -79499 -8153 -39073 -210095 -234105 -57732 52615 -9163 -52266 -117186 -18272 37115
26989 37115 8666 -29402 10187 20090 49545 70013 39799 4436 33943 86430 168027 208418
26977 208418 144466 32586 93668 153059 253579 298894 260872 111446 35925 2223 169677
26966A69677R1637l0273l5514j54354o9806l2916R80J33219k0316j38403r9792
26955a85861L5861L7583j3848j19861o1753k8992J33165J04364j1328l0444J61062
26944A9948J28552R696k6466q9644k6883k3107k301P1398j8612k153n5956j6456
26932c1984l5892J40399J32388P218j59716j22329p0315k8119m8958j087J14352
26921a04043p3360Q6612J16856K0919k1136o1775q1485m5648l5305o7574o7724
26910c33663J11138J08400J40963Q1967J06462j14953n8154M6017J13304R2915
26900B94396o800j00025P6100M8261j77059j67944q9942j3980N2042k6524j14718
26889b26193L5825O1795J04753J32679j02034R6713J02699m0993j66565j47297
$$ plain form
26966 169677 261314 231041 195527 41173 -28633 -61549 -60569 72650 52334 -86069 -185861
26955 -185861 -150000 -112417 -126265 -246126 -307879 -336871 -203706 -99342 -110670 -141114 19948
26944 19948 148500 158196 131730 42086 15203 -7904 -10205 61193 42581 40428 -15528 -31984
26932 -31984 -67876 72523 204911 212129 52413 -69916 -140231 -168350 -217308 -218395 -104043
26921 -104043 -177403 -90791 26065 46984 25848 -35927 -117412 -163060 -198365 -265939 -333663
26910 -333663 -222525 -114125 26838 108805 215267 100314 42160 88177 201481 294396
26900 294396 287596 187571 263671 311932 134873 -33071 -123013 -136993 -84951 -111475 -226193
26889 -226193 -190368 -128573 -23820 108859 6825 103538 206237 165244 -1321 -148618
26879a48618K0706L1803j4803O4977l6109J8280J47652M7583J0758K7519l7898
26868A31850J7382J11821P0684j19524j53005j05178j1564m101L983j8387j0334
26857h6373k1484K9764L0968l3444q10k1325j08748M0050R5463J8763N391k6652
26845g8437k0625L3227J51606R0776o8659j83625P1017J00786j04401j44413o2805
26834b15553j3489N1975M9307K2109L2172R9824k563k9177p4853o3888m1086k3073
26822b08295Q5773O4622K353M5351J26340Q27j01650l1419l0438Q8985Q5961m3976
26810H4434o7638o2467K1925j0711M86L9915O93j8956K1642n0115k32744r6057
26798c69593R404J48237J13067J07871j6706N9795j8506L802O3556l5290j12750
$$ plain form
26879 -148618 -127912 -96109 -110912 -45935 -82044 -63764 83888 131471 142229 169748 131850
26868 131850 149232 261053 331737 212213 59208 -45970 -57534 -61635 -57652 -76039 -86373
26857 -86373 -107857 -78093 -47125 -80569 -81379 -102704 -211452 -171402 -75939 -57176 -51785 -78437
26845 -78437 -99062 -65835 85771 176547 107888 -75737 -4720 96066 -8335 -152748 -215553
26834 -215553 -229042 -177067 -127760 -105651 -73479 26345 23782 -5395 -80248 -144136 -185222 -208295
26822 -208295 -122522 -57900 -55547 -10196 116144 116971 15321 -16098 -46536 42449 128410 84434
26810 84434 16796 -45671 -23746 -34457 -33971 5944 6637 -12319 9323 -40792 -273536 -369593
26798 -369593 -360189 -211952 -98885 8986 -7720 52075 33569 37371 100927 65637 -47113
26787d7113n2289J20637O2050Q619j59363K5923j1960N543j4533Q2698K14917
26776B35129m0391q7297j88342o1351O2271R1208J15187N8844m4474j18278j00837
26765g8331m8535K2621J22609j9884N225o7578k3551j5469j08435J6840J05399
26754h9089n1520K1887Q8442M224O2759q5181m3954J0945Q662j01332p67P7435
26742i7489r678L4857Q398j9576J45464J25769j51075k06936J18528K3330n1374
26731g9782L6507R8524j848K2947j58554n7617J06942N3864L2401n1220m4267
26720d2103q2413n4883o2343L389P1850r4849J6204J63345J10271n5088l38j8791
26708d5749q964Q0990k6138n5966Q6271Q5737M2616P1802j09052k4450q0650m8751
$$ plain form
26787 -47113 -99402 21235 83285 91904 -67459 -41536 -53496 -47953 -62486 20212 235129
26776 235129 194738 107441 -80901 -142252 -79981 11227 126414 185258 140784 22506 -78331
26765 -78331 -126866 -104245 18364 -1520 3705 -63873 -87424 -102893 -211328 -194488 -89089
26754 -89089 -140609 -118722 -30280 -26056 36703 -48478 -92432 -81487 -72825 -174157 -174924 -97489
26742 -97489 -107167 -72310 -63912 -83488 61976 187745 36670 -170266 -51738 -28408 -79782
26731 -79782 -43275 55249 53401 76348 -82206 -139823 -32881 20983 53384 2164 -42103
26720 -42103 -124516 -179399 -241742 -238353 -166503 -261352 -245148 -81803 28468 -26620 -26958 -45749
26708 -45749 -54713 26277 139 -55827 30444 116181 158797 230599 121547 97097 16447 -32304
26696c2304M8645o1113m3984K080J67653L8638q0139m3663O4897K8744k6573q7732
26684b4851L5095p665P7765N0749n8641m2078j09767l4547r662O9214J2949K9386
26672a2053O7270N4091O1339O6395k6376q0420q0825K7398P5812M1317r4935o2376
26660C6637l4973P1890J21971M8946k382j12921l9254K2606p6018j7714j03857
26649h5069j6523R6987J0429J13908L9397j32296k4022P6541k209m0636o4387
26638b7880J7509J56091o5400k2230j18947j30429j464K28722k6679L1360n2946
26627a2293m9077K6161N0443J7186r2730j21453p060J27380R2570o3631O1331
26616B8827K3840N359m2658P4787K2308j81852n6676Q3024k0751o4149J05673
$$ plain form
26696 -32304 16341 -44772 -88756 -86676 80977 119615 39476 -4187 60710 89454 62881 -24851
26684 -24851 10244 2579 80344 131093 72452 30374 -79393 -113940 -123602 -54388 -41439 -12053
26672 -12053 55217 109308 170647 237042 210666 130246 49421 76819 152631 193948 99013 36637
26660 36637 1664 73554 195525 244471 242089 129168 89914 112520 36502 18788 -85069
26649 -85069 -101592 -4605 5824 119732 159129 26833 2811 79352 77143 36507 -27880
26638 -27880 -10371 145720 80320 58090 -60857 -191286 -192750 35972 9293 40653 -12293
26627 -12293 -61370 -35209 15234 32420 -60310 -181763 -188823 -61443 31127 -32504 28827
26616 28827 52667 58026 15368 90155 112463 -69389 -126065 -43041 -63792 -127941 -22268
26605b2268n8618n1435K448J32288J30921p7894j44335N6041K2190o3962k406
26594g7030L7678N972L4043O1966K6050n9662R312l2067j24153N0468N1573J1472
26582d378J3764J9141M6496l2541k2611r1108q5638o747K31157R7315m4688m3118
26570G7044j10038k2789L3278J3147J46661J33875j06327o8863j0518j6068k7648
26559D1754P5499J225n2411O758j05460j20736l3023K8249R124J2843N6772L5439
26547d3967J937J37231K5170n4231K5168m0336j8193j16528N6631J6911J4248
26536D041j7508p7588N1526R8157L3112o7019p3321O2816K7999j68162O5581J01500
26524D1134K4443n5497j70605l1967J04813M7701K610k0707j03305M6664J00163
$$ plain form
26605 -22268 -80886 -132321 -129873 2415 133336 55442 -88893 -32852 -10662 -74624 -77030
26594 -77030 -39352 -33380 663 62629 88679 29017 38329 6262 -117891 -67423 -15850 -4378
26582 -4378 9386 28527 75023 42482 19871 -71237 -156875 -163622 67535 164850 120162 77044
26570 77044 -32994 -55783 -22505 -9358 137303 271178 164851 95988 85470 69402 41754
26559 41754 117253 118478 66067 72825 -32635 -153371 -186394 -158145 -149021 -136178 -79406 -43967
26547 -43967 -42030 95201 120371 66140 91308 50972 32779 -83749 -27118 -10207 4041
26536 4041 -13467 -91055 -39529 58628 91740 24721 -48600 14216 42215 -125947 -60366 41134
26524 41134 65577 10080 -160525 -192492 -87679 -39978 -37368 -58075 -161380 -114716 -14553
26513a4553j90280L1390P1543O6997L6279M4666N661L9023M592n0666P1842j07927
26501H567j43365R5317L4135r3451J4024M9228J1202J09080n0043j83330j68771
26490c17407K9754J3612Q9415R3914J00224R8324R155P477N8240j00140o4231
26479A8337n6490K2521M3716J1699L8210n197O3295Q5239R1598q7398p6157j18926
26467C0447J6052k584j36274r8706k3452N0101J29201K9265j59275j8195J69485
26456a3935R5311N0586p139n4077l1161M0309L9438m8764N9256J18671O7304l5275
26444B80524j25681j41308q3882K4849O3002N5984k0697j16228p8830n194o731
26433a54192M8772R6907n2975k4692r3429o117K05760O3057j15300j13183R1803
$$ plain form
26513 -14553 -204833 -173443 -101900 -34903 1376 46042 51703 90726 95318 44652 116494 8567
26501 8567 -134798 -39481 -5346 -98797 -84773 -35545 -24343 84737 34694 -148636 -317407
26490 -317407 -287653 -274041 -184626 -90712 9512 107836 116991 124468 182708 82568 18337
26479 18337 -38153 -15632 28084 39783 77993 72796 136091 221330 312928 225530 149373 30447
26467 30447 46499 43915 -92359 -191065 -214517 -164416 -35215 -5950 -165225 -183420 -13935
26456 -13935 81376 131962 124823 70746 39585 79894 119332 70568 129824 248495 315799 280524
26444 280524 154843 13535 -70347 -45498 17504 73488 52791 -63437 -142267 -147461 -154192
26433 -154192 -105420 -8513 -61488 -86180 -179609 -185726 20034 83091 -32209 -145392 -53589
26422e3589R4752Q5381N8342n7928m185k2411M0021K9567k7360j35595r5439j39744
26410b28188J87596J31814j21315j13555P4173P9187n343N3764P9927J5620Q836
26399A62516j11982q9867l8251k8187p013R7742R5074J13606J13603j63598J6966
26388A60609K5250j1559p29J44896R0291k1908j15444l3429p2343J115r8629r3176
26376b5056j6991K8101l476j05619l8547L1230J7537K9211J8538Q102j2087K3495
26364d5562n6455K79M1695O6418l2419o7936o6002Q758M935R2540k7995K2974
26352e8770O0443k0006j3161M3783M4984J1560m5149L7863J7013j5331j10647
26341d7418p9457M8777O8017o2287o6937k8883J02871J10788n2947L7851m1586
$$ plain form
26422 -53589 41163 126544 184886 126958 122773 100362 140383 169950 142590 6995 -88444 -228188
26410 -228188 -40592 91222 -30093 -143648 -69475 9712 4369 58133 138060 153680 162516
26399 162516 50534 -39333 -77584 -105771 -112784 -15042 80032 193638 307241 143643 160609
26388 160609 185859 174300 173571 318467 408758 386850 271406 237977 165634 166749 68120 -25056
26376 -25056 -42047 -13946 -17422 -123041 -161588 -130358 -112821 -83610 -65072 -56970 -69057 -45562
26364 -45562 -102017 -101738 -60043 6375 -26044 -93980 -159982 -151224 -146289 -53749 -81744 -58770
26352 -58770 1673 -18333 -31494 12289 57273 68833 23684 61547 78560 63229 -47418
26341 -47418 -126875 -78098 -10081 -72368 -139305 -168188 -65317 45471 -7476 30375 -11211
26330a1211o653k9176J8451J33541P8486k1927j82974p5224O4812K7180M5964
26319D1269L427o4348m9388N7646j7634L3654k359n4647P3223L8620R6476q0282
26307G5657j06216j8938j37642L5825J02669N0646J10925m2954L6042p7410o5955
26296c7351l6153Q3594J3190M6657O2150m9387L9611O2388K3745p7107q5237r6303
26284e0203L9402m55n0262L7633J10320l4929j7261r053j2258l3058K9916m4312
26272c4520o9967J26038O5313m5253k0685J04435K9191j33170p9783J8568M8231
26261H398J1585O326L1131m4697l9615P0777n0190r3983n772P8707R473j16473
26249a34333m9718K52850l4816O133O9788L078l513q0244M1996q0058p3720n7850
$$ plain form
26330 -11211 -17864 -47040 -28589 104952 183438 161511 -21463 -96687 -31875 -4695 41269
26319 41269 44696 -19652 -69040 -11394 -29028 4626 2267 -52380 20843 59463 155939 75657
26307 75657 -30559 -49497 -187139 -151314 -48645 2001 112926 69972 106014 28604 -37351
26296 -37351 -73504 10090 23280 69937 132087 82700 122311 184699 208444 131337 46100 -50203
26284 -50203 -10801 -11256 -61518 -23885 86435 51506 34245 25192 12934 -20124 9792 -34520
26272 -34520 -104487 21551 86864 41611 20926 125361 154552 21382 -58401 -39833 8398
26261 8398 19983 26309 57440 12743 -26872 43905 -6285 -100268 -106040 -27333 -17860 -134333
26249 -134333 -184051 68799 33983 40116 109904 112982 109469 29225 71221 -8837 -82557 -140407
26237a40407m2761n0141N888J33008J00426o7907K6947n0763j51K3942R1554j03692
26225g4057m3960Q7211P92R361K0492l659O394L7222N4481p1745o7612l5893J875
26212g9098l7049L5886Q2054Q4825R3912j06994j67640j4386l9706N637M0508
26201a02051K0784R7344J69954o8781j69772j44137k6670J11088J19082P4523
26191H1364K1815O8818J5585o9330r2204n387J09097M9928m0909j02506q8932
26180e2661P2967O109L1792o4056j13191l0653R6571N7906o3346K0284j0303L3534
26168a5047L8679k9780J07055q8203n7398j7404M3835l0679P8281J39948l8668
26157A30619j98K4086M1084O064l9387p3410j23581k9868L6127m0294K4108R7709
$$ plain form
26237 -140407 -183168 -233309 -227421 -94413 6013 -61894 -34947 -85710 -85861 -61919 29635 -74057
26225 -74057 -118017 -30806 -30014 -20653 -161 -3820 2574 39796 94277 22532 -45080 -80973 -79098
26212 -79098 -116147 -80261 1793 86618 180530 73536 -94104 -108490 -148196 -142559 -102051
26201 -102051 -81267 16077 186031 117250 -52522 -196659 -223329 -112241 6841 81364
26191 81364 103179 171997 187582 118252 26048 20661 129758 179686 138777 36271 -52661
26180 -52661 20306 26415 58207 -5849 -119040 -149693 -53122 4784 -58562 -38278 -48581 -15047
26168 -15047 23632 -6148 100907 12704 -44694 -62098 -18263 -48942 29339 169287 130619
26157 130619 130421 154507 195591 201655 162268 88858 -34723 -64591 -28464 -68758 -44650 53059
26145E3059J04732j02908m3203P0975N7645o849r7466R1356L2417j15833r4793
26134e0868Q13Q5245j9482j7950j1995L8728l8672j36854L2773M8651Q4691K149
26122A7229K8493K9806N0348j08504o7129j3938N1954n6889j05386N8869K432
26111a12715N0507J14806M4549J9506j21232q4825K821M2254L7515L0322L6590
26100F0098m1536n0047p3262l7505j02212K4330Q952L0701J39183n381p9312m3447
26088a69438l4504j12072O850J17451J45121R2668j55941j6586J06701q819p4994
26077a03563J739O5421L1724P8467J6146l3682p8151M1561k904l7426o5100P9096
26065f672L9736n6679j6464M3692q1828l9640o6803M8570J86622J53259j28668
$$ plain form
26145 53059 157791 54883 11680 82655 140300 133451 35985 127341 159758 43925 -50868
26134 -50868 -50055 35190 15708 -2242 -14237 24491 -14181 -151035 -118262 -69611 15080 17229
26122 17229 45722 75528 125876 17372 -49757 -63695 -11741 -68630 -174016 -115147 -112715
26111 -112715 -62208 52598 97147 116653 -4579 -89404 -86583 -44329 -6814 23508 60098
26100 60098 18562 -31485 -104747 -142252 -244464 -220134 -211182 -180481 -41298 -46679 -125991 -169438
26088 -169438 -203942 -316014 -309164 -191713 -46592 46076 -109865 -126451 -19750 -28569 -103563
26077 -103563 -101824 -36403 -4679 73788 89934 56252 -21899 19662 16758 -20668 -85768 -6672
26065 -6672 33064 -23615 -40079 3613 -78215 -117855 -184658 -136088 50534 203793 75125
26054G5125l4585k7139m2590p7461K849J20539r0138K454O1875Q0000M0503l8876
26042G2556m8321m066P4333Q9443N9227o9759p0559j08155K1552j2611j01084
26031i7444k4476L7056k0336L6994o6332k9550R3322P043J557J81712J8418k222
26019A35742Q2299j10389j64061K2864j8791j04297k4877M4707N3616P939K1186
26008e4062k7946k2045K0858J02892J05464J1100j5311n1491j33129O4162O2801
25997F3293m9952L1067m5381J656p104l2090k2204k3404k7905P1692L0620m3247
25985e2959j1168k4244j9418M1338O4565J9850l6997N403o477p8135l7159R4947
25973d0454K5162n2713P8103Q6317K875K641K1805n6212q4707j53016k0147J65011
$$ plain form
26054 75125 40540 13401 -29189 -106650 -103801 16738 -73400 -70946 -9071 70929 111432 72556
26042 72556 24235 20169 94502 183945 243172 173413 102854 -5301 16251 3640 -97444
26031 -97444 -121920 -84864 -105200 -68206 -134538 -164088 -70766 -63723 -62166 119546 137964 135742
26019 135742 218041 107652 -56409 -33545 -52336 -156633 -181510 -136803 -83187 -75248 -54062
26008 -54062 -82008 -104053 -83195 19697 125161 136261 120950 69459 -63670 492 63293
25997 63293 13341 44408 -973 683 -6421 -38511 -60715 -84119 -112024 -40332 -9712 -52959
25985 -52959 -64127 -88371 -107789 -66451 -1886 17964 -19033 -13630 -20107 -98242 -135401 -40454
25973 -40454 -15292 -68005 10098 96415 99290 101931 123736 67524 -17183 -170199 -190346 -25335
25961b5335K9048J056o371j4075J8538R1370P7541l5185m270j08256j4534o0693
25949e1166M4380p268l4938R9450J3319l1725o1559N879j8288o4656j9254N4823
25937g1003J1005k5532J09173Q0327j72473N796M0748k2691m4409p2163k1019
25926a82241m434L4689K9929J08179j8010K6065J96N3547M5406N3504o2535o904
25914G7391L4360j10100n3258m9944O2835J74376j22830L006J31278r1131k13352
25903a57369Q4123J78662j8920r7111o5242k2611P934M9739j9120j3688j59240
25892b32843P7725K12090M0164p3194q0297o7284K0640J72689K10948j25566j53284
25881A788q736N9445J2503j5997l7458j7159l9952j59973n6164M6821M4134P5208
$$ plain form
25961 -25335 3713 4769 -1602 -15677 2861 94231 171772 136587 132317 24061 9527 -51166
25949 -51166 -6786 -14054 -48992 50458 63777 32052 -29507 -23628 -41916 -106572 -125826 -71003
25937 -71003 -59998 -85530 23643 103970 -68503 -62707 -21959 -44650 -89059 -161222 -182241
25926 -182241 -186675 -151986 -122057 -13878 -31888 -5823 -5627 47920 93326 146830 84295 77391
25914 77391 111751 1651 -51607 -101551 -38716 135660 12830 15836 147114 55983 -157369
25903 -157369 -73246 105416 86496 -10615 -75857 -98468 -90534 -40795 -59915 -73603 -232843
25892 -232843 -155118 56972 97136 23942 -56355 -123639 -102999 69690 280638 155072 1788
25881 1788 -6948 52497 65000 49003 11545 -5614 -45566 -205539 -261703 -214882 -170748 -95540
25869i5540N7724j6925j3118p130P6057N1848j7860j4704l9060q2786n2321R0354
25857f3461O7469o5205j7641K3784n036k2323r937j7068L7537O5138k6363j33502
25845a66608j21079J02146P3123k4477L4839J4910n878J81145L7701q2436m0140
25834C246p6729q4036q964O1462N789q745J2977N4213O211k2921P1882Q0943l5024
25821F0304j8838N0450j41412N8278J31142n8873j79715q0027P3521k8916p9131
25810b13217q3502L0413Q0533J01532p81Q3170L6857L7688L708R3097l0116j01336
25798C8046K9860j8915M5570K8816j14813r2703n9165p6447J8421L8462j4983
25787a77851Q0509J70061N1418q4437P675j654J1739k1934j32973j19264M3988
$$ plain form
25869 -95540 -37816 -54741 -67859 -74989 1068 52916 35056 20352 -18708 -101494 -153815 -63461
25857 -63461 4008 -61197 -78838 -55054 -60090 -82413 -92350 -109418 -71881 -6743 -33106 -166608
25845 -166608 -287687 -185541 -112418 -136895 -102056 -87146 -93024 88121 125822 43386 3246
25834 3246 -73483 -157519 -166483 -105021 -99232 -107977 -95000 -40787 -34576 -57497 14385 95328 60304
25821 60304 41466 91916 -49496 8782 139924 81051 -98664 -178691 -105170 -134086 -213217
25810 -213217 -296719 -266306 -185773 -84241 -85022 -1852 35005 72693 76401 169498 139382 38046
25798 38046 67906 48991 94561 123377 8564 -84139 -143304 -219751 -201330 -162868 -177851
25787 -177851 -97342 72719 124137 39700 47375 45721 57460 35526 -97447 -216711 -172723
25776a72723J7296J1769J00408J83447P9105j7392q2562k5665P5972k41272j36729
25765b08346M1788J31563N0606K9118q1118n1897k270M9542Q8344L7755l8581
25754D6504p4769k8601P864J3847m1543P376l3732l0605N5333n2724n8954Q8978
25742a01026P0660Q6852j0955j8197M1667o9606n3832J9129j0785P828M4453L5351
25730D1539M6752j9828j71311o1317J26898L8031j08400L0744P8184P8233l7953
25719D1572n0359Q6385M9054j0339k6449K3124J11069o2079p1186m2518M8963
25708I7237q228j8884N1611J01385o8584p0066j17214m9053K9696K1073l8449
25697f9476o7500l2915m5734L9534J14365q1712r2559N8219k4065l4621P8073
$$ plain form
25776 -172723 -155427 -143658 -43250 140197 219302 201910 119348 93683 169655 -71617 -208346
25765 -208346 -166558 -34995 15611 44729 -36389 -88286 -90556 -41014 47330 85085 46504
25754 46504 -28265 -56866 -49002 -35155 -76698 -69322 -103054 -133659 -78326 -131050 -190004 -101026
25742 -101026 -30366 56486 45531 27334 69001 -605 -54437 -35308 -46093 -38265 6188 41539
25730 41539 88291 68463 -102848 -164165 -37267 764 -107636 -76892 1292 79525 41572
25719 41572 -8787 77598 126652 116313 89864 112988 224057 161978 90792 48274 97237
25708 97237 89009 70125 121736 223121 154537 84471 -32743 -81796 -52100 -31027 -69476
25697 -69476 -136976 -169891 -215625 -176091 -61726 -143438 -235997 -177778 -201843 -236464 -158391
25686a58391k7934N388K107O8706l1745P409J03156j3551k2530l9340J06506Q4016
25674H3797r0221q9445p703m0170N991j4976J36274K7841q909R380L6431m5841
25662B449j12978O1390q5093k4971M2650K1512J6585L1610J2687k881l5979K713
25650g0306L0533m7552Q9062M4347K1446q3247j03609l8640M1680o1610k356j8688
25638a98940n924j5351J504J5994M5089O7015K7080O2853j5709j22390k3158J17958
25626d3979P4388N649R4048L370o291k9003p3082J40431q41j66832j7275L7547
25614A8130m8015K9048K7681k2534l3831M6745r7650n1093J05997R073J3123m846
25602h172p398j04208M6953J16240K0355N9642O690j07674j14254J68006J07694
$$ plain form
25686 -158391 -186325 -180937 -178830 -110124 -141869 -134460 -31304 -44855 -67385 -106725 -219 83797
25674 83797 -6424 -95869 -103572 -143742 -137751 -152727 -16453 11388 2479 11859 48290 2449
25662 2449 -110529 -49139 -134232 -159203 -116553 -95041 -78456 -46846 -34159 -37040 -73019 -70306
25650 -70306 -39773 -87325 1737 46084 67530 -15717 -119326 -157966 -116286 -177896 -180252 -198940
25638 -198940 -204864 -220215 -218711 -202717 -157628 -90613 -63533 -680 -16389 -138779 -161937 -43979
25626 -43979 30409 36058 130106 133476 127185 98182 25100 165531 164690 -2142 -19417 18130
25614 18130 -29885 -837 26844 4310 -29521 17224 -80426 -131519 -25522 -16449 -3326 -8172
25602 -8172 -15570 -119778 -72825 43415 63770 123412 130102 22428 -91826 76180 183874
25591A83874L7832P1505M3417N2257k6949K6066m9594j75062q138j31688q4299
25580f0779K6010J0873m3991p479J07952q0981L0453P9055k8055k4345J5351m4982
25568b0918j00428Q0572L3776n4792J51212L2624M6142k450o7829O5882J2142
25557A75933j57327J5180J6164J66375P8644m4634j28539p7944Q0407L9159n0875
25546A12543j940j47764K6897m8448o0249P6348j1940K1730P7931l6182n4887
25535d5961K6162K9362O719q297l6725n5500m6015K9093P9794R303k8496J20086
25523G9525O4083n9515n1457r0036q1729R64m8860o264N4509M2741n2694M7821
25511a00912J33026j3476L755N6431n6766n1341K5545J05109N0474o8047p5356
$$ plain form
25591 183874 221706 293211 336628 388885 361936 388002 338408 163346 155208 23520 -60779
25580 -60779 -34769 -23896 -67887 -75366 32586 -48395 -17942 61113 33058 8713 24064 -20918
25568 -20918 -121346 -40774 -6998 -61790 89422 122046 168188 165738 97909 163791 175933
25557 175933 18606 33786 49950 216325 294969 250335 121796 43852 124259 163418 112543
25546 112543 110603 -37161 -10264 -58712 -118961 -42613 -54553 -32823 45108 8926 -45961
25535 -45961 -19799 9563 16282 7985 -28740 -84240 -130255 -101162 -21368 -12065 -40561 79525
25523 79525 143608 84093 32636 -57400 -139129 -138165 -187025 -193289 -138780 -96039 -148733 -100912
25511 -100912 32114 18638 22393 78824 22058 -29283 -3738 101371 151845 83798 8442
25500H442m3845J3493q123J48167J3807m5023n6005L2123n6838R3025J7304l3156
25488H3371p9569j57294j02814O3330J24774J24891N8350K0449K2215m3984n8269
25477E5450j02559n0379o8756J55504L6026r0264R3205P7595j42882n9171o464
25466a02695O3474R2160M1954L9021N3731k6360j19454q2699r4131k8381J7371
25455a46009R9781p291m6890l5694J16935Q4463k239R134L2142n333m3313Q543
25443F4229N5578j17583K4288j5415j12100K6823J37625M7244k9275p4811L6968
25432D3571O1625J11761Q6191L7428l8663r8977k1247j70823o3244J9221J08289
25421G5132J55347l9690j37996J0306P675l2233l9667J34862m0853n6507J1797
$$ plain form
25500 8442 -35403 -21910 -30033 118134 131941 86918 30913 63036 6198 99223 116527 83371
25488 83371 3802 -153492 -256306 -192976 -68202 56689 115039 135488 157703 113719 55450
25477 55450 -47109 -97488 -166244 -10740 25286 -64978 28227 105822 -37060 -96231 -102695
25466 -102695 -39221 52939 94893 133914 187645 161285 41831 -40868 -134999 -163380 -146009
25455 -146009 -46228 -53519 -100409 -136103 -19168 65295 63056 72190 104332 98999 55686 64229
25443 64229 119807 2224 26512 11097 -101003 -74180 63445 110689 81414 6603 43571
25432 43571 105196 216957 303148 340576 301913 202936 181689 10866 -52378 -33157 75132
25421 75132 230479 190789 52793 63099 70774 38541 -1126 133736 92883 36376 48173
25410D8173j925k044R2776q9502j6952J9048K1446q1281o809M6012K7656j1629
25398D4969k1850k4020R073J26508J7747q3497j4401R4200J20016q3469r6785
25387H8491p0066o1664p8482L6240n1842J2684l5188M0635R780N8654k3385j25204
25375a99347J4845J66925J67325L6151L6970k11731j14953N7215M5507n6257L5648
25364b1702L6138l835j9996k632K4128M7796M003M315j36807o9339J50710L7269
25352E0048L9000J9742m1928r9216J7592P3033j8178P4780L040J3950n0033M7866
25340A29696Q5040J26279r6062m6541k6268K7578J1546l6638j27476l8994R109
25329A7269j65947K4585J22283n1549j02429N9177J06456n9540j65967J0747J42949
$$ plain form
25410 48173 46248 44204 136980 47478 30526 49574 71020 -10261 -17070 28942 56598 44969
25398 44969 23119 -901 8172 134680 152427 68930 54529 148729 268745 185276 88491
25387 88491 18425 -43239 -121721 -85481 -137323 -124639 -159827 -119192 -109412 -50758 -74143 -199347
25375 -199347 -184502 -17577 149748 185899 222869 11138 -103815 -46600 -1093 -57350 -21702
25364 -21702 14436 10601 -9395 -12027 12101 59897 63900 68215 -68592 -137931 12779 50048
25352 50048 89048 108790 66862 -32354 -14762 58271 40093 114873 117913 131863 81830 129696
25340 129696 214736 341015 244953 198412 172144 199722 211268 174630 47154 8160 17269
25329 17269 -148678 -124093 -1810 -53359 -155788 -96611 9845 -49695 -215662 -204915 -61966
25318f1966R5123j46347l5674J05767O33M386k1427l7954J2480K7798j3927J720
25306f9388P8081j7834M941n693j118Q6295J1170j9760L1607l7598k7429K2313
25294E5587M4211l4405M8756L0029m7016K7925j47915j15345j2778k1367k3968
25283a96286M676O8410J25960N1929Q1751k4811n4764l6076J15270o8814m1180
25272B6065O035q2444l8399m3092J2379R9088m5228o1707j0889L9619q1431R3406
25260h6598M2266j1399J3107M2767k823M589q500m8800k9220j1052k0233K0782
25248i5114O9959r114L4336p6338O3168K5109l5734p2391K9802k2230J07174R2327
25236A10954K6245P3825M301L6848P1010p9859j29667r8201k2857n3751J6698
$$ plain form
25318 -61966 33157 -113190 -148864 -43097 -42464 -38078 -59505 -97459 -84979 -57181 -71108 -69388
25306 -69388 8693 -9141 -4200 -9893 -11011 75284 86454 66694 98301 60703 33274 55587
25294 55587 99798 65393 114149 144178 97162 125087 -22828 -138173 -150951 -172318 -196286
25283 -196286 -191610 -123200 2760 54689 136440 111629 56865 20789 136059 67245 26065
25272 26065 32100 -50344 -88743 -131835 -119456 -20368 -65596 -127303 -138192 -98573 -180004 -86598
25260 -86598 -44332 -55731 -42624 143 -2680 1909 -6591 -55391 -84611 -95663 -115896 -95114
25248 -95114 -25155 -34269 67 -76271 -13103 12006 -23728 -96119 -66317 -88547 18627 110954
25236 110954 137199 211024 215325 252173 323183 243324 113657 15456 -7401 -61152 -44454
25225d4454M5550j5672L1934K2934Q4966O2402l608n3900M4055J9990m3576j4273
25213A36348n7080m2074j01566k4235J8813p975J2291J0991k2918m2732k2210
25202a42347R398O7930K9544o327J5984N2649m9239p9028m3891M7135m2898k880
25190a43970l7859l5125R880J78448J17824o5587Q4287k826R853L0845K5577q843
25178A62504j01182j07786q2440J4043m7428k3051J57089J21804P8788p2616J6132
25167A15857o785n2215n5998j18220M144K8603J04711J3565n697j01965j08095
25156a82095q5092J2930O4771J7956J10809R8886J7444L947m1062L1166K0304
25145F9964K6837j1330p6505j31129m5483k1422R7746K42848J39329q5158j34060
$$ plain form
25225 -44454 1096 -14576 17358 40292 125258 187660 184052 130152 174207 194197 150621 136348
25213 136348 79268 37194 -64372 -88607 -69794 -77769 -65478 -54487 -77405 -120137 -142347
25202 -142347 -132949 -65019 -35475 -41802 -25818 26831 -22408 -101436 -145327 -98192 -141090 -143970
25190 -143970 -181829 -216954 -207074 -28626 89198 23611 107898 105072 114925 145770 171347 162504
25178 162504 61322 -46464 -128904 -114861 -162289 -185340 -28251 93553 172341 99725 115857
25167 115857 109072 56857 859 -117361 -113217 -84614 20097 33662 27965 -74000 -182095
25156 -182095 -267187 -254257 -189486 -171530 -60721 38165 55609 59556 18494 49660 69964
25145 69964 96801 85471 8966 -122163 -167646 -189068 -91322 151526 290855 205697 71637
25134G1637L404n6870J2415j8302K3101J8743N068j29029N3266N2079j11036n5761
25122a31285L5594l2772L8653N5897l6613k3643j0633m736K1296q183J2353Q5377
25110A305J3962o5971k9224O68M7809o0782k8887K3899j8934l7183L6033R9380
25098a7925q4988o4047L8456N347P2699l7890j51792j03580J14463J87560J12349
25087G0652r0707K8473n4611m9609K1001J14755J5852j37922M366O9603K1058
25076A2911j02128j7847O2550L9465M123k8060O6388R6670O242R2650J14612n1548
25064B96028j03475n071j25332l7393l2087J29858l1461j0033j2374k8080R4794
25053A35374o3589j17594N5921p6205M680r2269J86247M2350m3702p5953K7720
$$ plain form
25134 71637 75041 18171 30586 12284 35385 54128 59196 -69833 -16567 35512 -75524 -131285
25122 -131285 -95691 -128463 -89810 -33913 -70526 -94169 -104802 -109538 -88242 -96425 -84072 1305
25110 1305 15267 -50704 -79928 -79260 -31451 -92233 -121120 -97221 -116155 -153338 -117305 -17925
25098 -17925 -102913 -166960 -128504 -123157 -50458 -88348 -240140 -343720 -229257 -41697 70652
25087 70652 -20055 8418 -46193 -95802 -74801 39954 55806 -82116 -77750 -8147 12911
25076 12911 -89217 -107064 -44514 -5049 -926 -28986 37402 134072 140314 232964 347576 296028
25064 296028 192553 187482 62150 24757 -7330 122528 91067 81034 68660 40580 135374
25053 135374 71785 -45809 10112 -66093 -61413 -153682 32565 74915 31213 -44740 -17020
25042a7020J7765r7879n9056J17804p0311N459L4353M6603j0138j9409M8427n6783
25030f0185m388o0166O1424K3762K0440j4425n9202O2249m3357M409L9977L0232
25018G70q5765o517N9215l0555p5142J08428o7509p1737L3511J13542P7327R812
25006F5380o6107k9520m8256J18575K1798p7130j03875J07421K0967k721L8539
24995D5071l5034Q518M5581m8820m6076M90k1576j54907k485J42079R5434p6422
24983d8147O1233Q9319j02730k840l0334K1147p7233p1381R9657M9480n2497q2035
24971a46361n8978J4134J06854L4576N9021L285j27172j27369J40156J90221L2241
24960A20608k02p067m793j83017j17886J48404N2923l028j4974N350k3030J01172
$$ plain form
25042 -17020 745 -97134 -156190 -38386 -108697 -103238 -68885 -22282 -32420 -51829 -3402 -60185
25030 -60185 -64573 -124739 -63315 -39553 -19113 -33538 -92740 -30491 -73848 -69439 -29462 770
25018 770 -84995 -91512 -32297 -62852 -137994 -29566 -97075 -168812 -135301 -21759 55568 65380
25006 65380 -727 -30247 -78503 40072 61870 -15260 -119135 -11714 9253 6532 45071
24995 45071 10037 18555 64136 15316 -30760 -30270 -51846 -206753 -209238 -67159 28275 -48147
24983 -48147 13086 102405 -325 -3165 -33499 -12352 -89585 -160966 -61309 -11829 -64326 -146361
24971 -146361 -205339 -191205 -84351 -49775 9246 12531 -114641 -242010 -101854 88367 120608
24960 120608 120406 113339 108546 -74471 -192357 -43953 8970 5942 -9032 -3682 -26712 74460
24948G4460K1746o7943n8592r5514k1485J76714J1008l5964O4144R8300r520o6950
24936I0404n9905Q0949J6591K1736P414j00648N0370N9038L931K0238n5740j6465
24924A17913j46418j8183N3603M3830J47440M9954q4162k1129l4047Q612j32257
24913a4844M9477J5167K6936o8108q1381k7104L7858N0872q172p409M4025M7114
24901F4431k666o6493j31370k7953M6865K42378J04343M1987L2344n9245o1653
24890A82968r5679P2685k2484m7832M8371K8228j12104j70198J13682O4723J4327
24879G6687j02432k8818j2736J20951k7242o5476l3714K6457m3855n4594p984
24868a52756k0395p9101K0281J40969J4417n1923J0352J11214O2388N7585q5980
$$ plain form
24948 74460 96206 28263 -30329 -125843 -147328 29386 40394 4430 68574 166874 157354 90404
24936 90404 30499 111448 128039 149775 157189 56541 106911 165949 169880 190118 134378 117913
24924 117913 -28505 -46688 6915 50745 198185 248139 163977 142848 108801 117413 -14844
24913 -14844 34633 49800 76736 8628 -72753 -99857 -61999 -11127 -19299 -26708 17317 64431
24901 64431 61765 -4728 -136098 -164051 -117186 125192 229535 271522 303866 244621 182968
24890 182968 87289 159974 137490 89658 138029 166257 54153 -116045 -2363 62360 76687
24879 76687 -25745 -54563 -67299 53652 26410 -39066 -72780 -46323 -90178 -144772 -152756
24868 -152756 -173151 -252252 -231971 -91002 -76585 -128508 -118156 -6942 55446 113031 27051
24857B7051m8064J06663L2429j41327l7630n0931J8322J2384m2771m2139Q9675
24846g6338M5360Q9275K5360o3220j22543K6820J27669P5191p1869q4295j7154
24835d5744J12870J5521o4893j2652O2468K2957K0384l1044n0459j5477q6467
24824g2536P4596O1547p5983k3239j61462m0008N2420J22557N0192K9027J8297
24813C5408j9385J7538O557n4519n3356J16374q1846j77233N811j1230J10078
24802a05803L9308m8846o189N3290N9956r2703J4892O9812P8424j5812o6675j3175
24790c3521N7559p7178r6927O1288N2615L346p0857l1275N8289l400o1885K3205
24778a18741O7754Q1202j2401j02528j04780L6542L4678o600J04417P7702m0969
$$ plain form
24857 27051 -21013 85650 118079 -23248 -60878 -111809 -93487 -81103 -123874 -166013 -76338
24846 -76338 -30978 58297 83657 20437 -102106 -75286 52383 127574 55705 -28590 -45744
24835 -45744 67126 82647 17754 5102 67570 90527 110911 79867 29408 13931 -72536
24824 -72536 2060 63607 -12376 -35615 -197077 -237085 -184665 -62108 -11916 17111 35408
24813 35408 16023 33561 40118 -14401 -67757 48617 -33229 -210462 -204651 -215881 -105803
24802 -105803 -66495 -115341 -121530 -68240 -8284 -100987 -86095 -16283 62141 46329 -20346 -33521
24790 -33521 24038 -53140 -150067 -88779 -36164 -32818 -103675 -134950 -76661 -80061 -141946 -118741
24778 -118741 -50987 30215 17814 -84714 -189494 -152952 -118274 -124874 -20457 57245 16276
24767A6276Q0419O7024K9283o002j44200J0297M3430O8184q7414j8600k7080J59833
24755A91450Q1888l9976r0252o4736k8410j18760Q1496L6475m7009M3698p5402
24744b9538n9430l1236n4623O3743J9959M1494P376j2532Q9813Q0544l245J4402
24732A26727n8088n9084L2844L8524P691j29283P903J0207R018p8344o4452l1175
24720a87512p453O1292n936J1338M0307Q0119N3185K7052j18796J09185j11012
24709d8231J2684K484l7654m4942J07051P3701R8023r6611k35289J77556P0523
24698G9295q8966j09512L4547K9412m3948J0328N4455K226P3028O5043R753J1102
24686A26763L4603l6393j18170j30009O340J89135N175J0518j8839K4174n1073
$$ plain form
24767 16276 96695 163719 193002 187000 42800 53097 96527 164711 77297 58697 31617 191450
24755 191450 273338 233362 143110 78374 49964 -68796 12700 49175 2166 45864 -29538
24744 -29538 -88968 -120204 -174827 -111084 -91125 -49631 -42255 -54787 35026 115570 112325 126727
24732 126727 68639 9555 42399 80923 88614 -40669 -32766 -22559 -13541 -91885 -156337 -187512
24720 -187512 -194965 -133673 -139609 -128271 -87964 -7845 45340 72392 -46404 62781 -48231
24709 -48231 -35547 -33063 -70717 -115659 -8608 65093 163116 66505 -168784 8772 79295
24698 79295 -9671 -119183 -84636 -55224 -99172 -88844 -34389 -32163 40865 105908 115661 126763
24686 126763 161366 124973 6803 -123206 -116866 72269 77444 87962 69123 93297 42224
24675D2224p9305M257N870r3079j13580k2320m018j4550Q4029Q5012M6068q9866
24663a49258L627N5366R5174K5296L8295j7723m3948J01603q4079j28335k1262
24652a25244K5847L1753M5386J52521O4018l175k1524K352l332J43494m4472j54684
24640A12940k8128k4472m2505k3232l4098J16508J65974N663K4904M9102n4923
24629B67733q492p7139r1074j2631j03259j97856n0259R6351J0349K3598J10874
24618c1805K75m526l6934l6965K7758R5064K5895q0874O2979J75959J9207j28440
24606H7593j67270j5178q7675J553L1603M9507k0853M7945O9501o3468l0084j307
24594i8133M3679o380O2998p8752k0764k546N3244L7680j38159J07603O4464L1072
$$ plain form
24675 42224 -37081 -32824 -26954 -120033 -233613 -255933 -259951 -274501 -190472 -105460 -59392 -149258
24663 -149258 -145631 -90265 4909 30205 68500 50777 6829 108432 24353 -103982 -125244
24652 -125244 -99397 -67644 -22258 130263 194281 191106 169582 171934 168602 312096 267624 112940
24640 112940 84812 60340 17835 -5397 -39495 77013 242987 248650 273554 322656 267733
24629 267733 259241 182102 91028 78397 -24862 -222718 -272977 -176626 -166277 -142679 -31805
24618 -31805 -31530 -36056 -72990 -109955 -82197 12867 38762 -42112 20867 196826 216033 87593
24606 87593 -79677 -94855 -182530 -180977 -149374 -99867 -120720 -72775 -3274 -66742 -96826 -98133
24594 -98133 -54454 -60834 2164 -76588 -97352 -99898 -46654 -8974 -147133 -39530 24934 56006
24582E6006k5120q618O5965P4753M492K6772n1579j29320j3218M100l3834k8684
24570e8285q8604l9167n4280K7130J15561O226o7113O6413J18617Q5161K1344
24559A33003L2389r711j88517j79115K390R5033l2648o710q6000L8366J00449
24548a01071Q972j6653k838P2975R4509Q9759j01587N4016J23630k1358K3920
24537B24274p0623P713o9921k1007l3931L7384R9748j94270k19945J33403P9185
24526b7990M709m2115N659o0773J1827p1949l0484Q564J4772L1643J51671J17508
24514A13042j1218p1211L0641P7192O2864Q192j14388j20002q8987K4864L4898
24503e4113R8568J68881K7625j65831k26405n5507m5462J48472O6947o1732M9710
$$ plain form
24582 56006 30886 22268 88233 162986 167478 194250 142671 13351 133 4233 -29601 -58285
24570 -58285 -146889 -186056 -240336 -213206 -97645 -91419 -158532 -92119 26498 111659 133003
24559 133003 165392 155681 -32836 -211951 -209561 -114528 -147176 -153886 -239886 -201520 -101071
24548 -101071 -92099 -108752 -111590 -38615 55894 145653 44066 98082 221712 200354 224274
24537 224274 153651 161364 91443 70436 36505 73889 173637 -20633 -240578 -107175 -27990
24526 -27990 -23281 -65396 -59737 -120510 -108683 -180632 -211116 -202552 -187780 -156137 -4466 113042
24514 113042 101824 30613 61254 138446 201310 209502 95114 -24888 -113875 -89011 -54113
24503 -54113 44455 213336 240961 75130 -151275 -206782 -252244 -103772 -36825 -98557 -48847
24492d8847M3682K9107k95P1182l4847j088k6546j82837o6174M1833J3908N9113
24480a01809J1267L4699R2609k0537o1408n0125q4596o8922J11553J37124j0811
24469a0956j0757k6471r6040o7515J201J13532J17248q249l2572p290q137N4105
24457A8099j2779N4596p8714j88050K0227Q4482N8006j9992k4965M1366P20Q398
24445c8606N3410M4892L278r2787k9675N2134p5053J7401R5521L2792N9336k183
24433A20460j03911n0273J08189n583j49877O6458M1016r1411m9660q166M6400
24422g6358L8548M9722J717P818J67436Q9369m1817o3701j21965m0969Q2187K3734
24410A15721J1301L0922m1011n5264j41556j31253q1424j6772J12932Q8315J7310
$$ plain form
24492 -48847 -5165 23942 23647 94829 59982 58894 32348 -150489 -216663 -174830 -160922 -101809
24480 -101809 -90542 -55843 36766 16229 -45179 -95304 -179900 -248822 -137269 -145 -10956
24469 -10956 -21713 -48184 -144224 -211739 -210538 -97006 20242 11993 -20579 -27869 -36006 18099
24457 18099 5320 59916 -18798 -206848 -186621 -102139 -44133 -64125 -89090 -47724 -47004 -38606
24445 -38606 14804 59696 62974 -29813 -59488 -7354 -82407 -65006 30515 63307 122643 120460
24433 120460 16549 -33724 74465 68882 -80995 -14537 26479 -64932 -114592 -122758 -76358
24422 -76358 -37810 11912 13629 21447 188883 278252 236435 172734 50769 9800 91987 115721
24410 115721 127022 157944 116933 61669 -79887 -211140 -292564 -309336 -196404 -108089 -90779
24399i0779K4534M943M8069j23695m4247M5965l5475l3254R0612M5028J52109
24388H3810R8024k0413j63212o8185O2362p2097k4151M7356n7640O1690L2462
24377a9994o6122P3359K1416j17231j6830K0951J08678L8104j24624j27086O1900
24366a47479J59329O3355M1033j12246k0478M1783l2005n3723M8381P6719l5510
24355B9159P1646N0256J5675j18065j55627k0456M4498J14855Q7972p4059J0809
24344E6663J31252R8406j59069k25392m8134r242R4979J47152L1378j44419p2689
24333i9115l4746Q7865R7504L995J2051K7378j7695q6971j9510O429l3666l86
24321e6867Q1769p0445j59164k6433J62215p0915L6746Q2332J11881J9960L5559
$$ plain form
24399 -90779 -66245 -61302 -13233 -136928 -181175 -135210 -170685 -203939 -113327 -68299 83810
24388 83810 181834 161421 -1791 -69976 -7614 -79711 -103862 -56506 -114146 -52456 -19994
24377 -19994 -86116 -12757 8659 -108572 -125402 -104451 4227 42331 -82293 -209379 -147479
24366 -147479 11850 75205 116238 3992 -16486 25297 -6708 -60431 -12050 64669 29159
24355 29159 100805 151061 166736 48671 -106956 -127412 -82914 31941 119913 45854 56663
24344 56663 187915 286321 127252 -98140 -146274 -155516 -60537 86615 117993 -26426 -99115
24333 -99115 -133861 -45996 51508 55503 67554 94932 77237 -9734 -29244 -22815 -56481 -56867
24321 -56867 24902 -45543 -204707 -231140 -68925 -139840 -103094 -20762 91119 111079 146638
24310A46638k8620l0176J2782n8725o28M1740O7637k314j57670l8616o495R109
24298d5338N7430M750j0607n3294J02104J6591o885j0661m2367j41226O7834N4198
24286g471J3872O513k3958l8638Q0378J05722n074m6739q0751L360K9736J07608
24274A44558o1020j6499j32879p8326p8785K3631J22129J1741j285J0774J8421
24263c7540L6953l9365m3462K0140K2481J39813J203J6321m3931j04465m7497
24252g9349K5481P7303M4453j4403K4278J2515m1897R2022m3384P626o9993m5405
24240a0753J72596J19691J07665J97969L36656M22027N03507N60029K84469K1539
24230B715395l58324m10958k60714l61440l67611j94400k22777j19549j01167
$$ plain form
24310 146638 118018 87842 100624 41899 41271 83011 150648 148334 -9336 -47952 -54447 -45338
24298 -45338 12092 16842 6235 -47059 55045 71636 64751 54090 11723 -129503 -61669 -7471
24286 -7471 6401 12914 -11044 -49682 30696 136418 131344 84605 3854 7214 36950 144558
24274 144558 83538 67039 -65840 -144166 -222951 -199320 -77191 -65450 -66735 -55961 -37540
24263 -37540 -587 -39952 -83414 -63274 -40793 99020 100223 116544 72613 -31852 -79349
24252 -79349 -53868 23435 67888 53485 77763 90278 48381 140403 97019 104645 34652 -10753
24240 -10753 161843 281534 389199 587168 923824 1345851 1849358 2409387 2693856 2715395
24230 2715395 2357071 1946113 1685399 1323959 956348 761948 539171 419622 318455
24221C18455M8467K6685j7401r5233l9777M8876m2495m6698J5569k3273n455K5825
24209B13545M492K9670M2425L251j06023j30499j12417o7925k1238N2265L5036
24198e7418Q0615J7132p7849p5680J24231R2646q4359Q855O0001O7901n663p2202
24186G8210l6891j6099O095J5361o5252n9255o5157j679k5147R1015J04699j0954
24174A4946n6282k5486K7792K7595o9188o8129M8185P7515m4888m6381L3045m2851
24162a24127K5913J07428k3811j30309j1869J78010P7908j9677q0736K151m0439
24151c9558q0621p3673K4663K2983J15338J8611q8607Q1258o617J8980Q7754O7504
24139A48015Q2405k3199j83998k8317L9823R735l9544P4781R4818k0826Q828O9045
$$ plain form
24221 318455 366922 393607 376206 280973 241196 290072 247577 200879 216448 193175 187720 213545
24209 213545 218037 247707 290132 293383 187360 56861 -55556 -123481 -144719 -92454 -57418
24198 -57418 23197 40329 -37520 -113200 11031 103677 19318 28173 88174 156075 150412 78210
24186 78210 41319 25220 31315 46676 -18576 -77831 -142988 -144667 -169814 -78799 25900 14946
24174 14946 -41336 -66822 -39030 -11435 -80623 -148752 -100567 -23052 -67940 -114321 -81276 -124127
24162 -124127 -98214 9214 -14597 -144906 -156775 21235 99143 79466 -1270 881 -39558
24151 -39558 -120179 -193852 -169189 -146206 -30868 -12257 -100864 -19606 -26223 -7243 80511 148015
24139 148015 230420 207221 23223 -5094 34729 44464 4920 79701 174519 153693 162521 231566
24127B31566k0941m4359R807J9074N6893L3468k4269j9414k9908j53117q3179
24116b4379K9864L0733k1289n941P9072J18415l256q7873o4836R6454R465j27554
24104B8875j21083P3524R1902J67615o090p5619r8578N9391O2264N6569m4622
24093A94148o8643r0007L8167P0369n221O6886j51624o6068Q6426K7269K2512
24082A24214R7711m92o251M1844p3176q8762m7382j545O7184K3556p2410O1489
24070A25980j0288j84464k3585L2021K5253J8654L990n2848r6486p6897M9913
24059a88757J37554L2302l0310P5866J27717j22864j07634n8218M520J71789j0764
24048C1201J8657M4170j03397q9204L6216M5639P0115P094j4961P6995Q6606o669
$$ plain form
24127 231566 210625 166266 176073 195147 252040 285508 261239 241825 211917 58800 -24379
24116 -24379 5485 36218 14929 8988 88060 206475 203219 115346 50510 146964 156429 28875
24104 28875 -92208 -18684 73218 240833 234743 159124 60546 119937 182201 238770 194148
24093 194148 125505 35498 73665 144034 138813 205699 54075 -11993 74433 101702 124214
24082 124214 221925 221433 215182 257026 183850 95088 47706 46161 113345 136901 64491 125980
24070 125980 115692 -68772 -92357 -60336 -35083 -16429 -12439 -65287 -161773 -238670 -188757
24059 -188757 -51203 -18901 -49211 26655 154372 31508 -76126 -134344 -129824 41965 31201
24048 31201 49858 94028 -9369 -98573 -62357 -16718 53397 60491 45530 122525 209131 202462
24036B02462j10373j04703K643j6114Q282O501M3873M7796p7969j21583K254n9138
24024a76069O7535P5772j7201j00755l4915J22150Q6288j7827o7308Q2304O6537
24013H6511r2842r0966n8483Q3817Q9766Q8155M9450R6219l2123k6578M5797K5708
24001B64431K9119k4426j5335q0836J3307L5937m0273j8023l1066k3402J8038
23990A27471k012r349q6627k2797K4893P3443m1328o1141Q5428L8555J3415M6896
23978A86847j62748k6742n591K015R3708M6294K0065j4465N4294K1470j08986
23967A06161o5272M0630J7442O3023L0382j51958M655R9739m2487j1788p9097
23956A1430n3187K4992M1284k1985L1515L1099N7964N3661M1661m914m2069j66571
$$ plain form
24036 202462 92089 -12614 -9971 -26085 -17803 -11302 32571 80367 2398 -119185 -116931 -176069
24024 -176069 -108534 -32762 -49963 -150718 -185633 -63483 22805 4978 -62330 19974 86511
24013 86511 -6331 -97297 -155780 -71963 17803 105958 155408 251627 219504 192926 238723 264431
24001 264431 293550 269124 253789 172953 186260 222197 181924 163901 132835 109433 127471
23990 127471 125459 116110 29483 6686 31579 105022 63694 2553 87981 126536 139951 186847
23978 186847 24099 -2643 -8234 -6219 87489 133783 153848 139383 193677 215147 106161
23967 106161 40889 81519 98961 161984 192366 40408 45063 144802 102315 90527 11430
23956 11430 -41757 -16765 24519 2534 34049 65148 123112 176773 218434 213520 171451 4880
23944D880n9005j509K0995L9738J34013R7177j08295J3015J28344J567K3166j70222
23932A23864o5941k4076P4133l507n7997R248J29073O2607J2905j9426M1171O0325
23920C42379P4916L3342J7910Q1958O0187r3494N4952o3627r2505r4161n8647
23909B63210p1648j04904n4204n1518o3940j00498j7566L1763J22969k8881L1227
23898d3990Q4909K8791O878Q690J9151O7806j57557r5370j290O1440O3654M4952
23886H8064l3092R9124Q57P18j7164Q7311J13996l4333m2788k3997l5328N2060
23874B55428j8334k9430K1230j5183j466J03835j7545L4545M4819o1565n9515
23863B56819l7678o1081j01716Q186Q580N7399K4854M00k2143q693K2019K7337
$$ plain form
23944 4880 -54125 -55634 -34639 5099 139112 236289 127994 141009 269353 270920 294086 123864
23932 123864 57923 33847 107980 104473 46476 55724 184797 247404 260309 240883 282054 342379
23920 342379 417295 450637 468547 550505 610692 517198 572150 508523 416018 321857 263210
23909 263210 191562 86658 32454 -19064 -83004 -183502 -201068 -169305 -46336 -75217 -43990
23898 -43990 40919 69710 76588 85278 104429 172235 14678 -80692 -81982 -20542 43112 88064
23886 88064 54972 154096 154953 155671 138507 225818 339814 305481 262693 238696 203368 255428
23874 255428 237094 207664 228894 213711 212245 316080 298535 333080 377899 316334 256819
23863 256819 219141 158060 56344 64530 73110 130509 155363 155763 133620 124927 146946 174283
23851A74283R5896r2769n568l6974n6820n2818j37083r2843K4337o368m5524O3162
23839a69089O8044N3873M2422O6143R2981P8904p4193m5677k7427J2881r5833
23828C029k6744R7779j6489j90641P3991J02220K5692m513L0022j7737O8974J15623
23816B61206o8609j15962l9051k6048R1383N218K2971r175Q1839J41466J05046
23805D50284N2972j67630j54545n0671O418M2635J00022P5220M9741P5211J47725
23794F27382J63048K19201J55761LO7620j00691n8567j93375l37428p9726J07374
23783E70602q6197n9002l3919R6271N3538k5356M7776p6785n9928q9484q7744
23772B49772l8292J682N2714M5559l1029M7678o1410j39459R2930Q1119L9611
$$ plain form
23851 174283 270179 177410 171842 134868 78048 25230 -111853 -204696 -180359 -186727 -232251 -169089
23839 -169089 -101045 -47172 -4750 61393 154374 233278 159085 113408 85981 98862 3029
23828 3029 -23715 74064 57575 -133066 -59075 43145 68837 64324 94346 76609 145583 261206
23816 261206 192597 76635 37584 11536 102919 108137 131108 121933 203772 345238 450284
23805 450284 503256 335626 181081 130410 136828 179463 279485 354705 404446 479657 627382
23794 627382 790430 1009631 1165392 1165395 1233015 1132324 1073757 880382 542954 463228 570602
23783 570602 484405 425403 391484 487755 541293 515937 563713 486928 427000 337516 249772
23772 249772 211480 213162 265876 311435 280406 328084 266674 127215 220145 301264 340875
23761C40875m4313O7760n5901p6782L3618J14825N3900n8318M4977q33N0287P6877
23749E46972N4304J14965K22546L11882L32764M35877L47196M16671L09006q5624
23739C006559l91749m67072m72177l15676k17942j94174k40182o2495N8798J21834
23729H25724r3551q4191M5108k4206j0626m8380k5079P8421K09879R6082J8800
23718I87981O0418J12388J38722N198M785l3166q1642P0274J27033K3930m3558
23707A372363M2769R5743P6665m1122K9821j14905k9238J14729J17661J68087
23697A832573J85304J17893k921J09211J47885K11268K48197K74003L22947K35307
23687C681667L11802K74146L16533M12638N82120O87493R84991J201958J463586
$$ plain form
23761 340875 296562 364322 308421 231639 265257 380082 433982 375664 420641 419808 470095 546972
23749 546972 601276 716241 938787 1250669 1583433 2019310 2366506 2783177 3092183 3006559
23739 3006559 2614810 2147738 1675561 1359885 1141943 947769 707587 645092 703890 825724
23729 825724 732173 647982 693090 668884 658258 609878 584799 663220 873099 969181 987981
23718 987981 1048399 1160787 1299509 1304707 1309492 1276326 1194684 1264958 1391991 1415921 1372363
23707 1372363 1415132 1510875 1587540 1546418 1576239 1461334 1432096 1546825 1664486 1832573
23697 1832573 2017877 2135770 2132849 2242060 2389945 2601213 2849410 3123413 3446360 3681667
23687 3681667 3993469 4267615 4584148 4996786 5578906 6266399 7251390 8453348 9916934
23678I916934J781535K390504L264505M114951N250575O853153R080123J2403810
23670E5056090J7677292K6616038M1103343N9349879P5959997P9055079O2063307
23663D16881025M8986378L473636n1217805n4460689o8042340q5744170n9755642
23656A50120393l3281651j9698557j4051598j0806462q719574q393210q089458
23649D7079883o804197n564294m546704l785718l193039k604326k352596j997374
23641A6231635j695797j464599j270323j149348r10049r30005q02011n87570m77929
23632F944004n27130n36999m96711m21520l30403k27589j93849l22215k44286
23623C643302k38058k24134j73227k60763k59927k69271j84297k97265k49992
$$ plain form
23678 9916934 11698469 14088973 17353478 21468429 26719004 33572157 42652280 55056090
23670 55056090 72733382 99349420 140452763 199802642 275762639 354817718 416881025
23663 416881025 465867403 469341039 418123234 363662545 295620205 209876035 150120393
23656 150120393 116838742 97140185 83088587 72282125 63562551 55169341 47079883
23649 47079883 40275686 34711392 30164688 26378970 23185931 20581605 18229009 16231635
23641 16231635 14535838 13071239 11800916 10651568 9741519 8811514 8009503 7421933 6944004
23632 6944004 6416874 5879875 5383164 4961644 4631241 4403652 4209803 3887588 3643302
23623 3643302 3405244 3181110 3007883 2747120 2487193 2217922 2033625 1736360 1486368
23614A486368j33662K0518p6155j59781j98870j72560j56151l1109j9639J64903
23604G23862k2988Q0201k5261k2753k0572j3725k6178R1697J55504R7006K4882
23593A041675L494r5064j17174J7901J44360M11983M20028M08144L72389L45794
23583B953530J35312k78437l68189l06090m82474l67975m1734k29679n2380L2876
23573I94760o7874k47008j13388j08743P8104j5515q1929k8991J02137O8381K4614
23562F04548p0731j11087j20459r8124l4522J06490j3399r6132J3757K1451L8835
23551B40627J26978M7182N1747j12182j07148q7400k4021J22040N4662O8641j1733
23540C69393j22152r1285N7650M8297j33665j92872p8825K5110J17312J65696
$$ plain form
23614 1486368 1352706 1373224 1297069 1137288 938418 765858 609707 578598 558959 723862
23604 723862 700874 781075 755814 733061 712489 698764 672586 764283 919787 1016793 1041675
23593 1041675 1045169 950105 832931 850832 995192 1407175 1827203 2235347 2607736 2953530
23583 2953530 3088842 2810405 2442216 2136126 1653652 1285677 1243943 1014264 961884 994760
23573 994760 926886 679878 566490 457747 535851 520336 438407 409416 511553 579934 604548
23562 604548 533817 422730 302271 204147 169625 276115 262716 166584 180341 201792 240627
23551 240627 367605 414787 466534 354352 247204 159804 135783 257823 312485 381126 369393
23540 369393 247241 155956 213606 261903 128238 -64634 -143459 -118349 -1037 164659
23530A64659m1307J5968l3794j07671j2020K333J3642M7512L8820p4210j3702
23519B30o6518j5568j9353J9751K9026M3208K4178K7073P6317o8076L1558M6107
23507A27933P6976Q8188j4275j53736j44494k0047M7717K6676J00023J31469L7598
23496C04028j12623l6063q316k7443q6757k8614k2091M4432M8559o1757L3285
23485D6640L2103K4442K8679L5590o409K6697n3148j25779k5126R1070J5132l9271
23473E0620m2636K9462J5188j10152l7238J08621j8284j11794Q9044l0932P784
23462e0317k2309j17149Q3837p6706o0465n9479N2078K1438L9651k611q917L1276
23450a69673M5131r3116o9565L3861M6464J83840J49616n5066k9320K1849R1205
$$ plain form
23530 164659 123352 139320 105526 -2145 -14165 -11832 1810 49322 88142 13932 230
23519 230 -66288 -81856 -101209 -81458 -52432 -9224 14954 42027 118344 50268 81826 127933
23507 127933 204909 293097 278822 125086 -19408 -39455 8262 34938 134961 266430 304028
23496 304028 191405 155342 147026 119583 32826 4212 -17879 26553 75112 13355 46640
23485 46640 78743 103185 131864 167454 161045 187742 134594 8815 -16311 74759 89891 50620
23473 50620 7984 37446 52634 -57518 -94756 13865 -4419 -116213 -27169 -58101 -50317
23462 -50317 -72626 -189775 -105938 -182644 -243109 -302588 -250510 -229072 -189421 -192032 -200949 -169673
23450 -169673 -124542 -217658 -287223 -253362 -206898 -23058 126558 71492 42172 64021 155226
23439A55226n7254q8955k2054K2993O3456n1756o3264N7109M1014p8284l1137
23428e2906P8418m3851p2305J9183J42263M5139m1986n3410J6422P506q7159q81
23416d3567N2663l8193K5292m1136p4010j6969O7514Q7941n6071M4120O1170n1186
23404A7568p5189j42138R518J46964J23027J7850p4257l9595K2374R660j0207
23393E575J5450N5562m5744P4140q0825O1631J29973N635k7319j54022n9335Q8626
23381F9347J5755n7598j00447P1181K6664N0936n6635k7691o7660o6221J2458
23370a29911m0026l4832J15340J43522P7365J51214j6008j55146m4893K4704r8899
23359g570j4182j37753n4342K0729O3570L6l3690n953p3913q571J16208J16908
$$ plain form
23439 155226 97972 9017 -13037 9956 73412 21656 -41608 15501 56515 -21769 -52906
23428 -52906 25512 -18339 -90644 -71461 70802 115941 73955 20545 36967 44473 -42686 -43567
23416 -43567 9096 -29097 -3805 -44941 -118951 -135920 -68406 19535 -36536 7584 68754 17568
23404 17568 -57621 -199759 -190241 -43277 79750 97600 23343 -16252 6122 15782 5575
23393 5575 21025 76587 30843 104983 24158 85789 215762 221397 194078 40056 -19279 69347
23381 69347 85102 27504 -72943 -1762 24902 75838 19203 -8488 -76148 -142369 -129911
23370 -129911 -169937 -204769 -89429 54093 131458 282672 266664 111518 66625 91329 -7570
23359 -7570 -21752 -159505 -213847 -193118 -129548 -129512 -163202 -169155 -243068 -251639 -135431 -18523
23347a8523P6063j8965R4349j7638j14984j8421o2848j6434M0471P7023o835J0441
23335B3699j5880K6605o2584N7332l0881j58302O2000l7493n2538p0659M3782
23324b14919k3363j35486n0739L530L9219J27601K07636R3197L0255O0535j6096
23313A21370K9850p3484j48262n3045O0048J32899J30728Q4820M9742p527L862
23302C31001m7549k76200l9640O0954O6415R8057o0152l3467L4113l1841O4032
23291A65723J7285p5429j49956Q244J29020J6807N8219J01865m4584j05637j75542
23280e3985q6492j6792J65994k5167m7681p096K919j3909k1745J5317j6191L3371
23268g1457Q6410j7290j2595M8867J79482N9412n2221p1769q5361o6353M136o8335
$$ plain form
23347 -18523 57540 38575 132924 115286 302 -18119 -80967 -97401 -56930 20093 13258 23699
23335 23699 7819 34424 -28160 29172 -1709 -160011 -98011 -135504 -188042 -258701 -214919
23324 -214919 -238282 -373768 -424507 -420977 -381758 -254157 -46521 46676 76931 137466 121370
23313 121370 151220 77736 -70526 -123571 -63523 69376 200104 284924 334666 327139 331001
23302 331001 283452 7252 -32388 28566 94981 193038 132886 99419 133532 101691 165723
23291 165723 183008 107579 -42377 -34133 94887 111694 169913 271778 227194 121557 -53985
23280 -53985 -140477 -157269 8725 -16442 -64123 -71219 -68300 -82209 -103954 -88637 -104828 -71457
23268 -71457 14953 -2337 -14932 33935 213417 272829 220608 148839 63478 -2875 1261 -67074
23256f7074m2476k8838J37196K0085J7415P2022Q4372j68149n9115K9424K4712
23245A9574p3997j7573o033L2050K3140j59180j03713J20022L4039P027O2522
23234f2122l4405p9454Q3748M5712L2265q6292j3398R2522J13496P2260k6246
23223A38086L703l6753j11629p1849K6680k1799m3293m680M7041N0652m1486M0505
23211b4822m4021l2020L7441p0322k8728J2578Q3460O2897l2734k2549l9731m0767
23199a39318J6607J25527l234k4862j35541n39j2183j6256n2037O5878k4193K0269
23187a79882M9247J1239M4733J37215k4045o7625N3096K3449Q7625R6296J339
23176B32687j5772r5110j3771l4735n4890r5175r5206k0083M2088R1630M346l1899
$$ plain form
23256 -67074 -109550 -138388 -1192 18893 36308 108330 192702 24553 -34562 -5138 19574
23245 19574 -54423 -71996 -78029 -45979 -22839 -182019 -285732 -165710 -131671 -124644 -62122
23234 -62122 -96527 -175981 -92233 -46521 -14256 -100548 -113946 -21424 92072 164332 138086
23223 138086 141789 105036 -6593 -78442 -51762 -73561 -116854 -121534 -74493 -23841 -65327 -24822
23211 -24822 -68843 -100863 -63422 -133744 -162472 -149894 -66434 -3537 -36271 -58820 -98551 -139318
23199 -139318 -122711 2816 -418 -25280 -160821 -161360 -173543 -189799 -241836 -175958 -200151 -179882
23187 -179882 -130635 -119396 -74663 62552 38507 -29118 23978 47427 135052 231348 232687
23176 232687 216915 121805 108034 73299 18409 -76766 -171972 -192055 -149967 -58337 -53991 -85890
23164h5890o808k4846n789N8030J44843J3114n1756p8484q4410r6963o3012P6017
23152b05954l4544R6596J19318k5167m8855N6325M9590Q2796r0363k6357J16731
23141I0116k7252j34325k4812m6716K81R5799n2466j64252K462J10066J30999
23130b0100o4951p1308k6542p291p407J4190J3884n1668R5161J3808o635M7061
23118g1798M1664l1297j20402K1167J8815O1294j14852m6713J7718M5408j4306
23107a93302o403P8007J20871J28559J35734N3548p0008n3879j36219L1688P0520
23096A59116N6413M1432L5024L5116M6968Q4170J56463K81248M75647M03196L39253
23085B114046L83321J14468k53378k20741l10856m24843l93598k22929j03592
$$ plain form
23164 -85890 -92698 -117544 -123333 -65303 79540 92654 40898 -37586 -121996 -218959 -281971 -205954
23152 -205954 -240498 -143902 -24584 -49751 -98606 -42281 7309 90105 -258 -26615 90116
23141 90116 62864 -71461 -96273 -142989 -142708 -46909 -99375 -263627 -261165 -151099 -20100
23130 -20100 -85051 -156359 -182901 -190192 -197599 -183409 -169525 -221193 -126032 -112224 -118859 -71798
23118 -71798 -30134 -61431 -181833 -160666 -141851 -80557 -195409 -242122 -224404 -178996 -193302
23107 -193302 -199705 -121698 -827 127732 263466 317014 247006 193127 56908 88596 159116
23096 159116 215529 256961 291985 327101 374069 458239 614702 895950 1371597 1774793 2114046
23085 2114046 2497367 2611835 2358457 2137716 1826860 1402017 1008419 785490 681898
23076F81898j14712r5396p1604P3174m1854j52000j32127N4487K5332j50442m8752
23065B8004P0692L7861p4654M4960m5475P156p052k4415K7307N3815r572j36578
23053b7951k9987O7190J7518k2297R8798P5573o8391j4802j4897k6630o9528n4374
23041f9778j12279J8920J4314J6549R9231R5808l7858L92N2272R60p5086q7308
23029h3863m0415k1202K5497J48133J31689j01257j36931n4893K8164R1983O2428
23018D9333l5664k4848p8594o0146J5921N4743J18235N0437K1255L3532P7175
23007B21379j4670m39j03022q7508m7998O3271L4502l0325m7864k5296r5005O513
22995a26462q9645J0108J07568N4647p366l781N5375K8384J72048O954j95272
$$ plain form
23076 681898 567186 471790 400186 473360 431506 279506 147379 201866 227198 76756 28004
23065 28004 98696 136557 61903 106863 61388 68544 61492 37077 64384 118199 108627 -27951
23053 -27951 -57938 9252 26770 4473 103271 178844 110453 95651 80754 54124 -15404 -69778
23041 -69778 -182057 -163137 -148823 -132274 -33043 62765 24907 25299 77571 78531 3445 -83863
23029 -83863 -124278 -145480 -119983 28150 159839 58582 -78349 -133242 -105078 -13095 49333
23018 49333 13669 -11179 -89773 -149919 -133998 -79255 38980 89417 110672 144204 221379
23007 221379 206709 206270 103248 15740 -32258 31013 65515 35190 -12674 -37970 -132975 -126462
22995 -126462 -216107 -205999 -98431 -43784 -51150 -54931 444 28828 200876 207830 12558
22984A2558j25460K7188K22186J64943r4364o8858j78795j07627M6751J5100n0359
22973a36737M5720Q7813J16543j1289n5010r2104j26876j7664J06161Q1173J1991
22962I721q7774O5978L7471L7566p6739k6790J09122K6973N2143M5400j4506q8424
22950I0141m9667q2040P8950K8593q967j66051m4724M9036K6438K4091k16817
22939b71017P8737j5040N6424r667J2787Q2060J67707O1613j09160j00556l1458
22928g7570J32889N0086j57064q4107R7400P0190o4139j16394k9961J01321J1534
22917f5815k3764k4200L6953J27782K1782r8327K274P6607l9519q8665O7196K458
22905e238j10036q8878J02719J22444n5128n5507m6188k5473k0504P1107j8932
$$ plain form
22984 12558 -112902 -85714 136472 301415 207051 138193 -40602 -148229 -101478 -86378 -136737
22973 -136737 -91017 -3204 113339 102050 47040 -45064 -171940 -189604 -83443 -2270 9721
22962 9721 -78053 -12075 25396 62962 -13777 -40567 68555 95528 147671 193071 178565 90141
22950 90141 40474 -41566 37384 65977 57010 -109041 -153765 -104729 -78291 -54200 -271017
22939 -271017 -192280 -207320 -150896 -160563 -147776 -65716 101991 163604 54444 -46112 -77570
22928 -77570 55319 105405 -51659 -135766 -38366 31824 -32315 -148709 -178670 -77349 -65815
22917 -65815 -89579 -113779 -76826 50956 72738 -25589 -23315 53292 13773 -74892 -7696 -5238
22905 -5238 -115274 -204152 -101433 21011 -34117 -89624 -135812 -161285 -181789 -110682 -129614
22894a29614J25853L9161l8889n3485k5084L6423m0848l2621j8144J22018O5897
22883E0667J13000j8925j05103k846p5921r2804Q7390R5648j3957P6044l9111
22872G4082n0613Q369m6340k2421o5947l7326J55778J24721q7903P595J7986k8115
22860D9866p859o5280K2637j6508O481K4356N2049K4794o7363l4898p1961j79429
22848b63115l697J09074k6889K8326P2166K995N6718l222q316J13939J097j4851
22836F4225m3612J4057j4107l129l45J0073j12195P6046k2285q0346n6058l1688
22824a99364l6082K2683J91554L1073q3755M9821J06156k9243m2490k058m873
22813C422M6501m9960r7269p7495k0929L8163J98806R9812J06611J0241L8124
$$ plain form
22894 -129614 -3761 35400 -3489 -56974 -82058 -45635 -86483 -119104 -137248 -15230 50667
22883 50667 163667 144742 39639 36793 -39128 -131932 -44542 51106 37149 113193 74082
22872 74082 23469 31838 -14502 -36923 -102870 -140196 15582 140303 52400 59995 77981 49866
22860 49866 42007 -23273 -636 -17144 -10663 13693 65742 90536 23173 -11725 -83686 -263115
22848 -263115 -266812 -157738 -184627 -156301 -84135 -81140 -24422 -27644 -35960 77979 79076 64225
22836 64225 20613 34670 20563 17434 17089 27162 -85033 -8987 -31272 -111618 -167676 -199364
22824 -199364 -235446 -212763 -21209 9864 -73891 -24070 82086 52843 10353 8295 3422
22813 3422 49923 -37 -97306 -174801 -195730 -157567 41239 141051 247662 257903 296027
22802B96027M6830j44304o1220l6487j0089K8357o4662L8001j685j1962l392j26511
22790e1097j6619k0086j44815p9929P3007L8886J6266J6735K4992J43416L127
22779C883o1551o5758l9581n3950P0087J29829m52J6236K2583P5640n8147L0772
22767F9591K2163j12095k8739l1398P4061R0549j004n8868m1926K7752M6952r4456
22755c7418K218O6306J4997o5324l6404O0651J3332p4247q6855r402N6219o3999
22743a59926O738m4790j7750J6551Q2987l6871J05924O0569m6526K8989j8527
22732b2632j5014n6025r6385L7263J13732J3789L38L8002j8131j7867K6350n756
22720b336p1475l5590m1828O4364Q9222k2006n3291k5948J9229N1481n8043N1687
$$ plain form
22802 296027 342857 198553 137333 100846 90757 119114 54452 92453 90768 78806 75414 -51097
22790 -51097 -67716 -87802 -232617 -312546 -239539 -200653 -184387 -167652 -142660 756 3883
22779 3883 -57668 -123426 -163007 -216957 -146870 -17041 -17493 -1257 21326 96966 38819 69591
22767 69591 91754 -20341 -49080 -80478 -6417 84132 83128 24260 -17666 10086 57038 -37418
22755 -37418 -35200 31106 46103 -19221 -55625 5026 18358 -55889 -142744 -152146 -95927 -159926
22743 -159926 -153188 -197978 -215728 -199177 -116190 -153061 -47137 13432 -33094 -4105 -22632
22732 -22632 -37646 -93671 -190056 -152793 -39061 -25272 -24934 13068 -5063 -22930 3420 -2336
22720 -2336 -73811 -109401 -151229 -86865 2357 -19649 -72940 -98888 -79659 -28178 -86221 -34534
22708c4534k137K7557O651J9344l8682r5514j03681l5858R4294L2120P0753m0355
22696a00042M559R7953M5416j15605N221N4650m0243o1544n8980J8910O7425m0553
22684a22833p6978J3355J4368q8192N3205N4451k3759K5258O5695O0139j1494
22673c6785p9920k0163Q2557p393n0046J8821J34342K3985K4380n468n2928K0427
22661E1809r1810j37359J28648Q2563M7100J65950o0390p8984k8626j10655q6789
22650a18543q945p648O7550N8980o2003q4107J0344o297q6778p8039P8946K38650
22638B110L6260o6109J18958K3350N6523o3796q014N2935p0887j67785J33446
22627D6991N5455K645K8270O5989J5656p9407l2481q7471K2004O9580o5854m8604
$$ plain form
22708 -34534 -36671 -9114 -2463 16881 -21801 -117315 -220996 -256854 -162560 -130440 -59687 -100042
22696 -100042 -95483 2470 47886 -67719 -62498 -7848 -48091 -109635 -168615 -149705 -82280 -122833
22684 -122833 -199811 -186456 -172088 -260280 -207075 -152624 -176383 -151125 -85430 -25291 -36785
22673 -36785 -116705 -136868 -54311 -61704 -111750 -92929 41413 65398 89778 84310 31382 51809
22661 51809 -40001 -177360 -48712 33851 80951 246901 186511 107527 78901 -31754 -118543
22650 -118543 -127488 -135136 -67586 -8606 -70609 -154716 -144372 -150669 -237447 -315486 -236540 2110
22638 2110 38370 -27739 91219 114569 171092 107296 99282 152217 81330 -86455 46991
22627 46991 102446 105091 133361 199350 215006 135599 103118 15647 37651 107231 41377 -7227
22615g227n7199m5645n9175R6231J37503J6132J8522o0176k14613l0913J35808
22604g0752p5099r6827J24415J37198m211r4462j06920O8582R7508J11392o78
22593I0146j21137j9938l605j04245o5232M8837K5676P8073j4488Q6979P7738
22582G8804k3067J23975l197k22862j86083l7219Q8638J49162r1895j4306J27532
22571a0518J14696j00090q8980o932n2311j6318P272L1667P8766N6366J1854L4346
22559E9818O2871K1989j11611j05688q6740m1249L9899O9564J6022M5237M1512
22548A1624K4011K8790J2032l9299N170O3843p3945k8015N6127N7518j8120M4329
22536A44065M4784l5035j02431j83987l9770J16460N2534L6600n534M4665N9821
$$ plain form
22615 -7227 -64426 -110071 -169246 -73015 64488 80620 99142 38966 -175647 -206560 -70752
22604 -70752 -145851 -242678 -118263 18935 14724 -79738 -186658 -118076 -20568 90824 90146
22593 90146 -30991 -50929 -54534 -158779 -224011 -175174 -149498 -71425 -85913 1066 78804
22582 78804 55737 179712 176515 -46347 -232430 -269649 -181011 -31849 -123744 -138050 -10518
22571 -10518 104178 4088 -84892 -91824 -144135 -160453 -153181 -121514 -42748 13618 25472 59818
22559 59818 122689 144678 33067 -72621 -159361 -200610 -160711 -91147 -75125 -29888 11624
22548 11624 35635 64425 76457 37158 42328 106171 32226 4211 60338 117856 99736 144065
22536 144065 188849 153814 51383 -132604 -172374 -55914 -3380 33220 27686 72351 132172
22525A32172q6160j71678K975N9054k2579l1149J8667L4154Q193r0284Q431J81932
22513D3728K4590o7781j25277N0122l7408N1334m3582m3383M1863M7824R7653
22502C9683M6261j24961r0747Q1331j01076M4279M3857l5088l0777q119P0722
22491f4635K68R6722J90917m6882j38882K287p3700J8395O515L1894N1904M9440
22479A24243O5507O4530M8345q7927j49843j6957l4315p7367j09953q20r3856
22468b68413k4561J79133N3781j65725N1323J76391M521j32900k6690J72540j5077
22457D323o6920n5012P5684r987l1756n9614J19464O6104L935k1256n1129M7338
22445B1174L9637m4938j06456j4517J08615L6860P0698R0490n1779j24438N2853
$$ plain form
22525 132172 46012 -125666 -122691 -63637 -86216 -117365 -98698 -64544 -56351 -146635 -138204 43728
22513 43728 68318 537 -124740 -74618 -112026 -60692 -104274 -147657 -105794 -57970 39683
22502 39683 85944 -39017 -129764 -48433 -149509 -105230 -61373 -96461 -127238 -135357 -64635
22491 -64635 -64367 32355 223272 176390 37508 39795 -33905 -15510 -8995 22899 74803 124243
22479 124243 189750 254280 302625 214698 64855 47898 13583 -63784 -173737 -174557 -268413
22468 -268413 -292974 -113841 -60060 -225785 -174462 1929 6450 -126450 -153140 19400 4323
22457 4323 -62597 -117609 -41925 -51912 -83668 -143282 -23818 42286 46221 24965 -26164 21174
22445 21174 60811 15873 -90583 -105100 3515 40375 111073 201563 149784 25346 78199
22434G8199J46195J3197l3524p6770k609J7350o8740j20803r718p120j9314O8979
22422a4678J7925j7907l4320q2797p8578p7118m57J82858L7573l0595K4277P5891
22410B074O7820o4730p384K3159k3844K3669k5486p4141P8636m3598q7200r274
22398a40299M8271J00036M9782k4218l8440r816K9586j27228j64831j16796J84872
22387b09081J55292p9298j6241P6527R1967k7521j17186R1018P4625m8518l1124
22376c9540N9712L2629M4335M524m4842p9401l6782O8738J07614p9409q4870K8894
22364a8398o298N3307J7469J3153J0865p7487M8034l8338k7111J0364J17071J31098
22352B33729o469p7788J0547k5182k0653j65205j78283n5523l1727J84032k794
$$ plain form
22434 78199 224394 237591 204067 127297 124688 142038 73298 -47505 -57223 -64343 -83657 -14678
22422 -14678 3247 -14660 -48980 -131777 -210355 -287473 -287930 -105072 -67499 -98094 -73817 2074
22410 2074 69894 5164 -2220 20939 -2905 20764 -4722 -78863 -227 -43825 -131025 -140299
22398 -140299 -92028 8008 57790 33572 -4868 -14684 14902 -112326 -277157 -393953 -209081
22387 -209081 -53789 -133087 -149328 -72801 19166 -8355 -125541 -34523 40102 -8416 -39540
22376 -39540 20172 52801 97136 101660 56818 -22583 -59365 9373 116987 37578 -47292 -18398
22364 -18398 -24696 28611 46080 59233 70098 -7389 40645 2307 -24804 -14440 102631 233729
22352 233729 227260 149472 160019 134837 114184 -51021 -229304 -284827 -316554 -132522 -135316
22341a35316R9723P5596J27797L9110P7405o1791j27051q6000r4512j63881o0673
22330c09593N6445J5721J45647J10509p1990k0881n7018O8345M2392K9703L6135
22319D5415N635Q6406l3366J5730m9050p6309k6688l3026j07257N8647J04877
22308h986j4395j10664M0840J06521Q1088L0419K8973J3101j20214K9320r466
22297F6537P6473J03423r6607m0862n679j15043J1918m3259l0688j08476k4376
22286b06639K0921M1862N6215j9189l6810l6592M0850K2665j0687K1472N9292
22275d6640k6369q6561N5793J01571K56O154P3022K012n140Q1258K852j24108
22263C4100k3877K8554p6364n696J5257N8555M3237K1940o0382k2028M7375q009
$$ plain form
22341 -135316 -35593 40003 167800 206910 284315 222524 95473 9473 -85039 -248920 -309593
22330 -309593 -253148 -237427 -91780 18729 -53261 -74142 -131160 -62815 -20423 9280 45415
22319 45415 51050 137456 104090 119820 70770 -5539 -32227 -65253 -172510 -113863 -8986
22308 -8986 -23381 -134045 -93205 13316 94404 124823 153796 166897 46683 76003 66537
22297 66537 143010 246433 149826 108964 103285 -11758 160 -43099 -73787 -182263 -206639
22286 -206639 -185718 -143856 -87641 -106830 -143640 -180232 -139382 -116717 -127404 -105932 -46640
22275 -46640 -73009 -159570 -103777 -2206 -1950 4204 77226 79238 74098 155356 158208 34100
22263 34100 10223 38777 -37587 -43283 -28026 30529 73766 95706 35324 13296 60671 52662
22251E2662q9703Q7520P321o3354j36380J183N7893J8367j9187N6377q512M8548
22239A2735J45531j05466j86501j67462J14960j3408J3677k851J4487J36019N7635
22228A9356P9665p7516M2068o9034k3085J2215l0220L0637R239L4009M2513j29398
22216e9551O566R5705M9469k7150n8022M2567L3602j0386j47616k08529M534K17834
22204f0977j7754P9862k3854N853p9202l5791Q3331L1317L0146K6102j03078j13702
22192a77747p6219L4228O1942J42624R5315M2516L3280p9655q9826o1675J9207
22181e6010L8577N1320l0537Qk5222O3537J6527N6398P8929o497q2020o0946m7424
22168c360K9164M5082r7157j87383j39970J6395J44396K00858M2704j9240O1668
$$ plain form
22251 52662 -37041 50479 57800 -5554 -141934 -140751 -82858 -64491 -83678 -27301 -35813 12735
22239 12735 158266 52800 -133701 -301163 -186203 -199611 -185934 -188785 -174298 -38279 19356
22228 19356 99021 21505 63573 -5461 -28546 -16331 -46551 -15914 -6675 27334 69847 -59551
22216 -59551 -52985 42720 92189 65039 7017 49584 83186 72800 -74816 -283345 -278811 -60977
22204 -60977 -78731 1131 -22723 -16870 -96072 -131863 -48532 -17215 12931 39033 -64045 -177747
22192 -177747 -253966 -219738 -157796 -15172 80143 122659 155939 76284 -13542 -75217 -56010
22181 -56010 -17433 33887 3350 3358 -21864 41673 58200 114598 193527 187030 105010 44064 -3360
22168 -3360 25804 70886 -26271 -213654 -353624 -337229 -192833 8025 50729 31489 93157
22157I3157J25815K1310p2742j04890r4505L6487K2812J3593j04433l1406J46631
22146E1829M4191j21497L2529K704J29073J7996o367j23915j79219J0718O5611
22135g6347n5581M2371j37178k4044o518L3490M8585l3458j9440J38111J446M7787
22123d0776J26665J19908K5043j274j76221m7709L8530j11091j4761K1186J40182
22112G9682k8945r2654L0594J9181J1723M0666p849j56673n1574O7273Q5361N3757
22100E0542M2043k5692m9071J6332N3428M1932j14490k5590J4042j46110K5577
22089a17057O4349R2428l0250j7492J58J23137j8558p5700n1025Q0000k5344j29073
22077a04427M919k9125j0980P4916J9304o1969Q4833J15098K6133n9310p3730
$$ plain form
22157 93157 218972 240282 167540 62650 -31855 4632 27444 41037 -63396 -94802 51829
22146 51829 96020 -25477 7052 9756 138829 156825 150458 26543 -152676 -141958 -76347
22135 -76347 -131928 -89557 -226735 -250779 -257297 -223807 -175222 -208680 -228120 -90009 -88563 -40776
22123 -40776 85889 205797 230840 229566 53345 5636 44166 -66925 -81686 -60500 79682
22112 79682 50737 -41917 -11323 7858 19581 60247 52398 -104275 -155849 -88576 -3215 50542
22100 50542 92585 66893 17822 34154 87582 129514 15024 -10566 3476 -142634 -117057
22089 -117057 -52708 39720 9470 -8022 -7864 115273 96715 21015 -30010 49990 24646 -104427
22077 -104427 -99508 -128633 -139613 -64697 -45393 -107362 -22529 92569 118702 59392 -14338
22066a4338J14761l0309q7941o6622M8734N1866l9389j5090O981J8104l9040j16413
22054a68696q5053J96375J50389j3311N5872j08968q1433k5312R891M703m4650
22043a10193q1116P8969Q3910m6838l6730J39492K8219j05561q0683J5657o0928
22032a75802L1680P2477K0525M386m4046j00880m4663N5545p5049J8867J68551
22021f8409M8381J280K0215O1561m6985o7158m6846r856R8183J8078O9725L6965
22009A15134j1153N1923m0055L8992q056O5541j31873j54582j361L1354P494N8790
21997B2148J6729j41029r7290K6504n1125o920k684N258Q8552j3886m2306P8447
21985a17602P0221Q7872N1229m7223j18077p7155m3564r6613J53519J87778j208
$$ plain form
22066 -14338 100423 70114 -17827 -84449 -35715 16151 -23238 -38328 -31347 -13243 -52283 -168696
22054 -168696 -253749 -57374 93015 79704 135576 26608 -54825 -80137 -70246 -65543 -110193
22043 -110193 -191309 -112340 -28430 -75268 -111998 27494 55713 -49848 -130531 -114874 -175802
22032 -175802 -144122 -71645 -51120 -46734 -90780 -191660 -236323 -180778 -255827 -236960 -68409
22021 -68409 -20028 -18748 1467 63028 16043 -51115 -97961 -107817 -9634 8444 78169 115134
22009 115134 103981 155904 115849 154841 146785 212326 80453 -74129 -75490 -44136 -36642 22148
21997 22148 38877 -102152 -199442 -172938 -224063 -230983 -233667 -228409 -139857 -153743 -196049 -117602
21985 -117602 -47381 40491 91720 44497 -73580 -150735 -194299 -290912 -137393 50385 49177
21974D9177j13088j23042O905R6715j5026L1721O7255P394m1898k1793m9988M0942
21962f4726R6902M1117m8995p5037m2761P4054N0181m9281M7489l6421j39135
21951a46613n0651O5964P5941N4508J861J092n0480j40739Q6456R7940J17636
21940A12915R3728n0383j52759r4109P6844j6056K8789N5703r6087p9230J04457
21929a6188J07558p4801q7497J6317P3905J33121j36430p0073R4690m9538r3474
21918a02410m3994N2938m5672p5799J35550Q6530p735q8280l3622O2118O444K7944
21906b5988n4914q740L1022J6648K2531p1178j78581J2264L9122K8867j2691p7090
21894b78728N4909N0009m4878R9569L0819N1070R2920k4672o2772j25802o8435
$$ plain form
21974 49177 -63911 -186953 -180048 -83333 -98359 -66638 617 8011 -33887 -55680 -105668 -64726
21962 -64726 32176 73293 24298 -50739 -93500 -19446 30735 -18546 28943 -7478 -146613
21951 -146613 -197264 -131300 -55359 -851 1010 2102 -48378 -189117 -102661 -4721 112915
21940 112915 206643 156260 3501 -90608 -13764 -29820 -1031 54672 -41415 -120645 -16188
21929 -16188 91370 16569 -70928 -54611 19294 152415 15985 -54088 40602 -8936 -102410
21918 -102410 -146404 -93466 -139138 -214937 -79387 7143 -592 -88872 -122494 -60376 -53932 -25988
21906 -25988 -80902 -89642 -58620 -41972 -19441 -90619 -269200 -256936 -217814 -188947 -201638 -278728
21894 -278728 -223819 -173810 -218688 -119119 -88300 -37230 55690 31018 -31754 -157556 -225991
21883b25991P1910J65461n2485j2995m8636J4038K02533M1874j6788p3903n1921
21872A3097n4961m1195k867J7591n1153P9668J51638J17300j72111p6218j7711
21861c6922J2601k3683m6199l7647J20778J05892p4652n2590O6562m1024l306
21850a0190J06003N7160j19866o4657k6608J06569Q0301j18866j09484m7720N4863
21839i2495M6443L1856L2161p0032K4984m6471O6547p8751n3575L8186K8991K0525
21827e1631O7509M263l1674k4278N6325O0437n1309j8295r4211j3570J11960p2372
21815e6846r458l5275r2085J08704M9809L303j0170R4243j1365p872j9286J03672
21803A17374O0830l6088J2014j50545o3313K8090N0675Q1026N372J09364l4956
$$ plain form
21883 -225991 -154081 11380 -41105 -54100 -102736 -88698 113835 155709 138921 65018 13097
21872 13097 -41864 -83059 -85926 -68335 -119488 -39820 111818 229118 57007 -19211 -36922
21861 -36922 -24321 -48004 -94203 -131850 -11072 94820 20168 -32422 34140 -6884 -10190
21850 -10190 95813 152973 33107 -31550 -58158 48411 128712 9846 -99638 -147358 -92495
21839 -92495 -46052 -14196 17965 -52067 -27083 -73554 -7007 -85758 -139333 -101147 -72156 -51631
21827 -51631 15878 20141 -11533 -35811 20514 80951 29642 11347 -82864 -96434 15526 -56846
21815 -56846 -66304 -101579 -193664 -84960 -35151 -31848 -42018 52225 40860 32988 13702 117374
21803 117374 178204 142116 154130 3585 -59728 -31638 19037 100063 105435 214799 179843
21792A79843m3239q2531L3426M0893l0625j38529l9327R0789M1841M1403p473
21781H6471q5419k9161j01817l166O7068m2067L3873L2171q298k776P2309Q473
21769B7661j9275K5804L0672m8096j5341j6603q1620O4807M479O0743J11440p0736
21757G3935r8316l6691l7311j04224k5966J28931J322O1923J10959k0763j20016
21746f6217J28869J7184p937J69220m9136j40553j03003m1752M6109q152r5596
21735a50964j903J20411J26959R5431j20812r0048O817m6701M0516N2945K6222
21724E8873l7551m6262m3870j2568J8967L0200J807J9485L2380M7327r4771q5894
21712a11877p2881j3578M6894J04890P4954L2423K2956q085j9116Q7379J3193
$$ plain form
21792 179843 136604 54073 87499 128392 97767 -40762 -80089 10700 52541 93944 86471
21781 86471 1052 -28109 -129926 -133092 -66024 -108091 -74218 -42047 -50345 -53121 19188 27661
21769 27661 8386 34190 64862 16766 1425 -15178 -96798 -31991 -27512 33231 144671 73935
21757 73935 -24381 -61072 -98383 -202607 -228573 -99642 -98320 -36397 74562 53799 -66217
21746 -66217 62652 79836 71899 241119 191983 51430 -51573 -93325 -47216 -55368 -150964
21735 -150964 -152867 -32456 94503 189934 69122 -20926 -14109 -60810 -20294 32651 58873
21724 58873 21322 -24940 -68810 -81378 -62411 -32211 -30404 -10919 21461 68788 -25983 -111877
21712 -111877 -184758 -198336 -151442 -46552 28402 60825 83781 75696 56580 143959 157152
21701A57152j42774j87840o7164J52967O6591k8333N9654K0557M62M919j25812
21690h9621j65505J74505J49337j2578k0223l4317m0965Q2928J44877N2535o7534
21679A73439o5333k865j31193l1075k0141M6505J26542j07295k3561l843M727
21668c4093K043p9485j016N7907P7057Q2870j4092j05369j28795r509J06708k4669
21656g0443J3039N8132R674l1846K6575M6123Q5812r2220j43391j95086J28997
21645a64634J25202n8761P0584J00172j53246J1306J6884Q418L9743J29812L6208
21634A61688l1631p274k4010L7759L1753m5494l6618m2078L1019J22542O0132
21623B57788q1784r6143j08539n1852M8017J2126J7695J9491q2619J9764m1258
$$ plain form
21701 157152 14378 -173462 -240626 -87659 -21068 -49401 10253 30810 31272 36191 -89621
21690 -89621 -255126 -80621 68716 56138 35915 1598 -39367 43561 188438 240973 173439
21679 173439 108106 105241 -25952 -57027 -77168 -30663 95879 -11416 -34977 -38820 -34093
21668 -34093 -32050 -111535 -112551 -54644 22413 105283 91191 -14178 -142973 -152482 -45774 -70443
21656 -70443 -57404 728 10402 -21444 5131 51254 137066 44846 -98545 -293631 -164634
21645 -164634 -39432 -98193 -27609 72563 -80683 -69377 -52493 -44075 -4332 125480 161688
21634 161688 130057 122783 98773 136532 168285 122791 86173 44095 75114 197656 257788
21623 257788 176004 79861 -28678 -80530 -32513 -20387 -2692 16799 -65820 -46056 -87314
21612h7314K9082M9259M1168j5014j245o5709J4847L9778n1506O1808N8619j6310
21600E7463r687J8577N0325K3187k9450k9844n6898l3978j2393M2484j9938j11162
21588a11314K2271Q0845l2458j00332J60940M0966k8387m8432k2535o0469j1325
21577a10230M7824m1065N1925j9171M4007k0210r8531J00086o0107m8827R5955
21566e8344K191J2326M4130K3624l2838j4775J23273M3792M7741j7887M857q16
21554A77274J6166O4409l7387j29571j20258l5857M0178L2905n6711J0046k1542
21543f0348P917k0803l6425n0010J88382R43j01982k3944M7473J0536P4150r4691
21531e8802O965p243J6419j8725o8227J07737L7326p4471j21486R5847J63767
$$ plain form
21612 -87314 -58232 -8973 32195 17181 15936 -49773 -34926 4852 -46654 15154 73773 57463
21600 57463 47776 66353 116678 139865 110415 80571 23673 -10305 -22698 19786 -152 -111314
21588 -111314 -89043 -8198 -40656 -140988 19952 60918 32531 -15901 -38436 -98905 -110230
21577 -110230 -62406 -103471 -51546 -70717 -26710 -46920 -145451 -45365 -105472 -154299 -58344
21566 -58344 -56153 -43827 303 23927 -8911 -23686 99587 143379 191120 173233 178090 177274
21554 177274 193440 257849 220462 90891 -29367 -65224 -25046 7859 -48852 -38806 -60348
21543 -60348 -52431 -73234 -109659 -159669 28713 29656 -72326 -96270 -48797 -38261 35889 -58802
21531 -58802 -51837 -59080 -42661 -61386 -129613 -21876 15450 -59021 -180507 -84660 79107
21520G9107L7650R04L7690o3554j48091j6928J03755j4309j27799n0462M5642
21509a16395J53787N4029J06531n2979r7965L2323k5331O1417L2596k3774j58514
21498c4275m3788M0892J43009O072j07888l4127M0481R1288j7233J8558q7494
21487A5495j09720p1098q0800K6212K01593k2702l8323N1138J1185n7235J4388
21476e9867p440L0570j706q0124n52J01676R9558P4479K9499k9824j3749j30033
21464A2487p3329r049O4504r033O496k6163P3517n8530q8116k0279J35936j1624
21452c183j5019P3234J8488P8099J07655L0112l9086j17616q3375K0334N487R8634
21440A73764P949Q031p7834j02543K1758M4694k018j22913n3276K2478L5965R5247
$$ plain form
21520 79107 116757 117661 155351 91797 -56294 -73222 30533 16224 -111575 -162037 -116395
21509 -116395 37392 91421 197952 144973 47008 79331 54000 115417 148013 124239 -34275
21498 -34275 -78063 -37171 105838 111910 4022 -30105 10376 101664 84431 102989 15495
21487 15495 -94225 -165323 -246123 -219911 -18318 -41020 -79343 -28205 -17020 -74255 -59867
21476 -59867 -67307 -36737 -38443 -118567 -119119 -17443 82115 156594 186093 156269 142520 12487
21464 12487 -60842 -69891 -5387 -14420 -7924 -34087 39430 -19100 -107216 -127495 8441 -3183
21452 -3183 -18202 55032 73520 151619 259274 289386 250300 132684 49309 69643 75130 173764
21440 173764 181713 189744 111910 9367 31125 75819 73801 -49112 -102388 -79910 -43945 51302
21428E1302l587L3441P8265q3425j28014m6627o5689j31907L1319Q5250J35731
21417d3941J26583j16971j0646j08312O5584J26325k5746Q0256j1195l1493m333
21406D6111R001j1692q1379q4890R6037J32659l0304J6795k570j0694k4040q3383
21394b8349J20135L5742n1630m3434k4327L0887k5752M7529R9802O2188l6564
21383A86227P454j39493k2151Q7636m1732j53972k712Q094j5901L5829L0156Q2302
21371F1737J02455L2096J8060p8180Q2654k0759j74640j78757m1286O0267J15344
21360b1009O0684o7350K8139m9790M1002M6406L2196n7638j19775n5559j07315
21349b70009K7459P899Q396M8402P3798M7574Q6357P2627M319J353p6923n4634
$$ plain form
21428 51302 47715 81156 159421 75996 -52018 -98645 -164334 -296241 -264922 -179672 -43941
21417 -43941 82642 -34329 -44975 -153287 -87703 38622 12876 93132 81937 50444 46111
21406 46111 55112 43420 -37959 -122849 -26812 105847 75543 92338 89768 79074 55034 -28349
21394 -28349 91786 127528 75898 32464 8137 39024 13272 60801 160603 222791 186227
21383 186227 193681 54188 32037 119673 77941 -76031 -78743 -70649 -86550 -50721 -20565 61737
21371 61737 164192 196288 214348 136168 218822 198063 23423 -155334 -196620 -136353 -21009
21360 -21009 39675 -27675 464 -49326 -8324 38082 70278 12640 -107135 -162694 -270009
21349 -270009 -242550 -234651 -226255 -177853 -104055 -56481 29876 102503 106822 108175 31252 -23382
21337b3382J26697P9591q7350j23055j4170J70532p7130j42138r7031J99572R0631
21326A02767l092q0862j48936l4534J76180J52872M6902k0338n1782o749O756
21315A39184k9637k3158j12916p5358p9802L9633m7847O6448N7390Q3372N2681
21304F9990J3422N2833j2589n9022N8360O36j12404j4123Q51K5242J42982R2042
21292B58220k1012j5845p0882l1377O3308m539p2870j23734n5193Q476N1327o0317
21280g4438n3954k4718M4271M8066J6128r2446l2159l5687l667Q1526J49244Q1068
21268A03234K0284m0555m632o8635l6229j07137n4118P3933R3400p8581l8765
21257a37801l7670N6431n355O6163K2190J6189K0703j17472j65896J1064J99015
$$ plain form
21337 -23382 103315 182906 95556 -27499 -41669 128863 51733 -90405 -187436 12136 102767
21326 102767 99675 18813 -130123 -164657 11523 164395 211297 190959 139177 132428 139184
21315 139184 109547 86389 -26527 -101885 -181687 -142054 -189901 -123453 -66063 17309 69990
21304 69990 83412 136245 123656 64634 122994 123630 11226 -2897 -2046 23196 166178 258220
21292 258220 237208 221363 150481 119104 182412 177873 105003 -18731 -73924 -65448 -14121 -74438
21280 -74438 -128392 -153110 -108839 -60773 -44645 -137091 -169250 -204937 -208604 -127078 22166 103234
21268 103234 123518 82963 78331 9696 -26533 -133670 -187788 -113855 -20455 -99036 -137801
21257 -137801 -175471 -119040 -124395 -58232 -36042 -19853 850 -116622 -282518 -271454 -72439
21246g2439O1307j3468J64956l6518j46118q9014J20983K3410j4409M2082Q7801
21235A28573P1152j2790Q431P5918k8396j16707j0888M2717Q5493M3277j19013
21224A67767j28965l7456J5811P6826L3249n6565k1324J17565L222M9968n8312
21213A61786m6039k5135p4555o7622k3592Q5388J00110n7560j02598p2332J17654
21202d495P1110R862m3908M3209j5920Q7101J15178L5748m058j04321j6396m6337
21190A26773L3939j08053j55801r2033p1218J37443J28117o4461p3272j0L4983
21179a03593J48404O3353k8603J15586j904q9836q851L3637m0197n7735P369K7388
21167F5018R6981P0845j2004q9857Q4810O5583L1770p3359n9549J8749j1714q7587
$$ plain form
21246 -72439 -11132 -24600 140356 103838 -42280 -131294 -10311 13099 -1310 40772 128573
21235 128573 199725 186935 195366 271284 242888 126181 115293 158010 243503 286780 167767
21224 167767 38802 1346 17157 93983 127232 70667 49343 166908 170130 220098 161786
21213 161786 115747 90612 16057 -51565 -75157 10231 110341 52781 -49817 -122149 -4495
21202 -4495 66615 76477 32569 75778 59858 146959 262137 297885 293827 189506 173110 126773
21190 126773 160712 52659 -103142 -195175 -266393 -128950 -833 -65294 -138566 -138576 -103593
21179 -103593 44811 108164 79561 195147 193243 103407 94556 128193 87996 30261 37630 65018
21167 65018 161999 232844 220840 130983 215793 281376 313146 239787 180238 198987 187273 99686
21155I9686k01652K8521R5231Q7681j6746p4930J8297L1642j03272k3235r1335
21144a50112N464J00203K8316J80671J35052k8217j23346o4319O519J198O7183
21133A58612j0961l6419j52757L5613M9860p7625m4482n3333N1080O6928O2515
21122D9031p7799j73023K2760K4562J24119J25755Q8302j9470L5555O8835j17458
21111A51169j3769N3900j41192n5327j478l6188m5121m0711L2541L9817N7782
21100A423p6404L8264m6493k5172O7260J5460p3154P8061P4743L4553O7659n1311
21088A04889J38515M853k08172j24756K3694O2023J6013M5620l3248k1299m6248
21077c8116L0775J34267K5417k2553J9176j1903j59961n8522N2937L9621J23492
$$ plain form
21155 99686 -101966 -73445 21786 109467 92721 17791 36088 67730 -35542 -58777 -150112
21144 -150112 -144648 -44445 -16129 164542 299594 271377 148031 83712 90231 91429 158612
21133 158612 147651 111232 -41525 -5912 43948 -33677 -78159 -131492 -80412 -13484 49031
21122 49031 -28768 -201791 -179031 -154469 -30350 95405 183707 164237 199792 268627 151169
21111 151169 137400 191300 50108 -5219 -6697 -42885 -88006 -128717 -96176 -56359 1423
21100 1423 -74981 -36717 -83210 -108382 -41122 -25662 -98816 -20755 53988 88541 156200 104889
21088 104889 243404 248257 40085 -84671 -60977 1046 17059 62679 29431 8132 -38116
21077 -38116 -7341 126926 152343 129790 148966 137063 -22898 -81420 -28483 11138 134630
21066A34630j00147j24210P0821R3300o4536J9785J7501k050n7233q5971M3187
21055e4923J5850j2082l8940P972k7980K3827K5295J15988o961j22564K4391r1063
21043a41190m4994N5527J50552R0223R8099o3231M136M7546j2959r2897j63956
21032g3144m5070J4466P1969O6444l3814o952Q3476o887r2723n6098K2315O4040
21020H022O8384P3191k8664m7505p6551M0601L0452k6825K7892j3553o5686m8489
21008e8731R8595J46662J3925j00266j14809K4328L3581p827J411m8286q3569
20997i4986J2356L8539K32887K8657m2873p8043l1864j937n7971n4810o0811J44884
20985C4028P7261n0473n6457M7033k5200O7210j1143j00950n8596N0606J5923
$$ plain form
21066 134630 34483 -89727 -18906 74394 9858 29643 47144 45094 -12139 -98110 -54923
21055 -54923 -39073 -51155 -90095 -82123 -110103 -86276 -60981 55007 48046 -74518 -50127 -141190
21043 -141190 -186184 -130657 19895 110118 208217 144986 149122 196668 183709 90812 -73144
21032 -73144 -118214 -103748 -31779 34665 851 -6101 77375 70488 -22235 -78333 -56018 8022
21020 8022 76406 149597 120933 73428 -3123 37478 67930 41105 68997 55444 -10242 -58731
21008 -58731 39864 186526 200451 100185 -14624 9704 43285 35458 36869 -11417 -94986
20997 -94986 -82630 -44091 188796 217453 174580 96537 64673 62736 4765 -50045 -110856 34028
20985 34028 111289 60816 4359 51392 26192 93402 82259 -18691 -77287 -26681 -10758
20974a0758K1237q2513k256L3290R5509K5970N2949M5214q7044N5813l0303L200
20962A20308l4259l0891L0006p7584P9112M2106j69049m7155J42704j6341K9235
20951F8192L437p5459q7657J07274J26032j1252R053l4229j51431p9554m8918
20940a74512j7064J01594M8771K2058K2110M000J06624P4251Q5233j09997r7774
20929F5294j46339j4435J7268J63112M0913m7877O315j0244k206l6819o0688j17038
20917a42744o52M1052n9616j0013M2153L1999J10951p9112J74796J04294l1187
20906A81921O3519m9443n6514M0449m3954Q2075n8267k9519N8664m9665j48086
20895h820J7168N9082P1143O3468j30635o2913n3241j2721K2662P001r847p3781
$$ plain form
20974 -10758 10479 -72034 -74290 -41000 54509 80479 133428 178642 91598 147411 117108 120308
20962 120308 86049 55158 85164 7580 86692 128798 -40251 -87406 55298 38957 68192
20951 68192 71629 -3830 -91487 15787 141819 130567 139620 105391 -46040 -125594 -174512
20940 -174512 -191576 -89982 -41211 -19153 2957 6957 113581 187832 273065 163068 65294
20929 65294 -81045 -95480 -78212 84900 125813 77936 84251 74007 71801 34982 -25706 -142744
20917 -142744 -143396 -102344 -161960 -171973 -129820 -97821 13130 -65982 108814 213108 181921
20906 181921 245440 195997 139483 179932 135978 218053 159786 130267 188931 139266 -8820
20895 -8820 8348 67430 138573 202041 71406 8493 -44748 -57469 -34807 -27806 -37653 -111434
20883a11434M0418J32770J5329k0834J9030m5583j29435R43K04952P3722j62033
20872A7845j74743l4543J39667J11045K0951q9647n2268p8936m3973j8981K9491
20861a74092J38937J73947K8968K5801M6865l0448j9803J1059n3588n7099N1382
20850A41929r5136n1745O4610P3315J8486J8800K577R5998l3355l7321m0028q6518
20838G1612q807K9355M7284J9094j32797J7992N3759P841j0051J0926P7801j0914
20826A73095j58492l2853R6932M8879r3844j05798J27945J14575q1407j11820
20816b2788j34403M5758J9500o1328P9068P4025J325q6743k30J21729J2247j2099
20804C6061p1416o5214R64J86935K5329q2882n2105Q188J48872P320O6406J7973
$$ plain form
20883 -111434 -71016 61754 77083 56249 75279 29696 -99739 -98796 106156 179878 17845
20872 17845 -156898 -191441 -51774 59271 80222 -9425 -61693 -140629 -184602 -203583 -174092
20861 -174092 -35155 138792 167760 193561 240426 209978 190175 201234 147646 90547 141929
20850 141929 46793 -4952 59658 132973 151459 170259 172836 268834 235479 198158 158130 71612
20838 71612 62805 92160 139444 158538 25741 43733 97492 105333 95282 106208 184009 173095
20826 173095 14603 -18250 78682 127561 33717 -72081 55864 170439 89032 -22788
20816 -22788 -157191 -111433 -91933 -153261 -74193 -168 1157 -85586 -85816 35913 48160 36061
20804 36061 -35355 -100569 -99605 87330 112659 29777 -22328 -14140 134732 142052 208458 226431
20792B26431p6443j75089j42469l1199O4984N1003Q7055q8592O5040J0255M1953
20781C2929q30n3029P9670Q5447j2798P1644j11670j24065O1948J05598k01407
20770f6563r2760M3357K1248m4310N3737o4690k6362j3324L5033N6826Q2466m9477
20758f4819j18928J54056O0807J5478M2103K0157p5520j2949J1843l2369j4943
20747a5084P6899j5642r096j1747L1343L6988j1409N1006Q1913j6008k3188o7620
20735A08355p0783L2699P7381N79r4649k4025M7157N1615n4250L0509k2312J8156
20723A00432J0193R349J2674L4228Q47J8918n7529l2200P8773k0422N2186j560
20711B05889j42612m5344P5160m753o7263p3656k4760O3809p251L8783k7241j3188
$$ plain form
20792 226431 149988 -25101 -167570 -198769 -133785 -82782 4273 -84319 -19279 -9024 32929
20781 32929 32099 -20930 58740 144187 131389 203033 91363 -32702 29246 134844 -66563
20770 -66563 -159323 -115966 -94718 -139028 -85291 -149981 -176343 -189667 -154634 -97808 -15342 -64819
20758 -64819 -183747 -29691 31116 46594 88697 108854 33334 20385 32228 -141 -15084
20747 -15084 61815 46173 37077 25330 56673 93661 82252 133258 215171 199163 175975 108355
20735 108355 37572 70271 147652 148231 53582 29557 76714 128329 74079 104588 82276 100432
20723 100432 110625 119974 132648 166876 167723 186641 129112 96912 175685 155263 207449 205889
20711 205889 63277 17933 93093 88340 21077 -52579 -77339 -13530 -20781 18002 -9239 -22427
20699b2427J10535O3454q6764L2503k3344j4463R531j6593j19225R1791J28636
20688A53634p3969m2236N2511k3988o6722K0325K6251j050M8595M4077o2940j7907
20676E6581k6872Q451k893O8460k4077l7732j3642m0407K5465J26377o5562m9025
20664B5124K0506m6311k9079M5883k7050O8116j40610k7258O4425R9004N1326
20653A04076p0105j50186m5378J96412j0654Q9784o9545m9944J25455r5590k15377
20642a91052M7604J45385M8634J8379r7539j02341Q7953R7692J26147l0840j3939
20631A36083l8209j469K4887n1349L034J4456m9221N0514M4824m8050o1162l9879
20619a5541M4198M6512P6049P1210K5010j6268j35306l9309K7273l3913J3467
$$ plain form
20699 -22427 88108 151562 64798 97301 73957 59494 69025 52432 -66793 24998 153634
20688 153634 79665 37429 89940 65952 -770 19555 45806 44756 93351 137428 74488 56581
20676 56581 29709 38160 35267 103727 79650 41918 28276 -12131 13334 139711 74149 25124
20664 25124 45630 -681 -29760 16123 -10927 57189 -83421 -110679 -46254 52750 104076
20653 104076 33971 -116215 -161593 34819 24165 113949 44404 -5540 119915 24325 -191052
20642 -191052 -143448 1937 50571 68950 -28589 -130930 -42977 54715 180862 150022 136083
20631 136083 97874 96405 121292 69943 72977 87433 38212 88726 133550 85500 24338 -15541
20619 -15541 28657 75169 151218 222428 247438 231170 95864 56555 83828 49915 63382
20608F3382n3029p4071J47600J10827p5798j47492k1688k4995J20786K3466j09090
20597d0102K0645J5429l6566J78406o0277j35853o3269J4906O8660O3052J7421
20586D2452J46282L9965k8702N8044O2M430O0442Q7971J9135j6024J1007o1950
20574C63114j42485j03491K756j4911j01700n7076N1803O3791K4936n2447K2991
20563E7281k688L4914J12524K1811j87093j06851J88046O2474o194m5867J8590
20552A46947R6124r5176q7052p2468q568M6061P8008O3104p3223j82895j24528
20541b13666J2232N8978m9676j1030K5605R9654J17876M6211N1862L4162o0814
20530A11394j33053J03O8461L4569r2347o4249J48795O8239j2333j05505k2273
$$ plain form
20608 63382 10353 -63718 83882 194709 118911 -28581 -50269 -75264 45522 68988 -40102
20597 -40102 -19457 -4028 -40594 137812 77535 -58318 -121587 -106681 -38021 25031 42452
20586 42452 188734 228699 199997 258041 258103 262533 322975 410946 430081 414057 425064 363114
20574 363114 220629 117138 119894 104983 3283 -53793 -1990 61801 86737 34290 57281
20563 57281 54593 89507 202031 223842 36749 -70102 117944 180418 174224 128357 146947
20552 146947 243071 147895 60843 -11625 -20193 25868 103876 166980 93757 -89138 -213666
20541 -213666 -201434 -142456 -192132 -203162 -177557 -77903 39973 86184 138046 172208 111394
20530 111394 -21659 -21556 46905 81474 -10873 -75122 73673 141912 129579 24074 1801
20519A801M6082o4376K3191o813K4822M5080M7158J4889M33M9963j18581O267
20507F9916K0777m982K5663N6535r9960N8129J26719p8309r2121O0170K3930J3411
20495A79878o7888k0565O0078l832j08059L9182N8530M4240q313p8450M9104k2073
20483A21832k3619K2328p7268Q58r766n2227q2930L0111J72624J25785n5365r1147
20471H1216o5209m3854J05129K9848Q6046L6966n8084o0708j06470O4565Q9452
20460A58897L7993M5012k8443N4518r6660j4962k9636k6446j08489K9649O7410
20449H8843M9287L4411l8937o0022n0020o0236k8657J9120p9660J18394J07519
20438A00042K8474O4234P6356m4664n1021o6861m1395N0574l9228O0814J13318
$$ plain form
20519 1801 47883 -16493 6698 -115 24707 69787 116945 131834 132267 182230 63649 69916
20507 69916 90693 85711 111374 167909 67949 126078 252797 174488 82367 142537 166467 179878
20495 179878 111990 91425 151503 147671 39612 78794 137324 181564 173251 94801 143905 121832
20483 121832 98213 120541 43273 44131 34365 -17862 -100792 -70681 101943 227728 172363 81216
20471 81216 16007 -27847 77282 107130 193176 230142 172058 111350 4880 69445 158897
20460 158897 196890 241902 213459 267977 171317 156355 126719 100273 -8216 21433 88843
20449 88843 138130 172541 133604 73582 23562 -36674 -65331 -46211 -125871 -7477 100042
20438 100042 128516 192750 269106 224442 173421 106560 65165 115739 76511 137325 250643
20427B50643r8241j09370J13854P0968l3411j7214p5195k1801M3802l6554j06976
20416a9495o7518N0028R0175j525j8348n1378N40p661N8068O9478P6678l6250
20404A42792J8016K877q4893j03896j8440R4795R9686q6889K5337P8383M514L7080
20392B09362j18936l5751J00923q5924j07088M3961K9940p4178N5896N2603M9579
20381A20387L5564L2813R6461K0818p0754J83348P6226j69559j03617P2368J91919
20370D85974j07774j93193m7674L0936P0073q895j24290P068L2296M239P2153
20359B20913k906l7310j2251N4893p7599M1046j7472K9381J58581J48319J48159
20348F53754J35673P6763q9427m2361j04282k9287J9639m7035K8370k5809M885
$$ plain form
20427 250643 152402 43032 156886 227854 194443 177229 102034 80233 124035 87481 -19495
20416 -19495 -87013 -36985 53190 51665 33317 -18061 -17521 -25182 32886 102364 179042 142792
20404 142792 160808 163685 78792 -25104 -43544 51251 150937 64048 89385 167768 172282 209362
20392 209362 90426 54675 155598 69674 -37414 6547 36487 -37691 18205 70808 120387
20381 120387 155951 188764 285225 306043 235289 418637 494863 325304 221687 294055 485974
20370 485974 378200 185007 137333 168269 238342 229447 105157 112225 144521 148760 220913
20359 220913 218007 180697 168446 223339 145740 186786 169314 198695 357276 505595 653754
20348 653754 789427 866190 776763 734402 630120 600833 620472 573437 601807 575998 580883
20337E80883j255j45961Q4536n5479j36784P5156N5738o6765j22248o0946N2519
20326B59394j55244K5394K3264L0508J4481N7447J43j2746n2585j1647j2938l9833
20314A25638J1355M1572k6565P469J07121P7737n1244j34989o0024O4541j7240
20303A45371L2303J01349J25889k0340L022J29899M8005K7387J1219J1098R2671
20292G07873R6782J29313K12915R8669j55602Q9139J10320O5662n1761j05408
20282A197902k12145k27596j28340j60622j63248j96793k3659J46056M2211n1782
20272B21984N5831j8054k3816N5080n8079l4970K9638K9423N7368l5088n8148
20261B21169L0697O1414Q982n5953q2197Q7750J8882r7379J47001N060M6929J10003
$$ plain form
20337 580883 579628 433667 518203 462724 325940 401096 456834 390069 267821 206875 259394
20326 259394 104150 129544 152808 183316 197797 255244 255387 242641 190056 178409 165471 125638
20314 125638 136993 178565 152000 159469 266590 344327 293083 158094 98070 162611 145371
20303 145371 177674 279023 404912 384572 387594 517493 565498 592885 604104 615202 707873
20292 707873 804655 933968 1146883 1245552 1089950 1179089 1289409 1355071 1303310 1197902
20282 1197902 985757 758161 629821 469199 305951 109158 85499 231555 273766 221984
20272 221984 277815 259761 235945 291025 232946 197976 227614 257037 314405 279317 221169
20261 221169 251866 313280 322262 266309 184112 271862 290744 193365 340366 345426 392355 502358
20249E02358R8029J17034j409k88482j30021P3858j7559l6267L4127l3111q8881
20238B29676k1267m469J9936J36399K44559P7496j77013J3156l5590q4484l5607
20227C62792K0564K0477j06499p0892j6534l3089P7609o2443o8060J7407l8101
20216A03231K6764q208p4151k112J47175R6699R5826j4109j14363o1974J66035
20205C60813j2714q469n9984q4415j16767O224K5037p3599N0327l2444L1904N3981
20193A39894K782M6308n6885l185J15629q322N6069j09905P196J69674J07877
20182D67132j02181k8987M7868R7888R9320Q6543R6165J09615R0302K0173O7825
20171A051663n5860p2173p907M3743N9803l1510j41744l06054r4104m3933R3115
$$ plain form
20249 502358 600387 717421 716012 427530 297509 371367 353808 317541 351668 318557 229676
20238 229676 208409 203940 223876 360275 604834 682330 505317 518473 482883 398399 362792
20227 362792 383356 403833 297334 226442 209908 176819 254428 191985 123925 141332 103231
20216 103231 129995 121787 47636 45524 192699 289398 385224 371115 256752 194778 360813
20205 360813 348099 339630 279646 195231 78464 84688 109725 36126 86453 54009 85913 139894
20193 139894 142676 188984 132099 128914 244543 236221 292290 182385 189581 359255 467132
20182 467132 364951 335964 383832 481720 581040 667583 763748 873363 963665 983838 1051663
20171 1051663 995803 923630 915723 959466 1019269 987759 846015 539961 445857 401924 495039
20160D95039J6173M7035Q633p7238j35344k4954P0513n1050r7951N1312J14738
20149D16906L9706m7816l6677J07812L1244K372O9369J69904J44026j3580k1686
20138H61580q3000K6406P9094N409r453l9547J36682J22924L9674Q4559j33581
20127A090747j76121j3541J06360O1693L8180L1552j76732k73594j22089j34633
20117D31822K6958J16430P6124q4624j47059l8181m4542R705n7316o1520L3328
20106B61125j82o1794m2776J44362J05837M6406N118J56357m937o4505J81176
20095G26187k1723k6278K3333L3502p2031j42409l9282M8588p63q7138J177J71314
20083F14477O3573m2876j14107p997k9899o7915n8988J6417j2462l3364j4994
$$ plain form
20160 495039 511212 558247 566880 489642 354298 329344 399857 348807 250856 302168 416906
20149 416906 456612 408796 372119 479931 511175 513547 582916 752820 896846 883266 861580
20138 861580 778580 804986 884080 889489 880036 840489 977171 1100095 1139769 1224328 1090747
20127 1090747 914626 901085 1007445 1069138 1107318 1138870 962138 688544 566455 431822
20117 431822 458780 575210 651334 566710 419651 381470 336928 346633 289317 227797 261125
20106 261125 260943 199149 156373 300735 406572 452978 458096 614453 609516 545011 726187
20095 726187 704464 678186 701519 735021 662990 520581 481299 529887 529124 441986 443163 614477
20083 614477 678050 635174 521067 513070 483171 415256 356268 372685 360223 326859 311865
20072C11865J7740P9399J65571o6330j26338l7468L3027P4587K8148k8916k5369
20061D25916l9966L5370p8773p4817r0847P408Q5114L020n8099N0798J37115J2006
20049D14245j69435q7463J3114R7468J40412l3884o1973N1047O9757R809k6566
20038D16531P7941L2832n9791o1895K912J10812O9745m2442r4129k1934J64038
20027E94620q0721m0699J1533r6152j14187j42264N7631k6973J06741J28211J20619
20016E18359M9587p9865q605K6310Q6616R2367Q1906K41208J51146n6601j18834
20005I83594n0475j14773k5886n0300r4887q5630k771L8717K0142O495k0383j7098
19993E86745L514m8166M2435P6945j16515k8069r6005j77655M4857M6154J46623
$$ plain form
20072 311865 329605 409004 574575 508245 381907 344439 377466 452053 480201 451285 425916
20061 425916 385950 421320 342547 267730 176883 184291 269405 272425 214326 265124 402239 414245
20049 414245 244810 157347 170461 267929 408341 374457 312484 363531 433288 443097 416531
20038 416531 494472 527304 467513 405618 408530 519342 589087 546645 452516 430582 594620
20027 594620 513899 473200 484733 388581 274394 132130 189761 162788 269529 397740 518359
20016 518359 567946 488081 479476 505786 592402 684769 766675 1007883 1159029 1102428 983594
20005 983594 933119 818346 792460 742160 647273 561643 558872 597589 617731 624226 603843 586745
19993 586745 590259 542093 584528 661473 544958 516889 420884 243229 288086 334240 480863
19982D80863R5947o6369j11509K3831J08389k147k6611p4390l3814m9015J360
19971C46535L3304j5063P394L122J4373J84080Q7819J4635n9726o1662m7492o8897
19959D38422p2120J0867O2315m0827Q3530J46380N3518J8831R1283k525m728o9760
19947G15186J16893J57823L7127j11272p0963m3698O6500L2262J8562l6534M0559
19936I22445j72314q5951J09684N0919j3370j0577j3842l906Q8518j19333j92329
19925E59944N7172J39826L2016q1419p6878k0403n4250L9782J160Q9650M1311
19914G27911j8847k1178R561m8202m6892j2706J65879O5362j4540Q3499Q8635
19903I78482o6297p9954K4909l3355J24104J01720j4410n8550M8225N4886l6680
$$ plain form
19982 480863 576810 510441 398932 422763 531152 529005 502394 428004 394190 345175 346535
19971 346535 379839 364776 372170 375292 389665 573745 661564 676199 616473 554811 507319 438422
19959 438422 366302 377169 439484 398657 482187 628567 682085 700916 792199 789674 784946 715186
19947 715186 832079 989902 1027029 915757 844794 801096 867596 899858 918420 881886 922445
19936 922445 750131 664180 773864 824783 811413 800836 786994 783088 871606 752273 559944
19925 559944 617116 756942 788958 707539 630661 610258 556008 595790 596950 686600 727911
19914 727911 709064 687886 697447 649245 602353 589647 755526 820888 806348 889847 978482
19903 978482 912185 832231 857140 823785 947889 1049609 1035199 976649 1024874 1079760 1043080
19892A043080L8709Q9964J44718Q7595j6857n8556m6723L6742M6108J51338J01335
19881A617453p3613j4533R6886J04292r4160k3093M3510k9160J72175J9957j47337
19870A672377j49917j41852Q835J19732Q8542m118K9655l9314p42J72959J11545
19859A867702p4568j10360J457o351J00470N3055L7135M3267O2130L603R9671
19848B077211J79868L15793L46925K53656J26492P8456N9683J10851J50643J14653
19838C814231K98902L14099L40413L69075K75617L19857M45904M75385P17719
19829G371202J018777J391907J730095K113868K666573L723626N241068P945513
19821C3202629J2066863J8031624K4298931K6763415J9266070O944395p63993
$$ plain form
19892 1043080 1081789 1171753 1316471 1404066 1387209 1328653 1281930 1318672 1364780 1516118 1617453
19881 1617453 1543840 1529307 1626193 1730485 1636325 1613232 1656742 1627582 1799757 1819714 1672377
19870 1672377 1522460 1380608 1389443 1509175 1597717 1593599 1623254 1583940 1583198 1756157 1867702
19859 1867702 1793134 1682774 1684231 1677880 1778350 1831405 1868540 1911807 1973937 1977540 2077211
19848 2077211 2257079 2572872 2919797 3173453 3299945 3378401 3438084 3548935 3699578 3814231
19838 3814231 4113133 4427232 4767645 5136720 5412337 5732194 6178098 6653483 7371202
19829 7371202 8389979 9781886 11511981 13625849 16292422 20016048 25257116 33202629
19821 33202629 45269492 63301116 87600047 114363462 133629532 140573927 139809934
19814A39809934j7367512j2779993M860168J6528919J7253129L992206n429091
19807A46867760k2857959l6534790k5626834j4655002q808764n693337l607955
19800B9083119k618535k623127k727648k607673k337828j750906j092199q47623
19792A2477580o38297l84692l76061n71375m79940m96235m59797m21676j79442
19783H470065Q9230J90952J45068K0735O7675L3555J22120L05398M84449P52828
19773A0682075J249707J674137K012859K561046L663962M883306P023592J0800654
19765D4551338J6559541K3698278K9246608K8266691J4654207M602364r003414
19758A52575613k0808163m290121J3569381K1722096J3855991j643798j2933242
$$ plain form
19814 139809934 122442422 109662429 114522597 131051516 148304645 152296851 146867760
19807 146867760 124009801 87475011 61848177 47193175 38384411 32691074 29083119
19800 29083119 26464584 23841457 21113809 18506136 16168308 14417402 13325203 12477580
19792 12477580 11839283 11454591 11078530 10507155 10027215 9530980 9071183 8649507 8470065
19783 8470065 8559295 8750247 8895315 8916050 8983725 9017280 9139400 9444798 9929247 10682075
19773 10682075 11931782 13605919 15618778 18179824 21843786 26727092 33750684 44551338
19765 44551338 61110879 84809157 114055765 142322456 156976663 161579027 152575613
19758 152575613 131767450 127477329 141046710 162768806 176624797 174980999 162047757
19751A62047757l7647864l7875728k3321289j3543395q405539n424575l805313
19744C2024054l394366l555087l223839k899933k282978j716261j538681j301804
19736A2111105j059175p29132p82288r65513q58902q06913n26677m32788l82298
19727E567419k83935k70822j65131k43246k27302l22707l83268l68512r2459o6921
19717C143116l3491k30763j08994r2665o2072j43218j19978m5060j19885o6133
19707B120857j07970Q0659n375J9421O2526K7674N7637R054M4171N8642k2258
19696B345038R7873L12136L37494L19796K17968P6697L5701J04722P5719J87319
19686D110463K42259M6426J4586J64976L92593L90984K79083L69320K89758K55337
$$ plain form
19751 162047757 124399893 86524165 63202876 49659481 41253942 35829367 32024054
19744 32024054 28629688 25074601 21850762 18950829 16667851 14951590 13412909 12111105
19736 12111105 11051930 10322798 9540510 8574997 7716095 6909182 6382505 5949717 5567419
19727 5567419 5283484 5012662 4847531 4604285 4376983 4054276 3671008 3302496 3210037 3143116
19717 3143116 3109625 2878862 2769868 2677203 2615131 2471913 2351935 2306875 2186990 2120857
19707 2120857 2012887 2093546 2088171 2107592 2170118 2197792 2255429 2264483 2308654 2367296 2345038
19696 2345038 2442911 2755047 3092541 3412337 3630305 3707002 3742703 3847425 3923144 4110463
19686 4110463 4352722 4399148 4413734 4578710 4971303 5362287 5641370 6010690 6300448 6555785
19676F555785N52051P99639J206856J563639J673888K145948K960764L986942
19668B1445512N701525Q575202J3175211J9464332K5486800K7364432J8995187
19661A40208201O829092l070997j8862927j4127615K974524J3978881J3756756
19654A41685915K763316o180908k2418625l2544193k3073540j3377655q126548
19647C8727762n167776l382456k712932k539232k340988k109473j810716j344566
19639A7319623r17796o62137l34709l63106k46452l59890k80431Q8057N56270
19630A4799429R57781J295589J700512K374264L248816M580803O839978J0325871
19622D6123043J5781858K3284784L0315791L1401168J9972561O104214o414204
$$ plain form
19676 6555785 7107836 7907475 9114331 10677970 12351858 14497806 17458570 21445512
19668 21445512 27147037 35722239 48897450 68361782 93848582 121213014 140208201
19661 140208201 147037293 143966296 125103369 110975754 113950278 127929159 141685915
19654 141685915 144449231 138268323 115849698 83305505 60231965 46854310 38727762
19647 38727762 33559986 30177530 27464598 24925366 22584378 20474905 18664189 17319623
19639 17319623 16401827 15739690 15404981 15041875 14795423 14435533 14155102 14243159 14799429
19630 14799429 15757210 17052799 18753311 21127575 24376391 28957194 35797172 46123043
19622 46123043 61904901 85189685 115505476 146906644 166879205 172983419 166569215
19615A66569215k4343817j6111870L398205J4711490J3031559R16461q864948
19608A49306295k7345101l5361100k4206969j4307052q907777n760833l944372
19601B9473091l089695l154809k871334k621695k313194j783140j297358j090442
19593A1251424r61020q21106p94465p50543o54388n58575m36055l92726m75707
19584E406839m79000m45105k38960k60857k63537k82900m65778m04939l36311
19575B229452k92409k10458j86712k77021p433k2870K3874j68260k50277j33225
19565G04661j21364o445m2703o9107K3286l2300n5016j28986j34809j09597K6077
19554E3697J67835J074r681k6419J5592k9761j6232J13285p5978p8787O2578l1947
$$ plain form
19615 166569215 142225398 126113528 129511733 144223223 157254782 158171243 149306295
19608 149306295 121961194 86600094 62393125 48086073 39178296 33417463 29473091
19601 29473091 26383396 23228587 20357253 17735558 15422364 13639224 12341866 11251424
19593 11251424 10290404 9469298 8674833 7924290 7269902 6711327 6275272 5882546 5406839
19584 5406839 4927839 4482734 4243774 3982917 3719380 3436480 2970702 2565763 2229452
19575 2229452 1937043 1726585 1539873 1262852 1255419 1232549 1256423 1088163 837886 704661
19565 704661 583297 576852 534149 465042 488328 456028 401012 272026 137217 27620 53697
19554 53697 221532 222606 212925 186506 202098 172337 156105 269390 193412 114625 177203 145256
19542A45256m1091J04648J4156j4679J09137R591P3747J17048J15511Q9724J04982
19531H28030J12632J73194P4116n6160k49843k91315j58623j36044j7253K2229
19521C00963p8539l5387r7117j4049K4094K9893q175J2155L5670l7311r9413m3437
19509a0653J07495k0056j14971j7054J06519R4611j00058n7860k0151R5051Q2358
19498A45231M5776j8554n0091j23454k7725J9058O3510J19111J20435m3599J02066
19487C51764J30429M5525M6801N234j15893j17458j04908J1537M3880J57707J09209
19476E63827n2163j3033j8220j16142j15908r9295k00473J3424R4255j70048l9761
19465a53537R0823j3489J1551P255P037l3937p8865M5967M0720O5058J905k0341
$$ plain form
19542 145256 104165 208813 222969 208290 317427 327018 400765 517813 633324 723048 828030
19531 828030 940662 1113856 1187972 1131812 881969 590654 432031 295987 278734 300963
19521 300963 222424 187037 89920 75871 99965 129858 121683 133838 169508 132197 32784 -10653
19509 -10653 96842 76786 -38185 -55239 51280 145891 45833 -12027 -32178 62873 145231
19498 145231 191007 172453 122362 -1092 -28817 -9759 53751 172862 293297 249698 351764
19487 351764 482193 527718 574519 579753 463860 346402 241494 253031 296911 454618 563827
19476 563827 511664 498631 480411 364269 248361 149066 -51407 -37983 56272 -113776 -153537
19465 -153537 -62714 -76203 -64652 -57397 -50360 -84297 -163162 -117195 -76475 -11417 -9512 -29853
19453b9853j3922J512K0358L1892J11487P8069M5304r8108j53957m5843J02333
19442D9272J29678q124j84426j11527k4732P3403L23566J74796q8858L6761j7714
19431C52095j00629o9944n7748k1523J22679l8852j0343j77810J9947K8129k45488
19420a99487o5706J15668J12459L3339L2130P3379J13208q7394k01727j17327
19410a91458L5448J48395Q6014m2092j8341m2926J44676J1660q4910n1654r8985
19399a04173l9145J13359M1686J53057O8921j19594o9551R4119N4539j4176j9213
19388A59829j0148K489R2004r05m5949n941k7688j3689k3702n9968l4960P6323
19376A07695j35521q7942J52041J81748l0878j4629O5370j9426j3923r2609M2927
$$ plain form
19453 -29853 -43775 -42263 -21905 9987 121474 199543 244847 146739 -7218 -53061 49272
19442 49272 178950 170826 -13600 -125127 -149859 -76456 247110 421906 333048 369809 352095
19431 352095 251466 181522 123774 102251 224930 186078 175735 -2075 17872 46001 -199487
19420 -199487 -265193 -149525 -37066 -3727 28403 101782 214990 127596 -74131 -191458
19410 -191458 -156010 -7615 78399 36307 17966 -24960 119716 131376 46466 -5188 -104173
19399 -104173 -143318 -29959 11727 164784 233705 114111 44560 138679 193218 179042 159829
19388 159829 149681 152170 244174 243269 197320 191379 163691 150002 126300 66332 31372 107695
19376 107695 -27826 -115768 36273 218021 187143 172514 237884 218458 204535 111926 154853
19365A54853l0947o2334k453M9474P4562K321j1553n6242J0133j751J468L0811
19353A58342k4636N5829J3458K8132j35661O2679J31649J2321n0261p6805l9023
19342A36024o7162j3930n5614n0081M8333J47667K2678J9199L88o0199l9666n3183
19330C4454J2584J3678J14318J24703J07719r7270p3775o7726q4539J04588j6367
19319A72367n5137M0407j840Q6355O9695J6201m3480J0244L8515M4558o0710J3268
19307C30443J0828J6282k2693r1676N8155l472k178K5338Q046N5514J02665Q8448
19295E75700P7042P3427M030p0690K3249M6499J10837k5510M6270J05587J48263
19284A114704l9400L0829Q1831q0540p9877j25564m9096R811K2690K97440K18498
$$ plain form
19365 154853 123906 61572 59119 108593 183155 185476 173923 117681 127814 126063 127531 158342
19353 158342 133706 189535 202993 231125 95464 158143 289792 302113 251852 175047 136024
19342 136024 68862 54932 -682 -50763 -2430 145237 167915 187114 187502 127303 87637 34454
19330 34454 47038 60716 175034 299737 407456 310186 236411 168685 84146 188734 172367
19319 172367 117230 157637 155797 242152 311847 328048 284568 294812 333327 377885 317175 330443
19307 330443 341271 357553 334860 243184 301339 297867 295689 321027 329073 384587 487252 575700
19295 575700 652742 726169 730199 659509 682758 729257 840094 814584 860854 966441 1114704
19284 1114704 1075304 1106133 1187964 1107424 1027547 901983 852887 862698 885388 1182828 1401326
19273A401326M3180J5232j20310l4519m0628j8599k8597O7909l1053j01493k23810
19262I28638j9304j02407n6471N1839O5425J39911l3436J735J03248J3227r2998
19251I99407l6277l8167p4067M6450J23834P0408K1626O8027n95N5221R9234K9270
19239A364371J1619o9943O632q2869j8695J28294j5476q602M0436J67337J80629
19228A703733J00453J07468R2795J25750J1162l1957J16169O9474N2899R869M220
19217B362035J50186j05300j00859J07683R808r6346n2363k11145j30544n5239
19207A877916j30324j28704M5236r1123j06099n17m5867J497l4660j29337Q7318
19196A345336J33103l5158Q9818K01669L14113Q2174O4792R9832j97462l41219
$$ plain form
19273 1401326 1444506 1459738 1339428 1304909 1264281 1245682 1217085 1284994 1253941 1152448 928638
19262 928638 909334 806927 750456 802295 867720 1007631 974195 975930 1079178 1092405 999407
19251 999407 963130 924963 850896 897346 1021180 1091588 1113214 1181241 1180646 1235867 1335101 1364371
19239 1364371 1375990 1306047 1312679 1229810 1211115 1339409 1323933 1315331 1355767 1523104 1703733
19228 1703733 1804186 1911654 2004449 2130199 2141361 2109404 2225573 2295047 2347946 2357815 2362035
19217 2362035 2512221 2406921 2306062 2413745 2423553 2327207 2274844 2063699 1933155 1877916
19207 1877916 1747592 1618888 1664124 1573001 1466902 1466385 1420518 1422015 1387355 1258018 1345336
19196 1345336 1478439 1443281 1533099 1734768 2048881 2131055 2195847 2295679 2098217 1756998
19186A756998l22191k29902q8527J3417M5898M4940K0330l6008L8860O9534J0389
19175A323738K9820Q0718J47836Q9191J4861q7546j25996n4844q2322j41283m3310
19164A150863M959j09541j35537O9134L8289j08193M6182N6863J04131J40413
19154A257563J37477L41420L03206L22800K6652J8762j9000n9974j33428j27167
19144B068311o6949j38199j61887o6311p5712O1731J22110M6526j40047j60717
19134A488856j69880k74782K4781J52425N418n6847j52126j1497L1282j18898
19124I18732J2257o0001O8835K3276P805R924J4618o5078m4283m782P5634k1854
19112I35083j8260J18834q1318O0853Q1607j7659R7808J19563R5334J83974K51542
$$ plain form
19186 1756998 1434807 1204905 1116378 1129795 1175693 1220633 1240963 1204955 1243815 1313349 1323738
19175 1323738 1353558 1434276 1582112 1671303 1686164 1598618 1472622 1417778 1335456 1194173 1150863
19164 1150863 1155822 1046281 910744 979878 1018167 909974 956156 1013019 1117150 1257563
19154 1257563 1395040 1736460 2039666 2362466 2389118 2407880 2388880 2328906 2195478 2068311
19144 2068311 2001362 1863163 1701276 1634965 1559253 1620984 1743094 1789620 1649573 1488856
19134 1488856 1318976 1044194 1068975 1221400 1226818 1169971 1017845 1006348 1037630 918732
19124 918732 930989 870988 939823 963099 970904 980828 995446 930368 886085 881303 956937 935083
19112 935083 916823 1035657 954339 1015192 1096799 1079140 1176948 1296511 1391845 1575819 1827361
19101A827361n588j9054n0684l8255K6570n8439R8809K37274O4967R197j0401
19090B081757j54747j88606j06830j28297j51657l5127n6378k4024j06352Q1136
19080A210875M2663r6796j39980j54107n357K7075K2167M6448M9208K35806J18781
19069A356783l9698L3072q3532R63N3274n4145k48416p3044J07351Q4523K8683
19058A165814K39994J45412r850K8790K61118J31585Q6117J67505L9881L2458
19048B288824O358L2295O3124k2931K83040J27680J24413J85417J93702K76925
19038C558847K35919R8514J07568J66814K54599L56164M65582M61051Q53454J130775
19028G689287J411974J850160K224792L129961M466204O398377R620625J4233627
$$ plain form
19101 1827361 1821773 1802719 1752035 1713780 1740350 1681911 1780720 2017994 2082961 2092158 2081757
19090 2081757 1927010 1738404 1631574 1503277 1351620 1316493 1260115 1236091 1129739 1210875
19080 1210875 1253538 1156742 1016762 862655 857298 884373 906540 952988 1002196 1238002 1356783
19069 1356783 1317085 1350157 1266625 1267588 1320862 1266717 1018301 945257 1052608 1137131 1165814
19058 1165814 1405808 1551220 1541370 1570160 1831278 1962863 2048980 2216485 2256366 2288824
19048 2288824 2295182 2327477 2390601 2367670 2650710 2778390 2902803 3088220 3281922 3558847
19038 3558847 3794766 3893280 4000848 4167662 4422261 4778425 5244007 5705058 6558512 7689287
19028 7689287 9101261 10951421 13176213 16306174 20772378 27170755 36791380 51025007
19020E1025007J9107346K2093548J9818165J5077147R051413p784536j5607194
19013A12780896j5355674k2763432k1206363j2777390p254198m627386l443726
19006B5352727k750958k536009k337548k024011j610764j587857j216600p90014
18998A0498966n16964l10265j51296j56854k50547j52912j43545l08425k08937
18989H299221K0368J84261M12865Q33619J144937J431465J662596J933450K811608
18980A8734390L939375N757920Q918004J3105406J7624741K0044878J7163489
18973A05288203J3372973P700254o925237j1546773j0830349j5786318j1054273
18966G0218480m32147Q103572J3938718J6049384J2605196R438179k18869j3570585
$$ plain form
19020 51025007 70132353 92225901 112044066 127121213 136172626 128388090 112780896
19013 112780896 97425222 74661790 53455427 40678037 33423839 28796453 25352727
19006 25352727 22601769 20065760 17728212 15704201 14093437 12505580 11288980 10498966
18998 10498966 9982002 9671737 9520441 9363587 9113040 8960128 8816583 8508158 8299221
18989 8299221 8319589 8503850 8916715 9750334 10895271 12326736 13989332 15922782 18734390
18980 18734390 22673765 28431685 37349689 50455095 68079836 88124714 105288203
18973 105288203 118661176 126361430 119436193 107889420 97059071 81272753 70218480
18966 70218480 69786333 77889905 91828623 107878007 120483203 129921382 129702513 116131928
18958A16131928j4988287j7196594k1945398j5951789r215330n725543l836746
18951B7272241k814486k455840k373730k321803k093522j709332j405659j133111
18943A0964758p57506o29908m32491m37855l43775l63540l70999m35909l53469
18934F839306j74116q1981K5410L44240O65496Q31614J162131J471053J958641
18925A3041794K766426L906749N959283R176483J2967204J6193323J6444881J2750003
18917I3206146R720874m30772j1553145j1972765j4802270j8325829j2751612
18910C3090627p303287m319943l108224k483512j949593j727298j717735j477215
18902I003820j210398j043361q52166p46943n31241k43722k11675k67958j46634
$$ plain form
18958 116131928 101143641 83947047 62001649 46049860 36834530 31108987 27272241
18951 27272241 24457755 22001915 19628185 17306382 15212860 13503528 12097869 10964758
18943 10964758 10207252 9577344 9144853 8706998 8363223 7999683 7628684 7192775 6839306
18934 6839306 6665190 6583209 6608619 6952859 7618355 8449969 9612100 11083153 13041794
18925 13041794 15808220 19714969 25674252 34850735 47817939 64011262 80456143 93206146
18917 93206146 102927020 102496248 90943103 78970338 64168068 45842239 33090627
18910 33090627 25787340 21467397 18359173 15875661 13926068 12198770 10481035 9003820
18902 9003820 7793422 6750061 5897895 5150952 4619711 4375989 4164314 3896356 3749722
18893C749722j97616k70810l99150m71919j50757m9645q6399k16794n5529M206
18883A855309j68395k12329j52160j95330j10239o2770k30767j93625J1719K1055
18873E62468q5533J14122r7123j85250p1886o0369K0110L6317O0030M5503P3697
18862D12086n4858j34419j63747l497J08804J28540Q2143Q641m9927n3912m8809
18851B31045P1691J38029J49082J0413j56414q5720N0531J05156J1181J46865
18841F71859q8412K5831o2001r1451o233n4032j03393o8380J0612n6323k3909
18830A54168L7063q9996O748l645O7058r9975J3893N6133j2874r278j2854l3842
18818G2599J9339l8047J0383J37130R8052k9965L7630J7716l43k1247J178O7103
$$ plain form
18893 3749722 3552106 3281296 2882146 2410227 2259470 2209825 2123426 1906632 1851103 1855309
18883 1855309 1686914 1474585 1322425 1127095 1016856 954086 723319 529694 541413 562468
18873 562468 476935 591057 493934 308684 236798 176429 196539 232856 292886 338389 412086
18862 412086 357228 222809 59062 55565 164369 292909 375052 383693 333766 279854 231045
18851 231045 302736 440765 589847 600260 443846 358126 408657 513813 524994 671859
18841 671859 583447 609278 547277 455826 449593 395561 292168 223788 234400 178077 154168
18830 154168 191231 101235 107983 104338 171396 71421 85314 141447 128573 119295 106441 72599
18818 72599 91938 53891 64274 201404 299456 269491 307121 324837 324494 303247 304425 371528
18806C71528O4658l1564L6595J01961N6746L3772o6479l0440k0138J20433N2147
18795F89219J12101Q054j69518j57588j35487m3607j23108l4435j3542n5778K8473
18784A04784l630j35213J24032J28922J6918j0397L724K3336Q3203O8860m5573
18773C58966k1235K2926J43577K07595K24591J90382P5977q4678k70629k29980
18763F17492j45051j16146k9497n7668l0804m5972N3044J9850o2295j0420L7988
18752B30521m1753n5023K5270J08104J24522j1790L7819N3263p7787l3575p9325
18741B80246j06582k6252J6236Q0393J01301j0285p1929l0348r8366j9490j03543
18730A1381n3027P0378m1090L4639K10990O3643m3291J03540R9318O4116J37500
$$ plain form
18806 371528 436186 404622 441217 543178 599924 633696 567217 536777 516639 637072 689219
18795 689219 801320 809374 639856 482268 346781 303174 180066 145631 132089 76311 104784
18784 104784 101154 -34059 89973 218895 235813 225416 229140 252476 335679 404539 358966
18773 358966 337731 360657 504234 711829 936420 1126802 1202779 1118101 847472 617492
18763 617492 472441 356295 326798 269130 238326 192354 245398 265248 202953 192533 230521
18752 230521 188768 133745 159015 267119 391641 379851 417670 470933 393146 359571 280246
18741 280246 173664 147412 163648 244041 345342 335057 263128 232780 134414 114924 11381
18730 11381 -41646 28732 -12358 22281 233271 296914 253623 357163 456481 520597 658097
18719F58097J16172N579m1653L9600J15672m2348j31838j68925m4770m6030n5008
18708D04548R1231N2846Q3866r6788q7166r4J86650K2081m0171n7332m3707O5023
18696E80987r488N499m9814J4521K7831o6305p6379Q8784J37963k7089r7400j16990
18684D12120m7598N7297o5550o5243J7727n397O375J01626q4127r0568R0915p3635
18672B53942k0911k5710L7489J67169J62343M5578n3743P8122O8971n9476m9418
18661F04356r4417r6155q0782P744L1646M4855m8308J00561M4150O9556R0703
18650F73909j7418l6931Q0295P0126J66445J32870J74954k501k5495j41253k71661
18639H03340k7550M5091J26007K0944o3328r0854L0861P8420p1622k1788O8128
$$ plain form
18719 658097 774269 779848 738195 777795 893467 851119 719281 550356 505586 459556 404548
18708 404548 495779 548625 632491 535703 448537 448443 635093 657174 617003 559671 515964 580987
18696 580987 571499 576998 527184 541705 569536 503231 426852 515636 653599 626510 529110 412120
18684 412120 364522 421819 356269 291026 308753 303356 309731 411357 327230 236662 327577 253942
18672 253942 233031 207321 244810 411979 574322 619900 566157 644279 713250 653774 604356
18661 604356 509939 413784 333002 340746 372392 417247 368939 469500 513650 583206 673909
18650 673909 656491 619560 699855 769981 936426 1069296 1244250 1241749 1216254 1075001 803340
18639 803340 775790 820881 946888 967832 904504 813650 844511 922931 851309 829521 897649
18628H97649J28080l8351r3014R3136j02703Q3353J81183M7747J5805r0604j40969
18617I81312j94984j35042n9155J44791J28125P3441J05611j5679Q3977J55826
18607A268223K66764K92746K87375L51288M04512L30909J76958k9263m06198p09946
18597B233368n08737k03857k13471j42767K2865J09740J80941L2281J91420J50072
18587A851855K00216J71175K67767K85614J60655P8107k14296l07623k78618j82413
18577B032439l9496j82196k03673j60475j76212J2052J07586J25639J60831K22054
18567A898549J81925L38800N46626N65598Q04973P96202N26902L06674j42393
18558E823856p65530j142858r10120p05106l49668k71535k53418o0477j60421
$$ plain form
18628 897649 1025729 987378 894364 987500 884797 968150 1149333 1197080 1212885 1122281 981312
18617 981312 786328 651286 592131 736922 865047 938488 1044099 1028420 1112397 1268223
18607 1268223 1534987 1827733 2115108 2466396 2870908 3201817 3378775 3349512 2943314 2233368
18597 2233368 1724631 1520774 1307303 1164536 1187401 1297141 1478082 1510363 1701783 1851855
18587 1851855 2052071 2223246 2491013 2776627 2937282 3015389 2801093 2493470 2214852 2032439
18577 2032439 1992943 1810747 1607074 1446599 1270387 1282439 1390025 1515664 1676495 1898549
18567 1898549 2080474 2419274 2965900 3531498 4336471 5132673 5659575 5966249 5823856
18558 5823856 5058326 3915468 3005348 2300242 1950574 1679039 1425621 1365144 1204723
18549A204723j86527q1328k08442j13101P3135J87254J41521j09568L0359n6223
18539H81803K3446k3792k9200m6996p4278j21295k51813n3197N5750N6593P3258
18528D90279J45381R3721j15053l120M5412N7824m7939M2156O2354j00127R0691
18517G61579O3364P3505L5001r5793L6488o5753j03498p1919P1619j36913j68939
18506C98741M7772M3467q7369n0234r6727Q9650R8407J57481Q1672J20128J43540
18495I46528P4834j05724J66081K4121q8166n5550k5427K41k35r9275q9047o8062
18483F80319l0162L9125J4568J52749L0672r1251Q3619K20157O3178K4274o4238
18472A123010j03105j76350j76246K9127m397N1444L5466r6670l4674M0236m2480
$$ plain form
18549 1204723 1018196 936868 728426 615325 688460 875714 1017235 907667 938026 881803
18539 881803 905249 881457 852257 805261 730983 609688 357875 304678 360428 417021 490279
18528 490279 635660 729381 614328 611208 656620 714444 666505 708661 771015 670888 761579
18517 761579 824943 898448 933449 837656 874144 808391 704893 632974 704593 567680 398741
18506 398741 446513 489980 402611 352377 255650 345300 443707 601188 682860 802988 946528
18495 946528 1021362 915638 1081719 1105840 1017674 962124 936697 936938 936703 837428 748381 680319
18483 680319 650157 689282 703850 856599 887271 796020 879639 1099796 1162974 1187248 1123010
18472 1123010 1019905 843555 667309 696436 692039 743483 778949 682279 647605 687841 645361
18461F45361R4247J36484j2717n5101M2633J06523J88974J72286O2642K11963
18451A593295K17223P0992j19809r0963j34576r1099o34j00611k42677L4461P5165
18440A210767n7157J13480P9396O9132o6211K2557J18773q5691o8807r9133j8213
18429A218893o6520j15714m405Q2958P5973j4914p4312o74L4955K8364m9080j33941
18417I81583p7477N0241p4976o2465j37712J4660J79593J69282J20171L4660m2963
$$ plain form
18461 645361 739608 876092 863375 808274 850907 957430 1146404 1318690 1381332 1593295
18451 1593295 1810518 1881510 1761701 1670738 1536162 1445063 1444429 1343818 1101141 1135602 1210767
18440 1210767 1153610 1267090 1346486 1415618 1349407 1371964 1490737 1405046 1336239 1237106 1218893
18429 1218893 1152373 1036659 1032254 1115212 1191185 1176271 1101959 1101285 1136240 1164604 1115524 981583
18417 981583 904106 954347 879371 816906 679194 693854 873447 1042729 1162900 1197560 1154597
$$ [...]
##END NTUPLES=NMR SPECTRUM
##END=
