##TITLE=Analysis number 308991
Compound Code cc 09106
Book Reference 440/6
Project Code adrs
Chemist Name craigr
##JCAMPDX= 6.0         $$ Bruker NMR JCAMP-DX V2.0
##DATA TYPE= NMR SPECTRUM
##DATA CLASS= NTUPLES
##ORIGIN= Bruker BioSpin GmbH
##OWNER= NMR
$$ XWIN-NMR		Version 3.5
$$ Thu May 26 11:12:12 2005 GMT Daylight Time (UT+1h)  MAYBRIDGE\NMR@NMR_250MHZ
##.OBSERVE FREQUENCY= 250.131544655141
##.OBSERVE NUCLEUS= ^1H
##.ACQUISITION MODE= SIMULTANEOUS (DQD)
##.ACQUISITION SCHEME= undefined
##.AVERAGES= 16
##.DIGITISER RES= 18
##SPECTROMETER/DATA SYSTEM= dpx250
##.PULSE SEQUENCE= zg30
##.SOLVENT NAME= CDCl3
##.SHIFT REFERENCE= (INTERNAL, CDCl3, 0, 16.4506)
##AUDIT TRAIL= $$ (NUMBER, WHEN, WHO, WHERE, WHAT)
$$ ##TITLE= Audit trail, XWIN-NMR		Version 3.5
$$ ##JCAMPDX= 5.01
$$ ##ORIGIN= Bruker BioSpin GmbH
$$ ##OWNER= NMR
$$ C:\u/data/dgb/nmr/ADRS/3560/pdata/1/auditp.txt
$$ ##AUDIT TRAIL=  $$ (NUMBER, WHEN, WHO, WHERE, WHAT)
(   1,<2005-05-26 11:11:52.37 +100>,<MAYBRIDGE\NMR>,<NMR_250MHZ>,
      <created by zg, POWCHK disabled, PULCHK disabled
       configuration hash MD5:
       62 19 C7 07 E1 42 D1 B7 37 6C 3D D0 77 39 F9 E6
       data hash MD5: 64K
       2D EC 92 1E 94 89 68 4D 64 18 57 24 AD C7 18 80>)
(   2,<2005-05-26 11:12:05.56 +100>,<MAYBRIDGE\NMR>,<NMR_250MHZ>,
      <Start of raw data processing
       ef LB = 0.3 FT_mod = 6 PKNL = 1 SI = 32K 
       data hash MD5: 32K
       85 F0 6E 5A 77 58 2B 7D B3 8A 61 01 30 AD E2 77>)
(   3,<2005-05-26 11:12:07.21 +100>,<MAYBRIDGE\NMR>,<NMR_250MHZ>,
      <apk 
       data hash MD5: 32K
       3E A9 43 16 4E 6C 16 C8 D8 59 21 05 DB D1 D8 B3>)
(   4,<2005-05-26 11:12:07.95 +100>,<MAYBRIDGE\NMR>,<NMR_250MHZ>,
      <abs ABSG = 5 
       data hash MD5: 32K
       9F 95 70 78 43 F8 5E 75 AE D3 EE 2C B4 DA 2C E7>)
$$ ##END=
$$ 
$$ hash MD5
$$ 3B CE 2A 6D 35 6C 98 06 DB 6E 2C FE 6F 0D 69 57
##$RELAX= 
##$RELAX= 
##$RELAX= 
##$RELAX= 
##$RELAX= 
##$RELAX= 
##$RELAX= 
$$ Bruker specific parameters
$$ --------------------------
##$DU= <C:\u>
##$EXPNO= 3560
##$NAME= <ADRS>
##$PROCNO= 1
##$TYPE= <nmr>
##$USER= <dgb>
##$AMP= (0..31)
100 100 100 100 100 100 100 100 100 100 100 100 100 100 100 100 100 100 
100 100 100 100 100 100 100 100 100 100 100 100 100 100 
##$AQSEQ= 0
##$AQ_mod= 3
##$AUNM= <au_zg>
##$AUTOPOS= <13 >
##$BF1= 250.13
##$BF2= 250.13
##$BF3= 250.13
##$BF4= 250.13
##$BF5= 500.13
##$BF6= 500.13
##$BF7= 500.13
##$BF8= 500.13
##$BYTORDA= 1
##$CFDGTYP= 0
##$CFRGTYP= 5
##$CHEMSTR= <none>
##$CNST= (0..31)
1 1 145 1 1 1 1 1 1 1 1 1 1 1 1 1 1 1 1 1 1 1 1 1 1 1 1 1 1 1 1 1 
##$CPDPRG= <>
##$CPDPRG1= <>
##$CPDPRG2= <>
##$CPDPRG3= <>
##$CPDPRG4= <mlev>
##$CPDPRG5= <mlev>
##$CPDPRG6= <mlev>
##$CPDPRG7= <mlev>
##$CPDPRG8= <mlev>
##$CPDPRGB= <>
##$CPDPRGT= <>
##$D= (0..31)
0 1 0 0 0 0 0 0 0 0.06 0 0 0 0 0 0 0.0002 0 0 0 0 0 0 0 0 0 0 0 0 0 0 
0 
##$DATE= 1117102311
##$DBL= (0..7)
120 120 120 120 120 120 120 120 
##$DBP= (0..7)
150 150 150 150 150 150 150 150 
##$DBP07= 0
##$DBPNAM0= <>
##$DBPNAM1= <>
$$ [...]
##$SUBNAM7= <"">
##$SUBNAM8= <"">
##$SUBNAM9= <"">
##$SW= 20.6930455092707
##$SWIBOX= (0..15)
0 0 3 0 0 0 0 0 0 0 0 0 0 0 0 0 
##$SW_h= 5175.983436853
##$TD= 65536
##$TD0= 1
##$TE= 294.16
##$TE2= 300
##$TE3= 300
##$TEG= 300
##$TL= (0..7)
0 120 120 120 120 120 120 120 
##$TP= (0..7)
150 150 150 150 150 150 150 150 
##$TP07= 0
##$TPNAME0= <>
##$TPNAME1= <>
##$TPNAME2= <>
##$TPNAME3= <>
##$TPNAME4= <>
##$TPNAME5= <>
##$TPNAME6= <>
##$TPNAME7= <>
##$TPOAL= (0..7)
0.5 0.5 0.5 0.5 0.5 0.5 0.5 0.5 
##$TPOFFS= (0..7)
0 0 0 0 0 0 0 0 
##$TUNHIN= 0
##$TUNHOUT= 0
##$TUNXOUT= 0
##$USERA1= <user>
##$USERA2= <user>
##$USERA3= <user>
##$USERA4= <user>
##$USERA5= <user>
##$V9= 5
##$VALIST= <valist>
##$VCLIST= <CCCCCCCCCCCCCCC>
##$VD= 0
##$VDLIST= <DDDDDDDDDDDDDDD>
##$VPLIST= <PPPPPPPPPPPPPPP>
##$VTLIST= <TTTTTTTTTTTTTTT>
##$WBST= 1024
##$WBSW= 4
##$XGAIN= (0..3)
0 0 0 0 
##$XL= 0
##$YL= 0
##$YMAX_a= 253653
##$YMIN_a= -184544
##$ZGOPTNS= <>
##$ZL1= 120
##$ZL2= 120
##$ZL3= 120
##$ZL4= 120
##$ABSF1= 16.45059
##$ABSF2= -4.242582
##$ABSG= 5
##$ABSL= 3
##$ALPHA= 0
##$AQORDER= 0
##$ASSFAC= 0
##$ASSFACI= 0
##$ASSFACX= 0
##$ASSWID= 0
##$AUNMP= <proc_1d>
##$AZFE= 0.1
##$AZFW= 0.1
##$BCFW= 0
##$BC_mod= 0
##$BYTORDP= 0
##$COROFFS= 0
##$CY= 12.5
##$DATMOD= 1
##$DC= 0
##$DFILT= <>
##$DTYPP= 0
##$F1P= 14.0000005364418
##$F2P= -0.99999901652339
##$FCOR= 0.5
##$FTSIZE= 32768
##$FT_mod= 6
##$GAMMA= 0
##$GB= 0
##$INTBC= 1
##$INTSCL= 1
##$ISEN= 128
##$LB= 0.3
##$LEV0= 0
##$LPBIN= 0
##$MAXI= 10000
##$MC2= 0
##$MEAN= 0
##$ME_mod= 0
##$MI= 0
##$NCOEF= 0
##$NC_proc= -4
##$NLEV= 6
##$NOISF1= 0
##$NOISF2= 0
##$NSP= 0
##$NTH_PI= 0
##$NZP= 0
##$OFFSET= 16.45059
##$PC= 1
##$PHC0= -72.32635
##$PHC1= 15.69188
##$PH_mod= 1
##$PKNL= yes
##$PPARMOD= 0
##$PSCAL= 4
##$PSIGN= 0
##$REVERSE= no
##$SF= 250.130017861381
##$SI= 32768
##$SIGF1= 0
##$SIGF2= 0
##$SINO= 400
##$SIOLD= 32768
##$SREGLST= <1H.CDCl3>
##$SSB= 0
##$STSI= 32768
##$STSR= 0
##$SW_p= 5175.98343685301
##$SYMM= 0
##$S_DEV= 0
##$TDeff= 65536
##$TDoff= 0
##$TI= <Analysis number 999999
Compound Code 99
Book Reference 9
Project Code 9>
##$TILT= no
##$TM1= 0
##$TM2= 0
##$TOPLEV= 0
##$USERP1= <user>
##$USERP2= <user>
##$USERP3= <user>
##$USERP4= <user>
##$USERP5= <user>
##$WDW= 1
##$XDIM= 32768
##$YMAX_p= 391762022
##$YMIN_p= -628284
$$ End of Bruker specific parameters
$$ ---------------------------------
##NTUPLES= NMR SPECTRUM
##VAR_NAME=  FREQUENCY,     SPECTRUM/REAL,   SPECTRUM/IMAG
##SYMBOL=    X,             R,               I
##VAR_TYPE=  INDEPENDENT,   DEPENDENT,       DEPENDENT
##VAR_FORM=  AFFN,          ASDF,            ASDF
##VAR_DIM=   32768,         32768,           32768
##UNITS=     HZ,            ARBITRARY UNITS, ARBITRARY UNITS
##FACTOR=    0.157963299565203, 1,           1
##FIRST=     4114.78640396438, 0,            0
##LAST=      -1061.19703288863, 0,           0
##MIN=       -1061.19703288863, -628284,     0
##MAX=       4114.78640396438, 391762022,    0
$$ Real data points
##PAGE= N=1
##DATA TABLE= (X++(R..R)), XYDATA
$$ [...]
23317A48451j32184j40873l9216Q7070J8831n880R3023r632k2572p8893j78738
23306b60613M3671N0557j39158J30818P8407j9128r7827L8109J49399P2909m4400
23295B744j1326J57038k3875k3275j61111r0313k8285o0107q7275o3832J02514
23284b87103M0168M5444j1928J66853j3441o3751J82155J65890j9297j98065k51687
23273b44762l3496J64810l7697k04812J35491J73308m4517l1280R8495K16535
23263A92075K2346m3259P893j08302k37431l9650j31864J12987J58504J48269
23253H1568J59683j58922j75716k3216m3647N3939j6689p5750J52693R5325n725
23242D3543J54789O469r7555p389p53l0450L1374m4518q1790J36187Q5205Q779
$$ y = [148451, 16267, -124606, -163822, -76752, -57921, -63801, 29222, 19590, -2982, -81875, -260613, -216942, -166385, -305543, -174725, -96318, -115446, -213273, -175164, -25765, 47144, 2744, -8582, 148456, 124581, 101306, -59805, -150118, -178403, -238510, -325785, -389617, -287103, -246935, -201491, -213419, -46566, -60007, -123758, 58397, 224287, 204990, 6925, -244762, -278258, -113448, -151145, -355957, -220466, -47158, -91675, -122955, -24460, 192075, 214421, 171162, 179055, 70753, -166678, -206328, -338192, -225205, -66701, 81568, 241251, 82329, -93387, -116603, -160250, -106311, -123000, -198750, -46057, 49268, 43543, 198332, 204801, 107246, 99857, 99104, 68654, 100028, 55510, -26280, 109907, 195112, 203891]
23230B03891j29554n8123m2045k55948P5297K44761P6381K0232j6372m268P5935
23219A90187o1700l8203m6021j7696k6381j43607R6893L3159k5968L2618m7715
23208e4434J32076K19873j91208j57890K26127j93034j20641J17906j7453j98775
23198b37453k673M696j10233m7957K9284p2156K5463R5555P0045J9680l2758k1026
23186b79533J02234m462j42218r0725N2418J57033J56489j09501r8228Q8846K86270
23175A18623K04550k42298j44579j30429l52643M6201J06232N4235J20460O4384
23165a55264l8911M716J67152j5776k6428Q5750j36675j59978K7177k2073r497
23154b79807R1385m8676m2921R952O3197P2425J19283K0832l5492M4525j05441
$$ y = [203891, 74337, 16214, -25831, -281779, -206482, 38279, 114660, 134892, 118520, 114252, 190187, 128487, 90284, 44263, 26567, 186, -143421, -46528, -13369, -39337, -6719, -54434, 77642, 297515, 106307, -51583, 174544, -18490, -139131, -21225, -38678, -237453, -240126, -235430, -345663, -393620, -364336, -436492, -411029, -315474, -245429, -225749, -258507, -279533, -177299, -181761, -323979, -414704, -362286, -205253, -48764, -158265, -256493, -167647, 118623, 323173, 80875, -63704, -194133, -546776, -500575, -394343, -340108, -219648, -155264, -194175, -189459, -22307, -38083, -64511, 21239, -115436, -275414, -248237, -270310, -279807, -188422, -237098, -280019, -270067, -206870, -134445, -15162, 5670, -29822, 14703, -90738]
23143i0738l0423k0727l5964n953P355P2750n2393o1001K00402Q9182n7682K2
23131A4830J0780j46900o0800Q1391n8525J03950J18105n1465M808p7491k31275
23120b92592K1716K5614m3984L3980J98323R976n9322O2192N4030K7727k7047
23109A0613r557N3202N5256P2093M335j32886j04556Q588n208j93526m7574R8031
23097a91189N4491p1876L1210r038L4533m5630j37535J54138J89671J6010r8894
23086g4109J12906J36956j8513K7881r7998m1342K9625R8519n5472j0114k6304
23075H2035j78330J201P0068M7609R9957J39043k01821j18771p1863l4382J47905
23064a7349j2951o2919k03067m7192N2503O8564J12239q2709N6257l6661J24248
$$ y = [-90738, -121161, -141888, -177852, -183805, -176450, -103700, -156093, -217094, -16692, 72490, 14808, 14830, 25610, -121290, -182090, -100699, -159224, -55274, 62831, 11366, 16174, -61317, -292592, -270876, -245262, -289246, -255266, -56943, -46967, -106289, -44097, 9933, 37660, 10613, 1056, 54258, 109514, 181607, 185942, 53056, -51500, -42912, -48120, -241646, -289220, -191189, -136698, -208574, -177364, -186402, -151869, -197499, -335034, -180896, 8775, 24785, -74109, 38797, 175753, 157240, 185121, 87123, 45781, 75406, 173925, 118453, 108339, 82035, -96295, -95094, -25026, 22583, 122540, 261583, 59762, -59009, -130872, -165254, -17349, -30300, -93219, -296286, -343478, -290975, -222411, -110172, -192881, -136624, -173285, -49037]
23053d9037P701j4605j17300j0958P1294m5276Q0184J26482J38141k2394j17119
23042D7113o5937n0279M0852Q3150o838q450q9199o1244O249R6686J12409j65209
23030f0697k15658p4587O6516J86146J13865j86075R819J17766n5025m4503J20467
23019b1966m1054K34908k0421L0827Q6647k1526j06050l43714L1984K56641R6915
23008A83191L193j7797j09912j32624n7547J9110k1459J5188K17380J19636j43419
22997G4940n5664J36643m0267j44970j31645R5164J31433j39203R730J5775J38564
22986I0500j7970P938j5671j45087n9321L2922j8146K2204K87771J35701p6558
22975B44283j62463n7704J54251k0259o6728L920m8266j21900Q3038J49000m685
$$ y = [-49037, -41336, -55941, -173241, -184199, -112905, -158181, -77997, 48485, 186626, 164232, 47113, -18824, -69103, -28251, 54899, 48061, 39611, -49588, -110832, -104583, -7897, 104512, -60697, -276355, -350942, -284426, -98280, 15585, -170490, -160671, -42905, -97930, -142433, -21966, -63020, 171888, 151467, 182294, 268941, 247415, 141365, -202349, -170365, 86276, 183191, 186384, 168587, 58675, -73949, -131496, -112386, -133845, -118657, 98723, 218359, 74940, 19276, 155919, 115652, -29318, -160963, -65799, 65634, -73569, -63839, -48064, 90500, 72530, 80468, 64797, -80290, -139611, -106689, -124835, -102631, 185140, 320841, 244283, 81820, 24116, 178367, 158108, 91380, 95300, 47034, -74866, 8172, 157172, 152487]
22964A52487l6915j25983l0470O1351P0439P4198p0502r9587j0385r7264n6326
22953a68957j8045j81810q0927J66831j11563j53996J88736J24264L6869l0467
22943b29065o7175J8408q913L9865k7178q0256J19144J44076J49324j23991O5471
22932b90l6567n0197J39776O1824j8152k9403j38088j45031K22438J5610p0533
22921d8613J1456k7110k43593j31954o1588J51226O0088R3540Q5235r5492j44815
22910c51620k2025M6419K03257o644p2445P7962K21624J76191j69261p4055J67722
22899A97125L1468j98738o6555M6623p2279k0770j09502P5973N960L2556J37349
22888E9210q058m7151M092o7832j20348l1581K01856J55029R8206O9256q4782
$$ y = [152487, 115572, -10411, -40881, 20470, 90909, 165107, 94605, -4982, -15367, -112631, -168957, -187002, -368812, -449739, -282908, -394471, -548467, -359731, -235467, -198598, -229065, -296240, -277832, -286745, -246880, -274058, -354314, -235170, -91094, 58230, -65761, -290, -36857, -87054, 52722, 114546, 96394, 66991, -71097, -216128, 6310, 21920, -48613, -37157, -64267, -307860, -439814, -501402, -350176, -290088, -196548, -111313, -206805, -351620, -373645, -327226, -123969, -130613, -203058, -125096, 96528, 272719, 103458, 29403, 197125, 228593, 29855, -36700, 9923, -62356, -83126, -192628, -116655, -110695, -78139, 59210, 51152, 4001, 8093, -59739, -180087, -211668, -9812, 145217, 243423, 312679, 227897]
22877B27897l3219q9724j65841j40890j27455r0143l9006J71246P0819j5003k1552
22866b52871R4261K26208m1567k2601J85148J09613o7435j79463M6877J5128j02247
22855A1051j32574J3890J67951O6822k82N710k8565J22382l2951k21391o6538
22844i4495J2784L7344j12562m9067R3021K3573k6023l4106J44781J02598r9907
22833b059r1215j7088j0042m23J3886l6570P8406j2891p2824J20617L3673K5456
22821B8926N6261J78127j24938q163o9791k61292R0191N486q4238P7098K06971
22810I4638o4622K2720L0700O3534p4677l0653J14404K65415R830k98738j4286
22799A18265Q7473o5103n0246j72864l7995k8813k125O0150O8537P6972j45388
$$ y = [227897, 194678, 104954, -60887, -201777, -329232, -419375, -458381, -287135, -216316, -231319, -252871, -158610, 67598, 26031, 3430, 188578, 298191, 230756, 51293, 98170, 113298, 11051, -121523, -107633, 60318, 127140, 126858, 132568, 104003, 226385, 193434, -27957, -94495, -81711, -44367, -156929, -205996, -112975, -89402, -115425, -149531, -4750, 97848, -2059, -93274, -110362, -120404, -120827, -106941, -143511, -65105, -77996, -150820, -30203, 3470, 28926, 85187, 263314, 138376, 130213, 60422, -200870, -110679, -105193, -189431, -112333, 94638, 30016, 52736, 83436, 146970, 72293, 41640, 156044, 421459, 431289, 132551, 118265, 205738, 140635, 90389, -82475, -120470, -149283, -151408, -91258, -22721, 54251, -91137]
22788i1137k0149J2313k6444O265K8369l6336n6067j04987L4876Q4555Q0810Q557
22776g9375O3465j24425j0007l8877R8389L4725l5043j1087O4885L2221j02912
22765a08041m8320n172J41887K66735n036j69846j3384P0463J00567j23487l8420
22754F7946R2356o3514K420o806o4531n7605P0997K59055p6147j42791q7380k048
22742h048k3966J7169J46186J50915l3881j29146j47801P7795k0991K8537j5507
22731D1262L1549j26624o8887k695J5697Q7278J7165q66r2404M8335m4616O6852
22719b7954J06559l8545p1488K4573J11915r1324j20948Q3138K21300q0502p6919
22708C9805O191l7139N0050k9608j10123j38071L0677J68253R6778o0161J57662
$$ y = [-91137, -111286, -98973, -125417, -119152, -90783, -127119, -183186, -288173, -253297, -168742, -87932, -79375, -15910, -140335, -150342, -189219, -90830, -56105, -91148, -102235, -37350, -5129, -108041, -156361, -161533, -19646, 247089, 242053, 72207, 58823, 129286, 229853, 106366, 67946, 160302, 96788, 99208, 92402, 27871, -29734, 41263, 300318, 224171, 81380, -6000, -8048, -32014, -14845, 131341, 282256, 248375, 119229, -28572, 49223, 28232, 56769, 41262, 72811, -53813, -122700, -125395, -109698, -22420, -5255, -6121, -98525, -50190, -94806, -27954, 78605, 40060, -31428, -6855, 105060, 13736, -107212, -24074, 197226, 116724, 39805, 45996, 8857, 58907, 29299, -80824, -218895, -188218, -19965, 76813, 16652, 174314]
22697A74314k7655k52587P4397j7943q7186K60343q5051j91188M6312l5448R5783
22686d5909N0754j01181n1111O1565R2074J71503J7999j70455L8973K0967Q884
22675I4063J65256n6492l28223j93877J88391J68817O8100j04536O1402o5122
22665b221r9514j077J01155l4573o5909j16288M7091O1403l0158m5553K07584
22654B1940N469j70964n0008Q1113j5894j3313N5947K4588n5537J8537n3251M2178
22642a09195j7715j47233P2071J02857P2602k0991j08136J37788L7094j63078
22632a43936k6382m8885l3021K8901L5482O6772K7292l2274n1090o249J32416
22621e0974J23557m3445j63983Q2136P0513j549K3625J00045K83099o6027k31956
$$ y = [174314, 146659, -105928, -31531, -49474, -136660, 123683, 38632, -152556, -106244, -141692, -45909, 4845, -96336, -147447, -85882, 6192, 177695, 195694, 25239, 64212, 85179, 94063, 259319, 202827, -125396, -319273, -130882, 37935, 106035, 1499, 62901, -2221, -101735, -102812, -1657, -36230, -102139, -218427, -171336, -109933, -140091, -185644, 21940, 27409, -143555, -193563, -112450, -128344, -141657, -85710, -61122, -116659, -98122, -151373, -109195, -126910, -274143, -202072, -99215, -26613, -47604, -155740, -17952, 19142, -143936, -170318, -219203, -252224, -223323, -187841, -121069, -93777, -126051, -177141, -183390, -50974, 72583, 29138, -134845, -52709, 17804, 16255, 39880, 139925, 423024, 356997, 125041]
22610A25041k57248Q5026O1789j16179K2754J41803L3469j43307M5691J06008
22600A04847j23472j01989N3015J64793j184O2297j62540q2895Q5291k5911J8082
22589i666J24548q888j27213m6552L8888r025p8848N821L4021J10559j44254m7139
22577a57748j52741L5155J8104K08307j3569j51586j51878L6596K3470J96899
22567a08991K45117J82011j84034J86855k0496j63615K5732j45925j58497J5827
22557a26016j00509j1822m1915J60496J166p8274K08908J81226j73914k11145
22547a91799J9908J42690Q9982j32437p660N6095N0628K1302q0978k5065L6309
22536b1025J3048L9390K4794p3941l4074J0471n9757N7578K7019L4830n1383J1837
$$ y = [125041, -132207, -47181, 14608, -101571, -78817, 62986, 96455, -46852, -1161, 104847, -18625, -120614, -67599, 97194, 96010, 158307, -4233, -87128, -1837, -27748, -9666, 114882, 105994, -21219, -67771, -28883, -37908, -116756, -110935, -76914, 33645, -110609, -157748, -310489, -275334, -257230, -48923, -62492, -214078, -365956, -329360, -305890, -108991, 136126, 318137, 134103, 320958, 300462, 136847, 162579, 16654, -141843, -126016, -226525, -238347, -280262, -119766, -118600, -196874, 12034, 193260, 19346, -191799, -171891, -29201, 60781, -71656, -79316, -23221, 27407, 48709, -32269, -57334, -21025, -7977, 31413, 56207, -17734, -51808, -41337, -101094, -43516, -16497, 18333, -33050, -21213]
22524b1213K29386J04830m9538m4380j74061j34290m9594J40890J05237j6803
22514I0464j24699j43301M0514K37284l4288m8118k653J16172L2464l27660j61178
22503c24999O9321J03828J0239o1760R7457J28693J07138j5789L5870K5369n7555
22492A17812k035l4815N35j31986j13921K6049Q8376O2261j9706m7294r5926n0769
22480b01419L1501J10023p8656Q5106M248J86715R6853j32432l43462o028J2418
22469b35133J04094o4431j11549J40162J41037l5628l4437j0371O9644K8687R0950
22458H3025k3300r4618n8902o8712K4034k5028j08822p7046R2259M2861L1680
22447a82569k8206m2138K10722M42j8697q3802j94552J4449J03352P9648N1223
$$ y = [-21213, 208173, 313003, 263465, 219085, 45024, -89266, -138860, 2030, 107267, 90464, -34235, -177536, -137022, 100262, 65974, 17856, 15203, 131375, 163839, -163821, -324999, -255678, -151850, -141611, -203371, -105914, 22779, 129917, 114128, 149998, 175367, 117812, 115777, 80962, 81497, -50489, -164410, -138361, -49985, 12276, -7430, -54724, -150650, -201419, -169918, -59895, -138551, -53445, -49197, 137518, 234371, 101939, -241523, -247551, -235133, -131039, -195470, -307019, -166857, -25820, -61448, -95885, -106256, -36612, -7925, 83025, 59725, -34893, -93795, -162507, -138473, -163501, -272323, -349369, -257110, -214249, -182569, -210775, -252913, -42191, -41749, -60446, -144248, -338800, -324351, -220999, -141351, -90128]
22436i0128k4678j3875K033J18226O3397k6982j25608R5908J08327j21779j59397
22425a74556Q5782r1585J8898K18207R974j81852M4976J02045o4637O5721J57349
22414A90322m9566p9905q427m9162J6926n1654L1133j31231J33671P2117J14855
22403A89079p8460k31241j55479J48482J94367K6530p6925j07217K2854M5034
22393b2976J19063l2154J05096J58946Q5278J21386k44439k16115K1614J6370
22383A12069J506R859J13064j06123q966j48915k10305L0300J34388J81281m4208
22372F3950M2620j19557P5072N885K630R4899j06427L1407q489l0774k7387J48233
22360A72062r8501R939J31089q9923j13994O8468M7323j17395o4983J47069J54416
$$ y = [-90128, -114806, -128681, -126648, -8422, 54975, 27993, -97615, -1707, 106620, -15159, -174556, -88774, -180359, -161461, 56746, 66720, -115132, -70156, 31889, -32748, 32973, 190322, 140756, 60851, 52424, 3262, 20188, -31466, -333, -131564, 2107, 74224, 189079, 110619, -120622, -276101, -127619, 66748, 93278, 16353, -90864, -68010, -22976, 96087, 63933, 169029, 327975, 413253, 534639, 290200, 74085, 95699, 112069, 113575, 123434, 236498, 130375, 121409, -27506, -237811, -207511, -73123, 108158, 63950, 106570, -12987, 62085, 67970, 70600, 165499, 59072, 90479, 81990, 51216, 23829, 172062, 73561, 83500, 214589, 124666, 10672, 79140, 126463, 9068, -55915, 91154, 245570]
22349B45570k6710j26996j18812q1610N9296R6381R3528k4295j19891j35698j9122
22338a58359j09531J4123K10280N9561m5315n330l180K3375l0011n6700L3451
22327f7636J98325Q1158k00519j86925L7967j1073J05811p8101K0535J0482O3767
22316b6209k927r7065j19449q4058j16948l9853l234K04430J34561j993N4807
22305i7938J16100R9908M2889j17812j14953J01711k7798J85765j31595m3580
22295A2697n0501l7282K3842o8463K0535J01614K28855K15885k6775q3711L0384
22284C67080q5405j98566M6487p1562K1345P7612j71500j47255J8332N4750N7566
22273c1116k4494Q0395J06805m9138q0669K0639o1818K4457Q546o2945k06296
$$ y = [245570, 218860, 91864, -26948, -108558, -49262, 47119, 140647, 116352, -3539, -139237, -158359, -267890, -253767, -43487, 16074, -29241, -34571, -37751, -14376, -44387, -101087, -67636, 130689, 211847, 11328, -175597, -137630, -148703, -42892, -120993, -100458, -89976, -26209, -29136, -126201, -245650, -329708, -446656, -486509, -489743, -285313, -150752, -152745, -97938, 18162, 118070, 160959, 43147, -71806, 29905, 2107, 187872, 56277, 12697, -37804, -75086, -51244, -119707, -99172, 2442, 231297, 447182, 420407, 336696, 367080, 281675, 83109, 129596, 58034, 79379, 156991, -14509, -161764, -143432, -88682, -31116, -55610, 24785, 131590, 82452, 1783, 22422, -39396, -14939, -6393, -69338, -275634]
22262b75634p6661J42407P5215M60L1065k5174J11798P7091n3332J5297j03530
22251h0998k08423K5382K3081n5603J38336m9115M3252j3847R7631J95612N8895
22240A74203k2909M684p120k08632j48978J4009L0293J31791K03783R8422n4628
22229B14918q7976m5584k93707J08055k0949J03821P5108j36440o325J09563J28102
22218A48586J40436j98752j02472j04122m5992J55185l0803J07476J85693j0095
22208B45140q8636r0013N1585l0785J13330o3142l8438N6635j35409L7083K29958
22197B87308j55953j40837M6207J23636K552J0473J9388j20197p8341K49O8852
22186F3337j8573j79512q5762J74189J14606J41071n8399J19237J2782k8947m175
$$ y = [-275634, -352295, -209888, -134673, -134213, -103148, -128322, -16524, 60567, 7235, 22532, -80998, -289421, -264039, -240958, -296561, -158225, -207340, -164088, -177935, -80304, 115308, 174203, 151294, 155978, 148858, -59774, -208752, -194743, -164450, -32659, 171124, 269546, 214918, 126942, 81358, -212349, -104294, -125243, -21422, 53686, -82754, -89079, 20484, 148586, 289022, 90270, -12202, -116324, -162316, -7131, -37934, 69542, 255235, 245140, 156504, 66491, 118076, 87291, 200621, 137479, 99041, 155676, 20267, 57350, 287308, 131355, -9482, 36725, 160361, 162913, 173386, 192774, 72577, -5764, -5515, 63337, 44764, -134748, -220510, -46321, 68285, 209356, 150957, 270194, 282976, 254029, 249854]
22175B49854k13306j30385P0541J10713O9710M115R6610Q073J823m7918j23516
22164I6314j15473j32571N545K12556j62991j92420j21943J43445J80089O086
22154h1363j30085J87079O0624l4068O9231J39969j2381j02154m5674l9922r388
22143A868r6264j03198j2986Q4227K2245M9735J91482J0336m4740J6241o559j34243
22131b1856p6156O5160L3763M509J29690l3821L5938j58377J45162J44680j58833
22120A09859m6965K00099J56917q9481j85642k22300Q446P3568Q3021L7085q5164
22109C9443J36561J5507q2918o1563j79010K69403J65774k08021M6207o2328p2795
22098F260M6290K8048O8552J3039K13571J40027p3752k10449j29266m4755j16481
$$ y = [249854, 36548, -93837, -23296, 87417, 157127, 161242, 257852, 265925, 267748, 219830, 96314, -19159, -151730, -146185, 66371, -96620, -289040, -410983, -267538, -87449, -81363, -211448, -24369, 36255, 2187, 71418, 211387, 199006, 96852, 51178, 11256, 1868, -94396, -197594, -210580, -126353, -104108, -54373, 137109, 147445, 102705, 118946, 112387, -21856, -98012, -32852, 911, 5420, 135110, 101289, 137227, -21150, 124012, 268692, 109859, 62894, 262993, 419910, 330429, 144787, -77513, -69067, 4501, 87522, 124607, 39443, 176004, 191511, 108593, 47030, -131980, 137423, 303197, 95176, 141383, 79055, 6260, 52550, 80598, 149150, 162189, 375760, 515787, 442035, 231586, 102320, 57565, -58916]
22087e8916k1527J91193J59252o1726R6016J0968j43422j47240R3535J46748K8340
22076B93221j71433j46933k49304M1413J46380J53433l0710n9667m8932p1708
22066a44240l8820j09534R9439M7258Q9724l8781K5890R5132j71676j44915J10852
22055a79671O465j21568N0285R4356N8663k83K4414j03813l1540l3368R6097M3345
22043i6618l3070P8725l8720l6784K8296L0128l9012J50957j49886k48031J18241
22032b35774J22558L6390J54457P6768q2006p7407j7659p2507J51113K8051n4247
22021B9737m1702j64336M2127Q9240J07563K02911k29039k44830K5171J20479
22011f2679M7395q8670o1862n4297k3486O6163J84875P4045j27373r8002J42419
$$ y = [-58916, -80443, 110750, 270002, 208276, 304292, 315260, 171838, 24598, 118133, 264881, 293221, 121788, -25145, -274449, -233036, -86656, 66777, 36067, -23600, -72532, -144240, -183060, -292594, -193155, -145897, -56173, -94954, -69064, 26068, -145608, -290523, -179671, -173206, -294774, -244489, -150133, -91470, -91753, -67339, -171152, -202692, -236060, -139963, -96618, -129688, -50963, -89683, -126467, -98171, -68043, -107055, 43902, -105984, -354015, -235774, -113216, -76826, 77631, 154399, 72393, -5014, -22673, -95180, 55933, 83984, 29737, -11965, -176301, -134174, -44934, 62629, 265540, 36501, -208329, -183158, -62679, -15284, -103954, -165816, -220113, -243599, -177436, 7439, 81484, -45889, -143891, -1472]
22000a472M2056N8241J2853j52231j55857P0796J07280Q7127J56157r9509j12890
21989A2551m5483K6899j19423l4232Q9093m7187L0039j12368J9687n0068n4630
21978b85122P1968p8803R1086J09987q8313j16745N5893J15181j9490J01498j1333
21967e4193o8288j12976k09634P4540K10320K06445J26643j72476l7063o5679
21957a02361k1294J29556j5012p8928M5732L292o5347K988q5162J13558J9160
21946e3818j1523Q1678l7265J20068j9747j37905j03811M4546O7050j18549k13135
21935c82411K58116J10707O0681P0294J35955R475j26672j36221N1607m5367p3115
21924f6951j47707p1876J85556J57854k0317k4036l7755l9197k1502j93573J8859
$$ y = [-1472, 40584, 98825, 111678, -40553, -196410, -125614, -18334, 68793, 224950, 125441, 12551, -32932, -6033, -125456, -159688, -70595, -117782, -87743, -200111, -180424, -230492, -285122, -213154, -291957, -200871, -90884, -179197, -295942, -240049, -124868, -144358, -42860, -54193, -122481, -235457, -445091, -370551, -160231, 46214, 172857, 381, -36682, -102361, -123655, 5901, -9111, -88039, -42307, -39015, -104362, -101374, -186536, -72978, -53818, -65341, 16337, -20928, 99140, 79393, -58512, -162323, -117777, -50727, -169276, -382411, -124295, -13588, 47093, 117387, 253342, 262817, 136145, -76, 51531, 6164, -66951, -214658, -286534, -100978, 56876, 36559, 12523, -25232, -64429, -85931, -279504, -260645]
21913b60645J78924J27297o3288k7803M4650N9805m3855j37292p1374L5428j35019
21902b93172r9069Q9736J41778J65035R172o7523Q6733J25765Q7146q3334K7410
21891A89677j21883O2258Q7508j80127j61968j7634o779j11263k6493N8959J78615
21880d9130O817o7145K6387j12959l5959J43835J14146K1274j5207q5853n3026
21869a06820k2960J5958m1731J14926J57340r4075r6224k1463O4321J29850k17520
21858a18398j56887J03830J26154p961l7732j93937O087l1226J19858k892J210
21847a91894J89386J39867M9479n7569r4021o7482O1336J31022R0692o9355k5790
21836A55671N8622k82688j10093K2668k4339j1973K3374K09340J76596p8422L5224
$$ y = [-260645, -81721, 45576, -17712, -45515, -865, 58940, 15085, -122207, -193581, -158153, -293172, -392241, -302505, -160727, 4308, 13480, -54043, 32690, 158455, 245601, 162267, 189677, 67794, 130052, 217560, 37433, -124535, -142169, -148948, -260211, -286704, -227745, -49130, -42313, -109458, -83071, -196030, -231989, -88154, 25992, 47266, 32059, -53794, -106820, -129780, -113822, -155553, -40627, 116713, 22638, -73586, -95049, -30728, 99122, -118398, -275285, -171455, -45301, -53262, -90994, -284931, -278844, -310070, -190212, -193104, -191894, -2508, 137359, 186838, 129269, 35248, -32234, 29102, 160124, 250816, 181461, 155671, 214293, -68395, -178488, -155820, -180159, -192132, -168758, 40582, 217178, 138756, 173980]
21825A73980J17103o5553m2567k34656p2684N5977N9240q259J57888L5023j26957
21814D8535n6144J07227K0006n523k8606k29960R564k9650K8775O5855M3510J91001
21802A64590Q0815l1959j56712r2497K1699J01478P4444j0844j14885j65718j54205
21791b83794J07369J1560L8442J02514J11188J40588Q6106j14031n0198o6354
21781H3390r4518R5310o9382R3003P5095k25665k3460J85620J6604O2319n7876
21770A40440j33148M7735J23539j17279l1326J5395J00711K152j42663Q0851R5134
21759A81541k9572J1012o2363j44015J07310Q1377p1689P414j04743q7899j06823
21748b18450o4897R9870M2033p6655N5101K26208P0921j15847k46255q9174O9890
$$ y = [173980, 291083, 225530, 182963, -51693, -124377, -68400, -9160, -17419, 140469, 175492, 48535, -7609, 99618, 119624, 114101, 85495, -144465, -134901, -164551, -135776, -69921, -26411, 164590, 245405, 213446, 56734, -35763, -14064, 87414, 161858, 151014, 36129, -129589, -283794, -176425, -164865, -126423, -23909, 87279, 227867, 313973, 199942, 149744, 83390, -11128, 84182, 14800, 107803, 182898, -42767, -66227, 119393, 135997, 198316, 140440, 7292, 55027, 178566, 61287, 29961, 45356, 146067, 148219, 5556, 86407, 181541, 151969, 162981, 100618, -43397, 63913, 145290, 73601, 81015, -23728, -111627, -218450, -283347, -183477, -141444, -218099, -162998, 63210, 134131, 18284, -227971, -317145, -247255]
21737b47255Q4100N8803l5594q2349O0620J98528Q4191N8299l9419J97180L5963
21726C73067l5808J08029j72325j49723j68631j39514P3115J76511J18883K2227
21716B05831L8225n2597k00446M947R4456j35203n6489p5040N8100O7709j23777
21705a74284j53628Q7042Q2647O1117k1932J73081n9223j15385l8056m4022O9099
21694a33544L03097P4856R8191m0651k7193Q3843o1321j00014j80949J9080p410
21683B7985l2132l8402p4098r9641j4152J95188J22793o4904j18781J46612o1827
21672a1359k2129m4402k01447k8941L7507K7657K5095k0381P6412Q3387J3808
21661f4793Q6728k02383k8519m626P2925M5871j25414O9469J8372J90268J08441
$$ y = [-247255, -163155, -104352, -139946, -222295, -161675, 36853, 121044, 179343, 139924, 337104, 373067, 337259, 445288, 272963, 123240, -45391, -184905, -111790, 64721, 183604, 205831, 244056, 191459, -8987, -4040, 90416, -44787, -101276, -176316, -118216, -50507, -174284, -327912, -240870, -158223, -97106, -119038, 54043, -5180, -120565, -158621, -202643, -133544, 169553, 244409, 342600, 301949, 274756, 358599, 297278, 197264, 16315, 35395, 27985, -4147, -42549, -116647, -216288, -230440, -35252, 87541, 22637, -96144, 50468, -11359, -33488, -77890, -279337, -308278, -270771, -243114, -218019, -238400, -161988, -78601, -64793, 21935, -180448, -208967, -213593, -140668, -94797, -220211, -150742, -132370, 57898, 166339]
21650A66339m526k5870k8632L5732l5104J3761L615o4867j7557L2684j40638k11951
21638b77014P6762J34247j73321P0100L01627m6325j08709j93380J14342K5313
21628g6358j03024J3514P1702j3772j05710N36n6366M6680J04977j127M5260L1951
21616d1737M6646j03732J9698R7422q9331K522R1909j4157J2318j30125n4399
21605a62966l1329J62096K4159P1362L6472j54154m551K10591p9235k02206Q5532
21594d4229N3780M4351J24093K652J20343j97502j46047p4614O1953r2606j03450
21583b51276J26191J70846N7832k11974L9322J08996r1340P7260Q2532Q9976m1663
21572A56702p4798Q7j4844j38157l62k3352K0417J2120q2256r5675j1642N1484
$$ y = [166339, 161813, 135943, 107311, 143043, 107939, 121700, 125315, 60448, 42891, 75575, -65063, -277014, -200252, -66005, -239326, -169226, 132401, 86076, -22633, -216013, -101671, -76358, -179382, -165868, -94166, -107938, -213648, -213112, -269478, -222798, -117821, -118948, -73688, -41737, 4909, -98823, -79125, 18297, -71034, -68512, 23397, 9240, 21558, -108567, -162966, -194295, -32199, -8040, 63322, 99794, -54360, -58911, 151680, 72445, -129761, -44229, 9551, 53902, 177995, 180647, 300990, 103488, -42559, -117173, -55220, -147826, -251276, -125085, 45761, 103593, -108381, -69059, 39937, -51403, 25857, 108389, 198365, 156702, 81904, 81991, 67147, -71010, -71372, -94724, -74307, -62187, -144443, -240118, -251760, -200276]
21560b00276K06315J61780m5173k7918k9317n7362j51211p500Q8629J66125m997
21549I9095l9275j05835N4675M1728r1346m6080j06575o9919M6139Q757L2971
21538a75665O532l8218j14368Q3382J59807J47955R0766q3683j78027J09186o2405
21527e4738j04043O4738p5058k23255M7686K41691O1368J2541P6668J56617k08642
21516d427j74249K8992O0628R9730K03546J08593n3633k58360J59725L9233m9739
21505A60039l1739m9082L1757j4483j9932R8335m0296n0037J17686J18595j9851
21494C00992k00877l5876L202k4138p5121p2350N2861M0280R8276p3691j16731
21483a03173M2945P9875J32664j76676j43865P1384Q688j96763K09j12551J46555
$$ y = [-200276, 6039, 167819, 122646, 94728, 65411, 8049, -143162, -150662, -62033, 104092, 99095, 59820, -46015, 8660, 50388, -40958, -87038, -193613, -263532, -217393, -208636, -175665, -169133, -207351, -321719, -238337, -78530, 69425, 160191, 76508, -101519, 7667, -54738, -158781, -94043, -169101, -392356, -344670, -102979, -41611, -29070, 47598, 204215, -4427, -178676, -149684, -89056, 10674, 214220, 322813, 269180, 10820, 170545, 209778, 160039, 128300, 79218, 110975, 96492, 76560, 174895, 134599, 84562, 202248, 320843, 300992, 100115, 64239, 67441, 43303, -31818, -104168, -51307, -11027, 87249, 13558, -103173, -60228, 19647, 152311, -24365, -168230, -96846, -88158, -284921, -284712, -397263, -250708]
21472b50708J37162R0974J28845J35116P7509L1267r1938k34274k30342M7950
21462a58439l7313j8203o4673j14277K17167J20659j93625J36475J54034j6468
21452B5337j35124n1305j24328j27425M991P8365K43342J66124K5037j24427m3606
21441f3019N2749k25784m9612J51289m6252J09561J1694k09809j2206J17010Q6501
21430g7878N7675P1458O2460J5914j9521P5967O7386p2077L4819J66930l1339
21419C51794j04255K4366J42732o5765L1258r6100j74628j29732R6213K8794N8604
21408A63281K8606o3147r0735q8427j87559o1211L0420K1238N730j5763O3028
21397a94539J7266Q9160K43183j47488j58810J3476L5402L2189o75o8166n7252
$$ y = [-250708, -113546, -22572, 106273, 241389, 318898, 350165, 258227, 23953, -206389, -158439, -195752, -213955, -278628, -392905, -175738, -55079, -248704, -112229, 41805, 25337, -109787, -161092, -285420, -412845, -407854, -329489, -86147, 79977, 105014, -19413, -63019, -10270, -236054, -285666, -134377, -180629, -71068, -59374, -269183, -281389, -164379, -77878, -20203, 51255, 113715, 129629, 110108, 186075, 253461, 181384, 216203, 383133, 351794, 247539, 271905, 414637, 348872, 380130, 284030, 109402, -20330, 75883, 104677, 163281, 191887, 128740, 38005, -50422, -237981, -299192, -268772, -247534, -241804, -257567, -194539, -177273, -88113, 155070, 7582, -151228, -137752, -102350, -70161, -70836, -139002, -196254]
21386a96254o7258R9712J03396J12126R8885J00606j02965m9384p3460O9942J18954
21375B14300k4001o9301K6627r9995O4485j4584r6737m9592m5342j30524P475
21364b17189J82988J95924K28774j20097j20277n2920j50161j74055L7989O4196
21354a24828R5520p2126p0159J65866m6307n6237m3211P7894O9786j75366o595
21343a85763O3034l0329j41968j06702J16859K40948j6699O7153N4456j1905o3228
21332a4144J50011p3800j5218J87872j30819k28894K2530Q074L3228J6738J4529
21321b9893o3759n6217R4559l4743m6292J32348J14756q062k6171k99464M9756
21310a73182R9125l4204N4848R2191o2384O4214L7477k62028j65305P9049O4507
$$ y = [-196254, -263512, -163800, -60404, 51722, 150607, 251213, 148248, 98864, 25404, 95346, 214300, 190299, 120998, 147625, 47630, 112115, 97531, 794, -48798, -94140, -224664, -217189, -34201, 161723, 390497, 270400, 150123, 97203, -52958, -227013, -189024, -124828, -29308, -101434, -171593, -5727, -52034, -108271, -151482, -73588, -3802, -179168, -185763, -122729, -153058, -295026, -401728, -284869, -43921, -60620, 6533, 60989, 49084, -14144, 135867, 62067, 46849, 234721, 103902, -124992, -102462, -94388, -61160, -44422, -29893, -93652, -149869, -55310, -90053, -136345, -3997, 110759, 102697, 76526, -222938, -173182, -74057, -108261, -53413, 38778, -23606, 40608, 78085, -183943, -349248, -270199, -205692]
21299b05692J01997J2228L5581K8611n0535Q684J1600j0230j8418J9197l2516
21288i9493M3880J87842p4333j23847j137k014R4277n5533M91n9289m5437K4339
21276a10254J07040K33806J50135j15237k85424j86483k3150J66566O1803l9041
21266d0239K7547O0454R5943K440j44859j74982k3429R9991k016P0448k8577j56292
21254b13571j6696N026O7233n1753N0471J17867M2845l5280k46810j49927J55197
21243b75398J70985Q2898Q4051j18502q1155K3552J54655j39080j19628j53408
21233c71030k7907M0074K33502k029R4720K5772L9718o4551R072p7758j19489
21222b19906p8636m3362J01039Q9478K3529j04596O0934J08507J74508Q272p3222
$$ y = [-205692, -103695, -91467, -55886, -27275, -77810, -69126, -57526, -67756, -86174, -66977, -99493, -55613, 132229, 57896, -65951, -67088, -69102, 25175, -30358, -29867, -89156, -134593, -110254, -3214, 230592, 380727, 265490, -19934, -206417, -229567, -63001, -1198, -40239, -12692, 47762, 143705, 146145, 1286, -173696, -197125, -97134, -99150, -28702, -57279, -213571, -230267, -225241, -158008, -209761, -159290, -41423, 1422, -33858, -280668, -430595, -275398, -104413, -21515, 62536, -55966, -137121, -113569, 41086, -97994, -217622, -371030, -398937, -358863, -125361, -127390, -32670, -6898, 32820, -31731, -22659, -100417, -219906, -298542, -341904, -240865, -151387, -127858, -232454, -171520, -63013, 111495, 119767, 46545]
21211D6545K7394L481j85097r2848N4515J27523R4779R3715k0285O972P1537m0657
21199A87574j24877j11541J06859J08942q7062m0936j42466j45548Q1787o1983
21189b29251L1128p2500J49687M1488J55325L3393N686J24475P9028j27605j55408
21178C5446j05959j59313M5739O4245m0923L8839J53378J44474J6363j01372j19079
21167b8162J13292l4702l2075j24493K2927L9037j07026L4999J49561O9216n1298
21156E1276j71663j62263J33352J58898K6494l20335k15452J401J950J15614J19524
21145b61204J71832N7163J13033l6548l07308k2194K37990J40661J84891L9529
21135C17845O5273j03162k37411j38813l5545k3277j35790m6251J07775j61088
$$ y = [46545, 73939, 77420, -107677, -200525, -146010, -18487, 76292, 170007, 149722, 156694, 228231, 187574, 62697, -48844, 58015, 166957, 79895, 38959, -103507, -249055, -167268, -229251, -198123, -270623, -120936, -79448, 75877, 109270, 114956, 239431, 318459, 190854, 35446, -70513, -229826, -184087, -119842, -160765, -121926, 31452, 175926, 192289, 90917, -28162, 85130, 50428, 18353, -106140, -83213, -44176, -151202, -116203, 33358, 102574, 51276, -120387, -282650, -149298, 9600, 36094, -284241, -499693, -498292, -496342, -380728, -261204, -89372, -32209, 80824, 44276, -263032, -285226, -47236, 93425, 278316, 317845, 383118, 279956, 42545, -96268, -131813, -155090, -290880, -337131, -229356, -390444]
21125c90444k366K16384q1964j12216j45190O6833m7386J55833P5192R9712n6684
21114b22296n2266N0999J20719K2408M0724P5505M7068J07450M0338m0509j96647
21103f507M1231J74677j13077j8627j9379j9456l3664K921J58429J00529n9220
21092B07857j8306L8884j71802M0433M6281m0264Q1704J2196o4815o9635r6000
21081c3467K8383N144p4171L5937N9336j14562o0355n7769O773K3730k4331o3116
21069b68468J94906l1443n9655q8670M6444J48487q7156j10683O5469j1259n9608
21058b61636o614J01027P8949r2766R5683J49975Q187m9969k8346n2133q533K9618
21046c6558J14261K0689j0662r7743l662L4322J22148l1358k29364O725j02578
$$ y = [-390444, -392810, -176426, -258390, -370606, -515796, -448963, -496349, -340516, -265324, -165612, -222296, -274562, -223563, -102844, -80436, -39712, 35793, 82861, 190311, 230649, 190140, -6507, 34724, 209401, 96324, 77697, 58318, 38862, 5198, 8119, 166548, 267077, 207857, 189551, 228435, 56633, 97066, 143347, 103083, 184787, 196983, 132168, 62533, -33467, -5084, 60, -74111, -38174, 21162, -93400, -153755, -211524, -204751, -181021, -205352, -268468, -73562, -105005, -164660, -253330, -206886, -58399, -145555, -256238, -190769, -202028, -261636, -268250, -167223, -88274, -181040, -85357, 64618, 72805, 22836, -5510, -57643, -66176, -36558, 77703, 98392, 87730, -10013, -13675, 20647, 142795, 111437, -117927, -111202, -213780]
21035b13780r3837P9247N3743N2187K4799J2652P3681J50188j14697o5992j216
21024d3025m2245R8097J06945q0046j17612j03954q648j65034n2776L5481R7262
21013b75555J17023K13617J41947j36838o687R034j47490q6070j2863J39396R8723
21002E4237q7302j79747J08980l7778M2799J32792m976j37356l4509p2390k04650
20991d19900J01208J56433P0447J17586P3309L5707j5389l3998J69671j8520j04663
20980A31891k02695O741J09420j2582j66806j38263p0023k11122J19469J38719
20970b95251R5446J56145K05647N9547k73517L0798Q7659M6037k48328j47126
20960b82943R6673J16274j49561l6546N1789r7357O5564J71263j7559m7417J268
$$ y = [-213780, -307617, -228370, -174627, -122440, -97641, -84989, -11308, 138880, 24183, -41809, -43025, -85270, 12827, 119772, 39726, -77886, -181840, -190488, -355522, -408298, -372817, -275555, -158532, 55085, 197032, 60194, 53507, 62541, -84949, -171019, -183882, -44486, 54237, -33065, -212812, -103832, -141610, -98811, 33981, 29005, -108351, -142860, -215250, -419900, -318692, -162259, -91812, 25774, 99083, 134790, 119401, 85403, 255074, 236554, 131891, -70804, -64063, 45357, 32775, -134031, -272294, -342317, -553439, -433970, -295251, -199805, -43660, 161987, 221534, -51983, -21185, 66474, 112511, -135817, -282943, -186270, -69996, -219557, -256103, -204314, -301671, -236107, -64844, -82403, -129820, -128552]
20949a28552p8039o5814O9243K0062P7203n2417J54556k2097r6143L8006K18129
20938A34137N5788j34810j33735N5622k0802K3192j0739k0676j18548m3937K22468
20927G960J04847j84306j19356K36277j2223k9992j34642P8401Q9751n6609n0101
20916f9993j81895r3033K04819J07947o1026N5075J848L980R7599m1515l1800
20905g994J1153j9079l5918J06437r6426j62736Q241J08202K4988M4760J6431
20894a941j29211p4730Q8976O9040k0378j08637K5214J66984J33836R463j34195
20883B4421M1304M5164j24988p5076R2201O1132M492j24857j10116p4803o9095
20872c10221P299Q3740O2288M7720J67860P1798j26687J22528k0113j43768k44723
$$ y = [-128552, -206591, -272405, -203162, -183100, -105897, -158314, -3758, -25855, -121998, -83992, 134137, 189925, 55115, -78620, -22998, -43800, -20608, -31347, -52023, -170571, -214508, 7960, 112807, -71499, -190855, 45422, 33199, 3207, -131435, -53034, 36717, -19892, -69993, -251888, -344921, -140102, -32155, -93181, -38106, -36258, -32278, 65321, 23806, -7994, 3159, -15920, -51838, 54599, -41827, -204563, -196322, -88120, -63132, -18372, -1941, -131152, -205882, -116906, -47866, -68244, -176881, -151667, 15317, 149153, 158616, 24421, 65725, 110889, -14099, -89175, 3026, 64158, 68650, -56207, -166323, -241126, -310221, -302922, -219182, -156894, -109174, 58686, 130484, 3797, 126325, 106212, -37556, -282279]
20861b82279j24135l7228J69581K04504K04598l5021q609L4093p9291j70355l0855
20850a54997j09879J1774k6002n0285l4004P9154J22639K30646m7589r1292n4164
20839a23999j16445O5432J73875J02494k5273j72511O2577j0580j17235j1293
20829a72958r0127R739J00675J31649j46357K6922R3847M5153P7794P6987j04023
20818D9301p2479j20071l0297o3805J7378m343P9168l3219k48J14078j7875o0481
20806a42893p7541J6445R5091P5769K01978P5812n7345o9077k78559L0555J34882
20795E117J00777l4617m7002n9499Q7131j657j35345j81215J6517N5205J33034
20784f1554L8429j79075j42449J9067J44459P0768l5590k4988P318o095J59176
$$ y = [-282279, -406414, -443642, -274061, -69557, 135041, 100020, 91411, 125504, 46213, -124142, -154997, -264876, -253102, -279104, -329389, -363393, -284239, -161600, 69046, 21457, -69835, -123999, -240444, -175012, -1137, 101357, 76084, -96427, -33850, -44430, -161665, -172958, -263085, -253346, -152671, -21022, -167379, -140457, -46610, -1457, 76337, 153324, 49301, -23178, -143249, -173546, -237351, -219973, -224316, -145148, -178367, -178615, -64537, -82412, -142893, -220434, -203989, -108898, -33129, 168849, 244661, 187316, 118239, -160320, -129765, 5117, 105894, 71277, 24275, -35224, 51907, 50250, -85095, -266310, -249793, -194588, -61554, -23125, -202200, -344649, -325582, -181123, -110355, -145945, -170933, -163615, -169710, -10534]
20773a0534R8668j88381M7027J20541P2325j20067k3752n502J7865r0423o4713
20762a46946K22791p3655M4963R6471M0470m1459p2909j67569M8631J51544l9771
20751F2561q0642o949N8702n1868j35498K20429Q9003P0681J8478L1026J3792
20740B89715j07545j37225j42483l3007l9309j07567K1245J37219L5997j0157
20730i3117R206l3816J41446J47734j73639j74995p2462K5234J33148J40315l0480
20719A8574R624K34086J6169q9607k19774r1201Q5369P8828q4447K00524j35433
20708B2712j51784m687K7825O1950K4882K0285Q8224R6576J6832q3356n7386J19783
20696A81856o768q5262p066j41730j30510o0262q4098M5855K14120K04138N801
$$ y = [-10534, 88134, -100247, -53220, 67321, 139646, 19579, -4173, -9675, 8190, -82233, -146946, 75845, 2190, 47153, 143624, 184094, 142635, 69726, -97843, -49212, 102332, 62561, -18081, -25030, 33672, -18196, -153694, 66735, 155738, 226419, 244897, 275923, 289715, 182170, 44945, -97538, -130545, -169854, -277421, -256176, -118957, -82960, -93117, -83911, -117727, 23719, 171453, -2186, -177181, -249643, -224409, -91261, 49054, 18574, 28198, 262284, 278453, 188846, -30928, -122129, -36760, 42068, -42379, 158145, 22712, -129072, -133759, -105934, -43984, -19102, 1183, 89407, 185983, 202815, 119459, 62073, 181856, 175088, 89826, 82760, -58970, -189480, -249742, -333840, -287985, -73865, 130273, 136074]
20685A36074k05656r2729O8616P9183r5896l1972J6448k9775O5808n0014L9083
20674a00830J91702N8255M4386j09593j47939R094J94742q9000j34384J85182
20664A01615m1488J0353J13231j3703j18150j2287N4371l2192j36032j7589J04449
20653A2578J84564R1825k00264o2760j05661o7795n165K16021J07183k6386k5980
20642A18160q4683P4763j37008j31431o3423M3767N2047J34879O7680j71668j98154
20631b95071r418M3886L0150o8040K3224K22296J71883J16282L9419j35712j8287
20620A20612j3494j2501p7961J27892O6619m0682j14141k11809j49609N7209l2735
20609b80600r8366j0875O4754m4122O2634l0936L62997K65285j01531k8194j83361
$$ y = [136074, -69582, -162311, -93695, -14512, -110408, -142380, -125932, -155707, -89899, -139913, -100830, 90872, 149127, 193513, 83920, -64019, -54925, 139817, 50817, -83567, 101615, 60127, 70480, 183711, 170008, 51858, 39571, 93942, 61750, -74282, -91871, 12578, 197142, 288967, 88703, 25943, -79718, -147513, -152678, 63343, 170526, 144140, 118160, 33477, 108240, -28768, -160199, -223622, -179855, -127808, 7071, 74751, -96917, -295071, -304489, -260603, -230453, -298493, -275269, -52973, 118910, 235192, 274611, 138899, 120612, 107118, 94617, 16656, 144548, 211167, 170485, 56344, -155465, -305074, -247865, -280600, -378966, -389841, -325087, -369209, -306575, -337511, 25486, 290771, 189240, 161046, -22315]
20598b2315m1794L5017p3173j09518Q547J05175n7830O1005O8836m543q6343J14421
20586b515p3146K493J80001K10373P460q6466n4950p6521r8446j5806Q6627R7924
20574A77028O0578j94376j50384q1033K517m0711N9451L4387k7379j78706J04336
20563b34292J53082N5548M284R1038L7987j09296O5485o5522k38926r110Q1737
20552a67985J67262O0248k44893k3623J25614M9473J99945J3650M505q1109N8220
20541A61307K9049j15091j13327Q2671J8006r8750m7829R1000K8726q852l6274
20530i364J99919J34346l6630j50395m7274J82368J1669j43494j79968k184N2106
20519A1099j72321K460J79059L6139L9938K04262j14541j17303J7944o6993L9091
$$ y = [-22315, -64109, -29092, -102265, -211783, -203236, -98061, -155891, -94886, -26050, -30593, -116936, -2515, -75661, -73168, 106833, 317206, 324666, 238200, 183250, 106729, 8283, -7523, 79104, 177028, 237606, 43230, -107154, -188187, -185670, -226381, -166930, -132543, -159922, -338628, -234292, -81210, -25662, -21378, 69660, 107647, -1649, 63836, -1686, -240612, -249722, -167985, -723, 59525, -185368, -208991, -83377, -33904, 166041, 179691, 184196, 103087, 161307, 190356, 75265, -38062, 44609, 62615, -36135, -83964, 7036, 35762, 26910, -9364, 190555, 324901, 288271, 137876, 90602, 272970, 284639, 141145, -38823, -41007, 11099, -161222, -158762, 20297, 56436, 96374, 300636, 186095, 68792, 86736, 19743, 58834]
20508E8834j41803l0709j2378m40l5448J11879J56691K7785k3615j8246r9838
20497g288j60476j3150K9041K2282N1302M74j16546J2861R7237L4147r9408j10119
20485b59643J95130Q0608m0888m0573o9991j07176J3259K3853K61794O9024j794
20474A23603l960q018M074j35863j47284n8998J89186M3986L7292P420q1777l016
20462c3355L9501j53443O5123J81260r5996R6451k7932j69862P0734Q2408J3297
20451F8186J5972L2959L4375j15571j71690k926j2639J01844O9193l7924K511
20440a5710P0812K0620n8655K7510j0978j34118j2338J01175l8442q7127O8961
20429f8290j903j81086q7060N3503Q3064l8419K2592O4227J22310m9318o6170
$$ y = [58834, -82969, -113678, -126056, -126496, -161944, -50065, 106626, 134411, 110796, 92550, -7288, -167764, -180914, -151873, -129591, -78289, -77815, -194361, -181500, -84263, -50116, -149524, -259643, -64513, 16095, -24793, -65366, -135357, -242533, -229274, -205421, 56373, 125397, 123603, 119643, 111625, 115699, -20164, -167448, -226446, -37260, 6726, 44018, 51438, -30339, -33355, 6146, -147297, -82174, 99086, 3090, 99541, 71609, -98253, -27519, 54889, 68186, 84158, 117117, 151492, 35921, -135769, -138695, -151334, -49490, 19703, -18221, -15710, 55102, 75722, 17067, 44577, 33599, -100519, -112857, -11682, -50124, -137251, -68290, -70193, -251279, -338339, -284836, -201772, -240191, -217599, -153372, -31062, -80380, -146550]
20418a46550J68297O4805o6955p694o829j11189m1875P4728J30217J58205K6687
20407B41847O0739k6520n3592l1894q7882P7009P8012l1700k9804k25552k4070
20396e3407j16706K0122J23814L9507J67122m7035m1510K7636k1964o0540j01776
20385f4737J98638J8317n5009j2050P446j1082j83238l7693q7944J60517J42353
20374G5518O0045j1013J25023k0607J31969n684j21719J2761o2141R8091O7561
20363C49804J41582q1914k16793j81607l2843j34156K1245j66948M6334J90281
20353f5015J5710J6493m5099P3574q2123q6451P360l6772L8081J61998N7770j8348
20341C7178J32224L9524l0774N0520j05494p6211j1130r1734k1451m5957L3497
$$ y = [-146550, 21747, 86552, 19597, 11903, 5074, -106115, -147990, -73262, 56955, 215160, 241847, 302586, 276066, 222474, 190580, 102698, 179707, 257719, 226019, 196215, -29337, -53407, -170113, -149991, -26177, 13330, 180452, 133417, 91907, 119543, 97579, 37039, -64737, 133901, 152218, 97209, 85159, 92605, 81523, -101715, -139408, -227352, -66835, 75518, 135563, 124550, 249573, 228966, 360935, 355251, 233532, 246293, 184152, 282243, 349804, 491386, 409472, 192679, 11072, -21771, -155927, -134682, -301630, -255296, -65015, -49305, -32812, -77911, -4337, -86460, -172911, -165551, -202323, -164242, -2244, 55526, 37178, 169402, 208926, 178152, 228672, 123178, 46967, 35837, -55897, -77348, -123305, -89808]
20330h9808J2693j14346L6281q7310o53R7179O7739O8029K8755l7328q7638m5590
20318a51997m87l4587L9352j05325J31933m1999p3873q0890O0729K24915R5814
20307F3585j26107m1121J13228l622R8952k3450j57609M012j5996n847p8481Q904
20295a63552J97267l6435j52547l6564J97093O5277R1033q3588q5224N1072O3157
20284A06989M673p2274P0166N7938M1020M8452k02442k26833L3781M3472J27698
20273C2640O4626N3482r9397m3309Q9285J2206J12895q9566j51687q570l042P4670
20261D4233j6933r3041J34301J03415n3765N2023p598K7880r880j15585k25107
20250a60057q9522O2161R2525J30751M7976j47426J24832K6533Q0661j46781p5519
$$ y = [-89808, -77115, -191461, -155180, -242490, -243143, -145964, -78225, -10196, 18559, -18769, -106407, -151997, -152484, -187071, -147719, -253044, -121111, -163110, -236983, -317873, -257144, -32229, 63585, -62522, -103643, 9585, 5963, 104915, 81465, -76144, -72132, -88128, -93975, -172456, -163552, 33715, -2720, -155267, -191831, 5262, 70539, 161572, 77984, -7240, 43832, 106989, 111662, 39388, 109554, 167492, 208512, 256964, 54522, -172311, -138530, -95058, 32640, 97266, 150748, 51351, 8042, 97327, 109533, 222428, 132862, -18825, -27395, -30437, 44233, 27300, -65741, 68560, 171975, 118210, 170233, 162635, 190515, 180635, 65050, -160057, -249579, -187418, -94893, 35858, 83834, -63592, 61240, 87773, 168434, 21653, -53866]
20239e3866J53999N2256m6921j38434n1726Q8326J3380j00781p4096J43573M3998
20228B9708j86024j34837R7143O5384o7454r5371o1580O4976M0897R2514N9938
20217i4706J6469J03494N9440p7080r7390Q3395O8975J78903P8247q564k42960
20206F8223j38421K273k2289R2681K10212M4516k14055K1538M4413j68989j9542
20195g9440N2125J33188j5345p5191j59017j11665L6721K33885o4615k8799l202
20184h1355L6938p548l0928o1813L3467n7964M7787P6594q2529P710J66909J03451
20172A50719J2054j16415K605p269n3470p5440K6488Q7383O7299P3437p4656k04266
20160a11531M9009J71884j1303p5335q4021K188R9190J20381O0712p5825p6859
$$ y = [-53866, 100133, 152389, 105468, -32966, -84692, 3634, 17014, -83767, -157863, -14290, 29708, -156316, -291153, -194010, -128626, -196080, -291451, -353031, -288055, -247158, -154644, -94706, -78237, 25257, 84697, 7617, -89773, -6378, 62597, 241500, 319747, 311183, 68223, -70198, -67925, -90214, 2467, 212679, 257195, 43140, 64678, 109091, -59898, -79440, -27315, 105873, 90528, 15337, -143680, -255345, -218624, 15261, -49354, -78153, -81355, -44417, -51965, -82893, -144706, -111239, -169203, -121416, -44822, -127351, -119641, 47268, 150719, 162773, 46358, 48963, 41694, -11776, -87216, -60728, 26655, 93954, 167391, 92735, -111531, -62522, 109362, 98059, 22724, -61297, -59109, 40081, 160462, 221174, 145349, 68490]
20149F8490j2934M2747L6773p517j22223L4352L6623j82013R0608O7241m1649
20138A0498j24636l7212l7160j58608N9223K50256k4781j20958J24698N0616L1752
20127B3688Q5774j4016j42908J1857O3000J4214R8913r8767P8045J0814r3496
20116C7118N2828j32437K3061N6139p0142J2036K37313Q1491q1547m4479r8634
20105G2747q5553R1136J4681M7518j39435j01482O1281j7609p5829j30393J67828
20094i5110Q9652J82937K3126n1325J5948j78916j84343J50172J60574J02396
20084B15111j02040J22380J1723j56863o9686N252L39412O5863j02789j55995
20074A72368L1205p8491j13494p6555j07518J3205L5621J4725J0866l5244M8150
$$ y = [68490, 55556, 98303, 135076, 127559, 5336, 39688, 76311, -105702, -15094, 52147, 10498, -114138, -151350, -188510, -347118, -287895, -37639, -62420, -183378, -58680, -8064, 23688, 109462, 95446, -47462, -35605, 27395, 41609, 140522, 41755, 119800, 130614, 37118, 89946, -42491, -19430, 36709, -33433, -21397, 215916, 297407, 215860, 171381, 72747, -12806, 78330, 93011, 140529, 1094, -100388, -39107, -56716, -132545, -262938, -95110, -5458, 177479, 200605, 149280, 165228, -13688, -198031, -47859, 112715, 215111, 113071, 235451, 247174, 90311, 20625, 25877, 365289, 431152, 328363, 172368, 203573, 125082, 11588, -64967, -172485, -159280, -123659, -108934, -98068, -133312, -85162]
20063h5162P6726P1747L511q53K9550j13750j19748K21796K1682m2433K2770N9927
20051A45763k9035N9717o3790p1386N9432r0930j2540J39045m8095k4485R3915
20040A57611L8568j37697j24974o8770O1860J45793k2405j94694j00424J90171
20030e4961Q2323J96545l2261j99678O2041N4919N0654n2676r5419j83663J09172
20019f3004R2037j13758j1505R1472n8252o6388J16755j6780j34582p2402K3728
20008b12679R1677J65419J11595O7299n1309j30792j91615p4220J18723k1227
19998a27129K917J38060M3596q6921j4108J21065m243k4020K8309q9851j04949
19987a17274J4783k1031j06875Q4924J83043J00855J28448J45219J37125o9388
$$ y = [-85162, -8436, 63311, 66822, 65969, 95519, -18231, -137979, 83817, 105499, 63066, 85836, 145763, 116728, 176445, 112655, 41269, 100701, 9771, -2769, 136276, 88181, 63696, 157611, 196179, 58482, -66492, -135262, -73402, 72391, 49986, -144708, -245132, -54961, 27362, 223907, 191646, -8032, 54009, 108928, 159582, 106906, 11487, -172176, -63004, 29033, -84725, -96230, -4758, -63010, -129398, -12643, -29423, -164005, -236407, -212679, -121002, 44417, 156012, 223311, 172002, 41210, -150405, -224625, -105902, -127129, -124212, 13848, 57444, -29477, -43585, 77480, 73237, 49217, 77526, -12325, -117274, -102491, -123522, -230397, -145473, 37570, 138425, 266873, 412092, 549217, 479829]
19977D79829p1289J11136P2142j71003l2939M7646j07845o3108k3740o5351m549
19966A70929m8020p9529K2072Q5908N8381Q326J8892k17439p6125J0121R9129
19955E2645J1569j45528p2491j14955q1199K787j11038R0016J62947K54764N8030
19944A07547R1844r705j50434M2750K934j03964j18722J65661J42916J0489j11291
19933G0025P8501q9885j81778p1912J44103K18420J5477j29726m8748J54584J02630
19922B61691O4369O156p9904j33297j47985R3609j7351q1541J0735j45205l3833
19911b02556J68057P5179J8340N8448r5601k2354n9297m1163J7129L0001J512
19900e2305L9135o8830M9743l4197N6656n1004J13269K01971m1876q7340j21930
$$ y = [479829, 408540, 519676, 591818, 420815, 387876, 435522, 327677, 264569, 240829, 175478, 170929, 122909, 43380, 65452, 151360, 209741, 218067, 236959, 19520, -56605, -46484, 52645, 64214, -81314, -153805, -268760, -349959, -347172, -458210, -368194, -205247, 49517, 107547, 199391, 189686, 39252, 82002, 84936, -19028, -137750, 27911, 170827, 181316, 70025, 148526, 58641, -123137, -195049, -50946, 167474, 182951, 53225, 4477, 159061, 261691, 326060, 332216, 252312, 119015, -28970, 64639, 47288, -34253, -23518, -168723, -202556, -34499, 40680, 59020, 117468, 21867, -487, -59784, -100947, -83818, -53817, -52305, -13170, -82000, -32257, -66454, -9798, -60802, 52467, 254438, 212562, 125222, 3292]
19889C292J85757L7008N5758J37246J26296j13224r8127J1583q4862j18762P0270
19878B12235K33988q9247k45991k621J43145q6238j91950m5549J7396j9761l7004
19867a11597J06597l2839J2186Q3901j7242q4951L6467N581k955J27010Q422o3717
19855F6863o5691J56967J30196k8321k732j34955M4646p1185j82767M6808J20399
19844H0228J11752L3953N2361o8910Q0827M3217k0393k1970m4605m3764j13558
19833H9138l2528Q7035Q2382n2321K4225J64418j36134j48631Q7479j5751p6598
19822G2714Q2618O1978M9990O9400K9877M6982m2793l5693j59130n6905o0097
19811E8941j9811j11063N7162P2126Q2088N1801j08995N95M9065l0339o7111m2275
$$ y = [3292, 189049, 226057, 281815, 419061, 545357, 432133, 334006, 345589, 260727, 141965, 212235, 446223, 356976, 110985, 108364, 251509, 165271, -26679, -72228, -54832, -74593, -111597, -5000, -37839, -25653, 58248, 41006, -43945, -7478, -1897, -4852, 122158, 130580, 66863, 1172, 158139, 288335, 260014, 257282, 122327, 166973, 95788, -86979, -40171, 80228, 191980, 225933, 278294, 209384, 290211, 333428, 313035, 291065, 246460, 202696, 89138, 56610, 143645, 226027, 173706, 197931, 362349, 226215, 77584, 165063, 149312, 72714, 155332, 217310, 267300, 336700, 366577, 413559, 370766, 335073, 175943, 119038, 58941, 39130, -71933, -14771, 57355, 139443, 191244, 82249, 82844, 131909, 101570, 34459, -7816]
19799g816n3952L0269M5837R0406m7725k066r8782q464J07346Q9573k0805M3751
19787A67572j56037q8202j27814K5905J64558N9962q630r6142k6538L2831J14731
19776F2196Q0991R9734k4883j60600J19974N2187N1345j1522q5770j17884q3477
19765a7709m0641J96270O9327j96141o3307p4012m497J09745J02291K10465J47059
19754D38850j37992j71843j53916n7985n327r4316r2001J35544L2221R2113J23249
19743A08597J51000k13148j06622r825K5488n6671J85662P3232o5517J9894r5239
19732A6851j41956L7495q128L5894M2421P8451j32965P4229N5404l33300q8091
19721c63695L6406M1310J29232J03085p1444K7175O0319N0922M9988l3874j13891
$$ y = [-7816, -61768, -31499, 14338, 104744, 57019, 54953, -43829, -52293, 55053, 144626, 123821, 167572, 11535, -76667, -204481, -178576, -14018, 45944, 37314, -58828, -85366, -52535, 62196, 143187, 242921, 218038, 57438, 177412, 229599, 280944, 269422, 183652, 65768, -17709, -58350, 137920, 207247, 11106, -52201, -126213, -130710, -20965, 81326, 291791, 438850, 300858, 129015, -24901, -82886, -88213, -182529, -274530, -138986, -106765, -14652, 108597, 259597, 46449, -60173, -69998, -44510, -101181, 84481, 157713, 92196, 112090, 16851, -125105, -87610, -95738, -59844, -17423, 61028, -71937, 2292, 57696, -275604, -363695, -327289, -285979, -156747, -53662, -125106, -97931, -37612, 13310, 63298, 29424, -84467]
19710h4467j72707P612J71166J06426P4355n0303N8248p6096J7451N5463j31087
19699b3939l113k405P5594p7153L7720j16957R2695j8112L0608J3693J68201J28241
19687C05073l1832k04591n8216K6166J9683m4809p1397J13240o0790O6639M652
19676F3818M6987j07568m1697N0015J21294N4850j43703N5930n3345j43715J64037
19665F6903J28568j31995r5590K8003O809O4215m8929R83j21999j10568K27235
19654A3635J48117P8440p8807j74486k6228K7864l7895Q4872j9978k65284j47405
19643c97155N1395M0018R3608J64936J70640P5387r513J6546j30209m4982R7295
19632A27966k16612k29213l2305j01691K10097K25248R2619p5008n3223j7262
$$ y = [-84467, -257174, -249562, -78396, 28030, 102385, 52082, 110330, 34234, 51685, 107148, -23939, -27052, -29457, 46137, -31016, 6704, -110253, -17558, -35670, -5062, 8631, 176832, 305073, 273241, 68650, 10434, 36600, 56283, 11474, -59923, 53317, -7473, 59166, 63818, 110805, 3237, -38460, 11555, 132849, 187699, 43996, 99926, 46581, -97134, 66903, 195471, 63476, -32114, -4111, 2698, 66913, 17984, 18967, -103032, -213600, 13635, 161752, 240192, 161385, -13101, -39329, -11465, -49360, 35512, 15534, -249750, -397155, -345760, -305742, -212134, -47198, 123442, 198829, 189316, 205862, 75653, 30671, 127966, -88646, -317859, -350164, -451855, -241758, -16510, 76109, 1101, -52122, -69384]
19622f9384j99407O571K70510l882j81402j26068J59511J50033M8054j68148L3299
19611h0313J12589J01375m1843m0882K9585K2757P2882J09341j7661j22528j35211
19600A0091m1872M8561k4314L0304Q9972l3806j7253r9584Q5560N4742l7923J42500
19588B06978N6348r2428q4806N942L3595j49686M587M9489j59964r2998J49132
19577g3811Q8146m5132l5702L6961J18927L28845P8704Q7137L49260j0569o0717
19566H62049N711L2104J8266j54484j0519M0822k56270k64489j35084L5082O0442
19555B33630N7652N9219m1648k2508J4737J07372Q9888j73760k2760q6742R0980
19544C06060R0338j0305R5299j78031j11203R1567L5083O7314j04987k4838J3901
$$ y = [-69384, -268791, -262220, 8290, 4408, -176994, -303062, -143551, 6482, 54536, -113612, -80313, 32276, 133651, 91808, 50926, 80511, 103268, 176150, 285491, 267830, 145302, 10091, -31781, 16780, -7534, 22770, 112742, 78936, 61683, -37901, 47659, 102401, 64478, 206978, 263326, 170898, 86092, 92034, 125629, -24057, -19470, 30019, -129945, -222943, -73811, 14335, -30797, -66499, -29538, 89389, 418234, 496938, 584075, 933335, 922766, 862049, 867760, 899864, 918130, 763646, 753127, 793949, 537679, 273190, 138106, 173188, 233630, 291282, 350501, 308853, 286345, 301082, 408454, 498342, 324582, 301822, 215080, 306060, 396398, 386093, 481392, 303361, 192158, 283725, 318808, 386122, 281135, 256297, 270198]
19533B70198M0151p128k42424l5635L9951J38313J06165j64877o1425o379M7510
19522A24420Q9493J23278j03853j31490O1380J96298P4512J26973J47149O3002
19512G71162P4752J47044M9424j37302R6185Q3558J71934o594j66646k24086m1444
19501H17987q7169j5926J22169q1866l29958k7145J89451N6138j82531k9256j13507
19490C18387j22676M6545j73326q6041J27040R2794J10232M704J12822l5292j00374
19479B94815m2173j96632Q312J31833k9685j95138q5711K02660J71840K49967
19469E10088j72504j43904j32595j75728r200J98581P9246M7952j61755m1226
19459a045J47583k9353k5424k0963O875m6818J12162J09216l7087J02021j30239
$$ y = [270198, 310349, 303221, 60797, 25162, 65113, 203426, 309591, 144714, 83289, 76910, 124420, 213913, 337191, 233338, 101848, 163228, 359526, 434038, 561011, 708160, 771162, 845914, 992958, 1042382, 905080, 1001265, 1084823, 1256757, 1250163, 1083517, 859431, 817987, 730818, 714892, 837061, 755195, 425237, 398092, 587543, 643681, 461150, 431894, 318387, 195711, 242256, 68930, -17111, 109929, 202723, 312955, 317659, 430481, 395189, 294815, 252642, 56010, 64322, 196155, 166470, -28668, -114379, 88281, 260121, 510088, 337584, 193680, 61085, -114643, -123843, 74738, 153984, 201936, 40181, -1045, 146538, 117185, 91761, 70798, 77673, 30855, 143017, 252233, 215146, 317167, 186928]
19448A86928k4190J03850j7851j36146j5916N4520l9887n724j08883j24295J56222
19437B8628L8638n9331Q3832N3808J46416K9322j04193j24076k8135R5650R5603
19426B56162o146j97189m6919j5363M11k7945j01066l2094o5497j54533P6297
19415c13882J63203J12736J65305O357k75864J1236q4140J00029K9213p6240Q1197
19404h0850J72720n6624M6830M6532q361n5408J07086M9254M8804L857k09391
19393F4449k6422o2650l9006r312m270J91336Q9609p564m4322K5026p5572n6790
19381D4512N7761p5362q9499N7506J34452M5328j24494j29825J61031m562l398
19370G3450L4715Q1417j73223m3422J33079J14589m0485j42661J11604J72554
$$ y = [186928, 162738, 266588, 248737, 112591, 96675, 151195, 111308, 105584, -3299, -127594, 28628, 67266, 7935, 91767, 145575, 291991, 321313, 217120, 93044, 64909, 160559, 256162, 250016, 52827, 5908, -9455, -9044, -36989, -138055, -170149, -235646, -390179, -313882, -150679, -37943, 127362, 133719, -142145, -130909, -215049, -115020, -85807, -162047, -80850, 91870, 35246, 82076, 128608, 120247, 64839, 171925, 221179, 269983, 273840, 64449, 38027, -24623, -63629, -72941, -77211, 114125, 203734, 196170, 151848, 176874, 101302, 44512, 102273, 26911, -62588, -5082, 129370, 174698, 50204, -79621, 81410, 76848, 73450, 108165, 189582, 16359, -27063, 106016, 220605, 180120, 37459, 149063, 321617]
19360C21617N393j23761j14378k0710Q3207J16191j11588o3985J06494O9571r6736
19349A71315o9727k45409k30994K0446J06512P7007O6238K1617P9695J5327q334
19338C693l5133k6487K3858k743l1228Q2362J07777L0068m8354P8587l4358J4764
19326A62806r075q2121l6956l9763J15780K6419j4713K6189m7039m8209N7870
19315A11188J33715m5248j00735j66272j2876o4014r1317J22362J47794n1769
19305a7172K4031N8664o3134l2686o3261J13352L0531O4535m4364P3545j72849
19294b8808p5119r3760J01549J99716Q1345J32346M111K8911J754j91988j10538
19283D9519j22397l808m6185M1141J73076m531j2861N8520R7341o5862J3288n348
$$ y = [321617, 327010, 203249, 88871, 68161, 151368, 267559, 155971, 91986, 198480, 268051, 171315, 101588, -143821, -374815, -354369, -247857, -170850, -104612, -82995, -3300, 12027, 3693, -31440, -57927, -34069, -36812, -68040, 14322, 122099, 152167, 103813, 182400, 148042, 162806, 153731, 71610, 34654, -5109, 110671, 137090, 122377, 148566, 101527, 53318, 111188, 244903, 199655, 98920, -67352, -80228, -144242, -235559, -113197, 34597, -17172, 6859, 65523, 2389, -30297, -93558, 19794, 50325, 114860, 70496, 144041, -28808, -103927, -197687, -96138, 103578, 184923, 317269, 321380, 350291, 352045, 160057, 49519, -72878, -76686, -122871, -81730, 91346, 86815, 73954, 132474, 229815, 163953, 177241, 171893]
19271A71893o1760O7890N7986r0060j01310P6189K03998j47864j24413R182o1128
19260F03J10961k938J12361J02440k0814k29889n4608J56460P7212K9825j50239
19249A31374l519j37397r7577k399O5454N5888k3916N1744K09105M3943p4164
19238B18536k54308n5037O4316J71465K04322q3165q6546j0736l8737j3477j46980
19227c0347o6123r5696J82830Q1408J41582P815J46360o5531j38136N2711J56795
19216C73668N7985m9839M5524K3288M0353K3n4995L9674M1313l17578j22939O1132
19204A37609j32114O0194J51558n5972O344j50133n5166p7762J7064L6273R6265
19193C4160j4207K36678J16030r1580j82938K119j9643J3259Q4272K77800M8275
$$ y = [171893, 110133, 178023, 236009, 145949, 44639, 120828, 324826, 176962, 52549, 61731, 603, 111564, 108626, 220987, 323427, 302613, 72724, 18116, 174576, 251788, 281613, 131374, 127855, -9542, -107119, -109518, -44064, 11824, -12092, 39652, 248757, 292700, 218536, -35772, -90809, -26493, 144972, 349294, 266129, 179583, 168847, 130110, 116633, -30347, -96470, -192166, -9336, 72072, 213654, 221469, 367829, 302298, 164162, 216873, 373668, 431653, 381814, 427338, 450626, 490979, 491002, 436007, 475681, 516994, 199416, 76477, 137609, 5495, 65689, 217247, 161275, 167619, 17486, -37680, -115442, -98378, -62105, 34160, 19953, 256631, 372661, 281081, 98143, 100262, 80619, 93878, 178150, 455950, 504225]
19182E04225k163l1276k25127j50007k8759k2402r6273j35618N3384M874l3189
19171a62331J53755q149r1278L951L4106j29597O5922J68840O9035K237J45362
19160B51853J06235J21135J55378J8360k27568r5897K07331L45252K91576J33604
19150A307259j06434k53419k60204l2678j81124j84435j6569j48267j55217j4480
19140d5568N0291n3507K4167J37399J70760o8042j48057P9151R201o739J01690
19129B50746J54626M4306p6645j43175J0258J82715R3777j22644j75523m7382
19119A71059P3223l1489j205j27184N4233J39067R3850j19247j48475K64836N8908
19108D27576j21992j67784j00348P4087k0162K7792K45942R8494p6383o9256m8880
$$ y = [504225, 502062, 470786, 245659, 95652, 66893, 44491, -51782, -187400, -134016, -129142, -162331, -8576, -16725, -108003, -104052, -69946, -199543, -133621, 35219, 104254, 106491, 251853, 358088, 479223, 634601, 652961, 425393, 329496, 536827, 882079, 1173655, 1307259, 1200825, 947406, 687202, 654524, 473400, 288965, 272396, 124129, -31088, -45568, 4723, -48784, -24617, 112782, 283542, 215500, 67443, 146594, 155795, 149056, 250746, 405372, 449678, 373033, 229858, 240116, 422831, 516608, 393964, 218441, 171059, 244282, 212793, 211588, 84404, 138637, 277704, 371554, 252307, 103832, 368668, 427576, 305584, 137800, 37452, 111539, 91377, 119169, 365111, 463605, 387222, 317966, 269086]
19097B69086R4238J28564r200j66136j80679j6954J2848j03138N2116J11172O7950
19086B59867J8507j9698J67503n7751O3827k2257M8936R8938N9303P314o4035
19075E60454L8355P0347J21073J08570J30026J60374K98542N33686K68959j08841
19065B181545k34190R2332o8228l03798k03784n428K01475J11251K11652K38586
19055B221413M04729O54445N13810M1138l22701k2872K22592L99859O58707O21690
19045E392810P68372J163392J722991K590093L985987O654351J1776053K0188964
19037E4243013K8651656K7665386J5541799o767716j7163036l957792J2255112
19030A10468422J5448013L821893k0258443l3238947k5699032j5859720r526535
$$ y = [269086, 363324, 491888, 482688, 316552, 135873, 118919, 131767, 28629, 80745, 191917, 259867, 278374, 258676, 426179, 368428, 432255, 409998, 458934, 557872, 617175, 624489, 560454, 598809, 669156, 790229, 898799, 1028825, 1189199, 1487741, 2021427, 2290386, 2181545, 1947355, 2039687, 1971459, 1667661, 1463877, 1458449, 1659924, 1771175, 1982827, 2221413, 2626142, 3280587, 3794397, 3835535, 3512834, 3489962, 3712554, 4112413, 4771120, 5392810, 6161182, 7324574, 9047565, 11637658, 15623645, 22277996, 34054049, 54243013, 82894669, 110560055, 126101854, 119334138, 102171102, 98213310, 110468422, 125916435, 129738328, 109479885, 76240938, 50541906, 34682186, 25155651]
19023B5155651n917109m012659l063834k029182j492361q94654p32205n63260
19015F450387j19413j56950m29197l19584K3692O6893k3965l54352l64214l11194
19005D462103j29814j84308L3494L21590J14109J43008M9257l3074O7821R6259
18995D940445j16569j9986K02693M22746O92479Q15913Q46049J293485J797234
18986A0874489K877428M110451O608627J1791204K1016509L3124880L8109612
18979A28513200K8211399L318633k1836563j5087511P867807J9872308J2748022
18972A63607295j2148298l8729575l8055926k4707205j4907825r209112o052288
18965A9797066m274749l315077k198587j468415j201263p30267r16438p14678
$$ y = [25155651, 19238542, 15225883, 12162049, 10132867, 8640506, 7745852, 7013647, 6450387, 6330974, 6174024, 5744827, 5425243, 5448935, 5515828, 5491863, 5137511, 4773297, 4462103, 4332289, 4147981, 4181475, 4503065, 4617174, 4760182, 4809439, 4776365, 4844186, 4940445, 4823876, 4803890, 5006583, 5429329, 6121808, 6937721, 7783770, 9077255, 10874489, 13751917, 17862368, 24470995, 36262199, 57278708, 90403588, 128513200, 156724599, 160043232, 138206669, 123119158, 130986965, 150859273, 163607295, 151458997, 112729422, 74673496, 49966291, 35058466, 25849354, 19797066, 15522317, 12207240, 10008653, 8540238, 7338975, 6608708, 5692270, 4977592]
18957D977592o73929l29049j96643k42201l66403j25434j41042j88085N3456m8070
18947B720192p3216k6238l2757k54327l36825l31827k10272o2830L9116L77619
18937A808635J74745j6088j64810j92736k99689k66317k60830k12718j7101q4529
18927D68562O8393J9295n8229n1497o4339k7861K65479p5083k06769m7692O7093
18916C57352J81529J52695J911N007K6306p1264J41484n7759j0069J7109K78214
18905A022515M1588n3208j8129p4399j19999k14834k65495J00986J72404Q1888
18895F73317J9041J69300k5164j26743J89045M44497L00348K56956M6105p9035
18885A867667l35589l86145k35845j23053k43991j31669q6671l6693j3023j7615
$$ y = [4977592, 4303663, 3974614, 3777971, 3535770, 3169367, 3043933, 2902891, 2714806, 2768262, 2720192, 2646976, 2620738, 2587981, 2333654, 1996829, 1665002, 1454730, 1391900, 1431016, 1808635, 1983380, 1967292, 1802482, 1609746, 1310057, 1043740, 782910, 570192, 553091, 468562, 536955, 556250, 498021, 446524, 382185, 354324, 619803, 544720, 337951, 290259, 357352, 538881, 691576, 693487, 698494, 724800, 653536, 795020, 737261, 727192, 744301, 1022515, 1064103, 1010895, 992766, 918367, 798368, 583534, 318039, 419025, 591429, 673317, 692358, 861658, 836494, 709751, 898796, 1343293, 1643641, 1900597, 1946702, 1867667, 1532078, 1145933, 910088, 787035, 543044, 411375, 324704, 288011, 274988, 257373]
18875B57373j3819K5041l11134O5182K8979K8699L2409j6558j1707P0532j51753
18864C244j40384l648j98282j14484J11013K59959J68344N7426l317n1980q402
18853G9489K2478O2326R687n9400k1927m8406K484l7773k9155J7555J50243J57954
18841C05555p5167o4126O8182J18045o220J2656j03802p2933r871l5690K9524
18830A66153j07569R0708P2827R0830q7521J41509K07104q0981j8120p2433j77684
18819B24823j50588J31898N0471o077J7441o4780r0788l9652l0071Q5711J25107
18808B53495k306j81141r6736K38381J93954N408j02040m8607L7745O1897j3113
18797C46937L4780k4828m826J3662L2077j74605J2209O2438J0367J93383Q3585
$$ y = [257373, 243554, 268595, -42539, 22643, 51622, 80321, 112730, 96172, 84465, 154997, 3244, -137140, -140788, -339070, -453554, -342541, -82582, 85762, 143188, 139871, 87891, 79489, 101967, 164293, 173980, 114580, 92653, 44247, 46731, 8958, -20197, -2642, 147601, 305555, 230388, 166262, 234444, 352489, 346269, 358925, 255123, 182190, 172319, 136629, 166153, 58584, 149292, 222119, 312949, 225428, 366937, 574041, 493060, 474940, 402507, 224823, 74235, 206133, 256604, 250527, 267968, 203188, 112400, 72748, 42677, 128388, 253495, 251189, 70048, -26688, 211693, 405647, 411055, 309015, 260408, 298153, 360050, 346937, 381717, 356889, 352063, 365725, 397802, 223197, 235406, 297844, 308211, 501594, 585179]
18786E85179j20079j58970j12142r8116o5777O8139J78945M3666l6898P1466J07375
18775D62788J35292M56j0309j5798N7252j38145J41139O07329N14257M37476K70762
18764B462499k7019l43213m67430m05323j32210j21125p1626n2428k95740k04539
18754C41846L1578J14507Q9829J18790r72J42627k36538k03792j005N8781j10537
18743C45114r8580k7450r780N8416J39028N9045J89029N9999k7693N0151j49307
18732E87972q7682J38581P9569j15838k79914j55300j122J11118J58751J00499
18722E36634N0353j29954O3393J5904n9497Q7385p6852L2691j83995j80530J48314
18711C03846R0572M5643M0425m7603n618Q8358K12234N133J7477J14511l1399
$$ y = [585179, 465100, 306130, 193988, 95872, 30095, 98234, 277179, 320845, 283947, 355413, 462788, 598080, 598536, 588227, 572429, 629681, 491536, 632675, 1240004, 1754261, 2191737, 2462499, 2435480, 2092267, 1624837, 1219514, 1087304, 966179, 894553, 842125, 546385, 341846, 373424, 487931, 577760, 696550, 695578, 838205, 601667, 397875, 396870, 455651, 345114, 246534, 219084, 209304, 267720, 406748, 465793, 654822, 714821, 687128, 737279, 587972, 500290, 638871, 718440, 602602, 322688, 167388, 166266, 277384, 436135, 536634, 586987, 457033, 520426, 536330, 476833, 564218, 487366, 520057, 336062, 155532, 303846, 394418, 440061, 480486, 432883, 427265, 515623, 727857, 732990, 750467, 864978, 833579]
18700H33579j21839m0122J6275O6688K0970l2671j41285k28023k8702n0360O0890
18689C55400O9534o9820l7692l9944k6607q987Q0115O9849j0713N8003q0549J69040
18677E27629J24104k23620j71610j94856j3712J61379M24628L31206K00018j789
18667A163377j93596l30716j01483J91646l9609j01619j05274r753J076M091l6624
18656D41516m5500j48921L1515L0880O7392J12560n4008m0605K3840M6702j579
18645D63792R2904k1859n8521O9081J12626l4867k96799p7750J84710J76851p9361
18634E30807n3291J32303L86063M63918M59896P77720J306487J372842P55243
18625F131988m16667j365802r56335o34721k86547k73202k32421j1595k37169
$$ y = [833579, 711740, 671618, 687893, 754581, 775551, 742880, 601595, 373572, 344870, 294510, 355400, 424934, 355114, 317422, 277478, 250871, 241884, 321999, 391848, 381135, 439138, 358589, 527629, 651733, 428113, 256503, 61647, 47935, 209314, 633942, 965148, 1165166, 1163377, 969781, 639065, 537582, 729228, 689619, 588000, 482726, 472973, 474049, 478140, 441516, 396016, 247095, 278610, 309490, 376882, 489442, 435434, 394829, 418669, 465371, 463792, 556696, 534837, 476316, 545397, 658023, 623156, 326357, 248607, 433317, 610168, 530807, 477516, 609819, 995882, 1459800, 1919696, 2697416, 4003903, 5376745, 6131988, 5715321, 4349519, 3393184, 2758463, 2471916, 2198714, 1966293, 1954698, 1717529]
18616A717529l10217l05104j53063j4640K88098M26493n863J4723P7203k94825
18606A440334j05404K35591K14468O4657P8489Q2709J63161K57930L04666L36337
18596C072938M43577J150177J466466J739412K082123L176429N200674R438328
18588B7770124J6881643K6917657L2304114K4225614K086381k6932247l3188875
18581G0064411k3136175j3851683p771767m216993k165456j979222k718861k915537
18573A1308717k275543j453618j198748j134207p97763n76122k07179J6445N1053
18564C733035j20142k00975O6186J16733m2749K625N4049K23690L78302O03949
18554D814703N73682M29234L00700M54664N24320J045451J403162K034001K935646
$$ y = [1717529, 1407312, 1102208, 949145, 934505, 1222603, 1649096, 1643233, 1657956, 1735159, 1440334, 1334930, 1570521, 1784989, 1849646, 1928135, 2010844, 2174005, 2431935, 2736601, 3072938, 3516515, 4666692, 6133158, 7872570, 9954693, 13131122, 18331796, 27770124, 44651767, 71569424, 103873538, 128099152, 130185533, 103253286, 70064411, 46928236, 33076553, 25304786, 21087793, 18922337, 16943115, 14224254, 11308717, 9033174, 7579556, 6380808, 5246601, 4448838, 3872716, 3665537, 3681982, 3733035, 3612893, 3411918, 3478104, 3594837, 3552088, 3554713, 3608762, 3832452, 4210754, 4814703, 5388385, 5817619, 6118319, 6572983, 7097303, 8142754, 9545916, 11579917, 14515563]
18545A4515563M533174P516761J3376166K3064109L4369552L6586224K2622408
18538A56583957p151492l6050718l4918597k1751315j1457140l496110M183238
18531D5941823J3207669K1198268K0130751Q442325j3586687k7389897k2575636
18524D5368616j4227561q759383n420478l329405k145895j359933o99381n70425
18516H856155n00624q38336j088601j027873q42971p37022j90635J73492K8023
18507C831608l6199j2443l1047l3555r5996L0767J4602j8993P5432L07788N09685
18496D541649O15305N55043O10423N49483O82358J245672J821756K639624M631028
18487A7892341Q413711J4845409K4045956K9917381K4068011N146274k3003477
$$ y = [14515563, 19048737, 26565498, 39941664, 63005773, 97375325, 133961549, 156583957, 149432465, 113381747, 78463150, 56711835, 45254695, 41758585, 45941823, 59149492, 80347760, 100478511, 108920836, 95334149, 67944252, 45368616, 31141055, 22381672, 16961194, 13631789, 11485894, 10125961, 9426580, 8856155, 8355531, 7517195, 6428594, 5400721, 4557750, 3820728, 3630093, 3803585, 3831608, 3795409, 3782966, 3751919, 3718364, 3622368, 3653135, 3667737, 3648744, 3724176, 4031964, 4541649, 5156954, 5711997, 6322420, 6871903, 7554261, 8799933, 10621689, 13261313, 17892341, 26306052, 41151461, 65197417, 95114798, 119182809, 124329083, 101325606]
18480A01325606l2637844k3520398j4336093q603447n387044l661651k855076
18473A0324053k461970j757142j141402o18412m93066n45366m83825o03890k73029
18464A945951j67875p5791o7830j15662j21103Q0163o3401p8091j03606j03098
18454A129657k4671J66535J73063M2533K30592k3816m4063n9018m3835o8295k89474
18443A189208j95508r1043l10208n07941j44154K63157K13028N100L5797J08017
18433E65453j24194o6690K06550M5655n3744N7042j1354p7703J09785j63269N5369
18422E42900o2286m8371K8033r8984j56192N3686l0185o3907J22858J91035j43507
18411C35080K7993J50575m8790p3018m1823J40480l5261n6254L7027p8809k01964
$$ y = [101325606, 68687762, 45167364, 30831271, 22227824, 16840780, 13179129, 10324053, 7862083, 6104941, 4963539, 4345127, 3852061, 3306695, 2822870, 2218980, 1945951, 1778076, 1702285, 1634455, 1518793, 1397690, 1477853, 1414452, 1336361, 1232755, 1129657, 1104986, 1271521, 1444584, 1487117, 1717709, 1693893, 1649830, 1590812, 1546977, 1478682, 1189208, 993700, 902657, 592449, 84508, -59646, 203511, 416539, 421639, 457436, 565453, 441259, 374569, 581119, 626774, 573030, 630072, 618718, 541015, 650800, 487531, 542900, 480614, 432243, 460276, 361292, 205100, 258786, 228601, 164694, 287552, 478587, 335080, 363073, 513648, 464858, 391840, 350017, 490497, 455236, 398982, 436009, 357200, 155236]
18400A55236P8250K31406k32530k0745J28997p5568O2790l3271q4633j4030r468
18389A86434J20284p1442j36969j17307r7660M8372J73570Q3346L8681L1591K7877
18378B86777j40229j37963j02507p5313M003J02987l4930L3375J13044M1409k9184
18367F1469k7864N3238J31766L7986J4606j31790J59046J32019J43497J9265r2076
18356E01162j66002o4049l9313q8774J52625J77776n3522n7952O9024J75000J9301
18345F25276o1333j88221k8002j28412j16372J377O3229j7372J12598O0725N2136
18334C75629P8822k7324j42256k3470M7536J87982Q9581l00618k84500q903j357
18323h878J65200J08914K8570j43990r3861K2754J4381l2468J69352J38660O9425
$$ y = [155236, 233486, 464892, 232362, 211617, 340614, 265046, 327836, 294565, 209932, 195902, 186434, 306718, 235276, 98307, -19000, -116660, -68288, 105282, 188628, 227309, 258900, 286777, 146548, 8585, -93922, -169235, -165232, -62245, -97175, -63800, 49244, 90653, 61469, 33605, 86843, 218609, 256595, 271201, 139411, 298457, 430476, 573973, 593238, 501162, 335160, 271111, 231798, 143024, 295649, 473425, 419903, 361951, 430975, 605975, 625276, 563943, 375722, 347720, 219308, 102936, 104313, 167542, 150170, 262768, 323493, 375629, 454451, 427127, 284871, 261401, 308937, 496919, 586500, 285882, 1382, -7521, -8878, 156322, 265236, 293806, 149816, 55955, 78709, 93090, 60622, 229974, 368634, 438059]
18312D38059o5042R3947l2087P5914L3037q338o04M3207K37717K37505K23571
18301A276886J37403k14353q8053P0359Q7868j80890k88245j39652j24572r4060
18291D42691k0190j63861n7658P876k4732Q9859J12052J35828j74816j46380q2116
18280A18553l6933R6480j52219j9592J24023M3940n5884J02493n5092k28584l3165
18269i5980J57130J3812k3605J58570N8290j16486j76029p2443J01537J11078
18259A15874J31578J34189K31926J98931J69763J89528q460l00984j59236K83
18249G03392j11436j98060j53407l129p5910J58257R8124P6943L6194m8866j02752
18238C79350k4462l9324l774N5992p3094k01673J22638J31017Q794k034j15266
$$ y = [438059, 373017, 466964, 434877, 510791, 543828, 535490, 534886, 578093, 815810, 1053315, 1276886, 1414289, 1199936, 1111883, 1182242, 1270110, 1089220, 800975, 661323, 536751, 442691, 422501, 258640, 200982, 208858, 184126, 273985, 386037, 521865, 347049, 200669, 118553, 81620, 178100, 25881, 6289, 130312, 174252, 118368, 220861, 165769, -62815, -95980, 61150, 74962, 51357, 209927, 268217, 151731, -24298, -96741, 4796, 115874, 247452, 381641, 613567, 812498, 982261, 1171789, 1163329, 862345, 703109, 703392, 591956, 393896, 240489, 237360, 161450, 319707, 417831, 494774, 530968, 482102, 379350, 354888, 315564, 311790, 367782, 294688, 93015, 215653, 346670, 355464, 353430, 238164]
18227B38164k9514j17338o5031J48741J29279j29508j34470Q3025r1448p6395
18217d4495N9690j3942M2790k3410K6145P627J02248J83885n7814j0128J95695
18206D68291J07196k09560j14409q0734j86284N4192R090L8388J79093J37569
18196D02832q2359o6536j46660r4188q1417M4981J48045R2817R3771k71735K0076
18185E9627J65968j51864k7419J23642J77114Q2906j18526j75416j37726j88180
18175a89874Q7921K32417J7760r5721J88660J63507j64764j85919j775J56778
18165B08990K13877o6491O935j7445o9355q2974l6751J17199Q6871m1188L74397
18154F94065K79548P4983j7934j24835o5683J24090j04418j09394j51344j35420
$$ y = [238164, 208650, 91312, 26281, 175022, 304301, 174793, 40323, 123348, 31900, -44495, 15195, 1253, 44043, 20633, 46778, 54405, 156653, 340538, 282724, 272596, 468291, 575487, 365927, 251518, 170784, -15500, 38692, 47782, 86170, 265263, 402832, 320473, 253937, 107277, 13089, -68328, -23347, 124698, 217515, 311286, 39551, 59627, 225595, 73731, 46312, 169954, 347068, 429974, 311448, 136032, -1694, -189874, -101953, 130464, 148224, 52503, 241163, 404670, 239906, 53987, 52212, 208990, 422867, 356376, 363311, 345866, 276511, 193537, 156786, 273985, 360856, 319668, 694065, 973613, 1048596, 1030662, 905827, 840144, 964234, 859816, 750422, 599078, 463658]
18144D63658p8258q1334R2648K37296J33239J64179Q0636J89349R388l7075K5267
18133A198993K64224L59007N8466m5380K89368K23054K16013K89760L82494K51367
18123C487366L29243M75010N87167J130255J726935K118599K614639L297790M597094
18114B0364098P162209J1800654K0904572L8811571O9192937R8041470Q9038315
18107C55315826L6446196n9398991j09973016q2786446m9329214k8747135j7749252
18100D3777968j1529356p640387n351779l892980k963377j944743j355405j045376
18092H054565j069759r69412o71641o48387l82748m12884l74793l45271j64104
18083C015566n7896k96523l43564k34350L32K29322J44282j16521m7396q9964
$$ y = [463658, 385400, 304066, 396714, 634010, 767249, 931428, 1012064, 1201413, 1210801, 1173726, 1198993, 1463217, 1822224, 1880690, 1835310, 2124678, 2347732, 2563745, 2853505, 3235999, 3487366, 3816609, 4291619, 4878786, 6009041, 7735976, 9854575, 12469214, 15767004, 20364098, 27526307, 39326961, 60231533, 99043104, 168236041, 266277511, 355315826, 391762022, 332363031, 222390015, 139603569, 90274355, 61527220, 43777968, 32248612, 24608225, 19256446, 15363466, 12400089, 10455346, 9099941, 8054565, 6984806, 6015394, 5343753, 4695366, 4312618, 3899734, 3524941, 3179670, 3015566, 2957670, 2661147, 2317583, 2083233, 2083565, 2312887, 2457169, 2340648, 2293252, 2203288]
18073B203288K4680m4001r7963o6301j2590L0259p9908n4789N5514L45631L86787
18062B690607L51868K44629J06221j31678J57621K99013J44560J11944O7825p6459
18052C966151M588J50604J54466L86028O92314O97313J171238J358645J557285
18043A0138632J923651L079969N278961Q862302J4562442K3494054L2511159L2189989
18035A32041159J9290721n093388j8453331n814885J1954099J6157762M257374
18028A54339511k1409922l7242995l0645957j9680721j2118195p505765m972428
18021B0763528l505898k615729k203924j534198r31464n43443o07109p28940o55102
18012G437721j10995p4069j11222j43167l50035l92311k44307l5943K16060L89592
$$ y = [2203288, 2227968, 2183967, 2086004, 2019703, 2007113, 2037372, 1957464, 1902675, 1958189, 2303820, 2690607, 3042475, 3287104, 3393325, 3261647, 3419268, 3718281, 3862841, 3974785, 4042610, 3966151, 3970739, 4121343, 4275809, 4661837, 5354151, 6051464, 7222702, 8581347, 10138632, 12062283, 15142252, 20421213, 29283515, 43845957, 67340011, 99851170, 132041159, 151331880, 146238492, 127785161, 121970276, 133924375, 150082137, 154339511, 132929589, 95686594, 65040637, 45359916, 33241721, 25735956, 20763528, 17257630, 14641901, 12437977, 10903779, 9972315, 9428872, 8821763, 8092823, 7437721, 7326726, 7252657, 7141435, 6998268, 6648233, 6255922, 6011615, 5975672, 6191732, 6581324]
18002F581324P63306J112339J173963J263804J191879J884744L123878N014895
17994B2110132P957379J3458653K1977090K8554206K5058218J0866707j0063082
17987A19919303j4860458p34665J2005182J1610318k139670k3772186l1032961
17980G0994863k2954360j4294698q924327n775646l867502k873393k050785j430925
17972H823227r06011l03523K27285O26742Q18848M08740l36592j306047j433778
17963F618891j251920q64676n61117m31110j59702j13156k51709l06976j44429
17954B534096l01236l59968p3970K8636k9777j61725p1462q4646k5888r1220j93031
17943A169809j59J6136j00824o8655k7572J3235R9314o978o0858L5170m7382j8136
$$ y = [6581324, 7344630, 8456969, 9630932, 10894736, 12086615, 13971359, 17095237, 22110132, 30067511, 43526164, 65503254, 94057460, 119115678, 129982385, 119919303, 105058845, 104324180, 116329362, 127939680, 125800010, 102027824, 70994863, 48040503, 33745805, 24821478, 19045832, 15178330, 12304937, 10254152, 8823227, 7917216, 7613693, 7840978, 8467720, 9286568, 9695308, 9358716, 8052669, 6618891, 5366971, 4502295, 3941178, 3510068, 3350366, 3237210, 2985501, 2678525, 2534096, 2232860, 1872892, 1798922, 1827558, 1797781, 1636056, 1564594, 1479948, 1454060, 1362840, 1169809, 1169650, 1185786, 1084962, 1016307, 988735, 1001970, 1101284, 1094306, 1033448, 1068618, 1021236, 1003100]
17931A003100p5996n2564q6603Q138J90555N6069Q0633m484P1107K64542M45556
17920A900053O66317J139104J041272O46196k12790j154213j134590p40034n53880
17911A597435m75949j25733o6989l4758M8954k4593j08317r6131j95316J9017
17901E37620q3361j02187J83168k4858K0013m847m6380q5568K1665q323M307j93518
17889B17731p6205L373l981o5085P5486M1428p6007n35J14171l7735m050j10087
17877G8504j30401R0733J86234p320N0495m75q7047o7535J3538J9887l1251R7223
17865B12585J19214K15175L6214r0058j23303k0941r30q1040o1691o4690l3883
17854A06652J35737k4166o4250R0930l0924l9447K6011O7230R2589m2845j09798
$$ y = [1003100, 927104, 874540, 787937, 796075, 986630, 1042699, 1123332, 1118848, 1189955, 1454497, 1900053, 2566370, 3705474, 4746746, 5392942, 5180152, 4025939, 2891349, 2151315, 1597435, 1121486, 995753, 928764, 894006, 942960, 918367, 810050, 713919, 518603, 537620, 454259, 352072, 535240, 510382, 530395, 525548, 479168, 393600, 415265, 406942, 411249, 217731, 141526, 144899, 140918, 75833, 151319, 192747, 116740, 116205, 230376, 192641, 188591, 78504, -51897, 38836, 225070, 217750, 268245, 267770, 180723, 113188, 126726, 146613, 115362, 212585, 331799, 546974, 583188, 493130, 369827, 348886, 347956, 266916, 205225, 140535, 106652, 242389, 218223, 153973, 244903, 213979, 174532, 200543, 267773, 360362, 317517, 207719]
17843B07719o6048r3585J63469J1125K3926j38836J0199Q7250j5392m6623k2517
17832A20687J00781K44036J35613j26639j61466j70847r6578K9759K4661q2587
17822A7420j4561J24333J62814p6328j09691j29826L38m4613p9520M2870N4025
17811e2739r2321L4824J58253J00214L7581m6278n2311L2706l3236m0654J6734
17800F2773J04116J15950n3454m7365j99165K4571L4055k3130J31209K62367k4162
17789C87765q0155k78395p9117l018J71805J30429J04077k52715q6198j6379m0466
17778d2367O5859N5680J14000K4509K22980m0901k33240j77089J17828P2297j02717
17767G6839N2580J75183k2333k75639j3784M4977J02144Q9193l8525j37013k13910
$$ y = [207719, 141671, 48086, 211555, 222680, 246606, 107770, 117969, 205219, 189827, 143204, 120687, 221468, 465504, 601117, 474478, 313012, 142165, 45587, 75346, 100007, 17420, 2859, 127192, 290006, 213678, 103987, -25839, -25501, -70114, -149634, -106764, -52739, -145060, -110236, 48017, 148231, 185812, 139534, 87223, 119929, 86693, 46039, 62773, 166889, 282839, 229385, 182020, -17145, 7426, 41481, 18351, 149560, 411927, 387765, 307610, 29215, -49902, -52920, 118885, 249314, 353391, 100676, 14478, -1901, -42367, 23492, 79172, 193172, 217681, 440661, 399760, 166520, -10569, 107259, 179556, 76839, 129419, 304602, 282269, 6630, -7154, 37823, 139967, 229160, 190635, 53622, -160288]
17756a60288r1462J47248J43458K4866J41342j029N3375m5319n005r5301J08647
17745B20532o7940o6180J31005r562j45989J36087m799j12756j02566o8208l9140
17734a29516k60573K16953K59908J80220L5142o6466J3980O224q7286j96616q0453
17723a08483J8339k5823j46036J10571Q8472L7255m8268l4987L2910k3114J15585
17712A6421L1667j34293m0230o7547j6399J90878J24414Q4592q9866j08304J051
17701g616j0305p8605M408J76424j01621n012k6261R040j89250r4565O2242J66530
17689i4591m8937k37450l7347K7949J28778J16805j541o0176k0694J56976J94567
17678A24339l0444M5595j11766j49398R839K9430J0752m5430j05850L7428J17534
$$ y = [-160288, -251750, -104502, 38956, 63822, 205164, 204135, 257510, 212191, 207186, 111885, 220532, 152592, 86412, 217417, 207855, 61866, 197953, 193154, 80398, -22168, -90376, -129516, -390089, -173136, 86772, 266992, 302134, 235668, 249648, 255872, 168586, -28030, -108483, -90144, -115967, -262003, -151432, -62960, -25705, -73973, -108960, -76050, -99164, 16421, 48088, -86205, -126435, -193982, -210381, -19503, 104911, 189503, 99637, -8667, -7616, -17921, -96526, -92118, 84306, -17315, -22327, -48588, -39548, -228798, -323363, -261121, -94591, -143528, -380978, -418325, -390376, -261598, -144793, -146334, -206510, -227204, -70228, 124339, 93895, 139490, 27724, -121674, -111835, -82405, -71653, -117083, -222933, -185505, -67971]
17667f7971J15685O0093R1419L1192l7585J1347J06631J18162j60714q7997l3765
17656A46497j03121j45855P5955J63423J51888q0764j18171J19515N6471k49184
17646A6654k24508O875m3561r4037N7960R7296L9920q1111j00444J1208K78314
17635c5434L89369K8085j01274j27497q0779Q3358q6674n7079M8663j86749j32773
17624b58784m5794j42955J20506J94435q3392j4602J26749J2294j34299K3866
17614b01976M2260J03531P5632K7765j387l8098j13329P1243j2281R3223M1624
17603H8207k925q0114P5013M7631j8467j90756j18810O8749O2738j56618o1922
17592b87274J07262j47140m0545n235J97897J49106L5659k40177K5231n9163K4748
$$ y = [-67971, 47714, 107807, 199226, 230418, 192833, 204180, 310811, 428973, 268259, 180262, 146497, 43376, -102479, -26524, 136899, 288787, 208023, 89852, 209367, 265838, 16654, -207854, -200979, -244540, -338577, -280617, -183321, -143401, -224512, -324956, -313748, -35434, 353935, 382020, 280746, 153249, 72470, 155828, 69154, 12075, 60738, -126011, -258784, -304578, -447533, -327027, -132592, -215984, -230586, -103837, -91543, -225842, -201976, -159716, -56185, 19447, 47212, 45825, 7727, -105602, -34359, -46640, 46583, 88207, 85282, 5168, 80181, 127812, 109345, -81411, -200221, -131472, -68734, -225352, -287274, -180012, -327152, -367697, -372932, -175035, -25929, 9730, -230447, -205216, -264379, -239631]
17581b39631M4189j7924J15162N6406K4724n8611j20502m9080r763J45831J76765
17570F7566Q2540m5637k14864K845J69828j24926n4120l221P0134K16964o811
17559A60298l9409m5315j58665j51149J29294l8728n2143K0844Q7208L3635J77190
17548A23060O2765l3952q9196o9623J0428J81555R175j11901j29873K1200j4575
17537d0937n1729l437m6877P8471l2026k9718J5709L7963L3423j42696J13664
17526f8190l9468J6888l4275M8464J43930J84037J42354r7293j82312n0683K44704
17515C08156K39048J03929p7542M9282L0660L1684J46326R3654o2672j38656k39018
17504D84851l53103r5309l2493n7548J1337M8175J03777o4491j11653M967J42398
$$ y = [-239631, -195442, -213366, -98204, -41798, -17074, -75685, -196187, -245267, -255030, -109199, 67566, 150106, 104469, -110395, -107550, 62278, -62648, -116768, -119989, -49855, 167109, 160298, 120889, 75574, -83091, -234240, -104946, -143674, -195817, -174973, -87765, -54130, 123060, 185825, 151873, 62677, -6946, 3482, 185037, 194212, 82311, -47562, -26362, -40937, -92666, -96103, -142980, -64509, -96535, -126253, -110544, -72581, -39158, -181854, -68190, -107658, -90770, -125045, -76581, 67349, 251386, 393740, 296447, 114135, 63452, 308156, 547204, 651133, 573591, 622873, 653533, 685217, 831543, 925197, 862525, 723869, 484851, 131748, 36439, 3946, -53602, -42265, 5910, 109687, 45196, -66457, -61490, 80908]
17493H0908O3570r6427r3051j56451q7176j8190P9001K93315K18018l6815K8527
17482B75229o2036j28116J9414K5253j10167N0542k4081j95683Q6884K07809J03472
17471B48520K70323L59256P4244j43207p0700j05213k8965N7711l0425q6875l23346
17460B21323k60544L3106K1285r1178P7109J98578M9250j41986j4663Q396K07975
17449C08651J34853k72718r8326J28608K65119L70576M45405L34207L12774m5083
17439A884066n20295n52816j65772J7127j30659o6341L8682j0202m9195j07710
17429C36885k63928j95940M734M6049J77892J07646o6679J30921j51891k59589
17419a33900J28471l3536r4363j81716j63779j49461O9258J90429J17744J07347
$$ y = [80908, 144478, 48051, -45000, -201451, -288627, -306817, -227816, 65499, 283517, 246702, 275229, 213193, 85077, 104491, 129744, 19577, 70119, 46038, -149645, -62761, 145048, 248520, 518843, 878099, 952343, 809136, 738436, 633223, 604258, 661969, 631544, 544669, 221323, -39221, -6115, 15170, -76008, 1101, 199679, 248929, 106943, 92280, 100676, 308651, 443504, 170786, 72460, 201068, 466187, 836763, 1282168, 1616375, 1929149, 1884066, 1363771, 810955, 645183, 662310, 531651, 465310, 503992, 493790, 444595, 336885, 72957, -122983, -118249, -72200, 105692, 213338, 146659, 277580, 125689, -133900, -5429, -38965, -133328, -315044, -478823, -628284, -559026, -368597, -250853, -143506]
17409a43506j3325r674r482k5012J27942J06983k59353j15602N233J35540P6963
17398a23293J6910O0498J42114P4260q4391q6092P6630q168M9042L7977j23684
17387C1803J1242J77325J48395j8503n7386j80881R0874r4776p4663j85r8029
17376f4784r6345O6486O6589J37017Q291j03434r3893K5875L7722p6832J68324
17365G5016J58498J83416j53179k23030j01388K7929o8165O2220J26648n5235
17355C2730j62735n5798K67841o4199m5475p4962m7161J31845O6532j9797K3506
17344E2327M046Q563k3421M2973r5094j37952J4409J20779P306o9525Q5416J53441
17332A63268q7627K512k69673k80067n955J08454J37752Q7498O4065P6925N2437
$$ y = [-143506, -156831, -166505, -175987, -200999, -73057, 33926, -225427, -341029, -335796, -200256, -123293, -106383, -45885, 96229, 170489, 86098, 6, 76636, 68468, 117510, 155487, 31803, 43045, 220370, 368765, 350262, 292876, 111995, 202869, 108093, 33430, 33245, -64784, -161129, -94643, -28054, 108963, 117254, 13820, -80073, -54198, -16476, -93308, 75016, 233514, 416930, 263751, 40721, -60667, -32738, -100903, -38683, 87965, 32730, -130005, -185803, 82038, 17839, -27636, -102598, -149759, -17914, 48618, 28821, 52327, 56373, 64936, 41515, 84488, -10606, -148558, -134149, -13370, -6064, -75589, 9827, 163268, 75641, 78153, -191520, -471587, -477542, -369088, -231336, -143838, -79773, -2848, 49589]
17321D9589J0949j5365r1386l5748m630J25422m7734j67092j46737n1091J3346
17310c60477J34338L80334J08496j25234o6903l8055p964Q9276J56494o8941q8662
17299A12702M7142J28863j20678o3036r8722q2200O3147N9999j12749N7176M0938
17288C2582p9297j01259K2254M2672Q6795J32398P6355L6976L9525j77190k13179
17277a01368k2743M5617Q2753j89184j28494J16293J06660J3588L0155j6850k3113
17266h6686p0374p963K86796O5449j16524j63832p5349J87155K12250J11001j38352
17255B03571j60413l3819j236k0199j92603j8374Q5401L3295Q4276K2691n628
17244c038J88022O5240k16244l02544N4933n1552J1941N4737N5812J22867J00688
$$ y = [49589, 60538, 45173, -46213, -81961, -86591, 38831, -8903, -175995, -322732, -373823, -360477, -226139, 154195, 262691, 137457, 70554, 32499, 24535, 113811, 270305, 201364, 112702, 159844, 288707, 168029, 104993, 6271, -75929, -12782, 47217, -65532, -8356, 32582, -46715, -147974, -125720, -83048, 3747, 136145, 212500, 249476, 289001, 111811, -101368, -124111, -78494, 4259, -184925, -313419, -197126, -90466, -76878, -46723, -63573, -86686, -157060, -165023, 121773, 187222, 70698, -93134, -168483, 18672, 230922, 341923, 203571, 43158, 9339, 8103, -12096, -204699, -223073, -137672, -104377, -20101, 2590, -3038, 184984, 250224, 33980, -268564, -213631, -265183, -253242, -198505, -142693, -19826, 80862]
17233H0862q8473J14365Q5176q428J1616m7404j76701o0743n4951N1195o7209
17222a60695N091J36351K1458q0951P0287J39529J14765m323K2948n5372j03901
17211A05187l3503r7961k0148j84001m4939J1993J18935N8756P1618R2790R3078
17200A71805J4748j5174m2929r5133K8196N1072j18023k51740J5248m6345j3596
17189c01871P0641P4181P5486J72817K1428j39426o1066j37418J18849K43356
17179A36977J41784p3879j10585k30034J4252J59706J46430o1651j93918r2787
17169a63705n2793R8100J81224J41224R6724n3500r9035k55104k7238K49802Q1421
17158A97120o185J9700j5444l3545j12565m7853q8707q8072j24806J80273J51474
$$ y = [80862, -7611, 106754, 191930, 183502, 195118, 147714, -28987, -89730, -144681, -93486, -160695, -155604, -19253, 2205, -78746, -8459, 131070, 245835, 241512, 264460, 209088, 105187, 71684, -26277, -46425, -230426, -275365, -263372, -144437, -85681, -14063, 78727, 171805, 186553, 171379, 128450, 33317, 61513, 112585, -5438, -257178, -241930, -288275, -301871, -231230, -157049, -81563, 91254, 112682, -26744, -87810, -225228, -106379, 136977, 278761, 204882, 94297, -135737, -121485, 38221, 184651, 123000, -70918, -163705, -216498, -118398, 62826, 204050, 300774, 247274, 148239, -106865, -134103, 115699, 197120, 190935, 210635, 195191, 161646, 49081, 1228, -87479, -175551, -300357, -120084, 31390]
17147C1390R0371q5965o7510K6316m2568N2966Q1434p4134j85368P824o224m3781
17135b15249J25235J53166J23150n5284L943p5168J9886J17382J1256r1342r1331
17124B5644O248K1033m9114p0480m8998M816K63660j6535j60260k61097Q6622
17113a98461O7786J72700J6069j16229O5914n224K6959M9688Q5390K4818p51j62666
17101B5993M8653K1373J3846j9570Q5899K8023J16861j28497j45389j4763O8202
17090A00631M4468r742k2469K6159K8398P8709j94858J31977j7633k03474j34895
17079a72729R924j03405O2861P7914j28612J3513J88865P733r419Q5817j26624
17068i4162R8141J29830P0812K9796j45995K1838k06798j60191O4835O2975j6058
$$ y = [31390, 121761, 35796, -31714, -5398, -47966, 5000, 86434, 12300, -173068, -165244, -171468, -215249, -90014, 63152, 186302, 131018, 134961, 59793, 79679, 197061, 208317, 116975, 25644, 31892, 52925, 3811, -66669, -115667, -110851, 152809, 136274, -23986, -285083, -198461, -130675, 42025, 58094, -58135, 7779, 2555, 29514, 79202, 164592, 189410, 188659, 25993, 74646, 96019, 109865, 90295, 176194, 204217, 321078, 192581, 47192, 32429, 100631, 145099, 135357, 112888, 139047, 167445, 246154, 51296, 183273, 165640, -37834, -172729, -162805, -266210, -203349, -125435, -254047, -240534, -51669, -43936, -53355, 32462, -94162, 3979, 133809, 204621, 234417, 88422, 110260, -96538, -256729, -191894, -128919, -144977]
17057a44977n988Q5542r1096R1713J63102M4896q3688l4741r104q128r8362N6445
17045c4386J7781j24578L4883m1696M2499Q8034J8917O3473N3941n7086k5587
17034C6195p239l5981J69758p4473o6783J07198Q123n6555k16910j08042K16167
17023b8542Q8228J5022n5889K9537p8992n9220J97705o4745j79436l8768O4498
17012a10602J99385M601P4538M582j18150Q6614p1748r7157O3061r3566j28305
17001a86747K2388M3334J57930l7297M9090K6264n3176l4016O9094k2578L1355
16990F5641p2376j24076K8355M8758J4459j56415J47105j13990j12343q5264k000
16979c62146J77299R5682N0859k306K0877M3911p0520K1443J47780k059p9782
$$ y = [-144977, -150965, -65423, -156519, -64806, 98296, 143192, 59504, 24763, 15659, 7531, -90831, -34386, -16605, -141183, -106300, -147996, -105497, -17463, 1454, 64927, 118868, 61782, 36195, 28956, -7025, 162733, 88260, 21477, 128675, 136798, 80243, -136667, -244709, -28542, 59686, 74708, 18819, 48356, -30636, -89856, 107849, 43104, -136332, -175100, -110602, 88783, 93384, 167922, 172504, 54354, 140968, 69220, -27937, 35124, -58442, -186747, -164359, -121025, 36905, -392, 48698, 74962, 21786, -12230, 56864, 34286, 65641, -6735, -130811, -102456, -53698, -39239, -195654, -48549, -162539, -274882, -360146, -362146, -184847, -89165, -38306, -40612, -19735, 24176, -46344, -24901, 122879, 120820, 41038]
16968D1038m0360j85771j9099P8912Q6647o7508m9658j6220O3183K42403J59718
16957B93285j00037q0775j1022j08142p4821R5922K6516m3964J49622j47147j93099
16946a93662j52644M2343M1940R8096L00094k8792p3179p3606j88246M3561K9172
16935a54923o661o359O3196J10404J05991j38494k08580M9392J28136n1031N2620
16924e6309j53831Q0956R4966L079j39486j16787K39143L7315J53354P2363O251
16913B21014M2510j48109j51203O5130J96542O5658j11069j53560o7860j2907
16903e3854P0025L8069j11143N0175J27362m0732K12417M0876k11443k0162l998
16892I7592j8651L2814O8088j06612l1372j5121O5140j6072L7896j24275m4464
$$ y = [41038, 678, -185093, -204192, -125280, -38633, -106141, -155799, -172019, -108836, 133567, 293285, 193248, 112473, 101451, -6691, -81512, 14410, 40926, -3038, 146584, -563, -193662, -346306, -303963, -262023, -163927, 136167, 107375, 34196, -39410, -227656, -184095, -154923, -161584, -167943, -104747, 5657, 111648, -26846, -235426, -186034, -57898, -108929, -56309, -210140, -129184, -34218, -31139, -170625, -287412, -48269, -10954, 142400, 214763, 221014, 263524, 115415, -35788, 29342, 225884, 291542, 180473, 26913, -40947, -53854, 16171, 54240, -56903, -6728, 120634, 79902, 292319, 333195, 121752, 101590, 97592, 78941, 111755, 179843, 73231, 41859, 26738, 91878, 75806, 113702, -10573, -55037]
16881e5037k31299o6349J71569R5987N6200p9698J01107N4400j09981q4501J10591
16870c7011n4221L7352m5290J8173R0625M7897M5757j6580j76370p1246Q0282
16859h0632J26147P755K9148n6325J06869J7861m7738O6031J87999k9345j96296
16848A31474N452p209p4246L1312l1009o4215P1154j68539j62078j3051R5713
16837a85242M0440N9970p7605j47483K6224P5987P138K2815J00573J15918P5809
16826A14544n093j24950j05709R8451J94516j93666n5874k8913J35104n5635j80085
16815b07310m6187O7714O2006O6467O1121J1222M6885n6401j45216J6307J92501
16804F9109J89488R025J2167j38651j84825j06718m7160J00195M4303R6028R4228
$$ y = [-55037, -286336, -352685, -181116, -85129, -28929, -108627, -7520, 46880, -63101, -147602, -37011, -91232, -53880, -99170, -80997, 9628, 57525, 103282, 86702, -89668, -160914, -80632, 45515, 53270, 82418, 26093, 132962, 150823, 103085, 169116, 357115, 327770, 131474, 136926, 129717, 55471, 86783, 55774, -8441, 62713, -105826, -267904, -280955, -185242, -144802, -84832, -162437, -309920, -283696, -207709, -200571, -177756, -77183, 38735, 114544, 109451, -15499, -121208, -22757, 171759, -21907, -77781, -106694, 28410, -27225, -207310, -253497, -185783, -123777, -57310, 3811, 15033, 61918, 5517, -139699, -123392, 69109, 258597, 267622, 279789, 141138, -43687, -150405, -197565, -97370, -53067, 42961, 137189]
16793A37189j86778k59616j52453R6115J651J10578J02789O4353Q9910j3880o9011
16782g9153L7665M2641J7520o6907o0086Q0207P7590L1105j65853J3128l6853
16771a08996j26324l9342R0860K22607J22556j63587k54091Q6841J38661j8119
16761d8934n7766O9813O3131m2099M3568j37987j79490J35839K54439N6998J2277
16750A69789m9268j89577K8866l234M1449K8825K089m0484k7588O4732j76420
16739a50821m4998k2016j0251J44898J04034O3452K6194J09066j05350j30788
16729a6580Q0029R6701Q5519J40865L848j33694p7718m5234j48670r7645J4024
16718i8555J02317l4245q4126o8446O1741p3989j44153M7440J11955p1369k3199
$$ y = [137189, -49589, -309205, -461658, -365543, -363892, -253314, -150525, -86172, 3738, -10142, -79153, -41488, 1153, 18673, -48234, -108320, -28113, 49477, 80582, -85271, -72143, -108996, -235320, -274662, -183802, 38805, 161361, -2226, -256317, -169476, -30815, -48934, -106700, -36887, 26244, -15855, 27713, -110274, -289764, -153925, 100514, 157512, 169789, 120521, -69056, -40190, -43424, -1975, 26850, 28939, -11545, -39133, 25599, -150821, -195819, -217835, -228086, -83188, 20846, 84298, 110492, 219558, 114208, -16580, 63449, 160150, 245669, 386534, 390382, 256688, 178970, 133736, -14934, -112579, -98555, 3762, -30483, -114609, -183055, -121314, -195303, -339456, -292016, -180061, -251430, -274629]
16707b74629J50770k5039J18388Q2218M8335K2087k24009k24916J54259R1861
16697h0675L3556M5826k4183j50925K3462p2652J9522J05474M0180r7229n9722
16686b17366O1103J91433J55763K92886Q321k75970k09934m1061K3012J67783
16676A55970R2740m8407k4685p4173p5373M0948O429k27438o0379K56523J92329
16665B34484k84818j79606K19463J47796l6410K4539J59623j2786k66120R4697
16655A00862K5587j2151n2569k57043J9933q795p3839j55582J4755K50157M9764
16644i8921R0760J22255j43669j36938o9100J55271j7189o4013J19805J08317
16634F6578J05914j18913l0877k19896q9374M8107j6363l0546J70965J77076j1824
$$ y = [-274629, -123859, -148898, -30510, 51708, 100043, 122130, -101879, -326795, -172536, -80675, -47119, -1293, -25476, -176401, -152939, -225591, -206069, -100595, -60415, -157644, -217366, -156263, 35170, 190933, 483819, 492140, 216170, 6236, -34825, -11813, 155970, 248710, 200303, 175618, 101445, 26072, 67020, 73449, -153989, -214368, 42155, 234484, -50334, -229940, -10477, 137319, 100909, 125448, 285071, 272285, 6165, 100862, 126449, 114298, 61729, -195314, -175381, -184176, -258015, -413597, -398842, -148685, -98921, -8161, 114094, -29575, -166513, -235613, -80342, -97531, -161544, -41739, 66578, 172492, 53579, 22702, -197194, -286568, -238461, -254824, -285370, -114405, 62671, 50847]
16623E0847j77841p5870N0468J98070J00709L1212m8147m7590J2591j26477j15353
16612a47381J5758K3637Q110O3503L6126j90064l0573Q9350K74777J48160r8877
16601A92526k04633p1298R1624M8820m2717q348j56984j05276J2705q2533m2476
16590c68590m1388j1712m0432K03099Q5975J12741O2831Q3113L2267n1958J09610
16579A75556n3442j41072j45104q7529p6301J72001J65855l1748p2821j07689
16569b02294n4353P7178o6501P8077J5619P8465M0771k60114r5704k2923L5120
16558c76659K75925J32407r1757j87306J6029K26236J14974j83568q1960o8777
16548b24456N1054J41100J19035J11298k19110k02443m0087J43545q4253J94793
$$ y = [50847, -126994, -202864, -152396, 45674, 146383, 177595, 129448, 81858, 94449, -32028, -147381, -131623, -107986, -99876, -36373, -247, -190311, -220884, -131534, 143243, 291403, 192526, -12107, -83405, 8219, 57039, 14322, 5974, -151010, -256286, -243581, -326114, -368590, -409978, -421690, -462122, -259023, -173048, -60307, 2524, 85637, 117904, 65946, 175556, 122114, -18958, -164062, -251591, -327892, -155891, 9964, -21784, -94605, -202294, -256647, -179469, -245970, -167893, -152274, -73809, -33038, -293152, -388856, -411779, -376659, -100734, 31673, -60084, -247390, -231361, -5125, 109849, -73719, -155679, -224456, -173402, -32302, 86733, 198031, -21079, -223522, -263609, -120064, -204317, -9524]
16538i524L09869j21842j39709j92153O2464J15485J03911j38275r5655J11945
16528F516K9906J30458p019j42566r7649k5625j52661K9547K44815L3981j85029
16517a35326k9077m3231l2738J32991M6570l786L3943j09897J50248P2800j84481
16506a01984j09125p6862L3391K2173l1166O335M9920K64506J10363J093P5068
16495B43712j14272j28903Q6794L9987J09115j25007o742J24465L5838j0920o3244
16484A90823k34624j07023r692o5021J2818j03782q9262J51259K57975L03006
16474C06477J1875m8252k14418o0836J27918R6292M3261q2719j28466J860M1671
16463I4663l3703o4106m3358K90946K1355k53421N0672J70680l8646j95171j1729
$$ y = [-9524, 300345, 178503, 38794, -153359, -90895, 24590, 128501, -9774, -105429, 6516, 36422, 166880, 159861, 17295, -80354, -105979, -258640, -229093, 15722, 49703, -135326, -164403, -207634, -240372, -107381, -60811, -64597, -30654, -140551, 9697, 82497, -101984, -211109, -287971, -254580, -232407, -263573, -257238, -207318, 57188, 167551, 168644, 243712, 129440, 537, 87331, 127318, 236433, 111426, 104684, 229149, 264987, 254067, 190823, -43801, -150824, -160516, -225537, -212719, -316501, -405763, -254504, 3471, 306477, 318352, 270100, 55682, -5154, 122764, 219056, 262317, 179598, 51132, 52992, 94663, 60960, -3146, -46504, 244442, 265797, 12376, 63048, 233728, 195082, -89, -11818]
16452a1818O957k087J14479N9001O7306M6376L5992k50064j28454r1683j4446
16441a68441Q2594J20061N1097Q3805L7889l7765p5361l1007K1796l989N5192
16430A35871m808k07358p1854J07756J39988L8084M5992Q123J0067J21488j56195
16419A67154j45079O8321Q104l2491P1483J9466j49899n9341j32527K7189N1011
16408a06609O6747J14816J63025j20268k32465J62978o1450j00214J02981R1511
16398H1052Q2378k4595j5707j30170K0321j3385J82763K3539j70319j0278J50001
16387A75600J12488j02164k13935j26976K42552k6206J16702j40534o4484J40428
16377A13471J77046Q1537j73950j89118j2704P5897J1267j4809j82448j02600
$$ y = [-11818, -4861, -6948, 107531, 166532, 233838, 280214, 316206, 66142, -62312, -153995, -168441, -85847, 34214, 85311, 169116, 207005, 169240, 93879, 62872, 84668, 80679, 135871, 131063, -76295, -148149, -40393, 99595, 137679, 183671, 191794, 201861, 323349, 167154, 22075, 90396, 98500, 66009, 137492, 156958, 7059, -52282, -184809, -157620, -106609, -39862, 74954, 237979, 117711, -114754, 48224, -13226, -113440, -10459, 81052, 163430, 138835, 123128, -7042, 13279, -106, 182657, 206196, 35877, 25599, 175600, 288088, 185924, -28011, -154987, 87565, 61359, 178061, 37527, -26957, 113471, 290517, 372054, 198104, 8986, -3718, 72179, 83446, 68637, -113811, -216411]
16367b16411J67680J14217r8657k9044K3564n5620J41192O3832q6384q8881L4599
16356b9913J06251o6167j82833q6114O3871o938Q4675J54085O5662j97652j85094
16345b80167r0018J25388L59077Q0794l28138j27016K26459J03309j40454J1059
16335e9707J55357J6291q86k47955j29450Q1576R9925J19474k9875m6026Q8536
16324D7260o639o8390L1558O7274k0962J60627N1462r1067j44355J36135j15670
16313D7233k44719j30618K25438O6861j6888J26062J04446j25421k04799q1189
16303b33594O6347J48985k9216o4543Q189K70149k7704n9575Q3722j1686l7618
16292A13456j1954J75433O5965m0705l4461j46283j21867m3430O814M8875M2062
$$ y = [-216411, -48731, 65486, -33171, -62215, -38651, -94271, 46921, 110753, 24369, -64512, -29913, 76338, 10171, -172662, -258776, -194905, -201843, -117168, 36917, 102579, -95073, -280167, -370185, -244797, 114280, 195074, -133064, -260080, -33621, 69688, -70766, -59707, 95650, 111941, 111055, -136900, -266350, -184774, -84849, 34625, 4750, -41276, 47260, 40621, -27769, 3789, 71063, 50101, 210728, 262190, 171123, 26768, 162903, 47233, -197486, -328104, -102666, -35805, -52693, 73369, 177815, 52394, -152405, -233594, -167247, -18262, -47478, -112021, -103832, 166317, 138613, 79038, 162760, 151074, 113456, 101502, 276935, 342900, 302195, 267734, 121451, -416, -43846, -37032, 11843, 53905]
16281E3905j3518Q7768K807j82541J598J14255L5712R0235l9396j6754k6659k03489
16269i6077j06811J08873R253O6720J55079R8626J67255j92066j27905N2122q2315
16258E2754L6606j4225r7156K8597p1401j14668P3292J22448j8173n9861j05874
16247a67661k01051k4978J52622L00740M1593o5785j93373Q6201n0782J4780R8293
16236i401n3339j2700k7712P2607P5142J6452K3859j655J197K587l3699j22569
16224f9231q7216R4362M1953o4967Q3494J09985M4205k7104m2588j1659M3191
16213A14425Q6034j00925l2681M759J46004J34785k74252j65755j02518K3676
16203a66448r8645k5049J71684K2175J19086K05058j26054j22192l0879m3653
$$ y = [53905, 40387, 128155, 130962, -51579, -49981, 64274, 99986, 190221, 150825, 134071, 107412, -96077, -202888, -94015, -84762, -18042, 137037, 235663, 402918, 210852, 82947, 135069, 52754, 89360, 75135, -22021, 6576, -64825, -179493, -106201, 16247, -1926, -61787, -167661, -368712, -393690, -241068, 59672, 101265, 35480, -157893, -71692, -122474, -107694, -9401, -62740, -75440, -103152, -30545, 44597, 61049, 84908, 83253, 84450, 87037, 53338, -69231, -156447, -62085, -20132, -85099, -1605, 108380, 152585, 125481, 82893, 71234, 114425, 200459, 99534, 66853, 71612, 217616, 352401, 78149, -87606, -190124, -166448, -265093, -290142, -118458, -96283, 22803, 227861, 101807, -20385, -51264, -94917]
16193i4917Q0675k5561K160M0334p9497j40040J28340J92900j00357j53942N6630
16182i3275J68173q4985j15236j44139m7068Q909K16206R3346M6215J39457P4094
16171B61697P9110m2375j81657m0950L7313L992j40443l3852m0350J57536k0538
16160C9483j31607L7354J6647p1344P8157K09971L7352q5314l8789j06232n2481
16149f6803o6328m0885R2239l1039k0474K1094p6347m8786j79066m3543K23546
16138b36392Q4304K87993J80411r9922k31472J48979J08345j25302n5432N438
16128F6950n7630r4760P3551J30267j4845O5421j29189Q4628k73711k19009J97034
16117a71293J28852j2460J73311J04978m9579o2579M8044k8923j43072q8539J8287
$$ y = [-94917, -14242, -39803, -37643, 2691, -76806, -216846, -88506, 104394, 4037, -149905, -93275, 74898, -10087, -125323, -269462, -316530, -307621, -91415, 1931, 48146, 187603, 261697, 340807, 298432, 116775, 75825, 113138, 117130, -23313, -57165, -97515, 60021, 39483, -92124, -54770, -38123, -109467, -31310, 178661, 216013, 130699, 91910, -14322, -66803, -133131, -174016, -81777, -112816, -133290, -112196, -188543, -237329, -416395, -459938, -236392, -152088, 135905, 316316, 216394, -15078, 133901, 242246, 116944, 61512, 66950, 9320, -85440, -11889, 118378, 103533, 168954, 39765, 124393, -149318, -368327, -171293, -42441, -54901, 118410, 223388, 173809, 111230, 159274, 130351, -12721, -101260, -82973]
16106h2973K71062O0665l17712q8333N2918J3111L9163J4891J17383J65664J5412
16095B61251k25480q4410J33221n684n6740L1364K43676n2861n0164k6922Q3322
16084B50573m1921l0205k9799j43031j30436J63423k3317P308K5797Q1466r0486
16073C9372j68090L7925P6044q7866m8078j29663N4505J32165R557Q1542o8600
16062g1187l9389O6010L0454k01913j21501o869Q3518J86189J04455J83544N4429
16051B67740j21373q1671m7002K8622k0375k2999J03666N5910J39890l7600k87370
16040b2562j82835p113p750J25846m775j9725J76441O1337o2398J1433Q1734o0791
16028H8842j7820j44467k59708O3259K24775L3457M3680J48313j46088L2516N366
$$ y = [-82973, 188089, 248754, -68958, -157291, -104373, -91262, -52099, -37208, 80175, 245839, 261251, 35771, -48639, 84582, 78898, 22158, 53522, 297198, 244337, 194173, 167251, 250573, 208652, 178447, 148648, 5617, -124819, 38604, 15287, 22595, 48392, 129858, 39372, -128718, -90793, -14749, -102615, -150693, -280356, -225851, -93686, -84129, -2587, -71187, -110576, -44566, -14112, -216025, -337526, -344395, -260877, -74688, 29767, 213311, 267740, 146367, 64696, 17694, 46316, 25941, 2942, 106608, 162518, 302408, 264808, -22562, -205397, -212510, -220260, -94414, -99189, -118914, 57527, 118864, 56466, 67899, 149633, 88842, 71022, -73445, -333153, -269894, -45119, -11662, 32018, 180331, 34243, 66759, 72125]
16017G2125n1503q3484m5870l6397N6338m0764r9607J92416J83698K8450r5897
16006G9505J70665m606N4681J1229j0491k86878j54505J8924P5697q1338o3389
15995a90506n7605m4268J97836o739J43974k3205K7490K1636J29487M6437l2835
15984B11702j71413P866O3579n9761K6397o2859j16376K5818j2974J03391K3449
15973C8819N1010j3147k2773K47343O8302p6750n5952j74239m9932n2954J8987
15962b1286n3808j4127p9326n8377J06608O3965M2059k0773J0974K873k629m2907
15950f6754N3006k6507j30043k6379M0972J58087K7940r77L5011k1671L4773j37447
15938e9989o7843Q2547K8452J75978J22025m2981J1987R448j2776q7190K4081
$$ y = [72125, 20622, -62862, -108732, -145129, -88791, -129555, -229162, -36746, 146952, 175402, 79505, 250170, 245564, 300245, 311474, 300983, 14105, -140400, -121476, -45779, -127117, -190506, -248111, -292379, -94543, -101282, 42692, 19487, 46977, 68613, 198100, 244537, 211702, 40289, 48155, 111734, 51973, 78370, 15511, -100865, -75047, -88021, 15370, 38819, 89829, 76682, 53909, 301252, 369554, 292804, 236852, 62613, 12681, -40273, -21286, -75094, -89221, -168547, -226924, -120316, -56351, -14292, -35065, -24091, -21218, -23847, -66754, -13748, -40255, -170298, -196677, -155705, 2382, 30322, 29345, 64356, 42685, 77458, -59989, -127832, -45285, -16833, 159145, 281170, 238189, 250176, 259624, 246848, 159658, 183739]
15927A83739q5641j4027Q153n4782Q374j65359M976J96805J5938m2441L1584J43904
15915B31223j27113j51134L8169O8920j36305m2044O3968L1382N1233J21609J6735
15904A66643p6751L3858j2970L2294N5789m4710j01187J08863j8885p1937j34943
15893f3936o4870K32689K9321j31895n2440L3715p3647j90293J69561J84602L61
15882G3168l2301L6438R193q4733O4222K39251j5804j01031M0870J4427r5609
15871A48091k35317J37319J12087k76651J3901Q1528r9162m1985m5897J09080
15861i7006J1588q0526n3223J91967J13352K8772j08304j13393l5696R6515K23693
15850A77739O5382Q1728l960r0374l7179N4195p3902j77594L3051J23718P3946
$$ y = [183739, 98098, 84071, 92224, 37442, 45816, -119543, -114567, 82238, 98176, 55735, 87319, 231223, 104110, -47024, -8855, 60065, -76240, -118284, -54316, -22934, 28299, 149908, 166643, 89892, 123750, 110780, 143074, 198863, 154153, 52966, 161829, 142944, 71007, -63936, -128806, 103883, 133204, 1309, -51131, -17416, -91063, -281356, -111795, 72807, 73168, 40867, 77305, 86498, 1765, 65987, 305238, 289434, 188403, 229273, 243700, 148091, -87226, 50093, 162180, -114471, -100570, -19042, -118204, -160189, -206086, -97006, -85418, -165944, -219167, -27200, 86152, 114924, 6620, -106773, -142469, -45954, 177739, 243121, 324849, 320889, 230515, 193336, 247531, 173629, -3965, 29086, 152804, 226750]
15839B26750m7529j19859p3675r888J27336J5434j98171l7416K9499p9594o0847
15828b27960J2200l6288n6442K6677J26495J01708n953r98O0562J02663l3369
15817F9295r0506J27848O2992j00359R9448n9590j33295l8133K555j36448k05030
15806d01223M6444R0708K41392M7538j05736M8710o371M9685j57502l3063o0435
15795b39853o1615J5001p6004M4282K67976K50327j10649j46620J9314j33771
15785a71612j45146J55228K13030J57935j13445M4555R6336k66076j48562o1338
15775b39095R2108j6164M8979J06065J81108o6839O2728J7915j09869n0439J05867
15764A32364J06970j7462k87970j21279J9617J13598J21333l2598N466k6218o5648
$$ y = [226750, 179221, 59362, -14313, -24201, 103135, 118569, -79602, -117018, -87519, -167113, -227960, -215760, -252048, -308490, -281813, -155318, -53610, -59563, -60561, 1, 102664, 69295, -21211, 106637, 169629, 69270, 168718, 109128, -24167, -62300, -59745, -196193, -401223, -354779, -264071, -22679, 24859, -80877, -32167, -38538, 11147, -146355, -179418, -239853, -301468, -286467, -362471, -318189, -50213, 200114, 89465, -57155, -37841, -171612, -316758, -161530, 51500, 209435, 95990, 140545, 236881, -29195, -177757, -239095, -146987, -163151, -114172, -8107, 173001, 106162, 168890, 186805, 76936, 26497, 132364, 239334, 221872, -66098, -187377, -167760, -54162, 67171, 34573, 40039, 13821, -51827]
15753e1827P0976Q943m9566o6555Q7403j4235R6939n4193j88838J06011J34474
15742G9532o560l7108M676J3770r3690J06949j22835k15391N3462K39962M6268
15731F9035j898M3843N279j12868o8961l2514P9676j2540j6440N6936J50380k4713
15719A35215o3728j25015q0942j8611l2805l5343K24959K08021M344R0894o484
15708C00505Q38j70878j51352q6280l3218J56561O9230j18484N5753l0302J57709
15697A50082J21697j83798k22248J4920J10242N0341O1807J18653j54669k12111
15687a45084r4528J49446R0306j4884j48350p5780j26513J95968K34541L5977
15677A01099k2724l3022Q2466O8991q1158O8095q199j03779m6069j5484J58461
$$ y = [-51827, 19149, 28092, -21474, -88029, -626, -14861, 82078, 27885, -160953, -54942, 79532, 72972, 35864, 40540, 54310, -39380, 67569, -55266, -270657, -217195, 22767, 69035, 67137, 110980, 116259, 3391, -65570, -98084, -18408, -30948, -47388, 9548, 159928, 135215, 71487, -53528, -134470, -153081, -185886, -221229, 3730, 211751, 216095, 306989, 300505, 301343, 130465, -20887, -107167, -140385, 16176, 85406, -33078, 22675, -7627, 150082, 271779, 87981, -134267, -119347, -9105, 41236, 103043, 221696, 67027, -145084, -239612, -90166, 140, -14744, -163094, -238874, -365387, -169419, 65122, 101099, 78375, 45353, 127819, 196810, 115652, 183747, 175548, 71769, 25700, 10216, 168677]
15666A68677n0379N2536J35099n2523j2456o4292n0572J3676k9672j3302k6574
15655G0218k83668p6319O6482J07176J71087l5338j30341l3829O2660o6252L5635
15644a12489O3725O8052k82101r9453N9761J44867M0981M3275L7174O1580R7847
15633A23219J5569j15805j22023l7065J6932J1724J45917K9694k13626j35352
15623b80816R8582J10001p8555q699n0237R4783R3072j13392Q5993J74610n7620
15612F7722j43572k803N4351j21674O4546Q2864J10055M4061j33316P0632n9016
15601C3850M6286J8841l0306J35158P4166k2758j53251j32406o5278P8942j59999
15590a76755K0130J73946J10668k56651k28669J01754J19377M8607P1504n0674
$$ y = [168677, 118298, 170834, 305933, 253410, 240954, 176662, 126090, 139766, 110094, 96792, 70218, -213450, -289769, -223287, -116111, 54976, 19638, -110703, -144532, -81872, -148124, -112489, -48764, 19288, -262813, -362266, -302505, -157638, -116657, -73382, -36208, 25372, 123219, 138788, 22983, -99040, -136105, -119173, -107449, 38468, 68162, -145464, -280816, -182234, -72233, -150788, -159487, -209724, -114941, -21869, -135261, -49268, 125342, 67722, -75850, -78653, -24302, -145976, -81430, 1434, 111489, 155550, 22234, 92866, 33850, 80136, 98977, 68671, 203829, 277995, 255237, 101986, -30420, -95698, -16756, -176755, -156625, 17321, 127989, -128662, -357331, -255577, -136200, -87593, -16089, -66763]
15580f6763k19532p5264J18572O5656J34681Q8106M0120k02029N0590Q8949p043
15569A6043n536j38128n6125J50395K4588N8810P4246O937P5995L7719m6872K8842
15557B26914j39086j40337r2945J02457m5386j79385k7942J76210Q2416j7879
15547e4963n8430p6827j22158J65106O827M2296o5132j12798J13877P1883O7616
15536b2703K5958k6749L1532J3831r6837j67539l8309q2042L0161K54731j6646
15525i4612j45162l2588N5918p510K9873K4950K14165J69324j76390L3009o8133
15514B844j78422j19356Q3624J32535R5983p178k3498j6363J00924j18463p1251
15503a18621q7272P9009o9364M541J86026J73777Q4688n9560m5602K2763p7100
$$ y = [-66763, -286295, -361559, -242987, -177331, -42650, 45456, 85576, -116453, -65863, 23086, 16043, 10507, -127621, -183746, -33351, -8763, 50047, 124293, 131230, 207225, 244944, 198072, 226914, 87828, -52509, -145454, -42997, -88383, -267768, -295710, -119500, -37084, -54963, -113393, -190220, -312378, -147272, -140445, -98149, -163281, -276079, -162202, -90319, -22703, 3255, -23494, 8038, 21869, -74968, -242507, -280816, -362858, -332697, -77966, -94612, -239774, -272362, -216444, -223954, -194081, -169131, 45034, 214358, 37968, 70977, 2844, -175578, -294934, -211310, -78775, 17208, 10030, -13468, -29831, 71093, -47370, -118621, -205893, -126884, -196248, -191707, -5681, 168096, 252784, 193224, 147622, 170385, 93285]
15492I3285k00669n4040O2064K4335O0742N1503j68680k21832J24217J71444Q926
15481d8705j57249j00155J11921K9984j641Q9193J64413N4937Q2197r2555m0826
15470I1514j73815m1092J29273Q1189O4225r9633j53380J72360L8742q6873j34389
15459a11879J9900r2405L8725J75172J14284r6573k42422j86723K1844J83539
15449a76538J64807m1343k5767n1344j3208J02739K2728j83153o5369M3218R12
15438b22318L6398Q2131M2037Q7319j9498m9976j02865K004J2369q9186k6134
15427b47719J57216M7130j3225L429J68056p8020j72199J46654p757J1698P9415
15416I4678R8645M268k37600p8435k4140J53095J15726L5769M9943j12324r1713
$$ y = [93285, -107384, -161424, -99360, -75025, -14283, 37220, -131460, -353292, -229075, -57631, -48705, -205954, -306109, -194188, -164204, -165845, -76652, 87761, 142698, 224895, 132340, 91514, -82301, -123393, 5880, 87069, 151294, 51661, -101719, 70641, 109383, 22510, -111879, -91979, -184384, -145659, 29513, 143797, 47224, -195198, -381921, -360077, -176538, -11731, -53074, -78841, -130185, -143393, -40654, -17926, -201079, -266448, -223230, -222318, -185920, -103789, -61752, 25567, 6069, -43907, -146772, -144768, -132399, -221585, -247719, -90503, -43373, -56598, -53169, 114887, 36867, -135332, 11322, 3565, 15263, 94678, 193323, 197591, -40009, -118444, -142584, 10511, 126237, 162006, 211949, 99625, 7912]
15405G912M7777L772n9557j40468k7616Q8461j08199K64390j7602j19713o4417
15394a25260N2910K05835J20640P0764J7008r6497l6454k18389k60798j13168
15384c83409J32365N6516O0260J60630J92144k38479q7563J338r391o1900l1291
15373b08780R7857o8204q4985J10133K63728l9774J1758n5170n1454m841J39247
15362A09515O6874r3068j50582j52209J52971J42207k0699j3043P2047n0919j60361
15351i7267M2660R5691N2325J10451j32980k45581J31798M554j25766P7073N4012
15340c3030M0105Q032j09844J20542J31090J36826k1409J4433Q9843o2707p9469
15329B34412p9341j29495j2793k0606j84855Q9851K32410N5589J5463N4057l8355
$$ y = [7912, 55689, 59461, -96, -140564, -168180, -79719, -187918, 76472, 58870, -60843, -125260, -72350, 133485, 254125, 324889, 341897, 245400, 208946, -9443, -270241, -383409, -251044, -194528, -134268, 26362, 218506, -19973, -107536, -106198, -115589, -177489, -208780, -110923, -179127, -264112, -153979, 109749, 69975, 81733, 26563, -24891, -29732, 109515, 176389, 83321, -67261, -219470, -66499, 75708, 55009, 41966, 114013, 63094, -97267, -54607, 41084, 93409, 203860, 70880, -174701, -42903, -38349, -164115, -87042, -33030, 7075, 15107, -94737, 25805, 156895, 293721, 272312, 286745, 376588, 313881, 234412, 155071, 25576, 12783, -7823, -192678, -102827, 129583, 185172, 200635, 254692, 216337]
15318B16337o5645O7748n7782Q4994K9867k2663j88702j9591K441K5513J06951
15307A79468p3955K832J20221p0791q2374j87747L4283K1138j23962j7708J427
15296a97168P0786m0889k5160M2296k9608q6053J59372K21047K5416k33858n3917
15285a47736R8201r5874P1799L2943j8546K2993n0622m7627J28264J81033m4662
15274A30166r5789J64037r4883l7190r651l0621J2387N5388p8792j16351j13629
15263b14928O1769J90492K56003L7180m7750j52557j24077p0900K3658j77866
15253b18976j0437N7283K28538M4863l7427J11949O8584l4902m6187R8738p2713
15242A89313k13643p7118p9571J19274K25175J35620o7940j41709M184p65q3193
$$ y = [216337, 150692, 218440, 160658, 245652, 275519, 252856, 64154, 44563, 47004, 72517, 179468, 105513, 108345, 228566, 157775, 75401, -112346, -78063, -56925, -180887, -198595, -197168, -126382, -167271, -192431, -150135, -179743, -265796, -106424, 114623, 140039, -93819, -147736, -49535, -145409, -73610, -40667, -59213, -36220, -86842, -134469, -6205, 174828, 130166, 34377, 198414, 103531, 66341, 56690, 26069, 38456, 93844, 15052, -101299, -214928, -153159, 37333, 293336, 330516, 282766, 130209, 6132, -64768, -41110, -218976, -229413, -172130, 56408, 101271, 63844, 175793, 244377, 209475, 163288, 262026, 189313, -24330, -101448, -181019, -61745, 163430, 299050, 231110, 89401, 93585, 92820, 9627]
15231I627p5630n8486l5608o740J44129P8329O2238L6133j42982j3159o5763N7887
15219a0025J58244J784k4276M9692j49070o0372J30147N6472L6497K6893j16617
15208I9369j27134R4559J15914l6872R5003R1421j55056J22466J56102p8601j16115
15197B61056P9901r3704j11352R5795L2974p2372k0298n1287l1992j54034M1581
15186b3732R4780r6034j62182J345L1548K880j14573J01482K01477L9120j27549
15175e1438o6577J04779J61504J13481l2176j84277j29199j2617J16026N4364
15165G3870L6032R9151M338k2940K4787n7727p6642L0134J8677j36406N439O4270
15153F2983N0467N7306j96622n4574J85568O8736j34319N35k0328l2295n243J04575
$$ y = [9627, -66003, -124489, -160097, -166837, -22708, 55621, 117859, 153992, 11010, -2149, -67912, -10025, 148219, 150003, 125727, 175419, 26349, -34023, 96124, 152596, 189093, 215986, 99369, -27765, 66794, 182708, 145836, 240839, 332260, 177204, 299670, 455772, 377171, 261056, 340957, 247253, 135901, 231696, 264670, 192298, 172000, 120713, 88721, -65313, -23732, 71048, -24986, -187168, -185823, -154275, -151395, -265968, -164486, 36991, 76111, -51438, -118015, -13236, 148268, 261749, 229573, 45296, -83903, -96520, 19506, 73870, 109902, 209053, 213391, 190451, 215238, 157511, 80869, 111003, 129680, -6726, -1287, 62983, 113450, 170756, -25866, -80440, 105128, 173864, 39545, 40080, 19752, -12543, -17786, 86789]
15141H6789q7685l10306P2230J51989K06454N830J7976o1535o9585k28796J85976
15130c0663N5660j63748k3426L9826J17503K49620n1455j57133q6241J87489p1411
15119F6021J05641j68548n4155P6810J32777q1965j09942j42617J41635R1427
15109E7084P9155j8753p5105L0305j39513m0747O1295j38818r0277K06174R0318
15098B1118j24590P5589J4607p685M9639M9782L1090j14347k50643R5914J32196
15087b7330j10287j00214q0881q726M2596p2140m2494K60534Q8058p160J64174
15076A06130L1750P0985n5842k00152j04205K2923N1178r0823l9061q4268K08441
15065h2944J87040J05769k31992o9016p2144J60795N2690o5874o5689q9111K9601
$$ y = [86789, -896, -311202, -238972, -86983, 119471, 125301, 143277, 81742, 12157, -216639, -30663, 24997, -138751, -162177, -122351, -4848, 244772, 193317, 36184, -50057, 137432, 66021, 171662, 3114, -51041, 25769, 158546, 76581, -33361, -175978, -34343, 57084, 136239, 117486, 42381, 72686, -66827, -107574, -46279, -185097, -275374, -69200, 21118, -103472, -27883, -13276, -20961, 28678, 78460, 109550, -4797, -255440, -159526, -27330, -137617, -237831, -318712, -327438, -284842, -356982, -399476, -138942, -50884, -58044, 106130, 137880, 208865, 153023, -47129, -151334, -128411, -77233, -168056, -207117, -291385, -82944, 104096, 209865, -22127, -91143, -163287, -2492, 50198, -15676, -81365, -170476, -140875]
15054a40875p581J3527J71623o4682j34201P3668L8182P2489j228O9369j1173
15043G9118J4590j94338j89065J64405n73K6371j9473K7832K14621r6209J5677
15032D2956n1644n6377J06063L5096Q9562N789j19227n1718m8899O1102J40713
15021A53416k8769k7977R7680j24225o2024j59014j60433O7664l1928O9748J55211
15010e0651r2208k7362j9452J57886R399J62562N6751j68071j70806L589J83184
14999D4821M6139J84153J28670k71261j08131l59j34800p3020M1882M8076N8032
14988c5798J23756M3083j10434j28302M247r943q2190J03677J41886q5942k22510
14977b58470O2409J37093K80779O4974j33660k1265o317j2749J62130J5287k02906
$$ y = [-140875, -148456, -134929, 36694, -27988, -162189, -88521, -50339, 22150, 20922, 90291, 79118, 93708, -100630, -289695, -125290, -125863, -99492, -118965, -91133, 123488, 27279, 42956, -8688, -65065, 40998, 76094, 165656, 171445, 52218, 500, -48399, 12703, 153416, 124647, 96670, 194350, 70125, 8101, -150913, -311346, -243682, -275610, -205862, -50651, -142859, -170221, -189673, -31787, -22388, 140174, 196925, 28854, -141952, -138363, 44821, 90960, 275113, 403783, 132522, 24391, 24032, -110768, -183788, -141906, -93830, -35798, 87958, 131041, 20607, -107695, -103448, -113391, -195581, -91904, 49982, -35960, -258470, -196061, -58968, 221811, 286785, 153125, 131860, 125543, 112794, 274924, 290211, 87305]
14966H7305o5139K9017m1004j07776J6209J1887R129J79596J65424J37943j38130
14955B84461p8646l9481q1581q9627j38979l6402R1005p2151Q3717M9039q1991
14944a10636L4578P6903k8820j22813M4127J32306M3472j13439j27700J08553
14934f3469J49944j55128R8361J824j92644p527J09365J33529J46223P3978k02367
14923I2089j57128K5512L8649p4456m0024l813o9281m9025J67974J87770j7513
14912A00754k38249L3228L3320m6892J1243M5352P4397K63263L6306k33728j7414
14901F1580O1123j33535j20898l9061O6088K0354K7597p4188J38841J19293k5159
14890A02035o8000j6419o8950M415J03032P861j25967M4r8497o0337L578J68854
$$ y = [87305, 22166, 51183, 10179, -97597, -81388, -69501, -60372, 119224, 284648, 422591, 284461, 205815, 166334, 84753, -4874, -143853, -180255, -89250, -161401, -77684, -28645, -110636, -76058, 845, -27975, -150788, -106661, 25645, 69117, -44322, -172022, -63469, 86475, -68653, 29708, 31532, -161112, -168639, -59274, 74255, 220478, 294456, 92089, -65039, -39527, -878, -75334, -115358, -119171, -188452, -237477, -69503, 118267, 100754, -137495, -104267, -70947, -117839, -106596, -61244, 13153, 276416, 312722, 78994, 61580, 122703, -10832, -131730, -170791, -104703, -84349, -56752, -130940, 7901, 127194, 102035, 34035, 17616, -51334, -46919, 56113, 63974, -61993, -61949, -160446, -220783, -217205, -48351]
14878d8351P2330m5530o4304j76126q3270j24686L1794J08436J74055J94351L7812
14867G6511j64899Q6346J13458m6227o1260j84060n5233N3902n5810J43686O2964
14856c0622L051j21898Q1547r5744k32328J31969K34965J19259J4599K5489m5411
14845H4876m8895M1428j06581k5257N0472M6777j5569J2578l7670p7069K10820
14834A35910J4684J964j50207J509K32539M2166r5459m3473O3145K00583j51979
14823B51382k63251n5298J15347j05600K4113r3781L652j0517p2651J6587J57557
14812c2460J32060j38897j73735K4708O1654k6767p3478L456N3378N5522J3851
14801a00708R3815j9840o2905J4254p3158K80745J76680j3711l07450k0914R0616
$$ y = [-48351, 23979, -21551, -85855, -261981, -345251, -469937, -438143, -329707, -155652, 38699, 76511, -88388, -2042, 111416, 65189, 3929, -180131, -235364, -181462, -237272, -93586, -30622, -27571, -149469, -67922, -163666, -395994, -264025, -29060, 90199, 104798, 130287, 84876, 35981, 77409, -29172, -54429, -3957, 42820, 27251, 39829, 2159, -74910, 135910, 150594, 152558, 2351, 3860, 236399, 278565, 183106, 139633, 202778, 403361, 251382, -11869, -67167, 48180, -57420, -33307, -127088, -123436, -133953, -206604, -190017, -32460, 99600, -39297, -213032, -188324, -126670, -153437, -226915, -223459, -170081, -114559, -100708, -6893, -26733, -89638, -75384, -148542, 132203, 308883, 295172, -12278, -33192, 57424]
14790E7424J69332K3508p1503l3514k0609j58994j34525J46676m2696M0907p3194
14779i7188j76052J58480J10857j46171j7631K6731J4599o0655J5608K4891o0322
14768b06853j83944J35394J73069n8373N0073K00999J67134o4868q6476n6990
14758F9165k6043P9995Q5784q9232j12065K02442J66579j04708k24680j55626
14748a08389J4271R0320j3295M0630J5171J39705k36111k48748o7121P9935K31542
14737f2090K01895j00975O4751q3968Q9946j02508r7942J64974N1032j30555p4327
14726g9767n4325N4469M2917n4842m4607J933K75436L7144o9268P4393o9884j06712
14714F887j15019l2942N076O3891K1670J2786q4588N191M1859P0125K01979n2916
$$ y = [57424, 226756, 250264, 178761, 145247, 124638, -34356, -168881, -22205, -64901, -23994, -97188, -273240, -114760, -3903, -150074, -167705, -140974, -126375, -187030, -171422, -146531, -206853, -390797, -255403, -82334, -140707, -90634, 110365, 277499, 212631, 126155, 69165, 43122, 123117, 208901, 119669, 7604, 210046, 376625, 271917, 47237, -108389, -94118, -3798, -17093, 23537, 38708, 178413, -57698, -306446, -373567, -293632, -62090, 139805, 38830, 103581, 19613, 109559, 7051, -90891, 74083, 125115, -5440, -79767, -134092, -79623, -36706, -91548, -136155, -134222, 141214, 178358, 109090, 183483, 113599, 6887, -108132, -141074, -135998, -72107, -50437, -37651, -122239, -117048, -75189, -5064, 196915, 143999]
14702A43999j28658j15053o6568n77l119O2030O9277Q5988o0649j24186Q1224
14691e6292R7928m9111J35628J32318K5783J272K748q675k0076j83052N6634K85001
14679D20106j39621k2268P9158j88584q0432J1046P0452N4820p4316N897j61203
14668b4945j07320P3857N5627P0760m9573p4315o7114j03442Q1726J55762M0132
14657E1155N7948L2728o822k10455j68973J74183P2249j1117J2941l1469j0401
14646c8033J98112O4314l8500l3678p2693j07539N4753j09122N4882q6789J9938
14635i4355J97318J02333j8637q9485L1825m6083K28j30146j83842k6243J9594
14624b37493J01938J5913o5834m1390J65746J53657N0708m19j07373j67109j00060
$$ y = [143999, 15341, -99712, -166280, -166857, -169976, -107946, -38669, 47319, -13330, -137516, -56292, 41636, -7475, 128153, 260471, 286254, 287526, 290274, 281599, 261523, 78471, 135105, 420106, 280485, 258217, 337375, 148791, 68359, 79405, 149857, 204677, 130361, 136258, -24945, -132265, -58408, -2781, 67979, 18406, -55909, -123023, -226465, -144739, 11023, 51155, 109103, 141831, 135009, -75446, -244419, -70236, 2013, -9104, 3837, -27632, -38033, 160079, 224393, 185893, 152215, 79522, -28017, 26736, -82386, -27504, -114293, -94355, 102963, 205296, 186659, 97174, 128999, 82916, 83144, -47002, -230844, -257087, -237493, -135555, -119642, -185476, -226866, -61120, 92537, 143245, 142826, 35453, -131656, -231716]
14613b31716j3385N7721j12655J151K03784K493K4010J07719j2673q2790p71P9914
14601B2802J92617q3162m5504q9563R6370R4091J85619N5083j16848J478j37008
14590A75975k56667j33203K06286O8173J27161j15370j9314K9378q7716j6830
14580b2127J5258L3225J0002J66676n7408k66976j29800N1206k6311r8196J11278
14569b13173J98910J30469n4097Q7761k02165j27379J58257O0917J3620N5786
14559A08906m9765r7193R8885M7826J41207K6651n3090m2432j66382j3671j42875
14548a41933j10614K02290N3608J8169r5793J20119P550p3977p7435J33628j06250
14537g0638k14408L0791J57968P5063n4603R4929R4214N7752o0162j47739N0004
$$ y = [-231716, -245101, -187380, -300035, -298884, -95100, -92607, -68597, 39122, 26449, -56341, -57112, 22802, 215419, 132257, 86753, -2810, 93560, 187651, 373270, 428353, 311505, 312983, 175975, -80692, -213895, -7609, 60564, 187725, 72355, 53041, 82419, -5297, -22127, -6869, 26356, 36358, 203034, 145626, -121350, -251150, -199944, -226255, -324451, -213173, -14263, 116206, 62109, 149870, -52295, -179674, -21417, 39500, 53120, 108906, 59141, -38052, 60833, 108659, 249866, 276517, 223427, 180995, 14613, 942, -141933, -252547, -50257, 3351, 21520, -74273, 45846, 53396, -20581, -98016, 35612, -70638, -285046, -254255, -96287, -21224, -75827, 19102, 113316, 171068, 110906, -36833, 13171]
14526A3171r2642k50521o3744Q4042J18967L9115M5718j1883Q5690l7592j36080
14515b05759m6205J52225Q4029O5327J05558j1342m4032K1681l9847j13143j87478
14504b18986M0555J12805N0703Q818j66549Q3273J09668N2365j22251o9327j06321
14493b25247k0726Q7560K92939o5179j99806j12053n4006o5950J6752Q7617P4628
14482a83471K4724R4068M5639j38397j07750m249K00427J21727N7821l2955j27
14471G7457j245n0174j97736M2950J0496o209m2574N1748O1421p1360J83830M7406
14459A06010j12405q1517p674j7207p6072J8540p0520J16542J29840J59801q7185
14448G8153n742q401k9402M3744l410L0847N5396k269j56452r3783P6304J55451
$$ y = [13171, -79471, -329992, -393736, -309694, -190727, -151612, -105894, -117777, -32087, -69679, -205759, -251964, -99739, -15710, 49617, 155175, 143833, 99801, 121482, 81635, -31508, -218986, -178431, -65626, -14923, -6105, -172654, -89381, 20287, 72652, -49599, -118926, -225247, -245973, -158413, 134526, 69347, -130459, -242512, -296518, -362468, -345716, -258099, -183471, -158747, -64679, -19040, -157437, -265187, -269436, -69009, 52718, 110539, 77584, 77457, 76212, 26038, -171698, -128748, -118252, -124461, -167035, -115287, -53866, -125226, 58604, 106010, -6395, -87912, -95586, -112793, -188865, -170325, -240845, -124303, 5537, 165338, 78153, 72411, 64010, 34608, 78352, 74942, 105789, 161185, 158916, 2464, -91319, -15015, 140436]
14436A40436q011k6961j44085j21678J22306O525M4592J28689N7366j25523j24559
14425e0903j37595j01410J66101J87451J07098j8655j66984J10662K6512k2913
14415I9364J52504q8159l6765j07224j00260K06859J2450Q91J66591n8253j74447
14404G3551q2533N5480M1125K6695k3174J04205j19714n0368J96242k3333j58276
14393C9900K6516l8961J22986K09529K7689j28493k25208m9860J9040K02694J00388
14382C06220r4435j10501j28039k1775M1578j6986J88022L0283j44142k35459
14372a85234j14020K4474j66469J4558J59121J97290j9880K6513N7919J2694P5360
14361H2326o665K00294j08565j1448j07696r6227L8151J28439m7396j53821r1045
$$ y = [140436, 132425, 105464, -38621, -160299, -37993, -31468, 13124, 141813, 199179, 73656, -50903, -188498, -289908, -123807, 63644, 170742, 152087, -14897, 95765, 122277, 99364, 251868, 163709, 126944, 19720, -80540, 126319, 138769, 139660, 306251, 247998, 73551, -8982, 46498, 87623, 114318, 91144, 195349, 75635, 25267, 221509, 198176, 39900, 66416, 27455, 150441, 359970, 387659, 259166, 33958, -15902, 3138, 205832, 306220, 211785, 101284, -26755, -48530, -6952, -23938, 164084, 194367, 50225, -185234, -299254, -274780, -441249, -426691, -267570, -70280, -90160, -63647, -5728, 6966, 82326, 75661, 275955, 167390, 155942, 48246, -47981, -9830, 118609, 71213, -82608, -173653]
14350a73653L9015O4923k747m0322J9437K8818o3268J25614m679j27927k27119
14339c61908J51912M6022K2334J7092J48786K5835O7337k04352Q5582r4322o3173
14328a58855m9478O9447N4721l2396n0132K70354J69454j13331n2955j6034j9562
14317G1233K7781j62457R6220K2607P1331J7749j40089k9542n1479O9783J08103
14306A01240L0345j69120j96712o0935J8651J3246L2905j17865J4112k206J82530
14295a53809R5223r2438k39489J07505K54870R0414j09949j0745q0409k1675m9516
14284b10018O0211J65629J06849M7999j83474j17721k1845J31795J34872k3718
14274I0579P722J13033o3933k0670M0771m4130l3935K5457L46m8817j81058R642
$$ y = [-173653, -134638, -69715, -72462, -112784, -93347, -64529, -127797, -2183, -6862, -134789, -361908, -209996, -163974, -141640, -124548, 24238, 50073, 117410, -86942, -1360, -95682, -158855, -208333, -138886, -84165, -116561, -166693, 103661, 273115, 159784, 106829, 90795, 71233, 99014, -63443, 32777, 55384, 126715, 144464, 4375, -25167, -76646, -6863, 101240, 131585, -37535, -234247, -295182, -276531, -263285, -230380, -348245, -334133, -336339, -153809, -58586, -151024, -390513, -283008, -28138, 62276, -47673, -58418, -138827, -160502, -210018, -149807, 15822, 122671, 170670, -12804, -130525, -152370, -20575, 114297, 90579, 98301, 211334, 147401, 126731, 167502, 123372, 89437, 114894, 115240, 66423, -114635, -104993]
14262a04993J5983M0057J04814p272n7781r8684j1312q093L6152N3J3726l5000
14250a12350J27953J24044o643k6483n0299j21419K1643j00067j22684o9241j19082
14239d54628J67357K52842J17760N3107j79065q9335J9182J78035Q2727R4290
14229B42272n397p9698R165j78913k59788J72653Q7017k7053O0096M113M4262
14218F8729N5459J371j23354l6125j0896J94548R5666L395j3797j54807J2800
14207I2989j4247q4102l3571J9657O4545O8587n2698k2608Q1601o2817R0579J11112
14195B59027j20717k71507l2900o4683m7795k1073Q4761Q0717J20852k4633k1198
14184e9149R7361m7712p946M3642k1039J72516J12087o8237j7176N2884M3973
$$ y = [-104993, -89010, -48953, 55861, 48589, -9192, -107876, -119188, -127281, -91129, -91076, -77350, -112350, 15603, 139647, 133004, 106521, 56222, -65197, -43554, -143621, -266305, -335546, -454628, -287271, -34429, 83331, 136438, -42627, -131962, -112780, 65255, 147982, 242272, 236875, 157177, 166342, -12571, -272359, -99706, -12689, -39742, 20354, 24467, 68729, 124188, 125559, 2205, -33920, -44816, 149732, 245398, 248793, 234996, 80189, 92989, 78742, -5360, -38931, -19274, 45271, 113858, 61160, 38552, 120153, 57336, 147915, 259027, 138310, -133197, -166097, -230780, -278575, -299648, -214887, -134170, -13318, -37951, -59149, 38212, -9500, -17446, 26196, 5157, 177673, 289760, 221523, 204347, 257231, 301204]
14173C01204J37j45204j13610P1026j7056k0214l1194o5822k3101q6026l5595
14162a65455j308J84780N1189j21786K0278J10441Q1479O3229L6469k8503n0347
14151A80466m9641K0229J10649k0366j14613j39368R6700L5588k318p9404n7472
14140a9550j01136L1324M5424J02720J18162R2162p0818Q5420j46842j78651k46344
14129b88129Q3402K07980O0677j7768M4198K4450J32544o2669J02112j98618k96673
14118b08494j13329J69450K17715l4690N4468J51740L6865j17211M9827p1555
14108A34786j26013L726J16326L3794K1222o3176q7714J7951j07799j15212k3776
14097a95885O3715r643O7563J13887J51236R8942J54353j13499m3116j43650j76264
$$ y = [301204, 301341, 156137, 42527, 113553, 96497, 76283, 45089, -20733, -43834, -129860, -165455, -166763, 18017, 69206, -52580, -32302, 78139, 159618, 222847, 259316, 230813, 180466, 130825, 151054, 261703, 241337, 126724, -12644, 84056, 119644, 117326, 37922, -19550, -120686, -89362, -43938, 58782, 176944, 269106, 198288, 283708, 136866, -41785, -288129, -204727, 3253, 63930, 46162, 90360, 114810, 247354, 184685, 286797, 88179, -208494, -321823, -152373, 65342, 30652, 85120, 236860, 273725, 156514, 206341, 134786, 8773, 12499, 128825, 162619, 183841, 120665, 32951, 50902, -56897, -172109, -195885, -132170, -141813, -74250, 39637, 190873, 289815, 444168, 330669, 287553, 143903, -32361]
14086c2361K0026J13814l3415J1470J49165N8833j29698Q5912j01588j34862L77
14075G673L3608Q5477L5461N2990O0262r4861j2373q8257N6524o6256L6673n6699
14063E0222l7896N5888m4999n6037j3181n2077j5215l6180J71145J06339J8379
14052A46388r4669j00273o131R8382J11274J42234j21563j42480j430l5815J4828
14041A0745O8372l1245J71342m5061j97178L0225Q8476J19949j24294k70891q3253
14030b62813J82866J71094R4643k7955L3401k5456p2002q323M9292k2734j97353
14019h5340p6125J76979j6270L5174K0032l0784N0607j4176l6538o4577K3859
14008a7159j3989J24176Q9219O5576l4936k38282j55669J43748K16304Q7452l3293
$$ y = [-32361, -12335, 101479, 68064, 79534, 228699, 287532, 157834, 243746, 142158, 7296, 7673, 41281, 126758, 162219, 215209, 275471, 180610, 168237, 79980, 136504, 70248, 106921, 50222, 12326, 68214, 23215, -32822, -46003, -98080, -113295, -149475, 21670, 128009, 146388, 51719, -48554, -54685, 43697, 154971, 297205, 175642, 33162, 31732, -4083, 10745, 79117, 47872, 219214, 174153, -23025, 7200, 95676, 215625, 91331, -179560, -262813, -79947, 91147, 185790, 157835, 191236, 165780, 93778, 85455, 134747, 112013, -85340, -161465, 15514, -756, 34418, 54450, 23666, 74273, 60097, 23559, -41018, -17159, -31148, 93028, 182247, 247823, 212887, -25395, -181064, -37316, 178988, 266440, 233147]
13997B33147q9488j62112j14223K2452j10917q8200J06848P224p842M8544J34510
13986b0057Q1700J28076n4117o4198r4081n85j23451K189j8907n8544k7798J27001
13974a22772J17049n8556p5848J28005O9834N444k29158N5435J13158j1633n1627
13963f0669R5152J13605j24213j81455J42342J23007L3636q5823j37413P4704
13953g127l0852p1863M0104n6862j12987L9828n2097L7569J67645J15787P9914
13942A49059j41876L0224N6129p4621K57818L8506l58139k85183N3001K7447R3757
13931a53878J42704R2762r6045m2558N6329m3238n9534p5166M5374J4091q5303
13920b04462J54764m5929m0526j4369N1790N7981P1138M100k3195l7856K6852
$$ y = [233147, 143659, -18453, -132676, -110224, -221141, -309341, -202493, -195269, -203111, -154567, -20057, 61643, 189719, 135602, 71404, -22677, -23262, -146713, -144524, -163431, -221975, -249773, -122772, -5723, -64279, -140127, -12122, 57712, 63156, -166002, -110567, 2591, -9042, -60669, 34483, 148088, 23875, -157580, -15238, 107769, 141405, 55582, -81831, -7127, -37979, -109842, -69738, -126600, -239587, -199759, -251856, -214287, -46642, 69145, 149059, 7183, 37407, 93536, 18915, 276733, 315239, -42900, -328083, -275082, -247635, -153878, -11174, 81588, -14457, -57015, -686, -43924, -103458, -178624, -133250, -119159, -204462, -49698, -95627, -136153, -150522, -98732, -40751, 30387, 34487, 11292, -26564, 288]
13909B88j01024q8713M0193O9491j3884n6306m3430j11714L7872J51599K49096
13898A33468q9401M0013Q4155k9936K366k8459k09576j63046J5607J37845Q9709
13887a7255n7588Q1021M3373l9994J05354J06320p0227j48884j02297j14639J85129
13876b9687K67179K05366p5119j35207Q7844J07330j48081p93q3101p3803J40744
13865B62672l8083J9762O5826K53591k04517k33792J31625K43990K74572L51533
13855A127179R1032r0232J06785l199j43209j71093k33402j59651M5841N859r2985
13844D82925k6062m3656p6173r3172M7922Q9135J39322j32442j19933J08336L4954
13833D11156k6579j29480q3770J3276J51524J07611p5021o8413j56036p762j11036
$$ y = [288, -100736, -189449, -149256, -79765, -93649, -149955, -193385, -305099, -267227, -115628, 133468, 44067, 84080, 168235, 138299, 140665, 112206, -97370, -260416, -244809, -106964, -17255, -74843, 6178, 49551, 9557, 114911, 221231, 151004, 2120, -100177, -214816, -29687, 237492, 442858, 367739, 232532, 320376, 427706, 279625, 278832, 195731, 121928, 262672, 224589, 244351, 310177, 563768, 359251, 125459, 257084, 501074, 775646, 1127179, 1218211, 1127979, 1234764, 1231565, 1088356, 917263, 683861, 524210, 570051, 575910, 482925, 456863, 413207, 337034, 243862, 291784, 380919, 520241, 387799, 267866, 376202, 411156, 384577, 255097, 171327, 184603, 336127, 443738, 368717, 300304, 144268, 136506, 25470]
13822B5470K6026J15880R4813L8872j37039q4802n4489p9549j69517J13189R7947
13811a3199J70202K69229l6694K6826j63769r2938k9124j58786K8320K5257m9621
13800b4297K87722Q0090l43064j19048J21816m2067N5175K2871p2525k20838J2046
13789b42119J0594j76697L0076J16185J36648Q6239J09777J17490K73233P6989
13779E38415j12376m2636k20875q8847K5811L2604K4129N9658l1942K0424j77923
13768B6442k02283R1268O6234m5391R208J32603j30845o460o4097K30581Q4969
13757A92229k355k0264j10155r7672N4297r4440O9800J24518j1301N66n6911k7910
13745B0402K00113J74997O8088q2774j09184k39659j49745q9080J23539O3664
$$ y = [25470, 51496, 167376, 262189, 301061, 164022, 79220, 24731, -54818, -224335, -111146, -13199, 157003, 426232, 389538, 416364, 252595, 159657, 130533, -28253, 67, 25324, -24297, 263425, 343515, 451, -118597, 3219, -38848, 16327, 39198, -33327, -254165, -242119, -231525, -408222, -378146, -261961, -125313, -39074, 70703, 188193, 461426, 538415, 426039, 383403, 162528, 73681, 99492, 132096, 156225, 215883, 183941, 204365, 26442, -175841, -84573, -18339, -63730, -54522, 78081, -52764, -59224, -123321, 107260, 192229, 189874, 169610, 59455, -38217, 16080, -78360, -8560, 115958, 104657, 105223, 48312, 20402, 220515, 395512, 463600, 380826, 271642, 31983, -117762, -206842, -83303, -19639]
13735a9639K80118M7813j54908R447q8842N9125j19403n5042q0065K4368J06196
13724I168O5293r3451j33371j9126J22255K53069q2982p3940O562R218P0358k05433
13712g2380J78137J96002j15282n3667Q9969q0423j8832J64091K9774n1922j02839
13701A62628j25671J4163N4445m2736M7766J0562j17168O7676p0409j71811R7614
13690g2941Q7769j18403j21921j3109P7212J40558J8870k45954J1551J31337l7723
13679a42754k2842p893J04805M4565q3039L0454J03741R8612k0220k05L2280J38822
13667B76326J1068j86587l6566J35792p1667j69692l6031K6222K9914N2835L5357
13656F6971j44972M7230j62897Q968K9845K8191p8666m6491Q2043m5175J27711
$$ y = [-19639, 260479, 308292, 153384, 162831, 73989, 133114, 13711, -41331, -121396, -97028, 9168, 74461, -18990, -152361, -171487, -49232, 203837, 120855, 46915, 53477, 62695, 133053, -72380, 105757, 301759, 186477, 132810, 222779, 142356, 123524, 287615, 317389, 265467, 162628, 36957, 51120, 105565, 62829, 110595, 121157, 3989, 71665, 1256, -170555, -72941, 14828, -103575, -225496, -238605, -161393, -20835, -1965, -247919, -236368, -105031, -142754, -165596, -173489, -68684, -24119, -107158, -76704, 27037, 125649, 105429, 105224, 137504, 276326, 287394, 100807, 64241, 200033, 128366, -41326, -77357, -51135, -21221, 31614, 66971, -78001, -30771, -193668, -184700, -154855, -126664, -205330, -251821, -169778, -214953, -87242]
13645h7242J50676Q2144k05231j65227p3407P3554K15990J07280J18020j10967
13635A05590j44928j52919q987l2407K26676J81782M04J50213k7681j29225j89007
13624b0489j05011P9780m8617J4858L2276M7638n9658J77024N9358J24084q0703
13613B20540j00400j01507l6912L2876j49274k6675P5060J38420M4043j62656
13603f6485j07530j65407k1050J03013m3665O9420J04223k1012o0309m4591j14852
13592c68245N1665N1481o0646K4517J04702K14944p1345j86269o0255N6896k1204
13581b63759J14316J31487M4970k74256K0352J5128k1120J68284o097j0811O9309
13570a2197J92992k2513r6524l03J04021J34456k507n4325J2864q8796p7600N5897
$$ y = [-87242, 63434, 145578, -59653, -224880, -298287, -224733, -8743, 98537, 216557, 105590, -39338, -192257, -201244, -233651, -6975, 174807, 175211, 325424, 297743, 168518, -20489, -125500, -45720, -94337, -79479, -47203, 435, -59223, 117801, 177159, 301243, 220540, 120140, 18633, -18279, 14597, -134677, -161352, -86292, 52128, 96171, -66485, -174015, -339422, -360472, -257459, -301124, -231704, -127481, -148493, -208802, -253393, -368245, -316580, -265099, -325745, -301228, -196526, 18418, -52927, -239196, -299451, -242555, -263759, -149443, -17956, 27014, -247242, -226890, -211762, -232882, -64598, -70695, -81506, -12197, 180795, 158282, 61758, 61455, 165476, 299932, 297425, 243100, 255964, 167168, 89568, 145465]
13558A45465j05170K1679J04057J501O9126k16189j42196K35382m0169p0775j9129
13547a6418p732L5986J4625P8497J45514K11228R748j87000r3040m5789l48229
13536b02610P4R5648p281o3968Q0466Q1385K19511o5297p0053J1787j877J52260
13524B30045J41844o9520r6040j0711P3664j8282k77793n6073J9728M5995q5174
13513a02317R699N2712J32750L5202j29533p9939J79622j0078j79316M0989J01346
13502E1137N4058j752j44060p6784R3964R8549o0612J29211J98782l4741j76631
13491A31121j98026K9868N4622k1025j9407o2157r3241j7102R9708J36199J79100
13480B19660P5433j96250j26088k9054j32170Q6144l9640j32190q7124J22213
$$ y = [145465, 40295, 61974, 166031, 167532, 236658, 20469, -121727, 113655, 73486, 2711, -16418, -24150, 11836, 26461, 104958, 250472, 461700, 471448, 284448, 191408, 145619, -202610, -202536, -106888, -114169, -178137, -97671, -16286, 203225, 137928, 67875, 79662, 77785, 230045, 371889, 302369, 206329, 195618, 269282, 251000, -26793, -82866, -63138, -17143, -102317, -92618, -39906, 92844, 128046, -1487, -81426, 98196, 88118, -91198, -50209, 51137, 105195, 103443, -40617, -117401, -23437, 75112, 14500, 143711, 342493, 307752, 131121, -66905, -37037, 17585, -3440, -22847, -85004, -178245, -195347, -95639, 40560, 219660, 295093, 98843, -27245, -56299, -188469, -102325, -141965, -274155, -361279, -239066]
13470b39066J89316K9250R7137M5062k7945q5677L0759Q183j23145J01182M7616
13459G2672J50265Q2515k2003j15060j79218n2193J50R403K19202K22633K8974
13448D17340k41198l01752j15303j29527p9370L2009K65572K54257J91195q807
13438B84416k95181k19619j57868J46519J28348j36808r1881L0919J63097L9756
13428a08302j75333J249J15254R5736r7798j46288l132J83216P5161L2998j57690
13417a84929p2361k7896j2783K90944R5585j6608r454J78422P3222p7555j4508
13406B22079J055m6229r2728R0489J5497j56308j20732m5340J06407K7417j3679
13395a2072m9109j94729J50249L6584J64748L4402k0703m2156P0088l7028n5019
$$ y = [-239066, -49750, -20500, 76637, 121699, 93754, 8077, 38836, 47019, -76126, 25056, 72672, 222937, 305452, 283449, 168389, -10829, -63022, -62872, -53469, 165733, 388366, 417340, 176142, -125610, -240913, -370440, -449810, -417801, -152229, 102028, 293223, 284416, -10765, -230384, -388252, -241733, -113385, -250193, -342074, -311155, -148058, -108302, -283635, -282386, -167132, -71396, -169194, -315482, -318614, -135398, -60237, -27239, -184929, -257290, -285186, -297969, -7025, 88560, 71952, 62498, 240920, 314142, 236587, 222079, 223134, 176905, 84177, 174666, 190163, 33855, -86877, -132217, -25810, 1607, -12072, -61181, -255910, -105661, -69077, 95671, 130073, 109370, 67214, 137302, 100274, 45255]
13384D5255M6600j20469j48642m4615J67060R5689L6758M0768m4221o1804j9477
13373g098o8474Q1146K13979k1813j53834m9344P0789n0690j75434j53277J07971
13362b06079K01750R0375J7425j42044R5230J00478j44592k1566M3223k3486J71333
13351A82047K86772j8808K3769r1148q733n3088j16537j61773q0075P4585J70596
13340B07607K779o6361q8966j86279L2601K61809k3859r0477L4854J31158k8184
13329A86682k91567j06200L8147O0801j0161N1976o1842j9395J22984J55909P3977
13318B01311k2873j08539L7951P8610r6488k57666J04599r1178K109J76631R1236
13307A15703j29437j40116J09389J4290J38782m01m841P7822q8502j16459k9583
$$ y = [45255, 91855, -28614, -177256, -221871, -54811, 40878, 77636, 118404, 74183, 12379, -7098, -75572, 5574, 219553, 197740, 43906, -5438, 65351, 14661, -160773, -314050, -206079, -4329, 86046, 103471, -38573, 56657, 157135, 12543, -9023, 34200, 10714, 182047, 468819, 450011, 473780, 382632, 373899, 320811, 204274, 42501, -37574, 37011, 207607, 210386, 144025, 55059, -131220, -98619, 163190, 139331, 48854, 83708, 214866, 186682, -104885, -211085, -172938, -112137, -122298, -70322, -132164, -151559, -28575, 127334, 201311, 178438, 69899, 107850, 186460, 89972, -167694, -63095, -154273, -152164, 24467, 115703, -13734, -153850, -44461, -30171, 108611, 108210, 103369, 181191, 92689, -23770, -53353]
13296e3353J00637J71382r779J7579k6065K5924k3592L7218O2233j97349j15677
13285a0842j16392n77N2590m4289j04527p2032M4787K7329p4393K49931L3805
13274a4610o3242m2127M2202j65590K4337q942j03803J28145J55979P4618J46326
13263A73293L6004j0516j26642n1051N5134j36383q747p4601l3241k595o6483
13252b45828j17283P0266R2525j56455l7036J28980J98271J8114k7742K4738O9770
13241A8320J24273l9093j42096j12039O0381K5537K96902N8785j46702k32049
13231h7781k58147P5926J69520J81326j1288q9426J28560Q2383j12994l2192q6768
13220d0881N7392k2771j43020k8884J46690O1827L7297M0331m8430j55713n68
$$ y = [-53353, 47284, 218666, 208887, 226466, 200401, 226325, 202733, 239951, 302184, 104835, -10842, -127234, -127811, -75221, -119510, -224037, -296069, -251282, -223953, -298346, -48415, -14610, -77852, -119979, -77777, -243367, -219030, -227972, -331775, -203630, -47651, 26967, 173293, 209297, 198781, 72139, 21088, 76222, -60161, -68908, -143509, -176750, -179345, -245828, -363111, -292845, -200320, -356775, -393811, -264831, -66560, -48446, -76188, -51450, 18320, 142593, 103500, -38596, -150635, -90254, -64717, 232185, 290970, 144268, -87781, -345928, -270002, -100482, 80844, 69556, -19870, 108690, 191073, 78079, 45887, -40881, 16511, -6260, -149280, -178164, -31474, 30353, 67650, 107981, 59551, -96162, -96730]
13209i6730J0961R60r9213K3952J10450j17624k32489k6690k2176j1992J465K89321
13197a69805K8821l3742R8827K3976R8724J91828n9876j12815l5375J7275L3086
13186H0924k5618J24384m429K884j35172N9679K84581j35180j99975j13713q4788
13175a46423K39117L7779r8838o2349J80393k0176r0636J28023J04419q5487k31671
13164d5849j12433j07780O3901K9543J47619P9241J00562j40513k28685K8575
13154a85819J93280J10561Q3369p1612m3382R7859n9340k41j42681J6065k619
13143d560j14494l8041J21987J29477k7509j86160p9728J89419L7301N5217n1716
13132C1193J8823l2807J05178L3423j8709l7131q8221J52079R7733r4521j23928
$$ y = [-96730, -85769, -84809, -184022, -160070, -49620, -167244, -399733, -426423, -448599, -460591, -459126, -169805, -140984, -174726, -75899, -51923, 46801, 238629, 178753, 65938, 30563, 47838, 80924, 55306, 179690, 175261, 178145, 42973, 102652, 387233, 252053, 52078, -61635, -146423, 92694, 130473, 31635, -30714, 149679, 129503, 38867, 166890, 271309, 185822, -45849, -158282, -266062, -202161, -172618, -24999, 54242, 154804, 14291, -214394, -185819, 7461, 118022, 201391, 129779, 86397, 184256, 124916, 124675, -18006, -1941, -4560, -119054, -157095, -35108, 94369, 66860, -119300, -199028, -9609, 27692, 82909, 31193, 50016, 17209, 122387, 155810, 137101, 99970, 11749, 163828, 261561, 167040, 43112]
13121D3112K3203j45344j6532n9625J77193j0587j9823K66577J32748r7421k22851
13110G0650j53383l1986O0203Q2206M7472o9732O1759n3738N1159p6358k6460
13099c8208J4702l8148r8280o4691n0253j01574J4172J28444R0189P4330O8021
13088a296j40457j50000m958j15532O1016R5654N3995M6543N4858J57038k3848
13077C3013j75574Q6937P2670J17370o6692k29266J12573M3084j53225j63872
13067c22982J32926K82009J14234L6695K3381m5114j74066l27338K9362J25934
13057a24959Q7980n2791p3655j01724M2297M7671J07104M6080j7077J36362P6733
13046A74021j58532j16974j8287j617r5592L9637P1695j4723n3296n6268K8823
$$ y = [43112, 66315, -79029, -95561, -155186, 22007, 11420, -8403, 258174, 390922, 293501, 70650, -82733, -114719, -54516, 27690, 75162, 5430, 67189, 13451, 64610, -11748, -38208, -23506, -61654, -159934, -224625, -274878, -376452, -362280, -233836, -143647, -69317, -1296, -141753, -291753, -296711, -412243, -351227, -255573, -201578, -155035, -100177, 56861, 33013, -142561, -55624, 17046, 134416, 67724, -161542, -48969, -5885, -159110, -322982, -190056, 91953, 206187, 242882, 266263, 221149, 47083, -280255, -250893, -124959, -36979, -89770, -163425, -265149, -222852, -175181, -68077, -21997, -39074, 97288, 174021, 15489, -101485, -119772, -121389, -216981, -177344, -105649, -120372, -173668, -229936, -201113]
13035b01113N0641n6023j66753j8926J41211P9670j33310k560O2361j04694k7542
13024c77038J88215M5822Q0691J70333j92154j92368n894O5402J07797m1396J62173
13013A1583J69113l5083k31334q7995J25917J54115M4074p2044m4802m5965j2991
13002b5412J27788Q0707J17496j38538j42085K5668O1852M8951O151j02325k96537
12991b36284n0354J49436J30834J20586K5606j79660J48113k3366M7175K05737
12981C37823p4476l8263j0759j64020m63r8966J0415m831O9961L4019L6165L5147
12969A31752l5794n2456O0969l8103l3204q0459j52223k6824J25680J51112J9583
12958G0033J12320Q890k2524k06666j33732j65277J0017l3284J11153J69739J35579
$$ y = [-201113, -150472, -206495, -373248, -392174, -250963, -171293, -304603, -307163, -244802, -349496, -377038, -188823, -143001, -62310, 108023, -84131, -276499, -282393, -216991, -109194, -150590, 11583, 180696, 145613, -85721, -173716, -47799, 106316, 150390, 78346, 33544, -12421, -25412, 102376, 183083, 300579, 162041, 19956, 45624, 107476, 156427, 162578, 60253, -236284, -286638, -137202, -6368, 114218, 139824, -39836, 108277, 84911, 132086, 337823, 263347, 225084, 214325, 50305, 49842, -49124, -38709, -43540, 26421, 60440, 96605, 131752, 95958, 43502, 104471, 66368, 33164, -47295, -199518, -226342, -100662, 50450, 70033, 182353, 191243, 168719, -37947, -171679, -336956, -326939, -360223, -249070, -79331, 56248]
12947E6248n7569M2712J04446M7146n7193l0635j12143K5119j52341Q0919J47942
12936I4651p9962j29570O9974J81917o0737N6649J21678l8786j38057j44028N6230
12925a0041n3513P9611J30386l224r5025J4735O094M2890N6687R5468L8581J09449
12913D12098p4355k28150k21716k28229n6761J08509K04799J44896J31928l598
12903A89421j95497p7504Q1733M5996l2720j8866m9910m113J83278l9579n5235
12892B7004L7468J716P4510J69309N9801j8017p972j54434R808j32030j31143
12881f3980J6975q2990r1962l1729J05111J00580j4007m996L8290n4381m607J28894
12869D1198l932j86738J6725M5598O2697p0914L3686K9899J2704J7427R9691J8693
$$ y = [56248, -1321, 41391, 145837, 192983, 135790, 105155, -6988, 18131, -134210, -53291, 94651, 14689, -114881, -44907, 137010, 76273, 132922, 254600, 215814, 77757, -66271, -10041, -63554, 16057, 146443, 143219, 48194, 62929, 69023, 111913, 168600, 264068, 302649, 412098, 337743, 109593, -112123, -340352, -397113, -288604, -83805, 61091, 193019, 189421, -6076, -83580, -1847, 44149, 11429, -7437, -57347, -61460, 121818, 82239, 27004, 64472, 66188, 140698, 310007, 369808, 351791, 343819, 189385, 199193, 67163, -63980, -47005, -129995, -221957, -253686, -148575, -47995, -62002, -66998, -28708, -83089, -87696, 41198, 37266, -149472, -132747, -87149, -24452, -95366, -61680, -31781, -19077, -1650, 98041, 116734]
12857A16734q2426o271J5904j6638r1138m4307K0421K6537K6795M9769r1155J3349
12845f2426k7072M2223J64248n2097K1623o898p9551j20391N9167M5793k8694
$$ y = [116734, 34308, 28037, 43941, 27303, -63835, -108142, -87721, -61184, -34389, 15380, -75775, -62426, -89498, -47275, 116973, 64876, 86499, 79601, 50, -120341, -61174, -15381, -44075]
$$ [...]
##END NTUPLES=NMR SPECTRUM
##END=
