##TITLE=Analysis number 307822
Compound Code cc 10209
Book Reference 302/152/2
Project Code adrs
Chemist Name toml
##JCAMPDX= 6.0         $$ Bruker NMR JCAMP-DX V2.0
##DATA TYPE= NMR SPECTRUM
##DATA CLASS= NTUPLES
##ORIGIN= Bruker BioSpin GmbH
##OWNER= NMR
$$ XWIN-NMR		Version 3.5
$$ Fri May 13 16:03:46 2005 GMT Daylight Time (UT+1h)  MAYBRIDGE\NMR@NMR_250MHZ
##.OBSERVE FREQUENCY= 250.131544655141
##.OBSERVE NUCLEUS= ^1H
##.ACQUISITION MODE= SIMULTANEOUS (DQD)
##.ACQUISITION SCHEME= undefined
##.AVERAGES= 16
##.DIGITISER RES= 18
##SPECTROMETER/DATA SYSTEM= dpx250
##.PULSE SEQUENCE= zg30
##.SOLVENT NAME= CDCl3
##.SHIFT REFERENCE= (INTERNAL, CDCl3, 0, 16.522)
##AUDIT TRAIL= $$ (NUMBER, WHEN, WHO, WHERE, WHAT)
$$ ##TITLE= Audit trail, XWIN-NMR		Version 3.5
$$ ##JCAMPDX= 5.01
$$ ##ORIGIN= Bruker BioSpin GmbH
$$ ##OWNER= NMR
$$ C:\u/data/dgb/nmr/ADRS/2990/pdata/1/auditp.txt
$$ ##AUDIT TRAIL=  $$ (NUMBER, WHEN, WHO, WHERE, WHAT)
(   1,<2005-05-13 16:03:28.98 +100>,<MAYBRIDGE\NMR>,<NMR_250MHZ>,
      <created by zg, POWCHK disabled, PULCHK disabled
       configuration hash MD5:
       62 19 C7 07 E1 42 D1 B7 37 6C 3D D0 77 39 F9 E6
       data hash MD5: 64K
       33 7E B0 D6 1D FE 25 F7 B5 C4 55 FB 41 57 82 18>)
(   2,<2005-05-13 16:03:39.46 +100>,<MAYBRIDGE\NMR>,<NMR_250MHZ>,
      <Start of raw data processing
       ef LB = 0.3 FT_mod = 6 PKNL = 1 SI = 32K 
       data hash MD5: 32K
       FD E8 1F 78 38 8A F2 DE D2 5A 64 18 46 2B EA 27>)
(   3,<2005-05-13 16:03:41.13 +100>,<MAYBRIDGE\NMR>,<NMR_250MHZ>,
      <apk 
       data hash MD5: 32K
       27 62 E7 46 82 12 A2 C0 5F B1 E6 DF 63 27 CB 62>)
(   4,<2005-05-13 16:03:41.84 +100>,<MAYBRIDGE\NMR>,<NMR_250MHZ>,
      <abs ABSG = 5 
       data hash MD5: 32K
       75 53 A0 4C 89 37 56 04 60 06 C9 C5 4C E7 DF FB>)
$$ ##END=
$$ 
$$ hash MD5
$$ C4 59 8C 22 F0 9C 19 D0 11 E1 9E 7B 95 CB 48 22
##$RELAX= 
##$RELAX= 
##$RELAX= 
##$RELAX= 
##$RELAX= 
##$RELAX= 
##$RELAX= 
$$ Bruker specific parameters
$$ --------------------------
##$DU= <C:\u>
##$EXPNO= 2990
##$NAME= <ADRS>
##$PROCNO= 1
##$TYPE= <nmr>
##$USER= <dgb>
##$AMP= (0..31)
100 100 100 100 100 100 100 100 100 100 100 100 100 100 100 100 100 100 
100 100 100 100 100 100 100 100 100 100 100 100 100 100 
##$AQSEQ= 0
##$AQ_mod= 3
##$AUNM= <au_zg>
##$AUTOPOS= <52 >
##$BF1= 250.13
##$BF2= 250.13
##$BF3= 250.13
##$BF4= 250.13
##$BF5= 500.13
##$BF6= 500.13
##$BF7= 500.13
##$BF8= 500.13
##$BYTORDA= 1
##$CFDGTYP= 0
##$CFRGTYP= 5
##$CHEMSTR= <none>
##$CNST= (0..31)
1 1 145 1 1 1 1 1 1 1 1 1 1 1 1 1 1 1 1 1 1 1 1 1 1 1 1 1 1 1 1 1 
##$CPDPRG= <>
##$CPDPRG1= <>
##$CPDPRG2= <>
##$CPDPRG3= <>
##$CPDPRG4= <mlev>
##$CPDPRG5= <mlev>
##$CPDPRG6= <mlev>
##$CPDPRG7= <mlev>
##$CPDPRG8= <mlev>
##$CPDPRGB= <>
##$CPDPRGT= <>
##$D= (0..31)
0 1 0 0 0 0 0 0 0 0.06 0 0 0 0 0 0 0.0002 0 0 0 0 0 0 0 0 0 0 0 0 0 0 
0 
##$DATE= 1115996608
##$DBL= (0..7)
120 120 120 120 120 120 120 120 
##$DBP= (0..7)
150 150 150 150 150 150 150 150 
##$DBP07= 0
##$DBPNAM0= <>
##$DBPNAM1= <>
$$ [...]
##$SUBNAM7= <"">
##$SUBNAM8= <"">
##$SUBNAM9= <"">
##$SW= 20.6930455092707
##$SWIBOX= (0..15)
0 0 3 0 0 0 0 0 0 0 0 0 0 0 0 0 
##$SW_h= 5175.983436853
##$TD= 65536
##$TD0= 1
##$TE= 296.16
##$TE2= 300
##$TE3= 300
##$TEG= 300
##$TL= (0..7)
0 120 120 120 120 120 120 120 
##$TP= (0..7)
150 150 150 150 150 150 150 150 
##$TP07= 0
##$TPNAME0= <>
##$TPNAME1= <>
##$TPNAME2= <>
##$TPNAME3= <>
##$TPNAME4= <>
##$TPNAME5= <>
##$TPNAME6= <>
##$TPNAME7= <>
##$TPOAL= (0..7)
0.5 0.5 0.5 0.5 0.5 0.5 0.5 0.5 
##$TPOFFS= (0..7)
0 0 0 0 0 0 0 0 
##$TUNHIN= 0
##$TUNHOUT= 0
##$TUNXOUT= 0
##$USERA1= <user>
##$USERA2= <user>
##$USERA3= <user>
##$USERA4= <user>
##$USERA5= <user>
##$V9= 5
##$VALIST= <valist>
##$VCLIST= <CCCCCCCCCCCCCCC>
##$VD= 0
##$VDLIST= <DDDDDDDDDDDDDDD>
##$VPLIST= <PPPPPPPPPPPPPPP>
##$VTLIST= <TTTTTTTTTTTTTTT>
##$WBST= 1024
##$WBSW= 4
##$XGAIN= (0..3)
0 0 0 0 
##$XL= 0
##$YL= 0
##$YMAX_a= 412823
##$YMIN_a= -357589
##$ZGOPTNS= <>
##$ZL1= 120
##$ZL2= 120
##$ZL3= 120
##$ZL4= 120
##$ABSF1= 16.522
##$ABSF2= -4.171173
##$ABSG= 5
##$ABSL= 3
##$ALPHA= 0
##$AQORDER= 0
##$ASSFAC= 0
##$ASSFACI= 0
##$ASSFACX= 0
##$ASSWID= 0
##$AUNMP= <proc_1d>
##$AZFE= 0.1
##$AZFW= 0.1
##$BCFW= 0
##$BC_mod= 0
##$BYTORDP= 0
##$COROFFS= 0
##$CY= 12.5
##$DATMOD= 1
##$DC= 0
##$DFILT= <>
##$DTYPP= 0
##$F1P= 14.0000005364418
##$F2P= -0.99999901652339
##$FCOR= 0.5
##$FTSIZE= 32768
##$FT_mod= 6
##$GAMMA= 0
##$GB= 0
##$INTBC= 1
##$INTSCL= 1
##$ISEN= 128
##$LB= 0.3
##$LEV0= 0
##$LPBIN= 0
##$MAXI= 10000
##$MC2= 0
##$MEAN= 0
##$ME_mod= 0
##$MI= 0
##$NCOEF= 0
##$NC_proc= -4
##$NLEV= 6
##$NOISF1= 0
##$NOISF2= 0
##$NSP= 0
##$NTH_PI= 0
##$NZP= 0
##$OFFSET= 16.522
##$PC= 1
##$PHC0= -74.0699
##$PHC1= 14.05805
##$PH_mod= 1
##$PKNL= yes
##$PPARMOD= 0
##$PSCAL= 4
##$PSIGN= 0
##$REVERSE= no
##$SF= 250.13
##$SI= 32768
##$SIGF1= 0
##$SIGF2= 0
##$SINO= 400
##$SIOLD= 32768
##$SREGLST= <1H.CDCl3>
##$SSB= 0
##$STSI= 32768
##$STSR= 0
##$SW_p= 5175.98343685301
##$SYMM= 0
##$S_DEV= 0
##$TDeff= 65536
##$TDoff= 0
##$TI= <Analysis number 999999
Compound Code 99
Book Reference 9
Project Code 9>
##$TILT= no
##$TM1= 0
##$TM2= 0
##$TOPLEV= 0
##$USERP1= <user>
##$USERP2= <user>
##$USERP3= <user>
##$USERP4= <user>
##$USERP5= <user>
##$WDW= 1
##$XDIM= 32768
##$YMAX_p= 289292949
##$YMIN_p= -354597
$$ End of Bruker specific parameters
$$ ---------------------------------
##NTUPLES= NMR SPECTRUM
##VAR_NAME=  FREQUENCY,     SPECTRUM/REAL,   SPECTRUM/IMAG
##SYMBOL=    X,             R,               I
##VAR_TYPE=  INDEPENDENT,   DEPENDENT,       DEPENDENT
##VAR_FORM=  AFFN,          ASDF,            ASDF
##VAR_DIM=   32768,         32768,           32768
##UNITS=     HZ,            ARBITRARY UNITS, ARBITRARY UNITS
##FACTOR=    0.157963299565203, 1,           1
##FIRST=     4132.6476996994, 0,             0
##LAST=      -1043.33573715361, 0,           0
##MIN=       -1043.33573715361, -354597,     0
##MAX=       4132.6476996994, 289292949,     0
$$ Real data points
##PAGE= N=1
##DATA TABLE= (X++(R..R)), XYDATA
$$ [...]
19487D50272j23843o6019n8949l9247Q0845L293r803n984N2118L6467L4382q9207
19475B64325K0612J66j1162O1895L602l2506J8160J17007j1627o3377m2219q3607
19463B41269N3334K066Q540K7981j7965l5016o5737p4418N227K9984N243R5320
19451B75828j4446M36M0518Q7759J0903r5356p2808N0952K6098k1145o368J2315
19439B94686K1305n9856q5419L70L7026N6260l5444J2463P8605J9350J9883l4138
19427C25091l0689K5186Q8776Q3747p2413k6033l2891j1082L9954J9127J3575
19416D22348N2961l1318n7450K5919j9436j748J35016J24386J00138J7089J08229
19405H76134L9043L3390j6255L2346m2591K8296k3125j7578q7774q3523r0210
$$ y = [450272, 326429, 260410, 201461, 162214, 243059, 246352, 236549, 230565, 282683, 319150, 353532, 264325, 284937, 285103, 273941, 335836, 339438, 306932, 325092, 442099, 430472, 367095, 324876, 241269, 294603, 296669, 305209, 333190, 315225, 280209, 214472, 140054, 145281, 175265, 180508, 275828, 261382, 261818, 302336, 390095, 400998, 305642, 232834, 283786, 309884, 288739, 282371, 294686, 315991, 256135, 170716, 171086, 208112, 264372, 228928, 241391, 319996, 339346, 359229, 325091, 294402, 319588, 408364, 492111, 419698, 393665, 360774, 349692, 389646, 408773, 422348, 475309, 443991, 386541, 412460, 393024, 391276, 526292, 650678, 750816, 767905, 876134, 915177, 948567, 932312, 964658, 922067, 950363, 927238, 909660, 821886, 738363, 648153]
19394F48153o3063j229o1729M5069O5440r639R98O8940q632k9038o7869j40072
19382D47329O329K2537P0155R915N5386p6025M2969N7629J4374J03070N7271R4959
19370I05898M8756j09335n0752r2459K8599Q399n7351k5975M980K6687N3191J18678
19358H59316K6166j14275o1618m108N3563N1296P9517L8246L0550m3254j10226
19347H05173m2336L0019R476l6489q4651o847m0488j16006m0570P7273J3887K2976
19335E91417n4836N5559K6504m4581p7245n751K7060k1632j18892p982J23582
19324D93203P9517K6206J2310k2743Q799m8702K8605j1158o4785K6948Q3443j6283
19312E95360j5725j4721k0059N5150j4598N8312L5708j304K4836L4119p665l1821
$$ y = [648153, 585090, 583861, 522132, 567201, 632641, 623002, 624000, 692940, 684308, 655270, 587401, 447329, 453658, 476195, 546350, 556265, 611651, 535626, 578595, 636224, 650598, 753668, 810939, 905898, 954654, 845319, 794567, 702108, 730707, 739106, 681755, 655780, 660760, 687447, 740638, 859316, 885482, 771207, 709589, 705481, 759044, 810340, 889857, 928103, 958653, 915399, 805173, 762837, 792856, 802332, 765843, 681192, 674345, 633857, 517851, 477281, 554554, 568441, 591417, 536581, 592140, 618644, 574063, 496818, 491067, 518127, 496495, 377603, 369621, 493203, 572720, 598926, 611236, 588493, 597292, 548590, 577195, 566037, 501252, 528200, 611643, 595360, 579635, 564914, 544855, 600005, 585407, 643719, 679427, 678123, 702959, 737078, 729413, 697592]
19300F97592K6315L4857N4784j405M0138L1240J18317J04421j8868Q079m5767
19289A049703r9802k6460O210O7250M5610N8280l2302j4482j0286K4398j2131
19278A055988n7576p3770j07719o1932j1250l2752j0869K9330j2577O966k3380
19267G00459n5030j05265j2111M7167L7589J702j7696r665K0022Q0661J27652
19256H15485J10744J5535K5193m0895J9070L0508r8019Q142R927j12625o8552
19245G14513L5583K9706Q6225K8336K2284P1805M3574P7551N4789m0476m1586
19234A082304K279R6866R1195n4743Q5256j4882q3690j21680P0842N7266r2054
19223A118959l5623L3816n3081n949M2230K7880j8649k7922j6226J6261j1968
$$ y = [697592, 723907, 758764, 813548, 812143, 852281, 883521, 1001838, 1106259, 1087391, 1095470, 1049703, 949901, 923441, 929651, 996901, 1042511, 1100791, 1068489, 1054007, 1043721, 1068119, 1055988, 998412, 924642, 816923, 754991, 743741, 710989, 700120, 729450, 716873, 723839, 700459, 645429, 540164, 528053, 575220, 612809, 614511, 596815, 587150, 607172, 687833, 815485, 926229, 941764, 966957, 926062, 945132, 975640, 877621, 885763, 895690, 783065, 714513, 750096, 779802, 866027, 894363, 916647, 988452, 1032026, 1109577, 1164366, 1123890, 1082304, 1084583, 1181449, 1272644, 1217901, 1303157, 1288275, 1204585, 1082905, 1153747, 1211013, 1118959, 1083336, 1117152, 1064071, 1058122, 1100352, 1128232, 1109583, 1081661, 1065435, 1081696, 1069728]
19212A069728o5790R504N6138k208l3021m4471J04074n715o7683Q279l0208K4803
19200A023430K1281J4353N4545L59M1527O4591J3095L8917o105N2133L0843j0498
19188A338471r620j9447m5875n2163K0741P1113R233k0060j9670P649R5231J43239
19176A518842J6455J9244P0716J23766M8490n3019P8029K17640Q5785l7084J707
19165B090571N7637P1362k4729q535R1063M3810k7140J23858R4936N9828J32793
19154B705454J83674K10632K42673J76317N0545k133n1894J41783K59718K81779
19144D198548M10064M36230M50657N31183L86305K98140J66225J95357P6898P9364
19134G228971L55598M81836N36686P34444R94711J086735J307977J575490K001359
$$ y = [1069728, 1003938, 1013442, 1069580, 1067372, 1034351, 989880, 1093954, 1088239, 1020556, 1028835, 998627, 1023430, 1044711, 1059064, 1113609, 1113968, 1155495, 1220086, 1233181, 1272098, 1265993, 1318126, 1348969, 1338471, 1328851, 1309404, 1263529, 1211366, 1232107, 1303220, 1312453, 1292393, 1272723, 1280372, 1375603, 1518842, 1535297, 1554541, 1625257, 1749023, 1797513, 1744494, 1822523, 2040163, 2125948, 2088864, 2090571, 2148208, 2219570, 2194841, 2186306, 2277369, 2321179, 2294039, 2417897, 2512833, 2572661, 2705454, 2889128, 3099760, 3342433, 3518750, 3569295, 3567162, 3515268, 3657051, 3916769, 4198548, 4608612, 5044842, 5495499, 6026682, 6412987, 6711127, 6877352, 7072709, 7149607, 7228971, 7584569, 8066405, 8603091, 9337535, 10332246, 11418981, 12726958, 14302448, 16303807]
19125A6303807K516493L028540L899963N307324P405748J0656732J5602613K2261136
19117H6982356L0032109L6207633L7979046L3877962K3423274N674674j6385717
19110B37791337l1322991l6572407l7800954l4205257k6304769j8481501j2662792
19103D0440666q738588o237732m468655l307868k622296k160882j873948j470265
19095I560432j246121j079019p95208n47606m13689k92472j60268j42236j46029
19086D737784l48424m46688m06276l16513l42798k45006k29113j52056n3000j50583
19076B047327r8623j04048Q664J18980N5052m1263j1880p1218j60710p6114r9383
19065A566784p3938q2181l0990j09098j56466j68701j36629l3096M2972k3100
$$ y = [16303807, 18820300, 21848840, 25748803, 31056127, 38461875, 49118607, 64721220, 86982356, 117014465, 153222098, 191201144, 225079106, 248502380, 254177054, 237791337, 206468346, 169895939, 132094985, 97889728, 71584959, 53103458, 40440666, 31702078, 25464346, 20995691, 17687823, 15065527, 12904645, 11030697, 9560432, 8314311, 7235292, 6440084, 5892478, 5478789, 5186317, 5026049, 4883813, 4737784, 4389360, 3942672, 3536396, 3219883, 2877085, 2632079, 2402966, 2250910, 2197910, 2047327, 1948704, 1844656, 1853320, 1972300, 2027352, 1986089, 1974209, 1902991, 1742281, 1666167, 1566784, 1492846, 1410665, 1379675, 1270577, 1114111, 945410, 808781, 775685, 818657, 795557]
19055G95557K2401O1193J8051k021n2323k6261o1203p0071P0475J50650R774k1201
19043H95021n508q5665q3607j0753N9515L1865P3150P1139Q4469J64322J75940
19032A369888K20661K97174L95509K68568j17766l80630k99950j77818j15940
19023A459696j10753q2552m0791L0648J16846K55310L27949L62506J95369j42457
19013B371771l59005m00500k75557q3204j20645r4416o6329l2510j8132k9541
19003H91932q4599k878k1326n6646J8616R9720J30924J32848p2036j07056m5598
18992H83901k664j3285R5618K1207n6463J7608P0864J03407K0796j22725K2790
18981A041054N6211O2036K7801r9220j07961R372j3528p9896j78640j19197l0723
$$ y = [795557, 817958, 879151, 897202, 895181, 842858, 816597, 755394, 685323, 755798, 906448, 916222, 895021, 889513, 803848, 720241, 709488, 769003, 800868, 874018, 945157, 1029626, 1193948, 1369888, 1590549, 1887723, 2283232, 2551800, 2434034, 2053404, 1753454, 1575636, 1459696, 1348943, 1266391, 1225600, 1256248, 1373094, 1628404, 1956353, 2318859, 2514228, 2371771, 2012766, 1612266, 1336709, 1253505, 1132860, 1038444, 972115, 939605, 921473, 891932, 807333, 804455, 783129, 726483, 745099, 844819, 975743, 1108591, 1036555, 929499, 883901, 881237, 867952, 963570, 984777, 928314, 945922, 1016786, 1120193, 1140989, 1018264, 1041054, 1097265, 1159301, 1187102, 1087882, 979921, 989293, 975765, 895869, 717229, 598032, 567309]
18970E67309O8759M9845R1185N972m1052M078N587J42385J10655L7411M3172K8708
18958A114014j6449n6305j2451N1944R2707J27175J42578Q5199m1353o6015m9766
18947A371278j50799j25611j13119K6358J05555j1754N7328R1186l3076q1576
18937A135770j56599j09998m192L2798n5557q7026n0356J2036P3175L954q8365
18926G05640m6449n6477j7120N562J9779l8549p5836P9605Q2108J6948K5652J26904
18914H27767N3982K7813p3617n8636o8405j673J67021J65252J67058J26269k0938
18903A311893p4985m6260o5752Q3499K0891K5886K9896P3074K1269m2585p2377
18892A264449r2020p8464j02494o0239K7468k8806L1406M8767O0122J26536L5186
$$ y = [567309, 636068, 685913, 777098, 783070, 742018, 746096, 751683, 894068, 1004723, 1042134, 1085306, 1114014, 1097565, 1041260, 1028809, 1080753, 1173460, 1300635, 1443213, 1528412, 1487059, 1421044, 1371278, 1220479, 1094868, 981749, 1008107, 1113662, 1101908, 1159236, 1250422, 1217346, 1135770, 979171, 869173, 864981, 897779, 842222, 755196, 704840, 716876, 790051, 794005, 705640, 659191, 602714, 585594, 591156, 610935, 572386, 496550, 576155, 658263, 675211, 700863, 827767, 881749, 909562, 835945, 777309, 708904, 707231, 874252, 1039504, 1206562, 1332831, 1311893, 1236908, 1190648, 1124896, 1208395, 1229286, 1255172, 1285068, 1358142, 1379411, 1336826, 1264449, 1172429, 1093965, 991471, 931232, 958700, 929894, 961300, 1010067, 1070189, 1196725, 1231911]
18881A231911o4452q7090o4441o380L4947k8528j3359R683J09245M1916K8605
18870A192057k1312p512n2499o0108m1511R6932L8026j2748n7356m039J18456
18859A188386N5452M2896m3473N1433J16084J08120k2281j9318O6375P0637L7239
18848A651550N02j9127p046O0266N0624O2591N7111K9010O5574J15136L5382j3212
18836B088361J50963R8666P2757n1680k2128J12298P0503R8331J72165J12024
18826B902260L934O957M4477J32012R4853J23723J45948L60491L51940K82215
18816D448810L01906K72060K21660K29811L25749M71744N77972N81042N69703
18807H000457N56747O62797Q32610J027208J298900J903966K810589M039611N803208
$$ y = [1231911, 1167459, 1080369, 1015928, 1009548, 1044495, 1015967, 1002608, 1012291, 1121536, 1163452, 1192057, 1170745, 1163233, 1110734, 1050626, 1009115, 1106047, 1144073, 1131325, 1073969, 1069930, 1188386, 1243838, 1286734, 1243261, 1294694, 1410778, 1518898, 1496617, 1477299, 1543674, 1614311, 1651550, 1652052, 1632925, 1625879, 1686145, 1736769, 1799360, 1856471, 1885481, 1951055, 2066191, 2101573, 2088361, 2239324, 2337990, 2410747, 2359067, 2336939, 2449237, 2519740, 2618071, 2790236, 2902260, 2906194, 2913151, 2957628, 3089640, 3184493, 3308216, 3454164, 3814655, 4166595, 4448810, 4750716, 5022776, 5244436, 5474247, 5799996, 6271740, 6849712, 7430754, 8000457, 8557204, 9220001, 10052611, 11079819, 12378719, 14282685, 17093274, 21132885, 26936093]
18798B6936093P883809J0136596J2349244J3936821J4135329J1455103N092137
18791A01925132n001117j3001330j2338452n988025J548468R256519J6696725
18784I3097920K1025483J8559469P972658o990017j7646918j9631047j6187291
18777H0200257j2794300j1466215j0021467p009624l553466k63402K347608L466134
18769D0905525K023150j597597n162603o003494m902269l616318k404487j464207
18761A7777700q00982k79258K29239O50410J089948J750374K739697M210413O486567
18752C3854108R567427J2918551J4046148J0148092K430944k757017j492747K049614
18744H0765120L927470M952724R485737J8569412K5470783K1162420M759742j1870095
$$ y = [26936093, 34819902, 44956498, 57305742, 71242563, 85377892, 96832995, 101925132, 96924015, 83922685, 71584233, 65596208, 67144676, 76401195, 93097920, 114123403, 132682872, 140655530, 133665513, 116018595, 96387548, 80200257, 67405957, 55939742, 45918275, 38908651, 35355185, 35091783, 37439391, 40905525, 42928675, 41331078, 36168475, 30164981, 25262712, 21646394, 19241907, 17777700, 16976718, 16697460, 16926699, 17577109, 18667057, 20417431, 23157128, 27367541, 33854108, 43421535, 56340086, 70386234, 80534326, 82965270, 80208253, 78715506, 80765120, 84692590, 89645314, 99131051, 117700463, 143171246, 164333666, 169093408, 157223313]
18736A57223313j4819971j0322855n325099R85820P432104Q018674j393747j6879393
18728A24918846k7236684k6056238j9129517j3007402q807217o013808m076471
18721B0591509k419955j020250J79199J174192J540982P84541j217477l018451
18713A6594290l407121k806718j924929j374740r74341o76935m95811m73559m45563
18704D014573l02174l30609l93053l16360j92993j45315r3094o0946l4023j57125
18694A988881j34383j08162n7235q2147p2177j17041j19282p6686K4242n3683
18684A192327k1921n9678j44097o7174j4234l5786J1738k914n5993l8245j8443
18673G45580j469p6423o6487P0803P5066n5059p11L7959L3872Q9789n084Q434
$$ y = [157223313, 142403342, 132080487, 126755388, 127741208, 135173312, 143191986, 141798239, 124918846, 97682162, 71625924, 52496407, 39489005, 30681788, 24667980, 20591509, 18171554, 17151304, 17330503, 18504695, 20045677, 20830218, 19612741, 16594290, 13187169, 10380451, 8455522, 7080782, 6106441, 5429506, 4933695, 4460136, 4014573, 3712399, 3381790, 2988737, 2672377, 2479384, 2334069, 2240975, 2180029, 2146006, 1988881, 1854498, 1746336, 1689101, 1606954, 1534777, 1417736, 1298454, 1221768, 1246010, 1192327, 1170406, 1110728, 966631, 899457, 885223, 849437, 861175, 858261, 802268, 764023, 745580, 744111, 667688, 601201, 672004, 747070, 692011, 691300, 729259, 763131, 852920, 847836, 856270]
18661H56270M2683K7426l0708M6987M5543J5120L538k5602j1758L6649r559k6956
18649I69633j5625J16154Q0732m2638p3117j09754j00084M2346M6046L1960L7897
18638I83550n798K3649o1765p7947m7665J214n4723o3608p1514j5190m2426p1495
18626D96282k2898m3307M2381Q9258P8421J21966N9231j4868p1627o3681L876
18615F75034m992O1249P3760J9558l241n048k2169P2884Q7151N3599j4544L6355
18603A029596O7907J7847N9592k7741p0881k9042L2721N1987p6123n0095j17679
18592H88089j35600j2753m1170J791K0065k0322m316n1845j8341J03448P9448
18581H08494J25290o144p5611j5052M6506j7950j12835p4779k4733P1735K7047
$$ y = [856270, 898953, 926379, 895671, 942658, 988201, 1003321, 1006859, 981257, 969499, 1006148, 996589, 969633, 954008, 1070162, 1150894, 1108256, 1035139, 925385, 825301, 867647, 913693, 945653, 983550, 977752, 1001401, 939636, 861689, 814024, 815238, 760515, 696907, 625393, 610203, 567777, 496282, 473384, 430077, 472458, 561716, 640137, 762103, 821334, 806466, 734839, 671158, 675034, 670042, 731291, 805051, 824609, 821368, 816320, 794151, 867035, 954186, 1007785, 993241, 1029596, 1097503, 1115350, 1174942, 1147201, 1076320, 1047278, 1079999, 1131986, 1055863, 1005768, 888089, 752489, 739736, 698566, 700357, 720422, 700100, 695784, 643939, 625598, 729046, 808494, 933784, 927640, 852029, 836977, 883483, 865533, 752698, 677919, 653186, 724921, 751968]
18570G51968j2312M201O7124J9918M2695J20923O1097J1956m4697q2417J20903
18559A061359R2183L5896l3438Q060M0541L8624p574k1459n337l4035M8715Q3704
18547A307239J19877O7625l9433l3472k5886K2517N9370J4442K4332j3317M0734
18536A544028R8354N4604J0417N7836L5301l6119O8275J36881J91228J20799J4136
18525B295740M3896J07895K15973K00560N1399l1312J17030J53124L20224L34787
18515C809316L68732L46936L55653J95104K35851K78915M74624O82734R38391
18506G686256J438767K114553K924959M379474O220280P847363Q250860O125756
18498D6988268J701309l760547o925926n253288j963424J626906N736635R797216
$$ y = [751968, 739656, 743857, 810981, 830899, 873594, 994517, 1055614, 1067570, 1022873, 940456, 1061359, 1153542, 1189438, 1156000, 1164060, 1204601, 1243225, 1235651, 1214192, 1208855, 1174820, 1223535, 1307239, 1427116, 1494741, 1455308, 1421836, 1395950, 1418467, 1477837, 1492279, 1516611, 1503294, 1544028, 1642382, 1696986, 1707403, 1765239, 1800540, 1764421, 1832696, 1969577, 2160805, 2281604, 2295740, 2339636, 2447531, 2663504, 2864064, 2915463, 2884151, 3001181, 3154305, 3474529, 3809316, 4178048, 4524984, 4880637, 5075741, 5311592, 5590507, 6065131, 6747865, 7686256, 9125023, 11239576, 14164535, 18544009, 24764289, 32611652, 40862512, 46988268, 48689577, 44929030, 38003104, 32749816, 30786392, 32413298, 38149933, 47947149]
18490D7947149J1757109J0012560L701630l650440r826415j3052171j0999937
18483C5889485p376894m366531k101449m674J951801L450806L225731Q78930k731103
18474B8816102m808566m393762l122703j971140j161942n40630j51579J05339
18466A2771119L36320N62213J134393J738632K603812L824101M939177N040614
18458C2950381L750419J862423J392061J893147K586917M732005R264083J5368720
18450G3800156K0394741K0483028J4109003P477106R976982J7661675J6080129
18443A79982820j658756k5780389l5139668k7472295j6899874q465094j620264
18436F2946480L611384N972632M438916M29261l047308n842697j0528871j2686499
$$ y = [47947149, 59704258, 69716818, 73418448, 69768008, 59941593, 46889422, 35889485, 28512591, 24146060, 22044611, 22039937, 23991738, 27442544, 30668275, 31547205, 28816102, 24007536, 19613774, 16491071, 14519931, 13357989, 12817359, 12665780, 12771119, 13107439, 13669652, 14804045, 16542677, 19146489, 22970590, 27909767, 32950381, 36700800, 38563223, 39955284, 41848431, 44435348, 49167353, 58431436, 73800156, 94194897, 114677925, 128786928, 136264034, 146241016, 163902691, 179982820, 178324064, 152543675, 117404007, 89931712, 73031838, 64566744, 62946480, 66557864, 72530496, 76969412, 77398673, 74351365, 68508668, 57979797, 45293298]
18428D5293298j0157844o956632m741635l233351k183452j468089j004359o27624
18420A4920312l49621k37357k14618L4354J74898M43696Q46484J392656J920135
18411A8930939K801949M114932N862435Q212488R897529Q571071L594691k412539
18403E9573495l645092J14847N943568J2601230J7327727J6798287R476125j51711
18395A18038476n351967o789221n570084p228365j3634796j7739625j5059885
18388D6664533j0243475o487770l950548k064433m81692N25586P30352l29708
18380B4362845k144460k829514k236213j390689p70915m19325j96104L7722K22087
18371A4635434O44609J248093K043832L239830N039088P371187Q979227P633633
$$ y = [45293298, 35135454, 28178822, 23437187, 20203836, 18020384, 16552295, 15547936, 14920312, 14570691, 14333334, 14118716, 14153070, 14327968, 14771664, 15618148, 17010804, 18930939, 21732888, 25847820, 31710255, 39922743, 49820272, 58391343, 61986034, 59573495, 55928403, 56043250, 61986818, 74588048, 91915775, 108714062, 118190187, 118038476, 112686509, 105897288, 100327204, 93098839, 79464043, 61724418, 46664533, 36421058, 29933288, 25982740, 23918307, 23436615, 23962201, 24692553, 24362845, 22218385, 19388871, 17152658, 15761969, 14991054, 14571729, 14375625, 14413347, 14635434, 15280043, 16528136, 18571968, 21811798, 26850886, 34222073, 43201300, 50834933]
18363E0834933K340144m090999o017651l586428J30265M391090R389838J4507095
18355F7898287J6231605R837907m000266j5683785j6328527j1154612n780331
18348D1020278j223656K861319N483479M354459j217588q120847j0051999p833236
18340B5272209n231628l478431k315670j378900r36589n92396k86050k5630L38477
18331A1365392O56516J160289K197491L508541M690258M389499J747313k258088
18323B7457211m320705l721960k438640j127784j23533Q93044K094742L355162
18315B2067537N109992P689327J0229652J1888723J2000406J0678946O321374
18308H5985957k521526j0725678j3209707j1131403q828338p872797o836292n230130
$$ y = [50834933, 53175077, 49084078, 43066427, 39479999, 39610264, 44001354, 53391192, 67898287, 84129892, 93967799, 89967533, 74283748, 57955221, 46800609, 41020278, 39796622, 42657941, 48141420, 52495879, 51278291, 43157444, 33105445, 25272209, 20040581, 16562150, 14246480, 12867580, 11930991, 11338595, 11052545, 11026915, 11365392, 12021908, 13182197, 15379688, 18888229, 23578487, 27967986, 29715299, 27457211, 23136506, 19414546, 16975906, 15848122, 15724589, 16617633, 18712375, 22067537, 27177529, 34866856, 45096508, 56985231, 68985637, 79664583, 85985957, 83464431, 72738753, 59529046, 48397643, 39569305, 31696508, 24860216, 19630086]
18300A9630086l689815k571492j700996j053928n84065k25657K02815O47505J334134
18291A1988587J968069K189221J297942q25159k680607k758124k009922j356059
18283G813948r59386o82877k25291k8213Q9741K15885M79425O14338J079915J623616
18273A0021101K453341K613683J738886j59730j503634j269927k33767Q33587
18265A4493540K377908L623006L479633J046351k451069m191722l593722k159561
18257A2624364j014719O2416P58189N92607o32885k013753k318494j808408j159306
18248E090011p79403o40534m76967k75304j02915j55633j70299j12881n9001K7781
18238B344855J2517j77809j65943L9052Q0909J00713P9658Q6210O5105J29249
$$ y = [19630086, 15940271, 13368779, 11667783, 10613855, 10029790, 9804133, 10006948, 10654453, 11988587, 13956656, 16145877, 17443819, 16618660, 13938053, 11179929, 9170007, 7813948, 6854562, 6171685, 5946394, 5918181, 6007922, 6223807, 6703232, 7317570, 8397485, 10021101, 12474442, 15088125, 16827011, 16667281, 15163647, 13893720, 13659953, 14493540, 16871448, 20494454, 23974087, 25020438, 22569369, 18377647, 14783925, 12624364, 11609645, 11672061, 12430250, 13022857, 12389972, 10376219, 8057725, 6249317, 5090011, 4310608, 3670074, 3193107, 2917803, 2814888, 2659255, 2488956, 2376075, 2317074, 2344855, 2357372, 2179563, 2013620, 2052672, 2133581, 2234294, 2313952, 2400162, 2465267, 2594516]
18228B594516J03285N5873J6870j1003J7985k2968r2438j21144q9655n3843j39522
18217B257956n3979l39j10426j2782m7473r7996o0971n4608n6899r0992j21472
18206A550019o2927m3069l8584j0597J24565P9690q7734j00269p2454o9591m7999
18195A221050n6997O5680N2831N8736J4593N0305R5675L4271N538m61n2402m1957
18183A446862L4274J13879Q5933M6586M4663M2970k8586K940M6317m5260n8664
18172A731914l7829k2969N5268R025p1686k2515k2118n8038n2025p7496q5974
18161A345557R0432M1622k9334L9985M6702L8486p3096n8846p0164r012R9237
18150A461569J30099Q2070O7326J03229R4064N3549p1850m0916n1724p8121L4602
$$ y = [2594516, 2697801, 2753674, 2770544, 2759541, 2777526, 2754558, 2662120, 2540976, 2451321, 2397478, 2257956, 2203977, 2203638, 2093212, 2080430, 2032957, 1934961, 1873990, 1819382, 1762483, 1671491, 1550019, 1487092, 1444023, 1405439, 1394842, 1519407, 1599097, 1511363, 1411094, 1338640, 1269049, 1221050, 1164053, 1229733, 1282564, 1341300, 1355893, 1406198, 1501873, 1536144, 1541682, 1541221, 1488819, 1446862, 1481136, 1595015, 1680948, 1727534, 1772197, 1815167, 1786581, 1789521, 1835838, 1790578, 1731914, 1694085, 1671116, 1726384, 1735409, 1663723, 1641208, 1619090, 1561052, 1509027, 1431531, 1345557, 1435989, 1477611, 1448277, 1488262, 1534964, 1573450, 1500354, 1441508, 1371344, 1362332, 1461569, 1591668, 1673738, 1741064, 1844293, 1938357, 1991906, 1920056, 1879140, 1827416, 1749295, 1783897]
18139A783897J12782R3136R9118n980j5294J23589J59499N6701N2094R9326J11329
18128B670197O8980J12160K86782L25919L24747K97134M77139N52197O17021P53079
18118F485355R84440J259716J731897K375326L489801N370969Q413062J4023067
18110D4133633K3493596L6997265M1859856K3661187j7201093m5620865l7325760
18103F9997819k3043584j4525232r367505o067013l999112k746818j869583j334472
18095G044500j021508q26694p19317p05147m60924m04210m01227k87856k22744
18086A994873j57125j70955j64345q8131j31996r3652L380q4162p4155j0825J0427
18075A033334l5433n8407j43328j07534m3543n6383p8919M995L0654J5746j3650
$$ y = [1783897, 1896679, 1989815, 2088933, 2082953, 2067659, 2191248, 2350747, 2407448, 2459542, 2558868, 2670197, 2739177, 2851337, 3138119, 3464038, 3788785, 4085919, 4563058, 5115255, 5732276, 6485355, 7469795, 8729511, 10461408, 12836734, 16326535, 21697504, 30110566, 44133633, 67627229, 104624494, 146484350, 170145537, 152944444, 107323579, 69997819, 46954235, 32429003, 23061498, 16994485, 12995373, 10248555, 8378972, 7044500, 6022992, 5196298, 4476981, 3771834, 3310910, 2906700, 2505473, 2217617, 1994873, 1837748, 1666793, 1502448, 1414317, 1282321, 1188669, 1192049, 1107887, 1033732, 1022907, 1033334, 997901, 939494, 796166, 688632, 645089, 588706, 509787, 514782, 545436, 561182, 547532]
18064E47532k251J7870M9265O2509n4086q2858l266P8761j6515k8947o9096k5505
18052D73413K027J4261n5665n2935q4393K3812q031L6744q537k3571P0221O6782
18040D54128l5675q1786r6689p679n7814q1417p0086m9991P0944L7105J0704K6810
18028A18554J9104R616l0200m3175n6355j1919Q8166J3804r797j88949q2480O8560
18016a05071k3373k7723M0083P0785O3580L7993m4728K0308j3103J6099O9446
18005A04296q601J0613m1431n983J9554Q3654J66624M9053q7037n467M6035L4348
17993C65658n4722J4505O2828K8715N5329K9919r918n3851r3861N3776J20751
17982E19129K6627Q1179l5860p6654n3682K7034J11671J51754N266p7093P887
$$ y = [547532, 545281, 563151, 612416, 674925, 620839, 537981, 534715, 613476, 596961, 568014, 498918, 473413, 475440, 489701, 434036, 381101, 296708, 320520, 312489, 349233, 340696, 317125, 387346, 454128, 418453, 336667, 239978, 232299, 174485, 93068, 22982, -27009, 43935, 81040, 91744, 118554, 137658, 147274, 117074, 73899, 17544, 5625, 93791, 107595, 97798, -91151, -173631, -105071, -128444, -156167, -116084, -45299, 18281, 56274, 11546, 31854, 18751, 34850, 104296, 95695, 106308, 64877, 58894, 78448, 162102, 328726, 377779, 290742, 285275, 331310, 365658, 310936, 325441, 388269, 416984, 472313, 502232, 492314, 438463, 344602, 398378, 519129, 545756, 626935, 591075, 514421, 460739, 487773, 599444, 751198, 756464, 679371, 687258]
17971F87258q590r2582j16198j31918q2492R0701J7353K4382o2667j43347l062
17960A78838o0576L994L1491K9297L0153K6853k9903J0940J643k2340n194R6701
17948B91897R7173l1650k9078L5659J06983K5636N1194J7313K7362k6038M597
17937E71048J09388J65403Q8238j28445j09153M0818L0730m9184k1620N6496N7143
17926H10862J3303j31241j81998k2777k7225N6674N3722o7042m7282l4583l4736
17915C87677j03907j01234p9691k8406J5984r7549J0428J14754l985n4933R81
17904F0119J10019P8577m6268l9601j4566J9961l1645l131Q5241m9643k5856N7655
17892B00862K6025O3992J08035k6094m9125j08010J6553N3441M5953L2559L999
$$ y = [687258, 678668, 586086, 469888, 337970, 255478, 346179, 363532, 387914, 325247, 181900, 178838, 118262, 122256, 153747, 183044, 213197, 240050, 210147, 221087, 222730, 200390, 195196, 291897, 389070, 357420, 328342, 364001, 470984, 496620, 547814, 565127, 592489, 566451, 571048, 680436, 845839, 934077, 805632, 696479, 737297, 768027, 718843, 697223, 753719, 810862, 824165, 692924, 510926, 488149, 460924, 517598, 571320, 504278, 456996, 422413, 387677, 283770, 182536, 102845, 74439, 90423, -7126, 3302, 118056, 114071, 59138, 60119, 170138, 248715, 202447, 162846, 148280, 168241, 136596, 133465, 218706, 169063, 143207, 200862, 226887, 290879, 398914, 372820, 323695, 215685, 232238, 285679, 331632, 364191, 368190]
17881C68190j7510j16282L8088O1703n9338k427j7544O6938J02738K1645K8902
17870D75103l9590j69818j76759p8088J5936J2747L2776J08399M2455K8755R7201
17859C49117M4505l3853o2286j48545J271J32849O2322M2048L9064r3524o6652
17848B66316p4551k9225l1093J5791n8989n8081l7751J6310N7501n5974m2398
17837c2144K4490j019q0897n641K4557M321J1997O806O7149P536o6262J3380N3546
17824B7819q686p0443L5840k2960K4263P902P36k6001k268p9975k0302K4335R7041
17811a2699J85642R8262k0461L7522M13L9467M9493J07275J03529j5526j06868
17800D66049p5169k7398j01305m4897l4622K3491j4928l7423j24293o5351K1005
$$ y = [368190, 350680, 234398, 272486, 334189, 274851, 272424, 254880, 321818, 424556, 446201, 475103, 435513, 265695, 88936, 10848, 26784, 39531, 72307, 180706, 223161, 251916, 349117, 393622, 359769, 297483, 148938, 150209, 283058, 345380, 387428, 426492, 332968, 266316, 191765, 162540, 131447, 147238, 88249, 30168, -7583, 8727, 66228, 10254, -32144, -7654, -8673, -89570, -95211, -70654, -66333, -54336, -47530, 19619, 27155, -39107, -25727, 27819, 19133, -51310, -15470, -38430, -14167, -6265, -5529, -31530, -33798, -113773, -134075, -109740, -12699, 172943, 271205, 250744, 288266, 288679, 328146, 377639, 484914, 588443, 572917, 466049, 390880, 363482, 262177, 217280, 182658, 206149, 191221, 153798, 29505, -35846, -14841]
17789a4841K0634L1174n9759j1157N9528J2513n5866p7272q0587K0148M091O9628
17777h1766l4020L5416J8416K2403L6353l0111k8618n6235K1364K9041J4980L4686
17765a8091P3670P4651p4353n7092j1421P8296l0513J3533O6886Q1973K9302j12310
17753A14531m7045J7892j6164j2743j1630j5205j8291n773n3230k0193j3275p1105
17741a52231J0257O6616m5105r7077L6321N5615j6935M1011R612J2950M5069N658
17729b8239k6965P626q487J8627n5768n2546l2680N8842j0111r5181O9516R9006
17717e6360l0903M1897l6850o8420N4737Q0834Q2401n1676n859K8598k4155o3365
17705d9121L6350M0920O110j07098p0211K8069K5311P4163j9176j20330p3416
$$ y = [-14841, 5793, 36967, -22792, -33949, 25579, 38092, -17774, -95046, -175633, -155485, -151394, -81766, -115786, -80370, -61954, -39551, -3198, -33309, -61927, -118162, -96798, -67757, -52777, -18091, 55579, 130230, 55877, -1215, -12636, 65660, 35147, 48680, 115566, 197539, 226841, 114531, 67486, 85378, 69214, 56471, 44841, 29636, 11345, 5572, -47658, -67851, -81126, -152231, -141974, -75358, -120463, -217540, -181219, -125604, -142539, -101528, -91916, -78966, -33897, -28239, -55204, -47578, -56065, -37438, -93206, -145752, -178432, -119590, -129701, -224882, -155366, -56360, -87263, -45366, -82216, -150636, -95899, -15065, 67336, 15660, 9801, 38399, 14244, -49121, -12771, 28149, 34259, -72839, -143050, -114981, -89670, -15507, -34683, -155013, -228429]
17694b28429N7853P3050j0627K7651q6909n4825O3698K2575K5788N9366L105p4941
17682a22645k3983R3403M6366J7554q4348K4022k1544l6333o0715L4237j7520
17671a51506k857K1918k4145j12986P5748L33L9381m793k4849K2049j0358R8959
17659g3106O6331j93r7396L801J7817m616N306m3485J1957j6127r660l2862O4231
17646a08002J08606j6190l6819o8581r9744K3801P8038R0576o173M9627M7783
17635F2922k6543q0460l657M2181L8883o0593m6459p3660O0845N5244p0265r1460
17623a93022n699O7261m6909K4329N8176K5069L1312R401n7886O3748n9576r1227
17611a75023o5941P477O6690P193N429o348J6405o8237P717N4173L4638n240P3799
$$ y = [-228429, -170576, -97526, -108153, -80502, -167411, -222236, -158538, -135963, -110175, -50809, -47704, -122645, -146628, -53225, -6859, 10695, -73653, -49631, -71175, -107508, -168223, -133986, -151506, -154363, -132445, -156590, -269576, -193828, -193495, -154114, -158907, -183756, -161707, -172065, -73106, -6775, -6968, -104364, -100563, -82746, -87362, -82056, -125541, -113584, -129711, -139371, -172233, -108002, 604, -15586, -52405, -120986, -220730, -196929, -118891, -28315, -34488, 15139, 62922, 36379, -44081, -47738, -5557, 33326, -27267, -73726, -147386, -86541, -31297, -101562, -193022, -198721, -131460, -178369, -154040, -95864, -70795, -39483, -30082, -87968, -24220, -83796, -175023, -240964, -233487, -166797, -159604, -154175, -160523, -144118, -212355, -204638, -150465, -115827, -121067, -47268]
17598d7268q116m8294P792m232Q6361j6152l9095o2259K2215j9573o1369p2214
17586b62204J9980k0953L4384M0218Q2932P6121l4003K0457m4147l2166K8197
17575i1184j500j2214K6470j4543N4221J2093J8829r714r4551j35l292k8236L1428
17562a12328l9204m4035L7777L4204J1539L8625N6680L915j0569k8318K5192q174
17550c4696J8815K0152J9888P7872n7689K7157p5396q2976j9654m7341j7386q8279
17538b59533n1319P5717J36692R3229K0844k0773M6099j57847n1232j6158J1457
17527a72824K7516l4986p201k8813J829K1806M6725l3727l8421K4020Q13L4385
17515a58878l6509k488K8924N3893Q3036o9575l634O582l9334O3762n5326j5668
$$ y = [-47268, -55384, -103678, -95886, -100118, -13757, -29909, -69004, -131263, -109048, -128621, -189990, -262204, -242224, -263177, -228793, -188575, -105643, -29522, -63525, -43068, -87215, -119381, -91184, -92684, -104898, -78428, -92971, -38750, -26657, -7828, -17542, -112093, -112228, -115520, -143756, -112328, -151532, -195567, -157790, -123586, -112047, -73422, -16742, -12827, -23396, -51714, -26522, -34696, -15881, 4271, 24159, 102031, 44342, 71499, -3897, -86873, -106527, -153868, -171254, -259533, -310852, -235135, -98443, -5214, 15630, -5143, 40956, -116891, -168123, -184281, -172824, -145308, -180294, -187495, -216308, -214479, -192673, -145948, -179675, -218096, -194076, -193263, -158878, -195387, -197875, -168951, -115058, -32022, -101597, -105231, -98649, -137983, -74221, -129547, -145215]
17503a45215j7565l8891l2932N3040R8330K8144p7394q5244L8917O8164R626p5546
17491a76566l1691N8906l521p8186N8439J04310k5127j04861j7235j0170P987
17480b17715J6721n0052p7388P4853J06901P3535N4522j1308r905l0284j248o494
17468g7862L4455j1337k840N711j5778n0621k7135N3892M0937j7083J0905J6916
17456c9840o3577l6740K6071l0969l8564O6604N5893p9599k8114Q9368J53298
17445G3831J10420M6464P7858K70670J93216p1721k11728j36920j76581j45351
17435C0158j40073k5794K2292l2346j7728K5857L4700r0134k6385M6868O9771
17424a02814p1505O4463j2957k7690k9081O6583O2625k2379m862j8275j8107l212
$$ y = [-145215, -162780, -201671, -234603, -181563, -83233, -55089, -132483, -217727, -178810, -110646, -101020, -176566, -208257, -149351, -152872, -231058, -172619, -68309, -93436, -198297, -215532, -225702, -217715, -200994, -251046, -328434, -253581, -146680, -73145, -18623, -29931, -39836, -70120, -71368, -77862, -43407, -54744, -57584, -51873, -67651, -118272, -145407, -91515, -50578, -67661, -56756, -39840, -103417, -140157, -114086, -145055, -183619, -117015, -61122, -140721, -168835, -79467, 73831, 184251, 230715, 308573, 579243, 772459, 700738, 489010, 352090, 175509, 30158, -109915, -135709, -113417, -145763, -163491, -137634, -102934, -193068, -219453, -172585, -102814, -174319, -109856, -122813, -150503, -179584, -113001, -50376, -72755, -77617, -95892, -113999, -117211]
17412a17211L3827r0337J604J766K512m0304o039Q9822P0160l4851o3111j4249
17400a66411R1558O9359N1142o009p0721k5633n2323j0715q0771L8836L4669P3301
17388e3718K1737p8929l7305O9361l2190j06918j7353n6539J0120N2425P6109
17377a53200L6368r7094j6719R0857L0151M0687k7460M8971L019p0869o2345N1289
17365a26345O4427O0335k8582n9319q1370j4968N1586R8118o822p3332l7789o7029
17353b21090K7235J01673M8380o1979K7670P9484k3070O54k7081r3182o2931J9524
17341a84713M9749R1168J9800K8082N1556l9147l7673l2432L670R5648J177k3541
17329B3344m2088n9571L5759O5730k7367M5185L392j5514o7260p1635j03768N221
$$ y = [-117211, -83384, -173721, -172117, -170351, -167839, -208143, -214182, -124360, -54200, -89051, -152162, -166411, -74853, -5494, 45648, 39639, -31082, -56715, -109038, -119753, -200524, -161688, -127019, -53718, -31981, -110910, -148215, -78854, -111044, -217962, -235315, -291854, -281734, -229309, -153200, -116832, -213926, -230645, -139788, -109637, -68950, -96410, -47439, -44420, -115289, -177634, -126345, -61918, -1583, -30165, -89484, -170854, -185822, -134236, -36118, -42940, -116272, -154061, -221090, -193855, -92182, -43802, -105781, -78111, 1373, -21697, -21043, -48124, -141306, -204237, -184713, -134964, -43796, -23996, 4086, 55642, 16495, -21178, -53610, -49940, 45708, 46885, 23344, -18744, -78315, -42556, 23174, -4193, 40992, 44384, 28870, -38390, -110025, -213793, -208572]
17317b08572Q1090K8867r5J0090m0740m1610m7757Q8645Q9207j05200P20l3213
17305a78568O0410n5574p159P6161n909o3122j09657L8569J3960Q1440N4795j4305
17293a08959o3583q7063Q4039N4217M4297K5267j2925l4052l9803Q48N4096R396
17281g4225l9926J9655L0507p644n0177P6958P1057p6250p9149l5865m123P6074
17269i3108K9589L7193k3625k2696p4556L6859m0100q7721J6225K5363L4946j2489
17257a74120l0804k3965n5377p0331M6071L5848R3361p4918q5322L0029N7543
17246b51985P8970M5431r837J02475O4094j48188j42090K8797R3481r568K6649
17235a21771k666K7667J5159m0418O1834J439m5912J5032m5393n2982L9504L2388
$$ y = [-208572, -127482, -98615, -98710, -88620, -129360, -170970, -218727, -130082, -40875, -146075, -145355, -178568, -118158, -173732, -180891, -104730, -110639, -173761, -283418, -244849, -230889, -149449, -94654, -108959, -172542, -259605, -175566, -121349, -77052, -51785, -64710, -98762, -138565, -137717, -83621, -74225, -114151, -94496, -63989, -71633, -121810, -44852, 26205, -50045, -129194, -165059, -169182, -93108, -63519, -26326, -49951, -72647, -147203, -110344, -150444, -238165, -221940, -196577, -161631, -174120, -204924, -228889, -284266, -354597, -308526, -272678, -179317, -254235, -339557, -309528, -251985, -173015, -127584, -137421, -34946, 29148, -119040, -261130, -232333, -138852, -148420, -121771, -124437, -96770, -81611, -122029, -60195, -58756, -104668, -89636, -135029, -188011, -148507, -116119]
17223a16119O637J9878L8709k0838K4718o1180k8896K686k3949q3974o7846N5646
17211b54528R0665J18440Q691p609R040L1822k4239n6696j6230m9345k6083n4064
17199b30136Q6759k0904n661N1598K1154L4726K3103J2875o2187m5760O245J6963
17187a11225J1028L4108k1274M4537k9158j3216l6374p5258k7450m1941k6392
17176b92615J56278O6977l8213J7184M5623k036j129M7466N543p6999o0233k0310
17164a52464k4151k6864o1058M7203J5936q1310R768N2774M7103M6987M0025k6141
17152a12192Q379N8904n5686m0158M9098l9789m3974N3467j5133K2898j8769K654
17140a30301n6145O0965M7128j7136k2688j2666n9776m2524J495O3359K1920L0468
$$ y = [-116119, -109482, -89604, -50895, -71733, -47015, -108195, -137091, -134405, -158354, -242328, -310174, -254528, -163863, -45423, -36732, -44341, -35301, -3479, -27718, -84414, -100644, -149989, -176072, -230136, -143377, -164281, -169942, -118344, -97190, -62464, -39361, -26486, -88673, -134433, -128188, -111225, -100197, -66089, -87363, -42826, -71984, -85200, -121574, -196832, -224282, -266223, -292615, -136337, -69360, -107573, -90389, -44766, -46802, -47931, -465, 5078, -71921, -132154, -152464, -176615, -203479, -264537, -217334, -201398, -282708, -272940, -220166, -173063, -126076, -86051, -112192, -103813, -44909, -100595, -140753, -91655, -131444, -175418, -121951, -137084, -114186, -132955, -130301, -186446, -125481, -78353, -95489, -118177, -130843, -190619, -233143, -231648, -168289, -146369, -115901]
17128a15901K9772L1115o9297l3878k8088N6368L951k2639l6432L7404J0481j3327
17116a50471Q3869m7768l5220P1193L4793P0110J3165J0663l6615m0596L1025
17105D148q464j24234l5023J7403K0270l8403N4334O4688l6978n4071l5877n2818
17093b25025K1440P9876k2826m4828j641L0122L5772K4310m6980n3641N9225N4928
17081h9268m2147J0039N1596L4687p2579p6742P405R70n5694N8158P91Q5337Q5647
17068a800m9289n9942K1746p277m5181L8124N3073q9841l1819J11207L4502o356
17056c2853L364l3946J1007R109J31k6221P0111l6161m0141k6609J425l2067K7698
17043a05153L6538p2318m7744P7012k4366j16459l9042J02280J6967j3489O9050
$$ y = [-115901, -86129, -55014, -124311, -158189, -186277, -129909, -125958, -148597, -185029, -147625, -137144, -150471, -66602, -114370, -149590, -78397, -43604, 26506, 39671, 50334, 13719, -26877, 4148, -4316, -128550, -163573, -146170, -125900, -164303, -109969, -45281, -82259, -136330, -172207, -225025, -203585, -123709, -146535, -191363, -193004, -162882, -127110, -102800, -149780, -203421, -144196, -89268, -131415, -121376, -69780, -35093, -107672, -184414, -177009, -176039, -231733, -173575, -172784, -87447, -1800, -51089, -111031, -89285, -96562, -141743, -103619, -50546, -140387, -172206, -60999, -26497, -32853, -29489, -63435, -52428, -43319, -43188, -69409, 702, -35459, -75600, -102209, -100784, -132851, -105153, -68615, -140933, -188677, -111665, -136031, -252490, -291532, -189252, -172285, -185774, -116724]
17032a16724M2253j09269j2164k25q597L5015M259j8496n69R7216M0080m3336
17020i0557j8147P8900O9582n9054j15045j4999N7409J1126j4433m0892K9861
17009a06249K7311k869K1006l2140M065o267j2703o6623j9960k8808L2527R3967
16997i6743J6203j6576P092K139m2826q6390M1983O1342j0883n6948m428m7244
16985b33279N416J9744L3508q292K6280n753j3782K9404l2530L2241M1347J00375
16973e321k0015J3410m9399m7589p6185P674P5891P0833K3129o935L6968l7072
16961a4611r9552p5674K2749n315m8433n7480p260L7096j6973P0535L5078J8630
16949a41210M91Q0610J1365l7357M3464O0598m7269m3029j8312n7990p217M2575
$$ y = [-116724, -74471, -183740, -195904, -196129, -204726, -169711, -165452, -183948, -184517, -87301, -47221, -90557, -108704, -29804, 39778, -19276, -134321, -149320, -91911, -80785, -95218, -136110, -106249, -78938, -81807, -60801, -92941, -88876, -95143, -107846, -174469, -194429, -223237, -190710, -96743, -80540, -97116, -90024, -87885, -130711, -217101, -175118, -113776, -124659, -181607, -186035, -233279, -227863, -208119, -174611, -182903, -156623, -162376, -176158, -146754, -179284, -147043, -105696, -5321, -25336, -11926, -61325, -108914, -185099, -177425, -101534, -30701, -7572, -14507, 22461, -14611, -114163, -189837, -167088, -172403, -220836, -278316, -285576, -248480, -265453, -194918, -159840, -141210, -140719, -60109, -48744, -86101, -42637, 17961, -29308, -72337, -90649, -148639, -155856, -113281]
16937a13281M9788M2586K7850p3202j4949L8754j719l1319k1985Q1412K1434j26604
16925a21235r0721L297O7239k2861n7015Q5763l9725l6070n9155J3912N7879k575
16913b01267J6930K8543K7735Q5201Q7117o8294j06879j2235J9632L3724J2834
16902g6959m9083m549O4662p247K5707M5174J2118p2704K097O4960l3504q4359
16890a13687j3338O0304m3748L9508p066J2539m0359j3961J957m2700K6646O3297
16878g0608J9304k794n2374l3408L1151J7394q6804K9679k7299l3894m2524N8290
16866a93887P5790k67N0927j7075n4658m7464R8488J8188q376R589n9140p2301
16854b00186K5192K7000O6604n6658p2119L2436O7970l7894m4134P2j2588M3860
$$ y = [-113281, -63493, -20907, 6943, -66259, -81208, -42454, -44173, -75492, -97477, -16065, 5369, -121235, -211956, -208659, -141420, -164281, -221296, -135533, -175258, -211328, -270483, -256571, -198692, -201267, -184337, -155794, -128059, -42858, 44259, -24035, -130914, -143149, -123517, -89793, -76959, -126042, -130591, -65929, -73176, -47469, -2295, 9823, -62881, -60784, 4176, -29328, -113687, -127025, -66721, -110469, -70961, -78027, -65488, -105847, -119808, -117851, -160551, -133905, -70608, -51304, -54098, -106472, -139880, -108729, -91335, -178139, -148460, -175759, -209653, -252177, -193887, -118097, -118364, -67437, -84512, -139170, -186634, -88146, -69958, -78334, -68745, -127885, -200186, -174994, -147994, -81390, -138048, -210167, -177731, -109761, -147655, -191789, -191717, -204305, -160445]
16842a60445n0501q8065R729O6774N716k040K107O9816N3719n8776k27O7247O1395
16829b3551m9961L4976K812r7386k1654J16092O3082m7556n1453J02223N9861
16818H7485k477m5285n2298l870J34470L1467r8888k8830K6903j0780o813l2447
16806a363Q354K4957J6330p0582l6661k7489P1044J1223R302l6199l1874n4704
16794a17662l5357j312O9074O9453p6695p5156j41647L3100J06144L3628l4402
16783a70832K3307J06324K2522N6631r1935q5224k282J9327R126j7795K5765J0113
16771i4953j1252k1629N4812O7759L1966r2182m8426m9666l1014N1514O5627K5476
16759e1968j0713p7L0334R7452j5534K2451q6367n1539l9545k1354J3382l2913
$$ y = [-160445, -210946, -299011, -289282, -222508, -216792, -218832, -216725, -146909, -93190, -151966, -152193, -84946, -23551, -73512, -38536, -35724, -133110, -154764, -38672, 24410, -23146, -74599, 27624, 87485, 85008, 39723, -12575, -16445, 118025, 149492, 50604, 21774, 48677, 37897, 31084, -1363, 6991, 31948, 48278, -22304, -58965, -86454, -15410, -4187, 5115, -31084, -62958, -117662, -153019, -154331, -85257, -15804, -92499, -167655, -309302, -276202, -170058, -136430, -170832, -147525, -41201, -18679, 37952, -53983, -139207, -141489, -122162, -113036, -130831, -105066, -94953, -106205, -127834, -73022, -5263, 26703, -65479, -113905, -163571, -194585, -143071, -77444, -51968, -62681, -62758, -32424, 65028, 49494, 71945, -14422, -65961, -105506, -126860, -113478, -146391]
16747a46391O363n9124P103L4531Q9163j2840K9225Q1711r709k7433R847o8929
16735f6483k6835L459P363L1912J7425M6468N0389K7678k6926l378o4306j22834
16723a26068m2N0799k0486n4217M9439Q2686k0946L3770J2188l3140L6308J8945
16711B9236j3882j6242o4229L7184n2027l5223j0723l9302M650k512J00665Q1235
16699A8830M6795K2888k781l5870r5953L52p442p2795j9731m3637K9467K9330
16687a30547J6266K1351o211K6094Q2261o6274L5140O2000n1666q518o7099j63412
16675b50615J33872J01009L9332j3250m5419J1056k6392J7402J1596N4650O4234
16664I7475n8955p2708o2048r0033r3899O0732J03573N8275n6176o537K5171l3580
$$ y = [-146391, -140028, -199152, -192049, -157518, -68355, -81195, -51970, 29741, 20032, -7401, 2446, -66483, -93318, -89859, -82496, -50584, -33159, 13309, 63698, 91376, 64450, 61072, -3234, -126068, -126110, -75311, -95797, -150014, -100575, -17889, -38835, -5065, 7123, -26017, 10291, 29236, 15354, -888, -65117, -27933, -79960, -115183, -125906, -165208, -160558, -163070, -62405, 18830, 65625, 88513, 85732, 49862, -46091, -45739, -53181, -125976, -145707, -189344, -159877, -130547, -114281, -92930, -99141, -73047, 9214, -57060, -21920, 40080, -11586, -20104, -87203, -250615, -116743, -15734, 23598, 10348, -35071, -24015, -50407, -33005, -21409, 33241, 97475, 38520, -34188, -96236, -186269, -280168, -219436, -115863, -57588, -113764, -120301, -95130, -128710]
16652a28710o9947M0999P5866o8286m3049K8996L811k9799r596l252j0381J7118
16640a96230O6492N8880l0333m2248m240M530l3906m9930M0263M6042J05282P1512
16628C6114q9626k6325m3070k6328L2925r0923r584N8746J6544O2840j1642J3841
16616g6488K5246o4703l0601k495m0342N2165K9933R5022j4050m2502n5259k8103
16604a52177K6353L6681k5337M1586K3554k1095k5636k7030l5521M5626N1583
16593f1413J9595m1313j0769L5598P9797l1676o1634O214M3442r501q5012K3121
16581i3551Q6757l3735q0267M8810P5279p5525k3331N1041l80p1906M9864M7186
16569a9758L9632K0509L0651n285o7086p0851m19M4763j9099l096q6538j4100
$$ y = [-128710, -198657, -157658, -81792, -150078, -193127, -164131, -160320, -190119, -199715, -202967, -213348, -196230, -129738, -70858, -101191, -143439, -147679, -143149, -177055, -226985, -186722, -140680, -35398, 36114, -53512, -79837, -122907, -149235, -116310, -207233, -216817, -158071, -141527, -78687, -90329, -76488, -51242, -115945, -146546, -149041, -189383, -137218, -107285, -12263, -26313, -68815, -124074, -152177, -125824, -89143, -114480, -72894, -49340, -70435, -96071, -123101, -158622, -112996, -61413, -41818, -83131, -93900, -58302, 21495, -10181, -71815, -65601, -22159, -31660, -116672, -93551, -6794, -40529, -120796, -71986, 3293, -72232, -95563, -44522, -44902, -116808, -66944, -19758, 19874, 40383, 71034, 65749, -1337, -72188, -72607, -27844, -46943, -50039, -136577, -150677]
16557a50677O4651L4916m323j4581M7035k514k3473l0399m348N241P979J2118
16545e8375K1947N8188L5526k2113q0347K0491k6767l2789k105O142J45090o198
16533E8690j04612N134J699k5234l3496j2652M007q2399N9366P0707K6056J0240
16521b2494K7708j9352J9580l3270R552l1643k1132p7021N4205n6358l498P4894
16509g8829o856o4416K3434J12989N4523p1181k4373j8994J8689r496j9605l0911
16497a15026M6402p747J3635M1894L129k6438q603P4737K7573m4106m6967n465
16485d6982l3447o5759p2130k201R0334K490o0572k6090p094r612J3806P7928
16473a39329M2143l0765O8239J4533l793j49241r8477m4356K8371J49779R8210
$$ y = [-150677, -86026, -51110, -55433, -70014, -22979, -25493, -48966, -79365, -83713, -78472, -70493, -58375, -36428, 21760, 57286, 35173, -45174, -24683, -51450, -84239, -86344, -80202, 64888, 58690, -45922, -40788, -39089, -64323, -97819, -110471, -106464, -188863, -129497, -58790, -32734, -22494, 5214, -14138, 5442, -27828, -18276, -49919, -71051, -148072, -93867, -150225, -153723, -78829, -85685, -150101, -126667, -13678, 40845, -30336, -54709, -73703, -55014, -64510, -84115, -115026, -68624, -76371, -62736, -20842, -17713, -44151, -52754, 21983, 49556, 5450, -41517, -46982, -80429, -146188, -218318, -220519, -130185, -127695, -188267, -214357, -221451, -231063, -217257, -139329, -97186, -127951, -59712, -45179, -48972, -198213, -296690, -341046, -312675, -162896, -64686]
16462f4686J9683P6344j4451j28432k6064J7912J2791j7327l5447o4636k1032
16451b45345J5605M4727N7863p1819M4305N3345P1073K7692l8853l2626O3856
16440a0177P718k2349m5375j8689K0500R2704O511m8406n3876l1517J2910Q832
16428h1214n1194r429R5598Q7410j7970r9828J1847L195j9730K9189J05604J8953
16416G2431L6214r152m9249k6438n4862l0773O6911l0475o8022j265L9O2777l1624
16403f3488k7755k9716M9704N3282N975M20m2948j5020k762L2875j7202M2468
16391a4167M5531l3614J793N0385n324l0142n5257j5498L0014J9411k8877R511
16379b6234K1633J04727k0438n2656o2764N7892K6188l1384m8961O1220N6489
$$ y = [-64686, -45003, 31341, 16890, -111542, -137606, -119694, -106903, -124230, -159677, -224313, -245345, -229740, -185013, -127150, -198969, -154664, -101319, -30246, -2554, -41407, -74033, -10177, -2459, -24808, -70183, -88872, -68372, 24332, 30843, -17563, -71439, -102956, -90046, -81214, -132408, -141837, -46239, 41171, 23201, -76627, -64780, -61585, -81315, -52126, 53478, 72431, 108645, 99493, 50244, 23806, -31056, -61829, 5082, -25393, -93415, -94680, -94641, -31864, -63488, -91243, -120959, -71255, -17973, -11998, -11578, -54526, -69546, -72308, -39433, -56635, -14167, 31364, -2250, -457, 49928, 44604, 14462, -40795, -56293, -26279, -6868, -35745, -26234, -4601, 100126, 79688, 27032, -35732, 22160, 48348, 16964, -31997, 29223, 85712]
16368H5712k8230j9050j1131j5305K389Q906P233j5613q1638j43611J6114N075
16356a89149l5485L8496K5677L3684N65n589M1983k8189m0860k3301l9322l7742
16344b59232M7321O9974K3628l233J6507O4603n5778l5422Q1868J7700o5048p826
16332a04938P2083Q1855J0257l3359j19576p101J7645k9230k8438L2976L5667
16321g2159n065m7717N1741J8324M6069K6478p3075p092K6121M1764O4831q4609
16309a4389l2071J858k2593k6491n8236L5430M2958J9259j6168l794L9361Q7057
16297E2181J0562l9265n7501o9347L1548o455N5272j0821j082Q5445J715p3895
16285b1643j05755J1040j78k942M3747J8271M8270J30049O8964k6616j36213n6525
$$ y = [85712, 57482, 38432, 27301, 11996, 14385, 23291, 30524, 14911, -66727, -210338, -194224, -189149, -224634, -186138, -160461, -126777, -126212, -131801, -89818, -118007, -158867, -182168, -221490, -259232, -211911, -141937, -118309, -121542, -105035, -40432, -96210, -131632, -49764, -32064, -97112, -104938, -32855, 49000, 59257, 25898, -93678, -100779, -83134, -112364, -140802, -107826, -72159, -77224, -124941, -73200, -54876, -8807, 17671, -55404, -62496, -36375, 5389, 70220, -14389, -46460, -44602, -67195, -93686, -151922, -116492, -73534, -54275, -70443, -74237, -34876, 52181, 62743, 23478, -34023, -103370, -71822, -78277, -23005, -33826, -34908, 50537, 52252, -21643, -127398, -116358, -116536, -119478, -75731, -57460, -9190, 120859, 189823, 163207, 26994, -29531]
16273b9531K3036O4277l2417J436n4970j6814K2258O909L0226K4554k6090p7906
16261f5032q211J8534N8866R5576K2776n414m1176m0738l6704M5647M4765q9159
16249b70N191O0309j00521l0886j9734l6751m0931j67Q7582l0614j5494l1634
16237a53920J06172J3338N2535R835k8657r1947o1532n814J7830R848M835O1155
16225f6322O0846m0210p8835M9289O8530k6462q7644l2149R3451R1792n2643m3481
16213f3838o9398m564L5034J0313R399k5488n3964Q7740M6560j908o968m0597
16201g7679L0686K5118l856K3126L6150J6710L5886j24329j21422R217K0755M0623
16189h9015J3247O7630K5362r7177o9418J1920J9537j1522N9993Q8153n449p478
$$ y = [-29531, -6495, 57782, 25365, 26801, -28169, -44983, -22725, -15816, 14410, 38964, 12874, -65032, -73243, -54709, 4157, 99733, 122509, 117095, 75919, 35181, -1523, 44124, 88889, -270, 4921, 65230, -35291, -66177, -85911, -122662, -163593, -163760, -76178, -106792, -122286, -153920, -47748, -34410, 18125, 27960, -697, -92644, -154176, -159990, -142160, -132312, -127477, -66322, -5476, -45686, -124521, -75232, -6702, -33164, -120808, -152957, -59506, 32286, -20357, -63838, -133236, -137800, -102766, -92453, -83054, -108542, -162506, -74766, -28206, -30114, -37082, -77679, -46993, -21875, -25731, -2605, 33545, 50255, 86141, -38188, -159610, -150393, -129638, -89015, -75768, -8138, 17224, -79953, -149371, -137451, -117914, -129436, -69443, 18710, 13261, 5783]
16177E783o5477o8090L4949J9214m7253p5727P5156N984O9419q379J8718P616
16165b8087l3001J5170m9138q6630k5264O1627Q0543o6970J2159O1455q255K575
16153f3816j5693k8937j27582l5609Q6770M9602N2430Q2575L0294n7419J0042
16142a7343O1781q3104Q552Q665p1417n4733n6352O5387J17027m6211o9962J1782
16130a25928J3668j8353p8062K662m10j4345J4539k6172K7342M9924K073Q333
16118a44729O0261K0831K4716M9061K6045l611m8548M242L7142j1573M278K3283
16106D1398p695O0816K6137l8328q2659j01734q5098P8522K9425l5759J5645O573
16094i2757K1945j0736M0454L5560k7518k0775K7891j319Q70p6577j00048j4513
$$ y = [5783, -59694, -127784, -92835, -73621, -120874, -196601, -121445, -115461, -46042, -54421, -35703, -28087, -61088, -45918, -95056, -181686, -206950, -145323, -64780, -131750, -119591, -58136, -66391, -63816, -79509, -108446, -236028, -271637, -184867, -135265, -82835, -260, 30034, -27385, -17343, 44438, -38666, -30114, -21449, -92866, -147599, -203951, -138564, -21537, -67748, -137710, -125928, -112260, -130613, -208675, -206013, -206423, -220768, -206229, -232401, -205059, -155135, -153062, -144729, -84468, -63637, -38921, 10140, 36185, 32574, -15974, -11732, 25410, 13837, 18115, 41398, 33703, 94519, 120656, 82328, -331, -102065, -187163, -108641, -79216, -114975, -99330, -92757, -70812, -81548, -41094, -5534, -33052, -53827, -25936, -27255, -26385, -102962, -203010, -217523]
16082b17523P5925L3483k6833n9093J4453M8812J3315J07125P0885n2360L129
16071A1318k9854K1311k3159o5981K0569J02515j8662O307O032n367r3429J9243
16059d9157J06649j9989n3313k8489M6897j1458K3893k1589q2714m4633k2787
16048a56690K1002M8176J16358Q3358M8193k2674k6901j2033k477k5058m8769
16037B2485O497k1030K7100L100o0472M7989j4190q954L4032q5068q0911J33587
16025D165M0307l3682k0622K3544R64n5889p7398l2149N11k5904N6575N0977O1475
16012g126J15582j6318m1086j1279K1308j1557o294k3182J38L5147m4746m1730
16000c1143p2560N5625L4853k5833K2204n039R098M3044p5319m8962N0312L0512
$$ y = [-217523, -141598, -108115, -134948, -194041, -179588, -130776, -117461, -10336, 60549, 8189, 11318, -18536, 2775, -20384, -86365, -65796, 36719, 18057, 24364, 30396, 25029, -68400, -49157, 57492, 37503, -15810, -44299, 2598, -8860, 15033, -6556, -89270, -133903, -156690, -135688, -87512, 28846, 112204, 160397, 137723, 110822, 98789, 96312, 71254, 22485, 28982, 7952, 35052, 38152, -22320, 25669, 11479, 2525, 36557, -48511, -129422, 4165, 44472, 10790, -9832, 13712, 14676, -41213, -118611, -150760, -150249, -176153, -119578, -68601, -7126, 108456, 92138, 51052, 39773, 61081, 49524, 43230, 20048, 20186, 55333, 10587, -31143, -103703, -48078, -13225, -39058, -16854, -21893, -12795, 30249, -45070, -94032, -43720, -13208]
15988a3208k8279K6071o250j0307j0147k7993j7150L5530K0203N5828N673j2237
15976A7734l5903o5405N8315l7310j16359O8665M4144l0651j8452P6961M5519
15965G258l1763l4117L4757j7371p721j10442N616L0102K2144N8257M4732J914
15953C366P920M3051j0459j20579m2669n1422K167J36632N3753j20743j10682
15942b09665N1899j2738N9821N2001J3208L6032J4883m7574j9447m6013j9265
15931a26858k4421P6990J3582M4873j0810m9786K5780Q606J0672l6858K1410o7420
15919a14240k9107O1893j895p6423M3257M002l57m6146l024N6971O7739l5024
15907g2354l6570P159P7929O1284k9489q4356q5986n0319q8288M7308R5642j164
$$ y = [-13208, -41487, -15416, -21666, -31973, -42120, -70113, -87263, -51733, -31530, 24298, 29971, 17734, -18169, -83574, -25259, -62569, -178928, -110263, -66119, -96770, -115222, -38261, 7258, -24505, -58622, -23865, -41236, -48957, -159399, -153783, -123681, -101537, -43280, 1452, 3366, 11286, 54337, 43878, -76701, -119370, -170792, -168625, -31993, 21760, -98983, -209665, -157766, -170504, -110683, -58682, -45474, -9442, 5441, -42133, -61580, -107593, -126858, -151279, -74289, -60707, -15834, -26644, -76430, -50650, -42044, -31372, -68230, -46820, -114240, -143347, -81454, -83349, -159772, -116515, -112513, -112870, -159016, -162040, -105069, -37330, -72354, -108924, -101765, -23836, 37448, 7959, -76397, -162383, -212702, -300990, -253682, -158040, -159204]
15895a59204k7857Q7749Q1451j5309n5928N1551J3056J2145l959k0952k6904j2032
15883g6193R924K2492L4929M1460K2896j670m5356l3548L0340O5406p4269l1345
15871c4934K7765r287m3538l4100L405K7894o532o1650k6244O5398J6333l506
15859g8996q8785J0345J24944J3543l9674L48j6157l1366M4766L2942J2184o8277
15847h4183j7565M0383N2108L6717M2472J02614q0479j48872l9285K7576O6158
15836b356j2611L1787P047m2899l487M5369K6159O1536K5023k9952l8244m437
15824F2935K8990J966l467j9246k8435N8287j3159q8427K227o3460k1299R4579
15812A1491L2636r406j6883l1376l056q009n357l0403q8393K5260L9388k794P3937
$$ y = [-159204, -187061, -99312, -17861, -33170, -89098, -37547, -24491, -12346, -16305, -37257, -64161, -76193, -66269, -43777, -8848, 32612, 55508, 53838, 8482, -25066, 5274, 70680, -3589, -34934, -7169, -16456, -59994, -94094, -90689, -62795, -69327, -130977, -157221, -91823, -75490, -78996, -167781, -157436, -32492, -18949, -58623, -58275, -74432, -105798, -61032, -28090, -15906, -84183, -101748, -61365, -9257, 27460, 69932, 172546, 92067, -56805, -96090, -68514, -2356, -14967, 16820, 23867, -19032, -22519, 22850, 49009, 110545, 135568, 105616, 67372, 62935, 91925, 93891, 90424, 71178, 42743, 101030, 87871, -556, 1671, -61789, -83088, 11491, 44127, 34721, 17838, -13538, -16594, -24603, -29960, -60363, -148756, -123496, -84108, -86902, -12965]
15799a2965m1244l616K6371r5941L3910P5857o25n6031L1179k483M5605l1209
15787c1192l3300Q8669J8551m161n6684q5502l9549j4675Q3623M7898O9643N446
15775D8767n3838l5009r7432m4007K6034Q9699J18290o21l6510j5110R489l9296
15763b9544m8061N9672P2524j857k7448p7751O003k0621Q8042O0161o9040o5951
15751e3871K1075L7367k5788J2507o1623m9584J5941P4983K4374K9525j4266j29312
15739a18672j26556n6672L0003L8009L2225R7036M1096k1271R0138K1291p804
15728A8823J0230k6936r8063j9389n353Q7669L5212k9728k8767L994j6510n2411
15716a21229J0605p0229J4852J7372k0691j3860J5585P9102j9018L5641P8228
$$ y = [-12965, -54209, -57825, -31454, -127395, -93485, -17628, -18253, -74284, -43105, -45588, 17, -31192, -64492, 24177, 42728, 38567, -18117, -103619, -143168, -157843, -74220, -26322, 43321, 48767, -5071, -40080, -137512, -181519, -155485, -65786, 52504, 51883, 15373, 263, 9752, -29544, -77605, -17933, 54591, 52734, 25286, -52465, -46462, -67083, 20959, 81120, 12080, -53871, -32796, 4571, -21217, -8710, -70333, -119917, -103976, -28993, -4619, 24906, 10640, -118672, -245228, -301900, -271897, -233888, -201663, -104627, -63531, -84802, 5336, 26627, 18823, 29053, 2117, -95946, -115335, -120688, -33019, 2193, -27535, -56302, -52308, -68818, -121229, -110624, -180853, -166001, -148629, -169320, -183180, -167595, -88493, -107511, -71870, 6358]
15705F358n7644o5714L0789m03J4814M6173L1975J7028M3699K8399m0700j11040
15693e6266m7936k488k7739N6631K2679J4159J2746r7473M526N2378J9396J54325
15681A04938Q283m2103k2862j6104j7692K9263r031K7194n2895L143j1631p4038
15669g3535o8913L4772Q9280j1611k8885k874P2932M7844l949n0581k2858M7496
15657B9118M4745P9986J8380o8201q1549j8813J8151k4437j07794k1558L2020
15646i9952Q4768L0223L413K3065l9757r7029L1321P8631P821o5112o3883j7351
15634a23842L8676L479K1640l0238j5175m8634L4760L6236o1767J40559J22940
15623A18634k9756l8271k3214j5058J1235p6156o7711J3836O5581k7913K2673
$$ y = [6358, -51286, -117000, -86211, -86614, -71800, -25627, 6348, 23376, 67075, 95474, 54774, -56266, -104202, -106690, -134429, -77798, -55119, -40960, -28214, -125687, -121161, -68783, -49387, 104938, 113221, 71118, 48256, 32152, 14460, 43723, 34692, 61886, 8991, 12134, 503, -73535, -142448, -107676, -18396, -30007, -58892, -61766, 11166, 59010, 55061, 4480, -18378, 29118, 73863, 153849, 172229, 104028, 22479, 3666, 21817, -2620, -110414, -131972, -99952, -15184, 15039, 18452, 41517, 1760, -95269, -63948, 14683, 22504, -42608, -106491, -123842, -85166, -81687, -60047, -90285, -105460, -154094, -119334, -83098, -144865, -4306, 118634, 88878, 50607, 27393, 12335, 23570, -52586, -120297, -106461, -40880, -68793, -46120]
15612d6120O3773M9254L702p568J1507L8082o0816l1140J6050m1376j3543k9789
15600d7984J850Q5786N919l4438p8384q9179j1746M4084P3631N4612l2271r9387
15588a27507M727J20832m860n0390M0426L9096K5206q149R2061o4172K4620r2757
15576h67p3314L9804J2233k3413j1893N2491M469l8519J6331N449j9917q140L0394
15563a4892m4521j1674L901j063K8978n0174q1419l2748m2078J00547M7613L9212
15551e8318Q6572Q4415m7592j36770k4424n3195m68p668k6951M238P8379M2635
15539e9147m4096q0544k202J28313J487o7267k1618M1603K6681j4392k1508o3199
15527a75889m9324N0118o528k3089n014L9222N8013L1440M8884l7237k6380K2239
$$ y = [-46120, 17653, 66907, 70609, 63041, 74548, 112630, 51814, 20674, 36724, -4652, -18195, -47984, -46134, 39652, 45571, 11133, -67251, -156430, -168176, -124092, -50461, 4151, -28120, -127507, -122780, -1948, -6808, -57198, -16772, 22324, 47530, 39381, 131442, 67270, 91890, -867, -74181, -34377, -22144, -45557, -57450, -4959, -490, -39009, -22678, -17229, -37146, -45286, -14892, -59413, -71087, -67186, -68249, -39271, -89445, -170864, -203612, -245690, -145143, -97530, -58318, 28254, 112669, 65077, -71693, -96117, -149312, -149780, -157448, -184399, -180161, -101782, -59147, -103243, -183787, -185989, -57676, -56189, -123456, -145074, -103471, -76790, -91182, -112690, -175889, -225213, -175095, -181623, -204712, -209726, -170504, -112491, -81051, -32167, -69404, -95784, -73545]
15515g3545m673o327L1658J7662k5142k3838N5205l1078M4334L5860P7745r4885
15503B976m6128J4872k0622N0667L8298l0787N9248m3937j43083M3993l58l2692
15491a07553P4896M6968L1408J0855k0054q4941j01616r891j2183P9971K5422
15480f6718Q9075m792j42253J0968P2264J6047j8204n1288O5863M5686k0074n2899
15468e6325R0699q3689o7541j8752N1048M2635p295j4872J3705j2736O4965J3266
15456A5108k5145m6287Q3664k2540K5814o6578o6799K6615N8183N2827j1176o5883
15444d2197j3157R3028k4899j3465k4389M2811L2271j1508n0001K2910M1876m8000
15432E280j2963J9475p566j02292l0673P9170K7855l6608j2256L1361M6997l2133
$$ y = [-73545, -78218, -84545, -52887, -35225, -60367, -84205, -29000, -60078, -15744, 20116, 97861, 2976, -43152, -28280, -48902, 1765, 40063, 9276, 68524, 24587, -118496, -74503, -74861, -107553, -32657, 14311, 45719, 56574, 36520, -48421, -150037, -159928, -172111, -92140, -66718, 22357, 17565, -124688, -113720, -41456, -25409, -43613, -94901, -29038, 16648, -3426, -56325, 34374, -49315, -116856, -135608, -84560, -41925, -49220, -64092, -50387, -63123, 1842, 15108, -10037, -56324, 27340, 4800, 30614, -35964, -102763, -76148, -17965, 34862, 23686, -42197, -55354, 37674, 12775, -690, -25079, 17732, 50003, 38495, -11506, 11404, 53280, 5280, -7683, 11792, 4226, -98066, -128739, -49569, -21714, -58322, -70578, -39217, 7780, -24353]
15420b4353m1072o6488m087K9977L5640K2849p9110l7828L4914K9339L9087l5506
15408i6638P574o4247P430k4758J0786J8582P1334N6957K3245j12874N761l7187
15396a34035R387O1720K41l9703J4192K7627l6272l7899K4571l728p9618K1363
15384a72154N7395N8980N336m2955k4685P2259P8958p9842m0229M2065p7885J2287
15372a10470n019K829o205K7654J4999n0160j7495J20603M4900m4397j33384R745
15360a46400M1930N482L4825Q3501l5122o98m9769l8553P8004J18897K651q5350
15348I398l6480K3031P809O9412J2001k7840J6370K82j0489l7570m7348j5476
15336c6900o765O6051N3333q5222J389l8457k535N3429M6884K6850k1716o4761
$$ y = [-24353, -65425, -131913, -136000, -106023, -70383, -47534, -126644, -164472, -129558, -100219, -61132, -96638, -89064, -153311, -145881, -170639, -159853, -141271, -69937, -12980, 10265, -102609, -96848, -134035, -124648, -62928, -62687, -102390, -88198, -60571, -96843, -134742, -110171, -113899, -193517, -172154, -114759, -55779, -50443, -93398, -118083, -45824, 33134, -46708, -86937, -44872, -122757, -110470, -115489, -112660, -118865, -91211, -76212, -126372, -143867, -23264, 21636, -22761, -156145, -146400, -104470, -98988, -64163, 19338, -15784, -16482, -66251, -104804, -26800, 92097, 94748, 9398, -27082, -4051, 3758, 73170, 85171, 57331, 73701, 73983, 63494, 25924, -21424, -36900, -43665, 22386, 75719, -9503, -8114, -46571, -49106, 4323, 51207, 78057, 56341, -8420]
15324h420j6512n6522m5746J5693l4249J1219J04359O2795k007m496N2731Q6474
15312A65319N0715j5854m3880N1395O1957O7250J07171J50414K15744K07211J09250
15301A126692Q1794L3257j28422k35464k24118k38884j15913j7569l727p9276
15291A98370m0922L029p7200k8827L8512J8634o2942k1866k8420k6506J7110L2972
15279B1944o234o0978J9536j546n3175j136k9114n5905N1842O7187K9619o5170
15267h3130L7428M7562j5020l2146J9176l6205J7593J9405L6123l4614n078O3014
15255C4108o1885k7328K7351J5404J7536o6328q773q735K1352L9148M8992O2888
15243I3730j5923j04483k6128l5281M5292J2601l2567P7852P2435q923o827j1016
$$ y = [-8420, -24932, -81454, -127200, -111507, -145756, -134537, -30178, 32617, 30610, 26114, 78845, 165319, 216034, 200180, 156300, 207695, 269652, 336902, 444073, 594487, 810231, 1017442, 1126692, 1208486, 1241743, 1113321, 877857, 653739, 414855, 298942, 281373, 277646, 198370, 157448, 160477, 83277, 54450, 92962, 111596, 48654, 26788, -1632, -28138, -11028, 21944, 15710, -45268, -25732, -27278, -80453, -81589, -110703, -166608, -114766, -47579, -17960, -83130, -45702, 1860, -13160, -45306, -26130, -62335, -44742, -25337, 10786, -23828, -28906, 34108, -27777, -55105, -27754, -12350, 5186, -61142, -69915, -78650, -57298, -18150, 30842, 93730, 77807, -26676, -52804, -88085, -42793, -30192, -62759, 15093, 87528, 78605, 71778, 60762]
15231F0762l0380k9673p3131J2085L6143K0737J29919J0112n4152k6097N2411
15220A08736j012m7511p3800n1975o691K0160o38Q7787j934n2079l0157K6793
15208b2321j0210j307p7638j6329j5806j7199J243L0134J02599Q7038j4876N700
15196E1028l5169L6603l5445Q16L8082L8436l1440j10027o7526L8376N7808P1884
15184E3426N9301K7629q3302k4889J33354j15677n1299m964r8022k7793K0484
15173a11752L0314K4236k0445n966m715o0078l4062J5717P5057N5562Q9987K1651
15161G5506q0778r5536K0605N2248q2981L20q154L6390Q1508O6165J3361k9846
15149D8808l2605o9639J790j7274j3966L4444R0963p0599K519j4530M1567j1720
$$ y = [60762, 30382, 709, -72422, -60337, -24194, -3457, 126462, 136574, 82422, 56325, 108736, 107724, 60213, -13587, -65562, -72253, -52093, -52731, 35056, 33122, -18957, -49114, -22321, -32531, -33838, -111476, -127805, -143611, -160810, -159567, -129433, -26834, 60204, 45328, 51028, 15859, 52462, 17017, 17833, 55915, 94351, 62911, -47116, -114642, -76266, -18458, 53426, 112727, 140356, 57054, 32165, 165519, 49842, -1457, -6421, -104443, -132236, -111752, -81438, -57202, -77647, -83613, -88328, -148406, -182468, -166751, -91694, -36132, 53855, 75506, -5272, -100808, -80203, -27955, -110936, -110616, -118770, -82380, -872, 65293, 78654, 48808, 16203, -53436, -51646, -68920, -82886, -48442, 42521, -28078, -25559, -40089, 1478, -10242]
15137a0242j46197N0045R6518P865R8447J26489k8105k878N8413M4109p938k7058
15125B59468o4811p012n8666J4706O3118l298m5508j3440m481K0605o0248j33182
15113c2749q0323M7571J9486m2977k2963J43117J2932k8043M6415m3598l7802
15102a8934L6496L3684J4668M9283q0936j27816q177N6839J48607m477o5068m7986
15090a3817R413N3339j8411q3376j5768o1523r6734R760Q9762J04014L7667J3640
15078B7966q160o0439p3570o4526k6765K4587R04J5465n6467l6381J34908R9158
15066b3320m0563p756J820n736N6906N0068n6837n4832p916J2623L7019K0333
15054a8191k5512m0459m1582m152Q0067L5369n5973n6366j2861L8497L8365k1850
$$ y = [-10242, -156439, -106394, -9876, -2011, 96436, 222925, 194820, 191942, 250355, 294464, 286526, 259468, 194657, 187645, 128979, 143685, 206803, 203505, 157997, 144557, 140076, 160681, 100433, -32749, -113072, -65501, -46015, -88992, -111955, 31162, 44094, 16051, 62466, 18868, -18934, 17562, 51246, 65914, 115197, 34261, -93555, -101732, -44893, 103714, 99237, 34169, -13817, -4404, 48935, 30524, -52852, -68620, -130143, -226877, -217117, -127355, -23341, 14326, 27966, 19806, -40633, -114203, -178729, -205494, -180907, -180003, -164538, -221005, -257386, -122478, -23320, -63883, -71639, -69819, -75555, -18649, 31419, -25418, -80250, -88166, -75543, -38524, -18191, -43703, -84162, -125744, -129896, -49829, -14460, -70433, -126799, -139660, -101163, -62798, -84648]
15042h4648r0959m4785O6296J59059M20M5782K5951l1166m6664N167J1348j6177
15030c76j19176q6278L5021O2075k7694M7857k7246Q696L0865M5311r2787j8933
15018a42665j6448K6655j3497O866O0691l1346K550O3351M0781l3589j1084q2768
15006a30503q931M6712L3313L189L1970j1641J4424M570m1769O1663L3554J1532
14994D8083n4833l4700q1749m497R1809L9676N4536L5334j2676m9681j3753K5187
14982D2736n753K0661K7132j3704j61586m6137P2469L891O0601k1038M729P6287
14970F0288O226j8635j5148J1263n5996m2354k8266M6398M0382P3563n8658q590
14958A0473P7391J342m8336Q755M6662n9374J298m896O7140j1790l6585M33K9862
$$ y = [-84648, -175607, -220392, -154096, 4963, 5383, 51165, 77116, 45950, -714, 4453, 15801, -376, -119552, -205830, -170809, -108734, -136428, -88571, -115817, -107121, -76256, -30945, -123732, -142665, -159113, -132458, -145955, -139089, -78398, -109744, -107194, -43843, -3062, -36651, -47735, -130503, -139434, -92722, -59409, -56220, -24250, -35891, -21467, -16897, -58666, 2997, 36551, 48083, -6750, -41450, -123199, -127696, -35887, 3789, 58325, 93659, 80983, 31302, 17549, 42736, 36983, 57644, 84776, 71072, -90514, -136651, -64182, -60291, 310, -20728, -15999, 60288, 66514, 47879, 32731, 43994, -12002, -54356, -82622, -36224, 4158, 77721, 19063, 10473, 87864, 89206, 40870, 49625, 96287, 36913, 38211, 33315, 100455, 88665, 52080, 52513, 82375]
14945H2375L4455m5019j15493l5628M4037O1282l670N2382j5541q7573j8166n3331
14933i9890J7426j52m3359O7748Q759o4726l0Q4722J41384o2622j23848l0557
14921a05145J317K7756k8692M7559J8899k5625l4181N4183O5999k8658J4662J5489
14909B3563k4535N811o2759o352J4964P0906R371K2473o5290M1672J5946l312
14897D2458O2824M2976L6442j0086k7799J2654l5871q0287j00055K6586J9946
14886a0212n698K8770P3155j1804J43600R4136p7611p350l6585O9852L4712q0197
14874B14768J8704r001m698K0167Q3400M0382R225N6570j1614R11n0149o3571
14862C05094m7997N0386M512n6194n44k9803L044K6791K4684O985n6317n442L167
$$ y = [82375, 116830, 71811, -43682, -79310, -35273, 26009, 22339, 74721, 59180, -28393, -46559, -99890, -82464, -82616, -125975, -58227, -49468, -114194, -114224, -29502, 111882, 49260, -74588, -105145, -103828, -76072, -104764, -57205, -38306, -63931, -98112, -43929, 22070, -6588, 8074, 23563, -972, 4839, -57920, -64272, -49308, 21598, 30969, 53442, -11848, 29824, 45770, 42458, 105282, 148258, 184700, 174614, 146815, 159469, 123598, 43311, -56744, -30158, -10212, -15910, 12860, 86015, 74211, 217811, 311947, 234336, 226986, 190401, 260253, 294965, 214768, 233472, 224471, 219773, 239940, 323340, 363722, 372947, 429517, 417903, 418814, 368665, 305094, 257097, 307483, 311995, 255801, 255257, 225454, 228498, 255289, 279973, 286958, 230641, 225199, 228366]
14849B28366J9088P4323l3769o6916o577m3013l3942r5243K87P4404R4785N4861
14837B66654m6533n2936m5616J4580k8250m412N7505j5604J1196j0665k0598r0480
14825C4841k1498P3754K3690N526O6196l8328M2947j3162M0048R5264J00116P0354
14813D79748l2536K1495L9327m3230q6198l8398j9456l5049R3829k322n3808r0044
14801B33358M559o900k6111n5173k6056N9351K3938k8524l5811M6194Q8071j3829
14789B63067m7463L1664N1871M7317M2745p238K3128k4573J3169q6452p1332m2592
14777A93311m023l3077J7845k5153l1183j00622l6702Q7562M8751K4491m6873
14766I4327L5534J5899r0854J6045K2322n9310j4398n9122J00583J06094J2880
$$ y = [228366, 247454, 321777, 288008, 221092, 214515, 171502, 137560, 42317, 42604, 117008, 211793, 266654, 220121, 167185, 121569, 136149, 107899, 103487, 160992, 145388, 156584, 145919, 125321, 34841, 13343, 87097, 110787, 116313, 182509, 144181, 187128, 173966, 214014, 309278, 409394, 479748, 447212, 468707, 508034, 464804, 378606, 340208, 320752, 285703, 379532, 377210, 323402, 233358, 237917, 231017, 204906, 149733, 123677, 183028, 206966, 178442, 142631, 188825, 276896, 263067, 215604, 247268, 299139, 346456, 389201, 381963, 405091, 380518, 393687, 307235, 235903, 193311, 189288, 156211, 174056, 148903, 117720, 17098, -19604, 67958, 116709, 141200, 94327, 129861, 145760, 54906, 70951, 93273, 33963, 19565, -39557, 61026, 167120, 180000]
14755A80000p1511R13k3740j9575J16M7488j541n5148K805n0974o3533N8601J14014
14742A17915r7511k9917j284R5128J07136j0610K6002J7749q6410q3253m7281
14731G664J670r243m844J04726K4531p933k6732L856J01572j9522j48200j6218
14719A1327Q0101M052O1795j658l7671k4980o6661N6957J05002J244l6436P103
14707A60175l106j3571L5159n7025n2322m3729N2943L6341J0974J126M7278n2341
14695A21902l6880L1383R2480k4248m3147k0862K2080K0640p224j3483J08502
14684B51143M644j1316Q542J18143N4778n8986m096Q6509J63789Q5191M4400J23172
14672H65913Q8952J60103J37633J48896J07675K1385L6062J4894J7741r7289k47397
$$ y = [180000, 108489, 109402, 85662, 66087, 66203, 113691, 112150, 57002, 59807, 8833, -54700, 3901, 117915, 20404, -9513, -10797, 84331, 191467, 180857, 206859, 224608, 138198, 54945, 7664, 9334, 91, -4753, 99973, 124504, 116571, 89839, 93695, 195267, 175745, 27545, 11327, 91428, 95480, 157275, 155617, 117946, 92966, 26305, 83262, 188264, 189508, 153072, 160175, 157069, 143498, 178657, 121632, 69310, 25581, 78524, 114865, 125839, 126965, 174243, 121902, 85022, 116405, 208885, 184637, 141490, 120628, 142708, 163348, 156124, 142641, 251143, 255787, 244471, 253013, 371156, 425934, 366948, 362852, 449361, 613150, 698341, 742741, 865913, 954865, 1114968, 1252601, 1401497, 1509172, 1530557, 1566619, 1581513, 1599254, 1501965, 1254568]
14661A254568j18015q8065j19926l4355p1097j1114o0516q5217k55193j14625
14651B96445m8348P0567j3617k5382l4121J309J9987n351Q8214q1035j14134l7933
14639A16601r396J7984J6168l1269o450k697m9780j12980L0906J4814J7146O7563
14627F8610k965l1985P0860J5775j5707m7988j9150j4558J243J17874m616j07402
14615B9991J3374P5270O2349j25891q7081m639O8131m3312N3473J01240N6229
14604A99134j9818m3825M3023O4861l3642m8024k5113J4331q9968o0403N5095
14593E5651R7681M9739j9089j02235j8660K8393m1171m74K0171K4007q5584k2171
14581a3742J13509N5535r3462j12179m0479K3789L7214p642P1743N1757j1017
$$ y = [1254568, 1136553, 1048488, 928562, 894207, 823110, 811996, 751480, 666263, 411070, 296445, 248097, 318664, 305047, 279665, 245544, 246853, 266840, 261489, 349703, 268668, 154534, 116601, 107205, 125189, 141357, 110088, 103638, 100941, 51161, -61819, -30913, -16099, 1047, 68610, 65645, 33660, 104520, 120295, 104588, 56600, 37450, 22892, 24135, 142009, 137393, 29991, 43365, 118635, 180984, 55093, -31988, -36627, 31504, -11808, 41665, 142905, 199134, 179316, 135491, 178514, 243375, 209733, 161709, 136596, 150927, 60959, 556, 55651, 153332, 203071, 183982, 81747, 63087, 91480, 50309, 49835, 70006, 94013, 8429, -13742, 99767, 155302, 61840, -50339, -90818, -67029, -29815, -37457, 34286, 86043, 75026]
14570G5026l6061j8262o7717L6235J53682L069o0462j7720M4834j1007n675J397
14558I7339J7701j9442j0658O4121J1811K0205j3641q7264j0256j102O9607l2099
14546A06322l927k6943j13149k1954P5119l606k2176k620J9622M0417J0559l2342
14534B5322K5735k2358j63231J6825N9295l3312m2756l1412Q6749J4623m5451
14523a09971n7638j9190J7769O9099O7756K7273j4505J4048J874m0575O2001Q9938
14511A07879Q2806J7124J9835M8513J13613L0628J317O1399p600L5482j02772
14500D08224m7302J9774n8571o0202k2575O0962j0845l5999K1673M0520L1360
14489C47019j10762j4323P2145j8171N2308K4782r0062j33162l5642L8895N8536
$$ y = [75026, 38965, 20703, -47014, -10779, 142903, 145972, 85510, 67790, 112624, 101617, 95942, 97339, 115040, 95598, 84940, 149061, 160872, 181077, 167436, 80172, 69916, 68814, 138421, 106322, 102395, 75452, -37697, -59651, 15468, 11862, -10314, -12934, 6688, 47105, 57664, 25322, 51057, 28699, -134532, -117707, -58412, -91724, -134480, -165892, -79143, -64520, -109971, -167609, -186799, -169030, -99931, -32175, -4902, -19407, -5359, -3485, -44060, 17941, 107879, 190685, 207809, 227644, 276157, 389770, 420398, 421715, 483114, 475514, 510996, 408224, 360922, 380696, 322125, 261923, 239348, 300310, 289465, 253466, 275139, 315659, 347019, 236257, 221934, 294079, 275908, 328216, 352998, 262936, 129774, 94132, 133027, 191563]
14478A91563J17138R0257J2054M476o8830j1871k4154L3822N97l5245l1443J5902
14466B94266K9382N9415p1352o3153k6976L6961r9509L0193J14385R2440l3383
14455C62669p8870P7546j0794m2202k238K2197m1498n0841l684l0607n5982k521
14443A43175L7827m6775J4171O0796K5995L9113N9828j9317r7858o2853n8217
14432I5885o07L4404N4987j01996q4599K3837N2590M0618J3957M8978J5357m125
14420A89286K6365m353J3935p8832q1288N988k6404L1401m39j3327n2027J3597
14408B3902n5834J62970R1768j5467O9900L1130l4907j9846n4606n8237O4314
14397B05087k271j7506R0277K5799n9623r1701L6502M0162P2635O1405j01704
$$ y = [191563, 308701, 398958, 411012, 415488, 346658, 334787, 310633, 344455, 345052, 309807, 278364, 294266, 323648, 383063, 311711, 248558, 221582, 258543, 159034, 189227, 303612, 396052, 362669, 283799, 361345, 350551, 308349, 306111, 328308, 286810, 235969, 232285, 201678, 145696, 143175, 181002, 134227, 148398, 209194, 235189, 274302, 334130, 314813, 216955, 154102, 95885, 95278, 129682, 184669, 82673, -1926, 21911, 74501, 115119, 129076, 178054, 193411, 189286, 215651, 211298, 225233, 146401, 65113, 71101, 44697, 76098, 75659, 62332, 10305, 23902, -31932, 131038, 222806, 207339, 277239, 308369, 273462, 253616, 199010, 140773, 205087, 202816, 185310, 275587, 301386, 241763, 150062, 186564, 226726, 299361, 360766, 259062]
14386B59062p2647R582n1345l1676q6315q0066P8688R0523N8070k4776K8272j2946
14374A64426J9516o744L8605O4170o1017r1633L4795J17075Q3054r0286P459M0777
14362C20197N110p812K3553L2410J6589m2334l8948N0674j5633l3025l9850N3739
14350C24670M4617L1991p195r36j9560j6234m8102o494K4003K6567m0707J9435
14338C32055J05350P3716J4374Q6803J21367p1392j8494J13845J22581Q7532J4995
14327I82732j6459J1458N2808k4859n4576m5159J42817J16174K8467q4422j04700
14316A004281m107J9952P903L789J3222J9404R3733O8287n188n5337K3428K4582
14304A213949K8702R824m2526K7251O7421N6915R4717R0725M8952N3610K1297
$$ y = [259062, 186415, 195997, 144652, 112976, 26661, -53405, 25283, 115806, 173876, 149100, 177372, 164426, 183942, 177198, 215803, 279973, 218956, 127323, 162118, 279193, 362247, 271961, 279420, 320197, 325307, 317495, 341048, 373458, 390047, 347713, 308765, 359439, 343806, 310781, 270931, 324670, 369287, 401278, 394083, 393147, 373587, 357353, 309251, 302757, 326760, 353327, 312620, 332055, 437405, 511121, 525495, 612298, 733665, 662273, 643779, 757624, 880205, 967737, 982732, 966273, 977731, 1030539, 1005680, 951104, 905945, 1048762, 1164936, 1193403, 1108981, 1004281, 1000174, 1020126, 1028029, 1031818, 1045040, 1064444, 1158177, 1226464, 1221276, 1165939, 1189367, 1213949, 1242651, 1252475, 1209949, 1237200, 1304621, 1361536, 1456253, 1546978, 1595930, 1649540, 1670837]
14293A670837N0654j6119M5573P7830K4731L9121R5976L2232P9231O5828O4498
14282B230392M8982J49331J01676N0922J17505J43817N7749R3976J81787J42450
14272C318587J35526P7487J29441J84566J76400Q4687J35754K10173J91416J31405
14262D775442K35927L22469L20416K41541K50493K92499L19366L77498M24029
14253G559680N27076M54312L77640M82578N64687O77562O94501O86606P25476
14244A2750118Q12263R86869J139736J138797J275172J479219J505440J763535
14236B2851149K097486K270738K565613K972531L372413L918646M526845N190072
14228D9765493O005845O917292Q099273R544309J1330803J3392465J5852112J8623708
$$ y = [1670837, 1721491, 1705372, 1750945, 1828775, 1853506, 1892627, 1988603, 2020835, 2100066, 2165894, 2230392, 2279374, 2428705, 2530381, 2581303, 2698808, 2842625, 2900374, 2994350, 3176137, 3318587, 3454113, 3531600, 3661041, 3845607, 4022007, 4106694, 4242448, 4452621, 4644037, 4775442, 5011369, 5333838, 5654254, 5895795, 6146288, 6438787, 6758153, 7135651, 7559680, 8086756, 8541068, 8918708, 9401286, 9965973, 10643535, 11338036, 12024642, 12750118, 13562381, 14549250, 15688986, 16827783, 18102955, 19582174, 21087614, 22851149, 24948635, 27219373, 29784986, 32757517, 36129930, 40048576, 44575421, 49765493, 55771338, 62688630, 70787903, 80332212, 91663015, 105055480, 120907592, 139531300]
14220A39531300K1498425K4028641K5692227K5639062K3127819J7979923J0382128
14213B87879525J413424p759913j5754037k1665107k4862261k5582092k4327537
14206A69342002k2100767j9400255j6696263j4052254j1865895j0093746q589316
14199F6543506p356946o315710n529259m936894m306856l707662l233153k801798
14191B8355228k466393k294882j860311j671434j559602j391721j251681j006204
14183A4853000r72739r10917q09400q20104o66813o67697o78396n34715m23612
14174H368607l60984m42925m20985l76171k44345j74580l15891l09221j94152
14165E529353k17451k21931k52544j60642k31293k69593k87492j92752n3752j11461
$$ y = [139531300, 161029725, 185058366, 210750593, 236389655, 259517474, 277497397, 287879525, 289292949, 281533036, 265778999, 244113892, 219251631, 193669539, 169342002, 147241235, 127840980, 111144717, 97092463, 85226568, 75132822, 66543506, 59186560, 52870850, 47341591, 42404697, 38097841, 34390179, 31157026, 28355228, 25888835, 23593953, 21733642, 20062208, 18502606, 17110885, 15859204, 14853000, 13880261, 12969344, 12159944, 11339840, 10673027, 10005330, 9326934, 8792219, 8368607, 8007623, 7564698, 7143713, 6767542, 6523197, 6348617, 6032726, 5723505, 5529353, 5311902, 5089971, 4837427, 4676785, 4445492, 4175899, 3888407, 3695655, 3641903, 3530442]
14155C530442j46026j03780j72870j60895l013n375p9761j29604q2044L9738j70740
14144B516072j95464n9907p6449o650n9261l1302j3560n1720p3330o3081p2867
14133A812481k280q6758j10655p7121r8762r3582n6632L7689N9510n675p9143
14122A299072o9006l3818r218o5947n2771J9064J0707n5031q7738p9038m0857
14111H35419l2783K6479L7342N639m1928j6239j10919o8324l906N727J9458K8422
14099F84387P7220j4478k5400n7880K301p2764L3824O7125M0933K5743J2845O9376
14087H43232N4829M463K6976P1360l028J9807l9622q3735O792q3882p842j3825
14075G95525p127K0968o591o7159k3689j8649Q02o515M6764m7321j00731J9946
$$ y = [3530442, 3384416, 3280636, 3107766, 2946871, 2943858, 2938483, 2858722, 2729118, 2647074, 2686812, 2516072, 2320608, 2260701, 2184252, 2177602, 2118341, 2087039, 2073479, 2021759, 1948429, 1885348, 1812481, 1810201, 1723443, 1612788, 1535667, 1436905, 1343323, 1286691, 1324380, 1383890, 1378215, 1299072, 1230066, 1196248, 1187030, 1121083, 1068312, 1087376, 1098083, 1043052, 955314, 876276, 835419, 802636, 829115, 866457, 872096, 830168, 813929, 703010, 634686, 630780, 636507, 655965, 684387, 761607, 747129, 721729, 663849, 666150, 593386, 627210, 694335, 735268, 761011, 773856, 843232, 898061, 902524, 929500, 1000860, 997832, 1017639, 978017, 894282, 901074, 817192, 809350, 795525, 788398, 809366, 802775, 735616, 711927, 693278, 694080, 687565, 734329, 687008, 586277, 606223]
14063F06223P5301l1725m6921m2330n5202l9612Q258N4361K4123o4837o2222R5312
14051E20729m0594q5728n2924L3235J05519J5568J4645k2694m1339j2918j085
14040D32414J27196O7102K8923l2110m0929o6466l5512k9898l4488j3225L8434
14029D41441j8556q3368K7238N6036Q495o7664K508k8611M4416L2915p970p1847
14017C35033r9996J5439L5641J7024Q071k402l2270m7434j0141o9127m211k8687
14005A16940K7118l0244l1228j7439m3617q14K7381P6568N4404J0249N3852P0017
13993C13187K6471l9867k4791K3198p446r6566o3527M2270P732m2796j3369o7752
13981E6744n476Q2163j8132l4932K0072L9141n9505l7170J6130m8966J086k1188
$$ y = [606223, 681524, 649799, 602878, 560548, 505346, 465734, 473992, 528353, 552476, 487639, 425417, 520729, 480135, 394407, 341483, 374718, 480237, 495805, 510450, 487756, 446417, 433499, 432414, 559610, 626712, 655635, 623525, 582596, 516130, 480618, 450720, 416232, 403007, 441441, 422885, 339517, 366755, 422791, 431286, 363622, 366130, 337519, 381935, 414850, 406880, 335033, 235037, 250476, 286117, 303141, 311212, 308810, 276540, 229106, 218965, 149838, 145627, 116940, 144058, 113814, 82586, 65147, 21530, 20716, 48097, 124665, 179069, 189318, 243170, 313187, 339658, 299791, 275000, 298198, 290752, 194186, 130659, 172929, 180661, 137865, 124496, 56744, 51268, 133431, 115299, 80367, 100439, 139580, 80075, 42905, 59035, 10069, 11155, -10033]
13969a0033J6747N5812j6656n4320L2096P1165k5896N8381L7831r8527L5840j4545
13957H7895n5893L324p11K1462k7876J557K7410J9861M7051m0639q7435J4606
13945A0612M6734m4102J6838J8253o0532p3491M3078N4811j2310M7083m4018r7912
13933i4956q9630K1437O2166l7467P0683O1163n7732q6880m6077L8727m7198m7973
13921b53737m1861L2889Q760O8645R9617R6368M5108K7326n357k1428M6634j1596
13909I1368P5723k8950J6437j6566P4073J27947r866l579m3639l7806K6429p1403
13897B00168o7204L2165p6324J121L9875O5521K1871n5798j1575M5108N7860M3128
13885B95916j55210j14635M054j0022M6816O6548R4664l1097m6574l3596j6774
$$ y = [-10033, 6714, 62526, 45870, -8450, 23646, 94811, 68915, 127296, 165127, 66600, 102440, 87895, 32002, 35326, 34615, 56077, 28201, 29758, 57168, 77029, 124080, 83441, -3994, 10612, 57346, 13244, 30082, 48335, -12197, -85688, -42610, 12201, -109, 46974, 2956, -94956, -184586, -163149, -100983, -138450, -67767, -6604, -64336, -151216, -197293, -158566, -205764, -253737, -295598, -262709, -253949, -185304, -85687, 10681, 55789, 83115, 77758, 56330, 102964, 91368, 167091, 138141, 154578, 138012, 212085, 340032, 330166, 326587, 282948, 245142, 271571, 200168, 132964, 165129, 88805, 89926, 129801, 195322, 217193, 161395, 149820, 194928, 252788, 295916, 140706, 26071, 30125, 20103, 66919, 133467, 228131, 197034, 150460, 116864, 100090]
13874A00090l8131k9460L264K0919K0456L0089K0848m408j5997J4034q8948K471
13862C5227M1990K7602L016j4517K3808N14L1705J2765K2154k2169m5974r727
13850A06394K9878J5061o136l8589J6563o1230j1481P6128l123l1256K3302M6276
13838A61787J1201o9148k6714J1255m4550J3398M8926k9551k215K386J05303Q647
13826A90725n2081m9739P8471J3208o6281m1257l4135K1331O433j5479m2621k6720
13814a8145N9603M2515k8191j6266J8920l2879L3227R5180p2045Q599P5913m8326
13802A18105O6222J03278L4776r4185j02872r2418K4638L4154k3446j6071n6442
13791d261J6901N2657N1750L4436k5419K0252n134N9747R1821o928k2582k6357
$$ y = [100090, 61959, 32499, 35763, 56682, 77138, 107227, 128075, 123667, 107670, 121704, 32756, 35227, 77217, 104819, 107835, 93318, 117126, 117640, 149345, 162110, 184264, 162095, 116121, 106394, 136272, 151333, 145197, 106608, 123171, 61941, 50460, 126588, 123465, 92209, 115511, 161787, 172988, 103840, 77126, 88381, 43831, 57229, 106155, 76604, 74389, 76775, 182078, 190725, 138644, 88905, 167376, 180584, 114303, 73046, 38911, 60242, 66675, 51196, 8575, -18145, 41458, 83973, 55782, 39516, 58436, 25557, 58784, 153964, 81919, 90518, 166431, 118105, 184327, 287605, 322381, 228196, 125324, 32906, 57544, 91698, 68252, 52181, -4261, 12640, 65297, 117047, 151483, 126064, 146316, 141182, 200929, 292750, 285822, 263240, 236883]
13779B36883l664J8302L9598R04O7368r811L8621N8335N102n4380L1675P8847
13767E07780N6223r52q6499J4284J32523J26040J18704J06862J65264J68838O0122
13756A369189J44027M9379P747j30899j17044R763J8903r5710j50732j48310j69808
13745G86505j24204p8533n7363j3744q8964q5844r7706q0536l5182N0852P0820
13734B46101l386R4805l8777o2224J16422R0866k5936o9413j66654k9554Q588
13723A60838n5361J6483j43l889k092l4302O0471R1292n5110p2066n2484J4574
13711F8211N9743k222L783P3730m2392j23637l9594K0383J920q4k5196Q5312j4701
13698F5256p763j0167L9410j8280k7301J3267n2536o133K0317R0498K9236K017
$$ y = [236883, 233219, 251521, 291119, 292023, 359391, 349580, 388201, 446536, 451638, 397258, 428933, 507780, 564003, 563051, 476552, 490836, 623359, 749399, 868103, 974965, 1140229, 1309067, 1369189, 1513216, 1562595, 1570342, 1439443, 1322399, 1332162, 1351065, 1255355, 1104623, 956313, 786505, 662301, 583768, 526405, 512661, 423697, 337853, 240147, 159611, 124429, 175281, 246101, 242715, 337520, 298743, 236519, 352941, 443807, 417871, 348458, 181804, 152250, 160838, 105477, 121960, 121817, 117928, 115836, 81534, 142005, 233297, 178187, 106121, 53637, 68211, 127954, 125732, 129515, 203245, 160853, 37216, -2378, 18005, 19925, 19841, -5355, 79957, 65256, 57493, 47326, 86736, 68456, 41155, 54422, 1886, -4247, 16070, 106568, 135804, 137821]
13686A37821j24727m6486m28K4721L4288m3169N9461j2199o9901R0939k3026j11338
13674h4044j5226R761J7296L504m474l1015J13201M2813N9602K665K57K4420o5806
13661G2954r416n2646K60P099j2389q5069l5643P8533M4702L5054L6088L7623
13649A17150K9155l4039l3923J1441J2233q4374K5340M2962Q598q2983r927J9703
13637B1336K0664k6555M4864N9483p6591r5009m7800N2597J09272R17j21664l9820
13625i8306M6213R5508J2152j9416n3817o0771O9668J11844l5755r1973j7429
13614d2082J0401j600O6369j5688j0121N4844L95N1067j1593j09722l7433N5310
13602A0147p066o843p5371R9784O1930K1381K673q5609p3048N8496N2042m0271
$$ y = [137821, 13094, -33392, -33820, -9099, 25189, -17980, 41481, 29282, -40619, 50320, 27294, -84044, -99270, -89509, -72213, -68709, -73183, -104198, 9003, 51816, 111418, 114083, 114340, 138760, 72954, 63538, 10892, 11152, 18251, 5862, -79207, -114850, -36317, 8385, 43439, 79527, 117150, 146305, 112266, 78343, 89784, 102017, 17643, 42983, 85945, 94543, 11560, 1633, 21336, 42000, 15445, 60309, 119792, 43201, -51808, -99608, -47011, 62261, 63178, -58486, -98306, -52093, 43415, 55567, 36151, -17666, -78437, -8769, 103075, 67320, -24653, -42082, -31681, -33281, 33088, 17400, 7279, 62123, 62518, 113585, 101992, -7730, -45163, 10147, 3081, -3762, -79133, 20651, 82581, 103962, 106635, 21026, -52022, 6474, 58516, 18245]
13590A8245O3421L1705R056o4604l2624L5532O0059n7412p6622k3831K9241J07
13578g727m4617r823Q701J6156k9785N2343K5309j1006K1586J30584m5626j28939
13566b2844j2649K6552n0498K1726Q9763j0962j0794R5582L5281r2588L0847j6652
13554H2764j22680j0219j2656k1176L1685O1180K1898m3290M7810M0411p1061
13543D666m0510L9012J6661Q183M7458k3075p7370J7498O5425j9461l1285N3861
13531F1063J4200n5576K977P8123M2302M8979r0233q5881j3318P9919M2051p7679
13519D6927r7493k0193P7034J04999L490j416L099m1523j11556J7487J6341o5447
13507f8251R0797q588J5194J09559M3190k6679r0007R518k8001L7284J22095j0895
$$ y = [18245, 81666, 113371, 122427, 57823, 25199, 60731, 120790, 63378, -13244, -37075, -7834, -7727, -52344, -62167, -53466, -37310, -67095, -14752, 10557, -449, 21137, 151721, 106095, -22844, -35493, -8941, -59439, -37713, 52050, 41088, 30294, 125876, 161157, 68569, 99416, 82764, -39916, -50135, -62791, -83967, -52282, 8898, 30796, -12494, 35316, 75727, 4666, -35844, 3168, 19829, 28012, 75470, 52395, -24975, -7477, 57948, 38487, 7202, 61063, 75263, 19687, 22664, 100787, 143089, 192068, 101835, 15954, 2636, 82555, 124606, 46927, -50566, -70759, 6275, 111274, 114764, 113348, 116447, 74924, -36632, -19145, -2804, -68251, 22546, 13958, 29152, 138711, 181901, 155222, 65215, 74733, 46732, 84016, 206111, 195216]
13495A95216j33966l8654J3860k7588j5779L9676n2535j8357P2116J13283n6903
13484I0369j2893k0367l7739k638j5864N7716Q9660L5720j07612n8928l364M0624
13472E4684L4L9708j3830m762P7082L8472j1757m3822o7977o2910k2231l2488
13460d9797r443J1936O0118P5983K0489j7251R854k4774M1683R6171O5266j5419
13448B64816p523M3228j7710m2684l2242q9133j2255K9871N2526K030j6002M170
13436A79092j614j081K5094M4534K6634q5935M5984m083n116L717L8549J14554
13424C80329P4961K1563j879k62P9893j6045p6742k0109q141J2304m029j18708
13412C23135l4882N4490N1435r3160j04320j9785L8449j9963O433J11763K3816
$$ y = [195216, 61250, 22596, 36456, 8868, -6911, 32765, -19770, -38127, 33989, 147272, 90369, 77476, 57109, 19370, 16732, 868, 58584, 148244, 183964, 76352, 17424, 14060, 54684, 54718, 94426, 80596, 75834, 152916, 191388, 179631, 135809, 67832, 4922, -17309, -49797, -59240, -47304, 12814, 88797, 109286, 92035, 101889, 77115, 118798, 214969, 280235, 264816, 257293, 300521, 282811, 240127, 207885, 118752, 106497, 136368, 188894, 190924, 174922, 179092, 177478, 176397, 201491, 246025, 272659, 186724, 232708, 228625, 223509, 227226, 265775, 380329, 455290, 476853, 474974, 474712, 554605, 538560, 461818, 441709, 433568, 445872, 441843, 323135, 288253, 342743, 394178, 301018, 196698, 176913, 215362, 195399, 201832, 313595, 337411]
13401C37411k7765J1723J00067N150q4696P044J46718J12523L1567q168j8492
13390F13082j02287o1713K1002K4005n2533o5255j23781p5999L2757L7999Q1206
13379C28483J0278n2743l8869N6440Q1924M2300q554m2949L6502P3779Q2300L648
13367E72539j8192m1919n6083N3799p2083n8419k3478r8205q0979j0361l1858
13356A34761m0441P186N3797k541p5227Q3060J28537P2040K8634j1127k4003k3665
13344C31011o9166J6875L01M0227L5321O4867K8038r5983p0395L9449l7532p2826
13332B10187p8953N1566J4460j02985l0207M8309K1500p98K2203L2603o8692j9658
13320I9535q286l0618M0802m313j6258Q1142J06378P5889l2424q4311p0246j1378
$$ y = [337411, 309646, 321369, 421436, 426586, 341890, 348934, 495652, 608175, 639742, 631574, 613082, 510795, 449082, 470084, 494089, 441556, 376301, 252520, 176521, 209278, 247277, 328483, 338761, 286018, 247149, 303589, 385513, 427813, 419259, 376310, 412812, 486591, 568891, 572539, 554347, 512428, 456345, 510144, 438061, 379642, 356164, 257959, 176980, 166619, 134761, 94320, 101506, 155303, 152762, 77535, 160595, 289132, 361172, 389806, 378679, 354676, 331011, 261845, 278720, 279021, 319248, 354569, 419436, 447474, 351491, 281096, 320545, 283013, 210187, 131234, 182800, 197260, 94275, 64068, 112377, 133877, 133079, 155282, 187885, 119193, 99535, 91249, 60631, 101433, 97120, 80862, 162004, 268382, 344271, 311847, 227536, 157290, 145912]
13308A45912k126r4039q894R6j1008k3747q555j4875K9420K9433K7567n206L8632
13295A02610Q36J2810m8902J6613N242o2147M1001j3796p213o0316o033J3405
13283e890O7049L9598M7579L9902q8475j23575j8051N8986j7780o302O1335J2498
13271F6874o1647L7294n3050l3391K608O7220N2222M61P3447l2486M8039l6385
13259A31206j29621o7594K934p5513J0333N050Q8299J06417n960J3167P1815m5578
13247A04955j82003q8213J25657J17897K0427m8946l6954L2174N9544j03494l9481
13236c8437K2905L5451P6129o8429p0932l597P616N0534O0956P9161L280l1062
13224A23575p376j245m6941O1087k3178q7909k8045K0993J0246L4564k712j5464
$$ y = [145912, 143786, 49747, 40853, 40949, 29941, 6194, -2361, -17236, 12184, 41617, 69184, 63978, 102610, 103446, 116256, 67354, 83967, 89209, 27062, 68063, 54267, 47054, -13262, -19295, -5890, 61159, 100757, 148336, 188238, 99763, -23812, -41863, 17123, -657, -6959, 54376, 66874, 5227, 42521, -10529, -43920, -41312, 25908, 78130, 78591, 152038, 119552, 167591, 131206, 1585, -66009, -63075, -138588, -128255, -123205, -34906, 71511, 65551, 78718, 150533, 104955, -77048, -165261, -39604, 78293, 98720, 49774, 12820, 44994, 104538, 1044, -38437, -15532, 19919, 96048, 27619, -43313, -46910, -39294, 11240, 72196, 151357, 154637, 123575, 116199, 114954, 68013, 129100, 105922, 18013, -10032, 10961, 21207, 55771, 53059, 37595]
13212C7595K7250O629o3380n2658J10313J7024k5603M2252J8002k2702p1119l8494
13200a4891m0218m4836N8132J0610N0593J5789L5343l5717q7389n0207o9224O802
13188a65213O9277J6176j1896K4389j4089p7569k8746J22957K7168k3042l9212
13177i9800j01955o1306O8629L294M2101J8429P3827J03817M7068j1656J8296
13166A00744K2085k9244j13771l0049P7588k0784l6419K9761K6468p912K198k0040
13154F25O639j1071l4831L7821O8869k1566P5488m3305o7715O233j2026l4328
13142b9167n3277l632R3061M6656K1023q583m3549O1516k8970m2880p2214p7060
13130a37076K277j28248J1098J75881O6091m2024L642n5921R3334J1154M3687
$$ y = [37595, 64845, 71474, 8094, -44564, 65749, 82773, 57170, 99422, 117424, 94722, 23603, -14891, -55109, -99945, -41813, -31203, 19390, 35179, 70522, 34805, -52584, -102791, -172015, -165213, -95936, -79760, -91656, -67267, -81356, -158925, -187671, -64714, -37546, -60588, -99800, -201755, -263061, -194432, -191138, -149037, -130608, -56781, 47036, 94104, 82448, 100744, 122829, 93585, -20186, -50235, 27353, 6569, -29850, -89, 26379, 18467, 20665, 625, 7264, -3807, -38638, -817, 68052, 46486, 121974, 78669, 10954, 17187, 5161, -29167, -82444, -86076, 6985, 53641, 74664, 66081, 22532, 84048, 55078, 12198, -60016, -137076, -134799, -263047, -251949, -76068, -9977, -52001, -48359, -104280, -10946, 208, 43895]
13119D3895k4810k8503J0208k1822m8996P5717R2455l3430m0073k2100j09773
13108a07232m4214M6614J8328N0457P2040j1718J4006R044K4087p674p9338k3421
13096c9021n898J6491j2126k257O7879L035n8357M9766K2001p2469l1618R2350
13084B9776N8254o3868q4361j0401L4654j2274j4475O1644N9516K7392j9985M3307
13072A09179k5342n6376J504P4008j7082p997j0623O1670K2483J1365Q6476j4490
13060B34775l2906J3392L5156J7480j24459o5127K2223P879j0043k5977k3095
13049D9298K2658O9310k617l471K2860N265J7107K3171r378k2305O8836m8440
13037A92294L7049m6402n4067O629j6988p1223k4928k1211Q889m8671N7449N0686
$$ y = [43895, 19085, -9418, 790, -21032, -70028, 5689, 98144, 64714, 24641, 2541, -107232, -151446, -104832, -86504, -36047, 35993, 24275, 38281, 47325, 71412, 63738, -15600, -39021, -44919, -28428, -40554, -42811, 25068, 28103, -30254, 19512, 41513, -30956, -62574, 29776, 88030, 24162, -60199, -70600, -35946, -48220, -62695, -1051, 58465, 85857, 65872, 109179, 83837, 27461, 28965, 102973, 85891, 77894, 67271, 128941, 151424, 162789, 249265, 234775, 201869, 215261, 250417, 267897, 143438, 78311, 100534, 108413, 98370, 72393, 49298, 71956, 141266, 138649, 135178, 158038, 163303, 180410, 203581, 194203, 171898, 240734, 192294, 229343, 182941, 128874, 135503, 118515, 47292, 22364, 1153, 10042, -38629, 18820, 69506]
13025F9506L5790k1189n6867k9630p0808M0036L3685O1462k9772K3710N9243N5884
13013A71050j14902j4071N0178q240n3184l1029K088N0328P031k6929M9657m1912
13001D0065j11026l5911N8963M9181L970j1284J5388l1255L7705M5334P2624Q6384
12989B20138r7023o0045j9543K6200K2599K2529q3814l3595n958O5673j8451K1279
12977E9989O4524R1497R127m8555L3439p4023j9828j0999p0439L3207K0718O1903
12965A50560j425k0251J8032K7669N8370O5036l4189M0904j01424q2954O375K1690
12953A48393L0405j1327L6810N394L5848M6048R5358m8688o8567l1797l3704L0444
12941B34617j29007j70182o870Q4765k7579o8884J12707N5072L5169L4024o1691
$$ y = [69506, 105296, 84107, 27240, -2390, -73198, -33162, 523, 61985, 32213, 55923, 115166, 171050, 56148, 42077, 92255, 84015, 30831, -198, 1890, 52218, 59249, 32320, 81977, 40065, -70961, -106872, -47909, 1272, 5242, -6042, 9346, -21909, 15796, 61130, 133754, 220138, 123115, 63070, 43527, 69727, 92326, 114855, 31041, -2554, -8512, 57161, 38710, 59989, 124513, 216010, 225137, 176582, 210021, 135998, 116170, 105171, 34732, 67939, 88657, 150560, 149135, 128884, 146916, 174585, 232955, 297991, 263802, 304706, 203282, 120328, 126703, 148393, 178798, 167471, 204281, 209675, 245523, 291571, 386929, 338241, 269674, 237877, 204173, 234617, 105610, -64572, -71442, 13323, -14256, -83140, 29567, 84639, 119808, 153832, 92141]
12930I2141L6840J09424N7893o6515n7541r8543J6699J04811J4158j43733j7441
12919D8193k6318R8009N7851n1800r785K3295N173K2736j6417m9967j6j4603P9846
12906A66197L0522m9195k4030P0054n553k9210l1536R1244M9859o387O2918L5770
12894C60653m3416j7253k7530m8162j7339l1830m945N5589K9081k7538k598O1103
12882B85815j6525k548L6936J0758j6522P0340Q8302l7031l0810m2352Q68k182
12870C45049n155j1206j4476k3431L6604r8259q5284N1932K1579L037m238L954
12858B20106L2543J05356K9265l8385L283l0927m9553n7739l5781p6257R2045
12847A93956m0759m4307k2213j8072N3744R1342M9651j1438J4332k4023k2783
$$ y = [92141, 128981, 238405, 296298, 229783, 172242, 73699, 90398, 195209, 209367, 65634, 48193, 21875, 119884, 177735, 125935, 116150, 139445, 144618, 167354, 150937, 100970, 100954, 86351, 166197, 196719, 147524, 123494, 193548, 187995, 158785, 127249, 218493, 268352, 261965, 324883, 360653, 317237, 299984, 272454, 224292, 206953, 175123, 170178, 225767, 254848, 227310, 224712, 285815, 269290, 266742, 303678, 314436, 297914, 368254, 456556, 419525, 388715, 346363, 347231, 345049, 339894, 328688, 314212, 290781, 327385, 229126, 143842, 195774, 217353, 220390, 216152, 220106, 252649, 358005, 387270, 348885, 352168, 321241, 271688, 213949, 178168, 101911, 193956, 153197, 108890, 86677, 68605, 122349, 213691, 263342, 251904, 266236, 242213, 219430]
12836B19430n1046k7170M3104P8888N1179n706j4823k0321o200N8227J13689M8262
12824D87513L606P0369J2791j4580K1870o2357o945k5615o1697j0290m2995j2794
12812C58876K8597O9217p2199j65699n5328O8444L1876P509L5440R2601K8381
12801D27715P7672P0229N294Q376j27611p9499O7623M5622J3013M3242N9923r7696
12789E13903o7351p6784j02370O13r850r8483j3400N2063l5963N7817L8039o4064
12777A94170r7663J0799M9840J33991k7334k0288j09508j2324Q1142r209k3864
12766A69752m4774l9535Q9362K1962j05548m5394l2793K7075K4683p4764N2539
12755D2565n304m8746M9243N7214R7263Q8492k7476R975L426n6536L8539n5922
$$ y = [219430, 168384, 141214, 184318, 263206, 314385, 308679, 293856, 273535, 267335, 325562, 439251, 487513, 491119, 561488, 574279, 559699, 581569, 519212, 512267, 486652, 424955, 414665, 371670, 358876, 387473, 456690, 384491, 218792, 163464, 231908, 263784, 271293, 306733, 399334, 427715, 505387, 575616, 580910, 589286, 461675, 382176, 449799, 495421, 508434, 551676, 611599, 513903, 446552, 369768, 267398, 268011, 258161, 159678, 146278, 198341, 162378, 220195, 258234, 194170, 96507, 107306, 157146, 291137, 263803, 243515, 134007, 121683, 202825, 193616, 169752, 124978, 85443, 174805, 196767, 91219, 45825, 13032, 40107, 64790, -9974, 42565, 37261, -11485, 37758, 94972, 192235, 280727, 253251, 263226, 266652, 210116, 248655, 192733]
12743A92733l7755r645k0243j3401n8810r0787M8392J01806M7292j7147J1039
12732A53474J350k5584J9123L1146N8801M7193l0106p5816J1046o3576n4626O6852
12720A39277M0196p1044p8005K9284o5031j01156L2540k0940J2469P1608P6141
12709F5339J4973J5444j6205m7445Q891k9269k4671n2993J9458L3387l3341J3603
12697c2829N6044M1437L2938j10418m0457K7295m545r641M6515N8267P4446j5253
12685A23799j13611P363M8707n091n2839P9082l1529j04123j8992K9850J18756
12674H1372O6240m5165M636M0883n0378o4413O0210o4280l7454P1952L7944O2257
12662A63804l3163l4189k2921J5092j5161p218L1042j5349M4821M3315j73213
$$ y = [192733, 154978, 145333, 125090, 111689, 52879, -37908, 10484, 112290, 159582, 142435, 153474, 154824, 129240, 148363, 179509, 238310, 285503, 255397, 179581, 190627, 127051, 72425, 139277, 179473, 108429, 30424, 59708, -5323, -106479, -73939, -94879, -82410, -10802, 65339, 80312, 95756, 79551, 32106, 40997, 11728, -12943, -65936, -46478, -13091, -46432, -32829, 23215, 64652, 97590, -12828, -53285, -25990, -30535, -40176, 6339, 64606, 139052, 123799, 10188, 17551, 66258, 61167, 8328, 87410, 55881, -48242, -67234, -37384, 81372, 147612, 102447, 107083, 147966, 97588, 33175, 93385, 29105, -8349, 63603, 101547, 163804, 130641, 96452, 73531, 88623, 73462, 66244, 97286, 81937, 126758, 170073, -3140]
12651c140o6165J15340J59837M6623m3642q6300o5885J920o0139j1142O1828P1564
12639A20699q97r4265k161O5376P9326L7771j03322l5429K4420Q4397J2384K0533
12627B08832j11118r5717j2061P3785P9999L5970K1161j3949j5200l3400j8348
12616A19954j11859M4660R1651L108O6386M4517Q5815j13626r5168J8859N1817
12605B06114o601J3411K6218l2709L1708k2159n1706j7519J5434j5119K1026o1365
12593A06733L793K1586R6981J8408P214O0932l5889l9290j08620l2352L1197R2986
12581B23679Q2798J2663M2445M3457k042j08297n3801l2258m1722O8664L0493
12570B66079J8980j5765l096Q166q1675J6788O5102q0751m5737O5595O6626J4844
$$ y = [-3140, -69305, 46035, 205872, 252495, 208853, 122553, 56668, 58588, -1551, -12693, 49135, 120699, 119802, 25537, 23376, 88752, 168078, 205849, 102527, 67098, 91518, 175915, 188299, 208832, 97714, 1997, -10064, 63721, 143720, 179690, 200851, 186902, 171702, 138302, 119954, 8095, 52755, 144406, 147514, 213900, 258417, 344232, 230606, 135438, 154297, 206114, 199513, 212924, 239142, 206433, 238141, 215982, 164276, 146757, 162191, 147072, 168098, 106733, 110526, 132112, 229093, 247501, 254715, 315647, 279758, 240468, 131848, 99496, 130693, 223679, 306477, 319140, 361585, 405042, 403000, 294703, 240902, 208644, 166922, 235586, 266079, 285059, 269294, 266198, 274364, 192689, 209477, 274579, 193828, 148091, 213686, 280312, 295156]
12558B95156L6570K9327p1115o8212Q8749N2307n4984p6895N0699j1545K8612
12547B98669L3800r8265o6603N221J05064L48r3572n3904J1765P0623O235L806
12535B23187O623K7679k9495K344K9955M1585n5138K4308L9252m7257n0022q3212
12523A29809m640j5225J0984O0692j3685m91K7854O310M5348n956j6408k5816
12511A98776J7448n0759M7777N3415R3384K1607k1752j27309M658J12014l0063
12500C19196n3396j9175j83m3532o2532M3760j3173J0721J0807o37k7799k7121
12488A36936k4923K6326l1837L9139K4734m8862k7081L0770J29495J05811r4581
12477B65927j02666J1658P9477P2238r504m4029m5421j2169j3098K2071m802K0665
$$ y = [295156, 331726, 361053, 289938, 221726, 310475, 362782, 307798, 230903, 281602, 270057, 298669, 332469, 234204, 167601, 172822, 277886, 278234, 184662, 130758, 142523, 213146, 219381, 223187, 229810, 257489, 227994, 230338, 260293, 301878, 246740, 271048, 310300, 263043, 213021, 129809, 125169, 109944, 120928, 181620, 167935, 167444, 195298, 201608, 246956, 241000, 224592, 198776, 216224, 165465, 213242, 266657, 360041, 381648, 359896, 232587, 237245, 349259, 319196, 265800, 246625, 246442, 202910, 140378, 184138, 170965, 181686, 192493, 191856, 164057, 136936, 112013, 138339, 106502, 145641, 170375, 121513, 94432, 125202, 254697, 360508, 265927, 163261, 174919, 254396, 326634, 317130, 273101, 227680, 215511, 202413, 224484, 219682, 240347]
12465B40347L220q7737M4673k3811n7293J3902j8740L1028L791J6972M2065p572
12453B00845M9373O803O9975j7588j31131n6354K9081l049m8299L5456J9498O75
12441A55285R3512J0410o5870o3866P088K2339n4019K4963O7743l4328m9158R9703
12429B13802J10614K8532r0392r7216L4504J264N1825J4891l5700Q1434Q2409
12418C95967j2580n6495J1144j417n1618m8652m6824n839K1024J902k5401n4354
12406A26857p3258j9099J5219J7070J2196m2420Q1469P5261n4574p1634q4947
12395a7860k3318l1996K4207O6249K4111J8965r803o8956J3182J13330J56490
12384B64601l7667q2187j7386k0995J3500P1210J7002k4699n8106p5582P542Q7824
$$ y = [240347, 243567, 155830, 200503, 176692, 119399, 133301, 114561, 145589, 149380, 166352, 208417, 200845, 250218, 257021, 326996, 309408, 178277, 121923, 151004, 147955, 99656, 135112, 154610, 155285, 248797, 259207, 193337, 129471, 136559, 158898, 104879, 129842, 197585, 163257, 114099, 213802, 324416, 352948, 262556, 165340, 199844, 201108, 252933, 267824, 232124, 313558, 395967, 383387, 326892, 338036, 336619, 285001, 236349, 189525, 183686, 204710, 206612, 181211, 126857, 53599, 34500, 49719, 66789, 78985, 36565, 118034, 193295, 138721, 67087, -17860, -41178, -73174, -48967, 17282, 41393, 60358, 50555, -18401, -5219, 108111, 264601, 226934, 144747, 127361, 106366, 119866, 191076, 208078, 183379, 125273, 49691, 57233, 145057]
12372A45057O4293M3108j154q963l9334j33695J9958n0934j2005J3495K2572N3074
12360A15472R0570K0455l7390r6473p0902m1906N6019J9637M895l220K5015n6391
12348B5781J03158M7278N0394j0720m0984l3614j2700j7706m7935N2135m6471
12337F8616m9615n2796N4645K113P5371O1040N175p6591p0757N7709J23877J0276
12325B09063r9802j5540O0305n0673R256q03r5172n0093M2850j2305K4762N0920
12313G2768n2299K8116L2015m186N556n8620M6166j9609K220K3281M4844j7850
12301A02402j34229k8789P2302j0976L6343K6682J7360m5285k9491J3547O0458
12290H0324N5784J8302J6547l2034p2512l6733J1326j0215K6394p9886n007j990
$$ y = [145057, 209350, 252458, 251304, 242341, 203007, 69312, 89270, 38336, 26331, 39826, 62398, 115472, 206042, 226497, 189107, 92634, 21732, -20174, 35845, 55482, 60377, 57157, 82172, 25781, 128939, 176217, 226611, 215891, 174907, 141293, 128593, 110887, 62952, 115087, 68616, 19001, -33795, 20850, 22963, 98334, 159374, 164549, 87958, 17201, 74910, 198787, 209063, 109261, 93721, 154026, 103353, 112609, 111806, 16634, -33459, 9391, -2914, 21848, 72768, 20469, 48585, 80600, 76414, 81970, 23350, 69516, 49907, 52127, 75408, 120252, 102402, -31827, -60616, 11686, 710, 37053, 63735, 81095, 35810, 6319, 19866, 80324, 136108, 154410, 170957, 138923, 66411, 29678, 41004, 30789, 57183, -22703, -27710, -29700]
12278b9700N1300M3563p4827j0310o1260k7060M6881J04473l608m8987p793o834
12266b4162M0832K3921m9332L648J5757K1771N378J0581K1156j7298m3301j6919
12254g968o457n099O2808p9314o9160o0383n8236n6201L8431J76048R3954M1802
12242G0225M1746k6110m6856n9499m2250o68m3348J4435j7337n5038K3775J37836
12230c089L9650p2105J177L7610N2442R937l35k3038O712j00250r4407K9262K0409
12217i6025M6518R1322n6492n6216N1454q8936n8560J1210J07953J05442R418
12206F7088L28n7890o1961J8968K1942M1042K5526J4851o3688N1552N9875L1038
12194A48671m1030l1728o9656n5046j4001N0331P4385J8478l630o432j6856q421
$$ y = [-29700, 21600, 65163, -9664, -19974, -81234, -108294, -61413, 43060, 39452, -9535, -17328, -24162, 16670, 40591, -8741, -5093, 10664, 32435, 37813, 48394, 69550, 52252, 8951, -7968, -14425, -19524, 43284, -36030, -105190, -165573, -223809, -280010, -241579, -65531, 28423, 70225, 111971, 85861, 39005, -20494, -62744, -63412, -106760, -92325, -109662, -164700, -140925, -3089, 36561, -35544, -34367, 3243, 55685, 65622, 65287, 42249, 48961, -51289, -145696, -116434, -96025, -49507, 41815, -14677, -70893, -19439, -108375, -166935, -155725, -47772, 57670, 67088, 67416, 9526, -52435, -33467, -11525, 29517, 55043, 69894, 6206, 57758, 117633, 148671, 107641, 75913, 6257, -48789, -62790, -12459, 61926, 80404, 76774, 70342, 53486, 45065]
12182D5065o5400o617L1778Q435M3418P1014K0473p6595p8410n1539k6320J3975
12170g0723P0939r08o4160J2991J259m9563k2573K8718N5773p92L5120K8904O339
12157C1324m5704L8940L1957l305k2025J00868L3601J3429o1606m1210m6226l9246
12145i203j013k0773N6502K7883n7720M4944K4610K6213l1055K8300N0349r9664
12133C9373j5130K7984o1000O0101j8608l6453P7391l461K8493m6781l7876m4543
12121c0510r872m2587L7197Q7817O3402n6491O6933r2156l5570L1327r4125k6294
12109a00929j623J04654O1238J2218q2011m6403J4581J22440J01790m7417j29330
12098I208o1320m7938l4290M2383P757K6481O2154J9287o4621l0654N4102o0250
$$ y = [45065, -20335, -26952, 4826, 13261, 56679, 127693, 148166, 71571, -6839, -58378, -84698, -70723, 216, -692, -64852, -51861, -50602, -100165, -122738, -94020, -38247, -39039, -3919, 24985, 31324, -14380, 24560, 56517, 53212, 31187, 132055, 165656, 179085, 117479, 76269, 30043, -9203, -10216, -30989, 25513, 53396, -4324, 40620, 65230, 91443, 60388, 88688, 139037, 39373, 24243, 52227, -8773, 51328, 32720, -3733, 73658, 70197, 98690, 51909, 14033, -30510, -40382, -82969, -45772, 42045, 105447, 48956, 115889, 23733, -11837, 19490, -74635, -100929, -102552, 2102, 63340, 75558, -6453, -52856, -38275, 84165, 185955, 138538, 9208, -52112, -100050, -134340, -91957, -84200, -57719, 4435, 23722, -40899, -71553, -17451, -77701]
12086g7701p026O5251j9159k8019K5167N7394M5926q4573p7404p1568j8990Q1762
12074a08940L0973K5029M5556J5649k6637m4270j4672J7756J0209M0796m5816
12063e4367n6800O8062P4467N4400k045r5176m4937O1320l3661p1351l3221M982
12051a28327N004p445p071L3652j0059M0158L5408K1509Q1745N311M4296n945
12039A08236l6562K5817k4220M0494O8200n3197j5485l6193l9937q3625m1204
12028h7676M9621O3111K367J412M1570k9535k1861K8839q731n0708j969j2199
12016b5759l1237o308R5470Q9424L8906j2767J9463J0681j03612j0942M3657L3239
12004A40215k5663o0726n3968J8565J4763m2054l9820j6137L2848L6733N28m9794
$$ y = [-77701, -84727, -19476, -38635, -66654, -41487, 15907, 61833, -22740, -100144, -171712, -190702, -108940, -77967, -52938, -7382, 8267, -18370, -62640, -77312, -59556, -49347, -8551, -54367, -111167, -43105, 31362, 85762, 83717, -11459, -56396, 4924, -28737, -100088, -133309, -128327, -123323, -130768, -137839, -104187, -114246, -74088, -38680, -17171, 64574, 69885, 114181, 108236, 71674, 97491, 73271, 113765, 181965, 128768, 113283, 77090, 37153, -46472, -87676, -38055, 25056, 27423, 28835, 70405, 40870, 19009, 47848, 39117, -11591, -13560, -25759, -56996, -63304, 32166, 121590, 160496, 147729, 167192, 177873, 74261, 63319, 106976, 140215, 114552, 53826, -142, 18423, 33186, -8868, -48688, -64825, -31977, 4756, 5284, -44510]
11992d4510o8882j3172k0317o249k9306L0650J46046O6518j0012j0978K4817J9285
11980H3890j4126p473J7069K998L6189o4305N885q6980l0409m2468O148m3056
11968a36638n0425P1932L8245L9408k0966o7961M9925j3133Q2753k7793l5467
11957g0120J13180J14947N2554n9649k9784j2731j124M1686l9802m6789k0337
11946D2031L9559k0436j24118k788l8286m984Q2619P6546L3791n6661m4300L3006
11934A5979L1556J1247L1760n2533n1524L371M7827K4880J6184M800j47084o6244
11922a29781O5546J18013R7394M4975m8421O086o7838o9331o0082M8986p0921
11911f5374j5111K4137J04619M2485l9029j8335m3493n6739M4407O1404L559K2728
$$ y = [-44510, -113392, -126564, -146881, -153130, -182436, -151786, -5740, 60778, 50766, 39788, 64605, 83890, 69764, 62291, 79360, 82358, 118547, 54242, 60127, -26853, -57262, -99730, -93582, -136638, -187063, -115131, -76886, -37478, -58444, -126405, -76480, -89613, -6860, -34653, -70120, 43060, 158007, 210561, 150912, 121128, 108397, 107273, 148959, 109157, 62368, 42031, 81590, 61154, -62964, -65752, -104038, -109022, -26403, 50143, 83934, 27273, -17027, 15979, 47535, 58782, 90542, 38009, -13515, -10144, 37683, 62563, 78747, 83547, -63537, -129781, -64235, 53778, 151172, 196147, 147726, 153812, 85974, 16643, -43439, 5547, -65374, -80485, -56348, 48271, 90756, 51727, 33392, -10101, -66840, -22433, 38971, 42530, 65258]
11899F5258M2754Q900p0452p6576q2448R362N564R2722K5954l9205k4292J2136
11887c0323N3750l4914m4995L2936O5042L0770R9351L2416o0718n6550p9759K5679
11875C2685M7390m000j9301j3301l6619R1156K4824j7372R536J7590q1639j9413
11863C1536q161m2147Q10j4858P918L4839N0044j6218q5747l6374N9900N5923
11851C7465l013n9785n8373N2219M4478j1068J52J04616m8758l8960p0325o3952
11839a15304n8037M0883J11471n809P84L7289J9875M3762O7713k1913j44688L614
11827b0360l1390q9866k3270l3837N2736M6257J02259j4904N0157J1598m4552
11816D828j1173n0836L4009k7295p0423O8603r651j8073l7809J4758J18291J9582
$$ y = [65258, 108012, 116912, 46460, -30116, -112564, -103202, -97638, -4916, 21038, -18167, -42459, -30323, 23427, -11487, -56482, -23546, 41496, 72266, 171617, 204033, 143315, 86765, 7006, 32685, 80075, 76075, 56774, 43473, 6854, 98010, 122834, 105462, 114998, 132588, 50949, 31536, 23375, -18772, -17962, -32820, -24902, 9937, 59981, 43763, -41984, -78358, -18458, 37465, 34452, -25333, -83706, -31487, 12991, 1923, 2075, 106691, 57933, 18973, -51352, -115304, -173341, -132458, -20987, -26796, -26012, 11277, 31152, 74914, 142627, 120714, -23974, -20360, -51750, -141616, -164886, -198723, -145987, -99730, 2529, -12375, 37782, 49380, 4828, -6345, -57181, -23172, -50467, -120890, -52287, -61938, -80011, -117820, -103062, 15229, 34811]
11804C4811j3331k4467k2062l7129P8042Q8833L8176k9320K6058n4039q2292K1969
11792B5249l1533j7390L564K4877k4457l4399j06016J5106J45431K3958m1172
11781a6782k332j0988j3273O2979p959m0465j0284q5545K5597J23522k2725o3549
11769f1804m6688K3981J11982P5843n4164o4523j3683J05302O2637m2330l4628
11758F1925q5650L0282n3317R0590Q4094k7040j4340j1014o3262j4527K1674N0653
11746G0068K5096o0401p228M1586M1653o2953q252Q9235P670J5838O270L761N7302
11733B19645j5255j8678N9956L6359Q5827l0279M8959J28571N8898P2600M1731
11722F88334q8342j07703L8526P308j20866j65138K6641N1245l5557k9084l0367
$$ y = [34811, 21480, -2987, -25049, -62178, 15864, 104697, 142873, 113553, 139611, 85572, 3280, 25249, -6284, -23674, -20110, 4767, -19690, -54089, -160105, -144999, 432, 24390, -16782, -19114, -30102, -43375, 19604, 11645, -28820, -39104, -124649, -99052, 24470, 1745, -61804, -108492, -84511, 27471, 103314, 49150, -15373, -29056, 76246, 138883, 96553, 61925, -23725, 6557, -46760, 43830, 127924, 100884, 86544, 75530, 12268, -2259, 19415, 70068, 95164, 34763, 27535, 69121, 110774, 47821, 39569, 128804, 136474, 152312, 158582, 162343, 219645, 204390, 185712, 245668, 282027, 367854, 337575, 386534, 515105, 574003, 646603, 688334, 599992, 492289, 530815, 538123, 417257, 252119, 278760, 330005, 294448, 265364, 234997]
11711B34997j6076n2107J0113j1113k5504K1067M2597Q50l3617J6575l0144q4961
11699G2677k7832j7748p9129N0328l3284N4131P6562K7629o5011j5575J01585
11688A44333R7905K9542J7086j2221r3807N2933J7776n308m6686l1892m643l8043
11676A26975j8004l8223j2712n8120O628J34684K0228P0750M9776j37360r309
11665A35313N7359n6688m6867R0013J29508j6532k5891r1303L5597K5905K4135
11654B60549l5665j3958N6870n4456N479L3674L9021k5492L0372L0284o9602j8270
11642B38806J03592P171j00329l3097K1203K8117o9827j10008Q6143J33513n6577
11631B48707m8957K8459O6973j2686K2243n4587j0156M8077L3128j3509N2085
$$ y = [234997, 218921, 166814, 176927, 165814, 140310, 161377, 203974, 204824, 171207, 187782, 157638, 72677, 44845, 27097, -52032, -1704, -34988, 19143, 95705, 123334, 58323, 42748, 144333, 242238, 271780, 288866, 276645, 182838, 235771, 253547, 248239, 201553, 169661, 165018, 126975, 108971, 70748, 58036, -84, 6544, 141228, 161456, 232206, 281982, 144622, 135313, 192672, 135984, 89117, 179130, 308638, 292106, 266215, 174912, 210509, 236414, 260549, 224884, 210926, 267796, 213340, 218819, 252493, 291514, 266022, 296394, 326678, 257076, 238806, 342398, 349569, 249240, 216143, 237346, 265463, 195636, 85628, 171771, 305284, 248707, 199750, 228209, 295182, 282496, 304739, 250152, 239996, 288073, 321201, 307692, 359777]
11620C59777j1445J5731J60318R8352M0459J48045J66836J36444o4190j69669
11610H80658j52897r6182j5211m7549j357n06j3290j7554n9959l7965j5804k0755
11598D01629m898p576o3851k2867K8178O0055k644q1944J7771k2028L4075n3369
11586B82531k6M0927N5224l325O8848Q9545N5088k044q006o2067o6080p4529K8934
11573D05020R2037j9409M0985K0940N9431j8262m4595o2936n8828L2011N0145
11562D96539O339o1279M9653j5965o953q68j9618l1646J14981N2001k6040k7858
11550E29286L2776K9379j7805l2354k0166L6809K6414J0612l0077n513P4932N679
11538F39972L9636M851O5198l9999N1203N1755j00993J0203L5747O9239k3413
$$ y = [359777, 348332, 364063, 524381, 622733, 663192, 811237, 978073, 1114517, 1050327, 880658, 727761, 631579, 616368, 568819, 567462, 566956, 553666, 536112, 476153, 438188, 422384, 401629, 396731, 389155, 325304, 302437, 330615, 390670, 388026, 306082, 323853, 301825, 335900, 282531, 282505, 323432, 378656, 375331, 444179, 533724, 588812, 586768, 578762, 516695, 450615, 376086, 405020, 497057, 477648, 518633, 539573, 599004, 580742, 536147, 473211, 414383, 446394, 496539, 502878, 441599, 491252, 475287, 468334, 467466, 447848, 416202, 531183, 583184, 557144, 529286, 562062, 591441, 573636, 541282, 521116, 557925, 584339, 594951, 564874, 559361, 634293, 639972, 679608, 684459, 749657, 709658, 760861, 812616, 711623, 721826, 757573, 826812, 803399]
11527H03399m8505L8924N0943J6731j7087j9977L8615k4494k709N0659l5192M2562
11515H93869M9609Q839L9108O6866l5173j276P0563K2073j2814K8467R675o0612
11503A079194m7598J3765k8033m11O9820N4020M1240q0965L4884L7505K9839L2079
11491A235339k3228N57P13P9603L788L6841N7180J7816O6301L0405j18635l8897
11479A347783R183L3993K1085J8549Q0608J19278O0862P9382n9705L1830M9332
11468A792180N7408P7649P2899J4142L6967l8290M603P5969P3629J9938N6425
11457B243519Q9177J59217J09236J1681K0771K9150l11m9823P8351J28746M7866
11446B867580J09364J660q12L3833J14202J09802J82684J89270O6118P676J50030
$$ y = [803399, 754894, 793818, 844761, 861492, 844405, 824428, 863043, 838549, 835840, 886499, 851307, 893869, 943478, 952317, 991425, 1058291, 1023118, 1021842, 1092405, 1114478, 1101664, 1130131, 1139806, 1079194, 1031596, 1045361, 1017328, 1016917, 1086737, 1140757, 1181997, 1101032, 1135916, 1173421, 1203260, 1235339, 1212111, 1212668, 1213381, 1292984, 1296772, 1333613, 1390793, 1408609, 1474910, 1505315, 1386680, 1347783, 1356966, 1390959, 1412044, 1430593, 1511201, 1630479, 1691341, 1770723, 1711018, 1742848, 1792180, 1849588, 1927237, 2000136, 2014278, 2051245, 2012955, 2017558, 2093527, 2167156, 2187094, 2243519, 2332696, 2491913, 2601149, 2612830, 2633601, 2662751, 2662440, 2612617, 2690968, 2819714, 2867580, 2976944, 2978604, 2977792, 3011625, 3125827, 3235629, 3418313, 3607583, 3673701, 3681377, 3831407]
11435C831407J12346M4408J00352R2718J12560J64827J77180R7604R4125J67035
11425D994562J34043J94949R4045R5611J74527K02252J55032K09476K26032K32244
11415F712773L18444K21227J93212J80287J59288K85267L23170L26606L19178
11406I039452K16596K88301J85527L66289M59417M13551M10784L66554M60550
11397A2207021M34776M72784M09214M80528N79443P20095N98768O06018O44866
11388A7153513N94458O31324P29023Q03009Q18308Q71461Q19990P38680Q22957
11379B3982723Q71199R18978Q94223J016185R95217Q92431R43312J023746J017605
11370C2555619R13717Q27213Q73245P97201P17897O61298O11289N53028N46749
$$ y = [3831407, 3943753, 3988161, 4088513, 4181231, 4293791, 4458618, 4635798, 4733402, 4827527, 4994562, 5128605, 5323554, 5417599, 5513210, 5687737, 5889989, 6045021, 6254497, 6480529, 6712773, 7031217, 7252444, 7445656, 7625943, 7785231, 8070498, 8393668, 8720274, 9039452, 9256048, 9544349, 9729876, 10096165, 10555582, 10969133, 11379917, 11746471, 12207021, 12641797, 13114581, 13523795, 14004323, 14583766, 15303861, 15902629, 16508647, 17153513, 17747971, 18379295, 19108318, 19911327, 20729635, 21601096, 22421086, 23159766, 23982723, 24853922, 25772900, 26667123, 27683308, 28678525, 29570956, 30514268, 31538014, 32555619, 33469336, 34296549, 35169794, 35966995, 36684892, 37346190, 37957479, 38510507, 39057256]
11361C9057256L43254J73118J88513P2289j1395r9213l00338m39506m58394n40237
11351C7985347n54127o50244o91948o91841p96917r68753r97314q67370q63127
11342C0903706r49038r93891r57718r78121r41788q66617q15425p84940q29092
11333B2787076r29770p26039p28743o98605p27167o58168o38477o80378n97561
11324A6402168n33956n65191n63790n10525o06730m86850l62367m85457m53067
11315A1834235l43154l07791l25855l06523l39982k96144l91159k64209k06601
11306I052817j27653k67392k86264k81356k55996k62460j87631k01677j77111
11297G005277j42610k39750k15708k19586j77814j33180o1916j24047j59516j86713
$$ y = [39057256, 39400510, 39573628, 39762141, 39834430, 39823035, 39723822, 39423484, 38983978, 38525584, 37985347, 37431220, 36780976, 36089028, 35397187, 34600270, 33631517, 32634203, 31766833, 30903706, 29954668, 28960777, 28003059, 27024938, 26083150, 25216533, 24401108, 23616168, 22787076, 21857306, 21131267, 20402524, 19703919, 18976752, 18318584, 17680107, 16999729, 16402168, 15868212, 15303021, 14739231, 14228706, 13621976, 13135126, 12772759, 12287302, 11834235, 11491081, 11183290, 10857435, 10550912, 10210930, 9914786, 9523627, 9259418, 9052817, 8925164, 8657772, 8371508, 8090152, 7834156, 7571696, 7384065, 7182388, 7005277, 6862667, 6622917, 6407209, 6187623, 6009809, 5876629, 5814713, 5690666, 5531150, 5344437]
11287E344437j94199j53208j56657j05892j13417k13419j14047o9010p1261j56752
11277C996575j17884j20988j00391l1473j3332q0533q7353m6798J240j28822n8465
11266C211776n3146m1215r8311o8493o8475j05356k1908R60q9912n3723r0229
11255B521968p9396j18649o9637k5788J9185j9654o4916q4155k5754n7259k2678
11244A973267K2125J2051j1503r5799p9113N293j8525j42910q5612L7482L8841
11233A655597p3501j8384J03510k9537q2729k3308J2841Q3976K4082j8887k6250
11222A607410m8013k6922r9204j1411K8507p1693o3089r532L0470r714L4993M740
11210A366542j00751L3995R3959p934n6063j30717r2882J3022p3182L4129K6205
$$ y = [5344437, 5150238, 4997030, 4840373, 4734481, 4621064, 4407645, 4293598, 4224588, 4153327, 3996575, 3878691, 3757703, 3657312, 3625839, 3612507, 3531974, 3444621, 3397823, 3399063, 3270241, 3211776, 3158630, 3117415, 3019104, 2950611, 2882136, 2776780, 2754872, 2755832, 2665920, 2612197, 2521968, 2442572, 2323923, 2254286, 2228498, 2247683, 2228029, 2163113, 2078958, 2053204, 1995945, 1973267, 1995392, 2007443, 1995940, 1900141, 1821028, 1826321, 1807796, 1664886, 1579274, 1616756, 1655597, 1582096, 1563712, 1667222, 1637685, 1554956, 1531648, 1544489, 1628465, 1652547, 1633660, 1607410, 1559397, 1532475, 1433271, 1421860, 1450367, 1378674, 1315585, 1306053, 1336523, 1326809, 1361802, 1366542, 1265791, 1299786, 1393745, 1385811, 1329748, 1199031, 1106149, 1119171, 1045989, 1080118, 1106323]
11199A106323J0367l3377m9545n4187l678O134j4240j6958m7527l5212j4662k1016
11187H32422n093K3644R3757N8203n00n7206k232J731l0613k1083o6273n7241
11175G69516k1877r5127k6278O1029l179j9089M2792l508Q7903J1977j11971l2316
11163F59872K631o3232r105Q4367j7593l09L866o7348r7250p7034O0696n459K3681
11150D97783N2498n8752r7770p0876M560k67P774J15211Q8767K0075M1242K0398
11138F20643m2628j08542j08205J01543K0483K2918l652r1339Q731Q3629M5746
11127E49327q676K1380M1438R349k809p3417j07228o0718N2249J093n2710N0315
11115D19593P7294J04419p2339n5229m3594L7327k3079n5859j6369J7028n540
$$ y = [1106323, 1116690, 1083313, 1033768, 979581, 975903, 982037, 967797, 950839, 903312, 868100, 853438, 832422, 827329, 850973, 944730, 1002933, 1002433, 945227, 942995, 944726, 914113, 893030, 826757, 769516, 747639, 652512, 626234, 687263, 684084, 664995, 707787, 704279, 792182, 804159, 692188, 659872, 662503, 599271, 590166, 674533, 656940, 656631, 660497, 593149, 495899, 418865, 479561, 474102, 497783, 550281, 491529, 393759, 322883, 327443, 327176, 334950, 450161, 538928, 559003, 600245, 620643, 578015, 469473, 361268, 462811, 483294, 506212, 502560, 411221, 419952, 503581, 549327, 540651, 562031, 603469, 612818, 610009, 536592, 429364, 368646, 420895, 421988, 369278, 419593, 496887, 601306, 528967, 473738, 430144, 467471, 444392, 388533, 372164, 389192, 383652]
11104C83652n272n5202L074M6965P0289R7598k9162n7091j4772m9010k8305Q171
11092C70935P6284p5630k290M5432R319O9496R2742j874r3339J17J9325n142j9967
11079D85408k0980N1422L6832M4793k0861J0956Q4234J07116N6661J15990R0276
11068A041847n5564j16804r3065l0730p5162n8762J748l8274K8140K6723o1306
11057E68791o6098j01686L7880L4754m9369l2576L1364M7026J4593K1408k4897
11046D81190M4166J61961O4159j8630q206j3641q769K0542L3741K1144K9471J4334
11034H21462k2169q4787n7863r7836j0833p0012o090L2924k5677l8200q698j8579
11022D13642K5607l0942n4454O1435O8831L6974q0016l0617Q511K8252L0094k0686
$$ y = [383652, 378380, 323178, 326252, 373217, 443506, 541104, 511942, 454851, 440079, 391069, 362764, 370935, 447219, 371589, 369299, 414731, 424050, 493546, 586288, 584414, 491075, 491192, 510517, 505375, 485408, 464428, 515850, 552682, 597475, 576614, 587570, 671804, 778920, 835581, 951571, 1041847, 986283, 869479, 776414, 745684, 670522, 611760, 613508, 575234, 603374, 630097, 568791, 502693, 401007, 438887, 473641, 424272, 391696, 423060, 470086, 484679, 506087, 481190, 525356, 687317, 751476, 732846, 724640, 710999, 702230, 722772, 756513, 777657, 807128, 821462, 799293, 714506, 656643, 558807, 547974, 477962, 471872, 504796, 479119, 440919, 432221, 413642, 439249, 408307, 353853, 415288, 484119, 521093, 441077, 410460, 418971, 447223, 477317, 456631]
11010D56631p2331M6416J12348K0258N5059M4397N4692O0510O4782p165j11680
10999G23917k9383N726l8451k1792j3858m3936l8522M2154l3952n5494n5064n3859
10987C87486J8334j5182O2680K9333o7790j02708j7662L5544L7171P338N745m9645
10975C30644m2363m3100L0486L5235m110L2734P3764O3498j1088j0482j3669o4109
10963C77440J32557O5458l4784j2473k3599M5792p498j2569l7323o8874N767o38
10951D29256N5568k6341j0611J4442j79954o6217Q3115J9857k12l036m8901o8903
10939A98063j0304K6837O8396o5561j07129l538R4142L4227m0408M5484n660j04951
10927A29598l6516O2098J12453R8085J7936l7663Q3409R000o1708o8495R1314
$$ y = [456631, 384300, 430716, 543064, 563322, 618381, 662778, 717470, 777980, 842762, 835597, 723917, 694534, 700260, 661809, 640017, 626159, 582223, 543701, 585855, 551903, 496409, 441345, 387486, 405820, 390638, 453318, 482651, 414861, 312153, 294491, 330035, 367206, 374544, 380289, 330644, 288281, 245181, 275667, 310902, 306792, 339526, 413290, 476788, 465700, 455218, 441549, 377440, 509997, 575455, 540671, 528198, 504599, 550391, 542893, 530324, 493001, 424127, 429894, 429256, 484824, 458483, 447872, 462314, 282360, 216143, 299258, 319115, 318903, 315867, 266966, 198063, 187759, 214596, 282992, 217431, 110302, 106764, 200906, 235133, 194725, 240209, 234549, 129598, 93082, 155180, 267633, 365718, 383654, 345991, 429400, 438400, 376692, 308197, 399511]
10916C99511L1146m6842j4659N0755m9412m2270N25l4547o0428j6527J0833o6964
10904A61121M777J8700j1291n2675p968K9908m5038p2964L2305R3599O0596M9077
10892B60147r352o5572r995K0810n0307K9989K0866o0075j7230m7005q8561k6872
10880d3157N0741J8033K6388M4566j2837j10961p276L7323l005J7981L4602o9586
10868a7188j0916N4859O8147K9186K8194n0828n5501L7877l447M5052j00457j3830
10856A1148P8675O609k4357l1216L7903Q7426q6805j18401N2944J45964K2571
10845A82461K5846L9411m4817k3270m4225K4283k6652Q288o264M1157j12995p0945
10833g722j8738M3033N0109R078n1588J599l5798O8267M7340M8199N6918L6041
$$ y = [399511, 430657, 383815, 369156, 419911, 370499, 328229, 328754, 294207, 233779, 217252, 228085, 161121, 165898, 184598, 173307, 120632, 112664, 142572, 97534, 24570, 56875, 150474, 211070, 260147, 250795, 185223, 175228, 196038, 145731, 175720, 196586, 136511, 119281, 72276, -16285, -43157, 7584, 25617, 52005, 96571, 83734, -27227, -34503, 2820, -185, 17796, 52398, -17188, -28104, 26755, 94902, 124088, 152282, 101454, 45953, 83830, 80383, 125435, 24978, 11148, 89823, 96432, 72075, 40859, 78762, 166188, 79383, -39018, 13926, 159890, 182461, 208307, 247718, 202901, 179631, 135406, 159689, 133037, 141325, 135061, 176218, 63223, -7722, -26460, 16573, 66682, 75760, 24172, 25771, -10027, 58240, 105580, 153779, 210697, 246738]
10821B46738k2109m837m8p6888q2258M8267N5034L4458m6563m1395O8956L5647
10809B15002m0738K8644L1085n628o3781l3668l3609k969m4315O7190L5598p4585
10797G8226j5048m3180k9689l3941Q8854N4708k3800Q5783j198r5906k2531j6659
10785B5619k9555j075Q291J3992O124j1919j836l3136l0445K4148k9764Q1844
10773B2288P8544N6704Q0077N4440J3161n4041n3467j7133k9136J6425O9422m4431
10761A92853m9239l1569o2520k1417l0420M5881j4640L4005Q0997m6966n5785
10750D1180K350O986M333p4511j2360K2860J5165q2492r164q897L5180J35762
10738G6392M7932L3737K1079k2332m6015k0141l162J8977m6349N8734M2884o5221
$$ y = [246738, 224629, 219792, 219744, 142856, 60598, 108865, 163899, 198357, 151794, 110399, 179355, 215002, 174264, 202908, 233993, 228365, 164584, 130916, 97307, 94338, 50023, 117213, 152811, 78226, 63178, 19998, -9691, -43632, 45222, 99930, 76130, 161913, 160715, 64809, 42278, 25619, -3936, -5011, 3280, 17272, 23396, 11477, 9641, -23495, -53940, -29792, -59556, 22288, 100832, 157536, 237613, 292053, 305214, 251173, 197706, 180573, 151437, 167862, 237284, 192853, 143614, 112045, 49525, 28108, -2312, 43569, 28929, 62934, 143931, 96965, 41180, 43530, 50516, 54849, -19662, -32022, -9162, 6003, -76489, -85653, -94550, -59370, 76392, 124324, 158061, 179140, 156808, 110793, 90652, 87490, 106467, 60118, 118852, 161736, 96515]
10726I6515o3781m975L7987N896m7169K2988J08235K5341p0378k3642L6869J2706
10714A36592p7009o90P8940J8124k6548O7198Q632K97n8357q6290K590l2807o0834
10701c0162J5571n5406N5742J0828K3053N0779j9420j1986L2813K4185r4164n877
10689d044L3514p2176l467J42906J1067m7863O3070k0577n1786K8655j3812l9599
10677B5888Q4357m6849J7703M8778J6318l0679n1179o699K85P7158K9523l31l425
10664A60848p7920L2414L7552j1962N1327J46810K9942l4190n7599j20093M910
10653A62039L3227n1075J2941r853Q283M8178O7001P2569j1174L6992j9378l0065
10641C19685L7161K2368k0559k3078m0554O1412L2146K8343m0772r0332L0602
$$ y = [96515, 32734, 27759, 65746, 71642, 24473, 47461, 155696, 181037, 110659, 87017, 123886, 136592, 59583, 58893, 137833, 155957, 129409, 196607, 205239, 205536, 147179, 60889, 63479, 30672, -30162, -14591, -69997, -14255, -3427, 19626, 70405, 50985, 38999, 71812, 95997, 1833, -4044, 29470, -42706, -46173, 96733, 107800, 59937, 123007, 102430, 50644, 79299, 65487, 25888, 110245, 63396, 81099, 129877, 146195, 115516, 64337, 57638, 57923, 135081, 164604, 164273, 160848, 82928, 115342, 152894, 140932, 192259, 339069, 369011, 334821, 277222, 157129, 162039, 195266, 144191, 157132, 147279, 155562, 203740, 270741, 343310, 332136, 369128, 349750, 319685, 356846, 379214, 358655, 335577, 295023, 356435, 388581, 416924, 376152, 285820, 316422]
10630C16422M0950J4156O4160o0857j1206k8809P579J7114l0093l6598n3127o4560
10618A75131N4066M1856o0764K1205N2583p165n4342o3271k0612J8000J9197j17580
10606E8304n3906M1688Q3706K6186q8772J4884K1635P5605K1385K3163j4002k4123
10594A85753l2584l9464q1311l069j7307N5157M5990O5598M4580k0046j17939
10583H5358q1590J1412K5315O0888M6051l0609l8155J7379K6604j2316o5166l6067
10571I104K4738l6176o4679Q146M7157J38701N5797p507o5164p0171J1540O2050
10559A13536n2013o2083L1465N2218M091n4776q107J08933N3769j13046l5259
10548C8728J016M7770J2047l7019m982K6441L5469m483L3814J1186q9491L7891
$$ y = [316422, 357372, 371528, 435688, 374831, 363625, 334816, 342395, 359509, 329416, 292818, 239691, 175131, 229197, 271053, 210289, 231494, 284077, 276912, 222570, 159299, 138687, 156687, 175884, 58304, 4398, 46086, 129792, 155978, 67206, 82090, 103725, 179330, 200715, 223878, 209876, 185753, 153169, 113705, 32394, 29325, 12018, 67175, 113165, 178763, 223343, 203297, 85358, 3768, 15180, 40495, 101383, 147434, 116825, 78670, 96049, 122653, 110337, 45171, 9104, 33842, -2334, -67013, -58867, -11710, 126991, 182788, 175281, 110117, 39946, 51486, 113536, 61523, -560, 30905, 83123, 87214, 32438, 24331, 133264, 187033, 73987, 38728, 39744, 87514, 99561, 62542, 57560, 84001, 119470, 114987, 148801, 159987, 70496, 108387]
10536A08387P4614J2997K0872L3258q1734m8491m8379k7779J0873Q1124l4401
10525A01341p2247l319j224P5669K2526n6417o1315j0420k3702P8446m429l244
10513D1665Q766J2480l0953P9044o945p3691l6538k7445K4216j575p246j9492
10501c7714L481M4194k1291M0058k7676q0458K212o1656J8990K3931R5619R4044
10489I3734L9378O1255J3025n6236L5004M8780l1261j15884j38391o3380Q7190
10478b6786N9099m927k6238K4934j9487j2126p037j6135p4832M922L5006k234
10466f5841J4524J09609l9132l5951K0567r2540o1447n149J33623N5123O0641
10455I4027O2232L2444p1263l2590j116l6421J3298n5751L2276o3239L4567M5311
$$ y = [108387, 183001, 195998, 216870, 250128, 168394, 119903, 71524, 43745, 54618, 135742, 101341, 29094, 25775, 24551, 100220, 122746, 66329, 5014, -5406, -29108, 49338, 44909, 41665, 50431, 62911, 31958, 111002, 104057, 30366, -6172, -33617, -9401, -10976, -18222, -37714, -34233, 9961, -11330, 28728, 1052, -79406, -77194, -138850, -119860, -95929, -310, 93734, 133112, 194367, 207392, 151156, 186160, 234940, 203679, 87795, -50596, -113976, -26786, 32313, 27386, 1148, 26082, 6595, -5531, -12568, -28703, -103535, -98613, -63607, -65841, -51317, 58292, 19160, -16791, 3776, -88764, -150211, -155360, -21737, 33386, 94027, 156259, 188703, 117440, 84850, 83734, 47313, 60611, 4860, 37136, -26103, 8464, 53775]
10443E3775l3445M234J9863K923n5917k4665J9025N5223M2566J4568q805l7689
10431E1656k5912k274O1502M618K3504L482L3534J1282r1249L2938R9703n844
10419A96940k7345k4275l5116n0304P8660L0201m7338N1728Q4792M1670L4541
10408C34154m3306r0910l2128l6274j3698m9038o439l9728K7962M3167k3235o1356
10396I171M8108R5014o6813m2480k9284J3273k2246j6447O7261J1716O473l5877
10384C7869L596J0939n9979q2364O4944L4359k5975j07523k8777N6635Q1567R2145
10372G7436J0379K9258q38j6120k8399l8608p6080o9002P7029N7052Q2871j6100
10360H8878l9941L3698k9119K233J5701o0961o4199M5529L7912M0729L2761J4964
$$ y = [53775, 20330, 24564, 44427, 47350, -8567, -33232, -14207, 41016, 83582, 98150, 89345, 51656, 25744, 23470, 84972, 89590, 113094, 116576, 150110, 161392, 70143, 103081, 202784, 196940, 169595, 145320, 110204, 59900, 138560, 168761, 121423, 173151, 257943, 299613, 334154, 290848, 199938, 167810, 131536, 117838, 68800, 62361, 22633, 50595, 93762, 70527, 9171, 57279, 152293, 85480, 43000, 13716, 26989, 4743, -11704, 55557, 67273, 73746, 37869, 41465, 52404, -7575, -89939, -24995, 9364, -16611, -124134, -152911, -96276, -14709, 77436, 87815, 117073, 116235, 100115, 71716, 33108, -42972, -111974, -34945, 22107, 104978, 88878, 48937, 82635, 53516, 55749, 71450, 10489, -53710, -8181, 29731, 70460, 103221, 118185]
10348A18185R6339M1809K826M7794N5059J62332J32793n6775j8308J01266M1588
10337G24908M8309k8740j2124m3107j51326j59695l5028k4569L1563k3267j04450
10326B22474l0620L5574Q1384o8774j66818j35052j0218Q4779P6754L7467l2761
10315I4189n6840o1815n4165l3166n845J0290q790J01778J42403l6080n6865l1778
10303C316N1257l6970O958j8106L6685O2263K8985m1204m0439l1794j5128o7455
10291f1632L8212L8684l7176P1306P5570m7127n5530O5055R538q9649J8199L6856
10279F2306M5937L3493l3769P802j3933p4951j4719O8666N2011j3143o921K4807
10267A37586l8627j8684p2704p0157j2234J11388O6495k8693l201j4373j0467
$$ y = [118185, 214524, 256333, 259159, 306953, 362012, 524344, 657137, 600362, 582054, 683320, 724908, 773217, 744477, 732353, 689246, 537920, 378225, 343197, 318628, 350191, 326924, 222474, 191854, 227428, 308812, 240038, 73220, -61832, -72050, 12729, 89483, 126950, 94189, 37349, -24466, -78631, -111797, -117642, -107352, -116142, -14364, 128039, 91959, 35094, 3316, 54573, 17603, 24561, 6455, 43140, 105403, 134388, 93184, 52745, 20951, 5823, -61632, -23420, 15264, -21912, 49394, 124964, 77837, 22307, 87362, 96900, 7251, 25450, 62306, 108243, 141736, 107967, 115769, 101836, 26885, 12166, 80832, 132843, 119700, 112779, 137586, 98959, 80275, 7571, -62586, -74820, 36568, 103063, 74370, 71169, 56796, 46329]
10256D6329j0396l8252N8423O0825N7244j11579n9828O0602R5065K8258j16936
10245F9755K1003J0831k6430M1585r2571q5542K5468K2327J6457K0381N6330N347
10233H4941r397n0639j9101n2591K1352M8310j0942J379j1083k4782O3679K7374
10221F8500r8691M119m749J7176n2708N7687N4520k4137o919j6429J5423N9801
10209G3593O9441n5472p5566l936J4980m8407L9679N3181K3136K7730j2390l0084
10197G5885j21027m2147l3407M9088R2509L1274m4150k5571k8922P2655N885O992
10185C9064m2451l8467l0754J8732K4347P9987L157j6554L5909K1960m5377j7055
10173C2498N150n0883m5828o1229J0803Q846l6838Q534R1854J33514O9017M3427
$$ y = [46329, 35933, -2319, 56104, 116929, 174173, 62594, 2766, 63368, 158433, 186691, 69755, 90758, 101589, 75159, 116744, 24173, -61369, -35901, -13574, 2883, 23264, 79594, 84941, 75544, 24905, 5804, -46787, -25435, 22875, 11933, 13312, 2229, -22553, 41126, 68500, -30191, -26072, -30821, -13645, -66353, -8666, 45854, 21717, 14798, -1631, 13792, 73593, 143034, 87562, 11996, 8060, 23040, -25367, 14312, 67493, 90629, 118359, 105969, 75885, -45142, -87289, -120696, -71608, 20901, 52175, 8025, -17546, -46468, 26187, 32072, 39064, -3387, -41854, -72608, -53876, -29529, 50458, 53615, 37061, 72970, 94930, 49553, 32498, 37648, -13235, -59063, -120292, -109489, -100643, -137481, -128947, -37093, 96421, 165438, 208865]
10161B08865m8826j3032q9121p6382L0942K0204o3070k4890M5127Q0053m6426
10150B3444R542K8311j45480l5935J04210k6112J0067O1327m1485j6847K1924
10139g034L1448J2001L477l959n3288N120l635M399j7022o905J8664M9929n900
10126B7295K86K6079L1474L9304j5721J4884r0745m9539O5806P0289N741p4931
10114E0222k83P6277L0298j8718n826k5106n9459k6176O0574p772k7432m1084
10102E515K1687j9345J769L2233J8018O793n3880o091O5948p779m3903j05877
10090h4912m016R9764j2082m255R460P896k9710k4957J2910k1309l8919R830m097
10077h4397Q8518N6681O8163L0954r5445n9635l4835j5649J06037Q7467J0539
$$ y = [208865, 160039, 147007, 57886, -18496, 12446, 32650, -30420, -55310, -10183, 69870, 23444, 32986, 61297, -84183, -120118, -15908, -42020, -31953, 29374, -12111, -28958, -7034, 24414, 36415, 39892, 35933, -17355, -12235, -15870, -11471, -28493, -35398, -16734, 33195, 27295, 27581, 53660, 85134, 124438, 108717, 123601, 32856, -16683, 49123, 119412, 125153, 50222, 49939, 126216, 156514, 137796, 131970, 106864, 47405, 21229, 81803, 74031, 46599, 5515, 27202, 7857, 9626, 41859, 59877, 66670, 12790, 6699, 72647, 64868, 20965, -84912, -88928, 10836, -1246, -5501, 3959, 11855, -17855, -42812, -29902, -51211, -90130, -80300, -84397, 4121, 60802, 128965, 159919, 64474, 4839, -29996, -45645, 60392, 147859, 158398]
10066A58398j08911j5718j3970j2237j1560L3485J12881P0512n3306j21299P73
10055C9048l8069K4336M7651J7560N5999k4842l699l6159n2186L008k5847M4712
10043E1512N5221K9025o4999l2253k9539L9648N3041K6553K847j9604Q859k1653
10031I8658K4927j2772n9907J8133p022l7232n7573l6014k140j1120N3184J9817
10019i061R5644K5813n1210l3247J306j146L4574m4293m8949R302q563R208P4802
10006E4180K3544o8852k8400N781q613l9578j02217k2569M5326J04934R1973r404
9994D6105P2324l5566p3022O2629N6615j9646n1719n2976O8035N5733J2361Q666
9982A49539K7867l5503n8556k5908k5991j00720k395P3979M1962K7017Q842k2537
$$ y = [158398, 49487, 33769, 19799, 7562, -3998, 29487, 142368, 212880, 159574, 38275, 39048, 979, 25315, 72966, 90526, 146525, 121683, 117984, 81825, 29639, 32647, 6800, 51512, 106733, 135758, 70759, 38506, 8967, 48615, 101656, 128209, 131056, 111452, 120311, 98658, 123585, 110813, 50906, 69039, 62017, 24785, -32788, -68802, -70942, -82062, -28878, -9061, 86583, 112396, 61186, 27939, 29245, 28099, 62673, 18380, -30569, -21267, -29830, -20622, 54180, 77724, 8872, -19528, -13747, -22360, -61938, -164155, -186724, -141398, -36464, 55509, 46105, 118429, 82863, 9841, 72470, 129085, 109439, 57720, 4744, 72779, 128512, 140873, 149539, 177406, 141903, 83347, 57439, 31448, -69272, -71667, 2312, 44274, 71291, 80133, 57596]
9970E7596M7787K3311L9226L9854n9006p0720j4973O1835l3365q7626L3798L4976
9958G2693M3994o144n6525L1371m452r245n4694n0671Q520J58116P5930p0636
9946A38257q0293j07869p6135P6808M5468N421L4438J4852M3384R864k0632L850
9934H7413K18N2329k5921n0099j690P7127l7213J3699J0815l1076M0471n4763
9922H1310O3J7675n5584Q136l6k1287p7283K3941N4182J3734L3232J5810O2674
9909A56567Q2670j4883q3067k4656l812L528O6328Q5294J2930r7033n1083Q271
9897A41054P8575o4118J184K8534K1248p669o8509m0730N7947O3951J0112q2446
9885A39133o8759j9290l131n8259Q3564J2648j3129p9n1266o9482N4651n79K3480
$$ y = [57596, 105383, 128694, 167920, 207774, 148768, 78048, 63075, 124910, 91545, 3919, 37717, 72693, 116687, 110543, 54018, 85389, 80937, 71692, 16998, -33673, -25153, 132963, 208893, 138257, 57964, -49905, -126040, -49232, -3764, 1657, 36095, 50947, 94331, 104195, 83563, 87413, 87631, 139960, 114039, 63940, 62250, 139377, 102164, 115863, 126678, 95602, 136073, 81310, 81373, 99048, 43464, 51600, 51564, 30277, -47006, -23065, 31117, 44851, 78083, 93893, 156567, 239237, 224354, 141287, 116631, 112819, 116347, 182675, 267969, 280899, 183866, 132783, 141054, 219629, 155511, 156695, 185229, 206477, 198808, 130299, 89569, 147516, 211467, 221579, 139133, 70374, 51084, 47953, -10306, 73258, 85906, 72777, 72698, 21432, -48050, 6601, 6022, 29502]
9872B9502K3736J7949j7325n2773k4415K5100L8380l9556o5120o0895n2857M2899
9860a35375R5728M8705l3016n3367M221Q1783Q2189N0908K9173m2400j3974o4027
9848E0548K7803p37J5289r445n3626J7695L9481j5931j4450O3143L2349q6837
9836F5282p8150l3583R979m2466J49517R125L0537K8351N1896l1713j82322o1174
9824h4721J9379l204p462K1560K3191P1330l0715q0877j2943J01517N1699n4060
9812A4694m5203j3334O5843J6915K56K3529j4464k0787L7505n726M7582K5955
9800A32765j28067m6659L6434L7243O5242m1554q0154N1235j3336k2790P6473
9789F6832N6636m0205k8701J2320m4199o7592p129l6920J03806Q7905k9960m5560
$$ y = [29502, 53238, 71187, 53862, 1089, -23326, 1774, 40154, 598, -64522, -125417, -178274, -135375, -39647, 9058, -23958, -77325, -73104, 8679, 90868, 141776, 170949, 128549, 114575, 50548, 78351, 77614, 92903, 83458, 29832, 47527, 87008, 71077, 56627, 119770, 152119, 65282, -12868, -46451, -36472, -78938, 70579, 79704, 110241, 138592, 190488, 158775, -23547, -84721, -65342, -68546, -76008, -54448, -31257, 40073, 9358, -71519, -84462, 17055, 68754, 14694, -30509, -43843, 22000, 38915, 39171, 62700, 48236, 27449, 64954, 59228, 106810, 132765, 4698, -41961, -5527, 31716, 96958, 55404, -24750, 26485, 13149, -9641, 66832, 123468, 83263, 54562, 66882, 22683, -44909, -52038, -88958, 14848, 102753, 72793, 27233]
9777B7233k1516L024M9046J10596m0012r26k5861k01j0338N329j3782M88k5995
9764E7085N0320r8554M1686J9056o1801l6062L8400Q3057J20290l5949j03976
9753G3552n5857L2098J4392m670Q232O6911M2545k4045m9770j1811j17071p7420
9741a02914J0016Q9764Q911l4182J14606M3345K2032o6205n6715J9043j7799O7783
9729I7685j1395l836L9246l5219O1407m8232j27302J0864N8915J5492m6642n7490
9717d6507K8554K5505M9946L2736J5890L8070K2382K2327j20136k6930R3703J9903
9705A55443K9746k7787O989j2722K3073l2338k8648J8846J1958k0432m2910O921
9693H8139q007n2543j5470M108K7759m2988p3769k7655k5081L8213J27358J5588
$$ y = [27233, 5717, 8741, 57787, 168383, 128371, 127445, 101584, 101383, 91045, 96374, 82592, 83080, 57085, 107405, 8851, 50537, 69593, 7792, -28270, 10130, 93187, 213477, 177528, 73552, 17695, 49793, 64185, 59515, 67747, 134658, 177203, 153158, 103388, 91577, -25494, -102914, -92898, -3134, 5777, -28405, 86201, 129546, 151578, 85373, 28658, 47701, 29902, 97685, 86290, 82454, 121700, 86481, 147888, 99656, -27646, -16782, 42133, 57625, 10983, -46507, -17953, 7552, 57498, 90234, 106124, 144194, 166576, 188903, 68767, 41837, 135540, 155443, 185189, 157402, 164391, 151669, 174742, 142404, 113756, 132602, 144560, 124128, 81218, 88139, 80132, 27589, 12119, 16227, 43986, 998, -72771, -100426, -125507, -87294, 40064, 55652]
9681E5652K9493M3120q421m3752l9059K775R6019M1964M8335J7823j9431o2099
9669A62419N2286k5715p8380l4751R2340J4680P2275n154q5907m1377M805j6718
9657A10803k6746k5692M1019J06115l1322L3840L0775q7055n4409l693k8074K3016
9645H8577N7754K5271M8035J2607r160l8247O4668j8760k4878j2526k1789K1430
9633A92982m5188J1821K6023J5127N649n0231K4161j348p7615l5621k606N6690
9621A19844m1419o3411j3654O9007J00491k8307O098J8478L0816M7255o6024p4696
9609A04478j2667L2899M8936N2165M644l9781l4339J1791n689q9183n606P731
9597G5379L4196P9127r359M411O7473J889K6343J0759n3339j18615l2769K3338
$$ y = [55652, 85145, 128265, 119844, 76092, 37033, 39808, 135827, 177791, 226126, 243949, 224518, 162419, 214705, 188990, 110610, 75859, 168199, 182879, 255154, 250000, 164093, 122716, 127521, 110803, 84057, 58365, 99384, 205499, 174177, 208017, 238792, 151737, 97328, 93635, 65561, 88577, 146331, 171602, 219637, 232244, 223084, 184837, 249505, 230745, 205867, 193341, 171552, 192982, 147794, 159615, 185638, 200765, 206414, 156183, 180344, 178996, 101381, 65760, 63154, 119844, 78425, 15014, 1360, 70367, 170858, 142551, 148649, 167127, 197943, 245198, 179174, 104478, 91811, 124710, 173646, 225811, 230455, 190674, 156335, 168126, 162437, 73254, 67648, 75379, 109575, 188702, 179343, 183754, 251227, 253116, 279459, 290218, 236879, 118264, 85495, 108833]
9585A08833j974M0969Q4461P3306K36k1387k4587o0390k5353n6820M1498J4613
9573A73405M0323J6626k7318L0422J4145k8044j0394J2568l2704N8201k3569o2554
9561A61107J6283Q7689l0387k3833j5770o7852M5014Q0552J06540m6574r8335
9550B14434l1567l1678Q6664M4088K2731r132O0419l24l2575l6463m7106K2347
9538B61838o769J5176K5596n9317p1136N7427O5786P5712n021j05621J7980L8017
9526C09668N5170P9848m3321j39059K1134R1580L7194l9528L4237J8574k1638
9515D03859L3522J30356m4112j29820m274k3880M5738P5551m0294l4900L5970
9504D47716O9284j3690p4765k8012J3534J1247r334j6588o3552n1330L3707L0585
$$ y = [108833, 106859, 147828, 232289, 305595, 305831, 284444, 259857, 199467, 174114, 117294, 158792, 173405, 213728, 230354, 203036, 233458, 247603, 219559, 209165, 221733, 189029, 247230, 223661, 161107, 177390, 265079, 234692, 210859, 195089, 127237, 172251, 252803, 359343, 312769, 214434, 182867, 151189, 237853, 281941, 304672, 295540, 355959, 355635, 323060, 286597, 239491, 261838, 255069, 270245, 295841, 236524, 165388, 222815, 288601, 364313, 359292, 253671, 271651, 309668, 364838, 444686, 401365, 262306, 283440, 375020, 412214, 372686, 406923, 425497, 403859, 437381, 567737, 523625, 393805, 389531, 365651, 411389, 486940, 446646, 411746, 447716, 517000, 503310, 428545, 400533, 414067, 425314, 415980, 399392, 335840, 284510, 318217, 348802]
9492C48802O2867K5612j18J3938l0680j15681k3989J8259P5400j2904m2473O5482
9480C84515J5642k9710K9156J2822J0013L8336j6802L2221P0737O9442M4842n4338
9468F06876o5568p9507l1310K2781L2758j6228r8040R836K1397K9719J5181K2333
9456D70228R83L2624J02384r308k4602r543M4310J14755O4013p9905M626P4105
9444G84670j6994l8781j00055n221O4887J4422r6155r973M7598J08097J881M5219
9432G99595k8899Q431L6272J1753m8547J3511N1706M1394K7639O6773P7764o7592
9420I89800K2222J143P8565P9235K0495j26698j10348j8187M2356L8754M7166
9409A064503K1190j1331K9889M574k1230O8835j2661M0603Q8441j3865L9515O2317
$$ y = [348802, 411669, 437281, 437163, 451101, 420421, 304740, 280751, 299010, 374410, 361506, 319033, 384515, 400157, 370447, 399603, 412425, 422438, 460774, 443972, 476193, 546930, 616372, 661214, 606876, 541308, 461801, 430491, 453272, 486030, 469802, 371762, 381598, 402995, 432714, 447895, 470228, 471211, 503835, 606219, 596911, 572309, 562766, 607076, 721831, 785844, 705939, 710565, 784670, 767676, 728895, 628840, 623619, 688506, 702928, 606773, 596800, 644398, 752495, 754376, 799595, 770696, 779127, 815399, 827152, 778605, 792116, 843822, 885216, 912855, 979628, 1057392, 989800, 1012022, 1013165, 1091730, 1170965, 1191460, 1064762, 954414, 936227, 978583, 1017337, 1064503, 1085693, 1074362, 1104251, 1108825, 1087595, 1156430, 1143769, 1184372, 1272813, 1258948, 1298463, 1360780]
9397A360780r9271j6873P171J6958n9005K4357l1419j9814K5078P0058Q9690k5941
9385A341769q9702P666J5590k0302J5363n227J07164N5945K3091J2294N6177J4671
9373A534499Q864M5821J3782k0292k9149q49L3181L3358j5257j4841J7247m0210
9361A566154l7878O7439N5495m6379k5140J5989K1917j8193O0305l2823m7591
9350A579295m953P1373j1649J1821J12900j9381q5571j9026n3736p1787J19826
9339A629112l1403k1608N5512j6660n5395j3238J2404O3175k305m7510q581p557
9327A555946K987p3055r5130l3048q570K5286J9027K0207o0016m0570j02146q465
9315A202453P0226n214O3682J5269M4257p8359j26508l0271o7697J1163P2251
$$ y = [1360780, 1261509, 1244636, 1251807, 1268765, 1209760, 1234117, 1202698, 1182884, 1207962, 1278020, 1367710, 1341769, 1252067, 1259733, 1275323, 1255021, 1270384, 1265157, 1372321, 1428266, 1451357, 1463651, 1519828, 1534499, 1543363, 1589184, 1602966, 1582674, 1553525, 1552676, 1585857, 1619215, 1603958, 1589117, 1606364, 1566154, 1528276, 1595715, 1651210, 1604831, 1579691, 1595680, 1617597, 1599404, 1659709, 1626886, 1579295, 1574342, 1645715, 1634066, 1645887, 1758787, 1739406, 1653835, 1634809, 1581073, 1509286, 1629112, 1597709, 1576101, 1631613, 1614953, 1559558, 1546320, 1558724, 1621899, 1619594, 1572084, 1563503, 1555946, 1558933, 1485878, 1390748, 1357700, 1349130, 1374416, 1393443, 1413650, 1353634, 1313064, 1210918, 1202453, 1272679, 1267465, 1331147, 1346416, 1390673, 1312314, 1185806, 1155535, 1087838, 1099001, 1171252]
9304A171252M8989P379n921o5083O3622j7009r7124L7858n3535o4831L3798q719
9292A050676p4777n8190l80P5820R9822N3528n5900j22051k6253K8658r0358n736
9280H74859J3307P347k5844j8821P014n2418p3449o9404L6121M5167n5636m4796
9268F43447M3333m2530O368P7024N7890o8876K7675Q5148l6277p4263m6351n5198
9256F17390J9770j0529j4712j5724k7392m6422J4014L6654r042n9895k6498Q6700
9244E64314O1116l1790m9169k4814N7919J5003p6912K8025q378p418J7150p7564
9232D67482n412J01329m1010q8050m1572K3628L2713K1711l2293m3090o9818J223
9220C26841M7607r612J2038R4415n5519j52626L661J41156M5528m8555q3596J6223
$$ y = [1171252, 1220241, 1227620, 1221699, 1156616, 1220238, 1203229, 1106105, 1143963, 1090428, 1025597, 1059395, 1050676, 975899, 917709, 917329, 993149, 1092971, 1146499, 1090599, 968548, 942295, 970953, 880595, 874859, 888166, 895513, 869669, 850848, 857862, 805444, 731995, 662591, 698712, 743879, 688243, 643447, 686780, 644250, 650618, 727642, 785532, 716656, 744331, 829479, 793202, 718939, 672588, 617390, 637160, 626631, 611919, 596195, 568803, 522381, 536395, 573049, 564007, 504112, 477614, 564314, 625430, 593640, 544471, 519657, 577576, 592579, 515667, 543692, 535314, 527896, 545046, 467482, 462070, 563399, 522389, 434339, 392767, 416395, 449108, 470819, 438526, 395436, 325618, 326841, 374448, 364836, 376874, 471289, 415770, 263144, 266805, 407961, 453489, 404934, 321338, 337561]
9208C37561J4801L072m2180l5459K33n2534k1463J3769J3888N75K8562R1162M4191
9195C96178k7548o7009j43621m5182Q7488R8430o302P7300o7876n6585l762j8272
9183B23239n1867n0691J08204J623m2634l2377J1591J12596k9224o724m3547J3998
9171B14187m4548j1853j5626j1059K1806L7292K0897l700j06149O7710O6762p482
9159B28237m0357J1169M2431l4089r7595m0153K8802j3033l9602j272P8412Q2409
9147B05359k0637p3700P7837j6683p9129l2442M5490N8103M4622J5535L7421j7080
9135B44696r2064m7940J1582O9837k1023M2710M4395r4613J7599J3162L5016m3638
9123A79719q1342J6478l7168k9624P6551J02278L3580k5966L9505j2548p4784
$$ y = [337561, 352362, 355434, 313254, 277795, 278028, 225494, 204031, 217800, 231688, 232263, 260825, 351987, 396178, 368630, 301621, 158000, 112818, 200306, 298736, 292434, 369734, 301858, 245273, 241511, 223239, 171372, 120681, 228885, 230508, 187874, 155497, 167088, 279684, 250460, 243736, 200189, 214187, 169639, 157786, 142160, 131101, 152907, 190199, 211096, 207396, 101247, 168957, 235719, 228237, 187880, 199049, 241480, 207391, 109796, 69643, 98445, 85412, 45810, 44538, 122950, 205359, 184722, 111022, 188859, 172176, 93047, 60605, 106095, 164198, 208820, 224355, 261776, 244696, 152632, 104692, 116274, 186111, 165088, 207798, 252193, 157580, 175179, 188341, 223357, 179719, 98377, 114855, 77687, 48063, 124614, 226892, 260472, 234506, 274011, 261463, 186679]
9112A86679n8784q9871P6620Q0852J2054j11675q7259p7041j5779Q5880K0539
9101B2215J5445J2689O9811P1199o7123q1123K1643M6857K7555p681l7914j8651
9089G4922K0658K0252j4474K1873m1374o7746n9489N4060P6676n2550L9281M1219
9077A13308m9333J1423J08655l5771p9321k6871r026O2158N2013J9790o110K3983
9065A84898l796r227p9814m1717j0644J2914k3398J903j5910N1857M9418j875
9053A14609m7242L382l8002l5602k3014L5648J07494O9487l2367q5963K4258o877
9041H5811j3015l5558N8695j3441k826n2157m5677L7140l7755j526k809O7416
9029D4298Q3771J931p8694M520l8036L9321K7362P213K5728j15983j2273K4671
$$ y = [186679, 127895, 38024, 114644, 195496, 207550, 95875, 8616, -68425, -84204, 1676, 22215, 37660, 50349, 120160, 191359, 124236, 43113, 64756, 111613, 139168, 131487, 93573, 74922, 95580, 115832, 101358, 123231, 81857, 14111, -45378, 8682, 85358, 32808, 72089, 113308, 63975, 75398, 184053, 148282, 68961, 42090, 33064, 95222, 147235, 167025, 160915, 184898, 181102, 171875, 92061, 50344, 39700, 52614, 29216, 31119, 15209, 67066, 116484, 114609, 67367, 70749, 32747, -2855, -25869, 9779, 117273, 186760, 154393, 68430, 92688, 85811, 72796, 37238, 95933, 82492, 79666, 27509, -18168, 18972, -18783, -20309, -23118, 44298, 128069, 130000, 51306, 55826, 17790, 57111, 84473, 91686, 117414, 1431, -10842, 13829]
9017A3829M4357Q058j6369J21861k0521m1693k1607k4101o1249K6195q619q1608
9005f1467L4337O8254M522j3163P3477p951n7856n9594K5893L7542K5812n067
8993F4739K7546N1070J8191k2081J8888k6317M43j3084k7628o2777J386k7029
8981C347O6857L517o8143j22593l8400O286O1600O0699N690j4643l6763N4769
8969a7777o3236Q677P1218O5920m8175O2792o0095J7339K1860L1766J0777M4438
8957A45504R073o6768k0507k8637o2943q08O6854K4565k261r356o3023K3239q161
8944F771J5682L9645j2630L9345j3622j9165R032P003J3922j30104n4001R2849
8932e273J4634l2517n5639L8775K1650j6458P9998l3540j9495k1806j2896R2818
$$ y = [13829, 58186, 66244, 49875, 171736, 151215, 109522, 87915, 63814, 2565, 28760, 20141, -61467, -27130, 41124, 45646, 32483, 105960, 98009, 40153, -19441, 6452, 43994, 69806, 64739, 92285, 143355, 161546, 139465, 158353, 132036, 132479, 119395, 91767, 28990, 30376, 3347, 70204, 73721, 5578, -117015, -155415, -149129, -87529, -26830, -21140, -35783, -72546, -17777, -81013, -72336, -1118, 64802, 16627, 79419, 19324, 36663, 58523, 90289, 101066, 145504, 154577, 87809, 67302, 38665, -24278, -25086, 41768, 66333, 64072, 54716, -8307, 14932, 6771, 22453, 62098, 49468, 88813, 75191, 56026, 65058, 72061, 85983, -44121, -98122, -5273, 9361, -23156, -78795, -40020, -18370, -34828, 45170, 11630, -7865, -29671, -42567, 50251]
8920E0251l4290m002M7639K5731L5478M5603m2018m3517j9470l4104N317j5751
8908A6867K0659k3788m4646K354n0472P1807J5311j5054o5705P596O2993P0532
8896F8454n8016L2737O8547P7659Q2593J05717p5527j62445n8033j410J110M6639
8884A28025P8489n9884r4587l0619k2263j7251k8680M5788L3521L122q005m9515
8872b1859K1100O5027K268N42k3729J1487J6002M2575j4330J1011Q989j3393o7693
8859C7997J8559j2983n3652m4477r412M9800M3492N8109l2345n1146M4039l1884
8847A6097L6776L7460J7263l3357r5106o4098N4866j0143r3460N47K9260Q0600
8835b3295N0901j14384m574M4285l7694J692P9007L7393m0731k9461j9598K2085
$$ y = [50251, 15961, 11959, 59598, 85329, 120807, 166410, 124392, 80875, 61405, 27301, 32618, 16867, 37526, 13738, -30908, -28554, -79026, -7219, 8092, -6962, -72667, -65071, -2078, 68454, 10438, 43175, 111722, 189381, 271974, 377691, 302164, 139719, 81686, 80276, 81386, 128025, 206514, 146630, 52043, 21424, -839, -18090, -46770, -982, 32539, 35661, 27656, -21859, -759, 64268, 66536, 67078, 43349, 54836, 70838, 113413, 99083, 110094, 119083, 105690, 37997, 56556, 43573, -10079, -54556, -63968, -14168, 29324, 87433, 55088, 3942, 47981, 16097, 52873, 90333, 107596, 74239, -20867, -84965, -30099, -40242, -133702, -133155, -103895, -23295, 27606, -86778, -91352, -47067, -84761, -83069, -4062, 33331, -7400, -36861, -56459, -34374]
8823c4374L4540O7173m4976m9585J01916M8332p2949O506p5960L8853L0675O331
8811E6482K8544P080K3390K0735k6312o408O5432j2696P856N7644o73M5008k7042
8798B39040k0263o059J16923j3449l9085l1305p6735K8285K2888k5273j9135k5933
8786A49899m0990n3236K7257K3862q96L010L8876k3692q1914Q549M9996K92j1353
8773H9660m600M0157q5839J586q153L4566N573l4M0191P9907K8327J1242m6734
8760A85849O3717K6184O5978P0519o0840l5741j4989K9362q726O9213N3217n2921
8748C90822p8971J8593n1961k1796M4405P7385M2672K8212Q493m3537j46493j05309
8736A62515j8469L2707o8400J9594M3950m8728o535L8995r460n550k2466q422
$$ y = [-34374, 166, 67339, 22363, -27222, 74694, 123026, 50077, 56583, -19377, 19476, 50151, 56482, 85026, 92106, 115496, 136231, 109919, 103511, 168943, 156247, 164103, 221747, 221074, 266082, 239040, 218777, 212718, 329641, 316192, 277107, 245802, 169067, 197352, 220240, 194967, 175832, 149899, 108909, 55673, 82930, 106792, 105896, 108906, 147782, 124090, 42176, 50725, 100721, 101013, 89660, 85060, 125217, 39378, 40964, 32811, 67377, 72950, 72916, 113107, 193014, 221341, 232583, 185849, 249566, 275750, 341728, 412247, 351407, 315666, 300677, 330039, 321313, 390526, 443743, 390822, 311851, 330444, 278483, 256687, 301092, 378477, 421149, 449361, 457854, 414317, 267824, 162515, 144046, 176753, 108353, 127947, 171897, 123169, 116634, 155629, 146169, 140619, 118153, 109731]
8724A09731P1112j1452K4656n179M5071J1168l8902n8344K935J9053P8441M7808
8712B96098N9089P3404K8934p5262m9831N1266J8401j9831r2809J9232K0870r4122
8700B35439J3510l3019j24004o3034O3870Q1860r1610k8691K9444M371j0257O9687
$$ y = [109731, 180843, 169391, 194047, 188868, 233939, 245107, 206205, 147861, 150796, 169849, 248290, 296098, 355187, 428591, 457525, 382263, 332432, 383698, 402099, 382268, 289459, 308691, 329561, 235439, 248949, 215930, 91926, 28892, 92762, 174622, 83012, 54321, 83765, 88136, 77879, 147566]
$$ [...]
##END NTUPLES=NMR SPECTRUM
##END=
