##TITLE=Analysis number 307811
Compound Code cc 10408
Book Reference 438/4
Project Code adrs
Chemist Name antons
##JCAMPDX= 6.0         $$ Bruker NMR JCAMP-DX V2.0
##DATA TYPE= NMR SPECTRUM
##DATA CLASS= NTUPLES
##ORIGIN= Bruker BioSpin GmbH
##OWNER= NMR
$$ XWIN-NMR		Version 3.5
$$ Fri May 13 12:33:45 2005 GMT Daylight Time (UT+1h)  MAYBRIDGE\NMR@NMR_250MHZ
##.OBSERVE FREQUENCY= 250.131544655141
##.OBSERVE NUCLEUS= ^1H
##.ACQUISITION MODE= SIMULTANEOUS (DQD)
##.ACQUISITION SCHEME= undefined
##.AVERAGES= 16
##.DIGITISER RES= 18
##SPECTROMETER/DATA SYSTEM= dpx250
##.PULSE SEQUENCE= zg30
##.SOLVENT NAME= CDCl3
##.SHIFT REFERENCE= (INTERNAL, CDCl3, 0, 16.4558)
##AUDIT TRAIL= $$ (NUMBER, WHEN, WHO, WHERE, WHAT)
$$ ##TITLE= Audit trail, XWIN-NMR		Version 3.5
$$ ##JCAMPDX= 5.01
$$ ##ORIGIN= Bruker BioSpin GmbH
$$ ##OWNER= NMR
$$ C:\u/data/dgb/nmr/ADRS/2890/pdata/1/auditp.txt
$$ ##AUDIT TRAIL=  $$ (NUMBER, WHEN, WHO, WHERE, WHAT)
(   1,<2005-05-13 12:33:26.24 +100>,<MAYBRIDGE\NMR>,<NMR_250MHZ>,
      <created by zg, POWCHK disabled, PULCHK disabled
       configuration hash MD5:
       62 19 C7 07 E1 42 D1 B7 37 6C 3D D0 77 39 F9 E6
       data hash MD5: 64K
       7B 89 51 26 28 4A BC 34 D4 71 80 9F 01 36 2A 28>)
(   2,<2005-05-13 12:33:36.76 +100>,<MAYBRIDGE\NMR>,<NMR_250MHZ>,
      <Start of raw data processing
       ef LB = 0.3 FT_mod = 6 PKNL = 1 SI = 32K 
       data hash MD5: 32K
       68 A5 48 2B 47 39 2A 5A 15 0D 78 56 E0 F2 15 CC>)
(   3,<2005-05-13 12:33:38.59 +100>,<MAYBRIDGE\NMR>,<NMR_250MHZ>,
      <apk 
       data hash MD5: 32K
       66 84 AB 98 0F F0 96 B9 E3 50 CD C8 51 EB 54 18>)
(   4,<2005-05-13 12:33:39.26 +100>,<MAYBRIDGE\NMR>,<NMR_250MHZ>,
      <abs ABSG = 5 
       data hash MD5: 32K
       68 63 31 A5 37 A7 F2 DD 16 32 76 06 16 35 72 A3>)
$$ ##END=
$$ 
$$ hash MD5
$$ 69 01 23 9B 50 B5 23 6E A5 C1 9A 03 ED 4B 5D FA
##$RELAX= 
##$RELAX= 
##$RELAX= 
##$RELAX= 
##$RELAX= 
##$RELAX= 
##$RELAX= 
$$ Bruker specific parameters
$$ --------------------------
##$DU= <C:\u>
##$EXPNO= 2890
##$NAME= <ADRS>
##$PROCNO= 1
##$TYPE= <nmr>
##$USER= <dgb>
##$AMP= (0..31)
100 100 100 100 100 100 100 100 100 100 100 100 100 100 100 100 100 100 
100 100 100 100 100 100 100 100 100 100 100 100 100 100 
##$AQSEQ= 0
##$AQ_mod= 3
##$AUNM= <au_zg>
##$AUTOPOS= <27 >
##$BF1= 250.13
##$BF2= 250.13
##$BF3= 250.13
##$BF4= 250.13
##$BF5= 500.13
##$BF6= 500.13
##$BF7= 500.13
##$BF8= 500.13
##$BYTORDA= 1
##$CFDGTYP= 0
##$CFRGTYP= 5
##$CHEMSTR= <none>
##$CNST= (0..31)
1 1 145 1 1 1 1 1 1 1 1 1 1 1 1 1 1 1 1 1 1 1 1 1 1 1 1 1 1 1 1 1 
##$CPDPRG= <>
##$CPDPRG1= <>
##$CPDPRG2= <>
##$CPDPRG3= <>
##$CPDPRG4= <mlev>
##$CPDPRG5= <mlev>
##$CPDPRG6= <mlev>
##$CPDPRG7= <mlev>
##$CPDPRG8= <mlev>
##$CPDPRGB= <>
##$CPDPRGT= <>
##$D= (0..31)
0 1 0 0 0 0 0 0 0 0.06 0 0 0 0 0 0 0.0002 0 0 0 0 0 0 0 0 0 0 0 0 0 0 
0 
##$DATE= 1115984005
##$DBL= (0..7)
120 120 120 120 120 120 120 120 
##$DBP= (0..7)
150 150 150 150 150 150 150 150 
##$DBP07= 0
##$DBPNAM0= <>
##$DBPNAM1= <>
$$ [...]
##$SUBNAM7= <"">
##$SUBNAM8= <"">
##$SUBNAM9= <"">
##$SW= 20.6930455092707
##$SWIBOX= (0..15)
0 0 3 0 0 0 0 0 0 0 0 0 0 0 0 0 
##$SW_h= 5175.983436853
##$TD= 65536
##$TD0= 1
##$TE= 295.16
##$TE2= 300
##$TE3= 300
##$TEG= 300
##$TL= (0..7)
0 120 120 120 120 120 120 120 
##$TP= (0..7)
150 150 150 150 150 150 150 150 
##$TP07= 0
##$TPNAME0= <>
##$TPNAME1= <>
##$TPNAME2= <>
##$TPNAME3= <>
##$TPNAME4= <>
##$TPNAME5= <>
##$TPNAME6= <>
##$TPNAME7= <>
##$TPOAL= (0..7)
0.5 0.5 0.5 0.5 0.5 0.5 0.5 0.5 
##$TPOFFS= (0..7)
0 0 0 0 0 0 0 0 
##$TUNHIN= 0
##$TUNHOUT= 0
##$TUNXOUT= 0
##$USERA1= <user>
##$USERA2= <user>
##$USERA3= <user>
##$USERA4= <user>
##$USERA5= <user>
##$V9= 5
##$VALIST= <valist>
##$VCLIST= <CCCCCCCCCCCCCCC>
##$VD= 0
##$VDLIST= <DDDDDDDDDDDDDDD>
##$VPLIST= <PPPPPPPPPPPPPPP>
##$VTLIST= <TTTTTTTTTTTTTTT>
##$WBST= 1024
##$WBSW= 4
##$XGAIN= (0..3)
0 0 0 0 
##$XL= 0
##$YL= 0
##$YMAX_a= 636249
##$YMIN_a= -668357
##$ZGOPTNS= <>
##$ZL1= 120
##$ZL2= 120
##$ZL3= 120
##$ZL4= 120
##$ABSF1= 16.45583
##$ABSF2= -4.237343
##$ABSG= 5
##$ABSL= 3
##$ALPHA= 0
##$AQORDER= 0
##$ASSFAC= 0
##$ASSFACI= 0
##$ASSFACX= 0
##$ASSWID= 0
##$AUNMP= <proc_1d>
##$AZFE= 0.1
##$AZFW= 0.1
##$BCFW= 0
##$BC_mod= 0
##$BYTORDP= 0
##$COROFFS= 0
##$CY= 12.5
##$DATMOD= 1
##$DC= 0
##$DFILT= <>
##$DTYPP= 0
##$F1P= 14.0000005364418
##$F2P= -0.99999901652339
##$FCOR= 0.5
##$FTSIZE= 32768
##$FT_mod= 6
##$GAMMA= 0
##$GB= 0
##$INTBC= 1
##$INTSCL= 1
##$ISEN= 128
##$LB= 0.3
##$LEV0= 0
##$LPBIN= 0
##$MAXI= 10000
##$MC2= 0
##$MEAN= 0
##$ME_mod= 0
##$MI= 0
##$NCOEF= 0
##$NC_proc= -2
##$NLEV= 6
##$NOISF1= 0
##$NOISF2= 0
##$NSP= 0
##$NTH_PI= 0
##$NZP= 0
##$OFFSET= 16.45583
##$PC= 1
##$PHC0= 136.3403
##$PHC1= 5.828227
##$PH_mod= 1
##$PKNL= yes
##$PPARMOD= 0
##$PSCAL= 4
##$PSIGN= 0
##$REVERSE= no
##$SF= 250.130016550819
##$SI= 32768
##$SIGF1= 0
##$SIGF2= 0
##$SINO= 400
##$SIOLD= 32768
##$SREGLST= <1H.CDCl3>
##$SSB= 0
##$STSI= 32768
##$STSR= 0
##$SW_p= 5175.98343685301
##$SYMM= 0
##$S_DEV= 0
##$TDeff= 65536
##$TDoff= 0
##$TI= <Analysis number 999999
Compound Code 99
Book Reference 9
Project Code 9>
##$TILT= no
##$TM1= 0
##$TM2= 0
##$TOPLEV= 0
##$USERP1= <user>
##$USERP2= <user>
##$USERP3= <user>
##$USERP4= <user>
##$USERP5= <user>
##$WDW= 1
##$XDIM= 32768
##$YMAX_p= 317978231
##$YMIN_p= -22428
$$ End of Bruker specific parameters
$$ ---------------------------------
##NTUPLES= NMR SPECTRUM
##VAR_NAME=  FREQUENCY,     SPECTRUM/REAL,   SPECTRUM/IMAG
##SYMBOL=    X,             R,               I
##VAR_TYPE=  INDEPENDENT,   DEPENDENT,       DEPENDENT
##VAR_FORM=  AFFN,          ASDF,            ASDF
##VAR_DIM=   32768,         32768,           32768
##UNITS=     HZ,            ARBITRARY UNITS, ARBITRARY UNITS
##FACTOR=    0.157963299565203, 1,           1
##FIRST=     4116.09693529844, 0,            0
##LAST=      -1059.88650155457, 0,           0
##MIN=       -1059.88650155457, -22428,      0
##MAX=       4116.09693529844, 317978231,    0
$$ Real data points
##PAGE= N=1
##DATA TABLE= (X++(R..R)), XYDATA
$$ [...]
17061B170k979q56J621K146J053r82k841k302J902L079J849k254o896J967l479
17046f802k026K743L936K067J469N45j757j244L981M692k02P93q2q60l58l424
17030C471m296L718j959j734k745J874j583j854k443J510M103L881K594m635l023
17015c121k036L299M007l34k88P39k721J511j618j289L65J159J044J547J66l957
16999a527k440o37K399R90m753m929K961M26L974N589j765j295K509l296k025
16984c819J467k170K824J873q3J912K39N44j298j100R95J97J402J244n54m457
16968g84l602P54O5m66k684P23M346M597k911J611J711j776k651L384K235J164
16952E716j580l083j398l12J214J109J827l586Q10K601L623j815J346j781k212
$$ y = [2170, -809, -1665, -44, 2102, 3155, 2173, -668, -2970, -1068, 2011, 3860, 1606, -5290, -3323, -6802, -8828, -6085, -2149, -82, 1387, 1932, 175, -1069, 2912, 7604, 7402, 8195, 8113, 7253, 6895, 3471, -825, 2893, 934, -800, -3545, -1671, -3254, -5108, -7551, -6041, -1938, 1943, 4537, -98, -3121, -5157, -1858, 2149, 1815, 1527, 2266, -455, 1056, -562, -1851, -1486, -327, 717, 2264, 2430, -1527, -3967, -4604, -2205, -1215, -5968, -10897, -7936, -7510, -3536, 2053, 288, -1007, 1502, -1794, -3819, -2352, -4522, -1698, 175, 92, 2004, 2243, 2787, 1489, 389, 1384, 1581, 2983, 4227, 3673, -784, -4386, -3632, -3567, -4033, -6717, -5994, -1648, 2949, 38, 1649, 3360, 1584, -1067, 2317, 4552, 5716, 4136, 1053, -345, -657, 557, 1666, 3493, -93, 717, 3318, 6941, 5126, 6472, 4691, 2479]
16937B479J282k653J942j217m8Q7J684m886J464N438k85J455L72Q44L197P90k069
16920I876l608O031K542q55q4k510j866j525J366K872J938M5k603j54q23j756
16904H886m189l93L946K460j062M5j736n597k56K990P8J568o37J108j413k668
16888C130o51j23J756K366k625k86p55n307J221q41N45j296o03R00j023O99K435
16871d58M446L521k047n72p601N20N728N581M16K506o247j960J126q45k018J20
16855B216J179J627M473K051N352K532m077J723K486J885k171L812L251k377j738
16840B2224R22N626K020j939N23j34k567m253j900K348N337j920k039k449n68
16825B1231j89j207o68l91m532l919l343J134J016K67q56R16l796J68K304j813
$$ y = [2479, 3761, 1108, 3050, 1833, 1785, 1872, 3556, -1330, 134, 5572, 5287, 6742, 7114, 7958, 11155, 11945, 9876, 6268, 12299, 14841, 13986, 13902, 11392, 9526, 8001, 9367, 12239, 14177, 14222, 11619, 11465, 10642, 8886, 4697, 4304, 8250, 10710, 9648, 9693, 7957, 2360, 2104, 5094, 5172, 6740, 6103, 7211, 5798, 3130, 2479, 2356, 4112, 6478, 3853, 3567, 2812, -2495, -1274, -2115, -1570, -2866, -3469, -2569, -3592, -2893, -458, 3988, 7509, 5462, 4890, -2711, -2191, 3537, 9118, 9534, 12040, 5793, 3833, 4959, 4114, 2096, 2216, 3395, 5022, 9495, 11546, 16898, 19430, 15353, 17076, 19562, 21447, 19276, 23088, 26339, 23962, 22224, 23146, 28772, 30792, 28853, 29376, 29242, 26675, 22422, 20522, 22870, 28207, 26287, 24248, 21799, 21231, 21042, 19835, 19167, 18776, 14244, 10325, 6982, 8116, 9132, 9399, 8543, 9459, 5663, 5831, 8135, 6322]
16809F322k762N93P7K546k18L4Q51p33J464L115L209L944j638Q3k00K229K545
16792B1461k226n034j207K212K248J035r44m07L122L133N547Q557J2249J9320
16778F9066J7032K0645L1588L0552L0173L8164M2641M4896N0891M5730K4262N236
16766D50876L665K069Q513O895j7942m0243n0681m6860l6696k9438l2411l5423
16754A82324l3243k6571j8564j1931n995o391n441l194l76k481l319j596m715
16741E8507n104R36k04l213Q43O63l278P00p89j462p096l018k42J354q148l304
16725B7145O1k715L69M064k683n937N6j134r0N491J186J766r297k735P49n28K422
16708A8190k70j12L298K400k20l183k413m057r59K928p16k92j178J19l118K129
$$ y = [6322, 3560, 4153, 4230, 6776, 6558, 6592, 7443, 6710, 8174, 11289, 14498, 18442, 16804, 16887, 16687, 18916, 21461, 19235, 14201, 12994, 15206, 17454, 18489, 17545, 17138, 20260, 23393, 28940, 37497, 49746, 69066, 86098, 106743, 138331, 168883, 199056, 237220, 279861, 324757, 375648, 421378, 445640, 450876, 454541, 456610, 465123, 472018, 454076, 413833, 363152, 316292, 279596, 250158, 217747, 182324, 149081, 122510, 103946, 92015, 86020, 79629, 74188, 70994, 70618, 68137, 64818, 63222, 58507, 53403, 54339, 54135, 50922, 51765, 52428, 49150, 49850, 49061, 47599, 40503, 37485, 37243, 38597, 30449, 27145, 27206, 24491, 24860, 28924, 26241, 20304, 20360, 19226, 19136, 24627, 25813, 27579, 18282, 15547, 16296, 15768, 18190, 17920, 17808, 21106, 23506, 23286, 20103, 17690, 13633, 12674, 15602, 14886, 14594, 13416, 13535, 10417, 12546]
16692A2546N032J450N13m115m229j267K700j945r2L600L442M139L90r68l244n392
16676A2560K468Q92j219o77Q800J6p66l179j086K857J713P61O2j63L805n26l597
16659B2721k912n617o29K179K782l039j851k261K24J556l037p90J612p79j641
16644H518j968K988N99R12K558j061j179k064m466J355J0j169j965O511L790k867
16628A0502o417k23J044L407Q79K808K752M822K815j577r307j2192m458j096M951
16613a290R404P748L792N216M436k503n303n0L920M75n55K970p148p744o825o828
16597b85j612P919J0490P337O472L765J264o520N06l947J398P93j087N643N830
16582C7966M54j970l766p974n691j556J109j723J04l054j223l7k054L705R54j03
$$ y = [12546, 17578, 19028, 19541, 15426, 11197, 9930, 12630, 10685, 10593, 14193, 17635, 21774, 22164, 21196, 17952, 12560, 15028, 15920, 14701, 14024, 22824, 22840, 22074, 18895, 17809, 20666, 22379, 23140, 23202, 23039, 26844, 26318, 22721, 19809, 14192, 13563, 15742, 18524, 15485, 13634, 11373, 11597, 13153, 10116, 9326, 10938, 10159, 8518, 6550, 9538, 10137, 11049, 13607, 12546, 11367, 9303, 4837, 6192, 6202, 5033, 3068, 9579, 13369, 10502, 4085, 3862, 4906, 8313, 9192, 12000, 14752, 19574, 22389, 20812, 11505, -687, -5145, -6241, -1290, 8114, 15862, 19654, 24870, 29306, 26803, 21500, 21450, 25370, 25845, 25290, 28260, 21112, 13368, 6543, -285, -1897, 6022, 16512, 23849, 30321, 34086, 35350, 28830, 29336, 25389, 26787, 27580, 26493, 32136, 37966, 38420, 36450, 32684, 24710, 19019, 17463, 18572, 16849, 16953, 13899, 12676, 12639, 10585, 14290, 15244, 15141]
16566A5141J617J896k384J851l569k940J870k581j486p522l468L048L638Q44j716
16551D239K763P522l55L470K177l70j384j471m994k498l379j141j52n32l697J118
16535A316O225K888P98j155m349K411m73J425j650k828N926J594k187p34M458
16520A3665O016l235j432J032o249k70M341M57l186l009L21L076J507r5p84J852
16504A4007k832J252M606j400l422j00n24K449J585J35n01K398L069K806l746
16489A9782J02k08Q84K765m375j735K294R57k241J14R86p85l805n2L398k064j249
16472A4768M192K007R56J184N170L267j876J952J305K263k303J737N326Q066P369
16457E5383R008N668M095J772L144P090K556j781j663m251J60r3k986p381l247
$$ y = [15141, 16758, 18654, 16270, 18121, 14552, 11612, 13482, 10901, 9415, 1893, -1575, 1473, 5111, 5955, 4239, 7002, 14524, 14169, 17639, 19816, 19446, 18062, 16591, 11597, 9099, 5720, 4579, 4427, 3895, 198, 1316, 7541, 10429, 11227, 10072, 5723, 8134, 7661, 9086, 7436, 4608, 10534, 12128, 9941, 9207, 13665, 19681, 16446, 15014, 16046, 9797, 9527, 13868, 14325, 11139, 8130, 8451, 11527, 13034, 12939, 12155, 14007, 11175, 12427, 17033, 15633, 12211, 12111, 11587, 14036, 15621, 15756, 15255, 17653, 20722, 23528, 19782, 19884, 19676, 20560, 23325, 18950, 17215, 19509, 20466, 18225, 18339, 19325, 18540, 14735, 14683, 18081, 16017, 14768, 18960, 20967, 21923, 23107, 28277, 31544, 29668, 31620, 32925, 35188, 32885, 34622, 39948, 48014, 55383, 64391, 70059, 74154, 75926, 79070, 86160, 88716, 86935, 85272, 81021, 81181, 81088, 78102, 70721, 67474]
16442F7474j133k261q756m488j187m665J239n57j017n677m985j643k540M508K526
16427C6838J089m10j746l105j330P84j072j215K187K168J367L238J88n268K944
16412C6657L321j133j358m78K570r49l554k097N694P291p69k172q82M737k434
16397D4444k415m974j264K121K319l022n551n722q74n39K187Q79j992l672k897
16382A9028N23J313J41J055J832l34j314p50J027p80l809j425j139k456N07L864
16366A7283K288K605J289M846O805M318l478j279J359L468J494K305M072l605
16352D3770k529J388N179k314j866j603j743J580J755J335j11m04J952P498M877
16337E8764R59P255R114J1096J3745J1475J3403J4343J6714K5325K3873K2334
$$ y = [67474, 66341, 64080, 55324, 50836, 49649, 44984, 46223, 45666, 44649, 38972, 33987, 32344, 29804, 34312, 36838, 37927, 37517, 35771, 32666, 31336, 32120, 31048, 29833, 32020, 34188, 35555, 38793, 38981, 33713, 36657, 39978, 38845, 37487, 37009, 39579, 38630, 35076, 32979, 38673, 45964, 45195, 43023, 42141, 46878, 44444, 42029, 37055, 35791, 37912, 40231, 37209, 31658, 25936, 25062, 24523, 26710, 27589, 25597, 21925, 19028, 19551, 20864, 21005, 22060, 23892, 23558, 22244, 21494, 22521, 21741, 17932, 16507, 15368, 12912, 13419, 17283, 19571, 22176, 23465, 28311, 35116, 39434, 35956, 34677, 36036, 39504, 40998, 43303, 47375, 43770, 41241, 42629, 47808, 45494, 43628, 42025, 40282, 41862, 43617, 44952, 44841, 44437, 46389, 53887, 58764, 59723, 66978, 76092, 87188, 100933, 112408, 125811, 140154, 156868, 182193, 206066, 228400]
16325B28400K3153K1355J5704J5022J884L670q71o488j1967q942k0192j6256j8302
16312B26170k1839j3358j3525j0738q362n458m473k288j833J718L917N793Q754
16299A64478O866J347L543Q109J0996J1218M637P914P282O417O435M227K806N753
16285B52028M531L143L336N077P031P427O101L206N099Q241M182N422O964P648
16271C29436N482Q261R855J0773R962N917N355M505M690M672O743K417L802N656
16257D17526M228O230P462O936N802R168N949L843P079R070J3409J4985Q843P916
16243E28446J1819J8458J7421K1371K4319K9174L9987M8628N3486O3879P1739
16232I28727P1481P9038R8820J13951J12016R4751Q5700Q3803R7089J21987J33905
$$ y = [228400, 251553, 272908, 288612, 303634, 305518, 309188, 308317, 301829, 289862, 280920, 260728, 244472, 226170, 204331, 190973, 177448, 166710, 158348, 152890, 148417, 146129, 144296, 146014, 149931, 155724, 164478, 171344, 172691, 176234, 184343, 195339, 206557, 211194, 219108, 226390, 232807, 239242, 243469, 246275, 252028, 256559, 259702, 263038, 268115, 275146, 282573, 288674, 291880, 296979, 305220, 309402, 314824, 321788, 329436, 334918, 343179, 353034, 363807, 373769, 379686, 385041, 389546, 394236, 398908, 405651, 408068, 411870, 417526, 421754, 427984, 435446, 442382, 448184, 457352, 463301, 467144, 474223, 483293, 496702, 511687, 520530, 528446, 540265, 558723, 576144, 597515, 621834, 651008, 690995, 739623, 793109, 856988, 928727, 1000208, 1079246, 1178066, 1292017, 1404033, 1498784, 1584484, 1668287, 1765376, 1887363, 2021268]
16221B021268J35310J42479J55902J85330K49731L29483M15657N22866O55475
16212D813501Q33223J104834J514110K133777L071186M285882N351460O021367
16204B9129340N930067N638587O382448Q037818R254466R197891N595339J806203
16196H0972159m05712j95031J104629J053994k394484n872544q493008q459599
16188E7310404o972572n745751n442617n566423n503315m788405l732480k680098
16180A6878743j876136j332685r70666p19830n63858m77395m42047m33349m10272
16171I652505l78811l56667l40341l47614l66177l77486l79898l79476l77135
16162F348900l63275l37782l20132l15997l12899l03109k82818k58972k27186
$$ y = [2021268, 2156578, 2299057, 2454959, 2640289, 2890020, 3219503, 3635160, 4158026, 4813501, 5646724, 6751558, 8265668, 10399445, 13470631, 17756513, 23107973, 29129340, 35059407, 40697994, 47080442, 55118260, 64372726, 73570617, 79165956, 80972159, 80566447, 80371416, 81476045, 82530039, 80135555, 74263011, 65770003, 57310404, 50337832, 44592081, 39149464, 33583041, 28079726, 23291321, 19558841, 16878743, 15002607, 13669922, 12699256, 11979426, 11415568, 10938173, 10496126, 10062777, 9652505, 9273694, 8917027, 8576686, 8229072, 7862895, 7485409, 7105511, 6726035, 6348900, 5985625, 5647843, 5327711, 5011714, 4698815, 4395706, 4112888, 3853916, 3626730]
16153C626730k06575j96385j78488j67216j59170j53267j42502j26293j12613
16144B184221j15325j17973j18875j10684j00364r1293r2352q8088p7706o6445
16134A205116o3977o2294n5106m8373m6035m3199m3661l7945l5547l3302l3961
16123G01716l1862l4065l2535k9495k8754k6849k4531k4900k4895k0768j8699
16112D04363k1830k3852j8630j7840j8432j8092j9678j6704r214j4432j3381j0139
16100B02139r983r988r489r704r539n584n933m553o460o042l909k359n294n959
16086A07343J899j394o093n866q027n611n23L00n393m740K616NJ595N718N592
16071H7421K691M68J402k034k991j584j776j373N73m255P63p5j602n27n262p802
$$ y = [3626730, 3420155, 3223770, 3045282, 2878066, 2718896, 2565629, 2423127, 2296834, 2184221, 2068896, 1950923, 1832048, 1721364, 1621000, 1529707, 1437355, 1349267, 1271561, 1205116, 1141139, 1078845, 1023739, 975366, 929331, 886132, 842471, 804526, 768979, 735677, 701716, 669854, 635789, 603254, 573759, 545005, 518156, 493625, 468725, 443830, 423062, 404363, 382533, 358681, 340051, 322211, 303779, 285687, 266009, 249305, 240091, 225659, 212278, 202139, 192156, 182168, 172679, 162975, 153436, 147852, 141919, 137366, 130906, 124864, 120955, 118596, 113302, 107343, 109242, 107848, 101755, 95889, 87862, 82251, 81728, 82028, 76635, 71895, 74511, 74516, 76111, 81829, 87421, 90112, 90580, 91982, 89948, 86957, 85373, 83597, 82224, 82797, 78542, 79305, 79230, 77628, 77101, 71839, 64037]
16055F4037L336J904j635j363J737K122k010L106K943L272K612J613J562K30J465
16040H4931L872J271M172K659Q99M6R88L144N419M342J016J194L146J240j355
16025A16984M40J496R147M438k529r41j115l395N026J566n417l793N52J012j169
16010A22302M99l84m602o197m077k694m580j263K111l892m527p876k694r17l096
15995G8113m690p83l146p740q979l28M068J08j151P41K564o11l712o41o051l872
15979D3890O1l842k487J039P77l879l302K538p433k476k77L641j475q65k396l999
15963A9515k963m332l51m036k958J698J880K088J22j277J204m214j086K431K017
15948I738L762O216J764k146J208J388K20J490L88J2m528n4K391Q50o262l040
$$ y = [64037, 67373, 69277, 67642, 66279, 68016, 70138, 68128, 71234, 74177, 77449, 80061, 81674, 83236, 83466, 84931, 88803, 90074, 94246, 96905, 97804, 97850, 98838, 101982, 107401, 111743, 112759, 113953, 117099, 118339, 116984, 117424, 118920, 128067, 132505, 129976, 129035, 127920, 124525, 129551, 131117, 125700, 121907, 122459, 123471, 122302, 122801, 122417, 117815, 111618, 107541, 104847, 100267, 99004, 101115, 97223, 92696, 84820, 82126, 81209, 78113, 73423, 72640, 69494, 61754, 52775, 52447, 56515, 56623, 55472, 56213, 58777, 58166, 54454, 53813, 47762, 43890, 43951, 40109, 37622, 38661, 39438, 35559, 32257, 34795, 27362, 24886, 24609, 28250, 26775, 25910, 23514, 19515, 16552, 12220, 11869, 7833, 4875, 6573, 8453, 10541, 10663, 9386, 10590, 6376, 5290, 7721, 9738, 13500, 19716, 21480, 19334, 20542, 21930, 22150, 23640, 24028, 24040, 19512, 19458, 21849, 22699, 16437, 13397]
15932A3397K22P84j911m523j347J673k200k880K50L626K650J605j102L63J746
15917A2353n6K877R1l327K625r57m437l11J515l47r07L279L86j695Q44R092J801
15900B2826j083K021L301j910n166j085L688N699L029l865l647K994J445M251
15886C2498n55m028n159K772M047l768o76N49O6m425l91N59j137N13J078j096
15870B0847L016J592O77m614k687J993j028l648j003j776j454L10K431j239j958
15855A1459L969O81j417n83n035j818O79K627O57J320j729p692j357L684L29m244
15839A530K011N19j867N470J647m83L112K87l429o2J08l616o27J301l022l251
15823c72j504N07J042R00L292R00P75j288J481J178k130n398j504K746k49m709
$$ y = [13397, 13619, 14403, 12492, 7969, 6622, 8295, 6095, 3215, 3465, 7091, 9741, 11346, 10244, 10607, 12353, 12297, 15174, 15265, 11938, 14563, 13606, 9169, 8858, 10373, 10026, 9119, 12398, 12784, 11089, 11933, 21025, 22826, 21743, 23764, 27065, 25155, 19989, 18904, 22592, 28291, 31320, 27455, 23808, 26802, 28247, 32498, 31943, 27915, 22756, 25528, 29575, 25807, 25131, 25680, 25746, 21321, 20930, 21489, 20352, 20865, 21943, 20847, 23863, 25455, 26132, 21518, 18831, 20824, 19796, 16148, 15145, 13369, 11915, 12225, 14656, 13417, 11459, 15428, 16109, 14692, 14109, 9074, 7256, 7935, 10562, 11219, 12539, 10810, 3118, 1761, 5445, 5774, 1530, 3541, 4060, 2193, 7663, 9310, 8827, 11939, 12226, 8797, 8735, 8843, 5227, 4600, 5901, 2879, -372, -1876, -1369, -327, 573, 3865, 4765, 5540, 4252, 5733, 6911, 4781, -617, -2121, 625, 376, -4333]
15807d333j110p63K650K913P48l860j501o24l101L374N266k0J412r69R88j957
15791h87p37L16p53j068K511R59K93m63J452L803O61l374K120l129j773M56J643
15774B030O79k720j554n03J76L294r17Q77L970J143K615K605l695k696j409J489
15758E384K097j438l227L51K618L363M655N5k031l481k548k745l273J905K33J219
15742C137K886J065l125L908j347l785j353N43K4o27l288n147m483R50N157J354
15726d131n284n675J557j86K032K873q40J511J00o43P89P8j126L985L832L464
15710B336j425k267j03M504m012j147K505k360m917J61N975J109j808n371l579
15695a0399K951M401p25o491K92Q82K138K022PJ123K126J192n041Q88l4n102J327
$$ y = [-4333, -5443, -6206, -3556, -643, 105, -3755, -5256, -5880, -8981, -5607, -341, -361, 1051, 82, 1070, -887, -1624, -1308, -2061, -3129, -618, 341, 634, 171, 1623, 5426, 6087, 2713, 4833, 1704, -69, 387, 2030, 2709, -11, -1565, -2068, -1892, 1402, 485, 1362, 5332, 6475, 9090, 11695, 8000, 5304, 3895, 5384, 7481, 6043, 2816, 3167, 5785, 9148, 13803, 13858, 11827, 8346, 5798, 3053, -220, 1685, 1918, 3137, 6023, 7088, 3963, 7871, 6524, 2739, 1386, 1929, 1953, 1326, -1962, -7109, -11592, -10642, -5485, -4131, -9415, -15090, -13533, -13719, -11687, -8814, -9654, -8143, -8043, -8686, -7897, -7819, -8945, -4960, -1128, 2336, 911, -1356, -1459, 3045, -967, -2114, 391, -1969, -6886, -6725, -750, 359, -1449, -6820, -10399, -7448, -3047, -3772, -10263, -9971, -9089, -6951, -4929, -4922, -3799, -1673, -481, -5522, -4634, -4668, -9770, -8443]
15678h443J945k513K66Q74J927M698j712m042o46Mj664K287Q16l836j701K040
15662i700J937M481K335j046O04L779K565J421q11j662j842k021K843L206k900
15647C189j508K040j240K380L721l929j682L72J450L583N211J115L792P749Q414
15632C4657J1501J6484K1993L1259L2859L4053L0196L8191M6769M8403M8267L4330
15620D28962J3470j875N8Q515N373j3224l2755m8959m4897l9398l1247l0411l1429
15607A82183l0223k5641k0578j9858j2182p850o686n633k483q3J993L106j797
15594E4268k904k859l566l275k731o34o59k706k294n550l164L13m692m776k086
15579A2685j355j545p86P63m95J361p24K114P48l443o521O5J701K274o027k924
$$ y = [-8443, -6498, -9011, -8745, -7871, -5944, -1246, -2958, -7000, -7646, -7642, -9306, -7019, -6203, -10039, -11740, -9700, -7763, -3282, -947, -1993, -1389, 2390, 4955, 6376, 5565, 3903, 2061, 40, 2883, 6089, 3189, 1681, 3721, 2481, 4861, 8582, 4653, 2971, 3343, 4793, 8376, 13587, 14702, 18494, 26243, 34657, 46158, 62642, 84635, 115894, 148753, 182806, 213002, 251193, 297962, 346365, 394632, 428962, 442432, 440557, 440615, 449130, 454503, 441279, 408524, 359565, 314668, 275270, 244023, 213612, 182183, 151960, 126319, 105741, 85883, 73701, 65851, 59165, 53532, 51049, 50966, 52959, 56065, 54268, 51364, 48505, 44939, 41664, 38933, 38299, 37640, 34934, 32640, 27090, 23926, 24239, 19547, 14771, 12685, 11330, 9785, 8999, 9762, 9267, 10628, 9904, 12018, 12766, 9323, 2802, 2867, 4568, 6842, 815, -2109]
15563b109N5J346J508p26k84N15R42J376o07k032K284J961l42j756j459n85n42
15546d55K210J362l360J363K834L591R95l220l537m929P70K866L180m997p781
15531i108p43M505M669lk201n22K25m780M253M185M62n28p38R82R90L61l547l150
15513d688j24l90j130k25N45r14J48R45j292J307M670k22l149K810n742j505K503
15496f453M536k355o299K69J807L351K540p24n13j031J287K670j209Q27j443k197
15480d937k918M43K181M456K325M292J026n920K561K333k288l013M77l206j999
15465d187L8J005k619J301P48k651L119M479M26p97n369j222L065r11k259R82
15449d852J55k202j593L350o47l829j424R46j742O6K429L246O4j473K216j102
$$ y = [-2109, -2054, -708, 800, 74, -210, 305, 1247, 2623, 2016, -16, 2268, 4229, 3887, 2131, 672, 87, -455, 1755, 3117, -243, 1120, 3954, 7545, 8540, 5320, 1783, -3146, -2376, 490, 3670, -1327, -9108, -9851, -5346, -677, -680, -2881, -3403, -3178, -7958, -3705, 480, 942, 414, -324, 658, 1648, 2009, -1538, -4688, -4812, -5202, -6332, -6557, -6012, -6926, -6778, -5833, -7125, -5818, -1148, -1370, -4519, -1709, -7451, -8956, -6453, -1917, -4272, -10571, -10302, -8495, -5144, -2604, -3328, -3841, -4872, -3585, -915, -2124, -1297, -2740, -4937, -7855, -7412, -5231, -775, 1550, 5842, 6868, 948, 3509, 5842, 3554, 541, 1018, -2188, -4187, -4149, -3144, -5763, -4462, -3714, -6365, -3246, 1233, 1659, 862, -4507, -5729, -2664, -3575, -5834, -4852, -4697, -6899, -8492, -5142, -5789, -9618, -11042, -10096, -11838, -11772, -9343, -6097, -6033, -7506, -5290, -6392]
15433f392J653K039L625l171n042M882M127P75j779l166l164j914K64K10j461
15418h514q00k033J407k24n065J481L47L536P079J885q084l729L851L722l045
15403h186j478p90K215K488K067L794N606o87l866j573M53j93j776j253k819P14
15387e284J860M528p16l172L66K825J838J59l02j227j722j180n44P25p90j304
15371c940k936j47L066l212J070J619R15q93L731L775K925r37K23j1l902j647
15355c01o12p66o14k823J582J825k830R39K660J562j167j44K873M58l177l291
15339c826k159K139j215N05k51q13K334P1J95l935k345J949M405L090K102l334
15323a088o407j735L386Q99k308o2J464K672J007j628j116R86k622QM098l487
$$ y = [-6392, -4739, -2700, 925, -2246, -7288, -2406, 1721, 2496, 717, -2449, -5613, -7527, -7263, -7053, -8514, -9314, -11347, -9940, -10164, -15229, -13748, -13401, -9865, -2786, -901, -8985, -12714, -8863, -5141, -8186, -9664, -10454, -8239, -5751, -3684, 110, 5716, 5029, 1163, -410, 43, -150, -1926, -3179, -5998, -5284, -3424, 1104, 388, -2784, -2418, 407, 2245, 2404, 2102, 875, -847, -2027, -2571, -1846, -2636, -3940, -6876, -7023, -3957, -7169, -6099, -4480, -3565, -4458, -727, 3048, 5973, 5036, 5259, 5248, 1346, -301, -913, -1679, -2293, -5116, -3534, -1709, -4539, -3600, -940, 622, -545, -689, 2184, 2642, -535, -3826, -5985, -3846, -5061, -4556, -4807, -5620, -3286, -3215, -3020, -6955, -9300, -7351, -2946, 144, 2246, -1088, -7495, -9230, -5844, -4945, -7253, -7315, -5851, -3179, -2172, -3800, -4916, -3930, -6552, -6544, -2446, -5933]
15307e933l481r84N0M3O94K74K625O109l30L69M07j708m529R0k658K417L889J675
15289i81L656j360k684k810j565M411J637o78j436l9M044j970K85J085l757l884
15273f046J078k89j308J88N22k272J045J526j431M14l31q22K257N585L750K275
15257F141j02p421m537P83L891J786jM32l871K87j684k84K881j415k287n412K699
15240h114O396K493l099m714j346K381L271k062j215q71Q35P07K492L86N19j05
15224b046n287l010J618P95l745n8J698N87n75j611K352P37J498M021k373n850
15208a1249q32K475J820J528l75J039L534K75m677K190N580M543R75r09k008l450
15192D59Q09p93k472l044k772k165j282J974M97J024P21j25l622r68M761K49M69
$$ y = [-5933, -9414, -10398, -10348, -10305, -9611, -9337, -6712, -603, -933, -564, -157, -1865, -6394, -6304, -8962, -6545, -2656, -981, 2675, 1315, -1369, -4179, -5744, -1333, 304, -374, -1810, -1849, 2195, 225, 510, 1595, -2162, -6046, -4968, -5257, -6565, -6377, -5855, -8127, -7082, -5556, -6987, -6573, -6904, -7726, -5469, 116, 3866, 6141, 6039, -1382, -5919, -5136, -1245, 541, 540, 972, -2899, -2612, -4296, -4580, -1699, -3114, -5401, -10813, -8114, -1718, 775, -2324, -7038, -8384, -6003, -2732, -4794, -6009, -6880, -6045, -5338, -2846, -2460, -1941, -2046, -7333, -10343, -8725, -7930, -11675, -11733, -10035, -9448, -10023, -11634, -9282, -8545, -7047, -3026, -5399, -11249, -12081, -9606, -7786, -6258, -6633, -5594, -2060, -1785, -6462, -4272, 1308, 5851, 6826, 5917, 3909, 459, 1268, 475, -1997, -5041, -7813, -9978, -11260, -9286, -8789, -7765, -7044, -7169, -10791, -11759, -6998, -6749, -6280]
15175f280J612m274k61j213J934N668O051J674o663l110K206L085q4j178j944
15160b777K934M3q32j982J686L45n015j566J147L713J244l488j542K138M29J817
15144a706J448j964j097l284j031J616M770m67j866J475o14J040O02k298j146
15129d522Q42N658Q67j967k997k571l604j569J714j603k590J238M54J074L256
15114f320J070n09J111M84k971J403J749J396n786J902L637j457k226L209L346
15099C8J49K27K498l95j918j457j772k585K208K062M374J514J898o45m248n009
15083c061j331L431M724J824j083j26l265l245j002l093J516L157m095J101M384
15068a64J070N77L36Q39K111J805l951l843J929q51n963J561K92p92l3j437k332
$$ y = [-6280, -4668, -8942, -9203, -10416, -8482, -2814, 3237, 4911, -1752, -4862, -2656, 429, 345, -833, -2777, 157, 200, -632, -2614, -928, -583, -5598, -7164, -6017, -2304, -1060, -4548, -6090, -3952, -3523, -1706, -258, -2222, -3319, -6603, -7634, -6018, -1248, -1715, -3581, -2106, -2720, -1680, -1078, -3376, -4522, -3680, 1978, 2845, 878, -2119, -4690, -8294, -9863, -8149, -9752, -12342, -11104, -10650, -9576, -6320, -5250, -5759, -4648, -4164, -7135, -5732, -3983, -2587, -8373, -6471, -2834, -4291, -6517, -3308, 38, 187, 414, 2912, 2517, 599, -858, -2630, -5215, -3007, -945, 3429, 4943, 6841, 6196, 1948, -3061, -4392, -961, 3763, 5587, 4504, 4378, 1113, -2132, -3134, -6227, -4711, -1554, -5649, -4548, -164, 906, 1483, 1819, 2658, 4769, 6574, 2623, -1220, 709, -142, -6105, -4544, -4252, -5044, -5077, -6514, -8846]
15051h846k129m73L793K965k425m886K884J62K113K609J206Q86l102L285J926
15036c2p29j901l647K549L632o37L298P1j505q55j816k794J551K282q75J658J99
15019D49K477P3K693L239k670k863m204O05J318p48k967k580K665K594k08K211
15003B084l783l66L695Q13o67K0J444L654K812k72j048K26k690j384M06K545m25
14986G064k779O69J271K265K673p50k94r48j933L957P039P585P704N706Q025J4719
14970F1973J8884J9335K5861L4871N2222P6396J21601K09446L71851M55525J51303
14959A599268j95835l68509l35856k25990j37319q2832n1452l2928k3131j9815
14949A25601r540q967o558o781n685p98n261p288k093L032r67J372J34j333j121
$$ y = [-8846, -10975, -11448, -7655, -4690, -7115, -12001, -9117, -8955, -6842, -4233, -3027, -2141, -5243, -1958, -32, -761, -2662, -6309, -3760, -128, -765, 2533, 2604, 1099, 244, -1572, -4366, -2815, -533, -1408, 250, 449, 2926, 2999, 5692, 8931, 6261, 3398, -806, -201, 1117, 369, -2598, -5178, -2513, 81, -127, 2084, -1699, -2065, 1630, 2443, 1776, 1796, 3240, 6894, 9706, 9434, 8386, 8612, 5922, 4538, 4944, 7489, 7064, 4285, 4954, 6225, 8490, 11163, 10413, 10119, 9171, 7238, 11195, 18234, 25819, 33523, 39229, 47254, 61973, 80857, 100192, 126053, 160924, 213146, 289542, 411143, 620589, 992440, 1447965, 1599268, 1403433, 1034924, 699068, 473078, 335759, 252927, 201475, 168547, 145416, 125601, 116061, 107094, 100536, 93755, 88070, 87272, 82011, 74723, 72630, 75662, 74695, 76067, 76201, 74868, 73747]
14934G3747n099r003p493m314r58p12k799o746p03K899j661l927o77l371n872
14919B3311k975k590o106j296Q17J250Q95k968l377R05n17l095l71q1j269j882
14903F51J53K432j80l355J142K357p42m35k013M253j068k933L199j950k773L319
14887B057N645j850l364k336m093k113l036L241K160K377n40j04l312O134K535
14872C401K100k058r59N45P42K249K154J370k859j834l526k024K969J989l38m733
14856h12N105L701l405m231M1n45r64q50m264r91O131k036l808n25L05K560J817
14839b771J063m55N74K490P99m67l070J384J185J15L307k173l942m227J43p82
14823f827K166j334J808J375R26K933K503m218l303K466K901k881J229Mo446k146
$$ y = [73747, 68648, 59645, 52152, 47838, 46880, 46168, 43369, 36623, 35920, 38819, 37158, 33231, 32554, 29183, 23311, 20336, 17746, 11640, 10344, 11161, 12411, 13306, 10338, 6961, 7866, 7349, 4254, 3883, 3802, 2533, 651, 804, 3236, 3056, -299, 843, 3200, 2458, 2023, 10, 4263, 3195, 262, 3461, 1511, -1262, 2057, 7702, 5852, 2488, 152, -3941, -6054, -9090, -5849, -3689, -1312, -1852, -1956, -5268, 866, 3401, 5501, 3443, 2484, 3029, 3771, 6020, 8174, 9544, 6685, 4851, 1325, -699, 2270, 4259, 3921, -812, 4293, 7994, 4589, 358, 399, -146, -1110, -1960, -6224, -7215, -1084, -3120, -6928, -7453, -7148, -4588, -2771, -1708, -2163, -1589, 901, 1700, 1233, -1837, -453, 732, 847, 4154, 1981, -1961, -6188, -6045, -6827, -4661, -5995, -4187, -2812, -1886, 1047, 3550, -668, -3971, -1505, 1396, -1485, -256, -252, -6698, -8844]
14807h844N466N204J538k030J79L706j769L8J723k426l426J884k0k575j970K155
14791a167M864O88l973K872l414n35L391J982j60J595L298L006N872N578L618
14776B7515J872k471k372m061l892l720m615J495Q00m441j840l487J857J181p14
14761C107j165o847k500L956J567K089P062K643k281m552O46j538k967N955N107
14746A0282J648J29L978R29r64J579J052J14L56k837L26M45j747m238l572k050
14730E430o083k535J712N613j439m567O78M876J191j983m746j55L150K214k733
14715F23k392K38K727J959j153J494M187q89R07J834M489l848o413j625K399N03
14699E040M165P64J25j369J037l93j755k997j776r06L154M13k056j566k815j535
$$ y = [-8844, -3378, 1826, 3364, 1334, 1513, 5219, 3450, 3488, 5211, 2785, -641, 1243, 1223, -1352, -3322, -1167, 3697, 4385, 412, 3284, -130, -665, 2726, 4708, 4548, 6143, 9441, 12447, 18319, 23897, 27515, 29387, 26916, 24544, 20483, 16591, 12871, 8256, 9751, 10551, 6110, 4270, 783, 2640, 3821, 3107, 1942, -4905, -7405, -3449, -1882, 207, 7269, 9912, 7631, 3079, 3725, 2187, -780, 5175, 10282, 11930, 12059, 16037, 16966, 16002, 17581, 18633, 18747, 19103, 16266, 16592, 17037, 15290, 11052, 7480, 5430, -653, -3188, -1476, 4137, 2698, -1869, -1191, 3685, 4876, 2893, -1853, -2008, 1142, 3356, 623, -1769, -1531, 1196, 3155, 2002, 3496, 7683, 6794, 7701, 9535, 14024, 10176, 3763, 2138, 4537, 5040, 9205, 9969, 10094, 8725, 9762, 9369, 7614, 4617, 2841, 1935, 5089, 5502, 3446, 1880, -935, -2470]
14683b470N322q39l309J199L279O558R784N88r71L344R34j889K290K310j066j601
14667B3463l052j406n062l206n493K540K501k760J657J219M56m826N83n86n86
14652E442M549J759n552J40J112l940j339L079L452L550J40J204p84K477k376
14637A2913l545k649k370j024J572K065j955P14p59o57j981k753k063M217J654
14622C379K265j771o007K638J319l535q56J02L575K291j123J500J273k490m090
14607a530J068l024M39N914L709j637m892n59n458p72P07k637J485J91J757M88
14591d751j434j877k171K847L335k398J160M855M356L162l031j635J791k761j844
14576c96K81J95m489J184L335J014J816j115m631n505N506K582j407K708n42m740
$$ y = [-2470, 2852, 2013, -1296, -97, 3182, 9740, 19524, 20112, 19141, 22485, 23419, 21530, 23820, 26130, 25064, 23463, 20411, 19005, 13943, 10737, 5244, 7784, 10285, 7525, 9182, 10401, 10857, 6031, 6614, 6028, 5442, 9991, 11750, 6198, 6338, 7450, 3510, 2171, 5250, 8702, 12252, 12392, 13596, 12812, 15289, 12913, 9368, 6719, 4349, 3325, 4897, 6962, 5007, 5721, 4962, 4305, 2324, -429, -2492, 1725, 3379, 5644, 3873, -2134, 504, 1823, -1712, -2568, -2466, 1109, 3400, 2277, 3777, 5050, 2560, -1530, -462, -3486, -3047, 2867, 6576, 4939, 47, -512, -5970, -6742, -6035, -8672, -7187, -6996, -5239, -4751, -6185, -8062, -10233, -7386, -4051, -6449, -5289, -434, 3922, 7084, 4053, 2418, 4209, 1448, -396, -115, 80, -4409, -3225, 110, 1124, 2940, 1825, -2806, -8311, -2805, -223, -1630, 1078, 536, -4204]
14560d204n52l60K351J838k7M346L296j465k198j872K07O382J966k997R53m33
14544G231r86j835m14q83j329R05M896j03n134q57J876K277K222k870m756j394
14528a154K602J104J444J304l053l439j907M941J653K96j18L847K83K106l692
14513F217k673j487l87N611k501l392J511K680m633q78J744K956j239n17l590
14498e78O27K609M833l17m910Q3n77J500J44m024n54L665L177K865l852r70o35
14481C086k55J828m73l287L396j11k086J167j579n10K177J707J135l642k408L471
14465C616r32j628J03j948j722J556O2o42O97j668p37j659J635k946l500J36N655
14448c922M312l73l366l085J118J122K17Q72L664J824l361P52J458k302j258J868
$$ y = [-4204, -4756, -5116, -2765, -927, -954, 3392, 6688, 5223, 3025, 1153, 1360, 7742, 9708, 6711, 7664, 7231, 6245, 4410, 3996, 3113, 1784, 2689, 7585, 7482, 2348, 1491, 3367, 5644, 7866, 4996, 240, -1154, 1448, 2552, 3996, 5300, 2247, -1192, -3099, 1842, 3495, 3791, 3673, 7520, 7803, 9909, 6217, 3544, 2057, 1670, 7281, 4780, 1388, 2899, 5579, 946, 68, 1812, 4768, 3529, 3012, -578, 49, 2658, 7491, 7174, 2264, 2347, 1770, 3270, 3414, -610, -1164, 2501, 5678, 8543, 4691, 3721, 3086, 2831, 4659, 4186, 899, 4295, 4184, 2098, 3265, 1686, 1176, 3353, 5060, 6195, 2553, 145, 3616, 2684, 1056, 1159, -789, -2511, -955, -893, -1535, -838, -2506, -3243, -4902, -3267, -6213, -9713, -9577, -3922, 390, 17, -3349, -6434, -5316, -4194, -3977, -3105, 559, 2383, -978, -226, 1232, -1070, -2328, -460]
14432d60M388K310J700j618k081l486J014R16l169P185n6n272K66K136j90m086
14416e03N11q57K882N094l333n010n34j487l494M157J032M505K074k225r70J389
14400C231k037J309K222k382k487L98Q95L468J923k884O9j853m124J11J827j226
14384a540L245K847j275J060n63j747J381p94k677K409J435k64J607J776j201
14369E699k456j06K121j781o416j127K421J194J434l588r32J422L140p81J490
14354A734N56J240k00k030n32jk004K559M629J634j052J902k610j054j346L2O69
14337D126l227k047K922P885J086k425k680N1j442k716p10l4J630j11J805J275
14321E388K456J102r26j263j089l82K014J392j827K656p78m634o771o77O259M782
$$ y = [-460, 3928, 6238, 7938, 6320, 4239, 753, 1767, 2683, -486, 6699, 6643, 1371, 1637, 3773, 3583, -503, 8, -849, 2033, 7127, 3794, -1216, -1750, -3237, -6731, -2574, -1542, 2963, 5037, 2812, 1842, 3231, 1194, 2503, 4725, 2343, -144, 254, 1149, 4617, 6540, 3656, 3725, 1872, -2252, -2141, -314, -1540, 1705, 4552, 3277, 4337, 3774, 2027, 3408, 2614, -63, 2346, 3781, 3517, 5124, 6900, 5699, 3243, 3137, 5258, 3477, -2939, -4066, -1645, -451, 983, -2605, -3537, -2115, 1025, 244, 1734, 2290, 3530, 3330, 1300, 768, 767, -1237, 1322, 5951, 7585, 6533, 8435, 5825, 4771, 3425, 3457, 4126, 899, -1148, 1774, 9659, 10745, 8320, 5640, 5691, 4249, 1533, 823, 789, 2419, 2308, 4113, 5388, 7844, 8946, 8020, 6757, 5668, 5286, 7300, 8692, 6865, 9521, 8743, 4109, -2662, -3339, 2920, 7702]
14305G702j768q825O11N797j87J572j669j147M493J100M20R10r1m262m475j316
14289a135J347M235K493l455N82p00J902J704j121j002l98L087K07n349j675j985
14273a263q35J861K350M138K280l274k502J106M603j0k109l626J750L770p66L223
14257A0696L036o18m159j759L592k028j627R05Q15J614J663J234k714k823J55
14242G982j397L411p02q06J760k26o55J035K528L01o44j281k755l196O10J491
14226G456r30n05j59n27L28J397J674k024o098J227L182l507k421j46L525M359
14210F831l096l169K260m006l46L455j9K011k004M60N087M41K09K455K90n772
14194E087l600j421J302N740j010k390K150J397P28j139j310M298J217l369j464
$$ y = [7702, 5934, -2891, -2280, 3517, 3330, 4902, 3233, 2086, 6579, 7679, 8099, 9009, 8918, 4656, 181, -1135, 212, 4447, 6940, 3485, 4067, 3367, 5269, 6973, 5852, 4850, 4452, 7539, 7746, 2397, 722, -1263, -2098, -237, 2113, 6251, 8531, 5257, 2755, 3861, 8464, 8454, 6345, 2719, 4469, 8239, 7473, 10696, 13732, 13114, 8955, 7196, 10788, 8760, 7133, 8038, 8853, 10467, 12130, 13364, 10650, 7827, 7982, 6585, 9996, 9294, 8488, 10248, 10022, 9367, 10402, 12930, 13231, 12587, 11306, 8551, 5355, 5965, 7456, 6526, 6021, 5862, 5335, 5663, 7060, 8734, 6710, 612, 1839, 5021, 1514, -907, -1053, 2472, 6831, 3735, 566, 2826, -1180, -1526, 1929, 1910, 3921, 1917, 2377, 7464, 7905, 8114, 10569, 10859, 5087, 1487, 66, 1368, 7108, 6098, 3708, 5858, 7255, 7983, 6844, 5534, 9832, 11049, 7680, 6216]
14179F216J729P04k626J120K329J094j93K33j160j602k881K495K478K285o98n147
14163F376l97o44M15k237k631K374N654M906j031l396l943j388L02K443M503n60
14147A0746j209l42k620L556L119k664o144J36K323J096K288J844N125K191k053
14132A7392j109k230J967K744L375r17j953K353J746L820k181k326l202l38l160
14117A5981j467J134o30M740J591N23q3l961j560K404j729j377m09M252J385j92
14101B0602K753j797j083o540k088M06J765p99k268j341K278L887O90j377J620
14086A6708l240n089J944j989O43Q20J142L188L609K769k097r3J773j467j769
14071A6852N338J160J249q42n71J192M888N97j341N404N653K318J667p55K149
$$ y = [6216, 7945, 8649, 6023, 7143, 9472, 10566, 10373, 10606, 9446, 7844, 4963, 7458, 9936, 12221, 11523, 6376, 5979, 5335, 5750, 3513, 882, 3256, 8910, 13816, 12785, 9389, 5446, 4058, 4360, 6803, 11306, 10746, 9537, 9195, 6575, 10131, 13250, 10586, 4442, 4578, 6901, 7997, 10285, 12129, 17254, 19445, 17392, 16283, 14053, 16020, 18764, 22139, 21222, 19269, 21622, 23368, 27188, 25007, 22681, 19479, 19141, 15981, 14514, 15648, 15018, 19758, 21349, 21872, 21789, 17828, 16268, 18672, 16943, 15566, 15157, 19409, 20794, 20602, 23355, 21558, 20475, 13935, 11847, 12253, 14018, 13219, 10951, 9610, 11888, 15775, 16465, 15088, 16708, 13468, 8379, 10323, 8334, 8977, 9797, 10939, 14127, 17736, 20505, 18408, 18315, 20088, 18621, 16852, 22190, 23350, 24599, 23757, 23186, 24378, 29266, 29863, 28522, 33926, 39579, 41897, 43564, 42809, 44958]
14056D4958K583j569O348O665P837N067L072J0876L537P298J0603J3075J2265
14043A32615J5440J5780J5686J4167J6894K4532K3723K2758K2944K0332J3934
14032C38805J5618J2666k882n959n501j5079j8519j6478j3424j8069k5134k1997
14020B24047j9334j1702j0562j1293j1710l335l432o282m742l459o221L02k084
14007A30193j458k211j596n58l844l249k735J709N883R745J1024R644J4051J8265
13993A84863J8178K4527L8666N6781Q0996J23330J90034K81560L44328L00264
13983A643527J40141q0204k58401l23835k95937k14978j43056r1714n7506l4150
13973B83887k7086j8511j4759j4845n732k087n994k828m043p997p517l878k451
$$ y = [44958, 47541, 45972, 52320, 58985, 66822, 71889, 74961, 85837, 89374, 96672, 107275, 120350, 132615, 148055, 163835, 179521, 193688, 210582, 235114, 258837, 281595, 304539, 324871, 338805, 354423, 367089, 364207, 358248, 352747, 337668, 319149, 302671, 289247, 271178, 246044, 224047, 204713, 193011, 182449, 171156, 159446, 156111, 152679, 146397, 141655, 138196, 131975, 132277, 130193, 128735, 126524, 124928, 124370, 120526, 117277, 114542, 116251, 122134, 131879, 142903, 152547, 166598, 184863, 203041, 227568, 266234, 323015, 404011, 527341, 717375, 998935, 1343263, 1643527, 1783668, 1703464, 1445063, 1121228, 825291, 610313, 467257, 375543, 318037, 283887, 256801, 238290, 223531, 208686, 202954, 200867, 194873, 192045, 188002, 180005, 172488, 168610, 166159]
13960A66159n534r012j0171o752j0414j0701q328q691m044p391q945j733q001
13947F6442o512J778Q64J099m839m016o898m691j989l632n146k208J568L006J515
13932C6341J173L450L1k978j781J411p21k990j102k190m102q89l381m255K715
13917B0732P07J785M221J246m495Jq06M315N679p96K826K069J287n301k160m663
13901B6647J814l94J937k49n897j599K207j101l877M41L499M224J082n92L579
13886C1721K385j25q89J462J648k072n466k136k510l016J368K723l226J3j172
13871B0708L186N727o99N471J409m211k587l879p97J831l065m497k420L674J132
13856B0983J327rj734M234P176M437j800l03L920J168K214n039l721L123L12j537
$$ y = [166159, 160625, 151613, 141442, 134690, 124276, 113575, 105247, 96556, 92512, 85121, 76176, 74443, 66442, 59930, 61708, 62572, 63671, 58832, 54816, 47918, 43227, 41238, 37606, 32460, 30252, 31820, 34826, 36341, 37514, 40964, 40995, 38017, 36236, 37647, 36926, 33936, 32834, 30644, 26542, 25653, 22272, 18017, 20732, 21439, 23224, 27445, 28691, 24196, 24197, 23391, 27706, 33385, 32589, 35415, 37484, 38771, 33470, 31310, 26647, 28461, 28067, 30004, 29755, 23858, 22259, 24466, 23365, 19488, 19929, 23428, 27652, 28734, 28142, 31721, 34106, 33981, 33092, 34554, 36202, 34130, 28664, 26528, 24018, 21002, 22370, 25093, 21867, 21880, 20708, 23894, 29621, 28922, 34393, 35802, 31591, 29004, 25125, 24328, 26159, 23094, 18597, 16177, 19851, 20983, 22310, 22301, 20567, 24801, 31977, 36414, 34614, 34311, 38231, 39399, 41613, 36574, 32853, 35976, 36288, 34751]
13840C4751J687q251n237K152L93Q59O63M030P40M548j113O70K248q52J611O57
13824C9556o93K501L581K946N691O014M741L04N38J622P122L645k643j1593j2112
13809E1220j5406r753j0469m934K770N302K585J583M80O371N315L196P58J617
13795D0635O317K148L893J307P43O45P65n069m695K354J649j004p29q51J342K358
13779E1808Q88K000l463J761O23j844l623j775J481J357j4K954k254J452M926
13764E6277O283N356R955J4837J7670J5329J1396J2866P259Q931R865Q443J0730
13751A95197J3331R930m779r697q139m734m396j5562k0968k2872j9253j1550r880
13738H6628p389r7N78L983l26k808O96J46Q87L860O95K50l601k238J061N09J502
$$ y = [34751, 36438, 28187, 22950, 25102, 25495, 26354, 27017, 31047, 31787, 36335, 35222, 35892, 38140, 37288, 38899, 39556, 38863, 41364, 44945, 47891, 53582, 59596, 64337, 64641, 65179, 66801, 73923, 77568, 74925, 63332, 51220, 35814, 26061, 15592, 10658, 13428, 18730, 21315, 22898, 23378, 29749, 35064, 38260, 39018, 40635, 46952, 49100, 52993, 54300, 55043, 55688, 56453, 51384, 46689, 49043, 50692, 49688, 48959, 48108, 49450, 51808, 52696, 54696, 51233, 52994, 53617, 51773, 48150, 46375, 47856, 49213, 49199, 52153, 49899, 51351, 56277, 62560, 67916, 77871, 92708, 110378, 125707, 137103, 149969, 157228, 166159, 176024, 184467, 195197, 208528, 218458, 213679, 203982, 195843, 191109, 186713, 171151, 150183, 127311, 108058, 96508, 86628, 79239, 79142, 79720, 83703, 83377, 80569, 81265, 81411, 82298, 86158, 86853, 87103, 83502, 81264, 82325, 82834, 84336]
13721H4336N51p5k750r98j82L077L723j992j558m43K690R3q83J506L092J745K141
13704I4073K603J469O496P524L831n4O404J924L18l088p812j1463j4537j7964
13690F9724j2621j0347o452l726l34R221O099K867N653Q622Q985L747n71r122
13676G1745r433o592j0187j2506q957n855L294R943Q404O012J4650J1174P565
13663G9257L767R926O882N476N202J862M361P70n296q966n202J683O013N226K359
13648A13320p418p768p699k115J237O567O124N017J0211O857r8j471N376P707
13634A35847J4790K0696L0603L8506L9897M5935N6928O3156Q3501J04319J06771
13623G40949R6996O3711K3900k4654o3556j02941j19712j01029p2616n3601m0849
$$ y = [84336, 84887, 84812, 82062, 81064, 80882, 83959, 87682, 85690, 84132, 83689, 86379, 86472, 85589, 87095, 90187, 91932, 94073, 96676, 98145, 104641, 112165, 115996, 115942, 122346, 124270, 124588, 121500, 113688, 102225, 87688, 69724, 57103, 46756, 40304, 36578, 36244, 45465, 51564, 54431, 60084, 68706, 77691, 81438, 80867, 71745, 62312, 55720, 45533, 33027, 24070, 18215, 21509, 31452, 39856, 45868, 60518, 71692, 79257, 83024, 92950, 99832, 105308, 110510, 112372, 116733, 117503, 112207, 103241, 98039, 99722, 105735, 110961, 113320, 105902, 98134, 90435, 88320, 89557, 96124, 102248, 107265, 117476, 124333, 124235, 122764, 128140, 135847, 150637, 171333, 201936, 240442, 280339, 326274, 383202, 446358, 529859, 634178, 740949, 837945, 901656, 925556, 900902, 837346, 734405, 614693, 513664, 441048, 387447, 346598]
13612C46598l2579k0962j2404n584J474O612J3075J4831R166J4546J4105O299
13600C55177P958J3043J4433J9336K8131K2665K0546K0729J8318J2699Q737R050
13588E50822R667Q442N147M129N655Q098P184M797K446N719R635R228J5302K3308
13574F69579K4784K4273K0272J2919K323O86J0006J8641L0868L5163L1500K7495
13562I08509J6652Q278R82j0867j3550j0060p418M961J8336K8293L1127K9082
13550A004325K5277K2262K4912K9496K9477J9896J4096J0900J4637K0931M1765
13539A257974N6332O3888O0426N6112M1853L6128N2499P4487R4628J15625J45031
13528B054983J86225K11284K29562K26044K12647K04729K23157K63084L11292
$$ y = [346598, 314019, 293057, 280653, 275069, 276543, 283155, 296230, 311061, 320227, 334773, 348878, 355177, 363135, 376178, 390611, 409947, 438078, 460743, 481289, 502018, 520336, 533035, 541772, 550822, 560489, 568931, 574078, 578207, 583862, 591960, 599144, 603941, 606387, 612106, 621741, 630969, 646271, 669579, 694363, 718636, 738908, 751827, 754150, 754836, 764842, 783483, 814351, 849514, 881014, 908509, 925161, 933439, 934421, 923554, 910004, 899944, 892526, 897487, 915823, 944116, 975243, 1004325, 1029602, 1051864, 1076776, 1106272, 1135749, 1155645, 1169741, 1180641, 1195278, 1216209, 1257974, 1314306, 1378194, 1438620, 1494732, 1536585, 1572713, 1625212, 1699699, 1794327, 1909952, 2054983, 2241208, 2452492, 2682054, 2908098, 3120745, 3325474, 3548631, 3811715, 4123007]
13519D123007L57807M03470M66286N48118O80545R19677J247016J617193J967697
13510A2330816K313452K708675L226965L942480M929805O354053Q507347J1872640
13502E6186233J7315081K6359134M0732476N6970399O0954018M4174855J2638846
13495C15331042k3300592m9125434n7020209m9844215l6097980k3672111j5116222
13488F1154279r845668o712744m849802l709547k908818k255738j785642j525585
13480B7560735j432099j386266j259178j030051p29619m32582k45151k83247n20257
13471B0242285q51492j140891j265546j230775j127207j012335r17678q36393
13463A1859968p72817p15052o59665o21419n92147n53786n09526m63533m10279
$$ y = [4123007, 4480814, 4884284, 5350570, 5898688, 6579233, 7498910, 8745926, 10363119, 12330816, 14644268, 17352943, 20579908, 24522388, 29452193, 35806246, 44313593, 56186233, 73501314, 99860448, 140592924, 197563323, 258517341, 302692196, 315331042, 292030450, 242905016, 185884807, 136040592, 99942612, 76270501, 61154279, 51308611, 44595867, 39746065, 36036518, 33127700, 30871962, 29086320, 27560735, 26128636, 24742370, 23483192, 22453141, 21723522, 21290940, 21045789, 20762542, 20242285, 19390793, 18249902, 16984356, 15753581, 14626374, 13614039, 12696361, 11859968, 11087151, 10372099, 9712434, 9091015, 8498868, 7945082, 7435556, 6972023, 6561744]
13454F561744l71604l51084l28724l19741l11546k94343k70024k53608k30164
13445C830906k07145j86969j76247j66094j52569j39100j34102j29789j28499
13436B410392j32697j31876j30619j25326j16301j03236q8853p6037n9800n1687
13426A393960n1236n5308n9299o2127o5713n9044n1034m1232l7649l2682l5330
13415H43306l2434l8617m1169l7396l8806l5213l3036k8655k7411l6167l4013
13404D60389l1111k3361j8447j5473j8646j7767j0899m813o061j1539r505j1450
13392B81317j4534j2766j0883q565n278n4r35k264n965o536r249j1834j8241k3902
13378A50311k0168p890N023J4852K0360K4567K9161L3244K0094J0166n758k9171
$$ y = [6561744, 6190140, 5839056, 5510332, 5190591, 4879045, 4584702, 4314678, 4061070, 3830906, 3623761, 3436792, 3260545, 3094451, 2941882, 2802782, 2668680, 2538891, 2410392, 2277695, 2145819, 2015200, 1889874, 1773573, 1670337, 1581484, 1505447, 1445647, 1393960, 1342724, 1287416, 1228117, 1165990, 1100277, 1041233, 990199, 948967, 911318, 878636, 843306, 810872, 772255, 731086, 693690, 654884, 619671, 586635, 557980, 530569, 494402, 460389, 429278, 405917, 387470, 371997, 353351, 335584, 324685, 319872, 313811, 302272, 292767, 281317, 266783, 254017, 243134, 234569, 229291, 229237, 228302, 226038, 220073, 213537, 204288, 192454, 174213, 150311, 130143, 122253, 127276, 142128, 162488, 187055, 216216, 249460, 269554, 279720, 273962, 244791]
13366B44791l1038l2688l0721j0248J236p10M95O24n01l549j823l331L13m151
13352A28699l32Q149Q938J1958P695M197k459k986O322N355J4846J8287J3725
13339B22394Q463J807o777l010k85M968N447J0001J3286J1508J0207K036K072
13326B82117N254N972J2247J0358J013j514k54j610p162j1796j5212j0264o882
13313B62267j595P451J3385J8737J9364K3933L7323M1695K9772O69k5768m6600
13301C80633n8357m9679m1415l3982j9493j2861r113k980p22k98k605l073m03
13288A45652j841K192m944p486j825q85j889J76o444n379l751n634l871n057m816
13273I4198j2584m920j091q813o829l141k619m12p935p242m074K035J984L394
$$ y = [244791, 213753, 181065, 150344, 140096, 141332, 140622, 141117, 141741, 141240, 137691, 135868, 132537, 132850, 128699, 128367, 136516, 145454, 157412, 165107, 169304, 166845, 163859, 170181, 175536, 190382, 208669, 222394, 230857, 232664, 225887, 222877, 222592, 227560, 233007, 243008, 256294, 267802, 278009, 280045, 282117, 287371, 293343, 305590, 315948, 316961, 315447, 315193, 313583, 306421, 294625, 279413, 269149, 262267, 260672, 268123, 281508, 300245, 319609, 343542, 380865, 422560, 452332, 453001, 427233, 380633, 322276, 272597, 231182, 197200, 177707, 164846, 155733, 152753, 152031, 151733, 149128, 146055, 145652, 143811, 146003, 141059, 133573, 131748, 130863, 128974, 129150, 122706, 117327, 113576, 107942, 104071, 99014, 94198, 81614, 76694, 75603, 66790, 59961, 56820, 54201, 53789, 45854, 38612, 34538, 36573, 38557, 41951]
13259D1951P88l72j39J669k91o51m839n900l380j414j913N356J0790J2121Q531
13244F2307N458M705M505O030M192K183r706j6426j5807q960j0767q709o25L627
13230B2007M202K492P94K18m174k698R03K721j113k960n24J552P70q14r81j417
13214B0978J607r77K879Q622L018j653J465J713K551J890K112L229K318Q42R90
13199E1584P82L348K130J762k738J502R87n37K030Q37L71Q456Q887J2593J0860
13184A02854j11q640j6291j4518j1765o860P66J503M752J282k20n129n064K702
13170D5261L483K850o225m194L453K509l940q69K225J462Q02N96k06N70k495m072
13154D1210m758J052K689n290r1J452j804j620q43J281l81j8K912j420l832j171
$$ y = [41951, 42739, 42367, 42228, 43897, 43606, 42955, 38116, 32216, 28836, 27422, 25509, 30865, 41655, 53776, 62307, 67765, 72470, 76975, 83005, 87197, 89380, 79674, 63248, 47441, 38481, 27714, 19005, 18380, 22007, 26209, 28701, 29495, 29713, 25539, 22841, 23744, 26465, 25352, 22392, 21868, 23420, 24190, 23376, 22395, 20978, 22585, 21608, 24487, 33109, 36127, 34474, 35939, 37652, 40203, 42093, 44205, 47434, 49752, 50594, 51584, 52366, 55714, 57844, 59606, 56868, 58370, 59357, 58820, 60850, 61687, 62058, 70514, 79401, 91994, 102854, 102743, 94103, 77812, 63294, 51529, 44669, 45435, 46938, 51690, 52972, 52752, 47623, 42559, 45261, 48744, 51594, 45369, 41175, 44628, 47137, 43197, 42328, 44553, 46015, 46817, 47413, 47207, 47777, 45282, 41210, 36452, 37504, 40193, 34903, 34812, 36264, 34460, 32840, 31997, 33278, 32897, 32879, 35791, 34371, 30539, 29368]
13138B9368N8o42l151k02k74k266P92J077M48O54J853j380K63k598l045l780J469
13121A8644J521K420N458k451n711j17K381J423K78j520l573m598n166q63J93
13106H319m73M732P706R174N157P090R955J1721O502m604r734j1544j4536o200
13092B3265k706j6K356k591k757l411o85k193K3L782j502o17L593M951L384j715
13076B3161p420j858J904J944K111J175m02k78N551J847l23N40j42J699q13K777
13060C1473N009Q311Q435R122O540O192Q041O880k647p407j1080j3216q888m152
13046D2613J695O84M78k159m140n271k822J303L298o604l594l558m223Q11K382
13031B0893o592r204r246k946q26L613L442Q062J0571O344N743M660R626Q358
$$ y = [29368, 29426, 28784, 25633, 25431, 25157, 22891, 23683, 24760, 25208, 25862, 27715, 26335, 26598, 24000, 20955, 17175, 18644, 20165, 22585, 28043, 25592, 19881, 19764, 22145, 23568, 23846, 22326, 18753, 14155, 8989, 8126, 8319, 7846, 12578, 20284, 29458, 34615, 41705, 51660, 63381, 69883, 65279, 55545, 44001, 29465, 23265, 20559, 20543, 22899, 20308, 17551, 14140, 13455, 11262, 11285, 15067, 13565, 12948, 16541, 21492, 24876, 23161, 15741, 13883, 15787, 17731, 19842, 21017, 20615, 20337, 25888, 27735, 27412, 27952, 27810, 29509, 28696, 31473, 36482, 44793, 53228, 62350, 68890, 75082, 83123, 90003, 87356, 79949, 68869, 55653, 46765, 42613, 44308, 44992, 45470, 43311, 39171, 33900, 31078, 32381, 35679, 29075, 25481, 21923, 17700, 18511, 20893, 14301, 5097, -4149, -7095, -7921, -4308, -866, 7196, 17767, 24111, 29854, 34514, 44140, 52498]
13017E2498J2588J0301J3675J8094K1490K4829K8085M7104P1854R3885J40178
13006E34581K23776L13213L40334K60938P2734j49055k92912l20813k71500j89604
12996E21692j25217p7201n2139l6949k3980k2287j6212j0723p895j0717j2798
12985A25574o013n853m037k094K88J747M3n736n530J321l066r283j0269n969m299
12970F6824o460o974n326j2277n888l801M66J046J485k045m392j428P488K351
12956C1069Q67j321l220p905k383O53j749m752j794J309L474M55K099j425m065
12941A1312K968M419J921l283m807q16K666j377N82M890j151m651k730k136j765
12926F042k910N99L065K470k945j230M312J622k70J204N300J360J208J018k767
$$ y = [52498, 65086, 75387, 89062, 107156, 128646, 153475, 181560, 228664, 300518, 394403, 534581, 758357, 1071570, 1411904, 1672842, 1745576, 1596521, 1303609, 982796, 711296, 521692, 396475, 319274, 267135, 230186, 206206, 183919, 167707, 156984, 149089, 138372, 125574, 119561, 113708, 109671, 107577, 107865, 109612, 109655, 103919, 98389, 99710, 96644, 87361, 77092, 71123, 66824, 60364, 53390, 48064, 35787, 29899, 26098, 26564, 27610, 29095, 27050, 22658, 21230, 28718, 31069, 31936, 30615, 27395, 19490, 17107, 17760, 16011, 11259, 9465, 10774, 14248, 14703, 16802, 15377, 11312, 14280, 18699, 20620, 17337, 12530, 11714, 14380, 13003, 13585, 18475, 17324, 12673, 9943, 7807, 6042, 3132, 3731, 6796, 9266, 6321, 5091, 9403, 11025, 10755, 11959, 17259, 18619, 19827, 20845, 18078]
12911A8078j620L280J509q67m16m442l639j747R43j671j612O222J054l236n087
12896F749n496k646m692r95M294M379N77k321n443MK879K270m523k818j769Q93
12880h658K678L181k7j355M361J156R38k865o130m157J712M901K446m167p15L959
12864b742j741L200N551J214k48o617j308K277J601K349j609j311j402k102l002
12849e890m193K991L732K065j15k058p26J310J403O20j034J301O74K854k935j535
12833a536r24r20j865j235P0j531M729M710j811k94k25K407j63P5N85J876L063
12816G011K37k034q28l172j607J006k749j385j087P60N72l101n98K074l23P79
12800d445j190O892N651L181O08n83j89L83m896k956K68k466K07m109K180J841
$$ y = [18078, 16458, 19738, 21247, 20380, 19964, 15522, 11883, 10136, 11079, 9408, 7796, 14018, 15072, 11836, 6749, 1253, -1393, -6085, -7080, -2786, 1593, 2170, -151, -5594, -5590, -2711, -441, -4964, -7782, -9551, -8658, -5980, -2799, -2826, -4181, 180, 1336, 2274, -591, -6721, -10878, -9166, -4265, -1819, -5986, -6701, -2742, -4483, -1283, 4268, 5482, 5234, -1383, -2691, -414, 1187, 3536, 1927, 616, -786, -2888, -5890, -10083, -7092, -3360, -1295, -1410, -3468, -4194, -2884, -1481, -861, -1895, -594, 80, 2934, -1, -1536, -2460, -3380, -5245, -6480, -6410, -7941, -3212, 1498, -313, -607, -832, 1575, 1412, 1487, 2072, 3948, 7011, 7248, 5214, 4386, 1214, -393, 613, -2136, -3521, -4608, -3848, -3276, -6377, -6975, -4901, -5224, -4445, -5635, 1257, 6908, 10089, 10697, 10114, 9925, 10308, 5412, 2456, 2724, 258, 465, -3644, -1464, 377]
12784C77K552L728P46r57j416j497K267N7m106k808O5k973m533L099L694J064
12768f41L291K542O63j39N072k036m606j591j541j859K622N596L833r04n545N057
12752I814j184o747l322j461K283j533N90J046N87M61j294n700n344o310l836
12737b1950L184M904M252m26J773K814j5J386j322k644q12J400l91J769k02J386
12721d894L075O82L42J628K165j04J122O401K509j944o970k6l680n46j746o99
12705b685j271m164l75M895j366M22l262j095J477K956J624L570m867r29m03L959
12689a514L01j024l573j861P616J551j565k110p126j922L231R43J531j221J80
12674f563J70J197K485k322k02J862K22j275j788m74r02L133M271J270j293k530
$$ y = [377, 2929, 6657, 7403, 6446, 5030, 3533, 5800, 5857, 1751, -1057, -992, -3965, -8498, -5399, -1705, -641, 2650, 5192, 5855, 5716, 10788, 8752, 4146, 2555, 1014, -845, 1777, 7373, 11206, 10302, 4757, 9814, 8630, 1883, -1439, -2900, -617, -2150, -1560, -514, 73, 534, -760, -6460, -11804, -18114, -21950, -18766, -13862, -9610, -10036, -8263, -5449, -5464, -4078, -5400, -8044, -8856, -7456, -7847, -6078, -6280, -4894, -1819, -1137, -795, 833, 2998, 2894, 4016, 10417, 12926, 10982, 4012, 3986, 306, -240, -1986, -2685, -3956, -8120, -8495, -3600, -4966, -4544, -7806, -8901, -7424, -4468, -2844, 726, -4141, -5070, -5473, -1514, -1213, -2237, -5810, -7671, -55, 1496, -69, -2179, -9305, -11227, -7996, -7053, -5522, -6743, -6563, -6393, -5196, -2711, -5033, -5235, -3373, -3151, -4426, -6214, -6688, -7590, -4457, -186, 1084, -209, -2739]
12658b739J055R04K517j256l017n99j605k185J984K330J558j810m00M594M336
12643E667r25j656k263j600L58L85l345l875j457N77j26J644N307m94k017M44
12627c376l24L557Q20j559j210o214l890K426j51K554M019l04l696j453q95K216
12611g480o11J100M390K67O39J596j147l008j661q20Q31L080j75P06o2j777j149
12594e281N281L125l480k181m099K675K667O237R530J8018J2682K900j69r542
12580C8363j1152q011p441l417m871Q88N67K20p33k134k590K295K378r21k126
12565A315J643j185k350j281o59m773j516L515L618L569j927L576l390J716pj73
12549A691Q27o57J055j779M89l332o624K048K398m73K122O05k718J045K495J849
$$ y = [-2739, -1684, -780, 1737, 481, -2536, -3135, -4740, -6925, -4941, -2611, -1053, -2863, -3263, 1331, 5667, 4742, 3086, 823, -777, -419, -34, -3379, -7254, -8711, -8134, -8260, -6616, -1309, -1803, -3820, -3376, -3700, -143, 677, -882, -2092, -8306, -12196, -9770, -9921, -7367, -3348, -3652, -7348, -8801, -9696, -7480, -8091, -6991, -2601, -2334, -1695, -99, -1246, -4254, -5915, -6735, -5904, -2824, -2999, -2293, -2355, -4132, -5281, 0, 3125, -355, -2536, -6635, -3960, -1293, 4944, 14474, 32492, 45174, 48074, 47905, 38363, 27211, 19200, 11759, 8342, 3471, 4359, 4926, 5146, 4413, 2279, -311, 1984, 4362, 3441, 1315, 2958, 1773, -577, -1858, -2517, -7290, -8806, -5291, -1673, 1896, -31, 3545, 155, 1871, 1864, 1691, 2518, 1861, 2916, 1137, 1626, -1706, -8330, -6282, -3884, -4357, -2235, -1630, -4348, -3303, -808, 1041]
12533A041r66K431n753m011L148M378p93K765r54K689K714j787m647k162L205
12518A298J900n903m003J398k24L496M736Q31l840l576K089j842m871P10L227
12503d574K275j420m478j980K159J57j524M181J209r12L057J927l211j421o99
12488e254j937l92K805L439K110O77J209r4q60p62m69J485K505Q170J3630J5181
12472D1443P874o350j0601j1824r275o484m612m074Q14Q13J901K761k423r57N01
12457d93N94j062k603J157N18K554j095J417J492J854l02J42k558o652m741k55
12441a0033m4J730K710K230K473j928j576j044p04k250k31k463J981P295K319
12426D65J054k5l682J638M097O493N896P835Q650J3015K6012M6880M3589P168
$$ y = [1041, 75, 2506, -3247, -7258, -4110, 268, -525, 2240, 1286, 3975, 6689, 4902, 255, -1907, 1298, 3198, -2705, -6708, -5310, -5534, -2038, 2698, 3529, -311, -3887, -1798, -3640, -8511, -7801, -4574, -2299, -3719, -8197, -10177, -8018, -7861, -9385, -5204, -3995, -4907, -1850, 77, -3134, -4555, -5254, -7191, -7583, -4778, -1339, 771, 1448, 2657, 2563, 1703, 941, 472, 1957, 4462, 12632, 26262, 41443, 49317, 42967, 32366, 20542, 11267, 4783, 171, -3903, -3089, -2276, -375, 2386, -37, -994, -493, 101, -961, -3564, -2407, -1889, 665, -430, 987, 2479, 4333, 4031, 4173, 1615, -5037, -9778, -10033, -10077, -8347, -5637, -3407, -934, -2862, -4438, -5482, -6186, -8436, -8667, -11130, -9149, -1854, 465, 1519, 1494, -2188, -550, 3547, 10040, 15936, 23771, 32421, 45436, 71448, 118328, 161917, 169085]
12412A69085k5780l9803l2944k2063j5618q353l787p082l664K672j887q28J180
12399A1128j472o357j224k474K993j714m563K0Q72L717J977N827l15n307m343
12384a235o45J300R77l291R28M677n527p301j121Q30J609J005J353L960j731j750
12368e962J28K617O65L358R90K513k084k920P327K550r14J204L420J571k4p94
12352A3645M72k041k825m87J936k498n531k586J570l20N2l800J115p31k483k381
12336f893J94L792J258j308r00K137J963l263K232j189o79J332m35l908k267M04
12320g530Q38J950O82j292l204m562K189L719L155pp21j300K2k677k684R44K414
12303h064J524l887l51k352L673K417K98K664j100q88j107J586K876K140k836
$$ y = [169085, 143305, 103502, 70558, 48495, 32877, 24524, 20737, 13655, 9991, 12663, 10776, 9948, 11128, 9656, 3299, 2075, -399, 2594, 880, -3683, -3663, -2791, 926, 2903, 8730, 8415, 3108, -1235, -1880, -580, 397, -2894, -1966, 2711, -2816, -10117, -11238, -10408, -8799, -7794, -6441, -2481, -4212, -5962, -5834, -3217, -2552, 806, 1796, 4309, 2225, -695, 6632, 9182, 8268, 9472, 12892, 14463, 14439, 13645, 14117, 12076, 9251, 8764, 10700, 8202, 2671, 85, 1655, 1335, 1387, -2413, -1298, -2029, -4512, -6893, -6699, -2907, -1649, -2957, -3857, -1720, 243, -3020, -788, -1977, -2656, -1324, -1759, -5667, -7934, -7530, -6692, -4742, -4060, -5352, -8556, -13118, -10929, -7210, -4055, -4062, -4783, -6083, -6061, -8738, -11422, -10478, -8064, -6540, -10427, -10778, -13130, -9457, -7040, -6742, -4078, -5178, -6066, -7173, -5587, -2711, -571, -3407]
12288c407K22P13R92J179o91m866n923J056K528K164r91l763k559L245M17o66
12272a0350K514K936j687J191K562J647L446j358r03J278k285k945m65K70J282
12257b867J285n807j817J485N189k13J448q16K090K837n37k013R95j495m884j472
12241f592M031m521l234O45K187L152L727R38j823J172J421k625m483O98r38j136
12225g381j423J935K560N952o00q400j52N02j032J567J071L28J504N261L731j648
12209C775j284k495L27J363l299K768J58j881L008j467l050n094j019N086K840
12194b64K52L716N42j575k506N87j231K144K68J67p73m572o467Q70J341K323m92
12177e670q53J600K556j287J128k80l171K218J880K097k379N78J835r0k606j35
$$ y = [-3407, -3185, -2472, -1480, -301, -992, -5858, -11781, -10725, -8197, -6033, -7024, -10787, -13346, -10101, -9684, -10350, -7836, -4900, -6587, -5396, -2834, -1187, 2259, 901, -2, 1276, -1009, -3954, -4419, -4149, -2867, -1582, -7389, -9206, -7721, -2532, -2745, -1297, -2113, -23, 2814, 2277, 264, 1259, -236, -5120, -6592, -2561, -7082, -10316, -9671, -7484, -4332, -605, 333, -1490, -318, 1103, -1522, -6005, -5307, -6245, -7381, -8804, -6869, -4309, 1643, 1043, -7357, -7509, -7007, -8039, -6472, -5401, -5073, -3569, 1692, 5423, 3775, 2491, -4, 323, 1686, -1613, 1155, 1313, -568, 2440, 973, -2077, -7171, -8190, -3104, -264, -12, 3704, 4246, 2671, 165, 752, -479, 1665, 1933, 2100, 1327, -3245, -9712, -8842, -7501, -5178, -5670, -6523, -4923, -2367, -3654, -2526, -2806, -5977, -3759, -1879, 218, -2161, -1583, 252, 162, -2444, -2579]
12161b579J01j612q68Q53L964n13J015L089o92J562k447k752J190o13k768L155
12145H5Q0K121J135Q38j101O388R272N554P850J0174P725J5551K1274K0579M6638
12130A54163P4752Q4325M6133j4532n7161p2292n6871m0916k5548j7991j1455
12119F2607o928m870l482o470m873m05O51j997l892L2o96L645K957J368l01J211
12103C8557l05J207J168L477L193K559P536P312Q743J2937J7080K0736K3590L5646
12089A83436N4008P9726J17717J79783K47583K34181N8399j40531k34435k24294
12079E55573j63533r9578o1584m1397k6277j7591j6830j7098r198o641o563l037
12067H6246o96j673m197J375j953L433L58J257L226n53l065j165m414j025K67
$$ y = [-2579, -2478, -4090, -4958, -4105, -141, -654, 361, 3450, 2758, 4320, 1873, -879, 311, -302, -3070, 85, 165, 2286, 3421, 4259, 3158, 9546, 18818, 24372, 32222, 42396, 50121, 65672, 86946, 107525, 154163, 228915, 313240, 359373, 344841, 287680, 215388, 158517, 117601, 92053, 74062, 62607, 55679, 50809, 47327, 40857, 35984, 35579, 36230, 34233, 30341, 30373, 29677, 33322, 36279, 37647, 37346, 38557, 38252, 39459, 40627, 44104, 47297, 49856, 57392, 64704, 73447, 86384, 103464, 124200, 147790, 183436, 237444, 317170, 434887, 614670, 862253, 1096434, 1154833, 1014302, 779867, 555573, 392040, 292462, 230878, 189481, 163204, 145613, 128783, 111685, 102487, 95846, 89283, 86246, 85550, 83877, 79680, 81055, 79102, 82535, 82893, 84150, 87376, 86823, 83758, 82593, 78179, 77154, 77421]
12052G7421J847Q733J0653J6204K1561K7830L3872L9879O1432J01340J58606K28262
12040G87640K62503J44030o7111k16324k46068j93073j26421p5076m9370l3022
12030A87708k2338j8514j2188r513q403j1545j1676n553o733k346k315l546K66
12017G3304O42J315J441m646n697m163J878K852k678j241J724j160L107J781J653
12002G0112Q731J1996J9916K8409M6638O6906Q4501O3650N014n7199q0988p4080
11990A93606n3747l4667k1440j0785q842n375m850n557k420m739m827l379M03
11977C3381j419K218L245m158m586k657R06q54m062J658J809j481l793l099n512
11962A1596l121j996j512j211L307J873K641J01K238l664m685j718K456K186k991
$$ y = [77421, 79268, 88001, 98654, 114858, 136419, 164249, 198121, 238000, 299432, 400772, 559378, 787640, 1050143, 1194173, 1127062, 910738, 664670, 471597, 345176, 270100, 220730, 187708, 165370, 146856, 134668, 125155, 116752, 105207, 93531, 87978, 81245, 78899, 76584, 73038, 73304, 73946, 75261, 76702, 72056, 66359, 62196, 64074, 66926, 64248, 63007, 64731, 63571, 66678, 68459, 70112, 78843, 90839, 110755, 139164, 185802, 252708, 337209, 400859, 405873, 348674, 267686, 193606, 139859, 105192, 83752, 72967, 64125, 58750, 53900, 48343, 45923, 41184, 36357, 32978, 33381, 31962, 34180, 37425, 33267, 28681, 26024, 26930, 26076, 22014, 23672, 25481, 24000, 20207, 17108, 11596, 8475, 6479, 4967, 3756, 7063, 8936, 11577, 11678, 13916, 10252, 5567, 3849, 6305, 8491, 5500]
11947E500j171k856L799O874j637n520j911L312n58j618N40j616l90K114j535
11932C327n221L36k311j673j168L621m62k399m364l192K346K829M757R94j667
11917d247O47Q01J099k122k921M44K026M2o45l002M095J319j858O02m827P25M421
11900c401K049j95J644P8j730l67J546j95j451j697k579K474j092k806O37J727
11884e358J947j420k117R99M71K088J816k233K250N049l20l331o688l42J623K058
11868c508K367P91J113q00J105K274l122m952j653j239J810m6j105K963K678k234
11852c558p57K689M310J902K30P15J695o332n472k587M5L632M376K615n035m031
11836e563j335j181M289J318J450k315K20J112K335N57k86M241l559m248L41J669
$$ y = [5500, 4329, 1473, 5272, 12146, 10509, 4989, 3078, 6390, 5832, 4214, 4754, 3138, 2748, 4862, 3327, -1894, -1558, -3869, -5542, -6710, -3089, -3551, -5950, -10314, -13506, -11160, -8331, -3574, -2580, -4247, -3600, -2799, -1700, -3822, -6743, -6299, -4273, -4231, -4876, -7878, -3783, -2464, -4322, -3720, -8547, -7822, -3401, -1352, -1547, 97, 175, -1555, -1922, -376, -571, -2022, -3719, -6298, -3824, -4916, -7722, -7085, -5358, -3411, -4831, -6948, -5949, -5478, -3390, -1574, -3807, -1557, 3492, 3172, -159, -6847, -7189, -5566, -3508, -1141, -350, 763, -37, 1068, 3342, 220, -4732, -6385, -7624, -5814, -5860, -6965, -4002, -1324, -3558, -4315, -1626, 2684, 4586, 4816, 5531, 7226, 894, -4578, -7165, -7120, -3488, 888, 3503, -1532, -5563, -6898, -8079, -3790, -2472, -1022, -3337, -3117, -2005, 330, 887, 601, 4842, 1283, -2965, -2624, -955]
11820i55j908m907J20K413O579M114j710l275k631j157j680l700O60J716j306
11805g627O84N057J959k123R73L513n689m713k307K854M146R07J558k798j702
11790e308O52J643j293n94k033r29N70Q08J124j18J235r78K461L654l008l227
11774e341k385K96p07K704L709k068j364K932K917k819m905K351m14r54M027L093
11758A072j132q32Q97K027l205J240J556k097p61k964l377N50O83J194J434j446
11742e161L644K955m122K02Q88j61j93P76K801Q6K004J022k429o538K805J045
11726c76k201k872j678J612M345J692k17j916J37o09k516k567N19J72M765K791
11710A081j758J530K880l37k507j229m21J297o48j457l585j113J005j20P26k728
$$ y = [-955, -2863, -7770, -7650, -5237, 1342, 5456, 3746, 471, -2160, -3317, -4997, -8697, -8037, -6321, -7627, -6943, -1886, 73, -2050, -1077, 2436, -3253, -7966, -10273, -7419, -3273, -2366, -808, -3606, -5308, -4656, -3013, -4306, -4900, -6933, -7862, -7292, -6484, -5360, -5478, -4243, -5221, -2760, 894, -2114, -5341, -7726, -7430, -8137, -5433, -1724, -3792, -5156, -2224, 693, -2126, -7031, -4680, -5094, -6048, -2021, 1072, -60, -892, 5, 2032, -1173, 67, 1623, -474, -1235, -4199, -7576, -7026, -6343, -5149, -3715, -5161, -1517, 1438, -2684, -2482, -1594, -1755, -1948, -1172, 1629, 1715, 3719, 4741, 2312, -4226, -1421, -376, -2577, -5449, -7127, -5515, -1170, 522, 305, -1611, -1474, -2083, -4599, -7166, -6647, -6475, -1710, 1081, -677, 853, 3733, 3396, 889, -340, -761, 536, -112, -1569, -5154, -6267, -5262, -5382, -4656, -7384]
11694g384Q06K429O23l344j474K088L722M497J189P75p32J606o60k331n95J338
11678B553r5l058l051n00K585j134k658L110M52j162L594pp91L225O05k145J363
11661B886L805q99J69r50r39m744m922j727R84K508J741N73J089Q97K683N54k125
11644A583j762K871L189N42r54j915l67L730Q22l874l686j178K243K191L842k971
11628D306o544m545L196K632L971J735R49P43j633n436l803k651k237j338K738
11613g917L260N85O09n95J962K920j06O92M541j177j156o06m852l815J515O598
11597B458L046m23o12K48O13j551k475M359R66K52k531k734J366l583j52m026
11581d779m081N86J820O657N2J031J458K308j520J019J223k875P96k965n31O25
$$ y = [-7384, -6578, -4149, -3526, -6870, -8344, -6256, -2534, 1963, 3152, 3927, 3195, 4801, 4141, 1810, 1215, 2553, 2458, -600, -3651, -4151, -1566, -2700, -5358, -2248, -1796, -2958, 636, 629, -162, 3063, 3668, 1523, 2886, 6691, 5792, 5961, 5011, 4072, -672, -5594, -7321, -6337, -3829, -2088, -1515, -426, 471, 3154, 3708, 1583, -179, 2692, 5881, 6423, 5469, 3554, 3187, 6917, 7739, 3865, 179, -999, 1244, 3435, 7277, 4306, -2238, -6783, -3587, -955, 3016, 4751, 5700, 6443, 4810, -626, -4429, -7080, -9317, -10655, -7917, -4657, -4072, -3463, -4058, -2096, 824, 718, 1410, 5951, 4774, 3618, 3012, -1840, -5655, -4140, 2458, 5504, 5081, 4469, 4717, 5330, 3779, 1304, 5663, 6629, 6881, 4350, 1616, 2982, -601, -753, -4779, -8860, -8274, -6454, 203, 255, 1286, 2744, 5052, 3532, 4551, 5774, 2899, 3695, 730, 199, 824]
11565H24N08j12J651k105M022j33j702K61J275K139J762o243p370l281K095K914
11549c495L515O134K11l850k128N84j279R71m72p36k162L214J971kJ012K842J065
11532G395j728J761p70M26p64p28l921j134L317j717j431j328k188L681p71j670
11516a570Q06M58J430L130o69k523K756l522J013J008p9m08J006p07k330j85j68
11499e54q75L208J731o827j899K413r5K311O35j823j749L501K280K571J818k051
11483D595K088j060J409J720q40j170k116p693l2K261K504J008PM461L677j441
11467I378m654o31m77O702J170J64k339k168J487o0j388K061j545l817K754n516
11451A121r09J186J013J002j495j226k030lk83K097N042j292j818l306k832l503
$$ y = [824, 1332, 1220, 2871, 766, 4788, 4655, 2953, 3214, 4489, 6628, 8390, 2147, -5223, -8504, -6409, -3495, 20, 6154, 6365, 2515, 387, 971, -308, 663, 191, -545, -2707, 507, 2478, 2476, 3488, 6330, 7395, 5667, 7428, 6658, 7084, 6320, 5592, 1671, 537, 3854, 2137, 706, -622, -2810, 871, 100, -1570, -764, -306, 1124, 4254, 3585, 1062, 3818, 296, 1309, 2317, 2238, 1830, 2836, 2129, -201, -386, -554, -1429, 1779, 3510, -3317, -5216, -2803, -2898, -587, 48, -1775, -3524, -23, 2257, 4828, 6646, 4595, 6683, 5623, 7032, 8752, 7912, 6742, 4626, -3067, -3099, -838, 1666, 2674, 2681, 7142, 10819, 9378, 4724, 4093, 3616, 10318, 11488, 11652, 9313, 7145, 8632, 8572, 7184, 9245, 7700, 3883, 6637, 1121, 212, 1398, 2411, 3413, 1918, 692, -1338, -1341, -1624, 473, 5515, 4223, 2405, -901, -3733, -7236]
11435g236M757K107k573k8L727M346K746l162j205k24n16O57M272K29j312l270
11419C315k230R55k877K770l21K06K726J31R95R54M403J11l410k017K851r00J259
11402H921j414m936p23J126K523k68k853k524J673l836l567j238O329O695L24
11387F232j312k633k049L82J883K476K434L18K6K458m99m710N90pQ39q65j485
11370D078K117j792J048r40K266K805M602m76k101k77l55k165K535j916k596l540
11354C293L76L305J826L98n031m612K764L02j81j523m81n23L712M411K021M90
11338A0547j765l10k831n724R8L225J465L89l085j433L00o255l087M953O665R3
11322C245K53K646L380K947j958j926k726j299o53Q80J267J822K189j385r02k104
$$ y = [-7236, -2479, -372, -2945, -2973, 754, 5100, 7846, 4684, 3479, 3255, 2739, 3396, 7668, 7897, 6585, 3315, 1085, 2040, -837, 1933, 1612, 1818, 4544, 4675, 5670, 6624, 11027, 11138, 7728, 5711, 8562, 7662, 8921, 7507, 2571, 1848, 2974, 5497, 5229, 2376, -148, 1525, -2311, -5878, -7116, -787, 5908, 6232, 4920, 2287, 238, 620, 2503, 4979, 7413, 7731, 7757, 10215, 9716, 5006, 5596, 5589, 6428, 5563, 4078, 6195, 4403, 5451, 4511, 6777, 9582, 14184, 13708, 11607, 11330, 10975, 8810, 11345, 9429, 6833, 3293, 3669, 6974, 8800, 9198, 4167, -445, 2319, 2621, 2440, 917, 436, -87, 3625, 8036, 10057, 10547, 8782, 8472, 5641, -83, 15, 3240, 4705, 5094, 2009, 576, 876, -5379, -8466, -3513, 3152, 3245, 3498, 6144, 9524, 12471, 10513, 8587, 5861, 4562, 3909, 4789, 6056, 7878, 10067, 8682, 7780, 5676]
11306E676l524l900r36J398J832L183m51j306J934M077J063L254K724j500l271
11291A0253k913r00K312k424r78k548J969N6p50M116Q54j633m094m021L798L378
11275F475J826o8j055R40k343K637M55j090j804j252k195j594o25J369K57K871
11259D804O1J093pK398J115K087K910j893J163K699m548p033L978L953j670q71
11243A0239q18J262K537l56k845L977K400o28m580J43j606J617j886R98l24L789
11227A3919L969J988m565l898l909j278j471j328L590L291L444L584O2l822o952
11212F624j75K166J036K540L273L163l003l098j93k375p86J292k102j244j010
11197F108J570PJ290m14j353k183K511j742J115n91o050K407Q302j48k736J429
$$ y = [5676, 2152, -1748, -2684, -1286, 546, 3729, 3278, 1972, 3906, 7983, 9046, 12300, 15024, 13524, 10253, 7340, 6440, 8752, 6328, 5350, 2802, 4771, 4827, 4077, 8193, 9047, 7414, 3320, -701, 3097, 6475, 8301, 8233, 7178, 8118, 5775, 8412, 8867, 7777, 5973, 4721, 2526, 932, 307, 1676, 1933, 4804, 4865, 5958, 5951, 8349, 9464, 11551, 14461, 12568, 13731, 16430, 11882, 4849, 8827, 12780, 11110, 10239, 9421, 10683, 13220, 12864, 10019, 13996, 16396, 15768, 11188, 11331, 9725, 11342, 9456, 10454, 10130, 13919, 17888, 19876, 15311, 11413, 7504, 6226, 4755, 3427, 7017, 10308, 13752, 17336, 17398, 13576, 6624, 6449, 8615, 9651, 12191, 15464, 18627, 15624, 12526, 12333, 9958, 9172, 10464, 8362, 7118, 6108, 7678, 7685, 8975, 8561, 7208, 5025, 7536, 5794, 6909, 6318, 268, 2675, 10977, 10829, 8093, 9522]
11181I522j450k031J24J1L839L027k917J496J290J695J706j838k351j808K895
11166A3210J831N06j649o178k296J459j81J570n52l516M756L158J321j597m571
11151G271J566R819K250O44J885j282j25n01m331k463K307J200M26m28j351k661
11135A4226L529K927m032R02J568m258n51l21R22N06l94n44k377m297J984q8j00
11118I602O31M125O082K988N48p39l38o051o92M7k266r94M316j897l576l028j515
11101G243J33L813J058M80R88L13k360k052K041J27J636J550M855M328K136L653
11085B9942L352m263q602m916K823k746l788j733j425N77l289k864J198J596Q84
11070F746K784K217L358n31k143k307j066L549N287k28k106j961L85p43o24k209
$$ y = [9522, 8072, 6041, 6165, 6176, 10015, 13042, 10125, 11621, 12911, 14606, 16312, 14474, 12123, 10315, 13210, 15041, 15547, 13898, 7720, 5424, 6883, 6702, 8272, 7720, 4204, 8960, 12118, 13439, 11842, 7271, 8837, 18656, 20906, 21550, 23435, 22153, 22028, 21527, 17196, 14733, 17040, 18240, 18666, 18238, 16887, 14226, 17755, 20682, 16650, 17552, 19120, 14862, 14311, 13990, 14912, 15418, 15024, 14480, 12103, 7806, 9790, 9702, 9602, 10233, 14358, 20440, 23428, 23976, 23237, 22899, 16848, 16156, 16203, 13937, 12943, 17259, 15362, 11786, 8758, 7243, 7376, 11189, 12247, 12727, 13715, 14028, 11668, 9616, 11657, 11784, 13420, 14970, 19825, 24153, 26289, 29942, 33294, 29031, 20429, 15513, 18336, 15590, 11802, 10069, 8644, 9221, 5932, 3068, 4266, 5862, 6746, 9530, 11747, 15105, 14574, 12431, 10124, 9058, 12607, 17894, 17666, 15560, 13599, 13984, 13241, 12617, 10408]
11054A0408O25K269L637L775k103l936N07j428j981k365L940L15o46N05L319M746
11038B1587O22j11k172L32J964o7r69J282P00k609q53L824m106n346J031J357
11022A6466J179J925L081M724M275j542J284L250L33N08j047l177k879M76K5p01
11006B8180n867j494P86J381k327L075j820j60K206M813k664l654J29L74M150
10991B7108J983j62K233p90L280j208m822o100J132O851K0k331m494p60L983n614
10975B0309k633l273R5K031J538l25j755k625l09J038L915J490n22M960l35m001
10959A9598o04L082J048M570L763J535J09R4J865m92n13N24K69m243j812P19K33
10942B9745N550K63j081L136j722l377K564K715J877k614k977k750o63L70K230
$$ y = [10408, 11033, 13302, 16939, 20714, 18611, 14675, 15182, 13754, 11773, 9408, 13348, 13663, 13017, 13522, 16841, 21587, 22209, 22098, 19926, 20258, 22222, 22155, 21186, 22468, 23168, 20559, 19706, 23530, 19424, 14078, 15109, 16466, 17645, 19570, 22651, 27375, 31650, 30108, 31392, 34642, 34975, 35483, 34436, 31259, 28380, 28856, 28881, 28180, 22313, 20819, 21605, 22986, 20659, 23734, 21914, 21754, 23960, 28773, 26109, 22455, 22584, 22958, 27108, 29091, 28929, 31162, 30372, 33652, 32444, 27622, 21522, 22654, 29505, 29525, 27194, 22700, 21940, 25923, 20309, 17676, 14403, 14498, 16529, 18067, 17742, 15987, 13362, 13053, 14091, 18006, 19496, 18974, 23934, 23599, 19598, 18994, 22076, 23124, 27694, 31457, 32992, 33101, 33195, 35060, 34568, 34055, 34579, 34848, 30605, 28793, 29512, 29745, 35295, 35558, 34477, 37613, 35891, 32514, 35078, 37793, 39670, 37056, 34079, 31329, 30666, 31036, 33266]
10927C3266L554j465J288L142J972M960J531P06M69L701k16l928K631K249l390
10912E0470l318K811N6l847R73J611J384M206p94j551L970m51p91K291L097L493
10896F3610M210M147j37k479J406L159k150Q46L148R64l008m086l025K087L220
10881G1912p37k447N91K309n12l09l31N132L488m40n20m07N617M662Q240N773
10865A02021N354J704P819N973L242N218M717o55n683o232n039m418m338n812
10851A03871m310o761n587J192j66n516o735j892n03o098l525k773j933j125k213
10836E5926K70j161L476J192K512J470m266q42Q91K126M060K35L554N162M423
10821G9028J277O101P881R266M195J219M527N960P483Q209N857R362J7820J9577
$$ y = [33266, 36820, 35355, 36643, 39785, 41757, 46717, 48248, 48954, 49423, 53124, 52908, 48980, 51611, 53860, 50470, 47152, 49963, 50019, 46172, 47145, 48756, 50140, 54346, 53552, 52001, 55971, 55520, 54729, 57020, 60117, 63610, 67820, 71967, 71830, 69351, 70757, 73916, 71766, 72612, 75760, 76724, 73716, 69630, 66605, 68692, 71912, 71175, 68728, 69319, 71628, 71116, 70807, 70476, 75608, 79096, 78656, 78136, 77729, 83346, 88008, 96248, 102021, 107375, 109079, 116898, 122871, 126113, 131331, 136048, 135393, 129710, 123478, 118439, 114021, 109683, 103871, 99561, 92800, 87213, 88405, 88239, 82723, 75988, 74096, 73593, 67495, 63970, 61197, 59264, 58139, 55926, 56196, 55035, 58511, 59703, 62215, 63685, 59419, 58577, 59468, 61594, 65654, 65889, 69443, 74605, 79028, 80305, 86406, 94287, 103553, 107748, 108967, 113494, 119454, 126937, 135146, 141003, 150365, 168185, 187762]
10807A87762K8031L8355N0700P1983J05092J52544K26542L36086L83908K37505
10797A818508J0393j15120n8162R4637J35731l6319k47409l44897l14030k26129
10787G17203j46892r6851o4407m3251k9946k9382j7804j4383j2282o162n319l572
10775B46952j521m78k065m217q321q963q956j0356j3213r417o764p241j4627r039
10761A41774m929k182l872p978o397m894m549o215m399n994n513p50k699l170
10747G8233N15j098l611j00K895L019l7M47J642k895o00m459l586j825l299n38
10731F4703m682k681n007K067O034Q490N621k458l354k674K328j919k288J595
10717F5775l241L128L080K402q62l260M311O467L994Q270Q335Q862j778j5807
$$ y = [187762, 215793, 254148, 304848, 376831, 481923, 634467, 861009, 1197095, 1581003, 1818508, 1828901, 1713781, 1655619, 1750256, 1885987, 1849668, 1602259, 1257362, 943332, 717203, 570311, 473460, 409053, 365802, 335856, 306474, 288670, 274287, 262005, 255843, 250524, 246952, 245431, 244953, 242888, 238671, 230350, 221387, 212431, 202075, 188862, 179445, 172681, 165440, 150813, 141774, 136845, 134663, 130791, 122813, 116416, 111522, 106973, 100758, 96359, 90365, 84852, 84102, 81403, 78233, 78748, 77650, 74039, 73939, 76834, 79853, 79816, 80263, 81905, 79010, 78410, 73951, 70365, 68540, 65241, 64703, 60021, 57340, 52333, 54400, 60434, 68924, 74545, 72087, 68733, 66059, 68387, 66468, 64180, 65775, 62534, 65662, 68742, 71144, 70282, 67022, 71333, 77800, 81794, 90064, 98399, 107261, 105483, 89676]
10703H9676p415l334n974o49L458L11o707q531o358k422N61Q726P601L892L949
10688G6784K486k127k880M281o52k959J190R67j481j282P62m05j619J504L847
10673G8416J966N997J958j084L96P61n27l130R65N517K403L001n02p11l778J57
10657I1805M871J0780J1182J1209M223O616J5895J2128J7302J7070K0540K6501
10645B50122J9534J5098K3443J1453j8130n720J0775J5062K08k4916m2781k4277
10633B29871l397k416j7085k4583j6506r817n39o57j752Q38L307J926N412j4k915
10618A61673l666l737n892l90N99j999k336m385l458L539m005K105L547K530l139
10603A40986k195J786L663K132M723M162j451O824N935K950L327Q337Q922L135
$$ y = [89676, 82261, 78927, 72953, 72304, 75762, 76073, 69366, 60835, 54477, 52055, 52616, 61342, 68943, 72835, 76784, 79270, 77143, 74263, 78544, 77892, 74933, 76123, 77090, 75609, 74327, 75089, 74684, 73065, 74569, 78416, 80382, 86379, 88337, 87253, 87649, 88410, 87883, 84753, 85718, 91235, 93638, 96639, 96137, 95426, 91648, 91805, 96676, 107456, 118638, 129847, 134070, 140686, 156581, 168709, 186011, 203081, 223621, 250122, 269656, 284754, 308197, 319650, 301520, 295800, 306575, 321637, 321845, 296929, 254148, 229871, 226474, 224058, 206973, 182390, 165884, 156067, 155528, 154871, 153119, 153957, 157264, 159190, 164602, 164588, 161673, 158007, 154270, 148378, 147988, 148587, 146588, 144252, 139867, 136409, 139948, 135943, 138048, 141595, 144125, 140986, 138791, 140577, 144240, 146372, 151095, 155257, 153806, 160630, 166565, 169515, 172842, 181179, 190101, 193236]
10589A93236J328l197m991r116j0897j1669r925k024j1038j7655j5721m533N630
10576I9428j802n184l003P187R986N499l098n518j638P419J963r670j2523j0095
10562G8951p165K69N720O889k283L931J1412J8076J4811J2210Q687Q606J3166
10549A73280R787j728mj363N803J6151Q501K202q400j3432q706K43R741J0695
10535B02770K888m304j3268p791K174L858M938J1351J4823K2517K5485L3216L5029
10522C33686M1294N8204O9956Q1182J06473J33206J16799P4666O8413O1832J8984
10511A164695O31k5378m5605l5023n2482j13961j27945j00069p5321n2579l7124
10500D99839k2466j1294k509O508J5178P708O036J7553K7937K6616K7310K6299
$$ y = [193236, 194564, 191367, 186376, 177260, 166363, 154694, 144769, 142745, 131707, 114052, 98331, 93798, 99428, 97626, 92442, 89439, 96626, 106612, 112111, 109013, 103495, 101857, 109276, 111239, 101569, 89046, 78951, 71786, 72055, 77775, 84664, 82381, 86312, 97724, 115800, 130611, 142821, 151508, 160114, 173280, 183067, 181339, 181335, 179972, 185775, 201926, 210427, 212629, 204229, 190797, 182091, 182334, 192075, 202770, 205658, 201354, 188086, 180295, 182469, 186327, 191265, 202616, 217439, 239956, 265441, 298657, 333686, 374980, 433184, 503140, 584322, 690795, 824001, 940800, 1015466, 1083879, 1145711, 1164695, 1165326, 1139948, 1094343, 1059320, 1006838, 892877, 764932, 664863, 589542, 536963, 499839, 477373, 466079, 463570, 470078, 485256, 492964, 499000, 516553, 544490, 571106, 598416, 624715]
10488F24715K9675K6384K4692K8690K7092K7268L2357K6961J8523J8924J6887
10477I02168J6860K0726J2658M418N701P289J1021J4555J2491J8079K0216J8663
10465A064845J5732R325J3927K1692L3289M0319L7966L2225L1080K6943J9353
10454A346696K0178K0056K4643K1170J0045L569K371K0127K2132J7523J5073J7914
10442A541497K5237L2827M4241N6345N2347L2424K4143L4294M6703N6311O3680
10431B010049O9977O7370O2380N2945O0194Q9991J33319J56977J52805J48474
10421C004481J83905K46766L07135L24945L10043L23968M07210N42343O94955
10412F345751Q20511Q08928O23795M61811M97240P57339J122576J355717J449931
$$ y = [624715, 654390, 680774, 705466, 734156, 761248, 788516, 820873, 847834, 866357, 885281, 902168, 919028, 939754, 952412, 956830, 962531, 969820, 980841, 995396, 1007887, 1025966, 1046182, 1064845, 1080577, 1089902, 1103829, 1125521, 1158810, 1199129, 1237095, 1269320, 1300400, 1327343, 1346696, 1366874, 1386930, 1411573, 1432743, 1442788, 1446357, 1448728, 1468855, 1490987, 1508510, 1523583, 1541497, 1566734, 1599561, 1643802, 1700147, 1752494, 1784918, 1809061, 1843355, 1890058, 1946369, 2010049, 2080026, 2147396, 2209776, 2262721, 2322915, 2412906, 2546225, 2703202, 2856007, 3004481, 3188386, 3435152, 3742287, 4067232, 4377275, 4701243, 5108453, 5650796, 6345751, 7166262, 7975190, 8598985, 9060796, 9558036, 10315375, 11437951, 12793668, 14243599]
10403A4243599J654952K144811K921368L879375M905285O172945Q064870J0911432
10395E4898637J5135839K1582615L1820687M7928183O4606087N8664742K2853300
10388C17490090j1756266k2318345m667696K1015396J8215052j3886650m4368031
10381B59723550n6671505n0327398l6486776k4330789j6103635j0977252p672561
10374E7153634n550981m281902l474821k841707k220560j590852j017113o28804
10366C5546894o12220r44553j281657j275282j010459q19948r87988j438467j793208
10357B5383112j854535j729136j551297j386811j251748j153995j069130r84566
10349A4401894r02322q34513p86317p52805p09656o53648n99553n45230m90910
$$ y = [14243599, 15898551, 18043362, 20964730, 24844105, 29749390, 35922335, 43987205, 54898637, 70034476, 91617091, 123437778, 171365961, 235972048, 294636790, 317490090, 305733824, 283415479, 278747783, 299763179, 317978231, 304091581, 259723550, 203052045, 152724647, 116237871, 91907082, 75803447, 64826195, 57153634, 51602653, 47320751, 43845930, 41004223, 38783663, 37192811, 36175698, 35546894, 34934674, 33990121, 32708464, 31433182, 30422723, 29602775, 28614787, 27176320, 25383112, 23528577, 21799441, 20248144, 18861333, 17609585, 16455590, 15386460, 14401894, 13499572, 12665059, 11878742, 11125937, 10416281, 9762633, 9163080, 8617850, 8126940]
10340H126940m48126m18707m02941l84429l66055l38022l06492k76517k55822
10331D929829k43570k39665k35722k23411k08724j92541j88860j88013j77830
10322C031493j66528j47088j30412j27294j22838j14837j01406r0270q6077q2810
10312A861933p2289p0903p2111p8372p3719o5270o3280o5379o0829n6729n4528
10301A128524n4174n9035n7304n4482m8443m0366l7738n1403m1045l3834k3054
10290F27646j4248k1839k4034k0248j8496j6777j2687j2825o621k165n381j8753
10278D53572j8387j4196j4160j3207j7723j5083j5755k3990j8488j5177k078P261
10266B92589J2375Q298K1187M0280J3573M062Q433k0697p903J1693j8574j2735
$$ y = [8126940, 7678814, 7260107, 6857166, 6472737, 6106682, 5768660, 5462168, 5185651, 4929829, 4686259, 4446594, 4210872, 3987461, 3778737, 3586196, 3397336, 3209323, 3031493, 2864965, 2717877, 2587465, 2460171, 2337333, 2222496, 2121090, 2030820, 1944743, 1861933, 1789644, 1718741, 1646630, 1568258, 1494539, 1429269, 1365989, 1300610, 1239781, 1183052, 1128524, 1074350, 1015315, 958011, 903529, 855086, 814720, 776982, 725579, 684534, 650700, 627646, 613398, 591559, 567525, 547277, 528781, 512004, 499317, 486492, 479871, 477706, 472325, 453572, 435185, 420989, 406829, 393622, 375899, 360816, 345061, 321071, 302583, 287406, 285328, 292589, 304964, 313262, 334449, 374729, 388302, 392364, 400797, 380100, 372197, 383890, 365316, 352581]
10254C52581j6583m3173l0272r700j964M03N96J877j430n058j152J790M617K650
10240B55182J475M274N808P221J3441J7602J4515J0802K405J581K932Q567J5104
10227C60909J6034N472kP968R275R058Q146O161O270J3999J5435J5947R022K830
10213D86524N74K379M427k176j0263j5798q700l399k519o151j4379j2383k343
10200D15793J2385J149o060p579n748m378o922j6770k4905k1693j6794j4244j2646
10187B91588j2135j6552j3891j4863j0082n036K438J256k184p329k516r66L16
10174B10044j103J814o400k853l079k573n586n158r845o383n007j1342q741q458
10160A35330o736j1348r828k080L444j474q915n668J252K4r93Q02M4m231l851
$$ y = [352581, 335998, 292825, 262553, 252853, 250889, 251292, 251888, 253765, 252335, 247277, 246125, 247915, 252532, 255182, 256657, 260931, 266739, 273960, 287401, 305003, 319518, 330320, 332725, 334306, 337238, 345805, 360909, 376943, 382415, 382413, 390381, 399656, 408714, 416860, 423021, 429291, 443290, 458725, 474672, 483694, 486524, 487098, 489477, 493904, 491728, 481465, 465667, 456967, 453568, 451049, 444898, 430519, 418136, 415793, 428178, 429327, 423267, 415688, 409940, 405562, 398640, 381870, 356965, 335272, 318478, 304234, 291588, 279453, 262901, 249010, 234147, 224065, 219029, 221467, 222723, 220539, 213210, 210694, 209728, 210044, 208941, 210755, 204355, 201502, 198423, 195850, 190264, 185106, 175261, 168878, 163871, 152529, 143788, 135330, 128594, 117246, 107418, 105338, 108782, 107308, 98393, 92725, 93977, 94001, 93008, 93810, 93854, 89623, 85772]
10145H5772m488l415j613k791j593J0174Q535J0730K335O380J0292J3089K2129
10132A55536J6178O807j908l120N147R574J10n149n884p213j2745j8009j0434
10119A28890o274o507L298J27j194K59k172O67J860J416q9k489j0834j0222p483
10104H9253p57L027J88k936m444M949K479L081J099l10L328N76p325j606p64K785
10088I2623N414L355J701nN281K446Q67K465M326R696J2290K721l976q434r449
10073A21321N35Q657K389p773j1656j7546j2829k502M107M262M375k655m213l000
10059H3472k182l519k251J557j696j639k693k3K28J260L933l137k101K474N160
10044G8843j744n671k529j600n276o159m941j962J771R47n475l21q46k229M529
$$ y = [85772, 81284, 77869, 76256, 73465, 71872, 82046, 90581, 101311, 103646, 110026, 120318, 133407, 155536, 171714, 178521, 176613, 173493, 178640, 188214, 188324, 183175, 177291, 170078, 157333, 139324, 128890, 122616, 116109, 119407, 119534, 118340, 118599, 116427, 117094, 118954, 120370, 120281, 117792, 106958, 96736, 89253, 88496, 91523, 91711, 88775, 84331, 89280, 91759, 94840, 95939, 95629, 98957, 99533, 92208, 90602, 89838, 92623, 98037, 101392, 103093, 103088, 108369, 110815, 111682, 114147, 118473, 128169, 140459, 143180, 139204, 130770, 121321, 121856, 130513, 132902, 125129, 113473, 95927, 83098, 80596, 84703, 88965, 93340, 90685, 86472, 83472, 81290, 77771, 75520, 77077, 75381, 73742, 71049, 71026, 71254, 72514, 76447, 73310, 71209, 73683, 78843, 77099, 71428, 68899, 67299, 62023, 55864, 50923, 48961, 50732, 51679, 46204, 45883, 45037, 42808, 47337]
10029D7337M937J936J361L300j901n266k172k79O74N50k2p27l077j701J829q59
10013D5920M81K479N385N935M95m39M691J728j466p262l323j585l15O136K781
9998F1641N604M005P910J2430K0519K1317L6935N9010K8454p766k7654k4432r629
9985A88344O652J3726K5326L8253N4889Q8303J35486K13006L25471L92859K76572
9974A758887M0423j04781p5708P0887J44341Q980k08301l34961l26520k43587
9964G29660j60770j05015o5758m7141l5995k3976k0555k0540j2790q039q094j318
9952B19669J583Q09j6m011o083k152q679o907o814j1994j1143p568j1668n325
9938A39701q269p351l448J276l543o906o64m798o328j0784j0926k845j839m460
$$ y = [47337, 52274, 54210, 55571, 58871, 56970, 51704, 49532, 49253, 49927, 50477, 50455, 49728, 46651, 44950, 46779, 45920, 46401, 48880, 54265, 60200, 60695, 60256, 64947, 66675, 65209, 57947, 54624, 53039, 52724, 58860, 61641, 67245, 71250, 79160, 91590, 112109, 133426, 170361, 229371, 257825, 250059, 222405, 197973, 188344, 194996, 208722, 234048, 272301, 327190, 415493, 550979, 763985, 1089456, 1482315, 1758887, 1799310, 1694529, 1618821, 1689708, 1834049, 1843029, 1634728, 1299767, 973247, 729660, 568890, 463875, 398117, 350976, 314981, 291005, 270450, 249910, 237120, 229081, 220987, 219669, 221252, 222061, 222045, 218034, 211951, 209799, 201120, 194213, 187399, 175405, 164262, 156694, 145026, 139701, 131432, 124081, 120633, 121909, 118366, 111460, 110796, 105998, 99670, 88886, 77960, 75115, 73276, 68816]
9924F8816m734j4493j1447o549p689n720r69m620l982L222L097J565N675O911
9910B9083O017L173m634n723K49l687n192k78j680l420j067M309M476m329m384
9895A2913j683l225K21j206J290J358k645j839l492l948K174o16K144m13K88K68
9879A589Q64p63M698M908R26K238O925J0980R729J224n039j0718q897n281L104
9864A6487L595k07m474m485m284l078K220k153n28j369M04j23L619O66J166M94
9848G950k873l473r47J233M060N538N643K965j737m495l609o90l162R79P676O92
9832A5750l049K082K024o46L249r48j479k119l239J735j69k587L748O19l778O34
9816A1827K195L262N03K523K993M217j773N86M677K269M528K543R93P64K587L109
$$ y = [68816, 64082, 49589, 38142, 31593, 23904, 18184, 17215, 12595, 8613, 11835, 14932, 16497, 22172, 29083, 35100, 38273, 33639, 27916, 28165, 24478, 19286, 19008, 17328, 13908, 12841, 17150, 21626, 17297, 12913, 11230, 8005, 8226, 7020, 8310, 9668, 7023, 5184, 1692, -2256, -82, -698, 1446, 1033, 1321, 1589, 2453, 1690, 6388, 11296, 12222, 14460, 21385, 32365, 42094, 43318, 38279, 27561, 18664, 13383, 16487, 20082, 19875, 15401, 10916, 6632, 3554, 5774, 3621, 3093, 1724, 2128, 2005, 5624, 6290, 7456, 7950, 5077, 1604, 657, 1890, 5950, 11488, 17131, 20096, 18359, 13864, 10255, 9565, 6403, 7382, 15058, 15750, 12701, 14783, 16807, 16161, 19410, 18462, 16983, 14864, 11625, 13360, 13191, 10604, 14352, 14971, 11193, 11827, 14022, 17284, 17787, 20310, 23303, 27520, 25747, 26333, 31010, 33279, 37807, 40350, 41343, 42107, 44694, 47803]
9800D7803O223Q491J0068J4444J3710J9134L8300N5717O4654L7993q449m9789
9788B58299o2091n6625m1678k3437j0337r048r108j0057j196k29O33k710q63J325
9774C2878J294j277J60K911j878n352J68J261p016j736j135l380m720N44K101
9759A4823j571m814k9P94l112M2J66o65j0O32J079K061l57Q78k547l035J953N043
9741A1331M693J843j145k090l228k074L00q90k735j695n074M09j784L422L349
9726D632m57M81N77N25K259j261k770J520J995M395K236j64l250L123L253P36
9710A7830L78o34j713n039p18k72Q90N70J649J092m080k708k66J888j557j98K30
9693G342M88K663j584m03K901L37K319K7l493K987L419K340k533j053r03j024
$$ y = [47803, 54026, 62517, 72585, 87029, 100739, 119873, 158173, 213890, 278544, 316537, 308088, 258299, 196208, 139583, 97905, 74468, 64131, 55083, 45975, 35918, 34722, 34493, 35126, 32416, 31553, 32878, 34172, 32895, 33055, 35966, 34088, 28736, 28904, 30165, 23149, 21413, 20278, 16898, 12178, 12722, 14823, 13252, 8438, 8409, 9203, 6091, 6133, 6299, 5634, 5624, 6256, 7335, 9396, 9039, 9917, 7370, 4335, 6288, 11331, 16024, 17867, 16722, 14632, 11404, 9330, 9630, 8740, 6005, 4310, -764, -355, -2139, 1283, 4632, 4175, 4656, 5233, 5758, 8017, 6756, 3986, 5506, 7501, 11896, 14132, 13968, 10718, 13841, 17094, 17830, 18208, 17574, 15861, 10822, 10104, 9832, 10722, 11292, 12941, 14033, 9953, 7245, 6979, 8867, 7310, 7112, 7342, 7830, 10493, 8909, 8506, 11407, 11744, 14063, 14090, 10597, 13584, 17003, 19343, 16810, 15757, 14854, 13830]
9677A3830J031K029L830L216k542o413O29N458J593n757k971K567q28K00l327
9662A2545O66l25N154K996o53k985Q52K99N63k514j968K03n24l323L442N869m204
9645A6093m165K922o44J437l064r07k858J638O53N96J367J632J449m654l697K065
9629I863j802K077K851J332K327J361J801P33j059L503K955L849k673j589M49
9614B5978k624j425k165O02o61K343J200L625R33K074j766K76j191K391N023j810
9598C2803p95K753J954M967J254J600r59L8N69K607L140M290K349L804L952R33
9582F5259J336K528K43K42M904J159K443L413K333j602M63N637P553N111M244
9567A05266J078L924M638P434O702Q072O436n83M095J0188R060P594R276O981
$$ y = [13830, 14861, 16890, 20720, 23936, 21394, 14981, 15610, 21068, 22661, 16904, 13933, 16500, 15672, 15872, 12545, 13211, 12886, 18040, 21036, 20383, 17398, 18250, 18549, 19112, 16598, 14630, 14833, 14309, 10986, 14428, 20297, 16093, 11928, 14850, 14206, 15643, 12579, 11672, 8814, 10452, 11105, 11701, 13068, 14700, 16149, 11495, 7798, 9863, 8061, 10138, 12989, 14321, 16648, 18009, 19810, 20543, 19484, 22987, 25942, 29791, 27118, 25529, 25978, 23354, 21929, 19764, 20366, 19705, 22048, 23248, 26873, 27806, 29880, 28114, 28390, 27199, 29590, 34613, 32803, 32008, 34761, 36715, 41682, 42936, 44536, 43577, 43615, 44184, 46791, 49931, 54221, 56570, 60374, 64326, 65259, 66595, 69123, 69366, 69608, 74512, 75671, 78114, 81527, 83860, 82258, 82721, 88358, 95911, 101022, 105266, 106344, 110268, 114906, 122340, 129042, 137114, 143550, 142967, 147062, 157250, 166310, 173904, 183180, 190161]
9553A90161O637R947P902J3024J5280J5526J5847J3763J5008J3376J7707J5898
9541C50076J5993J8723J7954J6957J3001J3790J2557J5184J0199O638O007K766
9529D99845M53p81m570j0078r585j0577q673p783q885j2219j5172j5680j3238
9516C83057j4914j3205j4176j6580j7777j4591j0316r283j3694q453m452q437
9504B37179p347j1879r781o506p498j0876j0424o286l737p061o678o328p742r364
9490A25672l821l016m281o395j293j053m791k185J969j436j73m96l543m997k546
9475H7615m836j363R62J457j010j751k326j453m246n962j404k563q216m032Q4
9460E0956o14j916l444l372l776O63k875m387O29J121o62k651K65K621L245j232
$$ y = [190161, 196798, 206745, 214647, 227671, 242951, 258477, 274324, 288087, 303095, 316471, 334178, 350076, 366069, 384792, 402746, 419703, 432704, 446494, 459051, 474235, 484434, 491072, 497079, 499845, 500298, 499517, 494947, 484869, 475284, 464707, 456034, 448251, 439366, 427147, 411975, 396295, 383057, 368143, 354938, 340762, 324182, 306405, 291814, 281498, 272215, 258521, 250068, 245616, 237179, 229832, 217953, 208172, 201666, 194168, 183292, 172868, 166582, 162845, 155784, 149106, 142778, 135036, 125672, 121851, 118835, 114554, 108159, 106866, 105813, 101022, 98837, 100806, 99370, 99197, 98701, 95158, 90161, 87615, 82779, 81416, 82378, 83835, 82825, 81074, 78748, 77295, 73049, 67087, 65683, 63120, 54904, 50872, 50956, 50342, 48426, 44982, 41610, 37834, 38497, 35622, 31235, 31864, 32985, 32323, 29672, 29937, 32558, 35803, 34571]
9444C4571Q87J62j797j848j430N03L898m90p73o952j0062K070l18j001K057J833
9428B1310K455L130J046K468O077L939q22o995l451l389j575m073k433p05M1J26
9412A7149l474l10J410M773Q84m739j743j355k37J261M164P77j714J007J895k363
9396A7385R28J962K63j719k182m46L7M026L322j841j551O07r14l304l016K323
9380A5880K993J773m002M76K624M146J438k036p576o182K719L495k756k297k484
9365H211j938J048L204J43j354N9L438L270r87n73k380k408j606q4M29N54j991
9348G035q68J324P757K591L492K405k0k047n729k929M585L151K367M45L838M873
9332C2270K102J942K004K535K834M749J0220J7691K8998M7962O4369K9012j8226
$$ y = [34571, 35458, 35620, 33823, 31975, 30545, 31048, 34946, 34456, 33683, 26731, 16669, 18739, 18421, 17420, 19477, 21310, 23765, 26895, 27941, 30409, 36486, 40425, 39603, 32608, 29157, 25768, 24193, 20120, 17687, 16982, 17023, 17149, 13675, 13365, 14775, 19548, 20432, 15693, 13950, 12595, 12358, 13619, 17783, 18560, 16846, 17853, 19748, 17385, 18313, 20275, 20538, 18819, 16637, 16191, 16228, 20254, 23576, 21735, 20184, 20791, 19877, 16573, 13557, 15880, 18873, 20646, 16644, 17120, 19744, 23890, 25328, 23292, 15716, 9534, 12253, 15748, 12992, 10695, 8211, 6273, 7321, 10525, 10668, 9314, 9373, 12811, 16081, 15094, 14521, 12141, 9733, 8127, 8043, 8472, 9026, 7035, 6167, 7491, 15248, 17839, 21331, 23736, 23716, 21669, 15940, 13011, 17596, 20747, 23114, 23559, 27397, 32270, 34372, 36314, 38318, 40853, 43687, 48436, 58656, 76347, 105345, 153307, 217676, 246688, 228462]
9319B28462n0338m7204l2800k2694j7072j3489o017l052l073J056l643m07j235
9306B8494J81K37n272m856K296L751J87k291m875k207l553M01K174l165m185K054
9290I371L221k100k376L620L417J01J39l32k01L313j571k858M23Q86j573J683
9274A5163R51n791k659j614j048N14k72j90l57j512lq11j323J955J801J593j40
9257F257N64j596k807Q49K937L526j220n914n453k89L098L097J251K65m476j138
9241a049L861K862K377j338Q34j289N4k02m229K395o70L644j80m677k112M499
9225D780P76m206j228L305K650l676m25m10l160p55L32K967J816J251l112k417
9209a512o42k84K376O778j636j709r91N106P03l051J456l31l888J709L055K008
$$ y = [228462, 178124, 130920, 98120, 75426, 58354, 44865, 38848, 35796, 32723, 33779, 30136, 29729, 28494, 28675, 28912, 23640, 18784, 21080, 24831, 25018, 22727, 17852, 15645, 12092, 12493, 14667, 11502, 7317, 9371, 12592, 10492, 8116, 11736, 15153, 15254, 15393, 15061, 14860, 18173, 16602, 13744, 14167, 15053, 13480, 15163, 16114, 10323, 7664, 6050, 5002, 5516, 5244, 5054, 4697, 3185, 3182, 2371, 1048, 3003, 4804, 6397, 6257, 6821, 5225, 2418, 3267, 6204, 9730, 8510, 2596, -2857, -3146, -48, 3049, 4300, 4565, 89, -1049, 2812, 5674, 8051, 6713, 7547, 6258, 6312, 6110, 1881, 4276, 3606, 7250, 7070, 2393, 281, 4780, 5556, 1350, 122, 3427, 6077, 2401, 1976, 1566, -1594, -2349, -2017, 950, 2766, 4017, 905, -1512, -2154, -2438, -62, 6716, 5080, 3371, 2380, 7486, 8189, 5138, 6594, 6263, 2375, 4084, 7139, 9147]
9193I147K523j459o414r94j775K320J29J287J463J00J454R60k835n884j570M00
9177a148K503J856k786j262N55J796O62Q84L233l64n183L706L444O34k84n24k853
9160D869J814J429r43J238P71P58q60m408m524j939O627O788Q98N61j932N84k926
9143H805q74J833k085l109n60L891k33k906n657N323K236R22M183K920k695k416
9127I578m64k404K557O872r65l087M85K64l265K63M495o08o444l984k723K58k122
9110a294k664M274P740m29j921Q51l64k42k016k99J94L911J73j189o3J904k473
9093F093j877j510K837P51j1k534p15j527K515k507j702J198n58K1L878O02K418
9076G372O448j071j754k98l763O07l12l480n511k199L750O052M07j239j293j234
$$ y = [9147, 11670, 10211, 3797, 2803, 1028, 3348, 3477, 4764, 6227, 6327, 7781, 8741, 5906, 22, -1548, -1148, 1355, 3211, 425, -837, -282, 1514, 2176, 3060, 6293, 5929, 746, 4452, 7896, 8530, 8246, 7722, 4869, 6683, 8112, 7169, 8407, 9178, 9936, 9076, 4668, 144, -1795, 4832, 11620, 12518, 13079, 11147, 11731, 8805, 7931, 9764, 7679, 4570, 4010, 7901, 7668, 4762, -895, 4428, 6664, 7586, 11769, 14689, 11994, 9578, 9114, 6710, 9267, 16139, 15174, 12087, 12572, 12836, 9571, 9834, 14329, 13721, 7277, 3293, 570, 828, -1294, -3958, 316, 8056, 7627, 5706, 6557, 6193, 5951, 3935, 3636, 3830, 7741, 7914, 6725, 6662, 8566, 6093, 4216, 2706, 5543, 6294, 6283, 3749, 3034, 1507, 4022, 1515, -187, 1011, 453, 474, 4352, 4954, 7372, 13820, 12749, 10995, 10697, 6934, 7541, 7229, 3749, -1762, -3961, -211, 5841, 6248, 5009, 3716, 2482]
9060B482k07j593L372J34r1k564r54L81Q53j41J023M84J493l767j354k21j21J050
9042B59J208k023m68j877K257L31J056J035J492Q65k095N951L857R8n180n654
9026A112n465j785l23O517L107j186k511K475K760K74k270l332l67Q24L563p80
9010B613l758M5J335j85l84j855l15K482q48j842K705J255k752L845K141n936
8994a454l373q12N137L278O3k004l304L769M525p50K398j66p14L62N15J215P91
8977I476R71K278n215l475n25k131j515k484K060J437m20J989r28k292r5J836
8961I67R53l27l8J136K843K832o02l584L763K515J80K009m440j807J620J210q14
8944H416m188K162J183j076j086K415L024q91O7l780L71J521Q87J405L937j686
$$ y = [2482, 2275, 682, 4054, 4188, 4097, 1533, 579, 960, 1813, 1672, 2695, 3179, 4672, 905, -449, -670, -791, 259, 1467, -556, -1024, -2901, -644, -313, 743, 1778, 3270, 4135, 2040, 7991, 11848, 11946, 6766, 1112, -4353, -6138, -6461, 56, 3163, 1977, -534, 1941, 4701, 4975, 2705, -627, -994, -170, 3393, 2613, -1145, -1100, 235, 50, -334, -2189, -2504, -22, -870, -2712, -7, 1248, -1504, 2341, 4482, -1454, -4827, -5639, -502, 2776, 2839, 835, -2469, 1300, 5825, 5075, 7473, 7307, 6593, 6955, 7470, 8685, 9476, 10447, 12725, 7510, 4035, 3510, 1379, -136, -2620, -560, 877, 457, 2446, 1518, -774, -869, 967, 1920, 1593, 1555, 2691, 5534, 8366, 7764, 4180, 7943, 10458, 10638, 12647, 8207, 6400, 8020, 9230, 8416, 4228, 6390, 7573, 6497, 5411, 7826, 10850, 9959, 10026, 6246, 6617, 8138, 9025, 10430, 14367, 12681]
8928A2681q09J078K37l123k361J995j166l200K676M784M261l091k417j531K082
8913A2096J820o112r1M412J599k510m26J302J032j593k324k138j949j740Q6q16
8897B648R01k305k731L307J774L039K994j82l462J341J033L026k538m65k437N414
8881A1357J344j504m556n68j753k03J518L061k209k182j072j492K183K793L28
8866G045j523k78K821N21O52J238J455L493K8j551k770n180J021J916K91P69l41
8849I607l319k79K489k825k552N28k159J70j551K234j34J116N561Q04j03J22J732
8832A1441M838j380L09j949M136J2169J2705R182J2697K0326K8518J3328m464
8819A21856j4846k4120j8227j1108j0187n385p406p211J031l60J079j454k438
$$ y = [12681, 11872, 12950, 13187, 10064, 7703, 9698, 8532, 5332, 8008, 12792, 17053, 13962, 11545, 10014, 12096, 13916, 7804, 7713, 12125, 13724, 11214, 10788, 12090, 13122, 11529, 9205, 7067, 5118, 3378, 3464, 2648, 3549, 1244, -1487, 1820, 3594, 6633, 9627, 9445, 5983, 7324, 8357, 11383, 8845, 8380, 5943, 11357, 12701, 11197, 6641, 6073, 4320, 4117, 5635, 8696, 6487, 4305, 3233, 1741, 3924, 6717, 7045, 5522, 5244, 8065, 8586, 9238, 10476, 11931, 15424, 15452, 13901, 11131, 5951, 6972, 8888, 9179, 9948, 9607, 6288, 6009, 8498, 5673, 3121, 3649, 1490, 1660, 109, 2343, 2209, 3325, 8886, 9690, 9587, 9709, 11441, 16279, 14899, 15208, 13259, 17395, 29564, 42269, 51451, 64148, 84474, 112992, 126320, 121856, 107010, 82890, 64663, 53555, 43368, 37983, 30577, 23366, 24397, 24037, 25116, 23662, 21224]
8806B1224L286j621l621R31n21j468O08j356m06k018j32L036J184M25n28k828
8790A6195o412k573K931K890J869m75k725l430l773o75m02j052K02o40o42L616
8774D904L47j007N74M059o3j267k027O34j052J389K176J813K16J663K943n880
8758I422r39J989J791j738J503J10O09k949L42j205N06P68r60n513j787K414M135
8741H498J235k830k106J114K894K916L610Q32l876l306K577J914j152j244K156
8726A3232J851k6q46J657J426k415K526J1677N347j560l602m103q39j100l578
8711A9647k375K084k847k780k196R89j02K591O188J180r620j448J690K104O645
8696B1750J15o36j295l453P3Q65j404l801k603K245L802N456K248k828q34J036
$$ y = [21224, 24510, 22889, 19268, 20199, 19678, 18210, 18818, 17462, 17056, 15038, 14906, 17942, 19126, 19551, 19023, 16195, 9783, 7210, 10141, 13031, 14900, 14425, 11700, 8270, 4497, 3822, 3420, 2368, 2570, 1930, 1288, 4904, 5251, 4244, 4818, 8877, 8814, 7547, 5520, 6154, 5102, 6491, 8667, 10480, 10696, 12359, 15302, 9422, 8483, 10472, 12263, 10525, 12028, 12138, 12747, 9798, 10140, 8935, 9441, 10209, 9249, 3736, 1949, 4363, 8498, 9733, 6903, 4797, 5911, 8805, 11721, 15331, 16163, 12287, 8981, 11558, 13472, 12320, 11076, 13232, 15083, 15057, 14211, 15868, 17294, 14879, 17405, 29082, 34429, 32869, 29267, 25164, 24325, 23225, 19647, 17272, 19356, 16509, 13729, 11533, 12522, 12420, 15011, 21199, 22379, 12759, 11311, 13001, 15105, 21750, 21865, 21229, 19934, 16481, 16554, 17419, 16015, 12214, 9611, 11856, 15658, 21114, 23362, 20534, 19700, 20736]
8680B0736K756J667M170N865k931l807N584M646l84l837k940J07l740j228J259
8665B7923k298l744m094L790J111K428K382j997j066M600p11j904O46l67P29n8
8649B7370m16k393N311L041l167l847J7j42L766j488l44L845L627r09j081j440
8633C1750K072J025L362M287k181k073K754j832j756k399j753j937L815M253K23
8618C9610Q26R82J472j602J639k434j19k363j89L797K282L441O38n159N352J523
8602D9696P60M006R401K355J586P42M281J2071J9515K1603J6015J106r677j4888
8588A18572j6807n057k394m201n850p912J3N573L358Q37R71l43N81j67M55R39
8572H8568K762L20J379N187O246N137L871O776R916P831P639J0636N702N893J2708
$$ y = [20736, 23492, 25159, 29329, 35194, 32263, 28456, 34040, 38686, 38302, 34465, 31525, 31632, 27892, 26664, 27923, 25625, 21881, 17787, 21577, 22688, 25116, 27498, 25501, 24435, 29035, 28324, 26420, 27066, 26699, 27428, 27370, 26954, 24561, 29872, 32913, 29746, 25899, 25916, 25774, 29540, 28052, 27708, 31553, 35180, 34271, 33190, 31750, 33822, 34847, 38209, 42496, 40315, 38242, 40996, 39164, 37408, 35009, 33256, 31319, 35134, 39387, 39610, 40436, 41418, 42890, 41288, 42927, 40493, 40374, 38011, 37822, 41619, 43901, 47342, 47980, 42821, 48173, 49696, 50456, 54462, 63863, 66218, 67804, 68546, 72827, 84898, 104413, 126016, 142031, 143137, 133460, 118572, 101765, 96708, 94314, 90113, 84263, 76351, 76364, 81937, 85295, 86132, 87103, 86760, 87341, 87174, 87629, 88568, 91330, 91650, 93029, 98216, 104462, 109599, 113470, 120246, 130162, 137993, 145632, 156268, 161970, 167863, 180571]
8557A80571J7295J5280J6684J4126J6904K2055K8003L1479L5087M9857M8334J2470
8545D88145k3910m7465m8676l8793l3493k6647k4106k1649k0277j7169j1491j0878
8533A63591q103j679j898k053n960o042n095n805k707n12O489P492L405Q64N281
8518A47268J3460J7833K0949K6936M0956N9654R3566J51514K32666K91615J92189
8507A288606k4609k01784k54364k03763j31070p6170m9641m2933m4870l1203k1853
8496B06346j7635j1519o282o024r589n133n355l992O82p22l06J720k98m474K142
8481A39561N196L63M971Q234L372O855J2731J9574K8323L7955M9329P0094R5204
8468D81762J47774K37300L90147N80035N42405J20512l09177n21318m76239l38117
$$ y = [180571, 197866, 213146, 229830, 243956, 260860, 282915, 310918, 342397, 377484, 427341, 475675, 488145, 464235, 416770, 368094, 329301, 295808, 269161, 245055, 223406, 203129, 185960, 174469, 163591, 155488, 153809, 151911, 149858, 143898, 137856, 132761, 126956, 124249, 123737, 130226, 137718, 141123, 141987, 147268, 160728, 178561, 199510, 226446, 267402, 327056, 420622, 572136, 804802, 1096417, 1288606, 1263997, 1062213, 807849, 604086, 473016, 396846, 347205, 304272, 259402, 228199, 206346, 188711, 177192, 170910, 164886, 155297, 150164, 144809, 140817, 141499, 140777, 140471, 142191, 141893, 137419, 139561, 144757, 145120, 150091, 158325, 161697, 168552, 181283, 200857, 229180, 267135, 316464, 386558, 481762, 629536, 866836, 1256983, 1837018, 2379423, 2499935, 2190758, 1669440, 1193201, 855084]
8458H55084k19216j34331r0348n9620l9947l3392k5165k0779j3075m619l033j0220
8446B01339j1295n563k681o854j965j585K152m607o598o108p39J91l801k822m896
8431A44168q72K272O244J3824K2698K6485L9860N8703R0719J49767K35313K73594
8419A062775J53092n8933k11875k44546j95075j32929q2987n6173l7186k6020
8409A70143j6807j2969r100q679m604m757p608k656j943k405m145k125m230k196
8395H5919m122l939l939q92j797l634o092j705l177o186n292r5M541j11l144j13
8379D6222M055p838p483k190L72m315j950o65k735L45k032m88L834R59R8j588
8363B4601o73J988J642m352j854j247r08J233J694m705r22oq20J509O40k987j697
$$ y = [855084, 635868, 501537, 411189, 351569, 311622, 278230, 253065, 232286, 219211, 214592, 211559, 201339, 190044, 184481, 181800, 174946, 172981, 171396, 173548, 168941, 162343, 156235, 155496, 155687, 151886, 149064, 144168, 143296, 145568, 151812, 165636, 188334, 214819, 254679, 313382, 404101, 553868, 789181, 1062775, 1215867, 1156934, 945059, 700513, 505438, 372509, 289522, 233349, 196163, 170143, 153336, 140367, 131267, 122588, 117984, 113227, 105619, 102963, 101020, 98615, 94470, 92345, 88115, 85919, 81797, 77858, 73919, 73027, 71230, 67596, 61504, 59799, 56622, 50436, 45144, 45049, 49590, 49479, 46335, 46222, 50277, 42439, 34956, 32766, 33138, 28823, 26873, 26208, 23473, 23818, 21786, 21298, 25132, 26091, 26189, 24601, 23928, 25916, 27558, 23206, 21352, 20105, 19197, 20430, 22124, 17419, 16497, 16491, 15671, 17180, 17820, 14833, 13136]
8346A3136j198K469j654K688j674n206J54k52m269P772L374M30j715j22l07j524
8330A2102j742l42r28k862j070L487M331M426K608k448k682n441J33L411j395
8315A1588m709l402r15J785K07m9L73j53J194j499k106j488K505L008K798L482
8299A2619M21P65K334J564Q65K613k232n253k111K798k73k358j861J310L367N63
8283A5131J25K208L479N190Q290N043j547q289n750m342n771j632K26J696K771
8268A6828P12l977m573k828j506J772J376k061l729j404k09L414K757M89n4k297
8252D710L678K339p84m319l226Q9J304M744M496L853P25j927p69k668O111O612
8236B4968O230O185P228J0476m51m341j0228o442q295n348N02J047n32j226n154
$$ y = [13136, 11938, 14407, 12753, 15441, 13767, 8561, 8715, 8463, 4194, 11966, 15340, 15770, 14055, 13933, 13626, 12102, 10360, 10018, 9090, 6228, 5158, 8645, 12976, 17402, 20010, 17562, 14880, 9439, 9572, 12983, 11588, 6879, 3477, 2562, 4347, 4554, 4505, 4878, 4725, 5919, 4420, 2314, 826, 3331, 6339, 9137, 12619, 13040, 13805, 16139, 17703, 18568, 21181, 18949, 13696, 11585, 14383, 14110, 11752, 9891, 11201, 14568, 15131, 15256, 17464, 20943, 26133, 34423, 39466, 37919, 29630, 23880, 19538, 13767, 12135, 12361, 14057, 16828, 17540, 13563, 8990, 6162, 4656, 6428, 7804, 5743, 2014, 610, 401, 3815, 6572, 7061, 7007, 4710, 8388, 10727, 9943, 5624, 2398, 2487, 3791, 8535, 13031, 16884, 17609, 15682, 14913, 12245, 18356, 24968, 31198, 37383, 44611, 55087, 54636, 50295, 40067, 33625, 25330, 19982, 20484, 21531, 20999, 19773, 14619]
8221A4619m902O59L715K222j647L261p61l711L193K64l219j843L67J495Q15k504
8205A2023j568J775p17r32J665o53m965k719l266K956N156K680J180J309p54J750
8189A4920M328L017P132Q471Q15n362q373o613j998M08L36k052O19k805Q2j360
8173A1565n660J41K212k743l6L422M420o38j100J47P17L53L212m151p465j817
8157B579L671O206J690j324k548r41l381M77K380R82j822q42N890J694K777k520
8141A4968l858l708K255O6J274l663P22J983J842m094J4J739J942J156l104k063
8125G471k002J735P22j875Q91K152K014R37j667k191J809k134j715J176J29K281
8109I733M018k83k61Q54k147L00n00J635j336j606R77J68j694m704m81J682K298
$$ y = [14619, 9717, 10376, 14091, 16313, 14666, 17927, 17166, 13455, 16648, 16912, 13693, 11850, 12217, 13712, 14527, 12023, 10455, 12230, 11513, 10581, 12246, 11593, 6628, 3909, 643, 3599, 8755, 11435, 12615, 13924, 13170, 14920, 19248, 22265, 29397, 37868, 38683, 33321, 24948, 18335, 16337, 16745, 17081, 15029, 15648, 12843, 12925, 11565, 5905, 6046, 8258, 5515, 5479, 8901, 13321, 12683, 11583, 11730, 12447, 12800, 16012, 11861, 4396, 2579, 6250, 12456, 14146, 12822, 10274, 9333, 5952, 6429, 8809, 9791, 7969, 7127, 13017, 14711, 17488, 14968, 11110, 7402, 9657, 9723, 10997, 7334, 8056, 10039, 11881, 7787, 7801, 9540, 11482, 12638, 9534, 7471, 5469, 7204, 7926, 6051, 6942, 9094, 11108, 12045, 10378, 8187, 9996, 7862, 6147, 7323, 7452, 9733, 13751, 13468, 13207, 14061, 11914, 12214, 11714, 13349, 12013, 10407, 11384, 11552, 9858, 5154, 4673, 6355, 8653]
8092H653j083j423m030j996J587O28K635m299l574K194L583J150j222P6L758O627
8076A3264M667j621m420k521K998K545o907j810L178R17j434L780Q403M636k809
8061B2866o150k962Q47J384k300l889m750k743L319L334J456J068m05J730l078
8046I727m086n6K687K020q92j930m184K954L476J380k946m61J352o41j085r64
8030F351L335Q06m34j991J601Q66J327K835K237J992K675K82p03J153P47j464
8014B1615l619O46N00j975k535j81M73L38J918L947k046r79M959K883J275K7R80
7997B8226O9K133N08K877N245l542n77L685O73k740j068n64j388q35j347j55J605
7980C2805R26J405m932j7k16K154O597n10n280k517n67L0K167J879J969O98K526
$$ y = [8653, 7570, 6147, 2117, 121, 1708, 2336, 4971, 672, -2902, -708, 2875, 4025, 2803, 2879, 6637, 13264, 17931, 16310, 11890, 9369, 12367, 14912, 8005, 6195, 9373, 10290, 8856, 12636, 21039, 25675, 22866, 16716, 13754, 14601, 15985, 13685, 9796, 5046, 2303, 5622, 8956, 10412, 11480, 11075, 12805, 9727, 5641, 5585, 8272, 10292, 9400, 7470, 3286, 6240, 9716, 11096, 8150, 7689, 9041, 8400, 7315, 6351, 9686, 10492, 10058, 8067, 9668, 10534, 11861, 14696, 16933, 18925, 21600, 21882, 21179, 22332, 23079, 21615, 17996, 18642, 19142, 17167, 14632, 14451, 14924, 15262, 17180, 21127, 19081, 18102, 23061, 25944, 27219, 27246, 28226, 28295, 30428, 30936, 33813, 39058, 35516, 34939, 38624, 39297, 36557, 35489, 34925, 33537, 32702, 31355, 31200, 32805, 33731, 35136, 30204, 30187, 29971, 32125, 38722, 38212, 32932, 30415, 29848, 29878, 32045, 33924, 35893, 36591, 39117]
7963C9117k686J133N551M774K75N6K119K062M30N920N931L633M128K058L485J110
7947G9096L552o425m059m901j970k642k163n210k726l286l254q32j440K469K874
7932D9083j797m127J435L603j868J387R40m39q42L125N100o84J446j881L115P197
7916F4793L586k774P02j408K663L854j309N175K644P77j446K337J794k668j562
7901G7158m181n118n557l172k606J177L558l024k97l148q662m708N9k940r63M21
7885C7997R52J443j679Q69M600R22K687N635L349k066j104P3j392O77K474k91
7869E5146J614L118l550o551j014N70j456k55l149l405m53k0r02o41k822R41j419
7852C5752o98m57k894n133j250M9m039k412N273Q144j653m962L219m63o240l831
$$ y = [39117, 36431, 37564, 43115, 47889, 48164, 48220, 50339, 52401, 52831, 58751, 64682, 68315, 72443, 74501, 77986, 79096, 82648, 76223, 72164, 67263, 65293, 62651, 60488, 55278, 52552, 49266, 46012, 45180, 43740, 46209, 49083, 47286, 43159, 44594, 48197, 46329, 47716, 48656, 48217, 47375, 50500, 55600, 54916, 56362, 54481, 57596, 64793, 68379, 65605, 66307, 64899, 67562, 71416, 70107, 75282, 77926, 78703, 77257, 79594, 81388, 78720, 77158, 72977, 67859, 62302, 59130, 56524, 57701, 61259, 58235, 57938, 54790, 46128, 41420, 41479, 38539, 37576, 37997, 38949, 40392, 38713, 39582, 44182, 45104, 47791, 53426, 56775, 54709, 53605, 53678, 52286, 52963, 55437, 55146, 56760, 59878, 56328, 49777, 48763, 49333, 47877, 47622, 44473, 41068, 40615, 40595, 39693, 39052, 36230, 37171, 35752, 35054, 34597, 31703, 26570, 25320, 25369, 21330, 18918, 24191, 32335, 30682, 25720, 28939, 28476, 22236, 18405]
7836A8405K23q50k601K031N195N26J991M53m767l168K744K082j202l243k425L784
7820A9178j838l850RO61K427K106k404l076m17Q59K317J073l740j601j441J62
7804A0425O67n778l041j986K43K302M05J010J015k504K043J035N89K175l095r15
7788D590L997r78l819j319J159l173J022n451k941K652N123K687L933l92k330
7773D760o278k879O74J960K03K612J300j525q6N58N61K335n72J329K284j90o209
7756H37m77K284J305o70L590R57m389j624j2l534K274L104k591n300J474L227
7740D55J293l068j998N825N868o955l401O81o69J924k519R41L415J506O28j214
7724B712j694O63J282l619j466n68J840R38j852j093k598J923M963N84m382n080
$$ y = [18405, 18628, 17778, 15177, 17208, 22403, 22929, 24920, 25373, 20606, 17438, 20182, 22264, 21062, 17819, 15394, 19178, 17340, 13490, 13499, 14160, 16587, 18693, 16289, 13213, 12796, 13655, 15972, 17045, 13305, 11704, 10263, 10425, 11092, 5314, 2273, 287, 530, 2832, 3237, 4247, 5262, 2758, 4801, 5836, 6425, 8600, 5505, 4590, 8587, 7609, 3790, 2471, 3630, 457, 1479, -3972, -6913, -4261, 862, 3549, 7482, 7090, 4760, -1518, -4397, -3723, -1763, -1560, 1052, 2352, 827, 741, 1299, 1860, 4195, 3623, 4952, 7236, 7046, 837, 360, 2644, 3949, 3279, 6869, 7826, 3437, 1813, 1801, -1733, 541, 3645, 1054, -4246, -2772, 455, 1748, -1320, -3318, 2507, 8375, 1420, -1981, -1300, -1969, -45, -2564, -1623, 1792, 3298, 3926, 2712, 1018, 1681, 2963, -656, -2122, -2690, -850, 88, -1764, -2857, -5455, -3532, 1431, 2015, -2367, -7447]
7708g447k915K738L958L970Q10m197n076m35M010l622j619L535Q180Q118r0l556
7692F362o503j493j97M811M582p65J470m062m251l626q86j733pJ383L465o9J449
7675g0j129l011k956m433P27M434L121L334j099l483K74J238K52l582k891L477
7659e797J732k197l72l294r67N440M637j783j301P86l854j191K185p00K227K542
7643a907M405j638k155P04j459j085J012K017l397n423L139K331k123J412R89
7628c178J629j047r77J072K698k930K629L540M11j287n927l608m54L870P149J621
7612E211r43n457j808l087k856o31K42q22K450O381L669M41p73l375o039L148
7596d249k95k564l763J19J002O48J414L76J982j129l056K323L842P24J890m152
$$ y = [-7447, -10362, -7624, -3666, 304, 1114, -3083, -8159, -8594, -4584, -8206, -9825, -6290, 1890, 10008, 9918, 6362, -141, -1634, -1831, 2980, 7562, 6797, 8267, 4205, -46, -3672, -4558, -6291, -6298, -4915, -1450, -1519, -70, -1199, -4210, -7166, -11599, -10872, -6438, -3317, 17, -1082, -4565, -4291, -3053, -2801, -6383, -9274, -5797, -4065, -6262, -6634, -9928, -10895, -5455, -818, -2601, -3902, -3116, -6970, -8161, -5976, -6676, -4449, -1907, 2498, 860, -1295, -591, -2050, -3135, -2123, -106, -3503, -8926, -5787, -3456, -5579, -4167, -3178, -1549, -2596, -3573, -2501, 197, -2733, -104, 3436, 3847, 2560, -3367, -6975, -7429, -3559, 3590, 5211, 4268, -1189, -2997, -6084, -8940, -9571, -9329, -10151, -7701, -1320, 2349, 2790, 2017, -1358, -7397, -4249, -4544, -7108, -10871, -10752, -9750, -9102, -7688, -7312, -5330, -6459, -9515, -7192, -3350, -2626, -736, -4888]
7580d888q63q31m95L153K968J117m695J041j326k933K633K975P36m834n258L972
7564g528N988L702k404j721j067j991r07J40J028J252j66j088M060J638J654K022
7548D612n564j105j208j592j377k44K175Q09j480Q26L23j865L66K33J491j653
7532e253j273L785K495Jj772j803l75J106l58k77J68l69q28P77k627J03M876R44
7514f80j117k418j007L45Q62m80J491J444Q11J928j734l875O71L02N38K419m780
7497e280l966K553m86k075M602O926j908m128j951j611j780O25n38K039M173o25
7481c430l805L26n144L192K512j072L462M088N09k607L72L17l721O49J018J198
7465b136k945L21l63K27m993l037L295K696N36K07j55n270K314L810N16k460l02
$$ y = [-4888, -5751, -6582, -7077, -3924, -956, 161, -4534, -3493, -4819, -7752, -5119, -2144, -1408, -6242, -11500, -7528, -1540, 2162, -242, -1963, -3030, -5021, -5928, -5788, -4760, -3508, -3674, -4762, -702, 936, 2590, 4612, -952, -2057, -3265, -4857, -6234, -6478, -4303, -3494, -4974, -4148, -3825, -5690, -5324, -5091, -3600, -5253, -6526, -2741, -246, -245, -2017, -3820, -4195, -3089, -3447, -3724, -3556, -3925, -4753, -3976, -6603, -6500, -1624, -680, -1797, -4215, -5222, -4877, -4015, -4495, -3004, -1560, -749, 1179, -555, -4430, -3759, -3457, -2919, -500, -5280, -9246, -6693, -7179, -9254, -4652, 2274, 366, -3762, -5713, -7324, -9104, -8479, -9017, -6978, -2805, -3430, -7235, -6909, -12053, -8861, -6349, -7421, -3959, 129, 638, -1969, -1597, -1280, -5001, -4352, -3334, -2136, -5081, -4760, -5123, -4896, -9889, -12926, -9631, -6935, -6399, -6192, -6347, -11617, -9303, -5493, -4977, -7437, -7739]
7448g739J222L136K095O2j276o9P54N2l203L09R67K283M34m69k08l104J36K512
7430b106l92l271k071l139j6M739L51l20J646L243K883n279n270M070Q868n08
7414C428l677J98J470j851K188Q40j933m753l042P99J932K721L428j694l786p30
7398d462J727r32k115K023L85Q0m77r18k901o66J654J519J801R26m995l372R95
7381i728k77O08k11K633l224j856L276P842Q63N12J83M79l448q47k9j232j028
7364e484N23K532K049k26N07m657r9L67K544J336J61l382l176K024P81r10M65
7347d645j816k541J993L367k94o0r49K084k356k49J174o84J223J50L7J478j103
7330c191o4J350j05K052L77M31J075j176r73N8K992p09m748l639N03n66j808M740
$$ y = [-7739, -6517, -3381, -1286, -1224, -2500, -2569, -1815, -1763, -4966, -4657, -3690, -1407, -973, -1442, -1650, -4754, -4618, -2106, -2498, -5769, -7840, -10979, -10995, -6256, -5905, -6225, -4579, -1336, 1547, -3732, -9002, -4932, 3936, 3428, -249, -51, 1419, -432, 1756, 2596, 663, -4090, -7132, -6333, -4401, -1680, 1748, 54, -3732, -4462, -2735, -3667, -5782, -3759, -3374, -3294, -3771, -4689, -7590, -8256, -6602, -5083, -3282, -2356, -7351, -10723, -9728, -10005, -9397, -9608, -6975, -10199, -12055, -8779, -937, -74, 438, 621, 1100, -2348, -3195, -3224, -4456, -5484, -4961, -2429, -380, -606, -99, -4756, -4855, -4488, -1944, -608, -447, -3829, -7005, -4981, -4200, -5110, -4645, -6461, -9002, -7009, -3642, -3936, -3996, -4945, -2861, -5217, -5466, -4292, -4976, -3753, -3603, -3566, -2088, -3191, -3255, -1905, -2010, 42, 419, 850, 1925, 749, -224, -166, 2826, 2117, -2631, -6270, -5767, -6333, -8141, -3401]
7312c401J831q85l017J795J688k640m470J646L514Q32J846J45J680l229o560j989
7296a1214N153N450N256M45k922n884o744n154O79L581N282J1960J3455K860j1907
7281A0296r937k778J0840J6483N576p117r134j5347r526L869O011M69l9l545n394
7266i273p089l446k620J277K549n59P553M328K752O28P86L6N4J024k912k811J96
7249g527K33J175K01L21J24K527J025k268j422J615k55k890j174j02L836J769
7233b812k959l412J368P54L956j978j132M351J30j874j707J146o37k14N85L552
7217h83N488p77k851n046J21J176l6p83l165K282L201K234K550M56L51k081j326
7200I11l747k885L904k240j538L71J177O69j604J102j146p07j991k694j249M061
$$ y = [-3401, -1570, -2455, -5472, -3677, -1989, -4629, -9099, -7453, -3939, -3107, -1261, -1116, 564, -2665, -9225, -11214, -6061, -611, 4645, 5090, 2168, -3716, -10460, -15614, -14935, -11354, -6072, 5888, 19343, 22203, 10296, 359, -2419, 8421, 24904, 30480, 23363, 14229, -1118, -10644, -6775, -764, -295, -334, -3879, -9273, -16362, -19808, -22428, -21151, -18602, -19161, -11608, -7280, -4528, -3900, -3114, -3078, -3024, -2000, -4912, -7723, -7527, -7294, -6119, -5918, -5597, -5473, -2946, -1921, -4189, -5611, -3996, -4251, -7141, -8315, -8417, -4581, -2812, -5771, -9183, -7815, -7061, -3105, -5083, -6215, -1864, -1734, -3608, -5315, -4169, -4806, -5020, -4435, -883, 4605, 3828, 977, -4069, -3948, -2772, -2808, -3591, -6756, -4474, -1273, 961, 3511, 3967, 4318, 2237, 911, -2836, -5721, -1817, -4057, -5595, -5224, -4047, -3378, -4982, -3880, -5026, -5733, -7724, -10418, -11667, -7606]
7184g606J416N909N218k698j890n251L503M207k470m408R25K835M67j509j110
7169b462J234J566J182j995N66j948m64K548M856n485k6R56K045j432l844n745
7153h448k746Q74p4m09k34M190L707Q93k79j463p64k178J346k04Q69L401q92j551
7135c962J849N020L898j441j695k597j203k851J249j133J44K178l480n714K903
7120f835L524m403m58l27N18J852J511q63J319N57J360j158j846K83L500j097
7104b563j477P89K937n026j676k03L412M150p50L17k670o37o00l414N63j184m47
7087h479K930M621k390j811j2J991k834L71K005O26k41j70r22M18K835k496k787
7070f345k329K68J59K720K561l067K154M856O47j252k947N0j699j885k820K126
$$ y = [-7606, -6190, -281, 4937, 2239, 349, -4902, -1399, 2808, 338, -4070, -3145, -310, 157, -1352, -2462, -1228, 338, 1520, -475, 91, -1857, -2321, 227, 5083, -402, -428, 528, 2573, 1141, -2703, -8448, -11194, -10320, -10394, -10803, -11037, -6847, -3140, -2247, -2526, -3989, -4753, -6931, -5585, -5789, -4920, -1519, -2411, -3962, -2113, 2907, 6805, 5364, 3669, 1072, -131, -2982, -1733, -2866, -2722, -544, -4024, -9738, -6835, -3311, -7714, -8172, -8499, -7981, -6129, -4618, -5481, -4162, -3605, -2245, -3403, -5249, -4966, -1466, -2563, -4040, -3251, -314, -5340, -7016, -7219, -3807, 343, -407, -90, -2760, -3397, -3997, -7411, -6848, -8032, -8479, -5549, -928, -3318, -5129, -5141, -3150, -5984, -5613, -3608, -2982, -3223, -3393, -4315, -3897, -1062, -3558, -6345, -8674, -8406, -8247, -5527, -2966, -6033, -3879, 977, 1624, 372, -2575, -2525, -4224, -6109, -8929, -6803]
7054f803L67j018M073J614K248J34k679l170j992J934N296K13k374l228o19M73
7038e531M240M92K819J457j482m735j548p87j72L679J045m806j481Q76M51n80
7022f063J833L841K079k434m799J775j737L56L875j317j853J734k490J94O39j590
7006e957M371l199n729O12K187K696J092j927J515j02k434R13n0j131Q67J053
6990e223K791j302o81J021q36j189j7R62L609P11J174K759N38r84J737l177m580
6973b687J94L012L384L659K600K194l625n672j945r35j356j09L60l822K89l697
6957h156L27j698k724J890R20M103r23Q43M466l512k593j822J606J55M707J136
6941a275k118r32K495L651m464l951M01L684J248N635J229j138j143j891j256
$$ y = [-6803, -6436, -7454, -3381, -1767, 481, 615, -2064, -5234, -7226, -5292, 4, 217, -2157, -5385, -6004, -5531, -1291, -799, 2020, 3477, 1995, -2740, -4288, -5075, -5247, -1568, -523, -5329, -6810, -5934, -5483, -6063, -4230, -389, 1690, -744, -5543, -3768, -5505, -5149, -1274, -2591, -4444, -2710, -5200, -5006, -4367, -5957, -1586, -4785, -10514, -9902, -7715, -5019, -3927, -5854, -4339, -4441, -6875, -5962, -6012, -7143, -6276, -5223, -2432, -3734, -4415, -3394, -4230, -5419, -5436, -4474, -865, -154, 1020, 3779, 4317, 3333, 5070, 1893, -2687, -2493, 519, 3903, 7562, 10162, 12356, 8731, 3059, 1114, 179, -1177, -1286, -926, -4748, -4459, -8156, -7829, -9527, -12251, -10361, -9441, -5338, -6261, -5418, -952, -4464, -7057, -8879, -7273, -7118, -2411, -1275, -3393, -4325, -1830, 1821, -2643, -6594, -6193, -2509, -1261, 4374, 5603, 4465, 3322, 1431, 175]
6926A75l320j059J521l15j907J33r87P72J359R85j093M184N053J13k920j550q80
6909B64k458j868J96k088K547R65o863Q53L159R10R66J053j442j648k130l094
6893a0678L541M585j121m570j144l75J884J950k899J223N475J438j240l783J560
6878d154J011k228j968M196O244J156N899K588Q83j269k891j995J628l649j92
6863E259J888N77k597j669K3n305J224L829L280K013k110o63k925P6M239l672
6847C467k107M338Q17K859J615K525j885m425M705R704N390O948R244J5092K8827
6832H7114M4980O5796N1080q33m9742o0322m7652k6562j4692o706m761j857J6
6819C5859j394Q80m053n69L133P470J3479J5869K6270M2800O9673O0117K74m2268
$$ y = [175, -3145, -4204, -2683, -2998, -4905, -4772, -5759, -4987, -3628, -2643, -3736, 448, 5501, 5614, 2694, 1144, 264, -2194, -4062, -3866, -5954, -3407, -2442, -9305, -8452, -5293, -4383, -3417, -2364, -3806, -5454, -7584, -10678, -7137, -2552, -3673, -8243, -9387, -9762, -7878, -5928, -8827, -7604, -2129, -691, -1931, -5714, -4154, -3143, -5371, -7339, -3143, 3101, 4257, 10156, 12744, 13627, 12358, 9467, 7472, 9100, 5451, 5259, 7147, 7724, 5127, 3458, 3481, -1824, -600, 3229, 6509, 8522, 6412, 5749, 2824, 2900, 7139, 3467, 1360, 5698, 6515, 9374, 10989, 13514, 11629, 7204, 11909, 21613, 27003, 33951, 43195, 58287, 87114, 132094, 197890, 248970, 248137, 198395, 138073, 90421, 63859, 49167, 42461, 37700, 35843, 35859, 34465, 35345, 31292, 30723, 33856, 41326, 54805, 70674, 96944, 139744, 209417, 269534, 269808, 227540]
6805B27540n7292n1781l3659j9819r490o102L358L586K094R35O001J299n979n212
6791E5479m022q308l098k829k425j970j381R0j374k897j359m146j942R19l951
6776A6786o589M246j54k221J60n19j965j52j96r76L27o53l113m390O69M640K808
6759H708L827m40M44P777Q436j972m483l579m146l433L66m24m420J706J356j092
6743H631J322J24J190O81j784J090O173M155J540P108L006o252n271p392j783
6728A2538o81J365J706j557L632N106N638K826K361M830R627J4949J9610K8963
6714A10913L8915O5651J09391J35136O6027m6345j07047j10867p5997m8340l1094
6703A06343j9551j1712q017o843j0293n682M52K982L075L61p69M74N462J2571
$$ y = [227540, 170248, 118467, 84808, 64989, 55499, 49397, 52755, 56341, 58435, 59370, 65371, 66670, 60691, 55479, 51457, 43149, 40051, 37222, 34797, 32827, 31446, 31536, 30162, 27265, 25906, 21760, 19818, 20737, 16786, 10197, 14443, 14289, 12068, 12228, 11709, 9744, 9592, 9396, 8420, 8747, 8094, 4981, 591, 1260, 5900, 8708, 12535, 12095, 12539, 20316, 28752, 26780, 22297, 18718, 14572, 11139, 11505, 11081, 6661, 8367, 9723, 8631, 9953, 10077, 11267, 11948, 10164, 11254, 17427, 21582, 23122, 30230, 33236, 26984, 21713, 14321, 12538, 11857, 13222, 14928, 13371, 17003, 22109, 27747, 30573, 32934, 37764, 47391, 62340, 81950, 110913, 149828, 215479, 324870, 460006, 526033, 479688, 372641, 261774, 185777, 137437, 106343, 86792, 75080, 67063, 60220, 49927, 44245, 44697, 47679, 50754, 51115, 50346, 50820, 56282, 68853]
6689F8853J9610K1401R707j871r517p812o206j736P96k329q319j4079r537q663
6675E0298j0440r483o434k499k696r96K419L228l229l745m748L053j12N36n393
6660I759J11k582k613r48n55o97q36L435K666k600l372l61n08j259K190L82j42
6643B070N57K907q15k057m202l771k714J899O375j13n249K651L264J571j829J611
6627B155k706Q70K96l940k183J975n85k82J617L080K721J90l943J768K412j887
6611A558j278j942l221k799k044K888M553M166k165L383J663K551l178m309l663
6596c837k597M258K150k390j269n420M277K266P47q48j164j821j044Q61L572l219
6580e478q83RJ036K733J026L937L510m094j623O94J34k6J048l176o15j984l728
$$ y = [68853, 88463, 109864, 119571, 117700, 108183, 100371, 94165, 92429, 93225, 90896, 82577, 68498, 58961, 50298, 39858, 30375, 23941, 21442, 18746, 17750, 20169, 23397, 20168, 16423, 11675, 14728, 14616, 15152, 9759, 9870, 7288, 4675, 3727, 3172, 2475, 1639, 5074, 7740, 5140, 1768, 1407, 899, -360, 1830, 2212, 2070, 2627, 5534, 4719, 2662, -1540, -5311, -8025, -6126, 249, 136, -5113, -2462, 802, 2373, 544, 2155, -551, 319, 615, -3325, -5508, -3533, -4118, -4400, -2783, 297, 3018, 3208, -735, 1033, 3445, 1558, 280, -1662, -4883, -7682, -9726, -6838, -2285, 1881, -284, 3099, 4762, 7313, 4135, -174, -3837, -6434, -2176, -26, -2416, -3685, -9105, -4828, -2562, -1815, -2663, -3827, -5648, -6692, -5831, -2259, -5478, -6361, -6352, -5316, -2583, -1557, 2380, 5890, 1796, 173, 867, 1001, 975, 2023, -1153, -1768, -3752, -7480]
6563g480R89l149k823M0K660K210L266J079J91M119K535k821k552L138L978k642
6547B738l780p75M342K056k855j941k58J567L15k461l022J306m80n601k997M868
6531f978N668J722n96k798k513M66l4O94k429J141M320M50j53k17l94R30j49k850
6513c720j281R50l00L15K905k714P87K03l00j726k506K14J870J515Q74K719j347
6496a542q1k10k062K719J655j982l425l489K427J982k167J123L511k268l666l344
6480a0819m640L328N739r41J551N78L93Q96j643K096K25n229m345j767O925K027
6464e626M23k95K270K68K071J949l049k454K381M0j0207j839K331L55O320m40
6448e502k427M053J441k723k103j459K691J809K562l111r97M436L402k750k955
$$ y = [-7480, -6491, -9640, -12463, -12423, -9763, -7553, -4287, -3208, -3017, 1102, 3637, 816, -1736, 1402, 5380, 2738, -1042, -1817, 2525, 4581, 1726, -215, -473, 1094, 1409, -1052, -4074, -2768, -3248, -8849, -11846, -6978, -1310, 412, -184, -2982, -5495, -5029, -5063, -4369, -6798, -5657, -1337, -887, -1040, -1257, -1651, -721, -870, -3720, -5001, -4051, -4351, -4036, -1131, -3845, -3058, -2855, -3155, -4881, -7387, -7173, -5303, -3788, -2914, -195, -1542, -1623, -1833, -3895, -1176, 479, -1503, -4928, -8417, -5990, -4008, -6175, -5052, -1541, -3809, -7475, -10819, -15459, -12131, -6392, -7333, -5782, -5204, -4811, -3915, -5558, -3462, -3237, -8466, -12811, -14578, -7653, -5626, -5203, -5498, -3228, -2960, -889, 1060, -1989, -4443, -2062, -2022, -12229, -14068, -11737, -11382, -5062, -5502, -7929, -3876, -2435, -5158, -7261, -8720, -6029, -4220, -1658, -4769, -5766, -1330, 2072, -678, -3633]
6433c633l134M630O431J892k057k9j405k243M09k011k83J671j660p78M827K066
6417D693l401K152k569m208k418n508M8O514R27j404O17l790K247O063l6j318
6401a391l089K156R54o11O94k605r23j724N39M4k920L095O486L123n13n831J100
6384a416N66j254J029J763j582n95k70N83l163L538l0l740r96l198J333M017J367
6367b048R21M7j789k840m341L08q20K850M343m87r30J719l83j620J330q64j603
6350f207j74J054j477J040J162m66J453j37M00O217r79m541j208N06K154J497
6334B94J743r42k634K152k764k877j696m76L44J249k37l420K677j458M34K557
6318e054j481k656j85J101k008k039k257L858J678M363K955L446J1j061L440J944
$$ y = [-3633, -6767, -2137, 4294, 6186, 4129, 4100, 2695, 452, 861, -1150, -1433, 238, -1422, -2200, 2627, 4693, 1292, 3444, 875, -3333, -5751, -11259, -11211, -4697, -3770, -5174, -4557, -8347, -6100, -37, -73, -1391, -4480, -2324, -1370, -1981, -1287, -3892, -4815, -6539, -6000, -5956, -8876, -5781, 705, 3828, 3315, -2516, -1416, -850, -2104, -1075, 688, -894, -1489, -1759, -1176, -4339, -801, -831, -4571, -5567, -8765, -7432, -3415, -2048, -1127, -1080, -2869, -5709, -10050, -9742, -10562, -7712, -3369, -3856, -4786, -3067, -3450, -5070, -3740, -4604, -6207, -6381, -5327, -6804, -5764, -4602, -5068, -3615, -3752, -3352, 2865, 1886, -2655, -3863, -3357, -1203, 294, 2037, 1095, -1539, 613, -2151, -5028, -6724, -7200, -6856, -5607, -5844, -9264, -6587, -8045, -7611, -5054, -6535, -9191, -9376, -8275, -10283, -12322, -14579, -10721, -9043, -4680, -1725, 1721, 1732, 671, 4111, 6055]
6302F055o98l697n335l098j251R77M423j854K046M05j148P98o59n941M237J058
6286c682J035M51J553k33k37q35M287K813k020j003l470O02n85n052n235M324
6270g287m12L99R66J229l103L023j13q63p89K65o76J591L278Q59N05q77k348J960
6252b393L804R20j111M27p95m153l131O24K178K48L397l321n074o049L185M006
6236g238L583J256m52J078J138k273j142J726M338J312m621n140j147k341Q77
6221i046J88J926K595k039m327j716J576J604j050j60M063j271M591M39p26P25
6205b628J053M91N08m263l031k049N050M395J489q80k017M50K535j987o173l801
6189a0858k593M03M805M863J732R04L46j866j351m615n454n71R523R50l640K338
$$ y = [6055, 5357, 1660, -3675, -6773, -8024, -7047, -2624, -4478, -2432, -2027, -3175, -2377, -3036, -8977, -4740, -3682, -2647, -2196, -643, -876, -1113, -1948, 2339, 5152, 3132, 2129, -1341, -739, -1324, -6376, -11611, -7287, -7699, -7300, -6334, -5105, -8208, -5185, -5298, -6161, -6950, -6685, -7361, -5770, -2492, -1633, -1128, -2005, -4353, -2393, 1411, 2331, 1220, 1647, 852, -3301, -6432, -5808, -3630, -3382, 15, -3306, -8380, -14429, -11244, -7238, -3655, -2399, -2851, -1773, -635, -2908, -4050, -2324, 2014, 3326, -1295, -6435, -7582, -9923, -9046, -8858, -6932, -4337, -6376, -10703, -12419, -10843, -9239, -10289, -10449, -6386, -7657, -3066, -2627, -3353, -2628, -1575, -1084, -576, -4839, -7870, -9919, -4869, -474, 1015, 135, -1882, -1432, 1103, -884, -7057, -10858, -13451, -13048, -8243, -3380, -1648, -744, -398, -2264, -3615, -8230, -13684, -14255, -4732, -3782, -7422, -5084]
6173e084J163N5J741k033J429j22k024j531K096k156j541N014l58N41p11Q11j669
6156d379M021l09l5k364kM29r82j5o07n37k392j231L698L87O47j016j764p58K355
6137d854L289j010l148J099n806m647J141O472J399L116q1K706n96k846l902k743
6121a0411p30o41j069o69M394N785J921j993L19L462K371m184j280j478l814p16
6105h733K588K326l6q46j299J396l342l4N77K286L940K35j441m240l55R54J557
6088d467n49l117L972O79j715m30j033m697J852L438K635O841K396k999j808l969
6072b971k606j286j492L7M75j313j922N8O586M22m878L05K169N856J030m230j105
6055d865J940L629o83k352O16K320j166k003K5j705m302m968K924O013M633O4
$$ y = [-5084, -3921, -3866, -2125, -4158, -2729, -2851, -4875, -6406, -4310, -6466, -8007, -2993, -3351, -2810, -3521, -2710, -4379, -358, -667, -702, -3066, -3068, -2639, -3621, -3636, -4243, -4780, -7172, -8403, -4705, -4318, -3671, -4687, -6451, -7209, -4854, -1565, -2575, -5723, -4624, -10430, -15077, -13936, -7464, -6065, -2949, -3030, -324, -920, -3766, -7668, -10411, -11141, -11782, -12851, -13520, -9126, -3341, -1420, -3413, -3094, 368, 2739, -1445, -2725, -4203, -8017, -8733, -6145, -3819, -3855, -4701, -6000, -4604, -7946, -7980, -7403, -5117, -1177, -942, -2383, -6623, -6978, -6024, -4467, -5016, -8133, -4161, -3482, -5197, -5627, -6660, -11357, -9505, -6067, -3432, 3409, 5805, 2806, 998, -2971, -5577, -6863, -8355, -8318, -7843, -9156, -11078, -11020, -4434, -4012, -8890, -8585, -6416, -560, 470, -3760, -4865, -2925, 704, 21, -2331, -1715, 605, -561, -2564, -2539, -4244, -8546, -13514, -10590, -4577, 56, 120]
6039A20P35j008r56j199j583N89J212m08j989j860J531J880k862N068J917K347
6023C534M86j689k26m637n351L872J202L164J49K27l170j157P85J823k886l649
6007g523N18L22j481L405K383J195j882L997p02j180j654l111j883K476L493j578
5991c205j386R44K339K162m613k210J822M80o89J521k781J464J097k238J291m496
5975h498l467L613K696J644o18Q1L951p31k637l32K257M37l900o43M219L37j388
5958b979m339k712j113J648N05J399K487J820k230p14L858j477m67J96l404P04
5942f818J457l091k912J513L917L872m855m979K323M811j378k530O22J723L225
5927c100o50l629K917Q71K069J0r03J744J916l773q46K43k182p45Q07Q3L84J329
$$ y = [120, 855, -153, -1109, -2308, -3891, -3302, -2090, -2498, -4487, -6347, -4816, -2936, -5798, -730, 1187, 3534, 4020, 2331, 2105, -2532, -7883, -4011, -2809, 355, 504, 731, -2439, -3596, -2811, -988, -3874, -7523, -7005, -6683, -8164, -4759, -2376, -1181, -3063, 934, 232, -948, -2602, -5713, -7596, -5120, -1627, -3205, -4591, -3647, -1308, 854, -3759, -5969, -4147, -3667, -4356, -2835, -5616, -4152, -3055, -5293, -4002, -8498, -11965, -8352, -5656, -4012, -4630, -4549, -598, -1329, -3966, -4298, -2041, -1604, -5504, -6147, -1928, -1591, -2979, -7318, -10030, -11143, -9495, -8990, -7591, -5104, -3284, -5514, -6228, -2370, -3847, -4314, -4118, -7522, -6818, -5361, -8452, -11364, -9851, -5934, -2062, -6917, -11896, -9573, -4762, -6140, -8670, -8048, -6325, -3100, -3750, -7379, -4462, -3591, -1522, -1512, -2415, -671, 1245, -2528, -3374, -3131, -5313, -6058, -5251, -5168, -4784, -3455]
5909c455K210L665k551k736K33J081J084Q15J395l06q40l34K862J942J893K286
5893I244m82j511o101o733m994k480M666M552o95k136L488K181m543n04L348q40
5877c540j938J804K096j342l834k931J844L91O69J02O09J014q32P03L200K33l095
5860d847r42m45j16J37J146K894J050k658k050N15J462j378J804K972K71J632
5844A447K468l041j884J179J896j169K14M162K34p43k005m459n765k807O946L870
5828E43k392K499m41K896k736m887L83j466l68J838k255j544J341R85L36n18P37
5811e049m619K716N720K769k287k607k248J211M626M735m689k42L416l544r68
5796a060M60j746N0J254k2k311J671J432K438j071n226l023K210K807L769J825
$$ y = [-3455, -1245, 2420, -131, -2867, -2634, -1553, -469, 346, 1741, 1435, 595, 261, 3123, 5065, 6958, 9244, 8762, 7251, 1150, -5583, -10577, -13057, -8391, -3839, -4534, -6670, -3182, -1001, -5544, -6048, -2700, -3540, -5478, -3674, -1578, -2920, -6754, -9685, -7841, -7450, -6781, -6679, -6070, -5056, -5888, -5185, -1985, -1752, -4847, -5789, -6234, -6350, -6213, -5067, -2173, -1123, -3781, -5831, -5316, -3854, -5232, -3428, -456, -185, 1447, 3915, 874, -1010, 169, 2065, 896, 1110, 5272, 5506, 4763, 2758, -1701, -7466, -10273, -3327, 543, -1849, 650, 209, 3105, 369, -4518, -4135, -5601, -5969, -4131, -6386, -7930, -6589, -5604, -5268, -5786, -5049, -9668, -6952, -1232, 1537, -750, -3357, -5605, -4394, 232, 4967, 278, 36, 3452, -92, -1060, -600, -2346, -2296, -1042, -1064, -3375, -1704, -272, 2166, 1095, -4131, -7154, -4944, -2137, 1632, 3457]
5780C457l309k574j93P77O5j54n6l12j637o93O971L903j609l818r78k707l591
5763f458k20N51L924n58m227K242L28j767J798P717K69j031l837k204k15L614
5747g4L595L281o541p707k074J647j242L74L925K222K738rk199L754L15j978k192
5730b165K012J487J877K835q58m324p033m363N659j762k82J014L698L057J152
5715B004p88q28j573q46p09k656q78K368l70p72l65J339J497J674k542j063K238
5698b270j349j959j765L166M765J245l7M04n445l38j085n935k285Q013L387k928
5682d416J551R57m064k896J762m79n46j848J63L065Q23R48R77J166l609k721l135
5665a2302K332K439J95L966L765L052k885o814k631m30Q89L857P58l938J200K376
$$ y = [3457, 148, -2426, -2619, -1842, -1777, -1931, -1987, -2299, -3936, -4629, 2342, 6245, 4636, 818, -160, -2867, -6458, -6678, -6127, -2203, -2761, -6988, -4746, -4418, -6185, -4387, 3330, 3599, 2568, -1269, -3473, -3688, -74, 3521, 6802, 261, -7446, -9520, -7873, -9115, -8741, -4816, -2594, 144, 135, -2064, 1690, 2005, 27, -2165, -153, 1334, 3211, 6046, 5188, 864, -6169, -10532, -4873, -6635, -6917, -5903, -2205, 852, 2004, 1216, 388, -1185, -2031, -2740, -5396, -6274, -3906, -4276, -5048, -5413, -4074, -2577, -903, -3445, -4508, -2270, -3619, -5578, -7343, -4177, 588, 1833, 1796, 2200, -3245, -3583, -4668, -10603, -12888, -4875, -1488, -4416, -2865, -1908, -5972, -8868, -7106, -7585, -8131, -9979, -9816, -6751, -5928, -4980, -4003, -2837, -6446, -9167, -12302, -9970, -7531, -7336, -3370, 395, 3447, 562, -6252, -8883, -9313, -8424, -4567, -3809, -7747, -6547, -4171]
5649d171L398J919L906m3J037l364k908J584k14O82K717P66j880k871J049j541
5633F6k715j594K763J832k46L923j319K79M09r77R85j983o19k333M135j094l349
5616a837j977l118K586L322J76J274L920p13k395ql235k849r05M162K129m740
5600d208p69K459j578k30L214k535j06o3k112l28j545K637L796J142k643m492
5584g361m76M178J620J438L04j34j481nP308M607J650o36l918K346n830m111J811
5567A310R00j209j065j274K117n25m68N791L510m862n847J26j04K657P22k359
5551e80L74K981J721o37J49O90k873n770k653M040N559j713j372l34J184p16n44
5534d94j85q16l073j348O057L432j693j7N87k764j56k580J244m81L19m5J670J85
$$ y = [-4171, -773, 1146, 5052, 5009, 6046, 2682, -226, 1358, 1144, 1826, 4543, 5309, 3429, 558, 1607, 66, -2649, -4243, -1480, 352, 106, 4029, 2710, 2989, 3398, 2421, 3406, 1423, 804, -1529, 2606, 1512, -1837, -3814, -6932, -4346, -1024, -848, 426, 4346, 3633, 1238, 1230, -2005, -4854, -5759, -1597, 532, -4208, -4977, -2518, -4096, -4326, -1112, -3647, -3753, -3816, -5928, -6256, -7801, -5164, -1368, -226, -2869, -7361, -7837, -3659, -2039, -601, -297, -431, -1912, -1917, 5391, 9998, 11648, 11012, 7094, 9440, 3610, -501, 1310, 2210, 1001, -64, -1338, 779, 254, -214, 5577, 9087, 4225, -1622, -1496, -1600, 1057, 1779, -580, -206, 2775, 4496, 3859, 4008, 4698, 1825, -3945, -6598, -2558, 3001, 1288, -84, -418, 766, 50, -494, -679, -1495, -4568, -5916, 141, 3573, 1880, 1863, 2450, -314, -470, -3050, -1806, -2287, -1968, -2013, -343, -158]
5516a58J250l793p37J132j755m609j040M952M609K130o36l901J286m25k033l644
5500g372J178J39J457L644J620j619j631J67K945M347R37k11p27J501k150p345
5484c120m138M70O03J957j482m026m39L875M517j176k269j254K421J337j856m53
5468e033P63k0l122j994K354O59n67J718M435j783M36K100K429K86P86L98L61
5451D206k099L01J552k611m597K980M671l152m661p44k5J375j626L402J453l848
5435c423K716L353j5l300j778J831P69N089j019o826n317l517N663O086j050M11
5419c27o74j184J293k220o001q40K601M564K451k712J401N78j364J321J510j790
5403a393o665l087K210M569r94m248K412j77L759M618k259k504m001K161M857
$$ y = [-158, 1092, -2701, -3438, -2306, -4061, -8670, -9710, -4758, -149, 1981, 1345, -2556, -1270, -1695, -3728, -7372, -6194, -6055, -4598, -954, 666, -953, -2584, -2417, 528, 4875, 5812, 5601, 4874, 6375, 4225, -3120, -7258, -6788, -6185, -4228, -5710, -9736, -10175, -6300, -1783, -2959, -5228, -6482, -4061, -2724, -4580, -5033, -4270, -4290, -7412, -9406, -7052, -6393, -6960, -5242, -807, -2590, -2154, -54, 2375, 2661, 3447, 3845, 4206, 2107, 2408, 3960, 1349, -3248, -268, 4403, 1251, -3410, -4154, -4179, -2804, -4430, -1028, 425, -3423, -707, 2646, 2631, -669, -2447, -616, 153, 5242, 4223, -2603, -7920, -11437, -5774, 312, -738, -327, -1001, -2185, -892, -3112, -9113, -9953, -7352, -2788, -337, -3049, -1648, -1070, -2434, -1113, 397, -1393, -8058, -11145, -8935, -4366, -5360, -9608, -7196, -7373, -3614, 1004, -1255, -3759, -7760, -5599, -742]
5388g42j868r25L837j448J831r50j723Q58J310l3j53m347N26R97k573N1j11k605
5370h068l57j666l273O492R91j680r63K136R65K412J465n126m069K233M887N359
5354A738K787m091r40l013j402K683L750m54j764j640j156r99J390M530J687l7
5338C069j257j633k762J385J031J889J982K839k843j468L439M27j288J260j751
5323D319l203m884j943k095j812K043L82l265J750K943L698j714J14n316L48M625
5307d010K040J482M516Q21J9M98m646n772l612o66O53J613K083L18j326k255L692
5290d552P35l83M587L063l163n028q80J691M136N927r43p07J423n010p52J530
5274A674N410J586k154q410l892O58j750m81J959q72j077k164q27K723M140J67
$$ y = [-742, -2610, -3535, 302, -1146, 685, -265, -1988, -1130, 180, 147, -6, -4353, -3827, -2830, -5403, -5352, -5463, -8068, -8425, -10091, -13364, -6872, -5881, -7561, -8524, -6388, -5423, -3011, -1546, -6672, -10741, -8508, -3621, 1738, 4525, 434, -506, -3519, -4921, -2238, 1512, 1058, -706, -2346, -3502, -4501, -3111, 1419, 3106, 3069, 1812, 179, -2583, -1198, -167, 1722, 3704, 6543, 3700, 2232, 5671, 6098, 4810, 6070, 4319, 1116, -3768, -5711, -7806, -9618, -7575, -7193, -10458, -8708, -5765, -2067, -3781, -3667, -8983, -8635, -4010, -1970, -488, 4028, 4849, 4868, 5366, 720, -5052, -8664, -9330, -8677, -7064, -4981, -4663, -5989, -8244, -4552, -3817, -4200, 387, 3450, 287, -4741, -5621, -3930, 206, 6133, 5190, 4483, 5906, 896, 144, 1674, 7084, 8670, 6516, -1894, -5786, -5128, -6878, -7359, -5400, -6272, -7349, -9513, -10340, -7617, -3477, -3310]
5258c310L311M097j830m101J693J721j366k001k430Q44J296l848K036J788j871
5243c971R02k5q29P03k923m166k425K556K429k536k184M843M002J9j332N023J753
5226A839l845n421J381O098J128l329k874q29L14L958N779N745n195o272r48L177
5210G06n12J154L782K510j855j872J389r31o697J99k14K61J393Q84R09j819K17
5193d96k86L245L856n654m606r09J949J346O17k033o67m261K733O212K499k94
5177C251l441l688L960j39j774l438k144K148K289K44R87j018k82K240k208k752
5161e765j008K433j536J339M536J789R45j230O5j018l431o324J322L536q78L83
5145d842N15J328K97J089j011J871J75J905k69l495n411k347P06JK192M21N29
$$ y = [-3310, 1, 4098, 2268, -1833, -140, 1581, 215, -1786, -4216, -3372, -2076, -5924, -3888, -2100, -3971, -3069, -3094, -3923, -3220, -6143, -10309, -12734, -10178, -7749, -10285, -12469, -7626, -3624, -3605, -4937, 86, 1839, -2006, -7427, -6046, 52, 1180, -2149, -5023, -5852, -5538, -1580, 4199, 9944, 4749, -1523, -2471, 706, 194, 1348, 5130, 7640, 5785, 3913, 5302, 4371, -2326, -2127, -2341, -2080, -687, 197, 1106, -713, -496, -782, 2463, 6319, 665, -3941, -4850, -2901, -1555, -938, -2971, -3638, -7899, -5166, 1046, 3545, 3251, -190, -3878, 82, -57, -1831, -5269, -7413, -5265, -2976, -2732, -1745, -2763, -3045, -805, -3013, -5765, -6773, -4340, -5876, -4537, -1, 1788, 2733, 1503, 1568, 550, -2881, -9205, -7883, -4347, -5225, -4842, -4327, -2999, -2702, -1613, -2624, -753, -578, 1327, 1058, -2437, -7848, -10195, -9489, -9488, -7296, -6875, -6346]
5128f346L487K431j012k261N147J613N71Q29j657l586J945J915J669n629o909
5113g793k538k653J871K695K292K591O04M142k876p261p42J263P968M664J883
5098F110k413J804J572j076k51k821pj498j801o57O70J753k554j233j013J707
5082a708J421n18n72j691N04R05k311m241L000O918K070l279k578M83n85K279
5066I7J669m828N49J082L138L056n092j98K071K697j16K651N08m798o845L973
5050c86Q15l824k627L164K255K527L021j761k532j70j87j709K324K385J752J378
5034F425l437k623k892j990N613K709n0L789k143o985l312K83q7L293j590L00
5018b697n2j272K15o26K392K217n81r13J235m79j792k80k266k081L955O113R53
$$ y = [-6346, -2859, -428, -1440, -3701, 1446, 3059, 3630, 4459, 2802, -784, 1161, 3076, 4745, -884, -7793, -10331, -12984, -11113, -8418, -6126, -3535, -2931, 1211, -1665, -8926, -9668, -8405, -437, 4227, 6110, 3697, 5501, 7073, 5997, 5746, 2925, 2918, 1420, -381, -1038, -368, 1385, -1169, -2402, -3415, -1708, -287, -805, -1377, -3068, -2564, -1659, -3970, -8211, -5211, 1707, 3777, 498, -2080, -1597, -2182, 97, 1766, -3062, -2513, -1431, 1707, 4763, -329, -527, 1544, 4241, 4125, 6776, 7284, 2486, -4359, -386, 429, -3395, -6022, -2858, -603, 1924, 4945, 3184, 652, 482, 295, -1414, 910, 3295, 5047, 6425, 2988, 365, -2527, -4517, 1096, 3805, 3755, 7544, 5401, -1584, -4896, -4613, -4700, -1407, -2997, -2697, -2749, -4021, -3806, -4432, -2040, 177, -404, -1317, -82, -561, -2353, -2633, -4899, -6980, -3025, 3088, 4041]
5001D041O88j909k04k380m954R80J490J412L739M662j161n878K990J661l493m534
4985b850J183K149M442K336k921j792k034l67k242J504r2J158L5K969j969k896
4969a387R30J432k972l434m705J745J108j424k18N62J136J628K858K635O63Q79
4953A436K121L757J362k943p355k974p65K736J062o45k599K465M841J261l484
4938B76n133J624n95L32L762k337Q98o37j739j232r11J808L222J046J785j922
4922B47L46K018j013K27l88n603n84N879K387l741K480k882q02K110j873R40K836
4905B584K113j170n185l073R59K248j579l04N088J030k171J777K550J680k179
4890D368k223m280k173L64K972j797j922j925R45N047J992l563m67j243Q26P56
$$ y = [4041, 4729, 2820, 2616, 236, -4718, -3738, -2248, -836, 2903, 7565, 6404, 526, 3516, 5177, 1684, -2850, -1667, 482, 4924, 7260, 4339, 2547, 513, 146, -2096, -592, -684, 474, 509, 3478, 1509, -1387, -457, 975, -1997, -5431, -10136, -8391, -7283, -8707, -8925, -8363, -7227, -5599, -2741, -106, 557, 1436, 3557, 7314, 8676, 5733, -1622, -4596, -5361, -2625, -1563, -2208, -4807, -2342, 2499, 3760, 276, -4857, -3233, -3828, -3496, 266, -2071, -1173, -1810, -3549, -4781, -5692, -3884, -662, 384, 2169, 247, 593, 2611, 1598, 1825, 1437, -4166, -4750, 1129, 3516, -225, 2255, -627, -1429, 681, -1192, -252, 2584, 4697, 3527, -1658, -4731, -3772, -1524, -3103, -3407, 1681, 2711, 540, 2317, 4867, 6547, 4368, 2145, -2135, -4308, -3944, -972, -2769, -4691, -6616, -5671, -624, 1368, -2195, -2662, -3905, -3079, -2323]
4874b323J49K618M435k413m627k92N713Q71J433Q16J361o243m886J199J751K321
4858A883j601k030K232o13j132K68l88j853M180P70j347J91q78J063r96j603r78
4841b832Q70l808p69M913L509M173J376n943n588o303L049L50K638J564P42l137
4825e196l815R118M244j8l551n530q22j05j128j84k4K927K034p85Q59K129J594
4808A747M16j912J823P11j962k535k154J8L171O85m67l592J400L889M25j382K30
4791E11j452k135K554J067j915K445J56k074r91l965l170N513J282r58J857N43
4775g32l33n61r54m85l78p01L116K790J711Q25j209m919k162J787k594K844K18
4758a737m94L924L945k531m338j684J576L632l863j535R95m28J246K799J406l222
$$ y = [-2323, -2174, 444, 4879, 2466, -2161, -2453, 3260, 4131, 5564, 6380, 7741, 1498, -3388, -2189, -438, 1883, 282, -1748, 484, -129, -1261, -993, -1381, -3234, 946, 1716, 369, 560, -318, 745, -251, -1854, -2832, -1962, -5770, -6539, -1626, 1883, 6056, 7432, 1489, -4099, -10402, -7353, -7003, -4365, -2801, -2059, -5196, -9011, 107, 4351, 4333, 782, -4748, -5570, -5675, -6803, -6987, -7011, -4084, -2050, -2835, -1976, 153, 1747, 2163, 251, 2074, 2785, 823, -1712, -3866, -3848, -677, 8, -459, -4051, -2651, 1238, 1663, 281, 511, -941, -3076, -522, 545, -1370, 1075, 1231, -843, -1834, -5799, -8969, -3456, -2174, -3132, -1275, -732, -1065, -1626, -2580, -3065, -3443, -4144, -1028, 1762, 3473, 4298, 3089, -1830, -3992, -2205, -4799, -1955, -1737, -2231, 1693, 5638, 3107, -1231, -2915, -1339, 2293, -1570, -3105, -2110, -2538, -1292, 1507, 2913, -309]
4742c09J1K703J378m088j313m30k048l934k336K563L688k059p67O39J532j06L961
4725i15L924j72k934K958r28j959J935Q51K029J480J9K92n406k502J196J504p43
4708F29M82j9L53K463J186l561p971K49O43r45n02K98Q41M484J857O97m4K011
4690C151P35n673K164K154n208O41j009K70K23K591J165k673q03J023K182L153
4674D086J713p37p32J304q13L29j127M172l036j639k238J991j764j977J057L460
4658D049O08p41m244m820k757J644J535l248M921J092R79p19N80l812m074M18
4642h589M652Op56J847J392o124k379J06j93J841J904K176K696l081n95k424O39
4625f882L695J100K834n22K966J345q114l787j052m247M836M306k191R71J714
$$ y = [-309, -298, 2405, 3783, -305, -1618, -2048, -4096, -8030, -10366, -7803, -4115, -6174, -6941, -6302, -4770, -4876, -915, 3009, 2837, -97, 2861, 1933, -26, 1909, 2760, 4789, 6269, 6288, 6580, 1174, -1328, -132, 1372, 629, 1111, 1092, 1445, 3908, 5094, 1533, -6438, -6189, -5546, -6491, -6993, -6695, -5854, -1370, 487, 1184, 1140, 3151, 3886, -1787, 377, 2531, -2677, -2036, -3045, -2775, -2552, 39, 1204, -1469, -2272, -1249, 933, 4086, 5799, 5062, 4330, 5634, 4821, 5150, 4023, 8195, 5159, 3520, 1282, 3273, 1509, -468, 589, 4049, 4657, 3916, -328, -5148, -7905, -6261, -4726, -7974, -3053, -1961, -982, -1701, -1121, -4933, -9007, -8589, -3937, -3931, -4687, -2840, -1448, -7572, -9951, -9845, -10038, -8197, -6293, -4117, -1421, -4502, -5097, -7521, -6882, -3187, -2087, 747, 225, 3191, 4536, -3578, -7365, -8417, -12664, -7828, -3522, -5713, -4742, -3028]
4610c028l19K450L946l715l743R19R39k642k545J887J375O60N53J966K323j049
4594b3L206J38L072k153n640L821K466k785j119l191Q29L226n36n31k421k685
4578d326M39q03K952L574n35m500J418J390k047j305J175N533M165n214n145k856
4562f085J819K489m3l725n312K005L194J749N12O79L253K43m88K178n6k451n52
4545e91k061k126l898L16P582J251l381L006kl502o12N098K205l81J208K889n234
4528A767m041L693N544j663k301k922o522N1L647L580Q32q78r32K32J804j272
4512F19K803j271l546j127K938q96K916J093m141n249l667l29j274r68K068R31
4496i100J829M020L812K106l884p311j335L327K388J492k093o8j005M044m53J107
$$ y = [-3028, -3347, -897, 3049, -666, -4409, -3490, -2551, -5193, -7738, -5851, -4476, -3816, -3263, -1297, 1026, -23, 3183, 3321, 6393, 4240, -1400, 2421, 4887, 2102, 983, -2208, -1379, 1847, 1311, 780, -1641, -4326, -3887, -4690, -1738, 1836, 1301, -3199, -1781, -391, -2438, -3743, -2568, 2965, 7130, 1916, -3229, -6085, -4266, -1777, -1820, -5545, -10857, -8852, -5658, -3909, -3397, -2718, 535, 778, 290, 2468, 2412, -39, -591, -2652, -4778, -8676, -8360, -778, 473, -2908, 98, 96, -3406, -4018, 1080, 3285, 2904, 4112, 7001, 1767, -2274, 1419, 6963, 5300, 2999, 77, -6445, -6394, -2747, 833, 1665, 787, -145, 87, 1891, 619, 3422, 2151, -1395, -2522, 416, -480, 2436, 3529, -612, -5861, -9528, -9857, -11131, -12099, -10031, -9100, -7271, -3251, 561, 2667, -1217, -8528, -9863, -6536, -4148, -2656, -4749, -4817, -5822, -1778, -2231, -1124]
4480a124L231K358k320m658J043l03K131j23l96L72l779m16J562k606l404j127
4464i559L943K479J974R54l696l032L011j629l043N47L771L212L036j826k669
4449b527J696J599j321k586K467K341K81J055l581Q79L27k607j226l44J510L15
4433a722J481k869n081J808O450M726m760n748J338J96N33k345p52J606O155K099
4417C115j39K64J499m600J271K460j53J419K372j894L78n948n259J292K151o05
4401b377K245N083K800k047j877J404m08n370j903nJ473o89N22L431N49j050o465
4384d684J535m69Q1J842M217J538K209k141o55m553m267O78J694l591k381K153
4368f794J961M243o28j153m97p15M02M853L497l82k933j060l579l211J866j801
$$ y = [-1124, 2107, 4465, 2145, -2513, -1470, -1773, 358, 235, -161, 211, -3568, -3984, -2422, -5028, -8432, -9559, -5616, -3137, -1163, -209, -3905, -6937, -3926, -5555, -8598, -8051, -4280, -1068, 1968, 142, -2527, -831, 768, -553, -3139, -672, 1669, 1950, 3005, -576, 303, 630, -1977, -3203, -3547, -2037, -1722, -241, -3110, -8191, -6383, 67, 4793, 33, -5715, -4377, -4181, -3648, -5993, -6745, -5139, 1016, 3115, 2976, 3240, 4739, 139, 1410, 3870, 3717, 5136, 7508, 5614, 5992, 44, -5215, -3923, -1772, -2377, -132, 4951, 7751, 5704, 3827, 5231, 4823, -547, -2450, -2455, -982, -1671, -1149, 2282, 2831, 1781, -4684, -3149, -3618, -3537, -1695, 2522, 4060, 6269, 4128, 3473, -1080, -5347, -4669, -2975, -6566, -8947, -6794, -4833, -590, -1218, -2371, -2868, -3583, -3181, 1672, 5169, 4787, 1854, 794, -2785, -5996, -4130, -5931]
4352e931k151m9J338k49p15J907O76L596K644q22J74n13k021j401K061J170L281
4335B995K335J010k955p010J885L356j312K534n52m128n804j255M354K190j436
4320c793k68L985L645j125k89n40L23M55K12m079o205K836K023l4L112R00K2l44
4302H36J713M477P49j786j296l455o163J23M335N163O01M06k07p441k581L669
4286h57r10k068J418K365M299j722k996Q41m76l665m303L587Qj869J682J00j203
4269e769P11R86r57k016J356L685K831P05J245j370M003r92k491J204O03q54N77
4252C457P87l292l659j160k751m386L629P365L696o31k618l991K699M82J730q84
4236D73o27n32j379m457J9J230L009L088P34J967n71j519m7j224J884K709j972
$$ y = [-5931, -8082, -8131, -6793, -7042, -7757, -5850, -5174, -1578, 1066, 244, 418, -95, -2116, -3517, -1456, -286, 2995, 5330, 6340, 3385, -3625, -1740, 1616, 304, 2838, 2286, -1842, -7646, -8901, -4547, -2357, -3793, -4061, -76, 3569, 2444, 2155, 1615, 1938, 2393, 2605, -1474, -7679, -4843, -2820, -2854, 258, 1158, 1180, 836, 2549, 7026, 7775, 5989, 4693, 1238, -4925, -4802, -467, 4696, 5297, 5703, 5496, -1945, -4526, -857, -1767, -3835, -2417, -52, 4247, 2525, -471, 370, -106, -3771, -8074, -4487, -4479, -6348, -4666, -4566, -5769, -5058, -4072, -5029, -7045, -5689, -2004, 827, 1532, 2777, 1407, 5410, 4418, 1927, 3131, 3734, 2880, 3457, 4244, 952, -2707, -3867, -6618, -11004, -7375, -10, 3686, 3055, 437, -3554, -855, -373, 1357, 473, -154, -686, -2065, -6522, -6503, -5273, -2264, 824, 1558, 3525, 2954, 1435, 1388, 164, 2048, 4757, 2785]
4219B785l72N19k291J152q08J83p8P24p8J211L232k03o100l300j568J298L805
4202A11o19L35k477k9L167K147l883J860J287j65O32r56p69o16M16L646M37l018
4184A506L95Q54J616k041m053p558K76N898N169R20q53l987m785o295j732O435
4168h235L920M419K364n629l289k556L409P414J711J529O31n91l298k512J624
4153I11r36K197j520N41o180j853J631m75k60N023k79L034K836j040o343k081
4137d794J869Q26K977N023L51k047k525k615k318P85M003J845j179l075j88K407
4121A345L190l903q709j275K165K05j518K847P69Q68L920K607N64j128n511k463
4105f027j872J138M561N370N362k668m655M8l09P57K014j160j183k652l373J59
$$ y = [2785, 2413, 2932, 641, 1793, 985, 1168, 1090, 1814, 1736, 2947, 6179, 5976, -124, -3424, -4992, -3694, 111, -508, -173, -2650, -2679, 488, 2635, -1248, 612, 1899, 1734, 2366, 1410, 641, 25, 441, 4087, 4524, 1506, 1901, 2755, 4371, 2330, -1723, -9281, -9005, -3107, 2062, 2982, 2129, -1858, -6643, -12938, -14670, -8235, -4315, 104, 2468, -3161, -6450, -9006, -5597, 1817, 3528, 5057, 5688, 5097, 1799, -713, 911, -25, 2172, 652, 1193, -4987, -6840, -5209, -5684, -5944, -921, -1200, 1834, 4670, 3630, -2713, -4794, -2925, -2099, 878, 5901, 6252, 4205, 1680, -935, -3253, -2468, 1535, 3380, 2201, -874, -1062, 1345, 4535, 632, -8077, -9352, -7187, -6982, -8500, -5653, -4884, -4016, -96, 2511, 3075, 1947, -3564, -6027, -7899, -6761, -2200, 3170, 8532, 5864, 1209, 1257, 948, 1705, 3719, 2559, 1376, -1276, -4649, -4490]
4089d490K983O627L901j68k067j960k425j267M477k988m166m236l607L632M805
4074i49O75J747k598k317P462J547n927l961k445Q76K285j31J559M118j367j554
4058i80l470O122K555m000j457K140M79m222j18J935k490j857L337K641J536k46
4042A905l529q84q54O492K504m434K339K875L69J590j717q5j966l834r94K76K419
4025B472n13j356l248J034K38K677J13j824J255r44n157N3N479J424N953J78O40
4008H474k73j807k453P1l62j190K158j410k419l20l126k326O884j396n362K19
3992d638J292L30k145P06O20Q04K310K079J503j092J51J910j507l69j15j483L495
3975C851Q6j391J320j042j326k050p52J912R62j614j61L395K805K71q04k029k22
$$ y = [-4490, -1507, 5120, 9021, 8853, 6786, 4826, 2401, 1134, 5611, 2623, -1543, -5779, -9386, -5754, -949, -274, 1473, -1125, -3442, 4020, 5567, -360, -4321, -6766, -5890, -3605, -3736, -2177, 1941, 574, -980, -4450, 1672, 4227, 227, -1230, 910, 1389, -2833, -2951, -1016, -3506, -5363, -2026, 615, 2151, 1905, -1624, -2508, -3362, 3130, 5634, 1200, 3539, 6414, 6783, 8373, 6656, 6571, 4605, 771, -223, 53, 2472, 1959, 603, -2645, -1611, -1373, 1304, 1417, -407, 848, -96, -5253, -5200, 279, 1703, 7656, 7834, 8474, 8201, 6394, 3941, 4012, 3650, 2460, 4618, 3208, 789, 469, -2657, -4983, 1901, 505, -4857, -4638, -3346, -3016, -5161, -4455, -3835, -3031, -721, 1358, 2861, 1769, 1920, 3830, 2323, 1954, 1839, 356, 3851, 3937, 2546, 3866, 2824, 1498, -552, -1304, 608, 1570, -44, -205, 3190, 5995, 6266, 5462, 3433, 3211]
3958C211L92m994R57M88M32J553m04k54J080P88p56l462j590j03l57L442L068
3941C491l043m48k239n0K676J550M67k127l75J282L239R67J477J65J47p31q366
3924a918j916M04K305k68k070L102Q47L204l077K435L390q53k018q51jn618m081
3907f984P86L261j417J695J400M823J340l531j610J54m003l38j649K900o06j534
3891e313q14J383%n33j30K98k255j28K746M451Q18j326k9P74J06m203l245n58
3873g958Q669J16k775K273K290j815o35j606k09L271J119j866j119j329K60r16
3857b230J09J577R57j645l33j976k898m66O43O455L891K032k981l084m145M408
3841C14M01j317j406M247J455k766j383j12j961o50M737o2l753L17J383O13Q23
$$ y = [3211, 3603, -1391, -434, 54, 486, 2039, 1635, 1381, 2461, 3249, 2493, -969, -2559, -2662, -3019, 423, 3491, 448, 0, -2239, -2289, 387, 1937, 2404, 277, -98, 1184, 4423, 5390, 6867, 7032, 7179, 6448, -1918, -3834, -3430, -1125, -1393, -3463, -361, 486, 3690, 613, 3048, 6438, 5585, 3567, 2716, 2715, -2903, -6984, -6198, -2937, -4354, -2659, -1259, 3564, 4904, 1373, -237, -83, -4086, -4424, -6073, -3173, -3779, -5313, -6127, -4744, -4744, -5277, -5407, -5109, -7364, -7492, -4746, -295, 523, -803, -832, -58, 48, -4155, -7400, -7958, 711, 827, -1948, 325, 2615, 800, 165, -1441, -1650, 1621, 2740, 874, -245, -1574, -1314, -2230, -2121, -544, 413, -1232, -1565, -3541, -6439, -6905, -6262, 193, 4084, 6116, 3135, 51, -4094, 314, 715, -602, -2008, 2239, 3694, 928, -455, -567, -2528, -3178, 1559, 1497, -2256, -1939, -556, 57, 880]
3824H80p3K732L413l996j312K040j360Q41j577n521J533R94J843J244M75o93k00
3807A263L665K684l778j013J949J200N69j736m261k295l28L074J48q91j44o69
3791e63l06K536l189K157K558K607n56m175j665L632j905l855j317J501L557K44
3775A261j170n84l78M663L193l102K040K313l297r03k10O51k849j832j443n493
3759g140J471L892K581L444J078J607m51j894l746j066j607O52J764j811K526
3744A300K396k551R98K980o57k411j834K74K73m080q07M67p30j862N274K317P3
3727A420m941l305K560N34k47J540M137M08K550l608m957M58K915L803L520k542
3711D245l588L21L215j195k586k029J976l935n653j264K505P200L615K533l09
$$ y = [880, 807, 3539, 6952, 2956, 1644, 3684, 2324, 3165, 1588, -3933, -2400, -1406, 437, 1681, 2156, 1463, 1263, 4928, 7612, 3834, 2821, 4770, 5970, 6539, 4803, 542, -1753, -2081, 993, 1141, 250, 106, -563, -869, 1667, -1522, 635, 3193, 5800, 5244, 1069, -596, 3036, 1131, -2724, -4041, -2540, 1017, 1261, 91, -493, -871, 3792, 6985, 3883, 5923, 8236, 4939, 4036, 3826, 4477, 1628, -204, -1647, -7140, -5669, -1777, 804, 4248, 5326, 6933, 6482, 4588, 842, -224, -1831, -1179, 585, -1226, 1300, 3696, 1145, 2143, 5123, 4466, 2055, 221, 495, 768, -3312, -4119, -3652, -4382, -6244, -970, 1347, 1420, -3521, -6826, -4266, -3732, -3979, -2439, 1698, 2106, 4656, 1048, -3909, -3451, -536, 3267, 6787, 4245, 657, 978, 4193, 2998, 412, -1617, 359, -3576, -9229, -10493, -7988, -788, 2827, 5360, 5051]
3696E051Q37n36l667K93p640k095P54P704K520m250o07N21J164k719J533J894
3680G57N875n449j52j97Q89L27J680m133k971R92m68j788L948L33L273L446K238
3663H600m029l289j69J696l084J39K222K495k757j526k11n18Q82L838L63l467
3647A185l523k015K440k13j337J295J28J401j129j035k946L37K59L998M643j102
3631B386q91O66j025k711m05l33j078j877J4J147J692J939l16j340Q20N4J477
3614B19j041m169J621K399Q53l911j395n33L641L217k484P73j034R97j740N08
3598b079L060P75N9K756J451j799m80k344P53L181j160j794M649J48k428K306
3582G054J62m483j670n221j083K078L568l859l37J670j935mK778K035j848p19
$$ y = [5051, 5888, 5352, 1685, 1978, -5662, -7757, -7003, 701, 3221, -1029, -1636, -1115, 49, -2670, -1137, 757, 6632, 1183, 1031, 834, 1723, 2050, 3730, -403, -3374, -2382, -2850, -4638, -690, -357, 2916, 6362, 8600, 4571, 1282, 1113, 2809, -275, -136, 2086, 4581, 1824, 298, 87, -431, 451, 4289, 4652, 1185, -2338, -4353, -1913, -2126, -3463, -2168, -2040, -639, -1768, -2803, -5749, -5412, -5153, -1155, 3488, 2386, 1495, 2161, 1136, -1575, -1980, -2313, -3391, -5268, -5254, -4107, -2415, -476, -792, -2132, -1312, -1258, 219, -822, -4991, -3370, -971, -118, -4029, -5424, -5957, -2316, 901, -1583, -810, -1844, -847, -2587, -2079, 981, 1756, 1815, 4571, 6022, 4223, 3743, 1399, 2152, 5333, 4173, 2379, 7028, 7176, 4748, 7054, 7216, 2733, 1063, -4158, -5241, -3163, 405, -3454, -3791, -2121, -4056, -4060, -1282, 753, -1095, -1814]
3566a814j621N37l88K87k802j209L62O262P916m300n664r5K920J40k15K529J05
3549B950J746j673m1J118l214J890M42j485o114J996N207M055k86L88J00j183
3533E896l242K27n85K598J251j568k114K434J21j581K510k081k403J647K142o141
3517h89k123J151j731k794K949k77N349J509q98L253J974j568j598l95L25k753
3501A484k996n43l116k874L967M686M553K87j775k421J88p27J876J440L250J022
3485H301n549K25M147L286R29l689k870k061l665p38j246J090J149J042Q49k954
3469a754j23J011l69J675j849j58M366r73j0L74L12j098j883k920M832j11k076
3452g54J119j793K72J008M42k24Q47J583N03j063J036K602l50j708J328k101m616
$$ y = [-1814, -3435, -2898, -3286, -2999, -5801, -7010, -6648, -386, 7530, 3230, -2434, -2529, 391, 531, 316, 2845, 2950, 4696, 3023, 2982, 4100, 886, 2776, 3218, 1733, -4381, -2385, 2822, 6877, 6591, 6979, 7079, 5896, 2654, 2881, 2296, 4894, 6145, 4577, 2463, 4897, 5018, 3437, 5947, 3866, 1463, 3110, 5252, -889, -3012, -1861, -3592, -6386, -3437, -3714, 1635, 3144, 2246, 5499, 7473, 5905, 4307, 3912, 4237, 1484, -1512, -2055, -5171, -8045, -4078, 608, 5161, 5448, 3673, 1252, 1440, 713, 2589, 4029, 7279, 8301, 2752, 2977, 7124, 10410, 11339, 7650, 4780, 2719, -946, -1684, -2930, -1840, -691, 351, 1200, -1754, -1877, -866, -1235, 440, -1409, -1567, 2799, 1826, 1816, 2190, 2502, 1404, -479, -3399, 1433, 1322, -754, 365, -1428, -1156, -148, 294, 70, 917, 2500, 3003, 1940, 2976, 5578, 5228, 3520, 4848, 2747, -1869]
3435a869k576O527P907n40n056k60K880J444j165J093J947j566j080m693MJ144
3419D141k188l732j923j370K929R52k273k563o31N270L248K26j566N47j218K737
3403B586j880N62J825k514K48k94K88J229k51O5k4K119m020k465K883L975m274
3386E8j371K751L328q89j383o69P82K27l273K9m69J049J746J560j017n591k289
3369e421j638K92M23K282L343k156l478J766k653K550M845k147j195J079l058
3354e166n0K764K0O95j430j379Q49K981L012R81k185j33j829n0J310L463Q70L748
3336H471j781m118P62k78o244l09L285L147J861k219o42j120M866k71j465L22
3320D267k87k05O39k226q43P90k284L948j489l218J802J972Mj106q77p95j613
$$ y = [-1869, -4445, 2082, 9989, 9449, 4393, 4133, 7013, 8457, 7292, 8385, 10332, 8766, 7686, 2993, 2997, 4141, 1953, -1779, -3702, -5072, -2143, -1191, -3464, -6027, -6658, -1388, 1860, 2086, 520, 1067, -151, 2586, 706, 1268, 3093, 579, 827, 533, 821, 2050, 1799, 1864, 1840, 3959, -61, -2526, 357, 4332, 58, -1313, 1438, 4766, 3877, 2494, 1825, 2607, 2834, -439, -410, -879, 170, 1916, 3476, 2459, -3132, -5421, -7059, -6767, -6344, -4062, -719, -2875, -6353, -4587, -7240, -4690, 155, -1992, -3187, -2108, -5166, -5216, -2452, -2432, -1737, -3167, -4546, -3697, -716, 2296, 3277, 1092, 959, -870, -920, 390, 3853, 4723, 8471, 6690, 2572, 3334, 3056, -3188, -3497, -212, 2935, 4796, 2577, 1935, 815, 5681, 5410, 3945, 4267, 3980, 3775, 4414, 2188, 1345, 2135, -149, 3799, 2310, -908, 894, 2866, 2870, 1764, 887, 92, -1521]
3303a521j933L232M459j122j115m727j69J915p85j541M05L429J839k144l258k983
3287f019J605K329O90j122j451J873O793J195m756j754k70M82L85l740j139P65
3271d134J720L855J012K650MJ36n36j341l14j85J107J250K376K980j263q152k243
3254a078K587N656p79K503K934L54m788n051j750J249K154J635J010n186k581
3239a131P31R36J963J196j273j119L51L852k73n724K141J542k358J230j33k390
3223d59N20L619j950j536j260m32L065o13j835j10n27k939J548k059k950M866
$$ y = [-1521, -3454, -222, 4237, 3115, 2000, -2727, -2896, -981, -1766, -3307, -2902, 527, 2366, 222, -3036, -6019, -4414, -2085, -1395, -2517, -3968, -2095, 4698, 5893, 1137, -617, -887, -405, -20, -3760, -4899, -4134, -2414, 1441, 2453, 5103, 5107, 5243, 4707, 3366, 3052, 2867, 3974, 5224, 7600, 10580, 9317, 1165, -1078, 1509, 7165, 6386, 8889, 11823, 12177, 7389, 2338, 588, 1837, 3991, 5626, 6636, 1450, -1131, -400, 536, 2499, 3695, 2422, 1303, 1654, 5506, 5233, -491, 1650, 3192, 834, 2064, 1931, -459, 61, 3680, 1730, 194, -1066, -1498, 1567, 954, -881, -991, -1518, -4457, -2909, -4968, -7918, -3052]
$$ [...]
##END NTUPLES=NMR SPECTRUM
##END=
