##TITLE=Analysis number 313295
Compound Code cc 11710
Project Code qc-cat
Chemist Name prosynth
##JCAMPDX= 6.0         $$ Bruker NMR JCAMP-DX V2.0
##DATA TYPE= NMR SPECTRUM
##DATA CLASS= NTUPLES
##ORIGIN= Bruker BioSpin GmbH
##OWNER= NMR
$$ XWIN-NMR		Version 3.5
$$ Thu Sep  1 15:05:29 2005 GMT Daylight Time (UT+1h)  MAYBRIDGE\NMR@NMR_250MHZ
##.OBSERVE FREQUENCY= 250.131544655141
##.OBSERVE NUCLEUS= ^1H
##.ACQUISITION MODE= SIMULTANEOUS (DQD)
##.ACQUISITION SCHEME= undefined
##.AVERAGES= 16
##.DIGITISER RES= 18
##SPECTROMETER/DATA SYSTEM= dpx250
##.PULSE SEQUENCE= zg30
##.SOLVENT NAME= DMSO
##.SHIFT REFERENCE= (INTERNAL, DMSO, 0, 16.5662)
##AUDIT TRAIL= $$ (NUMBER, WHEN, WHO, WHERE, WHAT)
$$ ##TITLE= Audit trail, XWIN-NMR		Version 3.5
$$ ##JCAMPDX= 5.01
$$ ##ORIGIN= Bruker BioSpin GmbH
$$ ##OWNER= NMR
$$ C:\u/data/dgb/nmr/ADRS/8880/pdata/1/auditp.txt
$$ ##AUDIT TRAIL=  $$ (NUMBER, WHEN, WHO, WHERE, WHAT)
(   1,<2005-09-01 15:05:10.60 +100>,<MAYBRIDGE\NMR>,<NMR_250MHZ>,
      <created by zg, POWCHK disabled, PULCHK disabled
       configuration hash MD5:
       62 19 C7 07 E1 42 D1 B7 37 6C 3D D0 77 39 F9 E6
       data hash MD5: 64K
       1B A4 BE 83 C1 87 07 73 14 58 40 E9 23 1A CE 68>)
(   2,<2005-09-01 15:05:21.39 +100>,<MAYBRIDGE\NMR>,<NMR_250MHZ>,
      <Start of raw data processing
       ef LB = 0.3 FT_mod = 6 PKNL = 1 SI = 32K 
       data hash MD5: 32K
       2E BC A0 65 A7 97 F7 C0 35 C7 8B A2 22 F4 B9 23>)
(   3,<2005-09-01 15:05:23.21 +100>,<MAYBRIDGE\NMR>,<NMR_250MHZ>,
      <apk 
       data hash MD5: 32K
       B5 92 EB 16 53 C8 58 F5 71 07 99 B9 7D B3 3E 79>)
(   4,<2005-09-01 15:05:23.88 +100>,<MAYBRIDGE\NMR>,<NMR_250MHZ>,
      <abs ABSG = 5 
       data hash MD5: 32K
       90 76 8B 7A 5E 2B 51 98 3C 76 7C 11 40 F5 C5 81>)
$$ ##END=
$$ 
$$ hash MD5
$$ 5F 83 E0 D8 2C A7 CB 7F E8 2C 14 FE 45 B2 BF CB
##$RELAX= 
##$RELAX= 
##$RELAX= 
##$RELAX= 
##$RELAX= 
##$RELAX= 
##$RELAX= 
$$ Bruker specific parameters
$$ --------------------------
##$DU= <C:\u>
##$EXPNO= 8880
##$NAME= <ADRS>
##$PROCNO= 1
##$TYPE= <nmr>
##$USER= <dgb>
##$AMP= (0..31)
100 100 100 100 100 100 100 100 100 100 100 100 100 100 100 100 100 100 
100 100 100 100 100 100 100 100 100 100 100 100 100 100 
##$AQSEQ= 0
##$AQ_mod= 3
##$AUNM= <au_zg>
##$AUTOPOS= <13 >
##$BF1= 250.13
##$BF2= 250.13
##$BF3= 250.13
##$BF4= 250.13
##$BF5= 500.13
##$BF6= 500.13
##$BF7= 500.13
##$BF8= 500.13
##$BYTORDA= 1
##$CFDGTYP= 0
##$CFRGTYP= 5
##$CHEMSTR= <none>
##$CNST= (0..31)
1 1 145 1 1 1 1 1 1 1 1 1 1 1 1 1 1 1 1 1 1 1 1 1 1 1 1 1 1 1 1 1 
##$CPDPRG= <>
##$CPDPRG1= <>
##$CPDPRG2= <>
##$CPDPRG3= <>
##$CPDPRG4= <mlev>
##$CPDPRG5= <mlev>
##$CPDPRG6= <mlev>
##$CPDPRG7= <mlev>
##$CPDPRG8= <mlev>
##$CPDPRGB= <>
##$CPDPRGT= <>
##$D= (0..31)
0 1 0 0 0 0 0 0 0 0.06 0 0 0 0 0 0 0.0002 0 0 0 0 0 0 0 0 0 0 0 0 0 0 
0 
##$DATE= 1125583509
##$DBL= (0..7)
120 120 120 120 120 120 120 120 
##$DBP= (0..7)
150 150 150 150 150 150 150 150 
##$DBP07= 0
##$DBPNAM0= <>
##$DBPNAM1= <>
##$DBPNAM2= <>
$$ [...]
##$SUBNAM7= <"">
##$SUBNAM8= <"">
##$SUBNAM9= <"">
##$SW= 20.6930455092707
##$SWIBOX= (0..15)
0 0 3 0 0 0 0 0 0 0 0 0 0 0 0 0 
##$SW_h= 5175.983436853
##$TD= 65536
##$TD0= 1
##$TE= 295.16
##$TE2= 300
##$TE3= 300
##$TEG= 300
##$TL= (0..7)
0 120 120 120 120 120 120 120 
##$TP= (0..7)
150 150 150 150 150 150 150 150 
##$TP07= 0
##$TPNAME0= <>
##$TPNAME1= <>
##$TPNAME2= <>
##$TPNAME3= <>
##$TPNAME4= <>
##$TPNAME5= <>
##$TPNAME6= <>
##$TPNAME7= <>
##$TPOAL= (0..7)
0.5 0.5 0.5 0.5 0.5 0.5 0.5 0.5 
##$TPOFFS= (0..7)
0 0 0 0 0 0 0 0 
##$TUNHIN= 0
##$TUNHOUT= 0
##$TUNXOUT= 0
##$USERA1= <user>
##$USERA2= <user>
##$USERA3= <user>
##$USERA4= <user>
##$USERA5= <user>
##$V9= 5
##$VALIST= <valist>
##$VCLIST= <CCCCCCCCCCCCCCC>
##$VD= 0
##$VDLIST= <DDDDDDDDDDDDDDD>
##$VPLIST= <PPPPPPPPPPPPPPP>
##$VTLIST= <TTTTTTTTTTTTTTT>
##$WBST= 1024
##$WBSW= 4
##$XGAIN= (0..3)
0 0 0 0 
##$XL= 0
##$YL= 0
##$YMAX_a= 344850
##$YMIN_a= -273254
##$ZGOPTNS= <>
##$ZL1= 120
##$ZL2= 120
##$ZL3= 120
##$ZL4= 120
##$ABSF1= 16.56621
##$ABSF2= -4.126965
##$ABSG= 5
##$ABSL= 3
##$ALPHA= 0
##$AQORDER= 0
##$ASSFAC= 0
##$ASSFACI= 0
##$ASSFACX= 0
##$ASSWID= 0
##$AUNMP= <proc_1d>
##$AZFE= 0.1
##$AZFW= 0.1
##$BCFW= 0
##$BC_mod= 0
##$BYTORDP= 0
##$COROFFS= 0
##$CY= 12.5
##$DATMOD= 1
##$DC= 0
##$DFILT= <>
##$DTYPP= 0
##$F1P= 14.0000005364418
##$F2P= -0.99999901652339
##$FCOR= 0.5
##$FTSIZE= 32768
##$FT_mod= 6
##$GAMMA= 0
##$GB= 0
##$INTBC= 1
##$INTSCL= 1
##$ISEN= 128
##$LB= 0.3
##$LEV0= 0
##$LPBIN= 0
##$MAXI= 10000
##$MC2= 0
##$MEAN= 0
##$ME_mod= 0
##$MI= 0
##$NCOEF= 0
##$NC_proc= -4
##$NLEV= 6
##$NOISF1= 0
##$NOISF2= 0
##$NSP= 0
##$NTH_PI= 0
##$NZP= 0
##$OFFSET= 16.56621
##$PC= 1
##$PHC0= -86.27144
##$PHC1= 8.679186
##$PH_mod= 1
##$PKNL= yes
##$PPARMOD= 0
##$PSCAL= 4
##$PSIGN= 0
##$REVERSE= no
##$SF= 250.129988939862
##$SI= 32768
##$SIGF1= 0
##$SIGF2= 0
##$SINO= 400
##$SIOLD= 32768
##$SREGLST= <1H.DMSO>
##$SSB= 0
##$STSI= 32768
##$STSR= 0
##$SW_p= 5175.98343685301
##$SYMM= 0
##$S_DEV= 0
##$TDeff= 65536
##$TDoff= 0
##$TI= <Analysis number 999999
Compound Code 99
Book Reference 9
Project Code 9>
##$TILT= no
##$TM1= 0
##$TM2= 0
##$TOPLEV= 0
##$USERP1= <user>
##$USERP2= <user>
##$USERP3= <user>
##$USERP4= <user>
##$USERP5= <user>
##$WDW= 1
##$XDIM= 32768
##$YMAX_p= 473328170
##$YMIN_p= -921917
$$ End of Bruker specific parameters
$$ ---------------------------------
##NTUPLES= NMR SPECTRUM
##VAR_NAME=  FREQUENCY,     SPECTRUM/REAL,   SPECTRUM/IMAG
##SYMBOL=    X,             R,               I
##VAR_TYPE=  INDEPENDENT,   DEPENDENT,       DEPENDENT
##VAR_FORM=  AFFN,          ASDF,            ASDF
##VAR_DIM=   32768,         32768,           32768
##UNITS=     HZ,            ARBITRARY UNITS, ARBITRARY UNITS
##FACTOR=    0.157963299565203, 1,           1
##FIRST=     4143.70587232124, 0,            0
##LAST=      -1032.27756453177, 0,           0
##MIN=       -1032.27756453177, -921917,     0
##MAX=       4143.70587232124, 473328170,    0
$$ Real data points
##PAGE= N=1
##DATA TABLE= (X++(R..R)), XYDATA
$$ [...]
26470F536m3408O3978R3674m3210L216M8057m4075n818o4746o667k0504j19386
$$ 6536 -36872 27106 120780 77570 80786 128843 84768 78950 14204 7537 -12967 -132353
26458a32353m457r408O391J7814L4670N1651Q1191M2115n0595j20498k6653O4243
$$ -132353 -136810 -146218 -139827 -122013 -87343 -35692 45499 87614 37019 -83479 -110132 -45889
26446d5889J24436M786j23888J2466O7938l98l0284K3172J6136k1494N129l6612
$$ -45889 78547 83333 -40555 -28089 39849 39451 9167 32339 48475 26981 32110 -4502
26434d502j156O9844J7330L0087m8666k3475N9178P5433P1559r4686l0017k7737
$$ -4502 -5658 64186 81516 111603 62937 39462 98640 174073 245632 150946 120929 93192
26422I3192j45780k5941k4992L3261L206N0804o731K7452o079M316J16045K2252
$$ 93192 -52588 -78529 -103521 -70260 -67054 -16250 -22981 4471 -1608 2708 118753 141005
26410A41005k7096K8714m9514M9410r3112j41970Q937k699N6790Q9842M2526L0212
$$ 141005 113909 142623 93109 142519 49407 -92563 -83626 -86325 -29535 60307 102833 133045
26398A33045n5549L7416O927N092J3582p4371o7768M8333K5227J5444n3706J5625
$$ 133045 77496 114912 121839 126931 140513 66142 -1626 46707 71934 87378 33672 49297
26386D9297Q673k9808N6109J5704k5166l1870n8335p403N6552P5296o5427q6479
$$ 49297 57970 28162 84271 99975 74809 42939 -15396 -22799 33753 109049 43622 -42857
26374d2857L9305O4296O0208l5314j6601l4137J8105P4314K3994l745l5293o8313
$$ -42857 -3552 60744 120952 85638 69037 34900 53005 127319 151313 147568 112275 43962
26362D3962r4229r4698j0885J30431J25476o7463o4482M678P7292R7301j8737
$$ 43962 -50267 -144965 -155850 -25419 100057 32594 -31888 -27210 50082 147383 128646
26351A28646J7776M6751k5396l0448q7066q8118K4325J8906p213m2990K822j9835
$$ 128646 146422 193173 167777 137329 50263 -37855 -13530 5376 -1837 -44827 -42005 -61840
26339f1840O6012R0385r2657j06242m3692Q705M2240M0636N8676j1694O5298Q416
$$ -61840 4172 94557 1900 -104342 -148034 -139329 -97089 -56453 2223 -9471 55827 64243
26327F4243m3152j6763J8603K8402O977Q7766j2016l4108m1527J23801K6913p277
$$ 64243 21091 4328 22931 51333 58310 146076 134060 99952 58425 182226 209139 201862
26315B01862j02978k4935N6590o4832P13j7871q7340o6544Q7035L5511j5882J15625
$$ 201862 98884 73949 130539 65707 66420 48549 -38791 -105335 -18300 17211 1329 116954
26303A16954O4744r547N2708Q6135j8457m7879k1504M24q5602O2286q4099n7771
$$ 116954 181698 172151 224859 310994 292537 244658 223154 223578 137976 200262 116163 58392
26291E8392R9178q4671m519M5666J8108l1817p7331o5575J0133J324J1220l7122
$$ 58392 157570 72899 68380 114046 132154 100337 23006 -42569 -32436 -31112 -19892 -57014
26279e7014l3129J10042l3848l23j0581r7004M6637P7445m1337q483Q5592Q3949
$$ -57014 -90143 19899 -13949 -14272 -24853 -121857 -75220 2225 -39112 -47595 37997 121946
26267A21946o6685l7424R7772K301L256j0719n6763K0652j8167m3842j1719R8641
$$ 121946 55261 17837 115609 117910 121166 110447 53684 74336 56169 12327 608 99249
26255I9249J34602k7340r5551o0814O923J6988n7731m246j6576J1087J23443J05614
$$ 99249 233851 206511 110960 50146 57069 74057 16326 12080 -4496 6591 130034 235648
26243B35648k705M6601k7694j9545m6018j00997n5424J9802N7235J8984p1243
$$ 235648 232943 279544 251850 232305 186287 85290 29866 49668 106903 125887 54644
26232E4644j13376J4067J32381L7364n4378m6060M7698m8620m8707n2228O3320
$$ 54644 -58732 -44665 87716 125080 70702 24642 72340 23720 -24987 -77215 -13895
26221a3895J3764K5952r43n1475j6040k9673j66357L3543Q1439n364J3975R2672
$$ -13895 -131 25821 24878 -26597 -42637 -72310 -238667 -205124 -123685 -129049 -115074 -22402
26209b2402N6960M8302o6049j40443O1219O1722K9869o5112M016L1461L6561J8690
$$ -22402 34558 82860 16811 -123632 -62413 -691 29178 -35934 -31918 -457 36104 54794
26197E4794N7880Q427k3111O2713m2286j06102k044K5799P4227P4918p5518o9328
$$ 54794 112674 121101 97990 160703 118417 12315 10271 36070 110297 185215 109697 40369
26185D0369N4619Q035k2257j9284M0650J4913J9182j8814j73269m1415L1460J4405
$$ 40369 94988 103023 80766 61482 102132 117045 136227 117413 -55856 -97271 -65811 -51406
26173e1406M1914L4871j7571l3146m8284N1954q3762L1850O6651L1194K1851J044
$$ -51406 -9492 25379 7808 -25338 -73622 -21668 -105430 -73580 -6929 24265 46116 47160
26161D7160j8723L443m3254N5334k3603j5637N050n4090j9592L183k6937l9240
$$ 47160 28437 31880 -11374 43960 20357 4720 9770 -44320 -63912 -60729 -87666 -126906
26149a26906N7808j8338N0442M0174R626q714L462J00370q0974l0127m1708m9575
$$ -126906 -69098 -87436 -36994 3180 12806 4092 7554 107924 26950 -3177 -44885 -94460
26137i4460J9452J24902Q311O642K0375q2447l6408J4405k3894Q7796M2716J0638
$$ -94460 -75008 49894 58205 64847 85222 2775 -33633 -19228 -43122 44674 87390 98028
26125I8028j874j10579l2728M9217o178k7172K073j2203m70L2823K1090M5776
$$ 98028 96154 -14425 -47153 2064 -4114 -31286 -29213 -41416 -41886 -9063 12027 57803
26113E7803L3508p7365r0216m733N1106K3639Q4237N9333q5384j40122N871M7552
$$ 57803 91311 13946 -76270 -81003 -29897 -6258 77979 137312 51928 -88194 -82323 -34771
26101c4771l3253j0321q2038j0298J09309j8651J4569j2567l9546o560P2694J42655
$$ -34771 -68024 -78345 -160383 -170681 -61372 -80023 -65454 -78021 -117567 -124127 -51433 91222
26089I1222R7677j80168j30666J22009O3453n272l9470K2580p7570K3562j4822
$$ 91222 188899 8731 -121935 74 63527 58255 18785 41365 -36205 -12643 -27465
26078b7465J655r020k1452l7434R755l2967N3484O2896o667J34807Q7908N1930
$$ -27465 -25810 -34830 -56282 -93716 -83961 -116928 -63444 -548 -7215 127592 215500 267430
26066B67430m0220J459j42121q2144j6938O235m1974L7151q1090n7596O6168J16771
$$ 267430 227210 228669 86548 4404 -12534 -6299 -48273 -11122 -92212 -149808 -83640 33131
26054C3131L5173j15659k8199Q0382k850L9920R6993O8245j50250j03601L0688
$$ 33131 68304 -47355 -75554 4828 1978 41898 138891 207136 56886 -46715 -16027
26043a6027l6966k4485k4078j4940J7260J6150M7850l5583m5717n6830Q154J71403
$$ -16027 -52993 -77478 -101556 -116496 -99236 -83086 -35236 -70819 -116536 -173366 -165212 6191
26031F191J27290m0561n6618n6978K1350j0406Q93K9581N268L7644Q0351K8814
$$ 6191 133481 92920 36302 -20676 674 -9732 -8839 20742 26010 63654 144005 172819
26019A72819j4800q2331l7080j9451r06j0915q1866l4819R3406J02084j1273m221
$$ 172819 158019 75688 38608 19157 18251 7336 -74530 -109349 -15943 86141 74868 70647
26007G0647r1905j5387R153k9595O7171j7010R685Q2118N2139q9546N9712o1004
$$ 70647 -21258 -36645 -27492 -57087 10084 -6926 2759 84877 137016 47470 107182 46178
25995D6178p0031j01414M3998Q2917J0735k9521j5096K0892p478L17o431k424
$$ 46178 -23853 -125267 -81269 1648 12383 -17138 -32234 -11342 -18820 -18503 -24934 -27358
25983b7358l4387k6543k8744o040J6213R4559M1154J0774o7633J8569P1114p9185
$$ -27358 -61745 -88288 -117032 -123072 -106859 -12300 28854 39628 -28005 -9436 61678 -17507
25971a7507j04158J3388R2608r85m5656o5450N2221o977m0276J12395P9724l7369
$$ -17507 -121665 -108277 -15669 -16654 -62310 -127760 -75539 -82516 -122792 -10397 69327 31958
25959C1958p4684L3139j0598J8829K7404k1316n0325j33412L2081M3977O6887
$$ 31958 -42726 -9587 -20185 -1356 26048 4732 -45593 -179005 -146924 -102947 -36060
25948c6060P2667j5783p9245r6675N960O020K8975P5204P5851p05n6585p8687
$$ -36060 36607 20824 -58421 -155096 -149136 -143116 -114141 -38937 36914 36209 -20376 -99063
25936i9063O314P0033j0673L8251O6655j9907o4742l7299N4767L397m147k0451
$$ -99063 -92749 -22716 -33389 4862 71517 51610 -13132 -50431 4336 7733 3586 -16865
25924a6865J1990J7652J2930o6023m066N3681K7826P9844p1415j22173K418O5057
$$ -16865 -4875 12777 25707 -40316 -44382 9299 37125 116969 45554 -76619 -74201 -9144
25912i144j056l5822K5449M4991J37054J1529j04969r328J8469O815J5823K9368
$$ -9144 -10200 -46022 -20573 24418 161472 173001 68032 58704 77173 83988 99811 129179
25900A29179M6156n030l3134K3160o1504j32409n7099m016P2549K1841k7217q357
$$ 129179 175335 170305 137171 160331 98827 -33582 -90681 -94697 -22148 -307 -27524 -35881
25888c5881O5869N046l898M0283J08170k7373j27423j01227K7876J39027l8990
$$ -35881 29988 35034 31136 71419 179589 152216 24793 -76434 -48558 90469 51479
25877E1479m6895J9873l810k7552J21927Q0906Q647j97027j59703K5622R6575
$$ 51479 4584 24457 20647 -6905 115022 195928 204575 7548 -152155 -126533 -29958
25866b9958J48910l5055l5026K0875q5918m9312L9324m1495j63371j5430L8615
$$ -29958 118952 83897 48871 69746 -16172 -65484 -26160 -67655 -231026 -246456 -207841
25855b07841N3615P900M7876P4250o2489m0413N3060N9205L8912L4452n4344q2897
$$ -207841 -154226 -146326 -98450 -24200 -86689 -127102 -74042 -14837 24075 58527 4183 -78714
25843g8714l304J849l7491P0823N5918n5472M4681N3280m2737r121K1222j0033
$$ -78714 -82018 -80169 -117660 -46837 9081 -46391 -1710 51570 8833 -288 20934 10901
25831A0901J3797M3800l0770o5411j7477r2027N7812L2722n1144k6441O571N4337
$$ 10901 24698 68498 37728 -27683 -45160 -137187 -79375 -46653 -97797 -124238 -117667 -63330
25819f3330Q677J8616k027M0907j21495m2520N4601l1166J07166R5323o9716o1285
$$ -63330 -54653 -36037 -38064 2843 -118652 -161172 -106571 -137737 -30571 64752 -4964 -66249
25807f6249J2050J04031N4018m3899q8576N850J9601l1584Q0382N4885k1634J2570
$$ -66249 -54199 49832 103850 59951 -28625 -22775 -3174 -34758 45624 100509 78875 91445
25795I1445M1649l3070K8888J26429J3900j36949J0724m0824l8535m5430o8335
$$ 91445 133094 100024 128912 255341 269241 132292 143016 102192 63657 18227 -50108
25784e0108J3716q195M6597J14637L8989j97482q1244R7994p748K7151K6171Q2485
$$ -50108 -36392 -44587 2010 116647 155636 -41846 -123090 -25096 -32844 -5693 20478 102963
25772A02963O8245k1659p2083k3395R1345m65K4918k4483j8353j29024o7181K4168
$$ 102963 171208 149549 77466 54071 145416 144951 169869 145386 127033 -1991 -69172 -45004
25760d5004m7848j1562N3833M093n7646m6014P3560O0003J8552j8567m7053j4759
$$ -45004 -92852 -104414 -50581 -46488 -104134 -150148 -76588 -16585 1967 -16600 -63653 -78412
25748g8412M6975J9502J4451N2482l8868l6839K1413K6574j1468k2069o6547m9913
$$ -78412 -31437 -11935 2516 54998 16130 -20709 704 27278 15810 -6259 -72806 -122719
25736a22719n1988J11700J32631l1259K1669J4737l1384M6314j413j6695q8285
$$ -122719 -174707 -63007 69624 38365 60034 74771 43387 89701 88288 71593 -16692
25725a6692J0113M6783m084k3777k0360j02498P1371N8570J4621o0623P14k6074
$$ -16692 -6579 40204 36120 12343 -8017 -110515 -39144 19426 34047 -26576 -25862 -51936
25713e1936o2616m0992n5019q1804k9482Q1947R5037J5967j5538O7392M3934P8986
$$ -51936 -114552 -155544 -210563 -292367 -321849 -239902 -144865 -128898 -144436 -77044 -33110 45876
25701D5876J8913L1390j8854N0385o2670j32227j4169N2479L4914j0736L5811
$$ 45876 64789 96179 77325 127710 65040 -67187 -81356 -28877 6037 -4699 31112
25690C1112K7158O8014O2772j2685m9774k5983M3k1037q0336M7226M3535j765
$$ 31112 58270 126284 189056 176371 126597 100614 100657 79620 -716 46510 90045 88280
25678H8280l2507l3091l8735M4349l3120m9730q7767p7833j9925J59755J12163
$$ 88280 55773 22682 -16053 28296 -4824 -54554 -142321 -220154 -240079 -80324 31839
25667C1839j6074l140k4930K048K6061O1117J55270p2955m5902m8581p0619K7292
$$ 31839 15765 12625 -12305 -10257 15804 76921 232191 159236 113334 64753 -5866 21426
25655B1426N1883n6254j20233k6978J1096l5577J33432M0828k5000K1849p5925
$$ 21426 73309 17055 -103178 -130156 -119060 -154637 -21205 19623 -5377 16472 -59453
25644e9453j3586k8252J9413l5451M6710J55504m4461k0327p3575K828n8912P851
$$ -59453 -73039 -101291 -81878 -117329 -70619 84885 40424 20097 -53478 -50650 -109562 -101711
25632a01711k6167Q747O1550K1865p6883n8827J3917M0237J00800j8438L0097
$$ -101711 -127878 -119131 -57581 -35716 -112599 -171426 -157509 -117272 -16472 -34910 -4813
25621d813J02232J6889j13554l6910J4613j762o4129N1205o407P0998P6478p0217
$$ -4813 97419 114308 754 -36156 -21543 -23305 -87434 -36229 -42636 28362 104840 34623
25609C4623o1953j0268n220K6730N0497R698L8389n4918n6317J1371M2069R7745
$$ 34623 -27330 -37598 -42818 -16088 34409 44107 82496 27578 -28739 -17368 24701 122446
25597A22446k4644q2542L414J2872J5966l3977l8298K4053j4568O3742k2270R4778
$$ 122446 97802 15260 18674 31546 47512 13535 -24763 -710 -15278 48464 26194 120972
25585A20972l7426k6446k1476L5240k5735M3736J12994j71r4490r7115j9198J9025
$$ 120972 83546 57100 35624 70864 45129 88865 201859 201688 107198 10083 -9115 9910
25573I910M9745P6386M2615j7960m7980q8940k840l9352j5538L1259N0946J29159
$$ 9910 59655 136041 178656 160696 112716 23776 20936 -18416 -33954 -2695 48251 177410
25561A77410M0975n0775n0806n3856L6900O788o8159l7707K7117N2305m812q3344
$$ 177410 218385 167610 116804 62948 99848 106636 38477 770 27887 80192 75380 -7964
25549g964q8870J0525O2307l8451n0340k6985J0172Q0485J26774m6580k813J545
$$ -7964 -96834 -86309 -24002 -62453 -112793 -139778 -129606 -49121 77653 31073 28260 29805
25537B9805p0049l3576j6649q946Q625J4772n4315K1663O4305L9526O8103K1629
$$ 29805 -40244 -73820 -90469 -99415 -90790 -76018 -130333 -108670 -44365 -4839 63264 84893
25525H4893j7483j4508l5622J8843N7992o524r2423k8599L5491m2472j5125l3773
$$ 84893 67410 52902 17280 36123 94115 87591 -4832 -33431 2060 -40412 -55537 -89310
25513h9310Q0576K9519J7810r3507R355J08450N7054O828m9883k9722O5926M0264
$$ -89310 -8734 20785 38595 -54912 -45557 62893 119947 126775 76892 47170 113096 153360
25501A53360r5235o3030n5092L2242J25084O0139r8593q9813M2718N1566r2553
$$ 153360 58125 -4905 -59997 -27755 97329 157468 58875 -30938 11780 63346 -29207
25490b9207J3732L9570Q0935p5304K454o0636j05532p4147l0006m2030J4641M4281
$$ -29207 -15475 24095 105030 29726 32180 -28456 -133988 -208135 -238141 -280171 -265530 -221249
25478b21249R5328M1351q14O307j8752k649O7964L2016j0800j17243j8355R7868
$$ -221249 -125921 -84570 -85384 -79077 -97829 -100478 -32514 -498 -11298 -128541 -146896 -49028
25466d9028O6961l5739n3590N8304N8862j2649J2506J02650m6161m4861J409q2717
$$ -49028 17933 -17806 -71396 -13092 45770 33121 45627 148277 102116 57255 58664 -24053
25454b4053l7229K6619N7739J1718o6010m8430m4636j8762P8962J24917Q6968
$$ -24053 -61282 -34663 23076 34794 -31216 -79646 -124282 -143044 -64082 60835 147803
25443A47803j25319r4084R0026K293p3313L1574J8479k0307O216J0223q35J16342
$$ 147803 22484 -71600 18426 20719 -52594 -21020 -2541 -22848 -16632 -6409 -7244 109098
25431A09098J0062n0440k1061r219J35548M4011n7691o4135M976n8521n2554n1531
$$ 109098 119160 68720 47659 38440 173988 217999 160308 96173 101149 42628 -9926 -61457
25419f1457J32229L8201k1280m1807N673l1887r1483N6487N519J7713K6628m401
$$ -61457 70772 108973 87693 45886 51559 19672 -71811 -15324 -9805 7908 34536 30135
25407C0135p9425R881Q900p3651n4705M9585M8913l9560k9871m5538R9397L3490
$$ 30135 -49290 -39409 -30509 -104160 -158865 -109280 -60367 -99927 -129798 -175336 -75939 -42449
25395d2449k0606P756r9050l6144O6114J26597n9459L2023L2037M0588l6242J5242
$$ -42449 -63055 -55299 -154349 -190493 -124379 2218 -57241 -25218 6819 47407 11165 26407
25383B6407N9152m5173N127O8497J7875k3418j6553N896r593l9417j19143j38379
$$ 26407 85559 40386 45513 114010 131885 108467 91914 97810 88217 48800 -70343 -208722
25371b08722O9712J82622J41498r4785p6205l8298P734L5676J7867M093M6324
$$ -208722 -139010 43612 185110 90325 14120 -24178 -16444 19232 37099 41192 87516
25360H7516J6639L3028j24986o0590P4284j113j16851j32144M5318R7768O1924
$$ 87516 104155 137183 12197 -48393 25891 24778 -92073 -224217 -178899 -81131 -19207
25349a9207k0254o8770L86J2237M2091j6966Q2064J0823r8259m96K5660O682m9056
$$ -19207 -39461 -108231 -107845 -95608 -53517 -70483 11581 22404 -75855 -76351 -50691 -44009 -93065
25336i3065J11960Q3904P4363k5437p4021o2880p0408k764k5897o071L9405M153
$$ -93065 18895 102799 177162 151725 77704 14824 -55584 -58348 -84245 -90316 -50911 -46758
25324d6758k6114n0838p1511k1172N7680P0484K6704J3626M3728L2849m2340N5202
$$ -46758 -72872 -123710 -195221 -216393 -158713 -88229 -61525 -47899 -4171 28678 -13662 41540
25312D1540K3579k9681L6766L973m4134N4223j09204j69857L1083N7256L471N9139
$$ 41540 65119 35438 72204 76177 32043 86266 -22938 -192795 -161712 -104456 -100985 -41846
25300d1846P4646j01918q7415M474q618l9571P3769N3718M767J4944Q6471M2243
$$ -41846 32800 -69118 -156533 -152059 -160677 -200248 -126479 -72761 -67994 -53050 33421 75664
25288G5664o3019j8177K5614M5380O2164r4515l5790j22264j14346J21161J78255
$$ 75664 12645 -5532 20082 65462 127626 33111 -2679 -124943 -239289 -118128 60127
25277F0127R3666j20984m2140N5288j2900K3325o8814j33908p3666l8405Q9128
$$ 60127 153793 32809 -9331 45957 33057 56382 -12432 -146340 -220006 -258411 -169283
25266a69283Q5283R6629J6628l1274j45367M0985P7505R8196N2702K3441r847
$$ -169283 -84000 12629 29257 -2017 -147384 -106399 -28894 69302 122004 145445 135598
25255A35598n324l9067n3106l9924M4955J03412L9611q1292j3604L5371m191o5710
$$ 135598 130274 91207 38101 -1823 43132 146544 186155 104863 91259 126630 122439 56729
25243E6729n079M3277M5358R115k6645k2715l6553K1810K3384P177k2427o2226
$$ 56729 51650 94927 140285 149400 122755 100040 63487 85297 108681 115858 93431 31205
25231C1205l2312j7452l4840m6769P5732O3973K0189K9195k4844p9285m4961L8258
$$ 31205 -1107 -18559 -53399 -100168 -24436 39537 59726 88921 64077 -15208 -60169 -21911
25219b1911J9513L6823m6402J4122k8320J5540l3380p9769n0305J2254L1357M1747
$$ -21911 -2398 34425 -11977 2145 -26175 -10635 -44015 -123784 -174089 -161835 -130478 -88731
25207h8731N8248L4995p73k6477k8620j9836N9203L3561J5524n6102j2738J962
$$ -88731 -30483 4512 3739 -22738 -51358 -71194 -11991 21570 37094 -19008 -31746 -29784
25195b9784J8797m1592l2436K6736o517l0824o9050P5606L9181P2914n489o3063
$$ -29784 -10987 -52579 -85015 -58279 -64796 -95620 -164670 -89064 -49883 23031 17542 -45521
25183d5521L141j2715K9570j3569M3701n1345L1216l337l3770l7431n1078M7838
$$ -45521 -42380 -55095 -25525 -39094 4607 -46738 -15522 -18859 -52629 -90060 -141138 -93300
25171i3300M2345k3922Q0317N9915k0555k5766O2117q158l1281M5671j1121J7812
$$ -93300 -50955 -74877 5440 65355 44800 19034 81151 72993 41712 87383 76262 94074
25159I4074M480j15184j01668M5207p1679O185k8257l0833J66971j2172j1046
$$ 94074 98554 -16630 -118298 -73091 -144770 -138585 -166842 -197675 -30704 -42876 -53922
25148e3922l0942o172M3858l2185M6404P5494m7420j13806n3061K9798R1982l0820
$$ -53922 -84864 -91036 -47178 -79363 -32959 42535 -4885 -118691 -171752 -141954 -49972 -80792
25136h0792j9562r79p0504J5058L1370M1563N7076K7391l0644k095J3607j2204
$$ -80792 -100354 -101333 -171837 -156779 -125409 -83846 -26770 621 -30023 -32118 -18511 -30715
25124c0715j4753K654P8027N7486j2661l1415J3402J1567J0854K23p3869j6001
$$ -30715 -45468 -42814 35213 92699 80038 48623 62025 73592 84446 84669 10800 -5201
25112e201L4956K0490J8246o0848j06247P3914Q5273L6179k685m65J1157M3028
$$ -5201 29755 50245 68491 7643 -98604 -24690 60583 96762 94077 93612 104769 147797
25100A47797Q0225q2007n6918p6230l2855p767j8239K1047N8980j3377q158k3602
$$ 147797 228022 146015 89097 12867 -19988 -27755 -45994 -24947 34033 20656 12498 -11104
25088a1104o5513l0884j1270O4320L1366R855j1737J29375M3297n5897K3069L2582
$$ -11104 -76617 -107501 -118771 -54451 -23085 -13230 -24967 104408 147705 91808 114877 147459
25076A47459R3378J7810p3776o6879j33591j03251k8389M9490J02259k6595m9552
$$ 147459 240837 258647 184871 117992 -15599 -118850 -147239 -97749 4510 -22085 -71637
25065g1637j9917O3336Q3437k4397J8338p920k5120m2322n555k5899Q1845L421
$$ -71637 -91554 -28218 55219 30822 49160 41240 16120 -26202 -31757 -57656 24189 27610
25053B7610j16766m649P1335k7186k0948O965O1824J29672K6019M3215m9201j20284
$$ 27610 -89156 -93805 -22470 -49656 -70604 -63639 -1815 127857 153876 197091 147890 27606
25041B7606p6834K2277K2253m2950n4682N5309L4979M3658l1101q5316k5861J25869
$$ 27606 -49228 -26951 -4698 -47648 -102330 -47021 -12042 31616 515 -84801 -110662 15207
25029A5207L9856r9476m0547k3300n5619k9422K1342M8047M4471P9149n3900k901
$$ 15207 55063 -44413 -84960 -108260 -163879 -193301 -171959 -123912 -79441 -292 -54192 -57093
25017e7093P4293R0812q7384n5445O2241O0778p6043o5946p09L3947k1392M535
$$ -57093 17200 108012 20628 -34817 27424 88202 12159 -53787 -54496 -20549 -41941 -37406
25005c7406p0484L5485J21181J1218N6521j13042j01255j0353M6130J02421l5791
$$ -37406 -107890 -72405 48776 59994 116515 3473 -97782 -108135 -62005 40416 4625
24994D625l1626L9634Q6902n9738m5249N033m0040K0036L0609N5873K8258p5956
$$ 4625 -27001 12633 99535 39797 -5452 -419 -40459 -20423 10186 66059 94317 18361
24982A8361m6716j1332M2595j5449J770n136L7691P2583j9526k8955L7036p6434
$$ 18361 -28355 -39687 2908 -12541 -10771 -15907 21784 94367 74841 45886 82922 6488
24970F488L9885L5728O667L7389q7247k18j7853K2928N0099M2305L55m4960r1365
$$ 6488 46373 82101 88768 126157 38910 38692 20839 43767 93866 136171 136526 91566 201
24957B01j15501N1529K5177m9447O0703k0168K6941M7881L8352R3411J7537m0814
$$ 201 -115300 -63771 -38594 -88041 -27338 -47506 -20565 27316 65668 159079 176616 135802
24945A35802q4066k202J5205J2215o6066J6683L0012L3868j30679r1202L37N8231
$$ 135802 51736 49534 64739 76954 10888 27571 57583 91451 -39228 -130430 -130093 -71862
24933g1862J2083P3757K6169n5281J1270K6991k7622n0868L5457K4368j09002
$$ -71862 -59779 13978 40147 -15134 -3864 23127 -4495 -55363 -19906 4462 -104540
24922a04540p0874O6834R8361J6140j28965J6873m2883j0881N3357m2390p7830
$$ -104540 -175414 -108580 -10219 5921 -123044 -106171 -149054 -159935 -106578 -148968 -226798
24911b26798m1452J6973J70844J20070N0665p4353r0015o7815Q3854k8976l0524
$$ -226798 -268250 -251277 -80433 39637 90302 15949 -74066 -141881 -58027 -87003 -117527
24900a17527N493J04230O1430q6279o9712P1519m8915j62147P3448Q6213p924
$$ -117527 -112034 -7804 53626 -32653 -102365 -30846 -79761 -241908 -168460 -82247 -90171
24889i0171k8481j7442O7582Q7286K6891m3735k8071j6806O7368P592m7616Q0
$$ -90171 -118652 -136094 -68512 18774 45665 1930 -26141 -42947 24421 32013 -15603 -15523
24877a5523p6524J6318M9085j02546Q9256k4494J0384j8204L3515r6741p9503
$$ -15523 -92047 -75729 -26644 -129190 -39934 -64428 -54044 -72248 -38733 -135474 -214977
24866b14977N2096m762M3672K1819j1262j58294P1745J93685L4767n560N816p0545
$$ -214977 -162881 -167643 -123971 -102152 -113414 -271708 -199963 -6278 28489 22929 28745 -41800
24854d1800J6559j3807j5242l1473m8683k0948L0567L512R4443k8151N2762O1966
$$ -41800 -25241 -39048 -54290 -85763 -134446 -155394 -124827 -121315 -26872 -55023 -2261 59705
24842E9705k0762n9385j07065j4603M7064m6277j00060J6952O1380P2269M4039
$$ 59705 38943 -20442 -127507 -142110 -95046 -141323 -241383 -224431 -163051 -90782 -46743
24831d6743m0047j3328P4153j7622n6753p9938N7756R9691K3730j6971l2355j9246
$$ -46743 -86790 -100118 -25965 -43587 -100340 -180278 -122522 -22831 899 -16072 -48427 -67673
24819f7673k0712R4925n9259j9366N5547J6759q6986L7163N4316n5071l2231n5481
$$ -67673 -88385 6540 -52719 -72085 -16538 221 -86765 -49602 4714 -50357 -82588 -138069
24807a38069l454J9698J6494n1782K6760P3385K9369L8965J9832K5519N9261P6210
$$ -138069 -141523 -121825 -105331 -157113 -130353 -56968 -27599 11366 31198 56717 115978 192188
24795A92188O0438m7263o3533n963N2642o0819r8433M6190o6432m7184L9194j7569
$$ 192188 252626 205363 141830 135867 188509 127690 29257 75447 9015 -38169 1025 -16544
24783a6544j6443j1803K0751L4244k1191L949Q979L7066Q4851M3203k700o4791
$$ -16544 -32987 -44790 -24039 10205 -10986 -7037 1942 39008 123859 167062 164362 99571
24771I9571r6658j31027l3898N3305N8518L1417k3233k1314l473P016k4072k2270
$$ 99571 2913 -128114 -162012 -108707 -50189 -18772 -42005 -63319 -66792 -59776 -83848 -106118
24759a06118M7678N8304R090J0521l2551m1498l5243l2339Q6838Q2900K3742p3651
$$ -106118 -58440 -136 8954 19475 -13076 -54574 -89817 -122156 -35318 47582 71324 -2327
24747b327m3716K8658J6887m9764p0212L2403n7866M8918R4652P4436K7287m6781
$$ -2327 -46043 -17385 -498 -50262 -120474 -88071 -145937 -97019 -2367 72069 99356 52575
24735E2575l4598k4726j04787j2100P0304Q8037k3226L9778O2399k1755L7873
$$ 52575 17977 -6749 -111536 -123636 -53332 34705 11479 51257 113656 91901 129774
24724A29774L5063k3244n6545k8020j8594m1713r4772L2928K7877q4596j9710
$$ 129774 164837 141593 85048 57028 38434 -3279 -98051 -65123 -37246 -121842 -141552
24713a41552M9404P3841N5365j6650J21124j530j33353j3349r2134l7730J22607
$$ -141552 -92148 -18307 37058 20408 141532 140002 6649 -6700 -98834 -136564 -13957
24702a3957P6466q2219j38713K3152Q4956R7750l3889R722J19270Q44m6897m6131
$$ -13957 62509 -19710 -158423 -135271 -50315 47435 13546 23268 142538 143382 96485 50354
24690E0354P2081k6344j24599m3588J26078J5094p630n1505N4182m5324n4661
$$ 50354 122435 96091 -28508 -72096 53982 69076 61446 9941 64123 18799 -35862
24679c5862m0103L9117k4490l2120K4216K0100J24317p112J9751m030j22856n0279
$$ -35862 -75965 -36848 -61338 -93458 -69242 -49142 75175 68063 87814 83784 -39072 -89351
24667h9351O1154J6877L0887P5088J7840p1130k3116m3071P848M965O9273K8337
$$ -89351 -28197 -11320 19567 94655 112495 41365 18249 -24822 -16974 -12009 57264 85601
24655H5601O1347L0806j43268j46160n472n8553Q4650N8920P3114J0482q0697
$$ 85601 146948 177754 34486 -111674 -117146 -175699 -91049 -32129 40985 51467 -29230
24644b9230q8740M3121N2135n8253j38955l5388O3082k3232l9807M2778J35707
$$ -29230 -117970 -74849 -22714 -80967 -219922 -255310 -192228 -215460 -255267 -212489 -76782
24633g6782M9730m1649M3529N7157L9164J1527q5627J1193O5768K1887r1067m5199
$$ -76782 -27052 -68701 -25172 31985 71149 82676 -2951 8242 74010 95897 4830 -40369
24621d0369k219o6792K5240P2259R042L5303L8165k7043n7936J9382P6115p8476
$$ -40369 -42588 -109380 -84140 -11881 -2839 32464 70629 43586 -14350 5032 81147 2671
24609B671j8265L0294m7217o0167l136L3434K4221p6731M1191P8622J12561N4555
$$ 2671 -15594 14700 -32517 -92684 -95820 -62386 -38165 -114896 -73705 4917 117478 172033
24597A72033n3914j03691l8725L806Q5361M5098j13947q0655j6291K0735K5509
$$ 172033 118119 14428 -24297 -20491 64870 109968 -3979 -84634 -100925 -80190 -54681
24586e4681k2381m7965k9945N8067J56623J4881k9108l0336j9747l1604J7865
$$ -54681 -77062 -125027 -154972 -96905 59718 74599 45491 15155 -4592 -36196 -18331
24575a8331J9341P526N7983k5607O018J4869l250j8290M793k7500j32916k8195
$$ -18331 1010 8536 66519 40912 46930 61799 58549 40259 45052 17552 -115364 -143559
24563a43559l3008O6879O7321J7895n308n7488p8646n7861J1455N6244J9918r047
$$ -143559 -176567 -109688 -42367 -24472 -29780 -87268 -165914 -223775 -212320 -156076 -136158 -145205
24551a45205q1675m5735R1010J09757N0541m1969n1405M1655k6764M3435K7807
$$ -145205 -226880 -272615 -181605 -71848 -21307 -63276 -114681 -73026 -99790 -56355 -28548
24540b8548k638O4541M798O88M4758l2952l887p1942q9426j839K8495L8565J41304
$$ -28548 -31186 33355 38153 38841 83599 50647 46760 -25182 -114608 -116447 -87952 -49387 91917
24527I1917O9430r9280N2435n369M9546o5722O5022r4110j39292j2834J2862o316
$$ 91917 161347 62067 114502 109133 158679 92957 157979 63869 -75423 -88257 -75395 -81711
24515h1711l6790o39Q5157q8027l2842J18987N0970k2450j39289j34412r364J73647
$$ -81711 -118501 -119140 -33983 -122010 -154852 -35865 15105 -7345 -146634 -281046 -290410 -116763
24503a16763O0889K0302J0189q481n5579j595J14946J00249n1195p7024j0387
$$ -116763 -55874 -35572 -25383 -33864 -89443 -91038 23908 124157 72962 -4062 -14449
24492a4449J04532N7696M0181l10O3532n0606m1474o1211M6481k4775j24864k1992
$$ -14449 90083 147779 187960 187650 251182 200576 159102 97891 144372 119597 -5267 -27259
24480b7259L495l4888K0929K5715L5051M1945K0414j7878j08975K2332n3152L2940
$$ -27259 -23764 -58652 -37723 -12008 23043 64988 85402 67524 -41451 -19119 -72271 -39331
24468c9331Q7066L8697j6417n2636Q661L3581j00391k3339L3129P6363R729p3889
$$ -39331 47735 86432 70015 17379 26040 59621 -40770 -64109 -30980 45383 55112 -18777
24456a8777l5355M570m0807K6190l1120J0048Q7439l4814n0302m1129J12006M0735
$$ -18777 -54132 -49562 -90369 -64179 -95299 -85251 2188 -32626 -82928 -124057 -12051 28684
24444B8684Q4434m702m8794j53258r0683Q4657P5503M6970J13m4748k1090P7909
$$ 28684 113118 108416 59622 -93636 -184319 -99662 -24159 22811 22924 -21824 -42914 34995
24432C4995j5060M0835r3888j01773O5946R7620J1086n4826J905L6296P4891k0582
$$ 34995 19935 60770 -33118 -134891 -68945 28675 39761 -15065 -13160 23136 98027 77445
24420G7445j20976m3963L2004L7404P5468q500m6022l7227p8527j11327L197J36378
$$ 77445 -43531 -87494 -55490 -18086 57382 48882 2860 -34367 -112894 -224221 -221024 -84646
24408h4646P5440J1068k2394L936l395j18636q6787L4479L3706k2095J8703R0290
$$ -84646 -9206 1862 -20532 -16596 -19991 -138627 -225414 -190935 -157229 -179324 -160621 -70331
24396g0331N0552N0681l687P3942j6460J7091j1734O2337k3929k6925n2740o5549
$$ -70331 -19779 30902 27215 101157 84697 101788 90054 152391 128462 101537 48797 -16752
24384a6752M0355J090m6701o8755K506N6554K6672o0130n6461m0841M8750J35109
$$ -16752 23603 24693 -22008 -90763 -88257 -31703 -5031 -65161 -121622 -162463 -113713 21396
24372B1396R4544j6092R5976n3965j09202j8816K4737p4899N1939O9995j26573
$$ 21396 115940 99848 195824 141859 32657 13841 38578 -36321 15618 85613 -40960
24361d0960m4436m583L9430J270r6226j3366L4983L9392L0416o836O6910k4479
$$ -40960 -85396 -89979 -50549 -49279 -145505 -158871 -123888 -84496 -54080 -60916 5994 -18485
24349a8485K0604J01193j1054N2768J11302m8378j63848j20168Q0831N0736J6046
$$ -18485 2119 103312 92258 145026 256328 207950 44102 -76066 4765 55501 71547
24338G1547o1225k3103p5583q2002P7361J2920m2213n4488J063O5128K1408J5831
$$ 71547 10322 -12781 -88364 -170366 -93005 -80085 -122298 -176786 -175723 -110595 -89187 -73356
24326g3356l179J63747k4371j03565L1603p0713j06563N1791J15476J20254J9607
$$ -73356 -76535 87212 62841 -40724 -9121 -79834 -186397 -134606 -19130 101124 120731
24315A20731K1009o3153J5865n7108m3897O850N5382k2007m8005J8772k1105l7828
$$ 120731 141740 78587 94452 37344 -6553 297 55679 33672 -14333 4439 -16666 -54494
24303e4494O1859n433m0458P5938j6891m5838q7946M8412k9325j9289P3162N3008
$$ -54494 7365 1932 -38526 37412 20521 -25317 -113263 -64851 -94176 -113465 -40303 12705
24291A2705k8488k5789L6987j0983p4K6635O2160P3642N3361m7363j16987j03077
$$ 12705 -15783 -41572 -4585 -15568 -15642 10993 73153 146795 200156 152793 35806 -67271
24279f7271J5637L5003J21350p145k2011K4713L9711n2280p225o0031M608n104
$$ -67271 -51634 -16631 104719 97574 75563 100276 139987 87707 80482 20451 25059 19955
24267A9955K9895r037j8357K8875M6661l6315m3382l3426j949P4234q420k2782
$$ 19955 49850 40813 22456 51331 97992 61677 18295 -15131 -17080 57154 48734 25952
24255B5952j4548l0189l114O1628L5652j03396r846Q6534J9811j11597q1222J7135
$$ 25952 11404 -18785 -21899 39729 75381 -28015 -37861 48673 68484 -43113 -124335 -107200
24243a07200m7896j1049R9423M5025n4833m2677j5996l2684m2805n888K17777
$$ -107200 -155096 -166145 -66722 -21697 -76530 -119207 -135203 -167887 -210692 -216580 1197
24232A197L9789m4657k3711j6751N3280M6577N2023l7813m9647J1114J41990O3020
$$ 1197 40986 -3671 -27382 -44133 9147 55724 107747 69934 20287 31401 173391 236411
24220B36411j15501n4163l8003j6487J36005O7125j04113p080J0819r6433k3575
$$ 236411 120910 66747 28744 12257 148262 215387 111274 104194 115013 18580 -4995
24209d995L7571m8331m9193L5199P0832L4710M050l8128k6451K4303k6857Q3921
$$ -4995 32576 -15755 -64948 -29749 41083 75793 79843 41715 15264 39567 12710 96631
24197I6631J2624Q1221J3240k4114q4940q2307q1442O1655J26257N0184k8734
$$ 96631 109255 190476 203716 179602 94662 12355 -69087 -7432 118825 169009 140275
24186A40275J5940k6443L9153l8070j32077q2340P2931J03383J0691m9116o0797
$$ 140275 156215 129772 168925 130855 -1222 -83562 -10631 92752 103443 54327 -6470
24175f470n5593k3270K846p3617k8578l372L5200j7049K7407J8482J0752O659
$$ -6470 -62063 -85333 -82487 -156104 -184682 -188054 -152854 -169903 -142496 -124014 -113262 -106603
24163a06603p0977L0486O5838N1189l416j74704l2791O1763L3150J6728J10463
$$ -106603 -177580 -147094 -81256 -30067 -33483 -208187 -240978 -179215 -146065 -129337 -18874
24152a8874K9329J9671K003l5848m5400j5835j4311R3070J30319k447q0615n1828
$$ -18874 10455 30126 32129 -3719 -49119 -64954 -79265 13805 144124 141677 61062 9234
24140I234R116q1586m1585J0419K140r2558J7431P6502K2212K1447O8472M0106
$$ 9234 18350 -63236 -104821 -94402 -92262 -184820 -167389 -90887 -68675 -47228 21244 61350
24128F1350M2765n0176j00468R77k6744L4312J0541Q4589J08014m1810r1521q2606
$$ 61350 104115 53939 -46529 -45552 -72296 -37984 -27443 57146 165160 123350 31829 -50777
24116e0777J66511Q1416o3004j6679l4866n1909n6639n5147P2529K1168q733k0402
$$ -50777 115734 197150 134146 117467 82601 30692 -25947 -81094 -8565 12603 3870 -16532
24104a6532p971P7694o5422J5889K5068n3241M503l0142j10232P5313P5677J29020
$$ -16532 -24503 53191 -12231 3658 28726 -24515 -20012 -50154 -160386 -85073 -9396 119624
24092A19624M8483m8910j12644j1521L0181o6285p9983J9040j476l8347J6655
$$ 119624 168107 119197 6553 -4968 25213 -41072 -121055 -102015 -103491 -141838 -125183
24081a25183N2624J38213k7132l2328k9933k2473n0136J15451N7630p7308r0271
$$ -125183 -72559 65654 38522 6194 -23739 -46212 -96348 19103 76733 -575 -90846
24070i0846J5534L3095K535q4110P6271P7554m2039J14430j4648q5254L6032m1516
$$ -90846 -75312 -42217 -39682 -123792 -47521 30033 -12006 102424 87776 2522 38554 -2962
24058b962M3898J6890K6145j29081P313O7854j6263k5250m671k9535R359K5297
$$ -2962 40936 57826 83971 -45110 -37797 30057 13794 -11456 -16127 -45662 -36303 -11006
24046a1006l6269j1387n9904n3300P253K4928J0672O2841M3207p3375M1727K1883
$$ -11006 -47275 -58662 -118566 -171866 -164613 -139685 -129013 -66172 -22965 -96340 -54613 -32730
24034c2730m031j3763L1876j6730j9303N7693P5920j2541p4200n5180j6046J6084
$$ -32730 -36761 -50524 -18648 -35378 -54681 3012 78932 66391 -7809 -62989 -79035 -62951
24022f2951n5875l5321J7144K6748L8551m0585k2625K2015m473k7298N8445R949
$$ -62951 -118826 -154147 -137003 -110255 -71704 -112289 -134914 -112899 -117372 -144670 -86225 -76276
24010g6276m0106q556K407O3077K5987N4116J6959K3840j879l2903l0391l0067
$$ -76276 -116382 -124938 -122531 -59454 -33467 20649 37608 61448 59569 26666 -3725 -33792
23998c3792m535k3550m6926p0485j0072n526R3431J19873M8627p3147q8631M965
$$ -33792 -38327 -61877 -108803 -179288 -189360 -194886 -101455 18418 67045 -6102 -94733 -89768
23986h9768J26598l5681N8031N8749o1718r1116j2952J5432k7627m7326p7537
$$ -89768 36830 1149 59180 117929 56211 -34905 -47857 -32425 -60052 -107378 -184915
23975a84915J00827N8008j0002m613J00753O3298k6901o7343J7806k291K9760
$$ -184915 -84088 -26080 -36082 -40695 60058 123356 96455 29112 46918 44627 74387
23964G4387J4110j8455p4906j1794r529N121L5415K260m6802M8209j0469O1049
$$ 74387 88497 70042 -4864 -16658 -26187 -21066 14349 16609 -30193 18016 7547 68596
23952F8596P4598n7347j48451k7070M2375j6065p401J28699L2738o7458J0341
$$ 68596 143194 85847 -62604 -89674 -47299 -63364 -70765 57934 90672 23214 33555
23941C3555K0955J7962q2844N371n0744n2905Q6429R5884m1734n2449o4989j01715
$$ 33555 54510 72472 -10372 -5001 -55745 -108650 -22221 73663 31929 -20520 -85509 -187224
23929a87224l0552Q0752J31797L8753j07337j11368l6400O6423J81457M9042o4576
$$ -187224 -217776 -137024 -5227 33526 -73811 -185179 -221579 -155156 26301 75343 10767
23918A0767j04523n1664O9173p406j0923k362J03498R9222m713j8297j4653J7717
$$ 10767 -93756 -145420 -76247 -83653 -94576 -96938 6560 105782 101069 82772 68119 85836
23906H5836m7801k2078k3680j3697n2528m6502p3401R9545P0938O7581n5306m5839
$$ 85836 38035 15957 -7723 -21420 -73948 -120450 -193851 -94306 -23368 44213 -11093 -56932
23894e6932O7733j0535o4813o0085n0021M767N663n3775o4071M4352J06438K2264
$$ -56932 10801 266 -64547 -124632 -174653 -169886 -164223 -217998 -282069 -237717 -131279 -109015
23882a09015M3054n7541O5489P6611l7100l7401O6617N4125n1291k9751K3585
$$ -109015 -65961 -123502 -58013 18598 -18502 -55903 10714 64839 13548 -16203 7382
23871G382K1359K354j27781q1885k1094J251P403n1283R1334J29426l0318k6246
$$ 7382 28741 31095 -96686 -178571 -199665 -198414 -191011 -242294 -150960 -21534 -51852 -78098
23859g8098o338M3014L0413M2645k1052q5300k8080M5871K6489P6617L2145o5288
$$ -78098 -84436 -41422 -11009 31636 10584 -74716 -102796 -56925 -30436 46181 78326 13038
23847A3038q5206L6389L4069L6677J7843n1467o5255P689j7214k0300K940J44932
$$ 13038 -72168 -35779 -1710 34967 52810 1343 -63912 -56223 -73437 -93737 -90797 54135
23835E4135j09510p2919O0330K5179K949K3936J702L3846m5164K5360l1554o298
$$ 54135 -55375 -128294 -67964 -42785 -39836 -15900 -14198 19648 -25516 -156 -31710 -38008
23823c8008k290K1377P2240O0556n1258n5488j06531J7406k9j3238m0919K6146
$$ -38008 -40298 -18921 53319 113875 62617 7129 -99402 -81996 -82025 -95263 -136182 -110036
23811a10036P2864p8183m6673P9190L2150K3811l3201Q0176J8089n5435l3622
$$ -110036 -37172 -115355 -162028 -82838 -50688 -26877 -60078 20098 38187 -17248 -50870
23800e0870J29501R4183R846m4567L083K4280j3094m6819k7873j25209M9497J14153
$$ -50870 78631 172814 182660 138093 141176 165456 152362 105543 77670 -47539 1958 116111
23788A16111l4432l9334N4653l5810N01p9628J106n7157J8345K4591j7631K6148
$$ 116111 81679 42345 96998 61188 61689 -17939 -16833 -73990 -55645 -31054 -48685 -22537
23776b2537M6227J3128J1199K8835L045m4980o736q1746M889L2270Q471P0594
$$ -22537 23690 36818 48017 76852 79897 34917 28181 -53565 -48676 -16406 -7935 62659
23764F2659j2384K9956j03206n2100L4704P7805p1144n8061q357j1976J6365O272
$$ 62659 50275 80231 -22975 -75075 -40371 37434 -33710 -91771 -100128 -112104 -95739 -89467
23752h9467j3436o5131J1249J4673O4149N6637N4653L9107n1731j00389N8552
$$ -89467 -102903 -168034 -156785 -142112 -77963 -21326 33327 72434 20703 -79686 -21134
23741b1134J3375m1445l6621L0017K2146L3338o554l1242J0754l7002R480K4506
$$ -21134 -7759 -49204 -85825 -55808 -33662 -324 -6878 -38120 -27366 -64368 -54888 -30382
23729c0382M7389l0294J0758n7990K1510O4849m5780p5683M4741K7735q9451n4723
$$ -30382 17007 -13287 -2529 -60519 -39009 25840 -19940 -95623 -50882 -23147 -112598 -167321
23717a67321J9806J15823N5361o0926k9842P2579r756o793j39638l996J29002
$$ -167321 -147515 -31692 23669 -37257 -67099 5480 -4276 -11069 -150707 -154703 -25701
23706b5701O9206o4073l5927J5721M6224O4572k1568L4803M0534n763j7006p0298
$$ -25701 43505 -20568 -56495 -40774 5450 70022 48454 83257 123791 118028 101022 30724
23694C0724k6394o3270q1752l9328J3122o584N617k4486Q2204P7379K2486j11837
$$ 30724 4330 -58940 -140692 -180020 -166898 -173482 -167865 -192351 -110147 -32768 -10282 -122119
23682a22119O5084J6956p204k1506m7362P7508M1702J2610p1816K1333L1024K6170
$$ -122119 -57035 -40079 -47283 -68789 -116151 -38643 3059 15669 -56147 -34814 -3790 22380
23670B2380J6493O6530m4969r1689P2851J32294P795n3491l1508m1060j4648j10718
$$ 22380 38873 105403 60434 -31255 41596 173890 181685 128194 96686 55626 40978 -69740
23658f9740m1738J11247L7665o29k1216k9683M5285K2899n6520n9650M7603M3666
$$ -69740 -111478 -231 37434 36805 15589 -14094 31191 54090 -2430 -62080 -14477 29189
23646B9189N5723M7738J7303r7588n212r423p7472o196o6605P6816O7637l2547
$$ 29189 84912 132650 149953 52365 47153 37730 -39742 -45938 -112543 -35727 31910 -637
23634f37L859o3233k1747P7836N6009O7488m4619j7112o9067j10335n8459n6094
$$ -637 3222 -60011 -81758 -3922 52087 119575 74956 57844 -11223 -121558 -180017 -236111
23622b36111J49813M9421q138l4918O1167j0341j1540p5461O0299J49527M9127
$$ -236111 -86298 -36877 -45015 -79933 -18766 -29107 -40647 -116108 -55809 93718 142845
23611A42845N354j6860l2997o5742L070K6740n5357K4271O4175j37847j07540
$$ 142845 148199 131339 98342 32600 35670 62410 7053 31324 95499 -42348 -149888
23600a49888N1197k19o0351J0288O662Q0311K1763J1494L4707o0877o7866l9598
$$ -149888 -98691 -98910 -159261 -148973 -142311 -62000 -40237 -28743 5964 -54913 -122779 -162377
23588a62377P0647J19145n5968l9966O3603K9518L188l5352j2456N4400l1455
$$ -162377 -91730 27415 -28553 -68519 -4916 24602 27790 -7562 -20018 34382 2927
23577B927Q4889o607K4462j345J5691N795l2750m5062L9523N0221r017l4018j00065
$$ 2927 87816 81209 105671 104326 120017 125812 93062 48000 87523 137744 128727 94709 -5356
23564e356J1535O9310J1561o3531j3265q749k4058j8966K1254j5050L3741J2503
$$ -5356 6179 75489 87050 23519 10254 1505 -22553 -41519 -20265 -35315 -1574 10929
23552A0929j10517O363L8602n438N4191k4690r740K8531N0061L0137j07060k649
$$ 10929 -99588 -93225 -54623 -60061 -5870 -30560 -40300 -11769 38292 68429 -38631 -41280
23540d1280l3922N944O6226q1440p0190J17682J11243J8602j71135o2104m5622
$$ -41280 -75202 -69258 -3032 -84472 -154662 -36980 74263 92865 -78270 -140374 -185996
23529a85996j64P6786o156OJ50586N604n051M2720k8981k0689m5923k6408J07033
$$ -185996 -186160 -109374 -115530 -115524 35062 40666 35615 78335 49354 28665 -17258 -43666 63367
23516F3367k014m6610L5965L9149J05655n142j51399q3913n209Q4400k2646o059
$$ 63367 61353 14743 50708 89857 195512 190370 38971 -44942 -50151 34249 11603 5544
23504E544r514l2573l3822O2715L7448J11715k1187j58785m5332L0829j456k3716
$$ 5544 -3970 -36543 -70365 -7650 29798 141513 120326 -38459 -83791 -52962 -54418 -78134
23492g8134j842R5000m7914p9089n3979m3720J50721L6346m4344K3756R9476N5639
$$ -78134 -79976 15024 -32890 -111979 -165958 -209678 -58957 -22611 -66955 -43199 56277 111916
23480A11916K8508N7397m4431j98193o4205M0377L6931r9239N4303Q170o296n6523
$$ 111916 140424 197821 153390 -44803 -109008 -68631 -31700 -130939 -76636 -68466 -74762 -131285
23468a31285L890J03416N1022L8274q188l7196j3167N5404k4270L899N3155n276
$$ -131285 -127395 -23979 27043 65317 57129 19933 6766 62170 37900 41799 94954 89678
23456H9678K9158j44740m9500M1383o0684j8369J71944L9226r395p963m9196J8936
$$ 89678 118836 -25904 -75404 -34021 -94705 -113074 58870 98096 88701 80738 31542 50478
23444E0478O2685k5211j3112l596l5323o8041n6670j2186N360p095L0531P1082
$$ 50478 113163 87952 74840 71244 35921 -32120 -88790 -100976 -95616 -102711 -72180 -1098
23432a098L445p8315q6545k839Q5574J4143j02012K2929J42024P8176O2739k1238
$$ -1098 2347 -75968 -162513 -165352 -79778 -65635 -167647 -144718 -2694 75482 138221 116983
23420A16983k6102m7844J4769K2082j504K0493j8147n6383o9578O5966L4328J13806
$$ 116983 90881 43037 57806 79888 78384 98877 80730 24347 -45231 20735 55063 168869
23408A68869K732j17541j48138o9414N3728K5102O2775Q1360N2620n6778J1248
$$ 168869 171601 54060 -94078 -163492 -109764 -84662 -21887 59473 112093 55315 66563
23397F6563K7857l2258j3847K7230K684m9679M6993j6124N337j03804o9145M584
$$ 66563 94420 62162 48315 75545 78229 28550 75543 59419 64756 -39048 -108193 -103609
23385a03609K000J16444J13840j7798M3428j54394r9843O7972L7775M6546M619
$$ -103609 -101609 14835 128675 110877 154305 -89 -99932 -31960 5815 52361 56980
23374E6980q4151o1371K5361p013k6731L2206l8436Q0002M0088k0339K753k493
$$ 56980 -27171 -88542 -63181 -70194 -96925 -64719 -103155 -23153 16935 -3404 -651 -3144
23362c144K5161l2666k3832k6772r4840K2431O3444j9768p0991N4768N4748m1860
$$ -3144 22017 -10649 -34481 -61253 -156093 -133662 -70218 -89986 -160977 -106209 -51461 -93321
23350i3321o1311p2051P4620J4796l7639n6021N2042k0634l3340P3465J7347m1333
$$ -93321 -154632 -226683 -152063 -137267 -174906 -230927 -178885 -199519 -232859 -159394 -142047 -183380
23338a83380o2033N1832J23535P9412r768m8662k8180R5050K8756j20223j01708
$$ -183380 -245413 -193581 -70046 9366 -402 -49064 -77244 17806 46562 -73661 -175369
23327a75369K7529R7620k0174j8528j1882M0541n4081j1822J8898q5972k3746
$$ -175369 -147840 -50220 -70394 -88922 -100804 -60263 -114344 -126166 -107268 -193240 -216986
23316b16986L3784Q0165O4571n565O5932R7487k919m0405q1689p3274q0837j7182
$$ -216986 -183202 -103037 -38466 -44031 21901 119388 116469 76064 -5625 -78899 -159736 -176918
23304a76918N8338N3048P8546J5265M0501L4342m593l1436l7147M901k7710L620
$$ -176918 -118580 -65532 13014 28279 68780 103122 98529 67093 29946 34847 7137 10757
23292A0757n6635m1537J3573M3146M2164N313L9165j36095j3954K2706L1869m3311
$$ 10757 -45878 -87415 -73842 -30696 11468 16781 55946 -80149 -94103 -71397 -39528 -82839
23280h2839q928n4178M8277l7482L4459P6080J02769P2288j8457j13487n5350
$$ -82839 -91767 -145945 -97668 -135150 -100691 -24611 78158 150446 131989 18502 -36848
23269c6848r8372L1386J49261K6881o9748k4364k2427J7647n0508J246k5250L2300
$$ -36848 -135220 -103834 45427 72308 2560 -21804 -44231 -26584 -77092 -75846 -101096 -68796
23257f8796L6273q1108m7891K4030Q129k5861O8835j580j1356m6628n0292O659
$$ -68796 -32523 -113631 -161522 -137492 -129363 -155224 -86389 -87969 -99325 -145953 -196245 -189586
23245a89586k7526j0306J5362J09940L1465p6938R923J04M0043m6853Q429K4829
$$ -189586 -217112 -227418 -212056 -102116 -70651 -147589 -137666 -137562 -97519 -144372 -135943 -111114
23233a11114L0621J1676J2086Q0560R9548j1719o7311q2032o674l7279Q5764L9028
$$ -111114 -80493 -68817 -56731 23829 123377 111658 44347 -37685 -44359 -81638 4126 43154
23221D3154M7383q0928k6465O135j006k4797N4370O7381l6n0620J0512j9341m6341
$$ 43154 90537 9609 -16856 -10721 -11727 -36524 17846 85227 85191 34571 45083 25742 -20599
23208b0599n6473P041K8678o5666k6794Q8026J19315N0941K5278m2956o6069n116
$$ -20599 -77072 -70031 -41353 -107019 -133813 -45787 73528 124469 149747 106791 40722 35606
23196C5606n2544p5603K270J48135K6772j28766r7639j367N2536N8985l375M2774
$$ 35606 -16938 -92541 -90271 57864 84636 -44130 -141769 -143136 -90600 -31615 -34990 7784
23184G784o2372N2467M6625m5736K0233J018J5170J1634q7343J6663m0692J6669
$$ 7784 -54588 -2121 44504 -1232 19001 20019 35189 46823 -40520 -23857 -64549 -47880
23172d7880L5774r809o3693Q1299j2072n5483L4832O5935N6892L2727r2988j03639
$$ -47880 -12106 -21915 -85608 -4309 -16381 -71864 -37032 28903 85795 118522 25534 -78105
23160g8105o375R8192J07735K1742j29591j04973l7071K8531O3909j03896k4729
$$ -78105 -84480 13712 121447 143189 13598 -91375 -128446 -99915 -36006 -139902 -164631
23149a64631J08820M9909l6153k9941J1357Q9341J03276L8322o2341o7296k7705
$$ -164631 -55811 -5902 -42055 -71996 -60639 28702 131978 170300 107959 40663 12958
23138A2958N3838L5767p7425q5229J1389M0797Q7754L9864n770j27421J06483
$$ 12958 66796 102563 25138 -60091 -48702 -7905 79849 119713 113943 -13478 93005
23127I3005R4227q0027n0938L9940m1694j11213m7609J02644Q4392K1205m0069
$$ 93005 187232 107205 56267 96207 54513 -56700 -104309 -1665 82727 103932 63863
23116F3863M9818J17585k7677j33855n5045o7078o9224l8297p6508L003J32309
$$ 63863 113681 231266 203589 69734 14689 -52389 -121613 -159910 -236418 -233415 -101106
23105a01106J51423m2986m7108N7239J0232M3301m1304l0560L1745j0191K0907
$$ -101106 50317 7331 -39777 17462 27694 70995 29691 -869 30876 20685 41592
23094D1592q0026k6164m7420p0859l2143J9992M6449N5179O2477L857n8530l3331
$$ 41592 -38434 -64598 -112018 -182877 -215020 -195028 -148579 -93400 -30923 -27066 -85596 -118927
23082a18927R3930R9820k8464R518m1041j18296k2442J54787k4308k4874J1930
$$ -118927 -24997 74823 46359 55877 14836 -103460 -125902 28885 4577 -20297 -8367
23071h367J4625L5998j7310m4920p2003L5842J1497j6095M0521M0451j9589r2616
$$ -8367 6258 42256 24946 -19974 -91977 -56135 -44638 -60733 -20212 20239 650 -91966
23059i1966J7513K9598M1491K8693L1065K864k8713k9012q155L4595N7293q6387
$$ -91966 -74453 -44855 -3364 25329 56394 59258 30545 1533 -6622 27973 85266 -1121
23047a121n9355Q4749L4681j2152j14577P0077P1328K6958l9408j4789k6992k8397
$$ -1121 -60476 24273 58954 46802 -67775 2302 73630 100588 61180 46391 19399 -8998
23035h998P886q1097K5545k345N3160J8613j02482R807P2180M5171M6732J776
$$ -8998 -1112 -82209 -56664 -59009 -5849 12764 -89718 -79911 -7731 37440 84172 85948
23023H5948m0020j5639K8388r707n8501N5264L9566N6002j09580J958R1343J3555
$$ 85948 45928 30289 58677 48970 -9531 45733 85299 141301 31721 33679 125022 138577
23011A38577p9137j835l6729l6858Q3104r795M2125N0117p1940K1694l4855r0253
$$ 138577 59440 57605 20876 -15982 67122 57327 99452 149569 77629 99323 64468 -25785
22999b5785q9585m6629M6846K3660p1051N960J38046J23735M4092K0131J7627
$$ -25785 -115370 -161999 -115153 -91493 -162544 -156584 -18538 105197 149289 169420 187047
22988A87047l1695p7802l8148j5238k0664j8395p507o110J34532L6892j44351
$$ 187047 155352 77550 39402 24164 3500 -14895 -22402 -28512 106020 142912 -1439
22977a439n6992l279J06943k945p0648M3094n079k0635n475j09738k8178J4602
$$ -1439 -58431 -61710 45233 42288 -28360 14734 9655 -10980 -16455 -126193 -154371 -139769
22965a39769L963N5082k9959K7816J45191N4354O0280l6050k9911j03928Q0579
$$ -139769 -135806 -80724 -110683 -82867 62324 116678 176958 140908 110997 7069 87648
22954H7648r6855m7809J2203R9860P7876J4058P1618l3405j16108l2422k3754
$$ 87648 -9207 -57016 -44813 55047 132923 146981 218599 185194 69086 36664 12910
22943A2910m7514o933J89n5061k8058J5245J46591l0835q5181o4000M8386j2050
$$ 12910 -34604 -41537 -41348 -96409 -124467 -109222 37369 6534 -78647 -142647 -94261 -106311
22931a06311m880M2677j0418k7378l9560P8918L5689L7891k1906M5135n8943K0161
$$ -106311 -111191 -68514 -78932 -106310 -145870 -66952 -31263 6628 -15278 29857 -29086 -8925
22919h925k162p571l6596O4682r9371j14367q9610O8775J17152R587K659L1160
$$ -8925 -11087 -18658 -55254 9428 -89943 -204310 -293920 -225145 -107993 -98406 -95747 -64587
22907f4587K1887k8015M1417J00239k515j0315k3623N2698j7315k5433J0088M9525
$$ -64587 -42700 -70715 -29298 70941 68426 58111 34488 87186 69871 44438 54526 104051
22895A04051P993L1645n5369p3470n6073o390K9389j9029J21423N0977n2180m9068
$$ 104051 112044 143689 88320 14850 -41223 -47613 -18224 -37253 84170 135147 82967 33899
22883C3899k116q0767k393j659K7278r49N3683R115m4657n8353J1222J2296L9105
$$ 33899 31783 -48984 -51377 -53036 -25758 -26707 26976 36091 -8566 -66919 -55697 -43401 -4296
22870d296k6650L0014Q3907J36741K2004o5146r5085l0066P7837m231K2549j25682
$$ -4296 -30946 -932 82975 219716 241720 176574 81489 51423 129260 125029 147578 21896
22858B1896r9621K4059q4295j2247J34504M1777K0614J1493m2862p333l2588p0787
$$ 21896 -77725 -53666 -137961 -150208 -15704 26073 46687 58180 15318 7985 -24603 -95390
22846i5390P1097R66p4854r697N2321P3170O6725O778r4556l8491m6038m7858
$$ -95390 -24293 -23327 -98181 -107878 -55557 17613 84338 91116 -3440 -41931 -87969 -135827
22834a35827k4739L5141P562N9231Q54K9120j5603q652n8123p9318l3015M6822
$$ -135827 -160566 -125425 -117863 -58632 -57778 -28658 -44261 -52913 -111036 -190354 -223369 -176547
22822a76547Q5154L5105K3864N4033L7161K5173O6778n3480N292L5753n4750n4787
$$ -176547 -91393 -56288 -32424 21609 58770 83943 150721 97241 102533 138286 83536 28749
22810B8749M4504n4038r6482L6716J506q503j53134l5666J36471L1929m1253m0541
$$ 28749 73253 19215 -77267 -40551 -39045 -47548 -200682 -236348 -99877 -67948 -109201 -149742
22798a49742L0583j2506O2889K6029L6991j7914q9028r541M7459p383j3519L348
$$ -149742 -119159 -131665 -68776 -42747 -5756 -23670 -112698 -122239 -74780 -82163 -95682 -92334
22786i2334l4797K4168J24943R7202J3433j62162q6273l0293O5214L1025J7626
$$ -92334 -127131 -102963 21980 119182 132615 -29547 -115820 -146113 -80899 -49874 -32248
22775c2248l21R257P948r8555m0316M625J03273K5210m4576o3123o6257J5947
$$ -32248 -32569 -23312 -15364 -113919 -154235 -149610 -46337 -21127 -65703 -128826 -195083 -179136
22763a79136J4360R3015J6090l1258M9225J8173N32o370M0347O2906p3161q4360
$$ -179136 -164776 -71761 -55671 -86929 -37704 -19531 -18999 -25369 14978 77884 4723 -79637
22751g9637K7579j1680j4942p687q6937J6770K0819P53j1564J1203k1663L6520
$$ -79637 -52058 -63738 -78680 -86367 -173304 -156534 -135715 -134962 -146526 -135323 -156986 -120466
22739a20466J4574J35285Q054P8852M7937q4229p5444P340N7582k4197j4906P7233
$$ -120466 -105892 29393 37447 116299 164236 80007 4563 11903 69485 45288 30382 107615
22727A07615k533k0965q3589m1641q4574j15444M2735k291J2259K4137R2651R619
$$ 107615 105082 84117 528 -41113 -125687 -241131 -198396 -200687 -188428 -164291 -71640 -62021
22715f2021p4837q2055M1884L0849J6961k5180R8384R7510k7349l2913K3372j0988
$$ -62021 -136858 -218913 -177029 -146180 -129219 -154399 -56015 41495 14146 -18767 4605 -6383
22703f383m7948n2169j12805J55383J21378n428k724r6774l0059j1087L4219J15385
$$ -6383 -54331 -106500 -219305 -63922 57456 52028 49304 -47470 -77529 -88616 -54397 60988
22691F0988r406l5946o7031p202L0670N3627K2461K651l3652K3551k4654j860
$$ 60988 51582 15636 -51395 -58597 -27927 25700 48161 50812 17160 40711 16057 14197
22679A4197l5106j02208k753J17557K2227K2108L8570q0648l063j7857o991Q1584
$$ 14197 -20909 -123117 -125870 -8313 13914 36022 74592 -6056 -9119 -26976 -33967 47617
22667D7617p30p6431j50573j1537J82890J20249n6713R65K4072j32294r5473Q7315
$$ 47617 46887 -29544 -180117 -191654 -8764 111485 54772 55737 79809 -52485 -147958 -60643
22655f0643L1158k6985J2477P4312K3857k9261N8894M9845j1044L6069j1708q7836
$$ -60643 -29485 -56470 -43993 30319 54176 24915 83809 133654 122610 158679 146971 59135
22643E9135p0649p06O4425l4773p5215L4886j05567p8369J0849J19852J03526
$$ 59135 -11514 -12220 52205 17432 -57783 -22897 -128464 -206833 -195984 -76132 27394
22632B7394L4300p1199O015L666o0142l0730L8604j9423O9850M4110j6969o7179
$$ 27394 61694 -9505 -3490 176 -59966 -90696 -52092 -71515 -1665 42445 25476 -41703
22620d1703p399K9054k3843j11680l8184n4749M247P3550J08982m5453Q0426O1713
$$ -41703 -49102 -20048 -43891 -155571 -193755 -248504 -244257 -170707 -61725 -107178 -26752 34961
22608C4961o0861q5706P7930M3518l7145L2902m4086o8237J38518j851j01459
$$ 34961 -25900 -111606 -33676 9842 -27303 5599 -38487 -106724 31794 29943 -71516
22597g1516n1327J566K0862P9046K491p7816n1436N5856J14079p9211r7584N8336
$$ -71516 -122843 -121277 -100415 -21369 -18878 -96694 -148130 -92274 21805 -57406 -154990 -96654
22585i6654Q7103J1145j3339p615o4742L9088m0626L2266j9411m4671n4802O9001
$$ -96654 -9551 1594 -11745 -19360 -84102 -45014 -85640 -53374 -72785 -117456 -172258 -103257
22573a03257Q3682K3093K2178m5317J3766J7024l7145N5813Q795p4766K1707l467
$$ -103257 -19575 3518 25696 -19621 -5855 11169 -25976 29837 38632 -36134 -14427 -17894
22561a7894N1016m5395r5671n9387J3977J3843P8265R9982J64193J6034p8097
$$ -17894 33122 -12273 -107944 -167331 -153354 -139511 -61246 38736 202929 218963 140866
22550A40866o495o6282l2085o952n1842o800N1248o5327J9492K1303R511o824
$$ 140866 134371 68089 36004 29052 -22790 -29590 21658 -43669 -24177 -2874 6637 -187
22538a87k2724o9072k5557J03871J17441p7800p8049K3413k0955n7806l5388N9588
$$ -187 -22911 -91983 -117540 -13669 103772 25972 -52077 -28664 -49619 -107425 -142813 -83225
22526h3225M7981M3266l8939j8212L1001k2054O5670j2335o0963L2639R3581p2761
$$ -83225 -35244 8022 -30917 -49129 -18128 -40182 25488 13153 -47810 -15171 78410 5649
22514E649p062L8029M9817K1340N200l2795k9426j1419l993J44q3249j00345j5603
$$ 5649 -1413 36616 86433 107773 112973 80178 50752 39333 35340 35484 -47765 -148110 -163713
22501a63713J23583J35446Q054l8275l6985j35364p5459R9234J55917M6126k7549
$$ -163713 -40130 95316 103370 65095 28110 -107254 -182713 -83479 72438 118564 91015
22490I1015l4608L7696m6316o3088l3125p9010j3753n3286M4683J34650O0902
$$ 91015 56407 94103 47787 -15301 -48426 -127436 -141189 -194475 -149792 -15142 45760
22479D5760n6780j12554M3107m3001j8631K1100j6048R9811o582m8573o286l7201
$$ 45760 -11020 -123574 -80467 -123468 -142099 -120999 -137047 -37236 -43818 -92391 -98677 -135878
22467a35878K6468N0087N2748O2009n4413J6812O7793P8782K9215P5867J02230
$$ -135878 -109410 -59323 -6575 55434 1021 17833 85626 164408 193623 269490 371720
22456C71720k3404k7258j34602j11985r9177k4060l3831L5761j8333Q9353K1359
$$ 371720 348316 321058 186456 74471 -24706 -48766 -82597 -46836 -65169 24184 45543
22445D5543O470l038J9586M6859M9650K6749k1575J1346J041p2043L1455k1502
$$ 45543 52013 48975 68561 115420 165070 191819 170244 181590 182631 110588 142043 120541
22433A20541n3221J8873M0827m3782K1452o5084j3698j2948q534l2431M6945P6657
$$ 120541 67320 86193 127020 83238 104690 39606 25908 12960 4426 -28005 18940 95597
22421I5597m3590q1139N0359n9515N73M9091o5043L9657P363M8339r009l5190
$$ 95597 52007 -29132 21227 -38288 -37715 11376 -53667 -14010 -6647 41692 32683 -2507
22409b507j29241N3233P5014M616p7469j973o2647R0295L417m4951k176M4088
$$ -2507 -131748 -78515 -3501 1115 -76354 -78327 -140974 -50679 -47262 -92213 -94389 -50301
22397e0301O3820o1284J4800k1978L38O1856o3314K571J2014r1401j36351M1909
$$ -50301 13519 -47765 -32965 -54943 -54605 7251 -56063 -53492 -41478 -132879 -269230 -227321
22385b27321P8696Q3371K080j4068k3020Q891Q8283o4703N5628n3418o3876O135
$$ -227321 -148625 -65254 -63174 -77242 -100262 -91371 -3088 -67791 -12163 -65581 -129457 -123322
22373a23322K2283J22370Q0866J1792Q4636p4524j46697K68l4329j1972J6223
$$ -123322 -101039 21331 102197 113989 198625 124101 -22596 -22328 -56657 -68629 -52406
22362e2406Q1824L4494k2079j1947M3101l2586o0183o4581k8829K6519l2961N3827
$$ -52406 29418 63912 41833 29886 72987 40401 -19782 -84363 -113192 -86673 -119634 -65807
22350f5807j2074o891o830K2489R2371L8884k1095m0333R1973n7143p3842M0612
$$ -65807 -77881 -84772 -91602 -69113 23258 62142 41047 714 92687 35544 -38298 2314
22338B314L2544Q1680L1424M6636Q1903J09288M7103p791J4838L7344K7552m289
$$ 2314 34858 116538 147962 194598 276501 385789 432892 425101 439939 477283 504835 500546
22326E00546l836j4421j14406j44056n1674j21583r693J24797o8760p1831m7357
$$ 500546 496710 482289 367883 223827 172153 50570 40877 165674 96914 25083 -22274
22315b2274j90O1554q6864P267N0737l0516N5687M988k2350K4060J0772o5828
$$ -22274 -22464 39090 -47774 -40507 10230 -20286 35401 40389 18039 42099 52871 -12957
22303a2957j2078M659N2600L2245K321n1026j8330P0181N8282k2682l357q0312
$$ -12957 -25035 -20376 32224 64469 66790 15764 -2566 67615 125897 103215 99858 19546
22291A9546r1085n3568L851L8325M8217K9050R7986m4263k6756m8483m1374k1143
$$ 19546 -71539 -125107 -121256 -82931 -34714 -5664 92322 48059 21303 -27180 -68554 -89697
22279h9697q0326n1923m203L4495Q4536O1558j7400p9605J5909N2802j9213o1481
$$ -89697 -170023 -221946 -226149 -191654 -107118 -45560 -62960 -142565 -126656 -73854 -93067 -154548
22267a54548M5167Q0109Q0006k8062j10112r8619p9729Q1080N4292J08137n091
$$ -154548 -109381 -29272 50734 22672 -87440 -186059 -265788 -184708 -130416 -22279 -27370
22256b7370r4323J0246Q1515j9407k2902P0524K1748o0947j0703R9321M1660m6500
$$ -27370 -121693 -111447 -29932 -49339 -72241 -1717 20031 -40916 -51619 47702 89362 42862
22244D2862M7728k6099j5418m4678L596J9236N1173j1087O030q4387j5420r4854
$$ 42862 90590 64491 49073 4395 7991 27227 78400 67313 73343 -11044 -26464 -121318
22232a21318j44358R3947J7652p4335P9650R0882N3221j2195P7038l0960n5806
$$ -121318 -265676 -171729 -154077 -228412 -148762 -57880 -4659 -16854 60184 29224 -26582
22221b6582l5179J16120k4884j34670p7662k4979k3390q9144O903J09905R961
$$ -26582 -61761 54359 29475 -105195 -182857 -207836 -231226 -320370 -313467 -203562 -193601
22210a93601p411N0575O1407k5474L3188k1355q243J7411M4142J8775N9943M646
$$ -193601 -201012 -150437 -89030 -114504 -81316 -102671 -110914 -93503 -49361 -30586 29357 34003
22198C4003j0353j0291j03798o3020K2333Q5286N8555k6669O3560m0884m1769
$$ 34003 23650 13359 -90439 -153459 -131126 -45840 12715 -13954 49606 8722 -33047
22187c3047k5246k0931N2942K8826l7378o5440l100k5366O3531l892J2408Q4124
$$ -33047 -58293 -79224 -26282 2544 -34834 -100274 -103374 -128740 -65209 -69101 -56693 27431
22175B7431J0063k5942R9221r4122j13450K2840O9303n0618q183N9496L3920P1528
$$ 27431 37494 11552 110773 16651 -96799 -73959 -4656 -55274 -63457 -3961 29959 101487
22163A01487l8609m2610l9166K9645j08198r1290k8162K1171J13402O6094k6204
$$ 101487 62878 20268 -18898 10747 -97451 -188741 -216903 -195732 -82330 -16236 -42440
22152d2440r4275J5159J35938k0916r3253P4217M0728o3515R286Q7247k0507N1186
$$ -42440 -136715 -121556 14382 -6534 -99787 -25570 15158 -48357 -39071 48176 27669 78855
22140G8855j7576o8163k7503J34065K3392m0730k3215m5789M6351O338j9867o2092
$$ 78855 61279 -6884 -34387 99678 123070 82340 59125 13336 59687 66025 46158 -15934
22128a5934L0958j0576j6505n653j2079J8902l4451m2056j1457L0866R2928k3423
$$ -15934 15024 4448 -12057 -17710 -29789 -10887 -45338 -87394 -98851 -67985 24943 1520
22116A520j55015o06P1729Q8040K2604K1051j1707K6574N3716l101m3293k7560
$$ 1520 -153495 -154101 -82372 5668 28272 49323 37616 64190 117906 114805 71512 43952
22104D3952Q5891j4697j7605k3952j10705l9819M4575M7731l635L8776K6696k5526
$$ 43952 129843 115146 97541 73589 -37116 -76935 -32360 15371 11736 50512 77208 51682
22092E1682l6973L616j6550K7819L9254L6669k9860l3414k1196n7087L3760q9286
$$ 51682 14709 18325 1775 29594 68848 105517 75657 42243 21047 -36040 -2280 -91566
22080i1566J6368M8495P9180m3823n4391M9922J1169J5462m1117L3245l9960l3262
$$ -91566 -75198 -26703 52477 8654 -45737 4185 15354 30816 -10301 22944 -17016 -50278
22068e0278q061O0992Q3273m1525r2129P2539k037l3661q0535j0808p2689o995
$$ -50278 -58339 2653 85926 44401 -47728 24811 22774 -10887 -91422 -102230 -174919 -181914
22056a81914R7037j8202k9153o736R489K0246o1420q8930N1630J16591R1270N5735
$$ -181914 -84877 -103079 -132232 -138968 -129479 -109233 -170653 -259583 -207953 -91362 -92 55643
22044E5643J00813j21355r4170j4958L7184J88141Q2137q635j38204r0285J6817
$$ 55643 156456 35101 -59069 -74027 -36843 151298 233435 224800 86596 -3689 13128
22033A3128O0795j5304l6486j12696M5417q82j1896N6680K142q338k3815m5400
$$ 13128 73923 58619 22133 -90563 -45146 -46028 -57924 -1244 898 -7440 -31255 -76655
22021g6655P1513K9327p5463k5011j7890K77J3717Q83K6480M129n7333J0344L0659
$$ -76655 -5142 24185 -51278 -76289 -94179 -93902 -80185 -79302 -52822 -48693 -106026 -95682 -65023
22008f5023L2574n6925K6867Q4123Q0414o8220n3238l2311R0756J14890o9965
$$ -65023 -32449 -89374 -62507 21616 102030 33810 -19428 -51739 39017 153907 83942
21997H3942p2676p2581L9236R8028j25747r2431L5350J07592P3912J2441n1379
$$ 83942 11266 -61315 -22079 75949 -49798 -142229 -106879 713 74625 87066 35687
21986C5687k1611J6430N7221m4990m3052L3735R0360N9539r0152l2558p8j4713
$$ 35687 14076 30506 87727 42737 -315 33420 123780 183319 93167 60609 60531 45818
21974D5818m5088O8278l4292j969M5204M8930m2759k5463J3200M151l8126m677
$$ 45818 730 69008 34716 32747 77951 126881 84122 58659 71859 76010 37884 33207
21962C3207J223l6416o1844j73792r8609N648J88574R9034o4937Q9218k659r1254
$$ 33207 34430 -1986 -63830 -237622 -336231 -330583 -142009 -42975 -107912 -18694 -21353 -112607
21950a12607r4015k4358k9950N1086k5101J2857Q6975J37341M8885j4326j27981
$$ -112607 -206622 -230980 -260930 -209844 -234945 -222088 -135113 2228 51113 36787 -91194
21939i1194j31947J04769J16160n0289n0178J0969O9027M8431k3885j0922k0462
$$ -91194 -223141 -118372 -2212 -52501 -102679 -91710 -22683 25748 1863 -9059 -29521
21928b9521q38J2099Q705N4513L2211o2552m170L690J656K2385q0747Q655j808
$$ -29521 -30359 -18260 -9555 44958 77169 14617 10447 14137 15793 38178 -42569 -33914 -35722
21915c5722p0710M2872K6478l5488k8065J8414J05028R5773J8460j29466n2161
$$ -35722 -106432 -63560 -37082 -72570 -100635 -82221 22807 118580 137040 7574 -44587
21904d4587Q6418J5993j03696k7341J4274o4981l8504P7335O3837K9899n7042
$$ -44587 41831 57824 -45872 -73213 -58939 -123920 -162424 -85089 -21252 8647 -48395
21893d8395j4377j8646K1591l9787N5316J17378N0251r7011r9705P8528N6154
$$ -48395 -62772 -81418 -59827 -99614 -44298 73080 123331 26320 -73385 5143 61297
21882F1297k5348j9222k6068n6885j5575P650o423k69J06262j8795l5681L0338
$$ 61297 35949 16727 -9341 -66226 -81801 -74151 -80574 -80843 25419 6624 -29057 1281
21870A281j37M6229J2805j7104K5239N2843L39J5050L8985k2153l1837n4255l3406
$$ 1281 1144 47373 60178 43074 68313 121156 121495 136545 175530 153377 121540 67285 33879
21857C3879j8529l1188r4259R454M4150l4646K428J20598J40015l8103q7562j12203
$$ 33879 15350 -15838 -110097 -100643 -56493 -91139 -88711 31887 171902 133799 46237 -65966
21845f5966n6558N1585Q2113K712k6315L2985L460p2815N5659Q2636p8664K4608
$$ -65966 -122524 -70939 11174 13886 -12429 20556 24016 -48799 6860 89496 10832 35440
21833C5440Q9843Q442r136P789n3437k4415M9750N8333j6203M774o8415q5555
$$ 35440 125283 133725 124589 132378 78941 54526 104276 162609 146406 151180 82765 -2790
21821b790r3877p9916O5200j0604j04117k9587P4227L412N1673J46843J0885p2521
$$ -2790 -96667 -176583 -111383 -121987 -226104 -255691 -181464 -178052 -126379 20464 31349 -41172
21809d1172L4044k0581R1853l1881P752K1725l64r0988j592K3288l9327j25378
$$ -41172 -7128 -27709 64144 32263 40015 61740 61376 -29612 -31204 -7916 -47243 -172621
21797a72621L8210p6589M9823M7709m4355M9397K6668M5433q31L1250M7239q1938
$$ -172621 -134411 -211000 -161177 -113468 -157823 -108426 -81758 -36325 -37156 -5906 41333 -40605
21785d0605K9270R3528k519m9813K853M4945L4751r1132m2096J05365k6795m8636
$$ -40605 -11335 82193 79674 29861 32714 77659 112410 21278 -20818 84547 57752 9116
21773I116o1303J8230L8420J69163M2908j34208n6946P6359O5137k9054n5692
$$ 9116 -52187 -33957 4463 173626 216534 82326 25380 101739 166876 137822 82130
21762H2130k092K5292K3326m3386m6418M8607k8518l5462q2917o614m5542k0460
$$ 82130 80038 105330 128656 85270 38852 87459 58941 23479 -59438 -66052 -111594 -132054
21750a32054P6981J41484K5806K5656j9799K8067R829n5534o8359j4413k9305
$$ -132054 -55073 86411 112217 137873 118074 146141 155970 100436 32077 17664 -11641
21739a1641K2781L0212p627j55752J7249O0673k8886p3344j00059J3334M4129
$$ -11641 11140 41352 33725 -122027 -104778 -44105 -72991 -146335 -246394 -233060 -188931
21728a88931P4807k4522l3808k5554j091O7614N834L5919J04320L1287K2535k978
$$ -188931 -114124 -138646 -172454 -198008 -199099 -131485 -125651 -89732 14588 45875 68410 65432
21716F5432J861n0519m2913R708J08203L6627N2081p9686q0653l8902j55O0403
$$ 65432 67293 16774 -26139 -16431 91772 128399 180480 100794 20141 -18761 -18916 41487
21704D1487j6491j06744J0583K8372L1632J1030K7956j7549j2645k1263J6907
$$ 41487 24996 -81748 -71165 -42793 -11161 -131 27825 10276 -2369 -23632 -6725
21693f725p633L1665J9067M5126K2897j03842j6964J8379N895N3865N2670J7163
$$ -6725 -14358 17307 36374 81500 104397 555 -16409 1970 7865 61730 114400 131563
21681A31563m6392j14096m6951L7900n8227j86163l8172P7016M7676P3511K6077
$$ 131563 85171 -28925 -75876 -37976 -96203 -282366 -320538 -243522 -195846 -122335 -96258
21670i6258j5965M6538N5239R999m4479K3951P2995p2930q2409P012m7246o6355
$$ -96258 -112223 -65685 -10446 -447 -44926 -20975 52020 -20910 -103319 -96307 -143553 -209908
21658b09908j2734R9579m0210n2642o8921J06700Q7975j110M0804J05856L5589
$$ -209908 -222642 -123063 -163273 -215915 -284836 -178136 -90161 -91271 -50467 55389 90978
21647I0978j3248k2821k2830l3682j6203O1660k5998n8719Q3859P3802j23879
$$ 90978 77730 54909 32079 -1603 -17806 43854 17856 -40863 42996 116798 -7081
21636g081p8091O7666K2293K0344r2464k2779P7985P92L5230J09179J2234k6779
$$ -7081 -85172 -17506 4787 25131 -67333 -90112 -12127 -11335 23895 133074 145308 118529
21624A18529Q91Q077J1629o0135n1945K3925k8758Q543L5464J5493q5462j11732
$$ 118529 119420 127497 139126 78991 27046 50971 22213 30756 66220 81713 -3749 -115481
21612a15481n9640O8297M8465O6532M3447l9403m7903O046q5410L6959J1204M626
$$ -115481 -175121 -106824 -58359 8173 51620 12217 -35686 -29640 -115050 -78091 -66887 -62261
21600f2261J5026N7493J1470K44n7805J5013O907j6654k095N975K8720l8672P9655
$$ -62261 -47235 10258 21728 21972 -35833 -20820 -13913 -30567 -32662 -26687 2033 -36639 43016
21587D3016J1245q3962k3841J1238J37315J6474O622l4810j3310P0734k8234n4516
$$ 43016 54261 -29701 -53542 -42304 95011 111485 118107 83297 69987 140721 112487 57971
21575E7971j34074N0416M2798l8127j1185J26722K3963p3123p0508j9083L7102
$$ 57971 -76103 -25687 17111 -21016 -32201 94521 118484 45361 -25147 -44230 -7128
21564g128L4044K4434n6908j2037o9315N310K7751N0163J7778p1127N6039J5415
$$ -7128 26916 51350 -5558 -17595 -86910 -81600 -53849 -3686 14092 -57035 -996 14419
21552A4419P955n0847L205j7617q716Q6350M7934j6731O4622p9005k12907N0432
$$ 14419 22374 -28473 -25268 -42885 -51601 34749 82683 65952 130574 51569 -161338 -110906
21540a10906J00918J6378K694J1773J2288k151K5098M4267r884m4165J03749O4352
$$ -110906 -9988 6390 9084 20857 33145 30994 56092 100359 90475 46310 150059 214411
21528B14411n9552m7896j4432M5217R4195l2230j39441j7226j26462k2030J11693
$$ 214411 154859 106963 92531 137748 231943 199713 60272 43046 -83416 -105446 6247
21517F247O1848L4000K4214p8607k6873J20215N8164l9883K5699L6016j4848l9528
$$ 6247 68095 102095 126309 47702 20829 141044 199208 159325 185024 221040 206192 166664
21505A66664j6441r7682j44769N1550k8277L9998J5542L7248K2493P0333n207
$$ 166664 150223 52541 -92228 -40678 -68955 -28957 -13415 23833 46326 116659 111452
21494A11452l2880k4653p9125Q2695P5458p4534m4389O1067M8139j4538O103M0250
$$ 111452 78572 53919 -25206 57489 132947 58413 14024 75091 123230 108692 114795 155045
21482A55045r214r3326m6598P540j2188J15309P8805N7773J32606J80262O1159
$$ 155045 145831 52505 5907 13447 1259 116568 195373 253146 385752 566014 627173
21471F27173J60146J86851Q028n0009j65992j07694j77390r9559N158P8998J49682
$$ 627173 787319 974170 982198 932189 766197 658503 481113 381554 386712 465710 615392
21460F15392J42605J84061J78006R5424L1510n1205J8314q6506n4104j16710k01618
$$ 615392 757997 942058 1120064 1215488 1246998 1195793 1214107 1127601 1073497 956787 755169
21449G55169j05989m0218j30477n2797J38335J32704L5054M0730R4523J0412l701
$$ 755169 649180 608962 478485 425688 564023 696727 731781 772511 867034 877446 873745
21438H73745j93771k00778q7735j94404m8980r9392K082M1489m3591L2887O2602
$$ 873745 679974 479196 391461 197057 148077 48685 50767 92256 48665 81552 144154
21427A44154N8874l8891p9691k0085l2230k2726l7332O15J04391N9108m1686o479
$$ 144154 203028 164137 84446 64361 32131 9405 -27927 -27312 77079 136187 94501 88022
21415H8022K1552J4672q0917p3197J1735J0794k0168l5937p79M7962N1061R8512
$$ 88022 109574 124246 43329 -29868 -18133 -7339 -27507 -63444 -64223 -16261 34800 133312
21403A33312L9424L4653p8000p4001J0649L4989j1117J3295J50306l4540j46014
$$ 133312 172736 207389 129389 55388 66037 101026 89909 103204 253510 218970 72956
21392G2956q2760K9813P8648R6718P4340l4743m3772j8392J2174m7494j57754
$$ 72956 -9804 20009 98657 195375 269715 234972 191200 172808 184982 137488 -20266
21381b0266P533M8438k471N026K0952l078J798o1978j43511l4261k2295L3157
$$ -20266 -12733 35705 33234 38260 59212 56134 57932 -4046 -147557 -181818 -204113 -170956
21369a70956M5717N6865K613q45J77876j4981m023L740j09030j08801O7247J09306
$$ -170956 -125239 -68374 -65761 -66606 111270 96289 92266 96006 -13024 -121825 -54578 54728
21357E4728J5600j56O218j9377j017O4381m6581k1449j08837J1455J26243O6644
$$ 54728 70328 70172 76390 57013 55996 120377 73796 52347 -56490 -45035 81208 147852
21345A47852N7140J65307n9173q4884P155l6931J546L6930K4680M074j5831J5749
$$ 147852 204992 370299 311126 226242 233397 196466 198012 234942 259622 263696 247865 263614
21333B63614m0766L1014k2783k9748l2303n0524p8602O175L1091m206l5483J05358
$$ 263614 222848 253862 231079 201331 169028 118504 39902 46077 77168 72962 37479 142837
21321A42837O3632m3434j77834m7769J07926O2615j9539l5589K4721N6240N5093
$$ 142837 206469 163035 -14799 -62568 45358 107973 88434 52845 77566 133806 188899
21310A88899Q1733P093q0372q9310k8000l00N5860p1077K7389M6380n1133k3539
$$ 188899 270632 277725 197353 108043 80043 79743 135603 64526 91915 138295 87162 63623
21298F3623J6876M5790p141K9938q101j39319j21539R508J34006L9330P7285K5967
$$ 63623 80499 126289 119148 149086 140985 1666 -119873 -110365 23641 62971 140256 166223
21286A66223j2268r4894j40944J6913J00212J6210j07096l9717K1520r176N0782
$$ 166223 153955 59061 -81883 -64970 35242 51452 -55644 -95361 -73841 -83017 -32235
21275c2235N2046l2Q3607j3348L5090L180r0154o6969P6076Q1076J12298m8122
$$ -32235 19811 19779 103386 90038 125128 128308 38154 -28815 47261 128337 240635 192513
21263A92513j37568N5121J2044o1383j5638J09894l304K0827M4495R213m9914
$$ 192513 54945 110066 122110 60727 45089 154983 151679 172506 217001 226214 176300
21252A76300q0734J2774j2628n1245J4842O1482l5412q0278k2153M0837J4028
$$ 176300 95566 108340 95712 44467 59309 120791 85379 5101 -17052 23785 37813
21241C7813J2001p3472m8769j5139N6233L0987J07306k1984o3639j4284k6350
$$ 37813 49814 -23658 -72427 -87566 -31333 -346 106960 84976 21337 7053 -19297
21230a9297k0835J7943P7305J55523J6452o5515j73366k1423N7699M6565m7437
$$ -19297 -40132 -22189 55116 210639 227091 161576 -11790 -33213 24486 71051 23614
21219B3614n646J45939l5572q5023L5298n6740M6728K1586p2239l6616L7412R4498
$$ 23614 17968 163907 128335 43312 78610 21870 68598 90184 17945 -18671 18741 113239
21207A13239M8263m0587L6817K7185o043r2077k3716o14L420p0411j2922J22606
$$ 113239 161502 120915 157732 184917 178874 86797 63081 62467 65887 -4524 -17446 105160
21195A05160M5765l1901L9516O0581n1737n149k5989o6868p389K6739p8059O807
$$ 105160 150925 119024 158540 219121 167384 162235 136246 69378 61989 88728 10669 17476
21183A7476l5471N6972J13624R2787n8474p5082m6327L9429N7412L326l7505o1338
$$ 17476 -17995 38977 152601 245388 186914 111832 65505 104934 162346 165672 128167 66829
21171F6829n5381L1605N2306K1636J2456j16621o5045j1242L926k2125M7893k0028
$$ 66829 11448 43053 95359 116995 129451 12830 -52215 -63457 -59531 -81656 -33763 -53791
21159e3791K9802N0229J05229k4662o4579M2261L8225n452J1141k623p0550j8549
$$ -53791 -23989 26240 131469 106807 42228 84489 122714 117262 128403 125780 55230 36681
21147C6681P0229L5604m4832q2691Q5175n160o1690k6543J13916O3429n9965M1035
$$ 36681 106910 142514 97682 14991 100166 95006 33316 6773 120689 184118 124153 165188
21135A65188m1957k9407M1364L0135P108j5371M7367R4298M8939M5223j24387
$$ 165188 123231 93824 135188 165323 172431 157060 204427 298725 347664 392887 268500
21124B68500m1505J668k1493O5564M8470m7912Q2075K8728J0686j04973J1041
$$ 268500 226995 228663 207170 272734 321204 273292 355367 384095 394781 289808 300849
21113C00849M6309m4064j33841J3523J6938n9503K8311N3247r485p6308j00029
$$ 300849 347158 303094 169253 182776 199714 140211 168522 221769 212284 135976 35947
21102C5947m9459L4558j6888K5870J17068L7166j4846p7032J8719Q0672l0461
$$ 35947 -13512 21046 4158 30028 147096 184262 169416 92384 111103 191775 161314
21091A61314J04122M8585k9500l6489J42928N4579k1013O4684O2633M9513O1925
$$ 161314 265436 314021 284521 248032 390960 445539 424526 489210 551843 601356 663281
21080F63281P2764l0203j05749r284M5914J41547J8765N0118J6038J18807K3701
$$ 663281 736045 705842 600093 590809 636723 778270 797035 847153 863191 981998 1005699
21069A005699j3099j79066k45959j42327j52608n0984Q7169P4843R2324k2249
$$ 1005699 992600 813534 567575 425248 272640 221656 308825 383668 475992 453743
21059D53743j11045j60479k47647k89668m3644K6677O2810Q0957K05937J96934
$$ 453743 342698 182219 -65428 -355096 -398740 -372063 -309253 -228296 -22359 174575
21049A74575M1568n8344n4914j57991n3593j1501L1134j121k6258n154K2537J59884
$$ 174575 216143 157799 102885 -55106 -108699 -120200 -89066 -90187 -116445 -121599 -99062 60822
21037F0822l1368j13404M7245P8762P251n0365r0677j18736K7852K8756R2808
$$ 60822 29454 -83950 -36705 42057 49308 -1057 -91734 -210470 -182618 -153862 -61054
21026f1054J10484n0160j62659k0851l5745k9794r953J55536J34611N2914J206
$$ -61054 49430 -730 -163389 -184240 -219985 -249779 -259732 -104196 30415 83329 84535
21015H4535N1102O2995Q8580k6667n8865m2620J53017J73145J15687J47084J0050
$$ 84535 135637 198632 287212 260545 201680 159060 312077 485222 600909 747993 758043
21004G58043P8428P9413j22867j29055N6119N4335N8966p03j11249q9621q2821
$$ 758043 836471 915884 793017 663962 720081 774416 833382 832679 721430 631809 548988
20993E48988j6655j23941o2337j09559j55010M7306N9169P398L8570q308n452
$$ 548988 532333 408392 346055 236496 81486 128792 187961 195359 233929 225621 220169
20982B20169o5899j1173N9758n6698K0049J5561L1888O6239o0086j03290m8381
$$ 220169 154270 143097 202855 146157 166206 181767 213655 279894 219808 116518 68137
20971F8137o370K4001J26208R1615K7868P2647J17514L0158l9334k9022n8249
$$ 68137 61767 85768 211976 303591 331459 404106 521620 551778 512444 483422 425173
20960D25173J22772N0534r1604q7166N6923P1322K7413o1765J6030M0781j16792
$$ 425173 547945 598479 506875 419709 476632 547954 575367 513602 529632 570413 453621
20949D53621M7324M7873N6486r8652j12888j06152j6526J08994J12232O9400q41
$$ 453621 500945 548818 605304 506652 393764 287612 271086 380080 492312 561712 560871
20938E60871l2021p4028M7960P3843N619j7680M9140J21030J15696l1378M7878
$$ 560871 528850 454822 502782 576625 582244 564564 613704 734734 850430 819052 866930
20927H66930K00334K69213K71968L23693M06136L00479J56759J10299m7759k24544
$$ 866930 1067264 1336477 1608445 1932138 2338274 2638753 2795512 2905811 2858052 2633508
20917B633508l06764l7783P1168K24735M30050N87464N90862N51405L76886K03054
$$ 2633508 2326744 2288961 2360129 2584864 3014914 3602378 4193240 4744645 5121531 5324585
20907E324585P9545j83036k02211l1329J46555K12104K89397M37592O40079J047746
$$ 5324585 5404130 5221094 5018883 4987554 5134109 5346213 5635610 6073202 6713281 7761027
20897G761027J359569J822558K320327L187940M733782P369740J2034979J7502849
$$ 7761027 9120596 10943154 13263481 16451421 21185203 28554943 40589922 58092771
20889E8092771J8818235J2943024J559518r136406j2921083j0234141l556916
$$ 58092771 76911006 89854030 91413548 82277142 69356059 59121918 55565002
20882E5565002M373730J3622729K6603555M5706410O3939537O3562479L8671818
$$ 55565002 59938732 73561461 100165016 145871426 209810963 273373442 312045260
20875C12045260m412540l8415802m6840085l1623746j351697K7739722M1578695
$$ 312045260 307632720 269216918 222376833 190753087 189401390 217141112 258719807
20868B58719807L4810463P050389k3912901m8636695n4514654m7032844l3580723
$$ 258719807 293530270 300580659 276667758 228031063 173516409 126483565 92902842
20861I2902842j9963581r159195O2608P220047J0475628Q033635L50523q306001
$$ 92902842 72939261 63780066 63842674 71062721 81538349 89571984 89922507 81616506
20853H1616506j4818108j5584126j3059508r135350n979221m058907l172361k562338
$$ 81616506 66798398 51214272 38154764 29019414 23040193 18981286 15808925 13246587
20845A3246587k047168j523515j156846q59376n18855k91746j02457o440p2106
$$ 13246587 11199419 9675904 8519058 7659682 7140827 6849081 6746624 6740184 6668078
20836F668078r2453j8934k0748j23692k59685l64547m51813m86822l99127j44817
$$ 6668078 6575625 6556691 6535943 6412251 6152566 5788019 5336206 4849384 4450257 4305440
20826D305440J33397L67987O01903M73992J79487l29284o61710p12076p25829
$$ 4305440 4438837 4806824 5408727 5882719 6062206 5732922 5071212 4359136 3633307
20817C633307n66615m68100l34152j58115o6954j11572k25636j86224l0456N7621
$$ 3633307 3066692 2598592 2264440 2106325 2039371 1927799 1702163 1515939 1485483 1543104
20807A543104q9716m7158o8150k907R6206N6038q3626j82175q4445q918N8189
$$ 1543104 1453388 1406230 1338080 1335173 1431379 1487417 1403791 1221616 1137171 1128253 1186442
20796A186442N8676N2678l494j15741j32926o8508L453m9960l9753n8343l0007
$$ 1186442 1245118 1297796 1294302 1178561 1045635 977127 980580 930620 890867 832524 802517
20785H02517L8568j4418N0789m4745n1434p0648j41815n5834K2227K7975R2914
$$ 802517 841085 826667 877456 832711 781277 710629 568814 512980 535207 563182 656096
20774F56096J45871N9453r6475p1545O9855O9079p8577m7687J6423l5560j9188
$$ 656096 801967 861420 764945 693400 763255 832334 753757 706070 722493 686933 667745
20763F67745O8380N4252M4757J1721j4033q0710n9794P3071L8531j27037l8316
$$ 667745 736125 790377 835134 846855 832822 752112 692318 765389 803920 676883 638567
20752F38567R1402J23559N3414J23385q9486j7796r2847n2267J6893J47522K9170
$$ 638567 729969 853528 906942 1030327 940841 923045 830198 777931 794824 942346 971516
20741I71516j6223m4269p4867O0521k8593j48115j45232m7032R3672k443N8493
$$ 971516 955293 911024 836157 896678 868085 719970 574738 527706 621378 618935 677428
20730F77428n0139N3250M6726k5353p52l8869J0839J52286N2314n4675j34303
$$ 677428 627289 680539 727265 701912 701160 662291 673130 825416 877730 823055 688752
20719F88752j31120o5437k9737J31151M9175j6222n0418j05397q8264R0058o247
$$ 688752 557632 492195 462458 593609 642784 626562 576144 470747 382483 472541 466294
20708D66294p4842o8927Q8542P8612J19965J43860l2588j9425J2144r0676j42570
$$ 466294 391452 322525 411067 489679 609644 753504 720916 701491 713635 622959 480389
20697D80389q2109j19953n9799R6765Q5248K8597q026O6265N1303J00743R5858
$$ 480389 398280 278327 218528 315293 400541 429138 421112 487377 538680 639423 735281
20686G35281p0857j13903j71306q3393j03352l8814J24951O9840n9123j95209
$$ 735281 664424 550521 379215 295822 192470 153656 278607 348447 289324 94115
20676I4115j73694j85204j63046q1952N3309P4903J3806J25285P7076J0253k9675
$$ 94115 -79579 -264783 -427829 -509781 -456472 -381569 -367763 -242478 -165402 -155149 -184824
20665a84824L52K9720l3303l1500O0647K4479n073N8751m3494j380M0615J9501
$$ -184824 -184472 -154752 -188055 -219555 -158908 -134429 -139502 -80751 -124245 -125625 -85010 -65509
20653f5509m5354k6870O8491K9612N3913M3246j1861N1618M5022p514J0434N0217
$$ -65509 -110863 -137733 -69242 -39630 14283 57529 45668 97286 142308 134794 145228 195445
20641A95445K9428k7488o0319n1136k5455M5901Q6046K8720m605o4852m0524R703
$$ 195445 224873 197385 137066 85930 60475 106376 192422 221142 216537 151685 111161 120864
20629A20864j0012j6865J1325r2719l3109m1727L4511l3515l5107R1713O9920
$$ 120864 110852 93987 105312 12593 -20516 -62243 -27732 -61247 -96354 -4641 65279
20618F5279Q3699n940j6706m4851m3003K2625j19118R6850J05132r855m5740o7618
$$ 65279 148978 143038 126332 81481 38478 61103 -58015 38835 143967 134112 88372 20754
20606B0754m0570j070J601k1863N804N6385l7024P8473R071m8420K4683Q2199
$$ 20754 -19816 -20886 -19285 -41148 -35344 21041 -15983 62490 71561 23141 47824 130023
20594A30023P9291o5924n1149M9805O6399N8753j9668m3100r1141l7761p6828
$$ 130023 209314 143390 92241 142046 208445 267198 247530 204430 113289 75528 -1300
20583a300P0126P8438l4971j6141K0168l0962n8151K0557N5373l9717N596J5336
$$ -1300 68826 147264 112293 96152 116320 85358 27207 47764 103137 63420 69016 84352
20571H4352Q920n2572j602m0906k9605O5598J05024L8496n4625r4301l1043m4207
$$ 84352 93272 40700 39098 -1808 -31413 34185 139209 177705 123080 28779 -2264 -46471
20559d6471L602L909M3523k4043l0193N0472n7663j55251m3546P8621J05349O6058
$$ -46471 -42869 -38960 4563 -19480 -49673 799 -56864 -212115 -255661 -177040 -71691 -5633
20547e633k6190j5507L9756M7991L9225K9463p9126j03254m2218P5417M4722L8305
$$ -5633 -31823 -47330 -7574 40417 79642 109105 29979 -73275 -115493 -40076 4646 42951
20535D2951M5802o1142q0498n0609k4495k8369N244Q8224O8409j10209o6427K5412
$$ 42951 88753 27611 -52887 -103496 -127991 -156360 -151116 -62892 5517 -104692 -171119 -145707
20523a45707J06050L1695l687j7763j6327j19101m1061K3063J04212O6874l6733
$$ -145707 -39657 -7962 -11649 -29412 -45739 -164840 -205901 -182838 -78626 -11752 -48485
20512d8485L4434K4611P645j7688j3317L8501l5739M5019N9227K0228j2910o9605
$$ -48485 -14051 10560 18205 517 -12800 25701 -10038 34981 94208 114436 101526 31921
20500C1921l3666j4454n5651J806R237M3876O3984k6836N6666N2693j8679k4806
$$ 31921 -1745 -16199 -71850 -70044 -60807 -16931 47053 20217 76883 129576 110897 86091
20488H6091P7791j69354r5064n2761J470K9491j7983K2640l076K6689J5182l9404
$$ 86091 163882 -5472 -100536 -153297 -151827 -122336 -140319 -117679 -120755 -94066 -78884 -118288
20476a18288R2813m747j026L6407l0377J938m4377j1966L9227M1757o925k5783
$$ -118288 -25475 -30222 -31248 5159 -25218 -23280 -67657 -79623 -40396 1361 -5564 -31347
20464c1347l3973o687m1981o0740j9712r443Q1979M7053N6282n9489r0022O0414
$$ -31347 -65320 -72007 -113988 -174728 -194440 -203883 -121904 -74851 -18569 -78058 -168080 -107666
20452a07666J5248M1915n0787J1720m1147l9626j6640j6970M2965O1573J9166
$$ -107666 -92418 -50503 -101290 -89570 -130717 -170343 -186983 -203953 -160988 -99415 -80249
20441h0249j2597M8121J11562n0732j63624O0735J50718L9500l5463j9132q712
$$ -80249 -92846 -44725 66837 16105 -147519 -86784 63934 103434 67971 48839 40127
20430D0127k2668K1573N9153L4795N0669m8453k1359o3541K9561l5315n098J03373
$$ 40127 17459 39032 98185 132980 183649 135196 113837 50296 79857 44542 39444 142817
20418A42817p5780k2443K5949J05891K8075p918K8882R0472j3910j4944n1646
$$ 142817 67037 44594 70543 176434 204509 196591 225473 315945 302035 287091 235445
20407B35445J5149L0278J64914N1153J90399J20751m5096j14332l033m1116O908
$$ 235445 250594 280872 445786 496939 687338 808089 762993 648661 645628 604512 611420
20396F11420r5836q5238N2621J00925P2130P7290k9641j09255k6405R7189m8424
$$ 611420 515584 430346 482967 583892 656022 733312 703671 594416 568011 665200 616776
20385F16776j54506j29697r1796j51669P145L3159N423n0182j39858O6273Q5713
$$ 616776 462270 332573 240777 89108 96253 129412 134835 84653 -55205 11068 96781
20374I6781p6466L1891n1587l1072J3972M323Q035j5109j4890P383J01224Q1013
$$ 96781 20315 52206 619 -30453 -16481 -12158 -4123 -19232 -34122 -26739 74485 155498
20362A55498P5761r0827p937q928r5251k2575n538O935N6919N4039j6803M2143
$$ 155498 231259 140432 132495 123567 28316 5741 203 7138 64057 118096 101293 143436
20350A43436J8977J07256q1604o5729k6840l9193p5734n065O3420L4990q3487
$$ 143436 162413 269669 188065 122336 95496 56303 -19431 -24496 38924 73914 -9573
20339i573j9580R745n0114J57377Q4104o0822p9645q0063r566N3967n977Q834
$$ -9573 -29153 -19408 -69522 87855 171959 111137 31492 -48571 -58137 -4170 -10147 -1313
20327a313Q8838Q7702J890n6778k1165l6940p4121k8159L2817K4655N6398o1459
$$ -1313 87525 175227 177117 120339 99174 62234 -11887 -40046 -7229 17426 73824 12365
20315A2365o7223J4034p641k6299l7738m7378m4969Q1741J78645J05455L853k9255
$$ 12365 -54858 -40824 -48465 -74764 -112502 -159880 -204849 -123108 55537 160992 164845 135590
20303A35590j1071R918J23763J09425Q9622P0297O7723J73229Q8040K9851p6775
$$ 135590 124519 134437 258200 367625 457247 527544 595267 768496 856536 886387 809612
20292H09612m7965j95271j14770j2037k0646P8712J03086K53740J72276J29363
$$ 809612 761647 566376 451606 439569 418923 497635 600721 854461 1026737 1156100
20282A156100J36978R8132L7444K981l1872j65584j65984j16072j13071r2301
$$ 1156100 1293078 1391210 1428654 1431635 1399763 1234179 1068195 952123 839052 746751
20272G46751k9480o9901m7185k2042J11366Q3127P9567N0867r9874j43367j80355
$$ 746751 717271 647370 600185 578143 689509 772636 852203 903070 803196 659829 479474
20261D79474j15260r195j28581r2816M1752k0535q4112p9840m2186j2030k1245
$$ 479474 364214 355019 226438 133622 175374 154839 70727 -9113 -51299 -63329 -84574
20250h4574M6330Q0315o1048n5089m7759O7921p845k0929N8338P6957R8502o949
$$ -84574 -38244 42071 -18977 -74066 -121825 -53904 -61749 -82678 -24340 52617 151119 144170
20238A44170l8683k3584j4333k2273L4795k1628M6658j48379k9326N6668J6057
$$ 144170 105487 81903 67570 45297 80092 58464 105122 -43257 -72583 -15915 142
20227A42k5637N1046l7841N4404O0631M095n0333l6416L1170J4414p73L7342L1210
$$ 142 -25495 25551 -12290 42114 102745 106840 56507 20091 51261 65675 64902 102244 133454
20214A33454n802l9265j5405M4376l7994M5734j8378m4173K1698o5074j4997K4729
$$ 133454 127652 88387 72982 117358 79364 125098 106720 62547 84245 19171 4174 28903
20202B8903K4592q8265q2585k3810J24850l8697n0397P7603k3892j625L101J22647
$$ 28903 53495 -34770 -117355 -141165 -16315 -55012 -105409 -27806 -51698 -53323 -50222 72425
20190G2425L9162J3239l3973k2815q1251Q6567L3776o3529J03Q2198J16217o0061
$$ 72425 111587 124826 90853 68038 -13213 73354 107130 43601 43704 125902 242119 182058
20178A82058o6220J5545N8588M7666k8721Q1155n110k0111o2905r3886O6798K5198
$$ 182058 115838 131383 189971 237637 208916 290071 284961 264850 201945 108059 174857 200055
20166B00055j2568k5190M575k2513j7247q11q2493l5600L6260K4120r3413O527
$$ 200055 187487 162297 166872 144359 127112 126301 43808 8208 44468 68588 -24825 -18298
20154a8298N4663n0124Q11K9504J6649j00022M7915O2181N0036P5102J5387r3511
$$ -18298 36365 -13759 -12948 16556 33205 -66817 -18902 43279 93315 168417 183804 90293
20142I0293k5476k3903k0201o0624R663m3989M0703N0009K9608m706k8143m7506
$$ 90293 64817 40914 20713 -39911 -30248 -74237 -33534 16475 46083 41377 13234 -34272
20130c4272O2114K4897k1769m8524J6525O0457N6267N9840k8193N674n1713L7020
$$ -34272 27842 52739 30970 -17554 -1029 59428 115695 175535 147342 153016 101303 138323
20118A38323J8653j1287L3218j8034j17079j1558L6860K2023L8230M7648J1868
$$ 138323 156976 145689 178907 160873 43794 32236 69096 91119 129349 176997 188865
20107A88865o3302r96n0284l5151l4868n879N0839o167j34001j7948J00529J06447
$$ 188865 125563 124567 74283 39132 4264 -1615 49224 43057 -90944 -108892 -8363 98084
20095I8084P1922m1152j18730p4402P3022J02142j17429q3440O3222O0632N0562
$$ 98084 170006 128854 10124 -64278 8744 110886 -6543 -89983 -26761 33871 84433
20084H4433M4435J3218N2050N9847k0999j16281O4081J88782J30603p7261j56985
$$ 84433 128868 142086 194136 253983 232984 116703 180784 369566 500169 422908 265923
20073B65923p6640j00821j6975L9120O9403R657J51220K4546M4877J982j9476
$$ 265923 189283 88462 71487 110607 180010 189667 340887 365433 410310 412292 392816
20062C92816k0377L9722l141m9077N9080o5800j36573n5313O1464N2847l4315
$$ 392816 372439 412161 409020 359943 419023 353223 216650 161337 222801 275648 241333
20051B41333k5870K2887j3137o8416J3328k9419q5032n43m4613j20510P9824L7018
$$ 241333 215463 238350 225213 156797 170125 140706 55674 55131 10518 -109992 -30168 6850
20039F850j379J20547K1374m7509o9403r1531L1514P4834n9980j9607P6034l5163
$$ 6850 5471 126018 147392 99883 30480 -61051 -29537 45297 -14683 -34290 41744 6581
20027F581q3240n6537J0833o6022o5511O6078N8849M332O3135l8630J07927J6356
$$ 6581 -76659 -133196 -122363 -188385 -253896 -187818 -128969 -124637 -61502 -100132 7795 24151
20015B4151o5457n5794O4881n1314l6005M1426m9488q9654J4845K985L170M3148
$$ 24151 -41306 -97100 -32219 -83533 -119538 -78112 -127600 -217254 -202409 -199424 -196254 -153106
20003a53106L353n2830K3165K4327K8741O0715L4533R5854O1961O1004N6243O6257
$$ -153106 -149753 -202583 -179418 -155091 -126350 -65635 -31102 64752 126713 187717 243960 310217
19991C10217P8600o5691q8992n2142O222R8979J04938P3547N2382L9868n0029
$$ 310217 388817 323126 234134 181992 188214 287193 392131 465678 518060 557928 507899
19980E07899j03490k8955q1351r3557M2605r6993n1837m9291q3822J15797J9142
$$ 507899 404409 375454 294103 200546 243151 146158 94321 45030 -38792 77005 96147
19969I6147o4482k9572J42172Q8137J4190p293O0577j3545K839m7988r4615p5983
$$ 96147 31665 2093 144265 232402 246592 239299 299876 286331 289170 241182 146567 70584
19957G0584N5587J97858J20599P7487N7581Q6107J16116L2578l5833M3305j81403
$$ 70584 126171 324029 444628 522115 579696 665803 781919 814497 778664 821969 640566
19946F40566k42665q3808n1148j06343P7730l5524n1971R4546l0480q0827J9221
$$ 640566 397901 314093 262945 156602 234332 198808 146837 241383 210903 130076 149297
19935A49297j791q3469q3551Q6712K7349p9255r7412m102J64878O2804L6501O9377
$$ 149297 147506 64037 -19514 67198 94547 15292 -82120 -86222 78656 141460 177961 247338
19923B47338N9796p367k2837q9545N8410J5974j1470j7112O2154L9402P4173J424
$$ 247338 307134 299767 276930 187385 245795 261769 250299 233187 295341 334743 408916 410340
19911D10340K2570K4121j1463j5702M6032P1645M0372l878j8000k7832L7107R7533
$$ 410340 432910 457031 445568 429866 475898 547543 587915 584037 566037 538205 575312 672845
19899F72845Q3060J14743K21048K90920K50251K14161K11054K25585K85773K68247
$$ 672845 755905 870648 1091696 1382616 1632867 1847028 2058082 2283667 2569440 2837687
19889B837687K92661L86045M18199N19524N06027N51970M23928K37950K81434
$$ 2837687 3130348 3516393 3934592 4454116 4960143 5512113 5936041 6173991 6455425
19880F455425N06185P00496J244873K160490L030035M610054P154675J1914741
$$ 6455425 6961610 7662106 8906979 11067469 14097504 18707558 25862233 37776974
19872C7776974J9417414K3801635K2173741J6772728R384270O755873J806989
$$ 37776974 57194388 80996023 103169764 119942492 129326762 136082635 137889624
19865A37889624m607784j5838719k1349290j9538895j1406964M98612J2642855
$$ 137889624 133281840 117443121 96093831 76554936 65147972 65646584 78289439
19858G8289439J9605550J9274849J5043863P838137L757957j802054q388985j8903548
$$ 78289439 97894989 117169838 132213701 140051838 143809795 142007741 133618756 114715208
19850A14715208k4940686k4701669j9756328j3063003q252002n408766l837921
$$ 114715208 89774522 65072853 45316525 32253522 24001520 18592754 14754833
19843A4754833k655287j841764j295882q80656o50777n31606l63205l54822l82408
$$ 14754833 12099546 10257782 8961900 8081244 7430467 6898861 6535656 6180834 5798426
19834E798426m06617l66116l80021n08556n32278l96587l12347k16365p5646j34806
$$ 5798426 5391809 5025693 4645672 4137116 3604838 3208251 2895904 2679539 2603893 2469087
19824B469087j06602o9888m7111j81428r2668j53285k24618j50554k33237j21767
$$ 2469087 2362485 2292597 2245486 2064058 1971390 1818105 1593487 1442933 1209696 1087929
19814A087929m9490p1064k2788k8559k3283j9929m7902q7089P69N8640J6098p4616
$$ 1087929 1038439 967375 944587 916028 892745 872816 824914 737825 738594 797234 813332 738716
19802G38716n9463l7842o1467M178R0179N7733o1440k01548p0552l0470Q1438
$$ 738716 679253 641411 579944 584122 674301 732034 670594 469046 398494 368024 449462
19791D49462M7156J14695M977o2773o478k4287j3849O5309J39966j710q6447k2469
$$ 449462 496618 611313 616290 553517 547039 522752 508903 574212 714178 712468 626021 603552
19779F03552l2645K256l9085o0460j02665k7778Q1538J29485K0817O4776K9131
$$ 603552 570907 573163 534078 473618 370953 343175 424713 554198 575015 639791 668922
19768F68922N0062O1070M5468J8194j32108j72424k9027K9797P4875j28615p2172
$$ 668922 718984 780054 825522 843716 711608 539184 510157 539954 614829 486214 414042
19757D14042Q6901r4581n2966j8395M7421N3036O6137l6032l8783L128R6326r7082
$$ 414042 500943 406362 353396 335001 382422 435458 501595 465563 426780 429908 526234 429152
19745D29152p3694Q8683p1020j114J8177J08611M1645m2195k1072k3584p3726
$$ 429152 355458 444141 373121 372007 390184 498795 540440 498245 477173 453589 379863
19734C79863N0599O123o6922m32K86L3359R9776m5817q2460J05811n5193p8455
$$ 379863 430462 436585 369663 369231 369517 402876 502652 456835 374375 480186 424993 346538
19722C46538k2038L5736P1260P7100n9002k399M8582R1177n4076m9323M0326Q6727
$$ 346538 324500 360236 431496 508596 449594 447195 495777 586954 532878 483555 523881 610608
19710F10608o5449k5692L5351j5213p843k8377q9924j18687j5413N7532M7148
$$ 610608 545159 519467 554818 539605 531762 503385 413461 294774 279361 336893 384041
19699C84041J22959r677j12834j13273j1445k1497j25375K6902J30467L3877O6786
$$ 384041 507000 497323 384489 271216 259771 238274 112899 139801 270268 304145 370931
19688C70931p2929l0485J2397K6455O7213N5849j878N6161J4781o75j8729q3893
$$ 370931 298002 267517 279914 306369 373582 429431 427553 483714 498495 497820 479091 395198
19676C95198r5587p9582l8180m0001m4343N6258K420P8209J5353o8042Q870J9221
$$ 395198 299611 220029 181849 141848 97505 153763 156183 234392 249745 181703 190573 209794
19664B09794l3327j42194r118L5902q8210m9370q1786J0688O1832m5251Q3446
$$ 209794 176467 34273 25155 61057 -27153 -76523 -158309 -147621 -85789 -131040 -47594
19653d7594J31166J4897l4296n2797L8460K1818l5137m6532O6573J2507p7532
$$ -47594 83572 98469 64173 11376 49836 71654 36517 -10015 56558 69065 -8467
19642h467k8732M2211l2428k9925J20738J07406L1580o9344P3112J42637p4440
$$ -8467 -37199 5012 -27416 -57341 63397 170803 202383 133039 206151 348788 274348
19631B74348j15409K1143M6036q787L0092J55102P3509j01700j03722q7820M314
$$ 274348 158939 180082 226118 217331 247423 402525 476034 374334 270612 182792 187106
19620A87106j18709m9856n0722P6791K5172j9513L3341M3153j4174K8587M0237
$$ 187106 68397 18541 -32181 44610 69782 50269 83610 126763 112589 141176 181413
19609A81413N040R9410k4322j7526K2070j7477N0550p7192L829J22052l8643j1746
$$ 181413 186453 285863 261541 244015 266085 248608 299158 221966 225795 347847 309204 297458
19597B97458j9L5111l0744m4297J9714R5085l0743m2136K1478M8859P0699k3144
$$ 297458 297439 332550 301806 257509 277223 372308 341565 299429 320907 369766 440465 417321
19585D17321j23751o729r7629n5722N8668l8265M4846k1998r0750M1795R8997
$$ 417321 293570 286841 189212 133490 192158 153893 198739 176741 85991 127786 226783
19574B26783K336J15849R4267Q3173j6317j72215j69991p8025j28390j02310k2318
$$ 226783 229119 344968 439235 522408 506091 333876 163885 85860 -42530 -144840 -167158
19563a67158O231Q7745J49193K0693r250K1075J10571J9743M554K9192K7796R5557
$$ -167158 -160927 -73182 76011 96704 87454 108529 219100 238843 243397 272589 300385 395942
19551C95942l0742m7549k3586P8200j5438O7449k8916M5735k4334L7210N275M0005
$$ 395942 365200 317651 294065 372265 356827 424276 395360 441095 416761 453971 459246 499251
19539D99251N1876o4097q7121j50550j46638p0905m5228M853j2652j24170P790
$$ 499251 551127 487030 399909 249359 102721 31816 -13412 -8559 -21211 -145381 -137591
19528a37591J35141L7975q456o1385r7312r6738j58101r2501O6263P5008J43087
$$ -137591 -2450 35525 27069 -34316 -131628 -228366 -386467 -478968 -412705 -337697 -194610
19517a94610J54913J38106N4046r574J02570R8084J21109K70809K77345K8453
$$ -194610 -39697 98409 152455 142881 245451 343535 464644 735453 1012798 1041251
19507A041251o4291j11026j24212j64816l4519j57966o3572N8781p3861k36069
$$ 1041251 976960 865934 741722 576906 542387 384421 320849 379630 305769 69700
19497F9700p8068k3886P1288J5789K8727M2533k2886m5745J6281J21922J92729
$$ 69700 -8368 -32254 39034 54823 83550 126083 103197 57452 73733 195655 388384
19486C88384Q3678M7168n7335r0833J1287N1224k2545j02943j4167P2647J45140
$$ 388384 472062 519230 461895 371062 382349 433573 411028 308085 293918 366565 511705
19475E11705J50048J92738K37469J02188O1532p351K5913L4915j46468k19989
$$ 511705 661753 854491 1091960 1194148 1255680 1248329 1274242 1309157 1162689 942700
19465I42700k52797l4575L5221L6931j2567j32295q5413m3150M1071J93560J96576
$$ 942700 689903 655328 690549 727480 714913 582618 497205 454055 495126 688686 885262
19454H85262J51191M1847J01959R2732O0638J96008L35348L52487L47956K40038
$$ 885262 1036453 1078300 1180259 1272991 1333629 1529637 1864985 2217472 2565428 2805466
19444B805466K24352K90517N70419R49501J498787K577870M502123P677688J0807009
$$ 2805466 3029818 3320335 3890754 4840255 6339042 8916912 13419035 21096723 31903732
19435C1903732J0388218P254152L629851K999111R99938k039739p780360j0893961
$$ 31903732 42291950 49546102 53175953 56175064 57175002 55135263 47354903 36460942
19427C6460942j0626314q197967n136194l000023j941771j311129q58308o71370
$$ 36460942 25834628 17636661 12500467 9500444 7558673 6247544 5389236 4717866
19419D717866l96314k12598j05056k9932q9032j04677l46050l51108k69388l27698
$$ 4717866 4321552 4108954 4003898 3973966 3884934 3780257 3434207 3083099 2813711 2486013
19409B486013k96549k08963m6342L6139K8968J9574K3488j04505R3222J96718
$$ 2486013 2189464 1980501 1934159 1970298 1999266 2018840 2042328 1937823 2031045 2227763
19399B227763L28926L81318N27523O85233O18551L70057M40070M76719N95121
$$ 2227763 2556689 2938007 3465530 4150763 4769314 5139371 5579441 6056160 6651281
19390F651281O41300O67922J136301J707568K345045L488690N366059Q634269
$$ 6651281 7292581 7960503 9096804 10804372 13149417 16638107 22004166 30638435
19382C0638435J4516176K5200677M0755303M8087568L9695720K1287693O865402
$$ 30638435 45154611 70355288 111110591 159198159 198893879 220181572 227046974
19375B27046974J394205p021037j9575994l7030229m1769878l7690126k6692237
$$ 227046974 228441179 221420142 201844148 164813919 123044041 85353915 58661678
19368E8661678j6646976j0397206o675773m373688k838834j716494j161563q87454
$$ 58661678 42014702 31617496 24941723 20568035 17729201 16012707 14851144 13963690
19360A3963690m38169j80047p6721k8046K55527P04693J356265K560775M209128
$$ 13963690 13525521 13345474 13268753 13240707 13496234 14200927 15557192 18117967 22327095
19351B2327095P205636J2678555K2482595L6227367M1890091K8860686J605018
$$ 22327095 29532731 42211286 64693881 100921248 142811339 171672025 173277043
19344A73277043k4708618l5394994l2249132k1478931j1833106n177419N99563
$$ 173277043 148568425 113173431 80924299 59445368 47612262 42434843 43034406
19337D3034406P415302J7380906L0266569L5421556K4346740M84133k3971392
$$ 43034406 50449708 67830614 98097183 133518739 157865479 158349612 134378220
19330A34378220l3649671l1420303k2110124j3505336q190347m988158l294379
$$ 134378220 100728549 69308246 47198122 33692786 25502439 20514281 17219902
19323A7219902k472796k053041j739435j660695j310903q95780q55644p26817
$$ 17219902 14747106 12694065 10954630 9293935 7983032 7087252 6231608 5504791
19315E504791n77000m03828j79711q2523j96690j73279j12753o9716K37J51323
$$ 5504791 4927791 4523963 4344252 4261729 4065039 3891760 3779007 3709291 3709528 3860851
19305C860851J61349r8468j14542o3529p76K8727K50589L05023M14437N55269
$$ 3860851 4022200 3923732 3809190 3745661 3744885 3773612 4024201 4329224 4743661 5298930
19295E298930J099972J827708L348090O039026R171380R230930M912541k153478
$$ 5298930 6398902 8226610 11574700 17613726 26785106 36016036 40928577 38775099
19287C8775099p135276q110366o397783l849284j981170o06277R38312K867214
$$ 38775099 31639823 23529457 17131674 13282390 11301220 10694943 11633255 14500469
19279A4500469N816007R293500R350876M722538k612123q076688r179406p555858
$$ 14500469 20316476 29609976 38960852 43683390 41071267 32994579 23815173 16259315
19271A6259315n018181l022544j888472j284353r42469p73035l70180k69462r3487
$$ 16259315 11241134 8218590 6330118 5045765 4103296 3330261 2960081 2690619 2597132
19262B597132j62686k55579j39743r2441j25196p6076p1914m100m8137m8009j9357
$$ 2597132 2434446 2178867 2039124 1946683 1821487 1745411 1673497 1669397 1621260 1573251 1553894
19251A553894R2570N088n4752j19589j12771l8381r6917j40761j32294m9175l5709
$$ 1553894 1646464 1651552 1596800 1477211 1364440 1326059 1229142 1088381 956087 906912 871203
19240H71203j15824J1323n095J0327r3072j2322o2290L5774J24814R5883L6815
$$ 871203 755379 766702 761607 771934 678862 666540 604250 640024 764838 860721 897536
19229H97536j24876m6195M1173O8581J0146r1962M8027N3346n1576k3109O3489
$$ 897536 772660 726465 767638 836219 846365 754403 802430 855776 804200 781091 844580
19218H44580r3756j66492n8628p9914j37496k6187l1848J03761J15656K9734K2077
$$ 844580 750824 584332 525704 445790 308294 282107 250259 354020 469676 499410 521487
19207E21487m5192r215J3768J1978L0916K961M1670M3066M8765J6169n498n4361
$$ 521487 476295 467080 480848 492826 523742 526703 568373 611439 660204 676373 670875 616514
19195F16514j2753P445J58122M1405J13199O8139j05702m7563m2314m4517j96624
$$ 616514 603761 611206 769328 810733 923932 992071 886369 838806 796492 751975 555351
19184E55351j35486j48132j40067j8108o682o4037l9990o2734N0698P9278q586
$$ 555351 419865 271733 131666 113558 106876 42839 2849 -59885 -9187 70091 61505
19173F1505j0704R7522l6669P2508L7669q5612L2475k3391J6021J31399J57893
$$ 61505 50801 148323 111654 184162 221831 136219 168694 145303 161324 292723 450616
19162D50616j0557n8637J00867J29494O6672l8455k25637j56479q1649m2074n7307
$$ 450616 440059 381422 482289 611783 678455 640000 414363 257884 176235 134161 76854
19151G6854L0432L3350l8183M5216P3736N0737K8834J7434M5024N6114J63L4411
$$ 76854 107286 140636 102453 147669 221405 272142 300976 318410 363434 419548 419711 454122
19139D54122P4146P1553j7609n5868r6260j60102j41566K271l4154n5103K3841
$$ 454122 528268 599821 582212 526344 430084 269982 128416 130687 96533 41430 65271
19128F5271n1449J0524k1110R952n6107Q7140R6544J38310Q6611J1218M8323Q1108
$$ 65271 13822 24346 3236 13188 -42919 44221 140765 279075 365686 376904 425227 506335
19116E06335L9720o7165o1674n6060j32243j0889L0m9469m8619R402M3205L6425
$$ 506335 546055 478890 417216 361156 228913 218024 218054 168585 119966 129368 172573 208998
19104B08998N5979p4500k7458J46982J09331N6359L387K8812o6348j30581o3888
$$ 208998 264977 190477 163019 310001 419332 475691 479078 507890 441542 310961 247073
19093B47073q5566O1655j8943j5037J55390O4170j66388q8182N2814Q9984J1301
$$ 247073 161507 223162 204219 189182 344572 408742 242354 154172 206986 296970 308271
19082C08271o4750j04077p8255J02646K04807J56413O1541k1690j45433p8595
$$ 308271 243521 139444 61189 163835 368642 525055 586596 564906 419473 340878
19072C40878p1987j51918j33178M5958N8676O4716N8917r7756M4813r779j21332
$$ 340878 268891 116973 -16205 29753 88429 153145 212062 114306 159119 149340 28008
19061B8008q7687k7828P472Q1730M4851k0151r2074r2405K6539N902J04699m549
$$ 28008 -59679 -87507 -80035 1695 46546 26395 -65679 -158084 -131545 -125643 -20944 -25493
19049b5493m4129j13303J10604P4765N6818k5401r3000M3769K0m5155M3476N2841
$$ -25493 -69622 -182925 -72321 2444 59262 33861 -59139 -15370 -15350 -60505 -17029 35812
19037C5812Q526o587M6278j3286r4358q5161K0133P1422o4225K2229P9241L8753
$$ 35812 44338 37751 84029 70743 -23615 -108776 -88643 -17221 -81446 -59217 20024 58777
19025E8777o2516j03784k9198R3082Q6485k6686k7924L4017P1979n9306j09557
$$ 58777 -3739 -107523 -136721 -43639 42846 16160 -11764 22253 94232 34926 -74631
19014g4631N5056n5291R4736M3868m6082K1619O6392m4209n1809j139L5926J21635
$$ -74631 -19575 -74866 19870 63738 17656 39275 105667 61458 9649 8510 44436 166071
19002A66071l067p9348Q972q75M7215L3053m084n0216l5222r8843l2271N549O8445
$$ 166071 163004 83656 92628 91753 138968 172021 167937 117721 82499 -16344 -48615 -43066 25379
18989B5379k5255O4124l4122k1046K1782k443J4543L845j0044m6359m6622p691
$$ 25379 124 64248 30126 9080 30862 28419 42962 46807 36763 -9596 -56218 -63909
18977f3909J49008P4693p884k3704j03067q5348m3928L5031J06788M0261J1158
$$ -63909 85099 159792 151908 128204 25137 -60211 -104139 -69108 37680 77941 89099
18966H9099j2653q0800j6881M6429l0397m9765k6280m323J43413M8530J0605k3732
$$ 89099 76446 -4354 -21235 25194 -5203 -54968 -81248 -85571 57842 106372 116977 93245
18954I3245o2134q0745n1634M0349j6772K0257j616N0367P8692J9959N1648o0804
$$ 93245 31111 -49634 -101268 -60919 -77691 -57434 -59050 -8683 70009 89968 141616 80812
18942H0812K020K2953K3979L9276Q0309q333j88251o0723R9461o1748m5764N8358
$$ 80812 82832 105785 129764 169040 249349 241016 52765 -7958 91503 29755 -16009 42349
18930D2349o2646m2679l0664J9116M762Q7976Q9695K4176K5289q4052m8194n5399
$$ 42349 -20297 -62976 -93640 -74524 -69762 18214 107909 132085 157374 73322 25128 -30271
18918c0271m3609P3286P2414K3789m0047K2365L7207N8566L8624m9566p4391l1113
$$ -30271 -73880 -594 71820 95609 55562 77927 115134 173700 212324 162758 88367 57254
18906E7254m7080n361l2779m8293L4229N6621Q8588l1142l0406P2061J30045j2736
$$ 57254 10174 4813 -27966 -76259 -42030 14591 103179 72037 41631 113692 243737 231001
18894B31001Q5475K13445K00938R9725l1923l1753J2412j02279j75518o3994j31938
$$ 231001 316476 529921 730859 830584 798661 766908 779320 677041 501523 437529 305591
18883C05591j62686k5736N5922n5739n9779R044j4667K4317J14287N7136j00555
$$ 305591 142905 117169 173091 117352 57573 66617 51950 76267 190554 247690 147135
18872A47135q7248J3101q8294J1842N9964j22182N5836J24831M8861O7437K3326
$$ 147135 59887 72988 -15306 -3464 56500 -65682 -9846 114985 163846 231283 254609
18861B54609m89L1686j08776J4693k5694K7501K4284N6417R603p064j9500L6005
$$ 254609 254120 285806 177030 191723 166029 193530 217814 274231 283834 276770 257270 293275
18849B93275O7958k8463j75220o3637R2990J06856l6025m3168l1281j7303M6031
$$ 293275 361233 332770 157550 93913 186903 293759 257734 214566 183285 165982 212013
18838B12013N9480J16059J61368J78421P8625J6004j46807j11112j54721m7803
$$ 212013 271493 387552 548920 727341 805966 821970 675163 564051 409330 361527
18828C61527J0990n5375K2600j76685j37039j9037n8806J02130J39884Q236K0210
$$ 361527 372517 317142 339742 163057 26018 6981 -51825 50305 190189 198425 218635
18817B18635J7580J31145K01117J34969k5680j79843j53964j00103O7135j4665
$$ 218635 236215 367360 568477 703446 677766 497923 343959 243856 310991 296326
18807B96326k7971Q0833J1294L7620k4888J6741J02207M8077M0489j79044j43586
$$ 296326 268355 349188 360482 398102 373214 389955 492162 540239 580728 401684 258098
18796B58098o8719n4891q3944j37417Q941Q2340K07485N9625j26741n2490j0900
$$ 258098 189379 134488 50544 -86873 -77932 4408 211893 271518 144777 92287 81387
18785H1387o164J164l8938p6007r4109j6125j4771Q3206J02580M5396k2354m0755
$$ 81387 75223 76387 37449 -38558 -132667 -148792 -163563 -80357 22223 67619 45265 4510
18773D510J0805J49685O6303k5298R418m6894j53131l8299R7878O4015q758j6097
$$ 4510 15315 165000 231303 206005 215423 168529 15398 -22901 74977 138992 130234 114137
18761A14137J04971J48157J22259N2634k6841n7110P245R0810K024j1389M4516
$$ 114137 219108 367265 489524 542158 515317 458207 465452 556262 558286 546897 591413
18750E91413j7562j04544j09202J05413M9247j4999J21868P3776p7242r4756j02398
$$ 591413 573851 469307 360105 465518 514765 499766 621634 695410 618168 523412 421014
18739D21014q5515o9904r1957J1412M7521j3534M8569K9840J1735J89362K0453
$$ 421014 335499 265595 173638 185050 232571 219037 267606 297446 309181 498543 518996
18728E18996j1990j25092p0505n9455N6581L7096O1162K4866k3961j1715j8218
$$ 518996 507006 381914 311409 251954 308535 345631 406793 431659 407698 395983 377765
18717C77765k4128l0777P0064R0293o861j22929l296P1526K7590k6180p1276l2218
$$ 377765 353637 322860 392924 483217 476356 353427 350131 421657 449247 423067 351791 319573
18705C19573r9708P4032q97O72l27q4081j27968J1398k5918n939m5766k7573l1173
$$ 319573 219865 293897 293000 293672 293345 209264 81296 92694 66776 60837 15071 -12502 -43675
18692d3675p9127P9527M7561L7944J1851O5689l0997j274l2822m0825O6800M5917
$$ -43675 -122802 -43275 4286 42230 54081 119770 88773 87499 54677 13852 80652 126569
18680A26569M9282J1245O2207q0226j10983L5870j3762n4589N6321J24340k1437
$$ 126569 175851 187096 249303 169077 58094 93964 80202 25613 81934 206274 184837
18669A84837M7762l1934j1041m6435k0898N220n7053n7699M80k6267n5657P716
$$ 184837 232599 200665 189624 143189 122291 127511 70458 12759 13239 -13028 -68685 -60969
18657f0969N5433J1685J0306o4967k6771J2301k3390N0357L9649n5710m6234j6962
$$ -60969 -5536 6149 16455 -48512 -75283 -62982 -86372 -36015 3634 -52076 -98310 -115272
18645a15272J12891J4752m7473r636N3204M5772L0897k04N8677L0198L7796M4065
$$ -115272 -2381 12371 -35102 -44738 8466 54238 85135 84931 143608 173806 211602 255667
18633B55667j56645q479L2820P702j7129r5575k0933P6696N9384L4031m9710j24832
$$ 255667 99022 90543 123363 131065 113936 18361 -2572 74124 133508 167539 117829 -7003
18621g003j8526K5144J3505n675J2860k3837j0263N6743M2564o7357l2442Q568
$$ -7003 -25529 -385 13120 7445 20305 -3532 -13795 42948 85512 18155 -14287 -5719
18609e719J26142K7995n6270r5691m3327O843O4725Q251L0406j3734k3678J02485
$$ -5719 120423 148418 92148 -3543 -46870 -40027 24698 32949 63355 49621 25943 128428
18597A28428m0016r8155J02075k9044L6317j43677k5472J13301L7410J16070J7792
$$ 128428 88412 -9743 92332 63288 99605 -44072 -69544 43757 81167 197237 215029
18586B15029j69757j8012l1188r2762P6666M0983r3939o4033L9371N1454n236
$$ 215029 45272 27260 -3928 -96690 -20024 20959 -72980 -137013 -97642 -46188 -51424
18575e1424R8735N4760N3395J513M3224q5334q5339M9425L6104p473p1434n8464
$$ -51424 47311 102071 155466 156979 200203 114869 29530 78955 115059 107586 36152 -22312
18563b2312l9001K7751k5173l0539J15275L7353K4195j0985K2877n595p532k7
$$ -22312 -61313 -33562 -58735 -89274 26001 63354 87549 76564 99441 93846 86314 86287
18551H6287j062l9407j0244J613K4099n7763n632K7536M3766Q4651K1600q2260
$$ 86287 85225 45818 35574 37187 61286 3523 -2109 25427 69193 153844 175444 93184
18539I3184l0915Q909j06481q0412m1771k2769N4431J16166L9823l1427l3628
$$ 93184 62269 71178 -35303 -115715 -157486 -180255 -125824 -9658 30165 -1262 -34890
18528c4890p5245l7315Q9065R5129J8407r3453R2393Q0808j2434L3024l8121j51591
$$ -34890 -110135 -147450 -58385 36744 55151 -38302 54091 134899 122465 155489 117368 -34223
18516c4223j60760J46N4530R2572M3221J41r2029K7399l0978P7152K5296J41188
$$ -34223 -194983 -194837 -140307 -47735 -4514 -4373 -96402 -69003 -99981 -22829 2467 143655
18504A43655J5472j10439m624J26565P4329K8281M6291K8173K3081j04198m0722
$$ 143655 159127 48688 44064 170629 244958 273239 319530 347703 370784 266586 225864
18493B25864n7629L6104m2958k2743m145j9602o18R176q2996m001M5976l1831
$$ 225864 168235 204339 161381 138638 134493 114891 114273 123449 40453 36452 82428 50597
18481E0597q181L7255J32206J5173q5351j8426P3253K2481r9667o4713p613k0925
$$ 50597 42416 79671 211877 227050 141699 123273 196526 219007 119340 54627 47014 26089
18469B6089K3737M3461o5518o1375J42812P6380m1344o9587r1813j4112Q487O2817
$$ 26089 49826 93287 27769 -33606 109206 185586 144242 74655 -17158 -31270 -22783 40034
18457D0034q0131j7244j2293j566K1009J00710J27753m2528o221N4177L256j26046
$$ 40034 -40097 -57341 -69634 -71200 -50191 50519 178272 135744 129523 183700 186956 60910
18445F0910q2807K3340K9780m1785n1961K0092O8443m476j0693n0660k6894j09314
$$ 60910 -21897 1443 31223 -10562 -62523 -42431 26012 21536 10843 -39817 -66711 -176025
18433a76025O2656J26499j6031K5965O6923R0701l9736m6370m6826j8857Q1664
$$ -176025 -113369 13130 -2901 23064 89987 180688 140952 94582 47756 28899 110563
18422A10563l7162j05693k1445N0730Q0830P1363J6218r2543l3671L0648O0517
$$ 110563 73401 -32292 -53737 -3007 77823 149186 165404 72861 39190 69838 130355
18411A30355O2600N1815r4490q5535L2357N2945P6943J0617J380q7061n8490j9254
$$ 130355 192955 244770 150280 64745 97102 150047 226990 237607 238987 151926 93436 74182
18399G4182J3979P6877k5891j94964j10575P2594k6938K5551o316N4451R7685
$$ 74182 88161 165038 139147 -55817 -166392 -93798 -120736 -95185 -101501 -47050 50635
18388E0635J59532j12217L1797J8286j001J8892J5679p129L4763L9322l7549P558
$$ 50635 210167 97950 129747 148033 147032 165924 181603 174474 209237 248559 211010 218568
18376B18568R001q2647j15707j21858j2740j3555L3531J47270J9714n6446N832
$$ 218568 227569 144922 29215 -92643 -105383 -118938 -85407 61863 81577 25131 30963
18365C0963m5046L3315p119l3561N9853M887M9101O791q3854K2567l4157j04046
$$ 30963 -14083 19232 12113 -21448 38405 43292 92393 99184 15330 37897 3740 -100306
18353a00306p111Q669j9758Q5256M3637P964J9591k0340J8150l511o1388J2234
$$ -100306 -107417 -98748 -118506 -33250 10387 18351 37942 17602 35752 32241 -29147 -16913
18341a6913M9904j1228L3065N6687J19723J1759k4073n1555J2985J01676M7538
$$ -16913 32991 21763 54828 111515 231238 242997 218924 167369 180354 282030 329568
18330C29568j890l0919k5962k9422Q0633k9182j46436j05560k0592R6836M1011
$$ 329568 327678 296759 270797 241375 322008 292826 146390 40830 20238 117074 158085
18319A58085K0371m23o9957O1827j17506l1004M8803J10358Q529p3465Q2575K9270
$$ 158085 178456 178033 108076 169903 52397 21393 70196 180554 189083 115618 198193 227463
18307B27463j19496r112K505j06546M2668l567j05964n7053O308L0702J03259
$$ 227463 107967 98855 101360 -5186 37482 33915 -72049 -129102 -122794 -92092 11167
18296A1167M4384j1649L1789J8876m0362K9803l577k2915j06339p8810p3507L3168
$$ 11167 55551 43902 75691 94567 54205 84008 80431 57516 -48823 -127633 -201140 -167972
18284a67972J48968k909p240J1463p558n3955k2273Q757n2492P2164J59372K3779
$$ -167972 -19004 -21913 -29153 -17690 -25248 -79203 -101476 -92719 -145211 -73047 86325 110104
18272A10104K8202r295n7572J5811j7L9075o3661j4110O7791R1588R3021m8408
$$ 110104 138306 129011 71439 87250 87233 126308 62647 48537 116328 207916 300937 252529
18260B52529j73391j1479m2634N1394j9978m0370j6777O4426m8920M1162J3543
$$ 252529 79138 67659 25025 76419 56441 16071 -706 63720 14800 55962 69505
18249F9505m87J21368N5407j25406k8599K1498o5190L2868R6525N9630r5644o5710
$$ 69505 69018 190386 245793 120387 91788 113286 48096 80964 177489 237119 141475 75765
18237G5765j6645l3087q2655n3405Q2657p40k6269R4543n2353j74125j5966J14854
$$ 75765 59120 26033 -56622 -110027 -27370 -28110 -54379 40164 -12189 -186314 -202280 -87426
18225h7426Q9859j0970l018Q565P1401K1363L1898l2960p6916J9116N0755L4406
$$ -87426 2433 -8537 -11555 -2990 68411 89774 121672 88712 11796 30912 81667 116073
18213A16073l9654j09226j09019l2864L3623R4098J7731r9464o8603M2532P6311
$$ 116073 76419 -32807 -141826 -174690 -141067 -46969 -29238 -128702 -197305 -154773 -78462
18202g8462M8581l3450q8168j6912J45089J29050L4300j16485n4466N1025R8170
$$ -78462 -29881 -63331 -151499 -168411 -23322 105728 140028 23543 -30923 20102 118272
18191A18272K2062n4803K3800J287n3890p604J11923J08602o2898p2049J6529
$$ 118272 140334 85531 109331 110618 56728 49124 161047 269649 206751 134702 151231
18180A51231j0415j00855J37144k2715O6034R117o4409j17485m18K0444J3308
$$ 151231 140816 39961 177105 154390 220424 229541 165132 47647 47229 67673 80981
18169H0981o0038m7393j9884N9646R996L830R370K429n6974N4580O4638M5683
$$ 80981 20943 -26450 -46334 13312 23308 27138 36508 38937 -18037 36543 101181 146864
18157A46864j4984N1874M5577l2444K6784l7675j23244J7844P02r7028k7014L4517
$$ 146864 131880 183754 229331 196887 223671 185996 62752 80596 81298 -15730 -42744 -8227
18145h227O8969L4753o939k822j1551m9881J0728J192N6460r2068j13109M9914
$$ -8227 60742 95495 88556 85734 74183 24302 35030 36222 92682 614 -112495 -62581
18133f2581M9501J1319l196r47K9283j450Q312Q9349J21682M5663J28275J13365
$$ -62581 -13080 -1761 -4957 -5904 23379 21929 30241 119590 241272 286935 415210 528575
18121E28575O2295M7670P26r0164j25412k6859O4626K0224j9535n3286L8171K6662
$$ 528575 590870 638540 639266 549102 423690 396831 461457 481681 462146 408860 447031 473693
18109D73693J45197J52833P9476j12069r4170j11123r0774k4904n2618q6105p2587
$$ 473693 618890 771723 851199 739130 644960 533837 443063 418159 365541 279436 206849
18098B06849K9369j5663j33609q5789K0810L3169M4854K1101O08k5520Q5221Q963
$$ 206849 236218 220555 86946 1157 21967 55136 99990 121091 121699 96179 181400 190363
18086A90363r211L5713M2153l1858K1193m1168r1312k6956o5565j00472k9238
$$ 190363 181152 216865 259018 227160 248353 207185 115873 88917 23352 -77120 -106358
18075a06358K4839l2150O2075Q2198J75731J13744M8069N0932J00468o9223l0329
$$ -106358 -81519 -113669 -51594 30604 206335 320079 368148 419080 519548 450325 419996
18064D19996m7661m0306K3179o8443q8237k0771R1292N0634O2360J25939k3659
$$ 419996 372335 332029 355208 286765 198528 177757 269049 319683 382043 507982 484323
18053D84323p4944L7211o7779j01206o3047q7578j4008k1918P153M1231j2698
$$ 484323 409379 446590 378811 277605 214558 126980 112972 91054 98207 139438 126740
18042A26740q7742l4025l9614P896J8507p0850k9988J29908O9684J4251N031R1190
$$ 126740 38998 4973 -34641 -26745 -8238 -79088 -109076 20832 90516 104767 109798 200988
18030B00988j00759r9441K9885J4236n1571l9604K7435o5796K0575J09065O2306
$$ 200988 100229 788 30673 44909 -6662 -46266 -18831 -84627 -64052 45013 107319
18019A07319J4363K7792j7129l9691o6874n1499O9329J32928m7711p3297J0890
$$ 107319 121682 149474 132345 92654 25780 -25719 43610 176538 128827 55530 66420
18008F6420n2785J4327J44722k4133o6022j18618K5539M6071M8586m730J09342
$$ 66420 13635 27962 172684 148551 82529 -36089 -10550 35521 84107 79377 188719
17997A88719Q4548p0202n111l1553j3177R0994m7699l4368J6072O195m6982j4866
$$ 188719 273267 203065 197954 166401 153224 244218 196519 162151 178223 184418 137436 122570
17985A22570J9798K9671n0514j16993l1098n781R057j5644Q6698P6119j15761
$$ 122570 142368 172039 121525 4532 -26566 -32347 -23290 -38934 47764 123883 8122
17974H122o3020M8309j6476j232L9489Q9188Q3862j4111J9593M6252L2288j56545
$$ 8122 -54898 -6589 -23065 -24297 15192 104380 188242 174131 193724 239976 272264 115719
17962A15719p5932K1180j1359j7685Q4545q9174n3489p931J18121P0026p5952
$$ 115719 39787 60967 49608 31923 116468 27294 -26195 -34126 83995 154021 78069
17951G8069l1983J5895r4712k8280L1188N7584L5022r6795k6470L5975O720M471
$$ 78069 46086 61981 -32731 -61011 -29823 27761 62783 -34012 -60482 -24507 -17787 -13316
17939a3316K7693R418l3835l9424k6759K0597Q5715K6268o0407L5995M4064o0550
$$ -13316 14377 23795 -10040 -49464 -76223 -55626 30089 56357 -4050 31945 76009 15459
17927A5459J5603Q9851R6701j30278J3860J74767J4299n5713k6732k1707j14769
$$ 15459 31062 120913 217614 87336 101196 275963 290262 234549 207817 186110 71341
17916G1341K2650k8819r8631k2156O306K7586K9114K3818K0686k5768Q6143k2233
$$ 71341 93991 65172 -33459 -55615 -49309 -21723 7391 31209 51895 26127 112270 90037
17904I0037j42910o7438J15416O4180j00561n3940J17481J12872k0920q9964o3667
$$ 90037 -52873 -120311 -4895 59285 -41276 -95216 22265 135137 114217 24253 -39414
17893c9414O7685O8264m3206l7877j0997N9457N3495o7025j42803j20091J04109
$$ -39414 28271 96535 53329 15452 4455 63912 117407 50382 -92421 -212512 -108403
17882a08403J36579J1835j4989L3931p9385p1860Q798j577J5905M6158k8110N4858
$$ -108403 28176 40011 25022 58953 -20432 -92292 -83494 -85071 -69166 -23008 -51118 3740
17870C740P2521O6904M6623M780p9211L2802l269l0683k8587j19292k309k0817
$$ 3740 76261 143165 189788 194568 115357 148159 144890 114207 85620 -33672 -35981 -56798
17858e6798O7171K2882l8093m1499q2900o3322M687R2841J8542j2337k0071J6399
$$ -56798 10373 33255 -4838 -46337 -129237 -192559 -187872 -95031 -76489 -88826 -108897 -92498
17846i2498Q4454O8186P2195N838m5297m6494p9285M5366j464j40171k1848k2098
$$ -92498 -8044 60142 132337 138175 92878 46384 -32901 12465 11001 -129170 -151018 -173116
17834a73116K7468R5137m7668O1450J49061K3517K110r7423l0716k49o2311N0261
$$ -173116 -145648 -50511 -98179 -36729 112332 135849 137959 40536 9820 9571 -52740 -2479
17822b479N8742l7261O6283j6521l6744l5j6042O876q5228r8356m0255o4304n500
$$ -2479 56263 19002 85285 68764 32020 31985 15943 22819 -62409 -160765 -201020 -265324 -270824
17809b70824J03469J52415m1396j03472l044J29819J24145J04819l7884r7653
$$ -270824 -167355 -14940 -56336 -159808 -162852 -33033 91112 195931 158047 60394
17799F0394n7648M1628L2902m4778m437k5830p5270l3611N1192o2167K8076l1889
$$ 60394 2746 44374 77276 32498 28061 2231 -73039 -106650 -55458 -117625 -89549 -121438
17787a21438Q0851j0159O699P4400j1410q7221J030J1290R288P5996P6583o3146
$$ -121438 -40587 -50746 -44047 30353 18943 -68278 -67248 -55958 -46670 29326 105909 42763
17775D2763q9010L074j8879K5175K1541m4050P2575P632L9990j9666O4326N405
$$ 42763 -46247 -43173 -62052 -36877 -15336 -59386 13189 20821 60811 41145 105471 110876
17763A10876m1678k6755k1664l5803j02212J48660M7788q6826k2774J8221O2194
$$ 110876 69198 42443 20779 -15024 -117236 31424 79212 -7614 -30388 -12167 50027
17752E0027L4143m8030r4331K0950L2121j5954k2676n384K6061P4044m9329j4526
$$ 50027 84170 36140 -58191 -37241 -5120 -21074 -43750 -49134 -23073 50971 1642 -12884
17740a2884J917q1556j03086M8378l157L955R1129P978N1309J8703J3157k056
$$ -12884 -10967 -92523 -195609 -147231 -150388 -146433 -55304 -47326 3983 22686 35843 33787
17728C3787j28703j6458R1072M1556o665J6364l7954o492J41740M2453j1291j07188
$$ 33787 -94916 -111374 -20302 21254 14589 30953 -7001 -13493 128247 170700 159409 52221
17716E2221k876P0291j36894m0177K2287q482n2595k0010M2193K8459M394R7278
$$ 52221 49345 119636 -17258 -57435 -35148 -43630 -96225 -116235 -74042 -45583 -41189 56089
17704E6089L0108O818p4197L1118L4378j10503n5230M920l8928k6327K6875L5068
$$ 56089 86197 93015 18818 49936 84314 -26189 -81419 -76499 -115427 -141754 -114879 -79811
17692g9811j7665l6316j0057L1196P5734k095L5977R5711j674q296n0292m7759
$$ -79811 -97476 -133792 -143849 -112653 -36919 -39014 -3037 92674 91000 82704 32412 -15347
17680a5347o0997L7782j0964l3607l1585J20746p6681l2329Q0705j3400k2103
$$ -15347 -76344 -38562 -49526 -83133 -114718 6028 -70653 -102982 -22277 -35677 -57780
17669e7780m724m9088q914R1138P1432K6211o5180j00004N2696n1713N0613O6226
$$ -57780 -62504 -111592 -120506 -29368 42064 68275 3095 -96909 -44213 -95926 -45313 20913
17657B0913L102l6828k9500M7798j7541R6423K8235j9816M7712q1620r3095p690
$$ 20913 24015 -12813 -42313 5485 -12056 84367 112602 92786 140498 58878 -34217 -41907
17645d1907K1272Q1721O9037m8984M546K7954m4157j4768r0100L0649p86J7608
$$ -41907 -20635 61086 130123 81139 85685 113639 69482 54714 -35386 -4737 -5523 12085
17633A2085M8382o8242L8817K990n50J9989L8149n8730Q2197J8820M890n0865
$$ 12085 60467 -7775 31042 34032 33482 53471 91620 32890 115087 133907 138797 87932
17621H7932k3180K5218M2998k1649m1192m6114J8312L0277O0188L7023k9950L8186
$$ 87932 64752 89970 132968 111319 70127 24013 42325 72602 132790 169813 139863 178049
17609A78049j82321n2164O8596J7917M2181R395n5159j2688j00266k8185M9471
$$ 178049 -4272 -56436 12160 30077 72258 81653 26494 13806 -86460 -114645 -65174
17598f5174O2930k7127o256J8262P1342L9492k6217j18315j2865J62256J35872
$$ -65174 -2244 -29371 -35627 -17365 53977 93469 67252 -51063 -63928 98328 234200
17587B34200k0123q26j37910j51040n0463Q0640P8842L5169j4086j0806l8857
$$ 234200 214077 213251 75341 -75699 -126162 -45522 33320 68489 54403 43597 4740
17576D740q921l1687m7168L0391Q8873O0963k8532L4525M1466K2149m9726l6352
$$ 4740 -4181 -35868 -83036 -52645 36228 97191 68659 103184 144650 166799 117073 80721
17564H0721j0532o6766M480k4264j0024n7045o630j5916o2497O3723R6180P0066
$$ 80721 70189 3423 7903 -16361 -26385 -83430 -90060 -105976 -168473 -104750 -8570 61496
17552F1496r780r0711q747N7897k503p8549m5581Q0662O8020p2688k394L9156
$$ 61496 51716 -38995 -47742 10155 7652 -70897 -116478 -35816 32204 -40484 -42878 -3722
17540c722p2052m48J59404j2395q7931j7753p224J0595J8189p6539l9483q1724
$$ -3722 -75774 -76222 83182 70787 -17144 -34897 -42121 -31526 -13337 -89876 -129359 -211083
17528b11083J6502R3895Q4236K3452L734l5225N590k4287l0409M1941p782J41098
$$ -211083 -194581 -100686 -16450 7002 10736 -24489 -18899 -43186 -73595 -31654 -39436 101662
17516A01662J8380l5979k4007r855n7664q9688l2987N6930L6952m7349K3029k7458
$$ 101662 120042 84063 60056 50201 -7463 -97151 -130138 -73208 -36256 -83605 -60576 -88034
17504h8034L9352R8563J8691p808j50309j9482l1087J2315O6285J8098l264J31443
$$ -88034 -48682 49881 68572 60764 -89545 -109027 -140114 -127799 -61514 -43416 -46680 84763
17492H4763J8514m9443L2379P6520k2770j31647P5728j6678k941P21q1346n1666
$$ 84763 103277 53834 86213 162733 139963 8316 84044 67366 64425 65146 -16200 -67866
17480f7866Q5109l4081K9939M5787o9298J8550N8220l137N9513L2789j01558j12337
$$ -67866 17243 -16838 13101 58888 -10410 8140 66360 63223 122736 155525 53967 -58370
17468e8370m7041M9336M7401k7865l0017N2951K2028K7261m2735M219R0159q3152
$$ -58370 -105411 -56075 -8674 -36539 -66556 -13605 8423 35684 -7051 -2832 87327 4175
17456D175n1857K0183K2904j9908J7564O5250o6801n8226o6739N174M2797M5422
$$ 4175 -47682 -27499 -4595 -24503 -6939 58311 -8490 -66716 -133455 -128281 -85484 -40062
17444d0062L5702Q21j0290l927m9702M569Q6474O4185p838J28967p2558j49700
$$ -40062 -4360 -3539 -13829 -17756 -67458 -62889 23585 87770 79932 208899 136341 -13359
17432a3359k8493M226K0651K3671O809J274m1063n698J23707O7745q0920r1373
$$ -13359 -41852 -37626 -16975 6696 13505 14779 -26284 -31982 91725 159470 78550 -12823
17420a2823K3129K4448q993l4655n2888j985N0904m319l1279L2994K5757j4441
$$ -12823 10306 34754 25761 -8894 -61782 -63767 -12863 -17182 -48461 -15467 10290 -4151
17408d151q3320p1855m3395q076L2783Q2581l898K825J0892n3392L9443N3708
$$ -4151 -87471 -159326 -202721 -210797 -178014 -95433 -99331 -96506 -85614 -139006 -99563 -45855
17396d5855j8040M826l5316j7240M9951J8394l6277N6287M2503N138k7998p6952
$$ -45855 -63895 -59069 -94385 -111625 -61674 -43280 -79557 -23270 19233 24371 -3627 -80579
17384h0579P472K710N9339N246j49146p3737O9905J8831l725N6275P5999J16389
$$ -80579 -73107 -70397 -11058 -5812 -154958 -228695 -158790 -139959 -143684 -87409 -11410 104979
17372A04979r1057n3350Q7558J2939o0839J8827j754J2954p5726m0587N9200N5623
$$ 104979 13922 -39428 48130 61069 230 19057 17303 30257 -45469 -86056 -26856 28767
17360B8767m3201o2464k392Q8620J7825j11102n6135J03870k6916q1640J6117
$$ 28767 -14434 -76898 -79290 9330 27155 -83947 -140082 -36212 -63128 -144768 -128651
17349a28651R8517J6916p6126m2482N8447K9096o0882J0016R063j09892l7645
$$ -128651 -30134 -13218 -89344 -131826 -73379 -44283 -105165 -95149 -86086 -195978 -233623
17338b33623M9877K762Q4055O0789Q8744k0792m7410m7817J6996K0494k0366R8587
$$ -233623 -183746 -180984 -96929 -36140 52604 31812 -15598 -63415 -46419 -25925 -46291 52296
17326E2296j3565J4224j7829l257q730M3203P5476Q2939k1058K4525j5620o0489
$$ 52296 38731 52955 35126 31869 23139 66342 141818 224757 203699 228224 212604 152115
17314A52115j06298l9305K5962l3622N056j6285r9027O0576J4523j5505K7473
$$ 152115 45817 6512 32474 -1148 3908 -12377 -111404 -50828 -36305 -51810 -24337
17303b4337K7848M0535n6319o9107o3067P2226Q9171M540m3147N7440P14M4110
$$ -24337 3511 44046 -12273 -81380 -144447 -72221 16950 21490 -21657 35783 36497 80607
17291H0607r9737O6037O0751N0481m8833J5221k8766m1769j38420l3798k6006
$$ 80607 -19130 46907 107658 158139 109306 124527 95761 53992 -84428 -118226 -144232
17280a44232Q0095K1548k2568J7024P6918J9096j01513q4125m7987N6711J01120
$$ -144232 -64137 -42589 -65157 -48133 28785 47881 -53632 -137757 -185744 -129033 -27913
17269b7913K5900P4676K0548j9340m5798M1997P4554J25832O0100Q653q9382j17828
$$ -27913 -2013 72663 93211 73871 28073 70070 144624 270456 330556 339209 249827 131999
17257A31999L3572J15141p6811l67K4301q9907j18604n8291P2332q902Q1561n993
$$ 131999 165571 280712 203901 203534 227835 137928 19324 -38967 33365 24463 106024 100031
17245A00031n7852O9261j033q296K5507J9903O1208L5970l9077m4473p8718j7579
$$ 100031 42179 111440 110407 102111 127618 147521 208729 244699 205622 161149 82431 64852
17233F4852L3944K6462L313o3952J435k0985N269k6340P130k6541o0146R579j0897
$$ 64852 98796 125258 128571 64619 66054 45069 50338 23998 31128 4587 -55559 -45980 -56877
17220e6877O6642k9752p7054Q640J01656o0236m4548J43525K7037k6923n7916
$$ -56877 9765 -19987 -97041 -88401 13255 -46981 -91529 51996 79033 52110 -5806
17209e806n4116M5262N5144J18118q2812L3286j1865j4235j00993P0504R4548
$$ -5806 -59922 -14660 40484 158602 75790 109076 97211 82976 -18017 52487 147035
17198A47035k4830l9231M8400l8148o7621Q167o8525k907P2058k4461K9022P3461
$$ 147035 122205 82974 131374 93226 25605 33772 -34753 -37660 34398 9937 38959 112420
17186A12420O3407k567j0938o6117j14336j07025j7928J7627m8649M0589P9862
$$ 112420 175827 173260 162322 96205 -18131 -125156 -143084 -125457 -174106 -133517 -53655
17175e3655k1478j11070N988J08593M4126Q9358k8523k2532n4796M4730q390j23107
$$ -53655 -75133 -186203 -180215 -71622 -27496 61862 33339 10807 -43989 741 -7649 -130756
17163a30756m328N2599O297N7863K0983o7615n7054J11849N7134q2782j05595
$$ -130756 -135084 -82485 -76188 -18325 2658 -64957 -122011 -10162 46972 -35810 -141405
17152a41405l8026q291Q2003J30272q6500J3118k7065l6301k4061K3925j1769
$$ -141405 -179431 -187722 -105719 24553 -61947 -48829 -75894 -112195 -136256 -112331 -124100
17141a24100k3839J26900l914r3217k3665O6590P8420N1312M0680m1211q685N3282
$$ -124100 -147939 -21039 -24953 -118170 -141835 -75245 3175 54487 95167 53956 45271 98553
17129I8553m2431n3833n6992k095k9052o703m098L3159j8282J5201l1013M1657
$$ 98553 56122 2289 -54703 -56798 -85850 -92553 -96651 -63492 -81774 -66573 -97586 -55929
17117e5929M3145m7L1974k5504p2728n9737K5531l3798r1609P682L8290J21306
$$ -55929 -12784 -12831 19143 -6361 -79089 -138826 -113295 -147093 -238702 -231020 -192730 -71424
17105g1424m55o750K9919j0172P212J13213M463j2906l4620j00598j3034J05132
$$ -71424 -71879 -78629 -48710 -58882 -51670 61543 66006 53100 18480 -82118 -95152 9980
17093I980m0391p7207J8512m3886O6245J03183L633m2458J3761n0329J9750o7713
$$ 9980 -30411 -107618 -89106 -132992 -66747 36436 40069 -2389 11372 -38957 -19207 -86920
17081h6920k2180K0018P3061O3697J7709l1765k6904l9307n3976K5431J00644
$$ -86920 -109100 -89082 -16021 47676 65385 33620 6716 -32591 -86567 -61136 39508
17070C9508j03408L992l0615n5601J25176P5945J4772k9690j976J7223n3771l9362
$$ 39508 -63900 -59908 -90523 -146124 -20948 54997 69769 40079 38103 55326 1555 -37807
17058c7807k9153L5262K8340k3815j5694m1574j7734Q8167P4978k0708j8447k4869
$$ -37807 -66960 -31698 -3358 -27173 -42867 -84441 -102175 -14008 60970 40262 21815 -3054
17046c054l4496J9611J5438L0229r1263l5627L1517r5406o4525O7134J36052N0807
$$ -3054 -37550 -17939 -2501 27728 -63535 -99162 -67645 -163051 -227576 -160442 -24390 26417
17034B6417o9819P9649J27723N0459J20500n3758j41090j05826M4650N235m1683
$$ 26417 -43402 36247 163970 214429 334929 281171 140081 34255 78905 84140 42457
17023D2457n8846J1997J2177k7361l8465k5859o6897J8565J4900k4200n8395J4538
$$ 42457 -16389 -4392 7785 -19576 -58041 -83900 -150797 -132232 -117332 -141532 -199927 -185389
17011a85389O0137P5181J9688M9164r6213j30425J7632R4073J00637K8470J7977
$$ -185389 -125252 -50071 -30383 18781 -77432 -207857 -190225 -96152 4485 32955 50932
17000E0932J4488p1602l2879M3412Q0535O0602q7357m8980j29753m60L5085p3505
$$ 50932 65420 -6182 -39061 4351 84886 145488 58131 9151 -120602 -121062 -85977 -159482
16988a59482L8168Q2322N1376L1569j3808L7675R4650O0426P1426Q7441N8598
$$ -159482 -121314 -38992 12384 43953 30145 67820 162470 222896 294322 381763 440361
16977D40361J11960M4740r4016o0828j71448j25247m8241k873p4609r3397k9775
$$ 440361 552321 597061 503045 442217 270769 145522 97281 94408 19799 -73598 -103373
16966a03373Q7860M4425k4611j5092k2938j31p7728K4236o4341K8698P4000n810
$$ -103373 -15513 28912 4301 -10791 -33729 -33860 -111588 -87352 -151693 -122995 -48995 -54805
16954e4805k1467k6470Q1261J70937P8360n5468n6356n9339r5372K8612P7220
$$ -54805 -76272 -102742 -21481 149456 227816 172348 115992 56653 -38719 -10107 67113
16943F7113O8841j19086J7201q853K5088N4353K4434o3870L1362m907J2977q1838
$$ 67113 135954 16868 34069 25216 50304 104657 129091 65221 96583 91676 104653 22815
16931B2815J2877M4252M9236O893m5830m8082M3208n0550N2091j3889n8656M7311
$$ 22815 35692 79944 129180 136073 90243 42161 85369 34819 86910 73021 14365 61676
16919F1676J82926M8534L2055q2801m6830L8482j16317n3271m4166L4044l0760
$$ 61676 244602 293136 325191 242390 195560 234042 117725 64454 20288 54332 23572
16908B3572q8790J07943J11749O6830m3303l3730O134m1481j2519n9756r198M2028
$$ 23572 -65218 42725 154474 221304 178001 144271 150405 108924 96405 36649 27451 69479
16896F9479m133r1819n1181P407N5244J4523k9442M2982N5545j29382j15563j7493
$$ 69479 65346 -26473 -77654 -70247 -15003 -480 -29922 13060 68605 -60777 -176340 -193833
16884a93833N5949J06950N5298M0767L0128k2709o6333l6151M884J7029l2490
$$ -193833 -137884 -30934 24364 65131 95259 72550 6217 -29934 -25050 -8021 -40511
16873d0511j8071l1469N5903J20733Q2781r4309p2815k0789J4344k1097j0936
$$ -40511 -58582 -90051 -34148 86585 169366 75057 2242 -18547 -4203 -25300 -36236
16862c6236m7498N6319J05686p314L6096J8303j61715o4088O6049L2458J9312
$$ -36236 -83734 -27415 78271 70957 107053 125356 -36359 -100447 -34398 -1940 17372
16851A7372l5935q5933J07241R6572n9432J0270M044p9881q6480l9868J04197
$$ 17372 -18563 -104496 2745 99317 39885 50155 54199 -25682 -112162 -152030 -47833
16840d7833J87955M888p1743o3508M822R127Q919j725l0195q0207n8129J37445
$$ -47833 140122 145010 73267 9759 14581 23708 32627 30902 707 -79500 -137629 -184
16828a84N2128J02200L319l4316k8434M3394j4358o1410l681k1139M0840Q4239
$$ -184 51944 154144 157463 123147 94713 138107 123749 62339 58658 37519 78359 162598
16816A62598k9012q6159j6616L5747p7155j24743j9200j287r1448j8939P68Q2296
$$ 162598 133586 47427 30811 66558 -10597 -135340 -154540 -155827 -247275 -266214 -265446 -183150
16804a83150O1831K144n6405j12295J28173J4963K2429N6880J2558J00712k4874
$$ -183150 -121319 -119175 -175580 -287875 -159702 -144739 -122310 -65430 -52872 47840 22966
16793B2966q131m1929j5529J3696m8240p8857K1199P1961N5101M0247l749J1738
$$ 22966 14835 -27094 -42623 -28927 -77167 -156024 -134825 -62864 -7763 32484 28735 40473
16781D0473L6005J064k3958N4710n6852o0529q8183j4793L3720j8501K9948J04263
$$ 40473 76478 77542 53584 108294 51442 -9087 -97270 -112063 -78343 -96844 -66896 37367
16769C7367R5733n217m8917p4246j1340J3813l0212M1314M3751m7983J2709O7425
$$ 37367 133100 127883 78966 4720 -6620 7193 -23019 18295 62046 14063 26772 94197
16757I4197P6619j12933o0032K3751M970P3275J0861l3598J3929p3743K9380M4929
$$ 94197 170816 57883 -2149 21602 26572 99847 110708 77110 91039 17296 46676 91605
16745I1605N4484N9733j3895O4970k6986r0882o8881o0780k9986m4346R2099l3358
$$ 91605 146089 205822 191927 256897 229911 139029 70148 9368 -20618 -64964 27135 -6223
16733f223q2018O066L2479j9232o1950k484N3462M906q6924n782J03496k0678
$$ -6223 -88241 -82175 -49696 -68928 -130878 -133362 -79900 -74994 -161918 -167700 -64204 -84882
16721h4882n8248j8073J14276J7103K5999L2188l4326r7333o192p858K2606N5278
$$ -84882 -143130 -161203 -46927 -29824 -3825 28363 -5963 -103296 -109488 -117346 -94740 -39462
16709c9462K383n1559o1721Q9602J22754j7949k7395J474n8544o6753n547M8537
$$ -39462 -37079 -88638 -150359 -60757 61997 44048 16653 18127 -40417 -107170 -112717 -64180
16697f4180N7731N6157k5215J41011j8634q7118L9813k7335m602j2320o7398k7036
$$ -64180 -6449 49708 24493 165504 146870 59752 99565 72230 67628 55308 -12090 -39126
16685c9126n1250k8467R1170m192q3775k2662Q275o549O9174j1181k9752Q6648
$$ -39126 -90376 -118843 -27673 -31865 -115640 -138302 -130027 -136576 -67402 -78583 -108335 -21687
16673b1687O3439J7051n8155l1775K1620L1742K5943n8843N5600n9679j08160
$$ -21687 41752 58803 648 -31127 -9507 22235 48178 -10665 44935 -14744 -122904
16662a22904K145J13834L9009m1165J6433l1033k6129O7705J06054q0142j35325
$$ -122904 -120759 -6925 32084 -9081 7352 -23681 -49810 17895 123949 43807 -91518
16651i1518P819Q1465N5603l61q3031o9979K970j652l4684N4977Q2568M7290p7461
$$ -91518 -83699 -2234 53369 53008 -30023 -100002 -97032 -98684 -133368 -78391 4177 51467 -25994
16638b5994j7175L2377o4665m8668l4496K4846N2125J1667n4914K8148M3562j9453
$$ -25994 -43169 -10792 -75457 -124125 -158621 -133775 -81650 -69983 -124897 -96749 -53187 -72640
16626g2640K0597l6236Q8071j24J4153k0233o2474K3069k4051J5456J4695m728
$$ -72640 -52043 -88279 -208 -332 13821 -6412 -68886 -45817 -69868 -54412 -39717 -44445
16614d4445J8555r909q678K1667M0614R501O8335m3379l6511L0162m0544j0644
$$ -44445 -25890 -35799 -44477 -22810 17804 27305 95640 52261 15750 45912 5368 -5276
16602e276N9985q5510m531N5771J05545j09671j39899J3323R0600k642M4494R1285
$$ -5276 54709 -30801 -35332 20439 125984 16313 -123586 -110263 -19663 -22305 22189 113474
16590A13474N2492r3291n5626q9629m1444R7299N3825j31844m8443M1349p0343
$$ 113474 165966 72675 17049 -72580 -114024 -16725 37100 -94744 -143187 -101838 -172181
16579a72181K6905J02900J57634K8600j51783k6487O8393N3649R13q3752j20879
$$ -172181 -145276 -42376 115258 143858 -7925 -34412 33981 87630 88543 4791 -116088
16568a16088M1736J33184J8924l268r8954j20417K514N6503L8683O9284k8188
$$ -116088 -74352 58832 77756 74488 -24466 -144883 -142369 -85866 -47183 22101 -6087
16557f087n3949L8574L5808r9199j6758m40j3026j5501J0143m6730O7748M2176
$$ -6087 -60036 -21462 14346 -84853 -101611 -102051 -115077 -130578 -120435 -167165 -99417 -57241
16545e7241K3650l6851N5992N7736K0944k3452J7412n8614n2336K4709L6757j17657
$$ -57241 -33591 -70442 -14450 43286 64230 40778 58190 -424 -52760 -28051 8706 -108951
16533a08951M6698Q3735k3245j2659j2946j64170j60063J11024R6078Q5593M1259
$$ -108951 -62253 21482 -1763 -14422 -27368 -191538 -351601 -240577 -144499 -58906 -17647
16522a7647n4126j0627J8047m3056m0463J6296P2907k1515r760j31605L717J11768
$$ -17647 -71773 -82400 -64353 -107409 -147872 -131576 -58669 -80184 -89944 -221549 -217832 -106064
16510a06064K3843J7769M2396O0722M5408r2065M031o655l016P4797Q7803k3340
$$ -106064 -82221 -64452 -22056 38666 84074 -7991 -3960 -10615 -13631 61166 148969 125629
16498A25629j43491j0394j092L6525M2088J5120m3257m6579N1544O046M4074K0897
$$ 125629 -17862 -28256 -29348 7177 49265 64385 21128 -25451 26093 32139 76213 97110
16486I7110j05682n8789M6164p0241M3859J3558l0989P8837m2997q6342J4838
$$ 97110 -8572 -67361 -21197 -91438 -47579 -34021 -65010 13827 -29170 -115512 -100674
16475a00674N8995O2534n2404j43204q5521M7167J13385K0781P4708j8175o2644
$$ -100674 -41679 20855 -31549 -174753 -260274 -213107 -99722 -78941 -4233 -22408 -85052
16464h5052J3558O2297J8914m4461k0312m173o4422J28373J5007L9569N7697M617
$$ -85052 -71494 -9197 9717 -34744 -55056 -59229 -123651 4722 19729 59298 116995 121612
16452A21612l6404L4406J13937P6918o2519j11071j47347n9244o9448O65K8443
$$ 121612 85208 119614 233551 310469 247950 136879 -10468 -69712 -139160 -138495 -110052
16441a10052k4550P5138J26799R041k0999q194k9153l871k608J3283O682q148
$$ -110052 -134602 -59464 67335 76376 55377 47183 18030 14159 11551 24834 31516 23368
16429B3368L3898Q8950L3995J8225r2907o5990O6910k1265J1358m8321o8580P434
$$ 23368 57266 146216 180211 198436 105529 39539 106449 85184 96542 48221 -20359 -12925
16417a2925k4003N0337r2446k478Q0662J34009J05292n5635p2858l3800p0427
$$ -12925 -36928 13409 -79037 -81515 -853 133156 238448 182813 109955 76155 5728
16406E728n2245o6657j9241Q0735J26395R006p9723l5946J9023P4027M4945j6226
$$ 5728 -46517 -113174 -132415 -51680 74715 83721 3998 -31948 -12925 61102 106047 89821
16394H9821o2619K4505K7315N8441L0624o7526R1595K1067p8169J4375k4892l5405
$$ 89821 27202 51707 79022 137463 168087 100561 192156 213223 135054 149429 124537 89132
16382H9132p7874O1042P4643p5497m2970k6185o9838L7438O2846P015M853Q3606
$$ 89132 11258 72300 146943 71446 28476 2291 -67547 -30109 32737 39752 44605 128211
16370A28211m2921j00720J4995J4050P8965m4786j08435l1549K6112J12508L757
$$ 128211 85290 -15430 -435 13615 92580 47794 -60641 -92190 -66078 46430 50187
16359E0187o8469q656J4430n0277k2634L3064Q4434O9367m937n7488n3817j0029
$$ 50187 -18282 -26938 -12508 -62785 -85419 -52355 32079 101446 96509 39021 -14796 -24825
16347b4825q117l8505o3663j7870N2781O1970K2333K2263l085M1354L4996k2001
$$ -24825 -32942 -71447 -135110 -152980 -100199 -38229 -15896 6367 3282 44636 79632 57631
16335E7631q7368j11064J5256P2295n1794K3467M6386l8962r2846l1773Q400N2746
$$ 57631 -29737 -140801 -125545 -53250 -105044 -81577 -35191 -74153 -166999 -198772 -190372 -137626
16323a37626L8243Q6331M1845k2268k0643l7082o7611J7268m6106J13635J06238
$$ -137626 -99383 -13052 28793 6525 -14118 -51200 -118811 -101543 -147649 -34014 72224
16312G2224m2016l0603L7241o454r3309J1169j9552M3820O1134J4840j01907p2451
$$ 72224 30208 -395 36846 30392 -62917 -51748 -71300 -27480 33654 48494 -53413 -125864
16300a25864p0809Q7289M9812l6966k4541M5566k3723K1176o221M7514Q3548K131
$$ -125864 -196673 -109384 -59572 -96538 -121079 -75513 -99236 -78060 -84281 -36767 46781 48912
16288D8912K1061K9512L3469j06596j32598K2886J6558m7737k0663N2400M9122
$$ 48912 69973 99485 132954 26358 -106240 -83354 -66796 -114533 -135196 -82796 -33674
16277c3674m8006J6206J9962M6435P4245o6757J6120K808p8961k3008o946Q0808
$$ -33674 -81680 -65474 -45512 923 75168 8411 24531 27339 -51622 -74630 -81576 -768
16265g68K0980N616k9681n6731k7581k5502N7533O7574O3816j5278j00468k9961
$$ -768 20212 25828 -3853 -60584 -88165 -113667 -56134 11440 75256 59978 -40490 -70451
16253g0451M825k4149R2512P3279P201N5676M7025N397o3416k5363q4218l6362
$$ -70451 -65626 -89775 2737 76016 83217 138893 185918 191315 127899 102536 18318 -18044
16241a8044L1778k9484j390m0318p7115L1348R8680J8849J0949P2355Q0863K5097
$$ -18044 13734 -15750 -17140 -57458 -134573 -103225 -4545 14304 25253 97608 178471 203568
16229B03568n6260o5198n0821j42757P080N6411M7758l3187q5885N9847k519L0788
$$ 203568 147308 82110 31289 -111468 -104388 -47977 -219 -33406 -119291 -59444 -61963 -31175
16217c1175m0968l7608r831l6542O6289J25188M0253l3074r4929p315J04372p4371
$$ -31175 -72143 -109751 -119582 -156124 -89835 35353 75606 42532 -52397 -59712 44660 -29711
16205b9711r1449k3085J75921N8445j13765j4074j79L8984l5728k3124K4334K6809
$$ -29711 -121160 -144245 31676 90121 -23644 -37718 -37897 1087 -34641 -57765 -33431 -6622
16193f622O0690J0467r1171j949M7777K3442p6568l2390J0924L189k7090M9121
$$ -6622 54068 64535 -26636 -28585 19192 42634 -33934 -66324 -55400 -52211 -79301 -30180
16181c0180L5443p6624j1469l6122J2417J16926k3282j2325j2850j1313M5342
$$ -30180 5263 -71361 -82830 -118952 -106535 10391 -12891 -25216 -38066 -49379 -4037
16170d037M9360N4449k5590n1451n5209j25668L1162k3857N8101L7869p2664K5898
$$ -4037 45323 99772 74182 22731 -32478 -158146 -126984 -150841 -92740 -54871 -127535 -101637
16158a01637J38301k7433j3745l3523l6458J5794l3669M2729P3129n7604L3091
$$ -101637 36664 9231 -4514 -38037 -74495 -58701 -92370 -49641 23488 -34116 -1025
16147a025L1682P8323L558m9640n9873M7461k431j0222L307m606l5830J8624j16041
$$ -1025 30657 108980 112538 62898 3025 50486 48055 37833 41140 36534 704 19328 -96713
16134i6713r5196r8479Q244J14322N8696J6646Q0251n2768n8629J19932J07197
$$ -96713 -191909 -290388 -282144 -167822 -109126 -92480 -12229 -64997 -123626 -3694 103503
16123A03503K9760q4360k1319m4356P9873N5642j05047j39808j1725L764k1726
$$ 103503 133263 48903 27584 -16772 63101 118743 13696 -126112 -137837 -134073 -155799
16112a55799j0111K2155J12642j04609r4784K3135Q9547N0781J03495k4158r6072
$$ -155799 -165910 -143755 -31113 -135722 -230506 -207371 -117824 -67043 36452 12294 -83778
16101h3778l4049k8356m7607L2563m3482M3352Q2868M8978o6612J73297K0258
$$ -83778 -117827 -146183 -193790 -161227 -204709 -161357 -78489 -29511 -96123 77174 97432
16090I7432n1276l6793k7453J9792J4247o2610O5729m142o1980k0282N0647M6584
$$ 97432 46156 9363 -18090 1702 15949 -46661 19068 14926 -47054 -67336 -16689 29895
16078B9895l5149l3419m7159m7903O1198N1075q6928n0442K3936L0466M8330J27577
$$ 29895 -5254 -38673 -85832 -133735 -72537 -21462 -108390 -158832 -134896 -104430 -56100 71477
16066G1477N6732q6251j619J0151m1628J2364K034K6812l5429p3279l7247k7070
$$ 71477 128209 41958 40339 50490 8862 21226 23260 50072 14643 -58636 -95883 -122953
16054a22953k1972J27043k2803J3444M2436j9423r6788j389L4568m5455M8508
$$ -122953 -144925 -17882 -40685 -27241 15195 -4228 -101016 -102405 -67837 -113292 -64784
16043f4784J76726O5526k6137N9959N3648k3156j15503j02582m6031j1030J20194
$$ -64784 111942 177468 151331 211290 264938 241782 126279 23697 -22334 -33364 86830
16032H6830j2679m0684J2411J1960j1870N7208k3945n0629l9306j7440o7943L6762
$$ 86830 74151 33467 45878 57838 45968 103176 79231 28602 -10704 -28144 -96087 -59325
16020e9325j2812K1069j1672n5593O1995N498K1785J06230j2103m650m8344j05651
$$ -59325 -72137 -51068 -62740 -118333 -56338 -50840 -29055 77175 65072 60422 12078 -93573
16008i3573N3282N0606n154j11635R9556J09628l9137j1807j40890j03420o1062
$$ -93573 -40291 10315 5161 -106474 -6918 102710 63573 51766 -89124 -192544 -253606
15997b53606O8865J14073M2071k387N5740J5126L4943p1106j6442l5912k0933
$$ -253606 -184741 -70668 -28597 -30984 24756 39882 74825 3719 -12723 -48635 -69568
15986f9568N4180P261j3654l8035J9084J8041l2149n1746K3159O3417R875m8869
$$ -69568 -15388 -8127 -21781 -59816 -40732 -22691 -54840 -106586 -83427 -20010 -10135 -59004
15974e9004k9920q5495J25315J21806m3680N9178k4555n358l0484q0730l3535
$$ -59004 -88924 -174419 -49104 72702 29022 88200 63645 58287 27803 -52927 -86462
15963h6462n0015L4426P345m2380M4656Q1229q5621n5981Q9180j0450k5908J03095
$$ -86462 -136477 -102051 -94706 -137086 -92430 -11201 -96822 -152803 -63623 -74073 -99981 3114
15951C114Q7059l1418q4627j09126K9110R9509k1548m185k1598k5053j6897J6385
$$ 3114 90173 58755 -25872 -134998 -105888 -6379 -27927 -32112 -53710 -78763 -95660 -79275
15939g9275Q2926P4553J7914k613j15514j43004J8925J05577j8767o9506j16533
$$ -79275 3651 78204 96118 93505 -22009 -165013 -146088 -40511 -59278 -128784 -245317
15928b45317K8147P1930L8728N1658l094P750M155J41595K9361M1401r5698j5168
$$ -245317 -217170 -145240 -106512 -54854 -57948 -50198 -46043 95552 124913 166314 70616 55448
15916E5448M2816K4504o3323o2678Q038M3753l7626p440K3437M2154K2646o2212
$$ 55448 98264 122768 59445 -3233 4805 48558 10932 3492 26929 69083 91729 29517
15904B9517O1871j04420r1008m9363J08135J09063k5274o4381M6559k7337m7249
$$ 29517 91388 -13032 -104040 -153403 -45268 63795 38521 -25860 20699 -6638 -53887
15893e3887L7550N1679O3053k7512j6267K0075r14k2582q0804n5147m997N1609
$$ -53887 -16337 35342 98395 70883 54616 74691 73777 51195 -29609 -84756 -89753 -38144
15881c8144m071r9799j30033j4601J33892j701m3010R9816R5210Q482q154j1008
$$ -38144 -42215 -142014 -272047 -286648 -152756 -154457 -197467 -97651 -2441 6041 -2113 -13121
15869a3121L4946r216l5436m8967m9060p1645J4172L7123R2514P3273n7535l308
$$ -13121 21825 12609 -22827 -71794 -120854 -192499 -178327 -141204 -48690 24583 -32952 -36260
15857c6260P3244P1588R888q2634p4434k6293j4265m6583M880K5301l368K5109
$$ -36260 36984 108572 118460 35826 -38608 -64901 -79166 -125749 -120869 -95568 -98936 -73827
15845g3827P9105j6283K403l940m3513q1206p007K8284Q9359O0006L5610j04346
$$ -73827 5278 -11005 -8602 -12542 -56055 -137261 -144268 -115984 -26625 33381 68991 -35355
15833c5355K2197J1724p579O9421j6882l6904L6331k3056q9744m3706K8484j4854
$$ -35355 -13158 -1434 -9013 60408 43526 6622 42953 19897 -69847 -113553 -85069 -99923
15821i9923K2375l2799K7136J3417k3926j01838n4944J16875N993k3604M409j06693
$$ -99923 -77548 -110347 -83211 -69794 -93720 -195558 -250502 -133627 -127634 -151238 -146829 -253522
15809b53522J11596O8915n0820j6079n585M7926M2222K8303O1444j9773L4155
$$ -253522 -141926 -73011 -123831 -139910 -145495 -97569 -55347 -27044 34400 14627 48782
15798D8782r62J508n6777l9056J3330M086P3966L0766j03119k9022l6437P730
$$ 48782 47820 49328 -7449 -46505 -33175 -29089 44877 75643 -27476 -56498 -92935 -85205
15786h5205J1868j4129K3317n123k7547k1305j02918m1708L6276J06796Q3701
$$ -85205 -73337 -87466 -64149 -69272 -96819 -118124 -221042 -262750 -226474 -119678 -35977
15775c5977J3544j239O9542K6424O2921j12396j32392l5199o0374k61k4147N4096
$$ -35977 -22433 -23672 45870 72294 135215 22819 -109573 -144772 -205146 -205407 -229554 -175458
15763a75458J16987k515J9818K3175j4102J03333k4879m4634K0408l514k4506
$$ -175458 -58471 -60986 -41168 -17993 -32095 71238 46359 1725 22133 18619 -5887
15752e887R083k3191k4399J6404Q8631m5051j01499k7656L322O9135Q4402M2919
$$ -5887 3196 -19995 -44394 -27990 60641 15590 -85909 -113565 -110243 -41108 43294 86213
15740H6213M2338j8620j14886L1316m5323R4446l1583j49580j03680Q4331O6588
$$ 86213 128551 109931 -4955 26361 -18962 75484 43901 -105679 -209359 -125028 -58440
15729e8440j5342m5139j0163k0860O0147K3567M448M2045k8009p9050r1125N1416
$$ -58440 -73782 -118921 -129084 -149944 -89797 -66230 -61782 -19737 -47746 -126796 -217921 -166505
15717a66505R8829R2326l8618l3212K9601l350k1246j4859o5118R012r718O0203
$$ -166505 -67676 24650 -13968 -47180 -17579 -20929 -42175 -57034 -122152 -113140 -122858 -62655
15705f2655K3891J0991K7355p0566n3864J1597M1765N2450p8693j32682j2056
$$ -62655 -38764 -27773 -418 -70984 -124848 -113251 -71486 -19036 -97729 -230411 -242467
15694b42467J16140N2198J16095J4909p233j30852k058N7115j7416m96K2770O4761
$$ -242467 -126327 -74129 41966 56875 49642 -81210 -83268 -26153 -43569 -44065 -21295 43466
15682D3466J2241K3104m3645n0949K5638M3854j0723M9100M4212l8494k9727p4587
$$ 43466 55707 78811 35166 -15783 9855 53709 42986 92086 136298 97804 68077 -6510
15670f510o3054j21931J12367J10210k6831p5799n8672l7095k6238P8099Q7438
$$ -6510 -69564 -191495 -79128 31082 4251 -71548 -130220 -167315 -193553 -115454 -28016
15659b8016q8866m197R5Q855J20748N6581k3765K6308O257k4147J2527l6903L3277
$$ -28016 -116882 -121079 -120984 -112129 8619 65200 41435 67743 74000 49853 62380 25477 58754
15646E8754J12498p1759n8428K9881Q12P5564k2267j87118j06172M5628J06884
$$ 58754 171252 99493 41065 70946 71758 147322 125055 -62063 -168235 -122607 -15723
15635a5723j4992m7834M6053M1081n4989m2492O2996L1295M2414J2138l6528N3260
$$ -15723 -30715 -78549 -32496 8585 -46404 -88896 -25900 5395 47809 59947 23419 76679
15623G6679J8954l2273k5350K8064n6709N4665l830p1586m5525P8033l6689n3717
$$ 76679 95633 63360 38010 66074 9365 64030 60200 -11386 -56911 21122 -15567 -69284
15611f9284o4969M8260K202J634n6208r583L6969J05264L7367O141m3830p1869
$$ -69284 -134253 -85993 -83791 -82157 -138365 -147948 -110979 -5715 31652 37793 -6037 -77906
15599g7906J00820l5002M4656O1405P390j11681n2215P4915K4484M1322M4912
$$ -77906 22914 -12088 32568 93973 101363 -10318 -62533 12382 36866 78188 123100
15588A23100J06008P4221j27663j69791k8987N5217j1014j22252o2054J12720
$$ 123100 229108 303329 175666 5875 -23112 32105 21091 -101161 -163215 -50495
15578e0495L220j9013j2527n0067n5487r116j9813J11041k4857j16977k507J9895
$$ -50495 -47275 -66288 -78815 -128882 -184369 -193485 -213298 -102257 -127114 -244091 -246598 -226703
15566b26703N2218L5522l5328J3549J15994J00516l6721j21380j9649r6623J4463
$$ -226703 -174485 -138963 -174291 -160742 -44748 55768 19047 -102333 -121982 -218605 -204142
15555b04142J15630N3581K481j215k1110k7839O4972J40104m5440q3126L9628
$$ -204142 -88512 -34931 -32450 -33665 -54775 -82614 -17642 122462 77022 -6104 33524
15544C3524k6952p7124r0222l9497J00545J57904l917j04877j716P997L3059m9794
$$ 33524 6572 -70552 -160774 -200271 -99726 58178 54261 -50616 -52332 -44335 -11276 -61070
15532f1070l2156j1810O6667O1767o6177M7634M6631l1200l8420m3551n1971L1068
$$ -61070 -93226 -105036 -38369 23398 -42779 4855 51486 20286 -18134 -61685 -113656 -82588
15520h2588M9770J4774m7813p981n3247J05624l32M6989L5008J6961k8316K4852
$$ -82588 -32818 -18044 -65857 -73838 -127085 -21461 -21793 25196 60204 77165 48849 73701
15508G3701p6993M7856j3400m7534m6503O1683J61146m1682j34924n9615K8346
$$ 73701 -3292 44564 31164 -16370 -62873 -1190 159956 118274 -16650 -76265 -47919
15497d7919q0172k2513P3274Q4636n5257m1664R751l9543M0258J5300L9393K4916
$$ -47919 -128091 -150604 -77330 7306 -47951 -89615 -79864 -119407 -79149 -63849 -24456 460
15485D60n4221m1934L5047J21244J9187j5487l9631j00614L8458K7465o9555M2160
$$ 460 -53761 -95695 -60648 60596 79783 64296 24665 -75949 -37491 -10026 -79581 -37421
15473c7421K5906o0647J07213N4154M8692j7085j74724j15957K3565Q6654K4338
$$ -37421 -11515 -72162 35051 89205 137897 120812 -53912 -169869 -146304 -59650 -35312
15462c5312K6156P3039l9843Q6186N6635q0091l5882R1654o6911q8444j3656L0945
$$ -35312 -9156 63883 24040 110226 166861 86770 50888 142542 75631 -12813 -26469 4476
15450D476J7069J497l162r975r779L2161l167O780m5164p7200k9818k6988k3861
$$ 4476 21545 23042 19880 9905 126 32287 29120 35900 -9264 -86464 -116282 -143270 -167131
$$ [...]
##END NTUPLES=NMR SPECTRUM
##END=
