##TITLE=Analysis number 308255
Compound Code cc 12008
Book Reference 415/23
Project Code adrs
Chemist Name bos
##JCAMPDX= 6.0         $$ Bruker NMR JCAMP-DX V2.0
##DATA TYPE= NMR SPECTRUM
##DATA CLASS= NTUPLES
##ORIGIN= Bruker BioSpin GmbH
##OWNER= NMR
$$ XWIN-NMR		Version 3.5
$$ Mon May 23 15:35:22 2005 GMT Daylight Time (UT+1h)  MAYBRIDGE\NMR@NMR_250MHZ
##.OBSERVE FREQUENCY= 250.131544655141
##.OBSERVE NUCLEUS= ^1H
##.ACQUISITION MODE= SIMULTANEOUS (DQD)
##.ACQUISITION SCHEME= undefined
##.AVERAGES= 16
##.DIGITISER RES= 18
##SPECTROMETER/DATA SYSTEM= dpx250
##.PULSE SEQUENCE= zg30
##.SOLVENT NAME= CDCl3
##.SHIFT REFERENCE= (INTERNAL, CDCl3, 0, 16.4447)
##AUDIT TRAIL= $$ (NUMBER, WHEN, WHO, WHERE, WHAT)
$$ ##TITLE= Audit trail, XWIN-NMR		Version 3.5
$$ ##JCAMPDX= 5.01
$$ ##ORIGIN= Bruker BioSpin GmbH
$$ ##OWNER= NMR
$$ C:\u/data/dgb/nmr/ADRS/3320/pdata/1/auditp.txt
$$ ##AUDIT TRAIL=  $$ (NUMBER, WHEN, WHO, WHERE, WHAT)
(   1,<2005-05-23 15:35:02.76 +100>,<MAYBRIDGE\NMR>,<NMR_250MHZ>,
      <created by zg, POWCHK disabled, PULCHK disabled
       configuration hash MD5:
       62 19 C7 07 E1 42 D1 B7 37 6C 3D D0 77 39 F9 E6
       data hash MD5: 64K
       24 42 F7 14 30 BC 9D 4E 88 8D DA 95 0A 50 35 B8>)
(   2,<2005-05-23 15:35:13.98 +100>,<MAYBRIDGE\NMR>,<NMR_250MHZ>,
      <Start of raw data processing
       ef LB = 0.3 FT_mod = 6 PKNL = 1 SI = 32K 
       data hash MD5: 32K
       72 D9 59 52 BD 0D 29 BA 36 41 47 0F 7F 67 74 92>)
(   3,<2005-05-23 15:35:15.62 +100>,<MAYBRIDGE\NMR>,<NMR_250MHZ>,
      <apk 
       data hash MD5: 32K
       0C E8 CE F3 1F FA 4F E5 F2 0B 9D F6 D8 49 3B 00>)
(   4,<2005-05-23 15:35:16.27 +100>,<MAYBRIDGE\NMR>,<NMR_250MHZ>,
      <abs ABSG = 5 
       data hash MD5: 32K
       C6 E5 3D 20 BB 0B 75 31 B7 4F 3B 2E 28 96 81 21>)
$$ ##END=
$$ 
$$ hash MD5
$$ 1C 8E D4 31 27 D0 1E 1A 0C 31 78 9D E9 B2 75 BA
##$RELAX= 
##$RELAX= 
##$RELAX= 
##$RELAX= 
##$RELAX= 
##$RELAX= 
##$RELAX= 
$$ Bruker specific parameters
$$ --------------------------
##$DU= <C:\u>
##$EXPNO= 3320
##$NAME= <ADRS>
##$PROCNO= 1
##$TYPE= <nmr>
##$USER= <dgb>
##$AMP= (0..31)
100 100 100 100 100 100 100 100 100 100 100 100 100 100 100 100 100 100 
100 100 100 100 100 100 100 100 100 100 100 100 100 100 
##$AQSEQ= 0
##$AQ_mod= 3
##$AUNM= <au_zg>
##$AUTOPOS= <49 >
##$BF1= 250.13
##$BF2= 250.13
##$BF3= 250.13
##$BF4= 250.13
##$BF5= 500.13
##$BF6= 500.13
##$BF7= 500.13
##$BF8= 500.13
##$BYTORDA= 1
##$CFDGTYP= 0
##$CFRGTYP= 5
##$CHEMSTR= <none>
##$CNST= (0..31)
1 1 145 1 1 1 1 1 1 1 1 1 1 1 1 1 1 1 1 1 1 1 1 1 1 1 1 1 1 1 1 1 
##$CPDPRG= <>
##$CPDPRG1= <>
##$CPDPRG2= <>
##$CPDPRG3= <>
##$CPDPRG4= <mlev>
##$CPDPRG5= <mlev>
##$CPDPRG6= <mlev>
##$CPDPRG7= <mlev>
##$CPDPRG8= <mlev>
##$CPDPRGB= <>
##$CPDPRGT= <>
##$D= (0..31)
0 1 0 0 0 0 0 0 0 0.06 0 0 0 0 0 0 0.0002 0 0 0 0 0 0 0 0 0 0 0 0 0 0 
0 
##$DATE= 1116858902
##$DBL= (0..7)
120 120 120 120 120 120 120 120 
##$DBP= (0..7)
150 150 150 150 150 150 150 150 
##$DBP07= 0
##$DBPNAM0= <>
##$DBPNAM1= <>
$$ [...]
##$SUBNAM7= <"">
##$SUBNAM8= <"">
##$SUBNAM9= <"">
##$SW= 20.6930455092707
##$SWIBOX= (0..15)
0 0 3 0 0 0 0 0 0 0 0 0 0 0 0 0 
##$SW_h= 5175.983436853
##$TD= 65536
##$TD0= 1
##$TE= 295.16
##$TE2= 300
##$TE3= 300
##$TEG= 300
##$TL= (0..7)
0 120 120 120 120 120 120 120 
##$TP= (0..7)
150 150 150 150 150 150 150 150 
##$TP07= 0
##$TPNAME0= <>
##$TPNAME1= <>
##$TPNAME2= <>
##$TPNAME3= <>
##$TPNAME4= <>
##$TPNAME5= <>
##$TPNAME6= <>
##$TPNAME7= <>
##$TPOAL= (0..7)
0.5 0.5 0.5 0.5 0.5 0.5 0.5 0.5 
##$TPOFFS= (0..7)
0 0 0 0 0 0 0 0 
##$TUNHIN= 0
##$TUNHOUT= 0
##$TUNXOUT= 0
##$USERA1= <user>
##$USERA2= <user>
##$USERA3= <user>
##$USERA4= <user>
##$USERA5= <user>
##$V9= 5
##$VALIST= <valist>
##$VCLIST= <CCCCCCCCCCCCCCC>
##$VD= 0
##$VDLIST= <DDDDDDDDDDDDDDD>
##$VPLIST= <PPPPPPPPPPPPPPP>
##$VTLIST= <TTTTTTTTTTTTTTT>
##$WBST= 1024
##$WBSW= 4
##$XGAIN= (0..3)
0 0 0 0 
##$XL= 0
##$YL= 0
##$YMAX_a= 381127
##$YMIN_a= -303043
##$ZGOPTNS= <>
##$ZL1= 120
##$ZL2= 120
##$ZL3= 120
##$ZL4= 120
##$ABSF1= 16.4447
##$ABSF2= -4.248472
##$ABSG= 5
##$ABSL= 3
##$ALPHA= 0
##$AQORDER= 0
##$ASSFAC= 0
##$ASSFACI= 0
##$ASSFACX= 0
##$ASSWID= 0
##$AUNMP= <proc_1d>
##$AZFE= 0.1
##$AZFW= 0.1
##$BCFW= 0
##$BC_mod= 0
##$BYTORDP= 0
##$COROFFS= 0
##$CY= 12.5
##$DATMOD= 1
##$DC= 0
##$DFILT= <>
##$DTYPP= 0
##$F1P= 14.0000005364418
##$F2P= -0.99999901652339
##$FCOR= 0.5
##$FTSIZE= 32768
##$FT_mod= 6
##$GAMMA= 0
##$GB= 0
##$INTBC= 1
##$INTSCL= 1
##$ISEN= 128
##$LB= 0.3
##$LEV0= 0
##$LPBIN= 0
##$MAXI= 10000
##$MC2= 0
##$MEAN= 0
##$ME_mod= 0
##$MI= 0
##$NCOEF= 0
##$NC_proc= -4
##$NLEV= 6
##$NOISF1= 0
##$NOISF2= 0
##$NSP= 0
##$NTH_PI= 0
##$NZP= 0
##$OFFSET= 16.4447
##$PC= 1
##$PHC0= -65.60073
##$PHC1= 3.180087
##$PH_mod= 1
##$PKNL= yes
##$PPARMOD= 0
##$PSCAL= 4
##$PSIGN= 0
##$REVERSE= no
##$SF= 250.130019334529
##$SI= 32768
##$SIGF1= 0
##$SIGF2= 0
##$SINO= 400
##$SIOLD= 32768
##$SREGLST= <1H.CDCl3>
##$SSB= 0
##$STSI= 32768
##$STSR= 0
##$SW_p= 5175.98343685301
##$SYMM= 0
##$S_DEV= 0
##$TDeff= 65536
##$TDoff= 0
##$TI= <Analysis number 999999
Compound Code 99
Book Reference 9
Project Code 9>
##$TILT= no
##$TM1= 0
##$TM2= 0
##$TOPLEV= 0
##$USERP1= <user>
##$USERP2= <user>
##$USERP3= <user>
##$USERP4= <user>
##$USERP5= <user>
##$WDW= 1
##$XDIM= 32768
##$YMAX_p= 433524398
##$YMIN_p= -376390
$$ End of Bruker specific parameters
$$ ---------------------------------
##NTUPLES= NMR SPECTRUM
##VAR_NAME=  FREQUENCY,     SPECTRUM/REAL,   SPECTRUM/IMAG
##SYMBOL=    X,             R,               I
##VAR_TYPE=  INDEPENDENT,   DEPENDENT,       DEPENDENT
##VAR_FORM=  AFFN,          ASDF,            ASDF
##VAR_DIM=   32768,         32768,           32768
##UNITS=     HZ,            ARBITRARY UNITS, ARBITRARY UNITS
##FACTOR=    0.157963299565203, 1,           1
##FIRST=     4113.31318925409, 0,            0
##LAST=      -1062.67024759892, 0,           0
##MIN=       -1062.67024759892, -376390,     0
##MAX=       4113.31318925409, 433524398,    0
$$ Real data points
##PAGE= N=1
##DATA TABLE= (X++(R..R)), XYDATA
$$ [...]
19038A94386r5463j38109J9562L9416L7067M8040m1576k9976n9413m1639M4362
$$ 194386 98923 -39186 -19624 19792 56859 104899 63323 33347 -26066 -67705 -23343
19027b3343J38775j8879j07084L3673M9699L9617M4087m6201K5144n1979l6467
$$ -23343 115432 96553 -10531 23142 72841 112458 156545 110344 135488 83509 47042
19016D7042K7537O2435N1522n0307n9683M5171P4428j6917N6453p0997k2792M6370
$$ 47042 74579 137014 188536 138229 78546 123717 198145 181228 237681 166684 143892 190262
19004A90262J4863l1816o8363j22546o5052P5774N7935Q0278L4761k4008j591
$$ 190262 205125 173309 104946 -17600 -82652 -6878 51057 131335 166096 142088 140497
18993A40497j36591o9503O7498m833P4890K2627J4516K763O011k1845J1569l520
$$ 140497 3906 -65597 1901 -2932 71958 94585 109101 111864 117875 96030 107599 104079
18981A04079l4182o4280R3471K2632j9690m8337p93r431L6969N2868J289k7000
$$ 104079 69897 5617 99088 121720 102030 53693 52900 43469 80438 133306 134595 107595
18969A07595L5735K0126r7526j880O4927o6131o6173O9973M4286J0870J10625
$$ 107595 143330 163456 65930 64050 128977 62846 -3327 66646 110932 121802 232427
18958B32427L74j14092l4806k3053O6516J14258O9360L034j33988m5919N2550
$$ 232427 232801 118709 83903 60850 127366 241624 310984 314018 180030 134111 186661
18947A86661K6916k8948J0869r3299k7924M258j7928O1237Q0785K3195k657j9288
$$ 186661 213577 184629 195498 102199 74275 78533 60605 121842 202627 225822 223165 203877
18935B03877l2696j41889R145P1011O430l9111J6593p4402K920J16060n507j0352
$$ 203877 171181 29292 38437 109448 115878 76767 93360 18958 21878 137938 132431 122079
18923A22079L6885j3668n916M0801k2667j5417M6762k9342l0001l8008k1272l5668
$$ 122079 158964 145296 139380 180181 157514 142097 188859 159517 129516 91508 70236 34568
18911C4568Q7948m0980O243K9795m6643M1052O9302m7381K887L6145P947j2765
$$ 34568 122516 81536 87779 117574 70931 111983 181285 133904 136791 172936 180883 168118
18899A68118j2670O4912J47457K2953n8492j7500M3116k8588o9926J3315k5574
$$ 168118 155448 220360 367817 390770 332278 314778 357894 329306 259380 272695 247121
18888B47121q1443N200N9216l4464J27526J49787o4495p3462N7022R3692k3787
$$ 247121 165678 170878 230094 195630 323156 472943 408448 334986 392008 485700 461913
18877D61913j16287K9174j0082n7702P4595J22762J0966j04331O5214l269M2347
$$ 461913 345626 374800 364718 307016 381611 504373 515339 411008 476222 472953 515300
18866E15300M0712j4917K436k894P673r627r837P6801J70291p6024j06271R6011
$$ 515300 556012 541095 543531 540637 548310 538683 528846 605647 775938 699914 593643 689654
18854F89654o3810k3658K9288k6413o5355n3204m5345l7634l1719O0584k4407
$$ 689654 625844 602186 631474 605061 539706 486502 441157 403523 371804 432388 407981
18843D07981j07276m5746N9084M2627L0940M3853j59579j9202Q1327L9311M2609
$$ 407981 300705 254959 314043 356670 387610 431463 271884 252682 334009 373320 415929
18832D15929M3084J6929O7142J6216J1939l5272R5526R9200Q3540l2120k0303
$$ 415929 459013 475942 543084 559300 571239 535967 631493 730693 814233 782113 761810
18821G61810R9696M3415J26849J247o1686J7296l6671k0435q8744j43407l9931
$$ 761810 861506 904921 1031770 1033017 971331 988627 951956 931521 842777 699370 659439
18810F59439j7115j0632Q5751N0348J11433N6889K5704j92639p9153k2151o7791
$$ 659439 642324 631692 717443 767791 879224 936113 961817 769178 690025 667874 600083
18799F00083o3491j20157J7248N4837q8302q5370R7288l5016j17944J9083L2353
$$ 600083 536592 416435 433683 488520 400218 314848 412136 377120 259176 278259 310612
18788C10612j1664K3395N4227J3181l8259m2276o429L6217K2461r020J21233J24343
$$ 310612 298948 322343 376570 389751 351492 309216 302787 339004 361465 352445 473678 598021
18776E98021Q5424O3005M1810K1007r5901k9987K5034K05076L78061L59381J98290
$$ 598021 683445 746450 788260 809267 713366 683379 708413 913489 1291550 1650931 1849221
18765A849221p7726l01229l28833m17243j46792L1610k39l8099p6081J4033l056
$$ 1849221 1771495 1470266 1141433 724190 577398 609008 608769 570670 494589 508622 505566
18754E05566L2365J35930Q8533P4201O1315N4835j8905q2565k288J58433J78074
$$ 505566 537931 673861 762394 836595 897910 952745 933840 851275 848987 1007420 1185494
18743A185494N9555m0257J8035o5688j73409j42262Q0840P7992J8268k3160p0451
$$ 1185494 1245049 1204792 1222827 1157139 983730 841468 922308 1000300 1018568 995408 924957
18732I24957j01957j92960m3065O2201P4024R1754M2170j15920n6199J1839P6973
$$ 924957 823000 630040 586975 649176 723200 814954 857124 741204 685005 696844 773817
18721G73817L2995J38878o0161k2680j73025m6202k5355r002O6041P005O0549
$$ 773817 806812 945690 885529 862849 689824 643622 618267 609265 675306 682311 742860
18710G42860L8648k3060m3319J10531N7984r103R2181J0192J01863J39205P4499
$$ 742860 781508 758448 715129 825660 883644 874541 966722 976914 1078777 1217982 1292481
18699A292481J14723N4945K694M7869m272p297m2634K631P8775Q7057J20295J62835
$$ 1292481 1407204 1462149 1464843 1512712 1508440 1501143 1458509 1461140 1539915 1626972 1747267 1910102
18687A910102J59021K94128M27743L88556L81029M25743L57735K52104J54357
$$ 1910102 2069123 2363251 2790994 3179550 3560579 3986322 4344057 4596161 4750518
18678D750518K57526L73750M66432Q65396J571852K299233K850930K924827K206370
$$ 4750518 5008044 5381794 5848226 6713622 8285474 10584707 13435637 16360464 18566834
18669A8566834R06589l42207j140277q79595J03157J701761L786212P134523J2140483
$$ 18566834 19473423 19131216 17990939 17111344 17214501 18916262 22702474 29836997 41977480
18660D1977480J8406831K3604274K4845070J8962644Q710045j957089r888499
$$ 41977480 60384311 83988585 108833655 127796299 136506344 134549255 124660756
18653A24660756j4614526j6875469j7321452j5200083j1027899n603648m74521
$$ 124660756 110046230 93170761 75849309 60649226 49621327 44017679 43543158
18646D3543158K961194L799121J496921k503381o383260q097502p591579o009643
$$ 43543158 46504352 50303473 51800394 49297013 42913753 34816251 27224672 21215029
18638B1215029m322126k873340j573697o32982j08955J19583J77876J32093J12472
$$ 21215029 16892903 14019563 12445866 11812884 11703929 11823512 12001388 12133481 12245953
18629A2245953J22198O8395p658K02035M32236Q13593J382416K332469L793221
$$ 12245953 12368151 12436546 12428888 12630923 13063159 13876752 15259168 17591637 21384858
18620B1384858N822480Q098353R584581R168435N780091Q78160l594848n390132
$$ 21384858 27207338 35305691 44890272 54058707 59838798 60716958 57122110 51731978
18612E1731978m094742k58698N502308J2543189J9961605K6563456L0124240K9028394
$$ 51731978 47637236 47378538 52880846 65424035 85385640 111949096 142073336 171101730
18604A71101730K2380789R076442q120131k4076952l3794308l4004481k8066698
$$ 171101730 193482519 202558961 194438830 170361878 136567570 102563089 74496391
18597G4496391k0123343j2805890p427284l494440n13946J194641J293031l91423
$$ 74496391 54373048 41567158 34139874 30645434 30131488 31326129 32619160 32227737
18589C2227737k480025m290996m935481m312151l072149j930723j143065n89832
$$ 32227737 29747712 25456716 20521235 16209084 13136935 11206212 10063147 9473315
18581I473315k46542j40011k61360l18095l74192n96500n78696p09138n49690
$$ 9473315 9226773 9086762 8825402 8507307 8133115 7536615 6957919 6248781 5699091
18572E699091m27793l45600j86885j74302K3250K33498K23407J20381J27942K06035
$$ 5699091 5271298 4925698 4738813 4564511 4587761 4821259 5044666 5165047 5292989 5499024
18562E499024M9849m5443j88406l38277n31790m73654m75147m26664j61171j923
$$ 5499024 5548873 5503430 5315024 4976747 4444957 3971303 3496156 3069492 2908321 2906398
18552B906398M8340P3138J7676o0503n9497j72568k38032j28058r2395k2683j01284
$$ 2906398 2954738 3027876 3045552 2985049 2925552 2752984 2514952 2386894 2294499 2271816 2170532
18541B170532m3965j0751l4318l5647p1102r8591n882J37349Q8816J51653K06644
$$ 2170532 2126567 2115816 2081498 2045851 1974749 1876158 1870276 2007625 2096441 2248094 2454738
18530B454738J31171J76755J63363J65335k175j17797j79229j8861j04470j71428
$$ 2454738 2585909 2762664 2926027 3091362 3089187 2971390 2792161 2773300 2668830 2497402
18520B497402p7884n4673J5089Q5150J04658Q3338R7951N5298K21908K57222L28318
$$ 2497402 2419518 2364845 2379934 2465084 2569742 2653080 2751031 2806329 3028237 3285459 3613777
18509C613777K13569J5909j45576m18846m24149l84170l08424j12024k4935o8075
$$ 3613777 3827346 3843255 3697679 3278833 2854684 2470514 2162090 2050066 2025131 1957056
18499A957056J12765J33539M895j09679m3251j03367j31947k2444K1092N2913
$$ 1957056 2069821 2203360 2208255 2098576 2055325 1951958 1820011 1797567 1818659 1871572
18489A871572m5239o5106O2621k9288J6969p8436k8423R5892J30975J09705J93852
$$ 1871572 1826333 1761227 1823848 1794560 1811529 1733093 1704670 1800562 1931537 2041242 2235094
18478B235094K31312K75500L79313L22860M4362j41674m24999m57136l37607k38735
$$ 2235094 2466406 2741906 3121219 3444079 3488441 3346767 2921768 2464632 2127025 1888290
18468A888290k31868m7726l7497N5668j7900l1445J2879p0645q4007q691m1446
$$ 1888290 1656422 1608696 1571199 1626867 1608967 1577522 1590401 1519756 1435749 1427058 1385612
18457A385612j48865j0310r0706r044R506r5707R1409Q3777j1969j32849j28653
$$ 1385612 1236747 1226437 1135731 1126687 1136193 1040486 1131895 1215672 1203703 1070854 942201
18446I42201J3876l9002J9637N3569P1497M1268N1490M1690K741m0371o9891L3581
$$ 942201 956077 917075 936712 990281 1061778 1103046 1154536 1196226 1198967 1158596 1088705 1122286
18434A122286k9105j1052p4386k8659m6802O8456M6480J5563q2888m7113J21029
$$ 1122286 1093181 1082129 1007743 979084 932282 1000738 1047218 1062781 979893 932780 1053809
18423A053809L7520m8875l1595O871J0615l0973J57271R0796M8056Q8303R9566
$$ 1053809 1091329 1042454 1010859 1017730 1028345 997372 1154643 1245439 1293495 1381798 1481364
18412A481364O2641L3807k5396n0773o5583K1524J75801N6434J7346J37814K08039
$$ 1481364 1544005 1577812 1552416 1501643 1436060 1457584 1633385 1689819 1707165 1844979 2053018
18401B053018J93099K32294J91492K05105K39181K67956K93020K79350L78690
$$ 2053018 2246117 2478411 2669903 2875008 3114189 3382145 3675165 3954515 4333205
18392D333205L63070K94278L95138M88528M72155L98084M39158L82203K22543
$$ 4333205 4696275 4990553 5385691 5874219 6346374 6744458 7183616 7565819 7788362
18383G788362K11970L24911N46369R26768J369282K165294L162133L770002M057616
$$ 7788362 8000332 8325243 8871612 9798380 11167662 13332956 16495089 20265091 24322707
18374B4322707L814562K626298J355289K07466O5136J450388M238454R085921
$$ 24322707 28137269 30763567 32118856 32326322 32391458 33841846 38080300 47166221
18366D7166221J6146220K2821068K6177615K7549197K6378406J8815915Q913064
$$ 47166221 63312441 86133509 112311124 139860321 166238727 185054642 193967706
18359A93967706k812480j5314325k2183323k5765504k5658612k0789668j5307668
$$ 193967706 191155226 175840901 153657578 127892074 102233462 81443794 66136126
18352F6136126r218697l584020L20744K386634K203607j66389l009652n851320
$$ 66136126 56917429 53333409 53654153 56040787 58244394 58078005 55068353 49217033
18344D9217033p238323p313434o704471n364375l707177k432359j708451j227319
$$ 49217033 41978710 34665276 27960805 22596430 18889253 16456894 14748443 13521124
18336A3521124r40018o26380l81709l14965l35298j50984n2638O4182L44700P23506
$$ 13521124 12581106 11954726 11573017 11258052 10922754 10771770 10719132 10783314 11128014 11851520
18326A1851520J529173K601278M044797N582921O550671O852289N620307L014871
$$ 11851520 13380693 15981971 20026768 25609689 32160360 39012649 44632956 47647827
18318D7647827L59348j666553j409352Q94403M388492Q293009J2482094J5743599
$$ 47647827 48007175 46340622 44931270 45825673 50214165 58507174 70989268 86732867
18310H6732867J5883926J4084703J0370087L727711m878064j2383532j8768382
$$ 86732867 102616793 116701496 127071583 130799294 125921230 113537698 94769316
18303I4769316k0121889j8241282j4982497j0486331o352782l369875j499185
$$ 94769316 74647427 56406145 41423648 30937317 24584535 21214660 19715475
18296A9715475l25284N29052M53355k35290r93577j736596j924179k008634j987354
$$ 19715475 19390191 19919243 20372598 20137308 19143731 17407135 15482956 13474322 11486968
18287A1486968j566061j415879j285956r14959n39253l50408l30777k87626k92236
$$ 11486968 9920907 8505028 7219072 6304113 5764860 5414452 5083675 4796049 4503813
18278D503813l35828j88368j16017l10155k29382k19407k54273j38881l9372j16416
$$ 4503813 4167985 3979617 3863600 3553445 3324063 3104656 2850383 2711502 2672130 2555714
18268B555714k04690j37861L0807P1298k3588R6217q4314r5905M7124L9603L4031
$$ 2555714 2351024 2213163 2243970 2315268 2291680 2387897 2303583 2207678 2254802 2294405 2328436
18257B328436J39877J17283J16394P1722m5192Q1755J77591K46237L35140J75954
$$ 2328436 2468313 2585596 2701990 2773712 2728520 2810275 2987866 3234103 3569243 3745197
18247C745197J25235J70540L27614M40864N17393N75115P34235R20007Q20372
$$ 3745197 3870432 4040972 4368586 4809450 5326843 5901958 6636193 7556200 8376572
18238H376572Q79660J295594J685359K803430M762748Q270972J3594569J5999787
$$ 8376572 9256232 10551826 12237185 15040615 19803363 28074335 41668904 57668691
18230E7668691R886310J49619p993485q716949j568797Q386676J6560871J4305984
$$ 57668691 67555001 67704620 59711135 50994186 49425389 57812065 74372936 88678920
18222H8678920J792846j1596854j9667167j7209891j1084308o535410l672480
$$ 88678920 90471766 78874912 59207745 41997854 30913546 24378136 20705656
18215B0705656j878389n12176Q36481K610956N456466R993154J5884725J7123483
$$ 20705656 18827267 18315091 19151572 21762528 27218994 37212148 53096873 70220356
18207G0220356R007980j602919r740038q716814J5458J1268040J9285136J4034094
$$ 70220356 79228336 77625417 67885379 59168565 59184023 70452063 89737199 103771293
18199A03771293o10672j5019525k1797372j7499058j0104926m153317J205207
$$ 103771293 103160621 88141096 66343724 48844666 38739740 34586423 35791630
18192C5791630P344216J4658105J8470565J2218124K36357j0435022j3532427
$$ 35791630 43135846 57793951 76264516 88482640 88718997 78283975 64751548
18185F4751548p733565R57447P908202P727324M30196q428861j4221193j3361572
$$ 64751548 57017983 57975430 65883632 73610956 74041152 65612291 51391098 38029526
18177C8029526r449738o181575m020460k489443j572394j003371p63867o76696
$$ 38029526 28579788 22398213 18377753 15888310 14315916 13312545 12548678 11871982
18169A1871982m28187K8925M01798P37573R24696J446325K228681L706618O310012
$$ 11871982 11443795 11472720 11874518 12612091 13536787 14983112 17211793 20918411 27228423
18160B7228423J0533396J7397665K3772795K0287132O374512q719094j7299477
$$ 27228423 37761819 55159484 78932279 99219411 105593923 96874829 79575352
18153G9575352j3637741l453803O714981J0473722M004145o585640j5455223j6842225
$$ 79575352 65937611 62483808 69198789 79672511 83676656 77091016 61635793 44793568
18145D4793568j2295706p693568m749402l156512k326213j700371j340820r59290
$$ 44793568 32497862 24804294 20054892 16898380 14572167 12871796 11530976 10571686
18137A0571686o46338n94107m20474k54324j08101K47543L12915L52228M00651
$$ 10571686 9925348 9331241 8910767 8656443 8548342 8795885 9108800 9461028 9861679
18128I861679L42191J54255J35422O8279m7086k7853L92532N84335N08038M75296
$$ 9861679 10203870 10358125 10493547 10561826 10514740 10486887 10879419 11463754 11971792 12447088
18118A2447088M79757P23497J381438K397257L910511O355263J1159435J9955570
$$ 12447088 12926845 13650342 15031780 17429037 21339548 27694811 38854246 58809816
18110E8809816L6281555N8319339N2854582J3106097k5837486n5380051m7794756
$$ 58809816 95091371 153410710 206265292 219371389 193533903 138153852 90359096
18103I0359096k9481167j7472811j0971910p005587m610430l225517k285222j688038
$$ 90359096 60877929 43405118 32433208 25427621 20817191 17591674 15306452 13618414
18095A3618414j264433r72972q05422o45483m74792m17038l70451m25908n08119
$$ 13618414 12353981 11381009 10575587 9930104 9455312 9038274 8667823 8241915 7733796
18086G733796o40765p07213o76820m51632l59783k21638k59241l94086m66747
$$ 7733796 7093031 6385818 5708998 5257366 4897583 4675945 4416704 4022618 3555871
18077C555871l06923j06830N4742R0833L6228o529o1316k47672k70387k04502
$$ 3555871 3248948 3142118 3196860 3287693 3323921 3317392 3256076 3008404 2738017 2533515
18067B533515j66362j02389n2078p2268k16111j59617K2016p2274r2900O184L2655
$$ 2533515 2367153 2264764 2212686 2140418 1924307 1764690 1786706 1714432 1621532 1627716 1660371
18056A660371N7991J22248K3170L9762R3060Q361j21117l0529Q0686j02789o6231
$$ 1660371 1718362 1840610 1863780 1903542 1996602 2004963 1883846 1853317 1934003 1831214 1764983
18045A764983j50167o7457O189p5390j33874j77276j9329N120j8822n5134O0652
$$ 1764983 1614816 1547359 1553548 1478158 1344284 1167008 1147679 1152799 1133977 1078843 1139495
18034A139495k5715k7519k9155O9420L5864N403M5307R2387N5927O2703Q2490
$$ 1139495 1113780 1086261 1057106 1126526 1162390 1167793 1213100 1305487 1361414 1424117 1506607
18023A506607K6190O4866L114j04660j79321r7896j1454j5429n0396k9662j28615
$$ 1506607 1532797 1597663 1600777 1496117 1316796 1218900 1207446 1192017 1141621 1111959 983344
18012I83344j51307r6094o5024P9476K4377O6390O2316j3298o3494P4058L8153
$$ 983344 832037 735943 670919 750395 774772 841162 903478 890180 826686 900744 938897
18001I38897J5254k3890l9375N8331k2734K1219M8154p095q0776k7851K4120J9215
$$ 938897 954151 930261 890886 949217 926483 947702 995856 988761 907985 880134 904254 923469
17989I23469m176l0811j9677p8348N0856J5177J27206K42730O364m200p1761r3441
$$ 923469 919293 888482 868805 790457 841313 856490 983696 1226426 1232790 1228590 1156829 1063388
17977A063388K1834K3317J42971P3280j3515r5065o5547q2009J557M9045P3229
$$ 1063388 1085222 1108539 1251510 1324790 1311275 1216210 1150663 1068654 1070211 1119256 1192485
17966A192485j4685j29354L935M2879l218L9840J89370R7758j9329R0420J89468
$$ 1192485 1177800 1048446 1052381 1095260 1092042 1131882 1321252 1419010 1399681 1490101 1679569
17955A679569J28765K31897L58194K44636j18574j33751j28025j16648k66414
$$ 1679569 1808334 2040231 2398425 2643061 2524487 2390736 2262711 2146063 1879649
17946A879649k29000j30686j13782m7211O1131P2358P9855J19132K11911J74970
$$ 1879649 1650649 1519963 1406181 1358970 1420101 1492459 1572314 1691446 1903357 2078327
17936B078327K59774M07805M39854M01378K34681J68688J42382N5307j04824m21102
$$ 2078327 2338101 2745906 3185760 3587138 3821819 3990507 4132889 4188196 4083372 3662270
17926C662270n03869l50231l74348l23622k07879p9808r1359q5517p8509N9732
$$ 3662270 3158401 2808170 2433822 2110200 1902321 1822513 1731154 1645637 1567128 1626860
17916A626860o1984r7193K684r1070j95575r9285Q3542j592n3593o4700Q5860
$$ 1626860 1564876 1467683 1470367 1379297 1183722 1084437 1167979 1166387 1112794 1048094 1133954
17905A133954M6496L1547J9550P0168N4708N2970n5367J80536J59053Q1992Q4183
$$ 1133954 1180450 1211997 1231547 1301715 1356423 1409393 1354026 1534562 1693615 1775607 1859790
17894A859790Q8904J47591J58559N4305l616J56332J27956J56911J27962K33420
$$ 1859790 1948694 2096285 2254844 2309149 2305533 2461865 2589821 2746732 2874694 3108114
17884C108114M23883L50481K49102K93574K46838K58986M6713o4819n3089j36597
$$ 3108114 3531997 3882478 4131580 4425154 4671992 4930978 4977691 4912872 4859783 4723186
17874D723186M5578K72782N82356R26018J169268J586731K236012L627770O301144
$$ 4723186 4768764 5041546 5623902 6549920 7719188 9305919 11541931 15169701 21470845
17865B1470845J1162691J8825042K3647138J4886931n14459j5129040k0776700
$$ 21470845 32633536 51458578 75105716 89992647 89478188 74349148 53572448
17858E3572448j5839785r932539o306944m334249l163127k232691j256285o90422
$$ 53572448 37732663 27800124 21493180 17158931 13995804 11763113 10506828 9816406
17850I816406l12799M6575L10802N79557J147671K084931L529124O247796J1022320
$$ 9816406 9503607 9550182 9860984 10440541 11588212 13673143 17202267 23450063 34472383
17841C4472383J7936266K0619344J0889371k904229j5122463j7226859j0837043
$$ 34472383 52408649 73027993 83917364 81013135 65890672 48663813 37826770
17834C7826770m104588K327440R646867J6437949J4325379K526440r632794j7904217
$$ 37826770 33722182 36049622 45696489 62134438 76459817 78986257 69353463 51449246
17826E1449246j5997027j0488053o341089l965506k636188j586713r29449n13842
$$ 51449246 35452219 24964166 18623077 14657571 12021383 10434670 9505221 8991379
17818H991379k18533m5382P9827K40196O54440J320581K349831M262006P460455
$$ 8991379 8772846 8727464 8807291 9047487 9701927 11022508 13372339 17634345 25094800
17809B5094800J2692151J7364342J2633070O70486j0604598j6531082j3500187
$$ 25094800 37786951 55151293 67784363 68454849 57850251 41319169 27818982
17802B7818982q603707n179223l039990j826031j362686j099116p63997p40766
$$ 27818982 19215275 14036052 10996062 9170031 7807345 6708229 5944232 5203466
17794E203466o47632o63499n76375l23292r3008m5677P9196P5217K2743O3584
$$ 5203466 4555834 3892335 3315960 2992668 2899660 2853983 2933179 3008396 3031139 3094723
17784C094723j48287k26005k44881l21006j87945L0681P2065J37707N8271L7804
$$ 3094723 2946436 2720431 2475550 2154544 1966599 1997280 2069345 2207052 2265323 2303127
17774B303127o2174l30865k44916k43461k35514r8139n7459m0770Q5925k3560
$$ 2303127 2240953 1910088 1665172 1421711 1186197 1088058 1030599 989829 1075754 1052194
17764A052194n4275n1420j6623n0529j03512n17r5129j0191M2130R2991M3196
$$ 1052194 997919 946499 929876 879347 775835 775318 680189 669998 712128 805119 848315
17753H48315j373l7070r4089k02509o6425m134J36615p4772k7975n6185k694P1963
$$ 848315 846942 809872 715783 513274 446849 442715 579330 504558 476583 420398 417704 489667
17741D89667q671j2746o7823j30568j02297L1964J05504P8534R2469J78557j8388
$$ 489667 480996 468250 400427 269859 167562 199526 305030 383564 476033 654590 636202
17730F36202j34819j54930l375K3435n8440n9374P7593O1173M7452M0122J9740
$$ 636202 501383 346453 343078 366513 308073 248699 326292 387465 434917 475039 494779
17719D94779O847k4678m4130r0755j93084k8557J55317N0565j3753k7387j02052
$$ 494779 501626 476948 432818 342063 148979 120422 275739 326304 312551 285164 183112
17708A83112l6912Q2327O0735J8068P7415J88170J55724L4220q0810o1471M2418
$$ 183112 146200 228527 289262 307330 384745 572915 728639 762859 682049 620578 662996
17697F62996N5258J3830J5020L5532j2033j51800j35060q9768p4883m4566n7762
$$ 662996 718254 732084 747104 782636 770603 618803 483743 393975 319092 274526 216764
17686B16764l765k7316N2786R6427Q2378P460L5027P9267J6072n6108j03648k9736
$$ 216764 212999 185683 238469 334896 417274 424734 459761 539028 555100 498992 395344 365608
17674C65608O9340J2843P1322M3103M9353j12160k09746j00683n6891R9750N2322
$$ 365608 434948 447791 519113 562216 611569 499409 289663 188980 132089 231839 284161
17663B84161k0002Q118j13059o536p4357R908M8970N5920k3284n166p7548q959
$$ 284161 264159 272277 159218 152682 78325 88233 137203 193123 169839 164673 87125 78166
17651G8166J22409l7429j71256r0101J15976K22497M733r0440n8813j41114q3175
$$ 78166 200575 163146 -8110 -98211 17765 240262 244995 154555 95742 -45372 -128547
17640a28547L4968O9499p7340n068O0940R0829L7635K3574K0488P132J0036M9890
$$ -128547 -93579 -24080 -101420 -106488 -45548 45281 82916 106490 126978 134110 144146 194036
17628A94036n7263j72661p8719M6955N1563o3588l8316M6539L4156n229M5709
$$ 194036 136773 -35888 -114607 -67652 -16089 -79677 -117993 -71454 -37298 -42527 3182
17617C182K3126J067m6829K6575j6355Q837P4406J7000P221m1819Q7115J4467
$$ 3182 26308 27375 -19454 7121 -9234 -397 74009 91009 98230 56411 143526 157993
17605A57993j39630M392j7664O40J23099J18031M4205K6445Q304J2751M8811L4965
$$ 157993 18363 22755 5091 5731 128830 246861 291066 317511 325815 338566 387377 422342
17593D22342o6968r5308P815K0117j3438J39566R7571M5721r3311j40456j32153
$$ 422342 355374 260066 267881 287998 274560 414126 511697 557418 464107 323651 191498
17582A91498m6517n8168j953O1258N6254k7068L1925N1750m4670J2542K0190p2977
$$ 191498 144981 86813 84860 146118 202372 175304 207229 258979 214309 226851 247041 174064
17570A74064n3674M392L209q3374K2489J47244n872R1720K01576R7053K610q330
$$ 174064 120390 124782 127991 44617 67106 214350 208478 300198 501774 598827 601437 593107
17558E93107p4758l4137o6258P965K4827R2349n0859j09761p8419k2775L7951
$$ 593107 518349 484212 417954 425919 450746 543095 492236 382475 304056 281281 319232
17547C19232M3360l4970j17786j2819j5090R590j3398o123r6187p5849R3677R1763
$$ 319232 362592 327622 209836 197017 181927 191517 178119 171996 75809 -40 93637 185400
17535A85400o220k5181K5428j9696r513N8615J78582J72488K52449L31134L07594
$$ 185400 179180 153999 179427 159731 150218 208833 387415 559903 812352 1143486 1451080
17524A451080L82520K92592K863j85835l20830m33224l24532l38239j94809j74372
$$ 1451080 1833600 2126192 2129055 1943220 1622390 1189166 864634 526395 331586 157214
17514A57214j0713N5181j1863M8026r2522q1619J1176N7377L9363L1707N6508
$$ 157214 146501 201682 189819 237845 145323 63704 74880 132257 171620 203327 259835
17503B59835o1990n3533l0654n0979J7980K02737J03372J52267J47889K33642
$$ 259835 197845 144312 113658 62679 80659 283396 386768 539035 686924 920566
17493I20566K69844L21607K77575K29165P277j30143l30299l98401l33694k93477
$$ 920566 1190410 1512017 1789592 2018757 2026034 1895891 1565592 1167191 833497 540020
17483E40020j42657L2055o7604q0533m6513k0959L4081l1811M111J4619J7768
$$ 540020 397363 429418 361814 281281 234768 213809 247890 216079 220190 234809 252577
17472B52577Q440R523j0612q0893K0281O1454n3947l6332L9814R075N2607O3263
$$ 252577 261017 270540 259928 179035 199316 260770 206823 170491 210305 219380 271987 335250
17460C35250N3086N8926J2910o5289r8344j41853n8974K2923q5844Q8997L5363
$$ 335250 388336 447262 460172 394883 296539 154686 95712 118635 32791 121788 157151
17449A57151k3920j7873J24458J12748J21514J78433K95172K29571J7897p5925
$$ 157151 133231 115358 239816 352564 474078 652511 947683 1177254 1195151 1119226
17439A119226k67953l37973j64134j07160k1792j04861j50225m0731j3859R2557
$$ 1119226 851273 513300 349166 242006 220214 115353 -34872 -75603 -89462 3095
17429C095R1798Q486J0970O161N552P109j44776o9282N4772k6017P294l6855N6482
$$ 3095 94893 103379 114349 120510 126062 133171 -11605 -80887 -26115 -52132 -44838 -81693 -25211
17416b5211K3745o2054K2745Q9095J01095r5101p8581P3387M7535o1052j00396
$$ -25211 -1466 -63520 -40775 48320 149415 54314 -24267 49120 96655 35603 -64793
17405f4793r9715J06181J12304P0412l1811m7119r199N4039l4939M2583O0408
$$ -64793 -164508 -58327 53977 124389 92578 45459 36260 90299 55360 97943 158351
17394A58351l9105K5400L1780J54640Q0978P3344J18030O1925l9948Q5710J61379
$$ 158351 119246 144646 176426 331066 412044 485388 603418 665343 625395 711105 872484
17383H72484O7404n99p6138j27800l2110N2396n1034m0735k3472q6146j04069
$$ 872484 939888 939289 863151 735351 703241 755637 704603 663868 640396 554250 450181
17372D50181l0772m3118K1440M2185O7505R7637K7340M8448j57586J0522K16216
$$ 450181 419409 376291 397731 439916 507421 605058 632398 680846 523260 533782 749998
17361G49998J31046l5171K0608L8527n6007k2004Q5437Q7318N8240j06930j76398
$$ 749998 881044 845873 866481 905008 849001 826997 912434 999752 1057992 951062 774664
17350G74664j11354j54457j33633K6819k3430r4998M6364J44r3520J0516L0154
$$ 774664 663310 508853 375220 402039 378609 283611 329975 330119 236599 247115 277269
17339B77269j4793P3800j64J1347o1179J22019K05907N8265q9590K2129J23607
$$ 277269 262476 336276 336112 347459 286280 408299 614206 672471 582881 605010 728617
17328G28617Q835J9335j44368j2373o4217j08233k2370k0090N8324k8505N1300
$$ 728617 737452 756787 612419 600046 535829 427596 405226 385136 443460 414955 466255
17317D66255p3502o4348o6039m9878j6677J3127l3442j5153j10719M8500J21016
$$ 466255 392753 328405 262366 212488 195811 208938 175496 160343 49624 98124 219140
17306B19140M8450J11390P0453p633j16558n9543K7219P6104R2654l1453L1598
$$ 219140 267590 378980 449433 441800 325242 265699 292918 369022 461676 430223 461821
17295D61821L4849k4213j28544j14579q0622l3429p8563o6386P7274M2481m7976
$$ 461821 496670 472457 343913 229334 148712 115283 36720 -29666 47608 90089 42113
17284D2113K6415K5109j9543j05747m4876K6003J09478O1461M8089Q0469J18830
$$ 42113 68528 93637 74094 -31653 -76529 -50526 58952 120413 168502 248971 367801
17273C67801N3361o8344l944j14365p8814m0331j29479q0644N2248J25476j7383
$$ 367801 421162 352818 348874 234509 155695 115364 -14115 -94759 -42511 82965 65582
17262F5582m5301K6105j04938K6810M089p3948K2510J23376n556J3048N6542l799
$$ 65582 20281 46386 -58552 -31742 -27653 -101601 -79091 44285 38729 51777 108319 104520
17250A04520p9338k7712L2080O7144P115p6718n0748l931P4891P0606M4980n6193
$$ 104520 25182 -2530 29550 96694 103809 27091 -23657 -27588 47303 117909 162889 106696
17238A06696N0756K5851o2430j2402N382K9929m5353p4398l3735m1048J2678J1817
$$ 106696 157452 183303 120873 108471 113853 143782 98429 24031 -9704 -50752 -38074 -26257
17226b6257P9263r665j4972q5572O777J62527j7408K103m0785L5884O4998j634
$$ -26257 53006 43341 28369 -57203 -50426 112101 94693 96796 56011 91895 156893 155259
17214A55259m1966n1149r909j4721M524m4990j5988N7762J831o14l3898q8313
$$ 155259 113293 62144 52235 37514 42038 -2952 -18940 38822 40653 40039 6141 -82172
17202h2172J7123l6223k0707m6985o147J9783K6525J14021M5820J5175m9146k8761
$$ -82172 -65049 -101272 -121979 -168964 -175111 -155328 -128803 -14782 31038 46213 -2933 -31694
17190c1694J0871P853O0610L7889m835k0517m9628q7467m2165l7845M0024P363
$$ -31694 -20823 -12970 47640 85529 80694 60177 10549 -76918 -119083 -156928 -116904 -109541
17178a09541k2817j1520J9169L8773P6800L3682j9846j2616j3764M7482m7063
$$ -109541 -132358 -143878 -124709 -85936 -9136 24546 4700 -7916 -21680 25802 -21261
17167b1261m7651o905p5852l9719j8320J20361P8240N6823k8036j01781j7976
$$ -21261 -68912 -75817 -151669 -191388 -209708 -89347 -11107 45716 17680 -84101 -102077
17156a02077P3992j08920n7533J08060L2454p2885M8177Q7392K4707L9585M2573
$$ -102077 -28085 -137005 -194538 -86478 -54024 -126909 -78732 8660 33367 72952 115525
17145A15525m0848m704m5168R842K64n1820L5025O0063q5739j0185J6454J0756
$$ 115525 74677 69973 24805 34647 34911 -16909 18116 78179 -7560 -17745 -1291 9465
17133I465K8419o4548q2579l9174n6985M3868m1285O5434N6969O9089n9174l7768
$$ 9465 37884 -26664 -109243 -148417 -205402 -161534 -202819 -137385 -80416 -11327 -70501 -108269
17121a08269K3734Q1492K3761Q020m8674J857j01851j02635K5630J77777O3767
$$ -108269 -84535 -3043 20718 28738 -19936 -18079 -119930 -222565 -196935 -19158 44609
17110D4609l9527K3584Q265J440l1712M9039j8640L7515J1078j8528p8533k7616
$$ 44609 5082 28666 36931 38371 6659 55698 37058 74573 85651 67123 -11410 -39026
17098c9026k0393N1695N5967p832J0514n6240j0732P4118J26961M5892j361q2851
$$ -39026 -59419 -7724 48243 40411 50925 -5315 -16047 58071 185032 230924 229563 146712
17086A46712n448L3513j8004o610q2998q3522n3004m4008L6481J7006j2096n5970
$$ 146712 141264 174777 156773 150163 67165 -16357 -69361 -113369 -76888 -59882 -71978 -127948
17074a27948M9212K0019N8261J07883n6917o7804J1784M9519m9998o3295k0377
$$ -127948 -78736 -58717 -456 107427 50510 -17294 -5510 44009 -5989 -69284 -89661
17063h9661N4582L1903J9017Q8733M6443J300l8278j04532N5900n0189j13644
$$ -89661 -35079 -3176 15841 104574 151017 152317 114039 9507 65407 15218 -98426
17052i8426p38J6493L8158q447n7059Q8195J2725q4474M1700L8201J8611n1255
$$ -98426 -99164 -82671 -44513 -52960 -110019 -21824 -9099 -93573 -51873 -13672 4939 -46316
17040d6316q2692J28992l6389p9851j4050J9937O996R467J54054M7646j05940
$$ -46316 -129008 -16 -36405 -116256 -130306 -110369 -103373 -93906 60148 107794 1854
17029A854l6469j10483p0872l5228O895L8341j9164O10P7216O2562L8458M1030
$$ 1854 -34615 -145098 -215970 -251198 -244303 -205962 -225126 -224516 -147300 -84738 -46280 -5250
17017e250R4795J19522q0903o6054m0523m3483j792Q6855r2652j6778J33079L7276
$$ -5250 89545 209067 128164 62110 21587 -21896 -23688 63167 -29485 -46263 86816 124092
17005A24092o6034j22055N2655j267m0065J6506L0636q7319o2309Q5799n4126
$$ 124092 58058 -63997 -11342 -12609 -52674 -36168 -5532 -92851 -155160 -69361 -123487
16994a23487Q1000P0562k3937L5617j9469o894P8365L9557n0079l1001j2283l9749
$$ -123487 -42487 28075 4138 39755 20286 13392 91757 131314 81235 50234 37951 -1798
16982a798r9210o0674N732K622k993l1261O2243l1433Q198O2661J2214J3431L4071
$$ -1798 -101008 -161682 -155950 -153328 -156321 -187582 -125339 -156772 -148574 -85913 -73699 -60268 -26197
16969b6197K852m6618P5740J55695O15K1288o9671o1105K0589k9973M2006K0399
$$ -26197 -23345 -69963 5777 161472 162087 183375 113704 52599 73188 43215 85221 105620
16957A05620L8915n4505k6717n3856q0167k9342j6085l8409J9171O4786M0525
$$ 105620 144535 90030 63313 9457 -70710 -100052 -116137 -154546 -135375 -70589 -30064
16946c0064k9228q305Q3776L6724M3761k7683m7514l6338O9165n5278m6940K6765
$$ -30064 -59292 -67597 16179 52903 96664 68981 21467 -14871 54294 -984 -47924 -21159
16934b1159Q6552p8545r6836M1428L8708p1931j63572Q51J35889J01689J05780
$$ -21159 65393 -13152 -109988 -68560 -29852 -101783 -265355 -264504 -128615 -26926 78854
16923G8854k8960j12447l4538L9995Q3248q9054j106L1477n260j3613l7871K9887
$$ 78854 49894 -62553 -97091 -57096 26152 -62902 -64008 -32531 -37791 -51404 -89275 -59388
16911e9388J1426n1966K8474K6023K172j9032k5447p69M7848j23729r483J83366
$$ -59388 -47962 -99928 -71454 -45431 -43259 -62291 -87738 -88507 -40659 -164388 -173871 9495
16899I495Q9556J4696J3519p5144o7335j1627p6347r6391L1081M7906J59773j8248
$$ 9495 99051 113747 127266 52122 -15213 -26840 -103187 -199578 -168497 -120591 39182 20934
16887B0934j13472l9351R9521k9493J6569N2949J9055M055O2149L4503J4089r7052
$$ 20934 -92538 -131889 -32368 -61861 -45292 7657 26712 30767 92916 127419 141508 44456
16875D4456k8402L7768M3246m9758n7282K5518L2723J6935o8194M2692P6638r4457
$$ 44456 16054 53822 97068 47310 -9972 15546 48269 65204 -2990 39702 116340 21883
16863B1883j16968M4419R4864m6355K8013l0609J6929N339N453J0161p739K2479
$$ 21883 -95085 -50666 44198 -2157 25856 -4753 12176 17515 22968 33129 25390 47869
16851D7869r888J8309j5422Q5668o748r9573j05977P0397J46180j4507j70645
$$ 47869 37981 56290 40868 126536 119788 20215 -85762 -15365 130815 116308 -54337
16840e4337k1802J01296M6626N1116m3214q4693j9475M0481K335O0155J6895o8527
$$ -54337 -76139 25157 71783 122899 79685 -5008 -24483 15998 18333 78488 95383 26856
16828B6856r6280n1842M5874O9925k2742o5635M9495P095m9284O5291Q878k5249
$$ 26856 -69424 -121266 -75392 -5467 -28209 -93844 -44349 -37254 -86538 -21247 -12369 -37618
16816c7618P1205m5856j16438m1488L8189L2600Q4624M5733q0889K6827N0433
$$ -37618 33587 -12269 -128707 -170195 -132006 -99406 -14782 30951 -49938 -23111 27322
16805B7322K3040r602j04183q1146Q810L4307P2029R149L0198o6186p2998j5302
$$ 27322 50362 40760 -63423 -144569 -135759 -101452 -29423 -20274 9924 -56262 -129260 -144562
16793a44562L6462J33910k3744N7846Q4478k4825j41818o9494N1145R1621j13303
$$ -144562 -108100 25810 2066 59912 144390 119565 -22253 -91747 -40602 51019 -62284
16782f2284j20851k8264M1751J08937R7668q7321k8756O1225M8411n07r1180k4463
$$ -62284 -183135 -211399 -169648 -60711 36957 -50364 -79120 -17895 30516 30009 -61171 -85634
16770h5634j1531m0633m5658l4464N4221J16578O184j16659q8001L0826M6472
$$ -85634 -97165 -137798 -183456 -217920 -163699 -47121 -40937 -157596 -245597 -214771 -168299
16759a68299L2299P6409J5422Q1082J0421n9793m2004K9637Q204j6571P8233K1908
$$ -168299 -136000 -59591 -44169 36913 47334 -12459 -54463 -24826 -16622 -33193 45040 66948
16747F6948j6514R410j00908j23783Q2118q4110r143M6038M1977O4515P0973J1239
$$ 66948 50434 59844 -41064 -164847 -82729 -166839 -175982 -129944 -87967 -23452 47521 58760
16735E8760N4687q7981n0488n7455j29672j17756L7485J52925J24183R1790o1055
$$ 58760 113447 25466 -25022 -82477 -212149 -329905 -292420 -139495 -15312 76478 15423
16724A5423J1320K8076K2286K4489p2794n2393n9023r6546p950J9227O384Q4258
$$ 15423 26743 54819 77105 101594 28800 -23593 -82616 -179162 -187112 -167885 -161501 -77243
16712g7243M0409p4177Q3368Q6838j2257K7883L0228j02609M482j4905O8486L2604
$$ -77243 -36834 -111011 -27643 59195 46938 74821 105049 2440 6922 -7983 60503 93107
16700I3107j1492N2596K7786o1197n7331q2298k3242L1756L4242M6506J8847K5131
$$ 93107 81615 134211 161997 100800 43469 -38829 -62071 -30315 3927 50433 69280 94411
16688I4411j5917m7555o3136K8823R1408N6194k5293j21025k0032J8681M1688
$$ 94411 78494 30939 -32197 -3374 88034 144228 118935 -2090 -22122 -3441 38247
16677C8247l4535N570k4992j1872l2926n4903K7539R2066j1641K1999l8292o8473
$$ 38247 3712 9282 -15710 -27582 -60508 -115411 -87872 4194 -7447 14552 -23740 -92213
16665i2213N7889O9346Q9953l2640P8803p3379r3769k1427l1308m2398m3248L4417
$$ -92213 -34324 35022 124975 92335 171138 97759 3990 -17437 -48745 -91143 -134391 -99974
16653i9974J8230L5887J37010j0417O815j3511q9096m4952r936O4276o3186k1428
$$ -99974 -81744 -45857 91153 80736 87551 74040 -15056 -60008 -69944 -5668 -68854 -90282
16641i0282Q3875M5912p1935J5609n1188m7004K9126J2008N7567L1417J3472k8608
$$ -90282 -6407 39505 -32430 -16821 -68009 -115013 -85887 -73879 -16312 15105 28577 -31
16629c1M3261l164j3486j43382m2992J21619J62154k1867j36948p8720L0648j6036
$$ -31 43230 40066 26580 -116802 -159794 -38175 123979 102112 -34836 -113556 -82908 -98944
16617i8944R185O5949L6585M5876l5749m3129l4600r669n6427m1238j2671J16949
$$ -98944 -89759 -23810 12775 58651 22902 -20227 -54827 -64496 -120923 -162161 -174832 -57883
16605e7883Q6396n3223j2457M5127R5731r253j17613R75l408n982J6629L4544
$$ -57883 28513 -24710 -37167 7960 103691 94438 -23175 -22200 -25608 -31590 -14961 19583
16593A9583n3321p2623J9158o3159k321J37313n5045j65750N0640k0036M815R796
$$ 19583 -33738 -106361 -87203 -150362 -152683 -15370 -70415 -236165 -185525 -205561 -200746 -190950
16581a90950n261P3483R9184q224q1064O2624P5675j3474l5107n8613j00137P351
$$ -190950 -196211 -122728 -23544 -31768 -112832 -50208 25467 11993 -23114 -81727 -181864 -174513
16569a74513Q8694k9587l2631P7998N5756M173J5793M7969L3513j3054n5575Q079
$$ -174513 -85819 -115406 -148037 -70039 -14283 -10110 5683 53652 87165 74111 18536 26615
16557B6615l8967r4550l5879j7356l36j2227N3925L7195Q5279J95232q5024l0761
$$ 26615 -12352 -106902 -142781 -160137 -160473 -172700 -118775 -81580 3699 198931 113907 83146
16545H3146J7935j30619n9443k3118O235k8760J04275Q3925j3529j21544o4949
$$ 83146 101081 -29538 -88981 -112099 -105864 -134624 -30349 53576 40047 -81497 -146446
16534a46446K8321K9212Q1089N9904k5562K7532o5350r9834m849K0666r783O4434
$$ -146446 -118125 -88913 -7824 52080 26518 54050 -11300 -111134 -115983 -95317 -105100 -40666
16522d0666M3888q6914j3346j8449j4670l4656L2972m652j4878P6384m2604J8033
$$ -40666 3222 -83692 -97038 -115487 -130157 -164813 -131841 -136493 -151371 -74987 -117591 -99558
16510i9558J12440K6100N9062N9629j6927n5723p5033m1177N796p2217k7406M7907
$$ -99558 12882 38982 98044 157673 140746 85023 9990 -31187 -25391 -97608 -125014 -77107
16498g7107O7136O0643K7310m7018K647l608k2304J7364K6358N4753J344j49458
$$ -77107 -9971 50672 77982 30964 33611 30003 7699 25063 51421 106174 107518 -41940
16486d1940L0033K3716q1045k2687M7375K545l1872J5509k3934l4175J64022N7930
$$ -41940 -11907 11809 -69236 -91923 -44548 -42003 -73875 -58366 -82300 -116475 47547 105477
16474A05477n4260J2572l2681K2304J5127k6382r1206J4491R485l6334O0577N7277
$$ 105477 51217 63789 31108 53412 68539 42157 -49049 -34558 -25073 -61407 -830 56447
16462E6447p0739K6858Q8964K4591k8946q6086M397L6555m5519m1673r5531Q136
$$ 56447 -14292 12566 101530 126121 97175 11089 15486 52041 6522 -35151 -130682 -122546
16450a22546N9009O6892j4846M9687j8655n3486L4611N3599j10153j29178j05927
$$ -122546 -63537 3355 -11491 38196 19541 -33945 666 54265 -55888 -185066 -290993
16439b90993P608N9463P5636j1116J6514O3479Q9206O2237q5729J1021M0847l1972
$$ -290993 -283385 -223922 -148286 -159402 -142888 -79409 9797 72034 -13695 -2674 38173 6201
16427F201j00660M5388J03256r921k9683n1387J41792N0433o6271j58496n6606
$$ 6201 -94459 -49071 54185 44264 14581 -36806 104986 155419 89148 -69348 -125954
16416a25954J4154l505O2033k3598o2995K1154J9655L3391P6174J12865l8757
$$ -125954 -111800 -115305 -53272 -76870 -139865 -118711 -99056 -65665 10509 123374 84617
16405H4617q2586o2031Q8272Q0922J25562R177o1379m9044n3513L3533k8605k8917
$$ 84617 2031 -60000 28272 109194 234756 243933 182554 133510 79997 113530 84925 56008
16393E6008O227O42p0991J8723Q8076L8553p8067m8703m8481j292R2338J73657
$$ 56008 62235 62877 -8114 10609 98685 137238 59171 10468 -38013 -39305 53033 226690
16381B26690j4335j17765J9714p7572R2663j5094M914l1513n3775O1179j8072
$$ 226690 212355 94590 114304 36732 129395 114301 119215 87702 33927 95106 77034
16370G7034r290o6831p5215j0369R7400J02710N2699k983n7617l1467N0326M7876
$$ 77034 67744 913 -74302 -84671 12729 115439 168138 165155 107538 76071 126397 174273
16358A74273n6981r2680K7092r557o7496L793o9029k1297Q6379n8743j2061M759
$$ 174273 117292 24612 51704 42147 -25349 -21556 -90585 -111882 -25503 -84246 -96307 -91548
16346i1548r008N1915m0480L1672J9965O2791m183J6880j2302l149p551l102r9234
$$ -91548 -100556 -48641 -89121 -57449 -37484 25307 21124 38004 25702 22553 15002 11900 -87334
16333h7334j727R7330L4769L7765N2057j03770q3467j51173J8469M4503k7179
$$ -87334 -89061 8269 43038 80803 132860 29090 -54377 -205550 -187081 -142578 -169757
16322a69757J42075O4440N988l9404o6063J0707L0162L8694m4583K8890P0586
$$ -169757 -27682 36758 42746 3342 -62721 -52014 -21852 16842 -27741 1149 71735
16311G1735L5472J678n8892R852n9789j9292M3918Q3408P7136m0122j58267r6129
$$ 71735 107207 108885 49993 59845 56 -19236 24682 108090 185226 145104 -13163 -109292
16299a09292P039O0268N8699J9695n1907n7872O288P6678n022m6719j37737o0849
$$ -109292 -102253 -41985 16714 36409 -15498 -73370 -67082 9596 4574 -42145 -179882 -240731
16287b40731J90518K6064n3745K1995J01485O874j37250k3505N1398n0374Q2889
$$ -240731 -50213 -24149 -77894 -55899 45586 52460 -84790 -108295 -56897 -107271 -24382
16276b4382N5547M4710R738J8850o1862l0328l8302j21689m5424O7771k1896L1336
$$ -24382 31165 75875 85613 104463 42601 12273 -26029 -147718 -193142 -125371 -147267 -115931
16264a15931R2139N3735M257P7047q1293r4985k103q366K7833M5054M0700Q7143
$$ -115931 -23792 29943 34200 111247 29954 -65031 -67134 -75500 -47667 -2613 38087 125230
16252A25230N8088L2821r7188j33212k5425j3570j9662M6958O1734J05615J5394
$$ 125230 183318 216139 118951 -14261 -39686 -53256 -72918 -25960 35774 141389 156783
16241A56783j47535n3361R982o1488j3281L5423k5351p5086J6526K6173K2834
$$ 156783 9248 -44113 -34131 -95619 -108900 -73477 -98828 -173914 -157388 -131215 -108381
16230a08381m4261K532L8876P3559k3463j4862n3772Q85j6560r2449l5475J06386
$$ -108381 -152642 -150110 -111234 -37675 -61138 -76000 -129772 -128887 -145447 -237896 -273371 -166985
16218a66985N2398q1909J8089O2704j8661Q2635m7574N1801n0993j02863j9321
$$ -166985 -114587 -196496 -178407 -115703 -134364 -51729 -99303 -47502 -98495 -201358 -220679
16207b20679J8829J29568R9933k9374k9418P239o2325j6839M2540L6689j7231
$$ -220679 -201850 -72282 27651 -1723 -31141 -23902 -86227 -103066 -60526 -23837 -41068
16196d1068N2861J1487m7045l7387k0753J6125q3939m5438R1550N3754R5536J6553
$$ -41068 11793 23280 -23765 -61152 -81905 -65780 -149719 -195157 -103607 -49853 45683 62236
16184F2236p9839l2462j1214k6676P0257J6180J5845L8101l6624j30530L6647
$$ 62236 -17603 -50065 -61279 -87955 -17698 -1518 14327 52428 15804 -114726 -78079
16173g8079J7108n4884J0762l79m3845P5483k8316j7629K9379O251K0953l365
$$ -78079 -60971 -115855 -105093 -105472 -149317 -73834 -102150 -119779 -90400 -84149 -63196 -66561
16161f6561O0997j710m6139P0719m3356l7592K5046k688M55N9421N4203k5124
$$ -66561 -5564 -7274 -53413 17306 -26050 -63642 -38596 -41284 -40829 18592 72795 47671
16149D7671q0474o7305o3104L5163P7992O9105K5564J1412o8746M9O9032J3783
$$ 47671 -32803 -100108 -163212 -128049 -50057 19048 44612 56024 -12722 -12673 56359 70142
16137G0142k6983k9348o2887q2134M9965J20318Q2290l2295j70776k7238O0092
$$ 70142 43159 13811 -49076 -131210 -81245 39073 121363 89068 -81708 -108946 -48854
16126d8854n7047N2878K9274l1766m8171n5703m9522l8659M8084J18821J69629
$$ -48854 -105901 -53023 -23749 -55515 -103686 -159389 -208911 -247570 -199486 -80665 88964
16115H8964R3749r6685j46769q6924R3187m6372n2485J03115K6105M5997K5450
$$ 88964 182713 86028 -60741 -147665 -54478 -100850 -153335 -50220 -24115 21882 47332
16104D7332n0396K6691J04642o124l9099L8645k432o5051q7733r6036o1024J5821
$$ 47332 -3064 23627 128269 122145 83046 121691 119259 54208 -33525 -129561 -190585 -174764
16092a74764R3382Q3045N4719K653J59820N5293j56177j73166k3218J19988N3455
$$ -174764 -81382 1663 56382 59035 218855 274148 117971 -55195 -78413 41575 95030
16081I5030J1367l6418l667o8186j48745O7354N0810N0402k6371m6720k4338J5381
$$ 95030 106397 69979 66312 -1874 -150619 -83265 -32455 17947 -8424 -55144 -79482 -64101
16069f4101J9481N3096o1539k9172l7602n1212O7746O1927l961k6545N500l1304
$$ -64101 -44620 8476 -53063 -82235 -119837 -171049 -103303 -41376 -45337 -71882 -66382 -97686
16057i7686J26377l8580n4029k5991m1864N0896o449J04389N1998q9247L4009
$$ -97686 28691 -9889 -63918 -89909 -131773 -80877 -87326 17063 69061 -20186 13823
16046A3823l6255q4911K7010N377k4364j09015j6512J06586O9781O7753P5764
$$ 13823 -22432 -107343 -80333 -74956 -99320 -208335 -224847 -118261 -48480 19273 95037
16035I5037L417M3348J7925o1063R853m5766j8203m6382k2572L2412L2665P7411
$$ 95037 98454 141802 159727 98664 108517 62751 44548 -1834 -24406 8006 40671 118082
16023A18082o6181j72922j4180M5621k1341k1446J7683L0967k4389l7133Q563
$$ 118082 51901 -121021 -135201 -89580 -110921 -132367 -114684 -83717 -108106 -145239 -136676
16012a36676P5107p1072j23988o0709j4436P4932N8130L1360J4786O1446J4050
$$ -136676 -61569 -132641 -256629 -317338 -331774 -256842 -198712 -167352 -152566 -91120 -77070
16001g7070L1871O5181j5500k0935k1070P3783J28976j5565r1404n5779m0964
$$ -77070 -45199 19982 4482 -16453 -37523 36260 165236 149671 58267 2488 -38476
15990c8476M9175J3838j8011J26701m8111n2421l4030K8278j03190j22192J01398
$$ -38476 10699 24537 6526 133227 85116 32695 -1335 26943 -76247 -198439 -97041
15979i7041R4468L367n702K5663P50J5728j9353J0581r654j4308m6526L6857K3043
$$ -97041 -2573 794 -4908 20755 21505 37233 17880 28461 18807 4499 -42027 -5170 17873
15966A7873n3780l8146l5496o584L7080K7916Q0639j5094K3625k0182K408N256
$$ 17873 -35907 -74053 -109549 -116133 -79053 -51137 29502 14408 38033 17851 20259 25515
15954B5515m4229K0144R931l6589O7759k391r7036m394J55792k2849J1433l0261
$$ 25515 -18714 1430 11361 -25228 42531 40140 -56896 -61290 94502 71653 83086 52825
15942E2825o5613o3384l0309K849L365k9714p880J00014J18875n4539r7224N2678
$$ 52825 -12788 -76172 -106481 -103632 -100267 -129981 -137861 -37847 81028 26489 -70735 -18057
15930a8057M3362Q329j77l8917p8721q2227J21497k9461p9274O46n1065r8879
$$ -18057 25305 33634 33457 -5460 -84181 -166408 -44911 -74372 -153646 -153000 -204065 -302944
15918c02944l3806J56814J15801k8573J2661M4843P3715n4208q5264n6568O22
$$ -302944 -336750 -179936 -64135 -92708 -80047 -35204 38511 -15697 -100961 -157529 -156907
15907a56907L9587J8326K7391L0913m6513m3368N6952J3520M6703j1592p314L5479
$$ -156907 -117320 -98994 -71603 -40690 -87203 -130571 -73619 -60099 -13396 -24988 -32302 3177
15895C177J08024j34348n1095P152N3107j0352p3003K2442R7507r355M127j0125
$$ 3177 111201 -23147 -74242 -67090 -13983 -24335 -97338 -74896 22611 13256 17383 7258
15883G258l2995J6369J31857n103o2116J7294O6475Q0756L536m8518j04836j6805
$$ 7258 -25737 -9368 122489 117386 55270 72564 139039 219795 223331 174813 69977 53172
15871E3172m2424J5635O1503k8191p4864j409m4685m2889O6164K0441m1805N7718
$$ 53172 10748 26383 87886 59695 -15169 -16578 -61263 -104152 -37988 -17547 -59352 -1634
15859a634j4621j10223O1891R8917R0618o7373r6115l7635N9938P3157n7012m8788
$$ -1634 -16255 -126478 -64587 34330 124948 57575 -38540 -76175 -16237 56920 -92 -48880
15847d8880J04111M4453L4603j6113j2592l303k0445k8336r0279j03150m7564
$$ -48880 55231 99684 134287 118174 105582 102279 81834 53498 -36781 -139931 -187495
15836a87495Q208R5002N9125m8001K6850L1155o2115j711k4842J39803J09464
$$ -187495 -179287 -84285 -25160 -73161 -46311 -15156 -77271 -78982 -103824 35979 145443
15825A45443p8823o0437l3673P3039O7541K7852q9922l7492L1819p5003K9601
$$ 145443 66620 6183 -27490 45549 113090 140942 51020 13528 45347 -29656 -55
15814e5P5772l387o632r2043r3523o9562J2161Q3976R2804P2909O0311l2735j79486
$$ -55 75717 72330 65698 -26345 -119868 -189430 -177269 -93293 -489 72420 132731 99996 -79490
15801g9490m2374N8262n5504j31188K4315K3876O4968Q9226M6167P4241j5812
$$ -79490 -121864 -63602 -119106 -250294 -225979 -202103 -137135 -47909 -1742 72499 56687
15790E6687p3097j2401L1461r000k9634N39j8265p993l566M0952Q9881m0j04704
$$ 56687 -16410 -28811 2650 -6350 -35984 -35445 -53710 -61703 -65269 -24317 65564 65524 -39180
15777c9180q0494J0647K7774O7248L7876L3010o5816M8410l9500r0700q754M4914
$$ -39180 -119674 -109027 -81253 -14005 23871 56881 -8935 39475 -25 -90725 -99479 -54565
15765e4565J17090n4794p2884o8635k0077m8141J6739N9319K8674k3641l365L6522
$$ -54565 62525 7731 -65153 -133788 -153865 -202006 -185267 -125948 -97274 -120915 -124280 -87758
15753h7758j6469m0829j12809R4835J12373P9769j4609m7629j22603q1381q609
$$ -87758 -104227 -145056 -257865 -163030 -50657 29112 14503 -33126 -155729 -237110 -245719
15742b45719J13646M4716K3905R402R3668J20208k970p3564j33678p3241M5978
$$ -245719 -132073 -87357 -63452 -54050 39618 159826 156856 83292 -50386 -123627 -77649
15731g7649P7178K0410k1185o6159m2519m405O8797O4846L3139L7100J9158o5737
$$ -77649 -471 19939 -1246 -67405 -109924 -114329 -45532 19314 52453 89553 108711 42974
15719D2974l6470n9551p6729N50r457Q9449Q3070o617m7707m1174Q5661l8815
$$ 42974 6504 -53047 -129776 -129226 -138683 -49234 33836 27219 -20488 -61662 23999 -14816
15707a4816n4643l204N1392N0619L1500n5552r9293l2814r7783k1897J9372M8470
$$ -14816 -69459 -72663 -21271 29348 60848 5296 -93997 -126811 -224594 -246491 -227119 -178649
15695a78649O4963N7778L6818Q2015O2786o3260l5208j4944L0061M2121k0804
$$ -178649 -113686 -55908 -19090 62925 125711 62451 27243 12299 42360 84481 63677
15684F3677m6172j9454K8462j11617M1911R8189K5928j42580j9499O7157p5169
$$ 63677 17505 -1949 26513 -85104 -43193 54996 80924 -61656 -81155 -13998 -89167
15673h9167o055N8066n536O3395K7335M7130l0074p0803M1662K5853r74l035k8312
$$ -89167 -95222 -37156 -42692 20703 48038 95168 65094 -5709 35953 61806 60832 57797 29485
15660B9485m1589p2777m301k7999L4518J38187N6026l8587l5649j81470j06974
$$ 29485 -12104 -84881 -89182 -117181 -82663 55524 111550 72963 37314 -144156 -251130
15649b51130O5749J49961N8737j01424q623K985M4632K7298j8616K3981M6353
$$ -251130 -185381 -35420 23317 -78107 -86730 -83745 -39113 -11815 -30431 -6450 39903
15638C9903Q0448n8754o7891J6117L9561J2420L6941r6068o9118N9913J3378K2285
$$ 39903 120351 61597 -6294 9823 49384 61804 98745 2677 -66441 -6528 6850 29135
15626B9135k6191m2843k2744k4698q7830q433J7428R2811R0972m3242O4971N0675
$$ 29135 2944 -39899 -62643 -87341 -175171 -183604 -166176 -73365 17607 -25635 39336 90011
15614I0011m5500j3020l6670P6391j4898r5255j6256J9779o2517K0962Q445M8520
$$ 90011 44511 31491 -5179 71212 56314 -38941 -55197 -35418 -97935 -76973 -68528 -20008
15602b0008O2334M6399M653j1539n506q9029n2870J2133M3666O3797K3676r108
$$ -20008 42326 88725 93378 81839 76333 -12696 -65566 -53433 -9767 54030 77706 68598
15590F8598q6404M3206L8051o8505l1250k7403m1284j5775n7976R0011K0681K4754
$$ 68598 -17806 25400 63451 -5054 -36304 -63707 -104991 -120766 -178742 -88731 -68050 -43296
15578d3296M3016o113k2982l4348j7280m2366M3453L7281n4602j9785K8255k720
$$ -43296 -280 -6393 -29375 -63723 -81003 -123369 -79916 -42635 -97237 -117022 -88767 -91487
15566i1487L1345N8233q2641k3909J05128Q2594K7635l783J8337o1961M912m5228
$$ -91487 -60142 -1909 -84550 -108459 -3331 79263 106898 103115 121452 59491 64403 19175
15554A9175j21746q346P5087O3656r1233N5663J32462M3934o6294k4666q974j04365
$$ 19175 -102571 -110917 -35830 27826 -63407 -7744 124718 168652 102358 77692 68718 -35647
15542c5647j13289Q2258R6667p6683o6469N7111P0152j2081l7746L3817m0709
$$ -35647 -148936 -66678 29989 -46694 -113163 -56052 14100 2019 -35727 -1910 -42619
15531d2619N292m609k4364L0961p4917k204k0942P1614L2100j241J1569N6181
$$ -42619 -37327 -41936 -66300 -35339 -110256 -112460 -133402 -61788 -29688 -30929 -19360 36821
15519C6821j0275j21075k5133k5044J6342J5594m0208Q934M7175R638O6376L5741
$$ 36821 26546 -94529 -119662 -144706 -128364 -112770 -152978 -144044 -96869 -87231 -20855 14886
15507A4886J3046r7226Q384N7629r7699m3592L9175M7305p936N9928o0330L6J02950
$$ 14886 27932 -69294 -60910 -3281 -100980 -144572 -105397 -58092 -66028 -6100 -66430 -66394 36556
15494C6556J180r8432N4268J03431O0133n6258r6356L5665J2484j21119j6968
$$ 36556 37736 -60696 -6428 97003 157136 100878 4522 40187 52671 -68448 -85416
15483h5416Q227M582m810L0925L0877M5404L4004K0167J769p6217M9684j857Q7881
$$ -85416 -77189 -72607 -77417 -46492 -15615 29789 63793 83960 85729 9512 59196 57339 145220
15470A45220K9201K3489J4545n1669J1889k0436o897q4809q1477m8213K4374M4659
$$ 145220 174421 197910 212455 160786 172675 152239 145342 60533 -20944 -69157 -44783 -124
15458a24J1385l8724M3816J03721q1397k2050J0576j7817P3830P606j44397q092
$$ -124 11261 -27463 16353 120074 38677 16627 27203 9386 83216 90822 -53575 -61667
15446f1667q2946k0253O7480m136r729Q7683p149Q030K1902M631R3356K7079o0975
$$ -61667 -144613 -164866 -97386 -101522 -111251 -23568 -30717 -22687 -785 3846 97202 124281 63306
15433F3306j64898q9185J8821L7640M5440N1621R4646O7437Q0516J14307k7250
$$ 63306 -101592 -190777 -171956 -134316 -88876 -37255 57391 124828 205344 319651 292401
15422B92401k03003j26004j01992n8460N8164O9509m74m8810J08772p1276J8514
$$ 292401 89398 -36606 -138598 -197058 -138894 -69385 -69859 -118669 -9897 -81173 -62659
15411f2659J34914N7121j26185q8815m426k1863K9556n4287j2573J20051M5774
$$ -62659 72255 129376 3191 -85624 -90050 -111913 -82357 -136644 -149217 -29166 16608
15400A6608n7130K0288M9294P2726P0885O4840j18132j29893j04729p205N2224
$$ 16608 -40522 -20234 29060 101786 172671 237511 119379 -10514 -115243 -122448 -70224
15389g0224l9763N4761K6422L62K849J6654J9142r5448l0048m5997j0924J00112
$$ -70224 -109987 -55226 -28804 -28442 -25593 -8939 10203 -85245 -115293 -161290 -172214 -72102
15377g2102Q6656J9423N6014r7245j16248m5152J1896n828P2520P0420L5792n6314
$$ -72102 14554 33977 89991 -7254 -123502 -168654 -156758 -162586 -90066 -19646 16146 -40168
15365d0168K3260O4210o0978p5775p0325K2850K945M0828L1789j2580N3710j894
$$ -40168 -16908 47302 -13676 -89451 -159776 -136926 -133981 -93153 -61364 -73944 -20234 -22128
15353b2128L8585J1027o3176j80N3420L4073K6568P1587j02116j15164j9718L439
$$ -22128 16457 27484 -35692 -35872 17548 51621 78189 149776 47660 -67504 -87222 -83783
15341h3783M3415P0239O3663N5663r5573m6047K3996r1164j00194K1903N5820
$$ -83783 -40368 29871 93534 149197 53624 7577 31573 -59591 -159785 -137882 -82062
15330h2062N5010O0465p229n4598k0469m1927o5589r7071k7489L3123j8850K9905
$$ -82062 -27052 33413 26184 -28414 -48883 -90810 -156399 -253470 -280959 -247836 -266686 -236781
15318b36781j0994K3274j2948N5317q529l6480L3840O4782J21272J06042k7735
$$ -236781 -247775 -224501 -237449 -182132 -190661 -227141 -193301 -128519 -7247 98795 71060
15307G1060p6146l6451Q1155K142r2443O60j2038n5437j0522K8752L1620M9869
$$ 71060 -5086 -41537 39618 41760 -50683 -50023 -62061 -117498 -128020 -99268 -67648 -17779
15295a7779j8563M608N1951K7388m7620N4541m2984n7392R326K3205k866J1187
$$ -17779 -36342 -31734 20217 47605 -15 54526 11542 -45850 -36524 -13319 -16185 -4998
15283d998m3234p6742p9130J2379Q2403J60808M4757n039K4014K50q6329j42168
$$ -4998 -48232 -124974 -204104 -191725 -109322 51486 96243 91204 115218 115468 29139 -113029
15271a13029k4255N5311P218J9777Q164n8158j858Q9287L1899J2942O1776M0708
$$ -113029 -137284 -81973 -74755 -54978 -46814 -104972 -106830 -17543 14356 27298 89074 129782
15259A29782M0439K4199q9243j73545l3461J4745N9717k3338M3089J37253j3020
$$ 129782 170221 194420 105177 -68368 -101829 -87084 -27367 -50705 -7616 129637 116617
15248A16617p6148n3152O673M3761j13029j07892J5219N3957k8089r6269M1973
$$ 116617 40469 -12683 -6010 37751 -75278 -183170 -167951 -113994 -142083 -238352 -196379
15237a96379N5435L5608M3759K811k7504J6615j1563l0403j3592L3108l6287O0648
$$ -196379 -140944 -105336 -61577 -58766 -86270 -69655 -81218 -111621 -125213 -92105 -128392 -67744
15225f7744p4642j8599M5781L991j00093p5499K8212R7197Q6633o5286m6295M1034
$$ -67744 -142386 -160985 -115204 -111213 -211306 -286805 -258593 -161396 -74763 -140049 -186344 -145310
15213a45310K4996m4834K6973o713L4422M612K0859p0913j5188M711O4150j2596
$$ -145310 -120314 -165148 -138175 -144888 -110466 -105854 -84995 -155908 -171096 -166385 -102235 -114831
15201a14831K7799L4137j2447P8228K6917n133M0005L6348l744Q2983k533L572
$$ -114831 -87032 -52895 -65342 12886 39803 34670 74675 111023 107279 190262 187729 191301
15189A91301j35144N05k1713q7466J065M4182o8774l0214K8155R3049m0038J6992
$$ 191301 56157 56662 34949 -52517 -51452 -7270 -76044 -106258 -78103 14946 -25092 -8100
15177h100O4321J8619o8474m8664o0085J3079l0991M2022K3179J1904l2807J2768
$$ -8100 56221 74840 6366 -42298 -102383 -89304 -120295 -78273 -55094 -43190 -75997 -63229
15165f3229p5675q2880J01940J19886J72706P6544m9891q6135P737J2956j0670
$$ -63229 -138904 -221784 -119844 42 172748 249292 199401 113266 121003 133959 123289
15154A23289l7900n2550n4367J01609L8455k4323M2965o5225p6638r68j19619
$$ 123289 85389 32839 -21528 80081 118536 94213 137178 71953 -4685 -5653 -125272
15143a25272N0124J86099j719j07769J8623n2476J9131j5867o4287j5432o0002
$$ -125272 -75148 110951 109232 1463 20086 -32390 -13259 -29126 -93413 -108845 -168847
15132a68847q1487M3477Q5003R7048L1694O7304M8155m4774j38333o234J6580
$$ -168847 -250334 -206857 -121854 -24806 6888 74192 122347 77573 -60760 -66994 -50414
15121e0414J12402r380J126M0940o8036j04352j4166q2881l8467P9530P7399Q6940
$$ -50414 61988 52608 53734 94674 26638 -77714 -91880 -174761 -213228 -133698 -56299 30641
15109C0641n090l5324l070K0192J8090l0715L9728J29819k5122K0818r5962l966
$$ 30641 25551 -9773 -12843 7349 25439 -5276 34452 164271 139149 159967 64005 60039
15097F0039P5301k5852l6627n5474r8564N9527K5612K3510M7111m8915O0096N5696
$$ 60039 135340 109488 72861 17387 -81177 -21650 3962 27472 74583 25668 85764 141460
15085A41460j27846j9380K5265l0737l471n7867l7817K2504J30620J22975J035
$$ 141460 13614 -5766 19499 -11238 -14709 -72576 -110393 -87889 42731 165706 166741
15074A66741j27329k5160O1558m9002n6748K0322Q291L9174M8791q0608m2433
$$ 166741 39412 14252 75810 26808 -29940 -9618 -1327 37847 86638 6030 -36403
15063c6403L752J906K451K7939l1116K8407j0051o8541q952L0947O7819k640n094
$$ -36403 -32651 -30745 -28294 -355 -31471 -3064 -13115 -81656 -90608 -59661 8158 5518 424
15050D24N0837K0201p2404p1510J0355L8605N7983J23073L6590j21972j5510p8802
$$ 424 51261 71462 -942 -72452 -62097 -23492 34491 157564 194154 72182 56672 -22130
15038b2130n0292j05234K8395O5911N128O5796J06631r394M9410n4443j03521
$$ -22130 -72422 -177656 -149261 -83350 -78222 -12426 94205 84811 134221 79778 -23743
15027b3743Q023J22220J835j01028O6846M4991m4006r9125K0694J83628k2523
$$ -23743 -15720 106500 108335 7307 74153 119144 75138 -23987 -3293 180335 157812
15016A57812j10140p8289j48393N5432J67967O0359J6039m84j5505p3976J0551
$$ 157812 47672 -30617 -179010 -123578 44389 104748 120787 120303 104798 30822 41373
15005D1373l0943m2580o2904l6727R0644k0139l0740P2765J10193L2590l1679
$$ 41373 10430 -32150 -95054 -131781 -41137 -61276 -92016 -19251 90942 123532 91853
14994I1853L7967l6815k18382j57764J6809Q8598J05612O8115k0315q8336p9735
$$ 91853 129820 93005 -125377 -283141 -266332 -177734 -72122 -4007 -24322 -112658 -192393
14983a92393N6501J13514L4936p9473K7573P9497K1227k4683j5055p0481j02165
$$ -192393 -135892 -22378 12558 -66915 -39342 40155 61382 36699 21644 -48837 -151002
14972a51002p745J09932N0383n3565m4573m2781J03143J23256l3600o6111q2380
$$ -151002 -158747 -48815 1568 -51997 -96570 -139351 -36208 87048 53448 -12663 -95043
14961i5043L5208p4141M387Q6766j1495J32579k491L1876k8167m1023j193l0223
$$ -95043 -59835 -133976 -129589 -42823 -54318 78261 75770 107646 79479 38456 37263 7040
14949G040j9069J2969k6520j00479j03768r5275J02849R3364L2516M3225n380
$$ 7040 -12029 940 -25580 -126059 -229827 -325102 -222253 -128889 -96373 -53148 -58528
14938e8528r0441K1623J56078M1718J4005L1153p176j760j17232p4981N6690l0409
$$ -58528 -148969 -127346 28732 70450 84455 115608 108432 106672 -10560 -85541 -28851 -59260
14926e9260l5951j01102O2180J19704J67471K7663j02954j26148q4992j0156J29311
$$ -59260 -95211 -196313 -134133 -14429 153042 180705 77751 -48397 -133389 -143545 -14234
14915a4234J47357N9680j06120k00767k0089Q952M5019J180n5971J16343L0806
$$ -14234 133123 192803 86683 -114084 -134173 -125221 -80202 -79022 -134993 -18650 12156
14904A2156m7654k8891R7486M5291p5281k7877Q5022P3457j62055q1096M8723
$$ 12156 -35498 -64389 33097 78388 3107 -24770 60252 133709 -28346 -109442 -60719
14893f0719j9808K2818N6105O3146m281l0365j9071L2069J7479k0256M4323l8239
$$ -60719 -80527 -57709 -1604 61542 57261 26896 7825 39894 57373 37117 81440 43201
14881D3201l3245P3116J181r377j0500o392k387j8022l17q533J031j2777l0545
$$ 43201 9956 83072 84253 74876 64376 57984 55597 37575 37258 28725 29756 16979 -13566
14868a3566M4729r118m8161q0637m9327M9795N9275n567K6296K2892n7639K8630
$$ -13566 31163 22045 -26116 -106753 -156080 -106285 -47010 -52577 -26281 -3389 -61028 -32398
14856c2398R8522p6386r2868q9307p2253n041J809m679J26069J21012N6611j5765
$$ -32398 66124 -10262 -103130 -192437 -264690 -269731 -267922 -272601 -146532 -25520 31091 15326
14844A5326j48967k4006J03957N5689O8023K4029P4352M905o5113j43020M0110
$$ 15326 -133641 -157647 -53690 1999 70022 94051 168403 173308 108195 -34825 5285
14833E285N9871o5416N2649N8867l0235l0749O2838J7921l0131k0564m3848l6220
$$ 5285 65156 -260 52389 111256 81021 50272 113110 131031 100900 80336 36488 268
14821B68m462O5365Q8735K4160n0550R5616k6742j41435q4297l6257N91l2415
$$ 268 -4194 61171 149906 174066 123516 219132 192390 50955 -33342 -69599 -69008 -101423
14809a01423N7776n6641m1688P4510L5855Q951l1247k2654j24866k4455k7077
$$ -101423 -43647 -100288 -141976 -67466 -31611 -22660 -53907 -76561 -201427 -225882 -252959
14798b52959R9625J39802q8519j0780O4571J24535Q4754n3260k2850M200q1826
$$ -252959 -153334 -13532 -102051 -112831 -48260 76275 161029 107769 84919 89119 7293
14787G293k3355j5686k04980p0561Q1209R5305K8481k2288J16318K1855j0441
$$ 7293 -16062 -31748 -236728 -307289 -226080 -130775 -102294 -124582 -8264 13591 3150
14776C150l3499p712r7667j3717N0770o42L1107j0116L5987J17962o9924l1052
$$ 3150 -30349 -38061 -135728 -149445 -98675 -99317 -68210 -78326 -42339 75623 5699 -25353
14764b5353L66j43560n6345R313J89039J01138J5419M9715m5541n5469m1097P895
$$ -25353 -24987 -168547 -224892 -215579 -26540 74598 90017 139732 94191 38722 -2375 5520
14752E520j00245r412J65746j23522q9308r7253P677J49999P4850N5089L3893
$$ 5520 -94725 -104137 61609 -61913 -151221 -248474 -240797 -90798 -15948 39141 73034
14741G3034o5784o4760Q2070l7580q9713r293J01535K5790l7192M7024P5821L5613
$$ 73034 7250 -57510 24560 -13020 -102733 -112026 -10491 15299 -21893 25131 100952 136565
14729A36565N352j0113p1621m6058j05877K7416j6616O1757Q2332j9008o4751
$$ 136565 141917 131804 60183 14125 -91752 -64336 -80952 -19195 63137 44129 -20622
14718b0622R367o1505l3858R3427N8028l9791N2303O9165J7470q1119o552q8947
$$ -20622 -11255 -72760 -106618 -13191 44837 5046 57349 126514 143984 62865 56313 -32634
14706c2634j3412P4212J0887r4302q692J45617P4506J8552o8550P432j249O2912
$$ -32634 -46046 28166 39053 -55249 -63941 81676 156182 174734 106184 113616 112367 175279
14694A75279o5691K50j966M8645n7622n6022k1129m731j02723o881M2456J612
$$ 175279 109588 109838 107872 156517 98895 42873 21744 17013 -85710 -92591 -50135 -48523
14682d8523N2425Q6371j5218j05421r0129R2612J14348p1395o4257l6281K1710
$$ -48523 3902 90273 75055 -30366 -120495 -27883 86465 15070 -49187 -85468 -63758
14671f3758L2211L6313l9678J23807M5322q4504l4997m3204o0228N3566P0030
$$ -63758 -31547 4766 -34912 88895 134217 49713 14716 -28488 -88716 -35150 34880
14660C4880R7508q4099l4653M3295O2267P3729P4534k2492j90750j79085M9540
$$ 34880 132388 48289 13636 56931 119198 192927 267461 244969 54219 -124866 -75326
14649g5326J7526j8466R1176n2207n3976N5237O5001p9647j8488J04365J33731
$$ -75326 -57800 -76266 14910 -37297 -91273 -36036 28965 -50682 -69170 35195 168926
14638A68926l286n1440L2540k1702j47303j77753Q6465P9429o644Q0296J70214
$$ 168926 165640 114200 146740 125038 -22265 -200018 -113553 -34124 -40768 39528 209742
14627B09742J5356n3218o9506n9897M0447K3410K2913P6480O881K3998n314p0416
$$ 209742 225098 171880 102374 42477 82924 106334 129247 205727 212608 236606 231292 160876
14615A60876l1222O2888l028J3567j41364j33043l5812P5249P7095n9180l9592
$$ 160876 129654 192542 189514 203081 61717 -71326 -107138 -31889 45206 -13974 -53566
14604e3566M6045k8324M859m7000k751O6777P4273j4731j11800K6893N7053Q9512
$$ -53566 -7521 -35845 -30986 -77986 -80737 -13960 60313 45582 -66218 -39325 17728 107240
14592A07240Q7814m6927o1788J3027l8670j20345j03359P141P5360O0324O0585
$$ 107240 195054 148127 86339 99366 60696 -59649 -163008 -155867 -80507 -20183 40402
14581D0402j0423n9144O8853j3158J40921o7347o7242m990n4565N7876J8137k5161
$$ 40402 29979 -29165 39688 26530 167451 100104 32862 27872 -26693 31183 49320 24159
14569B4159n9878m3274k784J29474L3875J7715P7995p0260q6943J6470j0751J8692
$$ 24159 -35719 -78993 -81777 47697 81572 99287 177282 107022 20079 36549 25798 44490
14557D4490k4188r1418l3553J20499Q7884R8894j2938j02993j8930n3258n329
$$ 44490 20302 -71116 -104669 15830 103714 202608 189670 86677 67747 14489 9160
14546I160M8619j0909l8907n0604L3726r667k2634R3303K9691k9646m512K2096
$$ 9160 57779 46870 7963 -42641 -8915 -18582 -41216 52087 81778 52132 47620 69716
14534F9716P2429l7388N701p2997O2015L6412m2518N8362N138J1172J4618k9049
$$ 69716 142145 104757 110458 37461 99476 135888 93370 151732 156870 168042 182660 153611
14522A53611j60432o4103K7705N3055L1585L7201K137L0528J8133q5867N9292
$$ 153611 -6821 -70924 -43219 9836 41421 78622 80759 111287 129420 43553 102845
14511A02845J0901R540n4345o6291O799q803K597j2747m0197m2489J47M3340J9478
$$ 102845 113746 123286 68941 2650 9449 646 3243 -9504 -49701 -92190 -92043 -48703 -29225
14498b9225K0915l828J6085Q111j25535o4141P2924L539K5113M1613N7863L1884
$$ -29225 -8310 -12138 3947 12058 -113477 -177618 -104694 -101155 -76042 -34429 23434 55318
14486E5318O1574L9069k6571j03937o4492K8822o0725K7496J21595K9187q5526
$$ 55318 116892 155961 129390 25453 -39039 -10217 -70942 -43446 78149 107336 21810
14475B1810l6866j2372l6021o6k5769o057J39871O612q6320r701Q3698n423K602
$$ 21810 -15056 -27428 -63449 -63515 -89284 -95341 44530 51142 -35178 -44879 38819 33396 35998
14462C5998k525l1140n8966j0262L8281p4552P6715J37058j4618o2306J13267
$$ 35998 33473 2333 -56633 -66895 -28614 -103166 -26451 110607 95989 33683 146950
14451A46950J18763j959j82255r2348L8308Q289L0198j5841j1909q519m9946O7096
$$ 146950 265713 263754 81499 -10849 27459 35748 65946 50105 38196 29677 -20269 46827
14439D6827J00110O3846K1782O683l6179r104n9279o4245n0926j51973K7776J22133
$$ 46827 146937 210783 232565 239248 203069 193965 134686 70441 19515 -132458 -104682 17451
14427A7451L3012P2682O750j64483o0030J8903P2756J0004K4748O3271N006r2558
$$ 17451 50463 123145 129895 -34588 -94618 -75715 -2959 7045 31793 95064 100070 7512
14415G512m6325M9602M98r5696M8277m0232N4149J03908j7885r069n5770j2215
$$ 7512 -38813 10789 11287 -84409 -36132 -76364 -22215 81693 63808 54739 -1031 -13246
14403a3246K4308O818l3096p06L3849P5154k606p3759p6902J9410N9536P4013
$$ -13246 11062 17880 -15216 -15922 17927 93081 90475 16716 -60186 -40776 18760 92773
14391I2773m5079j31133Q003R1511J7701m3976M6745M7974O6862O0727N7950m4963
$$ 92773 47694 -83439 -75436 16075 33776 -10200 36545 84519 151381 212108 270058 225095
14379B25095n6776j47716n8294R150o4565P496K4685q0727J5937L8280P9394J61208
$$ 225095 168319 20603 -37691 -28541 -93106 -85610 -60925 -141652 -125715 -87435 -8041 153167
14367A53167p5134K785P1750p817J9329o4640n7899N8098K2769k0960j1523n7781
$$ 153167 78033 80818 152568 144751 164080 99440 41541 99639 122408 101448 89925 32144
14355C2144k1126N3944K7143j1720M9004j4380j28889j8773K8335o2106Q0796
$$ 32144 11018 64962 92105 80385 129389 115009 -13880 -32653 -4318 -66424 14372
14344A4372j4599J11J25636L2750k8385r001O2914m5118p5013O157j6711k4455
$$ 14372 -227 -116 125520 158270 129885 120884 183798 138680 63667 69824 53113 28658
14332B8658m8267p2973o4635p844O5850P1594P1555J02533n714m5566p1628r2026
$$ 28658 -19609 -92582 -157217 -165061 -99211 -27617 43938 146471 140757 95191 23563 -68463
14320f8463j7800p7514l8889J55695N7318l117K069j1752j5386J7794k3744j6224
$$ -68463 -86263 -163777 -202666 -46971 10347 7230 9299 -2453 -17839 -45 -23789 -40013
14308d0013j4627j05057p9185J2516Q3253J17721R4867L8399M0824O2617k4767
$$ -40013 -54640 -159697 -238882 -226366 -143113 -25392 69475 107874 148698 211315 186548
14297A86548J035j75955m8128J61144k8888m4178Q6257N9946r042j09485q2839
$$ 186548 187583 11628 -36500 124644 95756 51578 137835 197781 188739 79254 -3585
14286c585Q777J20627N1517j33969k0062M5072O8573p9557L3489J85349k7058
$$ -3585 5192 125819 177336 43367 23305 68377 136950 57393 90882 276231 249173
14275B49173j07931m4044m521K7021l7761O228P9654n9968o9329R4380J13547
$$ 249173 141242 97198 92677 119698 81937 88165 167819 107851 38522 132902 246449
14264B46449l3035j721K1722R0744J10388J22292j2919r6246k5813J35212K29145
$$ 246449 213414 211693 233415 324159 434547 556839 543920 447674 421861 557073 786218
14253G86218L61337L06506K72399L30325J91692R6262J10795j75866l90870k99196
$$ 786218 1147555 1454061 1726460 2056785 2248477 2344739 2455534 2279668 1888798 1589602
14243A589602m41639l04779k04021k00920r1549Q388l4238l8340k5325q861r2081
$$ 1589602 1147963 843184 639163 438243 346694 355082 320844 282504 257179 248318 156237
14232A56237l3102j1259r4870l7794J3228N0333j726N6543R1366J217M2211m2105
$$ 156237 123135 111876 17006 -20788 -7560 42773 41047 97590 188956 190173 232384 190279
14220A90279n8360m8222L5692R2212k1385m3926l0040Q4964l251r9343m2547n2234
$$ 190279 131919 83697 119389 211601 190216 146290 116250 201214 197963 98620 56073 3839
14208C839o1408o9990K296J25086J37795n4472l396q0129l2416K4573l2704q3743
$$ 3839 -57569 -127559 -125263 -177 137618 83146 79750 -379 -32795 -8222 -40926 -124669
14196a24669M671J22590J11748K7770q882n2375j359L4292P9336L3699j6611q9182
$$ -124669 -119998 2592 114340 142110 133228 80853 79494 113786 193122 226821 210210 121028
14184A21028n9803m5692N433J887o6604j1443K261P1548N3151k2230L5270m6563
$$ 121028 61225 15533 20966 22853 -43751 -55194 -52933 18615 71766 49536 84806 38243
14172C8243K8080K1955K1678O9270l1265m7824K5351o293m800O9736q4218j56685
$$ 38243 66323 88278 109956 179226 147961 100137 125488 119195 114395 184131 99913 -56772
14160e6772P384Q6911J36060O9627j139l6647K2418L21N3574o503J4910l0342
$$ -56772 -49388 37523 173583 243210 242071 205424 227842 228163 281737 275234 290144 259802
14148B59802l869q218j58502j06749o1954N7564M3059R6076O9515M0852m3110
$$ 259802 255933 247715 89213 -17536 -79490 -21926 21133 117209 186724 227576 184466
14137A84466M1166P3672M2310k14998k04885j9286L0760L8054N7730M4860K3472
$$ 184466 225632 299304 341614 126616 -78269 -97555 -66795 -28741 28989 73849 97321
14126I7321L1830M4288J05292j10756m3824Q3894j12594n8598p931n1243Q5794
$$ 97321 129151 173439 278731 167975 124151 208045 95451 36853 28922 -22321 63473
14115F3473O6797n649n0376m1273p9763p116M2622j5677P5353Q1854m681j8831
$$ 63473 130270 124621 74245 32972 -46791 -53907 -11285 -26962 48391 130245 125564 106733
14103A06733L0236N611l7015L9684N8152n281K9009J141O2246q849q7562j11405
$$ 106733 136969 142580 105565 145249 203401 198120 227129 228270 290516 281667 194105 82700
14091H2700k4239J118j9075K1485k8469J21367K7168q8838l4490L8385l6685P21
$$ 82700 58461 59579 40504 61989 33520 154887 182055 93217 58727 97112 60427 61148
14079F1148m1120k9724P4581R9472n7224m7535O3163J0440k0047Q4227l0n5732
$$ 61148 20028 -9696 64885 164357 107133 59598 122761 133201 113154 197381 197351 141619
14067A41619j04243K821j7984O9859M6587J5064M1160L0313N8221j23146r1160
$$ 141619 37376 40197 22213 92072 138659 153723 194883 225196 283417 160271 69111
14056F9111q6454n340R2435l6596q352m9879j2564K3190P4528O1281L8077Q504
$$ 69111 -17343 -22683 69752 33156 24804 -25075 -37639 -14449 60079 121360 159437 167941
14044A67941P055Q835L399M5670j8579n3574k7103N7288M9184p7788j2910O3044
$$ 167941 174996 183831 187230 232900 214321 160747 133644 190932 240116 162328 149418 212462
14032B12462r9105q0673R8486J38464M7406k7588p7149J47105J06725J5348k8735
$$ 212462 113357 32684 131170 269634 317040 289452 212303 359408 466133 481481 452746
14021D52746j31315P5206l9908p2999j04505O114j0613L3294k5413n4800j26781
$$ 452746 321431 396637 356729 283730 179225 185339 174726 208020 182607 127807 1026
14010A026O0102J20036R94K0917K3570k4553n0339L1978j7777o6470m2856P3364
$$ 1026 61128 181164 182158 203075 226645 202092 151753 183731 165954 99484 56628 129992
13998A29992k2540M3983j2677n8314o0739N5241J76832N6527m9092r4499M7084
$$ 129992 107452 151435 138758 80444 19705 74946 251778 308305 259213 164714 211798
13987B11798p857k9204M4377k286o3983Q0424o9044n8136L6861P041R887J03981
$$ 211798 203941 174737 219114 216828 152845 233269 164225 106089 142950 149991 159878 263859
13975B63859R9028j69592n9131P9210J6872N3778p2456j20421o2256R5554J8972
$$ 263859 362887 193295 134164 213374 230246 284024 211568 91147 28891 124445 143417
13964A43417l8749J9093j3919J0540K9443j08556n3701Q4252M8902p710k3994
$$ 143417 104668 123761 109842 120382 149825 41269 -12432 71820 120722 113012 89018
13953H9018M5806J1351l1035j6604L6607n253r063K299j6455j5137P170R8474
$$ 89018 134824 146175 115140 98536 135143 129890 120827 123126 106671 91534 98704 197178
13941A97178l780m4944m9637r9956n234r9695Q5912J52553R2823o9445P5680P1509
$$ 197178 193398 148454 98817 -1139 -6373 -106068 -20156 132397 225220 155775 231455 302964
13929C02964M8157K7259k3458p2765n9744n1003Q8715J59067K1787o7222k4382
$$ 302964 351121 378380 354922 282157 222413 171410 260125 419192 440979 373757 349375
13918C49375r819j9442j17606J9837J44875k322J6236O6550k033J21176L657N1727
$$ 349375 339556 320114 202508 222345 367220 364898 381134 447684 445651 566827 570484 622211
13906F22211K9724M7993J0437n3206N9414p2859j07973o8146j15880j61551n7138
$$ 622211 651935 699928 710365 657159 716573 643714 535741 467595 351715 190164 133026
13895A33026n4922K3661j4243n5243M3792O8027K25273m3421q9736J337M4983
$$ 133026 78104 101765 87522 32279 76071 144098 369371 325950 236214 237551 282534
13884B82534J8180L9473k631Q4258r261j6734M5919O4877J7404L1129R5884J51818
$$ 282534 300714 340187 337556 421814 412553 395819 441738 506615 524019 555148 651032 802850
13872H02850J83499N7834P5528q764k74N7476P365j06642j81001n8457p3417m0734
$$ 802850 986349 1044183 1119711 1110947 1110673 1168149 1175514 1068872 887871 829414 755997 715263
13860G15263m620n0730r2152r4218N5711Q503J19189n6899l7607J0407j63624
$$ 715263 710643 659913 567761 473543 529254 537757 656946 600047 562440 572847 409223
13849D09223k884K3948N0509O2713L2399m4178n2216j08676J00551J03446O6145
$$ 409223 406339 430287 480796 543509 575908 531730 479514 370838 471389 574835 640980
13838F40980j0026O315J606N3973N4852Q5628N5496P8886n4754n1295N5985R0694
$$ 640980 630954 637269 638875 692848 747700 833328 888824 967710 912956 861661 917646 1008340
13826A008340O0361P3968J07326O2213N3968J99318J79247K52671K03578J90889
$$ 1008340 1068701 1142669 1249995 1312208 1366176 1565494 1744741 1997412 2200990 2391879
13816B391879O5983q4469k9826n9067j30486j55802q8830l0198J58834Q0574P0288
$$ 2391879 2457862 2373393 2343567 2284500 2154014 1998212 1909382 1879184 2038018 2118592 2188880
13805B188880J34279J04933Q5670k7197K10460J82758J34828K25628L46499L61052
$$ 2188880 2323159 2428092 2513762 2486565 2697025 2879783 3014611 3240239 3586738 3947790
13795C947790L74552N21966O47300N63581P72544J066526J112229J321341J720616
$$ 3947790 4322342 4844308 5491608 6055189 6827733 7894259 9006488 10327829 12048445
13786A2048445J884883K061595K349396K660890L301320L829663L864962L457283
$$ 12048445 13933328 15994923 18344319 21005209 24306529 28136192 32001154 35458437
13778C5458437L614940M745851Q196355J4303241K4033010L7621629N2658131
$$ 35458437 39073377 43819228 52015583 66318824 90351834 127973463 180631594
13771A80631594O5945063P0427497O3455044M2208982J0856218k1741426n0285868
$$ 180631594 246576657 317004154 380459198 422668180 433524398 411782972 361497104
13764C61497104o5487811o8537909o0889466m7792568l4255054k2875129j5041936
$$ 361497104 296009293 227471384 166581918 118789350 84534296 61659167 46617231
13757D6617231r815518o557062m473258l187025k406731k073170j850480j745721
$$ 46617231 36801713 30244651 25771393 22584368 20177637 18104467 16253987 14508266
13749A4508266j619967j554116j429557j310479j084334p59840n58780m03661
$$ 14508266 12888299 11334183 9904626 8594147 7509813 6749973 6191193 5787532
13741E787532k7271K03530L22053M95974O05034M62758J13582j82448m75037o46102
$$ 5787532 5760261 5963791 6285844 6781818 7386852 7849610 7963192 7780744 7305707 6659605
13731F659605p07463r48617o81393n90140n18845m27375l03591k52684k26744
$$ 6659605 5952142 5003525 4322132 3731992 3213147 2785772 2482181 2229497 2002753
13722B002753k70899j43518n5572p1112l6417K4286j04460j34729q9327r3774
$$ 2002753 1731854 1588336 1532764 1461652 1425235 1449521 1345061 1210332 1121005 1027231
13712A027231l5052j27479J21925N4872l3361P1000p2248l0086J23135Q1820j06144
$$ 1027231 992179 864700 986625 1041497 1008136 1079136 1006888 976802 1099937 1181757 1075613
13701A075613p0178j09289j23144n6742j30517k9250l6924n3239m5840q4636j36702
$$ 1075613 1005435 896146 773002 716260 585743 556493 519569 466330 420490 335854 199152
13690A99152Q263K9303R7713K1367r138m3547O205j5015k9462P1867Q8319o7939
$$ 199152 207415 236718 334431 355798 346660 303113 309318 294303 264841 336708 425027 357088
13678C57088m5477n1231L9903M6018L2315N7293O0173m7436n8522n4901j8402
$$ 357088 311611 260380 300283 346301 378616 435909 496082 448646 390124 335223 316821
13667C16821o3074q3214r6394q6463k6444J19746J55849L9064j17252m1060j679
$$ 316821 253747 170533 74139 -12324 -38768 80978 236827 275891 158639 117579 115900
13656A15900o644m1735k7558L7341L059J8027q4235O7778J20712Q5744j1198L4059
$$ 115900 109256 67521 39963 77304 80363 98390 14155 81933 202645 288389 277191 311250
13644C11250O5383O9002N4459Q5114k1361o2059p4063q7683q6930m4827J6876
$$ 311250 376633 445635 500094 585208 563847 501788 427725 340042 253112 208285 225161
13633B25161m8255k662L4204p7581j06316l1672Q8927P9661K8948o1394j10974
$$ 225161 176906 174244 208448 130867 24551 -7121 81806 161467 190415 129021 18047
13622A8047L7770P649K0033J9295o5223L2452O1678J2665j14862K5952J7142r9781
$$ 18047 55817 63466 83499 102794 37571 70023 131701 144366 29504 55456 72598 -27183
13610b7183N238K6568O8652N6091o6956m9077j14953m3304K6857K2452Q2010J7475
$$ -27183 -21945 4623 73275 129366 62410 13333 -101620 -144924 -118067 -95615 -13605 3870
13598C870L8828l2015o2045n5421P5630N6086L7679m0565m2669l2442M6092j1895
$$ 3870 42698 10683 -51362 -106783 -31153 24933 62612 22047 -20622 -53064 -6972 -18867
13586a8867J6779q4217j3306M4456J01105J56876l370j65011j24880j3284j3729
$$ -18867 -2088 -86305 -99611 -55155 45950 202826 199456 34445 -90435 -103719 -117448
13575a17448M0829O6467J8845j86567l0090J60715K2890Q9802J01783r5827o1912
$$ -117448 -76619 -10152 8693 -177874 -207964 -47249 -24359 65443 167226 71399 9487
13564I487O6412r2320K8191N2601n4014o8072j55035l6042L0589L9394K4867J21129
$$ 9487 75899 -16421 11770 64371 10357 -57715 -212750 -248792 -218203 -178809 -153942 -32813
13552c2813n315o7244k5540n5935o0003J11295Q1752J3851M138K2211M2741J9596
$$ -32813 -38128 -105372 -130912 -186847 -246850 -135555 -53803 -39952 -35814 -13603 29138 48734
13540D8734P6239j0354j30635L5899P384r7439p7187Q0909O6311p962N383J1761
$$ 48734 124973 114619 -16016 19883 27267 -70172 -147359 -66450 -139 -8101 -2718 9043
13528I043M7275k8468L959r5105L8976Q1862K9755K9033k1566J4487O8738q1941
$$ 9043 56318 27850 31809 -63296 -24320 57542 87297 116330 94764 109251 177989 96048
13516I6048l6037R5889j9064L9967J9150K7952m2219r3510j33221j20036K1244
$$ 96048 60011 155900 136836 176803 195953 223905 181686 88176 -45045 -165081 -143837
13505a43837N3173N9359j8340J8893J1619N1407N9225r154l882m1703j24073r6161
$$ -143837 -90664 -31305 -49645 -30752 -19133 32274 91499 82345 78463 36760 -87313 -183474
13493a83474P6893O2018K0903j00023J30306J18069q7215m4449M3688N8691M9666
$$ -183474 -106581 -44563 -23660 -123683 6623 124692 37477 -6972 36716 95407 145073
13482A45073n877k4634j14473r9698K0106Q388r4185j7403Q633Q1455P4791O423
$$ 145073 139196 114562 89 -99609 -79503 -71115 -165300 -182703 -174070 -92615 -17824 -11401
13470a1401R1548l7225o3640N0233L1659m213k4926P0717m6237o8245j6561J17231
$$ -11401 80147 42922 -20718 29515 61174 56961 32035 102752 56515 -11730 -28291 88940
13458H8940K1395j2782l8090M2627P6785k1302j08648J02817l584p3496k6119
$$ 88940 110335 97553 59463 102090 178875 157573 48925 151742 148158 74662 48543
13447D8543j7432j30133j41471l388P5865L7004k549O044j6967l4862P1961R3582
$$ 48543 31111 -99022 -240493 -243881 -168016 -131012 -133561 -127517 -144484 -179346 -107385 -13803
13435a3803J26232j08440o5361L9725J1975l454m4535l1276p4863j6047P586J36004
$$ -13803 112429 3989 -61372 -21647 -9672 -13126 -57661 -88937 -163800 -179847 -172261 -36257
13423c6257M8602K9059N0573K0326l5421j18029O0387O0752j35547j25334l7113
$$ -36257 12345 41404 91977 112303 76882 -41147 19240 79992 -55555 -180889 -218002
13412b18002J02579M6972r6675p282J5951O7544P8264K2281j01776j0219J2862
$$ -218002 -115423 -68451 -165126 -172408 -156457 -88913 -10649 11632 -90144 -100363 -87501
13401h7501J23910l9655n7208J2002J3652K5154M6522O2225n129o6650m8982k7810
$$ -87501 36409 -3246 -60454 -48452 -34800 -9646 36876 99101 93972 27322 -21660 -49470
13389d9470R4065M0105l0299K3314l1703j21172j20806P702N2427M8869M506j02291
$$ -49470 44595 84700 54401 77715 46012 -75160 -195966 -188264 -135837 -86968 -82462 -184753
13377a84753R6735J24246N2523L1439r206q3942j32872j11858L654N2284Q8514
$$ -184753 -88018 36228 88751 120190 110984 27042 -105830 -217688 -214034 -161750 -73236
13366g3236P7532m5009M2695j7865r4068m9683m722J84682K2689j4892k7667o3514
$$ -73236 4296 -40713 1982 -15883 -109951 -159634 -164356 20326 43015 28123 456 -63058
13354f3058N5757o398n9672l0775J079J14880k4657l1790o0636n4109O7605J7378
$$ -63058 -7301 -13699 -73371 -104146 -103067 11813 -12844 -44634 -105270 -159379 -91774 -74396
13342g4396M8589M4208R2223p4709j02856J8401R9516O4972j09568o9077L8465
$$ -74396 -25807 18401 110624 35915 -66941 -48540 50976 115948 6380 -62697 -24232
13331b4232j0196n5232J9952N6445J23081K1292k8643p801L3963m5189q8129R9596
$$ -24232 -34428 -89660 -69708 -13263 109818 131110 102467 94666 128629 83440 -4689 94907
13319I4907N2298n6436l8798p4094j3893l5422K0679n0170Q854P4090O4183r2973
$$ 94907 147205 90769 51971 -22123 -36016 -71438 -50759 -100929 -92075 -17985 46198 -46775
13307d6775j28603L196n763P0527J6952Q0414Q1053O5538k4283p267m3883J10014
$$ -46775 -175378 -172182 -177945 -107418 -90466 -10052 71001 136539 112256 104989 61106 171120
13295A71120O2523k8744p1170M2163m842m2613N517R5715M2588J73262K54501
$$ 171120 233643 204899 133729 175892 171050 128437 133954 229669 272257 445519 700020
13284G00020K87610L00775L29739K49686J87400j3521r5135j76046k93642l69729
$$ 700020 987630 1288405 1618144 1867830 2055230 2041709 1946574 1770528 1476886 1107157
13274A107157l40281l06726j32919j21775n9552R2092O8018o5885r3727j17709
$$ 1107157 766876 460150 327231 205456 145904 237996 306014 240129 146402 28693
13264B8693q5145N6343L6283m4131j0205N3717J6809n1684l6393k5307J5562l481
$$ 28693 -56452 -109 36174 -7957 -18162 35555 52364 680 -35713 -61020 -45458 -48939
13252d8939M0311L2906k0161o803j5243J6174K6979j1709O6075j325k9684K4349
$$ -48939 -8628 24278 4117 -2686 -17929 -1755 25224 13515 79590 78265 48581 72930
13240G2930K7665k1194m6070L15N5313K2229j4283q5072L1720K0027Q4898P4749
$$ 72930 100595 79401 33331 33646 88959 111188 96905 11833 43553 63580 148478 223227
13228B23227m071m4703J3955L6345R1608J9198n4901K2345J03149R0657p4545
$$ 223227 219156 174453 188408 224753 316361 335559 280658 303003 406152 496809 422264
13217D22264J34117L5971k8490n8171j3928Q2108J33161O6461Q5191K79446K55763
$$ 422264 556381 592352 563862 505691 491763 573871 707032 773493 858684 1138130 1393893
13206A393893L01217L02510K19385J92206O5898K26680K59267J53505K9645j84780
$$ 1393893 1695110 1997620 2217005 2409211 2475109 2701789 2961056 3114561 3144206 2959426
13196B959426l1854j49545k66850l6871j56757k58649k98516j98343m6201O470
$$ 2959426 2927572 2778027 2511177 2474306 2317549 2058900 1760384 1562041 1515840 1522310
13186A522310j4077j986p6991j11546n6851j79554p6983k6517J5322o8993j27015
$$ 1522310 1508233 1506247 1429256 1317710 1260859 1081305 1004322 977805 993127 924134 797119
13175G97119q7778j71837k3054K0041n1276l5240K3915K8304j29567p3261p3171
$$ 797119 709341 537504 514450 534491 483215 447975 471890 500194 370627 297366 224195
13164B24195m619J15324N5393J3668r4460q4156R6615l7708r7687O9970N3197
$$ 224195 219576 334900 390293 403961 309501 225345 321960 284252 186565 256535 309732
13153C09732R2425m7012j39070O7528L8834q9812k5045K8024M5612K2492p0096
$$ 309732 402157 355145 216075 283603 322437 232625 207580 235604 281216 303708 233612
13142B33612j747L8519o089J30022R3460k847J2338J399j13853q9675J0408j4598
$$ 233612 231865 270384 264295 394317 487777 484930 497268 498667 384814 295139 305547 290949
13130B90949L5515l3348K3013L9863K6301q717j4538J0253r2798L4820n1237p8117
$$ 290949 326464 293116 316129 355992 382293 373576 359038 369291 276493 311313 260076 181959
13118A81959P3813m3925j26161o4155Q068O077Q6641R0538K3785o845M5924j5547
$$ 181959 255772 211847 85686 21531 29599 35676 122317 212855 236640 229795 275719 260172
13106B60172m8373Q2161K7616j8909K6213N3453m6687K2117j7823j32119q1813
$$ 260172 211799 293960 321576 302667 328880 382333 335646 357763 339940 207821 126008
13095A26008J13642q891j17436n0613o6095M9295N3263J7841m5213R511m5314
$$ 126008 239650 230759 113323 62710 -3385 45910 99173 117014 71801 81312 35998
13084C5998J7712J2141o071m0652J8155N0197J06209J0131m8794P7435o4768o1616
$$ 35998 53710 65851 59780 19128 37283 87480 193689 203820 155026 232461 167693 106077
13072A06077k8782L3731k996M949l2448K1345m2879j76152O2041J20476Q1626
$$ 106077 77295 111026 108030 112979 80531 101876 58997 -117155 -55114 65362 146988
13061A46988N2039k155l6920k2211J887k9069r6319j2363r2757k8265j5985J28097
$$ 146988 199027 196872 159952 137741 139628 110559 14240 1877 -90880 -119145 -135130 -7033
13049g033K16622n4250l3930o8077q3418j6734P832O5973P1732k884Q9410J35980
$$ -7033 209589 155339 121409 53332 -30086 -46820 -38988 26985 98717 95833 185243 321223
13037C21223p6072q6186N8646L1749m1987J6159Q0935m9798o1629J1518J43657
$$ 321223 245151 158965 217611 249360 207373 223532 304467 254669 193040 204558 348215
13026C48215J51564l5832n3045L4040O6318K8599J01371R4901Q4488J90608K17945
$$ 348215 499779 463947 410902 444942 511260 539859 641230 736131 820619 1011227 1229172
13015A229172M05725L75737M46435N77235N21365L51095J50133J45671K8497j49532
$$ 1229172 1634897 2010634 2457069 3034304 3555669 3906764 4056897 4202568 4231065 4081533
13005D081533j02751l07931l30494l02962k72248l83514m53520k94239k30376
$$ 4081533 3978782 3670851 3340357 3037395 2765147 2381633 1928113 1633874 1403498
12996A403498k25406k49667j18468j60725j24747j61128n2654j8549M7047l531
$$ 1403498 1178092 928425 809957 649232 524485 363357 310703 292154 339201 335670
12986C35670J3172J18665Q9227j16080m8526j5112m2002k0429Q2571J29475J3578
$$ 335670 348842 467507 556734 440654 392128 377016 335014 314585 397156 526631 540209
12975E40209p2064K3662J12247P2599J09930J8017k9933q4249p1728q239K7954
$$ 540209 468145 491807 604054 676653 786583 804600 774667 690418 618690 610451 638405
12964F38405N9856M1287p3023j522k1340j28605k1294k488K044p944j46347r5414
$$ 638405 698261 739548 666525 665003 643663 515058 493764 491276 493320 485376 339029 243615
12952B43615N9849M8079O2977k7272j4786n4411M7026j723M1329J6194k8627j7017
$$ 243615 303464 351543 414520 387248 372462 318051 365077 363354 404683 420877 392250 375233
12940C75233J589k72L3140O1316k9439l2296M643m0524n4374p7112L4014l6872
$$ 375233 376822 376550 409690 471006 441567 409271 413914 373390 319016 241904 275918 239046
12928B39046l4449N0443j8458j8379j9669q2271q447l0448j01366J2052M4212
$$ 239046 204597 255040 236582 218203 198534 116263 107816 77368 -23998 -11946 32266
12917C2266K61L742N5253R3797O5964R9342o112P3394o7532k829p2314K8831Q1853
$$ 32266 32527 36269 91522 185319 251283 350625 344513 417907 350375 347546 275232 304063 385916
12904C85916j19812l3625Q813L5925O5368j0772r5840L8472J33722R0268P324
$$ 385916 266104 232479 241292 277217 342585 331813 235973 274445 408167 498435 505759
12893E05759j73236p3929n75J6175N429n610O5429l334j68030m2256M3511J6524
$$ 505759 332523 258594 258019 274194 279623 274013 339442 336108 168078 125822 169333 185857
12881A85857M3881l7818O1262J11842L5481K2634K8770J65872J71387j16590K8701
$$ 185857 229738 191920 253182 365024 400505 423139 451909 617781 789168 672578 701279
12870G01279K0610M1987K30423P177p1942q4297l7990o6802j61297p9980j8934
$$ 701279 721889 763876 994299 1001476 929534 845237 807247 740445 579148 499168 480234
12859D80234J2959O4081j13070j41577j4431l8328Q59P021r1074j21273K1316
$$ 480234 493193 557274 444204 302627 288196 249868 250727 257748 166674 45401 66717
12848F6717l5860N3817O5150j2012K5789r0912m9569J79546K45920P3276J1631
$$ 66717 30857 84674 149824 137812 163601 72689 23120 202666 448586 521862 533493
12837E33493q0535j48883j70195P0458M9164P7330O9440l5228j64237J2264q8067
$$ 533493 452958 304075 133880 204338 253502 330832 400272 365044 200807 213071 125004
12826A25004l927K1817j796j9727j2194K8784N6786k1569n5304m7708R955L8490
$$ 125004 121077 142894 141098 121371 109177 137961 194747 173178 117874 70166 80121 118611
12814A18611L9679j57431j04593k0455K7485J596Q2505K6159j0530m4050N167
$$ 118611 158290 859 -103734 -124189 -96704 -95108 -12603 13556 3026 -41024 -35857
12803c5857p1334J18561P9682m104r217o1231l74O7284k4018O0698o49p8630m5760
$$ -35857 -107191 11370 91052 86948 77731 16500 16126 83410 59392 120090 119441 40811 -4949
12790d949J2014m496r8125j6305J60674P549j5631M7076k3134L4838M1611l4676
$$ -4949 7065 2569 -95556 -111861 48813 56362 40731 87807 64673 99511 141122 106446
12778A06446j58365J096K5131P9422Q803q3903j00562r8038R7385N7295Q9251
$$ 106446 -51919 -50823 -25692 53730 62533 -21370 -121932 -219970 -122585 -65290 23961
12767B3961N7828N4783K8258o5473j8615M3593L7955n2745k9510l4702Q7093l7664
$$ 23961 81789 136572 164830 99357 80742 124335 162290 109545 80035 45333 132426 94762
12755I4762j15526j58110n4979K0841N148K676R2878P4659r083n642K0327l6227
$$ 94762 -20764 -178874 -233853 -213012 -207864 -205188 -112310 -37651 -46734 -52376 -32049 -68276
12743f8276k6452J875N5815J9382j6900m5533j1589N6506m4044r4384Q3740k8078
$$ -68276 -94728 -92853 -37038 -17656 -34556 -80089 -91678 -35172 -79216 -173600 -89860 -117938
12731a17938L3942R6874J20134K3559J6221o5243n5725m1198n1315J39893Q7764
$$ -117938 -83996 12878 133012 156571 172792 107549 51824 10626 -40689 99204 186968
12720A86968j37742j35331r8427R8377J85278J9913j11766K581P7138Q261k4417
$$ 186968 49226 -86105 -184532 -86155 99123 119036 7270 9851 86989 95250 70833
12709G0833l9637N220L4598j0755r4343j9170k572j0555J8953R8119M1212k6383
$$ 70833 31196 36416 71014 60259 -34084 -53254 -55826 -66381 -47428 50691 91903 65520
12697F5520p1194r674R8925j6349r7772l5244o3590j7640P2323N3951L4192r3404
$$ 65520 -5674 -15348 83577 67228 -30544 -65788 -129378 -147018 -74695 -20744 13448 -79956
12685g9956R744N2608J6130m2619P2876O6124r0138l8447L3408O3787k7078j3843
$$ -79956 -70212 -17604 -1474 -44093 28783 94907 4769 -33678 -270 63517 36439 22596
12673B2596r6894J6386l2433L381n1062k0660J2184n7308q3073Q9675Q5173O0290
$$ 22596 -74298 -57912 -90345 -86964 -138026 -158686 -146502 -203810 -286883 -197208 -112035 -51745
12661e1745J11467L8866j35364p6243M8225p2625J4328R7949J02728O8265r8062
$$ -51745 59722 98588 -36776 -113019 -64794 -137419 -123091 -25142 77586 145851 47789
12650D7789j4570O8639n3773N0969K4739q7472m123m1485k7807P1525J04659j21637
$$ 47789 33219 101858 48085 99054 123793 36321 32198 -9287 -37094 34431 139090 17453
12638A7453j23506n2516j816j4389K2457J07080P979j1662J5233l603n6431k8168
$$ 17453 -106053 -158569 -160385 -174774 -152317 -45237 -37258 -48920 -33687 -37290 -93721 -121889
12626a21889j4405P2686L0118l4814j23929M2561Q8959k9450k5995M2015O7443
$$ -121889 -136294 -63608 -33490 -68304 -192233 -149672 -60713 -90163 -116158 -74143 -6700
12615f700N2704p1156n8733L2451L4065j5460K1464l9940n634J9534j7664J0302
$$ -6700 46004 -25152 -83885 -51434 -17369 -32829 -11365 -51305 -56939 -37405 -55069 -44767
12603d4767O0234k8440L875O6417m6042k5775j284o1348n258p4603o3622O1484
$$ -44767 15467 -12973 -9098 57319 11277 -14498 -15782 -77130 -82388 -156991 -220613 -159129
12591a59129O2624O0185M1156n5835j3975j1948l2097p2288O6562J19172j50760
$$ -159129 -96505 -36320 4836 -50999 -64974 -76922 -109019 -181307 -114745 4427 -146333
12580a46333m6778P0955J52516l7090k8142P974K6362Q5362K0291K3241j12827
$$ -146333 -193111 -122156 30360 -6730 -34872 -26898 -536 84826 105117 128358 15531
12569A5531o2225J726J4538L7785q5202q0840r1935O0588j736n173M8763J01712
$$ 15531 -46694 -44968 -30430 7355 -77847 -158687 -250622 -190034 -191770 -196943 -148180 -46468
12557d6468J09660j0308p7544j09508k015P2180n4063n3495J2871J08874O3734
$$ -46468 63192 52884 -24660 -134168 -136183 -64003 -118066 -171561 -158690 -49816 13918
12546A3918n3517l0328J01205J33006N1645j8566o5669p3011n5420R2247J9801
$$ 13918 -39599 -69927 31278 164284 215929 197363 131694 58683 3263 95510 115311
12535A15311J8447n2817j19822N6995P4933j08556k5878J9673j51573J2036j5207
$$ 115311 133758 80941 -38881 18114 93047 -15509 -41387 -21714 -173287 -161251 -176458
12524a76458R1384J48590N4560k9364L7835J8100l2128n9099j17855n3261L3530
$$ -176458 -85074 63516 118076 88712 126547 144647 112519 53420 -64435 -117696 -84166
12513h4166O8217L5368n6888m3165M9887L8088k4954m0359j1892r8863K6066P1843
$$ -84166 -15949 19419 -37469 -80634 -30747 7341 -17613 -57972 -69864 -168727 -142661 -70818
12501g0818L3492M0921j75077r0325N1370q57P1783J06784L0959P3049O9147p0116
$$ -70818 -37326 3595 -171482 -261807 -210437 -211294 -139511 -32727 -1768 71281 140428 70312
12489G0312j23717j7333O8835M1839J7188j2635n6426m9321l9102P52L6730K0700
$$ 70312 -53405 -70738 -1903 39936 57124 44489 -11937 -61258 -100360 -99608 -62878 -42178
12477d2178p8725K6726k6419J4478J20664L133m0909j362j0622L6278m5740J0825
$$ -42178 -120903 -94177 -120596 -106118 14546 17679 -23230 -24592 -35214 1064 -44676 -33851
12465c3851P0840K4827r8260p1058m689M7005J036O5737O9557r7224o4964l4224
$$ -33851 36989 61816 -36444 -107502 -112191 -65186 -64150 1587 71144 -26080 -91044 -125268
12453a25268q036r783m9914Q6226O9747l1116o05K6492j3160o1663j8573Q174
$$ -125268 -133304 -143087 -193001 -106775 -37028 -68144 -68749 -42257 -55417 -117080 -135653 -127479
12441a27479M2027J47737J28090o1310p0448n8774m4659j0166J43128l4323m3228
$$ -127479 -85452 62285 190375 129065 58617 -157 -44816 -54982 88146 53823 10595
12430A0595J26218m4169j18994j21916q0204O4849J29556P2888m7593j08514L5268
$$ 10595 136813 92644 -26350 -148266 -228470 -163621 -34065 38823 -8770 -117284 -82016
12419h2016J11862P2606J6812L8145j17804j89189N6412K2621j6836j0046r7885
$$ -82016 29846 102452 119264 157409 39605 -149584 -93172 -70551 -87387 -97433 -195318
12408a95318K0008M0878P0593M7606J07358k6760n0944O6778O7360L658J3000
$$ -195318 -175310 -134432 -63839 -16233 91125 64365 13421 80199 147559 151217 164217
12397A64217n2284J3424n3290j13074q5473l1882J0124M7651K7281K0195O9930
$$ 164217 111933 125357 72067 -41007 -126480 -158362 -148238 -100587 -73306 -53111 16819
12386A6819K1118n0435j740N0273o1065J753k4206m9556m6114p3580K0437J37700
$$ 16819 37937 -12498 -14238 36035 -25030 -23277 -47483 -97039 -143153 -216733 -196296 -58596
12374e8596K6661m8387P8346R5681p5510J3581L2483m8423l8186o6222n6029j9038
$$ -58596 -31935 -80322 -1976 93705 18195 31776 64259 15836 -22350 -88572 -144601 -163639
12362a63639r460Q5370m9846m9582J9779R9544M7260m2709m7641L5206P5360J15515
$$ -163639 -173099 -87729 -137575 -187157 -167378 -67834 -20574 -63283 -110924 -75718 -358 115157
12350A15157p149j4365L0561Q4036p3986K129o6595j38037k231Q7142J9168j3868
$$ 115157 108008 93643 124204 208240 134254 136383 69788 -68249 -70480 16662 35830 21962
12338B1962O495L4183j8886j21738J0007J60432O0314j49549o6265r5832m8857
$$ 21962 28457 62640 43754 -77984 -67977 92455 152769 3220 -63045 -158877 -207734
12327b07734Q8332k3145K5869O7600P872M1106O4742J5803m6242j79173R369L7123
$$ -207734 -119402 -142547 -116678 -49078 -41206 -100 64642 80445 34203 -144970 -135601 -98478
12315i8478j9047k5292L0153l439J7074Q9987M1739M5805n6496r2779P2990m4859
$$ -98478 -117525 -142817 -112664 -116103 -99029 -9042 32697 78502 22006 -70773 2217 -42642
12303d2642o2269k3373l0696j2765J28031M4899J6102N7194q0806p8386J8531
$$ -42642 -104911 -128284 -158980 -171745 -43714 1185 17287 74481 -6325 -84711 -66180
12292f6180N7017p2713m226O7717O1270m1361p9892j3446P45o3883J9786J76240
$$ -66180 -9163 -81876 -86102 -18385 42885 1524 -78368 -91814 -91069 -154952 -135166 41074
12280D1074N2350O0563q0537j49471K4415l6187k9701M1641K9336j59724l4981
$$ 41074 93424 153987 73450 -76021 -51606 -87793 -117494 -75853 -46517 -206241 -241222
12269b41222J13939J20168m4047J07749M9566p0146r3453l0493K6161J09666O897
$$ -241222 -127283 -7115 -51162 56587 106153 36007 -57446 -87939 -61778 47888 54785
12258E4785k0838L1931o843M808O9785p5084o6563R775m9484o0856l4916L839
$$ 54785 33947 65878 59035 63843 133628 58544 -8019 1756 -47728 -108584 -143500 -139661
12246a39661M8858j257M1261J01995q4874n7528K8180O8832j2790l9773l601p7816
$$ -139661 -90803 -92060 -50799 51196 -33678 -91206 -63026 5806 -6984 -46757 -50358 -128174
12234a28174R535J11408M8024l2744j2123j45237p5681O0452J54491m7959p0140
$$ -128174 -118639 -7231 40793 8049 -4074 -149311 -224992 -164540 -10049 -58008 -128148
12223a28148j4051j9534J8658Q865J59257O5819o2731m280J2548j23284m285J56644
$$ -128148 -142199 -161733 -143075 -134210 25047 90866 28135 23855 36403 -86881 -91166 65478
12211F5478j7571n5946j68132K6215M0920Q3835N0657m945N867l9867L7244K825
$$ 65478 47907 -8039 -176171 -149956 -109036 -25201 25456 20511 26378 -13489 23755 26580
12199B6580j20827k6052Q3931N9163n0073R7669n4570j5760P0157n1468j02044
$$ 26580 -94247 -120299 -36368 22795 -27278 70391 15821 61 70218 18750 -83294
12188h3294p4086n8560K9727k9164k7456J4716J11896J30243p1541K6213Q5637
$$ -83294 -157380 -215940 -186213 -215377 -242833 -228117 -116221 14022 -57519 -31306 54331
12177E4331k3803j10306Q0834J08576l001p2334Q2119N4548o8893j47096p1966
$$ 54331 30528 -79778 1056 109632 106631 34297 116416 170964 102071 -45025 -116991
12166a16991l4536m7365R2000L1602O4360Q926o5377j26639j6614k9909O0977
$$ -116991 -151527 -198892 -106892 -75290 -10930 -2004 -67381 -194020 -210634 -240543 -179566
12155a79566j8892j6002J40717R1593N6160l3196m3299R4393O359o8243p9077
$$ -179566 -198458 -214460 -73743 17850 74010 40814 -2485 91908 98267 30024 -49053
12144d9053p339k3530K5179k1131K0360n7392M4084N1396J1230o1841M642P0337
$$ -49053 -56392 -79922 -54743 -75874 -55514 -112906 -68822 -17426 -6196 -68037 -63395 6942
12132F942L1344j393R027l2117n6576m3314M1252M0233k7138r939j1853m0561
$$ 6942 38286 36893 45920 13803 -42773 -86087 -44835 -4602 -31740 -41679 -53532 -94093
12120i4093q178o2086p1374l9009O9473L8121J01478J18450j1668o9876j33589
$$ -94093 -102271 -164357 -235731 -274740 -205267 -167146 -65668 52782 41114 -28762 -162351
12109a62351l7098M5246M7348q783N9870N9264K7036l8911K0053R7088O9600r771
$$ -162351 -199449 -154203 -106855 -115638 -55768 3496 30532 -8379 11674 108762 178362 168591
12097A68591o1016R255j9284n5734k9333j7332P380J3417k2044P3343J2872q0935
$$ 168591 107575 116830 97546 41812 12479 -4853 2527 15944 -6100 67243 80115 -820
12085h20r4207N7021J25519N5174p1742J0389o896O5745n7215r0959O9444K3042
$$ -820 -95027 -38006 87513 142687 70945 81334 74438 140183 82968 -7991 61453 84495
12073H4495n7982k5353n3249q0074M5436N9227R340n8299N2965K0642Q1658L8586
$$ 84495 26513 1160 -52089 -132163 -86727 -27500 -18160 -76459 -23494 -2852 78806 117392
12061A17392j60p4354q3260M9596m2611J1386j9677j671m7875l4626o93J9676
$$ 117392 117232 42878 -40382 9214 -33397 -22011 -41688 -43359 -91234 -125860 -126553 -106877
12049a06877J4087o7838l0522L9413Q9774o0550j6460P9543p540k1258m2127j00172
$$ -106877 -92790 -160628 -191150 -151737 -61963 -122513 -138973 -59430 -66970 -88228 -130355 -230527
12037b30527l3647K9431O3851R7266Q5886l6505l5076n1680m1955J1592r4971
$$ -230527 -264174 -234743 -170892 -73626 12260 -24245 -59321 -111001 -152956 -141364 -236335
12026b36335M6291L0894M4688k9872J4041J36110k8742Q247P0379M635K6333J600
$$ -236335 -190044 -159150 -114462 -144334 -130293 5817 -22925 -14678 55701 60336 86669 88269
12014H8269m5222p063Q2610K9296j62188j30582m9441m8694L7223L215Q0696l8275
$$ 88269 43047 35984 118594 147890 -14298 -144880 -194321 -243015 -205792 -202577 -121881 -160156
12002a60156k0078m5000n14J48283O7035l3802l0196m0022o8185L0656M6887L3316
$$ -160156 -180234 -225234 -225748 -77465 -10430 -44232 -74428 -114450 -182635 -151979 -105092 -71776
11990g1776J44634n3583r8192m7613J01287N4770L0790j9142k0867k2044q5123
$$ -71776 72858 19275 -78917 -126530 -25243 29527 60317 41175 20308 -1736 -86859
11979h6859l7320N0943L7992k4357K0292n9896k2710L8116K3193p6771k045L4575
$$ -86859 -124179 -73236 -35244 -59601 -39309 -99205 -121915 -83799 -60606 -137377 -139422 -104847
11967a04847j5437M2113J2740n4000k6701J09449J2598o6941j5041N5939Q3794
$$ -104847 -120284 -78171 -65431 -119431 -146132 -36683 -24085 -91026 -106067 -50128 33666
11956C3666l1845r9196R4488J21799q2395n0240K0370n4792M338M0345L021l7486
$$ 33666 1821 -97375 -2887 118912 36517 -13723 6647 -48145 -43807 -3462 -441 -37927
11944c7927j0115n4268l7359M9938J3553K5388L2531N091M821K1990L6824n0123
$$ -37927 -48042 -102310 -139669 -89731 -76178 -50790 -18259 -13168 -8347 13643 50467 344
11932C44P5345n220m9162j1078L8179q2728o8979p657J55618J7966j45183M0466
$$ 344 75689 70469 21307 10229 48408 -34320 -103299 -110956 44662 62628 -82555 -42089
11920d2089J196J2915M1253L2852L9387j27918r6544J6929M5812K5094J0305J9631
$$ -42089 -40893 -27978 13275 46127 85514 -42404 -138948 -122019 -76207 -51113 -40808 -21177
11908b1177k8943m1463m462R8225J37186l5808j34947r0822l3835j1827J11680
$$ -21177 -50120 -91583 -96045 2180 139366 103558 -31389 -122211 -156046 -167873 -56193
11897e6193J04212J5936k6263l1725J09999j1953l5991o3775L5031n2063n4674
$$ -56193 48019 63955 37692 5967 115966 104013 68022 4247 39278 -12785 -67459
11886f7459P720O8667r1429J8897L4681J7960L8467M0720M1045p9782o2463J28159
$$ -67459 -59739 8928 -82501 -63604 -28923 -10963 27504 68224 109269 29487 -32976 95183
11874I5183R4896j11621j06010N8597p1362n5272J3636j8027q5217N933K13625
$$ 95183 190079 78458 -27552 31045 -40317 -95589 -81953 -99980 -185197 -179264 34361
11863C4361L0449j21140l8006J34171J16362O2096o178j25447m1332L2136L7602
$$ 34361 64810 -56330 -94336 39835 156197 218293 212115 86668 45336 77472 115074
11852A15074n0980p0679N1471R1568j9405J0850m0957j9625o1853k4792J17526
$$ 115074 64094 -6585 44886 136454 117049 127899 86942 67317 5464 -19328 98198
11841I8198m3279l2918m844n6458m9709R260J25652K0486r5737j9841R578J12184
$$ 98198 54919 22001 17157 -39301 -89010 -79750 45902 66388 -29349 -49190 -39612 72572
11829G2572p318p002L6802R2k0824k9769p0606l3058k9245J4244N4573l4746r405
$$ 72572 65254 58252 95054 95146 74322 44553 -26053 -59111 -88356 -74112 -19539 -54285 -63690
11816f3690k515L1532q2467J4175O6859Q5322K9285Q381j55378n3983J31221k5085
$$ -63690 -66205 -34673 -117140 -102965 -36106 49216 78501 86882 -68496 -122479 8742 -16343
11804a6343p923k5475K1931N4505k488l3372k4540O8353P6282j06204o4198l0413
$$ -16343 -24266 -49741 -27810 26695 24207 -9165 -33705 34648 110930 4726 -59472 -89885
11792h9885M2517Q6974K5017k6119m0263n8240l9699k9227J13233J19521K4128
$$ -89885 -47368 39606 64623 38504 -1759 -59999 -99698 -128925 -15692 103829 127957
11781A27957N418m4647R143j713q4299K5015l1888r6504K0299P4563q197l9319
$$ 127957 133375 88728 97871 96158 11859 36874 4986 -91518 -71219 3344 -4853 -44172
11769d4172K767O8981l7602J9802J0885L9753J15320J170l9030o9084j91310r5295
$$ -44172 -41405 27576 -10026 9776 20661 60414 175734 176904 137874 68790 -122520 -217815
11757b17815m7496N4987J23084K6875P7100l1678J2157O4083l3548j03718r924
$$ -217815 -265311 -210324 -87240 -60365 16735 -14943 -2786 61297 27749 -75969 -85893
11746h5893j2555l4811J03180Q4599k428k1423n4279m8886q2603N3803N4093l0868
$$ -85893 -98448 -133259 -30079 54520 52092 30669 -23610 -72496 -155099 -101296 -47203 -78071
11734g8071J6519k1118n4796J04564J21282n7430j21347k9320r1538J37168R8220
$$ -78071 -61552 -82670 -137466 -32902 88380 30950 -90397 -119717 -211255 -74087 24133
11723B4133n7735j22038J3330Q8440L9159K3272L2410q212l9048j30899j063O583
$$ 24133 -33602 -155640 -142310 -53870 -14711 8561 40971 32759 -6289 -137188 -138251 -131668
11711a31668K4951j9769m7408O3978M3331K8209R951p6335j39465P3264J01189
$$ -131668 -106717 -126486 -173894 -109916 -66585 -38376 -28425 -104760 -244225 -170961 -69772
11700f9772j1295m792R2549L8016J01938K4008m3555k0305l8025J3085Q3200m6294
$$ -69772 -81067 -85859 6690 44706 146644 170652 127097 106792 68767 81852 165052 118758
11688A18758j04187j6303N2013o554j30886p3395O5904m8572r647J8597P9645
$$ 118758 14571 -1732 50281 43727 -87159 -160554 -94650 -143222 -152869 -134272 -54627
11677e4627k8541J8668L3136J6996J9475N6463k0091k524k8175n7788J4042Q456
$$ -54627 -83168 -64500 -31364 -14368 5107 61570 41479 38955 10780 -47008 -32966 -24510
11665b4510J2027j5128k3575o1222j28402j8610K7642J1635n8945j4831J13373
$$ -24510 -12483 -27611 -51186 -112408 -240810 -259420 -231778 -220143 -279088 -293919 -180546
11654a80546J15302R5652L485j8976k7835j03770j7242L3352k664O1338M4540
$$ -180546 -65244 30408 33893 14917 -12918 -116688 -133930 -100578 -103242 -41904 2636
11643B636p2540n8729K4395l698L9969L6550J3123O6821K2131p9232j06542m2014
$$ 2636 -69904 -128633 -104238 -107936 -67967 -31417 -18294 48527 70658 -8574 -115116 -157130
11631a57130r1956N5499J04874M1806K3972P3551N7924j62581q4472l4517Q9928
$$ -157130 -249086 -193587 -88713 -46907 -22935 50616 108540 -54041 -138513 -173030 -83102
11620h3102Q5915k3694j25194j18781O7971O4143Q7929O1963o7711q5423J21382
$$ -83102 2813 -20881 -146075 -264856 -196885 -132742 -44813 17150 -50561 -135984 -14602
11609a4602J37408l7246q893j8853n5945L8741N5336j4854k0600J6758p2100P9357
$$ -14602 122806 85560 76667 57814 1869 40610 95946 81092 60492 77250 5150 84507
11597H4507o8487j21801N6032k3709O2886j217Q8136M0665n0205o0945J6492K6458
$$ 84507 16020 -105781 -49749 -73458 -10572 -11789 76347 117012 66807 5862 22354 48812
11585D8812r7797Q7993J29920o3019j08781J0019M4764m8512L933J556l5411l5824
$$ 48812 -48985 39008 168928 105909 -2872 7147 51911 3399 7332 8888 -26523 -62347
11573f2347o2065M6334R5997l427n8478l005j9396k5003M2812Q324K4811r7368
$$ -62347 -124412 -78078 17919 14492 -43986 -46991 -66387 -91390 -48578 -40254 -15443 -112811
11561a12811j2770N976J1574R3078l1109Q498j0157j11583J6475J5613N439m3570
$$ -112811 -125581 -119605 -108031 -14953 -46062 -37564 -47721 -159304 -142829 -127216 -121777 -165347
11549a65347k0280P9250l0465J7190J44210Q228J749J7369j21020m5584Q389J11890
$$ -165347 -185627 -106377 -136842 -119652 24558 32786 34535 51904 -69116 -114700 -106311 5579
11537E579N452o5991o1273o3798N593O9735L6145j03001K3368P4364M627j616
$$ 5579 11031 -54960 -116233 -180031 -174438 -104703 -68558 -171559 -148191 -73827 -69200 -70816
11525g0816m663l5464q539O1765P5647j0734m6310J8704J46781P2543j2260p895
$$ -70816 -75479 -110943 -119482 -57717 17930 7196 -39114 -20410 126371 198914 186654 178759
11513A78759n0250q1206l6171j5443O2583l0547O451R159J0084J3403n7591o8106
$$ 178759 128509 47303 11132 -4311 58272 27725 34176 43335 53419 66822 9231 -58875
11501e8875j2193N6638m226l5226l9261j1883N9339j393J6657J00585n6416r3020
$$ -58875 -71068 -14430 -18656 -53882 -93143 -105026 -45687 -47080 -30423 70162 13746 -79274
11489g9274K8858M8555j0904k7963K6300N5721N8327p5144m7144r010l6742J6318
$$ -79274 -50416 -1861 -12765 -40728 -14428 41293 99620 24476 -22668 -31678 -68420 -52102
11477e2102M5073J7433j02084l930l7215j05589O3090J23492J47258j11552j26344
$$ -52102 -7029 10404 -91680 -95610 -132825 -238414 -175324 -51832 95426 -16126 -142470
11466a42470M1739J01254N86R475M2737o2223k3683P6932l9068R765J3380l2598
$$ -142470 -100731 523 1109 10584 53321 -8902 -32585 44347 5279 15044 28424 -4174
11454d174k6268J9483L0073O3816p8420m5183J0648K0651j26611m1926K7774L3606
$$ -4174 -30442 -10959 19114 82930 4510 -40673 -30025 -9374 -135985 -177911 -150137 -116531
11442a16531p0499q2403J00803M8829n4477J1884Q641N0129j6952j1974O8187
$$ -116531 -187030 -269433 -168630 -119801 -174278 -162394 -153753 -103624 -120576 -132550 -64363
11431f4363n4307q5797J43805J13246Q9454M6678k468J5299p1605j4615m7392
$$ -64363 -118670 -204467 -60662 52584 142038 188716 186248 201547 129942 115327 67935
11420F7935r5656L0466J27297O6557O034l3303m2139j16081l9128M2258K818O138
$$ 67935 -27721 2745 130042 196599 202633 169330 127191 11110 -28018 14240 17058 23196
11408B3196J707r2334j10556l7550J15755O7251M25J3922o2485k0662R501Q9150
$$ 23196 24903 -67431 -177987 -215537 -99782 -32531 -32106 -18184 -80669 -101331 -91830 -2680
11396b680R7699j09658K8562J0029j585o0254j912P1270q9461P2165J13734o7885
$$ -2680 95019 -14639 13923 23952 22367 -37887 -39799 31471 -57990 14175 127909 60024
11384F0024r971L8320j27165j25015N3388r874n65l2866P1678J28269L3183k6269
$$ 60024 50053 88373 -38792 -163807 -110419 -120293 -120858 -153724 -82046 46223 79406 53137
11372E3137P8578m401n513j5415j25763j06911m6091J9538k0372M7545M6960o869
$$ 53137 131715 127314 121801 106386 -19377 -126288 -172379 -152841 -173213 -125668 -78708 -85577
11360h5577O5184j1787P6873j9714o4803j9643R6635M9078m3936j8978M1763K6190
$$ -85577 -20393 -32180 44693 24979 -39824 -59467 37168 86246 42310 23332 65095 91285
11348I1285k2893q6896j7581k484Q8307p839m5878q8171j10135J6448K1485N0635
$$ 91285 68392 -18504 -36085 -38569 49738 41899 -3979 -92150 -202285 -185837 -164352 -113717
11336a13717P5798K4922Q458o3250R1839q243o0347j00371L0236O0021J13599
$$ -113717 -37919 -12997 -4539 -67789 24050 15807 -44540 -144911 -114675 -54654 58945
11325E8945Q1679q1535j34772m3741J15867R8234l9198j34418o284M3828k072
$$ 58945 140624 59089 -75683 -119424 -3557 94677 55479 -78939 -85223 -41395 -43467
11314d3467p9365M3511J16953J9126k0777m2551J0138R2478k5430r5603r6977
$$ -43467 -122832 -79321 37632 56758 35981 -6570 3568 96046 70616 -24987 -121964
11303a21964j0770K9938j1602O5643R6791J5077n8196N9882N3374K852l5094J9963
$$ -121964 -132734 -102796 -114398 -48755 48036 63113 4917 64799 118173 121025 85931 105894
11291A05894j4494m0139k3771j38849q594M9553m9381N8003N9374J183M8686J41703
$$ 105894 91400 51261 27490 -111359 -119953 -70400 -119781 -61778 -2404 -1221 47465 189168
11279A89168P7779R283q9947j47428p2611M9064J68090J7280o4937n0806J9904
$$ 189168 266947 276230 186283 38855 -33756 15308 183398 200678 135741 84935 104839
11268A04839j11781j4479J6868p0160l0496l62J64951P8710n0345m7772J5089
$$ 104839 -6942 -21421 -4553 -74713 -105209 -105571 59380 138090 87745 39973 55062
11257E5062p2639n1769k3649J4539o8101m6758L1633J13449k815j14934j9133
$$ 55062 -17577 -69346 -92995 -78456 -146557 -193315 -161682 -48233 -51048 -165982 -185115
11246a85115R2327J22814N5976n1507p5800o6059j6236J20527M637k5845j52L6927
$$ -185115 -92788 30026 86002 34495 -41305 -107364 -123600 -3073 1564 -24281 -24433 12494
11234A2494J1674j20495j0428m6606J02659P6869M6102n379k4463j15265o3475
$$ 12494 24168 -96327 -106755 -153361 -50702 26167 72269 66890 42427 -72838 -136313
11223a36313M4791k0058M3078M2598K0396Q3440K8738j3311q237k0840K0928o0231
$$ -136313 -91522 -111580 -68502 -25904 -5508 77932 106670 93359 85122 64282 85210 24979
11211B4979M5460J04634k669k3143N2178m741j2290q1674j1097j9059r6425o6226
$$ 24979 70439 175073 172404 149261 201439 196698 184408 102734 91637 72578 -23847 -90073
11199i0073k5003J32559P1481r1903m189J3996m2908J4605O0651J0608L671j7645
$$ -90073 -115076 17483 88964 -2939 -7128 6868 -36040 -21435 39216 49824 53495 35850
11187C5850k9414L4648Q4224r1289j18543j3021K6581j10754j2571J30783J30369
$$ 35850 6436 41084 125308 34019 -84524 -97545 -70964 -181718 -194289 -63506 66863
11176F6863n9491r8955q30M883N8483l028k931P7175K8603J4184k6206N6987K2236
$$ 66863 7372 -91583 -92413 -87530 -29047 -32075 -35006 42169 70772 84956 58750 115737 137973
11163A37973r932k1420o5326P6927J3569n8068q6714m5697k3223J0207o672Q575
$$ 137973 128041 106621 41295 118222 131791 73723 -12991 -58688 -81911 -71704 -78376 -69801
11151f9801m859k8970j4749N3660M6444l7774Q711J19720m6029m8711j03293n223
$$ -69801 -74660 -103630 -118379 -64719 -18275 -56049 -47338 72382 26353 -22358 -125651 -130874
11139a30874J07712P7850K2754q9563j5424n4584L713J1729L7098j259r8746R7523
$$ -130874 -23162 54688 77442 -12121 -27545 -82129 -78416 -66687 -29589 -30848 -129594 -32071
11127c2071J5557r7843j36548R4837J32640m072m2323N0270O0178o1189j6343
$$ -32071 -16514 -114357 -250905 -156068 -23428 -27500 -69823 -19553 40625 -20564 -36907
11116c6907p6O8531P7665n2161q3895N371L1381n9921q693K2950M6550m369L5076
$$ -36907 -36983 31548 109213 57052 -26843 -21472 9909 -50012 -58705 -35755 10795 6426 41502
11103D1502L7886k0369k2715j20374p2679L7730J5734k163n8740j6717O063o641
$$ 41502 79388 59019 36304 -84070 -156749 -119019 -103285 -105448 -164188 -180905 -174842 -181483
11091a81483N1880q009K2976O6089L3061K586n06J9801k8371N9555O4366n5627
$$ -181483 -129603 -137612 -114636 -48547 -15486 -12900 -13406 6395 -21976 37579 101945 46318
11079D6318l2483m427l5269K7332R4766L0141K8817p876J5808J1461K4483j06368
$$ 46318 13835 9408 -25861 1471 96237 126378 155195 147319 163127 174588 199071 92703
11067I2703j41835j653O3396p8002L4525J667P097k1010m398l5529l9339n9305
$$ 92703 -49132 -50785 12611 -65391 -30866 -29199 -22102 -43112 -47510 -83039 -122378 -181683
11055a81683R5621J51266N8747j7618l5161n0126j19861l8284O2785J08021N7373
$$ -181683 -86062 65204 123951 106333 71172 21046 -98815 -137099 -74314 33707 91080
11044I1080r6144r3620L299O6684k7410K6889J18733k0406P87l8206L5061o5248
$$ 91080 -5064 -98684 -95385 -28701 -56111 -29222 89511 69105 69892 31686 66747 1499
11032A499k8721K364L0732J0934q587m7179K5884l0968n2030o4191k176q9212
$$ 1499 -27222 -24858 5874 16808 8221 -38958 -13074 -44042 -96072 -160263 -162439 -251651
11020b51651K9372R4661N0678q9353n9040P6617M5832N1712K6342N9215q7651
$$ -251651 -222279 -127618 -76940 -166293 -225333 -148716 -102884 -51172 -24830 34385 -53266
11009e3266j6058J3464J2985k15K9396o9761l8197N3162L282K1228P9959J18711
$$ -53266 -69324 -55860 -42875 -43090 -13694 -83455 -121652 -68490 -65208 -43980 35979 154690
10997A54690J4687j28854j1306j0196j8721k5028J6505j6922l4493k0136o498
$$ 154690 169377 40523 29217 19021 300 -24728 -8223 -25145 -59638 -79774 -86272
10986h6272J7312o0260r962J43691K0894q586O2903k6912j13402K3594Q143p7110
$$ -86272 -68960 -129220 -139182 4509 25403 16817 79720 52808 -60594 -37000 -28857 -105967
10974a05967M7194P7749r6040N945O7813L2824j9455q9949M518R5986Q6699K8695
$$ -105967 -58773 18976 -77064 -71119 -3306 29518 10063 -79886 -75368 20618 107317 136012
10962A36012l9655o4026l7467R7793R9403m1183k7379o7365p2892o753P4599j14496
$$ 136012 96357 32331 -5136 92657 192060 150877 123498 56133 -16759 -23512 51087 -63409
10950f3409J8909k3749O0832O1610M6743J881k6279K5207J5262N2299l6719j52585
$$ -63409 -44500 -68249 -7417 54193 100936 102817 76538 101745 117007 169306 132587 -19998
10938a9998j4114K1582j0185K4709J13507Q1931q3927p5295q530p575o1861m073
$$ -19998 -34112 -12530 -22715 1994 115501 197432 113505 38210 29680 22105 -39756 -43829
10926d3829J69547J3862p7959L0058k0841p8082J721M8058M1719j1023J02563
$$ -43829 125718 139580 61621 91679 70838 -7244 -5523 42535 84254 73231 175794
10915A75794O5187p2253o432l2652p3555k9327L6707q8668r7017k7990j0687M3550
$$ 175794 240981 168728 162296 129644 56089 26762 63469 -25199 -122216 -150206 -160893 -117343
10903a17343J14532M3415q9661k10337K8731J40174Q8530L2229m0968k8520o187
$$ -117343 -2811 40604 -49057 -259394 -230663 -90489 -1959 30270 -10698 -39218 -45405
10892d5405L3777j0366N3426K934R3818n9980p647k0563k310J6900M8298j4042
$$ -45405 -11628 -21994 31432 34366 128184 68204 60557 39994 37684 54584 102882 88840
10880H8840M0741r795p1530R382m9137j3931O5500j0832p9757p208J21485p5663
$$ 88840 129581 119786 48256 57638 8501 -5430 60070 49238 -30519 -37727 83758 8095
10868H095O6306J36490J4441r8385k9473o5233J0103J1119P4151K0287q3609j22246
$$ 8095 74401 210891 225332 126947 97474 32241 42344 53463 127614 147901 64292 -57954
10856e7954L3345k9542j23712j4127P7801J16022J4805q7057k4241L8189L9096
$$ -57954 -24609 -54151 -177863 -191990 -114189 1833 16638 -70419 -94660 -56471 -17375
10845a7375M2742M9638l8838J1417j3984R6903J3602q9091n0315l586M8178j1452
$$ -17375 25367 75005 36167 47584 33600 130503 144105 55014 4699 1113 49291 37839
10833C7839J8005M4743m9578j10075m1845j1204k7090K7510Q4529M959J9935N5034
$$ 37839 55844 100587 51009 -59066 -100911 -112115 -139205 -111695 -27166 -22207 -2272 52762
10821E2762K4694R6911O8730n9028o4826q6887J1095J05726R614o8500j3604m3120
$$ 52762 77456 174367 243097 184069 119243 32356 43451 149177 158791 90291 76687 33567
10809C3567n1686p2303r3340l337J89811P8491j2955Q4970p96n2982m1390m9900
$$ 33567 -18119 -90422 -183762 -187099 2712 81203 68248 153218 152422 99440 58050 8150
10797H150p6945n595K9304o052J1293N3072K4577Q7469O9472j4022j0780k3920
$$ 8150 -68795 -74390 -45086 -51138 -39845 13227 37804 125273 194745 180723 169943 146023
10785A46023l9445o2807n5616J635l800K6786p280J13890J02770q35j6349j06687
$$ 146023 106578 43771 -11845 -10210 -14010 12776 5496 119386 222156 221321 204972 98285
10773I8285p3352r0001m2919Q0624J09088L9550j2255M7873n0096j0995N8018
$$ 98285 24933 -65068 -107987 -27363 81725 121275 109020 156893 106797 95802 153820
10762A53820r6514k4411n5895m3493N17J3681Q7025P2583l4622J1639p3317k1588
$$ 153820 57306 32895 -23000 -66493 -65976 -52295 34730 107313 72691 84330 11013 -10575
10750a0575R8581P8661k9352q716r3192r1614L2536J85855J59523j4261j78822
$$ -10575 88006 166667 137315 128599 35407 -56207 -23671 162184 321707 307446 128624
10739A28624m9369L2696k3334j995p0282m1224l1350k7991N1247J17886J04476
$$ 128624 79255 111951 88617 86622 16340 -24884 -56234 -84225 -32978 84908 189384
10728A89384M751r3513j8829l2910N1091K2170l2576N9367o3874O5584R3865o0293
$$ 189384 194135 100622 81793 48883 99974 122144 89568 148935 85061 150645 244510 184217
10716A84217p5657j8966J6486o8820n8045J7282J04919l0197j29293l1727N2513
$$ 184217 108560 89594 106080 37260 -20785 -3503 101416 71219 -58074 -89801 -37288
10705c7288J16018N1168r5643m9100k2446J5051N3704L4887k4906j36986l1421
$$ -37288 78730 129898 34255 -14845 -37291 -22240 31464 66351 41445 -95541 -126962
10694a26962J07741L209P3566J24140J8163n2493l8658J3217O9379o2202p1811
$$ -126962 -19221 -16012 57554 181694 199857 147364 108706 121923 191302 129100 57289
10683E7289l9301M2531L5834o7965j9389M2882N4701p2288n165N8626J8692j02989
$$ 57289 17988 60519 96353 28388 8999 51881 106582 34294 29129 87755 106447 3458
10671C458j26668m8047M9249Q8550P6450Q9910J0054L939p3728r7740j2702Q3300
$$ 3458 -123210 -171257 -122008 -33458 42992 132902 142956 146895 73167 -24573 -37275 46025
10659D6025L4128r0164q074J27410l8268l3876l2199K1228m9402Q6820R1383q4252
$$ 46025 80153 -10011 -18085 109325 71057 37181 4982 26210 -23192 63628 155011 70759
10647G0759j18006L2548M7050J2757k116l5334n3097m9776J7306J8317P8367P0952
$$ 70759 -47247 -14699 32351 45108 42992 7658 -45439 -95215 -77909 -59592 18775 89727
10635H9727j1673n659O2875n7294L8658Q6078P4638q2286j8000k4125m5176m4243
$$ 89727 78054 72395 135270 77976 116634 202712 277350 195064 177064 152939 107763 63520
10623F3520L0409J17049L8835l8809k1083k8503l9822k0261K209P0614j6534M632
$$ 63520 93929 210978 249813 211004 189921 161418 121596 101335 103544 174158 157624 162256
10611A62256M0438j8455k672j03215k0291n7063L8869M5605k8553O4985L8213
$$ 162256 202694 184239 181567 78352 58061 998 39867 85472 56919 121904 160117
10600A60117l3068j11899j6646J46378r126m3921J3142K1687p4058j2668k2180
$$ 160117 127049 15150 -1496 144882 135756 91835 104977 126664 52606 39938 17758
10589A7758J17554J27251N1240L2675N011J6381R1119N5076r8671o086O9932l0950
$$ 17758 135312 262563 313803 346478 351489 367870 458989 514065 415394 409308 479240 448290
10577D48290n2036J61553j8828j12045j766K3567Q7145K839N8803l1223L0899
$$ 448290 396254 557807 538979 426934 425168 448735 535880 538719 597522 566299 597198
10566E97198R6634L740r5910r2177K1638J44376K00675K4503K5924O1284P0015
$$ 597198 693832 697572 601662 509485 531123 675499 876174 900677 926601 987885 1057900
10555A057900J06993K50211K73207K71861K36100N22416N73498Q74360J176324
$$ 1057900 1164893 1415104 1688311 1960172 2196272 2718688 3292186 4166546 5342870
10546E342870J384963J552125J521767J494940J195944J008736N99533L07543
$$ 5342870 6727833 8279958 9801725 11296665 12492609 13501345 14100878 14408421
10538A4408421M10577M15494L46323J05181j24098m52860n76566n70538j037685
$$ 14408421 14818998 15234492 15580815 15685996 15561898 15109038 14532472 13961934 12924249
10529A2924249j633275j846033j760341j666912j384359r69724p17746n50054
$$ 12924249 11290974 9444941 7684600 6017688 4633329 3663605 2945859 2395805
10521B395805m70742k20166k24282k20760k75312j70363j14568L4084j12872o2715
$$ 2395805 1925063 1704897 1480615 1259855 984543 814180 699612 733696 620824 558109
10511E58109J5593k5218q7700k9963m5852k0884p0592m6303M3056l7138j5284
$$ 558109 573702 548484 460784 430821 384969 364085 293493 247190 290246 253108 237824
10500B37824j3455n8402j07534R770J320M8629K7141m0478m2636L9611R6350p9747
$$ 237824 224369 165967 58433 68203 69523 118152 145293 104815 62179 101790 198140 118393
10488A18393j05648p8477j0237J20350L6541L1305L2904K1997R6538k4493l9287
$$ 118393 12745 -65732 -75969 44381 80922 112227 145131 167128 263666 239173 199886
10477A99886n6586M2619J1415L5000j8919J2782l2126j36638o8090r3644k5966
$$ 199886 143300 185919 197334 232334 213415 226197 194071 57433 -10657 -104301 -130267
10466a30267N2194J67625J09628j07250l742P5801l3918l0471P1185M1488k9693
$$ -130267 -78073 89552 199180 91930 88188 163989 130071 99600 170785 212273 182580
10455A82580j36569p8307J1556J56189Q1190L8465k203o2380j6535j0868r5714
$$ 182580 46011 -32296 -20740 135449 216639 255104 252901 190521 173986 163118 67404
10444F7404j0892K2582l6562R245J56931Q4753r4900j29812j8321N0435K2866
$$ 67404 56512 79094 42532 51777 208708 293461 198561 68749 50428 100863 123729
10433A23729J411K4021O2610m7332j02010R1725m970J0198R1615m2236j58788
$$ 123729 125140 149161 211771 164439 62429 154154 149184 159382 250997 208761 49973
10422D9973L7779Q4545r940l5189o3665m7080M9025L9687j2737K8140M410j24114
$$ 49973 87752 172297 162357 127168 63503 16423 65448 105135 92398 120538 124948 834
10410H34q6861Q6058J70119J55914n0041r6945m6821k5586R6893n9336l4011K7450
$$ 834 -86027 31 170150 326064 276023 179078 132257 106671 203564 144228 110217 137667
10398A37667M5026k4803p7181n5478n4114K1313Q6176J12092p564p149P4646J60648
$$ 137667 182693 157890 80709 25231 -28883 -7570 78606 190698 183134 175985 250631 411279
10386D11279m6126j34279m6761J3137O4065j135m6297J8559J55017J13321P7141
$$ 411279 365153 230874 184113 197250 261315 260180 213883 232442 387459 500780 577921
10375E77921j6225q582J5119l2633O2309J59603P5571M5038Q3317n3391p3692
$$ 577921 561696 553114 568233 535600 597909 757512 833083 878121 961438 908047 834355
10364H34355J46632J44138l4183p7522n1822o1418j55269o2234k4014j5605N7777
$$ 834355 980987 1125125 1090942 1013420 961598 900180 744911 682677 658663 643058 700835
10353G00835L7703N4624n1285j5079P9150O4918J34159q0313j92417r5683o1852
$$ 700835 738538 793162 741877 726798 805948 870866 1005025 924712 732295 636612 574760
10342E74760N4323q0096q2662n0930m6027o1349j41006l7584K0669J03234K0332
$$ 574760 629083 548987 466325 415395 369368 308019 167013 129429 150098 253332 273664
10331B73664K7462o206j13117l2294P905l6990L9169K098M9566J1529p119N8443
$$ 273664 301126 294920 181803 149509 157414 120424 159593 161691 211257 222786 215667 274110
10319B74110r5568p709k4453O5536l4530j26346l106O7895J29488m0110r372L0841
$$ 274110 178542 170833 146380 211916 177386 51040 47934 115829 245317 205207 195835 226676
10307B26676M7474m2839r8489M1317k3121o1233L9398J04046R5374K9023k5371
$$ 226676 274150 231311 132822 174139 151018 89785 129183 233229 328603 357626 332255
10296C32255J41839K2906J28561K66588J46647K66109L13333K59911J77608R0522
$$ 332255 474094 497000 625561 892149 1038796 1304905 1618238 1878149 2055757 2146279
10286B146279K072j16953l36059l87272k55339k17955j34393J7848m8260n1094
$$ 2146279 2148351 2031398 1695339 1308067 1052728 834773 700380 718228 669968 618874
10276F18874j01181j21101N8362L1068J05525m3572j20827j02060j8210J1219
$$ 618874 517693 396592 454954 486022 591547 547975 427148 325088 306878 318097
10266C18097l6949j35099l9445R6368P5638j8439n4938j51614J07316L2533k6259
$$ 318097 281148 146049 106604 202972 278610 260171 205233 53619 160935 193468 167209
10255A67209k9731l4263m348j10178o652L5630J48026M8692j059M894N3859r9871
$$ 167209 137478 103215 98867 -11311 -17963 17667 165693 214385 213326 218220 272079 172208
10243A72208J5020Q4667n0735K8353J00743k9870O4290P3703o3598o0669j33711
$$ 172208 187228 271895 221160 249513 350256 320386 384676 458379 394781 334112 200401
10232B00401j662R237q1787p7314Q7971L4245l415J9407l2439m5101Q0967K4691
$$ 200401 198739 207976 126189 48875 136846 171091 167676 187083 154644 109543 190510 215201
10220B15201L9032q019J0062J9135J12004R717r7814N5848l8677j11977n4154
$$ 215201 254233 246214 256276 275411 387415 397132 299318 355166 316489 204512 150358
10209A50358K7567P815p1421p4940J0176P0278J01163N2339M2416m3364l8092
$$ 150358 177925 185740 114319 39379 49555 119833 220996 273335 315751 272387 234295
10198B34295m615n8158N696O9366m7875n8374J73692J72013J13432J65928J92066
$$ 234295 229680 171522 177218 246584 198709 140335 314027 486040 599472 765400 957466
10187I57466M2173O2222J10212j27090j15675j46051o2635j48779j90009n0250
$$ 957466 999639 1061861 1172073 1044983 929308 783257 720622 571843 381834 331584
10177C31584K2604j3093o1042O0103J07463J8765n6992m8356l0543l038o2090
$$ 331584 354188 341095 280053 340156 447619 466384 409392 361036 330493 327455 265365
10166B65365k5925K4102l8416k0738M2327k1903l1684j0044J62688M3886o8608
$$ 265365 239440 263542 225126 204388 246715 224812 193128 183084 345772 389658 321050
10155C21050L3190K0918j1775O7134j3149j11467j30924l8690j6238O2200P1668
$$ 321050 354240 375158 363383 430517 417368 305901 174977 136287 120049 182249 253917
10144B53917J5487p174l7343j4677N0736P4622Q506l8090Q1554j8109r9835k6854
$$ 253917 269404 262230 224887 210210 260946 335568 344074 305984 387538 369429 269594 242740
10132B42740K8544O4453K950Q248r8279r1394J6842m0503J0585O3587Q0211l4169
$$ 242740 271284 335737 338687 346935 248656 157262 174104 133601 144186 207773 287984 253815
10120B53815j4820p9819m7792L6880P8378n4994k8040J2412J36594J9384O3231
$$ 253815 238995 159176 111384 148264 226642 171648 143608 156020 292614 311998 375229
10109C75229P1325l0827q9632j2497M9074N7469l6082m7311r2046J669r806J4881
$$ 375229 446554 415727 326095 313598 362672 420141 384059 336748 244702 246371 236565 251446
10097B51446P7879K4883N8836j5266n3041n327j33512o1285N7230P8099J5756
$$ 251446 329325 354208 413044 397778 344737 339410 205898 144613 201843 279942 295698
10086B95698k3234R928P8511L5434J818j14327l5513N7063O5534J6850Q1753k068
$$ 295698 272464 282392 360903 396337 398155 283828 248315 305378 370912 387762 469515 467447
10074D67447k5232J4147K53k7846M3918p023m7352n8429Q2720J6355l265k9595
$$ 467447 442215 456362 456615 428769 472687 465664 418312 359883 442603 458958 455693 426098
10062D26098M8229j1303o3902J20695J94855K79292L26102O0388j89373l28759
$$ 426098 474327 463024 399122 519817 714672 993964 1320066 1380454 1191081 862322
10052H62322j52932j64204j3811j14905p3590n8935q590M3490k9708J14239Q4288
$$ 862322 709390 545186 531375 416470 342880 283945 275355 318845 289137 403376 487664
10041D87664o1477l7216K7905Q6450L5996L5988n2744j29398j278j7216m7273
$$ 487664 426187 388971 416876 503326 539322 575310 522566 393168 391890 374674 327401
10030C27401L460L6923J8811n9669K9756O5611o479r1599m6032M580R4047o916
$$ 327401 330861 367784 386595 326926 356682 422293 415814 324215 278183 282763 376810 369894
10018C69894q681O2260K1411k1459o3055j9670P246J06544O3099L8357r6616j7811
$$ 369894 361213 423473 444884 423425 360370 340700 347946 454490 517589 555946 459330 441519
10006D41519o977o371k9966n1R38L5865Q839P3267l6960R8364N3580j8852l4208
$$ 441519 434542 428171 398205 398154 399092 434957 443796 517063 480103 578467 632047 613195 578987
9993E78987r0195j3213O8962j14090k2502k4816J8282o0326M0730L7744K4822
$$ 578987 488792 475579 544541 430451 407949 383133 401415 341089 381819 419563 444385
9982D44385M9978N1146o3173m9203M8416R0927L8600j3611m234j5184J04711r239
$$ 444385 494363 545509 482336 433133 481549 572476 611076 597465 593231 578047 682758 673519
9970F73519k3820n830J0586M8237p332j36205J1394K9992o3335m0777P954L4171
$$ 673519 649699 643869 654455 702692 695360 559155 570549 600541 537206 496429 504383 538554
9958E38554N8534J5226k1928L07P6326n4494p4660l1215N9193Q4426M3056J07831
$$ 538554 597088 612314 590386 590693 667019 612525 537865 506650 565843 650269 693325 801156
9946H01156K3176r7390p9698k1096l0359k7604J0857J3396L0315l9108J734j802
$$ 801156 824332 726942 647244 626148 595789 568185 579042 592438 622753 583645 585379 583577
9934E83577M3182J39925Q0519j19805j59213o4631L2312N7682k596j6783l1867
$$ 583577 626759 766684 847203 727398 568185 503554 535866 593548 590952 574169 542302
9923E42302K0861O7551l1043P4771P4652J3286J5590l7267k2773r877M0263j4915
$$ 542302 563163 630714 599671 674442 749094 762380 777970 740703 717930 708053 748316 733401
9911G33401j2651M0552q883N7780q8690J2185Q3270L2522j8229k8079o6841j94402
$$ 733401 720750 761302 752419 810199 721509 733694 816964 849486 831257 803178 736337 541935
9899E41935N329O5691J25804J7126l2519m9843K95O9948N0931O6030l1919l4416
$$ 541935 547264 612955 738759 755885 723366 673523 673818 743766 794697 860727 828808 794392
9887G94392j22239j18898j6791O003o967Q8106J50245L7541k8879j0742J5601
$$ 794392 672153 553255 536464 542467 535500 623606 773851 811392 782513 771771 787372
9876G87372o2324j6178R7828J95103P2627j00668n8555r7756k1680k447N471o316
$$ 787372 725048 708870 806698 1001801 1074428 973760 915205 817449 795769 793322 798793 792477
9864G92477q45M2678p22j3759m60N7222Q9136R1808l0701j34934j42990j27190
$$ 792477 791632 834310 833588 819829 819369 876591 965727 1057535 1026834 891900 748910 621720
9852F21720n9032q2243P2009Q6263m4974O9401N3186m9158J5851P9690N1222R288
$$ 621720 562688 480445 552454 638717 593743 663144 716330 667172 683023 762713 813935 823223
9840H23223r6736j4620J1989m31m2745J5634P6223J7028M5850k3684j20993J2147
$$ 823223 726487 711867 723856 723425 680680 696314 772537 789565 835415 811731 690738 702885
9828G02885O3191j8595j1894k661N996j5419O0809j7796k3251P9845M8925k9516
$$ 702885 766076 747481 735587 732926 738922 723503 784312 766516 743265 823110 872035 842519
9816H42519l1481k2815K8262R9448q0990q9130q4458M2815J08983L8980j7199
$$ 842519 811038 788223 816485 915933 834943 745813 661355 704170 813153 852133 834934
9805H34934l101j9175l4637l4396O643M8520P5753n1932j39545N8218R3432k5438
$$ 834934 831833 812658 778021 743625 750268 798788 874541 822609 683064 741282 834714 809276
9793H09276J2026O3871P7192K1101J5588l7453n5591M5640J310l6613M0986r672
$$ 809276 821302 885173 962365 983466 999054 961601 906010 951650 952960 916347 957333 947661
9781I47661L0331k3680p5318j6351o0514r7791p2676j4693J57409J9705j32904
$$ 947661 977992 954312 878994 862643 802129 704338 631662 616969 774378 794083 661179
9770F61179L8290P8500n021j17509j8014Q5992J8567k0728l908O7256l0371l8335
$$ 661179 699469 777969 772948 655439 637425 723417 741984 721256 717348 784604 754233 715898
9758G15898o3302M0663P277P8621m0756m8326N5042Q591n3116j4001J7589N0205
$$ 715898 652596 693259 700536 779157 738401 690075 745117 753708 700592 686591 704180 754385
9746G54385P3181L7136N0370q7087p055n3631j34111r9807N2186J21182P0573
$$ 754385 827566 864702 915072 827985 820930 767299 633188 533381 585567 706749 777322
9735G77322k5863r273M1929k6321p9541l3070m4063p3838J39710P3470K0110q559
$$ 777322 751459 742186 784115 757794 678253 645183 601120 527282 666992 740462 760572 752013
9723G52013j324j7848M1217k7490k0808L987J2053O6230p621m9981q5279P2106
$$ 752013 750689 732841 774058 746568 725760 729747 741800 808030 800409 750428 665149 737255
9711G37255M1218p675p3367k9216m942q662J50896M9916p9184p0045o1668j10408
$$ 737255 778473 770798 697431 668215 663273 654611 805507 855423 776239 706194 644526 534118
9699E34118N2709L7478O6005M2115k8534n2309l6612L784j5120k2025p3802K8076
$$ 534118 586827 624305 690310 732425 703891 651582 614970 618754 603634 581609 507807 535883
9687E35883J09188q57k7490L8688N808l2363m3005j27197Q434J7871R5569O8576
$$ 535883 645071 644214 616724 655412 661220 628857 585852 458655 467089 484960 580529 649105
9675F49105n7246l2124J41379J25086r5110j22130l1521Q9568r1799n0706K0705
$$ 649105 591859 559735 701114 826200 731090 608960 577439 667007 575208 524502 545207
9664E45207k9663r8649j31813P5194J79027P0812J14489k3805J2594n7415o8579
$$ 545207 515544 416895 285082 360276 539303 610115 724604 700799 713393 655978 587399
9653E87399K1058J1970m2239j25569p2941Q7847J54963L9003K1250q8477n5176
$$ 587399 608457 620427 578188 452619 379678 467525 622488 661491 682741 594264 539088
9642E39088J9633L646p110q0466n3553Q218j9427L7087N9692j1761n406q886M5104
$$ 539088 558721 562367 555257 474791 421238 429456 410029 447116 506808 495047 489641 480755 525859
9629E25859M26Q5557N7577l8532l6062K6785N8442J3423P4521O125j10208q3778
$$ 525859 526285 611842 669419 630887 594825 621610 680052 693475 767996 774121 663913 580135
9617E80135K4088q2137J5259l6286m1855k4446l922P2310K1438o5078r5579m8621
$$ 580135 604223 522086 537345 501059 459204 434758 430836 503146 524584 459506 363927 315306
9605C15306N3960K3966O2167K2958n8676J8023J06562J1516n8746L2815L6355
$$ 315306 369266 393232 455399 478357 419681 437704 544266 555782 497036 529851 566206
9594E66206M544p2432N200Q7104k185j18723L7636o7381j7904l4499L5751M3197
$$ 566206 570750 498318 503518 590622 588437 469714 507350 439969 422065 387566 423317 466514
9582D66514M6432Q5274r5088q9457L8555N7723P5949N3118k452K3740l0026j3458
$$ 466514 512946 598220 503132 413675 452230 509953 585902 639020 636568 660308 630282 616824
9570F16824K6753o4131j31565j09816n5263k083J65398L0834o9323m9434l191
$$ 616824 643577 579446 447881 338065 282802 280719 446117 476951 407628 358194 355003
9559C55003k2484J3420N9291N2715j38607j74341N5925J35311J1452J17847K7226
$$ 355003 332519 345939 405230 457945 319338 144997 200922 336233 347685 465532 492758
9548D92758l7138l6211k7389p7452o2620N4528O5667j9154j5927p0788j17002
$$ 492758 455620 419409 392020 314568 251948 306476 372143 352989 337062 266274 149272
9537A49272L7449O4459N1231Q1553O5577j0626p939L5648L9321L5340p4282n1534
$$ 149272 186721 251180 302411 383964 449541 438915 430976 466624 505945 541285 467003 415469
9525D15469j02842l135P7721p900L8169O8845q9992k2438m2461n7178k1341Q7020
$$ 415469 312627 309492 387213 379313 417482 486327 396335 373897 331436 274258 252917 339937
9513C39937j3549R638K4571p8017q9848J3785J36385r443n7110k0316L194P644
$$ 339937 326388 336026 360597 282580 192732 206517 342902 333459 276349 256033 259227 266871
9501B66871M8593K1741L492m6245l509N4559N8557k9942j03106K7856o6214J1772
$$ 266871 315464 337205 340697 294452 290943 345502 404059 374117 271011 298867 232653 244425
9489B44425R6964K0040p7386l5836j8336Q514k3963J8896J0340O3309j0731p7061
$$ 244425 341389 361429 284043 248207 229871 238385 214422 233318 243658 306967 296236 219175
9477B19175N8785M8210o0113m4913N5008K3818O310j28074k8153J35175O8860
$$ 219175 277960 326170 266057 221144 276152 299970 306280 178206 150053 285228 354088
9466C54088q7434m7365M5562m4776l6779K027o2770L8928J4583M0397O2397K6444
$$ 354088 266654 219289 264851 220075 183296 185323 122553 161481 176064 216461 278858 305302
9454C05302n0901k4537l7692N6441L9061j11593M5205J11069k0671l2412N8478
$$ 305302 254401 229864 192172 248613 287674 176081 221286 332355 311684 279272 337750
9443C37750l650k1735K5299M6368l4806L8785m2348p7711p1614O5871O8820J0414
$$ 337750 334100 312365 337664 384032 349226 388011 345663 267952 196338 262209 331029 341443
9431C41443n7014m8504R8J13293q6902L250k0194j29019m9067K0179M0031N8337
$$ 341443 284429 235925 236023 349316 262414 265664 245470 116451 67384 87563 127594 185931
9419A85931p3914m0508r5914K56J46728R1215J3055L0779J14609J03344j22715
$$ 185931 112017 71509 -24405 -24149 122579 213794 226849 257628 372237 475581 352866
9408C52866j62426r588R2971K4508M2785P3421m9384m5712j12715j15367l1863
$$ 352866 190440 180852 273823 298331 341116 414537 365153 319441 206726 91359 59496
9397E9496q850O5009J11379m5398j37359j5576O4225o0988k475J21512O0901R1816
$$ 59496 50646 115655 227034 181636 44277 28701 92926 31938 29463 150975 211876 303692
9385C03692k145j05035j7376L4539J0205Q3059j9803j41437k3750r9373r6154
$$ 303692 301547 196512 179136 213675 223880 306939 287136 145699 121949 22576 -73578
9374g3578J2294P6816Q9007Q0146j8542J13308P4723m7159J85k9706L6576J6859
$$ -73578 -61284 15532 104539 184685 166143 279451 354174 307015 307200 277494 314070 330929
9362C30929n2541n5705J6574o9257k2387L3609j9554p989o691L2505R1070K0838
$$ 330929 278388 222683 239257 170000 147613 181222 161668 153679 146988 179493 270563 291401
9350B91401P9785M0963n2182n6976q5687j10642n7924n977k4045n4475k0282J4236
$$ 291401 371186 412149 359967 302991 217304 106662 48738 42761 18716 -35759 -56041 -41805
9338d1805M8864J32317K5981j634J32223J06929l2800j32420n4160J5223k5152
$$ -41805 7059 139376 165357 163723 295946 402875 370075 237655 183495 198718 173566
9327A73566j2559L5441J25162n0462q1090J00899J7298k1786r2053r7442O3393
$$ 173566 161007 196448 321610 271148 190058 290957 308255 286469 194416 96974 160367
9316A60367M5742m2244k2017m3963l3829K6285N466p5q5973M5100J865L273j6454
$$ 160367 206109 163865 141848 97885 64056 90341 95807 95732 9759 54859 56724 59997 43543
9303D3543Q1013L4687j7077K0836O932J3826j7872M7374n0672r803K8670J15147
$$ 43543 124556 159243 142166 163002 169934 183760 165888 213262 162590 152787 181457 296604
9291B96604r073j60028j83017O7553P0436Q6358L9476k9777j5818r1558n6153
$$ 296604 287531 127503 -55514 12039 82475 168833 208309 178532 162714 71156 15003
9280A5003L3318L2332O9198m1711j8693j6776O1927K2803q1965j30710M9646L6067
$$ 15003 48321 80653 149851 108140 89447 72671 134598 157401 75436 -55274 -5628 30439
9268C0439O444J3985N050J2086K5267O6937M4183O4736l6628j9094p1166j4631
$$ 30439 36883 50868 55918 68004 93271 160208 204391 269127 232499 213405 142239 127608
9256A27608M5049n7550o6317k9461M0152J22298M4759P7779j17443q0219m7198
$$ 127608 172657 115107 48790 19329 59481 181779 226538 304317 186874 106655 59457
9245E9457m4427j09964M7420L3259K9515Q1470L715J60572l9835K0244O268j1007
$$ 59457 15030 -94934 -47514 -14255 15260 96730 100445 261017 221182 241426 247694 236687
9233B36687M2433J212m1223O73O5703J7401j0527p5967o3240P508j5424j167P720
$$ 236687 279120 280332 239109 239782 305485 322886 312359 236392 173152 180660 165236 164069 171789
9220A71789r852n3495J9924k0513P8382r125j4534m6647L8792j9328J04890j3390
$$ 171789 161937 108442 128366 107853 186235 177110 162576 115929 154721 135393 240283 226893
9208B26893k9757K757l370m3109K4048l6673l6599Q8737k2669j16169m3363O0165
$$ 226893 197136 199893 196523 153414 177462 140789 104190 192927 170258 54089 10726 70891
9196G0891M7967k4995M0051M937j1962k2612m8439k0712L6090J0563M7948m6403
$$ 70891 118858 93863 133914 138851 126889 104277 55838 35126 71216 81779 129727 83324
9184H3324n5996K7526k6808l6776Q3563j7512P0930N2969q588l897K7972n3257
$$ 83324 27328 54854 28046 -8730 74833 57321 128251 181220 172632 168735 196707 143450
9172A43450n9576J13518R5600m2200r9598M4829n9652m9632l1384O5075J10138
$$ 143450 83874 197392 292992 250792 151194 196023 136371 86739 55355 120430 230568
9161B30568J0293r612l1692R1283k4706q2014m4929m5374K2901j1882J709k8048
$$ 230568 240861 231249 199557 290840 266134 184120 139191 93817 116718 104836 106545 78497
9149G8497m4106k8109R1608L2873M2109M5058p9216q649k065L6015O2500p333
$$ 78497 34391 6282 97890 130763 172872 217930 138714 130065 128000 164015 226515 219182
9137B19182j08461K6784P5j8497L5602J9310j75043o2489O2134Q6396K5638P979
$$ 219182 110721 137505 137580 119083 154685 173995 -1048 -63537 -1403 84993 110631 118610
9125A18610j8241k1860K7101k9451pM988M6979K3689M3427R0457k0443m8966m171
$$ 118610 100369 78509 105610 76159 76152 81140 128119 151808 195235 285692 265249 216283 212112
9112B12112j6994r6745k0173k0370j6381K7209m663P9301q869O7190o9715n6079
$$ 212112 195118 98373 78200 57830 41449 68658 63995 143296 134427 201617 131902 75823
9100G5823j45268M5694m6267j818J33886R2871o428k7902n5166J0507Q096L9766
$$ 75823 -69445 -23751 -70018 -71836 62050 154921 148493 120591 65425 75932 84028 123794
9088A23794l2232j0423Q5997R7652O7688o8617j05694o3163M7774R010k8507R9750
$$ 123794 91562 81139 167136 264788 332476 263859 158165 95002 142776 151786 123279 223029
9076B23029N6380m2354j14109o5577l261m753j67645j12125o158K00485Q7477
$$ 223029 279409 237055 122946 57369 54108 49355 -118290 -230415 -236573 -36088 51389
9065E1389J33972l0337j21702J6522O7782o5697n1319l4371o2060r3P8628K0109
$$ 51389 185361 155024 33322 49844 117626 51929 610 -33761 -95821 -95914 -17286 2823
9053B823j7486n2109J541k133L0549J661N0388L6488j22405P3638O1879m0383
$$ 2823 -14663 -66772 -65231 -67364 -36815 -35154 15234 51722 -70683 2955 64834 24451
9041B4451J0046O407l668n54P981M0968R46J0979q5091q4193q2154N158L9698
$$ 24451 34497 40904 37236 36682 44663 85631 86577 97556 12465 -71728 -153882 -148724 -109026
9028a09026J51785Q0165l16M820l9479K3163J49433Q6613l2804k6477M9305j73791
$$ -109026 42759 122924 122608 127428 87949 111112 260545 347158 314354 287877 337182 163391
9016A63391r8122j28046N753R906K771k4041N9752R9715L2534J29152k2337r4103
$$ 163391 65269 -62777 -57024 -47118 -44347 -68388 -8636 91079 123613 252765 230428 136325
9004A36325p5883n4230P127o727k1474o6825O8582L9780J4627J3871O9842m9400
$$ 136325 60442 6212 13339 6612 -14862 -81687 -13105 26675 41302 55173 125015 75615
8992G5615r819j2900p3498J3162j4863K7176N8928j26732o9468K3359N4512M862
$$ 75615 65796 52896 -20602 -7440 -22303 4873 63801 -62931 -132399 -109040 -54528 -49666
8980d9666K5110J39382K9750l3415L9016K2042j23712p791O2468q2326p6199P8158
$$ -49666 -24556 114826 144576 111161 150177 172219 48507 40716 103184 20858 -55341 22817
8968B2817J9499k988k7052n6089J1644K8516R385M0237Q3790m210n3945K6282
$$ 22817 42316 39328 12276 -43813 -32169 -3653 5732 45969 129759 125549 71604 97886
8956I7886P0654k8003k7722l748k7335L8252M6346L5025r5391o2411o9931N0385
$$ 97886 168540 140537 112815 109067 81732 119984 166330 201355 105964 43553 -26378 24007
8944B4007J18953K2402l4817m6183m0257J3687M8661J7191q2505p0052J0271l4704
$$ 24007 142960 165362 130545 84362 44105 57792 106453 123644 41139 -28913 -18642 -53346
8932e3346M2861Q1475k9772j00986l9920n2808P81N1776O1815P9812l6688J6396
$$ -53346 -10485 70990 41218 -59768 -99688 -152496 -151715 -99939 -38124 41688 5000 21396
8920B1396J9779l5372l0246j4175K2239J1267J894l9592n5515O0226M4865n0648
$$ 21396 41175 5803 -24443 -38618 -16379 -5112 -3218 -42810 -98325 -38099 6766 -43882
8908d3882k1611R575J03109r97J7618L4398n4570m9511J6117o1296k3579J08612
$$ -43882 -65493 -55918 47191 46194 63812 98210 43640 -5871 10246 -51050 -74629 33983
8896C3983N7083n2706J1855L7168Q620o0603q5245R2679N20m3760l1178m6045
$$ 33983 91066 38360 50215 87383 96003 35400 -49845 42834 43354 -406 -31584 -77629
8884g7629J46594L0002O6976p751j52828k2764N3085j5795R5486P7304n9991O4520
$$ -77629 68965 98967 165943 158192 5364 -17400 35685 19890 115376 192680 132689 197209
8872A97209m0316k5249M2015l8331p1454j43399j2129M0539R5398J21922j5655
$$ 197209 156893 131644 173659 135328 63874 -79525 -91654 -51115 44283 166205 150550
8861A50550M819j151J7346j45671k4913O7652P7275N5987J6511j9887j1963k0211
$$ 150550 155369 154218 171564 25893 980 68632 145907 201894 218405 198518 186555 166344
8849A66344O3303p955N7069l1793j09703M566M3816k1206n7515j42227o4000O4302
$$ 166344 229647 221692 278761 246968 137265 141831 185647 164441 106926 -35301 -99301 -34999
8837c4999J36913m6792k0894j884j1696L2649N4727Q3043J2589J9001K7805M5252
$$ -34999 101914 55122 34228 32344 20648 53297 108024 191067 203656 222657 250462 295714
8825B95714O795l2155n0267k8187m2934m4908o4169q2078m9949j2666K6274n1170
$$ 295714 302509 270354 220087 191900 148966 104058 39889 -42189 -92138 -104804 -78530 -129700
8813a29700K2491K0958O7870R5967K9710L6371q9625j8759N3035N6841P1730M296
$$ -129700 -107209 -86251 -18381 77586 107296 143667 54042 35283 88318 145159 216889 221185
8801B21185m5680j06445r5097J9647n314N1936N8383m5794l4313l1454j91L8868
$$ 221185 175505 69060 -26037 -6390 -11704 40232 98615 52821 18508 -12946 -13137 25731
8789B5731l7699L9314l5179J2683J750l8826o2596N1994J08978j3675J8447m8233
$$ 25731 -11968 27346 -7833 4850 6600 -32226 -94822 -42828 66150 52475 70922 22689
8777B2689o8136o7672J03308N2830l5510q1607m98J03540J43780N8498p9145O8800
$$ 22689 -45447 -113119 -9811 43019 7509 -74098 -74596 28944 172724 231222 152077 220877
8765B20877j42395j28134N9555N3530j9933j2009j0624k7207o6029O19P2721j9779
$$ 220877 78482 -49652 9903 63433 43500 31491 20867 -6340 -72369 -71750 971 -18808
8753a8808J8885M8419p1601Q4937L3860m4132k927K5093N1243J03310N597J2559
$$ -18808 77 48496 -23105 61832 95692 51560 48633 73726 124969 228279 233876 246435
8741B46435k7946n7793n2870l1653K9491J25985p9503q5362J04724j6507J2028
$$ 246435 218489 160696 107826 76173 105664 231649 152146 66784 171508 155001 167029
8730A67029M735p1380p7638P720L0599n2724J5364L9850k3765Q426K667o048O6842
$$ 167029 171764 100384 22746 30466 61065 8341 23705 63555 39790 48216 50883 44835 111677
8717A11677N0281L427l4546K9643l4326p9012J33650J71869p745p4130n842m5559
$$ 111677 161958 165385 130839 160482 126156 47144 180794 352663 344918 270788 264946 219387
8705B19387J5810K6224m4110N2857p7683p0101L0005Q7686L0627L4676o7838M1146
$$ 219387 235197 261421 217311 270168 192485 122384 152389 240075 270702 305378 237540 278686
8693B78686R1713M842M153j77950p5771k8195k3605O2156L9742n6670j0021k531
$$ 278686 370399 375241 379394 201444 125673 97478 73873 136029 175771 119101 109080 106549
8681A06549J8167j9713J49102J16178N183l1698J222l4875j25332J242o189p678
$$ 106549 124716 105003 254105 370283 375466 343768 344990 310115 184783 186025 179836 172158
8669A72158m5068M5394K5065O2685q4592r399L7908l3286R828L8504N8222q6218
$$ 172158 127090 172484 197549 260234 175642 166243 204151 170865 180693 219197 277419 191201
8657A91201j09690N2022P1931K9314l3201O5180k8237L2211l3056n7319J0061
$$ 191201 81511 133533 205464 234778 201577 266757 238520 270731 237675 180356 190417
8646A90417P387P6227p7659l0612O9108Q0417l7062l3266K363J4931N9146l1681
$$ 190417 197804 274031 196372 165760 234868 315285 278223 244957 247320 262251 321397 289716
8634B89716k4447o570o9322n5442N1074P3167M1263L3926L897o9958o9874O2730
$$ 289716 265269 258699 189377 133935 185009 258176 299439 333365 337262 267304 197430 260160
8622B60160o0110m1386M6385L0746K5660J1647N8096M5254K8209o621R2654l0132
$$ 260160 200050 158664 205049 235795 261455 273102 331198 376452 404661 398040 490694 460562
8610D60562L1341P7322l9600k4531m6347J0429Q1879l3130N9623M2244l9861r1365
$$ 460562 491903 569225 529625 505094 458747 469176 551055 517925 577548 619792 579931 488566
8598D88566k4582K4529p943J7789j7073j80894p4746P5689k7353K061O6887m6086
$$ 488566 463984 488513 480570 498359 481286 300392 225646 301335 273982 276043 342930 296844
8586B96844j5535K5623o5548j09047j025M6263o5793j15325m1142L2861P467P6510
$$ 296844 281309 306932 241384 132337 131312 177575 111782 -3543 -44685 -11824 -4357 72153
8574G2153L2294J2183l8201J4688K4806n5864m3507L1132J21378R5354j23868
$$ 72153 104447 116630 78429 93117 117923 62059 18552 49684 171062 266416 142548
8563A42548q9650J03787l9196r2043l0955l6228J1649J13873O8539K5366o991
$$ 142548 52898 156685 117489 25446 -5509 -41737 -30088 83785 152324 177690 170699
8552A70699j12640K5553J6240L421n6946q2975L8014l6628m2702M7140Q3075O0711
$$ 170699 58059 83612 99852 103273 46327 -36648 1366 -35262 -77964 -30824 52251 112962
8540A12962k5665N5374j8028L9264K2881m2152r4391j5762l4390J11794N3864
$$ 112962 87297 142671 124643 163907 186788 144636 50245 34483 93 111887 165751
8529A65751n3118m1043M5434Q747O0811m6850o3805r403k0718k1752J22360o824
$$ 165751 112633 71590 117024 125771 186582 139732 75927 66524 45806 24054 146414 139590
8517A39590m4838q6531k2706J45536J4473o0130m4453j0051n1452O7333M8889
$$ 139590 94752 8221 -14485 131051 145524 85394 40941 30890 -20562 46771 95660
8506I5660P162J08659j06415j06389n2982L2874R7388j3593p8490L8937N584P2078
$$ 95660 102822 211481 105066 -1323 -54305 -21431 75957 62364 -16126 22811 28395 100473
8494A00473J1997j07786q2502p2002m6809l4075Q4538N0370J8559p3700Q1181
$$ 100473 112470 4684 -77818 -149820 -196629 -230704 -146166 -95796 -77237 -150937 -69756
8483f9756J03948j7821L8912K3621K8666p4432j04394o6727N6325K3751J1645
$$ -69756 34192 16371 55283 78904 107570 33138 -71256 -137983 -81658 -57907 -46262
8472d6262M7093m9279N2593L7727m6141j2376k8561l9192Q926J3091j7722M4636
$$ -46262 831 -48448 4145 41872 -4269 -16645 -45206 -84398 -75472 -62381 -80103 -35467
8460c5467k5269R0390p4691n0991N299K2168J62732l3528P9554J1377m8003L0852
$$ -35467 -60736 29654 -45037 -96028 -90729 -68561 94171 60643 140197 151574 103571 134423
8448A34423q3105n7800J45457J00653l8317l1357j35017o1529k893O8976J0176
$$ 134423 51318 -6482 138975 239628 201311 169954 34937 -26592 -29485 39491 49667
8437D9667r8664K8708M5053Q5735P4303q7403r0122K4040P9074j314o3806M260
$$ 49667 -48997 -20289 24764 110499 184802 97399 7277 31317 110391 109077 45271 49531
8425D9531m6419o3465K2902J42766P7808q4950k7180k09l4515j034n0054k8169
$$ 49531 3112 -60353 -37451 105315 183123 98173 70993 70784 36269 35235 -14819 -42988
8413d2988m8583K0631O2898K7958K3301J6814N5937K2068j24209j02212k2617
$$ -42988 -91571 -70940 -8042 19916 43217 60031 115968 138036 13827 -88385 -111002
8402a11002M3908k3327l1608J40327L1355o7909m7485l0684J1666k0114Q762q5211
$$ -111002 -67094 -90421 -122029 18298 49653 -18256 -65741 -96425 -84759 -104873 -96111 -181322
8390a81322N4916O3359M0658N2673M2665n2864M5618k3538o8592k6583j7277L2932
$$ -181322 -126406 -63047 -22389 30284 72949 20085 65703 42165 -26427 -53010 -70287 -37355
8378c7355n0066k1742R4205K3233j28483k207K9400J9221k9661P634R5933o2818
$$ -37355 -87421 -109163 -14958 8275 -120208 -122415 -93015 -73794 -103455 -95821 112 -62706
8366f2706m1711j5518k0454N9796m5632j8990J53231J0210L1164j9647N5910N0084
$$ -62706 -104417 -119935 -140389 -80593 -126225 -145215 8016 18226 49390 29743 85653 135737
8354A35737l6586p3125o9132m7239l4670p5506J13961J37919j9811o4226m6008
$$ 135737 99151 26026 -43106 -90345 -125015 -200521 -86560 51359 31548 -32678 -78686
8343g8686P9545p271K5910P87L8648j6463l8034q7030j2594P6425O1006J14244
$$ -78686 859 -6412 19498 20285 58933 42470 4436 -82594 -95188 -18763 42243 156487
8331A56487m6R215l4662l4211m6359q4720j8248P1351L3804j12351m1431L7067
$$ 156487 156441 165656 130994 96783 50424 -34296 -52544 18807 52611 -59740 -101171 -64104
8319f4104J4086J8811N9900O5793j404j32658j9488M6888J1121j9849r863O830
$$ -64104 -50018 -31207 28693 94486 93082 -39576 -59064 -12176 -1055 -20904 -30767 -23937
8307b3937o9326M1424O6922K8697q1552o4212Q8200j06678l0501J15283J18709
$$ -23937 -93263 -51839 15083 43780 -37772 -101984 -13784 -120462 -150963 -35680 83029
8296H3029P3797K1796j23988M2098o980l1191j17665p5240l0449j0315k111k7854
$$ 83029 156826 178622 54634 96732 89752 58561 -59104 -134344 -164793 -175108 -177219 -205073
8284b05073N2873l5194L4646Q2195J5936K0221J6383M7531L0362K9952n319m7701
$$ -205073 -152200 -187394 -152748 -70553 -54617 -34396 -18013 29518 59880 89832 84513 36812
8272C6812J08947n3714o7971M6279l1696K8213Q6259J4816j39182n3733N9419
$$ 36812 145759 92045 24074 70353 38657 66870 153129 167945 28763 -24970 34449
8261C4449P8111P0639k1323o8835L0608j9916k1616q0622J1536Q6652J8095j40208
$$ 34449 112560 183199 161876 93041 123649 103733 82117 1495 13031 99683 117778 -22430
8249b2430j2184k4769q0474m0296P8887P9842k7957o734Q4448m530j4667R058
$$ -22430 -34614 -59383 -139857 -180153 -101266 -21424 -49381 -56115 28333 23803 9136 18194
8237A8194O2117l3147j11886L6733R6594K2570q222m4942o6154M7271P6583m4536
$$ 18194 80311 47164 -64722 -27989 68605 91175 82953 38011 -28143 19128 95711 51175
$$ [...]
##END NTUPLES=NMR SPECTRUM
##END=
