##TITLE=Analysis number 307418
Compound Code cc 12303
Book Reference 442/51/1/1
Project Code adrs
Chemist Name robb
##JCAMPDX= 6.0         $$ Bruker NMR JCAMP-DX V2.0
##DATA TYPE= NMR SPECTRUM
##DATA CLASS= NTUPLES
##ORIGIN= Bruker BioSpin GmbH
##OWNER= NMR
$$ XWIN-NMR		Version 3.5
$$ Fri Apr 29 14:46:11 2005 GMT Daylight Time (UT+1h)  MAYBRIDGE\NMR@NMR_250MHZ
##.OBSERVE FREQUENCY= 250.131544655141
##.OBSERVE NUCLEUS= ^1H
##.ACQUISITION MODE= SIMULTANEOUS (DQD)
##.ACQUISITION SCHEME= undefined
##.AVERAGES= 16
##.DIGITISER RES= 18
##SPECTROMETER/DATA SYSTEM= dpx250
##.PULSE SEQUENCE= zg30
##.SOLVENT NAME= CDCl3
##.SHIFT REFERENCE= (INTERNAL, CDCl3, 0, 16.522)
##AUDIT TRAIL= $$ (NUMBER, WHEN, WHO, WHERE, WHAT)
$$ ##TITLE= Audit trail, XWIN-NMR		Version 3.5
$$ ##JCAMPDX= 5.01
$$ ##ORIGIN= Bruker BioSpin GmbH
$$ ##OWNER= NMR
$$ C:\u/data/dgb/nmr/ADRS/2600/pdata/1/auditp.txt
$$ ##AUDIT TRAIL=  $$ (NUMBER, WHEN, WHO, WHERE, WHAT)
(   1,<2005-04-29 14:45:50.95 +100>,<MAYBRIDGE\NMR>,<NMR_250MHZ>,
      <created by zg, POWCHK disabled, PULCHK disabled
       configuration hash MD5:
       62 19 C7 07 E1 42 D1 B7 37 6C 3D D0 77 39 F9 E6
       data hash MD5: 64K
       D2 C1 0C E1 DF E1 0B E4 C7 CA 5F 58 E7 05 54 3B>)
(   2,<2005-04-29 14:46:02.17 +100>,<MAYBRIDGE\NMR>,<NMR_250MHZ>,
      <Start of raw data processing
       ef LB = 0.3 FT_mod = 6 PKNL = 1 SI = 32K 
       data hash MD5: 32K
       3C D6 D3 1C D2 6B 63 EC 89 1D AB 61 AA B1 3F 40>)
(   3,<2005-04-29 14:46:04.04 +100>,<MAYBRIDGE\NMR>,<NMR_250MHZ>,
      <apk 
       data hash MD5: 32K
       5C 30 AF 90 2B 17 F8 EB 55 D7 D5 D8 2B C1 15 31>)
(   4,<2005-04-29 14:46:04.74 +100>,<MAYBRIDGE\NMR>,<NMR_250MHZ>,
      <abs ABSG = 5 
       data hash MD5: 32K
       6A 89 A4 EA 36 37 A3 80 E5 A6 32 71 34 7E DC B7>)
$$ ##END=
$$ 
$$ hash MD5
$$ FC 47 E3 6F EB 6C 30 17 8A DB 2E 81 35 18 9D B9
##$RELAX= 
##$RELAX= 
##$RELAX= 
##$RELAX= 
##$RELAX= 
##$RELAX= 
##$RELAX= 
$$ Bruker specific parameters
$$ --------------------------
##$DU= <C:\u>
##$EXPNO= 2600
##$NAME= <ADRS>
##$PROCNO= 1
##$TYPE= <nmr>
##$USER= <dgb>
##$AMP= (0..31)
100 100 100 100 100 100 100 100 100 100 100 100 100 100 100 100 100 100 
100 100 100 100 100 100 100 100 100 100 100 100 100 100 
##$AQSEQ= 0
##$AQ_mod= 3
##$AUNM= <au_zg>
##$AUTOPOS= <44 >
##$BF1= 250.13
##$BF2= 250.13
##$BF3= 250.13
##$BF4= 250.13
##$BF5= 500.13
##$BF6= 500.13
##$BF7= 500.13
##$BF8= 500.13
##$BYTORDA= 1
##$CFDGTYP= 0
##$CFRGTYP= 5
##$CHEMSTR= <none>
##$CNST= (0..31)
1 1 145 1 1 1 1 1 1 1 1 1 1 1 1 1 1 1 1 1 1 1 1 1 1 1 1 1 1 1 1 1 
##$CPDPRG= <>
##$CPDPRG1= <>
##$CPDPRG2= <>
##$CPDPRG3= <>
##$CPDPRG4= <mlev>
##$CPDPRG5= <mlev>
##$CPDPRG6= <mlev>
##$CPDPRG7= <mlev>
##$CPDPRG8= <mlev>
##$CPDPRGB= <>
##$CPDPRGT= <>
##$D= (0..31)
0 1 0 0 0 0 0 0 0 0.06 0 0 0 0 0 0 0.0002 0 0 0 0 0 0 0 0 0 0 0 0 0 0 
0 
##$DATE= 1114782349
##$DBL= (0..7)
120 120 120 120 120 120 120 120 
##$DBP= (0..7)
150 150 150 150 150 150 150 150 
##$DBP07= 0
##$DBPNAM0= <>
##$DBPNAM1= <>
$$ [...]
##$SUBNAM7= <"">
##$SUBNAM8= <"">
##$SUBNAM9= <"">
##$SW= 20.6930455092707
##$SWIBOX= (0..15)
0 0 3 0 0 0 0 0 0 0 0 0 0 0 0 0 
##$SW_h= 5175.983436853
##$TD= 65536
##$TD0= 1
##$TE= 295.16
##$TE2= 300
##$TE3= 300
##$TEG= 300
##$TL= (0..7)
0 120 120 120 120 120 120 120 
##$TP= (0..7)
150 150 150 150 150 150 150 150 
##$TP07= 0
##$TPNAME0= <>
##$TPNAME1= <>
##$TPNAME2= <>
##$TPNAME3= <>
##$TPNAME4= <>
##$TPNAME5= <>
##$TPNAME6= <>
##$TPNAME7= <>
##$TPOAL= (0..7)
0.5 0.5 0.5 0.5 0.5 0.5 0.5 0.5 
##$TPOFFS= (0..7)
0 0 0 0 0 0 0 0 
##$TUNHIN= 0
##$TUNHOUT= 0
##$TUNXOUT= 0
##$USERA1= <user>
##$USERA2= <user>
##$USERA3= <user>
##$USERA4= <user>
##$USERA5= <user>
##$V9= 5
##$VALIST= <valist>
##$VCLIST= <CCCCCCCCCCCCCCC>
##$VD= 0
##$VDLIST= <DDDDDDDDDDDDDDD>
##$VPLIST= <PPPPPPPPPPPPPPP>
##$VTLIST= <TTTTTTTTTTTTTTT>
##$WBST= 1024
##$WBSW= 4
##$XGAIN= (0..3)
0 0 0 0 
##$XL= 0
##$YL= 0
##$YMAX_a= 392305
##$YMIN_a= -263151
##$ZGOPTNS= <>
##$ZL1= 120
##$ZL2= 120
##$ZL3= 120
##$ZL4= 120
##$ABSF1= 16.522
##$ABSF2= -4.171173
##$ABSG= 5
##$ABSL= 3
##$ALPHA= 0
##$AQORDER= 0
##$ASSFAC= 0
##$ASSFACI= 0
##$ASSFACX= 0
##$ASSWID= 0
##$AUNMP= <proc_1d>
##$AZFE= 0.1
##$AZFW= 0.1
##$BCFW= 0
##$BC_mod= 0
##$BYTORDP= 0
##$COROFFS= 0
##$CY= 12.5
##$DATMOD= 1
##$DC= 0
##$DFILT= <>
##$DTYPP= 0
##$F1P= 14.0000005364418
##$F2P= -0.99999901652339
##$FCOR= 0.5
##$FTSIZE= 32768
##$FT_mod= 6
##$GAMMA= 0
##$GB= 0
##$INTBC= 1
##$INTSCL= 1
##$ISEN= 128
##$LB= 0.3
##$LEV0= 0
##$LPBIN= 0
##$MAXI= 10000
##$MC2= 0
##$MEAN= 0
##$ME_mod= 0
##$MI= 0
##$NCOEF= 0
##$NC_proc= -4
##$NLEV= 6
##$NOISF1= 0
##$NOISF2= 0
##$NSP= 0
##$NTH_PI= 0
##$NZP= 0
##$OFFSET= 16.522
##$PC= 1
##$PHC0= -75.32341
##$PHC1= 9.412098
##$PH_mod= 1
##$PKNL= yes
##$PPARMOD= 0
##$PSCAL= 4
##$PSIGN= 0
##$REVERSE= no
##$SF= 250.13
##$SI= 32768
##$SIGF1= 0
##$SIGF2= 0
##$SINO= 400
##$SIOLD= 32768
##$SREGLST= <1H.CDCl3>
##$SSB= 0
##$STSI= 32768
##$STSR= 0
##$SW_p= 5175.98343685301
##$SYMM= 0
##$S_DEV= 0
##$TDeff= 65536
##$TDoff= 0
##$TI= <Analysis number 999999
Compound Code 99
Book Reference 9
Project Code 9>
##$TILT= no
##$TM1= 0
##$TM2= 0
##$TOPLEV= 0
##$USERP1= <user>
##$USERP2= <user>
##$USERP3= <user>
##$USERP4= <user>
##$USERP5= <user>
##$WDW= 1
##$XDIM= 32768
##$YMAX_p= 378317132
##$YMIN_p= -428264
$$ End of Bruker specific parameters
$$ ---------------------------------
##NTUPLES= NMR SPECTRUM
##VAR_NAME=  FREQUENCY,     SPECTRUM/REAL,   SPECTRUM/IMAG
##SYMBOL=    X,             R,               I
##VAR_TYPE=  INDEPENDENT,   DEPENDENT,       DEPENDENT
##VAR_FORM=  AFFN,          ASDF,            ASDF
##VAR_DIM=   32768,         32768,           32768
##UNITS=     HZ,            ARBITRARY UNITS, ARBITRARY UNITS
##FACTOR=    0.157963299565203, 1,           1
##FIRST=     4132.6476996994, 0,             0
##LAST=      -1043.33573715361, 0,           0
##MIN=       -1043.33573715361, -428264,     0
##MAX=       4132.6476996994, 378317132,     0
$$ Real data points
##PAGE= N=1
##DATA TABLE= (X++(R..R)), XYDATA
$$ [...]
25866E5616q168L636k9205k9497J7129K64P756p0561L991O9179N0916l4959l5627
25853D70L7681K9084j6571L6777p3606M1702m4130L100J411n888K9517L6613k5733
25840E0427n0610p2067L9347K7242L6509k2809n9459n577J02193J3744m8105l0352
25828a9517L9847j784R530q662k8625j5450M4941K0588k8550k4591l1585O879
25816c6979j2082m5005K0480L9297o69j8490M0283j3680j8788K1827l9581k3178
25804h6565L8199R8108M1436K2551k4618m6231J2938k8304j0488L3766m6853k0717
25792a6778M6033L2761P593m4529K9437j2824J4279k7223l7155p887l8288j908
25780e6489N9177n23m3111J0346L4710k1665n1223l545L1364o723l3764R732K0932
$$ plain form
25866 55616 47448 51084 21879 -7618 9511 9775 17531 -53030 -49039 20140 71056 36097 470
25853 470 38151 67235 50664 87441 13835 55537 11407 14507 15918 10030 39547 76160 50427
25840 50427 -183 -72250 -32903 -5661 30848 8039 -51420 -56997 45196 58940 10835 -19517
25828 -19517 20330 18546 28076 19414 -9211 -24661 20280 40868 12318 -12273 -43858 -36979
25816 -36979 -49061 -94066 -73586 -34289 -34958 -53448 -13165 -26845 -45633 -23806 -63387 -86565
25804 -86565 -48366 49742 91178 113729 89111 42880 55818 27514 17026 50792 3939 -16778
25792 -16778 29255 62016 69609 25080 54517 41693 55972 28749 -8406 -16293 -54581 -56489
25780 -56489 2688 2165 -40946 -30600 4110 -17555 -68778 -72323 -40959 -47682 -81446 -71714 -50782
25767e0782M9826M1224K9598m6681n6586M0678L3231j99l7851p3784k4694P1192
25755b4828o4M3355k9145J6901M5428N484N549N027o6456j9137K1851L7318q413
25742C2870j9077P6704j729l5036l0348M7495j5056j5180L4959L6583J055O799
25730A20039L1955k1663l3257J358j9829k9638o9520L7697J5680O427M552J4178
25718E7979m1982m1534L986K7202o3274j7284O856M2706O2863L5539m8743j1095
25706A3219J3712n434M4579L8521j6425j3630p9601L024J6104J4017j2391j1033
25694D662k4906j5289n9069J6433N6364M2216N012l144k2685R273L5839l2755
25682A1951n8301k6830l4304M6599l99J0019L1528O6323K2040o444R580m1857
$$ plain form
25767 -50782 -956 40268 69866 23185 -33401 7277 40508 40309 2458 -71326 -96020 -24828
25755 -24828 -24892 18463 -10682 6219 51647 57131 62680 67707 1251 -17886 3965 41283 32870
25742 32870 13793 90497 88768 53732 23384 70879 55823 40643 75602 112185 113240 120039
25730 120039 151994 130331 97074 98432 78603 48965 -20555 17142 32822 39249 43801 57979
25718 57979 15997 -25537 -21551 5651 -57623 -74907 -68051 -25345 37518 73057 24314 13219
25706 13219 26931 21497 66076 104597 88172 74542 -5059 -2035 14069 28086 15695 4662
25694 4662 -20244 -35533 -94602 -78169 -21805 20411 25423 22279 -406 8867 44706 11951
25682 11951 -46350 -73180 -107484 -60885 -61284 -51265 -19737 46586 68626 62182 71762 29905
25670B9905n1590J2478M0431m7700p9311j4106O2289N1608L6863P809j4844o3785
25658b9953o2610M5573O683M3674M9130n4302l0733N5852j9422k9111K9903J5291
25646A9975L6578p9851l4535r335M7466N0968j2853n9377l167n165m7113l0306
25634a26715L4022J0663K4609J2107m045M1275L1588K3453O7944M8825l296n6208
25622A04222k2207n1893l557o5407r464N0342O6084L7397N2968o1882k6789K9457
25610I9271n2744N4285J2387o3927m5076L5569M278j5543K0202m09j5640j2604
25598B0049J8963N8959m259m4451k2801k0251L3006J4606N799n0107k359P1621
25586G8775l7534j188j1891j3703J7953K5903J6491n1367J4962k5289l2216L1104
$$ plain form
25670 29905 -21685 -9207 31224 -16476 -95787 -109893 -47604 4004 40867 48676 33832 -29953
25658 -29953 -92563 -46990 -40307 3367 52497 -1805 -32538 23314 3892 -25219 4684 19975
25646 19975 56553 -23298 -57833 -67168 -19702 31266 18413 -40964 -44131 -49296 -96409 -126715
25634 -126715 -92693 -82030 -57421 -45314 -49359 -8084 23504 46957 114901 163726 160430 104222
25622 104222 82015 30122 26565 -38842 -48306 2036 68120 105517 158485 96603 69814 99271
25610 99271 46527 100812 113199 49272 4196 39765 44043 28500 48702 48293 32653 20049
25598 20049 39012 97971 93712 49261 26460 6209 39215 53821 59620 9513 7154 78775
25586 78775 41241 40053 28162 14459 32412 58315 74806 23439 38401 13112 -19104 12000
25574A2000K9551K2929L546P010J3683k2497r9077k356O2953M1022l2836p849
25562B8079K8573j3562o9213j6215j122L3891l115j6509Q133K7730o560J687M5846
25549D7643l0579n7099L8425P1960L034n0575m3724k129J105M9153l4240r922
25537a6948M3698K6568j9046k3505p7325k8701J7400R7714L4209m4074o2021o821
25525e8852k6299L4562M1437l6454K737M5933N0261Q557L4890l3955m1786O642
25513B7673K2972Q988L6526J4917k7197m1851o1859m9166J8042M0791j0522n531
25501b6217j7064K358Q3037P6805L2020o7545p1027p9557r1634K9518L3537M8085
25489d7684k8805J7193P7661J2883m7238O506M3155N8144l9957n7703Q435P0526
$$ plain form
25574 12000 41551 64480 68026 75036 88719 66222 -32855 -35211 27742 68764 35928 28079
25562 28079 56652 43090 -26123 -42338 -43460 -9569 -12684 -29193 -21060 6670 110 1797 47643
25549 47643 17064 -40035 -1610 70350 73384 22809 -20915 -23044 -21939 27214 -7026 -16948
25537 -16948 26750 53318 34272 10767 -66558 -95259 -77859 19855 54064 9990 -52031 -58852
25525 -58852 -85151 -50589 -9152 -45606 -42869 3064 53325 61882 96772 62817 21031 27673
25513 27673 50645 59633 96159 111076 83879 42028 -19831 -68997 -50955 -10164 -20686 -26217
25501 -26217 -43281 -40923 42114 118919 150939 83394 12367 -67190 -158824 -129306 -95769 -47684
25489 -47684 -76489 -59296 18365 31248 -15990 -9484 33671 91815 51858 -5845 2590 73116
25477G3116Q48k3174m8039M414N7889j7782l1568m3687j1633O6300L7955O9944
25465A34583M6792m0572m8955j12600K3415J9370l7787K0764J9446P629L3194
25454F5279K809O316n0834L3966K4869K563q9402n023K1728Q823O102k1353j0304
25441d461L1133j7879o0428j2517K5417J1945R9249J8283k6296k0189n9531l1765
25429d7039K0298k3479m2402l269j4643q891l9028K5652N9546K2251M0842M4283
25417C4121q924l26l5849K584P893k2417l5864n7736M4662O7291J6193l7777K6950
25404H01k6988k1207L5183Q4777k8160Q902J8105N229q496M381n5447N568M4212
25391F6860k9730o4036j6994p911Q864m9877k0445O8273L1646K5946m0623m7548
$$ plain form
25477 73116 73964 50790 2751 7165 65054 47272 15704 -27983 -39616 26684 64639 134583
25465 134583 181375 140803 91848 -20752 2663 22033 -15754 5010 24456 32085 65279
25454 65279 68088 74404 23570 57536 82405 84968 -4434 -9457 12271 21094 27196 5843 -4461
25441 -4461 26672 8793 -51635 -64152 -38735 -26790 72459 90742 64446 44257 -15274 -47039
25429 -47039 -26741 -50220 -92622 -95891 -110534 -119425 -158453 -132801 -73255 -51004 -10162 34121
25417 34121 25197 24871 -10978 -8394 -501 -22918 -58782 -116518 -71856 -4565 11628 -26149 801
25404 801 -26187 -47394 -12211 72566 44406 53308 71413 76642 68146 72527 17080 22648 66860
25391 66860 37130 -26906 -43900 -51811 -42947 -92824 -113269 -44996 -13350 12596 -28027 -75575
25379g5575k4456M7781P1030N4303K9113M0865j6410l3324M8215n2812n3822N299
25367D0207J2331q9656l9826N215N4747J6097N7417k8385p9517P6464M2917L7678
25355A05689P3922K4981n0715j15352r7873l3134L1978M0902J6812j2524k786
25344a8100l613j2141N3288L3570o0392q1589O450J392j0870P7530P1700J6840
25332G4065k1002L0659L2023o3781p6087l2202r968n9192L1126K8067M3858M6772
25320B4338P738J7187J1948l5313m9617O798l1065J8017j5439J9011K7307L9620
25308D0530L7495p017k3289l996L1349J0868l5057o3145n0711M8072M7259n9318
25296b6960j01901N8899M1946J2721O3359J5407l0306k4540J8235j7527j06085
$$ plain form
25379 -75575 -100031 -52250 18780 73083 102196 143061 126651 93327 141542 88730 34908 40207
25367 40207 52538 -37118 -76944 -71729 -16982 -885 56532 28147 -51370 25094 68011 105689
25355 105689 179611 204592 153877 38525 -59348 -92482 -60504 -19602 -2790 -15314 -18100
25344 -18100 -21713 -33854 19434 53004 -7388 -88977 -82527 -81135 -92005 -14475 57225 74065
25332 74065 53063 83722 115745 51964 -24123 -56325 -66293 -125485 -94359 -66292 -22434 24338
25320 24338 32076 49263 61211 25898 -23719 -16921 -47986 -29969 -45408 -26397 910 40530
25308 40530 78025 71008 47719 43723 75072 85940 50883 -12262 -62973 -14901 32358 -26960
25296 -26960 -128861 -69962 -28016 -15295 48064 63471 33165 8625 26860 9333 -96752
25285i6752n484m4298K0842K0151K8240q696j5278L1336L4328l834o6496J0226
25273i5715k2261J6000K7184L8818k492l5509n3290M9441O0920j3329r836l7219
25261g7288J2733J0657q8131k9615N8243L1829M1308K9500N7937K5242k2502M9074
25249I8987M2783m748j09305n4998N4420M6748n2739q61M6661k1583j4503M2596
25237G3458K4827r1499J982L5172l7842p7786R696M1626L086K548K1525J5163
25225B1956l481L6445l5793n6324L1984L6351J0010k5213j8124o5602J437N1372
25213a4982o892K1212O4088J9757p2294m7259m5136R95P9753O5910M5914J2866
25201A23932j13860M360l1607k7477K40k2970J7666J6988n761M8791J0496Q96
$$ plain form
25285 -96752 -102236 -146534 -125692 -105541 -77301 -85997 -101275 -69939 -35611 -39445 -105941 -95715
25273 -95715 -117976 -101976 -74792 -35974 -38466 -73975 -127265 -77824 -16904 -30233 -40069 -77288
25261 -77288 -64555 -53898 -142029 -171644 -113401 -81572 -40264 -10764 47173 72415 49913 98987
25249 98987 141770 137022 27717 -27281 27139 73887 21148 20287 66948 45365 30862 73458
25237 73458 98285 6786 8768 43940 6098 -71688 -61992 -20366 -17280 -14732 6793 21956
25225 21956 18475 54920 19127 -37197 -5213 31138 41148 15935 -2189 -67791 -66354 -14982
25213 -14982 -21874 -662 63426 83183 10889 -36370 -81506 -80511 -758 65152 111066 123932
25201 123932 10072 14432 -17175 -44652 -44412 -67382 -49716 -32728 -38489 10302 20798 21694
25189B1694M4806l2830o49m8639o3173K2954L0632r617O0399L824J0435k0082
25177A9754j3508N0773O7842L2870j2604n9684P175o4840n5772m2426J0098q407
25165f8729k5912R9339N7314N512K8636Q329j0262L99J7521l5984P2326k5503
25153A22986J477r177l221j6869o8937j9685J629J9805n0558m418L9916M1974
25141E4922K7721K0016j21655k8500j7333l1013M6785M1533K9498K632j6411k6969
25129a8774n8259l2142P3166L6154j8741M0258P5459k5663j24793q1429O5679
25118f9085O4215k2551q415L3N991K794K1206J0316l3642L4747N0287K9830l249
25105H2477o0959q3981j3687j8278L2357P5701K2882o1589J2516M2215n0430m4411
$$ plain form
25189 21694 66500 33670 33021 -15618 -78791 -55837 -25205 -34822 25577 29401 39836 19754
25177 19754 6246 57019 124861 157731 145127 85443 92618 27778 -27994 -70420 -60322 -68729
25165 -68729 -94641 4698 62012 67524 96160 104489 94227 94626 112147 76163 148489 122986
25153 122986 124463 115286 112065 95196 26259 6574 8203 28008 -22550 -26968 12948 54922
25141 54922 82643 102659 -18996 -47496 -64829 -95842 -49057 -7524 21974 24606 8195 -18774
25129 -18774 -77033 -109175 -36009 145 -18596 21662 97121 71458 -53335 -134764 -69085
25118 -69085 -4870 -27421 -35836 -35803 -29812 -27018 -5812 4504 -29138 5609 55896 85726 82477
25105 82477 21518 -62463 -76150 -94428 -62071 13630 36512 -25077 -12561 29654 -20776 -65187
25093f5187n6770l13N8483K8202L1593K7731M4779k8164m7169J2031q825K1564
25081A7955j1593j0343j6737p686O3795M4069R525l6812J1437R737k9731K4993
25069F8609J3990K0452j8050o8243n4275K483N726L0314k1113o1679J5226J0394
25057e6166k9619o67P6450Q1408m618p1334o2896K0290L8774P7197M1593m0741
25045F9671l7253K9099L1056m5829n3925J529K5341Q0687o7722k0832P528n4859
25033c5509J5387Q449k6446O1118p234j4557J3493m1057k7362M8308M5275J8549
25021E8414k898p1933j4187O9986k590J0669j6601L5346m582p1324p777K496M887
25008a0094o461l6230j5326m7218L388N1024K7016j899M0257L5838L6330j4437
$$ plain form
25093 -65187 -121957 -122270 -63787 -35585 -3992 23739 68518 40354 -6815 5216 -3609 17955
25081 17955 6362 -3981 -20718 -28404 35391 79460 88985 52173 63610 73347 43616 68609
25069 68609 82599 103051 85001 16758 -37517 -35034 -29308 1006 -20107 -81786 -66560 -56166
25057 -56166 -85785 -86452 -10002 71406 66788 -4546 -67442 -47152 -8378 68819 110412 69671
25045 69671 32418 61517 92573 46744 -7181 -5652 19689 100376 32654 11822 19350 -35509
25033 -35509 -20122 -11673 -38119 22999 15765 1208 14701 -26356 -53718 -5410 39865 58414
25021 58414 55516 -16417 -30604 39382 36792 47461 30860 66206 61624 -9700 -17477 -14981 -10094
25008 -10094 -16555 -52785 -68111 -115329 -111941 -60917 -33901 -35800 4457 40295 76625 62188
24996F2188o8827l9996L696N724o463O6256K1460k4182o010r4292o2295N4680
24984h8061J19862j6249o461R772J5763J5646m2829n3366N8596N4661l2103k3581
24972A1650j1431o044J9875J6398J3278r3734O846K0342j202J7600j7230n9560
24960h3212k3285n4280J6228k2547J986N5357P5019J21971J9779p7512m3513J2848
24948a161K5707p714r422q053M4323k2536j3901K1357M71m9365r0527l7636Q176
24935a40281N7748J15267L0618L2798J5786l7987m7809J1863l0207k6731m7199
24924f6134O093M2919L0025J7876L88k8249L497K9393n9838j6516m5913k6430
24912a12889l0679N8256Q1703m714j13132j5592N902P7452Q782m1356R6183r943
$$ plain form
24996 62188 -6639 -46635 -42939 -37215 -43678 22578 44038 19856 13846 -80446 -142741 -88061
24984 -88061 31801 15552 9091 18863 34626 50272 7443 -45923 12673 67334 35231 11650
24972 11650 219 -5825 14050 30448 43726 -50008 -43162 -22820 -24022 -6422 -23652 -83212
24960 -83212 -106497 -160777 -144549 -167096 -165110 -109753 -34734 87237 107016 29504 -14009 -1161
24948 -1161 24546 16832 7410 -643 43680 21144 7243 28600 29071 -20294 -110821 -148457 -140281
24935 -140281 -82533 32734 63352 96150 111936 73949 26140 38003 7796 -18935 -66134
24924 -66134 -60041 -17122 12903 30779 31167 2918 6415 35808 -24030 -40546 -86459 -112889
24912 -112889 -143568 -85312 -3609 -8323 -121455 -137047 -131145 -53693 -44911 -86267 9916 -27
24900b7l8968j2486r23M3608j5328j6487k8108J8908J3343k098M5921J6549K6553
24887E0457K2905p3443o7434l2473l384Q2199K7313j4203J3126L1142n660M329
24875C4874j5101J8517k2432l8090L9491J5686q2224o3852P5837L7831l4881p2614
24863a06958m5221j7875K6109P6977J11103J6399j9502n3466k8729L8015J7784
24852A4636M4658j290j9448J1910M0984k9332l1538J1522J2309k8513l0809P4280
24840F9369l1476p3715l0248j0657K2979J1762O8495L3103J6056L5184r575l5973
24828F5304l5687o1366p3215l0098N4265J02049K564m1993m2188J2524J8370O312
24816b3159M7946q112Q810k6722l4877J6238J840J0038K5278M4234m4366m1992
$$ plain form
24900 -27 -38995 -51481 -52404 -8796 -24124 -40611 -68719 -49811 -36468 -38566 7355 23904 50457
24887 50457 73362 -81 -67515 -99988 -103372 -21173 6140 -8063 5063 36205 30545 34874
24875 34874 19773 38290 15858 -22232 17259 32945 -49279 -113131 -37294 537 -34344 -106958
24863 -106958 -152179 -170054 -143945 -66968 44135 60534 41032 -12434 -41163 -3148 14636
24852 14636 59294 58004 38556 50466 91450 62118 30580 42102 54411 25898 -4911 69369
24840 69369 37893 -35822 -66070 -76727 -53748 -41986 26509 59612 75668 110852 101277 65304
24828 65304 29617 -31749 -104964 -135062 -80797 21252 23816 -18177 -60365 -47841 -29471 -23159
24816 -23159 24787 16675 25485 -1237 -36114 -19876 -18036 -7998 17280 61514 17148 -24844
24804b4844J1125J0169J2962l4683k3643M8827P7404L1491k1851k6128m350m4029
24792A2450p2836p7638j6703J02940L4772M7840M20k862k3705L2250k9713p7094
24780f9879j323M7966N5536L9666n2085n9401O37L6094M4134l7690k0871k472
24768a9688P6660N3447M2542K9411o7669j49502n2771K8924n3431j4697J5652
24757a11122K8325L6681M0517N3382p589P061J327r455j950j9179m7829K6840
24745b991Q491O466k7979m7282l8251N3250k2089j5490P2826p9533m889O7955
24733b9516P7065N6108l6879p7195m1324M9230K4379m1242m6444P1366j5693n5240
24721f5385m9000J0292M4352N8725l48M0016K53o7498k7752j644J9266m282J2790
$$ plain form
24804 -24844 -13719 -3550 9412 -25271 -48914 -87 77317 108808 86957 60829 56479 12450
24792 12450 -60386 -138024 -154727 -51787 -17015 30825 31245 28383 4678 36928 7215 -69879
24780 -69879 -71202 -23236 32300 71966 19881 -39520 -38883 -2789 41345 3655 -17216 -19688
24768 -19688 56972 110419 152961 182372 114703 -34799 -87570 -58646 -112077 -126774 -111122
24757 -111122 -82797 -46116 -5599 47783 40194 47255 48582 39127 37177 17998 -29831 -2991
24745 -2991 5500 11966 -16013 -63295 -101546 -48296 -70385 -85875 -13049 -92582 -97471 -29516
24733 -29516 47549 103657 66778 -10417 -51741 -2511 21868 -19374 -65818 5548 -10145 -65385
24721 -65385 -114385 -104093 -59741 -1016 -1364 38652 38905 -28593 -56345 -57989 -38723 -43005 -30215
24708c0215L2009J218n3851J7643J2404J4243m679O5092L7145l5456K473M378
24696F2404J4707j1490P815p0398l2998L685o1071k6734K9516O1894k197l3926
24684e8793l5938n5481K5277P9534L2878m7689M16J3045R257K0769Q130j3876
24672b2471p448j7785n5727J6278n938J1918p429l2865P285N2217L5295J5996
24660a0674L1671l3518k099Q546J3274k7931N4258Q213n7365j4393L5851o530
24648f97n1307m9564m0457L7492N2973j238K8950N9967K1153p0578q357J5796
24636e867o4187p700P3916Q3976O1184P197Q611l0590l9349l3003J4164J3313
24624H1665o7725l6873j3152m898O0974J2774l2104n684N8565K1131k8003j2487
$$ plain form
24708 -30215 1794 3012 -50839 -33196 -20792 -6549 -11228 53864 91009 55553 58026 62404
24696 62404 77111 65621 73436 3038 -29960 -26275 -87346 -114080 -84564 -22670 -24867 -58793
24684 -58793 -94731 -150212 -124935 -45401 -12523 -60212 -59796 -46751 -37494 -16725 -8595 -22471
24672 -22471 -29919 -47704 -103431 -87153 -93091 -81173 -88602 -121467 -114182 -61965 -26670 -10674
24660 -10674 20997 -12521 -14620 -6074 7200 -20731 33527 41740 -15625 -30018 5833 -697
24648 -697 -52004 -101568 -142025 -104533 -51560 -52798 -23848 36119 57272 -13306 -21663 -5867
24636 -5867 -70054 -77754 -3838 80138 141322 148519 157130 126540 87191 54188 68352 81665
24624 81665 13940 -22933 -36085 -40983 19991 32765 661 -5023 53542 74673 46670 34183
24612C4183L944j6530n4974k1840j7783J3830j6808K5019l1729M8506K2720N471
24600e991j4037J3844L1981m1325j176M2126j4653J82k6915J2917M555l8129j1677
24587d8298n882P6568m8544L9695M3207Q058O9350m8547r935o6499o0266k6198
24575g7291N5098J5620j3547r058K7446k1153L4704P8487K6869o5865r780j9614
24563B1916K1855k8572k0422K4086k0245k6733k2651j242J0911o180L1925J4174
24551a178J9129l231k5106N868j7297N4085m3676n9956K5588M6543K2566j883
24539B1452k8549K0292n456m6262N003k8639k1915K6096L0483K5016k3527l4082
24527f0088p8562m3199O2140M9016R5795k4817l8118M720L5494M8969K0225m3409
$$ plain form
24612 34183 38127 21597 -33377 -55217 -73000 -59170 -75978 -50959 -82688 -34182 -11462 -5991
24600 -5991 -20028 -6184 25797 -15528 -16704 25422 10769 10951 -15964 -3047 1508 -36621 -48298
24587 -48298 -54180 22388 -26156 13539 56746 64804 134154 85607 75672 9173 -51093 -77291
24575 -77291 -22193 -6573 -20120 -29178 -1732 -22885 11819 90306 117175 51310 41530 21916
24563 21916 43771 15199 -5223 18863 -1382 -28115 -50766 -52008 -41097 -47277 -15352 -1178
24551 -1178 17951 14720 -10386 -4518 -21815 32270 -11406 -71362 -45774 769 23335 21452
24539 21452 -7097 13195 7739 -38523 -33520 -62159 -84074 -57978 -27495 -2479 -26006 -60088
24527 -60088 -138650 -181849 -119709 -70693 25102 285 -37833 -33113 2381 51350 71575 28166
24515B8166k0769m6249k2485L1960l6553k2548J2797M5156o754q6637n871J2118
24503a17669L1569o838J7811Q7368M6771k6349l0415k9652k2600p0391m1778O6555
24491i5618P8424L3514K4372p61J3448l9745n7794J0627L189O1429k7589j4177
24479a0681q0545k5173K5475J8791p80M4713k9114j132R0461N6222m8199l2669
24467G369P5696K3852J9818n8291q0956J3414q287K5055K8612K5753P659m2362
24455C7332q858L0410o97n4793J5784K1980M3872J861q5146k8660l405R45n0470
24442g9845O1154Q3546n528p0275n4783K0431m1166P752R7252j2766L6141L3988
24430G5901q639m4532o7848L5481O1323J232m0325k4021N7027M3877l2972n9615
$$ plain form
24515 28166 7397 -38852 -61337 -29377 -65930 -88478 -75681 -30525 -37279 -123916 -129787 -117669
24503 -117669 -86100 -92938 -75127 12241 59012 32663 2248 -27404 -50004 -120395 -162173 -95618
24491 -95618 -17194 16320 40692 39931 53379 13634 -44160 -33533 -30344 31085 3496 -10681
24479 -10681 -91226 -116399 -90924 -72133 -72913 -28200 -57314 -58446 32015 88237 40038 7369
24467 7369 83065 106917 126735 68444 -12512 902 -7385 17670 46282 72035 79694 37332
24455 37332 28474 58884 58187 3394 19178 41158 85030 86891 1745 -26915 -30320 -29375 -79845
24442 -79845 -18691 64855 59327 -10948 -65731 -45300 -86466 -78714 18538 5772 41913 75901
24430 75901 67262 22730 -45118 -9637 51686 52918 12593 -11428 45599 89476 56504 -3111
24418c111j077q426J5505j2017K205j8436k4507K176J8311j2804l0507n6474J931
24405a27231N4876j3043M8754j2201M0809M0965M432M0169L2336J4078l6019k5815
24393F2110N945k5669m5868k3586n4153n5164L2087M3637J0893K5734L9860M303
24381B0129K5677n466J3618N2153n9142m5705p3736M757l9521O2992N8571n0566
24369c6239k0465N660j6466O008J5825j2454k1516k8222R305N7352L9533J207
24357d72N8084k678l1213Q267J5495J5890j0098m1766J8020k075K3958N817K8607
24344H5836k775M0163J8857m3484j944j3864m6830j34349j5433Q9608L2345P958
24332A6088n6270r3809L956M3438L9755K0341L0498J7204l4040q003L7575j7889
$$ plain form
24418 -3111 -4188 -12614 2891 -9126 -6921 -25357 -49864 -47688 -29377 -42181 -72688 -129162 -127231
24405 -127231 -72355 -85398 -36644 -48845 -8036 32929 37361 77530 109866 123944 87925 62110
24393 62110 68055 42386 -3482 -27068 -81221 -136385 -104298 -60661 -49768 -24034 15826 20129
24381 20129 45806 40340 53958 106111 46969 1264 -72472 -67715 -107236 -44244 14327 -36239
24369 -36239 -56704 -51044 -67510 -61502 -45677 -58131 -79647 -107869 -98564 -41212 -1679 -472
24357 -472 57612 54934 23721 31988 47483 63373 53275 11509 29529 27454 51412 57229 85836
24344 85836 83061 123224 142081 98597 96653 82789 35959 -98390 -113823 -24215 8130 16088
24332 16088 -40182 -133991 -130035 -86597 -46842 -26501 3997 21201 -12839 -20842 16733 -1156
24320a156l3467J432N2765J05129J7473o91k3138j9013J632k3975l5317M791N3887
24307A00352j771r8098l7415j4242J174k5939M7662N464K4440K4025k3106n7010
24295e4464J3209K9440O5180M5670l5494q7672q8350O035M5862O9205M1311K3753
24283G3685m0327m5189L7207K4964J1150m6185j07582M216K3520j5723L2300o5334
24271a13298n6895L1606O9137q197K4234R1537j4009o6172l3862M2839p954l833
24259d4867N4378M4064l7329J4691N6009l9024M616k5607K6035m4067K7385k1617
24247A4667l409O7818K0721l9560q960K5784k6508p3000k5401O6117J9236n652
24235C1853l2538J7463K7324m744J1699k6696l0862M6988m1269k1937M3590P0995
$$ plain form
24320 -1156 -34623 -33191 19574 124703 142176 141485 118347 99334 100966 76991 41674 46465 100352
24307 100352 98581 483 -36932 -51174 -50000 -75939 -28277 -22813 1627 25652 2546 -54464
24295 -54464 -41255 -11815 53365 99035 63541 -24131 -112481 -106446 -60584 8621 49932 73685
24283 73685 33358 -11831 25376 50340 61490 15305 -92277 -88061 -64541 -80264 -47964 -113298
24271 -113298 -170193 -138587 -69450 -77647 -53413 38124 24115 -42057 -75919 -33080 -41034 -44867
24259 -44867 9511 53575 16246 30937 86946 47922 52538 26931 52966 8899 36284 14667
24247 14667 11258 79076 99797 60237 51277 77061 50553 -22447 -47848 18269 37505 31853
24235 31853 -685 16778 44102 39358 51057 24361 -6501 40487 -782 -22719 20871 91866
24223I1866l2890k7341k2625N1321J4234N46j9293m1026l1748m1276k5043K7330
24211e5945L1179J8569J0497q537K0970l6641j7726Q2732k1797m6136J0430J0363
24199b042k4271M7695M1128L3948l9955j6651P238Q894q5245k3760K8930L2545
24187H454J6858l5560m9513j07349p5945M9189Q6284N4615k339L5084m0589m4590
24175a05401k2838j5068J0251j0482L6766M0076Q9413L7612J4051l5084m6552
24164g256l6574N4084M612n4739O525K2905N7011jl8154k8484O3710R5909k5404
24151A14144j14768n2142K587Q861m907K8579k4424Q3706J8285j521L5670k09
24139I3861M1273Q749r1039o465k7963j2205K9801p326j5408p0333M5783N5820
$$ plain form
24223 91866 58976 31635 9010 60331 74565 75111 55818 14792 -16956 -58232 -83275 -55945
24211 -55945 -24766 -6197 4300 -4237 16733 -19908 -37634 45098 23301 -22835 -12405 -2042
24199 -2042 -26313 21382 62510 96458 56503 39852 47090 55984 -29261 -53021 -24091 8454
24187 8454 25312 -10248 -59761 -167110 -243055 -193866 -107582 -52967 -55306 -20222 -60811 -105401
24175 -105401 -128239 -143307 -133056 -143538 -106772 -66696 22717 60329 74380 39296 -7256
24164 -7256 -43830 10254 14866 -39873 -33348 -10443 46568 46567 8413 -20071 43639 139548 114144
24151 114144 -624 -52766 -50179 -41318 -46225 -17646 -42070 41636 59921 58400 94070 93861
24139 93861 135134 143883 52844 46379 18416 6211 36012 28686 13278 -57055 -11272 44548
24127D4548p4257p2835M0838O7964Q367l0989j0109j2468O6268N7995L9582j9187
24115A05717j2709N9593J5037p1539k9346n716o2518o4223J0439J441m254l6166
24103i4244o883K7095O5008L4784o232j6683J5170K0575K618o2739l8810k7008
24091h7349j1726P2434M8318L2752k7660n6501n3516l5350J7961K9361j2259m8040
24079a31575M6129Q2551j8362m3066p845J5031L2905K537n5326p081P9569k2988
24067b7521k8907r954O0908J5691M1325o7587k478J4644L2087j2316k6041O963
24055c186N3582k1881j0445j9926N8675O3066m253o4159N33K1726r0054j2479
24043b8801L8963m8652n4910N8646M5876M3984J1931J0336n0975q977Q490j3856
$$ plain form
24127 44548 -29709 -102544 -61706 6258 14625 -16364 -26473 -38941 27327 85322 124904 105717
24115 105717 93008 152601 167638 96099 66753 61037 -1481 -65704 -55265 -53824 -58078 -94244
24103 -94244 -101127 -74032 -9024 25760 19528 2845 18015 38590 41208 -21531 -60341 -87349
24091 -87349 -99075 -26641 21677 54429 26769 -29732 -83248 -118598 -100637 -71276 -83535 -131575
24079 -131575 -85446 -2895 -21257 -64323 -72168 -57137 -24232 -21695 -77021 -84102 -4533 -27521
24067 -27521 -56428 -66382 -5474 10217 51542 -16045 -18523 -3879 28208 15892 -10149 -3186
24055 -3186 50396 28515 18070 -1856 56819 119885 115632 51473 52006 73732 -16322 -28801
24043 -28801 10162 -38490 -93400 -34754 11122 55106 67037 77373 26398 17421 25911 12055
24031A2055n1767o522O6571j2244j8897k957o8005K9479o6337k1717O2814M2992
24019c4535J7041L2302N687j4206J2965M5905J0173m5614m6648o5373J6915K7494
24007c7894J2221J5397L6740l9633M2979Q3127o3608k5635n4834K5730O5847M698
23995F5135k1395k7370j0527o8613N8594p821J716o5411r3575j9693N3086L9400
23983i6474J20235J4141m9696m208j3147k2602L5536j255l4542m448q034l1879
23971i6373N2106K3660l3691l4620l1381K9270M4500k0628L5167Q148k139J3841
23959a2140L5164N5219J498m4444n5757K8889l8782n6657M6690J0311k8216O6278
23947H053N8499O680r941l7071M8363l6864j6669Q784k9730Q455P223R637J4916
$$ plain form
24031 12055 -39712 -46234 20337 8093 -10804 -13761 -81766 -52287 -118624 -140341 -77527 -34535
24019 -34535 -17494 14808 20495 6289 19254 65159 75332 29718 -16930 -82303 -65388 -37894
24007 -37894 -25673 -10276 26464 -13169 29810 112937 49329 23694 -31140 -5410 60437 65135
23995 65135 43740 16370 5843 -62770 -4176 -11997 -10281 -75692 -169267 -188960 -135874 -96474
23983 -96474 23761 37902 -11794 -16002 -29149 -51751 -16215 -17470 -52012 -56460 -64494 -96373
23971 -96373 -44267 -20607 -54298 -88918 -120299 -91029 -46529 -67157 -31990 -23842 -25981 -12140
23959 -12140 23024 78243 79741 35297 -20460 8429 -30353 -87010 -40320 -30009 -58225 8053
23947 8053 66552 73232 63291 26220 74583 37719 21050 29834 104 8559 15782 25419 40335
23934D0335J3770k5881K0990K9750j9783L011k6477m9996N561P0245M1933m7532
23922E5926j14598L7919L3641K139J866l7144L524N397L3925R01n9263l8867J1337
23909f3297M0598J9972k2164J7768K5366k7556r655K7499O7215K7211p335l8165
23897E7457l2128m1400J6852J4119O968j8001N080O8853n697q2636o1007k6125
23885i7665K2974M1889k6184p325j6290k2715k664K2986k22l2758M5909J5393
23873e6672N5600l6767p6249P6241Q5560p712q1429k4866K4775J9206R547R368
23861c398M3557L8905L9995k2180n6579j3729M3536o596j2271l7183j2690M8136
23849D9503k6962k4629l6569j8325j1874N4982N8M1602L2490r8078o2380J1320
$$ plain form
23934 40335 54105 28224 49214 78964 59181 62192 35715 -14281 -8720 61525 103458 55926
23922 55926 -58672 -20753 12888 15027 16893 -20251 -16727 -11330 22595 23496 -35767 -74634 -63297
23909 -63297 -22699 -2727 -24891 -7123 18243 -9313 -18968 8531 75746 102957 95622 57457
23897 57457 25329 -16071 781 14900 21868 3867 8947 77800 72103 -10533 -71540 -97665
23885 -97665 -74691 -32802 -58986 -66311 -82601 -105316 -107980 -84994 -85216 -117974 -72065 -56672
23873 -56672 -1072 -37839 -114088 -37847 47713 40001 -41428 -66294 -41519 -22313 -12766 -3398
23861 -3398 40159 79064 119059 96879 40300 26571 70107 63511 51240 14057 1367 49503
23849 49503 22541 -2088 -38657 -56982 -68856 -13874 -13816 27786 60276 -37802 -100182 -88862
23837h8862J3729P463L0003M2928J214l6993q580M3276j7101j9023j3748M5706
23825A2N8396j7351j6811k7464r4556p075K1008J3526J6057L3488j2041j660k5802
23812f0273N9805J8961n0499j3990M5034J8532R600j9685m160M1557o5106J8035
23800b189M4278j4646r9141N6067J6523L6889K3313m4367o4759m9689J6501L2760
23788d8460m450n9710O3960R1146O3340o7089m0460m5801N3432O4149J076p8016
23776f883j0877j3249J7608L9488O9268J4716k1486j6792m001q822p9345o0628
23764h1003L4198M7088O2142P5907k6038p6343m5909Q552N1232J0963k8450L682
23752C6021k9936M985J8370K7962L0582k1045j2129L7248J2861l2472r6814j3987
$$ plain form
23837 -88862 -75133 -67670 -37667 5261 6475 -30518 -39098 4178 -12923 -31946 -45694 12
23825 12 58408 41057 24246 -3218 -97774 -104849 -83841 -70315 -54258 -20770 -32811 -34471 -60273
23812 -60273 -468 18493 -32006 -45996 -962 17570 27170 7485 3325 44882 -20224 -2189
23800 -2189 42089 27443 -71698 -15631 892 37781 61094 16727 -48032 -97721 -81220 -48460
23788 -48460 -52910 -112620 -48660 42486 105826 38737 -1723 -47524 5908 70057 71133 -6883
23776 -6883 -17760 -31009 -13401 26087 95355 110071 88585 71793 67792 58970 -20375 -81003
23764 -81003 -46805 283 62425 138332 112294 35951 -9958 -1406 49826 60789 32339 36021
23752 36021 6085 11070 29440 57402 87984 66939 54810 92058 104919 72447 -24367 -38354
23740c8354M3025j7024J3530j6433l7238L9106K7589Q739l1553q974j8613j941
23728c8141o5379L0558R835m1590o253L6062L7537P129j7624M937l3552L1056
23716d5425M1654m751J1338j8396K1761J9788J4284K1699o9272n4334p915q034
23704g7603j9540J6676K3060M5338m387M1848M6709K1444K2189o1421k6971J8215
23692D5557K1482m2482l9012K0592j9792J9952r474J835M4682O6242j6714K2852
23680A15720M962j9885o8171p9278K4043j5203L7371M336k1319J3773K8888m7652
23668b2415q327n902j1074q7103O5458M3306l2390p267N5504J08219J06812o615
23656A98206m6116m0211k3612q3654l9378j1157N2433L1946O4223l1481q0830
$$ plain form
23740 -38354 4671 -12353 1177 -15256 -52494 -13388 14201 22940 -8613 -17587 -36200 -38141
23728 -38141 -103520 -72962 -63127 -104717 -110970 -74908 -37371 -30242 -47866 -42929 -76481 -45425
23716 -45425 -3771 -8522 2816 -15580 6181 25969 40253 61952 -7320 -61654 -69569 -77603
23704 -77603 -97143 -80467 -57407 -12069 -16456 25392 72101 93545 115734 54313 27342 45557
23692 45557 67039 24557 -14455 6137 -13655 6297 -3177 -1342 43340 109582 92868 115720
23680 115720 120682 100797 32626 -46652 -22609 -37812 -441 3895 -17424 -3651 25237 -22415
23668 -22415 -30742 -36644 -47718 -134821 -69363 -26057 -58447 -65714 -10210 98009 204821 198206
23656 198206 152090 111879 88267 4613 -34765 -45922 6511 38457 102680 71199 -9631
23645i631n3924J2944N4085j9993J9600M8704k1864L2875l969J923P215L380L0352
23632A01697J1644l6680o0190M1820n8899k5256k6316j7442J07602N0021M9594
23621A37595K3599l8689m0972k8976l5131j2929J6008o2415l5751j7023P9483
23610a5201L165j4498p0669j777J02809M5226r104K2482k8723j6073M145l3329
23598a1547l8579J0866Q8269j4088m9331j3219p200J1245M4265j2579l4430n2088
23586g8416k5046J3958M2780L5563l5578l7268M353K3929J2913J6117O661m2481
23574f2515K1227L3344P4771L8284k5933m3153k3716J5763m438j5205J2227J8598
23562C9254L2192N5772l1210k5707k218l1193q1177k8857j1911K0577m953j9234
$$ plain form
23645 -9631 -63555 -50611 3474 -16519 3081 51785 29921 62796 58827 60750 67965 71345 101697
23632 101697 113341 76661 16471 58291 -608 -25864 -52180 -69622 37980 88001 137595
23621 137595 161194 122505 81533 52557 17426 4497 20505 -41910 -77661 -94684 -15201
23610 -15201 -12036 -26534 -97203 -98980 3829 49055 39951 62433 33710 17637 21782 -11547
23598 -11547 -50126 -39260 49009 34921 -14410 -27629 -34829 -23584 20681 8102 -26328 -78416
23586 -78416 -103462 -89504 -46724 -11161 -46739 -84007 -79654 -55725 -42812 -26695 -20034 -62515
23574 -62515 -41288 -7944 66827 105111 79178 36025 12309 28072 23634 8429 20656 39254
23562 39254 71446 127218 96008 70301 68083 36890 -44287 -73144 -85055 -64478 -69431 -88665
23550h8665M8715O2869k9279J1412n161K1482j5953M7498o732j01817n3599J5522
23538i3708j2390K819J1545J8757M1812P752k0788m5761J4248n708M4767R0468
23526E3813L2445o1287m0813m1547m096K0888j8357j0038P7426Q089m5835N3994
23514B4682j7960l7525k5448k7726M269N1582K4876K3514M0663j0885l4614q1912
23502f6484l9362L6100J6273O471k3218k048K1790m9930j608J2820O2632P8410
23490E1846j306j9170k9539l4009J938J7700M7773K4031o7685j4029r25j8439
23478d1814R670M9907J4520O531L6349K6319p9731M346j8644l7084L2060K4134
23466B6563j7665L458r041o2381k0247O149q756o576J5425L3586R9329N2270K0174
$$ plain form
23550 -88665 -39950 22919 -6360 5052 -109 21373 5420 52918 46186 -55631 -109230 -93708
23538 -93708 -106098 -103279 -91734 -72977 -31165 -23413 -44201 -89962 -75714 -81422 -36655 53813
23526 53813 86258 24971 -15842 -57389 -61485 -40597 -58954 -68992 8434 16523 -29312 24682
23514 24682 6722 -30803 -56251 -83977 -79708 -28126 -3250 20264 60927 50042 15428 -66484
23502 -66484 -105846 -69746 -53473 -47002 -70220 -72268 -50478 -100408 -102016 -89196 -26564 51846
23490 51846 50540 31370 1831 -32178 -30240 -12540 35233 59264 -8421 -22450 -23375 -41814
23478 -41814 -32144 17763 32283 38814 75163 101482 21751 26097 7453 -29631 2429 26563
23466 26563 8898 12356 3315 -59066 -79313 -73164 -81920 -88496 -73071 -39485 59844 112114 132288
23453A32288o845m6849r3688k5250l5270l7795L4454L3915M9620K9087j6706M0902
23441E7863J1933k8851m9046Q60L3057K2836q6692j12495j0632O7413M4691q0346
23429a29409l0677k5697P4852O1577L5888K4482l8885l8467K5228N4613L9881
23418E3386J7488m7391k6441L6812j7876n3954P8282k6337L1821L9082j01961
23407a7089k0188L1455l435j009l282L7935O5494l8448r3613l7889o580P6988
23395i661O4190r287N4063n2219p4217l6421J6072l3834n6876k6605R1228K5074
23383d8493J4205L3492O8767R9572K4900p8253o8945l7569m2453k9796K7668n771
23371d2676o6861m2948l401Q1259L3979P3873p3413k8778L6798J1945L4835J5077
$$ plain form
23453 132288 125443 78594 -15094 -40344 -75614 -113409 -78955 -45040 4580 33667 16961 57863
23441 57863 69796 40945 -8101 -7241 25816 48652 -38040 -150535 -161167 -93754 -49063 -129409
23429 -129409 -160086 -185783 -110931 -49354 -13466 11016 -27869 -66336 -41108 13505 53386
23418 53386 70874 23483 -2958 33854 15978 -37976 40306 13969 45790 84872 -17089
23407 -17089 -37277 -5822 -9257 -10266 -13548 24387 89881 51433 -42180 -80069 -86649 -9661
23395 -9661 54529 45242 99305 47086 -27131 -63552 -47480 -81314 -138190 -164795 -73567 -48493
23383 -48493 -34288 -796 67971 167543 192443 114190 45245 7676 -34777 -64573 -36905 -42676
23371 -42676 -109537 -152485 -155886 -74627 -40648 33225 -40188 -68966 -32168 -20223 14612 29689
23359B9689q921k5737n9938J7455M596K4378m8115L318l141L6019K4146J2585
23347F334n0246k4668j8861L3538L4252J4350J2647L7752n064o9801l4818L5149
23335b9436m644k7535J3565O0780K3262J0779j0892j2895n457N5207N0354p9037
23323D4051p5813j3914l8869m1974K3642j9079M3545Q414M954R816O6121m1381
23311c0487k930j0310Q739k701k8155l6457k2326J6632K470K869K7543J2881K7575
23298c4657J0021l4985n8256m3107K6302p868N1235M6070J0833k772m4103K3930
23286e7357K5532L8959p2198m1793l312O2093J1038k5375O756J2597J9881P529
23274a5650M665p39O582N6268J644p0869j00949N4243N3099M5470M5501q2599
$$ plain form
23359 29689 20768 -4969 -64907 -47452 -42856 -18478 -66593 -63275 -66416 -30397 -6251 6334
23347 6334 -43912 -68580 -87441 -53903 -19651 -5301 7346 45098 40034 -29767 -64585 -29436
23335 -29436 -34080 -61615 -48050 12730 35992 46771 35879 22984 17527 72734 123088 44051
23323 44051 -31762 -45676 -84545 -126519 -102877 -121956 -78411 -69997 -65043 -55227 10894 -30487
23311 -30487 -33417 -43727 -34988 -37689 -65844 -102301 -124627 -107995 -105525 -102656 -75113 -62232 -34657
23298 -34657 -24636 -59621 -117877 -160984 -134682 -142550 -91315 -45245 -34412 -37184 -81287 -57357
23286 -57357 -31825 7134 -65064 -106857 -110169 -48076 -37038 -62413 -55657 -43060 -23179 -15650
23274 -15650 -10985 -11724 -5142 51126 52770 -18099 -119048 -64805 -11706 33764 79265 -3334
23262c334j9151N8763K3189j4877R814l1048k7351k7924m3136P4274M4747l0622
23250A3344o0573l6506l704j7590R253M7333R758k970M4236j911K5700j2551N062
23237A8881n2230P298n697k8940Q879K3580J0805O6762l374L1887k200j4283K9900
23224I1268l8509n5660J0271N679J0759L4311k2552r1409k9998L8302M9273J3076
23212A4811J2177K7474L3777k5327L6569M131r0152l8117k4873J7629N3447m9203
23200b7657l9044m343K5045M3115K7800p9897k0059k4518m1468p386N9729N7049
23188c1634j8356N5565L0935l5240p5179J1982P3868L4828J9852l1717N8274M290
23176I7468k386k7762k9281k3258l8920J2895O6443J5152l1546j4942O8905O3766
$$ plain form
23262 -3334 -22485 36278 59467 44590 54404 23356 -3995 -31919 -75055 -781 43966 13344
23250 13344 -47229 -83735 -87439 -105029 -95776 -48443 -38685 -41655 2581 670 26370 13819 18881
23237 18881 -33349 -26051 -31748 -60688 -51809 -28229 -17424 49338 45964 77851 75651 61368 91268
23224 91268 52759 -2901 7370 13049 23808 58119 35567 -55842 -85840 -47538 1735 14811
23212 14811 26988 54462 88239 62912 99481 103612 13460 -24657 -49530 -31901 21546 -27657
23200 -27657 -66701 -71044 -45999 -2884 24916 -54981 -75040 -99558 -141026 -148412 -88683 -31634
23188 -31634 -49990 5575 36510 1270 -73909 -61927 11941 46769 66621 34904 93178 97468
23176 97468 95082 67320 38039 14781 -24139 -11244 55199 70351 38805 23863 92768 156534
23164A56534j485p4966k30P094n7905J3106R337j5440p4661l9420K8097O1833
23152A1894L0395K8424k8475n8414l8881L0155n800N4478J8573n6570l8292j7404
23140f9917K9868j04j0954L8988N4065J1141k8078q7907l0939m8724j1716J36186
23128a8091O4259N7310r664q4797l8615P2158O2120L748k2225j1337o0040l9988
23116b5162m937j094j7300M4057J4633J5997M396m7189k9885J7869o85m6766j5738
23103i1804J07681L9285K40j4679J0204N822l1334l9564O8184k7629n5648J9841
23091i401k0568p181O0886L3282L924k3621k7517m5934k3398M4480Q2559j3012
23079E4499l7739k2429M31j2623J7872J699j6623L9796Q979L1040K4624n8451
$$ plain form
23164 156534 155049 80083 79853 86947 29042 42148 51485 36045 -38616 -78036 -49939 11894
23152 11894 42289 70713 42238 -16176 -55057 -24902 -30702 23776 42349 -14221 -52513 -69917
23140 -69917 -40049 -40153 -51107 -12119 41946 53087 25009 -62898 -93837 -142561 -154277 -18091
23128 -18091 46168 103478 93814 9017 -29598 42560 104680 108428 86203 74866 14826 -25162
23116 -25162 -30099 -31193 -48493 -4436 10197 26194 30590 -16599 -46484 -28615 -29300 -76066 -91804
23103 -91804 15877 55162 55402 40723 50927 56749 25415 -14149 54035 26406 -29242 -9401
23091 -9401 -29969 -37150 23736 57018 60942 37321 9804 -36130 -59528 -15048 67511 54499
23079 54499 16760 -5669 -5238 -17861 11 1710 -14913 24883 33862 64902 89526 31075
23067C1075L7819j0447k5191n6854M355K68J1103J9941k2098k5058M0124K2640
23055B7677o8082l0499L1422K8069N9354j4973J8446M2882M217j2585k3285l1080
23043C1563j0050l2740m3746j3778L1639L4242K4461j3350L6872l382J9576k407
23031E8900j23749j3878J13057M1586L9854m5564l2348M862Q5872l6998l6532
23020E5062K6243M9384l8296n9938o4105L0591O1690j1750m1435l520k6587l5429
23008e8090o1160j8261M6949N9053K9386j5902L8323J8131j8913j9468l8100M9258
22996A1206O0581n7315M134q0495K906k287m1321P17N6017P113M942K7539L6683
22983C0420R2950K6856p420r5628j39982K1793O0050l8296Q6771M6558k4989q760
$$ plain form
23067 31075 68894 58447 33256 -23598 -19243 -18975 -7872 12069 -10029 -35087 5037 27677
23055 27677 -40405 -70904 -39482 -11413 47941 32968 51414 94296 98513 85928 62643 31563
23043 31563 21513 -11227 -54973 -68751 -37112 -2870 21591 8241 45113 41731 61307 58900
23031 58900 -64849 -78727 34330 75916 115770 70206 37858 42720 128592 91594 55062
23020 55062 81305 130689 92393 32455 -31650 -1059 60631 48881 7446 3926 -22661 -58090
23008 -58090 -119250 -137511 -90562 -31509 -2123 -18025 20298 38429 19516 48 -38052 11206
22996 11206 71787 14472 18606 -61889 -58983 -61270 -102591 -101874 -45857 -38744 -33802 -6263 30420
22983 30420 123370 150226 142806 47178 -92804 -71011 -10961 -49257 37514 84072 59083 50323
22971E0323k2616l4209L0003k6264j7560K1011j117k1975M242N5627k28j0653
22959B6584M2948j7685l7310j485l5630k1632K320j60r78L8299p682n4290l8643
22946a05344n6926L167K4263L3430M465l6501K7548N7352P0049j1336m8795m6101
22934h4729J7041j6550k8213N2138k4009M3019M7349J3524l4060L5377K0479l8830
22922B536M164L3026k3952j5566j9318r996J9781N992l2206j4385q392J45805
22910H7489J4804r2736j08353L1533O8616l5752L0947k9524n278r633M4K5306
22898b2537L9262L1844r842K4005K5647k8442m030L1757l2842l6760O863p758
22886A7167J5836j6765J7011l584O450o9475n2061k3137O7559M0779o9032n5565
$$ plain form
22971 50323 27707 -6502 23501 -2763 -20323 688 -429 -22404 -18162 37465 37237 26584
22959 26584 69532 51847 14537 13052 -22578 -44210 -41890 -42050 -43028 -4729 -12411 -66701 -105344
22946 -105344 -162270 -159103 -134840 -101410 -96945 -133446 -105898 -48546 21503 10167 -38628 -84729
22934 -84729 -67688 -84238 -112451 -60313 -84322 -41303 6046 19570 -14490 20887 41366 2536
22922 2536 6700 39726 15774 208 -19110 -29106 -9325 -3333 -35539 -49924 -58316 87489
22910 87489 102293 9557 -98796 -67263 1353 -34399 -3452 -32976 -38254 -47887 -47843 -22537
22898 -22537 16725 48569 38727 62732 88379 59937 55907 87664 54822 18062 24925 17167
22886 17167 33003 16238 33249 29665 36115 -33360 -85421 -108558 -40999 -220 -69252 -124817
22874a24817M3977L1320J4126j9947J4887J3307L544L6330l6815n2912k3734j3326
22862a14060k5496l7101j6999M7097O7901R2232j7729o232N1460J142m2556j9358
22850a9699l7512J4779n839J9019J2169L7322l7670n6405m6751Q0053Q1923j2041
22838B9348l4656N1132m9138J2515M6249l2159n6406l2492m616n9362J5183r585
22826a23987N1693O1277L8694L667K899q935l128L2807k1349m9827k8662m0463
22814h5314J9917M4592J0123O9544R3836J7398m1011r9902p9289n4090N52M8018
22802e5626K6779j5085O489k2569K2666O2418M3356J5070m9667j4825K3471p3391
22790c0914p93L6397K826l8660N08K1330o44p658l0363l0722J8915M1796m2098
$$ plain form
22874 -124817 -80840 -49520 -35394 -55341 -40454 -27147 -23603 12727 -24088 -77000 -100734 -114060
22862 -114060 -139556 -176657 -193656 -146559 -78658 13574 -4155 -10387 41073 42215 -341 -19699
22850 -19699 -57211 -42432 -48271 -29252 -17083 20239 -17431 -73836 -120587 -40534 41389 29348
22838 29348 -5308 45824 -3314 9201 55450 23291 -33115 -65607 -70223 -129585 -114402 -123987
22826 -123987 -72294 -11017 27677 31344 34243 25308 22180 54987 33638 -16189 -44851 -85314
22814 -85314 -65397 -20805 -10682 58862 152698 170096 129085 29183 -50106 -104196 -103644 -55626
22802 -55626 -28847 -43932 -37443 -60012 -37346 25072 68428 83498 33831 19006 42477 -30914
22790 -30914 -31707 4690 7516 -31144 -30636 -9306 -9950 -17608 -47971 -78693 -59778 -17982 -60080
22777f0080m130J895l5273R211n8005k0520j429M3492J8064L9623l621p061K142
22764g5692m875O321J2140N8228k0580k4939L8729J7237j4807m7570o5815l4520
22752a56143r082J3707K5747N3930M8879K0406J5053Q6518K1912q2368J1983J78
22740E0720K0577r041l1220l315k1211m5715K1734m3646l4381K3716M0436r646
22728d0992l7056J4417R04P2217L3301j3557l7956q20Q323K3892n5697j0315J6557
22715b6782p4249j4714M4116J03231P5924P750L0748K3169l743n4906o2434R553
22703E7663K526k4835n2161O821n7396l3913J1970M8452L9840N391m3114l9763
22691g8519J6818m3212L4527P9778k4538m3465l5348L8370L2943k1961n0573K1514
$$ plain form
22777 -60080 -64210 -62315 -97588 -88377 -146382 -166902 -168331 -124839 -106775 -67152 -70773 -77834 -75692
22764 -75692 -80567 -74246 -62106 -3878 -24458 -49397 -10668 6569 -8238 -55808 -121623 -156143
22752 -156143 -165225 -151518 -125771 -71841 -22962 -2556 12497 99015 120927 38559 50542 50720
22740 50720 71297 62256 31036 27721 6510 -39205 -17471 -61117 -95498 -71782 -31346 -40992
22728 -40992 -78048 -63631 -62727 9490 42791 29234 -8722 -9542 -1219 22673 -33024 -43339 -26782
22715 -26782 -101031 -115745 -71629 31602 107526 115276 146024 169193 165450 110544 48110 57663
22703 57663 60189 35354 -16807 -9986 -67382 -101295 -89325 -40873 -1033 4358 -38756 -78519
22691 -78519 -61701 -104913 -70386 9392 -15146 -58611 -93959 -55589 -22646 -44607 -95180 -73666
22679g3666P110l3498M4993Q155K269N9810M2287P403j8429l3851n5467m2669
22667h5553J9811P9097R9935k432j562J9669Q43L7567o7584p5249o3011m2358
22655h0827o520L1649k3267k797L8904j4413L7715O58Q464p6204j5316P4544L6146
22642H736N5447m024j7090N373l3598K1454k8103r957l1368n484M8045K2464k9495
22629B400l0594m0211k0696j6182K9926M9509K1686n9364m341K1806J8025N5112
22617B7076k7291q210k8737N196N3297j7008n52N3851n7842K7200j4051l0578
22605a7649k0437j410M7801M7464M2886k4181N915k193n219j2939m1612j3465
22593D961m282J124M9539K0888M1903O25m3146l7183j0141N4157o863o579m2564
$$ plain form
22679 -73666 -66556 -100054 -55061 -46906 -44637 15173 57460 64863 46434 12583 -42884 -85553
22667 -85553 -65742 13355 113290 110858 109296 128965 129808 167375 99791 24542 -38469 -80827
22655 -80827 -87347 -55698 -78965 -81762 -42858 -57271 -19556 -18898 -10434 -86638 -101954 -27410 8736
22642 8736 64183 60159 43069 48442 14844 36298 8195 -1762 -33130 -38614 9431 31895 2400
22629 2400 -28194 -68405 -89101 -105283 -75357 -25848 -4162 -63526 -67867 -46061 -28036 27076
22617 27076 -215 -8425 -37162 -31966 21331 4323 3771 57622 -220 26980 12929 -17649
22605 -17649 -38086 -39496 8305 55769 98655 74474 80389 78196 72977 60038 18426 4961
22593 4961 679 1803 51342 72230 114133 114758 71612 34429 24288 78445 71582 65003 22439
22580B2439N1057J638l0218k1618m497N506k8333L8086K7389j1552p3330r2570
22568a16003o604O2559L5227j6706J169L0986l5266n2800L9702M9521j3775k0649
22556d2639k0109k3021j778o0306K1217P9013L2195M1905l21m2262l9316J0081
22544d5341R987r034K1128l5401M8365j1493K1606R372k504l8332L0676L076j421
22531F84l2031J9818L8178K0113k3173Q400n9146j3561K8358L4256J742l1462
22519g824l489K0646K7010n5229j02878J6104R5237J00995O9969j4710k5074j6953
22507A03804K5499n931k6607m8634n4189j5032L1772K3366q416j3283L013n4790
22495c9428r9320R9898K3193K7132o109r638M4319l5596n7425J7444N1683N8038
$$ plain form
22580 22439 73496 75134 44916 23298 18801 24307 -4026 34060 61449 49897 -23433 -116003
22568 -116003 -122607 -60048 -24821 -41527 -40358 -9372 -44638 -97438 -57736 -8215 -21990 -42639
22556 -42639 -62748 -85769 -87547 -147853 -126636 -47623 -15428 26477 26156 -16106 -55422 -45341
22544 -45341 -35354 -44388 -23260 -58661 -10296 -21789 -183 9189 6685 -31647 -971 2105 684
22531 684 -31347 -11529 26649 46762 23589 31989 -27157 -40718 -12360 21896 23638 -7824
22519 -7824 -11313 9333 36343 -18886 -121764 -105660 -10423 90572 160541 145831 120757 103804
22507 103804 129303 123372 96765 48131 -6058 -21090 10682 34048 25632 12349 15362 -39428
22495 -39428 -138748 -38850 -15657 11475 5366 -4272 40047 4451 -52974 -35530 16153 74191
22483G4191l7277j517N9841k749p9164n6649M9493J9639K0476K6761p874o4098
22471A073o5826k3143O3136L5981p273J7309J1746n198m8520J9833M9818N2314
22459A01250j05556L3028J4397j6759L994J5430N018K6719L5536l1879J7772K925
22447A01875n656j03186m9366N4063o0617o436M1028K1718j9640j0779l2847n0436
22435a20279J8673N7059L7252J506m896N532Q110N6378N363k9865m3846o3638
22423g2651K8786Q1005l6089m4869Q875J5028K9299j9997K6454P5650k5377n3142
22411A2972l4036R026J9045k4543m2274M9697r678j60M8171L47l769l7475K6575
22398A3898J5889l0979J6555J0834m1261n0552J2164L1751N1133J4007n3298K7504
$$ plain form
22483 74191 36914 35397 95238 92489 13325 -43324 6169 25808 46284 73045 65171 1073
22471 1073 -64753 -87896 -24760 11221 3948 21257 33003 27805 -20715 -882 48936 101250
22459 101250 -4306 28722 43119 26360 30354 45784 50802 77521 113057 81178 98950 101875
22447 101875 96219 -6967 -56333 -2270 -62887 -69323 -28295 -6577 -26217 -36996 -69843 -120279
22435 -120279 -101606 -44547 -7295 -5789 -10685 -5153 2957 59335 64698 34833 -9013 -72651
22423 -72651 -43865 37140 1051 -43818 -34943 -19915 9384 -10613 15841 91491 66114 12972
22411 12972 -21064 -12038 7007 -17536 -59810 -10113 -19791 -19951 28220 28567 24798 -12677 13898
22398 13898 29787 -1192 15363 26197 -15064 -65616 -53452 -21701 29432 43439 -9859 17645
22386A7645p074K8445l6671n5966m3293j8498O2942N2295n710l8097K3984J1875
22374h123n5885O006N777Q433l92N2055K4552m7504j3524K5720l3345k9173J4391
22361e1012M7567M1299J8305j3775K0054K4566p4504J4151k0371k6052n8660n1483
22349a29915J541R2652K0331p8110j3117J4902N8216j8778p241L779k8418L5426
22337d8732J6699R029M2678R577k6394O7333L1613n4655K1133k9617l1651L2219
22325C9232J1581m879k3501K2604Q089k6633K2353L0717K6680o1975m1813j8977
22313a6522k2636J1796L6931J2776k0379J6283n8453J5913K4382K0401K4773K796
22301D8061Q880N1651j6296K0870J4622p7927l5506k7058J5435L4060k1058m8236
$$ plain form
22386 17645 10571 39016 2345 -53621 -96914 -115412 -52470 -175 -5885 -43982 -19998 -8123
22374 -8123 -64008 -58002 -52225 -43792 -44184 7871 32423 -15081 -28605 -2885 -36230 -65403 -51012
22361 -51012 -3445 37854 56159 42384 62438 87004 12500 26651 6280 -19772 -78432 -129915
22349 -129915 -128374 -35722 -15391 -93501 -106618 -91716 -33500 -52278 -59519 -55740 -84158 -48732
22337 -48732 -32033 -23004 19674 29251 2857 70190 101803 47148 68281 38664 7013 39232
22325 39232 50813 45934 22433 45037 53126 26493 48846 79563 106243 44268 2455 -16522
22313 -16522 -39158 -27362 9569 22345 1966 18249 -40204 -24291 91 20492 45265 48061
22301 48061 56941 108592 92296 113166 127788 49861 14355 -12703 2732 36792 15734 -32502
22289c2502l6599M3334M8159k150M9510J7825k5835l0015j4214J4200k0094l6783
22277b5164K3007K5579J8725M4144l4015M3431k7121j8480n3275m3325L5033N8467
22265D7006O3606M5992n9305q2126l8356m0072J2456L4998M7100L737p0870J5983
22253a9851K4033p0204J5060M6838N6849N6782k1486l7299q068M5534N0821o705
22241A32304l9281j5548R207N419k6624k3810o1401m171Q8417P39r007k9445K9649
22228E6448K6883m9464j6462J3384r091L8407p4151M281N460o8765r28J7658l4278
22215i0618Q2303J5501k3606l486M964j2341M9074L2223m3814M659L9082L0991
22203H4932m7025m5801l1550k1684K4941j1385j6611Q0107Q101m461R433K6926
$$ plain form
22289 -32502 -69101 -25767 22392 20242 69752 87577 61742 31727 17513 31713 11619 -25164
22277 -25164 -2157 23422 42147 86291 52276 95707 68586 50106 -3169 -46494 -11461 47006
22265 47006 110612 156604 97299 15173 -23183 -63255 -50799 -15801 31299 35036 -35834 -19851
22253 -19851 4182 -66022 -50962 -4124 52725 109507 88021 50722 42654 88188 139009 132304
22241 132304 93023 77475 86682 92101 65477 41667 -19734 -23905 64512 65251 56244 26799 56448
22228 56448 83331 33867 17405 30789 21698 60105 -14046 -9765 -4305 -73070 -73998 -56340 -90618
22215 -90618 -8315 7186 -16420 -19906 -14942 -27283 21791 54014 10200 14859 53941 84932
22203 84932 37907 -7894 -39444 -61128 -36187 -47572 -64183 15924 24025 19564 28997 55923
22191E5923Q5842M952l1702l3418j2434l347m1052r7878p515K622K7556M4270
22179f181Q396n7627n5321J1856Q2133M0215l7900n8304k1027o7427k7940N2057
22167a37070J48048n683k1310k1996J508P6613K2175k3296N790K635Q4570m6580
22155H5404q2483K7209l6211j5122K2220l6508o0025j0507O2405O7999M8662o9931
22143C112n7444m4900K4369L3236Q503n964J5224m9503k4836L6954R459l6871
22131h8661L9784J89l1589m046r603J0075J8919Q5999L0190l6513m0044n7740
22119h3040J9292M483K9866M0413j2771j5632J4510J1098J4764n369l5779J7631
22107e34L8912J1057N030k3381m2367p1112l9615N6142J20809Q8215K6715m1727
$$ plain form
22191 55923 141765 146717 115015 81597 69163 65816 24764 -73114 -80629 -78007 -50451 -6181
22179 -6181 2215 -55412 -110733 -98877 -16744 23471 -14429 -72733 -93760 -161187 -189127 -137070
22167 -137070 10978 5295 -16015 -38011 -36503 40110 62285 38989 44779 47414 131984 85404
22155 85404 2921 30130 -6081 -21203 1017 -35491 -95516 -106023 -43618 24381 73043 3112
22143 3112 -54332 -99232 -74863 -41627 -33124 -39088 -23864 -73367 -98203 -61249 -51790 -88661
22131 -88661 -48877 -48688 -80277 -84323 -93926 -83851 -64932 21067 51257 14744 -25300 -83040
22119 -83040 -63748 -59265 -29399 11014 -1757 -17389 -2879 8219 22983 17614 -18165 -534
22107 -534 38378 49435 54465 31084 -11283 -82395 -122010 -65868 54941 143156 169871 128144
22095A28144j4845k632o2080k4934J8009l2873l2145m032L6542k0428N0218M5684
22083H4628J1962n8856p0018k8999L7681j9363k335L792k86J2891J6522K6243
22071A3862k4315n1830R51N7012N5244l6575M5401k5285j0999K7032Q234n4178
22059D554j9792M786O8763J9399j16481q3648M070j1842J1538Q1730M3643p376
22047f56o8593j8307K1960J0623L3442k8445k4964M4675P0290j2841m7991N261
22035a5546k9952k3507L2382J2411m4092J9337Q7204L4580m597m0707n5417l2015
22023e9919k3284L5579l662M1915K4494l7956M239k303K4098j4517R253L1528
22011B9465j8795R066P479N4912P3459n2829l0830n2377n3532K6373N2475m3385
$$ plain form
22095 128144 113299 110667 48587 23653 41662 8789 -23356 -27388 9154 -11274 38944 84628
22083 84628 96590 37734 -32284 -61283 -23602 -42965 -45300 -41508 -41794 -28903 -12381 13862
22071 13862 -10453 -62283 -61332 -4320 50924 14349 59750 34465 23466 50498 58732 4554
22059 4554 -15238 -10452 58311 77710 -38771 -122419 -118349 -130191 -118653 -36923 6720 -656
22047 -656 -69249 -87556 -65596 -54973 -21531 -49976 -74940 -30265 40025 27184 -20807 -15546
22035 -15546 -45498 -69005 -36623 -24212 -68304 -48967 38237 72817 68220 27513 -27904 -59919
22023 -59919 -83203 -47624 -51286 -9371 15123 -22833 -18594 -20897 3201 -11316 -2063 29465
22011 29465 10670 19736 27215 82127 155586 102757 71927 19550 -33982 -7609 44866 1481
21999A481k4117K5492P191o8967o903K6584L0159L6421L3079l1372j0144l3904
21987a5000q2432N0204O7545L2660J4578k1411L335M3746J5382L481o7539j5062
21975B9487m9073M1416K7205n0319j5363K6168L2209L2500n6419o8545M0333Q021
21963b380j2635K7318J1285o467j1259M12j1887L7431N3244j2580P98k3470n674
21950D4136P723L7290J1071l7850n2393o8063j5583J0664o965K8899M5688M1685
21938D6302K4441j5391q213o8871k5194l4732K200O9134M3516J2660R144l5041
21926A9955l9754j7078n4788k7295M2695M4976J5557L8615m636k9588K8779O795
21914B4233K3305k4677n1743O333M4531j1892p8797m26M3217L1280L6326l7387
$$ plain form
21999 1481 -22636 2856 10047 -58920 -65823 -39239 -9080 27341 60420 29048 18904 -15000
21987 -15000 -97432 -47228 20317 52977 67555 46144 49479 93225 108607 112088 44549 29487
21975 29487 -19586 21830 49035 -1284 -16647 9521 41730 74230 17811 -50734 -10401 -2380
21963 -2380 -15015 12303 23588 17121 5862 6274 -5613 31818 85062 72482 73280 49810 44136
21950 44136 51859 89149 100220 62370 9977 -58086 -73669 -63005 -69970 -41071 4617 46302
21938 46302 70743 55352 47139 -21732 -46926 -81658 -79458 -10324 33192 45852 54996 19955
21926 19955 -19799 -36877 -91665 -118960 -76265 -31289 -15732 22883 18247 -11341 17438 24233
21914 24233 47538 22861 -28882 -22549 21982 10090 -68707 -69133 -25916 5364 41690 4303
21902D303j0221O4935O5824k122q4836l8829j7451p940k6148J4941L1782M9983
21890D4221J8471m899l2151k2168K6916j4010o9269J2081J3308j3537M4355N7837
21878F1155J2178M52L8189l6618n5046j783k507n877j2510q885R286l6864n367
21865d4197n860N6057J876N920j3185o6443n497O7050K0533R1111K8774q0347
21853E5792k0030J6322L8034J9725j2353j3140k4488l1721l5167m9676K2942j8863
21841e2623N6390L6782J7922J9061q8524M124l055K7814q919N964Q8884L2486
21829A36306n5340l1083k6214l4255k0676L0618p719J0636K0936m0533j2598M7568
21817A7646j7643J3653l8075K427o629K0281M5718k1353m95o5786K004N3934J0417
$$ plain form
21902 4303 -5918 59017 124841 122719 37883 -946 -18397 -26337 -52485 -37544 -5762 44221
21890 44221 62692 57793 25642 3474 30390 16380 -52889 -40808 -27500 -41037 3318 61155
21878 61155 73333 73785 111974 75356 20310 18527 16020 10143 -2367 -11252 -1966 -38830 -44197
21865 -44197 -50057 6000 7876 13796 611 -65832 -71329 -4279 16254 107365 136139 55792
21853 55792 35762 52084 90118 109843 97490 84350 59862 28141 -7026 -56702 -33760 -52623
21841 -52623 3767 40549 58471 77532 -10992 -6868 -9923 17891 8972 14936 103820 136306
21829 136306 80966 49883 23669 -10586 -31262 -644 -8363 2273 23209 -17324 -29922 17646
21817 17646 3 13656 -24419 -21992 -28621 -8340 37378 16025 15530 -50256 -48252 5682 16099
21804A6099M6755o1380n9162P022k65L571M1064L734R2358L6488p3365k1918K2477
21791E3478N766m6664m6606p002J352J4228J1857k4180k1917l7462K279M3724
21779e1147k4059o3557J5997K0593K1367j3180M0031O7591q226L8631L768j9713
21767B8096r665r4961J3518q305P7975L6756l036m2736l7281J7274N3011j4703
21755A5943j0391J0652r375q7586m3378J8817Q0469M9333j9945m031k0430J5969
21743c953k0309n4590M1011K8955k131N1943N6402J8501L9222j3324j11670j11232
21731h1175K4827P3046L7071L5712o0553o0350o716L638P5170K5136r733n340
21719E0733J3585j6680j1612L878o4965Q815O9940k851l217k4274k1812L1475
$$ plain form
21804 16099 62854 1474 -57688 -50666 -50931 -47360 -6296 -2562 89796 126284 52919 31001 53478
21791 53478 59244 12580 -34026 -41028 -39676 -25448 -13591 -37771 -59688 -97150 -94871 -51147
21779 -51147 -75206 -138763 -122766 -102173 -80806 -93986 -53955 13636 5410 44041 47809 28096
21767 28096 18431 -76530 -63012 -71317 6658 43414 40378 -2358 -39639 -22365 30646 15943
21755 15943 5552 16204 6829 -80757 -124135 -105318 -24849 24484 4539 508 -19922 -3953
21743 -3953 -24262 -78852 -37841 -8886 -11017 40926 97328 115829 155051 141727 30057 -81175
21731 -81175 -56348 16698 53769 89481 28928 -31422 -38138 -34500 40670 65806 56073 50733
21719 50733 64318 47638 36026 39904 -25061 -16246 53694 50843 47626 23352 1540 33015
21707C3015p409k1683l5602k2766J7450l215N065j08915k8585N8119M3634k3325
21695i4217L9069R3183j4297L63N637O758J419j1435j7405n038J841M3198N8634
21682A07710j0130p4929k5528J3226n1585k6769p21J5683L6675K9957j4462m4596
21670d5469O449k4403J912J3525N9932L560M704k6323m4395L6751k7299k7362
21658f8418j8729Q0735j7169m6456K649j4604O6545M2272P6397L872j3506k5688
21646F7900j0957p788k7897j755Q3131q302p1959K2848p459n1450l0767L887K9499
21633a1069N2646L9945m4734k0696R545K4866o0471l6891Q967K7921N4940k4946
21621B0023n2032K8691M6014J1757p831O595k1867m7452l596P1189Q4019p3839
$$ plain form
21707 33015 25606 3923 -31679 -54445 -36995 -40210 -35145 -144060 -172645 -114526 -70892 -94217
21695 -94217 -55148 38035 23738 24101 29738 36496 37915 26480 9075 4037 5878 49076 107710
21682 107710 97580 22651 -2877 10349 -41236 -68005 -68726 -53043 -16368 13589 -873 -45469
21670 -45469 -39020 -63423 -61511 -47986 11946 15506 20210 -6113 -50508 -13757 -41056 -68418
21658 -68418 -87147 -6412 -23581 -70037 -67388 -81992 -15447 26825 103222 107094 93588 67900
21646 67900 56943 49155 21258 19503 102634 94332 22373 45221 37762 -13688 -44455 -40568 -11069
21633 -11069 41577 81522 36788 16092 25637 50503 -9968 -46859 -37892 -9971 44969 20023
21621 20023 -32009 -3318 42696 54453 46622 53217 31350 -16102 -19698 51491 135510 61671
21609F1671n6141N4002L9438o8051p5676q2008M3642O7119L837j9562K7764l3389
21597c7354N078k9461n7697N9173N9070M690l0829K4928O2528K1255j2896k0358
21585D8127J6575p4949l0387K3680J9614k2228l0257m5701l7936Q5876L4118l7530
21573e0998p923K5167j6739j4666J03292J5474m0537o9607l9474l4105P057R3453
21561b9606j4534K6575K5815J7442O0516N9743l8414j5282m9523n0836j5036M9986
21549B6846K3757j5186J5066n4140k9854O8249J3740j11657j2581J23272M4698
21538I2210j3464k1997o8091j9098J3893K531N2403j3019l4665j3246k1141N4655
21526A0971k4226k3330k7462l1701N101K6466O5664M111l5353o52M2692P938J1353
$$ plain form
21609 61671 5530 59532 98970 30919 -44757 -126765 -83123 -16004 -12167 -31729 -3965 -37354
21597 -37354 -32276 -61737 -119434 -60261 -1191 3499 -27330 -2402 60126 81381 68485 48127
21585 48127 64702 -10247 -40634 -16954 2660 -19568 -49825 -95526 -133462 -47586 -13468 -50998
21573 -50998 -58921 -33754 -50493 -65159 38133 53607 13070 -56537 -96011 -130116 -123059 -29606
21561 -29606 -44140 -17565 8250 25692 86208 145951 107537 92255 42732 -8104 -23140 26846
21549 26846 50603 35417 50483 -3657 -33511 34738 48478 -63179 -75760 47512 92210
21538 92210 78746 56749 -11342 -30440 -16547 -14016 38387 25368 -9297 -22543 -43684 10971
21526 10971 -13255 -36585 -64047 -95748 -90647 -64181 1483 5594 -29759 -30411 12281 20219 31572
21513C1572m314k9693J1638M065L4874k7435M0777j3930j08667K1768J5705j3176
21501c6816M4967K6884j4075m468K0293l590l1977k0889L1873L517K2921N0036
21489H8676J3664o4573k454L2671K5161J4004r3444p0994q6707J5167O5913M0415
21477b2501L120m643k6748L044R4869m1174l1595Q543M3552m4870m2169K1361
21465c9211n812N7499P6884N0465k0838k9405l481j9121n05n264q6455j1432L8593
21452A917J5279M7933J5456k8275m4043m1861O8974p2057J0501j229j2265M1742
21440B072m0762J7159M164L3462L0363q939M3153j6897k0708o5104q8660L1841
21428g8856N9776R7780K0744J3436k6258o5511p3332l105Q764k0508M4005M0884
$$ plain form
21513 31572 27258 -2435 9203 13268 48142 20707 61484 47554 -61113 -39345 -23640 -36816
21501 -36816 8151 35035 20960 16492 36785 33195 1218 -19671 12202 15719 38640 88676
21489 88676 102340 37767 35313 67984 93145 107149 13705 -57289 -143996 -128829 -62916 -22501
21477 -22501 -19381 -24024 -50772 -47728 47141 5967 -25628 -17085 26467 -18403 -60572 -39211
21465 -39211 -45023 12476 89360 139825 118987 89582 86101 66980 66475 61211 -25244 -36676 1917
21452 1917 17196 65129 80585 52310 8267 -33594 35380 -36677 -26176 -27405 -39670 2072
21440 2072 -38690 -21531 -17367 16095 46458 37519 80672 63775 43067 -22037 -110697 -78856
21428 -78856 -19080 78700 99444 112880 86622 21111 -52221 -55326 -46562 -67070 -23065 17819
21416A7819j611L400K7321m0436m8028m5145m6581L5610R052j2081N8630K9104
21404a2946K3709J3960l5737J1717j8579k3105K2933N3855K9284L8097L4770J7663
21392A55621q3582o4692k3459M1855K5827N927o4664l0534L5908k5086l4661L8306
21380b3234p089l290L3794L0265K5222J2691N011J841j4258L5100l7628j5808
21368D2617M8425N4925k5095o1872j2457O1037n2923k4690L61k4791j0843p8495
21356h3801m1085Q0076k5015k0371N9196Q352J8574m448K5848m5782j0738N033
21344c4161k75N9860J4298L2269Q630K888l7149o4100o3449q232N3171j4261K6181
21331b4330N5115N3932K343j3323m0755J4921p795M7212j9916o4427m1095L739
$$ plain form
21416 17819 16208 19608 46929 6493 -41535 -86680 -133261 -97651 -88599 -100680 -42050 -12946
21404 -12946 10763 24723 -11014 703 -17876 -40981 -18048 35807 65091 103188 137958 155621
21392 155621 72039 7347 -16112 25743 51570 57497 -7167 -37701 -1793 -26879 -61540 -23234
21380 -23234 -30323 -33613 181 30446 55668 68359 73370 75211 60953 96053 58425 42617
21368 42617 91042 145967 120872 59000 46543 107580 54657 29967 30328 5537 -5306 -83801
21356 -83801 -124886 -44810 -69825 -90196 -31000 -22648 -4074 -8522 17326 -28456 -39194 -34161
21344 -34161 -34436 25424 39722 71991 80621 83509 46360 -17740 -81189 -89421 -36250 -50511 -24330
21331 -24330 30785 84717 87060 73737 32982 47903 40108 87320 67404 2977 -38118 -34379
21319c4379m9400m3547K2285N3207L5814k6283J9313J01483K9964Q97j7568k9178
21307F2608N1670J2371o1983r3289j2692l099o7912j8216P093m0749J5989J20097
21295b8112Q0930K7300j5088r3859l7612J7784K8620L6152M7737N2306N545k3948
21283I7755k1199K3892j1142q310l9799M0505R01o1186n6162j7669k8376l0438
21271a11228K2258O132J6081L5071R3909l3139q3284k2855L1946O0423p169q416
21259b71L4603j284l8411q4618l2710M3686J2258J0264Q3082p54l410L5299J4602
21246G2336L7346n0673o3661J9962P3668q27n0249q477n8033J7721M2308m8015
21234a6594p539L3561N446n4372l7225j5354M2859l4693K828K5859j3342l1517
$$ plain form
21319 -34379 -83779 -127326 -105041 -51834 -16020 -42303 -22990 78493 108457 109354 91786 62608
21307 62608 114278 126649 64666 -28623 -41315 -44414 -112326 -130542 -123449 -164198 -148209 -28112
21295 -28112 52818 80118 65030 -28829 -66441 -48657 -20037 16115 63852 116158 121703 97755
21283 97755 76556 100448 89306 80996 41197 81702 82603 21417 -34745 -52414 -80790 -111228
21271 -111228 -88970 -82838 -66757 -31686 62223 29084 -54200 -77055 -45109 15314 8145 -271
21259 -271 34332 33048 -5363 -89981 -122691 -79005 -66747 -56483 26599 25845 22435 57734 72336
21246 72336 109682 59009 -4652 15310 88978 88151 37902 29425 -28608 -10887 31421 -16594
21234 -16594 -24133 9428 14874 -39498 -76723 -92077 -49218 -83911 -81083 -55224 -68566 -100083
21222a00083L5257o872N6551N2265R748j4492N3258j4712j6779m1301k7300M8935
21210C4475J0095o663k4442J2986o556N0548o114l0839K4392P268J2159l0642
21198D6667L8046q7971j11542M740P1315n925m500o7574n0333O6720M4824K0815
21186c4718K2701K4372M5672l3477K2924j7676o1603M225J9733J14089Q9898p3769
21174A22371q7317k7762M1328N3069J0247q081J0718M035l0037m7085k377O4161
21162A03270m3752j6626m1722j4541L4390J0559M4208Q6012J2304j12421j5913
21151D5768k154K2247K8209R226J7454j4520m4731l2572l3462K5112L175K4610
21139D8362j6033m779J0324k1836m9722m9242N7378K6753l3988M7095O554J8928
$$ plain form
21222 -100083 -64826 -71698 -15147 37118 46866 32374 85632 70920 54141 12840 -14460 34475
21210 34475 44570 37907 13465 26451 19895 70443 64329 33490 57882 65150 77309 46667
21198 46667 84713 -3258 -114800 -110060 -38745 -44670 -49170 -116744 -167077 -100357 -55533 -34718
21186 -34718 -12017 12355 58027 24550 47474 29798 -31805 -27580 -7847 106242 196140 122371
21174 122371 35054 7292 48620 101689 111936 103855 114573 118608 88571 41486 39109 103270
21162 103270 59518 42892 1170 -13371 21019 31578 75786 161798 174102 61681 45768
21151 45768 43614 65861 94070 103296 120750 106230 61499 28927 -4535 20577 23752 48362
21139 48362 32329 27550 37874 16038 -33684 -82926 -25548 1205 -32783 14312 20866 39794
21127C9794q9235n4333K5876P1686J05662N5551o7424o9826k0830L8492K0373
21116E5786k2866J4245k4008l9384J7872j0901L3951o161J2471r412k4337l5580
21104c8324P1840L1553q1125K8076K1085m4992p3968j4650K6592J9296K9232P0742
21092D5357r72l7600J3365O4998k8115r975L1955K0399O602n2026m6079J0723
21080A8632N8866m832O372l0120m1057j2591J0264r817N1550J1453o2599j4484
21068a8363r144K8856k5364o357J920J032J4338Q1410j871m2521J3339j46l2126
21055E003O3897K2306m0528k7191M9983O6129n4198p4453r8487l9155O6202P643
21043e2849M0388M9887J9260O096m0053j0188r163K9215k444k0175k0430M47o904
$$ plain form
21127 39794 -49441 -103774 -77898 -6212 99450 155001 87577 17751 -3079 35413 55786
21116 55786 32920 47165 23157 -16227 1645 -9256 24695 18534 31005 21593 -2744 -38324
21104 -38324 33516 65069 -16056 12020 33105 -11887 -85855 -100505 -73913 -54617 -25385 45357
21092 45357 44385 6785 20150 85148 57033 47058 79013 99412 106014 53988 7909 18632
21080 18632 77498 72666 79038 48918 7861 -4730 5534 -4283 47267 58720 -3879 -18363
21068 -18363 -27507 1349 -24015 -30372 -28452 -27420 -13082 68328 66457 23936 37275 37129 5003
21055 5003 68900 91206 50678 23487 73470 139599 85401 10948 -87539 -126694 -60492 -52849
21043 -52849 -12461 37426 56686 62782 22729 12541 3378 32593 30149 9974 -10456 -10009 -16913
21030a6913k4935K1129m7595k2614N5273M9809l7189P658N1837J8057j9033l1331
21018D153J4211O0570J5340J2619m2930p9070L0190N9700j7196l4714R3255L6408
21006A52536k9815m2810l2271L2273m8363k3050o0395n190K5620N2282J0019m024
20994B6812N310j574K6270K9219l0031o4910p103M9644L1757K9430L1791j7598
20982A09017j17502j7153R9673N6573j9935j6137o6298j0205L4978j6874j6577
20971A9560j2116k2220Q385k7219k7789l243p3721N8392L1993J3390j3007o485
20959e4080R0869K1273j9994j1458k9009K5933O7962M4373k9681o5576k5388m8845
20947c3621l8513K3576j6317O0608P2607M959m4190K2538l483p953p624k9617
$$ plain form
21030 -16913 -41848 -20719 -68314 -90928 -35655 14154 -23035 -15377 36460 54517 35484 4153
21018 4153 18364 78934 94274 106893 63963 -15107 15083 74783 57587 22873 116128 152536
21006 152536 122721 79911 47640 79913 31550 8500 -51895 -57085 -31465 20817 30836 26812
20994 26812 32122 30548 56818 86037 56006 -8904 -16007 33637 65394 94824 126615 109017
20982 109017 -8485 -25638 74035 130608 110673 94536 28238 18033 53011 36137 19560
20971 19560 7444 -14776 -6391 -33610 -61399 -64642 -138363 -79971 -47978 -34588 -47595 -54080
20959 -54080 36789 58062 38068 26610 -2399 23534 91496 135869 106188 40612 15224 -33621
20947 -33621 -72134 -48558 -64875 -4267 68340 73299 29109 51647 48164 40211 32587 2970
20935B970n7970o5650J1582M0096k3143J8939O242J0135r184M8276O9588J8985
20923G0866n3725k4922P575L2074J1405l402n543O422N1299k1118p1579k5313
20911b5961P0772N9772J6274k4391l5333p7524L9156L4812n7204J4931L6092j3627
20899C7769K8470J3638k5491n838j3671m8915o650l7557K6099P4303J4820L2908
20887H9885J2824N888m770k5328J7716m69q519p3645q0529L3020k6191K2846Q0541
20874D3269J0212K4995m0044K7421j8993L3750N665l2724M790M3709J8494O4163
20862A84707q1472j1786q1467n8528K6254K095p116M0776M876M117R195N3533
20850H5184j2383k842j9377M2876j2470l8780M3725M8628j4709p1854l6483l488
$$ plain form
20935 2970 -55000 -120650 -109068 -68972 -92115 -73176 -66934 -56799 -65983 -17707 51881 70866
20923 70866 17141 -7781 -206 31868 43273 39871 34328 40750 92049 70931 -648 -25961
20911 -25961 44811 104583 120857 96466 61133 -16391 22765 57577 373 15304 51396 37769
20899 37769 66239 79877 54386 48548 34877 -14038 -20688 -58245 -32146 42157 56977 89885
20887 89885 102709 108597 103827 78499 96215 95746 87227 13582 -66947 -33927 -60118 -37272 43269
20874 43269 53481 78476 38432 65853 46860 80610 86275 53551 58341 102050 120544 184707
20862 184707 103235 91449 9982 -48546 -22292 -20197 -27313 13463 18339 22456 31651 85184
20850 85184 72801 69959 50582 93458 80988 42208 85933 134561 119852 47998 11515 8027
20838H027J917K5222O8876n0237l8447j4071m9426p986K6839K1309K6186N0887
20826F9096n5002m4464J1773m1612k113k07O5327R7553Q8556K1634k8756n2304
20814A29481n5793k9104n8998k010k0139L4629L2723l464K0494M6660L7468L0292
20802A62239j07208q6891p318J3873L7558L2909M3318K2491l1422K4363k2690
20791H1222n3306k1440m4833k1745p116K2617o700M1875M6205J3773l310K0000
20779F7242R021K239r5755p3381K5325P1084O9680j0901m2268m9894m308K930
20767b8986N2897P201m9110J2707M4565K0520j5940p8166J9403N2439M9679L1415
20755A18624q4892n9393k3094L817J6175L1517O272j0807J4652j8187l3637m3566
$$ plain form
20838 8027 9944 35166 104042 53805 15358 1287 -48139 -56125 -29286 -7977 18209 69096
20826 69096 14094 -30370 -18597 -60209 -62322 -62529 2798 100351 188907 210541 181785 129481
20814 129481 73688 44584 -14414 -16424 -36563 -1934 30789 27325 47819 94479 131947 162239
20802 162239 55031 -31860 -39178 -25305 12253 45162 88480 110971 79549 103912 81222
20791 81222 27916 6476 -38357 -60102 -67218 -44601 -51301 -9426 36779 50552 47242 67242
20779 67242 76263 78502 -17253 -90634 -65309 5775 75455 64554 22286 -27608 -31916 -28986
20767 -28986 23911 31112 -17998 -5291 39274 59794 43854 -34312 -14909 37530 87209 118624
20755 118624 33732 -25661 -48755 -44938 -28763 2754 9026 -1781 12871 -5316 -38953 -82519
20743h2519l9034M1796L8349M3533K4613j0588n6117n321J1084J01082M9350p352
20731A08876P79j243j5391O132M659l3309K1065j0978m6472L898l1196L9585k4766
20718B1639K9471J14759K9623l7831J6538O5390J22786J34839K02674K43456L53736
20707A297080L18779L06142J77498M547j61673k81212l98138m20624k73480q0596
20697D88323K7348J5316n6406k9294j9540o570o4643j1919m6627l8086j8514P5305
20685C14693J4280n6560p1277m153M425n4985J180n6179k6551n2934M1438N8085
20673A11462l9545n0671l3453m157N9588N4890J0388m1266k1737L1958r3519m8857
20661f4919P2994K2136n42K4281k5023r5091K4752M8981J2648j8594R263J9104
$$ plain form
20743 -82519 -121553 -79757 -41408 2125 26738 16150 -39967 -45288 -34204 66878 116228 108876
20731 108876 109655 108412 93021 99153 103812 70503 91568 80590 34118 38016 6820 46405 21639
20718 21639 51110 165869 195492 157661 174199 239589 362375 497214 699888 943344 1297080
20707 1297080 1615859 1922001 2099499 2104046 1942373 1661161 1263023 842399 568919 488323
20697 488323 515671 530987 474581 445287 425747 419177 354534 342615 295988 257902 239388 314693
20685 314693 328973 272413 201136 196983 201408 146423 147603 91424 64873 11939 53377 111462
20673 111462 71917 21246 -12207 -16364 43224 98114 108502 67236 45499 77457 -16062 -64919
20661 -64919 8075 30211 29669 53950 28927 -66164 -41412 7569 20217 1623 10886 29990
20649B9990j1803o2650o732K4000K4066O4857O3448N761j11296m8418j0749K8052
20637a1474O324j0346L4125J2018j1388l075j4799l8190P1363M5903M8661L9647
20625A68769m8339j5563K7645K4465k8063l8228n1483j2473j9785L0863J1758
20614D9566m9009j5695m267l520Q1180K0985l8135j43215m591R1416O2580n181
20602D2114k070J8245N4202N4846k303l7509m9662l835l4257O5828K0803j06811
20590A9591j09322k068M4037M3913M9998q726k7366m0798M8272k2964L3925l1410
20578b918L1201M553o919K398l9840j256L7547l0992n1806m9063k5534O2886O537
20565f3206O7329K4047m235j7597j5043N0118J03473p5062m1919J0340l2623K7400
$$ plain form
20649 29990 18187 -44463 -51195 -27195 -3129 61728 125176 130937 19641 -28777 -39526 -11474
20637 -11474 -5150 -15496 18629 30647 19259 16184 1385 -36805 34558 80461 129122 168769
20625 168769 120430 104867 132512 156977 128914 90686 39203 26730 6945 37808 49566
20614 49566 557 -15138 -19405 -22925 58255 79240 41105 -102110 -106701 -15285 47295 42114
20602 42114 40044 58289 112491 167337 165034 127525 77863 74028 39771 105599 126402 19591
20590 19591 -89731 -91799 -47762 -3849 46149 37423 10057 -30741 17531 -5433 28492 -2918
20578 -2918 28283 32836 25917 28315 -11525 -12781 24766 -6226 -58032 -107095 -132629 -69743 -63206
20565 -63206 4123 28170 23935 6338 -8705 41413 144886 69824 27905 38245 5622 33022
20553C3022m91m0690o0204Q9778K5826n8623k5108o445O2363J2687K2496L3050
20541H7661q198k3978N360j2782N5057M5824m8144J7103r587m1320l5294J2848
20529D4550J3290L4381j722o1084P487Q9103j2834j7166J7542L4930N207k6617
20517A27067K4221p1325q0004K9815l6420M2879M4491O2316K5828m206j2143j7118
20505A35401r2477m3068k03o4093L0812M3562l7794J0764J6723k1936r29m4103
20493f7341L1966L1303M7417J0717N0200R196l2811N1870Q1889j8525j9215n6666
20481A20000m2694l0700k0514l3065L151M0389L2565R65j1228J6361J2228J4520
20469A01978K9450K8523o1795n9479K0813N1969l4207l5870K9352m794L4j8806
$$ plain form
20553 33022 32531 -8159 -68363 21415 47241 -11382 -36490 -42935 19428 32115 54611 87661
20541 87661 79463 55485 60845 48063 103120 148944 100800 117903 108316 66996 31702 44550
20529 44550 57840 92221 90499 29415 36902 126005 113171 96005 113547 148477 153684 127067
20517 127067 151288 79963 -41 29774 -6646 36233 80724 143040 168868 164662 152519 135401
20505 135401 42924 -144 -347 -64440 -33628 9934 -27860 -17096 -373 -22309 -23238 -67341
20493 -67341 -35375 -4072 43345 54062 104262 113458 80647 132517 214406 195881 176666 120000
20481 120000 77306 46606 26092 -6973 -3822 36567 69132 70097 58869 75230 87458 101978
20469 101978 131428 159951 98156 38677 59490 111459 77252 41382 70734 65940 65974 47168
20457D7168l5656O6559M7447k2595j592o713m6479q5011k7800l5826J0199R863
20445h0436N9246J5570r037p532J6357k0763m3547Q168n6672k4131j9443R124
20433a53096K0149m0401p2775l2224q0726o9191P5742J2138l1806K672O1530P1889
20421b36099P4806O0251K3267P0877K947j1146R9197O7245l8785P7325J71996
20410C61881K33232K43400J60798L4996k0918j1581j44644j73329j61435j38994
20400C83406j00751k5530j4970o1526J5473m5212M6344M4063n0063j8976J28131
20389C00389L1815M7926L8282l9289n8709j1007l556l0216N271l7522l0011l126
20377B10247K6983M8181j2637M3300j5115p8271m711K6997M3157l4733k792o0523
$$ plain form
20457 47168 11512 78071 125518 102923 101331 94618 48139 -36872 -64672 -100498 -90299 -80436
20445 -80436 -21190 -5620 -14657 -22189 -5832 -26595 -70142 -61974 -118646 -142777 -162220 -153096
20433 -153096 -132947 -173348 -246123 -278347 -359073 -428264 -352522 -340384 -372190 -369518 -307988 -236099
20421 -236099 -161293 -101042 -77775 -6898 -3951 -15097 84100 151345 112560 189885 361881
20410 361881 595113 838513 999311 1034307 1013389 1001808 857164 683835 522400 383406
20400 383406 282655 257125 242155 180629 196102 150890 197234 241297 191234 172258 300389
20389 300389 332204 380130 418412 379123 320414 309407 305851 275635 280906 243384 213373 210247
20377 210247 237230 285411 272774 316074 300959 222688 217977 244974 288131 253398 250606 190083
20365A90083N937M5439K5878k151M4097K5823m0218M9126N3223k0761P3880O3633
20353E13989K6911j9621J04161P9247l25o8250o5938j2769j3427J0151J09459
20342F63588M2250N5679l1406K3183m253J0715r1025j08354j54460n4573n9244
20331B92100m2270l898O754J0363n445r1881j9064P5113L7676j8533n7001N9906
20319B43820L4434J9646K9845j9449j7484M0824J9768l595k3479n0944q0749N626
20307A98263O6260q260M6646P1936J8761K4514L4485L599j3323M286J1980O0629
20295E19776L2509N6915Q8348J9014l1772m3936L9400O6164l95J9090m1642n0225
20283F73246p6236r1436m7282n2738l9608M3787l9468P769l9268l9846R5468k0537
$$ plain form
20365 190083 196020 241459 267337 265186 309283 335106 294888 344014 397237 376476 450356 513989
20353 513989 540900 521279 625440 704687 704362 636112 570174 557405 543978 554129 663588
20342 663588 705838 761517 730111 753294 749041 759756 668731 560377 405917 351344 292100
20331 292100 249830 245932 252686 263049 257604 165723 146659 221772 259448 240915 183914 243820
20319 243820 278254 297900 327745 308296 290812 331636 351404 347809 324330 273386 192637 198263
20307 198263 264523 256263 302909 374845 393606 418120 452605 456204 442881 447167 459147 519776
20295 519776 552285 609200 697548 716562 684790 640854 680254 746418 746023 765113 723471 673246
20283 673246 597010 505574 458292 405554 365946 409733 370265 378034 338766 298920 394388 373851
20271C73851n6066o672j633n5172l4701n5356N8144J07544K9525m6415n4223Q15
20259B59641q3032K0088N5756k8010j4949k8951o0617m0832k4590L4821O5162
20248A54487L9773m7210n9948M3540O7086k7550R687J6564N516k2532J6164j0456
20236A85121J5698l899L4585Q8253O6011K6723M2576l597q6500j19085q2506n3100
20224A10280m0049k0992j284K7435N5853P5126K5958K1293n2133P144M3406J18009
20212C70046K4436m2337j664K0440L1093p683l1876J0199N8389J2169N503n1554
20200C97161l1579M4647M0796O5886J8534p5880P301O0540Q462o8622P462Q096
20188D82804j582j8326j002m3867O851N6940L2208l7838K4663J02640n2707q5144
$$ plain form
20271 373851 317785 311113 309480 254308 219607 164251 222395 329939 359464 313049 258826 259641
20259 259641 176609 196697 252453 224443 209494 180543 119926 79094 54504 89325 154487
20248 154487 194260 147050 87102 130642 197728 170178 179865 196429 201945 179413 195577 185121
20236 185121 200819 196920 231505 319758 385769 412492 455068 451471 364971 245886 163380 110280
20224 110280 70231 49239 47955 75390 131243 206369 232327 253620 201487 208631 252037 370046
20212 370046 394482 352145 350481 370921 402014 394331 362455 372654 431043 443212 448715 397161
20200 397161 365582 410229 451025 516911 535445 459565 466866 527406 535868 467246 474708 482804
20188 482804 481222 462896 461894 418027 424878 481818 514026 476188 500851 603491 550784 465640
20176D65640K7297M1372n1483k0281O961J3219l0717N947L8163K2161j4064K0410
20164E24625M2550Q5142N4263o7103J5139K1564m6240n8163L948O9509N900l0733
20152F20401J14083L4168j6183O3446P4820O0463J8657L8284L9858l259R3074
20141A137812J19633J20602P7917J00044J34717P9591J16281J56282J14726K09400
20131B367005K75709L41400L80504N22676P60805Q61831Q79775Q40187O93214
20122G923106M82635L29745K01233J82540K05572N57485R71229J361532J881047
20113A4096124K462773L419453M836784O983098J0331933J5551142K3369759L4696043
20105A15747109M8814500O0290680O1504795N3818151L6712001J429896l2693336
$$ plain form
20176 465640 492937 534309 482826 462545 469506 482725 452008 457955 496118 518279 504215 524625
20164 524625 567175 652317 706580 639477 654616 676180 629940 571777 575725 645234 651134 620401
20152 620401 734484 768652 752469 815915 890735 951198 969855 1008139 1047997 1044738 1137812
20141 1137812 1257445 1378047 1455964 1556008 1690725 1770316 1886597 2042879 2157605 2367005
20131 2367005 2642714 2984114 3364618 3887294 4648099 5509930 6389705 7229892 7923106
20122 7923106 8405741 8735486 8936719 9119259 9324831 9882316 10853545 12215077 14096124
20113 14096124 16558897 19978350 24815134 31798232 42130165 57681307 81051066 115747109
20105 115747109 164561609 224852289 286357084 340175235 376887236 378317132 345623796
20098C45623796n0205334o1346515o1293224m6845442l0066937j8155454j1048440
20091F6662450o892552m226197k438397j749804j858733k093588k634220l227246
20083D1541713l314857l090974k716793k412093k323044k372175k359227k327556
20075B0624994k267421k068325j856814j540137j394664j278656j194418j158357
20067G866202j054353r03503p62671o20110n78920o12566n26683l29753k83152
20058B194491k60373o4274m1541q0944j63441q5234j02551j27561n3073N1249
20048A266748j0835q6086p3751o2502K9709K989m1562o7542o1998k1502k4784
20037H48884k6426j4939q5141j3076n3638o6622l5391j8162n924j4422k9917k428
$$ plain form
20098 345623796 295418462 234071947 172778723 125933281 95866344 77710890 66662450
20091 66662450 59769898 55543701 53105304 51355500 49496767 47403179 44768959 41541713
20083 41541713 38226856 35135882 32419089 30006996 27683952 25311777 22952550 20624994
20075 20624994 18357573 16289248 14432434 12892297 11497633 10218977 9024559 7866202
20067 7866202 6811849 5908346 5145675 4525565 3946645 3334079 2807396 2477643 2194491
20058 2194491 1934118 1869844 1828303 1747359 1583918 1498684 1396133 1268572 1215499 1266748
20048 1266748 1255913 1169827 1096076 1033574 1063283 1066272 1024710 957168 895170 873668 848884
20037 848884 822458 807519 722378 709302 655664 589042 553651 535489 529565 515143 485226 482798
20025D82798L472m9188n5903K1794M1189k0811l428r896L2875Q2023l7094k8204
20013D59627m233l6183J0226O7298m399R196J8825N1944P1763Q6959J37822J5287
20001H84132J20510P2166j8292l8374p8159j46218j32906o9715r9195n1985j2928
19990D29036Q4403M6173k2720O416k8377M3338K5342J6040N8981m9546K2885J25390
19978G57361Q6086P6796O7983Q311M3931q1544j8026n5352n9537j11705j36051
19967E78253j5755Q000o6363r2637l4708L0510M7990J7252M6338k7088n7671k1696
19955D12425P2100L2560n998k3054K4848J9699L9538N2928P587o8288p5591n2750
19943D36004J5336l3704J9166K7781O955j502M8154M1901L0056n7748p6673K6828
$$ plain form
20025 482798 486270 437082 381179 402973 444162 423351 419923 410027 442902 524925 487831 459627
20013 459627 455394 419211 429437 496735 492336 501532 520357 572301 644064 731023 868845 884132
20001 884132 1004642 1076808 1058516 1020142 941983 795765 662859 593144 493949 441964 429036
19990 429036 513439 559612 536892 543308 514931 558269 583611 599651 658632 609086 631971 757361
19978 757361 843447 920243 988226 996537 1040468 958924 940898 885546 826009 714304 578253
19967 578253 562498 570498 504135 411498 376790 407300 455290 472542 518880 491792 434121 412425
19955 412425 484525 517085 511087 488033 512881 532580 572118 625046 632633 564345 488754 436004
19943 436004 451340 417636 436802 464583 471538 470036 518190 560091 590147 532399 455726 482554
19931D82554J3602j695j4617O8070K1756n1665K7251M990L0065L4345k183K806
19919F15279o8105n4739n8508J5170Q53j7511O12j3021J01139J3704j6631J6039
19907E34281J8524O8004J4380K482L4330N8708R6754K6700l4628p4878j8532L0578
19895G56703q6659o3306m8403P366j35j7870k8564k7646n51m77J3653K5402J2981
19882E42494k9569J4209J0868J2292l0005N7345L5378m8510m9054L3732M0279
19871E89459M5493N8107R6295N6771L5422K8707M8388M4593P4136L9705j6160
19860A100916L2612J51294J20179J25574J39655J61040K27476J62845J50049N6194
19850B427834N1343J18437J68917J62414K01816J34974J22025L33858M94998N21554
$$ plain form
19931 482554 496156 494461 479844 547914 569670 518005 545256 550246 580311 614656 612473 615279
19919 615279 547174 492435 433927 449097 449950 432439 433051 420030 521169 534873 518242 534281
19907 534281 552805 620809 635189 637671 672001 730709 827463 854163 819535 744657 726125 756703
19895 756703 670044 606738 558335 565701 565566 547696 519132 491486 490935 490458 504111 529513 542494
19882 542494 512925 527134 538002 550294 520289 577634 613012 564502 515448 549180 589459
19871 589459 634952 693059 789354 846125 881547 910254 958642 1003235 1077371 1117076 1100916
19860 1100916 1133528 1284822 1405001 1530575 1670230 1831270 2058746 2221591 2371640 2427834
19850 2427834 2479177 2597614 2766531 2928945 3130761 3265735 3387760 3721618 4216616 4738170
19840D738170N69875O53495P97462R57156J392431K053529L004096M385609O500455
19831B5052278R075300J1152830J1357471R772532Q134226N815700L181377J863749
19823H5405463J848246K392818J854675J158244J969159L374529L744292Q5050
19815A01832476n794925r005019j0886320j3020682j2699302r744020o396499
19808C4285709m315711l066570k157635j554096j253769j167577j048815q80034
19800A8841502r63420j029996j028781q40088q30915p14283o01130n44783m21069
19791A1867037k76472j16202N8237K43215L92458Q56369J614651K728337M310657
19782B1678287O408830R086052J1240085J0967307Q503817N860186K894206J245201
$$ plain form
19840 4738170 5308045 5961540 6759002 7716158 9108589 11162118 14166214 18551823 25052278
19831 25052278 34127578 45280408 56637879 66410411 74544637 80360337 83541714 85405463
19823 85405463 87253709 89646527 91501202 92659446 94628605 98003134 101747426 101832476
19815 101832476 96037551 87032532 76146212 63125530 50426228 40682208 34285709
19808 34285709 29969998 26903428 24745793 23191697 21937928 20770351 19721536 18841502
19800 18841502 17878082 16848086 15819305 14979217 14148302 13434019 12832889 12288106 11867037
19791 11867037 11590565 11474363 11532600 11775815 12168273 13024642 14639293 17367630 21678287
19782 21678287 28087117 37173169 48413254 59380561 67884378 73744564 76638770 77883971
19774G7883971L387935O586956P989363Q210285N994684Q51792k375245k131397
19766A06398344k348832l840814n009938o011452p846928j1253743j3291189j1386288
19758D5409160p919526n174757l563336k550777j991894j737396j608820j409693
19750A9452961j142229j217616j325589j344509j249845j145227j031126r20427
19742A0076393r42150q56737q28683p56419o54512o58965o09946n91092n41224
19733C636665m35537l18818l10059k95842j83376k07825j15548l3357j0994j41034
19723A584275j15239o6207q5459q1988m8938k3647o0166n6913L5082Q3828Q508
19712A173136M3163K9743J698N979k8928L8499Q4419R222J4065p3202m3779L8767
$$ plain form
19774 77883971 81271906 87858862 95848225 104058510 110053194 110904986 108529741 106398344
19766 106398344 104049512 100208698 95198760 89187308 81340380 70086637 56795448 45409160
19758 45409160 37489634 32314877 28751541 26200764 24208870 22471474 20862654 19452961
19750 19452961 18310732 17093116 15767527 14423018 13173173 12027946 10996820 10076393
19742 10076393 9134243 8277506 7448823 6692404 6037892 5378927 4768981 4177889 3636665
19733 3636665 3201128 2882310 2572251 2276409 2093033 1885208 1769660 1736303 1725309 1584275
19723 1584275 1469036 1402829 1317370 1235382 1186444 1162797 1102631 1045718 1080800 1164628 1173136
19712 1173136 1216299 1246042 1247740 1253719 1224791 1263290 1347709 1356931 1370996 1297794 1254015 1292782
19700A292782P8450M2114N6756K6720p1456j23299m5831j13902j11000q1493j02122
19689H47719l7506o3075m4623l1509r1877n6571o9072p3847J0339j4822j3784
19678C61372K2584j4683M3271O6611k0388o8260l4983M2341k2009j1245j3180
19667C51431k8796l3747J2614J2745k749r1753o0133l8829K6264J588L7216M1494
19655B27345Q1678M2671O2933L229l8409M1722N6066k3128q8034k5861k748J4105
19643C51569p053j4608P0622M4570n5765j52883r7381j4262O2887J5351j3990
19632A89057o108P0431j6920j1067N6449R1913n679n3143l429j1182K9452j7798
19620C11976p8842l1052J0335j6163l2391J5180q2534j9678P7431J32124L5720
$$ plain form
19700 1292782 1371232 1413346 1470102 1496822 1425366 1302067 1256236 1142334 1031334 949841 847719
19689 847719 810213 747138 702515 671006 579129 522558 453486 379639 389978 375156 361372
19678 361372 383956 369273 412544 479155 458767 390507 355524 397865 375856 364611 351431
19667 351431 322635 288888 301502 314247 311498 219745 159612 120783 147047 148635 185851 227345
19655 227345 309023 351694 414627 417856 379447 421169 477235 454107 366073 340212 337464 351569
19643 351569 344516 329908 400530 445100 389335 236452 139071 124809 187696 203047 189057
19632 189057 182949 253380 236460 225393 281842 373755 368076 314933 311504 300322 329774 311976
19620 311976 233134 202082 212417 196254 163863 179043 96509 76831 154262 286386 322106
19609C22106p3660k567l2320k7111R412M945m1394M2611k1740k3772j6149m1447
19597I8914k1140j3794l318J7359p879K5078l3731j8092N986P9732M9573J2656
19585A91344O921l0812o3495L3825m5178m549O5670m3621j6585m3831m7462k9832
19573b7605M656O6441M2598l9533p9462l8875K8678j2803J6999L8885k2867M1634
19561A8746l5114n2775K2404O6459M5658K6026J7966J329k303J2139p083L7733
19549A51185P4892n054L1223n3120m7964K3149O7965j5541l4122M3957j0923l7683
19537A87964J6697Q3776P4866J10663R5411K975O9685L7221R38k7157j9156k1209
19525F12674j9093o6244j31975q2275j45670o6312J1175L3432M258l3851m3918
$$ plain form
19609 322106 248446 245879 213559 186448 195860 200805 159411 202022 180282 156510 140361 98914
19597 98914 77774 63980 60662 78021 70142 95220 61489 43397 49383 129115 178688 191344
19585 191344 198265 167453 103958 137783 92605 88056 153726 110105 93520 49689 2227 -27605
19573 -27605 -22949 43492 86090 46557 -32905 -71780 -43102 -55905 -38906 -21 -22888 18746
19561 18746 -16368 -69143 -46739 19720 65378 91404 109370 110699 108396 120535 113452 151185
19549 151185 226077 221023 252246 199126 151162 174311 242276 226735 192613 236570 225647 187964
19537 187964 204661 288437 363303 473966 569377 572352 642037 679258 680196 653039 633883 612674
19525 612674 593581 527337 395362 313087 167417 101105 112280 145712 149970 116119 72201
19514G2201O3185m0181j6154n5390Q1747L2919L52Q2188R6456J4873o3825j0970
19502B57401L7604J2771K6951Q6281L4789J55484J56117J53681K03489K81760
19492A406328L11011K89477K63304R1034r5036k29409k69119l65911l84801k41239
19482G75639o5640r6474l1135j6270l1207J6294k1567j9675l9745l6983l2385
19471D00852P5108K0959j36496q0972L6838J7031j8813J4540O3450k8607p5498
19460B88392l3402j3155N4839M9662R164j1880K201J3746L2000K8681P925n8145
19448C70028o2069M2110M2553P8042M7668l7762p6604j4248p5478K0870P7064
19437D12174N6574n9316q3289k287q422j2435m4152k0056n1308o398O9686L390
$$ plain form
19514 72201 135386 95205 79051 23661 105408 138327 138679 220867 317323 332196 268371 257401
19502 257401 295005 307776 334727 421008 455797 611281 767398 921079 1124568 1406328
19492 1406328 1717339 2006816 2270120 2361154 2266118 2036709 1767590 1401679 1016878 775639
19482 775639 709999 613525 582390 566120 534913 551207 529640 509965 470220 433237 400852
19471 400852 475960 496919 360423 279451 316289 333320 314507 329047 392497 363890 288392
19460 288392 254990 241835 296674 346336 355500 343620 345821 359567 391567 420248 428173 370028
19448 370028 307959 350069 392622 470664 518332 480570 403966 389718 314240 335110 412174
19437 412174 468748 409432 326143 323856 315434 302999 258847 238791 187483 181085 250771 254161
19425B54161k7723P0633J560n5425N0616m4453m0032N5018L1666L4983n4793q6730
19413A89481Q744o8616k0910M6502Q9238R3878L2224m4631j28761n0589L7229
19402A83789M4284M8208k4008j5147o5412J0430N5438M3187k3447k6682k9838
19391B00802J7452K4390O674l2302m9409l7694L2664J8662L614k3523O2263L3111
19379B56704R812L2458K5348O043M5698L9914O8775P358o0066n2001J7072o0625
19367C36490q7237J875m22j1095M1713N2952N5459M2091l7022l2444o09n5467
19355C06284m2675j540N3123N0911J3450k6573Q847L4026L762p68l8132j1303
19343C49412P437k2674p70M815K5134L1701l451L1357P4265J4036k0587n1387
$$ plain form
19425 254161 226438 297071 298631 243206 293822 249369 209337 264355 296021 331004 276211 189481
19413 189481 198225 129609 108699 155201 244439 338317 370541 325910 197149 146560 183789
19402 183789 228073 276281 252273 237126 171714 182144 237582 280769 257322 230640 200802
19391 200802 218254 242644 249318 217016 167607 129913 162577 181239 184853 161330 223593 256704
19379 256704 266516 298974 324322 330365 376063 415977 484752 492110 432044 380043 397115 336490
19367 336490 249253 251128 250706 239611 281324 334276 389735 431826 394804 362360 361751 306284
19355 306284 263609 262069 315192 366103 379553 352980 361827 395853 399615 398847 360715 349412
19343 349412 356849 334175 333405 338220 363354 395055 391604 422961 497226 511262 490675 439288
19331D39288j25703l3220J7800o662J5257L5265P2856J2486o871m3301K2740N8198
19319D58133Q715P1389R0471P372K7132M7779O4648K7263j14250r3615o0518o6941
19307D67578K4609J1304q435R8915Q0131O6872L8654N4226J03416R2957r150M445
19295A025522L6911O6761j517O606Q7234P6468M9485l0462J0251L3151k1324p7399
19283A261687m4816K8538L5261L6559p98k8477J1167N7080O6583N5327L6034J06301
19271A620446J40680J34901J44734K84777L47170L44421L74128K79487K25799
19262C896543J67153P8161R4616K29633M06138N03578O51510P77671J014185J584349
19252I403537K316973L312072M900359P039108R749081J1695074J1257371R449185
$$ plain form
19331 439288 313585 280365 298165 291503 306760 342025 414881 427367 420496 377195 399935 458133
19319 458133 466848 538237 628708 636080 663212 710991 775639 802902 688652 595037 534519 467578
19307 467578 492187 503491 495056 593971 674102 740974 779628 833854 937270 1030227 1021077 1025522
19295 1025522 1062433 1129194 1127677 1134283 1221517 1297985 1347470 1317008 1327259 1360410 1339086 1261687
19283 1261687 1216871 1245409 1280670 1317229 1316431 1287954 1299121 1356201 1422784 1478111 1514145 1620446
19271 1620446 1761126 1896027 2040761 2325538 2672708 3017129 3391257 3670744 3896543
19262 3896543 4063696 4141857 4236473 4466106 4872244 5375822 6027332 6805003 7819188 9403537
19252 9403537 11720510 15032582 19932941 26972049 36721130 48416204 59673575 69122760
19244F9122760Q277575O083940M306301M307757N515301N107943m32148n328682
19236I6960747o148380o939176o068113k289802k64960j441631l711010p972101
19228F2125574j1226231j0062768p014074m547713k999505k195635j842948j615846
19220B0620854j264340q99099n90957m87514o44582p21565q70610q05478p30658
19211A3606051o98464o11239m34323l21949j93784m0413K45396O03673R64013
19202A3118961J566572K487207L910060N871335Q604471J2113310J5032029J5336024
19194G8039969J4074686J2418693P283555Q55930m57399K62998o75614j603025
19186A10199793j142979p5004j806980m228351n525922o154848p851234j2216268
$$ plain form
19244 69122760 77400335 83484275 87790576 92098333 97613634 102721577 102289429 96960747
19236 96960747 90812367 83873191 77805078 75515276 75250316 73808685 70097675 62125574
19228 62125574 50899343 40836575 33822501 29274788 26275283 24079648 22236700 20620854
19220 20620854 19356514 18457415 17866458 17378944 16734362 16012797 15142187 14336709 13606051
19211 13606051 12907587 12296348 11862025 11540076 11346292 11305879 11551275 12154948 13118961
19202 13118961 14685533 17172740 21082800 26954135 35558606 47671916 62703945 78039969
19194 78039969 92114655 104533348 111816903 112672833 112215434 112478432 111802818 110199793
19186 110199793 109056814 108981810 107174830 102946479 97420557 91265709 83414475 71198207
19178G1198207j4046696j1433358p818903n165655l548934k540370j918749j724353
19170B3001189j601922j276688j020085j090541j295695j321250j267791j239809
19162A2887408j170582j149620r57971q84393q74342q29705p72484p06256o09726
19153D932329m97939l55156l72306l86541k92465k41079k37107j87620j63006
19144B199110j42478j35547p2578j07194p2437q152o2649k9819k0714j09603o7012
19133A370927o4014N1060M200l5442M9879R321n9226n1915Q918j3766o044k7594
19121A236304j2399L0611P302J0582k968Q9918Q4853J16958M6611Q2209J03108
19110A793089O9357N2425j8397j15202j41862j71062j25291q9783p8486k5110
$$ plain form
19178 71198207 57151511 45718153 37899250 32733595 29184661 26644291 24725542 23001189
19170 23001189 21399267 20122579 19102494 18011953 16716258 15395008 14127217 12887408
19162 12887408 11716826 10567206 9609235 8724842 7850500 7020795 6248311 5542055 4932329
19153 4932329 4434390 4079234 3706928 3320387 3027922 2786843 2549736 2362116 2199110
19144 2199110 2056632 1921085 1848507 1741313 1668876 1660724 1598075 1568256 1547542 1437939 1370927
19133 1370927 1306913 1357973 1362173 1326731 1376610 1385931 1326705 1274790 1283708 1269942 1263898 1236304
19121 1236304 1223905 1254516 1261818 1272400 1269432 1359350 1444203 1561161 1607772 1689981 1793089
19110 1793089 1862446 1914871 1896474 1781272 1639410 1468348 1343057 1253274 1174788 1149678
19100A149678p412o2870k3641j5320q128n3129n6027j11498n0101N4680k1545
19089G94687J8296j5616q8182k4816m5585m4441l4889m6294n3324L236J6265N5821
19077E35158R5585J3893Q3267J22623j0491p2110j04989q1626k6018p1995k9252
19066D54045L0743L7716j8444k174O5648L7423L8357J2948K9584N8551O921J6840
19054G68158l9290m108k6505k8103o3128j6583K5759N0199N2871m9185o4138n2476
19042E53471p6196p4799k4778o5387n7265O2807L1787k3041o3696j620J7526k7873
19030B50936n4665l0410J4464p85J5360J26153J08660l5933n4150K7475L4117
19019D01222L3545K6824K2280m4257m4024q3025m477L3761j8842L5432l2164p4889
$$ plain form
19100 1149678 1142266 1079396 1055755 1040435 1032307 979178 923151 811653 761552 816232 794687
19089 794687 812983 797367 709185 684369 638784 594343 559454 513160 459836 463072 479337 535158
19077 535158 630743 644636 727903 850526 840035 767925 662936 581310 555292 483297 454045
19066 454045 484788 522504 504060 501886 567534 604957 643314 656262 685846 744397 751318 768158
19054 768158 728868 724760 698255 670152 607024 590441 616200 666399 719270 670085 605947 553471
19042 553471 477275 402476 377698 312311 255046 317853 349640 326599 262903 261283 278809 250936
19030 250936 196271 165861 180325 179540 194900 321053 429713 393780 339630 367105 401222
19019 401222 434767 461591 483871 439614 395590 312565 308088 341849 323007 358439 326275 251386
19007B51386n9410o6506J2281O2783O7567O0246l0937j03525l9492L4166L9570
18996B28129M6559l1274k8248M125M5367l4822n3406L2242O4213R274o3731o1770
18984A56658J0124J4927p3273L419L5185N521J260N1002K5645M2957p061k1930
18972B44434m8089m5469N6427J7711k0444L481K5693K4213r2925k0401J9839k6937
18960A37533J07789Q0792j5112j09736n9860l5426J8853j3512k9581J6433L8750
18949A36923M7749K5749L7649R166k8004o1281P2964q809M315M0453J5390o1525
18937B30739J8888L1933r2446k5321N8L8616J6141j3013J9235O8400n1448m7265
18925A94517M2205L9160O3117M4561M0591J7900o9849k7329n8968P271J1366J3794
$$ plain form
19007 251386 191976 125470 137751 200534 268101 328347 297410 193885 154393 188559 228129
18996 228129 274688 243414 215166 219291 264658 229836 176430 208672 272885 282159 218428 156658
18984 156658 166782 181709 108436 111855 147040 152561 153821 204823 230468 273425 266364 244434
18972 244434 196345 150876 207303 225014 204570 208051 233744 257957 165032 144631 164470 137533
18960 137533 245322 326114 311002 201266 141406 105980 124833 111321 81740 98173 136923
18949 136923 184672 210421 248070 257236 229232 167951 240915 232106 236421 276874 292264 230739
18937 230739 249627 281560 189114 163793 163851 202467 218608 205595 224830 293230 241782 194517
18925 194517 236722 275882 338999 383560 424151 442051 372202 344873 285905 293176 304542 318336
18913C18336N8754O864j4540m2445K977J1734n5182j2289l5419K5869K4989j658
18901B87990k4666j3000o9035L5631m658n3091K1452J0858O6676o407k0675q648
18889B22427M2179O5129N4013m6771m5580j8123N734M2539M3968k8731M1597j0533
18877C67848m2181l1530l6232j5202J160K0132Q6339Q0943Q288L6411j3758l1113
18865D31105L4152j5314j5150r9520L5338k0951Q6253N006n2288K013l5156j7137
18853C38351K7658l9059K526m158r132J1750K8197L0898M9042M7389q946p2964
18841D01552J5194K9501o3358q850P2509J2922m6633o2481r77q713N2712K7625
18829D21003l8745o0799j7979P1629J2211m1277k1372j6929K5955P035o868P9150
$$ plain form
18913 318336 377090 383954 369414 326969 329946 341680 286498 274209 238790 264659 289648 287990
18901 287990 263324 250324 181289 216920 212262 159171 180623 191481 258157 251750 231075 222427
18889 222427 264606 329735 383748 336977 291397 273274 279008 321547 365515 336784 378381 367848
18877 367848 325667 294137 257905 242703 243863 263995 350334 431277 439565 475976 462218 431105
18865 431105 465257 449943 434793 335273 370611 349660 435913 440919 388631 390644 355488 338351
18853 338351 366009 326950 329476 325318 316186 327936 356133 387031 436073 483462 474516 401552
18841 401552 416746 446247 382889 374039 446548 459470 412837 350356 349379 340666 393378 421003
18829 421003 382258 321459 303480 375109 387320 346043 324671 307742 333697 340732 333864 413014
18817D13014J0269P375N6135l0262k6747L2802o0712M9364M2424K9685l3920M9749
18805E39176j894R499N8138p537k3073q6067J8214J41077L4065M9884N4400j0842
18793G75040K3273L9093L6423L747R6166J32345M1477N3161J30317J27669J4906
18782A473617j6534J5910K9777N3534N2378J41619J14046J10204P3349K04192
18772B252092K65813L11391M09528O85539R23048J222101J623010K273707L359393
18763A3325622M718514O227093O754153N298352L157687Q96288k068575k931504
18755C5377630l74610L111878M838719L501549Q89554k319503o626614q416521
18747B9982082o900229m495490k674766j692379j209581q37579n98665m84948
$$ plain form
18817 413014 423283 430658 486793 456531 429784 462586 401874 451238 493662 523347 489427 539176
18805 539176 537282 546781 604919 597382 574309 488242 506456 647533 681598 731482 785882 775040
18793 775040 798313 837406 873829 877576 973742 1106087 1147564 1200725 1331042 1458711 1473617
18782 1473617 1457083 1472993 1502770 1556304 1608682 1750301 1864347 1974551 2047900 2252092
18772 2252092 2517905 2829296 3238824 3924363 4847411 6069512 7692522 9966229 13325622
18763 13325622 18044136 24271229 31025382 36323734 39481421 40377709 38309134 35377630
18755 35377630 35003020 38114898 42953617 46455166 47344720 45025217 38398603 29982082
18747 29982082 23081853 18586363 15911597 14219218 13009637 12172058 11573393 11088445
18739A1088445l80906k19870j82180l21758m20321l90230l50010k74200j81739
18730H367231j22741r1544Q4346J99136L50353N97356R15478J332711J827623
18721A3459949K723745M168483O127661R076568J2609370J5593875J5320987J1085797
18713I0166435O847344J462986m000321m097925O77071N046808M463331N75130
18705A01140859k367226o080052r587795q531321n651152m302847m581221o670656
18697E3368589q475349p655891n545082l743785k444289j768163j446022j383049
18689B0906959j339162j119217r71956p93764q55425r13154q74928p30341o67341
18680A2641671n93604m36798l01990r5341J88088M63659P60531J242379J768668
$$ plain form
18739 11088445 10707539 10487669 10305489 9983731 9563410 9173180 8823170 8548970 8367231
18730 8367231 8244490 8152946 8237292 8436428 8786781 9384137 10299615 11632326 13459949
18721 13459949 16183694 20352177 26479838 35556406 48165776 63759651 79080638 90166435
18713 90166435 97013779 98476765 94476444 90378519 91055590 96102398 100565729 101140859
18705 101140859 98773633 92693581 83105786 74574465 68923313 64620466 60039245 53368589
18697 53368589 44893240 37237349 31692267 27948482 25504193 23736030 22290008 20906959
18689 20906959 19567797 18448580 17476624 16682860 15827435 14914281 14039353 13309012 12641671
18680 12641671 12048067 11611269 11309279 11213938 11402026 11865685 12626216 13868595 15637263
18671A5637263K628965L895870N742416Q556279J2169449J4962268J3952054Q821262
18663H6365826L074738m070186j0836270j0969058n348170J558699P008394Q811711
18655G5595684N922076J339276m036726j0638081j3156155j0497731o849211m000125
18647C3679007j778550j47980J561881L621387O255501Q995285J0870127J0592732
18639G3649390R037028N742861k81302m619539n989587o072975l135629K047453
18631G0377700O528848P883075P026353L302350l750007q802763j1604151j3195389
18623E7766016j1863878q759240n937152l939963k724380j946758j286073q68385
18615B0440187p71984q29544p60420q97134j030245r75242p98489p36647o71490
$$ plain form
18671 15637263 18266228 22162098 27904514 36460793 48630242 63592510 77544564 86365826
18663 86365826 89440564 85370378 74534108 63565050 58216880 59775579 66783973 75595684
18655 75595684 81517760 82857036 78820310 68182229 55026074 44528343 37679132 33679007
18647 33679007 31900457 31752477 33314358 36935745 43191246 52186531 63056658 73649390
18639 73649390 82686418 88429279 88147977 83528438 77538851 71465876 68330247 70377700
18631 70377700 76906548 84789623 91815976 95118326 91368319 82565556 70961405 57766016
18623 57766016 45902138 37142898 31205746 27265783 24541403 22594645 21308572 20440187
18615 20440187 19668203 18838659 18078239 17181105 16150860 15175618 14377129 13640482 12968992
18606A2968992n41508k81742p4947J09103K73956O90275J205991J899812K903665
18597A9153597M266605N844437O960946P339195P692540P366205O442664O496216
18589G1562405N871590M963795M427280K125117K33749K8927J00260L61147Q32109
18580I0506379P84999k94477l874605q097597r835012j0605227j0756373q990110
18572C8837977o294645m174555k959280k103466j542651j283637j128594j124838
18564A8226311j068309j038565j118593j078046r94136q74469q02572p32771n52271
18555I966579m79473m11353k13153n707J08028L32764P37053J315935K089495
18546A3440168L234013M428684M982851M662781M020018K212886m55912j617891
$$ plain form
18606 12968992 12427484 12145742 12070795 12179898 12453854 13144129 14350120 16249932 19153597
18597 19153597 23420202 29264639 36225585 43564780 51257320 58623525 65066189 71562405
18589 71562405 77433995 82397790 86825070 88950187 89183936 89212863 89313123 89674270 90506379
18580 90506379 91291378 90996901 87122296 79024699 69189687 58584460 47828087 38837977
18572 38837977 32543332 28368777 25409497 23306031 21763380 20479743 19351149 18226311
18564 18226311 17158002 16119437 15000844 13922798 12928662 12054193 11251621 10518850 9966579
18555 9966579 9487106 9075753 8862600 8856893 8964921 9297685 10034738 11350673 13440168
18546 13440168 16674181 21102865 26085716 30748497 34768515 36981401 36525489 34907598
18538C4907598j877100j508549k33687R89455J458640R85649j106245k991180
18530C0624581l795133m445058m377473l414110k329601j563857j064021p90949
18522H844379n36383m42016l36500l45355l93022m56504n57813n09758l49021
18513D918007k92595k99473l14143l13033k53745k34607k52020k27713j83266
18504B547412r6229j89545k13907j91437j35021j18339j33508j58356j16375r0186
18494A104509r0688o0896n3857m6364l2373m9290j2103R997K9912L4247k1494
18483H11600k4281k5150N903o5856L685J173K8264K2212J5525j7109L3041M5279
18471H34286M1895m1090n0498p4429j9944j5416q665p664m8917K2280J4688M0507
$$ plain form
18538 34907598 33030498 31521949 31288262 32277717 33736357 34722006 33615761 30624581
18530 30624581 26829448 22384390 18006917 14592807 12263206 10699349 9635328 8844379
18522 8844379 8307996 7865980 7529480 7184125 6791103 6334599 5776786 5267028 4918007
18513 4918007 4625412 4325939 4011796 3698763 3445018 3210411 2958391 2730678 2547412
18504 2547412 2451183 2261638 2047731 1856294 1721273 1602934 1469426 1311070 1194695 1104509
18494 1104509 1013821 952925 899068 852704 820331 771041 758938 768935 798847 833094 811600
18483 811600 787319 762169 768072 702216 705901 707074 735338 757550 773075 755966 789007 834286
18471 834286 876181 835091 784593 710164 690220 674804 666139 658475 609558 631838 646526 687033
18459F87033j653l7427j3966p5418n3311L1892J1485k7837j2747N599m2667j3696
18447D57287k2032l9979O290m3488p1213J9720K6837l08m515L6904n0913L1501
18435C46091P7933L7493M1212N3719k2559L9714J9190J1789j9000j39263j1628
18424D34691J1896J4822J699O08L2682M9510M3367M6169p668l3519l6990m479
18412E52788l3247l7318K0668o0508o5995J3043M0898o5273l036m0962k6301N0548
18400C45305J00438J12559N2573j0755L1682M1354q2563n9527l1903L0987m7141
18389D83009k2161K7197P463K5881O3004k2785K3555K4996K0466J05012J6500
18378G52137r0118o3387o9079r6145N8365Q0675N4817K0496k4665j18535p2273
$$ plain form
18459 687033 685380 647953 633987 558569 505258 537150 548635 520798 508051 513650 470983 457287
18447 457287 435255 395276 401566 358078 286865 306585 333422 333114 328599 365503 314590 346091
18435 346091 424024 461517 502729 556448 533889 573603 592793 604582 585582 446319 434691
18424 434691 446587 461409 463108 463716 496398 545908 589275 635444 627776 594257 557267 552788
18412 552788 519541 482223 502891 442383 376388 389431 430329 365056 362020 321058 294757 345305
18400 345305 445743 558302 610875 600120 631802 673156 590593 531066 499163 530150 483009
18389 483009 460848 488045 495508 521389 584393 561608 585163 610159 630625 735637 752137
18378 752137 662019 598632 529553 433408 491773 572448 627265 647761 623096 504561 432288
18367D32288p0760m614P7525j07900O096J3463O874Q8928M811m3856l3190o0912
18355C08753p9143j5Q1075l4723l2228m1300j8264L4462J1733K2689o6136o4347
18343A22556Q4813J2112j5250K7561O9093l9824O898K0906L1219J469l2656o7607
18331B21290J0473O4325m578q4905k8578M3762J0185L3754P4031K2843n2290m6825
18319B63487l0733r7825k7279N1807L5050Q0026m443n8481L4946J5789l273K0204
18307B79275K7987l0048J7157L7353j5165j6784k4786n7349o7943k0271K6572
18296A55998J6452O5381J01278M0087p7162o2745l7608K254l181k3339l0783N7926
18284B04558K9844N9187k6408k2192L4455M3695K0482o5124m2462Q583L1005n8543
$$ plain form
18367 432288 361528 356914 434439 326539 332635 346098 352972 441900 446711 402855 369665 308753
18355 308753 229610 229595 310670 275947 243719 202419 184155 218617 230350 253039 186903 122556
18343 122556 207369 219481 204231 231792 300885 261061 267959 288865 320084 321553 288897 221290
18331 221290 231763 296088 291510 206605 178027 221789 231974 265728 339759 362602 310312 263487
18319 263487 232754 134929 107650 159457 194507 274533 270090 211609 246555 262344 259071 279275
18307 279275 307262 277214 294371 331724 316559 299775 274989 217640 149697 129426 155998
18296 155998 172450 237831 339109 379196 302034 239289 201681 203935 200754 177415 146632 204558
18284 204558 234402 293589 267181 244989 279444 323139 343621 278497 236035 244618 275623 217080
18272B17080o4916K3481R159O971j4829N0814J00072O053o6986j9528O3895M9642
18260C60908L6763L6947K7388N8883J13078K0766l0338k4138n3212p3847r2293
18249C80905p3289p2683j7749L2105P150L4567J3400P413Q5332J47474j6830J7534
18237E45329K7244L0122J6992k1780q2422K2677L5208J3834n3243q4079m1150
18226D08732k4136j3731l3372k7553L9871L8797J7349k6632j765j9292q0064m6474
18214B31730J1269k6854J2005j5770J5359Q550K8175j3838p7626L3946Q0673J4434
18202C02053l0510k7851l5306j6858K0555P001q0584Q4273J16179m369L6541J37597
18190E08721N8590m655J2416N9688J14640L3142j1573K843k1355o1759L047R683
$$ plain form
18272 217080 152164 175645 184804 191775 176946 227760 327832 333885 266899 247371 311266 360908
18260 360908 397671 434618 462006 520889 633967 654733 624395 600257 547045 473198 380905
18249 380905 307616 234933 217184 249289 256439 291006 304406 311819 397151 544625 527795 545329
18237 545329 572573 602695 619687 597907 515485 538162 573370 587204 533961 449882 408732
18226 408732 384596 370865 337493 309940 349811 388608 405957 379325 377560 358268 278204 231730
18214 231730 242999 216145 228150 212380 227739 236289 264464 250626 173000 206946 287619 302053
18202 302053 271543 243692 208386 191528 212083 219084 138500 222773 338952 334583 371124 508721
18190 508721 567311 562656 575072 634760 749400 782542 770969 773812 752457 690698 693745 703428
18178G03428r7443r5224r0586j07522m5351l4464N3125L0203K9444o798r412o7860
18166B61540k4917k4889N8859M0599L5433n4190o8119K5848k0379O2084n884l0199
18154B55786m4922j3937P7733N3823l3065K7298k9545n2373J1064N5697N9489
18143C67048P8723R6362J38669J6513l5081K2407K8478k722N3118P8343J56404
18132I98262J42736K8619j6862J2815R4684J39410K10232K44928J93692L20095
18122B368611L24929L67342M76687O44246Q18491J050802J528258K314683L586544
18113A3480593N512937Q415186J2594925J7276799J8978284J2887506M835353
18106I3981583l263266j5580961k1397672j7005186j0520111o046713l564477
$$ plain form
18178 703428 605985 510761 420175 312653 267302 232838 285963 316166 345610 338812 329400 261540
18166 261540 236623 211734 270593 311192 346625 292435 224316 250164 229785 291869 285985 255786
18154 255786 210864 196927 274660 328483 295418 322716 293171 240798 251862 307559 367048
18143 367048 445771 542133 680802 697315 662234 684641 713119 710397 763515 841858 998262
18132 998262 1140998 1169617 1152755 1165570 1260254 1399664 1609896 1854824 2048516 2368611
18122 2368611 2693540 3060882 3537569 4181815 5000306 6051108 7579366 9894049 13480593
18113 13480593 18993530 27408716 40003641 57280440 76258724 89146230 93981583
18106 93981583 90718317 75137356 53739684 36734498 26214387 20167674 16603197
18099A6603197k175944j420586r21326n12084j63349k0189l43037q16025r70420
18090I260237r25087q42448p59820n91476n64888n23720m50265l70355l57401
18081C874777k58167k60327k24032k65793k85919k85136k09557j33237j54473
18072A798136j07332r5779j41857j05416j35413k26479j30231j2911l1832o7854
18062G43032r8831k4752k8070p1809q1461m4032k1320o074j5978R095k3393n6888
18050B79519m8601M5902l7489j8179Q5228k3378q6728j06579k0615P4845L4572
18039A78497K3942P5922M7803l0958j1061n3290L1314K1561M3787k3500k3548
18028B80469Q7613K6757N8023L3311j4024k2997m9459N7533Q208m5700m1050n7237
$$ plain form
18099 16603197 14427253 13006667 12085341 11573257 11409908 11389719 11046682 10230657 9260237
18090 9260237 8335150 7492702 6732882 6141406 5576518 5052798 4602533 4232178 3874777
18081 3874777 3616610 3356283 3132251 2866458 2580539 2295403 2085846 1952609 1798136
18072 1798136 1690804 1595025 1453168 1347752 1212339 985860 855629 842718 810886 743032
18062 743032 644201 619449 591379 519570 438109 394077 372757 366683 350705 359800 336407 279519
18050 279519 230918 276820 239331 221152 306380 283002 196274 89695 69080 143925 178497
18039 178497 202439 278361 326164 295206 284145 230855 262169 283730 327517 304017 280469
18028 280469 368082 394839 452862 486173 472149 449152 399693 457226 465434 419734 378684 321447
18016C21447j902k0046k0451O0092K5580o1463o8682k0868k9122j0987O7354J3631
18004B54583j01735O31K6769j02757j1529J222J0397K7072M8549M8427q365m4486
17992A48778l4623m9464Q957L9291J3153M971j046n509j3783L1670L1491j7630
17980A56256j6700K5622p54j4656m9725m8382R482J8740J0083j852j5175K9909
17968A02848L4577k9768q284k981k8390m3723J2095K0590R1227O2782n6565p1800
17956H2608j7834M3578J7783l785m5408K1315J5650N9367l3048n8641K430l1439
17944E2576p956R615K2090L867m5073n8536j8151m3153M891L6948Q3155l1539
17932H734j1933k1702j9394J9694J7379k5601k5698l6547N902j7433L0482M2356
$$ plain form
18016 321447 319545 299499 279048 339140 364720 303257 234575 213707 184585 173598 240952 254583
18004 254583 152848 153479 180248 77491 65962 67184 77581 104653 153202 201629 193264 148778
17992 148778 114155 64691 73648 112939 126092 131063 130017 124508 110725 142395 173886 156256
17980 156256 139556 165178 164424 149768 100043 51661 61143 79883 89966 88114 72939 102848
17968 102848 137425 107657 99373 96392 68002 24279 36374 56964 148191 210973 154408 82608
17956 82608 64774 108352 126135 122350 76942 98257 113907 173274 140226 81585 84015 52576
17944 52576 44620 54235 76325 80192 35119 -23417 -41568 -84721 -79830 -42882 40273 8734
17932 8734 -3199 -24901 -44295 -24601 -7222 -32823 -58521 -95068 -89166 -106599 -76117 -33761
17920c3761k3829Q429K3782m939N317J4853N0154p8p8141K4289J3254k4507J6154
17907i023q084K8157J0938o9107l7150R2928K5761j8438K8350N9492o133m0592
17895E7099Q94l0892k6281P86m8622n0053J7222O6275N5241n1840j9037j0023
17883c9231P6361K4621n0197m0493M3316P4870n1432l8091J19410M3592l205k6436
17871A33085l7727j1386P1482R939l4623k8236m4972K7216J6380k9559P33R429
17859H1761o1606K0741q020n3247M5351O4072m5070m4930J5935O1398l6692k9974
17847I719l516l3658L3699L785k6716m6168R569Q4086M7824m7069n5051k1912
17835d5408J498J8659m4823k4073L2134R909N0233N7373K590k9773R873O341k633
$$ plain form
17920 -33761 -57590 -49161 -25379 -30318 -25001 -10148 40006 39928 -38213 -13924 -670 -25177 -9023
17907 -9023 -17107 11050 21988 -47119 -84269 8659 34420 15982 44332 103824 97691 57099
17895 57099 57993 27101 820 1606 -47016 -97069 -79847 -13572 41669 -10171 -29208 -39231
17883 -39231 37130 61751 11554 -28939 14377 89247 37815 -276 119134 162726 159521 133085
17871 133085 95358 83972 155454 165393 130770 102534 57562 84778 101158 71599 72332 81761
17859 81761 20155 40896 32876 -20371 24980 89052 43982 -948 14987 76385 39693 9719
17847 9719 6203 -27455 6244 10029 -16687 -62855 -53286 30800 78624 31555 -23496 -45408
17835 -45408 -43910 -25251 -70074 -94147 -62013 -52104 -1871 55502 58092 28319 38192 44533 41900
17822D1900L6189m308k9914r606R5131n033j18053m5307J7973j4795M3297M9697
17810E7171j6068O392M0199k8450n7579k4131m4244P175j7753K7377N1342l3016
17798c1585N6283L9944m472J824m92k4610j182K7813j8242k1574J7148L3699O9937
17785A44491M1315O377L886o8121o0249Q2151M2128j01498k9365o5710l0951j0361
17773d5907n855Q7467J3358n925j3644m661J8265k6307J0569n028m0769N9699
17761D1262j3778m8978n694k1587L9412o86l3367N2309K1846m6803m8546J03668
17749C9058K5194N0725m1596m0163m2533J3778J9707k0443o0060m989o3768n6616
17737a81706Q8043O1250k2036O933Q9373P8297p5368o2804p229k928K4342K9365
$$ plain form
17822 41900 78089 73781 43867 34261 129392 124359 6306 -39001 -21028 -35823 7474 57171
17810 57171 41103 47495 87694 59244 1665 -22466 -66710 -59535 -77288 -49911 1431 -31585
17798 -31585 24698 64642 60170 61994 61502 36892 35710 63523 45281 23707 40855 74554 144491
17785 144491 185806 192183 196069 127948 67699 149850 191978 90480 61115 -4595 -35546 -45907
17773 -45907 -51762 35705 49063 43138 29494 24833 43098 16791 27360 22332 -18437 41262
17761 41262 27484 -21494 -27188 -48775 -9363 -10049 -43416 8893 30739 -16064 -64610 39058
17749 39058 64252 114977 73381 33218 -9315 4463 24170 3727 -56333 -61322 -125090 -181706
17737 -181706 -93663 -32413 -54449 -47516 41857 120154 44786 -18018 -25247 -28175 -3833 25532
17725B5532J5895Q63m694O53j3479P508J7971N098n7686p0559l1259k2758N2305
17712g4610P6071q314N145K2962N894j7089j8516J0851n026J0243j4102K6329
17700A9838L2148l8954k3835J7762N844o63N14K519n342k3867j8125n7866K961
17687h7066m362L2606J1593Q094m6243J6454R2342K1184k3089m2495k6762K1222
17675b6522K3159L8195K9829L430N466l8880m6037j9678l2307M771J9320J7724
17663b1530L351n409k5618M2826O2104m492M5762l331j4228n321n5154K5269l3693
17650A0536k3014k7604J0763l1806j8528M9148q738k3349M7919J0235L6824l1829
17638E57K466L9969k5905o5446m7985l7177L7545K6901J0959J5903O2112M6537
$$ plain form
17725 25532 41427 42290 37596 38249 24770 32278 50249 55347 -2339 -72898 -104157 -126915 -74610
17712 -74610 1461 -6853 -1708 21254 27148 10059 -8457 2394 -2632 7611 -6491 19838
17700 19838 51986 13032 -10803 6959 12803 12140 12654 15173 9831 -14036 -32161 -90027 -87066
17687 -87066 -91428 -58822 -47229 -39135 -85378 -68924 23418 44602 21513 -20982 -47744 -26522
17675 -26522 -3363 34832 64661 68091 73557 34677 -11360 -31038 -63345 -58574 -39254 -21530
17663 -21530 -18179 -23588 -49206 -6380 55724 51232 96994 93663 79435 74114 18960 44229 10536
17650 10536 -12478 -40082 -29319 -61125 -79653 -30505 -39243 -62592 -14673 -4438 32386 557
17638 557 3023 42992 17087 -48359 -96344 -133521 -95976 -69075 -58116 -42213 19899 66436
17626F6436l9287j1400j2891l3266l5124k8840L2895K0003K354O021N6682j9634
17614C949j07325o862Q050L0205J10612M9502O1246n0159p6158r4309n442k569
17602g9260N3916K6894l2877O9684j3673m3152K3585J2762J7568J100k0247p0709
17590e4409K6885P0515N03o360k2887j3697l6290j2982M3059J8231j1074m9596
17578d8102k3811Q845r466k1072O2417J0191k9038M1488M8372n554J671J5363
17566E1304k8432j1523k2652j638M7078K858k5093n5075O6933M9942j6892m8360
17554H450J0326M7832K2867K7409l7786p7054r6872R115P3007N5610O858o907
17542D2855k6174P1772O8854k1098r3074n6037k2248M6989N3817N4154K1439N743
$$ plain form
17626 66436 27149 15749 2858 -30408 -65532 -94372 -61477 -41474 -39120 -33099 23583 3949
17614 3949 -103376 -110238 -102188 -71983 38629 88131 149377 99218 23060 -71249 -76691 -79260
17602 -79260 -25344 1550 -31327 38357 24684 -18468 5117 17879 35447 36547 16300 -54409
17590 -54409 -27524 42991 43494 37134 14247 550 -35740 -48722 -5663 12568 1494 -48102
17578 -48102 -71913 -63068 -72534 -93606 -31189 -20998 -50036 -8548 39824 34270 35941 51304
17566 51304 22872 11349 -11303 -12941 34137 36995 11902 -43173 23760 73702 56810 8450
17554 8450 18776 66608 89475 116884 79098 2044 -94828 -85713 -12706 42904 49762 42855
17542 42855 16681 88453 157307 136209 43135 -12902 -35150 11839 65656 119810 141249 146992
17530A46992p0103p0062j3111M6940j9139J2544P7287k9864l7826j436M6910m547
17518H4585l3913o008k366k2578L8351L0894j0904j0326m0378m0213J6261j7379
17506a3974O1139N2523l3216l7741m3878o2409M690R8672P907m8945o3650P439
17494g1443K8650K8862M1945n328k1451k5949k2193m8126o406M1561j8478o2740
17482a41096O3658Q4402NN608O1162J3361L878k4956j6209K270m470j7859m4943
17469a5189o6379k6331Q9492J8393L234M4637k3535q4586k3686o377N7268M2425
17457I366o6716L5508L3022J9002l8833M5635J3173j0870O0891N6083j4976j3793
17445A27492N5031P8264J30002M7026M3607N360m7465q3329j24697p7432n9210
$$ plain form
17530 146992 76889 6827 -6284 40656 21517 34061 111348 81484 43658 42222 89132 84585
17518 84585 50672 44664 42298 19720 58071 88965 78061 67735 27357 -12856 3405 -13974
17506 -13974 47165 99688 66472 28731 -15147 -77556 -72866 25806 33713 -15232 -78882 -71443
17494 -71443 -42793 -13931 28014 22686 1235 -24714 -46907 -95033 -101439 -59878 -78356 -141096
17482 -141096 -77438 6964 6969 12577 73739 87100 90978 66022 49813 52083 47613 29754 -15189
17469 -15189 -81568 -107899 -18407 -14 3220 47857 24322 -60264 -83950 -90327 -33059 9366
17457 9366 -57350 -21842 11180 30182 -8651 36984 50157 39287 100178 156261 141285 127492
17445 127492 182523 260787 390789 437815 481422 486782 439317 355988 231291 153859 94649
17434I4649n6143O236P372m2726m6049L7806M2310K5753J6008J2779n8954p5860
17422c6819J9332L5196M72k7912k7591J7486o624J1808l2593O716k1048k4290
17410h5867L3166L6059o27p4567k6140J6830J0443L3870K2206L6735l8467J6284
17398b0075k019L7190m1582l9403l613J2078L3509N4029o729j10561l6770J4072
17386a09874N6320J09209L1985l4883l5597k4019O647L7735l1979k9246K9653
17375E951j7200n3331m7878O8602K3251k487L6399J7984j1288O8800P5793m9687
17363A14909k5577n1783L5240M0001l032j1018j00773J5789K5388l1787k7242
17352a9885J8145N1688L756q6191l3022L8714N9194N0530k8607o8538k7742k9017
$$ plain form
17434 94649 38506 44742 52114 9388 -36661 1145 43455 69208 85216 97995 39041 -36819
17422 -36819 -17487 17709 18181 -9731 -37322 -19836 -26460 -14652 -47245 -40529 -61577 -85867
17410 -85867 -52701 -16642 -17269 -91836 -117976 -101146 -90703 -56833 -34627 2108 -36359 -20075
17398 -20075 -22094 15096 -26486 -65889 -69502 -57424 -23915 30114 23385 -87176 -123946 -109874
17386 -109874 -53554 55655 87640 52757 17160 -6859 -212 37523 5544 -23702 5951
17375 5951 -11249 -64580 -112458 -43856 -20605 -23092 13307 31291 20003 88803 164596 114909
17363 114909 89332 37549 72789 112790 109758 98740 -2033 13756 39144 7357 -19885
17352 -19885 -1740 49948 53704 -32487 -65509 -26795 32399 82929 54322 -14216 -41958 -70975
17340g0975J1936L682N5393L5013L3332Q819m0513n0190O259K9725p4469J5482
17328c6506L6715q9781j2149l0776l9333M3823P9192l5548m427P8344L7508Q713
17316C5775J8116k9460k7278m9269K4921M8794m7978l6032m285J7069k0132k4101
17304i3860l0337N4608M3714k6658L1171Q7335p36l5898M9323J3177l0257k7910
17292C3672j2231J1420m2953o5297K5130J4341J22o015n063r0811J3857L8726
17280h5102j2225M8404L2781j2491k6295j0285N8892o923J575m25j3043J6250
17268h887R815j1795m6105l8695j8821O444N7079K6534J0463K6977L1126j5084
17256B9051n134j9757J6091r304K3191j135J5135L7246K5834k4387k5384p369
$$ plain form
17340 -70975 -59039 -55357 36 35049 68381 77200 36687 -13503 -7244 22481 -51988 -36506
17328 -36506 209 -89572 -101721 -132497 -171830 -128007 -48815 -84363 -88790 -10446 27062 35775
17316 35775 53891 24431 -2847 -52116 -27195 21599 -26379 -62411 -66696 -49627 -69759 -93860
17304 -93860 -124197 -69589 -25875 -52533 -21362 65973 65237 29339 78662 91839 61582 33672
17292 33672 21441 32861 -10092 -75389 -50259 -35918 -35796 -41811 -46874 -137685 -123828 -85102
17280 -85102 -97327 -48923 -16142 -28633 -54928 -65213 -6321 -13244 -11669 -12094 -25137 -8887
17268 -8887 928 -10867 -56972 -95667 -114488 -108044 -50965 -24431 -13968 13009 44135 29051
17256 29051 23917 4160 20251 10947 34138 33003 48138 85384 111218 86831 61447 54078
17244E4078K7103k8992l2681R608m372l913j830M7248M0241k0940k8027O886l9047
17231B5362Q285K0331K5552R270k1279p577K1364L2638L0157j1679M928L2005
17219A69357K4225n4055n0102J6663r303k0382n3392l1196J844K8344J1682n9480
17207b5795L0439N1675N325K7508j1446l3336l5563k4419P0354O3226l1352M1984
17195A28600j0887m5725j01080L1866o828q3465m1391l7480L5699N9525J6205
17184e4961L8413l0904J7322P00M1381N339j9737L697K2392K0600M1181o4166
17172B1257l7253K0090L3400k2827p6075o521M9427J4117j727n0544N7045J3051
17160A3440L8429O4465K0164k0970n5029j6353O493K8026j2973k3208k0545r808
$$ plain form
17244 54078 81181 52189 19508 29116 24744 20831 19001 66249 106490 85550 57523 64409 25362
17231 25362 33647 53978 79530 88800 67521 59944 81308 113946 144103 132424 137352 169357
17219 169357 193582 139527 89425 106088 96785 76403 23011 -8185 -6341 22003 33685 -25795
17207 -25795 4644 56319 61644 89152 77706 44370 8807 -15612 54742 117968 86616 128600
17195 128600 117713 71988 -29092 2774 -4054 -87519 -128910 -166390 -130691 -71166 -54961
17184 -54961 -16548 -47452 -30130 -29430 11951 17290 -2447 1250 23642 44242 85423 21257
17172 21257 -15996 4094 37494 14667 -61408 -67929 -18502 -4385 -6112 -56656 389 13440
17160 13440 51869 116334 136498 115528 60499 44146 50639 78665 65692 42484 21939 12131
17148A2131K3594m4275K0494K6029k2176J851k5649K0851k3975k5489L6303Q7842
17136H7531M5657m0039r419O6230p0513o4239p6437k3926O6076O3601J4660N892
17124F5074M1812k2570m9850m2792P187n9044L1284K6374K3794K0065J6675k5469
17112C2540k3384L6488Q999o588m8393k4879m023m9157J707N5413K4884p395k5258
17099b9046M875j6792K2496L784m6757K2568l1751j2836o1733k8626Q3189J41873
17087E1244R2047j5913J54l8716r7446k0535r595n4720m4213o967L3214M5483
17075f5963J6209K0591M6593L792K6340N2861O1928O631j23403o4369n1003j8338
17063h8131P8081n8781j5720k1200Q746P1374J6333O170M7337J0326m1025n5088
$$ plain form
17148 12131 35725 -8550 11944 37973 15797 17648 -8001 12850 -11125 -36614 -311 87531
17136 87531 133188 93149 83730 149960 79447 15208 -61229 -85155 -19079 44522 59182 65074
17124 65074 106886 84316 34466 -8326 -1139 -60183 -28899 -2525 21269 41334 58009 32540
17112 32540 9156 45644 54643 48055 -338 -25217 -29240 -78397 -76690 -21277 3607 -3788 -29046
17099 -29046 -24171 -40963 -18467 -14683 -61440 -38872 -70623 -83459 -145192 -173818 -90629 51244
17087 51244 143291 127378 127532 88816 -8630 -29165 -38760 -93480 -137693 -144660 -111446 -65963
17075 -65963 -49754 -29163 17430 21222 47562 100423 162351 168982 45579 -18790 -69793 -88131
17063 -88131 -10050 -68831 -84551 -105751 -97005 -25631 -9298 -3128 44209 54535 13510 -41578
17051d1578k8376o500K84K198J7206N2974J045J676L7399m3331K09K1270l5182
17038b0706j0252M4293L3171l2083m4943Q864k2155J8524n3898n7979J7569M8361
17026g1234P2733L3338m8451m9510J7716l5968j8645J5716K1706K9610j376j1672
17014d6037L6036N8424n1171q4133J712P2129N1609l0240K5979M9071K094m7874
17002C7599n7207L8442m4718P131L460L8505M9085o1457k8884J9064m4184k0687
16990f3851J03206L0447N3258k5955n5746m7057j4569k6183l9395j1624q557j0056
16978a16082l2445P269M2838R3421L3917m1618m6161K7996m64J5595n7491M3393
16966b9832l580l268O023P0064R13j5809o6323m6434L7069L2479J1263K582K9900
$$ plain form
17051 -41578 -69954 -76454 -76170 -73972 -56766 -3792 -2747 -1071 36328 -7003 -6794 14476 -20706
17038 -20706 -30958 13335 46506 14423 -30520 -21656 -43811 -25287 -79185 -137164 -119595 -71234
17026 -71234 1499 34837 -13614 -63124 -45408 -81376 -100021 -84305 -62599 -32989 -34365 -46037
17014 -46037 -10001 48423 -2748 -86881 -85169 -13040 38569 8329 34308 83379 85473 37599
17002 37599 -19608 18834 -25884 -18753 -15293 23212 72297 10840 -18044 1020 -43164 -63851
16990 -63851 39355 69802 123060 97105 41359 -5698 -20267 -46450 -85845 -97469 -106026 -116082
16978 -116082 -148527 -141258 -98420 -4999 28918 -12700 -58861 -30865 -31329 -15734 -73225 -29832
16966 -29832 -33412 -36680 -30657 39407 40320 24511 -41812 -88246 -51177 -18698 -7435 -4853 25047
16953B5047M9203j5725p6204m3263M9989L2600r296J5714k4916m2644M4989m5683
16941d0189j6127l264o9583J1985L2834J3855K4368m6612O980N0021n8861m3261
16929a37854M3375M4878O0099L6660k8485o6693N7305l122l8392l0554J9302j8059
16917f1540L4816O8268Q927r271j1335o8560K3003n7193K179L8533M4547Q553
16905B0927m3585m8028K8280M5376J2645n4395n4882L1430L6922O2117q552o7158
16893c8903L7324l5455J7891K6106m2367o6659k3691O4814O8453l8011n2069J8334
16881f4233R5222M8923j1349j1056l401l1068M7410k0777j8077L5736P496m2328
16869C2498p5268k7312j0587J8806P6259j8378j8645k8396m1576J1504N4065N2995
$$ plain form
16953 25047 74250 58525 -17679 -60942 -10953 21647 12351 28065 3149 -39495 5494 -40189
16941 -40189 -56316 -59580 -129163 -117178 -84344 -70489 -46121 -92733 -85753 -35732 -94593 -137854
16929 -137854 -94479 -49601 10498 47158 18673 -48020 9285 6163 -32229 -62783 -43481 -61540
16917 -61540 -26724 41544 50471 41200 29865 -38695 -15692 -72885 -70706 -32173 12374 20927
16905 20927 -22658 -70686 -42406 2970 15615 -38780 -93662 -62232 -25310 36807 28255 -38903
16893 -38903 -1579 -37034 -19143 6963 -35404 -102063 -125754 -60940 7513 -30498 -82567 -64233
16881 -64233 30989 79912 68563 57507 54106 23038 70448 49671 31594 67330 74826 32498
16869 32498 -42770 -70082 -80669 -61863 14396 -3982 -22627 -51023 -92599 -81095 -27030 25965
16857B5965N1343Q707r7335j08125n8376K868Q4691N7535M5804k1286l7108j5714
16845f1031m561P4741K7073l3586r357k8523m9142k968L8583J1613R1099O888
16833F0829m7470l0960K1307k152l5030L7311K2893k5252J4943N6741M6800P516
16821A27476k8572l6062n4529P3679q79o5040m3626M6886n3227m5903L4041P5547
16809B9791N8155P7483n4562k3762m8423k8769K7652M4198n8311p110N1025j6406
16797E0961n0189J1947O0712k7568j213n0576j072k7019k0716K2496j0201O2653
16785B0215k1856L652J0547m3353l9100M4006M3551m1529K1443K6597Q255r1712
16773e9284N6324O8203l831n3230l4349J5557K2062K2794Q42r3811q1208O1669
$$ plain form
16857 25965 77308 86015 -11320 -119445 -177821 -174953 -90262 -32727 13077 -8209 -45317 -61031
16845 -61031 -65592 9149 36222 2636 -6721 -35244 -84386 -87354 -48771 -37158 53941 60829
16833 60829 13359 -17601 3706 1554 -33476 3835 26728 1476 16419 73160 119960 127476
16821 127476 98904 62842 8313 81992 81113 16073 -27553 19333 -33894 -79797 -45756 29791
16809 29791 87946 165429 110867 87105 38682 9913 37565 81763 23452 16342 67367 50961
16797 50961 772 12719 73431 45863 44650 -5926 -6998 -34017 -54733 -32237 -42438 20215
16785 20215 -1641 2011 12558 -30795 -69895 -25889 17662 -23867 -2424 24173 32428 -59284
16773 -59284 -2960 65243 61412 8182 -26167 -10610 11452 34246 35088 -58723 -139931 -78262
16761g8262Q1862L4701j00272O805m818K0572Q2026K3552J0124L458j1959k4986
16749D2803J9862j3866j942k1933o5658K6821N7418n8655L241O3751N4098J0413
16737A16353K1474L876p0454m7253L837k7691l9751l6853K7135n1906l5016K5956
16725a10293K618J6240J6507P381P5336k4337j04684m0388N4476P8852J4471k4076
16713c7897J4623K2426K5590j58l0352o5542n755M7460p2730o080M4541N8808
16701e066l7464l7348L9619j3439O9742M4032j5447j1705M9460k5350o6422j0121
16689a9509j6544L0780k5502k6285M3459K7246j8688L756j2000L3084K5804o0819
16677a5218L8513K3201R7223O1410l956m5785m1879j424o3036m1899K6551k0096
$$ plain form
16761 -78262 3600 38301 -61971 -55166 -59984 -39412 42614 66166 76290 79748 67789 42803
16749 42803 62665 48799 46857 24924 -40734 -13913 43505 -15150 -11909 51842 105940 116353
16737 116353 137827 141703 71249 23996 27833 142 -39609 -76462 -49327 -101233 -136249 -110293
16725 -110293 -107675 -91435 -74928 -67547 7789 -16548 -121232 -161620 -107144 -28292 -13821 -37897
16713 -37897 -23274 -848 24742 24584 -5768 -71310 -77065 -29605 -102335 -108415 -63874 -5066
16701 -5066 -42530 -79878 -40259 -53698 16044 60076 44629 32924 82384 57034 -9388 -19509
16689 -19509 -36053 -5273 -30775 -57060 -13601 13645 -5043 -1287 -13287 19797 45601 -15218
16677 -15218 23295 46496 143719 205129 201173 155388 113509 112085 49049 7150 33701 13605
16665A3605q226n7598K6009M4310m0344n6841j2845K520J6860L0736j7024L9472
16653a9366M6042j0218j6430n727k3787j5665J3982j7279J1385N4633R545p0621
16641d3506J1023O2649Q4834M276k7044m6699J7306K6002j1703o6920p5706M613
16629f0875m7745j7453n745K8487j571P0626L5782k6798k6163N09m9957K9810
16617g1093O5357L8360K2746o0832K172P396p439p613o8670L7326L2852l2138
16605d1576O225J2009k4407n0458j0881O1902M9861m0770l2219K5188K996J5058
16593b7072j0047j8012n4209K0257k794J7572R6471L4944p6282n7374P0248L0094
16581B3796N058K2772j8375Q606R3274m182n0908m2314m0455q155k5922J5165
$$ plain form
16665 13605 5379 -52219 -26210 18100 -22244 -79085 -91930 -89410 -72550 -41814 -58838 -19366
16653 -19366 26676 16458 28 -5699 -29486 -45151 -31169 -48448 -37063 17570 27115 -43506
16641 -43506 -32483 30166 115000 119276 92232 45533 62839 88841 77138 10218 -65488 -60875
16629 -60875 -108620 -126073 -131818 -103331 -104902 -34276 1506 -25292 -51455 -50946 -100903 -71093
16617 -71093 -5736 32624 55370 -5462 -3290 4106 -3333 -10946 -79616 -42290 -9438 -41576
16605 -41576 -35351 -23342 -47749 -98207 -109088 -47186 2675 -38095 -70314 -45126 -42130 -27072
16593 -27072 -37119 -55131 -109340 -89083 -91877 -74305 22166 57110 -19172 -76546 -6298 23796
16581 23796 28854 51626 33251 41857 135131 130949 80041 37727 -2728 -10883 -36805 -21640
16569b1640K8879J3532n2435k041K5682L0518m8882l9380j6880N6667M0446J1964
16557B6430O4904K158k0580k2700J5651K2171p1021K3281j4725k5565m0395k2204
16545f2595n4276j4557q220L3759O4993N6970K0397K663k6928J424l4938j0036
16533c1344L5911L79r462l698O657k372N8469J9199l6784j7383n2494J2690K1759
16520A527j0184k295N9037J8239M1817j885r9633r2782l9860N4501M9402J7877
16508d239K1798K4663J1197L2205O120m404l2340j4748J6371J9408J0630J8402
16496A05063n9497l8913k5323j5245j5195O3090O6203j6456m7549p8134j2928
16485g4884K2528l0251J363M8338L649p0751J695O1526J6040J7262L8182K7976
$$ plain form
16569 -21640 7239 20771 -31664 -33705 -8023 22495 -26387 -65767 -82647 -25980 14466 26430
16557 26430 91334 93492 72912 50212 65863 88034 17013 40294 25569 4 -40391 -62595
16545 -62595 -116871 -131428 -139648 -105889 -40896 16074 36471 39134 12206 13630 -21308 -31344
16533 -31344 4567 4946 -4516 -8214 -1557 -3929 54540 73739 36955 19572 -32922 -20232 1527
16520 1527 -8657 -10952 48085 66324 108141 106256 6623 -86159 -126019 -71518 -22116 -4239
16508 -4239 17559 42222 53419 85624 91744 87340 55000 40252 56623 76031 86661 105063
16496 105063 45566 6653 -18670 -33915 -49110 13980 80183 63727 16178 -61956 -74884
16485 -74884 -52356 -82607 -81244 -32906 -29257 -100008 -98313 -36787 -20747 -3485 34697 62673
16473F2673J0235m2516J4883j4851P40j4965M3902n4686m8873J1946M2284j3227
16461b455k1474M1021L4554M6446j3827l3782k0961j3401L5630Q5627l6646j7332
16449H3400l3408l6439M2675k6809p4399m5112O5392L923n887N3665M431L9893
16437G1325O7772k8742n6757O462o2445L144j6667K8062j612j2989M3671J4774
16425E5998P036o8975r1490l1172K8307J7306k1750p4743j0895R1896N9197l0677
16413f9962m999K6592N3964j0756j9027q281L2911O8001J5063k2677q3467j5600
16401c8238Q1349j0843j1861k3752L7302k575j08007j07357j1220J10537M9163
16390c5502J375l253l0561K7815O544l1362l6498O1258N3182l8748K6327M7775
$$ plain form
16473 62673 72908 30392 45275 30424 31164 16199 60101 5415 -43458 -31512 10772 -2455
16461 -2455 -23929 17092 51646 98092 84265 50483 29522 16121 51751 137378 100732 83400
16449 83400 49992 13553 56228 29419 -44980 -90092 -24700 -20777 -26664 27001 31432 71325
16437 71325 139097 110355 53598 60060 -2385 759 -15908 12154 10542 -2447 41224 55998
16425 55998 63034 -5941 -97431 -128603 -100296 -82990 -104740 -179483 -190378 -98482 -39285 -69962
16413 -69962 -74961 -48369 5595 -5161 -24188 -32469 442 68443 83506 60829 -22638 -38238
16401 -38238 43111 32268 20407 -3345 33957 31382 -76625 -183982 -195202 -84665 -35502
16390 -35502 -34127 -37380 -67941 -40126 -33582 -64944 -101442 -40184 12998 -25750 577 48352
16378D8352L695k320j8330k8033n196k5392n9400k18N5111M2848n2630k9543k9483
16365a00539P2904Q1804J7781n0487l4587p8807J3035M9524L1410M5815R966L5408
16353I3227m7729q604k5355m2597K266J8249j9779N5285j3063k9419R031m510
16341a2998P2526j2644k0910l0816p3253p8130k1491P5862Q6416Q8852o7708m5553
16329c9847r906M2295M2730j8203j01093m9448M5704P7525K1912O264N7438j1251
16317F4120K5351k4613j0153N9875J6074m4826k9361j2911n3313j2158J7756k3073
16305b7232L9043l8081n5463P2953j8836l7590n540k0351M3473N4590L4658j8971
16293B2653J8908P38l2377K4694K3769M8406m5808J4728O0136n8303k9499l2835
$$ plain form
16378 48352 52047 49727 31397 3364 -1832 -27224 -86624 -86842 -31731 11117 -41513 -71056 -100539
16365 -100539 -27635 54169 71950 21463 -13124 -91931 -78896 -29372 2038 47853 57819 93227
16353 93227 45498 36894 11539 -31058 -28792 -10543 -30322 24963 11900 -17519 -8488 -12998
16341 -12998 59528 46884 25974 -4842 -78095 -156225 -177716 -101854 -15438 73414 5706 -39847
16329 -39847 -49753 -7458 35272 17069 -84024 -133472 -87768 -10243 11669 17933 75371 64120
16317 64120 89471 64858 54705 114580 130654 85828 56467 43556 -9757 -21915 -4159 -27232
16305 -27232 11811 -26270 -81733 -8780 -27616 -65206 -70746 -91097 -47624 6966 41624 22653
16293 22653 41561 42299 9922 34616 58385 106791 60983 75711 135847 77544 48045 15210
16281A5210j7182k6202J9837k1909j1144L1082L5192P010j8758p1024k4285L4972
16269d7201r333k7091K4251M6373L8809P1891Q7289r6756m5877j5063k6653j0224
16257i585m4018j0843M4291M9369J300n4393R304K8676N6664M4010L1950m6029
16245A00696p1736k5199L3240m908l1766j9314M135r502J9200Q097n8190m7670
16233a02917k7083k3225k010M2958K4448K8487M3296N0830J6300k5996P0268K6348
16221A21704q0407K4467K4156l6646m0651m4874m8431m3719K6915J33229K8458
16210F4201l1098o6251J0979q584j8321K5195J1213K2050j3889n2252q1284L5198
16198a02843L6335J0709J8275L1756J5850O554o858m6398L5625l06o1180n6168
$$ plain form
16281 15210 -1972 -28174 -8337 -30246 -41390 -10308 24884 31894 13136 -57888 -82173 -47201
16269 -47201 -56534 -83625 -59374 -13001 25808 97699 184988 88232 42355 27292 639 -9585
16257 -9585 -53603 -64446 -20155 29214 30514 -23879 -14575 14101 70765 114775 146725 100696
16245 100696 28960 3761 37001 32093 327 -18987 -14852 -24354 -5154 2943 -55247 -102917
16233 -102917 -130000 -153225 -155235 -112277 -87829 -59342 -16046 34784 51084 25088 95356 121704
16221 121704 41297 65764 89920 53274 12623 -32251 -80682 -124401 -97486 35743 64201
16210 64201 33103 -33148 -22169 -30753 -49074 -23879 -12666 9384 -4505 -56757 -138041 -102843
16198 -102843 -66508 -55799 -37524 -5768 10082 16636 9778 -36620 -995 -1301 -62481 -118649
16186a18649J514L2092L4213O032k5100k7704j9193J0983J9713m173k8443R307
16174a09408M3842l702J2495j8045K401M8894J9259l1994P685J2768j7645n2379
16162h5829L5564N8951K5836o023j8027J7988K9489k8394J249p196K2646O750
16150E3004m2546j4350j3104k1450q2054p528N2833J04284M0594Q2219j0645j6788
16138A24469q472M750o5022l7654k6010j4194K9713K1326J01828n8654q9278R2002
16126G4804n152m2523j3656j750l204q4304m3643J1789M404L2122N8111m508K1064
16113C554M8099j1158p1956m6937l030K1567p474p0804j9609N1243M0796L2760
16101c2949P1525L3744q633l9998p8248K3143K7094K5788O1265l2348q5934P3105
$$ plain form
16186 -118649 -117135 -85043 -50830 -44798 -69898 -97602 -116795 -105812 -86099 -90272 -118715 -109408
16174 -109408 -65566 -69268 -56773 -74818 -72417 -23523 -4264 -36258 -28573 -15805 -33450 -85829
16162 -85829 -50265 8686 34522 28499 10472 28460 57949 29555 30804 23608 46254 53004
16150 53004 10458 -3892 -16996 -38446 -120500 -128028 -75195 29089 69683 151902 141257 124469
16138 124469 115997 120747 55725 18071 -7939 -22133 7580 28906 130734 72080 -17198 74804
16126 74804 69652 27129 13473 11723 8519 -75785 -119428 -107639 -103235 -71113 -13002 -17510 3554
16113 3554 51653 40495 -31461 -78398 -81428 -59861 -67335 -138139 -157748 -106505 -65709 -32949
16101 -32949 38576 72320 63687 23689 -54559 -31416 -4322 21466 82731 50383 -35551 37554
16089C7554J9886l927j3831p6930J355L8559O297m406r807q046k641P316l7862
16076d6483M9103Q3914J4618m780n3758l4090l8675J0442o877K369m7857n3529
16064a25603l72l602M850K0820L8370J7389j377N4557N1537j2434j5215O497n8018
16051b2601j02765r2401M0985N1243M1940N7482M7406R575j7420J8272l5418J3271
16039I569l5529K891q351m205J1340J1070O567l071p75J3085P5763O3753m1856
16026A00251j8317J3984J2471n9096n3758o2007l706J2832n283l330k224J7598
16014e0585J8483Q690R305J6981m2727o6353k9164M0376J3780M3055k2096Q539
16002e1716j970J4009M0285l6336q4642J6628Q1191j2994P949J9305K18J0265
$$ plain form
16089 37554 57440 53513 39682 -37248 -35893 2666 8963 4557 -5250 -13296 -15937 -8621 -46483
16076 -46483 2620 86534 101152 96372 42614 8524 -30151 -19709 -26586 -24217 -72074 -125603
16064 -125603 -125975 -129577 -124727 -103907 -65537 -48148 -49525 5032 56569 44135 28920 35417 -22601
16051 -22601 -125366 -217767 -176782 -125539 -83599 -26117 21289 30864 13444 31716 -3702 9569
16039 9569 -25960 -23069 -31420 -35625 -24285 -13215 -6648 -9719 -10494 2591 78354 142107 100251
16026 100251 81934 95918 108389 49293 -4465 -66472 -70178 -57346 -62629 -65959 -68183 -50585
16014 -50585 -32102 -23412 -14107 2874 -39853 -106206 -135370 -94994 -81214 -38159 -60255 -51716
16002 -51716 -53686 -39677 608 -35728 -120370 -103742 -22551 -35545 -27596 -8291 -8073 2192
15990B192M8101P5860r0967j07982J6182Q172K2671M084j0245k1674O655K2425
15978b4526K9712j3183M5852N8288j0735r965p0512k1517K7010Q1444q33N292
15966I6327k5586j15480l8187J087M5077k597j0605J434K9461J2804J241n7120
15954f2144l8487j3759N0264L0707l8085L8313l5351n0219K2354M0360R786K9656
15942a6605M5175p8461k4655k2832K1195L9289N0993j2765l7353M682L8531j0379
15930c185J2557o1972o0860l4103J8648M6167M7940N4187L91j2206j0542q787
15918a1765n838k8845l1746K8261N3268L6871K2709l578m4242p4085L4096Q845
15906a6049r8207N250J28449J7229j3594l4207N42k5595K2705K1614K8961l6643
$$ plain form
15990 2192 50293 126153 35186 -72796 -56614 -48442 -25771 -21687 -31932 -53606 -46951 -24526
15978 -24526 5186 -7997 37855 96143 85408 75443 4931 -16586 10424 91868 91035 96327
15966 96327 70741 -44739 -82926 -81839 -36762 -39359 -49964 -48530 -19069 -6265 -5024 -62144
15954 -62144 -100631 -114390 -64126 -33419 -71504 -33191 -68542 -118761 -96407 -56047 -46261 -16605
15942 -16605 28570 -49891 -74546 -97378 -76183 -36894 14099 1334 -36019 -31337 7194 -3185
15930 -3185 9372 -52600 -113460 -147563 -128915 -82748 -34808 19379 19770 7564 -2978 -11765
15918 -11765 -17603 -46448 -78194 -49933 3335 40206 62915 59337 15095 -58990 -24894 -16049
15906 -16049 -114256 -109006 19443 36672 23078 -11129 -10587 -36182 -13477 8137 37098 455
15894D55N2721l2783N809j0017j5062k2952K2381M4625L6070n0077j05012N759
15882f8083M0626o2646k2684R607k418R1690J05869N3271j4750l6558n755n4865
15870C3304q0522k6919O904o361L1620k1438J3179L4762J6338k4146O3692L1333
15858G1746n4441P3085L3892p3119n7227N9564l4755m0006O3084N2197N4671l3256
15846A15435m1695j24733k0214O479K6054L660k8688L659K8809L8398M3510l4974
15834A5700q4906j2506N5315K1576M7261O998P651j1677n3047o7576O505N7542
15822a1164J07834J4175l3242o9808l0121k4959j6154m534O3258M0800N928l560
15810C8453J815M4586k9217p5660K8009N9788M1767K784p7008n188j16o7764K5565
$$ plain form
15894 455 53176 20393 26202 16185 1123 -21829 552 45177 81247 31170 -73842 -68083
15882 -68083 -27457 -90103 -112787 -103180 -105598 -13908 91961 145232 130482 93924 88169 33304
15870 33304 -47218 -74137 -67233 -73594 -41974 -63412 -50233 -15471 867 -23279 40413 71746
15858 71746 17305 90390 124282 51163 -6064 53500 18745 -21261 41823 94020 148691 115435
15846 115435 73740 -50993 -71207 -64728 -38674 -35014 -63702 -60043 -31234 7164 50674 15700
15834 15700 -69206 -81712 -26397 -4821 42440 49438 57089 45412 -7635 -75211 -68706 -11164
15822 -11164 96670 110845 77603 7795 -22326 -47285 -63439 -67973 -4715 36085 42013 38453
15810 38453 40268 84854 55637 -20023 7986 67774 109541 112325 35317 30129 30013 -37751 -12186
15797a2186L2007n0117K4971L3380k0009m1216j9840P4052J9981k1506k1597m7951
15785e0031O903L5989k004q737n0907J0208P1295k9017p4787l0807P2022N8010
15773H137J0604k2990L9766k0719j2050m7781l919J4720k9214L0079K6668K7142
15761B0443k221r984l2191J2627K7133l5767o3065n3123J0230L1666R8726P4755
15749G9229j9144l8869J9700R6314m3526K7985J2793n1872n9388k5661K182J5465
15737A5208k3064l5155K0134N8821K3215P44r580k1384n9303j3427M7176M3854
15725D7239k1596J3583n8183l0466l87J1339J4061K5547J41953J8769o5849j08750
15713a2740j7807J03819N4842o3871q1312K9598M15J7446r619n8847r075N5139
$$ plain form
15797 -12186 19821 -30296 -5325 28055 8046 -33170 -53010 21042 41023 19517 -2080 -50031
15785 -50031 -43128 -7139 -9143 -17880 -68787 -58579 12716 -16301 -91088 -121895 -49873 8137
15773 8137 18741 -4249 35517 14798 2748 -45033 -48952 -34232 -63446 -33367 -6699 20443
15761 20443 18222 8238 -23953 -11326 15807 -19960 -83025 -136148 -125918 -94252 4474 79229
15749 79229 60085 21216 40916 137230 93704 121689 134482 82610 23222 -2439 -257 15208
15737 15208 -7856 -43011 -22877 35944 59159 59903 50323 28939 -30364 -43791 3385 47239
15725 47239 25643 39226 -18957 -49423 -49810 -38471 -24410 1137 143090 161859 96010 -12740
15713 -12740 -30547 73272 128114 64243 -17069 12529 12944 30390 20771 -38076 -47151 7988
15701G988m2967L5086j4245J0161K337K5697P549K7402k8513R284N6457k4486
15689G1750j1942J504q2635k1544N6348O4093J6081r6387o3223m1039L3303M356
15677f9335J431O778K4917m6674k7729m929L3362L3479j39l7366K1180L6912k4542
15664e2655J7028n116M9363O5382J8044n4415K8517J8004L4115l4056o2826K9128
15652E0513K612O027n2849q9677J2522m656m7945m198L0772O6441J9712k5483
15640c6209O1629P4172M5656n666n1820o8474n1172N7638P0544P057r8383n0015
15628d5043L2954N5477j7727n4437j1349K9128N8773j6070m7771M12q89K4001
15616G459j3166L8534n1403n3966J6262M8241p8290n3790M3195M8867P4349K0212
$$ plain form
15701 7988 -34979 107 -14138 -3977 -1640 24057 31606 59008 30495 39779 96236 71750
15689 71750 59808 61312 -21323 -42867 13481 77574 93655 -2732 -65955 -106994 -73691 -69335
15677 -69335 -67904 -61126 -36209 -82883 -110612 -115541 -82179 -48700 -48839 -86205 -65025 -28113 -52655
15664 -52655 -35627 -40743 8620 74002 92046 37631 66148 84152 118267 84211 21385 50513
15652 50513 53125 59152 6303 -83374 -70852 -75508 -123453 -127651 -96879 -30438 -10726 -36209
15640 -36209 25420 99592 145248 139582 87762 19288 -31884 25754 96298 103355 4972 -45043
15628 -45043 -12089 43388 25661 -28776 -40125 -10997 47776 31706 -16065 -15653 -16542 7459
15616 7459 -5707 32827 -18576 -72542 -56280 -8039 -86329 -140119 -96924 -48057 26292 46504
15604D6504k484n4932l7284j8132j7202K5239j2049O9694p752k8165m6083M761
15592g7885j5280J276M0912N9115K1505l0610l8939j0606J0231N9306K4289o0336
15580a7022n317k4284k2906K6632N1160Q774L9196k0479l4880J0088M6763k5541
15568C2184l0917O788r597j5971K6883m1924J598k6569j5228J9216j3288J4081
15556e2744P4897J4619K3341k4914k4772K522r4327J0888L3562J1043J2916J425
15544a1544k4354k1896N2234O502j2289Q53k6403o076J1003k0578j9029k835M5650
15531b8762O6471k4095r4071k7776L3963L0327O7090O1609l1748n2791j1689K3148
15519A1676L6388Q234N1901J1260L946k0055m799k2127j4217m464j09198k9643
$$ plain form
15604 46504 44020 -10912 -48196 -66328 -83530 -58291 -70340 -646 -8398 -36563 -82646 -77885
15592 -77885 -93165 -91889 -50977 8138 29643 -967 -39906 -50512 -40281 19025 43314 -17022
15580 -17022 -22339 -46623 -69529 -42897 8263 17037 56233 35754 874 10962 57725 32184
15568 32184 1267 8055 -1542 -17513 9370 -32554 -30956 -57525 -72753 -53537 -66825 -52744
15556 -52744 22153 36772 60113 35199 10427 12949 -81378 -70490 -36928 -25885 -12969 -11544
15544 -11544 -35898 -57794 -5560 942 -11347 -10494 -36897 -42973 -31970 -52548 -71577 -74412 -28762
15531 -28762 37709 13614 -80457 -108233 -74270 -43943 23147 84756 53008 217 -11472 11676
15519 11676 48064 56298 108199 119459 123405 103350 98551 76424 62207 57743 -51455 -81098
15507h1098L3759K9500K4458k1207k8404L9106J9595K1910M6928K4503M411L966
15495A17427n7429O494n739o7242J2772M257J6513p218M370Q481J5085L0981n071
15482G3681Q057K1613J3317J755M699n0293n6959j7116L246J0424L7610n2146
15470b112N3523P371k4376n8170m6864J5787J3697P522j8169k9078J0282N0617
15458a9970P8547O3856o985m0930n2477n607M1596L7406m8448l5996J8795k4661
15446E126k985J0181j3735J2059j7665O6686K8185m6064q0524J5121L3744L621
15434A3750j7150L3081J5612L6761L5912j3795j52473J3366J2861J0384j8443
15423c0134n6552K6375Q4581Q7352j2456j9456q651M1968K434q289j8827q5478
$$ plain form
15507 -81098 -47339 -17839 6619 -14588 -42992 -3886 15709 37619 84547 109050 113461 117427
15495 117427 59998 66492 60753 -6489 6283 10540 27053 19835 24205 32686 47771 78752 73681
15482 73681 81738 103351 116668 118423 123122 72829 15870 -1246 2000 12424 50034 -2112
15470 -2112 51411 58782 34406 -23764 -70628 -54841 -41144 -33622 -51791 -80869 -70587 -19970
15458 -19970 58577 122433 115448 74518 22041 16434 58030 95436 46988 10992 29787 5126
15446 5126 2141 12322 -1413 10646 -7019 59667 87852 41788 -38736 -23615 10129 13750
15434 13750 -3400 29681 45293 82054 117966 104171 -48302 -34936 -22075 -11691 -30134
15423 -30134 -86686 -60311 24270 111622 99166 79710 71059 113027 115461 107172 88345 2867
15411B867n4616L035k6312j1641O2188O4318K9486m8980q201n4852j5731n5326
15399a13765L4989K3979J9176m4698J8483p475k5908m9243M154P1290J6294P0846
15387A8122K987K7496K2176J5358l897j7544m4450o4237P9229J3967L0235m3949
15375C5493m0481J7755J4781J5475j3865l9431m3451j7180M0124K8174K8597K7630
15363E3621k5473j6604J6498k2950j0005j164j5916M6736q407O8744L5114M782
15351A24976n6472j16372J335L0550J1066k6789j4517M8628m8844j2591O1984
15340B954L7789p4279J618K5090r3399j2971n559K3352J7513P4908L395p7757
15328g7346m158N0073N7589M9204j4926o7139J1246L1619J4678p5661r9302O0864
$$ plain form
15411 2867 -51749 -48714 -75026 -86667 -24479 39839 69325 20345 12144 -42708 -58439 -113765
15399 -113765 -78776 -54797 -35621 -80319 -61836 -69311 -95219 -144462 -140308 -69018 -52724 18122
15387 18122 21109 48605 70781 86139 82242 64698 20248 -43989 35240 49207 79442 35493
15375 35493 -4988 12767 27548 43023 29158 -10273 -53724 -70904 -30780 -2606 25991 53621
15363 53621 28148 11544 28042 5092 -4913 -6077 -21993 24743 16336 85080 120194 124976
15351 124976 68504 -47868 -46533 -15983 -4917 -31706 -46223 2405 -46439 -59030 2954
15340 2954 40743 -33536 -31918 -6828 -100227 -113198 -118757 -95405 -77892 -2984 411 -77346
15328 -77346 -81504 -31431 26158 75362 60436 -6703 4543 36162 50840 -24821 -124123 -63259
15316f3259K3798J2269o4197q28Q5354P2929p3319J9838M8866k8103k4513N6876
15304F5711q529q211l5071q9846K111K2883J0242o458O3726J8882m6619n5781
15292f6960m830J5574P5708n5993j3958k1574k9239L28J121L2440P0515L1752
15280C4884o9307o2344J8677O1960O4212o0034j8248P1729K4173j735o3319j2172
15268a1524K3978J5243N8890K8129r8054j9637j9107k8968j8044l613L1840M9022
15256H155m9584r2402J7758m7496j6604N7546L8971N2624J0954n2785K5683K1779
15244b5401K702o9548J402L4518Q508L4804k1730j3294M2549L3396p418k1203
15232g15o179O816L710r205l131j5811M1195Q154n0945k7830K9615k8099K9281
$$ plain form
15316 -63259 -39461 -27192 -91389 -92217 -6863 66066 -7253 12585 61451 33348 8835 65711
15304 65711 57182 48971 13900 -75946 -73835 -50952 -40710 -47168 16558 35440 -11179 -66960
15292 -66960 -71790 -56216 19492 -36501 -50459 -72033 -101272 -100944 -99823 -67383 3132 34884
15280 34884 -34423 -96767 -78090 -16130 48082 -11952 -30200 41529 65702 63967 648 -11524
15268 -11524 12454 27697 86587 114716 16662 -2975 -22082 -51050 -69094 -72707 -40867 8155
15256 8155 -41429 -133831 -116073 -163569 -180173 -122627 -83656 -31032 -20078 -72863 -47180 -25401
15244 -25401 -22699 -92247 -90845 -56327 -47819 -13015 -34745 -48039 -5490 27906 20488 -715
15232 -715 -6894 -78 3632 -5573 -8704 -24515 16680 24834 -26111 -53941 -24326 -52425 -23144
15219b3144Q0092M2313l5262j055R780n2967j5930J1663j8672l9301l4001L08
15207g6176m1881K5981K4204M4620P831L9226l512q5521l9774K0712M5761k879
15195d1408J6253L0888L7695l9415n64K3961J762o7032m3054N5109L1525l1142
15183b5422O1094R2291K0961L0335J4209j6210m6151n5468m4446j6743p229J5616
15171B2837K4272K8224p9994m9212M9227l8868J5943N2567l1443L2529l1816l4046
15159c9780J5504j1576k0548K6323M8041M2197P694o0631J1955O7625K568m1857
15147D7515J357J5867P630k3783L3124k2309k6063O010k6518N6289P3010M2923
15135A85052N1601n0680j39264K4084K2420J297n144M9806j3769K7188m8046r2076
$$ plain form
15219 -23144 56948 99261 63999 62944 72724 19757 3827 15490 -3182 -42483 -76484 -76176
15207 -76176 -118057 -92076 -67872 -23252 -15421 23805 20293 -65228 -105002 -84290 -38529 -41408
15195 -41408 -25155 5733 43428 4013 3449 27410 29172 -37860 -80914 -25805 5720 -25422
15183 -25422 35672 127963 148924 179259 193468 177258 131107 75639 31193 14450 7221 22837
15171 22837 47109 75333 -4661 -53873 -4646 -43514 -27571 24996 -6447 26082 -5734 -39780
15159 -39780 -24276 -35852 -56400 -30077 17964 60161 67855 7224 19179 86804 89372 47515
15147 47515 48872 64739 72369 48586 81710 59401 33338 39348 12830 69119 142129 185052
15135 185052 236653 185973 46709 70793 93213 94510 89366 139172 125403 152591 104545 12469
15123A2469j1661l5303k4345K9935N9995J3936m1179l530L1640l531M651k4259
15111H818P538L3797l411l0277P506J2091k5659L897M0399l5507n8767n8211j8106
15098a15892m0955o85R91P3814J2163j7630M086L7496n1674R221O9361J7710p639
15085i633j4850J4180n6643K9425J5829J5149R2469L0824k4559L5499k3557m271
15073I9862p4169l6584j7203J8360n1007r557n8949N4646P5384P4507l3558n264
15061C6468J0039k770K7893K3566R778L0572l1442n4493o8949n012O6010L8971
15049H0631J0269o441m1319o4607j4100j4276q176n166N5599J8627J0108M2661
15037F3810k8938l5445J394M7518K518o9119n4960n146J826l179P2923k2255M1536
$$ plain form
15123 12469 808 -34495 -58840 -28905 31090 45026 3847 317 31957 28426 33077 8818
15111 8818 16356 50153 46742 16465 23971 36062 10403 14300 54699 19192 -39575 -97786 -115892
15098 -115892 -156847 -157532 -156541 -82727 -70564 -88194 -84108 -46612 -98286 -89065 -19704 -1994 -9633
15085 -9633 -24483 -10303 -66946 -37521 -21692 -6543 85926 116750 92191 127690 104133 99862
15073 99862 25693 -10891 -28094 -9734 -60741 -70298 -129247 -74601 783 75290 41732 36468
15061 36468 46507 43737 71630 95196 104974 135546 104104 49611 -19338 -24350 41660 80631
15049 80631 90900 84459 43140 -21467 -35567 -49843 -58019 -63185 -7586 11041 21149 63810
15037 63810 34872 -573 821 48339 50857 -18262 -73222 -78368 -76542 -79721 -6798 -29053 12483
15024A2483L0319K0464n4699o4648K6886J1922j2564J1028J05701R2837l6596
15013A43133r3117l9172k3783o506K9176j3384L6842j8877k4210Q9419O766j22968
15001c6681m2564k0755k7717n246P0357P1436p247n173m5570J2427M2775k5548
14989a9506l0047N9614m360K4384P936J536l3442k6012o2319Q900J7041O8270
14977A1995j5210P538k9014m9590l2586l9488l1002p957Q9274Q4832P4829K8731
14965I2352n0768m5433m7316J921N6526K7583J150l5991l1183K9321Q274l4110
14953b7674j2266l8110K1557j8532m109P0317N626J8232j6911M8301N8573l4587
14941G0417p7678q8406K7221J9263J18924M9046l3861k618K5333j3362m9193l6942
$$ plain form
15024 12483 42802 63266 8567 -56081 -29195 -17273 -29837 -18809 86892 179729 143133
15013 143133 50016 10844 -12939 -19445 9731 -3653 33189 14312 -9898 79521 86287 -36681
15001 -36681 -79245 -100000 -127717 -132963 -62606 8830 1583 -3590 -49160 -36733 6042 -19506
14989 -19506 -49553 10061 5701 30085 38021 39557 6115 -19897 -82216 -73316 -56275 11995
14977 11995 -3215 4323 -24691 -74281 -106867 -146355 -177357 -185314 -96040 -11208 63621 92352
14965 92352 41584 -3849 -51165 -49244 7282 34865 36015 24 -31159 -1838 6436 -27674
14953 -27674 -39940 -78050 -56493 -75025 -79134 -8817 -3191 15041 -1870 46431 105004 70417
14941 70417 -7261 -95667 -68446 -49183 69741 118787 84926 82308 107641 94279 45086 8144
14929H144n5358n2358K84M4389J00695Q778j1410m8177q6920p339l7855M4247
14917i2880M7519M7641m0897l7336j3207Q8058M8109j2753j963q936k4942m7256
14905d8843M0748M1397q9608k4537r55K9991O0185M5738M0971J8089l3719l2968
14893D6489l1756P701n742K2195M923K7924j6626J9303j00172r7115O6246m775
14881f1405n689K5960l506J16P8361N0631K9850o0747r8520M3074N478k701j2554
14868a1652K3490M7648o4228n169K9841l5580k5046J4317k8397j4930L2977Q7790
14856E1061L8685l7778m7678n513N2680k1959l233m359l7826l5074J7971M6613
14844A3590L1628r217k7197k0259l967J2067K2050p912l4748l736N9656L9199
$$ plain form
14929 8144 -47214 -99572 -99288 -54899 45796 54574 43164 -5013 -91933 -99272 -137127 -92880
14917 -92880 -45361 2280 -38617 -75953 -89160 -1102 47007 34254 32291 23355 -1587 -48843
14905 -48843 -8095 33302 -56306 -80843 -81798 -51807 8378 54116 95087 113176 79457 46489
14893 46489 14733 22434 16692 38887 43810 71734 55108 74411 -25761 -122876 -56630 -61405
14881 -61405 -67094 -41134 -44640 -44524 33837 84468 114318 53571 -44949 -1875 3603 902 -11652
14868 -11652 11838 59486 -4742 -9911 19930 -15650 -40696 -26379 -54776 -69706 -36729 51061
14856 51061 89746 51968 4290 -1223 51457 29498 26265 21906 -15920 -50994 -33023 13590
14844 13590 45218 36001 8804 -11455 -15422 -3355 18695 10783 -23965 -27701 31955 71154
14832G1154j1567p010n8858k8156l7641l6923J04606K4391j8799l2473l5138K3009
14820d3405O1427o0977L6717j9823L4443L8419j9307L083j5229j3275K6112N189
14808C3374m888k5459M507M7352K2488n9236P09L7790Q6151J6017l346J7402o4067
14795A08794n4384l1282o3240J4562M5392M6321J6400l4640J8568m1322l1705
14784f536J8028J8909m789k7991p648l8292K1356J7137K0065k8414n7165K5063
14772e0277O2158k3443l0494K2247J4227K4937j7628K714N537J7560q819M3039
14760F1758J4973Q88o9227o0339j6492O6324N6741M308l1711r8666L2502M4197
14748E256K8787L5938N6374J334l4945j7904m7173j9584j8676k7584l1005J031
$$ plain form
14832 71154 59587 52577 -6281 -34437 -72078 -109001 -4395 19996 1197 -31276 -66414 -43405
14820 -43405 18022 -42955 -6238 -26061 8382 46801 27494 30577 15348 2073 28185 33374
14808 33374 28486 3027 7534 54886 77374 18138 18847 56637 142788 158805 155459 172861 108794
14795 108794 54410 23128 -40112 -25550 19842 66163 82563 47923 66491 25169 -6536
14784 -6536 11492 30401 25612 -2379 -10027 -48319 -26963 -9826 10239 -18175 -75340 -50277
14772 -50277 11881 -11562 -42056 -19809 -5582 19355 1727 4441 9978 27538 18719 61758
14760 61758 76731 77619 8392 -51947 -68439 -2115 54626 58934 27223 -71443 -38941 5256
14748 5256 34043 69981 126355 127689 92744 74840 27667 8083 -10593 -38177 -69182 -68151
14736f8151J0656O1341J3581K0766J4343q146k3657n0922r4739J6421O4112O3973
14724A9578j300o883L2043j6550k9724J2207j7654J3523q867J3422L7688K8338
14712G5821R14l1502p0422m0242P753k0362k9259o8721O089J31634J7558o570
14700b7309n6880l0808K1862J27724O2974k6891r3709o8881j7340Q7316R9704
14689G7762L8807k5241j3114j8466J8615k0052k0718l7259m6986l4177k0805N9470
14677d2164M621L9459K181M253J3968j5859p1904L039J4694j6101j8469N2886
14665b9396J0011M0564O444o7464r242q4010l3110P4700Q8565N7790k004k4169
14653B8679o634q9065l8319L2543L8134J8875K6692R649K901n8684N4854K8570
$$ plain form
14736 -68151 -57495 3846 17427 38193 52536 44390 20733 -30189 -124928 -108507 -44395 19578
14724 19578 18278 11395 43438 26888 -2836 9371 -8283 5240 -3627 9795 47483 75821
14712 75821 76735 45233 -25189 -65431 -57678 -78040 -107299 -176020 -169931 -38297 -20739 -27309
14700 -27309 -84189 -114997 -93135 34589 97563 70672 -23037 -91918 -109258 -21942 77762
14689 77762 116569 91328 78214 59748 78363 58311 37593 334 -46652 -80829 -101634 -42164
14677 -42164 -37543 1916 4097 8350 22318 6459 -65445 -62406 -47712 -63813 -82282 -29396
14665 -29396 -19385 21179 27623 -39841 -49083 -133093 -166203 -91503 -2938 54852 52848 28679
14653 28679 22045 -67020 -105339 -72796 -34662 -15787 10905 20554 23455 -35229 19625 48195
14641D8195O5928n5549n8755k3977L8839P180r599j0899Q2004N0433j8485n7925
14629E7390m1125K5519P555j9324n1302J4006J8064R9217O2609m0309p6601o6670
$$ plain form
14641 48195 114123 58574 -181 -24158 14681 21861 12262 1363 83367 133800 115315 57390
14629 57390 16265 41784 49339 30015 -21287 -7281 10783 110000 172609 132300 55699 -10971
$$ [...]
##END NTUPLES=NMR SPECTRUM
##END=
