##TITLE=Analysis number 311989
Compound Code cc 12309
Book Reference 399/193
Project Code adrs
Chemist Name evam
##JCAMPDX= 6.0         $$ Bruker NMR JCAMP-DX V2.0
##DATA TYPE= NMR SPECTRUM
##DATA CLASS= NTUPLES
##ORIGIN= Bruker BioSpin GmbH
##OWNER= NMR
$$ XWIN-NMR		Version 3.5
$$ Thu Jul 21 10:15:54 2005 GMT Daylight Time (UT+1h)  MAYBRIDGE\NMR@NMR_250MHZ
##.OBSERVE FREQUENCY= 250.131544655141
##.OBSERVE NUCLEUS= ^1H
##.ACQUISITION MODE= SIMULTANEOUS (DQD)
##.ACQUISITION SCHEME= undefined
##.AVERAGES= 16
##.DIGITISER RES= 18
##SPECTROMETER/DATA SYSTEM= dpx250
##.PULSE SEQUENCE= zg30
##.SOLVENT NAME= CDCl3
##.SHIFT REFERENCE= (INTERNAL, CDCl3, 0, 16.522)
##AUDIT TRAIL= $$ (NUMBER, WHEN, WHO, WHERE, WHAT)
$$ ##TITLE= Audit trail, XWIN-NMR		Version 3.5
$$ ##JCAMPDX= 5.01
$$ ##ORIGIN= Bruker BioSpin GmbH
$$ ##OWNER= NMR
$$ C:\u/data/dgb/nmr/ADRS/6250/pdata/1/auditp.txt
$$ ##AUDIT TRAIL=  $$ (NUMBER, WHEN, WHO, WHERE, WHAT)
(   1,<2005-07-21 10:15:33.74 +100>,<MAYBRIDGE\NMR>,<NMR_250MHZ>,
      <created by zg, POWCHK disabled, PULCHK disabled
       configuration hash MD5:
       62 19 C7 07 E1 42 D1 B7 37 6C 3D D0 77 39 F9 E6
       data hash MD5: 64K
       7E 80 AA FC 2D 8D 65 DA A7 FC 11 56 20 69 B5 3E>)
(   2,<2005-07-21 10:15:45.07 +100>,<MAYBRIDGE\NMR>,<NMR_250MHZ>,
      <Start of raw data processing
       ef LB = 0.3 FT_mod = 6 PKNL = 1 SI = 32K 
       data hash MD5: 32K
       EB 28 08 3F 68 A7 4C C8 3D 09 2F CC 2B D4 5B 04>)
(   3,<2005-07-21 10:15:46.83 +100>,<MAYBRIDGE\NMR>,<NMR_250MHZ>,
      <apk 
       data hash MD5: 32K
       AE 24 93 F6 1E EB 20 C5 E3 A9 B9 2C FB 31 04 46>)
(   4,<2005-07-21 10:15:47.58 +100>,<MAYBRIDGE\NMR>,<NMR_250MHZ>,
      <abs ABSG = 5 
       data hash MD5: 32K
       3C 0D 9E 06 56 7E 4F 65 16 6A 54 7E 2E 8A BD 4E>)
$$ ##END=
$$ 
$$ hash MD5
$$ 18 D6 36 7D EE A9 52 8D 80 11 48 FD C5 3C B0 49
##$RELAX= 
##$RELAX= 
##$RELAX= 
##$RELAX= 
##$RELAX= 
##$RELAX= 
##$RELAX= 
$$ Bruker specific parameters
$$ --------------------------
##$DU= <C:\u>
##$EXPNO= 6250
##$NAME= <ADRS>
##$PROCNO= 1
##$TYPE= <nmr>
##$USER= <dgb>
##$AMP= (0..31)
100 100 100 100 100 100 100 100 100 100 100 100 100 100 100 100 100 100 
100 100 100 100 100 100 100 100 100 100 100 100 100 100 
##$AQSEQ= 0
##$AQ_mod= 3
##$AUNM= <au_zg>
##$AUTOPOS= <7 >
##$BF1= 250.13
##$BF2= 250.13
##$BF3= 250.13
##$BF4= 250.13
##$BF5= 500.13
##$BF6= 500.13
##$BF7= 500.13
##$BF8= 500.13
##$BYTORDA= 1
##$CFDGTYP= 0
##$CFRGTYP= 5
##$CHEMSTR= <none>
##$CNST= (0..31)
1 1 145 1 1 1 1 1 1 1 1 1 1 1 1 1 1 1 1 1 1 1 1 1 1 1 1 1 1 1 1 1 
##$CPDPRG= <>
##$CPDPRG1= <>
##$CPDPRG2= <>
##$CPDPRG3= <>
##$CPDPRG4= <mlev>
##$CPDPRG5= <mlev>
##$CPDPRG6= <mlev>
##$CPDPRG7= <mlev>
##$CPDPRG8= <mlev>
##$CPDPRGB= <>
##$CPDPRGT= <>
##$D= (0..31)
0 1 0 0 0 0 0 0 0 0.06 0 0 0 0 0 0 0.0002 0 0 0 0 0 0 0 0 0 0 0 0 0 0 
0 
##$DATE= 1121937332
##$DBL= (0..7)
120 120 120 120 120 120 120 120 
##$DBP= (0..7)
150 150 150 150 150 150 150 150 
##$DBP07= 0
##$DBPNAM0= <>
##$DBPNAM1= <>
$$ [...]
##$SUBNAM7= <"">
##$SUBNAM8= <"">
##$SUBNAM9= <"">
##$SW= 20.6930455092707
##$SWIBOX= (0..15)
0 0 3 0 0 0 0 0 0 0 0 0 0 0 0 0 
##$SW_h= 5175.983436853
##$TD= 65536
##$TD0= 1
##$TE= 295.16
##$TE2= 300
##$TE3= 300
##$TEG= 300
##$TL= (0..7)
0 120 120 120 120 120 120 120 
##$TP= (0..7)
150 150 150 150 150 150 150 150 
##$TP07= 0
##$TPNAME0= <>
##$TPNAME1= <>
##$TPNAME2= <>
##$TPNAME3= <>
##$TPNAME4= <>
##$TPNAME5= <>
##$TPNAME6= <>
##$TPNAME7= <>
##$TPOAL= (0..7)
0.5 0.5 0.5 0.5 0.5 0.5 0.5 0.5 
##$TPOFFS= (0..7)
0 0 0 0 0 0 0 0 
##$TUNHIN= 0
##$TUNHOUT= 0
##$TUNXOUT= 0
##$USERA1= <user>
##$USERA2= <user>
##$USERA3= <user>
##$USERA4= <user>
##$USERA5= <user>
##$V9= 5
##$VALIST= <valist>
##$VCLIST= <CCCCCCCCCCCCCCC>
##$VD= 0
##$VDLIST= <DDDDDDDDDDDDDDD>
##$VPLIST= <PPPPPPPPPPPPPPP>
##$VTLIST= <TTTTTTTTTTTTTTT>
##$WBST= 1024
##$WBSW= 4
##$XGAIN= (0..3)
0 0 0 0 
##$XL= 0
##$YL= 0
##$YMAX_a= 459986
##$YMIN_a= -454664
##$ZGOPTNS= <>
##$ZL1= 120
##$ZL2= 120
##$ZL3= 120
##$ZL4= 120
##$ABSF1= 16.522
##$ABSF2= -4.171173
##$ABSG= 5
##$ABSL= 3
##$ALPHA= 0
##$AQORDER= 0
##$ASSFAC= 0
##$ASSFACI= 0
##$ASSFACX= 0
##$ASSWID= 0
##$AUNMP= <proc_1d>
##$AZFE= 0.1
##$AZFW= 0.1
##$BCFW= 0
##$BC_mod= 0
##$BYTORDP= 0
##$COROFFS= 0
##$CY= 12.5
##$DATMOD= 1
##$DC= 0
##$DFILT= <>
##$DTYPP= 0
##$F1P= 14.0000005364418
##$F2P= -0.99999901652339
##$FCOR= 0.5
##$FTSIZE= 32768
##$FT_mod= 6
##$GAMMA= 0
##$GB= 0
##$INTBC= 1
##$INTSCL= 1
##$ISEN= 128
##$LB= 0.3
##$LEV0= 0
##$LPBIN= 0
##$MAXI= 10000
##$MC2= 0
##$MEAN= 0
##$ME_mod= 0
##$MI= 0
##$NCOEF= 0
##$NC_proc= -4
##$NLEV= 6
##$NOISF1= 0
##$NOISF2= 0
##$NSP= 0
##$NTH_PI= 0
##$NZP= 0
##$OFFSET= 16.522
##$PC= 1
##$PHC0= -79.79008
##$PHC1= 7.199645
##$PH_mod= 1
##$PKNL= yes
##$PPARMOD= 0
##$PSCAL= 4
##$PSIGN= 0
##$REVERSE= no
##$SF= 250.13
##$SI= 32768
##$SIGF1= 0
##$SIGF2= 0
##$SINO= 400
##$SIOLD= 32768
##$SREGLST= <1H.CDCl3>
##$SSB= 0
##$STSI= 32768
##$STSR= 0
##$SW_p= 5175.98343685301
##$SYMM= 0
##$S_DEV= 0
##$TDeff= 65536
##$TDoff= 0
##$TI= <Analysis number 999999
Compound Code 99
Book Reference 9
Project Code 9>
##$TILT= no
##$TM1= 0
##$TM2= 0
##$TOPLEV= 0
##$USERP1= <user>
##$USERP2= <user>
##$USERP3= <user>
##$USERP4= <user>
##$USERP5= <user>
##$WDW= 1
##$XDIM= 32768
##$YMAX_p= 314631410
##$YMIN_p= -254632
$$ End of Bruker specific parameters
$$ ---------------------------------
##NTUPLES= NMR SPECTRUM
##VAR_NAME=  FREQUENCY,     SPECTRUM/REAL,   SPECTRUM/IMAG
##SYMBOL=    X,             R,               I
##VAR_TYPE=  INDEPENDENT,   DEPENDENT,       DEPENDENT
##VAR_FORM=  AFFN,          ASDF,            ASDF
##VAR_DIM=   32768,         32768,           32768
##UNITS=     HZ,            ARBITRARY UNITS, ARBITRARY UNITS
##FACTOR=    0.157963299565203, 1,           1
##FIRST=     4132.6476996994, 0,             0
##LAST=      -1043.33573715361, 0,           0
##MIN=       -1043.33573715361, -254632,     0
##MAX=       4132.6476996994, 314631410,     0
$$ Real data points
##PAGE= N=1
##DATA TABLE= (X++(R..R)), XYDATA
$$ [...]
$$ plain form
24003 -37389 271 24088 7513 -22341 -10744 -42723 -40166 -35673 -11152 -23913 -22006 -11755
23991 -11755 25431 -20417 -80071 -86992 -114995 -99722 -48794 38799 70064 46209 47631 28720
23979 28720 3208 -5602 -4605 -7574 -9616 -13692 -19393 -55583 -52363 16864 86533 138699 101691
23966 101691 19842 -55689 -38124 -23434 24355 32600 51558 -10944 -11730 3673 38714 34665
23954 34665 39459 56597 43800 -27672 -77870 -70668 -64475 -52726 -121797 -139848 -126314 -67113
23942 -67113 -51603 -30407 -22558 -40602 -44398 -69213 -41404 -27146 12331 -13189 -41091 -33468
23930 -33468 43758 76292 117875 140380 98343 83973 72604 52000 -7027 -18769 -6040 8456
23918 8456 -24675 -49978 -35562 -38995 -33040 13824 49129 55089 46318 34445 69580 92952 85263
$$ packed form
24003c7389L7660K3817j6575k9854J1597l1979K557M493K4521j2761J907J0251
23991a1755L7186m5848n9654o921k8003J5273N0928Q7593L1265k3855J422j8911
23979B8720k5512q810R97k969k042m076n701l6190L220O9227O9669N2166l7008
23966A01691q1849p5531J7565J4690M7789Q245J8958o2502p86J5403L5041m049
23954C4665M794J7138j2797p1472n0198P202O193J1749o9071j8051J3534N9201
23942f7113J5510K1196P849j8044l796k4815K7809J4258L9477k5520k7902P623
23930c3468P7226L2534M1583K2505m2037j4370j1369k0604n9027j1742J2729J4496
23918H456l3131k5303J4416l433N955M6864L5305N960q771j1873L5135K3372p689
$$ plain form
23905 85263 74703 72652 -7168 -16063 13093 4803 32250 65930 33756 38333 50174 32343
23893 32343 51163 81627 133327 134752 91431 57064 78505 117696 93874 93948 91738 98352 80794
23880 80794 40020 18145 12234 -10816 -36859 -15854 -8500 -34725 -26823 -39366 -81901 -91472
23868 -91472 -103287 -117333 -113136 -109767 -84955 -56317 -17145 -47930 -50503 -86604 -132657 -139008
23856 -139008 -62649 -8596 -14982 -2467 23531 36122 30555 -1197 -23768 -19194 -36958 -108210
23844 -108210 -90619 -55518 -30843 -57672 -23535 11297 16246 19477 48714 -239 3109 31891
23832 31891 59324 49287 62184 77934 67634 68002 46054 35547 -42516 -22936 -12997 -19398
23820 -19398 4643 -13271 -68486 -101868 -103705 -71668 -34291 -35806 -58465 -29575 14194 -27549
$$ packed form
23905H5263j0560k051p9820q895K9156q290K7447L3680l2174M577J1841j7831
23893C2343J8820L0464N1700J425m3321l4367K1441L9191k3822P4k210O614j7558
23880H0794m0774k1875n911k3050k6043K1005P354k6225P902j2543m2535r571
23868i1472j1815j4046M197L369K4812K8638L9172l0785k573l6101m6053o351
23856a39008P6359N4053o386J2515K5998J2591n567l1752k2571M574j7764p1252
23844a08210J7591L5101K4675k6829L4137L4832M949L231K9237m8953L348K8782
23832C1891K7433j0037J2897J5750j0300L68k1948j0507p8063J9580R939o401
23820a9398K4041j7914n5215l3382j837L2037L7377j515k2659K8890M3769m1743
$$ plain form
23808 -27549 -49330 -47534 14960 61003 93325 103030 13144 -28308 -60883 -60028 -14501 23384
23796 23384 -20875 -90023 -96722 -86287 -66896 -48790 -74670 -75715 -33836 11324 38272 32578
23784 32578 16535 -16694 20138 46508 42628 95038 56577 2746 -3141 18109 41919 43400
23772 43400 -13580 -83926 -98893 -58884 31999 74478 81304 29715 -19374 -6930 33980 39912
23760 39912 -7324 -52530 -52180 -3139 54273 34067 8454 15572 34992 24221 -45007 -92774
23748 -92774 -43266 -25903 -19965 14640 -12279 -53876 -52956 -19289 9878 30087 -19267 -41980
23736 -41980 -1677 -30787 -11853 13981 -17388 -16359 17452 61691 79336 88767 75834 85093
23724 85093 69063 56652 50492 -2339 -30788 -49690 -69288 -50173 -37962 -46572 -63213 -11500
$$ packed form
23808b7549k1781J796O2494M6043L2322R705q9886m1452l2575Q55M5527L7885
23796B3384m4259o9148o699J0435J9391J8106k5880j045M1879M5160K6948n694
23784C2578j6043l3229L6832K6370l880N2410l8461n3831n887K1250K3810J481
23772D3400n6980p0346j4967M0009R0883M2479O826n1589m9089J2444M0910N932
23760C9912m7236m5206L50M9041N7412k0206k5613P118J9420j0771o9228m7767
23748i2774M9508J7363N938L4605k6919m1597R20L3667K9167K0209m9354k2713
23736d1980M0303k9110J8934K5834l1369J029L3811M4239J7645R431j2933R259
23724H5093j6030j2411o160n2831k8449j8902j9598J9115J2211q610j6641N1713
$$ plain form
23712 -11500 27930 717 -74821 -65842 -41655 8210 13302 -27038 -56311 42733 55856 35911
23700 35911 26218 -5487 9705 -1498 -2324 -69847 -54903 -23124 1702 11048 -6705 7869
23688 7869 3743 35103 24648 14454 18310 33707 -36 10764 57207 31869 -23708 -17785
23676 -17785 17865 -27605 -45217 -20490 42332 15805 -9819 10897 67813 58019 22095 4883
23664 4883 19315 68880 110819 92029 49667 70271 108341 117749 102957 18954 7621 -35560
23652 -35560 -81478 -52119 -82300 -92123 -50702 6217 26209 32017 44591 -14756 -1791 18999
23640 18999 23028 -20473 -26193 -18765 -26018 -25679 -39860 -28387 -19713 -52396 -52731 -5094 -14039 15062
23626 15062 41332 31450 -20965 -52821 -124183 -118585 -52936 -12851 -27878 -74655 -92823 -101757
$$ packed form
23712a1500L9430k7213p5538Q979K4187M9865N092m0340k9273R9044J3123j9945
23700C5911r693l1705J5192j1203q26o7523J4944L1779K4826R346j7753J4574
23688G869m126L1360j0455j0194L856J5397l3743J0800M6443k5338n5577N923
23676a7785L5650m5470j7612K4727O2822k6527k5624K0716N6916r794l5924j7212
23664D883J4432M9565M1939j8790m2362K0604L8070R408j4792q4003j1333m3181
23652c5560m5918K9359l0181r823M1421N6919J9992N808J2574n9347J2965K0790
23640A8999M029m3501n720P428p253L39j4181J1473Q674l2683l35M7637q945K9101
23626A5062K6270r882n2415l1856p1362N598O5649M0085j5027m6777j8168q934
$$ plain form
23614 -101757 -50138 18377 -8209 -15064 -16099 -36874 -21638 -25286 -2438 52917 38109 1340
23602 1340 -46301 -50621 -46886 -64861 -67795 -106843 -147917 -22827 4941 12176 25790 -11362
23590 -11362 -19784 3917 -36942 -38923 -23010 6305 29989 97835 72813 23136 -45345 -43395
23578 -43395 -33992 -22731 3915 17063 43910 39900 -10780 -3124 -43031 -85201 -100975 -72830
23566 -72830 -92176 -95299 -67403 -17352 -55511 -73589 -71851 -45023 -36353 -26909 -196 -9751 -4510
23553 -4510 -466 -7563 -64088 -109081 -96691 -76783 -83247 9081 67450 43033 34561 10010 -49907
23540 -49907 -50590 8191 12201 -18639 6835 26808 47610 12089 3839 12758 51213 18125 31938
23527 31938 24808 -24703 -38134 -26823 -97492 -96922 -47437 -34507 -21371 653 -2000 5372 -24985
$$ packed form
23614a01757N1619O8515k6586o855j035k0775J5236l648K2848N5355j4808l6769
23602A340m7641m320L735j7975k934l9048m1074J25090K7768P235J3614l7152
23590a1362q422K3701m0859j981J5913K9315K3684O7846k5022m9677o8481J950
23578d3395R403J1261K6646J3148K6847m010n0680P656l9907m2170j5774K8145
23566g2830j9346l123K7896N0051l8159j8078J738K6828Q670R444K6713r555N241
23553d510M044p097n6525m4993J2390J9908o464R2328N8369k4417q472k4551n9917
23540d9907o83N8781M010l0840K5474J9973K0802l5521q250Q919L8455l3088J3813
23527C1938p130m9511j3431J1311p0669N70M9485J2930J3136K2024k653P372l0357
$$ plain form
23514 -24985 -41036 21755 50347 23473 48152 80683 76172 79413 56063 36637 18871 -6001
23502 -6001 -28756 30049 48540 30685 77067 88941 21757 -15020 -24415 -24816 -44738 -3391
23490 -3391 5522 11275 46641 45742 25065 -2332 -49495 -15945 25489 -26046 -67188 6745 49710
23477 49710 -2172 -69564 -119021 -112756 -105016 -25479 -946 -69386 -112490 -132170 -121021 -88640
23465 -88640 -94764 -52220 -23184 -22506 -33133 -59172 -52354 -34419 -61894 -26780 8832 34723
23453 34723 36956 7965 13202 25173 27045 55810 36109 -41453 -71135 -63908 -19453 6500
23441 6500 21249 11142 -2951 15417 71002 88635 67585 82304 96527 57585 16199 32880
23429 32880 33551 28437 -13115 -939 39358 21631 -8763 -23347 -24278 -39344 -52504 -42399 16099
$$ packed form
23514b4985j6051O2791K8592k6874K4679L2531m511L241k3350j9426j7766k4872
23502f001k2755N8805J8491j7855M6382J1874o7184l6777r395m01j9922M1347
23490c391Q913N753L5366q99k0677k7397m7163L3550M1434n1535m1142P3933M2965
23477D9710n1882o7392m9457O265P740P9537K4533o8440m3104j9680J1149L2381
23465h8640o124M2544K9036O78j0627k6039O818J7935k7475L5114L5612K5891
23453C4723K233k8991N237J1971J872K8765j9701p7562k9682P227M4455K5953
23441F500J4749j0107j4093J8368N5585J7633k1050J4719J4223l8942m1386J6681
23429C2880O71n114m1552J2176M0297j7727l0394j4584r31j5066j3160J0105N8498
$$ plain form
23416 16099 58331 28386 -19513 -60806 -85994 -41092 -14726 -3488 -22077 17179 17552 3773
23404 3773 -46871 -38917 3800 -20592 -60712 -38376 15679 9228 27409 37679 13486 28063
23392 28063 28749 -11242 -48586 -63504 -52140 1638 52716 108288 123675 73763 29146 30956
23380 30956 39037 6144 8571 14062 -39879 -16197 -14612 -62994 -114998 -59528 9502 52749
23368 52749 24129 -13851 -22096 -69639 -83398 -80561 -66723 -57783 5043 70347 54899 -4836
23356 -4836 -23656 -8610 -53191 -56440 -42564 -14009 -39165 -51157 -31092 -94 21935 13120
23344 13120 -19351 -12388 -559 -24172 -69942 -100094 -57766 -362 -26314 -12249 17733 -2370
23332 -2370 -2236 -33570 -78798 -137443 -101531 -61411 -12822 -23344 -31211 -39818 -47682 -56731 -64165
$$ packed form
23416A6099M2232k9945m7899m1293k5188M4902K6366J1238j8589L9256L73j3779
23404C773n0644P954M2717k4392m0120K2336N4055o451J8181J0270k4193J4577
23392B8063O86l9991l7344j4918J1364N3778N1078N5572J5387m9912m4617J810
23380C0956Q081l2893K427N491n3941K3682J585m8382n2004N5470O9030M3247
23368E2749k8620l7980q245m7543j3759K837J3838Q940O2826O5304j5448n9735
23356d836j8820J5046m4581l249J3876K8555k5156j1992K0065L0998K2029q815
23344A3120l2471O963J1829k3613m5770l0152M2328N7404k5952J4065K9982k0103
23332b370J34l1334m5228n8645L5912M0120M8589j0522p867q607p864r049p434
$$ plain form
23319 -64165 -50010 -77474 -59477 -25248 -45483 -37385 -9673 3793 -40630 -41342 -36485 -22906
23307 -22906 -46999 -83661 -43303 17808 -29832 -55098 -53129 19969 63622 54280 58407 62528
23295 62528 72198 63740 38057 20154 41084 -2096 -29971 -23328 19237 95409 61046 43503
23283 43503 28254 29135 88781 64258 16018 -28997 -46667 -37317 -10188 -454 -42543 -12185
23271 -12185 -5674 -27017 -27560 -57681 -18027 -26252 -41803 -67103 -101479 -60767 4733 55072
23259 55072 37391 17899 30671 17357 8508 -3633 -7612 8616 28405 35299 -5476 -22838
23247 -22838 -56466 -34547 -1729 1977 -8052 -19938 -13580 2939 27673 58931 12831 31933
23235 31933 32913 29969 93240 112531 80265 32329 1124 -29509 -5797 15633 56040 34111
$$ packed form
23319f4165J4155k7464J7997L4229k0235Q098K7712J3466m4423p12M857J3579
23307b2906k4093l6662M0358O1111m7640k5266J969P3098M3653r342M127M121
23295F2528R670q458k5683j7903K0930m3180k7875O643M2565P6172l4363j7543
23283D3503j5249Q81N9646k4523m8240m5015j7670R350K7129R734m2089L0358
23271a2185O511k1343n43l0121L9654q225j5551k5300l4376M0712O5500N0339
23259E5072j7681j9492J2772j3314q849j2141l979J6228J9789O894m0775j7362
23247b2838l3628K1919L2818L706j0029j1886O358J6519K4734L1258m6100J9102
23235C1933R80k944O3271J9291l2266m7936l1205l0633K3712K1430M0407k1929
$$ plain form
23223 34111 18755 6307 39923 16690 869 19011 -1329 9486 -17536 -19440 30248 65013
23211 65013 103126 66139 25480 30920 98027 143541 116581 25757 9665 21044 -5383 10217
23199 10217 7658 15420 68170 103974 102389 -13214 -77952 -71777 -61492 -33981 9252 35996
23187 35996 27502 -38169 -32458 -10974 9179 5579 -42504 -57887 -73514 -39331 -18402 -29172
23175 -29172 -36717 -55035 -36400 17143 -22549 -18716 -9783 -1164 38018 66750 19860 -3629
23163 -3629 -3538 -22752 -59475 -58811 -47873 -72299 -68763 -55763 -47197 -40227 -24193 -42780 -30681
23150 -30681 22227 35483 35979 71591 33373 -19599 -54696 -9217 60902 73279 22944 29192
23138 29192 23533 -46890 -41760 21923 92899 119907 118707 76044 66781 57551 40546 -4671 4393
$$ packed form
23223C4111j5356j2448L3616k3233j5821J8142k0340J0815k7022j904M9688L4765
23211F5013L8113l6987m0659N440O7107M5514k6960r0824j6092J1379k6427J5600
23199A0217k559P762N2750L5804j585j15603o4738O175J0285K7511M3233K6744
23187C5996q494o5671N711K1484K0153l600m8083j5383j5627L4183K0929j0770
23175b9172p545j8318J8635N3543l9692L833Q933Q619L9182K8732m6890k3489
23163c629R1j9214l6723O64J0938k4426L536J3000Q566O970J6034j8587J2099
23150c0681N2908J3256M96L5612l8218n2972l5097M5479P0119J2377n0335O248
23138B9192n659p0423N130O3683P0976K7008j200m2663r263r230j7005m5217R064
$$ plain form
23125 4393 16759 2322 -8540 -9345 3749 -31159 -46833 -44832 7998 23677 11334 20945 28371
23112 28371 51868 40496 50033 44028 37009 34594 -880 14116 56403 30091 -18010 -74539
23100 -74539 -44017 643 17264 46157 67666 85611 23425 -109080 -86311 25418 12708
23089 12708 32671 -10960 -53028 -53091 -664 61589 24634 -16733 -38291 -34871 -462 -40215
23077 -40215 -82377 -51795 -24975 29557 28777 -3549 -62210 -71696 -51856 -59527 -42704 -2601
23065 -2601 26756 24408 -7240 -14409 -38468 -29977 -31920 -53709 -45207 -29383 13857 27182 38066
23052 38066 63937 51938 25595 52017 98682 98413 77536 62310 19570 -440 10418 9239
23040 9239 24251 -35671 -39266 24556 36010 9195 61680 56609 47580 49672 -11313 -4573 24396
$$ packed form
23125D393J2366j4437j0862q05J3094l4908j5674K001N2830J5679j2343R611P426
23112B8371K3497j1372R537o005p019k415l5474J4996M2287k6312m8101n6529
23100g4539L0522M4660J6621K8893K1509J7945o2186j32505K2769J11729j2710
23089A2708J9963m3631m2068o3N2427O2253l6955m1367k1558L420L4409l9753
23077d0215m2162L0582K6820N4532p80l2326n8661r486J9840p671J6823M0103
23065b601K9357k348l1648p169k4059Q491j943k1789Q502J5824M3240J3325J0884
23052C8066K5871j1999k6343K6422M6665k69k0877j5226m2740k0010J0858j179
23040I239J5012n9922l595O3822J1454k6815N2485n071r029K092o0985O740K8969
$$ plain form
23027 24396 63340 56862 49727 50758 15125 30075 16808 -7040 68148 91669 110646 66268
23015 66268 39317 64607 104373 57571 5717 -39975 -58478 -85564 -97332 -72180 -75895 -84378
23003 -84378 -33498 22153 40250 -3298 -48437 -76316 -44153 -31781 -21368 -14580 -8213 30861
22991 30861 14977 44893 65056 31333 -42390 -47524 -57653 -13943 27515 -15769 -75239 -84157
22979 -84157 -87888 -106124 -29418 -5652 -56426 -31632 -31218 -57910 -54433 -5739 48058 55879 12083
22966 12083 -36910 -50885 -26683 -19591 -60348 -57233 -6844 16675 12009 -15024 -54385 -36648
22954 -36648 -14388 11050 -24431 -33046 14356 28145 23707 -43282 -56872 -50142 -28971 35607
22942 35607 41038 24422 22718 30840 598 -30988 -54451 -43461 -51950 -29790 3090 -34388
$$ packed form
23027B4396L8944o478p135J031l5633J4950j3267k3848P5188K3521J8977m4378
23015F6268k6951K5290L9766m6802n1854m5692j8503k7086j1768K5152l715q483
23003h4378N0880N5651J8097m3548m5139k7879L2163J2372J0413O788O367L9074
22991C0861j5884K9916K0163l3723p3723n134j0129M3710M1458m3284n9470q918
22979h4157l731j8236P6706K3766n0774K4794M14k6692L477M8694N3797P821m3796
22966A2083m8993j3975K4202P092m0757L115N0389K3519m666k7033l9361J7737
22954c6648K2260K5438l5481q615M7402J3789m438o6989j3590O730K1171O4578
22942C5607N431j6616j704Q122l0242l1586k3463J0990q489K2160L2880l7478
$$ plain form
22930 -34388 -91742 -91315 -56305 -17933 -14109 -29373 -55323 -83146 -84347 -51159 15472 53466
22918 53466 100030 65395 12941 47568 33580 6426 -14007 6609 12721 -19481 -11616 3991
22906 3991 -22537 -24361 8923 25994 -2633 -1560 19390 -10092 2161 37907 55723 70118
22894 70118 52332 56766 25567 -21398 5918 46166 26223 19786 21085 7899 17027 66408
22882 66408 29269 19073 -332 17323 41981 27347 -19007 -14923 -3220 8862 16768 -4006
22870 -4006 -8344 2102 8886 49366 35595 60370 75685 40924 23428 7800 -4993 -14637
22858 -14637 7729 987 6657 11655 -10040 31224 89642 104963 70715 -1260 -41366 -92169
22846 -92169 -78695 -74934 -91080 -73896 -109745 -109473 -50780 -55922 -13292 30202 22319 41049 49750
$$ packed form
22930c4388n7354M27L5010L8372L824j5264k5950k7823j201L3188O6631L7994
22918E3466M6564l4635n2454L4627j3988k7154k0433K0616O112l2202P865J5607
22906C991k6528j824L3284J7071k8627J073K0950k9482J2253L5746J7816J4395
22894G0118j7786M434l1199m6965K7316M0248j9943o437J299j3186R128M9381
22882F6408l7139j0196j9405J7655K4658j4634m6354M084J1703J2082P906k0774
22870d006m338J0446O784M0480j3771K4775J5315l4761j7496j5628j2793r644
22858a4637K2366o742N670M998k1695M1264N8418J5321l4248p1975m0106n0803
22846i2169J3474L761j6146J7184l5849K72N8693n142M2630M3494p883J8730Q701
$$ plain form
22833 49750 17746 -2838 -33794 -30743 9266 -37560 -68591 -110358 -85674 -36169 26100 4817
22821 4817 -64443 -75313 -10504 4374 -50641 -40116 -72423 -61270 -49320 -55578 -53304 -51015
22809 -51015 -107944 -127377 -117197 -109931 -68785 29082 45374 19842 10492 -15963 36717 98755
22797 98755 103413 53335 -20 -62980 -83353 -79105 -60008 -31419 -399 -23645 -19398 -22837
22785 -22837 -18258 -15799 -26697 -41265 -39825 -50928 -46795 -18954 47831 43487 64494 79286 67117
22772 67117 129443 112994 55176 31880 36746 23124 49804 16324 11144 27635 -6301 36277
22760 36277 65110 43830 -7262 -4615 76639 20305 -30514 -48735 -46090 20530 -6216 -44920
22748 -44920 -66454 -75575 -41625 -9228 1122 42108 66416 53277 29678 3181 -20871 7956
$$ packed form
22833D9750l2004k0584l0956L051M0009m6826l1031m1767K4684M9505O2269k1283
22821D817o9260j0870O4809J4878n5015J0525l2307J1153J1950o258K274K289
22809e1015n6929j9433J0180P266M1146R7867J6292k5532r350k6455N2680O2038
22797I8755M658n0078n3355o2960k0373M248J9097K8589L1020k3246M247l439
22785b2837M579K459j0898j4568J440j1103M133K7841O6785m344K1007J4792j2169
22772F7117O2326j6449n7818k3296M866j3622K6680l3480n180J6491l3936M2578
22760C6277K8833k1280n1092K647Q1254n6334n0819j8221K645O6620k6746l8704
22748d4920k1534r121L3950L2397J0350M0986K4308j3139k3599k6497k4052K8827
$$ plain form
22736 7956 37743 47638 61478 13178 -18074 -26298 15717 42413 32551 -26636 -37236 -30755 -21133
22723 -21133 1246 40122 29080 39142 53483 18127 13214 -57185 -87908 -58395 -55099 -36378
22711 -36378 -28588 -52445 -28984 -1459 -2606 -4641 -6673 -15796 -5702 -10721 -34025 -31450 -42902
22698 -42902 -71095 -40755 8651 35310 59280 57783 48935 -18722 -22258 -28888 -34487 -41485 14553
22685 14553 3659 17197 84533 63815 54087 78972 102441 94675 58239 62135 28695 36213
22673 36213 34724 68426 104768 77040 31874 14939 -25479 -42428 -54581 -54399 16521 94210
22661 94210 112361 121183 96377 25288 47835 70448 66324 59765 45936 58736 85294 15204
22649 15204 23308 70223 26560 -33944 -21783 -20309 -22764 -26257 -60125 -87094 -71911 -68051 -18368
$$ packed form
22736G956K9787R895J3840m8300l1252q224M2015K6696r862n9187j0600O481R622
22723b1133K2379L8876j1042J0062J4341l5356m913p0399l0723K9513L296J8721
22711c6378P790k3857K3461K7525j147k035k032r123J0094n019k3304K575j1452
22698d2902k8193L0340M9406K6659K3970j497q848o7657l536o630n599o998N6038
22685A4553j0894J3538O7336k0718r728K4885K3469p766l6436L896l3440P518
22673C6213j489L3702L6342k7728m5166j6935m0418j6949j2153J82P0920P7689
22661I4210J8151Q822k4806p1089K2547K2613m124o559j3829J2800K6558p0090
22649A5204Q104M6915m3663o0504J2161J474k455l493l3868k6969J5183L860M9683
$$ plain form
22636 -18368 -48743 -79357 -59646 -13106 -42171 -56026 -9200 -3545 28857 73973 22525 21884
22624 21884 43356 37098 45589 64950 76795 3911 13465 53017 71782 45421 24093 -27913
22612 -27913 -4144 56752 125732 109386 46183 54912 49942 9110 -1535 1905 17150 -53461
22600 -53461 -88768 -65459 -52180 -33921 -65179 -79559 -69777 -55456 -60730 -74924 -50779 -71404
22588 -71404 -52638 -36950 -1784 17405 -6257 2196 -35499 -66899 -63761 -78740 -60740 -57569
22576 -57569 -37630 -17352 -16647 -52140 -27549 32538 31642 23548 -18869 -9610 -32051 -26377 -4675
22563 -4675 -3921 -23605 -43818 -10393 29971 35352 30152 26098 -1006 -21423 -53984 -71305 -65286
22550 -65286 -45840 -16326 54685 68033 1792 -27337 11325 -14537 -33472 -24245 -49026 -87983
$$ packed form
22636a8368l0375l0614J9711M6540k9065j3855M6826N655L2402M5116n1448o41
22624B1884K1472o258Q491J9361J1845p2884R554L9552J8765k6361k1328n2006
22612b7913K3769O0896O8980j6346o3203Q729m970m0832j0645L440J5245p0611
22600e3461l5307K3309J3279J8259l1258j4380R782J4321n274j4194K4145k0625
22588g1404J8766J5688L5166J9189k3662Q453l7695l1400L138j4979J8000L171
22576e7569J9939K0278P05l5493K4591O0087q96q094m2417R259k2441N674K1702
22563d675P54j9684k0213L3425M0364N381n200m054k7104k0417l2561j7321O019
22550f5286J9446K9514P1011J3348o6241k9129L8662k5862j8935R227k4781l8957
$$ plain form
22538 -87983 -66200 -27353 12945 2537 -29826 -19926 -41010 -54201 -90216 -62455 14068 52012
22526 52012 53773 56245 31222 5770 -257 55036 64064 79101 32232 2183 -16018 13252
22514 13252 1103 -59677 -45336 -34277 -71982 -86434 -1937 65261 38790 -21164 -24169 -2176
22502 -2176 35229 65564 21642 -59233 -12160 12758 -45010 -64542 5026 85190 93416 25298
22490 25298 -51011 -62997 -45115 -40831 26626 -1183 -39037 -1083 15930 37742 2291 -8695
22478 -8695 32054 65623 42742 82764 85643 48993 35595 30919 -307 -3471 25563 11007
22466 11007 51233 106609 63542 13746 -62388 -64502 -58375 -27922 22017 39714 27173 27491
22454 27491 -7591 -22218 -3583 30797 48440 21523 -63726 -52831 3557 -60593 -88858 -106396
$$ packed form
22538h7983K1783L8847M0298j0408l2363R900k1084j3191l6015K7761P6523L7944
22526E2012J761K472k5023k5452o027N5293R028J5037m6869l0049j8201K9270
22514A3252j2149o0780J4341J1059l7705j4452Q4497O7198k6471n9954l005K1993
22502b176L7405L0335m3922q0875M7073K4918n7768j9532O9568Q0164Q226o8118
22490B5298p6309j1986J7882M284O7457k7809l7854L7954J7013K1812l5451j0986
22478h695M0749L3569k2881M0022K879l6650j3398m676l1226l164K9034j4556
22466A1007M0226N5376m3067m9796p6134k114O127L0453M9939J7697j2541L18
22454B7491l5082j4627J8635L4380J7643k6917q5249J0895N6388o4150k8265j7538
$$ plain form
22442 -106396 -81047 -40497 -83974 -102956 -66509 -48410 12919 8124 -3578 -7549 -10893 -70715
22430 -70715 -20642 -11701 -57270 -27255 3856 -8729 -5331 -3314 -17877 -20274 -2974 18356
22418 18356 7391 -66079 -35709 14666 44999 19827 -4692 14359 32233 -10529 -34165 -15758
22406 -15758 28021 55297 -7310 -21852 42887 86601 110888 114601 80038 62348 78197 113353
22394 113353 105132 32548 39031 67355 50312 73204 91018 68588 86500 66558 17955 -45067
22382 -45067 -62542 -20447 -18054 -42818 -16348 13822 -5727 -23562 -34703 -90077 -100445 -93759
22370 -93759 -5733 -65808 -143890 -104049 -94154 -52113 -56355 -72088 -89083 -52146 14982 8708
22358 8708 -36898 -83255 -64028 -58629 -75652 -29812 43698 53501 35530 44471 40894 26856 -33056
$$ packed form
22442a06396K5349M0550m3477j8982L6447J8099O1329m795j1702l971l344n9822
22430g0715N0073Q941m5569L0015L1111j2585L398K017j4563k397J7300K1330
22418A8356j0965p3470L0370N0375L0333k5172k4519J9051J7874m2762k3636J8407
22406a5758M3779K7276o2607j4542O4739M3714K4287L713l4563j7690J5849L5156
22394A13353q221p2584O483K8324j7043K2892J7814k2430J7912j9942m8603o3022
22382d5067j7475M2095K393k4764K6470L0170j9549j7835j1141n5374j0368O686
22370i3759Q8026o0075p8082L9841R895M2041m242j5733j6995L6937O7128o274
22358H708m5606m6357J9227N399j7023M5840P3510R803j7971Q941l577j4038n9912
$$ plain form
22345 -33056 -44464 -37449 -37219 53864 82577 -17978 -38979 2581 66667 73231 45097 -15782
22333 -15782 -56745 -84005 -47033 -61498 -38114 -26485 -21798 -12742 -5091 47249 83649 98506
22321 98506 59976 -16871 -60421 -76646 -58951 -35391 -14775 8944 33079 29893 -4710 -51145
22309 -51145 -80176 -83535 -86395 -56397 -63539 -23907 51165 84604 107002 88247 56555 65538
22297 65538 49167 27692 80958 88261 79176 82997 100966 69547 5975 -3609 332 16368 31170
22284 31170 36674 74197 97452 64581 5523 3822 -9281 -34387 27844 40639 -28873 -27344
22272 -27344 -49733 -62014 -38045 -30232 -19232 -2677 -24430 -86942 -84255 -51130 -4783 -10793
22260 -10793 16975 11232 40048 11033 -73332 -41380 856 2747 2029 50205 75314 65772 35289
$$ packed form
22345c3056j1408P015K30R1083K8713j00555k1001M1560O4086O564k8134o0879
22333a5782m0963k7260L6972j4465K3384J1629M687R056P651N2340L6400J4857
22321I8506l8530p6847m3550j6225J7695K3560K0616K3719K4135l186l4603m6435
22309e1145k9031l359k860K9998p142L9632P5072L3439K2398j8755l1692Q983
22297F5538j6371k1475N3266P303r085L821J7969l1419o3572r584L941J6036J4802
22284C1170N504L7523K3255l2871n9058j701j3103k5106O2231J2795o9512J529
22272b7344k2389j2281K3969P813J1000J6555k1753o2512K687L3125M6347o010
22260a0793K7768n743K8816k9015q4365L1952M2236J891p18M8176K5109r542l0483
$$ plain form
22247 35289 29997 7438 44760 36988 15227 -24708 -73520 -75251 -51457 -60928 -28221 -18199
22235 -18199 -26510 -20468 -30221 -37389 -35679 -20580 -70576 -105609 -122368 -61634 -7641 52950 53162
22222 53162 28925 47184 32172 -6719 16428 18072 30472 -25129 -38763 -29725 1298 55531
22210 55531 81999 117543 120727 74801 17980 -56920 -74098 -46332 -42009 -48134 -44519 -2267
22198 -2267 6629 23460 29903 -15434 -12037 -63602 -88448 -67282 -40955 46127 83182 -4090
22186 -4090 40081 65728 89685 112985 105287 109696 68246 45208 15220 25156 2849 -8337
22174 -8337 -22652 -52712 -133200 -113319 -27197 7536 5106 12627 42744 99559 77975 57439
22162 57439 87960 66088 43855 54557 46235 32323 21890 -13294 -5202 -54958 -87038 -93847
$$ packed form
22247C5289n292k2559L7322p772k1761l9935m8812j731K3794r471L2707J0022
22235a8199q311O042r753p168J710J5099m9996l5033j6759O0734N3993O0591K12
22222E3162k4237J8259j5012l8891K3147J644J2400n5601j3634R038L1023N4233
22210E5531K6468L5544L184m5926n6821p4900j7178K7766M323o125L615M2252
22198b267Q896J6831O443m5337L397n1565k4846K1166K6327Q7082L7055q7272
22186d090M4171K5647K3957K3300p698M409m1450k3038k9988R936k2307j1186
22174h337j4315l0060q0488J9881Q6122L4733k430P521L0117N6815k1584k0536
22162E7439L0521k1872k2233J0702q322j3912j0433l5184Q092m9756l2080o809
$$ plain form
22150 -93847 -110346 -124050 -70065 4552 -15648 -11975 7081 -4457 -15089 -20225 -13652 -21722
22138 -21722 -9507 5498 -27149 -17586 -3343 7938 26664 37442 1763 -14835 4118 63610
22126 63610 47824 -21655 -29480 -11601 32209 16800 -8536 -44958 -87667 -75245 -28622 -3637
22114 -3637 24699 22943 21698 28540 64088 62390 26908 38070 43259 25752 -6675 -51437 -61920
22101 -61920 -74538 -11569 36612 -18782 -49205 -62630 -80384 3325 30461 30171 -2991 23924
22089 23924 27574 -15361 24465 68854 42503 -4846 -42506 29402 93901 5294 -76552 -79883
22077 -79883 -28811 -16630 -31274 -22547 -45544 -69750 -90351 -71130 -35326 -50514 -72166 -100674
22065 -100674 -75013 -22134 -3295 -5516 -25463 -32252 -1405 29941 35041 -13251 -13639 42130
$$ packed form
22150i3847j6499j3704N3985P4617k0200L673J9056j1538j0632n136O573q070
22138b1722J2215J5005l2647R563J4243J1281J8726J0778l5679j6598J8953N9492
22126F3610j5786o9479p825J7879M3810j5409k5336l6422m2709J2422M6623K4985
22114c637K8336j756j245O842L5548j698l5482J1162N189j7507l2427m4762j0483
22101f1920j2618O2969M8181n5394l0423j3425j7754Q3709K7136k90l3162K6915
22089B3924L650m2935L9826M4389k6351m7349l7660P1908O4499q8607q1846l331
22077g9883N1072J2181j4644Q727k2997k4206k0601J9221L5804j5188k1652k8508
22065a00674K5661N2879J8839k221j9947o789L0847L1346N100m8292l88N5769
$$ plain form
22053 42130 50357 26330 -13207 -26047 18470 54121 9902 56062 107975 91509 64278 54964
22041 54964 53223 24300 6364 27087 75372 89456 92681 62874 25216 28678 51777 66515
22029 66515 34986 -10550 -22959 -50465 -106296 -159788 -69981 -35577 -26661 9182 33428 24210
22017 24210 -2122 -23131 32659 55320 37163 70113 29990 -35543 -33962 -40904 -64444 -85559
22005 -85559 -49813 -80026 -77228 -32367 -60056 -51068 15529 9071 -28957 -38907 23612 19664 -46233
21992 -46233 -42778 -50256 -47927 -559 18440 53687 87424 33000 21171 -1947 -4909 2243 29552
21979 29552 -1404 -40277 -36836 -44756 13260 48977 4774 -3948 10914 40845 -24757 -35576
21967 -35576 -12617 20074 -11614 -34613 1704 21895 24478 18998 -12257 -17007 -3958 20455
$$ packed form
22053D2130Q227k4027l9537j2840M4517L5651m4219M6160N1913j6466k7231r314
22041E4964j741k8923j7936K0723M8285J4084L225k9807l7658L462K3099J4738
22029F6515l1529m5536j2409k7506n5831n3492Q9807L4404Q916L5843K4246r218
22017B4210k6332k1009N5790K2661j8157L2950m0123o5533J581o942k3540k1115
22005h5559L5746l0213K798M4861k7689Q988O6597o458l8028r950O2519l948o5897
21992d6233L455p478K329M7368J8999L5247L3737n4424j1829k3118k962P152K7309
21979B9552l0956l8873L441p920N8016L5717m4203q722J4862K9931o5602j0819
21967c5576K2959L2691l1688k2999L6317K0191K583n480l1255m750J3049K4413
$$ plain form
21955 20455 57417 112073 89372 20487 46281 32962 24763 -33613 -74947 -42873 -113 37105
21943 37105 65014 89199 49037 -32922 -41114 1895 331 17190 58606 859 -28067 -3258
21931 -3258 -9868 -26713 -8514 -14443 14807 24883 -6649 -6173 -57568 -40683 -15190 -31663 21078
21918 21078 4207 -38354 -19921 -27875 -57727 -93110 -124471 -103491 -26758 2504 -20596 -39590
21906 -39590 -54844 -38523 -48399 -87953 -53774 -36333 -37415 -55885 -49480 -79451 -87188 -63059
21894 -63059 -16195 -13782 -23191 -68479 -103951 -102580 -86343 -42584 -25702 4395 37894 33187
21882 33187 17775 39223 45160 41803 12152 -63792 -128497 -147972 -86868 8124 16702 -6594
21870 -6594 -6433 59 15251 -3386 -57481 -33879 -27711 16286 33273 -1603 -13857 43710 53982
$$ packed form
21955B0455L6962N4656k2701o8885K5794j3319q199n8376m1334L2074M2760L7218
21943C7105K7909K4185m0162q1959q192M3009j564J6859M1416n7747k8926K4809
21931c258o610j6845J8199n929K9250J0076l1532M76n1395J6885K5493j6473N2741
21918B1078j6871m2561J8433p954k9852l5383l1361K0980P6733K9262k3100j8994
21906c9590j5254J6321r876l9554L4179J7441j082j8470O405k9971p737K4129
21894f3059M6864K413r409m5288l5472J371J6237M3759J6882L0097L3499m707
21882C3187j5412K1448N937l357k9651p5944o4705j9475O1104R4992Q578k3296
21870f594J61O492J5192j8637n4095K3602O168M3997J6987l4876j2254N7567J0272
$$ plain form
21857 53982 17292 -14699 -16492 -31715 9099 -29644 -90247 -56537 -44881 -26456 -41062 -33089
21845 -33089 533 31077 13861 -36766 -60914 -41455 -64210 -54348 -4726 19671 -6452 -34390
21833 -34390 -5043 25175 59323 62605 8830 -56919 -88729 -86838 -70957 -14468 -6692 32047
21821 32047 30565 -22716 -62636 -39848 -48292 -49499 -41774 -63447 -41156 -12436 18191 30098
21809 30098 59534 16286 -12634 -11260 -23872 -62644 -70965 -82591 -78605 -67770 -50576 -51051 -63021
21796 -63021 -90055 -104270 -137282 -137906 -79400 8564 48514 46801 31384 3528 -13497 -51616
21784 -51616 -17301 2083 -30255 -54633 -63169 -63950 8697 62256 94379 74434 84497 73038
21772 73038 12856 42341 44090 48044 66574 51297 31339 16340 50017 82375 63757 15486
$$ packed form
21857E3982l6690l1991j793j5223M0814l8743o0603L3710J1656J8425j4606P973
21845c3089L3622L0544j7216n0627k4148J9459k2755R862M9622K4397k6123k7938
21833c4390K9347L0218L4148L282n3775o5749l1810J891J5881N6489P776L8739
21821C2047j482n3281l9920K2788q444j207P725k1673K2291K8720L0627J1907
21809C0098K9436m3248k8920J374j2612l8772q321j1626L986J0835J7194m75j1970
21796f3021k7034j4215l3012o24N8506Q7964L9950j713j5417k7856j7025l8119
21784e1616L4315J9384l2338k4378q536p81P2647N3559L2123j9945J0063j1459
21772G3038o0182K9485J749L954J8530j5277j9958j4999L3677L2358j8618m8271
$$ plain form
21760 15486 -1411 -10679 -6687 -32227 -54953 -36012 -26961 33027 22290 -26903 -69759 -67277
21748 -67277 -82063 -81499 -80934 -33372 2286 22262 31660 13623 28878 11951 -30515 -23184 23127
21735 23127 65851 39803 37646 71860 70460 74608 76642 100227 85578 68639 9630 -14754
21723 -14754 20037 44551 63953 56504 48446 4430 -38093 33709 19420 -7771 -2112 -10719
21711 -10719 -51441 -65943 -22840 -41085 -52081 -56469 -46866 -66971 -40252 -22471 -35685 -20150
21699 -20150 20646 45497 59011 52109 44144 -599 -25143 -23441 6394 65247 47015 50270
21687 50270 58919 53663 58498 60349 18893 -33690 -17428 11601 41554 62933 60506 31305 12282
21674 12282 41269 -11607 -54975 -23146 -35430 -71707 -61562 -65018 -15202 -55722 -52390 9810
$$ packed form
21760A5486j6897r268L992k5540k2726J8941R051N9988j0737m9193m2856K482
21748f7277j4786N64N65M7562L5658J9976R398j8037J5255j6927m2466P331M6311
21735B3127M2724k6048k157L4214j400M148K034K3585j4649j6939n9009k4384
21723a4754L4791K4514J9402p449q058m4016m2523P1802j4289k7191N659q607
21711a0719m0722j4502M3103j8245j0996m388R603k0105K6719J7781j3214J5535
21699b0150M0796K4851J3514o902p965m4743k4544J702K9835N8853j8232L255
21687E0270Q649n256M835J851m1456n2583J6262K9029K9953K1379k427k9201j9023
21674A2282K8987n2876m3368L1829j2284l6277J0145l456M9816m0520L332O2200
$$ plain form
21662 9810 25240 14119 9627 20970 -22578 -56342 -80922 -75084 -65244 -52437 -72134 -66578 -32262
21649 -32262 -40844 -47157 -55121 -41061 -49573 -74318 -55589 32126 56148 20932 -1111 2009 -37044
21636 -37044 -52662 -84018 -60341 -33766 912 71348 42741 13650 6854 26461 30501 -5913
21624 -5913 6372 -25269 -43554 -5569 6889 14482 25145 46992 84509 37888 45762 55730
21612 55730 1278 -19865 -51387 -62006 -35689 -61845 -67569 -60354 -44764 -47302 5848 -6025
21600 -6025 25843 66843 70256 28036 -2250 -25254 -7030 56367 11394 16295 15400 6428 2073
21587 2073 23037 35302 45012 40081 118077 138068 109982 42574 4667 -18124 -24149 -21346 -39418
21574 -39418 189 -1546 -22164 -52181 -32902 3565 18163 11874 -16955 -57323 -65347 -48984
$$ packed form
21662I810J5430j1121m492J1343m3548l3764k4580N838R840J2807j9697N556L4316
21649c2262q582o313p964J4060q512k4745J8729Q7715K4022l5216k2043L120l9053
21636c7044j5618l1356K3677K6575L4678P0436k8607k9091o796J9607M040l6414
21624e913J2285l1641j8285L7985J2458P593J0663K1847L7517m6621P874R968
21612E5730n4452k1143l1522j0619K6317k6156n724P215J5590k538N3150j1873
21600f025L1868M1000L413m2220l0286k3004J8224O3397m4973M901q95q972m355
21587B073K0964J2265R710m931P7996J9991k8086o7408l7907k2791o025K803j8072
21574c9418L9607j735k0618l0017J9279L6467J4598o289k8829m0368q024J6363
$$ plain form
21562 -48984 -41758 -61593 -47987 2502 7875 19050 21886 -15693 -32510 -50994 -104222 -65851
21550 -65851 -3022 5103 -12272 -3282 -780 -19299 2547 31133 58751 410 -26190 -2336
21538 -2336 -3722 -19531 -28388 -40580 -7403 14319 1162 23267 20046 25597 50898 42926 85224
21525 85224 118651 131983 131985 110033 77646 59438 24146 -5629 19705 23437 28491 -9294 -30124
21512 -30124 -43742 -65735 -85074 -76200 -77542 -54720 -19186 -27402 35030 40892 29404 26758 -36656
21499 -36656 -96610 -66145 -67760 -17425 15633 9111 72885 62466 70239 8120 -53524 -21940
21487 -21940 -16311 -47502 21404 103749 113587 106569 105451 112109 41356 3516 3526 -27136 -59068
21474 -59068 -44949 -56765 -59097 -57249 -1901 -36924 -66160 -84598 -23078 39984 54467 35835
$$ packed form
21562d8984P226j9835J3606N0489N373J1175K836l7579j6817j8484n3228L8371
21550f5851O2829Q125j7375Q990K502j8519K1846K8586K7618n8341k6600K3854
21538b336j386j5809q857j2192L3177K1722j3157K2105l221N551K5301p972M2298
21525H5224L3427J3332Kk1952l2387j8208l5292k9775K5334L732N054l7785k0830
21512c0124j3618k1993j9339Q874j342K2822L5534q216O2432N862j1488k646o3414
21499c6656n9954L0465j615N0335L3058o522O3774j0419P773o2119o1644L1584
21487b1940N629l1191O8906Q2345R838p018j118O658p0753l7840J0l0662l1932
21474e9068J4119j1816k332J848N5348l5023k9236j8438O1520O3062J4483j8632
$$ plain form
21462 35835 43868 40076 29586 45379 48182 10148 -22682 -39793 -52733 -46765 8156 -15863
21450 -15863 -4482 36297 55840 94019 35066 -22280 45114 23076 -6823 37186 85977 64655
21438 64655 30643 32668 42443 18997 16422 26642 48454 -8863 -59605 -14877 34902 29499
21426 29499 60812 109315 54970 -65183 -90278 -13700 18314 62894 75417 82666 93057 48326
21414 48326 57160 67855 105026 50240 20297 4034 -8501 31383 30339 54763 41777 10362
21402 10362 -30028 -47230 13795 6602 -4339 23856 69563 70741 64583 43409 -25103 -60692
21390 -60692 -77084 -103376 -40838 -22160 -50329 -38005 -25548 -40619 19083 8327 -23510 -19531
21378 -19531 -8115 30897 52229 32581 6875 12947 4661 -19229 -41622 32077 64699 14305
$$ packed form
21462C5835Q033l792j0490J5793K803l8034l2830j7111j2940N968N4921k4019
21450a5863J1381M0779J9543L8179n8953n7346O7394k2038k9899M4009M8791k1322
21438F4655l4012K025R775k3446k575J0220K1812n7317n0742M4728M9779n403
21426B9499L1313M8503n4345j20153k5095P6578L2014M4580J2523P249J0391m4731
21414D8326Q834J0695L7171n4786k9943j6263j2535L9884j044K4424j2986l1415
21402A0362m0390j7202O1025p193j0941K8195M5707J178o158k1174o8512l5589
21390f0692j6392k6292O2538J8678k8169J2324J2457j5071N9702j0756l1837L979
21378a9531J1416L9012K1332j9648k5706O072q286k3890k2393P3699L2622n0394
$$ plain form
21366 14305 -8362 -5767 6150 7226 84001 111332 92543 38205 39719 64805 9757 -42771
21354 -42771 -45332 -11071 87657 107245 73929 94495 100152 64898 14828 14559 -4488 -14729
21342 -14729 -24307 -3351 -15967 4256 48980 84852 80243 34223 71417 52731 48533 33310
21330 33310 51861 13395 16030 46141 44087 52340 41295 3235 19108 17705 -53435 -63265 13614
21317 13614 50367 32981 26442 -14822 -42269 -41627 -34409 -64993 -52201 -16 -16621 -2967
21305 -2967 25689 -22087 -35431 46992 61741 49968 27449 20877 22727 25597 14625 -10748
21293 -10748 24107 4584 -38791 -51985 -60692 -40855 -45712 -55311 -46598 -28396 -13981 -4766 14757
21280 14757 9776 20282 11584 -6768 11956 6330 -11575 -42468 14299 44068 64251 101411
$$ packed form
21366A4305k2667K595J1917J076P6775K7331j8789n4338J514K5086n5048n2528
21354d2771k561L4261R8728J9588l3316K0566N657l5254n0070k69j9047j0241
21342a4729r578K0956j2616K0223M4724L5872m609m6020L7194j8686m198j5223
21330C3310J8551l8466K635L0111k054Q253j1045l8060J5873j403p1140r830P6879
21317A3614L6753j7386o539m1264k7447O42P218l0584J2792N2185j6605J3654
21305b967K8656m7776j3344Q2423J4749j1773k2519o572J850K870j0972k5373
21293a0748L4855j9523m3375j3194q707J9837m857r599Q713J8202J4415R215J9523
21280A4757m981J0506q698j8352J8724n626j7905l0893N6767K9769K0183L7160
$$ plain form
21268 101411 112289 65663 -9635 8480 65873 89754 90823 29856 -4558 4553 -16620 -29560
21256 -29560 -22421 -1556 -30256 -83552 -74981 -20645 13582 9510 36910 12069 -51473 -69990
21244 -69990 -34399 47718 98079 38188 5187 -34203 -58125 -70045 -27299 27199 56886 8738
21232 8738 17595 31282 19230 -12895 -37462 -6832 15950 10747 -34931 -12986 -7740 -14290 8638
21219 8638 -22050 -22590 20989 32060 6300 -23354 -10775 10930 36343 27639 -8712 -44102
21207 -44102 6166 7281 19689 79782 99046 74581 16767 -4795 -33038 -35328 -58055 -33988
21195 -33988 7618 35858 25982 -15862 -4105 24657 -8441 -8749 21573 41755 21868 71295
21183 71295 119390 107465 37480 31190 9023 -40080 -58251 -55862 -42972 -40477 -50148 -61853
$$ packed form
21268A01411J0878m6626p5298J8115N7393K3881J069o0967l4414R111k1173j2940
21256b9560P139K0865k8700n3296Q571N4336L4227m072K7400k4841o3542j8517
21244f9990L5591Q2117N0361n9891l3001l9390k3922j1920M2746N4498K9687m8148
21232H738Q857J3687j2052l2125k4567L0630K2782n203m5678K1945N246o550K2928
21219H638l0688n40M3579J1071k5760k9654J2579K1705K5413q704l6351l5390
21207d4102N0268J115J2408O0093J9264k4465n7814k1562k8243k290k2727K4067
21195c3988M1606K8240r876m1844J1757K8762l3098l08L0322K0182j9887M9427
21183G1295M8095j1925o9985o290k2167m9103j8171K389J2890K495r671j1705
$$ plain form
21171 -61853 -49933 26160 5609 -35429 -68083 -86139 -37298 7237 18868 -35594 -21723 -28944
21159 -28944 -30525 -27162 -18570 -49622 -53072 8856 -31233 -48130 -64132 -96957 -44323 13623
21147 13623 46743 33440 34058 -14449 -48271 20714 79291 55576 31223 7604 4294 -13791
21135 -13791 -6076 -24999 -35343 -30889 -19823 -9302 -21197 -6006 25809 7527 38493 44339
21123 44339 65765 58929 74319 90744 49165 -9156 -16790 9540 -5437 -38751 -65746 -29930
21111 -29930 41671 34745 -18635 -837 17562 38769 71562 24019 23549 44465 89311 135313
21099 135313 121605 89139 72043 69185 31508 48220 60127 47647 30074 31603 25199 -13095
21087 -13095 -63922 -78897 -78434 -17434 3741 6187 -23297 5688 8577 16773 28531 13952 6156
$$ packed form
21171f1853J1920P6093k0551m1038l2654j8056M8841M4535J1631n4462J3871p221
21159b8944j581L363Q592l1052l450O1928m0089j6897j6002l2825N2634N7946
21147A3623L3120j3303O18m8507l3822O8985N8577k3715k4353k3619l310j8085
21135a3791P715j8923j0344M454J1066J0521j1895J5191L1815j8282L0966N846
21123D4339K1426o836J5390J6425m1579n8321p634K6330j4977l3314k6995L5816
21111b9930P1601o926n3380J7798J8399K1207L2793m7543m70K0916M4846M6002
21099A35313j3708l2466j7096k858l7677J6712J1907j2480j7573J529o404l8294
21087a3095n0827j4975M63O1000K1175K446k9484K8985K889Q196J1758j4579p796
$$ plain form
21074 6156 80202 131282 105333 23589 56261 112579 100812 95326 70616 98145 79659 24911
21062 24911 3616 -23787 -46589 -13095 9449 24706 51862 55863 56839 88228 82811 77744 69070
21049 69070 32547 7379 91310 91062 41629 5313 -27510 -69631 -27973 -36719 -33423 -42690 13223
21036 13223 40386 54624 40766 30059 -6656 -46061 -69259 -52185 -28932 -6920 18468 69744
21024 69744 39828 5764 -25833 -27544 -3347 -5830 -1287 37214 69697 89998 55363 29125
21012 29125 40353 1593 18902 11013 27577 51120 55910 28657 -4588 2684 72855 114723
21000 114723 87595 49115 26544 42954 82905 91566 84249 145194 146240 88633 37337 50480
20988 50480 45518 55812 53522 89754 87607 -952 -1578 34963 52299 9644 34148 47678 43109
$$ packed form
21074F156P4046N1080k5949q1744L2672N6318j1767n486k4710K7529j8486n4748
21062B4911k1295k7403k2802L3494K2544J5257K7156M001R76L1389n417n067q674
21049F9070l6523k5168Q3931k48m9433l6316l2823m2121M1658q746L296r267N5913
21036A3223K7163J4238j3858j0707l6715l9405k3198J7074K3253K2012K5388N1276
21024F9744k9916l4064l1597j711K4197k483M543L8501L2483K0301l4635k6238
21012B9125J1228l8760J7309p889J6564K3543M790k7253l3245P272P0171M1868
21000A14723k7128l8480k2571J6410L9951Q661p317O0945J046n7607n1296J3143
20988E0480m962J0294k290L6232k147q8559o26L6541J7336m2655K4504J3530m569
$$ plain form
20975 43109 31448 31202 -30454 -4149 26372 8358 48185 29184 -3469 48483 61341 -15983
20963 -15983 -106245 -113193 -61433 -27135 -36188 -44315 -15119 21032 63496 32817 13523 -30515
20951 -30515 -49207 128 -23447 -53318 -59662 -92772 -61036 -40982 -65755 -91432 -100740 -80072
20939 -80072 -54123 -3900 33760 65838 70159 63285 36692 16363 -10918 -28599 -42504 7446
20927 7446 11323 -35220 -65144 13839 77056 67912 72344 35743 -19259 -58167 -37001 -51980
20915 -51980 -38299 23459 76972 70431 46515 17755 37069 68541 76878 26616 42400 1745
20903 1745 -3364 1415 19684 29002 35661 28054 -8268 11900 29546 36995 23379 20218 5199
20890 5199 5082 1734 -18178 68 31154 42974 19674 42392 86763 13237 -16781 10658
$$ packed form
20975D3109j1661k46o1656K6305L0521j8014L9827j9001l2653N1952J2858p7324
20963a5983r0262o948N1760L4298r053q127K9196L6151M2464l0679j9294m4038
20951c0515j8692M9335k3575k9871o344l3110L1736K0054k4773k5677r308K0668
20939h0072K5949N0223L7660L2078M321o874k6593k0329k7281j7681j3905M9950
20927G446L877m6543k9924P8983O3217r144M432l6601n5002l8908K1166j4979
20915e1980J3681O1758N3513o541k3916k8760J9314L1472Q337n0262J5784m0655
20903A745n109M779J8269R318O659p607l6322K0168J7646P449j3616l161j5019
20890E199j17l348j9912J8246L1086J1820k3300K2718M4371p3526l0018K7439
$$ plain form
20878 10658 25588 46449 67413 38247 9534 56636 27818 34222 56873 92333 83670 43817
20866 43817 27123 34269 16151 -39160 -20341 30584 71607 56339 68353 80908 74246 111492
20854 111492 100538 61132 50249 34700 23009 -27289 -16403 16837 36017 54881 21917
20843 21917 8938 -41160 -58709 43541 15053 8644 6912 7006 21653 33496 23586 -14409 35415
20830 35415 77607 115002 112561 71313 63477 78691 107685 105847 98550 99766 119045 96088 35932
20817 35932 30117 67306 24682 -12866 -7519 -280 -9198 -16129 -12867 6360 11397 35456 22798
20804 22798 -22381 9444 66296 68389 45779 43522 27051 61524 76388 47398 34084 46579
20792 46579 68923 54052 20449 16756 43974 62238 54563 6489 -32808 -61982 -14839 37160
$$ packed form
20878A0658J4930K0861K0964k9166k8713M7102k8818O404K2651L5460q663l9853
20866D3817j6694P146j8118n5311J8819N0925M1023j5268J2014J2555o662L7246
20854A11492j0954l9406j0883j5549j1691n0298J0886L3240J9180J8864l2964
20843B1917j2979n0098j7549J02250k8488o409j732R4J4647J1843r910l7995M9824
20830C5415M2192L7395k441m1248p836J5214K8994j838p297J216J9279k2957o0156
20817C5932n815L7189m2624l7548N347P239q918o931L262J9227N037K4059j2658
20804B2798m5179L1825N6852K093k2610k257j6471L4473J4864k8990j3314J2495
20792D6579K2344j4871l3603l693K7218J8264p675m8074l9297k9174M7143N1999
$$ plain form
20780 37160 88793 90055 43428 12471 21973 23070 8280 33127 -11083 -42110 8643 77581
20768 77581 43255 25822 9745 32868 72462 91307 112516 84960 119725 78531 55820 20875
20756 20875 6744 -19055 -30039 -34067 -59812 -39042 -10204 -19326 -33656 7695 -4297 -39115
20744 -39115 -40403 -34620 -54548 -36125 31948 52928 58085 42215 29127 70168 46138 -33369
20732 -33369 -98620 -81476 -41007 -25324 -40074 -71444 -22163 77490 91468 103452 50126 41864
20720 41864 58254 43475 37907 28832 31081 25449 38409 27941 16308 -20540 -10026 9943
20708 9943 26721 37835 18408 -34972 -35786 -10713 30765 60782 76627 22125 -2949 -24029
20696 -24029 -66489 -59865 -62693 -56516 -37051 -29216 8906 3755 -16543 -13145 -29702 -37114 -26794
$$ packed form
20780C7160N1633J262m6627l0957R502J097j4790K4847m4210l1027N0753O8938
20768G7581l4326j7433j6077K3123L9594J8845K1209k7556L4765m1194k2711l4945
20756B0875j4131k5799j0984m028k5745K0770K8838r122j4330M1351j1992l4818
20744c9115j288N783j9928J8423O8073K0980N157j5870j3088M1041k4030p9507
20732c3369o5251J7144M0469J5683j4750l1370M9281R9653J3978J1984n3326q262
20720D1864J6390j4779n568r075K249n632J2960j0468j1633l6848J0514J9969
20708I943J6778J1114j9427n3380q14K5073M1478L0017J5845n4502k5074k1080
20696b4029m2460O624k828O177J9465P835L8122n151k0298L398j6557p412J0320
$$ plain form
20683 -26794 -60313 -66681 -29189 12442 35635 27415 -20352 28348 41748 9797 -10188 -900
20671 -900 7807 7371 -41784 -65422 -66533 -67840 -97950 -63328 -52329 -7392 11994 -9151 -13811
20658 -13811 16369 18387 91237 116038 107895 103714 94918 70001 62806 30124 -5984 -56347 -78140
20645 -78140 -17879 2167 15861 52730 60213 49082 26890 -20008 6061 15478 11145 -6486
20633 -6486 -23348 -17851 -2992 -11331 33607 47784 94044 167383 126305 68007 50032 53769
20621 53769 69230 52393 48588 38400 -4656 -84196 -44115 -5857 30130 42146 68638 39763
20609 39763 -16624 17857 28741 16447 46104 18515 21289 74105 127726 59806 55756 36286
20597 36286 17308 33591 58428 46975 28396 18899 44655 33351 66063 147685 134780 101009
$$ packed form
20683b6794l3519o368L7492M1631K3193q220m7767M8700J3400l1951j9985R288
20671i00Q707m36m9155k3638j111j307l0110L4622J0999M4937J9386k1145m660
20658a3811L0180K018P2850K4801q143m181q796k4917p195l2682l6108n0363k1793
20645g8140O0261K0046J3694L6869P483j1131k2192m6898K6069R417m333j7631
20633f486j6862N497J4859q339M4938J4177M6260P3339m1078n8298j7975L737
20621E3769J5461j6837l805j0188m3056p9540M0081L8258L5987J2016K6492k8875
20609C9763n6387L4481J0884j2294K9657k7589K774N2816N3621o7920m050j9470
20597C6286j8978J6283K4837j1453j8579r497K5756j1304L2712Q1622j2905l3771
$$ plain form
20585 101009 64511 47984 -8753 -63486 -49934 42038 118306 152861 138057 57140 21064
20574 21064 -11179 -18133 -19601 -64511 -51950 -22126 -54657 -94481 -89013 -74646 -152115 -149007
20562 -149007 -114750 -159644 -129198 -66453 -23867 13404 -9337 -54798 -43973 7484 37231
20551 37231 40960 -11751 -7319 -23115 -71655 -65292 -27135 27286 79612 61270 73926 73133 87703
20538 87703 74179 45944 33488 -20949 -31540 -22029 6429 6772 -40072 -39297 -18836 -21986 20264
20525 20264 53969 38695 53769 24392 -1499 4262 -8584 -7632 4498 22612 58511 24692
20513 24692 -29545 22118 7689 26425 60678 58870 51134 75842 105560 85878 47188 46257
20501 46257 59992 27317 32634 4097 -12984 24813 45291 59315 14689 -25870 -5184 -20944
$$ packed form
20585A01009l6498j6527n6737n4733J3552R1972P6268L4555j4804q0917l6076
20574B1064l2243o954j468m4910J2561K9824l2531l9824N468J4367p7469L108
20562a49007L4257m4894L0446O2745M2586L7271k2741m5461J0825N1457K9747
20551C7231L729n2711M432j5796m8540O363L8157N4421N2326j8342J2656p93J4570
20538H7703j3524k8235j2456n4437j0591R511K8458L43m6844P75K0461l150M2250
20525B0264L3705j5274J5074k9377k5891N761j2846R52J2130J8114L5899l3819
20513B4692n4237N1663j4429J8736L4253j808p736K4708K9718j9682l8690r31
20501D6257J3735l2675N317k8537j7081L7797K0478J4024m4626m0559K0686j5760
$$ plain form
20489 -20944 -53006 -20526 -7955 -14472 -60183 -54642 -36289 -46029 -56340 -30686 -44713 -86716
20477 -86716 -114817 -99045 -81166 -18685 -709 -64038 -74664 -22514 -44406 -30584 -6391 -20017
20465 -20017 -41697 -54021 -36954 -9673 -13238 2829 2053 -25862 4047 5997 9295 -14038 9063
20452 9063 45292 30646 55557 47601 27877 19149 6411 -25486 -29136 -26290 24951 56783 28354
20439 28354 25922 46272 51957 35118 16757 3290 47487 90705 76065 70228 45080 40507
20427 40507 -5946 -34689 -36151 15618 32234 31670 63752 61647 46867 36099 60613 79610
20415 79610 79225 138665 130759 73754 44952 39494 47078 64220 72402 65587 29442 -6452 -65915
20402 -65915 -12858 31539 -216 1309 32487 29698 4174 -23532 5195 -20696 -41396 -22969
$$ packed form
20489b0944l2062L2480J2571o517m5711N541J8353r740j0311K5654j4027m2003
20477h6716k8101J5772J7879O2481J7976o3329j0626N2150k1892J3822K4193j3626
20465b0017k1680j2324J7067K7281l565J6067p76k7915K9909J950L298k3333K3101
20452I063L6229j4646K4911p956j9724q728j2738l1897l650K846N1241L1832k8429
20439B8354k432K0350N685j6839j8361j3467M4197M3218j4640n837k5148m573
20427D0507m6453k8743j462N1769J6616n64L2082k105j4780j0768K4514J8997
20415G9610l85N9440p906n7005k8802n458P584J7142Q182o815l6145l5894n9463
20402f5915N3057M4397l1755J525L1178k789k5524k7706K8727k5891k0700J8427
$$ plain form
20390 -22969 27064 13277 -19151 -6332 -19162 647 39995 37055 11003 -11975 -32273 22317
20378 22317 37179 41633 31027 13552 12623 -31844 -18169 8701 4921 -28882 -65431 -10607
20366 -10607 30665 36557 47448 -13400 -16391 27650 72446 55712 56797 97321 75637 18814
20354 18814 40027 19642 8399 -2233 69182 97166 116589 121784 115422 75341 99219 63277
20342 63277 2587 -21672 -24410 -70258 -74633 -33413 43278 34244 9683 25074 24207 -25687 4556
20329 4556 53504 73558 58499 65269 -8621 -49656 -21510 13777 8814 1588 -841 39992 61676
20316 61676 56297 83283 43126 37335 26299 18482 -4386 -20355 15565 81358 73655 53365
20304 53365 20838 -2441 39917 43353 10626 -2426 -10293 -21135 -13189 -20447 -6140 -12007 12001
$$ packed form
20390b2969N0033j3787l2428J2819j2830J9809L9348k940k6052k2978k0298N4590
20378B2317J4862M454j0606j7475r29m4467J3675K6870l780l3803l6549N4824
20366a0607M1272N892J0891o0848k991M4041M4796j6734J085M0524k1684n6823
20354A8814K1213k0385j1243j0632P1415K7984J9423N195o362m0081K3878l5942
20342F3277o0690k4259k738m5848m375M1220P6691r034k4561J5391q67m9894L0243
20329D556M8948K0054j5059O770p3890m1035K8146L5287m963p226k429M0833K1684
20316F1676n379K6986m0157n791j1036p817k2868j5969L5920O5793p703k0290
20304E3365l2527k3279M2358L436l2727j3052p867j0842P946p258J4307n867K4008
$$ plain form
20291 12001 36635 43443 35857 -32892 -22117 43976 76933 47035 29831 58011 23394 62450
20279 62450 57491 41810 22717 -1553 -27981 -28327 -15830 22685 13985 34973 21434 69440
20267 69440 79702 104099 84008 79325 72447 54502 26269 13288 -10131 -47659 -76624 -31205
20255 -31205 -10082 -4974 -11922 -34806 -52535 -27035 31913 47519 56659 36470 44146 51399 48844
20242 48844 -13403 -28475 -23612 26953 64829 63131 66724 54834 23457 44908 67623 67433 71261
20229 71261 88196 82620 35990 32658 18499 -9960 -30574 -8501 -26620 -9192 35836 37738
20217 37738 34779 29228 6912 70763 30982 3881 -2357 33357 -10495 -48928 -35545 -21094
20205 -21094 -20058 23365 89233 138577 96988 88387 73547 30969 30450 67981 83501 89655 56840
$$ packed form
20291A2001K4634O808p586o8749J0775O6093L2957k9898j7204K8180l4617L9056
20279F2450m959j5681j9093k4270k6428l46J2497L8515q700K0988j3539M8006
20267F9440J0262K4397k0091m683o878j7945k8233j2981k3419l7528k8965M5419
20255c1205K1123N108o948k2884j7729K5500N8948J5606R140k0189P676P253k555
20242D8844o2247j5072M863N0565L7876j698L593j1890l1377K1451K2715j90L828
20229G1261J6935n576m6630l332j4159k8459k0614K2073j8119J7428M5028J902
20217C7738k959n551k2316O3851l9781k7101o238L5714m3852l8433J3383J4451
20205b1094J036M3423O5868M9344m1589q601j4840m2578n19L7531J5520O154l2815
$$ plain form
20192 56840 60756 108402 137484 103440 114902 125045 44172 18194 70707 66916 63968 17527
20180 17527 2562 44756 99834 89795 61322 23524 33576 39210 79278 102595 108044 45508
20168 45508 46368 77322 82014 74041 18669 -27154 -52746 -56784 -6550 -755 -14961 13766 -5903
20155 -5903 -18453 -11066 -22738 2953 30741 57181 87562 89639 50891 66276 108887 103735
20143 103735 63219 38263 26150 25816 22501 37205 19988 39489 74389 44792 58091 66985
20131 66985 67581 103010 158092 102767 -528 -26678 -10636 -36261 -43412 6850 42174 -81724
20119 -81724 -97835 -19594 25142 14804 57993 76051 78658 37958 3891 7155 41685 40601
20107 40601 43958 23530 7101 10340 34758 14368 11917 -7692 -27946 -33060 12616 14705 -19524
$$ packed form
20192E6840L916M7646K9082l4044J1462J0143q0873k5978N2513l791k948m6441
20180A7527j4965M2194N5078j0039k8473l7798J0052N634M0068K3317N449o2536
20168D5508Q60L0954M692p973n5372m5823k5592m038N0234N795j4206K8727j9669
20155e903j2550P387j1672K5691K7788K6440L0381K077l8748J5385M2611n152
20143A03735m0516k4956j2113l34l315J4704j7217J9501L4900k9597J3299Q894
20131F6985N96L5429N5082n5325j03295k6150J6042k5625p151N0262L5324j23898
20119h1724j6111P8241M4736j0338M3189J8058K607m0700l4067L264L4530j084
20107D0601L357k0428j6429L239K4418k0390k451j9609k0254n114M5676K089l4229
$$ plain form
20094 -19524 2268 28532 25669 -14259 -20226 -18056 -18854 27648 35519 33965 18506 -21244 1264
20081 1264 45384 33235 51091 20451 37431 22211 11375 4489 38057 59573 66697 11594
20069 11594 -23499 50426 82547 74787 36659 -39998 15569 16505 9801 2888 75568 131049 130630
20056 130630 90423 64067 51425 30886 65305 110321 99739 73798 37225 4349 26379
20045 26379 66984 83367 73787 51056 20905 55236 86428 87127 99182 71682 57690 102380
20033 102380 27879 10103 -3185 -19689 -66424 -16288 32561 11703 33381 21555 25483 7825
20021 7825 3950 29094 21286 -10114 -1773 -13426 17500 10828 51157 50762 42243 6462 42301
20008 42301 85703 133225 109251 66650 58746 34483 33178 73727 72452 44496 73786 89160
$$ packed form
20094a9524K1792K6264k863l9928n967K170p98M6502P871j554j5459l9750K2508
20081A264M4120j2149J7856l0640J6980j5220j0836o886L3568K1516P124n5103
20069A1594l5093P3925L2121p760l8128p6657N5567R36o704o913P2680N5481m19
20056A30630m0207k6356j2642k0539L4419M5016j0582k5941l6573l2876K2030
20045B6379M0605J6383r580k2731l0151L4331L1192O99J2055k7500j3992M4690
20033A02380p4501j7776j3288j6504m6735N0136M8849k0858K1678j1826L928j7658
20021G825l875K5144p808l1400Q341j1653L0926o672M0329l95q519l5781L5839
20008D2301M3402M7522k3974m2601p904k4263j305M0549j275k7956K9290J5374
$$ plain form
19996 89160 82702 3211 59998 91077 102433 86861 74569 55006 54313 49787 53842 53169 5418
19983 5418 -13772 -32724 -76260 -13333 46026 17766 -29437 29302 129718 107687 94240 86720
19971 86720 55566 47396 56669 66060 8027 -60978 -67977 13883 7254 7725 -32435 20947 72623
19958 72623 51864 71535 69336 86261 123034 124349 142557 117463 59667 -2905 35011 54040
19946 54040 48206 26969 28492 82079 79931 84090 30510 19562 -268 -4268 36338 76401 121315
19933 121315 114485 48246 -16103 1759 27470 22439 61336 51637 39678 -1134 12158 65048
19921 65048 88142 74703 53701 45262 52657 79659 67318 61279 11764 17725 23552 40178 41196
19908 41196 34586 33154 69869 81117 47568 9228 21307 1314 2449 11568 40502 53484
$$ packed form
19996H9160o458p9491N6787L1079J1356j5572j2292j9563o93m526M055o73m7751
19983E418j9190j8952m3536O2927N9359k8260m7203N8739J00416k2031j3447p520
19971H6720l1154q170R273R391n8033o9005o999Q1860o629M71m0160N3382N1676
19958G2623k0759J9671k199J6925L6773J315J8208k5094n7796o2572L7916J9029
19946E4040n834k1237J523N3587k148M159n3580j0948j9830m000M0606M0063M4914
19933A21315o830o6239o4349J7862K5711n031L8897r699j1959m0812J3292N2890
19921F5048K3094j3439k1002q439P395K7002j2341o039m9515N961N827J6626J018
19908D1196o610j432L6715J1248l3549l8340J2079j9993J135R119K8934J2982
$$ plain form
19896 53484 12160 57053 50171 13422 -26263 -34400 -13959 1002 20607 36426 19166 -3692
19884 -3692 -14794 4961 15376 8778 37658 -2059 -32347 -8118 15687 74671 144512 163894
19872 163894 112144 114565 101558 31223 39561 46704 50796 33264 78089 127164 121657 113064 128841
19859 128841 84639 -5930 -38 23443 92348 84845 38058 112140 152080 174357 226703 191023
19847 191023 129814 139857 141136 92524 99457 101341 118071 119320 96237 59088 44485 49982
19835 49982 51010 61081 58482 59893 77937 55283 48713 56853 71986 95966 49027 39935 14093
19822 14093 -8261 -26152 -27519 2584 21629 17837 40681 47520 69499 42182 67671 42612
19810 42612 30132 78171 81343 95894 111373 57237 24414 24419 44089 97591 86821 30308 57606
$$ packed form
19896E3484m1324M4893o882l6749l9685q137K0441J4961J9605J5819j7260k2858
19884c692j1102J9755J0415o598K8880l9717l0288K4229K3805N8984O9841J9382
19872A63894n1750K421j3007p0335Q338P143M092j7532M4825M9075n507q593J5777
19859A28841m4202r0569N892K3481O8905p503m6787P4082L9940K2277N2346l5680
19847A91023o1209J0043J279m8612O933J884J6730J249k3083l7149j4603N497
19835D9982J028J0071k599J411J8044k2654o570Q140J5133K3980m6939r092k5842
19822A4093k2354j7891j367L0103J9045l792K2844O839K1979k7317K5489k5059
19810D2612j2480M8039L172J4551J5479n4136l2823NJ9670N3502j0770n6513K7298
$$ plain form
19797 57606 83174 74699 31656 10288 69832 88143 113251 124185 161543 196452 141612 89197
19785 89197 151594 105787 65372 36946 1153 -78870 -58891 43303 14937 15989 71492 56425
19773 56425 15298 -53638 -58641 -67391 -35327 31492 61352 77676 74353 93871 80486 71157
19761 71157 44308 8188 -19001 46839 7749 -41003 -9002 -50351 -46994 39772 75758 69954
19749 69954 78325 111269 59861 85189 100158 59582 13483 -70 24246 24283 52864 82368
19737 82368 107173 78157 45893 7946 -25631 6067 33017 19231 5524 2701 12166 57396
19725 57396 39148 37349 39940 54488 85278 100551 109704 41167 6005 65750 113081 102782
19713 102782 19007 3375 33865 53564 68863 119175 99870 108170 153145 126861 103224 142031
$$ packed form
19797E7606K5568q475m3043k1368N9544J8311K5108J0934L7358L4909n4840n2415
19785H9197O2397m5807m0415k8426l5793q0023J9979J02194k8366J052N5503j5067
19773E6425m1127o8936n003q750L2064O6819K9860J6324l323J9518j3385r329
19761G1157k6849l6120k7189O5840l9090m8752L2001m1349L357Q6766L5986n804
19749F9954Q371L2944n1408K5328J4969m0576m6099j3553K4316L7K8581K9504
19737H2368K4805k9016l2264l7947l3577L1698K6950j3786j3707k823R465M5230
19725E7396j8248j799K591J4548L0790J5273R153o8537l5162N9745M7331j0299
19713A02782q3775j5632L0490J9699J5299N0312j9305Q300M4975k6284k3637L8807
$$ plain form
19701 142031 160902 133089 99993 74648 56803 84411 89126 70415 70260 100851 108655 94462
19689 94462 64445 55744 105833 92973 78743 102306 122871 87945 61207 80582 60316 49060
19677 49060 79782 161540 209380 233739 173491 94930 109864 57689 -23078 -15216 17479 -31727
19665 -31727 -25296 20231 66011 96001 119255 60357 61253 61694 32710 70935 40670 38174 73527
19652 73527 76471 124386 142331 104880 112856 142091 152426 200792 185720 197109 209704 183643
19640 183643 192730 210960 217626 175212 163352 188137 220356 246945 225216 209801 255199 312201
19628 312201 380260 429336 427629 446759 491369 565096 635259 610114 554720 562895 553906 564404
19616 564404 591993 561623 521606 478373 433721 389764 352609 421949 513169 511561 457954 364506
$$ packed form
19701A42031J8871k7813l3096k5345j7845K7608M715j8711j55L0591P804j4193
19689I4462l0017q701N0089j2860j4230K3563K0565l4926k6738J9375k0266j1256
19677D9060L0722Q1758M7840K4359o0248p8561J4934n2175q0767P862L2695m9206
19665c1727O431M5527M5780K9990K3254n8898Q96M41k8984L8225l0265k496L5353
19652G3527K944M7915J7945l7451P976K9235J0335M8366j5072J1389J2595k6061
19640A83643R087J8230O666m2414j1860K4785L2219K6589k1729j5415M5398N7002
19628C12201O8059M9076j707J9130M4610P3727P0163k5145n5394Q175q989J0498
19616E64404K7589l0370m0017m3233m4652m3957l7155O9340R1220j608n3607r3448
$$ plain form
19604 364506 282912 258411 275606 286643 306338 307539 415285 511358 586687 589334 547765 579929
19592 579929 612830 606578 592439 562546 519011 477240 445210 404065 413597 389402 439192 538611
19580 538611 663719 769040 870710 955467 1003127 1001269 900892 847197 850979 788133 814786
19569 814786 927888 1003959 1064146 1046964 1012780 997619 940924 873265 775415 633633 508105
19558 508105 463706 445350 410278 406906 390611 357836 335791 316561 329328 387618 462852 472319
19546 472319 458160 445868 438233 436704 400759 396811 457244 495294 512568 567061 570630 535503
19534 535503 545492 559383 568990 514656 417793 354017 339181 337577 277399 266921 262693 224179
19522 224179 139539 144920 190619 191158 176590 145251 161839 221125 234387 224173 190436 165155
$$ packed form
19604C64506q1594k4501J7195J1037J9695J201J07746R6073P5329K647m1569L2164
19592E79929L2901o252j4139k9893m3535m1771l2030m1145R532k4195M9790R9419
19580E38611J25108J05321J01670Q4757M7660j858j00377n3695L782o2846K6653
19569H14786J13102P6071O0187j7182l4184j5161n6695o7659r7850j41782j25528
19558E08105m4399j8356l5072l372j6295l2775k2045j9230J2767N8290P5234R467
19546D72319j4159j2292p635j529l5945l948O0433L8050J7274N4493L569l5127
19534E35503R989J3891R607n4334r6863o3776j4836j604o0178j0478m228l8514
19522B24179q4640N381M5699N39j4568l1339J6588N9286J3262j0214l3737k5281
$$ plain form
19510 165155 155759 191289 212330 206412 218304 199884 212671 166719 101087 87806 132649 193323
19498 193323 197915 141565 92135 145171 148990 138833 115296 126850 144066 142718 120189 108761
19486 108761 111104 175661 206134 152033 112611 99292 75544 98613 130762 118101 119830 149579
19474 149579 193319 158585 106806 112477 184658 191891 181960 163108 207842 189551 164374 190937
19462 190937 196329 140395 127229 151887 143752 124735 104949 72702 24432 41284 100718 188082
19450 188082 221812 186949 144464 135466 118935 136411 114153 141943 191118 174813 182046 123150
19438 123150 92972 66704 95958 105513 98314 112068 141253 173227 156323 130550 122152 119216
19426 119216 139683 192588 255664 268423 258261 273811 294747 290635 313852 335209 353640 286040
$$ packed form
19510A65155r396L5530K1041n918J1892j8420J2787m5952o5632j3281M4843O0674
19498A93323M592n6350m9430N3036L819j0157k3537J1554J7216j348k2529j1428
19486A08761K343O4557L0473n4101l9422j3319k3748K3069L2149j2661J729K9749
19474A49579M3740l4734n1779N671P2181P233r931j8852M4734j8291k5177K6563
19462A90937N392n5934j3166K4658q135j9017j9786l2247m8270J6852N9434Q7364
19450A88082L3730l4863m2485q998j6531J7476k2258K7790M9175j6305P233n8896
19438A23150l0178k6268K9254R555p199J3754K9185L1974j6904k5773q398k936
19426A19216K0467N2905O3076J2759j0162J5550K0936m112K3217K1357J8431o7600
$$ plain form
19414 286040 255846 239414 229939 220690 185177 106621 100642 102103 134068 153401 147044 109688
19402 109688 104179 120061 189202 206844 200338 236407 229608 200332 194338 186788 216374 222174 197133
19389 197133 157994 185584 185827 144598 154538 235112 287105 254769 253478 308823 286040 237370
19377 237370 227160 211382 170660 206997 253686 254111 242372 259802 281429 263628 252566 257827
19365 257827 268441 271280 292351 315360 312468 292397 280898 266158 250949 241284 229849 256090
19353 256090 273605 256052 256853 264648 279083 207402 137287 166566 244743 255023 257238 230878
19341 230878 290198 332193 353731 404565 343870 294167 264369 252039 265308 276001 308783
19330 308783 334937 361841 391622 412751 406637 346680 266562 245883 256361 270212 290131 246302
$$ packed form
19414B86040l0194j6432r475r249l5513p8556n979J461L1965J9333o357l7356
19402A09688n509J5882O9141J7642o506L6069o799k9276n994p550K9586N800k5041
19389A97133l9139K7590K43m1229R940Q0574N1993l2336j291N5345k2783m8670
19377B37370j0210j5778m0722L6337M6689M25j1739J7430K1627j7801j1062N261
19365B57827J0614K839K1071K3009k892k0071j1499j4740j5209r665j1435K6241
19353B56090J7515j7553Q01P795J4435p1681p0115K9279P8177J0280K215k6360
19341B30878N9320M1995K1538N0834o0695m9703k9798j2330J3269J0693L2782
19330C08783K6154K6904K9781K1129o114n9957q0118k0679J0478J3851J9919m3829
$$ plain form
19318 246302 228265 239149 270097 264624 264881 247533 260206 245948 202983 217094 298292 343372
19306 343372 306997 278985 248480 270098 235309 169473 145756 159959 221451 270402 280450
19295 280450 227646 217356 220959 242411 292832 327229 321310 345425 304716 297750 327642 367274
19283 367274 329761 311832 294234 289826 299959 309227 254807 253500 263948 275069 257868 281571
19271 281571 247346 246257 218129 234269 259999 224468 264011 343810 331859 323527 328866 345590
19259 345590 337100 370796 314463 315223 365705 390305 346824 349804 339641 368983 343094 361208
19247 361208 375506 415178 426837 453367 468035 539635 545919 539287 552587 612405 635077 605590
19235 605590 557446 520574 546984 557950 583533 565802 485274 437722 453944 491512 489447 502384
$$ packed form
19318B46302j8037J0884L0948n473K57j7348J2673j4258m2965J4111Q1198M5080
19306C43372l6375k8012l0505K1618l4789o5836k3717J4203O1492M8951J0048
19295B80450n2804j0290L603K1452N0421L4397n919K4115m0709o966K9892L9632
19283C67274l7513j7929j7598m408J0133R268n4420j307J0448J1121j7201K3703
19271B81571l4225j089k8128J6140K5730l5531L9543P9799j1951q332N339J6724
19259C45590q490L3696n6333P60N0482K4600m3481K980j0163K9342k5889J8114
19247C61208J4298L9672J1659K6530J4668P1600O284o632J3300N9818K2672k9487
19235F05590m8144l6872K6410J0966K5583j7731q0528m7552J6222L7568k065J2937
$$ plain form
19223 502384 466515 463130 488097 551375 607630 667606 730287 797091 801503 738371 678043 669091
19211 669091 642763 645887 645907 641741 636079 676746 706326 681770 674691 738815 732040 744150 756415
19198 756415 737816 720334 699072 711436 809975 856103 872446 883125 872394 878197 929193 966367
19186 966367 944785 971383 1007640 1016149 1067435 1163480 1197766 1253680 1325991 1341269 1326944 1374104
19174 1374104 1428129 1499669 1627359 1745675 1905006 2141436 2321933 2440257 2519180 2480860
19164 2480860 2295508 2170327 2116289 2130331 2187027 2189641 2250376 2330835 2402722 2509846 2645176
19153 2645176 2793704 2917914 3008988 3177092 3414286 3635861 3884660 4245229 4638295 4967161
19143 4967161 5377873 5857548 6387649 6992914 7806742 8906148 10350283 12172159 14051166
$$ packed form
19223E02384l5869l385K4967O3278N6255N9976O2681O6804M412o3132o0328q952
19211F69091k6328L124K0m166n662M0667K9580k4556p079O4124o775J2110J2265
19198G56415j8599j7482k1262J2364R8539M6128J6343J0679j0731N803N0996L7174
19186I66367k1582K6598L6257Q509N1286R6045L4286N5914P2311J5278j4325M7160
19174A374104N4025P1540J27690J18316J59331K36430J80497J18324P8923l8320
19164B480860j85352j25181n4038J4042N6696K614O0735Q0459P1887J07124J35330
19153B645176J48528J24210R1074J68104K37194K21575K48799L60569L93066L28866
19143D967161M10712M79675N30101O05265Q13828J099406J444135J821876J879007
$$ plain form
19134 14051166 15445985 15940215 15445285 14710860 14313230 14332455 14632264 15242647 15990146
19125 15990146 16929805 18039270 19443591 21217205 23623979 26838135 31195268 37012461
19117 37012461 45124957 55295330 65515305 74795261 79860769 81784077 86282619 92545524
19109 92545524 96183683 90464961 80271759 75462136 77384073 81258719 84111981 81321109
19101 81321109 71144509 61934319 56925785 54805868 54631040 57369567 64219936 75967399
19093 75967399 92119355 110932027 126680216 134960499 135199544 128012732 118257923 107930144
19085 107930144 95648278 83288639 74516777 70136033 69830493 73982445 83377817 96076589
19077 96076589 108099584 114582834 110903900 101496945 94654561 91703561 90100383 90514420
$$ packed form
19134A4051166J394819M94230m94930p34425l97630J9225K99809O10383P47499
19125A5990146R39659J109465J404321J773614K406774L214156M357133N817193
19117C7012461Q112496J0170373J0219975R279956N065508J923308M498542O262905
19109I2545524L638159n718722j0193202m809623J921937L874646K853262k790872
19101H1321109j0176600r210190n008534k119917j74828K738527O850369J1747463
19093G5967399J6151956J8812672J5748189Q280283K39045p186812r754809j0327779
19085A07930144j2281866j2359639q771862m380744l05540M151952R395372J2698772
19077I6076589J2022995O483250l678934r406955o842384k951000j603178M14037
$$ plain form
19069 90514420 94882726 102938168 112478585 121004322 122707645 111064561 95015873 83920586
19061 83920586 78035984 75408100 76981059 84238883 95780893 110102580 122693571 131072452
19053 131072452 139407345 144975857 145744588 134219015 110402930 88402876 73891491
19046 73891491 64450246 57775179 54323849 54860221 59485705 67087178 75559730 80920566
19038 80920566 80587630 77002904 76350190 81581489 90314132 97728134 99078697 94216626
19030 94216626 87707302 84064955 81685557 75750811 64641730 52487522 42495580 34260385
19022 34260385 27376239 22065842 18122839 15121027 12835213 11214981 10074907 9338704
19014 9338704 8930767 8994482 9628964 10627142 11751919 12639472 12622828 11891519 10776397
$$ packed form
19069I0514420M368306Q055442R540417Q525737J703323j1643084j6048688j1095287
19061H3920586n884602k627884J572959P257824J1542010J4321687J2590991Q378881
19053A31072452Q334893N568512P68731j1525573k3816085k2000054j4511385
19046G3891491r441245o675067l451330N36372M625484P601473Q472552N360836
19038H0920566l32936l584726o52714N231299Q732643P414002J350563m862071
19030I4216626o509324l642347k379398n934746j1109081j2154208r991942q235195
19022C4260385o884146n310397l943003l001812k285814j620232j140074p36203
19014I338704m07937O3715O34482R98178J124777Q87553j6644p31309j115122
$$ plain form
19005 10776397 9119011 7511926 6221472 5257624 4387182 3643477 3069237 2603530 2249343
18996 2249343 2005600 1845116 1692385 1589310 1447147 1375537 1349646 1336999 1303123 1267032
18986 1267032 1145764 1083026 1085243 1096248 1088145 1119885 1156353 1272864 1436597 1657416 1807610
18975 1807610 1816205 1744024 1662109 1569484 1376752 1138446 1014166 864558 777486 761669 723359
18964 723359 700728 683916 654351 616858 587948 557527 497453 422843 392855 453425 456451 400738
18952 400738 409075 438238 485730 508045 419112 382580 401187 417007 349789 333142 371817 380273
18940 380273 357957 351535 347174 350774 352561 393892 344985 335580 348206 330074 420384 443881
18928 443881 376104 428057 459681 381983 352631 327427 387591 376597 347613 363587 364462 319001
$$ packed form
19005A0776397j657386j607085j290454r63848q70442p43705n74240m65707l54187
18996B249343k43743j60484j52731j03075j42163p1610k5891j2647l3876l6091
18986A267032j21268o2738K217J1005q103L1740L6468J16511J63733K20819J50194
18975A807610Q595p2181q1915r2625j92732k38306j24280j49608q7072j5817l8310
18964G23359k2631j6812k9565l7493k8910l0421o0074p4610k9988O0570L026n5713
18952D00738Q337K9163M7492K2315q8933l6532J8607J5820o7218j6647L8675Q456
18940C80273k2316o422m361L600J787M1331m8907r405J2626j8132R0310K3497
18928D43881o7777N1953L1624p7698k9352k5204O0164j0994k8984J5974Q75m5461
$$ plain form
18916 319001 314100 305125 315311 372411 394051 434603 404942 363218 331675 344795 371019 370693
18904 370693 363437 418385 455560 474076 490398 533538 515634 504447 553152 648606 798632
18893 798632 910198 1011930 1098582 1180940 1275403 1369702 1455827 1535378 1634304 1716130 1755993
18882 1755993 1729605 1643793 1449108 1277152 1233717 1167087 1089104 973211 821577 639049
18872 639049 507116 467990 425848 367659 339305 380221 407991 414400 379394 352900 356534 390588
18860 390588 365804 303155 320178 341249 381385 462333 548415 598911 737705 825049 846476
18849 846476 858667 920735 984961 977482 996052 1056560 1083285 1118896 1082219 1026429 964066 892582
18837 892582 781541 699487 643818 571098 487433 443189 379992 310806 318092 346261 358118
$$ packed form
18916C19001m901q975J0186N7100K1640M0552k9661m1724l1543J3120K6224l26
18904C70693p256N4948L7175J8516J6322M3140j7904j1187M8705R5454J50026
18893G98632J11566J01732Q6652Q2358R4463R4299Q6125P9551R8926Q1826L9863
18882A755993k6388q5812j94685j71956m3435o6630p7983j15893j51634j82528
18872F39049j31933l9126m2142n8189k8354M0916K7770O409l5006k6494L634L4054
18860C90588k4784o2649J7023K1071M0136Q0948Q6082N0496J38794Q7344K1427
18849H46476J2191O2068O4226p479J8570O0508K6725L5611l6677n5790o2363p1484
18837H92582j11041q2054n5669p2720q3665m4244o3197o9186P286K8169J1857
$$ plain form
18826 358118 332721 296804 234339 214297 180555 216008 189196 220021 249177 255774 281899 285185
18814 285185 290917 302987 309396 332182 369796 445790 450088 462315 514003 611245 693423 684351
18802 684351 724945 760294 789856 800989 781410 784950 770347 763211 806971 858847 824849 809617
18790 809617 770493 709270 608191 492976 395642 309803 283692 320750 317990 264538 185054
18779 185054 172096 218757 231016 266004 222345 250902 307107 321974 281942 225275 179636
18768 179636 258659 363201 470374 497152 516847 445712 327397 271844 280398 310398 267179
18757 267179 236611 309798 327886 266218 239773 286391 303615 267855 289466 347343 422435
18746 422435 453801 422531 376660 284235 242750 173833 145001 129722 106047 134904 168624
$$ packed form
18826C58118k5397l5917o2465k0042l3742L5453k6812L0825K9156O597K6125L286
18814B85185N732J2070O409K2786L7614P5994M298J2227N1688R7242Q2178r072
18802F84351M0594L5349K9562J1133j9579L540j4603p136M3760N1876l3998j5232
18790H09617l9124o1223j01079j15215r7334q5839k6111L7058k760n3452p9484
18779A85054j2958M6661J2259L4988m3659K8557N6205J4867m0032n6667m5639
18768A79636P9023J04542J07173K6778J9695p1135j18315n5553Q554L0000m3219
18757B67179l0568P3187J8088o1668k6445M6618J7224l5760K1611N7877P5092
18746D22435L1366l1270m5871r2425m1485o8917k8832j5279k3675K8857L3720
$$ plain form
18735 168624 211631 158984 48713 67243 101439 114089 117790 142282 141221 190677 167866 152787
18723 152787 146127 163870 129299 92206 90333 86584 140149 78670 62470 151306 159507 99372
18711 99372 109249 152212 165938 116065 118332 88812 25995 73044 124391 143681 147651 178775
18699 178775 193333 158592 139769 144951 128151 124243 131252 109645 108062 103166 132192 237872
18687 237872 202351 192808 185234 98561 87921 131774 152255 168553 149758 143754 132762 114760
18675 114760 93920 103161 169983 208197 198542 236855 212078 193728 203545 211723 189732 160617
18663 160617 157657 172788 173964 165015 92876 71717 166055 161944 141270 146429 173231 205546
18651 205546 220250 175674 197328 168109 150588 169336 181107 182803 225163 257017 231806 201930
$$ packed form
18735A68624M3007n2647j10271J8530L4196J2650L701K4492j061M9456k2811j5079
18723A52787o660J7743l4571l7093j873l749N3565o1479j6200Q8836Q201o0135
18711I9372R877M2963J3726m9873K267k9520o2817M7049N1347J9290L970L1124
18699A78775J4558l4741j8823N182j6800l908P009k1607j583m896K9026J05680
18687B37872l5521r543p574q6673j0640M3853K0481J6298j8795o004j0992j8002
18675A14760k0840R241O6822L8214r655L8313k4777j8350R817Q178k1991k9115
18663A60617k960J5131J176q949p2139k1159R4338m111k0674N159K6802L2315
18651B05546J4704m4576K1654k9219j7521J8748J1771J696M2360L1854k5211k9876
$$ plain form
18639 201930 176291 148779 135977 145459 152167 222848 225938 193699 212203 254874 335018 370471
18627 370471 318843 253430 251392 281538 372817 397136 331393 338237 395619 436879 479287 432505
18615 432505 441193 457474 459199 413186 432193 519490 533329 544796 529302 532457 515591 553504
18603 553504 540147 470914 449263 459312 459366 527077 609263 666315 696953 733396 792805 801696
18591 801696 775651 655888 598262 594704 682499 811839 889105 923345 958675 961354 892654
18580 892654 833958 829657 780085 689415 645315 593582 553913 627492 790582 900900 973421
18569 973421 1032351 1091619 1094590 1134104 1078975 986656 977274 985184 962576 939414 903324 844687
18557 844687 812158 807140 849996 914205 955490 914668 910782 875306 792623 774868 730068 723162
$$ packed form
18639B01930k5639k7512j2802R482O708P0681L090l2239J8504M2671Q0144L5453
18627C70471n1628o5413k038L0146R1279K4319o5743O844N7382M1260M2408m6782
18615D32505Q688J6281J725m6013J9007Q7297J3839J1467j5494L155j6866L7913
18603E53504j3357o9233k1651J0049N4O7711Q2186N7052L0638L6443N9409Q891
18591H01696k6045j19763n7626l558Q7795J29340P7266L4240L5330K679o8700
18580H92654n8696m301m9572r0670m4100n1733l9669P3579J63090J10318P2521
18569I73421N8930N9268K971L9514n5129r2319r382P910k2608k3162l6090n8637
18557H44687l2529n018M2856O4209M1285m0822l886l5476q2683j7755m4800o906
$$ plain form
18545 723162 698988 716253 796923 943081 1116699 1283551 1328389 1253622 1194400 1135168 1154331
18534 1154331 1149571 1157555 1140405 1087540 1099305 1085612 1010970 959730 973936 1008875 1037836 1033735
18522 1033735 976602 942939 907720 873318 801399 759681 772512 735946 654991 595008 513208
18511 513208 437693 428468 381170 340590 351935 400765 391915 385951 394792 363372 341213 297512
18499 297512 330322 370076 395348 415564 398720 414785 433573 470796 462231 468088 457963 426936
18487 426936 503116 529571 537365 598112 657277 678814 711483 710636 723293 653418 618794 626464
18475 626464 648262 714455 777878 813776 832895 767423 735029 710330 760799 733976 689767
18464 689767 708032 756114 827891 837543 821547 838289 838974 882100 921919 941937 993933 1039061
$$ packed form
18545G23162k4174J7265Q0670J46158J73618J66852M4838p4767n9222n9232J9163
18534A154331m760P984j7150n2865J1765j3693p4642n1240J4206L4939K8961m101
18522A033735n7133l3663l5219l4402p1919m1718J2831l6566q0955n9983q1800
18511E13208p5515r225m7298m0580J1345M8830q850n964Q841l1420k2159m3701
18499B97512L2810L9754K5272K0216j6844J6065J8788L7223q565N857j0125l1027
18487D26936P6180K6455P794O0747N9165K1537L2669q47J2657o9875l4624P670
18475F26464K1798O6193O3423L5898J9119o5472l2394k4699N0469k6823m4209
18464F89767J8265M8082P1777R652j5996J6742O85M3126L9819K0018N1996M5128
$$ plain form
18452 1039061 1053247 1054812 1081362 1142619 1194826 1187019 1240320 1349551 1466295 1582333 1648929
18441 1648929 1719854 1743339 1730281 1724656 1748873 1798365 1832623 1841567 1916091 2010840 2051331 2102269
18429 2102269 2159833 2227492 2344507 2443330 2578362 2677821 2769474 2865692 2937515 3040866 3186612
18418 3186612 3344498 3563904 3828418 4187003 4486309 4821852 5101816 5325871 5594495
18409 5594495 5792155 6092970 6631594 7323386 8418626 10118885 12666604 16183660 19856163
18400 19856163 22785850 23314640 20693737 17881562 16409507 16089187 16568888 18144314
18392 18144314 21376195 26785784 32889811 37802889 38642610 33172436 26402025 21821495
18384 21821495 18967744 16593628 14637607 13389291 12689949 12395204 12347216 12410970 12398114
$$ packed form
18452A039061J4186J565K6550O1257N2207p807N3301J09231J16744J16038O6596
18441A648929P0925K3485j3058n625K4217M9492L4258Q944P4524R4749M0491N0938
18429B102269N7564O7659J17015R8823J35032R9459R1653R6218P1823J03351J45746
18418C186612J57886K19406K64514L58585K99306L35543K79964K24055K68624
18409E594495J97660L00815N38624O91792J095240J700259K547719L517056L672503
18400A9856163K929687N28790k620903k812175j472055l20320M79701J575426
18392A8144314L231881N409589O104027M913078Q39721n470174o770411m580530
18384B1821495k853751k374116j956021j248316o99342k94745m7988O3754j2856
$$ plain form
18375 12398114 12471327 12785821 13273343 13958756 14856006 16018772 17358107 18835551 20429284
18366 20429284 22142684 23937063 25728525 27750372 30438701 34365540 40114886 48424613
18358 48424613 61015837 79240856 99294801 116037620 121793080 109820597 93085318
18351 93085318 82517279 78108514 77339285 81153005 90261403 101317418 110964146 113697725
18343 113697725 107698666 102203036 102030063 105218316 110834201 119632454 129658510 135552215
18335 135552215 133941859 128177209 117294005 102669804 90510633 82810791 78367027
18328 78367027 76182802 76213485 78354414 82405386 88555198 97045069 108094523 122227640
18320 122227640 141389080 167909200 203849753 245672425 283900314 309574742 314631410
$$ packed form
18375A2398114P3213L14494M87522O85413Q97250J162766J339335J477444J593733
18366B0429284J713400J794379J791462K021847K688329L926839N749346Q309727
18358D8424613J2591224J8225019K0053945J6742819N755460j1972483j6735279
18351I3085318j0568039m408765p69229L813720R108398J1056015R646728K733579
18343A13697725n999059n495630j72973L188253N615885Q798253J0026056N893705
18335A35552215j610356n764650j0883204j4624201j2159171p699842m443764
18328G8367027k184225L0683K140929M050972O149812Q489871J1049454J4133117
18320A22227640J9161440K6520120L5940553M1822672L8227889K5674428N056668
$$ plain form
18313 314631410 303969183 291573828 286505962 289487451 298103666 302843698 297632584 283901907
18305 283901907 262499583 239880416 223998404 214013377 204928862 195380836 186368097
18298 186368097 180156743 176623939 171957660 157240086 135852335 119518785 111125073
18291 111125073 107390208 105008417 104027435 102886216 97700213 90196225 82837502 74341368
18283 74341368 66482767 62588715 63860274 69443230 77248031 85313532 88146712 83598624
18275 83598624 75490550 63619336 50544602 39785982 31861358 25699198 20848130 17207655
18267 17207655 14546550 12550645 11055534 9926345 9038637 8351798 7814420 7392264 7166103
18258 7166103 7065280 7006524 7102811 7269831 7549896 7814741 8167977 8714428 9515800 10675568
$$ packed form
18313C14631410j0662227j2395355n067866K981489Q616215M740032n211114j3730677
18305B83901907k1402324k2619167j5882012r985027r084515r548026r012739
18298A86368097o211354l532804m666279j4717574k1387751j6333550q393712
18291A11125073l734865k381791r80982j141219n186003p503988p358723q496134
18283G4341368p858601l894052J271559N582956P804801Q065501K833180m548088
18275H3598624q108074j1871214j3074734j0758620p924624o162160m851068l640475
18267A7207655k661105j995905j495111j129189q87708o86839n37378m22156k26161
18258G166103j00823n8756R6287J67020K80065K64845L53236N46451Q01372J159768
$$ plain form
18248 10675568 12538734 15514346 19244539 23103361 26087439 26667268 25712791 23891616
18240 23891616 20593456 17085577 14609668 13358899 13056965 13687153 14871878 16311152
18232 16311152 16909713 16099990 14557010 12261309 9673899 7627102 6168292 5075126
18224 5075126 4134827 3450684 2975812 2682448 2405210 2186927 1998157 1817770 1691430
18215 1691430 1545442 1481477 1429334 1422136 1350782 1254414 1226126 1199534 1087314 1117265 1134935
18204 1134935 1075859 1049760 978003 895645 809913 779266 747041 682932 634541 644355 650519 688779
18192 688779 676162 682800 703985 705168 723927 729404 745064 678638 622152 607086 621680 608167
18180 608167 625430 637937 624329 591820 542336 538133 543363 517935 493418 549706 592702 557191
$$ packed form
18248A0675568J863166K975612L730193L858822K984078N79829r54477j821175
18240B3891616l298160l507879k475909j250769l01934O30188J184725J439274
18232A6311152N98561q09723j542980k295701k587410k046797j458810j093166
18224E075126r40299o84143m74872k93364k77238k18283j88770j80387j26340
18215A691430j45988o3965n2143p198p1354r6368k8288k6592j12220K9951J7670
18204A134935n9076k6099p1757q2358q5732l0647l2225o4109m8391R814O164L8260
18192F88779j2617O638K1185J183J8759N477J5660o6426n6486j5066J4594j3513
18180F08167J7263J2507j3608l2509m9484m203N230k5428k4517N6288M2996l5511
$$ plain form
18168 557191 565522 530615 531201 549248 583016 584284 592011 599591 600569 593270 669088 667063 599393
18155 599393 644314 679658 700583 705295 719240 775773 800908 842560 905363 978885 1027703 1029765
18143 1029765 1069793 1156113 1239037 1356609 1515339 1686818 1790573 1914204 2027578 2203333
18133 2203333 2330165 2452052 2604895 2824558 3028222 3228630 3435821 3648456 3977814
18124 3977814 4373957 4832719 5388269 6062801 6918796 7816234 8713090 9535437 10255936
18115 10255936 11054625 12316968 14444912 17852835 23248597 32212353 47192858 63976121
18107 63976121 78198661 82822913 67734031 48487780 36077456 28551623 21937434
18100 21937434 16227445 12082056 9113559 7005391 5462467 4342477 3522438 2927649
$$ packed form
18168E57191Q331l4907N86J8047L3768J268P727P580R78p299P5818k025o7670
18155E99393M4921L5344K0925M712J3945N6533K5135M1652O2803P3522M8818K062
18143A029765M0028Q6320Q2924J17572J58730J71479J03755J23631J13374J75755
18133B203333J26832J21887J52843K19663K03664K00408K07191K12635L29358
18124C977814L96143M58762N55550O74532Q55995Q97438Q96856Q22347P20499
18115A0255936P98689J262343K127944L407923N395762Q963756J4980505J6783263
18107F3976121J4222540M624252j5088882j9246251j2410324p525833o614189
18100B1937434n709989m145389k968497k108168j542924j119990q20039n94789
$$ plain form
18092 2927649 2445086 2017156 1686006 1461014 1253237 1071027 913656 798030 754666 735606
18082 735606 723564 682997 550256 428135 392947 381354 325161 282726 294249 299519 272004
18071 272004 231654 221872 213980 194963 162107 162799 161493 184529 159560 120026 93992 137606
18059 137606 122127 107731 102139 66019 100861 108993 81486 57890 78807 139125 141480 114332
18047 114332 101318 84996 31041 61698 85863 85302 74045 42946 12809 -25822 -75445 -100866
18035 -100866 -120046 -88815 -62792 -42699 -34896 -55569 -112650 -78162 -58667 -47134 -31169 18355
18023 18355 40966 25686 49928 54983 77365 72794 -492 665 -2544 -50619 -76769 -25737
18011 -25737 -25770 -83769 -96959 -57502 -56374 -74742 -85072 -123592 -227863 -254632 -240893 -230541
$$ packed form
18092B927649m82563m27930l31150k24992k07777j82210j57371j15626m3364j9060
18082G35606j2042m0567j32741j22121l5188j1593n6193m2435J1523N270k7515
18071B72004m0350r782p892j9017l2856O92j306K3036k4969l9534k6034M3614
18059A37606j5479j4396n592l6120L4842Q132k7507k3596K0917O0318K355k7148
18047A14332j3014j6322n3955L0657K4165n61j1257l1099l0137l8631m9623k5421
18035a00866j9180L1231K6023K0093P803k0673n7081L4488J9495J1533J5965M9524
18023A8355K2611j5280K4242N055K2382m571p3286J157l209m8075k6150N1032
18011b5737l3n7999j3190L9457J128j8368j0330l8520j04271k6769J3739J0352
$$ plain form
17999 -230541 -233517 -210286 -157775 -96464 -87746 -38830 -45215 -95798 -97353 -104500 -124445 -180489
17987 -180489 -177537 -124293 -126249 -114677 -77363 -86962 -83404 -62686 -38672 -41318 -31540 -33245 -61656
17974 -61656 -25158 34360 10634 -20644 -52425 -40840 -29150 -58419 -95644 -72685 -44897 -48886
17962 -48886 -34727 2944 59471 24175 -52092 -90219 -92441 -105003 -124566 -82402 -64911 -46560
17950 -46560 -74249 -89722 -60956 -34281 -15751 -45181 -62291 -28358 -32435 -93160 -87695 -55544
17938 -55544 -47154 -39966 -19481 -8379 -20119 -24287 -16573 3265 1889 27262 54937 15165 -14205
17925 -14205 -45580 -9573 80157 107883 51243 20495 -4260 16228 -19751 -60142 -23803 33376
17913 33376 65439 88803 89546 27389 -31835 -22214 -24560 -90968 -63802 -57605 -55967 -27889 -10167
$$ packed form
17999b30541k976K3231N2511O1311Q718M8916o385n0583j555p147j9945n6044
17987a80489K952N3244j956J1572L7314r599L558K0718K4014k646R778j705k8411
17974f1656L6498N9518k3726l1278l1781J1585J1690k9269l7225K2959K7788l989
17962d8886J4159L7671N6527l5296p6267l8127k222j2562j9563M2164J7491J8351
17950d6560k7689j5473K8766K6675J8530k9430j7110L3933m077o0725N465L2151
17938e5544Q390P188K0485J1102j1740m168P714J9838j376K5373K7675l9772k9370
17925a4205l1375L6007Q9730K7726n6640l0748k4755K0488l5979m0391L6339N7179
17913C3376L2063K3364P43o2157n9224R621k346o6408K7166O197J638K8078J7722
$$ plain form
17900 -10167 39147 47801 -18863 -69820 -34063 -7627 13642 -8417 -10238 6206 27789 52919
17888 52919 83386 99145 39349 28853 91769 177594 252691 329625 410646 406873 352675 311702
17876 311702 302113 302461 309000 335779 378461 398984 311646 211379 187423 184075 99433 65330
17864 65330 66420 53280 60132 54888 63851 69230 126503 138338 157839 158239 120018 119825 91393
17851 91393 8826 -38469 -39646 28373 105273 116939 80159 45181 37078 35987 80453 187246
17839 187246 222364 336117 457066 565573 669950 722128 761570 821618 951920 940897
17829 940897 933575 880421 810540 821064 791445 736652 670966 642560 662273 522120 380777
17818 380777 316476 259447 238605 184230 165893 143712 103569 87329 123929 130983 113234 115111
$$ packed form
17900a0167M9314Q654o6664n0957L5757K6436K1269k2059j821J6444K1583K5130
17888E2919L0467J5759n9796j0496O2916Q5825P5097P6934Q1021l773n4198m0973
17876C11702r589L48O539K6779M2682K0523q7338j00267k3956l348q4642l4103
17864F5330J090j3140O852n244Q963N379N7273J1835J9501M00l8221j93k8432
17851I1393q2567m7295j177O8019P6900J1666l6780l4978q103j091M4466J06793
17839A87246L5118J13753J20949J08507J04377N2178L9442O0048J30302j1023
17829I40897p322n3154o9881J0524k9619n4793o5686k8406J9713j40153j41343
17818C80777o4301n7029k0842n4375j8337k2181m0143j6240L6600P054j7749J877
$$ plain form
17806 115111 95082 103765 109405 76531 71947 99541 113467 86796 128666 118203 149101 179420
17794 179420 166294 182837 245793 315071 412755 493408 575299 597929 604630 621904 626222 722094
17782 722094 774369 764428 776154 773213 790926 750356 673198 612307 544034 523573 500848 362955
17770 362955 268699 226089 196414 180079 225494 148371 114548 141440 108558 38301 58916
17759 58916 89174 120474 109655 127557 131620 131732 107934 120158 118945 93038 129816 152291
17747 152291 152700 163590 206505 213181 213932 256974 307951 394849 432207 503603 542699 621045
17735 621045 668849 732183 845201 951347 1054151 1174633 1201227 1256439 1392086 1431754
17725 1431754 1434644 1392184 1250396 1052708 958154 938386 926335 828826 701826 589472 450666
$$ packed form
17806A15111k0029Q683N640l2874m584K7594J3926k6671M1870j0463L0898L0319
17794A79420j3126J6543O2956O9278R7684Q0653Q1891K2630O701J7274M318R5872
17782G22094N2275r941J1726k941J7713m0570p7158o0891o8273k0461k2725j37893
17770C62955r4256m2610k9675j6335M5415p7123l3823K6892l2882p0257K0615
17759E8916L0258L1300j0819J7902M063J12k3798J2224j213k5907L6778K2475
17747A52291M09J0890M2915O676P51M3042N0977Q6898L7358P1396L9096P8346
17735F21045M7804O3334J13018J06146J02804J20482K6594N5212J35647L9668
17725A431754K890m2460j41788j97688r4554j9768j2051r7509j27000j12354j38806
$$ plain form
17714 450666 348363 259723 224819 160382 101348 101256 92827 79246 93128 90082 57335 -33432
17702 -33432 -44676 -38677 -5849 20773 31628 30163 -7328 -36312 -17662 -10573 293 37038
17690 37038 -6724 -39059 -29085 -19654 -89565 -95984 -81693 -67311 -775 68554 44304 14185
17678 14185 -2369 -948 -19021 34811 80199 71337 -14442 -89440 -83185 -26498 -45342 -17310
17666 -17310 4422 -34604 13666 16501 36836 37801 -6598 -36948 -66276 -40014 -92984 -101036
17654 -101036 -63476 -121637 -135665 -39857 -24693 -19916 12294 19456 32059 85596 86714 48372
17642 48372 -38742 -26555 14904 -9204 -15961 29341 63641 37309 -12073 24075 23101 -16204
17630 -16204 -34673 -63686 -81681 -73196 -28047 -13199 39795 51996 7471 -13097 -34702 -38366
$$ packed form
17714D50666j02303q8640l4904o4437n9034r2q429j3581J3882l046l2747r0767
17702c3432j1244N999L2828K6622J0855j465l7491k8984J8650P089J0866L6745
17690C7038m3762l2335R974R431o9911o419J4291J4382O6536O9329k4250l0119
17678A4185j6554J421j8073N3832M5388q862q5779p4998O255N6687j8844K8032
17666a7310K1732l9026M8270K835K0335R65m4399l0350k9328K6262n2970q052
17654a01036L7560n8161j4028R5808J5164M777L2210P162J2603N3537J118l8342
17642D8372q7114J2187M1459k4108o757M5302L4300k6332m9382L6148r74l9305
17630a6204j8469k9013j7995Q485M5149J4848N2994J2201m4525k0568k1605l664
$$ plain form
17618 -38366 -40380 -17165 -19313 -29221 45913 82887 73666 6385 -26312 -52045 -5552 39387
17606 39387 26571 50671 45873 -44175 -36613 -27709 19252 16100 -29108 -35582 -43103 -12553 -8495
17593 -8495 -4167 16549 -9021 -23419 24535 73945 44633 26272 66234 75016 58490 31278
17581 31278 -26055 -18496 -14433 -11195 -5431 30055 -7510 -51608 -65264 -33015 -47515 -56346 -57789
17568 -57789 -66736 -54547 -42405 2712 13448 3858 13097 -32775 -68577 -22831 15170 41072
17556 41072 39808 36985 7907 -1064 -37461 -33474 -32904 -53391 -57768 -31135 4130 -28212 -32209
17543 -32209 -22597 -73609 -49672 61898 69718 26409 59457 44441 29617 22962 -46343 -72706
17531 -72706 -62969 -67895 -83328 -65530 -85186 -64366 541 -25908 -62370 -87101 -27783 -23676
$$ packed form
17618c8366k014K3215k148r908P5134L6974r221o7281l2697k5733M6493M4939
17606C9387j2816K4100m798r0048P562Q904M6961l152m5208o474p521L0550M058
17593h495M328K0716k5570j4398M7954M9410k9312j8361L9962Q782j6526k7212
17581C1278n7333P559M063L238N764L5486l7565m4098j3656L2249j4500q831j443
17568e7789q947J2189J2142M5117J0736r590R239m5872l5802M5746L8001K5902
17556D1072j264k823k9078q971l6397L987N70k0487m377K6633L5265l2342l997
17543c2209R612n1012K3937J11570P820m3309L3048j5016j4824o655o9305k6363
17531g2706R737m926j5433J7798j9656K0820O4907k6449l6462k4731N9318M107
$$ plain form
17519 -23676 -67691 -95069 -97552 -100765 -109315 -86889 -35895 28251 11411 -41720 -51312 -28343
17507 -28343 -24046 -42761 -83695 15233 87133 111190 65435 -28495 -100797 -54634 -27147 -47061
17495 -47061 -31305 -57067 -71502 -21684 -15626 -35376 -10565 20715 -3241 -54573 -112198 -110889
17483 -110889 -94632 -41719 -33088 -45899 -68410 -53928 -4048 8241 -9239 -58539 -75358 -90347
17471 -90347 -76741 5533 44491 51350 41853 -11293 -85604 -95787 -41070 -78221 -90133 -104403
17459 -104403 -63864 -31708 -26139 -32237 32593 72655 35825 24681 -3424 -21297 27002 82703
17447 82703 99315 90589 101831 96973 251245 417791 558175 522674 416687 272654 169385
17436 169385 127590 120229 115757 99237 120038 120886 111770 50485 19281 -42598 -30366 -54573
$$ packed form
17519b3676m4015k7378k483l213q550K2426N0994O4146j6840n3131r592K2969
17507b8343M297j8715m0934R8928P1900K4057m5755r3930p2302M6163K7487j9914
17495d7061J5756k5762j4435M9818O058j9750K4811L1280k3956n1332n7625J309
17483a10889J6257N2913Q631j2811k2511J4482M9880J2289j7480m9300j6819j4989
17471i0347J3606Q2274L8958O859r497n3146p4311j0183N4717l7151j1912j4270
17459a04403M0539L2156N569o098O4830M0062l6830j1144k8105j7873M8299N5701
17447H2703J6612q726J1242m858J54272J66546J40384l5501j05987j44033j03269
17436A69385m1795p361m472j6520K0801Q48r116o1285l1204o1879J2232k4207
$$ plain form
17424 -54573 -60897 -19249 -22214 20950 8336 -2984 -51857 -47388 -93363 -118257 -124543 -107453
17412 -107453 -52391 -26643 -46411 -42276 -38869 -103173 -131054 -112930 -122212 -118708 -75975 -24337
17400 -24337 -39925 -102814 -82465 -50357 -45094 -29053 -18691 -55327 -64029 -40497 -33941 -53592
17388 -53592 -90498 -81520 -51164 -19499 -20452 29177 78207 32622 -15991 -59452 -45422 -34486
17376 -34486 -59704 -97822 -113584 -68797 -4703 30493 13785 24660 14054 -16019 -20753 3519
17364 3519 34160 -10929 -10529 -63841 -56619 -39863 37673 101642 44392 1471 4538 16675 7272
17351 7272 11456 4395 -5141 -23699 -31423 -28377 -48261 -60114 -65609 -101097 -77514 -29919 17876
17338 17876 8584 -106 -56042 -78002 -50044 -9727 -11036 -34544 -78505 -128269 -146285 -124848
$$ packed form
17424e4573o324M1648k965M3164j2614j1320m8873M469m5975k4894o286J7090
17412a07453N5062K5748j9768M135L407o4304k7881J8124r282L504M2733N1638
17400b4337j5588o2889K0349L2108N263J6041J0362l6636q702K3532O556j9651
17388e3592l6906Q978L0356L1665r53M9629M9030m5585m8613m3461J4030J0936
17376c4486k5218l8118j5762M4787O4094L5196j6708J0875j0606l0073m734K4272
17364C519L0641m5089M00n3312P222J6756P7536O3969n7250m2921L067J2137r403
17351G272M184p061r536j8558p724L046j9884j1853n495l5488K3583M7595M7795
17338A7876r292q690n5936k1960K7958M0317j309k3508m3961m9764j8016K1437
$$ plain form
17326 -124848 -95687 -103510 -51039 -60022 -57088 -30907 -7796 10888 2967 10986 -12867 -56513
17314 -56513 -23441 27157 38742 4071 -10995 10874 39494 2158 -8210 24091 32944 3861
17302 3861 -29489 13971 38239 -5080 -26216 -31885 -16861 15728 -33228 -64786 -54229 -16448
17290 -16448 -43486 -59268 -68060 -61143 -74 17475 25213 18218 53207 59939 52821 79429 82316
17277 82316 55743 15371 -20142 -33076 -31160 -54308 -94515 -118054 -66173 -25495 -1425 18777
17265 18777 -8708 -9170 18872 42436 12252 -25445 -13525 52809 58569 16853 -68810 -130248
17253 -130248 -76993 -71177 -62370 -85571 -6505 35429 10095 -20824 -68835 -71839 -28956 -28431
17241 -28431 -38591 11012 -20678 -29861 22480 93641 93692 55574 -1335 -31144 -52763 -64405
$$ packed form
17326a24848K9161p823N2471q983K934K6181K3111J8684p921Q019k3853m3646
17314e6513L3072N0598J1585l4671j5066K1869K8620l7336j0368L2301Q853k9083
17302C861l3350M3460K4268m3319k1136n669J5024L2589m8956l1558J0557L7781
17290a6448k7038j5782q792O917O1069J7549P738o995L4989O732p118K6608K887
17277H2316k6573m0372l5513j2934J916k3148m0207k3539N1881M0678K4070K0202
17265A8777k7485m62K8042K3564l0184l7697J1920O6334N760m1716q5663o1438
17253a30248N3255N816Q807k3201P9066M1934k5334l0919m8011l004M2883N25
17241b8431j0160M9603l1690r183N2341P1161N1l8118n6909k9809k1619j1642
$$ plain form
17229 -64405 -13974 21957 41126 49832 -44139 -81875 -77869 -54230 -48476 -56357 -71483 -65691 -29651
17216 -29651 -13505 -54287 -72786 -77296 -35346 -40962 -87928 -93043 -78879 -13442 11847 -46493
17204 -46493 -88774 -80388 -89869 -74505 -71197 -103994 -71992 -37249 -38512 -31492 -11421 -17607 19820
17191 19820 43003 47101 9021 -13050 -44330 -72437 -71333 -47980 -31349 -73891 -78304 -96816
17179 -96816 -98268 -91671 -84440 -37234 -6762 -66955 -140139 -137319 -88067 -254 36774 -17545
17167 -17545 -65037 -57766 -59783 -43373 -15636 -56311 -1840 36212 47843 -3708 -15888 56078
17155 56078 65940 26476 31218 56342 -4538 16427 6000 -41027 -12278 21289 55784 60709
17143 60709 41146 5421 -16530 -7601 38885 59275 69892 79524 2034 -8504 15986 32363
$$ packed form
17229f4405N0431L5931J9169Q706r3971l7736M006K3639N754p881j5126N792L6040
17216b9651J6146m0782j8499m510M1950n616m6966n115J4164O5437K5289n8340
17204d6493m2281Q386r481J5364L308l2797L2002L4743j263P020K0071o186L7427
17191A9820K3183M098l8080k2071l1280k8107J104K3353J6631m2542m413j8512
17179i6816j452O597P231M7206L0472o0193p3184K820M9252Q7813L7028n4319
17167a7545m7492P271k017J6410K7737m0675N4471L8052J1631n1551j2180P1966
17155E6078R862l9464M742K5124o0880K0965j0427m7027K8749L3567L4495M925
17143F0709j9563l5725k1951Q929M6486K0390J0617R632p7490j0538K4490J6377
$$ plain form
17131 32363 29894 66267 14493 -26871 -935 2326 35486 66657 57710 17341 -46233 -71319
17119 -71319 -104917 -81817 -35507 -4439 -5510 9284 -10953 -41692 -68808 -45909 17583 33660
17107 33660 60040 29516 -23019 -4665 -16623 -41715 -3296 27784 43724 4022 -25585 22813
17095 22813 21864 -53349 -105959 -82378 -43290 -29018 -34999 -59077 -65332 -37591 -67376 -89579
17083 -89579 -113729 -95690 -78621 -59076 -67131 -87174 -96767 -115115 -111044 -59228 -32028 -63186
17071 -63186 -44039 -5276 -29827 -19872 -29813 -27855 -42069 -53481 -103409 -126424 -82160 -100360
17059 -100360 -134009 -96678 -88544 -47336 -27622 -37964 -18059 12192 -13748 -54435 -28636 -6543
17047 -6543 -42119 -40371 -28304 -14912 -11497 -11312 -58799 -44932 45626 87210 65478 5771 8817
$$ packed form
17131C2363k469L6373n1774m1364K5936L261L3160L1171q947m0369o3574k5086
17119g1319l3598K3100M6310L1068j071J4794k0237l0739k7116K2899O3492J6077
17107C3660K6380l0524n2535J8354j1958k5092L8419L1080J5940l9702k9607M8398
17095B2813r49p5213n2610K3581L9088J4272n981k4078o255K7741k9785k2203
17083h9579k4150J8039J7069J9545q055k0043r593j8348M071N1816K7200l1158
17071f3186J9147L8763k4551R955r941J958j4214j1412m9928k3015M4264j8200
17059a00360l3649L7331Q134M1208J9714j0342J9905L0251k5940m0687K5799K2093
17047f543l5576J748J2067J3392L415J85m7487J3867R0558M1584k1732n9707L046
$$ plain form
17034 8817 461 -11815 -79678 -108167 -86209 -22972 12543 9112 32071 49628 23106 36122
17022 36122 35214 -7655 -87240 -81757 -33111 10634 5462 -9401 -13638 23361 -55800 -101805 -84094
17009 -84094 -87144 -103230 -121560 -101899 -111984 -82496 -53530 -44317 -41921 -37627 -31100 -2566 4467
16996 4467 -1488 -26393 28639 61328 42758 8192 -73380 -70308 63709 76860 2775 -91908
16984 -91908 -109671 -108719 -103897 -128191 -140683 -148830 -127381 -125550 -85721 -63494 506 21437 34050
16971 34050 29846 8821 86412 123557 83747 18223 -7551 -42456 -51934 -11689 -49249 -53842
16959 -53842 8440 33163 24196 42848 23220 -42864 -35366 -7563 -71751 -60877 -19912 -43186
16947 -43186 -63197 -20850 6525 -8998 -61092 -96838 -89981 -74985 -55399 -39549 -1435 33128
$$ packed form
17034H817q356j2276o7863k8489K1958O3237L5515l431K2959J7557k6522J3016
17022C6122r08m2869p9585N483M8646M3745n172j4863m237L6999p9161m6005J7711
17009h4094l050j6086j8330J9661j0085K9488K8966R213K396M294O527K8534P033
16996D467n955k4905N5032L2689j8570l4566q1572L072J34017J3151p4085r4683
16984i1908j7763R52M822k4294j2492q147K1449J831L9829K2227O4000K0931J2613
16971C4050m204k1025P7591L7145l9810o5524k5774l4905r478M0245l7560m593
16959e3842O2282K4723q967J8652j9628o6084P498K7803o4188J0874M0965k3274
16947d3186k0011M2347K7375j5523n2094l5746O857J4996J9586J5850L8114L4563
$$ plain form
16935 33128 32040 104 -89165 -128984 -67799 -3596 38690 38792 34565 65219 56228 44572 -34946
16922 -34946 -38966 -29733 17294 40467 56686 84630 102787 112903 127843 104335 163027 157021
16910 157021 67635 -8855 3265 6481 -47527 -67207 -82702 -87025 -12282 37984 5944 -27175
16898 -27175 416 55082 62548 -20535 -57438 -75437 -55024 -50143 -37499 -9360 -67727 -88835
16886 -88835 -69145 -62339 -22111 8201 -1371 -97783 -112800 -75701 -26041 22400 38185 26144
16874 26144 8911 26336 9636 -84858 -104833 -105389 -64451 -24117 -33657 -32403 12826 35533
16862 35533 28871 22659 10787 -3759 -32616 -8408 37750 37935 32474 34269 38961 35047 66016
16849 66016 74921 67073 34138 17583 -6965 -27670 21357 43633 22979 78074 79605 26792
$$ packed form
16935C3128j088l1936q9269l9819O1185O4203M2286J02m227L0654q991j1656p9518
16922c4946m020R233M7027K3173J6219K7944J8157J0116J4940k3508N8692o006
16910A57021q9386p6490J2120L216n4008j9680j5495m323P4743N0266l2040l3119
16898b7175K7591N4666P466q3083l6903j7999K0413M881J2644K8139n8367k1108
16886h8835J9690O806M0228L0312r572r6412j5017L7099M9660M8441J5785j2041
16874B6144j7233J7425j6700r4494j9975n56M0938M0334r540J254M5229K2707
16862C5533o662o212j1872j4546k8857K4208M6158J85n461J795M692l914L0969
16849F6016Q905p848l2935j6555k4548k0705M9027K2276k0654N5095J531n2813
$$ plain form
16837 26792 93 -45867 -20507 -12978 15792 18371 -653 -673 -16936 -20966 -20308 34105 75847
16824 75847 104281 63401 -16213 -38233 -59888 -85315 -27210 3404 -19563 -28141 -36714 -24954
16812 -24954 -8024 -14241 -27648 13574 10519 -5143 -19688 -19973 -51315 -89558 -76110 -36025
16800 -36025 18185 59866 468 -65828 -99477 -146125 -135607 -107267 -95316 -98647 -117961 -111539
16788 -111539 -37277 -30078 -90331 -158869 -148181 -89649 -79516 -36946 7621 -16396 1431 20750
16776 20750 29085 6468 30701 -15841 -51978 -38533 -50048 -48446 -22492 -21155 -26581 -20281 -7002
16763 -7002 -44423 -37967 -62104 -65578 -43693 -38817 -42977 -60426 -63627 -79751 -123706 -109325 -128534
16750 -128534 -85900 -50833 -103487 -90969 -35324 -56378 -56300 -28332 -22152 -57885 -79420 -35146
$$ packed form
16837B6792k6699m5960K5360P529K8770K579j9024k0j6263m030O58N4413M1742
16824G5847K8434m0880p9614k2020k1655k5427N8105L0614k2967q578q573J1760
16812b4954J6930o217j3407M1222l055j5662j4545k85l1342l8243J3448M0085
16800c6025N4210M1681n9398o6296l3649m6648J0518K8340J1951l331j9314O422
16788a11539P4262P199o0253o8538J0688N8532J0133M2570M4567k4017J7827J9319
16776B0750Q335k2617K4233m6542l6137J3445j1515J602K5954J337n426O300J3279
16763g002l7421O456k4137l474K1885M876m160j7449l201j6124m3955J4381j9209
16750a28534M2634L5067n2654J2518N5645k1054P8K7968O180l5733k1535M4274
$$ plain form
16738 -35146 11034 32220 18621 11120 8940 8556 50379 32402 8229 -37243 -15563 76107
16726 76107 100357 84017 34316 -31179 -78059 -37907 -19301 -56415 -20502 33370 -11550 -62483
16714 -62483 -24435 24329 -30363 -112676 -58718 -55620 -57145 -43909 -29029 -27988 -23738 -103456
16702 -103456 -124666 -41699 -8495 -51581 -54407 -59154 -41934 -12903 -14739 -6074 -1770 -17948
16690 -17948 26324 40194 -16868 -28080 -13918 -35528 -58317 -21238 -43258 -111613 -156315 -104302
16678 -104302 -46474 25919 93162 92324 -539 13416 7792 31346 45094 83414 49114 -19922
16666 -19922 6858 48892 36867 -21785 -70520 -79585 -60472 -45489 -16818 14847 4006 6258
16654 6258 -17814 -52413 -79317 -53759 -75879 -14583 69503 7377 -12740 -28863 -104921 -61457
$$ packed form
16738c5146M6180K1186j3599p501k180l84M1823j7977k4173m5472K1680R1670
16726G6107K4250j6340m9701o5495m6880M0152J8606l7114L5913N3872m4920n0933
16714f2483L8048M8764n4692q2313N3958L098j525J3236J4880J041M250p9718
16702a03456k1210Q2967L3204m3086k826m747J7220K9031j836Q665M304j6178
16690a7948M4272J3870n7062j1212J4162k1610k2789L7079k2020o8355m4702N2013
16678a04302N7828P2393O7243q38r2863J3955n624K3554J3748L8320l4300o9036
16666a9922K6780M2034j2025n8652m8735r065J9113J4983K8671L1665j0841K252
16654F258k4072l4599k6904K5558k2120O1296Q4086o2126k0117j6123p6058M3464
$$ plain form
16642 -61457 -32638 30381 28167 68585 99165 88819 18115 -13163 -14143 -39000 -26655 -33336
16630 -33336 14497 46958 -1908 -19784 -82439 -116620 -125418 -111278 -66263 4411 26314 12778
16618 12778 4892 -25506 -37290 -44549 -22498 -7451 -33001 -29613 10609 21472 16803 -2692
16606 -2692 12961 15726 20891 54160 55686 -39804 -58099 -30480 -16453 -2023 -35373 -79479
16594 -79479 -73692 -59337 21634 57576 5693 -24033 -12452 30185 39591 -3175 -18530 17459
16582 17459 38775 23670 -33026 -48011 -49569 -82860 -96292 -148006 -115358 -49665 1374 22254
16570 22254 44650 30723 -582 -44885 -43437 -7586 -6738 28539 22134 -44568 -103569 -86942
16558 -86942 -40648 43307 16926 -15694 -60131 -67841 -43852 -23561 25150 58961 81365 34346
$$ packed form
16642f1457K8819O3019k214M0418L0580j0346p0704l1278r80k4857J2345o681
16630c3336M7833L2461m8866j7876o2655l4181q798J4140M5015P0674K1903j3536
16618A2778p886l0398j1784p259K2051J5047k5550L388M0222J0863m669j9495
16606b692J5653K765N165L3269J526r5490j8295K7619J4027J4430l3350m4106
16594g9479N787J4355Q0971L5942n1883k9726J1581M2637R406m2766j5355L5989
16582A7459K1316j5105n6696j4985j558l3291j3432n1714L2648O5693N1039K0880
16570B2254K2396j3927l1305m4303J448L5851Q48L5277o405o6702n9001J6627
16558h6942M6294Q3955k6381l2620m4437p710K3989K0291M8711L3811K2404m7019
$$ plain form
16546 34346 -37306 -49026 -100647 -78303 -357 -12750 -53353 -30636 -1509 26303 40613 7657
16534 7657 -4217 4718 14069 -14027 -43565 -5462 -17914 -11526 -1961 -11944 -23867 -61946 -36784
16521 -36784 650 -25344 -10978 -22149 -37401 -28496 -42738 -55795 -93425 -91062 -72520 -13411
16509 -13411 -2021 -32926 -63095 -80324 -61404 2383 -4436 -90 -31935 -13080 -28872 -36107
16497 -36107 -55377 -67786 -17868 9786 36177 51737 47691 37543 23457 -3634 -43268 -25746
16485 -25746 -9899 -61967 -71736 -65903 -65778 -44172 -12940 30544 25298 20671 16379 4109 -24225
16472 -24225 9362 6939 -7046 -32160 -59646 -27884 66950 120223 98548 29559 18913 41619
16460 41619 53079 34605 29497 41326 87615 78251 71754 49027 -26627 -47131 -88778 -64478
$$ packed form
16546C4346p1652j1720n1621K2344P7946j2393m0603K2717K9127K7812J4310l2956
16534G657j1874Q935R351k8096k9538L8103j2452O388R565r983j1923l8079K5162
16521c6784L7434k5994J4366j1171j5252Q905j4242j3057l7630K363J8542N9109
16509a3411J1390l0905l0169j7229J8920O3787o819M346l1845J8855j5792p235
16497c6107j9270j2409M9918K7654K6391J5560m046j0148j4086k7091l9634J7522
16485b5746J5847n2068r769N833J25K1606L1232M3484n246m627m292j2270k8334
16472b4225L3587k423j3985k5114k7486L1762R4834N3273k1675o8989j0646K2706
16460D1619J1460j8474n108J1829M6289r364o497k2727p5654k0504m1647K4300
$$ plain form
16448 -64478 -36945 -35309 -59459 23302 36767 20089 12549 -21610 -62869 -35572 36649 46586
16436 46586 67133 86714 5332 -45943 -24852 23799 7544 25092 35105 44521 -5437 -75429
16424 -75429 -48558 -13194 18618 18847 3078 30752 -44330 -62216 -61660 -17740 -5802 19998
16412 19998 1039 10779 14242 36403 -14383 -39287 3563 22021 5613 47470 -5427 -6334
16400 -6334 -26813 -47776 -50128 -21269 6949 14817 15659 12464 -22212 -81297 -62944 -55444 -89732
16387 -89732 -93502 -84390 -57018 -39157 -14085 5322 33536 45122 86619 85771 35526 16215
16375 16215 28555 3179 -6854 10178 5516 4299 -17730 -14245 -13809 3079 -17121 -41105 -67486
16362 -67486 -33806 -19604 -31865 13287 -19164 -56323 -80727 -65872 -50440 -31162 21262 37509
$$ packed form
16448f4478K7533J636k4150Q2761J3465j6678p540l4159m1259K7297P2221R937
16436D6586K0547J9581q1382n1275K1091M8651j6255J7548J0013R416m9958o9992
16424g5429K6871L5364L1812K29j5769K7674p5082j7886N56M3920J1938K5800
16412A9998j8959R740L463K2161n0786k4904M2850J8458j6408M1857n2897r07
16400f334k0479k0963k352K8859K8218P868Q42l195l4676n9085J8353P500l4288
16387h9732l770R112K7372J7861K5072J9407K8214J1586M1497q48n0245j9311
16375A6215J2340k5376j0033J7032m662j217k2029L485M36J6888k0200k3984k6381
16362f7486L3680J4202j2261M5152l2451l7159k4404J4855J5432J9278N2424J6247
$$ plain form
16350 37509 -30566 -24646 -18383 -11509 1770 -2312 -22183 14039 42244 17737 4998 3904 -1198
16337 -1198 -2623 -16082 -1704 -26446 -34099 -19431 10384 26302 16560 -14945 -41896 -39379 -4880
16324 -4880 23682 62668 49246 15716 44324 36039 23682 32397 30161 -2628 -17428 -17175 12171
16311 12171 -3580 -5907 -35418 -56491 -56166 -73477 -68112 -79667 -64092 -24932 -27598 -34140 -17421
16298 -17421 33454 22427 40373 114976 124008 100213 49142 17654 -35740 -98881 -81538 -49225
16286 -49225 -41876 -39368 -39549 -58569 -3805 47222 51228 43883 24957 4407 -19531 -24161 -18060
16273 -18060 -56901 -75800 -57226 -29423 19372 58719 34733 -34670 -63041 -118136 -119242 -98473
16261 -98473 -25557 -4951 -31234 -46554 -47726 858 16202 27905 28846 39279 47079 60674
$$ packed form
16350C7509o8075N920O263O874J3279m082j9871L6222K8205k4507j2739j094n102
16337a198j425j3459J4378k4742p653J4668K9815J5918r742l1505k6951K517L4499
16324d880K8562L8986j3422l3530K8608q285j2357Q715k236l2789j4800K53K9346
16311A2171j5751k327k9511k1073L25j7311N365j1555J5575L9160k666o542J6719
16298a7421N0875j1027J7946P4603R032k3795n1071l1488n3394o3141J7343L2313
16286d9225P349K508j81j9020N4764N1027M006p345j8926k0550k3938m630O101
16273a8060l8841j8899J8574K7803M8795L9347k3986o9403k8371n5095j106K0769
16261i8473P2916K0606k6283j5320j172M8584J5344J1703R41J0433P800J3595
$$ plain form
16249 60674 88836 50174 -17496 -15451 -22113 -30182 -18288 -93941 -93278 -15222 -519 -84554 -84851
16236 -84851 -86841 -76082 -102185 -74473 -53670 -62454 -66443 -62728 -47156 -367 -12827 -28401
16224 -28401 19927 105396 127544 73399 5383 -72482 -114342 -138423 -79709 -49444 -20789 -13119
16212 -13119 -36411 -14491 -14324 -75726 -99273 -55306 -56227 -48685 -19477 -21912 4478 21037 24365
16199 24365 90374 80312 29079 47092 83365 -3736 -45739 -18465 -14291 8470 -45145 -93619
16187 -93619 -86019 -73656 -65364 -35645 -18283 45739 23876 -10847 -23719 -1957 -4156 4269
16175 4269 5759 -21451 -73728 -45079 -23502 -27676 20514 23861 4594 -4829 19953 14208 74
16162 74 -28631 -31532 23271 33125 -17841 -5229 -24321 -42489 -16488 39550 77161 60529 25038
$$ packed form
16249F0674K8162l8662o7670K045o662q069J1894p5653O63P8056J4703q4035k97
16236h4851j990J0759k6103K7712K0803q784l989L715J5572M6789j2460j5574
16224b8401M8328Q5469K2148n4145o8016p7865m1860k4081N8714L0265K8655P670
16212a3119k3292K1920J67o1402k3547M3967r21P542K9208k435K6390J6559L328
16199B4365O6009j0062n1233J8013L6273q7101m2003K7274M174K2761n3615m8474
16187i3619P600J2363Q292K9719J7362O4022k1863l4723j2872K1762k199Q425
16175D269J490k7210n2277K8649K1577m174M8190L347j9267r423K4782n745j4134
16162G4k8705k901N4803R854n0966J2612j9092j8168K6001N6038L7611j6632l5491
$$ plain form
16149 25038 5527 -12477 -4205 23738 -27558 -11699 26070 58059 44468 14838 -25797 -55100
16137 -55100 -74951 -87577 -132715 -118636 -85000 -64943 -60525 -83496 -54661 -44317 -41298 -77284
16125 -77284 -22469 -93 -10842 -66835 -66743 -31886 -20165 2915 9213 8749 7933 5101 -12880
16112 -12880 -32539 -54625 -14328 65301 89086 113271 111327 132158 94926 99787 117659 71155
16100 71155 4803 1992 -43656 -22408 40687 -7232 -47067 -16013 14482 -18743 -52672 -77138
16088 -77138 -72068 -91767 -102585 -143106 -121659 -62165 -38176 -12016 -55265 -34378 -12965 19539
16076 19539 -7944 -37336 -24755 -19091 -57233 -96731 -104164 -58994 -68931 -40145 -12484 -15275
16064 -15275 -24286 -49170 -70002 -80735 -24353 29003 -6512 -66084 5012 -2171 -60451 -96349
$$ packed form
16149B5038j9511j8004Q272K7943n1296J5859L7769L1989j3591k9630m0635k9303
16137e5100j9851j2626m5138J4079L3636K0057M418k2971K8835J0344L019l5986
16125g7284N4815K2376j0749n5993R2L4857J1721K3080O298m64q16k832j7981
16112a2880j9659k2086M0297P9629K3785K4185j944K0831l7232M861J7872m6504
16100G1155o6352k811m5648K1248O3095m7919l9835L1054L0495l3225l3929k4466
16088g7138N070j9699j0818m0521K1447N9494K3989K6160m3249K0887K1413L2504
16076A9539k7483k9392J2581N664l8142l9498p433M5170r937K8786K7661k791
16064a5275r011k4884k0832j0733N6382N3356l5515n9572P1096p183n8280l5898
$$ plain form
16052 -96349 -108279 -73134 -93822 -130359 -69644 10316 50287 70331 83729 36160 52924 64164
16040 64164 31247 13426 -16651 -5131 -45524 -22650 -30906 -20245 -38050 -63857 -65278 -32094
16028 -32094 -13384 9175 64147 42769 -12213 8279 53634 44026 58445 95698 108578 91147
16016 91147 86269 41579 45515 41940 -6820 -15118 -28518 -60085 -44952 26488 140689 125093
16004 125093 31815 -4785 -58242 -501 33892 12833 -53528 -38072 9859 22827 4176
15993 4176 -28642 -15425 -18896 -18639 11325 29415 4460 23428 43057 2423 -48587 -18501
15981 -18501 -48201 -88997 -71576 -30507 37302 31736 22646 13746 -26766 -39497 -16012 35461
15969 35461 6367 -4787 -15038 5380 -21047 44170 61971 46375 13045 -11808 -442 109943
$$ packed form
16052i6349j1930L5145k0688l6537O0715P9960L9971K0044J3398m7569J6764J1240
16040F4164l2917j7821l0077J1520m0393K2874q256J0661j7805k5807j421L3184
16028c2094J8710K2559N4972k1378n4982K0492M5355r608J4419L7253J2880j7431
16016I1147m878m4690L936l575m8760q298j3400l1567J5133P1440J14201j5596
16004A25093r3278l6600n3457N7741L4393k1059o6361J5456M7931J2968j8651
15993D176l2818J3217l471K57K9964J8090k4955J8968J9629m0634n1010L0086
15981a8501k9700m0796J7421M1069O7809n566r090q900m0512j2731K3485N1473
15969C5461k9094j1154j0251K0418k6427O5217J7801j5596l3330k4853J1366J10385
$$ plain form
15957 109943 101211 31958 -4504 -3050 -22466 -20638 -22406 -72666 -132453 -47923 5586 2907
15945 2907 9641 15551 -2873 12044 -2239 4506 -13590 -25060 -14964 -536 13540 3644 7871
15932 7871 52432 63042 62547 30361 -24266 -56315 -57925 -90408 -102633 -70602 -89580 -57871
15920 -57871 -37209 -23798 -2603 67240 36591 1760 -11656 -17409 -4865 56758 64257 25540
15908 25540 -13418 -23333 -559 -5488 -35533 -3211 -1276 4523 34328 92110 107262 81106
15896 81106 -10352 -30637 -59330 -67168 -84793 8686 24527 5094 -19049 3787 -37197 -54429
15884 -54429 -6036 16515 -6659 9736 34616 44091 -27283 -85320 -93404 -91944 -79499 -60735
15872 -60735 -49848 -40626 -15960 -7159 63782 53635 34666 36937 33638 14078 -27572 -40870
$$ packed form
15957A09943q732o9253l6462J454j9416J828j768n0260n9787Q4530N3509k679
15945B907O734N910j8424J4917j4283O745j8096j1470J0096J4428J4076r896M227
15932G871M4561J0610m95l2186n4627l2049j610l2483j2225L2031j8978L1709
15920e7871K0662J3411K1195O9843l0649l4831j3416n753J2544O1623P499l8717
15908B5540l8958r915K2774m929l0045L2322J935N799K9805N7782J5152k6156
15896H1106r1458k0285k8693p838j7625R3479J5841j9433k4143K2836m0984j7232
15884e4429M8393K2551k3174J6395K4880R475p1374n8037q084J460J2445J8764
15872f0735J0887R222K4666Q801P0941j0147j8969K271l299j9560m1650j3298
$$ plain form
15860 -40870 -9900 28670 100756 112817 80635 46419 89067 107597 116200 58151 -58927 -81496
15848 -81496 -54836 -13776 23950 61218 80138 73703 46447 53155 9544 16102 -9938 -8922
15836 -8922 17641 49423 73529 7947 -38775 -44701 -50125 -12611 -39727 -25750 -2990 48825
15824 48825 52415 30908 4102 -124052 -106839 -60364 -60930 -28390 11666 9178 -13452 -35337
15812 -35337 -24831 -30074 -22382 9303 -12056 -54236 -55634 -51997 -50036 20056 48124 26116 11344
15799 11344 -11471 -44433 -37031 -18156 -22559 -58846 -70001 -60986 -45298 -21379 -41878 -81766
15787 -81766 -89809 -65715 -9542 59787 91368 69190 10883 514 -5250 -32150 5728 53286
15775 53286 117987 102303 20009 -38309 -10372 -19746 -27640 -75623 -72596 -21698 -35207 -53876
$$ packed form
15860d0870L0970L8570P2086J2061l2182l4216M2648J8530Q603n8049j17078k2569
15848h1496K6660M1060L7726L7268J8920o435k7256O708m3611O558k6040J016
15836h922K6563L1782K4106o5582m6722n926n424L7514k7116J3977K2760N1815
15824D8825L590k1507k6806j28154J7213M6475n66L2540M0056k488k2630k1885
15812c5337J0506n243P692L1685k1359m2180j398L637J961P0092K8068k2008j4772
15799A1344k2815l2962P402J8875m403l6287j1155R015J5688K3919k0499l9888
15787h1766q043K4094N6173O9329L1581k2178n8307j0369n764k6900L7878M7558
15775E3286O4701j5684q2294n8318K7937r374p894m7983L027N0898j3509j8669
$$ plain form
15763 -53876 -28336 -36278 -47396 -17256 -37930 -103173 -110181 -133173 -107920 -26994 15533 14582
15751 14582 7134 -2564 -35215 -35038 12947 34157 41591 16549 -132 31915 42829 37476 74517
15738 74517 82293 68247 89653 90961 54464 -33588 -47346 19801 41460 52094 -20315 -20264 -37126
15725 -37126 -27172 -9079 -34461 -47271 2258 1399 -25460 13526 76382 89081 40515 -16124
15713 -16124 -3498 9504 20560 31754 60843 55293 13151 -19590 -27272 -14741 -34957 -88754
15701 -88754 -64836 -69617 -111040 -114697 -85285 -83585 -51409 -15102 -38055 -49455 -72705 -83215
15689 -83215 -93995 -77584 -22398 7453 19107 -6303 -33803 -18143 -20907 -30998 -79260 -97257
15677 -97257 -82001 -20934 15302 13643 -13074 7928 15998 21114 1784 26916 58351 36431
$$ packed form
15763e3876K5540p942j1118L0140k0674o5243p008k2992K5253Q0926M2527r51
15751A4582p448r698l2651J77M7985K1210P434k5042j6681L2047J0914n353L7041
15738G4517P776j4046K1406J308l6497q8052j3758O7147K1659J0634p2409N1j6862
15725c7126R954J8093k5382j2810M9529q59k6859L8986O2856J2699m8566n6639
15713a6124J2626J3002J1056J1194K9089n550m2142l2741p682J2531k0216n3797
15701h8754K3918m781m1423l657K9412J700L2176L6307k2953j1400k3250j0510
15689h3215j0780J6411N5186K9851J1654k5410k7500J5660k764j0091m8262j7997
15677i7257J5256O1067L6236j659k6717K1002Q070N116j9330K5132L1435k1920
$$ plain form
15665 36431 -1046 148 -6927 -6222 -4271 -17226 11384 -6573 -5773 -29170 -66020 -59069 -16256
15652 -16256 38148 58059 66308 91250 71893 43663 26544 69263 93662 101818 86353 58388
15640 58388 77233 91528 66802 35409 32844 -4531 -15328 -23143 4965 -12679 -2312 4331
15628 4331 10350 23641 39112 30240 -40909 -6078 15393 -22771 18832 -25362 -4547 7246
15616 7246 -1644 16369 -8375 -64722 -64493 -88423 -86931 -42914 -9891 -35279 24561 42929 27371
15603 27371 14319 20394 -27471 -74563 -126647 -128454 -70638 45479 115621 43975 -1606 -6518
15591 -6518 11213 40665 51692 38855 23299 14595 6260 20796 7933 34284 9079 -9387
15579 -9387 7409 -743 -29142 1166 22801 35 -15005 -5228 14624 64775 43933 40805
$$ packed form
15665C6431l7477J194p075P05J951j2955K8610j7957Q00k3397l6850O951M2813
15652a6256N4404J9911Q249K4942j9357k8230j7119M2719K4399Q156j5465k7965
15640E8388J8845J4295k4726l1393k565l7375j0797p815K8108j7644J0367O643
15628D331O019J3291J5471q872p1149L4831K1471l8164M1603m4194K0815J1793
15616G246q890J8013k4744n6347K29k3930J492M4017L3023k5388N9840J8368j5558
15603B7371j3052O075m7865m7092n2084j807N7816J16117P0142p1646m5581m912
15591f518J7731K9452J1027j2837j5556q704q335J4536j2863K6351k5205j8466
15579i387J6796q152k8399L0308K1635k2766j5040R777J9852N0151k0842l128
$$ plain form
15567 40805 23916 38998 34774 26542 31892 -6546 -27076 -31698 -44144 -71002 -48146 27850
15555 27850 56918 55306 23372 15392 62245 78676 17050 7685 23834 42479 57745 16096
15543 16096 -17053 -34898 -70395 -117076 -84274 -35291 39360 32354 -12127 -74732 -59628 -30810
15531 -30810 -56656 -81742 -54711 -33693 -27138 -17101 -8641 -4039 -50440 -50382 -12836 51401 14705
15518 14705 1367 72159 73133 29626 44021 3277 -53203 -66095 -37612 -43299 -45138 -53818 -54443
15505 -54443 3907 -23546 -30888 -73003 -45006 -35793 8129 42613 28842 53500 42988 40637
15493 40637 29016 -5186 -73718 -60005 -95404 -46640 -16793 -14156 15620 27026 21838 -712
15481 -712 -27636 -19558 -73987 -92368 -52039 -53058 1824 42132 50936 59564 37381 2349 -39775
$$ packed form
15567D0805j6889J5082m224q232N350l8438k0530m622j2446k6858K2856P5996
15555B7850K9068j612l1934p980M6853J6431o1626r365J6149J8645J5266m1649
15543A6096l3149j7845l5497m6681L2802M8983P4651p006m4481o2605J5104K8818
15531c0810k5846k5086K7031K1018O555J0037Q460M602m6401N8L7546O4237l6696
15518A4705j3338P0792R74m3507J4395m0744n6480j2892K8483n687j839q680o25
15505e4443N8350k7453p342m2115K7997R213M3922L4484j3771K4658j0512k351
15493D0637j1621l4202o8532J3713l5399M8764K9847K637K9776J1406n188k2550
15481g12k6924Q078n4429j8381M0329j019N4882M0308Q804Q628k2183l5032m2124
$$ plain form
15468 -39775 -6430 19711 -16238 -28384 -39276 -33283 7652 18373 -35385 -48504 -81682 -121558
15456 -121558 -52474 150 -4537 2952 15910 -13741 -28833 6401 21552 -9828 -82759 -85787
15444 -85787 -14845 38743 61975 21090 -33328 -60592 -73120 -96203 -100371 -60595 -17291 -25629
15432 -25629 -24856 -19063 -58406 -3128 33846 82784 92851 64439 43931 -12198 -1014 75800
15420 75800 57211 27782 -52559 -127539 -136480 -112695 -23992 -59944 -99843 -66815 -14969 -25424
15408 -25424 -72665 -79524 -17935 37313 47065 56341 -9759 19487 50034 57600 45108 31384
15396 31384 20350 39912 81515 95685 27636 74199 84526 54025 -3008 29487 71964 35368
15384 35368 13743 13997 -11692 -15441 -35067 -44918 -34486 -60881 -103407 -61965 -5649 18746
$$ packed form
15468c9775L3345K6141l5949j2146j0892N993M0935J0721n3758j3119l3178l9876
15456a21558O9084N2624m687P489J2958k9651j5092L5234J5151l1380p2931l028
15444h5787P0942N3588K3232m0885n4418k7264j2528k3083m168L9776M3304q338
15432b5629P73N793l9343N5278L6974M8938J0067k8412k0508n6129J1184P6814
15420G5800j8589k9429q0341p4980q941K3785Q8703l5952l9899L3028N1846j0455
15408b5424m7241o859O1589N5248R752R276o6100K9246L0547P566j2492j3724
15396C1384j1034J9562M1603J4170o8049M6563J0327l0501n7033L2495M2477l6596
15384C5368k1625K54k5689l749j9626r851J0432k6395m2526M1442N6316K4395
$$ plain form
15372 18746 67675 56775 24595 28020 25223 20468 44330 33887 10148 33882 41082 37254 10482
15359 10482 16094 35712 41856 34033 58944 48307 51601 27772 37913 77731 58998 47041
15347 47041 30218 37386 -21375 -33716 9250 36363 88522 105114 136978 116255 45871 19737
15335 19737 46818 85594 123227 126495 89650 54225 11546 -18580 -24994 -51481 -45052 -25229
15323 -25229 -7517 -34699 -49055 -69791 -64131 15652 94191 118358 111854 61871 6207 24348
15311 24348 22125 33464 37686 31655 75265 91286 65442 32363 61999 43342 68266 141251
15299 141251 132374 80656 48336 46348 1474 -5881 886 4496 10710 21937 29828 34984 30008
15286 30008 60452 10947 -34911 12394 95040 101863 105508 99611 13852 -20284 -8996 -16926
$$ packed form
15372A8746M8929j0900l2180L425k797m755K3862j0443k3739K3734P200l828k6772
15359A0482N612J9618O144p823K4911j0637L294k3829J0141L9818j8733j1957
15347D7041j6823P168n8761j2341M2966K7113N2159J6592L1864k0723p0384k6134
15335A9737K7081L8776L7633L268l6845l5425m2679l0126o414k6487O429J9823
15323b5229J7712k7182j4356k0736N660P9783P8539K4167o504m9983n5664J8141
15311B4348k223J1339M222o031M3610J6021k5844l3079K9636j8657K4924P2985
15299A41251q877n1718l2320j988m4874p355O767L610O214J1227P891N156m976
15286C0008L0444m9505m5858M7305Q2646O823L645n897q5759l4136J1288p930
$$ plain form
15274 -16926 2100 5882 42382 38522 73015 80702 -8044 -25842 12295 5223 -50612 -43607 24235
15261 24235 44994 46675 69144 808 -25510 15638 30745 31970 33618 76016 76147 36581 29527
15248 29527 64982 50499 59267 58090 30820 27348 19282 -4020 -11100 -30337 28495 40650 33233
15235 33233 -14586 -69638 -79799 10396 28777 16387 6582 -34835 -53002 -70504 -46090 -26338
15223 -26338 -58827 -24015 110 1201 -2064 63 2246 -28611 -17618 -2240 -9376 41004 97974
15210 97974 87122 20828 28064 72496 71918 51853 11489 24978 39381 46798 65602 52780
15198 52780 51790 65300 70838 39996 844 39722 28306 5737 26517 13321 3460 -8559
15186 -8559 9073 19474 6158 26692 16106 34662 33419 130859 175947 145515 84019 39206
$$ packed form
15274a6926J9026L782L6500l860L4493P687q8746j7798L8137p072n5835P005O7842
15261B4235K0759J681K2469o8336k6318M1148J5107J225J648M2398J31l9566p054
15248B9527L5455j4483Q768j177k7270l472q066k3302p080j9237N8832J2155p417
15235C3233m7819n5052j0161R0195J8381j2390r805m1417j8167j7502K4414J9752
15223b6338l2489L4812K4125J091l265K127K183l0857J0993J5378p136N0380N6970
15210I7974j0852o6294P236M4432n78k0065m0364J3489J4403P417J8804j2822
15198E2780r90J3510N538l0842l9152L8878j1416k2569K0780j3196r861j2019
15186h559J7632J0401j3316K0534j0586J8556j243R7440M5088l0432o1496m4813
$$ plain form
15174 39206 46662 63361 73248 18926 -22274 -64067 -14191 -6999 26219 63334 12272 8243
15162 8243 -21716 3211 -9276 -1652 -4088 -10527 35475 70110 34478 34842 20207 12230 32343
15149 32343 62470 88001 65404 14273 13438 769 7348 -27336 -9552 -17197 -2285 23855
15137 23855 -44877 -27763 20984 108748 87693 77388 58457 65416 82930 99980 77549 66456
15125 66456 61264 91772 139946 140581 91682 56973 30592 64134 -126 -67939 -101474 -75615
15113 -75615 -38667 -27520 23570 81358 81638 29136 13390 -7101 -2107 54900 62181 43095
15101 43095 44207 24337 23862 47774 47111 -16068 -39559 -17656 18943 75989 58606 25106 -26600
15088 -26600 6486 40790 43734 8175 -15240 -2903 72247 115191 47100 22365 29898 18555
$$ packed form
15174C9206P456J6699R887n4322m1200m1793M9876P192L3218L7115n1062m029
15162H243k9959K4927j2487P624k436o439M6002L4635l5632L64j4635p977K0113
15149C2343L0127K5531k2597n1131q35j2669O579l4684J7784p645J4912K6140
15137B3855o8732J7114M8747Q7764k1055j0305j8931O959J7514J7050k2431j1093
15125F6456n192L0508M8174O35m8899l4709k6381L3542o4260o7813l3535K5859
15113g5615L6948J1147N1090N7788K80n2502j5746k0491M994N7007P281j9086
15101D3095J112j9870m75K3912o63o3179k3491K1903L6599N7046j7383l3500n1706
15088b6600L3086L4304K944l5559k3415J2337P5150M2944o8091k4735P533j1343
$$ plain form
15076 18555 -7839 -36104 -38870 -53986 8110 21864 -48384 -48145 -32867 -17180 38511 50757
15064 50757 65831 50564 25657 51921 37706 -27727 -24105 -27594 -59153 -34355 -21103 -34097
15052 -34097 -807 38781 17591 -14548 -25928 -9977 -25343 -1464 53978 50511 12617 37414
15040 37414 70289 70264 38129 25188 5720 9311 59142 88761 99719 149326 158238 115787 66276
15027 66276 72866 57235 42146 49261 51790 15533 13456 51094 79213 70771 37019 23313 52513
15014 52513 79909 24821 22470 6029 -42896 -13391 23101 135 -16308 -60418 -15241 46793
15002 46793 37444 43386 108871 94118 120772 63947 52516 63550 5513 -18570 5559 32722
14990 32722 9067 -16590 -61869 -52561 -6503 70037 114640 96849 112879 110476 91027 67035
$$ packed form
15076A8555k6394k8265k766j5116O2096J3754p0248K39J5278J5687N5691J2246
15064E0757J5074j5267k4907K6264j4215o5433L622l489l1559K4798J3252j2994
15052c4097L3290L9588k1190l2139j1380J5951j5366K3879N5442l467l7894K4797
15040C7414L2875k5l2135j2941j9468L591M9831K9619J0958M9607Q912m2451m9511
15027F6276O590j5631j5089P115K529l6257k077L7638K8119q442l3752j3706K9200
15014E2513K7396n5088k351j6441m8925K9505L6492k2966j6443m4110M5177O2034
15002D6793r349N942O5485j4753K6654n6825j1431J1034n8037k4083K4129K7163
14990C2722k3655k5657m5279R308M6058P6540M4603j7791J6030k403j9449k3992
$$ plain form
14978 67035 35282 39209 49499 39076 87474 61835 26866 43962 108562 137394 137675 101513
14966 101513 101283 81976 73542 83634 61570 23458 37971 46374 74126 -1548 -12862 19768
14954 19768 72830 102518 138212 165949 108154 76609 74605 41830 42741 68621 113330 91828
14942 91828 62934 69608 84579 92245 86138 97939 122336 79686 101643 124921 122839 88706
14930 88706 56822 68521 103153 169820 114946 35705 77763 90582 95271 121521 154539 138936
14918 138936 150498 198168 204393 198632 191424 164638 196833 204243 199398 142581 133456 185577 237647
14905 237647 210453 228886 248064 257577 296460 356405 376748 390603 452401 505088 483808 526639
14893 526639 634484 712066 733893 790376 900654 1001721 1035946 1024543 1086215 1145407 1136630
$$ packed form
14978F7035l1753L927J0290j0423M8398k5639l4969J7096O4600K8832K81l6162
14966A01513k30j9307q434J0092k2064l8112J4513Q403K7752p5674j1314L2630
14954A9768N3062K9688L5694K7737n7795l1545k004l2775R11K5880M4709k1502
14942I1828k8894O674J4971P666o107J1801K4397m2650K1957K3278k082l4133
14930H8706l1884J1699L4632O6667n4874p9241M2058J2819M689K6250L3018j5603
14918A38936J1562M7670O225n761p208k6786L2195P410m845n6817r125N2121N2070
14905B37647k7194J8433J9178R513L8883N9945K0343J3855O1798N2687k1280M2831
14893E26639J07845P7582K1827N6483J10278J01067L4225j1403O1672N9192q777
$$ plain form
14882 1136630 1112461 1067032 1007273 969942 940035 882199 860800 832753 781166 765126 781449
14871 781449 742777 676899 625726 625649 646763 666578 698979 715235 705323 714845 707144 752712 843571
14858 843571 932930 984691 1007726 1023403 982913 968561 978698 991317 978812 998397 999431 940545
14846 940545 862833 753913 754185 728855 618199 492816 434291 371580 323441 276398 229216
14835 229216 186348 154407 200574 226421 164220 127391 94274 90828 97109 148180 153827 94117
14823 94117 47626 82585 150659 143399 106588 90972 79930 75519 77907 94011 91521 80819
14811 80819 112086 149995 130520 155326 127024 72366 88722 125534 172789 166163 94992 67100
14799 67100 70960 67436 65696 61972 46379 39408 60222 78440 60603 65679 -6957 49722 121350
$$ packed form
14882A136630k4169m5429n9759l7331k9907n7836k1399k8047n1587j6040J6323
14871G81449l8672o5878n1173p7K1114J9815L2401J6256r912R522p701M5568R0859
14858H43571Q9359N1761K3035J5677m0490j4352J0137J2619j2505J9585J034n8886
14846I40545p7712j08920K72k5330j10656j25383n8525o2711m8139m7043m7182
14835B29216m2868l1941M6167K5847o2201l6829l3117l446O281N1071N647n9710
14823I4117m6491L4959O8074p260l6811j5616j1042m411K388J6104k490j0702
14811H0819L1267L7909j9475K4806k8302n4658J6356L6812M7255o626p1171k7892
14799F7100L860l524j740l724j5593o971K0814J8218j7837N076p2636N6679P1628
$$ plain form
14786 121350 122610 150258 107313 114387 129550 104047 113874 88831 107690 146594 144515 78648
14774 78648 51939 48678 72859 74870 79762 63100 39169 25825 34820 64643 129967 186661
14762 186661 184971 170732 123039 52749 15675 -12111 -6575 24825 50374 65443 79694 116178
14750 116178 129575 103077 109825 122200 86440 60968 32678 58666 159699 216081 220708 226942
14738 226942 160954 131317 125158 166072 201064 228329 233306 231306 170382 118515 106694 108403
14726 108403 143902 153644 134523 116654 110742 139752 148799 160898 175228 154245 191784 237161
14714 237161 218021 192350 147254 157836 219780 229451 245253 220204 208333 201119 204237 203921
14702 203921 212599 229294 258140 282046 286259 281933 269918 242147 250307 252021 234861 255669
$$ packed form
14786A21350J260K7648m2945P074J5163k5503R827k5043J8859L8904k079o5867
14774G8648k6709l261K4181K011M892j6662k3931j3344Q995K9823O5324N6694
14762A86661j690j4239m7693p0290l7074k7786N536L1400K5549J5069J4251L6484
14750A16178J3397k6498O748J2375l5760k5472k8290K5988J01033N6382M627O234
14738B26942o5988k9637o159M0914L4992K7265M977k000o0924n1867j1821J709
14726A08403L5499R742j9121j7869n912K9010R047J2099J4330k0983L7539M5377
14714B37161j9140k5671m5096J0582O1944R671J5802k5049j1871p214L118l16
14702B03921Q678J6695K8846K3906M213m326j2015k7771Q160J714j7160K0808
$$ plain form
14690 255669 265475 234018 265038 299203 286021 260931 284966 318029 260945 188974 188022 253644
14678 253644 267031 265903 291387 315028 300185 255063 231736 224568 168529 182778 191218 228355
14666 228355 252975 233205 214511 234123 230488 175713 177190 145981 136542 117701 118546 145022
14654 145022 173610 211731 200448 189102 212673 167833 234917 275169 287721 232192 173187
14643 173187 148805 157203 142546 171293 242430 210174 184709 141013 138060 208317 261070 215919
14631 215919 172940 152471 200535 247077 237548 223798 247135 228520 211608 186849 135688 114727
14619 114727 74734 55623 52555 71238 61324 60200 123180 172965 187541 168613 166379 177791
14607 177791 221171 247406 280314 292017 308133 284022 247507 221226 219626 196538 221670 249647
$$ packed form
14690B55669R806l1457L1020L4165j3182k5090K4035L3063n7084p1971r52O5622
14678B53644J3387j128K5484K3641j4843m5122k3327p168n6039J4249Q440L7137
14666B28355K4620j9770j8694J9612l635n4775J477l1209r439j8841Q45K6476
14654A45022K8588L8121j1283j1346K3571m4840O7084M0252J2552n5529n9005
14643A73187k4382Q398j4657K8747P1137l2256k5465m3696k953P0257N2753m5151
14631B15919m2979k0469M8064M6542r529j3750K3337j8615j6912k4759n1161k0961
14619A14727l9993j9111l068J8683r914j124O2980M9785J4576j8928k234J1412
14607A77791M3380K6235L2908J1703J6116k4111l6515k6281j600k3088K5132K7977
$$ plain form
14595 249647 253713 190326 159485 164106 161939 180248 212981 273769 321807 336542 381781 294763
14583 294763 279417 267766 229695 286051 306388 328864 383673 433284 471800 495225 534535
14572 534535 598450 584650 536495 571137 598361 584395 628109 693801 728681 799444 781824
14561 781824 730589 664858 706888 705661 679175 676757 672705 627072 612309 634066 645647 689414
14549 689414 697459 698922 696215 753003 742960 715403 723238 736035 738820 789617 820727 858586
14537 858586 852927 832909 851441 909261 982273 977662 993733 958787 952668 955446 937628 960758
14525 960758 965750 987251 985342 961137 939163 931414 963084 1030233 1061796 1052938 1047223 1067668
14513 1067668 1058768 1028751 1070310 1131275 1201222 1242413 1293782 1366913 1442680 1485492 1523388
$$ packed form
14595B49647M066o3387l0841M621k167J8309L2733O0788M8038J4735M5239q7018
14583B94763j5346j1651l8071N6356K0337K2476N4809M9611L8516K3425L9310
14572E34535O3915j3800m8155L4642K7224j3966M3714O5692L4880P0763j7620
14561G81824n1235o5731M2030j227k6486k418m052m5633j4763K1757J1581M3767
14549F89414Q045J463k707N6788j0043k7557P835J2797K785N0797L1110L7859
14537H58586n659k0018J8532N7820P3012m611J6071l4946o119K778j7818K3130
14525I60758M992K1501j909k4205k1974p749L1670O7149L1563q858n715K0445
14513A067668q900l0017M1559O0965O9947M1191N1369P3131P5767M2812L7896
$$ plain form
14502 1523388 1583814 1633642 1743925 1759499 1817717 1861364 1928971 2036223 2138137 2240124
14492 2240124 2319967 2403551 2517828 2659873 2800748 2995618 3163794 3356569 3606938 3786771
14482 3786771 4024611 4263338 4553690 4870537 5197196 5533223 5886337 6310356 6763986
14473 6763986 7251161 7777201 8321502 8963860 9623382 10370910 11179816 12032134 12921061
14464 12921061 13947350 15053619 16214021 17559214 18982218 20577878 22361672 24296683
14456 24296683 26429010 28857155 31497726 34443185 37835594 41622707 45841567 50559853
14448 50559853 55912950 62050540 69088116 77190280 86504362 97139278 108958815 121645000
14440 121645000 134656574 147356386 159005763 169064674 177219261 183404189 187515861
$$ packed form
14502A523388O0426M9828J10283J5574N8218M3647O7607J07252J01914J01987
14492B240124P9843Q3584J14277J42045J40875J94870J68176J92775K50369J79833
14482C786771K37840K38727K90352L16847L26659L36027L53114M24019M53630
14473F763986M87175N26040N44301O42358O59522P47528Q08906Q52318Q88927
14464A2921061J026289J106269J160402J345193J423004J595660J783794J935011
14456B4296683K132327K428145K640571K945459L392409L787113M218860M718286
14448E0559853N353097O137590P037576Q102164R314082J0634916J1819537J2686185
14440A21645000J3011574J2699812J1649377J0058911Q154587O184928M111672
$$ plain form
14433 187515861 189516607 189085923 186116610 180818556 173721200 165462758 156808626 148366383
14425 148366383 140483175 133373498 127249700 122197337 118125671 115036647 112900579 111592204
14417 111592204 111156328 111545615 112740123 114642061 117396430 120993200 125453888 130828763
14409 130828763 137102412 144248861 152129306 160248344 167999779 174686906 179725538 182622436
14401 182622436 183048097 181133442 177043190 170880857 162607048 152220501 140014826 126522589
14393 126522589 112629281 99046702 86447637 75038470 64853722 56021283 48375021
14386 48375021 41818065 36282368 31622522 27671368 24247243 21324163 18862364 16731576
14378 16731576 14817370 13174338 11766044 10532511 9472969 8552683 7793117 7096629
$$ packed form
14433A87515861K000746m30684k969313n298054p097356q258442q654132q442243
14425A48366383p883208p109677o123798n052363m071666l089024k136068j308375
14417A11592204m35876L89287J194508J901938K754369L596770M460688N374875
14409A30828763O273649P146449P880445Q119038P751435O687127N038632K896898
14401A82622436M25661j914655m090252o162333q273809j0386547j2205675j3492237
14393A26522589j3893308j3582579j2599065j1409167j0184748q832439p646262
14386D8375021o556956n535697m659846l951154l424125k923080k461799k130788
14378A6731576j914206j643032j408294j233533j059542r20286p59566o96488
$$ plain form
14370 7096629 6458786 5954758 5507246 5090496 4694056 4363759 4084855 3817885 3601038
14361 3601038 3375952 3168145 2972932 2850106 2677880 2543987 2415711 2275320 2179875 2089730
14351 2089730 2043548 1934149 1722002 1607870 1594340 1587404 1548549 1502875 1376324 1308057 1263027
14340 1263027 1208289 1173171 1102463 1082939 1108360 1097323 1071627 1030403 915394 877852 863014
14329 863014 851659 906007 897674 865399 925389 924066 895713 879648 809993 747413 698151 699110
14317 699110 743612 734756 765656 784707 778771 760283 742732 664976 598537 588020 586762 591916
14305 591916 616926 602842 595230 635222 599520 576837 545112 526725 504140 503945 540946 503967
14293 503967 509098 502363 482940 471693 475008 452124 399076 381780 390867 383524 396441 406391 368123
$$ packed form
14370G096629o37843n04028m47512m16750l96440l30297k78904k66970k16847
14361C601038k25086k07807j95213j22826j72226j33893j28276j40391r5445r0145
14351B089730m6182j09399k12147j14132j3530o936l8855m5674j26551o8267m5030
14340A263027n4738l5118p0708j9524K5421j1037k5696m1224j15009l7542j4838
14329H63014j1355N4348q333l2275N9990j323k8353j6065o9655o2580m9262R59
14317F99110M4502q856L0900J9051n936j8488j7551p7756o6439j0517j258N154
14305E91916K5010j4084p612L9992l5702k2683l1725j8387k2585j95L7001l6979
14293E03967N131o735j9423j1247L315k2884n3048j7296R087p343J2917R950l8268
$$ plain form
14280 368123 373985 404233 439643 482742 456250 415009 383865 367998 372007 339129 297408 295109
14268 295109 256059 229846 178628 158778 157244 209858 203732 189877 227007 188199 185158 191513
14256 191513 239009 288347 322262 332194 295682 216974 212462 235355 230778 281774 262723 217095
14244 217095 127037 85561 125623 184958 205116 192385 155471 164864 210433 235441 228644 135218
14232 135218 120081 144240 147362 203846 187431 154264 177134 197263 176415 172124 204633 246118
14220 246118 247233 186459 186582 166071 138236 117152 118262 93924 136974 193993 187609 146502
14208 146502 84844 69590 105533 103302 79423 97021 117111 121802 167293 138466 84436 36107
14196 36107 19410 -13976 -3710 55262 87695 87106 76967 112087 143431 196526 200779 160066
$$ packed form
14280C68123N862L0248L5410M3099k6492m1241l1144j5867M009l2878m1721k299
14268B95109l9050k6213n1218j9850j534N2614o126j3855L7130l8808l041O355
14256A91513M7496M9338L3915R932l6512p8708m512K2893m577N0996j9051m5628
14244B17095r0058m1476M0062N9335K0158j2731l6914R393M5569K5008o797r3426
14232A35218j5137K4159L122N6484j6415l3167K2870K0129k0848m291L2509M1485
14220B46118J115o0774J23k0511k7835k1084J110k4338M3050N7019o384m1107
14208A46502o1658j5254L5943k231k3879J7598K0090M691M5491k8827n4030m8329
14196C6107j6697l3386J0266N8972L2433n89j0139L5120L1344N3095M253m0713
$$ plain form
14184 160066 136941 148696 87204 40169 56166 103527 104440 78983 100402 64129 57894 86402
14172 86402 121221 82355 6000 -43673 -11592 -28492 -13850 -22161 -56732 -65435 -11705 26598
14160 26598 30399 12868 -27653 -43664 8180 15584 12322 -8309 15013 27559 49493 31133
14148 31133 12533 24190 52424 15374 -42139 -96552 -70730 8717 -5777 -13623 -36103 7062
14136 7062 57938 -12928 -91920 -110077 -46271 -62846 -81581 -99372 -150582 -182757 -175286 -156705
14124 -156705 -156709 -122857 -102071 -106988 -68353 -20684 -19366 -60627 -39172 -58797 -51151 -64424 -87793
14111 -87793 -91489 -46819 16573 36014 53940 35589 8944 86082 120846 54654 -15560 -103204
14099 -103204 -135120 -88628 -72287 -66553 -42077 -12828 1805 2147 -31819 -58251 -85951 -105788
$$ packed form
14184A60066k3125J1755o1492m7035J5997M7361R13k5457K1419l6273o235K8508
14172H6402L4819l8866p6355m9673L2081j6900J4642q311l4571q703N3730L8303
14160B6598L801j7531m0521j6011N1844P404l262k0631K3322J2546K1934j8360
14148C1133j8600J1657K8234l7050n7513n4413K5822P9447j4494p846k2480M3165
14136G062N0876p0866p8992j8157O3806j6575j8735j7791n1210l2175P471J8581
14124a56705mL3852K0786m917L8635M7669J318m1261K1455j9625P646j3273k3369
14111h7793l696M4670O3392J9441J7926j8351k6645P7138L4764o6192p0214q7644
14099a03204l1916M6492J6341N734K4476K9249J4633L42l3966k6432k7700j9837
$$ plain form
14087 -105788 -85074 -73547 -19990 8493 13709 43770 23100 46045 98238 98933 43113 1931
14075 1931 -60872 -55421 -6072 -12312 -12961 -3846 -1524 43946 70626 78547 85052 57216 36104
14062 36104 14954 -1668 11926 8541 -62037 -47787 7854 -29729 -22324 -26419 -14266 -24528
14050 -24528 -9757 53029 86838 40857 -1289 -59979 -64915 -66708 -27019 7321 13093 11997
14038 11997 30604 86587 78978 98387 105630 83131 66614 31110 49566 101133 87320 87443
14026 87443 72448 30434 -22598 -44836 -5818 61589 50421 52525 108245 104532 94234 94203 82758
14013 82758 32457 75634 77144 53656 42870 51977 90866 119473 85346 73974 77642 43849
14001 43849 45986 135371 184216 214418 244286 237974 212141 263456 313784 377799 357933 332105
$$ packed form
14087a05788K0714J1527N3557K8483N216L0061k0670K2945N2193O95n5820m1182
14075A931o2803N451M9349o240o49R115K322M5470K6680P921O505k7836k1112
14062C6104k1150j6622J3594l385p0578J4250N5641l7583P405m095J2153j0262
14050b4528J4771O2786L3809m5981m2146n8690m936j793L9689L4340N772j096
14038A1997J8607N5983p609J9409P243k2499j6517l5504J8456N1567j3813J23
14026H7443j4995m2014n3032k2238L9018O7407j1168K104N5720l713j0298l1j1445
14013H2758n0301M3177J510k3488j0786R107L8889K8607l4127j1372L668l3793
14001D3849K137Q9385M8845L0202K9868o312k5833N1315N0328O4015j9866k5828
$$ plain form
13989 332105 323879 360260 440950 468531 521409 601080 674371 777935 795638 813703 877514
13978 877514 925358 967760 987172 975051 929174 940605 983404 947966 908810 814638 746477
13967 746477 688706 643740 638993 622123 627779 641118 584149 594527 639344 652938 609541 646506
13955 646506 695742 732364 736091 714151 716560 710927 724812 809170 908081 944901 975201 955020
13943 955020 947303 961785 917019 816250 726873 685320 607511 570773 545422 499764 368821
13932 368821 258005 222326 265267 237801 204887 207803 229792 214069 198960 147436 131054
13921 131054 133773 86103 45928 56992 67413 77339 49584 20280 14651 -14180 -12262 17434
13909 17434 67572 122566 138415 126562 112801 58333 37516 97376 108128 6421 -68064
$$ packed form
13989C32105q226L6381Q0690K7581N2878P9671P3291J03564J7703J8065O3811
13978H77514M7844M2402J9412j2121m5877J1431M2799l5438l9156r4172o8161
13967G46477n7771m4966m747j6870N656J3339n6969J0378M4817J3594m3397L6965
13955F46506M9236L6622L727k1940K409n633J3885Q4358R8911L6820L0300k0181
13943I55020p717J4482m4766j00769q9377m1553p7809l6738k5351m5658j30943
13932C68821j10816l5679M2941k7466l2914K916K1989j5723j5109n1524j6382
13921A31054K719m7670m0175J1064J0421R926k7755k9304n629k8831J918K9696
13909A7434N0138N4994J5849j1853j3761n4468k0817N9860J0752j01707p4485
$$ plain form
13898 -68064 9227 24265 29724 79036 90079 49172 58926 34023 -568 28376 60823 82031
13886 82031 78152 66382 4679 -36736 -59077 2967 31316 53250 -12759 -39214 -36741 1667
13874 1667 -4779 14698 53966 18261 33895 75098 52519 41804 49800 15558 40153 42291
13862 42291 29856 66385 41929 7080 54583 41605 -29248 -7590 19137 43692 82419 33379
13850 33379 -12542 8868 -22387 3503 42012 82804 98553 50442 20201 15415 18672 20857
13838 20857 9375 16038 34344 7167 52578 119752 104579 56576 10254 -9703 6323 -57222
13826 -57222 -65853 20772 53659 42416 -35255 -54037 20348 54965 57740 29826 15824 -6561
13814 -6561 -10063 481 -75 21620 41290 67777 73959 71396 63709 16437 -14020 33301 58306
$$ packed form
13898f8064P7291J5038N459M9312J1043m0907R754k4903l4591K8944L2447K1208
13886H2031l879j1770o1703m1415k2341O2044K8349K1934o6009k6455K473L8408
13874A667o446J9477L9268l5705J5634M1203k2579j0715P996l4242K4595K138
13862D2291j2435L6529k4456l4849M7503j2978p0853K1658K6727K4555L8727m9040
13850C3379m5921K1410l1255K5890L8509M0792J5749m8111l0241m786L257K185
13838B0857j1482O663J8306k7177M5411O7174j5173m8003m6322j9957J6026o3545
13826e7222q631Q6625L2887j1243p7671j8782P4385L4617K775k7914j4002k2385
13814f561l502J0544n56K1695J9670K6487O182k563p687m7272l0457M7321K5005
$$ plain form
13801 58306 68778 92676 91741 102061 109170 -5017 -19564 35798 51806 19812 7699 -9105
13789 -9105 -6855 28043 59566 46587 45060 27082 -6078 44 -13291 -29321 7874 100395
13777 100395 48191 36512 34967 7599 7317 43660 55654 46762 28991 -17138 -50686 -36135
13765 -36135 -7981 -18953 -35745 -37603 -28033 -6891 -15659 2949 23988 68172 95566 99512
13753 99512 47793 32911 46449 48200 61914 48840 48800 58177 43807 11889 15084 2631 29270
13740 29270 31018 16656 13284 18015 -13845 -78308 -119533 -108829 -24691 25338 6748 2131
13728 2131 32599 20811 14360 28870 46293 -14856 -14724 -476 -1392 53136 102339 24984 -26196
13715 -26196 -7605 35241 19029 -29363 -75849 -107927 -82842 -623 54689 17905 24586 38302
$$ packed form
13801E8306J0472K3898r35J0320P109j14187j4547N5362J6008l1994j2113j6804
13789i105K250L4898L1523j2979j527j7978l3160O122j3335j6030L7195R2521
13777A00395n2204j1679j545k7368k82L6343J1994q892j7771m6129l3548J4551
13765c6135K8154j0972j6792j858R570K1142q768J8608K1039M4184K7394L946
13753I9512n1719j4882J3538J751J3714j3074m0R377j4370l1918L195j2453K6639
13740B9270J748j4362l372M731l1860o4463m1225J0704Q4138N0029j8590m617
13728B131L0468j1788o451J4510J7423o1149J32J4248r16N4528M9203p7355n1180
13715b6196J8591M2846j6212m8392m6486l2078K5085Q2219N5312l6784O681J3716
$$ plain form
13703 38302 50919 22602 -7730 -10541 5291 -15176 -30387 -23769 -75127 -55800 -14628 -16542
13691 -16542 -7272 6781 27644 88219 126605 120441 71713 81015 126203 86685 101482 105120
13679 105120 95718 99752 61692 25139 26416 38915 43928 52379 64618 52856 29015 -22992
13667 -22992 -51426 -47543 -32125 -58292 -83743 -76368 -32070 -12356 -56050 -60724 -13104 16995
13655 16995 -25347 -36466 -38106 11256 32661 26245 60598 101317 125165 82443 57900 -12578
13643 -12578 -94522 -157830 -73123 -45507 -30168 -22456 -73467 -130332 -52985 13607 15172 17702
13631 17702 6623 -16336 -54939 -63973 -14673 42480 110608 55661 28971 33465 84716 103171
13619 103171 70727 37366 27808 77808 111861 79161 63269 55720 54198 55647 83317 94613
$$ packed form
13703C8302J2617k8317l0332k811J5832k0467j5211O618n1358J9327M1172j914
13691a6542R270J4053K0863O0575L8386o164m8728R302M5188l9518J4797L638
13679A05120r402M034l8060l6553J277J2499N013Q451J2239j1762k3841n2007
13667b2992k8434L883J5418k6167k5451P375M4298J9714m3694m674M7620L0099
13655A6995m2342j1119j640M9362K1405o416L4353M0719K3848m2722k4543p0478
13643a2578q1944o3308Q4707K7616J5339P712n1011n6865P7347O6592J565K530
13631A7702j1079k2959l8603r034M9300N7153O8128n4947k6690M494N1251J8455
13619A03171l2444l3361r558N0000L4053l2700j5892p549j522J449K7670J1296
$$ plain form
13607 94613 118934 104239 60424 31416 25637 -2084 11603 26268 17446 13967 -20644 4654
13595 4654 58782 72122 67652 65487 47567 -1522 -42659 -36603 -62717 2237 69056 47834
13583 47834 -18625 5321 27115 36208 33784 9986 -22379 -47294 -61353 -98312 -64269 -67793
13571 -67793 -79056 -67836 -16779 -8680 -25918 -36256 -72513 -97030 -108655 -79741 -8788 16556
13559 16556 24820 -10822 -52516 -21525 7107 30854 -35504 -106995 -97953 -64827 -46363 -3667
13547 -3667 14601 13702 -10793 5464 -53678 -40742 8903 36420 4124 -15512 -7184 -33700
13535 -33700 -12984 -2668 -7298 18821 20329 -13187 -46819 -67239 -60443 -5563 2369 -46509
13523 -46509 -59918 -32907 -33798 -43930 -17402 -8528 30620 74937 42932 -847 -15476 -49234
$$ packed form
13607I4613K4321j4695m3815k9008n779k7721J3687J4665q822l479l4611K5298
13595D654N4128J3340m470k165j7920m9089m1137O056k6114O4954O6819k1222
13583D7834o6459K3946K1794R093k424k3798l2365k4915j4059l6959L4043l524
13571f7793j1263J1220N1057Q099j7238j0338l6257k4517j1625K8914P0953K5344
13559A6556Q264l5642m1694L0991K8632K3747o6358p1491R042L3126J8464M2696
13547c667J8268q99k4495J6257n9142J2936M9645K7517l2296j9636Q328k6516
13535c3700K0716J0316m630K6119J508l3516l3632k0420O796N4880P932m8878
13523d6509j3409K7011q91j0132K6528Q874L9148M4317l2005m3779j4629l3758
$$ plain form
13511 -49234 -32912 -20571 8551 38103 54537 32483 -33409 -40789 -39778 -96288 -106735 -107494
13499 -107494 -83274 -64452 -42815 -45690 -57016 -91816 -85837 -64502 -20319 50280 39391 15285
13487 15285 5416 -25325 3470 36433 31202 23604 -17520 -2251 45348 54704 23404 -4968
13475 -4968 12282 35863 27289 62652 27033 -9318 -2685 -9733 -46245 -40803 -36584 -37579 -63184
13462 -63184 -36659 764 -51569 -61603 -55506 -29361 -4030 24972 48295 50838 47134 -20497
13450 -20497 28882 89295 84379 31512 -47293 -20524 -31389 3007 56477 70157 55392 9983
13438 9983 9756 6603 35692 1747 -10612 -7423 -18963 -63133 -82324 -41401 -28962 -25621 -24882
13425 -24882 4794 32844 47937 51176 46070 38532 -6575 -32295 3361 26135 40524 54229
$$ packed form
13511d9234J6322J2341K9122K9552J6434k2054o5892p380J011n6510j0447p59
13499a07494K4220J8822K1637k875j1326l4800N979K1335M4183P0599j0889k4106
13487A5285r869l0741K8795L2963n231p598m1124J5269M7599R356l1300k8372
13475d968J7250K3581q574L5363l5619l6351O633p048l6512N442M219r95k5605
13462f3184K6525L7423n2333j0034O097K6145K5331K9002K3323K543l704o7631
13450b0497M9379O0413m916n2867p8805K6769j0865L4396N3470J3680j4765m5409
13438I983k27l153K9089l3945j2359L189j1540m4170j9191M0923J2439L341P39
13425b4882K9676K8050J5093L239n106p538m5107k5720L5656K2774J4389J3705
$$ plain form
13413 54229 6732 -36937 -43092 -36466 -9875 22865 43696 8144 -21473 -24815 -67710 -65858
13401 -65858 -44909 -54850 -19977 5991 -5820 -50271 -45856 -47098 -93440 -31161 20507 21182 21262
13388 21262 27635 22680 7300 44117 42727 -18519 -3372 15900 -31416 6688 20453 -45548
13376 -45548 -60791 -40043 -31303 -39811 -9579 -28804 -12387 -22779 -37965 -398 -10413 -108064
13364 -108064 -127249 -93826 -47112 22042 -9520 -31258 -21722 -17000 -43927 -21182 17010 58925
13352 58925 101683 74582 67533 57607 8232 21373 27791 -1977 -52593 -38894 -69801 -63691
13340 -63691 -73805 -119122 -95312 -49603 18660 32974 -17353 -22260 23437 42350 71392 80415
13328 80415 70127 74342 50308 23346 35767 11575 -12757 -18618 43933 50368 18095 -19633
$$ packed form
13413E4229m7497m3669o155O626K6591L2740K0831l5552k9617l342m2895J852
13401f5858K0949r941L4873K5968j1811m4451M415j242m6342O2279N1668O75Q0
13388B1262O373m955j5380L6817j390o1246J5147J9272m7316L8104J3765o6001
13376d5548j5243K0748Q740q508L0232j9225J6417j0392j5186L7567j0015r7651
13364a08064j9185L3423M6714O9154l1562k1738R536M722k6927K2745L8192M1915
13352E8925M2758k7101p049r926m9375J3141O418k9768n0616J3699l0907O110
13340f3691j0114m5317K3810M5709O8263J4314n0327m907M5697J8913K9042R023
13328H0415j0288M215k4034k6962J2421k4192k4332n861O2551O435l2273l7728
$$ plain form
13316 -19633 20491 32175 58463 14653 31202 51290 12945 3954 6797 -9448 26457 13837
13304 13837 -25661 -80359 -64872 -17857 2346 -21798 -58393 -79163 -78989 21210 -6671 -67918
13292 -67918 -87544 -48096 -8385 19238 27489 24134 28273 -17234 -13357 20782 56289 78171
13280 78171 90243 40651 25738 20688 26791 -28116 -24345 -54751 -74358 -39605 -17539 -47987
13268 -47987 -56986 1206 57867 153019 113742 2103 -54022 -31191 7718 33703 57705 -23627
13256 -23627 -52165 -42683 -15914 -11297 29488 57110 56651 -2415 -40209 -31086 -3495 -24892 -59904
13243 -59904 -64953 -9901 36515 10786 -8170 34467 60869 26271 24600 29085 46338 54758
13231 54758 65206 48713 -660 -643 6488 -27268 36963 89060 115894 99549 57777 19991
$$ packed form
13316a9633M0124J1684K6288m3810J6549K0088l8345q991K843j6245L5905j2620
13304A3837l9498n4698J5487M7015K0203k4144l6595k0770J74J00199k7881o1247
13292f7918j9626L9448L9711K7623Q251l355M139m5507L877L4139L5507K1882
13280G8171J2072m9592j4913n050O103n4907L771l0406j9607L4753K2066l0448
13268d7987q999N8192N6661R5152l9277j11639n6125K2831L8909K5985K4002q1332
13256b3627k8538R482K6769M617M0785K7622m59n9066l7794R123K7591k1397l5012
13243e9904n049N5052M6416k5729j8956M2637K6402l4598j671M485J7253Q420
13231E4758J0448j6493m9373J7P131l3756O4231N2097K6834j6345m1772l7786
$$ plain form
13219 19991 51155 41173 13498 -37301 -59653 -47615 -82843 -76848 -30423 27190 33714 13044
13207 13044 -24592 -3470 24081 -24044 -97360 -118034 -107495 -103700 -99693 -40396 -3302 -39891
13195 -39891 -58501 -28179 9628 6990 -1242 38029 76370 69884 67861 85714 18544 -47080
13183 -47080 -48589 -50001 -49963 743 40177 27097 16548 29001 22662 -32953 -69865 -38500 4910
13170 4910 -3265 -5259 5663 15277 7475 -9339 15520 52300 5484 -39556 -30830 -97787 -117158
13157 -117158 -109110 -59665 -51825 -58405 -39832 -14618 -25033 -49569 -50733 -37760 -34026 -43920 369
13144 369 29470 8610 -40664 9995 23578 -3033 -40459 -12546 -19347 -65345 -62190 -62791 -30542
13131 -30542 -17697 -38258 -45897 -61129 -38845 -4136 19280 41832 85401 112303 49955 -40639
$$ packed form
13219A9991L1164r982k7675n0799k2352J2038l5228N995M6425N7613O524k0670
13207A3044l7636K1122K7551m8125p3316k0674J0539L795M007N9297L7094l6589
13195c9891j8610L0322L7807k638q232L9271L8341o486k023J7853o7170o5624
13183d7080j509j412L8N0706L9434j3080j0549J2453o339n5615l6912L1365M3410
13170D910q175j994J0922R614p802j6814K4859L6780m6816m5040Q726o6957j9371
13157a17158Q048M9445P840o580J8573K5214j0415k4536j164J2973L734r894M4289
13144C69K9101k0860m9274N0659J3583k6611l7426K7913o801m5998L155o01L2249
13131c0542J2845k0561p639j5232K2284L4709K3416K2552M3569K6902o2348r0594
$$ plain form
13119 -40639 -60431 -57911 -40998 9961 19897 9541 -6001 -39488 -36529 50982 64582 49731
13107 49731 6735 -4720 30160 43771 40758 44965 32049 55999 61586 30222 5463 -17021
13095 -17021 -28162 -13869 -14825 -9892 -30016 -40294 -49570 -40686 3712 14995 5139 8084 13704
13082 13704 -6298 -21780 3381 17339 35073 7550 -46838 -79103 -72700 -45872 -7649 52868
13070 52868 86176 85557 68740 31866 21123 4244 1634 -4783 48966 86580 77684 92573 47880
13057 47880 2388 9560 -41322 -51124 -51616 -54879 -66744 -67241 -45848 23399 98392 64704 67615
13044 67615 53672 73410 114201 107625 65538 15231 34279 9168 -16904 2420 33952 61724
13032 61724 37169 -20905 -30112 -50408 -23741 5240 -8060 6099 41798 23343 38354 64945
$$ packed form
13119d0639j9792K520J6913N0959R936j0356j5542l3487K959Q7511J3600j4851
13107D9731m2996j1455L4880J3611l013M207j2916K3950N587l1364k4759k2484
13095a7021j1141J4293r56M933k0124j0278r276Q884M4398J1283r856K945N620
13082A3704k0002j5482K5161J3958J7734k7523n4388l2265O403K6828L8223O0517
13070E2868L3308o19j6817l6874j0743j6879k610o417N3749L7614q896J4889m4693
13057D7880m5492P172n0882r802m92l263j1865m97K1393O9247P4993l3688K911
13044F7615j3943J9738M0791o576m2087n0307J9048k5111k6072J9324L1532K7772
13032F1724k4555n8074r207k0296K6667K8981j3300J4159L5699j8455J5011K6591
$$ plain form
13020 64945 -1652 -19698 -24720 -18040 -2939 -12812 2427 24952 92631 137378 115209 96074
13008 96074 111267 91110 47262 60060 114645 117747 116343 155826 144177 133288 167200 201702
12996 201702 196382 163134 144651 62841 25402 29813 43144 57763 55183 53154 48006 76391
12984 76391 87146 21505 -45542 -10323 45994 15724 2438 9814 -28141 -17726 -32654 -57087
12972 -57087 -88511 -36424 -46146 -93330 -106569 -44876 -19177 -43484 -29990 -36040 -26009 -23414
12960 -23414 56215 83244 54030 29942 11460 9258 40394 29324 69425 80134 71289 46976
12948 46976 46446 61517 28065 5837 54750 98529 66759 -5446 -8642 42089 36514 -35676
12936 -35676 -74088 -28437 22778 45128 -2280 6899 26284 68621 81388 35313 -5962 -82886
$$ packed form
13020F4945o6597j8046n022O680J5101r873J5239K2525O7679M4747k2169j9135
13008I6074J5193k0157m3848J2798N4585L102j404L9483j1649j0889L3912L4502
12996B01702n320l3248j8483q1810l7439M411J3331J4619k580k029n148K8385
12984G6391J0755o5641o7047L5219N6317l0270j3286P376l7955J0415j4928k4433
12972e7087l1424N2087r722m7184j3239O1693K5699k4307J3494o050J0031K595
12960b3414P9629K7029k9214k4088j8482k202L1136j1070M0101J0709q845k4313
12948D6976n30J5071l3452k2228M8913M3779l1770p2205l196N0731n575p2190
12936c5676l8412M5651N1215K2350m7408R179J9385M2337J2767m6075m1275p6924
$$ plain form
12924 -82886 -86441 -51451 -9714 37430 74500 73587 56464 53228 -83 8123 10161 -15250 28613
12911 28613 36984 36872 53071 78510 72811 67066 51648 13329 -21338 -38852 8587 15877 -16727
12898 -16727 -40917 -110896 -137962 -32475 45203 69915 45217 8763 -28221 -56067 -45943
12887 -45943 -75712 -66665 -43450 -79853 -38110 -6650 28473 69561 71622 34568 31276 27774
12875 27774 66186 89902 55447 43969 41043 41867 -7227 -18819 2248 -17620 -14893 10394
12863 10394 8904 25627 30890 -27318 -99526 -118229 -106756 -92692 -77432 -40300 -8170 -23891
12851 -23891 -52522 -61456 -81641 -74149 -4896 44153 27804 -27171 1307 22024 68066 72586
12839 72586 29990 -51048 -71995 -78720 -88403 -64656 -65606 -75933 -92024 -41972 -10135 -33645
$$ packed form
12924h2886l555L4990M1737M7144L7070r13j7123l236n3311Q206K038k5411M3863
12911B8613Q371j12J6199K5439n699n745j5418l8319l4667j7514M7439P290l2604
12898a6727k4190o9979k7066J05487P7678K4712k4698l6454l6984k7846J0124
12887d5943k9769R047K3215l6403M1743L1460L5123M1088K061l7054l292l502
12875B7774L8412K3716l4455j1478k926Q24m9094j1592K1067j9868K727K5287
12863A0394j490J6723N263n8208p2208j8703J1473J4064J5260L7132L2130j5721
12851b3891k8631q934k0185P492O9253M9049j6349n4975K8478K0717M6042M520
12839G2586m2596q1038k0947o725r683K3747r50j0327j6091N0052L1837k3510
$$ plain form
12827 -33645 -72492 -13932 69093 52207 -15110 23782 23511 -56140 -9925 22946 20604 3388
12815 3388 10469 2588 39254 74742 57467 27680 43777 50813 46093 -27126 -64041 -26872 -16829
12802 -16829 10387 -14545 -30535 4312 50121 100155 58612 -4100 19136 -26308 -27236 2212
12790 2212 -5530 -8228 -16517 -5369 9310 -20358 -33063 -16698 23393 44299 22034 22508 44210
12777 44210 52787 42215 43173 12401 15461 -32940 -21727 -43911 -44425 -2474 10903 10510 -13631
12764 -13631 -1422 -11893 -36 -4454 11214 -3061 66333 102122 48611 37776 70833 44874
12752 44874 26335 -9119 6145 -7879 8034 10989 23079 -2295 -44113 -35395 30206 4601
12740 4601 -1743 -10531 -7973 11673 37182 -1142 21177 65097 97235 -2525 -85602 -26366
$$ packed form
12827c3645l8847N8560Q3025j6886o7317L8892k71p9651M6215L2871k342j7216
12815C388P081p881L6666L5488j7275k9787J6097P036m720p3219l6915L7169J0043
12802a6829K7216k4932j5990L4847M5809N0034m1543o2712K3236m5444r28K9448
12790B212p742k698q289J1148J4679k9668j2705J6365M0091K0906k2265M74K1702
12777D4210Q577j0572R58l0772L060m8401J1213k2184n14M1951J3377l93k4141
12764a3631J2209j0471J1857m418J5668j4275O9394L5789n3511j0835L3057k5959
12752D4874j8539l5454J5264j4024J5913K955J2090k5374m1818Q718O5601k5605
12740D601o344q788K558J9646K5509l8324K2319M3920L2138r9760q3077N9236
$$ plain form
12728 -26366 1264 828 -6727 12687 22336 -44694 -127449 -94815 -1709 29118 -15745 -4169
12716 -4169 -16432 -19203 -56601 -47268 -65404 -56824 292 -16468 -49889 -27335 9953 42177
12704 42177 79331 96019 93488 4497 -8491 6981 10308 9184 -20708 -29668 -21036 -14607 -24202
12691 -24202 -4598 -11217 -36544 -29262 -37867 -62551 -94873 -104856 -120404 -100430 -19637 11087
12679 11087 -46154 -23220 1230 -39933 -30359 -16055 -13801 -4949 -8139 -577 -8061 18199 99701
12666 99701 102531 45597 -7421 -7296 16858 17198 -12359 -55022 -58024 -24186 58895 95856 63338
12653 63338 26988 23267 -7389 -50134 -61583 -86213 -58147 -10824 -56185 -57894 -9179 52750
12641 52750 25393 26223 25566 29443 32118 32052 53194 107712 46135 -23359 -3819 -17423 4726
$$ packed form
12728b6366K7630m36p555J9414R649o7030q2755L2634R3106L0827m4863J1576
12716d169j2263k771l7398R333j8136Q580N7116j6760l3421K2554L7288L2224
12704D2177L7154J6688k531q8991j2988J5472L327j124k9892q960Q632O429r595
12691b4202J9604o619k5327P282q605k4684l2322r983j5548J9974Q0793L0724
12679A1087n7241K2934K4450m1163R574J4304K254Q852l190P562p484K6260Q1502
12666I9701K830n6934n3018J25K4154L40k9557m2663l002L3838Q3081L6961l2518
12653F3338l6350l721l0656m2745j1449k4630K8066M7323m5361j709M8715O1929
12641E2750k7357Q30o57L877K675o6K1142N4518o1577o9494J9540j3604K2149
$$ plain form
12628 4726 26657 41697 21826 2047 -7787 -10434 21292 29331 36526 27093 17658 -34299 -16384
12615 -16384 -29744 -52433 -43891 -41741 -42441 -33331 -26082 -3221 -8682 33994 56803 1475 19353
$$ packed form
12628D726K1931J5040j9871j9779r834k647L1726Q039P195r433r435n1957J7915
12615a6384j3360k2689Q542K150p00R110P249K2861n461M2676K2809n5328J7878
$$ [...]
##END NTUPLES=NMR SPECTRUM
##END=
