##TITLE=Analysis number 312185
Compound Code cc 12604
Book Reference 422/87
Project Code qc-cat
Chemist Name robb
##JCAMPDX= 6.0         $$ Bruker NMR JCAMP-DX V2.0
##DATA TYPE= NMR SPECTRUM
##DATA CLASS= NTUPLES
##ORIGIN= Bruker BioSpin GmbH
##OWNER= NMR
$$ XWIN-NMR		Version 3.5
$$ Wed Jul 27 13:17:21 2005 GMT Daylight Time (UT+1h)  MAYBRIDGE\NMR@NMR_250MHZ
##.OBSERVE FREQUENCY= 250.131544655141
##.OBSERVE NUCLEUS= ^1H
##.ACQUISITION MODE= SIMULTANEOUS (DQD)
##.ACQUISITION SCHEME= undefined
##.AVERAGES= 16
##.DIGITISER RES= 18
##SPECTROMETER/DATA SYSTEM= dpx250
##.PULSE SEQUENCE= zg30
##.SOLVENT NAME= CDCl3
##.SHIFT REFERENCE= (INTERNAL, CDCl3, 0, 16.522)
##AUDIT TRAIL= $$ (NUMBER, WHEN, WHO, WHERE, WHAT)
$$ ##TITLE= Audit trail, XWIN-NMR		Version 3.5
$$ ##JCAMPDX= 5.01
$$ ##ORIGIN= Bruker BioSpin GmbH
$$ ##OWNER= NMR
$$ C:\u/data/dgb/nmr/ADRS/6700/pdata/1/auditp.txt
$$ ##AUDIT TRAIL=  $$ (NUMBER, WHEN, WHO, WHERE, WHAT)
(   1,<2005-07-27 13:16:58.55 +100>,<MAYBRIDGE\NMR>,<NMR_250MHZ>,
      <created by zg, POWCHK disabled, PULCHK disabled
       configuration hash MD5:
       62 19 C7 07 E1 42 D1 B7 37 6C 3D D0 77 39 F9 E6
       data hash MD5: 64K
       52 25 40 FD 42 B9 2A 4D 43 70 73 F7 A1 86 8E 4B>)
(   2,<2005-07-27 13:17:12.08 +100>,<MAYBRIDGE\NMR>,<NMR_250MHZ>,
      <Start of raw data processing
       ef LB = 0.3 FT_mod = 6 PKNL = 1 SI = 32K 
       data hash MD5: 32K
       8D 2D 57 0A 0E E4 C4 A1 52 E7 C2 D3 2A 3F 8B 35>)
(   3,<2005-07-27 13:17:13.97 +100>,<MAYBRIDGE\NMR>,<NMR_250MHZ>,
      <apk 
       data hash MD5: 32K
       24 8F 5D B2 5B DF 01 C8 14 5F 02 47 47 97 3A C0>)
(   4,<2005-07-27 13:17:14.72 +100>,<MAYBRIDGE\NMR>,<NMR_250MHZ>,
      <abs ABSG = 5 
       data hash MD5: 32K
       81 16 F5 A7 43 44 90 9F 32 98 94 41 AE 11 C2 8E>)
$$ ##END=
$$ 
$$ hash MD5
$$ 2E 84 08 7B 56 74 67 E6 39 34 83 E2 C3 28 4F 69
##$RELAX= 
##$RELAX= 
##$RELAX= 
##$RELAX= 
##$RELAX= 
##$RELAX= 
##$RELAX= 
$$ Bruker specific parameters
$$ --------------------------
##$DU= <C:\u>
##$EXPNO= 6700
##$NAME= <ADRS>
##$PROCNO= 1
##$TYPE= <nmr>
##$USER= <dgb>
##$AMP= (0..31)
100 100 100 100 100 100 100 100 100 100 100 100 100 100 100 100 100 100 
100 100 100 100 100 100 100 100 100 100 100 100 100 100 
##$AQSEQ= 0
##$AQ_mod= 3
##$AUNM= <au_zg>
##$AUTOPOS= <15 >
##$BF1= 250.13
##$BF2= 250.13
##$BF3= 250.13
##$BF4= 250.13
##$BF5= 500.13
##$BF6= 500.13
##$BF7= 500.13
##$BF8= 500.13
##$BYTORDA= 1
##$CFDGTYP= 0
##$CFRGTYP= 5
##$CHEMSTR= <none>
##$CNST= (0..31)
1 1 145 1 1 1 1 1 1 1 1 1 1 1 1 1 1 1 1 1 1 1 1 1 1 1 1 1 1 1 1 1 
##$CPDPRG= <>
##$CPDPRG1= <>
##$CPDPRG2= <>
##$CPDPRG3= <>
##$CPDPRG4= <mlev>
##$CPDPRG5= <mlev>
##$CPDPRG6= <mlev>
##$CPDPRG7= <mlev>
##$CPDPRG8= <mlev>
##$CPDPRGB= <>
##$CPDPRGT= <>
##$D= (0..31)
0 1 0 0 0 0 0 0 0 0.06 0 0 0 0 0 0 0.0002 0 0 0 0 0 0 0 0 0 0 0 0 0 0 
0 
##$DATE= 1122466617
##$DBL= (0..7)
120 120 120 120 120 120 120 120 
##$DBP= (0..7)
150 150 150 150 150 150 150 150 
##$DBP07= 0
##$DBPNAM0= <>
##$DBPNAM1= <>
$$ [...]
##$SUBNAM7= <"">
##$SUBNAM8= <"">
##$SUBNAM9= <"">
##$SW= 20.6930455092707
##$SWIBOX= (0..15)
0 0 3 0 0 0 0 0 0 0 0 0 0 0 0 0 
##$SW_h= 5175.983436853
##$TD= 65536
##$TD0= 1
##$TE= 295.16
##$TE2= 300
##$TE3= 300
##$TEG= 300
##$TL= (0..7)
0 120 120 120 120 120 120 120 
##$TP= (0..7)
150 150 150 150 150 150 150 150 
##$TP07= 0
##$TPNAME0= <>
##$TPNAME1= <>
##$TPNAME2= <>
##$TPNAME3= <>
##$TPNAME4= <>
##$TPNAME5= <>
##$TPNAME6= <>
##$TPNAME7= <>
##$TPOAL= (0..7)
0.5 0.5 0.5 0.5 0.5 0.5 0.5 0.5 
##$TPOFFS= (0..7)
0 0 0 0 0 0 0 0 
##$TUNHIN= 0
##$TUNHOUT= 0
##$TUNXOUT= 0
##$USERA1= <user>
##$USERA2= <user>
##$USERA3= <user>
##$USERA4= <user>
##$USERA5= <user>
##$V9= 5
##$VALIST= <valist>
##$VCLIST= <CCCCCCCCCCCCCCC>
##$VD= 0
##$VDLIST= <DDDDDDDDDDDDDDD>
##$VPLIST= <PPPPPPPPPPPPPPP>
##$VTLIST= <TTTTTTTTTTTTTTT>
##$WBST= 1024
##$WBSW= 4
##$XGAIN= (0..3)
0 0 0 0 
##$XL= 0
##$YL= 0
##$YMAX_a= 768088
##$YMIN_a= -736537
##$ZGOPTNS= <>
##$ZL1= 120
##$ZL2= 120
##$ZL3= 120
##$ZL4= 120
##$ABSF1= 16.522
##$ABSF2= -4.171173
##$ABSG= 5
##$ABSL= 3
##$ALPHA= 0
##$AQORDER= 0
##$ASSFAC= 0
##$ASSFACI= 0
##$ASSFACX= 0
##$ASSWID= 0
##$AUNMP= <proc_1d>
##$AZFE= 0.1
##$AZFW= 0.1
##$BCFW= 0
##$BC_mod= 0
##$BYTORDP= 0
##$COROFFS= 0
##$CY= 12.5
##$DATMOD= 1
##$DC= 0
##$DFILT= <>
##$DTYPP= 0
##$F1P= 14.0000005364418
##$F2P= -0.99999901652339
##$FCOR= 0.5
##$FTSIZE= 32768
##$FT_mod= 6
##$GAMMA= 0
##$GB= 0
##$INTBC= 1
##$INTSCL= 1
##$ISEN= 128
##$LB= 0.3
##$LEV0= 0
##$LPBIN= 0
##$MAXI= 10000
##$MC2= 0
##$MEAN= 0
##$ME_mod= 0
##$MI= 0
##$NCOEF= 0
##$NC_proc= -2
##$NLEV= 6
##$NOISF1= 0
##$NOISF2= 0
##$NSP= 0
##$NTH_PI= 0
##$NZP= 0
##$OFFSET= 16.522
##$PC= 1
##$PHC0= -79.16769
##$PHC1= 5.439267
##$PH_mod= 1
##$PKNL= yes
##$PPARMOD= 0
##$PSCAL= 4
##$PSIGN= 0
##$REVERSE= no
##$SF= 250.13
##$SI= 32768
##$SIGF1= 0
##$SIGF2= 0
##$SINO= 400
##$SIOLD= 32768
##$SREGLST= <1H.CDCl3>
##$SSB= 0
##$STSI= 32768
##$STSR= 0
##$SW_p= 5175.98343685301
##$SYMM= 0
##$S_DEV= 0
##$TDeff= 65536
##$TDoff= 0
##$TI= <Analysis number 999999
Compound Code 99
Book Reference 9
Project Code 9>
##$TILT= no
##$TM1= 0
##$TM2= 0
##$TOPLEV= 0
##$USERP1= <user>
##$USERP2= <user>
##$USERP3= <user>
##$USERP4= <user>
##$USERP5= <user>
##$WDW= 1
##$XDIM= 32768
##$YMAX_p= 514760380
##$YMIN_p= -37656
$$ End of Bruker specific parameters
$$ ---------------------------------
##NTUPLES= NMR SPECTRUM
##VAR_NAME=  FREQUENCY,     SPECTRUM/REAL,   SPECTRUM/IMAG
##SYMBOL=    X,             R,               I
##VAR_TYPE=  INDEPENDENT,   DEPENDENT,       DEPENDENT
##VAR_FORM=  AFFN,          ASDF,            ASDF
##VAR_DIM=   32768,         32768,           32768
##UNITS=     HZ,            ARBITRARY UNITS, ARBITRARY UNITS
##FACTOR=    0.157963299565203, 1,           1
##FIRST=     4132.6476996994, 0,             0
##LAST=      -1043.33573715361, 0,           0
##MIN=       -1043.33573715361, -37656,      0
##MAX=       4132.6476996994, 514760380,     0
$$ Real data points
##PAGE= N=1
##DATA TABLE= (X++(R..R)), XYDATA
$$ [...]
19819b635k839m075m72j560K901j725l372P015N235l22l773n358j941K382K766
19804g773L142k007J844M51J494N55N851M524k798q648o401j910P244m39k71l780
19788h922l067N75l206l98K432J1423N744n496o011o787P03N616R083J767o199
19773b743o550J012m076M267J843J89L084O197J317j196r012l960n57l770L472
19758a0483P704Q421o919o728j81q13p72L152m213j927M902m156J462K832K922
19743d797o94M814R84m40l322J745J020L96l663j0717l879O261Q206K203n705
19728g588j446K261r76q74O54J273K831J896J68q08O824l270j258n608l372M822
19712d471O946n93j0483K253K200p45l630m378K666L61P80L955J372r49L106j424
$$ y = [-2635, -5474, -9549, -10021, -11581, -8680, -10405, -13777, -6762, -1527, -1849, -5622, -10980, -12921, -10539, -7773, -4631, -6638, -4794, -4343, -2849, -2294, 3557, 8081, 5283, -3365, -9766, -11676, -4432, -4871, -5142, -8922, -11989, -11414, -14620, -15018, -12586, -1163, 4581, -915, -6926, -13713, -13010, -7394, 1689, 3456, -2743, -9293, -8281, -12357, -8090, -6247, -6058, -2974, 3223, 4540, 3344, -5668, -9628, -10185, -13955, -10483, -2779, 5642, -1277, -8005, -8186, -8999, -9771, -6619, -10832, -12759, -7857, -12013, -10551, -7719, -4797, -5491, -677, 307, -133, -3455, -1710, -690, -294, -3957, -14674, -18553, -12292, -4086, -1883, -7588, -9034, -6773, -7749, -8623, -7969, -6696, -3865, -1969, -1801, -2609, 4215, 945, -313, -5921, -9293, -4471, 2475, 1882, -8601, -6348, -4148, -4893, -8523, -12901, -10235, -9874, -9094, -5139, -3767, -4716, -1610, -3034]
19696c034l778M167L1Q60K313k233p66j104N187n34K993m36J063o101n252p749
19680a4373R05O272m92n028K291L996N738l938K879M141N202m100J858n180j306
19665a135L237l107K9j704j397L995K224r745j480P925Q250N174qo476k345N77
19649D014L649o207m70M927j012j2961J347M371m260k91l421r098j632R901K334
19634h809j0824k804j109P461Q712N108j941l226n667q89K431M875K836m945k590
19619a1381M601l272l2K257Q569K991j368j517m525k253O5Q702L029J35N03L273
19603I777q33j911O04q653j122O349j291j242q06K146K491n785l750K145j99k961
19587e041L905K249m528n336k3j934L385M745J806M09O337n62m9k514m656n216
$$ y = [-3034, -6812, -2645, -2614, -1754, 559, -1674, -2440, -3544, 1643, 1109, 4102, 3666, 4729, -1372, -6624, -14373, -13468, -7196, -7688, -12716, -10425, -6429, -691, -4629, -1750, 2391, 7593, 3493, 5351, 171, -1135, 2102, -1005, -976, -2680, -4077, -82, 2142, -7603, -9083, -1158, 7092, 12266, 12258, 5782, 3437, 4014, 7663, 1456, 986, 5913, 4901, -8060, -6713, -2342, -6602, -6893, -10314, -19412, -21044, -11143, -8809, -19633, -22437, -23546, -16085, -7373, -2265, -4206, -7432, -13099, -13988, -11557, -6682, -3846, -8791, -11381, -6780, -10052, -10084, -7827, 742, 3733, 2365, 848, -3677, -5930, -5865, 2837, 5866, 6001, 6504, 9777, 8944, 7033, 7637, -1016, -2138, 4211, 2920, 1678, 872, 3018, 5509, -276, -4026, -1881, -2080, -5041, -1136, 1113, -3415, -8751, -8774, -10708, -7323, -2578, -772, -363, 5974, 5412, 5363, 2849, -1807, -7023]
19571g023n630l154P33J0464m843l757j577K760M584J484k239j552r443l86J0677
19556h902L65o182K323O479o843l85P874L831k872r57J124L571j984K053R11p936
19540g530P150P346k137j053J584n049K452J693j578r71k866k930k535L35N778
19525c11n654m732j97j484K260o875j765N104L51M442M011j450Q54p445k011J2080
19509b822M911P38k486k345n979j755q69k095j713K740P654M787K912r51j036
19494A691o030J024N161j315n098o477k321K80N361L990r63m607M50K512O579
19479B37Q920n57p281l950k163M359L336L479j160j066j856k935J311l940M52
19464b814m52N731K013l018j078j010l579M209N515n723m679J953L276k817n83
$$ y = [-7023, -12653, -15807, -15074, -4610, -9453, -13210, -14787, -12027, -7443, -5959, -8198, -9750, -19193, -19579, -8902, -8537, -14719, -12396, -5917, -12760, -13145, -5271, -1440, -4312, -5269, -4145, -574, -2558, -505, 406, -7530, -380, 6966, 4829, 3776, 5360, 311, 2763, 4456, 2878, 1907, -959, -3889, -6424, -6089, -311, -5965, -10697, -10894, -12378, -10118, -16993, -18758, -13654, -13303, -8861, -4850, -6300, -5446, -12891, -14902, -2822, 2089, 2827, 341, -2004, -7983, -9738, -10607, -12702, -14415, -11675, -4021, 766, 3678, 2727, 1691, -4339, -3315, 1846, 531, -4567, -11044, -13365, -13085, -7724, -3734, -4697, -9304, -8854, -6342, 237, 9157, 8600, 1319, -2631, -4794, -435, 2901, 6380, 5220, 4154, 2298, -637, 674, -3266, -2814, -3266, 2465, 4478, 1460, 382, -628, -4207, 2, 5517, -206, -4885, -2932, 344, -2473, -3056]
19449c056R67j759k588J30R56J841K44o289N785J093k896k72p56L76R84j973o453
19432a3666n987k62N590P409k913l923O964N126J523n735k199l251p736k909R899
19417a2070N970k000J226j132k863o60J670K265m14j885M863K065L65L126Q08
19402A334q159k084N305k445o56j123M996o528O6j804j065K041K193P857L198
19387C126k849m719k798l209n061K669O81m760l74O595m367n774M548j10j037
19372a7439k416K10O289L339N558K500L341j519k681q899k067K802K654L206k234
19357g356l773p105Q816O846N920R18p769N55N646j165m06O140M038j825l986
19342E494k866M440k475q213K265K578N721m826r6k936K841O637k610n15k735
$$ y = [-3056, -2089, -3848, -6436, -6306, -5350, -3509, -3265, -9554, -3769, -2676, -5572, -5844, -6600, -6224, -5240, -7213, -13666, -19653, -19915, -14325, -6916, -9829, -13752, -6788, -1662, -139, -5874, -8073, -11324, -19060, -21969, -12070, -6100, -8100, -6874, -8006, -10869, -11529, -9859, -7594, -8008, -9893, -5030, -2965, -2600, 526, 1334, -6825, -8909, -3604, -6049, -6705, -7828, -2832, -9360, -9294, -11098, -12163, -10122, -7929, -72, 3126, 277, -4442, -7240, -10449, -15510, -12841, -12160, -16920, -17294, -10699, -15066, -20840, -16292, -16402, -17439, -19855, -19645, -13356, -10017, -4459, -1959, 1382, -137, -2818, -11717, -13784, -10982, -8328, -5122, -7356, -11129, -18234, -9418, -2572, 3348, 4266, -3503, -2948, 2698, 1533, 1127, 7267, 11305, 9480, 5494, 2628, 7068, 4593, -3620, -1355, 1223, 6944, 2118, 2022, -914, 1927, 8564, 5954, 5439, 2704]
19327B704l836j5J537J225M030M9L213j383r411p396L241K596L540J154n710n042
19311i504J097L808k745j466k352K594L357k012L339O637J306n950n275j202k996
19296a1364N627L27J757M026J244q187K567M08L368j916r051J086P190n601J665
19281f854O49n097J721M086m74m224P444K761l167M31M136j2075o010N547N210
19266e916Q153J473J034o598l039M333K975j077k120M021J1130R64J551l145m512
19251I227q27K25r57Q943M687m988p30o517l222L291N054K230k850n878p696P82
19235G74J193M691L055m077m260Q68L053n241n154q92N509J0783k91j0806n603
19220f398J778k298n18P335l577m907R18K193M17r957N96N493J923N047K037K030
$$ y = [2704, -1132, -1147, 390, 1615, 5645, 5694, 8907, 7524, -1887, -9283, -6042, -3446, 94, 1248, -4462, -9504, -8407, -4599, -7344, -8810, -11162, -8568, -5211, -7223, -3884, 2753, 4059, -1891, -7166, -8368, -11364, -5737, -5410, -3653, 373, 1617, -6570, -4003, -3595, -227, -2143, -11194, -10108, -2918, -8519, -6854, -6205, -11302, -9581, -5495, -5969, -10193, -2749, 12, -3155, -2724, 1412, -10663, -16673, -11126, -5916, 2237, 3710, 4744, -1854, -4893, -560, 2415, 1338, -782, 3239, 14369, 15333, 16884, 13739, 9227, 8400, 8625, 7668, 16611, 21298, 16310, 15580, 9063, 5841, 9132, 14186, 16416, 13566, 7688, -8, 774, 1967, 6658, 9713, 5636, 1376, 2244, 5297, 56, -5098, -5990, -481, 10302, 10011, -795, -6398, -4620, -6918, -7436, -101, -3678, -8585, -7667, -5474, -5057, -15014, -14418, -8925, -7002, -1955, 82, 2112]
19204B112O437j694m110P316k130j4555j0076k022N119P232K42l846Q14K238Q20
19189f103M936j405p186j326P13J97k253l086q11M29N611M911o282J715l287Q71
19173a2356O11O850P362L562m892n525j125P180J542n585O86j039k156R1J386
19158c408R50j988p011N94O652M142J106K018j686l985m117L547J3538L724l446
19143A0630k747l665k679m317m385N496K749k821k447Q205l121o531J551j783
19129e865k94j551J425l436r97Q26M430j576L445M056K816L646j358n876r7J357
19113I51k79K46N15m104k933P394K716j172J207l279m908o133R96Q44r405K034
19097a5310L364q169O882O248k427k158J582L279M193j851n43K152k156p12K767
$$ y = [2112, 8549, 6855, 2745, 10061, 7931, -6624, -16700, -18722, -13603, -6371, -6129, -9975, -9161, -6923, -6103, -1167, -2572, -9758, -11084, -10371, -10174, -12427, -15513, -16324, -15895, -10284, -5373, -11655, -9940, -13227, -12356, -11745, -4895, 2467, 6029, 1137, -4388, -5513, 1667, 3209, -2376, -1690, -2729, -4885, -4794, -3408, -2458, -4446, -11457, -10863, -4211, -69, 1037, 3055, 1369, -2616, -6733, -3186, 10352, 14076, 10630, 7883, 4218, 1539, -2778, -7163, -1667, 1082, -1739, -4186, 4019, 898, -5633, -4082, -5865, -6159, -7710, -6285, -9721, -10718, -9892, -5462, -7038, -3593, 463, 3279, 6925, 5567, -309, -406, 951, 672, 918, 1433, -2671, -5604, 1790, 4506, 3334, 4541, 1262, -3646, -9779, -8783, -7939, -17344, -15310, -11946, -20115, -13233, -6985, -9412, -11570, -9988, -6709, -2516, -4367, -4910, -2758, -4914, -5626, -2859]
19082b859K054m364l847l19O803L473R14k772K422k453l10j870l360k760p238
19067a6486L71J567j358K284n92m156O222N932O323l522q995j042M433L920N33
19052d566R9k010J200Q347l384n559j698O13m027k41J2728J861J007j03k969n307
19036d009n771L020j252J96K409k914q551j360P259N512J88j538L136P15q96M486
19020F30m191K289J293p930n148O293K396L768L781k79k998p46L530q52j775r708
19004i647J979M638n90o356R31P462J624l723K817k264k213j622K016q8J503K336
18988a197j957l293m822J561L1J540m081n454j623J161j931m80K728K342p43P515
18972h703P086J224J329l0j410J412j077j705L483K100M664m116n405o769l539
$$ y = [-2859, -805, -5169, -9016, -9335, -2532, 941, 1855, -917, 1505, -948, -1258, -3128, -6488, -9248, -16486, -16115, -14548, -15906, -13622, -14214, -18370, -12148, -6216, 107, -3415, -12410, -13452, -9019, -5099, -4566, -4467, -6477, -5277, 3070, -314, -5873, -7571, -6958, -10985, -11226, 1502, 3363, 4370, 4267, 1298, -4009, -9780, -6760, -8012, -7816, -5407, -8321, -16872, -18232, -10973, -5461, -5273, -6811, -3675, -2960, -3856, 630, -3561, -1272, 21, -7909, -13057, -6764, -4368, -600, 3181, 2902, -96, -842, 2688, 1836, 61, -9647, -7668, -3030, -3620, -9976, -9045, -1583, 41, -3682, -865, -3129, -5342, -6964, -4948, -5036, -3533, -1197, -3154, -6447, -11269, -9708, -9677, -8137, -12218, -17672, -19295, -18134, -20065, -20545, -17817, -15475, -16218, -8703, -1617, -393, 936, 906, -504, 908, -169, -1874, 1609, 3709, 8373, 4257, -1148, -7917, -11456]
18957a1456L718L236L64n849J157L958Q41J765J95m94K249J162j186K84J816Q83
18941B643N15P97N162j102j118k108o122k443L34k817Q014K369k98k533j742o75
18925a124n080K721M509l455o533J151J257J01k184P11J006K35j80P76n1j707
18909g847r5K559M368q029K77L609J277J572q94Q9o540j266Q996K672r42K956
18893B762J585l619N438L383j132l915k470L316L722l273m313R21K602M093J0348
18878A9448n749j4366j3393l891Q556Q407M482k39k06oq504J365M374P93M3l092
18862a978j532L245m627k635L75j268n171J785M659O841k613j196m94m312n146
18847a4067l468k240L648P392J2058L13l840m928K330P352q81n588j218o421n468
$$ y = [-11456, -7738, -4502, -4138, -9987, -8830, -4872, -4031, -2266, -2071, -2565, -316, 846, -340, -56, 1760, 2643, 3158, 3955, 9117, 8015, 6897, 4789, -1333, -3776, -3442, -6259, 1755, 4124, 3826, 1293, -449, -1124, -6204, -3483, 1026, -2429, -8962, -7811, -6554, -6453, -8637, -7926, -6920, -6685, -6865, -6089, -6140, -7847, -7942, -5383, -1015, -9044, -8767, -5158, -3881, -2309, -3203, -3114, -9654, -10920, -1924, 748, -194, 2762, 4347, 728, 6166, 9549, 8417, 4502, 2032, 5348, 9070, 5797, 1484, 2405, 5007, 9100, 19448, 13699, -667, -14060, -17951, -9395, -988, 3494, 3255, 3049, 3043, -5461, -4096, 278, 1071, 1114, -1978, -3510, -265, -4892, -7527, -7152, -8420, -13591, -11806, -7147, -306, -2919, -4115, -4609, -8921, -14067, -17535, -19775, -16127, -8735, 3323, 3636, -204, -5132, -2802, 4550, 3669, -1919, -3137, -9558, -15026]
18832a5026J364L293N206j154J646j946j674R62M732k362j801L939K461K121N76
18817B337j287N083K774J151k116n796k789K534L81j947M563L057R54j61j235
18802G503k22m904m075N868P381Q780M311J227J1951K0338K6891L1686K4215R618
18788A50568n630j5470k1673k3500k7678j9633r923n822l289K495o311l335K971
18775A3770n256J458l724N913O417M557K832O122K1239J6301M101o422j6295j7384
18761C3629j3929q565o478m100m537M297J4208p083k940L661n485L288M142j172
18747H936j561l896m886J0740j514m045M260l809p119j25K664mM550n969j0724
18732a2502K919R04J734k058K206L408L694L359M51o28J407j2318j694L381M812
$$ y = [-15026, -13662, -10369, -5163, -6317, -4671, -6617, -8291, -7329, -2597, -4959, -6760, -2821, -360, 1761, 2337, 1050, 6133, 8907, 10058, 7942, 2146, -643, 1891, 2272, 325, 4888, 7945, 8899, 8738, 7503, 7281, 2377, -1698, 4170, 11551, 20331, 24642, 25869, 37820, 58158, 85049, 116735, 140950, 150568, 144938, 129468, 107795, 84295, 56617, 36984, 27061, 21239, 17950, 20445, 14134, 10799, 13770, 8514, 9972, 6248, 12161, 18578, 23135, 25967, 32089, 53328, 69629, 73730, 67308, 51013, 33629, 19700, 11135, 4657, 557, -3980, 317, 14525, 7442, 4502, 8163, 2678, 5966, 10108, 8936, 7375, 3479, -1407, 9333, 7819, 3774, 8034, 4225, -2894, -3019, -355, -359, 4191, -1778, -12502, -9583, -8679, -6945, -9003, -6797, -3389, 305, 3664, 4115, 3487, 4894, -7424, -9118, -5737, -925]
18717i25K420l026l639o074r54K61n641N848M061M177K860j522k348k965k15K269
18701e413L846O519K470l942q404l83K319M818J935K174R16m417r403K500M102
18686c63k111o806J162L205m010l704M860j061j356R522M760m296k533m85M131
18671I15Q99m510L455J043m260r43L203n762P637L525r43n001J320k094r64K199
18655b81j318o131P34M721k190m16m733K606P502M123M156l540p610J865j999
18640b511j994P024J566q705J219O729M321L03o73l918J330N889l849q203l390
18625d862J941k545m47k320o816m751L922K298J403J411K72J0247M890o576j310
18610c243J711J672P65P99J630p029q7L555M705o896o521l118j603N059P773J552
$$ y = [-925, 1495, -1531, -5170, -11244, -12198, -11937, -17578, -11730, -7669, -3492, -632, -2154, -4502, -7467, -7682, -5413, -1567, 4952, 7422, 3480, -4924, -5307, -2988, 1830, 3765, 5939, 6855, 2438, -6965, -4465, -363, -2474, -9280, -8118, -4913, -8923, -12627, -7767, -8828, -10184, -662, 4098, -198, -2731, -3216, 915, 1814, -2696, 759, 1802, -2458, -3401, -198, -5960, 1677, 5202, 4259, -742, 578, -1516, -2480, -281, -1599, -7730, -6996, -2275, -4465, -4881, -9614, -7008, 494, 4617, 8773, 5233, -2377, -512, -2511, -4505, 2519, 4085, -4620, -3401, 3328, 7649, 7952, 7279, 3361, 4691, 10580, 6731, -1472, -4862, -2921, -5466, -5913, -8233, -15049, -19800, -15878, -13580, -12177, -10766, -10494, -247, 4643, -1933, -3243, -1532, 140, 905, 1704, 3334, -3695, -3782, -227, 4478, -2418, -8939, -12057, -13660, -8601, -828, 724]
18594G24j121l427O32J077m189M886k728k032L106Q369k427l613O196n211q281
18579h039q202L583N951k932l350l459J609N161M506J463j631K492k043j320N107
18564a104L64n049n858k278K369o272L366K457L409O513J895K255o87k714k61
18549a595k960k078j530K454l427L431P005n277l254k3k22p93J209K033O218J556
18533B747l841j533k062L282M02k080M92n869l474N436j496o074J42J337N382
18518g209M749M19R15R21R88n516Q81K243p91J231j544Q82j744j468R01o353l304
18501a3799J0868J256l040k34Q73Q536j017n124p87n457K311N723K423n310l245
18486f023r45k66r11L349J570j743L396j137m196j695L780J6q46K216J398K724
$$ y = [724, -397, -3824, -3192, -2115, -6304, -1418, -4146, -6178, -3072, 5297, 2870, -743, 5453, 242, -8039, -16241, -12658, -6707, -9639, -12989, -16448, -14839, -9678, -5172, -3709, -5340, -2848, -4891, -6211, -1104, -740, -5789, -11647, -13925, -11556, -17828, -14462, -12005, -8596, -2083, -188, 2067, 1380, -1334, -1595, -4555, -6633, -8163, -5709, -9136, -5705, 1300, -3977, -7231, -7254, -7476, -8269, -7060, -5027, 1191, 2747, -1094, -2627, -4689, -1407, -1005, -3085, -2593, -8462, -11936, -6500, -7996, -14070, -13928, -12591, -7209, -2460, -2041, -1126, -205, 783, -4733, -3852, -1609, -2400, -1169, -2713, -1831, -3575, -5043, -4142, -10495, -13799, -2931, -1675, -4715, -4949, -4076, 4460, 3443, -1681, -2468, -7925, -5614, 109, 2532, -2778, -6023, -6968, -7234, -8145, -4796, -3226, -4969, -1573, -2710, -6906, -8601, -4821, -4805, -5651, -3435, -2037, 687]
18470F87k737J392J850j869n627j654L254N484M755m147n483l448k487P553Q27
18455a650J107J117k02j182j39o065J415L251J293L582J182m074n195l315m18
18440i293m880R645O602l494N165M603k731j542p098m531K244n34L243o58K427
18425h32J153J886L106k280p583M552N663k914k430L819m639l816j575J70j365
18410g085o89L933l868m321J599O87L653k34k331L876K863j78j264R89J90n492
18394g672L942J953O813R03k556q02l223M623k817l996M190K118j212j410J213
18379B067l378r92N844O225n27r958k356L894j083N265K15p322j214j74J114j209
18363c589l15O214l526l713J602N790M257K144m856j488l75k35J666j31j559j88
$$ y = [687, -2050, -658, 1192, -677, -6304, -7958, -4704, 780, 5535, 1388, -4095, -7543, -10030, -2477, -1650, -543, 574, 372, -810, -949, -7014, -5599, -2348, -1055, 2527, 3709, -365, -5560, -8875, -9293, -14173, -4528, 2074, -1420, 3745, 8348, 5617, 4075, -3023, -7554, -5310, -5844, -2601, -3259, -832, 321, 2207, 5313, 3033, -4550, 2, 5665, 2751, 321, 4140, -499, -4315, -5890, -5720, -7085, -7774, -3841, -7709, -12030, -10431, -9744, -6091, -6325, -8656, -4780, -1917, -2095, -3359, -2370, -2180, -7672, -3730, -1777, 5036, 5939, 3383, 2581, -642, 3981, 1164, -2832, 1358, 3476, 2264, 854, 2067, -1311, -2303, 3541, 9766, 9239, -719, -3075, 819, -264, 5001, 5216, -2106, -3320, -3494, -2380, -3589, -3904, 2310, -1216, -4929, -3327, 2463, 6720, 8864, 4008, 2520, 2145, 1910, 3576, 3445, 1886, 1698]
18347A698j608M103k001J207J315l875l237m915K35j339M986j223K644N673L968
18332G631P97j042n281m348N328M280M80k954k908L744K923l573l950j210N853
18317E770L026L078k576r025j0864J666M157M692o324L527M048l592J318J0439
18303I340L757o235l086K044J343k901n580Q73k177J283O856l07n894o383K687
18288d380k386k991R898N880l50J123M893p087j0483K306M997j006M74l339m35
18273b886K955n94p426K750K278J594L479j97M45o10j526O877K242M027o80l454
18257I274K236J759K86p635l146r81L08l730L644m087m911N967N987J317j333
18242D955k05K265M490N859K942Q26j226N1j86R60N460N7j1480j008l27p629m765
$$ y = [1698, 90, 4193, 2192, 3399, 4714, 839, -2398, -7313, -7078, -8417, -3431, -4654, -2010, 3663, 7631, 8428, 7386, 2105, -2243, 3085, 7365, 7845, 4891, 1983, 5727, 8650, 5077, 1127, -83, 5770, 8796, 11874, 9298, 273, -10591, -8925, -4768, -76, -6400, -2873, 1175, -2417, -1099, 9340, 13097, 6862, 3776, 5820, 7163, 4262, -1318, -445, -2622, -1339, 5517, 5210, -684, -7067, -4380, -6766, -9757, 141, 6021, 5671, 6794, 11687, 4600, -5883, -3577, 1420, 414, 888, -2451, -2886, 69, -525, -7951, -5201, -2923, -1329, 2150, 1953, 2398, 1788, 262, 7139, 9381, 13408, 12728, 9274, 11510, 13269, 13555, 5920, 2774, 1793, 2101, -1629, 2015, -2072, -6983, -1016, 4971, 6288, 4955, 4750, 7015, 11505, 17364, 20306, 21132, 19906, 19957, 19771, 20731, 26191, 26248, 14768, 13760, 13433, 5804, 1039]
18225A039R498L465k580k671K129k327p346J109M828l658J297O490M284p104K04
18210H657l223n777m120L013L47l096N561K127j762M395q17L136M679K002n84
18195A4538j901m854r333K031P02m112K947N212O102n052K490J0928r86o55J489
18180A9546j322L575k939m692M51M23L591K110m293l309Lk873m070K94K781J715
18164A0991j0415l45P340M360o194n50J1032R401l39K777J884j626l02r805m674
18149A3535J598p4K394O028k63J124L450N275L863K390P974R128L036j573j953
18134E5932O698N578J1613P112Q889O443J1273J1184R014J4050J9712K6571L9419
18121B33488M3006N1013O0707O9094P9430R6954J28478J90464K94440M50439P57343
$$ y = [1039, 10537, 14002, 11422, 8751, 10880, 8553, 1207, 2316, 7144, 3486, 4783, 11273, 15557, 8453, 8657, 5434, -343, -4463, -1450, -1103, -4199, 1362, 3489, 1727, 6122, 5305, 8441, 13120, 15122, 14538, 12637, 7783, -1550, 481, 1183, -2929, 18, 5230, 11332, 6280, 8770, 19698, 18712, 18057, 19546, 18224, 21799, 18860, 14168, 14619, 15042, 18633, 20743, 16450, 13141, 13144, 10271, 6201, 6495, 9276, 10991, 576, 231, 7571, 11931, 5737, 5187, 16219, 25620, 25281, 28058, 29942, 28316, 28014, 18209, 13535, 15133, 15059, 17453, 23481, 23218, 24342, 27792, 33067, 36930, 39320, 47294, 56422, 59458, 57885, 55932, 62630, 68208, 79821, 86933, 95822, 102265, 113538, 124722, 133736, 147786, 167498, 194069, 233488, 276494, 327507, 388214, 457308, 536738, 633692, 762170, 952634, 1247074, 1697513, 2454856]
18110B454856J354989K355774L443073K977339M7559j831969k703597k555325
18102E542699j748179j144396p75860n27313l57872k49520j69106j18946q7423
18093C64084o5391n3526l6390l3389k8064k0605j0875j1466n268P23j1437j0575
18081G7821n866l778o244l593N595n124p306q152J734k896l561l264K361j447
18067C6280q613j39N217l641R08l428o200k745l203q429j889N931L699K296M656
18052B0700m45J807q046q682o345L572n057l351M210P199R721m538p858o021j444
18037d578K412J298J994M423M425n812o327Q028M069m659M74O425K54n379n102
18022A945j083m126k454N911M628l934J401R388m558j786M076L146n208j333p11
$$ y = [2454856, 3809845, 6165619, 9608692, 12586031, 12633590, 10801621, 8098024, 5542699, 3794520, 2650124, 1874264, 1346951, 989079, 739559, 570453, 451507, 364084, 298693, 245167, 208777, 175388, 147324, 126719, 115844, 104378, 99110, 99833, 88396, 77821, 71955, 68177, 61933, 58340, 63935, 58811, 51505, 43353, 45087, 42191, 38630, 35366, 37727, 36280, 27667, 27528, 32745, 29104, 30012, 26584, 20384, 17639, 14436, 6007, 4118, 10049, 13748, 16044, 20700, 20255, 22062, 14016, 5334, -1011, 2561, -2496, -5847, -1637, 5562, 15283, 10745, 2887, -3134, -4578, -2166, -868, 1126, 5549, 9974, 4162, -2165, 5863, 9932, 5273, 5747, 12172, 12426, 7047, 1945, 862, -3264, -5718, 193, 4821, 887, 2288, 11676, 7118, 5332, 9408, 12554, 7346, 6013, 5302]
18007E302n638M607J0197N920r247n053J885j857j547l072K01P779M353J438n436
17992I832k828L303j321O45m134l860M335P905P858P630n268o016j989k324J528
17977A5296l700n693n887p23P193L291j831J097o21m505p604j978k195p27L259
17962e328q75L554K552l959o59K959j06k601K009l392N044Q12K485J974L550l008
17946E011l466j547l879m374J610J114K779P968M922l57q66j057n647q54n293
17931c936R89J060J167l917o79K381P430L788J478j620O470J313l474k630q38
17916H982K274r22N120j771l401p442p493L522J467j061l556l524P11K018K288
17901b788K490J619L198j81L694J27k804l471j1445N257N708J552j87m733k072
$$ y = [5302, -336, 4271, 14468, 20388, 11141, 6088, 7973, 6116, 4569, 1497, 1698, 9477, 13830, 15268, 9832, 7004, 10307, 8986, 9631, 5497, 1637, 5972, 13877, 21735, 29365, 24097, 18081, 16092, 13768, 15296, 11596, 5903, 16, -707, 6486, 9777, 7946, 9043, 8422, 3917, -3687, -5665, -7860, -8587, -5328, -6203, -2649, -97, -4056, -4715, -1756, -1862, -4463, -2454, -5846, -802, 10, 2495, 4469, 8019, 5011, 1545, -2, -3881, -8255, -6645, -5531, -2752, 5216, 10138, 9781, 8915, 7858, 2211, 1357, -3936, -2947, -1887, -720, -4637, -5316, -2935, 4495, 8283, 9761, 8141, 14611, 15924, 12450, 9820, 8982, 11256, 10334, 15454, 13683, 10282, 2840, -4653, -1131, 336, -725, -4281, -7805, -7094, -5076, -2788, -298, 1321, 4519, 4338, 8032, 8159, 5355, 1884, -9561, -4304, 1404, 2956, 2769, -1964, -4036]
17886d036L955l221Q28O02k996m263P298P756k286j965J581M353l805k807N69
17871A563l308l420P000O311j001m66K322k62J631J676q75q352p745L097L410
17856A581K793M990L278q54Q12O919q646j0900J009N086K072J060K021K205p08
17841A2718l233m790l395m281L184M462L447o137m586k722J444j212j043R162
17827C018M385Qj515n43n170L389Q93r147n004K110O141P215L52k160M28j94L999
17810H205J2842n133o201l370l362j611J637Q886L487k287q778J812K797O972
17796A5896K609q906j0986n261M352M685K153L257m094l669l77P517o700o894
17782f418K387N924J40r51N88l34M089N056j885O22N744k353m393l696L567N097
$$ y = [-4036, -81, -3302, -2474, -1872, -4868, -9131, -1833, 5923, 3637, 1672, 3253, 7606, 3801, 994, 1563, -1745, -5165, 1835, 8146, 7145, 6679, 9001, 8739, 10370, 12046, 11171, 2819, -4926, -1829, 1581, 4374, 9364, 12642, 11788, 12600, 19519, 10873, -27, 982, 6068, 8140, 9200, 11221, 13426, 12718, 9485, 4695, 1300, -2981, 203, 4665, 8112, 1975, -2611, -5333, -3889, -5101, -6144, 3018, 7403, 7411, 5896, 5353, 183, 3572, 4465, -4682, -9686, -7576, -1435, 5780, 6132, 3972, 4400, 4206, 8205, 21047, 15914, 9713, 6343, 2981, 1370, 3007, 11893, 15380, 13093, 4315, 6127, 8924, 15896, 18505, 9599, -1387, -6648, -2296, 2389, 4542, 7799, 3705, 36, -341, 7176, 476, -6418, -4031, 1893, 2033, 1082, 1670, 1336, 5425, 10481, 8596, 9218, 14962, 12609, 8216, 4520, 8087, 13184]
17766A3184j530j1784o860j165K623J015l644N302N449j951m414O06j066n74L754
17751a055M993K334l898L35O036J477j119l01K499j0404r101L2k93O073k79K223
17735d48o96k983n688L025J412J32N130N751k662r336L8J0269K684L243k837j654
17719E380r64K437M649m678n043n187J079o883j578n59k86K729M695L619J880
17704A290j348L486l055J61k670K844K112O639M874l512n979l4M948p188k628
17689f0K944o18l52O429J513m545q834o75O728P924l669j480J071l97J259k632
17673D606L527O124k155l395O90N773K685l247J058K192J365m247P62P467j877
17658B1328k471k65K589J38j199R123M290J084R323P473R705J5135K2539K4856
$$ y = [13184, 11654, -130, -6990, -8155, -5532, -4517, -8161, -2859, 2590, 639, -3775, -3169, -4235, -4809, -1055, 3938, 6272, 2374, 2709, 8745, 10222, 9103, 8802, 11301, 897, -8204, -8172, -8465, -2392, -2671, -448, -1144, -4127, -9815, -6790, -5378, -5246, -116, 5635, 2973, -6363, -6325, 3944, 6628, 9871, 7034, 5380, 4416, 6853, 11502, 6824, 1781, -3406, -2327, -9210, -10788, -11347, -11633, -8904, -4209, -590, 1290, -58, 3428, 373, 534, -2136, 708, 2820, 9459, 14333, 10821, 4842, 4808, 9756, 2568, -60, 2884, 2266, 1914, 8343, 9856, 5311, -3523, -4198, 2530, 10454, 6785, 5305, 6376, 5979, 7238, 4606, 8133, 14257, 12102, 8707, 9397, 15170, 17855, 14608, 15666, 17858, 19223, 14976, 15738, 23205, 21328, 18857, 18592, 21181, 21319, 20120, 29243, 33533, 34617, 43940, 51413, 61118, 76253, 98792, 123648]
17644A23648L3467N6774P0940O6558Q8058Q4428N8494K9568J6449n462l4075n9353
17632E29494o8760p0867p8988o9976n7820l9903l5103k1123j2030j3229j3214
17621D8481k617r812q715k28K652J285k064q656q115k847l211O458J261j183M059
17606A6748j660r50p319r306k551R200m677O22P41n27O220J612M899K87m217p858
17590A264M906K025p679l568M585M901J067k667N675J204j573m598l82K857k658
17575E359j962J484J841M069P144L970j279k920j505M084m072l150n343J95N553
17560A3468l329K36j439l850j836M670p882r403j9N754K757J053M235j579j202
17545A634J2542M846J515o401q983p134m85P39k457n04l179k899K929N607M540
$$ y = [123648, 157115, 213889, 284829, 351387, 439445, 523873, 582367, 611935, 628384, 622922, 588847, 529494, 460734, 389867, 310879, 240903, 183083, 143180, 108077, 86954, 74924, 61695, 48481, 45864, 36052, 27337, 27109, 29761, 31046, 28982, 20326, 12211, 9364, 6153, 12611, 13872, 12689, 16748, 15088, 14138, 6819, -2487, -5038, 4162, -515, 107, 848, 321, 6541, 8153, 13052, 13339, 9122, 1264, 6170, 8195, 516, -3052, 1533, 6434, 7501, 4834, 10509, 11713, 10140, 5542, 5160, 8017, 5359, 3397, 4881, 6722, 10791, 17935, 21905, 20626, 17706, 16201, 20285, 16213, 13063, 7720, 7915, 13468, 10139, 10375, 8936, 5086, 3250, 7920, 38, -9365, -9384, -3630, -873, 180, 4415, 2836, 1634, 14176, 19022, 20537, 14136, 5153, -1981, -2466, -1727, -4184, -4688, -7867, -10766, -7837, -2230, 2310]
17530B310N993L593k10K268L207l253J766l883k584K173L36R043k876Q90l192
17515A5581K429o402m825l20k906j379K127J73M298K052j9m043jN75K028N121
17499A4489J66j77n034l804j468M73K431N28j62j383Q12m85n102J12K780J492
17483E668J190M935L384m29l17K515k934o514J759N139k543n213j202O660N51
17468A2649k814l585M096Q571M949m50n871o300o59M026r20r99n88M5k016j317
17452H817l44L960l135n101K66j072N168O750N44N841O928J9648K3020Q763m938
17437G5115j8703j3064j1070q169N18q374J340n683k357O365L503K081j889l083
17423A6530j120P93J329q926m543M179J242J0867J33l541L545j627q232r16O675
$$ y = [2310, 8303, 11896, 11686, 13954, 17161, 13908, 15674, 11791, 9207, 11380, 11716, 20759, 17883, 18773, 15581, 18010, 11608, 6783, 6463, 3557, 2178, 4305, 4478, 8776, 10828, 10809, 6766, 6765, 7340, 9368, 14489, 14655, 14478, 9444, 5640, 4172, 4645, 7076, 7604, 7442, 6059, 6871, 6386, 1284, 1396, 4176, 5668, 6858, 11793, 15177, 14748, 14431, 16946, 14012, 7498, 9257, 14396, 11853, 6640, 5438, 12098, 12649, 9835, 6250, 10346, 18917, 23866, 23416, 17545, 11245, 10586, 14612, 13692, 12693, 12105, 12150, 10134, 8817, 8473, 12433, 9298, 4197, 4463, 3391, 8559, 15309, 15853, 21694, 28622, 48270, 71290, 80053, 75115, 56412, 43348, 32278, 24109, 24627, 16253, 17593, 11910, 9553, 15918, 19421, 21502, 19613, 16530, 15410, 16203, 17532, 8606, 4063, 8242, 9484, 20351, 20484, 16943, 20488, 18861, 10629, 9713, 16388]
17408A6388m53k777L605J603J771M664L679J188j804N340Q049p82q290p150J013
17393B6044k927m396j118k607n602l38J357l297n57J527M32m85L211J387n983
17378F648m400O478P058k350k507r53J445J650l355j145Q138N630j533L393J937
17363B6134L557K693M964J396K113R91n973o970K766N127p567l895K591R881J5583
17348E3391M760j695o06K802N190J0071N400j336P668Q302N172K421j29o396r537
17333H5478j2745k958l073r951o188n331r411j218l805j726m890k766J271R20
17319B3607o19P68L97j584J917N950n265j076O671K536k036j490P50l482N51J02
17303B7697L921N707o179j0454k721k338m93N276N484M013j55J827l317K299K458
$$ y = [16388, 15935, 13158, 16763, 18366, 20137, 24801, 28480, 29668, 27864, 33204, 41253, 40471, 32181, 25031, 26044, 23117, 18721, 17603, 14996, 9394, 9056, 10413, 7116, 6559, 8086, 8518, 8033, 11244, 12631, 6648, 2248, 8726, 15784, 13434, 10927, 9974, 11419, 13069, 9714, 8569, 16707, 22337, 20804, 24197, 26134, 29691, 32384, 37348, 38744, 40857, 41848, 35875, 28905, 31671, 36798, 29231, 25336, 27927, 37808, 53391, 58151, 56456, 55850, 58652, 63842, 73913, 79313, 77977, 85645, 93947, 99119, 101540, 101411, 95015, 85478, 72733, 69775, 66702, 56751, 50563, 45232, 35821, 34603, 30798, 29072, 24182, 21416, 22687, 23607, 22988, 23756, 24153, 22569, 24486, 30436, 25171, 24095, 30766, 33302, 31266, 29776, 30526, 27044, 27595, 27697, 31618, 37325, 31146, 20692, 17971, 15633, 15140, 20416, 25900, 29913, 29758, 31585, 28268, 30567, 33025]
17288C3025R5j683j87j362L315N389N630K379Q8J80o465j325K506p447m575N7
17272B9620M203j2510k756L069M974K196J744O353J226K191L005N026J485q398
17258D1428j2553l402l92o967n284q067k204K850K251m880J267j387O395N920
17244A4975O928P825R007J4587N395J96L701O970L696N616K241n455J089M902
17230H1673k231l484n874K480M549L178R349N459m172J0036Q395N300O938J5350
17216A36946K4822J0225J1714K1699K3157m779j1801L143k873k1900k3678j5904
17204A50771j4552o659r727p449l41j87K906N264O70m274p12J595P712L071q5
17189A28003K605K942K350N101K777K692L478O9k623O74L161N083L189j773J009
$$ y = [33025, 33120, 31437, 31250, 29888, 33203, 38592, 44222, 46601, 46689, 46869, 40404, 39079, 41585, 34138, 29563, 29620, 33823, 21313, 18557, 21626, 26600, 28796, 30540, 36893, 38119, 40310, 43315, 48341, 49826, 41428, 28875, 25473, 25081, 18114, 12830, 4763, 2559, 5409, 7660, 2780, 4047, 2660, 9055, 14975, 21903, 29728, 38735, 53322, 58717, 58913, 62614, 69584, 73280, 78896, 81137, 75682, 76771, 81673, 79442, 75958, 70084, 72564, 77113, 80291, 89640, 95099, 90927, 100963, 109358, 114658, 121596, 136946, 161768, 171993, 183707, 205406, 228563, 223784, 211983, 215126, 212253, 190353, 166675, 150771, 136219, 129560, 119833, 112384, 112043, 111856, 114762, 120026, 120696, 116422, 115710, 117305, 125017, 128088, 128003, 130608, 133550, 135900, 141001, 143778, 146470, 149948, 150017, 147394, 148068, 151229, 156312, 159501, 157728, 158737]
17174A58737j172R028J0357O809P191J598K976P248M920R026J018O938Q735N526
17160B38935K967L557N10L863O483M072N135J66l44L157O754O476M012O365R644
17145C01752M032j495n623O397j543K357Q898J0675J2009J5208J7329J6211K7676
17132D13883K6902J7916K8038K2287K6537L4197L1234L4258L4129M5722N3475
17121G68578N9919P1474P8313R6405J10403J31335J49955J81995J93090J87701
17111B029168J82859J90220J96395J97492K02747K26181K85219L66291M48157
17102D324729N52508O92786Q51633J031113J272862J636259K192988L051243M411498
17093B0017619O388601Q721851J0721603J2156104J3821709J5137243J3260894
$$ y = [158737, 157565, 166593, 176950, 183759, 190950, 192548, 195524, 202772, 207692, 216718, 217736, 224674, 233409, 238935, 241902, 245459, 245969, 249832, 256315, 260387, 265522, 265688, 265344, 268501, 275255, 281731, 285743, 292108, 301752, 305784, 304289, 298666, 305063, 303520, 305877, 314775, 325450, 337459, 352667, 369996, 386207, 413883, 440785, 458701, 486739, 509026, 535563, 569760, 600994, 635252, 669381, 715103, 768578, 828497, 899971, 978284, 1074689, 1185092, 1316427, 1466382, 1648377, 1841467, 2029168, 2212027, 2402247, 2598642, 2796134, 2998881, 3225062, 3510281, 3876572, 4324729, 4877237, 5570023, 6421656, 7452769, 8725631, 10361890, 12554878, 15606121, 20017619, 26406220, 35128071, 45849674, 58005778, 71827487, 86964730, 100225624]
17086A00225624Q364658M557675J917154k574588q177539j1879725j3525594j3802315
17078F5105350j3066507j1630959r730175p547723n519075l932664k804809k037834
17070H835604j508604j123724q63314p01248n78642m79959l84186l20682k49567
17061B625678j79332j33725j09086j01831r6248r6520j21321j42140j44000j43943
17051A357532j34455j26960j15168r7532p5086n5838m7704m7531m1554l9684k8295
17040E47725l0534k5960k0262k2316k3044j2906j4377j4970q668j3449j3211j5161
17028C32867j8602j6440j9430j2641k1089j4659j2714j0849j1621j4713l051q234
17016A68824j0411j5290j2627r349o338p240l421o838N66J359n431k526p365m547
$$ y = [100225624, 108590282, 113147957, 115065111, 112490523, 104312984, 92433259, 78907665, 65105350, 52038843, 40407884, 30677709, 23129986, 17610911, 13678247, 10873438, 8835604, 7327000, 6203276, 5339962, 4638714, 4060072, 3580113, 3195927, 2875245, 2625678, 2446346, 2312621, 2203535, 2101704, 2005456, 1908936, 1787615, 1645475, 1501475, 1357532, 1223077, 1096117, 980949, 883417, 808331, 752493, 704789, 657258, 615704, 576020, 547725, 517191, 491231, 470969, 448653, 425609, 412703, 398326, 383356, 374688, 361239, 348028, 332867, 314265, 297825, 278395, 265754, 244665, 230006, 217292, 206443, 194822, 180109, 177058, 168824, 158413, 143123, 130496, 121147, 114809, 107569, 104148, 97310, 97876, 99235, 93804, 91278, 83913, 79366]
17002G9366k093R67m410l421R380N701p556O61K904K634L583o190K120p574j969
16987G4103j307p742o135o695l072O15n002O351R073j969m615K131K10O943Q045
16972G0934J0461q86l636m393j424J0331J5106J1567J8285J7917J4981M304M235
16959A67782J0689K045j1710j3708q797k581j5393j3532j1958j1329p610q922
16947G4976j1672k234J07l385o41m122j404P05P78o623l255J706M137Q30L796
16932E3699K693J439J755O078J3611N439k256k924l280l634j95K976n092j589
16918F8720O370J825q398j026L031l022p28M747J176p475j3658j2228j524l14
16904C7496J167J392N806K082K069r10p690k976k019m914o908p051O46P87p923
$$ y = [79366, 77273, 78240, 73830, 70409, 79789, 85490, 77934, 78595, 81499, 84133, 87716, 81526, 83646, 76072, 74103, 72796, 65054, 58919, 52224, 49152, 49767, 44765, 51116, 60189, 58220, 53605, 55736, 55946, 62889, 70934, 81395, 80509, 76873, 72480, 71056, 81387, 96493, 108060, 126345, 144262, 159243, 163547, 167782, 178471, 180516, 168806, 155098, 146301, 143720, 128327, 114795, 102837, 91508, 83898, 74976, 63304, 61070, 61177, 57792, 57151, 53029, 51625, 52330, 53108, 46485, 43230, 44936, 49073, 49903, 53699, 56392, 57831, 59586, 65664, 79275, 84714, 82458, 79534, 76254, 72620, 72425, 75401, 70309, 68720, 75090, 76915, 68517, 67491, 70522, 67500, 66772, 71519, 72695, 65220, 51562, 39334, 37810, 37496, 38663, 40055, 45861, 47943, 50012, 49102, 41412, 38436, 36417, 31503, 24595, 17544, 18190, 18977, 11054]
16889A1054o099p99N163j305J498k740l855Q170L529K602K098J252p496j227J779
16874A3624L258l213J717L424j82j03Q8J063K683M360m196K681J739M610P868
16859C9421J0435J1627K7633N1678Q5547J13939R1611L47n6677q6519q3595n7104
16847A48343m0965k8428j7784j0933j1455j3185n123O48j486n554m733j110j92
16834H043j400L719J074j184Q3N309M711n06j704j90j664J305R96j838k03j435
16818A5116j776k530m929k543p391J2967M518o484n739j629j10N316m459O49j647
16803f71q68N070J95N64k475j601K103l644p035L60N501L231L613m66N236N000
16787A4113q57r764m186M451p3j0772q95j037q46p048L076M884L568J898m611
$$ y = [11054, 4955, 4156, 9319, 8014, 9512, 6772, 2917, 11087, 14616, 17218, 19316, 20568, 13072, 11845, 13624, 16882, 13669, 15386, 18810, 18628, 18525, 18613, 19676, 22359, 26719, 22523, 25204, 26943, 31553, 39421, 49856, 61483, 89116, 140794, 226341, 340280, 431891, 432238, 375561, 289042, 205447, 148343, 107378, 78950, 61166, 50233, 38778, 25593, 20470, 21118, 19632, 14078, 9345, 8235, 8043, 6643, 10362, 11436, 10252, 10335, 15644, 20355, 19849, 18145, 17955, 16291, 17596, 18592, 16754, 16551, 15116, 13340, 10810, 5881, 3338, -4053, 8914, 13432, 6948, 1209, -420, -530, 4786, 327, 976, -671, -1539, 3531, 3726, 4290, 1815, 214, 2317, -1327, -8362, -8002, -2501, 730, 4343, 3877, 9113, 14113, 13256, 3492, -694, 3757, 3684, -7088, -7983, -9020, -9866, -16914, -13838, -8954, -5386, -3488, -8099]
16772h099j1475J974L802k521N50P089k924l204k761P75O176K383m529l746M189
16757a2321O363j436n082M500J896K74o965j581N018P378J494k604m72k889n455
16742a1882O750J038k753k346j476M695m91Q95O234j336m734M724K493n955p190
16727a1334J317L102p18j24j289l434M27K921k4L301M437M52k985K998n096n395
16711a1444k859P93k704P889L932k841O97j559o461j741K228O88Q894j164j850
16696g502m156M005j402L420K350N069N89K04L321J140K805k605p997l817N704
16681A128K237M055M33j402n556J54o942r091j714P257K203N319J93M615K519
16666E408J833j930l046k219j004r213o45M375j207J216O66l172N982J624O204
$$ y = [-8099, -19574, -17600, -13798, -16319, -15769, -8680, -11604, -14808, -17569, -16794, -10618, -8235, -12764, -16510, -12321, -5958, -7394, -12476, -7976, -6080, -5806, -12771, -14352, -9334, -1956, -462, -3066, -3538, -6427, -11882, -5132, -4094, -6847, -9193, -10669, -5974, -6465, -5570, 664, -672, -5406, -682, 1811, -4144, -11334, -10017, -6915, -7633, -7757, -9046, -12480, -12053, -9132, -9156, -5855, -1418, -966, -3951, -953, -6049, -11444, -14303, -13510, -16214, -8325, -4393, -7234, -6537, -8096, -14557, -16298, -14070, -13382, -4488, -5652, -7502, -11658, -7653, -9055, -5635, -3285, 1784, 2373, 2577, 5898, 7038, 9843, 7238, -759, -4576, 1128, 3365, 7420, 7853, 6451, 895, 1049, -5893, -14984, -16698, -9441, -7238, -1919, -1726, 2889, 5408, 7241, 5311, 2265, 46, -958, -10171, -10816, -6441, -7648, -6432, -5766, -8938, -2956, -1332, 4872]
16651D872J992o2j100l434J292p372r05M99l376O75l664J96K105L605P422k079
16635F66l076o776J379K926J851J188m26j677j866K606K787j373r20j701L607
16620h05L594M401L884Q27M435j645k395k87Q10L259L815M469n43K79m731l671
16604A5696q577n018p37m721k340K616O695L659n467q98L964n702J599m498O76
16589c053K976J766j798Q19Q990K618K139J311P81J513k771j06L815j46m365r542
16573D947p985M316M164k810o703Q398L062p6N713M302l403K493l696n347r11
16558F464p67k370j424k693M859N049J159J894J753K987L424K383o983r21P54
16543A5568k382M225P357P18J2134J2830J4720J4650K8844M2384N1719N8429O8085
$$ y = [4872, 6864, 6802, 5702, 2268, 3560, -3812, -4717, -4218, -7594, -6919, -10583, -10387, -8282, -4677, 2745, 666, -2410, -9186, -7807, -4881, -3030, -1842, -2268, -3945, -5811, -3205, -418, -1791, -2711, -4412, -805, 2789, 7190, 11074, 11901, 16336, 14691, 12296, 12009, 12819, 16078, 19893, 24362, 23819, 24098, 19367, 15696, 7119, 2101, 1364, -3357, -5697, -3081, 3614, 7273, 1806, 908, 4872, -830, 769, -3729, -3053, -77, 1689, -109, 710, 9700, 12318, 14457, 15768, 16549, 18062, 15291, 15185, 19000, 18854, 14489, 4947, -3038, 1278, 5442, 2632, -4071, 4327, 7389, 7313, 13026, 17328, 13925, 16418, 12722, 7375, 6464, 5697, 3327, 1903, -790, 4069, 9118, 10277, 12171, 13924, 16911, 20335, 22718, 15735, 14814, 15568, 13186, 17411, 24768, 25486, 37620, 50450, 65170, 79820, 108664, 151048, 202767, 261196, 329281]
16530C29281P2029P7448O4035L7052J6519N672k7043n2921p3127p7361o4455o3318
16518B43811o6707m4527l2784k5564j9332j5726j543p370p228K338l61r028m391
16505A1588m52J699j484m774m410j656n34N184m773J21j714o32L2l408j837P567
16489E17K461m085k679M446K504l548m764j838o88L560O41J662j930j724L388
16474b077k025k018M328l802L540K031j0339m510N645K480J887M6m711O02k448
16459a1371k309n019M299P340m669o745K361M325Q273j468j988L941j592J888
16445b734L001L24l626n741n764L833N851n95J865m444l17R75p12L148K839J244
16429h53o276p335K826R567j822N558j781m298j59k397j138L154N414m139L698
$$ y = [329281, 401310, 478758, 542793, 579845, 596364, 602036, 574993, 522072, 448945, 371584, 307129, 243811, 177104, 132577, 99793, 74229, 54897, 39171, 37628, 30258, 23030, 25368, 25007, 15979, 11588, 11136, 12835, 11351, 6577, 2167, 511, -23, 5161, 388, 509, -1205, -1837, -1805, -5213, -7050, 517, 2978, -1107, -3786, 660, 3164, -384, -5148, -6986, -7674, -4114, -3473, -1811, -3741, -5465, -2077, -4102, -6120, -1792, -5594, -2054, -23, -10362, -14872, -9227, -6747, -4860, -4814, -9525, -8923, -11371, -13680, -18699, -14400, -7060, -11729, -18474, -16113, -11788, -3515, -4983, -6971, -3030, -4622, -2734, 267, 591, -3035, -8776, -14540, -10707, -4856, -5451, -3586, -8030, -8347, -7372, -8084, -4936, -2097, -853, -7129, -14464, -11638, -2071, -3893, 1665, -116, -4414, -4573, -6970, -8108, -4954, 460, -3679, 19]
16414A9L041K322l367n580m337K210J478N94j549r1M300j37j316J335k641m671
16398h390l330L463O500l172K270j168j287j587n270p996r90j824Q254N730j840
16383a0637J107J1249L625n966l173k004N053K657j213m214m389k014L8k612j213
16368a3706m36J091k39L707K028L998k881R23P125k647o334m145P07o21L444R36
16352g050J059k588j362j46N263K591M553J0528J667p774j0588l930N944N453
16338C620L240O17n562Q0R72o75l413L07K299R38k295P02P376j104l240R02n276
16321e12j861M639L518j849q015q251P737J862K059J822K920j0350j56M86N206
16306g45M971p991n360J745O118k469j119L951k156J341K163r90L70n387l829
$$ y = [19, 3060, 5382, 2015, -3565, -7902, -5692, -4214, -3620, -5169, -5260, -960, -1097, -2413, -1078, -3719, -8390, -11720, -8257, -1757, -4929, -2659, -3827, -5114, -6701, -11971, -19967, -20957, -22781, -14527, -8797, -10637, -9530, 1719, 5344, -622, -3795, -5799, -746, 1911, 698, -3516, -7905, -9919, -9881, -12493, -13706, -14142, -13051, -13290, -9583, -7555, -3557, -6438, -5515, 1610, -1037, -7371, -11516, -10809, -11430, -7986, -7050, -5991, -8579, -9941, -10087, -4824, -2233, 2320, 12848, 14515, 6741, -3847, -7777, -1833, 3620, 6860, 7477, 1915, 1995, 2967, 2292, -1121, -814, 1485, 2423, 128, 830, 8206, 7102, 3862, 4764, -512, -2373, 2266, 5784, 3935, -4080, -12331, -4594, -2732, -673, 1149, 4069, -6281, -6437, -5951, -745, 4226, -3765, -9125, -7380, -1262, -3731, -4850, -899, -3055, -1714, 449, -541, -171, -5558, -9387]
16291i387O12j531q958j037J875O897P879O269j274j84j230L52M127J965m1L05
16275F639m273k713J212K513p71j674j189O681Q28r66n47n484J859R65j912q193
16259g025r008K080Q089J343j676L737L124J821k541N76k567K53q97J843n692
16244f540J611N114n660m219j659J547j50P96J039L009j442J640n07o90j134L100
16228d145m918o236j20L129M838J661O608L210j19L51l551n277J559n785k459
16213a1254o723L080P949M235l245J381K574j254l767l480L113p02m031O045Q603
16198B524J424l960n882K74N965p13M463J857M102K259l996o46j024M463R408
16183B0518J4602J2739J3763J9186K5062K2967K2637L0607L7651K2527P463J32
$$ y = [-9387, -8775, -10306, -19264, -20301, -18426, -11529, -3650, 2619, 1345, 1161, -69, 283, 4410, 6375, 6334, 6639, 2366, -347, 865, 3378, 2607, 933, -256, 6425, 7253, 6287, 5740, 256, 2115, 3080, 1168, -7025, -16033, -13953, -5864, -4521, -6197, -2460, 664, 2485, -56, 520, -2047, -1794, -2691, -848, -6540, -4929, 185, -5475, -9694, -11353, -9806, -9956, -9160, -8121, -5112, -6554, -4914, -5421, -6111, -7245, -4145, -9063, -15299, -15419, -12290, -7452, -5791, 817, 4027, 3908, 4259, 708, -4569, -3010, -8795, -11254, -17977, -14897, -6948, -2713, -5958, -4577, -2003, -3257, -7024, -10504, -7391, -8093, -12124, -6079, 2524, 3948, -12, -5894, -5620, 345, -368, 4095, 5952, 10054, 12313, 8317, 7671, 6647, 11110, 20518, 35120, 47859, 61622, 80808, 105870, 128837, 151474, 182081, 219732, 242259, 249722, 249854]
16171B49854j4206k0832k2679l2441l1599k9275k7575k3586j3132j0026j3926
16160A0577m586P016N30n622n488k097M212j56m305j88L112l410N56J615q91n755
16144d880J201K565N873K056K834m988k05k278q55q054m423J836J865j888q59
16129a0200l266L355J0889J494p94l65l717k559M938K573kL328o658o493l382
16114a0859P137J246m034P71K409P475j337l801M756K931k648q945L686M331K015
16099E133P27o852j884K038p940K512N003J926l146l25j321k09P774N862l308
16084E990m449Om441l731k573J171L631L56l888j38K263l745l875Q85P054K833
16068b651L576r14m711j181L610N638m078p78j644p022P88l656j505N922m72j98
$$ y = [249854, 235648, 214816, 192137, 159696, 128097, 98822, 71247, 47661, 34529, 24503, 10577, 5991, 13007, 13537, 7915, 2427, 330, 4542, 4386, 81, -107, 3005, -405, 151, 1766, 875, -4880, -3679, -1114, 4759, 6815, 9649, 4661, 4456, 2178, 1323, -6731, -11154, -9318, -7453, -9341, -10200, -13466, -10111, 778, 2272, 1478, 1113, -2604, -5163, -225, 2348, 2346, 5674, -984, -7477, -10859, -3722, -2476, -6510, -5739, -3330, 4145, 2808, -993, 3763, 6694, 4046, -4899, -1213, 3118, 5133, 5860, -992, -2876, -838, -8778, -6266, -1263, 663, -2483, -2808, -4129, -4338, 3436, 9298, 5990, 1541, 1547, -2894, -6625, -9198, -8027, -4396, -4040, -7928, -8066, -5803, -9548, -13423, -12538, -5484, -2651, 925, 11, -4700, -5881, -2271, 3367, -711, -1489, -3133, -10155, -9367, -13023, -14528, -8606, -9078, -9276]
16052i276K585N132J594M965J765j979p90m234m17K403K831J367o416J028j762
16037a204K72L334R23k271o500o781l55M676L555j62q085M921J1670R59J223k812
16021C363r38Q46K678m927m068L213K524J256M90k163j145R45m927p254J146J076
16005g885r85l829k589M251j17j489L762K981J913J074R02N43K684J181m772j749
15989d124M251k166L03k889r71K187l46R1m972q6K520l208n381M729K5M124L428
15972b485m373K618K34J191K042k509n392J31J651m921r43J872K017M171o853
15957a1549r57J770K732K167L565j335k368n15P613N023p090k016m74k567k105
15942h106k711l843N221r31m354K146K257m644K661N357L990j136O07j83P74l044
$$ y = [-9276, -6691, -1559, 35, 5000, 6765, 4786, 3996, -238, -655, 1748, 4579, 5946, -470, 558, -1204, -932, 2402, 3325, 1054, -5446, -12227, -12582, -7906, -4351, -4513, -12598, -7677, 3993, 4952, 6175, 3363, 2425, 3271, 5949, 1022, -3046, 167, 2691, 3947, 4437, 2274, 1129, 2074, -2853, -10107, -8961, -7885, -8870, -12699, -15288, -11037, -11154, -12643, -8881, -5900, -3987, -2913, -2011, -1468, 1216, 2397, -2375, -4124, 127, -2039, -1736, -4625, -5596, -3409, -3755, -3664, -8636, -8722, -6202, -9410, -14791, -10062, -10037, -5913, -2485, -6858, -4240, -4006, -2815, -773, -3282, -8674, -8543, -6892, -11813, -12756, -10884, -8867, -4696, -11549, -12506, -10736, -8004, -5837, -2272, -3607, -5975, -6490, 1123, 6146, -944, -2960, -3434, -6001, -8106, -10817, -14660, -9439, -10370, -14724, -12578, -10321, -14965, -12304, -6947, -2957, -4093, -3486, -3669, -2895, -5939]
15926e939p165l324M720L676P366j332j0264R21O107O486r959o690J90L266M474
15911g467R737Q149Q04J088J389j126m487r784j3354r745J841J846N234J0122
15897e753P770L584k68n105l544O82K239j28k053J809P950o5q94k819J344K127
15881F876N383O448J9230J8482J5417r94n394n690j2472N71n725o253p399o656
15867B1824l295m807n200J757L897L07o804o716R39o84P38j876l043o795n405
15852a5163K426q47k937J643K939J755j849L101L892M598r73j545m287j70J013
15837f404N580M941j57j169k919O605J53p53m465q899j0223q41k203k083N273
15822a7564O277K677J296O152k65n230o918J830L537J357K272k983r00Q173M918
$$ y = [-5939, -13104, -16428, -11708, -8032, -666, -1998, -12262, -11341, -5234, 1252, -8707, -15397, -15207, -11941, -7467, 2270, 10419, 11223, 12311, 13700, 12574, 8087, -1697, -15051, -24796, -22955, -21109, -15875, -5753, 2017, 5601, 5333, 228, -3316, -2634, -395, -523, -2576, -767, 7183, 7118, 6224, 3405, 4749, 6876, 12259, 18707, 37937, 56419, 71836, 70842, 65448, 59758, 47286, 47857, 42132, 35879, 28480, 21824, 18529, 13722, 8522, 10279, 14176, 14483, 7679, 963, 1902, 1218, 1956, 80, -2963, -9758, -15163, -12737, -13584, -16521, -14878, -11939, -10184, -12033, -8932, -5040, -442, -1415, -2960, -7247, -7417, -6404, -824, 4117, 3960, 2791, -128, 6477, 6630, 5877, 1412, -7487, -17710, -18551, -20754, -22837, -17564, -11287, -8610, -7314, -1162, -1427, -6657, -13575, -11745, -8208, -6851, -4579, -7562, -8462, -289, 4629]
15807D629M229K506o595m704p671j331k79K53P40N915L990n13j3972p53o68Q03
15791a3421L69M357O890L466k142L021l843K145j554Q04O09O40J560Q52o35m850
15775a732L252L657K171j0890q045l882N689Q625O0j452J997j316Q74l179n636
15760i807J369l823n287J783K488R5N263M947j762j343j29n443o071k124L531
15745a6313L214O180m057n989O93Q04j134P114N941M350M174K852N51m240p791
15730c651o516j890k0N01J729K903N579l8M055k779j816k008k874M109j263m187
15714h166j204j953L870M319k067l234m282R444O698o572j816J966j560O165o30
15699I78q044l134O266Q586N72K335q093l384M226N717M500j127o632k909l778
$$ y = [4629, 8858, 11364, 4769, 65, -7606, -8937, -9216, -8963, -8223, -2308, 1682, 1169, -12803, -13556, -14224, -13421, -13052, -8695, -1805, 1661, -481, 2540, -1303, 842, -712, 92, 701, 1341, 2901, 3753, 3118, -1732, 1520, 5177, 7348, -3542, -11587, -15469, -9780, -1155, -1095, -2547, -550, -1866, -992, -4171, -9807, -8438, -12261, -17548, -15765, -13277, -13182, -7919, -2972, -4734, -6077, -6206, -11649, -17720, -19844, -16313, -13099, -6919, -10976, -16965, -16272, -15468, -16602, -9488, -3547, 803, 4977, 7829, 8380, 4140, -3651, -10167, -12057, -12077, -11576, -9847, -6944, -1365, -1403, 2652, -127, -1943, -3951, -6825, -2716, -3979, -8166, -9370, -11323, -7453, -3134, -5201, -8435, -12717, -3273, 3425, -3147, -4963, -2997, -4557, 1608, 978, -7066, -10200, -3934, 4652, 5224, 7559, -534, -3918, 308, 6025, 10525, 9398, 2766, -143, -3921]
15684c921k256L767K77m75J515o509m577K47L117R43m053q800o806J257R956P068
15668i250K331Q9N637N143m796K583M714n294o759j078K37o024L326L987L647
15653a507J752j91j470m824p848J148N811K314l082k441R56P26M875L121j0961
15638a1621l168R194P165K185j762j838K384n714j641o56K073n535p166L962N536
15623f602M141M390K350O455J306p554o57j721p799J40m873L20M612k661k314
15608a0467j696L832j631j570J030R247O194o016J261K680m252l302m216M178
15594d728m851m483m01j287R96O931O872K068l877J007J761k413k042j962J624
15579d785k938j365P46J742k024Q846O771o975k701n103Q64r21L69K654m722o460
$$ y = [-3921, -6177, -2410, -2133, -2608, -1093, -7602, -12179, -11932, -8815, -7872, -11925, -20725, -27531, -26274, -16318, -9250, -6919, -6830, -1193, 3950, -846, 1737, 6451, 1157, -5602, -6680, -6443, -12467, -9141, -5154, -1507, 245, 54, -1416, -6240, -14088, -12940, -7129, -4815, -7897, -10338, -9382, -8656, -3781, -660, -11621, -14789, -5595, 1570, 3755, 1993, 155, 2539, -3175, -4816, -5472, -3399, -8934, -16100, -12138, -6602, -2461, 1929, 4279, 10734, 12040, 4486, 3829, 2108, -5691, -5551, -10424, -10104, -5492, -8153, -10467, -12163, -8331, -9962, -11532, -10502, -1255, 4939, -1077, 184, 2864, -1388, -4690, -8906, -4728, -9579, -14062, -14463, -15750, -14754, -7823, -951, 1117, -2760, -1753, 8, -2405, -4447, -6409, -4785, -7723, -9088, -8342, -6600, -8624, 222, 6993, 18, -2683, -7786, -6922, -7843, -7474, -4820, -9542, -16002]
15563a6002j18J578l510l065j004K599L323M063J0331M418l419M585J559l557
15549A781l672l562l302n286M177P789K176R02j79j586n655R12n4J839l982N346
15533b356K654l300n191K599K103l122j77N477o287k348j062j968J868K459K69
15518h382M440Q253L012j302j529j937m167n796j366l351L135M169J842J697J653
15503C71m661m128J044m388L693L458m716J456J573l443j253N417o58J923k999
15488g311q345M377O637n39j23K418O45j501L75j303K846K26m336m066M387N090
15472e23mk570n444l177R3K232m221M501P890L414k314m554j683J235Q48l979
15456h256N20m096o488K007O025J989N771P590m270o854j521L00p934j094L651
$$ y = [-16002, -16120, -14542, -18052, -21117, -22121, -19522, -16199, -12136, -1805, 2613, -806, 3779, 5338, 1781, -1891, -5453, -8755, -14041, -9864, -2075, 101, 1003, 824, -762, -6417, -5505, -5559, -3720, -7702, -2356, 298, -3002, -8193, -5594, -3491, -6613, -6790, -1313, -7600, -9948, -11010, -12978, -11110, -8651, -8382, -3942, 4311, 7323, 6021, 4492, 2555, -1612, -7408, -8774, -12125, -8990, -4821, -2979, -1282, 371, -4290, -8418, -7374, -11762, -8069, -4611, -9327, -7871, -6298, -9741, -10994, -5577, -6235, -4312, -7311, -15656, -11279, -4642, -5181, -5304, -2886, -2241, -3742, -3367, -4670, -1824, -1598, -5934, -10000, -5613, -523, -527, -3097, -8541, -11718, -11625, -9393, -13614, -9113, -1223, 2191, -123, -4677, -6360, -5125, -4277, -8256, -7736, -11832, -18320, -16313, -10288, -8299, -2528, 5062, 792, -6062, -7583, -7283, -15217, -16311, -12660]
15441a2660J475k16k742k986K002P126L723K912q78j955k036l303J626N105J802
15426a005N89j414j643j921L670Q35j658J620M51M20M63N767j61L157N556n329
15410I397j2377o093O754Q53J922l025k806Q54k694L080m981m550Q554j659n069
15395a1840n505L800L627L962M167K083q902M010N686N443N128k376n548o407
15381b672J609P18N562l78j53l446l545N60l127m5L011j848j980M18J721m159
15365g754l232j100j45M592M625r74r587M840j119j293L78K930L409N635r144
15350g939n697L462k631j110P976J1317K410j459j571n685L642K861l275n275
15336b974l450O721N331J680r853o537m144k001L355Q199J346j445m072Q70l999
$$ y = [-12660, -11185, -11401, -14143, -17129, -15127, -8001, -4278, -1366, -2244, -4199, -6235, -9538, -7912, -2807, -1005, -416, -1830, -3473, -5394, -1724, -889, -2547, -927, -476, -56, 407, 6174, 6013, 9170, 14726, 9397, -2980, -9073, -2319, -1466, 456, -2569, -5375, -4521, -7215, -4135, -9116, -13666, -5112, -6771, -11840, -17345, -13545, -9918, -5956, -1789, 294, -8608, -4598, 1088, 6531, 11659, 9283, 3735, -2672, -1063, -345, 5217, 4839, 4686, 1240, -2305, -1745, -4872, -4917, -1906, -3754, -5734, -5316, -3595, -7754, -10986, -12086, -12231, -7639, -3014, -3988, -13575, -8735, -9854, -11147, -10769, -7839, -4430, 1205, -7939, -13636, -10174, -12805, -13915, -5939, 5378, 7788, 6329, 4758, -927, 2715, 5576, 2301, -2974, -6424, 297, 5628, 7308, -2545, -9082, -13226, -15227, -11872, -3673, -2327, -3772, -7844, -6974, -10973]
15321a0973j374M016J473l023k560j430l82M812l46J37N329l404q651L032O9K004
15305a1271Q962M87j532m325k06J897J626l068j750K2J875K732K151j071l627
15290g098O85L163l837m173k754J308J875M543j743k601L988Q855N216r7M06P237
15274A4973m515j0915n090Q02M535N033L264n486r287o750M385J6626J531q262
15260H44r326q346j476l3j331N173M424p474j897N414L723M660K064m036n720
15245a3337Q36o21m919n97K581L214K039j906o24M078M147j411o883K389N630
15230e384J439M363l106P75p49q72l041j015J063K99j795M771L501R29m312l514
15214f648n666l316l758j072K143J0046O951k196l507n160R76M558j500m702l93
$$ y = [-10973, -12347, -8331, -6858, -9881, -12441, -13871, -14253, -9441, -9787, -9650, -4321, -7725, -16376, -13344, -13275, -11271, -2309, -1822, -3354, -7679, -7885, -5988, -4362, -7430, -9180, -9158, -7283, -4551, -2400, -3471, -7098, -6413, -3250, -7087, -11260, -14014, -12706, -10831, -6288, -8031, -10632, -6644, 2211, 7427, 7330, 7736, 14973, 10458, -457, -5547, -4745, -210, 4823, 8087, 2601, -6686, -13436, -9051, 7575, 9106, 844, -8482, -16828, -18304, -18337, -19668, -14495, -10071, -17545, -19442, -14028, -10305, -5645, -3581, -7617, -13337, -12501, -13122, -18041, -18638, -16057, -12843, -10804, -12710, -13334, -9256, -5109, -6520, -13403, -11014, -5384, -3945, 418, -2688, -1913, -2662, -3534, -6575, -7590, -6527, -6228, -8023, -3252, 249, 1178, -3134, -6648, -12314, -15630, -19388, -20460, -18317, -8271, -1320, -3516, -7023, -12183, -11207, -6649, -8149, -12851, -13244]
15199a3244P191K354L601N348m228q576r55r4O84J214M684P123k987q395k982
15184i262m35m162M582K43l376L236K941Q255K43o166q879m707N31J748L81l00
15168a5127L700N711K218j137l629k090K674P591l663m953L455J648L066k005
15154b541N056L658o206m405M421L837m022n804J873M821k144K419L071N40k083
15139B491J748J219J042q186j951j064j908j098K356o52J188O586J589j11K926
15124F175M733J119m536m798p899O323K356j560J830K192j525l676n15l861l463
15109g105m219q219K878R934Q59r98m412M273m4r67K36P599Q330p452Q62O334
15093G889k650j892r805j024L454l66M187L658K374l018n179q0j713p57K527M163
$$ y = [-13244, -6053, -3699, -98, 5250, 1022, -7554, -8509, -8603, -7919, -6705, -2021, 5102, 2115, -6280, -9262, -9697, -13859, -9277, -9034, -12410, -9174, -6233, 2022, 2265, -3901, -12780, -17487, -16956, -15208, -14827, -15127, -11427, -5716, -3498, -4635, -8264, -10354, -7680, -89, -3752, -8705, -5250, -3602, -536, -2541, 2515, 6173, -33, -4438, -17, 3820, -202, -6006, -4133, 688, -1456, 963, 4034, 4574, 2491, 4239, 5458, 6500, -1686, -3637, -4701, -6609, -7707, -5351, -6003, -4815, 1771, 3360, 3249, 6175, 10908, 12027, 7491, 2693, -5206, 1117, 3473, 1913, 3743, 5935, 4410, 734, 219, -3642, -7105, -11324, -19543, -16665, -6731, -5872, -6870, -11282, -7009, -7053, -8020, -7784, -185, 8145, 693, 1555, 7889, 5239, 3347, -6458, -7482, -4028, -4394, -207, 3451, 5825, 2807, -2372, -2452, -4165, -4922, -2395, 1768]
15077A768J463k955j786L348k484l876J110k563N424J255j40l796j80k422m432
15062a0266J623N554Q300K661l086n391m624k00N186M8K758n303K595M332L040
15047G227K607n110p097n430J344J456L262J97P944P914L54n646j647j766n184
15032D25o81J655K26M451K206L428j34m6o435j2171j292J0882J707n776l615J414
15016c756N021J790O85o498K98L577j755k200K425o712J813l62p070O498N064
15001a182L478m262M50K406J651l935m076k585p100k444O813Q995M665K703q449
14986b872L34J06L258j32m885M389K711r79n494N82Q43n54Q34K914K582l97l938
14969f98o137j883N160P564k290j333j063o87k020n542J705M588l052l823n68
$$ y = [1768, 3231, 276, -1510, 1838, -646, -4522, -3412, -5975, -551, 704, 564, -3232, -3412, -5834, -10266, -8643, -3089, 5211, 7872, 4786, -605, -5229, -5429, -243, -195, 2563, -2740, -145, 4187, 7227, 9834, 4724, -2373, -7803, -6459, -5003, -1741, -1544, 6400, 14314, 14668, 9022, 7375, 5609, 425, -256, 1399, 1625, 6076, 8282, 11710, 11576, 11530, 5095, -7076, -8368, 2514, 4221, -1555, -5170, -3756, 1265, 3055, 3740, -2758, -2460, 1117, -638, -2838, -413, -7125, -5312, -5674, -12744, -6246, -1182, 2296, -1966, -1516, 890, 2541, -1394, -5470, -8055, -15155, -17599, -10786, -1791, 2874, 5577, -2872, -2538, -2432, 826, 694, -4191, 198, 2909, 1930, -3564, -2982, -2139, -2693, -1859, 1055, 3637, 3240, -698, -6835, -8718, -3558, 4006, 1716, 383, -680, -1367, -3387, -8929, -7224, -2636, -5688, -9511, -10079]
14954a0079J321l39Q52k511L808L609k480L839M7j07J299l767r83J649J475n183
14938g550n802J19j442L177L957N148Q2l823J834j35j942o493L049R364L066j327
14922A282j1736r692M936Q190M248N390o016j4154q85P331R199j373j024l28O039
14907A407L874K638m186m883J26k924k229l137k60R063K368j0552p40N765L010
14892f60o46J155m501q88Q890O734R36k503j0597n607j81o95K870k750l159K08
14876a1394K849N62K936J692k14L44L65k108k623k226m178M35R444O307L333Q760
14860A4284O791L848j3077m464K371Q27j617p054o848M50K224M855k568J261l976
14845b693q52j405k480L440n336p913L20j491L228K278L203J920k518J766M446
$$ y = [-10079, -8758, -9097, -8245, -10756, -6948, -3339, -5819, -1980, -1933, -2040, -741, -4508, -5491, -3842, -2367, -7550, -13352, -13233, -14675, -11498, -7541, -2393, -2311, -6134, -4300, -4435, -6377, -12870, -9821, -457, 2609, 1282, -10454, -20146, -15210, -7020, -2772, 2618, -3398, -17552, -18437, -11106, -1907, -3280, -4304, -4632, 1407, 5281, 7919, 3733, -1150, -1024, -3948, -6177, -9314, -9574, -511, 1857, -8695, -9435, -3670, -660, -1306, -151, -4652, -5540, 3350, 10084, 11020, 8517, -2080, -7687, -7868, -8563, -5693, -8443, -11602, -11394, -8545, -7983, -5047, -3355, -3569, -3225, -2860, -4968, -7591, -9817, -13995, -13560, -4116, 2191, 5524, 14284, 21075, 24923, 11846, 7382, 9753, 10580, 8963, 1909, -4939, -4489, -2265, 2590, 22, 1283, -2693, -3545, -4950, -7430, -3990, -9326, -17239, -16919, -18410, -15182, -12904, -9701, -7781, -10299, -8533, -4087]
14830d087r29L12L507L830L095l464k121J657j249J25m291J756o615M63J898P979
14814A866N32n514m12K918K161l67m092K746Q76p26m526m661J674j85M500o60
14798c870k533l73L222P991j031K915K328r822n676K680K705O21n517K748K528
14783a084K626k313m521J695K222l164o626j833Q57K774O214j28N64M937j611
14768F09j0147M434L575j743q037k990M681j066j975L96L49O143l674n397M33
14753a4409l326o473M215O405K722P120J036n490k826K570P468Q253L621o508
14739D378j990n336J018K035j006N521o716n074M640o74m337l371M107l629j395
14724a1829j391j591M796q50P008m949J140L876L318m169l430p33p49l937N127
$$ y = [-4087, -5016, -4704, -1197, 2633, 5728, 2264, 143, 1800, 551, 676, -3615, -1859, -8474, -8011, -6113, 1866, 2398, -3116, -3528, -610, 1551, 1184, -2908, -162, 714, -12, -4538, -9199, -7525, -7710, -3210, -3870, -6403, -6776, -3554, 4437, 3406, 6321, 8649, -1173, -6849, -4169, -1464, -843, -6360, -3612, -1084, 1542, -771, -5292, -3597, -1375, -4539, -11165, -12998, -12141, -9367, -3153, -3281, -2717, 2220, 609, -9538, -5104, -1529, -3272, -11309, -14299, -9618, -10684, -12659, -12263, -11914, -5771, -9445, -14842, -14409, -17735, -24208, -19993, -13588, -10866, -3746, -2710, -8200, -11026, -8456, -988, 7265, 10886, 4378, 2388, -2948, -1930, 105, -901, 4620, -2096, -7170, -2530, -3204, -7541, -10912, -6805, -10434, -11829, -13220, -14811, -10015, -10865, -3857, -8806, -7666, -3790, -472, -4641, -8071, -8804, -9553, -13490, -8363]
14709h363J722K606K044k468k289Q19J741k126l144L844L256k239j104n78O981
14694G02J222M531K117o791J732o026J786R582k65J026l484k409n143M536M558
14679G674J132n867N763K920q874n807l408Q61J298L029k826k468M614m736l293
14664i988K328O925L22j989L72K825P08k518m218n958O470L607k907m315M446
14649c890N576j60L877M594l105K765M408K600p829m323j209O620j444m384k26
14634C870l870n43q44P76K967q41k784J557N888N24o091P09l255k324K641N107
14618C487j673m810P24M244j16L608N558j729N740k917l793J553j674n202k073
14603I27K890p31j801m135J305J1933J183n661k84o520o24O253N858J869o34L724
$$ y = [-8363, -6641, -4035, -1991, -4459, -6748, -5929, -4188, -6314, -9458, -5614, -2358, -4597, -5701, -6279, 702, 1924, 6455, 8572, 1781, 3513, -2513, -727, 8855, 8590, 9616, 6132, 3723, -1420, 3116, 7674, 8806, 2939, 8702, 11622, 2748, -3059, -6467, -5606, -4308, -1279, -4105, -6573, -1959, -6695, -9988, -7660, -735, -413, -2402, -2030, 795, 1503, -1015, -5233, -11191, -4721, -1114, -4021, -8336, -3890, 1686, 1526, 5403, 9997, 6892, 9657, 14065, 16665, 8836, 4513, 3304, 9924, 8480, 4096, 3870, 0, -543, -1387, -611, 2356, 1515, -1269, 288, 6176, 6700, 609, 1318, -1937, -4261, -1620, 3487, 1814, -2996, -2272, 1972, 1856, 5464, 11022, 9293, 15033, 12116, 8323, 9876, 8202, 3000, 927, 3817, 3086, 1285, -2850, -1545, 10388, 11571, 5910, 5626, -894, -1518, 4735, 10593, 12462, 11828, 15552]
14587A5552N347k066n065n771m708j253k793L393L254n69J652Q438J0029M691
14573C0131p89K5O095J2093J3114R959J1641J9526K9760L2436N7834R1609J15702
14560D29136J15339R4072L6630k0271p3312j05588j07601r3355q2979n7369l6989
14549I7713j7916j3294r158l260J855q313j5779n777m413p983J189K983n33K623
14535A9937J992N052k236N94j497k754n632j5852k520M817L594j132L626M842
14521A2831K520m676L774P560K316l062j2291p927L027o61m467Q76M164j556K446
14506D874J082L72j129l698q786N869N673j29N0j822o577O796P13K638L76q851
14490b549j610O755L975k37N20k970J3M270L649l155J55J169n709q443k150M986
$$ y = [15552, 20899, 18833, 13768, 7997, 3289, 2036, -757, 2636, 5890, 5321, 6973, 15411, 25440, 30131, 29342, 29367, 35462, 47555, 60669, 70628, 82269, 101795, 131555, 163991, 221825, 313434, 429136, 544475, 638547, 675177, 654906, 581594, 476006, 368405, 275050, 192071, 134702, 97713, 79797, 66503, 57345, 54085, 55940, 47627, 31848, 26071, 21658, 13675, 14864, 17847, 17314, 19937, 21929, 26981, 24745, 25339, 23842, 21088, 15456, -396, -2916, 1901, 5495, 4363, 7989, 12831, 15351, 10675, 14449, 22009, 24325, 21263, 8972, 1045, 4072, 3411, -1056, -180, 3984, 2428, 4874, 5956, 6328, 5199, 1501, -7285, -1416, 4257, 4128, 4178, 2356, -4221, 2575, 3288, 5926, 6302, -2549, -4159, 2596, 6571, 6334, 6854, 3884, 3897, 8167, 11816, 8661, 8816, 9985, 4276, -4167, -6317, -1331]
14474a331J316k401l936n466J0002O414l879l357m190K184R668N471o7k896k313
14459E219j1433m797M544R015N986L756j396q483r172J32m469K721P164o26p248
14444i087L03J128N648R519M825M545k314q830j820L504k125k434K35n503o845
14429i251L146L198m52L229L622j945l071J294N705M552m792o309j920O336K01
14414C543o171j339J894j205J093L47K291N54Q53N265J036L924q97o315q22J0679
14398A4730J677l624o261p849K562N682K411r062j572N987L41l14k58N212o719
14383B943m916m61l434M869K903M969j527l010j117m843o239J071K487j680J169
14368f816R82j649l646Q56N990J599L303o08M346J425J0042K501n601k219j1586
$$ y = [-1331, -15, -2416, -6352, -11818, -1816, 4598, 719, -2638, -6828, -4644, 5024, 10495, 10428, 7532, 5219, -6214, -11011, -6467, 2548, 8534, 12290, 10894, 2411, -6761, -6629, -11098, -8377, -1213, -1839, -9087, -8784, -7656, -2008, 7511, 12336, 16881, 14567, 5737, 3917, 7421, 5296, 2862, 3097, -2406, -9251, -6105, -2907, -3359, -130, 3492, 1547, -1524, -230, 5475, 10027, 5235, -1074, -2994, 3342, 3543, -2628, -3967, -2073, -3278, -2185, -1838, 453, 1007, 1860, 7125, 8161, 12085, 11188, 4873, 4051, 14730, 16407, 12783, 6522, -1327, 1235, 6917, 9328, 266, -1306, 4681, 5022, 4708, 4450, 9662, 2943, -1973, -2434, -5868, -999, 1904, 6873, 5346, 2336, 1219, -3624, -9863, -8792, -6305, -7985, -6816, -5834, -7483, -11129, -10273, -4283, -2684, 619, 11, 4357, 5782, 15824, 18325, 12724, 10505, -1081]
14353a081n478J593R017j657k816M152O76K718J321K579m992N32r72L205J618
14338A0415j950M57q073J858N770O940l621q688m729o59K174k475M369L233k347
14323B674M951m92l98l667l494J017J996L818l005L000l429k238J506Q072J686
14308A1997n050l431N522j499l191K449l623J461l940j363O023J708n972m456
14294c365r81L284J660K563P56N632L143n316m060k986M611p26m332L470K550
14279E903J313j937k619r2J627K413J752j262L145m744o435O92P74P115j010n042
14263A593j603l030M337L967n451k985N761j542q232k45K218K481K252k135j135
14248c749N512M757K363J320k450k795r90m57K023L370L965N006k406l181J273
$$ y = [-1081, -6559, -4966, 4051, 2394, -422, 3730, 4406, 7124, 8445, 11024, 6032, 6564, 5592, 8797, 10415, 8465, 8922, 849, 2707, 8477, 15417, 11796, 3108, -1621, -2280, -106, -2581, 1788, 5021, 2674, 7625, 7133, 6735, 3068, -426, 591, 2587, 6405, 3400, 6400, 2971, 733, 2239, 10311, 11997, 6947, 3516, 9038, 7539, 4348, 6797, 3174, 4635, 695, -668, 5355, 7063, 1091, -3365, -4346, -1062, 598, 3161, 3917, 9549, 12692, 7376, 3316, 330, 4941, 4215, -117, 3353, 5903, 7216, 5279, 2660, 2568, 4195, 6608, 8360, 7098, 10243, 5499, -936, -244, 530, 7645, 6635, 1593, -10, -3040, 1297, 5264, -187, -3172, 2589, 1047, -7185, -7430, -5212, -2731, -479, -2614, -3749, 1763, 6520, 8883, 10203, 7753, 4958, 3968, 3511, 5534, 8904, 12869, 17875, 15469, 12288, 13561]
14233A3561j794m58L13J484n709n327J097K301n089J626O16K366K674K739J527
14218A1927o919N12P7n163k817K807k213j839K310K296p64k771k775J103L286
14203i43J995j666J890M016O662l99J33L091o737o796P054Q337p744l156P745
14188A3482J266m14k512n012l932l366J212j781M18L202N145m273l792Q9M878
14173D610O451J00k408l705q628P32L562J132M552M610j326k20m073L890J502
14158A0781m974k505M483P350l547P38J398L3n760k972J459Q549J782p912o17
14143H286P491J793M620r017j4069K205O10k88l227L773R78j286o424K589M867
14128B901q46M81K843n913r85r15L830J379P489K431r084k843j301j991J693O269
$$ y = [13561, 11767, 11309, 11622, 13106, 7397, 2070, 3167, 5468, 379, 2005, 2621, 4987, 7661, 10400, 11927, 5008, 5520, 5597, 434, -2383, 424, -1789, -3628, -1318, 978, 214, -2557, -5332, -4229, -943, 1052, -614, 1276, 5292, 11954, 11555, 11688, 14779, 8042, 1246, 8300, 16637, 8893, 5737, 13482, 14748, 14334, 11822, 6810, 2878, -488, 724, -1057, -639, 2563, 7708, 3435, -357, -268, 4610, 11061, 11161, 8753, 5048, -3580, -2848, 714, 1846, 6398, 11008, 9682, 9462, 5389, 9279, 10781, 5807, 3302, 7785, 15135, 11588, 12326, 13724, 13757, 7997, 5025, 6484, 15033, 16815, 8903, 8286, 15777, 17570, 22190, 13173, -896, 1309, 1919, 1631, -1596, 2177, 3155, 1869, -4555, -1966, 2901, 2055, 2536, 5379, -534, -1519, -2434, 1396, 2775, 10264, 12695, 3611, 768, -533, -2524, -831, 5438]
14112E438P992L744k35m75J311j424o242l107l73N656l92l222r1l644k794K451
14096D593R367k669m570M16J904l429j067M135L676k443J777K198k018j714o351
14081C805M48K415M290K024P55k775N151J747M79j47n329j0390o374K018m131
14066f014O578P974J708Q7o14P551j782n083o14N546L014K831o064r159k653M532
14050G838J326K642L651l090L771m52m663q76l130m723M234L927N589q75p130
14035H039j391K223L95j947n502P13O855K276J016m398j083J177k73Q14R60K225
14019A2099K081M049P72l684m342P08J312l770m371n02K894m828l586R793P097
14004A5722k043M20K492m525M137l571J567P75k299O20J214K71l216j264N90k957
$$ y = [5438, 13430, 17174, 16939, 16464, 17775, 16351, 10109, 7002, 6629, 12285, 11893, 8671, 8580, 4936, 2142, 4593, 13960, 11291, 6721, 7137, 9041, 5612, 4545, 8680, 12356, 9913, 11690, 13888, 11870, 10156, 3805, 4253, 6668, 10958, 12982, 13737, 10962, 16113, 17860, 18339, 18192, 12863, 2473, -3901, -1883, -6014, 564, 8538, 10246, 10333, 9719, 17270, 15488, 10405, 9791, 15337, 18351, 21182, 15118, 5959, 3306, 7838, 9164, 11806, 15457, 12367, 16138, 15686, 11023, 10147, 7017, 2294, 6528, 10455, 16044, 15169, 8039, 6648, 8871, 9266, 7319, 1817, 2530, 9385, 11661, 12677, 8279, 7196, 8373, 8100, 8914, 9874, 12099, 14180, 18229, 19001, 15317, 10975, 11683, 12995, 9225, 4854, 4352, 7246, 2418, -1168, 8625, 15722, 13679, 14099, 16591, 12066, 16203, 12632, 14199, 14974, 12675, 13295, 14509, 14780, 11564, 10300, 10890, 7933]
13988G933L193L435l60j355j177p668m874K420R84K681J82k386k378q82N433k523
13972B658j020R048M656N46J934L465m85r544K801N098k520o447J658L892K351
13957A8091l238n528K119j908n472J548Q689k087R22M11q53l242L806k909k132
13942H217j027Q90j017J07M342L550j508k254K325J307J330n285l371J590k010
13927G186K80J902K25k217K366J359k026m144R4j767m621j849N49P320Q234K702
13911A5593k153k950j558K158K438K985o551K190M784k342l426m05K07L341k93
13896A4018O019J96k57j761k404k882l916l567q51M766K736k056N899O745L572
13881B6257J152p549l838l178O75l600O78l08n303o529O413K144l292l644J206
$$ y = [7933, 11126, 14561, 14201, 12846, 11669, 4001, -873, 1547, 2531, 5212, 5394, 3008, 630, -252, 5181, 2658, 1638, 10686, 15342, 15888, 17822, 21287, 20802, 11258, 14059, 19157, 16637, 10190, 11848, 15740, 18091, 14853, 9325, 11444, 9536, 4064, 5612, 14301, 12214, 13136, 13547, 12694, 9452, 13258, 10349, 8217, 7190, 8080, 7063, 7170, 11512, 15062, 13554, 11300, 13625, 14932, 16262, 10977, 7606, 9196, 7186, 7466, 9368, 9593, 7376, 9742, 11101, 9075, 4931, 5025, 3258, -1363, -3212, -2663, 4657, 12891, 15593, 13440, 10490, 8932, 11090, 13528, 16513, 9962, 12152, 16936, 14594, 11168, 10763, 10970, 14311, 14018, 20037, 20233, 19976, 18215, 15811, 12929, 9013, 5446, 4595, 9361, 12097, 10041, 15940, 22685, 26257, 27409, 19860, 16022, 12844, 13519, 9919, 10597, 10289, 4986, -1543, 4870, 7014, 3722, 78, 1284]
13866A284L792j556M654N244j481k959J936K056L508j577l50m724n901K655o017
13851E64K673N394L277P042J0408l953l822R302n599o139N562L037j971l541J794
13836B4028R74J274l264n823O78J306N619l56k017J402k83r055o330J80L702M027
13820A6062n142J568R41K66m595L404J0034J699p5p37k921r346l665J594O302
13805A5389O807J581K319j001q059k647L649K72k925L565j524j0912L488L126
13791A3128K743j757q196M323J876l517m621L494q10l858K707L028n69N393M893
13776A8257K449o402o762K047K303M057J822N769L971J407l889o864N66r74k065
13761A5692N524j989m366k225o447k21K803O051N944l327q598L230P746j099J952
$$ y = [1284, 5076, 3520, 8174, 13418, 11937, 8978, 10914, 12970, 16478, 14901, 14551, 9827, 3926, 6581, 564, 3237, 8631, 11908, 18950, 29358, 25405, 21583, 30885, 25286, 19147, 24709, 27746, 25775, 22234, 24028, 25002, 26276, 23012, 17189, 17867, 19173, 24792, 24436, 22419, 23821, 23538, 14483, 8153, 8333, 12035, 16062, 10920, 12488, 13429, 13695, 9100, 12504, 22538, 24237, 24162, 23425, 20504, 11158, 7493, 9087, 15389, 22196, 23777, 26096, 25095, 17036, 14389, 18038, 18310, 15385, 18950, 17426, 6514, 10002, 13128, 15871, 14114, 5918, 10241, 12117, 8600, 3979, 7473, 6663, 2805, 5512, 8540, 7971, 13364, 18257, 20706, 14304, 7542, 9589, 11892, 15949, 17771, 23540, 27511, 28918, 25029, 18165, 18731, 17757, 15692, 21216, 19227, 14861, 12636, 6189, 5968, 8771, 14822, 20766, 17439, 8841, 12071, 19817, 18718, 20670]
13746B0670k764Q82j121L123j216m668l538L061N570k566p784qJ841J607j408
13731A1681j655N958L016l595n925r44M785M420L311M096K566r25R26k349m929
13716B0437n335r95j953P770k456q626K077N558n431l394K957J143J863R529l02
13701B2842l095k872J75M282k207l465M290L042K54m5K014J761j001M929o54m590
13685B5660j608j882N232Q188K80m757k996Q79n305n338N926k067N002j716o66
13670B4832q36L493J829j19l613m073N304J124Q58K476M451J617K977M633K16
13655D5169l094m770p865m543N77r699L963J1926O925R42L716k221k574L777L026
13640D5255m231l269k10o483p065m556m806J337J434k967J044j037k827L846J452
$$ y = [20670, 17906, 18788, 17667, 20790, 19574, 14906, 11368, 14429, 19999, 17433, 9649, 9641, 11482, 13089, 11681, 10026, 15984, 19000, 15405, 9480, 8536, 13321, 17741, 21052, 25148, 27714, 26789, 27715, 25366, 20437, 15102, 14107, 12154, 19924, 17468, 8842, 10919, 16477, 11046, 7652, 10609, 11752, 13615, 23144, 22842, 19747, 16875, 17050, 21332, 19125, 15660, 19950, 22992, 23246, 23201, 25215, 26976, 25975, 30904, 30250, 25660, 24052, 22170, 27402, 35590, 35870, 31113, 28117, 28996, 23691, 18353, 24279, 22212, 27214, 25498, 24832, 23996, 27489, 29318, 29199, 25586, 21513, 26817, 27941, 28799, 31275, 35726, 37343, 40320, 44953, 45169, 42075, 37305, 29440, 24897, 25474, 15775, 19738, 31664, 38589, 39531, 43247, 41026, 38452, 42229, 45255, 41024, 37755, 37545, 31062, 23997, 19441, 14635, 15972, 17406, 14439, 15483, 14446, 11619, 15465, 16917]
13625A6917J688J416o11K257l38j57j903n1j856j113P107O252M45m295m123Q280
13609B9915M306j789O79l697j743l314Q4N508N921O318l087j0119m725P253K729
13594C4239m731M516N673m474q451l13P216p600M088M152J339P53P384Q100k668
13579D9223j676l955K6k033j2680m482N701N206p33k286J304j403k139J997N05
13564C2575K137L480l70k147j126o801O94N392L594L643M261p088j329J052k689
13549C5278m470P294R176J871m519j017N357K08o53j885n751J733J74L08k502
13534D0602m953k77j669l767m30l531r015Oj692R88M228K751J9364J0359N070
13519E8034R798K648k461N362O603L873J6539K3276J0857J3001J5009L2393M3780
$$ y = [16917, 18605, 20021, 19410, 21667, 21329, 21172, 19269, 19218, 17362, 16249, 23356, 29608, 30053, 25758, 21635, 29915, 34221, 32432, 33111, 29414, 27671, 24357, 24441, 29949, 35870, 42188, 39101, 28982, 24257, 31510, 34239, 29508, 34024, 39697, 35223, 26772, 26459, 33675, 26075, 30163, 34315, 35654, 36407, 43791, 51891, 49223, 47547, 43592, 43618, 41585, 28905, 24423, 30124, 35330, 34597, 32311, 33615, 32212, 30073, 32070, 32575, 34712, 38192, 37822, 35675, 34549, 27748, 28442, 33834, 37428, 41071, 45332, 38244, 36915, 37967, 35278, 30808, 38102, 47278, 49149, 44630, 43613, 48970, 49178, 48525, 46640, 40889, 42622, 42796, 43104, 40602, 35649, 35372, 33703, 29936, 29506, 25975, 16960, 16966, 15274, 16262, 20490, 23241, 42605, 52964, 58034, 67832, 70480, 68019, 73381, 79984, 83857, 100396, 123672, 134529, 147530, 162539, 194932, 238712]
13506B38712M3683N8183R1886J44048K26788L58735N13650O02287M91872J73589
13496B943433k00317m50283n29267m69605l50364k47340j80655j25284r2245o8218
13486B29855m2944k0691j6094j4753j2970j2079o44j2337j1843n572l039p753
13474F9136j0480p077J011K060N068K731n833J437l236o296k344j75Q65P819m356
13459E0330J13M62P040K27l873l20k835q430m278j784n824M892j928j587L260
13444C5465J0101P179L948J982L069l077l46J973L450J795m125k25M415N351j450
13429F9505o940p92j266j319L47q716q301J076j93n164k618N658L245q23k241
13414D1458j106j393M44L02k12J004j794k76k576J291L901P491N069j0762r470
$$ y = [238712, 282395, 340578, 432464, 576512, 803300, 1162035, 1675685, 2277972, 2769844, 2943433, 2743116, 2292833, 1763566, 1293961, 943597, 696257, 515602, 390318, 298073, 229855, 186911, 166220, 150126, 135373, 122403, 110324, 109680, 97343, 85500, 79928, 76889, 69136, 58656, 51579, 52590, 54650, 59718, 62449, 56616, 58053, 54817, 48521, 46177, 46002, 46867, 54686, 50330, 50443, 50905, 57945, 58172, 54299, 53979, 51144, 42714, 38436, 36652, 30828, 35720, 33792, 32205, 35465, 45566, 52745, 56693, 58675, 61744, 58667, 58321, 60294, 63744, 65539, 61414, 61189, 65604, 70955, 69505, 62565, 61773, 60507, 59188, 59535, 50819, 42518, 43594, 43401, 38237, 35619, 41277, 44522, 43699, 41458, 40352, 38959, 39403, 39705, 39493, 40497, 38703, 38427, 35851, 37142, 41043, 48534, 53603, 42841, 33371]
13399C3371J099J030O59K324J0666J1031P963M494j000m391k070J902l868n769
13385E7441R756N10L778k752k501k139k419m820k639M225J550p675J163Q813M727
13370F7018P788J3897N904P102M001j636l888r539l426l782q803p958m933o207
13356E5538p711j0156n903P294P953o162k954n852m098P962J1718N847K696N44
13342E6716M327P689N946N133K584Q452N030M819P76P32j402l818p71K057J1989
13327A10259J1539J0210j274q249j3029r771p495o728k346M960J2897J1498K3262
13314A35733K2610K3837L2012L5910L5222L3358J5976P010K460m892r284k2099
13302C07853k7090l0373l0845k9279k4424k1983j2141n608l417o350K992J557
$$ y = [33371, 34470, 35500, 36159, 38483, 49149, 60180, 68143, 72637, 71637, 67246, 65176, 67078, 63210, 57441, 67197, 67707, 71485, 68733, 66232, 64093, 61674, 56854, 54215, 58440, 59990, 52315, 53478, 62291, 67018, 74806, 88703, 94607, 101709, 105710, 104074, 100186, 90647, 87221, 83439, 74636, 66678, 61745, 55538, 47827, 37671, 31768, 39062, 47015, 40853, 37899, 32047, 27949, 35911, 47629, 53476, 56172, 56716, 61043, 68732, 74678, 79811, 82395, 90847, 95877, 100696, 101472, 102204, 100802, 96984, 96213, 98270, 110259, 121798, 132008, 130734, 122485, 109456, 99685, 92190, 85462, 83116, 88076, 100973, 112471, 135733, 158343, 182180, 214192, 250102, 285324, 318682, 334658, 341668, 344128, 339236, 329952, 307853, 280763, 250390, 219545, 190266, 165842, 143859, 131718, 126110, 122693, 116343, 119335, 120892]
13290A20892l615J0533J1632j653n975m550j480R65J526q088n495L394L293k446
13276A18933j049q072m554R22j029m795L182L495N82k850n91L730k263L951j070
13261A08522r182n491Q39N804Q597R032O673M588l368k193K794Q55l300m939j0313
13246A08918r681p909M246J232n844l593j0819k544k001j3539j3826o101J7470
13233E6009L4413M1645L2627J9905P76j5381l6100l1545l1759k5538j2045p149
13221B5858j151J0375J2899N802M839P25M307P824L218M626J0772L1050M5786
13208A66930L6380L1960K7177R295m763r963k307M326R98R110K788l430j926P152
13194B73727k954l75m575O821J1526Q367L0559M2624O3471Q1573P8383N2253L5372
$$ y = [120892, 117277, 127810, 139442, 137789, 131814, 127264, 125784, 126749, 128275, 120187, 114692, 118086, 121379, 118933, 117884, 109812, 105258, 106180, 105151, 100356, 103538, 107033, 107615, 104765, 104174, 107904, 105641, 109592, 108522, 99340, 93849, 94688, 100492, 109089, 118121, 124794, 129382, 126014, 123821, 126615, 127470, 124170, 119231, 108918, 99237, 91328, 95574, 96806, 90962, 87369, 76550, 74006, 72005, 58466, 44640, 38539, 56009, 90422, 132067, 164694, 184599, 185375, 169994, 133894, 102349, 70590, 45052, 33007, 25858, 24707, 35082, 47981, 53783, 58622, 59347, 63654, 71478, 74696, 79322, 90094, 121144, 166930, 203310, 235270, 262447, 271742, 266979, 257016, 254709, 259035, 260033, 269143, 271931, 268501, 266575, 273727, 270773, 270398, 265823, 272644, 284170, 292537, 323096, 365720, 429191, 510764, 589147, 641400, 676772]
13181F76772Q0649J18134P2224n0846j45013j57550j11644o4051k7761k3632j7797
13170C49485k1472q915K659J4076J9260K2613K5676J0786M655M524n434m692j540
13157D11681Q063Q486R620J3507J9718J1930J0596M050K627k062m660r59K413
13144D95010J2615K8188L7525L1772J9278K0301K3069J6967Q604N16L145N850
13132G02840J5188K1407K2871J5052M82N613O376P847K0790J8753K5096K0723
13120H83038O601J816O334J8569K1320K5663K6590K8503J6172q942j5948j9842
13108I89874j6505M175L9283O1058P2427P5846O5386N5618N4424O4553O4466N4856
13096A585461N3698P2307Q8893J03557J11255J32540J65463J90752J91691J79888
$$ y = [676772, 757421, 875555, 947779, 896933, 751920, 594370, 482726, 418675, 390914, 367282, 349485, 328013, 319098, 321757, 335833, 355093, 377706, 403382, 414168, 418823, 423347, 417913, 413221, 411681, 419744, 428230, 437850, 451357, 471075, 483005, 493601, 497651, 500278, 498216, 493556, 492597, 495010, 507625, 535813, 573338, 605110, 624388, 644689, 667758, 684725, 693329, 693845, 696990, 702840, 718028, 739435, 762306, 777358, 777840, 783453, 789829, 797676, 818466, 837219, 862315, 883038, 889639, 891455, 897789, 916358, 937678, 963341, 989931, 1018434, 1034606, 1025664, 1009716, 989874, 973369, 977544, 1016827, 1077885, 1150312, 1226158, 1291544, 1347162, 1401586, 1466139, 1530605, 1585461, 1639159, 1711466, 1800359, 1903916, 2015171, 2147711, 2313174, 2503926, 2695617, 2875505]
13086B875505J64763J54463J60082K00137K63800L36172L98739M49386M93227
13077E496274N50880O17953O74725P60867Q92271J076221J318428J635942K009221
13068A5032782K463282L001484L651378M461593N562457P161293R653046J3622142
13060F4609457K0073315L0926371M8974385P4782646R9120283J01011710O6607884
13053E06106051Q654329m7503382q1322735q9074121p7858714n9333376m2609429
13046A17058623l0349203k1747410j5609230j1230437q155585n965285m404583
13039A9596890l282079k483576j923057j547757j281633j082547r07643p58509
13031F330089o35129n08939l97142l19849k48654k00070j94204k24517k48915
$$ y = [2875505, 3040268, 3194731, 3354813, 3554950, 3818750, 4154922, 4553661, 5003047, 5496274, 6047154, 6665107, 7339832, 8100699, 8992970, 10069191, 11387619, 13023561, 15032782, 17496064, 20497548, 24148926, 28610519, 34172976, 41334269, 50987315, 64609457, 84682772, 115609143, 164583528, 239366174, 338486457, 439498167, 506106051, 514760380, 467256998, 385934263, 296860142, 219001428, 159668052, 117058623, 86709420, 64962010, 49352780, 38122343, 29966758, 24001473, 19596890, 16314811, 13831235, 11908178, 10360421, 9078788, 7996241, 7088598, 6330089, 5694960, 5186021, 4788879, 4469030, 4220376, 4020306, 3826102, 3601585, 3352670]
13022C352670k70139k65390k29869j76191j31810j03130q6995q2297p3470q5443
13012A847936j03041r5978q7691q2633p4405p0724o7996o0115l6724j3050j5136
13001A140443j4105l2911m6146o4941o3206n7389o3845n0664l7785l7703l8782
12990F32966m0893l8784m2084l6913l1054k6224j2895j0829j7420k0562k0983
12979C34325k4331j9050j2455M665L729j1597k3609j3615j1235j0527j5377m748
12967A96175K893L091J1823R561J1608K471p825p243j0086k0688j9352j3792r025
12954A49611j771n96P422K634P66O35k648m743o696m755k276J3392J6595J0679
12940A78249O995J3261J4175J2655M291J321J2879L8610R5478J31171J31069O4239
$$ y = [3352670, 3082531, 2817141, 2587272, 2411081, 2279271, 2176141, 2089146, 2006849, 1933379, 1847936, 1744895, 1648917, 1561226, 1478593, 1404188, 1333464, 1265468, 1205353, 1168629, 1155579, 1140443, 1126338, 1093427, 1047281, 982340, 919134, 861745, 797900, 747236, 709451, 671748, 632966, 592073, 553289, 511205, 474292, 443238, 417014, 404119, 393290, 375870, 355308, 334325, 309994, 290944, 278489, 283154, 286883, 275286, 251677, 238062, 226827, 216300, 200923, 196175, 199068, 202159, 213982, 223543, 235151, 237622, 229797, 222554, 212468, 191780, 172428, 158636, 149611, 147840, 147244, 154666, 157300, 158066, 158701, 156053, 151310, 144614, 139859, 137583, 150975, 167570, 178249, 185244, 198505, 212680, 225335, 229626, 230947, 243826, 282436, 377914, 509085, 640154, 704393]
12928G04393k9428p5666n3863k1758l9603o6233o7241n1640l1505j7502j5092
12917B34862k2812k6694k8590k0271j8612j8837k1162j7259q782O638P996L581
12905G0058j3582k5039k2660p267J48J6545L3466M2877L9107K1317J1379M953
12893A71302J618L044O803N947m657l005j897M002M716J953j2572k2884l1270
12880A23100l5901k8690k6437p723J4555L0275K8070K0482Q724O703J769P91q662
12867A27056j1350q564j0980p546L87J33O90Q953O741J9026L0223J8250L881j4160
12853A62740k8990l0390j2543p571n656j2498j7907r331o794P843L399j449J823
12840D2676k143o819P30p53K019P579L909p526o911p675q102j0241l141J362j1148
$$ y = [704393, 674965, 599299, 545436, 523678, 484075, 417842, 350601, 298961, 267456, 249954, 234862, 212050, 185356, 156766, 136495, 117883, 99046, 77884, 60625, 51843, 58481, 66477, 70058, 56476, 31437, 8777, 1510, 1658, 18203, 51669, 94546, 133653, 154970, 166349, 171302, 172920, 175964, 182767, 188714, 184057, 181052, 179155, 183157, 187873, 189826, 177254, 154370, 123100, 87199, 58509, 32072, 24349, 38904, 69179, 97249, 117731, 126455, 133158, 134927, 135718, 127056, 115706, 107142, 96162, 88616, 89003, 89136, 89826, 98779, 105520, 124546, 154769, 173019, 176900, 162740, 133750, 103360, 90817, 83246, 77590, 65092, 47185, 37854, 31060, 38903, 42302, 40853, 42676, 40533, 33714, 34444, 33691, 35710, 43289, 47198, 39672, 32761, 25086, 16984, 6743, 3602, 4964, -6184]
12825f184m604O367N970m44l94R54L21M009J0848O325J1052O150j252J043m768
12810C5393m610q280l322L750k883K3P888K677p508l53O094M395R571k36o346
12795C6253m448j328N471R202Q542K508j262k274q011j0610n978o866j7080j2286
12781h167p437K503J909K695Q518q54o92o259p017J315L987J901J719O307N849
12766F277O083L015k486J078L491Q298M544K15J199O226M047l410j616J519k834
12751C5646q27p859j2612j1778j3717j1122j1927l460Q451L626P15l241r93M356
12737b4742J20K320J0642R922P699N582l240l609L914L642M060p20n045k137L236
12722A1644m359p298l517l247K859k625M542J067O909N144j993J2134J0688J757
$$ y = [-6184, -10788, -4421, 1549, 1105, 711, 1665, 1986, 5995, 16843, 23168, 34220, 40370, 39118, 40161, 35393, 30783, 22503, 19181, 22931, 20048, 20071, 27959, 30636, 23128, 22775, 28869, 33264, 42835, 42599, 36253, 31805, 30477, 35948, 45150, 53692, 56200, 54938, 52664, 44653, 34043, 28065, 21199, 4119, -8167, -15604, -13101, -11192, -8497, 21, -833, -1525, -7784, -14801, -13486, -9499, -7598, -5879, 428, 6277, 12360, 15375, 12889, 13967, 17458, 25756, 30300, 30515, 31714, 37940, 41987, 38577, 36961, 38480, 35646, 34819, 26960, 14348, 2570, -11147, -22269, -34196, -37656, -29205, -25579, -24864, -28105, -29098, -24742, -24622, -22302, -11660, -1738, 5961, 11543, 8303, 4694, 8608, 12250, 16310, 15590, 10545, 8408, 11644, 7285, -13, -3530, -6777, -3918, -6543, -2001, -934, 5975, 11119, 9126, 21260, 31948, 33705]
12708C3705M179J0408J3652J5301K5106M3431M9418L8751J5164j5228l7289m5025
12696A51573l8392k5636j4711r274j0119j0562q999M93N099O59j3524q24o510
12683A9273m590p103p021r640j180M436p71M151j960n10N303L355m150l23K707
12668A977P207N64L894J1699N359N507M177K963r78j774k644n129j2545j1722
12654H555m073J1564J699j494j769p45o839n50P966K831J604L992j75K255Q85
12639B5706j654j547Q509J1131N472l69L043j530o690n322K440N447M787J47l04
12624D9266P488Q918J3314J2840J0377N323j16M138O71Q091J6249L3980M4920
12611B15459N3613P8125J14844J71118K79981M28545N72548N84866L83394J7122
$$ y = [33705, 37884, 48292, 61944, 77245, 102351, 145782, 195200, 233951, 249115, 233887, 196598, 151573, 113181, 87545, 72834, 63560, 53441, 42879, 33880, 34373, 39472, 40131, 26607, 25783, 19273, 14683, 7580, 559, -9081, -10261, -5825, -6596, -2445, -4405, -4915, 388, 3743, -407, -730, 1977, 9184, 9748, 13642, 25341, 30700, 36207, 40384, 43347, 42369, 40595, 37951, 32822, 20277, 8555, 4482, 16046, 17745, 16251, 14482, 13737, 6898, 6348, 14314, 17145, 18749, 22741, 22566, 24821, 25706, 24052, 22505, 31014, 42145, 47617, 47248, 50291, 48761, 42071, 36749, 39189, 44636, 49423, 49570, 49266, 56754, 65672, 78986, 91826, 102203, 107526, 107410, 111548, 112219, 120310, 136559, 170539, 215459, 269072, 347197, 462041, 633159, 913140, 1341685, 1914233, 2499099, 2882493, 2899615]
12601B899615l23732m99301n02038m12577k98019j96886j21112n8125Q93N5592
12591E44310J32263J82627J92405J36027J9240j12678j76083j94475j76099j44464
12581D03073r8590p0609n2354l4048l2809k3590j9226r184l577o873j1098j2444
12569B8671j1822k980J531p30L554j326r156M48L204j040k28L288L880k262m753
12554A0279p46O136j376J041k600j324k79K74k365n510K213j261l845N759Q159
12539A4555K49m151Q14l174p667o845p523P960L506q251j043L650j453P03N651
12524c019o11m190J839J037k326l129K563L149L605k41l458J980L455P208J862
12509I724Q585J610L379l259q28L259l683p120j0398o330k139l495m91k116O65
$$ y = [2899615, 2575883, 2076582, 1574544, 1161967, 863948, 667062, 545950, 487825, 488718, 544310, 676573, 859200, 1051605, 1187632, 1206872, 1094194, 918111, 723636, 547537, 403073, 304483, 233874, 181520, 147472, 114663, 91073, 71847, 62663, 59086, 52213, 41115, 28671, 16849, 13869, 15400, 14670, 18224, 16898, 7742, 8190, 11394, 10354, 10126, 13414, 17294, 15032, 10279, 9533, 15669, 14293, 15334, 12734, 11410, 11131, 11405, 9040, 3530, 5743, 4482, 637, 6396, 14555, 14804, 10653, 11467, 8293, 626, -6219, -13742, -5782, -2276, -10527, -11570, -7920, -9373, -8670, -3019, -3630, -7820, -5981, -4944, -7270, -10399, -7836, -4687, -1082, -1323, -4781, -2801, 654, 7862, 9724, 18309, 19919, 23298, 20039, 19211, 22470, 18787, 11667, 1269, -5061, -7200, -10695, -11186, -13302, -12637]
12494a2637j306l351r65Q098k328M068M768l129j12L33n238k133L546k463P43
12479a2106Q090M42m654N071M320K580j216p045o144n132r6N303M450O74j1520
12464a6983K729M083J306m316o349L473M205k59n942m314J607m23k344j185O219
12449a8493L78Q89K981K441K181R44K136k023l55K334P51n466q398k780P452L009
12433a2019p94M691J384j092R28K484P718o414L568J51l778o66j110q37R414J276
12417D904j798J509p68j774L042O613L614L592R343l263m862q80n348n494q22
12402G608k768J928J729K833k343o426k437k540O19M354j358o388J489m265r1
12387h056K556j128N167J308m510M938q10r980K100J782q81k337K679R557K523
$$ y = [-12637, -13943, -17294, -18259, -10161, -12489, -8421, -3653, -6782, -6894, -6561, -11799, -13932, -10386, -12849, -12106, -4016, -3574, -8228, -3157, 1163, 3743, 2527, -4518, -10662, -15794, -15890, -10587, -6137, -5463, -16983, -14254, -10171, -8865, -13181, -19530, -16057, -11852, -12111, -18053, -22367, -20760, -21183, -23527, -24712, -18493, -18115, -17226, -14245, -11804, -9623, -8679, -6543, -8566, -8921, -6587, -5836, -11302, -19700, -22480, -15028, -12019, -12813, -8122, -6738, -7830, -6902, -4418, 3300, -3114, 454, 605, -3173, -3839, -4949, -5786, 3628, 4904, 3106, 4615, 3847, 2073, 5115, 11728, 15342, 18934, 28277, 25014, 20152, 19272, 13924, 8430, 7608, 4840, 6768, 8497, 11330, 8987, 2561, 124, -2416, -1797, 2557, 1199, -5189, -3700, -7965, -8056, -5500, -6628, -1461, -153, -4663, 275, -535, -10515, -8415, -6633, -7514, -9851, -7172, 2385, 4908]
12372D908K506k399j0529K239q23l393j381Q59J146m913N6P202K906J178m840
12357e278L002N106p380m149n858M591P358M390M062J599q23k521l515k709L413
12342A288k924j0193J365k143j583O819O474M136j2566o921j788Q89Q56P465K880
12327e946k894L209L499m764N772q68R99R812j378j982k038P484R93k704n572
12312C622J306j360J086k860o646q49j466J754K295K414M291K277o942m757K426
12297c409N504N20K032L169o550p044o124k765K602J1141M805R322p867j0279
12283d943L713K761n065j964K354j386J410o825J276L820O512l425o232L854N248
12268A108r674m98J035M136L254M639l285J028J742n799P735M084j443k196k421
$$ y = [4908, 7414, 5015, -5514, -3275, -4098, -7491, -8872, -8013, -6867, -11780, -11724, -4522, -1616, -438, -5278, -2276, 2830, -4550, -8699, -14557, -9966, -2608, 1782, 5844, 7443, 6620, 4099, 584, -2125, 1288, -1636, -11829, -10464, -12607, -14190, -7371, -897, 3239, -9327, -16248, -18036, -17147, -16291, -8826, -5946, -8840, -5631, -2132, -6896, -1124, -1992, -993, 8819, 7441, 5459, 3421, 10905, 11898, 9194, 3622, 4928, 3568, 4654, 1794, -4852, -5701, -7167, -5413, -3118, -704, 3587, 5864, -1078, -5835, -3409, 2095, 2615, 4647, 7816, 1266, -5778, -11902, -14667, -12065, -924, 3881, 13203, 5336, -4943, -1230, 1531, -3534, -5498, -3144, -4530, -3120, -9945, -8669, -4849, 1663, -1762, -7994, -4140, 1108, -8566, -9064, -8029, -3893, -639, 4000, 715, 1743, 3485, -2314, 5421, 9505, 8062, 5866, 3445]
12253C445P97J924r97L335n20n524r964p946L258K516j200K150O504R829k675
12238D932m190L94L516j008o449l848L895J166n582k122L59J834j842j7k877R405
12222b434L611j100L841L557n452n439j81Q36J355J767O22r162m958j662L732
12207a1067O251k348L218P291k32n554P148L564l091m976j681q54r03M72N27n641
12191g876m037j605R45L614P279O004L45N167O399k720l40L106m604o442J772
12176G007J141j798K208l144k479m652o33l053j680J13l324M801J1899q62n337
12161B07l573j436J091M870P100m142K62j580p923J448O084L133l371q2l768m271
12145e951N498J286L51J614J464l352k544N912o24j967k446j020p92m355L40N353
$$ y = [3445, 4242, 6166, 5169, 8504, 7984, 2460, -7504, -15450, -12192, -9676, -10876, -8726, -2222, 7607, 4932, 742, 1136, 4652, 3644, -2805, -6653, -2758, -1592, -7174, -9296, -8937, -7103, -8945, -8962, -11839, -2434, 1177, 77, 3918, 7475, 2023, -3416, -3597, -2761, -1406, 361, 983, -8179, -13137, -14799, -11067, -4816, -7164, -3946, 3345, 3113, -2441, 4707, 8271, 5180, 204, -1477, -2331, -3234, -2762, -2235, -7876, -11913, -13518, -12573, -8959, -1680, 4324, 4669, 9836, 16235, 13515, 13175, 16281, 11677, 5235, 7007, 8148, 6350, 8558, 5414, 2935, -1717, -2350, -5403, -7083, -6970, -10294, -5493, 6406, 5544, 207, -3366, -4802, -3711, 1159, 8259, 4117, 4379, 2799, -5124, -3676, 2408, 5541, 2170, 2088, -1680, -5951, -453, 833, 1184, 2798, 4262, 910, -1634, 4278, 3654, 1687, -759, -1779, -2571, -6926, -6586, -1233]
12129a233k259L183N81k365j993r808K396K842j848J137M962k32q661k150K297
12114a3151j031K498l132J152k651Q99P727m8j951J846K907N96j1505m820P850
12099a2814N820R78K281Q11k76l270n67M749l889j352m642m67J011j272K339j194
12083a1754Q32p32Q975P973M98p72q281k847O072M415j424p001n124j178K056
12068h292L444K103K929J877K930N91j623j491m821N567n399m550o86l126K485
12053h062M131N406P739R368k934r720n076o961m810L24N657J720l476l820J952
12038h562L164k928n888l01J551P155K942j339m5r72k227N362j296J134o378k272
12022a0900N254m86k165m934N58l181n046l720L939N081J46O2K72p83L684P718
$$ y = [-1233, -3492, -309, 272, -2093, -4086, -13894, -11498, -8656, -10504, -9367, -4405, -4637, -13298, -15448, -13151, -14182, -11684, -14816, -13664, -16315, -15416, -7689, -7737, -9688, -7842, -4935, -4339, -15844, -20664, -12814, -6994, -6016, -3735, -2924, -3200, -6470, -7037, -2288, -6177, -7529, -12171, -12638, -11627, -12899, -10560, -11754, -10922, -11654, -2679, 5294, 5792, 5020, -3261, -6108, -36, 4379, 2955, -4046, -9170, -10348, -8292, -4848, -2745, 184, 2061, 4991, 5582, 3959, 2468, -2353, 3214, -2185, -6735, -7421, -10547, -8062, -3931, 1475, 9214, 18582, 15648, 5928, 852, -6109, -10919, -10595, -4938, -3218, -6694, -10514, -8562, -5398, -8326, -14214, -14515, -12964, -5809, -2867, -4206, -4251, -5223, -7450, -2088, -3384, -2250, -8628, -10900, -5646, -6132, -8297, -13231, -12673, -15854, -20900, -24620, -20681, -15600, -15454, -15392, -15120, -15903, -12219, -4501]
12006d501n225r25M542K779l797k740l059j395n153L784M277O098K186k788K385
11991c532J013m48j408m384l742J593k693j682j711K021K268K059M183J120P18
11976d625J679l213R36J086k710L385l579p087n923N703M085k436r76P680l915
11961i910m784K277K428l394j567N326N240K857L153J050o798n037m169M689M215
11946d424j904J455k025l315M64N593M539n395J400N250l18k107m862p001N301
11931g349O546L924m272k769J280l243J031k1l156o55M692L587K696o789N346
11916H48L25Q32l473o300P173j215k766n08q891O085J0775M904j1798l786N106
11901b689J221n926K690m21O61J312k580l398k660Q746K244L68k395n743k76J072
$$ y = [-4501, -9726, -10651, -6109, -3330, -7127, -9867, -12926, -14321, -19474, -15690, -11413, -5315, -3129, -5917, -3532, -2519, -2967, -4375, -8759, -12501, -10908, -13601, -15283, -16994, -14973, -12705, -10646, -6463, -5343, -4625, -2946, -6159, -5223, -4137, -6847, -3462, -7041, -14128, -20051, -14348, -10263, -12699, -13675, -5995, -9910, -14694, -12417, -9989, -13383, -14950, -9624, -4384, -1527, 1626, 2676, -4122, -9159, -13328, -8639, -4424, -6328, -4873, -6898, -10213, -9749, -4156, 383, -5012, -3612, 1638, 1320, -787, -5649, -12650, -7349, -803, 3121, -1151, -3920, -2640, -5883, -4852, -4873, -8029, -8684, -3992, -405, 2291, -4498, 848, 1173, 2005, -1468, -7768, -595, -1810, -4576, -5084, -13975, -7890, 2885, 7789, -4009, -7795, -2689, -1468, -7394, -4704, -5125, -4464, -3152, -5732, -9130, -11790, -3044, -800, -432, -2827, -8570, -8846, -7774]
11885g774K514Q31R7J197p69q617M83M074Q39l172l157J355K42l256L915J517
11869i681p64L150O606M063L023l339N062j21m747p755O760J953k23K415O572
11854A2974n298k222n596J721M07J977j542l572j675O334m162r045L853J929p793
11839a1710q61O193P198r19M766j021K74K471m634k827j37n983l84Q11Q489k345
11823f19n182n173m277j500K862l44N788Q838j150j467j338N810R08p292N19P79
11807b838l970j691L293K334O821M282m762M172L38q441o043M934o18K12P22K216
11791I61r24J751K463J434j907m498j354k920J304K025l455q92L17J256N691J184
11775B436r98N479M0o717R46k612m141j033J593Q32R419M242J82O266J504j659
$$ y = [-7774, -5260, -4429, -4332, -3135, -3904, -12521, -12038, -7964, -7125, -10297, -13454, -12099, -11857, -15113, -11198, -9681, -10445, -7295, -689, 3374, 6397, 3058, 8120, 7999, 3252, -4503, 2257, 4210, 3987, 6402, 12974, 7676, 5454, -142, 1579, 1986, 3963, 2421, -1151, -2826, 3508, -654, -9699, -5846, -3917, -11710, -12571, -6378, 820, -99, 4667, 3646, 3920, 6391, 1757, -1070, -1207, -7190, -7574, -6763, 1726, -619, -5801, -10974, -15251, -16751, -13889, -14233, -8445, 393, -757, -2224, -3562, 2248, 3156, -4136, -3617, -2838, -6808, -8499, -5206, -2872, 3949, 8231, 3469, 7641, 7979, -462, -6505, -1571, -2189, -1977, -1255, 961, 37, 1788, 4251, 5685, 3778, -720, -2074, -4994, -3690, -1665, -5120, -6012, -5695, -4439, 1252, 2436, 1438, 6917, 6957, 240, 1186, -1426, -5567, -6600, -5007, -4175, 5244, 9486, 9668, 15934, 17438, 15779]
11759A5779L286P317Ln655n506k225l283O19K148J798J475q40l308l579m14l741
11743C874r569l819K920K980j678L081J272J618k720M967j053o13M155P9p700
11728b206j946K52L360l09J263L518m166k85M971L020j126N282J222r589o434
11713c173n372M095N800o102Q53L999J2M947l291m623j999K358j450n129k573
11698a1648K982j101q39K655m35J643P31k942l490K423k523j597j133M991M372
11683e911L408J73k049m147p286k404N843R537N523M280P50J176l523j508K700
11668F562o894O67L865J137l650j037K646J912R02m134m41Q75p108O597L344q52
11652D391K813k236j696l588R69O351P919l245n006j0324K635J0014K900L249
$$ y = [15779, 19065, 26382, 26385, 20730, 15224, 12999, 9716, 10335, 12483, 14281, 15756, 14916, 11608, 8029, 7615, 3874, -5695, -9514, -6594, -3614, -5292, -2211, -939, 679, -2041, 2926, 1873, 1260, 5415, 5494, -2206, -4152, -3900, -540, -849, 414, 3932, -234, -519, 4452, 7472, 6346, 11628, 12850, 3261, -3173, -8545, -4450, 1350, -4752, -3899, 100, 112, 5059, 1768, -2855, -4854, -2496, -3946, -9075, -11648, -8666, -9767, -10606, -7951, -8386, -6743, -6012, -8954, -12444, -10021, -12544, -14141, -15274, -10283, -5911, -2503, -2330, -4379, -8526, -15812, -18216, -12373, -2836, 2687, 6967, 7717, 8893, 5370, 3862, 6562, -332, 335, 4200, 5337, 1687, 650, 3296, 5208, 6110, 1976, 1535, 2410, -4698, 1899, 5243, 4391, 7204, 4968, 3272, -316, 653, 7004, 14923, 11678, 6672, -3652, -1017, 8997, 11897, 15146]
11638A5146m01P00p480j3837l867J1423R672r338m291n496n114k368K198k761
11624a5814N953N277N42j759N93Q662M599j0219o507L214J350J18o627K38O077
11609d303j075R22k538j387k274K862O20j834N03N313j145n175L736r58N677O485
11593E429k838q948j111J160Q506O219k57J514l954n546n300r274q74L923N857
11578e494K897M36M019n536o675J0325R772k496o373o350L526P760N796r904q603
11563f900L214M185o204j65q67J696Q706K53l991m606p797n950M921Q377N601
11548D73m99p642L797P005n59o034n72M112O807J450K315M356l680r737k159R674
11532I107R92jR58m639j173j650k286k521l603j33j070J669K180j387l643L654
$$ y = [15146, 14745, 15445, 7965, -5872, -9739, 1684, 11356, 2018, -2273, -7769, -12883, -15251, -13053, -15814, -9861, -4584, -4042, -5801, -5208, 3454, 8053, -2166, -8673, -5459, -4109, -3991, -10618, -10380, -4303, -5378, -4456, -6994, -8381, -10655, -7793, -7173, -9007, -8504, -3191, -4336, -9511, -5775, -6733, -1056, 5429, 2591, -6357, -7468, -6308, 2198, 8417, 8160, 9674, 5720, 174, -5126, -14400, -15274, -11351, -5494, -2597, -2161, 1858, -3678, -10353, -28, 9744, 7248, 875, -5475, -1949, 5811, 11607, 1703, -6900, -3686, 499, -5705, -5870, -6737, -5041, 3665, 3918, -73, -4679, -12476, -18426, -13505, -5128, 473, -26, -7668, -3871, 3134, 2575, -3459, -4031, 81, 6888, 8338, 10653, 15009, 11329, 1592, -567, 9107, 10099, 10098, 11056, 6417, 5244, 3594, 1308, -1213, -4816, -4949, -6019, -4350, -2170, -3557, -7200, -3546]
11516c546l716j000K140j261J533M735M4j775L887L943l314N683j871n214n01
11501b33J79P275m130k93K848l098k413K010M665pm879m415l731o541Q587j311
11485e487o596L25N682j484j003O651m24M902M388k487q087k331j259n25L668
11470d067L270n448k205K563L735K677J531j473l886l664N201L002O53n59N338
11455F668j130l478K711M707J608j580K848K779o617p509n718J410L363J068M653
11440E783j807o082j610j606L401n439n102M050O886J111K819N42N9K09K666N8
11424E938N24l258n546l21L913p46n236K755L970k252M864K975k425k585J289
11409C859m640J177K732K7L428P091q33l183m835n589j597q16j300J398L106P762
$$ y = [-3546, -7262, -8262, -6122, -7383, -5850, -1115, -1071, -2846, 1041, 4984, 1670, 7353, 5482, 268, -233, -54, 7221, 3091, 2798, 5646, 2548, 135, 2145, 6810, 6803, 1924, -2491, -6222, -12763, -4176, -5487, -12083, -11758, -6076, -7560, -8563, -1912, -2336, 2566, 6954, 4467, -3620, -5951, -7210, -7735, -4067, -797, -6245, -8450, -5887, -2152, 525, 2056, 583, -3303, -6967, -1766, 1236, 1889, 1330, 6668, 5538, 2060, 4771, 9478, 11086, 9506, 12354, 15133, 8516, 1007, -4711, -3301, 62, 1130, 5783, 3976, -2106, -3716, -5322, -1921, -7360, -12462, -8412, -1526, -415, 2404, 2946, 3005, 3214, 5880, 5938, 6462, 3204, -2342, -2663, 1250, 504, -4732, -1977, 1993, -259, 4605, 7580, 5155, 2570, 3859, -781, 396, 3128, 3155, 6583, 13674, 12841, 9658, 4823, -766, -2363, -3179, -4479, -3081, 25, 7787]
11393G787j680n907K759Q175o885M065L503l662j585o087J325q120L16L959M985
11378B948k249K64N156N75o65k756L46N108J872N368O05K447J333m207r546k699
11362C900L966k76k63J753J416m217q70L532m493q564K677J0517j536P30N258
11347A3530P24p092k858K212K506j462o72Q87L462l880n04L528M654j322l34K030
11331A5409j252M428l434q935j476J416M490jj084j51q07J583k87l599p171l406
11315d277N740M82R275L896l735m6L418O33L566l179m477n696L939O323L183P291
11299B6336J1046J3489J7296M0374N6469N2558O943k7898m4519l6967l0095k1522
11287F3510j8865j1752m764n394k14m62p993r982Q1M775K016L771o176n858m246
$$ y = [7787, 6107, 200, 2959, 11134, 4249, 8314, 11817, 8155, 6570, 483, 1808, -6312, -5996, -2037, 2948, 699, 963, 6119, 6694, 6029, 3273, 3619, 8727, 10599, 15967, 16572, 19019, 20352, 16145, 6599, 3900, 7866, 7590, 7327, 9080, 10496, 6279, 5409, 8941, 4448, -4116, -1439, 9078, 7542, 8272, 13530, 14254, 7162, 4304, 6516, 9022, 7560, 6888, 7775, 11237, 7357, 6853, 10381, 15035, 13713, 13379, 15409, 14157, 18585, 15151, 6216, 4740, 6156, 10646, 10645, 9561, 9410, 8603, 10186, 9899, 6300, -871, -4277, 1463, 1945, 11220, 15116, 11381, 11335, 14753, 15386, 18952, 15773, 11296, 5600, 9539, 15862, 19045, 26336, 37382, 50871, 68167, 108541, 165010, 217568, 224511, 196613, 152094, 115127, 85032, 63510, 44645, 32893, 28129, 22735, 22521, 22059, 14066, 4084, 4165, 8940, 10956, 14727, 8551, 2693, -1553]
11272a553k239k015k721M991R759J703J885J638L458m610k720J048p470o205N698
11257F47N22L732m105m82K939N938K862L55k367L868P908J0259K1392K7350K5133
11242A05951J5214R826O261j268k1751k2841k1311k1059j1277p063p244q485Q89
11229A5842J688k8J492J91L228m676j923N529j749n714l580N655L444p097n969
11214F333R05l789l810O327O392l639l644m08N605N593k122q795o961J45N518
11199C650n072l572P49K888M957M36m932J013M436K509M869R86p122o258m452
11184d915j218K805Q173m418O842L133L473l17N614n586o763m723o63r75J118
11169A580n162m919M046j924l172P277Q17L293Q051P665p975p861j920P227J4784
$$ y = [-1553, -3792, -5807, -8528, -3537, 6222, 7925, 9810, 11448, 14906, 10296, 7576, 8624, 1154, -5051, 647, 1169, 4901, 796, 314, 3253, 9191, 12053, 12408, 10041, 13909, 21817, 32076, 53468, 80818, 105951, 121165, 130991, 137252, 135984, 114233, 91392, 70081, 49022, 37745, 30682, 23438, 14953, 15842, 17530, 17502, 18994, 19185, 22413, 17737, 15814, 21343, 19594, 13880, 10300, 15955, 19399, 12302, 6333, 7238, 3449, -361, 5966, 12358, 8719, 5075, 4667, 10272, 15865, 13743, 4948, -2013, -1868, 3650, -1422, -4994, -4245, -1357, 3600, 4036, -896, 117, 4553, 7062, 11931, 12917, 5795, -463, -4915, -6133, -3328, 4845, 427, 7269, 10402, 13875, 13558, 19172, 13586, 6823, 2100, 1437, 462, 1580, -3582, -8501, -4455, -6379, -9551, -2274, -1457, 1836, 9887, 17552, 9577, 1716, -204, 7023, 21807]
11154B1807l78m978k506l595n60o63m769n254K37O884O262J192J303J941m918
11139A2005r405j429P54J890J714N623L869k357O81K003j520N163Q857N195K340
11124C5383J780J2291L0960L3642R563R3J771j4o260j6373k3567j5730j2468r747
11110D1324p979m745m387k691n867l265J42N676J183K445m035j774o019K25M500
11095A4733M68M325o06l202M84j869k010P593J370p024m048J420J16O268L340
11080B1358j225p815l504M288K101q82k826j778q04k385O862p09q85R025N378
11065B6199n047m51j1285l409l559J019j746j573O230M457L70L818P62K312o548
11050A1549p292j849J433O660j349m227l264K220J320n130j0572L744J1955N115
$$ y = [21807, 21429, 16451, 13945, 10350, 9790, 9127, 4358, -896, -659, 6225, 12487, 13679, 14982, 16923, 12005, 2600, 1171, 1925, 3815, 5529, 11152, 15021, 12664, 13345, 15348, 13828, 18991, 27848, 33043, 35383, 37163, 49454, 80414, 114056, 123619, 123712, 125483, 125469, 119209, 102836, 79269, 63539, 51071, 41324, 33345, 28600, 24213, 21522, 15655, 12390, 12532, 18208, 19391, 21836, 17801, 16027, 10008, 10233, 14733, 15201, 19526, 18920, 15718, 16202, 14333, 12323, 19916, 21286, 14262, 10214, 11634, 11750, 18018, 21358, 20133, 12318, 8814, 13102, 15203, 14321, 11495, 9717, 8913, 6528, 13390, 12681, 11796, 20821, 26199, 21152, 20701, 9416, 6007, 2448, 3467, 1721, 148, 6378, 10835, 11205, 15023, 15785, 18097, 11549, 4257, 2408, 3841, 10501, 9152, 4925, 1661, 3881, 5201, 71, -10501, -6757, 5198, 10313]
11036A0313K390K374M934k396r265l789J902L251K116L672J457j911J017L067
11022A9132m303j683J038Q188Q70o797l755k776J766M852L492m855j751k896m007
11007F515j15O285Q251J170n662N350n168O69N55o061m067N93k666j219n21J655
10991E564J386J555L570J231j769L60J313J588N34K790M503J681m277n579P321
10976B1771m02l143k460m532J657J275O01J182K553j004R91n453K406j319m417
10961I706m519M322P149J191j79j071j0557o542k78N097Q990M189q659m191K494
10946G142l232q040K526M924j405J582m097L92J435J037n163k768P783L816O273
10931A2205P733l611l48l15K391l466k368L521K565l583P31M15j0602k058K768
$$ y = [10313, 12703, 15077, 20011, 17615, 8350, 4561, 6463, 9714, 11830, 15502, 16959, 15048, 16065, 19132, 14829, 13146, 14184, 22372, 23242, 16445, 12690, 9914, 11680, 16532, 20024, 15169, 13418, 10522, 6515, 6400, 12685, 20936, 22106, 16444, 21794, 16626, 17295, 17850, 11789, 7722, 8315, 5649, 4430, 3909, 5564, 6950, 8505, 12075, 13306, 11537, 11897, 13210, 14798, 15332, 18122, 22625, 24306, 20029, 14450, 21771, 21369, 18226, 15766, 11234, 12891, 14166, 14767, 15949, 18502, 17498, 18489, 13036, 15442, 14123, 9706, 5187, 9509, 16658, 17849, 17670, 16599, 6042, -500, -778, 4319, 13309, 17498, 8839, 4648, 7142, 3910, -4130, -1604, 3320, 1915, 3497, -600, -208, 1227, 2264, -2899, -5667, 2116, 5932, 12205, 19938, 16327, 15979, 15664, 18055, 14589, 12221, 15742, 18307, 14724, 15455, 15870, 5268, 3210, 5978]
10916E978L379K3o533p74M331L649m99l272P96j495K08N174N17j84j049L558o20
10899A3187k838m068j730l370j957M226Q143K661n62l902K227K307L81n54K2M44
10883A4617K434O959J139p504m77j247k738n166P262N649n357n629k35J141L206
10868A4054N913K916k308n608l593K69N88m679n080J3226O832N476L893Q36n870
10853B6865R02j557j15k546j936n004o404L988R58k162L698K235M184k413j514
10838A9179J495k04J065M353j835P75l970q154n570J361R001J0L571P956M262
10823C3295O52N587j960m702k23p973r75J0866Q52q870k551K737L06J619M278
10808C2938M993j957n073n272L170J912M731K375k955k058m102K26n032m749j664
$$ y = [5978, 9357, 9380, 2847, 2073, 6404, 10053, 9554, 6282, 7078, 5583, 5791, 10965, 11482, 11298, 10249, 13807, 13187, 10349, 6281, 4551, 1181, -776, 3450, 11593, 14254, 13692, 9790, 12017, 14324, 14705, 14151, 14173, 14617, 17051, 24010, 25149, 17645, 17168, 15921, 13183, 8017, 15279, 20928, 15571, 9942, 9707, 10848, 14054, 19967, 22883, 20575, 14967, 11374, 11643, 12231, 7552, 2472, 15698, 22530, 28006, 31899, 32735, 26865, 27767, 26210, 26095, 23549, 21613, 16609, 10205, 14193, 15151, 12989, 16687, 18922, 23106, 20693, 19179, 20674, 20470, 21535, 25888, 24053, 24828, 20858, 12704, 7134, 8495, 17496, 17506, 21077, 29033, 33295, 33947, 39534, 37574, 32872, 32649, 24676, 23701, 34567, 35419, 26549, 23998, 26735, 27041, 28660, 32938, 37931, 35974, 30901, 25629, 28799, 30711, 35442, 37817, 34862, 32804, 28702, 28928, 23896, 19147, 17483]
10793A7483L886M240N492j218n82j550N081j433j419k596J188N46n258j13L046
10778B6793L627k65m282j221O490J755m732l643M426n2k779l275K805J504l584
10763B3567n621K463m22M283K943P14N760m447l246K244J892N460N798L35n625
10748C6098l270j002r85N53J223l47K597J89o198J908j612l124m228N370q90J883
10732B8165M14J0059O463o803l532J26M45j552k519M09K237l016j689l352k545
10717B3310j490r83M411J67K0J917J199J056J484J721K638Q670Q121L609J1033
10702F6883K5547K5613L671o971j0194k0105j8274q948o07o210q649O6M196J179
10688D7197n198l475n814J230j999p910P67J716n471O754K242m67k615k454k584
$$ y = [17483, 21369, 25609, 31101, 29883, 29301, 27751, 32832, 31399, 29980, 27384, 28572, 29118, 23860, 23747, 26793, 30420, 30155, 25873, 24652, 31142, 32897, 28165, 24522, 28948, 28896, 26117, 22842, 25647, 27151, 23567, 17946, 20409, 19987, 24270, 27213, 27927, 33687, 29240, 25994, 28238, 30130, 35590, 41388, 41723, 36098, 32828, 31826, 30841, 31394, 32617, 32270, 34867, 35056, 28858, 30766, 29154, 26030, 21802, 27172, 26282, 28165, 28579, 38638, 45101, 38298, 34766, 34892, 35337, 33785, 31266, 31675, 33912, 30896, 29207, 25855, 23310, 21820, 20837, 25248, 25415, 25435, 27352, 28551, 29607, 31091, 32812, 35450, 44120, 52241, 55850, 66883, 92430, 118043, 121714, 114743, 104549, 84444, 66170, 57222, 56615, 50405, 41756, 41822, 46018, 47197, 41999, 38524, 32710, 33940, 31941, 24031, 24798, 26514, 21043, 27797, 30039, 29572, 26957, 24503, 21919]
10673B1919l621j967k741L11K974O08O878m27L598N626L090N205k355j577o91
10658C6830L320O93L618J606k946P046J1856j985r265k818m535k612k616M604
10644D2796K137j233L873P427p37m202R53M163L934P41J973M457M931J352J3352
10629H5917R982J320j2315l138J398J814j170J0397M187K988P929J5660J1949
10616A36918J3401J6680K5020L3486M0353M6119P1196R9767J67038K56748L46605
10605A253331L93167L52738K48324J31678J6253j36272k83022l72725l72154l22466
10595I08852k44577j72767j09634p4348n9861l8082l0394k0539j3101r026m455
10584A32068o07q055O58m51m997n243q633l448p727o933n604o853R23n108n841
$$ y = [21919, 18298, 16331, 13590, 13901, 16875, 17483, 24361, 23934, 27532, 33158, 36248, 41453, 39098, 37521, 36830, 40150, 40843, 44461, 46067, 43121, 50167, 62023, 60038, 50773, 47955, 43420, 40808, 38192, 42796, 44933, 43700, 47573, 55000, 54263, 50061, 51014, 55177, 59111, 59852, 61825, 66282, 71213, 72565, 85917, 95899, 97219, 84904, 81766, 83164, 84978, 83808, 94205, 98392, 101380, 109309, 124969, 136918, 150319, 166999, 192019, 225505, 265858, 311977, 383173, 482940, 649978, 906726, 1253331, 1646498, 1999236, 2247560, 2379238, 2395491, 2259219, 1976197, 1603472, 1231318, 908852, 664275, 491508, 381874, 307526, 247665, 209583, 179189, 158650, 145549, 136523, 132068, 131461, 123406, 124064, 123613, 118616, 113373, 104740, 101292, 93565, 86632, 81028, 74175, 75098, 69990, 64149]
10569F4149l721K21j297m994j0258l834O507no257m966M087K767Q927L381m202
10554E0505k555O267q55J535n45j326o564k85J244n2j34P197M915L028J831m05
10538F3801k726m177L323N033L404j501L084R299j174j330o463l873m588n615
10524E6497n399M630n491J855K826J851K321J1107N664O278L496O842M869N856
10510A03202m664o825k392L98o601q625q006j4948k865j021j185p193k942O625
10496D2958N020J167M033O653n109N739L270J121J780J296M197N308Q249O322
10482I2004Q120M793L01J250N48N525l725q05N239M670P884N022p541j3129j1235
10467I8921q300L309P855J1475R795R227J5730K7962K9587L7150K6567J7503J3813
$$ y = [64149, 60428, 60649, 59352, 54358, 44100, 40266, 46773, 46768, 40511, 35545, 39632, 42399, 51326, 54707, 50505, 47950, 54217, 53362, 54897, 54352, 53026, 46462, 46177, 47421, 47369, 47235, 54432, 59347, 62375, 64206, 63801, 61075, 56898, 60221, 65254, 68658, 67157, 70241, 79540, 78366, 77036, 70573, 66700, 62112, 56497, 51098, 55728, 50237, 52092, 54918, 56769, 59090, 70197, 75861, 82139, 85635, 92477, 97346, 103202, 98538, 91713, 89321, 89719, 83118, 74493, 66487, 51539, 48674, 47653, 46468, 39275, 36333, 42958, 47978, 49145, 53178, 59831, 54722, 60461, 63731, 64852, 66632, 67928, 72125, 77433, 85682, 92004, 100124, 104917, 105218, 106468, 107016, 112541, 108816, 108011, 113250, 117920, 125804, 130826, 123285, 110156, 98921, 90621, 93930, 101785, 113260, 123055, 132282, 148012, 175974, 205561, 242711, 269278, 286781, 300594]
10454C00594J6001K232p171o966j5193j7470j4188k3903k9724k6449j6071j5477
10442A46215q874j1226P31K123p7p44L121K71l86j902k542K765k056l63P686j946
10426A32796n748j2317o893O66n229m630j237J245J0068K727k395J568R42K577
10412A14140L078j816o825K314R999P365o620l541P529R39N036L635j46J148r53
10397A35282k23l276l415o55N41j809k369l999n297q336n757j4299j3010l978
10383F9400M457N378O981J1432J9089J7227J1618J2828R12j5265j9799k1243k3163
10370G9852j9514r367L003O72p896K106P064L001M087Q335P231J5303J3243K4199
10356A31319L3022K9937L0718K0847K1061J1949n28n786L189O671j1k27j351M605
$$ y = [300594, 316595, 318827, 311656, 304690, 289497, 272027, 257839, 233936, 204212, 177763, 161692, 146215, 137341, 126115, 126846, 128969, 128892, 128148, 131269, 131540, 131154, 129252, 126710, 129475, 127419, 127056, 134742, 132796, 127048, 114731, 107838, 108504, 103275, 98645, 97408, 98653, 108721, 111448, 109053, 110621, 111563, 114140, 117218, 115402, 108577, 110891, 120890, 128255, 121635, 118094, 125623, 126562, 131598, 135233, 135087, 136235, 135282, 135059, 131783, 128368, 127713, 128254, 126445, 124076, 120077, 114780, 106444, 100687, 86388, 73378, 69400, 73857, 79235, 86216, 97648, 116737, 133964, 145582, 158410, 159322, 144057, 124258, 103015, 79852, 60338, 50971, 53974, 54646, 46750, 48856, 55920, 58921, 63008, 71343, 78574, 93877, 107120, 131319, 164341, 194278, 224996, 245843, 266904, 278853, 278325, 272539, 275728, 282399, 282388, 282161, 280810, 285415]
10342B85415N093m08l733n806L53J9506K5565L0072M8421N5632O1690M4053N7722
10329F23575Q3777Q0067K6212k0803k5202k7519o4402r4124r0097o8663l3032
10318C89789j2037p617p290J955M223P532R676J5698R639P113J1978O522M688
10305D41869K093O848J2295P372R350Q195j652l86K596o959l439N367Q886R661
10291E02096J6054J8467J6816J9551K4840K4688K7184K1542J3111O493J0808J0717
10279G12367J6786J9089J4114J2912J6015J9538J7216R352P734R461J7826J2921
10267H85331J8113J1644N804L626R704J2701J8332K0996J2292L799K81j130J8298
10254A019791L4459M1373M6953N2726O6725P1336O8075O9187O9462O5743O9163
$$ y = [285415, 290508, 290100, 286367, 280561, 280914, 300420, 325985, 356057, 404478, 460110, 521800, 565853, 623575, 707352, 787419, 813631, 792828, 767626, 740107, 675705, 581581, 491484, 422821, 389789, 377752, 370135, 362845, 364800, 369023, 376555, 386231, 401929, 411568, 418681, 430659, 437181, 441869, 443962, 450810, 463105, 470477, 479827, 488022, 486370, 485984, 488580, 481621, 478182, 483549, 492435, 502096, 518150, 536617, 553433, 572984, 597824, 622512, 649696, 671238, 684349, 690842, 701650, 712367, 729153, 748242, 762356, 775268, 791283, 810821, 828037, 837389, 845123, 854584, 872410, 885331, 903444, 915088, 920892, 924518, 934222, 946923, 965255, 986251, 998543, 1002342, 1002623, 1001493, 1019791, 1054250, 1095623, 1142576, 1195302, 1262027, 1333363, 1401438, 1470625, 1540087, 1605830, 1674993]
10243A674993P6121Q6507J03905J21987J45960J74076J81506J72172J52095J53257
10233C042579J76529J97252K12249K53909L11011L95679N22074O75433Q44218
10224F630933R70586J019515J010805J010675J050164J108246J226779J487915
10216A5515618J920406K495242L151295L837946M650967N786827P565567J0499162
10208E5423030J5514949K4114435L7689362N4821895O7832112O6760026N1304179
10201C73459988L0972857J2065326q190801l1423136n2395942o3254140o2032209
10194A99201943n1982601l8988253k7672120j9447642j3777243r877802p219708
10187C0236574n436027m208399l275873k495877j827918j301356r49723p68777
$$ y = [1674993, 1751114, 1837621, 1941526, 2063513, 2209473, 2383549, 2565055, 2737227, 2889322, 3042579, 3219108, 3416360, 3628609, 3882518, 4193529, 4589208, 5111282, 5786715, 6630933, 7601519, 8621034, 9631839, 10642514, 11692678, 12800924, 14027703, 15515618, 17436024, 19931266, 23082561, 26920507, 31571474, 37358301, 44923868, 55423030, 70937979, 95052414, 132741776, 187563671, 255395783, 322155809, 373459988, 404432845, 416498171, 408307370, 376884234, 324488292, 261234152, 199201943, 147219342, 108231089, 80558969, 61111327, 47334084, 37456282, 30236574, 24800547, 20592148, 17316275, 14820398, 12992480, 11691124, 10741401, 9972624]
10179I972624o86318o39757o42469o80027p12641o91109o21878n22901m31252
10170D344272l70887l27347k87554k51275k23005j92147j54890j22317r1766q7122
10160B235962j05683j08575j12495j15169j09609r8108q9022p1849n6571m1599
10150A327282m2965l1914l8228l9982l9655m7752n3445o1669n7855n4048n8646
10139H01123o1854n3745m2047l5590l9641l7161l3061k1718o615p263n263o211
10127D50954p274j1670j7793j8695j9438k2121j2479j0737j6515j9047j2701n795
10115B76689m875K183L755K958K0726J2457N786Q585k291j8806j9854j9464j0376
10102B57473m022j1290r432R198J5384K6459L1902L1033N6594R3402J27307J41612
$$ y = [9972624, 9286306, 8646549, 8004080, 7324053, 6611412, 5920303, 5298425, 4775524, 4344272, 3973385, 3646038, 3358484, 3107209, 2884204, 2692057, 2537167, 2414850, 2323084, 2235962, 2130279, 2021704, 1909209, 1794040, 1684431, 1586323, 1497301, 1425452, 1368881, 1327282, 1284317, 1252403, 1214175, 1174193, 1134538, 1086786, 1033341, 971672, 913817, 859769, 801123, 739269, 685524, 643477, 607887, 568246, 531085, 498024, 476306, 469691, 462428, 457165, 450954, 443680, 432010, 414217, 395522, 376084, 353963, 341484, 330747, 314232, 295185, 282484, 276689, 271814, 273997, 277752, 280710, 301436, 313893, 319679, 328264, 325973, 307167, 287313, 267849, 257473, 253451, 242161, 232729, 241927, 257311, 283770, 315672, 346705, 403299, 496701, 624008, 765620]
10090G65620J48026J30346Q3457J5239n0081j11158j40396j31867r5139m8410
10080E65637m455K3606L5298K5267J1106J2090L246l1398n8964o0065n0283l6657
10068D34428l7781m5910l8723l4216k7487k1612k9111k0029j7548k0032j4579
10057A27400o941o802j1622n423k293j3173j5593j4707j0423L17J0128J5976K2677
10044H9521K2724K2214K3273J6364J8971J5810M810j766O660L170J080L833L540
10031B30204q040j7961k4549k3972l0213k2122j730l096L058Q230P284R642Q509
10018A35244K0143J0259k830Q97k107p079K13N02K813N495P195M571j882k107
10004A71327J2096J6948K2573L0867L9747M6045P0579R4714J46437K23350L86128
$$ y = [765620, 913646, 1043992, 1127449, 1142688, 1092607, 981449, 841053, 709186, 614047, 565637, 561182, 584788, 620086, 645353, 656459, 668549, 671795, 640397, 581433, 521368, 471085, 434428, 396647, 350737, 312014, 277798, 250311, 228699, 199588, 179559, 162011, 141979, 127400, 120459, 113657, 102035, 96612, 94319, 81146, 65553, 50846, 40423, 40740, 50868, 66844, 89521, 112245, 134459, 157732, 174096, 193067, 208877, 213687, 211921, 218581, 221751, 222831, 226664, 230204, 222164, 204203, 179654, 155682, 125469, 103347, 101617, 98521, 101579, 109809, 117093, 126735, 135244, 155387, 165646, 162816, 163713, 161606, 154527, 154740, 155242, 158055, 163550, 170745, 175316, 173434, 171327, 183423, 200371, 222944, 253811, 293558, 339603, 410182, 504896, 651333, 874683, 1260811]
9993A260811P13124J214335J637468J033880l58396r73802j265450j029114o70195
9984A562661m41708l01646k17368j49527j05626o8408m8050m5807l2610k5675
9974A26236q207p316p816k637j2024p319j1960j3922n508j16N79J274M949M391
9960F0604O204M300J433n461j2736j0392k268n301p130K132M063J977J0093J0190
9946E7708O748J651L010l094m407o081J364L975J269J904K673r75J589j4342j5253
9931C7739j7101n930k827m392o099k374K826n24n991M445m935l404N664Q980O820
9916A2897m374J643M443N316Q015K71L307N125L671K065j700K643L921K434N370
9901E5047j0741n81j824l637r535r459j2186p506n340r78k145q88q353l852M453
$$ y = [1260811, 1973935, 3188270, 4825738, 5859618, 5501222, 4527420, 3261970, 2232856, 1562661, 1120953, 819307, 601939, 452412, 346786, 278378, 230328, 184521, 151911, 126236, 118029, 110713, 102897, 100260, 88236, 80917, 68957, 55035, 49527, 49411, 49990, 51264, 56213, 60604, 66808, 71108, 72541, 67080, 54344, 43952, 41684, 36383, 29253, 31385, 35448, 37425, 47518, 57708, 64456, 66107, 69117, 66023, 61616, 55535, 56899, 60874, 62143, 64047, 66720, 65745, 67334, 52992, 37739, 20638, 14708, 11881, 7489, 1390, -984, 1842, 1318, -4673, -228, -5163, -8567, -2903, 6077, 12897, 8523, 10166, 14609, 19925, 27940, 28211, 31518, 36643, 40314, 42379, 40679, 43322, 47243, 49677, 55047, 44306, 43725, 41901, 38264, 28729, 19270, 7084, -422, -5762, -6740, -8885, -9773, -18126, -21978, -17525]
9886a7525N440L436N014K530Q352N097P087J119J479Q723k351K008R630j330J587
9871D0296L828l961K711K569Q187K103K071J0500J0512P737J8449K1906L4775
9858A61683N4693Q2939J36988K18205L06839K80292R5457j15367k32032k53490
9848G36207k05964j42034q9302n8468l2393k8462l4792k4746j0371n252j0341
9837I4082j2188k476k10k017L029j810j1596R29L454j0487m148M955o385L305
9823E8437J148k811j113k447k394N212M825O317J1285J389M166J1422J7805R644
9809A22885J1146K0459K1450J9374J6590K1154L7158N0259P9969J12339J74811
9798F87594K71993L58875L94835L36703K29947J19153q693j58131k98488l70659
$$ y = [-17525, -12085, -8649, -3635, -1105, 7247, 12344, 19431, 20550, 22029, 30752, 28401, 30409, 40039, 38709, 40296, 44124, 40163, 42874, 45443, 53630, 55733, 57804, 68304, 78816, 86553, 105002, 126908, 161683, 216376, 299315, 436303, 654508, 961347, 1241639, 1337096, 1221729, 989697, 736207, 530243, 388209, 298907, 240439, 208046, 179584, 144792, 120046, 109675, 104423, 94082, 81894, 79418, 79208, 77191, 80220, 78410, 66814, 67743, 71197, 60710, 56562, 61517, 55132, 58437, 59585, 56774, 55661, 53214, 50820, 56032, 60857, 67174, 78459, 79848, 84014, 95436, 113241, 122885, 134031, 154490, 175940, 195314, 211904, 233058, 270216, 320475, 400444, 512783, 687594, 959587, 1318462, 1713297, 2050000, 2279947, 2399100, 2390407, 2232276, 1933788, 1563129]
9788A563129l60297l06486k26604j53710j09476q0861n7943l9207l2368k3973
9778A72204j9051j4726q789K036k167j201n120o15j330O055M674J00j165r708
9764A21197L87K646M779J4813Q778R148R427N865Q315Q759P238R354O975J488
9750B19169M721J8246K0874J5403J2778K3152L1201K4603K1003K0578K6439L5734
9738D73901L2391L5769M6317N6641O0484P0696Q2989R4049R8631J08834J22129
9727A282831J40098J59858J82619K09606K32778K60998K87141L05218L06247K88797
9717C656191K53617J98908J06818J083r4831j86563k60003k93156l09966l02394
9707B769704k92314k75004k43740k09913j86291j65339j44149j22959j09546j08227
$$ y = [1563129, 1202832, 896346, 669742, 516032, 406556, 325695, 267752, 228545, 196177, 172204, 153153, 138427, 129638, 131674, 129507, 128306, 123186, 122571, 121241, 127296, 131970, 132070, 130905, 121197, 121584, 124230, 129009, 143822, 152600, 161748, 171175, 177040, 185355, 194114, 201352, 210706, 217681, 219169, 223890, 242136, 263010, 278413, 291191, 314343, 345544, 370147, 391150, 411728, 438167, 473901, 506292, 542061, 588378, 645019, 705503, 776199, 859188, 953237, 1051868, 1160702, 1282831, 1422929, 1582787, 1765406, 1975012, 2207790, 2468788, 2755929, 3061147, 3367394, 3656191, 3909808, 4108716, 4215534, 4216617, 4121786, 3935223, 3675220, 3382064, 3072098, 2769704, 2477390, 2202386, 1958646, 1748733, 1562442, 1397103, 1252954, 1129995, 1020449, 912222]
9697I12222q6503p4417p2165n3675n3468m5444l9312m2193k7428k3203k4465k3871
9685C46078k7119j9562j7172j0878j5558j4289j6005j1210j6299j3364j3415p827
9673A63380n796J561n948j5782q706m726o133o994j6818K82j839o731L87K270
9659H8407o61j2019l209J701m267l12q87l832n908m204o642n679K156R401p1m129
9643D9845r091m238m50m286R52j51K55M756J084j912p253J063O530J682K843p205
9627C4424k298k598n727o255K642k37n157j666M19L771l411k117O825K323K268
9612B3206N793J900L195j401J95N703L244k584M581O211n335o076j375o739k305
9597B8213K58q28J4M454K741J712k46n536K543l986q8O377k65K914l794p021k863
$$ y = [912222, 825719, 751302, 679137, 625462, 571994, 526550, 487238, 445045, 417617, 394414, 369949, 346078, 318959, 299397, 282225, 271347, 255789, 241500, 225495, 214285, 197986, 184622, 171207, 163380, 157584, 159145, 153197, 137415, 128709, 123983, 117850, 110856, 94038, 94320, 92481, 85750, 86137, 88407, 87746, 75727, 72518, 74219, 69952, 69640, 68753, 64921, 59013, 54809, 48167, 42488, 44644, 54045, 53974, 49845, 40754, 36516, 36066, 31780, 32732, 32581, 32836, 37592, 38676, 36764, 29511, 30574, 37104, 38786, 41629, 34424, 32126, 29528, 23801, 17546, 20188, 19951, 14794, 13128, 13547, 17318, 13907, 11790, 18615, 20938, 23206, 28999, 30899, 34094, 32693, 32888, 38591, 41835, 39251, 43832, 50043, 44708, 38632, 37257, 30518, 28213, 28471, 27643, 27657, 32111, 34852, 36564, 36318, 30782, 33325, 29339, 29251, 35628, 35363, 38277, 34483, 27462, 24599]
9580B4599p687p510o81p98J798Q868L668m323l767r97r122o098n979j45N325J225
9564a624l793R033M530k257l62p350k936K684N496P17O544j992L758Q788k36K086
9548B3086M356j382J884j305k351p754q178R63j718m12K099m93L253M547p688
9533H907j1234l741n83k630M419J3923K428k163m52n21P098K186J833j314j634
9518A6522K772j017o81j872k997l453q27Q24m47k287K513q860k509P904l30n683
9502d28mM423L336L765k39k689o297J455l894j496J338j640K759L620k138r543
9486g672n63M615J865j675K159O76l195K820k657j240N399K859j12Q55Q726J842
9470A4702j0726n399Q253k558j024k831K433J824k141n122m249P125K401l728
$$ y = [24599, 16912, 9402, 8721, 7923, 9721, 18589, 22257, 17934, 14167, 13170, 4048, -2050, -8029, -8174, -2849, -1624, -5417, 3616, 8146, 5889, 5527, -1823, -4759, -2075, 3421, 4138, 10682, 8690, 12448, 21236, 21000, 23086, 27442, 26060, 27944, 26639, 24288, 16534, 8356, 9319, 7601, 7189, 9288, 8795, 12048, 16595, 8907, -2327, -6068, -6651, -9281, -4862, 9061, 11489, 9326, 8874, 8353, 15451, 17637, 19470, 18156, 16522, 19294, 18277, 17596, 15724, 12727, 9274, 8447, 9271, 8824, 6537, 9050, 190, -2319, 5585, 5255, -428, -432, 3991, 7327, 11092, 10853, 8164, 1867, 3322, -572, -2068, -730, -2370, 389, 4009, 1871, -7672, -8235, -3620, -1755, -3430, -1271, -595, -3790, -970, -3627, -4867, 532, 3391, 3279, 4134, 12860, 14702, 3976, -1423, 6830, 4272, 3248, 417, 2850, 4674, 2533, -2589, -6838, 287, 2688, -1040]
9456a040j381j216r31K703O80j305L275M659k18M35n851j153m260r316N00Q438
9440e981Q484M26m518n72l039m389M810N332m466R13m82J419J076K954j74P29
9424B522m647l383l10o984j0282J057P613R444O080q060K048J216k169l727m072
9409a3654J779K004N796O626M44m15m749r056M498M9k027K61n819K659J0294l690
9393e000l980J416M063J134j286o536J274M855l964k000R724M806q354r757j635
9378a5240L950M318k042k916n060m290m516O925R978l265l975r8j498o708j191
9363b5628R250M897p53n553n315M899O489L397K739R5K442j82L984p73r82J066
9347G2K83M199K472l251j0736M178J1886k754M019J649l219M61J922k677O84n83
$$ y = [-1040, -2421, -3637, -4568, -1865, -1185, -2490, 785, 5444, 5226, 5661, -190, -1343, -5603, -14919, -14419, -5981, 2503, 2929, -1589, -2161, -5200, -9589, -4779, 553, -3913, -3000, -3482, -2063, -987, 1967, 1793, 2522, -2125, -5508, -5818, -12802, -23084, -22027, -14414, -4970, 1110, -6950, -4902, -3686, -5855, -9582, -13654, -11875, -9871, -4075, 2551, 2995, 2580, -2169, -11225, -6727, -6678, -8705, -8444, -14263, -11604, -1310, -5000, -8980, -7564, -3501, -2367, -3653, -10189, -8915, -4060, -8024, -10024, -300, 4506, -3848, -13605, -15240, -11290, -6972, -9014, -11930, -16990, -21280, -25796, -18871, -8893, -12158, -16133, -16231, -17729, -24437, -25628, -16378, -11481, -12234, -17787, -23102, -18203, -11714, -8317, -5578, -5483, -3041, -3223, 761, -12, -994, 72, 355, 4554, 7026, 3775, -6961, -2783, 9103, 6349, 10368, 12017, 8798, 9259, 11181, 8504, 9188, 8605]
9331H605p712J208K736l848j897J915L004J416j167O65k873J753K175p065m106
9316e191O604k15n748j200P315M451o005l276N33P59K392l213K106K355m046k704
9300e083R58L202P220R89k416m271L758J668p140q007M753L796j294m694N499
9285a062P042M645l802j842o355k19k65l510M10N3j25l359J959L497m060l529
9269a0522l493M343P0k377L698J837m0j734j223Q54K150L981O39l90l491j46k92
9252f136L129K574N968m213o348l68K782m425L72O76j521m32L857Q34M927K502
9236D178N90l918n901N521M249L368k237l805l584M816L106K370O200M037m931
9221A4059r286o618k473j275K904J146j295l855l801N336k254L040L651l90R06
$$ y = [8605, 893, 2101, 4837, 989, -908, 1007, 4011, 5427, 4260, 4925, 2052, 3805, 5980, -1085, -5191, 1413, 1198, -4550, -5750, 1565, 6016, 11, -3265, -2732, -1973, 419, -2794, -688, 1667, -2379, -5083, -4125, -923, 6297, 7286, 4870, 599, 4357, 6025, -1115, -9122, -4369, -573, -1867, -6561, -1062, 5980, 10625, 6823, 4981, -1374, -1593, -1858, -5368, -4958, -4905, -5030, -8389, -6430, -2933, -6993, -10522, -14015, -9672, -9602, -11979, -8281, -6444, -6484, -8218, -9441, -8587, -6437, -2456, -1817, -2207, -5698, -5844, -6136, -3007, -433, 5535, 1322, -5026, -5394, -2612, -7037, -6665, -5989, -7510, -7942, -4085, -3251, 1676, 4178, 4768, 850, -5051, 470, 4719, 8087, 5850, 2045, -1539, 3277, 6383, 8753, 14953, 18990, 14059, 4773, -1845, -4318, -5593, -2689, -1543, -2838, -6693, -10494, -5158, -7412, -4372, -721, -1111, -205]
9206b05J090k296J981K951J088O857l06q296r78J595k931j921j865l339L95L89
9190e791r18k957k186L054L986J583j83L51m19m13L620m240k634k861J972K635
9174e401M643P689m42m966l867k653j391l752K187N598K073J528k950n383k349
9159i436R646l11j597O72m899m960L338r31P511q31l689K253o017l430J942M003
9143f736M917P42o222J742m85P752M024l079q548o539L081j905L512N011N064
9128B331K414N68j091L927N969J46n37P25P52L49l632r609K658K456n369j626
9112D31L252j142Q7L08k162m72n353m828K102K494P583Q107m791p800m931k648
9096i763M180L152k974M49K362N238l038k332M087J1017M32o009m123k090l100
$$ y = [-205, 885, -1411, 570, 3521, 4609, 11466, 11160, 2864, 1886, 3481, 550, -1371, -3236, -6575, -6180, -5791, -6709, -9666, -11852, -8798, -4812, -3229, -3412, -3061, -3480, -3893, -273, -4513, -7147, -10008, -8036, -5401, -758, 6931, 6489, 1523, -2344, -4997, -6388, -10140, -7953, -2355, -282, 1246, -1704, -7087, -9436, 210, -101, -1698, -1026, -5925, -10885, -7547, -8478, -967, -1798, -5487, -3234, -9251, -12681, -10739, -6736, -1819, -1077, -7299, -5557, -6042, 1710, 5734, 2655, -5893, -12432, -9351, -11256, -7744, -2733, 2331, 4745, 5313, 4222, 8149, 14118, 14264, 13727, 14452, 15204, 15553, 11921, 2312, 4970, 7426, 2057, 431, 3683, 2541, 2628, 2936, 774, 302, -5051, -9879, -7777, -5283, 2300, 10407, 5616, -2184, -7115, -9763, -5583, -2431, -5405, -4956, -2594, 2644, -394, -2726, 1361, 12378, 12810, 6801, 2678, 588, -2512]
9081b512m090Q62N437O99j625N482M029q086j435k349l167K380O02O981K350o887
9065a329p600J894L736l994L30L960l654J105k09J453R99K236l576k831J641K680
9049c159K377M724M364k955O71k180l415J19l092K534J713n77J265J642o439l446
9033e854k681M951L618l481r60j510K049N581l988m45Q80l566m80K59L879L769
9017B021n413m633J687J658K097N297j460J532J674Q46l99l136n750m192L627
9002d544P025K64o726l80N117P05N954N429o567l37Q452j236j185o843k721K139
8986D546N29m237L494M67j499J791M141L448M250J178l562m933j2648j67J399
8971a803N808n91m403K980N21P82k631k669p606j366Q92l330m42M806N583k189
$$ y = [-2512, -6602, -5740, -303, 396, -1229, 4253, 8282, 196, -1239, -3588, -6755, -4375, -3773, 3208, 5558, -1329, -8929, -7035, -3299, -7293, -6963, -3003, -6657, -5552, -5761, -4308, -3309, -1073, -4649, -7480, -5839, -3159, -782, 3942, 8306, 5351, 6022, 3842, 427, 546, -2546, -12, 1701, 1124, 2389, 4031, -2408, -5854, -8535, -3584, 34, -3447, -4407, -5917, -3868, 1713, -2275, -2720, -1840, -5406, -5886, -5627, -1748, 2021, -3392, -8025, -6338, -4680, -2583, 2714, 1254, 2786, 4460, 5306, 4907, 1771, -3979, -8171, -4544, 2481, 2745, -3981, -4361, 756, 1461, 7415, 12844, 6277, 5940, 14392, 13156, 11971, 5128, 2407, 4546, 5075, 838, 4332, 4799, 3300, 5091, 9232, 12680, 16930, 18108, 14546, 9613, -3035, -3202, -1803, 4005, 3414, -989, 1991, 2512, 3294, 663, -2006, -9612, -10978, -10086, -13416, -13858, -9052, -3469, -5658]
8955e658n079M49L426K704O06M526N898l300n503l65J397l477M86O534J719n883
8939a520J366M333k17J960l303j046j553N607n85J05m26j260N024q94K4J212J154
8922I981l202j2J820J333P001k057o514p39J1056P639N410M755P432J0935J0244
8907F5082J1219O682Q438N190Q370M708J1367K2042L1646M8502Q2091J22923J83447
8894F11707K59171K97784K14483J3704j54869k41700k43647j97555j51010j03514
8884C04554p0125m5649k5020j8304k5503j5359n113j0291j0543r388j4463j2579
8872D2217m427m429o794q109m298j021Q75J859m18k476k815K82o17k347o078l177
8856a773L957j65Q867P926l941L540P3j529j325L187Q231J046L999l546L132M709
$$ y = [-5658, -10737, -10288, -6862, -4158, -3552, 974, 6872, 3572, -1931, -2296, -899, -4376, -3890, 2644, 4363, -1520, -154, 4179, 3962, 5922, 2619, 1573, 20, 5627, 5042, 5147, 4721, 3461, 8485, 7591, 7615, 8827, 9981, 6779, 6767, 8587, 9920, 16921, 14864, 8350, 7611, 18667, 26306, 31716, 36471, 43903, 54838, 65082, 76301, 82983, 91421, 96611, 104981, 109689, 121056, 143098, 174744, 223246, 305337, 428260, 611707, 870878, 1168662, 1383145, 1396849, 1241980, 1000280, 756633, 559078, 408068, 304554, 234429, 188780, 163760, 145456, 119953, 104594, 99481, 89190, 78647, 69259, 54796, 42217, 37790, 33361, 26567, 18458, 14160, 13139, 14014, 15873, 15455, 12979, 10164, 10446, 9829, 7482, 1404, -1773, 2184, 2019, 10886, 18812, 14871, 18411, 18484, 16955, 15630, 18817, 27048, 28094, 32093, 28547, 31679, 36388]
8840C6388L27l779k225n113q11K060j510j0292l201Q612L887o087n161m078n083
8825C934M934J680R16n287k869L443P913O414l657J408j156l922o128j847o41
8810E135r93R015J620o312j955P730R013q284q707j022K283k157j848k728k729
8795a939J905N103l854o553k24r26k536K297Q728J874k222m564K53J601o83K404
8779F64n95K402K368k34P976J872j0735m659K61J278M053J07K94k278K527J916
8763G217l019J971L054M332l59o453k671n41O858K392p145k191m67M62j254n04
8747A682q53K04O93k95M529L829O390j454q183l699k16q73N160j372L445L784
8731A2771m048J404J0315k081n219j912L568m36M10O599P318K153J542q43N532
$$ y = [36388, 36715, 32936, 30711, 25598, 24787, 26847, 25337, 15045, 11844, 20456, 24343, 18256, 13095, 9017, 3934, 8868, 10548, 11464, 6177, 3308, 6751, 14664, 21078, 17421, 18829, 17673, 13751, 7623, 5776, 5135, 4142, 13157, 14777, 8465, 6510, 14240, 23253, 14969, 6262, 5240, 7523, 5366, 3518, 790, -1939, -34, 5069, 1215, -5338, -5562, -6488, -9024, -6727, 2001, 3875, 1653, -2911, -2658, -1057, -1740, 664, 69, 2471, 4839, 4605, 12581, 14453, 3718, -941, -680, 598, 4651, 4758, 5052, 2774, 5301, 7217, 4198, 6169, 9223, 13555, 13196, 6743, 4072, 3531, 10389, 12781, 5636, 3445, 2978, 3440, 2186, 1682, 829, 1033, 1726, 1431, 5960, 9789, 16179, 14725, 6542, 2843, 2627, 1754, 6914, 5542, 8987, 12771, 8723, 10127, 20442, 18361, 13142, 11230, 14798, 14362, 14772, 21371, 28689, 30842, 32384, 31541, 37073]
8716C7073N527L518j616r984q047m437R14p745r281k276N808O878O846J065j199
8701B3044k215q437k343M30L573J019o61M734J0012M187k613o722r991k382L831
8686A5466O131k247l508k023Q83Q888M840l343M11L493m771Q13L341m3k153j1250
8670A4928j042L859P57P125K865j000J304K629L523M03kp98n296o632k424M712
8654B4911J274J304j7k774n810L207O812R579j89l825O204N962l882j485k486
8639C8785L048k064O768k58j950o638J72L923r48k843M75l137N143J4956O792
8624F2224K110M681O954J107q000m140k603M752N814J660j496j562j965n6Q0N858
8608G5418M394R119O956Q362K979m653q28J4736J1716Q978K731R442J5573J5890
$$ y = [37073, 42600, 46118, 44502, 34518, 26471, 22034, 22948, 15203, 5922, 3646, 9454, 16332, 23178, 24243, 23044, 20829, 12392, 10049, 10479, 14052, 15071, 14410, 19144, 29156, 33343, 30730, 24008, 14017, 11635, 15466, 21597, 19350, 15842, 13819, 14702, 23590, 28430, 25087, 25498, 28991, 24220, 25033, 28374, 28331, 26178, 14928, 13886, 17745, 18502, 25627, 28492, 27492, 28796, 31425, 34948, 35351, 35349, 34551, 29255, 22623, 20199, 24911, 26185, 27489, 27472, 24698, 18888, 22095, 28907, 38486, 38297, 34472, 40676, 46638, 42756, 41271, 38785, 41833, 39769, 46537, 46279, 44329, 37691, 37863, 41786, 40838, 37995, 38470, 35333, 40476, 55432, 62224, 64334, 69015, 75969, 77076, 69076, 64936, 62333, 67085, 72899, 74559, 73063, 71501, 69536, 69480, 69560, 75418, 79812, 88931, 95887, 104249, 107228, 102575, 101747, 116483, 128199, 137177, 139908, 149350, 164923, 180813]
8594A80813J4508J8317K7623L4224K8759K7330L1225M7189P6727J21538J81092
8583G89345K71288M35591O38611P70430N80864N5182l98385o22632o23925m93818
8573A402551l58732k51273j77399j14632p8749n8555l8156k1630k1255j6985j2193
8562B52992j5395k0249j7233r367j1661j0227m928R80p520M893J2583K729k222
8549A75375K030Q069L501Q299J7535J7032Q584L704R432J2128J4905Q178J695
8536B90467m598j6941j6483j7389j4200k0393k1259j2897n076j0194j0308j4810
8524A25919j2701m945k921r438j1493o469k752q933j214P16J566J736j316l145
8510F4610j817J592j579p680k838j700J654j389N26P507K405K11J006m642j126
$$ y = [180813, 195321, 213638, 241261, 275485, 304244, 331574, 362799, 409988, 486715, 608253, 789345, 1060633, 1496224, 2134835, 2905265, 3486129, 3541311, 3142926, 2520294, 1896369, 1402551, 1043819, 792546, 615147, 500515, 421766, 363211, 325055, 303425, 282170, 265185, 252992, 237597, 217348, 200115, 190748, 179087, 168860, 163932, 164912, 157392, 162285, 174868, 177597, 175375, 177405, 185474, 188975, 197274, 214809, 231841, 240425, 244129, 253561, 265689, 280594, 288772, 290467, 285869, 268928, 252445, 235056, 220856, 200463, 179204, 166307, 161231, 151037, 140729, 125919, 113218, 108273, 105352, 95914, 84421, 77952, 75200, 66267, 65053, 65769, 67335, 69071, 67755, 64610, 62793, 64385, 62806, 55126, 52288, 50588, 52242, 50853, 51379, 58886, 61291, 61502, 62508, 57866, 56740]
8495E6740l200o829o657p91O632o43p670m053l105j527K091j732P445Q246J981
8480D6928l037p721L308N889K933O034o058k489j697N550M519N352J4060J2282
8466H5853K4107J7143l277j2597k8342j9196o364q077p980o278N54o560k587j967
8452B4432k79k765M150m046L071N558P7M472L306l236P06Q960R279M597k270n522
8436E0490q091l952o197j172L852J07m222k936j2540l896k454l470L94P457O242
8421A9612J315K179M360n249m714n780P60L086M953r43J333m295k125l998o36
8406I858K146K800q562N713L155q219k79K579K887K936L508k635o923O23K041
8391A1628j370k016l147q79j141o86J257P62N108N757r59J463p93m858n362q175
$$ y = [56740, 53540, 46711, 40054, 39263, 45895, 45252, 37582, 33529, 30424, 28897, 30988, 29256, 36701, 44947, 46928, 43891, 36170, 39478, 45367, 48300, 54334, 48276, 45787, 44090, 49640, 54159, 59511, 73571, 85853, 109960, 127103, 123826, 111229, 82887, 63691, 57327, 49250, 41270, 34992, 35546, 28986, 26399, 24432, 24153, 21388, 25538, 21492, 24563, 30121, 30198, 34670, 37976, 34740, 35446, 44406, 53685, 58282, 56012, 50490, 42399, 38447, 32250, 31078, 34930, 35037, 30815, 27879, 15339, 11443, 8989, 5519, 5913, 13370, 19612, 20927, 23106, 27466, 22217, 17503, 11723, 12483, 15569, 20522, 19579, 20912, 16617, 14492, 10494, 9858, 12004, 14804, 6242, 11955, 15110, 6891, 6612, 9191, 12078, 15014, 18522, 15887, 8964, 9587, 11628, 10258, 8242, 5095, 4216, 3075, 2389, 3646, 4408, 9516, 15273, 14314, 15777, 14984, 10126, 4764, -3411]
8375c411j118Q130K589O807L064m198k145q875l82P333M352N914m453r659k156
8360A792k617L216L613m336M918O996k459p584k697J75L158L277l243o58L918
8345G469M65M89L51l409K074j77j566P6L890M575j311k846j766k781l65n345k768
8328b945J706O146P589l41n9j845k034l555L61J254k730J988n428L998Q638m10
8312A2333K385n816k758L353j301J183K425j036O310J331M35l875k866j200n18
8297A0385L096K570R91p100n924l184j0039M430J0606j329j116m891n249j171
8283g925l868J013M097N042N942L157q83l855k633J851q21K15J770o235n833j017
8267i983J773N96Q537N496p526L389o8J175r24Q79J099R29q82l305O355N932k501
$$ y = [-3411, -4529, 3601, 6190, 12997, 16061, 11863, 9718, 843, 461, 7794, 12146, 18060, 13607, 3948, 1792, -825, 2391, 6004, 1668, 6586, 13582, 11123, 3539, 842, 1017, 4175, 7452, 4209, 3551, 7469, 7934, 8423, 8774, 5365, 7439, 7262, 5696, 5772, 9662, 14237, 12926, 10080, 8314, 5533, 5168, -177, -2945, -1239, 4907, 12496, 12155, 12096, 10251, 8217, 4662, 5023, 6277, 3547, 5535, 107, 4105, 12743, 12333, 14718, 8902, 6144, 9497, 8196, 9379, 11804, 10768, 17078, 18409, 18844, 14969, 12103, 10903, 10385, 13481, 16051, 17042, 9942, 4018, 834, -9205, -4775, 5831, 4502, 3386, -1505, -6754, -7925, -11793, -10780, -6683, -1641, 4301, 7458, 6575, 2720, 87, 1938, 1117, 1332, 3102, -3133, -8966, -9983, -8210, -7614, 923, 6419, -1107, 2282, 2214, 3389, 2465, 3344, 4443, 5372, 4490, 1185, 7540, 13472, 10971]
8250A0971J674L446j1793p986k490M893K642l086J79O378m21l631m4L011j472
8235B271k352K311M176N579k980l54L114j356k590n071L132j569n682k027K251
8220a147r65M500R181k188k511L1n453j692K186L462k665o324k51K135M251P425
8204I975N422n751l720n421K652J491J0181K700N51m84p711o353n143Q87J963
8189A239N671Q048n1n944l995k314l83K503N586K669N04n047m095J006N599m963
8173F033M737r35j059k69n090R366K032K638j223j007p687Q55L663J928N91M655
8157A9228R20k594K59j182j1909o258P77O267Q744N653r078o625r05l258j352
8142a313N697N032l465o299o120K982R939O753L297l389n950L296J34j299j661
$$ y = [10971, 12645, 16091, 4298, -3688, -6178, -1285, 1357, -1729, -1550, 4828, 4407, 776, 732, 3743, 2271, -81, 2230, 6406, 11985, 9005, 8651, 11765, 10409, 7819, 2748, 5880, 4311, -1371, -3398, -1147, -2112, 2388, 11569, 9381, 6870, 6901, 1448, -244, 1942, 5404, 2739, -3585, -3836, -1701, 2550, 9975, 15397, 9646, 5926, 505, 3157, 4648, 14829, 17529, 18080, 17596, 9885, 3532, -1611, -724, 1239, 6910, 14958, 14907, 8963, 4968, 2654, 2271, 4774, 10360, 13029, 13533, 8486, 4391, 5397, 10996, 6033, 10770, 9835, 8776, 8507, 3417, 12783, 14815, 17453, 16230, 15223, 7536, 8391, 12054, 13982, 14573, 19228, 20148, 17554, 17813, 16631, 4722, -1536, -759, 5508, 14252, 19905, 10827, 4202, 3297, 39, -1313, 4384, 9416, 5951, -348, -6468, -3486, 6453, 13206, 16503, 13114, 7164, 10460, 10594, 9295, 7634]
8127G634n18L101R96m875L271j098K479l220k941l868k671O276l516J419r1N070
8111G448k406n340j703L539l133L128m91l433L747l00l747j920j14L558J505J948
8095B286L739M15J287M015m545L592N528L46o833k987k698L21K086J304L81L596
8079A1833L400k314n783l074k311m145n225K623N327M190J602j073n91N217Q91
8064A0567n027l674N89Q86j789k751q395K89L211P089O428L356l67L157n803n541
8048B225P169m0o232n090J828N730q6j455M584l365R30L598K540j02K397J146
8032A5777m33m583k696L28p93j22J246j735m323p26N807L885J546j226k647k886
8016F419N56M908j899k711R26j977O82P42o229j352O586J1401J715k451K272j573
$$ y = [7634, 7116, 10217, 11213, 6338, 9609, 8511, 10990, 7770, 4829, 961, -1710, 4566, 1050, 2469, 2378, 7448, 5042, -298, -2001, 1538, -1595, 1533, 1042, -2391, 1356, 1056, -2691, -4611, -4725, -1167, 338, 2286, 6025, 6440, 7727, 11742, 7197, 10789, 16317, 16663, 9830, 6843, 4145, 4466, 6552, 7856, 8237, 11833, 15233, 12919, 7136, 4062, 1751, -2394, -7619, -4996, 331, 4521, 6123, 5050, 4459, 9676, 10567, 5540, 1866, 2455, 3341, 1552, -1199, -9594, -9305, -6094, 995, 7423, 10779, 10412, 13569, 7766, 2225, 9394, 9354, 3122, -1968, -140, 5590, 5504, 4049, 8633, 5268, 6198, 9796, 12336, 12234, 14631, 15777, 15344, 10761, 8065, 8393, 7600, 7478, 8724, 6989, 2666, 1940, 7747, 11632, 13178, 11952, 9305, 6419, 6975, 11883, 9984, 7273, 8199, 6222, 6904, 7646, 1417, 65, 6651, 18052, 19767, 17316, 19588, 18015]
8000A8015K700N46o154l545M692L23l245k345K685P550K249l367M856j019j391
7985B2550P327l202m286l385j501N734l82j504m90L12K011m429R34O273j277J416
7969B6101m119k432j246l648O024K418p95l56J827J381p727k732j66O241R209
7954B9980l26p800m800O46P120R726j79o887O845O133J843K273Q758L36P3N515
7938E9256P45L044n470r186n406m575m428j349o573r944Q18P75O057M059O87P915
7922C6425M095M506k955n494m526J998j656p45J176L822J49m638p188m297K109
7907B2781P391M625l495O382K442L324N98j363q07l706q02O813K250m289l032
7892C9112o986J016l09J963l281n647k798o410J461L560N61L304l259o147K826
$$ y = [18015, 20715, 21261, 15107, 11562, 16254, 16577, 13332, 10987, 13672, 21222, 23471, 20104, 24960, 23941, 22550, 29877, 26675, 22389, 19004, 17503, 23237, 22855, 21351, 20861, 21173, 23184, 18755, 19689, 25962, 24685, 26101, 21982, 19550, 18304, 14656, 20680, 23098, 22303, 21947, 23774, 25155, 17428, 14696, 14530, 20771, 29980, 29654, 21854, 17054, 17700, 24820, 34546, 34367, 27480, 34325, 40458, 42301, 44574, 53332, 53668, 53741, 59256, 60001, 63045, 57575, 48389, 42983, 38408, 33980, 32631, 26058, 16114, 16932, 17707, 23764, 27823, 28510, 36425, 40520, 45026, 42071, 36577, 32051, 34049, 32393, 31648, 32824, 36646, 36795, 32157, 24969, 20672, 22781, 30172, 34797, 31302, 37684, 40126, 43450, 44048, 42685, 41878, 38172, 37370, 44183, 46433, 42144, 39112, 32126, 33142, 32833, 34796, 31515, 25868, 23070, 16660, 18121, 21681, 22242, 25546, 22287, 16140, 18966]
7877A8966M34l318l299r2j580N821R163K365N196K445j086j751j0094j774l834
7862A7562k397l722J644l438L08O695K597j574l162j709j267m404N42L43J251
7847I269K451K200m673L837N263k109p641l612n88K807j705n08p862J087L610
7832A826J7o969K907L547l141O046J639n76L92k95l528K73O39O30n671l323j059
7815f646K878P123L188j700j342K520j858M119k5k59r13N231l314R36J124J061
7799A2123o603l017R79j648M87M433K012m479j112N859j761N089l411k267q692
7784b008q380P605M550m703j021j363J91J354m958m562M682k42J98K456k014M749
7768c466P900n318p736L227M872j05J453j854n118l629j70M435K129j151L219
$$ y = [18966, 19400, 16082, 12783, 12691, 11111, 16932, 26095, 28460, 33656, 36101, 35015, 33264, 23170, 21396, 17562, 15165, 11443, 13087, 9649, 9957, 16652, 19249, 17675, 14513, 12804, 11537, 7133, 7675, 8018, 9269, 11720, 13920, 9247, 13084, 18347, 16238, 8597, 4985, 4397, 7204, 5499, 4991, -2871, -1784, 1826, 1843, -5126, -2219, 1328, -1813, 4233, 5872, 5296, 5688, 5393, 1865, 2138, 2777, 3407, -2264, -5587, -6646, -3768, 3355, 6543, 4843, 3501, 6021, 4163, 8282, 8257, 7998, 7085, 12316, 9002, 9938, 11062, 12123, 5520, 2503, 3482, 1834, 2321, 6754, 8766, 4287, 3175, 9034, 7273, 12362, 8951, 6684, -2008, -10388, -2783, 1767, -2936, -3957, -5320, -5129, -3775, -8733, -13295, -8613, -8855, -8657, -6201, -8215, -3466, 4434, -884, -8620, -5393, -521, -626, 827, -1027, -6145, -9774, -9944, -5509, -3380, -4531, -1312]
7753a312j36l36J932L319K998J19p623n243L248K501m245L877R085l429k771m097
7737b113j300k196J021l626L884J848l567m851L610Q994j632M265K346j966p526
7722b809m969L853K426j103k426J090O660q39o228k550p254L418L690M082M726
7707A767k33n873p588j365M564L215N083k090J304j481n995L094K66M434K114
7692A216j758j0015o96l525K375M467l443N43L749j712N010O021N35o127k027
7677e387m274j738O390j430m08K978o43j200m54r08j088M693M576L076L990k642
7661E531L342j826p072o532J804K764M387J545l563R58J548p72j352l670l759
7646f667O521L908K379k845n726k343pJ999q25l574k616M568j295K574L839l257
$$ y = [-1312, -1448, -1784, 148, 3467, 6465, 6584, -1039, -6282, -3034, -533, -4778, -901, 8184, 4755, 1984, -2113, -3413, -5609, -4588, -8214, -4330, -2482, -6049, -10900, -7290, 1704, 72, 4337, 6683, 4717, -2809, -7778, -3925, -1499, -2602, -5028, -3938, 2722, 1883, -4345, -6895, -14149, -10731, -7041, -2959, 1767, 1534, -4339, -11927, -13292, -8728, -5513, -430, -2520, -1216, -2697, -8692, -5598, -5332, -898, 1216, -542, -10557, -11253, -14778, -12403, -7936, -11379, -10836, -7087, -8799, -3789, 2232, 2767, -3360, -5387, -9661, -11399, -5009, -6439, -6847, -3869, -4512, -5712, -6166, -7074, -8162, -3469, 1107, 4183, 8173, 5531, 8873, 7047, -25, -6557, -4753, -1989, 2398, 3943, 380, 1338, 2886, 2114, 762, -2908, -6667, -146, 3762, 6141, 3296, -2430, -4773, -4780, -2781, -3606, -7180, -9796, -5228, -6523, -3949, -110, -3367]
7630c367k349L795O677l700j0795L967j92l32m112n407J129J1732J307k575m343
7615h565r89j448o18N66j240M79l9q06P59L155M376m21M34L0l467J601J473l699
7597h419l744N33K057L164k507m980Q14O292P807K820K329n567k781j479j088
7582d749N267k90O78k039j102r208K038j129L083L725P177k13j823q91j523l822
7566d821l547L731J301K738P168n082l339L014K699o4j583p737j930K790L41J156
7550c165R64M669PL090r20K568n072m894j809r421q15J590j559j02M358L215M381
7533b915J852J315L2p6O87n234J638N361n2L62m270r7j607J34n40p609k174M027
7515i166N417j779l161q2M828J576M64J21N66L15N921k785l267o06M203n259k736
$$ y = [-3367, -5716, -1921, 4756, 1056, -9739, -5772, -5964, -6296, -10408, -15815, -14686, -2954, -1647, -4222, -8565, -9554, -11002, -11620, -11054, -12294, -11815, -11854, -12660, -11901, -8746, -4370, -4791, -4357, -4327, -7794, -6193, -4720, -8419, -12163, -11630, -9573, -6409, -8916, -13896, -13082, -6790, 1017, 3837, 6166, 599, -2182, -3661, -4749, 518, 228, 906, -1133, -2235, -11443, -9405, -10534, -7451, -3726, 3451, 3238, 1415, 524, -999, -4821, -8368, -4637, -3336, -598, 6570, 1488, -1851, 1163, 3862, 3798, 2215, -5522, -7452, -4662, -4321, -3165, -2201, 2468, 2475, 5565, 4645, 7213, 2141, -2753, -4562, -13983, -14798, -13208, -14767, -14869, -10511, -7296, -2915, -1063, 252, 284, 208, 895, -4339, -2701, 2660, 2608, 2970, -1300, -1397, -3004, -2870, -3410, -11019, -13193, -9166, -3749, -5528, -8689, -8771, -3943, -2367, -1903, -1782, -1216, -901, 5020, 2235, -1032, -1638, 2565, -2694, -5430]
7498e430L554j540O89N827P917q131o954J096l403M079M30m7k248J357n52n550
7482h906j858k181l509O527N760K733O92L410k181J754L359m206l641L927K116
7467C796J446k233k499j0226p521Q663P995N47M310k416N70Q99l404j832m695
7452f600K335J751Q479n84l108l66n474J4N416q41o485L294L31K015o116m105
7436a0044Q351P458n76J038p762J960N969p444l671m5O13m544m294O26J648l674
7420a4391r039j300N693M298K130K53L754J345M37j482N130j587L316N92K252
7405A401k662j559o098j0599J635N944M438j00K783M119P526j789k992l709l723
7390e385n250K677j037Q057p67k754m028J157L507Ok016p312l885K632L163J352
$$ y = [-5430, -1876, -3416, -2727, 3100, 11017, 2886, -4068, -2972, -6375, -2296, -1866, -1913, -4161, -2804, -3356, -8906, -10764, -12945, -16454, -9927, -4167, -1434, -742, 2668, 487, 2241, 5600, 1394, -2247, 1680, 3796, 5242, 3009, 510, -9716, -17237, -8574, -579, -32, 4278, 1862, 2432, 3331, -73, -1905, -6600, -4265, -2514, 5965, 5381, 2273, 1907, -3567, -3553, 1863, 1022, -5463, -2169, -1838, 177, -5939, -10044, -1693, 5765, 5189, 6227, -1535, 425, 6394, -1050, -4721, -4766, -4153, -8697, -12991, -12365, -10717, -14391, -23430, -24730, -19037, -14739, -12609, -12356, -8602, -7257, -6820, -8302, -3172, -4759, -1443, -851, 1401, -1261, -2820, -8918, -19517, -17882, -11938, -7500, -7600, -4817, -698, 6828, 5039, 2047, -1662, -5385, -10635, -7958, -8995, -938, -1705, -4459, -8487, -7330, -3823, -3817, -5833, -13145, -17030, -14398, -11235, -9883]
7374i883J09k014j656l90M907L690L74M417M169n20J961m21n980q352m867M169
7358a0287O122N119L827m767m92N349O03j842L637P501J44m852l030l471j1984
7343h423k599k0l343l908K580J0301j9q697j595K596P909J088k988n565m31N793
7327g321K804J02q82n82j561l090L974q66l544R668M237o928m211M041j703j653
7311g515J120K613M84k252J924j25L2P97k101K531K370K476m32j10j010O2J05
7294I69p56m743o455n98O10L328k556l494M737M26K708M326L498l860p200O81
7278h379O368K397j60k496q52n357l006j458l357K384O495M273l905L677n25l015
7262f916j9Q33P671l214m962M84j940p86K265l114N158M669R43K717J810k799
$$ y = [-9883, -9774, -11788, -13444, -13834, -8927, -5237, -4863, -446, 3723, 3203, 5164, 4743, -1237, -9589, -14456, -10287, -4165, 954, 4781, 14, -478, 4871, 5474, 3632, 7269, 14770, 14914, 10062, 7032, 3561, -8423, -11022, -11042, -14385, -18293, -15713, -5412, -5431, -14128, -15723, -13127, -5218, -4130, -7118, -12683, -13114, -7321, -4517, -4415, -5297, -5879, -7440, -10530, -6556, -7422, -10966, -1298, 2939, -3989, -8200, -4159, -5862, -7515, -6395, -3782, -3298, -5550, -3626, -3751, -3719, -2922, -5023, -2492, -122, 2354, 1922, 1812, 802, 864, 969, 213, -4530, -10985, -11583, -10973, -7645, -10201, -13695, -8958, -8532, -5824, -1498, 2000, -1860, -9060, -8379, -2011, 386, 226, -2270, -3122, -8479, -11485, -12943, -16300, -13916, -7421, -3148, -7053, -3376, -3901, -6916, -6935, -6102, 1569, -1645, -6607, -6123, -8063, -8849, -6584, -9698, -4540, 129, 1072, 3789, 5599, 2800]
7246B800l167P790j395L904J62k994n326M66k892n845o72Q45L865M21j673q845
7230a2556j646O969J986O22P107j682K96k757l612P41K156l420o130j450O526
7215f850J452j850p350N90q29l597J78P42N1j487R053J0266L786k406r450R6m7
7198g652m852J293M514n188k968J726K952M837j028k081L795L0M256K262n701
7183c805j4011L628J3486O288j753n123k370n052j069J719r26L273m398k554R561
7168c106P154M039m475l396k807J21L434K559n938m662K809K111j0533J570k307
7153a3427j237K742N518L134J855M482K76j96k920J424O475m927l303k513j664
7138d281L34J20j729l706M254j767P34k988j031N322M209q363M688O698n47j765
$$ y = [2800, -367, 7423, 6028, 9932, 10094, 7100, 1774, 2240, -652, -6497, -7169, -6324, -2459, -2038, -3711, -12556, -14202, -7233, -5247, -4625, 2482, 800, 1096, -1661, -5273, -4532, -2376, -5796, -11926, -13376, -6850, -5398, -7248, -14598, -14008, -14837, -18434, -18256, -17514, -17463, -18950, -9897, 369, 4155, 1749, -7701, -7605, -7652, -12504, -11211, -6697, -11885, -14853, -13127, -10175, -5338, -6366, -8447, -4652, -4622, -366, 1896, -3805, -17816, -14188, -702, 5586, 3833, -1290, -3660, -8712, -9781, -8062, -8988, -5715, -10113, -12667, -3106, 4048, 8087, 3612, 216, -2591, -2470, 964, 3523, -2415, -7077, -4268, -2157, -12690, -11120, -13427, -14664, -11922, -6404, -3270, -1415, 3067, 3343, 3147, 227, 1651, 8126, 3199, -104, -2617, -4281, -3947, -3827, -5556, -9262, -5008, -6775, -6041, -9029, -10060, -4738, -529, -8892, -4204, 2494, 1947, 182]
7122A82J787N522J254m315L628m470r37L55o439j263L88J855N665k19q22J350
7106C521J392q421j026J304L145R552n428j0372m9M840j172K095Q285J957r006
7091F17q362J701L051m583K778j128r028J408P296p692k00Q519j968p444m436
7076a9471N586J0334M957J737l059L919n103k511J125p56J703K965j031o311n441
7061a1357m50Q015M028N112n77o698o387m893M11J892N588K311K001Q10N112p411
7045b493o923L795O385m886k451L181N679n321l226j871q368l723R185P043k586
7030f580j637J782J363p107k563M453J356O81m817L689M420J847j211M575K409
7015B660l046K501R52k668N57O551l880l145q57O577J173m596k569l067L24k898
$$ y = [182, 1969, 7491, 8745, 4430, 8058, 3588, 2651, 3006, -3433, -4696, -4308, -2453, 3212, 2993, 2171, 3521, 4913, -3508, -4534, -3230, -85, 9467, 4039, -6333, -6382, -1542, -2714, -619, 7666, 9623, 617, -7745, -6044, -2993, -7576, -4798, -5926, -14954, -13546, -6250, -13942, -14142, -5623, -7591, -15035, -19471, -13885, -3551, 1406, 3143, 84, 4003, -1100, -3611, -2486, -3242, -1539, 1426, 395, -5916, -11357, -11807, -3792, 236, 5348, 4771, -1927, -8314, -13207, -12796, -10904, -5316, -3005, -1004, -194, 4918, -2493, -9416, -5621, 764, -4122, -6573, -3392, 2287, -3034, -6260, -8131, -16499, -20222, -11037, -3994, -6580, -8217, -6435, -5072, -12179, -14742, -10289, -8933, -8252, -13069, -9380, -4960, -3113, -4324, 251, 2660, -386, 2115, 3067, 399, 956, 7507, 3627, 482, -375, 6202, 7375, 2779, 210, -2857, -2533, -5431]
6999e431L001N86k816k313J275N310l726J436J895J16K921K124m36m22l079o60
6983b19j169q78j322k875L341P799j472j060L026K142o086n527R916p012p519
6968h915j694J739o65j776N56L508P391L584j1765o462k013L17P142Q535L922
6953C404j764r17k868R701j234m128k206k974j368o37m820l1N065P430P393l128
6937F918q576l089j007L425K100m071L319K437k265P35n74k140N1k47N17o59L366
6920B40j4M05j226k301p517m514l812Q97J1546N133Q227L291r21r415r564o727
6904a6272n428k174M206M028N929J775M640O297O10o393m97k130n941L128l118
6889a1340K172L014P327J37k004J265j085J325l286q183M63R276L91n444J898
$$ y = [-5431, -2430, -1844, -4660, -6973, -5698, -388, -4114, -2678, -783, -667, 2254, 4378, 3942, 3520, 441, -219, -1388, -2266, -3588, -6463, -3122, 4677, 3205, 2145, 5171, 7313, 1227, -4300, 5616, -1396, -8915, -10609, -8870, -9535, -11311, -10755, -7247, 144, 3728, -8037, -14499, -16512, -16195, -9053, -518, 3404, 1640, 723, -2145, 7556, 6322, 2194, -12, -2986, -4354, -4991, -9811, -9842, -4777, 2653, 10046, 6918, -1658, -4747, -5754, -2329, -229, -4300, -981, 1456, -809, -74, -648, -2788, -2737, -2984, -2467, -3126, 240, 226, 631, -595, -2896, -10413, -14927, -18739, -17842, -6296, -1163, 7064, 10355, 9434, 19, -9545, -16272, -21700, -23874, -19668, -15640, -9711, -7936, -3296, 3001, 3611, -2782, -3279, -5409, -11350, -8222, -11340, -9168, -6154, 1173, 1310, -694, 571, -514, 811, -2475, -10658, -10195, -919, -528, -5972, -4074]
6874d074O598n661r13r58j270J236k20R22L661o08l645k461l60P55M919P35L075
6857A731o33k416l800r539J908P801j052k26L969q33K208O863p242l852j587N72
6841f128M021k961j133R56j889l791N378M788K590K999m473J94J460j332k257
6826a578j259o091k060L640m16N839k96m998K256L720L439n604n299J531p44L304
6810d616l453j719L288K612J644K516m234j034L674p74o64q59o884n577M32J958
6794a3690J3707K021l365j515J161P5L685L436l908l011n180J302j39j904j2313
6779a9638K539J0424M427l654K708k431J085K229N815L140j310n660n846Q46L112
6764b214k874O5m536q40l105J182J837k252p41M440P500O230r86p706k586l142
$$ y = [-4074, 2524, -3137, -4050, -5008, -6278, -5042, -5262, -4340, -679, -1287, -4932, -7393, -7753, -6998, -2079, -1344, 1731, 1098, -1318, -5118, -14657, -12749, -4948, -6000, -6226, -2257, -3090, -882, 5981, -1261, -5113, -6700, -6128, -2107, -5068, -6201, -5245, -7134, -10925, -5547, -759, 1831, 4830, 357, 551, 2011, 679, -1578, -2837, -8928, -10988, -7348, -7764, -1925, -2221, -7219, -4963, -1243, 2196, -3408, -8707, -7176, -7920, -4616, -8069, -9788, -6500, -3888, -2244, 272, -3962, -4996, -1322, -2096, -2760, -3619, -10503, -16080, -15648, -13690, 17, 2038, -1327, -2842, -1681, -1606, 2079, 5515, 1607, -1404, -6584, -5282, -5421, -7325, -19638, -17099, -6675, -2248, -5902, -3194, -5625, -4540, -2311, 3504, 6644, 5334, -326, -6172, -5326, -2214, -5088, -5023, -9559, -10399, -13504, -12322, -10485, -12737, -13478, -9038, -1538, 4692, 3706, -4000, -6586, -9728]
6748i728j667K253N091k05k49k229L637O244o641r445N7Q615N41j599k813R1J65
6731g882K210O245n372J859R063J438l990r777K123j26k702N349M417L012l265
6716B602j714l150m800l396q7L184J952j8J206l261l46O105l43j124L969k426
6700a647K543M946J919l318k176M359K180L920n304N116M401K013j715p04o416
6685A0117K275L147n566J018o2M972O879Q373P031J0808J0311N092j342l016j3234
6670D6803j4139j1301k930j546m660n265J053j260l467j467K979k958o307j035
6656e500K263Q83j551o328L612L471j425l082l93L960m95r13l173N465N34J909
6640g63l759k172J448O922j907q333n540M315j875Q438K293n460n556O168N111
$$ y = [-9728, -11395, -9142, -4051, -4256, -4505, -6734, -3097, 3147, -3494, -12939, -12882, -4267, -3726, -5325, -8138, -8047, -7882, -5672, 573, -4799, -2940, 6123, 7561, 3571, -6206, -4083, -4209, -6911, -1562, 2855, 5867, 2602, 888, -2262, -7062, -10458, -10545, -7361, -5409, -5427, -4221, -7482, -7828, -1723, -2066, -3190, 779, -1647, 896, 5842, 7761, 4443, 2267, 6626, 8806, 12726, 7422, 12538, 16939, 18952, 17237, 16533, 10117, 12392, 15539, 9973, 10991, 10929, 15901, 22780, 31153, 38184, 48992, 59303, 64395, 63053, 60037, 46803, 32664, 21363, 18433, 16887, 12227, 6962, 8015, 6755, 3288, 1821, 4800, 1842, -4465, -5500, -3237, -2354, -3905, -10233, -6621, -3150, -4575, -7657, -8050, -4090, -4585, -5498, -8671, -3206, -2672, -763, -4522, -6694, -5246, 1676, -231, -8564, -14104, -9789, -11664, -3226, -933, -6393, -11949, -5781, -670]
6625f70O313R09k424m16n076j931k514m640O206O658o731m869k40K339J0508J843
6609E265p223q652l066K343L850m392P55l261m754L842J0304P813K867j394j451
6594B846n196n303j262L19Q93l604l486L37J0016l001O41N624J1198J039p761
6579C300p942M547L036r225n380q84M810p79J503j083R96K277J23O05L345o77
6563a428n252M07K218j149r72J652J555O538M769M184j0541o124l698o27J858
6548f610N168Q6R64k545j508J367n93j296N273m302P90O059j238j00j570m887
6532d942l405l774l44P260k181j013k536N275N010m217l859J122J10J336O9r385
6516a5474j479J956O241k967J227M62J749k165o39P30L683L034j144J341k858
$$ y = [-670, 5643, 6552, 4128, 3712, -1364, -3295, -5809, -10449, -4243, 2415, -4316, -9185, -9425, -7086, 3422, 5265, -1958, -10610, -13676, -11333, -7483, -11875, -11120, -14381, -19135, -15293, -4989, 2824, 5691, 4297, 2846, -2350, -7653, -8915, -8596, -7703, -11307, -14793, -14456, -4440, -7441, -6800, -1176, 10022, 11061, 3300, -4642, -95, 2941, -6284, -11664, -12548, -7738, -8517, -7014, -8097, -7101, -4824, -4701, -4096, -751, -1428, -6680, -6273, -4055, -5204, -6176, -4524, -2969, 3569, 8338, 12522, 1981, -4143, -7841, -8468, -6610, -1442, -1356, -392, -2937, -4445, -3078, -3671, -4967, 306, -3996, -3206, 2853, 1615, 1515, -55, -4942, -8347, -12121, -12465, -5205, -7386, -8399, -10935, -5660, -650, -4867, -8726, -7604, -7494, -6158, -6089, -15474, -16953, -14997, -8756, -11723, -10496, -10034, -8285, -10450, -11089, -10359, -6676, -3642, -4786, -3445, -6303]
6501f303o103P135R555J737n713m788n83K140M138n645k853K067l698P09P045
6486a160J420j640L387L800o352p229k717p236j922N746P101Q13n942l823Q258
6471g496P53M92M232P96l511l101J062K240k590j668L254k840p022q95j94O900
6455i588L967J1372M283o851k692q37m744l047M64l435k845j615J571J394P527
6440e076M480n277K165K569j132m735n6j828K147O193l035J233L79L132M462J386
6424G007r426J392N096J82q52l135k190n499n924L34R30J010J841m246k04J991
6408a1693m862J888M407K721N49K439M949Q64M389J269l735q627r95l85J268m597
6392a0151l27L256N423M091L166m271l130N413L082j0362l228k594p749j182K993
$$ y = [-6303, -12406, -5271, 4284, 6021, 308, -4480, -5063, -2923, 1215, -4430, -7283, -5216, -8914, -8205, -1160, 260, -1380, 2007, 5807, -545, -7774, -10491, -17727, -19649, -13903, -6802, -5989, -11931, -15754, -7496, -6743, -6251, -2019, -1223, -4734, -7835, -6773, -4533, -7123, -8791, -5537, -8377, -15399, -16294, -16488, -9588, -5621, 5751, 10034, 3183, 491, -346, -5090, -8137, -7673, -11108, -13953, -15568, -13997, -12603, -5076, -596, -5873, -3708, -1139, -2271, -7006, -7062, -8890, -6743, -550, -3585, -2352, -1973, 1159, 5621, 7007, -2419, -1027, 4069, 4251, 3399, 264, -1926, -7425, -13349, -13015, -12085, -11075, -9234, -13480, -13684, -11693, -16555, -14667, -10260, -7539, -6990, -4551, 398, 1262, 5651, 6920, 3185, -5442, -6437, -6822, -5554, -10151, -10478, -7222, -1799, 2292, 5458, 1187, -1943, 3470, 6552, -3810, -7038, -9632, -17381, -18563, -15570]
6377a5570K660N259j185L02P09j154N619N691J6M42o06m211O71N343M561j426
6361G121r504o159K096M849m175o674K089L268R96p85N234J0923N827k001k454
$$ y = [-15570, -12910, -7651, -8836, -8534, -7825, -8979, -3360, 2331, 2347, 2789, 2183, -2028, -1357, 3986, 8547, 7121, -2383, -8542, -6446, -1597, -5772, -12446, -10357, -7089, -6093, -6878, -1644, 9279, 15106, 13105, 10651]
$$ [...]
##END NTUPLES=NMR SPECTRUM
##END=
