##TITLE=Analysis number 310762
Compound Code cc 12609
Book Reference 1
Project Code adrs
Chemist Name fudan
##JCAMPDX= 6.0         $$ Bruker NMR JCAMP-DX V2.0
##DATA TYPE= NMR SPECTRUM
##DATA CLASS= NTUPLES
##ORIGIN= Bruker BioSpin GmbH
##OWNER= NMR
$$ XWIN-NMR		Version 3.5
$$ Thu Jun 23 11:20:32 2005 GMT Daylight Time (UT+1h)  MAYBRIDGE\NMR@NMR_250MHZ
##.OBSERVE FREQUENCY= 250.131544655141
##.OBSERVE NUCLEUS= ^1H
##.ACQUISITION MODE= SIMULTANEOUS (DQD)
##.ACQUISITION SCHEME= undefined
##.AVERAGES= 16
##.DIGITISER RES= 18
##SPECTROMETER/DATA SYSTEM= dpx250
##.PULSE SEQUENCE= zg30
##.SOLVENT NAME= CDCl3
##.SHIFT REFERENCE= (INTERNAL, CDCl3, 0, 16.522)
##AUDIT TRAIL= $$ (NUMBER, WHEN, WHO, WHERE, WHAT)
$$ ##TITLE= Audit trail, XWIN-NMR		Version 3.5
$$ ##JCAMPDX= 5.01
$$ ##ORIGIN= Bruker BioSpin GmbH
$$ ##OWNER= NMR
$$ C:\u/data/dgb/nmr/ADRS/4610/pdata/1/auditp.txt
$$ ##AUDIT TRAIL=  $$ (NUMBER, WHEN, WHO, WHERE, WHAT)
(   1,<2005-06-23 11:20:09.11 +100>,<MAYBRIDGE\NMR>,<NMR_250MHZ>,
      <created by zg, POWCHK disabled, PULCHK disabled
       configuration hash MD5:
       62 19 C7 07 E1 42 D1 B7 37 6C 3D D0 77 39 F9 E6
       data hash MD5: 64K
       0F D4 87 0D B4 C1 90 92 6E 72 3D FB A6 B3 B5 A2>)
(   2,<2005-06-23 11:20:23.07 +100>,<MAYBRIDGE\NMR>,<NMR_250MHZ>,
      <Start of raw data processing
       ef LB = 0.3 FT_mod = 6 PKNL = 1 SI = 32K 
       data hash MD5: 32K
       FC 55 50 D8 B4 47 10 80 E9 F0 BD 72 C6 CA 30 2B>)
(   3,<2005-06-23 11:20:25.60 +100>,<MAYBRIDGE\NMR>,<NMR_250MHZ>,
      <apk 
       data hash MD5: 32K
       6B 19 5A C6 9C E7 E8 4D E0 D4 59 25 8C B3 C9 7F>)
(   4,<2005-06-23 11:20:26.30 +100>,<MAYBRIDGE\NMR>,<NMR_250MHZ>,
      <abs ABSG = 5 
       data hash MD5: 32K
       BC 53 DA DA 4A E1 CE FD F4 A4 C7 AD 32 B7 0E F6>)
$$ ##END=
$$ 
$$ hash MD5
$$ 77 D4 AF C7 33 1A 36 56 91 89 4B 1A 54 C4 9B ED
##$RELAX= 
##$RELAX= 
##$RELAX= 
##$RELAX= 
##$RELAX= 
##$RELAX= 
##$RELAX= 
$$ Bruker specific parameters
$$ --------------------------
##$DU= <C:\u>
##$EXPNO= 4610
##$NAME= <ADRS>
##$PROCNO= 1
##$TYPE= <nmr>
##$USER= <dgb>
##$AMP= (0..31)
100 100 100 100 100 100 100 100 100 100 100 100 100 100 100 100 100 100 
100 100 100 100 100 100 100 100 100 100 100 100 100 100 
##$AQSEQ= 0
##$AQ_mod= 3
##$AUNM= <au_zg>
##$AUTOPOS= <7 >
##$BF1= 250.13
##$BF2= 250.13
##$BF3= 250.13
##$BF4= 250.13
##$BF5= 500.13
##$BF6= 500.13
##$BF7= 500.13
##$BF8= 500.13
##$BYTORDA= 1
##$CFDGTYP= 0
##$CFRGTYP= 5
##$CHEMSTR= <none>
##$CNST= (0..31)
1 1 145 1 1 1 1 1 1 1 1 1 1 1 1 1 1 1 1 1 1 1 1 1 1 1 1 1 1 1 1 1 
##$CPDPRG= <>
##$CPDPRG1= <>
##$CPDPRG2= <>
##$CPDPRG3= <>
##$CPDPRG4= <mlev>
##$CPDPRG5= <mlev>
##$CPDPRG6= <mlev>
##$CPDPRG7= <mlev>
##$CPDPRG8= <mlev>
##$CPDPRGB= <>
##$CPDPRGT= <>
##$D= (0..31)
0 1 0 0 0 0 0 0 0 0.06 0 0 0 0 0 0 0.0002 0 0 0 0 0 0 0 0 0 0 0 0 0 0 
0 
##$DATE= 1119522008
##$DBL= (0..7)
120 120 120 120 120 120 120 120 
##$DBP= (0..7)
150 150 150 150 150 150 150 150 
##$DBP07= 0
##$DBPNAM0= <>
##$DBPNAM1= <>
$$ [...]
##$SUBNAM7= <"">
##$SUBNAM8= <"">
##$SUBNAM9= <"">
##$SW= 20.6930455092707
##$SWIBOX= (0..15)
0 0 3 0 0 0 0 0 0 0 0 0 0 0 0 0 
##$SW_h= 5175.983436853
##$TD= 65536
##$TD0= 1
##$TE= 295.16
##$TE2= 300
##$TE3= 300
##$TEG= 300
##$TL= (0..7)
0 120 120 120 120 120 120 120 
##$TP= (0..7)
150 150 150 150 150 150 150 150 
##$TP07= 0
##$TPNAME0= <>
##$TPNAME1= <>
##$TPNAME2= <>
##$TPNAME3= <>
##$TPNAME4= <>
##$TPNAME5= <>
##$TPNAME6= <>
##$TPNAME7= <>
##$TPOAL= (0..7)
0.5 0.5 0.5 0.5 0.5 0.5 0.5 0.5 
##$TPOFFS= (0..7)
0 0 0 0 0 0 0 0 
##$TUNHIN= 0
##$TUNHOUT= 0
##$TUNXOUT= 0
##$USERA1= <user>
##$USERA2= <user>
##$USERA3= <user>
##$USERA4= <user>
##$USERA5= <user>
##$V9= 5
##$VALIST= <valist>
##$VCLIST= <CCCCCCCCCCCCCCC>
##$VD= 0
##$VDLIST= <DDDDDDDDDDDDDDD>
##$VPLIST= <PPPPPPPPPPPPPPP>
##$VTLIST= <TTTTTTTTTTTTTTT>
##$WBST= 1024
##$WBSW= 4
##$XGAIN= (0..3)
0 0 0 0 
##$XL= 0
##$YL= 0
##$YMAX_a= 420557
##$YMIN_a= -336892
##$ZGOPTNS= <>
##$ZL1= 120
##$ZL2= 120
##$ZL3= 120
##$ZL4= 120
##$ABSF1= 16.522
##$ABSF2= -4.171173
##$ABSG= 5
##$ABSL= 3
##$ALPHA= 0
##$AQORDER= 0
##$ASSFAC= 0
##$ASSFACI= 0
##$ASSFACX= 0
##$ASSWID= 0
##$AUNMP= <proc_1d>
##$AZFE= 0.1
##$AZFW= 0.1
##$BCFW= 0
##$BC_mod= 0
##$BYTORDP= 0
##$COROFFS= 0
##$CY= 12.5
##$DATMOD= 1
##$DC= 0
##$DFILT= <>
##$DTYPP= 0
##$F1P= 14.0000005364418
##$F2P= -0.99999901652339
##$FCOR= 0.5
##$FTSIZE= 32768
##$FT_mod= 6
##$GAMMA= 0
##$GB= 0
##$INTBC= 1
##$INTSCL= 1
##$ISEN= 128
##$LB= 0.3
##$LEV0= 0
##$LPBIN= 0
##$MAXI= 10000
##$MC2= 0
##$MEAN= 0
##$ME_mod= 0
##$MI= 0
##$NCOEF= 0
##$NC_proc= -4
##$NLEV= 6
##$NOISF1= 0
##$NOISF2= 0
##$NSP= 0
##$NTH_PI= 0
##$NZP= 0
##$OFFSET= 16.522
##$PC= 1
##$PHC0= 125.7795
##$PHC1= 12.19919
##$PH_mod= 1
##$PKNL= yes
##$PPARMOD= 0
##$PSCAL= 4
##$PSIGN= 0
##$REVERSE= no
##$SF= 250.13
##$SI= 32768
##$SIGF1= 0
##$SIGF2= 0
##$SINO= 400
##$SIOLD= 32768
##$SREGLST= <1H.CDCl3>
##$SSB= 0
##$STSI= 32768
##$STSR= 0
##$SW_p= 5175.98343685301
##$SYMM= 0
##$S_DEV= 0
##$TDeff= 65536
##$TDoff= 0
##$TI= <Analysis number 999999
Compound Code 99
Book Reference 9
Project Code 9>
##$TILT= no
##$TM1= 0
##$TM2= 0
##$TOPLEV= 0
##$USERP1= <user>
##$USERP2= <user>
##$USERP3= <user>
##$USERP4= <user>
##$USERP5= <user>
##$WDW= 1
##$XDIM= 32768
##$YMAX_p= 482998850
##$YMIN_p= -81430
$$ End of Bruker specific parameters
$$ ---------------------------------
##NTUPLES= NMR SPECTRUM
##VAR_NAME=  FREQUENCY,     SPECTRUM/REAL,   SPECTRUM/IMAG
##SYMBOL=    X,             R,               I
##VAR_TYPE=  INDEPENDENT,   DEPENDENT,       DEPENDENT
##VAR_FORM=  AFFN,          ASDF,            ASDF
##VAR_DIM=   32768,         32768,           32768
##UNITS=     HZ,            ARBITRARY UNITS, ARBITRARY UNITS
##FACTOR=    0.157963299565203, 1,           1
##FIRST=     4132.6476996994, 0,             0
##LAST=      -1043.33573715361, 0,           0
##MIN=       -1043.33573715361, -81430,      0
##MAX=       4132.6476996994, 482998850,     0
$$ Real data points
##PAGE= N=1
##DATA TABLE= (X++(R..R)), XYDATA
$$ [...]
$$ plain form
18375 -8479 -20207 -36554 -38856 -19145 -10125 7219 18869 23114 30206 9017 14554 14591 694
18362 694 4771 -6779 -588 14356 30204 32641 26953 18538 14026 8527 6146 15144 6112 -529
18348 -529 803 -890 4081 905 -1979 10506 15688 13483 9285 4606 1380 582 3470 1276 -15308
18333 -15308 -21036 -7529 -9783 -12922 -16825 -9656 -7967 -3446 6375 -2284 -7046 5188 8209 10392
18319 10392 8556 458 -3869 -2042 2939 4545 10492 1001 7050 16878 8289 1507 9628 23820
18305 23820 29864 19987 1098 -1159 13141 10868 5280 -1349 2659 -2594 -3354 9053 -1522 13529
18291 13529 4698 208 5907 -5089 -11001 -7847 2085 3018 2801 2940 -627 -10353 -4428 -2695 -2149
18276 -2149 3954 -1960 -8829 -19390 -17380 -21452 -18822 -16842 -20473 -22665 -5924 -5790 -12834 -14245
$$ packed form
18375h479j1728j6347k302J9711R020J7344J1650M245P092k1189N537L7j3897
18362F94M077j1550O191J4944J5848K437n688q415m512n499k381Q998r032o641
18348e29J332j693M971l176k884J2485N182k205m198m679l226p98K888k194j6584
18333a5308n728J3507k254l139l903P169J689M521R821q659m762J2234L021K183
18319A0392j836q098m327J827M981J606N947r491O049R828q589o782Q121J4192
18305B3820O044r877j8889k257J4300k273n588o629M008n253p60J2407j0575J5051
18291A3529q831m490N699j0996n912L154R932R33k17J39l567r726N925J733N46
18276b149O103n914o869j0561K010m072K630J980l631k192J6741J34p044j411
$$ plain form
18262 -14245 -4261 3611 -11891 98 7041 15635 2092 -9215 -5561 -8141 -6713 -534 9523
18249 9523 11344 10776 17551 15137 6683 6406 11579 10146 6092 3156 -4989 -6954 -9378 -709 8388
18234 8388 7322 5203 7610 7795 11128 17167 30746 26430 10229 4114 1914 9316 5968 -8467
18220 -8467 -9951 -5679 -4196 -2188 3278 6623 5650 5154 1360 8759 18004 15500 8484 11744 671
18205 671 -14249 -6456 10434 20390 32365 40068 38120 41207 42314 47875 49746 47789 51864 57090
18191 57090 49699 44785 48197 49064 55208 60204 60319 52908 55867 67353 66483 65927 56208 45654 47396
18176 47396 59859 57510 73157 75423 69451 73141 77822 79291 73948 70470 63963 62708 58642 62698
18162 62698 86611 90678 78634 77013 92501 103113 103852 93297 89766 106762 115231 116079 117309
$$ packed form
18262a4245R984P872j5502J1989O943Q594j3543j1307L654k580J428O179J0057
18249I523J821n68O775k414q454k77N173j433m054k936q145j965k424Q669R097
18234H388j066k119K407J85L333O039J3579m316j6201o115k200P402l348j4435
18220h467j484M272J483K008N466L345r73m96l794P399R245k504p016L260j1073
18205F71j4920P793J6890R956J1975P703j948L087J107N561J871j957M075N226
18191E7090p391m914L412Q67O144M996J15p411K959J1486q70n56r719j0554J742
18176D7396J2463k349J5647K266n972L690M681J469n343l478o507j255m066M056
18162F2698K3913M067j2044j621J5488J0612P39j0555l531J6996Q469Q48J230
$$ plain form
18149 117309 123587 137961 134045 122330 130205 144128 152410 159427 148014 148666 164766 186445 189388
18136 189388 191512 203398 215192 222259 240039 255163 281242 304795 337010 376286 414926 459760
18124 459760 520698 599932 682108 787338 934302 1101470 1322839 1611980 1957212 2371346
18114 2371346 2902973 3575405 4491510 5826136 7690396 9988797 12024239 12242660 10538301
18105 10538301 8276292 6376620 5083713 4228882 3630004 3188494 2830346 2540732 2337659
18096 2337659 2182192 2043392 1923878 1813331 1727567 1651487 1571716 1505085 1457179 1430731
18086 1430731 1404337 1377324 1351643 1312744 1280568 1265597 1256407 1254220 1268255 1281487 1275789 1257708
18074 1257708 1232353 1201065 1169659 1140072 1106445 1060949 1014662 958934 907569 854174 815502
$$ packed form
18149A17309O278J4374l916j1715P875J3923Q282P017j1413O52J6100K1679K943
18136A89388K124J1886J1794P067J7780J5124K6079K3553L2215L9276L8640M4834
18124D59760O0938P9234Q2176J05230J46964J67168K21369K89141L45232M14134
18114B371346N31627O72432R16105J334626J864260K298401K035442K18421j704359
18105A0538301k262009j899672j292907q54831n98878m41510l58148k89614k03073
18096B337659j55467j38800j19514j10547q5764p6080p9771o6631m7906k6448
18086A430731k6394k7013k5681l8899l2176j4971r190k187J4035J3232n698j8081
18074A257708k5355l1288l1406k9587l3627m5496m6287n5728n1365n3395l8672
$$ plain form
18063 815502 785442 752461 706831 664907 610080 562478 529642 498306 488009 463017 434779
18052 434779 412023 379495 347454 348123 338951 312430 296333 275292 252296 240302 220301 201331
18040 201331 193454 186857 175248 167592 147374 148671 154645 149510 141958 131429 133170 126696 114952
18027 114952 97885 98275 95804 85340 85774 75576 61034 63053 67098 46708 36976 44400 43965 44745
18013 44745 47526 47581 38862 34819 26070 20157 24997 26968 31117 20082 12227 13560 16573 10665 15469
17998 15469 9431 2100 17693 24335 19573 29940 29096 21078 10503 -910 9694 29678 29890
17985 29890 23100 10801 2980 18780 31929 13819 13196 11703 142 -1373 -12955 -12886 -8848 -19131
17971 -19131 -13292 594 9091 3775 -2484 -5360 -17740 -24395 -18984 -17790 -23615 -20788 -3488 6302
$$ packed form
18063H15502l0060l2981m5630m1924n4827m7602l2836l1336j0297k4992k8238
18052D34779k2756l2528l2041O69r172k6521j6097k1041k2996j1994k0001j8970
18040B01331p877o597j1609p656k0218J297N974n135p552j0529J741o474j1744
18027A14952j7067L90k471j0464M34j0198j4542K019M045k0390r732P424m35P80
18013D4745K781N5q719m043q749n913M840J971M149j1035p855J333L013n908M804
17998A5469o038p331J5593O642m762J0367q44q018j0575j1413J0604J9984K12
17985B9890o790j2299p821J5800J3149j8110o23j493j1561j515j1582O9M038j0283
17971a9131N839J3886Q497n316o259k876j2380o655N411J194n825K827J7300R790
$$ plain form
17957 6302 -8601 -17624 1314 3004 -446 922 14319 13292 2423 -263 2420 -3327 2746 15051
17943 15051 18825 19914 20205 18986 16898 20942 24283 11286 18651 20975 17815 19129 27112 27116 23077
17928 23077 16058 15472 8197 9926 5458 1044 9810 15695 17336 8901 3715 6556 13481 19474 14140
17913 14140 13564 16087 25699 32321 25673 30176 16715 3702 17 3582 11515 28308 14069 -2014
17899 -2014 -13796 517 13673 13096 12208 14117 12680 15313 13315 -483 -292 7516 7791 -2313
17885 -2313 2719 10246 122 -14891 -15124 -200 -6078 -4415 6474 12321 12474 21602 17281 10776
17871 10776 3974 1250 4850 16149 7146 -4410 -1103 1591 2427 3987 10966 8177 2088 459
17857 459 -10620 -17835 -11147 -5494 -8917 -19758 -10016 -3580 -4341 -26010 -34311 -24749 -20225 -14637
$$ packed form
17957F302j4903r023J8938J690l450J368J3397j027j0869k686K683n747O073J2305
17943A5051L774J089K91j219k088M044L341j2997P365K324l160J314P983Mm039
17928B3077p019n86p275J729m468m414Q766N885J641q435n186K841O925N993n334
17913A4140n76K523R612O622o648M503j3461j3013l685L565P933J6793j4239j6083
17899b014j1782J4313J3156n77q88J909j437K633j998j3798J91P808K75j0104
17885b313N032P527j0124j5013k33J4924n878J663J0889N847J53R128m321o505
17871A0776o802k724L600J1299r003j1556L307K694Q36J560O979k789o089j629
17857D59j1079p215O688N653l423j0841R742O436p61k1669q301R562M524N588
$$ plain form
17843 -14637 -11403 -3712 3015 3725 15383 13242 -7862 -13746 -25748 -32028 -24783 -14371 -10583 -6403
17829 -6403 -11362 -20690 -21987 -13437 -4494 -2311 -16130 -15102 -4245 -2949 -4552 -13019 -15756 -6741
17815 -6741 -8921 -12555 -10991 -11759 -9061 7750 8429 29544 30429 19325 22617 11653 1235 1448
17801 1448 8062 9217 861 -18952 -22600 -17121 -10468 -3533 694 13081 19709 17944 15416 22218
17787 22218 23597 10163 -2639 -8921 -20251 -29987 -21663 -11173 -4179 -9118 -8439 3562 1362
17774 1362 -4324 -3470 -14999 -17638 -22665 -11802 -7452 -8614 -11809 -13924 -5798 2180 10417 11369 8575
17759 8575 -3908 -7704 -4357 -13463 -12669 -875 -2119 -10444 -14093 -16736 -14424 -17957 -15913 -10839
17745 -10839 -12772 -8983 -10372 -25958 -16420 -5828 -15776 -16713 -980 15605 20105 22846 8921
$$ packed form
17843a4637L234P691O727P10J1658k141k1104n884j2002o280P245J0412L788M180
17829f403m959r328j297Q550Q943K183j3819J028J0857J296j603q467k737R015
17815f741k180l634J564p68K698J6811O79K1115Q85j1104L292j0964j0418K13
17801A448O614J155q356j9813l648N479O653O935M227J2387O628j765k528O802
17787B2218J379j3434j2802o282j1330r736Q324J0490O994m939O79J2001k200
17774A362n686Q54j1529k639n027J0863M350j162l195k115Q126P978Q237R52k794
17759H575j2483l796L347r106P94J1794j244q325l649k643K312l533K044N074
17745a0839j933L789j389j5586R538J0592r948r37J5733J6585M500K741j3925
$$ plain form
17732 8921 1417 11295 11591 -5713 -8174 -5623 -12535 -2411 -12105 -21916 -18502 -17283 -14592 -22314
17718 -22314 -28628 -27154 -34441 -35036 -29147 -22373 -32293 -27838 -25305 -26020 -14351 4099 13089 8591
17704 8591 4049 12377 -4898 -11373 1996 4064 -4709 -10616 -9972 2434 -5158 -5177 2986 6074 -2922
17689 -2922 -1713 -60 9049 10449 -4549 -16202 -15822 -2020 -12660 -24615 -14315 -16791 -12995
17676 -12995 -8625 -5690 -16310 -26974 -22705 -31010 -32326 -25421 -12110 -2593 -643 -4882 -643 -6592
17662 -6592 -5114 -6149 -7702 2230 7995 -4312 -8415 3819 14035 26562 34906 25198 15935 13845
17648 13845 16374 394 -1875 -169 -8325 -3777 -6993 -15242 -10733 -1016 7284 3587 4957 12375
17634 12375 4364 -17578 -17026 5941 10053 8986 6252 -6040 -4506 -5688 -7516 -4733 -15154 -16578
$$ packed form
17732H921p504R878K96j7304k461K551o912J0124r694r811L414J219K691p722
17718b2314o314J474p287n95N889O774r920M455K533p15J1669J8450Q990m498
17704H591m542Q328j7275o475J3369K068q773n907O44J2406p592j9Q163L088q996
17689b922J209J653R109J400j4998j1653L80J3802j0640j1955J0300k476L796
17676a2995M370K935j0620j0664M269q305j316O905J3311R517J950m239M239n949
17662f592J478j035j553R932N765j2307m103J2234J0216J2527Q344r708r263k090
17648A3845K529j5980k269J706q156M548l216q249M509R717Q300l697J370P418
17634A2375q011k1942N52K2967M112j067k734j2292J534j182j828K783j0421j424
$$ plain form
17620 -16578 -8275 -1502 -12353 -20014 -5985 -1488 2807 11859 15779 4518 -8783 -13736 -9530
17607 -9530 -7782 -4570 5613 7726 -9577 -15895 -14998 -7650 -4778 -9515 -7378 -16996 -11248 -6923
17593 -6923 -16679 -25442 -9147 -817 -14181 -15183 -28709 -32210 -38446 -42287 -33944 -16794 -4686
17580 -4686 -6526 -5729 613 -9829 -10851 -14019 -25430 -26642 -22223 -12226 -5336 7709 -2250 -10682
17566 -10682 -11904 -16045 -2470 -4514 -7516 -8610 -4914 -25489 -26325 -15413 -6820 962 -3520 -8287
17552 -8287 -8290 -19909 -17769 238 -660 -2682 -11040 -25137 -18599 -19509 -22251 -19019 -8956 -9676 -19153
17537 -19153 -15405 -12975 -4486 -8034 -8870 -9956 -20587 -16424 -20591 -10302 -4592 8083 6529 -2309
17523 -2309 -27573 -21264 -15318 -13623 -6338 -10400 -14978 -7226 -4001 -7843 -13031 -13351 -12192 -13421 -14371
$$ packed form
17620a6578Q303O773j0851p661J4029M497M295R052L920j1261j3301m953M206
17607i530J748L212J0183K113j7303o318Q97P348K872m737K137r618N748M325
17593f923r756q763J6295Q330j3364j002j3526l501o236l841Q343J7150J2108
17580d686j840P97O342j0442j022l168j1411j212M419R997O890J3045r959q432
17566a0682j222m141J3575k044l002j094L696k0575q36J0912Q593P782m482m767
17552h287lj1619K140J8007q98k022q358j4097O538r10k742L232J0063p20r477
17537a9153L748K430Q489l548q36j086j0631M163m167J0289N710J2675j554q838
17523b309k5264O309N946J695P285m062m578P752L225l842n188l20J159j229r50
$$ plain form
17508 -14371 -11895 -7417 -6902 -17552 -29438 -20598 -10641 -3489 2971 12124 16204 5040 -3791 -751
17494 -751 -1409 -9829 1621 8422 7075 -3533 -12716 -9986 -12347 -17521 -14469 -15072 -6351 2955 -19447
17479 -19447 -22253 -15729 -11789 -8100 -2817 -4748 2928 -6663 -13126 1155 9735 1338 -2746 4981
17465 4981 11617 14313 9415 8858 8754 -782 -9857 -6260 1559 5447 11691 19245 13592 5742 11943
17450 11943 23187 19282 29556 24729 31603 36923 25584 25116 41913 57265 72928 83862 61424
17437 61424 49400 47184 39585 21611 22944 21952 9977 1890 -462 781 13522 25972 24692
17424 24692 18278 18281 -1302 -28188 -28804 -29258 -12592 -15991 -29446 -30307 -35233 -23125 -20962 -29832 -26008
17409 -26008 -3595 28037 29087 30748 20691 7429 -1658 -9225 -13803 -19361 -15986 -8721 11315
$$ packed form
17508a4371K476M478N15j0650j1886Q840R957P152O460R153M080j1164q831L040
17494g51o58q420J1450O801j347j0608r183K730k361n174L052o03Q721R306k2402
17479a9447k806O524L940L689N283j931P676r591o463J4281Q580q397m084P727
17465D981O636K696m898n57j04r536r075L597P819L888O244P554n653p850O201
17450A1943J1244l905J0274m827O874N320j1339m68J6797J5352J5663J0934k2438
17437F1424j2024k216p599j7974J333r92j1975q087k352J243J2741J2450j280
17424B4692o414Lj9583k6886o16m54J6666l399j3455q61m926J2108K163q870L824
17409b6008K2413L1632J050J661j0057j3262r087p567m578n558L375P265K0036
$$ plain form
17396 11315 18817 11433 3349 -6104 -8340 -94 7933 9060 256 -9720 -7245 -1284 5518 11459
17382 11459 11359 189 -6106 -10402 -2075 3546 7578 -825 2276 564 -11305 -16788 -23009 -6981
17368 -6981 6428 -9863 -4251 -153 -3737 79 8000 12879 15664 12829 1827 3553 7287 7444
17354 7444 16780 14132 7470 6031 8155 3372 -2176 6260 1018 -7892 -7729 592 -1239 -6147 -18004
17339 -18004 -32079 -23613 -24694 -25827 -8686 2190 -2495 -11065 -19765 -23960 -20393 -8280 -6144
17326 -6144 -8188 -9936 -23053 -19639 -4002 9765 17078 13893 4635 5824 -1506 -2548 8764 12075
17312 12075 9431 1751 -4825 13660 23256 18707 4482 -16274 -16177 -19316 -17675 -14622 -12685 -23104
17298 -23104 -23336 -20589 -18167 -13662 -22452 -14307 -8175 2417 -1409 1567 22284 27835 27775 29061 22318
$$ packed form
17396A1315P502p384q084r453k236Q246Q027J127q804r976K475N961O802N941
17382A1459j00j1170o295m296Q327N621M032q403L101j712j1869n483o221J6028
17368f981J3409j6291N612M098l584L816P921M879K785k835j1002J726L734J57
17354G444R336k648o662j439K124m783n548Q436n242q910J63Q321j831m908j1857
17339a8004j4075Q466j081j133J7141J0876m685q570q700m195L567J2113K136
17326f144k044j748j3117L414J5637J3767P313l185r258J189p330j042J1312L311
17312A2075k644p680o576J8485R596m549j4225k0756R7l139J641L053J937j0419
17298b3104k32K747K422M505q790Q145O132J0592l826K976K0717N551o0J286o743
$$ plain form
17283 22318 17339 8644 2883 544 4577 -8431 -16407 -11438 -13778 -13742 -13879 -26056 -19234 -14320 -6174
17268 -6174 5469 8542 -3362 -6835 1354 -13988 -23337 -15090 -4970 -15395 -29689 -19412 -18553
17255 -18553 -33371 -21587 -7388 -17872 -26576 -21375 -19111 -8268 1302 8790 16486 -2201 -3661
17242 -3661 -10232 -6713 -8880 -842 -1741 357 2070 -8824 -11266 -20585 -18726 -22028 -11539 4096
17228 4096 7359 -7461 -16945 -19420 -14074 -11371 -10666 -2045 1892 5202 1085 -8643 3199 16175
17214 16175 4305 -8214 -22573 -26782 -25052 -13863 -13598 -14610 -9278 1040 4564 3798 -2617 -2464
17200 -2464 -7203 -7963 -3707 -10834 -9568 -17082 -16592 -12417 -7124 -15891 -10141 -9062 -23059 -14907 -23527
17185 -23527 -30254 -37379 -33385 -30235 -26348 -11401 8304 4093 1095 -1108 -3928 -7711 -12390 -7561
$$ packed form
17283B2318m979q695n761k339M033j3008p976M969k340L6j37j2177O822M914Q146
17268f174J1643L073j1904l473Q189j5342r349Q247J0120j0425j4294J0277Q59
17255a8553j4818J1784J4199j0484q704N201K264J0843R570P488P696j8687j460
17242c661o571L519k167Q038q99K098J713j0894k442r319J859l302J0489J5635
17228D096L263j4820r484k475N346K703P05Q621L937L310m117r728J1842J2976
17214A6175j1870j2519j4359m209J730J1189K65j012N332J0318L524p66o415J53
17200b464m739p60M256p127J266p514M90M175N293q767N750J079j3997Q152q620
17185b3527o727p125L994L150L887J4947J9705m211k998k203k820l783m679M829
$$ plain form
17171 -7561 -6934 -9226 -14990 -8284 -13904 -11530 -3035 5354 11235 13064 -6422 -17920 1471 1332
17157 1332 -9436 -2640 15014 17609 -7570 -17627 -7972 -2922 -13582 -16374 -23804 -19474 -11041
17144 -11041 -13929 -7984 7224 8538 1451 -1551 -4460 -16145 -17970 -13475 -17949 -20931 -22235 -32389
17130 -32389 -15393 -4295 -6950 -13420 -11489 -10012 -9088 -2432 2087 -6649 -2029 -6121 -7650 -21353
17116 -21353 -31224 -35344 -27124 -20850 -15602 -14378 -8607 -8957 -7073 2584 4762 -6860 -20815 -11940
17102 -11940 -21717 -6764 -863 -9055 -11566 -11312 -13457 -6618 -666 -7372 -4391 -2174 -6604 -10908
17088 -10908 -4639 -3457 -3744 8828 14547 10044 1959 -2635 -1851 557 6266 4257 -1702 -6052 -16566
17073 -16566 -13016 -12565 -18476 -23265 -20663 -22847 -13606 3514 13494 8246 -6935 -17829 873 8751
$$ packed form
17171g561O27k292n764O706n620K374Q495Q389N881J829j9486j1498J9391j39
17157A332j0768O796J7654K595k5179j0057R655N050j0660k792p430M330Q433
17144a1041k888N945J5208J314p087l002k909j1685j825M495m474k982j304j0154
17130c2389J6996J1098k655o470J931J477R24O656M519q736M620m092j529j3703
17116b1353r871m120Q220O274N248J224N771l50J884R657K178j1622j3955Q875
17102a1940r777J4953N901q192k511K54k145O839N952o706K981K217m430m304
17088a0908O269J182k87J2572N719m503q085m594P84K408N709k009n959m350j0514
17073a6566L550M51n911m789K602k184R241J7120R980n248j5181j0894J8702P878
$$ plain form
17059 8751 12809 13294 -2840 -18890 -19064 -16003 -14364 -31684 -26807 -24459 -15651 -14346 -20217 -18716
17045 -18716 -11172 -13006 -20990 -29319 -29008 -18092 -8853 -13152 -23644 -9543 -1576 4686 8222 -1535
17031 -1535 -18743 -12072 4055 22779 9495 -14493 -30527 -22938 -6199 -7348 2467 14354 30734
17018 30734 20631 21701 24994 16345 6621 3544 -3267 -3035 8151 14588 13459 -6426 -17185 -18900
17004 -18900 -25434 -21170 -27196 -1710 11449 7067 -7544 -14462 -12981 -18891 -19398 -21679 -9088 -9171
16990 -9171 -12930 -6508 7975 18867 21811 15612 14322 10205 14569 14142 16236 25326 16006 6547
16976 6547 6996 2948 -1804 -6725 -8692 -15695 -22047 -33004 -28910 -31837 -38572 -23568 -14628 -9818
16962 -9818 1188 -4514 -12915 -10393 -6948 -10968 -15927 -7141 -5519 -3234 6019 2886 -4277 -7618
$$ packed form
17059H751M058M85j6134j6050j74L061J639j7320M877K348Q808J305n871J501
17045a8716P544j834p984q329L11J0916R239m299j0492J4101P967O262L536r757
17031a535j7208O671J6127J8724j3284k3988j6034P589J6739j149R815J1887J6380
17018C0734j0103J070L293q649r724l077o811K32J1186O437j129j9885j0759j715
17004a8900o534M264o026K5486J3159m382j4611o918J481n910n07k281J2591q3
16990i171l759O422J4483J0892K944o199j290m117M364m27K094R090r320r459
16976F547M49m048m752m921j967p003o352j0957M094k927o735J5004Q940M810
16962i818J1006n702q401K522L445m020m959Q786J622K285R253l133p163l341
$$ plain form
16948 -7618 -2329 6963 14999 14300 2674 -11207 -3872 9099 7170 10093 -7127 -22979 -22293 -21027
16934 -21027 -20117 -407 19599 18474 5509 8416 9604 6300 2122 625 -2014 2354 -7731 -10914
16920 -10914 -8228 -10382 -16685 -6296 -9298 -21076 -25534 -24057 -25610 -29917 -23358 -22975 -20118 -13195
16906 -13195 -9596 -2352 7068 9419 -3327 -15742 -3566 6423 2981 -8606 -10661 -12475 -13272 -13787
16892 -13787 1837 471 -7980 733 3365 -3196 -8819 1113 981 -365 11977 9481 -7890 -6595
16878 -6595 6420 8906 14463 8602 4241 -6477 -15772 -11083 -15713 1447 -4895 -18153 -23199 -10949
16864 -10949 -4921 -16052 -12235 5022 13412 23879 28372 21953 23843 11974 7583 3545 -2635
16851 -2635 -11906 -10047 -10937 10047 27208 18298 6184 11603 15799 14039 2334 -948 -2930 7941
$$ packed form
16948g618N289R292Q036o99j1626j3881P335J2971j929K923j7220j5852O86J266
16934b1027R10J9710K0006j125j2965K907J188l304m178j497k639M368j0085l183
16920a0914K686k154o303J0389l002j1778m458J477j553m307O559L83K857O923
16906a3195L599P244R420K351j2746j2415J2176R989l442j1587k055j814p97n15
16892a3787J5624j366q451Q713K632o561n623R932j32j346J2342k496j7371J295
16878f595J3015K486N557n861m361j0718r295M689m630J7160o342j3258n046J2250
16864a0949O028j1131L817J7257Q390J0467M493o419J890j1869m391m038o180
16851b635r271J859q90K0984J7161q910j2114N419M196j760j1705l282j982J0871
$$ plain form
16837 7941 -10544 -27268 -21522 -10292 1693 4835 -6592 -8414 -3460 -12619 -9069 -14321 -1243
16824 -1243 17238 5656 -5033 -8305 7566 16140 13904 8688 183 6736 15109 8851 9258 -1633
16810 -1633 -13274 -18480 -838 -3633 -6214 1726 -2844 156 -3033 -10500 -14691 -10400 -8537 -11428
16796 -11428 -5766 -2982 4467 20221 22785 10626 5918 6952 4587 3201 -11129 -10065 -7096 -3519
16782 -3519 -4541 -12323 -22286 -21917 -16058 -9392 -8004 -2582 6448 14550 16454 14114 14706 16952 17603
16767 17603 17691 5781 -17671 -25618 -22197 -16548 -14877 -10069 -2278 8094 8798 -3700 -8734 -4537
16753 -4537 655 -4326 4465 9518 5305 7023 28 9785 8709 1758 -262 8319 9341 12986 20786
16738 20786 25169 22333 21584 12948 -6708 -12122 -4764 -6202 378 13234 14714 8727 8581 5726
$$ packed form
16837G941j8485j6724N746J1230J1985L142j1427j822M954r159L550n252J3078
16824a243J8481j1582j0689l272J5871Q574k236n216q505O553Q373o258M07j0891
16810a633j1641n206J7642k795k581P940m570L000l189p467m191M291J863k891
16796a1428N662K784P449J5754K564j2159m708J034k365j386j4330J064K969L577
16782c519j022p782r963L69N859O666J388N422R030Q102J904k340N92K246O51
16767A7603Q8j1910k3452p947L421N649J671M808P791J0372P04j2498n034M197
16753d537N192m981Q791N053m213J718o995R757j076o951k020Q581J022L645P800
16738B0786M383k836p49q636j9656n414P358j438O580J2856J480n987j46k855
$$ plain form
16724 5726 8722 16617 13357 15484 18494 8851 -8157 -6795 7882 12671 8946 6698 13017 6353
16710 6353 -519 980 -9772 -16831 -6434 13859 9729 -7739 -16635 -10505 -10183 -21151 -10933
16697 -10933 -4258 -7499 92 -7178 -673 4590 7271 -830 1769 9992 13282 13599 16707 10755 17146
16682 17146 31765 27099 7669 3043 14064 18145 9641 780 3661 3141 1452 3752 -1544 1295
16668 1295 24518 33384 17405 4208 5027 -664 -5538 -646 -4489 -7784 -11239 -3974 1872 -1956
16654 -1956 11223 15593 13501 20404 36798 39155 39760 39486 37733 33654 32624 15241 14226 3834
16640 3834 10016 24358 34048 36740 32348 12202 7370 11728 19796 25138 30552 21355 23246 21300
16626 21300 24072 19467 14667 21731 12212 8045 10269 1734 -8836 -9520 -4270 -6364 -1524 -2692
$$ packed form
16724E726K996P895l260K127L010r643j7008J362J4677M789l725k248O319o664
16710F353o872J499j0752p059J0397K0293m130j7468q896O130L22j0968J0218
16697a0933O675l241P591p270O505N263K681q101K599Q223L290L17L108n952O391
16682A7146J4619m666j9430m626J1021M081q504q861K881n20j689K300n296K839
16668A295K3223Q866j5979j3197Q19n691m874M892l843l295l455P265N846l828
16654a956J3179M370k092O903J6394K357O05k74j753m079j030j7383j015j0392
16640C834O182J4342R690K692m392k0146m832M358Q068N342N414r197J891j946
16626B1300K772m605m800P064r519m167K224q535j0570o84N250k094M840j168
$$ plain form
16612 -2692 9245 4771 -12735 -12370 11264 25227 15645 16003 22067 16173 12360 16031 21870 11193
16598 11193 8876 13378 25474 33450 27717 17665 22446 31695 32385 34799 43546 35727 34333 21645
16584 21645 4621 9167 8719 13351 18231 25707 21765 20448 11383 613 1532 16074 30521 27893
16570 27893 19731 26152 29333 29652 19850 17244 19882 13807 24922 36665 33674 23462 9193 5851
16556 5851 24149 26704 23832 12476 5256 13454 10642 4937 3751 11401 17032 13747 15991 17699
16542 17699 27945 24775 26367 28684 23070 18035 29825 27052 11550 10174 14932 23106 9610
16529 9610 6775 11036 21538 22325 9660 11045 1641 -2828 -1075 4088 10480 14499 17063 29528
16515 29528 44519 58530 58011 44312 51194 62144 49110 38319 21552 30805 41140 56478
$$ packed form
16612b692J1937m474j7506L65K3634J3963r582L58O064n894l813L671N839j0677
16598A1193k317M502J2096P976n733j0052M781R249O90K414Q747p819j394j2688
16584B1645j7024M546m48M632M880P476l942j317r065j0770R19J4542J4447k628
16570B7893q162O421L181L19r802k606K638o075J1115J1743k991j0212j4269l342
16556E851J8298K555k872j1356p220Q198k812n705j186P650N631l285K244J708
16542A7699J0246l170J592K317n614n035J1790k773j5502j376M758Q174j3496
16529I610k835M261J0502P87j2665J385r404m469J753N163O392M019K564J2465
16515B9528J4991J4011n19j3699O882J0950j3034j0791j6767R253J0335J5338
$$ plain form
16503 56478 79401 86484 99216 119366 156460 195476 225298 270979 322649 388221 452162 521661
16491 521661 573186 623677 664158 671799 656450 626185 577612 534541 486928 434221 383415 324721
16479 324721 277970 248264 231490 220289 195700 185742 181540 178007 176811 167945 168431 151108 144951
16466 144951 149795 131249 134228 140201 133570 131061 131783 127201 125011 122019 126572 117736 122524 137501
16452 137501 140024 126394 116939 118924 114737 99732 79079 82826 84691 82303 90671 84976 61901
16439 61901 63500 76755 84327 83958 82462 67262 58630 62229 57356 54174 45112 34388 36550 45715
16425 45715 51109 50661 42189 29648 35778 25233 16781 25562 34331 25065 29960 33624 38310 30262
16411 30262 24590 29000 23819 24140 32335 42220 31682 22622 26514 32500 29968 29917 31673 34128 34695
$$ packed form
16503E6478K2923P083J2732K0150L7094L9016K9822M5681N1670O5572O3941O9499
16491E21661N1525N0491M0481P641j5349l0265m8573m3071m7613n2707n0806n8694
16479C24721m6751k9706j6774j1201k4589r958m202l533j196q866M86j7323o157
16466A44951M844j8546K979N973o631k509P22m582k190k992M553q836M788J4977
16452A37501K523j3630r455J985m187j5005k0653L747J865k388Q368n695k3075
16439F1901J599J3255P572l69j496j5200q632L599m873l182r062j0724K162R165
16425D5715N394m48q472j2541O130j0545q452Q781Q769r266M895L664M686q048
16411C0262n672M410n181L21Q195R885j0538r060L892N986k532n1J756K455N67
$$ plain form
16396 34695 41979 47808 42324 27719 14961 7825 12232 21138 23527 34810 27927 30272 26327 20554
16382 20554 19326 24824 22399 18098 9464 7913 12805 18861 13295 20139 20271 9518 64 11022
16368 11022 23848 21723 26382 37465 49655 39701 40804 28489 12052 6671 12498 13669 14549
16355 14549 22780 28795 26997 22975 15004 10808 23321 22506 25101 14795 20903 31093 37806 45507
16341 45507 36377 37450 33511 28846 40120 39682 38782 37414 36099 37654 42992 37870 29010 21268 38133
16326 38133 47606 44541 32121 37198 33740 23357 32766 38853 37144 39554 37279 45548 51082 48563
16312 48563 42576 35030 47240 53252 55573 37805 37725 48555 61870 65383 59215 62494 57208 38750
16298 38750 26937 20517 18688 28740 25606 19372 24145 23748 22199 28449 33029 52598 70042 63865
$$ packed form
16396C4695P284N829n484j4605j2758p136M407Q906K389J1283o883K345l945n773
16382B0554j228N498k425m301q634j551M892O056n566O844J32j0753r454J0958
16368A1022J2826k125M659J1083J2190r954J103j2315j6437n381N827J171Q80
16355A4549Q231O015j798m022p971m196J2513q15K595j0306O108J0190O713P701
16341D5507r130J073l939m665J1274m38r00j368j315J555N338n122q860p742J6865
16326C8133R473l065j2420N077l458j0383R409O087j709K410k275Q269N534k519
16312D8563n987p546J2210O012K321j7768q0J0830J3315L513o168L279n286j8458
16298C8750j1813o420j829J0052l134o234M773l97j549O250M580J9569J7444o177
$$ plain form
16284 63865 67323 62817 57261 50915 50161 48983 41255 27767 29064 23034 10266 13736 18216 27190
16270 27190 34000 28225 25607 27946 23166 18215 10099 14521 22113 29525 23016 32327 42794 26571
16256 26571 16575 14457 20288 26286 35518 41487 54474 69405 71125 74473 81950 77684 74242 75583
16242 75583 71480 58227 45603 47104 45618 41144 40357 48208 58759 66181 70634 58872 65265 73365
16228 73365 74526 76244 69278 66585 68459 67385 75687 68084 74300 75800 84384 87039 86275 81503 78027
16213 78027 79345 79902 86162 99691 114682 115530 120670 129618 144821 177549 206455 222901 234099
16200 234099 250548 261494 273315 282964 299291 305284 325705 342269 336336 340425 345587 363248
16188 363248 378382 394934 425884 461477 516139 587592 664868 764520 865385 956256 1041423
$$ packed form
16284F3865L458m506n556o346p54j178p728j3488J297o030j2768L470M480Q974
16270B7190O810n775k618K339m780m951q116M422P592P412o509R311J0467j6223
16256B6571r996k118N831N998R232N969J2987J4931J720L348P477m266l442J341
16242G5583m103j3253j2624J501j486m474p87P851J0551P422M453j1762O393Q100
16228G3365J161J718o966k693J874j074Q302p603O216J500Q584K655p64m772l476
16213G8027J318N57O260J3529J4991Q48N140Q948J5203L2728K8906J6446J1198
16200B34099J6449J0946J1821R649J6327N993K0421J6564n933M089N162J7661
16188C63248J5134J6552L0950L5593N4662P1453P7276R9652J00865R0871Q5167
$$ plain form
16177 1041423 1117954 1145260 1154945 1132885 1067867 971391 885364 796001 709020 616677 540356
16166 540356 483703 452392 416672 390925 380318 367886 358451 340867 347625 345196 326411 316052
16154 316052 323803 332682 323796 322319 325539 333803 350564 355971 360103 365494 366134 368691 355692 346493
16140 346493 350858 344724 336121 333937 323280 307720 288306 256975 246678 247213 228524 228307 232126
16127 232126 231261 236347 238586 231815 226903 219707 203590 200666 200999 205866 210398 220151 226347 227927
16113 227927 229384 232640 222561 210366 206249 224599 236978 242380 241859 243331 247633 244187 228939
16100 228939 230566 237875 233637 224890 222723 213812 203005 204932 212150 214390 222336 231227 233155 247830
16086 247830 278403 298201 306109 323891 340075 370721 383193 402686 428818 453584 475376 500606
$$ packed form
16177A041423P6531K7306R685k2060o5018r6476q6027q9363q6981r2343p6321
16166E40356n6653l1311l5720k5747j0607j2432r435j7584O758k429j8785j0359
16154C16052P751Q879q886j477L220Q264J6761N407M132N391O40K557j2999r199
16140C46493M365o134q603k184j0657j5560j9414l1331j0297N35j8689k17L819
16127B32126q65N086K239o771m912p196j6117k924L33M867M532R753O196J580
16113B27927J457L256j0079j2195m117J8350J2379N402n21J472M302l446j5248
16100B28939J627P309m238q747k167q911j0807J927P218K240P946Q891J928J4675
16086B47830L0573J9798P908J7782J6184L0646J2472J9493K6132K4766K1792K5230
$$ plain form
16074 500606 539342 577011 621345 670019 734899 809523 903222 1032018 1175038 1367585 1571048
16063 1571048 1811666 2093696 2395556 2703693 3009225 3301596 3549283 3719213 3809511 3830136
16053 3830136 3804033 3707274 3543313 3322371 3075965 2813010 2560690 2323415 2116404 1955586
16043 1955586 1817562 1692064 1586746 1519537 1458750 1404103 1365459 1359450 1361574 1367821 1373187
16032 1373187 1386193 1388157 1393520 1410110 1430125 1458128 1465690 1478720 1490009 1508660 1519546 1534939
16020 1534939 1553206 1557537 1550413 1550240 1539505 1538613 1541916 1544326 1545030 1544601 1550086 1549910 1558262 1566546 1567557
16005 1567557 1573599 1575430 1564857 1559499 1560473 1566625 1569533 1579679 1594103 1620996 1646319 1658990 1684889
15992 1684889 1724601 1766452 1805388 1833406 1881381 1927909 1989735 2049672 2111835 2179319 2253056
$$ packed form
16074E00606L8736L7669M4334M8674O4880P4624R3699J28796J43020J92547K03463
16063A571048K40618K82030L01860L08137L05532K92371K47687J69930R0298K0625
16053C830136k6103r6759j63961k20942k46406k62955k52320k37275k07011j60818
16043A955586j38024j25498j05318o7209o0787n4647l8644o009K124O247N366
16032A373187J3006J964N363J6590K0015K8003P562J3030J1289J8651J0886J5393
16020A534939J8267M331p124j73j0735q92L303K410P04m29N485j76Q352Q284J011
16005A567557O042J831j0573n358R74O152K908J0146J4424K6893K5323J2671K5899
15992A684889L9712M1851L8936K8018M7975M6528O1826N9937O2163O7484P3737
$$ plain form
15981 2253056 2323194 2406530 2503890 2603446 2721314 2852656 3005523 3212251 3447686 3706196
15971 3706196 3967971 4248341 4567757 4916462 5293591 5700294 6168743 6697318 7326030
15962 7326030 8068604 8953882 10010514 11295573 12868766 14807984 17196281 20152160
15954 20152160 23861933 28548101 34454204 41810770 50770503 61342504 73369807 86087502
15946 86087502 98475146 109965418 119114138 124231137 125681738 123598891 117387705 108215454
15938 108215454 97661638 86514192 75624317 65839620 57565255 50776710 45343784
15931 45343784 41066518 37708144 35040113 32884614 31124071 29654813 28396067 27300623
15923 27300623 26350539 25535333 24815185 24184729 23673081 23258695 22914723 22659837 22429570
$$ packed form
15981B253056P0138Q3336R7360R9556J17868J31342J52867K06728K35435K58510
15971C706196K61775K80370L19416L48705L77129M06703M68449N28575O28712
15962G326030P42574Q85278J056632J285059J573193J939218K388297K955879
15954B0152160L709773M686168N906103P356566Q959733J0572001J2027303J2717695
15946H6087502J2387644J1490272R148720N116999J450601k082847o211186r172251
15938A08215454j0553816j1147446j0889875r784697q274365o788545n432926
15931D5343784m277266l358374k668031k155499j760543j469258j258746j095444
15923B7300623r50084q15206p20148o30456n11648m14386l43972k54886k30267
$$ plain form
15914 22429570 22205828 21982256 21721397 21402981 21048806 20618213 20113065 19570178 18984330
15905 18984330 18345594 17672941 16958888 16230623 15514839 14785491 14057143 13317111 12606575
15896 12606575 11926208 11266605 10651519 10072513 9522202 9013514 8531281 8068530 7630777
15887 7630777 7220412 6828053 6462244 6131760 5827873 5523675 5244118 4985135 4733747
15878 4733747 4484639 4252873 4040198 3850262 3665375 3474120 3303684 3157294 3002395
15869 3002395 2865308 2728959 2592549 2464860 2336055 2224729 2122567 2013704 1924120 1837386
15859 1837386 1741256 1643912 1555352 1483547 1416576 1362805 1305710 1230528 1172771 1129539 1071078
15848 1071078 1012014 963070 917121 853050 808459 774317 746761 726786 707162 662883 641848
$$ packed form
15914B2429570k23742k23572k60859l18416l54175m30593n05148n42887n85848
15905A8984330o38736o72653p14053p28265p15784p29348p28348p40032p10536
15896A2606575o80367o59603o15086n79006n50311n08688m82233m62751m37753
15887G630777m10365l92359l65809l30484l03887l04198k79557k58983k51388
15878D733747k49108k31766k12675j89936j84887j91255j70436j46390j54899
15869C002395j37087j36349j36410j27689j28805j11326j02162j08863q9584q6734
15859A837386r6130r7344q8560p1805o6971n3771n7095p5182n7757m3232n8461
15848A071078n9064m8944m5949o4071m4591l4142k7556j9975j9624m4279k1035
$$ plain form
15837 641848 626609 588265 555878 540425 513874 491591 488544 480935 456344 441043 441456 427999
15825 427999 439239 451865 459332 448978 429336 412170 401260 403652 395132 385374 357454 329474
15813 329474 304674 271824 252539 241723 227192 202032 190835 177523 171920 154944 142413 148577
15801 148577 150926 150710 145127 152568 161579 173058 182989 194771 189785 185757 190828 197340 220531 225566
15787 225566 221147 219347 242236 253870 249960 265965 281797 285401 296796 306100 320125 326423 345189
15774 345189 353545 366583 382352 394296 407419 421758 432089 427176 413273 413777 427405 431006
15762 431006 435293 429260 429712 415392 412997 407085 396201 390550 387392 403131 409547 414432 403956
15749 403956 395227 389853 379297 355614 339872 325570 321447 327606 326052 318706 322488 328330 317968
$$ packed form
15837F41848j5239l8344l2387j5453k6551k2283l047p609k4591j5301M13j3457
15825D27999J1240J2626P467j0354j9642j7166j0910K392q520r758k7920k7980
15813C29474k4800l2850j9285j0816j4531k5160j1197j3312n603j6976j2531O164
15801A48577K349k16n583P441R011J1479R931J1782m986m028N071O512K3191N035
15787B25566m419j800K2889J1634l910J6005J5832L604J1395R304J4025O298J8766
15774C45189Q356J3038J5769J1944J3123J4339J0331m913j3903N04J3628L601
15762D31006M287o033M52j4320k395n912j0884n651l158J5739O416M885j0476
15749D03956q729n374j0556k3683j5742j4302m123O159j554p346L782N842j0362
$$ plain form
15736 317968 296618 288769 289680 275334 276955 285292 276529 248897 238853 233657 239576 233233 228826
15723 228826 221679 206783 192373 178986 168466 169288 177745 189908 193692 177522 160217 163689 170271
15710 170271 168436 169736 167174 165853 160178 142195 136475 141222 138911 135765 117553 114937 119599 139451
15696 139451 155957 157959 138588 143251 135889 118377 109983 105010 101066 92716 86959 81350 76838
15683 76838 62533 62570 46238 34885 30943 27406 28337 43344 43919 35043 25984 25289 31591 35275 37348
15668 37348 34864 34725 42454 46699 51901 46480 29165 26639 18441 21272 22046 23118 22481 25820 20245
15653 20245 17074 17305 26931 24876 37054 45964 39961 37287 29130 33233 41221 54270 57410 50004
15639 50004 48017 44074 58167 68390 73369 69997 80091 87525 90396 97388 105691 109127 117284 121015
$$ packed form
15736C17968k1350p849R11j4346J621Q337q763k7632j0044n196N919o343m407
15723B28826p147j4896j4410j3387j0520Q22Q457J2163L784j6170j7305L472O582
15710A70271j835J300k562j321n675j7983n720M747k311l146j8212k616M662J9852
15696A39451J6506K002j9371M663p362j7512q394m973l944q350n757n609m512
15683G6838j4305L7j6332j1353l942l537R31J5007N75q876r059o95O302L684K073
15668C7348k484j39P729M245N202n421j7315k526q198K831P74J072o37L339n575
15653B0245l171K31R626k055J2178Q910o003k674q157M103P988J3049L140p406
15639E0004j987l943J4093J0223M979l372J0094P434K871O992Q303L436Q157L731
$$ plain form
15625 121015 109880 114571 112964 111471 99295 94068 79025 54324 44858 58685 68380 73337 80993
15612 80993 100430 108009 93837 78701 80995 73242 63134 67168 84071 96021 90539 81601 80251
15599 80251 73614 67050 63564 68764 76705 73421 67071 59151 65763 58472 52920 44489 32423 43346
15585 43346 55436 54235 44663 45546 35220 37477 45840 47653 51361 71273 64468 51180 36158
15572 36158 33802 42335 35970 31086 32843 36446 40503 33399 31660 26218 20766 12242 7993 23792
15558 23792 34893 28305 26780 21493 14402 -4611 -10911 -10179 -4842 -6237 1732 16234 11126 1408
15544 1408 -1092 -8558 -18552 -23026 -19534 -6457 -12353 -15121 -12079 -3103 -1970 -8256 -9155 6878
15530 6878 7887 3919 3313 7012 10741 13165 1521 -4770 -19659 -23931 -16364 -8057 -2848 -284
$$ packed form
15625A21015j1135M691j607j493j2176n227j5043k4701r466J3827R695M957P656
15612H0993J9437P579j4172j5136K294p753j0108M034J6903J1950n482q938j350
15599H0251o637o564l486N200P941l284o350p920O612p291n552q431j2066J0923
15585D3346J2090j201r572Q83j0326K257Q363J813L708J9912o805j3288j5022
15572C6158k356Q533o365m884J757L603M057p104j739n442n452q524m249J5799
15558B3792J1101o588j525n287p091j9013o300P32N337j395P969J4502n108r718
15544A408k500p466r994m474L492J3077n896k768L042Q976J133o286q99J6033
15530F878J009l968o06L699L729K424j1644o291j4889m272P567Q307N209K564
$$ plain form
15516 -284 -7795 -10290 -4549 4509 2527 -537 -3747 8638 12935 -2865 -2544 11166 8773 12411
15502 12411 7052 8203 20676 29880 40392 35421 28105 19414 17242 7485 12085 20779 19633 11233
15488 11233 7879 15528 10867 6828 10246 14554 18671 15758 21972 19826 20352 20754 24763 18152 7285
15473 7285 19892 33678 24374 16285 16072 11556 5481 -6932 -14385 531 19798 22588 13536 10693
15459 10693 20135 11111 15590 26858 15474 19751 25559 36786 24243 18552 23081 29711 33036
15446 33036 22197 19930 12629 4521 -15159 -7496 -3611 -3414 -3394 3257 -2037 -4942 9019 10643
15432 10643 7968 11302 17400 13533 8690 -269 -8838 3198 10061 -8424 -7148 1903 3639 8417
15418 8417 19266 12915 2482 12110 6921 22150 35837 43746 42432 33588 40785 56769 63340
$$ packed form
15516b84p511k495N741R058j982l064l210J2385M297j5800L21J3710k393L638
15502A2411n359J151J2473R204J0512m971p316q691k172r757M600Q694j146q400
15488A1233l354P649m661m039L418M308M117k913O214k146N26M02M009o611j0867
15473G285J2607J3786r304q089k13m516o075j2413p453J4916J9267K790r052k843
15459A0693R442r024M479J1268j1384M277N808J1227j2543n691M529O630L325
15446C3036j0839k267p301q108j9680P663L885J97K0O651n294k905J3961J624
15432A0643k675L334O098l867m843q959q569J2036O863j8485J276R051J736M778
15418H417J0849o351j0433R628n189J5229J3687P909j314q844P197J5984O571
$$ plain form
15405 63340 59172 67867 73130 81459 103637 147749 199767 239805 289058 349283 430258 501982
15393 501982 556521 611499 655235 672220 655413 621262 572313 512366 463053 409718 365849
15382 365849 312257 275210 246831 232068 218235 194971 177905 163084 142810 133942 126874 132257
15370 132257 123673 121117 116346 119117 121572 116833 117129 130095 142418 143490 133170 120977 121731 115701
15356 115701 116591 110229 97428 98256 91124 97244 99016 97262 79780 76811 81447 82983 87954 94063
15342 94063 93869 79560 64445 52812 44394 35720 28868 34702 31719 37706 26975 11778 4652
15329 4652 12567 14666 8859 9613 11776 17384 16919 20686 21306 22625 6587 167 -1647 -841 10316
15314 10316 20658 16876 21117 28059 25484 5723 -8118 -525 10989 8945 -6747 -12003 -12629
$$ packed form
15405F3340m168Q695N263Q329K2178M4112N2018M0038M9253O0225Q0975P1724
15393E01982N4539N4978M3736J6985j6807l4151m8949n9947m9313n3335m3869
15382C65849n3592l7047k8379j4763j3833k3264j7066j4821k0274q868p068N383
15370A32257q584k556m771K771K455m739K96J2966J2323J072j0320j2193P54o030
15356A15701Q90o362j2801Q28p132O120J772j754j7482k969M636J536M971O109
15342I4063j94j4309j5115j1633q418q674o852N834k983N987j0731j5197p126
15329D652P915K099n807P54K163N608m65L767O20J319j6038o420j814Q06J1157
15314A0316J0342l782M241O942k575j9761j3841P593J1514k044j5692n256o26
$$ plain form
15301 -12629 -9242 -19192 -30244 -42162 -42446 -36564 -17993 -2962 5569 -13569 -22217 -20503 -2633
15288 -2633 14901 17002 26403 15240 -1209 -814 -7467 -8153 -9847 -11247 -3381 -9284 -12581 -15764
15274 -15764 -12341 -313 -1620 -1174 -75 7923 13303 -1206 -11819 -14933 -17455 -29554 -31597 -29175
15260 -29175 -25352 -19846 -22005 -23959 -15078 -11545 -3495 5825 -1326 390 1673 1006 -831 -2178 -15309
15245 -15309 -13561 -3067 273 -1522 -7804 -15031 -20177 -19883 -18229 -14163 -17454 -19742 -25047 -30571
15231 -30571 -27744 -27466 -14061 -23556 -27286 -14312 -16911 -24884 -35490 -37750 -39823 -21733 -7242
15218 -7242 -7098 -19451 -32725 -34033 -38482 -35881 -27766 -19575 -19185 -43532 -31304 -22117 -12108 -8915
15204 -8915 -4702 -9533 -11989 -26448 -38020 -24435 -13900 -10689 -21255 -19263 -27885 -17212 -20085
$$ packed form
15301a2629L387r950j1052j1918k84N882J8571J5031Q531j9138q648J714J7870
15288b633J7534K101R401j1163j6449L95o653o86j694j400P866n903l297l183
15274a5764L423J2028j307M46J099P998N380j4509j0613l114k522j2099k043K422
15260b9175L823N506k159j954Q881L533Q050R320p151J716J283o67j837j347j3131
15245a5309J748J0494L340j795o282p227n146K94J654M066l291k288n305n524
15231c0571K827K78J3405r495l730J2974k599p973j0606k260k073J8090J4491
15218g242J44j2353j3274j308m449K601Q115Q191L90k4347J2228R187J0009L193
15204h915M213m831k456j4459j1572J3585J0535L211j0566J992q622J0673k873
$$ plain form
15191 -20085 -27476 -27319 -16496 -12303 -12435 -14989 -8100 -15992 -17010 -25551 -16327 -14056 -4687 -2511 -4801
15176 -4801 -10354 344 924 7563 12439 13993 14783 18156 9455 -7693 -3060 -6529 -8230 -10052 -23225
15161 -23225 -37439 -42593 -34317 -25724 -40613 -41236 -34898 -31327 -18321 -28979 -19680 -19874 -24237 -17067
15147 -17067 -316 -11557 -6930 -6676 -7010 -3342 -1957 -7243 -2721 -3336 -7636 -10641 -12843 -15790 -28057
15132 -28057 -15444 -17975 -30805 -28811 -5285 12509 21083 13452 6976 7335 5982 -2474 328 -4337
15118 -4337 -9096 1496 3632 1366 2429 1111 -23343 -24081 -6476 2975 -1610 2750 3272 12279
15104 12279 14462 3866 -14304 -37789 -36008 -27587 -21493 -31545 -34349 -25607 -20176 -16028 -13305
15091 -13305 -10200 -11720 -14887 -20795 -18561 -18316 -23415 -10897 -10815 4787 19042 729 -14283 -9440
$$ packed form
15191b0085p391J57J0823M193j32k554O889p892j018q541R224K271R369K176k290
15176d801n553J0698N80O639M876J554P90L373q701j7148M633l469j701j822j3173
15161b3225j4214n154Q276Q593j4889o23O338L571J3006j0658R299j94m363P170
15147a7067J6751j1241M627K54l34L668J385n286M522o15m300l005k202k947j2267
15132b8057J2613k531j2830J994K3526J7794Q574p631o476L59j353q456K802m665
15118d337m759J0592K136k266J063j318k4454p38J7605R451m585M360N22R007
15104A2279K183j0596j8170k3485J781Q421O094j0052k804Q742N431M148K723
15091a3305L105j520l167n908K234K45n099J2518Q2J5602J4255j8313j5012M843
$$ plain form
15077 -9440 -12411 -20283 -22144 -14141 -7844 -6098 -15768 -24526 -16213 -14973 -16542 -14960 -5882 -810 4924
15062 4924 7286 -2481 -15760 -22570 -28568 -27278 -22530 -5682 -12594 -22680 -20396 -18878 -11425 -19328
15048 -19328 -28312 -29870 -29148 -23403 -21945 -16570 -15845 -622 -1715 -16505 -13120 -16475 -21111 -42613
15034 -42613 -51492 -54630 -39747 -21948 -14136 -14923 -13608 -15488 -13774 -6280 3836 10619 7395 -687
15020 -687 -5717 -11159 -12899 -3268 -1948 -5146 -4857 -4974 -12677 -6774 -4052 -6791 5000 18162 13183
15005 13183 -1558 -1880 -5487 -6004 -11891 -11867 1585 2425 -18782 -25066 -25082 -22726 -19511 -15977 -23100
14990 -23100 -19128 -2176 1742 -14205 -39685 -45756 -33555 -21652 -25242 -29806 -23093 -19453 -20013
14977 -20013 -16976 -5030 -2035 -19868 -24069 -27742 -25019 -13040 716 -56 -17920 -25437 -22203
$$ packed form
15077i440k971p872j861Q003O297J746r670q758Q313J240j569J582R078N072N734
15062D924K362r767j3279o810n998J290M748J6848o912j0086K284J518P453p903
15048a9328q984j558P22N745J458N375P25J5223j093j4790L385l355m636k1502
15034d2613q879l138J4883J7799P812p87J315j880J714P494J0116O783l224q082
15020f87n030n442j740R631J320l198K89j17p703N903K722k739J1791J3162m979
15005A3183j4741l22l607n17n887K4J3452Q40k1207o284j6K356L215L534p123
14990b3100L972J6952L918j5947k5480o071J2201J1903l590m564O713L640n60
14977b0013L037J1946K995j7833m201l673K723J1979J3756p72j7864p517L234
$$ plain form
14964 -22203 -16538 -4060 5696 -7363 -10756 -16859 -39156 -64558 -81430 -80008 -53568 -8293 29033
14951 29033 63727 82484 97909 104454 99355 77376 63310 48259 19163 -14704 -50108 -72574
14939 -72574 -66830 -53111 -31661 -23151 186 1536 -13521 -42476 -48920 -38816 -22201 -30608 -36518
14926 -36518 -35798 -19710 -6685 -6359 -7428 -82 -138 -11758 -20673 -27277 -34777 -39180 -24748 -12529
14912 -12529 -12532 -22356 -21560 -33988 -28740 -15654 -1097 -3792 -17093 -18050 -11942 -11876 -29396 -29719 -11847
14897 -11847 -4936 -22146 -11588 -6579 -16945 -23527 -27574 -17420 -11257 -18779 -33090 -32842 -30380
14884 -30380 -26264 -20964 -28054 -30618 -33942 -47832 -42148 -35729 -31661 -38746 -35503 -23763 -21505 -24013
14870 -24013 -27824 -37486 -41691 -37990 -26966 -23071 -18183 -25418 -19525 -19927 -24561 -29912 -24038 -25122
$$ packed form
14964b2203N665J2478R756j3059l393o103k2297k5402j6872J422K6440M5275L7326
14951B9033L4694J8757J5425O545n099k1979j4066j5051k9096l3867l5404k2466
14939g2574N744J3719K1450Q510K3337J350j5057k8955o444J0104J6615q407n910
14926c6518P20J6088J3025L26j069P346n6j1620q915o604p500m403J4432J2219
14912a2529lr824P96j2428N248J3086J4557k695j3301r57O108O6j7520l23J7872
14897a1847O911j7210J0558N009j0366o582m047J0154O163p522j4311K48K462
14884c0380M116N300p090k564l324j3890N684O419M068p085L243J1740K258k508
14870b4013l811r662m205L701J1024L895M888p235N893m02m634n351N874j084
$$ plain form
14856 -25122 -27199 -19452 -20052 -11316 -7931 -922 1357 -1825 -7715 -13354 -22212 -21092 -15990 -18902 -17968
14841 -17968 -15402 -23401 -27478 -22538 -8536 -445 3231 -320 -1924 2348 4931 11348 3268 -4178
14827 -4178 -6582 -7056 -17468 -15889 -7760 -3322 -8219 -23968 -33582 -34392 -30025 -29570 -26593 -21872 -27309
14812 -27309 -27209 -27354 -23592 -16981 -24632 -29114 -22165 -21089 -16698 -21771 -33453 -35376 -30659 -15049
14798 -15049 2318 8388 6407 7219 -3854 -15226 -33661 -33563 -15234 2398 -8998 -23468 -24006
14785 -24006 -17691 -15719 -34313 -26145 -19221 -18119 -22581 -34417 -35950 -33578 -28531 -23656 -28621 -39809
14771 -39809 -43702 -44027 -48172 -44369 -27702 -25354 -16482 -26664 -37270 -27508 -18578 -21754 -35040 -43770
14757 -43770 -26257 -15231 -6364 -5981 -8751 -7015 -8609 -20237 -29845 -25682 -20323 -16881 -20996 -22924
$$ packed form
14856b5122k077P747o00Q736L385P009K279l182n890n639q858J120N102k912R34
14841a7968K566p999m077M940J4002Q091L676l551j604M272K583O417q080p446
14827d178k404m74j0412J579Q129M438m897j5749r614q10M367M55K977M721n437
14812b7309J00j45L762O611p651m482O949J076M391n073j1682j923M717J5610
14798a5049J7367O070j981Q12j1073j1372j8435R8J8329J7632j1396j4470n38
14785b4006O315J972j8594Q168O924J102m462j1836j533K372N047M875m965j1188
14771c9809l893l25m145L803J6667K348Q872j0182j0606R762Q930l176j3286q730
14757d3770J7513J1026Q867L83k770J736j594j1628r608M163N359L442m115j928
$$ plain form
14743 -22924 -22235 -22826 -28523 -26636 -21855 -11987 -14518 -12432 -13686 -22864 -18302 -7484 -10889 -23578
14729 -23578 -21627 -23439 -21298 -12296 -14734 -11681 -10907 -5672 6958 -5578 -10486 -18396 -17761 -9777
14715 -9777 -6319 -6059 -12868 -20138 -4742 -790 3249 -556 -11643 -17717 -18410 -7254 -1233 -1002 -5584
14700 -5584 -15002 -22055 -25742 -22377 -5529 1306 3357 139 -7278 -7624 -4456 6692 14846 23381
14686 23381 9064 -8623 -11861 -14120 -19527 -20492 -9866 -11526 -15414 -7954 -5299 -10762 -15827 1219
14672 1219 -2381 -934 -2964 -8913 -14618 -17486 -20212 -32355 -30437 -20486 -18045 -12639 -8809 6385
14658 6385 9008 3744 5988 -1300 -9089 -17473 -10893 -3061 6477 6447 5691 -260 1130 7864 16697
14643 16697 2144 -2687 -192 -981 4452 -8399 -11032 -5893 -9548 -28968 -28196 -16700 -4940 -1790
$$ packed form
14743b2924O89n91n697J887M781R868k531K086j254r178M562J0818l405j2689
14729b3578J951j812K141R002k438L053P74N235J2630j2536m908p910O35P984
14715i777L458K60o809p270J5396L952M039l805j1087o074o93J1156O021K31m582
14700e584r418p053l687L365J6848O835K051l218p417l46L168J1148Q154Q535
14686B3381j4317j7687l238k259n407r65J0626j660l888P460K655n463n065J7046
14672A219l600J447k030n949n705k868k726j2143J918R951K441N406L830J5194
14658F385K623n264K244p288p789q384O580P832R538l0p56n951J390O734Q833
14643A6697j4553m831K495p89N433j2851k633N139l655j9420P72J1496J1760L150
$$ plain form
14629 -1790 655 -7554 -735 -885 6074 3201 -153 -3647 6255 3939 2467 3197 1932 -2231 8610
14614 8610 28196 16536 13051 17207 11990 10484 7068 11050 6752 4691 9661 -7382 -9443 -16
14600 -16 7403 9296 15227 20263 32795 28469 13086 13789 13169 14201 13623 6038 2337 6124 8839
14585 8839 5398 11209 10758 2973 5958 -9066 -6260 -8384 -6618 -4802 -1640 16835 38369 38986
14571 38986 35545 38162 41752 47167 43204 35814 45121 65702 92854 91095 90570 104484 117330 111845
14557 111845 120768 151972 177755 207262 248747 295268 350576 415161 493879 598787 737659
14546 737659 905742 1111278 1380916 1698625 2030455 2312183 2468184 2471378 2328255 2073764
14536 2073764 1768076 1488169 1253789 1075667 945294 837992 776246 727794 674063 613398
$$ packed form
14629a790K445q209O819j50O959k873l354l494R902k316j472P30j265m163J0841
14614H610J9586j1660l485M156n217j506l416L982m298k061M970j7043k061R427
14600a6P419J893N931N036J2532m326j5383P03o20J032n78p585l701L787K715
14585H839l441N811m51p785K985j5024K806k124J766J816L162J8475K1534O17
14571C8986l441K617L590N415l963p390R307K0581K7152j759n25J3914J2846n485
14557A11845Q923L1204K5783K9507M1485M6521N5308O4585P8718J04908J38872
14546G37659J68083K05536K69638L17709L31830K81728J56001L194j43123k54491
14536B073764l05688k79907k34380j78122j30373j07302o1746m8452n3731o0665
$$ plain form
14526 613398 564057 538564 515173 487016 464791 433291 406897 392473 393646 386614 383741 379271
14514 379271 375344 375537 367332 364460 363179 343224 344008 358537 356372 328446 325715 332360 312143 298994
14500 298994 286231 292288 289625 272594 252682 257789 268596 270697 273121 267017 270728 291818 315749
14487 315749 336774 357280 347144 311976 274269 252816 225058 199200 180236 151182 136136
14476 136136 119796 105155 113580 110199 107566 90395 73553 61363 56757 55026 66536 76817
14464 76817 84133 67700 57371 59493 47053 44616 42764 45099 50566 41412 38572 37028 33850 36214
14450 36214 26965 25721 34061 39652 48234 50050 48912 41328 30899 31128 26205 16744 8149 -985
14436 -985 -14072 -17982 -12207 -2390 16470 28995 31757 15172 -3853 -2451 12106 8549 9875
$$ packed form
14526F13398m9341k5493k3391k8157k2225l1500k6394j4424J173p032k873m470
14514C79271l927J93q205k872j281j9955P84J4529k165k7926k731O645k0217j3149
14500B98994j2763O057k663j7031j9912N107J0807K101K424o104L711K1090K3931
14487C15749K1025K0506j0136l5168l7707k1453k7758k5858j8964k9054j5046
14476A36136j6340j4641Q425l381k633j7171j6842j2190m606j731J1510J0281
14464G6817P316j6433j0329K122j2440k437j852K335N467r154k840j544l178K364
14450C6214r249j244Q340N591Q582J816j138p584j0429K29m923r461q595r134
14436i85j3087l910N775R817J8860J2525K762j6585j9025J402J4557l557J326
$$ plain form
14423 9875 17785 19180 17385 7923 12380 10529 14270 11476 668 10708 14607 8249 4050 -7904
14409 -7904 -3590 -1371 -12507 -580 1371 373 -14934 -27183 -17598 -12795 -3468 -3751 -12780 -7847
14395 -7847 -3331 -662 1762 -4749 -7416 91 7894 5362 6392 11499 8911 389 4952 -2300 7546
14380 7546 4370 2201 3377 3955 5998 3223 657 -4792 735 6002 8085 10646 21625 10362
14366 10362 14600 11519 9858 -1935 -2665 2807 5785 4062 3935 12135 22582 19342 18577 20124 20252
14351 20252 28573 21826 4069 10675 12047 11181 438 -5821 -11522 -6470 3138 -640 -6177 9571
14337 9571 5521 6954 -1185 -4839 -102 12097 18956 12690 170 7003 22455 26916 16393 19855
14323 19855 38828 42515 40274 15953 3141 27363 30190 20554 26845 27163 23790 19937 10298 14153
$$ packed form
14423I875P910J395j795r462M457j851L741k794j0808J0040L899o358m199j1954
14409g904M314K219j1136J1927J951r98j5307j2249R585M803R327k83r029M933
14395g847M516K669K424o511k667P507P803k532J030N107k588q522M563p252R846
14380G546l176k169J176N78K043k775k566n449N527N267K083K561J0979j1263
14366A0362M238l081j661j1793p30N472K978j723j27Q200J0447l240p65J547J28
14351B0252Q321o747j7757O606J372q66j0743o259n701N052R608l778n537J5748
14337I571m050J433q139l654M737J2199O859o266j2520O833J5452M461j0523L462
14323A9855J8973L687k241k4321j2812K4222K827r636O291L18l373l853r639L855
$$ plain form
14309 14153 18044 59 2237 16543 18157 522 798 17135 33059 41086 30926 27780 26602
14296 26602 20424 13136 18775 12383 13810 36813 55856 55750 46765 51061 62377 51791 40851
14283 40851 46097 53877 67413 88342 98797 111037 130479 146173 156294 178543 210961 235231
14271 235231 267559 304180 352900 411108 470387 543249 614134 656183 666726 675493 651082 607104
14259 607104 558985 503624 465731 421098 379625 351512 340790 333636 307926 302311 299859 295628
14247 295628 280832 276193 279250 273842 269036 278236 306484 327223 338712 351242 364529 390063
14235 390063 426171 478665 533698 581843 642263 700898 774925 814963 831641 828579 798757 740003
14223 740003 655529 591832 533297 487350 438464 401844 363972 334278 307079 285801 278947 277477
$$ packed form
14309A4153L891j7985K178J4306J614j7635K76J6337J5924Q027j0160l146j178
14296B6602o178p288N639o392J427K3003J9043j06q985M296J1316j0586j0940
14283D0851N246P780J3536K0929J0455J2240J9442J5694J0121K2249L2418K4270
14271B35231L2328L6621M8720N8208N9279P2862P0885M2049J0543Q767k4411m3978
14259F07104m8119n5361l7893m4633m1473k8113j0722p154k5710n615k452m231
14247B95628j4796m639L057n408m806R200K8248K0739J1489J2530J3287K5534
14235C90063L6108N2494N5033M8145O0420N8635P4027M0038J6678l062k9822n8754
14223G40003q4474o3697n8535m5947m8886l6620l7872k9694k7199k1278o854j470
$$ plain form
14211 277477 275373 282562 275263 270985 259611 243226 229096 236373 232689 234899 221395 217702 220629
14198 220629 206798 187016 173098 170727 164544 152894 161821 167194 165296 146506 152539 152080 150519
14185 150519 138350 147884 147303 147279 134549 126657 124150 126546 129816 125040 119304 135507 132478 121910
14171 121910 116097 112543 111291 114531 115661 98860 88905 89822 86990 78848 73559 69848 70076 76707
14157 76707 75665 81096 79631 64104 55829 53876 54387 50283 46318 39408 47689 43814 39320 39949 48518
14142 48518 55316 51878 59081 67821 71430 70653 62373 60090 54695 58608 49199 47355 59220 46174
14128 46174 26511 24773 20324 22216 16825 23788 29805 30277 22492 34627 37100 41600 33135 34437
14114 34437 34637 54454 53205 53597 63181 50827 35177 41023 43484 43760 35481 34544 36827 31504 26113
$$ packed form
14211B77477k104P189p299m278j1374j6385j4130P277l684K210j3504l693K927
14198B20629j3831j9782j3918k371o183j1650Q927N373j898j8790O033m59j561
14185A50519j2169R534n81k4j2730p892k507K396L270m776n736J6203l029j0568
14171A21910n813l554j252L240J130j6801r955R17k832q142n289l711K28O631
14157G6707j042N431j465j5527q275j953N11m104l965o910Q281l875m494O29Q569
14142D8518O798l438P203Q740L609p77q280k283n395L913r409j844J1865j3046
14128D6174j9663j738m449J892n391O963O017M72p785J2135K473M500q465J302
14114C4437K00J9817j249L92R584j2354j5650N846K461K76q279r37K283n323n391
$$ plain form
14099 26113 41824 40325 24480 22885 26033 23410 31101 21658 37886 41276 35163 29639 32914 40480
14085 40480 56731 68581 67018 65194 71182 75685 88939 116588 141105 148358 164234 182709 183823
14072 183823 179125 193003 208930 231716 249301 257223 268826 276257 262370 262993 267060 264168 257298
14059 257298 247687 237619 233427 239630 222373 214897 214928 205447 217535 208008 185104 172287 158138
14046 158138 163940 169082 164301 164926 173514 196198 202897 207659 227193 232833 247433 258805 268439
14033 268439 273097 290040 300745 299266 323672 336033 333842 322261 308553 287595 265118 245176
14021 245176 243658 236938 227274 219416 225228 223199 211211 202338 190862 170595 159572 140196 132488
14008 132488 137160 142513 140175 132997 141788 145812 139452 143155 155680 148599 146792 155252 143591 144465
$$ packed form
14099B6113J5711j499j5845j595L148k623P691r443J6228L390o113n524L275P566
14085D0480J6251J1850j563j824N988M503J3254K7649K4517P253J5876J8475J114
14072A83823m698J3878J5927K2786J7585P922J1603P431j3887O23M067k892o870
14059B57298r611j0068m192O203j7257p476L1r481J2088r527k2904j2817j4149
14046A58138N802N142m781O25Q588K2684O699M762J9534N640J4600J1372R634
14033B68439M658J6943J0705j479K4406J2361k191j1581j3708k0958k2477j9942
14021B45176j518o720r664p858N812k029j1988q873j1476k0267j1023j9376p708
14008A32488M672N353k338p178Q791M024o360L703J2525p081j807Q460j1661Q74
$$ plain form
13994 144465 132328 129187 147169 150113 137309 140374 160700 166151 154148 153820 151922 155363 174466
13981 174466 179016 192631 200811 205658 196988 193327 192183 187133 191889 200122 184541 174238 183917
13968 183917 178248 185653 196463 200255 192783 176967 170942 172360 183025 193156 199010 202085 207961
13955 207961 227376 243620 272371 281956 277898 281117 301312 308320 310663 321574 337805 353236
13943 353236 364991 372084 376819 381088 395852 396946 385079 371527 352623 343428 362707 379092
13931 379092 379126 378184 379762 373394 372745 386251 407487 411578 420787 425717 434545 441185 452727 460960
13917 460960 487918 513866 535587 542939 550078 567092 586353 616353 643550 665288 701648 742228
13905 742228 779688 815607 853122 878148 890306 917987 950291 982451 1006802 1020272 1029747 1049262
$$ packed form
13994A44465j2137l141J7982K944j2804L065K0326N451j2003l28j898L441J9103
13981A74466M550J3615Q180M847q670l661j144n050M756Q233j5581j0303R679
13968A83917n669P405J0810L792p472j5816o025J418J0665J0131N854L075N876
13955B07961J9415J6244K8751R585m058L219K0195P008K343J0911J6231J5431
13943C53236J1755P093M735M269J4764J094j1867j3552j8904r195J9279J6385
13931C79092L4r42J578o368o49J3506K1236M091R209M930Q828O640J1542Q233
13917D60960K6958K5948K1721P352P139J7014J9261L0000K7197K1738L6360M0580
13905G42228L7460L5919L7515K5026J2158K7681L2304L2160K4351J3470R475J9515
$$ plain form
13893 1049262 1064684 1075008 1111866 1156655 1178143 1195550 1230408 1250020 1283579 1308018 1354464
13882 1354464 1407190 1456013 1499042 1520834 1541822 1600381 1651525 1681033 1706215 1738379 1786825
13871 1786825 1845676 1897964 1949708 1999862 2051883 2098649 2143078 2203241 2276125 2361771 2449268
13860 2449268 2532332 2609424 2693024 2789083 2886223 2974095 3059605 3163106 3265329 3383029 3494188
13849 3494188 3621930 3757798 3898595 4051974 4246662 4446710 4659048 4908458 5193544
13840 5193544 5495273 5831539 6221415 6666242 7168659 7750141 8424248 9232631 10168360
13831 10168360 11290631 12617581 14202038 16088497 18353615 21054257 24273568 28102575
13823 28102575 32692243 38233464 44961359 53156893 63084860 74791647 87828887 100992376
$$ packed form
13893A049262J5422J0324L6858M4789K1488J7407L4858J9612L3559K4439M6446
13882A354464N2726M8823M3029K1792K0988N8559N1144K9508K5182L2164M8446
13871A786825N8851N2288N1744N0154N2021M6766M4429O0163P2884Q5646Q7497
13860B449268Q3064P7092Q3600R6059R7140Q7872Q5510J03501J02223J17700J11159
13849C494188J27742J35868J40797J53379J94688K00048K12338K49410K85086
13840E193544L01729L36266L89876M44827N02417N81482O74107Q08383R35729
13831A0168360J122271J326950J584457J886459K265118K700642L219311L829007
13823B8102575M589668N541221O727895Q195534R927967J1706787J3037240J3163489
$$ plain form
13815 100992376 112396630 120249859 123416305 121624014 115386384 106118109 95706744 85723226
13807 85723226 77037835 69884472 64122012 59491004 55797094 52845214 50470385 48594937
13799 48594937 47121882 46061483 45387619 45062627 45115257 45560519 46427007 47749848 49579448
13790 49579448 51974961 55000999 58743497 63338551 68949606 75760862 84015491 93890833
13782 93890833 105402550 118053098 130658433 141312981 148047605 149683419 145984467
13775 145984467 137524735 125776256 112759462 100251288 89306184 80181973 72702444
13768 72702444 66605772 61591453 57432996 53944550 50975502 48474362 46339735 44506258
13760 44506258 42929982 41507374 40155889 38836487 37511048 36193635 34926831 33761745
$$ packed form
13815A00992376J1404254P853229L166446j792291o237630r268275j0411365r983518
13807H5723226q685391p153363n762460m631008l693910k951880k374829j875448
13799D8594937j473055j060399o73864l24992N2630M45262Q66488J322841J829600
13790D9579448K395513L026038L742498M595054N611055O811256Q254629R875342
13782I3890833J1511717J2650548J2605335J0654548O734624J635814l698952
13775A45984467q459732j1748479j3016794j2508174j0945104r124211p479529
13768G2702444o096672n014319m158457l488446k969048k501140k134627j833477
13760D4506258j576276j422608j351485j319402j325439j317413j266804j165086
$$ plain form
13752 33761745 32709931 31774966 30975555 30293928 29657997 29046770 28434802 27786114 27086209
13743 27086209 26340368 25573284 24772687 23961481 23125129 22277740 21424880 20578337 19737651
13734 19737651 18929270 18149124 17439705 16794709 16216547 15693236 15246813 14886755 14599245
13725 14599245 14376957 14181713 13974516 13707852 13347943 12853754 12238583 11529917 10781464
13716 10781464 10065619 9396262 8787598 8223313 7731305 7298145 6911563 6548352 6212161
13707 6212161 5921054 5636829 5381432 5144876 4908283 4696178 4502099 4329138 4148021
13698 4148021 3976753 3828679 3686019 3560874 3457596 3339609 3219627 3124417 3034535 2935048
13688 2935048 2833655 2723861 2628754 2507601 2404202 2296910 2189171 2082211 1979755 1897867
$$ packed form
13752C3761745j051814r34965p99411o81627o35931o11227o11968o48688o99905
13743B7086209p45841p67084q00597q11206q36352q47389q52860q46543q40686
13734A9737651q08381p80146p09419o44996n78162n23311m46423l60058k87510
13725A4599245k22288j95244k07197k66664l59909m94189o15171p08666p48453
13716A0781464p15845o69357o08664n64285m92008m33160l86582l63211l36191
13707F212161k91107k84225k55397k36556k36593k12105j94079j72961j81117
13698D148021j71268j48074j42660j25145j03278j17987j19982r5210q9882r9487
13688B935048j01393j09794r5107j21153j03399j07292j07739j06960j02456q1888
$$ plain form
13678 1897867 1809018 1735104 1661954 1595168 1525393 1466118 1412653 1365444 1322630 1274655 1230446
13667 1230446 1209861 1178963 1147971 1117578 1103706 1079037 1077833 1083804 1071426 1057954 1046913 1044141
13655 1044141 1034469 1015903 1004343 991851 976694 958915 950048 921615 893710 874867 855461 833838
13643 833838 825106 810529 819870 838906 850975 843871 832113 822906 815038 808317 813236 819793 817243
13630 817243 821394 817628 815658 818310 821486 821618 830171 837597 818070 813550 808725 815329 828475 832782
13616 832782 832269 840508 851539 852099 859300 863899 866289 888656 900442 903821 905070 897964 891854 889497
13602 889497 882834 870889 872547 865632 854378 847993 843582 832638 816639 809988 795695 784494 773232
13589 773232 770487 772653 756546 752134 750610 728770 715474 702915 689283 680163 680847 671137 646228
$$ packed form
13678A897867q8849p3914p3150o6786o9775n9275n3465m7209m2814m7975m4209
13667A230446k0585l0898l0992l0393j3872k4669j204N971j2378j3472j1041k772
13655A044141r672j8566j1560j2492j5157j7779q867k8433k7905j8843j9406k1623
13643H33838q732j4577R341J9036J2069p104j1758r207p868o721M919O557k550
13630H17243M151l766j970K652L176J32Q553P426j9527m520m825O604J3146M307
13616H32782n13Q239J1031N60P201M599K390K2367J1786L379J249p106o110k357
13602H89497o663j1945J658o915j1254o385m411j0944j5999o651j4293j1201j1262
13589G73232k745K166j6107m412j524k1840j3296j2559j3632r120O84r710k4909
$$ plain form
13576 646228 621552 618386 621181 600848 596829 590186 591189 586404 564342 559345 553399 552149 551073
13563 551073 533185 519550 502016 494625 495511 481329 469357 462743 450266 430580 412368 413304 422203
13550 422203 436710 426260 406913 399245 380840 358564 356883 351607 333797 318610 319678 300155
13538 300155 297927 287762 275422 266823 271585 274957 284468 285738 282919 288306 294462 280622 267297
13525 267297 273335 267080 251918 238598 207164 205840 224921 224283 218798 216855 215110 207888 194985
13512 194985 188244 195508 200324 193795 194669 202626 200480 199801 203901 218441 215174 216209 220519 201076
13498 201076 186937 193529 190610 196186 204479 195243 179361 167832 170682 174460 180516 186927 174874
13485 174874 181126 197538 202646 198668 199883 206457 233518 256918 266833 271374 263977 253443 241300
$$ packed form
13576F46228k4676l166K795k0333m019o643J003m785k2062m997n946j250j076
13563E51073j7888j3635j7534p391Q86j4182j1972o614j2477j9686j8212R36Q899
13550D22203J4507j0450j9347p668j8405k2276j681n276j7810j5187J068j9523
13538C00155k228j0165j2340q599M762L372R511J270k819N387O156j3840j3325
13525B67297O038o255j5162j3320l1434j324J9081o38n485j943j745p222j2903
13512A94985o741P264M816o529Q74P957k146o79M100J4540l267J035M310j9443
13498B01076j4139O592k919N576Q293r236j5882j1529K850L778O056O411j2053
13485A74874O252J6412N108l978J215O574K7061K3400R915M541p397j0534j2143
$$ plain form
13472 241300 236662 236799 237838 236559 232097 242329 242678 246860 241958 242696 220280 232982 234460 235259
13458 235259 231857 231126 228823 227570 223551 225229 227830 233520 233430 208330 183596 180402 186581 182813
13444 182813 187806 184254 178141 177058 170802 165036 181847 196682 192293 201622 206871 203962 189393
13431 189393 169057 164670 163481 161981 168034 156841 141935 135005 132459 143355 134892 120677 137087
13418 137087 127534 113543 119423 130615 136401 130354 113404 95418 98904 93386 90170 90561 81171
13405 81171 83616 101181 116252 129843 123382 118095 116821 108751 110440 111653 102932 97799 106974 110559
13391 110559 112667 106836 114214 125200 126052 122426 126968 114038 115619 115358 128290 134169 126651 122635
13377 122635 121207 124081 134339 137841 146310 163870 183972 193939 214872 244184 254669 273701
$$ packed form
13472B41300m638J37J039j279m462J0232L49M182m902P38k2416J2702J478P99
13458B35259l402p31k303j253m019J678K601N690r0k5100k4734l194O179l768
13444A82813M993l552o113j083o256n766J6811J4835m389R329N249k909j4569
13431A89393k0336m387j189j500O053j1193j4906o930k546J0896q463j4215J6410
13418A37087r553j3991N880J1192N786o047j6950j7986L486n518l216L91r390
13405H1171K445J7565J5071J3591o461n287j274q070J689J213q721n133R175L585
13391A10559K108n831P378J0986Q52l626M542j2930J581k61J2932N879p518m016
13377A22635j428K874J0258L502Q469J7560K0102R967K0933K9312J0485J9032
$$ plain form
13365 273701 321361 366669 411171 463867 518118 587667 645328 678395 700796 698930 674840 642005
13353 642005 597407 552795 513916 473036 436999 417357 403015 391647 381865 368722 349374 347615
13341 347615 341154 333834 335304 351179 369661 391917 394750 405426 424619 429477 451382 476536
13329 476536 504226 557494 600164 651553 719642 794759 857177 901000 916473 896828 856670
13318 856670 805785 741871 674256 621895 565885 518398 474312 435817 411280 395901 396512 377203
13306 377203 353879 330733 313701 310477 307495 308283 310972 307189 296966 286208 265309 253799 255972
13293 255972 269523 266880 249442 233849 223676 226072 235829 227939 219857 205319 198563 195024 200417
13280 200417 184903 174104 163492 149879 158269 153111 142421 130202 134915 138617 131231 135899 130329
$$ packed form
13365B73701M7660M5308M4502N2696N4251O9549N7661L3067K2401j866k4090l2835
13353F42005m4598m4612l8879m0880l6037j9642j4342j1368r782j3143j9348j759
13341C47615o461p320J470J5875J8482K2256K833J0676J9193M858K1905K5154
13329D76536K7690N3268M2670N1389O8089P5117O2418M3823J5473j9645m0158
13318H56670n0885o3914o7615n2361n6010m7487m4086l8495k4537j5379O11j9309
13306C77203k3324k3146j7032l224k982P88K689l783j0223j0758k0899j1510K173
13293B55972J3551k643j7438j5593j0173K396R757p890q082j4538o756l539N393
13280B00417j5514j0799j0612j3613Q390n158j0690j2219M713L702p386M668n570
$$ plain form
13267 130329 126817 124723 109476 95537 100944 97197 90554 89287 83828 77929 74562 68111 68461 78169
13253 78169 78670 78431 91091 91602 95081 90838 76209 77779 76919 74976 60227 47883 49284 54626
13239 54626 46096 49526 62420 62509 68661 74561 73636 68107 59949 50348 54692 52595 62215 67695 75524
13224 75524 70575 66182 56400 51834 62238 74418 68881 55351 49703 41898 53565 60862 75839
13211 75839 72614 67318 71961 69601 66530 76192 74465 76216 80672 79081 77782 67811 56506 60264
13197 60264 64728 79033 77541 81629 82500 80176 66978 68663 66051 61278 62116 64895 73731 71159
13183 71159 78655 83738 71262 54495 50516 45271 50371 53515 63847 62486 60516 59397 64958 63483
13169 63483 80522 95750 116738 111265 113738 116322 111253 110499 105797 109149 106373 113047 120222 111739
$$ packed form
13267A30329l512k094j5247j3939N407l747o643j267n459n899l367o451L50R708
13253G8169N01k39J2660N11L479m243j4629J570q60j943j4749j2344J401N342
13239E4626q530L430J2894Q9O152N900r25n529q158r601M344k097R620N480P829
13224G5524m949m393r782m566J0404J2180n537j3530n648p805J1667P297J4977
13211G5839l225n296M643k360l071R662j727J751M456j591j299r971j1305L758
13197F0264M464J4305j492M088Q71k324j3198J685k612m773Q38K779Q836k572
13183G1159P496N083j2476j6767l979n245N100L144J0332j361j970j119N561j475
13169F3483J7039J5228K0988n473K473K584n069p54m702L352k776O674P175q483
$$ plain form
13155 111739 103453 109137 113094 108780 103469 108391 95080 77650 63966 63644 66696 82176 98494
13142 98494 98147 104769 112678 112536 111495 112814 116119 108852 117786 139067 152122 152838 149320 138812
13128 138812 138196 151291 161375 156209 144902 131254 137943 132214 145589 146655 147005 145749 138077
13115 138077 137894 135087 110719 93033 96822 105830 116922 119101 110046 103402 104603 100130 105141 113198
13101 113198 113184 109185 125603 137320 144385 151416 142364 134339 134964 134883 134368 128362 137356 136607 121253
13086 121253 103820 99458 107403 124806 132094 122460 119568 111286 116801 113554 114084 117115 119929 122296
13072 122296 121118 110768 96440 89393 96378 82502 66140 59370 58713 64118 68017 75748 97715
13059 97715 109196 103693 100137 98868 100107 93882 98800 92607 93998 100566 111409 116792 114784 106479
$$ packed form
13155A11739q286N684L957m314n311M922j3311j7430j3684l22L052J5480J6318
13142I8494l47O622P909j42j041J319L305p267Q934K1281J3055P16l518j0508
13128A38812o16J3095J0084n166j1307j3648O689n729J3375J066L50j256p672
13115A38077j83k807k4368j7686L789R008J1092K179r055o644J201m473N011Q057
13101A13198j4l999J6418J1717P065P031r052q025O25q1n15o006Q994p49j5354
13086A21253j7433m362P945J7403P288r634k892q282N515l247N30L031K814K367
13072A22296j178j0350j4328p047O985j3876j6362o770o57N405L899P731K1967
13059I7715J1481n503l556j269J239o225M918o193J391O568J0843N383k008q305
$$ plain form
13045 106479 115711 122073 129621 140288 148543 155247 153403 160472 161240 152240 167223 170944 161013 159688
13031 159688 151970 138882 150659 166807 164165 156547 161275 169271 173484 169627 173432 177796 173459
13018 173459 182318 199472 209406 221510 239302 261303 261217 259340 262896 265140 271711 272308 267030 290361
13004 290361 323239 328650 313447 324411 341992 356986 373648 368014 373263 370983 368044 369166 385058
12991 385058 405955 427017 443434 446831 454686 473088 499699 522963 537479 548828 560618 574906
12979 574906 587041 585642 586021 601386 602326 617555 633586 657280 681758 712905 729372 735363 746930
12966 746930 772369 798093 826492 840663 870864 896159 916897 954403 979199 1017681 1062431
12955 1062431 1096999 1139986 1167013 1195599 1240749 1275497 1315075 1373288 1428149 1476117 1520400
$$ packed form
13045A06479R232O362P548J0667Q255O704j844P069P68r000J4983L721r931j325
13031A59688p718j3088J1777J6148k642p618M728P996M213l857L805M364m337
13018A73459Q859J7154R934J2104J7792K2001q6j877L556K244O571N97n278K3331
13004B90361L2878N411j5203J0964J7581J4994J6662n634N249k280k939J122J5892
12991C85058K0897K1062J6417L397P855J8402K6611K3264J4516J1349J1790J4288
12979E74906J2135j399L79J5365R40J5229J6031K3694K4478L1147J6467N991J1567
12966G46930K5439K5724K8399J4171L0201K5295K0738L7506K4796L8482M4750
12955A062431L4568M2987K7027K8586M5150L4748L9578N8213N4861M7968M4283
$$ plain form
12944 1520400 1579739 1637561 1711979 1791943 1885545 1983962 2079316 2201607 2339473 2489258 2649403
12933 2649403 2830392 3041493 3289546 3597262 3947536 4348764 4833835 5409734 6082793
12924 6082793 6912926 7933076 9160232 10617507 12331271 14214720 16227409 18376036
12916 18376036 20667792 23222389 26128412 29225838 32104711 34150632 34853298 34071131
12908 34071131 32111635 29541020 26899343 24501362 22441033 20744355 19347951 18216780
12900 18216780 17297353 16553215 15988142 15568683 15274948 15118403 15078120 15171553 15399869 15781713
12890 15781713 16333876 17059237 18016571 19246479 20783847 22675758 24951153 27696027
12882 27696027 30974513 34896571 39574839 45121185 51553369 58541782 65163168 69992276
$$ packed form
12944A520400N9339N7822P4418P9964R3602R8417R5354J22291J37866J49785J60145
12933B649403J80989K11101K48053L07716L50274M01228M85071N75899O73059
12924F082793Q30133J020150J227156J457275J713764J883449K012689K148627
12916A8376036K291756K554597K906023L097426K878873K045921P02666p82167
12908C4071131j959496k570615k641677k397981k060329j696678j396404j131171
12900A8216780r19427p44138n65073m19459k93735j56545m0283R3433K28316L81844
12890A5781713N52163P25361R57334J229908J537368J891911K275395K744874
12882B7696027L278486L922058M678268N546346O432184O988413O621386M829108
$$ plain form
12874 69992276 71643931 69643719 64786702 58549085 52221242 46530013 41720632 37752329
12866 37752329 34514658 31848478 29629447 27768887 26207675 24883208 23764329 22816034
12858 22816034 22042621 21433742 20971552 20642828 20444676 20371644 20434612 20652325 21041740 21602377
12848 21602377 22371771 23352208 24554742 26002898 27716256 29690006 31893333 34194190
12840 34194190 36373482 38029460 38672821 37992143 36090878 33418021 30461873 27616103
12832 27616103 25082706 22885945 21009625 19404475 18020474 16809851 15748427 14799821
12824 14799821 13959038 13201950 12526491 11923253 11381294 10880310 10419964 9993127 9618542
12815 9618542 9283253 8977206 8703871 8457116 8223838 8004569 7825882 7659384 7481916
$$ packed form
12874F9992276J651655k000212m857017o237617o327843n691229m809381l968303
12866C7752329l237671k666180k219031j860560j561212j324467j118879r48295
12858B2816034p73413o08879m62190l28724j98152p3032O2968K17713L89415N60637
12848B1602377P69394R80437J202534J448156J713358J973750K203327K300857
12840C4194190K179292J655978O43361o80678j901265k672857k956148k845770
12832B7616103k533397k196761j876320j605150j384001j210623j061424r48606
12824A4799821q40783p57088o75459o03238n41959n00984m60346m26837l74585
12815I618542l35289l06047k73335k46755k33278k19269j78687j66498j77468
$$ plain form
12806 7481916 7286095 7080628 6891225 6693250 6493158 6280462 6058277 5814330 5572779
12797 5572779 5327184 5074977 4826760 4569318 4346449 4149095 3964479 3775429 3580011
12788 3580011 3397351 3241284 3087688 2954194 2833255 2716107 2585357 2459291 2357611
12779 2357611 2257947 2148396 2042256 1950639 1879065 1815618 1743458 1657089 1584947 1543807 1488495
12768 1488495 1427166 1370120 1332733 1297583 1256278 1199772 1159336 1132200 1095428 1047894 1019955
12757 1019955 993138 971383 944605 928092 916134 900783 882807 857407 851938 842317 838440 833885
12745 833885 820700 812480 825432 855108 896268 948170 995955 1037714 1066514 1095543 1122535 1151020
12733 1151020 1162884 1160705 1157635 1155880 1150675 1145478 1127348 1099581 1056446 1017589 974810 939488
$$ packed form
12806G481916j95821k05467j89403j97975k00092k12696k22185k43947k41551
12797E572779k45595k52207k48217k57442k22869j97354j84616j89050j95418
12788C580011j82660j56067j53596j33494j20939j17148j30750j26066j01680
12779B357611r9664j09551j06140r1617p1574o3447p2160q6369p2142m1140n5312
12768A488495o1329n7046l7387l5150m1305n6506m0436k7136l6772m7534k7939
12757A019955k6817k1755k6778j6513j1958j5351j7976k5400n469r621l877m555
12745H33885j3185q220J2952K9676M1160N1902M7785M1759K8800K9029K6992K8485
12733A151020J1864k179l070j755n205n197j8130k7767m3135l8857m2779l5322
$$ plain form
12721 939488 914860 909209 877585 857115 829817 806556 780601 739607 720679 702468 679573 655054
12709 655054 635936 625697 635246 626136 605604 615889 624936 621448 608828 595396 594169 581354
12697 581354 577671 579062 592910 601559 580408 584464 580548 585990 576258 564253 553350 544242 552293
12684 552293 545455 557744 577973 579529 587537 590615 577194 582847 574963 551322 522498 494051 477003
12671 477003 479395 487536 492349 501859 513112 522806 527457 520151 513302 497941 477853 471457 469250
12658 469250 471419 480661 484441 476746 500802 511974 535266 562755 568193 563567 574664 576312 575107
12645 575107 569360 566154 550722 536093 512855 493784 491464 483735 492957 500797 487844 480397 460737
12632 460737 440924 426889 420618 409321 396015 415221 443594 469612 495403 526968 534459 542553
$$ packed form
12721I39488k4628n651l1624k0470k7298k3261k5955m0994j8928j8211k2895k4519
12709F55054j9118j0239R549r110k0532J0285R047l488j2620j3432j227j2815
12697E81354l683J391J3848Q649k1151M056l916N442r732j2005j0903r108Q051
12684E52293o838J2289K0229J556Q008L078j3421N653p884k3641k8824k8447j7048
12671D77003K392Q141M813R510J1253R694M651p306o849j5361k0088o396k207
12658D69250K169R242L780p695K4056J1172K3292K7489N438m626J1097J648j205
12645E75107n747l206j5432j4629k3238j9071k320p729R222P840j2953p447j9660
12632D60737j9813j4035o271j1297j3306J9206K8373K6018K5791L1565P491Q094
$$ plain form
12620 542553 555190 580343 604921 612532 629670 653039 661017 683974 721019 746482 775542 828663
12608 828663 876554 920880 938124 929077 915306 897102 873461 840735 817621 791928 767263 747336
12596 747336 735917 750214 775368 797224 805339 804774 805330 812156 830518 864059 882434 899621 926354
12583 926354 963593 987753 1008141 1019107 1043973 1099781 1160790 1225139 1296399 1359970 1412644
12572 1412644 1472156 1548563 1626846 1706982 1790103 1880643 1964390 2056794 2142841 2221614 2313194
12561 2313194 2388854 2463247 2532211 2579100 2640549 2699373 2750809 2823615 2889304 2937857 3008953
12550 3008953 3107395 3183669 3270058 3368854 3454842 3522244 3585775 3649941 3704542 3750334 3790940
12539 3790940 3861850 3943805 3997691 4046456 4107989 4184829 4245149 4322946 4418416 4520630 4650523
$$ packed form
12620E42553J2637K5153K4578P611J7138K3369P978K2957L7045K5463K9060N3121
12608H28663M7891M4326J7244r047j3771j8204k3641l2726k3114k5693k4665j9927
12596G47336j1419J4297K5154K1856Q115n65N56O826J8362L3541J8375J7187K6733
12583I26354L7239K4160K0388J0966K4866N5808O1009O4349P1260O3571N2674
12572A412644N9512P6407P8283Q0136Q3121R0540Q3747R2404Q6047P8773R1580
12561B313194P5660P4393O8964M6889O1449N8824N1436P2806O5689M8553P1096
12550C008953R8442P6274Q6389R8796Q5988O7402O3531O4166N4601M5792M0606
12539C790940P0910Q1955N3886M8765O1533P6840O0320P7797R5470J02214J29893
$$ plain form
12528 4650523 4802365 4966722 5157833 5369603 5603217 5844468 6070295 6286997 6527514
12519 6527514 6791470 7086959 7399421 7749105 8166590 8695778 9360441 10178117 11162925
12510 11162925 12241091 13229705 13964731 14411780 14663406 14908146 15290934 15901635 16771229
12501 16771229 17913812 19343831 21129188 23343016 26035110 29303418 33284571 38179363
12493 38179363 44240597 51847391 61372488 73302523 88150962 106515386 129304727
12486 129304727 157937557 194737435 242428760 302158030 369982067 433846407 475741675
12479 475741675 482998850 454100881 399714473 337367406 280759162 235768069 201922612
12472 201922612 176382814 156606817 140952593 128428450 118335132 110102055 103248100
$$ packed form
12528D650523J51842J64357J91111K11770K33614K41251K25827K16702K40517
12519F527514K63956K95489L12462L49684M17485N29188O64663Q17676R84808
12510A1162925J078166R88614P35026M47049K51626K44740L82788O10701Q69594
12501A6771229J142583J430019J785357K213828K692094L268308L981153M894792
12493C8179363O061234P606794R525097J1930035J4848439J8364424K2789341
12486A29304727K8632830L6799878M7691325N9729270O7824037O3864340M1895268
12479D75741675P257175k8897969n4386408o2347067n6608244m4991093l3845457
12472B01922612k5539798j9775997j5654224j2524143j0093318q233077o853955
$$ plain form
12465 103248100 97452039 92492614 88239168 84581214 81415740 78648468 76220108 74106358
12457 74106358 72253024 70676267 69390771 68414788 67743152 67382100 67318842 67389937 67345825
12448 67345825 66942538 66011870 64622102 62974335 61247563 59514534 57730369 55816404
12440 55816404 53713476 51432357 49022204 46573012 44170395 41863407 39656242 37530483
12432 37530483 35489999 33578286 31794150 30085459 28471688 26962771 25557134 24228340
12424 24228340 22967230 21760438 20640392 19593527 18602743 17680123 16824784 15999816 15221048
12415 15221048 14491056 13805783 13176893 12576964 12026130 11510910 11020793 10535141 10068203
12406 10068203 9633588 9201693 8798527 8413140 8052466 7704515 7370644 7061211 6769583
$$ packed form
12465A03248100n796061m959425m253446l657954l165474k767272k428360k113750
12457G4106358j853334j576757j285496r75983o71636l61052o3258P1095m4112
12448F7345825m03287r30668j389768j647767j726772j733029j784165j913965
12440E5816404k102928k281119k410153k449192k402617k306988k207165k125759
12432C7530483k040484j911713j784136j708691j613771j508917j405637j328794
12424B4228340j261110j206792j120046j046865r90784r22620q55339q24968p78768
12415A5221048p29992o85273o28890n99929n50834n15220m90117m85652m66938
12406A0068203m34615m31895m03166l85387l60674l47951l33871l09433k91628
$$ plain form
12397 6769583 6500983 6237585 5990443 5753297 5527200 5322270 5128122 4944094 4762734
12388 4762734 4587329 4434484 4277704 4153038 4039164 3951622 3880361 3832004 3789287 3770688
12378 3770688 3800205 3870591 3992453 4166651 4406881 4755589 5208840 5798691 6563456 7560856
12368 7560856 8906602 10751362 13087958 15653493 17766020 18576722 17767659 15771490
12360 15771490 13422786 11344428 9767153 8594293 7697299 6984720 6398324 5905859 5507088
12351 5507088 5172946 4884161 4629084 4419020 4232298 4055803 3898092 3753624 3626064
12342 3626064 3519189 3436371 3368906 3311454 3260768 3245029 3263749 3290022 3316533 3348912 3369129
12331 3369129 3368152 3337287 3292552 3255152 3237967 3217102 3178680 3151363 3122551 3104959 3090136 3079311
$$ packed form
12397F769583k68600k63398k47142k37146k26097k04930j94148j84028j81360
12388D762734j75405j52845j56780j24666j13874q7542p1261m8357m2717j8599
12378C770688K9517P0386J21862J74198K40230L48708M53251N89851P64765R97400
12368G560856J345746J844760K336596K565535K112527Q10702q09063j996169
12360A5771490k348704k078358j577275j172860q96994p12579n86396m92465l98771
12351E507088l34142k88785k55077k10064j86722j76495j57711j44468j27560
12342C626064j06875q2818o7465n7452n0686j5739J8720K6273K6511L2379K0217
12331C369129r77l0865m4735l7400j7185k0865l8422k7317k8812j7592j4823j0825
$$ plain form
12319 3079311 3065686 3054750 3051822 3048313 3033232 3031742 3028946 3030896 3008265 2968677 2946464 2953427
12307 2953427 2958195 2953494 2940970 2923931 2911744 2901622 2885912 2863536 2827145 2787191 2745077 2703515
12295 2703515 2661607 2630218 2623290 2606953 2595132 2588430 2583071 2568373 2539731 2496569 2461722 2429825
12283 2429825 2387088 2348673 2310552 2273606 2238522 2196213 2155369 2123089 2091516 2055664 2016337
12272 2016337 1977880 1923691 1857494 1797922 1747501 1707001 1663542 1630899 1603513 1579625 1549860
12261 1549860 1498029 1448645 1416153 1379264 1343106 1319581 1299763 1284596 1278045 1255182 1222205
12250 1222205 1196687 1192752 1186726 1162909 1143651 1129935 1082219 1042454 1011000 989340 974362 962894
12238 962894 944623 925379 922410 910481 911375 922917 914147 898422 869819 850116 842093 820249
$$ packed form
12319C079311j3625j0936k928l509j5081j490k796J950k2631l9588k2213O963
12307B953427M768m701j2524j7039j2187j0122j5710k2376l6391l9954m2114m1562
12295B703515m1908l1389o928j6337j1821o702n359j4698k8642m3162l4847l1897
12283B429825m2737l8415l8121l6946l5084m2309m0844l2280l1573l5852l9327
12272B016337l8457n4189o6197n9572n0421m0500m3459l2643k7386k3888k9765
12261A549860n1831m9384l2492l6889l6158k3525j9818j5167o551k2863l2977
12250A222205k5518l935o026k3817j9258j3716m7716l9765l1454k1660j4978j1468
12238I62894j8271j9244k969j1929Q94J1542q770j5725k8603j9703q023k1844
$$ plain form
12226 820249 814378 801546 770247 717418 675550 645213 641271 633883 611742 585158 556303 531610
12214 531610 509714 486485 480434 475690 457935 446191 439749 422607 423963 417892 415921 413574 404886
12201 404886 398530 375524 350235 334740 332006 335316 336788 334598 330096 334509 345851 360949 353675
12188 353675 348245 356640 361290 357975 353386 346780 349585 379750 404570 416092 416230 413014 426412
12175 426412 446719 458992 477471 505190 522310 523040 529189 531328 554574 562789 557639 553180 550241
12162 550241 556449 550958 534657 516331 508516 515892 515880 522456 519412 503650 501688 507716 496805 497609
12148 497609 480394 463140 464655 465098 456442 455909 449336 444196 434211 440650 446410 444558 442504 433811
12134 433811 430835 433330 427890 397993 370598 367069 360163 364517 358561 367977 368419 386687 380114 366085
$$ packed form
12226H20249n871j2832l1299n2829m1868l0337l942p388k2141k6584k8855k4693
12214E31610k1896k3229o051m744j7755j1744o442j7142J356o071j971k347q688
12201D04886o356k3006k5289j5495k734L310J472k190m502M413J1342J5098p274
12188C53675n430Q395M650l315m589o606K805L0165K4820J1522J38l216J3398
12175D26412K0307J2273J8479K7719J7120P30O149K139K3246Q215n150m459k939
12162E50241O208n491j6301j8326p815P376j2O576l044j5762j962O028j0911Q04
12148D97609j7215j7254J515M43q656n33o573n140r985O439N760j852k054q693
12134D33811k976K495n440k9897k7395l529o906M354n956R416M42J8268o573j4029
$$ plain form
12120 366085 364826 345093 340000 335271 322357 312575 310815 315863 320813 316705 305500 310863 306992
12107 306992 297439 291973 295646 296801 292237 292290 291886 274340 260955 257536 257003 244489 232654 235203
12093 235203 228630 221848 217978 216427 214371 212126 215237 212568 215239 222120 221482 236985 229445 215743
12079 215743 197740 188474 168325 164086 171942 184435 177937 183565 177771 178503 186603 189742 207903
12066 207903 218279 228624 211291 197676 207080 219181 230632 236808 251923 266221 265411 269930
12054 269930 288271 310897 335589 352767 349667 373773 402201 454597 517145 565879 633296 728986
12042 728986 851651 1006931 1198902 1447863 1759677 2113120 2472251 2744992 2828852 2708175
12032 2708175 2426572 2078265 1768355 1515139 1324885 1176125 1072145 972489 880718 816478
$$ packed form
12120C66085j259j9733n093m729j2914r782j760N048M950m108j1205N363l871
12107C06992r553n466L673J155m564N3m04j7546j3385l419n33j2514j1835K549
12093B35203o573o782l870j551k056k245L111k669K671O881o38J5503p540j3702
12079B15743j8003r266k0149m239P856J2493o498N628n794P32Q100L139J8161
12066B07903J0376J0345j7333j3615R404J2101J1451O176J5115J4298q10M519
12054B69930J8341K2626K4692J7178l100K4106K8428N2396O2548M8734O7417R5690
12042G28986J22665J55280J91971K48961L11814L53443L59131K72741Q3860j20677
12032B708175k81603l48307l09910k53216j90254j48760j03980r9656r1771o4240
$$ plain form
12022 816478 766120 716091 690515 676777 660325 634963 617804 617333 614874 606770 595456 582040
12010 582040 576207 565537 564785 560060 565421 556189 545306 538875 530600 512212 512424 503412 493989 485310
11996 485310 467728 454746 440884 423755 428513 421606 409754 403698 402802 380215 357741 340382
11984 340382 322720 311956 305768 290515 268818 241734 234179 238876 230434 219884 224797 228328 229061
11971 229061 210252 192951 186414 193323 191913 185407 167079 169394 169582 155011 163330 159717 149049
11958 149049 152841 158920 155890 141636 127494 122458 124784 124755 122834 122039 123401 128288 132270 138103
11944 138103 154557 156956 143981 130879 117722 111098 108117 103747 103685 106533 101608 101917 89166 76759
11930 76759 75964 80594 77910 81152 87874 109962 126516 126190 135740 151563 174273 180149 179336 170037
$$ packed form
12022H16478n0358n0029k5576j3738j6452k5362j7159m71k459q104j1314j3416
12010E82040n833j0670p52m725N361r232j0883o431q275j8388K12r012r423q679
11996D85310j7582j2982j3862j7129M758o907j1852o056q96k2587k2474j7359
11984C40382j7662j0764o188j5253k1697k7084p555M697q442j0550M913L531P33
11971B29061j8809j7301o537O909j410o506j8328K315J88j4571Q319l613j0668
11958A49049L792O079l030j4254j4142n036K326k9j921p95J362M887L982N833
11944A38103J6454K399j2975j3102j3157o624k981m370o2K848m925L09j2751j2407
11930G6759p95M630k684L242O722K2088J6554l26R550J5823K2710N876q13r299
$$ plain form
11916 170037 162172 158103 154124 153329 148709 138795 137440 129724 134703 129832 126501 128632 122801 111995
11902 111995 117544 122745 120736 125288 131916 150656 151424 137309 126005 128425 132570 149336 161309
11889 161309 153351 136970 139569 142017 137380 138139 128408 130066 144154 147205 145733 130949 126984 141637
11875 141637 138665 135541 143908 145856 142597 134538 138454 139062 138041 128106 106658 102312 97964 103496
11861 103496 113471 116634 119099 117128 111641 108201 116720 124334 113620 107888 88912 83818 78133 84483
11847 84483 86195 81633 85301 87275 87483 89361 97392 106613 115165 120284 116853 115969 101545 100975 96555
11832 96555 81700 84032 80673 70700 72900 80673 94903 103053 98124 105449 101734 91373 88672 77447
11818 77447 70428 58763 58546 70523 64389 65480 69065 66192 62932 72718 65502 63658 67097 79743
$$ packed form
11916A70037p865m069l979p95m620r914j355p716M979m871l331K131n831j0806
11902A11995N549N201k009M552O628J8740P68j4115j1304K420M145J6766J1973
11889A61309p958j6381K599K448m637P59r731J658J4088L051j472j4784l965J4653
11875A41637k972l124Q367J948l259q059L916O08j021r935k1448m346m348N532
11861A03496R975L163K465j971n487l440Q519P614j0714n732j8976n094n685O350
11847H4483J712m562L668J974K08J878Q031R221Q552N119l431q84j4424n70m420
11832I6555j4855K332l359r973K200P773J4230Q150m929P325l715j0361k701j1225
11818G7447p019j1665k17J1977o134J091L585k873l260R786p216j844L439J2646
$$ plain form
11804 79743 76953 51490 54000 41796 46916 60529 72525 69075 67053 59138 62422 52464 38161
11791 38161 35328 48936 60047 54948 55086 52445 58704 60102 63689 63405 54408 68926 76306 55663
11777 55663 54589 65148 72659 71774 66191 62639 65440 69046 73024 72797 76350 69709 68039 72140 71724
11762 71724 67237 65404 59504 67978 74504 70758 56069 54375 58263 57415 57956 53448 66599 72967
11748 72967 70225 57411 44647 38147 39275 43455 50099 53657 48844 46027 47291 51063 58847 64905
11734 64905 72682 64817 60703 53869 43469 37912 43536 46393 50693 50269 40043 39589 44526 33991
11720 33991 37817 39703 34922 49083 48702 38000 41836 52293 55191 50395 39708 28723 25820
11707 25820 31540 32733 20145 23231 20738 173 6099 27178 36179 49362 49070 54717 41676
$$ packed form
11804G9743k790k5463K510j2204N120J3613J1996l450k022p915L284r958j4303
11791C8161k833J3608J1111n099J38k641O259J398L587k84q997J4518P380k0643
11777E5663j074J0559P511q85n583l552K801L606L978k27L553o641j670M101m16
11762G1724m487j833n900Q474O526l746j4689j694L888q48N41m508J3151O368
11748G2967k742j2814j2764o500J128M180O644L558m813k817J264L772P784O058
11734F4905P777p865m114o834j0400n557N624K857M300m24j0226m54M937j0535
11720C3991L826J886m781J4161l81j0702L836J0457K898m796j0687j0985k903
11707B5820N720J193j2588L086k493k0565N926K1079R001J3183k92N647j3041
$$ plain form
11694 41676 34822 27056 24143 37014 42838 38061 47201 55712 48917 44070 39523 34577 30865 44181
11680 44181 42338 34668 21055 15775 21841 29828 29480 37544 41923 40220 35854 20153 15819 16001
11666 16001 24996 35690 33655 41302 45242 37658 33294 40155 45822 41510 27140 30042 45627 57135
11652 57135 52021 44866 34970 37242 50099 43644 46366 53486 48431 31127 27718 36803 39373 25758
11638 25758 22747 19494 15868 16880 27552 44817 52595 50655 44880 45764 45579 36240 25323 29997
11624 29997 33523 32276 30724 35317 38465 31996 37843 45561 48579 38460 43026 52858 51818 50308
11610 50308 35090 20084 27979 34614 42229 42162 44812 42047 38096 38793 38627 40694 42645 47161 49725
11595 49725 46893 44359 47673 46430 57987 65296 52170 46869 39563 48980 53995 65894 54324
$$ packed form
11694D1676o854p766k913J2871N824m777R140Q511o795m847m547m946l712J3316
11680D4181j843p670j3613n280O066P987l48Q064M379j703m366j5701m334J82
11666A6001Q995J0694k035P647L940p584m364O861N667m312j4370K902J5585J1508
11652E7135n114p155r896K272J2857o455K722P120n055j7304l409R085K570j3615
11638B5758l011l253l626J012J0672J7265P778j940n775Q84j85r339j0917M674
11624B9997L526j247j552M593L148o469N847P718L018j0119M566R832j040j510
11610E0308j5218j5006P895O635P615o7K650k765l951O97j66K067J951M516K564
11595D9725k832k534L314j243J1557P309j3126n301p306R417N015J1899j1570
$$ plain form
11582 54324 38580 35102 39010 48104 49230 43730 53598 61013 81643 99624 77164 75101 77692
11569 77692 76756 74760 77543 82549 76317 73068 67438 67205 53349 46567 67459 89127 84101 93370
11555 93370 86901 88402 83290 83972 87872 90500 92463 95671 108381 122699 125601 122483 126648 143080
11541 143080 145650 136431 139851 165333 182920 196677 218580 227082 237802 264922 304823 343410
11529 343410 382950 431616 483964 541881 618600 694630 764979 835758 886157 916580 915677 887925
11517 887925 846247 804426 753127 694099 646897 611754 570140 538259 516588 498359 491775 502525
11505 502525 505992 503032 499044 502110 519072 526590 535091 552304 583681 613818 661190 720006 787500
11492 787500 868545 950751 1054038 1157019 1271551 1413594 1570554 1725894 1837653 1895199
$$ packed form
11582E4324j5744l478L908R094J126n500R868P415K0630J7981k2460k063K591
11569G7692r36j996K783N006o232l249n630k33j3856o782K0892K1668n026R269
11555I3370o469J501n112O82L900K628J963L208J2710J4318K902l118M165J6432
11541A43080K570r219L420K5482J7587J3757K1903Q502J0720K7120L9901L8587
11529C43410L9540M8666N2348N7917P6719P6030P0349P0779N0399L0423r03k7752
11517H87925m1678m1821n1299n9028m7202l5143m1614l1881k1671j8229o584J0750
11505E02525L467k960l988L066J6962P518Q501J7213L1377L0137M7372N8816O7494
11492G87500Q1045Q2206J03287J02981J14532J42043J56960J55340J11759N7546
$$ plain form
11482 1895199 1886639 1814906 1691912 1564836 1440955 1320718 1213918 1124525 1036490 978630
11472 978630 928837 876161 822926 775825 745801 712699 696258 668079 651542 656984 648808 642905
11460 642905 647289 665520 676941 695150 704605 732461 771565 812777 857052 905882 976925 1047289
11448 1047289 1101757 1151572 1179676 1151439 1093748 1035469 981793 926608 852966 787242 733920
11437 733920 673447 617958 578348 550833 513275 490799 474353 459856 435976 414954 400105
11426 400105 384445 375017 353967 330174 320962 309660 300960 299434 290234 266917 273884 279332 271256
11413 271256 250357 233119 226723 231512 232329 223366 213124 202940 209630 194278 182993 173165 172275
11400 172275 169906 163660 161700 135938 123472 128758 136782 125614 108805 103875 94572 95392 92919
$$ packed form
11482A895199q560p1733j22994j27076j23881j20237j06800q9393q8035n7860
11472I78630m9793n2676n3235m7101l0024l3102j6441k8179j6537N442q176n903
11460F42905M384J8231J1421J8209R455K7856L9104M1212M4275M8830P1043P0364
11448A047289N4468M9815K8104k8237n7691n8279n3676n5185p3642o5724n3322
11437G33920o0473n5489l9610k7515l7558k2476j6446j4497k3880k1022j4849
11426D00105j5660r428k1050k3793r212j1302q700j526r200k3317O967N448q076
11413B71256k0899j7238o396M789Q17q963j0242j0184O690j5352j1285r828q90
11400A72275k369o246j960k5762j2466N286Q024j1168j6809m930r303Q20k473
$$ plain form
11387 92919 83959 67295 60988 64282 65972 71508 65682 70567 78521 79712 69497 57203 42640
11374 42640 35442 34001 32245 26467 24433 24046 41531 40326 44883 59880 55990 38832 26705 27094
11360 27094 41587 48673 41529 31249 21874 17154 9338 3258 14509 27639 47824 74559 83039
11347 83039 84993 83063 79895 66029 58538 54558 46547 32068 21539 10208 18537 28700 33419
11334 33419 17983 23063 30633 23461 32045 31938 22558 19974 6852 21 6658 14447 24005 37213
11320 37213 33943 33601 34428 21437 24794 35144 37978 45132 46295 44056 52023 64606 63848 48843
11306 48843 37718 30885 30446 21672 16398 23097 19044 13671 14584 1374 -3302 -1654 779 3368
11292 3368 8915 19479 25215 23488 18889 10956 5470 -8912 -6703 3652 18843 31572 46235
$$ packed form
11387I2919q960j6664o307L294J690N536n826M885P954J191j0215j2294j4563
11374D2640p198j441j756n778k034l87J7485j205M557J4997l890j7158j2127L89
11360B7094J4493P086p144j0280r375m720p816o080J1251J3130K0185K6735Q480
11347H3039J954j930l168j3866p491l980q011j4479j0529j1331Q329J0163M719
11334C3419j5436N080P570p172Q584j07r380k584j3122o831O637P789R558J3208
11320C7213l270l42Q27j2991L357J0350K834P154J163k239P967J2583p58j5005
11306D8843j1125o833m39q774n274O699m053n373R13j3210m676J648K433K589
11292C368N547J0564N736j727m599p933n486j4382K209J0355J5191J2729J4663
$$ plain form
11279 46235 49349 50998 31360 8223 -6442 5702 30664 29090 18221 15211 14767 17889 12484
11266 12484 17941 17021 21912 23563 5306 535 -3834 -12551 -23252 -19955 -8180 3613 5477 4787
11252 4787 7866 203 2366 6540 46 -2908 -2889 3588 4759 4223 5665 14089 6846 1322 -2045
11237 -2045 -9145 3243 19130 14789 10420 5603 -2704 -10472 -12180 633 7351 15140 6902 -13576
11223 -13576 -14154 -11975 2729 -5184 -5289 1607 19848 15272 -2822 608 -807 -9437 -4582 2597
11209 2597 -6901 -19437 -9208 8997 3876 2639 -3384 -5431 -7518 -15675 -6071 8910 22185
11196 22185 30096 30690 31688 38841 25906 22230 13302 2851 597 7846 9750 19731 14106 7618
11182 7618 11016 13102 8971 8304 -1826 -3699 -1303 2685 1367 376 4917 2816 -4610 3078 6047
$$ packed form
11279D6235L114J649j9638k3137j4665J2144K4962j574j0869l010m44L122n405
11266A2484N457r20M891J651j8257m771m369q717j0701L297J1775J1793J864o90
11252D787L079p663K163M174o494k954J9O477J171n36J442Q424p243n524l367
11237b045p100J2388J5887m341m369m817q307p768j708J2813O718P789q238k0478
11223a3576n78K179J4704p913j05O896J8241m576j8094L430j415q630M855P179
11209B597r498j2536J0229J8205n121j237o023k047k087q157R604J4981J3275
11196B2185P911N94R98P153j2935l676q928j0451k254P249J904R981n625o488
11182G618L398K086m131o67j0130j873K396L988j318r91M541k101p426P688K969
$$ plain form
11167 6047 8297 11467 12924 14075 6844 7744 10007 6237 -2345 2324 -5632 -3968 -11662 -6614 5469
11152 5469 13142 14099 6117 13738 10982 9003 4083 4645 4928 13554 21717 25259 -2509 -8712 -11626
11137 -11626 -2147 7184 7082 11411 144 -12049 -9815 8498 14765 18562 18686 14862 12586 9899
11123 9899 3546 2737 5206 4022 18387 31775 25892 9252 5364 1016 7386 14526 22237 21909
11109 21909 17905 12555 765 -2772 -3323 -7237 -13557 -17836 -13412 -5398 16424 19000 27253 19178
11095 19178 15531 3535 -13268 -18145 -5435 975 5872 6330 -8213 -8173 5228 9113 6263 1541
11081 1541 3165 6121 -5422 -15065 -6481 -6621 -8953 3708 955 -3883 -11818 -3919 1054 2628
11067 2628 12220 14162 15133 7869 8086 2 -5714 1300 17521 21411 14234 33 852 11305 17748
$$ packed form
11167F047K250L170J457J151p231R00K263l770q582M669p956J664p694N048J2083
11152E469P673R57p982P621k756j979m920N62K83Q626Q163L542k7768o203k914
11137a1626R479R331j02M329j1267j2193K234J8313O267L797J24l824k276k687
11123I899o353q09K469j184J4365J3388n883j6640l888m348O370P140P711l28
11109B1909m004n350j1790l537n51l914o320m279M424Q014K1822K576Q253q075
11095A9178l647j1996j6803m877J2710O410M897M58j4543M0J3401L885k850m722
11081A541J624K956j1543r643Q584j40k332J2661k753m838p935P899M973J574
11067B628R592J942R71p264K17q084n716P014J6221L890p177j4201Q19J0453O443
$$ plain form
11052 17748 22801 19444 15639 12168 18917 16180 5029 3231 12409 32662 45419 39995 18768
11039 18768 8256 12455 5172 -4840 -4032 7119 10055 19132 17262 1950 12445 14601 7777
11026 7777 15674 14511 -2618 -4856 2373 31 4176 6346 20484 23392 22811 8001 -2773 2692
11012 2692 7395 -2441 -24958 -49295 -40692 -28063 -27608 -33533 -36056 -40347 -40413 -35116 -30421 -13962
10998 -13962 -4925 -1651 -4926 -2486 -5001 -7834 -8742 2145 5792 2367 2664 2684 -585 4481 7291
10983 7291 1015 -3326 -11821 -21241 -19575 -11624 -10718 4446 6062 5903 16190 1423 -31 4465
10969 4465 764 5037 3065 9875 12394 13903 15559 11854 10982 15075 1570 -13029 -10584 -11502 -10442
10954 -10442 -1527 -1530 2477 -8769 -9731 -9502 -7945 2316 -1955 -16208 -28897 -30695 -14814 -15528 -8358
$$ packed form
11052A7748N053l357l805l471O749k737j1151j798R178K0253J2757n424k1227
11039A8768j0512M199p283j0012Q08J1151K936R077j870j5312J0495K156o824
11026G777P897j163j7129k238P229k342M145K170J4138K908n81j4810j0774N465
11012B692M703r836k2517k4337Q603J2629M55n925k523m291o6N297M695J6459
10998a3962R037L274l275K440k515k833r08J0887L647l425K97K0l269N066K810
10983G291o276m341q495r420J666P951R06J5164J616j59J0287j4767j454M496
10969D465l701M273j972O810K519J509J656l705q72M093j3505j4599K445r18J060
10954a0442Q915lM007j1246r62K29J557J0261m271j4253j2689j798J5881p14P170
$$ plain form
10939 -8358 1175 1679 1228 -1291 -8824 -7234 -5330 10809 -2292 -17202 -13394 -13423 -9194 -20226 -12504
10924 -12504 -10852 -14363 -21694 -16590 -17575 -8760 -1122 1336 6320 198 -14404 -9730 -4110 -2105
10910 -2105 893 3906 10500 7311 -3927 -18070 -14783 -8848 -14522 -12255 -11236 88 7199 9672
10896 9672 5128 -2614 5608 12275 -685 -4605 521 -552 -15933 -18123 -13419 1083 2802 4003
10882 4003 -10007 -37094 -41669 -36730 -40308 -33761 -22292 -17790 -24403 -16373 -6299 6699 2941
10869 2941 -3549 5409 -2581 -8094 -5044 -8953 -13339 -21966 -3114 3266 -4465 -17353 -24780 -17006
10855 -17006 -13158 -9992 -6596 -2086 7418 11318 7896 -172 -4768 2793 -2461 -9814 -9491 -15252 -19815
10840 -19815 -18837 -10680 -7793 -8788 -19078 -13835 -6663 -7706 2174 -3307 -13879 -9955 -15581 -31146
$$ packed form
10939h358R533N04m51k519p533J590J904J6139j3101j4910L808k9M229j1032P722
10924a2504J652l511p331N104r85Q815P638K458M984o122j4602M674N620K005
10910b105K998L013O594l189j1238j4143L287N935n674K267J019J1324P111K473
10896I672m544p742Q222O667j2960l920N126j073j5381k190M704J4502J719J201
10882D003j4010k7087m575M939l578O547J1469M502o613Q030J0074J2998l758
10869B941o490Q958p990n513L050l909m386q627J8852O380p731j2888p427P774
10855a7006L848L166L396M510R504L900l422q068m596P561n254p353L23n761m563
10840a9815R78Q157K887r95j0290N243P172j043R880n481j0572L924n626j5565
$$ plain form
10826 -31146 -28297 -23347 -18509 -9667 -2517 -8553 -23815 -21938 -4790 -12962 -20498 -26539 -19720 -18327
10812 -18327 -9347 -4994 605 -6582 -16315 -12343 -10792 -2497 -11980 -18254 -4683 -6444 -11396 -16800
10798 -16800 -20922 -25913 -26026 -24619 -8532 -2817 1968 -7111 -16623 -9111 -14133 -25049 -34332 -28455
10784 -28455 -30600 -29934 -25696 -21122 -7894 -2058 9549 5938 4424 9172 2180 -10137 -5603 -7699
10770 -7699 -22875 -22644 -8550 -5299 -3433 -2108 5324 20191 20314 846 1088 -1441 -3904 -927
10756 -927 11226 12203 7842 12016 12609 4962 6489 21911 23176 15962 4796 -11725 -4625 2687
10742 2687 12668 -1780 -10422 946 4107 8982 19584 29091 20984 1722 -13481 -19078 -26901
10729 -26901 -33411 -35074 -34227 -37075 -41905 -40689 -20512 -13139 -24688 -29384 -13690 -15483 -16457 -18023
$$ packed form
10826c1146K849M950M838Q842P150o036j5262J877J7148q172p536o041O819J393
10812a8327Q980M353N599p187r733L972J551Q295r483o274J3571j761m952n404
10798a6800m122m991j13J407J6087N715M785r079r512P512n022j0916r283N877
10784b8455k145O66M238M574J3228N836J1607l611j514M748o992j2317M534k096
10770g699j5176K31J4094L251J866J325P432J4867J23j9468K42k529k463K977
10756i27J2153R77m361M174N93p647J527J5422J265p214j1166j6521P100P312
10742B687R981j4448q642J1368L161M875J0602R507q107j9262j5203n597p823
10729b6901o510j663Q47k848m830J216K0177P373j1549m696J5694j793r74j566
$$ plain form
10715 -18023 -17309 -13468 -8037 -216 -110 -2586 -3899 -11543 -22092 -11913 -13423 -27459 -21451 -1055
10701 -1055 -2194 -3885 -2023 5409 -7146 -9656 -7727 -10927 -7691 -8535 -4925 9439 9409 -6250 -17123
10686 -17123 -9383 6809 11676 5710 10684 918 -5013 -1675 3798 -10528 -18969 2664 -3314 4377
10672 4377 -307 2637 13584 -4356 -13243 -7349 -9681 5401 13775 6504 -11570 -15579 -11582 -23673
10658 -23673 -32582 -20326 -4765 9077 11029 10659 10027 8775 14658 13789 11513 17828 8509 3750
10644 3750 9786 -843 -6218 12214 17469 11835 25332 24301 21600 23240 31146 39285 35507 16067
10630 16067 14794 11081 3265 -3377 -251 9484 7699 16779 19930 14852 17925 20734 23891 30357
10616 30357 41173 27756 19789 28669 48914 57436 54889 48926 33856 17759 14811 28977 50143
$$ packed form
10715a8023P14L841N431P821J06k476j313p644j0549J0179j510j4036O008K0396
10701a055j139j691J862P432j2555k510J929l200L236q44L610J4364l0j5659j0873
10686a7123P740J6192M867n966M974r766n931L338N473j4326q441K1633n978P691
10672D377m684K944J0947j7940q887N894k332J5082Q374p271j8074m009L997j2091
10658b3673q909J2256J5561J3842J952l70o32j252N883q69k276O315r319m759
10644C750O036j0629n375J8432N255n634J3497j031k701J640P906Q139l778j9440
10630A6067j273l713p816o642L126R735j785R080L151n078L073K809L157O466
10616C0357J0816j3417p967Q880K0245Q522k547n963j5070j6097k948J4166K1166
$$ plain form
10603 50143 40217 40901 38557 33038 50495 52893 34058 37095 41351 41906 51430 56271 62545 61644 56374
10588 56374 60922 67237 66909 77701 85774 80707 84034 81259 82833 79947 69253 79572 94079 104146
10574 104146 115215 128494 129906 137583 148396 157076 150798 152298 160022 165635 182385 191955 199392
10561 199392 215710 215625 210815 221274 237724 253285 274285 291041 298757 302483 309690 314981 316759
10548 316759 348161 366225 389757 409950 432841 457158 492726 515103 549313 588366 636313
10537 636313 674341 720037 773534 839221 911576 987981 1075776 1194071 1328960 1468751 1617225
10526 1617225 1774900 1975360 2207891 2471146 2771903 3094544 3460247 3872161 4325920
10517 4325920 4844279 5381837 5895736 6370474 6790765 7109029 7273030 7247421 7045900 6710575
$$ packed form
10603E0143r926O84k344n519J7457K398j8835L037M256N55R524M841O274r01n270
10588E6374M548O315l28J0792Q073n067L327k775J574k886j0694J0319J4507J0067
10574A04146J1069J3279J412P677J0813Q680o278J500P724N613J6750R570P437
10561A99392J6318q5m810J0459J6450J5561K1000J6756P716L726P207N291J778
10548C16759L1402J8064K3532K0193K2891K4317L5568K2377L4210L9053M7947
10537F36313L8028M5696N3497O5687P2355P6405Q7795J18295J34889J39791J48474
10526A617225J57675K00460K32531K63255L00757L22641L65703M11914M53759
10517D325920N18359N37558N13899M74738M20291L18264J64001k5609k01521l35325
$$ plain form
10507 6710575 6308522 5895045 5488389 5081807 4704915 4364017 4055967 3800164 3564540
10498 3564540 3349186 3175229 3021768 2859344 2717814 2602327 2494734 2415443 2333210 2253756
10488 2253756 2195906 2139901 2074876 2023908 1972466 1931899 1887163 1861563 1849026 1820613 1772739
10477 1772739 1735276 1684964 1624037 1586199 1532575 1485415 1439838 1393940 1347872 1294657 1227420
10466 1227420 1173631 1125159 1061756 1010165 973583 935170 893342 860368 832517 790929 746742
10455 746742 717803 671678 630356 613484 590690 559275 534698 520470 506003 481241 462167
10444 462167 459400 440717 418117 403294 403937 396966 388207 373291 356517 338129 325686 334833 352488
10431 352488 357236 366491 385097 408626 404438 420683 456253 509927 544753 604038 677419 777394
$$ packed form
10507F710575m02053m13477m06656m06582l76892l40898l08050k55803k35624
10498C564540k15354j73957j53461j62424j41530j15487j07593p9291q2233p9454
10488B253756n7850n6005o5025n0968n1442m0567m4736k5600j2537k8413m7874
10477A772739l7463n0312o0927l7838n3624m7160m5577m5898m6068n3215o7237
10466A227420n3789m8472o3403n1591l6582l8413m1828l2974k7851m1588m4187
10455G46742k8939m6125m1322j6872k2794l1415k4577j4228j4467k4762j9074
10444D62167k767j8683k2600j4823O43o971q759j4916j6774j8388j2443R147J7655
10431C52488M748R255J8606K3529m188J6245L5570N3674L4826N9285P3381R9975
$$ plain form
10419 777394 908492 1062806 1238048 1468679 1746804 2038703 2263927 2405367 2443221 2371675
10409 2371675 2197603 1962118 1700556 1456964 1262940 1102594 979998 893681 826683 776927
10399 776927 727927 682776 643293 615838 597776 570222 536127 517282 506720 498502 476421 462815
10387 462815 470296 464133 465101 477194 478530 468719 453787 443179 439931 426021 410306 397487 392258
10374 392258 380098 372755 367121 358220 349733 330177 303415 285063 261178 236289 213431 208440
10362 208440 220431 225285 222450 204418 175260 170116 164310 166514 165039 154821 153132 139627 118987
10349 118987 116431 112045 107045 88631 77492 72681 73957 84264 77215 62234 52704 53742 65698
10336 65698 64003 50150 44404 49588 40896 24297 19328 14848 821 -3302 -5459 -11658 -11451 -9595
$$ packed form
10419G77394J31098J54314J75242K30631K78125K91899K25224J41440L7854p1546
10409B371675j74072k35485k61562k43592j94024j60346j22596q6317o6998m9756
10399G76927m9000m5151l9483k7455j8062k7554l4095j8845j0562q218k2081j3606
10387D62815P481o163R68J2093J336r811j4932j0608l248j3910j5715j2819n229
10374C92258j2160p343n634q901q487j9556k6762j8352k3885k4889k2858m991
10362B08440J1991M854k835j8032k9158n144n806K204j475j0218j689j3505k0640
10349A18987k556m386n000j8414j1139m811J276J0307p049j4981r530J038J1956
10336F5698j695j3853n746N184q692j6599m969m480j4027m123k157o199K07J856
$$ plain form
10322 -9595 -2851 16401 21332 19789 26072 36851 30577 23782 32139 47009 52917 59035 52635 63403
10308 63403 74323 86076 94591 100817 96283 92283 87584 78417 67466 72755 74777 78404 69498 70956
10294 70956 81598 72172 66229 63661 56222 46552 40961 52794 48115 54831 59026 60440 63529 73864
10280 73864 89412 89766 91497 119090 158595 198149 257624 318226 371887 414345 454692 496625
10268 496625 533268 572380 607831 636425 655203 653014 643801 629245 616177 597287 560072 527050
10256 527050 498094 467152 437950 404419 375383 351102 327057 300450 282105 266480 238086
10245 238086 201025 188375 174962 157498 141479 132940 125663 129706 127988 124307 121238 116208 119258
10232 119258 116866 124360 133551 131781 137669 136284 122283 98666 108050 113419 106636 93515 96463
$$ packed form
10322i595O744J9252M931j543O283J0779o274o795Q357J4870N908O118o400J0768
10308F3403J0920J1753Q515O226m534m000m699r167j0951N289K022L627q906J458
10294G0956J0642r426n943k568p439r670n591J1833m679O716M195J414L089J0335
10280G3864J5548L54J731K7593L9505L9554N9475O0602N3661M2458M0347M1933
10268D96625L6643L9112L5451K8594J8778k189r213j4556j3068j8890l7215l3022
10256E27050k8956l0942k9202l3531k9036k4281k4045k6607j8345j5625k8394
10245B38086l7061j2650j3413j7464j6019q539p277M043j718l681l069n030L050
10232A19258k392P494R191j770N888j385j4001k3617R384N369o783j3121K948
$$ plain form
10219 96463 101166 101765 114347 123256 134012 129213 101982 96057 105786 95688 91745 98888 71422
10206 71422 51542 34770 20081 18143 40813 73262 88172 94073 101910 107061 110109 102286 104717
10193 104717 107663 99392 98177 113279 134865 147543 167240 172184 189377 210230 226373 246041
10181 246041 265272 274892 282830 282186 292541 303933 300898 289174 268698 256642 260639 272653 279764
10168 279764 272645 253233 231978 209509 198883 195302 200039 203276 207619 215966 242213 257515 281137
10155 281137 299727 310149 342278 379185 410329 447733 469998 487653 508059 540352 577636
10144 577636 611977 646428 686869 735850 775278 811602 825144 847422 865870 878210 880814 878121
10132 878121 876863 897966 940601 1005366 1080747 1171737 1268852 1395271 1507633 1630657 1763073
$$ packed form
10219I6463M703N99J2582Q909J0756m799k7231n925R729j0098l943P143k7466
10206G1422j9880j6772j4689j938K2670L2449J4910N901P837N151L048p823K431
10193A04717K946q271j215J5102K1586J2678J9697M944J7193K0853J6143J9668
10181B46041J9231R620P938o44J0355J1392l035j1724k0476j2056L997J2014P111
10168B79764p119j9412k1255k2469j0626l581M737L237M343Q347K6247J5302K3622
10155B81137J8590J0422L2129L6907L1144L7404K2265J7655K0406L2293L7284
10144E77636L4341L4451M0441M8981L9428L6324J3542K2278J8448J2340K604k693
10132H78121j258K1103M2635O4765P5381R0990R7115J26419J12362J23024J32416
$$ plain form
10121 1763073 1900486 2071828 2275586 2527711 2824219 3185688 3658217 4274596 5066735
10112 5066735 6118543 7485746 9164841 10961265 12511056 13484208 13936238 14136157 14181211
10103 14181211 13819683 12851044 11416337 9917754 8663936 7723687 7060515 6590538 6227686
10094 6227686 5930417 5697042 5539660 5421585 5316281 5231090 5170733 5121475 5083380 5056141
10084 5056141 5062539 5085288 5103006 5140015 5172549 5214150 5291197 5360866 5413883 5466576 5506796
10073 5506796 5563043 5595025 5627476 5663041 5706724 5745662 5803791 5899795 6020486 6162157 6358596
10062 6358596 6625262 6983125 7427922 7949434 8494738 8983916 9351245 9553272 9558569 9419293
10052 9419293 9177222 8910315 8666323 8507672 8441715 8466808 8575779 8776104 9047937 9403304
$$ packed form
10121A763073J37413J71342K03758K52125K96508L61469M72529O16379P92139
10112E066735J051808J367203J679095J796424J549791R73152M52030J99919M5054
10103A4181211l61528r68639j434707j498583j253818r40249o63172m69977l62852
10094F227686k97269k33375j57382j18075j05304q5191o0357m9258l8095k7239
10084E056141O398K2749J7718L7009L2534M1601P7047O9669N3017N2693M0220
10073E506796N6247L1982L2451L5565M3683L8938N8129R6004J20691J41671J96439
10062F358596K66666L57863M44797N21512N45304M89178L67329K02027N297j39276
10052I419293k42071k66907k43992j58651o5957K5093J08971K00325K71833L55367
$$ plain form
10042 9403304 9858825 10398023 11046391 11803859 12684636 13701171 14895668 16282304 17831013
10033 17831013 19540309 21427268 23555304 26018089 28950702 32537120 36973453 42529192
10025 42529192 49427259 57982148 68544288 81567459 97732017 118060618 143950264
10018 143950264 177065466 218518090 267501676 319892178 368341594 405203744 424716467
10011 424716467 423897861 403611983 367980436 323348808 277385492 236177461 202641106
10004 202641106 176710994 156904781 141589733 129468886 119643181 111499563 104648469
9997 104648469 98849814 93957566 89835572 86351803 83383954 80833367 78567246 76533384
9989 76533384 74693415 73026737 71573113 70383604 69497217 68854855 68372277 67939884 67379007
$$ packed form
10042I403304M55521N39198O48368P57468Q80777J016535J194497J386636J548709
10033A7831013J709296J886959K128036K462785K932613L586418M436333N555739
10025D2529192O898067Q554889J0562140J3023171J6164558K0328601K5889646
10018A43950264L3115202M1452624M8983586N2390502M8449416L6862150J9512723
10011D24716467q18606k0285878l5631547m4631628m5963316m1208031l3536355
10004B02641106k5930112j9806213j5315048j2120847r825705q143618o851094
9997A04648469n798655m892248m121994l483769k967849k550587k266121k033862
9989G6533384j839969j666678j453624j189509q86387o42362m82578m32393n60877
$$ plain form
9980 67379007 66593743 65548310 64267080 62755564 61046901 59215089 57283703 55263471
9972 55263471 53128331 50869533 48529993 46154877 43813862 41549031 39367452 37318425
9964 37318425 35385480 33566832 31834951 30193485 28637457 27181990 25797880 24486743
9956 24486743 23247384 22075391 20976244 19925742 18947960 18032657 17164551 16350140 15571804
9947 15571804 14839758 14148021 13499227 12896762 12328437 11801661 11287826 10788977 10313264
9938 10313264 9860996 9422324 9007240 8621932 8242509 7880597 7546908 7243112 6957396
9929 6957396 6683238 6408284 6146243 5903913 5659525 5433185 5202164 4974427 4765639 4575083
9919 4575083 4386553 4210526 4049460 3904057 3758510 3619115 3497071 3371875 3242138 3103172
$$ packed form
9980F7379007p85264j045433j281230j511516j708663j831812j931386k020232
9972E5263471k135140k258798k339540k375116k341015k264831k181579k049027
9964C7318425j932945j818648j731881j641466j556028j455467j384110j311137
9956B4486743j239359j171993j099147j050502r77782r15303q68106q14411p78336
9947A5571804p32046o91737o48794o02465n68325n26776n13835m98849m75713
9938A0313264m52268m38672m15084l85308l79423l61912l33689l03796k85716
9929F957396k74158k74954k62041k42330k44388k26340k31021k27737k08788j90556
9919D575083j88530j76027j61066j45403j45547j39395j22044j25196j29737j38966
$$ plain form
9909 3103172 2992334 2897378 2793454 2692312 2585162 2504332 2443633 2395293 2366136 2322002 2277882
9898 2277882 2230700 2208846 2195670 2179301 2175354 2181967 2173637 2174519 2188067 2173241 2129729 2073131
9886 2073131 2013292 1921497 1822466 1741614 1679575 1606585 1534403 1485686 1439176 1401213 1366699
9875 1366699 1330805 1300340 1272805 1267852 1253999 1272454 1314976 1365910 1431268 1488379 1556500 1658584
9863 1658584 1773552 1910403 2093026 2323868 2632194 3043764 3610639 4333816 5136448 5737156
9853 5737156 5813264 5362314 4683673 4064721 3609417 3304982 3119638 2978388 2852218 2770375
9843 2770375 2746918 2755146 2779312 2817692 2867739 2896970 2903326 2863075 2787587 2728775 2691557 2654977
9831 2654977 2616835 2564941 2517516 2491819 2464333 2427263 2400737 2385928 2381848 2370665 2346672 2322697
$$ packed form
9909C103172j10838r4956j03924j01142j07150q0830o0699m8340k9157m4134m4120
9898B277882m7182k1854j3176j6369l947O613q330Q82J3548j4826m3512n6598
9886B073131n9839r1795r9031q0852o2039p2990p2182m8717m6510l7963l4514
9875A366699l5894l0465k7535m953j3853J8455M2522N0934O5358N7111O8121J02084
9863A658584J14968J36851J82623K30842L08326M11570N66875P23177Q02632O00708
9853E737156P6108m50950o78641o18952m55304l04435j85344j41250j26170q1843
9843B770375k3457Q228K4166L8380N0047K9231O356m0251p5488n8812l7218l6580
9831B654977l8142n1894m7425k5697k7486l7070k6526j4809m080j1183k3993k3975
$$ plain form
9819 2322697 2291235 2256705 2215775 2163569 2119603 2070311 2007932 1967197 1933737 1905217 1870950
9808 1870950 1831400 1784978 1745753 1708341 1666716 1628050 1605313 1567273 1526362 1501202 1465320
9797 1465320 1408712 1373639 1344075 1323362 1303191 1291432 1274062 1247356 1221126 1205080 1178445
9786 1178445 1153842 1137659 1117657 1105938 1088913 1062049 1043716 1014052 997458 975607 950730
9775 950730 914005 884961 884014 882732 876265 865466 870512 878056 886705 884209 881173 888549 889379 876722
9761 876722 850271 816370 804861 795221 767945 743550 717665 691950 661123 641578 625794 606897
9749 606897 591325 580547 566444 547893 543364 532294 513795 502729 494717 492439 483662 471545
9737 471545 457504 446326 434474 425170 432086 424935 408568 394043 395613 391618 392079 393371 420609
$$ packed form
9819B322697l1462l4530m0930n2206m3966m9292o2379m0735l3460k8520l4267
9808A870950l9550m6422l9225l7412m1625l8666k2737l8040m0911k5160l5882
9797A465320n6608l5073k9564k0713k0171j1759j7370k6706k6230j6046k6635
9786A178445k4603j6183k0002j1719j7025k6864j8333k9664j6594k1851k4877
9775I50730l6725k9044r47j282o467j0799N046P544Q649k496l036P376Q30j2657
9761H76722k6451l3901j1509r640k7276k4395k5885k5715l0827j9545j5784j8897
9749F06897j5572j0778j4103j8551m529j1070j8499j1066q012k278q777j2117
9737D71545j4041j1178j1852r304O916p151j6367j4525J570l995M61J292K7238
$$ plain form
9724 420609 439801 440808 427487 421168 411980 404577 409671 418037 427237 424390 422346 438718 447355 460055
9710 460055 479245 484291 492485 507926 532096 550726 563378 566819 574209 596828 626074 642001
9698 642001 642642 661858 662785 648610 633770 633912 612754 589210 606791 614706 592826 585831 600736
9685 600736 595890 571109 569035 571109 574681 569282 546620 546355 562418 549866 539888 547283 539375 547006
9671 547006 540876 529046 538854 542350 544268 530172 515465 517170 526895 523253 524142 523245 513077 498731
9657 498731 504941 509112 497037 486690 483727 483735 478965 464364 454415 439804 433664 425891 431710 440285
9643 440285 436176 422924 423359 404763 398224 408566 431806 437077 435214 429097 417389 420863 427116
9630 427116 421735 420285 421114 430060 429474 433308 438852 452139 465618 495750 537854 582424 639558
$$ packed form
9724D20609J9192J007j3321o319r188p403N094Q366R200k847k044J6372Q637J2700
9710D60055J9190N046Q194J5441K4170J8630J2652L441P390K2619K9246J5927
9698F42001O41J9216R27j4175j4840J42k1158k3544J7581P915k1880o995J4905
9685F00736m846k4781k074K074L572n399k2662k65J6063j2552r978P395p908P631
9671E47006o130j1830R808L496J918j4096j4707J705R725l642Q89q97j0168j4346
9657D98731O210M171j2075j0347k963Qm770j4601r949j4611o140p773N819Q575
9643D40285m109j3252M35j8596o539J0342K3240N271j863o117j1708L474O253
9630D27116n381j450Q29Q946n86L834N544J3287J3479L0132M2104M4570N7134
$$ plain form
9617 639558 711157 792289 882668 994870 1150962 1359935 1613904 1888037 2156909 2386081
9607 2386081 2533733 2559668 2467227 2307277 2074618 1820136 1588013 1388124 1228793 1118716
9597 1118716 1029849 961237 905925 857052 816627 790265 780694 764640 738832 717471 697810 682255
9585 682255 661271 667826 674002 661978 648790 643200 634108 629922 639884 643039 624037 610254 615675
9572 615675 626481 623570 620774 612112 602889 583351 570935 566071 545903 527026 516455 502381 485841
9559 485841 474839 454209 435861 438131 431060 410160 401286 395331 398593 393876 371380 375855 384806
9546 384806 393845 403944 399071 371720 357285 357341 347768 348193 346489 339119 330779 324233 323145 329750
9532 329750 333336 314675 303297 296408 290604 279621 269891 270887 282740 302602 291367 270849 270547
$$ packed form
9617F39558P1599Q1132R0379J12202J56092K08973K53969K74133K68872K29172
9607B386081J47652K5935r2441j59950k32659k54482k32123j99889j59331j10077
9597A118716q8867o8612n5312m8873m0425k6362r571j6054k5808k1361j9661j5555
9585F82255k0984O555O176j2024j3188n590r092m186R962L155j9002j3783N421
9572F15675J0806k911k796q662r223j9538j2416m864k0168j8877j0571j4074j6540
9559D85841j1002k0630j8348K270p071k0900q874n955L262m717k2496M475Q951
9546C84806R039J0099m873k7351j4435N6r573M25j704p370q340o546j088O605
9532C29750L586j8661j1378o889n804j0983r730R96J1853J9862j1235k0518l02
$$ plain form
9519 270547 273622 268506 256537 241971 237737 240724 236368 249780 251452 238770 236040 233830 230915
9506 230915 229385 227826 205815 203789 215773 217608 206116 198060 195019 190670 190250 180586 172816 173080
9492 173080 187417 197198 195820 184866 181584 186153 186052 179072 184687 182238 190333 195238 180463 177186
9478 177186 177276 173386 175609 163780 171800 170799 163349 167325 163002 166711 163381 168230 165140 158827 154864
9463 154864 163030 163657 168049 168459 159904 150713 144640 142327 141379 145861 155731 158891 159833 169627 168734 182031
9447 182031 182209 165429 167596 173991 188095 206711 214363 210515 218893 214646 204313 194763 201005 204400
9433 204400 204176 200658 195958 186678 186774 187398 183343 178243 187209 193266 191742 192478 186911 192586 205087
9418 205087 206095 213545 215254 202947 197666 198001 208510 203718 194117 191204 190236 185620 210488 229887
$$ packed form
9519B70547L075n116j1969j4566m234K987m356J3412J672j2682k730k210k915
9506B30915j530j559k2011k026J1984J835j1492q056l041m349m20r664p770K64
9492A73080J4337R781j378j0954l282M569j01o980N615k449Q095M905j4775l277
9478A77186R0l890K223j1829Q020j001p450L976m323L709l330M849l090o313l963
9463A54864Q166O27M392M10q555r191o073k313r48M482R870L160R42R794q93J3297
9447A82031J78j6780K167O395J4104J8616P652l848Q378m247j0333r550O242L395
9433B04400k24l518m700r280R6O24m055n100Q966O057j524P36n567N675J2501
9418B05087J008P450J709j2307n281L35J0509m792r601k913r68m616K4868J9399
$$ plain form
9404 229887 224139 209125 209465 206172 200550 187287 185568 177340 173667 174950 181497 177460 172311 172055
9390 172055 169663 163786 156631 154117 157290 156919 159598 141351 135052 126125 114158 105371 118140 138876
9376 138876 150369 149970 154806 150820 133067 128372 126545 128512 137242 147516 152216 134207 135857 136918
9362 136918 134608 131363 125210 127383 132971 135550 138161 132509 114937 117376 126715 138344 127687 125619
9348 125619 130941 129001 115822 115964 130735 131576 132107 136774 134582 125463 119915 120471 132480 135903 120465
9333 120465 107213 98400 111247 120705 114914 121537 132888 137491 130903 128292 115649 118670 134139
9320 134139 146247 152780 148762 136213 145975 148354 144579 154897 153745 149841 145178 141492 142094 136046
9306 136046 137668 143361 144509 150118 148408 142580 140036 137362 135439 127931 133086 130317 129714 130726 116013
$$ packed form
9404B29887n748j5014L40l293n622j3263j719q228l673J283O547m037n149k56
9390A72055k392n877p155k514L173l71K679j8247o299q927j1967q787J2769K0736
9376A38876J1493l99M836l986j7753m695j827J967Q730J0274M700j8009J650J061
9362A36918k310l245o153K173N588K579K611n652j7572K439R339J1629j0657k068
9348A25619N322j940j3179J42J4771Q41N31M667k192r119n548N56J2009L423j5438
9333A20465j3252q813J2847R458n791O623J1351M603o588k611j2643L021J5469
9320A34139J2108O533m018j2549R762K379l775J0318j152l904m663l686O02o048
9306A36046J622N693J148N609j710n828k544k674j923p508N155k769o03J012j4713
$$ plain form
9291 116013 118963 129165 146266 159635 154664 152150 156131 150598 149950 135675 134903 146427 145609 142379
9277 142379 147334 147743 139454 129747 129750 134082 141847 141710 148160 149996 152504 151986 147286 139865 132595 123675
9261 123675 127333 133900 141357 143268 149133 159856 162636 164934 179103 182083 177582 162141 162023 174210
9247 174210 168553 153233 137096 132176 123476 114495 118240 126871 111866 108497 129398 148891 149424
9234 149424 134951 125970 132950 144146 146629 152936 143852 139879 149620 169916 176200 152387 149047
9221 149047 162337 161322 162126 158921 154442 158920 171498 183958 168276 153161 160214 166619 165781 168975
9207 168975 173284 178691 180947 178815 174883 162729 163225 179633 195843 218012 230790 252081 263375
9194 263375 276011 300229 317590 356411 408572 460768 497496 532599 546587 550245 531892 488114
$$ packed form
9291A16013K950J0202J7101J3369m971k514L981n533o48j4275p72J1524q18l230
9277A42379M955M09q289r707LM332P765j37O450J836K508n18m700p421p270q920
9261A23675L658O567P457J911N865J0723K780K298J4169K980m501j5441j18J2187
9247A74210n657j5320j6137m920q700q981L745Q631j5005l369K0901J9493N33
9234A49424j4473q981O980J1196K483O307r084l973R741K0296O284k3813l340
9221A49047J3290j015Q04l205m479M478J2578J2460j5682j5115P053O405q38L194
9207A68975M309N407K256k132l932j2154M96J6408J6210K2169J2778K1291J1294
9194B63375J2636K4218J7361L8821N2161N2196L6728L5103J3988L658j8353m3778
$$ plain form
9182 488114 440618 427070 408960 394757 392273 401949 410583 443264 482445 516604 559707 599743
9170 599743 618530 625928 636638 650925 646229 641313 651905 650948 632398 627280 649460 674749 700495
9157 700495 722527 769756 823999 917789 1023861 1144425 1251642 1317164 1317310 1264351 1178058
9146 1178058 1069238 974222 905212 857846 819561 795417 779389 766889 765668 763647 766464 780866
9134 780866 791581 807632 816132 828434 821950 802880 777267 738512 691739 652243 627993 628820
9122 628820 615512 602927 621114 637191 655138 665408 709540 747775 748088 734540 717321 684576
9110 684576 645714 605852 555388 519539 494719 466310 439130 422645 391717 371874 377876 385305
9098 385305 383543 366283 352943 334619 319009 305313 291090 286445 274178 267151 267812 263034 251263
$$ packed form
9182D88114m7496j3548j8110j4203k484R676Q634L2681L9181L4159M3103M0036
9170E99743J8787P398J0710J4287m696m916J0592r57j8550n118K2180K5289K5746
9157G00495K2032M7229N4243R3790J06072J20564J07217O5522J46n2959q6293
9146A178058j08820r5016o9010m7366l8285k4144j6028j2500j221k021K817J4402
9134G80866J0715J6051Q500J2302o484j9070k5613l8755m6773l9496k4250Q27
9122F28820j3308j2585J8187J6077J7947J0270M4132L8235L13j3548j7219l2745
9110F84576l8862l9862n0464l5849k4820k8409k7180j6485l0928j9843O002P429
9098C85305j762j7260j3340j8324j5610j3696j4223m645j2267p027O61m778j1771
$$ plain form
9085 251263 259662 264569 258407 259054 253496 242368 249874 246106 233196 222554 204262 201543 213519
9072 213519 222585 218976 207033 184890 180161 166694 158023 157091 151357 150589 144572 146754 139875 131607
9058 131607 133193 144976 160699 158168 149314 141020 141348 148496 163738 164143 153487 147635 131567 127620
9044 127620 138343 152541 149861 150040 134820 138079 145009 130332 124853 128841 120006 114129 111380 114939
9030 114939 113777 107614 102859 99928 108497 113545 115779 114005 111411 117944 118591 120993 135410 127055
9016 127055 115460 110084 101049 105296 114069 116249 102947 94330 87482 97564 113081 111569 86356
9003 86356 86943 102697 104910 85673 83802 92653 98120 101924 116158 104101 92814 103886 102424
8990 102424 99417 92626 81557 86302 100827 109503 104931 91985 88322 85098 97688 99522 87701
$$ packed form
9085B51263Q399M907o162O47n558j1128P506l768j2910j0642j8292k719J1976
9072B13519R066l609j1943k2143m729j3467q671r32n734p68o017K182o879q268
9058A31607J586J1783J5723k531q854q294L28P148J5242M05j0656n852j6068l947
9044A27620J0723J4198k680J79j5220L259O930j4677n479L988q835n877k749L559
9030A14939j162o163m755k931Q569N048K234j774k594O533O47K402J4417q355
9016A27055j1595n376r035M247Q773K180j3302q617o848J0082J5517j512k5213
9003H6356N87J5754K213j9237j871Q851N467L804J4234j2057j1287J1072j462
8990A02424l007o791j1069M745J4525Q676m572j2946l663l224J2590J834j1821
$$ plain form
8977 87701 87073 91315 103583 100718 102799 99498 103122 92972 86527 93255 95007 85382 83577 73450
8963 73450 62130 67726 83407 103265 115268 107591 103797 105215 100821 91075 83481 89083 107676
8950 107676 114288 114517 113584 99456 90811 84899 73131 76393 95195 95821 94581 101251 118627 126570
8936 126570 105696 95169 96696 95731 108948 119863 113746 99917 96346 89271 79952 95235 103384
8923 103384 100569 93021 83019 81787 77687 77212 89080 91307 95089 109228 101538 94025 85943 72593
8909 72593 73476 79320 80254 68659 61063 66548 74486 89809 93016 83118 67369 77467 92568 107881
8895 107881 99712 94270 88427 94343 94548 103554 109222 109680 102007 86904 82252 80023 73832 68117 66476
8880 66476 60695 55691 52438 49443 52782 56400 60777 70458 85958 96579 87061 82113 80137 95314
$$ packed form
8977H7701o28M242J2268k865K081l301L624j0150o445O728J752r625j805j0127
8963G3450j1320N596J5681J9858J2003p677l794J418m394r746p594N602J8593
8950A07676O612K29r33j4128q645n912j1768L262J8802O26j240O670J7376P943
8936A26570k0874j0527J527r65J3217J0915o117j3829l571p075r319J5283Q149
8923A03384k815p548j0002j232m100m75J1868K227L782J4139p690p513q082j3350
8909G2593Q83N844R34j1595p596N485P938J5323L207r898j5749J0098J5101J5313
8895A07881q169n442n843N916K05R006N668M58p673j5103m652k229o191n715j641
8880F6476n781n004l253k995L339L618M377R681J5500J0621r518m948j976J5177
$$ plain form
8866 95314 105085 104830 91144 90426 94502 83148 79631 88440 91772 86794 81835 74089 65256 61852 90280
8851 90280 99946 87993 70870 64925 63524 50042 49753 63998 69325 57179 49726 51902 52643 50804
8837 50804 66526 79866 81275 66964 69766 85302 80165 54219 45494 44170 58932 73899 79787
8824 79787 74666 87633 84437 71905 79022 76924 82066 97252 99949 97649 89475 88844 89889 79945
8810 79945 76698 85157 92374 97980 96926 86386 73993 74220 73841 68642 77432 86660 71067 53850
8796 53850 70436 87748 77060 79319 78237 89765 80369 76132 72235 68260 71858 86911 97374
8783 97374 80789 70199 70903 76352 76340 86787 87041 91725 97310 87561 98564 101846 96534 94102 90857
8768 90857 87681 87145 84645 88007 92933 87473 81946 81740 84203 77857 65795 64206 64472 69758 69473
$$ packed form
8866I5314R771k55j3686p18M076j1354l517Q809L332m978m959p746q833l404K8428
8851I0280R666j1953j7123n945j401j3482k89J4245N327j2146p453K176P41j839
8837E0804J5722J3340J409j4311K802J5536n137k5946q725j324J4762J4967N888
8824G9787n121J2967l196j2532P117k098N142J5186K697k300q174o31J045r944
8810G9945l247Q459P217N606j054j0540j2393K27l79n199Q790R228j5593j7217
8796E3850J6586J7312j0688K259j082J1528r396m237l897l975L598J5053J0463
8783I7374j6585j0590P04N449j2J0447K54M684N585r749J1003L282n312k432l245
8768I0857l176n36k500L362M926n460n527k06K463o346j2062j589K66N286k85
$$ plain form
8753 69473 72728 72350 66100 82705 86044 61622 57215 70849 78086 77776 72609 73955 84468 94894
8739 94894 97271 96968 94136 96365 98861 93839 81341 82911 100838 101892 94380 81415 83889 88576
8725 88576 88379 88768 88456 80881 91849 104778 104693 116949 115551 119951 123890 127571 120313 108165 102114
8710 102114 99622 100254 95250 92987 91826 94525 88216 85902 89471 79559 81581 95427 94722 88070 102729
8695 102729 97401 89524 78040 90971 108613 109170 104389 100627 98946 94863 104135 120845 127541 128036
8681 128036 130708 139995 140501 132170 127297 102808 104905 109016 99612 91813 92369 92629 107470 107511 96167
8666 96167 94135 82950 79122 83587 94971 104256 100832 98329 99412 100208 104881 110739 104803 104263 112646
8651 112646 117572 122849 118210 114747 107244 101362 100381 108940 113260 122787 127397 132064 134420 139472 153020
$$ packed form
8753F9473L255l78o250J6605L339k4422m407J3634P237l10n167J346J0513J0426
8739I4894K377l03k832K229K496n022j2498J570J7927J054p512j2965K474M687
8725H8576j97L89l12p575J0968J2929q5J2256j398M400L939L681p258j2148o051
8710A02114k492O32n004k263j161K699o309k314L569r912K022J3846p05o652J4659
8695A02729n328p877j1484J2931J7642N57m781l762j681m083R272J6710O696M95
8681A28036K672R287N06q331m873k4489K097M111r404p799N56K60J4841M1j1344
8666I6167k032j1185l828M465J1384R285l424k503J083P96M673N858n936n40Q383
8651A12646M926N277m639l463p503n882r81Q559M320R527M610M667K356N052J3548
$$ plain form
8636 153020 157226 144843 131396 137431 157923 169149 151879 125859 117707 132607 130851 132010 139645
8623 139645 140617 147454 130545 123213 127635 121465 131036 148614 154819 150652 136319 124983 134091 144460
8609 144460 140169 136326 153122 161843 167847 171808 190773 183949 178992 169194 167171 162341 170435 179554
8595 179554 185026 182791 181102 185344 186265 190908 187170 190726 200709 204479 214890 219066 219264 229269
8581 229269 223927 232916 257849 266793 276437 305206 322487 336529 365769 390052 409295 436528
8569 436528 448953 465419 510531 557586 587684 624339 663304 720760 774052 834846 889111 958665
8557 958665 1015998 1064213 1105353 1106549 1078263 1018304 940800 865019 800932 754329 721977 692574
8545 692574 665329 621053 581598 547348 521205 491610 481787 483464 482057 464990 441927 418094
$$ packed form
8636A53020M206j2383j3447O035K0492J1226j7270k6020q152J4900j756J159P635
8623A39645R72O837j6909p332M422o170R571J7578O205m167j4333j1336R108J0369
8609A44460m291l843J6796Q721O004L961J8965o824m957r798k023m830Q094R119
8595A79554N472k235j689M242R21M643l738L556R983L770J0411M176J98J0005
8581B29269n342Q989K4933Q944R644K8769J7281J4042K9240K4283J9243K7233
8569D36528J2425J6466M5112M7055L0098L6655L8965N7456N3292O0794N4265O9554
8557I58665N7333M8215M1140J196k8286n9959p7504p5781o4087m6603l2352k9403
8545F92574k7245m4276l9455l4250k6143k9595r823J677j407j7067k3063k3833
$$ plain form
8533 418094 400281 387869 382761 383460 372932 379178 385506 377804 366154 356497 374331 370500 359185
8520 359185 352408 346981 345785 330727 328927 334226 324577 312645 315381 310497 287311 283317 278918 273715
8506 273715 263568 243187 238693 257694 261444 251359 241332 231608 228050 233538 226775 222456 207329
8493 207329 196270 182250 187892 193710 183696 174214 176847 181020 173340 162509 164008 166459 159443
8480 159443 165930 161829 159529 159560 155855 137835 134871 151147 153296 149647 149014 155242 163150 163720 151121
8465 151121 137632 141239 133614 139285 151282 152489 142200 126765 114662 103297 97801 102747 112518
8452 112518 107344 104372 114378 110014 105499 108761 112258 107641 111058 111538 113727 107640 102432 102812 95951
8437 95951 92925 100331 109457 118308 110468 114533 106030 96384 80748 77512 81381 82525 73522 91862
$$ packed form
8533D18094j7813j2412n108O99j0528O246O328p702j1650r657J7834l831j1315
8520C59185o777n427j196j5058j800N299r649j1932K736m884k3186l994m399n203
8506B73715j0147k0381m494J9001L750j0085j0027r724l558N488o763m319j5127
8493B07329j1059j4020N642N818j0014r482K633M173p680j0831J499K451p016
8480A59443O487m101k300L1l705j8020k964J6276K149l649o33O228P908N70j2599
8465A51121j3489L607p625N671J1997J207j0289j5435j2103j1365n496M946R771
8452A12518n174k972J0006m364m515L262L497m617L417M80K189o087n208L80o861
8437I5951l026P406R126Q851p840M065q503r646j5636l236L869J144r003J8340
$$ plain form
8423 91862 80967 72200 80586 87846 81717 85816 81796 91202 111306 111612 108836 102119 89976 81794
8409 81794 67918 64884 68425 89927 97290 82145 85408 93019 88201 90648 98997 91879 76833 76785
8395 76785 67211 70897 80835 89196 97798 81588 92853 99081 78685 68656 75265 81159 81096 76121
8381 76121 72470 66631 73018 83129 100072 109408 111296 117345 101561 80301 69246 86651 94607
8368 94607 97246 85580 79064 75336 73767 69676 62714 61262 67216 65123 55028 47748 54732 56907
8354 56907 63454 81328 76591 83663 91337 93254 93969 98731 86773 79798 82352 75115 79020 82459
8340 82459 82611 85631 75917 70566 76625 80784 82516 81321 67242 74315 83558 72823 65030 69894
8326 69894 75088 90901 80324 76440 69925 80093 86716 87234 77949 70082 68077 74055 87863 71711
$$ packed form
8423I1862j0895q767Q386P260o129M099m020R406K0104L06k776o717j2143q182
8409H1794j3876l034L541K1502P363j5145L263P611m818K447Q349p118j5046m8
8395G6785r574L686R938Q361Q602j6210J1265O228k0396j0029O609N894o3m975
8381G6121l651n839O387J0111J6943R336J888O049j5784k1260j1055J7405P956
8368I4607K639j1666o516l728j569m091o962j452N954k093j0095p280O984K175
8354E6907O547J7874m737P072P674J917P15M762j1958o975K554p237L905L439
8340H2459J52L020r714n351O059M159J732j195j4079P073R243j0735p793M864
8326F9894N194J5813j0577l884o515J0168O623N18r285p867k005N978J3808j6152
$$ plain form
8312 71711 67889 72094 83178 78965 70230 66723 74079 77591 67188 61275 70892 72009 76509 87928
8298 87928 79036 60934 54438 63193 75515 84537 81344 69955 58181 60268 64856 65075 77189 74880
8284 74880 61790 59041 61570 66829 70066 80986 75738 72572 71323 70871 72675 66757 63335 67211
8270 67211 73872 79759 81708 76871 73319 69687 69820 77766 89637 85823 91698 103180 106951 99016
8256 99016 93415 92828 84058 72610 64786 61144 60406 66493 71532 75989 72859 64497 58556 55341 58162
8241 58162 72908 73650 81510 86718 88377 83480 80667 79452 75418 88750 92787 76638 65918 60903
8227 60903 60896 62415 71231 82619 88296 90344 85055 68984 66050 59690 49100 56204 61863 61132 74015
8212 74015 74648 77557 78092 66602 67114 75154 72305 64613 61419 75749 73305 70315 78154 60653 47170
$$ packed form
8312G1711l822M205J1084m213q735l507P356L512j0403n913R617J117M500J1419
8298H7928q892j8102o496Q755J2322R022l193j1389j1774K087M588K19J2114k309
8284G4880j3090k749K529N259L237J0920n248l166j249m52J804n918l422L876
8270F7211O661N887J949m837l552l632J33P946J1871l814N875J1482L771p935
8256I9016n601n87q770j1448p824l642p38O087N039M457l130q362n941l215K821
8241E8162J4746P42P860N208J659m897k813j215m034J3332M037j6149j0720n015
8227F0903pJ519Q816J1388N677K048n289j6071k934o360j0590P104N659p31J2883
8212G4015O33K909N35j1490N12Q040k849p692l194J4330k444k990P839j7501j3483
$$ plain form
8197 47170 46995 49010 53127 53185 46914 43065 49061 55735 52812 49563 43485 28856 38657 43497 41759
8182 41759 55837 69588 68581 52796 51356 53141 55266 69582 66671 64440 71807 63440 60769 64157
8168 64157 70258 70719 80448 73067 66377 63953 63529 54613 52991 69960 70660 74914 69928 57931 58458
8153 58458 64670 64935 73203 69075 54579 47791 50975 54845 60909 52011 44073 49206 56192 57527 69553
8138 69553 73612 69554 70386 77828 70529 64594 66577 71273 63513 53557 52519 50551 62180 59013 58944
8123 58944 59061 50123 45017 55877 54803 57460 65119 69307 70880 71219 67451 74573 89059 85657 61265
8108 61265 39018 40046 47497 62740 66529 72942 69028 55321 57909 55763 58606 50943 55042 61511
8094 61511 56954 55386 62197 62444 70020 71413 65267 63335 62051 56269 52565 59382 56597 59854 55935
$$ packed form
8197D7170j75K015M117N8o271l849N996O674k923l249o078j4629R801M840j738
8182D1759J4078J3751j007j5785j440J785K125J4316k911k231P367q367k671L388
8168F4157O101M61R729p381o690k424m24q916j622J6969P00M254m986j1997N27
8153E8458O212K65Q268m128j4496o788L184L870O064q898p938N133O986J335J2026
8138F9553M059m058Q32P442p299n935J983M696p760r956j038j968J1629l167o9
8123E8944J17q938n106J0860j074K657P659M188J573L39l768P122J4486l402k4392
8108F1265k2247J028P451J5243L789O413l914j3707K588k146K843p663M099O469
8094F1511m557j568O811K47P576J393o146j932j284n782l704O817k785L257l919
$$ plain form
8079 55935 40386 48736 51908 38464 37398 46498 53576 62093 65472 51225 42349 57473 67741
8066 67741 57463 68024 73601 50553 40231 50722 50957 39912 34278 44002 60532 60910 61847 68074
8052 68074 72143 71212 59689 55901 68546 72224 73083 64023 55053 50830 52602 72259 69814 70810 73201
8037 73201 81911 81619 66264 58981 52631 47804 58030 69248 74647 80823 75331 57891 46143 45422
8023 45422 53359 52473 55631 56569 45509 56055 61284 51542 43996 53620 68363 77465 82349 91046
8009 91046 87717 104833 103911 93653 108770 105688 109669 111527 100542 94815 106422 118007 127243
7996 127243 129266 134835 141019 142336 131940 134335 125366 115725 112879 123020 127054 124667 119745 120823
7982 120823 115815 115961 116960 113365 117866 125121 133636 118019 105778 116402 127725 137546 144642 144880
$$ packed form
8079E5935j5549Q350L172j3444j066R100P078Q517L379j4247q876J5124J0268
8066F7741j0278J0561N577k3048j0322J0491K35j1045n634R724J6530L78R37O227
8052F8074M069r31j1523l788J2645L678Q59r060q970m223J772J9657k445R96K391
8037G3201Q710k92j5355p283o350m827J0226J1218N399O176n492j7440j1748p21
8023D5422P937q86L158R38j1060J0546N229r742p546R624J4743R102M884Q697
8009I1046l329J7116r22j0258J5117l082L981J858j0985n727J1607J1585R236
7996A27243K023N569O184J317j0396K395q969r641k846J0141M034k387m922J078
7982A20823n008J46R99l595M501P255Q515j5617j2241J0624J1323R821P096K38
$$ plain form
7968 144880 146037 153227 179793 199926 214827 218706 218805 216786 219067 208549 212616 220975 211697 205692
7954 205692 190871 188180 197361 190595 189914 188363 189407 180219 164411 158625 154165 153155 156912 150097
7940 150097 143141 139305 144543 156991 161262 164711 159687 156860 168960 175664 177605 180585 189823 199305
7926 199305 206078 199820 199935 204023 215199 215283 210470 216183 225748 231382 229760 215386 198545 202292
7912 202292 196585 181432 180323 195740 194483 183519 175206 175761 172248 176757 166359 157202 158487 156148
7898 156148 166722 154824 150738 150241 139816 132754 140789 162466 158795 139579 134179 148327 158670
7885 158670 151683 148946 155473 156798 147312 147141 145938 146875 163513 171378 167040 154449 136912 124207
7871 124207 120869 123023 129241 134236 115249 111330 111813 111881 106634 100760 108321 116207 115000 113883 109849
$$ packed form
7968A44880J157P190K6566K0133J4901L879R9k019K281j0518M067Q359r278o005
7954B05692j4821k691R181o766o81j551J044r188j5808n786m460j010L757o815
7940A50097o956l836N238J2448M271L449n024k827J2100O704J941K980R238R482
7926A99305O773o258J15M088J1176Q4m813N713R565N634j622j4374j6841L747
7912B02292n707j5153j109J5417j257j0964q313N55l513M509j0398r157J285k339
7898A56148J0574j1898m086m97j0425p062Q035K1677l671j9216n400J4148J0343
7885A58670o987k737O527J325r486j71j203R37J6638P865m338j2591j7537j2705
7871A24207l338K154O218M995j8987l919M83O8n247n874P561P886j207j117m034
$$ plain form
7856 109849 117291 114072 106757 98307 90643 96287 94422 87316 91472 90964 94084 99657 90000 84405 82147
7841 82147 86180 89507 88755 89301 70895 70564 77914 78527 83011 73886 70694 79359 80061 70063 71432 77478
7825 77478 74921 70295 75582 66644 61120 68567 62429 54363 59062 63589 54924 58084 54448 49394 52895
7810 52895 44725 45893 53537 48926 48942 57069 68884 76406 73428 65543 59947 51594 63145 67648 59423
7795 59423 59093 58551 54198 48444 37510 40253 36490 42853 34993 25867 18719 30698 44469 44786 40258
7780 40258 42912 49561 56886 54488 51741 46950 55716 55711 54687 53756 62568 63278 51202 26486 13585
7765 13585 2963 4624 10522 19870 29326 39310 32726 29138 36785 31934 24094 38291 38106 41514
7751 41514 31916 26366 32441 36194 41852 35188 48691 48135 37898 33138 33733 22406 2082 4486
$$ packed form
7856A09849P442l219p315q450p664N644j865p106M156n08L120N573r657n595k258
7841H2147M033L327p52N46j8406l31P350O13M484r125l192Q665P02r998J369O046
7825G7478k557m626N287q938n524P447o138q066M699M527q665L160l636n054L501
7810E2895q170J168P644m611J6Q127J1815P522k978p885n596q353J1551M503q225
7795E9423l30n42m353n754j0934K743l763O363p860r126p148J1979J3771L17m528
7780D0258K654O649P325k398k747m791Q766nj024r31Q812P10j2076k4716j2901
7765A3585j0622J661N898R348R456R984o584l588P647m851p840J4197j85L408
7751D1514r598n550O075L753N658o664J3503n56j0237m760N95j1327k0324K404
$$ plain form
7737 4486 27285 42881 37376 38539 36562 24776 14563 23716 34883 40174 33851 34482 35048 38043
7723 38043 45467 54070 56016 53982 48428 47631 44491 40310 44948 52450 46630 38822 32581 29518 15165
7708 15165 12411 14384 17191 33003 31079 21760 14664 18061 43423 47459 40717 37698 38187 28238
7694 28238 29056 33053 27650 27310 33008 30820 43236 41014 39369 45639 42906 37258 47198 43423 37536
7679 37536 31819 27569 29892 40848 49005 49043 45142 42571 44752 44775 37671 21678 10603 11575 6326
7664 6326 -208 4654 1269 -6 14234 18351 19926 30930 20612 12719 21280 32096 32998 25426
7650 25426 11695 -5908 -10157 833 -1619 -6900 -2622 13267 19768 28218 35956 29681 21609 25503
7636 25503 22362 16932 13741 11165 14156 15579 4613 2225 18271 26763 35097 44379 50848 25265
$$ packed form
7737D486K2799J5596n505J163j977j1786j0213R153J1167N291o323O31N66K995
7723C8043P424Q603J946k034n554p97l140m181M638P502n820p808o241l063j4353
7708A5165k754J973K807J5812j924r319p096L397K5362M036o742l019M89r949
7694B8238Q18L997n403l40N698k188J2416k222j645O270k733n648R940l775n887
7679C7536n717m250K323J0956Q157L8l901k571K181K3p104j5993j1075R72n249
7664F326o534M862l385j275J4240M117J575J1004j0318p893Q561J0816R02p572
7650B5426j3731j7603m249J0990k452n281M278J5889O501Q450P738o275q072L894
7636B5503l141n430l191k576K991J423j0966k388J6046Q492Q334R282O469k5583
$$ plain form
7622 25265 2312 17822 14765 16598 22576 17173 25801 24633 24406 24182 29777 35719 37731 24986
7608 24986 34133 41015 31275 23141 29224 32972 31853 24378 27216 34831 41834 45882 43260 36043 41030
7593 41030 35924 34332 32976 26014 20244 10760 12828 15037 13562 7087 2611 6933 13563 25225
7579 25225 22719 19645 16392 19284 16951 3436 5245 7546 5624 -8656 -13874 -8451 -4280 8862
7565 8862 17677 22094 20403 16102 20378 15993 7477 3428 2715 10192 21145 2562 -12365 -10789
7551 -10789 -484 14068 41525 62871 80267 99066 114162 110685 92628 88130 83567 67622
7539 67622 49703 32987 19120 20666 34496 33198 20174 16161 26794 21317 18850 27758 22844
7526 22844 32080 33542 31897 33390 23944 20431 17866 13109 8723 11286 15702 6292 2093 14306
$$ packed form
7622B5265k2953J5510l057J833N978n403Q628j168k27k24N595N942K012j2745
7608B4986R147O882r740q134O083L748j119p475K838P615P003M048k622p217M987
7593D1030n106j592j356o962n770r484K068K209j475o475m476M322O630J1662
7579B5225k506l074l253K892k333j3515J809K301j922j4280n218N423M171J3142
7565H862Q815M417j691m301M276m385q516m049p13P477J0953j8583j4927J576
7551a0789J0305J4552K7457K1346J7396J8799J5096l477j8057m498m563j5945
7539F7622j7919j6716j3867J546J3830j298j3024m013J0633n477k467Q908m914
7526B2844R236J462j645J493r446l513k565m757m386K563M416r410m199J2213
$$ plain form
7512 14306 22296 19650 15425 16389 8229 8897 30663 18019 5615 2777 4954 -806 5266 17181
7498 17181 26165 17524 18817 19275 10257 9376 15126 7637 5191 1748 -128 14949 16608 14561 15399
7483 15399 10362 4850 19726 22138 8197 11728 25256 32812 35271 23018 -1477 -8422 -10178
7470 -10178 -11848 -7297 -651 15448 20799 12019 17450 19579 24582 12604 4105 11589 9632 -1290
7456 -1290 1289 13965 22366 24587 14575 10294 12795 5200 8109 16263 10210 5308 -3916 -4876 9779
7441 9779 10786 12530 -1544 -223 6827 6188 21191 23038 10607 8823 10701 5580 -6781 -395
7427 -395 2364 6101 8679 9639 12913 22130 24653 25977 22811 23559 32912 35829 25327 18624 25958
7412 25958 25805 25352 27746 24985 20588 25202 10146 -2131 -14317 1369 11669 20885 4885 -11012
$$ packed form
7512A4306P990k646m225R64q160O68K1766j2644j2404k838K177n760O072J1915
7498A7181Q984q641J293M58r018q81N750p489k446l443j876J5077J659k047Q38
7483A5399n037n512J4876K412j3941L531J3528P556K459j2253k4495o945j756
7470a0178j670M551O646J6099N351q780N431K129N003j1978q499P484j957j0922
7456a290K579J2676Q401K221j0012m281K501p595K909Q154o053m902r224r60J4655
7441I779J007J744j4074J321P050o39J5003J847j2431j784J878n121j2361O386
7427c95K759L737K578R60L274R217K523J324l166P48R353K917j0502o703P334
7412B5958j53m53K394k761m397M614j5056j2277j2186J5686J0300R216j6000j5897
$$ plain form
7398 -11012 820 17848 17990 20005 20171 17302 18664 9295 21241 27769 14813 5566 7594 7945
7384 7945 10555 9413 25377 33104 21305 10985 7773 5066 6731 11572 13515 8365 10381 14838
7370 14838 15796 19088 20079 12584 11393 19524 20653 28941 34383 26548 26311 32766 38239 30003 21612
7355 21612 16615 10303 7813 13046 28911 29227 26225 24475 14322 12497 20560 22563 16578 20945
7341 20945 12709 -5602 -5154 -1409 5461 9585 -2090 4531 9826 12177 13039 8244 16550 23713 28339
7326 28339 26408 17704 9300 5486 10637 -739 -14459 -10551 1691 10885 18857 15078 15068 17423
7312 17423 22822 10091 18853 21505 4758 -160 -2711 496 7431 6776 10609 9262 5689 8669
7298 8669 8109 5822 -3223 -9585 -2802 4319 17643 7670 8619 8602 10432 -4008 -4312 210 14143
$$ packed form
7398a1012J1832J7028J42K015J66k869J362r369J1946O528j2956r247K028L51
7384G945K610j142J5964P727j1799j0320l212k707J665M841J943n150K016M457
7370A4838R58L292R91p495j191Q131J129Q288N442p835k37O455N473q236q391
7355B1612m997o312k490N233J5865L16l002j750j0153j825Q063K003n985M367
7341B0945q236j8311M48L745O870M124j1675O621N295K351Q62m795Q306P163M626
7326B8339j931q704q404l814N151j1376j3720L908J2242R194P972l779j0K355
7312A7423N399j2731Q762K652j6747m918k551L207O935o55L833j347l573K980
7298H669n60k287r045o362O783P121J3324r973R49j7J830j4440l04M522J3933
$$ plain form
7283 14143 25634 23935 21196 21950 16840 2649 -2707 -2484 10187 15027 13787 20026 4170 13000
7269 13000 19141 27023 22686 10710 17703 26504 25463 14170 13932 17059 12776 13601 13784 2508 -4123
7254 -4123 5402 26116 23536 18033 26501 38683 33545 21559 17766 18378 8792 5775 14997 13342
7240 13342 13462 9000 -4208 1520 4668 1611 2046 7777 13230 5682 6554 3431 3771 5602 1572
7225 1572 -8534 -9973 -9235 -5009 6894 21238 34163 28385 15683 3755 3604 1159 -2966 3469
7211 3469 16456 22464 17018 13455 13492 14320 17906 24283 21209 1789 -8566 1848 -12515 -23448
7197 -23448 -24436 -20381 -973 14127 17409 12863 7718 1595 -5631 -15452 -10551 -7283 1341 4488
7183 4488 14230 17483 27264 35223 32561 34036 23171 8615 15063 22627 11574 4239 -95 -1724
$$ packed form
7283A4143J1491j699k739P54n110j4191n356K23J2671M840j240O239j5856Q830
7269A3000O141P882m337j1976O993Q801j041j1293k38L127m283Q25J83j1276o631
7254d123R525K0714k580n503Q468J2182n138j1986l793O12r586l017R222j655
7240A3342J20m462j3208N728L148l057M35N731N453p548Q72l123L40J831m030
7225A572j0106j439P38M226J1903J4344J2925n778j2702j1928j51k445m125O435
7211C469J2987O008n446l563L7Q28L586O377l074j9420j0355J0414j4363j0933
7197b3448r88M055J9408J5100L282m546n145o123p226r821M901L268Q624L147
7183D488R742L253R781P959k662J475j0865j4556O448P564j1053p335m334j629
$$ plain form
7169 -1724 18389 13841 12074 3368 -7131 -683 12556 15429 18582 25934 18302 9847 12005 13133
7155 13133 21628 12336 11768 4134 -10997 -8969 -7742 -45 12260 9299 -4340 -24074 -21622 -7549
7141 -7549 -5365 2553 7473 -767 -20088 -21557 -14841 -13905 -13475 -10927 580 8964 3684 3501 10521
7126 10521 14584 12066 -771 -6199 2048 4780 -9193 -3927 8650 1614 -3723 3181 12468 16827
7112 16827 36362 33868 36277 33561 29611 18616 7137 873 12141 427 -9116 -7693 1206
7099 1206 -2799 -11579 -1097 1122 711 1654 -1663 -4904 -6549 -919 4822 14908 7160 -8128 -5671
7084 -5671 189 22521 23605 26204 23567 15728 11996 24915 16593 20844 10953 7867 20166 23012
7070 23012 14783 16754 21778 14081 5029 12378 15510 13783 12829 15967 4464 -6850 -18316 -22163
$$ packed form
7169a724K0113m548j767q706j0499O448J3239K873L153P352p632q455K158J128
7155A3133Q495r292n68p634j5131K028J227P697J2305k961j3639j9734K452J4073
7141g549K184P918M920q240j9321j469O716R36M30K548J1507Q384n280j83P020
7126A0521M063k518j2837n428Q247K732j3973N266J2577p036n337O904R287M359
7112A6827J9535k494K409k716l950j0995j1479o264J1268j1714r543J423Q899
7099A206m005q780J0482K219m11R43l317l241j645N630N741J0086p748j5288K457
7084e671N860K2332J084K599k637p839l732J2919q322M251r891l086J2299K846
7070B3012q229J971N024p697r052P349L132j727r54L138j1503j1314j1466l847
$$ plain form
7056 -22163 -6767 5519 14565 13229 11289 16734 24894 16848 5062 10472 12289 16121 9097 1838
7042 1838 3888 5837 -1432 11274 22157 16368 -42 8307 21461 12862 5785 -7786 -11351 3773
7028 3773 24359 26959 18589 23758 26661 33663 32243 20337 16599 18632 12556 8039 28674 32931
7014 32931 24092 25027 16658 14083 17888 17310 15457 9915 1519 -15145 -9113 5814 6506 -7408 -5368
6999 -5368 -514 4367 4957 5601 1450 -2622 9103 27572 34640 34794 29459 14602 13781 12494 13447
6984 13447 20663 21611 9384 8593 19946 23827 8814 7406 8322 -1871 -3452 1178 249 -4263 5134
6969 5134 17532 9143 -2895 -12346 -9652 6633 4299 -3326 -3741 3099 16210 6227 -7119 -7140
6955 -7140 -3326 -6427 -5720 -3703 -586 10829 6631 9366 18413 20606 8373 -14659 -9531 -3984
$$ packed form
7056b2163J5396J2286R046j336j940N445Q160q046j1786N410J817L832p024p259
7042A838K050J949p269J2706J0883n789j6410Q349J3154q599p077j3571l565J5124
7028C773K0586K600q370N169K903P002j420j1906l738K033o076m517K0635M257
7014C2931q839R35q369k575L805n78j853n542q396j6664O032J4927O92j3914K040
6999e368M854M881N90O44m151m072J1725J8469P068J54n335j4857q21j287R53
6984A3447P216R48j2227p91J1353L881j5013j408R16j0193j581M630r29m512R397
6969E134J2398q389j2038r451K694J6285k334p625m15O840J3111r983j3346k1
6955g140L814l101P07K017L117J1415m198K735R047K193j2233k3032N128N547
$$ plain form
6941 -3984 -2193 4413 10625 16465 10891 2276 -681 -15696 -16955 1871 17948 8031 -7691 -7566
6927 -7566 -18905 -14196 1565 8372 -2438 5833 -3881 -12189 -8711 -8611 -2642 9084 22660 19258
6913 19258 9970 5990 18888 32113 35085 17219 27197 35072 31877 29004 23437 27045 25344 10877
6899 10877 6496 7787 24653 34539 31438 31172 15650 3911 -10203 -15513 1613 298 12536
6886 12536 12082 6780 12947 13018 17505 9703 -1582 -6131 -199 5152 -8871 -33342 -35787 -13220
6872 -13220 -4041 3427 15337 24016 18516 2626 -1413 9468 11436 22008 30162 18841 -3960
6859 -3960 -10940 -5519 -1049 4460 4372 -2044 -6077 -4545 -723 17574 30502 32503 27312 19709 -2413
6844 -2413 1218 7549 14138 20982 14530 9434 21977 15611 4954 -98 -19595 -33121 -31928 -12712
$$ packed form
6941c984J791O606O212N840n574q615k957j5015j259J8826J6077r917j5722J25
6927g566j1339M709J5761O807j0810Q271r714q308L478J00N969J1726J3576l402
6913A9258r288l980J2898J3225K972j7866R978P875l195k873n567L608j701j4467
6899A0877m381J291J6866R886l101k66j5522j1739j4114n310J7126j315J2238
6886A2536m54n302O167P1M487p802j1285m549N932N351j4023k4471k445K2567
6872a3220R179P468J1910Q679n500j5890m039J0881J968J0572Q154j1321k2801
6859c960o980N421M470N509q8o416m033J532L822J8297J2928K001n191p603k2122
6844b413L631O331O589O844o452n096J2543o366j0657n052j9497j3526J193J9216
$$ plain form
6830 -12712 -853 7912 18369 12331 845 -7480 -18969 -13309 -15229 -4566 10615 15979 23871
6817 23871 20763 4883 -569 9828 8756 16945 20417 11267 -35 1486 2063 -2999 112 -3921
6803 -3921 -13010 -21820 -2072 10980 7955 5645 2032 -8682 -13079 -18965 -9034 -203 12991 13680
6789 13680 20031 8442 21330 19296 3632 5031 4307 -7753 5777 13984 21525 -842 -8524
6776 -8524 -13768 -7987 -6554 -4430 -3141 134 3059 -419 1859 1374 8192 15362 14269 10046 16668
6761 16668 19500 12182 2040 -4848 -5653 -2146 3390 933 -7430 -5203 5119 22675 22572 15925
6747 15925 10153 4715 -976 -8213 -4649 -4291 -3564 -2945 -909 -2596 10194 16887 13152 6765 4329
6732 4329 -2264 -3882 2952 7974 13827 10280 15332 17198 12437 -2322 -5848 -2254 -1515 12783 22381
$$ packed form
6830a2712J1859Q765J0457o038j1486q325j1489N660j920J0663J5181N364P892
6817B3871l108j5880n452J0397j072Q189L472r150j1302J521N77n062L111m033
6803c921r089q810J9748J3052l025k310l613j0714m397n886R931Q831J3194O89
6789A3680O351j1589J2888k034j5664J399p24j2060J3530Q207P541k2367p682
6776h524n244N781J433K124J289L275K925l478K278m85O818P170j093m223O622
6761A6668K832p318j0142o888q05L507N536k457q363K227J0322J7556j03o647
6747A5925n772n438n691p237L564L58P27O19K036j687J2790O693l735o387k436
6732D329o593j618O834N022N853l547N052J866m761j4759l526L594P39J4298R598
$$ plain form
6717 22381 22966 11125 14133 20732 21778 21764 6112 -2466 10971 28848 37489 23742 11387 -734
6703 -734 -2684 6919 17957 21268 21876 14450 1005 -3701 -16835 -13137 3239 9224 11300 18824
6689 18824 23106 15459 7151 897 -4143 -921 -847 -5546 -3257 3691 -1597 -10324 -15817 -12250 4041
6674 4041 13651 21137 18293 8144 16768 24448 22854 17300 25494 16498 3804 -1215 772 10525
6660 10525 3662 -5250 -2758 3607 14219 13848 3635 1670 2211 6391 3415 -6600 -12103 -6446
6646 -6446 -7773 -13079 -3946 -5284 -14759 -2964 -1509 -10333 -11287 -9167 -15488 1818 6325 6052 13219
6631 13219 9499 7684 25419 31719 29237 19688 14571 4513 8215 11278 4396 11125 23776 24055
6617 24055 14448 5198 -1474 6418 13618 20944 9377 -1448 -5062 -498 1702 1746 -5801 -12801 2664
$$ packed form
6717B2381N85j1841L008O599J046j4j5652q578J3437J7877Q641j3747j2355j2121
6703g34j950R603J1038L311O08p426j3445m706j3134L698J6376N985K076P524
6689A8824M282p647q308o254n040L222P4m699K289O948n288q727n493L567J6291
6674D041R610P486k844j0149Q624P680j594n554Q194q996j2694n019J987R753
6660A0525o863q912K492O365J0612l71j0213j965N41M180k976j0015n503N657
6646f446j327n306R133j338r475J1795J455q824r54K120o321J7306M507k73P167
6631A3219l720j815J7735O300k482r549n117j0058L702L063o882O729J2651K79
6617B4055r607r250o672P892P200P326j1567j0825l614M564K200M4p547p000J5465
$$ plain form
6602 2664 13532 14715 11679 11716 4434 2009 8335 6207 -2029 3999 18008 13070 12310 27373 44452
6587 44452 39210 32418 27305 17896 10415 3262 5395 6421 5494 4529 -653 3940 5340 6198 23878
6572 23878 26665 18116 24086 30522 17145 -6406 -14102 -12076 -1654 -1222 -7463 -6821 4190 7540
6558 7540 5408 2055 6151 20659 25060 26243 28413 43393 53162 52060 45595 44303 35400 32283
6544 32283 26514 17587 16846 18810 16897 11314 19209 11761 9027 21659 7381 -4480 -14679 -13165
6530 -13165 -13419 32 13050 6687 254 5232 6096 4077 12798 10277 3692 -956 10865 1293
6516 1293 -8715 -722 3615 354 6663 4911 1715 2782 10711 20200 19411 6956 2129 -630 -2467
6501 -2467 -11610 -23548 -23704 -6741 -3522 -6286 48 3693 811 -12892 -4495 15993 16983 12800
$$ packed form
6602B664J0868J183l036L7p282k425O326k128q236O028J4009m938p60J5063J7079
6587D4452n242o792n113r409p481p153K133J026r27r65n182M593J400Q58J7680
6572B3878K787q549N970O436j3377k3551p696K026J0422M32o241O42J1011L350
6558G540k132l353M096J4508M401J183K170J4980R769j102o465j292q903l117
6544C2283n769q927p41J964j913n583P895p448k734J2632j4278j1861j0199J514
6530a3165k54J3451J3018o363o433M978Q64k019Q721k521o585m648J1821r572
6516A293j0008P993M337l261O309j752l196J067P929R489p89j2455m827k759j837
6501b467r143j1938j56J6963L219k764O334L645k882j3703Q397K0488R90m183
$$ plain form
6487 12800 3268 7706 10776 10258 10574 7893 26720 26664 13704 10343 10255 15943 10914 11253 13986 13612
6471 13612 16437 23960 8592 -10238 -3584 2474 -8452 -7455 -3480 -458 13044 15092 8064 4575
6457 4575 -3557 -9333 -18998 -14170 -6684 -13529 -18614 -15454 1608 11710 1990 -451 -5561 -12407
6443 -12407 -16541 -10245 -4603 848 1873 -2768 -1409 2657 9870 2689 -3311 -10527 -15843 -47
6429 -47 -977 0 -6930 -5028 8725 13755 5747 14605 7900 -5055 -8058 -2785 -5698 2319 8650
6414 8650 15091 21102 11497 8422 -1614 13143 24089 14796 12301 7150 7030 12478 25806 25178
$$ packed form
6487A2800r532M438L070n18L16k681J8827n6j2960l361q8N688n029L39K733l74
6471A3612K825P523j5368j8830O654O058j0926R97L975L022J3502K048p028l489
6457D575q132n776r665M828P486o845n085L160J7062J0102r720k441n110o846
6443a2407m134O296N642N451J025m641J359M066P213p181o000p216n316J5796
6429d7r30R77o930J902J3753N030q008Q858o705j2955l003N273k913Q017O331
6414H650O441O011r605l075j0036J4757J0946r293k495n151j20N448J3328o28
$$ [...]
##END NTUPLES=NMR SPECTRUM
##END=
