##TITLE=ns-20-28 - 
##JCAMPDX= 6.0         $$ Bruker NMR JCAMP-DX V2.0
##DATA TYPE= NMR SPECTRUM
##DATA CLASS= NTUPLES
##ORIGIN= BRUKER
##OWNER= naomi.sakai@unige.ch
$$ XWIN-NMR		Version 3.5
$$ Tue Feb 16 12:34:49 2010 "MET (UT+1h)  guest@nmrge300
##.OBSERVE FREQUENCY= 300.131853425608
##.OBSERVE NUCLEUS= ^1H
##.ACQUISITION MODE= SIMULTANEOUS (DQD)
##.ACQUISITION SCHEME= undefined
##.AVERAGES= 32
##.DIGITISER RES= 18
##SPECTROMETER/DATA SYSTEM= av300
##.PULSE SEQUENCE= zg30
##.SOLVENT NAME= CDCl3
##.SHIFT REFERENCE= (INTERNAL, CDCl3, 0, 16.459)
##AUDIT TRAIL= $$ (NUMBER, WHEN, WHO, WHERE, WHAT)
$$ ##TITLE= Audit trail, XWIN-NMR		Version 3.5
$$ ##JCAMPDX= 5.01
$$ ##ORIGIN= Bruker BioSpin GmbH
$$ ##OWNER= guest
$$ /u/data/matile/nmr/ns-20-28/1/pdata/1/auditp.txt
$$ ##AUDIT TRAIL=  $$ (NUMBER, WHEN, WHO, WHERE, WHAT)
(   1,<2010-02-16 12:34:27.44 +0100>,<guest>,<nmrge300>,
      <created by zg, POWCHK disabled, PULCHK disabled
       configuration hash MD5:
       42 FB D1 63 34 BA 53 DC 99 2C E0 62 B9 E2 7C B0
       data hash MD5: 32K
       F6 F7 91 4D 14 50 77 4B EC 31 2B 97 96 78 7F 15>)
(   2,<2010-02-16 12:34:32.87 +0100>,<guest>,<nmrge300>,
      <Start of raw data processing
       efp LB = 0.3 FT_mod = 6 PKNL = 1 PHC0 = 599.7491 PHC1 = 12.55803 SI = 64K 
       data hash MD5: 64K
       57 6E 98 29 89 3B 2C 87 60 03 99 BD 92 8F C7 A4>)
$$ ##END=
$$ 
$$ hash MD5
$$ 2E EA E4 29 F0 90 FC FB 60 FA F3 AD 1A 1E B5 97
##$RELAX= 
##$RELAX= 
##$RELAX= 
##$RELAX= 
##$RELAX= 
$$ Bruker specific parameters
$$ --------------------------
##$DU= </u>
##$EXPNO= 1
##$NAME= <ns-20-28>
##$PROCNO= 1
##$TYPE= <nmr>
##$USER= <matile>
##$AMP= (0..31)
100 100 100 100 100 100 100 100 100 100 100 100 100 100 100 100 100 100 
100 100 100 100 100 100 100 100 100 100 100 100 100 100 
##$AQSEQ= 0
##$AQ_mod= 3
##$AUNM= <au_zg>
##$AUTOPOS= <19 >
##$BF1= 300.13
##$BF2= 300.13
##$BF3= 300.13
##$BF4= 300.13
##$BF5= 500.13
##$BF6= 500.13
##$BF7= 500.13
##$BF8= 500.13
##$BYTORDA= 1
##$CFDGTYP= 0
##$CFRGTYP= 5
##$CHEMSTR= <none>
##$CNST= (0..31)
1 1 145 1 1 1 1 1 1 1 1 1 1 1 1 1 1 1 1 1 1 1 1 1 1 1 1 1 1 1 1 1 
##$CPDPRG= <>
##$CPDPRG1= <>
##$CPDPRG2= <>
##$CPDPRG3= <>
##$CPDPRG4= <mlev>
##$CPDPRG5= <mlev>
##$CPDPRG6= <mlev>
##$CPDPRG7= <mlev>
##$CPDPRG8= <mlev>
##$CPDPRGB= <>
##$CPDPRGT= <>
##$D= (0..31)
0 1 0 0 0 0 0 0 0 0.06 0 0 0 0 0 0 0.0002 0 0 0 0 0 0 0 0 0 0 0 0 0 0 
0 
##$DATE= 1266319955
##$DBL= (0..7)
120 120 120 120 120 120 120 120 
##$DBP= (0..7)
150 150 150 150 150 150 150 150 
##$DBP07= 0
##$DBPNAM0= <>
##$DBPNAM1= <>
##$DBPNAM2= <>
##$DBPNAM3= <>
##$DBPNAM4= <>
##$DBPNAM5= <>
##$DBPNAM6= <>
##$DBPNAM7= <>
##$DBPOAL= (0..7)
0.5 0.5 0.5 0.5 0.5 0.5 0.5 0.5 
##$DBPOFFS= (0..7)
0 0 0 0 0 0 0 0 
##$DE= 6
##$DECBNUC= <off>
##$DECIM= 24
##$DECNUC= <off>
##$DECSTAT= 4
##$DIGMOD= 1
##$DIGTYP= 7
##$DL= (0..7)
0 120 120 120 120 120 120 120 
##$DP= (0..7)
150 150 150 150 150 150 150 150 
##$DP07= 0
##$DPNAME0= <>
##$DPNAME1= <>
##$DPNAME2= <>
##$DPNAME3= <>
##$DPNAME4= <>
$$ [...]
##$SUBNAM4= <"">
##$SUBNAM5= <"">
##$SUBNAM6= <"">
##$SUBNAM7= <"">
##$SUBNAM8= <"">
##$SUBNAM9= <"">
##$SW= 20.5670922153648
##$SWIBOX= (0..15)
0 1 2 3 0 0 0 0 0 0 0 0 0 0 0 0 
##$SW_h= 6172.83950617284
##$TD= 32768
##$TD0= 1
##$TE= 300
##$TE2= 300
##$TE3= 300
##$TEG= 300
##$TL= (0..7)
0 120 120 120 120 120 120 120 
##$TP= (0..7)
150 150 150 150 150 150 150 150 
##$TP07= 0
##$TPNAME0= <>
##$TPNAME1= <>
##$TPNAME2= <>
##$TPNAME3= <>
##$TPNAME4= <>
##$TPNAME5= <>
##$TPNAME6= <>
##$TPNAME7= <>
##$TPOAL= (0..7)
0.5 0.5 0.5 0.5 0.5 0.5 0.5 0.5 
##$TPOFFS= (0..7)
0 0 0 0 0 0 0 0 
##$TUNHIN= 0
##$TUNHOUT= 0
##$TUNXOUT= 0
##$USERA1= <user>
##$USERA2= <user>
##$USERA3= <user>
##$USERA4= <user>
##$USERA5= <user>
##$V9= 5
##$VALIST= <valist>
##$VCLIST= <CCCCCCCCCCCCCCC>
##$VD= 0
##$VDLIST= <DDDDDDDDDDDDDDD>
##$VPLIST= <PPPPPPPPPPPPPPP>
##$VTLIST= <TTTTTTTTTTTTTTT>
##$WBST= 1024
##$WBSW= 4
##$XGAIN= (0..3)
0 0 0 0 
##$XL= 0
##$YL= 0
##$YMAX_a= 823974
##$YMIN_a= -1224611
##$ZGOPTNS= <>
##$ZL1= 120
##$ZL2= 120
##$ZL3= 120
##$ZL4= 120
##$ABSF1= 0
##$ABSF2= 0
##$ABSG= 0
##$ABSL= 0
##$ALPHA= 0
##$AQORDER= 0
##$ASSFAC= 0
##$ASSFACI= 0
##$ASSFACX= 0
##$ASSWID= 0
##$AUNMP= <proc_1dsp>
##$AZFE= 0.1
##$AZFW= 0.1
##$BCFW= 0
##$BC_mod= 0
##$BYTORDP= 1
##$COROFFS= 0
##$CY= 20
##$DATMOD= 1
##$DC= 0
##$DFILT= <>
##$DTYPP= 0
##$F1P= 16.4590207986505
##$F2P= -4.10819907665074
##$FCOR= 0.5
##$FTSIZE= 65536
##$FT_mod= 6
##$GAMMA= 0
##$GB= 0
##$INTBC= 1
##$INTSCL= 1
##$ISEN= 128
##$LB= 0.3
##$LEV0= 0
##$LPBIN= 0
##$MAXI= 32.82496
##$MC2= 0
##$MEAN= 0
##$ME_mod= 0
##$MI= 0.5909162
##$NCOEF= 0
##$NC_proc= -4
##$NLEV= 6
##$NOISF1= 0
##$NOISF2= 0
##$NSP= 0
##$NTH_PI= 0
##$NZP= 0
##$OFFSET= 16.45902
##$PC= 1
##$PHC0= 599.7491
##$PHC1= 12.55803
##$PH_mod= 1
##$PKNL= yes
##$PPARMOD= 0
##$PSCAL= 0
##$PSIGN= 0
##$REVERSE= no
##$SF= 300.13
##$SI= 65536
##$SIGF1= 0
##$SIGF2= 0
##$SINO= 400
##$SIOLD= 65536
##$SREGLST= <1H.DMSO>
##$SSB= 0
##$STSI= 65536
##$STSR= 0
##$SW_p= 6172.83950617283
##$SYMM= 0
##$S_DEV= 0
##$TDeff= 32768
##$TDoff= 0
##$TI= <FRANCE
PROTON DMSO u guest 19

>
##$TILT= no
##$TM1= 0
##$TM2= 0
##$TOPLEV= 0
##$USERP1= <user>
##$USERP2= <user>
##$USERP3= <user>
##$USERP4= <user>
##$USERP5= <user>
##$WDW= 1
##$XDIM= 65536
##$YMAX_p= 482078150
##$YMIN_p= -838390
$$ End of Bruker specific parameters
$$ ---------------------------------
##NTUPLES= NMR SPECTRUM
##VAR_NAME=  FREQUENCY,     SPECTRUM/REAL,   SPECTRUM/IMAG
##SYMBOL=    X,             R,               I
##VAR_TYPE=  INDEPENDENT,   DEPENDENT,       DEPENDENT
##VAR_FORM=  AFFN,          ASDF,            ASDF
##VAR_DIM=   65536,         65536,           65536
##UNITS=     HZ,            ARBITRARY UNITS, ARBITRARY UNITS
##FACTOR=    0.0941914931894839, 1,          1
##FIRST=     4939.84585706711, 0,            0
##LAST=      -1232.99364910572, 0,           0
##MIN=       -1232.99364910572, -838390,     0
##MAX=       4939.84585706711, 482078150,    0
$$ Real data points
##PAGE= N=1
##DATA TABLE= (X++(R..R)), XYDATA
$$ [...]
$$ plain form
41978 130005 112447 108928 131129 167818 207653 242144 254786 236540 208148 199582 209957 214254
41966 214254 205837 201601 204986 197757 176533 166013 181171 201466 199915 178491 157124 142321
41954 142321 124866 100676 79576 76662 101581 149331 195607 210301 185381 146361 130669 155496
41942 155496 205434 245609 248314 215342 175749 157185 162497 178720 197617 212884 207518 168552
41930 168552 115223 89771 112067 158051 188456 185401 157801 127161 113957 123171 136291 129336
41918 129336 102044 75986 63680 59411 63835 92269 145809 196577 219981 224441 229448 229869 207524
41905 207524 169899 149340 161130 184496 192805 185687 180355 182997 183286 173458 158536 143596 122071
41892 122071 87674 53331 44061 68260 108539 146005 179192 209928 228114 229406 234354 263815
$$ packed form
41978A30005j7558l519K2201L6689L9835L4491J2642j8246k8392q566J0375M297
41966B14254q417m236L385p229k1224j0520J5158K0295j551k1424k1367j4803
41954A42321j7455k4190k1100k914K4919M7750M6276J4694k4920l9020j5692K4827
41942A55496M9938M0175K705l2972l9593j8564N312J6223J8897J5267n366l8966
41930A68552n3329k5452K2296M5984L0405l055k7600l0640j3204R214J3120o955
41918A29336k7292k6058j2306m269M424K8434N3540N0768K3404M460N007M21k2345
41905B07524l7625k0559J1790K3366Q309p118n332K642K89r828j4922j4940k1525
41892A22071l4397l4343r270K4199M0279L7466L3187L0736J8186J292M948K9461
$$ plain form
41880 263815 301156 307424 275492 240595 228945 222753 191763 139273 98457 95156 128631 178316
41868 178316 216114 220749 192920 152694 117929 94821 91279 119859 174830 221743 226769 189921
41856 189921 139919 106154 103603 129870 162393 170607 146834 116706 106514 111951 113709 109775
41844 109775 110853 113976 106531 93885 97712 122409 144323 143299 129631 129088 150814 180281 199333
41831 199333 204159 202651 199937 192954 180872 172951 176030 178623 163081 134525 119356 128729 142992
41818 142992 143837 141671 152773 167484 166665 157866 165242 187015 193677 174506 159708 183148 240037
41805 240037 294172 315766 302509 273884 255600 262907 289351 314099 324165 324103 320526 306619
41793 306619 272927 230117 207497 221370 250109 251003 205111 138407 92676 82026 88058 92267
$$ packed form
41880B63815L7341O268l1932l4897j1650o192l0990n2490m0816l301L3475M9685
41868A78316L7798M635k7829m0226l4765k3108l542K8580N4971M6913N026l6848
41856A89921n0002l3765k551K6267L2523Q214k3773l0128j0192N437J758l934
41844A09775J078L123p445j2646L827K4697K1914j024j3668n43K1726K9467J9052
41831A99333M826j508k714o983j2082p921L079K593j5542k8556j5169R373J4263
41818A42992Q45k166J1102J4711q19q799P376K1773O662j9171j4798K3440N6889
41805B40037N4135K1594j3257k8625j8284P307K6444K4748J0066o2l577j3907
41793C06619l3692m2810k2620J3873K8739Q94m5892o6704m5731j0650O032M209
$$ plain form
41781 92267 96386 108411 124969 136063 136505 125932 107941 94457 97952 112865 119680 115488 122223
41768 122223 151277 178685 175441 148466 129071 130073 136224 130639 110373 81744 59550 63714
41756 63714 95650 125299 124962 109380 116152 151580 185954 201357 210723 223556 226122 210283 194507
41743 194507 196942 206747 200437 173605 141796 120072 112348 111857 105658 88707 75517 83682 106095
41730 106095 120171 125508 143856 173657 177578 135231 79709 54480 56331 52905 40686 48490
41718 48490 87403 131545 154321 157887 158320 161886 166510 172966 184058 198632 211019 212841 197460
41705 197460 170104 150913 158153 188749 222301 240437 233933 198767 142045 90313 73393 93621
41693 93621 123291 137687 138572 138640 136497 121440 97114 84060 94547 115184 122809 113420 105874
$$ packed form
41781I2267M119J2025J6558J1094M42j0573j7991j3484L495J4913O815m192O735
41768A22223K9054K7408l244k6975j9395J002O151n585k0266k8629k2194M164
41756F3714L1936K9649l37j5582O772L5428L4374J5403R366J2833K566j5839j5776
41743A94507K435R805o310k6832l1809k1724p724m91o199j6951j3190Q165K2413
41730A06095J4076N337J8348K9801L921m2347n5522k5229J851l426j2219P804
41718D8490L8913M4142K2776L566M33L566M624O456J1092J4574J2387J822j5381
41705A97460k7356j9191P240L0596L3552J8136o504l5166n6722n1732j6920K0228
41693I3621K9670J4396Q85O8k143j5057k4326j3054J0487K0637P625r389p546
$$ plain form
41680 105874 116051 136841 149691 147712 136476 117558 87989 57624 48580 66390 85157 77299
41668 77299 51631 45068 76447 123448 150809 150824 146646 159577 182963 192081 174858 145635 127432
41655 127432 127160 133530 134991 132295 134253 146294 162256 165821 147761 126870 140444 199271 263584
41642 263584 285682 269244 259387 276504 293026 282543 257632 242171 236171 230419 230190 238310 236555
41629 236555 212750 188437 189440 204326 204008 189288 184132 192014 196751 200414 219691 245161 246316
41616 246316 223024 211146 226625 244006 244284 242630 248229 238198 201263 170984 179293 206402
41604 206402 215871 213621 227257 246117 233271 190289 159500 158750 160969 148430 142213 159268 179752
41591 179752 182048 178194 186966 198933 199050 201728 227990 261449 263830 229898 193129 175341 162521
$$ packed form
41680A05874J0177K0790J2850j979j1236j8918k9569l0365r044J7810J8767p858
41668G7299k5668o563L1379M7001K7361J5m178J2931K3386R118j7223k9223j8203
41655A27432k72O370J461k696J958J2041J5962L565j8060k0891J3574N8827O4313
41642B63584K2098j6438r857J7117J6522j0483k4911j5461o000n752k29Q120j755
41629B36555k3805k4313J003J4886l18j4720n156P882M737L663J9277K5470J155
41616B46316k3292j1878J5479J7381K78j654N599j0031l6935l0279Q309K7109
41604B06402R469k250J3636J8860j2846m2982l0789p50K219j2539o217J7055K0484
41591A79752K296l854Q772J1967J17K678K6262L3459K381l3932l6769j7788j2820
$$ plain form
41578 162521 138499 114667 112143 134363 171202 214272 254364 277504 279214 273891 276509 282261
41566 282261 277027 261016 247513 241678 234409 216915 190451 161850 139032 130496 139519 157933
41554 157933 173279 182000 188813 195831 201503 207537 215356 217633 206959 192266 189998 196240 187047
41541 187047 155649 130529 139808 170850 185811 171257 151491 152594 172800 194643 210698 226108
41529 226108 243844 258299 261624 250597 229150 208223 200403 209340 224921 233246 231627 229188 230562
41516 230562 224128 193990 144072 101871 91455 106627 118340 106349 74964 39449 10146 -5390
41504 -5390 2828 39116 94228 154169 211528 258783 277184 249586 188284 136051 127755 155013
41492 155013 178340 173218 153722 146324 151115 143709 114501 88032 92293 121068 143674 146362 144712
$$ packed form
41578A62521k4022k3832k524K2220L6839M3070M0092K3140J710n323K618N752
41566B82261n234j6011j3503n835p269j7494k6464k8601k2818q536R023J8414
41554A57933J5346Q721O813P018N672O034P819K277j0674j4693k268O242r193
41541A87047l1398k5120R279L1042J4961j4554j9766J103K0206K1843J6055J5410
41529B26108J7736J4455L325j1027k1447k0927p820Q937J5581Q325j619k439J374
41516B30562o434l0138m9918m2201j0416J5172J1713j1991l1385l5515k9303j5536
41504e390Q218L6288N5112N9941N7359M7255J8401k7598o1302n2233q296K7258
41492A55013K3327n122j9496p398M791p406k9208k6469M261K8775K2606K688j650
$$ plain form
41479 144712 154852 172745 188803 204942 224800 239656 237770 221000 202085 190922 189982 195429
41467 195429 196815 185422 168616 163037 166468 153556 112451 69169 58070 81675 117400 148470
41455 148470 165879 156353 119881 89625 99230 132891 143832 124610 119743 156914 204639 221255
41443 221255 213733 216734 235402 244391 234277 225525 234014 247387 243815 220232 194513 185056 190844
41430 190844 191728 173477 151859 158458 197548 234143 237466 220685 219596 244204 272988 286504
41418 286504 281987 258269 213877 165336 142764 154961 175848 177994 166335 166104 188446 222298
41406 222298 253257 275810 289298 294482 295177 294536 288566 270198 240720 211626 194420 192213 198995
41393 198995 201811 188506 163861 154068 177855 211013 202317 139271 78529 85621 154530 216302
$$ packed form
41479A44712J0140J7893J6058J6139J9858J4856j886j6770j8915j1163r40N447
41467A95429J386j1393j6806n579L431j2912m1105m3282j1099K3605L5725L1070
41455A48470J7409r526l6472l0256R605L3661J0941j9222m867L7171M7725J6616
41443B21255p522L001J8668Q989j0114q752Q489J3373l572k3583k5719r457N788
41430A90844Q84j8251k1618O599L9090L6595L323j6781j089K4608K8784J3516
41418B86504m517k3718m4392m8541k2572J2197K0887K146j1659k31K2342L3852
41406B22298L0959K2553J3488N184O95o41n970j8368k9478k9094j7206k207O782
41393A98995K816j3305k4645r793K3787L3158q696o3046o0742P092O8909O1772
$$ plain form
41381 216302 224522 198275 173481 150209 114148 81939 87050 129366 171375 184416 174203 161376
41369 161376 161003 182224 223410 261923 268978 241045 201734 173258 164539 182121 222802 253477
41357 253477 233643 171333 125682 135968 175366 193998 179333 149976 118516 93667 96922 138097
41345 138097 186291 202068 191575 193661 218294 234897 222235 192857 162145 129135 99981 97019
41333 97019 125427 155916 159973 143195 127371 118909 113395 114235 125776 139685 147096 154188 167650
41320 167650 174687 158257 126263 104833 104854 115112 128504 152768 187199 207763 192196 153073
41308 153073 130974 153411 208704 261478 285481 276924 244666 200674 160640 139843 138525 138925
41296 138925 128079 118895 135388 177754 216151 223595 204498 184695 180889 186223 181826 158752
$$ packed form
41381B16302Q220k6247k4794k3272l6061l2209N111M2316M2009J3041j0213j2827
41369A61376l73K1221M1186L8513P055k7933l9311k8476q719J7582M0681L0675
41357B53477j9834o2310m5651J0286L9398J8632j4665k9357l1460k4849L255M1175
41345A38097M8194J5777j0493K086K4633J6603j2662k9378l0712l3010k9154k962
41333I7019K8408L0489M057j6778j5824q462n514Q40J1541J3909P411P092J3462
41320A67650P037j6430l1994k1430K1J0258J3392K4264L4431K0564j5567l9123
41308A53073k2099K2437N5293N2774K4003q557l2258m3992m0034k0797j318M00
41296A38925j0846r184J6493M2366L8397P444j9097j9803l806N334m397k3074
$$ plain form
41284 158752 130460 121958 141226 165672 167724 150574 142524 155205 167136 156754 133529 122829
41272 122829 133478 154686 173695 181472 171400 149219 135896 143548 157081 158642 159868 182470
41260 182470 211648 203389 146633 86888 70306 88769 101984 93549 78344 68302 61967 64116
41248 64116 86342 123901 155354 170742 179131 182753 167725 132844 105627 110429 135333 150665
41236 150665 149400 147557 151162 146625 125085 96581 75272 65706 68289 84419 109629 132053 143878
41223 143878 147394 147444 146281 147522 155757 170006 185331 200008 211455 209280 188117 164647 160988
41210 160988 170350 164463 141660 138594 177548 228126 245430 226385 200701 181729 158956 132274
41198 132274 120550 133182 158758 185833 212905 234555 240097 232206 227367 230992 229468 213391
$$ packed form
41284A58752k8292q502J9268K4446K052j7150q050J2681J1931j0382k3225j0700
41272A22829J0649K1208J9009P777j0072k2181j3323P652J3533J561J226K2602
41260A82470K9178q259n6756n9745j6582J8463J3215q435j5205j0042o335K149
41248F4116K2226L7559L1453J5388Q389L622j5028l4881k7217M802K4904J5332
41236A50665j265j843L605m537k1540k8504k1309r566K583J6130K5210K2424J1825
41223A43878L516N0j163J241Q235J4249J5325J4677J1447k175k1163k3470l659
41210A60988R362n887k2803l066L8954N0578J7304j9045k5684j8972k2773k6682
41198A32274j1724J2632K5576K7075K7072K1650N542p891m839L625j524j6077
$$ plain form
41186 213391 191886 176531 166443 157050 150160 148183 149773 155181 163190 161420 137740 105628 97511
41173 97511 123658 157473 174026 183892 211094 252351 279162 273544 244834 215285 201902 207395
41161 207395 216916 208362 176517 141617 124272 119644 108870 88901 75423 79075 93741 109037
41149 109037 121756 132092 138102 138406 136013 137065 146709 164430 182963 196723 211783 237854 265805
41136 265805 265372 218515 150920 117236 150687 230265 298300 311119 276278 239657 232326 236417
41124 236417 214645 165375 124973 115266 118508 116347 122835 153353 184293 178423 140388 113204
41112 113204 120454 141639 149184 144069 145849 166621 203724 243836 267598 262456 236485 211070
41100 211070 200007 205070 225432 253455 265727 242241 196651 164603 158273 156908 147982 148006 168062
$$ packed form
41186B13391k1505j5355j0088r393o890j977J590N408Q009j770k3680l2112q117
41173I7511K6147L3815J6553R866K7202M1257K6811n618k8710k9549j3383N493
41161B07395R521q554l1845l4900j7345m628j0774j9969j3478L652J4666J5296
41149A09037J2719J0336O010L04k393J052R644J7721J8533J3760J5060K6071K7951
41136B65805m33m6857o7595l3684L3451P9578O8035J2819l4841l6621p331M091
41124B36417k1772m9270m0402r707L242k161O488L0518L0940n870l8035k7184
41112A13204P250K1185P545n115J780K0772L7103M0112K3762n142k5971k5415
41100B11070j1063N063K0362K8023J2272k3486m5590l2048o330j365q926K4K0056
$$ plain form
41087 168062 188203 190909 196735 233766 283542 292736 240470 166073 122861 126336 156895 192576
41075 192576 221862 235742 227755 204467 184517 181340 190438 197051 193611 185046 178113 173338 171694
41062 171694 180876 203393 222014 213279 179864 154162 158894 176082 170307 135658 101817 94857
41050 94857 110053 128261 142747 158636 176342 189509 196039 199755 201581 198811 194373 197749 212735
41037 212735 230856 241181 241030 232221 212798 180431 141229 107681 88857 87990 105303 133150
41025 133150 151151 140674 107816 79308 69630 64165 42879 8319 -21471 -36411 -35159 -11828
41013 -11828 36663 91408 121329 118946 110743 123996 156321 187276 207960 225341 243471 255199
41001 255199 253860 243416 233142 227424 224529 222560 221592 218272 202073 163356 107588 57179 34636
$$ packed form
41087A68062K0141K706N826L7031M9776R194n2266p4397m3212L475L0559L5681
41075A92576K9286J3880p987k3288j9950l177R098O613l440q565o933m775j644
41062A71694R182K2517J8621q735l3415k5702M732J7188n775l4649l3841o960
41050I4857J5196J8208J4486J5889J7706J3167O530L716J826k770m438L376J4986
41037B12735J8121J0325j51q809j9423l2367l9202l3548j8824q67J7313K7847
41025A33150J8001j0477l2858k8508r678n465k1286l4560k9790j4940J252K3331
41013a1828M8491N4745K9921k383q203J3253L2325L0955K0684J7381J8130J1728
41001B55199j339j0444j0274n718k895j969r68l320j6199l8717n5768n0409k2543
$$ plain form
40988 34636 44528 72121 94704 93528 65402 31081 23778 56551 104563 131252 128919 121253 130058
40975 130058 156453 193783 237627 275873 288426 270682 244203 229646 219405 193620 156670
40964 156670 138099 155054 189231 208313 200869 181940 169702 166523 163596 155915 147044 143307 149953
40951 149953 169788 195466 204876 180788 141302 132091 172114 221652 227148 188702 156089 161679
40939 161679 188698 209432 219676 220128 197035 149688 114814 130065 182426 221992 222836 203842
40927 203842 191047 186886 182133 174903 167553 160821 159918 173357 197574 213778 207758 184376 157898
40914 157898 138550 133798 149797 180604 204774 205381 190023 180667 185509 190856 181831 162128 148250
40901 148250 148848 156108 157846 153252 153010 165766 189082 213627 230608 233187 217576 189057 162808
$$ packed form
40988C4636R892K7593K2583j176k8126l4321p303L2773M8012K6689k333p666Q805
40975A30058K6395L7330M3844L8246J2553j7744k6479j4557j0241k5785l6950
40964A56670j8571J6955L4177J9082p444j8929j2238l179k927p681q871l737O646
40951A49953J9835K5678R410k4088l9486r211M0023M9538N496l8446l2613N590
40939A61679K7019K0734J0244M52k3093m7347l4874J5251N2361L9566Q44j8994
40927B03842j2795m161m753p230p350o732r03J3439K4217J6204o020k3382k6478
40914A57898j9348m752J5999L0807K4170O07j5358r356M842N347r025j9703j3878
40901A48250N98P260J738m594k42J2756K3316K4545J6981K579j5611k8519k6249
$$ plain form
40888 162808 151152 151079 150429 144965 141804 145395 148369 141155 126302 117459 124303 142352 160057 174157
40874 174157 192887 220962 246522 251636 235374 216918 213082 222209 234488 246369 255373 251801
40862 251801 231455 211494 215637 241177 255693 233387 184780 143253 129507 137333 149887 160014
40850 160014 171682 186438 195224 187275 164890 143524 136193 143562 160658 184264 208212 221015
40838 221015 218676 213947 221830 239871 253428 256012 252177 244569 233491 227393 236383 253666 261060
40825 261060 256799 258662 271677 273295 245948 207286 186801 182956 168299 134998 110054 117011
40813 117011 141659 150474 133149 111170 106235 114652 119339 118535 130069 164624 204977 222876 214200
40800 214200 204323 214056 232405 233544 212228 188055 178576 184140 199097 219285 232047 218097
$$ packed form
40888A62808j1656p3o50n464l161L591K974p214j4853q843O844J8049J7705J4100
40874A74157J8730K8075K5560N114j6262j8456l836R127J2279J1881R004l572
40862B51801k0346j9961M143K5540J4516k2306m8607m1527j3746P826J2554J0127
40850A60014J1668J4756Q786p949k2385k1366p331P369J7096K3606K3948J2803
40838B21015k339m729P883J8041J3557K584l835p608j1078o098Q990J7283P394
40825B61060m261J863J3015J618k7347l8662k0485l845j4657l3301k4944O957
40813A17011K4648Q815j7325k1979m935Q417M687q04J1534L4555M0353J7899q676
40800B14200r877R733J8349J139k1316k4173r479N564J4957K0188J2762j3950
$$ plain form
40788 218097 178783 147964 156149 188964 202649 179364 144272 124992 120926 124880 146873 189303
40776 189303 216791 187708 115100 63755 77214 131973 174699 181742 166796 150937 147624 164965
40764 164965 198968 227347 227715 201845 170604 148707 136135 129378 127390 128895 135025 150204 169322
40751 169322 172399 149173 123375 131693 178509 230521 257728 260247 251182 234695 211617 189869
40739 189869 175808 165211 153024 143743 143964 152084 161476 166301 160784 143720 128195 133275 157971
40726 157971 176446 169992 152704 152490 174499 196892 198963 182050 163824 159429 167445 171739 161128
40713 161128 146741 149329 167871 176901 162646 144470 145976 159559 159518 141919 130557 145261 180481
40700 180481 213831 222842 198548 158882 143505 174535 222743 233657 190242 129696 94804 93001
$$ packed form
40788B18097l9314l0819Q185L2815J3685k3285l5092j9280m066L954K1993M2430
40776A89303K7488k9083p2608n1345J3459N4759M2726P043j4946j5859l313J7341
40764A64965L4003K8379L68k5870l1241k1897j2572o757j988J505O130J5179J9118
40751A69322L077k3226k5798Q318M6816N2012K7207K519r065j6487k3078k1748
40739A89869j4061j0597j2187r281K21Q120R392M825n517j7064j5525N080K4696
40726A57971J8475o454j7288k14K2009K2393K071j6913j8226m395Q016M294j0611
40713A61128j4387K588J8542R030j4255j8176J506J3583m1j7599j1362J4704L5220
40700A80481L3350R011k4294l9666j5377L1030M8208J0914m3415o0546l4892j803
$$ plain form
40688 93001 113358 156562 223129 287592 314834 301826 279829 270830 262201 234301 196109 176366
40676 176366 186773 211209 230682 242620 250474 249983 239256 233246 249860 281162 294453 268528
40664 268528 217632 172130 145289 128726 113017 100745 101189 120540 155776 192641 213949 216251
40652 216251 212633 212012 205157 184498 168839 186027 229834 256894 237984 196224 178627 199243
40640 199243 228319 235398 224747 220212 227130 224968 198725 163906 148342 154190 154720 134490 117276
40627 117276 138292 195279 245366 252882 226641 204617 211203 234934 242171 209853 150391 104928
40615 104928 105391 144032 188126 219650 244692 265981 270165 251946 230037 223228 226147 225987 228488
40602 228488 244620 261218 251453 213507 175452 159073 159668 165362 174939 188593 199851 206470 213317
$$ packed form
40688I3001K0357M3204O6567O4463K7242j3008k1997q999q629k7900l8192j9743
40676A76366J0407K4436J9473J1938P854m91j0727o010J6614L1302J3291k5925
40664B68528n0896m5502k6841j6563j5709j2272M44J9351L5236L6865K1308K302
40652B16251l618o21o855k0659j5659J7188M3807K7060j8910m1760j7597K0616
40640A99243K9076P079j0651m535O918k162k6243l4819j5564N848N30k0230j7214
40627A17276K1016N6987N0087P516k6241k2024O586K3731P237l2318n9462m5463
40615A04928M63L8641M4094L1524K5042K1289M184j8219k1909o809K919j60K501
40602B28488J6132J6598r765l7946l8055j6379N95N694R577J3654J1258O619O847
$$ plain form
40589 213317 216508 203967 182931 184438 220270 253792 240585 187719 144526 139443 155684 170371
40577 170371 185563 208284 226006 221253 195209 161345 129235 109125 117020 154601 193673 202167
40565 202167 181774 161252 156344 157088 154020 153501 159622 160429 144881 121577 108922 114345 132146
40552 132146 154163 173056 181558 179404 178100 189137 207640 214759 197146 160110 122230 100867
40540 100867 102098 120386 146128 173820 202775 231316 253855 264651 262105 249375 233460 222243
40528 222243 217621 212465 200456 188416 190679 208926 225201 219278 188201 146583 113743 102830
40516 102830 114740 136989 152481 152946 141411 123564 104923 95129 101693 116237 121124 116128 122858
40503 122858 151221 176592 168735 134743 113152 127871 165803 199638 214453 208534 186667 163223
$$ packed form
40589B13317L191j2541k1036J507L5832L3522j3207n2866m3193n083J6241J4687
40577A70371J5192K2721J7722m753k6044l3864l2110k0110P895L7581L9072Q494
40565B02167k0393k0522m908P44l068n19O121Q07j5548k3304j2655N423J7801
40552A32146K2017J8893Q502k154j304J1037J8503P119j7613l7036l7880k1363
40540A00867J231J8288K5742K7692K8955K8541K2539J0796k546j2730j5915j1217
40528B22243m622n156j2009j2040K263J8247J6275n923l1077m1618l2840j0913
40516A02830J1910K2249J5492M65j1535j7847j8641r794O564J4544M887m996O730
40503A22858K8363K5371p857l3992k1591J4719L7932L3835J4815n919k1867k3444
$$ plain form
40491 163223 158969 180690 208520 215328 199444 189835 214456 267058 311516 320544 303796 290277
40479 290277 287234 271086 224137 165985 134416 141350 162402 169367 160095 153104 162714 185597 207433
40466 207433 217560 216391 209185 195910 173908 150930 144677 161678 184002 186640 164123 132366
40454 132366 109519 104037 116669 142905 174202 203721 228206 240016 226816 189752 153558 144254
40442 144254 161021 182323 194151 198262 198337 194849 191330 191313 192659 197819 219678 257142 276219 245756
40428 245756 187940 158425 172949 191240 184789 179362 204149 233490 217948 154862 90454 60774
40416 60774 64889 91918 138112 190320 222367 221865 202626 181167 158141 132875 118589 126430
40404 126430 143857 146097 127719 109905 113733 135693 155807 164746 173479 194286 220990 236194
$$ packed form
40491A63223m254K1721K7830O808j5884r609K4621N2602M4458R028j6748j3519
40479B90277l043j6148m6949n8152l1569O934K1052O965r272o991R610K2883K1836
40466B07433J0127j169p206j3275k2002k2978o253J7001K2324K638k2517l1757
40454A32366k2847n482J2632K6236L1297K9519K4485J1810j3200l7064l6194r304
40442A44254J6767K1302J1828M111P5l488l519j7J346N160K1859L7464J9077l0463
40428B45756n7816k9515J4524J8291o451n427K4787K9341j5542o3086o4408k9680
40416F0774M115K7029M6194N2208L2047n02j9239k1459k3026k5266j4286P841
40404A26430J7427K240j8378j7814L828K1960K0114Q939Q733K0807K6704J5204
$$ plain form
40392 236194 233543 222052 210107 198804 193653 206908 238274 265450 267345 249635 234837 232982
40380 232982 235411 233230 227166 219790 211105 202780 195754 183668 160598 135740 126681 134966 142626
40367 142626 139494 140216 163095 202504 236194 253585 261529 264734 258262 243567 235290 241400 249507
40354 249507 248170 252042 283603 330783 348038 310572 247436 204237 189930 183204 178451 193019
40342 193019 228320 255727 254223 238645 233443 235570 222877 188869 150279 124873 116931 121930
40330 121930 133184 145674 162217 191284 229530 253956 245431 215655 195131 195383 199369 191911
40318 191911 182067 184958 194497 191620 177104 177806 210431 250534 255680 219431 183024 183482 207391
40305 207391 214736 195422 175064 169362 164955 152875 150573 173435 207418 230044 240626 249110
$$ packed form
40392B36194k651j1491j1945j1303n151J3255L1366K7176J895j7710j4798j855
40380B32982K429k181o064p376q685q325p026j2086k3070k4858r059Q285P660
40367A42626l132P22K2879L9409L3690J7391P944L205o472j4695q277O110Q107
40354B49507j337L872L1561M7180J7255l7466o3136m3199j4307o726m753J4568
40342A93019L5301K7407j504j5578n202K127j2693l4008l8590k5406p942M999
40330A21930J1254J2490J6543K9067L8246K4426q525k9776k0524K52L986p458
40318A91911r844K891R539k877j4516P02L2625M0103N146l6249l6407M58K3909
40305B07391P345j9314k0358n702m407j2080k302K2862L3983K2626J0582Q484
$$ plain form
40293 249110 251264 239062 224256 226215 241571 248080 235576 214497 198174 195071 212454 246155
40281 246155 270410 260935 227992 205035 203838 203258 186111 164795 161533 180196 206851 225784
40269 225784 228244 215526 197581 180465 156975 121829 91969 93277 126840 166991 194464 212363
40257 212363 227269 236829 242746 254495 269879 270754 249892 226016 220370 232185 247420 257545
40245 257545 259802 253733 248165 256755 275177 277586 247924 200147 155723 118510 87078 73001
40233 73001 84710 106780 118880 125501 143095 166013 172056 158645 146425 145606 145585 144262 161164
40220 161164 206819 258310 282838 274243 250774 225542 196419 162803 136552 130816 145072 166087
40208 166087 182270 195330 216467 248992 276951 278398 251623 219105 200229 190905 181127 180917
$$ packed form
40293B49110K154j2202j4806J959J5356O509j2504k1079j6323l103J7383L3701
40281B46155K4255r475l2943k2957j197n80j7147k1316l262J8663K6655J8933
40269B25784K460j2718j7945j7116k3490l5146k9860J308L3563M0151K7473J7899
40257B12363J4906R560N917J1749J5384Q75k0862k3876n646J1815J5235J0125
40245B57545K257o069n568Q590J8422K409k9662m7777m4424l7213l1432j4077
40233G3001J1709K2070J2100O621J7594K2918O043j3411j2220q19k1j323J6902
40220A61164M5655N1491K4528q595k3469k5232k9123l3616k6251n736J4256K1015
40208A66087J6183J3060K1137L2525K7959J447k6775l2518j8876r324r778k10
$$ plain form
40196 180917 206132 240692 242244 199202 157772 167939 218971 258378 264395 262157 268170 262102
40184 262102 229893 195802 183660 177603 155492 135217 145553 168830 161626 127398 118822 161278
40172 161278 219518 253755 266127 271495 262632 233720 206115 197011 186531 151017 111146 109609
40160 109609 149268 188010 193777 175596 158317 152362 154052 155792 149170 131807 115043 113961 129358
40147 129358 150239 171778 197231 223126 237654 237150 232727 236237 246737 253077 244808 220649 190928
40134 190928 171025 169805 186207 214678 243906 251274 217804 158299 119356 131511 174941 206809
40122 206809 209228 192965 168670 140543 121778 128687 156726 182523 192095 189623 177787 150175
40110 150175 109949 79796 83211 122630 178798 224580 240325 226137 201427 186812 187406 196110
$$ packed form
40196A80917K5215L4560J552m3042m1430J0167N1032L9407O017k238O013o068
40184B62102l2209l4091j2142o057k2111k0275J0336K3277p204l4228q576M2456
40172A61278N8240L4237J2372N368q863k8912k7605r104j0480l5514l9871j537
40160A09609L9659L8742N767j8181j7279n955J690J740o622j7363j6764j082J5397
40147A29358K0881K1539K5453K5895J4528n04m423L510J0500O340q269k4159k9721
40134A90928j9903j220J6402K8471K9228P368l3470n9505l8943J2155M3430L1868
40122B06809K419j6263k4295k8127j8765O909K8039K5797R572k472j1836k7612
40110A50175m0226l0153L415L9419N6168M5782J5745j4188k4710j4615N94Q704
$$ plain form
40098 196110 204061 201685 183805 165880 178219 224007 259036 241315 190670 166802 192424 232421
40086 232421 250078 246561 235448 215722 190630 183771 209834 246779 259554 239499 204195 172840
40074 172840 158126 166652 187896 196590 186825 190874 239482 312124 354300 342786 307728 286593
40062 286593 281641 273756 256945 240706 229690 220524 216112 225870 247686 262851 257572 241164 231892
40049 231892 229423 215445 183491 154636 155543 188289 228042 244030 219498 162678 106152 84240
40037 84240 100504 126510 139403 143955 145564 125906 73825 23584 24581 76650 131665 161311
40025 161311 185680 225110 261533 268816 253038 238565 234190 234536 237582 239844 229455 204774 186836
40012 186836 193212 210975 214990 202544 190679 188921 194107 203841 215745 220572 214945 214165 232631
$$ packed form
40098A96110P951k376j7880j7925J2339M5788L5029j7721n0645k3868K5622L9997
40086B32421J7657l517j1113j9726k5092o859K6063L6945J2775k0055l5304l1355
40074A72840j4714Q526K1244Q694r765M049M8608P2642M2176j1514l5058k1135
40062B86593m952p885j6811j6239j1016r166m412R758K1816J5165n279j6408r272
40049B31892k469j3978l1954k8855R07L2746L9753J5988k4532n6820n6526k1912
40037H4240J6264K6006J2893M552J609j9658n2081n0241R97N2069N5015K9646
40025A61311K4369L9430L6423P283j5778j4473m375L46L046K262j0389k4681j7938
40012A86836O376J7763M015j2446j1865j758N186R734J1904M827n627p80J8466
$$ plain form
39999 232631 256530 256267 225155 189327 179428 203997 246042 273776 262554 221295 189740 194489
39987 194489 217781 226913 220026 216584 215291 197902 171931 168789 190154 195440 163401 132743 150412
39974 150412 201637 227909 206677 178738 191803 243455 291771 305001 286364 258729 239690
39963 239690 232835 235191 247153 272614 308430 336655 334126 294450 238494 198358 189969 203656
39951 203656 220363 230860 236707 239950 240253 239036 237497 231725 219135 209115 215280 234560 246851
39938 246851 241474 231505 233079 242780 248091 248973 251072 243957 208325 148008 95978 79312 91227
39925 91227 108573 126436 159083 208174 246711 244792 204920 160557 140152 143849 158900 183388
39913 183388 220759 260022 282108 286903 295268 318093 339228 337201 309571 266756 216680 168053
$$ packed form
39999B32631K3899k63l1112l5828r899K4569M2045K7734j1222m1259l1555M749
39987A94489K3292R132o887l442j293j7389k5971l142K1365N286l2039l0658J7669
39974A50412N1225K6272k1232k7939J3065N1652M8316J3230j8637k7635j9039
39963B39690o855K356J1962K5461L5816K8225k529l9676n5956m0136q389J3687
39951B03656J6707J0497N847L243L03j217j539n772j2590j0020O165J9280J2291
39938B46851n377r969J574R701N311Q82K099p115l5632o0317n2030j6666J1915
39925I1227J7346J7863L2647M9091L8537j919l9872m4363k0405L697J5051K4488
39913A83388L7371L9263K2086M795Q365K2825K1135k027k7630m2815n0076m8627
$$ plain form
39901 168053 135545 126035 128840 133617 148164 181888 219882 233258 213698 182392 165815 174795
39889 174795 203244 233187 244327 232986 218852 220431 230798 234212 237560 259641 291855 299797
39877 299797 271855 239346 234146 248734 256664 253954 255544 260402 247271 208058 164735 142859
39865 142859 140399 135725 122403 121914 155577 212569 258498 274924 276421 283209 291888 287108 271725
39852 271725 265548 275294 283423 270799 237709 198993 170083 161249 172865 189467 188565 164203 136480
39839 136480 130926 151770 180611 198986 206902 217041 232178 234934 209190 170417 158776 192873
39827 192873 243806 269345 262922 251192 252990 264520 281118 305709 329502 328777 294748 251520
39815 251520 231244 240256 258198 262155 244684 215932 194872 193702 207590 223103 233762 239867
$$ packed form
39901A68053l2508r510K805M777J4547L3724L7994J3376j9560l1306j6577Q980
39889A74795K8449K9943J1140j1341j4134J579J0367L414L348K2081L2214P942
39877B99797k7942l2509n200J4588P930k710J590M858j3131l9213m3323k1876
39865A42859k460m674j3322m89L3663N6992M5929J6426J497O788Q679m780j5383
39852B71725o177R746Q129j2624l3090l8716k8910q834J1616J6602r02k4362k7723
39839A36480n554K0844K8841J8375P916J0139J5137K756k5744l8773j1641L4097
39827A92873N0933K5539o423j1730J798J1530J6598K4591K3793p25l4029m3228
39815B51520k0276R012J7942L957j7471k8752k1060j170J3888J5513J0659O105
$$ plain form
39803 239867 238585 226967 210638 195264 174693 145143 124854 135328 165333 181491 176758 177688
39791 177688 196564 210145 201500 190511 199100 213118 207406 188396 180914 185957 181665 159149 131520
39778 131520 112585 108638 123889 150664 161879 140102 110372 116352 162926 208952 221398 211473
39766 211473 208674 222069 241011 257418 271097 280925 283434 277797 265998 250065 231644 212258
39754 212258 194420 184359 188530 202035 207441 194482 175276 169083 177000 183899 180524 169609 154066
39741 154066 135676 124868 135234 165390 199284 226193 247965 266027 275479 274444 266438 252089
39729 252089 231775 216279 217897 228781 226842 208581 196773 206658 223386 226075 217789 215635 224067
39716 224067 235100 244757 251265 245140 221473 198465 202694 233724 261527 264677 255516 258686 277046
$$ packed form
39803B39867j282j1618j6329j5374k0571k9550k0289J0474L0005J6158m733R30
39791A77688J8876J3581q645j0989Q589J4018n712j9010p482N043m292k2516k7629
39778A31520j8935l947J5251K6775J1215k1777k9730N980M6574M6026J2446r925
39766B11473k799J3395J8942J6407J3679R828K509n637j1799j5933j8421j9386
39754B12258j7838j0061M171J3505N406j2959j9206o193P917O899l375j0915j5543
39741A54066j8390j0808J0366L0156L3894K6909K1772J8062R452j035q006j4349
39729B52089k0314j5496J618J0884j939j8261j1808R885J6728K689q286k154Q432
39716B24067J1033R657O508o125k3667k3008M229L1030K7803L150r161L170J8360
$$ plain form
39703 277046 291040 285782 266813 248873 237316 224678 203475 178776 164669 166931 173292 166536
39691 166536 145591 126468 122106 129816 141159 153960 167392 174479 171409 168870 180020 198899
39679 198899 206349 199356 197195 210606 221550 207856 175141 145561 123202 93944 59758 49378
39667 49378 84262 149205 208844 243815 259205 263812 254001 219904 162407 101762 67438 75202
39655 75202 114009 158458 190696 204851 198403 174921 153201 155243 180822 208958 227260 241001
39643 241001 248038 229584 182293 139234 135364 163162 184996 182450 170658 166616 166802 161677 155525
39630 155525 163173 194023 241934 285880 303153 289072 259941 229498 190399 131351 65175 22063
39618 22063 16159 35357 65385 106727 160909 213431 242066 239380 221191 211586 218506 224492 207404
$$ packed form
39703B77046J3994n258j8969j7940j1557j2638k1203k4699j4107K262O361o756
39691A66536k0945j9123m362P710J1343J2801J3432P087l070k539J1150J8879
39679A98899P450o993k161J3411J0944j3694l2715k9580k2359k9258l4186j0380
39667D9378L4884O4943N9639L4971J5390M607r811l4097n7497o0645l4324P764
39655G5202L8807M4449L2238J4155o448k3482k1720K042K5579K8136J8302J3741
39643B41001P037j8454m7291m3059l870K7798K1834k546j1792m042J86n125o152
39630A55525P648L0850M7911M3946J7273j4081k9131l0443l9099n9048o6176m3112
39618B2063n904J9198L0028M1342N4182N2522K8635k686j8189r605O920N986j7088
$$ plain form
39605 207404 171555 147364 153965 175590 187502 192445 212195 250864 288537 308704 310202 291638
39593 291638 248008 190924 152149 153185 182279 212285 232935 255402 290111 329351 352127 343169
39581 343169 307095 263457 227889 202126 182441 167652 154075 135531 118533 124236 160318 202839
39569 202839 224319 228725 236450 245249 235811 212831 207812 234391 268552 283010 277365 263876 246977
39556 246977 230859 226917 236914 242732 226425 189179 142561 96893 67072 70000 100987 128699
39544 128699 130045 117451 116908 132635 150013 160443 163897 157079 140461 131184 147250 179440 197583
39531 197583 187057 163762 149965 150011 156242 166448 183866 204548 216743 217066 220818 247657 296391
39518 296391 341865 360994 355078 340715 326543 308363 281693 249298 220284 208458 222345 247516
$$ packed form
39605B07404l5849k4191O601K1625J1912M943J9750L8669L7673K0167J498j8564
39593B91638m3630n7084l8775J036K9094L0006K0650K2467L4709L9240K2776q958
39581C43169l6074m3638l5568k5763j9685j4789j3577j8544j6998N703L6082M2521
39569B02839K1480M406P725Q799r438k2980n019K6579L4161J4458n645j3489j6899
39556B46977j6118l942R997N818j6307l7246m6618m5668k9821K928L0987K7712
39544A28699J346j2594n43J5727J7378J0430L454o818j6618r277J6066L2190J8143
39531A97583j0526k3295j3797M6O231J0206J7418K0682J2195L23L752K6839M8734
39518B96391M5474J9129n916j4363j4172j8180k6670l2395k9014j1826J3887K5171
$$ plain form
39506 247516 252193 225528 196154 192917 203150 197496 180868 180751 192989 184388 152188 134741 150546
39493 150546 170762 171959 174647 202709 240964 264189 277661 296109 309062 301615 287446 286355
39481 286355 287658 270603 245250 238250 250747 263896 274758 293149 312408 316727 310536 309450
39469 309450 309787 298711 286562 294490 314312 314811 286857 251467 225878 212962 219668 249136 274106
39456 274106 256715 202368 160279 161616 188146 210510 224278 233778 230551 208835 183081 172215
39444 172215 178144 189660 196706 196798 199171 221080 264844 304488 316049 313267 325042 344339 336694
39431 336694 300790 279966 301352 338631 351189 330578 293180 255402 231864 231257 238373 225324
39419 225324 192381 168307 158858 133616 86065 66974 121654 221980 299822 329245 337250 346011
$$ packed form
39506B47516M677k6665k9374l237J0233n654j6628j17J2238q601l2200j7447J5805
39493A50546K0216J197K688K8062L8255K3225J3472J8448J2953p447j4169j091
39481B86355J303j7055k5353p000J2497J3149J0862J8391J9259M319o191j086
39469C09450L37j1076j2149P928J9822M99k7954l5390k5589j2916O706K9468K4970
39456B74106j7391n4347m2089J337K6530K2364J3768R500l227k1716k5754j0866
39444A72215N929J1516P046R2K373K1909M3764L9644J1561k782J1775J9297p645
39431C36694l5904k0824K1386L7279J2558k0611l7398l7778k3538o07P116j3049
39419B25324l2943k4074r449k5242m7551j9091N4680J00326P7842K9423Q005Q761
$$ plain form
39407 346011 344925 320136 280586 248411 240739 260973 294493 316467 314862 299429 281263 258174
39395 258174 230270 210990 207623 209693 212705 231531 269996 301030 303670 297485 308638 322432
39383 322432 308132 275937 265379 282837 294791 285558 278980 292166 305973 299256 282687 278480
39371 278480 287875 296832 298165 293093 283426 273594 269599 268932 264182 261315 277135 310543 334585 330384
39357 330384 314420 315939 336183 346466 324728 282017 250122 247481 259603 255584 225806 196398
39345 196398 197042 220448 229551 204761 166817 147398 152755 166410 175967 183878 196191 211915 224983
39332 224983 232368 238759 252382 274562 295834 305837 303646 293778 277578 256440 238334 230897
39320 230897 231440 232993 234670 235501 227362 211370 212542 252509 309140 332328 306652 270071 257866
$$ packed form
39407C46011j086k4789l9550l2175p672K0234L3520K1974j605j5433j8166k3089
39395B58174k7904j9280l367K070L012J8826L8465L1034K640o185J1153J3794
39383C22432j4300l2195j0558J7458J1954r233o578J3186J3807o717j6569m207
39371B78480R395Q957J333n072r667r832l995o67m750k867J5820L3408K4042m201
39357C30384j5964J519K0244J0283k1738m2711l1895k641J2122m019k9778k9408
39345A96398O44K3406R103k4790l7944j9419N357J3655R557P911J2313J5724J3068
39332B24983P385O391J3623K2180K1272J0003k191r868j6200k1138j8106p437
39320B30897N43J553J677Q31q139j5992J172L9967N6631K3188k5676l6581j2205
$$ plain form
39307 257866 257112 239174 212403 209469 234572 258227 263665 266010 277384 281811 262583 235094 230007
39294 230007 252040 276010 282517 279311 282433 290918 290873 276915 257360 239332 219633 194965 174546
39281 174546 174255 196854 222732 226045 202264 176052 176010 202724 230048 239446 241059 252998 272571
39268 272571 284193 287529 295576 305311 294508 256347 216641 202860 211107 218092 212904 201265 189332
39255 189332 181213 185986 210073 245316 277187 300192 313587 310112 285657 255220 241451 247813
39243 247813 257129 255160 241950 222386 201470 189886 200366 234538 279468 314851 320073 287426
39231 287426 240910 226949 265492 321432 347809 345348 348664 363252 358027 324426 300163 316373
39219 316373 355162 382214 393484 403487 409364 396044 364663 329968 296825 260569 224786 199962
$$ packed form
39307B57866p54j7938k6771k934K5103K3655N438K345J1374M427j9228k7489n087
39294B30007K2033K3970O507l206L122Q485m5j3958j9555j8028j9699k4668k0419
39281A74546k91K2599K5878L313k3781k6212m2K6714K7324R398J613J1939J9573
39268B72571J1622L336Q047R735j0803l8161l9706j3781Q247O985n188j1639j1933
39255A89332q119M773K4087L5243L1871K3005J3395l475k4455l0437j3769O362
39243B47813R316j969j3210j9564k0916j1584J0480L4172M4930L5383N222l2647
39231B87426m6516j3961L8543N5940K6377k461L316J4588n225l3601k4263J6210
39219C16373L8789K7052J1270J0003N877j3320l1381l4695l3143l6256l5783k4824
$$ plain form
39207 199962 188526 186337 194321 215473 245250 275299 299475 307967 288907 249097 219116 220122
39195 220122 237202 244297 242955 252158 269009 269124 245740 220328 208476 200432 186477 179728 196254
39182 196254 225505 239373 227436 209010 208030 225137 240523 241232 237575 247311 268601 279800 267372
39169 267372 242251 223495 217850 223899 243567 274994 302080 307430 293536 279113 277066 286339
39157 286339 300809 314196 319961 317822 316683 321708 326691 331057 351473 395790 434997 427722 370283
39144 370283 297247 235099 186361 161370 186040 258284 327323 343880 312688 271874 238771
39133 238771 205020 172827 162321 181736 215262 244440 263286 271350 270775 272222 284903 297582
39121 297582 288772 260971 244390 256977 280001 287644 283976 290529 307947 313946 298630 280575
$$ packed form
39207A99962j1436k189P984K1152K9777L0049K4176Q492j9060l9810k9981J006
39195B20122J7080P095j342R203J6851J15k3384k5412j1852q044j3955o749J6526
39182A96254K9251J3868j1937j8426r80J7107J5386P09l657R736K1290J1199j2428
39169B67372k5121j8756n645O049J9668L1427K7086N350j3894j4423k047R273
39157B86339J4470J3387N765k139j139N025M983M366K0416M4317L9207p275n7439
39144C70283p3036o2148m8738k4991K4670P2244O9039J6557l1192m0814l3103
39133B38771l3751l2193j0506J9415L3526K9178J8846Q064n75J447J2681J2679
39121B97582q810k7801j6581J2587K3024P643l668O553J7418N999j5316j8055
$$ plain form
39109 280575 281052 297232 310427 311162 305361 300650 297606 295637 299468 314292 335930 349725 341283
39096 341283 308318 262132 219859 197459 206050 244704 292145 314882 296142 255858 231204 236033
39084 236033 250481 253086 247811 248349 249603 235885 214075 214869 252266 299608 320219 309672 290255
39071 290255 272107 244011 205122 181120 193189 225981 245950 244079 239600 243467 242405 227387
39059 227387 215913 227787 251956 259010 241741 222548 220110 228731 236601 247102 270885 307514
39047 307514 344900 369899 373364 354035 324887 306710 307219 314010 313949 308546 302475 290278 266732
39034 266732 238735 213493 186750 157844 142688 151007 162397 150672 124562 116128 132667 151412
39022 151412 163212 187310 232639 275535 291900 285957 270674 244394 206691 175244 164242 163920
$$ packed form
39109B80575M77J6180J3195P35n801m711l044j969L831J4824K1638J3795q442
39096C41283l2965m6186m2273k2400Q591L8654M7441K2737j8740m0284k4654M829
39084B36033J4448K605n275N38J254j3718k1810P94L7397M7342K0611j0547j9417
39071B90255j8148k8096l8889k4002J2069L2792J9969j871m479L867j062j5018
39059B27387j1474J1874K4169P054j7269j9193k438Q621P870J0501K3783L6629
39047C07514L7386K4999L465j9329k9148j8177N09O791o1n403o071j2197k3546
39034B66732k7997k5242k6743k8906j5156Q319J1390j1725k6110q434J6539J8745
39022A51412J1800K4098M5329M2896J6365n943j5283k6280l7703l1447j1002l22
$$ plain form
39010 163920 163296 174709 210191 249977 264800 259289 262646 281994 296093 295090 296975 319220 357702
38997 357702 398470 428778 433114 402125 352810 318502 310699 310803 306684 313353 343865 381951 402794
38984 402794 404716 400311 389971 367624 344289 340060 352185 353335 327407 289279 260600 241440
38972 241440 219745 199639 202437 237455 284664 314395 318645 314561 318761 327461 325716 310036 294777
38959 294777 296405 315529 336325 343785 340878 344984 363788 379404 365619 319592 265385 225483
38947 225483 202743 193845 201942 223718 240345 240674 243758 276935 334661 378785 381225 351503 321334
38934 321334 315078 334362 357601 355024 317801 271457 247929 249291 255224 258277 266419 274185 263251
38921 263251 237955 229113 249606 274400 280605 278671 281944 273643 236210 193205 184135 206461 219438
$$ packed form
39010A63920o24J1413L5482L9786J4823n511L357J9348J4099j003J885K2245L8482
38997C57702M0768L0308M336l0989m9315l4308p803J04m119O669L0512L8086K0843
38984D02794J922m405j0340k2347k3335m229J2125J150k5928l8128k8679j9160
38972B41440k1695k0106K798L5018M7209K9731M250m084M200Q700j745j5680j5259
38959B94777J628J9124K0796P460k907M106J8804J5616j3785m6027n4207l9902
38947B25483k2740q898Q097K1776J6627L29L084L3177N7726M4124K440k9722l0169
38934C21334o256J9284K3239k577l7223m6344k3528J362N933L053Q142P766j0934
38921B63251k5296q842K0493K4794O205j934L273q301l7433m3005r070K2326J2977
$$ plain form
38908 219438 204693 187952 193798 210158 212301 198782 185475 178186 168528 151047 132329 124750
38896 124750 136080 161986 187102 198676 199403 200410 203792 202820 198510 201647 214515 224190 221103
38883 221103 213224 213650 223043 232728 237972 240054 240801 241943 244833 245899 239432 229819 231029 245602
38869 245602 254560 241038 216470 207944 222979 242360 247774 241795 238234 246541 270068 306881 345574
38856 345574 370445 377324 375530 369695 352008 320205 289624 274500 268983 263464 269916 307800 366434
38843 366434 405398 399069 361746 321089 287101 260911 253967 273856 299986 299898 271951 250189
38831 250189 259359 282925 288018 269488 253056 259872 284473 309832 329254 343394 344817 321876
38819 321876 280314 247399 244674 263922 281380 290150 302505 320281 322820 295121 254063 230999
$$ packed form
38908B19438j4745j6741N846J6360K143j3519j3307p289r658j7481j8718p579
38896A24750J1330K5906K5116J1574P27J007L382r72m310L137J2868R675l087
38883B21103p879M26R393R685N244K082P47J142K890J066o467r613J210J4573
38869B45602Q958j3522k4568q526J5035J9381N414n979l561Q307K3527L6813L8693
38856C45574K4871O879j794n835j7687l1803l0581j5124n517n519O452L7884N8634
38843C66434L8964o329l7323m0657l3988k6190o944J9889K6130q8k7947k1762
38831B50189R170K3566N093j8530j6432O816K4601K5359J9422J4140J423k2941
38819C21876m1562l2915k725J9248J7458Q770J2355J7776K539k7699m1058k3064
$$ plain form
38807 230999 234199 242432 233614 208341 185491 183504 205333 234710 249490 245532 242959 260323 288849
38794 288849 304710 301560 294714 295294 299259 304705 319774 343600 355879 339677 305095 277633 270496
38781 270496 280300 302523 334433 363267 367380 337039 287803 247676 233189 239973 253205 263259
38769 263259 270778 277936 277580 256389 212920 168326 148548 152520 149825 122355 99568 128730 206328
38756 206328 267290 263125 228348 235706 297909 356727 370361 362296 364804 362325 329523 290223
38744 290223 288826 320971 340991 330264 312319 302967 291969 278325 278624 290000 286868 268464
38732 268464 268942 301835 333001 331375 311463 300601 297530 291508 290755 299454 294365 259652 221683
38719 221683 212838 221081 213501 192302 186140 198183 205862 206953 224238 262692 297954 311053 304615
$$ packed form
38807B30999L200Q233q818k5273k2850j987K1829K9377J4780l958k573J7364K8526
38794B88849J5861l150o846N80L965N446J5069K3826J2279j6202l4582k7462p137
38781B70496R804K2223L1910K8834M113l0341m9236m0127j4487O784J3232J0054
38769B63259P519P158l56k1191m3469m4594j9778L972k695k7470k2787K9162P7598
38756B06328O0962m165l4777P358O2203N8818J3634q065K508k479l2802l9300
38744B90223j397L2145K0020j0727j7945r352j0998j3644K99J1376l132j8404
38732B68464M78L2893L1166j626j9912j0862l071o022p53Q699n089l4713l7969
38719B21683q845Q243p580k1199o162J2043P679J091J7285L8454L5262J3099o438
$$ plain form
38706 304615 284507 256142 238319 247887 269375 272483 260400 264518 288542 299743 286925 284504
38694 284504 317401 358381 367582 346139 322136 306481 292444 281647 280563 281595 273428 262544
38682 262544 262526 270308 274947 282218 306675 342731 366146 364297 345846 320627 290104 260966 248705
38669 248705 258490 275031 279905 270667 257367 249425 253208 274430 312111 352085 375348 374611 357862
38656 357862 335438 310330 284382 266468 264968 273715 275075 259042 231976 205869 189326 191153
38644 191153 218139 260496 292330 298352 289414 280378 267648 246820 237486 262099 305857 327695
38632 327695 313186 288447 275842 264704 238944 208826 196998 209558 236737 268159 293792
38621 293792 304346 304819 313415 332896 339034 314732 279161 260425 253249 232476 201279 192708 218724
$$ packed form
38706C04615k0108k8365j7823R568K1488L108j2083M118K4024J1201j2818k421
38694B84504L2897M0980R201k1443k4003j5655j4037j0797j084J032q167j0884
38682B62544j8P782M639P271K4457L6056K3415j849j8451k5219l0523k9138j2261
38669B48705R785J6541M874r238j3300p942L783K1222L7681L9974K3263p37j6749
38656C57862k2424k5108k5948j7914j500Q747J360j6033k7066k6107j6543J827
38644A91153K6986M2357L1834O022q938r036j2730k0828r334K4613M3758K1838
38632C27695j4509k4739j2605j1138k5760l0118j1828J2560K7179L1422K5633
38621B93792J0554M73Q596J9481O138k4302l5571j8736p176k0773l1197q571K6016
$$ plain form
38608 218724 247849 247978 228987 222688 234656 240503 227960 219376 241830 288624 325786 331787 314687
38595 314687 289001 254253 208244 168308 160688 191226 240231 284529 312519 321840 318502 316928
38583 316928 324243 325963 306545 282674 289323 325678 343300 305919 239580 201667 214782 252858
38571 252858 281192 286523 273037 252118 238791 242720 259119 276678 292088 307745 319747 320067
38559 320067 308835 294343 281693 268671 250840 225999 198901 185493 202014 241401 271394
38548 271394 268391 245047 232230 241960 261656 276848 283370 282293 279377 287338 313947 348321 370217
38535 370217 370562 353320 324212 291606 272011 276615 293754 300280 289472 273930 263794 258265
38523 258265 256927 262056 269256 272455 278860 301538 335159 357432 359293 356390 364107 376924 379837
$$ packed form
38608B18724K9125J29j8991o299J1968N847j2543q584K2454M6794L7162O001j7100
38595C14687k5686l4748m6009l9936p620L0538M9005M4298K7990R321l338j574
38583C16928P315J720j9418k3871O649L6355J7622l7381o6339l7913J3115L8076
38571B52858K8334N331j3486k0919j3327L929J6399J7559J5410J5657J2002L20
38559C20067j1232j4492j2650j3022j7831k4841k7098j3408J6521L9387K9993
38548B71394l003k3344j2817R730J9696J5192O522j077k916P961K6609L4374K1896
38535C70217L45j7242k9108l2606j9595M604J7139O526j0808j5542j0136n529
38523B58265j338N129P200L199O405K2678L3621K2273J861k903P717J2817K913
$$ plain form
38510 379837 365862 335304 293324 257816 254568 290435 340108 371064 374778 365064 356001 353836
38498 353836 362105 379078 392587 390632 377273 367720 367706 368082 361137 351233 344035 334298 314016 289736
38484 289736 281959 303926 345367 380483 390272 376497 357731 352956 362659 362140 322153 245814 177839
38471 177839 162208 193507 227274 237906 243564 266507 294286 300854 289089 285941 301829 320499
38459 320499 330274 341881 365951 388783 384009 344068 292472 264393 275516 308871 334184 340635
38447 340635 344670 363582 391313 407567 402569 384357 368764 369861 391194 417036 422011 400464
38435 400464 376664 374259 386684 391295 379950 358061 326404 287323 260450 265989 293846 311351
38423 311351 301043 272384 240854 216970 210822 222531 231559 221994 215285 246806 309303 354120
$$ packed form
38510C79837j3975l0558m1980l5508l248L5867M9673L0956L714r714r063k165
38498C53836Q269J6973J3509j955j3359r553j4L76o945r904p198r737k0282k4280
38484B89736p777K1967M1441L5116R789j3775j8766m775R703n19l9987p6339o7975
38471A77839j5631L1299L3767J0632N658K2943K7779O568j1765l148J5888J8670
38459C20499R775J1607K4070K2832m774l9941n1596k8079J1123L3355K5313O451
38447C40635M035J8912K7731J6254m998j8212j5593J097K1333K5842M975k1547
38435D00464k3800k405J2425M611j1345k1889l1657l9081k6873N539K7857J7505
38423C11351j0308k8659l1530k3884o148J1709R028r565o709L1521O2497M4817
$$ plain form
38411 354120 355661 340164 337949 341210 329538 308614 297885 298738 298058 290193 277744 263670 257305
38398 257305 273277 309259 338743 339652 316546 284925 253509 234352 245859 285621 321608 332095
38386 332095 333400 344819 350744 330879 307802 322228 369069 400093 390780 364672 344219 317169
38374 317169 270903 229141 226729 262690 301575 315296 306414 292942 284822 278745 268672 256194
38362 256194 249935 256326 274239 298599 322959 336556 328885 304674 285287 285111 294431 297065 295857
38349 295857 304333 319695 325249 320107 325210 351994 381652 387627 368563 346169 335377 329744 317927
38336 317927 303300 297599 299263 292571 274881 271182 304497 358245 389735 381327 354651 330112
38324 330112 301959 268301 255281 282470 324440 339713 326083 314449 316162 312680 295742 280455
$$ packed form
38411C54120J541j5497k215L261j1672k0924j0729Q53o80p865j2449j4074o365
38398B57305J5972L5982K9484R09k3106l1621l1416j9157J1507L9762L5987J0487
38386C32095J305J1419N925j9865k3077J4426M6841L1024r313k6108k0453k7050
38374C17169m6266m1762k412L5961L8885J3721q882j3472q120o077j0073j2478
38362B56194o259O391J7913K4360K4360J3597p671k4211j9387j76R320K634j208
38349B95857Q476J5362N554n142N103K6784K9658N975j9064k2394j0792n633j1817
38336C17927j4627n701J664o692j7690l699L3315N3748L1490q408k6676k4539
38324C30112k8153l3658j3020K7189M1970J5273j3630j1634J713l482j6938j5287
$$ plain form
38312 280455 273001 261429 249737 265738 316232 365636 383487 385936 400154 411006 383237 326322
38300 326322 293364 308999 336070 331883 308172 307831 339458 367643 365933 348621 339147 331192 302596
38287 302596 255919 221108 218571 239543 266470 293786 319939 336263 338725 339794 352469 368322
38275 368322 366838 344538 320859 313871 321303 329178 331984 339614 365211 406732 443091 454059 441944
38262 441944 423679 403602 371533 331163 307568 313029 325113 316731 290685 264273 238334 208844
38250 208844 193318 211290 246548 264035 260435 261063 267688 252720 214046 190902 204660 224209
38238 224209 219859 216886 255745 321417 356224 335750 293699 270509 270353 276068 279170 281777 285575
38225 285575 291202 300734 315332 336226 366963 404893 432161 428640 396221 358976 336554 327931
$$ packed form
38312B80455p454j1572j1692J6001N0494M9404J7851K449J4218J0852k7769n6915
38300C26322l2958J5635K7071m187k3711l41L1627K8185j710j7312r474p955k8596
38287C02596m6677l4811k537K0972K6927K7316K6153J6324K462J069J2675J5853
38275C68322j484k2300k3679o988P432P875K806P630K5597M1521L6359J0968j2115
38262D41944j8265k0077l2069m0370k3595N461J2084q382k6046k6412k5939k9490
38250B08844j5526J7972L5258J7487l600O28O625j4968l8674k3144J3758J9549
38238B24209m350k973L8859O5672L4807k0474m2051k3190j56N715L102K607L798
38225B85575N627R532J4598K0894L0737L7930K7268l521l2419l7245k2422q623
$$ plain form
38213 327931 323883 322908 327625 334683 337819 337186 337855 339695 334565 316157 290746 274426 276440 286589
38199 286589 285028 266072 245116 237407 238196 233775 226582 234791 265109 299014 313679 309042 305468
38186 305468 317840 339735 353228 348756 334025 326543 337820 361525 376619 366329 336420 311244
38174 311244 308491 321201 329496 326799 326220 340636 365319 384684 390010 385440 381451 387535 406397
38161 406397 428845 437924 425209 401826 388444 395807 417855 439022 443551 424419 392190 371146
38149 371146 376725 398134 411347 407263 398283 398978 410299 422874 425926 410925 375118 325907 278038
38136 278038 245070 235329 252516 293768 347237 394987 417970 401487 347401 284112 249418 253106
38124 253106 268341 269470 262087 261950 264813 261349 264824 292313 328788 343575 335987 328716 320615
$$ packed form
38213C27931m048r75M717P058L136o33O69J840n130j8408k5411j6320K014J0149
38199B86589j561j8956k0956p709P89m421p193Q209L0318L3905J4665m637l574
38186C05468J2372K1895J3493m472j4731p482J1277K3705J5094j0290k9909k5176
38174C11244k753J2710Q295k697n79J4416K4683J9365N326m570l989O084J8862
38161D06397K2448R079j2715k3383j3382P363K2048K1167M529j9132l2229k1044
38149C71146N579K1409J3213m084q980O95J1321J2575L052j5001l5807m9211m7869
38136B78038l2968r741J7187M1252N3469M7750K2983j6483n4086o3289l4694L688
38124B53106J5235J129p383j37K863l464L475K7489L6475J4787p588p271q101
$$ plain form
38111 320615 288691 239849 214063 223110 231812 220786 222427 263531 313262 329012 322267 333234
38099 333234 362610 376301 364132 346933 332936 313951 303204 329027 382545 414326 397840
38088 397840 360727 337835 327753 315966 308846 316254 322992 308570 283397 276894 294307 310529
38076 310529 308986 306211 328434 374327 412156 414754 391506 378213 393563 416128 415003 394147
38064 394147 386891 407656 431257 427616 398233 367008 350791 352212 366678 378946 364274 314668
38052 314668 259592 239112 254530 264459 236312 186490 159609 178319 225121 267837 290412 298018
38040 298018 302373 309274 318156 326772 331663 326027 304532 274559 256995 266874 294415 315126 319873
38027 319873 322622 332812 335149 312376 277748 261796 267790 265879 240500 219644 238018 288131
$$ packed form
38111C20615l1924m8842k5786R047Q702j1026J641M1104M9731J5750o745J0967
38099C33234K9376J3691j2169j7199j3997j8985j0747K5823N3518L1781j6486
38088C97840l7113k2892j0082j1787p120P408O738j4422k5173o503J7413J6222
38076C10529j543k775K2223M5893L7829K598k3248j3293J5350K2565j125k0856
38064C94147p256K0765K3601l641k9383l1225j6217J421J4466J2268j4672m9606
38052C14668n5076k0480J5418R929k8147m9822k6881J8710M6802M2716K2575P606
38040B98018M355O901Q882Q616M891n636k1495k9973j7564R879K7541K0711M747
38027C19873K749J0190K337k2773l4628j5952N994j911k5379k0856J8374N0113
$$ plain form
38015 288131 332176 352900 365815 382899 392423 383448 367899 363254 366257 358233 330524 294767
38003 294767 271369 273243 297088 327367 351919 372540 394915 413653 419378 416302 415987 415598 403220
37990 403220 386859 393571 429650 463563 463131 432453 397638 372646 355362 341926 326644 300495
37978 300495 268319 256546 285029 339315 386282 407002 399992 368854 329642 316145 347874 397903
37966 397903 419932 405617 389488 397648 418158 425824 411553 380455 342564 313974 309196 324176
37954 324176 341199 354703 375607 405691 426795 424177 404754 383453 366197 355350 357124 371268
37942 371268 383644 380492 363800 345892 337040 344198 370680 406729 428704 420258 392477 374514
37930 374514 384557 415270 446332 464607 469136 460948 437446 403089 378814 385864 417695 442732
$$ packed form
38015B88131M4045K0724J2915J7084R524q975j5549m645L003q024k7709l5757
38003B94767k3398J874K3845L0279K4552K0621K2375J8738N725l076l15l89j2378
37990D03220j6361O712L6079L3913m32l0678l4815k4992j7284j3436j5282k6149
37978C00495l2176j1773K8483N4286M6967K0720p010l1138l9212j3497L1729N0029
37966C97903K2029j4315j6129Q160K0510P666j4271l1098l7891k8590m778J4980
37954C24176J7023J3504K0904L0084K1104k618j9423k1301j7256j0847J774J4144
37942C71268J2376l152j6692j7908q852P158K6482L6049K1975q446k7781j7963
37930C74514J0043L0713L1062J8275M529q188k3502l4357k4275P050L1831K5037
$$ plain form
37918 442732 442068 429426 423172 415994 392217 363165 359661 390481 428998 443989 429224 401655
37906 401655 382681 380947 384365 373754 352381 348946 376181 402589 390065 347499 316939 314189
37894 314189 317688 315364 325573 362607 412337 453858 480177 488672 477073 458278 452754 456101
37882 456101 441488 405596 382199 394114 421642 439937 459099 498398 541912 552428 520373
37871 520373 473425 443175 441454 462211 487660 496373 479416 445683 406313 366134 336352 335175
37859 335175 361379 386190 389584 387694 404199 431398 444625 442843 447113 464101 477051 472970
37847 472970 457157 438368 417698 397226 386977 396997 426830 463477 488414 491633 481225 472901
37835 472901 470114 464698 455584 450791 450639 448707 450186 463728 471856 443010 385444 353375 377428
$$ packed form
37918D42732o64j2642o254p178k3777k9052l504L0820L8517J4991j4765k7569
37906D01655j8974j734L418j0611k1373l435K7235K6408j2524m2566l0560k750
37894C14189L499k324J0209L7034M9730M1521K6319Q495j1599j8795n524L347
37882D56101j4613l5892k3397J1915K7528J8295J9162L9299M3514J0516l2055
37871E20373m6948l0250j721K0757K5449Q713j6957l3733l9370m0179k9782j177
37859C35175K6204K4811L394j890J6505K7199J3227j782M270J6988J2950m081
37847D72970j5813j8789k0670k0472j0249J0020K9833L6647K4937L219j0408q324
37835D72901k787n416r114m793j52j932J479J3542Q128k8846n7566l2069K4053
$$ plain form
37822 377428 422030 439739 436102 445228 468897 482880 484517 489074 491415 476949 463277 483023
37810 483023 524177 534268 493727 444142 429191 443633 459342 470337 487294 507873 517367 510616
37798 510616 496589 484099 471705 451346 421000 392936 380692 375958 357338 332213 343353 409530
37786 409530 484432 509928 490431 471958 464200 438303 397892 390231 431026 471717 466344 426926
37774 426926 387068 353771 326946 326596 359718 389176 377947 345281 339897 371743 407572 423751
37762 423751 426731 426283 422975 422834 435553 455303 465830 464726 461739 454993 431912 395085 367004
37749 367004 366683 396573 448655 504557 535105 525108 498685 494650 514432 521686 499150 474412
37737 474412 473655 479419 460662 424029 403200 407738 416449 421336 444202 497168 553159 575236 558070
$$ packed form
37822C77428M4602J7709l637R126K3669J3983J637M557K341j4466j3672J9746
37810D83023M1154J0091m0541m9585j4951J4442J5709J0995J6957K0579R494o751
37798E10616j4027j2490j2394k0359l0346k8064j2244m734j8620k5125J1140O6177
37786D09530P4902K5496j9497j8473p758k5897m0411p661M0795M0691n373l9418
37774D26926l9858l3297k6825l50L3122K9458j1229l2666n384L1846L5829J6179
37762D23751K980m48l308j41J2719J9750J0527j104k987o746k3081l6827k8081
37749C67004l21K9890N2082N5902L0548r997k6423m035J9782P254k2536k4738
37737D74412p57N764j8757l6633k0829M538Q711M887K2866N2966N5991K2077j7166
$$ plain form
37724 558070 519959 468004 398223 325310 282564 283953 307691 328089 345005 368197 389893 392978
37712 392978 376721 354768 333323 310651 295529 306193 347734 405072 460442 504502 529819
37701 529819 530103 510886 486852 463046 432294 397519 381133 398889 433387 448919 432504 409971
37689 409971 417542 461836 512672 535801 527679 511825 505134 502119 495313 492381 498943 499347 475055
37676 475055 434067 401487 386792 382344 389119 416558 455112 476784 472005 463181 471727 493042
37664 493042 515058 538612 562246 566270 535320 487616 461256 473804 508487 536221 539203 517068
37652 517068 483511 458065 452315 461173 469927 468616 458028 445149 435867 431371 431447 440168 461661
37639 461661 487349 498092 487684 472741 466414 455479 423165 382701 361394 358972 353696 347876
$$ packed form
37724E58070l8111n1955o9781p2913m2746J389K3738K0398J6916K3192K1696L085
37712C92978j6257k1953k1445k2672j5122J0664M1541N7338N5370M4060K5317
37701E29819K84j9217k4034k3806l0752l4775j6386J7756L4498J5532j6415k2533
37689D09971P571M4294N0836K3129q122j5854o691l015o806k932O562M04k4292
37676D75055m0988l2580j4695m448O775K7439L8554K1672m779q824Q546K1315
37664D93042K2016K3554K3634M024l0950m7704k6360J2548L4683K7734K982k2135
37652E17068l3557k5446n750Q858Q754j311j0588j2879r282m496P6Q721K1493
37639D61661K5688J0743j0408j4943o327j0935l2314m0464k1307k422n276n820
$$ plain form
37627 347876 370237 424465 470708 475782 454316 441860 451083 472387 493840 499362 468864 405075
37615 405075 345165 323604 335965 357303 379003 404136 421650 414438 388182 368219 368388 380097
37603 380097 390046 394140 396003 402726 418229 433412 431236 409064 385207 376322 382347 400232 432034
37590 432034 467474 481047 464574 443006 439349 444723 444027 447826 470868 499439 512013 515318 525441
37577 525441 528243 498865 452780 435315 459239 490890 503771 510369 530073 555523 565539 552123
37565 552123 525833 508935 522270 559497 579079 547766 487799 449607 440394 419553 370599 333050
37553 333050 343121 381941 411352 429282 454069 476089 466100 425809 395215 404493 441222 470599
37541 470599 471558 447872 416527 392365 378989 371083 365931 368983 384611 405781 418415 414473 398621
$$ packed form
37627C47876K2361N4228M6243N074k1466j2456R223K1304K1453N522l0498o3789
37615D05075n9910k1561J2361K1338K1700K5133J7514p212k6256j9963J69J1709
37603C80097R949M094J863O723J5503J5183k176k2172k3857q885O025J7885L1802
37590D32034L5440J3573j6473k1568l657N374o96L799K3042K8571J2574L305J0123
37577E25441K802k9378m6085j7465K3924L1651J2881O598J9704K5450J0016j3416
37565E52123k6290j6898J3335L7227J9582l1313n9967l8192r213k0841m8954l7549
37553C33050J0071L8820K9411J7930K4787K2020r989m0291l0594R278L6729K9377
37541D70599R59k3686l1345k4162j3376p906n152L052J5628K1170J2634l942j5852
$$ plain form
37528 398621 385049 388304 411563 441945 462525 469779 473274 478923 482141 479394 476448 480899 494569
37515 494569 516450 543744 565586 566341 543816 517756 511801 530382 559040 582630 595768 598969
37503 598969 594691 589837 595341 617241 649550 681283 712013 755802 826187 921573 1030346 1143791
37491 1143791 1252503 1333156 1355194 1306895 1205843 1081212 955828 845413 758647 691982
37481 691982 638370 604831 603846 623404 629576 609462 587147 582524 580670 562649 540351 533149 532570
37468 532570 521428 508330 509027 511418 497084 481340 487777 494970 460235 395478 366238 403876
37456 403876 464861 492921 480169 449967 421161 412244 442126 497150 527567 506092 464857 447375
37444 447375 449788 441035 418891 409138 421036 438125 449374 460900 476613 490145 498940 510733
$$ packed form
37528C98621j3572L255K3259L0382K0580P254L495N649L218k747k946M451J3670
37515D94569K1881K7294K1842P55k2525k6060n955J8581K8658K3590J3138L201
37503E98969m278m854N504K1900L2309L1733L0730M3789P0385R5386J08773J13445
37491A143791J08712Q0653K2038m8299j01052j24631j25384j10415q6766o6665
37481F91982n3612l3539r85J9558O172k0114k2315m623j854j8021k2298p202n79
37468E32570j1142j3098O97K391j4334j5744O437P193l4735o4757k9240L7638
37456D03876O0985K8060j2752l0202k8806q917K9882N5024L0417k1475m1235j7482
37444D47375K413q753k2144r753J1898J7089J1249J1526J5713J3532Q795J1793
$$ plain form
37432 510733 533571 567792 605434 632575 640824 642420 661282 700148 730111 723693 685298 638750
37420 638750 600765 580029 584775 611490 637796 644963 638267 630327 618378 597871 585176 600110
37408 600110 630309 637581 601713 540648 487037 460616 462985 482385 500338 506681 511135 530045
37396 530045 561261 583147 580155 559547 540298 533265 535068 536202 532873 532178 543245 561621 569288
37383 569288 556381 536531 531080 541703 549912 543920 534618 539391 558241 575492 582270 585047 588220
37370 588220 582331 563616 554539 580291 625818 646214 629941 619939 650169 691683 696243 669929
37358 669929 658805 673603 677929 651632 617946 597867 581860 563196 559059 576428 591105 585157
37346 585157 577305 592790 627325 661720 688291 703372 699408 685545 689806 717753 734999 715807
$$ packed form
37432E10733K2838L4221L7642K7141Q249J596J8862L8866K9963o418l8395m6548
37420F38750l7985k0736M746K6715K6306P167o696p940j1949k0507j2695J4934
37408F00110L0199P272l5868o1065n3611k6421K369J9400J7953O343M454J8910
37396E30045L1216K1886k992k0608j9249p033J803J134l329o95J1067J8376P667
37383E69288j2907j9850n451J0623Q209n992r302M773J8850J7251O778K777L173
37370E88220n889j8715r077K5752M5527K0396j6273j0002L0230M1514M560k6314
37358F69929j1124J4798M326k6297l3686k0079j6007j8664m137J7369J4677n948
37346E85157p852J5485L4535L4395K6571J5081l964j3863M261K7947J7246j9192
$$ plain form
37334 715807 683034 672011 680560 686845 692938 713232 737156 742511 735507 741603 763713 782721 793250
37321 793250 806034 818877 818059 808573 813310 840309 876921 917476 970010 1030874 1076931 1092362
37309 1092362 1087929 1087484 1105621 1139555 1173382 1191356 1193783 1194778 1199990 1199309 1188992 1183114 1190510
37296 1190510 1200057 1205543 1223607 1264388 1304835 1319488 1321277 1340202 1373027 1386759 1366013 1326620
37284 1326620 1285533 1245565 1209460 1184501 1172124 1170756 1184033 1208003 1218793 1194844 1145449
37273 1145449 1098799 1070771 1062749 1075222 1100914 1119319 1122314 1129234 1151470 1163246 1140620 1109042
37261 1109042 1111118 1141772 1160005 1155909 1158864 1181357 1201466 1206550 1212840 1233150 1260927 1293912
37249 1293912 1340722 1397115 1445621 1482998 1520031 1555019 1579040 1604945 1655038 1720561 1771239
$$ packed form
37334G15807l2773j1023Q549O285O093K0294K3924N355p004O096K2110J9008J0529
37321G93250J2784J2843q18r486M737K6999L6612M0555N2534O0864M6057J5431
37309A092362m433m45J8137L3934L3827J7974K427R95N212o81j0317n878P396
37296A190510R547N486J8064M0781M0447J4653J789J8925L2825J3732k0746l9393
37284A326620m1087l9968l6105k4959j2377j368J3277K3970J0790k3949m9395
37273A145449m6650k8028q022J2473K5692J8405K995O920K2236J1776k2626l1578
37261A109042K076L0654J8233m096K955K2493K0109N084O290K0310K7777L2985
37249A293912M6810N6393M8506L7377L7033L4988K4021K5905N0093O5523N0678
$$ plain form
37238 1771239 1805796 1853341 1922597 1991743 2052838 2120689 2187225 2212812 2182041 2131544 2104796
37227 2104796 2110457 2137093 2174695 2208815 2226911 2242639 2281790 2336742 2371862 2381277 2399025 2441829
37215 2441829 2488263 2529648 2591630 2680835 2755460 2777152 2752374 2697283 2605929 2485660 2382218
37204 2382218 2330241 2310029 2286742 2259627 2238128 2203900 2138142 2059886 1996850 1940837 1869944
37193 1869944 1793355 1735226 1691690 1640996 1582572 1533600 1500151 1479261 1472896 1473938 1459113 1422553
37181 1422553 1391959 1382972 1367809 1325771 1292857 1312136 1358850 1371221 1343620 1331743 1365683
37170 1365683 1412219 1434294 1441668 1462871 1499396 1528485 1533403 1518425 1505114 1517195 1559162 1612911
37158 1612911 1664054 1718263 1776509 1812899 1803690 1765915 1738867 1735645 1740225 1743814 1753817 1771351
$$ packed form
37238A771239L4557M7545O9256O9146O1095O7851O6536K5587l0771n0497k6748
37227B104796N661K6636L7602L4120J8096J5728L9151N4952L5120R415J7748M2804
37215B441829M6434M1385O1982Q9205P4625K1692k4778n5091r1354j20269j03442
37204B382218n1977k0212k3287k7115k1499l4228o5758p8256o3036n6013p0893
37193A869944p6589n8129m3536n0694n8424m8972l3449k0890o365J042j4825l6560
37181A422553l0594q987j5163m2038l2914J9279M6714J2371k7601j1877L3940
37170A365683M6536K2075P374K1203L6525K9089M918j4978j3311J2081M1967N3749
37158A612911N1143N4209N8246L6390r209l7775k7048l222M580L589J0003J7534
$$ plain form
37146 1771351 1789664 1814106 1857024 1912661 1960940 1995456 2025117 2050076 2060194 2057983 2060750 2077275
37134 2077275 2099779 2118711 2128949 2123179 2095772 2052330 2002951 1951108 1901111 1866878 1857463 1861694
37122 1861694 1860990 1848083 1822153 1781364 1734354 1699915 1677678 1640263 1574694 1506818 1459245 1412955
37110 1412955 1345391 1280901 1259157 1270365 1267964 1235250 1193756 1153348 1103465 1053892 1034964
37099 1034964 1047841 1055989 1036741 1005428 980747 963624 959500 981849 1017772 1025845 988287 936574
37087 936574 906792 896441 885196 873656 877102 896157 915274 922904 919741 913295 911656 915293 912086
37074 912086 890092 855471 825514 805134 785613 766455 761389 779505 813522 847806 867142 861835
37062 861835 838571 821609 827266 841335 836694 806664 765276 724572 691336 676123 682400 694517
$$ packed form
37146A771351J8313K4442M2918N5637M8279L4516K9661K4959J0118k211K767J6525
37134B077275K2504J8932J0238n770k7407m3442m9379n1843m9997l4233r415M231
37122A861694p04j2907k5930m0789m7010l4439k2237l7415o5569o7876m7573m6290
37110A412955o7564o4490k1744J1208k401l2714m1494m0408m9883m9573j8928
37099A034964J2877Q148j9248l1313k4681j7123m124K2349L5923Q073l7558n1713
37087I36574k9782j0351j1245j1540L446J9055J9117P630l163o446j639L637l207
37074I12086k1994l4621k9957k0380j9521j9158n066J8116L4017L4284J9336n307
37062H61835k3264j6962N657J4069m641l0030m1388m0704l3236j5213O277J2117
$$ plain form
37050 694517 698607 705689 730033 756667 760151 746912 746731 766397 782592 779047 763433 749814 747756
37037 747756 761329 776587 766167 733603 728644 778696 831143 818821 763642 748656 795206 841710
37025 841710 849243 849170 863986 858948 814221 779826 805018 860196 883268 868841 859160 871841 886787
37012 886787 890339 889811 891559 895346 901716 903190 884701 853583 845757 876168 908088 903491 880520
36999 880520 882612 907730 911142 872683 822064 795159 797329 815412 838644 857837 862978 852910
36987 852910 838522 830767 830208 829045 819683 802450 786659 782245 792913 821351 871252 930984 966754
36974 966754 955722 920295 902541 908084 907582 893192 892740 916799 932813 914649 884369 877382 892136
36961 892136 902667 901052 900054 907960 924154 947775 971787 980689 970447 957876 956858 960911 961918
$$ packed form
37050F94517M090P082K4344K6634L484j3239j81J9666J6195l545j5614j3619k058
37037G47756J3573J5258j0420l2564m959N0052N2447j2322n5179j4986M6550M6504
37025H41710P533p3J4816n038m4727l4395K5192N5178K3072j4427r681J2681J4946
37012H86787L552n28J748L787O370J474j8489l1118p826L0411L1920m597k2971
36999H80520K092K5118L412l8459n0619k6905K170J8083K3232J9193N141j0068
36987H52910j4388p755n59j163r362j7233j5791m414J0668K8438M9901N9732L5770
36974I66754j1032l5427j7754N543n02j4390m52K4059J6014j8164l0280o987J4754
36961H92136J0531j615r98P906J6194K3621K4012Q902j0242j2571j018M053J007
$$ plain form
36948 961918 966602 978775 985581 980806 983682 1012204 1050266 1062367 1034577 987231 953766 954858
36936 954858 983740 1011965 1020491 1023564 1044402 1073091 1078183 1059475 1052918 1075815 1104287 1116964
36924 1116964 1122776 1128743 1118666 1086469 1056629 1047720 1046388 1038873 1036288 1047458 1060754 1074313
36912 1074313 1106477 1152086 1170494 1147983 1129943 1154068 1192091 1199719 1185341 1181484 1183804 1171821
36900 1171821 1159782 1169023 1173407 1133423 1070525 1047773 1081473 1124870 1136945 1119312 1088427 1059986
36888 1059986 1060823 1108868 1176228 1212744 1209705 1202931 1213126 1224431 1225728 1232002 1253895 1278752
36876 1278752 1292082 1292814 1283472 1269009 1264446 1279016 1296824 1299165 1298168 1317442 1346982 1352880 1329041
36863 1329041 1304456 1299851 1310240 1328775 1352450 1363282 1340705 1299461 1283017 1310451 1355717
$$ packed form
36948I61918M684J2173O806m775K876K8522L8062J2101k7790m7346l3465J092
36936I54858K8882K8225Q526L073K0838K8689N092j8708o557K2897K8472J2677
36924A116964N812N967j0077l2197k9840q909j332p515k585J1170J3296J3559
36912A074313L2164M5609J8408k2511j8040K4125L8023P628j4378l857K320j1983
36900A171821j2039R241M384l9984o2898k2752L3700M3397J2075j7633l0885k8441
36888A059986Q37M8045O7360L6516l039o774J0195J1305J297O274K1893K4857
36876A278752J3330P32r342j4463m563J4570J7808K341r97J9274K9540N898k3839
36863A329041k4585m605J0389J8535K3675J0832k2577m1244j6444K7434M5266
$$ plain form
36852 1355717 1385112 1391096 1385679 1384269 1399396 1429357 1452197 1449609 1432521 1423397 1422180 1413871 1400098
36839 1400098 1395547 1400867 1406204 1412671 1423115 1423833 1405979 1391529 1403602 1425533 1428992 1428629 1461241
36826 1461241 1518015 1548770 1535509 1513543 1513175 1526032 1538604 1554926 1571494 1568820 1545065 1526619
36814 1526619 1531180 1547724 1562408 1576728 1592636 1607239 1627833 1664696 1705480 1725244 1723604 1722089
36802 1722089 1725081 1717037 1699059 1692018 1700952 1713636 1737314 1795490 1879639 1944688 1966573 1969715
36790 1969715 1984921 2013856 2048207 2090732 2140930 2187247 2227936 2276971 2340100 2405992 2463769
36779 2463769 2506195 2518602 2494234 2457540 2439997 2437716 2429204 2426279 2458806 2510258 2524066 2486141
36767 2486141 2450361 2463887 2511909 2555651 2582382 2595226 2591620 2577370 2573858 2592437 2625176 2668106
$$ packed form
36852A355717K9395N984n417j410J5127K9961K2840k588j7088r124j217q309j3773
36839A400098m551N320N337O467J0444P18j7854j4450J2073K1931L459l63L2612
36826A461241N6774L0755j3261k1966l68J2857J2572J6322J6568k674k3755j8446
36814A526619M561J6544J4684J4320J5908J4603K0594L6863M0784J9764j640j515
36802A722089K992q044j7978p041Q934J2684K3678N8176Q4149O5049K1885L142
36790A969715J5206K8935L4351M2525N0198M6317M0689M9035O3129O5892N7777
36779B463769M2426J2407k4368l6694j7543k281q512k925L2527N1452J3808l7925
36767B486141l5780J3526M8022M3742K6731J2844l606j4250l512J8579L2739M2930
$$ plain form
36755 2668106 2722851 2770810 2783701 2767993 2761286 2777798 2796828 2808567 2824221 2835140 2816257
36744 2816257 2782394 2783337 2823198 2843020 2810109 2766746 2756201 2756465 2730754 2694935 2684999 2695109
36732 2695109 2697522 2696160 2714714 2751803 2785684 2805281 2807057 2784215 2747904 2733861 2758049 2790316
36720 2790316 2800784 2805057 2830964 2866460 2878117 2863814 2851992 2859147 2876265 2890104 2898025 2908743
36708 2908743 2937768 2988677 3036385 3052649 3050155 3069325 3117863 3163446 3194147 3237916 3303892
36697 3303892 3353493 3358656 3346895 3357762 3391686 3431499 3478049 3533042 3579565 3609307 3638052
36686 3638052 3668833 3674981 3646912 3619990 3627482 3660378 3699764 3750548 3815004 3872881 3918197 3975762
36674 3975762 4051038 4107501 4127872 4151238 4208224 4264305 4275723 4262939 4276985 4323235 4367325
$$ packed form
36755B668106N4745M7959J2891j5708o707J6512J9030J1739J5654J0919j8883
36744B816257l3863R43L9861J9822l2911m3363j0545K64k5711l5819r936J0110
36732B695109K413j362J8554L7089L3881J9597J776k2842l6311j4043K4188L2267
36720B790316J0468M273K5907L5496J1657j4303j1822P155J7118J3839P921J0718
36708B908743K9025N0909M7708J6264k494J9170M8538M5583L0701M3769O5976
36697C303892M9601N163j1761J0867L3924L9813M6550N4993M6523K9742K8745
36686C638052L0781O148k8069k6922P492L2896L9386N0784O4456N7877M5316N7565
36674C975762P5276N6463K0371K3366N6986N6081J1418j2784J4046M6250M4090
$$ plain form
36663 4367325 4390955 4396809 4381970 4348544 4319550 4308984 4300342 4285135 4290075 4331653 4378320 4395216
36651 4395216 4392397 4391958 4386046 4369860 4377404 4434564 4507268 4543970 4543313 4537621 4538210 4538821 4543597 4550193
36637 4550193 4534137 4488518 4448542 4442069 4452400 4463426 4495546 4557064 4610547 4634356 4665992
36626 4665992 4732524 4792142 4804216 4802689 4831227 4857794 4832759 4788249 4794542 4848942 4890587 4900961
36614 4900961 4910078 4923598 4921822 4915466 4929433 4944822 4924171 4878336 4845227 4824252 4796736 4783825
36602 4783825 4811494 4843554 4826761 4780907 4765437 4777045 4764291 4729655 4730621 4783752 4848132 4902582
36590 4902582 4962988 5023084 5051745 5052706 5061600 5084154 5098902 5114728 5161857 5232215 5290418 5334344
36578 5334344 5385036 5433704 5464197 5508453 5607797 5736054 5834700 5908397 6010524 6149073 6283585
$$ packed form
36663D367325K3630N854j4839l3426k8994j0566q642j5207M940M1578M6667J6896
36651D395216k819m39n912j6186P544N7160P2704L6702o57n692N89O11M776O596
36637D550193j6056m5619l9976o473J0331J1026L2120O1518N3483K3809L1636
36626D665992O6532N9618J2074j527K8538K6567k5035m4510O293N4400M1645J0374
36614D900961R117J3520j776o356J3967J5389k0651m5835l3109k0975k7516j2911
36602D783825K7669L2060j6793m5854j5470J1608j2754l4636R66N3131O4380N4450
36590D902582O0406O0096K8661R61Q894K2554J4748J5826M7129P0358N8203M3926
36578E334344N0692M8668L0493M4256R9344J28257R8646P3697J02127J38549J34512
$$ plain form
36567 6283585 6402289 6527604 6660418 6793040 6956755 7177800 7408969 7587804 7736921
36558 7736921 7918102 8117448 8278477 8422530 8620311 8857184 9046514 9175477 9319371
36549 9319371 9505098 9678018 9817778 9970423 10142751 10275706 10352295 10430672 10540504 10640866
36539 10640866 10707349 10769193 10836111 10879715 10911377 10988820 11121500 11253820 11358629 11460407
36529 11460407 11554764 11600842 11609484 11642603 11707424 11747198 11753407 11788198 11876209 11973264 12063783
36518 12063783 12190971 12366439 12542509 12694207 12840595 12977166 13084009 13204734 13410330
36509 13410330 13678285 13918709 14126066 14386377 14726340 15082805 15437353 15849946 16334856
36500 16334856 16832479 17334087 17910761 18589833 19324321 20111638 21022027 22086651 23278684
$$ packed form
36567F283585J18704J25315J32814J32622J63715K21045K31169J78835J49117
36558G736921J81181J99346J61029J44053J97781K36873J89330J28963J43894
36549I319371J85727J72920J39760J52645J72328J32955P6589P8377J09832J00362
36539A0640866O6483O1844O6918M3604L1662P7443J32680J32320J04809J01778
36529A1460407R4357M6078Q642L3119O4821L9774O209L4791Q8011R7055R0519
36518A2063783J27188J75468J76070J51698J46388J36571J06843J20725K05596
36509A3410330K67955K40424K07357K60311L39963L56465L54548M12593M84910
36500A6334856M97623N01608N76674O79072P34488P87317R10389J064624J192033
$$ plain form
36491 23278684 24619780 26172525 27909082 29728239 31635538 33773032 36217757 38830993
36483 38830993 41312706 43345054 44767966 45761399 46795634 48250900 50155205 52429223
36475 52429223 55222010 58765714 63062820 68026240 73787264 80542689 88300883 97164938
36467 97164938 107489533 118997795 129990481 138560531 144798134 150611833 156718918 160876138
36459 160876138 160219044 154801813 147659565 141560642 136752824 131881786 125984317 119127753
36451 119127753 111892319 104927401 98799048 93859546 90246857 88000797 86999511 86883110
36443 86883110 87375601 88596663 90605743 92653798 93445961 92361609 90033516 87550718
36435 87550718 85469589 83793373 82480023 81564154 80968792 80532885 80185619 79943795 79834631
$$ packed form
36491B3278684J341096J552745J736557J819157J907299K137494K444725K613236
36483C8830993K481713K032348J422912R93433J034235J455266J904305K274018
36475E2429223K792787L543704M297106M963420N761024O755425P758194Q864055
36467I7164938J0324595J1508262J0992686Q570050O237603N813699O107085M157220
36459A60876138o57094n417231p142248o098923m807818m871038n897469o856564
36451A19127753p235434o964918o128353m939502l612689k246060j001286j16401
36443H6883110M92491J221062K009080K048055P92163j084352k328093k482798
36435H7550718k081129j676216j313350r15869n95362m35907l47266k41824j09164
$$ plain form
36426 79834631 79934410 80366998 81168494 82266668 83655411 85457851 87772512 90608104 94014736
36417 94014736 98122259 103000917 108630142 115041274 122359653 130702301 140158471 150789589
36409 150789589 162403708 174349736 185845656 196682506 207506398 219286345 232393443
36402 232393443 246012039 258478828 268649236 277245600 286514368 298142749 311809427
36395 311809427 326203377 341006498 357159361 375576989 396551421 419999541 444665522
36388 444665522 466651263 480321939 482078150 472951670 457011139 438087439 418879845
36381 418879845 402065715 390098411 383342375 379622468 376475921 373434908 371620037 371490168
36373 371490168 371628147 369785848 364718105 356695606 346359631 333643759 318300150 301147624
$$ packed form
36426G9834631R9779M32588Q01496J098174J388743J802440K314661K835592L406632
36417I4014736M107523M878658N629225O411132P318379Q342648R456170J0631118
36409A50789589J1614119J1946028J1495920J0836850J0823892J1779947J3107098
36402B32393443J3618596J2466789J0170408Q596364R268768J1628381J3666678
36395C11809427J4393950J4803121J6152863J8417628K0974432K3448120K4665981
36388D44665522K1985741J3670676J756211r126480j5940531j8923700j9207594
36381D18879845j6814130j1967304o756036l719907l146547l041013j814871j29869
36373C71490168J37979j842299n067743q022499j0335975j2715872j5343609j7152526
$$ plain form
36365 301147624 283862841 267260925 250586166 233066975 215507249 199555205 185865733
36358 185865733 173900546 163278616 154302599 147127027 141380557 136875344 133853687 132108347
36350 132108347 130532639 128102730 124925935 121888288 119599093 118097059 117297392 117211881
36342 117211881 117778003 118833274 120295120 122173791 124417306 126887863 129490484 132251622
36334 132251622 135278902 138629806 142145829 145467531 148378713 151143798 154355236 158440351
36326 158440351 163459056 169363282 176262376 184389907 193933667 204920258 217216086 230728557
36318 230728557 245637799 262113886 279471332 295784575 308832164 317643422 323121804
36311 323121804 327302504 331999455 337596212 342606411 344792725 343526294 341021616 340490296
$$ packed form
36365C01147624j7284783j6601916j6674759j7519191j7559726j5952044j3689472
36358A85865733j1965187j0621930q976017p175572n746470m505213l021657j745340
36350A32108347j575708k429909l176795l037647k289195j502034p99667q5511
36342A17211881N66122J055271J461846J878671K243515K470557K602621K761138
36334A32251622L027280L350904L516023L321702K911182K765085L211438M085115
36326A58440351N018705N904226O899094Q127531R543760J0986591J2295828J3512471
36318B30728557J4909242J6476087J7357446J6313243J3047589Q811258N478382
36311C23121804M180700M696951N596757N010199K186314j266431k504678n31320
$$ plain form
36303 340490296 342874622 345955505 346869920 345052572 342608754 342296416 345171188 349512681
36295 349512681 351802926 349337646 342146734 331918838 319183963 302679323 281898536
36288 281898536 259033448 237312494 218106536 200760810 184723104 170439612 158171397
36281 158171397 147257849 137077656 127943332 120527104 114907672 110615974 107272952 104801747
36273 104801747 103170714 102117364 101004465 98967951 95514087 91029901 86419227 82197277
36265 82197277 78232754 74342629 70674287 67356606 64192648 60958444 57735212 54725037
36257 54725037 51956061 49359118 46943728 44729331 42669418 40781542 39189901 37924782
36249 37924782 36848962 35882543 35111501 34560668 34052437 33427890 32742977 32118652 31559070
$$ packed form
36303C40490296K384326L080883R14415j817348k443818l12338K874772M341493
36295C49512681K290245k465280p190912j0227896j2734875j6504640k0780787
36288B81898536k2865088k1720954j9205958j7345726j6037706j4283492j2268215
36281A58171397j0913548j0180193r134324p416228n619432m291698l343022k471205
36273A04801747j631033j053350j112899k036514l453864m484186m610674m221950
36265H2197277l964523l890125l668342l317681l163958l234204l223232l010175
36257E4725037k768976k596943k415390k214397k059913j887876j591641j265119
36249C7924782j075820r66419p71042n50833n08231o24547o84913o24325n59582
$$ plain form
36240 31559070 31049164 30675562 30504589 30464489 30477602 30597354 30900468 31348643 31853974 32377682
36230 32377682 32892510 33376589 33914853 34647268 35514049 36204710 36475527 36370761 36010022
36221 36010022 35327559 34207261 32758796 31257591 29859552 28533520 27234852 25994270
36213 25994270 24844085 23773397 22762415 21796033 20866545 20011848 19301074 18731311 18203965
36204 18203965 17659547 17156971 16749082 16362398 15889998 15336941 14783296 14260350 13752728
36195 13752728 13274727 12857070 12490739 12150840 11838909 11549476 11249325 10946167 10714462
36186 10714462 10587332 10484620 10317720 10105710 9916570 9755525 9590521 9430727 9294317
36177 9294317 9145105 8944713 8729421 8558932 8425508 8284783 8137427 8009178 7889211
$$ packed form
36240C1559070n09906l73602j70973m0100J3113J19752L03114M48175N05331N23708
36230C2377682N14828M84079N38264P32415Q66781O90661K70817j04766l60739
36221C6010022o82463j120298j448465j501205j398039j326032j298668j240582
36213B5994270j150185j070688j010982r66382r29488q54697p10774n69763n27346
36204A8203965n44418n02576m07889l86684m72400n53057n53645n22946n07622
36195A3752728m78001m17657l66331l39899l11931k89433l00151l03158k31705
36186A0714462j27130j02712j66900k12010j89140j61045j65004j59794j36410
36177I294317j49212k00392k15292j70489j33424j40725j47356j28249j19967
$$ plain form
36168 7889211 7760366 7653481 7600629 7570255 7518355 7467397 7463382 7490256 7499937 7494409 7504705
36157 7504705 7519198 7507125 7486260 7493483 7512199 7501348 7474153 7476305 7506542 7530273 7552224 7601786
36145 7601786 7662128 7689193 7691924 7720703 7780343 7823492 7828758 7819515 7805293 7769161 7716179 7671749
36133 7671749 7625678 7537971 7409321 7288272 7195810 7098007 6971146 6842796 6743413 6658109
36123 6658109 6553695 6425181 6293250 6176757 6083915 6012710 5946708 5863304 5754522 5632112
36113 5632112 5514321 5419049 5362474 5344761 5338513 5307862 5239918 5149413 5060760 4996590 4971316
36102 4971316 4977905 4987687 4978137 4955317 4939047 4936437 4941734 4951410 4967082 4992247 5034569 5100518
36090 5100518 5181149 5256145 5317238 5373711 5433703 5499858 5583599 5696265 5821037 5923921 6002554
$$ packed form
36168G889211j28845j06885n2852l0374n1900n0958m015K6874R681n528J0296
36157G504705J4493j2073k0865P223J8716j0851k7195K152L0237K3731K1951M9562
36145G601786O0342K7065K731K8779N9640M3149N266r243j4222l6132n2982m4430
36133G671749m6071q7707j28650j21049r2462r7803j26861j28350r9383q5304
36123F658109j04414j28514j31931j16493r2842p1205o6002q3404j08782j22410
36113E632112j17791r5272n6575j7713o248l0651o7944r0505q8653o4170k5274
36102D971316O589R782r550k2820j6270k610N297R676J5672K5165M2322O5949
36090E100518Q0631P4996O1093N6473N9992O6155Q3741J12666J24772J02884P8633
$$ plain form
36079 6002554 6093834 6219797 6355564 6467389 6555157 6639450 6731271 6831926 6940208 7043913
36069 7043913 7125728 7190793 7266423 7363332 7460193 7535709 7590164 7626639 7639948 7635510 7631249 7629335
36057 7629335 7611686 7571015 7519730 7464925 7404794 7348989 7305766 7251244 7156091 7041729 6957587
36046 6957587 6900745 6820140 6710403 6631943 6614531 6610429 6577835 6544369 6543224 6547640 6523017 6493017
36034 6493017 6495351 6512225 6503005 6474430 6462324 6467979 6465125 6451642 6446368 6447292 6433963 6403186 6373084
36021 6373084 6362935 6387593 6449713 6520225 6558184 6571389 6620457 6736145 6871872 6970450 7038544
36010 7038544 7117444 7218015 7328523 7455042 7606904 7764534 7905001 8042819 8208712 8402942
36000 8402942 8600779 8789902 8978203 9180687 9414934 9686208 9964527 10207957 10420577
$$ packed form
36079F002554R1280J25963J35767J11825Q7768Q4293R1821J00655J08282J03705
36069G043913Q1815O5065P5630R6909R6861P5516N4455L6475J3309m438m261j914
36057G629335j7649m0671n1285n4805o0131n5805m3223n4522r5153j14362q4142
36046F957587n6842q0605j09737p8460j7412m102l2594l3466j145M416k4623l0000
36034F493017K334J6874r220k8575j2106N655k854j3483n274R24j3329l0777l0102
36021F373084j0149K4658O2120P0512L7959J3205M9068J15688J35727R8578O8094
36010G038544P8900J00571J10508J26519J51862J57630J40467J37818J65893J94230
36000H402942J97837J89123J88301K02484K34247K71274K78319K43430K12620
$$ plain form
35991 10420577 10648261 10905360 11156351 11389128 11646746 11953371 12267215 12550182 12830587
35982 12830587 13147405 13481746 13799704 14121715 14489900 14897208 15304584 15704254 16116056
35973 16116056 16542543 16973088 17413721 17875363 18354109 18855621 19411490 20038063 20708010
35964 20708010 21395031 22116064 22898806 23742715 24644516 25624302 26689506 27807925 28953244
35955 28953244 30146033 31418714 32774635 34212713 35758713 37445159 39294782 41343426
35947 41343426 43636374 46181773 48953037 51952966 55221886 58768739 62564956 66643566
35939 66643566 71149119 76239558 81932580 88007900 94022255 99530861 104488764 109459414
35931 109459414 115270918 122386029 130652521 139606235 148851983 158191672 167646696 177470525
$$ packed form
35991A0420577K27684K57099K50991K32777K57618L06625L13844K82967K80405
35982A2830587L16818L34341L17958L22011L68185M07308M07376L99670M11802
35973A6116056M26487M30545M40633M61642M78746N01512N55869O26573O69947
35964B0708010O87021P21033P82742Q43909R01801R79786J065204J118419J145319
35955B8953244J192789J272681J355921J438078J546000J686446J849623K048644
35947D1343426K292948K545399K771264K999929L268920L546853L796217M078610
35939F6643566M505553N090439N693022O075320O014355N508606M957903M970650
35931A09459414N811504P115111Q266492Q953714R245748R339689R455024R823829
$$ plain form
35923 177470525 188045895 199828646 213531484 229972184 248871603 267534758 281621072
35916 281621072 288301494 288788034 287306106 287585901 290675536 295843870 302667359 311775128
35908 311775128 323935025 338748320 354006929 366153974 371827827 369649075 360875466
35901 360875466 348416646 335158187 322792938 311475924 300128387 287326476 272416103
35894 272416103 255985192 239282508 223316685 208577724 195341671 183874232 174303845
35887 174303845 166507526 160226933 155272262 151618838 149285509 147995839 146925492 144989282
35879 144989282 141594040 137090138 132380775 128137656 124467919 121197036 118232683 115613545
35871 115613545 113358816 111375670 109501640 107629498 105822384 104314981 103384296 103196571
$$ packed form
35923A77470525J0575370J1782751J3702838J6440700J8899419J8663155J4086314
35916B81621072O680422M86540j481928K79795L089635N168334O823489R107769
35908C11775128J2159897J4813295J5258609J2147045N673853k178752q773609
35901C60875466j2458820j3258459j2365249j1317014j1347537j2801911j4910373
35894B72416103j6430911j6702684j5965823j4738961j3236053j1467439r570387
35887A74303845p796319o280593m954671l653424k333329j289670j070347j936210
35879A44989282l395242m503902m709363m243119l669737l270883k964353k619138
35871A15613545k254729j983146j874030j872142j807114j507403r30685j87725
$$ plain form
35863 103196571 103721326 104723627 105864544 106924727 107988186 109367629 111336016 113968548
35855 113968548 117210229 120987222 125232549 129897712 134987538 140548101 146612439 153150888
35847 153150888 159962231 166534540 172182610 176574810 180118530 183660243 187850866 192972507
35839 192972507 199232436 206800960 215416598 224214657 232149771 238578472 243539237 247719027
35831 247719027 252163034 257831939 265456089 275789771 289306457 304765687 318373153
35824 318373153 325791159 325813046 321479353 316997241 314109519 311978333 309701904 307675659
35816 307675659 306714894 307003495 307990435 308351817 305959731 299079227 288306792 276698609
35808 276698609 267337803 261072963 256920959 254031340 252555046 252939021 255198000 259024132
$$ packed form
35863A03196571N24755J002301J140917J060183J063459J379443J968387K632532
35855A13968548L241681L776993M245327M665163N089826N560563O064338O538449
35847A53150888O811343O572309N648070M392200L543720L541713M190623N121641
35839A92972507O259929P568524Q615638Q798059P935114O428701M960765M179790
35831B47719027M444007N668905P624150J0333682J3516686J5459230J3607466
35824C18373153P418006K1887m333693m482112k887722k131186k276429k026245
35816C07675659r60765K88601R86940L61382k392086o880504j0772435j1608183
35808B76698609r360806o264840m152004k889619j476294L83975K258979L826132
$$ plain form
35800 259024132 264175962 270561551 278019192 285931070 292953201 297394064 298219108 295677948
35792 295677948 290807589 284467134 277014793 268641456 259588405 250046335 240144080 230082438
35784 230082438 220095652 210298209 200750674 191650189 183279198 175788258 169186884 163506252
35776 163506252 158791524 154942116 151706326 148823131 146057677 143157650 139935790 136390277
35768 136390277 132648571 128849875 125179794 121906826 119207181 117004607 115125349 113541885
35760 113541885 112321098 111426166 110745268 110233252 109847772 109451270 109001535 108760195 109073300
35751 109073300 110002526 111394564 113213711 115533676 118331433 121662974 125908957 131252612
35743 131252612 136799011 140830557 142371377 142207332 142048784 142987087 145095431 148164351
$$ packed form
35800B59024132N151830O385589P457641P911878P022131M440863Q25044k541160
35792B95677948m870359o340455p452341q373337r053051r542070r902255j0061642
35784B30082438r986786r797443r547535r100485q370991p490940o601374n680632
35776A63506252m714728l849408l235790k883195k765454k900027l221860l545513
35768A36390277l741706l798696l670081l272968k699645k202574j879258j583464
35760A13541885j220787q94932o80898n12016l85480l96502m49735k41340L13105
35751A09073300R29226J392038J819147K319965K797757L331541M245983N343655
35743A31252612N546399M031546J540820j64045j58548R38303K108344L068920
$$ plain form
35735 148164351 152232856 157455758 163896359 171402272 179235601 185851058 189623412 190100662
35727 190100662 188290234 185578830 182667672 179660711 176699912 174079206 171983313 170565230
35719 170565230 170157960 170934441 172337563 173326326 173438650 173360046 174226877 176556724 180059340
35710 180059340 184261432 188923571 193852479 198687822 203086675 206913066 209973011 211604672
35702 211604672 210803068 206926269 200266933 191897821 182996722 174312900 166126911 158509462
35694 158509462 151519988 145204691 139498381 134200142 129093500 124109550 119355943 114987095
35686 114987095 111100055 107782086 105176276 103407176 102481198 102351402 103036921 104557134
35678 104557134 106773935 109439547 112393763 115582537 118951628 122581222 126898268 132316147
$$ packed form
35735A48164351M068505N222902O440601P505913P833329O615457L772354M77250
35727A90100662j810428k711404k911158l006961k960799k620706k095893j418083
35719A70565230m07270P76481J403122R88763J12324p8604Q66831K329847L502616
35710A80059340M202092M662139M928908M835343M398853L826391L059945J631661
35702B11604672q01604l876799o659336q369112q901099q683822q185989p617449
35694A58509462o989474o315297n706310n298239n106642m983950m753607m368848
35686A14987095l887040l317969k605810j769100r25978j29796O85519J520213
35678A04557134K216801K665612K954216L188774L369091L629594M317046N417879
$$ plain form
35670 132316147 138409948 143792199 147249958 148948373 150250720 152486791 156160325 161056021
35662 161056021 166479476 171368535 174846897 177076192 179298641 182815113 188098917 194808482
35654 194808482 201961666 207723914 209705902 206394368 198403988 187984933 177393201 167940970
35646 167940970 160071844 153440052 146878868 139127056 130030898 120702135 112352037 105408745
35638 105408745 99879365 95857511 93105218 90554101 86941466 81967440 76434560 71282537
35630 71282537 66848775 63039469 59768940 57015920 54680603 52614170 50754302 49154669
35622 49154669 47913747 47093145 46660591 46508057 46556190 46815117 47306873 47970716 48690183
35613 48690183 49372713 49970190 50481614 50976055 51549446 52218048 52917319 53633182 54453049
$$ packed form
35670A32316147O093801N382251L457759J698415J302347K236071L673534M895696
35662A61056021N423455M889059L478362K229295K222449L516472N283804O709565
35654A94808482P153184N762248J981988l311534p990380j0419055j0591732r452231
35646A67940970p869126o631792o561184p751812r096158r328763q350098o943292
35638A05408745n529380m021854k752293k551117l612635m974026n532880n152023
35630G1282537m433762l809306l270529k753020k335317k066433j859868j599633
35622D9154669j240922q20602m32554j52534M8133K58927M91756O63843P19467
35613D8690183O82530N97477N11424M94441N73391O68602O99271P15863Q19867
$$ plain form
35604 54453049 55452433 56609541 57852781 59101612 60252493 61245413 62168934 63181617
35596 63181617 64313735 65466350 66598322 67788294 69181883 71055960 73754576 77131377
35588 77131377 80097952 81304983 80518611 78914909 77802491 77506263 77739423 78441394 79709459
35579 79709459 81412643 83543541 86502354 90144231 92800470 92343846 88452597 83017694
35571 83017694 78077500 74122598 70701032 67734050 65490930 63856402 62451534 61211308
35563 61211308 60144661 58705489 56118985 52365519 48286341 44635955 41486379 38631410
35555 38631410 36080672 33920364 32029775 30217212 28478095 26941886 25682811 24703668
35547 24703668 23998222 23528033 23217026 23035288 23021181 23189707 23491963 23873412 24287318
$$ packed form
35604E4453049R99384J157108J243240J248831J150881R92920R23521J012683
35596F3181617J132118J152615J131972J189972J393589J874077K698616L376801
35588G7131377K966575J207031p86372j603702j112418k96228K33160P01971J268065
35579G9709459J703184K130898K958813L641877K656239m56624l891249n434903
35571H3017694m940194l954902l421566k966982k243120j634528j404868j240226
35563F1211308j066647j439172k586504l753466m079178l650386l149576k854969
35555C8631410k550738k160308j890589j812563j739117j536209j259075r79143
35547B4703668p05446m70189l11007j81738j4107J68526L02256L81449M13906
$$ plain form
35538 24287318 24656721 24930073 25178101 25523952 25963921 26363468 26643603 26861977 27091832
35529 27091832 27337888 27613649 27997272 28541316 29176552 29738874 30051658 29985568 29515790
35520 29515790 28751371 27862965 26968406 26116481 25345172 24673730 24047330 23376675 22644990
35511 22644990 21911108 21208919 20517107 19828235 19167540 18531053 17877806 17198902 16530423
35502 16530423 15888164 15254709 14640235 14088507 13608876 13165691 12746479 12374401 12039004
35493 12039004 11685228 11298317 10938836 10661123 10444742 10234942 10010202 9784959 9579148
35484 9579148 9403566 9247861 9076283 8865494 8645520 8467722 8337819 8222897 8116752
35475 8116752 8044936 8005137 7959646 7897791 7855077 7856099 7882912 7914167 7956093 8021706 8113653
$$ packed form
35538B4287318L69403K73352K48028L45851M39969L99547K80135K18374K29855
35529B7091832K46056K75761L83623N44044O35236N62322L12784o6090m69778
35520B9515790p64419q88406q94559q51925p71309o71442o26400o70655p31685
35511B2644990p33882p02189o91812o88872o60695o36487o53247o78904o68479
35502A6530423o42259o33455o14474n51728m79631m43185m19212l72078l35397
35493A2039004l53776l86911l59481k77713k16381k09800k24740k25243k05811
35484I579148j75582j55705j71578k10789k19974j77798j29903j14922j06145
35475H116752p1816l9799m5491o1855m2714J022K6813L1255M1926O5613R1947
$$ plain form
35464 8113653 8237371 8402461 8608729 8855655 9151587 9475035 9743490 9874792 9878549 9842263
35454 9842263 9833580 9862702 9928142 10038993 10192357 10382499 10625229 10910521 11136547 11168033
35444 11168033 10977610 10668515 10347063 10039328 9746059 9498291 9315984 9169550 9024985
35435 9024985 8883125 8739588 8549861 8274658 7931294 7571208 7232726 6934703 6683216
35426 6683216 6461099 6237066 6001499 5769368 5543890 5311694 5077192 4861726 4666254
35417 4666254 4480344 4327511 4242394 4195209 4107403 3964808 3846498 3805451 3785036 3702795
35407 3702795 3564011 3436209 3349845 3280095 3201209 3108865 3005230 2902051 2824742 2782647
35397 2782647 2751398 2708967 2667155 2644038 2631377 2613950 2592806 2563732 2504427 2413675 2333178
$$ packed form
35464H113653J23718J65090K06268K46926K95932L23448K68455J31302L757l6286
35454I842263q683K9122O5440J10851J53364J90142K42730K85292K26026L1486
35444A1168033j90423l09095l21452l07735k93269k47768j82307j46434j44565
35435I024985j41860j43537j89727k75203l43364l60086l38482k98023k51487
35426F683216k22117k24033k35567k32131k25478k32196k34502k15466j95472
35417D666254j85910j52833q5117m7185q7806j42595j18310m1047k0415q2241
35407C702795j38784j27802q6364o9750p8886r2344j03635j03179p7309m2095
35397B782647l1249m2431m1812k3117j2661j7427k1144k9074n9305r0752q0497
$$ plain form
35386 2333178 2298061 2294639 2299007 2322615 2376485 2420339 2400773 2326112 2255014 2217751 2193368 2163030
35374 2163030 2142250 2149614 2174254 2188735 2179567 2158312 2149369 2164436 2184483 2176778 2134659 2084981
35362 2084981 2050021 2023280 1993476 1968192 1957246 1954345 1952795 1959067 1974013 1981714 1973257 1959038
35350 1959038 1942064 1906431 1851124 1804717 1781818 1755304 1701873 1646616 1627118 1637030 1642111 1631650
35338 1631650 1615408 1587245 1533537 1467493 1416755 1384076 1354238 1330305 1326910 1335668 1334655 1326833
35326 1326833 1331614 1342005 1329544 1293031 1263929 1257365 1252759 1231908 1205635 1193785 1205865 1246927
35314 1246927 1312610 1371201 1382594 1347174 1306623 1284211 1256943 1205260 1155989 1144072 1155290
35303 1155290 1144797 1102410 1063085 1052067 1051961 1033958 997205 962902 946234 949567 971408 1004789
$$ packed form
35386B333178l5117l422M368K3608N3870M3854j9566p4661p1098l7263k4383l0338
35374B163030k0780P364K4640J4481r168k1255q943J5067K0047p705m2119m9678
35362B084981l4960k6741k9804k5284j0946k901j550O272J4946P701q457j4219
35350A959038j6974l5633n5307m6407k2899k6514n3431n5257j9498R912N081j0461
35338A631650j6242k8163n3708o6044n0738l2679k9838k3933l395Q758j013p822
35326A326833M781J0391j2461l6513k9102o564m606k0851k6273j1850J2080M1062
35314A246927O5683N8591J1393l5420m0551k2412k7268n1683m9271j1917J1218
35303A155290j0493m2387l9325j1018j06j8003l6753l4303j6668L333K1841L3381
$$ plain form
35291 1004789 1032491 1040328 1034440 1032550 1039027 1041754 1032301 1012838 982857 940706 904833 909002 959890
35278 959890 1018972 1046817 1049712 1061981 1100154 1161941 1253555 1379321 1507105 1579756 1566804
35267 1566804 1481502 1351970 1207242 1086686 1020227 990395 951060 893210 853932 849644 846574
35256 846574 821395 807493 843614 907041 938088 913037 858215 806145 770841 756835 761486 770649
35244 770649 772799 772140 773225 766890 750890 748673 782497 838599 883237 904464 914263 917234 903230
35231 903230 869902 831642 804386 793872 795096 792606 769713 729953 699464 694314 697061 682874
35219 682874 658813 656568 688840 728491 731900 677395 586414 510455 486667 502385 515396 507853
35207 507853 498595 501707 504836 499586 500568 515347 525192 517510 509061 513209 513392 497076 486894 504252
$$ packed form
35291A004789K7702P837n888j890O477K727r453j9463k9981m2151l5873M169N0888
35278I59890N9082K7845K895J2269L8173O1787R1614J25766J27784P2651j2952
35267A566804q5302j29532j44728j20556o6459k9832l9335n7850l9278m288l070
35256H46574k5179j3902L6121O3427L1047k5051n4822n2070l5304j4006M651R163
35244G70649K150o59J085o335j6000k217L3824N6102M4638K1227R799K971j4004
35231I03230l3328l8260k7256j0514J224k490k2893l9760l0489n150K747j4187
35219F82874k4061k245L2272L9651L409n4505r0981p5959k3788J5718J3011p543
35207E07853r258L112L129n250R82J4779R845p682q449M148J83j6316j0182J7358
$$ plain form
35193 504252 527485 523536 500380 489991 497594 506998 519755 546573 571122 565226 535084 514555
35181 514555 517386 531175 550966 580332 604488 602262 583877 580318 596692 611857 620898 638614
35169 638614 661499 667272 655945 652460 663341 668481 661375 658800 662918 652883 625274 606044 609741
35156 609741 621738 633199 657772 698823 735195 756562 779225 808295 817567 789291 744621 712185
35144 712185 693775 682883 688279 712617 733074 732511 729356 747267 772224 769746 732849 685807
35132 685807 650584 635196 645173 677968 710596 720191 716982 732380 770914 796575 776305 721467
35120 721467 674627 662661 671969 667895 633223 586419 562699 578514 617035 648424 660348 666143
35108 666143 684919 716448 738104 729021 695174 663525 651141 650670 650014 652608 667698 691305 710345
$$ packed form
35193E04252K3233l949k3156j0389P603R404J2757K6818K4549n896l0142k0529
35181E14555K831J3789J9791K9366K4156k226j8385l559J6374J5165R041J7716
35169F38614K2885N773j1327l485J0881N140p106k575M118j0035k7609j9230L697
35156F09741J1997J1461K4573M1051L6372K1367K2663K9070R272k8276m4670l2436
35144G12185j8410j0892N396K4338K0457n63l155J7911K4957k478l6897m7042
35132F85807l5223j5388R977L2795L2628R595l209J5398L8534K5661k0270n4838
35120G21467m6840j1966R308m074l4672m6804k3720J5815L8521L1389J1924N795
35108F66143J8776L1529K1656r083l3847l1649j2384m71o56K594J5090K3607J9040
$$ plain form
35095 710345 719931 727519 747592 798153 886439 986091 1047935 1054351 1047291 1077877 1141396 1190339
35083 1190339 1201980 1201424 1221092 1267597 1329687 1392072 1438590 1464355 1486636 1525715 1579389 1634448
35071 1634448 1690323 1744903 1772690 1754576 1718966 1710446 1723390 1714577 1681500 1673850 1715330 1766932
35059 1766932 1789880 1798085 1820507 1852507 1875902 1892974 1908493 1906510 1875951 1836110 1810927 1800969
35047 1800969 1801796 1820431 1848965 1854362 1825196 1796747 1793410 1776424 1693695 1560199 1441417 1369238
35035 1369238 1320414 1272213 1232616 1209845 1190165 1157382 1109363 1049902 986521 938479 924387
35024 924387 938397 957230 971282 990419 1019880 1049840 1069951 1077970 1074591 1064588 1060223 1068135
35012 1068135 1076302 1068696 1047747 1028058 1016605 1015892 1034807 1073364 1107118 1115042 1116314 1147320
$$ packed form
35095G10345R586P588K0073N0561Q8286R9652O1844O416p060L0586O3519M8943
35083A190339J1641n56J9668M6505O2090O2385M6518K5765K2281L9079N3674N5059
35071A634448N5875N4580K7787j8114l5610q520J2944q813l3077p650M1480N1602
35059A766932K2948Q205K2422L2000K3395J7072J5519j983l0559l9841k5183r958
35047A800969Q27J8635K8534N397k9166k8449l337j6986q2729j33496j18782p2179
35035A369238m8824m8201l9597k2771j9680l2783m8019n9461o3381m8042j4092
35024I24387J4010J8833J4052J9137K9461K9960K0111Q019l379j0003m365P912
35012A068135Q167p606k0949j9689j1453p13J8915L8557L3754P924J272L1006
$$ plain form
35000 1147320 1203775 1242161 1246448 1256553 1310408 1387336 1438311 1455387 1478730 1537632 1612877
34989 1612877 1666127 1687005 1695812 1708565 1716792 1704702 1674111 1643898 1630560 1637376 1657906 1679564
34977 1679564 1685728 1666458 1629924 1595480 1574606 1565246 1561381 1557264 1545732 1526504 1513898 1520616
34965 1520616 1536519 1542303 1541652 1556075 1587724 1615713 1634499 1664647 1713547 1756484 1774727 1783930
34953 1783930 1803119 1822084 1824673 1819674 1819195 1807668 1765690 1709204 1670773 1651773 1625965 1583739
34941 1583739 1540328 1502840 1460227 1408041 1356763 1312401 1271509 1238502 1227478 1242647 1271751
34930 1271751 1298930 1310923 1295620 1251472 1194875 1143080 1095655 1047428 1008303 988969 976415
34919 976415 948040 904059 862446 828406 794581 765993 756443 761691 763065 757085 755652 758743 755040
$$ packed form
35000A147320N6455L8386M287J0105N3855P6928N0975J7076K3343N8902P5245
34989A612877N3250K0878Q807J2753Q227j2090l0591l0213j3338O816K0530K1658
34977A679564O164j9270l6534l4444k0874r360l865m117j1532j9228j2606O718
34965A520616J5903N784o51J4423L1649K7989J8786L0148M8900M2937J8243R203
34953A783930J9189J8965K589m999m79j1527m1978n6486l8431j9000k5808m2226
34941A583739m3411l7488m2613n2186n1278m4362m0892l3007j1024J5169K9104
34930A271751K7179J1993j5303m4148n6597n1795m7425m8227l9125j9334j2554
34919I76415k8375m3981m1613l4040l3825k8588r550N248J374n980j433L091l703
$$ plain form
34906 755040 748320 752068 756806 737330 699078 682141 705611 739009 745535 726222 703904 690138
34894 690138 688931 708944 746593 774880 774630 764264 774736 805209 828147 832684 838697 867013
34882 867013 914891 964829 1003951 1030935 1053832 1084395 1127886 1176544 1217007 1242826 1255827
34871 1255827 1259377 1257536 1258079 1267673 1283652 1297256 1305384 1311706 1313625 1295891 1244939 1167797 1090084
34858 1090084 1034263 1004278 990402 979572 957129 910318 842815 780099 746137 736451 727769 712344
34846 712344 705193 715356 730092 737429 748685 784732 847073 911420 945716 933608 889639 850761
34834 850761 840129 841953 828931 807074 803715 813910 800542 758615 734480 756382 787739 784646
34822 784646 762550 760661 769745 749462 701710 671960 681607 708447 735374 770772 812741 836462
$$ packed form
34906G55040o720L748M738j9476l8252j6937K3470L3398O526j9313k2318j3766
34894F90138j207K0013L7649K8287k50j0366J0472L0473K2938M537O013K8316
34882H67013M7878M9938L9122K6984K2897L0563M3491M8658M0463K5819J3001
34871A255827L550j841N43R594J5979J3604Q128O322J919j7734n0952p7142p7713
34858A090084n5821k9985j3876j0830k2443m6811o7503o2716l3962r686q682j5425
34846G12344p151J0163J4736P337J1256L6047O2341O4347L4296j2108m3969l8878
34834H50761j0632J824j3022k1857l359J0195j3368m1927k4135K1902L1357l093
34822G84646k2096j889R084k0283m7752k9750R647K6840K6927L5398M1969K3721
$$ plain form
34810 836462 831643 819577 821588 838927 870282 918226 970862 1007706 1031656 1065167 1108080 1132191
34798 1132191 1127333 1119518 1130372 1150228 1165181 1178042 1185200 1165863 1118211 1078282 1075659 1091593
34786 1091593 1087777 1059743 1035137 1031071 1038874 1045062 1045096 1036591 1014330 975374 924733 877069 849656
34773 849656 842702 828317 775452 688767 607183 560839 545049 538186 526361 507056 487754 485512
34761 485512 509964 544807 565483 573661 588896 607848 605832 584658 581795 616989 663402 690551
34749 690551 704108 720245 730176 718587 694244 673266 649909 611888 570199 546276 539925 535043
34737 535043 529449 536060 558186 581101 585543 560526 512318 469059 461296 486163 506686 499175
34725 499175 483194 489285 516199 539789 547746 543876 531288 513278 501346 502858 508012 503900 492321
$$ packed form
34810H36462m819j2066K011J7339L1355M7944N2636L6844K3950L3511M2913K4111
34798A132191m858p815J0854J9856J4953J2861P158j9337m7652l9929k623J5934
34786A091593l816k8034k4606m066P803O188L4q505k2261l8956n0641m7664k7413
34773H49656o954j4385n2865q6685q1584m6344j5790o863j1825j9305j9302k242
34761D85512K4452L4843K0676Q178J5235J8952k016k1174k863L5194M6413K7149
34749F90551J3557J6137R931j1589k4343k0978k3357l8021m1689k3923o351m882
34737E35043n594O611K2126K2915M442k5017m8208m3259p763K4867K0523p511
34725D99175j5981O091K6914K3590P957l870j2588j8010j1932J512N154m112j1579
$$ plain form
34712 492321 481094 469923 457518 449075 444809 437010 428919 434332 444379 422018 352286 273023
34700 273023 228780 217597 212939 212491 225306 230817 199725 148980 127938 146728 162904 149286
34688 149286 132901 146762 177409 187646 169283 145032 128941 111391 84007 59982 59481 81292
34676 81292 100351 99083 95006 123894 193185 266326 301889 296162 276297 263281 256645 247242 228316
34663 228316 197874 165011 151856 174939 222433 259037 256741 218793 175091 154438 156974 155685
34651 155685 132003 103173 98538 114724 119706 102513 89502 102424 129588 152427 171365 186448
34639 186448 181120 150602 122704 123238 139986 145838 136698 119717 87857 41046 12880 34964
34627 34964 85217 112520 108196 112248 146614 182700 188477 176560 185628 230749 288694 327012
$$ packed form
34712D92321j1227j1171j2405q443m266p799q091N413J0047k2361o9732p9263
34700B73023m4243j1183m658m48J2815N511l1092n0745k1042J8790J6176j3618
34688A49286j6385J3861L0647J0237j8363k4251j6091j7550k7384k4025n01K1811
34676H1292J9059j268m077K8888O9291P3141L5563n727j9865j3016o636r403j8926
34663B28316l0442l2863j3155K3083M7494L6604k296l7948m3702k0653K536j289
34651A55685k3682k8830m635J6186M982j7193j3011J2922K7164K2839J8938J5083
34639A86448n328l0518k7898N34J6748N852r140j6981l1860m6811k8166K2084
34627C4964N0253K7303m324M052L4366L6086N777j1917R068M5121N7945L8318
$$ plain form
34615 327012 339395 351070 386527 434765 461473 458287 456636 480572 510967 516821 498892 476802
34603 476802 453332 420718 385895 359898 336425 309178 293962 301958 307444 279001 231907 212946
34591 212946 240149 290487 338339 372572 385643 382164 390085 427729 469299 479917 472132 484589
34579 484589 515709 526869 504128 465722 414100 338962 269724 261238 311485 350409 331340 282123
34567 282123 245347 222165 202593 197948 206480 192940 143080 99252 99608 116997 103994 69095
34555 69095 57698 76962 91240 84523 79518 91109 99979 84101 51013 27158 28236 44847
34543 44847 50020 23661 -23081 -54276 -47451 -16459 10703 23588 28744 31862 34584 38124 36948
34530 36948 19153 -14158 -40067 -37625 -12068 16097 36692 51865 60925 57882 41692 19236
$$ packed form
34615C27012J2383J1675L5457M8238K6708l186j651K3936L0395N854j7929k2090
34603D76802k3470l2614l4823k5997k3473k7247j5216P996N486k8443m7094j8961
34591B12946K7203N0338M7852L4233J3071l479P921L7644M1570J0618p785J2457
34579D84589L1120J1160k2741l8406n1622p5138o9238q486N0247L8924j9069m9217
34567B82123l6776k3182j9572m645Q532j3540m9860m3828L56J7389j3003l4899
34555F9095j1397J9264J4278o717n005J1591Q870j5878l3088k3855J078J6611
34543D4847N173k6359m6742l1195O825L0992K7162J2885N156L118K722L540j176
34530C6948j7795l3311k5909K442K5557K8165K0595J5173R060l043j6190k2456
$$ plain form
34518 19236 -654 -11468 -11099 -3378 5890 15027 24577 32922 41455 58456 85407 103891 91114
34505 91114 46712 -8677 -56703 -88298 -94783 -72894 -36790 -7259 8600 13268 5957 -5905
34493 -5905 2536 41944 79983 78510 50498 41770 62754 81339 80896 77587 75895 57034 23920
34480 23920 9567 22743 30125 13741 3261 26014 64241 89759 105776 125398 139637 135149
34468 135149 117324 92594 56080 18253 11796 46683 88058 102727 97584 90325 78345 63469
34456 63469 68698 95523 100075 51940 -12343 -35298 -13627 11719 17433 9628 -5929 -24371
34444 -24371 -27890 -9351 4089 -13179 -39130 -29250 23006 83151 121827 133443 120449 90372
34432 90372 61313 45909 38477 34538 43976 66527 80425 78467 85330 111384 123185 94815 54005
$$ packed form
34518A9236j9890j0814L69P721R268R137R550Q345Q533J7001K6951J8484j2777
34505I1114m4402n5389m8026l1595o485K1889L6104K9531J5859M668p311j1862
34493e905Q441L9408L8039j473k8012q728K0984J8585m43l309j692j8861l3114
34480B3920j4353J3176P382j6384j0480K2753L8227K5518J6017J9622J4239m488
34468A35149j7825k4730l6514l7827o457L4887M1375J4669n143p259j1980j4876
34456F3469N229K6825M552m8135o4283k2955K1671K5346N714p805j5557j8442
34444b4371l519J8539J3440j7268k5951R880N2256O0145L8676J1616j2994l0077
34432I0372k9059j5404p432l939R438K2551J3898j958O863K6054J1801k8370m0810
$$ plain form
34419 54005 35408 22438 -13959 -49696 -40757 -1308 13806 -6786 -25248 -26650 -34726 -53411
34407 -53411 -53028 -26633 -7050 -10624 -9188 22167 66038 91214 92610 86859 88551 100355 110773
34394 110773 100887 69424 44422 50765 77619 99780 113142 120021 101412 44544 -18000 -41070
34382 -41070 -27897 -15349 -11730 1263 15439 2169 -29073 -34153 -2512 29227 38626 41406
34370 41406 45893 36572 16928 17082 40098 48995 28336 11943 23569 33349 5068 -46876 -78728
34357 -78728 -71071 -37777 -4138 5199 -19651 -53667 -52127 -403 71009 128117 164123 182264
34345 182264 180135 164123 151032 142516 123804 96894 86511 103590 131049 152610 164756 155446
34333 155446 109369 45038 7977 12889 29762 40131 63764 109137 141573 131584 99731 80526
$$ packed form
34419E4005j8597j2970l6397l5737Q939L9449J5114k0592j8462j402q076j8685
34407e3411L83K6395J9583l574J436L1355M3871K5176J396n751J692J1804J0418
34394A10773r886l1463k5002O343K6854K2161J3362O879j8609n6868o2544k3070
34382d1070J3173J2548L619J2993J4176j3270l1242n080L1641L1739R399K780
34370D1406M487r321j9644J54K3016Q897k0659j6393J1626R780k8281n1944l1852
34357g8728P657L3294L3639R337k4850l4016J540N1724P1412N7108L6006J8141
34345A82264k129j6012j3091q516j8712k6910j0383J7079K7459K1561J2146r310
34333A55446m6077o4331l7061M912J6873J0369K3633M5373L2436r989l1853j9205
$$ plain form
34321 80526 69690 39804 -12735 -65591 -99869 -109950 -99367 -83217 -77637 -74792 -48798 4004
34309 4004 55248 83047 90772 79897 42442 -4307 -16882 15345 45819 33226 -3776 -22314
34297 -22314 -13986 3956 26948 56322 75901 71136 57371 59350 75110 84455 78465 58403 23436
34284 23436 -15771 -28675 2488 53311 83637 83060 71399 66685 71669 81043 85886 80702 75525
34271 75525 86381 107494 114537 102866 95541 102983 106102 95450 94273 120149 153366 168670 171940
34258 171940 179252 184208 173747 155608 143622 133802 118804 108603 114830 130725 144343 153470
34246 153470 153169 132035 97180 78668 92779 124413 156525 185300 195049 160134 93607 52768
34234 52768 68982 109716 135991 154141 178656 189765 170232 144593 137565 130706 105880 92484
$$ packed form
34321H0526j0836k9886n2539n2856l4278j0081J0583J6150N580K845K5994N2802
34309D004N1244K7799P725j0875l7455m6749j2575L2227L0474j2593l7002j8538
34297b2314Q328J7942K2992K9374J9579m765j3765J979J5760R345n990k0062l4967
34284B3436l9207j2904L1163N0823L0326n77j1661m714M984R374M843n184n177
34271G5525J0856K1113P043j1671p325P442L119j0652j177K5876L3217J5304L270
34258A71940P312M956j0461j8139j1986r820j4998j0201O227J5895J3618R127
34246A53470l01k1134l4855j8512J4111L1634L2112K8775R749l4915o6527m0839
34234E2768J6214M0734K6275J8150K4515J1109j9533k5639p028o859k4826j3396
$$ plain form
34222 92484 117746 145210 123612 70916 47376 63865 79856 80503 91923 120446 134195 114054
34210 114054 80353 62761 75901 121356 181653 219798 216557 197304 192227 189855 166059 134738
34198 134738 124027 123737 108133 93630 117939 172814 213537 228777 246603 276130 298287 311831
34186 311831 333208 351223 337471 302773 286315 285977 260113 206741 177326 193578 210768 190597
34174 190597 157672 151832 168601 180437 182044 183663 188008 200265 234633 286216 319446 307526
34162 307526 266167 232107 225200 242085 266747 277250 262172 237972 229886 233682 223658 201761
34150 201761 204597 249388 304387 330485 326415 314148 301770 282926 260009 247685 255211 273817
34138 273817 282161 266946 241096 231969 244893 253946 240339 219204 210566 208120 201962 205755 227040
$$ packed form
34222I2484K5262K7464k1598n2696k3540J6489J5991O47J1420K8523J3749k0141
34210A14054l3701j7592J3140M5455O0297L8145l241j9253n077k372k3796l1321
34198A34738j0711k90j5604j4503K4309N4875M0723J5240J7826K9527K2157J3544
34186C11831K1377J8015j3752l4698j6458l38k5864n3372k9415J6252J7190k0171
34174A90597l2925n840J6769J1836J607J619M345J2257L4368N1583L3230j1920
34162C07526m1359l4060o907J6885K4662J0503j5078k4200q086L796j0024k1897
34150B01761K836M4791N4999K6098m070j2267j2378j8844k2917j2324P526J8606
34138B73817Q344j5215k5850r127J2924R053j3607k1135q638k446o158L793K1285
$$ plain form
34125 227040 235796 205799 167719 172708 216721 251591 261588 274361 299258 312643 311643 328185
34113 328185 374150 418281 434666 435436 439613 443809 438783 427399 416709 415535 439202 489287 534973
34100 534973 547814 546986 572658 625011 673453 714731 768839 823875 844907 840466 860411 917847
34088 917847 969181 983258 975039 957647 918426 862483 826592 825929 832785 828036 827857 839850 839360
34075 839360 812920 784599 777757 786126 797052 806507 801758 769942 731060 718864 724799 709699
34063 709699 673410 655563 661070 647796 601124 557628 538983 526626 519048 544608 592756 602512
34051 602512 552201 496773 482575 487228 478179 467850 471595 470021 454221 455372 491624 535894
34039 535894 567542 601076 634332 630141 584448 551525 565241 594980 611933 632410 659950 656423
$$ packed form
34125B27040Q756k9997l8080M989M4013L4870R997J2773K4897J3385j000J6542
34113C28185M5965M4131J6385P70M177M196n026j1384j0690j174K3667N0085M5686
34100E34973J2841q28K5672N2353M8442M1278N4108N5036K1032m441J9945N7436
34088I17847N1334J4077q219j7392l9221n5943l5891o63O856m749j79J1993m90
34075H39360k6440k8321o842Q369J0926R455m749l1816l8882j2196N935j5100
34063G09699l6289j7847N507j3274m6672m3496j8645j2357p578K5560M8148R756
34051F02512n0311n5428j4198M653r049j0329L745j574j5800J151L6252M4270
34039E35894L1648L3534L3256m191m5693l2923J3716K9739J6953K0477K7540l527
$$ plain form
34027 656423 613681 584247 596757 611084 601036 605871 651152 696680 716094 747521 807790 841851
34015 841851 824468 826383 902313 994651 1031408 1041638 1085114 1142655 1171366 1199338 1266549 1335235
34003 1335235 1358766 1378913 1452516 1539693 1571231 1574582 1624866 1716590 1789670 1840453 1904784
33992 1904784 1972981 2020718 2080302 2185113 2293046 2360546 2432856 2559297 2688927 2766091
33982 2766091 2856719 3047589 3287090 3467593 3603731 3779942 3981465 4138155 4283246 4500905
33972 4500905 4762497 4986030 5211304 5534412 5913033 6232558 6529366 6942086 7467722
33963 7467722 7978949 8461886 9015029 9631516 10220503 10834879 11627516 12584517 13566575
33954 13566575 14616449 15940069 17576996 19406735 21498812 24093208 27171476 30416159
$$ packed form
34027F56423m2742k9434J2510J4327j0048M835M5281M5528J9414L1427O0269L4061
34015H41851j7383J915P5930R2338L6757J0230M3476N7541K8711K7972O7211O8686
34003A335235K3531K0147P3603Q7177L1538L351N0284R1724P3080N0783O4331
33992A904784O8197M7737N9584J04811J07933O7500P2310J26441J29630P7164
33982B766091R0628J90870K39501J80503J36138J76211K01523J56690J45091K17659
33972D500905K61592K23533K25274L23108L78621L19525K96808M12720N25636
33963G467722N11227M82937N53143O16487N88987O14376P92637R57001R82058
33954A3566575J049874J323620J636927J829739K092077K594396L078268L244683
$$ plain form
33946 30416159 33664148 37017779 40516153 44281112 49039175 55553625 62924157 68225210
33938 68225210 68918141 65518107 61102525 58248221 57171049 56781663 56536926 56740952 57629891
33929 57629891 58851478 59879276 60772952 62470626 65970759 70709552 73975060 72865827
33921 72865827 67202576 59875852 53925776 49870422 46333852 42493091 38882964 36083326
33913 36083326 33739640 31178806 28287830 25396000 22719450 20277092 18095750 16209814
33905 16209814 14592987 13247564 12221749 11444354 10716122 9957130 9284612 8758985 8247652
33896 8247652 7649662 7065476 6610677 6227488 5821341 5436064 5146270 4903625 4638406
33887 4638406 4404019 4273221 4183464 4028572 3825677 3655479 3508955 3328839 3141197 3011070
$$ packed form
33946C0416159L247989L353631L498374L764959M758063O514450P370532N301053
33938F8225210O92931l400034m415582k854304j077172l89386k44737K04026Q88939
33929E7629891J221587J027798Q93676J697674L500133M738793L265508j109233
33921G2865827n663251p326724n950076m055354l536570l840761l610127k799638
33913C6083326k343686k560834k890976k891830k676550k442358k181342j885936
33905A6209814j616827j345423j025815p77395p28232p58992o72518n25627n11333
33896H247652n97990n84186m54799l83189m06147l85277k89794k42645k65219
33887D638406k34387j30798q9757j54892k02895j70198j46524j80116j87642j30127
$$ plain form
33877 3011070 2915784 2788435 2645015 2548835 2488201 2405671 2311820 2255009 2211947 2122860 2006465
33866 2006465 1928597 1884020 1819241 1744655 1712044 1707659 1682036 1658857 1693721 1750371 1748016 1713157
33854 1713157 1745366 1839281 1886100 1860562 1860632 1937083 2023392 2069735 2114412 2182047 2237940 2287116
33842 2287116 2393025 2547956 2646853 2644983 2625531 2656908 2701473 2722610 2757850 2816215 2823709
33831 2823709 2749629 2674603 2654381 2629271 2553102 2497363 2530348 2597638 2621813 2621961 2636038 2625827
33819 2625827 2565696 2530477 2584598 2671082 2716239 2754425 2841863 2940917 3003965 3078595 3210736
33808 3210736 3336601 3394283 3449825 3585723 3759191 3901948 4059622 4289911 4525064 4690658
33798 4690658 4861836 5136714 5449675 5683281 5875627 6139888 6467017 6787822 7136677
$$ packed form
33877C011070r5286j27349j43420r6180o0634q2530r3851n6811m3062q9087j16395
33866B006465p7868m4577o4779p4586l2611m385k5623k3179L4864N6650k355l4859
33854A713157L2209R3915M6819k5538P0P6451Q6309M6343M4677O7635N5893M9176
33842B287116J05909J54931R8897j870j9452L1377M4565K1137L5240N8365P494
33831B823709p4080p5026k0222k5110p6169n5739L2985O7290K4175J48J4077j0211
33819B625827o0131l5219N4121Q6484M5157L8186Q7438R9054O3048P4630J32141
33808C210736J25865N7682N5542J35898J73468J42757J57674K30289K35153J65594
33798D690658J71178K74878L12961K33606J92346K64261L27129L20805L48855
$$ plain form
33789 7136677 7565701 7995734 8351126 8737667 9276699 9878560 10411142 10966732 11699383
33780 11699383 12524037 13271851 14024508 14969301 16033941 17022946 18018491 19258249 20702005
33771 20702005 22143541 23686878 25661062 28120504 30917611 34208063 38312128 43079853
33763 43079853 47991160 52890767 58010271 63407124 69314945 76920952 87202047 98256907
33755 98256907 105281967 104807657 98499040 91517028 87441661 85973509 85238517 84625885
33747 84625885 84785637 86012439 87648067 88936539 90147233 92788918 98168534 105020445
33739 105020445 109058903 106304115 97198935 86378837 77972639 72163291 66809272 61010191
33731 61010191 55722260 51631914 48060821 44096067 39695327 35343821 31341873 27766578
$$ packed form
33789G136677M29024M30033L55392L86541N39032O01861N32582N55590P32651
33780A1699383Q24654P47814P52657R44793J064640R89005R95545J239758J443756
33771B0702005J441536J543337J974184K459442K797107L290452M104065M767725
33763D3079853M911307M899607N119504N396853N907821P606007J0281095J1054860
33755I8256907P025060m74310o308617o982012m075367j468152p34992o12632
33747H4625885J59752J226802J635628J288472J210694K641685N379616O851911
33739A05020445M038458k754788r105180j0820098q406198n809348n354019n799081
33731F1010191n287931m090346l571093l964754m400740m351506m001948l575295
$$ plain form
33723 27766578 24665978 22008601 19703620 17778691 16300928 15122423 13987241 12876002
33715 12876002 11949409 11176826 10343070 9421710 8616995 8006691 7447390 6874884 6405563
33706 6405563 6077974 5761970 5397428 5083961 4864037 4638345 4362747 4121306 3940262
33697 3940262 3727053 3455964 3225912 3073132 2907315 2694106 2526208 2449384 2381864 2269575
33687 2269575 2166925 2103149 2016715 1883275 1771440 1716273 1666120 1598919 1560523 1548680 1493365
33676 1493365 1391419 1326193 1316678 1285622 1214721 1186008 1223259 1238247 1188617 1146593 1152253
33665 1152253 1140943 1083197 1056744 1101742 1135368 1094335 1041238 1042514 1054467 1021928 986140
33654 986140 999422 1023055 1003082 968987 969518 980835 960243 928082 921572 924550 908024 884833
$$ packed form
33723B7766578l100600k657377k304981j924929j477763j178505j135182j111239
33715A2876002r26593p72583q33756r21360q04715o10304n59301n72506m69321
33706F405563l27589l16004l64542l13467k19924k25692k75598k41441j81044
33697C940262k13209k71089k30052j52780j65817k13209j67898p6824o7520j12289
33687B269575j02650o3776q6434j33440j11835n5167n0153o7201l8396j1843n5315
33676A493365j01946o5226r515l1056p0901k8713L7251J4988m9630m2024N660
33665A152253j1310n7746k6453M4998L3626m1033n3097J276J1953l2539l5788
33654I86140J3282K3633j9973l4095N31J1317k0592l2161o510K978j6526k3191
$$ plain form
33642 884833 868914 840018 798786 791757 831983 861668 842153 812030 808901 807470 785811 776676
33630 776676 796352 795565 740237 673393 641318 626290 605681 604388 630219 630440 576117 521208
33618 521208 515060 524598 507394 491857 514792 546117 550200 560502 616205 679797 694496 674640
33606 674640 666278 666407 653702 651555 685786 723020 724644 721255 761209 825101 864763 889523 938461
33593 938461 999954 1033838 1045885 1068247 1090843 1082207 1056820 1055048 1075635 1089756 1100013 1123793
33581 1123793 1140742 1120888 1086284 1082322 1103942 1109945 1094494 1084388 1078516 1049237 995990 944143
33569 944143 897546 840596 779899 739680 723725 719382 725055 736868 727210 676401 607832 554971
33557 554971 515118 472073 437727 429732 432762 422889 405614 391726 365992 321299 290731 299009
$$ packed form
33642H84833j5919k8896m1232p029M0226K9685j9515l0123l129j431k1659r135
33630G76676J9676p87n5328o6844l2075j5028k0609j293K5831K21n4323n4909
33618E21208o148R538j7204j5537K2935L1325M083J0302N5703O3592J4699j9856
33606F74640q362J29j2705k147L4231L7234J624l389L9954O3892L9662K4760M8938
33593I38461O1493L3884J2047K2362K2596q636k5387j772K0587J4121J0257K3780
33581A123793J6949j9854l4604l962K1620O003j5451j0106n872k9279n3247n1847
33569I44143m6597n6950o0697m0219j5955m343N673J1813r658n0809o8569n2861
33557E54971l9853m3045l4346p995L030r873j7275j3888k5734m4693l0568Q278
$$ plain form
33545 299009 312922 287581 232269 184729 153797 135509 148148 195593 230876 214580 177042
33534 177042 165650 167752 148966 128150 140467 161058 146750 124622 150417 198326 186453 107608
33522 107608 44102 46094 79253 105298 133472 169991 187736 174794 157444 151949 141994 120711
33510 120711 108390 113677 119860 119880 124156 128864 119168 106443 118155 149450 169206 172605 180543
33497 180543 189965 176561 146004 129042 124537 101925 63264 47282 65754 89600 103781 121442
33485 121442 137836 127646 97770 86324 97954 96143 71442 59065 73373 84059 78176 88482
33473 88482 134147 185331 214194 233208 254952 259468 232616 198648 185707 190486 198550 207392
33461 207392 211566 198943 178477 178539 204505 232293 252044 276735 298347 284018 233119 191660
$$ packed form
33545B99009J3913k5341n5312m7540l0932j8288J2639M7445L5283j6296l7538
33534A77042j1392K102j8786k0816J2317K0591j4308k2128K5795M7909j1873p8845
33522A07608o3506J992L3159K6045K8174L6519J7745j2942j7350n495r955k1283
33510A20711j2321N287O183K0M276M708r696j2725J1712L1295J9756L399P938
33497A80543R422j3404l0557j6962m505k2612l8661j5982J8472K3846J4181J7661
33485A21442J6394j0190k9876j1446J1630j811k4701j2377J4308J0686n883J0306
33473H8482M5665N1184K8863J9014K1744M516k6852l3968j2941M779Q064Q842
33461B07392M174j2623k0466O2K5966K7788J9751K4691K1612j4329n0899m1459
$$ plain form
33449 191660 189028 203371 209579 216574 232829 237576 214370 178680 149474 126133 109713 110022 117324
33436 117324 108575 95519 118856 177395 215378 203447 177991 171310 159985 122367 93610 112852
33424 112852 157551 182537 191002 214698 249285 260754 240781 212308 191312 178417 176991 188599
33412 188599 200214 199159 188727 174003 153155 136730 146499 177433 193545 181727 173166 187355
33400 187355 195773 172732 141694 132700 131660 115176 100563 112137 127482 110842 78143 73802
33388 73802 96489 102193 76511 54590 66962 106791 154526 198777 226689 224282 195887 164405
33376 164405 148545 152426 173460 206654 244727 280885 302641 284537 212574 121056 71884 84060
33364 84060 117544 139152 159209 181745 173593 124569 89451 115763 167770 180950 160823 163392
$$ packed form
33449A91660k632J4343O208O995J6255M747k3206l5690k9206k3341j6420L09P302
33436A17324q749j3056K3337N8539L7983j1931k5456o681j1325l7618k8757J9242
33424A12852M4699K4986Q465K3696L4587J1469j9973k8473k0996j2895j426J1608
33412A88599J1615j055j0432j4724k0848j6425R769L0934J6112j1818q561J4189
33400A87355Q418k3041l1038q994j040j6484j4613J1574J5345j6640l2699m341
33388G3802K2687N704k5682k1921J2372L9829M7735M4251K7912k407k8395l1482
33376A64405j5860L881K1034L3194L8073L6158K1756j8104p1963r1518m9172J2176
33364H4060L3484K1608K0057K2536q152m9024l5118K6312N2007J3180k0127K569
$$ plain form
33352 163392 199570 227120 227287 223671 226393 218994 205351 212282 235703 236256 202034 169842 169221
33339 169221 185232 190295 176538 145015 98936 60512 60704 97738 134270 146565 148248 156105
33327 156105 162716 156366 142070 129342 120318 120060 138451 173063 207531 231597 245618 245039 221822
33314 221822 183382 150187 133516 132864 149692 181046 205900 204934 190188 188706 203006 217688
33302 217688 237169 278316 326668 340992 309259 265434 243039 244595 262188 291634 316764 316176
33290 316176 298792 298951 322961 335154 312991 281198 270358 273258 266441 247961 228221 205539
33278 205539 176035 150622 140063 137755 135651 141933 165730 199554 233001 267886 303465 323531
33266 323531 317394 300031 292232 291269 278960 250813 221582 207458 213862 234634 255009 262862 263410
$$ packed form
33352A63392L6178K7550J67l616K722p399j3643O931K3421N53l4222l2192o21
33339A69221J6011N063j3757l1523m6079l8424J92L7034L6532J2295J683P857
33327A56105O611o350j4296j2728r024k58J8391L4612L4468K4066J4021n79k3217
33314B21822l8440l3195j6671o52J6828L1354K4854r66j4746j482J4300J4682
33302B17688J9481M1147M8352J4324l1733m3825k2395J556J7593K9446K5130n88
33290C16176j7384J59K4010J2193k2163l1793j0840K900o817j8480j9740k2682
33278B05539k9504k5413j0559k308k104O282K3797L3824L3447L4885L5579K0066
33266C23531o137j7363p799r63j2309k8147k9231j4124O404K0772K0375P853N48
$$ plain form
33253 263410 274589 303834 339096 364301 371668 360569 342639 347436 398399 476686 531520 535228
33241 535228 508690 487771 489154 515878 567340 629211 677361 705122 724577 733908 715806 680771
33229 680771 672603 705925 734706 715654 670237 644178 633905 602092 548489 511815 505028 499381
33217 499381 479546 468840 483304 498271 484115 449644 425298 418389 408290 381336 352595 348434
33205 348434 374275 406177 417750 411171 410080 421145 420895 390931 348392 323973 323299 329795 333874
33192 333874 336532 333226 319547 307886 313528 327171 326639 314871 319600 352241 392210 417299 425658
33179 425658 420806 399239 365180 338641 335924 355410 390498 441032 502503 558650 596358 618439
33167 618439 633985 644954 647822 640697 626890 619291 636813 681939 725943 735845 714659 694950
$$ packed form
33253B63410J1179K9245L5262K5205P367j1099j7930M797N0963P8287N4834L708
33241E35228k6538k0919J383K6724N1462O1871M8150K7761J9455R331j8102l5035
33229F80771q168L3322K8781j9052m5417k6059j0273l1813n3603l6674o787n647
33217D99381j9835j0706J4464J4967j4156l4471k4346o909j0099k6954k8741m161
33205C48434K5841L1902J1573o579j091J1065k50k9964m2539k4419o74O496M079
33192C33874K658l306j3679j1661N642J3643n32j1768M729L2641L9969K5089Q359
33179D25658m852k1567l4059k6539k717J9486L5088N0534O1471N6147L7708K2081
33167F18439J5546J0969K868p125j3807p599J7522M5126M4004R902k1186j9709
$$ plain form
33155 694950 695653 710479 736988 784389 846037 896637 928913 963752 1011179 1051465 1071051 1087737
33143 1087737 1121457 1167363 1216482 1275018 1343356 1404126 1451184 1500941 1555922 1592748 1609793
33132 1609793 1646654 1725774 1816316 1892351 1982100 2112790 2250708 2354599 2451738 2595197
33122 2595197 2773501 2930515 3053592 3174624 3302883 3426405 3563486 3741232 3936533
33113 3936533 4109582 4280535 4497523 4745057 4966347 5162595 5384953 5644475 5923041
33104 5923041 6254492 6687493 7180878 7651252 8114573 8658064 9285719 9932534 10620493
33095 10620493 11438897 12375948 13357515 14463895 15903133 17746733 19915335 22448047
33087 22448047 25510148 29069962 32857068 36713655 40684134 44778766 49189360 54776529
$$ packed form
33155F94950P03J4826K6509M7401O1648N0600L2276L4839M7427M0286J9586J6686
33143A087737L3720M5906M9119N8536O8338O0770M7058M9757N4981L6826J7045
33132A609793L6861P9120R0542P6035Q9749J30690J37918J03891R7139J43459
33122B595197J78304J57014J23077J21032J28259J23522J37081J77746J95301
33113C936533J73049J70953K16988K47534K21290J96248K22358K59522K78566
33104E923041L31451M33001M93385M70374M63321N43491O27655O46815O87959
33095A0620493Q18404R37051R81567J106380J439238J843600K168602K532712
33087B2448047L062101L559814L787106L856587L970479M094632M410594N587169
$$ plain form
33079 54776529 62348457 70717346 76263777 75781954 69823065 62246937 56315279 52146079
33071 52146079 48192799 43948616 40212034 37405084 34865870 31829264 28308773 24846858
33063 24846858 21914540 19696630 18073302 16669980 15180748 13699183 12523920 11683962
33055 11683962 10926737 10131223 9417529 8839185 8273311 7667018 7125678 6695417 6289889
33046 6289889 5882302 5551273 5294448 5009157 4693710 4456473 4294453 4081722 3813272
33037 3813272 3635156 3584471 3523433 3389837 3290289 3274645 3236924 3124614 3038773 3034727 3020034
33026 3020034 2944160 2899292 2935124 2956399 2904463 2865120 2896972 2924743 2903723 2921819 3035663
33015 3035663 3166560 3256353 3364789 3518635 3632479 3678056 3764032 3947305 4134028 4267985
$$ packed form
33079E4776529P571928Q368889N546431m81823n958889p576128n931658m169200
33071E2146079l953280m244183l736582k806950k539214l036606l520491l461915
33063B4846858k932318k217910j623328j403322j489232j481565j175263q39958
33055A1683962p57225p95514p13694n78344n65874o06293n41340m30261m05528
33046F289889m07587l31029k56825k85291l15447k37237j62020k12731k68450
33037C813272j78116n0685o1038j33596r9548j5644l7721j12310q5841m046j4693
33026C020034p5874m4868L5832K1275n1936l9343L1852K7771k1020J8096J13844
33015C035663J30897Q9793J08436J53846J13844M5577Q5976J83273J86723J33957
$$ plain form
33005 4267985 4442202 4717300 5004743 5240146 5497157 5821740 6136210 6418045 6783484
32996 6783484 7278647 7784201 8243472 8775357 9438147 10107414 10727682 11452075 12377778
32987 12377778 13373905 14323587 15294687 16331182 17363721 18490568 20028712 22100560
32979 22100560 24519639 27280929 30733773 34992069 39624459 44246401 48933874 53788492
32971 53788492 58887043 65149698 74027081 84862300 93275517 94260265 87370445 77404316
32963 77404316 69376776 64111509 59458450 54259683 49438959 45852545 42869552 39386154
32955 39386154 35176139 30842149 27075816 24251166 22277868 20625367 18801670 16900414
32947 16900414 15398898 14444204 13701534 12898481 12114265 11466040 10879716 10285621 9744016
$$ packed form
33005D267985J74217K75098K87443K35403K57011L24583L14470K81835L65439
32996F783484M95163N05554M59271N31885O62790O69267O20268P24393R25703
32987A2377778R96127R49682R71100J036495J032539J126847J538144K071848
32979B2100560K419079K761290L452844M258296M632390M621942M687473M854618
32971E3788492N098551O262655Q877383J0835219Q413217R84748o889820r966129
32963G7404316q027540n265267m653059n198767m820724l586414k982993l483398
32955C9386154m210015m333990l766333k824650j973298j652501j823697j901256
32947A6900414j501516r54694p42670q03053p84216o48225n86324n94095n41605
$$ plain form
32938 9744016 9270215 8781132 8291458 7935072 7733206 7553621 7336668 7151780 7009595
32929 7009595 6837457 6661287 6592089 6613202 6598045 6549888 6598982 6750439 6868207 6928932
32919 6928932 7060118 7304737 7578204 7875696 8282304 8755673 9142112 9434724 9777798
32910 9777798 10208039 10652959 11189714 12013514 13131305 14394455 15852253 17726873 19996892
32901 19996892 22369767 24713502 27137192 29674467 32444002 36109523 41252236 46803508
32893 46803508 49968045 48705007 44010004 38910072 35357715 32924201 30422999 27708951
32885 27708951 25416436 23716773 22093050 20100779 17819493 15619982 13821626 12532657
32877 12532657 11588297 10674878 9656465 8707027 8021625 7533827 7053773 6546964 6106282
$$ packed form
32938I744016m73801m89083m89674l56386k01866j79585k16953j84888j42185
32929G009595j72138j76170o9198K1113j5157m8157M9094J51457J17768O0725
32919F928932J31186K44619K73467K97492M06608M73369L86439K92612L43074
32910I777798M30241M44920N36755Q23800J117791J263150J457798J874620K270019
32901A9996892K372875K343735K423690K537275K769535L665521N142713N551272
32893D6803508L164537j263038m695003n099932l552357k433514k501202k714048
32885B7708951k292515j699663j623723j992271k281286k199511j798356j288969
32877A2532657r44360r13419j018413r49438o85402m87798m80054n06809m40682
$$ plain form
32868 6106282 5748119 5405507 5060052 4737567 4423064 4099049 3816731 3623251 3471585
32859 3471585 3298498 3131246 3020652 2931848 2804406 2665084 2577920 2530016 2465095 2386913
32849 2386913 2334789 2296852 2238781 2180701 2157838 2142359 2090477 2030170 2016216 2033818 2032811
32838 2032811 2023276 2050334 2104816 2144133 2172934 2221205 2274772 2311580 2371423 2497615 2640846
32827 2640846 2718891 2748661 2821273 2963770 3122230 3268171 3425454 3600110 3774869 3966097
32817 3966097 4201675 4456976 4697636 4961972 5306898 5698748 6061543 6408011 6812882
32808 6812882 7285127 7787521 8349974 9021246 9730995 10354549 10902725 11490293 12138452
32799 12138452 12797878 13559127 14623112 16043489 17721469 19678932 22077911 24912988
$$ packed form
32868F106282l58163l42612l45455l22485l14503l24015k82318j93480j51666
32859C471585j73087j67252j10594q8804j27442j39322q7164m7904o4921p8182
32849B386913n2124l7937n8071n8080k2863j5479n1882o0307j3954J7602j007
32838B032811r535K7058N4482L9317K8801M8271N3567L6808N9843J26192J43231
32827B640846P8045K9770P2612J42497J58460J45941J57283J74656J74759J91228
32817C966097K35578K55301K40660K64336L44926L91850L62795L46468M04871
32808F812882M72245N02394N62453O71272P09749O23554N48176N87568O48159
32799A2138452O59426P61249J063985J420377J677980J957463K398979K835077
$$ plain form
32791 24912988 27953210 31056381 34262580 37578148 41130865 45596488 51662415 58445685
32783 58445685 63059739 62841535 58094134 51871780 46911350 43466412 40312514 36915940
32775 36915940 33827650 31435950 29289395 26756640 23784997 20818335 18300744 16404885
32767 16404885 15007686 13795907 12529078 11261937 10212533 9435330 8774495 8115556
32759 8115556 7496236 6951602 6427779 5896262 5406866 4977855 4558561 4141713 3793127
32750 3793127 3529708 3282824 3024332 2817218 2694025 2590227 2451112 2309709 2204692
32741 2204692 2108411 1992414 1886085 1814534 1746949 1657993 1577341 1531333 1495377 1446960 1406031
32730 1406031 1381943 1341429 1271955 1217022 1204205 1195601 1154150 1102057 1067203 1029598 973650
$$ packed form
32791B4912988L040222L103171L206199L315568L552717M465623O065927O783270
32783E8445685M614054k18204m747401o222354m960430l444938l153898l396574
32775C6915940l088290k391700k146555k532755k971643k966662k517591j895859
32767A6404885j397199j211779j266829j267141j049404p77203o60835o58939
32759H115556o19320n44634n23823n31517m89396m29011m19294m16848l48586
32750C793127k63419k46884k58492k07114j23193j03798j39115j41403j05017
32741B204692r6281j15997j06329p1551o7585q8956q0652m6008l5956m8417m0929
32730A406031k4088m0514o9474n4933j2817q604m1451n2093l4854l7605n5948
$$ plain form
32719 973650 938835 957882 988471 967454 899082 832873 784267 734247 685144 661945 669977 694216
32707 694216 728364 767778 787144 760682 696856 629670 588691 593520 651560 736690 794722 797297
32695 797297 771800 758784 764611 775171 785180 787341 760565 698671 629584 581876 553340 531531
32683 531531 517833 508822 482286 428588 373964 350228 360739 389994 421095 432976 413526 387882
32671 387882 397012 436986 462892 463623 476788 510155 513888 466028 420626 423113 438717 422173
32659 422173 400838 418715 445817 422361 360687 324845 331090 343716 351650 372066 388321 362400
32647 362400 309496 287001 302370 300053 251505 194166 165651 160153 170126 212898 287085 350437
32635 350437 371951 369172 368427 364016 344482 328312 343011 388472 444365 496555 537034 555201
$$ packed form
32719I73650l4815J9047L0589k1017o8372o6209m8606n0020m9103k3199Q032K4239
32707F94216L4148L9414J9366k6462o3826o7186m0979M829N8040Q5130N8032K575
32695G97297k5497j3016N827J0560J0009K161k6776o1894o9087m7708k8536k1809
32683E31531j3698r011k6536n3698n4624k3736J0511K9255L1101J1881j9450k5644
32671C87882R130L9974K5906P31J3165L3367L733m7860m5402K487J5604j6544
32659D22173k1335J7877K7102k3456o1674l5842O245J2626P934K0416J6255k5921
32647C62400n2904k2495J5369k317m8548n7339k8515n498R973M2772P4187O3352
32635C50437K1514k779p45m411j9534j6170J4699M5461N5893N2190M0479J8167
$$ plain form
32623 555201 550379 542308 551513 574319 588422 579299 554171 532226 524370 523141 514853 498551 482130
32610 482130 462268 428672 390764 372289 369376 346634 294355 255959 270138 315988 348189 356949
32598 356949 355464 338530 301722 278254 303115 354018 378639 368634 354747 340396 300373 243145
32586 243145 211645 212156 199298 148477 93665 73906 85352 105016 122819 132587 128374 125933
32574 125933 150877 189582 190606 135266 70670 49055 65479 79451 70473 47526 26218 20083
32562 20083 37918 71218 97256 104938 102242 93409 71122 38030 11832 -269 -10501 -27285
32550 -27285 -45192 -61862 -79813 -87794 -67680 -24041 20643 60812 104660 136184 123097 71888
32538 71888 31703 28016 35135 34146 52207 111699 178120 199129 172411 138188 120185 107526
$$ packed form
32623E55201m822q071R205K2806J4103r123k5128k1945p856j229q288j6302j6421
32610D82130j9862l3596l7908j8475k913k2742n2279l8396J4179M5850L2201Q760
32598C56949j485j6934l6808k3468K4861N0903K4621j0005j3887j4351m0023n7228
32586B43145l1500N11j2858n0821n4812j9759J1446J9664J7803R768m213k441
32574A25933K4944L8705J024n5340o4596k1615J6424J3972q978k2947k1308o135
32562B0083J7835L3300K6038P682k696q833k2287l3092k6198j2101j0232j6784
32550b7285j7907j6670j7951p981K0114M3639M4684M0169M3848L1524j3087n1209
32538G1888m0185l687P119r89J8061N9492O6421K1009k6718l4223j8003j2659
$$ plain form
32526 107526 86525 61626 44933 41195 43251 38501 26710 27660 54664 87233 96832 93637 110045
32513 110045 138531 133994 89834 61160 86733 132621 146621 130032 116279 108995 84638 39048
32501 39048 -5476 -28365 -20195 19366 68221 86453 62102 34340 44363 82429 111203 120101
32489 120101 123080 121038 105389 89808 101298 140341 178443 195360 196635 196300 200981 207862 204512
32476 204512 179300 144096 130704 148055 162029 140505 100245 81072 88248 92955 82607 77910
32464 77910 97849 132829 158003 157367 132624 100165 79329 75960 79991 80967 75994 62702 43257
32451 43257 37392 64664 105668 112533 74120 38699 49478 89786 121199 144406 182487 225982
32439 225982 238878 210921 167721 133618 113749 106230 104760 95802 77022 68778 84943 106957
$$ packed form
32526A07526k1001k4899j6693l738K056m750j1791R50K7004L2569R599l195J6408
32513A10045K8486m537m4160k8674K5573M5888J4000j6589j3753p284k4357m5590
32501C9048m4524k2889Q170L9561M8855J8232k4351k7762J0023L8066K8774Q898
32489A20101K979k042j5649j5581J1490L9043L8102J6917J275l35M681O881l350
32476B04512k5212l5204j3392J7351J3974k1524m0260j9173P176M707j0348m697
32464G7910J9939L4980K5174o36k4743l2459k0836l369M031R76m973j3292j9445
32451D3257n865K7272M1004O865l8413l5421J0779M0308L1413K3207L8081M3495
32439B25982J2896k7957m3200l4103j9869p519j470q958j8780q244J6165K2014
$$ plain form
32427 106957 111663 106843 109320 107271 81935 52176 55406 90849 121575 129333 128549 127716 117793 104038
32413 104038 111470 146958 184526 198566 189379 171049 156423 157215 176513 197554 198663 179051
32401 179051 152596 123280 89284 62118 52731 45093 15724 -23421 -34917 -9284 24252 43041
32389 43041 54548 69847 85936 102471 125800 146587 141980 111518 84952 82536 91672 94576
32377 94576 94659 100001 101179 83651 50165 17827 1193 4533 20656 33189 30793 21646 23454
32364 23454 39754 58300 70523 78195 83257 86471 93955 110169 127793 138756 148452 162699 170428
32351 170428 160328 145179 144775 152399 145865 126658 118399 127453 133866 123817 106223 95612 100731
32338 100731 128026 172669 209116 214596 197326 178344 157358 127510 109340 127024 158364 157303
$$ packed form
32427A06957M706m820K477k049k5336k9759L230L5443L0726P758p84q33r923j3755
32413A04038P432L5488L7568J4040r187j8330j4626P92J9298K1041J109j9612
32401A79051k6455k9316l3996k7166r387p638k9369l9145j1496K5633L3536J8789
32389D3041J1507J5299J6089J6535K3329K0787m607l0462k6566k416R136K904
32377I4576Q3N342J178j7528l3486l2338j6634L340J6123J2533k396r147J808
32364B3454J6300J8546J2223P672N062L214P484J6214J7624J0963R696J4247P729
32351A70428j0100j5149m04P624o534j9207q259R054O413j0049j7594j0611N119
32338A00731K7295M4643L6447N480j7270j8982k0986k9848j8170J7684L1340j061
$$ plain form
32326 157303 127167 120748 158974 200339 207130 192531 179075 158123 123423 105248 131627 180993
32314 180993 207509 194154 153746 100358 50754 34588 67970 125360 165573 179625 190436
32303 190436 213153 239533 258048 268405 275179 281097 286313 284310 261844 214408 161538 136944
32291 136944 157823 204439 233903 219986 178891 147295 137500 133325 131630 154412 200478 219927
32279 219927 173972 96545 54032 60781 79518 90450 106422 125895 128232 119617 129053 151032
32267 151032 147074 115958 105501 135916 167566 169280 163356 171633 171090 143545 121843 138541 165052
32254 165052 150817 96989 46696 23521 21354 36936 70242 102210 107956 89309 71602 74888
32242 74888 102380 142719 171902 173395 166008 184080 220739 229161 196130 169054 183106 207541
$$ packed form
32326A57303l0136o419L8226M1365O791j4599j3456k0952l4700j8175K6379M9366
32314A80993K6516j3355m0408n3388m9604j6166L3382N7390M0213J4052J0811
32303A90436K2717K6380J8515J0357O774N918N216k003k2466m7436n2870k4594
32291A36944K0879M6616K9464j3917m1095l1596r795m175j695K2782M6066J9449
32279B19927m5955p7427m2513O749J8737J0932J5972J9473K337q615R436K1979
32267A51032l958l1116j0457L0415L1650J714n924Q277n43k7545k1702J6698K6511
32254A65052j4235n3828n0293k3175k167J5582L3306L1968N746j8647j7707L286
32242G4888K7492M0339K9183J493p387J8072L6659Q422l3031k7076J4052K4435
$$ plain form
32230 207541 200753 175250 163505 158187 138238 123741 149255 202915 244256 266864 293516 322947
32218 322947 332556 326951 336309 368672 403851 430921 455841 479317 502651 544688 614242 676355
32206 676355 687252 653863 616645 583377 528760 456128 407126 401451 411763 410921 405650 409618
32194 409618 417295 421221 429345 449725 474552 486537 468592 412182 336118 288692 302862 353066
32182 353066 384878 383014 377295 383905 381261 354333 326116 323948 339067 342626 328613 320167 335892
32169 335892 363814 374182 354905 326343 314246 315738 308245 287161 269928 262049 249591 232206
32157 232206 229055 239620 237554 223002 238170 300635 363372 381376 379250 402659 435332 424395
32145 424395 369132 322314 308512 298369 268513 237295 229625 244805 271337 305850 349788 407218
$$ packed form
32230B07541o788k5503j1745n318j9949j4497K5514N3660M1341K2608K6652K9431
32218C22947R609n605R358L2363L5179K7070K4920K3476K3334M2037O9554O2113
32206F76355J0897l3389l7218l3268n4617p2632m9002n675J0312q42n271L968
32194D09618P677L926Q124K0380K4827J1985j7945n6410p6064m7426J4170N0204
32182C53066L1812j864n719O610k644k6928k8217k168J5119L559j4013q446J5725
32169C35892K7922J0368j9277k8562j2097J492p493k1084j7233p879j2458j7385
32157B32206l151J0565k066j4552J5168O2465O2737J8004k126K3409L2673j0937
32145D24395n5263m6818j3802j0143k9856l1218p670J5180K6532L4513M3938N7430
$$ plain form
32133 407218 484301 572370 641881 677171 705673 765635 854435 933990 977154 986795 983027 992259
32121 992259 1030715 1079877 1102951 1103604 1131949 1206963 1277328 1296186 1288997 1301188 1324780 1332768
32109 1332768 1341889 1375908 1406071 1400126 1395721 1446274 1522346 1551455 1536010 1543869 1591903 1625826
32097 1625826 1613607 1576523 1526516 1453025 1375580 1331270 1304891 1247163 1164952 1114359 1100326
32086 1100326 1066488 994016 926669 884782 839834 792360 787985 828964 851834 825114 793712
32075 793712 793743 795982 769689 736062 722326 721461 727337 752765 788169 800466 793671 809852 851803
32062 851803 870102 846994 827333 845774 887176 934244 985795 1015856 991879 949137 965737
32051 965737 1045196 1108246 1121448 1143363 1216300 1305729 1381944 1469810 1576426 1657174 1697308
$$ packed form
32133D07218P7083Q8069O9511L5290K8502N9962Q8800P9555M3164R641l768R232
32121I92259L8456M9162K3074O53K8345P5014P0365J8858p189J2191K3592P988
32109A332768R121L4019L0163n945m405N0553P6072K9109j5445P859M8034L3923
32097A625826j2219l7084n0007p3491p7445m4310k6379n7728q2211n0593j4033
32086A100326l3838p2472o7347m1887m4948m7474m375M0979K2870k6720l1402
32075G93712L1K239k6293l3627j3736q65N876K5428L5404J2297o795J6181M1951
32062H51803J8299k3108j9661J8441M1402M7068N1551L0061k3977m2742J6600
32051I65737P9459O3050J3202K1915P2937Q9429P6215Q7866J06616Q0748M0134
$$ plain form
32040 1697308 1744444 1818349 1870412 1872623 1863770 1868065 1853386 1811731 1796730 1840024 1912162 2000840
32028 2000840 2139570 2323679 2488071 2600946 2688552 2746493 2736266 2694946 2725773 2844507
32018 2844507 2958595 3030543 3123686 3249870 3329534 3358602 3451470 3645504 3825447 3925280
32008 3925280 4040633 4245148 4460067 4616227 4787305 5043147 5319360 5551672 5795986
31999 5795986 6099972 6401413 6667257 6985198 7408645 7864249 8310206 8813407 9378286
31990 9378286 9901894 10399244 11045786 11884763 12744572 13567885 14536646 15730558 16987383
31981 16987383 18276743 19858003 21864282 24123716 26632594 29765339 33733263 38332203
31973 38332203 43541800 49747854 56951755 64582152 72777110 82791818 94681284 105147997
$$ packed form
32040A697308M7136P3905N2063K211q853M295j4679m1655j5001M3294P2138Q8678
32028B000840J38730J84109J64392J12875Q7606N7941j0227m1320L0827J18734
32018B844507J14088P1948R3143J26184P9664K9068R2868J94034J79943R9833
32008C925280J15353K04515K14919J56160J71078K55842K76213K32312K44314
31999E795986L03986L01441K65844L17941M23447M55604M45957N03201N64879
31990I378286N23608M97350O46542Q38977Q59809Q23313R68761J193912J256825
31981A6987383J289360J581260K006279K259434K508878L132745L967924M598940
31973C8332203N209597O206054P203901P630397Q194958J0014708J1889466J0466713
$$ plain form
31965 105147997 109562470 106495122 99009620 91252288 85109049 80551694 77532292 76210110
31957 76210110 76194612 76876953 78303125 81050771 85583317 92047766 99816268 106518952
31949 106518952 108567374 104020992 94654331 84206446 74945796 66874384 59612756 53391992
31941 53391992 48123332 43044581 37898809 33453728 30302141 27964011 25695538 23465836
31933 23465836 21582160 19956774 18334902 16812145 15595669 14573486 13550281 12618684
31925 12618684 11922738 11327705 10662467 10031085 9579854 9210675 8808432 8493354 8365864
31916 8365864 8248904 7960404 7609019 7357753 7126917 6794712 6469025 6294033 6187773
31907 6187773 6020591 5860117 5805169 5773362 5682466 5644773 5754143 5875722 5870893 5836395 5901082
$$ packed form
31965A05147997M414473l067348p485502p757332o143239m557355l019402j322182
31957G6210110j5498O82341J426172K747646M532546O464449P768502O702684
31949A06518952K048422m546382r366661j0447885r260650q071412p261628o220764
31941E3391992n268660n078751n145772m445081l151587k338130k268473k229702
31933B3465836j883676j625386j621872j522757j216476j022183j023205r31597
31925A2618684o95946n95033o65238o31382m51231l69179m02243l15078j27490
31916H365864j16960k88500l51385k51266k30836l32205l25687j74992j06260
31907F187773j67182j60474n4948l1807r0896l7693J09370J21579m829l4498O4687
$$ plain form
31896 5901082 5984734 5980802 5980610 6093629 6239676 6333863 6474578 6734223 6976811 7101487 7245943
31885 7245943 7528414 7825714 8038795 8323531 8802569 9308314 9689063 10110334 10759811
31876 10759811 11517513 12227801 13024524 14050991 15135776 16112175 17190705 18641212 20390456
31867 20390456 22328958 24703303 27767598 31379296 35408218 40145263 45753095 51813025
31859 51813025 58171803 65643715 74605831 83052017 87482524 86228762 81011664 74904701
31851 74904701 69724331 65806506 63160179 61804818 61485378 61908850 63112980 65272593
31843 65272593 68574150 73459586 80046633 86635520 89752517 86947714 79297581 70220531
31835 70220531 62138206 55248001 49100022 43806354 39380072 35193340 30863198 26940664
$$ packed form
31896E901082Q3652l932j92J13019J46047R4187J40715K59645K42588J24676J44456
31885G245943K82471K97300K13081K84736M79038N05745L80749M21271O49477
31876A0759811P57702P10288P96723J026467J084785R76399J078530J450507J749244
31867B0390456J938502K374345L064295L611698M028922M737045N607832O059930
31859E1813025O358778P471912Q962116Q446186M430507j253762n217098o106963
31851G4904701n180370l917825k646327j355361l19440M23472J204130K159613
31843F5272593L301557M885436O587047O588887L116997k804803p650133r077050
31835G0220531q082325o890205o147979n293668m426282m186732m330142l922534
$$ plain form
31827 26940664 24074534 22031799 20123818 18161811 16417625 14965051 13627933 12400234
31819 12400234 11426812 10653461 9881952 9107777 8482178 7999251 7508090 6988644 6557309
31810 6557309 6230815 5913389 5595418 5359807 5203039 5027491 4803021 4584380 4383502
31801 4383502 4164713 3950855 3803008 3705762 3587801 3442380 3322436 3234906 3141338 3045459
31791 3045459 2983137 2941077 2876463 2802883 2770583 2773119 2753605 2694721 2631697 2586573 2553125
31780 2553125 2531595 2516740 2468977 2359008 2225951 2134297 2089162 2046923 1990076 1937393 1897659
31769 1897659 1865656 1849459 1856660 1870362 1876052 1885072 1893930 1858975 1760209 1651293 1589306 1551081
31757 1551081 1481879 1392747 1337041 1314681 1277070 1215853 1171526 1154067 1125099 1068556 1018320
$$ packed form
31827B6940664k866130k042735j907981j962007j744186j452574j337118j227699
31819A2400234r73422p73351p71509p74175o25599m82927m91161n19446m31335
31810F557309l26494l17426l17971k35611j56768j75548k24470k18641k00878
31801D383502k18789k13858j47847r7246j17961j45421j19944q7530r3568r5879
31791C045459o2322m2060o4614p3580l2300K536j9514n8884o3024m5124l3448
31780B553125k1530j4855m7763j09969j33057r1654m5135m2239n6847n2683l9734
31769A897659l2003j6197P201J3702N690R020Q858l4955r8766j08916o1987l8225
31757A551081o9202q9132n5706k2360l7611o1217m4327j7459k8968n6543n0236
$$ plain form
31746 1018320 999504 990224 957858 897832 827936 774268 762932 794364 829131 829916 809088 801345
31734 801345 803692 786206 751786 733967 735628 720580 674886 631448 619912 629732 636043 628106
31722 628106 600180 549221 498399 491134 538804 595326 604235 557968 496730 461296 459698 471036
31710 471036 470199 451297 430969 428022 444459 471291 503562 538980 571518 601238 642248 703744
31698 703744 769216 812777 832916 852776 888541 933431 972780 1001083 1023020 1046759 1074479
31687 1074479 1092903 1080265 1032511 976266 946348 956025 994478 1040983 1072337 1070421 1036549 989409
31675 989409 939833 880671 810849 751619 723692 722293 728635 731718 727061 712591 700274 711377
31663 711377 742973 760057 739929 702464 675752 656636 631341 609650 604924 600175 570457 525358
$$ packed form
31746A018320j8816r280l2366o0026o9896n3668j1336L1432L4767P85k0828p743
31734H01345K347j7486l4420j7819J661j5048m5694m3438j1536R820O311p937
31722F28106k7926n0959n0822p265M7670N6522Q909m6267o1238l5434j598J1338
31710D71036q37j8902k0328k947J6437K6832L2271L5418L2538K9720M1010O1496
31698G03744O5472M3561K0139J9860L5765M4890L9349K8303K1937K3739K7720
31687A074479J8424j2638m7754n6245k9918R677L8453M6505L1354j916l3872m7140
31675I89409m9576n9162o9822n9230k7927j399O342L083m657j4470j2317J1103
31663G11377L1596J7084k0128l7465k6712j9116k5295k1691m726m749k9718m5099
$$ plain form
31651 525358 495402 488448 490872 496328 498362 471551 402710 330408 308855 336844 365115 370859
31639 370859 378747 404807 426161 419667 392483 359554 322757 286318 265201 264659 272576 278836 281947
31626 281947 276274 257296 237591 230074 220370 189465 158154 166297 207179 229478 212466 190953
31614 190953 191293 192676 175501 160401 166119 169081 143645 111150 108817 133341 154490 167141 190975
31601 190975 228087 255115 253908 224809 175633 120467 82672 76626 90357 102814 110319 119586
31589 119586 126142 121075 111881 115436 133533 152701 165498 176504 188511 195434 190026 173401 158936
31576 158936 165388 195278 221206 212295 178322 166236 203957 268228 317861 335929 326793 297884
31564 297884 264994 253715 271904 296037 304091 304982 316254 331637 333009 317250 289204 246595
$$ packed form
31651E25358k9956o954K424N456K034k6811o8841p2302k1553K7989K8271N744
31639C70859P888K6060K1354o494k7184l2929l6797l6439k1117n42P917O260L111
31626B81947n673j8978j9705p517r704l0905l1311Q143M0882K2299j7012k1513
31614A90953L40J383j7175j5100N718K962k5436l2495k333K4524K1149J2651K3834
31601A90975L7112K7028j207k9099m9176n5166l7795o046J3731J2457P505R267
31589A19586O556n067r194L555J8097J9168J2797J1006J2007O923n408j6625j4465
31576A58936O452K9890K5928q911l3973j2086L7721O4271M9633J8068r136k8909
31564B97884l2890j1279J8189K4133Q054Q91J1272J5383J372j5759k8046m2609
$$ plain form
31552 246595 196116 165132 168954 182699 174503 150618 136493 129490 107949 77380 68498 91165
31540 91165 123865 147378 157531 148075 115998 84644 86522 117714 140555 137365 131428 147725
31528 147725 181771 215775 238653 241278 217681 180821 154712 143840 132707 119324 121568 143118
31516 143118 161329 159173 142623 116381 71193 9685 -41490 -60901 -50674 -14414 53432 138775
$$ packed form
31552B46595n0479l0984L822J3745q196k3885j4125p003k1541l0569q882K2667
31540I1165L2700K3513J0153r456l2077l1354J878L1192K2841l190n937J6297
31528A47725L4046L4004K2878K625k3597l6860k6109j0872j1133j3383K244K1550
31516A43118J8211k156j6550k6242m5188o1508n1175j9411J0227L6260O7846Q5343
$$ [...]
##END NTUPLES=NMR SPECTRUM
##END=
