##TITLE=Analysis number 312078
Compound Code cc 13106
Book Reference 441/111
Project Code adrs
Chemist Name colinb
##JCAMPDX= 6.0         $$ Bruker NMR JCAMP-DX V2.0
##DATA TYPE= NMR SPECTRUM
##DATA CLASS= NTUPLES
##ORIGIN= Bruker BioSpin GmbH
##OWNER= NMR
$$ XWIN-NMR		Version 3.5
$$ Mon Jul 25 11:39:23 2005 GMT Daylight Time (UT+1h)  MAYBRIDGE\NMR@NMR_250MHZ
##.OBSERVE FREQUENCY= 250.131544655141
##.OBSERVE NUCLEUS= ^1H
##.ACQUISITION MODE= SIMULTANEOUS (DQD)
##.ACQUISITION SCHEME= undefined
##.AVERAGES= 16
##.DIGITISER RES= 18
##SPECTROMETER/DATA SYSTEM= dpx250
##.PULSE SEQUENCE= zg30
##.SOLVENT NAME= CDCl3
##.SHIFT REFERENCE= (INTERNAL, CDCl3, 0, 16.522)
##AUDIT TRAIL= $$ (NUMBER, WHEN, WHO, WHERE, WHAT)
$$ ##TITLE= Audit trail, XWIN-NMR		Version 3.5
$$ ##JCAMPDX= 5.01
$$ ##ORIGIN= Bruker BioSpin GmbH
$$ ##OWNER= NMR
$$ C:\u/data/dgb/nmr/ADRS/6510/pdata/1/auditp.txt
$$ ##AUDIT TRAIL=  $$ (NUMBER, WHEN, WHO, WHERE, WHAT)
(   1,<2005-07-25 11:38:34.58 +100>,<MAYBRIDGE\NMR>,<NMR_250MHZ>,
      <created by zg, POWCHK disabled, PULCHK disabled
       configuration hash MD5:
       62 19 C7 07 E1 42 D1 B7 37 6C 3D D0 77 39 F9 E6
       data hash MD5: 64K
       68 B4 DB 01 DE 05 7D 75 F3 F9 D3 8D B0 60 1F 54>)
(   2,<2005-07-25 11:38:55.52 +100>,<MAYBRIDGE\NMR>,<NMR_250MHZ>,
      <Start of raw data processing
       ef LB = 0.3 FT_mod = 6 PKNL = 1 SI = 32K 
       data hash MD5: 32K
       8D AA 45 A8 C1 49 EC 91 D0 B5 C0 E2 6B 14 DC F9>)
(   3,<2005-07-25 11:38:59.54 +100>,<MAYBRIDGE\NMR>,<NMR_250MHZ>,
      <apk 
       data hash MD5: 32K
       D6 DB FD D5 24 0B B2 E8 A7 A5 48 12 75 7C CB 21>)
(   4,<2005-07-25 11:39:01.25 +100>,<MAYBRIDGE\NMR>,<NMR_250MHZ>,
      <abs ABSG = 5 
       data hash MD5: 32K
       02 FB 70 CC 35 E0 A4 AB 8E 9C 2A D5 97 E4 50 C7>)
$$ ##END=
$$ 
$$ hash MD5
$$ EF 70 3E 05 5C 29 B3 0A 4C 3E B8 A5 FD AC 8E DE
##$RELAX= 
##$RELAX= 
##$RELAX= 
##$RELAX= 
##$RELAX= 
##$RELAX= 
##$RELAX= 
$$ Bruker specific parameters
$$ --------------------------
##$DU= <C:\u>
##$EXPNO= 6510
##$NAME= <ADRS>
##$PROCNO= 1
##$TYPE= <nmr>
##$USER= <dgb>
##$AMP= (0..31)
100 100 100 100 100 100 100 100 100 100 100 100 100 100 100 100 100 100 
100 100 100 100 100 100 100 100 100 100 100 100 100 100 
##$AQSEQ= 0
##$AQ_mod= 3
##$AUNM= <au_zg>
##$AUTOPOS= <10 >
##$BF1= 250.13
##$BF2= 250.13
##$BF3= 250.13
##$BF4= 250.13
##$BF5= 500.13
##$BF6= 500.13
##$BF7= 500.13
##$BF8= 500.13
##$BYTORDA= 1
##$CFDGTYP= 0
##$CFRGTYP= 5
##$CHEMSTR= <none>
##$CNST= (0..31)
1 1 145 1 1 1 1 1 1 1 1 1 1 1 1 1 1 1 1 1 1 1 1 1 1 1 1 1 1 1 1 1 
##$CPDPRG= <>
##$CPDPRG1= <>
##$CPDPRG2= <>
##$CPDPRG3= <>
##$CPDPRG4= <mlev>
##$CPDPRG5= <mlev>
##$CPDPRG6= <mlev>
##$CPDPRG7= <mlev>
##$CPDPRG8= <mlev>
##$CPDPRGB= <>
##$CPDPRGT= <>
##$D= (0..31)
0 1 0 0 0 0 0 0 0 0.06 0 0 0 0 0 0 0.0002 0 0 0 0 0 0 0 0 0 0 0 0 0 0 
0 
##$DATE= 1122287911
##$DBL= (0..7)
120 120 120 120 120 120 120 120 
##$DBP= (0..7)
150 150 150 150 150 150 150 150 
##$DBP07= 0
##$DBPNAM0= <>
##$DBPNAM1= <>
$$ [...]
##$SUBNAM7= <"">
##$SUBNAM8= <"">
##$SUBNAM9= <"">
##$SW= 20.6930455092707
##$SWIBOX= (0..15)
0 0 3 0 0 0 0 0 0 0 0 0 0 0 0 0 
##$SW_h= 5175.983436853
##$TD= 65536
##$TD0= 1
##$TE= 296.16
##$TE2= 300
##$TE3= 300
##$TEG= 300
##$TL= (0..7)
0 120 120 120 120 120 120 120 
##$TP= (0..7)
150 150 150 150 150 150 150 150 
##$TP07= 0
##$TPNAME0= <>
##$TPNAME1= <>
##$TPNAME2= <>
##$TPNAME3= <>
##$TPNAME4= <>
##$TPNAME5= <>
##$TPNAME6= <>
##$TPNAME7= <>
##$TPOAL= (0..7)
0.5 0.5 0.5 0.5 0.5 0.5 0.5 0.5 
##$TPOFFS= (0..7)
0 0 0 0 0 0 0 0 
##$TUNHIN= 0
##$TUNHOUT= 0
##$TUNXOUT= 0
##$USERA1= <user>
##$USERA2= <user>
##$USERA3= <user>
##$USERA4= <user>
##$USERA5= <user>
##$V9= 5
##$VALIST= <valist>
##$VCLIST= <CCCCCCCCCCCCCCC>
##$VD= 0
##$VDLIST= <DDDDDDDDDDDDDDD>
##$VPLIST= <PPPPPPPPPPPPPPP>
##$VTLIST= <TTTTTTTTTTTTTTT>
##$WBST= 1024
##$WBSW= 4
##$XGAIN= (0..3)
0 0 0 0 
##$XL= 0
##$YL= 0
##$YMAX_a= 546178
##$YMIN_a= -514138
##$ZGOPTNS= <>
##$ZL1= 120
##$ZL2= 120
##$ZL3= 120
##$ZL4= 120
##$ABSF1= 16.522
##$ABSF2= -4.171173
##$ABSG= 5
##$ABSL= 3
##$ALPHA= 0
##$AQORDER= 0
##$ASSFAC= 0
##$ASSFACI= 0
##$ASSFACX= 0
##$ASSWID= 0
##$AUNMP= <proc_1d>
##$AZFE= 0.1
##$AZFW= 0.1
##$BCFW= 0
##$BC_mod= 0
##$BYTORDP= 0
##$COROFFS= 0
##$CY= 12.5
##$DATMOD= 1
##$DC= 0
##$DFILT= <>
##$DTYPP= 0
##$F1P= 14.0000005364418
##$F2P= -0.99999901652339
##$FCOR= 0.5
##$FTSIZE= 32768
##$FT_mod= 6
##$GAMMA= 0
##$GB= 0
##$INTBC= 1
##$INTSCL= 1
##$ISEN= 128
##$LB= 0.3
##$LEV0= 0
##$LPBIN= 0
##$MAXI= 10000
##$MC2= 0
##$MEAN= 0
##$ME_mod= 0
##$MI= 0
##$NCOEF= 0
##$NC_proc= -4
##$NLEV= 6
##$NOISF1= 0
##$NOISF2= 0
##$NSP= 0
##$NTH_PI= 0
##$NZP= 0
##$OFFSET= 16.522
##$PC= 1
##$PHC0= -79.65836
##$PHC1= 1.571451
##$PH_mod= 1
##$PKNL= yes
##$PPARMOD= 0
##$PSCAL= 4
##$PSIGN= 0
##$REVERSE= no
##$SF= 250.13
##$SI= 32768
##$SIGF1= 0
##$SIGF2= 0
##$SINO= 400
##$SIOLD= 32768
##$SREGLST= <1H.CDCl3>
##$SSB= 0
##$STSI= 32768
##$STSR= 0
##$SW_p= 5175.98343685301
##$SYMM= 0
##$S_DEV= 0
##$TDeff= 65536
##$TDoff= 0
##$TI= <Analysis number 999999
Compound Code 99
Book Reference 9
Project Code 9>
##$TILT= no
##$TM1= 0
##$TM2= 0
##$TOPLEV= 0
##$USERP1= <user>
##$USERP2= <user>
##$USERP3= <user>
##$USERP4= <user>
##$USERP5= <user>
##$WDW= 1
##$XDIM= 32768
##$YMAX_p= 434435687
##$YMIN_p= -195362
$$ End of Bruker specific parameters
$$ ---------------------------------
##NTUPLES= NMR SPECTRUM
##VAR_NAME=  FREQUENCY,     SPECTRUM/REAL,   SPECTRUM/IMAG
##SYMBOL=    X,             R,               I
##VAR_TYPE=  INDEPENDENT,   DEPENDENT,       DEPENDENT
##VAR_FORM=  AFFN,          ASDF,            ASDF
##VAR_DIM=   32768,         32768,           32768
##UNITS=     HZ,            ARBITRARY UNITS, ARBITRARY UNITS
##FACTOR=    0.157963299565203, 1,           1
##FIRST=     4132.6476996994, 0,             0
##LAST=      -1043.33573715361, 0,           0
##MIN=       -1043.33573715361, -195362,     0
##MAX=       4132.6476996994, 434435687,     0
$$ Real data points
##PAGE= N=1
##DATA TABLE= (X++(R..R)), XYDATA
$$ [...]
23910E1251J0059p899m4563k6325j3414J1199N533n3698k7557O5470N7163L1249
23898E8468l8732J7890K3766J4504o296l1308r3342n2438K1082K9901K8794M1355
23886A3644L0514P448n901k6664K5197L3665j3256n0514k7907K5543o579K483
23874G673K0074j5434k5154k3143o945j8003M3176O979P363m553M727J2011j93
23861H578M3707L7317q545j0776J4358j9475n490j2607J0847k6216M5824p703
23849F9819r095k3609r387k5533L1821P418m2039k7344k3057k1263L1925Q504
23837c1840p897j3870j0415N6759N895K0273o27l0280K9655L863K0426k6988j4113
23824H41M4669J4021k6298J9224n934n2611l1835l664L4402O7154P137j7770n9476
$$ plain form
23910 51251 61310 53411 8848 -17477 -30891 -19692 -14159 -67857 -95414 -29944 27219 58468
23898 58468 19736 37626 61392 75896 69600 38292 -55050 -107488 -86406 -56505 -27711 13644
23886 13644 44158 51606 45705 19041 44238 77903 64647 14133 -13774 11769 5190 7673
23874 7673 27747 12313 -12841 -35984 -42929 -60932 -17756 -10777 -3414 -7967 -3240 8771 8578
23861 8578 52285 89602 81057 70281 84639 65164 59674 47067 57914 31698 77522 69819
23849 69819 60724 37115 27728 2195 34016 41434 -605 -27949 -51006 -72269 -40344 -31840
23837 -31840 -39737 -53607 -64022 -7263 -1368 18905 18278 -12002 17653 21516 41942 14954 841
23824 841 45510 59531 33233 52457 46523 -6088 -37923 -41587 -7185 59969 67106 49336 -10140
23811a0140m5812L5860j8275k3298j6915L1555k445n351Q580k5823N7119M0844
23799B5899K4319j761l1092j6053j7339L009K0377M0342j5557k1568j5248j5827
23787b0499j3663k9305K4733K5676K5405j2959j339l372j9171j0922k7953K3640
23775c9729N2341k9496o789o2376J1525M5105R0001k1729j7589M600K9218J0581
23763F5663l4372L0481n5764k0575L8276K0100j2000p6951j1354J1026p216L1353
23751b1333J5208j3403n987J2036L7938k017k4949L89K1145J8083J5737P862o8370
23738g661l4527J9138L4233p498L4828j6841n1779l3153k0673k5570K5080O0528
23726b3895L1704j2897k2290K1782n888N818O220N1449o5647k2097M217k710N7667
$$ plain form
23811 -10140 -55952 -20092 -38367 -61665 -78580 -47025 -49470 -54821 -46241 -72064 -14945 25899
23799 25899 50218 48457 17365 1312 -16027 -13018 7359 47701 32144 10576 -4672 -20499
23787 -20499 -34162 -63467 -38734 -13058 12347 -612 -1951 -5323 -24494 -35416 -63369 -39729
23775 -39729 12612 -16884 -23673 -86049 -74524 -29419 60582 38853 21264 25864 55082 65663
23763 65663 31291 61772 6008 -14567 23709 43809 31809 -45142 -56496 -45470 -52686 -21333
23751 -21333 -6125 -19528 -25515 -13479 24459 22442 -2507 -2118 19027 37110 52847 60709 -7661
23738 -7661 -42188 -23050 11183 3685 38513 21672 -30107 -63260 -83933 -109503 -84423 -23895
23726 -23895 7809 -5088 -27378 -5596 -11484 -5666 554 52003 -13644 -35741 -31524 -34234 23433
23713B3433L272o1361n295j4419j9430l0540J3315L350K4369M1966J589K740O3774
23700D6763Q081m71l1832n5546K3097L7216J178P66j6727J1164L695N69L0970
23687E8923o344L0909j6016j173O2555n313o6803q3067K2439Q259k2111k5155
23675d2897p899N5491M3222k122k8309j9878l4595K1456K044P472J8844K4722
23663C7551K0508k102o177l4021j3260m869n510j4680L3581k9095k3682N4208
23651A2452L3712J3640K1089j1073k8039r5319k7692J9005K176P0169N7446N42
23639F8108l2289l6042o995j0012K6994J0184L6594n401q491m380l172k8650o8625
23626f2177j9001N0936M9514K0433n232m4680R300M2664L1321p928l2514n662
$$ plain form
23713 23433 26705 -34656 -39951 -54370 -73800 -104340 -91025 -87675 -63306 -21340 -19751 -17011 46763
23700 46763 54844 54373 22541 -33005 -9908 27308 28486 29252 12525 23689 27384 27953 58923
23687 58923 52579 83488 67472 66299 128854 123541 56738 -26329 -3890 4369 -17742 -42897
23675 -42897 -50796 4695 47917 45795 17486 -2392 -36987 -15531 -13487 -6015 12829 37551
23663 37551 58059 55957 49780 15759 2499 -2370 -7880 -22560 11021 -18074 -41756 12452
23651 12452 46164 59804 80893 69820 41781 -53538 -81230 -62225 -60049 10120 67566 68108
23639 68108 35819 -223 -7218 -17230 9764 19948 56542 51141 42650 38270 35098 6448 -62177
23626 -62177 -81178 -30242 19272 39705 34473 -10207 -907 41757 73078 65150 32636 26974
23614B6974o024l1445m5573L6882L2047K0009k4211m1020N538J7783L6412J2202
23602C9574J4102L2695M8040J059o9786m6814O136l2134j2565j4999j4654O6662
23590A7316J5354m2816l4295j3506J3334N0658m412k7371K2055o423M0804P471
23578C8169k9184O00m1558M5674k029p199j3265J2025j6992j9039M5605K0865
23566C3672l4622j0920K2315K5870R707k214l4310K273m2235J0956N0471J305
23554C2268o8276L4055J81p540L0293R641l1557n2223m515L4909K69P654J7699
23541B858j3800k3226n8477j1037L1687J9729L9117K7583J3217M9322K5512o1808
23529D0677j4968q353J422l3878l356k3185k0903L6803P737J6384j450k614j5591
$$ plain form
23614 26974 20950 -10495 -56068 -19186 12861 32870 8659 -32361 -26823 -9040 27372 39574
23602 39574 53676 86371 134411 135470 65684 18870 25006 -7128 -19693 -34692 -49346 17316
23590 17316 32670 -10146 -44441 -57947 -44613 6045 1633 -25738 -3683 -10106 30698 38169
23578 38169 8985 9585 -31973 13701 11672 4473 -8792 3233 -13759 -32798 12807 33672
23566 33672 -950 -11870 10445 36315 46022 43808 9498 11771 -30464 -19508 30963 32268
23554 32268 -36008 -1953 -1772 -9312 20981 30622 -935 -53158 -57673 -22764 -22495 -14841 2858
23541 2858 -10942 -34168 -92645 -103682 -71995 -52266 -13149 14434 27651 76973 102485 40677
23529 40677 25709 17356 18778 -15100 -18456 -41641 -62544 -25741 -18004 -1620 -3070 -5684 -21275
23516b1275P547K8192k8012J1836p440L015l14P529L9656J6776K9928m2117K947
23503D8268J8197n0013l8675N281J9080J7820m3196k6093j4629K9528p659k7651
23491f9742J4651j0060k2943M5983q960m00q918j643O185n131M6452j9912k2497
23478e6935L8687j4459L0079O1832K1023j6265l0811J6878k8574J7543n2834j0675
23466b4511o697K8176j561l4126l555j8704l0207K1778p270j0973M4411L4701
23454h538O6763K6660l4255K845l2767p6193j7580n319L8082J0864K8575J8556
23442A7693o709K4009J0160o9756k7577L7276q736l902l504M1636M8261J2948
23430G1799j5460K655L2898k4066l0307J1437Q008K4024m1043L55m5811o5677
$$ plain form
23516 -21275 -13728 14464 -13548 -1712 -9152 -6137 -6451 1078 40734 57510 87438 45321 48268
23503 48268 66465 16452 -22223 -16942 2138 19958 -23238 -49331 -63960 -34432 -42091 -69742
23491 -69742 -55091 -65151 -88094 -42111 -51071 -51471 -60389 -62032 -55847 -60978 -14526 -34438 -56935
23478 -56935 -18248 -32707 -2628 59204 80227 63962 33151 50029 21455 38998 -13836 -24511
23466 -24511 -31208 -3032 -4593 -38719 -42274 -60978 -91185 -69407 -76677 -87650 -43239 -8538
23454 -8538 58225 84885 50630 53475 20708 -55485 -73065 -78384 -40302 -29438 -863 17693
23442 17693 10984 34993 45153 -24603 -52180 -14904 -23640 -27542 -31046 10590 58851 71799
23430 71799 56339 58994 91892 67826 37519 48956 56964 80988 39945 40300 -5511 -71188
23418g1188q035j956k072n734j0645O8015J6374J1736J6454l4779m4296K8705
23406c7421L1283K9438m0534k3289j9492P806P182j9837J8700N7586j5887l4277
23394c8742k6535l6898J589l530O668K0985J3408O8819j8208L3126J4057L105
23382C7844K6490R422n7007R38j9909k9476m1137j35L753Q4247M145m4474P3339
23369D8040N4292R368j2113n7829l3409L7919p732k1906j8393M0631N3506J3319
23357A05693l8916o9400l0372J7964r921j1844j2910n318K5493J435l573p2137
23345a03806J8732K3260K0826n6845n0285K4184N6748N7215J9383j6405K3058
23334A6065l1457l336K7342o770m4474k5446J4898K2142K4950q197Q036n945L085
$$ plain form
23418 -71188 -79223 -81179 -83251 -88985 -99630 -31615 -15241 -3505 12949 -21830 -66126 -37421
23406 -37421 -6138 23300 -17234 -40523 -60015 -52209 -45027 -64864 -46164 11422 -4465 -38742
23394 -38742 -65277 -102175 -100586 -104116 -97448 -76463 -63055 5764 -12444 20682 34739 37844
23382 37844 64334 73756 16749 17687 -2222 -31698 -72835 -72970 -69217 15030 19175 -25299 48040
23369 48040 102332 111700 99587 41758 8349 46268 38536 16630 -1763 38868 92374 105693
23357 105693 66777 -2623 -32995 -15031 -24952 -36796 -49706 -55024 -29531 -28096 -31669 -103806
23345 -103806 -85074 -61814 -40988 -97833 -148118 -123934 -67186 -9971 9412 -6993 16065
23334 16065 -15392 -18728 8614 1844 -42630 -68076 -53178 -31036 -6086 -14283 -6247 -12192 -9107
23321i107j9094j1362k5366L7739K3258J0271j0367m173J3674J6098Q070J8302
23309D7943K19N3532j0770n6823j0024j1513n574R577q114k069K8519M892m7437
23296g642O254M4801j1051o2345l2273M0267O7894J954o5647K8681O644j1146
23284F391J0223K6656J5472k308J5986k1082J1431k2647l4125m7130n1887k1887
23272a14907P983K942l3091k876J4959J8569L3667O1113K3345j3093j0253j6185
23260b7827k8716M494K2653K4163J0895l0584J578R310l0471k8805J3736L8416
23248b1158r002l4497m7765K7622J4142N1605L9571m7929j900P1344P050q8715
23236c9632k5729K4910K8437K7117K8317M7534r075j9265p314L6409k076l0792
$$ plain form
23321 -9107 -28201 -39563 -64929 -27190 -3932 6339 -4028 -8201 5473 21571 29641 47943
23309 47943 48162 101694 90924 34101 24077 12564 6990 16567 8453 6384 34903 39795 -7642
23296 -7642 -1388 43413 32362 -29983 -62256 -21989 45905 47859 -17788 10893 17537 6391
23284 6391 16614 43270 58742 56434 72420 51338 62769 40122 5997 -41133 -93020 -114907
23272 -114907 -106924 -103982 -137073 -139949 -124990 -106421 -72754 -11641 11704 -1389 -11642 -27827
23260 -27827 -56543 -52049 -29396 -5233 5662 -24922 -23344 -14034 -44505 -73310 -59574 -21158
23248 -21158 -30160 -64657 -112422 -84800 -70658 -19053 20518 -27411 -29311 42033 49083 -39632
23236 -39632 -65361 -40451 -12014 15103 43420 90954 81879 62614 55300 91709 89633 58841
23224E8841o2848l4849m045j1934J3580j2673J7818N2303K1724p4449m3425M6863
23212c3094N0186k0822r26l1872m0290J3863J577J6580M1448N605j2431Q18k1315
23199c0673k3754J8044J9163k5133L1553L7949J8934O769q2777l9748M6668R3335
23187G0330J8722k0828J2107J4978j2301m3245o331l3447k9095P386J9284j3572
23175a6012k6198j457N6464J9121m022k8673O988K1995p087j18K8598k547l2786
23162A4266q1399l4731M2918J7444j6613M8193L1845l8700p2808k992K6778K4639
23150d1160n394K648K7652J3819L8818L3629k9792l9013l0237j5474k2624q975
23138g6103L2960M40m525P686O1060L2460l4147j4406O7802k622j7355j2335n3104
$$ plain form
23224 58841 -4007 -38856 -42901 -54835 -41255 -53928 -36110 16193 37917 -36532 -79957 -33094
23212 -33094 17092 -3730 -4656 -36528 -76818 -62955 -61378 -44798 -3350 2255 -10176 -9358 -30673
23199 -30673 -54427 -36383 -17220 -42353 -10800 27149 46083 52852 -29925 -69673 -23005 70330
23187 70330 89052 68224 80331 95309 83008 39763 33432 -15 -29110 -21724 -2440 -16012
23175 -16012 -42210 -43667 12797 31918 27896 -777 6211 28206 21119 21001 49599 47052 14266
23162 14266 -67133 -101864 -58946 -41502 -58115 -9922 21923 -16777 -89585 -92577 -65799 -41160
23150 -41160 -46554 -43906 -16254 -2435 36383 70012 40220 1207 -29030 -44504 -67128 -76103
23138 -76103 -43143 -42703 -47228 -39542 21518 53978 19831 5425 73227 70605 53250 40915 -12189
23125a2189n3738n4775J6869Q0190Q075r434J6184M9017N032l4203p941J637k79
23112D445K407J3009k7013k5008p0813R96L0301N6642J8418j622j5390j6989j579
23099c2196L9244J6695k1448k1314K1041N375j0781P254m790q139M1120K517k4769
23086I809k2064J5894k312j6740m804L8745K2707K4401K9374j5730j9661j7561
23074D2058j6169N818K5665k7819l8908j3861P206j9985j6288k8756k0113n011
23062a06163J2260L9792L9579k0499K6125k8424l1232M971J0486J087L7304m823
23050a9537J6818J5577M375n612Q097j009j1899m597K0114K4196k0344L4452o352
23037E4279k2688K6325L1100J3048l3061m316l6344m2739J0289K4915o217n5869
$$ plain form
23125 -12189 -65927 -120702 -103833 -23643 -15568 -25002 -8818 40199 45231 11028 3087 4724 4445
23112 4445 6852 19861 -7152 -32160 -102973 -101977 -71676 -15034 3384 1762 -13628 -30617 -32196
23099 -32196 7048 23743 2295 -19019 2022 7397 -3384 3870 -920 -9059 32061 34578 9809
23086 9809 -12255 3639 1327 -15413 -20217 18528 41235 65636 95010 79280 59619 42058
23074 42058 25889 31707 57372 29553 -9355 -23216 -16010 -35995 -52283 -81039 -101152 -106163
23062 -106163 -93903 -54111 -14532 -35031 -8906 -37330 -68562 -63591 -53105 -52018 -14714 -19537
23050 -19537 -2719 12858 17233 11621 19718 18709 6810 2213 22327 46523 26179 60631 54279
23037 54279 31591 57916 89016 102064 69003 64687 28343 -14396 -4107 20808 14591 -41278
23025d1278m0348N3929O3057o568m6251p057K8641M3855l662K782k6089k0381
23013F30P03L1213J5552m1039j8208k0145m533j7065L4169L8581l1019j2074O328
23000a6907L9766K6090k6452m7271j0590K600J6865L1799K9035M8236J3014q857
22988I7328l4786l1007R103L3184J3537o7221p1737k0977K2838J9226l693M184
22976c0021J1346J1979j9644k0800l275K8322J2726j7593k2286L3876L968o92
22964a2094q271k1163l4843J8586K2353J4852j3561n535N0230J889k8294L9025
22952B3174J7894q9264j1814J4260J8693j6758J8472k2808k6414j4938l1635N318
22940a15820L6309J6888K1354K9371K4013L06K194l898j6709K0160n689K403K267
$$ plain form
23025 -41278 -81626 -27697 35360 28792 -17459 -24516 4125 47980 44318 47100 21011 630
23013 630 1333 32546 48098 7059 -11149 -31294 -35827 -52892 -18723 19858 -11161 -23235 -16907
23000 -16907 22859 48949 22497 -24774 -35364 -32764 -15899 15900 44935 93171 106185 97328
22988 97328 62542 31535 40638 73822 87359 20138 -51599 -72576 -49738 -30512 -34205 -30021
22976 -30021 -18675 -6696 -26340 -47140 -50415 -22093 -9367 -26960 -49246 -15370 -11402 -12094
22964 -12094 -20365 -41528 -76371 -57785 -35432 -20580 -34141 -39676 10554 12443 -15851 23174
22952 23174 41068 -48196 -60010 -45750 -27057 -43815 -25343 -48151 -74565 -89503 -121138 -115820
22940 -115820 -79511 -62623 -41269 -11898 12115 12421 14615 10717 -5992 14168 8479 10882 13149
22927A3149k116J0163L8642k22l7704k162J8372K749l610k5287O847K8627l5991
22914A1457K9260j2320l4787k009k0119n4214k1422K7716P158j2323J1000l316
22902g3919M662L2748L153L56N5997J2790r3874r862J1287J1145K0822J2405l997
22889a6287m6244J4566n6232j701M4080J6351j3202J7838O273K818j487L6285
22877C058J0763k6183k3119m6093o219P271L0928M2932K0591k8345J9583L2397
22865C7564J6690j1263l7695l8518M6218j9552O528M2131k1536k2987L7491L722
22853C8793k5837m0853O8664k2856k2527j5644n342K8231l167K4828O670l3167
22841b207J8932J079J3805j7111p1881j7528N9418J7024l6132j4238k3278L989
$$ plain form
22927 13149 11033 21196 59838 59616 21912 19750 38122 40871 37261 11974 18821 47448 11457
22914 11457 40717 28397 -6390 -8399 -28518 -82732 -104154 -76438 -69280 -81603 -70603 -73919
22902 -73919 -69257 -36509 -33356 -33000 22997 35787 -58087 -67949 -56662 -45517 -24695 -12290 -16287
22889 -16287 -62531 -47965 -104197 -105898 -61818 -45467 -58669 -40831 -34558 -31740 -33227 3058
22877 3058 13821 -12362 -35481 -81574 -87793 -80522 -49594 -6662 13929 -14416 5167 37564
22865 37564 54254 42991 5296 -33222 12996 -6556 -28 42103 20567 -2420 35071 38793
22853 38793 12956 -27897 40767 17911 -4616 -20260 -25602 2629 -538 24290 30960 -2207
22841 -2207 16725 17804 31609 14498 -57383 -74911 -15493 1531 -34601 -48839 -72117 -68128
22829f8128K1325K3034N5079M754j3755j61J1618K5528j1111k9886j4363m7351
22817d3417n2183K0676K3066k0331M3542P0506N060k6974l8246K5984j1161n3570
22805e7048O221M0232O448M8095j1675qr372l3334j0705k5940K9743L6312m8516
22792b9547o2996k0518J4232O8073n994N8661N4030m6082j0156N48j0678l9588
22780c0015k0172K5890M4275L5041J8973m1687n6975m5283L2790K3412J4314K8927
22768B9490j1640k1215l6057J9969n19O0736N0559m7835m2053m3674J511J5572
22756b5156K0958L1285J4116K4115j3644k2895k8122k9506q938K0410M14l6419
22744e3382p1645N7795O1972P836M2609k9924p652K1221L452l0122J2816l3175
$$ plain form
22829 -68128 -46803 -23769 31310 36064 22309 22148 33766 59294 48183 18297 3934 -43417
22817 -43417 -95600 -74924 -51858 -72189 -28647 41859 46919 19945 -18301 7683 -3478 -57048
22805 -57048 -50827 -10595 -4147 43948 32273 32265 22893 -10441 -21146 -47086 -17343 18969 -29547
22792 -29547 -92543 -113061 -98829 -30756 -36750 21911 75941 29859 19703 20251 9573 -30015
22780 -30015 -50187 -24297 19978 55019 73992 32305 -24670 -69953 -37163 -13751 563 29490
22768 29490 17850 -3365 -39422 -19453 -19972 40764 91323 43488 1435 -42239 -40728 -25156
22756 -25156 -4198 27087 41203 65318 51674 28779 657 -28849 -37787 -17377 -16963 -53382
22744 -53382 -125027 -67232 -5260 2576 45185 15261 7609 28830 32282 2160 14976 -18199
22732a8199l0881m6245j1209M1425j219R665k2945N347O5810K9421R134j18826
22720h8722O293J9204k129j3374J4697J4359N7824L003l3493J423k2673j9851
22708f3439k2472n283L6339M5205Q827M2131J735l5596L53k6489L237Q097M5999
22695C8644k7665j3176N3442K4063q514j1975l930J9049m3424m7137m6154j6510
22683h3287J1832J4277N1052J7812P755j9340K6564N8812l2730k0166J0244N131
22671D7956k8576l646J9137k635k8998N102l8443O402K4517K0161m0210j1347
22659c0580p696L8147K0888L7337O8406l1541n4536j8121k8849l7617l1702L1954
22647d3910K3143J1215N596N9117k4866j2674k7202J6710j588k8876j1980j2778
$$ plain form
22732 -18199 -49080 -95325 -106534 -65109 -66328 -56663 -79608 -74261 -8451 20970 30104 -88722
22720 -88722 -82429 -63225 -65354 -78728 -64031 -49672 8152 11155 -22338 -20915 -43588 -63439
22708 -63439 -85911 -91194 -54855 -9650 -823 41308 43043 7447 7800 -18689 -15452 -7355 38644
22695 38644 10979 -2197 51245 75308 66794 54819 50889 69938 26514 -20623 -66777 -83287
22683 -83287 -71455 -57178 -6126 11686 19441 101 26665 85477 52747 32581 42825 47956
22671 47956 19380 15734 34871 32236 3238 8340 -30103 -23701 816 20977 -19233 -30580
22659 -30580 -38276 -129 20759 58096 126502 94961 40425 22304 -6545 -44162 -75864 -43910
22647 -43910 -20767 -9552 -3956 55161 30295 17621 -9581 7129 5541 -23335 -35315 -48093
22635d8093L8746k0546o9799J8738L2066K6135K2793J2828J9109K0334l097j8761
22623C0453j3905m518M89k4364J1780K5014L0866K4164l8653l4831J6764J5154
22611C8413j7598j4022k2562j8431k4969J7692O821J2991J3662J8480k2363j0893
22599b2779K059k8516k5704M0929J3764M1608N5145j7267j2300Q674k1619m5384
22587a1390j2430K0227j6354O620l2736M3619l0819l1273r1899j9734O6871P0746
22575c8552O5672p49J032l3018P007L9687p543m0926l3294o216L4524R633o2383
22562f5126j28L5022P530R06j8243q902O0429n138k2207J7429K925k0933r484
22549b5920N1293l3078q6220p441L2779J5187j9105q316R01p051N5539J5660k0615
$$ plain form
22635 -48093 -9347 -29893 -99692 -80954 -48888 -22753 40 12868 31977 52311 49214 30453
22623 30453 16548 12030 12519 -11845 -65 24949 55815 79979 41326 6495 23259 38413
22611 38413 20815 6793 -15769 -34200 -59169 -41477 -34656 -21665 -8003 10477 -11886 -22779
22599 -22779 -20720 -49236 -74940 -34011 -20247 21361 76506 59239 46939 55613 33994 -11390
22587 -11390 -23820 -3593 -19947 -13327 -46063 -2444 -33263 -64536 -156435 -176169 -109298 -38552
22575 -38552 27120 26371 27403 -5615 1392 41079 33536 -7390 -40684 -46900 -12376 -2743 -65126
22562 -65126 -65254 -30232 -22702 -21796 -40039 -48941 11488 6350 -15857 1572 4497 -16436 -25920
22549 -25920 25373 -7705 -93925 -101366 -68587 -53400 -72505 -80821 -79920 -86971 -31432 -15772 -36387
22536c6387J1441J7006Q348l8044j7457l0515k9388J4162J899J8952O5742L0839
22524A6598M814o995M3502k4794k4422j2992k201j0841J3082k6993m1137j4675
22512h7054J4455N742J0275K9810K386j3463L7226N2397K5483q068L0072l3812
22500F5449m2097p631j0268k7054n665L8526K5220j953l351k114K7119K192K0384
22487G8757L9611m1971m2071R191M498l0842m9j9246J1358k0418m6467K6713K3219
22474g717J4348O641j0072r053J0217J6928k3054m5993j9643L8817Q503j0714
22462c0792m9189j4347O1143Q1628j9098l4407j3560k2423K3635l0154N747M8237
22450F420l091M3430J9973o9640l4083J6343L1767j1081k3816J3018n742p5443
$$ plain form
22536 -36387 -24946 -7940 408 -37636 -55093 -85608 -114996 -100834 -98935 -79983 -14241 16598
22524 16598 21412 14417 57919 33125 8703 -4289 -6490 -17331 -4249 -31242 -72379 -87054
22512 -87054 -72599 -66857 -56582 -26772 -24386 -37849 -623 51774 77257 69189 99261 65449
22500 65449 23352 15721 5453 -21601 -27266 11260 36480 34527 31176 29062 56181 58373 78757
22487 78757 118368 76397 34326 43517 48015 17173 17124 -2122 9236 -11182 -57649 -30936 -7717
22474 -7717 6631 13272 3200 -5853 4364 21292 -1762 -47755 -67398 -28581 -20078 -30792
22462 -30792 -79981 -94328 -33185 48443 29345 -5062 -18622 -41045 -17410 -47564 -41817 6420
22450 6420 3329 46759 66732 -2908 -36991 -20648 11119 38 -23778 -10760 -16502 -91945
22438i1945m1874J4235M4655K7548p883m4494L1029M7188J5024q245j2285L469
22426b3578l1593l4725k7464k890N4046N2823k7337j6478K7399k3314k5920L607
22414g5424k0566L1775k8067K8858O2317j7902L030n875k3438l0721l5293J5562
22402i5744J5122M895K2323L9808K1581m6915j5584M3097L0838L210l1291q637
22390a7297K0022m2631m601l4280m5354K1168O6432K430n664k9569m0504l7951
22378a47799K3039M0173L3949o360l1304K2103N970N538j8065m0199j1973O7599
22366e7329L4777m3856J5914M9468j998O74J9018M612l6754l7243l8775J6051
22354g5441M0491J804K9610K7719K6870j6226J7261n4918l8155l8581k9811K654
$$ plain form
22438 -91945 -133819 -119584 -74929 -47381 -55264 -99758 -68729 -21541 -6517 -14762 -27047 -23578
22426 -23578 -55171 -89896 -117360 -120250 -66204 -13381 -40718 -57196 -29797 -53111 -79031 -75424
22414 -75424 -95990 -64215 -92282 -63424 -1107 -19009 -15979 -21854 -45292 -76013 -111306 -95744
22402 -95744 -80622 -75727 -53404 -13596 7985 -38930 -54514 -11417 19421 22631 -8660 -17297
22390 -17297 2725 -39906 -44507 -78787 -124141 -102973 -36541 -34111 -39775 -69344 -109848 -147799
22378 -147799 -124760 -84587 -50638 -56998 -88302 -66199 -60229 -54691 -72756 -112955 -124928 -57329
22366 -57329 -22552 -66408 -50494 -1026 -3024 -2350 16668 21280 -15474 -52717 -91492 -75441
22354 -75441 -34950 -33146 -3536 24183 51053 34827 52088 -2830 -40985 -79566 -109377 -106723
22342a06723l266l09K2865K4635L1267k794L445K1100J3567J8864J3055J0760
22330D6466l5324k5194M844j803l4475k4811N356J2350L9395J0398l172J2639
22318F669P3961O815n753m2543N171J6692k0965m2499j0219l6155m611k471K7780
22305b8128l8503L423M7247j5560j0764o25L7000p953j3972J2400l7673K0663
22293c2445K4135L626N012k1022L0370N7796k6603n328K3596M636k9141j4784
22281A9848M507m9725l349j7241q280J1658l393j4409M397O5887L0558K6930J9764
22268H7152j1789k0794j9998p0164Q376J6167P2079N6734j2202o0013j02205k2296
22256g8953P9365P0330m463j3701l8710k0963L3662n935K9847L669m6081P234
$$ plain form
22342 -106723 -109989 -110298 -87433 -62798 -31531 -34325 -30880 -9780 3787 22651 35706 46466
22330 46466 11142 -14052 -9208 -11011 -45486 -70297 -64941 -52591 -13196 -2798 -5970 6669
22318 6669 80630 87445 81692 39149 44320 61012 40047 -2452 -12671 -48826 -53437 -55908 -28128
22305 -28128 -66631 -63208 -15961 -31521 -42285 -42910 -5910 -13863 -27835 -15435 -53108 -32445
22293 -32445 -8310 -4684 328 -20694 9676 67472 40869 35541 59137 63773 34632 19848
22281 19848 24355 -25370 -28719 -45960 -54240 -42582 -45975 -60384 -55987 9900 40458 67388 87152
22268 87152 75363 54569 34571 -35593 -27217 -11050 61029 117763 105561 45548 -56657 -78953
22256 -78953 412 70742 66279 52578 13868 -7095 26567 20632 50479 54148 8067 15301
22244A5301J0647J5434o883l0584m5817j1272L0871J00884L0259o7723l9448j4009
22232a2340Q572L4412r520k0352K9437o628j5723m9627N6077O7938n5271o9990
22220d3015M1759M9510o092J8606n4294o0621j2704r547J1312j3451K1278L7139
22208b0120M3882O2596l4852j01533J6255O7713q271l9958J136J48k8522j5456
22196e6982J0121J7313N0474M5484J2003p0841M879L3903N202K6052l3191m4312
22184A05k4721j3011M3870j8357k8656J3172J0661k0133m2950k6087M5407L1624
22172b9076K8173J7913l0875k9681K0155P733L7261O121k3680m836Q8800m5444
22160D2564j931l6932j7836J2768J9596j2825J563L0992j4263o649M0525o1561
$$ plain form
22244 15301 25948 41382 34499 3915 -41902 -53174 -22303 78581 108840 41117 1669 -12340
22232 -12340 -3768 30644 21124 772 30209 23581 7858 -41769 14308 82246 26975 -43015
22220 -43015 -1256 48254 42162 60768 6474 -54147 -66851 -76398 -65086 -78537 -57259 -20120
22208 -20120 23762 86358 51506 -50027 -33772 33941 25670 -14288 -13152 -13004 -41526 -56982
22196 -56982 -46861 -29548 20926 66410 78413 7572 12451 46354 51556 77608 44417 105
22184 105 -24616 -37627 6243 -12114 -40770 -27598 -16937 -37070 -80020 -106107 -60700 -29076
22172 -29076 -903 17010 -13865 -43546 -23391 -15658 21603 27724 4044 -792 88008 42564
22160 42564 40633 3701 -14135 -1367 18229 5404 6967 37959 23696 17047 57572 -3989
22148c989n6246O1030M2639M8444J4279k7903l807J040n5446q407m5187J5935
22136a7618j0025N3075R062j0379k8637j2091k3690J3967J899m3776P250q047
22124f9010N9068K6978k9287j4701K8799L4712r740K436J0794J8642j6595o1700
22112a9604K6976N0124j0992k8849j5425m834J6975j8962J1341n0394r521l680
22100e6845J1247j3253K5383j2175J5745l1272K3048Q171J517L2762m3400K3942
22088a5130O945j8488L7081k9325l4051n516o259J2152M1818J4075r017J3089
22076G374r67l8443l5192O7742J5076o761j125J2970k3075m4876l6711J4976M4489
22063b4523K9956Q119N7893p135O672l8793l5398j133N261j2217J2859m3527j293
$$ plain form
22148 -3989 -60235 795 43434 91878 106157 78254 74447 75487 20041 11634 -33553 -17618
22136 -17618 -27643 25432 34494 24115 -4522 -16613 -40303 -26336 -24437 -68213 -60963 -69010
22124 -69010 -9942 17036 -12251 -26952 1847 36559 26819 29255 40049 58691 42096 -19604
22112 -19604 7372 57496 46504 17655 2230 -2604 14371 -4591 6750 -43644 -53165 -56845
22100 -56845 -45598 -58851 -33468 -45643 -29898 -61170 -38122 -29951 -28434 4328 -39072 -15130
22088 -15130 -8185 -26673 10408 -18917 -52968 -58484 -64743 -52591 -10773 3302 -5715 7374
22076 7374 6407 -32036 -67228 514 15590 8829 7704 20674 -2401 -47277 -83988 -69012 -24523
22063 -24523 5433 13552 71445 64310 70982 32189 -3209 -4342 919 -11298 1561 -41966 -43259
22050d3259j1679j1006M4745L546m670K2164m1486k2819j3943j6147J2570L3694
22038d8290N6755J612O427j9086j9132R252M2451K9683j6117n999j4847k7083
22026d374P37j6925k0964m6613M7805R19j8218j3771K0753M6511j2168o890o227
22013b9425J0550O0724j9464m9188L0444M2384K7743k7971j6336J1608j3708j5199
22001A2162k6338j2026M3517j8005k0401K83K9279K873k6080j5735m8891L5848
21989d3514Q033L017K5907j0473N3625J8600r345n7573m3626K8332J8938Q0593
21977G2514j2709o9183k4547r968k84J5973M4088L685o1811k4645Q3057N7672
21965G3842k7812m5677J1749m0357Q904l268k7844l0662j7198L6778J2490K0279
$$ plain form
22050 -43259 -54938 -65944 -21199 -17653 -22323 -159 -41645 -64464 -78407 -94554 -81984 -48290
22038 -48290 8465 10077 16504 -2582 -21714 -12462 29989 59672 43555 37556 22709 -4374
22026 -4374 -3637 -20562 -41526 -88139 -40334 -39415 -57633 -71404 -50651 -4140 -16308 -23198 -29425
22013 -29425 -18875 41849 22385 -26803 3641 46025 73768 45797 29461 41069 27361 12162
22001 12162 -14176 -26202 17315 -690 -21091 -20808 8471 11344 -14736 -30471 -79362 -43514
21989 -43514 -35481 -32464 -6557 -17030 36595 55195 45850 -11723 -55349 -27017 -8079 72514
21977 72514 59805 -9378 -33925 -43893 -44177 -28204 15884 19569 -42242 -66887 16170 73842
21965 73842 46030 353 12102 -28255 -19351 -22619 -50463 -81125 -98323 -61545 -49055 -28776
21953b8776j0726J232k5691M0765M1416K2273K3505k7019n5104o864J1794M8690
21941C5495J3419K2517K659q7792l3725J7230l467j9367N8726L3077O726M258
21929D9756l6694k3074l9363j2896K7626O1472m3216k962L1403L528k4507J7874
21917H947j7158k835R274j0928J0788R912j3260k3625L977j714j7633K8900O504
21904h851L1784K6269l707M2028K2272k4919r0243l9842R855J7600K3513L4721
21892D0480j1135l0029k2345J6493L0969L9123N32k884l6472j3102l8226l3525
21880f0121N7558N2693j8670j8407j4701m0710n6858O96N1992j0931k2832N413
21868g4878k7008M3207j5717K7365L3410M7264K9994k9972k5812k4429N085l2807
$$ plain form
21953 -28776 -39502 -38270 -63961 -23196 18220 40493 63998 36979 -18125 -24989 -13195 35495
21941 35495 48914 71431 74090 -13702 -47427 -30197 -33664 -53031 5695 38772 45498 49756
21929 49756 13062 -10012 -49375 -62271 -34645 26827 -16389 -19351 12052 15580 -8927 8947
21917 8947 -8211 -11046 -1772 -12700 -1912 8000 -5260 -28885 -24908 -26622 -44255 -15355 -8851
21904 -8851 22933 49202 45495 87523 109795 84876 -5367 -45209 -35354 -17754 5759 40480
21892 40480 29345 -684 -23029 -6536 24433 63556 64088 61204 24732 11630 -26596 -60121
21880 -60121 -2563 50130 31460 13053 -1648 -42358 -99216 -98520 -46528 -57459 -80291 -74878
21868 -74878 -101886 -58679 -74396 -47031 -13621 33643 63637 33665 7853 -16576 -11491 -44298
21856d4298l1945R837K775M4450L9315K258o05q249n1123l0103R571J2464m000
21843d9653k2723L3340M5409L4390K1908n0343l9084k462l0130j924M0670K5190
21831D588k8556r749O690K2543O4385m1409m3922J5479M645k239j6349M338j0126
21818b9682o375k2150m9494N6979k4044J5662M4051L1044K2945k1743l8214J126
21806a9895N548P944p1030O66L0449l4038j0085j3546K3209M6954K323L3875m219
21793a845K807j9153m4809j0642M1686N0926j2424l3283j9280j7789k1138K2963
21781f1981K717N2879J1265m2235j8063J6760K7786L9819j8902k1235j4895M8069
21769B1984N9973k4937m7592l1448N488L9828k3817K0137J837R482M2894j766
$$ plain form
21856 -44298 -76243 -66406 -63631 -19181 20134 22392 21787 13538 -37585 -67688 -58117 -45653 -49653
21843 -49653 -72376 -39036 6373 40763 62671 12328 -26756 -29218 -59348 -61272 -20602 4588
21831 4588 -23968 -33717 -27027 -4484 59901 18492 -25430 -9951 -5306 -7545 -23894 -19556 -29682
21818 -29682 -36057 -58207 -107701 -50722 -74766 -59104 -15053 15991 38936 17193 -21021 -19895
21806 -19895 -14347 -6403 -77433 -76767 -46318 -80356 -90441 -103987 -80778 -33824 -31501 2374 -1845
21793 -1845 962 -18191 -63000 -73642 -31956 18970 6546 -26737 -46017 -63806 -84944 -61981
21781 -61981 -59264 -6385 4880 -37355 -55418 -38658 -10872 28947 10045 -11190 -26085 21984
21769 21984 81957 57020 9428 -22020 -16532 23296 -521 19616 21453 30935 73829 72063
21757G2063m6302j4083k946j059K4763M4918M5764j3530n2788m4172l4604J4836
21745g140J7833k8744j6779K7643N4253M2011R670k9968m3087m3596O661M6773
21733C5530R342k3342M837j640Q595j0957o3446m9202j3542K7606J4672J0355
21721e1192J0226o99j2816O353J6495L8134q219R676K5327K9490L0078n5216q7156
21708d9519k4981N5409N237M3583k0366j7687M3777j5566j0563j8901n122K3042
21696H343K2549K9939M0240k073j5683k6980p473j2162J5874j2404k9680k1049
21684a0559n98L3853J6856k7304K7065j8317j8782l0816k5748K963J6718L3408
21672a261M5379j2012l0026K0471N4151K2920o6288o2312K578O4926J1273m0278
$$ plain form
21757 72063 25761 11678 8732 7673 32436 77354 123118 109588 56800 12628 -21976 -7140
21745 -7140 10693 -18051 -34830 -7187 47066 89077 98747 68779 25692 -17904 -11243 35530
21733 35530 44872 21530 26367 24727 33322 22365 -41081 -90283 -103825 -76219 -61547 -51192
21721 -51192 -40966 -41665 -54481 -48128 -31633 6501 -1718 7958 33285 62775 92853 37637 -49519
21708 -49519 -74500 -19091 -13854 29729 9363 -8324 35453 19887 9324 -9577 -14699 8343
21696 8343 30892 60831 101071 98998 83315 56335 48862 36700 52574 40170 10490 -10559
21684 -10559 -11157 22696 39552 12248 39313 20996 2214 -28602 -54350 -51387 -34669 -1261
21672 -1261 44118 32106 2080 22551 76702 99622 33334 -28978 -26400 38526 49799 9521
21660I521k2212L9466k2038j6295M7520k3296k2813j8807J0540M7567L3723M501
21648F7377k3654l4473l8236J1372j607q826L6929p117p093k6249l436J7695K7205
21635I887M6748M7886k986m2784o1480l9332m566k4323N744L4258M5456O9990
21623H4498J5037l8671m4115j5115Q98k6132k8900J4351l3997j3135M4218K0816
21611b0247M033n9485l4251N5448L12j9073o704L1111o104Q4057J11j3261n7869
21598d1922l8581K1448M7433n436M820J4122O6848L6249l8452m3060K2654k0265
21586B5858K9537l285m2243l4058j8032M5296N525K9210M1799l8357j1959L0602
21574E9893K7628J1464l9819o7707m6447K3757j2237j6369L386k823J1870O111
$$ plain form
21660 9521 -12691 26775 4737 -11558 35962 12666 -10147 -28954 -18414 29153 62876 67377
21648 67377 43723 9250 -28986 -17614 -19221 -28047 8882 1765 -5328 -31577 -35013 -17318 9887
21635 9887 56635 104521 101535 58751 -2729 -42061 -46627 -70950 -65206 -30948 14508 84498
21623 84498 99535 60864 16749 1634 2532 -23600 -52500 -38149 -72146 -85281 -41063 -20247
21611 -20247 -16214 -75699 -109950 -54502 -54190 -73263 -79967 -48856 -54960 29097 29208 15947 -41922
21598 -41922 -80503 -59055 -11622 -17058 -12238 1884 68732 104981 66529 23469 46123 25858
21586 25858 55395 52110 9867 -24191 -42223 3073 8598 37808 79607 41250 29291 59893
21574 59893 87521 98985 59166 -8541 -54988 -31231 -43468 -59837 -56451 -59274 -47404 -41293
21562d1293O2081J6001m5740j2377q66L0892o677M2072m549m2385j0431k6484
21550c9756J8454L5444k7822K4420j7248j8912k935l2754J1967L3364N642k0787
21538c0923J4653J3606k0088L0202L0483J1110l5904l6786l4162L9219n122j011
21526b4723j1120N6m1593q15R76J823k5475l066M1989L1965J9527M9812R603J462
21512E0421j7317K51L5094j6932l4983L6278K739k0342k1972o4138n7746J4317
21500i4330K5697K2953N9628K9161l3775J8673j160M318q009L3454p606n9357
21488a0353l7005L8245K5255j7443M1641J3037r8833l5138N9563O4070O3997K1390
21476A28426l0796l1438q633m3895J680j748K7376M0962m8720n2211m8771m1451
$$ plain form
21562 -41293 20788 36789 -8951 -21328 -22194 8698 2021 44093 39544 -2841 -13272 -39756
21550 -39756 -21302 14142 -13680 10740 -6508 -25420 -28355 -61109 -49142 -15778 -10136 -30923
21538 -30923 -16270 -2664 -22752 7450 37933 49043 13139 -23647 -57809 -18590 -23712 -24723
21526 -24723 -35843 -35787 -77380 -78195 -77219 -75396 -100871 -103937 -61948 -29983 -10456 39356 48959 50421
21512 50421 33104 33355 68449 51517 16534 52812 55551 35209 13237 -50901 -108647 -94330
21500 -94330 -68633 -45680 13948 43109 9334 28007 26847 31165 23156 56610 49004 -10353
21488 -10353 -47358 -9113 16142 -1301 40340 53377 -45456 -80594 -21031 43039 107036 128426
21476 128426 97630 66192 57559 13664 15344 13596 40972 81934 33214 -18997 -67768 -109219
21464a09219M2140K5447Q737L0406o551j7231n8138q633N0107L9461L095N896
21452E517j2782k8233r057n982j8005J5262K9065L7551J8351k0455L0418j8890
21440B2760k5377K4532M2616k2113o708M6492M6895j6942j3637j014m9762k2784
21428B4958k8053O957M281j7716J4581J5272K014K2613j3816N8668l9883n9475
21416i599O235K4905L3731M1267k805m9019l03J5960l7464k6033l7286K4791L1485
21403A5865l3523j3538L0627K5217O283J389p196k6705j5055M218K1808L4449
21391D3839J4938L861l1422J3721K5825q204m8779l1612m4522l1501J3808p100
21379h7148P018K0745P415r306P131P2351j3772k1812O0688M5614n0611j4456
$$ plain form
21464 -109219 -67079 -41632 -32895 -2489 -9040 -26271 -84409 -93042 -42935 -3474 -379 5517
21452 5517 -7265 -35498 -44555 -50537 -68542 -53280 -24215 13336 31687 11232 41650 22760
21440 22760 -2617 21915 64531 42418 35710 82202 129097 112155 98518 97504 47742 24958
21428 24958 -3095 3862 8143 -9573 5008 20280 22294 44907 31091 89759 49876 -9599
21416 -9599 -3364 21541 55272 96539 93734 44715 44412 60372 22908 -3125 -40411 -15620 15865
21403 15865 -17658 -31196 -569 24648 30931 32320 25124 -1581 -16636 -12418 9390 43839
21391 43839 58777 62638 31216 44937 70762 62558 13779 -17833 -62355 -93856 -80048 -87148
21379 -87148 -80130 -59385 -51970 -61276 -54145 18206 4434 -17378 43310 88924 38313 23857
21367B3857q895K7810M471q9402q315J2201k7592m293Q569J0337J5542k1591j6209
21354g3510K0637J1122K065n376K881j332j5513J3612J1157J8232N1510k1464
21342A4021m6976K8141K9638l1554p0161m1943M8729L7697N6846k053j511j0097
21330A0777k2196N630l19J8322l173J4308K4645J5495m331J5583o2363m5983m5550
21317g9155j918R761k937L474P111J0828L0916q215k5249N0583O4651K0604l8196
21304D2258k686j2425L0835J9219m2266m4277j4340J8006j363j9877J4282P319
21292e315k5135k0986M331k090j3096O9882O2621J9499m6152o3509J7763L7022
21280C4835L4461k8548m2280J3839k034J1000k751n734j2738L1710j7726K5368
$$ plain form
21367 23857 14962 42772 47243 -42159 -50474 -38273 -65865 -70158 -61589 -51252 -35710 -57301 -73510
21354 -73510 -52873 -41751 -39686 -45062 -42181 -43513 -59026 -45414 -34257 -16025 35485 14021
21342 14021 -32955 -4814 24824 -6730 -76891 -118834 -70105 -32408 24438 22385 20874 10777
21330 10777 -11419 -5789 -6108 12214 9041 23349 47994 63489 59158 74741 12378 -33605 -79155
21317 -79155 -81073 -71312 -74249 -70775 -63664 -52836 -21920 -30135 -55384 -4801 59850 80454 42258
21304 42258 39572 27147 57982 77201 34935 -9342 -23682 -5676 -7039 -26916 -12634 -5315
21292 -5315 -30450 -51436 -47105 -49195 -62291 7591 70212 89711 43559 -19950 -2187 34835
21280 34835 69296 40748 -1532 12307 10273 21273 18522 12788 50 31760 14034 39402
21268C9402J1451k6138k932m2448k5690k3799j645L547L3094R649K9192N9013
21256F2696P036J7680o8969o8067K2318K9618M74k1303q264m0204K3054N5289
21244A1358Q545K988q888k3387N84K0485k0949k1813R00J7127j7456K6664K6479
21231B2637K696N916O217N494J770m7143m4936K1952q265J2599J9832n3000k8749
21218h2980J739o730R410M6137Q807R822J061k2278K74k1768L1224K3828k5954
21205b7408k1023M2721J7123M093J8084K5533p827k3942o6405O97P4374k754j6512
21192A6754r977J7230P690j4118K5243K0915k2878p91R411M6470j173o6583k646
21179B5547J3925r364L4347P2763n5k6372m4259q0989J0980J1315N959j7354K968
$$ plain form
21268 39402 50853 24715 21783 -20665 -46355 -70154 -71799 -68252 -35158 -25509 3683 62696
21256 62696 69732 87412 18443 -49624 -27306 2312 2786 -18517 -26781 -66985 -43931 11358
21244 11358 19903 22891 14003 -9384 -8800 11685 -9264 -31077 -30177 -13050 -30506 -3842 22637
21231 22637 25333 31249 37466 42960 44730 -2413 -47349 -25397 -33662 -21063 -1231 -54231 -82980
21218 -82980 -81241 -87971 -78561 -32424 -23617 -13795 -12734 -35012 -34738 -56506 -25282 -1454 -27408
21205 -27408 -48431 -5710 11413 15506 33590 59123 51296 27354 -39051 -38354 36020 33266 16754
21192 16754 6777 24007 31697 17579 42822 63737 40859 40068 49479 95949 94776 28193 25547
21179 25547 39472 30108 64455 137218 137163 110791 66532 -14457 -3477 7838 13797 -3557 -589
21166e89M6491K2227r621o3007p71J2064K6299K8089K6868J6110l3867p8187k1756
21153b9650K9957K3643K4597P608L750M5588k9694p4488n7500N9240M9916M5239
21141I8206j2390p985q293m8028O511K5348O1449L2782Q736j7164p5870j07341
21129d4039k02L9156k9532k2129M7350K5114O730K7056P163j0574n3857k1201
21117b8965N2899L872o453n725j5545j2764k0966m64Q350N6788J0037j8106J7573
21104D0531k6482o5071l3640j0762L1774L0051q767K6201N7871J8797j598j8106
21092D0799J4977k9199o2393j4618K7420Q694k6026L8389K1944l9976P573N0372
21080C7956k9108o800K3520m7169j2409P3784j0604K6436j1979k1319m7853N043
$$ plain form
21166 -589 45902 68129 58508 -4499 -5270 6794 33093 61182 88050 104160 70293 -7894 -29650
21153 -29650 307 23950 48547 56155 59905 105493 75799 1311 -56189 3051 52967 98206
21141 98206 85816 77831 69538 21510 28021 53369 114818 147600 156336 139172 63302 -44039
21129 -44039 -44241 -5085 -34617 -56746 -9396 15718 22448 49504 56667 46093 -7764 -28965
21117 -28965 23934 27806 21353 15628 83 -12681 -33647 -34111 -25761 31027 41064 22958 40531
21104 40531 14049 -51022 -84662 -95424 -63650 -33599 -42366 -16165 41706 60503 58905 40799
21092 40799 55776 26577 -35816 -50434 -23014 -14320 -40346 -1957 19987 -19989 -12416 37956
21080 37956 8848 2048 25568 -21601 -34010 39774 29170 55606 43627 22308 -25545 -20502
21068b0502J2638j632o6745L790J6513M2090l1950O498j5019p070K8822M3435
21056A0868O003J7433N399J3646O167M404r642m263R24L4166r631n1564l3359
21043i449j5575m1160j0823n934J3146N265K7223N1410j5168K4954o494n3634
21031c6239L4656N0530J8986m795J018k156j0082p4762n4339n537L0414L529j0551
21018e9328M5806j7818m7951j402k9930O321N2886L623J1804N5842J5246k6275
21006H824k2461m2879j1673K8444o292o162k1427l0665m25j5548L5364M8215J0529
20993b6156K190K347p758j5399J1217o944k6995K5900N1138j0993k9417K1485
20981i385K2413j2067j8042j575J5172K6545J2302J1206k053L0331l756j0799
$$ plain form
21068 -20502 -7864 -9496 -76241 -72451 -55938 -13848 -45798 -39300 -54319 -61389 -32567 10868
21056 10868 16871 34304 39703 53349 59516 63920 54278 50015 50939 85105 75474 23910 -9449
21043 -9449 -25024 -66184 -77007 -82941 -69795 -64530 -37307 14103 -1065 23889 17395 -36239
21031 -36239 -1583 48947 67933 63138 64156 62000 51918 -22844 -77183 -82720 -52306 -48777 -59328
21018 -59328 -13522 -31340 -79291 -80693 -110623 -104302 -51416 -47793 -35989 19853 35099 8824
21006 8824 -13637 -56516 -68189 -39745 -46037 -52199 -73626 -104291 -104716 -120264 -84900 -36685 -26156
20993 -26156 -23966 -21619 -29377 -44776 -33559 -40503 -67498 -41598 9540 -1453 -30870 -9385
20981 -9385 13028 961 -17081 -18656 -3484 23061 35363 46569 44516 74847 71091 60292
20969F0292l2677K0282K0305K6504J5606o7472l6554J3385M0618k35j1808J1930
20957F0176J0301o3582n502J0043p4220L9555Q045K1786M8098J0951l5082m3964
20945a3395q97k6560J3603K2101K810p078L5948L3948l8144p6472k751j7637J878
20932g2646n227K876J2651K6402k7419P2222K8024j552j644k9172J1639L2970
20920D9124Q262J0847L0453Q185N523k3880l7068q9140J0039J6007O796L9968
20908C5116K4884l1794K4243J2834n9708p194R893j7822k1766j3190J1891o941
20896c9554j5454L39Q566N0508q10m7856j9536j141K5465J7470j4338P159K3951
20883e231p208L0994J8488k075m8775K9566K4170r770j5390k518l873n7911j2142
$$ plain form
20969 60292 27615 47897 68202 94706 110312 42840 6286 19671 60289 60054 48246 60176
20957 60176 70477 6895 1393 11436 -62784 -23229 -15184 6602 54700 65651 30569 -13395
20945 -13395 -14292 -40852 -27249 -5148 -2338 -9416 26532 60480 22336 -54136 -56887 -74524 -72646
20932 -72646 -77873 -74997 -62346 -35944 -63363 8859 36883 35331 33687 4515 16154 49124
20920 49124 57386 68233 98686 106871 112394 88514 51446 -37694 -27655 -11648 -4852 35116
20908 35116 60000 28206 52449 65283 5575 -1619 8274 -9548 -31314 -44504 -32613 -39554
20896 -39554 -55008 -54669 -46103 4405 3595 -44261 -63797 -64938 -39473 -22003 -36341 -29182 -5231
20883 -5231 -12439 18555 37043 34968 -13807 15759 39929 30159 14769 12251 8378 -49533 -61675
20870f1675j2200K5848J16081J7986q433k5146n0624m6054j5842N9920K412m0213
20858c7940J6116p141p24J6705O1793J6975J9724k9114n287j8538n1006p751j18
20845b6306K9986N0408m7683k4361K962L5516J0149q885k4393j4964r048K2406
20833d213k8235J8464j2442N259N4346k2167L710n842l5468k1418Q723k902J260
20820d0925J1914L3006M7720l0974j7126l16Q4680J1841m8468j6386m0982j7880
20808b3896q479k1849Q694J4211j3089j4727o707m537Q1302j631J0350j8549o249
20795e156l1123m89K4557m527n894j344K1683L475j2421r253M207n2247m9861
20782a18393K9742J914L288K7145L2235N1433K1676R463j4139p6712p1371M5907
$$ plain form
20870 -61675 -73875 -48027 68054 86040 77607 52461 1837 -44217 -60059 -139 2273 -37940
20858 -37940 -21824 -28965 -29689 -12984 48809 65784 85508 56394 51107 32569 -18437 -26188 -26306
20845 -26306 3680 54088 6405 -17956 -14994 20522 30671 21786 -2607 -17571 -26619 -4213
20833 -4213 -32448 -13984 -26426 -21167 33179 11012 14722 8880 -26588 -48006 -39283 -42185 -40925
20820 -40925 -29011 3995 51715 20741 3615 3299 87979 99820 51352 34966 -6016 -23896
20808 -23896 -32375 -54224 -45530 -31319 -44408 -59135 -65842 -70379 10923 9292 19642 1093 -5156
20795 -5156 -36279 -36768 -12211 -16738 -22632 -23976 -2293 1182 -11239 -20492 -16285 -68532 -118393
20782 -118393 -88651 -86737 -83449 -56304 -24069 27364 49040 58503 44364 -32348 -103719 -57812
20770e7812L1163M114J9630j3938n7920O890K5265J5451m670L0040J7990o243
20758I960j4943k7225J2174o5578K0100j322j9536k32j7467l256N7693L0695o260
20745b5197J002q774n1735J35K4867L3725J7991k0195j8395j9567J9144N0957
20733C958M4507L7518k1062k0355n5780m9554N645M0881k9743P337M5921n469
20721C804m4148P201J9329k443P002L4600n0160j7119M8969J6239j7596J9294
20709B4972N2509o7841j9310j0452l4006R378m368M5240K3473j2303J6680K4555
20697D8527M9065J2514k2123l5544r0591l6204K1746J3416M0377K5351J6284J8038
20685F0856m1139j7363O7493k9465j4131j7341m6329j1053J0837J8172j9934p224
$$ plain form
20770 -57812 -26649 -22535 -2905 -16843 -74763 -67873 -42608 -27157 -31827 -1787 16203 9960
20758 9960 -4983 -32208 -20034 -85612 -65512 -66834 -86370 -86602 -104069 -107325 -49632 -18937 -25197
20745 -25197 -24195 -32969 -84704 -84569 -59702 -25977 -7986 -28181 -46576 -66143 -46999 3958
20733 3958 48465 85983 64921 44566 -11214 -60768 -55123 -14242 -43985 -36648 9273 3804
20721 3804 -40344 -33143 -13814 -16257 -9255 25345 -24815 -41934 7035 23274 5678 24972
20709 24972 77481 9640 -9670 -20122 -54128 -44750 -49118 -3878 19595 7292 23972 48527
20697 48527 97592 110106 87983 52439 -38152 -74356 -52610 -39194 1183 26534 42818 60856
20685 60856 19717 2354 69847 40382 26251 8910 -37419 -48472 -37635 -19463 -39397 -46621
20673d6621K6302K7796L4344n812k2548j4333l1409k0145k3477M6446P8069N736
20661E4348m9445J245K1772l4896n3735O869L2126P2597J7826m3390o1210j2193
20649d8086J3525O45K7142R045k769n328J9563k9466l4786P2140P6540j4878p0133
20636A3154j5936K9496P513p381l6370J2360J5471M9051j087k1599K5918j3282
20624E7308n1002l0586R521O8593N0298p605m5143j3639k0077l9870J886J3081
20612g235N96M3984L763l4823L911M1107l7643n869l1640l9931r405J5458J3389
20599d4338M346M6667K4235p9953k4668K6349K6074K2214L1076K1494j8016k9644
20587E836k118k5130j2245J8807K5240J6527m15J420j3977J8873K130J7427n4033
$$ plain form
20673 -46621 -20319 7477 41821 36009 13461 -872 -32281 -52426 -75903 -29457 48612 54348
20661 54348 4903 6148 27920 -6976 -60711 -53842 -21716 50881 68707 25317 -35893 -48086
20649 -48086 -34561 -33916 -6774 2271 -498 -5826 13737 -15729 -50515 21625 98165 83287 13154
20636 13154 -2782 26714 34227 26846 -9524 2836 18307 67358 66271 44672 70590 57308
20624 57308 6306 -24280 -14759 53834 104132 96527 51384 37745 17668 -22202 -20316 -7235
20612 -7235 -6639 37345 41108 6285 10196 51303 13660 7791 -23849 -63780 -73185 -57727 -44338
20599 -44338 -39992 6675 30910 -49043 -73711 -47362 -21288 926 32002 53496 35480 5836
20587 5836 3718 -21412 -33657 -14850 10390 26917 26502 27922 13945 32818 34948 52375 -1658
20574a658j8167M6748L0743j2815K2222r609j6376m389N476J4128j4715K2558
20562F4146j8512j1887J1049P248o3628j3850L3936p840n8142L8060N4018J0174
20550D4772q056r198n031K1650J3119L9198l2383K0871m2419m2052k0027k539
20538b2095K3852M7189k6203m8375q802J370K6788k8050J3113J7848m9664k5652
20526g8681M1518N4786k406j4534K3874M387n7667k0293L7606Q621j8152k297
20514b3238N0609l5614k1508L9873M859J1586J8903N385l4505m104l6271m8225
20502g2250M501M0418Q400m7785K4941K4175J3218K6518O572K3862j8404P684
20490D1850k0704m1105K7106L1141M2459l294J9704l127l632p918J242m7166o6039
$$ plain form
20574 -1658 -19825 26923 57666 44851 67073 57464 41088 36699 42175 56303 41588 64146
20562 64146 45634 33747 44796 52044 -11584 -25434 8502 662 -57480 -19420 34598 44772
20550 44772 36716 27518 22487 44137 57256 96454 64071 84942 42523 471 -19556 -22095
20538 -22095 1757 48946 22743 -25632 -34434 -33064 -6276 -34326 -21213 -3365 -53029 -78681
20526 -78681 -37163 17623 15217 683 24557 28944 -28723 -49016 -11410 -2789 -20941 -23238
20514 -23238 27371 -8243 -29751 10122 14981 26567 45470 50855 16350 12246 -24025 -72250
20502 -72250 -67749 -27331 -18931 -66716 -41775 -17600 -4382 22136 28708 52570 34166 41850
20490 41850 21146 -19959 7147 38288 80747 77453 97157 94030 90398 82480 83722 36556 -29483
20477b9483J4632J1581K4602O412j755j7113l7188M5635j110M059J6266j5668
20465B0870J5455N3705j3943l5647L7235o708j8377p6734l3079L3699N3375k9989
20453a38J9014J7375j9012j9105K5141j6043K6163N8476m9199m4691j1880j7816
20441c1715n751K7435O15j2563l2508j3151l05M4626M949m1073Q725M928J3691
20428c2097L0760M1484K9967K3785o879J3329O257k0687j7030m9481j3915k2435
20416a6942o8081j3515K1388N7556j5162m5771M224l0356M2631P9853k2J4208
20404C0011L3429j7223m112K660m945q1341k0085k1549m0777N8604K7803m8996
20392h6521M1846P5677L4060l3980P1337K6268J6908j2275k0540l7135n090R490
$$ plain form
20477 -29483 -14851 -3270 21332 27744 25989 8876 -28312 17323 16213 20272 36538 20870
20465 20870 36325 90030 76087 40440 77675 70967 52590 -24144 -57223 -23524 29851 -138
20453 -138 18876 36251 17239 -1866 23275 7232 33395 91871 42672 -2019 -13899 -31715
20441 -31715 -37466 -10031 -9416 -21979 -54487 -67638 -67943 -23317 -18368 -59441 -50716 -45788 -32097
20428 -32097 -1337 40147 70114 93899 87020 100349 106606 85919 68889 19408 5493 -16942
20416 -16942 -85023 -98538 -77150 -19594 -34756 -80527 -76303 -106659 -64028 15825 15803 30011
20404 30011 63440 46217 42105 44765 39820 -41521 -61606 -83155 -123932 -65328 -37525 -86521
20392 -86521 -44675 31002 65062 31082 102419 128687 145595 133320 112780 75645 70555 80045
20380H0045l9393j3010n1435L788M2229J8721m0326q693M120K8407K1082L3745
20368G9280k6678k9795j8195l5946k6539L3097J1441K0542K3124N649l7304p272
20356h596l7919o785Q964N5737K9193o572K0444j21L3689L1115N096n4921j9117
20343E0207L541L4233j5856l0825k3162p1064k0545L3575N758k5888o233J4938
20331e1321Q338j8315J7827N678J0988J9591j6020L5156n413L09O386M9681P907
20318G0792p989P5758P099n3761o5148m8068l5982K0218N0585N0168j6314j7820
20306B9538J0957k3345M533J2083L0185J076j096k9944m3644l1618N011K2036
20294a4228O333M4332p221k4147J971l8432j2216J8707Q545N4664O5980J9331
$$ plain form
20380 80045 40652 27642 -23793 -20005 22224 40945 619 -8074 -3954 24453 45535 79280
20368 79280 52602 22807 4612 -31334 -57873 -24776 -13335 7207 30331 35980 -1324 -8596
20356 -8596 -46515 -53300 -44336 11401 40594 34022 54466 54345 88034 119149 124245 69324 50207
20343 50207 53748 87981 72125 41300 18138 -52926 -73471 -39896 -34138 -60026 -66259 -51321
20331 -51321 -42983 -61298 -43471 -37793 -26805 -7214 -23234 11922 6509 6818 13204 62885 70792
20318 70792 62803 138561 145660 91899 26751 -21317 -57299 -37081 13504 63672 47358 29538
20306 29538 40495 17150 21683 33766 63951 65027 63931 33987 -9657 -41275 -36264 -14228
20294 -14228 -7895 36437 29216 5069 7040 -31392 -43608 -24901 -16356 38308 104288 123619
20282A23619J6450j5985l3308k123m0217J495Q950o7463p1389j888L6750Q4717
20270C9608N713j1986k603k826L6338k7806m0256j7889m1487o138j7254L3958
20258e2628Q6953L80m403k798n0106m0978k998n592K8639P5175l2585l3521j1908
20245d6370L1493O3182J9133l3410q169J3425K7726L125O002o7422k0765J9532
20233G482K414j0692L3293R595o040L642j4398n338k9218N4713K0026q7956j4378
20220c6855N8822N1952J1780o138r2345j7308J8578n3890J9335O7823M8425Q748
20208G8927K1743r178p1753j0535N9133Q644l6865j1958J5032N654r623j4525
20196B4696J1567K0277K8672n3279k5154M522Q926J246l7398J3472N279K0769
$$ plain form
20282 123619 140069 124084 90776 88653 48436 49931 58881 -8582 -79971 -81859 -45109 39608
20270 39608 45321 33335 30732 27906 64244 36438 -3818 -21707 -63194 -69332 -86586 -52628
20258 -52628 34325 34705 30302 27504 -22602 -63580 -66578 -72170 -43531 31644 -941 -34462 -46370
20245 -46370 -14877 48305 67438 34028 25859 39284 67010 70135 76137 8715 -12050 7482
20233 7482 9896 -796 32497 42092 36052 39694 25296 19958 -9260 45453 65479 -22477 -36855
20220 -36855 21967 73919 85699 79561 -12784 -30092 -11514 -65404 -46069 21754 70179 78927
20208 78927 100670 91492 19739 9204 68337 76981 40116 28158 43190 48844 39221 24696
20196 24696 36263 56540 85212 31933 6779 11301 20227 21473 -15925 -2453 2826 23595
20184B3595j2029j5836L0788L1215m2061n3871j0930k5987J2840J4917m2217j1232
20172a00808L4205m545N0259M0728j8508m195p074J1794M7711O617K2610k212
20160G6582j9262j2454j0663m8431N732l982N035k6649K9755J4691k810O460L6194
20147E0198j176k0454j2606N5771k2612o2718j7281J88M6774N0582J8832k403
20135H3095k0800k2902l6719L479K4083N4358m2429m2479k310K8840N0655O6481
20123A43352j2615o9012m1042m1176k5704N1201K5803N8747k0929o5991n9113
20112e6479O9526N9790N1937K216o6092n9486m7987P257j9426n581l1112K9571
20100f5866K4470J3630M1003M1359q217o8220Q454L0302L248K2229j3001m7680
$$ plain form
20184 23595 11566 -4270 26518 57733 15672 -38199 -49129 -75116 -62276 -47359 -89576 -100808
20172 -100808 -66603 -71148 -20889 19839 1331 -2864 -9938 1856 49567 56184 78794 76582
20160 76582 57320 44866 34203 -14228 -8496 -12478 -7443 -34092 -4337 10354 7544 14004 50198
20147 50198 49022 28568 15962 71733 49121 -13597 -30878 -30690 16084 66666 85498 83095
20135 83095 62295 39393 2674 6153 30236 84594 42165 -314 -2624 26216 76871 143352
20123 143352 130737 61725 20683 -20493 -46197 5004 30807 89554 68625 2634 -56479
20112 -56479 13047 72837 124774 126990 60898 1412 -46575 -39318 -58744 -64325 -95437 -65866
20100 -65866 -41396 -27766 13237 54596 46379 -21841 -13387 16915 20163 42392 29391 -18289
20088a8289J348L7098k9979k8254L5134q126J9461K1331l4569k3125P334n999
20076b6635m183j8592K8860N0714J8565k450o8048m3943P7370O3877m6474k015
20064B7046N555n4150q791K2906L1223q063j6160J6150M7165q1677l2047j5361
20052f6204M376K3715j010P129l3976k2069J0605K6461N0610p344K0922K5828
20040C9043k4372J5976k806j0034m2726p822K983L0925J7162L8676l8715J55O6245
20027H4690N754k5889n1806K8785N0492k450j4229l3988n1288j6758K296J0048
20015a4343K710J1610m2305n5795J1352O8093L1931L5724q592m4458K9627K5874
20003E1428p956K0217J7938q021l0085k8172j8924K3194N6750N888j0673r007
$$ plain form
20088 -18289 -16941 20157 -9822 -38076 -2942 -11068 8393 29724 -4845 -27970 -20636 -26635
20076 -26635 -30818 -49410 -20550 30164 48729 46279 -21769 -65712 11658 75535 29061 27046
20064 27046 32601 -21549 -30340 -7434 23789 15726 -434 15716 62881 -18796 -50843 -66204
20052 -66204 -61828 -38113 -39123 -31994 -65970 -88039 -77434 -50973 -363 -7707 13215 39043
20040 39043 14671 30647 27841 17807 -24919 -32741 -29758 1167 18329 57005 18290 18445 84690
20027 84690 90444 64555 12749 41534 92026 89576 75347 41359 -9929 -26687 -24391 -14343
20015 -14343 -11633 -23 -42328 -98123 -86771 -18678 13253 48977 40385 -4073 25554 51428
20003 51428 43472 63689 81627 73606 43521 15349 -3575 19619 76369 82257 71584 62577
19991F2577N1970K4501j8177l6756m931N989m3157l177K428J3708l2772K223P2860
19978I7286P9451j5058o4500m9894l2323k4302M10L7069M7271L2542p7764n3381
19966b3193j4715j4316k5338j442O2678N3758O202n7637j3954k2435j386r237
19954f1015K1618O173l0787L0205N8921j1529j7423j9873Q721n557J1336M1992
19942C2782O4102n760n1322J4517Q009l2673l2286K1111k2790N528L6011l9645
19930b416m2522j6270L0370P4619m2819K1597K0313j4660n6608K9608P2155K4954
19918I8321n334j5542o877l8972j0985p240j847K34j0534L3036Q322P610k9866
19905B0326l6794J323j2840j8167M0259n1558O5228M7260j0862j1298j3927J7147
$$ plain form
19991 62577 114547 139048 120871 84115 79184 85173 42016 38839 41267 54975 22203 24426 97286
19978 97286 176737 161679 97179 47285 14962 -9340 -8930 28139 75410 107952 30188 -23193
19966 -23193 -37908 -52224 -77562 -79004 -16326 37432 43634 -14003 -27957 -50392 -51778 -61015
19954 -61015 -39397 -33224 -64011 -33806 25115 13586 -3837 -23710 -14989 -20546 -9210 32782
19942 32782 96884 91124 39802 54319 62328 29655 -2631 18480 -4310 1218 37229 -2416
19930 -2416 -44938 -61208 -30838 43781 962 22559 42872 28212 -28396 1212 73367 98321
19918 98321 92987 77445 70568 31596 20611 13371 11524 11758 1224 34260 42582 50192 20326
19905 20326 -16468 -15145 -27985 -46152 -5893 -57451 7777 55037 44175 32877 18950 36097
19893C6097K5321K9616k398m7085n953K3649J850L1301k3255k5927M0065j5563
19881F7718l3314J2439M8151J2263m2788o8871K1244L8914k6135r909J8261K0957
19869E8930k4123p4631j8090O4264M9985k9578m0488K3316L2895m2635K0292K7302
19857D7439J6200L3084k8531n7533r905L10Q352J7030k1186k4517M111K5686m5466
19844c4926j4783K60M101L4373O8653l304q1293o0012N4429o479O2903M4304l4276
19831C3950k9464L1035K3175p448P767l0709r934R798q083R369O2638J7980m7342
19818F2732o8922j4819K303L8552P926k1625K4498K4972k8347L269M505p1538
19806c6494Q173L2074J7093m704j0273k6270M9260l8535P667P004J6808j3150
$$ plain form
19893 36097 61418 91034 88636 41551 35598 59247 61097 92398 69143 43216 83281 67718
19881 67718 34404 46843 94994 107257 64469 -4402 16842 55756 29621 19712 37973 58930
19869 58930 34807 -39824 -57914 6350 56335 26757 -13731 9585 42480 -155 20137 47439
19857 47439 63639 96723 68192 10659 754 1064 9416 26446 5260 -19257 -15146 10540 -34926
19844 -34926 -49709 -49449 -45348 -10975 57678 54374 -26919 -86931 -32502 -38981 23922 68226 33950
19831 33950 4486 35521 58696 51248 59015 28306 18372 28170 20087 29456 92094 110074 62732
19818 62732 -6190 -21009 -18706 19846 27772 6147 30645 55617 27270 30539 35044 -36494
19806 -36494 -28321 3753 20846 16142 5869 -20401 28859 -9676 -2009 4995 21803 8653
19794H653j8105k3189K0580O6720J8231m3891J1897j7792k4700l7492N8455L2420
19782E1787k9980k4908L2958K2289J4609k9669n4075k7443q28n4254J8222p456
19770h8748RK4598L6842J15452j5116m7896j5757O684k8233J4289J9579k6846
19758e143J2510J0779J1709j4736j8289j6484R892J2265K8151m6884j5952K9615
19746b567K4962j8M460N6880J4821m6157k2166j4409R786j0243j9076k5834M8452
19733A8891j484k4725K1199R816j0382k2542J6807M4828J9003j0353J3224j2241
19721F2041l7927l4787k0356k4792L2413O305p419k8682J4841N4258P287k371
19709B0811m261o1755J2845N1788J4713n251J8434k8845O994M4057M7068k7684
$$ plain form
19794 8653 -9452 -32641 -12061 54659 72890 28999 40896 23104 -1596 -39088 19367 51787
19782 51787 21807 -3101 29857 52146 66755 37086 -16989 -44432 -45260 -99514 -81292 -88748
19770 -88748 -88739 -64141 -27299 88153 73037 25141 9384 16068 -12165 2124 21703 -5143
19758 -5143 7367 18146 29855 15119 -3170 -19654 -9762 2503 30654 -16230 -32182 -2567
19746 -2567 22395 22377 26837 83717 98538 52381 30215 15806 25592 15349 -3727 -29561 18891
19733 18891 17407 -7318 13881 23697 13315 -9227 7580 52408 71411 61058 74282 62041
19721 62041 24114 -10673 -31029 -55821 -23408 -17103 -24522 -53204 -38363 15895 23182 20811
19709 20811 16550 -45205 -32360 19428 34141 28890 47324 18479 25473 69530 116598 88914
19697H8914j3179m0416r374L7168k6218j3502n315j5920n1815L7996P415n7267
19685f1513m1368k7448O8042N2128N327k2354M080K7083n124K1397j218j2086
19673F946j8128P933j8659L4760L4227J5984R400j355l2776l9196K9409j086J0910
19660C8369P960m0450n9562J2669Q098J4762r761m219j7666K6737N8578P9621
19648A15136J0630m27r395l2129m9322m2944k1529O5677j1586j8175l3268J6757
19636a0575K0739J7398J8256l508J3714l3196L697j4755J1459L7977J7652m3404
19624C5454m4537j5210K1123J6437j7232l90L4405j7850n3356l0192J7677M9662
19612d009N0906j969o9550K7563r376l9785J711O9145N2701m3795L8086L2877
$$ plain form
19697 88914 75735 35319 25945 63113 36895 23393 18078 2158 -49657 -11661 -4246 -61513
19685 -61513 -102881 -130329 -62287 -10159 -4832 -27186 -23106 3977 -1147 20250 19032 6946
19673 6946 -11182 -3249 -21908 12852 47079 63063 72463 71108 38332 -864 28545 27459 38369
19660 38369 46329 5879 -53683 -41014 -32916 -18154 -27915 -32134 -49800 -23063 35515 115136
19648 115136 125766 125339 115944 83815 34493 -8451 -29980 35697 24111 5936 -27332 -10575
19636 -10575 10164 27562 45818 42310 56024 22828 26525 11770 23229 61206 78858 35454
19624 35454 -9083 -24293 -3170 13267 -3965 -4355 30050 12200 -41156 -71348 -53671 -4009
19612 -4009 46897 44928 -24622 2941 -6435 -46220 -44509 24636 77337 33542 71628 104505
19600A04505m0461l2237M6564L6713m1566J9438l470n9028p127j8054m505K6301
19588B7073M1051K0355k0269k0176j0389J1619k1910k7654K0737L5293N8383m9558
19576F4555p9039k866j3323K3947Q6521J9036k8567k5449j0428j5738L5205L4119
19564H7973Q13o57K001l0846n2670l1203J6442K2405O239l9223m3761L0352Q0427
19551D8292L9008q520k5430K6212j7818q1192j6940L8232O4923k4645j0120K7475
19539E9477K0069M982m2795k3262M2838J1219m263J5031k713m4474K9094k565
19527F2638K9553K7853p3656l0361L1336k9205M763M6792K6404J6039l8558l8833
19515C4765j4982L0680L4399J7393j4834J2095J921J2559l8225l4512L9967o0555
$$ plain form
19600 104505 64044 31807 78371 115084 73518 92956 89486 30458 23331 5277 772 27073
19588 27073 68124 88479 68210 48034 37645 49264 27354 -300 20437 55730 114113 64555
19576 64555 -14484 -17350 -30673 -6726 79795 98831 70264 44815 34387 18649 53854 87973
19564 87973 88786 88129 90130 59284 6614 -24589 -8147 14258 20497 -18726 -62487 -32135 48292
19551 48292 87300 78780 53350 79562 61744 -19448 -36388 1844 66767 42122 32002 59477
19539 59477 79546 84528 41733 18471 61309 72528 68265 83296 80583 36109 65203 62638
19527 62638 92191 120044 46388 16027 47363 18158 22921 69713 96117 112156 73598 34765
19515 34765 19783 50463 84862 102255 87421 99516 101437 113996 75771 41259 81226 20671
19503B0671J7191j307O89K5949J1639m7411n7163m519K8097K4706K9048k7718
19491A9872l5521K7181J3768L410K2626j0369M6798J9159j8458j8687j4059L7974
19479I3694N0744M539r993j6306m6543M246J0213p6166K5117O620o7027m990O0669
19466C4817j7609k4574J5082K6654J4737M8775J1718j9483R989Q117M935K8050
19454A41208l5499m0997j6218K143N391J9525j7851K884J0222r333N4578j5330
19442A00723k555p8777k3310j8928O5664J1427q334N030K6843J4271J213j1358
19430H1909m8542j4085l2402Q654L6563j7864k7816k5584K1515O2203L9141o0400
19418B3292k1540N6873J03041Q650k0547p2298m9318k2597n553K0872M4751l8597
$$ plain form
19503 20671 37862 36555 37244 63193 74832 27421 -29742 -34261 -6164 18542 47590 19872
19491 19872 -15649 11532 25300 28710 51336 40967 87765 106924 88466 69779 55720 93694
19479 93694 144438 148977 138984 122678 76135 80381 90594 14428 39545 46165 -20862 -25852 34817
19466 34817 17208 -7366 7716 34370 49107 97882 109600 90117 100106 108223 113158 141208
19454 141208 105709 64712 48494 50637 56028 75553 57702 60586 70808 61475 116053 100723
19442 100723 98168 19391 -3919 -22847 42817 54244 45910 50940 77783 92054 93267 81909
19430 81909 33367 19282 -13120 -4466 32097 14233 -13583 -39167 -17652 44551 83692 23292
19418 23292 1752 58625 161666 170316 149769 77471 28153 5556 3 20875 65626 27029
19406B7029k5283k7198j1745J5880K2116L7665l7216j7657L3055L6102L2026j8276
19394F6498l6374K7699o800k8197l5747m3196K1392o77M1794O5111L0001L1663
19382A33167k0511p3577P689L8740m054p459N7154k9503N628J5169l6113j1392
19370G4938k2022r543K175k629p098j6171M3199M0879J9160l278L3589J2166l6971
19357A28394j0957o455m1545m9152j3266J0225L2454l9608j4868O4417J9587J4332
19345I3558N373n6481n4282k5039J6366K6025P085k9992L6873N8273J386J2064
19333I1209l0061k2536m1534j7831L3916j5425k2962N2904J03678L7841k0387
19322A48812l8449o5061O091O8960K4376p8061r2007o4108M6490L0569p164j5921
$$ plain form
19406 27029 1746 -25452 -37197 -21317 799 38464 1248 -16409 16646 52748 84774 66498
19394 66498 30124 57823 51023 22826 -12921 -56117 -34725 -35402 6392 71503 101504 133167
19382 133167 112656 39079 46768 85508 81454 73995 131149 101646 107274 122443 86330 74938
19370 74938 52916 43373 45548 42919 35821 19650 62849 103728 122888 119610 153199 165365 128394
19357 128394 117437 110982 69437 20285 7019 17244 49698 10090 -4778 59639 79226 93558
19345 93558 98931 42450 -11832 -36871 -20505 5520 12605 -17387 19486 77759 79145 91209
19333 91209 61148 38612 -2922 -20753 13163 -2262 -25224 27680 131358 169199 148812
19322 148812 110363 45302 51393 120353 144729 66668 -25339 -89447 -42957 -12388 -19552 -35473
19310c5473L7077O1798J4475K890l6515p4990k7328L6250k108K3241M0083J3509
19298E2909j1566k8113J0718O8002M1404k3500k5684j2076K2558N831l5580K379
19286F7282L7396n859K803l4488p936J4384L0893J3919J503j6129m2260k0004
19274D1504L5404p478n5556L1415M4279p658k5035k6513p859J761J9019L8451
19262H1734j3146n846k9280L588Q189L1726L9560J5804p1289l5744j1825p740
19250E731N8743o176m2048k267n321K6527Q508J3236M3906j2319m7469K7768L960
19237G2779n475K903l518k0551j709p900K6732J9702m9037n997K7289L0148l1616
19224E3750j4973j1J1095l8873K6734N4390j9378k6432J2762M4098K6047P5693
$$ plain form
19310 -35473 1604 63402 77877 80767 44252 -30738 -58066 -21816 -23924 -683 39400 52909
19298 52909 41343 13230 23948 91950 133354 109854 84170 72094 94652 100483 64903 67282
19286 67282 104678 98819 101622 67134 59198 73582 104475 118394 119897 103768 61508 41504
19274 41504 76908 69430 13874 45289 89568 81910 56875 30362 22503 24264 43283 81734
19262 81734 68588 62742 33462 37050 45239 76965 116525 132329 61040 25296 13471 5731
19250 5731 64474 58298 16250 13983 8662 35189 43697 56933 100839 88520 41051 68819 72779
19237 72779 67304 70207 66689 46138 44429 36529 63261 82963 33926 27929 55218 85366 53750
19224 53750 38777 38766 49861 10988 37722 92112 72734 46302 59064 103162 129209 204902
19212B04902P8499j0725p3798P884j8716m4522l1594M6751P2689P1715J1804m1109
19200B73780o7376m2396k3615J8628L6290N6082P8062o220p966n9328o7503m6439
19188A41999J1719K6713N2140Q9560K0284o0083p1107l5841j3935r34j0982l0952
19176A18581K2003j3730j7266K0615j2305p2723j9458K7208O89k0339l9047n892
19164a1664M0526J2740k3390K4751P761J8526l5480j0923O183j1529k3132J8735
19152A3104L9343p999K9755P5056L8098n2546k8389k6490Q1047k5903m1227O323
19140A00172J4397j1115p832j7497L9554Q1200J6962J2073r4540m8931n1208L5753
19128F8988J3623m9245m4216j826N2641J5282M1189R388j9421K8112J390n3743
$$ plain form
19212 204902 283401 272676 198878 206762 188046 143524 111930 158681 231370 303085 314889 273780
19200 273780 206404 164008 140393 159021 195311 251393 329455 323235 315269 255941 188438 141999
19188 141999 153718 180431 232571 322131 342415 282332 211225 175384 161449 160515 149533 118581
19176 118581 140584 126854 109588 130203 117898 45175 25717 52925 53614 33275 -5772 -11664
19164 -11664 28862 41602 18212 42963 50724 69250 33770 22847 29030 17501 -5631 13104
19152 13104 52447 44448 74203 149259 187357 134811 106422 79932 160979 135076 93849 100172
19140 100172 114569 103454 95622 78125 117679 198879 215841 227914 133374 84443 33235 68988
19128 68988 82611 33366 -10850 -12676 39965 55247 96436 105824 86403 114515 115905 62162
19116F2162K2431K1004k4948l8552n555L7261K0840K4398j5895m6889k151k1195
19104C2911j7191Q3714j2993n8550K8926Q9484K6156o1084k4116p678J6057J1135
19092A06771O6627k0217p9277j3056O9842L4617Q660l5007k1414K7288J653K308
19080A48795r760J8934K3915m1487l5557k5123n979J8714j5262J0292J5160m032
19068I8610L1099M1864l3049j5664J3653R328j5473j2017l8883j1917M3535j1935
19056I9151m5438N650o495J0990M8589n027k7358L6887N2742k8095n1333n8126
19044C2137K3489K919L6002j5427l6362k9011M7869J02393K9137o3107o8663o2122
19032g46J8024r733j9826J8165N8095M0270j8046k825J2219k9039m2868j0284
$$ plain form
19116 62162 84593 105597 80649 42097 36542 73803 94643 119041 103146 56257 54106 32911
19104 32911 15720 99434 86441 27891 56817 146301 172457 111373 87257 79579 95636 106771
19092 106771 173398 153181 73904 60848 130690 165307 173967 138960 117546 144834 146487 148795
19080 148795 139035 157969 181884 140397 104840 79717 73738 92452 77190 87482 102642 98610
19068 98610 129709 171573 138524 122860 136513 145841 130368 118351 79468 67551 111086 99151
19056 99151 53713 59363 52868 63858 112447 107420 80062 116949 169691 141596 90263 32137
19044 32137 55626 58545 94547 79120 42758 13747 61616 164009 193146 130039 61376 -746
19032 -746 17278 7545 -12281 5884 63979 104249 86203 83378 95597 66558 23690 13406
19020A3406j1004K5939M4617k5199l4554k7996n6N7453k4786L5488K8954J0615
19008I2877L5363J1942J6103K8472p616o5483l6241K9025J6201l3771l4563J7468
18996F9777J365l7987L590K3832j0346J2373O290P962M036j440K2662l8567L4667
18983I8214J2383l8179j7094L494O3937k8517l8313R86K9104N9984k281j5309
18971A28409Q210Q125k5235o4167j4543R869J1935j3655k8255J9368L9869j8191
18959F1739N149r500Q605L9970R141j2874N5734j8509p737N4006R547p8958k2773
18946I3540Q127J548K7296Q978J2288J0518k288j6641K8994j8450l8956q381j0692
18933I5881m1693O45J7511J9570K2049q547j5460r300j7082o167j9626Q485N1559
$$ plain form
19020 13406 2402 28341 72958 47759 13205 -14791 -14847 42606 17820 53308 82262 92877
19008 92877 128240 140182 156285 184757 177141 111658 75417 104442 120643 86872 52309 69777
18996 69777 71142 33155 36745 60577 50231 62604 68894 76856 80892 79452 102114 63547 98214
18983 98214 110597 72418 55324 58818 122755 94238 55925 56911 86015 145999 143718 128409
18971 128409 136619 144744 119509 55342 40799 50668 62603 48948 20693 40061 79930 61739
18959 61739 66888 57388 65993 105963 115104 102230 157964 139455 131718 185724 195271 116313 93540
18946 93540 101667 103215 130511 139489 151777 162295 160007 143366 172360 153910 114954 106573 95881
18933 95881 54188 54833 72344 91914 113963 105416 89956 80656 63574 57407 37781 46266 97825
18920I7825K0673K7228m1766o2771l7555L9832K4784K2481k968o6397j1927R3645
18908A03084m7774j5206k802j5291M5818J7561r164j2393L6000L4401L792o5711
18896G2315p067k3307J7607J7578m0827J0059N1776O4572J4002K3908k6980j0302
18884A63334l0833p6950j5482K2059O6861J551l2733j2837K068K1739n592l572
18872I9613m3258L0861J8081K4185K241j3980O667l9457p243L0684N5598L2642
18860A96634q405o5504K0870m6702j10301R748N830K4529K4250O2438J1837l0338
18848I4886P211Q3470J4766p734l7740l9350J7086j3388M886q163r293M1343K019
18835A49999j046K6306p9221l5873J5557J9870J5674k7381l7839M4695k0590j6388
$$ plain form
18920 97825 118498 145726 103960 41189 3634 43466 68250 90731 87763 21366 9439 103084
18908 103084 55310 40104 37302 22011 67829 85390 76226 63833 99833 134234 138026 72315
18896 72315 65248 41941 59548 77126 36299 46358 98134 162706 176708 200616 173636 163334
18884 163334 132501 55551 40069 62128 128989 130540 97807 84970 87038 108777 103185 99613
18872 99613 56355 87216 105297 129482 131723 117743 124410 84953 77710 108394 163992 196634
18860 196634 188229 122725 143595 96893 -13408 -3660 2170 26699 50949 113387 125224 94886
18848 94886 102097 185567 200333 192599 154859 115509 132595 119207 124093 115930 106637 147980 149999
18835 149999 148953 175259 96038 60165 75722 95592 111266 83885 46046 90741 70151 53763
18823E3763j4453L2968Q3207M5249l9319L0586O567k6617m5902k5678k8998o510
18811F4863K6341L0212N6677K3289j9716l482M677l7295l5591j1475n465K8648
18799A21683j93K0016j7316J6441R195k7532o9014M256R851K05p75P7295m415
18786A39697l4718n2135O660j9740M7400P975K1862M652j1486K8638J9451j661
18774A56595l6310L266P0600K9588L9625M2266K7965J20749J07903q433j2107
18763E41707n1129j08144j04145n4805q7445m9870K7775J2550O041O0781j4776
18752A78540K8452j2186o5581r206N704K4936L1666l8826l9232J5156o073L6536
18740A49886N033k677J4191l4144L8313l6715o723Q526n599K6901L3733K1260
$$ plain form
18823 53763 39310 72278 155485 200734 161415 192001 198568 171951 126049 100371 71373 64863
18811 64863 91204 121416 178093 201382 181666 178184 182861 145566 109975 98500 93035 121683
18799 121683 121490 141506 124190 140631 149826 122294 53280 57536 67387 67592 66817 144112 139697
18786 139697 104979 52844 59504 39764 87164 95139 117001 121653 110167 138805 158256 156595
18774 156595 120285 123551 194151 223739 263364 305630 333595 454344 562247 553814 541707
18763 541707 490578 382434 278289 223484 136039 86169 113944 126494 132535 193316 178540
18752 178540 206992 194806 129225 120019 125723 150659 182325 143499 104267 119423 113350 149886
18740 149886 154919 152242 166433 132289 170602 133887 127164 135690 130091 156992 190725 211985
18728B11985L766l3058K2255O1343N4268O7431P4765L0349O7137J77543L86236
18717A124020N18668K76946q7189k47652l66726l27106j90679j17362q9144j07506
18707C86270l3210o057Q747K7533M1379K0827M3052J27200J43338L34277M36733
18696A530089M19463J57046j20321k97366l67847l07332j39204r4532j3449J48126
18686I14673K88454M44540L44149K4553k21626l37146l40010k76836j95258r8868
18676E46625p7984n4442o6277o834J0191J159M0182Q2103Q3249J39777K49989
18665I47738L92944M98931L34741j09065l52806l20528l59538k98910j94834q1572
18655D57101n5798n4975P946j286n0822j0148j04157j6482j7169Q964m5655O188
$$ plain form
18728 211985 215751 182693 204948 266291 320559 387990 462755 493104 560241 737784 1124020
18717 1124020 1642688 1919634 1832445 1584793 1218067 890961 700282 582920 493776 386270
18707 386270 353060 347003 355750 383283 424662 445489 488541 615741 759079 1093356 1530089
18696 1530089 1949552 2106598 1986277 1688911 1321064 1013732 874528 779996 766547 914673
18686 914673 1203127 1647667 1991816 2016369 1794743 1457597 1117587 840751 645493 546625
18676 546625 468641 414199 347922 341088 351279 352438 392620 474723 557972 697749 947738
18665 947738 1340682 1839613 2174354 2065289 1712483 1391955 1032417 733507 538673 457101
18655 457101 401303 346328 354274 352988 302166 292018 187861 171379 154210 163174 117519 123707
18643A23707M6548L3282R833l6836k8258J4258j9239o4850M9776m3799K4293M3182
18631A51897j3432j3124L5197J3132K3438J2389L9419O129j2681j9007l2286M9180
18619B40251J5853k4846l2266m885J8286K6352Q8454J5176r798n261K6786n248
18607C48854l578m0497m9052j6926N0293J4923k3828k6600Q98r887J2133m9298
18595B07435p177j0540Q5582j465m6798l1177j267K6776K2629O592l4691P642
18583B23541k9613j7103j0459p851M488M590L2264j3383k1007l1214K6720M6850
18571B07823N2098P322L979k0136o844m5504J8968J8383M8732J8433K8580m9981
18559B81853k3755L692l1987k2706r626p9407n807N5521J7189j0042m9215K4536
$$ plain form
18643 123707 170255 203537 213370 176534 148276 162534 143295 78445 128221 84422 108715 151897
18631 151897 138465 125341 160538 173670 197108 209497 248916 255045 242364 223357 191071 240251
18619 240251 256104 231258 198992 194107 212393 238745 327199 342375 332577 327316 354102 348854
18607 348854 345276 304779 255727 238801 289094 304017 280189 253589 254487 244600 256733 207435
18595 207435 200258 189718 275300 273835 227037 195860 194593 221369 243998 250590 215899 223541
18583 223541 193928 176825 166366 158515 163003 167593 199857 186474 165467 134253 160973 207823
18571 207823 259921 267243 271222 251086 244242 198738 217706 236089 284821 303254 331834 281853
18559 281853 258098 261790 229803 207097 197471 118064 112257 167778 184967 174925 125710 150246
18547A50246O1732k389Q210o949Q114k6850M7086N711r40m4359N317m227K4138
18534B24840J2914j1470R233j0037j2437k1095k0131M5188M1612q762m2838J7313
18522B24330P1303J5762k1611m926K9072j4536j6004o906j6013L2719l3247l3550
18510B26393O0708M7849l297j3197K0494m9550N401K6590J9520m1619l9180n084
18498B55028K413J4070j7320l8097p862l653m6245M497K7900j7880J4101N0447
18486B37399j0178k9205O715O808R794J7336J5609O783L635N3000k3297k4641
18474B69758J2660K9614M761K5522k4793M0557J830k7277L6556R032j9465J0655
18462C69410m7300R170n221m7044K7351Q868M90M1466l0214l8369L1800K073J2937
$$ plain form
18547 150246 211978 209589 217799 210850 218964 192114 239200 244911 243971 199612 204929 200702 224840
18534 224840 237754 226284 235517 225480 213043 191948 171817 217005 258617 249855 207017 224330
18522 224330 295633 311395 289784 284858 313930 299394 283390 276484 260471 293190 259943 226393
18510 226393 287101 334950 331653 318456 338950 289400 294801 321391 340911 299292 260112 255028
18498 255028 257441 271511 254191 216094 208232 204579 158334 162831 190731 172851 186952 237399
18486 237399 227221 198016 204731 211539 221333 238669 254278 261061 264696 317696 294399 269758
18474 269758 282418 312032 316793 342315 317522 358079 359909 332632 369188 378220 358755 369410
18462 369410 322110 331280 326059 279015 306366 315234 315724 357190 326976 288607 320407 322480 335417
18449C35417n4194l1191N297j0726j4696J6678k6184j3114n1948J2934K9536J2390
18437B10199Q5454J7697K96j7390M692J2451n1371n5367L3741J0792j0700n0995
18425A89499L1482L8122J0584O4298l9665l4241l627L871Q623K3673J1623O343
18413C10585l9816k3121N0448P6552P5129p650p7871m603J3798J0470K0057K602
18401D06580j1525l0190M2081j2338l4566m1590J3169J5178Q1398N5279m1732
18390D41744k0584L0920Q617q0554m4621R861k2783N1702O3071M8830O3922O1072
18378F11197M9434K9949K936n0982q5440o6947K0243l3565n3013j2202K4626k1072
18366D15164Q297k2204J388M3314R8562P0209M1955J34319M4402p8756q1317o7409
$$ plain form
18449 335417 281223 250032 255329 244603 229907 246585 220401 207287 155339 168273 197809 210199
18437 210199 295653 313350 313646 296256 300948 313399 262028 206661 240402 251194 240494 189499
18425 189499 220981 259103 269687 333985 294320 260079 256452 260323 268946 292619 304242 310585
18413 310585 270769 247648 298096 374648 449777 442127 364256 359653 373451 383921 403978 406580
18401 406580 395055 364865 406946 394608 360042 318452 331621 346799 428197 483476 441744
18390 441744 421160 452080 460697 380143 335522 345383 322600 374302 437373 486203 550125 611197
18378 611197 660631 690580 693516 642534 557094 490147 510390 476825 423812 411610 436236 415164
18366 415164 423461 401257 402645 445959 544521 614730 656685 791004 835406 756650 675333 607924
18354F07924o1042l5342M811n3269m1311L5403N9789J7544n5834n7954p809k7136
18342C85774j2008L5061K4624m8248m4773M381R806J23806O4184M0203m678j4662
18330E63470p162J4015k2617M2470P6512K920N844q181k1316r2503l1633J5851
18318E37670l6067m2455m2903M2515l7437n208P669M2577M5822N4590j0742J5934
18306E71965n4042j2638J4877l8944N868M0999k637n5936K660L832q986m3276
18294D23742o0701l2464J475M7835j2045K271N7230p363k8172L4991j5839j7035
18282C93925n7402k6850P960k9295L7519Q0387O4856K3203j6416N3764k72Q747
18270E40126l6977o0631o0671J6973L4642Q227J1731J3577j4491j15978m0011
$$ plain form
18354 607924 546882 511540 516351 463082 421771 457174 516963 534507 478673 420719 412910 385774
18342 385774 373766 408827 433451 385203 340430 344811 354617 478423 542607 582810 578132 563470
18330 563470 556308 570323 547706 590176 666688 669608 675452 667271 645955 553452 521819 537670
18318 537670 501603 459148 416245 458760 421323 416115 423784 466361 512183 566773 556031 571965
18306 571965 517923 505285 520162 481218 487086 528085 525448 469512 472172 476004 467018 423742
18294 423742 363041 330577 332052 379887 367842 370113 427343 419980 391808 426799 410960 393925
18282 393925 336523 309673 317633 288338 325857 406244 471100 494303 477887 531651 531379 540126
18270 540126 503149 442518 381847 398820 433462 441689 453420 466997 452506 336528 296517
18259B96517L5768L6051O6234P0641N5788O4728J05653L4118k1300n6863m0677
18248F46658l7026j40K5572Q018L7735J5992K3942k587K615j6749O0730P8135
18236H42895N4653l5506q544K7070K4457j4800L0670k5226q1065j8719L3761N1193
18224H80839K5483K5201K9842J16889R9057O1520O8151M0840M728o3855m3582
18213A245113m1123q374M7975P4534L5426j7414o383r21l4421o0143o3982O8779
18201A239066J00824J09677J19165J19873R678n4422m9791q2690k0247M9634O3540
18190A604307k7138M4200N4225k345R9189J46148Q3550O5044J04146J04893K24253
18179B500472L24780M10276M60258M92495L68975J80630J97824L11419M29914
$$ plain form
18259 296517 332285 368336 434570 505211 560999 625727 731380 765498 744198 687335 646658
18248 646658 609632 609492 635064 643082 680817 696809 720751 718164 720779 704030 764760 842895
18236 842895 897548 862042 853498 880568 905025 890225 920895 895669 814604 795885 829646 880839
18224 880839 906322 931523 961365 1078254 1177311 1238831 1306982 1347822 1352550 1288695 1245113
18213 1245113 1203990 1195616 1243591 1318125 1353551 1336137 1329754 1328833 1294412 1234269 1170287 1239066
18201 1239066 1339890 1449567 1568732 1688605 1698283 1643861 1594070 1511380 1491133 1540767 1604307
18190 1604307 1577169 1621369 1675594 1673249 1772438 1918586 2002136 2067180 2171326 2276219 2500472
18179 2500472 2825252 3235528 3695786 4188281 4557256 4737886 4935710 5247129 5677043
18170E677043N27389O08761O77634P42041N64618L2863n57749o97480o28532l57009
18160F589579k21878j24857l9136Q1032J70446O9324Q440J32973M12542Q29052
18150G907517J040190P75618M50905L00793K90630L77114L96774N33552R48382
18141A3021475J420919J580717J332788J313950J658929K223276L166377L979979
18133B9698410M348531N094519P535422J2335339K1266561L8355098O6251404
18126A84885284Q4898206N2385992q291655m1979955n7161286n6287494m2836820
18119A15612272k7965435j6750388r527579m737926r35759K430958N381525Q469569
18111G1977237J3748071K4120455L9972578N3144575N8543313P1659250O6903862
$$ plain form
18170 5677043 6204432 6813193 7490827 8232868 8797486 8830349 8272600 7575120 6946588 6589579
18160 6589579 6367701 6242844 6203708 6284740 6455186 6524510 6532950 6665923 7078465 7907517
18150 7907517 8947707 9723325 10174230 10475023 10765653 11142767 11539541 12073093 13021475
18141 13021475 14442394 16023111 17355899 18669849 20328778 22552054 25718431 29698410
18133 29698410 34046941 39141460 46676882 59012221 80278782 118633880 184885284
18126 184885284 269783490 322169482 313877827 271897872 214736586 158449092 115612272
18119 115612272 87646837 70896449 61368870 56630944 55695185 58126143 63507668 71977237
18111 71977237 85725308 109845763 149818341 202962916 261506229 333165479 400069341
18104D00069341R835644m4440259o5803252p0909946n9050258l7779648j6914473
18097A15007149K347434K4160874N5310419Q5884719P0441715N977474m1115345
18090C18014439o2364780o6302795n4242852l6884941k2650365j3519602q206225
18083E3842879m411236j422057J131058L597997O530359J0612662J6434032K6612509
18075A12928203M6682097P9267793R6922874N2392505j8944561n6983459p3668596
18068B38596856p0736718n3282013l4861836k1601403j4165784r895302o996761
18061B7057039m905751l360138k436389j654310j097865q86270q40678o14353
18053A1261285o85594r98016j048610r48506p55081n64204l64045j03509K34317
$$ plain form
18104 400069341 409904985 365464726 299661474 228751528 169701270 131921622 115007149
18097 115007149 117354583 141515457 196825876 282710595 353152310 359129784 318014439
18090 318014439 255649659 189346864 135104012 98219071 75568706 62049104 53842879
18083 53842879 49431643 48009586 49140644 52738641 59269000 69881662 86315694 112928203
18075 112928203 159610300 238878093 335800967 388193472 369248911 312265452 238596856
18068 238596856 167860138 114578125 79716289 58114886 43949102 34053800 27057039
18061 27057039 22151288 18791150 16354761 14700451 13602586 12716316 11875638 11261285
18053 11261285 10575691 9577675 8529065 7580559 6825478 6261274 5897229 5793720 6028037
18044F028037K99204L3325l55562m16973l69173l42049n7517K39255N55648Q17380
18034F431575P48465L11772k32062n89726p26661o53956l76124r1402Q9336K48854
18024E160071M14641O32215P14651P23803Q91275J122635J237655J380637J728422
18015A4006005J871171J754271J760267K059712J958003J221428N28253K86295
18007B5445405J89079l0299m30261p95424r71457j196461j662503k160274k369235
17998A6018570k303147k076484j819968j508668j110119p78612o09265l77976
17990E434331k50433j76075k17370j85690j82942j65301j09336P990M0042Q6222
17980D281438J91824L47325M54103M08691L49558M24227O00245O37645N98676
$$ plain form
18044 6028037 6327241 6360566 6005004 5588031 5218858 4876809 4819292 5058547 5614195 6431575
18034 6431575 7180040 7491812 7259750 6670024 5943363 5289407 4913283 4821881 4911217 5160071
18024 5160071 5574712 6206927 6921578 7645381 8536656 9659291 10896946 12277583 14006005
18015 14006005 15877176 17631447 19391714 21451426 23409429 24630857 25159110 25445405
18007 25445405 25634484 25604185 25173924 24378500 23407043 22210582 20548079 18387805 16018570
17998 16018570 13715423 11638939 9818971 8310303 7200184 6421572 5812307 5434331
17990 5434331 5183898 5007823 4790453 4604763 4421821 4256520 4147184 4155174 4195216 4281438
17980 4281438 4473262 4820587 5274690 5683381 6032939 6457166 7057411 7695056 8293732
17971H293732O07683N55833N62946O12012N64254L46904K24013K50105K66893
17962A2284375J57660K7996j4787J3573J00583N2028k14426m82334n86442o80849
17952A0657377q95808j052059j067763j064105r75193q47666p42147o96516n73104
17943B743016m11989k33818j07593k4508P0476J09384P7476j103m3256o9005j27164
17932A981916j25370j17911j50614k0563q1458q0706j4364R3443R0719o500J0254
17921A578846J8537N8644Q1123J24728J30414J28776N1486J04716K7372M4976
17911B349618J4067m0940j12371j47408j72921j35425j22132m5895q7121j10478
17901A388994q7513n3105m5630q3031j37757r1885p3329n1448r0916r1227p4413
$$ plain form
17971 8293732 8901415 9457248 10020194 10632206 11196460 11543364 11767377 12017482 12284375
17962 12284375 12442035 12470031 12455244 12468817 12569400 12621428 12407002 11924668 11338226 10657377
17952 10657377 9761569 8709510 7641747 6577642 5602449 4754783 4012636 3316120 2743016
17943 2743016 2331027 2097209 1989616 1965108 2035584 2144968 2222444 2221341 2178085 2109080 1981916
17932 1981916 1856546 1738635 1588021 1567458 1486000 1405294 1390930 1484373 1575092 1568592 1578846
17921 1578846 1597383 1656027 1737150 1861878 1992292 2121068 2172554 2277270 2304642 2349618
17911 2349618 2363685 2322745 2210374 2062966 1890045 1754620 1632488 1586593 1499472 1388994
17901 1388994 1301481 1248376 1202746 1119715 981958 890073 816744 765296 674380 583153 508740
17890E08740K5511l5673N139R8172R7624j9887k6646l5399k4126l3308n8275j5677
17878D86195O3486J00229R4284k4390l1521j4639m1858r6132n6983L990l4296
17867D48365k6013n3235n3190K8032O2521K4056j1761J4004l5172K2859l876R924
17855D26514K1066J366L0895M3322K4117k5402o5912N471L164k6713k9216n1345
17843C57327N2823k131J6317L2301J0733J2209m20p3737J3657J02765N1647l859
17831E69632k6147J4402M306P527j3622k8880P6571O8551M9505j8324k0845j8600
17819F64076k4455j8250k7042J8637M5471P6594L6619M0334k0545r0137p8143
17808F23159l4715n7676l5441K3456M2173L8366k5868m1679k7223J7105m8491
$$ plain form
17890 508740 534251 498578 503717 601889 699513 679626 652980 617581 593455 560147 501872 486195
17878 486195 549681 649910 744194 719804 688283 673644 631786 535654 478671 482661 448365
17867 448365 422352 369117 315927 343959 406480 430536 418775 432779 397607 420466 416590 426514
17855 426514 447580 448946 479841 523163 547280 521878 455966 461437 464601 437888 408672 357327
17843 357327 410150 408019 424336 456637 467370 479579 479159 405422 419079 521844 573491 569632
17831 569632 543485 557887 562193 569720 556098 527218 603789 672340 721845 703521 682676 664076
17819 664076 639621 621371 594329 612966 658437 735031 771650 811984 791439 701302 623159
17808 623159 588444 530768 495327 518783 560956 599322 573454 531775 504552 521657 473166
17797D73166m1552j0615n0497p2670j6905L9692Q4150j0410n4925K0808O0783
17786D21025j4509o4773j8620M988L2137j994j5782J4444j030K9155L3592N8857
17774D77490j2231n569k6423l2440K7755j9187k175l0655J733p779M0894R8128
17762E09541J18303J00230j652K183j0122o1472o2854J1203M4473M4006L2756
17751G26595k9526p294J5022n4250j18429n9718j124r870K4588M4192R759l6874
17739E03071O67K0514m2088k0006j9019J3208M8538R6726K3754K0337K4473j2119
17727F58056o6603r2861o8388j6747O7792Q5029O1133Q5776J7908K6797l656m1104
17715G13132n5877m1724l4503R160P0932L251O3617M684j0333O4166J1224K5608
$$ plain form
17797 473166 431614 420999 370502 297832 280927 320619 404769 394359 339434 360242 421025
17786 421025 406516 341743 323123 328111 360248 358254 342472 356916 355886 385041 418633 477490
17774 477490 465259 459690 433267 400827 428582 409395 407220 376565 378298 370519 411413 509541
17762 509541 627844 728074 726422 728605 718483 657011 594157 605360 649833 693839 726595
17751 726595 697069 689775 704797 650547 532118 472400 471276 461406 485994 530186 539945 503071
17739 503071 503738 524252 482164 462158 443139 456347 504885 601611 625365 645702 670175 658056
17727 658056 591453 498592 430204 413457 481249 566278 627411 713187 731095 757892 754236 713132
17715 713132 657255 615531 581028 590188 661120 664371 727988 732672 722339 786505 797729 823337
17703H23337J3210J8286m554l6942O9101P8472K6042R026k1676l9447J2826Q4078
17691A031759j42k4667l4116j3738Q737Q5442N6027j59l4780j255O9963R177J0552
17678A162800k8900L3492Q8179J24803M5844n8620p7922m8679o7403l9478L9113
17667A173229M5763n3098p1688r3575p699J10409J35839Q5452N9942J5112k3067
17656A376619m7920l6914P9104Q8801R9535J20268Q0656L755m667L7855P8021
17645A875113K108Q3978J58271P5145j3932r374L258j09500q3018O2612Q2941
17634B127602K7382L1039M281L1903M7680M2084j9334J10407J33400N9861P204
17623B603509L433j5191P9542J27280J48823J32256J72853J40663P6514N7348
$$ plain form
17703 823337 836547 854833 850279 813337 882438 960910 986952 995978 974302 934855 947681 1031759
17691 1031759 1031617 1006950 972834 959096 967833 1053275 1109302 1109143 1074363 1073108 1143071 1152248 1162800
17678 1162800 1133900 1167392 1255571 1380374 1426218 1367598 1289676 1240997 1173594 1134116 1173229
17667 1173229 1218992 1165894 1094206 1000631 992932 1103341 1239180 1324632 1384574 1399686 1376619
17656 1376619 1328699 1291785 1370889 1459690 1559225 1679493 1760149 1763904 1759237 1797092 1875113
17645 1875113 1877221 1961199 2119470 2194615 2180683 2171309 2174567 2065067 1982049 2044661 2127602
17634 2127602 2154984 2186023 2190304 2222207 2269887 2311971 2292637 2403044 2536444 2596305 2603509
17623 2603509 2606942 2591751 2671293 2798573 2947396 3079652 3252505 3393168 3469682 3527030
17613C527030J06324J75909K86037L14490K46866K48523L46812L50774L93537
17604E996302O49059R20807J057635R87319P34932O49762O83555O20212N63723
17595A2863306P38692J081803J541704J905354K143560K460115K718063K837286
17587B8289883L145463M131042O019230R363695J4906576K4588171M2010802O8884116
17579B01338978Q3239306M8463769o840005l5249472m4636552l5244568q768834
17572B02302622K9467720P4415761R0131155L8118429k9606724o3035210p5551151
17565B66242602o7540426m6272479k4294983n160894J3873441L9143869O8286829
17558B44277959O8385425K0724854k3747542m2372368m4975943k9738867o92767
$$ plain form
17613 3527030 3633354 3809263 4095300 4409790 4656656 4905179 5251991 5602765 5996302
17604 5996302 6645361 7566168 8623803 9611122 10346054 10995816 11679371 12299583 12863306
17595 12863306 13601998 14683801 16225505 18130859 20274419 22734534 25452597 28289883
17587 28289883 31435346 35566388 41585618 50949313 65855889 90444060 132454862 201338978
17579 201338978 284578284 333042053 326202048 290952576 246316024 211071456 202302622
17572 202302622 231770342 306186103 396317258 434435687 404828963 341793753 266242602
17565 266242602 198702176 152429697 128134714 122973820 136847261 175991130 244277959
17558 244277959 312663384 333388238 309640696 267268328 222292385 192553518 191860751
17551A91860751L7850770P4564015O6299746M925185m4203243o6032027p0803538
17544A94461659n8955929m0838435k6007111j6582274j1275788p866935n581823
17537B7353364l926926k500569j301797m78958M8324M54957L41473j28264l81347
17528A9480257m91579o358M24363L95428K82500N32581R84849J342484J769836
17519B4714361K299778L082183L860957M672152N734790P942936J2255473K0220809
17511H4783439L5116246O2543683J00195000J04335885M0109516k7778031n8978001
17504C40327737o8510972n4040414k1541816J9330690N9689809O1838822J0241144
17497C47335000l6863853n8549635o4772142n5059145l8223577k3778860j3894779
$$ plain form
17551 191860751 229711521 304275536 370575282 375500467 331297224 265265197 194461659
17544 194461659 135505730 94667295 68660184 52077910 40802122 32935187 27353364
17537 27353364 23426438 20925869 19624072 19145114 19193438 19648395 19989868 19861604 19480257
17528 19480257 18988678 18982320 19406683 19802111 20084611 20617192 21602041 22944525 24714361
17519 24714361 27014139 30096322 33957279 38629431 44364221 52307157 64562630 84783439
17511 84783439 119899685 182443368 282638368 386974253 427083769 399305738 340327737
17504 340327737 271816765 217776351 196234535 215565225 275255034 337093856 347335000
17497 347335000 310471147 251921512 187149370 132090225 93866648 70087788 56193009
17490E6193009q134879n055609l124714j391016K09671J564371K632861L887236
17482D6780930N964126R589317J5342613K5879471M6031802P8158307R6619965
17475C24366531N5401966j2086261m6947071o0586935n3265421k7795921O675334
17468A85762222M5580815O2190461K5234912k6115903n0847200o0801111n5649077
17461A25355119m0505622k6005957j5798356r794598o530467m744467l513648
17454A8462004k479131j754218j388749j182159r77397q69525q29989o66012m50693
17445G864131j23385m2254j90726l38583m88379o30249o27292o11218n57846n00433
17435C753766l74199k03641n0700K9000J527l0190q5524j94787k62847k63091
$$ plain form
17490 56193009 48058130 43002521 39877807 38486791 38696462 40260833 42893694 46780930
17482 46780930 52745056 62334373 77676986 103556457 149588259 227746566 324366531
17475 324366531 379768497 367682236 320735165 260148230 206882809 179086888 185762222
17468 185762222 231343037 293533498 318768410 292652507 241805307 181004196 125355119
17461 125355119 84849497 58843540 43045184 33250586 26720119 21975652 18462004
17454 18462004 15982873 14228655 12839906 11657747 10680350 9810825 8980836 8314824 7864131
17445 7864131 7740746 7698492 7507766 7169183 6680804 6050555 5423263 4812045 4254199 3753766
17435 3753766 3379567 3175926 3125226 3154226 3155753 3125563 3040039 2845252 2582405 2319314
17425B319314j56443M96R6344m3415r8112o6315j37566j12426r9158j21214r4375
17414A487130j6739m696o381j2058m9840J4443N1076Q1983M5707n9306j28463
17403A402856j34803j24673j30740j18553j15568J614N4565O2694L0157R0249
17393A017798j2132p2073q2070m9662J9237K4197l1147l5438j0866K2453R1466
17382H81763J17636J12151Q033q2188j30862j35502k1970l1960L991J17553J61238
17371I99883J17209J2917j23476j16207j50411j30473p4909p0241j5691K1854
17361D70455J7001k0884l683R046Q218L7747K6653Q1773R0248J08082O5413N8380
17349I48449P0728n4334o5626o5056j02784q4942p529N8079J7702M0066n3344
$$ plain form
17425 2319314 2162871 2163367 2259711 2216296 2118184 2051869 1914303 1801877 1702719 1581505 1487130
17414 1487130 1470391 1465695 1459314 1447256 1397416 1411859 1462935 1544918 1590625 1531319 1402856
17403 1402856 1268053 1143380 1012640 894087 778519 780133 834698 897392 927549 1017798
17393 1017798 1005666 933593 851523 801861 821098 845295 814148 778710 767844 790297 881763
17382 881763 999399 1111550 1119583 1037395 906533 771031 749061 717101 721092 838645 999883
17371 999883 1117092 1130009 1006533 890326 739915 609442 534533 464292 448601 470455
17361 470455 487456 466572 462889 471935 480153 517900 544553 626326 716574 824656 890069 948449
17349 948449 1019177 964843 899217 834161 731377 646435 638906 696985 714687 754753 701409
17338G01409K7793o3440J8450R2591N5059r3465j09835r5419j06168m4477l9043
17327C43455j2968K5279l8690j4334j5380L232Q8229P7704M5426l781o0433j07378
17315C30361r0310l3086Q0987O7058L8236L4927j4478r7506p3600j9290l1760
17304A91539m9515J0486j5233J3833j4079K2235n2627j9984j4593j341Q49k8042
17292D3528K812M8508j4442L9414M4271r224J4908k0891l4185j397n5002j9791
17280C8509N3586K3903N6983M1253l9714l4474l4369n299N5040K8977k0305j6638
17268A47452m0437O384O5438k0505o616j123l3791K5406J2507j0783j01018k8083
17256A4831L181j805j9255K3286J4m8706N022K4007K2102J7764K613L3511L0066
$$ plain form
17338 701409 729202 665762 684212 776803 831862 738397 628562 533143 426975 382498 343455
17327 343455 330487 355766 317076 302742 287362 290594 378823 456527 501953 498172 437739 330361
17315 330361 240051 206965 287952 355010 393246 428173 413695 316189 242589 223299 191539
17304 191539 142024 152510 137277 151110 137031 159266 106639 86655 72062 70721 71570 43528
17292 43528 46340 94848 80406 119820 164091 154867 169775 148884 114699 113302 58300 38509
17280 38509 92095 115998 172981 214234 174520 140046 105677 100378 155418 184395 164090 147452
17268 147452 107015 113399 178837 158332 151716 150593 116802 142208 154715 143932 42914 14831
17256 14831 18012 16207 -3048 20238 20252 -28454 -23432 575 22677 40441 43054 76565 106631
17243A06631q3524k3626K6617l6859j7181k159N3796P7703K8033k4660j6940l0142
17231E7689m4987k2014m359M4860k734p668M0506M2515j048l8723J1737M9752
17219A25526K3332K2037k7281K8710N5452N4173O0541Q8776J40359K6463l0924
17208E67164j15504j49339n9432j2145O8676Q6219J14614N3913J6035k8497o3942
17197D77762p8147o441n4192r7398j5446m909j6064J0663J73628J55120N4900
17186E99476j7796j31755j36729o6042k8821k0692O9352P8413O1878K1361r3011
17175C35634j28698p5057m4368l3112o07m820K330l1359j9402j0085j9822K5879
17163c487R280N12k2093J9873K2612j8632L366k0277k4153J1080j8101m5466l5666
$$ plain form
17243 106631 23107 -519 26098 -10761 -27942 -30101 23695 101398 129431 104771 87831 57689
17231 57689 12702 -9312 -13671 31189 28455 20787 61293 103808 102760 64037 75774 125526
17219 125526 148858 170895 143614 172324 227776 281949 342490 431266 571625 598088 567164
17208 567164 451660 302321 242889 230744 299420 385639 500253 554166 570201 541704 477762
17197 477762 399615 393174 338982 241584 226138 221229 205165 215828 389456 544576 599476
17186 599476 581680 449925 313196 247154 218333 197641 266993 345406 407284 428645 335634
17175 335634 206936 131879 87511 54399 53792 48972 51302 19943 541 -9544 -29366 -3487
17163 -3487 5793 6305 -15788 4085 26697 8065 11431 -8846 -32999 -21919 -40020 -85486 -121152
17150a21152k47Q968K6029N7297J7092O753M700q1005m8264M1272Q4406P0505
17138F6354N2253j6355n4148l9736n3439j2324m1295K0653K3711J9946K7402k5117
17126c2095l0828K1972K0477l2313l995O5896k6379j8216K4661K8380j7793k7472
17114b7705m5762J2092M5675o577M5018l9583J772l1530k9693o732K8099K4779
17102c0147J4783k1142k7274l4870m3426L1003J3421J1524m5526m7783M587L6025
17090a38825K9488M0988j7203k3814J8255J8655k0912j1114k6280j5163r0j4707
17078a60722N0305O4264N3843L0310L9459j2654r0205o5584J8643N745K0454N5520
17066I378n4654l8212M1013O5348j6391m3549m457j1617P0444k4423l3914n4963
$$ plain form
17150 -121152 -121399 -112431 -86402 -29105 -12013 -5260 -560 -81565 -129829 -88557 -4151 66354
17138 66354 118607 102252 48104 8368 -45071 -57395 -98690 -78037 -54326 -34380 -6978 -32095
17126 -32095 -62923 -40951 -20474 -52787 -56782 9114 -17265 -35481 -10820 17560 -233 -27705
17114 -27705 -73467 -61375 -15700 -22277 22741 -16842 -15070 -46600 -76293 -83025 -54926 -30147
17102 -30147 -15364 -36506 -63780 -98650 -142076 -111073 -97652 -86128 -131654 -179437 -174850 -138825
17090 -138825 -109337 -68349 -85552 -109366 -91111 -72456 -93368 -104482 -130762 -145925 -146015 -160722
17078 -160722 -110417 -46153 7690 38000 77459 64805 -25400 -90984 -72341 -66596 -46142 9378
17066 9378 -45276 -83488 -42475 22873 6482 -37067 -41524 -53141 17303 -7120 -41034 -95997
17054i5997Q739J7786R331o1934O60M4498M0794N7059M96p3669l5412O2390K8869
17041C610L0387j3965k4669j3762K4204L6218J9182l024N522m6287m2366k2176
17029d7126J7535K9614K0430j1677j4483j0400N287L7952r3738m4911M9231k1721
17017h4007K6165n442o7398N264M1551Q2954K0816l7598J3843K5514Q714m935
17005B5441k5580q768k1586J4901N742j1972L815M0073Q380J4458P370n997M2138
16992H8415R577q28N0842R990J7494N6100J32202K17795L33780M47056N67996
16981A930419K17448r8709k20279l39352k72816o2863J72117L92985L92055J06541
16971B217546j57285k90082k94211j61927l6902J50077N14922O68078N89424M01647
$$ plain form
17054 -95997 -87258 -69472 -60141 -122075 -121415 -76917 -36123 20936 21432 -52237 -87649 -25259 3610
17041 3610 33997 20032 -4637 -18399 5805 42023 61205 58181 63703 17416 -24950 -47126
17029 -47126 -29591 23 20453 8776 -5707 -16107 -10820 27132 -66606 -111517 -62286 -84007
17017 -84007 -57842 -63284 -130682 -125418 -83867 -913 19903 -17695 -3852 21662 30376 25441
17005 25441 -139 -8907 -30493 -15592 -9850 -21822 -18007 22066 30446 44904 52274 46277 88415
16992 88415 97992 97164 148006 157996 175490 231590 363792 581587 915367 1362423 1930419
16981 1930419 2147867 2049158 1828879 1489527 1216711 1153848 1325965 1718950 2111005 2217546
16971 2217546 2060261 1770179 1475968 1314041 1277139 1427216 1942138 2610216 3199640 3601287
16961C601287Q3263l01094m81369m42376j22099K10302M39696M29192K66012p6264
16951C606550m75285n97444o50185n69699l94231l03207j89542q1800m3202m4192
16941B57763l1624J6759J9822P583L0643L8904J12241J86458L65996M97689M43275
16930A945509J07050j82811l63165l65179j87534M4701K36518L67961L00171o4576
16920A838645k39947l33204l45841k97802k52907j42372l4962l7164R268J2661
16910A76375n5378l7855L484P0942K4005q9006r9719k2302l0582j847j0067O9848
16898b102L0733K0744J5520l2899m6695j1964p980M4434k0141k2120L0168J8442
16886A6140j6193K7731j5453j2850K0247J1601j2360K3620l9271K3210N4818K6859
$$ plain form
16961 3601287 3684550 3383456 2902087 2459711 2337612 2547914 2987610 3416802 3682814 3606550
16951 3606550 3131265 2533821 1883636 1313937 919706 616499 426957 345157 301955 257763
16941 257763 226139 242898 262720 270303 300946 339850 452091 638549 1004545 1502234 1945509
16930 1945509 2052559 1869748 1506583 1141404 953870 998571 1235089 1603050 1903221 1838645
16920 1838645 1598698 1265494 919653 621851 368944 226572 191610 154446 163714 176375
16910 176375 120997 83142 86626 157568 181573 92567 -7152 -29454 -60036 -61883 -71950 -2102
16898 -2102 28631 49375 64895 31996 -14699 -26663 -34643 9791 -10350 -32470 -2302 16140
16886 16140 -53 27678 12225 -625 19622 31223 18863 42483 3212 26422 81240 108099
16874A08099m6882k0117o676l5984M439L1975K1259l1277j3759o6416j6801K9098
16862d3042L7356J3333l888J7328l5681j9903j5645L1088K054J944L8837R202
16850C2983k2277n514R369k0408q549n041L651p018k0246j96Q636J2883O412N3670
16836C8355p842n3483l8086k0433J9203P5270K4705m9715k8100L5922J450Q534
16824E780r189o4557J6145O2486k3727j7138j3854L874Q968L1677J455n3769q544
16811f0393q578M4430j3627M148J9404K993m627j9149m8570j7960J00937L6503
16799C5511o8110m8128j742K7746k1031L2493M8384L0577l2419J9M1493j0075
16787C4718o782k0238l2095n2246K38M6284K9672R126K2536k8404j4033m2892
$$ plain form
16874 108099 61217 41100 34424 -1560 2879 34854 56113 24836 11077 -55339 -72140 -43042
16862 -43042 -5686 7647 3759 21087 -14594 -34497 -50142 -19054 -17000 -15056 23781 32983
16850 32983 10706 5192 14561 -5847 -14396 -19437 -15786 -22804 -43050 -43246 -34610 -21727 -15315 38355
16836 38355 30513 -22970 -61056 -81489 -62286 12984 37689 -12026 -40126 -4204 -2754 5780
16824 5780 -3409 -67966 -51821 10665 -13062 -30200 -44054 -40180 -31212 465 1920 -51849 -60393
16811 -60393 -68971 -24541 -38168 -34020 -14616 -11623 -16250 -35399 -83969 -101929 -992 35511
16799 35511 -32599 -80727 -82469 -54723 -75754 -43261 5123 35700 3281 3300 44793 34718
16787 34718 27936 7698 -24397 -76643 -76405 -30121 -449 8677 31213 2809 -11224 -54116
16775e4116J1714J15l1185k4620j2242M7800L5310M5068K994l6461K7199K2008
16763C3584p904m8982l9873j7624M1591J5022l8336l6427j1977M5201K5204j4405
16751e4926n0989k7149J101o66L1612o810p316m0944r412L2472N3559K2754r5783
16738a52497l6245P948L3470N4339L5801J8965p808k7154j5722J6746K5812K7029
16726a9316k1602l5640j9587K8468l8256l0577l0799m556R584j7941L9663Q3506
16714e7053q411K7957k3930j9494l0778k1663j7545q61M8191j319m517K4186K8077
16701e7160L9846J8806K097l9264m9438m3163K1868O410m723m750m541j820M7650
16688f8182N2110L8300j0878J0716J1608o9741l8773k1953m2791K9365m343p341
$$ plain form
16775 -54116 -42402 -42287 -73472 -98092 -110334 -62534 -27224 17844 20838 -15623 11576 33584
16763 33584 25680 -23302 -63175 -80799 -39208 -24186 -62522 -98949 -110926 -65725 -40521 -54926
16751 -54926 -105915 -133064 -131963 -132629 -101017 -107827 -115143 -156087 -165499 -133027 -79468 -56714 -152497
16738 -152497 -188742 -180794 -147324 -92985 -57184 -38219 -46027 -73181 -88903 -72157 -46345 -19316
16726 -19316 -40918 -76558 -96145 -67677 -105933 -136510 -167309 -171865 -162281 -180222 -140559 -57053
16714 -57053 -65464 -37507 -61437 -80931 -111709 -133372 -150917 -151778 -103587 -104906 -109423 -85237 -57160
16701 -57160 -17314 1492 3589 -35675 -85113 -128276 -106408 -99998 -104721 -109471 -114012 -115832 -68182
16688 -68182 -16072 22228 11350 22066 33674 -36067 -74840 -96793 -139584 -110219 -114562 -121903
16676a21903Q103L171L9154l5827j0317J8138M3630j3013L6848M6192k2436m5008
16664e3268k5141N0300K3224k3435j0535K4192L8778k8984j144J6163j4145m5337
16652d9332l0266K398M5049K4257J1051n2640l9383j0854P282K8799K2263L0324
16640a1052m0145m7949j9437K5989k6409l0526l66M8851M0553r878j6262L799
16628h2832m8531J9723j1117n6284j1391O0588L6467P9421N642m7975j2999l3687
16616a02975L295l3334k7350M7858L8423N4864J6055n7846l4748m7574L0016J0883
16604a02433l620P013K6399L2761L8670P533k9738j4178n8229l2486j3153M01
16592a41060P686K4466M5389m1045L3747N6673k8789k4043J5071J4858k4070L6856
$$ plain form
16676 -121903 -113800 -110629 -71475 -107302 -117619 -99481 -55851 -68864 -32016 14176 -8260 -53268
16664 -53268 -78409 -28109 -4885 -28320 -38855 -14663 24115 -4869 -6013 10150 -3995 -49332
16652 -49332 -79598 -77200 -32151 -7894 3157 -49483 -88866 -99720 -92438 -63639 -41376 -11052
16640 -11052 -51197 -99146 -118583 -92594 -119003 -149529 -149895 -101044 -60491 -70369 -86631 -82832
16628 -82832 -131363 -111640 -122757 -179041 -190432 -129844 -93377 -13956 -8314 -56289 -69288 -102975
16616 -102975 -99680 -133014 -160364 -112506 -74083 -19219 -3164 -61010 -95758 -143332 -113316 -102433
16604 -102433 -106053 -99040 -72641 -39880 -1210 6323 -23415 -37593 -95822 -128308 -141461 -141060
16592 -141060 -133374 -108908 -63519 -104564 -70817 -14144 -42933 -66976 -51905 -37047 -61117 -24261
16580b4261p340q832J4227k2508R980j4848o0560j6849L3969P26L7612N0746n999
16567a3937J427J8848j6394l8597L7222O0020N476k8322J4751j8172j6769n5062
16555d9509m7977L685L5065J8211J9600L0404k110P2o1164j3152l8326j0674M3352
16542g2523O689L6211J8300N5998J7215o435o2858r228N55j5912k9582L4465p561
16529c4666n0991J717j0539J4948J7044L1602M765k0570K2302n571m7988k6502
16517a04449K1190j49K318m189L3707J3976l6340j3252k3051n00L8220N6024k2533
16504c9028j7344J1129Q612J8286k2900j5468L6618K3449n6749j9895p726j1619
16492i2635n9472O5974N6109j3594J8543M3531P932p4659n8844M1761O6929R356
$$ plain form
16580 -24261 -31601 -40433 -26206 -48714 -38734 -53582 -114142 -130991 -97022 -96296 -58684 -7938 -13937
16567 -13937 -12510 6338 -10056 -48653 -11431 48589 54065 25743 40494 22322 5553 -49509
16555 -49509 -97486 -93801 -58736 -40525 -20925 9479 7369 7441 -53723 -66875 -105201 -115875 -72523
16542 -72523 -65834 -29623 -11323 44675 61890 55455 -7403 -16631 -16076 -31988 -61570 -27105 -34666
16529 -34666 -85657 -83940 -94479 -79531 -62487 -30885 -26120 -46690 -24388 -29959 -77947 -104449
16517 -104449 -83259 -83408 -81090 -85279 -51572 -37596 -73936 -87188 -110239 -110739 -72519 -16495 -39028
16504 -39028 -56372 -45243 -36631 -18345 -41245 -56713 -20095 3354 -53395 -73290 -81016 -92635
16492 -92635 -152107 -86133 -30024 -43618 -25075 18456 26388 -48271 -107115 -65354 1575 10931
16480A0931m0547J4218K9970M4447l0993q29P913m1183k5931Q172N080q958l3644
16467f1354r908m0508j2919N7739M4679l380M0510K5323l7332L125K8377k9156
16455E196k8560n2157m1342Q159K4660L430k8888k9617l560M2752N5977N3859
16443I909M0066k7911m1109k4048p391m4339p8493J7117N4331O9181M8614m4243
16431b8316k0737L3944J2883m2404O440l293L7437K7462p159l7532m3760M7074
16419a7961N7232m517k8251m3275k7883M995j7991M8086N7756m696k9161l2713
16407c8379n1389o482o470k3086K1169j1205M3902R1650L5887m995n2467m2810
16395d4675o4720J6314K7291j6200J1669O918m335K884J965n0520l5581M3212
$$ plain form
16480 10931 -29616 -15398 14572 59019 28026 27197 35110 -6073 -32004 -23832 -18752 -27710 -61354
16467 -61354 -71262 -111770 -124689 -66950 -22271 -25651 14859 40182 2850 5975 34352 5196
16455 5196 -23364 -75521 -116863 -108704 -84044 -80614 -109502 -139119 -142679 -99927 -43950 9909
16443 9909 49975 22064 -19045 -43093 -50484 -94823 -173316 -156199 -101868 -32687 15927 -28316
16431 -28316 -49053 -15109 -2226 -44630 -38190 -41483 -4046 23416 16257 -21275 -65035 -17961
16419 -17961 39271 34754 6503 -36772 -64655 -59660 -77651 -29565 28191 23495 -5666 -38379
16407 -38379 -89768 -96250 -102720 -125806 -104637 -115842 -71940 19710 55597 50602 -1865 -44675
16395 -44675 -109395 -93081 -65790 -81990 -70321 -63403 -67738 -64854 -62889 -113409 -148990 -105778
16383a05778L5718J8901J359P2436K861m7291M478r345k0451K8367q535k5072
16371e2352M7990p218o3844k5332J1006j2198p309L9766K0624Q550k4165o7033
16359a31515o3847L0847P9454j0121q013L0523J5139j3955j2148p75j3323k1251
16347a18985o268O2007N9615O2100k5435Q99p535j3730K5532l8065N879O71m2328
16334c5643l6391Q131o1489j2055Q7085K1577J7129m2472J1475K100k188N4378
16322A1637N735O775J0563j3912N8680J8577J7003m1981O093o046R340j5731Q202
16309G4935r778k8673l8508k0784j1953o3102k901j8905l2311J8051J3641J3891
16297a06397O6213j2284m3243K6348M1202L8832P854l3880R30L8334K8557l1996
$$ plain form
16383 -105778 -70060 -51159 -49800 22636 25497 -21794 -17316 -26661 -47112 -18745 -27280 -52352
16371 -52352 -4362 -11580 -75424 -100756 -89750 -101948 -109257 -69491 -48867 -40317 -64482 -131515
16359 -131515 -195362 -164515 -85061 -95182 -103195 -72672 -57533 -71488 -83636 -84411 -97734 -118985
16347 -118985 -125253 -63246 -3631 58469 33034 33933 26398 12668 38200 135 6014 6685 -35643
16334 -35643 -72034 -63903 -125392 -137447 -50362 -28785 -11656 -54128 -42653 -40553 -42741 11637
16322 11637 17372 24147 34710 20798 79478 98055 115058 73077 79170 73124 82464 66733 74935
16309 74935 65157 36484 -2024 -22808 -34761 -97863 -100764 -119669 -151980 -133929 -120288 -106397
16297 -106397 -40184 -52468 -95711 -69363 -28161 10671 18525 -15355 -14425 23909 52466 20470
16285B0470k5522k8358m2525p265K7218q876j8475K9055K7519N3264j4602o2080
16273e0177j9546j2463n620k4333j7123L1171L9119m963j9816L5655j2201J1208
16261d9089l2975R522m5978m5809K7188O1070j5802n2532K0565K0894K329J0319
16249i0298K1518K8796k531K8622q574n9347m8201M0236J5534K976M5779K6418
16237I28J0258j0475K6370k2692J9131R299N748j8883n7539J3515K4067j7455
16225a7728p808p920n408M2308K0321J17k7697K8393K9363J480r4509o4600N94
16212a03094N5034N7946J10n1575k0811l4185R281L2677L1626J7002P190k422
16200a221k6608j8613p538k2019M772R560O632q881m3378j3771l939n490L6994
$$ plain form
16285 20470 -5052 -33410 -75935 -83200 -55982 -64858 -83333 -54278 -26759 26505 11903 -50177
16273 -50177 -69723 -82186 -87806 -112139 -129262 -98091 -58972 -63935 -83751 -48096 -60297 -49089
16261 -49089 -82064 -72542 -118520 -164329 -137141 -76071 -91873 -144405 -123840 -102946 -100617 -90298
16249 -90298 -68780 -39984 -42515 -13893 -22467 -81814 -130015 -89779 -74245 -71269 -25490 928
16237 928 11186 711 27081 4389 23520 32819 38567 19684 -37855 -24340 -273 -17728
16225 -17728 -25536 -33456 -38864 3444 23765 23882 -3815 24578 53941 55421 -39088 -103688 -103094
16212 -103094 -48060 9886 9996 -41579 -62390 -96575 -87294 -54617 -22991 -5989 1201 -1221
16200 -1221 -27829 -46442 -53980 -75999 -71227 -61667 -55035 -63916 -107294 -121065 -125004 -130494 -93500
16187i3500j7842N7140O5439l1438j9647J1545k4330J4755j2328o766L0017L3711
16175F756j8255m5154k3129N1740J8134m6298n5906L498j4551j4900N5001j2756
16163i5820Q075M5035O3998K361k9349m0054k972J0922k7720k9039P983M689k977
16150h4868j6204r255o49L9596J8963J5216L311K8706K5339O599k9653m4723K317
16137d5305j1799m7959l5235N123J8422j0333r391L7069J8479l265K3708N5092
16125e394L1436K9899q28l5154k4560l1069j4323R17N7861L3148o4250l4158O089
16112e0386J0447j6989j8488R152J8896J0918J7342O792k9416j9885m201L9467
16100b6351o533j7284K4684J7882j2455M9808N6813o4688m4282O6j067R410J0541
$$ plain form
16187 -93500 -111342 -54202 11237 -20201 -39848 -28303 -52633 -37878 -50206 -56972 -26955 6756
16175 6756 -11499 -56653 -79782 -28042 -9908 -56206 -112112 -108614 -123165 -138065 -83064 -95820
16163 -95820 -87745 -42710 21288 23649 -5700 -45754 -48726 -37804 -65524 -94563 -86580 -81891 -84868
16150 -84868 -101072 -110327 -110976 -71380 -52417 -37201 -33890 -5184 20155 26754 -2899 -47622 -45305
16137 -45305 -57104 -105063 -140298 -135175 -116753 -127086 -136477 -99408 -80929 -84194 -60486 -5394
16125 -5394 26042 55941 55113 19959 -4601 -35670 -49993 -49076 8785 41933 -22317 -56475 -50386
16112 -50386 -39939 -56928 -75416 -66264 -47368 -36450 -19108 -12316 -41732 -61617 -65818 -26351
16100 -26351 -32884 -50168 -25484 -7602 -20057 29751 86564 21876 -22406 -22340 -23407 -13997 -3456
16087c456l2725m560k6091n4095j7059J0475N5668Q8586j4714j2759J1553k3032
16075b2209l5741k0327N4436O4947m458J6426n2844K5352R838q429o207L6181
16063E6965J8828m3951k4668l1081K9969M6917J5103n1055n0015o541K5197l0022
16051d4354j0082J8412J0495K860o344J8544J327K2851O8358j1920j9668p6687
16039b6208k361O666L6866n609l0468J1222M6868L8139l9290l1668J9463O972
16027C0592p091N407J148j6292K5801l4486j8924m4677q985L7913J64j2120J2665
16014b8885l0809m820Q038L7607L9222q163J6125l139j9539l4127j5761q21m3868
16001h8940K0637N0079n40j0596l1183L5839P9579q5297l7784K8000K1252k8896
$$ plain form
16087 -3456 -36181 -40741 -66832 -120927 -137986 -127511 -71843 16743 2029 -10730 823 -22209
16075 -22209 -57950 -78277 -23841 41106 36648 53074 230 25582 35420 26991 20784 56965
16063 56965 75793 31842 7174 -23907 6062 52979 68082 17027 -32988 -39529 -14332 -44354
16051 -44354 -54436 -36024 -25529 -22669 -29013 -10469 -9142 13709 82067 70147 50479 -26208
16039 -26208 -28569 -21903 14963 9354 -21114 -9892 36976 75115 35825 4157 23620 30592
16027 30592 23501 28908 30056 13764 39565 5079 -13845 -58522 -67507 -29594 -29430 -41550 -28885
16014 -28885 -59694 -64514 -56476 -18869 20353 12190 28315 25176 5637 -28490 -44251 -45072 -88940
16001 -88940 -68303 -18224 -18764 -29360 -60543 -24704 54875 -30422 -68206 -40206 -18954 -47850
15989d7850K1645K6693j382k2569j7197L9003J6317k894N622J8277M4p0313m6392
15976h0996p478l938K1493j9809j6804K5595J1896k3278M2339K909m5725M625
15964h9171l373J7977L731L7403r739j8176r941M836N0837N3832n1106N890j762
15951h762j7621M403l3086j5914l204M2635L9910J7985j599j6570Q76l2087p8823
15938a01857K3636M6892L2050L9874k0361l1327k2898k8331l1667O053J9750M5903
15926b2283k0979l2376J8337L6365J3313l6159M03L1422l8424r172J9455R382
15914c0716R136m2879j9142L1198L8967L1604J7485l32l8365k5427J9725J3297
15902D551j702k1084k9733l4567Q881K7708J902M805N9311M1776J1874n2713k9751
$$ plain form
15989 -47850 -26205 488 -894 -23463 -40660 -1657 14660 11766 17388 35665 35709 -34604 -80996
15976 -80996 -88474 -92412 -70919 -90728 -107532 -81937 -70041 -93319 -50980 -48071 -93796 -89171
15964 -89171 -92544 -74567 -70836 -33433 -43172 -61348 -71289 -66453 -15616 38216 -12890 -7000 -8762
15951 -8762 -26383 -21980 -55066 -70980 -74184 -31549 8361 26346 24747 8177 9053 -23034 -101857
15938 -101857 -78221 -31329 721 40595 20234 -11093 -33991 -62322 -93989 -87936 -68186 -22283
15926 -22283 -43262 -75638 -57301 -20936 -7623 -43782 -43379 -11957 -50381 -59553 -40098 -30716
15914 -30716 -21580 -64459 -83601 -52403 -13436 18168 35653 35321 -3044 -28471 -8746 4551
15902 4551 2849 -18235 -47968 -82535 -73654 -45946 -44044 -39239 20072 61848 73722 21009 -8742
15889h742K646L694O38m9258n3632K5872k4187J0206J8155K6026K5725M926L7185
15876A9254L156j6239l0017l8446J0392K1348k4981L968O265k8978l299K7793
15864d9784L7614J2171J5271J053k4766l3104k985m6184L0758Q7897N8065M9875
15852A35881l3946l1578j4861k1391n7117l3246K7568N2715k6335r732L5431J9789
15840D3178l759k7647k3059k9640k8799J6443M1844J9489K0629J520r611o682
15828A3906l5463p685P845K3606K1521J5319L9687j7927j4094j6593k3786l5013
15816b8677m82j0265k1530J282K5311k0008Q5215K3833m554q858M064n4392k1557
15803c0618M5200k6753o6200K6018M3098J1816j7171l3098K5744K1785M8217K0038
$$ plain form
15889 -8742 -6096 -2402 -1764 -51022 -104654 -78782 -102969 -92763 -74608 -48582 -22857 -17931 19254
15876 19254 22410 6171 -23846 -62292 -51900 -30552 -55533 -51565 -45300 -74278 -77577 -49784
15864 -49784 -12170 1 15272 16325 -8441 -41545 -44530 -90714 -59956 27941 86006 135881
15852 135881 101935 70357 55496 34105 -23012 -56258 -28690 24025 -2310 -12042 23389 43178
15840 43178 39419 11772 -11287 -40927 -69726 -53283 -11439 8050 28679 30199 20588 13906
15828 13906 -21557 -29242 -21397 2209 23730 39049 78736 60809 46715 30122 6336 -28677
15816 -28677 -29159 -39424 -60954 -59672 -34361 -54369 30846 54679 50125 41267 45331 -9061 -30618
15803 -30618 14582 -12171 -78371 -52353 -9255 2561 -14610 -47708 -21964 -179 48038 68076
15791F8076m8410l1091m1416p039M3710J3085J7469R469l7053n5391k7401M8991
15779d7001L5373m127j1382J442O1704P7156l5322l8716M2058K7853M0365Q419
15767A57822r3486p4178l8321M2973L595K3971J4167j2231R363k8262l0211J1972
15755a2826K6069p821L0273J4600o4477r349J8837K1044k7167j5573j2348l5725
15743g4463L5744l7171p980Q5775M2663o303j4045M394M0279O986j9657m4672
15731A1550R914l7635p136K7680K3818j7738J3824K9722Q106l7493k9755n986
15719a1129r118J324L2223q390k9232m0616j6550j530K6809R634K2380J7710m0606
15706d7091k7336J9886O0167N546O556j3798q1604j1244L2942K7689M5840k5651
$$ plain form
15791 68076 19666 -11425 -52841 -59880 -16170 -3085 14384 23853 -13200 -68591 -95992 -47001
15779 -47001 -11628 -15755 -27137 -25695 36009 113165 77843 39127 81185 109038 149403 157822
15767 157822 64336 -9842 -48163 -5190 -1595 22376 36543 24312 33675 5413 -24798 -12826
15755 -12826 13243 5422 35695 50295 -14182 -23531 -4694 16350 -10817 -26390 -38738 -74463
15743 -74463 -38719 -75890 -83870 1905 44568 38265 24220 28614 68893 75879 56222 11550
15731 11550 21464 -16171 -23307 4373 28191 10453 24277 53999 62105 24612 -5143 -11129
15719 -11129 -20247 -18923 13300 4910 -24322 -64938 -81488 -83018 -56209 -46575 -24195 -6485 -47091
15706 -47091 -74427 -54541 5626 11172 17728 3930 -77674 -88918 -55976 -28287 17553 -8098
15694h098n1435J1418K8343K6841m708J488l2828k3638k4548J2692N852j5451
15682g4072N356j9424L0497L6544J5560l2634j4114J8452k7169n755K3725K2201
15670b0833j7165j3127n415K5384P2942p2454k0963L4249L4776k1257Q418K603
15658G158k4155k0681j8542K5447K1357j5590K3745J61j8754k63P4064L898l1325
15645B6520K0288m0452l7972K9335L1959J6822J5532j329m8762l7297L5836M8547
15633E9027M2480O235j0010l2203j8521k8551J2787l6497l9302m712L5653K5289
15621A1675P471N4079L2552o7362l3544j6459k1248J4416K9900R654p108k0834
15609f808l3236m0709l0158K2724K5944m55L5275K0255l9534k9087M4125o167
$$ plain form
15694 -8098 -59533 -48115 -19772 7069 2361 3849 -28979 -52617 -77165 -64473 -58621 -74072
15682 -74072 -68716 -88140 -57643 -21099 -5539 -38173 -52287 -33835 -61004 -66759 -43034 -20833
15670 -20833 -37998 -51125 -56540 -31156 41786 -30668 -51631 -17382 17394 -3863 4555 7158
15658 7158 -16997 -37678 -56220 -30773 -9416 -25006 -1261 -1100 -19854 -20117 53947 57845 26520
15645 26520 46808 6356 -31616 -2281 29678 46500 62032 60703 11941 -25356 10480 59027
15633 59027 101507 107742 97732 65529 47008 18457 31244 -5253 -44555 -49267 -13614 11675
15621 11675 19146 73225 105777 38415 4871 -11588 -32836 -18420 11480 21134 14026 -6808
15609 -6808 -40044 -80753 -110911 -88187 -62243 -62698 -27423 -7168 -46702 -75789 -31664 -37831
15597c7831J718J5281j2299K2647L4792J5680k6329J2825J6195M9990m931k4073
15585F3665n3897j9773M0288M357ro0763J8482J5494r933J9897L904N197m2654
15572a5745L789K103k3087m335L8382K8637J8196J9858n7499m4010J9639j1967
15560b6039K5420r323l4527K4969M7677N429k4702k4442K9304j4667j2270l017
15548a6188l4001j8842l6158L069o05K562K8809M6600m2025J6022M9706N7579
15536E6528j9745r9941o7817L2472O1670K8703K1856k1179k6474j9055M2704k9713
15524c9991J5789N1130J1991l2954k5922k0723k1768j5156K058P575O1136O027
15512h08J9489N1822l7114k3097l6231k5159j0551J1879j3117J3272M0753M24
$$ plain form
15597 -37831 -36113 -20832 -33131 -10484 24308 39988 13659 26484 42679 92669 87738 63665
15585 63665 9768 -10005 30283 34640 34631 -26132 -7650 7844 -2089 17808 21712 26909 -15745
15572 -15745 -11956 -9853 -32940 -37275 1107 29744 47940 67798 10299 -33711 -14072 -26039
15560 -26039 -619 -9942 -44469 -19500 28177 33606 8904 -15538 13766 -901 -13171 -16188
15548 -16188 -50189 -69031 -105189 -102120 -102725 -100163 -71354 -24754 -66779 -50757 -1051 56528
15536 56528 36783 -63158 -130975 -98503 -36833 -8130 13726 -7453 -33927 -52982 -10278 -39991
15524 -39991 -24202 26928 38919 5965 -19957 -40680 -62448 -77604 -75546 -67971 -6835 -808
15512 -808 18681 70503 33389 10292 -25939 -51098 -61649 -49770 -62887 -49615 -8862 -8438
15500h438n2329k3827L1549K3216P092n09n1641k1936J4009L4424K2457N2487
15488B6554J373n8678K863K9595J7570N5893l7991r541K332l5742J846L26k0258
15475b3858p1708q969N7467J3555M3410N2650o932j8778r303N76M590J6045n1283
15462b538m7848m6376l812O494K2314j1129l1764J1360L2540L6426m8450l3131
15450a15914P3930M1837n772k6661J7806j4244m9502K297N8723K0300j2049J9577
15438A0328N568l5979l9702M1977K9880q452l8972j8917K5222L6732m9947J0879
15426c1383M6372M9872J262R004k8260l6397l3990j3674J166K1347L3347m7895
15414b9229l9797m6454K8575K1173M9914J0101K0701P029m2772k0506K9075K1502
$$ plain form
15500 -8438 -60767 -84594 -53045 -29829 -22737 -23246 -74887 -96823 -82814 -48390 -25933 26554
15488 26554 27927 -30751 -27888 1707 19277 75170 37179 27638 29970 -5772 -3926 -3600 -23858
15475 -23858 -95566 -104535 -47068 -33513 9897 62547 55615 36837 27534 28110 32700 48745 -2538
15462 -2538 -50386 -96762 -100574 -94080 -71766 -82895 -114659 -103299 -70759 -34333 -82783 -115914
15450 -115914 -41984 -147 -5919 -32580 -14774 -29018 -78520 -76223 -17500 2800 -9249 10328
15438 10328 15896 -20083 -59785 -17808 12072 3620 -35352 -54269 -29047 7685 -42262 -31383
15426 -31383 14989 64861 66123 75127 46867 10470 -23520 -37194 -36028 -14681 18666 -29229
15414 -29229 -69026 -115480 -86905 -65732 -15818 -5717 14984 22013 -20759 -41265 -12190 9312
15402I312l7823l4011j7054M460L6920K6583K0012l1911m4831k1486q985j4662
15390a13476M8051J6453k5313j9169k3387L4413O352j8334M5931Q368l6600J159
15378g5552J0404k6908m408J3038l090k0980J2529J1573l4989L2231J9024P5883
15366H755M3184K4407M616q6595m9285M2154J6444n729L1345K2506k3011m5236
15354a6445n8781L2499J5222P7539j964q501k5743m9702j2007N4788O3389O854
15342G7148k0320l2904p764j3262J9479M9363k141r2463Q64P854J6672K5897l3292
15329d869j3270j8505m049J7398n409K0128l3301N63N1316R076m6299M7272P1008
15316I1059J0934j6635j8117l8694n212Q068q721R864J9075r818r753l7193j718
$$ plain form
15402 9312 -28511 -62522 -79576 -75116 -38196 -11613 8399 -23512 -68343 -89829 -98814 -113476
15390 -113476 -65425 -48972 -74285 -93454 -116841 -82428 -76076 -94410 -48479 -40111 -76711 -75552
15378 -75552 -65148 -92056 -96464 -83426 -86516 -107496 -94967 -83394 -118383 -86152 -67128 8755
15366 8755 51939 76346 80962 -5633 -54918 -12764 3680 -2049 29296 51802 28791 -16445
15354 -16445 -75226 -42727 -27505 50034 48070 39569 13826 -35876 -47883 6905 70294 77148
15342 77148 56828 23924 16160 2898 22377 71740 69599 -22864 -22000 -14146 2526 28423 -4869
15329 -4869 -18139 -36644 -40693 -23295 -28704 -8576 -41877 -41314 10002 19078 -27221 20051 91059
15316 91059 101993 85358 67241 28547 23335 31403 22682 32546 51621 41803 32050 -5143 -6861
15303f861M5201J5708p8719L932K5421L3783J8156j6136p0582k6307R907Q048
15291c8449K2646j1899K6149L80l5068q562K3531L8573J7051m147l1360q487q41
15278a0483k6012K3387K0418l7780j0757j8063P985J9473O7407P2550k0190K1637
15266A09572o3595p0243l253j1824O4652M1587K942n3442m9561j8784l8781p335
15254i8065K0729j50M275P6394K904K7091j4693L8857M110n883l1574j3536o957
15241C502M2835L716m2510J475J1754J2088k1838K1136k4502Q428j3087M9079
15229E2076o515J3802m781j9974k8288k0744m0323o007J1378j7492K1040L9639
15217f189m915j941l9240l6106q862L9857M520M2552K7424J0252p755l2402R121
$$ plain form
15303 -6861 38340 54048 -24671 -20739 4682 38465 56621 40485 -30097 -56404 -46497 -38449
15291 -38449 -15803 -27702 -1553 -1173 -36241 -44803 -21272 17301 34352 30205 -1155 -9642 -10483
15278 -10483 -36495 -13108 7310 -30470 -41227 -59290 -51305 -31832 35575 108125 87935 109572
15266 109572 45977 -24266 -27519 -39343 25309 66896 69838 16396 -33165 -51949 -90730 -98065
15254 -98065 -77336 -77486 -73211 3183 6087 33178 18485 57342 61452 55569 23995 10459 3502
15241 3502 46337 50053 7543 9018 20772 32860 11022 32158 7656 16084 2997 52076
15229 52076 45561 59363 54582 34608 6320 -14424 -54747 -60754 -49376 -66868 -45828 -6189
15217 -6189 -11104 -13045 -52285 -88391 -97253 -57396 -52876 -10324 17100 27352 19597 -12805 -3684
15204c684K0664q582m4521k5129J9154K2653K6592k929m1960L3980L2523K067
15192C0828K140L590J1631J6234k9997M290M3121k897k2321n9836q497L0818J9957
15179C9061L7287q436m1313k7569M3740K4562J5421k2521Q448l5122j5907o8376
15167e0725j5032J720L9821N5696P1424r172l9615k1798M3058l632j2338O7068
15155A26475j3431k6355K1807J531l6405l5487J4765J1769m3279n1663k445l1146
15143f3864M8319j3340m8822K51P0153K3209l3763Q676Q202N071k0505J5524J518
15130F29K2176m0226o5045j3536N349j5528Q438K0182n179j2069L2038l0835M599
15117h9007O9036j6631o0278k8234K9145r695m582K719j4962M519L3645j8953
$$ plain form
15204 -3684 16980 8398 -36123 -61252 -42098 -19445 7147 4218 -37742 -3762 28761 30828
15192 30828 32968 36558 48189 64423 34426 38716 81837 78940 56619 -3217 -11714 19104 39061
15179 39061 76348 67912 26599 -970 42770 67332 82753 60232 68680 33558 17651 -50725
15167 -50725 -65757 -64037 -24216 31480 102904 93732 54117 32319 75377 71745 59407 126475
15155 126475 113044 86689 108496 110027 73622 38135 52900 64669 21390 -30273 -32718 -63864
15143 -63864 -15545 -28885 -77707 -77456 -7303 15906 -17857 -9181 -979 4092 -16413 -889 629
15130 629 22805 -17421 -82466 -96002 -90653 -106181 -97743 -77561 -82740 -94809 -62771 -93606 -89007
15117 -89007 -19971 -36602 -96880 -125114 -95969 -105664 -110246 -107527 -122489 -117970 -84325 -103278
15105a03278L0094P4985R096M5691l929k691k4384j8809o6896J7556N9532M603
15093B1570M776j5360o1276k918K155J8841k0087q308j0067j3011q021p6K5778
15080f6004j6990L7334M7967L028m3621k248L3181m704L687j1989j8542j3687
15068e2588j6865K4894m821j4695K0492J2744N6450j5518P829l9468j838k6042
15056d9426j8240j7096j8876L0542N734m0779o2686M2555M8688M4428J6233j9852
15044c8775r734P29J0807M428m5724N8070L3238k1617Q20l3894L9216Q3039k0405
15031F0198q996K2868j8634m2797k0912k772k034k7852l431O9817J9092j8082
15019B6465l2130j8396Q855k387m3154p115l330L2124J8419K4833M029J5754L77
$$ plain form
15105 -103278 -73184 1801 10897 56588 52659 49968 25584 6775 -60121 -42565 16967 21570
15093 21570 26346 10986 -50290 -53208 -51053 -32212 -52299 -60607 -70674 -83685 -91706 -91782 -66004
15080 -66004 -82994 -45660 2307 5335 -38286 -40534 -7353 -12057 -8370 -20359 -38901 -52588
15068 -52588 -69453 -44559 -49380 -64075 -43583 -30839 25611 10093 17922 -21546 -23384 -49426
15056 -49426 -67666 -84762 -103638 -73096 -67362 -108141 -170827 -128272 -79584 -35156 -18923 -38775
15044 -38775 -48509 -47780 -36973 -32545 -78269 -20199 13039 -8578 -7758 -41652 -2436 80603 60198
15031 60198 51202 74070 55436 12639 -8273 -11045 -13079 -40931 -44362 25455 44547 26465
15019 26465 -5665 -24061 -15206 -17593 -60747 -67862 -71192 -39068 -20649 4184 8213 23967 24344
15006B4344K0343K6107k0381m7817j385J3863n477j98l212K1058J0230j8455J8294
14993C7314O1025M322k2814m4995n8686m071m86N702J9604j5731k9252L2044j190
14980a7214L8420J3510m3468Q483L5483K8190m857k5625l6488j267M285J5467
14968A4919j8594o4018k6309K443M9496M0139N282J975k8624J0256N2241j8233
14956B0973N471k717M3909L6611l3488k9425l3827J6985M7015j6257n8590J4424
14944A1084J7749o1833J4203M3966L5255k4633m2563j9100K8054l164J92P653
14932F863J3708M3686J5664k6232j6208l6606k8311L0943K2231J9757K0718k0950
14920D5263k1647n8795o2592r677K2655J4230L3984m501R398J5620k7398J9456
$$ plain form
15006 24344 44687 70794 50413 2596 1211 15074 9597 9399 6187 27245 37475 19020 37314
14993 37314 98339 102661 79847 34852 -23834 -27905 -28391 -22689 -3085 -18816 -48068 -16024 -17214
14980 -17214 21206 34716 -8752 -269 35214 63404 58547 32922 -3566 -4833 -548 14919
14968 14919 -3675 -67693 -94002 -91559 -42063 -1924 3358 5333 -23291 -13035 39206 20973
14956 20973 26444 23727 67636 104247 70759 41334 7507 24492 71507 55250 -3340 11084
14944 11084 28833 -33000 -18797 25169 60424 35791 -6772 -25872 2182 -982 -790 6863
14932 6863 20571 64257 79921 53689 37481 875 -27436 3507 25738 45495 66213 45263
14920 45263 23616 -35179 -97771 -107448 -84793 -70563 -36579 -41080 -31682 -16062 -43460 -24004
14908b4004K0388M7243K4093Q957n1388m7779J1119K915N6225K2433J6284l8112
14896D8374k9975J1299l3255o6689M1069K4908L5362L4160n7059o286M3645r848
14884C5705j9054K1658k6096n2341k7706n77l682N992l3622J5280M0494K1093
14872b2856O7727p468k7150Q336l6194l3566L4516M1815j7992j2004P960j6968
14860a3844L4993K5658m8810l2520M1796L069p1637n3781J8356J0970K9197L2234
14848b4319J710k4466K5534J3081j3694J7500j0944R046j0046M350m1099k4990
14836g8337k6432J6169M7058J0477j749m801k5217j1039R044K4328M232K4324
14824a1943M024m063j8723k8552M0211K4074k9094k3472K6041R960j661Q902L0027
$$ plain form
14908 -24004 -3616 43627 67720 76677 25289 -22490 -11371 -8456 47769 70202 86486 48374
14896 48374 18399 29698 -3557 -70246 -29177 -4269 31093 65253 8194 1908 45553 35705
14884 35705 16651 38309 12213 -40128 -67834 -68411 -72093 -66101 -99723 -84443 -43949 -22856
14872 -22856 44871 37403 10253 18589 -17605 -51171 -16655 25160 7168 -4836 3124 -13844
14860 -13844 21149 46807 -2003 -34523 7273 10342 -61295 -115076 -96720 -85750 -56553 -24319
14848 -24319 -22609 -47075 -21541 -8460 -22154 -4654 -15598 -6552 -16598 -12248 -53347 -78337
14836 -78337 -104769 -88600 -41542 -31065 -32814 -37615 -62832 -73871 -64827 -40499 -36267 -11943
14824 -11943 -7919 -11982 -30705 -59257 -19046 5028 -24066 -47538 -21497 -11537 -13198 -4296 25731
14811B5731M8276K9343j1230k8788J6176j1575p6250l5629M9680l64k4950J2076
14799g504J9347O4979k9074l6631k7242j6317L2445j21r400M5082k1065k3779
14787i280l8223k0438L670l2201K4888K517q760j4048L8668m289K542L0681O656
14774a7617j006J2237O811j8989m430J6006m2709l5372O5122L1800Q7000M5493
14762A44346j6035j972k9978l5773m5637K6470j6364m3019Q846O6072m3516j1168
14750B272K7454l639j2805l8011N37M2409l427m6318l0527J1173N837k2308O522
14737f0831l8968m4184L2146P3670J709j5445M5648N4525L4008K9451K2198o1626
14725G2301n9919k2708k9870j8625k5362k4429M0558Q2339L2931j345P575R336
$$ plain form
14811 25731 74007 103350 92120 63332 79508 67933 -8317 -43946 5734 5370 -19580 -7504
14799 -7504 11843 76822 47748 11117 -16125 -32442 3 -118 -9518 35564 14499 -9280
14787 -9280 -47503 -67941 -64271 -96472 -71584 -69067 -77827 -91875 -53207 -57496 -54954 -24273 -17617
14774 -17617 -18623 -6386 425 -18564 -22994 -6988 -49697 -85069 -19947 11853 98853 144346
14762 144346 128311 126339 96361 60588 14951 41421 25057 -17962 -9116 56956 13440 2272
14750 2272 29726 26087 13282 -24729 -24192 18217 14790 -31528 -62055 -50882 -45045 -67353 -60831
14737 -60831 -99799 -143983 -111837 -38167 -36458 -51903 -6255 48270 82278 111729 133927 72301
14725 72301 12382 -10326 -40196 -58821 -84183 -108612 -68054 14285 47216 45871 53446 62782
14713F2782q550L2518M932k4579j1039P4207J9026q1450O809k7182k4961j2415
14701A0098J8223k864J1582L6525k032m4430O624J098J7552j7019j6372L545N3008
14688G5538k3578o6549k2230Q541j0967m1119o958j3189N917L5077L3993M5467
14676A9943k563p1487J3579N6894K5675l2622k9652L8293L1764Q156L2240R605
14664I9825n1856k8620l8381L777M033M3860l9865j8000j4364K7943k0653k956
14652c5257L7760j1743J4073k296m3247L4603N0197k7306p134m1703m0914J1383
14640f1584M7015K4120M439M3568O0798J5590N437j5261m4991j7962n953j1132
14628D4084m263j1191m3909p142P9851j2437m587Q630j9197m0279j869R786l885
$$ plain form
14713 62782 54232 86750 91682 67103 56064 130271 149297 67847 74656 47474 22513 10098
14701 10098 28321 25457 37039 73564 71532 27102 33726 34824 52376 35357 18985 22530 75538
14688 75538 51960 -14589 -36819 -28278 -39245 -80364 -87322 -100511 -94594 -59517 -25524 19943
14676 19943 17380 -54107 -40528 16366 42041 9419 -20233 18060 49824 57980 90220 99825
14664 99825 47969 19349 -19032 -15255 -11222 32638 -7227 -25227 -39591 -11648 -32301 -35257
14652 -35257 2503 -9240 4833 2537 -40710 -6107 44090 16784 9650 -32053 -72967 -61584
14640 -61584 -14569 9551 13990 57558 118356 133946 139383 124122 79131 61169 55216 44084
14628 44084 39821 28630 -15279 -22421 57430 44993 40406 49036 29839 -10440 -12309 -2523 -6408
14615f408k8080o082k4165m2121K5427N5203L6675k4000k878M5819q306L892L632
14602B8608r979m5931l7022L3588J7270l4596o5238j7670l2657N2749P6165O181
14590b8532j862j2380K9180K3865k9102Q265N3715J7713J466j0726r8847l7058
14578h4303M3107J076J4816M9508j0775J433j6245J2284k2528m0508j2336J6765
14566d7706j2262k5545O071L3603j6206m2838k0965k9510N8051R0553J8239M5567
14554E7052j3115j09201m5596Oq649M5595N8851j9622j4214J8748L2331j3778
14542a1592k4957j5224N2652J1970O3m1413k2781N5013K1689J664M04j9945j641
14529E902K8132M3199o861k8689o0766L2167m3781j849J0236K6018J6093q069
$$ plain form
14615 -6408 -34488 -40570 -64735 -106856 -81429 -26226 10449 -13551 -16429 29390 21084 24976 28608
14602 28608 18629 -27302 -64324 -30736 -13466 -48062 -113300 -130970 -163627 -110878 -34713 -28532
14590 -28532 -30394 -42774 -13594 10271 -18831 -10566 43149 60862 62328 51602 -47245 -84303
14578 -84303 -41196 -40120 -25304 24204 13429 14862 -1383 10901 -11627 -52135 -64471 -47706
14566 -47706 -59968 -85513 -79442 -45839 -62045 -104883 -125848 -155358 -97307 -6754 11485 57052
14554 57052 43937 -65264 -110860 -110854 -119503 -73908 -15057 -34679 -48893 -30145 2186 -11592
14542 -11592 -36549 -51773 879 12849 12912 -28501 -51282 3731 25420 27084 27488 7543 5902
14529 5902 34034 77233 70372 41683 -19083 13084 -30697 -32546 -22310 3708 19801 11732
14517A1732o2183J0685R113m635k5916k0730K6548K4219Q9407n7967k6447L2989
14505F815M0611m769J3803K2985j7711l6670Q840K101m246J3105J0219j2980K7308
14492F9411K4123N1691Q484j3768Rj4686m3327p9376n137j5956J4326K0609l02
14479A6101K9153J274K3425j742l1170j490M5670n4075j7380j5587l78M3167L0869
14466F7837k2480k6753L5717k0984L0440r449q3078j142j7124J6056L8737M8431
14454E6208m1218j2424J4463O0450J3770l1984J7216j8969p1297k4261J2497R210
14442a6339M1724K8878L2391l3126n1853j3498L3282q941k6140K1868j6616J163
14430g207N374r909n0643O981K9971K7081N4551j6099J0620k2649L029o3785j6068
$$ plain form
14517 11732 -50451 -39766 -30653 -35288 -61204 -81934 -55386 -31167 58240 273 -26174 6815
14505 6815 47426 42657 56460 79445 61734 25064 33904 36005 31759 44864 55083 42103 69411
14492 69411 93534 145225 153709 139941 139950 125264 81937 2561 -2576 -18532 -4206 16403 16101
14479 16101 45254 46528 69953 68211 37041 35551 81221 27146 9766 -5821 -6199 36968 67837
14466 67837 45357 18604 54321 33337 63777 54328 -28750 -29892 -47016 -30960 7777 56208
14454 56208 14990 2566 17029 77479 91249 59265 76481 57512 -13785 -38046 -25549 -16339
14442 -16339 25385 54263 86654 53528 1675 -11823 21459 12518 -13622 8246 -8370 -7207
14430 -7207 -1833 -11742 -62385 -55404 -25433 1648 56199 40100 50720 28071 31100 -32685 -48753
14417d8753J5833O999l1205k0019O0013P4617O1586m7127q0148l3378j7924J621
14405e7885J2309M0457K5414q011k6941P7995Q074o3309l8799l612M0326n536
14393D82L9511m4766j06298k884K2586L1386k2280M0227O2730k3881Q947J0859
14381A6619K5728M1930K6962L2255m4411p9928n7794K354J5062L0199O988m6273
14369c0309L8575N3600k7528l9610m0260j6415J439K3749O6352J8570k336K6161
14357G1988k2779r1207l6168j2234j5022L4926K0201l6758L8498K4102M048j6085
14345c6490k9454r852J5128K8868L2722M005m1868p905N4742N7191M86J5310k0457
14332F2426j0791l4647j1436l8751L55J3525m0165m2925M9522N1360K3599L1353
$$ plain form
14417 -48753 -32920 -25921 -57126 -77145 -17132 57485 119071 71944 -8204 -41582 -59506 -57885
14405 -57885 -45576 -5119 20295 12284 -14657 63338 71412 8103 -30696 -34308 6018 482
14393 482 39993 -4773 -111071 -113955 -91369 -59983 -82263 -42036 20694 -3187 5760 16619
14381 16619 42347 84277 111239 143494 99083 19155 -38639 -36285 -21223 8976 15964 -30309
14369 -30309 8266 61866 34338 -5272 -45532 -61947 -60508 -36759 29593 48163 45827 71988
14357 71988 49209 -41998 -78166 -90400 -105422 -70496 -50295 -87053 -48555 -24453 -20405 -36490
14345 -36490 -65944 -75796 -60668 -31800 922 4927 -36941 -44846 9896 67087 67573 82883 62426
14332 62426 51635 16988 5552 -33199 -32844 -19319 -59484 -102409 -52887 -1527 22072 53425
14320E3425M5933M595n5447m2733l6649M0L5894j4628L6863q75j8584J3687j4553
14307F968N469j87j8912l259P514K5214J5690K84j385k1180k32p610j0929j3754
14293a6309l8942M3L1697K1813j0958K9203q180k8255N0080O4801m2126j5645
14281C7222J2751J4729K4950k4056k0828K584o227Q854k0373l1504n6791K1563
14269c7126K8338P935J6243J9289k6063R446j3453j4516k2157J969L4406L8111
14257D2422m2922k9013k845r091p590J6765N8779L7679J5732o208r953j2036J2918
14244F4637l3348j3696P0003l894o1986l9489l5245J8993j441M4602L4925j7480
14232B6581m4073l270O0623L2904k3827o890j8087K265j1568J757l6268k9228
$$ plain form
14320 53425 99358 103953 48506 5773 -30876 -30836 5058 -9570 27293 26418 7834 21521 6968
14307 6968 12437 12250 -6662 -9921 -2407 22807 38497 38781 37396 16216 15984 8374 -2555 -16309
14293 -16309 -55251 -55208 -23511 -1698 -12656 16547 8367 -19888 30192 94993 52867 37222
14281 37222 49973 64702 89652 65596 44768 47352 41125 49979 29606 -1898 -58689 -37126
14269 -37126 -8788 -853 15390 34679 8616 18062 4609 -9907 -32064 -30095 4311 42422
14257 42422 -500 -29513 -32358 -41449 -49039 -32274 26505 64184 79916 73708 63755 51719 64637
14244 64637 31289 17593 87596 83702 21716 -17773 -53018 -34025 -35466 9136 44061 26581
14232 26581 -17492 -20762 39861 72765 48938 42048 23961 26226 14658 16415 -19853 -49081
14220d9081J7230R5425K4046l0422l1535J1791J1151O614m7507k9641j0888J3880
14208a8937p310R344q226J5542K8547K4116Q609K459l8461k4397n6763J7034K0123
14195b8320k8117k8260K8670L8100Q70l8984j61K2109Q675L7632n049j3660l136
14182i631q960L6685J9766l5596m2786J4351K6334J2777M7750M4258m059m1955
14170E8934J8563n39j5291Q43k3828o9887P0201K0520k6039k008J1096r964l7019
14157d418j4755J412l154m8404J7472N3496M8543K3580k7658k5558J722j0030
14145A2248m9475o443K6169K6856L3528r05q3722m9090K923K8092J8897Q303j0689
14132d3308L1048M3787k8306j1327N1546M1667k9705p94R516J1766k4875l0347
$$ plain form
14220 -49081 -31851 63574 87620 57198 25663 37454 48605 55219 7712 -21929 -32817 -18937
14208 -18937 -26247 -16903 -25129 -9587 18960 43076 51685 54144 15683 -8714 -65477 -48443 -28320
14195 -28320 -56437 -84697 -56027 -17927 -17057 -56041 -56202 -34093 -25418 12214 7165 -6495 -9631
14182 -9631 -18591 18094 37860 2264 -40522 -26171 163 12940 60690 104948 100889 58934
14170 58934 77497 76958 61667 62510 38682 -31205 38996 59516 33477 31469 42565 32601 -4418
14157 -4418 -19173 -17761 -20915 -69319 -51847 1649 50192 73772 46114 20556 22278 12248
14145 12248 -37227 -43670 -17501 9355 42883 41978 -41744 -90834 -87911 -59819 -40922 -32619 -43308
14132 -43308 -12260 31527 3221 -8106 43440 85107 55402 54608 64124 75890 51015 20668
14120B0668L0510M1322M601k6415k3225m1152L329K7164j4912k5534k0541K6763
14108B578l586l6802k4051j2912J4061k1296J8580Q1276j8414j1625L8697K3750
14096E0256n5413J0511M245K0702l1433j6190l0597R71M564L0853K0727K1992
14084C1188k6283o9235K2626K1100k7172j8314K588L6439M6115N4672m4390l7363
14072h029m193M3633n5281L758L7689P464j9122P591l2379m5278j5611M5474K2046
14059a2238J3274L8379K2713m9615R638r201n5104Q976L8595L9539j4671J8151
14047D8436K977K8828J4280k8697l9126o952J2451J5337j0092j9680m0422j6828
14035c9488l90j3463l2020J4406O1560R261K5419p2084j3445R647k0024j7918
$$ plain form
14120 20668 51178 92500 97101 70686 47461 6309 9638 36802 21890 -3644 -24185 2578
14108 2578 -1008 -37810 -61861 -74773 -60712 -82008 -63428 17848 -566 -12191 26506 50256
14096 50256 -5157 5354 9599 30301 -1132 -17322 -47919 -46948 -42384 -11531 9196 31188
14084 31188 4905 -64330 -41704 -20604 -47776 -66090 -63502 -27063 19052 73724 29334 -8029
14072 -8029 -12222 31411 -23870 -20112 17577 25041 5919 13510 -18869 -64147 -79758 -34284 -12238
14059 -12238 1036 39415 62128 12513 22151 12950 -42154 -33178 5417 44956 30285 48436
14047 48436 51413 80241 94521 65824 26698 19746 32197 47534 37442 17762 -22660 -39488
14035 -39488 -39878 -53341 -85361 -70955 -9395 -134 25285 -46799 -60244 -50597 -70621 -88539
14023h8539r175L2666L3155L2393L7312k8460J2823L1003m1267l1379M2335k3387
14011e20L131O9058L7631n685k9222o5894m6363K4454M6854J9284M239j3553k6840
13998A6574K4203J3413l6924r373J1161O392J0549K3469r977o3009l2268J7572
13986b8218J0392K8748L4464K8397N344k940J2594o0036k1399l5306K6050L1418
13974B9508k0566J0152R416M5802J4078n4141m092o416K8568n5398j6680k2264
13962d2033J4241M3920k9416L5812K3941j7936K903L3599m7249o5709N408M4119
13950A600j0416k0378m193l9154L8739L2696P10l5707n8257n077L9111M6068l5399
13937d9657l4049L5142N5530k2460M0451j1995r367O920k6471K144m7j1340J5201
$$ plain form
14023 -88539 -97714 -65048 -31893 500 37812 9352 22175 53178 11911 -19468 22867 -520
14011 -520 2611 71669 109300 103615 74393 8499 -37864 -13410 33444 52728 56967 43414 16574
13998 16574 40777 54190 17266 7893 19054 25446 35995 59464 49487 -13522 -45790 -28218
13986 -28218 -17826 10922 45386 73783 79127 76187 88781 28745 7346 -27960 -1910 29508
13974 29508 8942 19094 28510 74312 88390 34249 30157 23741 52309 -3089 -19769 -42033
13962 -42033 -27792 16128 -13288 22524 46465 28529 31432 65031 17782 -47927 -42519 1600
13950 1600 -8816 -29194 -33387 -72541 -33802 -1106 -396 -36103 -94360 -99437 -60326 -14258 -49657
13937 -49657 -83706 -48564 6966 -15494 24957 12962 3595 10515 -15956 -13812 -13859 -25199 -9998
13924i998k5018n4268j0682k812P479M4022K079K1887n949q101K8810m237o7520
13911h4308l1054N3670j4431L9962M7978J041Q123k0582K2686j1428l3181N12
13899b1012n906k7787n028L1966K6142J629m159L8494n320j980M4890l160l9421
13886B9348J947L3745J5726n810J425J0620n2859k1805j656j2236j4872k0177
13874c6604j9086J2565J2315J0955l9897j8464O229j696k7987J2879m2803N1535
13862h0059M0548L3444J6686l9292j4207j2655k8804J4113J9163K8718N8385j6790
13850A9250l5339k304R723M5246N226l3021r542J9375O061k3662l3379l1211L4125
13837b9452k711j8684P7725M7891k9078r3675P74J9402K5054Q1883J0932p1064
$$ plain form
13924 -9998 -35016 -89284 -99966 -102778 -95299 -51277 -49198 -27311 -33260 -41361 -12551 -16788 -84308
13911 -84308 -115362 -61692 -76123 -36161 11817 12858 20981 399 23085 11657 -21524 -21012
13899 -21012 -26918 -54705 -59733 -27767 -1625 4 -4155 34339 29019 27039 71929 68769 29348
13886 29348 31295 65040 80766 74956 76381 87001 34142 12337 10681 -1555 -16427 -36604
13874 -36604 -55690 -43125 -30810 -19855 -59752 -78216 -71987 -73683 -101670 -88791 -131594 -80059
13862 -80059 -39511 -6067 10619 -28673 -42880 -55535 -84339 -70226 -51063 -22345 36040 19250
13850 19250 -16089 -18393 -8670 36576 41802 8781 -761 18614 24675 1013 -32366 -63577 -29452
13837 -29452 -32163 -50847 26878 74769 45691 -47984 -47210 -27808 -2754 79129 90061 18997
13825A8997k7276j4544J6529K1428K5688J2986m5876K9108L6437j1357O798l3839
13813C5079o3962o252L9742O025j5053j8570L8491K7317l2358m2022q492n2657
13801i2712l056K1059Q2661L3776o605l8841j644K7679K4085j3882o3572l1568
13789f2620K4849j825j0141Q7903K4677n6313k8665M2804k3971j5656K1537P093
13777I672o911J7808O0544O4123k2726j08380p1226L9107K8931K931K2584K7577
13765F4034p5906l1584M0443K6470k4756K1581J1103k2650J3900M3398N029k7542
13753D3520o7584n8946J1846M3009k4397l2806M059J7516K8894L7388R1438P1735
13741A65672R270p7415k9085R367K4433l4766l9836l8997n820L3681k4767o567
$$ plain form
13825 18997 -8279 -22823 -6294 15134 40822 53808 7932 37040 73477 62120 68918 35079
13813 35079 -28883 -35135 4607 10632 -4421 -22991 15500 42817 10459 -31563 -40055 -92712
13801 -92712 -95768 -74709 7952 41728 35123 -3718 -5362 22317 46402 32520 -31052 -62620
13789 -62620 -37771 -39596 -49737 38166 62843 6530 -22135 20669 -3302 -18958 2579 9672
13777 9672 2761 20569 81113 145236 122510 14130 -57096 -17989 10942 13873 36457 64034
13765 64034 -11872 -43456 -3013 23457 -1299 20282 31385 8735 22635 66033 71062 43520
13753 43520 -24064 -83010 -71164 -28155 -52552 -85358 -81299 -63783 -34889 2499 93937 165672
13741 165672 174942 97527 68442 77809 102242 67476 27640 -11357 -17177 16504 -8263 -14830
13729a4830m053j2371j0606N6661M8361m302j5733J5604R289q817J1955l0776
13717D0382O858o203N173J6362J2978m7602K6317K8405J2967K3383r664o5839
13705D3517j4672o607k4308l955L403n4457N0699J6911K1797n1515k9035j8910
13693f7132L9622L5079l8542K9002N0869j2010l6650l7669k9332M4645L6466M49
13681A4797J1117k4114l609L1146j3989k1388L3090k2348o1148J4931P4879N0569
13669H3933j317R266l5549o6863l3677k2978L184K7966k804k6762J839K9785J8165
13656a5812L0075K5899K8808n244m6679m8562J2761J4493L7443k1515j0077k1142
13644a9552J0981J4299K775K4394L2141j1883J1294k8960p158M5042k0641j7863
$$ plain form
13729 -14830 -18883 -31254 -41860 14801 63162 58860 43127 58731 68020 59203 71158 40382
13717 40382 47240 41037 46210 62572 75550 27948 54265 82670 95637 119020 109356 43517
13705 43517 28845 22238 -2070 -6025 -2622 -57079 -6380 10531 32328 -19187 -48222 -67132
13693 -67132 -27510 7569 -30973 -1971 48898 36888 238 -37431 -66763 -22118 14348 14797
13681 14797 25914 1800 -1809 29337 15348 -6040 27050 4702 -56446 -41515 33364 83933
13669 83933 82616 91882 56333 -10530 -44207 -67185 -64001 -36035 -38839 -65601 -63762 -33977 -15812
13656 -15812 14263 40162 68970 63726 17047 -31515 -18754 -4261 33182 11667 1590 -19552
13644 -19552 -8571 5728 8503 32897 65038 53155 64449 35489 28331 73373 52732 34869
13632C4869j9422k8613K0858j1163j205J531p4050k0745K8894L1332N6881K3114
13620D2281m5140k7721L7983K1824j0263m1251n6046N1924l0794m7135j3114J4857
13608a02595K4197L6430J3684o743L107n1586M1493P4643k3250k2679K4810L4280
13596D5791M8637N0306l312j2312m0819m7741o1624J0905J0670l4424J1356N4096
13584C1529j4550O1034O129m6431N285N854J5357L0529j4775k8290m8219m82J801
13571D771k2696L3666L8755K9279l3044O83j488J7970L0126j451n4394P484L3268
13558H2929o7979l1957j1735R597J530O210J9109m3867l2985k7319J9829J3795
13546f2843J4809k1542L2677J4029j112M8058L237J1651K8888L218L54J518L747
$$ plain form
13632 34869 15447 -13166 7692 -3471 -4676 -3145 -77195 -97940 -69046 -37714 19167 42281
13620 42281 -2859 -30580 7403 29227 18964 -22287 -78333 -26409 -57203 -104338 -117452 -102595
13608 -102595 -78398 -41968 -28284 -35027 -31920 -83506 -42013 32630 9380 -13299 11511 45791
13596 45791 94428 144734 141422 129110 88291 40550 -21074 -10169 501 -33923 -22567 31529
13584 31529 16979 78013 84142 37711 42996 48850 64207 94736 79961 51671 3452 2970 4771
13571 4771 -17925 15741 54496 83775 50731 51414 49926 67896 98022 96571 42177 49661 82929
13558 82929 14950 -17007 -28742 -19145 -17615 -11405 7704 -36163 -69148 -96467 -76638 -62843
13546 -62843 -48034 -69576 -36899 -22870 -23982 24076 27313 38964 67852 71070 71424 72942 76689
13533G6689J9580n0507m8983k8035k0837P478L3027O843k1326j3998j943K4720
13521a7292K4605L633j2695J5822j6389L716K697J8001M4907L3821L369k1569
13509H2626p562l0029N459L634j7575O2319m469n094N859k6117j831k6445k8670
13496A2105l0721j7084n6646q429N5885L9639R186J3302m030J3507m2787n7306
13484g3379L0284P3877r666j4113m2585k9050J3706L6050j4602o959K6799J9094
13472I456j3961m2876J3166j4497k0671M0880L5208K7271l4756l5811J9987L423
13460a3181k0064J1583K931m2890L6434M4305n3637m3231k8798K494o485L9221
13448g1318K3773m006k0060N028R80k832q562M5054L0696J2095l9854N513K3456
$$ plain form
13533 76689 96269 45762 -3221 -31256 -52093 -44615 -11588 -4745 -26071 -40069 -42012 -17292
13521 -17292 7313 10946 -1749 14073 -2316 1400 4097 22098 67005 100826 104195 82626
13509 82626 75064 45035 50494 54128 36553 98872 94403 89309 95168 69051 67220 40775 12105
13496 12105 -18616 -35700 -92346 -100775 -44890 -5251 3935 17237 13207 26714 -16073 -73379
13484 -73379 -43095 30782 21116 7003 -35582 -64632 -50926 -14876 -29478 -36437 -9638 9456
13472 9456 -4505 -47381 -34215 -48712 -69383 -28503 6705 33976 -780 -36591 -16604 -13181
13460 -13181 -33245 -21662 -18731 -61621 -25187 19118 -34519 -77750 -106548 -104054 -110539 -71318
13448 -71318 -47545 -51551 -71611 -66583 -65603 -68435 -76997 -31943 -1247 10848 -29006 -23493 -37
13435c7L5126k5222l9966q946N1175k6743J853L255K5255Q800k9548N3197j5414
13422C2785k7095K8258n035j8735o880J5931J392J0852K0171j268Q121n3857K1
13409D661j1623J1861k2631l0715O942K6832P437L7127q511K3377K1255J3349
13397G9361m1469n2411j9233J2339J1248J0871l3253k1375O1182K5133J9474N0128
13385A01995n2533m6779J7534j252K107M0463m0371k4802N207O385L793k4531
13373a2784m8844l3595N3729J7230m2749M8394O0333k6119k0443k8137N4678P280
13361B8973L115k4962n0746K8854O8644l2917q1954k0239L3152K1542m2776j4220
13349h3534L7418L711l8745M5944N6783j1114j1071j8970l9925k5l3177m5134
$$ plain form
13435 -37 35089 9867 -30099 -39045 12130 -14613 -12760 -9505 15750 24550 -4998 48199 32785
13422 32785 5690 33948 28913 10178 3298 19229 20621 31473 51644 50376 58497 4640 4661
13409 4661 -6962 4899 -17732 -48447 -41505 -14673 -7236 29891 21380 44757 66012 79361
13397 79361 37892 -14519 -33752 -21413 -10165 706 -32547 -53922 7260 32393 51867 101995
13385 101995 49462 2683 20217 18965 21072 61535 21164 -3638 1569 7954 11747 -12784
13373 -12784 -61628 -95223 -41494 -24264 -67013 -18619 41714 15595 -4848 -32985 21693 28973
13361 28973 32088 7126 -43620 -14766 53878 20961 -60993 -81232 -48080 -26538 -69314 -83534
13349 -83534 -46116 -42405 -81150 -35206 21577 10463 -608 -19578 -59503 -59528 -92705 -137839
13337a37839M909N891K9420k4769p555O6260M2182K1344J5462n125l6782k1067
13325d7669l7214q512M5066J3300K3544p758J6791O290M7886j5738M480P1896
13313A12362l6611k2299q025m7960j0402J1281N4075K6906q264q8016k0529j1631
13301d9113N1889k7481k4171K5260J3819O53K4365L0421k4743M857K0440k4697
13289B1499j8446j6217L2825P420k0808k6881Q414M2078O0433j9675n6264j8552
13277d174M1373J3085j5369k4672k6398l2812K8728k584p311q437M449K0130J8690
13264D698m3406M6004K3364n8601k4959L159r882J9138L4693L7731K307k5258
13252H988K9424L1074k1244O288j4201n197Q7590l6111J050j8047o8375P387P597
$$ plain form
13337 -137839 -132930 -127039 -97619 -122388 -129943 -63683 -21501 -157 15305 10180 -26602 -47669
13325 -47669 -84883 -93395 -48329 -35029 -11485 -19243 -2452 3838 51724 35986 40466 112362
13313 112362 75751 53452 45427 -2533 -12935 -1654 52421 79327 71063 -16953 -37482 -49113
13301 -49113 2776 -24705 -48876 -23616 -9797 -9144 15221 45642 20899 25756 46196 21499
13289 21499 3053 -13164 19661 27081 6273 -20608 -12194 29884 90317 70642 14378 -4174
13277 -4174 37199 50284 34915 10243 -16155 -48967 -20239 -22823 -30134 -38571 -34122 -13992 4698
13264 4698 -38708 7296 30660 -27941 -52900 -49741 -59623 -40485 -5792 31939 34246 8988
13252 8988 38412 69486 48242 54530 40329 35132 122722 86611 87661 69614 1239 8626 16223
13239A6223J0732j0658j9286k1927n026J3093L325j7247n19N5159N956o8573o672
13226d5420l658l710l3546J8910M3744N6321N8308r233r580j3686j6074l1524
13214A0852k0878M4682L3872l5820k6813K4125M4931N9616R896m0814m2458o2520
13202a329l3835J0920j7966M9805K4536L299j2332J8715m4294j9734J8012M1457
13190C7254K2159J0538L8958r259m8329J9002l3894m1741J9908N6883N474l0053
13178D6900j4665L7086N7517L819l5181n0928l5241k9582l598K8691L890L188
13166A1896m587l3131p2550N801j4887K7076P3114M8213j7379R748J8334j7752
13154C3896n2104n0671m6507N1367O0301L9488m127q535l1161M763L0018K9185
$$ plain form
13239 16223 26955 16297 -2989 -24916 -29942 -16849 -13524 -30771 -31290 23869 29825 -38748 -45420
13226 -45420 -49078 -52788 -86334 -67424 -23680 32641 90949 81716 72136 58450 42376 10852
13214 10852 -10026 34656 68528 32708 5895 30020 74951 134567 144463 103649 61191 -1329
13202 -1329 -35164 -24244 -42210 7595 32131 35430 23098 41813 -2481 -22215 -4203 37254
13190 37254 59413 69951 108909 99650 51321 70323 36429 -5312 14596 71479 76953 46900
13178 46900 32235 69321 126838 130657 95476 44548 9307 -20275 -23873 4818 8708 11896
13166 11896 7309 -25822 -98372 -92571 -107458 -80382 -7268 40945 23566 33314 51648 33896
13154 33896 -18208 -68879 -115386 -64019 -3718 35770 31643 23108 -8053 -3290 26728 55913
13142E5913M76k6496l2039k2588L7654K4801L6251M2354o732m1691J727n1202
13130A8428k4412J8098q112j3285n8432r826J6230o6413k647O1831N2473L3256
13118A7189L7982k0436q266O994k2118J1739m5519p3920N393P4006j4334k9681
13106f0971P876M2440P3162M2661m7455l8915l248J7534k5191j9893L283p952
13094a6669J5980J4049K3431Q843m6762l1805m178k6018J5166K7653L8178l972
13082A3896N491J5320n235r047M2878O724k8463J51J8954N415O923m5825m6837
13069a9655r628J3369K2075k624J3753L0761L0791Q577p5413N954K2294o197J9562
13056E3619n6270N27l506k644L3610P946J5438K1757j2863j7173p369j2175m0331
$$ plain form
13142 55913 56389 29893 -2146 -24734 12920 37721 73972 116326 109594 67903 69630 18428
13130 18428 -5984 12114 4002 -9283 -67715 -77541 -61311 -127724 -130371 -68540 -16067 17189
13118 17189 55171 34735 26469 33463 11345 23084 -22435 -96355 -90962 -16956 -31290 -60971
13106 -60971 -53095 -10655 62507 105168 57713 18798 15550 33084 7893 -12000 -8717 -16669
13094 -16669 -689 13360 36791 45634 -1128 -32933 -37111 -63129 -47963 -20310 17868 13896
13082 13896 19387 34707 29472 20425 63303 70027 41564 41715 60669 66084 73007 27182 -19655
13069 -19655 -29283 -15914 6161 3537 17290 48051 78842 87419 12006 17960 40254 34057 53619
13056 53619 -2651 -2124 -5630 -8274 25336 33282 48720 70477 57614 40441 33072 20897 -19434
13043a9434P222J2006L6818O205l5435k0219l0739j1263N409M739K4101K7853
13031G263J4999K0804N359n8915j630K3181o136m4840N4659j4267l1887N268j440
13018b7582M599J5746m098J0249J4573K0763L814M5513m3510o7607r053M0262
13006C669k9673j9441K7595L5209O3J1924q457n7178n4192K7767J0490N3017r903
12993i110o17N7380J2985o9023L2752R206k4607O341K0508R703r196o0487p3245
12980i7410L2534M5393r674m5255k9229K1500M1606j5306L1955l0674K658J6706
12968c5196l3106j3230M8527O0866O2124n255k6269m1072k3109N055J696L8329
12956C9360j1481n5558q375R50l9975k4794O3970J9053k2701j3377m288O4546
$$ plain form
13043 -19434 -12212 -206 36612 42817 7382 -12837 -43576 -54839 -49430 -44691 -20590 7263
13031 7263 22262 43066 48425 -10490 -12120 11061 4925 -39915 14744 477 -31410 -26142 -27582
13018 -27582 -22983 -7237 -11335 -1086 13487 34250 38064 83577 40067 -27540 -36593 3669
13006 3669 -26004 -45445 -17850 17359 17422 29346 20889 -36289 -90481 -62714 -52224 793 -9110
12993 -9110 -9727 47653 60638 -8385 24367 33573 8966 15307 35815 45518 36322 -24165 -97410
12980 -97410 -64876 -19483 -29157 -74412 -103641 -82141 -40535 -55841 -23886 -54560 -51902 -35196
12968 -35196 -68302 -81532 -33005 27861 89985 84730 58461 17389 -5720 -665 1031 39360
12956 39360 27879 -27679 -36054 -35104 -75079 -99873 -35903 -16850 -39551 -52928 -57216 7330
12944G330K8167j2579l4208l4633j9248m3332K2091Q3010M953k8489n2194K241
12932g6891K6999J429N5083R4265J6521n0941n781l2765n501n4467o1714O108
12920h7655L5134M8690K1833o1180m0766N2224J0655k1750j4303Q370K0791L73
12908b7584j5750p53L4293L2247n5026k5875j0007L8414K4673L5936J5252l328
12896D2492k7682k1202k708O287p497O978J0740k7080j6290K2860O0598l832n4332
12883a0668K8423K5118J1733J6314k6084k6361k3826k6547n043l0679k1217J5469
12871g3368L4799L6637K927j4520Q661j478j6078m190K4679k186K5998K706l1278
12858f691M866P949l38L9067R106N5355k1183l7999l6711m4552L3916K2832j9304
$$ plain form
12944 7330 35497 22918 -11290 -45923 -65171 -108503 -86412 -3402 1551 -26938 -79132 -76891
12932 -76891 -49892 -48463 6620 100885 117406 66465 60684 27919 22418 -32049 -93763 -87655
12920 -87655 -52521 -3831 18002 -43178 -83944 -31720 -21065 -42815 -57118 -48748 -27957 -27584
12908 -27584 -43334 -44087 -9794 22453 -32573 -58448 -68455 -30041 -5368 30568 45820 42492
12896 42492 14810 -6392 -9100 -2813 -10310 -3332 7408 -19672 -35962 -13102 47496 43664 -10668
12883 -10668 17755 42873 54606 70920 44836 18475 -5351 -31898 -36941 -67620 -88837 -73368
12871 -73368 -38569 -1932 995 -13525 -4864 -6342 -22420 -26610 -1931 -4117 21881 24587 -6691
12858 -6691 -1825 6124 5786 44853 53959 109314 88131 50132 13421 -31131 2785 25617 6313
12845F313m6882L6928O2266M7004l2204n8456j2233m3798k2452K8645N5300N5395
12833G5826k6223K8688J9197L6756P032l5205k9621k0992m63m0544J2953O995
12821C4399j1949o2766j2300M1315J9128M16j0191o92j0326J3662J4323K4791
12809C9810M438k1351k5117l0055O019O6353k2976l3820J2524q161l2367N9963
12797A5260P1866O425p8476j9092L0811J9645L1239q562j9662p662L8457j2261
12785F7988n3399l8344N945N8923N7460m404r44k0870o3866j4442J906q908J9863
12772F908k1506j9708L1995L6625N0687k3112o5193J2713M7091K2016m4269k5758
12760H489K4215j7071j3524O7923K6380Q370J0305m3117n5225m0600M5903M1124
$$ plain form
12845 6313 -40569 -3641 58625 105629 73425 14969 2736 -41062 -63514 -34869 20431 75826
12833 75826 49603 78291 97488 134244 141276 106071 76450 55458 54995 14451 27404 34399
12821 34399 22450 -40316 -52616 -11301 7827 8243 -1948 -2640 -12966 696 15019 39810
12809 39810 44248 22897 -2220 -32275 -26256 40097 17121 -16699 -4175 -12336 -44703 15260
12797 15260 87126 93551 15075 -4017 26794 46439 77678 69116 49454 41792 80249 67988
12785 67988 14589 -23755 -17810 41113 98573 94169 93225 72355 8489 -5953 -4047 -12955 6908
12772 6908 -14598 -34306 -2311 34314 85001 61889 -3304 9409 56500 78516 34247 8489
12760 8489 32704 15633 2109 70032 96412 104782 115087 71970 16745 -23855 22048 63172
12748F3172o9835k1430K9484k1927l4371K3818N2443K7368L2925j5827J32P88
12736F6740J0157J367m0522l2325J9317J1288k7707k7097l447r558L42N637o283
12723c2091n190L602k9951J6174J5129r246L629k2175J4115j7651j2525K8164
12711d8016J2927K9766M482J0351M0272R028k9667L985O9721M910k9638j8337
12699E9784m46n9673j7446K76k1046k7794J0065j7610J3907M6711K2037l958M115
12686H922O0131K0814k3489k005J9477k1673m2864k4712R973j8953q7645k0219
12674a22243Q00k4562J2619j0207K1661L9947k1476M2202K4399J8885N4662M8179
12662H4866j3745j9248l9359o2324j6594K0282J8904J852o1937K5243M3140k3449
$$ plain form
12748 63172 -6663 -28093 1391 -20536 -54907 -31089 21354 48722 81647 65820 65952 66740
12736 66740 76897 78264 37742 5417 24734 36022 8315 -18782 -22229 -31787 -31445 -25808 -32091
12723 -32091 -37281 -33679 -63630 -47456 -32327 -41573 -37944 -60119 -46004 -63655 -76180 -48016
12711 -48016 -35089 -5323 -841 9510 49782 58810 29143 33128 102849 107759 78121 59784
12699 59784 59338 -335 -17781 -17505 -38551 -66345 -56280 -73890 -59983 -13272 8765 4807 8922
12686 8922 69053 89867 66378 64373 83850 62177 19313 -5399 4574 -14379 -102024 -122243
12674 -122243 -121443 -146005 -133386 -143593 -121932 -81985 -103461 -61259 -36860 -17975 36687 84866
12662 84866 71121 51873 12514 -49810 -66404 -46122 -27218 -25366 -87303 -62060 -18920 -42369
12650d2369O160L4631j2091Q143L4674L6465L8861R09l7933l1194L7988K1270
12638I5514l2713k9809j120N4049n7314r132L7849j8959k1482R577j5800k9780
12626a9120K6127N537l2704l7233j8323K1861j0584P2546M1583l875k6794m2885
12614b3864m7211J5008K5810J4549J500L8524N0476N322k7053q4154l7990K1351
12602d7732O70L7679J5550K336o299j0271N1130K3574K550k1298k4208K3017j7244
12589B9454m2714k127K5290j28k086o850j8291J642L3794n7503l3980N9953N4896
12576D1350m0390J9721N3973P156j4083m5228m839l820N6004m753j0426r549j3436
12563C1680R210k0466L630l7122p938m7642K2366j1242R144J6541L1837r801j4717
$$ plain form
12650 -42369 -36209 -1578 -13669 -5526 29148 65613 104474 105383 67450 36256 74244 95514
12638 95514 62801 32992 31872 85921 28607 19475 57324 38365 16883 26460 10660 -19120
12626 -19120 7007 12544 -20160 -57393 -75716 -53855 -64439 8107 49690 45815 19021 -23864
12614 -23864 -71075 -56067 -30257 -15708 -14208 24316 74792 80114 53061 -31093 -69083 -47732
12602 -47732 -47062 -9383 6167 8503 2204 -8067 43063 66637 69187 47889 23681 46698 29454
12589 29454 -13260 -15387 9903 9775 7689 839 -17452 -15810 17984 -39519 -73499 -13546 41350
12576 41350 960 20681 74654 81810 67727 22499 17660 13840 69844 65091 54665 45116 31680
12563 31680 40890 20424 24054 -13068 -21006 -68648 -46282 -57524 -48380 -31839 -2 -9803 -24520
12550b4520k6p478l1277l589L4100J4847o193L6176q982j1237k060O460O2724
12537E8945j1705q618J4496K5275m9092l5523O581M8690j3718m2606N9629J1360
12525F3714L4878l2334m2231l0693J8438j6653M0839Q968O655k67l7065p6746
12513f2497n6532M3540N4209J2037J1510L9348J2319k8560K648p2229k3001L5126
12501c2082r400L3551j0052n013L8174M1819j6705j0401l820J6684Q2574J17516
12489B42845J67297Q2338j0286n6172p6171m3797r1060n8890l6512o2756n6947
12478a11l4185l81L3489M0193l4290l4677j4309J4821N397N7006K9498j7662K4566
12465F9355k8478j2452r467k6005R513J4340K84J8209m4572o5789L5918N6390
$$ plain form
12550 -24520 -24546 -32024 -63301 -66890 -32790 -17943 -24136 12040 3058 -8179 -10239 -3779 58945
12537 58945 47240 38622 53118 78393 29301 -6222 359 49049 35331 -7275 52354 63714
12525 63714 98592 66258 24027 -6666 11772 -4881 35958 44926 51581 51314 14249 -62497
12513 -62497 -119029 -75489 -21280 -9243 2267 41615 53934 25374 28022 -44207 -67208 -32082
12501 -32082 -41482 -7931 -17983 -22996 15178 56997 40292 29891 26071 42755 125329 242845
12489 242845 410142 492480 482194 426022 349851 306054 214994 156104 119592 56836 -111
12478 -111 -34296 -34677 -1188 39005 4715 -29962 -44271 -29450 -24053 32953 62451 44789 69355
12465 69355 40877 28425 18958 -7047 2466 16806 17090 35299 -9273 -75062 -39144 17246
12453A7246L105J4460K3174l2604o9880j0397N9939J9068N2728n709j1418J9444
$$ plain form
12453 17246 20351 34811 57985 25381 -44499 -54896 5043 24111 76839 71130 59712 79156
$$ [...]
##END NTUPLES=NMR SPECTRUM
##END=
