##TITLE=Analysis number 309917
Compound Code cc 13113
Book Reference 335/184
Project Code adrs
Chemist Name davee
##JCAMPDX= 6.0         $$ Bruker NMR JCAMP-DX V2.0
##DATA TYPE= NMR SPECTRUM
##DATA CLASS= NTUPLES
##ORIGIN= Bruker BioSpin GmbH
##OWNER= NMR
$$ XWIN-NMR		Version 3.5
$$ Wed Jun  8 11:27:16 2005 GMT Daylight Time (UT+1h)  MAYBRIDGE\NMR@NMR_250MHZ
##.OBSERVE FREQUENCY= 250.131544655141
##.OBSERVE NUCLEUS= ^1H
##.ACQUISITION MODE= SIMULTANEOUS (DQD)
##.ACQUISITION SCHEME= undefined
##.AVERAGES= 16
##.DIGITISER RES= 18
##SPECTROMETER/DATA SYSTEM= dpx250
##.PULSE SEQUENCE= zg30
##.SOLVENT NAME= CDCl3
##.SHIFT REFERENCE= (INTERNAL, CDCl3, 0, 16.522)
##AUDIT TRAIL= $$ (NUMBER, WHEN, WHO, WHERE, WHAT)
$$ ##TITLE= Audit trail, XWIN-NMR		Version 3.5
$$ ##JCAMPDX= 5.01
$$ ##ORIGIN= Bruker BioSpin GmbH
$$ ##OWNER= NMR
$$ C:\u/data/dgb/nmr/ADRS/3940/pdata/1/auditp.txt
$$ ##AUDIT TRAIL=  $$ (NUMBER, WHEN, WHO, WHERE, WHAT)
(   1,<2005-06-08 11:26:56.75 +100>,<MAYBRIDGE\NMR>,<NMR_250MHZ>,
      <created by zg, POWCHK disabled, PULCHK disabled
       configuration hash MD5:
       62 19 C7 07 E1 42 D1 B7 37 6C 3D D0 77 39 F9 E6
       data hash MD5: 64K
       27 51 88 10 30 F5 1F 44 7D F3 6B F0 3C 01 06 ED>)
(   2,<2005-06-08 11:27:07.89 +100>,<MAYBRIDGE\NMR>,<NMR_250MHZ>,
      <Start of raw data processing
       ef LB = 0.3 FT_mod = 6 PKNL = 1 SI = 32K 
       data hash MD5: 32K
       C4 EB A8 0B FC BB C9 8E 57 02 E7 36 A5 83 C3 27>)
(   3,<2005-06-08 11:27:09.50 +100>,<MAYBRIDGE\NMR>,<NMR_250MHZ>,
      <apk 
       data hash MD5: 32K
       A3 C4 4D FB 7C 77 7C F0 80 6A 54 9F A7 7B 32 F9>)
(   4,<2005-06-08 11:27:10.25 +100>,<MAYBRIDGE\NMR>,<NMR_250MHZ>,
      <abs ABSG = 5 
       data hash MD5: 32K
       3C AA 3F 09 C2 BD F4 4B 4C 22 60 62 13 10 37 A0>)
$$ ##END=
$$ 
$$ hash MD5
$$ 4F 3D EB CE 12 B6 06 62 C2 1C A2 3A 07 A4 DF 52
##$RELAX= 
##$RELAX= 
##$RELAX= 
##$RELAX= 
##$RELAX= 
##$RELAX= 
##$RELAX= 
$$ Bruker specific parameters
$$ --------------------------
##$DU= <C:\u>
##$EXPNO= 3940
##$NAME= <ADRS>
##$PROCNO= 1
##$TYPE= <nmr>
##$USER= <dgb>
##$AMP= (0..31)
100 100 100 100 100 100 100 100 100 100 100 100 100 100 100 100 100 100 
100 100 100 100 100 100 100 100 100 100 100 100 100 100 
##$AQSEQ= 0
##$AQ_mod= 3
##$AUNM= <au_zg>
##$AUTOPOS= <17 >
##$BF1= 250.13
##$BF2= 250.13
##$BF3= 250.13
##$BF4= 250.13
##$BF5= 500.13
##$BF6= 500.13
##$BF7= 500.13
##$BF8= 500.13
##$BYTORDA= 1
##$CFDGTYP= 0
##$CFRGTYP= 5
##$CHEMSTR= <none>
##$CNST= (0..31)
1 1 145 1 1 1 1 1 1 1 1 1 1 1 1 1 1 1 1 1 1 1 1 1 1 1 1 1 1 1 1 1 
##$CPDPRG= <>
##$CPDPRG1= <>
##$CPDPRG2= <>
##$CPDPRG3= <>
##$CPDPRG4= <mlev>
##$CPDPRG5= <mlev>
##$CPDPRG6= <mlev>
##$CPDPRG7= <mlev>
##$CPDPRG8= <mlev>
##$CPDPRGB= <>
##$CPDPRGT= <>
##$D= (0..31)
0 1 0 0 0 0 0 0 0 0.06 0 0 0 0 0 0 0.0002 0 0 0 0 0 0 0 0 0 0 0 0 0 0 
0 
##$DATE= 1118226415
##$DBL= (0..7)
120 120 120 120 120 120 120 120 
##$DBP= (0..7)
150 150 150 150 150 150 150 150 
##$DBP07= 0
##$DBPNAM0= <>
##$DBPNAM1= <>
$$ [...]
##$SUBNAM7= <"">
##$SUBNAM8= <"">
##$SUBNAM9= <"">
##$SW= 20.6930455092707
##$SWIBOX= (0..15)
0 0 3 0 0 0 0 0 0 0 0 0 0 0 0 0 
##$SW_h= 5175.983436853
##$TD= 65536
##$TD0= 1
##$TE= 295.16
##$TE2= 300
##$TE3= 300
##$TEG= 300
##$TL= (0..7)
0 120 120 120 120 120 120 120 
##$TP= (0..7)
150 150 150 150 150 150 150 150 
##$TP07= 0
##$TPNAME0= <>
##$TPNAME1= <>
##$TPNAME2= <>
##$TPNAME3= <>
##$TPNAME4= <>
##$TPNAME5= <>
##$TPNAME6= <>
##$TPNAME7= <>
##$TPOAL= (0..7)
0.5 0.5 0.5 0.5 0.5 0.5 0.5 0.5 
##$TPOFFS= (0..7)
0 0 0 0 0 0 0 0 
##$TUNHIN= 0
##$TUNHOUT= 0
##$TUNXOUT= 0
##$USERA1= <user>
##$USERA2= <user>
##$USERA3= <user>
##$USERA4= <user>
##$USERA5= <user>
##$V9= 5
##$VALIST= <valist>
##$VCLIST= <CCCCCCCCCCCCCCC>
##$VD= 0
##$VDLIST= <DDDDDDDDDDDDDDD>
##$VPLIST= <PPPPPPPPPPPPPPP>
##$VTLIST= <TTTTTTTTTTTTTTT>
##$WBST= 1024
##$WBSW= 4
##$XGAIN= (0..3)
0 0 0 0 
##$XL= 0
##$YL= 0
##$YMAX_a= 424881
##$YMIN_a= -395319
##$ZGOPTNS= <>
##$ZL1= 120
##$ZL2= 120
##$ZL3= 120
##$ZL4= 120
##$ABSF1= 16.522
##$ABSF2= -4.171173
##$ABSG= 5
##$ABSL= 3
##$ALPHA= 0
##$AQORDER= 0
##$ASSFAC= 0
##$ASSFACI= 0
##$ASSFACX= 0
##$ASSWID= 0
##$AUNMP= <proc_1d>
##$AZFE= 0.1
##$AZFW= 0.1
##$BCFW= 0
##$BC_mod= 0
##$BYTORDP= 0
##$COROFFS= 0
##$CY= 12.5
##$DATMOD= 1
##$DC= 0
##$DFILT= <>
##$DTYPP= 0
##$F1P= 14.0000005364418
##$F2P= -0.99999901652339
##$FCOR= 0.5
##$FTSIZE= 32768
##$FT_mod= 6
##$GAMMA= 0
##$GB= 0
##$INTBC= 1
##$INTSCL= 1
##$ISEN= 128
##$LB= 0.3
##$LEV0= 0
##$LPBIN= 0
##$MAXI= 10000
##$MC2= 0
##$MEAN= 0
##$ME_mod= 0
##$MI= 0
##$NCOEF= 0
##$NC_proc= -4
##$NLEV= 6
##$NOISF1= 0
##$NOISF2= 0
##$NSP= 0
##$NTH_PI= 0
##$NZP= 0
##$OFFSET= 16.522
##$PC= 1
##$PHC0= -74.14555
##$PHC1= 5.842008
##$PH_mod= 1
##$PKNL= yes
##$PPARMOD= 0
##$PSCAL= 4
##$PSIGN= 0
##$REVERSE= no
##$SF= 250.13
##$SI= 32768
##$SIGF1= 0
##$SIGF2= 0
##$SINO= 400
##$SIOLD= 32768
##$SREGLST= <1H.CDCl3>
##$SSB= 0
##$STSI= 32768
##$STSR= 0
##$SW_p= 5175.98343685301
##$SYMM= 0
##$S_DEV= 0
##$TDeff= 65536
##$TDoff= 0
##$TI= <Analysis number 999999
Compound Code 99
Book Reference 9
Project Code 9>
##$TILT= no
##$TM1= 0
##$TM2= 0
##$TOPLEV= 0
##$USERP1= <user>
##$USERP2= <user>
##$USERP3= <user>
##$USERP4= <user>
##$USERP5= <user>
##$WDW= 1
##$XDIM= 32768
##$YMAX_p= 438452760
##$YMIN_p= -147079
$$ End of Bruker specific parameters
$$ ---------------------------------
##NTUPLES= NMR SPECTRUM
##VAR_NAME=  FREQUENCY,     SPECTRUM/REAL,   SPECTRUM/IMAG
##SYMBOL=    X,             R,               I
##VAR_TYPE=  INDEPENDENT,   DEPENDENT,       DEPENDENT
##VAR_FORM=  AFFN,          ASDF,            ASDF
##VAR_DIM=   32768,         32768,           32768
##UNITS=     HZ,            ARBITRARY UNITS, ARBITRARY UNITS
##FACTOR=    0.157963299565203, 1,           1
##FIRST=     4132.6476996994, 0,             0
##LAST=      -1043.33573715361, 0,           0
##MIN=       -1043.33573715361, -147079,     0
##MAX=       4132.6476996994, 438452760,     0
$$ Real data points
##PAGE= N=1
##DATA TABLE= (X++(R..R)), XYDATA
$$ [...]
18450E94524K3519k5120j4914K2883j2707m1632K7218J2725O217Q160K6319Q612
18438F35804L7223K6104p037l0815m8446m477K9510K3891J3776j343m8103q9998
18426E36089l8946M0607J792p1323m5801j7694k8873k5726k6437J7258P032j1498
18414C36480l3083k3819o291l0371R071j8931o54J2444O1150L4918m8715k5820
18402B66379N238p692j6448l201p887J9786J7055k767l4700m5017J7104L2801
18390B40651N7685L0503p010j1706K0381n713J4550j4233k3974o298q991k7995
18378B57850r627m680J2863j5338k8981L259l8498m0695J1560L2092O1308P030
18366B48143l1381j6153k5636L8579M2995j2219k5542K175L367k8814Q10L5812
$$ y = [594524, 618043, 592923, 578009, 600892, 588185, 546553, 573771, 586496, 592713, 600873, 627192, 635804, 673027, 699131, 692094, 661279, 612833, 608356, 637866, 661757, 675533, 674190, 626087, 536089, 497143, 537750, 539542, 468219, 422418, 404724, 375851, 350125, 323688, 340946, 347978, 336480, 303397, 279578, 273287, 242916, 251987, 233056, 232402, 244846, 305996, 340914, 292199, 266379, 271617, 263925, 247477, 244276, 236389, 256175, 273230, 270463, 235763, 190746, 207850, 240651, 298336, 328839, 321829, 310123, 330504, 324791, 339341, 325108, 301134, 294836, 285845, 257850, 248223, 243543, 256406, 241068, 212087, 215346, 176848, 136153, 147713, 179805, 241113, 248143, 216762, 200609, 174973, 213552, 256547, 244328, 218786, 220961, 224328, 195514, 196324, 232136]
18354B32136o06j8666m8939j8270j436j3809P106L145K6086K3205L1403K3241
18342B44596k0206J030O122j9480l6055l7935m1876j999O2887P1193J0018J4769
18330B53064k1885J723n255j191j215L942R069K0058l454J4125j9730m2114j8826
18317A88311N264K8676J7319J5953K4263M7390J0045n562j4681k5865j7733k1314
18305B52066J8785j3035j4742J9737O9226O8772P2712N3302N5535M0958O634l2509
18293E97441l4851L4002K1788N3671M2302j845p351n8648n5534m7805n8400o8505
18281D16265j1018P871k2648l252k248J3874L842L9130N417J0137M3859Q0154
18269E81383J30979J24712J02514N9863K9939k7031r7J0307o75K4036Q2656N2470
$$ y = [232136, 231530, 212864, 163925, 145655, 144219, 130410, 137516, 140661, 166747, 189952, 221355, 244596, 224390, 225420, 231542, 212062, 176007, 138072, 96196, 94197, 157084, 228277, 238295, 253064, 231179, 232902, 227647, 226456, 225241, 229183, 238252, 258310, 254856, 268981, 249251, 207137, 188311, 193575, 222251, 239570, 255523, 279786, 327176, 337221, 331659, 316978, 291113, 273380, 252066, 270851, 257816, 243074, 262811, 332037, 400809, 473521, 526823, 582358, 623316, 629950, 597441, 562590, 596592, 618380, 672051, 714353, 712508, 705157, 646509, 590975, 543170, 484770, 416265, 405247, 413118, 390470, 387218, 384970, 398844, 402686, 441816, 447233, 457370, 501229, 581383, 712362, 837074, 939588, 999451, 1029390, 1002359, 1002262, 1012569, 1011894, 1035930, 1118586, 1171056]
18257A171056M516j8616l8596o9525j16519q7090n6123l7165k7263J7125n763
18246G36037r986j4130L0933M5144J6484j6663l255M6013L7890N1889L5507Q552
18234I64415j5928O315J034J5102M0105L9568L3056J9268J2032K4361M5373J3934
18222A198635k2539L9694N0931Q3885N5147N9154K7305L7521J14810J50865J15683
18211A911091Q4595J14349M9512K0773M4726M0949K4184M6175Q3629J83251J78973
18200B782207J52047K33917L11195L44578M31872N69280N96293O37462Q02323
18191F861174R33846J141775J485073K087472L107149M799575P403421J0843036
18183C8662521J2882080J3106205J0341982K844583l820462r449256j1848561
$$ y = [1171056, 1175572, 1156956, 1118360, 1048835, 932316, 845226, 789103, 751938, 724675, 741800, 736037, 726051, 711921, 742854, 787998, 804482, 787819, 784564, 830577, 868467, 920356, 955863, 964415, 948487, 954802, 955836, 970938, 1011043, 1050611, 1083667, 1102935, 1114967, 1139328, 1184701, 1198635, 1176096, 1215790, 1266721, 1350606, 1405753, 1464907, 1492212, 1529733, 1644543, 1795408, 1911091, 1995686, 2110035, 2159547, 2180320, 2225046, 2265995, 2290179, 2336354, 2419983, 2603234, 2782207, 2934254, 3168171, 3479366, 3823944, 4255816, 4825096, 5421389, 6058851, 6861174, 7795020, 8936795, 10421868, 12509340, 15616489, 20416064, 27819485, 38662521, 51544601, 64650806, 74992788, 77837371, 74016909, 64567653, 52719092]
18176E2719092j0926986q469528n800175l580577j952644o94595M77651J718405
18168B3490643L326863N527285Q849775J2759070J4598530J4582249J0185568
18161I3319983J676255n348210j1017037j2513073j0348856o355023j655259L434700
18153E1193480Q910908J2467813J3408637J1237721L176618m441278j0869984
18146H5083915j4082545j3345688j0690158p689225n010102k961190j493479q0457
18138B9731071J423522L216425N650258R338717J3965003J6433013J6351787J2001567
18130A08111363J892509o752073j3837441j6649675j5279603j2055701q645274
18123C6784105n872864m018280k805398j946134j305753q18920l54700N2314M60266
$$ y = [52719092, 41792106, 33322578, 27522403, 23941826, 21989182, 21294587, 21772238, 23490643, 26817506, 32344791, 41194566, 53953636, 68552166, 83134415, 93319983, 94996238, 89648028, 78630991, 66117918, 55769062, 49414039, 47758780, 51193480, 60104388, 72572201, 85980838, 97218559, 100395177, 95953899, 85083915, 71001370, 57655682, 46965524, 39276299, 34266197, 31305007, 29811528, 29731071, 31154593, 34371018, 40021276, 49359993, 63324996, 79758009, 96109796, 108111363, 110003872, 103251799, 89414358, 72764683, 57485080, 45429379, 36784105, 30911241, 26892961, 24087563, 22141429, 20835676, 20016756, 19662056, 19714370, 20174636]
18114B0174636J010345J801772L205966N477269R559376J5928637J2419210j577405
18106F7999806j0090250j2781743j1068967p471483m692440l168887k254066j723778
18098A4748192j322713r79644p53447o41100n88078n28683m92706m76774m53092
18089H511955m65162m13403l93267l27924k82200l05867k53109k51909k32413
18080E586701k32549j55887j81221k00326j86355r9060q7102m0232m4763j38090
18070D221116j71067j35885j81057j25372j40190j62201j62105j44414j64722
18061B834103j11378j02866j39336j01704r1194j03762o7218m1325m7558r5033
18051A932729q3156r5952o1110n9174p6321q2055p0903l2166m3545j9002l4079
$$ y = [20174636, 21184981, 22986753, 26192719, 31669988, 41229364, 57158001, 69577211, 67999806, 57909556, 45127813, 34058846, 26587363, 21894923, 18726036, 16471970, 14748192, 13425479, 12445835, 11692388, 11051288, 10463210, 9934527, 9441821, 8965047, 8511955, 8046793, 7633390, 7240123, 6912199, 6629999, 6324132, 6071023, 5819114, 5586701, 5354152, 5198265, 5017044, 4816718, 4630363, 4531303, 4444201, 4403969, 4359206, 4221116, 4050049, 3914164, 3733107, 3607735, 3467545, 3305344, 3143239, 2998825, 2834103, 2722725, 2619859, 2480523, 2378819, 2287625, 2183863, 2116645, 2075320, 2027762, 1932729, 1849573, 1753621, 1692511, 1633337, 1557016, 1474961, 1404058, 1371892, 1328347, 1309345, 1275266]
18040A275266n6850l3091J088J741j1953m9618k3391J0945J0113j4136l5175m0075
18028A034864J5945K1954j0450J5890j8189n9571n8013k2911l5630k6139k4272
18017H33478l1120j5621p380L9628j6885p8425k6235K1599M4781n928J9595L790
18005G81277L0030l153o360l6497k5587j9418J867q411j0603P06M9209M3109J0276
17992H06445L1457n947j8644k9828J0993J5346p160J543j3099k5511o3045J6116
17980G18666j5798j4926J5815J7551L3640K5013k70J7203j5878l4385p663m66
17968G38502l1558J4861J4891J8364K0823K0288L7631M0702M495O868M8885j3838
17956I20914k7302k6051K1652r31P511N5370M8363O2811M6329L0029J6815q182
$$ y = [1275266, 1218416, 1185325, 1186413, 1188154, 1176201, 1126583, 1103192, 1114137, 1124250, 1110114, 1074939, 1034864, 1050809, 1072763, 1062313, 1078203, 1060014, 1000443, 942430, 919519, 883889, 857750, 833478, 802358, 786737, 779357, 818985, 802100, 723675, 697440, 719039, 763820, 757892, 777487, 781277, 811307, 808154, 801794, 765297, 739710, 720292, 722159, 713748, 703145, 703851, 753060, 796169, 806445, 837902, 831955, 813311, 783483, 794476, 809822, 802662, 804205, 791106, 765595, 702550, 718666, 702868, 687942, 703757, 721308, 754948, 779961, 779691, 796894, 781016, 746631, 738968, 738502, 706944, 721805, 736696, 755060, 775883, 796171, 833802, 874504, 878999, 885867, 934752, 920914, 893612, 867561, 889213, 888282, 895793, 951163, 999526, 1062337, 1108666, 1138695, 1155510, 1147328]
17944A147328J3061K6653L9380q005j1696K8553M2030J5605K9741N5016L3097
17933A410763K1636J7874k6728M5815K3298K2547K2228M7916L1492L9536M5567
17922A701944M4074M2030P6548J04389P4991J16664J06435Q1489J07634O8582
17912B524780J04296J65990J82941J46197J15058J44697J72349J96856J80556
17903C933720K21668L01407L29355L73254M09787M97189O08879P20900R35174
17894H331333J266499J792441K558167L613738N173565P220633P092364M116190
17886D1164930K239851K800510O086601J1583512J3937993R405405M239117j136040
17878I0321879l341920p02126L764910O888699Q394532K527602n099254p192335
$$ y = [1147328, 1160389, 1187042, 1226422, 1218417, 1206721, 1235274, 1277304, 1292909, 1322650, 1377666, 1410763, 1432399, 1450273, 1423545, 1469360, 1492658, 1515205, 1537433, 1585349, 1616841, 1656377, 1701944, 1746018, 1788048, 1864596, 1968985, 2043976, 2160640, 2267075, 2348564, 2456198, 2524780, 2629076, 2795066, 2978007, 3124204, 3239262, 3383959, 3556308, 3753164, 3933720, 4155388, 4456795, 4786150, 5159404, 5569191, 6066380, 6675259, 7396159, 8331333, 9597832, 11390273, 13948440, 17562178, 22735743, 29956376, 37048740, 41164930, 43404781, 46205291, 52291892, 63875404, 77813397, 87218802, 91457919, 90321879, 86979959, 86277833, 90042743, 96931442, 105325974, 107853576, 102754322, 95561987]
17870I5561987m312046o51482J085407k92197k527921j245720L406858N397871
17862I6422757K223503j228766m886436n369509k039482J941873M196291M315546
17854I5575777k223417r029714j1182973r423606n293676j708903k356480n072846
17846D9284162o562674o453540n327635l952325k825070k020617j567034j224583
17838A9350684j031428q89695p74976o62961o48280o08888m98328m55664m70711
17829A3309753m13245m03311l06583k88675l59030l58676l65991l44307k54949
17820A0214986k33331l04989k57251k70863l34923k86069k78767k38769k00402
17811G809622k19405k49602j98226j34312j10282r2559q3123o2052r1495j08082
$$ y = [95561987, 91249941, 90598459, 91683866, 91391669, 88863748, 87618028, 91024886, 96422757, 98646260, 97417494, 92531058, 87161549, 85122067, 87063940, 91260231, 95575777, 93352360, 84322646, 73139673, 63716067, 58422391, 56713488, 54357008, 49284162, 42721488, 36267948, 30940313, 26987988, 24162918, 22142301, 20575267, 19350684, 18319256, 17429561, 16654585, 15991624, 15343344, 14734456, 14236128, 13780464, 13309753, 12896508, 12493197, 12186614, 11897939, 11538909, 11180233, 10814242, 10469935, 10214986, 9981655, 9676666, 9419415, 9148552, 8813629, 8527560, 8248793, 8010024, 7809622, 7590217, 7340615, 7142389, 7008077, 6897795, 6805236, 6722113, 6660061, 6568566, 6460484]
17801F460484l6007k8355o602P4833J48970J82222J49745R2750J35850J82646
17791G356536K18163K83519L35162N03435O31995Q06463J129107J588065K222464
17782A5074909L169048M547504O642301J0061455J4302725J6076132J6359962
17775H6234036J4926411O900653L9334m567403o883351m090344K20204K946252
17767I5725792N356829K145386m183493q583895j2510586j3761776j2286856r700413
17759D2200988o976927m746490l189164k093550j273855n22251J64671R42663
17751B4506085J867998L053465M793179P495239J1120211J3095697J3382298J2889165
17743I2203337O699682M79204l479383n936808m110359k63338K228961M534846
$$ y = [6460484, 6424477, 6396122, 6389520, 6464353, 6613323, 6795545, 6945290, 7038040, 7173890, 7356536, 7574699, 7858218, 8193380, 8696815, 9328810, 10135273, 11264380, 12852445, 15074909, 18243957, 22791461, 29433762, 39495217, 53797942, 69874074, 86234036, 101160447, 108061100, 108100434, 103533031, 96649680, 92559336, 92779540, 95725792, 101082621, 103228007, 99044514, 90460619, 77950033, 64188257, 51901401, 42200988, 35224061, 30477571, 27288407, 25194857, 23921002, 23398751, 23563422, 24506085, 26374083, 29427548, 34220727, 41715966, 52836177, 65931874, 79314172, 92203337, 98903019, 99382223, 95902840, 89966032, 85855673, 85592335, 87821296, 92356142]
17735I2356142K517847l271885p266579j0988732j2610488j1485481r327558o890639
17727C3032627m847861l519369k634179k059496j645114j282832r95239q62014
17719A5186523p35938o40939o24480n27295m86300m72119m05528l99433l19655
17710A0574836k89673k60117k16368k11516k81668k58488k56015l31210l37360
17701H132421k69562k65278k31656k23963k61163k91622l06803k85449k80199
17692E716726k80955k48224k47481k68390k02700j92172k40862j99034j67305
17683C669603j63087j30740j40273j63344j57887j35675p7850j02926j19611j01732
17673B376478o3782p6817p3975o5078j11110p0073j5365m5898p1672r9775o1418
$$ y = [92356142, 94873989, 91602104, 84335525, 73346793, 60736305, 49250824, 39923266, 33032627, 28184766, 24665397, 22031218, 19971722, 18326608, 17043776, 16048537, 15186523, 14450585, 13809646, 13185166, 12657871, 12171571, 11699452, 11293924, 10894491, 10574836, 10285163, 10025046, 9808678, 9597162, 9315494, 9057006, 8800991, 8469781, 8132421, 7862859, 7597581, 7365925, 7141962, 6880799, 6589177, 6282374, 5996925, 5716726, 5435771, 5187547, 4940066, 4671676, 4468976, 4276804, 4035942, 3836908, 3669603, 3506516, 3375776, 3235503, 3072159, 2914272, 2778597, 2700747, 2597821, 2478210, 2376478, 2312696, 2235879, 2161904, 2096826, 1985716, 1915643, 1900278, 1854380, 1782708, 1682933, 1621515]
17662A621515p6242m4804m3474l3144n3350m8252r0470o1419j1521J4982j0194
17651A163627q22k0106o8558k5840N344J2974j6708n4310m1022o7442l3012j3461
17639H40664k0599n117k9647k4969m7286m3696n8430m9902k5872k0077R484j4053
17627E10500o204J5782N0625N187j3702p293M0045K9967Q302P086k0544k4919
17615E94832k4069l046L2043K5578k9729k6097j8276k0021j4414j4104K6700n285
17603E24112o7088m8152l0709j5293k9120J5332R111J135M5638M121L0978J00469
17591E40534J14882J45990J24554P9760j9101l1182q1259j11316j02734p8736
17581E81392k4056K5066L0837R523K403K5243P9843O6888J03240J18196J15994
$$ y = [1621515, 1545273, 1500469, 1456995, 1423851, 1370501, 1322249, 1231779, 1170360, 1158839, 1173821, 1163627, 1162805, 1142699, 1074141, 1048301, 1053645, 1066619, 1049911, 995601, 954579, 887137, 854125, 840664, 820065, 814948, 785301, 760332, 713046, 669350, 610920, 561018, 535146, 515069, 524553, 510500, 504296, 520078, 570703, 575890, 562188, 554895, 594940, 624907, 633209, 640295, 619751, 594832, 570763, 567717, 599760, 625338, 595609, 569512, 551236, 531215, 516801, 502697, 529397, 524112, 457024, 408872, 378163, 362870, 333750, 349082, 358193, 359328, 404966, 409087, 440065, 540534, 655416, 801406, 925960, 1005720, 986619, 955437, 874178, 762862, 660128, 581392, 557336, 582402, 613239, 622762, 625165, 650408, 730251, 797139, 900379, 1018575, 1134569]
17570A134569M6930J531k3260K02n3651r1542n7375p3110q5424q0093O213O2707
17558G87697N3118N1045O8068k858r1012p9325n3255r0407o2420l39J52L116J4950
17545E98530N1125Q3994O8842L8155K5190K9160J5876N9523Q984m0370l0602J0625
17533I19032q5150j03802j07856q2551n5356k0999m3019k1495p415K3305l2695
17522C81999m5845k1375j7269j3154R680N918j8774M822m2604J4196L1068j4257
17510B74405j7311n9911j7191J0185n815N0506K4929J22p380k9773o647j0415
17498B05704l1162j1975j6584q12j0679k2568j4908P54K1978J5887n075L553J4936
17485A49049Q877j6645J5047k2266j0627J2133J7434K5784p953l1556k4637l4885
$$ y = [1134569, 1181499, 1183030, 1159770, 1159972, 1106321, 1014779, 957404, 884294, 798870, 718777, 724990, 787697, 840815, 891860, 959928, 957070, 866058, 786733, 733478, 643071, 580651, 580312, 580464, 583580, 598530, 649655, 733649, 802491, 840646, 865836, 894996, 910872, 970395, 979379, 939009, 908407, 919032, 833882, 730080, 622224, 539673, 484317, 463318, 420299, 398804, 391389, 414694, 381999, 336154, 314779, 297510, 284356, 294036, 299954, 281180, 286002, 243398, 257594, 288662, 274405, 257094, 197183, 179992, 190177, 184362, 234868, 259797, 259919, 252539, 222766, 216119, 205704, 174542, 162567, 145983, 145171, 134492, 111924, 97016, 97770, 119748, 135635, 130560, 134113, 149049, 157926, 141281, 156328, 134062, 123435, 135568, 153002, 178786, 170833, 139277, 114640, 79755]
17473G9755n8m502Q901j1203k2140K1889M0996k9399k9975j9362m57k0311k5111
17460a0977K8369J7832K6106k6051j4879j1707K1293k5153J8877N4563K4344J2243
17448A14860P683j061l1292j1990N6595J09966J19408Q7948J0416j14894o9286
17437B78353r33n6021n6970j8225K889j1167l9903l055j644L737K9435j2644J8226
17424A32078K1185j5496m3423Q386l6298j4044m26J2823N098k555J2423J8840
17412I8591J5201J5471N555k3301l4677K5406K0191j9716o78J0372q179k5614
17400G8622K2890O513n5193q453l4604K538J2439R586J9040K5728P585R620K154
17387I8465j8539K0949q074j1526K3199N941K8326n450l5105m91Q053J2757k3324
$$ y = [79755, 79697, 75195, 84096, 72893, 50753, 72642, 113638, 84239, 54264, 34902, 34445, 14134, -10977, 17392, 35224, 61330, 35279, 20400, 8693, 29986, 4833, 23710, 78273, 102617, 114860, 122543, 121482, 90190, 78200, 134795, 244761, 364169, 452117, 462533, 347639, 278353, 277420, 221399, 164429, 146204, 149093, 137926, 98023, 94968, 93324, 97061, 126496, 113852, 132078, 153263, 137767, 94344, 102730, 66432, 52388, 51962, 64785, 69883, 67328, 79751, 98591, 113792, 129263, 134818, 111517, 76840, 102246, 122437, 102721, 102043, 112415, 104236, 78622, 101512, 108025, 52832, 44379, 9775, 12313, 24752, 34338, 53378, 79106, 86691, 96311, 98465, 79926, 100875, 92801, 81275, 104474, 110415, 138741, 133291, 98186, 97695, 105748, 118505, 95181]
17374I5181J820J0980k1212k3352m1477J615J865J8503k7447j0149N0017p538
17362D8806k8288k3749L131O621Q050K2355k3118K899J4614r888L6636Q949k6178
17349D0840j0606K2262k2539j4208P1566R991l6082j8796j2628p987n89M745j7099
17336H870k9907j629R107k342o016J5252M1465L3698J221o2765q847L1639j700
17323B8046n6607r080N3276N7769P619j7096q039N8474L0055k0056j2936k7866
17311H3559k177l6464J530K5891K6866Q3133M5171L3468J5387M5902J8496K0122
17299C60884R3154P8440o425k1374m6477k53L2090O8293K5715n653k1372J85j8755
17286E38452J5964Q998k504n410J5014K3748l899k6416K3646J4232l1022j2643
$$ y = [95181, 97001, 107981, 86769, 63417, 21940, 23555, 25420, 43923, 16476, 6327, 56344, 48806, 20518, -3231, -100, 6521, 14571, 36926, 13808, 16707, 31321, 21433, 58069, 67018, 40840, 30234, 52496, 29957, 15749, 87315, 97306, 61224, 42428, 29800, 21813, 21224, 25969, 8870, -21037, -22666, -13559, -15901, -21917, -6665, 34800, 68498, 69719, 6954, -1893, 29746, 28046, -28561, -37641, 15635, 73404, 81023, 63927, 55888, 114362, 144417, 124361, 111425, 83559, 81382, 44918, 46448, 72339, 99205, 182338, 227509, 260977, 276364, 322266, 340762, 360884, 454038, 532478, 526053, 504679, 458202, 457949, 490039, 558332, 584047, 578394, 557022, 557207, 538452, 554416, 563414, 560910, 555500, 570514, 594262, 590363, 563947, 587593, 601825, 570803, 558160]
17274E58160K1568K9214L107n2715m6855m897n7913q0750l5831j714k7825j6430
17262B87119j5173L203k3599k7255j0636n147K3784N5729K1523M5875N7908O2445
17250D75776Q4525O6236K7518p341n7572m7769M8003M4404M202L0289q14q5307
17238E82150o8587p9619n6957m7883n2595k6816j4289J0081P769k8181j8170k8773
17226A78130J0807m963K4248K6990R2130M9297M4356N5962P7443K2003P010Q438
17214E91851K281Q734l823k27L0760M3565l2552r1829p1545m2447o3428j12751
17202B58589n0794k7814k1772l2034j9238L2825Q814l3424J1315r377l5157r881
17190G2052o790Q798L5203J5724J0182m81k0497j0876O16K777P448l7919k8300
$$ y = [558160, 579728, 608942, 612049, 559334, 512479, 507582, 449669, 368919, 333088, 331374, 303549, 287119, 271946, 275149, 251550, 224295, 213659, 208512, 232296, 288025, 309548, 355423, 413331, 475776, 560301, 626537, 654055, 646714, 589142, 541373, 589376, 633780, 637982, 668271, 667457, 582150, 513563, 433944, 376987, 329104, 276509, 249693, 235404, 245485, 253254, 225073, 206903, 178130, 188937, 183974, 208222, 235212, 327342, 376639, 420995, 476957, 554400, 576403, 583413, 591851, 594132, 602866, 599043, 598816, 629576, 673141, 640589, 548760, 477215, 434768, 371340, 258589, 207795, 179981, 158209, 126175, 106937, 139762, 148576, 115152, 126467, 117090, 81933, 72052, 65262, 74060, 109263, 124987, 135169, 134688, 114191, 103315, 103931, 106708, 114156, 76237, 47937]
17177D7937r443J3724J5095j106M468j1804k1835O150n573m05L2685K5281j659
17164I3515q769R206j6577m9080K611K8535L078j7779k9512o282j5507j5989R33
17151b1617l2885P941M9204p554Q100l646K5879j601K3695K7054q203j7565J4251
17138F3053k4347l5128l8320J4478j4331k1862p313L16j052P046o329K676K5149
17125c5964j4122O8127L5730k5136j1132p965K0515m355l3533M789J3096q314
17113A736J5967k703n972j1028j1395J5597J0186n125O870k6812j8871L0615M866
17100C931j3394J925J5988J9685r121j2381n340K1135p418j4024M975J4581l0726
17087a0184k7967P831j4519r820j4999j3583J8107M7663K2220j5108j1176k1803
$$ y = [47937, 38494, 52218, 67313, 66207, 70675, 58871, 37036, 43186, 37613, 37208, 69893, 95174, 93515, 84746, 93952, 77375, 28295, 30906, 59441, 62519, 44740, 15228, 8946, -6561, -22550, -21617, -54502, -46561, 2643, -4911, 3189, -457, 25422, 23821, 47516, 74570, 66367, 48802, 63053, 38706, 3578, -34742, -20264, -34595, -56457, -63770, -63454, -64506, -57460, -63789, -61113, -35964, -50086, 18041, 53771, 28635, 17503, 9538, 30053, 25698, -7835, -3046, 10050, 1736, 17703, 15000, 9028, -2000, -13395, 2202, 12388, 7263, 14133, -12679, -31550, -935, 3931, -9463, -7538, 8450, 28135, 19014, 6633, 1293, 22428, 15010, 986, 5961, 20542, -10184, -38151, -30320, -44839, -54659, -69658, -83241, -65134, -17471, 4749, -10359, -21535, -43338]
17075d3338k7644K2940M1876R094N546J1306k3423j2174R844J2566K370n0319
17063d1356j8941L3618J5196m0830p884J2534J6232N5448K5235k7343l0899K1476
17051A2486L1820j3230j4004k0463K3217M4344L7102N0187N3129K6971P053O145
17039B44757k1714m37m1405j8140J851q064L572k4076n439M7427M9205P5904O8454
17026C71895M6973N6776J2335l2392p4017q7079n4102l3370m3444k2216m125O973
17014A44207K6571L6889M5234O248l453K0054o665K039j0005m2769l9970k3854
17002A54526m988k1250n0024k6825L5889M2226j3404j3385l4486j2534O3458L6931
16990A56134J0947M548K6440j3283m8300k8093r517L655k5552k0604k5970K6306
$$ y = [-43338, -70982, -48042, -6166, 2928, 8474, 19780, -3643, -15817, -5973, 6593, 8963, -41356, -60297, -26679, -11483, -52313, -60197, -47663, -31431, 24017, 49252, 21909, -8990, 12486, 44306, 31076, 17072, -3391, 19826, 64170, 101272, 151459, 204588, 231559, 238612, 244757, 223043, 222606, 181201, 163061, 164912, 156848, 160420, 136344, 130905, 178332, 227537, 303441, 371895, 418868, 475644, 487979, 455587, 381570, 294491, 240389, 207019, 163575, 141359, 137234, 144207, 170778, 207667, 252901, 259149, 255696, 275750, 269085, 271124, 261119, 218350, 178380, 154526, 149538, 128288, 78264, 51439, 87328, 129554, 116150, 102765, 68279, 55745, 119203, 156134, 167081, 171629, 198069, 184786, 136486, 108393, 98876, 102531, 76979, 56375, 30405, 56711]
16978E6711o855k1140L3789J202k4736j7948K3225o949l4663p42M732M1161K5545
16965G3332k4174j4648Q974p209p177K4581j4943l0626k9814j9827J6652j758
16953b6637K0519J0755J344K3329L2537k9947k5790L0368j5332J0383M207j7319
16941A8417J9289k2504k5393l8339k2259R088Q534L0294J5860j0942k1337j4961
16929e4253K6634K5298m800l9429J4464q949n2803k4276K0392Q825J2420Q115
16917f8362P093L4830P002K1414l080m0068j0592J0853L7840J2917l0654m6613
16905f7420m495O457L6672p401Q184J7549j6720k0929j9380N014J9781J9697k1151
16892d4142Q580j0739K2976K139j1517L5278K8813J2013J59j9746j4589j5699
$$ y = [56711, 49856, 28716, 62505, 63707, 38971, 21023, 44248, 37299, 2636, 1894, 6626, 47787, 73332, 49158, 34510, 43484, 36275, 29098, 53679, 38736, 8110, -21704, -41531, -24879, -26637, -6118, 4637, 5981, 29310, 61847, 31900, 6110, 36478, 21146, 31529, 35736, 18417, 37706, 15202, -10191, -48530, -70789, -61701, -53167, -22873, -7013, -17955, -39292, -54253, -27619, -2321, -7121, -46550, -32086, -41035, -93838, -118114, -97722, -88897, -76477, -68362, -61269, -26439, -19437, 1977, -1103, -41171, -51763, -40910, -3070, 9847, -20807, -67420, -71915, -65458, -28786, -36187, -28003, -10454, -27174, -48103, -67483, -62469, -42688, -22991, -44142, -35562, -46301, -23325, -21186, -32703, 2575, 31388, 43401, 43560, 23814, 9225, -6474]
16880f474L7513Q729m2787k1279J1606J0398k2116k2441K1202K8805J5845K3079
16868D2080J8213k9983k5864k861M6273m766m3555M737N418J3741o146k6185J4
16855h884j4152o211K1291k5686r009R051L9068K4458j7934r706L397K7981M3385
16842G7049L0574K3361k4087J1030l4921o462M3036k837Q699J4262l081K7468
16830A64091K758L4384M1575n081O812J5523R302L726K0597j328O695L944M503
16817C07501j7821N895L8314r781O646K4999J9144j8466l7999k4837j7439l8717
16805B37439j2789Q176M694k3913o938n0676Q736l0788j2999J676j107K0187k0267
16792A21431j3381J6152j4434K755K2010o229j418j0994j2956j755K0691k8297
$$ y = [-6474, 31039, 39768, -3019, -24298, -12692, -2294, -24410, -46851, -25649, 3156, 19001, 42080, 60293, 30310, 4446, 1585, 47858, 43092, -463, 4274, 9692, 23433, 17287, -8898, -8884, -23036, -29247, -7956, -33642, -42651, -33600, 5468, 29926, 11992, 2286, 5683, 33664, 77049, 107623, 130984, 106897, 117927, 83006, 76544, 119580, 116743, 125442, 139704, 136623, 164091, 166849, 201233, 242808, 237727, 244539, 260062, 269364, 273090, 293687, 292359, 299054, 302998, 307501, 289680, 295575, 333889, 324108, 330754, 355753, 374897, 356431, 318432, 293595, 276156, 237439, 224650, 232826, 237520, 213607, 206669, 155993, 164729, 133941, 120942, 122618, 121511, 141698, 121431, 108050, 124202, 109768, 112523, 134533, 128304, 126886, 115892, 102936, 101181, 121872, 93575]
16780I3575m3367l4971j6383K9506K5832o607l0266P75L285j991Q568J4772k641
16767D0087K3466k212l8998r864J8427J6162k0608j6128L6110M60k8096j4662
16755D144J1079k6532N624N731k506j1560K4131L6813n918m1457j7089R604k2313
16742c0249l5548L3893L18J9534K2912K5567l8048J2167K3150j0226k2877m90
16730A03o259j8340l9830j4313M37N8707j0967k1195M604k5451j6822M3485N419
16717d0422J4545M4750K1776P349j881k785r254j8338m0502j4270l7081L6194
16705c9919M9275p473q648J0419k1433l8804J783l3353L8461N7470M398m6941
16693c4765n3818L9969J1996j1594J033k234k238K5911l0905l8736O026M5973
$$ y = [93575, 50208, 15237, -1146, 28360, 54192, 47585, 17319, 18094, 21379, 19388, 27956, 42728, 40087, 63553, 61341, 22343, 12479, 30906, 47068, 26460, 10332, 46442, 46902, 18806, 4144, 15223, -11309, -5685, 46, -2460, -14020, 10111, 46924, 41006, -451, -17540, -7936, -30249, -65797, -31904, -31586, -12052, 10860, 36427, -1621, 10546, 33696, 23470, 593, 103, -6156, -24496, -64326, -78639, -78202, -19495, -30462, -51657, -47053, -72504, -89326, -45841, -40422, -25877, 18873, 40649, 47998, 46117, 43332, 34078, 15740, -24762, -39032, -76113, -39919, 9356, 1883, -6765, 3654, -17779, -56583, -54800, -88153, -49692, 7778, 12176, -34765, -88583, -48614, -36618, -48212, -47179, -49413, -51651, -25740, -56645, -95381, -89355, -43382]
16681d3382l2754l1757K1705N0319O5576N1869J5553J2754k0139o1654j7796L1085
16669D1379J4063m6025m5000L2649r502J1763j2128j7513J4678q529J2905M498
16657f762J4653K677J1477L386j5117m7660R03M2652j4043l5586l869J1578L1481
16644d230l03j5149k5143k5910j1298J5062K6817K1816N047K2999J244l2069J8839
16631b278K552l9884l639K5608M8446Q047o612m410J275O974r989P828j7148M393
16617B1163l7399M879k3227j7544J5706l753j400R707K2666K2897r394k804o191
16604d694p517l1543m1734q979M3745Q360j5173r431J9544K7677j9174q41K7478
16591a2282k2181j8372K0142L002j9901k3110M2982M4828L0136l2038k4504J4771
$$ y = [-43382, -76136, -107893, -86188, -35869, 29707, 81576, 97129, 109883, 89744, 28090, 10294, 41379, 55442, 9417, -35583, -2934, -12436, -673, -12801, -30314, -15636, -24165, -11260, -6762, 7891, 10568, 22045, 25431, 10314, -37346, -36443, 6209, -7834, -43420, -47289, -35711, -4230, -4533, -19682, -44825, -70735, -82033, -66971, -40154, -18338, -13291, 9708, 10952, -21117, -2278, 274, -39610, -43249, -17641, 30805, 38852, 32240, 27830, 29105, 36079, 26090, 33918, 16770, 21163, -16236, -11357, -34584, -52128, -36422, -40175, -41575, -31868, -9202, 13695, 4301, 1497, -4694, -12211, -43754, -85488, -94467, -50722, -42362, -57535, -66966, -47422, -19745, -38919, -39760, -12282, -34463, -52835, -32693, -29691, -49592, -72702, -29720, 15108, 45244, 13206, -11298, 3473]
16579C473l9691l0611M332p695L8556J6665J6868j5679l9892J2614o492O944p675
16566d8283J3259O771k8908j0557k1222J46M0143M6261J0821k7049Q480K3878
16554A3740M97j6883L715J4996k7549K8407J7341k5687n1444J090j1082l2776
16542h5635R521j6211M2181j9754Q36N921L1333J3649k3546r713R781K8544j2639
16529b5732Q408k101k6914p2K5379J9641K0160J2920J5659j5997l9827o573k4399
16516c9448M716j552j9364K7415Q790j6164L123O936j3102J8006O765j8269K1997
16503a0151L6982m8352J5827J9816l9516K437K4742N1894m6963m5584j7696o189
16491f2753J4403O9176o541l1235j0928J9829L2307K0090j1171r322Q118l1123
$$ y = [3473, -36218, -66829, -62497, -70192, -31636, -14971, 1897, -13782, -53674, -41060, -47552, -40608, -48283, -35024, -28253, -57161, -67718, -88940, -88794, -48651, -2390, 8431, -18618, -10138, 13740, 14237, -2646, 1069, 16065, -11484, 16923, 34264, 8577, -42867, -41777, -52859, -85635, -76114, -92325, -50144, -69898, -69062, -63141, -31808, -18159, -41705, -51418, -41637, -13093, -25732, -17324, -19425, -46339, -46411, -21032, -1391, 18769, 31689, 47348, 31351, -8476, -15049, -39448, -34732, -36284, -55648, -28233, -19443, -35607, -32484, -25548, -38650, -20644, -13879, -32148, -10151, 26831, -21521, -5694, 14122, -25394, -22957, 1785, 53679, 6716, -38868, -56564, -62753, -48350, 20826, 14285, -16950, -27878, -8049, 24258, 44348, 33177, 23855, 31973, 850]
16479H50J1364N221L549o443j7215j8490Q225J7354L0145j4462j5933q325O379
16466B219L3906j3682Q002j1360j5253j9106k874J3613J0506q198O659p27k730
16453I75K515K0165J5554q549n682j7605l965o5j4307J671l0709J0201L645L7316
16439A1160K1914j5863k8468l4168J5276r125J2029K881K524P707L1060j6207
16427G20J1381R705j4011l3076n008n585k5784l6408J198M6155M2865J946L759
16414b143l2721l4063j6533K6457O445O817M2910K4194j6268j5956l3388j2787
16402e7036Q593L4444J305l5762o257L8554j1019j2233L379J0556M225L5446Q851
16389B3046L0785J1305L479j979m525k6564n3363l1648J8945J4891J6215K9000
$$ y = [850, 12214, 17435, 20984, 14541, -2674, -21164, -12939, 4415, 34560, 20098, 4165, -4160, 2219, 36125, 22443, 30445, 19085, 3832, -15274, -18148, -4535, 5971, -2227, 4432, 3705, 975, 3490, 23655, 39209, 30660, 24978, 7373, 3408, 3343, -10964, -9293, -40002, -29801, -26156, 11160, 33074, 17211, -11257, -45425, -30149, -39274, -27245, -24364, -21840, -14133, 16927, 720, 12101, 21806, 7795, -25281, -30289, -35874, -61658, -98066, -96868, -50713, -7848, -5902, -2143, -34864, -68927, -85460, -59003, -52558, -45741, -2831, 21363, 5095, -10861, -44249, -57036, -48443, -13999, -12694, -48456, -54713, -16159, -27178, -39411, -36032, -25476, -21251, 14195, 23046, 53831, 65136, 68615, 66636, 62111, 35547, -17816, -49464, -30519, -15628, 587, 29587]
16377B9587P81k1597k0147o203j1066k8223M941K7569M664j6187k6600O315K4317
16364c1849J7365k760M507L697J0630j164Q360L902L5141J5325k1924l0804J8185
16351B8611J0849m0085J2960M194L897L98j1210Q892k421l3536K8593K0026K0145
16338E1313j6269m4811n6048P320K4565J79J0990M0731J1409m917J235j6375j9223
16325i901J3288J050l7060L406J7306k254J2944K4651J921l1811N630n947j5939
16312b2716l0103K941K4065O765Q241k2979j2489N013N1270K3060k0275Q616K6045
16299D7454j4953l7137L2641N681n5585k7766j3250L037m666K4567M1659J6387
16287A8069j1212k1645R490P532J6951o218j4774j6279P141J6902J579p532l8401
$$ y = [29587, 30368, 8771, -11376, -17579, -28645, -56868, -51927, -24358, -19694, -35881, -62481, -56166, -31849, -14484, -17244, -12737, -9040, 1590, 426, 8786, 12688, 47829, 63154, 41230, 10426, 28611, 39460, -625, 12335, 16529, 20426, 20824, 9614, 18506, 16085, -17451, 11142, 31168, 51313, 35044, -9767, -65815, -58495, -33930, -33751, -22761, 17970, 29379, 24462, 25697, 9322, -9901, 3387, 4437, -32623, -29217, -11911, -14165, -1221, 23430, 25351, -6460, -830, -6777, -22716, -52819, -49878, -25813, -19048, -10807, -33786, -46275, -41262, 10008, 33068, 12793, 21409, 47454, 32501, -4636, 28005, 33686, -21899, -49665, -62915, -59878, -64544, -39977, 1682, 18069, 6857, -14788, -5298, 2234, 19185, 12967, -1807, -18086, -10945, 5957, 7536, 4, -38397]
16274c8397Q548J4094J5523j8390j1543J2193k3384m1261L646M9761L8046k9119
16262b0283j7365K7504K397K0686n278O920O034k2865P221L3017J3376k9541j6878
16249D945P348J5481m1242k2293j3313J9299K419O695N827k6662r674K3542R31
16236b6697N6541N1774j9385k7578l0008j6447L0603J832l369L8016K3781L2634
16224A11697Q053l6568l5116n882J4927P974L3093k6523j7556j0462J0233M7098
16212A00968k4896n1246M8123L5103l9751J360o150j3738m0495j2740L2003q986
16200A9555K8242M1512J6603p667r299m654k2932j9518n3839o8357j3878L0345
16188f3887J9500J364P519Q513J2887O09j7218j7321J2077M0685J8550l460l0708
$$ y = [-38397, -29849, -15755, -232, -18622, -30165, -17972, -41356, -82617, -78971, -29210, 8836, -20283, -37648, -10144, -7747, 12939, 7661, 14581, 20615, -2250, 4971, 37988, 51364, 21823, 4945, 12293, 27774, -13468, -35761, -49074, -29775, -27356, -20661, -14834, -41496, -51170, -27628, -26697, 29844, 81618, 62233, 34655, 4647, -11800, 18803, 20635, 17266, 55282, 79063, 111697, 119750, 83182, 48066, 42184, 57111, 65085, 98178, 71655, 54099, 43637, 53870, 100968, 76072, 24826, 72949, 108052, 68301, 69661, 63511, 49773, 9278, -3462, 28541, 19555, 47797, 89309, 105912, 98245, 88946, 84292, 61360, 41842, -11997, -80354, -94232, -63887, -44387, -43023, -35504, -26991, -14104, -13495, -30713, -48034, -35957, 4728, 23278, 19818, -10890]
16175a0890R744j9859j185L5116K2064j4029l8862j7804R940k8280j3095M0250
16163b6890O6893n996k181n529j3467q38q696l171k233l0000k7286K993K6893
16150b9508m068K688Q542j2168J7993J5297q900k7572Q448J4916n684M9088K2802
16137E1874J9552m724p194m0652m2920m3522L127L1292j6797J8354L214j247j472
16124c1115K1870M7889m819k4452Q245K3409J8004k6494J1587K2234K617Q015
16112G6990m7136l4606L3780J1298K883J223j919J1888L4277J2291K8483N3398
16100A82850K8338J7946K4985j1969O777m725k7107n807J8014L3077k569Q100
16088B67910J8735L4660K6637K6144j5778k150l880j6262k5880m3014j8249l3835
$$ y = [-10890, -1146, -21005, -22190, 12926, 34990, 20961, -17901, -35705, -25765, -54045, -67140, -26890, 40003, 34007, 31826, 26297, 12830, 11992, 3296, 125, -2108, -32108, -59394, -56401, -29508, -33576, -30888, -22346, -34514, -16521, -1224, -10124, -37696, -29248, -14332, -20016, 29072, 51874, 71426, 66702, 59508, 18856, -24064, -67586, -64459, -33167, -49964, -31610, -28396, -29643, -31115, -9245, 38644, 33825, 9373, 17618, 41027, 59031, 32537, 44124, 66358, 68975, 76990, 29854, -4752, 29028, 40326, 43209, 44432, 42513, 54401, 88678, 100969, 129452, 182850, 211188, 229134, 254119, 242150, 248927, 244202, 217095, 211288, 229302, 262379, 259810, 267910, 286645, 321305, 347942, 374086, 358308, 356158, 352278, 336016, 310136, 267122, 248873, 215038]
16076B15038l3724O075J828J8367M4212j2539m9911j4469r578k5922J1461J6244
16064A67082k2913n9567k5997J1925k382o048j083n204K5158l088k9179J330p308
16051D2726j0902L6955L274m4445k2399K6258J0256K2685J5049l174l1550n7671
16039a2938K685J9849M234k754K6171K5944j5533j1275J7356k4642l4231K302
16027b832K3000L438K0587n271M937K2958k1255n5169k1153L6657L0274j3601
16015B2570m512J0809k3167l0129m8221Q883q27K7807K9293K0000K7903k816k1035
16002A6558N859K8476j6269j5356L1859r875K707J2170k0872Q145L76l6930J8
15989F866J1676m3080n6434k217J7232K8603n772n13J8935j8096n401O259k7381
$$ y = [215038, 181314, 187389, 189217, 207584, 251796, 239257, 189346, 174877, 165299, 139377, 150838, 167082, 144169, 84602, 58605, 70530, 68148, 62100, 61017, 55813, 80971, 77883, 48704, 50034, 42726, 31824, 68779, 72053, 27608, 5209, 31467, 41723, 64408, 79457, 76283, 44733, -12938, -10253, 9596, 13830, 11076, 37247, 63191, 47658, 36383, 53739, 29097, -5134, -2832, 20168, 23606, 44193, 38922, 43859, 66817, 45562, -9607, -30760, 5897, 36171, 22570, 18058, 28867, 5700, -24429, -72650, -63767, -64594, -36787, -7494, 12506, 40409, 37593, 16558, 22417, 50893, 34624, 19268, 51127, 41252, 43959, 56129, 35257, 43402, 43778, 6848, 6866, 18542, -24538, -80972, -83189, -65957, -37354, -43126, -43639, -24704, -42800, -48201, -41942, -69323]
15976f9323K1325L1560l2763k1029L6119J7547L6573J6944k7921k7424j593J2402
15964g583j0717R54K6357k1555k3429l2398M270N3215m872j3710q343P713J5201
15951a4897K792j3532J3616J826O733J7840j0313J9466L1641j1289p5883l1277
15939f3277M307K0331K7651J1583J050N124j0121m972j5118R230j0156K9219K1716
15926B6567l2977K795k7607n4638L5699K8530l1312K296j5020L4506m898o389
15914d2448J9837N704K2919J0221J6916j2352j8411k5390j434J9882L2095M1897
15902F9436o835l8338m124j3517j2852j5066l1053J2555L3276J1913q07l4822
15890c0234M901L6885L1241l6596J7085J5487J1907K881J03j3467k6399J1584
$$ y = [-69323, -47998, -16438, -49201, -70230, -34111, -16564, 20009, 36953, 9032, -18392, -19985, -7583, -18300, -17346, 9011, -12544, -35973, -68371, -64101, -10886, -15758, -29468, -37811, -30098, -14897, -12105, -25637, -12021, -10195, -3462, 14378, 4065, 23531, 55172, 43883, -32000, -63277, -58970, -38639, -10988, 595, 1645, 6769, -3352, -8324, -23442, -14212, -24368, 4851, 26567, -6410, -3615, -31222, -85860, -50161, -21631, -52943, -50647, -65667, -31161, -36059, -42448, -22611, -16907, 6012, 16233, 33149, 20797, 2386, -23004, -24438, -4556, 27539, 69436, 62601, 24263, 20139, 6622, -6230, -21296, -52349, -39794, -6518, 5395, 4588, -30234, -25333, 11552, 42793, 6197, 23282, 38769, 50676, 53557, 53660, 40193, 13794, 25378]
15878B5378r839j3825J7965J4143K4882K3943m6043p1085L393R007P835J5080
15866H34J365l23p201K933k8330K311J0264k1488K5748L3888O650J4808J7255
15853E8714o408j7702O223K408L8543J3325l2795k9691k7777j9082l1465K533
15841d3174P922q977q585p722K6590N9233j3865n9291j6086J1327K7258J6626
15829h744R431n619K772j2307L8653L4760J9848k7074l0643j3367n3241J1058
15817c4473L5846j6026J3553N3844n8608o5262Q909M1403K2961K7331j6l0807
15805a345l5736K5558m086j0341M081J8881J0241p844j2829J0279n839J624J3856
15792F500K1101J6372l4187l9199p349p224j753J1930r618k0677M4554J3860k8118
$$ y = [25378, 15539, 1714, 19679, 33822, 58704, 82647, 36604, -34481, -31088, -22081, -14246, 834, 2199, 1876, -5325, -2392, -30722, -28411, -18147, -39635, -13887, 20001, 26651, 41459, 58714, 52306, 34604, 40827, 43235, 81778, 95103, 62308, 32617, 4840, -14242, -45707, -43174, -35252, -44229, -52814, -60536, -33946, 25287, 11422, -47869, -63955, -52628, -25370, -8744, 687, -4932, -2160, -14467, 24186, 58946, 78794, 51720, 21077, 7710, -45531, -34473, 1373, -14653, -1100, 52744, -5864, -71126, -62217, -20814, 2147, 29478, 29462, -1345, -37081, -11523, -15609, -25950, -21869, -2988, 7253, -591, -13420, -3141, -8980, -7356, 6500, 27601, 43973, 9786, -29413, -36762, -43986, -45739, -33809, -43427, -64104, -19550, -5690, -33808]
15779c3808l9681q909L3662L6475K5568P711j7685K068l8175k5293L5100J5584
15767g383k428J4657J6033l5725J540j3109L959k6219k6246K5677M7144J4874
15755A2774J7147n0346J653j5051Q403N692J2774j0295L275K3523K7726j6694
15743B0581J5255j0115n8948m591k282L9406j3664m6400J4003K7712L0046p09
15731A0294m1991M893l677j9470l211j3800K0186K4189K0184r33J8286k371k7366
15718a4787p709j976j3356l22O507K5426k4932j0687p267R541L4290k2147L3253
15705E834K6513l7749Q002k7159k3227j6387J6562L8765K6277m24N964J077j7134
15692F914r71J9569k9995l5416J1012J7024K5289l2016p168O496k6106n583J0849
$$ y = [-33808, -73489, -82398, -48736, -12261, 13307, 21018, 3333, 5401, -32774, -58067, -22967, -7383, -9811, 4846, 20879, -14846, -13306, -26415, -22456, -48675, -74921, -49244, -2100, 12774, 29921, -20425, -18772, -33823, -25420, -19728, -6954, -17249, -13974, 9549, 37275, 20581, 35836, 25721, -33227, -37818, -40100, -694, -14358, -60758, -46755, -19043, 11003, 10294, -31697, -26804, -30481, -49951, -53162, -66962, -46776, -22587, -2403, -3336, 14950, 12579, -14787, -22496, -24472, -37828, -38150, -31643, -6217, -31149, -41836, -49103, -39562, -5272, -27419, 5834, 32347, -5402, 2600, -24559, -47786, -64173, -47611, -8846, 17431, 17007, 22971, 24048, 6914, 5943, 25512, -4483, -39899, -28887, -11863, 13426, -18590, -25758, -19262, -45368, -50951, -40102]
15679d0102L4737o319j784N80r117m427J1387o977P036J032N908j0682k0185J6465
15665b2448J8878q785k1732M659Q196J9934P636j2776J1213n10J0065o161l090
15652E079r002m1825j2100j8695J8434L9926L3186K428l0507k8772l5707j3035
15640i0590M2538K9503k630n867r143k3842M3352N1650K82j3395k4056j5013P5731
15627E8520J3494k6759J4418J2126j4544n4100k6101J2556K1374o72J5335J5306
15615D0953O684k7424m3240j9809j6840Q289K9566J8195J3469m3921l2223O0556
15603e745L698j9193l390K4835J4214l0357J446J1515l5401o956J1609l271L733
15590c3263r62N915L3963k7730m101K6882m1136k7396L1891L6499J0607l3162
$$ y = [-40102, -5365, -11684, -13468, -12888, -22005, -26432, -15045, -22022, -14986, -13954, -8046, -18728, -38913, -22448, -3570, -12355, -34087, -29428, -21232, -1298, 6338, -6438, 4775, 4265, 14330, 8169, 5079, -3923, -45748, -57848, -76543, -58109, -18183, 15003, 17431, -13076, -41848, -77555, -90590, -48052, -18549, -21179, -27046, -36189, -60031, -16679, 34971, 35253, 21858, -2198, -17211, 58520, 72014, 45255, 59673, 71799, 57255, 3155, -22946, -10390, 10984, 10312, 25647, 40953, 47637, 20213, -23027, -42836, -59676, -51387, -21821, -3626, 9843, -34078, -66301, -5745, -2047, -21240, -24630, 205, 14419, -15938, -14492, -2977, -38378, -45334, -33725, -36996, -33263, -34225, -28310, 5653, -22077, -26178, 704, -40432, -67828, -35937, 562, 11169, -21993]
15578b1993K9290o540k4776m7110M249L2875K9969n057J2121J5088J6427l4675
15566a32k4769k3445j1502K386K7149K6457M325L3221K6278j6132k5631k9651
15554a1446J2984k425J0609j5646K6595L2852n597P895k4754k8292j5643j8697
15542c1565j1540k258Q276j4320P576N9595n778R007J5624k1115m0866j8383K6414
15529a9333L1838O910o819j6890J4402j3688K6053Q446l720J5378j2504J9111
15517D9184K7478l6642l4139l4045J6108L3355J9796j6989n0610k2690o341M3523
15505a2012n481m9911k8637O0205M3517l838j6866k5127j1417N5626K1279j7590
15493I748k1965J7622J0599K1893o392j384j5482o9352M692k286K7790K382J678
$$ y = [-21993, 7297, 757, -24019, -71129, -66880, -34005, -4036, -9093, 3028, 18116, 34543, -132, -24901, -48346, -59848, -57462, -30313, -3856, 469, 33690, 59968, 43836, 18205, -11446, 1538, -887, 9722, -5924, 20671, 53523, 47926, 55821, 31067, 2775, -12868, -31565, -43105, -45363, -37087, -51407, -43831, 15764, 9986, 18993, 34617, 13502, -27364, -45747, -19333, 12505, 19415, 12596, -4294, 10108, -3580, 22473, 30919, 27199, 42577, 30073, 49184, 76662, 40020, 5881, -28164, -12056, 21299, 41095, 24106, -26504, -49194, -55535, -12012, -17493, -67404, -96041, -35836, 7681, 3843, -13023, -38150, -49567, 6059, 27338, 9748, -12217, 5405, 16004, 37897, 31505, 30121, 14639, -54713, -50021, -52307, -24517, -22135, -20457]
15480b0457L3311N514j299J015j9284q245n5374j8212O4841L3861M965n5173j8683
15467e3220L6879K9192l1128p49p235l3737J390L5408M582l1420R36M3455K2948
15454A7301K17j7980j306J5452J1561J5532N92k0778l0926M1261m660m7874k0939
15441d2547J7412L9489J7714k7823j015L9845J9327j9828k4222q710m6462q799
15429d5619R457K4772N4845O837k6282K6739J7349l4782l5667n4524N7541L1834
15417C2500j5050l3822m524P264q495m7875k5379K7011N0421L300k3076j6055
15405e3780J8163K3593J3523Q157K851M377l3844l1764j055j952R64O336J3952
15392c0479m977k4867j1424L7933M2274K3032k3244l2738N207K0415q195o846
$$ y = [-20457, 12854, 18368, 17069, 18084, -1200, -9445, -64819, -83031, -18190, 15671, 20636, -34537, -53220, -16341, 12851, -18277, -19026, -26261, -59998, -58608, -23200, -18618, -50038, -49102, -5647, 17301, 17518, -462, -1768, 13684, 25245, 40777, 41369, 20591, -10335, 30926, 26266, -21608, -42547, -25135, 14354, 32068, 4245, 3230, 43075, 62402, 42574, 18352, 9642, -36820, -45619, -36162, -11390, 43455, 50292, 24010, 50749, 68098, 33316, -2351, -56875, 666, 32500, 17450, -16372, -20896, -13632, -22127, -70002, -95381, -68370, -17949, -14649, -37725, -53780, -35617, -12024, 1499, 9656, 12507, 16884, -16960, -48724, -49779, -51731, -50767, -44431, -30479, -35456, -60323, -71747, -33814, 8460, 31492, 8248, -24490, -19283, 1132, -7063, -13909]
15380a3909M516j4995j6205L6110j3121k1107j3800J2441L1236M3804j9106p047
15368H817K1719L057J6182r065k1777l2025k1415K9494J1066p769R92K8053O886
15355C4215P461j2549j7945K6576K419m855l9543k3812q569Q379l6631j5871K9309
15342e1416J7158J3542L891l3217J736j9205J1834K701Q362j3290J6124k495K7493
15329a6782L6689K0422j1966N129j4488j9997k102R803M10J8378N7372n329l1129
15316D6410k7853N050K0006j0638J0095J2122q128n604j3461q824k7187P136L3134
15303C2258M5029j7057o632k2050j5580m7715k3673k3548J7039J1911j7751N912
15291f1857K9870J6583r698L397K8330j0644k2018L2150R928l2536j3870j5072
$$ y = [-13909, -9393, -24388, -40593, -4483, -17604, -38711, -52511, -40070, -8834, 34970, 15864, 8817, 30536, 33593, 49775, 40710, 18933, -13092, -34507, -5013, 6053, -1716, -724, 27329, 34215, 41676, 29127, 11182, 37758, 40177, 35322, -4221, -28033, -36602, -28223, -64854, -80725, -51416, -34258, -20716, -16825, -50042, -48306, -67511, -55677, -52976, -44614, -57904, -41780, -44275, -16782, 19907, 40329, 28363, 33492, 19004, -993, -3095, 6708, 7118, 25496, 82868, 77539, 46410, 18557, 23607, 43613, 32975, 43070, 55192, 47064, 41460, 27999, 19175, -8012, -876, 32258, 77287, 60230, 53598, 31548, 15968, -31747, -55420, -78968, -61929, -50018, -67769, -61857, -31987, -15404, -25102, -21705, 6625, -4019, -26037, 6113, 16041, -16495, -30365, -45437]
15279d5437n136K8542L9564L6100j4813n5969P459Q267l7446j8053j0590M8544
15267a8968L0190L83n301M257M64l6409l3471K3529K1062N179q486j1169K7261
15254a479M879l631l3654j7693M5204M388j3557j9631P503L3346J4201k3496m3566
15241d7186P893M7276M3966J2482K2175k0818j2240k232n314l0798L9682q528
15229D6358k7038n8187l1006K2707l381L6334L7924J670j0078k6476N2644L6272
15217G7743r953m0574j6933p058J1257j0953M647l7609k695L4007K967j3839L5268
15204B6275j3224M626J6024L207J0366j3766l0834l8283K7208L8560l0997L588
15192B750J0079j4448o542k1239l1214m0217K1002J8288j589K0803l0193L1363
$$ y = [-45437, -50573, -22031, 17533, 53633, 38820, -17149, -9690, -1423, -38869, -56922, -67512, -18968, 11222, 11605, 6304, 10561, 11025, -25384, -58855, -35326, -14264, -9085, -17571, -28740, -1479, 3400, -231, -33885, -51578, -6374, -1986, -15543, -35174, -27671, 5675, 19876, -3620, -47186, -39293, 7983, 51949, 64431, 86606, 65788, 53548, 51316, 46002, 15204, 54886, 46358, 19320, -38867, -69873, -47166, -50547, -14213, 23711, 25381, 15303, -11173, 41471, 77743, 67790, 27216, 10283, 3225, 14482, 3529, 8176, -29433, -32128, 1879, 4846, -8993, 26275, 13051, 17677, 33701, 36908, 47274, 33508, 2674, -35609, -8401, 30159, -838, 2750, 12829, -1619, -8161, -29400, -60614, -100831, -79829, -61541, -63130, -42327, -72520, -41157]
15180d1157K8638L016P010M555k4392J8645O6529m317k0716j9818k1030J9257
15168A6220k847l6471j0290J348K7100m535j0493o066J3396j40K437J7526J1134
15155A8319j7341N603L3422K4581k9609l8763j3787j013q695L952k4363j2505
15143f0199j3923M6454L3267J4514j9266j1059J7091j7988N957J8705O656r252
15131A0957m2005J9081J4347m0590J3648K317r465J2291q599l273J9047L2163
15119A9919K2089L7647n255n0074q094O6518j0968o6488j2858J1113J3437k8413
15107a1427j6429q549m941m982j3185K3226k0075m6370J909J2420J6095O3849
15095h459L1971M530j9757l0317J0354o383J1689R66k062j0872j2034J2874J5765
$$ y = [-41157, -12519, -9503, -2493, 2062, -22330, -3685, 62844, 58527, 37811, 17993, -3037, 16220, 13373, -23098, -33388, -32040, -4940, -9475, -19968, -26034, -12638, -12778, -10341, 7185, 18319, 978, 6581, 40003, 64584, 34975, -3788, -17575, -18588, -27283, -23331, -47694, -60199, -74122, -27668, 5599, 20113, 847, -10212, 6879, -11109, -5152, 13553, 20209, 10957, -31048, -11967, 2380, -38210, -24562, -22245, -31710, -19419, -28018, -31291, -12244, 19919, 42008, 79655, 74400, 24326, 16232, 82750, 71782, 5294, -7564, 3549, 16986, -11427, -27856, -36405, -41346, -46328, -59513, -36287, -56362, -102732, -100823, -88403, -72308, -8459, 23512, 28042, 8285, -22032, -11678, -18061, -6372, -5406, -7468, -18340, -30374, -17500, -1735]
15082a735l023k2813j054J7891j2994K6575N3733j8290o909K0895j6780j2407
15070B3089k1947q523j3767K3463m789k2086m5706M811J8677Q930K5491j2002
15058b4359j1533K7998j9680l2061m621L1381K7395R960J1242j9354N191l0099
15046b8540k6744k0080P121M8822L8679j5542Q764J487k5480q156J885M5329M3173
15033G0718J9363l6193l0888l4243L027j3037j9072K7449O692j8962k762j1032
15021c8940J9130O172o826Q418n69K321J4117j7767Q340k185k0513Q265L6374
15008A6337j0908n0715L749K2673J5277K2401J1140j3163l4689J4784J5536J3270
14996B5692J5234k0740l6980j8610j7007K1367M2535O648K552J692l0275L835
$$ y = [-1735, -4758, -27571, -28625, -10734, -23728, 2847, 56580, 38290, 31381, 52276, 35496, 23089, 1142, -7381, -21148, 2315, -2474, -24560, -70266, -65455, -46778, -37848, -12357, -24359, -35892, -7894, -27574, -59635, -64256, -32875, -5480, 4480, 15722, -3632, 1559, -28540, -55284, -75364, -68243, -19421, 19258, 3716, 12480, 13967, -11513, -19669, -17784, 27545, 70718, 90081, 53888, 23000, -11243, -8216, -21253, -40325, -12876, -6184, -25146, -27908, -38940, -19810, -13638, -20464, -12046, -12615, -10294, 3823, -13944, -5604, -7789, -28302, -20037, 16337, 5429, -45286, -41537, -18864, -3587, 18814, 29954, 16791, -17898, -3114, 12422, 25692, 40926, 20186, -16794, -35404, -52411, -31044, 11491, 18139, 20691, 22383, -7892, -4057]
14984d057l075Q741K7387R845j755o684j4402j5213j7426N223L3052l17m2408
14971b1089K1605J9178K57m310l2553M308l1758o453Q125J5818k6238l2687K1499
14958f4298L0132J2531l1180J2740J3518J5141m011J1049J7290L4176k6213j4130
14946F745K0468J1736J257K4062k0457l5113k0396j4541j3441o776n505K6087
14934b5874j5518M303N1698M893J1350L0644J5917j3194l2679m2409l2634k351
14922d5854K5234J0361K9180K695o195k2599k2158K380L0724n6938J707j1568
14910f3031j3606j8877K0485r582J4184O7994J5961l2085m2448J898j7394k610
14898g9111K4267K8189L8052j9616j6496l1321j2267J5086K0336p779j304j5583
$$ y = [-4057, -7132, 1609, 28996, 38841, 37086, 30402, 16000, 787, -16639, -11416, 21636, 21319, -21089, 516, 19694, 19951, 15641, -16912, -12604, -44362, -50815, -42690, -26872, -53110, -85797, -64298, -34166, -21635, -52815, -40075, -26557, -11416, -15427, -4378, 12912, 47088, 20875, 6745, 27213, 38949, 40206, 64268, 43811, 8698, -11698, -26239, -39680, -46456, -51961, -25874, -41392, -37089, 14609, 19502, 30852, 61496, 77413, 64219, 31540, -10869, -43503, -45854, -20620, -10259, 18921, 21616, 15421, -7178, -29336, -26956, 3768, -53170, -51463, -63031, -76637, -95514, -75029, -84611, -70427, -2433, 13528, -18557, -61005, -59107, -76501, -79111, -54844, -26655, 11397, -8219, -24715, -56036, -68303, -53217, -32881, -40660, -41964, -57547]
14886e7547J6824K6659J2242k2351l4643L6903p442j5208M5272k1109K240J1943
14874f217k098l482j5565j801M0643k8339J0049k036m7501J8554L8984l641j6299
14861a8749K1619N3908K9070n0779m8259j9523j5494M2691J2596m4626O652k538
14849c3432n086J2451J8839O447k3880J1876L0865r079m179l6631m1259J6995
14837e6073L9733j3932j7679j0934K4215j357M7725K5673J1435l0270l4824j816
14825a8104M790j349K2472j3879J1184J6818k126n133j8206l197l9013j006J2234
14812c4515J7458M3499L0313j2610O706k514p291j9212N25k9156m010L1298L0056
14799E0547K4271k2336k6393j6025r096j2916j4025m871J066k2044j6652M0154
$$ y = [-57547, -40723, -14064, -1822, -24173, -58816, -21913, -29355, -44563, 709, -20400, -18160, -6217, -8315, -11797, -27362, -29163, 11480, -16859, -6810, -8846, -56347, -37793, 1191, -2450, -18749, 2870, 56778, 85848, 35069, -13190, -32713, -48207, -5516, 7080, -37546, -30894, -33432, -38518, -26067, -7228, -781, -24661, -12785, 18080, 9001, 4822, -31809, -73068, -56073, -16340, -30272, -47951, -58885, -34670, -36027, 11698, 37371, 48806, 18536, -16288, -18104, -13314, -14663, 7809, -6070, 5114, 21932, 19806, 14673, -3533, -6730, -45743, -46749, -34515, -17057, 26442, 56755, 44145, 50851, 48337, 41046, 21834, 22359, -6797, -10807, 20491, 50547, 74818, 52482, 26089, 10064, 968, -11948, -25973, -30844, -29778, -51822, -68474, -28320]
14787b8320N974R959j0970j9089j2105M757k966O658k418K7151J8313j0444k016
14774a5516L0473J1414l5004q443L4084K2366l7135j5761L9411K129Q535p455
14762B9098m9956l1101L1257J0924q584Q166m8445r483K2916J1129L1728K3174
14750B0823M017j8808M6222J6984n4834j4904j055J7039K6441k9506J0983K2048
14738D5450J7154j9703l743K3395j1731n0698p0568k438J4930J461n344m675K8700
14725c7810p430Q886K0338k1595K6204j7012k2556M1587N7349n1206l6181N741
14713c3685J6654K5234K616l2564n602r06K6536l0647j8888O272Q022R725r317
14700c6550O129J1212K1116N172j0197M0147k2188j9484q030L384p423l0752J082
$$ y = [-28320, -22346, -12387, -23357, -42446, -54551, -49794, -52760, -46102, -48520, -21369, -3056, -13500, -15516, 14957, 26371, -8633, -17076, 17008, 39374, 2239, -13522, 25889, 28018, 36553, 29098, -20858, -51959, -20702, -9778, -18362, -10196, -58641, -68124, -45208, -34079, -2351, 20823, 24840, 6032, 52254, 69238, 14404, -500, -1555, 15484, 41925, 12419, 23402, 45450, 62604, 42901, 39158, 62553, 50822, 124, -70444, -72882, -57952, -56491, -61835, -66510, -37810, -45240, -36354, -16016, -37611, -11407, -28419, -50975, -9388, 47961, -3245, -39426, -33685, -17031, 8203, 10819, -21745, -27347, -28253, -1717, -32364, -51252, -44980, -36958, -27233, -36550, -30421, -19209, 1907, 7079, -3118, 37029, 14841, -4643, -12673, -9289, -16712, -47464, -46382]
14687d6382M2133J6573p618m350l1259k5390k5898L8535K7581L4816j6545r347
14675g151m760j1646k0249M561J5305K883K2510o948j0954M8600K5772j2813l4227
14662A0883j8285l7626R883L6300N358K194M1j1532j0444K6543J0285j5444L4301
14649D2457o924l971k2031k1497P032m8588J744l319j5257r67L6532J0944K5622
14636A777K1111l652K7900K8970k9561k1935J0652L8002p630n890j4524j1713
14624C3507L0183L1833k445k6547j5754k6916k2358j595M0894k973l1066n7695
14612e0932j1920Q792Q842J3960M0762K4853J7764j3355m2153p441L4851n728
14600A8295P497K9011n957n3700j7323l1632j379L3862J8370P904k3694q065n967
$$ y = [-46382, -4249, 12324, 4706, 356, -30903, -56293, -82191, -43656, -16075, 18741, 2196, -7151, -11911, -23557, -43806, -39245, -23940, -21057, 1453, -5495, -16449, 32151, 57923, 45110, 10883, -7402, -45028, -35145, 1155, 6513, 8707, 8748, -2784, -13228, 13315, 23600, 8156, 42457, 35533, 31562, 9531, -11966, -4934, -53522, -51778, -55097, -70354, -71321, -34789, -23845, 1777, 22888, 19236, 47136, 76106, 46545, 24610, 35262, 73264, 65634, 59744, 45220, 33507, 63690, 95523, 93078, 66531, 50777, 23861, 1503, -92, 40802, 37829, 6763, -50932, -62852, -54060, -45218, -31258, 9504, 34357, 52121, 38766, -3387, -10828, 24023, 18295, 25792, 54803, 48846, -4854, -22177, -53809, -55188, -21326, -2956, 4948, -18746, -26811, -32778]
14587c2778Q948K8786m387r850l1752k7520L6824M1427M2108k868l4319J3164
14575B7783J2054N630m7728P907L6431K5726k1673l1874k2950j2249j779l807
14563b6529l594o648j349J2599M786K1500j1777q722J1008j226O636K5294k1964
14550A4J3849J6995J2853j5061j2359K8400k1410k3163Q72k464K754O1J5481K4690
14536D1512k2976P738L893j8011n825K586k1084j1412J9714K0977r668L693k473
14523H664j1640k2622l0605j1028M7607M4806K664J0290N430k292k9415l6939
14511b5080L9327q867m3864l245L2607K5066O281L916M9149P3514L3676L1372
14499B13852K1073R933M2569N5942R1075J09364J77712K27464J53676J12009P1585
$$ y = [-32778, -23830, 4956, 569, -9281, -41033, -68553, -31729, 9698, 51806, 48938, 14619, 27783, 39837, 45467, -2261, 5646, 42077, 67803, 46130, 14256, -8694, -20943, -22722, -26529, -30123, -36771, -38120, -25521, -20735, 765, -11012, -19734, -8726, -9952, -3316, 21978, 14, 13863, 30858, 43711, 28650, 16291, 44691, 23281, 118, 990, -1474, 1280, 1341, 16822, 41512, 18536, 26274, 30167, 12156, 6331, 8917, -12167, -23579, -3865, 17112, 7444, 11137, 8664, -2976, -25598, -56203, -67231, -19624, 25182, 27846, 38136, 43566, 41274, 11859, -25080, 14247, 5380, -38484, -41729, -9122, 15944, 22225, 26141, 75290, 148804, 182480, 213852, 234925, 244858, 287427, 343369, 434444, 543808, 721520, 948984, 1102660, 1214669, 1286254]
14488A286254M4686M6209L3791L0670q7515j47597r2176j50931j72289j59799
14478F31303j25550q1367k0458n7960p1191o7523M165l0821j3520j3631K0029
14467A73476J4276j4048k1725j7013k1694j3832J3456K3241m3361J716J3465n1458
14455E6499K3583K6658O4J9347J2513k2948j4294o087m3002q591L9908K677n2380
14442C3947K6676K4725l946k2325j5720J0971K4071L7420L384K027j9254k3596
14430G8380j3224j5459n5365r216N5483j0156J3108J5641q749K63j2473o734K5720
14417E7219L7417p736p171K4447j3195n1650m790l992n9560N051r35j3620M8562
14404A0047M2343k0624l2478K1157K9129j0508q113p043k4140K5687K0211j9568
$$ y = [1286254, 1330940, 1377149, 1410940, 1441610, 1354095, 1206498, 1114322, 963391, 791102, 631303, 505753, 424386, 403928, 345968, 274777, 207254, 211419, 180598, 167078, 153447, 173476, 187752, 173704, 151979, 134966, 113272, 99440, 112896, 136137, 92776, 94492, 107957, 56499, 80082, 106740, 106804, 126151, 138664, 115716, 101422, 95335, 52333, 43742, 83650, 86327, 33947, 60623, 85348, 81402, 59077, 43357, 54328, 78399, 115819, 119203, 121230, 101976, 78380, 65156, 49697, -5668, -14884, 40599, 30443, 43551, 59192, 50443, 50706, 38233, 31499, 57219, 94636, 86900, 79729, 104176, 90981, 39331, 34541, 30549, -29011, -23960, -24895, -38515, 10047, 52390, 31766, -712, 20445, 49574, 39066, 30953, 23910, -230, 25457, 45668, 26100]
14392B6100k6500o555o376L3618j4195p711J5949L814o420J2149R10o665k1157
14379c039J4134j7642l4951k0377O5595L0247j0337o176Q64k3193J2436J8923
14367B6484m7930k2120J8623K0675j5016j2097l731L699J8797L0662j5695o7578
14355f5227l856J2606K9406j7820K0651j185r426J111m023L3755l762J5076J0433
14342A7739k1635l2485K177M4336J5346j6965o1467j1811K9500L55M1631K4521
14330C1242K6683k2471l6440K1404k5028q295j0517p667j10L6878J6995j4414
14318H260j7471l2939L722M1695J3100J3779r450l2961n2788J1395M0180J2478
14306a000j4482j567K9094J4051K6599N244k8575K6276j7223j1280l276m223j2208
$$ y = [26100, -400, -6955, -13331, 20287, 6092, -1619, 14330, 18144, 11724, 23873, 24783, 18118, -3039, 11095, -6547, -41498, -61875, 3720, 33967, 23630, 17454, 18318, -4875, 7561, 26484, -21446, -43566, -24943, -4268, -19284, -31381, -35112, -31413, -12616, 18046, 2351, -65227, -69083, -56477, -27071, -44891, -24240, -25425, -34851, -33740, -37763, -4008, -7770, 7306, 17739, -3896, -36381, -34204, 10132, 25478, 8513, -52954, -64765, -35265, -34910, 6721, 31242, 57925, 35454, -986, 20418, -4610, -12905, -23422, -31089, -31199, 5679, 22674, 8260, -9211, -42150, -38428, 3267, 16367, 30146, 20696, -12265, -65053, -53658, -13478, -1000, -15482, -17049, 12045, 26096, 52695, 57939, 29364, 55640, 38417, 27137, 23861, 19638, 7430]
14293G430K2001J108k1573l8875l0156q352K6250M6894o611J93R792j7850o362
14280a6111K8464R512q924p779m177L4187r59j6599q165m3588k3797J6954J8224
14267b2758J5506L3877J4683m898k485j2462R925m378j9444J1351K0434L5923
14255G5274j7378p3509k6027Q223J190N6412L9418K403m891p451k3648o2490m515
14242c6989P235L8262M39k2608p32J5197L6758n248o048K7195K2652j1998K188
14229F6303j0460l6737k6274K0436l2459k7379O295K5054N986k9264q512K928
14217d4083p946O170L0773j0j8151L0579L5834J5441l9900P087k193q396k0513
14204a5308K988N311k517m512k2819o90m26O566J6022j3130k142M9675K390O571
$$ y = [7430, 29431, 30539, 8966, -29909, -60065, -68417, -42167, 4727, -1884, -1691, 8101, -9749, -16111, 12353, 21865, 12941, 5162, 985, 35172, 34213, 17614, 9449, -34139, -57936, -40982, -22758, -7252, 26625, 41308, 36410, 33925, 21463, 31388, 27010, 7566, 18917, 39351, 75274, 57896, -15613, -41640, -33417, -32227, 24185, 63603, 66006, 61115, 53664, 30016, -32474, -36989, -29754, 8508, 8947, -13661, -14393, 804, 37562, 32314, 26266, 53461, 76113, 64115, 66303, 55843, 19106, -7168, 13268, -19191, -46570, -40275, -15221, -9235, -38499, -47011, -44083, -52029, -45859, -15086, -15096, -33247, -2668, 33166, 48607, 8707, 15794, 13601, 5205, -15308, -12320, -7009, -9526, -14038, -36857, -37547, -37973, -31407, -15385, -28515, -30657, 19018, 21408, 27979]
14190B7979K9983K8996k4219J0906m8841j1222K8711J3957j0846n096l753k139
14178C4416j0864J4760O543P156J6043Q961k0012N447j1848J0086l83j8938p912
14165C3455j1459k1961m905m185M0209J2240k5932L610j0792q780k7566R976R105
14152f985J6027J5271j9616r997P934J8232N429j7024n1311j6921r188J8771L7781
14139a1597N882l0968j6829k4786O31J6415K9859J1135j4220K521l0389j6961
14127g9307K207M9024K8249J9778O119M233J8099n4343p070L1057j1695j0255
14115c904k4827R706K6529j819J7094K8049p396n528k0322r917j3181l940j3669
14102b3125l404J7133K2036n203O786J8838J2308J5170j6614l8428j8151N063
$$ y = [27979, 57962, 86958, 62739, 73645, 24804, 13582, 42293, 56250, 45404, 40308, 36555, 34416, 23552, 38312, 44855, 52011, 68054, 77015, 57003, 62450, 50602, 60688, 60305, 41367, 33455, 21996, 35, -4870, -9055, 31154, 43394, 17462, 21072, 10280, 1500, -26066, -16090, -6985, 9042, 24313, 4697, -5300, 2634, 20866, 26295, 9271, -42040, -58961, -68149, -49378, -11597, -5715, -36683, -53512, -78298, -77667, -61252, -31393, -20258, -34478, -31957, -62346, -79307, -77100, -28076, 173, 19951, 26070, 30303, 48402, -5941, -13011, 18046, 6351, -3904, -28731, -19025, 7504, 5685, 22779, 50828, 43432, 37904, 17582, 7665, -5516, -9456, -23125, -26529, -9396, 12640, 7437, 14223, 33061, 45369, 60539, 43925, 5497, -12654, -7591]
14090g591J7285N4149L3624l1798l0684J0757J1110J117m5617k0712P681q036
14078h715k6479q040p262J2087K5205N8253k1456M4L4203K458j6337j9403l5621
14065a1063M745M521k741K5280j0320L4512K6476P19k9082k5784l201J4077K071
14052C0210j6165Q218P358j2028j680l8084L3476l1696m1527J0381J9493O955
14040b5089J8089K6909O919l2244l4125k2474N184O796K0625L4098P978j754L0815
14027D1727j9243l8334j2536J7418J8825P569J3050j9218o4209P5K9653L6304
14015A1081K5514O0822k2989o5003j9671j8118k6630q660O3426J4436J6260j8791
14003A1677j4827K932L0908l6896m0590L9331J6896l1249j4536K207j5736K8480
$$ y = [-7591, 9694, 63843, 97467, 65669, 34985, 45742, 56852, 57969, 12352, -8360, -679, -8715, -35194, -43234, -50496, -38409, -13204, 45049, 23593, 23637, 57840, 60298, 43961, 24558, -11063, -6318, -1797, -4538, 20742, 10422, 44934, 71410, 72129, 43047, 17263, 14062, 28139, 30210, 14045, 22263, 29621, 17593, 15913, -22171, 11305, -20391, -61918, -51537, -32044, -25089, -7000, 19909, 26828, -5416, -39541, -62015, -56831, -50035, -29410, 4688, 12666, 10912, 41727, 22484, -15850, -28386, -10968, 7857, 15426, 28476, 9258, -54951, -54876, -25223, 11081, 36595, 97417, 74428, 9425, -10246, -28364, -54994, -63654, -228, 14208, 30468, 11677, -3150, -218, 30690, -6206, -46796, -7465, 9431, -21818, -36354, -34147, -49883, -21403]
13991b1403Q054P744M065P551J7150l8629K2051K1820J8636j6923k0678j2332
13979b894J040K2169K5849K2916m998j3177j1750J0895K5790j2418L691l8291
13967B8822O66k9945j7568M8595n964k9177Q172o212l250K4908M2252M919j6946
13954D9272j087J2053j4365k8024J5899j003O874l8879J5127m979J1213j1696
13942A0405L0268J2304m3276J9452K1238k9306k9263L4710p530j066M299R916
13930C2151J2519N042J0451m5855m4641k9549R34o103m682k122K8984L5200Q772
13917A101J4128J896K76k820R387J5618j1210o9642K9710L8057j6534j5734j3384
13904a9151j5246N658R293r876Q805n261O0121L6831K373K5827M104j7333j4100
$$ y = [-21403, -13349, -5605, -1540, 6011, 23161, -15468, 6583, 28403, 47039, 30116, 9438, -2894, -1854, 20315, 46164, 69080, 64082, 50905, 39155, 50050, 75840, 63422, 67113, 28822, 29488, -457, -18025, 30570, 24606, -4571, 3601, -2611, -5861, 19047, 61299, 66218, 49272, 48185, 60238, 45873, 17849, 33748, 32745, 39619, 740, 15867, 10888, 22101, 10405, 40673, 52977, 9701, 29153, 50391, 21085, -8178, 26532, 19002, 17936, 22235, 32151, 44670, 49712, 60163, 14308, -30333, -59882, -58948, -65051, -69733, -71855, -42871, -7671, 1101, 15229, 17125, 17401, 14581, 23968, 39586, 28376, -41266, -11556, 26501, 9967, -5767, -19151, -34397, -28739, -19446, -29322, -20517, -25778, 34343, 71174, 73547, 99374, 103478, 86145, 72045]
13891G2045J5409P203l3224n4617m8026K1541J6166p876K1074J7704J6032j5283
13879B8148j5091M4409l397r209M868r981j3361M4422q697m2534J4010L586J8504
13866E5677m858l6531J4802m528J0766K125j2372J8369J9677j0902k8521l5748
13854a2044j4708J8340J1261o435j1633j9372J6633L1333K3554J1271K5705K189
13842G6094o939K451k177J5500K3980p499l1508j6825k3278k9301L2837K8791
13830F2126K5380j0185j7554l7861l4844k3746N1859L3324k8519P443j0872N955
13818B2506P0j8372M738l53L374N677M832n816J871L1377J1160k84Q078M584p535
13803F5907l4535m042J9655P509j9265m193j6399o342q345j9293j3729J5889j0165
$$ y = [72045, 87454, 94657, 61433, 6816, -41210, -19669, -3503, -11379, 9695, 27399, 43431, 28148, 13057, 57466, 54069, 44860, 49728, 39747, 26386, 70808, 62111, 19577, 33587, 37173, 55677, 50819, 14288, 29090, 24562, 35328, 37453, 25081, 43450, 63127, 52225, 23704, -12044, -26752, -8412, 2849, -3586, -15219, -34591, -17958, 13375, 36929, 48200, 73905, 76094, 69155, 71606, 69429, 84929, 108909, 101410, 69902, 53077, 29799, 498, 33335, 62126, 87506, 77321, 59767, 21906, -12938, -36684, 15175, 48499, 19980, 27423, 16551, 22506, 22576, 4204, 8942, 8589, 11963, 17640, 22472, 16656, 18527, 49904, 61064, 60780, 68858, 73442, 65907, 31372, 27330, 46985, 54494, 35229, 31036, 14637, 8295, -50, -19343, -33072, -17183, -27348]
13790b7348R185L740j0296K4285J3694j4759J3234p305l797O437K9471q644p421
13777B0476j7414j3529J638j1486j8437L9186J7279Q149K3294l0159k1751r378
13765a2132m799k0073m6435K2733L2484J0447m229j296J1949J299j916l0038l0056
13752g2062Q777L2230l7101o195M2155M3461k145J6701L1673j3014n5576J64J1503
13739E71J5946j1002J1325m260J9109n773M75q471r315J8104K3113K5208j878
13726G3152P710n808l8783k0868k6834l4414q111M3690K9705k1551J1902K9175
13714C8965J2932m5412j8137L7234K0531L048r626n545K7754k008J758l4157O791
13701C4128K5282k237k3910J2721j0586k06l8841k4151K2568M281K0097R346J157
$$ y = [-27348, -18163, -14423, -24719, -434, 13260, -1499, 11735, 4430, 633, 7070, 36541, 27897, 20476, 3062, -10467, -8829, -20315, -38752, 434, 17713, 25862, 49156, 18997, -2754, -12132, -16931, -37004, -83439, -60706, -28222, -17775, -22004, -23300, -11351, -10052, -11968, -42006, -72062, -63285, -31055, -68156, -74351, -32196, 11265, 9120, 25821, 57494, 44480, -11096, -10932, 571, 16517, 5515, 16840, 12580, 31689, 25916, 26391, 17920, 8605, 26709, 49822, 75030, 73152, 80862, 75054, 36271, 15403, -11431, -45845, -53956, -10266, 19439, -2112, 9790, 38965, 51897, 6485, -11652, 25582, 46113, 49161, 39535, 33990, 61744, 59736, 61494, 27337, 34128, 59410, 57173, 33263, 45984, 35398, 35192, -3649, -27800, -5232, -951, 19146, 28492, 29649]
13688B9649K2901k521j4595j7215J6574P08k0300n611L5332K7434R694P891R901
13675I9842k2051l624L6978J7868J5767n603K52k8668n39M3110J2132j4086l8283
13662A13095P028K8591k8104J0572J512j9809K6205k536m8401P873j8131l7241
13650D0654j4728K2516M122L2335J6751p52j010k8841J2898j0672j3000L411k906
13637F0778j1199J1836K4067J4485K4064o211m3989n8724J9039K4334k1647k8000
13625H833l6245J405O008j856J1988L0928k884j700k1321K8027O504k295R953
13612C7345R699l0179j0065J7522N146n126k0933j7120K4422K6221K3146J6488
13600G6566J434J121n3568k4420M518j0730k2345J5062N2211J6486M0086j620
$$ y = [29649, 52550, 50029, 35434, 18219, 34793, 35501, 15201, 9590, 44922, 72356, 82050, 89941, 99842, 77791, 74167, 111145, 129013, 144780, 139177, 139429, 110761, 110222, 153332, 165464, 151378, 113095, 120123, 148714, 120610, 131182, 132694, 112885, 139090, 136554, 88153, 96026, 77895, 40654, 25926, 48442, 52564, 84899, 101650, 100898, 99888, 71047, 83945, 73273, 60273, 63684, 60778, 49579, 61415, 85482, 99967, 124031, 117820, 73831, 15107, 34146, 58480, 36833, 8833, -27412, -26007, -19999, -21855, -9867, 21061, 18177, 16477, -4844, 23183, 29687, 27392, 37345, 47044, 16865, 6800, 24322, 29468, 24342, 3409, -13711, 10711, 36932, 60078, 76566, 78000, 79121, 25553, 1133, 5651, -5079, -27424, -12362, 39849, 56335, 96421, 94801]
13588I4801l1457j7196J4751n32P514l1476k0674r422L7063L4463j5599k3768
13576C8468k0840r034J2866j0848o26L5072N753j4194k6063j0018j9596J4296
13564d764o718l4210L8785J3061k370J5197K3166O741l327m5140L9214J92j2081
13551B7746M5197j1427k0759n989j3326l2306J6931J5560K1289M886n20l301j6631
13538B7350l5480O710P143j2569o181J2353K4806J4146n5216J8245M0697M208
13526D6212j1579r659j9998k5311J7980M8935K665j5479o782J9684l548r06J0858
13513E3072j1390K8936K2192j5125k8192j2471o931j9034l4359M0219j4310K8045
13501C0652R660m5540M6826J3496k1385r269l8975l5511L5727r048k8277K8626
$$ y = [94801, 63344, 46148, 60899, 60367, 67881, 36405, 15731, 6309, 43372, 77835, 62236, 38468, 17628, 8594, 21460, 10612, 9986, 45058, 50811, 36617, 10554, 536, -19060, -4764, -11482, -45692, -6907, 6154, 3784, 18981, 42147, 48888, 45561, 421, 39635, 39827, 27746, 72943, 61516, 40757, 34768, 21442, -10864, 6067, 21627, 42916, 47802, 47282, 43981, 27350, -8130, -1420, 5723, -6846, -13027, -674, 24132, 38278, -16938, 1307, 42004, 46212, 34633, 24974, 4976, -20335, -2355, 46580, 49245, 33766, 26984, 46668, 43120, 42214, 53072, 41682, 70618, 92810, 77685, 49493, 37022, 30091, 11057, -23302, 16917, 2607, 30652, 40312, -5228, 41598, 55094, 33709, 24440, -14535, -50046, -14319, -23367, -51644, -23018]
13489b3018O2370K3569k4288N105k221o943j3982K7359R673J6283M655l5526j800
13476D1236J018l627K0796K5029m7903l6333N04L2337j5833Q843j0840j8332j4080
13463a7185j2206J1430K9753Q602p639J2627K6832P700J9335O915j3831o7986
13451D347l685J7455l330k4556j1797M848k6697m454J5051J2545Q249M1364M2665
13438G2005l3765k5447L7618M768k3197R566k1793K8715K2153J855K6942J9516
13426A18936J863j0040k1058o754J0876k4412k0920k4919k6513J8946L0451K1797
13414F8253J2044m0289k4384j7847k973J0250M5717L2751j8400j1814N366L4784
13402I3458j1187J4958j6400k6048j2830M034k4809p439M838j9140K2638J0650
$$ y = [-23018, 39352, 62921, 38633, 43738, 41517, 34574, 20592, 47951, 57624, 73907, 78562, 43036, 41236, 42254, 38627, 59423, 84452, 36549, 216, 720, 33057, 17224, 26067, 15227, -3105, -17185, -29391, -17961, 11792, 20394, 12755, 25382, 52214, 59914, 79249, 86164, 72333, 4347, 662, 18117, 14787, -9769, -21566, -16718, -43415, -47869, -32818, -20273, -12024, 29340, 72005, 38240, 12793, 50411, 55179, 31982, 41548, 19755, 48470, 70623, 72478, 99420, 118936, 120799, 110759, 89701, 82947, 93823, 69411, 48491, 23572, -2941, 16005, 46456, 68253, 80297, 40008, 15624, -2223, -5196, 5054, 50771, 83522, 65122, 53308, 58674, 93458, 82271, 97229, 80829, 54781, 41951, 45985, 21176, 13737, 18575, -565, 22073, 32723]
13390C2723K5040p93n163k3578j7244n3787M6709J1564J1497p57k1053L1639Q7174
13377A23971J6146m4042m8198J5090O946l746j2025k0499l4997M678P809o042
13365E091M515L0256J1128j2810J0026l410j6068O503o325P832J7961l2074l301
13352A9324k0065K6246L1210j0301J6143j3395j5663O673J2633J3261J354k7045
13340D0375j8617j783M122P645J5793N602M6234J6427L380o4068j3592O616K602
13327E0736q885L6854M3033j9804k0911k5817j4310k1342o020K9481q325k5811
13315H879L5380M3002k665l6153j8462r36k2122R582K3177o969j4637k7397J4197
13302D876J0828L2244n524k081l568j6408P928L4340N0924l0773l6482l4702L5483
$$ y = [32723, 57763, 56970, 51807, 28229, 10985, -42802, 3907, 15471, 26968, 26211, 5158, 36797, 123971, 140117, 96075, 47877, 62967, 69913, 66167, 54142, 33643, -1354, 3324, 11133, 5091, 9606, 39862, 50990, 38180, 48206, 44796, 28728, 35231, 28906, 36738, 54699, 22625, 19324, -741, 25505, 56715, 46414, 62557, 49162, 33499, 40172, 52805, 66066, 67420, 40375, 21758, 19975, 24097, 31742, 47535, 53137, 99371, 115798, 119178, 55110, 41518, 48134, 50736, 41851, 78705, 121738, 101934, 81023, 55206, 40896, 19554, 13534, 43015, 34690, 8879, 44259, 87261, 84596, 48443, 29981, 29045, 6923, 16505, 39682, 32713, 18076, -9321, 4876, 15704, 47948, 42424, 40343, 36775, 20367, 28295, 62635, 113559, 82786, 46304, 11602, 47085]
13289D7085O8177Q980k3052l894L2025N97p282j507j745o950k0815R693l4952
13276F6360l3429N628Q4L1123l341l4132K4068J6671j331j6636l2544j6921K6419
13263C2019J2592K3692O326p890j9861L0197M374k2217J759L1035l3892k7185
13251C0949P988m026J3954M1632L3998K0951j5312j3968n701j8139j972K5801
13239A16155K863J468K8296m945j9358m6194m4095K989M3962j4703j5883J1413
13227F1968K3552l21j2663J0220J9789J0383L5961K9509j3889M038J7168m194
13215A81521J1853J4463M3622K284J2998K0394L2257M2662O2288R6662J73487
13204F94491K43785K79257L11257L32143K54647J29322J07306N3745L1789J9133
$$ y = [47085, 115262, 124242, 101190, 97296, 129321, 129918, 122636, 121129, 119384, 112434, 91619, 101312, 66360, 32931, 38559, 38643, 69766, 66425, 32293, 56361, 73032, 71701, 55065, 22521, 5600, 32019, 44611, 68303, 74629, 66739, 46878, 77075, 81449, 59232, 60991, 92026, 58134, 30949, 38937, 34911, 48865, 90497, 124495, 145446, 130134, 116166, 110465, 92326, 90354, 116155, 119018, 120486, 148782, 143837, 124479, 78285, 34190, 37179, 81141, 66438, 50555, 61968, 85520, 85199, 72536, 82756, 102545, 112928, 148889, 178398, 164509, 168547, 185715, 181521, 193374, 207837, 251459, 253743, 266741, 287135, 319392, 362054, 424342, 521004, 694491, 938276, 1217533, 1528790, 1860933, 2115580, 2244902, 2352208, 2405953, 2437742, 2456875]
13194B456875l4887j28012j98558k62796l12075k79169k65888j89234j26219n8866
13184F01171p4115n8660m8204k2903j5914j6931l5101l6605k2609K3826r554m2320
13172B42081n514l085l7048m980M0708K4494R53J2325J5105k2532J5835J9930
13160B98272r417j632l7119n5563m5160J2339L5146P798j2900J502K2114l166
13148B12214o556n980j5240J9379K2252j0473m4802q445J0396L7938q605l1114
13136A70964j06j088K7452N329l8097J2462K9318j6120k7134l0846j6230k6322
13124H9582p370J3860K850M4815l609L0294k4076J3105k9217m8732j6627K9458
13112I4333J2928J889l2160N011M691n99m6831k5594j1251j8615K3464P1318N238
$$ y = [2456875, 2421988, 2293976, 2095418, 1832622, 1520547, 1241378, 975490, 786256, 660037, 601171, 527056, 468396, 420192, 397289, 381375, 364444, 329343, 292738, 270129, 293955, 284401, 242081, 236567, 233482, 196434, 191454, 232162, 256656, 257609, 269934, 285039, 262507, 278342, 298272, 288855, 287223, 250104, 194541, 149381, 161720, 196866, 204664, 191764, 193266, 215380, 212214, 205658, 199678, 184438, 203817, 226069, 215596, 170794, 162349, 172745, 210683, 202078, 170964, 170858, 169770, 197222, 202551, 164454, 176916, 206234, 190114, 162980, 132134, 115904, 89582, 82212, 96072, 98922, 143737, 140128, 170422, 146346, 159451, 130234, 81502, 64875, 94333, 107261, 109150, 76990, 82001, 86692, 86093, 39262, 13668, 2417, -16198, 7266, 78584, 83822]
13099H3822k7951l5349J2870Q490K4150L6182K4797J1603N93k1147J0024L6370
13087A64454J8036j3180L113j659j1036k3254k6554m8628Q387L6627M3994M582
13075A54882M498M3863L7751J3190l0077l2683l7739k3518k675p491K1817J4336
13063A56154M6757l077p251O60k6982p2263L6162J1316o210j0646Q327j3418J1709
13050A31238L5805M3355r058j8992l6170j0675L4117L1071K029J4201O0556P0310
13038C47787N0385K7524J026J0457Q044M4476N3433M7837O3560N0760K0262J6710
13026G42261K4575j3257j767k6415k1198l9290o3412o6142l9806n0200k5158l6455
13014C83736k6698m2133l6418m926L7997j6788k5562J2766j3187k217K9292J1230
$$ y = [83822, 55871, 20522, 33392, 41882, 66032, 102214, 127011, 138614, 139207, 118060, 128084, 164454, 182490, 169310, 172423, 170764, 159728, 136474, 109920, 61292, 69679, 106306, 150300, 154882, 159380, 203243, 240994, 254184, 224107, 191424, 153685, 130167, 127492, 120001, 141818, 156154, 202911, 199834, 192583, 193243, 166261, 93998, 130160, 141476, 135266, 124620, 132947, 119529, 131238, 167043, 210398, 201340, 182348, 146178, 135503, 169620, 200691, 202720, 216921, 277477, 347787, 398172, 425696, 426722, 437179, 445223, 489699, 543132, 590969, 654529, 705289, 725551, 742261, 766836, 753579, 751812, 725397, 704199, 664909, 601497, 535355, 495549, 445349, 420191, 383736, 357038, 314905, 278487, 273561, 311558, 294770, 269208, 281974, 268787, 266570, 295862, 307092]
13002C07092K5613K0892j729m0429l9989k8366P272r376K839K0790M3175M4579
12990C52363J3694l7869j2602L0942L6159J822m5485l2773j1377q437N655q796
12978B83296K4325j1300j4230K0987o183R119j8006m091J5931o142r495o394K9748
12965C07565n3397k1838J4341k7626k5004J2212L5369m1232k0843K5112K6977
12954B31636M7053K5134N2057M0608M0911L1923m3850l4535j1607r187m971J0425
12942C75597k3331o3334k6734K0861J2096J0185j8784o0837m326M497L543K3834
12930B53267n4575k4381j858j722J1849p965k4605l3830R909N1739N1653O291
12918B35772m755M844K3734P466J891L5004K9671P765J8012R192J5282L5756K5318
$$ y = [307092, 332705, 353597, 351868, 311439, 271450, 243084, 250356, 240980, 243819, 264609, 307784, 352363, 366057, 328188, 315586, 346528, 382687, 384509, 339024, 306251, 294874, 286437, 292092, 283296, 307621, 296321, 282091, 303078, 296895, 306014, 288008, 283917, 299848, 293706, 284211, 277817, 307565, 254168, 232330, 246671, 219045, 194041, 206253, 241622, 200390, 179547, 204659, 231636, 278689, 303823, 355880, 396488, 437399, 469322, 425472, 390937, 379330, 370143, 365172, 375597, 352266, 288932, 262198, 283059, 295155, 305340, 286556, 225719, 221393, 225890, 229433, 253267, 198692, 174311, 172453, 170731, 182580, 174615, 150010, 116180, 126089, 177828, 229481, 235772, 231017, 235861, 259595, 267061, 268952, 303956, 333627, 341392, 359404, 368596, 383878, 419634, 444952]
12905D44952R988M2018L3370L9958M9652j764j5631j020J3987p212n656j9332
12893E83310q529j4290j1082k404n760j4257J617l7053q593K1453K4287L764K243
12880E34706K3817L3787J6798J2173K3407J249N319j1253J9640P5410N9539J325
12868G95917m670J5020N0186L8156O7587L7893L5041J7614K8942N9238J2137J9084
12856A172145R3533O3166K6890L1790J9184P1043N6809K444J0216M4585N7709
12845A649514Q7769R7350Q3556O9301L6716N8711K2925M2083M1015Q6503J29468
12834B404911P4368K8772M2412L7971K2779P6262R2365P0906P7641Q6102Q1569
12823C096058P9001Q2266J25477J06146J38146J36879J30674J07117J40802J39238
$$ y = [444952, 454940, 496958, 530328, 570286, 619938, 618174, 602543, 601523, 615510, 608298, 602642, 583310, 574781, 560491, 549409, 547005, 541245, 526988, 528605, 491552, 482959, 504412, 528699, 532463, 534706, 558523, 592310, 609108, 621281, 644688, 645937, 651256, 640003, 659643, 735053, 794592, 795917, 791247, 806267, 856453, 894609, 962196, 1000089, 1035130, 1052744, 1081686, 1140924, 1153061, 1172145, 1265678, 1328844, 1355734, 1387524, 1406708, 1477751, 1534560, 1537004, 1547220, 1591805, 1649514, 1737283, 1834633, 1918189, 1987490, 2024206, 2082917, 2105842, 2147925, 2188940, 2275443, 2404911, 2479279, 2508051, 2550463, 2588434, 2611213, 2687475, 2779840, 2850746, 2928387, 3014489, 3096058, 3175059, 3257325, 3382802, 3488948, 3627094, 3763973, 3894647, 4001764, 4142566, 4281804]
12813D281804J25520J38393K08813J85202J73665K54867K54965K28843K63232
12804F115304K99832L18695L22966L72263M41219N00837N89024O83136P81482
12795A0424758R46618J161904J494234J793576K034226K315475K552852K857896
12787B5581539L369004M130895N138249O590803Q592808J1602712J6093450K2959138
12779A04058598L3132180M5825833N5653502N9037108N4997964M0555582K3961614
12772D17222381J3120479N855602K254298j56765j0184084k6154700m1098511
12765C60858700n2593041n5758100n0407201m0694951l0284685k1698838j5550007
12758I3871877j1485426q852769o978208n629099m650411l933147l384547l015521
$$ y = [4281804, 4407324, 4545717, 4754530, 4939732, 5113397, 5368264, 5623229, 5852072, 6115304, 6415136, 6733831, 7056797, 7429060, 7870279, 8371116, 8960140, 9643276, 10424758, 11371376, 12533280, 14027514, 15821090, 17855316, 20170791, 22723643, 25581539, 28950543, 33081438, 38219687, 44810490, 53403298, 65006010, 81099460, 104058598, 137190778, 183016611, 238670113, 297707221, 352705185, 393260767, 417222381, 430342860, 436198462, 438452760, 438295995, 428111911, 401957211, 360858700, 308265659, 252507559, 202100358, 161405407, 131120722, 109421884, 93871877, 82386451, 73533682, 66555474, 60926375, 56275964, 52342817, 48958270, 45942749]
12750D5942749k821029k544305k281228j910774j587868j336561j131198r12670
12742C1417116p10221n08341l57428k81010l07190l69558m18878n08984n33812
12733B7421694o14370p07938p97193r08951j023247j074342j087821j069324j029950
12724A9108558r67960r25960q84578q34447p50423o88846o93493o36492o46899
12715A2079460n91945n53201n21880m95008m64221m33365m15669m10071l83009
12706G811091l91295l43678k93429l05030l04881k76000k57667k53828k53607
12697E131676j53536j73041k04099k23913j73391j89166j95760j57494j44207
12688C517069j59531j07672j32517j60715j36761j09522j38554j16101l5518m8451
$$ y = [45942749, 43121720, 40577415, 38296187, 36385413, 34797545, 33460984, 32329786, 31417116, 30706895, 30198554, 29841126, 29560116, 29252926, 28883368, 28464490, 27955506, 27421694, 26807324, 26099386, 25302193, 24393242, 23369995, 22295653, 21207832, 20138508, 19108558, 18140598, 17214638, 16330060, 15495613, 14745190, 14056344, 13362851, 12726359, 12079460, 11487515, 10934314, 10412434, 9917426, 9453205, 9019840, 8604171, 8194100, 7811091, 7419796, 7076118, 6782689, 6477659, 6172778, 5896778, 5639111, 5385283, 5131676, 4978140, 4805099, 4601000, 4377087, 4203696, 4014530, 3818770, 3661276, 3517069, 3357538, 3249866, 3117349, 2956634, 2819873, 2710351, 2571797, 2455696, 2420178, 2371727]
12678B371727r2056q2318r9810j33889q8832n5406o6455n8333q1284o0177n7392
12667A495775j8107j7845o9368q0854m9338j1853j8271K3465M0506j936J3372
12656A305546Q664N954K6048O8077M3560K2248O1048Q0429N7936k0599p4388q4660
12644A499863m2609o5709q0388q3398j13388p7331q3495n8769p1293q6029k9036
12633G08418k6915o2445o2280r507m4750k0514J5822k6031k0499M9349K5104J2831
12621E38583P421Q942M8079M182n262J3321O344j9861m47j2992j4503l070j3711
12608E57026K9653M334l6041J297O106j2388J3441J4637o876n0154k253J8055
12596E36837M374j4918k9538k6211P677J2876L3159L0481L5841L6032M6291J4613
$$ y = [2371727, 2279671, 2197353, 2097543, 1963654, 1874822, 1819416, 1752961, 1694628, 1613344, 1553167, 1495775, 1477668, 1459823, 1390455, 1309601, 1260263, 1248410, 1230139, 1253604, 1294110, 1292174, 1305546, 1314210, 1320164, 1346212, 1414289, 1457849, 1480097, 1541145, 1621574, 1679510, 1658911, 1584523, 1499863, 1457254, 1391545, 1311157, 1227759, 1114371, 1037040, 953545, 894776, 823483, 737454, 708418, 681503, 619058, 556778, 547271, 502521, 482007, 497829, 471798, 451299, 500648, 525752, 538583, 546004, 554946, 603025, 607207, 601945, 615266, 621610, 601749, 601302, 588310, 573807, 570737, 557026, 586679, 591013, 554972, 556269, 562375, 549987, 563428, 578065, 571189, 521035, 518782, 536837, 541211, 526293, 496755, 470544, 478221, 491097, 524256, 554737, 590578, 626610, 672901, 687514]
12584F87514O298L2230K6445L4435J1812j9467j8110q913k2305l9380j9723o543
12572F64293l6711k1849o493k3305k7984l5756M679m879j15r527m4739R671L343
12559D70628N305m5797k5912M319J3081M2801k466n4917m6317l5753k5858J080
12547C00194J7843J4867j3066L3481K0363k7698k726K427l130j2599K8277N0894
12535D09127p817o2313o2558R100K5270j2776j3964j3849J9526N28R348M4939
12523C44561L0079J8620J5183K5517j902L3298L9604n975n4247l7509m602l0836
12511C71791l2355j6699J805R954l6208k9936k188j8248L757j3766L580k4708
12499B16779j3103r839O673o118K4325O899j4831m999R85Q84n3062j3545p943
$$ y = [687514, 693812, 726042, 752487, 786922, 798734, 779267, 761157, 752244, 729939, 690559, 670836, 664293, 627582, 605733, 599240, 575935, 547951, 512195, 516874, 511995, 511880, 502353, 457614, 467285, 470628, 475933, 430136, 404224, 408543, 421624, 464425, 461959, 407042, 360725, 324972, 299114, 300194, 318037, 332904, 319838, 353319, 373682, 345984, 343258, 345685, 342555, 329956, 358233, 409127, 401310, 338997, 276439, 285539, 310809, 298033, 284069, 270220, 289746, 290274, 299622, 344561, 374640, 393260, 408443, 433960, 432058, 465356, 504960, 498985, 444738, 407229, 402627, 371791, 339436, 322737, 324542, 334496, 298288, 268352, 266164, 247916, 251673, 237907, 241487, 216779, 203676, 193837, 200510, 194392, 218717, 225616, 210785, 205786, 206771, 207655, 154593, 141048, 133105]
12486A33105P366n717j5898j4767k4283j5811L2382J7844K0647j2717j3179l323
12474A05649M398K3308j0576P352K8562n857L3742j2022j4842o88j9067J9472
12462A59431l6981k6188M9007L2500r134k0923l5848o3257o754K3131J8507J8857
12450A02348j9717j3190K6302K9887J8535K1018j169j8830j795L1673Q997J3334
12438A97393j9688L3128K526m1199j3207J486J2410N797M505J0760j704j9409
12426A72798l0556J251K7489K8115K280n8524k3374J0147J8197K167K4638J2963
12414A87591J200k9211l3767q366n284m014J0653k3450j9699P740m331J647J386
12401H2095j0471M0739K4499J2241J9090l0861k5321k4047K6699N1983q457r113
$$ y = [133105, 140471, 134754, 118856, 104089, 79806, 63995, 96377, 114221, 134868, 122151, 108972, 105649, 110047, 133355, 122779, 130131, 158693, 152836, 186578, 174556, 159714, 159026, 139959, 159431, 122450, 96262, 145269, 177769, 168635, 147712, 111864, 48607, 41853, 64984, 83491, 102348, 82631, 69441, 95743, 125630, 144165, 165183, 164014, 145184, 143389, 175062, 184059, 197393, 177705, 210833, 213359, 172160, 158953, 160439, 172849, 178646, 183151, 193911, 192207, 172798, 142242, 143493, 170982, 199097, 201377, 142853, 119479, 129626, 147823, 149990, 174628, 187591, 188791, 159580, 125813, 117447, 112163, 108149, 118802, 95352, 75653, 83393, 79062, 80709, 82095, 71624, 112363, 136862, 149103, 168193, 137332, 112011, 87964, 114663, 166646, 158189, 149076]
12389A49076n560m6134q892j7060j7769Q876M2016J7381j9201k1764J9470R371
12377A09810k9219p72J5097M070l2218J2305M6049Q448l489J4442j7881j4914
12365A11728k84j1731Q781j7552J9192L5376M7413j6232j6157l715J3497L8185
12353B08501L1966N5352N1152P9125R8136J23777J49898K12409K74468L63478
12343A648262L51922K22490J17731O9192M7627K0705l9309j05144j64028j79634
12333A989814k50588l37132k96779k49682j55876r3784q9460p2360k1385n478
12323D17290m5114j9932K522l1876m0624n3312j9667K7864o974k7696K5575M3496
12311B71552q581J8198K5684l0894l2437n104j5342k1113K5745L2132p825j5355
$$ y = [149076, 143516, 97382, 88490, 71430, 53661, 62537, 104553, 121934, 102733, 80969, 100439, 109810, 80591, 79819, 94916, 98986, 66768, 79073, 125122, 133570, 130081, 144523, 126642, 111728, 111444, 99713, 108494, 90942, 110134, 145510, 192923, 176691, 160534, 156819, 170316, 208501, 240467, 295819, 346971, 426096, 524232, 648009, 797907, 1010316, 1284784, 1648262, 2000184, 2222674, 2340405, 2409597, 2457224, 2477929, 2438620, 2333476, 2169448, 1989814, 1739226, 1402094, 1105315, 855633, 699757, 605973, 516513, 444153, 422768, 417290, 372176, 352244, 354766, 322890, 282266, 228954, 209287, 237151, 230177, 202481, 228056, 271552, 262971, 281169, 306853, 275959, 243522, 238418, 223076, 201963, 227708, 259840, 252015, 236660]
12299B36660j9879j4180o0033j3404K4176K9214k5456l3134n422j1941j5652N214
12287I6163K6975J8700l0968k8526k2590J8631l6681L1912M4041k5816k2015J3965
12275H3791j9090k3387J1911L0650m304P192o524k5236K1329O0187r640p4603
12263E2276p077j0000J4515l0663j1680J1951K8527j2340l2387r523N098M3425
12251D2122J6077o593l7010L736K8407k581l416Q807q200M620j3611J1017L291
12238D6666j0371J9891k8627k3003j9607K1892J9481l6833J7507O111J0243J126
12226B4476m2888L185P791j4158M1147r28m6380j3285M6744j289q11P350q762
12213B192J569N54O348O318l4782k9214L4207J2256J2879j830J6439o96m9760
$$ y = [236660, 216781, 202601, 142568, 129164, 153340, 182554, 157098, 123964, 118542, 106601, 90949, 96163, 123138, 141838, 110870, 82344, 59754, 78385, 41704, 73616, 117657, 91841, 69826, 83791, 64701, 41314, 53225, 83875, 79571, 86763, 80239, 55003, 76332, 136519, 126879, 52276, 45199, 35199, 49714, 19051, 7371, 19322, 47849, 35509, 3122, -6401, -1303, 42122, 58199, 51606, 14596, 18332, 46739, 44158, 40742, 49549, 41349, 45969, 32358, 43375, 46666, 36295, 56186, 27559, 4556, -15051, 6841, 26322, -10511, 6996, 13107, 23350, 24476, -18412, -15227, -7436, -21594, 19553, 18625, -27755, -41040, 5704, 4415, 3604, 10954, 2192, 3761, 4315, 10663, 16981, -17801, -47015, -12808, -552, 12327, 10497, 26936, 26240, -23520]
12200b3520l6944M517L4738j1967K021L1257K2464M2204K0111j8683k5453r377
12188C1368J998j7253l6788k490k5116j4010J4611K4335J8521J591n0927M2020
12176a2140O037K9826k8530j5425K4267K2628m382P333L7160k7976j2677j0375
12164A5746k2497P172J3451j2800L763N4995L3494n416N37j8845n430J7778J3152
12151I5100k9441k9907l7259K3316Q463k2406p24L6352q987l2406Q719l3237L5804
12138A3387L9856j2597l8316k4224J3470J5697N600j0047j0486J380N869k4054
12126b4465j5219P68P849O057K7699K3086N00k1234k4715j9191k3151p115L2006
12113c7125N9778M794r026J372j177P721j9586k7417K0112L5999M163k8383m8253
$$ y = [-23520, -60464, -55947, -21209, -33176, -31155, 102, 22566, 64770, 84881, 66198, 40745, 31368, 33366, 16113, -20675, -23165, -48281, -62291, -47680, -23345, -4824, -3233, -54160, -12140, -6103, 23723, -4807, -20232, 4035, 26663, 22281, 29614, 66774, 38798, 26121, 15746, -6751, 421, 13872, 1072, 4835, 59830, 93324, 87908, 88445, 69600, 64170, 81948, 95100, 65659, 35752, -1507, 21809, 30272, 7866, 7142, 43494, 34507, 2101, 10820, -22417, 13387, 53243, 40646, 2330, -21894, -8424, 7273, 12873, 2826, -7660, -6280, -411, -24465, -39684, -38916, -31067, -25010, 2689, 25775, 26275, 5041, -19674, -38865, -62016, -69131, -37125, 22653, 27447, 18421, 19793, 18616, 26337, 6751, -20666, -554, 35445, 39608, 11225, -37028]
12100c7028r730n704J1612K1460N500m7110J591K3183j743N3623K2276K2488k8512
12087C1906l6988k3237O452J135L5001j2943p394m798J3990j807l0719K1665J6129
12074H392k1994k5585k0854M0712L1206J5835K4509J44l0954n912j7599j9868
12062b1968k1689J9189M7128R297p218j6020k7941K9541J6483j6478k5416k2818
12050c7910J4253L3361m7636l5086M5301J8891J2541K3125j5630k2595j6743m5086
12038g3214J8753L6361j2150k8609l860j376l8229K2194N1159M6686J3382P233
12026C8330j4285k377l5269J2175k140j7642l489o552K1755L9614j434j3256q787
12013F643L178K0790l5642n872l1543m2650R963M2228K2121j0316N014j7958o570
$$ y = [-37028, -46758, -52462, -40850, -19390, -13890, -61000, -59409, -36226, -37969, 15654, 37930, 60418, 31906, -5082, -28319, -21867, -20732, 14269, 1326, -6068, -10866, 3124, 1317, -29402, -7737, 8392, -13602, -39187, -60041, -19329, 11877, 27712, 52221, 52365, 21411, 15499, -2100, -21968, -43657, -24468, 22660, 31957, 24739, 8719, -19222, 10319, 26802, 10324, -15092, -37910, -23657, 9704, -37932, -73018, -27717, -8826, 3715, 26840, 11210, -11385, -28128, -73214, -54461, -18100, -30250, -58859, -62719, -64095, -102324, -80130, -28971, 17715, 31097, 38330, 24045, 21668, -13601, -1426, -3566, -21208, -24697, -31249, -9494, 30120, 28686, 15430, 6643, 9821, 30611, -5031, -10903, -42446, -85096, -75133, -32905, -10784, -21100, -16086, -34044, -40614]
12000d0614J0163k2341j2667M4529k8898L5767M954J1897k7282N998O866j2856
11988b4484k4391J6116q323K0274J0612n279J6149l7407j2602R347K4290J6289
11976E91K505j1733j5169n72J6655L03K7231K2759k0740n363L1773K5640P405
11963H1285M696j9478m6262k0926K5855K5497J0288k2706j4479J658k6082m1628
11951d2282o739R485j5006J6038R784K336R969R636K1615N910r470n2069k9012
11938f9805k1858k2982J1383J7032K8045L1633J2695j0319L1577k7834m9912K921
11926f7424M3280K3248r378j8780o470K5382j243K035r414j2516L6520O188l0424
11913a8996Q333n065j0618l9308K1044O6604K5596j2678j0497j5002k6451j6712
$$ y = [-40614, -30451, -52792, -65459, -20930, -49828, -14061, -9107, 2790, -24492, -18494, -11628, -24484, -48875, -32759, -41082, -20808, -10196, -15475, 674, -36733, -49335, -39988, -15698, 591, 3096, -8637, -23806, -24378, -7723, -7420, 19811, 42570, 21830, 16467, 48240, 73880, 81285, 85981, 66503, 20241, -685, 25170, 50667, 60955, 38249, 23770, 25428, -654, -42282, -49021, -39536, -54542, -38504, -28720, -26384, -16415, -6779, 14836, 20746, 11276, -40793, -69805, -91663, -114645, -103262, -86230, -58185, -26552, -13857, -24176, 7401, -20433, -70345, -67424, -24144, -896, -10274, -29054, -35524, -10142, -11385, -9350, -18764, -31280, 5240, 11428, -18996, -10663, -15728, -26346, -65654, -44610, 21994, 47590, 34912, 24415, 9413, -17038, -33750]
11901c3750K9446K795K53L300Q261l3915K3644M034l5342j7718L3653L2653n149
11888A2165l4367l1680M847J499J6574L5868p673R198O673k8876j1296k7375M302
11875e0141L457K9106J8356J8977j4713l552P053K4546j3171l3316j9633J642
11863c1389J1933m074J7056L0987K6914k843k9620k4998l801j017M20j9570N3647
11850B3645L288l3959k2072r535j2924k2832L0418M5824j1677l2284l10M9547
11838G129K549j0142o892p676P322k814j3317J9960P06L5269j2229o392m7865
11825c4392j7096p665J3964M257j0115J5107K3046r807j8007L182M009j1194k7493
11812g2204N191K9350N6221r353R168j178j0835J678J0906q89k5607L369J6425
$$ y = [-33750, -4304, -1509, -1256, 2044, 10305, -23610, 34, 4068, -31274, -48992, -15339, 17314, 12165, -22202, -53882, -49035, -47536, -30962, 4906, -2767, 6431, 13104, -15772, -27068, -54443, -50141, -46684, -17578, 778, 19755, 5042, 1490, 8543, 33089, 19918, -13398, -33031, -31389, -19456, -23530, -6474, 24513, 51427, 48584, 18964, -6034, -9835, -10852, -10432, -30002, 23645, 26933, -7026, -29098, -38633, -51557, -74389, -43971, 1853, -9824, -42108, -42418, 7129, 9678, -464, -7356, -15032, -7710, -10524, -23841, -3881, -3175, 32094, 19865, 13473, -34392, -51488, -59153, -45189, -40932, -51047, -35940, -12894, -22701, -40708, -37526, -33517, -44711, -72204, -67013, -37663, 18558, 9205, 18373, 17195, 6360, 8038, 18944, 18055, -7552, -4183, 12242]
11799A2242j6184j4061L0357J3524r321L3300o983j9998J2063n969k548j2877
11787A3545J4658j4842j4142J5424K5189m2804J1905o2872m0362N843K0040L3547
11775c4871L0568Q778J290M666P004Q416o2092J7335J1518m408P217k0745j1868
11762c7192J6481l0056j0820J5030K3121O767J4194N546J0445r166J5379l143
11750A6586l2736k7034L3437K5210O962j2154k6707j0277L6036k3989K2436M9390
11738E7160q603k1499j5978l881j1444k4101J3198j3785r146M153J9014k7706
11726d2618J9364J9740J663l5615k4050L7946K1435l1191l3827J8589M7902N8855
11714E8193m8630m1796k175o762o76J6759K2197o722j4804J0081l8108j3550M5266
$$ y = [12242, -3942, -18003, 12354, 25878, 16557, 49857, 42874, 22876, 34939, 28970, 26422, 13545, 28203, 13361, -781, 14643, 39832, -2972, 8933, -53939, -94301, -88458, -68418, -34871, -4303, 4475, 5765, 10431, 17435, 25851, -36241, -18906, -7388, -11796, -4579, -25324, -37192, -20711, -50767, -61587, -46557, -23436, -16669, -2475, 3071, 13516, 4350, 19729, 16586, -16150, -43184, -9747, 15463, 22425, 10271, -16436, -26713, 9323, -14666, 7770, 57160, 48557, 27058, 11080, 7199, -4245, -28346, -15148, -28933, -38079, -33926, -14912, -42618, -23254, -3514, -1851, -37466, -61516, -23570, -2135, -33326, -67153, -48564, -662, 58193, 9563, -32233, -34408, -41170, -41846, -25087, -2890, -9612, -24416, -14335, -52443, -65993, -20727]
11701b0727L9475l2935j6225L0165K973l8142q294J2304L1916j5255j7416K4925
11689g236N2517N7312N449j4530n5864o1227P292J1197J2394J0348p108K074r058
11676C560K210j4659k8903M3001N8515j6625m4814l6291j5873K633J3604J2215
11664b1427J9326R856j9536K1613L6749j5658n3965j5945LR49k5539L1981N7793
11651B6200j2643p6318l3637M7226L8067Q416j9757J248J1218J6552k0782L808
11639a0402j9460j937J1184j2581m3643m4482M6963K9475L7437o250J3652q98
11627i42j596J1984l1591J3713M4865m257j015k8091j5212l51j7783N53m557L5453
11613A173R240m2452r259J9404J494O051q329M9231K2727l7178l74o284m3798
$$ y = [-20727, 18748, -14187, -30412, -247, 2726, -35416, -43710, -31406, 510, -14745, -32161, -7236, 45281, 102593, 108042, 93512, 37648, -23579, -16287, -5090, 7304, 17652, 10544, 12618, 3560, 5770, -8889, -37792, 5209, 63724, 47099, 2285, -34006, -49879, -47246, -33642, -21427, -2101, 7755, -11781, 9832, 46581, 30923, -23042, -38987, -38984, -38035, -63574, -31593, 26200, 13557, -62761, -96398, -49172, -11105, -2689, -22446, -21198, -9980, 6572, -14210, -10402, -29862, -31799, -20615, -33196, -76839, -121321, -74358, -44883, -7446, -13696, -44, -942, -2538, 9446, -22145, -8432, 36433, 32176, 31161, 3070, -12142, -12493, -30276, -29723, -34280, 1173, 10413, -32039, -41298, -21894, -20400, -14349, -22678, 26553, 49280, 12102, 11728, 5444, -38354]
11600c8354k6409N9939J5749L074l5489k4523J8908M8368L224l114l8012j6992
11588c3631L8932N549M289o437L897K0007j5370l9955l4199p100J7897o82K8976
11575a7827K349k3721P397L1974K744J1152m41k4058n1725m555j3675j318N2124
11562b9580j1482R98M7982M4496k8785n117K5912m1844n8176k6111k562N4259
11550c0010K7203r765r908p132k4812K0323K0755K4137J1643J175J1607j9979
11538A5237j1829k4281j1240k39Q329K2590l2360j1208m615j7088J1676M1847
11526a3181K6189L490O810R830m2449l1022J2409J3597k7340K8807J9373R64O914
11513A4391q345K733J7931j2183l8347m1492J3664J2010M8582q96m4792J455L6523
$$ y = [-38354, -64763, -4824, 10925, 13999, -21490, -46013, -27105, 21263, 24487, 21373, -16639, -33631, 5301, 10850, 15139, 8702, 12599, 32606, 17236, -22719, -56918, -64018, -46121, -46803, -17827, -15478, -39199, -31802, 172, 2916, 14068, 13627, -10431, -62156, -66711, -80386, -81704, -29580, -41062, -40064, 7918, 52414, 23629, 18512, 44424, 2580, -55596, -81707, -84269, -30010, -2807, -12572, -22480, -29612, -54424, -34101, -13346, 10791, 22434, 23609, 35216, 15237, 3408, -20873, -32113, -32352, -24023, -1433, -33793, -45001, -49616, -66704, -55028, -13181, 13008, 16498, 23308, 33138, -9311, -40333, -27924, -14327, -41667, -12860, 6513, 7477, 14391, 6046, 8779, 26710, 14527, -23820, -65312, -51648, -39638, 8944, 8048, -36744, -35289, 1234]
11500A234L290K262j4672k4775n4457K0037N8614r397k1341M6511m264J3778N7547
11487G4367R473m7206J0058L1056k7791j1763j2939j9440l3298L2362P324q237
11475C966l4380j2106j3272O723n52m1325J7985J3083K3955j2439J4458O465n5216
11462h2655k562J3168J6722L8182R508k6770L0164J481Q170l691l638P018k0729
11449a5632J4686j3891j7348J4140L2638m894J504j3825j9050M926J2N511K9653
11436A8430J8851O730j6767k3403J7108l009j2687k2012o799j3766r463j5401
11424f2188j0028K2993K8220M9428l1881k3195K4701J0372K5268k6319j2216K355
11412b490p99m0293J129L3412L7209j1557J5919j0992n299q783P164m289j644
$$ y = [1234, 4524, 6786, -7886, -32661, -87118, -67081, -8467, -17864, -39205, 7306, 3042, 16820, 74367, 83840, 36634, 46692, 77748, 49957, 38194, 25255, 5815, -27483, 4879, 12203, 3966, -30414, -42520, -55792, -49069, -49621, -90946, -72961, -59878, -35923, -48362, -33904, -27439, -82655, -85217, -72049, -55327, -17145, -7637, -34407, -4243, -2762, 5408, 1717, -1921, 5097, -15632, -946, -14837, -32185, -18045, 14593, 9699, 11203, -2622, -21672, -16746, -16734, -11223, 18430, 37281, 44011, 27244, 3841, 20949, 17940, 5253, -16759, -23558, -37324, -46787, -62188, -72216, -49223, -21003, 28425, -3456, -26651, -1950, 8422, 33690, 7371, -4845, -2490, -3289, -43582, -42453, -9041, 28168, 16611, 32530, 21538, 16239, 7456, 14620, 10331, 8687]
11399H687M553r541j5329J8242K6568j1047j8991n0641Q774L2565K8851K1293
11387D3984k097j7784J4563l540l1064n212q24l3405J7K9700K569P921j1051j4586
11373b0809j4412J2588J0578P875k7715k4785k2995k871L7252K9235k2516K0564
11361a8011J8285O690M743j6135l1970l4318J1309K236p073R543Q239K0708K845
11348b2909J0862j6332j5953J0646K587p461L730R419L437L744j9225k6940J0742
11335e3653l299L8267J2799R049K8862j0628l426l0174J5420K7224L097j879l6913
11322e254K1232o880l8811J823L0543j3008K0876J8956j1922l0186j9724J3048
11310a9307J8155k663L4410j4034j2817K8644n4889j3575L1519J4695O559k7202
$$ y = [8687, 13240, 3699, -11630, 6612, 33180, 22133, 3142, -47499, -38725, -6160, 22691, 43984, 41887, 24103, 38666, 35126, 4062, -1150, -1974, -35379, -35362, -5662, -3093, 4828, -6223, -20809, -35221, -22633, -12055, -4180, -31895, -56680, -79675, -82546, -45294, -16059, -38575, -18011, 274, 6964, 11707, -4428, -36398, -70716, -59407, -57171, -64244, -54701, -46462, -25754, -22909, -12047, -28379, -44332, -33686, -31099, -38560, -34830, -25411, -21974, -18230, -37455, -64395, -53653, -56952, -18685, -5886, 3163, 32025, 21397, 17971, -12203, 3217, 30441, 33538, 31659, -5254, 15978, 9098, -29713, -27890, 2653, -10355, 10521, 29477, 17555, -12631, -32355, -19307, -1152, -3815, 30595, 16561, 3744, 32388, -22501, -36076, -4557, 10138, 16697, -10505]
11298a0505l5663J1541R384j5747l4543L8520M5578n044j3447j0859J7998o642
11286i429L516j1175j8396J2075K8080O576J767j2011k281K1900L9020M020K5978
11273H9640Q375j2085k3834j0521m2795q72r456j6719r773K1595K760l6081l4021
11260g3787J2072O0156L3256j4414k0113J1922P13k5493K0506J5305n771j1065
11248C287K9832O864j1016K0383r640k5892j329l0476j9602j207J5858K459J1642
11235h837r306J938J5911K8378j737j7472k0678j4429k9832L625N1210k4978J9035
11222g172K9985J0059K2141K0973R129k0474j3902N150m1353j6772L9697N6056
11210I3517j4247k4174J815J4415k178K649p595k7200k9087l0224M11j6134L284
$$ y = [-10505, -46168, -34627, -25243, -40990, -75533, -37013, 8565, 3521, -9926, -20785, -2787, -9429, -5913, -17088, -35484, -23409, 4671, 11247, 13014, 1003, -1278, 20622, 59642, 63662, 89640, 98015, 85930, 62096, 51575, 8780, 7908, -1548, -18267, -28040, -6445, -3685, -39766, -73787, -61715, -1559, 31697, 17283, -2830, 9092, 9805, -15688, 4818, 20123, 14352, 3287, 33119, 39983, 28967, 49350, 39710, 13818, 12489, -17987, -37589, -38796, -22938, -20479, -8837, -18143, -16205, -294, 28084, 26347, 8875, -11803, -26232, -56064, -52439, -1229, -26207, -7172, 22813, 32872, 55013, 75986, 85115, 64641, 50739, 55889, 14536, -2236, 37461, 93517, 79270, 55096, 56911, 71326, 69148, 71797, 64202, 37002, 7915, -22309, -21898, -38032, -34748]
11197c4748N935J5514M1j1241M99O687O348j1129o806J9667J3542J1697K248k5671
11183g417P193J3605O677l2775j1987M892l1917k915K5793M0199J7417l455l1854
11170f544J4140j2931m4650R834L8277N576j7905J3585l279K7898j0072j8904
11158d975l9281k401K3175K3556N656k4365P794k3643J0835L7989J6022k4756
11146E606k5359n57M1796m0585j8146Q491L3294K2007l644l1914J065M6730l0977
11133G807k1927l3782K1125K0616J5378P891o264J8856n293j4076m37l5253J8459
11120f900K2050l1066j3730n24p735L2528M988l0355k6475J5738j1703J7658J7987
11107a7539l3873k2642q55J4332J1502M4509m844k3373L214P918k9293o336L2815
$$ y = [-34748, -28813, -13299, -13258, -24499, -24000, -17313, -10965, -22094, -28900, -9233, 4309, 16006, 18254, -7417, -224, 13381, 20058, -12717, -24704, -19812, -51729, -54644, -28851, 11348, 28765, 25310, -6544, 7596, -5335, -49985, -40151, -1874, 3702, -14203, -618, -3897, 24001, 13929, -4975, -44256, -46657, -23482, 74, 5730, -18635, -10841, -34484, -23649, 14340, 30362, 5606, -19753, -20310, 21486, -19099, -37245, -28754, 4540, 26547, 22903, -9011, -7946, 38784, 7807, -14120, -47902, -26777, -6161, 9217, 17108, 10844, 29700, 24407, 10331, 9894, -25359, -6900, 15150, -15916, -29646, -30170, -37905, -5377, -389, -30744, -57219, -41481, -53184, -35526, -17539, -51412, -74054, -74909, -60577, -49075, -4566, -9410, -32783, -29569, -21651, -50944, -57280, -24465]
11094b4465R960k2354k5942n780J016O679K518M591l8375O299L2653K6565J3099
11081a3536J9352O843J5383J6571m945r031k5909L772J0119l8671K5424j6431
11069a1059j9262J8919j9193j7026K3336j455M631J1082k050K1452J6214M2879
11057F8468K453k3421o099k4936n293j8095j2858o458K5095j6007j0019J708K3616
11044a846K1227k5936J1989J899j0749r851K3331M2801l4773m8571l123L2625
11032i77j0648l122n174L6848P922j4368q812J4112k4569Q074J9478l0461Q238
11019c459K3002j7606j7369K004J7902Q992n3259k9965L1677L0584j0117k3879
11007d1493m8600j6893M1500O4189J0422m3118j5959J9081J2411j850Q892L273
$$ y = [-24465, -14505, -36859, -62801, -68581, -67565, -60886, -58368, -53777, -92152, -85853, -53200, -26635, -13536, 5816, 12659, 28042, 44613, 39668, 30637, 4728, 8500, 18619, -20052, 5372, -11059, -30321, -11402, -30595, -47621, -24285, -25740, -21109, -10027, -12077, 9375, 25589, 68468, 70921, 47500, 41401, 16465, 11172, -6923, -19781, -26239, -1144, -17151, -27170, -25462, -1846, 19381, -6555, 5434, 7333, -3416, -13267, 10064, 52865, 18092, -30479, -33602, -977, -11625, -14747, -19921, 16927, 24849, 10481, 1669, 15781, -8788, -714, 18764, -11697, -3459, 19543, 1937, -15432, -13428, 4474, 13466, -39793, -69758, -38081, -7497, -17614, -41493, -90093, -106986, -65486, -1297, 9125, -33993, -49952, -30871, -18460, -20310, -11418, -8145]
10995h145K2552R115K114j2336L8105J3556k1432j6571j3791m3715N824J1838
10983a2886K2760j1847J8845J0413j6514J4561m5903j8527O3294P588k0181k2245
10971a0642J2195k5649l8025R035j8981K3563K5204P004n959j4863j5869j8495
10959g1482j8738K0934M267K8785K6107J4935r183k4740J2998M2148k481k4490
10947i40o756k1164K373M1299J1187P842P718k7392k2613K0349J5085J8303l5472
10934I819k0849o783P639j5205J0966J5709N785J0446l007r064J9790O411k1991
10921I666J6852k4174o415J1072P825j9068n362J4196k8153j4097M0660J6433
10909A9435J5946L7812j6310l5473l6769q22Q377L3803N2852K7124m2871j2777
$$ y = [-8145, 14407, 23522, 25636, 13300, 51405, 64961, 43529, 26958, 13167, -30548, -24724, -12886, 9874, -1973, 16872, 27285, 10771, 25332, -20571, -39098, 24196, 31784, 11603, -10642, 1553, -24096, -62121, -53086, -72067, -48504, -23300, -16296, -22255, -37118, -52987, -71482, -90220, -69286, -65019, -36234, -10127, 4808, -4375, -29115, -16117, 26031, 23550, -940, -7696, -28860, -26487, 14812, 25999, 33841, 41559, 14167, -8446, 11903, 26988, 45291, 9819, -11030, -17813, -10174, -25379, -14413, 1296, 7081, 17527, 14520, 5456, 25246, 31657, 9666, 26518, 2344, -4071, 7001, 14826, -4242, -9604, 4592, -23561, -37658, 3002, 19435, 35381, 73193, 56883, 21410, -15359, -16181, -7804, 25999, 78851, 105975, 63104, 50327]
10897E0327J198k3259m399M2889Q671l0531R944p306k7077k2974j5969J2942L8800
10884C3256n070r253j2262L466K9910M2686k4963J5704k874j3641j4259j7604
10872B5096k6160j3107J7520K1365J4537j9363j3641K074N82J956J9235L1998
10860F2092L390k8028l3898K333J0313N3971R141j8094l778J4232N7947K3612
10848A53233p2099m1389K3310k6490k9560j7737L133J4438L1018K064j6548j5660
10836G713O488K4866j2680l347n0186J7270M8420J6415M728j2012j7201q818k8765
10823g109l3048k327J7945L9151k984K0862j3034l5970J481J5257l2348K0700
10811a1424K5583L778r799k2520k0389J4685J704K014J07j1973k3946J5474N0949
$$ y = [50327, 51525, 28266, 23867, 66756, 75427, 44896, 54840, 47534, 20457, -2517, -18486, -5544, 33256, 28186, 18933, 6671, 10137, 40047, 82733, 57770, 73474, 70600, 56959, 42700, 25096, -1064, -14171, 3349, 24714, 39251, 19888, 6247, 8321, 8903, 10859, 30094, 62092, 65482, 37454, 3556, 5889, 16202, 70173, 79314, 61220, 57442, 71674, 129621, 153233, 81134, 39745, 63055, 36565, 7005, -10732, -7599, 6839, 37857, 39921, 23373, 7713, 14201, 39067, 26387, 23040, -27146, -9876, 38544, 54959, 59687, 47675, 30474, 21656, -7109, -40157, -42484, -24539, 14612, 11628, 32490, 19456, -16514, -15033, 224, -32124, -11424, 14159, 17937, 8138, -14382, -34771, -20086, -18382, -16368, -16261, -28234, -52180, -36706, 14243]
10798A4243L4126J0684k1999o606K5274P257Q96o931L529P34j0459k4190j3753
10785A2805R39p305P595N623P963L23l0384k5004m131j6584J9615K734M681N833
10771a5297L7266L7125N563j7919r623k4628J7075j8094j3503L5326o313m8378
10759b1400n942R870L654J5720l2062n061J664L1827M9665j1168l2628j2723k8464
10746c7048K230P763O120K3276j2160k9913N036k3382L4215L1145k962j5884L5145
10733B3581N4691l3180l9406J3763l4359l2613L5689J1381k1650M308L6396J0021
10721B8622l5569Q985L2588Q295l0348j6762J4285J5469R754l3759o601K3267
10709A8226L1429j438q286l5068j491o5024N539N8873j4822q5734J7957J6519
$$ y = [14243, 48369, 59053, 37054, 30448, 55722, 62979, 63875, 56944, 60473, 61207, 50748, 26558, 12805, 13744, 6439, 14034, 19657, 27620, 27943, -2441, -27445, -31576, -48160, -28545, -25811, -21130, -15297, 21969, 59094, 64657, 46738, 37115, 12487, 29562, 11468, -2035, 33291, 26978, -21400, -27342, -17472, -13818, 1902, -30160, -35221, -33557, -1730, 47935, 36767, 4139, -8584, -37048, -34818, -27055, -20935, 2341, -9819, -39732, -34696, -58078, -23863, 7282, 4320, -11564, 23581, 78272, 45092, 5686, 19449, -14910, -47523, -11834, -453, -22103, -17795, 18601, 28622, -6947, 2038, 34626, 42921, 12573, -4189, 10096, 25565, 35319, 1560, -5041, 18226, 49655, 48217, 39931, 4863, 3372, -61652, -56113, 2760, -12062, -97796, -79839, -63320]
10697f3320J64K6422M6621l0781l4945j3087J2682K2571J8073N640o447q759L3273
10684H107m909m7076K2769M0508J9082L2118l703K3981n822m0738k6097o745L090
10671A4565J8046j8522J9131J6223j8288J3957J237J9533K4021N188l989j2688
10659G8414p424j0667o147k9060K7897J3014m6o42r635m7595J352K5744j8338
10646A6867K0499M6501O4956L8652P543p3025l9047k3051n269K9718p234K0357
10634I7467o921k4144l0317o548k4218N253J1946J6111J9299Q775J5501k0425
10622F1779k6602j4871J2538j5645m618J494K4354k8775q436j9653l107J2673
10610h869J3084N7808K6654k5344k517P458m0937m8693r700L6598M3336j3239
$$ y = [-63320, -63156, -36734, 9887, -20894, -55839, -68926, -56244, -33673, -15600, -9960, -16407, -25166, 8107, 3198, -43878, -21109, 19399, 38481, 70599, 66896, 90877, 85055, 44317, 18220, 11475, 14565, 32611, 14089, 33220, 49443, 31155, 45112, 46349, 65882, 89903, 95091, 91102, 78414, 70990, 60323, 54176, 25116, 53013, 66027, 65981, 65339, 55704, 8109, 9461, 35205, 16867, 37366, 83867, 148823, 187475, 195018, 121993, 82946, 59895, 54626, 84344, 77110, 97467, 90546, 66402, 36085, 29537, 5319, 10572, 22518, 38629, 57928, 66703, 82204, 61779, 35177, 20306, 32844, 17199, 12581, 14075, 38429, 9654, 1218, -18435, -21542, -8869, 4215, 62023, 88677, 63333, 60816, 68274, 27337, -21356, -31056, 5542, 48878, 35639]
10598C5639k7787k4415j0932K4700k0810n198K6455J8999L3857l5332k7010P853
10586c981O4587J4919m1395M90K7734k912N657j3236k5267j2643n230j7685q585
10573a7547J5532L958N987l5149K6679J7561j9776L8517J4578k5885n017K3239
10561D2677k6810k2980Q883L2524j0936j9712j0246J8132L346K1038O455n4926
10549a2555r609J4186n0381j0161M2878L2402k14q298q598J4029l5065l5708J0798
10536e6296N0474M5533L3314l4079l8464K5825M9160L7165r670o5709l98k0131
10524A6724K2962k538O084R980N380j3319q416j2956k2313J606K1895k9116j0966
10511a4993K6657O0849K1229J6793j4018K5457j8593l6336l9288J0891J9038r241
$$ y = [35639, 7852, -16563, -27495, -2795, -23605, -28803, -2348, 16651, 50508, 15176, -11834, -3981, 60606, 75525, 34130, 34620, 62354, 59442, 65099, 51863, 26596, 13953, 8723, -8962, -17547, -2015, 1943, 7930, -27219, -540, 17021, -2755, 35762, 50340, 24455, 19438, 42677, 15867, -7113, 1770, 34294, 23358, 3646, -6600, 11532, 14878, 35916, 42371, -12555, -22164, -7978, -58359, -68520, -25642, 6760, 6546, -1752, -10350, 3679, -31386, -67094, -56296, -5822, 39711, 73025, 38946, 482, 26307, 75467, 112632, 102962, 37253, 36855, 16724, 39686, 37148, 43232, 53212, 58592, 45273, 36857, 23901, 1588, 3194, 25089, -4027, -14993, 11664, 72513, 93742, 110535, 96517, 121974, 103381, 67045, 27757, 38648, 57686, 48445]
10499D8445k9262k3589j3794K7072K8290J3813J0538l3580l4511j4290K827K2759
10487D718j6776k3470j7937J8788J2758r843J3352l715J5977p363J7115J0556
10475A4160k6735m88k0324j3553J6431O764j3024k0371l4786L1729O2304J8629
10463B0736J8068L3240R709q455p145j4880J9799j5835m8281n649K3591r080r626
10450F192j0181R397L560l8688j8571K2742N559J9275r467L6672K6174j1055n583
10437C6026l6572l9683j9621M5148J8932L753K854p16o798j7817M077j440k443
10424a4300J8514j440L901N741N780j2413j6051K543J3313k2973J9074M7093j0532
10411C8250M701K4136J4054m1433k3214n232j2427K1338K6612O550n8495k3330
$$ y = [48445, 19183, -4406, -18200, 8872, 37162, 50975, 61513, 27933, -6578, -20868, -18041, 4718, -12058, -35528, -53465, -34677, -21919, -31762, -18410, -22125, -6148, -13511, 3604, 14160, -12575, -13063, -33387, -46940, -30509, -23745, -36769, -57140, -91926, -60197, 2107, 20736, 38804, 72044, 81753, 73298, 66153, 51273, 71072, 55237, 6956, 1307, 24898, 15818, 6192, -3989, 5408, 8968, -29720, -48291, -25549, -19990, -715, -10182, 26490, 52664, 41609, 36026, -546, -40229, -59850, -14702, 4230, 7983, 10837, 10121, 3323, -14494, -10417, -11857, -14300, 4214, 2774, 6675, 12416, 18196, 5783, -10268, -7725, 5588, -17385, 1689, 48782, 38250, 42951, 67087, 81141, 39708, 16494, 11262, -1165, 20173, 46785, 53335, -5160, -28490]
10399b8490r104m5135j0912K3987M9655p834J2072R376k0475k7775K2868L0616
10387a151R099J3978K4158M668k3550j0551K2572k5212p366n355N4479J0526P296
10374G3591J5908J1460l9760l8989r103Q194K0137K1759j7284J9007P557K9553
10362A02030p302l3888o064n197j8659j7984M598K5034J0908Q045l867j3718R034
10349E2970l2760J6527j1956r181o313K4369J8466r07J7388k3724l4172Q088K6419
10336D5214K0028l2518k8672L2415L4018l1125m4361k8790l537L1273K1811O93
10324A6449m083J4950j0778q672M0340J1902J8735L3930J0484j6852K0313K6421
10312A53139j3538l7622q684k3878j5977J0899J0779O519l5819l5373N396L0188
$$ y = [-28490, -37594, -82729, -93641, -69654, -19999, -27833, -15761, -6385, -26860, -54635, -31767, -1151, 7948, 21926, 46084, 50752, 27202, 16651, 39223, 14011, 6645, 1290, 55769, 66295, 73591, 89499, 100959, 61199, 22210, 13107, 21301, 41438, 63197, 45913, 64920, 72477, 102030, 94728, 60840, 54776, 49579, 30920, 12936, 17534, 42568, 53476, 61521, 57654, 43936, 52970, 20210, 36737, 24781, 15600, 9287, 33656, 52122, 51215, 68603, 44879, 10707, 18795, 45214, 65242, 32724, 4052, 36467, 70485, 39360, -5001, -33791, -37328, -6055, 15756, 16449, 12366, 27316, 16538, 7866, 48206, 60108, 78843, 112773, 123257, 106405, 126718, 153139, 139601, 101979, 93295, 69417, 53440, 64339, 75118, 81637, 45818, 10445, 15841, 46029]
10300D6029o975k4721K7939n729k1813p711o752j6324k1104O427J6939L0610M623
10287B1438l3681j8021o450J9527J2764N7302M3709K2690l5819k7008M534K8971
10275H9956l5870k8008r42L3187L4325K3580r053l5288r831l3177M4347m457l3111
10262C5658j4030j7904L4796P893n1820N716J4328K0904J2822L3185p544k7670
10250D6334l3619O831J7181K6301J466k6839L61J2632r081j7029k4707q528K6646
10237A7949L8926O566J8757j9516l5773j4439m720k5310l5430J4819L8543k585
10225b213J1124j583J1662l0640m727j0185P144L8987K5054j9597J7897L8676
10213H1599j2546Q617L8902j3580l917Q383J2241J0271n538k0807l5676n7844
$$ y = [46029, 39054, 14333, 42272, 36543, 14730, 7019, 267, -16057, -37161, -30734, -13795, 16815, 21438, -12243, -30264, -36714, -17187, -4423, 52879, 96588, 119278, 83459, 56451, 60985, 89956, 54086, 26078, 25136, 58323, 92648, 116228, 107175, 71887, 62056, 28879, 73226, 68769, 35658, 21628, 3724, 38520, 46413, -5407, 309, 14637, 35541, 48363, 81548, 74004, 46334, 12715, 19546, 36727, 63028, 64494, 37655, 38016, 50648, 41567, 24538, -169, -8697, 17949, 56875, 63441, 82198, 62682, 26909, 12470, 7750, -17560, -52990, -38171, 372, -2213, 8911, 7328, 18990, -11650, -16377, -26562, -19418, 19569, 44623, 25026, 42923, 81599, 69053, 77670, 116572, 102992, 99075, 107458, 119699, 129970, 124432, 103625, 67949, 10105]
10201A0105j7060n948N729j0901o0490J3774k06j2348R773K7284J685N0023M074
10188A5494l9334J5744J0789Q920k1475k6385J7324K3410j0453J2064L7159J6432
10176E9689n836M883l840J195J2287j1500j298L4534L1201J7301r411l0341j0069
10163H8795k7020m1777K540n98K863o305j3761j1695K3332K740P304r233k0761
10150c576Q947Q660j2362n542j585L3247j2521k1415k9920j1362K9635K5631L2440
10137D0277j4212k6428M7960k487l0693k4534J6537K0806L026p973m906k0640
10125c267J6421J2286N412j5316L872J7268M340K4038N6019K4200k9320n9975
10113E5978R403J5683k4244k7660l2981p755m1371K147N5274L5051J3863K6671
$$ y = [10105, -6955, -12903, -7174, -18075, -78565, -64791, -64997, -77345, -67572, -40288, -38603, 11420, 15494, -23840, -8096, 2693, 11613, -9862, -36247, -18923, 4487, -5966, 6098, 43257, 59689, 53853, 58736, 54896, 56091, 68378, 56878, 55580, 90114, 121315, 138616, 129205, 98864, 88795, 61775, 19998, 22538, 21940, 24803, 18498, 4737, -6958, 16374, 19114, 26418, 17185, -3576, 5371, 14031, 1669, -3873, -5458, 27789, 15268, -6147, -36067, -47429, -17794, 7837, 40277, 26065, -363, 47597, 45110, 14417, -10117, 6420, 27226, 30252, 22279, 17373, -3267, 13154, 25440, 30852, 15536, 19408, 36676, 41016, 65054, 121073, 145273, 115953, 55978, 65381, 81064, 56820, 29160, -3821, -11576, -52947, -50800, 4474, 39525, 53388, 80059]
10101H0059l756l0750j2407Q30K0833j7959k2825M975L6825J819j3766M530j5953
10088C2455j5421P987L1249k4042m247K7559J3319R631j1503k6517l5629p292
10076b451j9125O420p999j2174J0986r8p222Q075K4835K7193p415k1112K0284
10063B0197J5419O582k1671O548l6616l9418l9571M0181K6971m346J9501L098
10051c125K2670L6354k0824m3111j4981J9407O491j0979L0844L1194O0782J1800
10039A26522n4360o9402j3835K6015K897q376k0629L1830L8675Q470j6797l5078
10027A5932J9607J7094k9271l0585j2733L9381N3291K2965j5079m2162k4464O794
10015B0770O498j1878L2384O00l3904N792j3543J1545N454k430P415J822R433
$$ y = [80059, 76303, 45553, 33146, 33976, 54809, 36850, 14025, 19000, 55825, 57644, 43878, 48408, 32455, 17034, 25021, 56270, 32228, 27981, 55540, 68859, 78490, 66987, 40470, 4841, -2451, -21576, -15156, -23155, -35329, -24343, -24441, -31663, -23588, 1247, 28440, 21025, -87, 20197, 35616, 42198, 20527, 27075, -9541, -48959, -88530, -48349, -21378, -25724, -6223, -3125, 19545, 55899, 35075, -8036, -23017, -3610, 2881, -8098, 22746, 53940, 114722, 126522, 72162, 2760, -11075, 14940, 17837, 9461, -11168, 20662, 59337, 67807, 51010, 15932, 35539, 52633, 23362, -7223, -19956, 19425, 72716, 95681, 80602, 38440, 13976, 20770, 27268, 15390, 47774, 48374, 14470, 20262, 6719, 18264, 23718, 21288, 28703, 30525, 39958]
10002C9958K2890L9941m447J8173O501J7609n162l3451j7188O1360K7201O8299
9990B41684Q7842Q4364O3972N0055L2794M1054O80K812J3080j5679l0053j1706
9978E60899o4557j04955j33656r1349n7325l0762k5570L0454K9868P354M396n965
9966A18832J3169N338j3046m7737m7185k7590L1141J2589P295J1705K5700j5593
9954G4618m375p979L9786K5524J8651m3046j468O509j2992J0852P245k7819L017
9941H8523K2171J5046J780J1727o626n800o508K5430L7130J620K6876J6208J1057
9928B38634N2959J6437M5355P8507J49269K32887K96576L01360K45808J85540
9918A843332J55890J44361Q0844k4645j1257q2264j51631j85760k74645k26625
$$ y = [39958, 62848, 102789, 98342, 116515, 123016, 140625, 135463, 102012, 84824, 146184, 173385, 241684, 329526, 413890, 477862, 527917, 560711, 601765, 602445, 605257, 618337, 602658, 572605, 560899, 496342, 391387, 257731, 166382, 109057, 78295, 52725, 83179, 113047, 120401, 124797, 118832, 132001, 137339, 124293, 76556, 29371, 1781, 32922, 45511, 52806, 64511, 90211, 74618, 70243, 62264, 102050, 127574, 146225, 103179, 101711, 108220, 95228, 106080, 113325, 85506, 88523, 110694, 125740, 127520, 139247, 132621, 126821, 120313, 145743, 182873, 184493, 211369, 227577, 238634, 291593, 308030, 353385, 431892, 581161, 814048, 1110624, 1411984, 1657792, 1843332, 1999222, 2143583, 2224427, 2199782, 2188525, 2106261, 1954630, 1768870, 1494225, 1267600]
9908A267600k03381j89576j10775q1512r0353n5841k1517P922J4161J2983m8672
9897E01039l8129l3963M342j8771r349k1276k3453R785m8902o0408n948M7115
9885C02082M31n5119n4215j3726l264j7k496m715K930P41K1771K124l5486l8638
9871A22403k2200J4552K8846J8921J867k054M491L5538l3019m2516M291k574k8966
9858I9580R103N147m910K4922j5380O942l2313j2615p955P422j4064k3805p9K2023
9844F4018K6349J0205k1637n137p303m2414l0044J0535N5722j106l8984j998J0217
9831B8423J317J2254k013N291K148J1327J6009L3661l858l6534m778K9706q970
9818H3983l771q257K628q120J0756q535l6932k543O866Q904K6110K2132L2560
$$ y = [1267600, 1064219, 874643, 763868, 682356, 592003, 536162, 514645, 522567, 536728, 549711, 501039, 462910, 428947, 433289, 414518, 405169, 383893, 360440, 370225, 321323, 260915, 254967, 302082, 302513, 247394, 193179, 179453, 176189, 176172, 173676, 168961, 171891, 172632, 194403, 196527, 161041, 122403, 100203, 114755, 143601, 162522, 164389, 162335, 166826, 202364, 169345, 126829, 131120, 128546, 99580, 108683, 113830, 108920, 133842, 118462, 125404, 93091, 80476, 72521, 79943, 65879, 42074, 41995, 64018, 90367, 100572, 78935, 73798, 66495, 24081, -5963, 4572, 60294, 59188, 20204, 18206, 28423, 29740, 41994, 39981, 45272, 47420, 58747, 74756, 108417, 104559, 68025, 63247, 92953, 83983, 80212, 71955, 74583, 66463, 77219, 68684, 31752, 29209, 36075, 44979, 71089, 93221, 125781]
9805A25781m2593l1831J3647j6079p938K4791J1l2690k972K5094J5838l1412K0210
9792E9857L1688j6380J1906k3050o274l846J051m220l028r103Q172k464K2916
9779F7225O777l198k1123m4207L810L4798O6054R64j6289l1403j4037l2002j0408
9766F961n4707O693M9971l138K7074J9455J1443j3950n2349O477J783J1797K0127
9753C7637k0249J7031m828K029j1342J5948l7963j2385L3417J6559q740J4879
9741D1993j8578J555J1303m090k2664L4494K7409l4527p881J5369K054J5595L426
9728F5458J966L2855m6960k1615j7532K5955L2809K545k5804l8083r770K0035
9716B1859J9887L6597l76Q857j3048o535K8817J8163J1704j1409l2751L951j5327
$$ y = [125781, 83188, 51357, 65004, 48925, 40987, 65778, 65789, 33099, 30127, 55221, 71059, 39647, 59857, 91545, 75165, 87071, 64021, 57747, 53901, 54952, 50732, 47704, 38601, 46773, 44309, 67225, 74002, 70804, 49681, 5474, 9284, 44082, 110136, 111100, 94811, 63408, 49371, 17369, 6961, -47746, -41053, 8918, 5780, 32854, 52309, 63752, 49802, -2547, 3930, 5713, 17510, 37637, 17388, 34419, 29591, 31620, 20278, 36226, -1737, -14122, 19295, 35854, 27114, 41993, 23415, 24970, 36273, 32183, 9519, 44013, 71422, 36895, 29014, 44383, 46437, 62032, 65458, 67424, 100279, 53319, 31704, 14172, 40127, 72936, 75481, 49677, 11594, 1824, 21859, 41746, 78343, 77967, 86824, 73776, 67241, 96058, 114221, 125925, 114516, 81765, 85716, 70389]
9703G0389l7272N61P329O049n808K6572K9848l8357k1614R527m526j2087J3955
9690D4566o071M1573K0115k7616Q986J967k9282m0136L9408r839J0673J3637K1131
9677H9112j7056j0395j6720k4504K4818j5773j0686K5656J8744j1776m7535j047
9665B838L6218O7283M1446q766l341K5974Q960n4769k0741j2764K9377J4990J0563
9652A37268K8165N754P806N4051K8282j245K2490N7674L3747l73M097O15l8942
9639C39389r037l6486n4736j9305n3959o684K4836j4000j5102j3952k1198J960
9627A21726J3304L5l0080r941n399J6695J729k8015J9137Q977L3122n6949j7122
9614F7219J3627j0791k6975K0970P313r711j8457J8641l8125n28M578j4934K4194
$$ y = [70389, 33117, 33678, 41007, 47056, 41248, 67820, 97668, 59311, 37697, 47224, 42698, 30611, 44566, 38495, 80068, 100183, 72567, 81553, 83520, 54238, 14102, 53510, 43671, 54344, 67981, 89112, 72056, 61661, 44941, 20437, 45255, 29482, 18796, 44452, 63196, 51420, 3885, 2838, 39056, 106339, 147785, 139019, 135678, 161652, 170612, 115843, 95102, 82338, 111715, 126705, 137268, 165433, 171187, 178993, 233044, 261326, 260081, 282571, 340245, 373992, 373619, 377716, 378331, 339389, 330352, 293866, 239130, 219825, 165866, 159182, 184018, 170018, 154916, 140964, 119766, 121726, 135030, 135065, 104985, 95044, 89645, 106340, 108069, 80054, 99191, 108168, 141290, 84341, 67219, 80846, 70055, 43080, 64050, 71363, 61652, 43195, 61836, 23711, 23183, 27761, 12827, 37021]
9601C7021L2638Q973Q33L2541j459R509K7871p890o54j8902k748J2801J3580k4465
9587A19649J49j2788j6131J0257k198K0920J4814R084J4546r964m6062k8306K8136
9574A02106M9598N715n2277l3506l837J706j6154J6284N3419L1104k989r848k9512
9561A11809K0533J6488J6925L488k4190j5129k5559M46J7911r582P538Q461M91
9548A29630J8948l4374l9422L0285p572K8297j1306l1366k417L4766K5267Q684
9536A49420L9324J8240k149n896k2441L5155L814k0736k9494l9174K0669N3091
9524A99823M336j8228j5011M879J7818J3034k3476l0217n7979k0393M2659J1064
9512A28309K148N0912J1083o865l4151k1595L249o494q156j9253n863J0819m685
$$ y = [37021, 69659, 78632, 79465, 112006, 110547, 120056, 147927, 140037, 139383, 120481, 117733, 130534, 144114, 119649, 119798, 107010, 90879, 101136, 98938, 119858, 134672, 143756, 158302, 148338, 102276, 73970, 102106, 151704, 157419, 105142, 71636, 67799, 69505, 53351, 69635, 123054, 154158, 151169, 141321, 111809, 132342, 148830, 165755, 169243, 145053, 129924, 104365, 104811, 122722, 113140, 120678, 129139, 129630, 148578, 114204, 74782, 105067, 97495, 125792, 114486, 83120, 80703, 115469, 140736, 149420, 188744, 206984, 204835, 198939, 176498, 211653, 215467, 194731, 165237, 126063, 146732, 199823, 204159, 185931, 170920, 175799, 193617, 206651, 183175, 152958, 94979, 74586, 117245, 128309, 130457, 181369, 192452, 185587, 151436, 129841, 133090, 126596, 118440, 99187, 93324, 104143, 99458]
9499I9458J6048K7555J1283K4990P154q028m7623m071P801j4634j8784l6118J6058
9486H1089J6168K6853L094j5262L0762q123p274k1204K1069J850J5813j2992l217
9473A28626j1252j4858K1305j1531k3735k2040k8932J7788M9378L4467m733r523
9461A24960p487q475j0639K0627J4989l8395l4146L7485L3167N725m613J6002
9449A49200k906j6332J851K4129p20q160J515n6890l1867L7953K6722j7349L1420
9436A38566Q106k3075n1841j8971q504j9249K3609Q246k8122K3491L6961K5533
9424A14750l3042m7618j4151L2768N5752O737m0912l3114l445j3676L918K0107
9412D8074R600N3094J9186j3652j8059N635J2729k407l0998L0764K8035j8349
$$ y = [99458, 115506, 143061, 154344, 179334, 186488, 178460, 130837, 126766, 134567, 119933, 101149, 65031, 81089, 97257, 124110, 127204, 111942, 142704, 134581, 127307, 106103, 127172, 129022, 144835, 131843, 128626, 117374, 102516, 123821, 112290, 88555, 66515, 37583, 55371, 104749, 139216, 134483, 124960, 117473, 108998, 98359, 118986, 133975, 95580, 61434, 98919, 132086, 137811, 133198, 149200, 146294, 129962, 131813, 155942, 155222, 147062, 148577, 91687, 59820, 97773, 124495, 107146, 138566, 146672, 123597, 71756, 52785, 44281, 25032, 48641, 56887, 28765, 52256, 89217, 114750, 81708, 34090, 19939, 52707, 108459, 115196, 74284, 41170, 37725, 24049, 27967, 48074, 57674, 110768, 129954, 116302, 98243, 103878, 116607, 114200, 83202, 113966, 142001, 123652]
9400A23652k3725n4487l087N3387R384j1984j5069q962p926J5006L2958j8869
9388I0278M0787N1119L372O385l7828k6935J4943N680n0295j0672J5783J3931
9376A16548M4246K7540Q7J2445J2403j379k5646m721k1337k7255r649J6807M7876
9363A87965P469m9926l9084J3297J7065J2824q42K0640k3162m4197L8281K2113
9351A62443j1813N286J9279J0801j792l4574j4286j191L445K6593j5665Q366P864
9338A64756j9581j9655K0519N573l4760j542j5500J456K6304J3057k4895K0474
9326A36206J1162l3551k453M5201N6448M281R910k243p584m3512j1386J8358J3182
9313A94019n4445k6609j3318O025N580L4683J2352j8777p371O311k1522J4595
$$ y = [123652, 99927, 45440, 42353, 95740, 105124, 93140, 78071, 69109, 61183, 76189, 109147, 90278, 131065, 182184, 185556, 191941, 154113, 127178, 142121, 147801, 97506, 86834, 102617, 116548, 160794, 188334, 188421, 200866, 213269, 211890, 186244, 181523, 160186, 132931, 123282, 140089, 187965, 195434, 145508, 106424, 119721, 136786, 149610, 148768, 169408, 146246, 102049, 140330, 162443, 150630, 155916, 175195, 185996, 184204, 149630, 135344, 134153, 137598, 164191, 148526, 156892, 164756, 145175, 125520, 146039, 151612, 116852, 115310, 99810, 101266, 127570, 140627, 115732, 136206, 147368, 113817, 111364, 156565, 213013, 217294, 227204, 224961, 217377, 173865, 162479, 180837, 194019, 139574, 112965, 99647, 105672, 111252, 145935, 158287, 139510, 132139, 138450, 116928, 131523]
9301A31523j4619J316l369k01j7925K5621J2192q355L9883L2023o721k5417l6146
9288A29805l353j5534Q870L2705K854l8940J9318J4841O719j4011j1928j1701
9276A19645p722N683M5085k1865o715K8880l5617j4110K0441L0959J2352o659
9264A70357k5871j6542J5511N0135K3432p994m2338Q988L3239L281m247J3674
9252B21625j7832k6256k1525K979J4193N9155m003K2055r186m3341r130q203O71
9239A81202L2572K8227j5254j3598L2211J32K5774k5113l1846M3331P831o0860
9227B04609k9016k1599O16J8178j4537Q258M645J701l713j4468k0298J4058L8042
9214A86476j1063r820k385L0965J8597k0043k5646O659L0582J4603m8619j9500
$$ y = [131523, 116904, 118220, 114851, 114650, 96725, 122346, 134538, 126183, 166066, 198089, 191368, 165951, 129805, 126452, 110918, 119788, 152493, 155347, 116407, 135725, 150566, 157285, 143274, 131346, 119645, 111923, 117606, 162691, 140826, 134111, 162991, 127374, 113264, 133705, 164664, 177016, 170357, 144486, 127944, 143455, 193590, 217022, 209028, 166690, 175678, 208917, 212198, 207951, 221625, 203793, 177537, 156012, 158991, 173184, 232339, 228336, 250391, 241205, 197864, 188734, 180531, 181202, 213774, 242001, 226747, 213149, 245360, 245492, 271266, 246153, 214307, 257638, 265469, 204609, 175593, 153994, 154610, 172788, 158251, 166509, 171154, 172855, 169142, 154674, 134376, 148434, 186476, 175413, 165593, 163208, 194173, 212770, 192727, 167081, 173740, 204322, 218925, 170306, 150806]
9202A50806o924L843L9801R676k7802J8453N017M8108K7442K6424R290j7661k414
9189B84059k4701l7075k5390J1011L4010J2822j8211n1411j2872O9252N6150l8476
9177B59168l2586J4189k6549j1548j1756O752j3796R131M7535M958k6169l0347
9165A88982R089L4338J8208N513N8199P323j1006k4269l4984j9663J037O809L2048
9152B71624r104q618J7181O7011K3072k3872k3183n773J5360K299l6157m2937
9140B46903N015Q9325O2909J8650j4668Q721J7383L5122M7813K6365j5315J3779
9128E42002M0797Q5219M6401J8079M6440j6001j9078K1427l8460o1083k9724j1658
9116F24361j6570m96j6407n157Q689l0050j1446m6679l4186k854j557K4272j5964
$$ y = [150806, 143882, 147725, 187526, 197202, 169400, 187853, 192870, 240978, 268420, 294844, 304134, 286473, 284059, 259358, 222283, 196893, 207904, 241914, 254736, 236525, 185114, 172242, 241494, 297644, 259168, 226582, 240771, 214222, 202674, 190918, 197670, 183874, 193005, 240540, 245498, 219329, 188982, 198071, 232409, 250617, 256130, 314329, 321652, 310646, 286377, 251393, 231730, 232767, 239576, 271624, 262520, 253902, 271083, 338094, 361166, 337294, 314111, 308338, 323698, 325997, 289840, 246903, 251918, 341243, 404152, 422802, 408134, 416855, 434238, 469360, 517173, 543538, 528223, 542002, 582799, 668018, 714419, 732498, 778938, 762937, 743859, 765286, 726826, 665743, 636019, 624361, 607791, 607295, 590888, 585731, 594420, 564370, 552924, 506245, 472059, 469205, 467648, 491920, 475956]
9103D75956l088Q592p487J0998K5595Q368k1637k272k8966K7446M9763K385m7651
9090D98002j1492K0430J7179O23O220N064o677J0548j0062K466R967Q115k8876
9077E21507k1485J9541M3552J3334o4034k6213N8619J7508n162O995K6641k899
9065E87904j9724m5173m6306J3724q95k1713j4180p522J9301N9458M6056J9505
9053E90435R792j1913J1768L4720L8998L8331N4990j5794k962l899n1259m9281
9041F43926L8294J4522j1747J2999L9793P907j0965j2244j8006m3652n216K2365
9029F77976Q943J0487J2894m5673J1043J083l9872l3750J8972P7935L5045L6482
9017G71565j3701r594J743K0116L9335L4495N1580J7032J3422L0548K6659O7625
$$ y = [475956, 472868, 481460, 473973, 484971, 510566, 518934, 497297, 495025, 466059, 493505, 543268, 545653, 498002, 486510, 506940, 524119, 524742, 530962, 536026, 529349, 539897, 529835, 532301, 542268, 550383, 521507, 500022, 519563, 563115, 576449, 512415, 486202, 544821, 562329, 557167, 564162, 590803, 587904, 568180, 523007, 476701, 490425, 489530, 467817, 453637, 446115, 465416, 524874, 570930, 590435, 600227, 588314, 600082, 634802, 673800, 712131, 767121, 751327, 748365, 744466, 693207, 643926, 682220, 696742, 684995, 697994, 737787, 745694, 734729, 722485, 704479, 660827, 655611, 677976, 686919, 697406, 710300, 664627, 675670, 676753, 636881, 603131, 622103, 700038, 735083, 771565, 757864, 748270, 750013, 770129, 809464, 843959, 895539, 912571, 925993, 956541, 983200, 1050825]
9005A050825M1164R645O8406O8088L2040k6357l3717k0620K2724M1006K2512K4111
8993A299827M113Q630j5145Q09k0p051j5864O962k405p535K746L0351K4323K7318
8979A357059J6104M2298L2591P898m080L3353O7000L9792M8499N7062O1081P0524
8967A829181L6152N5792N706M0030P7656Q1192P3847P291N0999J03079O5516R7756
8955B524197J02972M1417M4229P4403L1275J03359R1830Q1567P5031Q2252J12080
8944C364612Q4416J11761P8105J06844J11964R5119J27100J39678J20871J10742
8934D451212J45696J35465J33304J24611J19605J02258J49941J71016J81569J57534
8924E872211J89674K14516J92452K00611J94332K12722K91814L28857L02311K81964
$$ y = [1050825, 1091989, 1101634, 1170040, 1238128, 1270168, 1243811, 1210094, 1189474, 1212198, 1253204, 1275716, 1299827, 1303940, 1312570, 1297425, 1298234, 1298214, 1291163, 1275299, 1282261, 1279856, 1272321, 1275067, 1305418, 1329741, 1357059, 1373163, 1415461, 1448052, 1455950, 1451870, 1485223, 1552223, 1592015, 1640514, 1697576, 1758657, 1829181, 1865333, 1921125, 1926831, 1966861, 2044517, 2125709, 2199556, 2206847, 2257846, 2360925, 2426441, 2524197, 2627169, 2668586, 2712815, 2787218, 2818493, 2921852, 3013682, 3095249, 3170280, 3252532, 3364612, 3449028, 3560789, 3638894, 3745738, 3857702, 3952821, 4079921, 4219599, 4340470, 4451212, 4596908, 4732373, 4865677, 4990288, 5109893, 5212151, 5362092, 5533108, 5714677, 5872211, 6061885, 6276401, 6468853, 6669464, 6863796, 7076518, 7368332, 7697189, 7999500, 8281464]
8914H281464L09259L33773L45771L66710M03102M11719M71656M74497N52939N76110
8904A2527000O62399O87499P19008P97550R09250R51840J034548J133297J309836
8895B0732227J443652J658316J898492K088028K366926K757210L178694L607832
8887C9731377M171748M892389N792748O925680Q322574J0062987J2164124J4847975
8879A06911602J8162250K2115481K6911396L2451144L8215188M3155137M5383363
8872C33305561M2230580L1785365J4722370n072061k2686928l4638154m0078843
8865C19567890m0152916l6966089l2295062k7384950k2877451j9048130j5836373
8858A25006919j3180850j1022392r222150p819580o711510n763827m974353m288913
$$ y = [8281464, 8590723, 8924496, 9270267, 9636977, 10040079, 10451798, 10923454, 11397951, 11950890, 12527000, 13189399, 13876898, 14595906, 15393456, 16302706, 17254546, 18289094, 19422391, 20732227, 22175879, 23834195, 25732687, 27820715, 30187641, 32944851, 36123545, 39731377, 43903125, 48795514, 54588262, 61513942, 69836516, 79899503, 92063627, 106911602, 125073852, 147189333, 174100729, 206551873, 244767061, 287922198, 333305561, 375536141, 407321506, 422043876, 416971815, 394284887, 359646733, 319567890, 279414974, 242448885, 210153823, 182768873, 159891422, 140843292, 125006919, 111826069, 100803677, 91581527, 83761947, 77050437, 71286610, 66312257, 62023344]
8850F2023344l782933l295504k861820k565904k268171j981468j769791j621520
8842D1876233j470612j242220j119662r73580q37214p61036p14990p08789p29512
8833C3318618q35772q96444r65293j033111j117740j092721j094762j132022j080947
8824B4069806j063837j061897r55074q81191q93073q73584q01988p63796p07279
8815A6068087o97062o63854o12749n85380n64945n66902n08430m67223m29334
8806A0972208m36596m01072m05711l91380l65646l12695l32001l37410l04317
8797G685380k73254k63222k77259k97498k73310j92062j89898k06419j90253j76840
8787E345365j79027j47904j59796j95934j80528j95121j34202j23536j13707j01751
$$ y = [62023344, 58240411, 54944907, 52083087, 49517183, 47249012, 45267544, 43497753, 41876233, 40405621, 39163401, 38043739, 37070159, 36232945, 35471909, 34756919, 34048130, 33318618, 32482846, 31586402, 30621109, 29587998, 28470258, 27377537, 26282775, 25150753, 24069806, 23005969, 21944072, 20988998, 20107807, 19214734, 18341150, 17539162, 16775366, 16068087, 15371025, 14707171, 14094422, 13509042, 12944097, 12377195, 11868765, 11401542, 10972208, 10535612, 10134540, 9728829, 9337449, 8971803, 8659108, 8327107, 7989697, 7685380, 7412126, 7148904, 6871645, 6574147, 6300837, 6108775, 5918877, 5712458, 5522205, 5345365, 5166338, 5018434, 4858638, 4662704, 4482176, 4287055, 4152853, 4029317, 3915610, 3813859]
8777C813859j34665j40511q7571o7641j09674r2234j24944j20238j12274p7924
8767B746183o6584o2541p4433m6023k9184n7688r6813q7618n8207r500j4016k7361
8755B116215j7819l5427k5775N0585L6624K7785M0332k2121m0808j7413r569j2919
8743B089690l9761q6039o7014n9826p5266n6174n4795o1866n5189m4103p0218
8732A419439o5863q0344o1792K271K2735k9222K096k011n0742j7463o051L9979
8720A173032J7537n4834j3308k9276j5671J6337L318p018M453k2534j6760R502
8708A064778k3891Q920M3486K0084l9448l2053m0544r74J6719r402m4996n968
8696I56711J6881k8404j5397J1872l4874l270j8241K226M1468J3144K107J9090
$$ y = [3813859, 3679194, 3538683, 3451112, 3383471, 3273797, 3181563, 3056619, 2936381, 2824107, 2746183, 2679599, 2617058, 2542625, 2496602, 2467418, 2409730, 2312917, 2225299, 2167092, 2157592, 2143576, 2116215, 2098396, 2062969, 2037194, 2087779, 2124403, 2152188, 2192520, 2170399, 2129591, 2112178, 2102609, 2089690, 2049929, 1963890, 1896876, 1837050, 1761784, 1705610, 1650815, 1588949, 1533760, 1489657, 1419439, 1353576, 1273232, 1211440, 1213711, 1236446, 1207224, 1209320, 1207309, 1156567, 1139104, 1133053, 1173032, 1190569, 1135735, 1122427, 1093151, 1077480, 1093817, 1097135, 1090117, 1094570, 1072036, 1055276, 1064778, 1040887, 1049807, 1093293, 1113377, 1073929, 1041876, 1001332, 1000358, 1017077, 1007675, 962679, 956711, 973592, 945188, 929791, 941663, 906789, 903519, 885278, 887504, 928972, 942116, 944223, 963313]
8684I63313K7207m711L3155N7454l727o8910n4746O739M7068Q926j6906j0017
8672I84845n6845m7166Q254K5103l2493k3374k2883l8445o760o140q677k1679
8660G53740j1062k162j9699l1405M7718R8n6898o4086m2890K4945J3660m0943
8648E71016r211m19n426J3233k3443j7871k4918L594K5881J2143j7243l8199J5198
8635E04335K4065l5337k2749J9793J0427K3859O418n746M2671J1751m3494r082
8623E26911J5936J6282j4253L3215l574o3369k8836q976K134Q838J663J4728N760
8610E06459l5573K8666N90j2041j0085J0553Q598j2609q062q96J8809o313k0221
8597D67875J5921p792P301j5072k4990k9929k3522j7286k0505J876J002J619j7290
$$ y = [963313, 990520, 985809, 1018964, 1076418, 1072691, 1003781, 949035, 955774, 1002842, 1011768, 994862, 984845, 928000, 880834, 889088, 914191, 881698, 858324, 835441, 796996, 790236, 784096, 775419, 753740, 742678, 740516, 720817, 689412, 737130, 737228, 680330, 616244, 573354, 598299, 611959, 571016, 561805, 561386, 555960, 569193, 545750, 527879, 502961, 506555, 532436, 544579, 527336, 489137, 504335, 528400, 493063, 470314, 490107, 500534, 524393, 530811, 525065, 567736, 579487, 535993, 526911, 542847, 559129, 544876, 578091, 574517, 511148, 482312, 473336, 475470, 484308, 485971, 500699, 506459, 470886, 499552, 500142, 488101, 478016, 488569, 497167, 484558, 476496, 475600, 494409, 488096, 467875, 483796, 476004, 483305, 468233, 443243, 413314, 389792, 372506, 352001, 353877, 354879, 356498, 339208]
8584C39208J5299k9332K1865k3948k9801k1520j0245j1015O944J5125l434k3916
8572B45230N597J6224J0486p812n04J2386K5872j496J335L4267L7190r716k177
8559C66882J0082m8409p300m672l752j4226N366j2519j1887m66M1430Q010K701
8546C31240q612k9099N2934J5278p88l579j4153l4917j6321L1975j6059J248p546
8533C01601R459k2257j3421M803K9155k8614o7507l7177L7385L8858L9469j716
8521B90038k1903j4664k9351K4726N1N638r05O710k1070k6039j2791j8151L1629
8508B13918j1997n056j8845K0427R429l7915j8967l07K8809M1785J1830J8281
8496B51392j9869l4110m0529J3109j6743k7109j1333J1607q339j5879J7757L0275
$$ y = [339208, 354507, 325175, 347040, 323092, 293291, 271771, 261526, 250511, 257455, 272580, 269146, 245230, 250827, 267051, 277537, 269725, 269221, 281607, 307479, 305983, 307318, 341585, 378775, 369059, 366882, 376964, 328555, 321255, 316583, 312831, 298605, 303971, 291452, 279565, 279099, 320529, 328539, 331240, 322628, 293529, 346463, 361741, 360953, 357374, 343221, 308304, 291983, 323958, 307899, 309147, 301601, 311060, 288803, 275382, 280185, 309340, 280726, 213219, 176042, 213427, 252285, 291754, 290038, 268135, 253471, 224120, 248846, 248897, 254535, 253630, 260340, 239270, 213231, 200440, 182289, 213918, 201921, 196865, 178020, 198447, 207876, 169961, 150994, 150687, 179496, 221281, 233111, 251392, 231523, 197413, 156884, 169993, 153250, 126141, 114808, 126415, 118076, 102197, 119954, 150229]
8484A50229o798J1923L5827j5027k276J1191j583j6715k885l5605j8143j3804
8472I6334L5927N003j0239k7921j293L026N938M27m009K451k087J5219p51m320
8458A13705J4092J5409l3060m2428J6691j701M607L0130M0477K7789j6852K0077
8446A88936L0782j8658j7191j6136n8430k1976k535L608J7936k1122k1051J8541
8434H2704N1060j0677P886N1l7341P771j4968k0223J278L4431L7106k1960j0601
8421A06517R024q884o391k493M4410J3321k7039j9920L683L135L2640O997p244
8408A47756K8788L1259M668j9934l4184j3869J2732K150J1618M3620L6620k4751
8396B26473n9736k2355q537j0337j2433k844K594L5179K9034J3523j8491j5825
$$ y = [150229, 143431, 155354, 191181, 176154, 173878, 185069, 183486, 166771, 163886, 128281, 110138, 96334, 132261, 137264, 127025, 99104, 97811, 100837, 106775, 107202, 103193, 105644, 103557, 118776, 118025, 113705, 127797, 143206, 110146, 67718, 84409, 82708, 87315, 117445, 157922, 185711, 168859, 188936, 219718, 201060, 183869, 167733, 109303, 87327, 84792, 88400, 106336, 85214, 64163, 82704, 133764, 123087, 130973, 131024, 93683, 101454, 86486, 66263, 67541, 101972, 139078, 117118, 106517, 115541, 106657, 100266, 97773, 142183, 155504, 128465, 108545, 112228, 115363, 148003, 155000, 147756, 176544, 207803, 212471, 192537, 158353, 144484, 157216, 159366, 170984, 214604, 251224, 226473, 166737, 144382, 135845, 125508, 113075, 110231, 112825, 148004, 177038, 190561, 172070, 156245]
8384A56245P369o349J4441j328k621l0866O060K7415r086J5864J0055k4357j9574
8371A43268l6965j6262j717j4032K6653J2310l8316j5274J8310J7577J3946R622
8359A19120k2762j1946M6340L2902j5954K3142p866m9400n3843j8959r85K5211
8347F5000P283M054K6246L8981j8863k6821K1943o645k0058j1407L0959L2312
8335A42984l0610m1779N615k646J6355J1066j613K029j9194J143l0160r187K070
8322D6073k434k8987k5485k6378M9658P277M400K35K228J4725k1853M5084K2598
8309H7141k2097l0697l0723P027K4399Q185K6305P173J0104p194k8604l2099j3161
8296E759J2464J9782N994n329R19j5242j2969J7850j4217J3545N970J9875K8634
$$ y = [156245, 163614, 157265, 171706, 170378, 167757, 136891, 142951, 170366, 161280, 177144, 187199, 162842, 143268, 106303, 90041, 88324, 74292, 100945, 113255, 74939, 59665, 77975, 95552, 109498, 119120, 96358, 84412, 130752, 163654, 147700, 170842, 162976, 113576, 59733, 40774, 39789, 65000, 72283, 76337, 102583, 141564, 122701, 95880, 117823, 111178, 91120, 79713, 110672, 142984, 112374, 70595, 76210, 73564, 89919, 100985, 99372, 101401, 82207, 83350, 53190, 44003, 46073, 43639, 14652, -10833, -37211, 12447, 19724, 24124, 24359, 26587, 41312, 19459, 64543, 87141, 65044, 34347, 3624, 10651, 35050, 43235, 69540, 76713, 86817, 79623, 51019, 18920, 5759, 18223, 38005, 43999, 38670, 39589, 24347, 11378, 29228, 15011, 28556, 34526, 54401, 83035]
8283H3035K8840n33k1153l1677r119K4454j2727m245q356m0341J0213m044k8795
8270a4448J2361K3643L3909O882n7259k9118J2498r642O945J2608N6561K6686
8258H1626L7775K0017o5821k5686K3156L7035j7606m3404o09k271K0477L5696
8246A00385K675m932K051K0299k5432k2954j1529O911P7m400L7535L280J6964
8233A20930j0807K60J718k6537J3636O4469L2333j3548j3125j8897l3085q3100
8221C4247l2508M0988L7504l2519J9511M4538R578M319K9268j1413n0491j1589
8209H1433q363m5572q016L6009K4134j9497J1329L5553k394K679l720m9256j6570
8196C7749J1420O729k0671j7020k4208M848J361J2223L0673L9644j0654k9793
$$ y = [83035, 111875, 111342, 90189, 58512, 49393, 73847, 61120, 56875, 48519, 8178, 18391, 14347, -14448, -2087, 21556, 55465, 62347, 5088, -24030, -11532, -21174, -14229, -1621, 54940, 81626, 119401, 139418, 73597, 47911, 71067, 108102, 90496, 47092, 46483, 44212, 64689, 100385, 103060, 98128, 100179, 120478, 95046, 72092, 60563, 67474, 67551, 63151, 100686, 103966, 120930, 110123, 110383, 112101, 85564, 99200, 163669, 196002, 182454, 169329, 150432, 117347, 34247, 1739, 42727, 80231, 47712, 67223, 111761, 121339, 125658, 154926, 143513, 93022, 81433, 73070, 27498, 19482, 55491, 79625, 60128, 71457, 107010, 104616, 107295, 103575, 54319, 37749, 49169, 55898, 35227, 18207, -6001, -1153, 208, 12431, 43104, 82748, 72094, 42301]
8184D2301J3470j2243q834j0772J7877j0900M380R270j158O016l6644k9879J2250
8171d866j1461o269K5283M2914K574L4771j8224m7526K0081K5918r210J2034j567
8158F4452m2295p818p076K3799J2462j3154m396k540J9375m197n0781l0407J0261
8145c2315J9873R48J5034K8434K6953J9516j6525k8536J1964j1252J2026l805
8133D2315k5997Q088O433o360K6088o698K321j1591K7369P73k9853K244r732N385
8119C0785k777K5765m847k0783j036L798M8031K9050k3418k4599j5282k0244j1170
8106A3273R086L5822J9922K239Q447j6344j4332J5284j5907K845J7882J887o5635
8093A4469o8688J2346M2356L5306J5218L64k7426K7286M7344r153k7069j933j4806
$$ y = [42301, 55771, 43528, 34694, 23922, 41799, 30899, 35279, 44549, 43391, 49407, 12763, -17116, -4866, -16327, -22596, 2687, 45601, 48175, 82946, 64722, 17196, 37277, 63195, 53985, 66019, 64452, 22157, 14339, 7263, 31062, 43524, 30370, 25974, 23434, 42809, 38612, -12169, -42576, -32315, -12442, -11494, 3540, 31974, 58927, 78443, 61918, 33382, 45346, 34094, 46120, 42315, 16318, 24406, 30839, 24479, 50567, 43869, 46190, 34599, 61968, 62741, 32888, 35132, 25400, 30785, 28008, 53773, 48926, 28143, 27107, 30905, 78936, 107986, 84568, 59969, 44687, 24443, 13273, 22359, 58181, 78103, 80342, 88789, 72445, 58113, 73397, 57490, 60335, 78217, 80104, 14469, -54219, -41873, 483, 35789, 51007, 51371, 23945, 51231, 98575, 89422, 62353, 60420, 45614]
8080D5614J1454K070j1733j333m0486j6424k0750L1566K7675j6j1940m031J7894
8067B9560N078J374J6783l832J2208p18J076k5229l2834K8489L6774K3958J9094
8054A11781l2294m1112J6759K7967p465K965O75K4940K3328k2403M157P861l19
8041A16840j2250l7047k231k2811J6150J4326J2018k2860l2680j2484J115j0846
8029G240K3097K1201L774j3713l3507K402L2848N930K0754J2232k274J3426K4950
8016A18360k3126j4157l220p440R658K0662q837K9493k8490j8547j0608J0834
8004G4582K5112P485M174O706K878J4123k4203k0942q105J0974K1729l1289n948
7991G7276Q124J3540J3376M642m737P176j4764k4598K311n5800l7905Q689j0200
$$ y = [45614, 57068, 59138, 47405, 46072, 5586, -10838, -31588, -22, 27653, 27637, 15697, 11666, 29560, 34638, 36012, 52795, 48963, 61171, 60453, 61529, 36300, 3466, 31955, 68729, 92687, 111781, 79487, 38375, 55134, 83101, 75636, 78601, 79276, 104216, 127544, 105141, 109298, 117159, 116840, 104590, 67543, 65312, 42501, 58651, 72977, 84995, 62135, 29455, 16971, 18086, 7240, 30337, 51538, 55312, 41599, 8092, 10494, 43342, 49272, 70026, 82258, 79984, 93410, 118360, 95234, 81077, 77857, 70417, 80075, 100737, 91900, 121393, 92903, 74356, 63748, 74582, 99694, 107179, 111353, 118059, 120937, 135060, 110857, 89915, 81810, 92784, 114513, 83224, 77276, 85400, 98940, 112316, 116958, 112221, 119397, 104633, 80035, 82346, 26546, -11359, -2670, -12870]
7978a2870J4359Q007K2212K9163K2920l8941J5302J5182K0016K1753m8824l6084
7966C2195R541j7405j2329J3068M2788Q89r379m256r324Q205J5492j6673o487
7953D6325J8446J019L1062m972l3053p749j3806R307L282J0022P465J1994p466
7940G1876j437M647J2518j8678l2044J4517L877o111r294m1044l0857l157J2341
7927b2846M5956L7911j4351m7886Q8L3546N036l0407j3084L0753M1210L7813r215
7914I4524m2640J1908k3033R997N195p082j4612k213J7541K3451q714N416M1688
7901A11426l3417l2947m2K9127k5071m3504k023r75J5615K7908l0665P190j205
7888B1417j4860J2181J9749K8183J7424k300j5384M456J0886o333n0565L0698
$$ y = [-12870, 1489, 9496, 31708, 60871, 83791, 44850, 60152, 75334, 95350, 117103, 68279, 32195, 41736, 24331, 12002, 25070, 67858, 68747, 59368, 55112, 45788, 53993, 69485, 52812, 46325, 64771, 65790, 96852, 91880, 58827, 51078, 37272, 46579, 49861, 59883, 67348, 79342, 71876, 70439, 75086, 87604, 68926, 36882, 51399, 55276, 49165, 39871, -1173, -32030, -35187, -22846, 23110, 61021, 46670, -1216, -1128, 32418, 37454, 7047, -6037, 24716, 65926, 103739, 94524, 51884, 63792, 40759, 50756, 55951, 48869, 34257, 32044, 49585, 73036, 64322, 69738, 111426, 78009, 45062, 45020, 74147, 49076, 5572, 3549, 2574, 18189, 46097, 15432, 22622, 21417, 6557, 18738, 38487, 66670, 84094, 81794, 66410, 70866, 81752, 75419, 24854, 55552]
7876E5552J0241j145R822n693j8203K6570K9176J420j7763l9523o7441q936K7453
7863A530k7071l623J6837K3835q872l5686k998K1636K794J3580K295j7643j9897
7850c3283N84K0849R72O548N603L5550j8188k3224j6133L1598L9236J6190N702
7837G2004l7399p5858m133L0429M112N531K5270o849m364n274p496L4913Q549
7824C9435l5291q88q327l6705K0185o830m8615J0682O1875L965n277N791P933
7811G933J4524J0162j0052m3496j0776J2184m025K9970K7662k7122m40Q871k8768
7798a3373j4178M205P675K9000k2002j643k4303k44r618l0429j4867L5743K7668
7785b6366j7068L7169J4126J1098J4837k1503m6555j693K7389K8136K2581N702
$$ y = [55552, 65793, 64648, 74470, 68777, 50574, 77144, 106320, 107740, 89977, 50454, -16987, -25923, 1530, -25541, -29164, -12327, 11508, 2636, -33050, -36048, -14412, -11618, 1962, 4257, -13386, -33283, -32699, -11850, -10878, -4330, 1273, 36823, 18635, -4589, -20722, 10876, 50112, 66302, 72004, 34605, -41253, -45386, -14957, -10845, -5314, 19956, 13107, 8743, 3469, -4027, 30886, 39435, 4144, 3256, -5071, -41776, -21591, -28421, -77036, -66354, -4479, -514, -5791, 0, 7933, 22457, 32619, 22567, -20929, -31705, -19521, -23546, 6424, 34086, 6964, 6524, 15395, -13373, -27551, -23346, -15671, 13329, -8673, -10316, -34619, -34863, -44481, -74910, -89777, -54034, -26366, -43434, -6265, 7861, 18959, 33796, 12293, -34262, -35955, -8566, 19570, 42151, 47853]
7773D7853j9685N003K0598J81l8147j9622n541O153k229m3349j4788k49K1084
7760d2738k965K0469J0242q996M5741K7786N541j8840m7143j2658p541R069K9956
7747G923J4381k9279q765K4190K1726r969l313L1101k4632n097k0737j2515P030
7734g956k911o224J3662J4229m9621J1404K3963M1142J2663k1963k1775j8187
7722a1574K1259J77N971n496k3444j8222K282J2142N683l465r844R087J6257R619
7708A0432N840J55J7158N283K2574J5607j2319Q319j5523l6618n789K388J2508
7695C0015j7485j2515K6501k0522n067L7596m400n513j4532P893r004J5261r683
7682A8545Q576M7213m605r207m7301j9844J1041l6454P195K6489K711o66K490
$$ y = [47853, 28168, 33171, 53769, 53950, 15803, -3819, -9360, -3207, -5436, -48785, -63573, -63822, -42738, -45703, -25234, -14992, -23988, 21753, 49539, 55080, 36240, -10903, -23561, -31102, -22033, 7923, 22304, -6975, -15740, 8450, 30176, 20207, 16894, 47995, 23363, 18266, -2471, -14986, -7956, -10867, -17091, -3429, 10800, -38821, -27417, -3454, 37688, 50351, 28388, 6613, -11574, 9685, 9862, 15833, 10337, -13107, -31329, -29047, -16905, -11222, -14687, -24531, -15444, 813, 10432, 16272, 16427, 33585, 38868, 61442, 77049, 64730, 73049, 57526, 20908, 15119, 17507, 30015, 12530, 15, 26516, 5994, 927, 38523, 34123, 28610, 14078, 21971, 12967, 28228, 18545, 27121, 74334, 69729, 60522, 13221, -6623, 4418, -32036, -24841, 1648, 4359, 3693, 6183]
7669F183k8552K7117K0862J9298j7219l1393k1332K0031j1150N1295L5286m0453
7657B9973j3513k9452Q577J3235m092Q563l706j5713k3821l1924J4239K1535K2193
7644c906k2162k9763N814L7379O136r880k828Q8J6100k1475j9952J0081L1145
7631c223L5194K830k1090q799o413j0253j5231k7068K167l222O704J1009l4718
7618g2113O399k728J8984K3010O1882K976k5455j2198L3770j1766k7432Q014j2608
7605i265q180J2121K6753K515j7179L4454K4053k2141l3135j7234m1385J4737
7593c3886K0296P382N7160j0297m1147k961K1416R613k1543p5843l1311N3280
7581d7841L2641J9153L0686n925l1810k7474K4646J2778k5105k3512j8599J3895
$$ y = [6183, -22369, 4748, 25610, 44908, 27689, -3704, -25036, -5005, -16155, 35140, 70426, 29973, 16460, -12992, -4415, 8820, 4728, 13291, 9585, -6128, -29949, -61873, -47634, -26099, -3906, -26068, -55831, -50017, -12638, -6502, -16382, -19210, -19122, -3022, -24497, -44449, -34368, -3223, 31971, 34801, 13711, 4912, -1501, -11754, -26985, -54053, -51886, -55108, -48404, -37395, -72113, -65714, -68442, -49458, -26448, 35434, 38410, 12955, 757, 34527, 22761, -4671, 3343, -9265, -17445, -5324, 21429, 23944, 6765, 41219, 65272, 43131, 9996, -7238, -48623, -33886, -13590, -6208, 50952, 40655, -492, -3453, 17963, 27576, 6033, -69810, -101121, -47841, -15200, 3953, 34639, 28714, -3096, -30570, -5924, 6854, -18251, -41763, -60362, -46467]
7569d6467j984k213J7158j7212j17K1868L5697n7J7799L5849j1799j4109m933
7556B9480j6268l08J4268o073j6165K1267K8214N25r829j2769l8408n4813k1803
7543h2682L1003J753J8329J3071J4396M199m923K9287L7501J0288j6841l1254
7531B4127J0939J1486l2385l3393l3434l4593k8134J4286M8033M909K1264L8568
7519A1673N509j2063l0221n31K8073j2650J256J7364J1530L9105j7321l5528k0599
7506a4403K7941m921l317N362j2592j2905q128M2639j3926k1457j877k7986l011
7493d8581L4022m822L160K5183J2174j4669j9224J9707L337j8088j3469M2369
7481B1099L3594k3744M109j5491l2736M23L3338k9260m80J5787j6983J1081K4802
$$ y = [-46467, -48451, -50664, -33506, -50718, -50835, -28967, 6730, 6673, 24472, 60321, 48522, 34413, 29480, 13212, 12904, 27172, 21099, 4934, 26201, 54415, 54940, 45111, 32342, -6066, -60879, -82682, -51679, -49926, -31597, -18526, -4130, 69, -4854, 24433, 61934, 72222, 55381, 24127, 35066, 46552, 14167, -19226, -52660, -87253, -115387, -101101, -53068, -48159, -26895, 11673, 17182, 5119, -25102, -25633, 2440, -10210, -8954, 8410, 19940, 59045, 41724, 6196, -14403, 13538, 8617, 5300, 10662, -1930, -14835, -22963, 19676, 5750, -15707, -17584, -45570, -48581, -14559, -19381, -16221, 8962, 21136, 6467, -12757, 6950, 10287, -7801, -21270, 21099, 54693, 30949, 35058, 19567, -13169, -12746, 20592, -8668, -9148, 6639, -10344, 737, 25539]
7468B5539O082k716m131L470J322k3339P536J7185P139K0744P021k4759J091m0334
7454A850l5331l585o347K6539L6674j3276p519R52j3532L0728l605l4006m0989
7441f1447R936L2580J3738J814k0411j2005j2743R660j8314l718Q214L4187L0102
7428A1593k3804n080k168r307K6139L8304l4458n5546O35L7527J8512j1215J3850
7415D982j375k5332J8678M0069J6070l1106k2867r529k7968j8678P037J1421J1847
7402b6751L4683K5836j706m0515j3850J5909J3555N957k784j6622K603K9122k0656
7389D781m1831r465L3629M991m289j1M4247M2301m125n8977k3823m4365l5886
7376i2823O808L405K3181l151K3090k478R272K0115K2010J5817J264k4222j0521
$$ y = [25539, 31621, 28905, 24774, 28244, 29566, 6227, 13763, 30948, 38087, 58831, 65852, 41093, 42184, 1850, -33481, -37066, -43413, -16874, 19800, 6524, -995, -43, -13575, 17153, 13548, -20458, -61447, -51511, -18931, -5193, -3379, -23790, -35795, -48538, -38878, -57192, -60910, -52696, -18509, 11593, -12211, -17291, -19459, -28766, -2627, 35677, 1219, -54327, -53692, -16165, 2347, -8868, 4982, 3607, -21725, -3047, 37022, 53092, 21986, -881, -10410, -38378, -57056, -50019, -38598, -26751, 7932, 33768, 32062, -8453, -22303, -6394, 7161, 13118, 10334, -6288, -3685, 25437, 4781, -37050, -46515, -12886, -7895, -12184, -12195, 32052, 74353, 70228, 11251, -12572, -56937, -92823, -86015, -82610, -59429, -62580, -39490, -41968, -32696, -12581, 9429, 25246, 26510, 2288, -8233]
7363h233k7483k1930q075j6431J0755L119l974O3551N389L648j6295P369r182
7350a7772m218K1892n20k2710k5256k4796j6925K4579L5027M2851K2344j9264
7338A5232l1061O0727J9051l7634j0809P815j6437J6421L8086j7927m6615j7348
7326b0499o898K9362K3051K3737l2176l1214p455J9557L3984K9863l2796m1376
7314a2860k8887K8945J2671l9524P128L4349K253P545o760J9758L1825L367M627
7301F4437l8701J5240o0337m6741j3894K5055R285n566O921K7860k917l3k5020
7288d4411k9615l0781L077L8823O5312J9369p752k7407p098K25K6517K7491k6986
7275F764l1199K3165K6518j9278k4295n350j6280l365q422P43j4646L0636J9818
$$ y = [-8233, -35716, -57646, -65721, -82152, -71397, -68278, -72252, -8701, -3312, 336, -15959, -8590, -17772, -21990, -98, -618, -23328, -48584, -73380, -90305, -65726, -30699, 12152, 34496, 15232, -15829, 44898, 63949, 26315, 15506, 23321, 6884, 23305, 61391, 43464, -3151, -20499, -27397, 1965, 25016, 48753, 16577, -14637, -22092, -2535, 31449, 61312, 28516, -12860, -41747, -12802, -131, -39655, -32527, 1822, 4075, 11620, 4860, 24618, 56443, 59810, 64437, 25736, 40976, -19361, -66102, -79996, -54941, -45656, -51222, -44301, -16441, -19358, -19391, -44411, -74026, -104807, -101730, -62907, 2405, 21774, 14022, -13385, -20483, -20258, 6259, 33750, 6764, -24435, -1270, 25248, 5970, -18325, -23675, -39955, -43320, -51742, -50999, -65645, -35009, -15191]
7262a5191k8029k0637P946L859R29J625j653k507n998M8634K9897R553l2855m4525
7248d8952J6379o0j0934q421J5965K742q16j0464l0942l767L0144K0532L7647
7235I053K256m5712k4155N3987m8461J3051J9483j2069m02j2149j7351K4356K9787
7222h326m554j5471J8011L4955k0910k9180j4812L0956M557k5168l82K391j7017
7209d4950Q368j8583J2573j3077J0728O094J2028J3873Q059K88j7317j3812J9534
7196a6194J5893J6843J6803l0238k6254K8404K2900L1980j712m4294m1103q312
7184c5284L7285p575o357J4400k0853l803j3229K3430L5057P166k4577j0044k6599
7171c0983l7498K0923k1941J6208N9004J1946l7854r745J2102q262n512j5255
$$ y = [-15191, -43220, -63857, -55911, -52052, -51123, -49498, -51151, -53658, -59656, -11022, 18875, 28428, -4427, -48952, -32573, -32633, -43567, -51988, -36023, -33281, -34097, -44561, -75503, -79270, -49126, -28594, 9053, 11309, -34403, -58558, -4571, -53032, -39981, -20498, -32567, -32969, -45118, -62469, -38113, -8326, -12880, -28351, -10340, 24615, 3705, -25475, -40287, -9331, -4774, -29942, -30324, -27933, -44950, -36582, -55165, -42592, -55669, -44941, -38847, -26819, -12946, -4887, -4599, -21916, -35728, -16194, -301, 16542, 33345, 3107, -23147, 5257, 28157, 60137, 58425, 14131, -26972, -35284, 2001, -5574, -11931, 2469, -18384, -22187, -35416, -11986, 23071, 30237, 5660, -4384, -30983, -68481, -47558, -69499, -53291, 5713, 17659, -20195, -29940, -17838, -26100, -31612, -46867]
7159d6867o999k2584M3251K8627K5762K6726l544P085R598l7406l6834m246J7724
7146B93N812J7435L0371k6102k4222j0829m1582K5644J6647K5129k64l7115k8912
7133d7695J3545M1076J0758j122n517r442J7990j5335m3538J838K7112n256K6811
7120A1225K7058o296J2327K8541j5028j3641k7023j3266j2978J0490k1043j3783
7108c3417k7511n043K5958J2380K9572K1597m606O854j1115l7588j0572R151l3393
7095e7733L609j0314J5701p28L0793K9369K8932n22j4166l8869n469J0826j7484
7082b6055l6590K0887q714K1441n981J3522P000m262j2410n493j1413K0456N925
7069b1687j8134j1888j74J2979k707j0419J5585K7528P414K594J5616l3408l9074
$$ y = [-46867, -53866, -76450, -33199, -4572, 21190, 47916, 44372, 51457, 61055, 23649, -13185, -17431, 293, 6105, 23540, 53911, 27809, 3587, -7242, -48824, -23180, -6533, 18596, 18332, -18783, -47695, -34150, 6926, 17684, 16562, 11045, 1603, 19593, 4258, -39280, -37442, -10330, -15586, 11225, 38283, 31987, 44314, 72855, 57827, 44186, 17163, 3897, -9081, 1409, -19634, -33417, -60928, -65971, -40013, -27633, 1939, 23536, 18930, 25784, 14669, -22919, -33491, -24340, -57733, -54124, -64438, -48737, -49465, -18672, 10697, 39629, 39107, 24941, -13928, -19397, -8571, -26055, -62645, -41758, -50472, -29031, -35012, -21490, -14490, -18752, -31162, -36655, -48068, -27612, -21687, -39821, -51709, -51883, -38904, -41611, -52030, -36445, -8917, -1503, 1091, 16707, -16701, -55775]
7056e5775J8288O966j2076J3832K0927P872M375p11J5418m0814l2475K4446j1281
7043d1008k5128L1733K8964O2344R106m8043m257L2436K0939k6791l3814P7K2228
7030B8786R214L207N652l9624o647L4945l8509j7498R131J2654k7141l1663J4340
7017d3153K0445J9079p225N2859J8970m5496k2626K3935J8269k7970l3265j0980
7005c7158L8331R105k2501J0778K454m9221k2653L466K2722M2330R056M265O900
6992A7874o68j077J185O369l1343k491P599k2660j4239j3622j7602J4942K3263
6979c2470j8419j4939p390M5630P6601J0772k6671n915k6999m7475j8739Q849
6967e7165l7385p441J2573j307K5858L3086L36K531J761R206J9865q910m87J7187
$$ y = [-55775, -37487, -30521, -42597, -28765, -7838, 34, 4409, 3698, 19116, -21698, -54173, -29727, -41008, -66136, -34403, -5439, 56905, 66011, 17968, 13711, 46147, 67086, 40295, 6481, 6558, 28786, 38000, 41207, 46859, 7235, 588, 35533, -2976, -20474, -11343, 1311, -25830, -57493, -43153, -22708, -3629, -10854, 42005, 60975, 15479, -7147, 16788, 35057, 7087, -26178, -37158, 1173, 10278, -12223, -1445, 1009, -48212, -70865, -67399, -44677, -2347, 6709, 10974, 17874, 17206, 16129, 17314, 23683, -7660, -10151, -2552, -25212, -39451, -53073, -70675, -55733, -32470, -50889, -65828, -73218, -27588, 49013, 59785, 33114, 27199, 200, -47275, -66014, -57165, -94550, -101991, -89418, -90725, -64867, -31781, -31445, -28914, -27153, -17947, 1918, -6992, -7479, 9708]
6953I708N584M521Q716l7294P03P884j9586j0456K1242J662N731P728K0816K2039
6939D8998k5245k9988L597k4796O363L2128R876k6502N440p999j1514k8952m288
6926e2882o694K7559m641k557L0624J4743K5825J1717l8561j896l283r860M0265
6913C0359M1576P609m3331j4667K553l1760j2624J0652J5394l8n3459P606J0418
$$ y = [9708, 15292, 19813, 28529, -8765, -8062, -178, -19764, -30220, -8978, -7316, -1585, 6143, 26959, 48998, 23753, -6235, -2638, -27434, -21071, 11057, 20933, -5569, -129, -8128, -19642, -48594, -52882, -59576, -32017, -36658, -39215, -8591, 6152, 31977, 43694, 5133, 3237, -46, -9906, 30359, 71935, 79544, 36213, 21546, 24099, -7661, -20285, -9633, 5761, 5723, -47736, -40130, -29712]
$$ [...]
##END NTUPLES=NMR SPECTRUM
##END=
