##TITLE=Analysis number 312408
Compound Code cc 13504
Project Code adrs
Chemist Name endeavour
##JCAMPDX= 6.0         $$ Bruker NMR JCAMP-DX V2.0
##DATA TYPE= NMR SPECTRUM
##DATA CLASS= NTUPLES
##ORIGIN= Bruker BioSpin GmbH
##OWNER= NMR
$$ XWIN-NMR		Version 3.5
$$ Wed Aug  3 12:21:44 2005 GMT Daylight Time (UT+1h)  MAYBRIDGE\NMR@NMR_250MHZ
##.OBSERVE FREQUENCY= 250.131544655141
##.OBSERVE NUCLEUS= ^1H
##.ACQUISITION MODE= SIMULTANEOUS (DQD)
##.ACQUISITION SCHEME= undefined
##.AVERAGES= 16
##.DIGITISER RES= 18
##SPECTROMETER/DATA SYSTEM= dpx250
##.PULSE SEQUENCE= zg30
##.SOLVENT NAME= CDCl3
##.SHIFT REFERENCE= (INTERNAL, CDCl3, 0, 16.522)
##AUDIT TRAIL= $$ (NUMBER, WHEN, WHO, WHERE, WHAT)
$$ ##TITLE= Audit trail, XWIN-NMR		Version 3.5
$$ ##JCAMPDX= 5.01
$$ ##ORIGIN= Bruker BioSpin GmbH
$$ ##OWNER= NMR
$$ C:\u/data/dgb/nmr/ADRS/7120/pdata/1/auditp.txt
$$ ##AUDIT TRAIL=  $$ (NUMBER, WHEN, WHO, WHERE, WHAT)
(   1,<2005-08-03 12:21:25.37 +100>,<MAYBRIDGE\NMR>,<NMR_250MHZ>,
      <created by zg, POWCHK disabled, PULCHK disabled
       configuration hash MD5:
       62 19 C7 07 E1 42 D1 B7 37 6C 3D D0 77 39 F9 E6
       data hash MD5: 64K
       23 1E E0 A5 13 DB 17 32 E2 75 19 BF DC 6B 9F 8C>)
(   2,<2005-08-03 12:21:36.00 +100>,<MAYBRIDGE\NMR>,<NMR_250MHZ>,
      <Start of raw data processing
       ef LB = 0.3 FT_mod = 6 PKNL = 1 SI = 32K 
       data hash MD5: 32K
       16 02 D0 82 1A 01 1B C9 A5 DB 85 46 91 20 82 63>)
(   3,<2005-08-03 12:21:37.64 +100>,<MAYBRIDGE\NMR>,<NMR_250MHZ>,
      <apk 
       data hash MD5: 32K
       B8 C0 07 94 39 4B C1 DF 76 0A DB 53 D8 89 E8 08>)
(   4,<2005-08-03 12:21:38.46 +100>,<MAYBRIDGE\NMR>,<NMR_250MHZ>,
      <abs ABSG = 5 
       data hash MD5: 32K
       4D 6F 35 4C 6A 0B 7F 1B 13 D2 D0 47 49 AE F9 B8>)
$$ ##END=
$$ 
$$ hash MD5
$$ 52 FB A0 71 62 BA 7D 65 DF B1 29 E3 80 28 AD 70
##$RELAX= 
##$RELAX= 
##$RELAX= 
##$RELAX= 
##$RELAX= 
##$RELAX= 
##$RELAX= 
$$ Bruker specific parameters
$$ --------------------------
##$DU= <C:\u>
##$EXPNO= 7120
##$NAME= <ADRS>
##$PROCNO= 1
##$TYPE= <nmr>
##$USER= <dgb>
##$AMP= (0..31)
100 100 100 100 100 100 100 100 100 100 100 100 100 100 100 100 100 100 
100 100 100 100 100 100 100 100 100 100 100 100 100 100 
##$AQSEQ= 0
##$AQ_mod= 3
##$AUNM= <au_zg>
##$AUTOPOS= <20 >
##$BF1= 250.13
##$BF2= 250.13
##$BF3= 250.13
##$BF4= 250.13
##$BF5= 500.13
##$BF6= 500.13
##$BF7= 500.13
##$BF8= 500.13
##$BYTORDA= 1
##$CFDGTYP= 0
##$CFRGTYP= 5
##$CHEMSTR= <none>
##$CNST= (0..31)
1 1 145 1 1 1 1 1 1 1 1 1 1 1 1 1 1 1 1 1 1 1 1 1 1 1 1 1 1 1 1 1 
##$CPDPRG= <>
##$CPDPRG1= <>
##$CPDPRG2= <>
##$CPDPRG3= <>
##$CPDPRG4= <mlev>
##$CPDPRG5= <mlev>
##$CPDPRG6= <mlev>
##$CPDPRG7= <mlev>
##$CPDPRG8= <mlev>
##$CPDPRGB= <>
##$CPDPRGT= <>
##$D= (0..31)
0 1 0 0 0 0 0 0 0 0.06 0 0 0 0 0 0 0.0002 0 0 0 0 0 0 0 0 0 0 0 0 0 0 
0 
##$DATE= 1123068084
##$DBL= (0..7)
120 120 120 120 120 120 120 120 
##$DBP= (0..7)
150 150 150 150 150 150 150 150 
##$DBP07= 0
##$DBPNAM0= <>
##$DBPNAM1= <>
##$DBPNAM2= <>
$$ [...]
##$SUBNAM7= <"">
##$SUBNAM8= <"">
##$SUBNAM9= <"">
##$SW= 20.6930455092707
##$SWIBOX= (0..15)
0 0 3 0 0 0 0 0 0 0 0 0 0 0 0 0 
##$SW_h= 5175.983436853
##$TD= 65536
##$TD0= 1
##$TE= 295.16
##$TE2= 300
##$TE3= 300
##$TEG= 300
##$TL= (0..7)
0 120 120 120 120 120 120 120 
##$TP= (0..7)
150 150 150 150 150 150 150 150 
##$TP07= 0
##$TPNAME0= <>
##$TPNAME1= <>
##$TPNAME2= <>
##$TPNAME3= <>
##$TPNAME4= <>
##$TPNAME5= <>
##$TPNAME6= <>
##$TPNAME7= <>
##$TPOAL= (0..7)
0.5 0.5 0.5 0.5 0.5 0.5 0.5 0.5 
##$TPOFFS= (0..7)
0 0 0 0 0 0 0 0 
##$TUNHIN= 0
##$TUNHOUT= 0
##$TUNXOUT= 0
##$USERA1= <user>
##$USERA2= <user>
##$USERA3= <user>
##$USERA4= <user>
##$USERA5= <user>
##$V9= 5
##$VALIST= <valist>
##$VCLIST= <CCCCCCCCCCCCCCC>
##$VD= 0
##$VDLIST= <DDDDDDDDDDDDDDD>
##$VPLIST= <PPPPPPPPPPPPPPP>
##$VTLIST= <TTTTTTTTTTTTTTT>
##$WBST= 1024
##$WBSW= 4
##$XGAIN= (0..3)
0 0 0 0 
##$XL= 0
##$YL= 0
##$YMAX_a= 333129
##$YMIN_a= -397071
##$ZGOPTNS= <>
##$ZL1= 120
##$ZL2= 120
##$ZL3= 120
##$ZL4= 120
##$ABSF1= 16.522
##$ABSF2= -4.171173
##$ABSG= 5
##$ABSL= 3
##$ALPHA= 0
##$AQORDER= 0
##$ASSFAC= 0
##$ASSFACI= 0
##$ASSFACX= 0
##$ASSWID= 0
##$AUNMP= <proc_1d>
##$AZFE= 0.1
##$AZFW= 0.1
##$BCFW= 0
##$BC_mod= 0
##$BYTORDP= 0
##$COROFFS= 0
##$CY= 12.5
##$DATMOD= 1
##$DC= 0
##$DFILT= <>
##$DTYPP= 0
##$F1P= 14.0000005364418
##$F2P= -0.99999901652339
##$FCOR= 0.5
##$FTSIZE= 32768
##$FT_mod= 6
##$GAMMA= 0
##$GB= 0
##$INTBC= 1
##$INTSCL= 1
##$ISEN= 128
##$LB= 0.3
##$LEV0= 0
##$LPBIN= 0
##$MAXI= 10000
##$MC2= 0
##$MEAN= 0
##$ME_mod= 0
##$MI= 0
##$NCOEF= 0
##$NC_proc= -3
##$NLEV= 6
##$NOISF1= 0
##$NOISF2= 0
##$NSP= 0
##$NTH_PI= 0
##$NZP= 0
##$OFFSET= 16.522
##$PC= 1
##$PHC0= -73.74295
##$PHC1= 5.422259
##$PH_mod= 1
##$PKNL= yes
##$PPARMOD= 0
##$PSCAL= 4
##$PSIGN= 0
##$REVERSE= no
##$SF= 250.13
##$SI= 32768
##$SIGF1= 0
##$SIGF2= 0
##$SINO= 400
##$SIOLD= 32768
##$SREGLST= <1H.CDCl3>
##$SSB= 0
##$STSI= 32768
##$STSR= 0
##$SW_p= 5175.98343685301
##$SYMM= 0
##$S_DEV= 0
##$TDeff= 65536
##$TDoff= 0
##$TI= <Analysis number 999999
Compound Code 99
Book Reference 9
Project Code 9>
##$TILT= no
##$TM1= 0
##$TM2= 0
##$TOPLEV= 0
##$USERP1= <user>
##$USERP2= <user>
##$USERP3= <user>
##$USERP4= <user>
##$USERP5= <user>
##$WDW= 1
##$XDIM= 32768
##$YMAX_p= 365174088
##$YMIN_p= -154876
$$ End of Bruker specific parameters
$$ ---------------------------------
##NTUPLES= NMR SPECTRUM
##VAR_NAME=  FREQUENCY,     SPECTRUM/REAL,   SPECTRUM/IMAG
##SYMBOL=    X,             R,               I
##VAR_TYPE=  INDEPENDENT,   DEPENDENT,       DEPENDENT
##VAR_FORM=  AFFN,          ASDF,            ASDF
##VAR_DIM=   32768,         32768,           32768
##UNITS=     HZ,            ARBITRARY UNITS, ARBITRARY UNITS
##FACTOR=    0.157963299565203, 1,           1
##FIRST=     4132.6476996994, 0,             0
##LAST=      -1043.33573715361, 0,           0
##MIN=       -1043.33573715361, -154876,     0
##MAX=       4132.6476996994, 365174088,     0
$$ Real data points
##PAGE= N=1
##DATA TABLE= (X++(R..R)), XYDATA
$$ [...]
17162A805308j4598J03290P0936P2760L6394O0217J02680N5926K2024j2425j7187
17151B285325Q698M0294J7376Q0728J87117J66193K42554L82732M73491N95875
17141D480383P31025Q87833J209459J684460K320658L212310M389157N786445
17133B4701730P031863P359471O397598M045226P01859k680838n345376o881865
17125C5329668p063694o327598n251058m096698l070422k249395j668243j272678
17117D329882r29648p26928n47347l49375k25813j47467j09539o4970n5556l9800
17107A133439K1400K1908j2020j12819p9171r1906j07124q9198p5716r0257l7325
17096D81211n3989o5897m6171q0618p793K2313K4397k4540n5951m8943J1246L6797
$$ y = [1805308, 1790710, 1894000, 1964936, 2037696, 2074090, 2134307, 2236987, 2292913, 2314937, 2302512, 2285325, 2294023, 2334317, 2351693, 2432421, 2619538, 2785731, 3028285, 3411017, 3884508, 4480383, 5211408, 6099241, 7308700, 8993160, 11313818, 14526128, 18915285, 24701730, 31733593, 39093064, 45490662, 49535888, 50237747, 47556909, 42211533, 35329668, 28265974, 21938376, 16687318, 12590620, 9520198, 7270803, 5602560, 4329882, 3400234, 2673306, 2125959, 1776584, 1550771, 1403304, 1293765, 1228795, 1173239, 1133439, 1154839, 1176747, 1164727, 1051908, 972737, 880831, 773707, 684509, 608793, 518536, 481211, 427222, 361325, 315154, 234536, 226743, 249056, 273453, 248913, 192962, 144019, 155265, 192062]
17084A92062L778k2636K8165j7144j6028o534N372J8520K1492l7023j3254k1506
17072A35264n4559o027j2158K8259j9888J3859j852n2261J447N8418K0523J2526
17060A23551J1008n9011l095M4155j467k779n984j8870r367j1348L366L0452P580
17047A08191J931q515l4974k801Q10k3769m5083J3239M2090J9204O671m086l1371
17034D1537M351J6998J8103p4702o9561r522j4307K9441M1357K9958K022j3024
17022B651k1308j0051j4286o394L0483N2536L0881L820j5993l9674j327m699J3081
17009A9720Q8449l347k8161j9983Q990R648M1186j433o523l6901j0397N673K914
16996F9835k5003P020l8773n0723l444K0948K3707J8799K7059j4067J4642K2685
$$ y = [192062, 195840, 173204, 201369, 184225, 168197, 161663, 167035, 185555, 207047, 170024, 156770, 135264, 80705, 74678, 62520, 90779, 70891, 84750, 82898, 30637, 32084, 90502, 111025, 123551, 134559, 75548, 72453, 116608, 115141, 112362, 106378, 87508, 78141, 66793, 70159, 100611, 108191, 110122, 101607, 66633, 63832, 64642, 40873, -4210, 9029, 51119, 70323, 76994, 72908, 41537, 45888, 62886, 80989, 6287, -63274, -72796, -87103, -57662, -16305, 13653, 15675, 2651, -18657, -28708, -42994, -49388, -18905, 33631, 64512, 68332, 52339, 12665, 11338, 6639, 19720, 108169, 104822, 76661, 56678, 65668, 75316, 116502, 115069, 108546, 71645, 61248, 66921, 69835, 44832, 51852, 13079, -37644, -41088, -20140, 3567, 22366, 49425, 35358, 50000, 72685]
16984G2685k3706N402Q906m568k0438m5909N080l128j9549j785J9023m98J8127
16971I642J2255J0842j0034n1098R946L239L4789l162j7895m5125J0968M5292
16959I659m490j4910J4151j9219j9886L5546K5221j9620l912P439L210L2376r183
16946C6382O485l0046j6950n196j1477j2677K3830K7559L6395L3304l4599j4099
16934C8911j1048k5684l270J006M5214N368R059r276j0233o495k3634k8896J1355
16921g623O287m5503k3625j575M202J1838K6521K0122L1723l2792r214m7177L945
16908f2871p501L619J9080L2138L0751L2263J211J7074K2166N141l333k0113j884
16895F7741J3887o1479o5825l3745k1994q637M5560M3719K3842N705J2934R156
$$ y = [72685, 48979, 54381, 63287, 58719, 38281, -7628, -2548, -5676, -25225, -27010, -7987, -8485, 9642, 21897, 32739, 22705, -28393, -18447, -15208, 19581, 16419, -1476, -46601, -35633, 9659, 5169, -9741, 4410, -14809, -34695, 851, 26072, 6452, 2540, 9979, 13189, 45565, 36382, 42867, 12821, -4129, -9325, -20802, -33479, -9649, 17910, 54305, 87609, 53010, 38911, 27863, 2179, -1091, -85, 45129, 50497, 59556, 50280, 40047, 33552, 9918, -18978, -7623, -1336, -46839, -70464, -72039, -67837, -55999, -29478, -9356, 22367, -10425, -19639, -66816, -62871, -70372, -66753, -47673, -15535, 15216, 47479, 48690, 65764, 87930, 93071, 89738, 69625, 67741, 81628, 20149, -45676, -79421, -101415, -110052, -64492, -20773, 3069, 8774, 21708, 30864]
16883C0864L236j9406k6781J7866K3565K8827j3754J3164O522j2349r773l0668
16871A1313k1001J9280P848L87m76M147j9168j6510J5078O29J5606j1365L722
16858I490L6379j8606l9769m8421M610N9162M5061k1930m0191L2463j3525k8697
16846b3974K584L995R419n497m6167k3126M4614n2852O99J009r430K4315O4330
16833a0081L732q502k4641K1974M5338q089o5232K2618J1532p767l982j089N8675
16820C4486p470l8462J266k536j6378l8492N6609J2029k5416k7200j7622K5710
16808d3476K2471Q98l6850P419K224Q467J7511K4535l2102l1564K5658P100k2111
16795d9820N782j6665j148K1965j8457K7643N8360P292j5602j5333r423r245J2958
$$ y = [30864, 34100, 14694, -12087, 5779, 29344, 58171, 44417, 57581, 64103, 51754, 41981, 11313, -9688, 9592, 17440, 17827, 17351, 21498, 2330, -14180, 898, 1527, 17133, 5768, 9490, 45869, 27263, -12506, -60927, -56317, 2845, 47906, 25976, -14215, 18248, 4723, -23974, -21390, -17395, -7976, -13473, -59640, -82766, -38152, -91004, -90305, -89296, -98726, -74411, -10081, -6349, -14851, -39492, -17518, 27820, 19731, -45501, -22883, -11351, -19118, -23100, -24189, 34486, 27016, -11446, -10180, -12716, -29094, -67586, -10977, 1052, -24364, -51564, -69186, -43476, -21005, -20107, -56957, -49538, -47314, -38847, -21336, 3199, -28903, -60467, -34809, -27709, -49820, -44038, -60703, -61851, -39886, -58343, -30700, 27660, 34952, 19350, 4017, -5406, -14651, -1693]
16782a693K1756k188q457l4826k7488M1359j218l0597r375K9922J3524m371k1551
16769c5203j3853k9271L0830O8416k2478l3945J0451J538K568j266K5240l0698
16757b7671p081J9858j1158K7390j1706k9548K0412Q883j3499j6492j6041L072
16745e3581J3945j4825j140n072K030j7370N5199J9422o350J2184k8143J9313
16733d388N712J1000j4914o313O876J7901l2371l4800L864O959M690K2612J1253
16720a919q191k4809K611k8355m6484R372Q330L1497N8211j4534o947J6702j0013
16707a4529j6759N353k571j511J46r206j1785j211J5593J0979K8619O0038j0989
16694E2167n7855l5429q952n7147K2671O2403O323l5807K458L2371L2026K0746
$$ y = [-1693, 20063, 17875, 9418, -25408, -52896, -11537, -12755, -43352, -52727, -22805, -9281, -13652, -35203, -49056, -78327, -47497, 20919, -1559, -35504, -25053, -23515, -20947, -22213, 3027, -27671, -34752, -14894, -26052, 1338, -10368, -39916, -19504, -10621, -24120, -40612, -56653, -53581, -39636, -54461, -55601, -60673, -58643, -76013, -20814, -1392, -7742, 4442, -23701, -4388, 1324, 12324, -2590, -8903, -2027, 15874, -16497, -51297, -47433, -40474, -35784, -13172, -1919, -10110, -34919, -32308, -60663, -107147, -97775, -89445, -57948, 263, -14271, -21218, -4516, -14529, -31288, -25935, -28506, -30017, -29871, -39077, -50862, -52073, -36480, -25501, 3118, 63156, 52167, -5688, -41117, -50069, -107216, -84545, -22142, -15819, -51626, -49168, -16797, 15229, 35975]
16682C5975J194J7182O6849M4684L6149M4659j3567j6530o138k3903J8318j2135
16670A92737m5736n0328k4447j3739m0806n4344R89J4652J3941k7108J9728L4896
16658B0435J30k4317N66R521j2882l5448L138J5322O258O957n7708J4167J0066
16645d3795j7651K7997L0655K7139R31k4692l6932J1787J2328p502j0685k0887
16633e1307p428O2960L9281N728n48L7761P4029P5151N0114l750n470m7497j5338
16620B13686l1549m3299k3272n5769k2469M7248L1828j3669K5400k4433j8700
16609H5002j7113l2181j982K808R82J3493j6596k8409k9163J5511J2855l9814
16597c4607K9693J7039k5206J0413N268k9026j6280M1332p676o455n084N359q680
$$ y = [35975, 37169, 54351, 121200, 165884, 202033, 246692, 233125, 216595, 210457, 186554, 204872, 192737, 147001, 96673, 72226, 58487, 17681, -36663, -35674, -21022, -7081, -34189, -14461, 20435, 20565, -3752, -3186, 6335, -6547, -41995, -38857, -23535, -17277, -10320, -68028, -53861, -43795, -61446, -33449, -2794, 24345, 25276, 584, -36348, -24561, -12233, -19735, -30420, -51307, -58735, 4225, 43506, 49234, 48686, 86447, 160476, 235627, 285741, 281991, 276521, 229024, 213686, 182137, 138838, 115566, 59797, 37328, 84576, 116404, 102735, 128135, 103702, 85002, 67889, 35708, 33726, 36534, 37516, 51009, 34413, 6004, -23159, -7648, 5207, -34607, -4914, 12125, -13081, -2668, 2600, -26426, -42706, -1374, -9050, -15505, -20589, -15230, -23910]
16584b3910L5586L701k6286j7998j2148l2197P028K5998J1478P785p338l5712
16572f4013j5746N741Q134j669j9176j693M7243J0070P815J3341k3826K0900K6535
16559A3656P338K1392k2691m7461O042P426j9440O491K0790j5240j4237K0554
16547a5380K7533J4571o896K4369K3523n1561m7561J3504J4384R524J8962L1287
16535E6259k9387j7181l5548N201M319k0050k1176k416L5139O986m0155k8275
16523h6284n727M3094N8558L1221l3829k8326K0704K8463L622l8062n2581K5299
16511c3848J4331J7270l3781J539k351j8924j3636j0022J4718o408J4752L2742
16499b3618N019R270J244j0239j9182l3668N245J9985M4M7828K6518k3502j6526
$$ y = [-23910, 11676, 15377, -10909, -28907, -41055, -73252, -66224, -40226, -28748, -20963, -28301, -64013, -79759, -74018, -65884, -67553, -86729, -88422, -41179, -31109, -23294, -9953, -33779, -12879, 13656, 20994, 42386, 19695, -27766, -21724, -14298, -33738, -27247, -6457, -21697, -35934, -15380, 12153, 26724, 19828, 44197, 67720, 16159, -31402, -17898, -3514, 6010, 24972, 56259, 26872, 9691, -25857, -20656, -16337, -36387, -57563, -59979, -24840, -17854, -58009, -86284, -92011, -48917, 9641, 40862, 7033, -21293, -589, 27874, 31496, -6566, -59147, -33848, -19517, -2247, -36028, -34489, -36840, -55764, -69400, -79422, -64704, -71112, -56360, -23618, -18599, -9329, -8085, -18324, -37506, -71174, -65929, -45944, -45900, 1928, 28446, 4944, -11582]
16486a1582J4277n5M158k3658k6881j015L119q491K1867l542l8687J635L5196
16473c3659J464n5l3961L0135M7900L0719M074n144J6596j8370o2658j8171R22
16460d0208m9019L3500K2339L5496K3545Q169l3540j3945l3605N8806J908l5553
16448b2107k5934M4281J5781q337j5948l305K0593N3246k65l4136o3226j8311
16436e7668o253k0476n453k83K4558m833Q481N7197N7825P062j7203k4269L9672
16423E8357M3993K3829j4067n3506n4147K3001J7852N91M849J251j5978l2973
16411C052m3140R874L0914k9588j526J9256K5384L516R130k7084j5896J2496J2060
16398H448j5813j1276K5387J1216J0879j1807l4617l534N0606J2515l4913m8832
$$ y = [-11582, 2695, 2640, 6798, -16860, -43741, -44756, -41637, -50128, -28261, -31803, -70490, -68855, -33659, -32195, -32250, -66211, -36076, 11824, 42543, 46617, 41473, 58069, 39699, -22959, -41130, -40208, -89227, -55727, -33388, 2108, 25653, 33822, 282, -13663, -47268, 11538, 13446, -22107, -48041, -3760, 12021, 3684, -12264, -15569, 5024, 58270, 58005, 23869, -39357, -57668, -63921, -84397, -89850, -90133, -65575, -70408, -61927, -4730, 53095, 60157, 42954, 18685, 58357, 102350, 126179, 112112, 58606, 4459, 27460, 45312, 45903, 50752, 52003, 36025, 3052, -40088, -30214, 700, -28888, -30414, -11158, 14226, 17742, 26872, -212, -16108, -3612, 8448, -7365, -18641, 6746, 17962, 28841, 17034, -17583, -21117, 29489, 42004, 7091, -41741]
16386d1741L4152l1695j3529K4278M352o771k9059N580j3091r469K5259J4986
16374c6748j4084k6707m1516N1920K2313k3945J1326O948J3304m2170j9615K4889
16362g4085J6334J8345J0938O698O236K0422j3298n1795r595q759m736N919J2284
16349f5092L7580K9065k5704j4121N233J1402j1492j7275M4685k3564m6757J8592
16337e7448L8469M7180j104j8239k791N732J0192L160Q106N09j4778k2965M330
16324C53J9758N0799k3072l6645q410m7284j9748R094j119L5641j291k1730M7171
16311C517K7962K2865k5126l3795k6335M3969J5923r431Q852j9316m4974P198
16299b8691K6420o818l1088K6417Q10l0564J6341K2997l629r283J4647k9562J9286
$$ y = [-41741, -7589, -39284, -52813, -28535, -24183, -30954, -60013, -54433, -67524, -76993, -51734, -36748, -50832, -77539, -119055, -67135, -44822, -68767, -57441, -50493, -37189, -79359, -98974, -74085, -57751, -39406, -28468, -21770, -15534, 4888, -8410, -60205, -69800, -78559, -83295, -77376, -65092, -27512, 1553, -24151, -38272, -33039, -21637, -33129, -50404, -5719, -29283, -76040, -57448, -18979, 28201, 27097, 8858, 6067, 11799, 21991, 25151, 33257, 33766, 18988, -3977, 353, 20111, 70910, 47838, 11193, 2783, -44501, -64249, -55155, -56274, -20633, -21924, -43654, 3517, 31479, 54344, 29218, -4577, -30912, 13057, 28980, 19549, 28401, 9085, -35889, -28691, -2271, -9089, -40177, -13760, -12950, -43514, -27173, -4176, -7805, -17088, -2441, -32003, -12717]
16286a2717N495L1m3148m2377K6408L6868R334j4416j4472N809L824L525J3147
16273b2689L1090O562m2051k636q42k2190j4533q619J1842L5609q726J0159j4553
16260d1577K8669K014j0688K2208O638l2321J5240K9590l6537m2270J1630K1665
16248b5739j7534O404J349m0871L3989L1545p403J8372J436k071j8714j7459p684
16235d4380M063J2533m7745k9097L0025J6138J2751L4912L1912j557j2325L0117
16223C7347N981k2208j5472j9178q63M1292J674j579n392l8815J008J2677k427
16210e955l7079j5062k4748j3761K4271K3000L1952k871l0476k771K6979M0546
16198A4025k8332j1348K3923L2894q417K5168L5206o860m7384k3896K8318j644
$$ y = [-12717, -7222, -7191, -50339, -92716, -66308, -29440, -20106, -34522, -48994, -43185, -39361, -35836, -22689, 8401, 14963, -27088, -29724, -30566, -52756, -67289, -75908, -64066, -28457, -37183, -27024, -41577, -12908, -10894, -21582, 626, 7264, -25057, -9817, 19773, -16764, -59034, -47404, -25739, -43273, -36869, -35520, -76391, -42402, -10857, -18260, 112, 1548, -523, -19237, -36696, -44380, -40317, -27784, -75529, -104626, -74601, -58463, -45712, -10800, 21112, 19555, 7230, 37347, 43328, 21120, 5648, -13530, -14393, 26899, 28573, 26994, 21602, -17213, -16205, -3528, -5955, -43034, -58096, -82844, -96605, -72334, -49334, -17382, -20253, -50729, -53500, -26521, 14025, -14307, -25655, -1732, 31162, 22745, 47913, 83119, 76259, 28875, 4979, 33297, 31653]
16186C1653k1050J982n798l9230J213k5613m5145M92K5711K4660J4930M4727J8627
16173B7159J225m3569m0503j9855j6759K2618P3298M1476j6460m7286j8572n670
16161d2898j8967N9502m616m2158N522J8762N469N5954P677j6003j0130k4525
16149f411p1097k1494J2913j6933M5690J8543K2348K1161j61R55J6012n440l0755
16136a4669n508l693J5925J2605J8540Q541J8528k7066j6167k7309O616j1893
16124b5550m4787J0402K8069j3997L2704p747j7593J1693K4747L9991Q065o3510
16112a7513j6733j6053j5866K3320M0403K2443q556o077j6966j1655L4248j0524
16100D71l3418J4898M1033j1142J3207m0538k4283P663k2628K325J5814K0137
$$ y = [31653, 10603, 12585, 6787, -32443, -31230, -56843, -101988, -101496, -75785, -51125, -36195, 8532, 27159, 28384, -15185, -55688, -75543, -92302, -69684, 3614, 45090, 28630, -18656, -37228, -42898, -61865, -2363, -6979, -49137, -43615, -24853, -19384, 36570, 44247, 28244, 18114, -6411, -77508, -99002, -86089, -103022, -57332, -38789, -16441, 4720, 4559, 5514, 21526, 16086, -14669, -20177, -23870, -7945, 4660, 23200, 31741, 50269, 23203, 7036, -20273, -13657, -25550, -70337, -59935, -31866, -45863, -13159, -20906, -38499, -26806, -2059, 37932, 45997, -17513, -34246, -50299, -66165, -42845, -2442, 20001, 11445, 5368, -11598, -23253, 10995, 471, -32947, -18049, 22984, 11842, 25049, -15489, -39772, -32109, -54737, -52412, -36598, -16461]
16088a6461J0246K1909O46L5216M3586q4l3065m1867J7468M375m5834k8218k14
16075c2297R372L1856k9133J3547l6690k1398J1460K7204j6583K3534N0565m417
16063B7020N419m3360l6034k5926N415K4400K0944J9292r103Q318l0636l2871
16051f7122m0082K4128N4231M8717J2380j9201q255n5835l3779J9951L6421K4104
16039d342j0564k9520k5420K391J6584j2998j4206M4272L712j6404K1632L4610
16027I747k9978k0076r327M4998K0701m371k2877k8526L6125J6996r174l9333
16015c5095j2126M3736J6395m713o996k935p142p967j1579j3800o731m0904K168
16002h7689j590J8374K1215L2905M0562k3665j5496P0178K8802J5800j8704n3421
$$ y = [-16461, -6215, 15694, 16340, 51556, 95142, 95058, 61993, 20126, 37594, 41969, -3865, -32083, -32297, -22925, 8931, -20202, -6655, -43345, -64743, -53283, -26079, -42662, -19128, 31437, 27020, 32439, -10921, -46955, -72881, -67466, -43066, -22122, -2830, -11933, -3615, -34251, -67122, -107204, -83076, -28845, 19872, 32252, 13051, 4796, -51039, -84818, -64867, -28446, -4342, -14906, -44426, -69846, -67455, -50871, -63869, -78075, -33803, -30091, -46495, -24863, 9747, -20231, -40307, -49634, -4636, 16065, 11694, -11183, -39709, -3584, 13412, 4238, -35095, -47221, -3485, 12910, 8197, 1201, -1734, -8876, -16843, -28422, -42222, -48953, -89857, -87689, -89279, -70905, -49690, -16785, 23777, 112, -15384, 54794, 83596, 99396, 80692, 27271]
15990B7271J940P991P487o864k7437j4278P148k2741k5784J5199k0629J0294N1800
15977A1397Q19P296m308M234k742j2614m2723m591O0485N477M5630k4937l7754
15964E669Q579K41j1497j4917j5120L9377j1565K9527l8301k7408J8739Q7k1558
15951c8147L85J1090l352J9688L3803J0896k2818j6505j3205J8510M5308K8184
15939G3837j7353k1347j1510l488k1943j1076r405K2904J8327J3776J5278j134
15927D6866o3461j5968n365j9710J2475K6367J6523L5445l590q0161r63J0367
15915d1175l3762K2961K9023L3279N3757L5405k0600j9603k6947q105r864j7789
15903c420m556K8514J5419k0868J0139K8410j4478r460j8969j3160p936J1437
$$ y = [27271, 29211, 37202, 44689, 37825, 10388, -3890, 3258, -19483, -45267, -30068, -50697, -40403, 11397, 12216, 19512, 15204, 19438, 16696, 4082, -38641, -43232, 17253, 22730, 68360, 43423, 5669, 14248, 14489, 2992, -11925, -27045, 12332, 767, 30294, -8007, -35415, -16676, -16589, -38147, -37762, -26672, -30024, -10336, 23467, 34363, 11545, -4960, -18165, 345, 45653, 73837, 56484, 35137, 23627, 20139, -1804, -12880, -22285, 619, 18946, 32722, 48000, 46866, -16595, -32563, -37928, -57638, -45163, -18796, -2273, 33172, 29582, -50579, -51542, -41175, -74937, -51976, -22953, 10326, 64083, 99488, 78888, 59285, 32338, 24233, 14369, -3420, -7976, 20538, 35957, 15089, 25228, 53638, 39160, 29700, 10731, -2429, -10365, 1072]
15891A072j0264p413L2781K7138L366r397j1111J6913n945j7241j7752l0733k2709
15878e1295K122R423j9534n1653J4995J1078K4283M9654l487j2069j3454L605
15866c6332L4359N774L6348l566j447k683k0070k1243J4046Q399m999m2483M0577
15853F680N4127j0907r307j964r503p633k1302j7021J0199j1845l489L1368Q238
15840A7641K3765l0350K349J706j1837j5777J6948K3131J6227k8885l5946M448
15828a6580l0877r48l7108J3331M7930K7464J7589J486k1866j2924O578n443j6363
15815b7731R535j6008J1946J5243j7181j9784p078L224p868M610M4144L7901J2876
15802D3829l0949L59l2491j4252j1989K3619n474k605j4513j7059J8198J8973
$$ y = [1072, -9192, -16605, 16176, 43314, 46680, 37283, 26172, 43085, 37140, 19899, 2147, -28586, -51295, -49173, -39750, -59284, -110937, -95942, -84864, -60581, -10927, -14414, -26483, -39937, -36332, -1973, 3801, 40149, 36583, 35136, 32453, 12383, -8860, 5186, 13585, 8586, -33897, 6680, 60807, 49900, 40593, 38629, 29126, 21493, 191, -16830, -6631, -18476, -21965, 9403, 17641, 41406, 11056, 13405, 15111, 3274, -12503, 4445, 27576, 43803, 14918, -21028, -16580, -47457, -48405, -85513, -72182, -24252, 3212, 20801, 22287, 421, -12503, -5925, -11368, -27731, -18196, -34204, -22258, -7015, -24196, -43980, -51058, -47834, -55702, -51092, -6948, 30953, 43829, 12880, 13239, -19252, -33504, -45493, -21874, -27348, -29953, -44466, -61525, -43327, -24354]
15790b4354M265J3555k5843j4496J7273L0046J7789j4490j4220j2970j0874P477
15778b6842j2430r96Q280l4803J9989K9471q943j0508R374m187k5234K812J932
15765e2085K7193o691k2714L4186L9973J7668l5388k1214j1609j9075P815k5303
15753f7244l1355j65L8668j7763q955k194J4942L7639O1240J5546m7316n6963
15741f3920M597Q497k5536P778Q536J6513J3508k8207q529J2150M1394L3485K160
15728B2426k994Q771K9240M2572k8055m3286q972J3720K6349p770J0729Q326k1684
15715D9372l2187j0845m7k4409j2062L8478L618o526Q254L1559l257l1748p385
15702B815j3804K0986J7362k6540N084M2164L6384j557k1163j8595J6218J0026
$$ y = [-24354, -20089, -6534, -32377, -46873, -29600, 446, 18235, 3745, -10475, -23445, -34319, -26842, -39272, -40268, -31988, -66791, -46802, -17331, -26274, -36782, -27408, -31595, -56829, -54017, -52085, -24892, -31583, -54297, -20111, 19862, 37530, 2142, -19072, -30681, -49756, -41941, -67244, -98599, -98764, -60096, -77859, -86814, -89008, -74066, -36427, 24813, 40359, -6957, -63920, -59323, -50826, -76362, -68584, -60048, -43535, -30027, -58234, -66763, -54613, -13219, 20266, 22426, 19432, 28203, 57443, 100015, 71960, 28674, 19702, 33422, 59771, 52001, 62730, 71056, 49372, 17185, 6340, 6293, -18116, -30178, 8300, 11918, 5392, 13646, 45205, 41948, 10200, 2815, -10989, 9997, 27359, 819, 5903, 48067, 84451, 82894, 61731, 43136, 59354, 69380]
15690F9380n3990n2374l3369l621K8417J5611J5186j1269l2970J4695J3148l9077
15678g0233k8320L3875M0181K0398o343J8457j4214j4518r883k7076K040q943
15666f4579K2353N6516j4334k6172q363k0416K9690j2925k8595j9983K803j1819
15654i5824J1627J6216J0613J5901K1645L0538K790j6130j6217K4508J3050J1052
15642B9769j8429j6962j21J8974K1348q110k0319j2357j3580l8233o377R23K5927
15629c7547O4038N1366q204J5139l0640j7718j1043m5146J1110k851J3686J1519
15617A3709r676j6656k7869j1929Q871k6374o097m539j152K0796O0994L2583R389
15604D2050k1154k8684n0300j3947j1176j3878n14L0782L1776m400j2978j1919
$$ y = [69380, 15390, -36984, -70353, -73974, -45557, -29946, -14760, -26029, -58999, -44304, -31156, -70233, -98553, -64678, -24497, -4099, -10442, 8015, -6199, -20717, -30600, -57676, -55636, -64579, -42226, 14290, -44, -26216, -34579, -54995, -25305, -38230, -66825, -86808, -84005, -95824, -84197, -67981, -57368, -41467, -19822, 10716, 13506, -2624, -18841, 5667, 18717, 29769, 11340, -5622, -5743, 13231, 34579, 26469, 6150, -6207, -19787, -58020, -64397, -63474, -37547, 26491, 77857, 69653, 84792, 54152, 36434, 25391, -19755, -8645, -11496, 2190, 13709, 4033, -12623, -40492, -52421, -43550, -69924, -76021, -80560, -81712, -60916, 78, 32661, 42050, 20896, -7788, -58088, -72035, -83211, -97089, -97603, -66821, -35045, -39445, -52423, -64342]
15592f4342J9972j0838j2767q936M8962k080K3592L5341l2512j2782J798K123
15580a2469J4289K0391L647j3476l575j3064k4246L76L3668K3652j4506l8326
15568b3639r309n719j0722J167J0318J8424k824l5911l7141L1004M1262k4018
15556d7108J0137k203J6597j2612j1777k6120Q125K0195M1386m249n6443j6299
15544h0371O8351J0788k0857K6693j0909k76l873R143L7270L0688j6719k0291
15532B9637L6567l3251o6070r435K6497J073J6869K0419m8508m4672K5748N3503
15520H377J5428j548j9637k2382L6633L0633r260k6467M564k5465m9885M5580
15508a3429q345l3973n341K7287K5428Q574j6780q181k9408J8183L2919m9374
$$ y = [-64342, -44370, -55208, -67975, -76911, -27949, -30029, -6437, 28904, -3608, -16390, -14592, -12469, 1820, 22211, 25858, 12382, 8807, -4257, -28503, -28127, 5541, 29193, 14687, -23639, -32948, -38667, -49389, -48222, -37904, -19480, -22304, -58215, -95356, -64352, -23090, -47108, -36971, -39174, -22577, -35189, -46966, -73086, -64961, -44766, -3380, -7629, -64072, -80371, -12020, -1232, -22089, 4604, -6305, -6581, -10454, -1311, 35959, 66647, 49928, 29637, 66204, 32953, -33117, -42552, -16055, -14982, 1887, 22306, -26202, -70874, -45126, 8377, 23805, 22257, 2620, -19762, 16871, 47504, 38244, 11777, 16341, -9124, -59009, -13429, -21774, -55747, -61088, -33801, -8373, 201, -16579, -24760, -54168, -35985, -3066, -52440]
15496e2440K2102M1254K229m1526k549J2494K0460K0588m1483N131J6175K9178
15484C1613K860J1156l065j1057k0366o465J0717J633J925j5015j6527M5304J5101
15471D7814j8752r953l4056Q799m291M066j0291M387p465m7518J8305N5536J3017
15458A9598j1790k3515q044N591j0714l9759K1343N2405j9518l5348k2166L1894
15446d0023j5387l2173J2648J9012N9978J953l2124j8770K0482O8755J2984l0555
15434B6780j468K646k3243J1042l1309j3523l437M514J1488K7282k4185q616r850
15421c1879j532P837n437Q932J4648q976Q218J1657l3196k438J1039M962L310
15408a2855J2351q865L845K9756N222J6665k142k1808P496j0578k1288K0083j5755
$$ y = [-52440, -30338, 10916, 13145, -28381, -30930, -18436, 2024, 22612, -18871, -13740, 2435, 31613, 34473, 45629, 42564, 31507, 11141, 4676, 15393, 17026, 18951, 3936, -12591, 32713, 47814, 29062, 19109, -14947, -6148, -10439, -6373, -16664, -12277, -19742, -67260, -48955, 6581, 19598, 7808, -15707, -23751, -18160, -28874, -68633, -47290, 5115, -14403, -49751, -71917, -40023, -55410, -87583, -74935, -55923, 4055, 6008, -26116, -44886, -24404, 44351, 57335, 26780, 25312, 27958, 4715, 15757, -15552, -29075, -32512, -27998, -16510, 10772, -13413, -22029, -31879, -33411, -25574, -31011, -22079, -7431, -16407, -8189, 3468, -29728, -32166, -21127, -16165, -12855, -504, -9369, -5524, 24232, 29454, 46119, 43977, 22169, 29665, 19087, -2201, 17882, 2127]
15395B127l5697j8066k3042L885K0722L419L6079R089J514Q592K7221l6908l7522
15382c8587n157Q501j518K6741l6168K3916j2359k6024J4062L9121j3607k6799
15370d7878P854J3569j1624J0259L8327M552j6832l3546J5225L6548P665j8690
15358E429j1997j9947k3685K0564K2402J8858J7423r698o8087n735M8056K2331
15346A5914J8331J5610J3084j6286o881j6803j8266j9687j137L9903j1893j6961
15334e072J5009L1999j0699q741k226L7752L763j1361k4982k5155m1700J6764
15322b4649j136l2841n2900P955J8021j948K9159J5144J007J4518K1900K9205
15310B3435J2830k4861k1902K798o165J5512J2547O423l1792m5554J2715M0835
$$ y = [2127, -33570, -51636, -74678, -70793, -50071, -46652, -10573, -1484, 30, 8622, 35843, -1065, -38587, -43744, -35243, -36761, -10020, -46188, -22272, -34631, -60655, -46593, -7472, -21079, -47878, -40024, -26455, -38079, -27820, 10507, 15059, -1773, -35319, -20094, 16454, 24119, 5429, -6568, -26515, -50200, -29636, -7234, 11624, 29047, 19349, -48738, -54473, -6417, 15914, 34245, 49855, 62939, 46653, 39772, 22969, 4703, -14984, -16121, 23782, 11889, -5072, 9937, 41936, 31237, 22496, 20270, 58022, 61785, 50424, 25442, 287, -41413, -24649, -25785, -58626, -111526, -103571, -85550, -87498, -58339, -43195, -42188, -27670, -5770, 23435, 36265, 11404, -10498, -7700, -13865, 1647, 14194, 20617, -11175, -56729, -44014, -3179]
15298c179k7681n107O444j7487K1153O0604J3609o012m6328l9401k8691J2666
15286e9410K6025J1069J9422l586n4662o317M7677o605k7841j3731O2999L5703
15274C0743k5694m4345M1090J0800l1098n2253r072J4264K3592M996M0464K1075
15262B4562p957J9487O686l621l0452O484J0673j4803j6611M337k1230K7939R237
15249A4731j7149k7285p780O487M1805j337J1707l3603q011M86n6220j8848j4688
15236a09705j3285M9294O8072J4570l1291L458N996P047j5494K8834K1555r869
15224A9182k5529k839P847J5310R479k8613k5610O669P3J3326k8931K6464j4859
15211b8031M3823L4476k9857j5108j9238J968M66p93j0831j3134M8324M3436j2026
$$ y = [-3179, -30860, -35967, -29523, -47010, -25857, 34747, 48356, 42344, -3984, -43385, -72076, -59410, -33385, -22316, -2894, -6480, -61142, -67459, -19782, -26387, -54228, -67959, -4960, 30743, 5049, -39296, 1794, 12594, -18504, -70757, -79829, -65565, -41973, -36977, 3487, 24562, 16605, 36092, 42778, 39157, 8705, 15189, 25862, 11059, -5552, -1215, -22445, 5494, 14731, -2418, -29703, -37483, -30996, 10809, 9472, 21179, -12424, -20435, -19949, -76169, -95017, -109705, -122990, -73696, -5624, 8946, -22345, -18887, -12891, -5844, -21338, 7496, 29051, 19182, -6347, -9186, -1339, 13971, 23450, -5163, -30773, -24104, -24031, -10705, -39636, -13172, -28031, 15792, 50268, 20411, 5303, -13935, -11967, -11501, -12294, -23125, -36259, 12065, 55501, 43475]
15198D3475O549M514l7905l5872j0571K6274J8872P489k7422L541J7329O5941
15186H2214p454k2023p305n679L990k7380j05619k6242R66K5845O1725J7136M0707
15173C0881L3728k7075q388J4156k6788m7351O992J8213p3277k4392N4252N0376
15161A327K0511K237j9800l0448p439M211p037j2305J6727J017M2845n153j0040
15148c347L535o726K2214m280n5254l4313K6462K4248K5663L654L0084M1573o0720
15135A2793K873J3777J12M0413m4888p751K9177L4667q70m2087m138K513j3774
15122B2817Q436K0742k5186N741J3233o2394l7773j6298M4993J7132j6547o323
15110c1427N056K9379K2744J9779J0521l5106l7897n692r391q27N637J9332l4455
$$ y = [43475, 50024, 54538, 16633, -19239, -29810, -3536, 15336, 22825, -4597, -1056, 16273, 82214, 74760, 52737, 45432, 39753, 43743, 16363, -89256, -115498, -114532, -88687, -26962, -9826, 30881, 64609, 37534, 29146, 43302, 16514, -30837, -23845, -5632, -78909, -103301, -49049, 1327, 21838, 24075, 4275, -26173, -33612, -29401, -36438, -48743, -32016, -30999, 11846, 6693, -3347, 188, -6538, 15676, 11396, -43858, -78171, -51709, -27461, -1798, 1856, 31940, 73513, 12793, 15666, 29443, 29555, 69968, 25080, 17329, 46506, 81173, 80303, 38216, 34078, 36591, 22817, 31253, 51995, 26809, 32550, 45783, -16611, -54384, -70682, -25689, -8557, -25104, -31427, -26371, 3008, 25752, 45531, 56052, 20946, -16951, -22643, -32034, -32861, -27224, -7892, -42347]
15097d2347l028L4395J1037J3101k4652K3025K0990J3914L18k6267q737j8348
15085f599J029Q141l235Q786K3161k2370m528L3900L9916l544n4566m1404n405
15072b6718L0776k3542n1716n73J6823L1978j9196j536J0950q221l39J3532j7245
15059d5027r287J8093M7363L6531k3535l3983J602M1349n433j8097O675K3147
15047C9398M45l1112R27j8625K5517k5278M515K0518L0348Q868r875j7361n788
15034B2497L1819k8392n1155j3109L2373q670K405K2433M5942l5222Q265j5959
15022A3227n5403p582K3556M91L3551K5042L8718j825J419P619k6632l6613k9919
15009a4351k0891L9454K8914P449N956j0667k5320l7397n436L5078K313Q59K7241
$$ y = [-42347, -45375, -10980, 57, 13158, -11494, 11531, 32521, 46435, 46753, 20486, 11749, -6599, -5570, 2571, -664, 8122, 31283, 8913, 4385, 38285, 78201, 74657, 20091, -21313, -26718, 4058, -19484, -71200, -71773, -54950, -22972, -42168, -43704, -32754, -40975, -41314, -27782, -45027, -54314, -36221, 11142, 47673, 24138, -9845, -8243, 33106, 27673, 9576, 16251, 39398, 39843, 8731, 9658, -8967, 16550, -8728, -4213, 16305, 46653, 55521, 45646, 28285, 22497, 54316, 25924, -25231, -38340, -5967, -14637, -12232, 10201, 56143, 20921, 29186, 13227, -42176, -49758, -26202, -25711, 7840, 32882, 71600, 69775, 71194, 78813, 52181, 15568, -14351, -35242, 4212, 33126, 40575, 46531, 35864, 10544, -26853, -32289, 2789, 5102, 5961, 33202]
14996C3202l8181k9151m3518K1990O0531R513m5737L133N0305J4672j2897k8622
14984d760k2356j5842J5733J0737K083J6338L1374L2816k6168k2208l4457N209
14972a1501K6363K2559k301P235l34k777n0143n3826J0777M9761K1881J3288P649
14959C8631k9050k6758K153k4249K81Q0114J3319l8060J4385J6808k1570k8416
14947b412k5823k2541o985M3296K4833J846j5060o312l8150k061J5560l370k5064
14934f2243o334O0363l961l0943N2948J9040K732j5647k1068K4730j7909K0034
14922B1742M516j0344P215j1675l3411k1468J6395K3627p949k3377Q677L4872
14910H820J9421m1721l2722P818J3630J1638J8346P087j6924l3609R436K9384
$$ y = [33202, -4979, -34130, -77648, -55658, 4873, 14386, -31351, -28218, 22087, 36759, 23862, -4760, -27116, -42958, -27225, -16488, -14405, 1933, 33307, 66123, 39955, 17747, -16710, -11501, 14862, 37421, 35120, 42355, 42021, 39244, -10899, -64725, -53948, -4187, 17694, 30982, 38631, 9581, -17177, -15024, -39273, -38992, 41122, 54441, 16381, 30766, 47574, 26004, -2412, -28235, -50776, -57761, -14465, 10368, 12214, -2846, -9158, -47308, -49369, -33809, -37179, -62243, -68577, -8214, -12175, -43118, 9830, 28870, 31602, 15955, -5113, 19617, 1708, 21742, 26258, 15914, 23129, 11454, -21957, -43425, -27030, -3403, -11352, -34729, -26052, 8820, 28241, -13480, -46202, -38384, -24754, -13116, 5230, 12317, -4607, -38216, -28780, 604]
14898F04K5332m7843l9434j3557J0271K9156k857j005j2621l1811J1417M5789
14886b6559L0154N397M4360k4504j5613p535o697j4010j3259K5350K8377K4263
14874D9724k1440m1115k1927j0124j7066R369K8260O390q087K459k0774j8518
14862f2849l0517K7620L3795L0758j5153o712j3953J587O37r737q012j0361j6092
14849g8989R475J9794J349K4205O0602M5561J1609o114L911k0988n1403m3215
14837b4203j2629M1955P462m038k0080j9222M609j3198K9276K4796J1689k8236
14825a819k4177r473j9346k4246K9480J1860J1126J9515k1731J5203J8415K3153
14813B7960k922j8387K6648Q511k6108j9590l028p749n201J0032K4951O648n4187
$$ y = [604, 25936, -21907, -61341, -74898, -64627, -35471, -38328, -39333, -51954, -83765, -72348, -26559, 3595, 8992, 53352, 28848, 13235, 5700, -997, -15007, -28266, -2916, 25461, 49724, 28284, -12831, -34758, -44882, -61948, -52579, -24319, -17929, -26016, -23557, -44331, -62849, -93366, -65746, -31951, -1193, -16346, -23058, -37011, -35424, -34787, -44524, -52536, -62897, -78989, -69514, -49720, -48371, -24166, 36436, 81997, 93606, 87492, 91403, 70415, 19012, -24203, -36832, 5123, 12585, 8547, -11533, -30755, -26146, -39344, -10068, 14728, 26417, -1819, -25996, -35469, -54815, -79061, -49581, -37721, -26595, -7080, -28811, -13608, 4807, 27960, 25038, 6651, 33299, 41810, 15702, -3888, -6916, -14665, -19866, -9834, 15117, 21765, -32422]
14800c2422N910N7310m5170k3096J9313n913k5276p756l287O759k4106o99N4133
14787b4300m0867l5453j187n533k5971K9299O4209J3285J3313m030P41k7312o573
14774e0379K2577p570J1975N393J5619j748L6034r25l8245k6487J0105j7205m7081
14761h7937K5318L4773J881J6383N6302M2803K0928k8121n3507l1837l4650k6651
14749f4315J7292J5886L1170M5272k0065m2623j7085J1151O9094Q003n1051j181
14737A548j2071L8708O0195j8872k4467k6084l0228Q782k7279Q060L0754R659
14725A8705l4177L8691M168J5812j2060n25j1580j8493j6106m139N417p25k7525
14712d2537K563O4923M7051j0341l3102k6801l9096L0519K9997k272j1027l4671
$$ y = [-32422, -26512, 30798, -14372, -37468, -18155, -24068, -49344, -57100, -60387, -53628, -77734, -78433, -24300, -65167, -100620, -101807, -107340, -133311, -104012, -39803, -26518, -13205, -17235, -16494, -43806, -50379, -27802, -35372, -23397, -18004, -2385, -4133, 31901, 30976, -7269, -33756, -23651, -40856, -87937, -62619, -27846, -25965, -9582, 46720, 89523, 110451, 82330, 28823, -3014, -37664, -64315, -47023, -31137, 33, 45305, 25240, -17383, -34468, -23317, 45777, 53780, 2729, 1548, -10523, 28185, 88380, 69508, 45041, 18957, -11271, -2489, -29768, -21708, 9046, 18705, -15472, 23219, 27387, 43199, 31139, 30614, 19034, 541, -15565, -19704, -14287, -15012, -42537, -39974, 24949, 72000, 61659, 28557, 1756, -37340, -6821, 23176, 20904, 9877, -24794]
14700b4794m3102J7016L535J6324M888O75k3023j1946K4917L4781J5706J4355
14688B9332J1201m5390k0979K4452J5358K136L0295J9179P78m9264Q169K8453
14676E3720l4624l2353j809J9951j9622k3167J7441R931K8935K2345m4785m009
14664h046l4140L5422L0098j3640o966R757o0j9956o906O54M6031L9403p657m04
14650F3590j8538o781q095k0614l3929K6964K1317l0691K0801k6619K6K3891m976
14637F346k3206J8939k572j9937k8525N049l189J3579P660J453L1913R832M028
14624B1370k7012o765J2986Q31j4391p254N598L6706m030k6534m5216L1355N2767
14611C0411k8702l9951o204O51O414o223m1820M514K8322L5832L2067L8644J0859
$$ y = [-24794, -67896, -50880, -47345, -31021, -26133, -25458, -48481, -60427, -35510, -729, 14977, 29332, 40533, -4857, -25836, -1384, 13974, 16110, 46405, 65584, 66362, 17098, 25267, 53720, 19096, -13257, -15066, 4885, -14737, -37904, -20463, -10532, 18403, 40748, -4037, -8046, -42186, -6764, 23334, 9694, 2728, 12485, 12425, -7531, -14437, -13783, 32248, 71651, 63994, 63590, 45052, 38271, 30176, 9562, -24367, 2597, 23914, -6777, 14024, -12595, -12569, 11322, 6346, -16860, 2079, -493, -20430, -48955, -43906, -47095, -33516, -25856, -24403, 7510, 17342, 21370, -5642, -12407, 579, 1410, -12981, -20235, -14637, 22069, 18039, -8495, -53711, -22356, 30411, 1709, -38242, -44446, -43795, -37381, -43604, -85424, -80910, -52588, -16756, 15311, 53955, 64814]
14598F4814k4036m4516J1193L4209p890j3831l052K825K282k6275k3208K9419
14586A934M5368j4488j2404K8568j5179K4048j7425j7992j5895j967k454j4843
14574a2729k4161K8368N1138r607P096j078K1611k7159k0292J5690j0609l0572
14562a2304Q79j4671L1977M7027k9615n944M0893J7326k2692J8397J3548J1449
14550I6270J3510l1913k2710j9349k1432K2520M9682L5185q14p3171l5607k3469
14538a1298j4817J3266J8525J4855l6902k4681J8964J9631l0128R892J3208J4616
14526E131j8950K3017K4695k0873o1337l2190n140J604L6799j2083K6699j3632
14514d6260K5001L3309l717o882J8989o476q482L1996L8341k0009k6592J9983
$$ y = [64814, 40778, -3738, 7455, 41664, 33774, 19943, 16891, 19716, 21998, -4277, -27485, 1934, 47302, 32814, 20410, 48978, 33799, 57847, 40422, 22430, 6535, 4568, 2114, -12729, -36890, -8522, 42616, 33009, 40105, 39027, 60638, 33479, 13187, 28877, 18268, -12304, -11425, -26096, 5881, 52908, 23293, 17349, 58242, 75568, 52876, 71273, 84821, 96270, 109780, 77867, 55157, 35808, 14376, 36896, 86578, 121763, 120949, 47778, 12171, -11298, -26115, -12849, 5676, 20531, -16371, -41052, -22088, -2457, -32585, -22693, -9485, 5131, -13819, 9198, 33893, 13020, -48317, -80507, -85647, -84043, -47244, -59327, -32628, -46260, -21259, 12050, 8333, 1451, 20440, 13964, 5482, 37478, 75819, 55810, 29218, 49201]
14502D9201k4726j7925N964j0777j9748j59k673K4559J8043k6896K8562K3694
14490D7119r004j6523m3605k2200r214J4067J0772L6085j4915k8953K2271j9027
14478c3127r074j2787l0960M8471M0177n111J0954p291J6654M711J3016j4060
14466B1573o5320l9569J3174J3100J5549N4992L4890O431R784l8447k7880j4612
14454a6335k9630j9369J6537J6444n750M7159m2687R518M6616M2462k9311l6469
14442h15r120J8366l2737j3826N412L1985J7877j6071k3734K929P646R177L158
14429B47J0763j2821k2186j89k1854l4949J9854J2563j4623N563O8756N4609l1413
14416C4320k7939K234j7103k1351N938J5662K4829K2842J5267k2491k1468l2475
$$ y = [49201, 24475, 6550, 12514, 1737, -18011, -18170, -20843, 3716, 21759, -5137, 23425, 47119, 38115, 21592, -22013, -44213, -53427, -39360, -28588, 7497, -7418, -36371, -14100, -33127, -42201, -54988, -85948, -37477, 2700, -2411, 8543, 1252, 17906, 22617, 35633, 21573, -43747, -83316, -70142, -57042, -41493, 13499, 48389, 54820, 64604, 26157, -1723, -16335, -45965, -65334, -48797, -32353, -38103, 9056, -33631, -24113, 22503, 64965, 35654, -815, -9935, 8431, -24306, -38132, -32720, -735, 17142, 1071, -22663, -19734, -12088, -2911, 247, 11010, -1811, -23997, -24186, -46040, -80989, -61135, -48572, -63195, -57632, 11124, 65733, 34320, 6381, 8615, -8488, -29839, -23901, -8239, 16590, 39432, 54699, 32208, 10740, -21735]
14404b1735J4376M075J8867Q985q685m7027K8838M978k9806J8652N0419k4602
14392A7335J0747l1971k8792k3033L9278J6816N5948P849l5276j9470K649M086
14380A6166k138K957k3580L2391J0246k7823j2703M093j7048n60j3509k6506R641
14367d8373L174J7453L2346K8428o364l7684r110J4159K5872K4286N638o7214
14355a7389k3551n306J4334k5822n514K5738q551o786l945K7533K0724J5150k8184
14342b1569l4603o898j7482K0157R2167m940k7899j4911L46K8873J3631P20M502
14329C2094j3082J3387p67L0956K690m1885l8608l080J43J9324j078L5418o061
14316B9451n3178O481K3937k6146o1415q72l595K7717N0965q876n8491j3286N1378
$$ y = [-21735, -7359, -3284, 15583, 24568, 15883, -31144, -2306, 2672, -27134, -8482, 41937, 17335, 28082, -3889, -32681, -55714, -16436, 380, 56328, 64177, 28901, 9431, 12080, 16166, 14028, 16985, -6595, 25796, 36042, 8219, -4484, -391, -17439, -17999, -31508, -58014, -48373, -45199, -27746, 4600, 33028, 26664, -11020, -20130, -5971, 19901, 44187, 49825, -17389, -40940, -46246, -31912, -57734, -63248, -37510, -46061, -52847, -56792, -29259, -8535, 6615, -21569, -56172, -63070, -80552, -60395, 31772, 26832, -1067, -15978, -15632, 13241, 26872, 27592, 32094, 19012, 32399, 31632, 62588, 65278, 23393, -15215, -18295, -18152, 1172, 94, 35512, 29451, -23727, -17246, 6691, -19455, -80870, -81742, -85337, -57620, -6655, -15531, -74022, -87308, -35930]
14303c5930K1138L5388K6614m76k1405M5902L9049r953l6416l8046P354J109l2941
14290A387r526L4259j5824k0286l8372r256N598O2155k368M7241Q022l6148k0894
14277E988q999k7171o202K913K6163j4824j6342J4925J4138J3474r354k0466k27
14264b5984P328K4333P86r632J642Q160R99j2011r146J2718J3148K6571J9020
14251E7932J2276k1680o085j0035l6594P806j3056k4841K807L398r408Q84K0022
14238a6574K451K9924K4957l2247k3943r268R318N786O859l4592k1670M4984J3496
14225e19n4310j0447K0468N4482K4309L789l0546k2088r027R896K9355j1488R61
14212D835j869p483k850m20o832k7165k1113n547n462j281J8816M9872K0269k3529
$$ y = [-35930, -14792, 20596, 47210, 46734, 25329, 71231, 110280, 100327, 63911, 25865, 33219, 34328, 1387, -8139, 26120, 10296, -9990, -48362, -57618, -52020, 10135, 7767, 55008, 63030, 26882, 5988, -3011, -30182, -36384, -33471, -7308, -22132, -38474, -23549, -9411, 4063, -5291, -25757, -25984, -18656, 5677, 6463, -3169, -1527, 6633, 7632, -4379, -13525, -807, 12341, 38912, 57932, 70208, 48528, 42443, 32408, -4186, 3620, -9436, -34277, -31470, -28072, -37480, -36596, -16574, -14123, 15801, 40758, 8511, -15432, -24700, -15382, -9596, -2737, -37329, -58999, -14015, -519, -54829, -65276, -44808, 9674, 33983, 37772, 7226, -14862, -23889, -13993, 15362, 3874, 4835, 2966, -4517, -7367, -7787, -14619, -41784, -62897, -68444, -73906, -75187, -56371, -6499, 13770, -9759]
14198i759k7285l1297k5891m360m012N5270J5412k1387R719N6456L5725l2501
14186A6090n6517M3623L331J22j5194k9330m149N8262j3395j8608j9505r074l5882
14173h0226j8825J300O680L5226K4650M1371J6195j2438m3019k5838P072J4753
14161c3099L0089j895K3438N0393R336l7222m4620k3223K399J0286J2790K7166
14149B5838J1502J4194k0846o1452k8735K622J7297K3020K9435K2548k5070j1277
14137i24J2101L4521k3576L790K6506m0588r459j3273J423m262L3706P5648L169
14124I8782l3466k0138o05K4886l8356k4287P685j294P673J0136Q4J1708n227
14111C7581j3792N69P79L2642k8312o0299r000J1952K934k4280N628J9362J0523
$$ y = [-9759, -37044, -68341, -94232, -98592, -102604, -47334, -31922, -53309, -43590, 12866, 48591, 16090, -40427, 3196, 6527, 6649, -8545, -37875, -42024, 16238, 2843, -15765, -35270, -44344, -80226, -99051, -97751, -91071, -55845, -31195, 10176, 26371, 13933, -29086, -54924, -47852, -33099, -3010, -4905, 18533, 68926, 78262, 41040, -3580, -26803, -24404, -14118, -1328, 25838, 37340, 51534, 30688, -30764, -59499, -56877, -39580, -16560, 12875, 35423, 10353, -924, 11177, 45698, 22122, 25912, 52418, 11830, 2371, -10902, -9479, -13741, 19965, 95613, 98782, 65316, 45178, 44573, 69459, 31103, 6816, 14501, 13207, 20880, 31016, 31100, 42808, 37581, 23789, 24358, 25137, 57779, 29467, -30832, -39832, -27880, -24946, -49226, -43598, -24236, -13713]
14098a3713j9223j2384j3315r264L6961N5232j5428m4962k8064J3967J0181L1667
14086h345J0470J9073j3756k9311N722o438j6620k5404r838k0485L0388P3217
14074H673O3101J6430n5778J5441j3843k246q890k1933l6010j44k5537r438J490
14061f8684N9047o088k3642j5101M5147J4395R32j6477R160M3657O450j5103l5822
14048b129j6230L1484L6290M818N493r864n7575k4347O929N0892l686L5143K9999
14035H7217l513N447M755k7231k4391n431m5359m6531M7291K7723n498j3143J0645
14022A1981j3064r853L3916k0863P191J2389j97K1981K3318j3967j3835j3550
14010B5447p081m1044k5801L7176L1577j2033m2241M50J4365J1977J4444J324
$$ y = [-13713, -32936, -45320, -58635, -67899, -30938, 24294, 8866, -36096, -64160, -50193, -40012, -8345, 2125, 21198, 7442, -21869, -16147, -22585, -39205, -64609, -74447, -94932, -64544, 8673, 71774, 88204, 32426, 47867, 34024, 31778, 22888, 955, -35055, -35199, -60736, -70174, -68684, -9637, -15725, -39367, -54468, -9321, 5074, 6006, -10471, -1311, 42346, 48796, 33693, -2129, -18359, 13125, 49415, 54233, 59726, 49862, -7713, -32060, -25131, 25761, 22075, 57218, 87217, 83704, 89151, 93906, 66675, 42284, 36853, -8506, -55037, -7746, 19977, 14479, 1336, 11981, -1083, -10936, 22980, 2117, 9308, 21697, 21500, 43481, 66799, 52832, 38997, 25447, 18366, -22678, -48479, -11303, 20274, 8241, -34000, -33550, -19185, -7208, 7236, 8560]
13998H560k8220l4513q340J746M7964M9221r695l28j5485r806j5318J5529M1230
13985D2545R558J4405J911K155j3957J1231K0937m9061l4870k4515Q801n668N714
13972a0814Q518K2532L3891j8540l5105Q302K9619r61k1303k375k3970j3109M6562
13959B3247L5207N38l7180k8605J3764J8374K2489k1271m7869R453j1432J4464
13947h821J53k9847M792K655L7084K7455j1036k3447k8314J1631j4185l0269q609
13934g0758O411L0288L5514k7013k0827K3916J9416j5744J3145L0670r835p330
13922G853r798n7826O128M6365m889k7235J2289L3521L2534k5432j7988m2203
13910d6681l8895O093L5338J7465j8214M010M2972N057J0756j4519l5937n475
$$ y = [8560, -19660, -54173, -62513, -60767, -12803, 36418, 26723, 26395, 10910, 1104, -14214, 1315, 42545, 52103, 66508, 68419, 70574, 56617, 67848, 88785, 39724, 4854, -19661, -10860, -16528, -10814, -2296, 20236, 54127, 35587, 482, 8784, 38403, 37442, 16139, 13764, -10206, -23315, 23247, 58454, 58992, 21812, -6793, 6971, 25345, 47834, 26563, -21306, -11853, -23285, -8821, -8668, -38515, -33723, -31068, 6016, 33471, 22435, -1012, -29326, -17695, -31880, -62149, -70758, -64347, -34059, 1455, -25558, -46385, -22469, -3053, -18797, -5652, 25018, 15183, 7853, -1945, -59771, -53643, -7278, -12167, -39402, -27113, 6408, 38942, 13510, -4478, -46681, -85576, -79483, -44145, -26680, -44894, -40884, 2088, 7145, 17901, 3382, -32555, -38030]
13898c8030j2061q836N550J9487M2408n373j0012J044K0644J404m3389j0156M1698
13885D378k493m490R176O709k808l0573j1228M7012M0340k9294n4150m0097l119
13872g0637N6527L7007J4612j4257j1832q15k2263l101Q034m559N502K1728J6391
13859C2337N5023M7509m3853n1624K9944O2471K8600L710J5887M9113P1688K4893
13847C25698l8654n1282m3865l3346l3369r59n791M912o46q904O644n475j020
13834A13943J5675L4685J3333l9350l4225K7102M6517K2978K5964K7060J5965
13823B69647L0960K8884k4172j1039l3211k5011j2124J8878j5473p958m3843k0608
13811A54930Q580J9910k6029j1094j567o43K4270M1177k1671n7043k7199m3814
$$ y = [-38030, -50091, -58927, -53377, -33890, 8518, 3145, -6867, -5823, 14821, 16225, -27164, -37320, 4378, 1885, -2605, 6571, 13280, 10472, -20101, -31329, 15683, 56023, 26729, -27421, -67518, -70637, -14110, 22897, 37509, 23252, 11420, 10605, -11658, -14759, -6725, -11284, -5782, 15946, 32337, 87360, 134869, 91016, 39392, 69336, 131807, 160407, 164117, 180004, 229117, 300805, 325698, 287044, 235762, 191897, 158551, 125182, 124223, 118432, 123344, 122698, 113794, 120438, 114963, 113943, 129618, 164303, 177636, 138286, 104061, 131163, 177680, 200658, 226622, 253682, 269647, 300607, 329491, 305319, 294280, 261069, 236058, 223934, 242812, 227339, 219381, 175538, 154930, 163510, 183420, 157391, 146297, 144730, 144087, 168357, 209534, 187863, 130820, 103621, 59807]
13799E9807R03K4888Q462Q2565L6909M9866O2805J1357j7292m4781m7416p8330
13787A49743k0307J155k691m4398k5144q206k9405l2112N331K889o444J9086J5204
13774B4701J0224j4264J7098L4190J7121K2819J6397j0350l4513o3558n0503k2838
13762e3476K6659M3131K9734L725N333k5044k9343K9409J7408r483l9384j9293
13750b0624M8172o029p2407o2940Q51L2792M5482K3197k7018L2016M1563P292
13738D2347l7362j9882J5583M5147O107j1617R658j1452j1770k975k1800L9344
13726D1328M4744j6261j607J8911j3587q031j9251j0702J4151K7542J9023J5825
13714A12085K2510k5667k2246r289k7566k3229m967K4054J267r035m2220l8818
$$ y = [59807, 60710, 85598, 94060, 176625, 213534, 263400, 326205, 337562, 320270, 275489, 228073, 149743, 129436, 130591, 127900, 83502, 58358, 50152, 20747, -11365, -6034, -3145, -9589, 9497, 24701, 34925, 20661, 37759, 71949, 89070, 111889, 128286, 117936, 83423, 19865, -30638, -53476, -26817, 16314, 46048, 49773, 55106, 30062, 719, 30128, 47536, 38053, -1331, -20624, 27548, 21519, -50888, -113828, -112977, -80185, -34703, -11506, -38524, -6508, 35055, 42347, 4985, -14897, 686, 45833, 51940, 40323, 49981, 38529, 26759, 23784, 1984, 41328, 86072, 69811, 68204, 87115, 73528, 65497, 46246, 35544, 49695, 77237, 96260, 112085, 134595, 108928, 86682, 77393, 49827, 26598, 21631, 45685, 46952, 37917, -4303, -43121]
13702d3121J5466L5329O593j9224J0559J2598J8030m1301o9271l0190K3112L5014
13690d6406k0094K649J5044L386o75L0095J9862q026j2725J3130L1194m561J1012
13677C3885L5290M883j2711K3596K0443m5702j2239q262K3194k9687k2987O698
13665A6401R456r402j0022J1608K422J3545R82j0865j1028m216j9287J1780L1977
13652C3351M3283J028j2082k2267k5071m5796J3649J3899p974l838K5653N5443
13640F9278M2512J4192k3978J1018L2616J6078j5891l0976k6883J9617j6197L3127
13628A24513j3587m7198q85j8785J1198K0456Q439N66J1814m726p499K4003J5605
13615A23914k3485j3994J9206J5482N923K8328k764k6207j775j0004m9328k3174
$$ y = [-43121, -27655, 7674, 14267, -4957, 5602, 18200, 36230, -5071, -74342, -104532, -81420, -46406, -66500, -63851, -48807, -45421, -46096, -16001, 3861, -4165, -16890, -3760, 27434, 22873, 33885, 69175, 74058, 61347, 84943, 105386, 59684, 47445, 39183, 62377, 32690, 9703, 16401, 25857, 16455, 6433, 18041, 20463, 34008, 34990, 24125, 13097, 8881, -10406, 1374, 33351, 76634, 77662, 65580, 43313, 18242, -27554, -13905, -6, -7980, -11818, 13835, 69278, 111790, 125982, 102004, 113022, 145638, 161716, 145825, 114849, 87966, 107583, 91386, 124513, 110926, 63728, 62843, 44058, 55256, 75712, 84151, 84717, 96531, 91805, 84306, 108309, 123914, 100429, 86435, 105641, 121123, 127046, 155374, 152610, 126403, 124628, 114624, 65296, 42122]
13603D2122n063l4852J673j1643j1345L3160J6347n016q829J5988j4262J877p197
13590A2960J2206K4959K0936j1549O385K2830j1134l0338K5095K4473L732n549
13578I5006L8525j1717o0727o79M3931J5881m0482L500L5180k4653l5080J910
13566F0595M0012J3765R956k0174n0656j6384P4703K0526j3160k0489l8490o8833
13554h629k6478N8160R6085L5215m415j3451n2823l9758k5482M0462K6127J3376
13542I8389l371j8772l0294Q501j0197J0674Q718M1106J7336N881o4141l9255
13530B4575L0802J1686l7721Q96O46M3115L7301k5426J3941R690J8146L0338J8212
13517A76201L394L6594J6468K6225P179j1595j2467J7939r169k4666j4336l7935
$$ y = [42122, 37059, 2207, 3880, -7763, -19108, 14052, 30399, 25383, 16554, 32542, 18280, 20157, 12960, 25166, 50125, 71061, 59512, 65897, 88727, 77593, 47255, 72350, 96823, 100555, 95006, 133531, 121814, 61087, 60408, 104339, 120220, 79738, 83238, 118418, 93765, 58685, 60595, 100607, 114372, 124328, 104154, 53498, 37114, 111817, 132343, 119183, 98694, 60204, -8629, -35107, 23053, 119138, 154353, 149938, 136487, 83664, 43906, 18424, 58886, 85013, 98389, 95018, 76246, 45952, 54453, 44256, 54930, 63648, 104754, 122090, 127971, 63830, 24575, 55377, 67063, 29342, 30238, 30884, 73999, 111300, 85874, 99815, 109505, 127651, 157989, 176201, 179595, 216189, 232657, 258882, 266061, 254466, 241999, 259938, 250769, 226103, 211767, 173832]
13505A73832J3793M1494N1559R623J8896m4357m8621j5611j3660L8919J8217k5085
13493B18999l6922L4288K682m513l370k1552m0314K5311L3026L0643J4224M838
13481B57340L2946k0682l7059l3700J2700N4955j5957L229M1492k1192l7673m482
13469B31917P421k5973O686k0363n756j0536k6876l2598J784K5978j4534o78L0222
13456A66694M2504O5896L1304K6288n1815l7889k7307j8033M5941L879j1502q529
13444B27431J7812L2312J4997J1515l0731J2587N315j7941j118J6127M4487L2719
13432C65512O418J0606l319k79J6428J7394L2737M2731K4577M7819N1856L8589
13420F51069L517L0439K458O015O3527K4007N1973P9421L2294O7832R5604J02973
$$ y = [173832, 187625, 229119, 280678, 290301, 309197, 264840, 216219, 200608, 186948, 225867, 244084, 218999, 182077, 216365, 219047, 214534, 211164, 189612, 149298, 174609, 207635, 238278, 252502, 257340, 290286, 269604, 232545, 198845, 211545, 266500, 250543, 253772, 295264, 274072, 236399, 231917, 239338, 213365, 220051, 199688, 193932, 183396, 156520, 123922, 125706, 151684, 137150, 136472, 166694, 209198, 275094, 306398, 332686, 280871, 242982, 215675, 197642, 243583, 247462, 235960, 227431, 245243, 277555, 292552, 304067, 273336, 285923, 291238, 273297, 272179, 288306, 332793, 365512, 371930, 382536, 379217, 378938, 395366, 412760, 445497, 488228, 512805, 560624, 612480, 651069, 654586, 685025, 687483, 693498, 757025, 781032, 833005, 912426, 944720, 1012552, 1108156, 1211129]
13408A211129J13777J40196J60927J46767J82307K13703K81788L52854L40623
13399C144071L93886N12210O01890O75198P73248R19385J140976J559356K127419
13390A1847639K801497L673385N039316P340285J0322629J1141054O572080j233579
13382E7504306o645777q195310p765860o663620n195207l761933k518869j481182
13374A5276548o85807M7058Q83906J824318K404031J894634P10754J95755O44342
13365B3195539J695668L493239N554225O043573L955326K081789K927650N504284
13357E4451293P425828O064980J143470m161511o851732o647709m607018j963819
13349D4853782q18103k543453m804440n090319m103095k782899j338031j58005
$$ y = [1211129, 1324906, 1465102, 1626029, 1772796, 1955103, 2168806, 2450594, 2803448, 3144071, 3537957, 4050167, 4652057, 5327255, 6100503, 7019888, 8160864, 9720220, 11847639, 14649136, 18322521, 23361837, 30702122, 41024751, 52165805, 58737885, 57504306, 50858529, 42663219, 34897359, 28233739, 23038532, 19276599, 16757730, 15276548, 14590741, 14637799, 15521705, 17346023, 19750054, 21644688, 22355442, 22551197, 23195539, 24891207, 28384446, 33938671, 39982244, 43937570, 46019359, 48947009, 54451293, 61877121, 67942101, 69085571, 64924060, 58072328, 51424619, 46817601, 44853782, 44035679, 41492226, 36687786, 31597467, 27494372, 24711473, 23373442, 23215437]
13341B3215437k06820j275344j906645j813345j329831p34948k4133P89027J757383
13332A8470781K806717M061610O149037R154976J1643144R849600K268293n683145
13324E8721013r175735r440179q511469p139586n557744m120846l064317k239043
13316I472094j682753j303527j075594q73728o59181n60811m36685l17846k77151
13307B284818k43599j77703j50328j58076j28715n2450o3998o5948l2466J8789
13297A230324M419l0512J7755L8406M4759m872r0596p3648j33002j40831p2691
13286G89511k9381l6735k5477J3374m7908j9483j2154j3648m9451n2352j7915
13275D98381K0119L4414p111n5962k0155J2830o307o953k2463l7154m3186k7658
$$ y = [23215437, 23008617, 21733273, 19826628, 18013283, 16683452, 15948504, 15924371, 16713398, 18470781, 21277498, 25339108, 31488145, 40643121, 52286265, 62135865, 64404158, 58721013, 49545278, 40105099, 31593630, 24454044, 18896300, 14775454, 11711137, 9472094, 7789341, 6485814, 5410220, 4536492, 3877311, 3316500, 2879815, 2561969, 2284818, 2041219, 1863516, 1713188, 1555112, 1426397, 1373947, 1309949, 1244001, 1211535, 1230324, 1234743, 1204231, 1221986, 1260392, 1305151, 1300279, 1209683, 1136035, 1003033, 862202, 789511, 760130, 723395, 697918, 711292, 663384, 643901, 631747, 618099, 568648, 516296, 498381, 518500, 552914, 545803, 489841, 469686, 482516, 476209, 469256, 446793, 409639, 366453, 338795]
13263C38795j4954J617Q580N8278M2681k4727N276O058j3345l336K197o0675Q12
13250C47257J0324n3882n789n383M595O868j1941l0481j8224j6806Q50J3402K0302
13237B61092J4337L472j5764j4903m744j3688K177L7716j57r177K5145N891m1274
13224B50123k7586l7749k2671k2497K810L6377J2110J7322M3086K0951n38m893
13212B66845N658J5323K0395J6756l080M571l2606m1145J2800L723n7403l2579
13200A79258n3956j684L8614K223l8573n1134j6493k8843k7K8895L4297P450M810
13187A04837j2858k9957j1447K4964Q017j3285m8596k2975J8635K6445K5358J3045
13175H2183M5216J5648l3178j4902o5748p119L0368K866j8634l4715L325k4850
$$ y = [338795, 323841, 325458, 334038, 392316, 434997, 410270, 415546, 421604, 408259, 404923, 407120, 346445, 347257, 357581, 303699, 297910, 292527, 297122, 303990, 292049, 261568, 243344, 226538, 227388, 240790, 261092, 275429, 278901, 263137, 248234, 243490, 229802, 231979, 269695, 269538, 260361, 285506, 291397, 250123, 222537, 184788, 162117, 139620, 142430, 178807, 190917, 208239, 251325, 272276, 271738, 266845, 272503, 287826, 308221, 324977, 321897, 326468, 293862, 252717, 265517, 269240, 211837, 179258, 125302, 123618, 162232, 164455, 125882, 74748, 58255, 29412, 29385, 58280, 92577, 100027, 104837, 91979, 62022, 50575, 75539, 83556, 70271, 21675, -1300, 17335, 43780, 69138, 82183, 127399, 143047, 109869, 94967, 29219, 22100, 52468, 55334, 36700, 1985, 5310, -19540]
13163a9540p451L3839M2875k7197n844N631N450M0127R633L814J363n7585j7096
13150H019N600J5136j7256j9626k1426p921N1314M8482M526r464J2380m108j5712
13137D9944n821j821k3136m1175K9083M3236J7736L765r282J9514l5483k2692
13125B3868N7025m196l0156J0822L9368l7044K1809J5678r424j6076R072j1153
13113F9593m624k4284l0465j2042k9835k0852j4853J0375N154L4343R943K4926
13101A7379m913l561K3057m666J3663p525l93j4236j2378J1834K8090J737l5254
13088A2834j3195K2894M350j8575l1506K876L3253L5787L0380J8251R122k114
13076A04357l570n4388p2332l4734j02k5847Q687K8367L5952R334j8797L5854
$$ y = [-19540, -26991, 6848, 49723, 22526, 16682, 22313, 27763, 67890, 77523, 81337, 82700, 25115, 8019, 13619, 28755, 11499, -8127, -29553, -37474, 13840, 62322, 66848, 57384, 69764, 65656, 49944, 44123, 42302, 19166, -22009, 7074, 50310, 68046, 71811, 62529, 82043, 46560, 23868, 80893, 76697, 46541, 57363, 96731, 59687, 81496, 97174, 87750, 71674, 80746, 69593, 64969, 40685, 10220, -1822, -31657, -52509, -67362, -56987, -51833, -17490, -7547, 17379, 12466, 8905, 31962, 27296, 40959, 33434, 33041, 18805, 6427, 18261, 46351, 48088, 12834, -361, 22533, 26883, 8308, -23198, -20322, 12931, 48718, 79098, 97349, 106471, 104357, 100787, 46399, -25933, -60667, -60769, -86616, -77929, -49562, -13610, -4276, -23073, 12781]
13064A2781K8371k699j3447J0225J4827P329R176k8230l5640j9060J491J5967
13052A091K4526O574J5546j1583j3778m788Q994k9173n19K3843M8748J1616j9654
13039F1443N864m3544l7864j3816M2424L8880L918l070n5288p305M3153l250L048
13026C4593J4511m8434m6846K5749M1704J0766p976j0347l318L6720j5308m8725
13014a6911l0384J3530J2780k1467J6954M1939O1745L9915m7770j7698j9802k0803
13002A2028j0864l6190j9303L4136L2211k41j7530j6915K1327j8489K1267O934
12990H371R201J4739p555j6701k5346l2604O73K9085K6860o524o965J9423n035
12977G622J7372k7456l3962J4834L8585K6206P620j4028j0544J249k715j3979
$$ y = [12781, 41152, 38453, 25006, 35231, 50058, 57387, 66563, 38333, 2693, -16367, -14876, 1091, 25617, 32191, 47737, 36154, 22376, 17588, 26582, -2591, -3110, 20733, 69481, 81097, 61443, 67307, 23763, -14101, -27917, 14507, 53387, 57305, 54235, -1053, -8358, 34795, 31545, 34593, 49104, 670, -46176, -20427, 21277, 32043, 24067, 13720, 10402, 47122, 31814, -16911, -47295, -33765, -20985, -42452, -25498, 16441, 78186, 118101, 70331, 52633, 32831, 12028, 1164, -35026, -54329, -20193, 12018, 11777, -5753, -22668, -1341, -19830, 1437, 8371, 17572, 32311, 24756, 8055, -17291, -49895, -49222, -20137, 6723, 199, -6766, 12657, 7622, 24994, -2462, -36424, -21590, 16995, 43201, 50821, 36793, 26249, 27498, 24783, 10804]
12965A0804J8661m305k8457K3741j9334l6181J9727M3248j4448R819L8061J3326
12953G4662L5915k0406m9689j4769O653J584k7516K2295K9697l3975J614m897
12941B1168p552j5488l1655K1231l43N65M7090n707j8680r669L651K5201J7339
12928D7151n259j0918k8411Q367K2128J6389J9712L1308o850k6635K6614R839
12916A03435J8549M5417K4078O8753N5704J2313j7333k9408n3434m0093k4386
12905A63595n731R069j2727K555l2165o4383O570K6962j311P779L272M505o230
12892A01760K3693M72L3704L1417J5322K5780J7031N3757P941N865j7936K479
12880C01285n9131m0657K1416K5825k0136n3596q4938p434K296j5455L655N1856
$$ y = [10804, 29465, 25160, -3297, 20444, 1110, -35071, -15344, 27904, 13456, 23275, 61336, 74662, 110577, 90171, 40482, 25713, 32366, 33950, 6434, 28729, 58426, 24451, 26065, 21168, 13616, -1872, -33527, -12296, -12639, -12074, 35016, 29309, 10629, 960, 4611, 29812, 47151, 41892, 30974, 2563, 10930, 33058, 49447, 69159, 100467, 93617, 66982, 93596, 103435, 121984, 167401, 191479, 260232, 315936, 328249, 310916, 281508, 228074, 187981, 163595, 157864, 166933, 154206, 156761, 124596, 60213, 66783, 93745, 92434, 100213, 103485, 107990, 101760, 125453, 125925, 159629, 191046, 206368, 232148, 249179, 302936, 310877, 316742, 298806, 301285, 242154, 201497, 222913, 248738, 228602, 175006, 90068, 82634, 84930, 69475, 73130, 124986]
12868A24986L1566k5484j036K9704M910j0751n7243l6760l64L7757K6786N3858
12856A77929M1199L5940M2722j7590k6100n6711j3345m1294m4554o187k645m0351
12844D9013k4412n966J9333l35Q370j5549K8780K2407j176n6254l5681L4972n352
12831A8150j5806K6869J3046J0266r775N7747P675l9374m1066j8046k0398J1671
12819I59J8954n396J7178Q208L8208r220k9061N002n003j2007J3189M871j1678
12806C4204M647R448k3762r180L2624K1362L3605j3344K3781m7103p2578J0801
12794D505j9296l1025M5678N4377o000n5731l574M00Q579J3947j616j0054j4386
12781a4196p342j5976q951L9141L3480R352j895j9926J0097j7991L1267m732l5076
$$ y = [124986, 156552, 131068, 130032, 159736, 164646, 153895, 96652, 59892, 59528, 97285, 124071, 177929, 219128, 255068, 297790, 280200, 254100, 197389, 184044, 142750, 98196, 92009, 89364, 49013, 24601, 18635, 37968, 37633, 46003, 30454, 59234, 81641, 80465, 24211, -11470, 23502, 18150, 2344, 29213, 42259, 52525, 42750, 100497, 108172, 68798, 27732, 9686, -10712, 959, 19913, 14517, 31695, 39903, 78111, 68891, 39830, 44832, 39829, 27822, 41011, 45882, 34204, 38851, 48299, 24537, 15357, 47981, 69343, 102948, 89604, 113385, 66282, -6296, 4505, -14791, -45816, -138, 54239, 48239, -7492, -11066, -10666, -2087, 11860, 10244, 190, -14196, -21538, -37514, -46465, -7324, 26156, 35508, 33613, 13687, 23784, 5793, 37060, 32328, -2748]
12768b748j2978J0971j7572j4718O780K2172J3679Q721J5465O055J2474J5622
12756F3923k9629J9622J1809k2896k1433M0112l041l6872L597N848l911l6093
12744h964q306J2405K4628j4500l0192N3279P964K3626J7427m639n7708L149k3137
12731d968J3771J9070j7020k5471j8560k0343J2286p324p381M4132l5271l8093
12719h5172r093J3073K5309M4782P582M488k0344L6220L8321K7307m023O748k0949
12706F4249R437k4652J2440r673L9457K1782Q669k3462j1840j3957r0004m3055
12694f0609L1732L6068J2766K8766j737K1440j8548n448j9016r659j3329J0257
12682A2683Q005l882j6596n1456L5192L9654j8431j8385L9282L4855m753l9440
$$ y = [-2748, -15726, -4755, -22327, -37045, -30265, -8093, 5586, 14307, 29772, 35827, 48301, 63923, 34294, 53916, 65725, 42829, 21396, 61508, 58467, 21595, 25192, 31040, 27129, -8964, -17270, -4865, 19763, 5263, -24929, 28350, 36314, 59940, 77367, 72728, 15020, 18169, -4968, 8803, 27873, 10853, -14618, -33178, -53521, -41235, -48559, -55940, -11808, -47079, -85172, -94265, -81192, -55883, -11101, -3519, 969, -19375, 16845, 55166, 82473, 78450, 85198, 64249, 73686, 49034, 61474, 51801, 91258, 113040, 121709, 98247, 86407, 72450, -17554, -60609, -28877, 7191, 19957, 48723, 46986, 68426, 49878, 44430, 25414, 15755, 2426, 12683, 20688, 16806, 210, -51246, -16054, 23600, 5169, -13216, 26066, 60921, 56168, 16728]
12670A6728k6881j0722J8123O124L2984J4199k6559k3474Q084j7800l8616n7l189
12657e1056M5765L5616J9232K523R654k887k444l8858k6371k1265j5662N7877
12645A2124J9898k6564k9151J2187L1705L7891P26l4137j4529J942M4960j7626
12633C9426K0826m6802p592N0990K1619m1990m8672J2618q007o452l284J4897
12621b423R595N670j1124m392j031l955O4926J6351m7197K38K5619J612o028K0302
12607F8163j5409k2770l612l4641R814O3590Q077J7354L565k9267P283L7685j417
12594A08415j7600l4687j8810k6258J0796J4601k3978l4952L8472L4840j3367
12583C7472k2328j7215l2805K850J9543j8818j8669J8542K4099N905r499m988
$$ y = [16728, -10153, -20875, -2752, 3372, 36356, 50555, 23996, 522, 8606, -9194, -47810, -47867, -51056, -5291, 30325, 49557, 52080, 61734, 58847, 56403, 17545, -8826, -30091, -45753, 12124, 32022, 5458, -23693, -11506, 20199, 58090, 58816, 24679, 10150, 12092, 57052, 39426, 60252, 13450, 5858, 56848, 78467, 36477, -12195, 423, -7584, -14036, -17320, -2423, 7172, 12842, 1718, -2674, -3705, -7660, 57266, 73617, 26420, 26658, 52277, 53889, 47861, 68163, 52754, 29984, 26372, -8269, 1545, 65135, 73212, 90566, 94131, 64864, 72147, 109832, 108415, 90815, 56128, 37318, 11060, 21856, 36457, 12479, -22473, 15999, 50839, 37472, 15144, -2071, -34876, -32026, -12483, -31301, -49970, -31428, -7329, -1424, -10923, -15911]
12571a5911J5999j748K1078L5783J2713k7967m2949N3848J544K1206J8878k7930
12559F4544l3845J5966k044q440K2654L5979n8554j0626o311k3197N317M2253
12547D3696m347K855K1491j2072j8736M2163j807K4654N802J1417K9230k9409
12535A14937J9438J3941J8558K2972n8055l0730j0481K4800n855K0740L1040j5084
12523A46221M543J7550k219N5255N8441O3339M2446j2846k2992K0502O6932N1530
12511D88702K7239P339k8171n3740o2336j2297p2414p3219k2057l7789j736L5388
12499A94909K4864k7099j2254M63O4109J1170j5916l6063l809Q900M1983J7730
12487B68987R145J407K0443M9756N1913J8641O183P379L412j7932m8588m3598
$$ y = [-15911, 88, -1660, 19418, 55201, 67914, 39947, -3002, 50846, 52390, 73596, 92474, 64544, 30699, 46665, 44621, 36181, 58835, 94814, 36260, 25634, 19323, -3874, 1443, 43696, 39349, 42204, 63695, 51623, 32887, 75050, 73243, 97897, 103699, 115116, 144346, 114937, 134375, 148316, 166874, 189846, 131791, 101061, 90580, 115380, 109525, 130265, 161305, 146221, 150764, 168314, 166095, 221350, 279791, 343130, 385576, 372730, 349738, 370240, 437172, 488702, 515941, 523280, 495109, 441369, 379033, 366736, 294322, 221103, 199046, 161257, 159521, 194909, 219773, 192674, 180420, 180883, 244992, 256162, 240246, 204183, 200374, 209274, 251257, 268987, 278132, 279539, 299982, 349738, 401651, 420292, 426475, 433854, 437266, 419334, 370746, 327148]
12475C27148o9465l8700K6703l7711l9387j4297N306J0006m9848o8472l894L6764
12463H4153O0954K83J9106K6103j1404P559Q337K3309Q5673N4335j3799m4273
12451C00336k2422J6094m2968n8490k6970j3769r869J8545m8208m5564j4866k4653
12439B7196l8087L0842L7345N251l7115m3567k1916J8559M8110L167P880K6537
12427F4202L844p412J0919P978l5360J1948J0752n6229m3032j2585L9301N2255
12415D6581k2884Q328J1931K0792j4180l1474R284P784j8955j0825K8972L3859
12403F9213l4284m1687p634L616K7467r252J2170j6732o5311L5057L0691J9883
12391B3197Q817R16m248j5008J4502M8950j310p715r384l8448J491K4866L3205
$$ y = [327148, 257683, 218983, 245686, 207975, 168588, 154291, 159597, 169603, 119755, 51283, 47389, 84153, 145107, 145390, 164496, 190599, 179195, 186754, 195091, 218400, 304073, 358408, 344609, 300336, 277914, 294008, 251040, 192550, 165580, 151811, 141942, 160487, 112279, 66715, 51849, 27196, -10891, 19951, 57296, 62547, 25432, -18135, -40051, -21492, 26618, 29785, 37665, 64202, 68046, 60634, 71553, 79531, 44171, 56119, 66871, 10642, -32390, -44975, -5674, 46581, 23697, 32025, 43956, 64748, 50568, 19094, 28378, 36162, 17207, 6382, 35354, 69213, 34929, -6758, -14392, -10776, 16691, 7439, 19609, 2877, -62434, -27377, 3314, 23197, 32014, 32930, 28682, 13674, 28176, 77126, 75816, 68101, 58717, 20269, 21760, 46626, 79831]
12378G9831K8901p911j6463L937m1191J737K1430M637N390L6271J3862l7476j9246
12365G3709n090Q522L3035N654J1035N1656K3647m984k1525l975J0231j2703Q2911
12352B52123O3835N1896N1073L589m1898l2999l6153m0452J5643k8893m4778J5033
12340B28019p562j404l5262l2665L9276o06l5876l776M3025J9602L1155Q3225
12328C27151P7271Q4551J3465p074L3615J8551R114K8406O4248K3040k8521l4832
12316F08985l4110o9379r1384m2961l8799l6462j5133j3305L3940k8726k3605
12305B49061J9896J6163j7474l496M3819k462j1913j1262J6993L5706Q4926O1837
12293D81794N3194l316m0547k2852n348j8965j8804q1009o0470m5515o1522n7547
$$ y = [79831, 108732, 100821, 84358, 88295, 47104, 48841, 70271, 74908, 80298, 116569, 130431, 92955, 73709, 68619, 77141, 110176, 115830, 126865, 178521, 202168, 197184, 175659, 171684, 181915, 169212, 252123, 315958, 367854, 418927, 422516, 380618, 347619, 311466, 271014, 286657, 257764, 212986, 228019, 220457, 219053, 183791, 151126, 190402, 189796, 153920, 150144, 193169, 212771, 243926, 327151, 404422, 488973, 502438, 495364, 528979, 547530, 556644, 585050, 649298, 672338, 643817, 608985, 574875, 505496, 414112, 371151, 332352, 295890, 280757, 267452, 301392, 272666, 249061, 268957, 285120, 267646, 264150, 307969, 305507, 293594, 282332, 299325, 335031, 419957, 481794, 534988, 531672, 491125, 468273, 462925, 443960, 425156, 344147, 283677, 238162, 176640, 119093]
12281A19093j5197L2493J762P219m831l9291j3380L3033L1696k280J0613N5524
12269B16454M8631l5439n3024p7950K6259O3878j533m4071l4993j6313k9822r235
12257E2842j1019K7855O121L299q01N8538P790j9776k0247l1871r243K2435L9941
12244A25864j040j2805J5782J2460q624l3417L0662K2593o608m749m3402m815
12232I1901J2334J6774l5197k1476O63K1946k3688J0879L2459P471r754j0915
12220I3397j3090k3477L484K8937k1105L2164j638j348M1057j0583m742J1013
12208A34069N7966K3869k9176L315N5046L6294Q588M132j8429O210j6967J1409
12196B76326m678j2758N4223l176N503L6214k4338k9230o7532l8514k4346r024
$$ y = [119093, 103896, 136389, 138151, 145370, 140539, 101248, 87868, 120901, 152597, 150317, 160930, 216454, 265085, 229646, 176622, 98672, 124931, 188809, 187276, 143205, 108212, 91899, 62077, 52842, 41823, 69678, 75799, 79098, 78297, 136835, 144625, 124849, 104602, 72731, 63488, 85923, 125864, 124824, 112019, 127801, 140261, 131637, 98220, 128882, 151475, 144867, 140118, 96716, 91901, 104235, 121009, 85812, 64336, 64999, 86945, 63257, 74136, 106595, 114066, 104312, 93397, 80307, 56830, 60314, 89251, 68146, 100310, 98672, 97324, 138381, 127798, 123056, 134069, 192035, 215904, 186728, 190043, 245089, 281383, 289971, 294103, 275674, 281884, 264917, 276326, 271648, 258890, 313113, 309937, 315440, 351654, 327316, 298086, 230554, 192040, 167694, 158670]
12184A58670N3054R476l9901J5934O068J6523j951K6999J874k0403J4377L1383
12172B72103N97j5562l5753l14K7852o749l4760j9690l457j3797J0633K338k3272
12159A60169l3446N3830J1753j2951K6716M3247K863m1212l2761L5670N7652K1028
12147B92558L0842J0544j6049j0299K1994L089Q087J3729k4842N203l2117J8390
12135C21129K4430r744j732M6786K7494k1832l6416k0121M919O0220N932k5158
12123C75907o0394k1555J447L2636J0696k4597K0133M3315Q4881N4142L7599L8778
12111E92988M3927K4596L5932n750N323Q6440Q8160P4942Q0759Q3736J35201J27195
12099A373449J49669J70061J77735J86647K23810K50020L02396K88468L09116
$$ y = [158670, 211724, 221200, 181299, 197233, 203301, 219824, 217873, 244872, 246746, 226343, 240720, 272103, 272700, 257138, 221385, 221071, 248923, 242174, 207414, 187724, 184267, 170470, 181103, 183441, 160169, 126723, 180553, 192306, 179355, 206071, 249318, 252181, 210969, 178208, 213878, 271530, 292558, 323400, 333944, 317895, 307596, 329590, 332679, 340766, 354495, 329653, 334856, 302739, 321129, 345559, 335815, 334083, 380869, 408363, 386531, 350115, 329994, 334913, 395133, 401065, 375907, 315513, 293958, 295405, 328041, 338737, 314140, 334273, 377588, 462469, 516611, 554210, 592988, 636915, 661511, 697443, 691693, 697016, 783456, 871616, 946558, 1027317, 1111053, 1246254, 1373449, 1523118, 1693179, 1870914, 2057561, 2281371, 2531391, 2833787, 3122255, 3431371]
12090C431371M23307M98620N76742Q01585R56456J082536J354410J761081K225178
12081A3111286K852729L861634N401388P737070J0335841J0946745P186222K78714
12073F1711629n670110q236017q350278p320084n899008m360216k990821j824853
12065A7060242q72394j0250R26480J790760K007236J324412M69451K74388R58922
12056B3929247K264426L869478M680385L835202J958685J021792J979629M164290
12048D7703134O565561P281242M930258L93022l676018n287836m570652l280122
12040E0058589l221795m455687n413480n143979m049948k594208j300579p05696
12032B3173217j166953j879331k109831j735318j184254n92718P7489P58087J513442
$$ y = [3431371, 3854678, 4353298, 4930040, 5731625, 6688081, 7770617, 9125027, 10886108, 13111286, 15964015, 19825649, 25227037, 32964107, 43299948, 54246693, 61432915, 61711629, 56041519, 47805502, 39455224, 32135140, 26236132, 21875916, 18885095, 17060242, 16187848, 16177598, 17104078, 18894838, 20902074, 22226486, 22695937, 22970325, 23929247, 26193673, 30063151, 34743536, 38578738, 40537423, 41559215, 43538844, 47703134, 54268695, 61549937, 66480195, 66873217, 63197199, 57909363, 53338711, 50058589, 46836794, 42381107, 36967627, 31823648, 27773700, 25179492, 23878913, 23173217, 22006264, 20126933, 18017102, 16281784, 15097530, 14504812, 14582301, 15340388, 16853830]
12023A6853830K461900L663584N471775P766731R404987Q091933K935715l352489
12015E3297966p225072q318612p775072o574773n255824l989765k968052k199524
12007H991272j654099j341464j070547q83831o75538m70575m03564k94617k32295
11998A964742k13848j79522j49004r0902j22316j40743n9031j8937p0101p6509
11988H43829m2064k9254l7594k3868l6578R845m5746l9569o0335n3080L4803o112
11976E14277j9548O057k854k6486l4722J7604J6972O94k0051k8945l6961N966
11964C92003l1538l3944K0762M8408k1676n1639l0894Q268L7432K1001m3290n0910
11952B63983n8816K2225O235R051p239j3273K3094J5758o951l5885j6294m331
$$ y = [16853830, 19315730, 22979314, 28451089, 36217820, 45622807, 53714740, 56650455, 53297966, 46072894, 37754282, 29979210, 23404437, 18148613, 14158848, 11190796, 8991272, 7337173, 5995709, 4925162, 4041331, 3365793, 2895218, 2491654, 2197037, 1964742, 1750894, 1571372, 1422368, 1331466, 1209150, 1068407, 1009376, 990439, 920338, 843829, 801765, 772511, 734917, 711049, 674471, 684316, 638570, 599001, 538666, 485586, 520389, 514277, 494729, 500786, 497932, 471446, 436724, 454328, 471300, 471994, 451943, 422998, 386037, 392003, 360465, 326521, 347283, 395691, 374015, 322376, 291482, 299750, 337182, 358183, 314893, 263983, 205167, 227392, 233627, 242678, 235439, 222166, 245260, 261018, 254067, 218182, 201888, 197557]
11940A97557j5183Q895J6571Q987M566Q201q517J3240L4160J4330k6956j8370
11928B37481O101L391q730l5353m1243p926O828k966j1592N45M7566J1676k7068
11915A78710p216n5290J441M3070K9131j5408j4091j9451r613j4367k2442J2172
11903A06646K8782R137N3049L5284k544j235K9326k7869j0449k3912n934J3803
11891B04084L327m4383p284L9338k3513m0171j9257k5627J8231J728r830K489
11879I9132P534K9235Q145k1571q419J474R992R549j6268j4404K2574O3635O5141
11866B55749K109m2963l9554o55o7627l7197L2385j4510j4672l937J4723L8461
11854A22312M0135J2059n8878r177L8824k9591n7992L124O2525M3819K2153n287
$$ y = [197557, 182374, 191269, 207840, 216827, 221393, 229594, 221077, 234317, 268477, 282807, 255851, 237481, 243582, 246973, 238243, 202890, 161647, 153721, 160549, 157583, 145991, 146536, 194102, 205778, 178710, 171494, 116204, 117645, 160715, 189846, 174438, 160347, 140896, 131283, 116916, 94474, 106646, 135428, 144565, 197614, 232898, 230354, 229119, 258445, 230576, 220127, 196215, 190281, 204084, 207411, 163028, 155744, 195082, 171569, 131398, 112141, 86514, 104745, 106473, 96643, 99132, 106666, 135901, 144046, 122475, 114056, 115530, 125522, 135071, 118803, 104399, 126973, 190608, 255749, 257858, 214895, 175341, 174686, 107059, 69862, 102247, 87737, 73065, 69128, 83851, 122312, 162447, 174506, 115628, 106451, 145275, 115684, 57692, 60816, 123341, 167160, 189313, 184026]
11842A84026K1878J9533K859j1246M1949L2091j4810N8349L8567k1903k0509N9190
11830C89974K7199R3123J25322K11048K82906L31279L36481K08891j111j94199
11820A810913l32254l06124k16858j78072j51722j24836q3484o9926L654J3906
11810C65197l4740l5461n1957l5640k1742J7075m250j9789k0805m6135m1592K3496
11798I3657J660J1923J2795J3398k2483n4733J9650L6507K6731l2687j6216m1021
11786D9181k9030K7108N7740j2716j2953k7257k6036K0811N3938J7279M850n3606
11774F9309j6801K1746J8445j0852k2745k3335K3288L9501M1627Q751m626j2595
11762A31713m3117K2482J6512l6431J6382J3080j2181L179k2495k7368k008J5208
$$ y = [184026, 205904, 225437, 228296, 217050, 258999, 291090, 276280, 334629, 373196, 351293, 330784, 389974, 417173, 510296, 635618, 846666, 1129572, 1460851, 1797332, 2006223, 2005112, 1810913, 1478659, 1172535, 955677, 777605, 625883, 501047, 417563, 347637, 351291, 365197, 330457, 294996, 243039, 207399, 185657, 202732, 198482, 178693, 157888, 111753, 70161, 93657, 95317, 107240, 120035, 133433, 110950, 56217, 75867, 112374, 139105, 106418, 90202, 49181, 20151, 47259, 104999, 92283, 79330, 52073, 26037, 46848, 100786, 118065, 122915, 69309, 52508, 74254, 92699, 81847, 59102, 35767, 59055, 98556, 140183, 148934, 144308, 131713, 88596, 111078, 127590, 91159, 107541, 120621, 108440, 111619, 89124, 61756, 59748, 74956]
11750G4956M7161M13m1962o2934k284L2613P4833j7318m1862K27K6780r378l5562
11737D5683j8952K3653J5022j4903J3046J9481j1336J5863l4812M981k8567k7214
11725A945M6164J178l7894J20K0911M316Q064j4200J2107L829j7613J7984m835
11712D2076J0877M2551j225J891L7018l5834n3387k2938J6824L7553j3783j3196
11700D8427k4753J5172k1128n3072n297R674L8610K368K881k1854J577M4066L1497
11687F8168j4688l1394p007L3879J5264k460k0559p809K5152J4742k123l036j9220
11674D8909j3380j2262q04N9785J6763k9019j9870Q877K2507j1598J3577r767
11662G3718j1439O047K1322L9766L5961Q908K4362k420J0665J5508k963L6722
$$ y = [74956, 122117, 122530, 80568, 17634, 15350, 47963, 122796, 105478, 63616, 63843, 90623, 81245, 45683, 26731, 50384, 65406, 50503, 63549, 83030, 71694, 87557, 52745, 57726, 29159, 1945, 48109, 49287, 11393, 11513, 32424, 36740, 44804, 30604, 42711, 46540, 28927, 46911, 42076, 52953, 95504, 94279, 96170, 133188, 97354, 43967, 21029, 37853, 75406, 61623, 48427, 23674, 38846, 17718, -35354, -40651, -30977, 7633, 10001, 12882, -8972, -7395, 36671, 68168, 53480, 22086, 15079, 48958, 64222, 61762, 41203, 33394, 58546, 73288, 71165, 68129, 48909, 35529, 23267, 22463, 82248, 99011, 69992, 50122, 58999, 81506, 69908, 83485, 73718, 62279, 68326, 89648, 129414, 165375, 174283, 198645, 196225, 206890, 222398, 219435, 256157]
11650B56157K1860P2920P2024K1333m5083o9122m3104l8505j6439m5532m3072
11639A43437o602J3375J4019L0424N5387K4922O4070N8055L195m3629p2992p7989
11627B05672k0477n5032J0787o414p041L5797J5328j4441J4285M7054L2689L0797
11615B89004j0794n6602j0036J100M7010L5495K9214l1517n7999L5684P1741N6402
11603C98702J2597K2404m6518k9187k5260k8355p5356j8603J4304n984K389p082
11591B14051m259R52k5752k295j0965L8916R7912L918K8969K4439n5094k8630
11579B82162k3731R38L0761M4443M5187L931M634o7563k1146k4143p860L424j1859
11566B59178q766m7145K1738N3325o4608l2712J1210k9764q869K6618K2432J9750
$$ y = [256157, 278017, 350937, 422961, 444294, 399211, 330089, 286985, 248480, 232041, 186509, 143437, 136835, 150210, 164229, 194653, 250040, 274962, 339032, 397087, 400282, 356653, 283661, 205672, 185195, 130163, 140950, 134536, 127495, 163292, 178620, 164179, 178464, 225518, 258207, 289004, 278210, 221608, 211572, 212672, 259682, 295177, 324391, 292874, 234875, 270559, 342300, 398702, 411299, 433703, 387185, 357998, 332738, 304383, 229027, 210424, 224728, 218744, 221133, 214051, 209792, 210744, 184992, 182697, 171732, 210648, 308560, 312478, 341447, 365886, 310792, 282162, 258431, 259369, 290130, 334573, 379760, 383691, 388325, 320762, 299616, 275473, 267613, 271037, 259178, 250412, 203267, 225005, 278330, 213722, 181010, 192220, 162456, 153587, 180205, 202637, 222387]
11554B22387R301J0524J4137L4980l5504J6243J0790M1169k8470J051k5656L970
11542B74922K0747L7002M1366J0486O7550P3895O805P2865J13271J71871K26887
11531A117667K75381M40513O26774O43571M06548j2087l57421m87631m42870l46383
11521A864062k51993k00730j62832j68009k04185j57281q6888n0564n8649m1508
11511D81423j5505q142k5431l7882k3296l4559j00981p8870j4022L8948M3631
11500B25314J3887j3038R508L1944L7161o668J346k958j8181j7136j884J6426
11488B75721K4386J0977J734l821K3945j8163m5592k4712R942P992Q203M183K5202
11475B99997R572m0679m0621j2101j1456n928L0128M5386N4434J6781M8141R037
$$ y = [222387, 231688, 242212, 256349, 291329, 255825, 272068, 282858, 324027, 295557, 296608, 270952, 274922, 295669, 332671, 374037, 384523, 452073, 525968, 532773, 605638, 718909, 890780, 1117667, 1393048, 1833561, 2460335, 3103906, 3510454, 3498367, 3140946, 2653315, 2210445, 1864062, 1612069, 1411339, 1248507, 1080498, 876313, 719032, 632144, 581580, 522931, 481423, 465918, 457776, 432345, 394463, 371167, 336608, 235627, 156757, 142735, 181683, 225314, 239201, 226163, 235671, 267615, 304776, 298108, 299454, 296496, 278315, 261179, 259295, 275721, 300107, 311084, 312818, 308997, 332942, 314779, 269187, 244475, 254417, 262409, 270612, 274795, 299997, 309569, 268890, 228269, 216168, 204712, 198784, 228912, 274298, 328732, 345513, 393654, 402691]
11463D02691K0963M3796J2754j0920o96J5597L4402M7358N7708O2656L8781K0386
11451G45476j2224j1302O170l285K2222O1691J9720N949K4350o069J7774O1357
11439I31829Q4392R1043P0135P3389P1888Q7721P5869M9923R2221J26172J29116
11428A883698J55068J80774K20332K27914K57168K53491L12035M09993M87607
11419D388080N58660O82164P07976P60675Q06215R02371J168431J387424J620229
11410A2982225J926824K259382K677569L232079L952529M615781N313690O426483
11402D3386562Q288124J1212888J5468096K1781694L2355854M8458184O4692174
11395B45643576O6160623M4791129Q578760k9504829n3952788n8608580n2072414
$$ y = [402691, 423654, 467450, 480204, 469284, 468588, 484185, 518587, 565945, 623653, 686309, 725090, 745476, 733252, 721950, 728120, 724835, 747057, 808748, 828468, 834417, 858767, 852698, 870472, 931829, 1016221, 1107264, 1177399, 1250788, 1322676, 1410397, 1486266, 1536189, 1628410, 1754582, 1883698, 2038766, 2219540, 2439872, 2667786, 2924954, 3178445, 3490480, 3900473, 4388080, 4946740, 5628904, 6336880, 7097555, 7903770, 8806141, 9974572, 11361996, 12982225, 14909049, 17168431, 19846000, 23078079, 27030608, 31646389, 36960079, 43386562, 51674686, 62887574, 78355670, 100137364, 132493218, 180951402, 245643576, 311804199, 356595328, 365174088, 335669259, 281716471, 223107891, 171035477]
11388A71035477m2392069l2417657k3512138j6627133j1894052q807316o870254
11381B8514858n505001m491141l591395k741988k073366j532254j203712r42454
11373F433547q16929o89465n57246m42539l45939k59785k11168k13154j99659
11364B697663j11551q6848j23319j00532j14210j63956q6723r6994j13177j04765
11354A595588l7300n7101k7083l4773n8258n9315l2871k2573k6409k8392o1140
11343A150373l0025m0178o5217l4455K9614N4993J08591J36000j8133j06831j39669
11332A045063j27103j03566p7859m7010o8983m8694r472j6462j7388j4569j9431
11321D94526J3555N0425K8927o140k2067j6415j5755n5445m5368m3095P521N325
$$ y = [171035477, 128643408, 96225751, 72713613, 56086480, 44192428, 35385112, 28514858, 23009857, 18518716, 14927321, 12185333, 10111967, 8579713, 7376001, 6433547, 5616618, 4927153, 4369907, 3927368, 3581429, 3321644, 3110476, 2897322, 2697663, 2586112, 2499264, 2375945, 2275413, 2161203, 1997247, 1910524, 1813530, 1700353, 1595588, 1558288, 1501187, 1474104, 1439331, 1381073, 1321758, 1288887, 1266314, 1239905, 1211513, 1150373, 1120348, 1080170, 1014953, 980498, 1010112, 1065105, 1173696, 1309696, 1291563, 1184732, 1045063, 917960, 814394, 736535, 689525, 620542, 571848, 562376, 545914, 528526, 513957, 494526, 508081, 558506, 587433, 581293, 559226, 542811, 527056, 471611, 426243, 383148, 390669, 395994]
11309C95994J1628o421l2376J457m0563k0696m0206k6297K1541p597k9577l062
11297B23825r853J2918L2135J0462l597j7342P211J6748J0251L239J2520p759
11285B90758r344k7725j5525k073K8464J2459L295L213q173L6096J0708j8018
11273C04135k3026L319N8985N5113L6924Q907k2488m2797m1303n886l8071n6371
11261B37441k1771o241m8754m8628m203K2500L547k3668N21J1347K1555J2312
11249A55958k8565l0684q762J6308k2342l1032J3635N470k7320J3835m6740k6709
11237a6948l734j2557J4566O4480k267l1163K515Q070k09M4895k511P770J2341
11224H5248k3822j1044M2535K2501J0310m6318m9632m0388N726O692N8464K0929
$$ y = [395994, 407622, 401201, 368825, 370282, 329719, 309023, 268817, 242520, 264061, 256464, 226887, 223825, 213972, 226890, 259025, 269487, 265890, 248548, 255759, 272507, 282758, 285997, 298517, 290758, 281414, 253689, 238164, 236091, 264555, 277014, 280309, 283522, 275349, 311445, 322153, 304135, 281109, 284428, 343413, 398526, 435450, 444357, 421869, 379072, 337769, 331883, 293812, 237441, 215670, 209429, 160675, 112047, 107844, 130344, 133891, 110223, 110744, 122091, 143646, 155958, 127393, 96709, 87947, 104255, 81913, 50881, 64516, 69986, 42666, 56501, 9761, -16948, -20682, -33239, -18673, 45807, 43540, 12377, 14892, 22962, 22753, 67648, 65137, 72907, 85248, 61426, 50382, 92917, 115418, 125728, 79410, 29778, -10610, -4884, 1808, 60272, 81201]
11212H1201K4473J6330k2350K2628q3429n4910q78k3043q247j2365m651O6593
11200A352N3538N1887M5020k5379n363M115l4668o470m283L9735j4112m1792O725
11187G0305p905J739l156q188n6607k6650J993N5359L4343J4827Q354l3236k6630
11174B4548n933q653L6404P5644K9188l5720l8133R656P693K0241m259l9545m2240
11161B8891o5472L813J6031K5988J8346o58p493m9275k5049L1610N2271j1121
11149A7882O884j7239k6415K2965L2711p698l4039o801N2421J9039k5423n7323
11137b3036l6286R565K524M7063K9816j5540k1660K545J5227L4632k7106m4184
11125b6440R302J7402O769m3250r490r767K9020L0217M3941M59k1370k3132j2259
$$ y = [81201, 105674, 122004, 99654, 122282, 38853, -16057, -16935, -39978, -48225, -60590, -65241, 1352, 54890, 106777, 151797, 126418, 121055, 125170, 90502, 84032, 79749, 119484, 105372, 63580, 70305, 62400, 64139, 60983, 52795, -3812, -30462, -28469, 26890, 61233, 76060, 84414, 51178, 24548, 18615, 9962, 46366, 122010, 151198, 115478, 77345, 87001, 94694, 114935, 110676, 71131, 28891, -36581, -32768, -16737, 9251, 27597, 26939, 19446, -29829, -54878, -23268, 29003, 17882, 24766, 7527, -18888, 4077, 36788, 29090, -4949, -11750, 40671, 59710, 34287, -23036, -59322, -49757, -47233, -170, 29646, 14106, -7554, -5009, 10218, 44850, 17744, -26440, -17138, 264, 7033, -36217, -45707, -55474, -26454, 3763, 47704, 48163, 26793, 3661, -8598]
11112h598J802L5728j1362l0289O856M6058P563k3122R476M452J1604L1103j174
11099H0097l5078m4486r772j808r69k6419R001L6208J2457J9925r967M6423L5516
11086A11128J3850m1564m2745j5252J0337J0144l0491j8534j456q453k2054r072
11074d4162N7133J4834l0485j4779K3200J6876L5598j2818k289n1026m1551Q084
11062d1385M775J3953N159Q396L8094J5117j7019M580j5945l3701q982J4336L5927
11049B3305R120R519m243j3559l581K5350k6911O872j3530r838J6592J2470o401
11036B5165n787J2875Q094K610J0436o20p481q704K4793k5j7399R445R829l969
11022E9262K6853N075N2476L0267o5894l3457j9288n636J9521k2866l6069P2931
$$ y = [-8598, -6796, 28932, 17570, -12719, -5863, 40195, 47758, 24636, 34112, 38564, 50168, 81271, 80097, 45019, 533, -9239, -11047, -12016, -38435, -29434, 6774, 19231, 39156, 29189, 75612, 111128, 124978, 83414, 40669, 25417, 35754, 45898, 15407, -3127, -4583, -13036, -35090, -44162, 12971, 27805, -2680, -17459, 5741, 22617, 58215, 45397, 43108, -7918, -49469, -41385, -36610, -22657, -17498, -9102, 28992, 44109, 27090, 31670, 15725, -17976, -26958, -12622, 23305, 32425, 41944, 37701, 24142, 20561, 45911, 19000, 25872, 12342, 2504, 19096, 31566, 25165, 19378, 32253, 40347, 42957, 53393, 52773, 45292, 36588, 61381, 61356, 43957, 53402, 63231, 59262, 86115, 91190, 143666, 173933, 108039, 74582, 55294, 49658, 69179, 46313, 10244, 83175]
11010H3175O5096j6155l2698l3487m7042k6788J6959k4898K340K4679J0742p422
10998A4501r636l0115M59m056l7687K9101J2786M6139M9579j3568o674L7777J2925
10985A01531l0124j7602j222R061K123k5260o046L1128L2828k961o086j1835j232
10972G4303K7778K3444K2214L2734J3704M5466L6219M3292J00839J42364J76223
10961G38580K11008L32557L50080K10228R5328j29929k36750l07327l11793k20370
10951G31612j71413j28629j43628r8296l0483j4269k5924l5350L1407J1978n0797
10940G6208K5127J2356j3176l3751k9762K287k8841J6274K9073j252Q395L0040
10928I2978k0156p4618O195L8660Q119l0625K3956k3926N377k643j0758l678K9880
$$ y = [83175, 148271, 132116, 99418, 65931, 18889, -7899, 9060, -15838, -13498, 11181, 21923, 14501, 4865, -25250, -24791, -28847, -66534, -37433, -24647, 21492, 71071, 57503, 50829, 88606, 101531, 71407, 53805, 52583, 61644, 63767, 38507, 32461, 63589, 96417, 93456, 87370, 75535, 74303, 102081, 125525, 147739, 180473, 194177, 239643, 275862, 319154, 419993, 562357, 738580, 949588, 1282145, 1632225, 1842453, 1937781, 1807852, 1571102, 1263775, 951982, 731612, 560199, 431570, 287942, 189646, 159163, 144894, 118970, 83620, 115027, 127005, 76208, 101335, 113691, 100515, 66764, 37002, 39289, 10448, 26722, 55795, 54543, 62938, 92978, 72822, -1796, 4399, 43059, 51178, 20553, 44509, 20583, 25960, 23317, 12559, 8881, 38761]
10915C8761N3472k3591l2009k2579L3157j1308k8461J7844K2643n645l7425R692
10903A4551K0636K3579L596J2747m543l3528J2059J9136l1857J807j125j2930
10891B4128j3525L6671k999p780M5960K9723l5585q193k898j2063K4138j4657
10879F2920p223j4622L6464L3021n4534m5441J014M1132P927k7704q861m810K4464
10866D3747J1031k9134K514j5238k4456j4713J4486N2573L0614J5296J4304L186
10854A04210k1448k2644l738j1685L1742j1858j2765K996k0474k4636k3288K9390
10842A5802j3706q75j1498K4171m592l447K0690K640L3237K3594m8203n3479K212
10829a3454O749J0289K7951J1426q563k4511K256M7577L8289j4292k9306m2846
$$ y = [38761, 92233, 68642, 36633, 14054, 47211, 35903, 7442, 25286, 47929, 42284, 4859, 14551, 35187, 58766, 62362, 75109, 70566, 37038, 49097, 68233, 36376, 38183, 37058, 24128, 10603, 47274, 44275, 36495, 82455, 112178, 76593, 68400, 65502, 53439, 77577, 62920, 55697, 41075, 77539, 110560, 56026, 10585, 11599, 52731, 60658, 32954, 24093, 19283, 43747, 54778, 25644, 28158, 12920, -11536, -26249, -11763, 40810, 71424, 86720, 101024, 104210, 82762, 60118, 56380, 44695, 76437, 64579, 51814, 54810, 34336, 9700, -13588, 15802, 2096, 1221, -10277, 13894, 9302, 5855, 26545, 29185, 62422, 86016, 37813, -15666, -13454, -6705, 3584, 31535, 42961, 34398, 9887, 12143, 59720, 98009, 83717, 54411, 11565]
10817A1565K593O060K6023k8680k4037Q887n6891j4821O531J8714M5926L2564
10805C4434j6237n6684l800N282l3093L731K1708K6705j216K4058J3321K2021
10793D0230r159J0140j9343j9418l017N236K3217M7438j7502n5059L4676L1796
10781F9235l5260j2305k2919K130N4563M0947K0334K1957o3023k0760K527k2427
10769C4999j7081l3003m6754K3271M768k186l550Q994K3222N334p699K481L8588
10756C1384M0381l284o9817L034N7826J2635r26k1079j129m3006k6331j5000L8880
10743C568Q009j034N498p298j9910n237J1712K0017j4180k7784k4094j7399L3350
10730c4782O0016L557m9058k6215N304K1414K4968n7054k5936N3063K5450J2973
$$ y = [11565, 14158, 20218, 46241, 17561, -6476, 2411, -54480, -69301, -62770, -44056, 1870, 34434, 18197, -38487, -42287, -37005, -70098, -66367, -44659, -17954, -19170, 4888, 18209, 40230, 31071, 41211, 21868, 2450, -567, 4669, 27886, 75324, 57822, 2763, 37439, 69235, 33975, 21670, -1249, 881, 55444, 96391, 116725, 138682, 75659, 54899, 57426, 34999, 17918, -15085, -61839, -38568, -33800, -35986, -39536, -30542, -7320, -1986, -9685, -7204, 31384, 71765, 68481, -1336, 1698, 59524, 72159, 71233, 50154, 49025, 6019, -20312, -35312, 3568, 11577, 10543, 16041, 8743, -11167, -16404, -4692, 15325, 1145, -26639, -50733, -68132, -34782, 25234, 28791, -20267, -46482, -41178, -19764, 5204, -51850, -77786, -24723, 727, 13700]
10718A3700l1406J8426K8147r675J3122L6930L4138N277k3971Q20n3764o8991
10706c7247p438l2271Q655M4282k4382k07L7043J9100l5151j6941j3019J6350
10694d1226L2323j0849J1440j510j1966J6356N6600K0181R47n2513m1595R350
10682a2462J7223L1929M1450n755N504k0480p7398l3619L7586m48l1253r975O3452
10669E754J1448m409j4295m3083r058J2959n890J7500N1613m843r0931l3654J4673
10656i2216L3838n615j139O40j1790J6835L8465P845J3475l0971k8963M089N1945
10643c562J5627k3879M6695M4193j6968j6127J033n18k3846k1314N9j7440k9210
10630d5257j756K2451k2209L497J3062J15K1427j4556N411J4764O697n8841K89
$$ y = [13700, -17706, 720, 28867, 19192, 32314, 69244, 103382, 108659, 84688, 85508, 31744, -37247, -44685, -76956, -68301, -24019, -48401, -48608, -11565, 7535, -27616, -44557, -57576, -41226, -8903, -19752, -8312, -9822, -21788, -5432, 51168, 71349, 72296, 19783, -21812, -12462, 4761, 36690, 78140, 72385, 77889, 57409, -19989, -53608, -16022, -16470, -47723, -57698, 5754, 17202, 12793, -1502, -44585, -53643, -40684, -46574, -29074, 22539, 17696, -73235, -106889, -92216, -58378, -63993, -65132, -64492, -76282, -59447, -20982, -13137, 338, -30633, -59596, -55507, -3562, 12065, -11814, 34881, 79074, 62106, 45979, 47012, 46494, 22648, 1334, 1393, -16047, -45257, -47013, -24562, -46771, -43274, -30212, -30097, -8670, -23226, -17815, -3051, 3646, -55195, -54906]
10617e4906L1652K5921j8042O731j8758j0961M1332k2709l5282M4434J6602l0405
10605b4391j6267r321L0876J1028j7162o716l5437M6963N732o122K2504K9902
10593C1589l7713J8850n4324j6207J880j4919l3349m7020l663M7713J9041j0839
10581i8961j5611r5O919l302M8741J3247p447K0283L7640k4980q314K5190N222
10568a468M0937N140m4636l3345q527J6979J4131k558J5343m046l2766j1454L1920
10555a4350K1596K708m1633Q297K8466n0451j5685K4359M5887J2109j4757k4731
10543a8185j0003j1258k0845J706j3440J2809K645M1822J6607k6922r699M52j365
10530c5676M6532L7426k2874m517J5939k1297m1301o1046J853K2919M5625K637
$$ y = [-54906, -23254, 2667, -15375, -8644, -27402, -38363, 2969, -19740, -55022, -10588, 6014, -24391, -40658, -49979, -19103, -8075, -25237, -31953, -67390, -20427, -14695, -20817, 1687, 31589, -6124, 12726, -41598, -57805, -55925, -70844, -104193, -151213, -154876, -107163, -88122, -98961, -114572, -114667, -107748, -111050, -62309, -49062, -56509, -36226, 1414, -23566, -31880, -6690, -1468, 39469, 44609, -27, -33372, -41899, -24920, -10789, -13347, 1996, -2050, -34816, -46270, -14350, 7246, 9954, -31679, -23382, 5084, -45367, -61052, -36693, 9194, 21303, 6546, -18185, -28188, -39446, -60291, -58585, -72025, -59216, -56571, -14749, 1858, -25064, -34763, -34311, -35676, 10856, 48282, 25408, 20891, 36830, 15533, -25768, -86814, -84961, -62042, -16417, -13780]
10518a3780r224M5870k1976R937J462K5987K4262j6340j9531j7425K1730K8894
10506E9866m982p687q757o1842l73J4940J7324K3994K022J08P759k2615J1901
10493C1658N248K1375k3056k4635p292q36J0480k7024q161K6713q211j0915j5305
10480b9961o002N997q893j3061j3327J1047M1731K8212O601n077K252n0394m0335
10467g1210J2592L0733L0436j7658l5612p404N9008L3824P92k4342n9312J0438
10455c7715j1131m447O063N677K6103k418j0821l0881j1697l1186R715N7964O6866
10442C2092R964j1574j6685k3950l3680k5343k0575j2086r274J1469J4796K6315
10430e8531M6895p73J3653K83K4260Q329j8910N596J736L719l037j4443l8113
$$ y = [-13780, -23004, 22866, 890, 10827, 12289, 38276, 62538, 46198, 26667, 9242, 30972, 59866, 54884, 47197, 38440, -23402, -23775, -8835, 8489, 32483, 34505, 34613, 42372, 19757, 31658, 36906, 58281, 35225, 10590, 3298, 2462, 12942, -14082, -22243, 4470, -3741, -14656, -29961, -35963, -29966, -38859, -51920, -65247, -54200, -12469, 15743, 22344, 17267, 19519, -30875, -71210, -58618, -27885, 2551, -15107, -50719, -58123, 885, 34709, 35501, 11159, -48153, -37715, -48846, -53293, -47230, -41553, -15450, -17868, -28689, -59570, -71267, -102453, -92738, -34774, 32092, 42056, 30482, 13797, -10153, -43833, -69176, -89751, -101837, -111111, -99642, -84846, -58531, -11636, -12409, 1244, 1527, 25787, 34116, 15206, 20802, 22538, 26257, 23220, 8777, -29336]
10417b9336j8113J9331N8179j375k2102k672q185L7822k1658N217K2711j1840
10405B7979k3334P834L1707k9430J1321q369q36p197j9900Q367K9504k067j2659
10392A2920k3191J2202j919l4259l5768K0749L3354j0435j6720L5066K5574n461
10380A2112J2795q624k2420L5225Q581j7609j4642k8714J6343M7832K3759l4711
10368B9927j3663j7105J5518j5573l4032l1338l9446N7209P9597p758k5149J3206
10356A1393N219K1945L9071J4400l8692l6357k9912r437j2499K3534M58j3731
10344b4608l9453N481J8818Q319r435j2148P305J1327l1796K5818L5950K8437
10332B4015j1328m414K260L4097L0128j3394n9966j6012j1892R534J239K7488
$$ y = [-29336, -47449, -28118, 30061, 28686, 6584, 3912, -4273, 33549, 11891, 17108, 39819, 27979, 4645, 12479, 44186, 14756, 26077, 17708, 16872, 9675, -10225, -1858, 27646, 25579, 12920, -10271, 1931, 12, -34247, -70015, -49266, -15912, -26347, -43067, -8001, 17573, 12112, 24907, 16283, -6137, 29088, 37669, 20060, 5418, -23296, -6953, 40879, 64638, 29927, 16264, -841, 14677, -896, -34928, -66266, -105712, -48503, 31094, 23336, -1813, 11393, 16612, 38557, 77628, 92028, 53336, 16979, -12933, -22370, -34869, -11335, -10877, -24608, -64061, -58580, -39762, -31443, -40878, -53026, -45721, -34394, -66190, -40372, -4422, 24015, 12687, 8273, 10533, 44630, 74758, 61364, 1398, -14614, -26506, -16972, -15733, 11755]
10320A1755J5993Q185l2324j8328j2974J5103K2240J7128Q120l0412M1261K9022
10308G4769k4541n081l0455R278M140k701k8287J4502J3483K3940M4719o664L9885
10295A26987l0544m4111n3097l7951K1995n643K3985M144J8474P133j0230k2197
10283a055j869J7176J7703j1217m762j9333k0927k1681P515O103J1483j1881l9877
10270g2622j6634J5467L4913J2848K0116M1870n306l9823n7629K4079L3781j0844
10258a9784k4495k7720J5221M0868J2742k6497L0380K3417J7664j5419k502K8527
10246E2402o149k4591o50L7126q382k1610m330k6036O488L0998K828k2604p357
10233H133j6630m609K0248J1180k243p926J6101N2748J585m0395j9544l6033l6264
$$ y = [11755, 27748, 35933, 3609, -14719, -27693, -12590, 9650, 26778, 34898, 4486, 45747, 74769, 50228, 45147, 14692, 23970, 28110, 25409, -2878, 11624, 25107, 49047, 93766, 87102, 126987, 96443, 52332, -765, -38716, -16721, -22364, 1621, 5765, 24239, 31372, 21142, -1055, -2924, 14252, 31955, 20738, 15976, -3357, -24284, -45965, -38450, -32347, -20864, -32745, -72622, -89256, -73789, -38876, -26028, -5912, 35958, 30652, -9171, -66800, -42721, -8940, -19784, -44279, -71999, -56778, -15910, -3168, -29665, 715, 24132, 41796, 26377, 23875, 52402, 46253, 21662, 21012, 58138, 49756, 28146, 23816, -2220, 4268, 35266, 38094, 15490, 8133, -8497, -13106, 7142, 18322, 16079, 8153, 24254, 77002, 78587, 38192, 18648, -17385, -53649]
10220e3649L3170K7231L4139q475n1878O505N121j6372j2978J5741K7925J1150
10208A7630l229N3999P0918N7561O319l2911o210L3201J21o7198k4626K6174M4490
10195A76239k847p5433o6402m3770K1290n8210j065L0781p482K3102Q60k9400
10183c2337O513M700j1577m616j29j8849l9227P613M9237R855J6359p431N8647
10170C8758J0363j3166q670m2540l4588k042J5020p142O1602K5172o134J4494
10158E1127Q363k8070J9926m0417Q129K1176L3884m006n6586k2755K6670J9703
10146C7144O131L2346L1296k7982l8924j2175n373R104K3610L5424l1452o2298
10134c149p0725j565N9114R413j4743k1434L4584L7821J3006j5284L1799L5927
$$ y = [-53649, -20479, 6752, 40891, 32416, -19462, -12957, -7836, -24208, -37186, -21445, 6480, 17630, 14401, 68400, 139318, 196879, 203198, 170287, 164077, 197278, 197399, 130201, 105575, 131749, 176239, 173392, 97959, 31557, -12213, 9077, -49133, -50198, -19417, -26899, -3797, -2937, -32337, -25824, -21124, -32701, -37317, -37446, -56295, -95522, -87909, -38672, -28817, -12458, -19889, 38758, 49121, 35955, 27285, -15255, -49843, -51885, -36865, -44007, 17595, 42767, 36633, 51127, 59490, 31420, 51346, 10929, 19058, 40234, 74118, 70112, 13526, -9229, 17441, 37144, 43275, 75621, 106917, 78935, 40011, 27836, 22463, 31567, 55177, 90601, 59149, -3149, -73874, -75439, -16325, -6912, -21655, -43089, -8505, 29316, 42322, 27038, 58837, 94764]
10122I4764K553m0298o6749k6423p796q247J6812O526m618K768K3432N5101k6542
10109B1283j9946m1918j1818P625J3979M1115K2086r272k7728Q736l238k7537
10097b6633J6099Q420o362l7607l0846K9261j3625K019K6601j7529J6510K3892
10085i800J5533m138l1674K0481J5487r520N019j1864n617p342L0541K206l0631
10072b1319N574N313k8850j6106J4464J7869O442j8841l0648j1128J8506M5226
10060a3498K4334j9080m7511J8994L8087J2158k103j7095n6880p89L3830K6678
10048b875l2557j7842K0361j3380K8941J64k7143j5120l7494p962M196L0623M094
10035f5994P317K6260K3724K3277J1865n2091j6561L8014J0834K056j3436M1066
$$ y = [94764, 97317, 57019, -9730, -36153, -43949, -52196, -35384, -28858, -33476, -30708, -7276, 47825, 21283, 1337, -40581, -52399, -44774, -30795, 10320, 32406, 23134, -4594, 4142, 904, -26633, -10534, -2114, -8476, -46083, -76929, -47668, -61293, -59274, -32673, -50202, -33692, -9800, 5733, 1595, -30079, -9598, 5889, -3631, 1388, -10476, -16093, -23435, 7106, 9312, -21319, -15745, -10432, -39282, -55388, -40924, -23055, -16613, -35454, -66102, -77230, -58724, -13498, 10836, -8244, -55755, -36761, 1326, 13484, 11381, -5714, -62594, -63383, -29553, -2875, -35432, -53274, -32913, -46293, -17352, -17188, -44331, -59451, -96945, -104907, -100711, -70088, -65994, -58677, -32417, -8693, 14584, 26449, -25642, -42203, -4189, 6645, 8701, -4735, 36331]
10023C6331N151J0874j6168j4478p192k6013k7846K715O454J2845N316k8857N155
10010c5713J9080k5920M5648K1858N608k0700j7294l6540k2197L6432L0216R916
9998A0394J1268Q658k7843K4650N327k253j8187n356J009k8008J1484r382j3405
9985c1644q119J5155J4400L8021J3478j6337l1838l845k5363k584K0401L1069
9973A2794R861m3416Q725k5652L9572m351j6856M4202l0155o3550J5363J6284
9961c7179M2993M2310j7094J691J5324j9713L866k1661k4852p026j2918k694q215
9948d5168L232Q7736L355J7209K304Q79k6068k3139l7283J5522K5445J0962O320
9935D1306m849j3036j5016k1869p206o1817p776K1487M6058L7529k1736l495M7134
$$ y = [36331, 41482, 52356, 36188, 21710, 14518, -11495, -39341, -36626, -30172, -17327, -12011, -40868, -35713, -16633, -42553, 3095, 24953, 30561, 9861, -7433, -43973, -66170, -29738, 478, 10394, 21662, 30320, 2477, 27127, 32454, 30201, 12014, 6658, 7667, -20341, -8857, -18239, -31644, -39763, -24608, -10208, 27813, 41291, 24954, -6884, -10729, -36092, -38676, -18275, 12794, 22655, -20761, -12036, -37688, 1884, -2467, -19323, 24879, -5276, -68826, -53463, -37179, 5814, 48124, 31030, 32721, 48045, 28332, 32198, 10537, -14315, -21341, -34259, -36953, -45168, -41936, 45800, 49155, 66364, 68668, 69547, 43479, 20340, -16943, -1421, 24024, 34986, 41306, 36457, 23421, 8405, -13464, -20670, -82487, -90263, -68776, -22718, 14811, -6925, -10420, 36714]
9922C6714L1444Q051J4446N453m1511n3562k1142o612K8150M9440j0118m3982
9910c229l5785l100j2249r932K2471K4858J5446N4937k597K2928R684n9019l2034
9897g621L5879L119M616k287N7208J7355Q450k0762l4404n2924j4517l293N6412
9884D7231j0433l5183k475j0977k9653N648j1150M14m389J8242J8411j1916J1919
9871a4311n335j4749K9266k8563l9028J2479R238J0639P669K3000o364J8604J2857
9858A5402l7563j1193J4344K3106L7620l9329J350N7620M5192n0751q4883l0473
9846e9558l041O259J5169J1506k636j228m880J1822r84k0743P452k8555R702K9290
9832c0425J6041k361J0323J6953j264n416q530k9582n8663l3362p067J5064k0851
$$ y = [36714, 68158, 76209, 90655, 96108, 54597, 1035, -20107, -26719, 1431, 50871, 40753, -3229, -39014, -42114, -54363, -64295, -41824, -16966, -1520, 53417, 50820, 73748, 83432, 24413, -7621, 28258, 31377, 35993, 33706, 90914, 108269, 116719, 95957, 61553, 8629, -5888, -9181, 47231, 36798, 1615, -860, -11837, -41490, -35842, -46992, -46578, -50967, -32725, -14314, -26230, -14311, -19646, -34395, -5129, -33692, -72720, -60241, -51003, -40364, -32695, -9695, -16059, 2545, 15402, -22161, -33354, -19010, 4096, 41716, 2387, 3737, 61357, 106549, 55798, -29085, -59558, -62599, -56340, -41171, -29665, -32301, -33529, -38409, -26587, -27571, -48314, -40862, -69417, -59715, -30425, -14384, -16745, -6422, 10531, 9267, 3851, -4679, -34261, -92924, -126286, -133353, -118289, -139140]
9819a39140J2400L8171O7907L8198j7429J498r652J094J2501j0193p441o3454
9807g5540l5813J4468J9273J9405M2046L8955J2569k055J3399P447J3100o150
9795F1104k5023k0383m7067L2297L7037k9635k8919J111k9438J3371L7009J3414
9783A4878q682m7031n0364p082N4334L4445J7037J9205r230O100j2057R07L0815
9770D3275L3226k8310m9410n5535M924N3244K5738J0234o203R340m103P420k9022
9757A4818r3758j1922O7356N1007P264k7783n331l696P855O752J9154n1922j1250
9744c1456k6523m281R17O6069K9744o437J0218j8161J6161q887K2357K5076k8316
9731D6481m0166k4240O25K2134n858m6180j3080K4322R735J5258K8181Q289L7746
$$ y = [-139140, -126740, -88569, -20662, 17536, 107, 1605, -8047, -6953, 5548, -4645, -12086, -75540, -111353, -96885, -77612, -58207, -16161, 22794, 35363, 33308, 46707, 54154, 67254, 61104, 36081, 15698, -31369, 928, 37965, 8330, -20589, -19478, -48916, -35545, 1464, 14878, 6196, -40835, -91199, -98281, -43947, -9502, 7535, 26740, 17510, 23610, 11553, 12460, 43275, 76501, 48191, -1219, -56754, -51830, 1414, 27152, 37386, 31183, 40523, 36420, 43840, 14818, -78940, -90862, -23506, 27501, 34765, 6982, 1651, -2045, 5810, 12562, 31716, -20206, -31456, -57979, -62260, -61343, 4726, 34470, 28033, 38251, 20090, 36251, 27364, 49721, 74797, 46481, 6315, -17925, -17300, 4834, -1024, -47204, -60284, -35962, -26227, -10969, 17212, 25501, 63247]
9718F3247k6173r23M4046l798j5692j9708k9883p3137Q205M1679L4729o951l7295
9705b1654j4817j2308L434P620O754j4626j1029p812L6821K6759r686k3003L2945
9692f02L9714l4247k1305j4298k3010K4044j2348k805O4193M5028k8083j9618
9680A6663j3367l226l2913j558k3034k4694K5183L7331k5575q022o169J4072j8397
9667f3706L4742K0175J1086o033j2272L4857k0706M7577j3876j8742J4621k1853
9655E870j7680J4944M1386n736o397Q166J0270m5329J5294K6810k585N024m6111
9642C926q380J5373J6399J4147J155m8054l5538Q285j5714M3685M9831K4367j3984
9629E5498k8077k5402M897J0341k9313j7144j2096m321J0713M8008j3724l1416
$$ y = [63247, 37074, 36151, 80197, 76399, 60707, 40999, 11116, -62021, -53816, -12137, 22592, 15641, -21654, -36471, -48779, -45345, -37725, -30971, -45597, -56626, -64438, -27617, -858, -10544, -33547, -602, 39112, 4865, -16440, -30738, -53748, -29704, -42052, -44857, 19336, 64364, 36281, 16663, 3296, 70, -32843, -34401, -57435, -82129, -56946, -19615, -45190, -53212, -59381, -45309, -63706, -28964, -8789, 2297, -3736, -16008, 18849, -1857, 45720, 31844, 13102, 27723, 5870, -11810, 3134, 44520, 38784, 32387, 40553, 50823, 5494, 20788, 47598, 45013, 50037, 3926, -4454, 10919, 27318, 41465, 42620, -5434, -40972, -32687, -48401, -4716, 45115, 69482, 55498, 27421, 2019, 6916, 17257, -12056, -29200, -41296, -45617, -34904, 13104, -620, -32036]
9617c2036Q299M6768j5800m0564j2207J7498J8083J898l5518J414L1156M7422
9605C6413l0046k131K1950j088O9450P147m0997k6549J1119j6627l5210j3087
9593a9656O443M836l2024j9483J979L0162J1087m2286R841J6637L6960K2048q547
9580A7997P469k5440k609k2691q177m107j6582M85L4124j411N450j5673l8005
9567f9170K4626M5864n364k3694R129j5943j811J084j9448j6498K2299R786L0831
9554h309L7277k2241j8861R063j6714l4564l426J4066J3298L4123L9201K0239
9542F3152l6493k4532j2117n8547Q056M8812M4237q679k2564j8076q13j707k2180
9529d1451O485K3680k9959M3026j4666N50J3505K8239J7947p664m4601k0596J1598
$$ y = [-32036, -23737, 23031, 7231, -33333, -45540, -28042, -9959, -8061, -43579, -42165, -11009, 36413, 6367, 4236, 26186, 25098, 94548, 101695, 60698, 34149, 45268, 28641, -6569, -19656, -13213, -8377, -40401, -59884, -57905, -27743, -16656, -58942, -49101, -32464, 4496, 26544, 17997, 25466, 26, -2583, -25274, -33451, -37558, -54140, -53655, -19531, -20942, -15492, -31165, -69170, -44544, 1320, -4044, -27738, -18609, -34552, -36363, -35279, -54727, -71225, -48926, -39140, -8309, 28968, 6727, -12134, -3071, -19785, -54349, -57775, -43709, -30411, 3712, 42913, 63152, 26659, 2127, -9990, -68537, -60481, -11669, 32568, 23889, 1325, -16751, -17564, -19271, -41451, -34966, -11286, -41245, 1781, -12885, -12335, 1170, 29409, 47356, 39692, -4909, -25505, -13907]
9516a3907J2762l5332k9068L1986K1053k5907l5984L1817R774L658j6291j4854
9504f0293J2904K6482K438J8194j0298Q809L236L0882Q25l5361o238K9449P522
9491B8551l292j3544l3210l3849J7162J6670K5109K1171L079o0588q421M4355
9479C193K6350j6144l485j0125j0712p409l3998J3164L4221J0936k0257J874K5632
9466A3240l4104J9141L9487J5636J3260M2480n8919l9692R3p027m9451L8066K8297
9453B0507l575k7329k570q688N1778q001j8374j109n126j9564J6250j0688R515
9440f974K9450O480k7687k5770o61N0063J7878j6192j2939K3853J3480O455K713
9427F0149J71J3185j2595Q788L4117k2627l6912m0550K2321k713l2728l0131q179
$$ y = [-13907, -1145, -36477, -65545, -33559, -12506, -38413, -74397, -42580, -32806, -29148, -45439, -60293, -47389, -20907, -18469, -275, -10573, -1764, 1472, 32354, 33179, -2182, -8420, 21029, 28551, 25259, 11715, -21495, -55344, -38182, -21512, 3597, 24768, 27847, -32741, -41162, 3193, 29543, 13399, 9914, -211, -10923, -18332, -52330, -39166, -4945, 5991, -14266, -12392, 13240, -20864, -1723, 37764, 53400, 66660, 109140, 50221, 10529, 10622, 3595, -45856, -7790, 20507, 16932, -10397, -12967, -21655, 30123, 22122, 3748, 2639, -2487, -22051, -5801, -16489, -6974, 22476, 28956, 1269, -24501, -25162, 24901, 42779, 26587, 13648, 37501, 50981, 57436, 60149, 60320, 73505, 60910, 69698, 103815, 81188, 44276, 3726, 26047, 23334, -9394, -39525, -47704]
9414d7704K0612j8212j1464P142K6347K4362L2723L193N803L8308j0175m1096
9402B9839J7850j1748l0493j6038j6624M7463j947q85j0405n429J146l3536K2653
9389h154K1786r902O255J3734K7507j8124K608N468l1702L3222J1l0237K27m4257
9375c1558k6844L075M0078M6522o357P372j5991L165m3904j0491Q063j6681K1028
9362b2523j0137R056J1120O10J726o754k7017j9238J1285L2555m235J2738M0694
9349B9880K2836j0904J4008j7497J0272l0966j3026J7021O820k6852k4655L2132
9337I069N4854n841l5865j2891L489j1074K3924M6729J3302o2696P623k6929j8092
9324a4398k2245k0005J2494O3161L3918j0179j8173r152j6640l5126p806m068
$$ y = [-47704, -27092, -45304, -56768, -49626, -23279, 1083, 33806, 36999, 42802, 81110, 70935, 29839, 47689, 35941, 5448, -10590, -27214, 20249, 18302, 17417, 7012, 1583, 2729, -30807, -8154, 13632, 3730, 9985, 23719, 51226, 33102, 35710, 41178, 9476, 42698, 42709, 12472, 12699, -31558, -58402, -55327, -15249, 31273, 24916, 32288, 16297, 19462, -24442, -34933, -26870, -43551, -22523, -32660, -23604, -12484, -11874, -10148, -16902, -43919, -63157, -51872, -19317, -23552, -10814, 29880, 52716, 41812, 55820, 38323, 48595, 17629, 4603, 21624, 28444, 1592, -23063, 9069, 63923, 58082, 22217, 9326, 12815, 1741, 25665, 72394, 85696, 23000, 30623, 3694, -14398, -36643, -56648, -44154, 19007, 52925, 42746, 24573, 15421, -1219, -36345, -44151, -48219]
9312d8219n84l2718M8662N1518l987K5009k5741p594N110J217j4265J9540q328
9299I620Q610R273J5870K8556L7414L0811n7607l8596M2094k9449J3599J2561
9287H2756j1404p82l4931j5584L9894L1571M384n560k4253r696J581R989j8983
9274D8982P812k0157R313J0022N885j1080k0147m6485J3422J8540J6376M780Q04
9261C8067K399K543J0098O304j3725m4999J1789N6810J4304m1124J156J0377P755
9248F1754L6137k0600k5743k056p112K1003r248n186j946l3212r711O2088N274
9235G1442l3238k3846J1309K8178j5894L0804M6545Q910k3192m58J9207k9294
9223I0473k7552J0587K2905L656k9851k4172J3856O3126M083o133K2182K4760
$$ y = [-48219, -48803, -81521, -32859, 18659, 14672, 39681, 13940, 6346, 11456, 12673, -1592, 17948, 9620, 18230, 27503, 43373, 71929, 109343, 140154, 82547, 43951, 86045, 56596, 70195, 82756, 71352, 70570, 35639, 20055, 59949, 91520, 95904, 90344, 66091, 56395, 57976, 67965, 48982, 56794, 36637, 45950, 55972, 61857, 50777, 30630, -15855, -2433, 16107, 32483, 37263, 38067, 40466, 43009, 53107, 59411, 45686, 687, 12476, 69286, 83590, 42466, 43622, 53999, 61754, 97891, 77291, 51548, 49492, 42380, 63383, 54135, 48949, 47003, 13791, 4080, 66168, 71442, 38204, 14358, 25667, 53845, 37951, 68755, 115300, 124210, 101018, 100560, 119767, 90473, 62921, 73508, 96413, 100069, 70218, 46046, 59902, 123028, 127111, 120978, 143160, 167920]
9211A67920J3816O482j4675j3213r794j3267j944O962K0572L3493P804n401K781
9198B01536L1579k864L164L3577K6951J7229L8514l172L6378O3763M9926O7313
9186E63894L3652K7893N7451N3089N4032L2409J02085R6214M9056O1766J05471
9175A237012J80360K23913J54638J77159K60229K53655L35635L88447M08941N30674
9165D150663N96622P38482R76561J168226J502202J983927K582747L355124M474882
9156B1529436N770513O023527L880671k03230l492232m892720n054802m579909
9148A8981254l938006l155561k444073j905485j432281j134776r15808p09741
9140C345523n31847m17205l17135k62570j61452j30420j88535j79888j46553j34115
$$ y = [167920, 181736, 188218, 173543, 160330, 150536, 137269, 135325, 142287, 162859, 196352, 204156, 198755, 201536, 233115, 230251, 233415, 266992, 293943, 311172, 349686, 346514, 382892, 446655, 496581, 563894, 597546, 625439, 682890, 735979, 790011, 822420, 924505, 1020719, 1069775, 1131541, 1237012, 1417372, 1641285, 1795923, 1973082, 2233311, 2486966, 2822601, 3211048, 3619989, 4150663, 4747285, 5485767, 6462328, 7630554, 9132756, 11116683, 13699430, 17054554, 21529436, 27299949, 33323476, 37204147, 37000917, 33508685, 28615965, 23561163, 18981254, 15043248, 11887687, 9443614, 7538129, 6105848, 4971072, 4055264, 3345523, 2813676, 2396471, 2079336, 1816766, 1655314, 1524894, 1336359, 1156471, 1009918, 875803]
9130H75803j00813n8301J031j1840J0464k9608o4606m6422j9510k8211o9096n7793
9118D01098l3496k4814J0448j1160k3499j295k0251n3244n1450J8390K9521K9090
9106B69338Q064m7709k0292L009l8103l1917L665K1866N080k0504l3033R746k33
9093A28977l5589l1941J7689j4423K9665K370j94J8643J2591K3614J0246p1555
9081I0093k9980N378K1229p104l1751q947J8355L8605J9038M375j8072q525l7253
9068E5441K1622K1589m1656k1005k6k9576J9611M4510J100K8887J4915l2673n0552
9055C2187K0375K3840j1796L596j5318l7463l769k9032r864J8785J6725L1494
9043C9760k929k568j2329k0149M043J1852J1698j9242J3087P4915J7696n6418
$$ y = [875803, 774990, 716689, 717720, 705880, 716344, 686736, 622130, 575708, 556198, 527987, 458891, 401098, 367602, 342788, 353236, 342076, 318577, 317282, 297031, 243787, 192337, 210727, 240248, 269338, 277402, 229693, 209401, 212410, 174307, 142390, 146055, 167921, 173001, 152497, 119464, 129210, 128977, 93388, 61447, 79136, 64713, 94378, 96748, 96554, 115197, 127788, 151402, 161648, 90093, 60113, 65491, 86720, 79616, 47865, 38918, 57273, 95878, 114916, 119291, 101219, 92694, 55441, 77063, 98652, 56996, 35991, 35965, 6389, 26000, 70510, 71610, 100497, 115412, 82739, 32187, 52562, 76402, 64606, 68202, 52884, 15421, 11652, -17380, -27244, -8459, 8266, 39760, 36831, 34263, 21934, 1785, 5828, 17680, 29378, 10136, 23223, 98138, 115834, 59416]
9031E9416k2974q016J4149L7901j810K6576K6755j3770o9086k3522L9367J36j6262
9018D8860j4712K1725L4245j957Q848p1155p5566K8163N2625J514j7838L4762
9006D9514K1932o2069l2958j8111L5832k3983q870J2910j701k5692p636J7443
8994d3389R0924o81M488L3745m8468n6626j9356P1945N1024K3534l3389l1188
8982D2563k7279j8701K0600J4384r932k6399K5811J9781q854J4765K4592N366
8970G6697j5707k4665L0651J9682n5095n3343j9605L8103j04k6645m841O1434
8958B6562O3735K732j0083m4589n3279m6690K1307P7599L6360l074l6502k3636
8946A0442L2801J2505k8329k7972J053r337l4045K1372K9234r230n24Q257Q136
$$ y = [59416, 36442, 28426, 42575, 80476, 78666, 105242, 131997, 118227, 49141, 25619, 64986, 65122, 48860, 34148, 55873, 90118, 88161, 97009, 25854, -49712, -21549, 31076, 32590, 14752, 49514, 71446, 9377, -23581, -41692, -5860, -29843, -38713, -25803, -27504, -53196, -60832, -43389, 47535, 46854, 51342, 85087, 36619, -20007, -39363, 32582, 83606, 107140, 73751, 42563, 15284, -3417, 17183, 31567, 21635, -4764, 21047, 40828, 31974, 46739, 71331, 76697, 60990, 36325, 66976, 86658, 31563, -21780, -41385, -3282, -3386, -30031, -34872, 26562, 90297, 93029, 82946, 38357, -14922, -61612, -40305, 37294, 73654, 70580, 34078, 10442, 43243, 55748, 27419, -553, 500, -8837, -42882, -21510, 7724, -1506, -2030, 6227, 14363]
8933A4363M2k4673m500N5147L5145j9758j4709q39k7839L6775R357p210l0038
8920B1263k080J7991j9964L0389K3332k8627j9401j0431J4311m012J6182k8280
8908A0673k4845N537N4386j4200J347J5603K9903j6190k4648J8705p407k7522
8896B1342j534N836L5895K0885L3395J3382k3638Q789K6139L0358O969j1432L251
8883A69637O403K0897O9453M0381Q3502P4611J27965J79936K77750L88426K83110
8872A722071k1661k10942k84026k63200j86929j68894j40209q9862n1851m4132
8862B60365K34n4335o3790n2924n1845j8554M0423J034m3137j8386P507M3460
8850E0052J9338l6802l6114l5818p373L1785k2761r32P0403J7285k8128k2080
$$ y = [14363, 14405, -10268, -14768, 40379, 75524, 55766, 41057, 40218, 12379, 49154, 58511, 51301, 21263, 19183, 37174, 17210, 47599, 70931, 42304, 22903, 12472, 26783, 22771, 38953, 10673, -14172, -8635, 45751, 31551, 32898, 48501, 78404, 62214, 37566, 56271, 48864, 21342, 19808, 25644, 61539, 82424, 115819, 129201, 105563, 114352, 140491, 170849, 177818, 166386, 169637, 176040, 196937, 266390, 306771, 390273, 464884, 592849, 772785, 1050535, 1438961, 1722071, 1700410, 1489468, 1205442, 942242, 755313, 586419, 446210, 356348, 304497, 260365, 260599, 206264, 142474, 89550, 37705, 19151, 59574, 60608, 17471, -915, 6592, 50052, 69390, 32588, -3526, -39344, -46717, -14932, -37693, -38625, 31778, 49063, 20935, -1145]
8838a145j8960K9574K3650k0867L132O795L4219k8758k9321J3262j1061K0140
8826B0660L0269m816J6585l7359m0236J1098K8457L0512K6317m898n1149k1523
8814C917j6439P007K0175J366k1641l0267k62k5569j5003j4642M8491M5231J4954
8801A7318j1697j9239m989r860j6583P410M1437K5123n9306j6611j9663J6786
8789d9874K4866P692K6432k5968j8455L0098j2283J1054L3489L3394k8268k0691
8777A1486m3918Q341m0403j2868J7009P097O804J5764N511J5909L9316K2146k5230
8764B6964j3845R072P396J4493J7824p821m3375J1821O4785M4106P7103L1955
8752B40478k2246j9165n3594o659m045J4428k3283r646k1482j4018k5997k749
$$ y = [-1145, -20105, 9469, 33119, 12252, 15384, 22179, 56398, 27640, -1681, 11581, 520, 20660, 50929, 46113, 62698, 25339, -14897, -3799, 24658, 55170, 81487, 76589, 25440, 3917, -12522, -5515, 14660, 16026, -5615, -35882, -36144, -61713, -76716, -91358, -42867, 2364, 17318, 5621, -13618, -18607, -28467, -45050, -37640, 3797, 28920, -30386, -46997, -66660, -49874, -25008, -17316, 9116, -16852, -35307, -5209, -17492, -6438, 27051, 60445, 32177, 11486, -32432, -24091, -64494, -77362, -60353, -53256, -46452, -30688, -25177, -9268, 30048, 52194, 26964, 13119, 22191, 29587, 44080, 61904, 54083, 10708, 22529, 87314, 131420, 208523, 240478, 218232, 199067, 145473, 138814, 134769, 149197, 125914, 116268, 94786, 80768, 54771, 52022]
8740E2022M015k2602l1486j8109R378K38M8659o786m0615j2268L3010K4852j750
8727C8558Q171q161R767j4638l505R178J9961O751j8340l765k5112j4841j4243
8714a0219j4667J8673M1220j5087j3118j394J8254J4073m7331m6664L4470L7368
8702A5578k7683j6848M1730L3940j8041m0082n803P709J6710p690j1257j0104
8690b1841p66K465n82K6010q834m7307k500J6734P200L3804j2555k8511J9626
8677a7057J6296j9489m1878k5993k908M2541j0574K3766K8744J7412m4502k4195
8665e7837j4307j3638N3689K6738j3967M382K9035K528Q378J298k1401j684K3380
8652B6594o013L8245M53l4383J7590J1872n37j4193r777l387O021r953q469Q618
$$ y = [52022, 56037, 33435, 1949, -16160, -6782, -6544, 42115, 35329, -5286, -17554, 15456, 40308, 38558, 46729, 38568, 48335, 33697, 30192, 39370, 59331, 66082, 47742, 43977, 18865, 4024, -10219, -24886, -6213, 35007, 19920, 6802, 5408, 23662, 37735, -9596, -56260, -21790, 15578, -12105, -28953, 12777, 46717, 28676, -11406, -17209, -9500, 7210, -480, -11737, -21841, -22607, -20142, -20724, 5286, -3548, -50855, -53355, -36621, -29421, 4383, -8172, -36683, -17057, -761, -20250, -62128, -88121, -91029, -48488, -59062, -35296, -6552, 10860, -33642, -57837, -72144, -85782, -32093, -5355, -19322, -14940, 14095, 16623, 25001, 26299, 4898, 3214, 26594, 20581, 58826, 59279, 24896, 42486, 54358, 53821, 39628, 29851, 26464, 32485, 22532, 14063, 22681]
8638B2681k8748k3907N2807J7631k4356k476L0404Q1031L4365P271n9412k2768
8626H4523k3703p396k650J6589M1501N8753p886j4627j1038j6436j2850q157K705
8613I9328j8549l8822R457Q581j913n461K4605J3482L498K6843l3447p281J4428
8600I4749J6155O115K426J7748J1540k3068m6404q383K0205J9325K6389m705l2504
8587I9588q129O381k7713l524N8674J4102l662p912L2080N4026L6381R084J3021
8574B72397j3929l7837m7731l4792j649k1967K152K120M1648j345Q653r68l6496
8561A30256m0069j2691l8978j6225O1771j1730m2157M387m2838j7558L0071M4024
8549D8263J532l1623k5517L1328J0761K984P245K5134L5014J2718j3835j2365
$$ y = [22681, -6067, -29974, 22833, 40464, 16108, 13632, 44036, 125067, 159432, 166703, 107291, 84523, 60820, 53424, 50774, 67363, 108864, 167617, 159731, 145104, 134066, 117630, 104780, 96623, 99328, 80779, 41957, 51414, 59995, 58082, 52621, 77226, 90708, 94206, 121049, 87602, 80321, 94749, 110904, 117019, 119445, 137193, 148733, 125665, 79261, 70878, 91083, 110408, 136797, 132092, 99588, 91459, 97840, 70127, 66603, 125277, 139379, 135717, 127805, 159885, 213911, 250292, 259376, 272397, 258468, 220631, 172900, 138108, 136459, 114492, 116644, 118764, 160412, 159067, 167720, 166752, 130256, 90187, 77496, 38518, 22293, 84064, 72334, 30177, 34564, -8274, -25832, 4239, 48263, 49795, 18172, -7345, 23983, 34744, 37728, 44973, 70107, 105121, 117839, 104004, 91639]
8537I1639j4567j865J482K1228J4046J7061m1318o600M5447J7433l6984k6553
8525H0449q478j0131L1212J02021O3347k9063l0034L1086l964j6526o761k2981
8513A80177n3361n0048k2039j2135n956j8881k6568M7988L8963k4504j328K9633
8501H1941R464k7660M613l3720m9364K1056M7366L0445j8771n1526q283J7325
8489B2886k0380k8161J8920K9092M7996M3728K759l5656n273k7031O804O296M0901
8476A02881J5994l25O881k2826Q503Q733m9597k0385O895N770O65j2101k8982
8463B2106l4381K2420r617l9494J4784M8673Q420J6254J8055j6220n5657n2048
8451e6705K153J7267K0578J271P852K4858N9167J4876k6951m6479k5908M36J7826
$$ y = [91639, 77072, 75207, 76689, 97917, 111963, 129024, 87706, 81106, 126553, 143986, 107002, 80449, 71971, 61840, 93052, 195073, 258420, 229357, 199323, 230409, 226445, 209919, 203158, 180177, 126816, 76768, 54729, 42594, 36638, 17757, -8811, 39177, 78140, 53636, 52308, 81941, 91405, 63745, 68358, 34638, -14726, 6330, 53696, 84141, 65370, 13844, 5561, 22886, 2506, -25655, -6735, 22357, 70353, 114081, 116840, 81184, 75911, 48880, 55684, 61980, 102881, 118875, 118550, 125431, 102605, 111108, 119841, 70244, 49859, 56754, 62524, 63189, 51088, 22106, -12275, 10145, 528, -38966, -24182, 24491, 32911, 49165, 67220, 51000, -4657, -56705, -54552, -37285, -16707, -15436, -7584, 17274, 76441, 91317, 64366, 17887, -8021, -7585, 10241]
8438A0241j4004j5093L372J7119L0768J0683l248k0605j0464j8979J8707L1131
8426C9628k1230o4185j9483J2593K5340L2899L3084K0376l1820k1491K0525J2530
8414C8766l2155L3083J102j3938k1008O22q136J6718J0898k9007L2397j3544m0739
8401b4941J5840P891J7681k8178k7579j5301K4791L2131K4485J7860l2695o2263
8389e0278k2620K2061K1813J7920J745m30n517j9778J5518l4875j0959L0516O4929
8376C0045R223j1585J3135l6011l1049M2247K97o4864J3561M6249J9695O579l3041
8363D481k3937L4854k4191k6068L2354N9037N767m0903l3659O86m3664l1394j538
8350h8175k978L5571K2325J973M116L3587K4034l3806j2245K3678J8052K5635
$$ y = [10241, -3763, -18856, -15484, 1635, 32403, 43086, 39838, 19233, 8769, -10210, 8497, 39628, 18398, -45787, -65270, -52677, -27337, 5562, 38646, 59022, 27202, 5711, 26236, 38766, 6611, 39694, 40796, 26858, 5850, 6472, -1664, 15054, 25952, -3055, 29342, 15798, -24941, -9101, -1210, 16471, -11707, -39286, -54587, -29796, 2335, 26820, 44680, 11985, -50278, -72898, -50837, -29024, -11104, -9359, -9789, -15306, -35084, -19566, -54441, -65400, -34884, 30045, 39268, 27683, 40818, 4807, -26242, 16005, 16302, -48562, -35001, 11248, 30943, 37522, 4481, -19456, 15398, -8793, -34861, -2507, 56530, 62297, 21394, -12265, -11579, -55243, -86637, -88175, -91153, -55582, -33257, -31284, -27168, 6419, 30453, -3353, -15598, 8080, 26132, 51767]
8338E1767j0752j0863p452k799j2423l1597j055J4591K0350m4021K253q485j4235
8325e4721l5441j897L6893L8991J5450j1815K967K230K0941N568P574L224m7796
8312a7832k5891K5209k2387l2931L0618L4861P290j8662l3103k0299q80O337K3646
8299d4024k1809L1147L9063L4497p71k1527K267l808J0153j2816k3182N6746k6324
8286A9612k2237K2508j939n9394n8436J3399N0713O0795J6307k8434j8823k5054
8274c0983m9817L6367J4979k2033N504J779K4573K1558n3717j2790K4976L1144
8262h460J0882N32J795l6737J6217K3109j4272j9647J8216l8432m1159M4054O6708
8249B2806j2252k8429M3157M5254j2102m5006o3856L4262K8281r788k7169L1974
$$ y = [51767, 41015, 30152, 22700, 19901, 7478, -24119, -25174, -10583, 9767, -34254, -32001, -40486, -54721, -90162, -92059, -55166, -16175, -725, -12540, -9573, -7343, 13598, 19166, 26740, 29964, -17832, -43723, -18514, -40901, -73832, -43214, -8353, -1063, -19725, -52828, -73127, -74007, -67670, -44024, -65833, -34686, 4377, 38874, 38103, 16576, 18843, 15035, 25188, 12372, -10810, 45936, 19612, -2625, 19883, 17944, -41450, -99886, -86487, -35774, 25021, 41328, 12894, -5929, -30983, -80800, -44433, -29454, -51487, -45983, -44204, -19631, 1927, -51790, -64580, -39604, -8460, 2422, 2954, 4749, -31988, -15771, 7338, -6934, -26581, -8365, -46797, -87956, -43902, 22806, 10554, -17875, 25282, 70536, 58434, 13428, -50428, -16166, 12115, 2327, -24842, 7132]
8237G132K6876R523R342l1101l3397J4613r495k1094N824l2586k3295N0562K1735
8224e361L523k1518l964J8186l587J659J5396J4600k3292l2392K0580K7160l79
8211A0611j4774k0829j3087L315J9254m454K7246L3009K4032l2534J4203k478
8199D3514K5941m8480j7647k6702n993l043L3455M389n9007J1574L0334K2420
8187A0755j3161K9777K1350j9884m0701n36Q532j3373q823K0810m082L649J3093
8174G406j37J9289j9683n822k7373L9568k3868k1648K0743J994o269K3447n781
8161A866l9563l3191p125L186k4983L8012R683Q513o607q999j508M2228J4241
8148d247N3763J9809l8712n1367n507l4703q232M0707L4228j860j700o579j6361
$$ y = [7132, 34008, 43531, 52873, 21772, -11625, 2988, -6507, -27601, -21777, -54363, -77658, -27096, -5361, -1838, -23356, -27320, -9134, -12721, -11062, 4334, 18934, -4358, -36750, -16170, 10990, 10611, -4163, -24992, -38079, -34764, -15510, -19964, 7282, 40291, 64323, 31789, 45992, 43514, 69455, 20975, 3328, -23374, -29367, -32410, 1045, 5434, -53573, -41999, -11665, 10755, -2406, 27371, 48721, 28837, -11864, -12400, -3868, -17241, -26064, -5254, -9336, -5687, 7406, 7269, 26558, 6875, 1053, -26320, 13248, -10620, -32268, -11525, -9531, -15800, 7647, 1866, -37697, -70888, -78013, -74827, -99810, -61798, -52115, -43602, -50209, -59208, -60716, -18488, -4247, 49516, 69325, 30613, -20754, -26261, -60964, -69196, -28489, 5739, 3879, 2179, -4400, -20761]
8135b0761P252j2195k2343R588k4372l1725K7979J1022L0894J4832n3814K6298
8123c7345M8525q958k7615K924K0399J3662K5326M3748k5580j3625J8543L322
8111F3326n843p759N498j768m384Q313K0504m073Q105L3866m8008l8813n632j7369
8097E963j0116K2899r034M261n7173k5722O0880M7354l7687r220k0677M136J9449
8084d687l5806J6201l042M809L1180Q472n4602m7102J1431K5092j0713K0086M3271
8071D590j9265M1268N112k7250p498J5236K4223K038k3117o613l563N799m8655
8058c7695k8423N837N558J0671L4102j042j0575K380l8976k3004K0632J4088K0134
8045b6313L9333L3262j7741Q094k1826k5859q897J2772j931M353k568K9284Q244
$$ y = [-20761, -13509, -25704, -48047, -38459, -62831, -94556, -66577, -55555, -24661, -9829, -63643, -37345, 11180, 2222, -25393, -22469, -2070, 11592, 36918, 80666, 55086, 41461, 60004, 63326, 57483, 49724, 55222, 53454, 49070, 57383, 77887, 73814, 81919, 115785, 67777, 28964, 23332, 5963, -4153, 18746, 9712, 13973, -43200, -68922, -8042, 39312, 1625, -7595, -28272, -24136, -4687, -40493, -24292, -27334, -22525, 8655, 17127, -37475, -84577, -73146, -48054, -58767, -38681, 4590, -14675, 26593, 31705, 4455, -3043, 12193, 36416, 38454, 15337, 8724, 5161, 10960, -37695, -66118, -60281, -54723, -44052, -9950, -10992, -21567, -19187, -58163, -81167, -60535, -46447, -26313, 13020, 46282, 28541, 36635, 14809, -11050, -19947, -7175, -9106, -4753, -7321, 21963, 30207]
8032C0207O798L4846J3605P337j5873J2263k3812o5316K1171L3867j9512j6686
8020A8895q726j5215Q653J3680J3796j6712l8608p084K5752J87L7079r626n3039
8007c0968N680J4930K0312M9771o331k4407j0140j8109K2895N429j7955J0171
7995B1278L674n804j6361l033m553J7924J0519m6814m4893L4129O1527O8363K9313
7982A25269n538k8536o8520j0178L5489j024j4139j2283k2235L44l353m825j957
7969a1486n072k580K4555M17j170O5805J1757j4982p795j9139P449Q180J2645
7956F8584O05L254n143k1390n7769k4112J9111L2189k3812K3788N2764J5767k8251
7943E5585j4060j3323q340j5412j0105O98m2179k3565J9665k441k1200K6668N6836
$$ y = [30207, 37005, 71851, 85456, 92793, 76920, 89183, 65371, 55, 21226, 55093, 35581, 18895, 10169, -5046, 3607, 17287, 31083, 14371, -24237, -31321, -5569, -5382, 31697, 22071, -30968, -25288, -10358, 9954, 59725, 53394, 28987, 18847, 738, 23633, 29062, 11107, 21278, 24952, 19148, 2787, -246, -4799, 13125, 23644, -23170, -68063, -33934, 27593, 95956, 125269, 119731, 91195, 22675, 12497, 47986, 46962, 32823, 20540, -1695, -1351, -4704, -9529, -11486, -16558, -19138, 5417, 5834, 4664, 70469, 82226, 67244, 59449, 40310, 47759, 55939, 68584, 69189, 72443, 67300, 45910, -11859, -35971, -16860, 15329, -8483, 15305, 68069, 83836, 55585, 41525, 28202, 19862, 4450, -5655, -4957, -47136, -70701, -51036, -53477, -74677, -48009, 8827]
7930H827l189K9083M1223M3165M608q511n266j8452m7993J7053N094J694P512
7917G4848l6059P200L0945n294l0607k1576K3659O4l7741l3854p640J0315n067
7904c0807k0747k48k4233K3342K2525J5451M4640j9139j0260J6164K374n9926
7892d0864N627O0781j1760M313l0539l4672q011J2341K4553K3121K5678k236p495
7879B0837L680n6791k4026J6630J3758M1092m3098L670J3726J480k8907j7708
7867e5657o851n477K7310J3759j3536j505P661J4623j7384j1409J0183j8409j2692
7854f9384P689K5415J2523m3407k6874O2126N7103j4433Q072J8226j9838j7795
7842e77K1012M5176j6784j5165O29k8151k9340r282M925K7214K95m7234j8324
$$ y = [8827, 5638, 34721, 75944, 119109, 123717, 115206, 109940, 91488, 43495, 60548, 65642, 67336, 74848, 38789, 45989, 76934, 71640, 41033, 19457, 43116, 43180, 5439, -28415, -36055, -25740, -30807, -51554, -51802, -76035, -52693, -30168, -14717, 29923, 10784, 524, 16688, 19062, -40864, -35237, 25544, 13784, 18097, -12442, -47114, -55125, -42784, -18231, 4890, 30568, 28332, 20837, 24517, -32274, -56300, -39670, -25912, 15180, -27918, -24248, -10522, -9042, -37949, -55657, -62508, -67985, -40675, -26916, -40452, -41957, -34296, -19673, -37057, -48466, -38283, -56692, -69384, -61695, -36280, -23757, -67164, -94038, -31912, 25191, 10758, 18830, 37056, 17218, -577, 20435, 65611, 48827, 33662, 34291, 6140, -23200, -32482, -27557, -343, -48, -47282, -65606]
7829f5606J6628P10J4593k940j7407l3870j9554L7626O9314l964k7192m8439j0543
7816i0644L6477j2052J6169J7911K3293J4028j8222L5790j6142k9532j4745L675
7804c3994J3234o301M2023K9986J9580k9547o657M4904j5427k7389j920j5908
7792A2584J2002k8477j4247n251k4017M9775M750l0852j6072m3003k9592L9648
7780g2752J6259o9j9034Q672p149q201j0068O3132L6268r118J0309m5685p17N1254
7766A3101J3897p568q477q215O748Q141q262o5975k6756m451j0464L150M3305
7753e1826M459J2394N9774j70l0276m3269j1747L0063k9442J4475M172j0593J7048
7740c4938k5337j3433k2726K803O0118R235J7430m1673L213n3126j0454J5033
$$ y = [-65606, -48978, -48268, -33675, -36615, -54022, -87892, -107446, -69820, -506, -4470, -31662, -80101, -90644, -54167, -66219, -50050, -32139, -8846, 5182, -13040, 22750, 6608, -22924, -37669, -33994, -20760, -27061, 14962, 44948, 64528, 34981, 28324, 73228, 57801, 30412, 28492, 12584, 24586, -3891, -18138, -23389, -47406, 2369, 7119, -23733, -39805, -82808, -112400, -72752, -56493, -56562, -75596, -66924, -74073, -82274, -92342, -29210, 7058, -2060, 8249, -37436, -38153, 13101, 26998, 19430, 10953, 2738, 9486, 17627, 9365, -56610, -83366, -87817, -98281, -95131, -51826, -47367, -34973, 24801, 24631, -5645, -48914, -60661, -30598, -60040, -45565, -41393, -51986, -34938, -60275, -73708, -96434, -93631, -33513, -24278, -6848, -48521, -45308, -98434, -108888, -93855]
7728i3855M9315M1676k112k5250P223k1532m3414Q75M3551M1292j31j8210j1001
7715c1573j2809L619L2830K4704k4604R912k5202k9773K2300M1568j3809m7227
7703e0064k7185j0497P420J8557P3218K4994j5772j2712J0650K3466k5154j1521
7691E400j6205N514N794O2j2219K659M047j0380m0546k4987L0282K1764K0814
7678h001J505n540q575L21j1824l5502j4348L650J2932L613n943K4975Q601K0248
7664a3888J8430J6212j2736l7985R513q118J8500O569j3525l4721l79m652j687
7651e8467J3833J9733r06K1062M1088J3371l1569o3647j736J7027K4781J5727
7639A0297L8123L851k1878R342K0514J0582l8981j7492J827p828j8856J2371K4454
$$ y = [-93855, -44540, -2864, -4976, -30226, -23003, -44535, -87949, -87074, -43523, -2231, -2362, -20572, -31573, -44382, -40763, -7933, 16771, -7833, 2079, -23123, -52896, -30596, 10972, -2837, -50064, -77249, -87746, -80326, -61769, 11449, 36443, 20671, 7959, 18609, 42075, 16921, 5400, -10805, -5291, 503, 565, -11654, -8995, -4948, -15328, -55874, -80861, -50579, -28815, -8001, -6496, -12036, -20611, -20290, -32114, -67616, -81964, -78314, -65382, -61769, -67712, -42737, -34136, -13888, 4542, 20754, 8018, -29967, -20454, -28572, -10072, -3503, -17028, -51749, -52128, -56780, -58467, -44634, -24901, -25807, -4745, 36343, 49714, 18145, -45502, -47238, -30211, -5430, 10297, 48420, 52271, 30393, 39735, 60249, 70831, 31850, 14358, 16185, 8357, -10499, 1872, 26326]
7626B6326l8844o1994L8568M0208o9989k6520J9544Q86J6936J7862O973k1125
7614e1169j0204M6992J1658j192L0226J5010l4515j2240j0775j919j6443l005
7602c7576J2390k6299L0469K0505M803n027J1042k6724J9436K2094r388j8160
7590b435J0188M1566j8823J341j6550J1118k5578m327k2558k5121o454J0609N0846
7577C822j6611j4882L6390K9932J4353j7225o3802k9333L3401K9945J0668J2634
7565B9292J5477j4737k6411J003J2490K6529L51k4270N67L235Q54J4730j6099
7552B3011l4531j4723M3447j2972k0146M4322M6795k7258n0821r73k192j6333
7540b2374j1165k6300j5555L0405R669J1949p687J1900j1965k400k5588l2207
$$ y = [26326, -12518, -74512, -35944, 4264, -65725, -92245, -72701, -71815, -54879, -37017, -30044, -51169, -61373, -14381, -2723, -3915, 26311, 41321, 6806, -5434, -16209, -18128, -34571, -37576, -25186, -51485, -21016, -511, 4292, -735, 10307, -16417, 3019, 25113, 15725, -2435, 7753, 49319, 30496, 31837, 15287, 26405, 827, -3500, -26058, -51179, -57633, -47024, 3822, -12789, -27671, 8719, 38651, 53004, 35779, -28023, -57356, -23955, 5990, 16658, 29292, 44769, 30032, 3621, 4624, 17114, 43643, 43994, 19724, 20291, 23526, 24380, 39110, 23011, -11520, -26243, 17204, 4232, -15914, 28408, 75203, 47945, -2876, -3849, -6041, -22374, -33539, -59839, -75394, -44989, -35320, -23371, -31058, -19158, -31123, -33523, -59111, -91318]
7528i1318q41N6332L5818k1651o6788R963J8405L1265J4396q551j8763J5827k3280
7515d9186J9527N1084M6540j9149J7561l7054k3383K3804L3472l5532j2819K1325
7503C6190k4513l2857J4940L837K4162K1238l952J9972m9531j3195K3232J5976
7491C5499p3300j5251J3983M4199j2165k7388K4363J1580p32K5520j4438o2160
7479e0290J6602J9182j3230k309K1228N420r746m070J630K290j9812k6422m0956
7466a00483R512J9600j5047M9519M072O595L469J1824j7038O224j0533K8567N1592
7453D7873L568n4399j3460M0975q187j1572J9352l2312J9230M460j7871k0596
7441b2939K991N3621m287l0506l4577k712P365L6793j4285k1235J0123K2053L27
$$ y = [-91318, -92159, -35827, -9, -21660, -88448, -78485, -60080, -28815, -14419, -22970, -41733, -25906, -49186, -29659, 21425, 67965, 48816, 66377, 29323, 5940, 29744, 63216, 27684, 14865, 36190, 11677, -21180, -6240, -2403, 21759, 42997, 39045, 59017, 9486, -3709, 19523, 35499, -37801, -53052, -39069, 5130, -7035, -34423, -10060, 1520, 788, 26308, 11870, -50290, -33688, -14506, -27736, -30045, -8817, -3397, -13143, -17213, -15583, -13293, -33105, -59527, -100483, -90971, -71371, -86418, -36899, -32827, -26232, -22763, -10939, -27977, -21753, -32286, -3719, 47873, 51441, -2958, -16418, 24557, 16370, 4798, 24150, -8162, 11068, 15528, -2343, -22939, -19948, 33673, 29386, -1120, -35697, -38409, -31044, 5749, -8536, -29771, -19648, 2405, 2732]
7428B732M7229N192q002j4806o7487O446J0056l6789L5957O562L4878p422n2728
7415c8182j2156O270J6851n674l4224k2240M8064K3397l2881P229k0370k3705
7403h7621N0168M965J7806M012j1068m06J2408j0852J1198l2475k1455M2744L9691
7390A9115L811M666k0163q51M4505k6207p4212J1673M9468J6412M0949L644n1416
7377B1394k6582n6582l51K0870J3060M1983j589k2338K1718J1984j648N914j1542
7364A6291m530J8278j7080k0656R723R622N1178k4559n7695j6539q100j04J2169
7351c2002L0433J3877J4135k8681K3480j3995j5625K4769M842J278j8871k2306
7339a8666j042R877l4344l805L2426M2612J0630n4833q797K4705J0563K8196O400
$$ y = [2732, 49961, 55153, 47151, 32345, -35142, -28696, -18640, -55429, -19472, -12910, 21968, 14546, -38182, -50338, -44068, -27217, -32891, -67115, -89355, -41291, -17894, -50775, -43546, -63916, -87621, -37453, -32488, -14682, -10670, -21738, -22144, -9736, -20588, -9390, -41865, -63320, -20576, 19115, 22926, 27592, 7429, 6578, 51083, 24876, -49336, -37663, 11805, 28217, 69166, 72810, 21394, -5188, -61770, -62121, -41251, -28191, 13792, 12203, -10135, 11583, 23567, 21919, 27833, 16291, 11761, 30039, 12959, -7697, 2026, 11648, 62826, 38267, -19428, -35967, -44067, -44171, -32002, -1569, 12308, 26443, -2238, 21242, 7247, -8378, 16391, 21233, 22511, 3640, -18666, -19708, -9831, -44175, -47980, -15554, 27058, 37688, -17145, -25942, -1237, 9326, 37522, 43922]
7326D3922M710k1246j9892l1006N56K6863j2071k7562q197q212J7208Q484k1729
7313d8172l8619J3706N2837p826J3680k0599j4479J6402K7269l6488n569m2944
7301i0802k5099N5631M6873J3901m970l7050l263Q0705K1202m0705j7838J583
7289A68J7615K5299k9724m5126j6682k0699K965K4472R85k4246j499k0027K3717
7276f2782r01j3153l2781k467N2948K4042K9667P056L4181j4190j670J9750K925
7263D2625p045r663k9985O862L7093j2956m4488j2081k0116m2183J8119K6950
7251d6868K2512J0238j3430J6156K0376M70j0022K8243l985m5213P193l9914J1389
7238d2855J3758M5305J0777p927R522j8556N588K6954m778r348k4667m9761K0666
$$ y = [43922, 48632, 27386, 7494, -23512, -22956, 3907, -8164, -35726, -43923, -52135, -34927, -26443, -48172, -86791, -73085, -20248, -28074, -14394, -34993, -49472, -33070, -5801, -42289, -47858, -90802, -115901, -60270, -13397, 504, -4466, -41516, -44779, 35926, 57128, 16423, -1415, 168, 17783, 43082, 13358, -31768, -48450, -69149, -66184, -41712, -40727, -64973, -66472, -86499, -62782, -63683, -76836, -109617, -112084, -59136, -35094, -5427, 1629, 35810, 21620, 19950, 39700, 42625, 35580, 25917, -4068, 2794, 39887, 26931, -17557, -29638, -49754, -91937, -73818, -46868, -24356, -14118, -27548, -11392, 8984, 9454, -568, 27675, 23690, -21523, -14330, -54244, -42855, -29097, 16208, 26985, 19058, 28580, 10024, 15612, 42566, 37788, 28440, 3773, -45988, -25322]
7225b5322M1223j7983P996K5888n0691m1680j5936K6304K2885o414L043n978K5828
7212a0837K5523l8716M160r180l9331J717J5219J2522k113P811J5461K2455j4775
7199a0084r498L66M1500L0310j0350J3407J5100m1458N701o2590J140J6322j7589
7186b7723L6948L002k5437l6180J143M7494O62J163K4601j0543p738O939l3566
7173a9235l0196j2221M505r497K2375M1268j8885m0541k0925N967K0563K7580
7161b9242L0561j597j5833j8146l5410k2652N970M355K0526J0587M9005K8548
7149B6672k4849l3864n336J3330j7989Q86J518o219j3991J7882J2206j8050M3425
7136d379L719K2611r660k4566L3272L5844j125n0031j1939J9354l3587l3124J1619
$$ y = [-25322, 15901, -2082, 5914, 31802, -18889, -60569, -76505, -50201, -27316, -33730, -30687, -36665, -10837, 14686, -24030, -19870, -29050, -68381, -66664, -51445, -38923, -41036, -33225, -17764, 4691, -10084, -19582, -19216, 22284, 52594, 42244, 55651, 70751, 29293, 34994, -27596, -26456, -10134, -27723, 9225, 12227, -13210, -49390, -48247, -753, -91, 1072, 25673, 15130, 7392, 14331, -19235, -49431, -61652, -57147, -66644, -44269, -3001, -21886, -62427, -83352, -77385, -56822, -29242, 1319, -278, -16111, -34257, -69667, -92319, -86349, -81994, -61468, -50881, -1876, 26672, 1823, -32041, -37377, -24047, -42036, -41150, -39632, -45851, -59842, -41960, -29754, -47804, -4379, -660, 21951, 12291, -12275, 20997, 56841, 55716, 5685, -6254, 13100, -20487, -53611, -41992]
7123d1992J4937L520L707r976k715J4686P337n5427n4390L3214N7414L0452K9177
7110B9944K3084O607M067l1574m6677l4615l44N557l338K41L5319o849k4944j701
7096d5223R687M2440K708k8725l7710Q832N081k4343K67k233M1330K6885l839
7083d843j1428L1527o198k763j0975j5674l454O772j5701J709R146L076o372P491
7069a7687M567j7323j8923n802K6633Q143k4051K7133J6161R152j6808j2959J7836
7056c928R857m853K1199k2261l0999j5567j3600Q656L1144N6317J946p4183n9209
7043i5481J7241K4598L655P457J4113K4333j1228K2781J2758J3020m7492j4537
7031b8782j1290k4168J5392K825j0682k2260J4171m7240k2602P5475Q9737K5350
$$ y = [-41992, -27055, -23535, -19828, -29804, -32519, -17833, -10496, -65923, -120313, -87099, -29685, 767, 29944, 53028, 59635, 63702, 32128, -14549, -49164, -49508, -43951, -47289, -47048, -11729, -18578, -43522, -45223, -35536, 6904, 9612, -19113, -56823, -47991, -42910, -67253, -66986, -69219, -27889, -1004, -4843, -16271, 15256, 9058, 6295, -4680, -20354, -23808, -17036, -32737, -31028, -21882, -18806, -25178, -17687, -13120, -30443, -49366, -55168, -28535, -20392, -44443, -17310, -1149, 8003, -8805, -21764, -3928, 5929, 1076, 22275, 14, -30985, -46552, -60152, -51496, -20352, 35965, 37911, -36272, -95481, -78240, -53642, -49987, -42530, -28417, -4084, -15312, 7469, 20227, 33247, -14245, -28782, -40072, -64240, -48848, -46023, -56705, -78965, -64794, -112034, -134636, -59161, 30576, 55926]
7019E5926l2452k4363o651p80M4620K6660K5081L4604k1350k6795k7203j4701
7007C2596j2843R974r030k7613j9598l2720l446J0357M4239l9667J2605n06r430
6994d5082Q355m6749j6259O077J0323K8488j6277l411L4926J9855P311j9539j0139
6981d2121M4474M530n9688j64L2152J823l0244k116K4295j7092J1226Q309j6299
6968d0915R550q29J0850L292r154k1587L7589K2411k1625l3934n3602j7588N0101
6955f5441M0039K3970O082J0571M835k1140M0812n415p479l236j5504k2107j3332
6942b7345j2676l089j3397R463K2347K2859j4683L028M7880o806o889p517l040
6929A0135l6265K034L0046l4987j9681J6177l3455K2076J7656l9216o75n836O267
$$ y = [55926, 23474, -889, -7540, -8320, 36300, 62960, 88041, 122645, 101295, 74500, 47297, 32596, 19753, 29727, 20697, -6916, -26514, -59234, -62680, -52323, -8084, -47751, -35146, -35652, -45082, -36727, -83476, -99735, -93658, -83335, -54847, -71124, -74535, -39609, -19754, -12443, -31982, -42121, 2353, 6883, -52805, -52969, -20817, -18994, -49238, -51354, -27059, -44151, -32925, -24616, -40915, -31365, -32194, -21344, -18052, -27206, -48793, -11204, 11207, -10418, -44352, -97954, -115542, -65441, -25402, -1432, 4650, 15221, 20056, -1084, 39728, 34313, 26834, 23598, 8094, -14013, -27345, -40021, -43110, -56507, -47044, -24697, -1838, -16521, -13493, 34387, 27581, 20692, 13175, 10135, -26130, -24096, 5950, -29037, -48718, -32541, -65996, -43920, -26264, -65480, -66155, -71991, -65724]
6916f5724J0570m4564J0675K3947L2679k2588l0040N0782L0497j0965L3619O753
6904B5641p2579k4207O497N1077O7626M0301k7965r920m9627l1561k3038N151
6892d2604O1985K6223p411k1284m3057k5529J5808N9359j2685R583j6553j3254
6880i419j4386n920Q216L0974J9247q028o3389l1634k878R603k1304l4570J6878
6867a06610J5559K007O0067K3642P120J5951k3235j5072j496J7531l4300P71N2507
6854A4442q360j9606n37r043k7232J9795N7031J5478J99O5n2683m3261L4426K6946
6840G660N0094K9404n4935J2126L6879j0199p941l0504P029J2132K8369P710o4125
6827B3699J2518J218r406K0092l1600K6370j9712l6826l1838M304J024J2937M4007
$$ y = [-65724, -55154, -99718, -89043, -65096, -32417, -55005, -85045, -34263, -3766, -14731, 18888, 25641, -46938, -71145, -64648, -13571, 54055, 94356, 66391, 56471, 6844, -24717, -47755, -42604, 19381, 45604, 38193, 16909, -26148, -51677, -35869, 23490, 10805, 20388, 3835, -9419, -23805, -29725, -21509, 9465, 28712, 20684, -42705, -74339, -77217, -67614, -88918, -123488, -106610, -91051, -89044, -28977, -5335, 1785, 17736, -5499, -20571, -22067, -4536, -38836, -38065, 14442, 6082, -13524, -14061, -23104, -50336, -30541, 26490, 41968, 42167, 42232, -10451, -53712, -19286, 7660, 57754, 87158, 32223, 44349, 81228, 71029, 63088, 32584, 39613, 51745, 80114, 87824, 23699, 36217, 37435, 28029, 48121, 16521, 42891, 23179, -13647, -45485, -41181, -40157, -27220, 16787]
6814A6787K6949j5695l392L682j7808o7619j1039O0567N686r936J5189L3686j4391
6801B2666Q018k5151k9395K3183R878q662K37j2979R438M617M2491l120o7229
6788b6008k3082N8730K811l7841l6580j0890J4984J2469J4143j1440K2138L1050
6776A0484j8042j1083O3090L4934L8503q054k1480m4203o7036l7273J7293J3018
6764b9849m7474R208N4745J4952m6492j0334J9002K9182J7894J4506j4523n4420
6752d3603k0012K539q376j6820k643J8219K0253K7628K2557L8742l1912p201M4791
6739D4162K7374p515k4311k3107l0839Q820j0327j0225o705N1676K098J1171j6937
6726A5335j9066l1673J7046l013j8255O2044L8127K7594J1863J0575l5898n2151
$$ y = [16787, 43736, 28041, 24649, 28331, 10523, -57096, -68135, -7568, -1882, -11818, 3371, 37057, 22666, 30684, 5533, -23862, -679, 9199, 537, 774, -12205, -2767, 1850, 44341, 41221, -26008, -49090, 9640, 12451, -25390, -61970, -72860, -57876, -45407, -31264, -42704, -20566, 10484, -7558, -18641, 44449, 79383, 117886, 109832, 88352, 44149, -22887, -60160, -42867, -29849, -77323, -68115, -13370, 1582, -44910, -55244, -36242, -7060, 10834, 25340, 10817, -43603, -63615, -61076, -69452, -86272, -88915, -70696, -50443, -22815, -258, 38484, 6572, -629, 44162, 71536, 64021, 39710, 16603, -14236, -5416, -15743, -25968, -32673, 19003, 21101, 32272, 15335, -3731, -35404, -18358, -21371, -39626, 22418, 60545, 88139, 100002, 110577, 74679, 22528]
6714B2528k2246J9427P739Q95J9863o5726j5420J5717M940l755J4754M215J5706
6701A8637K2295j2427k7965J6798M0281J1123m1739j1089J3837p73k0156k0735
6689a1913n276l1019K694M9529j2202R391j1461l887j8769n7771Q59M3580J196
6676d5049O212J6418j0607l066o566K0100j9337l7208q557J2959K0042K3967M5658
6663A4966K5387L1809k2618m4699J2096Q334k3320j316j2526l6667J2688j0632
6651d6498N065L2706j9496J1349K5237r938j2634R999k1485K2054Q811j5319k3102
6638c3251q100k7926j7465l852O0528L3299J8088K5629j6005n6272l3163O994
6626e1496K8623K0675K0201N401J8224K4556K7210j2500m5990k8468M921n265
$$ y = [22528, 282, 19709, 27448, 28343, 48206, -17520, -32940, -17223, -12283, -16038, -1284, 2931, 18637, 40932, 28505, 540, 17338, 57619, 68742, 27003, 15914, 29751, 28978, 8822, -11913, -17189, -48208, -45514, 4015, -8187, 1204, -10257, -14144, -32913, -90684, -89825, -46245, -45049, -38837, -22419, -33026, -36092, -42658, -22558, -41895, -79103, -87660, -74701, -54659, -30692, 14966, 40353, 72162, 49544, 4845, 16941, 25275, 1955, 639, -11887, -48554, -35866, -46498, -41433, -8727, -28223, -16874, 8363, -1575, -14209, -4210, -25695, -3641, 5170, -10149, -33251, -41351, -69277, -86742, -90594, -30066, 3233, 21321, 46950, 30945, -25327, -58490, -51496, -22873, -2198, 18003, 23404, 41628, 66184, 93394, 80894, 34904, 6436, 11357, 6092]
6614F092n653J716J2503k1835k2485L4134K7593l1477k7630N9592K355l1586j3584
6601a0265r272j344l6996j1060Q47j5961p837m356l038M1386K1909j124L8430
6588A319M4202Q470k3314j5171k2533m48J6113Q468O328L970j3902l1219l7985
6575e5702k6611k3856J8272j3522L4655K3533R025j2149K8332J9824p623j8835
6563b4657M7149M2603k7474l0642J8638M661j0713r139N912k0276q305L977k0423
6550b8689j8561l0337K5631J3585k0501P669L4623M5821K2838k9838k8954l019
6538i732P172L1967K5208R942o1723o3160R803L0456L4639M4094k0231J1129J3730
6525F3294j8986m9197Q54L736j0466N1898J9269l6508j5464j4865L2064J7102
$$ y = [6092, 439, 2155, 14658, -7177, -29662, 4472, 32065, 588, -27042, 32550, 34905, 3319, -10265, -19537, -20881, -57877, -68937, -68090, -84051, -91888, -96244, -99282, -57896, -35987, -37111, 1319, 45521, 53991, 30677, 15506, -7027, -7475, 8638, 17106, 23434, 27404, 13502, -17717, -55702, -82313, -106169, -87897, -101419, -66764, -43231, -34206, -46355, -18023, 1801, -5822, -24657, 22492, 65095, 37621, 6979, 25617, 30278, 19565, 10426, 16338, -3938, -12243, -8266, -28689, -47250, -77587, -51956, -38371, -58872, -51203, -16580, 29241, 52079, 22241, -6713, -9732, -2560, 29407, 54615, 64557, 2834, -60326, -50523, -20067, 14572, 58666, 38435, 49564, 63294, 44308, -4889, -4035, -299, -10765, 41133, 60402, 23894, 8430, -6435, 25629, 42731]
6513D2731R790l9091m5627K3920L8901j4892m5446J3674Q184m0599m4350p011
6501i9816O7822M7178J4528J2362k505L4155k5055j1330J9861N0176j5235k3153
6489F8988j9562m4999k8240N0972L3286M8927L352R68l1267k4091k0395k8612
6477I327m823j697N217M041j3525k2942p108K2446K570j1520K942q25J1680m856
6463i073o356m523K9633L039l1841m4429k5912K9036L9456J7597l1893k0254m77
6450e5997K5193L4010r251R966j8741l0282J0165P052k484j6553P068l8L505n066
6436d1453j1613L3810M3742o759m620k6004Q977J9978J478J9427K3549l2516k8674
6423f78n7R705K6183k6685j5990k0825J7620j2830L6307k2646k8080K7660L5891
$$ y = [42731, 52521, 13430, -32197, -8277, 30624, 15732, -29714, -16040, -7856, -48455, -92805, -99816, -31994, 15184, 29712, 42074, 39569, 73724, 48669, 37339, 57200, 107376, 92141, 68988, 49426, 4427, -23813, 27159, 60445, 109372, 112724, 113692, 82425, 58334, 37939, 9327, 4504, 2807, 8024, 12065, -1460, -24402, -31510, -9064, -6494, -18014, -15072, -15897, -4217, -9073, -15429, -19952, 9681, 12720, -19121, -63550, -89462, -60426, -20970, -3373, -35266, -55520, -55997, -30804, 3206, -6045, 3921, -14820, -45102, -34937, -27885, -30369, -46922, -39854, -39892, -36387, -41453, -53066, -19256, 24486, 17727, 13107, -12897, -3920, 16058, 17536, 36963, 60512, 27996, -678, -735, 8970, 35153, 8468, -7522, -28347, -10727, -23557, 12750, -9896, -37976, -10316, 25575]
6410B5575k0623k4331K0567L0030J4620n724n1481J1488N0044L1296m5076m2361
6398e976J1154j825m2920l4276k4941J3442M7154K5156l6127K5381O8950k2954
6386B2218n3504m2326m9N5877N9496J4331l3258k0896l006J828p335j5462M151
6373a7935p8157J4652L7507R952j7241j7221J9980K4608j0271k5709o257K8997
6361c7095l730L5636J755K650n323j6681N244j1171o677K7000J421n5029L4159
6348b7841j2411l3769J337N4041P6142K6828o072o070k8288K906J2179r880P46
6335D9848m5752k6106J267l5105N962M6299k423J687k716J6836R39J2654n0277
6322b6887m7086l0124K6717K109j2296Q434L2003J3216K0348J2942J8422P496
$$ y = [25575, 4952, -19379, 1188, 31218, 45838, 40114, -11367, 121, 50165, 81461, 36385, -5976, 5178, 3353, -39567, -73843, -98784, -85342, -38188, -13032, -49159, -23778, 45172, 22218, -31286, -73612, -73661, -17784, 41712, 56043, 22785, 1889, -1117, 711, -6624, -22086, -17935, -96092, -81440, -43933, -33981, -51222, -68443, -48463, -23855, -34126, -59835, -66092, -37095, -40825, -5189, -3434, -784, -6107, -22788, -17544, -28715, -35392, -8392, -6971, -62000, -27841, -40252, -74021, -72684, -18643, 57499, 84327, 78255, 72185, 43897, 46803, 58982, 49102, 49848, 4096, -22010, -20743, -55848, -49886, -3587, -6010, -4323, -7039, 9797, 10736, 23390, -26887, -73973, -104097, -77380, -75271, -87567, -79133, -47130, -33914, -13566, -624, 17798, 25294]
6310B5294J0218k9989L6451l6357l4378p509L8618J7643j2468J6265J4594k8507
6298I875j9278J477o958J5459k076j893j1243k0085k7872M888M1988p875j0790
6285c4383j2939k0760N230j0420j9948K4964R19q866p696L2892L7602n468l3421
6272e2294k3442K4756K3560J0449J0448K1095k8455J874L0791j4479O896N9292
6260G0491r150l0878k6095j4818N875L0251n2570p292K1191k569K4730L7653L690
6247E0509n279j3031m3430k8971j6965k6417L0412K0859J2252j491L126L63J1817
6234f246j707l1160J8618L0499K612m3533l2843J2914K9383q992l3578j3203K6369
6221e0867N0449K0316k2813K3307L7346J2333o257l3722L21J8001K28O39R570
$$ y = [25294, 35512, 5523, 41974, 5617, -28761, -36270, 2348, 19991, 7523, 23788, 38382, 9875, -9403, -7926, -14884, 575, -1501, -3394, -14637, -34722, -62594, -57706, -15718, -23593, -34383, -47322, -68082, -62852, -73272, -93220, -68256, -67337, -76203, -83899, -51007, -13405, -18873, -52294, -75736, -50980, -27420, -16971, -6523, 14572, -13883, -12009, 18782, 4303, 11199, 70491, 61341, 30463, 4368, -10450, -4575, 25676, -26894, -34186, -12995, -15564, 9166, 46819, 50509, 45230, 32199, -11231, -40202, -57167, -83584, -53172, -32313, -20061, -21552, -18426, -18063, -6246, -7953, -39113, -20495, 10004, 12616, -30917, -63760, -50846, -21463, -30455, -64033, -77236, -50867, -418, 19898, -2915, 20392, 57738, 70071, 63814, 30092, 30413, 48414, 48642, 49281, 58851]
6208E8851k8085R878l0654p147j3093r300m1389M6052K6300J371r976m6653r329
6195e3174Q51j419k901L1465L3801J4611M6443N107n1462l7460J3423j0367j3246
6182b4328m1366n222L1709j1838K4097P730o408O035p466n3186K3315N897p549
6169e8580J1610Q087Q564R742M833J5036j6336O65J1439j3796j328L018j0793
6156b7839m2527k0202O4450j3659K1744K2792k7914l1252j7853J3471M401O672
6144d7716M9882K0949Q004m9783j5008p493Q994p236j9017K6805M8392L1658N2779
6131A01210K082k5746m5414k2493p235k8036J7160l3843k987M2261l4008J1725
6119b5324L9715M6200p17l0626n2216m8994k092L3366L7489r404m1263j6229J445
$$ y = [58851, 30766, 40644, 9990, 2843, -10250, -19550, -60939, -14887, 11413, 12784, 2808, -43845, -53174, -52323, -53742, -56643, -25178, 8623, 23234, 69677, 74784, 23322, -14138, -715, -11082, -24328, -65694, -70916, -39207, -51045, -26948, -19218, -25626, -19591, -27057, -80243, -56928, -51031, -58580, -46970, -38883, -30319, -20577, -15744, -708, -17044, -16379, -4940, -18736, -20064, -17046, -27839, -70366, -90568, -26118, -39777, -18033, 4759, -23155, -54407, -72260, -58789, -54388, -47716, 2166, 23115, 31119, -18664, -33672, -41165, -32171, -39407, -58424, -31619, 16773, 48431, 101210, 103292, 77546, 32132, 9639, 2404, -25632, -8472, -42315, -45302, -3041, -37049, -25324, 14391, 60591, 59874, 29248, -22968, -71962, -74054, -40688, -3199, -12603, -53866, -70095, -68650]
6106f8650J0828L1151R881Q4459K1650J8074k4060n5759j2980J7336n868j5465
6094A0597j7160J0823K4566j1334k0932J0228K2175Q184J7689K0843k8560k2640
6082B4479k5984M03j7056L8260K3299J6352l7969n1256J8529J4715L7145o1022
6070b0105r1249k774J8960M1930O228J2033K2395L9152J0585L0586K4028l6919
6058E4850J5325j3914p0636l6601N4m902K8306k1244j4472L9526j6426M894M1548
6045F308j7966N03P922o43J0604O256k0532l0558J5861k777K6955m9150m7464
6032i4681O0017M2259J6013j1356j0052J5702k2959K7329k005j4387j3565P099
6020e86P361J7376L1882K9650m543m3399k6752m69j1939m92j0507j358L3182L8183
$$ y = [-68650, -57822, -26671, -16790, 67669, 89319, 107393, 83333, 27574, 14594, 31930, 26062, 10597, -6563, 4260, 28826, 17492, -3440, 6788, 28963, 37147, 54836, 75679, 47119, 24479, -1505, -1102, -18158, 20102, 43401, 59753, 21784, -29472, -10943, 3772, 40917, -20105, -111354, -114128, -95168, -53238, -47010, -34977, -12582, 26570, 37155, 67741, 91769, 54850, 70175, 56261, -14375, -50976, -50922, -55824, -27518, -48762, -63234, -23708, -40134, -35240, 6308, -11658, -11155, -3233, -3876, 6728, 12984, -7548, -38106, -22245, -25022, 1933, -47217, -94681, -34664, 7595, 23608, 12252, 2200, 17902, -5057, 22272, 20267, 5880, -7685, -586, 6775, 24151, 56033, 85683, 81140, 37741, 10989, 10520, -1419, -1911, -12418, -13776, 19406, 57589]
6006E7589K4326k2545k9125o159j9940J5019J6626p992k3050k0677P093J4389
5994E554J9920j4755k9395j9469q263j940K4625L5597M1210J7828k4023r024r177
5981B8688K7097j5210j3769q199J9047j1357m7780O312J4130n917J7049J8800
5969B8891J2606p073j3487j7441K308o6N728k4487L0703L2418P401k1851m5842
5956a0192j1402M2269K4589l1635j0749k3547j1429q003M1399J9944j1127j8318
5944h201k2135K8165l634m8809R391j0268J5272P676J8614K0377J6223j4471j3301
5931e101j5546k0358k244o7J5569J1591l341L4281J4389q025k4180J1140L8891
5918D6999L0684N603m2618l6150q202Q573O7823p389k1876J2446k618n9636n2935
$$ y = [57589, 81915, 59370, 30245, 24086, 4146, 19165, 35791, 27799, 4749, -15928, -8835, 5554, 25474, 10719, -18676, -38145, -46408, -48348, -23723, 11874, 53084, 70912, 46889, 37865, 28688, 55785, 40575, 26806, 18607, 37654, 26297, -21483, -15171, -1041, -6958, 10091, 28891, 41497, 34424, 20937, 3496, 5804, 5738, 11466, -13021, 17682, 50100, 57501, 35650, -10192, -21594, 20675, 45264, 13629, 2880, -20667, -32096, -40099, 1300, 21244, 10117, -8201, -30336, -2171, -5805, -54614, -45223, -55491, -40219, -32543, -13929, 6448, 22671, 8200, -5101, -20647, -41005, -43249, -43316, -27747, -16156, -19497, 14784, 29173, 21148, -3032, 8108, 46999, 77683, 83286, 40668, 4518, -3684, 4889, 72712, 65323, 43447, 55893, 53275, -6361, -59296]
5905e9296L7710N0582n9093P946M4190k1049l0374k2703k6763M1813m618K1381
5893b0274J771l7455M664K4648M2104J5934J4757J7961k8611P533Q381m8190n1930
5880d8707k924J7712M3887J9147J3025k3993K7701o310o70o1056l6608r23J5791
5867d3928k258J8483K9028Q773J1366P931J1370R390M482j0619k3697l3939k6499
5854d0117n459J7628K4222L0253J5715J3633q190j3373m4689J7342J4642m845
5842A6762j4018J0096M126K6976m525j1109n955p41N272n644l9572n6297j0098
5829h4727M7100N4783k366j9657j5815r463l7408J8275k3389k4321N0918N9335
5817A3265M6775k3966l7810O68L7998m032l6533l0940J050k6667k277J6338M686
$$ y = [-59296, -21586, 28996, -30097, -22151, 22039, 990, -29384, -52087, -78850, -37037, -41655, -20274, -18503, -55958, -51294, -26646, 15458, 31392, 46149, 64110, 35499, 43032, 51413, 3223, -48707, -51631, -33919, 9968, 29115, 42140, 18147, 45848, 39538, 38868, -22188, -58796, -59719, -43928, -46186, -27703, 1325, 10098, 21464, 29395, 40765, 50155, 54637, 44018, 20321, -13618, -40117, -45576, -27948, -3726, 26527, 42242, 55875, 47685, 34312, -10377, 6965, 21607, 16762, 2744, 12840, 16966, 43942, 39417, 28308, 22353, 21612, 26884, 21240, -18332, -74629, -84727, -37627, 17156, 14790, -4867, -20682, -30145, -67553, -49278, -72667, -96988, -46070, 13265, 60040, 36074, -1736, -1068, 36930, 32898, -3635, -34575, -33525, -60192, -62469, -46131, -41445]
5804d1445j8194K2959O3602N0430J6423k6851J1620m9354R754K5610p574J6875
5792G3855k1041k4866N687K2265j8291l4347k4202L309l4241k4254M4335K9598
5780b193k4165j3326J6970J6628M6216l556m9414j0834O927Q534k0344j6921L947
5767d1531K3936Q505k6783n109M4483J9877k8455j2936J031n236q609M74R347
5754b1006k5182k5633m181N4353N2868N968J8986l2676o4044j0441p041L0237
5742b7792L6092L5584l4909m8706k7579K025J8977K1554J4408L8709L331j6036
5730A5658m5425j504J3426n083l0763j6771K7645N9501J1817n4583K4393K1271
5718A9582l4258j3359L2896J8826q396l1579p296n505l0737L6977L733L118K1185
$$ y = [-41445, -59639, -36680, 26922, 77352, 93775, 66924, 78544, 29190, 38944, 64554, 56980, 73855, 52814, 27948, 33635, 55900, 37609, 3262, -20940, -17631, -51872, -76126, -31791, -2193, -26358, -39684, -22714, -6086, 40130, 36574, -12840, -23674, -16747, -8213, -28557, -45478, -41531, -17595, -9090, -35873, -40982, 3501, 23378, -5077, -18013, -16982, -22218, -30827, -30353, -21006, -46188, -71821, -76002, -21649, 31219, 37187, 56173, 23497, -40547, -50988, -58029, -27792, 8300, 43884, 8975, -39731, -67310, -65285, -46308, -24754, -10346, 28363, 31694, 15658, -29767, -31271, -17845, -22928, -53691, -70462, -42817, 16684, 28501, -26082, -1689, 19582, -14676, -28035, 4861, 23687, 15291, -16288, -23584, -29089, -59826, -22849, -19116, -15998, 5187]
5705E187K2225J5409Q67k1761o814J4909k7973L925M7320J676m375M5286K437
5692I8318p1971o8637O4L8010j4913j0921l868j3329K6728M8215k9113k4334m720
5679c0471l388L9171m413j2361n519L2626K9633l792j5791J1360J0765j8188j4346
5666A5286p89J933N093k5656Q691j6845k6234L5041N8791k7395j2042J3003j2300
5653A6577m370P650M0072K346k1577k8228J5713j0233j3626L9171M7221o5391
5641B5325j8251K0164j5450k6225M663J5561J3252k5286l433j8462J2607N531
5629a0004j2602m0983J2772N2213k1057j258k0451O967l276K0344k8307K2555
5617b3087J5836R484J0507k216k7641j1208k564M5274k1343L477J4875j9139k3842
$$ y = [5187, 27412, 42821, 43688, 21927, 15113, 30022, 2049, 5974, 53294, 54970, 50595, 95881, 98318, 26347, -42290, -42226, -4216, -19129, -30050, -33918, -47247, -20519, 27696, -1417, -25751, -30471, -33859, 5312, 899, -11462, -16981, 15645, 45278, 41486, 25695, 37055, 47820, 29632, 15286, 14497, 16430, 21523, -4133, 4558, -12287, -38521, -3480, 55311, 27916, 15874, 28877, 16577, 12207, 19857, 59929, 62275, 40698, 12470, 28183, 17950, 4324, 43495, 90716, 25325, 7074, 27238, 11788, -14437, -9774, 5787, 19039, -6247, -9680, -28142, -15535, -10004, -22606, -63589, -50817, 1396, -19661, -20919, -41370, -34403, -37679, -17335, -45642, -23087, -7251, 2233, 12740, 10524, -17117, -28325, -30889, 14385, -6958, -3481, 11394, -7745, -31587]
5604c1587j629L6220N2578j9722j2963K2359k282n1688j2273J3014K3628k9710
5592a4055P930n095J4030J3212r402j6675K5398L1161q169j5317j8195l4762K6851
5579c088j9685l1372j5587J6310M7238L4158J4246K2596o746o193q9817k3082
5567f1022O906R771o812Q30J8167L762Q767L1921N6969P003p5115l6408m4874
5554h0135K2291K1957O1338O4441P501n1112r956l80j8625k2369n130o055j233
5541a7467j0322q238J4985p024J7825K9644k0243m817Q364K6684J1615l2120k6971
5528a8085J5657O049J5519L4247K2545j8692o3620j8208j6490k0656J2553r282
5516e8463q031K1876M0361r89k679K2981J7839k8939k7700J9887k580j4064k1089
$$ y = [-31587, -33216, 3004, 55582, 35860, 22897, 45256, 42974, -8714, -20987, -7973, 15655, -14055, -6125, -11220, 2810, 16022, 6620, -10055, 15343, 46504, 38335, 23018, 4823, -29939, -3088, -22773, -54145, -69732, -53422, -6184, 27974, 42220, 64816, 58070, 51877, -37940, -61022, -54116, -44345, -51157, -50327, -32160, -28398, -19631, 12290, 69259, 76262, 1147, -35261, -80135, -57844, -35887, 25451, 89892, 97393, 46281, 36325, 35945, 17320, -5049, -10179, -16234, -17467, -27789, -36027, -21042, -28066, -10241, 19403, -840, -5657, 2707, 29391, 41006, 8886, -18085, -2428, 3621, 19140, 53387, 75932, 57240, -6380, -24588, -41078, -61734, -49181, -58463, -66494, -44618, -4257, -5246, -7925, 15056, 32895, 3956, -23744, -3857, -6437, -20501, -41590]
5503d1590R312k0691J6972O435L0507J9191j1767p961m8466l6139L4818j0728
5491f0107k6915M8036K9987J1202L853m497j5317l964M462K4023j598q324k778
5478a937n4944k2816M7785K3524M544j1425l0018J1335J9891j0201P087L381k083
5465a5877J7412K3433K3853j159l906K0008J105j597J2012n440r548n6467l7154
5452c3325K924J3974R557j2041M93J60j940M5133j142l7959o865L2674o219j538
5438C886K7049r905l2359n2688O537R009J5442K1450k448j622P316J8545r545
5425F67L012j3397k92j983J8243L2771j0616n634l9519p517K7577m1160K1946
5412a5902J8196k9906Q844Q279M845J0179j1522L2112J618j7419m9601r31M5799
$$ y = [-41590, -32278, -52969, -35997, -29562, 945, 20136, 8369, 408, -48058, -84197, -49379, -60107, -87022, -38986, -8999, 2203, 6056, 1559, -13758, -17722, -13260, 10763, 9165, 841, -1937, -56881, -79697, -31912, -8388, -3844, -15269, -45287, -33952, -14061, -24262, -17175, -13794, -15877, 1535, 24968, 48821, 47662, 43756, 63764, 64869, 63272, 75284, 69844, 60296, 3829, -33325, -30401, -16427, -6870, -18911, -18418, -18258, -20198, 24935, 23793, -14166, -21031, 11643, 5424, 3886, 30935, 21030, -11329, -64017, -57480, -48471, -33029, -11579, -14027, -15649, -8333, 10212, 667, 3679, -9718, -10010, -11993, 6250, 39021, 28405, 22771, -16748, -24265, 3312, -37848, -15902, 2294, -27612, -18768, -10489, -5644, 4535, -6987, 25125, 26743, 9324, -40277, -41208, 4591]
$$ [...]
##END NTUPLES=NMR SPECTRUM
##END=
