##TITLE=Analysis number 309966
Compound Code cc 13539
Book Reference 416/176
Project Code adrs
Chemist Name stevep
##JCAMPDX= 6.0         $$ Bruker NMR JCAMP-DX V2.0
##DATA TYPE= NMR SPECTRUM
##DATA CLASS= NTUPLES
##ORIGIN= Bruker BioSpin GmbH
##OWNER= NMR
$$ XWIN-NMR		Version 3.5
$$ Wed Jun  8 12:19:34 2005 GMT Daylight Time (UT+1h)  MAYBRIDGE\NMR@NMR_250MHZ
##.OBSERVE FREQUENCY= 250.131544655141
##.OBSERVE NUCLEUS= ^1H
##.ACQUISITION MODE= SIMULTANEOUS (DQD)
##.ACQUISITION SCHEME= undefined
##.AVERAGES= 16
##.DIGITISER RES= 18
##SPECTROMETER/DATA SYSTEM= dpx250
##.PULSE SEQUENCE= zg30
##.SOLVENT NAME= CDCl3
##.SHIFT REFERENCE= (INTERNAL, CDCl3, 0, 16.4481)
##AUDIT TRAIL= $$ (NUMBER, WHEN, WHO, WHERE, WHAT)
$$ ##TITLE= Audit trail, XWIN-NMR		Version 3.5
$$ ##JCAMPDX= 5.01
$$ ##ORIGIN= Bruker BioSpin GmbH
$$ ##OWNER= NMR
$$ C:\u/data/dgb/nmr/ADRS/3950/pdata/1/auditp.txt
$$ ##AUDIT TRAIL=  $$ (NUMBER, WHEN, WHO, WHERE, WHAT)
(   1,<2005-06-08 12:19:15.04 +100>,<MAYBRIDGE\NMR>,<NMR_250MHZ>,
      <created by zg, POWCHK disabled, PULCHK disabled
       configuration hash MD5:
       62 19 C7 07 E1 42 D1 B7 37 6C 3D D0 77 39 F9 E6
       data hash MD5: 64K
       57 84 58 CB D6 5B 17 AC 7B 68 B8 82 2B F3 7A 7F>)
(   2,<2005-06-08 12:19:26.81 +100>,<MAYBRIDGE\NMR>,<NMR_250MHZ>,
      <Start of raw data processing
       ef LB = 0.3 FT_mod = 6 PKNL = 1 SI = 32K 
       data hash MD5: 32K
       9A 7D 5F F5 05 92 45 61 AA D6 6B 10 B6 C0 95 C8>)
(   3,<2005-06-08 12:19:28.39 +100>,<MAYBRIDGE\NMR>,<NMR_250MHZ>,
      <apk 
       data hash MD5: 32K
       A3 E0 2B 1F CE E1 73 E0 F9 49 8E 56 DA 95 9E D0>)
(   4,<2005-06-08 12:19:29.04 +100>,<MAYBRIDGE\NMR>,<NMR_250MHZ>,
      <abs ABSG = 5 
       data hash MD5: 32K
       40 6C 76 BE 2A 19 A5 ED E3 13 C6 E1 C8 C7 2D 59>)
$$ ##END=
$$ 
$$ hash MD5
$$ 59 F7 45 FE E2 28 D6 A5 C1 31 73 1D 1A 68 F6 D2
##$RELAX= 
##$RELAX= 
##$RELAX= 
##$RELAX= 
##$RELAX= 
##$RELAX= 
##$RELAX= 
$$ Bruker specific parameters
$$ --------------------------
##$DU= <C:\u>
##$EXPNO= 3950
##$NAME= <ADRS>
##$PROCNO= 1
##$TYPE= <nmr>
##$USER= <dgb>
##$AMP= (0..31)
100 100 100 100 100 100 100 100 100 100 100 100 100 100 100 100 100 100 
100 100 100 100 100 100 100 100 100 100 100 100 100 100 
##$AQSEQ= 0
##$AQ_mod= 3
##$AUNM= <au_zg>
##$AUTOPOS= <24 >
##$BF1= 250.13
##$BF2= 250.13
##$BF3= 250.13
##$BF4= 250.13
##$BF5= 500.13
##$BF6= 500.13
##$BF7= 500.13
##$BF8= 500.13
##$BYTORDA= 1
##$CFDGTYP= 0
##$CFRGTYP= 5
##$CHEMSTR= <none>
##$CNST= (0..31)
1 1 145 1 1 1 1 1 1 1 1 1 1 1 1 1 1 1 1 1 1 1 1 1 1 1 1 1 1 1 1 1 
##$CPDPRG= <>
##$CPDPRG1= <>
##$CPDPRG2= <>
##$CPDPRG3= <>
##$CPDPRG4= <mlev>
##$CPDPRG5= <mlev>
##$CPDPRG6= <mlev>
##$CPDPRG7= <mlev>
##$CPDPRG8= <mlev>
##$CPDPRGB= <>
##$CPDPRGT= <>
##$D= (0..31)
0 1 0 0 0 0 0 0 0 0.06 0 0 0 0 0 0 0.0002 0 0 0 0 0 0 0 0 0 0 0 0 0 0 
0 
##$DATE= 1118229554
##$DBL= (0..7)
120 120 120 120 120 120 120 120 
##$DBP= (0..7)
150 150 150 150 150 150 150 150 
##$DBP07= 0
##$DBPNAM0= <>
##$DBPNAM1= <>
$$ [...]
##$SUBNAM7= <"">
##$SUBNAM8= <"">
##$SUBNAM9= <"">
##$SW= 20.6930455092707
##$SWIBOX= (0..15)
0 0 3 0 0 0 0 0 0 0 0 0 0 0 0 0 
##$SW_h= 5175.983436853
##$TD= 65536
##$TD0= 1
##$TE= 295.16
##$TE2= 300
##$TE3= 300
##$TEG= 300
##$TL= (0..7)
0 120 120 120 120 120 120 120 
##$TP= (0..7)
150 150 150 150 150 150 150 150 
##$TP07= 0
##$TPNAME0= <>
##$TPNAME1= <>
##$TPNAME2= <>
##$TPNAME3= <>
##$TPNAME4= <>
##$TPNAME5= <>
##$TPNAME6= <>
##$TPNAME7= <>
##$TPOAL= (0..7)
0.5 0.5 0.5 0.5 0.5 0.5 0.5 0.5 
##$TPOFFS= (0..7)
0 0 0 0 0 0 0 0 
##$TUNHIN= 0
##$TUNHOUT= 0
##$TUNXOUT= 0
##$USERA1= <user>
##$USERA2= <user>
##$USERA3= <user>
##$USERA4= <user>
##$USERA5= <user>
##$V9= 5
##$VALIST= <valist>
##$VCLIST= <CCCCCCCCCCCCCCC>
##$VD= 0
##$VDLIST= <DDDDDDDDDDDDDDD>
##$VPLIST= <PPPPPPPPPPPPPPP>
##$VTLIST= <TTTTTTTTTTTTTTT>
##$WBST= 1024
##$WBSW= 4
##$XGAIN= (0..3)
0 0 0 0 
##$XL= 0
##$YL= 0
##$YMAX_a= 365363
##$YMIN_a= -482540
##$ZGOPTNS= <>
##$ZL1= 120
##$ZL2= 120
##$ZL3= 120
##$ZL4= 120
##$ABSF1= 16.44808
##$ABSF2= -4.245092
##$ABSG= 5
##$ABSL= 3
##$ALPHA= 0
##$AQORDER= 0
##$ASSFAC= 0
##$ASSFACI= 0
##$ASSFACX= 0
##$ASSWID= 0
##$AUNMP= <proc_1d>
##$AZFE= 0.1
##$AZFW= 0.1
##$BCFW= 0
##$BC_mod= 0
##$BYTORDP= 0
##$COROFFS= 0
##$CY= 12.5
##$DATMOD= 1
##$DC= 0
##$DFILT= <>
##$DTYPP= 0
##$F1P= 14.0000005364418
##$F2P= -0.99999901652339
##$FCOR= 0.5
##$FTSIZE= 32768
##$FT_mod= 6
##$GAMMA= 0
##$GB= 0
##$INTBC= 1
##$INTSCL= 1
##$ISEN= 128
##$LB= 0.3
##$LEV0= 0
##$LPBIN= 0
##$MAXI= 10000
##$MC2= 0
##$MEAN= 0
##$ME_mod= 0
##$MI= 0
##$NCOEF= 0
##$NC_proc= -2
##$NLEV= 6
##$NOISF1= 0
##$NOISF2= 0
##$NSP= 0
##$NTH_PI= 0
##$NZP= 0
##$OFFSET= 16.44808
##$PC= 1
##$PHC0= -67.89188
##$PHC1= 6.032461
##$PH_mod= 1
##$PKNL= yes
##$PPARMOD= 0
##$PSCAL= 4
##$PSIGN= 0
##$REVERSE= no
##$SF= 250.130018488896
##$SI= 32768
##$SIGF1= 0
##$SIGF2= 0
##$SINO= 400
##$SIOLD= 32768
##$SREGLST= <1H.CDCl3>
##$SSB= 0
##$STSI= 32768
##$STSR= 0
##$SW_p= 5175.98343685301
##$SYMM= 0
##$S_DEV= 0
##$TDeff= 65536
##$TDoff= 0
##$TI= <Analysis number 999999
Compound Code 99
Book Reference 9
Project Code 9>
##$TILT= no
##$TM1= 0
##$TM2= 0
##$TOPLEV= 0
##$USERP1= <user>
##$USERP2= <user>
##$USERP3= <user>
##$USERP4= <user>
##$USERP5= <user>
##$WDW= 1
##$XDIM= 32768
##$YMAX_p= 307921771
##$YMIN_p= -74930
$$ End of Bruker specific parameters
$$ ---------------------------------
##NTUPLES= NMR SPECTRUM
##VAR_NAME=  FREQUENCY,     SPECTRUM/REAL,   SPECTRUM/IMAG
##SYMBOL=    X,             R,               I
##VAR_TYPE=  INDEPENDENT,   DEPENDENT,       DEPENDENT
##VAR_FORM=  AFFN,          ASDF,            ASDF
##VAR_DIM=   32768,         32768,           32768
##UNITS=     HZ,            ARBITRARY UNITS, ARBITRARY UNITS
##FACTOR=    0.157963299565203, 1,           1
##FIRST=     4114.15857023157, 0,            0
##LAST=      -1061.82486662144, 0,           0
##MIN=       -1061.82486662144, -74930,      0
##MAX=       4114.15857023157, 307921771,    0
$$ Real data points
##PAGE= N=1
##DATA TABLE= (X++(R..R)), XYDATA
$$ [...]
14759b7015k5048J4157j587P817J4920J3769Q120k668k1232O82j4983l923K2898
14746a4093J3968N801l771r846j0803n983l385N883J1900j515L753j3347q148
14733b9586O793k5409j7395Q237J1626J991r598J9116J4031n78J3911k5949j8797
14720e1607L057Q561J673M1818N574n393j7839K0864L0112j3465j2704p656M456
14707G451K597n339r045m653j2963J2913P290j2258j0835j744J1018j923Q464
14694i027P289m136l029L953M25j1621n480j8125L498J4755p113j4915J349K4726
14680a7451K0117r320L4700n876r581K689J7756J898k3045j7719l209n264L446
14667a0859Q092K5704K372j327q906k8475j9365J8774J8744r585o199K620O623
$$ y = [-27015, -52063, -37906, -39493, -31676, -16756, -2987, 5133, 2465, -18767, -18085, -33068, -36991, -14093, -125, 5676, 1905, -7941, -18744, -24727, -28112, -22229, -10329, -11844, -8091, -21438, -29586, -22793, -48202, -65597, -57360, -45734, -43743, -53341, -34225, -20194, -20772, -6861, -32810, -51607, -48550, -39989, -38316, 3502, 9076, 3683, -14156, 6708, 36820, 23355, 10651, 2995, 7451, 10048, 4709, -4336, -8989, -21952, -9039, -1749, -14007, -24842, -26586, -15568, -17491, -9027, -1738, -5874, -8903, -4950, -4525, -16146, -21626, -39751, -36253, -21498, -28611, -43526, -42177, -17451, 2666, -6654, 28046, 22170, 12589, 15278, 33034, 34932, 11887, -5832, -9041, -14305, -10859, -2767, 22937, 25309, 23982, 15076, -13399, -32764, -13990, 4754, -4831, -11030, -8410, -1787]
14654a787K271l281n433R872K717k4394j6518m645J6812J2805o513Q168J5856
14641E930k5751j2137j875k1146K8274L5970M229J02j910r212j1052o452Q085
14628f945J3583K7204K099q383J5344Q955J242k2944k941n433j4709k2417p177
14615b2522l365J7573R048j2024j0680j0776J6506K3943j6658j8026Q173J4989
14603c819J1822p850r621J3619j58M85m207k240M950o523K395m533k418L0454
14589B2356J1256l023l817J7481m203j4182q811o359J2944n593j1201O787j180
14576A2455l5819q178M421N968K8277O177q61J1483j7171j0850r234K7190M235
14563A8093k582j5969n667q48N533l623K253k3778K044J3404O482j6217k1502
$$ y = [-1787, 484, -2797, -8230, 1642, 4359, -20035, -36553, -41198, -24386, -11581, -18094, -9926, 5930, -19821, -31958, -33833, -54979, -26705, 9265, 13494, 13596, 11686, 2474, -8578, -15030, -6945, 6638, 33842, 35941, 27558, 42902, 51857, 53099, 30155, 27214, 21781, 7072, -15345, -22522, -25887, -8314, 734, -11290, -21970, -32746, -16240, 7703, -8955, -26981, -18808, -3819, 8003, 153, -9468, 4151, 3993, 4478, 271, -1969, 2981, -3542, -1147, -5680, -8098, 22356, 33612, 30589, 26772, 44253, 40050, 25868, 17057, 10698, 23642, 18049, 6848, 13635, 12455, -23364, -31542, -27121, -21153, 7124, 13301, 12440, 23923, 6752, -4098, -13332, 13858, 18093, 15511, -458, -6125, -6973, -1440, -5063, -2810, -26588, -24544, -11140, -4658, -20875, -42377]
14550d2377k761N650R186O805J4531K464j561j2473L242J1627Q482r055k055J5412
14536G117L187P665l2196k6214L172L1889K454J048l215K996O397k0281L972O732
14522e277k2945J8616Q894j2476k1393N615J1493L443p821L250J3305R868o584
14509b012j1466l046j619m715j5331Q640J2267O040N684J4640M296l691R85j0632
14495D0J8505j144j8726k1154O76K2323p433j6271R681P65l214k784L441j2270
14481b7565r911N694K9633K4028J3304o165n999j5576k0653k0839l238K0179J1620
14468e488M408P510K291j0528j1666l3678j6140J7191J8888J2710r355R343O797
14455g717O976J2421k5109k1213J6174K0639o080p787j27O618m017q881J058O841
$$ y = [-42377, -45138, -39488, -30302, -23497, -8966, -6502, -8063, -20536, -17294, -5667, 2815, -6240, -8295, 7117, 10304, 17969, -14227, -40441, -37269, -5380, -2926, -1878, -5093, -2097, 4300, -15981, -12009, -5277, -28222, -9606, -712, -13188, -34581, -28966, -17473, -14030, -21851, -18601, -5296, 4572, -2012, -13478, -16524, -18143, -22858, -38189, -29549, -17282, -11242, -5558, 9082, 13378, 9687, 10672, 40, 18545, 17401, -1325, -22479, -21803, 520, -6913, -23184, -13503, -12738, -15952, -18736, -15295, -27565, -37476, -31782, -2149, 21879, 35183, 29018, 23019, 7443, -13210, -34049, -37287, -17108, -5488, -1080, 6430, 8721, -1807, -13473, -47151, -63291, -46100, -27212, -14502, -23857, -14514, -7717, -741, 11680, -13429, -34642, -18468, 2171, -3909, -11696, -11823, -5205, -9222, -18103, -17045, -10204]
14441a0204j3533m826J663m38J5014Q497j5009k392j9900j5882Q828J4064M714
14428b9404Q098J4602J3150R615k6660j7431m05J3219j745M774p934n259M685
14415b0695J4247j287r124m027J2817j9017j3966M038J0068R97J741K6057J8316
14402B0165N42r583P4r29Q416p226k0773k2072j1034j6297O407P854j057K4022
14388b1491J5358J1233M467j0397j2623j7778j000J7918j3711L440K2265j0422
14376a2741L930P699j8097P870P695o734K026j0278q70j91p206j2996j776J060
14362d0609L254J1927J3497P037J3040K418j892o821q109J3260o35k3109O486
14349a0256k05n080J3058O496J293P895j048K747n894l263L3418J1051k2860j3324
$$ y = [-10204, -23737, -28563, -26900, -27338, -12324, -3827, -18836, -21228, -41128, -57010, -48182, -34118, -29404, -21306, -6704, 6446, 16061, -10599, -28030, -28435, -15216, -16961, -12187, -20121, -25380, -20695, -6448, -7735, -16859, -20886, -8069, -27086, -41052, -37014, -26946, -25949, -24208, 1849, 20165, 20707, 11124, 11198, 10269, 18685, 11459, -9314, -31386, -42420, -58717, -52310, -44456, -45513, -21491, -6133, 5100, 9567, -830, -13453, -31231, -32231, -14313, -28024, -24584, -2319, -12741, -8811, -1112, -19209, -11339, -3644, -10378, -8352, -18630, -19500, -19691, -26897, -39893, -41669, -40609, -37355, -25428, -11931, -4894, 8146, 10564, 8672, 1851, -6258, 7002, 6367, -16742, -10256, -10461, -15541, -2483, 4013, 5306, 13201, 12153, 14900, 9006, 5743, 39161, 50212, 27352, 14028]
14335A4028K22M547j8557K6402P915j9655k4607o935J1288j394j680J2373J6344
14322B0291k4809j8523j123L097q400q513Q755M8145J3352k6581j8935N324J2511
14309D591q680j271N70k2665j436L500P693l438r940o00R098J8911Q227K887Q471
14294A5918M201k268m206J875j3699j4812j4844l966J2250J9035L993j9482O862
14281i143P82j0371j8334m664o772M838J1159J3157Q397p84j1350J0306K7773
14268A4994p702m140L2124j933j257N868j0268l4306j2870M462j4888j2554L24
14255d2146Q365r478j245K4041L367k1640J9421K7568j417j4020p207k858K886
14242a4363m921r765O133j498j2574K3312J9818K639k922j6945J837M609J7918
$$ y = [14028, 14250, 18797, 240, 26642, 34557, 14902, -9705, -16640, -5352, -6746, -8426, 3947, 20291, -4518, -23041, -24164, -21067, -29467, -37980, -29225, 18920, 32272, 5691, -13244, -7920, 4591, -4089, -5360, -4790, -27455, -28891, -25391, -17698, -21136, -31076, -31676, -22578, -3667, 4560, 7447, 15918, 20119, 17851, 13645, 15520, 1821, -12991, -27835, -31801, -19551, -516, 3477, -16005, -9143, -8361, -18732, -37066, -41730, -48502, -43664, -32505, -19348, -10951, -11735, -23085, -12779, 14994, 7292, 3152, 35276, 33343, 32086, 37954, 27686, -6620, -19490, -15028, -29916, -42470, -42146, -33781, -43259, -44504, -20463, -17096, -38736, -19315, 8253, 6836, -7184, -14391, -17249, -14363, -19284, -29049, -22916, -24414, -36988, -13676, 6142, 8781, 5859, -11086, -9249, -4640, 13278]
14229A3278K1230J2401j2976k9006n008L663M031J3821n904o373N699l535j3581
14216b260j2478Q26N02m211l364M704Q671J5383J4558m475j6418M639j1509L353
14202b079j4482k3724J0788j0378O029K2263N130M819p592j2604p413k2015n979
14189e7237K1809K0727R44K2957M358j0349j5706o75J5764K996P058p874J5227
14176A9999o740k3189L719j7271J763l415j92J4738n332R58K0695N361j3258O648
14162D484J6916K0748j5187k9581o965R167Q335R355l325j6246k397O109L059
14149D472J1892m234m39j010P597q658k2532l482l337j546r255k547L60q573J2751
14134b8541J5113J7188J1926j0625R696N992p208j7159o744J3152n964P618j9541
$$ y = [13278, 34508, 46909, 33933, 4927, -81, 3582, 7613, 21434, 15530, 9157, 14856, 11321, -2260, -14738, -13912, -13410, -17621, -20985, -16281, -7610, 7773, 22331, 17856, 1438, 6077, -5432, -2079, -16561, -40285, -29497, -39875, -33846, -11583, -6453, -1634, -9226, -21830, -29243, -51258, -57237, -35428, -14701, -13757, 9200, 13558, 3209, -12497, -13172, 2592, 5588, 12646, 4772, 19999, 13259, -9930, -6211, -23482, -21719, -25134, -25326, -10588, -15920, -14962, 5733, 11094, -2164, 4484, 21400, 42148, 26961, -2620, -9585, -418, 7917, 17272, 13947, -2299, -4696, 1413, 4472, 16364, 12130, 11691, 10681, 18278, 9620, -12912, -16394, -19731, -21277, -30532, -33079, -32719, -41292, -28541, -13428, 3760, 15686, 5061, 14757, 20749, 13541, -3618, -10362, 2790, -3174, 4444, -15097]
14121a5097j3507K0483L812j5040L4457L5950j0096r544m780j2192K883l516K099
14108A5912N073j2937j8047j1061O685l65r466n941J3487J7822j7729M312J3484
14095A229L58J5104m319j1000j1474j4272R543J8748k758n096J5854J3239O131
14082C1287n562K408l5401j0960L768j1572j6232R617J2613R50J1405J484j4900
14069b1095P726J7354K376j4384P327R908L626j1402n097J54o694j91J863p801
14055a6330k485J5885k675q840Q307P697M211r354j6760j6568L890p455J7646
14042b2831J0016l226K6093K0466l298j6007k8989j1391l0510j720L1494k497
14030c2400n287L070J4426N173l401m405J6933K3757J2314j6123p758J2943N536
$$ y = [-15097, -28604, -8121, -4309, -19349, 15108, 51058, 40962, 31418, 26638, 14446, 17329, 13813, 15912, 20985, 8048, -9999, -21060, -14375, -14740, -24206, -30147, -16660, 1162, -16567, -12255, 1229, 1587, 16691, 12372, 1372, -10102, -24374, -14831, 3917, 1159, -3937, 11917, 25156, 31287, 25725, 28133, -7268, -18228, -14460, -26032, -42264, -32647, -20034, -19084, -7679, -6195, -21095, -13369, 3985, 6361, -8023, -696, 9212, 12838, 1436, -3661, -3507, -10201, -10392, -8529, -16330, -18815, -2930, -5605, -14445, -6138, 1559, 5770, -3584, -20344, -36912, -33022, -40477, -22831, -12815, -16041, 10052, 30518, 27220, 11213, -17776, -29167, -59677, -61397, -29903, -32400, -37687, -34617, -20191, -15018, -18419, -22824, -5891, 17866, 30180, 14057, 6299, 19242, 24778]
14017B4778k5904J0180J6211R967K1369j7269k3041j9408K286J4725M995q489
14005A0400j3128j9987m626r109K474J9161J9629Q203J7268j9930k4323j442l705
13992a9115n218j5819L381K9066q013p787J725l477M514J1763o10p82K2900J0392
13978B2920j0090k9612j4183J438O43J1400P679L474J8630j2542p178M191J895
13965a335K9623J0822l810n026l5822o020K6353K0155k0266l947K2899j7595P983
13952B4014K1408r779r376r998p448K5414Q396k4967m902j863j2023P096m332
13939A640j9639r211N599M163o276K053l518k692K9803J4745l884M28j697q813
13925B701n929J87n450k876L881J9241q635l394l546k0812L348j5034o332J3148
$$ y = [24778, -1126, 9054, 25265, 35232, 56601, 39332, 16291, -3117, -831, 13894, 18889, 10400, -2728, -22715, -27341, -36450, -33976, -14815, 4814, 13017, 30285, 10355, -13968, -15410, -19115, -24333, -40152, -36771, -7705, -15718, -23505, -21780, -25257, -20743, -8980, -9590, -10372, 12528, 22920, 12830, -16782, -30965, -29527, -28884, -17484, -9805, -6331, 12299, -243, -7421, -3230, -1335, 28288, 39110, 35300, 30274, -5548, -11568, 14785, 34940, 14674, 10727, 33626, 16031, 24014, 45422, 35643, 26267, 16269, 8821, 34235, 42631, 17664, 12762, 10899, -1124, 5972, 1640, -17999, -27210, -21611, -17448, -23724, -21671, -25189, -27881, 1922, 16667, 12783, 13211, 11514, 2701, -3228, -3041, -8491, -11367, -7486, 11755, 3120, -274, -3820, -24632, -21284, -36318, -42650, -29502]
13911b9502J3240J0374l975J0875N606J165l868j0123r573j0488J4416K6054J7881
13898C2082j4002j8357j7937j667N053n178M329L588J7471Q949k292k4856j376
13885a4193K640m047o995P479r536k4818R484J8263J0616L594P71p625l527j276
13871a9170K7127Q11K398J073K777j6929m087q273j1317J2906N034L48o703m323
13857a8328J3966R257q600j1630J6948R011N023j6656o970O338J6594k792K363
13844A4524J5008O488Q916j0626k5975k3602K0997K5150L313J685R890K710j1580
13831C6898J7129r773l5679n995J9120j2280k071J4146N92j270j2928J4133J6297
13818C8319N2L996J4168r968n136J102M455K0666K3006n922j0856n244j3301k6992
$$ y = [-29502, -16262, -5888, -9863, 1012, 6618, 7783, 3915, -6208, -15781, -26269, -11853, 14201, 32082, 18080, -277, -18214, -19881, -14828, -20006, -15677, -12089, 5382, 14331, 12039, -12817, -14193, -11553, -15600, -22595, -15116, -24652, -49470, -39986, -21723, -11107, -7513, -6742, -14367, -17894, -19170, 7957, 8768, 11166, 12239, 15016, -1913, -6000, -14273, -25590, -12684, -7650, -7302, -14005, -18328, -4362, 4895, -3705, -15335, 1613, 10624, 15647, -1009, -7979, -1641, 14953, 12161, 14524, 29532, 36020, 44936, 34310, 8335, -15267, 5730, 30880, 34193, 35878, 45768, 48478, 36898, 54027, 44254, 8575, 2580, 21700, 9420, 7349, 21495, 22087, 20817, 7889, 22022, 38319, 38371, 42367, 56535, 46567, 41431, 42533, 46988, 67654, 90660, 84738, 73882, 68638, 55337, 28345]
13804B8345O486N507k816J228J9748J6165J6983j255M887n989l2539j7447m815
13791C4488L805o050P777J329O612P696n009j2124J7904J7488j6472j5469q016
13778C3959k601J79j1802j3295p847j5551R485K1945J2067j4889k7273J2578J4858
13765A1813K117j4083j8445j7541K045J7750Q093m355J6465J9670j0113q073P920
13752A3263Q147l1004j7836J570O52R550k328J1749O50J563n2J3760l781j8977
13738a3074j9931J0135J4072M071n705K695M846P522N448k860m571M740L079J785
13724A2252k113j5681j4463p507n82R09N757L0255J0888o679m111j871J9623J2022
13710C8699M913j3363M830J0488l561k2798r36m432K432Q819o672P516j3745l643
$$ y = [28345, 34831, 40338, 37522, 38750, 58498, 74663, 91646, 90391, 95278, 89289, 56750, 39303, 34488, 38293, 32243, 40020, 41349, 47961, 55657, 50648, 38524, 56428, 73916, 57444, 41975, 33959, 31358, 31537, 19735, 6440, -1407, -16958, -7473, 14472, 26539, 11650, -15623, -3045, 11813, 13930, -153, -18598, -36139, -34094, -16344, -8251, -12606, 3859, 23529, 13416, 5343, 13263, 21410, -9594, -27430, -25860, -25208, -15658, -17986, -6237, -5587, -4024, -4076, 9684, 5903, -13074, -33005, -22870, -8798, -4727, -10432, -7737, -2891, 4631, 10079, 7219, 2648, 7388, 10467, 12252, 10139, -5542, -20005, -27512, -28094, -27185, -21428, 8827, 19715, 13036, 8925, 7054, 26677, 38699, 43612, 30249, 35079, 45567, 42006, 19208, 18272, 13840, 16272, 25091, 18419, 25935, 12190, 8547]
13696H547K4023O113j5443j3270j852M169J4647n975j812M17o829N763k407J467
13682A7558p592n569j892J5757j2298r548j763M339q416K6350K5485k0224j2655
13669I532Q979j071L375k301J51p863j3049N775J4851j1390j3334j793J7736m004
13655E594J5267R874j0683k2209j4113o509J5578P137K369R940m70M547J7228
13642C3550O421p97O846k102k1487j5290L496l496M334M982m045j2636J259R678
13628A0713Q650J8226k227j4225N085j5445l5598j5786K6843J1357k5111k592
13616c0110K9778j572J3660J841J147O78R4n291p024J7845J0507J611r205j7463
13602F496p632N162q934p940J0322o125L768j1366J8291K2045j3497k988J1373
$$ y = [8547, 32570, 38683, 23240, 9970, 8118, 12287, 26934, 20959, 19147, 19564, 12735, 18498, 16091, 17558, 9966, 4397, 2505, 18262, 5964, -3584, -5347, -1008, -9424, 16926, 42411, 22187, 9532, 18511, 17440, 20815, 18514, 18665, 10802, -2247, 3528, 18379, 6989, -6345, -8138, 9598, 5594, 20861, 30735, 20052, -2157, -16270, -22779, -7201, -64, 2305, 12245, 11775, 16322, 33550, 39971, 39174, 46020, 43918, 22431, 7141, 10637, 7141, 11475, 16457, 12412, -224, 1035, 10713, 19363, 37589, 35362, 21137, 26222, 10777, -24821, -40607, -13764, -2407, -27518, -30110, -332, -1904, 11756, 13597, 14744, 15422, 15516, 10225, 3201, 21046, 31553, 33164, 23959, 6496, -1136, 4026, -4908, -12848, -2526, -8651, -4883, -16249, 2042, 24087, 10590, 7602, 18975]
13589A8975q096q425n472j6836n880l331k504J1012K8871K109o392j210O243R709
13575A8773J1860j3703r54l467k006q047j4600Q630J5786j1334l334Q339R419
13562A5362k195j6282J363J0724q649l550k389j5779Q327R295L530m260j6791
13549b1294J5866J6318m921J539R866r973l798O370O149k021o983J050O736J1051
13535B5955l976k350J9365L222o623j2357o510l249p363q962p666J6602J9684
13522B5772j3472j9760k0379M069P091P945k195J0728m023j773J8712J1574O766
13509C1055j7934J0666L1708k7147j0436p507L748k015J4132J7531L733O507R11
13496E4952j659m955n353k905J407k240J4438m192l2149L49P346J2821l606J3681
$$ y = [18975, 10879, 2454, -3018, -19854, -25734, -29065, -31569, -20557, 8314, 10423, 4031, 2821, 9064, 18773, 30633, 16930, 15976, 12509, 10503, 2456, -12144, -3514, 12272, 938, -2396, 5943, 15362, 13167, -3115, -1752, 8972, 323, -3227, -5616, -21395, -13068, -3773, -243, -4503, -21294, -5428, 10890, 5969, 7508, 17374, 7401, 3603, 9973, 16122, 14101, 7118, 8168, 14904, 25955, 21979, 19629, 38994, 42216, 35593, 23236, 16726, 13477, 6114, -2848, -10514, 6088, 25772, 12300, -7460, -27839, -23770, -16679, -8734, -10929, -201, -4224, -5997, 12715, 24289, 31055, 13121, 23787, 55495, 28348, 17912, 10405, 14153, 12138, 26270, 43801, 47534, 54041, 54952, 53293, 48338, 42985, 40080, 41487, 39247, 53685, 49493, 17344, 17693, 25039, 37860, 34254, 47935]
13482D7935j0980o220J0562J1935L2075R759j4804j7261j1450q183K113j0074
13470C5407M584N039K687R345k197K228j792L666m730L589k8626k9765J0604L0103
13456D0142K1491K0913J888j193l423l172j2421j1519L128J697N295l45k096q219
13442E2166K361J6691j368j7762J9172L8436j868j752j0150R60M516m618J696
13429I8480K7796L0332n773K317r69n009J7724j5438k480Q739k6169j3754K082
13416A17878K3786K3060Q883Q769j2511J5950J3338L545r68M505m614m728J961
13403A98854J5312J5103L6654J9646j0361J1460m431J1527L3341L4840N6950M5712
13391D64607L4743M4669O7588Q2232J13085J11324J54258K08518K99504L97522
$$ y = [47935, 36955, 30735, 41297, 53232, 85307, 95066, 80262, 63001, 51551, 43368, 45481, 35407, 39991, 45030, 47717, 57062, 54865, 57093, 55301, 58967, 54237, 57826, 29200, -565, 10039, 40142, 61633, 82546, 84434, 83241, 79818, 76646, 64225, 52706, 55834, 57531, 62826, 62481, 60385, 52166, 54527, 71218, 69850, 52088, 71260, 109696, 107828, 106076, 95926, 96886, 101402, 96784, 98480, 126276, 156608, 150835, 153152, 152183, 147174, 164898, 149460, 146980, 155719, 129550, 115796, 117878, 141664, 164724, 173607, 182376, 169865, 185815, 199153, 202698, 201730, 206235, 201621, 196893, 198854, 214166, 229269, 265923, 285569, 275208, 286668, 282237, 293764, 327105, 361945, 418895, 464607, 499350, 544019, 611607, 693839, 806924, 918248, 1072506, 1281024, 1580528, 1978050]
13381A978050N70489Q07797J106233J498765J999731K329214J750271R0677j432610
13372A0698617j983799j821564j403709r96103o50086l74002k01391o5903J08877
13363C310937K92377N03916O81898N50715J97378K3271K67580P11907J060340
13354G600319Q35641J24004j01077K33850Q23900J440138J723160J256026J06018
13345A4041979j076674j613533j483264j007182m12037J94105N50526J27656o55025
13336H666551q65890o00736j94329L8865j62470n21147o03555m37065k55021l5859
13326E029344J74282L27033N81414Q81899J269699J759419K233084K231938J016294
13317A5504406r12007k126612k283631j887108j397688r82658p02981m94468l72154
$$ y = [1978050, 2548539, 3356336, 4462569, 5961334, 7961065, 10290279, 12040550, 12131227, 10698617, 8714818, 6893254, 5489545, 4493442, 3843356, 3469354, 3267963, 3202060, 3310937, 3603314, 4107230, 4789128, 5339843, 5537221, 5560492, 5828072, 6539979, 7600319, 8435960, 8559964, 8458887, 8692737, 9516637, 10956775, 12679935, 13935961, 14041979, 12965305, 11351772, 9868508, 8861326, 8449289, 8643394, 9193920, 9321576, 8666551, 7800661, 7199925, 7005596, 7044461, 6881991, 6360844, 5757289, 5320224, 5065203, 5029344, 5203626, 5530659, 6112073, 6993972, 8263671, 10023090, 12256174, 14488112, 15504406, 14592399, 12465787, 10182156, 8295048, 6897360, 5914702, 5211721, 4717253, 4345099]
13308D345099k95996k26675j64855j42021j59932j33153j08369j05885o9763p4213
13298B864237o1435o1821n3371o2217p6082o0901k6404l4525m9212n3663m3235
13287B281371k3939l3692j8348p095k4055k0504m0750o9462m5052n6915q5437
13276A856122q5432p5399o4441n2930n1778l4326n9347k8378l3555n4027n6855
13265A259654n7312m2665m6954p0529m6689l5199l3592l9576m2669m8190m0130
13254G56149k5363j7292m0436l0124m968r794j0797j9115l1244k4542j4319k3757
13242E04398j1961j4131j1437k3012j7844j3591j3110N669j0984l4067n937j0957
13230C43036k1658k7274j217l256p029k5869k354o242q638N465L235j7471j1116
$$ y = [4345099, 4049103, 3822428, 3657573, 3515552, 3355620, 3222467, 3114098, 3008213, 2938450, 2864237, 2802802, 2740981, 2687610, 2625393, 2549311, 2488410, 2462006, 2427481, 2378269, 2324606, 2281371, 2257432, 2223740, 2205392, 2198297, 2174242, 2153738, 2112988, 2043526, 1998474, 1941559, 1856122, 1770690, 1695291, 1630850, 1577920, 1526142, 1491816, 1432469, 1404091, 1370536, 1316509, 1259654, 1202342, 1159677, 1112723, 1042194, 995505, 960306, 926714, 887138, 844469, 796279, 756149, 730786, 713494, 673058, 642934, 637966, 628172, 617375, 598260, 567016, 542474, 528155, 504398, 492437, 478306, 466869, 443857, 426013, 412422, 399312, 404981, 393997, 359930, 353993, 343036, 321378, 294104, 292887, 289631, 282602, 256733, 254379, 248137, 239499, 244964, 248199, 230728, 219612]
13217B19612M456j1793k2378k124J2088R208p415k3277k179M530j3613m782J6455
13204A78788Q034q065p048j1130K5J5435p580k0830l2195j6712K0800K0527Q67
13191A40916j5534q306j4932J1362O202j4831j8239J4377M566J4894n061K01o433
13178A09182n077j9541l243k46K0700Q312j6635J1252p591k6178k3748j324J8755
13165F4618J8491j974o050J1492J6703J1059q453r658k5477k5107n801K5592J2142
13152G7577n372N440j3100o558j650K5896P076j60L886j4530k206n094k2546O462
13138E5121R530j1062Q650Q549J0410j3291J99n094N127J3177n383k0151k6751
13125B9031k344J3959R714Q574J0165O753l509O885j4918o25J6101Q662J104j7501
$$ y = [219612, 224068, 212275, 189897, 187773, 199861, 209069, 201654, 178377, 176198, 180728, 167115, 162333, 178788, 186822, 178757, 171709, 160579, 160604, 176039, 168459, 147629, 115434, 98722, 119522, 140049, 140916, 125382, 117076, 102144, 113506, 119708, 104877, 86638, 101015, 105581, 120475, 115414, 115615, 109182, 104105, 84564, 81321, 81075, 101775, 110087, 93452, 104704, 97113, 70935, 47187, 45863, 64618, 83109, 81135, 75085, 86577, 103280, 114339, 105886, 96228, 70751, 45644, 39843, 65435, 77577, 72205, 77645, 64545, 57987, 56337, 82233, 89309, 89149, 93035, 78505, 76299, 71205, 48659, 55121, 64651, 53589, 62239, 70788, 81198, 67907, 68106, 63012, 68139, 81316, 75933, 55782, 29031, 26687, 40646, 50360, 58934, 69099, 75852, 72343, 79228, 64310, 63685, 79786, 88448, 89552, 72051]
13111G2051k2902m591J4046K299M697m805l029j5099j1920R069J3101K2045J8887
13098I3849k107p669j6333j4901j144l022l290M012K755o683o202n28P032K3041
13084F8810O850j877k470o740l3962n451q862J5155Q033r26k4128J0451K801q522
13070A9162J2573Q322k8035J034J5474j2593J180j015q623K5995m161k1982L698
13057A1029J6941J1050L0514j1381j4942l0768j7735J5565o33M295Q719J079J0947
13044C4680o853j0302m164J1244M939j153p024M695J0339n977q125J4491P792
13031D4582k8402j9587M776L646J6884M431o53j0780O217r238J0895Q225N726
13018C6722M270o205J6125K945j4391j3338M233n334r933N588n186N997j6567
$$ y = [72051, 49149, 44558, 58604, 60903, 65600, 60795, 57766, 42667, 30747, 39816, 52917, 74962, 93849, 91742, 84073, 67740, 52839, 51695, 48673, 45383, 49395, 52150, 45467, 39265, 38737, 45769, 68810, 75660, 73783, 71313, 64573, 30611, 25160, 16298, 31453, 39486, 38560, 14432, 24883, 27684, 19162, 31735, 40057, 12022, 13056, 28530, 15937, 17117, 16102, 7479, 33474, 29313, 7331, 11029, 27970, 39020, 69534, 58153, 43211, 12443, -5292, 10273, 9640, 13935, 22654, 23733, 34680, 27827, 17525, 13361, 24605, 29544, 28391, 21367, 26062, 36401, 30424, 22299, 36790, 44582, 16180, -3407, 1369, 5015, 21899, 26330, 25677, 14897, 21114, 11876, 22771, 30996, 36722, 40992, 34787, 50912, 53857, 39466, 26128, 30361, 25027, 15094, 20682, 15496, 21493, 4926]
13005D926Q636M206K4686P689l4901k0007k2703Q316L1983J3265l1l375j078j0048
12991A1564j146Q89J3357K4766J7283k1883k6712k4761Q420k1824l98R516K2716
12978A1787K4637j6132j6868M723l864k697J1294j050l155l990p29K6171J0428
12965D0555O077j2381k0556M464Q226P510o60r729n762L45j6567j2313Q502J2425
12951A0136o918j425R1J3392J9234j6505Q65j015k6108j0512L4694J4522N409
12938C5860o464o345J9075j6584k9841l16M663J7408J8098j544P1M87Q23j6191
12924A9200j0584j7415K926q654R946k666J262J6953J1904n269K324o248r655
12911D024L587R036J0089N785J1706L1125J7221k667k5008k4211m797j9013p477
$$ y = [4926, 13562, 17768, 42454, 50143, 15242, -4765, -27468, -19152, 12831, 26096, 26065, 22690, 21612, 11564, 10418, 11307, 24664, 49430, 66713, 44830, 18118, -6643, 1777, -20047, -20445, -10929, 11787, 36424, 20292, 3424, 8147, 4283, 1586, 12880, 11830, 8675, 4685, 3956, 30127, 40555, 46632, 34251, 13695, 18159, 26385, 33895, 33235, 23506, 17744, 18089, 1522, -10791, -2289, 10136, 3218, 1793, 1884, 15276, 34510, 18005, 18870, 17855, -8253, -18765, 15929, 30451, 35860, 29396, 23051, 42126, 25542, -4299, -4615, 48, 17456, 35554, 34010, 34081, 34568, 35391, 19200, 8616, -8799, -5873, -14527, -4581, -7247, -5985, 10968, 22872, 17603, 19927, 13679, 4024, 7611, 16647, 26736, 32521, 44227, 75352, 92573, 89906, 64898, 40687, 35890, 16877, 9400]
12898I400M111P571K931M091K994k2826p933j7838r852M014R821J3500k586J5774
12884A3172J4484Q093l3959k3145J9944K5683J1723N632J6220l582j36j5621J278
12871C9786J0431M456J496j4434J219j1185r817o002m332J1701J2040Q09j2558
12858B3610m826r583j2307P387K2110K3604n439m515K0491K2366O327L646n689
12845H7182N862j7467j2303k4995k524k9620q722P704J5514Q114k0878j1202P53
12832b582l658j6308l457J2487K5214J0261r941n841J3170M041k7271n434J705
12819g614J2255K3958J0762o400k2862O988K615k3158j412J3363J0492j4234k2492
12806a7739J3572J6177j3833Q219n38K7502J9822j7329k2231Q40J4045J2018j0354
$$ y = [9400, 13511, 21082, 24013, 28104, 31098, 8272, 339, -17499, -27351, -23337, -13516, -16, -2602, 13172, 27656, 35749, 1790, -21355, -1411, 24272, 35995, 41627, 57847, 54265, 54129, 38508, 39786, 50217, 54673, 56169, 41735, 42954, 31769, 21952, 15950, 11618, 23319, 35359, 36168, 23610, 18784, 9201, -3106, 4281, 26391, 49995, 44556, 40041, 60532, 82898, 89225, 92871, 87182, 93044, 75577, 63274, 38279, 35755, 6135, -2587, 5117, 20631, 28745, 7867, -3335, -2582, -6240, -22548, -26005, -13518, 11696, 21957, 12016, 6175, 19345, 23386, -3885, -9319, -7614, 4641, 28599, 39361, 32961, 10099, 17087, 19702, -3456, -4868, 8495, 18987, 4753, -17739, -4167, 12010, -1823, 6396, 5858, 33360, 53182, 35853, 13622, 14462, 28507, 40525, 30171]
12793C0171j4959J8094J0703m652l3317j0024o811J2522J7403O342l439p682r589
12780D762j9523q59M844O364Q645j8748o435J3782J4640m981j4159J1505q146
12767h309J6728J0175o219R267O167j9722L678J078n323k4276k937L4369r360
12754E316k3290N191N448P29L542P749k442P584o515j0884j0038O247J4593J857
12740E087j6209k3797j2280N70R284K7159N301Q136q024N73K339P048M777j4805
12726d841k4193J8030M2325j2753j4334J4640M968j5433l90L548P494r102o5L320
12712A3214J6530o83j9726M936p647J817j6558j8224L837R233L164P413l817k523
12698i034p243j552K835J3027L38m093P030J3627K0623k4185j6586L52m290j744
$$ y = [30171, 15212, 33306, 44009, 39357, 6040, -3984, -10795, 1727, 19130, 25472, 22033, 14351, 4762, -14761, -15620, -10776, -4412, 4233, -14515, -20950, -7168, 7472, 2491, -11668, -163, -8309, 8419, 18594, 12375, 21642, 27809, 8087, 11765, 12843, 7520, -16756, -19693, 14676, 5316, -17974, -12783, -7335, -6606, -3064, 4685, 2243, 9827, 3312, -7572, -17610, -11363, 3230, 5087, -11122, -34919, -47199, -46629, -37345, -10186, -4885, 3251, -4773, -4200, -1861, 5187, 9964, -4841, -29034, -11004, 31321, 18568, 4234, 18874, 23842, 8409, 8019, 11567, 19061, 9959, 9894, 13214, 29744, 29061, 9335, 14271, 6624, 8441, -8117, -26341, -22504, -13271, -10107, -2694, -6511, -9034, -16277, -17829, -14994, -1967, -1629, -5722, 1308, 14935, 35558, 11373, -5213, -4861, -9151, -10895]
12684a0895q1j0063L027J1039J3146j0886j805L323o591o848O399R397j543j4774
12670a7155k2593Q323K4052K0018M443j5262J581j823m2374k2546K840K0673K4738
12657a5085j2611J5946J2741j943K2015J4106j3709j9106p824R511j2452j2425
12645b0836R623J0906j8828P407J1284J118j0671k781J2416J3433j1223l183j7247
12632a8582j3002K2591J5370R253M540J0949N862k989k2766j5705K352L123j1246
12619a0250j5430O007p335Q127J6593L841k625j3051Q982L634J3354r003j3266
12606a0422j0469p356J6795J2603J2390K646K28J0062m442k2765j5576J6878K7720
12593B8292j186j0205k4109l084j0699r235J7635q41L918J4135K1098l634j5738
$$ y = [-10895, -10976, -21039, -18012, -6973, 6173, -4713, -6518, -3195, -9786, -16634, -10235, -838, -2381, -17155, -39748, -31425, -7373, 12645, 17088, 1826, 3407, 1584, -40790, -63336, -60496, -39823, -15085, -27696, -11750, 991, -952, 21063, 35169, 21460, 2354, -5470, 4041, -8411, -20836, -11213, -307, -19135, -11728, -444, 674, -9997, -12778, -362, 13071, 1848, -1335, -18582, -31584, -8993, 6377, 15630, 20170, 31119, 36981, 33992, 11226, -4479, -2127, 996, -10250, -25680, -19673, -27008, -18881, -2288, 1553, -1072, -14123, -5141, -1507, 11847, 2844, -10422, -20891, -28247, -11452, 1151, 13541, 16187, 16415, 26477, 22035, -730, -16306, 572, 28292, 27106, 16901, -7208, -10292, -20991, -30226, -12591, -13432, -9514, 4621, 25719, 22085, 6347]
12580F347L547j8497r279J3363o602K449K2919j4171j88K3378j6469l1360j2716
12567c7279L1999R317K4534m771k2678k5497l60O953K5662Q668O509j5470j2631
12554e044j703p660j035K0489K3263K1707P530J1921k22q609k0400k3231M33n470
12540A1969O503P661L155K420j0130r256Q061Q316j2192J3021P744k0900k0029
12527c657k114J4754r212M583J0846l324k0955n405J3611L2210L903M218K0190
12514E9648K0562L639j8427r499M947k6858O18J3291K029P308J0082j457j1763
12501E4120p703n708Q122j2998l961N006k221j7357j1560K4950J3620J1227k403
12488E3134j4817R156R213o023K511J9232L0807L3396K0162l1852n2981k4420
$$ y = [6347, 9894, -8603, -17882, -4519, -11121, -8672, 14247, 76, -112, 23266, 6797, -24563, -37279, -5280, 4037, 28571, 23800, 1122, -24375, -24735, -17782, 7880, 16548, 23057, 7587, -5044, -6747, -14407, -15442, 5047, 28310, 50017, 57547, 69468, 69246, 60637, 40237, 17006, 17439, 11969, 18472, 26133, 29288, 31708, 21578, 12322, 20383, 28699, 16507, 29528, 37272, 16372, -3657, -5771, 8983, -229, 4354, 15200, 11876, -9079, -14484, -873, 31337, 35240, 39458, 59648, 80210, 83849, 65422, 55923, 60870, 34012, 34630, 47921, 49950, 57258, 67340, 65883, 54120, 46417, 40709, 48831, 35833, 31872, 36878, 34657, 17300, 5740, 30690, 44310, 55537, 53134, 38317, 47473, 56686, 50663, 53174, 72406, 103213, 136609, 156771, 124919, 71938, 47518]
12476D7518j534J1724Q066O398J346J7680K170l6236p062j9491j2168J974J3118
12463C3503p621j7590K1332J9920K605q489j4421o644l814P139l392j1210J1791
12450B3109l77K193K225j7060p456L130J0348J5176l105k2252j8870r9J6020J2910
12436A5892j3562k0766j1308K1000M424k489K6550R774m227M315O717k0958K563
12423A7925l681q120l220l0408J0933P218J2773R771j0432j686N324J224l532
12410D089o4J756M838n653l390j9276k5312J3277K6568l542m399R515p729p314
12396a6636N987K263k111O555J2127p560r676j0850q061O103P040O046m229O26
12382a2376J6952J8151N338p247k2262j064P770K5758j608j5166m979k21Q831
$$ y = [47518, 45984, 57708, 65774, 72172, 73518, 91198, 93368, 57132, 50070, 30579, 18411, 20385, 33503, 25882, 8292, 29624, 49544, 52149, 43660, 29239, 22595, 18781, 25920, 22528, 11318, 23109, 22732, 24925, 27150, 10090, 2634, 5764, 16112, 31288, 28183, 5931, -12939, -13038, 2982, 15892, 2330, -18436, -29744, -8744, -4320, -6809, 19741, 29515, 25288, 29603, 36320, 15362, 17925, 14244, 6124, 2904, -27504, -16571, -9353, 3420, 13191, 2759, 1073, 6397, 7621, 4089, 4025, 5781, 10619, 4966, 1576, -17700, -43012, -29735, -3167, -6709, -11108, -1593, -9322, -16636, -10649, -8386, -10497, -3942, 8185, 625, -9051, -19901, -27962, -21859, -14819, -8773, -13002, -12376, 4576, 22727, 28065, 20818, -1444, -2508, 5262, 31020, 29412, 14246, 9267, 9046, 17877]
12369A7877J1282j0205k8511q604J7944K362K2596P50l5471j1223M080J1627K0295
12356A4799n939k3568J74r074q192K1839J6594j806O27n974n323J5503r029O50
12342A281P23j7728j0431n587L659J1597l379m953R374J9960K869q796j9655Q281
12328a2785L872n793P350Q554J6718j116J801O314r469j2983p022J1054L060J7438
12314B6993J0903r618j0194K2181O581q786j435p728j8037k0424j3619J9745M904
12301A466J8465J244j2276N498K1837j324n482j5947J850J9272J9933Q479j9221
12288D3794l6435L708K1944J2297M689j271J4077J6310m716j90M792j2349l2374
12275C4276j3537J2560P184R419K638l481q034o922Q810J6277j7064k5544j9180
$$ y = [17877, 29159, 18954, -9557, -18161, -217, 2145, 24741, 25491, -9980, -21203, -17123, -5496, 14799, 8860, -14708, -14534, -23608, -31800, -9961, 6633, 4827, 5454, -520, -5843, 9660, 631, 1281, 2004, -15724, -26155, -31742, -28083, -16486, -19865, -24818, -15444, 4516, 7385, -1411, -21066, -12785, -8913, -14706, -7356, 1198, 17916, 16800, 18601, 24915, 15446, 2463, -4559, 6495, 9555, 26993, 37896, 28278, 18084, 40265, 46846, 38060, 36625, 28897, 10860, -9564, -23183, -3438, 1466, 19931, 21175, 8899, 14397, 36234, 34910, 29428, 13481, 15331, 34603, 54536, 63015, 43794, 7359, 11067, 33011, 45308, 49997, 48726, 62803, 79113, 74397, 74207, 78999, 66650, 34276, 20739, 33299, 40483, 49902, 52540, 49059, 41025, 34103, 42913, 59190, 42126, 16582, -2598]
12262b598Q342K2554J3858j2567q197J6561R17q380J7099M5710L103l0168j9828
12249D6406j2106M863l056p183o052j218j7511p272J1151K1517J1260l3127j1272
12236c600j3618r105J7318J1942P093j441L899J2185J694k4287k171J010k551
12223a632K0847K9152J7823j4699j0907J1919j2528j6251j8497N24Q59Q58P277
12210A4745j3595k6920J1149K8337K0989o812j1964O089O880n176r718j455p949
12197D600J0591r364k2627K3124L4444q570l2262M164K8698m044j5310p465q223
12184b244j8623m927K595j1465j822K6547J1247N815Q513J377p401J597j3032
12171a823j4305Q840k691R177k392l406m071p732k80J2396J0008j5860l134q049
$$ y = [-2598, 5744, 28298, 42156, 29589, 21392, 37953, 38870, 30490, 47589, 93299, 96402, 66234, 46406, 34300, 39163, 36107, 28924, 22872, 21654, 4143, -3129, 8022, 29539, 40799, 7672, -3600, -17218, -26323, -9005, 2937, 10030, 8589, 12488, 24673, 26367, 2080, -91, 919, -1632, 19215, 48367, 66190, 51491, 40584, 52503, 39975, 23724, 5227, 5751, 6610, 7468, 14745, 1150, -25770, -14621, 13716, 34705, 27893, 15929, 22018, 28898, 23722, 14004, 12549, 4600, 15191, 5827, -16800, 6324, 40768, 32198, -64, 4100, 32798, 28754, 13444, 5979, -2244, -20867, -25794, -23199, -34664, -36486, -9939, 1308, 7123, 15636, 17013, 9612, 11209, -1823, -16128, -7288, -9979, -802, -3194, -6600, -10671, -18403, -18683, -6287, 3721, -12139, -15273, -23322]
12157b3322o439J0062p539M435R849K8403j3663k7244m241M316J4841J3106k854
12144b90O696J8295k2857K2403n017j700L542K839M159q253k6271n425J8607L819
12130A0547J5198P112J2056k3995k1088J1072n456J5293J8418P507k4036k8089
12118e461l134P89k0011n639p75o247j831k127l885Q332K0639L2377M784k3082
12104e271O26m236J1662L751l936j2467J7391J2076p262M476J3943J568q219L178
12090B7280k488n50M856n773k4918J6327q624J614J2279J528K2160P191j0316
12077D0566q020j0482j2218k870J7176j065l2404j8386P493J0955J6292L974q16
12064A0195K941N614j943J5407O138o243r674o404K99j3921l1151O439J4859q315
$$ y = [-23322, -29761, -19699, -27238, -22803, -12954, 15449, 1786, -25458, -29699, -25383, -10542, 2564, -290, 6406, 24701, 1844, 24247, 19230, 17530, 21072, 23911, 28070, 19817, -6454, -11879, 6728, 10547, 25745, 32857, 44913, 20918, -170, 10902, 5446, 20739, 39157, 46664, 22628, -5461, -8595, -7806, -27817, -33456, -34231, -40478, -42309, -44436, -48321, -39989, -19350, 13027, 17811, -5271, -4645, -8881, 2781, 6532, 2596, -9871, 7520, 19596, 12334, 16810, 30753, 32321, 24102, 27280, 24792, 24242, 29098, 23325, -1593, 14734, 6110, 7724, 20003, 21531, 43691, 50882, 40566, 32546, 22064, 9846, 6976, 24152, 23087, -9317, -27703, -20210, -9255, 7037, 11011, 10195, 13136, 18750, 16807, 32214, 38352, 32109, 22435, 16031, 16330, 2409, -28742, -22303, -7444, -15759]
12050a5759R232K7318J0224j6686j6400K3510J2370J0831m866k9197k3542l861
12038a6826M480J1280J4286J6460N84q317j2029N640J6832J4050j7175r287J3605
12025C3583j2503m159q461J0266m568k01K36J662R818J4272o273j7214j8358N533
12011C633o800j6702L3505K7208o270j4424m728K088K772J0548J0512J1948J1842
11998F5132O436N705J6235J804p981p312q615j1379l449j8079L216M794q562L903
11984D1848q702o816M634N150K81Q496J0440l325m403K902k1023j6685M963J4865
11970C2625Q257J2k4812l1004M995J7543n806L462J7667Q550k020j1294j4220
11957C955J2765J7302K6028l25j8395k456M976P058p21j140K97J2859M04j2977
$$ y = [-15759, -6527, 20791, 31015, 14329, -2071, 21439, 33809, 44640, 39774, 10577, -12965, -16826, -12346, -1066, 13220, 29680, 30264, 21947, 9918, 15558, 32390, 46440, 29265, 19978, 33583, 21080, 16921, 8460, 18726, 14158, 13957, 14193, 15855, 25673, 39945, 33672, 16458, -1900, 3633, -3167, -19869, 13636, 40844, 34574, 20150, 15422, 17510, 20282, 30830, 41342, 53290, 65132, 71568, 77273, 93508, 95312, 87331, 80019, 71404, 60025, 56576, 38497, 41713, 46507, 37945, 41848, 33146, 26330, 30964, 36114, 36395, 44891, 55331, 52006, 47603, 50505, 29482, 12797, 17760, 32625, 40882, 40894, 16082, -14922, -9927, 7616, 1810, 5272, 22939, 31489, 29469, 18175, 3955, 16720, 34022, 60050, 59725, 41330, 38874, 43850, 50908, 50187, 49047, 49344, 62203, 62607, 49630]
11943D9630N52r449J497O82R351O147M627j1041J1679J9627K0326J8962j5637
11930A06953j961O815L063j7273J2587J2679j923k1159K0q164M509J1772K1371
11917A29289n412p158J7125J3012j6403j1047J6650J8782m791p318J9176L6079
11905A97984K3046R83m378J788P622n451K8838L8578K1884j005L5841N5231M4227
11892D45188P8834Q4976R5362J29615J26727J67639K35731L16328L98825N53476
11882B632701Q03914J100049J505014K031826K459378K137242N07405j314797
11874A1862732k122589k011636j603584j137262p46743m91116k71383m5359J28972
11865C562032L01891N37000P13781N11369Q4275J9951L14243P30989Q98900M46689
$$ y = [49630, 50182, 40733, 42230, 42912, 52263, 58410, 63037, 51996, 63675, 83302, 103628, 122590, 106953, 104992, 111807, 114870, 97597, 110184, 122863, 120940, 99781, 99801, 91637, 96146, 107918, 129289, 123877, 116719, 133844, 146856, 130453, 119406, 136056, 154838, 150047, 142729, 161905, 197984, 221030, 222013, 217635, 219423, 227045, 221594, 250432, 289010, 310894, 309889, 345730, 400961, 445188, 524022, 608998, 704360, 833975, 960702, 1128341, 1364072, 1680400, 2079225, 2632701, 3436615, 4536664, 6041678, 8073504, 10532882, 12670124, 13177529, 11862732, 9740143, 7728507, 6124923, 4987661, 4240918, 3749802, 3478419, 3433060, 3562032, 3863923, 4400923, 5114704, 5626073, 5710348, 5730299, 6044542, 6775531, 7674431, 8121120]
11855H121120j85369k75414J01455O60318J265431J758517J727327R91936k21796
11846A3943525j243678j529554j210951o47080j7831K61660j79769p68500q46919
11837G760903m99636j04629j2481l39187o60995o42957m18344j95978k1202R6118
11827D961612K69209M95899P67569J091248J507722J972269K104570J257408m61769
11818A3965737j802883k098800j844528j365819r69429p03108m91733l44313k74496
11809D070628k35341k03775j59009j40279j23198r9847j06382r7912r0264o1958
11799B752663n7545m4191n3168o0482n0821n5547n0022n1173k8800k8935m4367
11788B227612n0740m1038l5503o603j3235o4008n3782l3650n5057q3081p9865
$$ y = [8121120, 7935751, 7660337, 7761792, 8422110, 9687541, 11446058, 13173385, 14165321, 13943525, 12699847, 11170293, 9959342, 9312262, 9294431, 9556091, 9376322, 8607822, 7760903, 7261267, 7156638, 7144157, 6804970, 6143975, 5501018, 5082674, 4886696, 4865494, 4961612, 5230821, 5726720, 6494289, 7585537, 9093259, 11065528, 13170098, 14427506, 13965737, 12162854, 10064054, 8219526, 6853707, 5884278, 5181170, 4689437, 4345124, 4070628, 3835287, 3631512, 3472503, 3332224, 3209026, 3109179, 3002797, 2904885, 2814621, 2752663, 2695118, 2650927, 2597759, 2537277, 2486456, 2430909, 2380887, 2329714, 2300914, 2271979, 2227612, 2176872, 2135834, 2100331, 2093728, 2080493, 2016485, 1962703, 1929053, 1873996, 1790915, 1711050]
11777A711050n7425o8653n5820l8872m6988l0786l1117k5524n5094n4045n6780
11766A189946o2441m2884k9349l7487l4641m8301o7710n5046k7065m0646l6295
11755G08081k7532j6680j961j3479k2018r658r493q551k9563l3226l0675j3720
11743D91525j9434l1372j3254n661J1853k7554j4883r455j3002j3670O49J9010
11731C74752M512o778l6060q078j4900l510O277j7618k9479l0792j6367j165j4559
11718B06235P659K926j9824q627j9782j3207J0164J1020k3024K481J1783j774
11706A66030J1901J3891J7512J869j0626l0613p010j9028k550J1639LJ1321j148
11693A63191q699l3356o823m79K0466k1757R4k909K9565J1818l1533j8565j1940
$$ y = [1711050, 1653625, 1584972, 1529152, 1490280, 1443292, 1412506, 1381389, 1355865, 1300771, 1246726, 1189946, 1127505, 1084621, 1055272, 1017785, 983144, 934843, 867133, 812087, 785022, 744376, 708081, 680549, 663869, 661908, 648429, 626411, 616753, 607260, 598709, 569146, 535920, 505245, 491525, 472091, 440719, 427465, 421804, 433657, 406103, 391220, 381765, 368763, 355093, 355742, 374752, 379264, 372486, 336426, 328348, 313448, 309938, 316215, 298597, 269118, 238326, 221959, 220794, 206235, 213894, 216820, 196996, 188369, 168587, 155380, 165544, 176564, 153540, 156021, 167804, 166030, 177931, 191822, 209334, 211203, 200577, 169964, 162954, 143926, 141376, 153015, 153018, 164339, 163191, 154492, 121136, 114313, 113834, 134300, 112543, 112637, 109728, 139293, 151111, 119578, 101013, 89073]
11680H9073n032N268o853J7248J1720j1602l214j2475J678J1117j7918o256L8724
11667A11478N2114j7491l1438j2835k4176j599Q222J9447K5910K8961L4656N4231
11655B47480O5522R2707Q3108L4351K870q8918j21242n6156l9601k8845o268k6136
11643A58872o945k5745r025m037l2919l4346j5524n163J6700K7917K5492r40Q227
11630A02564J7335O540k7357p795j1643M391k697p843R548Q57k060Q714q812l901
11616G7841j377J716J1510O618n260j5000j1221j3410j3913J6002Q184K296L52
11603F4338Q489L857k973m815j4330j8962M349J2545M335J2628p169j6003r747
11590C6542n08m383M606j710J3346j689r493J6145l25j4092P400J9934R010j5243
$$ y = [89073, 84041, 89309, 82456, 99704, 111424, 99822, 96608, 84133, 85811, 96928, 79010, 72754, 111478, 163592, 146101, 114663, 101828, 77652, 76053, 84275, 103722, 129632, 158593, 193249, 247480, 313002, 405709, 488817, 523168, 526038, 437120, 315878, 259722, 220121, 191276, 185008, 158872, 151927, 126182, 117157, 113120, 80201, 45855, 30331, 25168, 41868, 69785, 95277, 94337, 102564, 119899, 126439, 99082, 91287, 79644, 84035, 81338, 73495, 83043, 83900, 81840, 90554, 81742, 77841, 76464, 78180, 89690, 96308, 91048, 76048, 64827, 51417, 37504, 53506, 61690, 63986, 64338, 72827, 76684, 73711, 68896, 54566, 35604, 39953, 52498, 56833, 69461, 62292, 46289, 36542, 36034, 31651, 36257, 34547, 47893, 46204, 36711, 52856, 52531, 38439, 45839, 65773, 74783, 59540]
11576E9540K654k3581k1937R566K5890K496m403K487j3333l593L456o847k7782
11563D613j0521q00J102L323J8026O283r469j218J1359L2244M414O056p2k9423
11549C5917j4094k47N272J657j4043J6966O722q86j4184L684N639j1760k7683
11536g040J715M02J8042Q405P794j1719j7599j0945j451j1322O196L862K1744
11523H084M498j7764o180J9164J6136j5138N763L456R335o128l860r103P041M253
11509A9557Q994k4519n404m280j6475N383J1057N263q004N03J5893K6515n532
11496B8951P06r838j0746O230J6264r845p273j8809M818L3228K6096o02J5791
11483G4971N124P267m685K1063j4259J7977K26j8330j9210k3540j8182K122o732
$$ y = [59540, 62194, 38613, 16676, 26242, 52132, 54628, 50225, 52712, 39379, 35786, 39242, 32395, 4613, -5908, -6708, -5606, -2283, 15743, 22026, 12557, 11339, 22698, 54942, 59356, 65412, 65340, 35917, 21823, 21576, 26848, 28505, 14462, 31428, 38150, 37264, 23080, 26764, 32403, 20643, -7040, -5325, -4923, 13119, 21524, 29318, 17599, 0, -10945, -12396, -23718, -17522, -13660, 8084, 12582, -5182, -11362, 7802, 23938, 8800, 14563, 18019, 27354, 21226, 17366, 8263, 15304, 19557, 28551, 4032, -1372, -5652, -22127, -16744, -5687, -424, -8428, -7925, 7968, 34483, 28951, 29657, 19819, 9073, 15303, 31567, 21722, 14449, -4360, 458, 33686, 59782, 59180, 74971, 80095, 87362, 82677, 103740, 89481, 107458, 107684, 89354, 70144, 46604, 28422, 30544, 23812]
11470B3812p785j4452m730N250N490O309J3492m930J1128R946J0265K251Q067
11457F4113k543K335k4363l5626K8083L326j8554o028P528j224J0709J8078R958
11444E5792O344l436q349r680P93Q867k344J3076J2874l1614l5709J561J5923
11431B4098o805k919l125p845J538J1353N163J633l536J3449K317N626K7339Q55
11417F9141k1349p880N615Q723r84r913J4203m54J8641L4792K799m717j8145k9351
11403F1121k3617L130K1327J8675r113M24k5660j9629o056L4629K8316J6201l0514
11390F9234k5586n093K2149J4531L089O419K688O003J1598M251j6270r590p926
11377G5497j2562k5131K503P958j9178J487J7732o626n729m059j9456j311J1427
$$ y = [23812, 16027, 1575, -3155, 2095, 7585, 13894, 27386, 22456, 33584, 43530, 53795, 56046, 64113, 61570, 63905, 39542, 3916, 31999, 35325, 16771, 10743, 18271, 17047, 27756, 45834, 55792, 62136, 58700, 50351, 40671, 41464, 50331, 47987, 61063, 73937, 42323, 6614, 8175, 24098, 17293, 14374, 11249, 3404, 4942, 16295, 21458, 23091, 19555, 33004, 35321, 40947, 68286, 69141, 47792, 39912, 45527, 54250, 53266, 43353, 57556, 57102, 75743, 110535, 113334, 108617, 90472, 61121, 37504, 40634, 61961, 80636, 71523, 71947, 46287, 26658, 20602, 55231, 83547, 99748, 69234, 43648, 38555, 60704, 75235, 78324, 84743, 87431, 93434, 105032, 109283, 93013, 83423, 75497, 62935, 37804, 40307, 48265, 29087, 30574, 48306, 41680, 35951, 31892, 12436, 11125, 22552]
11364B2552J7674M417J422o063q334Q854L7387J9694j9682k0418j3391L914J8952
11351F6978J1636J9404M936m984J618j5169r16p442P172K3702J5014Q267j5823
11338A14393k9359k3081J3083O697J0531j5131k1813l745J2671K8970J4307k7494
11326H0029k4012r764k2921P523N710L023J9302k33J728l779L155j7699j0306
11313C1756J0211K1824J9087j5684J1455J0585L1135p998j1102o173J3307n085
11301A03318r838K6942L8717J955m573r323J2022J8906L746j1395K0207O179j2269
11288A84594k361K332J9634j3512m931J2677P678o89K680J660P193J3097J9084
11275B49136Q793J112j7476k137Q905J8766o108j3702P330K8373J7876J0125J0694
$$ y = [22552, 40226, 44643, 46065, 40002, 31668, 40522, 77909, 97603, 77921, 57503, 44112, 48026, 66978, 78614, 98018, 102954, 97970, 99588, 84419, 83503, 76061, 83233, 106935, 121949, 130216, 114393, 85034, 61953, 75036, 81733, 92264, 77133, 55320, 51575, 64246, 93216, 107523, 80029, 56017, 46253, 23332, 30855, 36565, 39588, 58890, 58657, 60385, 56606, 59761, 42062, 31756, 41967, 63791, 82878, 67194, 78649, 89234, 120369, 112371, 101269, 95096, 108403, 103318, 93480, 120422, 159139, 161094, 156521, 147198, 159220, 178126, 181872, 170477, 190684, 196863, 184594, 182233, 184565, 204199, 190687, 185756, 198433, 206111, 205422, 208102, 209762, 216955, 230052, 249136, 257929, 259041, 241565, 239428, 248333, 267099, 260991, 247289, 254619, 282992, 300868, 310993, 321687]
11262C21687K6463Q557M862K1894L9790J8569K2148K5290K8416J9285M4450N8050
11250F39461N7034L5970N0386N5624P8213J33335J57581K28476K66494L12074
11240B014648M09097M99507N93970P16808Q61198J119511J624791K432183L725570
11231A3997283N599026Q285854J2307744J7143847J7780159R876081k216870j3619792
11223F9153332j7316484j4497802j0313736o832929m476111k944580j956156j341220
11215I474314r71733p58198o50246n59515m69101l48655k30573j57852q5032n8995
11205E184414o2358l4662J2806M0685O1986J07072J32430J25113J20752J28423
11195E816661J64979J60547J18201J10253J17650J01240O3120l0080j44445j71985
$$ y = [321687, 348150, 356707, 361569, 383463, 423253, 441822, 463970, 489260, 517676, 536961, 581411, 639461, 696495, 732465, 782851, 838475, 916688, 1050023, 1207604, 1436080, 1702574, 2014648, 2423745, 2923252, 3517222, 4234030, 5095228, 6214739, 7839530, 10271713, 13997283, 19596309, 27882163, 40189907, 57333754, 75113913, 84989994, 82773124, 69153332, 51836848, 37339046, 27025310, 20192381, 15716270, 12771690, 10815534, 9474314, 8502581, 7744383, 7094137, 6534622, 6065521, 5716866, 5486293, 5328441, 5243409, 5184414, 5122056, 5087394, 5100200, 5140885, 5202871, 5309943, 5442373, 5567486, 5688238, 5816661, 5981640, 6142187, 6260388, 6370641, 6488291, 6589531, 6652651, 6622571, 6478126, 6306141]
11185F306141k00838k17082k02119j66868r4023p1129o1065o8545o3003j23344
11175E038125j61149j66580j99748k25433k44213k42240k26050k37198j89887
11166C145627j81838j56416j48758j31739r9476q9741j19514r6120p2847p8136
11156A971042l7994k3742m5136o6280p0800q5678r2681q6095n9286o9402o3167
11145A270781n8758m7624l9950l4546m8201l7619n0099l6170l2936l7467j4076
11134H33335j8962l2335m3938l3846j2356k5487m1372l4978j1200K241j5744j9323
11122E46035n422j2830k2345k5711j1774k2661k7546l9194J1007L4038q073q086
11110D07438J0761j1297k9114q357j8723O679n722m004M409K3911J8286j316L526
$$ y = [6306141, 6105303, 5888221, 5686102, 5519234, 5425211, 5354082, 5293017, 5224472, 5161469, 5038125, 4876976, 4710396, 4510648, 4285215, 4041002, 3798762, 3572712, 3335514, 3145627, 2963789, 2807373, 2658615, 2526876, 2427400, 2337659, 2218145, 2122025, 2049178, 1971042, 1933048, 1909306, 1864170, 1797890, 1727090, 1641412, 1548731, 1462636, 1403350, 1333948, 1270781, 1212023, 1164399, 1124449, 1089903, 1041702, 1004083, 953984, 917814, 884878, 847411, 833335, 814373, 782038, 738100, 704254, 691898, 666411, 625039, 590061, 578861, 581102, 565358, 546035, 540613, 527783, 505438, 479727, 467953, 445292, 417746, 378552, 389559, 423597, 415524, 407438, 418199, 406902, 377788, 369431, 350708, 357387, 351665, 347661, 352070, 375981, 394267, 392951, 396477]
11097C96477k0316l6377k0491j6685j1771j3080k5581j5874j0533o849J006J2052
11085B31978J595j6626O831L58j1847j0053p779j5110k0667p985l363p349J250
11072A41233J5031j5601O541j1308n603L0675R525l620J186j1724j4626J4219
11060A55928j269j2383j6544o0K607N976J1278j566r171j3318J5919K983r439
11047A30941j6230j984K4646M582N482J1988o031P980J4777K7364K5069K3629
11035B52213K3669K5534J4506l7662m1744k5262r469m694k235m1000j8274Q554
11023A44136K0404Q918j9713k159j9930N281K2324j0755j7983k3941j300k879
11011A02403J1503K0006j2458k3386n669n835J4623r64N978m270O241M377L756
$$ y = [396477, 376161, 339784, 319293, 302608, 290837, 277757, 252176, 236302, 225769, 218920, 219926, 231978, 233573, 216947, 223778, 224136, 212289, 202236, 194457, 179347, 158680, 150695, 147332, 139983, 141233, 156264, 140663, 147204, 135896, 130293, 160968, 170493, 166873, 168059, 156335, 141709, 155928, 154659, 142276, 125732, 125672, 128279, 134255, 145533, 143967, 134796, 121478, 137397, 140380, 130941, 114711, 112727, 137373, 141955, 147437, 159425, 153394, 161374, 176151, 203515, 228584, 252213, 275882, 301416, 315922, 278260, 236516, 211254, 201785, 197091, 194856, 153856, 135582, 144136, 164540, 173458, 153745, 151586, 131656, 136937, 159261, 148506, 130523, 106582, 105282, 102403, 113906, 133912, 121454, 98068, 92399, 86564, 101187, 100223, 106201, 101931, 108172, 112549, 116305]
10998A16305n35K1245r257k8632Q76J908m000o175K631j859r325j417O568p229
10984H1104J4743o835l329L493j8140j968n69J9293J0463O466j5959j2387L344
10971G9719j3421j6662J9123k124J6767k433j6432r698o637J4740L49L147j9732
10958D6706n380L015o336K3524N357q856j1002j5530J0511k342M154M51K835N411
10944E2518j9938K436m888l315M557J9094m009K118q944Q212j3733K76k2569n49
10930A1266L245P151r735m294o118Q802J759m614K3156M283r590m635K965j0367
10916A3274n516k482l104J239p820j0308j493Q293O097o212r982J414J1977K840
10902a783p237J1063j2256O896J5012O356J6748K0507O628k1987k2059J7783N431
$$ y = [116305, 115770, 137015, 127758, 99126, 100002, 101910, 97910, 91735, 94366, 92507, 83182, 81765, 88333, 81104, 95847, 89012, 85683, 89176, 71036, 69068, 68499, 87792, 98255, 104721, 88762, 76375, 79719, 66298, 49636, 68759, 66635, 83402, 80969, 64537, 54839, 48202, 62942, 63291, 66438, 46706, 41326, 44341, 38005, 61529, 66886, 58030, 47028, 31498, 42009, 39667, 43821, 44272, 47107, 52518, 32580, 35016, 30128, 26813, 31370, 50464, 46455, 48573, 39629, 47841, 34108, 34384, 11815, 11266, 14511, 21662, 11927, 7633, 1515, 10317, 12076, 7462, 30618, 34901, 25311, 20676, 23641, 13274, 7758, 5276, 2172, 3411, -4409, -14717, -16210, -7917, -1820, -8032, -18014, -16600, -4623, -1783, -9020, 2043, -10213, -3317, 11695, 18051, 34799, 55306, 61934, 39947, 17888, 35671, 41102]
10889D1102m115J0474J0462j724Q619K26j965j1760l3000j4694R995Q739j5363
10876F996j5774J547J6073L5655M0294j8258m327j2694o658n297r616n610J494
10863B3825Q311J3087O520k869j3341k408j565Q324K0392r508O165p121o477k930
10849D0405O213l23p462j6271n287N334M319J6065k626k0623k1933n095N729k857
10835d412m356J201R924j511j0014j0120k827O03J488L430J0501J1114p61j7398
10821a3138M504P833l466N243Q608J2828m269j666J2839m131J3871j045p817k641
10807B7553j5129k1362j0921J5509K8737K3884O578J5207J7809K0565L8246O1807
10795B08483Q3399Q9711O4281l13o4017r7584q8231o5664l9835k1082q270N444
$$ y = [41102, 36987, 47461, 57923, 56199, 64818, 65044, 63079, 51319, 18319, 3625, 13620, 22359, 6996, -8778, -7231, 8842, 44497, 84791, 66533, 62206, 49512, 42854, 37557, 27941, 22331, 23825, 32136, 45223, 51743, 48874, 35533, 33125, 31560, 39884, 60276, 50768, 56933, 49812, 43335, 40405, 46618, 46295, 38833, 22562, 17275, 22609, 26928, 42993, 40367, 19744, -2189, -7284, -1555, -4412, -8768, -7567, 2357, 846, -9168, -19288, -22115, -21512, -20024, -16594, -6093, 5021, 4260, -13138, -8634, -801, -4267, 976, 9584, 22412, 18143, 16477, 29316, 25185, 39056, 38011, 30194, 27553, 12424, -8938, -19859, -4350, 24387, 48271, 54849, 70056, 87865, 108430, 146676, 208483, 291882, 381593, 445874, 445561, 381544, 283960, 195729, 130065, 90230, 69148, 60878, 66322]
10783F6322m629j0603j3806n640p942J3833l092j7593J5496K4787M554P084O786
10770G5557j3639l0569k0026j9472J466J4996L974J3303p786J70q996M311J4802
10757B8091R28J4416K2997J8184k4906j3100l32j216J5978O31j0767k0193R303
10744D0014Q132j3760q964J7417J085k1761L0506K1095k0470j0333k768j3545
10732B6648K968n327M3j3271k7226j477L3374K177J3618O509P319O819j3350l2853
10718E971J3300J1685L000J3436N080j5651j8587j8619l101p423j439J9304K4650
10705C1606J4587j4826J576o02j3210k1284j6251L598J2060K0878j7770l5940
10693c5578J445P037J6416Q092n485p432J6590N522k583K308j875M02m88Q949
$$ y = [66322, 61693, 51090, 37284, 31644, 23702, 37535, 34443, 16850, 32346, 57133, 61687, 68771, 75557, 61918, 31349, 11323, -8149, -6683, 8313, 12287, 25590, 17804, 17974, 8978, 13289, 28091, 29019, 43435, 66432, 84616, 59710, 46610, 46278, 45062, 61040, 61671, 50904, 30711, 40014, 48146, 34386, 25422, 42839, 43924, 22163, 52669, 73764, 53294, 42961, 40193, 26648, 29616, 24289, 24332, 11061, -16165, -17642, 15732, 17909, 31527, 38036, 45355, 52174, 38824, 5971, 19271, 30956, 33956, 47392, 52472, 36821, 18234, -385, -3486, -10909, -12348, 6956, 31606, 46193, 31367, 32943, 32341, 19131, -2153, -18404, -14806, -2746, 18132, 362, -35578, -34133, -27096, -10680, -2588, -8073, -15505, 1085, 6607, 4024, 6332, 4457, 4859, 4371, 13320]
10679A3320j3502k731J1677J2617P15j1077m963K293j9890L470N209k455J6651
10666A1334j0774P665l692n835j5039J656Q05J9504j0334J8215K6887n542l102
10653C1748k6891l061K7630j1903k2112r189N434J7205J193j6357N629J5083k487
10640A1922j3114K943J3011J0344L206L511j243p868j0775j8988j5678K3171R848
10627A0290p065k0460J34K5655L578n574l39o258L465P521l284Q561p302N80N76
10612A0078k402M201Q818K949l215r199K4677p146n667J4022p701j860r283k0582
10598b310o025J347J7110Q917k1543r442j4512n426J9479l232j1251J396L5792
10585A0300M538k173j0561p867O329p492j5329J4143l204P714K8967M087j8806
$$ y = [13320, -182, -2913, 8764, 21381, 22096, 11019, 6056, 8349, -11541, -8071, -2862, -5317, 11334, 560, 8225, 4533, -1302, -16341, -14685, -13880, 5624, -4710, 13505, 40392, 34850, 31748, 4857, 1796, 29426, 17523, -4589, -13778, -8344, 8861, 10054, -6303, -674, 14409, 11922, -1192, 1751, 14762, 25106, 28312, 31823, 30580, 22712, 11937, -7051, -22729, 442, 10290, 3225, -17235, -17101, 8554, 12132, 6558, 6219, -39, 3426, 10947, 7663, 16224, 8922, 9502, 10078, 7676, 11877, 20695, 23644, 20429, 11230, 35907, 28761, 23094, 37116, 29415, 27555, 18272, -2310, -8335, -6988, 10122, 19039, -2504, -11946, -26458, -31884, -12405, -15637, -26888, -25492, 10300, 14838, 12665, 2104, -5763, 566, -6926, -22255, -8112, -11316, -3602, 25365, 29452, 10646]
10572A0646N699j655j0250J5636Q390o9Q02q226k0011k3752l901J489r939J5345
10558a9796J1783J1413J7379N288l0891j2440M568J7346J0412Op135m428j7843
10545a4338j050J5758Q504o150o146J7325J3540j0373M294n50j9716p688n703
10532a2293J5864R876j2345q358L683q645j781L337k0849p885J0989J0415J8525
10519E33J9666k5601k8109L642K1662J1584J1245l490Q173J53m218J215k0100
10506c645J1583m602j7981k555k785k671N058R896l08NK124K012q501j1657p116
10491c1143j2088J7544O075o810j5893J386K212J7480Q643j0378j1716N39m525
10478c8674p768J4583K5949j910q049K8500N891m6900q845P693K5684M817j319
$$ y = [10646, 16345, 14690, 4440, 20076, 28466, 28397, 29199, 20973, 962, -22790, -26691, -25202, -35141, -19796, -8013, 3400, 20779, 26067, -4824, -17264, -12696, 4650, 15062, 15068, 7933, 3505, -14338, -15388, 370, 8874, 2724, -3422, 13903, 27443, 17070, 21364, 20814, 1098, -6590, -12293, 3571, 13447, 1102, -7256, -3573, -12218, -13999, -10662, -31511, -39396, -28407, -17992, 533, 20199, -5402, -33511, -29869, -8207, 3377, 14622, 11132, 19305, 19458, 15240, 16455, -3645, 7938, 3336, -14645, -17200, -19985, -22656, -17598, -7702, -8010, -8005, -5881, -3869, -12370, -24027, -31143, -43231, -25687, -19612, -26422, -42315, -40929, -38717, -21237, -12594, -22972, -34688, -34149, -38674, -46442, -31859, -5910, -7820, -15869, 12631, 18522, -28378, -37223, -29530, -3846, 971, -348]
10465c48j8476p676M02M657j0701r008o259l088K5327R265O841J2869k0016m975
10451b1186L578p737L6095L403k253k889j5j2194j2397Q33J9186l987q240r596
10437a7399n300N453L731N174J5015r571l0661M407L168J1O385K7598M857j9799
10423f931n775P234J192j1975p215O245L2958j654j8905M58N17J2318j5084q463
10409a5080R151K4579J0168r890p050j1210k1682M807K2615N977K939p453l990
10396C881Q813j169P374p311j2053M866j0963l106m268j0372m520N347p300j1161
10382d1942k271N433J4064O689J3578K4433J4137j8971l0349J3975M931J0149
10370A3856Q258k2409j2489J7998J0758o449o795q315r507j4878N925J1251q749
$$ y = [-348, -18824, -26500, -26098, -21441, -32142, -41150, -47409, -50497, -25170, -15905, -9064, 3805, -16211, -21186, -17608, -25345, 10750, 14153, 11900, 9011, 8996, -3198, -15595, -14762, 4424, 437, -7803, -17399, -22699, -17246, -13515, -8341, 6674, -2897, -33558, -29151, -25983, -25972, -19587, 8011, 12868, -6931, -12706, -5472, -4280, -16255, -23470, -17225, 15733, 14079, -4826, -4368, -3851, 8467, -6617, -15080, -5929, 18650, 28818, 18928, 11878, 668, -21014, -16207, 6408, 12385, 15324, 7871, 3881, 12694, 11525, 18899, 11588, -465, 4401, -6562, -9668, -13936, -24308, -28828, -23481, -30781, -41942, -44213, -38780, -24716, -18027, -4449, 19984, 34121, 15150, -15199, -1224, 3707, 13856, 22114, -295, -12784, 5214, 15972, 9523, 2728, -5587, -15094, -29972, -24047, -12796, -21545]
10357b1545P048L575J6292q56j6447o143M237r307K390K0324J9492q570L835j2669
10343A656m105Q412j6527k1209m618o417N051J9934Q435r990O018L824K461P342
10329B67j9145j7123L6255J8328J4347r953l197J0056q949k5050M523l527K1610
10316A8442m870j7395Q882p853o654j575K110J2187J5836k8253k5943k1742N335
10303e1493J7689K1668K0852J4708o247j5339k2535k8499J875L939P697N515M952
10290b5218K5488M216q557M636k0642k8368p130L1306k310r462p634J7466J8827
10277g382J6057K1132K1015q831l0189l4101N551O790J0929J0980N960M458N708
10264B8077k902J901l553p769L784r882j3590K6455K871q944l7779l8763j301
$$ y = [-21545, -14497, -10922, 5370, 4514, -11933, -18076, -13839, -23146, -20756, -432, 19060, 10490, 14325, 1656, -2449, 5963, -10564, -31773, -36391, -42808, -37757, -17823, -9388, -19378, -13360, -9536, -7075, 267, -18878, -36001, 254, 18582, 32929, 22976, 19779, 29835, 20886, -4164, 359, -3168, 18442, 13572, -3823, 5059, -2794, -9448, -11023, -8913, 3274, 19110, -9143, -35086, -56828, -51493, -33804, -12136, 8716, 23424, 17177, 1838, -20697, -49196, -47321, -43382, -35685, -30170, -25218, 270, 4486, -4071, 565, -20077, -48445, -55575, -24269, -26579, -36041, -43675, -26209, -7382, 8675, 29807, 50822, 41991, 11802, -22299, -16748, -9958, 971, 11951, 17911, 22369, 28077, 25175, 27076, 23523, 15754, 19538, 9656, -3934, 22521, 25392, 16448, -21331, -60094, -61395]
10251f1395K1169P292o943P199J867R560k0111K1477P516j408j0078j0772L6O084
10237b8507J1065k730k696M110J8821J4246k549j2029j3613J1803J2741j4528
10225c866r054l03K159R796r002j5376Q213j3279r841P693J3451K607J9656K5948
10211B8802n756j0431q193Q261n361o337q066k100J9540j0336k3456n832Q243
10198b1022L637J0822R310l726K0259q4r262N11J4065K210j3342j2233m833j248
10184d936p226J3745j841n636k112k390N814r915J481J0640O200N540j0288j1214
10170a2138j0365n337l411m484J0310P728L616k59J209K636M191K479l5205l180
10156d2210J1687K979M735L00K0519J1022n174k4970o993o434J7598R323J7411
$$ y = [-61395, -40226, -32934, -39877, -32678, -30811, -21251, -41362, -19885, -12369, -13777, -23855, -34627, -34591, -28507, -17442, -20172, -22868, -18758, 63, 14309, 11760, -269, -13882, -2079, 10662, -3866, -12920, -13223, -11064, -1268, -10270, -25646, -17433, -30712, -40553, -32860, -19409, -16802, 2854, 28802, 23046, 12615, 4422, 12683, 7322, 985, -7081, -9181, 10359, 23, -23433, -29265, -21022, -17385, -6563, 2747, -979, 19280, 19196, 9934, 10445, 24510, 26720, 13378, 1145, -3688, -4936, -12162, 1583, -258, -5894, -8006, -10396, -4582, -14497, -13016, -2376, 3824, 9364, -924, -12138, -22503, -27840, -31251, -35735, -25425, -17697, -14081, -14340, -13131, -10495, -6304, -3825, -39030, -42210, -30523, -27544, -22809, -22509, -1990, 9032, 3858, -21112, -28105, -34539, -16941, -7618, 9793]
10143I793M719k6469k3222q923J2345L1983k793m412K701j3756Q862r873M57J1077
10129g511J7756l939m502K3152L736N075j957o851j5691j0385k791j0819k660
10116a7387K101J0970J7572k542j6796R408M612Q749m41O907j3248j1466O831
10103E270R031M201m725j0846p02M756r081r340k4537M131J5089R510J3191m727
10089A221O880j1889j5261M192J4212j6509l6522m360K958N128J02L2887K1463
10076D502J0371l8291l723M472M066R528m1l89q081K4614K69q291J7341J1147
10062B7494j9401k974K64J1495K9302M5510O5322R5276Q8556k5605n8541o0148
10050A96550n6508n7049k7646j5140k1716j4794k363J0894R038K016j627l401
$$ y = [9793, 14512, -11957, -35179, -44102, -31757, 226, -2567, -6979, -4278, -18034, -9172, -19045, -18588, -7511, 10245, 6306, 1804, 24956, 28692, 33767, 31810, 24959, 9268, -1117, -3908, -14727, -17387, -15286, -4316, 13256, 10714, -6082, 3326, 7938, 16687, 16246, 23153, 9905, -1561, 5270, 14301, 18502, 13777, 2931, 2229, 6985, -2096, -11436, -35973, -31842, -16753, -7243, 5948, 1221, 8101, -3788, -19049, -14857, -645, -17154, -53676, -58036, -55078, -49950, -49848, -16961, 4502, 14873, -23418, -27141, -22669, -18603, -9075, -9116, -9505, -17586, 7028, 7297, -994, 16347, 27494, 8093, 5119, 5383, 16878, 46180, 91690, 157012, 252288, 340844, 315239, 256698, 196550, 140042, 82993, 55347, 40207, 18491, 3697, 1334, 12228, 21266, 23282, 21655, 18254]
10038A8254j8044j5749J0156J1438j7874j0181J1498J2384P954Q579k3552m965
10026a0102l716k3655q05J6552j7424o188J7232K4687p4k540J2536K0487J740
10013B8730k3428n386j2051Q783J1012N51L0320O503k7052k6129j82J0564J5208
10000A7443K63k4243k6887j763J4817q525J617Q710P39J382K845P15Q479J8146
9986A3738P802J061p452n267j0317j4029p699k333K1932K505j860J5499k354m6401
9972c5175k1800Q156J6700L2748J9644j1495M136j956j2351l732R814R50J172
9959F811j6443K816K5891Q832l5578j2483r19j1358K526J0238K0007q73J0384
9946I851p950j0394o139j0224O327P529J6277O805k2651j1548J3049J5067N77
$$ y = [18254, 210, -15539, -5383, 6055, -11819, -22000, -10502, 1882, 9836, 18415, -5137, -10102, -13818, -37473, -38278, -21726, -39150, -45338, -28106, -3419, -3493, -6033, 6503, 26990, 28730, 5302, -84, -12135, -3352, 7660, 8211, 38531, 45034, 17982, -8147, -8329, 2235, 17443, 17706, -6537, -33424, -35187, -20370, -28895, -27278, -18568, -17829, -16447, -13602, -12887, -4408, 13738, 21540, 22601, 15149, 9882, -435, -14464, -22163, -24496, -2564, -59, -1919, 13580, 11226, -35175, -56975, -48819, -32119, 629, 20273, 8778, 12914, 10958, -1393, -5125, 4689, 5639, 6811, -9632, -6816, 19075, 27907, -7671, -20154, -21073, -32431, -29905, -19667, 340, -533, 9851, 1901, -8493, -14632, -24856, -18529, -11000, 5277, 12082, -10569, -22117, -9068, 5999, 6576]
9933F576j8112j0447K943K0073j1807k682J0897j033j5599M486J2725L147j764
9920e97J191j3769j390J2374R067Q923l708j9579j937Q842K2253p714j6847m924
9906g815J270j828j9351k8L0096J4024N520r678j2817q160l497J9732Q467j7125
9892a190k6494k405J2561O99J2732J5039j2778k4255j3135J8329J0876q608l436
9879b2065Q955R907j8029J9981J6094j3848k4334l65J946j6844M043j178K4841
9866a0896O354N816P580J1323j0775j8866m137q995Q57J0548J4380J7805m721
9853A6273k0673L519J8545J0314j2710j0635j4753k8820j8858R238K0335k231
9841c0456k0008j825R481K9721J8034j1176J3222J2338J9675k3377j7009l158
$$ y = [6576, -11536, -21983, -19040, 1033, -10774, -13456, -2559, -3592, -19191, -14705, -1980, 1167, -597, 594, -13175, -14565, -2191, 6876, 15799, 12091, -7488, -9425, -583, 21670, 13956, -2891, -7815, -6545, -8373, -27724, -27752, 2344, 16368, 21888, 12210, -607, -8767, -12264, 7468, 15935, -1190, -27684, -30089, -17528, -16829, -4097, 10942, -1836, -26091, -39226, -20897, -10021, -18629, -22065, -13110, -3203, -21232, -1251, 14843, 995, -23339, -23704, -21758, -38602, -34559, -35737, -10896, -4542, 1274, 8854, 20177, 9402, -9464, -13601, -22596, -21739, -11191, 3189, 20994, 16273, -4400, -881, 17664, 27978, 15268, 4633, -10120, -38940, -57798, -48560, -28225, -30456, -50464, -52289, -42808, -13087, 4947, -6229, 6993, 19331, 39006, 15629, -1380, -4538]
9829d538J5998O196k0524k1358k713J6689J2431j0297J1383J304j8488r795L514
9816b0198n469J8233J0017K607R227J9939k773k8846L583P297J2191o552j0812
9803H444j6594k762j0535p115m221k391n802p053q183J2915R186M759M969l271
9789b7654j4139R97j4L162J2347n65k2657k037J4114O994K3946p501o110L2987
9775A3870R147O409l567o604j0064j1828j4254q261K0922J3225o124J1776M733
9762A9380n968k3455m531J2274j5840j0445J3374J2710K026J9299p583k5193J4083
9749A31J5478l554j2383n963J66j6385L293K188j3228J125j1225J4975N025k9190
9735d9547N798N642j8213L0095K3125L644j677J0452n256k0184q37N702J7871
$$ y = [-4538, 11460, 17656, -2868, -24226, -26939, -10250, 2181, -8116, 3267, 4571, -13917, -23712, -20198, -25667, -7434, 2583, 5190, 14417, 34356, 31583, 2737, 6320, 13617, 25808, 19256, 8444, -8150, -10912, -21447, -28562, -32783, -35174, -40976, -48029, -56212, -43297, -34111, -29352, -24383, -27654, -41793, -40796, -40810, -37648, -25301, -25866, -48523, -50560, -36446, -29452, -5506, -13007, -19117, 13870, 23017, 29426, 25859, 19255, 9191, -2637, -16891, -25152, -4230, 8995, 2871, 14647, 19380, 13412, -10043, -14574, -2300, -18140, -28585, -15211, -2501, -475, 18824, 11241, -13952, 131, 15609, 12055, -328, -6291, -6125, -22510, -19217, -17029, -30257, -29132, -40357, -25382, -20357, -49547, -43749, -38107, -56320, -26225, -3100, 544, -1133, 9319, 4063, -16121, -16958, -11256, 6615]
9722F615O006q703j3394M460J4685k4033k7811j013K3440J090j2452J4683K0676
9709D249l063j3797j6961m750K6207J8032j1478k1484p791m023O860R320P688
9696a0991j5308M932J1077K846r088N140L96r045k656P247J254J1357l21j1842
9682a5002j1495j0137j6608J1327K5446m04n220J965j1773Q110K2320j0072j4459
9669b6002o874p754J3683J4790J0339j2763k7180q575P315J3063J0785o676J41
9656b5708J0346R236J0027K2456J399j5257k6212p116R754K0644O094j3388k0325
9643a8050l980J9635O848N848R3p648n398m653j0312J1334P9j3977j2591k164
9629c4936K3229K831R023J543k0114l930r37O836J0563q992R443O442j288o304
$$ y = [6615, 12621, 3918, -9476, -5016, 9669, -14364, -42175, -43188, -19748, -18658, -31110, -16427, 4249, 1186, -12611, -29572, -34322, -8115, 9917, -1561, -23045, -30836, -34859, -27999, -18679, -10991, -26299, -21367, -10290, -7444, -16532, -11392, -10996, -20041, -22697, -15450, -14196, -2839, -3160, -15002, -26497, -36634, -53242, -41915, -16469, -16873, -22093, -20128, -31901, -23791, -1471, -11543, -26002, -32876, -40630, -26947, -12157, -1818, -14581, -41761, -50336, -43021, -29958, -19173, -25849, -25708, -15362, -6126, 3901, 26357, 27756, 12499, -13713, -20829, -11075, 9569, 15663, 2275, -18050, -22030, -2395, 4453, 10301, 10394, 2746, -2652, -7305, -17617, -6283, -6204, -20181, -32772, -34936, -11707, -8876, 147, 1690, -18424, -22354, -23291, -16455, -5892, -14884, -5441, 1001, -287, -6591]
9615f591M901j0918j1292Q812O325j0083q937l864N234p204J4078K499J2350j1809
9601a6499j042n37Q866j1386j5171K450o40m890L1243p685j8805m246R907o647
9587c5082L765l472R383J9931n920j8493j3394J4710J0489K517M797K940k1409
9574b9238N23M804q789q908K1416K8655j1795j332J1911j9596L750P988q661k4456
9560c3728j6512O984m951J7249J6734P878j1473N552J8538l499q548r493J2224
9547c045J7115j2055j5588J4655k331j8652k633L892J328r891P116p507R061J245
9533a7290J294m012K875p332J622j867N055O174J6430J0317J0863J411o077p099
9519A2364j0659k9783k0537J1328k567J3131K4826R390j5221j4285l863J7247
$$ y = [-6591, -1690, -12608, -23900, -15088, -8763, -18846, -27783, -31647, -26413, -33617, -19539, -17040, -4690, -16499, -17541, -18078, -9212, -20598, -35769, -33319, -33959, -38849, -7606, -15291, -34096, -38342, -28435, -35082, -31317, -34789, -25406, -5475, -11395, -29888, -43282, -28572, -18083, -15566, -10769, -7829, -29238, -28715, -23911, -32700, -41608, -20192, 8463, -3332, -4664, 7247, -12349, -8599, -611, -9272, -33728, -50240, -43256, -48207, -30958, -14224, -6346, -17819, -12267, 6271, 2772, -5776, -15269, -3045, 14070, 2015, -13573, 1082, -1249, -19901, -22534, -18642, -17314, -27205, -20089, -27596, -18535, -17290, -15996, -20008, -17133, -24465, -22843, -24710, -19655, -13481, 2949, 13266, 24129, 25540, 19463, 12364, 1705, -28078, -48615, -37287, -39854, -26723, -1897, 7493, -7728, -22013, -25876, -8629]
9507h629P551M085r107Q830Q267J0626k2817j6716r126k583K089P627k552l388
9493b5843J2819O82l855j0306M778k952M834J3106r147o542j398J8282R093j871
9479A680J898k7055j7587Q796P375J7194O490J2490K3953j7042m507k7112N136
9466h291R183k6976k89q473j1662K417q276J6264J3950M963J6341m035m131K6430
9452A7415J3438k666N824l0429j3299n502l705j5436K404j953j4357P663K5510
9439a5093q79j561J5730r415j8252k534J0157M083R413j557R274J2222j0878j9015
9425a8305J2619L799n161j1575M74p194O42J0663M814J2205n575m995p46k7580
9411c5915j4965J9024J5631R800j969j4852K454q692Q421K2670J0326j3841o146
$$ y = [-8629, -1078, 3007, -6100, 2730, 10997, 21623, -1194, -17910, -27036, -29619, -27530, -19903, -22455, -25843, -13024, -12342, -16197, -26503, -21725, -24677, -19843, -6737, -15884, -22426, -23824, -5542, 3551, 1680, 3578, -23477, -41064, -32268, -24893, -7699, -1209, 11281, 35234, 18192, 13685, -13427, -8291, 892, -26084, -26373, -34846, -46508, -44091, -52367, -36103, -22153, -17190, -849, -4884, -9015, 17415, 30853, 28187, 34011, 3582, -9717, -15219, -18924, -34360, -31956, -33909, -48266, -40603, -15093, -15972, -17533, -1803, -11218, -29470, -32004, -21847, -17764, -8351, -9908, -634, 11588, 710, -18305, -5686, -1887, -7048, -18623, -18149, -25343, -24701, -14038, -9224, 2981, -2594, -7589, -8335, -35915, -50880, -31856, -16225, -6425, -8394, -23246, -20792, -29484, -21063, 1607, 11933, -1908, -8054]
9398h054K2149Q372j0561J4572n160j3381O275J312J7211k6656j4345l902l216
9385a5384J0420P061P651o329j0288o066j5175J998J4266J7063J6880j6782j1384
9372f069K3399o219j5160k9193J3011Q060k854k904m18K0705O172l290j3667K112
9358f315m141k0229j3598L11Q586K77J2802j0202Q398J4998K1491J2522k8927
9345d027n877R346j5823k4769O943K1278J8907K0198q460j1431P003J873j0539
9332D622j3865J144j4833J7787J2555n606R320O584J9659R405k1647k9130K280
9319a725N783j6188J199j5339m95K0845O477J0766K0688K793k9500j6396k92l915
9305a5299O39K464m725l284J262K0601J4608j9592j347j681N49o523J072N787
$$ y = [-8054, 14095, 22467, 11906, 26478, 21318, 7937, 14212, 15524, 32735, 6079, -8266, -12168, -15384, -4964, 2097, 9748, 3419, -6869, -12935, -28110, -26112, -11846, 5217, 22097, 5315, -6069, 17330, 11111, -4049, -33242, -20231, -12171, -15025, -17929, -18347, 2358, 8530, 5240, -8427, -6315, -10456, -30685, -44283, -43972, -35386, -35109, -22307, -32509, -24111, -9113, 12378, 24900, -4027, -9904, -558, -16381, -41150, -34207, -12929, 5978, 26176, 17716, 6285, 13288, 15161, 4622, -9243, -8099, -22932, -5145, 7410, 1804, 11124, 17708, 37367, 46772, 25125, -4005, -1725, 4058, -12130, -10931, -26270, -26765, -5920, 557, 11323, 32011, 34804, 5304, -11092, -11384, -15299, -14660, -12196, -16921, -20205, -18943, 1658, 16266, -3326, -4673, -6354, -5805, -12328, -11256, -5469]
9291e469J2390R813O289Q732j0894j2450J4278K6372k466k6080k282J3650k3434
9278H449j0036J62M762J3876J1256J918j2912N10m704r993p275J777j943k2945
9264b7098N177J7194j0739o769j7414j1598j4770J0285J721M692K7007k385J2117
9251a2580J6866L453R316K0654p424k6902K484J0495r243L567m228j5883m816
9238a4241J9628O00K981r834p094k612K2972l474r170k167N896j1024j2534j1946
9224c2019k757m542O153M910Q024J3321J5014n425J3229q382j5863J1412J3316
9211A6391J9682l15j2937J917K983M952j3646k3954K546K462L092m730J1271K3868
9197C3582J4233J906p149k7198r868Q01N342J0833j355L5813q291l593J745q422
$$ y = [-5469, 6921, 16734, 23023, 31755, 20861, 8411, 22689, 49061, 46595, 20515, 18233, 31883, 8449, -1587, -1425, 3337, 17213, 28469, 30387, 17475, 17985, 13281, 3288, -3987, -2210, -4153, -27098, -21921, -4727, -15466, -22235, -39649, -51247, -66017, -55732, -54011, -49319, -22312, -24697, -12580, 4286, 7739, 17055, 37709, 30285, 3383, 5867, 16362, 7119, 10686, 6458, -9425, -14241, 5387, 5987, 8968, -866, -7960, -10572, 12400, 8926, -244, -2411, 3485, -7539, -20073, -32019, -34776, -39318, -33165, -28255, -20231, -6910, 8104, 2679, 15908, 7526, -8337, 3075, 16391, 36073, 35758, 22821, 24738, 27721, 32673, 19027, -4927, -2381, 81, 3173, -1557, 9714, 33582, 47815, 49721, 42572, 15374, 5506, 6307, 11649, 22482, 21127, 56940, 48649, 45056, 46801, 38379]
9183C8379l9503J7132L1330R257n099j718R749m787r157n616j6618k300L0821
9170E1870K0475J1666j2111j4702k168j2699j0373K8302K4019q426Q297j7907
9158F6243j1615J3228K5650J852L315J3080O28O502M762K363j7429K683m386O920
9144A13796N459o16P746Q925n3R906j2341j8246J5301M1337J5824o820o393J734
9130A75559k765J4538K975M280K6330K6181J8663M2975K8287K0565K1940K9620
9118D09148M6587M1847M0582O2756O0772O3240Q0223Q2695J07343J11723J33747
9107A240663J47850J78078K07131K16872K15927K10861K36359K12465J76218R9551
9097C141975M2118k7012r6085j77462j77213j63366j31876j09034p9387m7138
$$ y = [38379, -1124, 16008, 47338, 56595, 51496, 49778, 59527, 54740, 45583, 39967, 23349, 21049, 51870, 72345, 84011, 71900, 57198, 55030, 42331, 31958, 60260, 84279, 75853, 84150, 66243, 54628, 67856, 93506, 95358, 98673, 111753, 112381, 118883, 123645, 126008, 108579, 111262, 106876, 113796, 119255, 118639, 126385, 135310, 135257, 145163, 132822, 114576, 129877, 171214, 187038, 180218, 173825, 175559, 172794, 187332, 190307, 194587, 220917, 247098, 265761, 308736, 337023, 357588, 379528, 409148, 455735, 497582, 538164, 600920, 661692, 724932, 805155, 887850, 995193, 1106916, 1240663, 1388513, 1566591, 1773722, 1990594, 2206521, 2417382, 2653741, 2866206, 3042424, 3141975, 3184093, 3157081, 3060996, 2883534, 2706321, 2542955, 2411079, 2302045, 2222658, 2175520]
9087B175520l5170J0310L6347j7769n6446q0891j04082j42747j38142j49929j50468
9076A346533j06358q4011o7785n1448l6052l8577l2911k6587l0426k4418m120
9065H43840J6974l0981k8843N069k2082k3649r987l192l301o981k2821J2616R377
9052G36039l6581k6490J2483j1063j3049k3063j4964k1243n5053l1021J2694l368
9040E25321k4920O590j5533k6785k6946k2955k6218j7723r242m698o029k7739
9028C23123l1350n826J8000J5115k1264k9169R443j1440k5735m124j6990J012
9016B20795J8789J7354m973l241Q158j397J1796j9198j9189N923N328j5050j2387
9003B12708k4596R13k038j943j0336k7182m2011j0519k9672l1239m249K3799J3213
$$ y = [2175520, 2140350, 2150660, 2187007, 2169238, 2112792, 2031901, 1927819, 1785072, 1646930, 1497001, 1346533, 1240175, 1156164, 1088379, 1036931, 1000879, 962302, 929391, 902804, 872378, 847960, 843840, 860814, 829833, 800990, 806059, 783977, 760328, 750341, 747149, 743848, 736867, 714046, 726662, 736039, 699458, 672968, 685451, 674388, 661339, 638276, 623312, 602069, 547016, 515995, 528689, 525321, 500401, 506991, 491458, 464673, 437727, 414772, 388554, 370831, 361589, 356891, 350862, 323123, 291773, 285947, 303947, 319062, 297798, 268629, 278072, 266632, 240897, 236773, 219783, 220795, 239584, 256938, 251965, 248724, 256882, 255485, 267281, 248083, 228894, 234817, 240145, 225095, 212708, 188112, 189025, 186987, 185044, 174708, 147526, 105515, 94996, 65324, 34085, 29836, 53635, 66848]
8990F6848J8756J7030Q87j1901m726j3931k863p246N673n514q140j2464L623j892
8976D4140J330K179j1963K5411J3532k4812J9406J0806r262J2175k9110m562Q386
8963E7656j237o340j2563q802Q992K4316J4172K0235P106k8948j2450n81J8233
8950G9789J0802J3817P715J1378q591l9J7352M6338N9346O3351L7482Q850P9j0204
8936C37465m6338m9729l8979k1469j0290l7693k1198rJ0972R008p261J1949J2414
8923A48842r528k1607k2051r085j2559j836k3014J0455K2677Q555j6473o033J1721
8910H0064k3357k3397J3375P708K0142J8687j7607P285P71k1055j5129J7467k424
8897F2530j2354J177k489l744n086O160J6162k542k2733j1981J5418K4605K540
$$ y = [66848, 85604, 102634, 103521, 91620, 86894, 72963, 70100, 62854, 68527, 63013, 54873, 42409, 46032, 44140, 45470, 47649, 35686, 61097, 74629, 49817, 69223, 80029, 70767, 82942, 53832, 49270, 57656, 56419, 50079, 37516, 28714, 37706, 62022, 76194, 96429, 103535, 74587, 62137, 61556, 79789, 90591, 104408, 112123, 123501, 114910, 114871, 132223, 178561, 237907, 301258, 338740, 347590, 347669, 337465, 291127, 241398, 202419, 180950, 170660, 132967, 111769, 111760, 122732, 131740, 124479, 136428, 148842, 139314, 117707, 95656, 86571, 74012, 72176, 49162, 59617, 82294, 90849, 74376, 68343, 80064, 56707, 33310, 46685, 54393, 74535, 93222, 75615, 82900, 83671, 62616, 47487, 64954, 62530, 50176, 51353, 48864, 45120, 40034, 46194, 62356, 59814, 37081, 25100, 40518, 65123, 67663]
8884F7663l776k4088j1973n165j0140k419j779J4821J2904K4860J9169M184O236
8871I0497j7133P991j4290j1169N607N122M610l7611k007m082J6090J5462q634
8858E0453Q11R82j2873K6626L0409J1357M98R38J8236r932l401m817L750o213
8844A06824R683K6414J6736j0773p629l501j2622M810j3478K753q111l865m831
8831A02410k710j4082l6414P290J0638L4161Q767k441M542j3229q959J2776J6725
8818A19474J7411K3839K2224R60j0496j934J0306M3597N8528L4306R600J3356
8806C41171n62k3749m3815m4774j6732K100j1411p128j2017o065J3172J7064q459
8793A98795j5633k144r003k8667R870K6100P019Q909K4059K9826L0225Q176j1470
$$ y = [67663, 63887, 39799, 27826, 22661, 12521, 10102, 8323, 23144, 36048, 60908, 80077, 84261, 90497, 73364, 81355, 67065, 55896, 61503, 66625, 71235, 33624, 31617, 27535, 43625, 59087, 50453, 51264, 52246, 39373, 65999, 96408, 107765, 108263, 109201, 127437, 117505, 114104, 109287, 113037, 106824, 116507, 142921, 159657, 148884, 141255, 137754, 125132, 129942, 116464, 119217, 111106, 107241, 102410, 99700, 85618, 49204, 56494, 67132, 101293, 110060, 107619, 112161, 98932, 89973, 102749, 119474, 136885, 160724, 182948, 183908, 173412, 171478, 181784, 225381, 283909, 318215, 327815, 341171, 340609, 316860, 273045, 228271, 211539, 213639, 202228, 195100, 183083, 177018, 190190, 207254, 198795, 183162, 181018, 172015, 143348, 153218, 179318, 186337, 195246, 219305, 249131, 279356, 287532, 276062]
8780B76062k9761j0766J4956K245J5666J0288K16L0990L7081L2978k752J4436
8768C91639L8763O1241N2862L1104O5316P3066N6888M2533n266j9828K343J1922
8756H02583Q71k4191L5257M9168M9243N4161J8366K5275N3443M7932O1143J8189
8744A191440k9322k8531l6324l2144o141K0208J7037N3873O2826M8148L2042L2053
8732A325165L9216K8170K8013M0648O0464M6754L8223P2197Q2206J03961R9409
8721A964426Q0027J14087J18096J23651J32298J60759J36050J90234K28983K54373
8711C502984K95695L04206L49671L91828M65534N43376P27432R63496J216037
8702H760259J469037J746602K049992K379669K701383K999368L571476M643825
$$ y = [276062, 246301, 235535, 250491, 252736, 268402, 278690, 278906, 309896, 346977, 379955, 377203, 391639, 430402, 491643, 544505, 575609, 640925, 713991, 770879, 813412, 808146, 788318, 790661, 802583, 803454, 779263, 814520, 863688, 912931, 967092, 985458, 1010733, 1064176, 1112108, 1173251, 1191440, 1162118, 1133587, 1097263, 1065119, 1058978, 1079186, 1096223, 1150096, 1212922, 1261070, 1293112, 1325165, 1364381, 1392551, 1420564, 1461212, 1521676, 1568430, 1606653, 1678850, 1761056, 1865017, 1964426, 2044453, 2158540, 2276636, 2400287, 2532585, 2693344, 2829394, 3019628, 3248611, 3502984, 3798679, 4102885, 4452556, 4844384, 5309918, 5853294, 6580726, 7544222, 8760259, 10229296, 11975898, 14025890, 16405559, 19106942, 22106310, 25677786, 30321611]
8694C0321611O452672R224573J3401800J9488086K7657564L8081792N1672149
8687A96300247O3219862M8401662m095659m7896201n7440262m8893431l6211487
8680A13384731k5445791j7667897j2240998q542949o047662m421342l443605k730986
8672C2843501k173318j899061j717966j474185j164233q76726o70835m86478l31965
8663B2048734j98302o7075P9394J98397L07868L73572M22161M42938M21105M04428
8653B4433220M29964M38019L88452L05368J55808o6346l35830n96143p63058q31767
8643B3557687p66900o61519n22885m13661l04139k85632l70552n04419o67209
8634A9060771p68805q48592q54365q14244p85574p09916o46744o55872o59476
$$ y = [30321611, 36774283, 45998856, 59400656, 78888742, 106546306, 144628098, 196300247, 259520109, 307921771, 303826112, 255929911, 198489649, 149596218, 113384731, 87938940, 70271043, 58030045, 49487096, 43439434, 39018092, 35574487, 32843501, 30670183, 28771122, 27053156, 25578971, 24414738, 23538012, 22867177, 22380699, 22048734, 21850432, 21783357, 21862751, 22061148, 22369016, 22742588, 23164749, 23607687, 24028792, 24433220, 24863184, 25301203, 25689655, 25995023, 26150831, 26084485, 25748655, 25152512, 24389454, 23557687, 22790787, 22129268, 21606383, 21192722, 20888583, 20602951, 20232399, 19727980, 19060771, 18291966, 17443374, 16589009, 15774765, 14989191, 14279275, 13632531, 12976659, 12317183]
8625A2317183o04784n56649n30135n11125m73265m34523m22667l76451l52360
8616H055224l20544l09380k82069k79781k91924k77657k38077k32712k26661k18873
8606E377546k08382j84746j77765j62413j68622j86829j78156j51207j52087j43692
8596C663647j33279j19854r6303j27523j24998j20082p4013o3759p1552n8637
8586B673647k4820k3932K2500Q862r7880j46320j18452r8687q4187j10607p1688
8575A928436n1593m5185n8698o4582p0270j6874J4514m3623m5923k9301k5692
8564A491209n252L0470J1294J1733K0243k1677o1785q4005p1458n0166m1524n4778
8552A174304m7790n9134l2813q521m000j6313k0738k1065j9792j8789j9155J4324
$$ y = [12317183, 11712399, 11155750, 10625615, 10114490, 9641225, 9206702, 8784035, 8407584, 8055224, 7734680, 7425300, 7143231, 6863450, 6571526, 6293869, 6055792, 5823080, 5596419, 5377546, 5169164, 4984418, 4806653, 4644240, 4475618, 4288789, 4110633, 3959426, 3807339, 3663647, 3530368, 3410514, 3314211, 3186688, 3061690, 2941608, 2867595, 2803836, 2732284, 2673647, 2648827, 2624895, 2647395, 2656257, 2558377, 2412057, 2293605, 2194918, 2110731, 2000124, 1928436, 1876843, 1831658, 1772960, 1708378, 1638108, 1621234, 1635748, 1592125, 1546202, 1516901, 1491209, 1485957, 1516427, 1527721, 1539454, 1559697, 1538020, 1476235, 1392230, 1320772, 1270606, 1229082, 1174304, 1126514, 1067380, 1034567, 1026046, 1022046, 1005733, 984995, 963930, 944138, 925349, 906194, 920518]
8540I20518M625J6193j6750m9672n3996n6979m7202k6895j9868l4459j2747r50
8528F21818q747k0675r240K892p119j0537o474L334J1932L136L885j5850k380
8515E65975N029K042P425J8737k2370j0460J3319J2066j4674k7071J057K3521
8503E74596P849o227O066Q755Q525Q915r590K6487K2678J0730M211q480k6060
8490F28455j5878j2676k6978l5612j4620O328N067J3033J426q55K4147j7440j7409
8477E36988Q52J784k1805l1026l7457j9398m993j400Q676j919k0071j5206J367
8464C96392J6817J9959j67j3211k257j5072j2568k4845p405K0390j3209p365j4034
8451C43425l8558j9902P062O581M768O15N091J1235P551O505J15o247m928j1467
$$ y = [920518, 925143, 941336, 924586, 874914, 820918, 763939, 716737, 689842, 669974, 635515, 622768, 621818, 613071, 592396, 583156, 586048, 578929, 568392, 561918, 565252, 577184, 580320, 584205, 568355, 565975, 571004, 573046, 580471, 599208, 576838, 566378, 579697, 591763, 577089, 550018, 551075, 574596, 582445, 576218, 582284, 591039, 599564, 608479, 598889, 625376, 648054, 658784, 662995, 654515, 628455, 612577, 599901, 572923, 537311, 522691, 529019, 534086, 547119, 548545, 547690, 571837, 554397, 536988, 537840, 539624, 517819, 486793, 449336, 429938, 424945, 423545, 432221, 430302, 410231, 395025, 396392, 413209, 433168, 433001, 419790, 417533, 402461, 389893, 365048, 357643, 378033, 364824, 357459, 343425, 304867, 284965, 292027, 298608, 303376, 303991, 309082, 320317, 327868, 334373, 334488, 328241, 323313, 311846]
8437C11846p866r396o062p075R53K393k152n840k2275j2029J4692J7636J1613
8424B86438j5788k8245R498N339k2031k8863K887j851j7252Q322J4773N524k782
8411B15969J1388m90j4845l0867k962l03j311j8391j1712l306M714R884J323R170
8397A68261J2600k1403l1241J6308R708p785n464k503k0119j3271J3255J5887
8385A34233M862Q504J3159O326j8531O636K1744J860j5221o674n592k6672k9884
8372I4750k6319l101j7493l759J4319J8643J2709K366n566n12q267l165j1111
8359F3494J9671J441p739J0784M5496K9115M127j9098j2005M437M549l761j0630
8346A29881j7374M060N113p812K2416Q887k0951K0902N445k6174k293J3152M668
$$ y = [311846, 303980, 294584, 288522, 281447, 282400, 284793, 282641, 276801, 254526, 242497, 257189, 274825, 286438, 270650, 242405, 251903, 257242, 235211, 206348, 209235, 207384, 190132, 198454, 213227, 218751, 215969, 227357, 226867, 212022, 181155, 178193, 177890, 176579, 158188, 146476, 143170, 147884, 157768, 159091, 168261, 180861, 159458, 128217, 144525, 154233, 146448, 140984, 138481, 118362, 105091, 118346, 134233, 139095, 147599, 160758, 167084, 148553, 155189, 176933, 178793, 163572, 156898, 151306, 124634, 94750, 68431, 65330, 47837, 44078, 58397, 77040, 89749, 92115, 86549, 86037, 77770, 74605, 63494, 83165, 84606, 76867, 87651, 133147, 162262, 166389, 147291, 135286, 139723, 144272, 140511, 129881, 112507, 116567, 121680, 113868, 136284, 145171, 124220, 145122, 150567, 124393, 122100, 135252, 139920]
8333A39920P854Q091J2500l3884q570O926o176l075P38N393O428j6484j2850K1709
8319A28520Q260n249K346o000K293j714M295r828l478l393K1943J0744K3063j587
8305A70215j5374j3464l312O84J5466N668K507k8922M166J2334L5536M6685L2616
8292B64805K5124O6135Q5592R1541J05179J19970J24739J05178P8681M2346R252
8281A118542k2592p2247j24394j22755j21155q6948o6662q9104n4316k6213k2114
8270C10042k5532k9366j6937P969n244l5463j7657J2360K775j2727k0073k0601
8258A49546p245J7236K5532m270j6463L2257J5368j0506k2813K3403L078j1473
8246A93650n11m007R507J5853K939j5367j5551j2025J008l0576q164K5685l821
$$ y = [139920, 147774, 155865, 168365, 134481, 125911, 132837, 126661, 123586, 124324, 129717, 136145, 119661, 106811, 128520, 136780, 131531, 133877, 127877, 130170, 128456, 132751, 122923, 119445, 116052, 137995, 148739, 171802, 170215, 154841, 141377, 138065, 138749, 154215, 159883, 162390, 133468, 137634, 149968, 185504, 232189, 264805, 289929, 356064, 441656, 533197, 638376, 758346, 883085, 988263, 1066944, 1109290, 1118542, 1095950, 1023703, 899309, 776554, 655399, 568451, 501789, 412685, 358369, 332156, 310042, 284510, 255144, 238207, 246176, 240932, 205469, 187812, 200172, 202947, 190220, 170147, 149546, 142301, 159537, 185069, 180799, 164336, 196593, 211961, 201455, 178642, 202045, 205123, 193650, 193139, 189132, 198639, 214492, 217431, 202064, 186513, 174488, 175496, 144920, 136756, 162441, 158620]
8233A58620o915J2972R780Q83P081k817j0789j4997j9058p056O935j0471j7010
8220A07158j4022j1337j730K861n089J1084J9248K4064L8k4909k0481K705J0681
8207A00271N10l174J0955J2706k7916l6644M056J0711j429N860k674L915K2213
8194I9360K235j1481j2832l284m135j2731j734J5466l64l69j1273J0046o7O377
8180G5214j3924j0850L318K6304K830k2922J4037Q402l609P995j207k1090j2331
8167E2167J5225j4924k0390M952J3380M114j1622j6493J2700K1029J0948j5429
8155E5657k3269N61P976r73j5554L906R80j4150J2980O132Q144K6939N843Q02
8141G5974N869M01j4462m520o163q88o06j127j386o125j1424J0987Q152j87n962
$$ y = [158620, 151705, 164677, 174457, 175340, 182421, 179604, 168815, 153818, 134760, 127704, 134639, 124168, 107158, 93136, 81799, 80069, 82930, 77841, 88925, 108173, 132237, 132275, 107366, 86885, 89590, 100271, 100781, 97607, 108562, 121268, 93352, 56708, 60764, 71475, 70046, 75906, 73232, 77147, 99360, 101595, 90114, 77282, 73998, 69863, 57132, 55398, 70864, 70500, 70131, 58858, 68904, 68837, 75214, 61290, 50440, 53758, 80062, 82892, 59970, 74007, 82409, 78800, 86795, 85588, 64498, 52167, 67392, 52468, 32078, 37030, 50410, 54524, 42902, 26409, 39109, 60138, 71086, 55657, 32388, 32949, 40925, 39952, 24398, 28304, 29284, 15134, 28114, 34246, 42390, 69329, 75172, 75974, 81843, 82244, 67782, 63262, 57099, 56211, 55605, 54478, 53092, 46967, 35543, 46530, 54682, 54495, 48533]
8126D8533q113j4041Q322J1228o501J068J9744J021j9474j4202j1711j4217J8401
8113B0058J5013M870R854M226q205p088k59j4449O487N272o245k5603J5635j498
8099A8068O720m762Q177R307k546m1j5717J6417J2041j4022J3084J2433P572k3388
8085D3343j7004P613K860R06o111Q699K967q828n493N881k844n315O148k664n735
8070B4423Q995q554j5194J4799M664j3845P357L57O102N760J1985n835k4974O82
8056A6722L0488J0437r617o809L852L566n70N250n816p325K6271J5972j168j5648
8042F5605k91Q869q387l450P395N307l848M573r485k640j0391j8622K34J198M396
8027D0463J2116k219j2579q632J2121J1409J3714k7155k1158J4342J304j6957
$$ y = [48533, 40420, 26379, 34701, 45929, 39428, 40496, 60240, 61261, 41787, 27585, 15874, 1657, 20058, 35071, 39941, 49795, 54021, 45816, 38728, 38469, 24020, 30507, 35779, 29534, 3931, 19566, 18068, 24788, 20026, 28203, 37510, 34964, 34923, 19206, 35623, 47664, 33642, 46726, 59159, 66731, 43343, 26339, 33952, 36812, 37718, 31607, 40306, 43273, 34445, 28952, 34833, 31989, 26674, 32822, 30158, 24423, 33418, 24864, 9670, 24469, 29133, 15288, 22645, 23002, 29104, 34864, 46849, 41014, 16040, 16722, 47210, 57647, 48030, 41221, 45073, 48639, 48069, 53319, 47503, 40178, 66449, 82421, 81253, 65605, 65314, 74183, 65796, 62346, 69741, 75048, 71200, 75773, 66288, 63648, 53257, 34635, 34869, 36067, 40463, 52579, 50360, 37781, 29149, 41270, 52679, 66393, 39238, 18080, 32422, 33726, 16769]
8015A6769j3488J7825m31m547j94j2149Q250J106Q788P142J3134L499k61L400
8001D8843j9072N127o173j4225k5480N014J1952J6019m270L281J6107J1509n478
7988D3154L149J7881J907p907r931k5392J0919K959j935j2675R45j5717p655O451
7974F153J0798J2761J4263o363M843q82j2104N920l35j0914J0906M285j0317K040
7960C1054L550L721n68k766j4442k8004J5671L3085P520r12k7773j4820k578l90
7946B348K6942J8867k1187k969P238J2529J2942J9997J0306j0327m0988q149L112
7933C0661q21j2671J2557Q976q048J8145Q106o304j8785r157P283J5998J0711
7920E6651j3342k467j3444k6872n099p26R315K1900K6522J2133K586L717j0318
$$ y = [16769, 3281, 21106, 20675, 16128, 15934, 3785, 12035, 13141, 21929, 29071, 42205, 45704, 45443, 48843, 29771, 34898, 28725, 14500, -10980, -5966, 5986, 22005, 17735, 21016, 37123, 48632, 43154, 46303, 64184, 66091, 58184, 48253, 22861, 33780, 36739, 34804, 22129, 23074, 7357, -298, 6153, 16951, 29712, 43975, 37612, 42455, 41573, 29469, 35389, 35054, 24140, 35046, 39331, 29014, 31054, 34604, 38325, 37757, 34991, 20549, -7455, 8216, 41301, 48821, 47909, 20136, 5316, 2738, 2348, 29290, 48157, 26970, 24001, 31239, 43768, 56710, 76707, 87013, 76686, 35698, 27549, 30661, 29840, 17169, 29726, 38702, 30654, 48799, 56905, 50601, 31816, 22659, 29942, 45940, 56651, 43309, 40842, 27398, 526, -4573, -5299, 4016, 25916, 52438, 64571, 67157, 70874, 60556]
7907F0556j5962p889j4044j0711J8844P827J9721J7445J4321j5061k1308R740
7895F3479J1251k4306l5957k895j535J101j346m267J0695K1050K3135K890j9674
7882D3621j9133p923K6553j2673l914J1278J5890j0420j6813p689k4145J5504
7870A0136J6919J8420K610j2460k0771n342L954N000M161J3994O439k4176l558
7857A5326J255N733r19j3397P876M487j190q856J1739J2473j3680j4836j1134
7844e123O555r437j1780J4236Q230K476m459j6470J1395J9899q000J3031N963
7831B6516j2998n620Q021J2148j8165j5308M041Q274J8031J068L404L553j678
7818C1287j6533q215l118L233K962O048L532j3354L272J1903j1392J0111R207
$$ y = [60556, 44594, 36705, 22661, 11950, 30794, 38621, 58342, 75787, 90108, 75047, 53739, 63479, 74730, 50424, 14467, 11572, 10037, 11138, 9792, 5525, 16220, 37270, 60405, 63295, 43621, 24488, 16565, 43118, 30445, 26531, 37809, 53699, 43279, 26466, 18777, -5368, 10136, 27055, 45475, 48085, 35625, 14854, 9512, 13466, 18466, 22627, 36621, 43060, 18884, 15326, 16581, 22314, 21395, 7998, 15874, 20361, 19171, 10315, 22054, 34527, 20847, 6011, -5123, 1432, -8005, -19785, -5549, 2681, 5157, 698, -15772, -4377, 15522, 7522, 20553, 26516, 13518, 7898, 15919, 28067, 9902, -5406, -1365, 6909, 24940, 26008, 29412, 32965, 31287, 14754, 6539, 3421, 6654, 9616, 15664, 19196, 5842, 9114, 21017, 9625, 19736, 28943]
7805B8943J1465j2088K052l5069R40K6243j5808L413J1894p623J685l124j1006
7792A917k36r339q962M573K2219j2474n823P552J6551j0579n658p131L4903o209
7778B1304k8143M870J1469O191J9613j3021j385O230n535M827p743k1032j6726
7765a9081J0413J8250J6875r318l582j6310k4241o261J5735K2411R913R85j0869
7752D920J1182J6494j2788K43j2491K645O336j6073k333o961L717Q95j398J5442
7738I830O260j976j8554j5528K0561J0674j210o543K2154p99r835R317p509J6551
7724C3393j3303q755N51l60p076l845J7341O640o260J046n225j4105N797J1885
7710A7724m805J2732R889q675j354j3941j2178j2037n914O415O227J6762J1230
$$ y = [28943, 40408, 28320, 30372, -4697, -3757, 22486, 6678, 10091, 21985, 14362, 16047, 12923, 1917, 1681, -7658, -16620, -12047, 10172, -2302, -8125, -573, 15978, 5399, -259, -7390, 27513, 21304, -6839, -1969, 9500, 15691, 35304, 22283, 20898, 27128, 21593, 26420, 18677, -2355, -19081, -8668, 9582, 26457, 17139, 13557, -2753, -26994, -33255, -17520, 4891, 14804, 15789, 4920, 16102, 32596, 19808, 20051, 7560, 10205, 16541, 468, -1865, -8826, -5109, -4214, -5612, 9830, 16090, 14114, -4440, -19968, 593, 11267, 10057, 3514, 25668, 24869, 15034, 24351, 16842, 33393, 20090, 11335, 11886, 11526, 4450, 605, 17946, 24586, 18326, 19372, 14147, 42, 5839, 17724, 12919, 25651, 35540, 26865, 25511, 11570, -608, -12645, -18559, -12144, -5917, 10845, 22075]
7697B2075J1234O115N410k0662m262J1061m566j2085j2561O247M071K747l44k916
7683A1564j3103l36Lj3786j839K0631l85l702P434r80J2569j1571j1765n462j75
7668a0903J8382L24k3316P84K3647J6807K1766O794o738k0119j4055j2602m750
7655c979J7075L8m488O091k859j4702j6282M813P52M592P698P020j284N785K0677
7640C0947p69J082j813p617J0644N116j8551j7740r722p241M690K9252J7807K230
7626C8315p109o259j0757j7472O218J3028J282m168n996r985N966J1865R855J877
7612B6660k2661j6592J688J6636J9934j5685l866L420p506j0134l288k844j418
7599a5656Q564N711o635R71Q6q667J7892J5554J4098K1169k6400m1554q71p768
$$ y = [22075, 33309, 39424, 44834, 24172, 19910, 30971, 26405, 14320, 1759, 8006, 12077, 14824, 14480, 11564, -1539, -1875, -1872, -15658, -17497, 3134, 2749, -953, 6481, 5501, 18070, 6499, -5266, -10728, -10903, 7479, 7803, -15513, -14729, 8918, 25725, 47491, 54285, 47547, 27428, 13373, 771, -3979, 13096, 13134, 8646, 14737, 11878, -2824, -19106, -14293, -13541, -8949, -1251, 5769, 4485, 10270, 30947, 30178, 31260, 29447, 21830, 32474, 37590, 19039, 1299, -8423, -15664, -10974, 18278, 36085, 38315, 31206, 24947, 14190, -3282, 2936, 15964, 17246, 13078, 7082, -2903, 3063, 14928, 24783, 26660, 3999, -12593, -10905, 5731, 25665, 9980, 6114, 9534, 2028, -8106, -11394, -14238, -15656, -7092, -1381, -8016, -7045, -6959, -15626, 2266, 17820, 31918, 53087, 26687, -14867, -15738, -23506]
7585b3506P330O283o188O786O201J40j6580M801M284M043r629J0016k2166p118
7571c5303J0782J0506L058K0061N690m106q873j498J3409J014l128l72p185L349
7557G404J3469j6969L465J37L806k333N597K300j2135k0721n966J2500J4300M598
7543I452J9114M112n251J544Q685k0798j0829k498K0605k186M112R508k6646k2636
7529a3712j4148L0395J8436l3109o167J5950N688J7066K70j3220J455q985K385
7516B304J8L159l98J9683N727j0377k620j9140o623r449J422J0095O291n023K423
7501b508J8245M342q137K0091N006j4376k613J324K245Q745j4360m875n47m102
7487H480n322j5958J917o96K0620J94j0708K1054J4660q140O781j7372l0811j7210
$$ y = [-23506, -16176, -9893, -16081, -9295, -3094, -2954, -19534, -14733, -10449, -6406, -16035, -6019, -28185, -35303, -24521, -14015, -10957, 9104, 14794, 10688, 1815, 317, 13726, 14740, 11612, 11240, 4055, 7404, 20873, 3904, 7369, 7506, 11312, 8979, 14576, 16876, 4741, -15980, -21946, -9446, 4854, 9452, 28566, 32678, 27427, 28971, 37656, 16858, 6029, 3531, 24136, 21950, 26062, 35570, 8924, -13712, -27860, 2535, 20971, -12138, -18305, -2355, 3333, 20399, 20669, 7449, 8904, -81, 2304, 2322, 5481, 5083, 24766, 30493, 20116, 17496, -1644, -8267, -17716, -16294, -6199, 92, -4931, -2508, 15737, 20079, 11942, 32033, 37039, 22663, 20050, 21374, 23619, 32364, 18004, 13129, 12582, 8480, 3158, -12800, -10883, -11579, 9041, 9235, -1473, 19581, 34241, 26101, 32882, 15510, -15301, -32511]
7473c2511m783K4992Q910J1143N534j3623O206j5970r855R012J2393J3697J6802
7460C1947J676k1811M750K29l212J0076Q889K068N070k006k1655r551m880j6333
7446a4743l131M351N287J5047J388m246j9486J2983J8921l952r728j2694n370
7433a5373o43j2061Q247M630J8043P563o163L357j5255r359l970P651j5465j1692
7419d0490j1208L700K8239J7868P268j206R824L0888R477j9362j6135q788j9521
7406i446l063K49K581n664J229J1683M461J9560j038n302j0861N290j4719M372
7392f68K3856J7533k1499j3781k6421r195P678Q248r9n032L450j6654j769J0142
7378b4211m850R537J6243J5152j2936j0127j8010k994R889J093K2771M058N474
$$ y = [-32511, -37294, -12302, -3392, 7751, 13285, -338, 5868, -10102, -19957, -10945, 1448, 15145, 31947, 33623, 11812, 16562, 16791, 13579, 23655, 32544, 34612, 39682, 37676, 16021, 6470, 1590, -14743, -17874, -13523, -8236, 6811, 8199, 3953, -15533, -2550, 16371, 12419, 2691, -10003, -15373, -16016, -28077, -19830, -15200, 2843, 10406, 4243, 7600, -7655, -17014, -20984, -13333, -28798, -40490, -51698, -47998, -19759, -1891, 5377, 4171, 13995, 44883, 54360, 34998, 18863, 10075, -9446, -12509, -12260, -9679, -15343, -14114, -2431, 2030, 21590, 20552, 15250, 4389, 9679, -5040, -668, 23188, 40721, 19222, 5441, -20980, -30175, -22497, -14249, -14348, -19380, -15930, -32584, -34353, -24211, -29061, -19524, -3281, 11871, -1065, -11192, -29202, -32196, -22307, -21214, 1557, 5615, 11089]
7365A1089n681R827J4596j4176p69n210k442L730j2254j2931k788K568j466L4431
7351A8524M595j7938L500N779K92j1161r156K0509N42Q969K2076J529o044k5481
7337A6535j6738j5904K1470M457j0348j3056J4965J2492k476j7542M554M142M598
7324G149L265Q638Q524o961l622n031J4208J8102p990j3976K0117J3202j3176
7311D2449j0028l569j6726k3397j7130L505M577q053k653J8265J5736P181J0022
7298B0179n681p075j8604j3528j0229J2354j4307j4013n74M026j349J5862J1501
7285b1438L773n275K2465K1661O30p361m312k232o018j2413L788k092m791Q728
7271d887J7020j1605J7944K5421j933k0471k7225k7665k210J2225L645K101J1431
$$ y = [11089, 5408, 15235, 29831, 15655, 14886, 9676, 7234, 10964, -1290, -14221, -17009, -14441, -15907, 18524, 23119, 5181, 8681, 14460, 14752, 3591, -5565, 14944, 15486, 24455, 46531, 48060, 42016, 16535, -203, -16107, 5363, 9820, -528, -13584, 1381, 13873, 11397, -6145, -1591, 2551, 7149, 10414, 19052, 27576, 20615, 16993, 11962, 26170, 44272, 36282, 22306, 42423, 55625, 42449, 32421, 28852, 12126, -11271, -28401, -24896, -20319, -28372, -31025, -12760, 2976, 10157, 20179, 14498, 7423, -11181, -24709, -34938, -22584, -36891, -50904, -51478, -47452, -48801, -32939, -21438, -17665, -22940, -475, 21186, 21816, 14455, 10143, 7911, 1893, -10520, -6732, -8824, -13615, -4887, 12133, 528, 18472, 43893, 41960, 21489, -5736, -33401, -35611, -23386, -19741, -17640, -6209]
7258f209L698j8401P076J3834n648l5018p570L132L5194K246J0613K0816m173
7245A9590l1180R04J4540k5350m360J4790J4130P223j0999r580j3043j3417J7490
7232a9262J7051o229j7908R258M519m10R562K804K279O810O43J5971Q011K2109
7218E5208J5088k7528l2726o97J7101r277L06n040m72j057k765L022l321M203
7204A2045j3143R667K216K658j7540n974J5098k084p242J9335L597K779j4983
7191F429m913k1037K698K2488Q417l584l603n76q252r613j3013K0713L756r266
7177i356j950q088o759J4422Q252j147J7648K7333j4409k5901J0986r438k309
7164g16J0914R077l725k2164M000J9328n44q994o41j587J2096j2379o479J4597
$$ y = [-6209, -2511, -20912, -13836, -2, -5650, -40668, -48238, -45106, -9912, -7666, 2947, 23763, 19590, -11590, -10686, 3854, -21496, -25856, -11066, 3064, 10287, -712, -10292, -23335, -36752, -19262, -2211, -8440, -26348, -17090, -12571, -12981, -3419, -615, 1664, 8474, 9117, 25088, 33099, 55208, 70296, 42768, 10042, 9345, 26446, 17169, 17475, 12435, 11963, 10906, 8141, 11163, 7842, 12045, -1098, 8569, 10785, 13443, -4097, -10071, 5027, 2943, -4299, 15036, 18633, 21412, 6429, 1516, -19521, -16823, 5665, 14082, 10498, 6895, 6319, -1933, -11546, -24559, -3846, -90, -9356, -11306, -19394, -26153, -11731, -3479, -4626, 13022, 40355, 25946, 45, 11031, 1593, -716, 10198, 19275, 15550, -6614, -2614, 16714, 16170, 7176, 6535, 4948, 17044, 4665, -1814, 12783]
7150A2783N590J1776O47j475m687k8433K198K346j3672L945Q471j4447k5388k6583
7136f6929J4587M227J9051j77J878J3701K2105K590m851O293J1646J271n213j8958
7122A221P285J3137j5933p380p094l842K3071J0012J2244j0018k4307N889L679
7109G964n560n385J4629Q287O400j5183j8856j4256J1671j0003j1926J7492R090
7096e636j3567j0285J0241K9585J1494j0387j5624K7733j979m235j921k0388k4292
7083b9261K4957K694P203J0702M64k1800j0387L436k335K3834P029k0685n242
7070i391J4570K4792J1493j096p523k0868p277k031M921j2371q933R140n576J2366
7056B216Q396R034j1224o325j3992N300O854m134j5820O77J9347j92r064m419
$$ y = [12783, 18373, 30149, 30796, 29321, 24634, -3799, -1601, 745, -12927, -8982, -511, -14958, -40346, -66929, -52342, -48115, -29064, -29241, -27363, -13662, 8443, 11033, 6182, 12475, 24121, 25392, 20179, 1221, 8506, 21643, 5710, -1670, -8764, -12606, 10465, 20477, 32721, 22703, -1604, 4285, 7964, 2404, -2981, 11648, 19935, 26335, 11152, -7704, -21960, -10289, -20292, -32218, -14726, -5636, -19203, -29488, -19247, 10338, 21832, 11445, -4179, 23554, 21575, 17340, 15419, -4969, -29261, -4304, -1610, 5593, 16295, 16759, -5041, -15428, -11992, -14327, 9507, 16536, -4149, -9391, 5179, 29971, 41464, 40368, 32845, 11977, 4700, 2669, 7590, -4781, -13714, -4574, -10150, 2216, 10612, 19646, 8422, 2097, -11895, -6595, 259, -3875, -19695, -19018, 329, 137, -8927, -13346]
7042a3346R579J5169L506p980L870J8626N446j2827j344l962o454j336Q882p811
7028A0018k25J3975L718M595m852J878K833r4p596l167n405q602j615p257r497
7013a1293j3704n887N403J7540j0674j1882K4386N000j9199J0070K946l516M388
7000f422j3184q478J0950J5558M833j8008K408J385j911j4192J457J1701r44P139
6986g708K5529r984r586P425k701M252l896k9233J4875R350J5389R607j359n171
6972A6789Q190K1659q03k8195r318l646P32n074k1243J0722J8116L523j5847P189
6958B794l164j7891j604n69J6033M520J3911n402r405k178k2121K1329K4368j4218
6944F403k4731l697J2441Q363M981n791L36n63m719K4839K0456R243q735k0781
$$ y = [-13346, -3767, 11402, 14908, 6928, 10798, 29424, 34870, 22043, 20699, 16737, 10283, 8947, 17829, 10018, 9793, 23768, 27486, 32081, 27229, 29107, 31940, 31846, 24250, 21083, 15678, 7076, 5461, -1796, -11293, -24997, -30884, -25481, -7941, -18615, -30497, -6111, -1111, -20310, -10240, -7294, -10810, -6422, -19606, -28084, -17134, -1576, 3257, -14751, -12343, -10958, -12869, -27061, -25604, -13903, -14847, -7708, 17821, 7837, -1749, 5676, 2975, 7227, 3331, -25902, -11027, -1677, 13712, 23319, 21960, 16789, 24979, 46638, 45835, 17640, 8322, 4676, 5408, 334, -20909, -10187, 7929, 11452, -4395, 2794, -370, -18261, -19865, -20434, -4401, 119, 14030, 8628, -777, -2955, -25076, -3747, 20621, 6403, -18328, -22025, -9584, -1221, 3760, -2031, -1695, -2258, -6977, 17862, 38318, 47561, 38826, 18045]
6930A8045j5191k357J4372n68m20Q24j0244j5994J286j3670j8141K465J2120L3254
6916E781J3724j5880O884M980J1687j0676j1705n517j5951L3322J5423j5263l616
6903A3193j6575q111J1458K329j2830J5219J2147J1702J5111j2704l071l33n674
6890B1861L763P733J274k525Q92j0069j4081j8856J5770K3635N177j8513O002
6877B2063J3784j8203k0376j1606j410J1230J959j8827j5961J1292L9563K434
6865A5942j3326m663l812R987j7155M405J1496J1076o995J890p664l2148J3763
6852a7204K340j2212J4666K3171j2850J2276r622o639l2946o339J4918K2237P570
6839f34j3075o223M90K2545K871k3202j5105P039l208m439J87J880l204J4170
$$ y = [18045, 2854, 497, 14869, 14301, 13881, 14705, 4461, -11533, -10247, -23917, -42058, -39593, -27473, 5781, 19505, 3625, 10509, 15489, 27176, 16500, 4795, -722, -16673, 16649, 32072, 16809, 13193, -3382, -11493, -35, 2294, -10536, 4683, 16830, 28532, 43643, 30939, 27868, 27535, 21861, 25624, 33357, 34631, 32106, 32998, 22929, 8848, -10008, 5762, 29397, 34574, 16061, 22063, 35847, 17644, -2732, -14338, -15748, -4518, -2559, -21386, -37347, -26055, 13508, 15942, 2616, -2047, -5859, 4128, -13027, -8622, 2874, 13950, 6955, 8845, 1181, -30967, -17204, -14864, -27076, -12410, 10761, -2089, 10187, 565, -6074, -39020, -45359, -30441, -8204, -634, -13709, -19932, -19442, 3103, 5974, -17228, -32333, -25294, -28502, -32941, -32754, -30874, -34078, -19908]
6825a9908K5147N704j3395J591P450J3408r124m055q202k1208k7812j0669J5144
6812d5929K2267J7001l976O98N205j3442n249R762q400k0530L020Q782J0964J6573
6798c254J1352N090J094n635R781j3275j6235n507R484m570j3930N278M323O342
6784i662J811J0412q490l406j3005N405J9737K0167m278j5696j4419J3461Q943
6771A0980Q316n283j1720j2247K1252p028l5793N442l210P54J5596L445o012j880
6757a7388J2116K2293q223j8603r03j5608l817J2189r813J8603J7604N121J3543
6744B7114Q325k509n832j6750K327j3316q687Q126J879j1060j2436P154J8548
6731B883J2276p174R2J1892J5044J6346J3391L1014N2369J0870k3311k5811l8698
$$ y = [-19908, 5239, 10943, -2452, -861, 6589, 19997, 10873, 6818, -1384, -22592, -50404, -61073, -45929, -23662, -6661, -10637, -9939, -4734, -18176, -23425, -13663, -22063, -42593, -39573, -30791, -19827, -3254, 8098, 13188, 14282, 8647, 18428, 5153, -11082, -16589, -7105, -11675, -25605, -20327, -16004, -9662, -7851, 2561, -5929, -9335, -22340, -16935, 2802, 22969, 18691, 2995, -11424, 2037, 10980, 19296, 14013, 2293, -9954, 11298, 4270, -31523, -26081, -29291, -28537, -12941, -9496, -15508, -17388, -5272, 17021, 8798, -9805, -10708, -26316, -30133, -17944, -27757, -9154, 8450, 13571, 27114, 35439, 32930, 27098, 10348, 12675, -641, -9328, -1202, 677, -10383, -22819, -15665, 2883, 15159, 7985, 8077, 19969, 35013, 51359, 64750, 95764, 148133, 159003, 135692, 109881, 71183]
6718G1183j1579P084j5303j0974j465n362j1233P21q646j0116J6307r99m047J2858
6704B8429r599j9769M810J7362j1986n764j961P280J716R743k570J214j3530j9079
6690a3704J9509L1705J2026j3933J9315j1363j4609j4708j7508m829J6282k6646
6678a8463q208n826J3286J5479l514o591q57J0373Q179R877o204n669J1832K289
6664A5983l808q305k9667j5820J2240M0590L1797K042l882m300k5031l881j548
6651F410j279k695j4710l2372j1928J1781J1704N25K2583K1568O327k3689m41
6638f216J0935P18j2854J3020J3986O56J5747m318k6709j6090n198j921N688J4856
6624B300K020j3752L1693J5959k789j0568j5674K172n181l7937j5582K1105K1571
$$ y = [71183, 59604, 66688, 51385, 40411, 38946, 33584, 22351, 23072, 14426, 4310, 20617, 19618, 15571, 28429, 18830, -939, 3871, 21233, 9247, 3483, 1522, 8802, 10518, 20261, 17691, 18905, 5375, -13704, 5805, 37510, 49536, 35603, 54918, 43555, 28946, 14238, -3270, -8099, 8183, -18463, -26671, -32497, -19211, -3732, -7246, -13837, -14694, -4321, 3858, 13735, 7531, 1862, 13694, 15983, 12175, 3870, -25797, -41617, -29377, 11213, 43010, 45052, 41170, 36870, 11839, 7958, 6410, 5131, 2436, -12274, -44646, -56574, -44793, -33089, -32564, -9981, 11587, 17914, -5775, -6216, 4719, 5437, -7417, 5603, 19589, 20245, 35992, 31674, 4965, -11125, -16323, -18244, -12556, 2300, 4320, -9432, 22261, 38220, 35431, 24863, 9189, 11361, 6180, -31757, -47339, -26234, -4663]
6611d663N101j901J6213j0814J2009R823j3833k0217N38J1427m978K776j5804
6598a4323j0492r79j4501L397J2346M275q855k767L4812J1853k3923k0873K2075
6585g955Q119j0716O822J4647j4141O743J7716R212r122o849R540J721p697j0248
6571G792K691m040M425n858o234m039R643J5074J1811k204j5226M896J26j2859
6557E998j1409o318n233J4997K204L378K196J170m847R448j1305k5134L708J4513
6543f634R008O684J1328L541q845R897R453r638o185j6972M337j8860l0556K166
6529d1276J5936K3156J4342j4274j9178J4888J761k3046k509N086J6124J1377
6517B387j7730k413R916l535j0128M255O035K1546R676r625l400Q727j0576r475
$$ y = [-4663, 438, -1463, 14750, 3936, 15945, 25768, 11935, -8282, -7744, 3683, -1295, 1481, -14323, -24815, -25794, -40295, -36898, -24552, -20277, -29132, -31899, 2913, 14766, -9157, -30030, -7955, 164, -10552, -3730, 10917, -3224, 3519, 21235, 30447, 21325, 14476, 24016, 25737, 18040, 7792, 10483, 6443, 10868, 5010, -1224, -5263, 4380, 19454, 31265, 29061, 13835, 18731, 18857, 5998, -5411, -11729, -16962, -1965, 239, 3617, 5813, 6983, 2136, 11584, 279, -24855, -21147, -6634, 2374, 9058, 20386, 23927, 15082, 24979, 34432, 24794, 18609, 1637, 5974, -12886, -43442, -41276, -25340, -2184, 12158, -2116, -21294, -6406, -4645, -27691, -30200, -25114, -8990, 2387, -15343, -17756, -7840, -11375, -21503, -17248, -11213, 10333, 20009, 10384, 6984, 15711, 5135, -4340]
6503d340j2837j2048K743J7564K1433j4184m402J3937J9136p029j2893Q641l802
6490A1919j1689j3845J6955K8542j0289n118k0212J756Q925K305K372j4470O092
6477C243o179J7426j1723j7312J3274j8192M041R945o847j1790J290m768O447
6464b1145K2767N951j9250l856K2464r016R23J3864J9502q07k4342k0307o651
6451a9903k921j380J523R301Q093K0555K1621J721j0192R329l150j1882j397j3372
6437G946r239l208k021P332k356R566m6o497j5351j957Q016j667j8600J2154P238
6422h690l789O347K6278J814r180m68k913N714j7979j5715J0189J0120n002n049
6408h323p990j6323L014R264P12j1167M360J6126J0009l466Q304K3456J3051k4647
$$ y = [-4340, -17177, -29225, -26482, -8918, 12515, -1669, -6071, 7866, 27002, 19973, 7080, 15721, 11919, 230, -13615, 3340, 31882, 21593, 16475, -3737, -1981, 6944, 9249, 11621, -2849, 3243, -2936, 14490, 2767, -14545, -1271, -19463, -15422, -5477, -12324, -24114, -22824, -27592, -21145, 1622, 7573, -11677, -15533, 6931, -2085, -1162, 12702, 32204, 31397, 7055, -13252, -19903, -22824, -24204, -22681, -13380, -5287, 15268, 36889, 38610, 28418, 37747, 34597, 22715, 21318, 7946, -1293, -4501, -6522, 810, -1546, 8020, 7974, 1477, -13874, -15831, -7815, -9482, -28082, -15928, -8690, -12479, -6132, 20146, 21960, 12780, 12312, 9399, 15113, -2866, -18581, -8392, 1728, -3274, -8323, -16313, -32636, -29622, -20358, -19646, -30813, -26453, -10327, -318, -3784, 4520, 27976, 41027, 16380]
6394A6380k3157r000k567k193k358K1687J8758k1360p991m457l625L1754J3744
6381B5615M389q754k3178j0058j1641L216L1593L751j2215J1931M167K0617Q966
6368D8399P052j3017j1570j6291k9519j6626K3612J0960p245j2273K071J0716
6356c731l89p561K2598k780j5108o739N466L075j0145Q51l464l57N205k061O612
6341h528J249P298L880o508l402j0137K3392J0628o494J0960m379j629m194K421
6327A4557k446j6764j4118J3470K2463p470p863k623k5289Q542K6361j4284j959
6314g423L057o361J7990J7083J0747J316j9683k2470j855j9360k3865j1225M3732
6301a8317J9330R149l172m839j6119k323p353J3879R498j1266r629K7131K3637
$$ y = [16380, -6777, -15777, -18344, -20537, -22895, -1208, 17550, -3810, -11801, -16258, -19883, 11871, 25615, 30004, 21250, -1928, -11986, -23627, -20411, 11182, 14933, 2718, 14649, 18816, 39433, 48399, 55451, 42434, 30864, 14573, -14946, -31572, -7960, 3000, -4245, -16518, -14447, -3731, -4120, -11681, 10917, 8137, -6971, -13710, -8244, -5169, -15314, -14463, -17927, -18284, -13079, -15140, -8528, -7279, 19, 3899, -2609, -6011, -16148, 7244, 17872, 11378, 22338, 17959, 16330, 12136, 14557, 12111, -4653, -18771, -5301, 17162, 9692, 1829, -794, -26083, -17541, 8820, -5464, -7423, -4366, -10727, 7263, 24346, 35093, 36409, 16726, -5744, -7599, -26959, -50824, -62049, -18317, 1013, 10162, 6990, 2151, -13968, -16291, -23644, -9765, -267, -11533, -21162, 5969, 29606]
6288B9606j7892j5074K724L247M874J9618J0091j0459j6178p159l0727k8734l16
6275e6379P657L9310K7370q143L145j9108j3424m407n50K332o737N354K4409L62
6261A191p940q679q594k3060L620Q175j111L0902J6276J1871k168l30n065J3296
6247B8384k2698k8260m75J2471J5364O201J1208J1213N428K157j1102Q415J0949
6234D9255J5460o823j7942j0888l865M461k0285m0031p87N120M152J9885J6980
6221A4692q258r788o950M976j255P301j0431Q696j594k151o705k5637r521J3746
6207c2879J8348R196K0898J2346N922j6979j8643k6995N191J4268O352L012L664
6194C701j0035j1715m722N867K512J1894K5002L362n80m978j2824k2295l7953
$$ y = [29606, 11714, -3360, -636, 2611, 7485, 27103, 37194, 26735, 10557, 3398, -27329, -56063, -56379, -48722, -9412, 17958, 9815, 12960, -6148, -19572, -23979, -24529, -22197, -28934, -23580, 829, 1191, -6749, -15428, -24022, -47082, -43462, -35287, -36398, -5496, 10780, 22651, 20483, 20153, 15088, 28384, 5686, -22574, -23049, -10578, 4786, 10987, 22195, 33408, 38836, 40993, 29891, 38306, 49255, 64715, 57892, 39950, 29062, 25197, 29658, 9373, -30658, -31445, -26325, -22173, -2288, 14692, 6434, -3354, -10304, -5328, -6583, 718, -9713, -1017, -2611, -4762, -11467, -37104, -46625, -32879, -14531, -5335, 15563, 27909, 33831, 16852, -1791, -28786, -23595, -9327, -2975, 37, 3701, -6334, -18049, -22771, -16904, -14392, -2498, 22504, 25866, 25286, 20308, 7484, -14811, -52764]
6181e2764P163J9357J789j8256K575J9776K3910r105j3337j3072K0679N712k044
6168g617M079Q845O557N619J682K486P015J899j8181j3690K113j0032k9004l607
6154d1836J0459J3541K9907m889M373J2141O053K9971l793j2390J7318j7357l2216
6141A1282k829K1064q553l734R864j5065l0645j2763J5255n920j5296J9022K0512
6128B194O572q683P592j2603k0681j4453O771J5008p484j9564p508J0004K0191
6115b2644J6631j1609J0572J0354R333L788k021k5453r614p083J6005J1831K485
6102B575J551j1115j57K502p998m389r2p661J971o21L146l815q598r152J1730
6087c0123J5559r330J5597J0228q419M836M7j8823l645K046J9368J4157m814j797
$$ y = [-52764, -45601, -26244, -24455, -42711, -40136, -20360, 3550, -5555, -18892, -31964, -11285, -5573, -7617, -3538, 5307, 11864, 17483, 19165, 21651, 28666, 30565, 12384, -1306, 807, -9225, -38229, -41836, -31377, -17836, 12071, 7182, 11555, 23696, 29749, 59720, 55927, 43537, 60855, 43498, 11282, 8453, 29517, 20964, 17230, 27094, 12029, -18616, -31379, -16124, -22044, -37340, -18318, 2194, 8766, 83, 7675, -4928, -25609, -40062, -33291, -18283, -25767, -45331, -52839, -42835, -22644, -6013, -17622, -7050, 3304, 12637, 16425, 14404, -11049, -20663, -27746, -11741, 90, 2575, 4126, -6989, -7146, -4644, -12642, -17031, -17123, -24784, -22813, -23434, -20288, -24103, -32701, -41853, -30123, -14564, -23894, -8297, 1931, -6488, -1652, -1605, -20428, -24073, -22027, -2659, 11498, 6684, 4887]
6073D887j3260K657J110o669K192J6188K4215j273n311j1681j1203j8376j1223
6060b7747J4575R156O813K4594j9608j4314Q747R498O359k656l962L413J0123
6047B4991M070k8969k4948J5127K5622k2196k7119J427J4359K9049N990j2675
6035D728o596j7744J0827j0524M932Q14p493N558J8386l998L604J862m346k1472
6021b1462n801K1008O625j5937q163p939J0608J195o830J714K0776j1662j3472
6008b9340J0036O443J7707J1131J0145q910k3685J4025P254o954J0917J5976k005
5995C2740k3785k2108J2569K0936j648k0044m390R91K113J3490l548o754j0758
5982a0196o886L780O1M027J1257j0881j0742L985o155J1902R896K686j502P402
$$ y = [4887, -8373, -5716, -4606, -11275, -9083, 7105, 31320, 30047, 24736, 13055, 1852, -16524, -27747, -13172, -4016, 2797, 27391, 7783, -6531, 2216, 11714, 18073, 15417, 11455, 14868, 24991, 29061, 92, -24856, -9729, 15893, -6303, -33422, -31995, -17636, 11413, 17403, 4728, -1868, -19612, -8785, -19309, -14377, -13563, -21056, -15498, 2888, -1110, 2494, 4356, 10, -21462, -27263, -6255, 370, -15567, -23730, -31669, -21061, -19866, -26696, -24982, -4206, -15868, -29340, -19304, -12861, 4846, 15977, 26122, 17212, -6473, 7552, 14806, 7852, 18769, 34745, 32740, 8955, -13153, -584, 20352, 18704, -1340, -5730, -4739, -2626, 10864, 7316, 562, -10196, -17082, -13302, -13241, -9214, 2043, -8838, -19580, -15595, -21750, -9848, 48, 2734, 1232, 8634]
5968H634k5427L488J8528J9909K8497j4828j9681j5946k8890k01K1368J1115q650
5955b084j5611j810Q350K7662r781j9510J4047K1841r148N448O700N83j3109r865
5941C713k536O440J5712J0247j482j0296k9941r709N995k0793k1042K0482o339
5928c9549l0798J002L6763K0459p569L515n322R733K0623N171J7002l833j3822
5915A3375l4774j608J3381J896M558J3740K532M646j3717O119k166N727R97j4744
5901c8J557Q193k137J6476J656k6507m104R224L879j1914k253J8287O346p091
5887A1574j7858o008J7332j8276j9893K172n676J6069M284J181j8868L511K7281
5874c175Q244J3638O762J757j5284l8162l382K3740J6228P31j3560J5117K1442
$$ y = [8634, -16793, -13305, 5223, 25132, 53629, 38801, 19120, 3174, -25716, -25917, -4549, 6566, -2084, -17695, -19505, -11155, 16507, 6726, -12784, 1263, 23104, 13956, 19404, 26104, 26687, 13578, 3713, 1177, 7617, 23329, 33576, 32094, 21798, -8143, -17852, -11857, -32650, -53692, -33210, -39549, -70347, -69345, -32582, -12123, -19692, -16177, -21499, -11766, 8857, 14028, 31030, 27197, 13375, -21399, -23007, -9626, -7730, -3172, 10568, 13100, 17746, 4029, 10148, 7982, 13709, 14706, -38, 1519, 9712, 7575, 24051, 25707, -800, -4904, 4320, 8199, -3715, -5968, 12319, 18665, 11574, -6284, -12292, 5040, -13236, -33129, -30957, -36633, -20564, -16280, -15099, -33967, -30456, -3175, 5069, 18707, 25469, 27226, 11942, -26220, -29602, -5862, 10366, 11097, -2463, 12654, 34096]
5861C4096R100O68j1898j6922k4476K846j0168j3367J6758Q148r887K004J6068
5848B970J2923M195K592j8220o507N593n732k832J8776P614O538l93J970L42o746
5833B3083m329j4740J0081j0341L536K2783k8964j4236K3111m863K083q803J791
5820A92N812j6774K94p551l755K3297K3536l3180j8325j1861J9140O433J0179
5807b563J7718r306o471o090K455m564J2361J7206J8229L034k4009j2821P629
5794A2808k360j0659R022J8621J542n406n335j6933j5478j1356J2383m287n756
5781b3194K0450q030L17q41p622O79K1072P027k346j8152O422l700J678j0166
5767a6406q467N666L1043K6220l975j0813o694j8570j6045J6928K1588m130J853
$$ y = [34096, 43196, 43864, 31966, 15044, -9432, -6586, -16754, -30121, -13363, -5215, -15102, -13098, 2970, 15893, 20088, 22680, 4460, -2047, 3546, -2186, -5018, 13758, 21372, 27910, 27517, 29487, 29829, 23083, 18754, 4014, 14095, 3754, 7290, 30073, 1109, -13127, 9984, 5121, 7204, -1599, 192, 6004, -10770, -10476, -18027, -21782, 1515, 25051, -8129, -26454, -38315, -19175, -12742, -2563, 15155, 5849, -622, -6712, -4257, -8821, 3540, 20746, 38975, 42009, 18000, 5179, 12808, 10448, -211, 8811, 27432, 28974, 23568, 18233, 1300, -14178, -25534, -13151, -17438, -23194, -2744, -10774, -10457, -11298, -18920, -18241, 2831, 9858, 7512, -10640, -4218, -7918, -6240, -16406, -24873, -19207, 11836, 38056, 34081, 23268, 16574, -1996, -18041, -1113, 20475, 16345, 18198]
5754A8198Q921M377j7961j7347j2639j2864N989Q651p333L713p016o476J6392
5741a5395L737j0145K2626L521q330l861J0907j739Q116R533l079r866j6022j2071
5727b2068n003J0216k077J0553j762j420L934O195o040j9460N278J243R348j4668
5713b5731K172j412j666m665O973J0717J3376J8394K8877r693j1308J664m0325
5700a2627m8926L455J1230O055J2901J5184J0747o106o161J8363m432k4980O341
5687a8956K4436K0360P225k952m856j4350j6425j3973k939K960K280J1419M511
5674a260Q041l609j8539m348J254K6912k814k1008k653j2044O72J2688Q144j9988
5660b8552j4686K0626J5086r37P290O001K508J9656m364Q819N045j0066k6535
$$ y = [18198, 27119, 31496, 13535, -3812, -16451, -29315, -23326, -14675, -22008, -18295, -25311, -31787, -15395, -11658, -21803, 823, 4344, -3986, -7847, 3060, 1321, 9437, 18970, 15891, 6025, -9997, -22068, -27071, -16855, -18932, -8379, -10141, -11561, -7627, -1432, -7472, -26932, -21654, -20411, -11063, -25731, -23559, -24971, -26637, -31302, -24329, -13612, -236, 18158, 47035, 37342, 26034, 27698, -12627, -61553, -58098, -46868, -40813, -27912, -12728, -1981, -8087, -14248, 4115, -317, -25297, -18956, 5480, 25840, 33065, 30113, 25257, 10907, -5518, -19491, -22430, -19470, -17190, -5771, -1260, 6781, 3172, -15367, -19715, -18461, 8451, 5637, -15371, -18024, -30068, -29396, -16708, -8564, -28552, -43238, -22612, -7526, -8463, -1173, 4828, 7336, 26992, 22628, 31447, 36492, 26426, -109]
5647a09N655L916O193L136P198J8364K975k840l1805p253J8630m725k3560k3833
5633b8058K059J8859K001o910J324j3442j3912J6075K4865J3226j1463n872K6206
5620B4958M550N793J889J584j0520j5517J143N195q858j311k138k6234O078m351
5606a7739j0781K547K7454J0919n772K339N969j1254J7498j0034l181O318n495
5593H788L868J3394p351r592J4802N76k2552K4499q345j0440O483l409j8820m469
5579a2568k6244j453J9946P21J6339J5395J4860J9232O176k724j8558k6061m346
5566G15J5422q80j7151q597o283m575m005K0021o718k015J4074j1233m846K2808
5552F737J8247j5159j1435k524J886O066Q556J2753k2363m592j9619j4595J4567
$$ y = [-109, 5546, 9462, 15655, 18791, 25989, 44353, 47328, 44488, 12683, 5430, 24060, 19335, -4225, -28058, -25999, -7140, -5139, -12049, -10725, -24167, -38079, -22004, 2861, 16087, 4624, -1248, 24958, 29508, 35301, 37190, 38774, 28254, 12737, 13880, 19075, 10217, 8906, 6768, -19466, -13388, -17739, -28520, -25973, 1481, 12400, 6628, 8967, 14936, 3682, 21180, 11146, 7965, 14283, 8788, 12656, 26050, 18699, 9107, 23909, 24485, 1933, 26432, 18087, 7647, 14130, 10721, -8099, -12568, -38812, -40265, -20319, -19598, -3259, 12136, 26996, 46228, 52404, 49680, 31122, 5061, 715, 16137, 15257, -1894, -10491, -16774, -21349, -25354, -5333, -12051, -14066, 8, -11225, -16071, 6737, 24984, 9825, -1610, -4134, -2248, 3818, 12374, 25127, 2764, -1828, -21447, -36042, -21475]
5539b1475K3139j6191K4180K5570k541j162j1150j8889k5640r424J4502K0144
5527A063L2257k4315p915J4217p081j8132N569K2478Q039k020k550n82J3087j0915
5513B3200L855n671p70K299j6121r728J1491L543J3682p88j2824O632L334o084
5499A6050k899m565N745N847Q717R256j0137n691k1279j4092j8680O695J7095
5486g938j9191l7177J0061K6571J5576P601P931J2159J2898j1764k0297m720K3526
5473A5236J964k7778p544Q843M978j0329J7682L029o787o858J009J4925l174j2418
5459g222j4943q949Q791p406J2835J2822j6005Q569M710M432n153O503j2681o662
5445b0359J7574J2773Q71j6657o2k829k07K5731o410j9122K2543O740n404q636
$$ y = [-21475, 1664, -14527, 9653, 35223, 32682, 31520, 20370, 1481, -24159, -33583, -19081, 1063, 33320, 9005, 1090, 15307, 8226, -9906, -4337, 18141, 26180, 24160, 21610, 21028, 34115, 23200, 27055, 21384, 20614, 22913, 6792, -2936, 8555, 12098, 25780, 24992, 12168, 18800, 22134, 16050, 13151, 8586, 14331, 20178, 28895, 38151, 28014, 22323, 1044, -13048, -31728, -25033, -7938, -27129, -64306, -54245, -27674, -12098, -4497, 3434, 15593, 28491, 16727, -3570, -8290, 15236, 17200, -10578, -18122, -9279, -4301, -14630, 3052, 6081, -706, -7564, -6555, 8370, 5196, -7222, -22165, -31114, -22323, -29729, -16894, -4072, -20077, -11508, -6798, -2366, -7519, -1016, -13697, -20359, -2785, 9988, 10859, -5798, -5860, -8689, -8896, 16835, 10425, -8697, 13846, 20586, 15182, 6546]
5431F546K366l878j7658n930J662k0106R204O081k430n272l725J5382K0479J4071
5417A6792k4187j565q894o615O081N907J3232M662m592j0424n618J1168m568R436
5403H15k7745j9213P919J693P766L915O53j3561J4941P450J0294N228q197j5654
5389b3696O170j4119m667k1135L156R036l466P350J2658K923P793J6827J1802
5376A0632M896j574j068k553L869l915p665j0272k0204N852m871j8034o607k174
5362e3688J102K0431K5972n462K257m348p082j1866j0875P364R312L415J1506
5349a1962J5018k363Q838k7695o894O914m617k2031j0754J6531J9755J6497Q914
5336F151r753j7118P687M812j5329j3888J2556O045J6650P006r864q41L340j6388
$$ y = [6546, 8912, 5034, -12624, -18554, -16892, -36998, -27794, -21713, -24143, -29415, -33140, -17758, 2721, 16792, -7395, -8960, -17854, -24469, -18388, -12481, 751, 5413, 821, -9603, -15221, -4053, -8621, 815, -26930, -46143, -38224, -36531, -28765, -24850, -24197, -37758, -22817, -15367, -5073, 155, -8042, -23696, -17526, -31645, -36312, -57447, -54291, -45255, -48721, -41371, -28713, -25790, -17997, -1170, 10632, 15528, 13954, 12886, 10333, 14202, 10287, 2622, -7650, -27854, -22002, -26873, -44907, -51514, -53688, -52586, -32155, -6183, -11645, -9388, -13736, -20818, -32684, -43559, -36195, -26883, -23468, -11962, 3056, 693, 9531, -18164, -25058, -18144, -22761, -44792, -55546, -39015, -19260, -2763, 6151, -3602, -20720, -13033, -8221, -23550, -37438, -24882, -18837, -2187, 4819, -5045, -5886, -2546, -18934]
5322a8934q674J8180n010r583J6322K5131N439n16j438k1314K532j1580j4392
5309b3837p096o483K9729k51j5227p655N526L520j712n619J0143o899J5948K9939
5295B0026m542j0550j3455N126j8095p718P728j397J955M467o530Q970J0801J2336
5281I122k175j3884n147J3149m815j6105O666K945p014q996J3260J7017J7537
5268B1560o952j3632M626p504r937R967L2256r956n384K230k2568q748Q324o967
5254a2685p778j0351j3649J273R619l212J9511j631j3762r18O127J493j0347j9489
5240e5799P036K1588L305J3816N674P494J0397J210j4555Q605K718j4891Q555
5227E153M982p791P561j0042K456J6837J1396j0852L364N072j946j5874p525K5395
$$ y = [-18934, -27608, -9428, -14438, -24021, -7699, 17432, 22871, 22355, 20917, -397, 2135, -9445, -23837, -30933, -37416, -7687, -7938, -23165, -30820, -25294, -21774, -23486, -29105, -18962, -25861, -9913, 20026, 15484, 4934, -8521, -3395, -21490, -29208, -21480, -22877, -20922, -16455, -22985, -14015, -3214, 9122, 6947, -6937, -12084, 1065, -3750, -19855, -13189, -10244, -17258, -26254, -12994, 4023, 21560, 14608, 976, 5602, -1902, -11839, -1872, 30384, 20428, 15044, 17274, -5294, -14042, -5718, -12685, -20463, -30814, -44463, -43190, -33571, -36783, -17272, -18903, -32665, -33583, -27456, -25963, -36310, -55799, -48763, -27175, -23870, -10054, -4380, 3114, 13511, 14721, 166, 8771, 11489, -3402, 5153, 10135, 2344, 9905, -137, 2319, 19156, 30552, 19700, 23064, 28136, 26190, 10316, 2791, 28186]
5213B8186k43k2463j3066J0861Q368K2340L042n381m808j2598j6647j0639N432
5200g616L616m880r143J480K922O184P120P02o156n370K967k3457R930K4878k244
5185I33M523J389j924j9908J2882J8444L114p286k521k0266j3880k2684L479J8377
5171b5328N803K3385j3440j6436p162Q796m054J3681M35L71J1973j1094J4953
5158A883K1111M138j7745k5178o799J1935K722j674O549J8881m933n747k073J3957
5144A7027K5221N570j948n357j3051j3896j2918j2018l41N321O951R699j902q214
5130A44j1459j0802J3068P943n175L776q089P781J630j3892N910K9258l1486j7349
5116b8742R367J2886O88o582n967M0J2370L570n401P417j6824L970Q134J2748
$$ y = [28186, 27943, 5480, -7586, 3275, 11643, 33983, 37025, 31644, 26836, 14238, -2409, -13048, -7616, -4000, -8880, -18023, -16543, -13621, -7437, -317, 385, -5771, -11141, -8174, -31631, -21701, 3177, 933, 5456, 6845, 4921, -14987, -2105, 16339, 19453, 12167, 9646, -10620, -24500, -47184, -43705, -25328, -19525, 3860, -9580, -26016, -33178, -24382, -28436, -14755, -14320, -13949, -1976, -13070, 1883, 22994, 27132, 9387, -15791, -22590, -10655, -7933, -9607, -3058, 15823, 10890, 5143, 3070, 17027, 42248, 47818, 45870, 40513, 27462, 13566, 648, -11370, -11711, -6390, 561, 10260, 8358, 144, -11315, -22117, -9049, -1106, -6281, -2505, -10594, -2813, -1183, -15075, -9165, 20093, -11393, -28742, -19375, -6489, -5801, -12383, -18350, -18310, -5940, -2370, -7771, -354, -17178, -13208, -5074, 7674]
5102G674M734k4990o290O017K0895n596L278J3391L736J6775m359q390l4122j8272
5088b5519m168M079O798j4805K159K8531o97j5135j2485l496J276J569K1495J9897
5074I499J8568k550k8995k3025j0520M122L2513J8506k347k9878j0147L598k0583
5061d1239p207J8237K8318J69j8591j9459J503J8959M048M838J1219q225J4392
5048F962L0171j2281J0576Q44j355j0656n65P618P672o716k586k3710j1879m503
5034a0408m948M501K871M081n126j0708M738j710O139j89N607R313k030R23J1974
5019A5028l878J109j1707K1926P883o137k8899j8703o218J622J3364K0932k461
5006C861j7038k9304J5528J2727K2876o44k3753j4210q491N677J7245J3710Q017
$$ y = [7674, 12408, -12582, -18872, -12855, 8040, 2444, 5722, 19113, 22849, 39624, 35265, 26875, -7247, -25519, -29687, -25608, -18810, -33615, -31456, -2925, -3622, -18757, -31242, -34738, -33462, -31893, -10398, 9499, 28067, 25517, -3478, -26503, -37023, -32901, -388, 18118, 15771, -14107, -24254, -20656, -41239, -48446, -30209, -1891, -1722, -20313, -39772, -38269, -19310, -15262, -10424, 795, -7430, 6962, 37133, 24852, 35428, 36272, 34917, 24261, 23696, 31314, 38986, 32270, 29684, 5974, -5905, -10408, -15356, -10855, -7984, -3903, -9029, -19737, -14999, -16709, -10570, -10759, -5152, 4161, 2131, 3054, 15028, 11150, 12259, 552, 22478, 30361, 24224, -4675, -23378, -29596, -27974, -14610, 6322, 3861, -13177, -42481, -26953, -14226, 8650, 8006, -15747, -29957, -38448, -32771, -15526, -1816, 6201]
4993F201R877j1555j2329j4650O404J2136m326j8459J2541J3564K662K6012l03
4980B7775k9q103j5440J094j322q435L081j4708J9695J1479Q412J4291k481k717
4966C2592K573j2753j8602L357l53j1060j1572K4871J0700q633K348j1527J3072
4953A5013L354k7899j5852j6918K927P157j1242R316M6731o075j6583n360n104
4940b0535K4555K2661N848J471p919j3719Q809n665j5792j8059L602j1188p73
4927b6704l669R810K7760K102j5050k3930l883N151M091p697j915K4632K0745
4914A1443J747k0591j9893k229L907J3179K8185J5411J0447k2020q774n911k491
4901B410Q662J1037J6425M290j9596j1312J94p070K660J1645Q560J7283J877m625
$$ y = [6201, 16078, 4523, -7806, -22456, -16052, -3916, -8242, -26701, -14160, -596, 2066, 28078, 27775, 27746, 19643, 4203, 5297, 3975, -4460, -1379, -16087, 3608, 15087, 23499, 37790, 35309, 32592, 35165, 22412, 3810, 7167, 6814, -4246, -15818, 9053, 19753, 11120, 13468, 1941, 15013, 18367, -9532, -25384, -42302, -39375, -32218, -43460, -34144, 12587, 6512, -10071, -15431, -20535, 4020, 26681, 32529, 34000, 26081, 12362, 21171, 15506, -286, -18345, -14743, -25931, -26704, -30373, -20563, 7197, 9299, -5751, -29681, -33564, -28413, -24322, -32019, -33934, -9302, 11443, 13190, -7401, -27294, -29523, -25616, -12437, 15748, 31159, 41606, 19586, 10812, 4901, 2410, 11072, 22109, 38534, 42824, 23228, 11916, 12110, 5040, 7700, 19345, 27905, 45188, 47065, 42440]
4887D2440l3861k1219J2741Q313P188r100j6896M615K6163Q424j2955l8581j240
4874b3968J9493J2059M234K063O562Q917l1033l0932L335R031J1455J4554j872
4861C898j5157m783n587j872Q674n034R007l133o16R233K4177r182j3502q321
4847a2198p122J1859J2876j7989J843R416J0619n853j3139O896K0564j105r914
4834F753j89Q759M779p042o47O648j1752k911J323J850j4825j2770J8405j168
4820b787j3672N819J3682K7114k213l2886R59J2027k037n600J0993O86j3021r728
4806a0664r678L115j912n809J7736J5988M456K395J473o717j280j5949k001J8240
4792I393L554J682j4531j1512k012r491n217o68K4343J1062j4756J178j1288R051
$$ y = [42440, 8579, -12640, 101, 8414, 15602, 6502, -10394, -5779, 20384, 28808, 15853, -22728, -23968, -4475, 7584, 11818, 13881, 20443, 29360, -1673, -32605, -29270, -20239, -8784, 5770, 3898, -11259, -16042, -21629, -23501, -14827, -19861, -10854, -13987, -14603, -5370, 18807, 9625, -3877, -12198, -19320, -7461, 5415, -12574, -10731, -1315, 9304, 3451, -9688, -2792, 17772, 16667, 6753, 6564, 15323, 20102, 13060, 12413, 19061, 7309, 4398, 5721, 7571, -7254, -20024, -1619, -2787, -16459, -10640, 3042, 30156, 27943, -4943, -3984, 8043, 6006, 406, 11399, 12085, -936, -10664, -20342, -17227, -19139, -24948, -7212, 8776, 13232, 15627, 17100, 10383, 9103, -6846, -8847, 9393, 12947, 14629, 98, -11414, -13426, -22917, -28134, -28802, -4459, 6603, -8153, -6975, -18263, -9212]
4778i212J2705J1453j6385j9439n286p220J7438J7386J2790k2408k203k0198j4626
4765d5205l62K4219K4562N552J255O018j7563k339N565k644m946l187n499J0600
4751c974k3516p198J8538R977j3027n588J7323K0137o754Q855N026j7813P58j931
4737H13J087K728r032J7255K0431J3723j3928m489K171J0458o361k4593n392J138
4723F009k212j3624j0455J753O277K3069k0591J3358K707k7467o085L1940J7406
4710B2085n648m09J3096K1149k274m4094j2390J1263N524N724J167L1233J4168
4697F0594j5402k3449j8450j4208L007R985j6899Q06J0238K521r086q221J2158
4684f406j0695k608j338L71J4218J0368j974j0042j4833K578J8149N658k1579
$$ y = [-9212, 3493, 14946, -1439, -20878, -26164, -33384, -15946, 1440, 14230, -8178, -10381, -30579, -45205, -45567, -21348, 3214, 8766, 10021, 16039, -1524, -3863, 1702, -942, -5888, -9075, -14574, -3974, -27490, -34688, -16150, -6173, -19200, -24788, -7465, 12672, 5918, 14773, 19799, 1986, 2744, 813, 1900, 4628, -4404, 12851, 33282, 47005, 33077, 28588, 30759, 41217, 34856, 10263, 4871, 6009, 3797, -9827, -20282, -18529, -12252, 10817, -9774, 3584, 6291, -21176, -27261, 4679, 22085, 16437, 16028, 29124, 50273, 47999, 3905, -8485, 2778, 8302, 14026, 15193, 46426, 60594, 45192, 21743, 3293, -10915, -7908, 2077, -14822, -14016, -3778, -1257, -10343, -18564, -6406, -17101, -19709, -21047, -20676, -6458, 3910, 1936, -8106, -22939, -20361, -2212, 3446, -18133]
4671a8133r371j763J0437J0721P825N92Q704J2731j2251j9928R880J3320J2148
4658B4912j2843J9326l255j1548J0163j1472n120k80j2020m212J533j673K0226
4645A3737K0426j0020l5515k978N556n457o236K5757K3888mk1590K066P740j3026
4631D344p576K494j218r481j3015Q442K0618p379j793k073l502j4349P003j3771
4617c1256M601J352j3697P942R391J653m09n964K708J1241m943n928p641q480
4603c9430Q477R714l550J7590J0353N767p335j5433Q205K412j5435K6741L0763
4590C8839o534l2641j6438J3706j33j5086r337P153R100J4437j3224j4386l893
4577b8437O708N573R44M474P417Q061l745K3203Q323k1547k2331J1654J0134L53
$$ y = [-18133, -27504, -29267, -18830, -8109, -284, 308, 9012, 21743, 9492, -10436, -556, 12764, 24912, 12069, 31395, 28140, 16592, 26755, 15283, 10163, 9883, -2137, -6349, -4816, -6489, 13737, 34163, 24143, -11372, -14350, -8794, -14251, -20487, 5270, 29158, 29154, 7564, 9630, 17370, 4344, -3232, -738, -1956, -11437, -24452, -16010, 4608, -2771, -4564, -6637, -10139, -24488, -17485, -31256, -26655, -25303, -39000, -31058, -21667, -20014, -20423, -26387, -23679, -12438, -17381, -23309, -30950, -39430, -30953, -21239, -24789, -7199, 3154, 8921, 1586, -13847, -5642, -3230, -18665, 8076, 38839, 32305, -336, -16774, -3068, -3201, -18287, -27624, -20471, -11371, 3066, -10158, -24544, -28437, -21729, -16156, -15212, -10738, -3321, 4740, 995, 24198, 32521, 10974, -11357, 297, 10431, 10784]
4563A0784J501j4511r652l057J7009L572r890N998J1270J2839K9812o845j9892
4550B8938K431k775N009r211j3125j2944o587J1777J1378j737J746J167j0896
4537E171P034Q254L200J4528l3934j6432q595L410K22J7276r997n589m038k0618
4523d0108J2496N002j255K7692l551q352J3883O711j6527R113Q342O786j3344
4510F888n951O184J4568j0873O161q347m933j8457J1136K0385k5118l6161k0631
4497f5149J2854K0354M09L437K7187J212l5440j1515L4267K1694L609N852o366
4484A2405o451J1107J2522j6356q462J1266n700n2N441m157o108J8525J3264o678
4470C0566j2018r194q684J2377J1042L993k6342q726p411q253J2629J9603J386
$$ y = [10784, 12285, -2226, -11878, -14935, 2074, 5646, -4244, 1754, 13024, 25863, 55675, 48830, 28938, 31369, 28594, 33603, 24392, 11267, -1677, -8264, 3513, 14891, 13154, 14900, 16067, 5171, 12205, 20459, 23659, 38187, 4253, -12179, -20774, -17364, -17142, 134, -9863, -15452, -19490, -40108, -27612, -22610, -23865, 3827, 276, -8076, 5807, 12518, -4009, 5104, 13446, 20232, 6888, 937, 7121, 21689, 10816, 16977, 8630, 3697, -14760, -3624, 16761, -8357, -44518, -65149, -52295, -31941, -31532, -28095, -908, 304, -35136, -46651, -12384, 9310, 12919, 18771, 12405, 5954, 17061, 29583, 13227, 4765, 16031, 10331, 10279, 15720, 11563, 5455, 23980, 37244, 30566, 18548, 9354, 670, 13047, 24089, 28082, 1740, -6986, -14397, -22650, -10021, 9582, 10968]
4457A0968k600o046M818o106k3829l0924l713L2591J2333J373J0922K2740J0369
4444C2896o437j3211j8947J1329k605r631L263l686j1174L49Q197j3191J0664
4431a2184Q113M693j0303N091K293J0575J6846J634l0174k1874L902K2115J352
4418B079j0928R783O63J8871P840k0960r533j0739R568Q607N8j1664j6551j6640
4404c9546J0101J2391L1712Q777j662M578K729q882j2304j9164M841J3237K131
4391H939J6642J7892o83j2977n651j0587k6183J6938L3670J240P707k535k6069
4378A8343k0316n022j3185P890P606k835J5648L473l898P953J2922l141j4371
4365A1067j5692j3235q868o983o301J8314J1922J021N189R141k4398j972K9092
$$ y = [10968, 8368, 2322, 7140, 1034, -22795, -53719, -57432, -24841, -12508, -11135, -213, 22527, 32896, 26459, 13248, -5699, 5630, 3025, -6606, -3343, -7029, -18203, -17854, -9657, -22848, -12184, -4071, 622, -9681, -4590, -2297, 8278, 25124, 26758, -3416, -25290, -21388, 727, 2079, -8849, 934, 1597, 20468, 28308, 7348, -2185, -12924, -3356, 5251, 5309, -6355, -22906, -39546, -29445, -17054, 14658, 23435, 21773, 26351, 29080, 20198, 7894, -11270, -6429, 6808, 8939, 25581, 43473, 42790, 29813, 24162, 13575, -12608, 4330, 38000, 39240, 46947, 44412, 18343, -1973, -6995, -20180, -12290, -4684, -7519, 8129, 11602, 7704, 15657, 28579, 25438, 11067, -4625, -17860, -26728, -33711, -40012, -21698, -9776, -8755, -3566, 5575, -18823, -20795, 8297]
4352H297J1064O180p239j5745P585J0876K4224q605m2856k1156J6824O607p274
4339a1218j1864o256j6111K646K2123m273k894J512P869M738M763J7822M549j2498
4325I08o653k095J8201J5291k9927j2398k078Q215R828k419K4839L912j1280m464
4311I880k9195j4078K1160M820k3566j5139M929j6352K8755R270O65J6240P123
4298D512j7711q324p676l638K0642J020o070J7996J3899q461j8443j6595L0725
4285A876J3048j4578k6608J5999J3958j6523l043K3434O658j3966j1000o736J3668
4272c813J0966j7849m497J9524j0756N621L518N012O278o744j8311j0296L380
4259a7967J0411N408J826q206p172O986k368M034K5325J5244N190m185j1725j3041
$$ y = [8297, 19361, 25541, 18302, 2557, 10142, 21018, 45242, 36637, -6219, -27375, -10551, -3944, -11218, -23082, -29338, -45449, -42803, -20680, -24953, -27847, -26335, -18466, -13728, -8965, 8857, 13406, 908, -5745, -7840, 10361, 25652, -4275, -16673, -18751, -10536, -708, -3127, 21712, 25624, 14344, 9880, -19315, -33393, -12233, -7413, -30979, -46118, -41189, -57541, -28786, -19516, -18851, -2611, 4512, -13199, -21523, -29199, -32837, -12195, -11175, -17245, 751, 14650, 6189, -12254, -28849, 1876, 14924, 346, -26262, -10263, 3695, -12828, -15871, 7563, 14221, 255, -10745, -17481, -3813, 7153, -10696, -15193, 4331, -6425, -804, 2714, 7726, 14004, 7260, -11051, -21347, -17967, -7556, -2148, -322, -8528, -15700, -8714, -11082, -7048, 18277, 33521, 38711, 34526, 22801, 9760]
4245I760p009j361M340N898j4383j5828k926L792J1341J8201m24j0478j2922J9241
4231G242J7804p21j4202l727l256j2199j3744j215k952m192j216j040p41K1922
4217a2237M550k4934J1196J5169k401J1437J6868J6409j6293K91M818j1419l0110
4204a6656q675K6818P482m275l908N649L0404j693o972O761J23j0585j4796M26
4190A0103m890j0527L554p418o808k789K1561L399k516m376k7844j2158J2114
4177b8595J8187j6205P42K1399J4656j505j7411m816J4853n18l452p704o280p146
4163b3795l111R563J3980j517r249j0203J2982L439r103J7241M500k1345k2577
4150c9195N493J3710o154Q21j186N597R817j5285j2606O838J0861J9177p647j3427
$$ y = [9760, 2751, 1390, 5730, 11628, -2755, -18583, -21509, -17717, -6376, 11825, 11401, 923, -11999, 7242, 25046, 24325, 10123, 6396, 3140, -9059, -22803, -24018, -26970, -31162, -32378, -33418, -34159, -12237, -7687, -32621, -21425, -6256, -8657, 2780, 19648, 36057, 19764, 20055, 24873, 13454, -16656, -25331, 1487, 8969, 4694, 786, 6435, 36839, 35146, 28174, 34935, 35058, 24473, 9677, 10103, 5213, -5314, -1760, -9178, -15986, -18775, 2786, 6185, 3669, -707, -28551, -40709, -28595, -10408, -26613, -25871, -4472, 10184, 8679, -8732, -13548, 1305, 787, -2665, -10369, -16649, -23795, -26906, -17343, -3363, -4880, -14129, -24332, -11350, -7911, -17014, 227, 4727, -16618, -39195, -33702, -19992, -26146, -25325, -26511, -20914, -11097, -26382, -38988, -32150, -21289, -2112, -9759, -23186]
4136b3186R511r681j0929K8392J1348j0124m340o542k2565j1167P96J5811P504
4123b5172k0900M992J3968J2738R101Q470Q04r729l146J3680k4043n357M0345
4110A5751l79k5284K044q015J1121P083K0171k3901l6816J3340L1838J2892Q482
4097B8327k7638j0826Q237j7862q182J5006O633o501M052R692m921R289j0309
4084e003l1102J1167J1101J2788L037L574j451j220J2541m704l407K393j4786
4071e072J991J2905N101N7K1172j569k9400j8809P886J1488o841j8132j8711l1462
4057f9396Q716J3411J7091K0771K798j6148M204L99K0666j1886p085L044J6885
4044C470o300j6838R886j241M482N070o984m757j612J0470K1687J9k1320R843
$$ y = [-23186, -13675, -23356, -34285, -5893, 5455, -4669, -9009, -15551, -38116, -49283, -48487, -32676, -25172, -46072, -41080, -27112, -14374, -5273, 3197, 4001, -5728, -8874, 4806, -19237, -24594, 15751, 15372, -9912, -7868, -15883, -4762, 2321, 22492, -1409, -38225, -24885, 6953, 19845, 28327, 689, -10137, -1900, -19762, -27944, -12938, -6305, -12806, -8754, 938, -3983, 5306, -5003, -36105, -24938, -13837, -1049, 1988, 5562, 4111, 2891, 15432, 10728, 7321, 9714, -5072, -3081, 9824, 14925, 14982, 36154, 34585, 5185, -13624, -5738, 5750, -1091, -19223, -37934, -69396, -60680, -47269, -30178, -9407, -6609, -22757, -18553, -18154, 2512, -9374, -16459, -13415, 3470, -2830, -19668, -9782, -11023, -6541, -1471, -8455, -13212, -14824, -4354, 17333, 17352, -3968, 5875]
4030E875J1425m73p166k0191p541M910K662R100n61j3588r225J5428L65q409L0897
4015A3508J0477Q219j548j002n528P571k7547j5118j2866k558O00O204J1310m792
4001a3070p588J2933J2175k440J0376N425P69K560j6227j6210n407j2337J5786
3988a3255M321j903n113N566K6416J3848j1097j9015N584R540R592k0721q940
3975e177J5433J1966j5972j0491k622k889M999Q789l783k9925O327L4751j5641
3962d235l141L517m024j3843j2569j9624O103L7953J9046M052o404j2505L582
3949b092J2343K2057K242j1310j0556N002m696l647L759m404k6500q693L0002
3936C507K0093l541q786p832R20j538m0153k5458K7671L6880j803j1045j213L775
$$ y = [5875, 17300, 16827, 9661, -10530, -18071, -13161, -10499, -1399, -1960, -15548, -24773, -9345, -8980, -17389, 13508, 23985, 32204, 30656, 29654, 24126, 31697, 4150, -10968, -23834, -26392, -25792, -19588, -8278, -13070, -20658, -7725, 4450, 2010, 12386, 17811, 18580, 21140, 4913, -11297, -16704, -29041, -13255, -8934, -10837, -15950, -10384, 16032, 29880, 18783, -232, 5352, 14892, 24484, 3763, -5177, 10256, 22222, 6250, -4241, -6863, -9752, -4753, 4036, 253, -29672, -23345, 11406, -4235, -7376, -3859, -7883, -21726, -34295, -53919, -47816, -9863, 9183, 13235, 6831, -5674, -2092, 10251, 32308, 34550, 23240, 12684, 17686, 12990, 9343, 13102, 8698, -17802, -26495, 3507, 23600, 20059, 11273, 3441, 4361, 2823, -37330, -62788, -35117, 1763, -40, -11085, -12298, -8523]
3922h523n307o72Q224J5752M98q978j1296l200P674J1871Q213k951P578k527p919
3907H437k0949M02n045q176Q444J3165J5217k1718r174j9080k1245Q957Q682J935
3893d0148K8063J2836q107J8921J3564J8229j5646p225j5732r795K537K2939n534
3880A4902j2230j1510p21J6657J770j2900j6342k212P875L0035J2082k4743j4953
3867a2290J1278R370n099k3298r11J002Q522J4346M338j7486j616O694J6898j0683
3853A065r868l832j9587l646J4529K7379J422J106K631j0244j2215M33j114j3641
3839b5582J5663J9864R945l775k6624j1835n395k0622j371R255J0854J7902O167
3826e554j7997k5399J1337J5166j8141N177R942J442j8275o415n328n175L0014
$$ y = [-8523, -13830, -14502, -6278, 9474, 9972, 994, -10302, -13502, -5828, 6043, 14256, 11305, 18883, 16356, 8437, -12512, -12110, -17155, -25331, -16887, -3722, 11495, -10223, -19397, -38477, -59722, -50765, -42083, -40148, -12085, 751, -7356, 11565, 25129, 43358, 27712, 20487, 4755, -5040, -2503, 20436, 14902, 2672, -8838, -9559, 7098, 8868, -4032, -20374, -22586, -14711, 15324, 27406, 2663, -12290, -1012, 8358, 3259, -20039, -20950, -19948, -11426, 2920, 7258, -10228, -11844, -5150, 11748, 1065, -8803, -12635, -32222, -35868, -21339, 6040, 7462, 8568, 11199, 955, -11260, -10827, -11941, -25582, -9919, 9945, 19890, 16115, -10509, -22344, -27739, -48361, -49732, -40477, -29623, -11721, -5554, -23551, -48950, -37613, -22447, -40588, -35411, -25469, -24027, -42302, -48717, -54045, -59220, -29206]
3813b9206J4363Q952P451Q824J375J3062J5092j8491l0994K518L050j97J4106
3800I905J2410j0l0957r042J0654P907k2888R546J9576N242k1045l738Q652o529
3786a0317J2598J5533p704j3319k650M459o371j4588j892j340j623J3030N554
3773h630J3548j5333j4594O117q763m420L0849J3776n042j0227J524N472j2530
3760h253r330N697K0423J4562j2160J7427R5k9843k0823K0891R139j9965l414
3747a5554j1143J6657O843j2042m09J6396K020o259j4995P789L3679r500j0627
3734B855J3837n347j9108j375J3698M264m787l249M09P490L280k3713M059Q206
3720E19P071N985K310l442R868j2665o660J5604J2075P678j117l8198j5597J12
$$ y = [-29206, -14843, -5891, 1560, 10384, 11759, 24821, 39913, 21422, -9572, -7054, -4004, -4201, 9905, 22315, 22305, -8652, -17694, -7040, 867, -22021, -12475, 7101, 12343, -8702, -12440, -3788, -10317, 2281, 17814, 10110, -3209, -5859, -1400, -7771, -22359, -24251, -25591, -27214, -14184, -8630, 4918, -10415, -25009, -18892, -27655, -32075, -1226, 12550, 7508, -2719, -1195, 4277, -8253, -17583, -11886, 8537, 23099, 10939, 28366, 28461, -1382, -22205, -1314, 7825, -12140, -15554, -26697, -10040, -3197, -15239, -15648, 748, 2768, -3491, -18486, -10697, 22982, 13482, 2855, 16692, 11345, -7763, -9138, 4560, 8824, 4037, 788, 1197, 8687, 11967, -11746, -7687, 519, 7590, 13575, 15885, 12443, 22311, 9646, 2986, 18590, 30665, 38343, 37226, -972, -16569, -16457]
3706a6457K7358O812n601j5115P506O636k518l345j5101o894J4469l186k78K369
3692c345M048n753k6175j5051K0237k725O394m589K468J3835n861K4908L808k0143
3678g944q310l186O833N919J9855k958J9501J665k5580K263J8951O420J350j3222
3664B1557k313n873j4774j8814K453M452J5606Q997p19J830L527k0826M97l125
3650g525n729O995J8440n151m478L673j0926j6941q160Q51l4970Q098K7926J9491
3636h406J1679j757j7016R026P031m306K7858J1732j8052j9901l3584K087K7753
3623e856M310o107j181j7655K195N348Q351k689j3707J3869K2244j9341j2967
3610b3186K4204L0573L442o361q773r582M445p11K4682J5743n107k0327j6766
$$ y = [-16457, 10901, 17713, 12112, -3003, 4503, 11139, 8621, 5276, -9825, -16719, -2250, -5436, -5714, -3345, 703, -5050, -31225, -46276, -26039, -28764, -22370, -26959, -24491, -10656, -16517, 8391, 12199, -7944, -16254, -19440, -12607, -6688, 13167, 10209, 29710, 31375, 5795, 8058, 27009, 33429, 34779, 21557, 19244, 13371, -1403, -20217, -17764, -13312, 2294, 11291, 10572, 12402, 15929, -4897, -4400, -7525, -13254, -6259, 12181, 7030, 2552, 6225, -4701, -21642, -29802, -28951, -63921, -55823, -27897, -8406, 3273, 1516, -15500, -6474, 557, -3749, 24109, 35841, 17789, -2112, -35696, -33609, -5856, -1546, -7653, -8834, -26489, -24294, -18946, -10595, -13284, -26991, -13122, 9122, -10219, -23186, 1018, 31591, 35033, 28672, 19899, 10317, 14762, 14051, 38733, 54476, 49369, 29042, 12276]
3597A2276j4660k3952k0409K7262K6329k5327q445k130M063J0748J6430L321J3517
3584A9023O107j7559Q57M475m269p41J8002J7210O970p359j1734q241L499k488
3570B3752J3149j101j392o834j4558j176j4480k7640J0156J5599j0923q312L3182
3557I422N903q047P357J7233J0884j506k4504j1680l438j2612j7761Q257J7971
3544b521j4576j3751J818J4810L0024R225o203j6710l669o637j1038O363K4962
3531A2097Q499k37j2156N110J2225k2778j7301J0142L148o002j4211j589J4005
3518i048N553j8218r217o767K676n859J6747K1882m241K101L411K201K2237p665
3504A5793j3302O522R963J7984q496j3491q689M650J7163j0270j4296O268j736
$$ y = [12276, -2384, -26336, -46745, -19483, 6846, -18481, -26926, -29056, -24993, -14245, 2185, 5506, 19023, 25130, 7571, 8428, 12903, 8634, 7893, 25895, 43105, 50075, 42716, 30982, 22741, 26240, 23752, 36901, 35800, 34408, 27574, 13016, 11840, -2640, -30280, -20124, -4525, -15448, -23760, 9422, 15325, 7278, 14635, 31868, 42752, 41246, 16742, 5062, 1624, -10988, -28749, -20492, -2521, -17097, -30848, -29030, -14220, 15804, 25029, 18826, 2116, -1553, -8190, -19228, -12865, 12097, 20596, 20359, 8203, 13313, 25538, 2760, -14541, -4399, -1251, -7253, -21464, -23053, -9048, -3495, -21713, -30930, -37697, -35021, -40880, -24133, -2251, -6492, -4391, -980, 1221, 23458, 15793, 2491, 9013, 18976, 36960, 28464, 14973, 6284, 10934, 28097, 17827, 3531, 9799, 8063]
3491H063J022p009J4361j0401j9455j5537j6597J580L10J199J7930J8210j8726
3478b5050J456K1452K3305j7352j3616p098r919K114P972J4926o450j1892Q170
3465a1982j7312j0996J5009N728P823j693j8944j3157J6937Q637J3703r211j7016
3452c2474k328P725j677j8062o186M203l124J7675L8013L1516J169K519k6390
3439A2579k1093M062O448J4718p925j6862r707L130J6132K1185K022k208r416
3426A3065J3522k6550m0622J7581L0573K0223J456J4131J966K767K560j2189J8335
3413E6818l088l5134j1499N349j0894j6361o720m804R566K0109L861n394o085
3400d276Q970L281j6333N08L631O808q181J143Q554P34K320L81m38L069j7469
$$ y = [8063, 9085, 2076, 16437, 6036, -13419, -28956, -45553, -43973, -43663, -42464, -24534, -6324, -25050, -23594, -2142, 21163, 3811, -9805, -16903, -26822, -24708, -16736, -1810, -8260, -20152, -11982, -29294, -40290, -25281, -19553, -11730, -13423, -32367, -45524, -28587, -19950, -6247, -15458, -32474, -34802, -27077, -28754, -46816, -53002, -48799, -51923, -34248, 3765, 35281, 36450, 38969, 12579, -8514, -4452, 1996, 16714, 8789, -8073, -17780, -14650, 1482, 22667, 24689, 22481, 13065, 26587, 37, -40585, -23004, 7569, 27792, 29248, 43379, 45345, 48112, 50672, 38483, 56818, 53730, 18596, 7097, 12446, 1552, -14809, -21529, -26333, -16767, 3342, 7203, 1809, -4276, 4694, 7975, -8358, -7850, -4219, 2589, -5592, -4449, 4105, 4839, 7159, 7540, 7102, 10171, -7298]
3385g298j9900J3084J5750q689n541J0949Q59o251J6456R207O460j9220j3285
3372g419K456k924O820j4492j1655j5944K804J4720R393J0279P01J6620j722q223
3358A414J1252p356P685j2711j7501p2O391j4864o461J5127J4721k888J3741m029
3344D449j6782k1334K0530K2847L9496k561l7818j2535J2012J1789p29k1516j8006
3331b0158j4104k928J447J1647O367J5439K1026J0301j1461L662k6251k3282k759
3318c1054l60J4155q938J1420K1797k72J0128M082r966j8697J547J2299O488j0628
3304B001j9990l551R053K2310J251K202L603P853j271O755L33n390K736j1558
3290A6337k6318k2441O915R917P569J6564j981n556k657K782N987J4947J0370
$$ y = [-7298, -27198, -14114, 1636, -7053, -12594, -1645, -786, -7037, 9419, 18626, 25086, 5866, -7419, -4963, -7887, -1067, -15559, -27214, -43158, -40354, -25634, -16241, -5962, -5261, 11359, 9637, 1414, 12666, 5310, 12995, 284, -17217, -17289, -10898, -25762, -32223, -17096, -2375, -5263, 8478, 4449, -12333, -33667, -13137, 9710, 49206, 46645, 8827, -3708, 8304, 20093, 19364, -2152, -20158, -34262, -37190, -35743, -24096, -17729, -2290, 18736, 29037, 17576, 21238, -5013, -28295, -31054, -31414, -17259, -26197, -14777, 7020, 6748, 16876, 20958, 10992, -7705, -6158, 6141, 12629, 2001, -17989, -21540, -12487, 9823, 11074, 13276, 16879, 24732, 23461, 30216, 30549, 25159, 27895, 16337, -9981, -32422, -25507, -15590, -8021, 8543, 6562, 1006, -1651, 1131, 7118, 22065, 32435]
3277C2435R7r579M89n66j6942j224K548Q789j3651j25J5433N770n909o571K815
3262A3809J943n663j472n772m01j3504n464J4936J2976J0757l562J0365j2820
3249A6128j4513J0879j3546j18p539J528K1618k1808j4730K3365K093J311R737
3236A4405j5722j2659j466J8661R356N270Q252q618j120p747J25L095N607j2318
3222E121k2721n301Q263R177R207n091m040o045J798j3008p922N147K3838j798
3208c375k1046J1169K1395o069m379l34j5414Q920J6367M242J957K749J0684k5807
3194A059k3887l579O869N892K881q458p672R669J1464O315j9761K7214J5821j633
3180B2194M458Q719j0527j6570l1958j003J2133N025o45M116j560r635m1J3014
$$ y = [32435, 32532, 22953, 23442, 22876, 5934, 4710, 7258, 16047, 2396, 2271, 17704, 23474, 17565, 10994, 13809, 15752, 10089, 8617, 2845, 2444, -11060, -16524, -1588, 11388, 22145, 18583, 28948, 16128, 1615, 12494, -1052, -1170, -8709, -7181, 14437, -7371, -22101, 1264, 3357, 4668, 14405, -1317, -13976, -15442, 3219, 12575, 17845, 26097, 17479, 16359, 8612, 8737, 11832, 17439, 5121, -17600, -22901, -14638, -5461, 3746, -1345, -5385, -11430, -9632, -22640, -30562, -25415, -1577, -3375, -24421, -13252, 8143, 2074, -2305, -2639, -18053, -9133, 7234, 11476, 13433, 16182, 26866, 1059, -22828, -26407, -19538, -13646, -10765, -19223, -26895, -17226, -5762, 553, -19208, 8006, 23827, 22194, 26652, 35371, 24844, 8274, -23684, -24687, -12554, -7529, -8174, -4058, -5618, -15253, -15294, -2280]
3166b280k2109j2249J451J4469M907j2655K0140p177j8444j4861J5588K4303J9751
3153A0834J1046J4922J5671p110l2939m384p404j1749k021J7780Q179J606m735
3140I696j1092k0458J6937J2538o885l1320j1483J2064O493J5447J741M599L166
3127A443j8010j1554m986J8977j3347N96Q468r553J966K1428K7225l220k0087
3114f54J221P226P77l978r843K114M438j2473j5293R182J6372J5581Q30k2292
3100f792j3290K711j1551J1358J076r528j1224M960l305M204J2658J6510j4335
3087a6548Q596J8439m953R10N313j1463j4051m237O406R203R75j6403Q779J6818
3073G784K8385J8147j4644q892K983q071R50j0349n221j1078Q234p74m647k0608
$$ y = [-2280, -24389, -36638, -35187, -20718, -15811, -28466, -8326, -15503, -33947, -48808, -33220, -8917, 10834, 21880, 36802, 52473, 45363, 12424, 8040, 636, -11113, -13134, 4646, 12825, 14431, 9696, -1396, -21854, -4917, 7621, 736, -30584, -42067, -30003, -23510, -8063, -6322, -1723, 1443, -16567, -28121, -33107, -14130, -27477, -26881, -18413, -27966, -26000, -4572, 22653, 19433, -654, 567, 7793, 8570, 4592, -5251, -3137, 1301, -11172, -26465, -17283, -911, 14670, 15500, -6792, -20082, -17371, -28922, -17564, -16488, -26016, -37240, -32280, -35585, -31381, -18723, -2213, -16548, -7952, 10487, 5534, 6444, 11757, 294, -13757, -17994, -11588, -2385, -1410, -17813, -9034, 7784, 36169, 54316, 39672, 30780, 33763, 25692, 26642, 16293, 11072, -6, 8228, 7454, 2807, -17801]
3059a7801K1709j789j8307L261Q936P386j712q574n856O664Q349k548r530j1295
3045b1107Q636o857n010J4152J5578j827p975O558k467j7725m425P830j4076k52
3031b8967J6775j5486Q9J1735J7259P729j1051j3266j2703L736p973L91Q779O039
3017a6914M526o859K888N175M36Q350M282j333q955J3245N355k035j0338k944
3003e121k637N03k6986K416L1706K7350j3155O283j575m904J280k0850k3740q153
2989c7583K0025l016k0250n373L392P401n247P310J8919J4250J8176L608n648
2976A5964Q491P334k2148R322O801k9445q617m713k652N678K1874k1711m539J1827
2962f534J7425J5513l2289k8831O074O447L391J6100n913m632J2848O012j4396
$$ y = [-17801, 3908, 2119, -16188, -12927, -3991, 3395, 1683, -6891, -12747, -6083, 2266, -282, -9812, -21107, -12471, -19328, -24338, -10186, 5392, 3565, -4410, 2148, -319, -18044, -22469, -14639, -28715, -28967, -12192, -27678, -27589, -15854, 1405, 9134, -1917, -15183, -27886, -24150, -32123, -31732, -22953, -16914, -12388, -19247, -16359, -11184, -10748, -2398, 1884, 551, -8404, 4841, 10196, 8161, -2177, -5121, -7758, -7255, -34241, -31825, -119, 27231, 14076, 20359, 18784, 13880, 15160, -5690, -29430, -37583, -17558, -20574, -40824, -46197, -42805, -35404, -40651, -33341, -14422, -172, 18004, 21612, 15964, 24455, 31789, 9641, 18963, 25764, -3681, -12298, -17011, -19663, -13985, 7889, -13822, -18361, -6534, 10891, 26404, -5885, -34716, -28642, -22195, -18804, -2704, -8617, -13249, -401, 5611, -8785]
2949h785p45J9889o918K7914J0390k7255j8414j4774j4649J5089Q675P063m486
2936g006j5852J201J6421L6227K4230M01k9045J2007L340k6258j4800P551n589
2923B828J1801k8425l2644r173J9946K6072m913j7910q017O36K2826K8832q262
2910C597N475O118o467j6177j7993n463q06M893J4481O688j405k241l103j3124
2896b5527J0101K98M470m0L732J1239q717r270k2596J294J4659j267K380K377
2882a6867J8657p50J975j2788j2432K612L998P660M31P375M582l3527K3566J0099
2868D591k2174O170J4643J2963r733j4203r041J3126J2425L355r39r518q311K0086
2854A3440J4353O13k201l087K855J754P60k1177m247J6629N618j4666K354R079
$$ y = [-8785, -9530, 10359, 3441, 31355, 41745, 14490, -3924, -18698, -33347, -18258, -9583, -2520, -7006, -22858, -21657, -5236, 30991, 55221, 55622, 26577, 38584, 41924, 15666, 866, 8417, 2828, 14629, -13796, -46440, -55613, -35667, -9595, -14508, -32418, -40435, -39799, -16973, 11859, 3597, 9072, 15190, 8723, -7454, -25447, -30910, -31716, -26823, -12342, -5654, -7059, -9300, -12403, -25527, -15426, -15128, -10658, -10698, -6966, 4273, -4444, -13714, -36310, -35016, -20357, -21624, -19244, -16867, 1790, 1040, 3015, -9773, -22205, -19593, -15595, -7935, -7504, -129, 4453, -29074, -5508, 4591, -17583, -11413, 3230, 16193, 6460, -7743, -16784, -3658, 8767, 12122, 11183, 1665, -6646, 13440, 27793, 28406, 26205, 23118, 25973, 27727, 28487, 7310, 3063, 19692, 25310, 10644, 12998, 22077]
2840B2077J06m724j2230j6673r552P082P909o580k95j7130j9023J136J4973K7186
2826e738J1338O025N248K464j0794k076N235J9738j8492l1106l5048J1457L7920
2813c829O252q288J2541M772j1922p388J7534J3695j6040m382J5678K949k638
2800A8934q93J930p107J172o96j2594M570n09k0526R576j946J33J6399j0037N200
2785C606K095j3034o340J655J5026L748k090j0376L744M705J74Q331j1389j6340
2771a6485M698K753P824J0899j5198j6212j3591m274J7848J5537j317Q530j1497
2758a0485k6047J0445L3109l438l256p577j8367k933Q019J0805q222q203l319
2745b9469j4933J663R055J1758j884J5927o521j7885J646R801k066M489J4171
$$ y = [22077, 22183, 17459, 5229, -11444, -20996, -13914, -6005, -12585, -12880, -30010, -49033, -47897, -32924, -5738, 5600, 11625, 16873, 19337, 8543, 6467, 11702, 31440, 12948, -18158, -53206, -41749, -3829, 2423, -5865, 6676, 11448, -474, -7862, 9672, 23367, 7327, 2945, 18623, 21572, 18934, 18041, 19971, 12864, 14036, 13340, 746, 5316, 4807, -15719, -6143, -8089, -7956, 8443, -1594, 3606, 5701, -7333, -13673, -12018, 3008, 6756, 4666, -5710, -1966, 2739, 2913, 11244, -145, -16485, -11787, -9034, -1210, 9689, -5509, -21721, -35312, -39586, -21738, -6201, -7518, 1012, -10485, -36532, -26087, 7022, 3584, 328, -7249, -25616, -28549, -20530, -9725, -17947, -26150, -29469, -44402, -42739, -33684, -21926, -23810, -7883, -14404, -32289, -30643, -20842, -22908, -18419, -4248]
2732d248L993l400l2762o408K140K1251J7394k233k541O65r347j4259J9172K5916
2718A5333J0042j8673j0895p798Q439J7345j6792q110J2970J7153l540l0919l298
2705a8743m475K738Q942j707L931J7478R854N104j2145j9325j4173n735L2259
2692D003J2646N047n610p986j4201k971o136N625J3743j660J4323p853l2701k2185
2678d5916J2760K6981R839k501O055J9493n944j8262j4191N735R037R868J3837
2665B6791p430j9368m420r108J7263J5441K0458P898r605r90j8796k8474r821
2652b0161Q698O735J4169N683j9138O08m09j3570m270O39n614N368J5316J1377
2638E431O352M359q096k428K138Q49j6168K809P918k0768P095J678J3637K7720
$$ y = [-4248, -255, -3655, -36417, -42825, -40685, -19434, -2040, -4273, -6814, -6149, -15496, -29755, -10583, 15333, 25375, 6702, -4193, -11991, -3552, 13793, -2999, -11109, 1861, 19014, 15474, -15445, -18743, -23218, -20480, -11538, -13245, -9314, 8164, 18018, 23122, 10977, -8348, -22521, -28256, 4003, 16649, 21696, 16086, 8100, -6101, -9072, -15208, -9583, 4160, 2500, 16823, 8970, -23731, -45916, -33156, -6175, 3664, 1163, 7218, 26711, 20767, 2505, -11686, -5951, 3086, 12954, 26791, 19361, -7, -4427, -13535, 3728, 19169, 39627, 47525, 37920, 36930, 18134, -10340, -20161, -11463, -4728, 9441, 15124, -4014, -3406, -3815, -17385, -21655, -21016, -26630, -21262, -5946, 5431, 11783, 16142, 8046, 5618, 7756, 8605, -7563, -4754, 3164, -17604, -10509, -8831, 4806, 32526]
2624C2526Q625r389P912k9397l1939k499K1748K1749J6713j8783l120L343k5271
2611g782j1827J148N792Q521J1003Q256j3279j1439L189K5656p138l0075K0578
2598B603J038J0256L708j6608o259k325j1434J0371J2559J1076q257L435P766
2585A7929n465p666q898Q508K6712j0722k27N437j0881k1833j882K919r193j0789
2571b6051k508J9688j2767o094R277K823m770o870m656J7424J4751N246p958k621
2557e086K2426N619n500j7042j0852O541K565k804k177J9315J8880Q954j5398
2544B5441n141q055l654j2907n458n608M065j8227J3436K1786j6944p548J2490
2531f324J357j2864J4120K0825L395j1688j1596j4842N631J7566J7842j0132j3227
$$ y = [32526, 41151, 31762, 39674, 10277, -21662, -24161, -2413, 19336, 36049, 17266, 14146, 17489, -7782, -19609, -18461, -12669, -4148, 6855, 15111, 1832, -9607, -6418, 19238, 12100, -17975, 2603, 3641, 13897, 17605, 997, -5262, -7587, -19021, -8650, 3909, 14985, 6728, 10163, 17929, 12464, 4798, -4100, 4408, 31120, 20398, 20171, 25608, 14727, -7106, -8988, -6069, -15262, -26051, -28559, -8871, -21638, -27732, -18455, -15632, -20402, -27272, -31928, -14504, 247, 5493, -2465, -5086, 17340, 22959, 17459, 417, -10435, -3894, -1329, -4133, -6310, 13005, 31885, 40839, 25441, 20300, 12245, 8591, -4316, -9774, -15382, -11317, -29544, -16108, 5678, -11266, -18814, -6324, -4967, -17831, -3711, 17114, 20509, 8821, -2775, -17617, -11986, 5580, 23422, 13290, 63]
2518F3p750J6994M197k288k9501j4489Q569M163J2577M987M127l643J85M905M275
2503G371r74l548K573J181k2107l159K797O990N178k297k114J3290O3k4318l335
2488b2409J0151P914j2879O484J2541n594j7619j0922P405R238L311Q84J5589
2475D094l774l308M353j857N024J8354M916n25m842j1152q879j8125O576n814
2461a4959Q055J1675j5976j6241j4833k144J3648J7398K2134J8508k2740k3157
2449a8632K6196J0196j1761p419j386K95n355K631N539Q179k853p857P361l671
2435A463j5742k4641j4294n117K1468K7371J4782k4418j4135J6484J3323N343
2423A887K820l968o203j0591J5225Q892r413j3738j3314J8730J6216R541l4689
$$ y = [63, -7687, 9307, 13504, 11216, -18285, -32774, -24205, -20042, -7465, -2478, 1649, -1994, -1809, 3096, 7371, 6397, 2849, 5422, 6603, -15504, -18663, -15866, -8876, -3698, -5995, -8109, 5181, 5244, -19074, -22409, -12258, -4344, -17223, -10739, 1802, -3792, -21411, -32333, -24928, -15690, -12379, -11495, 4094, 320, -2988, 1365, -492, 4532, 22886, 27802, 27277, 22435, 11283, 2404, -15721, -9145, -14959, -6904, 4771, -11205, -27446, -42279, -44423, -30775, -13377, 8757, 27265, 4525, -18632, 7564, 17760, 5999, -1420, -2806, -2511, -7866, -5235, 304, 8483, 5630, -2227, 5134, 1463, -14279, -38920, -53214, -58331, -36863, -9492, 5290, -19128, -33263, -16779, -3456, 1887, 4707, 739, -5464, -16055, -830, 8062, -1351, -15089, -28403, -9673, 6543, 16084, -18605]
2410a8605l260J1341J2695j4023K516P688N443Q134j2330j7957K0181J4594J7698
2397C4115l211n576J0732m199j6603j6537M482J1496r732P835k1122k012J1969
2384A637j0975j5105l641J5263J8830l281j1273J6520K0293j6669n371J65o661
$$ y = [-18605, -21865, -10524, 2171, -11852, -9336, -1648, 3795, 11929, -401, -18358, 1823, 16417, 34115, 30904, 25328, 36060, 31861, 15258, -1279, 3203, 14699, 4967, 12802, -8320, -10332, 1637, -9338, -24443, -28084, -12821, 6009, 2728, -8545, 7975, 28268, 11599, 6228, 6393, -268]
$$ [...]
##END NTUPLES=NMR SPECTRUM
##END=
