##TITLE=Analysis number 310746
Compound Code cc 14706
Book Reference 441/77
Project Code adrs
Chemist Name colinb
##JCAMPDX= 6.0         $$ Bruker NMR JCAMP-DX V2.0
##DATA TYPE= NMR SPECTRUM
##DATA CLASS= NTUPLES
##ORIGIN= Bruker BioSpin GmbH
##OWNER= NMR
$$ XWIN-NMR		Version 3.5
$$ Thu Jun 23 08:57:28 2005 GMT Daylight Time (UT+1h)  MAYBRIDGE\NMR@NMR_250MHZ
##.OBSERVE FREQUENCY= 250.131544655141
##.OBSERVE NUCLEUS= ^1H
##.ACQUISITION MODE= SIMULTANEOUS (DQD)
##.ACQUISITION SCHEME= undefined
##.AVERAGES= 16
##.DIGITISER RES= 18
##SPECTROMETER/DATA SYSTEM= dpx250
##.PULSE SEQUENCE= zg30
##.SOLVENT NAME= CDCl3
##.SHIFT REFERENCE= (INTERNAL, CDCl3, 0, 16.522)
##AUDIT TRAIL= $$ (NUMBER, WHEN, WHO, WHERE, WHAT)
$$ ##TITLE= Audit trail, XWIN-NMR		Version 3.5
$$ ##JCAMPDX= 5.01
$$ ##ORIGIN= Bruker BioSpin GmbH
$$ ##OWNER= NMR
$$ C:\u/data/dgb/nmr/ADRS/4530/pdata/1/auditp.txt
$$ ##AUDIT TRAIL=  $$ (NUMBER, WHEN, WHO, WHERE, WHAT)
(   1,<2005-06-23 08:56:59.16 +100>,<MAYBRIDGE\NMR>,<NMR_250MHZ>,
      <created by zg, POWCHK disabled, PULCHK disabled
       configuration hash MD5:
       62 19 C7 07 E1 42 D1 B7 37 6C 3D D0 77 39 F9 E6
       data hash MD5: 64K
       00 39 14 1E 66 A7 DC 71 98 0A 9A 71 A6 64 B6 82>)
(   2,<2005-06-23 08:57:10.63 +100>,<MAYBRIDGE\NMR>,<NMR_250MHZ>,
      <Start of raw data processing
       ef LB = 0.3 FT_mod = 6 PKNL = 1 SI = 32K 
       data hash MD5: 32K
       93 98 23 EE D6 1E D4 F7 EE 63 E9 FC 1F 2C 51 59>)
(   3,<2005-06-23 08:57:13.43 +100>,<MAYBRIDGE\NMR>,<NMR_250MHZ>,
      <apk 
       data hash MD5: 32K
       A5 34 73 28 7B ED 78 02 AE 26 58 93 B7 DB CF 92>)
(   4,<2005-06-23 08:57:14.13 +100>,<MAYBRIDGE\NMR>,<NMR_250MHZ>,
      <abs ABSG = 5 
       data hash MD5: 32K
       CD D0 0C F4 A9 C3 83 1A 26 DF 21 BB 24 28 37 41>)
$$ ##END=
$$ 
$$ hash MD5
$$ A5 5F ED BA 3A 5D 3F 3C A9 86 EE 01 F7 BF 1C DC
##$RELAX= 
##$RELAX= 
##$RELAX= 
##$RELAX= 
##$RELAX= 
##$RELAX= 
##$RELAX= 
$$ Bruker specific parameters
$$ --------------------------
##$DU= <C:\u>
##$EXPNO= 4530
##$NAME= <ADRS>
##$PROCNO= 1
##$TYPE= <nmr>
##$USER= <dgb>
##$AMP= (0..31)
100 100 100 100 100 100 100 100 100 100 100 100 100 100 100 100 100 100 
100 100 100 100 100 100 100 100 100 100 100 100 100 100 
##$AQSEQ= 0
##$AQ_mod= 3
##$AUNM= <au_zg>
##$AUTOPOS= <52 >
##$BF1= 250.13
##$BF2= 250.13
##$BF3= 250.13
##$BF4= 250.13
##$BF5= 500.13
##$BF6= 500.13
##$BF7= 500.13
##$BF8= 500.13
##$BYTORDA= 1
##$CFDGTYP= 0
##$CFRGTYP= 5
##$CHEMSTR= <none>
##$CNST= (0..31)
1 1 145 1 1 1 1 1 1 1 1 1 1 1 1 1 1 1 1 1 1 1 1 1 1 1 1 1 1 1 1 1 
##$CPDPRG= <>
##$CPDPRG1= <>
##$CPDPRG2= <>
##$CPDPRG3= <>
##$CPDPRG4= <mlev>
##$CPDPRG5= <mlev>
##$CPDPRG6= <mlev>
##$CPDPRG7= <mlev>
##$CPDPRG8= <mlev>
##$CPDPRGB= <>
##$CPDPRGT= <>
##$D= (0..31)
0 1 0 0 0 0 0 0 0 0.06 0 0 0 0 0 0 0.0002 0 0 0 0 0 0 0 0 0 0 0 0 0 0 
0 
##$DATE= 1119513417
##$DBL= (0..7)
120 120 120 120 120 120 120 120 
##$DBP= (0..7)
150 150 150 150 150 150 150 150 
##$DBP07= 0
##$DBPNAM0= <>
##$DBPNAM1= <>
$$ [...]
##$SUBNAM7= <"">
##$SUBNAM8= <"">
##$SUBNAM9= <"">
##$SW= 20.6930455092707
##$SWIBOX= (0..15)
0 0 3 0 0 0 0 0 0 0 0 0 0 0 0 0 
##$SW_h= 5175.983436853
##$TD= 65536
##$TD0= 1
##$TE= 295.16
##$TE2= 300
##$TE3= 300
##$TEG= 300
##$TL= (0..7)
0 120 120 120 120 120 120 120 
##$TP= (0..7)
150 150 150 150 150 150 150 150 
##$TP07= 0
##$TPNAME0= <>
##$TPNAME1= <>
##$TPNAME2= <>
##$TPNAME3= <>
##$TPNAME4= <>
##$TPNAME5= <>
##$TPNAME6= <>
##$TPNAME7= <>
##$TPOAL= (0..7)
0.5 0.5 0.5 0.5 0.5 0.5 0.5 0.5 
##$TPOFFS= (0..7)
0 0 0 0 0 0 0 0 
##$TUNHIN= 0
##$TUNHOUT= 0
##$TUNXOUT= 0
##$USERA1= <user>
##$USERA2= <user>
##$USERA3= <user>
##$USERA4= <user>
##$USERA5= <user>
##$V9= 5
##$VALIST= <valist>
##$VCLIST= <CCCCCCCCCCCCCCC>
##$VD= 0
##$VDLIST= <DDDDDDDDDDDDDDD>
##$VPLIST= <PPPPPPPPPPPPPPP>
##$VTLIST= <TTTTTTTTTTTTTTT>
##$WBST= 1024
##$WBSW= 4
##$XGAIN= (0..3)
0 0 0 0 
##$XL= 0
##$YL= 0
##$YMAX_a= 516743
##$YMIN_a= -583397
##$ZGOPTNS= <>
##$ZL1= 120
##$ZL2= 120
##$ZL3= 120
##$ZL4= 120
##$ABSF1= 16.522
##$ABSF2= -4.171173
##$ABSG= 5
##$ABSL= 3
##$ALPHA= 0
##$AQORDER= 0
##$ASSFAC= 0
##$ASSFACI= 0
##$ASSFACX= 0
##$ASSWID= 0
##$AUNMP= <proc_1d>
##$AZFE= 0.1
##$AZFW= 0.1
##$BCFW= 0
##$BC_mod= 0
##$BYTORDP= 0
##$COROFFS= 0
##$CY= 12.5
##$DATMOD= 1
##$DC= 0
##$DFILT= <>
##$DTYPP= 0
##$F1P= 14.0000005364418
##$F2P= -0.99999901652339
##$FCOR= 0.5
##$FTSIZE= 32768
##$FT_mod= 6
##$GAMMA= 0
##$GB= 0
##$INTBC= 1
##$INTSCL= 1
##$ISEN= 128
##$LB= 0.3
##$LEV0= 0
##$LPBIN= 0
##$MAXI= 10000
##$MC2= 0
##$MEAN= 0
##$ME_mod= 0
##$MI= 0
##$NCOEF= 0
##$NC_proc= -3
##$NLEV= 6
##$NOISF1= 0
##$NOISF2= 0
##$NSP= 0
##$NTH_PI= 0
##$NZP= 0
##$OFFSET= 16.522
##$PC= 1
##$PHC0= -57.95171
##$PHC1= -24.78227
##$PH_mod= 1
##$PKNL= yes
##$PPARMOD= 0
##$PSCAL= 4
##$PSIGN= 0
##$REVERSE= no
##$SF= 250.13
##$SI= 32768
##$SIGF1= 0
##$SIGF2= 0
##$SINO= 400
##$SIOLD= 32768
##$SREGLST= <1H.CDCl3>
##$SSB= 0
##$STSI= 32768
##$STSR= 0
##$SW_p= 5175.98343685301
##$SYMM= 0
##$S_DEV= 0
##$TDeff= 65536
##$TDoff= 0
##$TI= <Analysis number 999999
Compound Code 99
Book Reference 9
Project Code 9>
##$TILT= no
##$TM1= 0
##$TM2= 0
##$TOPLEV= 0
##$USERP1= <user>
##$USERP2= <user>
##$USERP3= <user>
##$USERP4= <user>
##$USERP5= <user>
##$WDW= 1
##$XDIM= 32768
##$YMAX_p= 310192610
##$YMIN_p= -375033
$$ End of Bruker specific parameters
$$ ---------------------------------
##NTUPLES= NMR SPECTRUM
##VAR_NAME=  FREQUENCY,     SPECTRUM/REAL,   SPECTRUM/IMAG
##SYMBOL=    X,             R,               I
##VAR_TYPE=  INDEPENDENT,   DEPENDENT,       DEPENDENT
##VAR_FORM=  AFFN,          ASDF,            ASDF
##VAR_DIM=   32768,         32768,           32768
##UNITS=     HZ,            ARBITRARY UNITS, ARBITRARY UNITS
##FACTOR=    0.157963299565203, 1,           1
##FIRST=     4132.6476996994, 0,             0
##LAST=      -1043.33573715361, 0,           0
##MIN=       -1043.33573715361, -375033,     0
##MAX=       4132.6476996994, 310192610,     0
$$ Real data points
##PAGE= N=1
##DATA TABLE= (X++(R..R)), XYDATA
$$ [...]
$$ plain form
15924 -5658 -20468 -21406 6420 10906 3038 -14172 -22569 -1187 21066 23218 -7173 -31178 -34928
15911 -34928 -35914 -50756 -37871 -8207 -7816 -13920 -22707 -19150 -18308 -5744 6632 5922 2187 21397
15897 21397 27940 23489 16123 -4122 2187 10898 20327 24188 21381 10856 5629 4761 -10097 -17396
15883 -17396 -4883 17034 16748 -10939 -33734 -66737 -51814 -39659 -30910 -5886 3072 -3936 -11451
15870 -11451 -13409 -24994 -20589 -13131 -18458 3622 11479 -5412 -16581 -11825 -2852 13377 -6674
15857 -6674 -33104 -24725 7722 21208 -586 -9841 -8293 8190 16026 11464 -3188 2207 24071
15844 24071 46104 31871 17171 14743 8510 -24396 -41437 -37107 -17128 1349 12148 12692 18485
15831 18485 9355 23607 15161 3889 -9127 1439 3900 -1350 -1433 12291 31951 39112 34449
$$ packed form
15924e658j4810r38K7826M486p868j7210q397K1382K2253K152l0391k4005l750
15911c4928r86j4842J2885K9664L91o104q787L557Q42J2564J2376p10l735J9210
15897B1397O543m451p366k0245O309Q711R429L861k807j0525n227q68j4858p299
15883a7396J2513K1917k86k7687k2795l3003J4923J2155Q749K5024Q958p008p515
15870a1451j958j1585M405P458n327K2080P857j6891j1169M756Q973J6229k0051
15857f674k6430Q379L2447J3486k1794r255J548J6483P836m562j4652N395K1864
15844B4071K2033j4233j4700k428o233l2906j7041M330J9979J8477J0799N44N793
15831A8485r130J4252q446j1272j3016J0566K461n250q3J3724J9660P161m663
$$ plain form
15818 34449 35290 28311 19226 20372 19315 18669 12015 -8004 -6205 26568 34345 30473 13527 3612
15804 3612 -8446 -16624 -14167 -379 3806 -25360 -12407 -11847 -10138 -610 1820 17490 281
15791 281 -8198 13105 17911 26386 41720 31118 6018 19017 41294 38462 19517 11336 2486
15778 2486 -32034 -15866 4245 -8487 -14774 -17183 6204 -11710 -17245 -3004 9089 -5566
15766 -5566 -18777 -3712 -3362 24510 44873 24869 -2638 4193 15301 16649 -8824 -12296 -3644
15753 -3644 1056 7250 7196 2977 8719 7507 25556 12203 8413 27411 7115 8083 6697 -12112
15739 -12112 -14631 -375 -1241 -9121 9095 6204 3035 -10587 6550 12375 8266 -3495 -8073
15726 -8073 -14485 -8976 -18811 -20953 268 21858 823 -12643 -14191 -15880 -8992 -10453 -11890 -8256
$$ packed form
15818C4449Q41o979r085J146j057o46o654k0019J799L2773P777l872j6946r915
15804C612j2058q178K457J3788M185k9166J2953N60J709R528K430J5670j7209
15791B81q479K1303M806Q475J5334j0602k5100J2999K2277k832j8945q181q850
15778B486l4520J6168K0111j2732o287k409K3387j7914n535J4241J2093j4655
15766e566j3211J5065L50K7872K0363k0004k7507O831J1108J348k5473l472Q652
15753c644M700O194n4m219N742j212J8049j3353l790J8998k0296R68j386j8809
15739a2112k519J4256q66p880J8216k891l169j3622J7137N825m109j1761m578
15726h073o412N509r835k142K1221K1590k1035j3466j548j689O888j461j437L634
$$ plain form
15712 -8256 -9788 10074 22388 10165 -10306 -2162 9638 -9679 -15113 -21632 -14040 -21585 -26287
15699 -26287 -31074 -8917 5457 12986 7725 -5222 -13472 -16601 -30499 -36096 -30629 -37068 -37299 -23143
15685 -23143 -16472 -28556 -25255 -696 9766 22139 17361 29137 33607 29369 24300 6196 -21138
15672 -21138 -34246 -20846 -5116 18628 2214 -4777 1105 -15066 -20414 -8017 -11099 -11219 -13473
15659 -13473 -10807 15642 13182 12574 16578 3649 -3327 2816 -1513 -1290 8514 12345 -1333 5050
15645 5050 24663 55904 49009 29846 11104 -9139 -33496 -15713 -7640 -13028 -34593 -43475 -20251
15632 -20251 7045 25592 13838 10846 21956 31717 46944 50853 45401 46484 22179 6367 7333
15619 7333 14200 4998 -16444 -18270 21899 8030 -7729 4034 35079 45329 44228 34494 33595
$$ packed form
15712h256j532J9862J2314j2223k0471Q144J1800j9317n434o519P592p545m702
15699b6287m787K2157J4374P529n261j2947q250l129j3898n597N467o439k31J4156
15685b3143O671j2084L301K4559J0462J2373m778J1776M470m238n069j8104k7334
15672b1138j3108J3400J5730K3744j6414o991N882j6171n348J2397l082j20k254
15659a3473K666K6449k460o08M004j2929o976O143m329K23R804L831j3678O383
15645E050J9613L1241o895j9163j8742k0243k4357J7783Q073n388k1565q882K3224
15632b0251K7296J8547j1754k992J1110R761J5227L909n452J083k4305j5812R66
15619G333O867r202k1442j826M0169j3869j5759J1763L1045J0250j101r734q99
$$ plain form
15606 33595 33184 49032 32206 12308 20632 26078 20975 35375 32237 9787 -30418 -45200 -11879
15593 -11879 2957 25749 45322 61478 42716 23636 22351 16419 11328 -921 -24233 -35764
15581 -35764 -23603 -21842 -11543 2892 18301 32486 54694 61979 40000 35946 43499 57788
15569 57788 76779 88558 59864 40824 39154 47838 34172 3066 -13862 7361 14838 28936
15557 28936 47367 54808 41232 25502 50273 83097 76946 84232 93045 96738 111136 108496 91851
15544 91851 104081 90836 103097 104942 78608 88700 87432 91967 113606 126541 116777 119847 118789
15531 118789 135620 136720 139354 159115 193893 220448 219631 227198 228780 246081 266919 290428 278027
15518 278027 278844 284781 294790 293927 314288 334495 327241 331391 363544 384535 415469 425549 424423
$$ packed form
15606C3595m11J5848j6826j9898Q324N446n103J4400l138k2450m0205j4782L3321
15593a1879J4836K2792J9573J6156j8762j9080j285n932n091j2249k3312j1531
15581c5764J2161J761J0299J4435J5409J4185K2208P285k1979m054P553J4289
15569E7788J8991J1779k8694j9040j670Q684j3666l1106j6928K1223P477J4098
15557B8936J8431P441j3576j5730K4771L2824o151P286Q813L693J4398k640j6645
15544I1851J2230j3245J2261J845k6334J0092j268M535K1639J2935r764L070j058
15531A18789J6831J100K634J9761L4778K6555q17P567J582J7301K0838K3509j2401
15518B78027Q17N937J0009q63K0361K0207p254M150L2153K0991L0934J0080j126
$$ plain form
15505 424423 428276 447643 479724 510751 521115 509279 517721 502065 533342 541425 561700 569595
15493 569595 591860 585363 586848 570629 559530 558474 549399 534185 524736 520381 520985 509736 500725
15480 500725 508642 491370 464414 453671 427852 409589 364598 361327 354700 337504 325124 330875
15468 330875 338417 336539 312035 294245 302248 293434 302340 312987 308638 297978 291610 276123 273956
15455 273956 253585 247516 233922 210399 221768 228519 200554 208855 215802 217286 203233 162371
15443 162371 148380 134408 141648 143031 157483 150535 128574 119032 117514 83832 82323 102347 130012
15430 130012 122254 93232 76798 84826 94892 95582 97841 106755 127210 145321 136637 104475 98437
15417 98437 90261 78657 70040 72244 89215 97202 65478 52746 56031 73890 86735 77162 65716
$$ packed form
15505D24423L853J9367L2081L1027J0364j1836Q442j5656L1277Q083K0275P895
15493E69595K2265o497J485j6219j1099j056r075j5214r449m355O04j1249r011
15480E00725P917j7272k6956j0743k5819j8263m4991l271o627j7196j2380N751
15468C30875P542j878k4504j7790Q003q814Q906J0647m349j0660o368j5487k167
15455B73956k0371o069j3594k3523J1369O751k7965Q301O947J484j4053m0862
15443A62371j3991j3972P240J383J4452o948k1961r542j518l3682j509K0024K7665
15430A30012p758k9022j6434Q028J0066O90K259Q914K0455J8111q684l2162o038
15417I8437q176j1604q617K204J6971P987l1724j2732L285J7859J2845r573j1446
$$ plain form
15404 65716 76421 71660 55709 43689 45417 52443 36160 20871 26798 49583 32257 32262 39004
15391 39004 32414 26460 31563 36689 35093 20945 14423 37956 64608 58477 25007 -551 -25529
15378 -25529 -15909 22443 24911 1620 10895 19411 17302 4383 -1485 716 4884 16387 42198
15365 42198 41023 39011 31957 11369 11905 -15084 -17594 -10558 -8021 3717 13915 21001 13185 18188
15351 18188 41211 38934 9370 -6758 -203 16672 7183 -7927 10200 19378 20434 50211 46231
15338 46231 27224 36215 61041 88610 86078 75434 47102 37337 27834 17488 30563 28409 25827
15325 25827 43858 53771 47723 26289 21702 18305 2125 8699 18468 6616 19673 23781 32037
15312 32037 38421 37188 45028 47461 36880 44333 29830 23852 20778 13932 17942 13528 31762 49215
$$ packed form
15404F5716J0705m761j5951j2020J728P026j6283j5289N927K2785j7326NO742
15391C9004o590n954N103N126j596j4148o522K3533K6652o131l3470k5558k4978
15378b5529R620L8352K468k3291R275Q516k109j2919n868K201M168J1503K5811
15365D2198j175k012p054k0588N36k6989k510P036K537J1738J0198P086p816N003
15351A8188K3023k277k9564j6128O555J6875r489j5110J8127R178J056K9777l980
15338D6231j9007Q991K4826K7569k532j0644k8332r765r503j0346J3075k154k582
15325B5827J8031R913o048k1434m587l397j6180O574R769j1852J3057M108Q256
15312C2037O384j233P840K433j0581P453j4503n978l074o846M010m414J8234J7453
$$ plain form
15298 49215 39377 19093 -4070 10675 29290 35861 42779 39723 17876 18798 24483 17610 439
15285 439 -2248 482 5514 4077 15503 15676 -2734 7079 22650 19893 8916 9953 4142 13387
15271 13387 -3543 -24628 -54347 -55549 -15698 -6261 -9373 -36305 -58844 -42797 -40997 -29945
15259 -29945 -15448 12202 31499 29201 7873 1374 15835 20262 15959 -2650 -6389 -20595 -35458
15246 -35458 -37294 -23546 -6747 -2163 -19503 -34520 -36571 -33222 -32381 -37550 -20363 6044 -368
15233 -368 -9949 -31451 -41901 -29329 -34252 -23707 -15231 -39609 -26858 -15627 -12152 -14158 19695
15220 19695 32986 32659 27799 4629 -25709 -41388 -22768 -62 -4814 -2368 12977 9565 7916
15207 7916 11808 -274 -11813 -3297 8140 29755 32974 17764 16314 9035 -561 -7368 5107
$$ packed form
15298D9215r838k0284k3163J4745J8615O571O918l056k1847R22N685o873j7171
15285D39k687K730N032j437J1426J73j8410R813J5571k757j0977J037n811R245
15271A3387j6930k1085k9719j202L9851R437l112k6932k2539J6047J800J1052
15259b9945J4497K7650J9297k298k1328o499J4461M427m303j8609l739j4206j4863
15246c5458j836J3748J6799M584j7340j5017k051L349Q41n169J7187K6407o412
15233c68r581k1502j0450J2572m923J0545Q476k4378J2751J1231L475k006L3853
15220A9695J3291l27m860k3170l0338j5679J8620K2706m752K446J5345l412j649
15207G916L892j2082j1539Q516J1437K1615L219j5210j450p279r596o807J2475
$$ plain form
15194 5107 9036 -7508 -24153 -29444 -15665 -24660 -30623 -35771 -20384 8197 15434 6640 3865
15181 3865 10042 15363 15999 28312 10673 -6977 5258 6110 -22763 -37632 -32132 -9497 6496
15168 6496 -2916 -20329 378 1221 8794 13426 19892 186 -15868 -2824 37332 39927 9708
15155 9708 -14914 -16342 5586 25622 26224 20526 26489 24048 35465 32223 23622 38605 35299 28233
15141 28233 12757 16378 35567 35485 28560 28244 30583 28338 18330 5291 20508 15977 16314 25839
15127 25839 30728 19621 31863 51967 38600 38922 24401 2216 -13274 -26142 -32127 -24335 -19551
15114 -19551 4762 5103 2000 13050 5809 -21905 -1152 11595 -418 5661 7024 -3860 9681
15101 9681 11311 -2124 11356 -9146 -15060 18317 23955 -3315 -7441 -21293 -21346 -10304 782
$$ packed form
15194E107L929j6544j6645n291J3779q995n963n148J5387K8581P237q794k775
15181C865O177N321O36J2313j7639j7650J2235Q52k8873j4869N500K2635J5993
15168F496r412j7413K0707Q43P573M632O466j9706j6054J3044M0156K595l0219
15155I708k4622j428K1928K0036O02n698N963k441J1417l242q601J4983l306p066
15141B8233j5476L621J9189q2o925l16K339k245j0008j3039J5217m531L37R525
15127B5839M889j1107J2242K0104j3367L22j4521k2185j5490j2868n985P792M784
15114a9551K4313L41l103J1050p241k7714K0753J2747j2013O079J363j0884J3541
15101I681J630j3435J3480k0502n914L3377N638k7270m126j3852n3J1042J1086
$$ plain form
15088 782 10279 12946 10316 21096 32158 25351 -16691 -28046 -26308 -19078 -15965 -2016 3222 7633
15074 7633 34653 25741 16685 -6334 -43160 -30188 547 13378 28137 15208 2026 7190
15062 7190 -3806 -15534 -9019 -6534 -1947 19906 15317 4652 750 163 6013 9508 27931 5986
15048 5986 4379 -1951 -20684 -26847 -8016 -5261 491 1951 -1238 -4343 -840 -8308 -10239 3602
15034 3602 19260 19829 21724 25476 471 -10268 8819 25587 15284 9812 26862 19523 5148
15021 5148 1295 -12605 -20845 -25377 -35033 -37445 -9251 -16504 -28111 -53142 -60595 -52879 -16076
15008 -16076 2053 -9732 -16514 -22701 -5589 18218 28538 25400 36198 53183 25851 372
14996 372 -407 -4115 17524 20919 -2008 -9723 -13805 -19515 -1985 19190 15708 10735 11837 29645
$$ packed form
15088G82R497K667k630J0780J1062o807m2042j1355J738P230L113J3949N238M411
15074G633K7020q912r056k3019l6826J2972L0735J2831J4759j2929j3182N164
15062G190j0996j1728O515K485M587K1853m589j0665l902n87N850L495J8423k1945
15048E986j607o330j8733o163J8831K755N752J460l189l105L503p468j931J3841
15034C602J5658N69J895L752k5005j0739J9087J6768j0303n472J7050p339j4375
15021E148l853j3900q240m532r656k412K8194p253j1607k5031p453P716L6803
15008a6076J8129j1785o782o187J7112K3807J0320l138J0798J6985k7332k5479
14996C72p79l708K1639L395k2927p715m082n710J7530K1175l482m973J102J7808
$$ plain form
14982 29645 13035 -20169 -15504 -3861 10569 4508 -1177 -13190 -25086 -46695 -24100 -25663
14970 -25663 -18509 -8888 141 10783 8333 -6801 -29475 -25983 -8366 -16438 -15230 5455 29107
14957 29107 25089 -1030 -8238 6626 15214 34007 32646 14288 -8657 -21708 -33392 -1141
14945 -1141 16694 6053 -14452 -11069 -8868 19524 37200 18298 -1559 -17950 -31536 -26615
14933 -26615 -17846 1446 21319 9713 6231 169 -33398 -26958 -3224 -7717 -20124 -5843 -235
14920 -235 -1610 12883 25597 15344 15197 27694 34913 41593 35544 7894 15648 28686 33332 36256
14906 36256 30261 -5639 -38206 -45962 -47272 -28625 -17671 -17835 -5703 16229 23283 31880 25521
14893 25521 501 -21142 -9108 -3364 -12535 -4324 -16628 -4050 1793 10382 37464 12719 -4543
$$ packed form
14982B9645j6610l3204M665J1643J4430o061n685j2013j1896k1609K2595j563
14970b5663P154R621R029J0642k450j5134k2674L492J7617q072J208K0685K3652
14957B9107m018k6119p208J4864Q588J8793j361j8358k2945j3051j1684L2251
14945a141J7835j0641k0505L383K201K8392J7676j8902j9857j6391j3586M921
14933b6615Q769J9292J9873j1606l482o062l3567O440K3734m493j2407J4281N608
14920b35j375J4493J2714j0253j47J2497P219O680o049k7650P754J3038M646K924
14906C6256n995l5900l2567p756j310J8647J0954j64J2132K1932P054Q597o359
14893B5521k5020k1643J2034N744r171Q211j2304J2578N843Q589K7082k4745j7262
$$ plain form
14880 -4543 -1125 -10308 -12455 -9951 -3674 2066 -2501 -22634 -31223 -45188 -38885 -24764 -25447 -4411
14866 -4411 14966 27387 27726 27854 27189 8804 -10217 -40934 -31106 -28103 -19153 -6938 -16828 -7062
14852 -7062 -535 -6442 -7384 -18269 -44757 -32779 -16505 -6478 7286 17188 17841 31474 25818
14839 25818 34589 25205 16557 39360 47512 35361 17140 21361 14564 -3224 -17887 -9751 324
14826 324 8184 -14302 -19243 -14526 -5744 -9424 -1106 -2596 2384 -8721 -24601 -17523 1148 -13908
14812 -13908 -9224 -15677 -12967 -8976 -18106 -31379 -38078 -38635 -32657 -26876 -22602 -217 18830 15117
14798 15117 34120 41126 31762 13890 25804 17906 25844 35183 38037 12975 -3924 -12436 -39103
14785 -39103 -47289 -32773 -33817 -45905 -25918 -15873 -19288 -29805 -36227 -19835 -22192 -16788 -26918
$$ packed form
14880d543L418r183k147K504O277N740m567k0133q589j3965O303J4121o83K1036
14866d411J9377J2421L39J28o65j8385j9021l0717R828L003Q950J2215r890R766
14852g062O527n907r42j0885k6488J1978J6274J0027J3764R902O53J3633n656
14839B5818Q771r384q648K2803Q152j2151j8221M221o797j7788j4663Q136J0075
14826C24P860k2486m941M717Q782l680Q318j490M980j1105j5880P078J8671j5056
14812a3908M684o453K710L991r130j3273o699n57N978N781M274K2385J9047l713
14798A5117J9003P006r364j7872J1914p898P938R339K854k5062j6899q512k6667
14785c9103q186J4516j044j2088J9987J0045l415j0517o422J6392k357N404j0130
$$ plain form
14772 -26918 -18187 11373 -2080 -6251 -15249 -16710 -9297 -12002 -19483 -20799 -5069 -19181 -33586
14759 -33586 -45937 -30889 1256 8372 -14285 -11364 3283 17444 43388 57195 29061 -3706
14747 -3706 -1269 15025 12153 9494 -13661 -13663 17161 43324 59161 61598 49574 36599 34609 25921
14733 25921 5751 11685 20029 1965 5001 15711 9426 4495 -848 9421 12633 -1340 -19755
14720 -19755 -37412 -48062 -27158 -11749 -9496 -22045 -14989 -22361 -37478 -26890 -30116 -25773 3617
14707 3617 -921 -19109 -16761 -14856 -16373 -22620 -18232 -12311 -5376 9329 14485 4955 1082 9102
14693 9102 2001 6873 5440 -24869 -36720 -16493 -1435 16995 29694 38231 26269 14202 20198
14680 20198 28609 41656 29913 20472 22296 14669 8280 7590 11349 8048 -1663 20682 31379 15315
$$ packed form
14772b6918Q731K9560j3453m171q998j461P413k705p481j316J5730j4112j4405
14759c3586j2351J5048L2145P116k2657K921J4647J4161K5944J3807k8134l2767
14747c706K437J6294k872k659k3155kL0824K6163J5837K437j2024j2975j990q688
14733B5921k0170N934Q344j8064L036J0710o285m931n343J0269L212j3973j8415
14720a9755j7657j0650K0904J5409K253j2549P056p372j5117J0588l226M343K9390
14707C617m538j8188K348J905j517o247M388N921O935J4705N156r530l873Q020
14693I102p101M872j433l0309j1851K0227J5058J8430J2699Q537j1962j2067N996
14680B0198Q411J3047j1743r441J824p627o389o90L759l301r711K2345J0697j6064
$$ plain form
14666 15315 -17467 -22433 -23896 -13962 980 3377 -8186 -9073 -1858 21072 34979 17173 -9179
14653 -9179 -10355 -13268 -24518 -26377 -19929 3265 10659 7922 9788 20770 30707 17969 42788
14640 42788 30612 14416 -270 -1873 -12495 -19997 -13120 -26541 -20894 -10006 -12203 -6680 4848
14627 4848 -3660 -385 -11850 -27053 -38180 -46375 -30099 -15171 13092 17277 22985 25298 9044
14614 9044 -18388 -37184 -42112 -18694 10192 25617 855 -11568 1232 -1068 -7206 5258
14602 5258 15895 5753 5633 15554 2819 -7204 174 -3135 -3935 -8776 -4767 -2833 -25734 -33421
14588 -33421 -19381 -16519 -1233 -6983 -8554 -7365 5778 22486 17377 14747 12973 13367 12200 -16760
14574 -16760 -51586 -14312 9779 22026 16079 34303 44474 38583 57999 65723 26396 1548
$$ packed form
14666A5315l2782m966j463R934J4942K397j1563q87P215K2930J3907j7806k6352
14653i179j176k913j1250j859O448K3194P394k737J866J0982R937j2738K4819
14640D2788j2176j6196j4686j603j0622p502O877j3421N647J0888k197N523J1528
14627D848q508L275j1465j5203j1127q195J6276J4928K8263M185N708K313j6254
14614I044k7432j8796m928K3418K8886J5425k4762j2423J2800k300o138J2464
14602E258J0637j0142j20R921j2735j0023P378l309q00m841M009J934k2901p687
14588c3421J4040K862J5286n750j571J189J3143J6708n109k630j774L94j167k8960
14574a6760l4826L7274K4091J2247n947J8224J0171n891J9416P724l9327k4848
$$ plain form
14562 1548 -10946 -21290 21504 15562 -379 651 -8292 -17980 -15046 -4494 6546 6907 3659
14549 3659 226 5630 8979 21133 38421 18382 15222 6117 12846 34455 -962 -37965 -22674
14536 -22674 1246 -4835 -22813 -23656 -48012 -36016 -15862 -5151 -14581 -34120 -40974 -32977 -35388
14523 -35388 -21409 4497 -1790 -30362 -36930 -30423 -27247 -20307 -13690 -2501 -4661 -7534 -5401
14510 -5401 -45080 -48693 -30917 -24789 -23050 -9567 -23441 -29362 -29223 -37005 -67581 -73103 -45876
14497 -45876 -25258 -28440 -22471 26129 40552 18548 27921 19596 17721 3116 -5111 516 -4054
14484 -4054 -1677 -2967 -19722 -35344 -58123 -25931 9450 23166 238 -21840 -21210 -29979 -17885
14471 -17885 -11457 2486 4165 -9755 2179 4112 -22003 -30095 -14047 -2755 -4606 -23460 -40496
$$ packed form
14562A548j2494j0344M2794n942j5941J030q943r688K934J0552J1040L61l248
14549C659l433N404L349J2154J7288k0039l160r105O729K1609l5417l7003J5291
14536b2674K3920o081j7978q43k4356J1996K0154J0711r430j9539o854P997k411
14523c5388J3979K5906o287k8572o568O507L176O940O617J1189k160k873K133
14510e401l9679l613J7776O128J739J3483j3874n921J39p782l0576n522K7227
14497d5876K0618l182N969M8600J4423k2004R373q325j875j4605q227N627m570
14484d054K377j290j6755j5622k2779L2192L5381J3716k2928k2078O30q769J2094
14471a7885O428J3943J679j3920J1934J933k6115q092J6048J1292j851j8854j7036
$$ plain form
14458 -40496 -27965 -22748 -30787 -25870 -26922 -36830 -28513 -6040 10827 31689 40085 40466 43339 35312
14444 35312 34551 26221 12667 -14285 -36457 -8598 11035 9254 31110 40084 14379 2214 -16120
14431 -16120 -20251 -16248 -27047 -9438 2086 34050 23015 6159 -9522 -13477 -10935 -13402 -15806
14418 -15806 -13620 -3625 -1971 8563 11633 17488 25715 -1293 2543 5699 13782 17872 -1966 -31034
14404 -31034 -23565 -23115 -19510 -2609 25115 28179 11285 -1968 18429 29104 35520 48187 26651
14391 26651 11310 12352 31328 32297 30182 14587 12123 24753 17575 -21370 -28460 -22549 -6189
14378 -6189 -20538 -34750 -23952 -24274 -28510 -22554 -27970 -3075 23 -40 -108 14867 22185 3214
14364 3214 -10109 -7137 -745 417 -206 -29922 -22178 -8616 -32569 -20461 -6465 4207 18293
$$ packed form
14458d0496J2531N217q039M917j052r908Q317K2473J6867K0862Q396L81K873q027
14444C5312p61q330j3554k6952k2172K7859J9633j781K1856Q974k5705j2165j8334
14431a6120m131M003j0799J7609J1524L1964j1035j6856j5681l955K542k467k404
14418a5806K186R995J654J0534L070N855Q227k7008L836L156Q083M090j9838k9068
14404c1034P469M50L605J6901K7724L064j6894j3253K0397J0675O416J2667k1536
14391B6651j5341J042J8976R69k115j5595k464J2630p178l8945p090N911J6360
14378f189j4349j4212J0798l22m236N956n416K4895L098o3o8J4975P318j8971
14364C214j3323K972O392J162o23k9716P744J3562k3953J2108J3996J0672J4086
$$ plain form
14351 18293 6086 -3372 -1813 8659 23295 22247 21340 526 -9431 17272 48297 44472 23439
14338 23439 -13750 -53457 -67390 -62986 -40398 -19413 -24612 -23644 -7580 -11935 -3543 -16776 -42879
14325 -42879 -33527 -2691 10823 -9948 -17283 553 8703 -11937 -14701 -15406 -7455 12501 19156
14312 19156 10071 14536 28020 14375 16436 3278 7753 20175 38120 33274 15856 -6753 -34074
14299 -34074 -17800 13401 -11191 -23476 -26335 -3556 12478 -873 -14777 -8531 -8478 4871 25122
14286 25122 7234 16153 -4126 -27996 -20482 -27298 -35741 -12998 -13811 3580 19329 18799 25320
14273 25320 23762 21177 17525 33600 42045 29124 8564 19466 15339 455 2057 30892 35653
14260 35653 32606 35515 4619 -14722 -2134 -15053 -12527 -3695 -14411 -10203 7822 11599 -5221
$$ packed form
14351A8293j2207r458J559J0472J4636j048r07k0814r957K6703L1025l825k1033
14338B3439l7189l9707j3933M404K2588K0985n199R68J6064m355Q392j3233k6103
14325d2879R352L0836J3514k0771p335J7836Q150k0640k764p05P951J9956O655
14312A9156r085M465J3484j3645K061j3158M475J2422J7945m846j7418k2609k7321
14299c4074J6274L1201k4592j2285k859K2779J6034j3351j3904O246N3J3349K0251
14286B5122j7888Q919k0279k3870P514o816q443K2743q13J7391J5749n30O521
14273B5320j558k585l652J6075Q445j2921k0560J0902m127j4884J602K8835M761
14260C5653l047K909l0896j9341J2588j2919K526Q832j0716M208J8025L777j6820
$$ plain form
14247 -5221 -40615 -29183 -24693 -17576 454 935 10503 8661 -7528 -11857 7495 3342 -16259
14234 -16259 -27400 -24705 -14662 -1446 18744 10133 8056 -3956 15576 31324 17250 21648
14222 21648 41762 41939 9218 9879 9147 161 -6527 -7764 -10923 -59 20745 27753 16175 16591
14208 16591 15712 1282 14923 32202 37972 11348 -7880 -9303 -4101 17371 7992 -69 27151
14195 27151 50225 63012 46950 29260 21176 4392 -13450 -5616 -12473 -5200 796 -17864 -20373
14182 -20373 -17158 -9428 -11861 20207 53947 31741 -5506 -31839 -29784 -29705 -26751 -22723 -23950 -23073
14168 -23073 -11379 -5595 -17607 -33754 -28683 -14791 -15818 2732 6745 2794 14259 15388 34613
14155 34613 42068 2872 10497 15133 20566 17855 23423 16811 21957 33166 37919 41433 27283 23903
$$ packed form
14247e221l5394J1432M490P117J8030M81R568j842j6189m329J9352m153j9601
14234a6259j1141K695J0043J3216K0190q611k077j2012J9532J5748j4074M398
14222B1648K0114J77l2721O61p32q986o688j237l159J0864K0804P008j1578M16
14208A6591q79j4430J3641J7279N770k6624j9228j423N202K1472r379q061K7220
14195B7151K3074J2787j6062j7690q084j6784j7842P834o857P273N996j8660k509
14182b0373L215P730k433L2068L3740k2206l7247k6333K055P9K954M028j227Q77
14168b3073J1694N784j2012j6147N071J3892j027J8550M013l951J1465J129J9225
14155C4613P455l9196P625M636N433k711N568o612N146J1209M753L514j4150l380
$$ plain form
14141 23903 34724 22929 5287 -3597 -12370 5387 7488 -24253 -7768 -7877 -24364 -19465 -8933
14128 -8933 -16915 -16808 -16734 -23981 -20204 -31504 -34531 -4221 -7352 11769 22038 18145 4203 -8217
14114 -8217 -15088 -21792 -34498 -37975 -51546 -40985 -5306 9802 12380 4737 704 5706 11091
14101 11091 -1018 -21720 -19337 35 -4156 -17416 -22423 -35557 -32227 -24717 -14953 -11328 9232
14088 9232 -4593 16235 14665 6944 -5708 -30518 3129 17014 31038 15600 21772 30198 31341
14075 31341 27277 22361 21563 9022 -5928 -27371 -34237 -21839 -3057 19392 -901 6815 11416
14062 11416 1083 17521 6587 -19321 -9407 23703 19820 -1034 -9088 10891 3052 -9368
14050 -9368 -20198 -15219 -21555 -2245 34750 48388 32080 25276 -2752 7697 26496 20131 3634
$$ packed form
14141B3903J0821j1795j7642q884q773J7757K101l1741J6485j09j6487M899J0532
14128h933p982J07P4p247L777j1300l027L0310l131J9121J0269l893j3942j2420
14114h217o871o704j2706l477j3571J0561L5679J5108K578p643m033N002N385
14101A1091j2109k0702K383J9372m191j3260n007j3134L330P510R764L625K0560
14088I232j3825K0828j570p721j2652k4810L3647J3885J4024j5438O172Q426J143
14075C1341m064m916p98j2541j4950k1443o866J2398J8782K2449k0293P716M601
14062A1416j0333J6438j0934k5908R914L3110l883k0854q054J9979p839j2420
14050i368j0830M979o336J9310L6995J3638j6308o804k8028J0449J8799o365j6497
$$ plain form
14037 3634 2226 -4082 -9028 -16566 9826 971 -7123 -26588 -27436 -26834 -18647 -8160 -321 13241
14023 13241 29474 36960 34784 45831 38194 12412 18575 -7721 -7854 -16821 -9002 10897 15897
14010 15897 -5058 -17173 -16087 -55495 -32266 14339 26724 1760 -9047 -27216 -26052 9403
13998 9403 2004 -27680 -35993 -25375 -18022 -10430 -32171 -34399 -27607 -38462 -28660 -49520 -32978
13985 -32978 -3680 5304 24770 18585 1403 -7580 5754 1560 -9953 7382 14223 14501 6251
13972 6251 25471 23062 32309 25234 16645 27616 24976 2548 -3196 10875 29183 15622 5611
13959 5611 3501 -7045 1486 -12248 -548 32014 37876 23392 11911 -1178 -11407 -7170 5320
13946 5320 12377 24643 15227 7738 -859 -9004 -15089 -26355 -19884 -1451 -9602 1743 9591 7216
$$ packed form
14037C634j408o308m946p538K6392q855q094j9465q48O02Q187J0487P839J3562
14023A3241J6233P486k176J1047p637k5782O163k6296j33q967P819J9899N000
14010A5897k0955j2115J086l9408K3229M6605J2385k4964j0807j8169J164L5455
13998I403p399k9684q313J0618P353P592k1741k228O792j0855R802k0860J6542
13985c2978K9298Q984J9466o185j7182q983J3334m194j1513J7335O841K78q250
13972F251J9220k409R247p075q589J0971k640k2428n744J4071J8308j3561j0011
13959E611k110j0546Q531j3734J1700L2562N862j4484j1481j3089j0229M237J2490
13946E320P057J2266r416p489q597q145o085j1266O471J8433q151J1345P848k375
$$ plain form
13932 7216 -10415 -10490 3596 10428 8154 200 -5500 -1674 6519 38213 40631 24450 9765 26284
13918 26284 25533 1156 -10406 -21657 -30640 -20946 -1162 10963 1819 12486 28597 21223 21155
13905 21155 28960 21295 6825 4500 -11408 -2935 8203 -17095 6327 20309 1887 -2995 -2224
13892 -2224 3421 10267 13748 12326 10605 -8230 -13430 -9534 -3490 -1256 3064 22787 11840 -10749
13878 -10749 -6955 2404 9176 5375 6445 7561 25534 31749 7427 -9069 8670 46097 39698
13865 39698 25718 26811 24598 30335 29574 15235 21692 9393 -40796 -45617 -53650 -50455 -50084 -35874
13851 -35874 -24350 -16080 -3502 5663 17787 45026 6083 -5985 5419 9766 19963 23607
13839 23607 12597 16025 26799 28008 39889 18234 -8480 -9287 -20278 -16279 18544 10589 -4000
$$ packed form
13932G216j7631p5J4086O832k274p954n700L826Q193L1694K418j6181j4685J6519
13918B6284p51k4377j1562j1251q983R694J9784J2125r144J0667J6111p374o8
13905B1155P805p665j4470k325j5908Q473J1138k5298K3422J3982j8422m882P71
13892b224N645O846L481j422j721j8835n200L896O044K234M320J9723j0947k2589
13878a0749L794R359O772l801J070J116J7973O215k4322j6496J7739L7427o399
13865C9698j3980J093k213N737p61j4339O457j2299n0189m821q033L195L71J4210
13851c5874J1524Q270J2578R165J2124K7239l8943j2068J1404M347J0197L644
13839B3607j1010L428J0774J209J1881k1655k6714q07j0991L999L4823p955j4589
$$ plain form
13826 -4000 -3667 -6297 -7724 15951 19235 31310 -5597 -28827 -6835 9246 34849 19820 4235
13813 4235 -9345 -21373 -562 12465 24240 10897 13165 15744 32978 34074 8445 -7081
13801 -7081 29948 29399 -7101 -13513 -9696 16928 11829 6517 18230 4768 13833 -1989 -16047
13788 -16047 11825 31046 20746 28986 20655 23744 22507 37480 42210 34292 42827 29761 38034
13775 38034 33108 24642 10061 1614 -4730 -4732 14660 37529 54323 44804 59095 65894 52464 70684
13761 70684 114817 172471 228637 228704 168196 117865 119408 99283 75860 70197 79571 54510 43621
13748 43621 51161 68323 61928 42639 33022 43558 59497 70309 74706 60618 14654 12280 25006
13735 25006 25156 23035 12355 29100 14330 2257 -7693 -2718 1963 8501 10983 10052 17281 31408
$$ packed form
13826d000L33k630j427K3675L284J2075l6907k3230K1992J6081K5603j5029j5585
13813D235j3580j2028K0811J3027J1775j3343K268K579J7234J096k5629j5526
13801g081L7029n49l6500o412L817K6624n099n312J1713j3462R065j5822j4058
13788a6047K7872J9221j0300Q240q331L089j237J4973M730p918Q535j3066Q273
13775C8034m926q466j4581q447o344kJ9392K2869J6794r519J4291O799j3430J8220
13761G0684M4133N7654N6166O7o0508n0331J543k0125k3423n663R374k5061j0889
13748D3621P540J7162o395j9289r617J0536J5939J0812M397j4088m5964k374J2726
13735B5006J50k121j0680J6745j4770j2073r950M975M681O538K482r31P229J4127
$$ plain form
13721 31408 52842 53329 52658 63187 42379 25728 37220 39017 26669 8333 -7736 2997 14482
13708 14482 19829 -4973 -14879 8533 28810 4137 4346 5486 -5974 -29649 -33316 -16797 10034
13695 10034 12249 -8182 -10351 -27628 -34970 -32769 -38391 -20237 -12640 -30174 -31641 -20337 -13581
13682 -13581 -461 10737 11480 2666 10341 18148 10717 7846 4164 -18260 -26651 -14520 -23825 -15290
13668 -15290 18446 25085 -1832 -8959 -7943 2180 -3134 3567 -6232 -19495 -18041 -11299 6262
13655 6262 -4659 -8867 4040 -9565 -41205 -45758 -31674 -35318 -37213 -24975 -44004 -26117 2782
13642 2782 10019 16002 37754 40611 30350 -2352 -14740 -14390 -30077 -35782 -10667 -6349 -24705
13629 -24705 -42221 -20967 3779 11123 14033 4228 21226 22185 18657 15435 30119 40026 11250
$$ packed form
13721C1408K1434M87o71J0529k0808j6651J1492J797j2348j8336j6069J0733J1485
13708A4482N347k4802r906K3412K0277k4673K09J140j1460k3675l667J6519K6831
13695A0034K215k0431k169j7277p342K201n622J8154P597j7534j467J1304O756
13682a3581J3120J1198P43q814P675P807p431k871l682k2424q391J2131r305Q535
13668a5290L3736O639k6917p127J016J0123n314O701r799j3263J454O742J7561
13655F262j0921m208J2907j3605l1640m553J4084l644j895J2238j9029J7887K8899
13642B782P237N983K1752K857j0261l2702j2388L50j5687n705K5115M318j8356
13629b4705j7516K1254K4746P344K910r805J6998R59l528l222J4684R907k8776
$$ plain form
13616 11250 40180 46205 45521 36444 37452 22748 8738 17423 20171 -2749 10100 9032 4315
13603 4315 -2780 19491 19545 7030 -7398 11746 28699 3945 -18897 -13036 -19993 -34421 -27233
13590 -27233 -26804 -26515 -6513 -6306 -12899 13504 26358 22168 16431 -1216 -7386 -14943 -18924 -2916
13576 -2916 1046 2326 19968 -21073 -28101 -1180 -7040 -22098 -25418 -22345 -12151 -17346 -32106
13563 -32106 -43848 -28343 -7840 -21889 -39244 -57205 -47147 -30942 171 6042 -2878 -19140
13551 -19140 1350 9557 -1224 -774 30629 32950 -339 -17237 -17660 -942 -10709 -32175 -38052
13538 -38052 -10879 12462 16996 22018 36715 44774 44132 33139 8399 -26228 -42091 -34913 -37265
13525 -37265 -29537 -16009 -17391 -14846 -26041 -27400 -26781 218 -5266 17198 11614 -8616 11458
$$ packed form
13616A1250K8930O025o84r077J008j4704j4010Q685K748k2920J2849j068m717
13603D315p095K2271N4j2515j4428J9144J6953k4754k2842N861o957j4428P188
13590b7233M29K89K0002K07o593K6403J2854m190n737j7647o170p557l981J6008
13576b916L962J280J7642m1041p028K6921n860j5058l320L073J0194n195j4760
13563c2106j1742J5505K0503j4049j7355j7961J0058J6205L1113N871q920j6262
13551a9140K0490Q207j0781M50L1403K321l3289j6898m23J6718r767k1466n877
13538c8052K7173K3341M534N022J4697Q059o42j0993k4740l4627j5863P178k352
13525c7265P728J3528j382K545j1195j359O19K6999n484K2464n584k0230K0074
$$ plain form
13512 11458 16447 12704 2769 17827 10983 10416 21336 7234 -726 -8400 -3677 -4908 10654 13438
13498 13438 -1505 6052 25475 26570 7138 -9608 13255 47599 42669 19199 15317 23471 34144
13485 34144 21681 34677 33755 22595 -4557 195 10259 25622 4563 -6860 2146 5218 2748
13472 2748 -1398 6743 27350 48450 45397 41636 36365 17518 4157 13170 44718 34080 45095
13459 45095 35126 26876 16093 -2322 -4780 -2698 24148 44024 48458 56067 28733 9792 -9310
13446 -9310 -6228 3474 -1276 9803 22794 36484 43295 42843 19851 5834 14447 27767 20093
13433 20093 17077 -1534 -1474 2059 11715 1821 -6478 -6416 -9216 15240 31298 36639 33525 39559 16640
13418 16640 24904 35777 31874 48632 49683 45088 20398 -12439 -15005 -8221 7208 12905 18642
$$ packed form
13512A1458M989l743r935J5058o844n67J0920j4102p960p674M723j231J5562K784
13498A3438j4943P557J9423J095j9432j6746K2863L4344m930k3470l882Q154J0673
13485C4144j2463J2996r22j1160k7152M752J0064J5363k1059j1423R006L072k470
13472B748m146Q141K0607K1100l053l761n271j8847j3361R013L1548j0638J1015
13459D5095r969q250j0783j8415k458K082K6846J9876M434P609k7334j8941j9102
13446i310L082R702m750J1079J2991J3690O811m52k2992j4017Q613J3320p674
13433B0093l016j8611O0L533R656r894q299O2k800K4456J6058N341l114O034k2919
13418A6640Q264J0873l903J6758J051m595k4690l2837k566O784J5429N697N737
$$ plain form
13405 18642 18534 19741 42264 51105 14025 9895 1121 -10241 -99 16650 5467 -12311 -9781
13392 -9781 18798 18232 12138 10361 21210 20151 37757 26880 -3987 -1041 7469 6009 21031
13379 21031 -1488 -3589 15547 27826 13872 -8779 -20208 -19344 -4431 7023 33374 57116
13367 57116 29132 26521 30471 22053 20866 18042 18043 25935 51569 60979 29555 9562 23176 36718
13353 36718 45644 53586 39757 35875 48226 51228 45572 16761 22070 7777 11791 24204 23643
13340 23643 -1947 -15834 -6907 -11583 4085 -3737 -19146 -3881 -8792 -6079 24278 48297 74127
13327 74127 71554 68730 53069 35948 7876 12917 13380 -5137 -4215 16156 15706 2185 39122
13314 39122 35521 12442 13915 35469 42051 4541 13800 27132 23400 23627 23226 14686 9990 25339
$$ packed form
13405A8642j08J207K2523Q841l7080m130q774j1362J0142J6749j1183j7778K530
13392i781K8579n66o094j777J0849j059J7606j0877l0867K946Q510j460J5022
13379B1031k2519k101J9136J2279j3954k2651j1429Q64J4913J1454K6351K3742
13367E7116k7984k611L950q418j187k824JP892K5634R410l1424j9993J3614J3542
13353C6718Q926P942j3829l882J2351L002n656k8811N309j4293M014J2413n61
13340B3643k5590j3887Q927m676J5668p822j5409J5265m911K713L0357K4019K5830
13327G4127k573k824j5661j7121k8072N041M63j8517R22K0371m50j3521L6937
13314C9122l601k3079J473K1554O582l7510R259J3332l732K27m01q540m696J5349
$$ plain form
13300 25339 19974 32427 41803 27523 35010 43509 25903 17322 36132 39637 22121 20505 20491 30879
13286 30879 19969 15535 35868 44930 32797 9211 15508 15778 -27306 -54801 -46755 -27192 -25935
13273 -25935 -16936 7480 20243 13799 7623 17858 30287 32984 21875 2494 -1354 -14630 -6922
13260 -6922 1343 -10270 -7597 -1924 2749 -2533 -18770 -16507 18200 22471 9768 16770 -1038
13247 -1038 -9928 1444 -11979 1250 -2625 -155 -13566 -16191 -14487 -10702 -29572 -29677 -46932
13234 -46932 -51795 -37053 -26389 -6687 7397 18716 18950 23011 16606 3204 -411 -3099 1989
13221 1989 21577 34611 12158 -8546 -19367 -6969 -7237 -3068 9985 5909 -17239 -27971 -22551
13208 -22551 -31651 -38814 -18133 -13709 -20987 -15904 5591 9754 22848 36954 36619 51972 40247
$$ packed form
13300B5339n365J2453R376j4280P487Q499j7606q581J8810L505j7516j616j4J0388
13286C0879j0910m434K0333R062j2133k3586O297K70m3084k7495Q046J9563J257
13273b5935Q999K4416J2763o444o176J0235J2429K697j1109j9381l848j3276P708
13260f922Q265j1613K673N673M673n282j6237K263L4707M271j2703P002j7808
13247a038q890J1372j3423J3229l875K470j3411k625J704L785j8870j05j7255
13234d6932m863J4742J0664J9702J4084J1319K34M061o405j3402l615k688N088
13221A989J9588J3034k2453k0704j0821J2398k68M169J3053m076k3148j0732N420
13208b2551r100p163K0681M424p278N083K1495M163J3094J4106l35J5353j1725
$$ plain form
13195 40247 47490 27601 18035 15013 17219 1256 -8828 890 -9072 -15355 3964 6145 -2330
13182 -2330 12762 7389 -5896 -14904 -18962 -17651 -16652 2277 17692 -5327 -32102 -19815 19218
13169 19218 28411 335 9739 17781 -11676 -29095 -34022 -22670 -16829 -24725 -26259 -38398 -52248
13156 -52248 -47574 -37100 -28060 -15264 -4349 6949 20331 230 -12446 -13850 -8885 16404
13144 16404 9541 -6944 -24055 -23669 -13973 -35160 -62016 -69643 -59378 -51176 -48174 -38677 -10968
13131 -10968 -3957 8229 -5079 -41095 -36949 -33758 -55196 -65639 -81595 -76378 -51905 -14480
13119 -14480 11982 23626 4499 -24439 -44001 -42894 -38596 -6599 -522 10232 27890 28789 17923
13106 17923 2653 2619 -5077 -16788 -24121 -26246 -22619 -25426 -24134 -6845 -11192 -7186 7541 3971
$$ packed form
13195D0247P243j9889r566l022K206j5963j0084R718r962o283J9319K181q475
13182b330J5092n373j3285r008m058J311R99J8929J5415k3019k6775J2287L9033
13169A9218R193k8076R404Q042k9457j7419m927J1352N841p896j534j2139j3850
13156e2248M674J0474R040J2796J0915J1298J3382k0101j2676j404M965K5289
13144A6404o863j6485j7111L86R696k1187k6856p627J0265Q202L002R497K7709
13131a0968P011J2186j3308l6016M146L191k1438j0443j5956N217K4473L7425
13119a4480K6462J1644j9127k8938j9562J107M298L1997O077J0754J7658Q99j0866
13106A7923j5270l4p696j1711p333k125L627k807J292J7289m347M006J4727l570
$$ plain form
13092 3971 32418 55705 43649 13023 -21987 -17491 1036 2364 6497 -7645 -7684 21947 31155
13079 31155 18217 -557 5932 18215 5524 -4834 -10453 -15386 -1650 543 5054 -5847 -3873
13066 -3873 6725 17615 15186 -776 -2961 -3045 7370 29490 37701 26346 3564 -13634 -9170
13053 -9170 4264 -861 -12074 -31636 -40529 -18479 -15214 -28644 -24118 -12264 -3404 -12108 -30042
13040 -30042 -37999 -37890 -42443 -36418 -31456 -17295 -30234 -47054 -27258 3742 7055 1825 8492
13027 8492 -3136 2048 6602 10903 -235 -4983 653 4145 -700 2803 -9571 -22784 -14426 -15489
13013 -15489 -478 13215 13121 2781 10852 4928 -11573 -17431 -13373 -18250 -11363 -13588 -23371 -38857
12999 -38857 -48462 -50006 -44637 -38070 -35308 -31323 -28797 1834 9839 -14015 -38162 -40689 -41777 -40073
$$ packed form
13092C971K8447K3287j2056l0626l5010M496J8527J328M133j4142l9K9631R208
13079C1155j2938j8774O489J2283j2691j0358n619m933J3736K193M511j0901J974
13066c873J0598J0890k429j5962k185q4J0415K2120Q211j1355k2782j7198M464
13053i170J3434n125j1213j9562q893K2050L265j3430M526J1854Q860q704j7934
13040c0042p957J09m553O025M962J4161j2939j6820J9796L1000L313n230O667
13027H492j1628N184M554M301j1138m748N636L492m845L503j2374j3213Q358j063
13013a5489J5011J3693r4j0340Q071n924j6501n858M058m877O887k225r783j5486
12999c8857r605j544N369O567K762L985K526L0631Q005k3854k4147k527j088J704
$$ plain form
12985 -40073 -23180 -33496 -25738 -19985 -21805 -11991 -11308 -13816 -27509 -27711 -29394 -14765 9326 11539
12971 11539 10745 18492 20123 -5402 -12291 -18047 -30345 -38288 -32313 -9355 -8046 -14010 -10123 -3390
12957 -3390 -26209 -35555 -26057 -5149 32682 40337 22906 4276 5034 14876 15874 8651 -1520 4437
12943 4437 16708 8324 13042 17774 -2414 -13603 3859 19288 26277 23585 25035 25222 16886 5580
12929 5580 1255 5455 15554 32349 23004 276 -1506 -721 -1540 -18954 -6926 -7541 -14309 -14695
12915 -14695 15956 15026 -1554 -17321 -10442 6338 -2779 -10816 1510 12492 38478 55271 60623
12902 60623 64128 64515 71266 95301 102917 117306 146346 131350 141222 172412 162912 156213 147233
12889 147233 142294 139232 119246 116573 117762 105719 107540 96228 91980 96446 82132 70296 65202
$$ packed form
12985d0073J6893j0316P758N753j820R814O83k508j3693k02j683J4629K4091K213
12971A1539p94P747J631k5525o889n756j2298p943N975K2958J309n964L887O733
12957c390k2819r346R498K0908L7831P655j7431j8630P58R842R98p223j0171N957
12943D437J2271q384M718M732k0188j1189J7462J5429O989k692J450J87q336j1306
12929E580m325M200J0099J6795r345k2728j782P85q19j7414J2028o15o768l86
12915a4695L0651r30j6580j5767O879J6780r117q037J2326J0982K5986J6793N352
12902F0623L505L87O751K4035P616J4389K9040j4996R872L1190r500o699q980
12889A47233m939l062j9986k673J189j2043J821j1312m248M466j4314j1836n094
$$ plain form
12876 65202 72491 89249 116333 154984 167890 184020 237017 291387 377870 498954 644163
12865 644163 801294 966442 1124384 1251897 1319060 1273979 1161138 1000860 879222 766646
12855 766646 648698 573773 517211 473673 420080 387781 376575 334529 330697 328815 311065 269539
12843 269539 237676 239570 239607 232068 216727 214067 218187 199673 192909 191641 184918 177017 186558 202278
12829 202278 216597 215273 204993 169130 155434 160174 171618 177251 191737 176797 145077 151765
12817 151765 136063 122530 125335 134494 142655 136685 120628 119387 123241 122030 81802 57855 69593
12804 69593 83237 66044 68362 66198 66806 54840 33484 18985 15915 13823 27943 56163 78997
12791 78997 66294 60932 63718 58506 39817 41453 42108 41889 40077 55779 53681 27621 14064 -9436
$$ packed form
12876F5202P289J6758K7084L8651J2906J6130N2997N4370Q6483J21084J45209
12865F44163J57131J65148J57942J27513O7163m5081j12841j60278j21638j12576
12855G66646j17948p4925n6562m3538n3593l2299j1206m2046l832j882j7750m1526
12843B69539l1863J894L7p539j5341k660M120j8514o764j268o723p901R541J5720
12829B02278J4319j324j0280l5863j3696M740J1444N633J4486j4940l1720O688
12817A51765j5702j3533K805R159Q161n970j6057j241L854j211m0228k3947J1738
12804F9593J3644j7193K318k164O08j1966k1356j4499l070k092J4120K8220K2834
12791G8997j2703n362K786n212j8689J636O55k19j812J5702k098k6060j3557k3500
$$ plain form
12777 -9436 -14035 -12286 3744 22036 23356 12603 -678 -8575 -6464 4438 7246 30376 38846
12764 38846 32219 25207 29796 45595 51045 48586 53929 36893 42258 60150 41159 14741 46520
12751 46520 45805 45637 36708 32578 44734 62650 71834 70343 72246 81990 104691 108645 104313 129133
12737 129133 175316 192985 230745 298546 358981 409660 453345 454678 429654 387410 305566 237804
12725 237804 214060 176282 136971 101084 83367 73138 64796 62719 61476 65647 57597 52121 38751
12712 38751 54786 93240 99105 81333 76394 91683 90210 86319 85936 76077 99496 123843 156525
12699 156525 159599 134708 133527 120407 113267 130807 125335 110969 113101 118539 141055 182338 196883
12686 196883 179844 177765 212118 242474 315778 370428 412285 433046 450286 453503 412718 374261
$$ packed form
12777i436m599J749J6030J8292J320j0753j3281p897K111J0902K808K3130Q470
12764C8846o627p012M589J5799N450k459N343j7036N365J7892j8991k6418L1779
12751D6520p15j68q929m130J2156J7916R184j491J903R744K2701L954m332K4820
12737A29133M6183J7669L7760O7801O0435N0679M3685J333k5024m2244q1844o7762
12725B37804k3744l7778l9311l5887j7717j0229q342k077j243M171q050n476j3370
12712C8751J6035L8454N865j7772m939J5289j473l891l83r859K3419K4347L2682
12699A56525L074k4891j181j3120p140J7540n472j4366K132N438K2516M1283J4545
12686A96883j7039k079L4353L0356P3304N4650M1857K0761J7240L217m0785l8457
$$ plain form
12674 374261 357663 330590 275434 229039 195862 164538 147839 139410 148035 112795 88570 64167
12662 64167 25773 27213 48858 50693 54814 56079 57267 29454 -1399 5202 5803 6047 9603 6585
12648 6585 23850 19859 404 -4640 -9273 -8829 -3855 9597 21278 14061 12832 7712 4061 9550
12634 9550 22805 14441 8631 9464 25462 14522 -5709 -3467 8337 43284 58113 69100 82487
12621 82487 100487 111311 102079 59328 51514 69320 73567 98009 128029 143869 147446 153497 146268
12608 146268 128306 149062 167590 141330 130028 149310 139784 146745 164799 164418 183889 201161
12596 201161 207816 226972 252239 244842 228644 222922 243349 235175 215536 212773 228235 237642 250311
12583 250311 240013 256056 250744 248029 241994 227895 232725 210492 208534 216542 227236 260611 274363
$$ packed form
12674C74261j6598k7073n5156m6395l3177l1324j6699q429Q625l5240k4225k4403
12662F4167l8394J440K1645J835M121J265J188k7813l0853O601O01K44L556l018
12648F585J7265l991j9455n044m633M44M974J3452J1681p217j229n120l651N489
12634I550J3255q364n810Q33J5998j0940k0231K242J1804L4947J4829J0987J3387
12621H2487J8000J0824r232m2751p814J7806M247K4442L0020J5840L577O051p229
12608A46268j7962K0756J8528k6260j1302J9282r526O961J8054l81J9471J7272
12596B01161O655J9156K5267p397j6198n722K0427q174j9639k763J5462R407J2669
12583B50311j0298J6043n312k715o035j4099M830k2233j958Q008J0694L3375J3752
$$ plain form
12570 274363 286182 297440 315615 298728 302224 314435 344790 387216 418899 409151 402694 418307
12558 418307 449671 471359 471895 497885 507905 518233 536244 566112 602079 633564 658605 707786
12546 707786 743794 802447 841416 881800 919155 953375 998649 1050921 1082451 1119051 1163585
12535 1163585 1197285 1231119 1267299 1294983 1314356 1303342 1306040 1327472 1382748 1425490 1453613
12524 1453613 1534610 1627592 1689956 1777340 1892273 2026229 2205297 2426854 2662468 2948276
12514 2948276 3274257 3602446 3958353 4333786 4706963 4998395 5212748 5318140 5301921 5161699
12504 5161699 4942983 4741077 4522555 4284625 4109170 3980438 3881482 3794276 3697626 3627390
12494 3627390 3583247 3579316 3586853 3576226 3608715 3679185 3748024 3828332 3893562 3972221 4066278 4198166
$$ packed form
12570B74363J1819J1258J8175j6887L496J2211L0355M2426L1683r748o457J5613
12558D18307L1364K1688N36K5990J0020J0328J8011K9868L5967L1485K5041M9181
12546G07786L6008N8653L8969M0384L7355L4220M5274N2272L1530L6600M4534
12535A163585L3700L3834L6180K7684J9373j1014K698K1432N5276M2742K8123
12524A453613Q0997R2982O2364Q7384J14933J33956J79068K21557K35614K85808
12514B948276L25981L28189L55907L75433L73177K91432K14353J05392j6219j40222
12504E161699k18716k01906k18522k37930j75455j28732r8956q7206r6650p0236
12494C627390m4143l931P537j0627L2489P0470O8839Q0308O5230P8659R4057J31888
$$ plain form
12482 4198166 4360735 4540219 4728871 4932483 5158246 5382967 5612027 5872675 6162359
12473 6162359 6505381 6905709 7364377 7871266 8434551 9070066 9770154 10552277 11404656
12464 11404656 12318842 13306474 14340092 15409207 16495892 17609014 18689016 19732290
12456 19732290 20742584 21815181 23036672 24400262 25803133 27127135 28177528 28775006
12448 28775006 28795122 28295341 27422748 26367231 25311753 24403361 23743279 23404072 23382266
12439 23382266 23725003 24546298 25940927 28055229 31082655 35299284 41107270 48926195
12431 48926195 59282486 72950993 91002894 114677169 144524149 179081257 213812790
12424 213812790 241299858 254146370 248937359 228063660 198437600 167823640 141273069
$$ packed form
12482D198166J62569J79484J88652K03612K25763K24721K29060K60648K89684
12473F162359L43022M00328M58668N06889N63285O35515P00088P82123Q52379
12464A1404656R14186R87632J033618J069115J086685J113122J080002J043274
12456A9732290J010294J072597J221491J363590J402871J324002J050393N97478
12448B8775006K0116m99781q72593j055517j055478r08392o60082l39207k1806
12439B3382266L42737Q21295J394629K114302L027426M216629N807986P818925
12431D8926195J0356291J3668507J8051901K3674275K9846980L4557108L4731533
12424B13812790K7487068J2846512n209011k0873699k9626060l0613960k6550571
$$ plain form
12417 141273069 120357356 104420278 92224350 82690398 75109633 68968850 63951519
12410 63951519 59794852 56299655 53346373 50893300 48797376 46982208 45405927 44028377
12402 44028377 42883324 41936145 41172362 40580911 40069985 39602871 39079160 38443014 37674653
12393 37674653 36829341 35948293 35063223 34236436 33583911 33054630 32606431 32144303 31541957
12384 31541957 30740572 29694337 28438540 27095746 25697255 24358579 23112679 21897935
12376 21897935 20723494 19626937 18609097 17647229 16712959 15837605 15015921 14252664 13549751
12367 13549751 12885268 12250001 11666623 11108856 10583556 10095398 9623732 9156697 8737792
12358 8737792 8336583 7964462 7622123 7281864 6941166 6629031 6340700 6080201 5845212
$$ packed form
12417A41273069k0915713j5937078j2195928r533952p580765o140783n017331
12410F3951519m156667l495197k953282k453073k095924j815168j576281j377550
12402D4028377j145053r47179p63783n91451n10926m67114n23711o36146p68361
12393C7674653q45312q81048q85070q26787o52525n29281m48199m62128o02346
12384C1541957q01385j046235j255797j342794j398491j338676j245900j214744
12376B1897935j174441j096557j017840r61868r34270q75354q21684p63257p02913
12367A3549751o64483o35267n83378n57767n25300m88158m71666m67035m18905
12358H737792m01209l72121l42339l40259l40698l12135k88331k60499k34989
$$ plain form
12349 5845212 5602704 5361616 5152399 4956049 4763157 4560293 4355958 4184769 4036725
12340 4036725 3884834 3751897 3621835 3518354 3396622 3266881 3142624 3037527 2922866
12331 2922866 2799074 2688060 2597911 2489672 2416964 2344461 2277642 2218662 2126258 2050969 2009488
12320 2009488 1940602 1860912 1807448 1760044 1716434 1682589 1649181 1629018 1574780 1542694 1517791
12309 1517791 1491218 1479147 1484894 1484203 1478104 1491884 1502355 1528233 1540740 1491288 1403888 1300895
12297 1300895 1198038 1097057 1044448 1011246 1001693 981102 968944 946426 899161 873361 868535
12286 868535 881265 879979 857122 832611 804866 796747 822495 821843 800056 797428 800298 791408 795378
12273 795378 801806 812120 856299 848068 828701 813602 817231 820329 839121 885764 894590 885183 904005
$$ packed form
12349E845212k42508k41088k09217j96350j92892k02864k04335j71189j48044
12340D036725j51891j32937j30062j03481j21732j29741j24257j05097j14661
12331B922866j23792j11014r0149j08239p2708p2503o6819n8980r2404p5289m1481
12320B009488o8886p9690n3464m7404m3610l3845l3408k0163n4238l2086k4903
12309A517791k6573j2071N747o91o099J3780J0471K5878J2507m9452q7400j02993
12297A300895j02857j00981n2609l3202r553k0591j2158k2518m7265k5800m826
12286H68535J2730j286k2857k4511k7745q119K5748o52k1787k628K870q890L970
12273G95378O428J0314M4179q231j9367j5099L629L098J8792M6643Q826r407J8822
$$ plain form
12260 904005 906819 939073 957925 968515 987122 973889 974899 997728 1010010 998268 1001209 1015011
12248 1015011 1013273 1014911 1028324 1037933 1026344 1017143 1009050 1011493 1001387 996536 996413 972100 962947
12235 962947 976124 992545 987733 980277 986139 979327 975980 957490 918283 897726 897939 908668 904574
12222 904574 896586 875378 854865 841409 850029 838942 812852 784336 754229 757626 749861 708239
12210 708239 694874 689503 690004 686927 687375 679799 663271 663001 679075 666116 636190 642590 614814
12197 614814 593756 594198 603443 611422 627675 630574 629023 620268 592077 584183 599340 562418 535513
12184 535513 521631 522430 510427 498454 495139 496615 491971 481038 469436 481544 492620 493846 483175
12171 483175 477167 513504 534368 510316 476816 443185 410253 388484 382427 365933 380861 375111
$$ packed form
12260I04005K814L2254J8852J0590J8607j3233J010K2829J2282j1742K941J3802
12248A015011j738J638J3413R609j1589r201q093K443j0106m851j23k4313r153
12235I62947J3177J6421m812p456N862o812l347j8490l9207k0557K13J0729m094
12222I04574p988k1208k0513j3456Q620j1087k6090k8516l0107L397p765m1622
12210G08239j3365n371N01l077M48p576j6528k70J6074j2959k9926O400k7776
12197F14814k1058M42R245P979J6253K899j551q755k8191p894J5157l6922k6905
12184E35513j3882P99j2003j1973l315J476m644j0933j1602J2108J1076J226j0671
12171D83175o008L6337K0864k4052l3500l3631l2932k1769o057j6494J4928n750
$$ plain form
12159 375111 357659 351227 344657 345047 324875 292492 267666 259772 235541 217383 200071 168178
12147 168178 178990 216085 223073 223113 205979 203112 227943 247914 231829 212585 194509 202659 214540
12134 214540 233080 248454 252067 260546 259921 268118 273029 258848 239324 227986 202929 196448 198628
12121 198628 166389 114053 42808 -12277 -51761 -81377 -95512 -47342 10620 27874 38219
12110 38219 54494 86733 105190 134708 181668 188380 200339 208964 207679 204323 210467 232074 234539
12097 234539 237704 246946 245569 249182 256075 262063 255784 258673 277987 295460 277066 277606 264974
12084 264974 280719 299875 298401 308116 293859 274139 263653 276300 285951 281507 283399 283005 276294
12071 276294 244106 260087 272252 270502 265632 287752 314076 313213 329427 307809 299329 292143 290699
$$ packed form
12159C75111j7452o432o570L90k0172l2383k4826p894k4231j8158j7312l1893
12147A68178J0812L7095O988M0j7134k867K4831J9971j6085j9244j8076Q150J1881
12134B14540J8540J5374L613Q479o25Q197M911j4181j9524j1338k5057o481K180
12121A98628l2239n2336p1245n5085l9484k9616j4135M8170N7962J7254J0345
12110C8219J6275L2239J8457K9518M6960O712J1959Q625j285l356O144K1607K465
12097B34539L165R242j377L613O893N988o279K889J9314J7473j8394N40j2632
12084B64974J5745J9156j474R715j4257j9720j0486J2647R651m444J892l94o711
12071B76294l2188J5981J2165j750m870K2120K6324q63J6214k1618q480p186j444
$$ plain form
12058 290699 281615 274163 263446 256998 270708 256139 249125 250375 259572 264741 263072 242815 244275
12045 244275 250298 244411 229178 231708 213619 200535 191621 173245 165895 173988 203763 231714 222390
12032 222390 220846 217870 196099 214195 229722 198014 195977 238641 236872 226075 206755 192779
12020 192779 194686 205316 224520 252727 258614 227093 250500 282158 283381 303229 335376 341540
12008 341540 318023 325834 341724 331967 314228 317225 333123 334127 295672 292905 319109 303348
11996 303348 287900 286350 304515 307646 296936 308743 331028 357234 399140 450519 496628 546176
11984 546176 646525 751905 912662 1124097 1329508 1486104 1585625 1552108 1421187 1259782
11974 1259782 1096940 948038 834325 754194 713421 678596 628353 580828 547776 524972 517382
$$ packed form
12058B90699r084p452j0717o448J3710j4569p014J250R197N169j669k0257J460
12045B44275O023n887j5233K530j8089j3084q914j8376p350Q093K9775K7951r324
12032B22390j544k976k1771J8096J5527l1708k037M2664j769j0797j9320j3976
12020A92779J907J0630J9204K8207N887l1521K3407L1658J223J9848L2147O164
12008C41540k3517P811J5890r757j7739K997J5898J004l8455k767K6204j5761
11996C03348j5448j550J8165L131j0710J1807K2285K6206M1906N1379M6109M9548
11984E46176J00349J05380J60757K11435K05411J56596R9521l3517j30921j61405
11974A259782j62842j48902j13713q0131m0773l4825n0243m7525l3052k2804p590
$$ plain form
11963 517382 510728 485276 449427 421592 420677 413700 437026 436952 435311 424292 407209 421096 434947
11950 434947 424922 443264 453589 433245 412820 377914 374732 392613 387313 362248 362449 340455
11938 340455 343555 337890 345533 345494 352369 336168 344532 341151 310911 276407 270429 276698 286702 277408
11924 277408 276769 271951 276948 264798 241578 245628 249946 258563 252107 228500 232306 231778 222637 223374
11910 223374 225687 198340 195403 198058 178527 187258 219613 210632 182456 169538 146898 137990 145582
11897 145582 176785 183492 176680 177321 176639 184642 181606 153675 148699 142235 152147 153645 167312 166169
11883 166169 183764 196601 172804 163098 167940 176717 176142 144285 120370 122040 142418 123406 114305
11870 114305 121771 116619 131091 153976 161621 149030 127777 126593 146456 160668 159373 153280 172920
$$ packed form
11963E17382o654k5452l5849k7835r15o977K3326p4j641j1019j7083J3887J3851
11950D34947j0025J8342J0325k0344k0425l4906l182J7881n300k5065K01k1994
11938C40455L100n665P643l9O875j6201Q364l381l0240l4504n978O269J0004r294
11924B77408o39m818M997j2150k3220M050M318Q617o456k3607L806n28r141P37
11910B23374K313k7347k937K655j9531Q731L2355q981k8176j2918k2640q908P592
11897A45582L1203O707o812O41o82Q003l036k7931m976o464R912J498J3667j143
11883A66169J7595J2837k3797r706M842Q777n75l1857k3915J670K0378j9012r101
11870A14305P466n152J4472K2885P645j2591k1253j184J9863J4212j295o093J9640
$$ plain form
11857 172920 182875 175080 169983 158135 160493 161665 148509 137359 151573 168543 175811 204235 205152
11844 205152 213419 218103 218716 219529 216077 235736 229413 223542 207553 209678 221566 232027 225538 239697
11830 239697 248424 257858 246992 222175 205891 189832 189609 183417 218136 244621 243596 234025 243328
11817 243328 240181 210088 195680 217466 213042 230182 249992 253166 260451 269859 262265 268149 255460
11804 255460 227910 227322 219067 201622 211902 219945 234936 231127 198587 203895 213415 191839 204310
11791 204310 217089 215206 210721 209783 208095 172362 175171 194577 209028 215290 231675 238990 248785
11778 248785 238930 204166 183759 191936 162647 141761 151473 177275 175860 163213 163096 186244 173725
11765 173725 147374 161679 185945 189407 195521 186063 183314 157524 149960 166940 170215 188802 200716
$$ packed form
11857A72920R955p795n097j1848K358J172j3156j1150J4214J6970P268K8424R17
11844B05152Q267M684O13Q13l452J9659o323n871j5989K125J1888J0461o489J4159
11830B39697Q727R434j0866k4817j6284j6059k23o192L4719K6485j025r571R303
11817B43328l147l0093j4408K1786m424J7140J9810L174P285R408p594N884j2689
11804B55460k7550n88q255j7445J0280Q043J4991l809l2540N308R520k1576J2471
11791B04310J2779j883m485r38j688l5733K809J9406J4451O262J6385P315R795
11778B48785r855l4764k0407Q177k9289k0886R712K5802j415j2647j17K3148j2519
11765A73725k6351J4305K4266L462O114r458k749k5790p564J6980L275J8587J1914
$$ plain form
11752 200716 201881 217594 224397 214758 202181 179221 160420 179341 183467 191910 173447 152872
11740 152872 191918 204770 170716 150103 141030 160071 202552 207649 192414 166313 144380 161224
11728 161224 187110 203021 176669 174855 152274 132323 130853 140886 151506 143672 141812 136229
11716 136229 118281 117627 121380 149981 165320 149472 160830 194680 186520 167362 179050 177021
11704 177021 166549 166197 156631 152135 153024 141338 145714 137412 132891 147202 140022 119133 126852 142955
11690 142955 164543 162583 158903 165323 150990 162547 195238 188220 149885 132128 125249 112554
11678 112554 119762 111977 117220 132296 119780 114557 93877 98521 121781 130120 150710 136381 126049
11665 126049 144550 147256 166400 179274 167474 166015 175874 175642 166026 154036 146064 139007 137340
$$ packed form
11752B00716J165J5713O803r639j2577k2960j8801J8921M126Q443j8463k0575
11740A52872L9046J2852l4054k0613r073J9041M2481N097j5235k6101k1933J6844
11728A61224K5886J5911k6352j814k2581j9951j470J0033J0620p834j860n583
11716A36229j7948o54L753K8601J5339j5848J1358L3850q160j9158J1688k029
11704A77021j0472l52r566m496Q89j1686M376q302m521J4311p180k0889P719J6103
11690A42955K1588j960l680O420j4333J1557L2691p018l8335j7757o879j2695
11678A12554P208p785N243J5076j2516n223k0680M644K3260Q339K0590j4329j0332
11665A26049J8501K706J9144J2874j1800j459R859k32r616j1990p972p057j667
$$ plain form
11652 137340 141304 140520 143849 163529 138892 125047 126170 136182 146795 144757 156870 155811 138062
11639 138062 131106 125946 128265 112164 121296 104895 95224 131821 143179 137359 116305 110551 131330
11626 131330 153296 153976 129909 137278 140678 134787 118434 127906 135828 140306 131142 123063 108350
11613 108350 105779 139586 152089 124340 128356 136144 102255 99114 119800 123551 100909 94349 118097
11600 118097 132484 154891 132727 102768 80886 101987 137634 139231 134070 135791 136182 143750 139516
11587 139516 124747 129494 143616 127498 128003 146143 147761 150832 155558 144363 136351 158927 160614
11574 160614 159818 158144 164985 163671 169495 152040 139351 139426 142374 122699 102629 112731 130053
11561 130053 143379 129158 141211 139531 108068 98140 123709 130831 130481 134714 135130 131470 128974
$$ packed form
11652A37340L964p84L329J9680k4637j3845J123J0012J0613k038J2113j059j7749
11639A38062o956n160K319j6101R132j6401r671L6597J1358n820k1054n754K0779
11626A31330K1966O80k4067P369L400n891j6353R472P922M478r164q079j4713
11613A08350k571L3807J2503k7749M016P788l3889l141K0686L751k2642o560K3748
11600A18097J4387K2407k2164k9959k1882K1101L5647J597n161J721L91P568m234
11587A39516j4769M747J4122j6118N05J8140J618L071M726j1195q012K2576J687
11574A60614p96j674O841j314N824j7455j2689P5K948j9675k0070J0102J7322
11561A30053J3326j4221J2053j680l1463r928K5569P122l50M233M16l660k496
$$ plain form
11548 128974 125128 134045 133523 131165 121064 127326 128333 125999 122092 120805 136556 151541 174088
11535 174088 175196 127421 122642 136371 129888 124804 124038 124832 143914 149477 137001 143101 154161
11522 154161 166386 149490 139550 138311 153018 155473 148205 179815 169964 114597 120267 153896 157082
11509 157082 148322 126136 105169 107746 136366 157721 146583 131720 109746 129041 158515 143531
11497 143531 122556 92433 100665 110532 135475 135522 148118 170157 161777 120890 111918 133726 143167
11484 143167 153194 170339 169449 142041 138144 117708 93726 112256 132439 141853 167034 164986
11472 164986 176093 168642 156821 156676 167101 174599 170976 172579 172081 159357 139599 129010 149287
11459 149287 162094 166361 157874 159917 165545 184292 180835 159205 149792 145862 141002 156544 181972
$$ packed form
11548A28974l846Q917n22k358j0101O262J007k334l907j287J5751J4985K2547
11535A74088J108m7775m779J3729o483n084p66P94J9082N563j2476O100J1060
11522A54161J2225j6896r940j239J4707K455p268L1610r851n5367N670L3629L186
11509A57082q760k2186k0967K577K8620K1355j1138j4863k1974J9295K9474j4984
11497A43531k0975l0123Q232R867K4943M7J2596K2039q380m0887q972K1808R441
11484A43167J0027J7145q90k7408l897k0436k3982J8530K0183R414K5181k048
11472A64986J1107p451j1821j45J0425P498l623J603m98j2724j9758j0589K0277
11459A49287J2807M267q487K043N628J8747l457k1630r413l930m860J5542K5428
$$ plain form
11446 181972 162352 146319 129104 138849 167832 144147 138886 131010 136768 131011 126354 149440 154587
11433 154587 156771 162694 162703 160212 173465 153442 160024 166245 166481 135399 127232 159122 160317 169323
11419 169323 145660 128460 105073 99539 97991 104757 128751 136394 133267 130309 116747 115020 123936
11406 123936 148646 161220 136701 152691 171681 155049 131329 138232 132827 121654 127991 145727
11394 145727 167780 180463 185162 171734 135457 89332 94718 111295 129301 122333 120233 132515
11382 132515 147015 158572 138860 133412 143992 149942 168121 154226 122873 126575 139774 145426
11370 145426 149176 153541 151534 151754 147545 156826 150382 150538 155088 142953 106702 100784 124996 141031
11356 141031 131583 145656 131735 105856 122423 138855 152761 135831 143733 144284 147102 150592 130772
$$ packed form
11446A81972j9620j6033j7215R745K8983k3685n261p876N758n757m657K3086N147
11433A54587K184N923Rk491J3253k0023O582O221K36l1082q167L1890J195R006
11419A69323k3663j7200k3387n534j548O766K3994P643l127k958j3562j727Q916
11406A23936K4710J2574k4519J5990J8990j6632k3720O903n405j1173O337J7736
11394A45727K2053J2683M699j3428l6277m6125N386J6577J8006o968k100J2282
11382A32515J4500J1557j9712n448J0580N950J8179j3895l1353L702J3199N652
11370A45426L750M365k007K20m209R281o444J56M550j2135l6251n918K4212J6035
11356A41031r448J4073j3921k5879J6567J6432J3906j6930P902N51K818L490j9820
$$ plain form
11343 130772 122132 125480 127124 133779 118008 141877 154515 164303 146257 138684 153415 144416 117438
11330 117438 109227 126491 142205 154380 165415 148532 122302 123730 124902 125337 132542 134466 145106
11317 145106 133466 138075 134604 129022 115150 111277 122414 126043 145557 169487 177110 160189 151190
11304 151190 148538 153969 155806 162632 147914 153329 164368 161699 137313 131447 142751 162484 159901
11291 159901 135389 114252 121225 140625 174912 175627 168411 159788 143707 122971 98126 103405 136995
11278 136995 157240 151944 155126 148677 138986 141029 138916 126721 150174 186113 182452 161459 177497
11265 177497 167444 165881 172103 160225 163927 170230 173109 148620 153477 177075 182445 181548 162967
11252 162967 139570 135807 150603 149123 125736 121171 127569 152480 157930 148991 139562 139029 130470
$$ packed form
11343A30772q640L348J644O655j5771K3869J2638R788j8046p573J4731q999k6978
11330A17438q211J7264J5714J2175J1035j6883k6230J428J172M35P205J924J0640
11317A45106j1640M609l471n582j3872l873J1137L629J9514K3930P623j6921q999
11304A51190k652N431J837O826j4718N415J1039k669k4386n866J1304J9733k583
11291A59901k4512k1137O973J9400L4287P15p216q623j6081k0736k4845N279L3590
11278A36995K0245n296L182o449r691K043k113j2195K3453L5939l661k0993J6038
11265A77497j0053j563O222j1878L702O303K879k4489M857K3598N370q97j8581
11252A62967k3397l763J4796j480k3387m565O398K4911N450q939r429n33q559
$$ plain form
11239 130470 145987 151728 154633 149270 149899 153198 142588 130476 138588 142862 143360 167903 168213 174932
11225 174932 161295 151839 159175 155211 147188 139381 141918 145327 140484 101394 116307 153379 175289
11212 175289 178501 202273 184461 162664 178891 193278 197267 189519 176401 174918 175880 174145 183698
11199 183698 185478 184421 178791 168948 170142 154636 160511 182030 185961 171885 160397 136590 122269
11186 122269 134551 151697 175100 176532 174804 160607 157129 165064 176740 174963 188497 176136
11174 176136 157112 144311 151760 154070 149675 132726 126901 139546 145392 144782 129640 120490 147788
11161 147788 162185 162714 146740 163187 182598 195422 188407 182992 173839 179298 177047 180680 159940
11148 159940 132190 134160 142987 149783 152217 174684 180984 170708 158714 142151 164620 164464 160214
$$ packed form
11239A30470J5517N741K905n363O29L299j0610j2112Q112M274M98K4543L10O719
11225A74932j3637r456P336l964q023p807K537L409m843l9090J4913L7072K1910
11212A75289L212K3772j7812k1797J6227J4387L989p748j3118j483R62j735R553
11199A83698J780j057n630r843J194j5506N875K1519L931j4076j1488k3807j4321
11186A22269J2282J7146K3403J432j728j4197l478P935J1676j777J3534j2361
11174A76136j9024j2801P449K310m395j6949n825J2645N846o10j5142r150K7298
11161A47788J4397N29j5974J6447J9411J2824p015n415r153N459k251L633k0740
11148A59940k7750J970Q827O796K434K2467O300j0276j1994j6563K2469j56m250
$$ plain form
11135 160214 187131 190306 198601 179874 165153 185119 183457 195668 211918 207786 194461 175751
11123 175751 183841 190200 218767 215157 197065 172455 178596 210624 213323 231191 209923 203220 213045
11110 213045 196377 190244 184427 179108 178485 177386 175648 194230 202191 191636 186793 181671 159245
11097 159245 132430 154131 163534 185784 200843 175541 155429 136620 149990 169956 182942 183132
11085 183132 182197 183063 181734 172461 180941 186225 201471 204696 189964 196893 194831 166957 154344 159244
11071 159244 163674 174680 171557 174609 182777 212097 212644 207123 201387 199364 200458 197049 207623 199609
11057 199609 173551 166258 201136 200152 186592 197519 195149 188631 199887 192810 191419 175306 163781
11044 163781 184591 192056 197945 202754 202030 192731 206009 227461 216586 206599 202359 185726 206529
$$ packed form
11135A60214K6917L175Q295j8727j4721J9966j662J2211J6250m132j3325j8710
11123A75751Q090O359K8567l610j8092k4610O141L2028K699J7868k1268o703R825
11110B13045j6668o133n817n319o23j099j738J8582P961j0555m843n122k2426
11097A59245k6815K1701R403K2250J5059k5302k0112j8809J3370J9966J2986J90
11085A83132r35Q66j329r273Q480N284J5246L225j4732O929k062k7874j2613M900
11071A59244M430J1006l123L052Q168K9320N47n521n736k023J094l409J0574q014
11057A99609k6058p293L4878r84j3560J0927k370o518J1256p077j391j6113j1525
11044A63781K0810P465N889M809p24r299J3278K1452j0875r987m240j6633K0803
$$ plain form
11031 206529 218650 207156 220795 227514 232740 229732 223203 187112 181237 211391 217175 210744 218795
11018 218795 218679 231296 239724 238584 222877 228459 213362 225132 239768 253626 251288 268705 272078
11005 272078 248474 231784 204700 190060 207334 219315 239870 238368 223796 210387 207455 223070
10993 223070 240603 253358 231099 240967 262837 256615 241458 240721 220174 221614 227292 217609 223194
10980 223194 239133 255131 249110 235838 249854 240002 231609 251968 245422 218856 211044 217761 209526
10967 209526 208101 203720 219985 219107 230544 234853 215725 215132 208368 221599 218937 201804 185398
10954 185398 202669 209802 215762 210389 212609 223246 212842 219377 244440 247489 250540 251775 249818
10941 249818 260151 239362 211774 215675 234004 238065 224928 212933 212573 222080 233416 218007
$$ packed form
11031B06529J2121j1494J3639O719N226l008o529l6091n875L0154N784o431Q051
11018B18795j16J2617Q428j140j5707N582j5097J1770J4636J3858k338J7417L373
11005B72078k3604j6690k7084j4640J7274J1981K0555j502j4572j3409k932J5615
10993B23070J7533J2755k2259R868K1870o222j5157p37k0547J440N678r683N585
10980B23194J5939J5998o021j3272J4016r852q393K0359o546k6566p812O717q235
10967B09526j425m381J6265q78J1437M309j9128n93o764J3231k662j7133j6406
10954A85398J7271P133N960n373K220J0637j0404O535K5063L049L051J235j957
10941B49818J0333k0789k7588L901J8329M061j3137j1995l60R507J1336j5409
$$ plain form
10929 218007 200603 186135 199084 239983 237815 236263 233963 241847 261310 272388 264937 284676
10917 284676 282680 283683 269671 253955 220283 190169 180813 217669 240707 288291 308291 294598
10905 294598 262435 251907 249024 246853 250538 249014 238824 279400 308666 280932 259088 268105
10893 268105 246772 233852 252381 260781 265941 256608 268154 243450 233988 239574 235340 241713 234342
10880 234342 253218 264839 260423 269656 278133 277699 262158 266705 257911 246493 275905 298549 275272
10867 275272 260381 296617 276747 279084 292338 284338 283726 288187 283936 290359 290778 291040 289569 287644
10853 287644 280248 285611 278293 270361 254052 262478 287430 296290 263683 248301 273717 301083 301269
10840 301269 293444 310349 321339 317428 291264 268681 278953 308757 296893 298773 283249 265061
$$ packed form
10929B18007j7404j4468J2949M0899k168j552k300P884J9463J1078p451J9739
10917B84676j996J003j4012j5716l3672l0114r356L6856K3038M7584K0000j3693
10905B94598l2163j0528k883k171L685j524j0190M0576K9266k7734k1844R017
10893B68105k1333j2920J8529Q400N160r333J1546k4704r462N586m234O373p371
10880B34342J8876J1621m416R233Q477m34j5541M547q794j1418K9412K2644k3277
10867B75272j4891L6236j9870K337J3254q000o12M461m251O423M19K62j471j925
10853B87644p396N363p318p932j6309Q426K4952Q860l2607j5382K5416K7366J86
10840C01269p825J6905J0990l911k6164k2583J0272K9804j1864J880j5524j8188
$$ plain form
10828 265061 249061 256807 260037 259691 270400 304112 313138 298576 282338 294417 329182 347407
10816 347407 357926 325551 310452 320739 323370 295760 272949 278414 304772 317475 324359 332578
10804 332578 343952 349325 345908 334681 322083 315755 325576 319531 315823 317425 327232 329712 342656
10791 342656 320496 300081 288499 290203 298492 294931 286241 296180 300835 305798 316645 322842 337928
10778 337928 341169 316405 317553 316135 309771 296545 290671 299898 337395 348979 346824 333371 346473
10765 346473 335172 333538 319280 327084 326971 330675 316025 302118 327958 350568 349024 355089 342717
10752 342717 320756 294090 309703 295989 276283 266953 284479 308196 325497 319519 305787 309080
10740 309080 348134 351545 348522 325073 309442 303836 315042 320309 317571 331663 314460 314802 327634
$$ packed form
10828B65061j6000P746L230l46J0709L3712R026j4562j6238J2079L4765J8225
10816C47407J0519l2375j5099J0287K631k7610k2811N465K6358J2703O884Q219
10804C32578J1374N373l417j1227j2598o328R821o045l708J602R807K480J2944
10791C42656k2160k0415j1582J704Q289l561q690R939M655M963J0847O197J5086
10778C37928L241k4764J148j418o364j3226n874R227L7497J1584k155j3453J3102
10765C46473j1301j634j4258P804j13L704j4650j3907K5840K2610j544O065j2372
10752C42717k1961k6666J5613j3714j9706r330J7526K3717J7301n978j3732L293
10740C09080L9054L411l023k3449j5631n606J1206N267k738J4092j7203L42J2832
$$ plain form
10727 327634 348589 350332 333485 329339 328905 332628 376817 383969 355814 347539 350694 338638 328453
10714 328453 319767 312773 306396 304364 308342 314977 318804 320928 323958 320777 320158 305020 310630 315002
10700 315002 323466 309294 277528 318082 326391 312322 312475 315504 313903 318927 324117 351020 346758
10687 346758 338483 349337 358055 364661 357175 346737 345248 358671 346928 355266 361116 338446 327278
10674 327278 321709 322645 328009 314468 319538 316690 325304 332446 348268 357873 378704 363251 331763
10661 331763 309557 316217 317969 322378 340495 355227 341597 330329 332889 337832 340487 328494 330304
10648 330304 339963 319731 345761 354914 357237 369438 364611 347413 336819 344268 351136 354828 374902
10635 374902 378261 362457 326316 325832 348118 363393 351660 352151 356413 356466 350679 336976 322605
$$ packed form
10727C27634K0955J743j6847m146m34L723M4189P152k8155q275L155j2056j0185
10714C28453q686o994o377k032L978O635L827K124L030l181o19j5138N610M372
10700C15002Q464j4172l1766M0554Q309j4069J53L029j601N024N190K6903m262
10687C46758q275J0854Q718O606p486j0438j489J3423j1743Q338N850k2670j1168
10674C27278n569R36N364j3541N070k848Q614P142J5822R605K0831j5453l1488
10661C31763k2206O660J752M409J8117J4732j3630j1268K560M943K655j1993J810
10648C30304R659k0232K6030R153K323J2201m827j7198j0594P449O868L692K0074
10635C74902L359j5804l6141m84K2286J5275j1733M91M262N3n787j3703j4371
$$ plain form
10622 322605 344669 361141 366701 372804 389145 383473 372875 353950 356077 353255 344900 375537 392732
10609 392732 392470 383112 381083 373430 383642 388604 385098 365775 349735 341825 362601 362590 365082 376975
10595 376975 370968 347607 338211 342471 371830 417297 419395 396493 396203 418113 402020 408140 411623
10582 411623 420446 421743 414351 414230 421514 397915 369704 351266 363331 383724 391509 387568 389638
10569 389638 415077 430109 424061 416789 412054 414682 430664 432147 424483 413257 409383 425017 417875
10556 417875 391790 376362 375741 373305 379831 411066 418398 403081 414215 428855 418006 423141 440422
10543 440422 432671 402067 397548 413235 431724 434094 427890 434789 428926 421570 410484 415630 426903
10530 426903 415796 410116 410229 403116 406016 426037 423854 414726 397137 398771 423249 434822 444355
$$ packed form
10622C22605K2064J6472N560O103J6341n672j0598j8925K127k822q355L0637J7195
10609C92732k62r358k029p653J0212M962l506j9323j6040p910K0776j1K492J1893
10595C76975o007k3361r396M260K9359M5467K098k2902k90K1910j6093O120L483
10582D11623Q823J297p392j21P284k3599k8211j8438J2065K0393P785l941K070
10569C89638K5439J5032o048p272m735K628J5982J483p664j1226l874J5634p142
10556D17875k6085j5428o21k436O526L1235P332j5317J1134J4640j0849N135J7281
10543D40422p751l0604m519J5687J8489K370o204O899n863p356j1086N146J1273
10530D26903j1107n680J13p113K900K0021k183r128j7589J634K4478J1573R533
$$ plain form
10517 444355 451830 465852 482511 492636 508509 536893 532380 506646 505300 502721 506193 510150 527277
10504 527277 549284 543797 544130 572849 595832 611206 636751 665327 647682 661451 666287 652386
10492 652386 637771 632840 653683 695739 696070 696196 699597 705855 719290 741674 771368 814447 850920
10479 850920 887472 966912 1067226 1154296 1296977 1453364 1629940 1808393 1933206 1961757
10469 1961757 1923826 1838892 1698197 1524631 1397461 1337179 1291907 1262195 1278796 1335999 1446269
10458 1446269 1580075 1739838 1953608 2120501 2186495 2124317 1958330 1755281 1559856 1418635
10448 1418635 1329552 1248022 1178588 1137971 1104707 1071361 1035316 975668 933760 925672 916163 888701
10436 888701 890185 906347 894845 874534 870470 893689 902840 873115 867061 853734 827993 810340
$$ packed form
10517D44355P475J4022J6659J0125J5873K8384m513k5734j346k579L472L957J7127
10504E27277K2007n487L33K8719K2983J5374K5545K8576j7645J3769M836j3901
10492F52386j4615m931K0843M2056L31J26L401O258J3435K2384K9694M3079L6473
10479H50920L6552P9440J00314Q7070J42681J56387J76576J78453J24813K8551
10469A961757l7931q4934j40695j73566j27170o0282m5272k9712J6601N7203J10270
10458A446269J33806J59763K13770J66893O5994o2178j65987k03049j95425j41221
10448A418635q9083q1530o9434m0617l3264l3346l6045n9648m1908q088r509k7462
10436H88701J484J6162j1502k0311m064K3219R151k9725o054j3327k5741j7653
$$ plain form
10424 810340 798676 794049 778608 775947 776071 788071 788621 767782 774084 782104 774589 761007 749710
10411 749710 743521 754400 751854 762466 757973 754214 746680 757048 753491 739265 713703 719333 714560
10398 714560 724017 721665 715025 718864 745815 765978 764765 773922 817383 864280 918108 945358 984954
10385 984954 1059477 1146568 1217926 1285258 1322430 1326435 1334122 1344975 1346363 1324028 1282084 1211206
10373 1211206 1147167 1073106 1018238 981815 948958 940230 935877 926146 926058 924178 926231 961273 1026018
10360 1026018 1067289 1094845 1138011 1198381 1209007 1158727 1118473 1086782 1043418 1000707 963991
10349 963991 967630 980882 1003742 1015108 1020363 1016610 1040227 1112553 1188451 1239578 1280340 1325567
10337 1325567 1367890 1376558 1364630 1321918 1270323 1214062 1208851 1212794 1224639 1273115 1314808 1359817
$$ packed form
10424H10340j1664m627j5441k661J24J2000N50k0839O302Q020p515j3582j1297
10411G49710o189J0879k546J0612m493l759p534J0368l557j4226k5562N630m773
10398G14560R457k352o640L839K6951K0163j213R157M3461M6897N3828K7250L9596
10385I84954P4523Q7091P1358O7332L7172M005P687J0853J388k2335m1944p0878
10373A211206o4039p4061n4868l6423l2857q728m353r731q8j880K053L5042O4745
10360A026018M1271K7556M3166O0370J0626n0280m0254l1691m3364m2711l6716
10349I63991L639J3252K2860J1366N255l753K3617P2326P5898N1127M0762M5227
10337A325567M2323Q668j1928m2712n1595n6261n211L943J1845M8476M1693M5009
$$ plain form
10325 1359817 1372254 1354944 1343311 1287389 1224574 1157952 1101002 1071637 1064298 1057656 1011686 977872
10313 977872 956799 976763 983501 955216 995895 1053907 1113284 1167175 1211364 1207992 1197468 1146888
10301 1146888 1081747 1048778 1029710 996759 966512 936844 898335 879600 850430 793200 760014
10290 760014 728102 715655 716369 733610 729785 707321 679346 673404 688616 708179 714977 720562 703514
10277 703514 702289 707265 692970 696245 698611 699032 674321 687681 706292 717490 700456 698858 721421
10264 721421 731504 744115 738299 722802 723801 751293 759419 800803 809518 800763 801038 813662 836287
10251 836287 835577 834418 838592 833343 838185 871591 893299 924850 941209 925434 906609 907072 930508
10238 930508 972026 1007121 1029080 1045536 1034671 1037042 1038204 1030634 1043323 1046316 1055725 1073933
$$ packed form
10325A359817J2437j7310j1633n5922o2815o6622n6950k9365p339o642m5970l3814
10313I77872k1073J9964O738k8285M0679N8012N9377N3891M4189l372j0524n0580
10301A146888o5141l2969j9068l2951l0247k9668l8509j8735k9170n7230l3186
10290G60014l1912j2447P14J7241l825k2464k7975n942J5212J9563O798N585j7048
10277G03514j225M976j4295L275K366M21k4711J3360J8611J1198j7034j598K2563
10264G21421J0083J2611n816j5497R99K7492Q126M1384Q715q755K75J2624K2625
10251H36287p10j159M174n249M842L3406K1708L1551J6359j5775j8825M63K3436
10238I30508M1518L5095K1959J6456j0865K371J162p570J2689K993R409J8208
$$ plain form
10226 1073933 1076979 1081476 1108097 1088453 1065520 1073742 1066449 1080145 1094839 1109044 1104724 1123189
10214 1123189 1132874 1143160 1158760 1168829 1184560 1198165 1206933 1222690 1211840 1233443 1242190 1242470
10202 1242470 1235391 1223632 1199335 1189580 1191856 1214460 1222266 1232580 1218239 1239995 1304392 1347933
10190 1347933 1390409 1400207 1415504 1424969 1424872 1461309 1496355 1491644 1500330 1515359 1527843 1551371 1601598
10177 1601598 1652898 1691980 1705298 1739915 1792339 1869160 1940161 1982265 2033247 2075754 2115243
10166 2115243 2169981 2218932 2286425 2378538 2448634 2496530 2581642 2644546 2716305 2807530 2888173
10155 2888173 2959005 3053672 3148609 3230817 3325473 3442230 3541884 3646817 3761647 3872382
10145 3872382 4006071 4140213 4269320 4402176 4519953 4632631 4761244 4894465 5058143
$$ packed form
10226A073933L046M497K6621j9644k2933Q222p293J3696J4694J4205m320J8465
10214A123189R685J0286J5600J0069J5731J3605Q768J5757j0850K1603Q747K80
10202A242470p079j1759k4297r755K276K2604P806J0314j4341K1756O4397M3541
10190A347933M2476R798J5297R465r7L6437L5046m711Q686J5029J2484K3528N0227
10177A601598N1300L9082J3318L4617N2424P6821P1001M2104N0982M2507L9489
10166B115243N4738M8951O7493R2113P0096M7896Q5112O2904P1759R1225Q0643
10155B888173P0832R4667R4937Q2208R4656J16757R9654J04933J14830J10735
10145C872382J33689J34142J29107J32856J17777J12678J28613J33221J63678
$$ plain form
10136 5058143 5246477 5422770 5609292 5811204 6015139 6226887 6474613 6726694 6975635
10127 6975635 7261627 7605625 7938941 8264355 8577722 8915348 9309864 9736743 10218819
10118 10218819 10742055 11316862 11995518 12716387 13520582 14423068 15400742 16466976 17629521
10109 17629521 18852998 20135662 21478012 22834363 24205741 25572853 26897589 28244763
10101 28244763 29667070 31228002 32958406 34852120 36794990 38618130 40129091 41191773
10093 41191773 41855255 42219072 42434285 42603779 42870988 43338729 44082936 45201697 46701083
10084 46701083 48633547 51083050 54174399 58135047 63254182 69884381 78428947 89277284
10076 89277284 102944370 120181076 141903393 168746038 200039444 232611888 260531481
$$ packed form
10136E058143J88334J76293J86522K01912K03935K11748K47726K52081K48941
10127F975635K85992L43998L33316L25414L13367L37626L94516M26879M82076
10118A0218819N23236N74807O78656P20869Q04195R02486R77674J066234J162545
10109A7629521J223477J282664J342350J356351J371378J367112J324736J347174
10101B8244763J422307J560932J730404J893714J942870J823140J510961J062682
10093D1191773O63482L63817K15213J69494K67209M67741P44207J118761J499386
10084D6701083J932464K449503L091349L960648N119135O630199Q544566J0848337
10076H9277284J3667086J7236706K1722317K6842645L1293406L2572444K7919593
$$ plain form
10069 260531481 276878899 277067713 261360116 234816556 204674577 177004893 154953860
10062 154953860 138930537 128126417 121590546 118557734 118769036 122254193 129335858 140772852
10054 140772852 157852265 182019179 213813871 251062899 286882854 309895444 310192610
10047 310192610 287418380 251537340 214783662 184127978 160803084 143377468 130151066
10040 130151066 119829133 111537865 104693187 98947734 94005081 89729786 86095929 83055369
10032 83055369 80466313 78125629 75905020 73712014 71487060 69210596 66963575 64831175
10024 64831175 62836711 61041561 59338889 57549243 55648310 53700551 51733114 49859236
10016 49859236 48133826 46587769 45252080 44139477 43172851 42176201 40931632 39384386
$$ packed form
10069B60531481J6347418J88814j5707597k6543560l0141979k7669684k2051033
10062A54953860j6023323j0804120o535871l032812K11302L485157P081665J1436994
10054A40772852J7079413K4166914L1794692L7249028L5819955K3012590K97166
10047C10192610k2774230l5881040l6753678l0655684k3324894j7425616j3226402
10040A30151066j0321933q291268o844678n745453m942653m275295l633857l040560
10032H3055369k589056k340684k220609k193006k224954k276464k247021k132400
10024F4831175j994464j795150j702672j789646j900933j947759j967437j873878
10016D9859236j725410j546057j335689j112603r66626r96650j244569j547246
$$ plain form
10008 39384386 37588989 35676646 33795960 31991443 30252917 28616331 27115993 25713789
10000 25713789 24338606 23044562 21841970 20691560 19558758 18494775 17498207 16599649
9992 16599649 15784150 15003011 14251667 13556686 12883018 12262803 11679086 11080445 10515955
9983 10515955 9988348 9504748 9067721 8632911 8210161 7808840 7416707 7036589 6683805
9974 6683805 6366724 6076845 5806213 5533413 5260323 5035398 4808793 4585250 4383364 4191652
9964 4191652 4004016 3827386 3669921 3539748 3396193 3240040 3097367 2965583 2859182 2755702
9954 2755702 2658174 2561026 2488997 2407429 2365881 2314857 2274008 2230400 2155378 2044626 1912431
9943 1912431 1738067 1569812 1472400 1413438 1350344 1302976 1291539 1258639 1227429 1201381 1198902
$$ packed form
10008C9384386j795397j912343j880686j804517j738526j636586j500338j402204
10000B5713789j375183j294044j202592j150410j132802j063983r96568q98558
9992A6599649q15499p81139p51344o94981o73668o20215n83717n98641n64490
9983A0515955n27607m83600m37027m34810m22750m01321l92133l80118l52784
9974F683805l17081k89879k70632k72800k73090k24925k26605k23543k01886j91712
9964D191652j87636j76630j57465j30173j43555j56153j42673j31784j06401j03480
9954B755702r7528r7148p2029q1568m1548n1024m0849m3608p5022j10752j32195
9943A912431j74364j68255r7412n8962o3094m7368j1437l2900l1210k6048k479
$$ plain form
9932 1198902 1192702 1171451 1154591 1169640 1198288 1222270 1232156 1194540 1076183 901821 768781
9921 768781 710591 726588 783862 800272 790660 772128 746228 730438 708658 713975 723950 711129
9909 711129 724791 743524 786888 819485 810268 807110 822877 839839 876332 914521 947159 960730
9897 960730 983139 997948 985140 972556 967581 978635 978363 1016037 1053668 1061606 1084422 1100554
9885 1100554 1133226 1147790 1152371 1171515 1201481 1204331 1183805 1177461 1189829 1197061 1192289 1203046
9873 1203046 1176039 1156363 1140735 1145852 1149243 1159364 1178695 1164807 1131492 1085567 1042992 1005657
9861 1005657 1012688 1019874 1030131 1023682 1007646 981433 950946 932991 920460 904883 876044 826895
9849 826895 823755 821651 797591 788588 793691 772052 745606 728924 697491 685170 706009 666186
$$ packed form
9932A198902o200k1251j6860J5049K8648K3982R886l7616j18357j74362j33040
9921G68781n8190J5997N7274J6410r612j8532k5900j5790k1780N317R975j2821
9909G11129J3662J8733M3364L2597r217l158J5767J6962L6493L8189L2638J3571
9897I60730K2409J4809j2808j2584m975J1054k72L7674L7631P938K2816J6132
9885A100554L2672J4564M581J9144K9966K850k0526o344J2368P232m772J0757
9873A203046k7007j9676j5628N117L391J0121J9331j3888l3315m5925m2575l7335
9861A005657P031P186J0257o449j6036k6213l0487j7955j2531j5577k8839m9149
9849H26895l140k104k4060r003N103k1639k6446j6682l1433j2321K0839l9823
$$ plain form
9837 666186 635416 631726 622637 611452 600210 585758 561196 528793 482963 458270 447879 422780
9825 422780 407314 417527 414141 405513 417122 411323 420386 438403 456469 477920 460808 426602
9813 426602 404449 378420 349713 297533 256696 241480 237609 227060 216365 220123 219356 213017 209203
9800 209203 195942 182547 193921 216177 212348 201781 150091 106601 76655 59644 27870 3403
9788 3403 -2208 -16455 -54887 -89656 -86343 -72876 -89873 -107485 -91953 -45060 -28566 -34950 -34504
9775 -34504 -39539 -42128 -69204 -101646 -96121 -91664 -123335 -147674 -192972 -244789 -273064 -306134 -348886
9762 -348886 -375033 -369998 -352112 -331079 -274671 -197094 -140029 -108208 -95631 -83634 -60865 -77940
9750 -77940 -78223 -62377 -61075 -54458 -96265 -171849 -252792 -302634 -340788 -358491 -346863 -319700 -259492
$$ packed form
9837F66186l0770l690r089j1185j1242j4452k4562l2403m5830k4693j0391k5099
9825D22780j5466J0213l386q628J1609n799R063J8017J8066K1451j7112l4206
9813D26602k2153k6029k8707n2180m0837j5216l871j0549j0695L758p67o339l814
9800B09203j3261j3395J1374K2256l829j0567n1690m3490k9946j7011l1774k4467
9788C403n611j4247l8432l4769L313J3467j6997j7612J5532M6893J6494o384M46
9775c4504n035k589k7076l2442N525M457l1671k4339m5298n1817k8275l3070m2752
9762c48886k6147N035J7886K1033N6408P7577N7065L1821J2577J1997K2769j7075
9750g7940k83J5846J302O617m1807p5584q0943m9842l8154j7703J1628K7163O0208
$$ plain form
9737 -259492 -189258 -134614 -93083 -60738 -26312 -8585 -15627 -23599 -12196 14611 24001 -4004
9725 -4004 15853 29727 34794 46299 37265 53119 52957 35339 34153 58748 87998 108092 121481
9712 121481 99373 86748 71873 99255 137727 151319 132599 126442 115737 103121 126453 140052
9700 140052 156916 166067 163366 164810 175096 173524 181732 201505 220446 222482 235192 237436 240388
9687 240388 240291 233198 208181 188281 178651 172809 160095 168594 183682 202160 220484 239000 238154
9674 238154 247510 294215 318144 340014 387199 445346 520325 638677 806401 973464 1130358
9663 1130358 1304959 1432743 1450812 1374457 1242644 1059823 884152 750940 634228 567654
9653 567654 511925 458367 419157 425373 433675 452301 457841 464130 515052 562814 673175 780785
$$ packed form
9737b59492P0234N4644M1531L2345L4426J7727p042p972J1403K6807R390k8005
9725d004J9857J3874N067J1505r034J5854j62j7618j186K4595K9250K0094J3389
9712A21481k2108j2625j4875K7382L8472J3592j8720o157j0705j2616K3332J3599
9700A40052J6864R151k701J444J0286j572Q208J9773J8941K036J2710K244K952
9687B40388r7p093k5017j9900r630n842j2714Q499J5088J8478J8324J8516q46
9674B38154R356M6705K3929K1870M7185N8147P4979J18352J67724J67063J56894
9663A130358J74601J27784J8069p6355j31813j82821j75671j33212j16712o6574
9653E67654n5729n3558l9210O216Q302J8626N540O289N0922M7762J10361J07610
$$ plain form
9641 780785 936045 1127761 1335119 1506909 1569510 1481252 1300451 1109309 932995 798660
9631 798660 705663 646422 580335 541131 500862 456025 426651 392202 362679 353744 336738 334387
9619 334387 330979 329621 337494 324900 299188 281325 272214 263985 263992 267839 269811 254264 240609 236855
9605 236855 239043 233211 244854 275705 249059 226819 227638 218486 167719 156626 160413 180651 169412
9592 169412 153022 144522 127475 114177 111506 94463 90636 90744 91770 84421 76402 75989 82147 81615
9578 81615 77454 87390 88682 101761 91409 77517 85978 74580 84106 101912 95864 75070 54395
9565 54395 40079 18005 16091 3445 14663 19553 21979 -10718 -16310 -10531 -11951 -17707 9223
9552 9223 5547 -22122 -31546 -30612 -4895 3076 5891 8282 -9933 -44127 -51286 -55379 -69535 -92495
$$ packed form
9641G80785J55260J91716K07358J71790O2601q8258j80801j91142j76314j34335
9631G98660r2997n9241o6087l9204m0269m4837k9374l4449k9523q935j7006k351
9619C34387l408j358P873j2594k5712j7863r111q229PL847J972j5547j3655l754
9605B36855K188n832J1643L0851k6646k2240Q19r152n0767j1093L787K0238j1239
9592A69412j6390q500j7047j3298k671j7043l827J08J026p349q019m13O158n32
9578H1615m161R936J292J3079j0352j3892Q461j1398R526J7806o048k0794k0675
9565E4395j4316k2074j914j2646J1218M890K426l2697n592N779j420n756K6930
9552I223l676k7669r424R34K5717P971K815K391j8215l4194p159m093j4156k2960
$$ plain form
9538 -92495 -100893 -93844 -87219 -72982 -80238 -76618 -71479 -60355 -64325 -56382 -51978 -75016 -71734 -71382
9524 -71382 -102547 -124084 -114702 -104975 -87924 -70898 -81322 -90168 -82114 -87863 -72237 -73792 -94507
9511 -94507 -115590 -136657 -112931 -102840 -106999 -124670 -104270 -77643 -102066 -113896 -119328 -124139
9499 -124139 -112686 -131154 -119718 -83487 -69839 -54375 -64257 -73425 -74898 -64562 -61542 -61050 -63018
9486 -63018 -55495 -38246 -39202 -50680 -56636 -62278 -52651 -36339 -11491 -6161 -22597 -29053 -53155
9473 -53155 -27369 -4388 14712 -22503 -63237 -73322 -44398 -38993 -22595 -15830 -18668 -12750 -9521
9460 -9521 -15616 -19543 -44406 -32566 -31046 -29123 -50524 -64563 -36296 -21096 -31007 -39428 -33916
9447 -33916 -20161 -3895 17419 2458 5169 6345 264 -17215 -28280 -34503 -43315 -45891 -42916
$$ packed form
9538i2495q398P049O625J4237p256L620N139J1124l970P943M404k3038L282L52
9524g1382l1165k1537R382R727J7051J7026j0424q846Q054n749J5626j555k0715
9511i4507k1083k1067K3726J0091m159j7671K0400K6627k4423j1830n432m811
9499a24139J1453j8468J1436L6231J3648J5464r882r168j473J0336L020M92j968
9486f3018P523J7249r56j1478n956n642R627J6312K4848N330j6436o456k4102
9473e3155K5786K2981J9100l7215m0734j0085K8924N405J6398O765k838N918L229
9460i521o095l927k4863J1840J520J923k1401j4039K8267J5200r911q421N512
9447c3916J3755J6266K1314j4961K711J176o081j7479j1065o223q812k576K975
$$ plain form
9434 -42916 -25225 -32264 -48385 -31598 -33093 -38006 -40489 -37203 -25314 -20398 -22151 -26451 -44885
9421 -44885 -35781 -40424 -36157 -60907 -66472 -74450 -67506 -53659 -46451 -54510 -66683 -62945 -60121 -66001
9407 -66001 -75627 -73195 -80975 -98338 -96027 -101198 -108598 -83297 -72558 -76826 -78451 -75047 -77186 -88502
9393 -88502 -91262 -81449 -67150 -65516 -41863 -22255 -37742 -35895 -37176 -46768 -47357 -28819 -26409 -28695
9379 -28695 -40530 -70138 -65654 -33297 -14076 -12863 -39571 -68341 -75839 -68891 -76672 -74168 -71492
9366 -71492 -60926 -65075 -78294 -78505 -73105 -75299 -80069 -103956 -96478 -102322 -125774 -106468 -78890
9353 -78890 -62058 -58766 -46888 -50120 -42395 -51697 -40307 -54805 -42463 -29280 -41147 -40141 -12569
9340 -12569 9877 2545 -2003 2784 551 536 7845 14347 5102 -21875 -58032 -46901 -43969 -50223
$$ packed form
9434d2916J7691p039j6121J6787j495m913k483L286J1889M916j753m300j8434
9421d4885R104m643M267k4750n565p978O944J3847P208q059j2173L738K824n880
9407f6001r626K432p780j7363K311n171p400K5301J0739m268j625L404k139j1316
9393h8502k760R813J4299J634K3653J9608j5487J847j281r592n89J8538K410k286
9379b8695j1835k9608M484L2357J9221J213k6708k8770p498O948p781K504K676
9366g1492J0566m149j3219k11N400k194m770k3887P478n844k3452J9306K7578
9353g8890J6832L292J1878l232P725r302J1390j4498J2342J3183j1867J006K7572
9340a2569K2446p332m548M787k233j5P309O502r245k6977l6157J1131K932o254
$$ plain form
9326 -50223 -69229 -63794 -69767 -82585 -47524 -28381 -19020 -28319 -31978 -35793 -53814 -87582 -97067
9313 -97067 -58055 -32766 -28743 -10668 -16378 -9999 -24512 -22020 -16313 -13582 -7423 -24124 -47158
9300 -47158 -55006 -54951 -63328 -54558 -61824 -71444 -48598 -26331 -24887 -45535 -28310 2666 5910 -14240
9286 -14240 -24245 -15180 -31722 -44185 -48810 -56887 -43641 -46248 -37868 -38243 -42882 -53861 -69878
9273 -69878 -71245 -58885 -39330 -29620 -32649 -42145 -45130 -46331 -31356 -26116 -28511 -34738 -35118 -12106
9259 -12106 -10176 -28826 -30685 -35423 -45051 -49451 -39659 -39788 -67263 -74982 -64279 -76029 -64430 -53595
9245 -53595 -47062 -61434 -54270 -45440 -51037 -60390 -57384 -41969 -26622 -15329 -32276 -52131 -54696
9232 -54696 -54639 -54612 -56471 -41788 -30406 -7124 -8036 -11071 -43520 -60497 -46910 -24654 -19137 -20905
$$ packed form
9326e0223j9006N435n973j2818L5061J9143R361r299l659l815j8021l3768r485
9313i7067L9012K5289M023J8075n710O379j4513K492N707K731O159j6701k3034
9300d7158p848N5q377Q770p266r620K2846K2267J444k0648J7225L0976L244k0150
9286a4240j0005R065j6542j2463m625q077J3246k607Q380l75m639j0979j6017
9273f9878j367J2360J9555R710l029r496k985j201J4975N240k395o227l80K3012
9259a2106J930j8650j859m738r628m400R792j29k7475p719J0703j1750J1599J0835
9245e3595O533j4372P164Q830n597r353L006J5415J5347J1293j6947j9855k565
9232e4696N7K7j859J4683J1382K3282r12l035l2449j6977J3587K2256N517j768
$$ plain form
9218 -20905 -27481 -24031 -1489 -4600 -40457 -63625 -73608 -72300 -45702 -54117 -45200 -42724 -33993 -18213
9204 -18213 -17148 -3994 -29446 -30577 -22150 -18296 -17646 856 879 -33768 -26031 -21244 -11129 5037
9190 5037 6275 -4660 -16764 -5313 8346 14704 29453 25324 1962 -19345 -29533 -28416 -9546
9177 -9546 9360 6158 11793 12951 13783 12002 -13650 -28325 -21573 -4208 16591 13301 -7592 -25322
9163 -25322 -28890 -32765 -40175 -35416 -6945 -12850 -38977 -24222 -14625 -35940 -48502 -50507 -60814
9150 -60814 -39769 -41292 -55359 -51693 -31810 -17152 -42028 -55540 -70551 -70553 -87818 -66260 -68611
9137 -68611 -86544 -84678 -44953 -25122 -30815 -25275 -937 -4627 -9099 -5659 -14908 1008 1901 -4813
9123 -4813 -32913 -34750 -35350 -10662 -3047 -1866 2784 12275 -10032 -16525 -11579 -43436 -43554 -38672
$$ packed form
9218b0905o576L450K2542l111l5857k3168r983J308K6598q415Q917K476Q731J5780
9204a8213J065J3154k5452j131Q427L854O50J8502K3l4647P737M787J0115J6166
9190E037J238j0935j2104J1451J3659O358J4749m129k3362k1307j0188J117J8870
9177i546J8906l202N635J158Q32j781k5652j4675O752J7365K0799l290k0893j7730
9163b5322l568l875p410M759K8471n905k6127J4755R597k1315j2562k005j0307
9150f0814K1045j523j4067L666J9883J4658k4876j3512j5011kj7265K1558k351
9137f8611j7933J866L9725J9831n693N540K4338l690m472L440r249J5916Q93o714
9123d813k8100j837o00K4688P615J181M650R491k2307o493M946l1857j18M882
$$ plain form
9109 -38672 -48474 -41843 -17970 -28637 -51058 -64416 -69492 -57276 -46239 -51248 -47860 -36582 -37594
9096 -37594 -35020 -43312 -38227 -26957 -26983 -24699 -14245 -16344 -52154 -76041 -83862 -88228 -31870 2228
9082 2228 1598 -27785 -23968 -7194 19055 12414 -8881 5289 23387 15999 7431 20995 52911
9069 52911 47163 2919 11442 20589 -10975 -44381 -51202 -37738 -61908 -72206 -47495 -30395 -43041
9056 -43041 -67876 -52032 -35406 -54143 -42003 -27607 -22418 -52953 -56541 -66131 -53253 -36077
9044 -36077 -40967 -57253 -60649 -52295 -38222 -36245 -54261 -63320 -62759 -55034 -66061 -72952 -67504 -25637
9030 -25637 -26489 -31598 -27162 -24912 -24748 -23876 -32545 -28075 -29193 -42845 -80592 -96099 -89162 -55803
9016 -55803 -26680 -23892 -31050 -31550 -19427 -23872 -15108 -3605 -6922 158 7778 -32999 -66281 -79214
$$ packed form
9109c8672r802O631K3873j0667k2421j3358n076J2216J1037n009L388J1278j012
9096c7594K574q292N085J1270k6K284J0454k099l5810k3887p821m366N6358L4098
9082B228o30k9383L817J6774K6249o641k1295J4170J8098p388q568J3564L1916
9069E2911n748m4244Q523R147l1564l3406o821J3464k4170j0298K4711J7100j2646
9056d3041k4835J5844J6626j8737J2140J4396N189l0535l588r590J2878J7176
9044c6077m890j6286l396Q354J4073J977j8016r059N61P725j1027o891N448M1867
9030b5637q52n109M436K250J64Q72q669M470j118j3652l7747j5507O937L3359
9016e5803K9123K788p158n00J2123m445Q764J1503l317P080P620m0777l3282j2933
$$ plain form
9002 -79214 -78303 -78414 -71349 -77772 -87240 -60768 -61764 -44517 -33024 -41232 -38552 -27805 -32499 -27286
8988 -27286 -57331 -59366 -68611 -46611 -47791 -28191 -25446 -47650 -38547 -35796 -23198 -28501 -5381
8975 -5381 -2438 -11719 -14992 -12070 -18428 -22101 -5961 -17462 -21956 -22971 -14918 -14425 -27344 -50153
8961 -50153 -69636 -67824 -65496 -65269 -60442 -65472 -83493 -82698 -70912 -55789 -27378 -10575 -30795
8948 -30795 -58323 -58030 -22096 9595 15727 -2766 -14357 -18428 -6620 -12573 -25330 -17701 -35532
8935 -35532 -30641 -37641 -28818 -10657 -13441 -23368 -20603 -26858 -10818 -27771 -24249 6031 4496 -5885
8921 -5885 -15322 -11514 -21375 -19142 -16640 -27050 -23521 -32897 -29625 -14205 -15314 -22554 -26801 -37332
8907 -37332 -27697 -8680 16209 24752 6084 10345 -3093 -3717 6507 2460 -4704 -34248 -68396
$$ packed form
9002g9214R11j11P065o423r468K6472r96J7247J1493q208K680J0747m694N213
8988b7286l0045k035r245K2000j180J9600K745k2204R103K751J2598n303K3120
8975e381K943r281l273K922o358l673J6140j1501m494j015Q053M93j2919k2809
8961e0153j9483J812K328K27M827n030j8021P95J1786J5123K8411J6803k0220
8948c0795k7528K93L5934L1691O132j8493j1591m071J1808n953j2757P629j7831
8935c5532M891p000Q823J8161k784r927K765o255J6040j6953L522L0280j535j0381
8921e885r437L808r861K233K502j0410L529r376L272J5420j109p240m247j0531
8907c7332R635J9017K4889Q543j8668M261j3438o24J0224m047p164k9544l4148
$$ plain form
8894 -68396 -68698 -55802 -39157 -42208 -52658 -31236 -4473 12046 20952 15463 -5405 -30596 -43376
8881 -43376 -30688 -35493 -47123 -53866 -44552 -33194 -34706 -26722 1171 2162 -22693 -19737 -12291 931
8867 931 -7255 -21629 -16330 1818 3709 -4391 13503 19015 11663 16375 6538 -2207 -6521 -16034
8853 -16034 -19618 -14670 -24227 -40096 -46501 -14898 23402 40191 50852 64256 81277 82631 65867
8840 65867 18253 -13258 -8372 -23115 -44055 -47023 -36125 -25338 -4087 68 -7574 -24092 -32917
8827 -32917 -51031 -28306 -7323 -26602 -31515 -18132 -21568 -26109 -40571 -53877 -37100 -23585
8815 -23585 -4916 -6961 -8491 -26371 -33954 -11975 -10461 -20296 -13697 -8419 9565 29243 16243
8802 16243 -10401 -30137 -29023 -10147 -9906 4067 23337 20219 34948 45689 46233 33107 26335
$$ packed form
8894f8396l02J2896J6645l051j0450K1422K6763J6519Q906n489k0868k5191j2780
8881d3376J2688m805j1630o743R314J1358j512P984K7893R91k4855K956P446J3222
8867I31q186j4374N299J8148J891q100J7894N512p352M712r837q745m314r513
8853a6034l584M948r557j5869o405L1603L8300J6789J0661J3404J7021J354j6764
8840F5867m7614l1511M886j4743k0940k968J0898J0787K1251M155p642j6518q825
8827c2917j8114K2725K0983j9279m913J3383l436m541j4462j3306J6777J3515
8815b3585J8669k045j530j7880p583K1979J514r835O599N278J7984J9678j3000
8802A6243k6644j9736J114J8876K41J3973J9270l118J4729J0741N44j3126o772
$$ plain form
8789 26335 6666 -517 -340 8317 -4366 -20144 -18139 -7642 -16011 -13689 -18569 -10862 -660 -11573
8775 -11573 -20181 -27344 -25703 -24595 -18142 -15829 -25529 -21504 -8742 -20882 -30939 -27212 -12554 -2038
8761 -2038 3475 -3024 -16501 -25649 -33121 -39278 -26849 -1029 -5579 -10 5259 -7490 9334 4334
8747 4334 -3171 -14815 1244 -21147 -61205 -84000 -91876 -79535 -49341 -21313 -20490 -38590 -35574
8734 -35574 -25741 -29739 -37735 -32686 -9558 -12409 -25785 -13545 -39120 -30185 -25358 -21348 8072
8721 8072 11458 -8807 -8048 -15231 -19218 -10432 -4393 -12253 -27887 -28918 -36401 -34735 -29483 -39219 -30454
8706 -30454 -28655 -6890 9766 17948 6273 -14126 -15774 -6008 -22104 -36236 -19992 17203 31628
8693 31628 10803 11309 -5773 -4272 10156 24308 9363 -8340 -11414 -3099 5625 -11573 -21128
$$ packed form
8789B6335j9669p183J77Q657j2683j5778K005J0497q369K322m880P707J0202j0913
8775a1573q608p163J641J108O453K313r700M025J2762j2140j0057L727J4658J0516
8761b038N513o499j3477r148p472o157J2429K5820m550N569N269j2749J6824n000
8747D334p505j1644J6059k2391m0058k2795p876J2341L0194K8028Q23j8100L016
8734c5574R833l998p996N049K3128k851j3376J2240k5575Q935M827M010K9420
8721H072L386k0265P59p183l987Q786O039p860j5634j031p483J666N252r736Q765
8706c0454J799K1765J6656Q182j1675k0399j648R766j6096j4132J6244L7195J4425
8693C1628k0825N06j7082J501J4428J4152j4945j7703l074Q315Q724j7198r555
$$ plain form
8680 -21128 -18355 -4363 5431 6769 -3610 -11042 -9548 -628 -2411 -3593 5312 3869 -7300 -31306
8666 -31306 -59568 -78192 -77007 -62017 -40875 -32313 -24274 -51390 -48507 -25611 -16404 -21502 -23446
8653 -23446 -17122 -52126 -71386 -59803 -31252 4779 8463 -14947 -37684 -45779 -35928 -22878 7258
8640 7258 -2506 -21801 -11269 -17716 -28890 -49343 -47652 -44308 -12913 -520 6610 13745 11741
8627 11741 15337 9920 -752 -13037 -26876 -27523 -20901 -25923 -27899 -7138 20420 18852 -17052
8614 -17052 -39079 -39244 -27823 -12813 -3136 17608 28132 32889 7313 -10117 -16862 -29127 -30643
8601 -30643 -13995 -10105 -16300 -44958 -29977 12152 36832 57883 46557 27945 39495 59469
8589 59469 65807 51154 54456 56306 35732 1350 9214 43539 39117 15036 18535 26446 14572
$$ packed form
8680b1128K773J3992R794J338j0379p432J494Q920j783j182Q905j443j1169k4006
8666c1306k8262j8624J185J4990K1142Q562Q039k7116K883K2896R207n098j944
8653b3446O324l5004j9260J1583K8551L6031L684k3410k2737q095R851J3050L0136
8640G258r764j9295J0532o447j1174k0453J691L344L1395J2393P130P135k004
8627A1741L596n417j0672j2285j3839o47O622n022j976K0761K7558j568l5904
8614a7052k2027j65J1421J5010R677K0744J0524M757k5576j7430o745j2265j516
8601c0643J6648L890o195k8658J4981M2129K4680K1051j1326j8612J1550J9974
8589E9469O338j4653L302J850k0574l4382P864L4325m422k4081L499P911j1874
$$ plain form
8576 14572 14590 33124 43813 36498 31269 17468 9885 -15605 -49674 -33676 -15101 -7621 -1437
8563 -1437 -9994 -105 27255 32485 35955 31449 25839 28477 9424 14854 16937 -8211 -30281 -30086
8549 -30086 -6946 8689 8273 2303 3906 4521 24327 40236 33149 42844 59822 20163 -4573
8536 -4573 -13300 4166 17825 21744 30750 -2175 10883 31132 22184 19465 42691 38028 25234
8523 25234 -5544 -10892 1673 1556 -8555 8098 7940 12671 9288 -13408 -11639 -6129 -11223 -28474
8509 -28474 -14725 -1288 9475 15054 11481 -16032 -8315 3148 -5261 -2696 -1642 -23857 -18396
8496 -18396 12516 20181 3502 -2315 -669 -12801 -24225 -10748 4969 11262 10109 8571 -2792
8483 -2792 -21414 -9679 -8785 1661 -4000 6522 21380 5766 -6727 -11056 -25481 -33204 -18343
$$ packed form
8576A4572J8J8534J0689p315n229j3801p583k5490l4069J5998J8575P480O184
8563a437q557R889K7360N230L470m506n610K638j9053N430K083k5148k2070J95
8549c0086K3140J5635m16n970J603O15J9806J5909p087R695J6978l9659k4736
8536d573q727J7466J3659L919R006l2925J3058K0249q948k719K3226m663j2794
8523B5234l0778n348J2565j17j0111J6653j58M731l383k2696J769N510n094j7251
8509b8474J3749J3437J0763N579l573k7513P717J1463q409K565J054k2215N461
8496a8396L0912P665j6679n817J646j2132j1424J3477J5717O293j153j538j1363
8483b792j8622J1735Q94J0446n661J0522J4858j5614j2493m329j4425p723J4861
$$ plain form
8470 -18343 694 -17779 -20417 -20771 4092 20599 6688 4555 -4970 -6509 -2061 -2292 -3412 1315
8456 1315 33917 19229 -10924 -1519 -5453 -14484 2755 11901 26415 32629 44708 35393 10946
8443 10946 -10215 -27283 3351 25431 17491 10914 20845 27609 50226 38143 40973 50672 71362
8430 71362 81176 76519 72167 77108 81524 94548 78790 85367 104204 113693 111813 104974 90754 88013
8416 88013 88306 75637 68462 88353 110261 80448 68855 69933 67397 48037 41581 70946 83921
8403 83921 89508 88185 84161 75441 69437 84255 73487 61744 65135 90713 91223 100038 84852 98998
8389 98998 70186 74684 107181 125962 132542 138453 151306 167751 189852 197971 195038 194738 189974
8376 189974 161829 148995 126904 118539 118253 143306 148693 129175 114112 118399 131242 138222 115911
$$ packed form
8470a8343J9037j8473k638l54K4863J6507j3911k133r525j539M448k31j120M727
8456A315L2602j4688l0153R405l934r031J7239R146J4514O214J2079r315k4447
8443A0946k1161j7068L0634K2080p940o577R931O764K2617j2083K830R699K0690
8430G1362R814m657m352M941M416J3024j5758O577J8837R489j880o839j4220k741
8416H8013K93j2669p175J9891K1908k9813j1593J078k536j9360o456K9365J2975
8403H3921N587j323m024q720o004J4818j0768j1743L391K5578N10Q815j5186J4146
8389I8998k8812M498L2497J8781O580N911J2853J6445K2101Q119k933l00m764
8376A89974k8145j2834k2091q365k86K5053N387j9518j5063M287J2843O980k2311
$$ plain form
8363 115911 89526 98388 112994 118483 124137 94153 73627 79072 80613 60548 48920 57151 70079
8350 70079 67992 50730 30776 37190 48200 64370 49245 35552 38131 39737 44040 54622 76187
8337 76187 84351 76674 80679 93819 104986 107511 120915 101940 90050 95301 89391 78045 94703
8324 94703 92996 83528 77820 72051 64490 57191 39345 24392 14187 6705 -4576 12832 9504
8311 9504 -346 11416 17880 25379 14835 9795 -13534 -17125 -9512 1491 -11554 -19432 -12688 -19192
8297 -19192 -21429 -24714 -34377 -6494 10127 20363 33060 31031 3843 904 -3225 -467 22497
8284 22497 18794 13216 550 3823 -3704 -23854 -31876 -26039 -11113 4406 -6282 -24519 -35520
8271 -35520 -31571 -29969 -31009 -711 -21835 -40906 -36392 -35668 -31424 -33614 -20676 -25943 -26058 -6015
$$ packed form
8363A15911k6385Q862J4606N489N654k9984k0526N445J541k0065j1628Q231J2928
8350G0079k087j7262j9954O414J1010J6170j5125j3693K579J606M303J0582K1565
8337G6187Q164p677M005J3140J1167K525J3404j8975j1890N251n910j1346J6658
8324I4703j707r468n708n769p561p299j7846j4953j0205p482j1281J7408l328
8311I504r850J1762O464P499j0544n040k3329l591P613J1003j3045p878O744o504
8297a9192k237l285r663K7883J6621J0236J2697k029k7188k939m129K758K2964
8284B2497l703n578j2666L273p527k0150q022N837J4926J5519j0688j8237j1001
8271c5520L949J602j040L0298k1124j9071M514P24M244k190J2938n267j15K0043
$$ plain form
8257 -6015 3749 115 -3746 -23486 -33044 -45847 -37712 -29278 -19025 -37223 -45794 -48207 -55449 -59032
8243 -59032 -51154 -48369 -29775 -9087 3921 10783 11985 21253 26313 7331 -7407 5375 2850
8230 2850 1279 -10997 -12778 -16659 -19934 -21658 -22305 -35970 -20680 12047 24444 38931 43979 48672
8216 48672 39557 2413 -26487 -14415 -18048 -28998 -23246 17966 36848 34421 9859 -16364 -29056
8203 -29056 -19821 -8074 -17029 -30944 -28714 104 16463 -12059 -17516 4814 7983 5914 -4108
8190 -4108 -21127 -44732 -16416 11626 -15647 -16844 -31181 -24404 -3422 -11687 -17662 -29734 -54682
8177 -54682 -47435 -32187 -26801 -38290 -28967 -20772 -7100 -1009 7115 -328 -8064 -16177 -29994 -54851
8163 -54851 -52817 -21351 31053 36079 26276 -10486 -38476 -24883 -14478 -22276 -31573 -32289 -40845
$$ packed form
8257f015R764l634l861j9740r558j2803Q135Q434J0253j8198q571k413p242l583
8243e9032P878K785J8594K0688J3008O862J202R268N060j8982j4738J2782k525
8230B850j571j2276j781l881l275j724o47j3665J5290L2727J2397J4487N048M693
8216D8672r115l7144k8900J2072l633j0950N752M1212J8882k427k4562k6223j2692
8203b9056R235J1747q955j3915K230K8818J6359k8522n457K2330L169k069j0022
8190d108j7019k3605K8316K8042k7273j197j4337O777K0982q265n975j2072k4948
8177e4682P247J5248N386j1489R323Q195J3672O091Q124p443p736q113j3817k4857
8163e4851K034L1466N2404N026r803l6762k7990J3593J0405p798r297p16q556
$$ plain form
8150 -40845 -26800 -30206 -38913 -35050 -41288 -66268 -74059 -41120 -21028 -13658 -7934 1279 -2778 -6450
8136 -6450 -34988 -28423 -20350 -14581 -7106 -19632 -21195 -29937 -27411 -20008 -11102 -14002 -5048 10701
8122 10701 28584 9807 -12084 -18623 -20797 -34983 -49281 -48499 -59162 -66223 -53482 -41782 -41945
8109 -41945 -30750 3242 3037 -3636 3387 -2174 10742 8323 -4821 -27967 -15275 10949 22088
8096 22088 12569 -8974 -7784 -18889 -30107 -23818 -46092 -58868 -53461 -43646 -19359 -28049 -21647
8083 -21647 4352 23622 40042 43675 26220 23892 22345 5539 2906 -3332 -13333 -11596 -3710
8070 -3710 25684 43302 22944 13445 9724 -10861 -34336 -43775 -21817 -10733 284 25093 46810
8057 46810 44915 33805 17247 5150 -8681 11618 8408 19926 -2872 -6399 -1286 8113 42571
$$ packed form
8150d0845J4045l406q707L863o238k4980p791L2939K0092P370N724R213m057l672
8136f450k8538O565Q073N769P475j2526j563q742K526P403Q906k900Q954J5749
8122A0701J7883j8777k1891o539k174j4186j4298P82j0663p061J2741J1700j63
8109d1945J1195L3992k05o673P023n561J2916k419j3144k3146J2692K6224J1139
8096B2088r519k1543J190j1105j1218O289k2274j2776N407R815K4287q690O402
8083b1647K5999J9270J6420L633j7455k328j547j6806k633o238j0001J737P886
8070c710K9394J7618k0358r499l721k0585k3475r439K1958J1084J1017K4809K1717
8057D6810j895j1110j6558j2097j3831K0299l210J1518k2798l527N113R399L4458
$$ plain form
8044 42571 39610 15655 -13888 -15732 -10745 -16328 -2039 -8484 -41014 -26207 -6573 30874 42895
8031 42895 26661 18547 24716 16274 13100 25128 22194 7818 -6084 -7737 -29940 -25554 -9173
8018 -9173 -29021 -4123 9309 -12516 -53913 -28401 12435 14848 10142 -9893 -13886 8106 63218
8005 63218 69289 37740 20722 3922 -17618 -20732 -7662 4804 -17924 -43021 -32422 -42037
7993 -42037 -18220 8203 13514 9501 7606 22317 30964 42775 27160 10765 24579 17711 -4220
7980 -4220 5136 19030 7628 3457 -8123 -5751 -2762 -7300 -14527 -10433 -46 -4226 -11602 -7500
7966 -7500 -10025 -13378 -27065 -14933 15282 31194 17505 3896 5905 9021 15751 -10371 -34964
7953 -34964 -25708 4349 6746 -4080 11720 19180 4799 7172 32474 40762 42699 43834 37515
$$ packed form
8044D2571k961k3955k9543j844M987n583J4289o445l2530J4807J9634L7447J2021
8031D2895j6234q114O169q442l174J2028k934j4376j3902j653k2203M386J6381
8018i173j9848K4898J3432k1825m1397K5512M0836K413m706k0035l993K1992N5112
8005F3218O071l1549j7018j6800k1540l114J3070J2466k2728k5097J0599r615
7993d2037K3817K6423N311m013j895J4711Q647J1811j5615j6395J3814o868k1931
7980d220R356J3894j1402m171j1580K372K989m538p227M094J0387m180p376M102
7966g500k525l353j3687J2132L0215J5912j3689j3609K009L116O730k6122k4593
7953c4964R256L0057K397j0826J5800P460j4381K373K5302Q288J937J135o319
$$ plain form
7940 37515 17967 -9100 -9355 11194 9499 16304 405 -2019 28 1115 8121 32465 38838 36927
7926 36927 42345 33469 22469 25667 24119 24764 17269 27250 27537 21833 24357 2576 -10003 -5796
7912 -5796 14596 33233 49849 33492 10866 15572 14487 7297 -3707 -19332 -4901 -3110 1650
7899 1650 -2351 -14419 -2465 13703 15851 13806 4595 -9675 -3341 13855 23306 -2017 -5471
7886 -5471 -1982 -12753 3619 36724 14302 8700 6817 12898 14116 7196 3630 -19387 -33311
7873 -33311 -17780 -13920 -7285 14323 41108 31188 28131 32910 30808 46012 21949 18433 18437 27125
7859 27125 26374 19381 19561 21315 30114 38913 30461 36541 24296 6610 8641 -12036 -19283 -30075
7845 -30075 -38036 -17270 -16309 -17842 -23889 -14490 1780 -2329 -12506 -913 23255 -1521 -29846
$$ packed form
7940C7515j9548k7067k55K0549j695O805j5899k424K047J087P006K4344O373j911
7926C6927N418q876j1000L198j548O45p495R981K87n704K524k1781j2579M207
7912e796K0392J8637J6616j6357k2626M706j085p190j1004j5625J4431J791M760
7899A650m001j2068J1954J6168K148k045r211j4270O334J7196R451k5323l454
7886e471L489j0771J6372L3105k2422n602j883O081J218o920l566k3017j3924
7873c3311J5531L860O635K1608K6785r920l057M779k102J5204k4063l516MQ688
7859B7125p51o993J80J754Q799Q799q452O080j2245j7686K031k0677p247j0792
7845c0075p961K0766R61j533o047R399J6270m109j0177J1593K4168k4776k8325
$$ plain form
7832 -29846 -18532 933 -39687 -36965 -12035 60 7236 11324 24863 4751 -14340 -35982
7820 -35982 -41883 -15278 2783 24966 17798 17539 11697 1279 -20549 -50679 -59383 -35949 -15647
7807 -15647 -10805 -14067 -823 23065 25950 26884 25217 6974 -32133 -49879 -41908 -29036 -24805
7794 -24805 -1980 10309 -13451 -39792 -17330 12081 24211 12014 -15776 -35952 -40063 -17834
7782 -17834 2383 16128 15842 -4347 -13958 -1197 -3648 -12118 -17737 -20244 -41779 -48534 -29671
7769 -29671 -22921 -22781 -27250 -44508 -46742 -44365 -37983 -19051 -26554 -23920 -18305 -1116 19228 26736
7755 26736 18254 27672 38768 23308 15573 14328 -17426 -23701 -22923 -42893 -65346 -55310 -30898
7742 -30898 -26252 -13187 -19507 -23660 -18601 -15470 -20184 -16810 -18873 -34453 -24787 -15119 -16787 -11528
$$ packed form
7832b9846J1314J9465m0620K722K4930J2095P176M088J3539k0112j9091k1642
7820c5982n901K6605J8061K2183p168k59n842j0418k1828l0130q704K3434K0302
7807a5647M842l262J3244K3888K885R34j667j8243l9107j7746P971J2872M231
7794b4805K2825J2289k3760k6341K2462K9411J2130j2197k7790k0176m111K2229
7782a7834K0217J3745k86k0189r611J2761k451q470n619k507k1535o755J8863
7769b9671O750J40m469j7258k234K377O382J8932p503K634N615J7189K0344P508
7755B6736q482R418J1096j5460p735j245l1754o275P78j9970k2453J0036K4412
7742c0898M646J3065o320m153N059L131m714L374k063j5580R666R668j668N259
$$ plain form
7728 -11528 -242 -2873 14912 12626 -5651 -18515 -27688 -25640 -11855 -3924 -14188 -18121 -18662
7715 -18662 7596 14565 7983 7844 -17592 -22991 -17012 -37808 -43705 -18409 2191 299 -10334
7702 -10334 -6894 -10081 -25518 -35087 -14223 -2812 337 13278 24508 8134 -26562 -45720 -47595
7689 -47595 -58609 -38563 -8810 -2190 -2634 3957 -11430 -15806 -28928 -35178 -32312 -9894 -11332
7676 -11332 6797 32460 28148 15545 4055 17797 -11569 -53331 -84967 -84233 -65248 -61045 -31620
7663 -31620 12820 4841 -33276 -39341 -42702 -33302 -16685 -18516 -33194 -41127 -24036 5374 -1523
7650 -1523 -12732 -25395 -4743 8105 12627 20218 -4504 -25054 -26740 -10548 32074 32099 5140
7637 5140 -8153 2420 -3128 -6734 -27372 -33524 -53004 -41929 -5438 -21117 -32086 -18145 -23973
$$ packed form
7728a1528J1286k631J7785k286j8277j2864r173K048J3785P931j0264l933n41
7715a8662K6258O969o582j39k5436n399N979k0796n897K5296K0600j892j0633
7702a0334L440l187j5437r569K0864J1411L149J2941J1230j6374l4696j9158j875
7689d7595j1014K0046K9753O620m44O591j5387m376j3122o250K866K2418j438
7676a1332J8129K5663m312j2603j1490J3742k9366m1762l1636P34J8985M203K9425
7663c1620M4440p979l8117o065l361R400J6617j831j4678p933J7091K9410o897
7650a523j1209j2663K0652J2848M522P591k4722k0550j686J6192M2622K5k6959
7637E140j3293J0573n548l606k0638o152j9480J1075L6491j5679j0969J3941n828
$$ plain form
7624 -23973 -14570 -13383 -9895 -2955 -10487 -22024 -16081 -10865 -12152 10147 -21685 -43869 -36371 -29647
7610 -29647 -18197 -33688 -56470 -68174 -37805 7043 -7143 -2417 13473 -23386 -41257 -18784
7598 -18784 14641 -2040 -17375 -11990 -7301 -12360 -21288 -20714 -25789 -27635 -6695 1973 -11640 -20913
7584 -20913 -23124 -16836 4718 24390 20698 14180 3472 -6205 9896 11902 11806 4814 6997 3635
7570 3635 202 3685 25080 2291 -9220 -17460 5385 13857 -3779 -12768 -7811 4040 10755
7557 10755 238 -43220 -37583 -43839 -39630 -33911 -28073 -34846 -21424 -6908 232 -11537 -17844
7544 -17844 -4711 -15312 -25087 -26936 150 -15861 -21577 -16254 -23261 -30806 -24021 -3028 -21994
7531 -21994 -38772 -24570 -35744 -44002 -33258 -52115 -49756 -36981 -24807 -19665 -7211 -7412 15209
$$ packed form
7624b3973R403J187L488O940p532j1537N943N216j287K2299l1832k2184P498O724
7610b9647J1450j5491k2782j1704L0369M4848j4186M726J5890l6859j7871K2473
7598a8784L3425j6681j5335N385M689n059q928N74n075j846K0940Q668j3613r273
7584b0913k211O288K1554J9672l692o518j0708r677J6101K006r6o992K183l362
7570C635l433L483K1395k2789j1511q240K2845Q472j7636q989M957J1851O715
7557A0755j0517m3458N637o256M209N719N838o773J3422J4516P140j1769o307
7544a7844J3133j0601r775j849K7086j6011n716N323p007p545O785K0993j8966
7531b1994j6778J4202j1174q258J0744j8857K359J2775J2174N142J2454k01K2621
$$ plain form
7518 15209 -5617 -12454 -18330 91 6544 14822 18193 3459 -26467 -37669 -50588 -33600 -18781
7505 -18781 3324 5258 -9029 12934 13396 16086 -6497 -17799 -26712 -6955 -1735 23584 52232
7492 52232 64190 42397 -6357 -31606 -28662 -12617 -1778 -23877 -24776 -33874 -27457 -29480 -40462
7479 -40462 -24540 -32515 -28488 436 3526 622 1748 -15885 -15317 -26273 -15526 1151 1591 -28561
7465 -28561 -31282 -17320 -19283 -24637 -25493 -7969 9701 10455 1946 148 -24847 -53602 -13992 -1676
7451 -1676 -23546 -41589 -37270 -35802 -14623 2346 4543 -8016 -26256 -24090 -19891 -38571 -42960
7438 -42960 -36436 -50495 -48865 -47864 -33994 -24120 -50792 -47496 -2886 16311 28842 16814 -10531
7425 -10531 -25638 -20343 -19117 -40089 -24579 -1616 5347 -22427 -50624 -41898 -16021 -2088 -19493
$$ packed form
7518A5209k0826o837n876J8421O453Q278L371j4734k9926j1202j2919J6988J4819
7505a8781K2105J934j4287K1963M62K690k2583j1302q913J9757N220K5319K8648
7492E2232J1958k1793m8754k5249K944J6045J0839k2099q99r098O417k023j0982
7479d0462J5922p975M027K8924L090k904J126j7633N68j0956J0747J6677M40l0152
7465b8561k721J3962j963n354q56J7524J7670P54q509j798k4995k8755L9610J2316
7451a676k1870j8043M319J468K1179J6969K197j2559j8240K166M199j8680m389
7438d2960O524j4059J630J001J3870R874k6672L296M4610J9197J2531j2028k7345
7425a0531j5107N295J226k0972J5510K2963O963k7774k8197Q726K5877J3933j7405
$$ plain form
7412 -19493 -32250 -34366 -14274 15677 -16055 -44056 -25370 -4617 -6222 -7262 -10224 9755 -1153
7399 -1153 -25120 -33661 -14044 -3596 -6579 2686 761 -15096 -19591 -17038 -26615 -44113 -55314
7386 -55314 -48355 -1439 6128 -8371 5956 -7183 -24994 -27424 -20505 -12307 -41105 -38231 -21230
7373 -21230 -12461 -37093 -45527 -32873 -21122 -3007 1480 -6123 -2538 2868 6874 -10212 -15897
7360 -15897 -8170 3334 -11763 -29537 -38465 -22178 -13935 2218 4904 4922 3642 -357 -22140 -40697
7346 -40697 -42441 -30746 -30424 -11556 -12564 -25497 -15900 -16760 -14493 -28780 -37579 -24672 -10928 -18467
7332 -18467 -23344 -19625 -34846 -22463 -13747 -19120 -17615 -9449 -3287 -11570 -22323 -36862 -44358 -26246
7318 -26246 -18683 -120 16490 -5982 -7242 644 20082 46308 34477 -370 -11803 -831
$$ packed form
7412a9493j2757k116K0092K9951l1732k8001J8686K0753j605j040k962J9979j0908
7399a153k3967q541J9617J0448k983R265j925j5857m495K553r577j7498j1201
7386e5314O959M6916P567j4499J4327j3139j7811k430O919Q198k8798K874J7001
7373b1230Q769k4632q434J2654J1751J8115M487p603L585N406M006j7086n685
7360a5897P727J1504j5097j7774q928J6287Q243J6153K686J8j280l999k1783j8557
7346d0697j744J1695L22J8868j008j2933R597q60K267j4287q799J2907J3744p539
7332a8467m877L719j5221J2383Q716n373J505Q166O162q283j0753j4539p496J8112
7318b6246P563J8563J6610k2472j260P886J9438K6226j1831l4847j1433J0972
$$ plain form
7306 -831 -14818 -22678 -46874 -39543 -9994 8255 27972 27715 15279 891 294 330 -5727 -11845
7292 -11845 -21354 -10971 -3780 -17310 -3889 -5898 1146 2215 -11770 -32226 -35557 -9984 21266
7279 21266 34835 38328 21843 -2327 -8672 12188 41924 19106 22357 33836 25090 2015 10950
7266 10950 12092 9240 2728 5104 1027 -8056 -13622 -11889 -25282 -13960 1355 -5749 -27065 -23526
7252 -23526 -25306 -24153 -1226 -6385 -6228 10740 13935 -4236 -1035 -7598 -4616 -11417 -20071 -11640
7238 -11640 -22037 -6130 -12347 -23076 -24220 -27354 -18590 -7894 -9227 -5556 10708 22192 10727
7225 10727 19919 26300 25359 4584 4101 16330 12902 -5842 -11022 -1363 4162 -11804 -5606 -6580
7211 -6580 -14402 -14042 -29321 -18779 -14868 -17736 -16643 -18466 -29355 -40742 -24326 8384 1696 -16617
$$ packed form
7306h31j3987p860k4196P331K9549J8249J9717k57j2436j4388n97L6o057o118
7292a1845r509J0383P191j3530J3421k009P044J069j3985k0456l331K5573L1250
7279B1266J3569L493j6485k4170o345K0860K9736k2818L251J1479q746k3075Q935
7266A0950J142k852o512K376m077r083n566J733j3393J1322J5315p104k1316L539
7252b3526j780J153K2927n159J57J6968L195j8171L201o563K982o801q654Q431
7238a1640j0397J5907o217j0729j144l134Q764J0696j333L671J6264J1484j1465
7225A0727R192O381r41k0775m83J2229l428j8744n180R659N525j5966O198r74
7211f580p822L60j5279J0542L911k868J093j823j0889j1387J6416L2710o688j8313
$$ plain form
7197 -16617 -7081 -6953 -5 -5778 -14870 -20471 -18976 8544 -13135 -21680 -12438 12596 19103 3921
7183 3921 -17846 -7627 -6590 -42111 -37564 -31823 -39310 -34221 -10575 7289 -672 -13434 -22665
7170 -22665 -44928 -26057 -4483 -1658 -1038 -5554 -16560 -395 23811 46720 41803 14163 12235
7157 12235 25241 25580 16606 -5060 3547 -1238 -1600 16205 15942 5254 3300 1474 6025 -23964
7143 -23964 -12968 -8074 -18653 -32983 -35044 -19195 -14580 -10196 -19032 -29696 -44178 -52456 -55339
7130 -55339 -42602 -34498 -22755 -5973 -9153 -9220 -18559 -25710 -29004 -16473 -4566 -2569 12488 17156
7116 17156 -6361 -15052 24054 47826 39627 8853 -34476 -27777 3412 11570 -9128 -12177 -3717
7103 -3717 -19048 -26853 -28884 -20356 -4056 23312 40485 39207 30011 18840 -9813 -8353 6292
$$ packed form
7197a6617R536J28O948n773r092n601J495K7520k1679q545R242K5034O507j5182
7183C921k1767J0219J037l5521M547N741p487N089K3646J7864p961j2762r231
7170b2665k2263J8871K1574K825O20m516j1006J6165K4206K2909m917k7640j928
7157A2235J3006L39q974k1666Q607m785l62J7805k63j0688j954j826M551k9989
7143b3964J0996M894j0579j4330k061J5849M615M384q836j0664j4482q278k883
7130e5339J2737Q104J1743J6782l180o7r339p151l294J2531J1907J997J5057M668
7116A7156k3517q691L9106K3772q199l0774m3329O699L1189Q158k0698l049Q460
7103c717j5331p805k031Q528J6300K7368J7173j278r196j1171k8653J460J4645
$$ plain form
7090 6292 -588 -10813 -16048 -9134 -10809 -7360 10173 12033 -23490 -41654 -36367 -34205 -22124 -20126
7076 -20126 -33382 -30838 -19746 -30093 -6750 -11324 -27465 -43935 -36023 13940 54692 65600
7064 65600 55478 34300 16687 13818 24859 -9532 -17646 -7850 360 10341 9202 1824 5344
7051 5344 -7190 -11164 -1471 10551 20411 355 -387 1483 5075 19345 -8922 -40488 -40167 -41410
7037 -41410 -33502 -18559 3178 23556 15208 -10329 -23522 -18012 -8441 -6379 -26349 -41010 -41069
7024 -41069 -30706 -24508 -26364 -9074 -117 16828 33834 43640 33850 25011 12627 25556 30654
7011 30654 27899 27119 27496 15988 1196 -19989 -19163 -16058 -13860 3645 21450 16057 14036 10116
6997 10116 14348 15253 7605 -13683 -14440 12930 19845 35958 39731 37837 26440 19914 49710 51162
$$ packed form
7090F292o880j0225n235O914j675L449J7533J860l5523j8164N287K162J2081J998
7076b0126j3256K544J1092j0347K3343m574j6141j6470P912M9963M0752J0908
7064F5600j0122k1178j7613k869J1041l4391q114R796Q210R981j139p378L520
7051E344j2534l974R693J2022R860k0056p42J870L592J4270k8267l1566L21j243
7037d1410P908J4943K1737K0378q348k5537j3193N510R571K062j9970j4661n9
7024d1069J0363O198j856J7290Q957J6945J7006R806r790q839j2384J2929N098
7011C0654k755p80L77j1508j4792k1185Q26L105K198J7505J7805n393k021l920
6997A0116M232R05p648k1288p57K7370O915J6113L773j894j1397o526K9796J452
$$ plain form
6983 51162 19965 6370 5799 161 1139 20350 24697 3988 914 -17916 81 13944 81
6970 81 12423 -7489 -3965 -3055 -8396 -7634 -11810 -6743 1227 1753 -10816 -32063 -35375 -12791 6007
6955 6007 -6392 -28021 -13718 -8707 5516 15355 8881 -9161 -24926 -40428 -46719 -19426 -6057
6942 -6057 -27357 -39190 -30973 -31133 -15588 -3700 -14309 -25456 -58824 -58167 -45081 -34640 -14297
6929 -14297 -8839 -24634 -32376 -23847 -25897 -31199 -13388 -17850 -19223 10064 17100 -9325 -25379
6916 -25379 -13993 -16708 -28379 -7916 10876 25328 6530 -16156 -16660 -13644 37 3900 2234
6903 2234 10734 15136 12827 -2811 -20018 -19227 -21311 -44121 -53488 -34079 -2449 25859 11953
6890 11953 8087 22891 18780 -4269 -4674 -138 3193 -451 -18466 -29993 -49727 -39179 -14938
$$ packed form
6983E1162l1197j3595n71n638R78J9211M347k0709l074j8830J7997J3863j3863
6970H1J2342j9912L524R10n341P62m176N067P970N26j2569k1247l312K2584J8798
6955F007j2399k1629J4303N011J4223R839o474j8042j5765j5502o291K7293J3369
6942f057k1300j1833Q217j60J5545J1888j0609j1147l3368O57J3086J0441K0343
6929a4297N458j5795p742Q529k050n302J7811m462j373K9287P036k6425j6054
6916b5379J1386k715j1671K0463J8792J4452j8798k2686n04L016J3681L863j666
6903B234Q500M402k309j5638j7207P91k084k2810r367J9409L1630K8308j3906
6890A1953l866J4804m111k3049m05M536L331l644j8015j1527j9734J0548K4241
$$ plain form
6877 -14938 -25598 -20443 -18218 -446 39612 32955 10895 -5236 -10326 -13633 -13279 -49292 -45650
6864 -45650 -19963 -4224 -4614 -12150 -36446 -33867 -19260 -33984 -7971 -2728 -7450 -7878 -1569 -25827
6850 -25827 -31002 -15789 -16804 -22108 -32583 -33359 -28240 -8405 -3252 -19731 -36766 -26612 -19168
6837 -19168 -10159 -10326 13315 29245 10862 -3636 11511 19358 14853 3198 -11727 -9313 7419
6824 7419 1816 11450 12657 1252 4466 6189 -823 -23364 -6809 -2785 -23114 -27820 -7270 16044
6810 16044 -8008 -1724 6378 -7173 6197 20949 15543 -9040 -28126 -31204 -7686 -14637 -29229
6797 -29229 -43130 -47022 -37872 -13451 -19706 -37966 -50515 -24547 3001 -4119 -11308 -22325 -30190
6784 -30190 -43690 -50661 -46557 -45649 -28205 -23688 -32774 -34050 -18721 -2680 6515 -19797 -28429 -37374
$$ packed form
6877a4938j0660N155K225J7772M0058o657k2060j6131n090l307L54l6013L642
6864d5650K5687J5739l90p536k4296K579J4607j4724K6013N243m722m28O309k4258
6850b5827n175J5213j015n304j0475p76N119J9835N153j6479j7035J0154P444
6837a9168R009j67K3641J5930j8383j4498J5147P847m505j1655j4925K414J6732
6824G419n603R634J207j1405L214J723p012k2541J6555M024k0329m706K0550K3314
6810A6044k4052O284Q102j3551J3370J4752n406k4583j9086l078K3518o951j4592
6797b9229j3901l892R150K4421o255j8260j2549K5968K7548p120p189j1017p865
6784c0190j3500o971M104R08J7444M517r086j276J5329J6041R195k6312q632q945
$$ plain form
6770 -37374 -43143 -30819 -16159 -10837 -8199 -3411 -28569 -24241 -22701 -23402 -38531 -47322 -11034 28202
6756 28202 31670 10726 -2912 7082 3055 -16595 -40236 -56019 -53067 -17785 -7630 -22054 -32327
6743 -32327 -33259 -15606 -35293 -30787 -12404 -6585 1761 669 -25240 -40755 -46824 -14814 20152
6730 20152 -414 -8607 -13770 -2558 -6645 -1398 -416 -21598 -24350 -30445 -36329 -25655 -15460 -8582
6716 -8582 -19763 -12566 3696 -9835 -13916 3888 -17579 -13428 11564 50446 60383 8622 832
6703 832 -6638 -16397 -7460 -19478 -16356 -16989 -13980 2085 8002 4067 8670 -10506 -18581 -24743 -23362
6688 -23362 -34834 -26202 -3013 -21236 -41341 -47696 -31959 2391 27196 20372 10908 -26650 -66719
6675 -66719 -52626 -49964 -16046 9075 10459 14684 -2677 -177 -20218 -6648 -4109 16063 1043
$$ packed form
6770c7374n769J2324J4660N322K638M788k5158M328J540p01j5129q791L6288L9236
6756B8202L468k0944j3638R994m027j9650k3641j5783K952L5282J0155j4424j0273
6743c2327r32J7653j9687M506J8383N819Q346j092k5909j5515o069L2010L4966
6730B0152k0566q193n163J1212m087N247R82k1182k752o095n884J0674J0195O878
6716h582j1181P197J6262j3531m081J7804k1467M151K4992L8882R937n1761p790
6703H32p470r759Q937j2018L122o33L009J6065N917l935M603j9176q075o162J381
6688b3362j1472Q632K3189j8223k0105o355J5737L4350K4805o824r464l7558m0069
6675f6719J4093K662L3918K5121J384M225j7361K500k0041J3570K539K0172j5020
$$ plain form
6662 1043 -12436 -7089 18354 8798 -21711 -34425 -40795 -16904 -30725 -39249 -29261 -60235 -59834
6649 -59834 -39144 -45678 -43298 -44847 -39863 -33007 -29660 -15014 -2351 17892 50 -15660 -17183
6636 -17183 -23576 -27426 -20191 972 1983 -12161 -8165 8635 22893 17030 21541 13815 16683 33044
6622 33044 21471 16967 8483 -16837 -41351 -74028 -80652 -66814 -47289 -14944 -13232 -20368 -32107
6609 -32107 -53533 -52263 -33821 -29387 -9900 -473 -17167 -36908 -32511 -14300 -24201 -8618 -12825
6596 -12825 -29474 -23019 -28447 -46720 -46509 -29359 1985 24243 13861 -9925 -23223 -11546 1325
6583 1325 -17225 -26373 -19376 -4385 4949 -282 -25505 2176 18348 18987 -9543 -22981 -15167
6570 -15167 -14417 -26239 -11493 4217 -4775 -6088 16054 -3750 -33354 -37959 -23227 -1335 9131
$$ packed form
6662A043j3479N347K5443r556l0509j2714o370K3891j3821q524R988l0974M01
6649e9834K0690o534K380j549M984O856L347J4646J2663K0243j7842j5710j523
6636a7183o393l850P235K1163J011j4144L996J6800J4258n863M511p726K868J6361
6622C3044j1573m504q484k5320k4514l2677o624J3838J9525L2345J712p136j1739
6609c2107k1426J270J8442M434J9487R427j6694j9741M397J8211r901J5583m207
6596a2825j6649O455n428j8273K11J7150L1344K2258j0382k3786j3298J1677J2871
6583A325j8550r148O997J4991R334n231k5223K7681J6172O39k8530j3438P814
6570a5167P50j1822J4746J5710q992j313K2142j9804k9604m605J4732K1892J0466
$$ plain form
6557 9131 7249 6335 -7480 -19363 2467 15687 21650 11986 -4412 -4478 -10583 9059 18944 30454
6543 30454 40171 23022 10426 3697 7369 9864 2776 -25949 -18225 3764 22742 26186 37456
6530 37456 26906 32092 22078 4372 9611 5083 -14331 -14463 -361 10326 9365 -9414 14279
6517 14279 13750 12531 10266 11385 19521 -9367 -31399 -12820 -13415 -33449 -27054 -20106 -51364 -44986
6503 -44986 -12790 -10824 22625 29138 -19220 -51060 -51097 -19049 -29880 -37076 -47305 -27522 4621
6490 4621 16844 -2967 -6151 -1055 -18528 -33971 -22465 -36649 -30961 -27483 -26716 -11455 -14339
6477 -14339 -42034 -38855 -20881 -16826 -9840 -3992 5120 7394 15068 29903 26262 19169 11696 27216
6463 27216 35927 18353 -8416 -11584 3585 25755 43854 44857 30812 10350 -3574 -18104
$$ packed form
6557I131j882r14j3815j1883K1830J3220N963r664j6398o6o105J9642R885J1510
6543C0454R717j7149j2596o729L672K495p088k8725P724K1989J8978L444J1270
6530C7456j0550N186j0014j7706N239m528j9414j32J4102J0687r61j8779K3693
6517A4279n29j219k265J119Q136k8888k2032J8579n95k0034O395O948l1258O378
6503d4986L2196J966L3449O513m8358l1840l7L2048j0831p196j0229J9783L2143
6490D621J2223j9811l184N096j7473j5443J1506j4184N688L478P67J5261k884
6477a4339k7695L179J7974M055O986N848R112K274P674J4835l641p093p473J5520
6463B7216Q711j7574k6769l168J5169K2170J8099J003j4045k0462j3924j4530
$$ plain form
6451 -18104 -25346 -25652 -16466 -26014 -42560 -47579 -50262 -17934 9325 20934 11894 -10531 -21669
6438 -21669 -17870 -8698 -3703 -4392 -5321 5411 6733 -2849 17240 33260 4601 -28473 -1037 20054
6424 20054 23325 26122 15127 4764 2573 15281 33115 18143 -7216 -15280 -5031 -4348 -5071
6411 -5071 -5228 -3957 11731 -5586 -31152 -27687 -19129 -9956 -19398 -768 -2452 12098 12850 22972
6397 22972 14371 10370 15697 2196 -12021 -8616 3157 2460 -6589 -7152 -8758 7905 25352 43597
6383 43597 19125 16330 -28995 -70414 -66749 -50996 -58368 -53793 -35231 -19407 -10221 -11321 -17989
6370 -17989 -3663 37862 31208 16724 14906 25029 20438 47 -16043 -9891 5818 7769 25051
6357 25051 17698 20587 30253 15265 1318 -16573 -9124 8151 -3343 -14095 -14486 -963 7598
$$ packed form
6451a8104p242l06R186r548j6546n019k683L2328K7259J1609r040k2425j1138
6438b1669L799R172M995o89r29J0732J322r582K0089J6020k8659l3074K7436K1091
6424B0054L271K797j0995j0363k191J2708J7834j4972k5359q064J0249O83p23
6411e071j57J271J5688j7317k5566L465Q558R173r442J8630j684J4550P52J0122
6397B2972q601m001N327j3501j4217L405J1773o97r049n63j606J6663J7447J8245
6383D3597k4472k795m5325m1419L665J5753p372M575J8562J5824R186j100o668
6370a7989J4326M1525o654j4484j818J0123m591k0391j6090O152J5709J951J7282
6357B5051p353K889R666j4988j3947j7891P449J7275j1494j0752l91J3523Q561
$$ plain form
6344 7598 12879 5103 -25131 -38714 -11182 -733 -6477 -22938 -11818 10197 8104 22868 12796
6331 12796 743 4817 22749 28324 20020 11993 -7135 -13423 -16764 -40811 -54019 -37910 -33731
6318 -33731 -16255 -1142 23880 42177 24986 -395 -19547 -43418 -49618 -38004 -2954 19265
6306 19265 27339 43178 50152 53258 64863 33371 12493 23366 27586 26363 16239 22110 15927
6293 15927 -1121 -23802 -25453 -2406 16076 19378 13248 -12481 -21984 -2243 -1967 -10846 -15275
6280 -15275 -12844 -18438 -21643 -22242 -8017 207 21763 22250 -241 -6244 -5828 -12298 -12467 -18257 -29922
6265 -29922 -34859 -23000 -7466 -3050 -1492 -5545 -10588 -23030 -37846 -39736 -45041 -46685 -11778
6252 -11778 1937 -4158 -3317 4081 -8537 -18043 -28902 -24292 -9818 23657 30640 22614 21131 5595
$$ packed form
6344G598N281p776l0234j3583K7532J0449n744j6461J1120K2015k093J4764j0072
6331A2796j2053M074J7932N575q304q027j9128o288l341k4047j3208J6109M179
6318c3731J7476J5113K5022J8297j7191k5381j9152k3871o200J1614L5050K2219
6306A9265Q074J5839O974L106J1605l1492k0878J0873M220j223j0124N871o183
6293A5927j7048k2681j651K3047J8482L302o130k5729r503J9741K76q879m429
6280a5275K431n594l205n99J4225Q224K1556M87k2491o003M16o470j69n790j1665
6265b9922m937J1859J5534M416J558m053n043j2442j4816j890n305j644L4907
6252a1778J3715o095Q41P398j2618r506j0859M610J4474L3475O983q026j483j5536
$$ plain form
6238 5595 -14836 -21153 7099 31941 29693 26199 26434 37931 36698 25524 22870 33633 19771
6225 19771 23797 26631 15985 -9177 -23673 -5075 11504 24204 18087 20222 -3105 -29549 -25833
6212 -25833 -18506 -2884 5163 -2024 9014 8826 -183 4690 4369 -1214 2565 -2392 2917 19009
6198 19009 32111 37221 42294 28472 12777 1267 17643 18699 22655 24924 18511 17869 15987 -4187
6184 -4187 39 24052 17367 -7728 -16769 -1052 11723 10784 24397 27442 43432 38511 19385
6171 19385 3250 19219 24468 1424 -20675 -28390 -15060 -9437 -27490 -35703 -13235 -12170 -38891
6158 -38891 -55676 -42157 -13214 13993 26234 8812 -7973 -16344 -27739 -29088 -8083 3798
6146 3798 6879 8542 12180 13346 5058 3776 11109 9412 410 -14316 257 953 12378 17366
$$ packed form
6238E595k0431o317K8252K4842k248l494K35J1497j233j1174k654J0763j3862
6225A9771M026K834j0646k5162j4496J8598J6579J2700o117K135k3327k6444L716
6212b5833P327J5622Q047p187J1038j88r009M873l21n583L779m957N309J6092
6198A9009J3102N110N073j3822j5695j1510J6376J056L956K269o413o42j882k0174
6184d187M226K4013o685k5095r041J5717J2775r39J3613L045J5990m921j9126
6171A9385j6135J5969N249k3044k2099p715J3330N623j8053q213K2468J065k6721
6158c8891j6785J3519K8943K7207J2241j7422j6785q371j1395j349K1005J1881
6146C798L081J663L638J166q288j282P333j697r002j4726J4573O96J1425M988
$$ plain form
6132 17366 30057 35602 14403 16566 23136 22324 7609 -13943 -18376 -1708 -6161 5255 5581 -10945
6118 -10945 -4998 -8230 -27191 -34835 -28509 -17267 -4528 -11190 -2725 -23629 -52487 -55751 -34842
6105 -34842 -13351 1090 14467 15928 34854 36923 31678 26567 22811 -3851 -20046 -17631 -20222
6092 -20222 -24692 -14994 23382 36738 22904 17352 1096 -13005 -6994 -8451 -6019 724 -1658
6079 -1658 1633 7392 5917 1792 8813 -4740 15104 9978 -16513 -22460 -29606 -33635 -14904 -15179
6065 -15179 4146 5871 -3100 -16948 -27958 -19224 -23783 -6543 -6247 -16945 -43073 -48725 -31202
6052 -31202 -17030 -14086 -31414 -19517 4557 -10503 -10709 -25118 -24567 -31058 -10211 -18376 -35542
6039 -35542 -16469 14035 19214 3513 -6013 -3579 -3159 -15690 -10491 8511 6059 9290 15351 14310
$$ packed form
6132A7366J2691N545k1199K163O570q12j4715k1552m433J6668m453J1416L26j6526
6118a0945N947l232j8961p644O326J1242J2739o662Q465k0904k8858l264K0909
6105c4842K1491J4441J3377J461J8926K069n245n111l756k6662j6195K415k591
6092b0222m470R698L8376J3356j3834n552j6256j4101O011j457K432O743k382
6079a658L291N759j475m125P021j3553J9844n126k6491n947p146m029J8731k75
6065a5179J9325J725q971j3848j1010Q734m559J7240K96j0698k6128n652J7523
6052c1202J4172K944j7328J1897K4074j5060k06j4409N51o491K0847q165j7166
6039c5542J9073L0504N179j5701r526K434M20j2531N199J9002k452L231O061j041
$$ plain form
6025 14310 -12693 -16831 -13092 -24904 -36454 -27332 -8494 -3258 6431 26423 43979 43772 17277
6012 17277 1863 8277 10244 20274 31726 20232 19348 25676 16906 11858 13579 -10169 -22319
5999 -22319 -20045 -12235 13612 34269 47020 10859 -3758 2326 -14537 -19426 -40193 -16944 -4090
5986 -4090 5610 22779 -6739 -49430 -19495 5196 2691 15141 7451 -2192 -111 10409 13949
5973 13949 -2567 -29368 -41855 -29785 -15438 -17425 -2371 -12242 -9429 3894 -1428 -6799 17596
5960 17596 26937 18311 9367 -6270 -22910 -724 19835 33543 19962 3117 -11941 -5612 11554
5947 11554 7296 -6260 -11045 10684 33995 7674 11172 8754 -18094 -10959 3564 -1355 -5827
5934 -5827 -32269 -45131 -32821 -39902 -25366 -44854 -25781 7350 24968 21308 9738 4531 1349
$$ packed form
6025A4310k7003m138L739j1812j1550R122J8838N236R689J9992J7556k07k6495
6012A7277j5414O414J967J0030J1452j1494q84O328q770n048J721k3748j2150
5999b2319K274P810K5847K0657J2751l6161j4617O084j6863m889k0767K3249J2854
5986d090R700J7169k9518m2691K9935K4691k505J2450p690r643K081J0520L540
5973A3949j6516k6801j2487J2070J4347j987J5054r871K813J3323n322n371K4395
5960A7596R341q626q944j5637j6640K2186K0559J3708j3581j6845j5058O329J7166
5947A1554m258j3556m785K1729K3311k6321L498k418k6848P135J4523m919m472
5934e827k6442j2862J2310p081J4536j9488J9073L3131J7618l660j1570n207l182
$$ plain form
5921 1349 -925 -6535 -22503 -33981 -38934 -26974 -24907 -24510 -43904 -56710 -53912 -17255 1412
5908 1412 4501 -498 1620 -4574 -16052 1438 4911 -12056 5622 7177 3866 -3995 -17131 -17361
5894 -17361 -9389 74 -16101 -20033 -13203 -11652 -34500 -44684 -38513 -50654 -46985 -16710 11899
5881 11899 9388 -5975 -14944 -36062 -32771 -19415 6988 3350 11504 -2566 -19474 -34722 -33743
5868 -33743 -31715 -17770 11407 9446 -1489 3799 1820 10068 3786 6529 3736 -3122 -20068 -28129
5854 -28129 -33584 -25629 -42067 -52463 -29726 -18152 -27732 -32364 -41727 -20375 5306 10438 -3864
5841 -3864 -19690 -20174 -29165 -44046 -40858 -15158 -4683 12570 22267 20246 20386 22161 8835 -15544
5827 -15544 -23527 -11674 -7135 -20339 -10160 5897 18644 20922 17883 -19837 -40640 -21108 -16761
$$ packed form
5921A349k274n610j5968j1478m953J1960K067L97j9394j2806K798L6657J8667
5908A412L089m999K118o194j1478J7490L473j6967J7678J555l311p861j3136k30
5894a7361P972R463j6175l932O830J551k2848j0184O171j2141L669L0275K8609
5881A1899k511j5363q969k1118L291J3356K6403l638Q154j4070j6908j5248R79
5868c3743K028J3945K9177j961j0935N288j979Q248o282K743k793o858j6946q061
5854b8129n455P955j6438j0396K2737J1574r580m632r363K1352K5681N132j4302
5841c864j5826m84q991j4881L188K5700J0475J7253R697k021J40J775j3326k4379
5827a5544p983J1853M539j3204J0179J6057J2747K278l039l7720k0803J9532M347
$$ plain form
5814 -16761 -8309 -19872 -24733 -39739 -44974 -32213 -28841 -39309 -33843 -744 7579 3776 7286
5801 7286 -14462 -23844 -30979 -8486 15498 -782 -697 14789 3439 10331 22205 4214 9315
5788 9315 1553 5080 -24638 -26011 -27359 2015 23127 18480 9812 9320 31242 34219 33113 19925
5774 19925 17496 41301 47145 29708 10764 3712 -17101 -2925 23522 35198 9179 -4994
5762 -4994 -3328 -7757 -3342 6461 25669 25362 18605 23074 9993 2560 19517 9174 31926 49587
5748 49587 32967 12030 -19118 -21377 20697 36406 9173 -1206 -21803 -15095 6956 17397
5736 17397 15422 14050 15281 5102 -47070 -40382 -6825 -25593 -35229 -17095 -8422 -26974 -28075
5723 -28075 -22879 -4507 16033 30611 17702 -2513 -6398 13503 5076 -11674 -12709 10423 24071
$$ packed form
5814a6761Q452j1563m861j5006n235J2761L372j0468N466L3099Q323l803L510
5801G286k1748r382p135K2493K3984j6280Q5J5486j1350O892J1874j7991N101
5788I315p762L527k9718j373j348K9374K1112m647q668m92K1922K977j106j3188
5774A9925k429K3805N844j7437j8944p052k0813J4176K6447J1676k6019j4173
5762d994J666m429M415R803J9208l07o757M469j3081p433J6957j0343K2752J7661
5748D9587j6620k0937l1148k259M2074J5709k7233j0379k0597O708K2051J0441
5736A7397j975j372J231j0179n2172O688L3557j8768r636J8134Q673j8552j101
5723b8075N196J8372K0540J4578j2909k0215l885J9901q427j6750j035K3132J3648
$$ plain form
5710 24071 16091 32893 25119 3980 -17399 -21309 483 -28244 -34986 -23885 910 10291 -6156
5697 -6156 -3206 -13412 -22063 -46202 -35247 -29130 -32928 -42144 -53273 -44673 -27640 -18640 -35751
5684 -35751 -44934 -4209 22693 30289 40088 38129 18370 8805 11922 15714 20117 25221 25045 13011
5670 13011 8402 16451 11699 16371 3159 -18730 -4711 12677 12577 -6491 2849 6146 10601 15456
5656 15456 -10029 -4492 12378 8254 16068 5669 -13167 -14473 -872 -10923 -1964 13974 35411
5643 35411 59358 67125 54120 28846 -6607 -38302 -52200 -39546 -19777 -10234 -8900 8438
5631 8438 23949 1297 -21059 2764 7487 19099 29899 34159 -2846 -6555 -21948 -25550 -17065
5618 -17065 -3589 8203 13007 -767 -4869 7916 30153 62859 51067 -3257 -16107 -28108
$$ packed form
5710B4071p980J6802p774k1139k1379l910K1792k8727o742J1101K4795R381j6447
5697f156K950j0206q651k4139J0955O117l798r216j1129Q600J7033R000j7111
5684c5751r183M0725K6902P596R799j959j9759r565L117L792M403N104j76j2034
5670A3011m609Q049m752M672j3212k1889J4019J7388j00j9068R340L297M455M855
5656A5456k5485N537J6870m124P814j0399j8836j306J3601j0051Q959J5938K1437
5643C5411K3947P767j3005k5274l5453l1695j3898J2654J9769R543J334J7338
5631H438J5511k2652k2356K3823M723J1612J0800M260l7005l709j5393l602Q485
5618a7065J3476J1792M804j3774m102J2785K2237L2706j1792n4324j2850j2001
$$ plain form
5606 -28108 -28142 -2720 35209 36373 39422 41367 26917 20391 36399 24384 23055 14631 -655 -10273
5592 -10273 13566 17553 20691 15120 -4414 -6762 -5618 -5436 -1669 -23081 -15523 9004 14275 18235
5578 18235 8781 -13549 -16347 -6477 -3165 -10621 -16979 -7190 -11389 -16050 -25935 -15635 -17227 -26120
5564 -26120 -25778 -11937 7182 14269 39110 21655 -3623 3245 11035 -8828 -14062 -20113 -23126
5551 -23126 -11223 -15701 -12394 -31283 -20335 -13090 -8452 -3204 -3827 -20266 -19957 -9753 -22621 -6768
5537 -6768 538 3809 -2628 -6207 433 -6704 -19363 -20364 -29846 -27897 -25786 -30625 -26473 -33405 -19668
5522 -19668 12545 23448 11049 8536 15093 22539 16357 38737 31254 5131 -5592 7442 12195
5509 12195 -85 -14718 -20670 -33935 -40632 -17489 -3061 -3578 -7284 -11533 -7766 -1734 8999
$$ packed form
5606b8108l4K5422L7929J164L049J945j4450o526J6008j2015j329q424j5286r618
5592a0273K3839L987L138n571j9534k348J144J82L767k1412P558K4527N271L960
5578A8235r454k2330k798R870L312p456o358R789m199m661r885J0300j592q893
5564b6120L42J3841J9119P087K4841j7455k5278O868P790j9863n234o051l013
5551b3126J1903m478L307j8889J0948P245M638N248o23j6439L09J0204j2868J5853
5537f768P306L271o437l579O640p137j2659j001r482J949K111m839M152o932J3737
5522a9668L2213J0903j2399k513O557P446o182K2380p483k6123j0723J3034M753
5509A2195j2280j4633n952j3265o697K3143J4428n17l706m249L767O032J0733
$$ plain form
5496 8999 25701 28388 -5474 -18289 -18482 -13236 -8490 -20087 -25738 -22960 14269 40645 18017
5483 18017 -1389 -10853 -21970 -19153 -2299 3102 18015 27550 29879 17752 17547 -6091 -28366
5470 -28366 -32029 -43969 -33043 -23691 -1278 13227 10476 7893 12402 26878 49425 44509 42233
5457 42233 47930 31093 41079 27471 17997 19700 18828 -7764 -130 29531 32007 1677 -25273
5444 -25273 -14557 11099 21143 6628 -17944 -28836 -19473 -29811 -36320 -17730 189 11076
5432 11076 5872 -25115 -38203 -35445 -38119 -22780 2582 -19156 -4034 4099 10148 6294 -2101
5419 -2101 -10647 -6760 -11963 -14229 -7928 15538 24930 5950 -2530 5558 31221 42390 30529 9974
5405 9974 7073 8118 13513 13111 7538 7350 5620 21869 26616 30865 4164 8189 7812 20075 13853
$$ packed form
5496H999J6702K687l3862j2815j93N246M746j1597n651K778L7229K6376k2628
5483A8017j9406r464j1117K817J6854N401J4913R535K329j2127k05k3638k2275
5470b8366l663j1940J0926R352K2413J4505k751k583M509J4476K2547m916k276
5457D2233N697j6837R986j3608r474J703q72k6592P634K9661K476l0330k6950
5444b5273J0716K5656J0044j4515k4572j0892R363j0338o509J8590J7919J0887
5432A1076n204l0987j3088K758k674J5339K5362k1738J5122Q133O049l854q395
5419b101q546L887n203k266O301K3466R392j8980q480Q088K5663J1169j1861k0555
5405I974k901J045N395m02n573j88j730J6249M747M249k6701M025l77J2263o222
$$ plain form
5390 13853 -19292 -32258 -24585 -20208 -267 6639 -13499 -8988 -12004 11251 16114 8942 21908
5377 21908 11688 -13340 -11611 -26579 -42362 -43393 -40306 -3366 -19897 -28633 -23709 -7112 -9431
5364 -9431 -756 15270 17047 -2234 -6652 -17406 -23098 -19325 -44 19635 23343 11509 10118
5351 10118 15920 20431 24758 30886 25741 24944 -499 2908 2117 12170 24107 15713 565 4919
5337 4919 -3646 -8092 -4338 13135 24137 -5400 9923 28533 34429 26602 25116 5617 26507
5324 26507 20572 25507 4798 -12928 -20709 -39529 -55027 -35028 2267 24989 36821 36407 32529
5311 32529 17034 1819 -6108 -12061 -14141 -10 7443 -4394 -21173 -21760 -13635 3553 7002
5298 7002 -12381 -38756 -37439 -25372 -5577 21546 -338 -15365 3140 -3568 -10265 -28340 -2766
$$ packed form
5390A3853l3145j2966P673M377J9941O906k0138M511l016K3255M863p172J2966
5377B1908j0220k5028J729j4968j5783j031L087L6940j6531q736M924J6597k319
5364i431Q675J6026J777j9281m418j0754n692L773J9281J9679L708j1834j391
5351A0118N802M511M327O128n145p97k5443L407p91J0053J1937q394j5148M354
5337D919q565m446L754J7473J1002k9537J5323J8610N896p827j486j9499K0890
5324B6507n935M935k0709j7726p781j8820j5498J9999L7295K2722J1832m14l878
5311C2529j5495j5215p927n953k080J4131P453j1837j6779n87Q125J7188L449
5298G002j9383k6375J317J2067J9795K7123k1884j5027J8505o708o697j8075K5574
$$ plain form
5285 -2766 21101 26165 9408 15095 40314 30906 638 13407 18714 4830 9275 -4199 -18335
5272 -18335 -17513 7010 22507 27771 20546 25759 6191 6686 -4398 -2742 2445 20654 31050 33393
5258 33393 6253 -5466 -2933 -19023 -9892 1417 17700 8715 214 -20 19819 24236 10304
5245 10304 -881 -10323 -14713 8941 16562 46949 49875 46286 49058 55453 47194 12854 6713 -17863
5231 -17863 -32900 -18690 8402 11593 -4745 -13168 -20737 -20601 5674 12400 -4236 6458 -5216
5218 -5216 -14419 12543 34984 25905 -6577 -36781 -40867 -13261 5494 11910 8427 29814 27767
5205 27767 2525 -2563 -14911 -797 7312 2068 -9368 -5578 2211 -4755 -11022 6102 9411
5192 9411 10391 17769 44271 24165 3505 -1306 -11151 -19765 -25809 -25348 -31684 -12881 8589 20507
$$ packed form
5285b766K3867N064j6757N687K5219r408l0268J2769N307j3884M445j3474j4136
5272a8335Q22K4523J5497N264p225N213j9568M95j1084J656N187J8209J0396K343
5258C3393k7140j1719K533j6090R131J1309J6283q985q501k34J9839M417j3932
5245A0304j1185r442m390K3654P621L0387K926l589K772O395q259l4340o141k4576
5231a7863j5037J4210K7092L191j6338q423p569J36K6275O726j6636J0694j1674
5218e216r203K6962K2441r079l2482l0204m086K7606J8755O416l483K1387k047
5205B7767k5242n088j2348J4114Q109n244j1436L790P789o966o267J7124L309
5192I411R80P378K6502k0106k0660m811r845q614o044M61o336J8803K1470J1918
$$ plain form
5178 20507 2570 7944 -3253 -14333 -4347 -774 8840 8202 6839 15369 -15849 -26966 -11483
5165 -11483 -5344 785 -10158 4742 24966 22302 13543 -3337 5976 1650 15356 20258 16886
5152 16886 9864 20824 45103 48246 30334 40611 22212 7198 -13925 -9816 -8328 -31087 -54643
5139 -54643 -34253 -20302 -19980 -15114 -14284 -22029 -10691 -16638 -19170 -6974 802 -12 242 -8276 4228
5124 4228 4882 5917 -2711 13630 11030 29033 39607 8169 -326 113 8619 2431 -32304 -35526
5110 -35526 -17233 -14662 -28300 -23130 -7504 14567 15176 22059 540 -29292 -21736 23067 30465
5097 30465 32390 13328 43266 34745 34973 25474 42571 42924 39461 27413 19352 12880 8162 20940
5083 20940 18798 11873 17407 2734 -6626 4993 27631 19293 15151 -1340 -30308 -37678 -41700
$$ packed form
5178B0507j7937N374j1197j1080R986L573R614o38j363Q530l1218j1117J5483
5165a1483O139O129j0943J4900K0224k664q759j6880R313m326J3706M902l372
5152A6886p022J0960K4279L143j7912J0277j8399j5014k1123M109J488k2759k3556
5139e4643K0390J3951L22M866Q30p745J1338n947k532J2196P776q14K54q518J2504
5124D228O54J035q628J6341k600J8003J0574l1438q495M39Q506o188l4735l222
5110c5526J8293K571j3638N170J5626K2071O09O883k1519k9832P556M4803P398
5097C0465J925j9062K9938q521K28r499J7097L53l463j2048q061o472m718J2778
5083B0940k142o925N534j4673r360J1619K2638q338m142j6491k8968p370m022
$$ plain form
5070 -41700 -17425 10322 7715 15605 28947 25211 34601 45814 42973 20521 4418 -13988 -19514
5057 -19514 -13303 3564 -3101 10985 1932 -26553 -6386 -1182 11108 31738 56895 24072 21999
5044 21999 44459 26288 2376 -11864 -11032 -8726 -12472 -12110 -7442 5102 10802 13072 421 4333
5030 4333 16982 6041 3998 1202 -14237 -21002 -26069 -8523 11538 -14237 -31644 -13734 -380
5017 -380 3072 -5956 -15086 -6890 -7419 -22768 -8159 1816 -4043 -6925 -19857 -28890 -7563 10720
5003 10720 12825 6752 26210 23322 13061 -46 14347 28595 30027 59340 44497 24126 1460
4990 1460 -6616 -10292 -17171 -2621 -4325 -6306 -15776 -23957 -1068 9083 -3279 11316 28720
4977 28720 38712 24676 7758 -6497 -23861 -18691 2966 5442 -4397 -4482 -10110 -16559 -21776 -18206
$$ packed form
5070d1700K4275K7747k607P890J3342l736R390J1213k841k2452j6103j8406n526
5057a9514O211J6867o665J4086r053k8485K0167N204J2290K0630K5157l2823k073
5044B1999K2460j8171k3912j4240Q32K306l746L62M668J2544N700K270j2651L912
5030D333J2649j0941k043k796j5439o765n067J7546K0061k5775j7407J7910J3354
5017c80L452r028r130Q196n29j5349J4609R975n859k882j2932r033K1327J8283
5003A0720K105o073J9458k888j0261j3107J4393J4248J432K9313j4843k0371k2666
4990A460q076l676o879J4550j704j981r470q181K2889J0151j2362J4595J7404
4977B8720R992j4036j6918j4255j7364N170K1657K476r839q5n628o449n217L570
$$ plain form
4963 -18206 -12311 -8400 -21224 -3163 12325 14373 17165 5737 3410 3408 -166 4664 4978 14902 22163
4948 22163 12152 17126 15039 9261 2855 16550 36894 24917 9915 30144 35991 1778 4913
4935 4913 7686 -6668 -20381 -10113 2260 36162 20287 11414 -4693 -6222 7893 -2144 6623
4922 6623 12280 22360 8917 19917 9258 -5853 8468 7576 -5427 -25589 -26252 -16398 6760
4909 6760 6022 12657 24492 21187 21278 6007 -21972 -19405 -2850 -760 12224 1252 -18797 -22806
4895 -22806 -25143 -29329 -35933 -24470 -22454 -18419 -16592 -20758 -14455 -30645 -40438 -42922 -60735 -61191
4881 -61191 -46304 -49649 -56371 -45690 -28787 -18323 -9050 -13061 -4431 -1436 -4790 -1538 -2231 2570
4867 2570 -4778 -6900 -33454 -39317 -19900 1262 33416 24105 21899 20074 25993 29956 23688 -6106
$$ packed form
4963a8206N895L911j2824J8061J5488K048K792j1428k327kl574M830L14R924P261
4948B2163j0011M974k087n778o406J3695K0344j1977j5002K0229N847l4213L135
4935D913K773j4354j3713J0268J2373L3902j5875q873j6107j529J4115j0037Q767
4922F623N657J0080j3443J1000j0659j5111J4321q92j3003k0162o63R854K3158
4909F760p38O635J1835l305R1j5271k7979K567J6555K090J2984j0972k0049m009
4895b2806k337m186o604J1463K016M035J827m166O303j6190r793k484j7813m56
4881f1191J4887l345o722J0681J6903J0464R273m011Q630K995l354L252o93M801
4867B570p348k122k6554n863J9417K1162L2154r311k206j825N919L963o268k9794
$$ plain form
4853 -6106 -29454 -28049 13522 40177 45319 14660 -4952 -5138 1615 10673 24669 4082 1433
4840 1433 5709 7099 12655 13511 13693 477 -10382 -8283 9570 28206 25144 8123 2011 -2788
4826 -2788 8125 10099 -2609 -38276 -59718 -49826 -22481 -2284 22047 20561 9246 -14415 -4310
4813 -4310 -11984 -24756 -8873 -11474 2691 17919 27786 20901 11055 4966 -7463 -9089 -1015 18494
4799 18494 2681 4225 9949 3823 -8933 -1012 -7391 -17474 -4434 3757 11565 -240 1996
4786 1996 5341 -23366 -40281 -9938 26678 35292 36032 9435 -7511 -5296 -5429 1560 13062 22104
4772 22104 34039 36759 32566 28445 4128 -32640 -31364 -23397 -14748 -7623 -5267 593 5558 22190
4758 22190 -18105 -19927 -3118 -8389 -6135 22442 29844 11499 6382 -2628 -12313 -6911 1248 30910
$$ packed form
4853f106k3348J405M1571K6655N142l0659j9612j86O753R058J3996k0587k649
4840A433M276J390N556Q56J82j3216j0859K099J7853J8636l062j7021o112m799
4826b788J0913J974j2708l5667k1442R892K7345K0197K4331j486j1315k3661J0105
4813d310p674j2772J5883k601J4165J5228R867o885r846o089j2429j626Q074J9509
4799A8494j5813J544N724o126j2756P921o379j0083J3040Q191P808j1805K236
4786A996L345k8707j6915L0343L6616Q614P40k6597j6946K215j33O989J1502R042
4772B2104J1935K720m193m121k4317l6768J276P967Q649P125K356N860M965J6632
4758B2190m0295j822J6809n271K254K8577P402j8345n117r010r685N402Q159K9662
$$ plain form
4744 30910 27753 25868 16573 14965 12354 13610 25644 48746 29613 4329 -14690 -11699 -2043
4731 -2043 30495 31939 17183 23086 18587 26147 46159 19408 -1949 -7890 3639 7272 6314 10130
4717 10130 5323 4399 4599 -1041 7958 489 8796 1546 -11499 -11257 18308 34613 35958 24676
4703 24676 5547 -1310 -9516 -15941 -1091 3522 3147 624 -3981 25325 55559 57410 50733 55799
4689 55799 28259 -8637 -18269 -9923 -28268 -29154 -9399 -10895 8545 11781 12353 4018 1291 10256
4675 10256 13087 -11442 2768 2450 4868 3528 11426 23907 22363 11835 1432 -18045 -3229
4662 -3229 -6969 -119 -7234 -1942 9714 -7690 -14620 -7214 2760 1445 5771 -8517 -29341 -13105
4648 -13105 -13902 -13236 -27813 -13960 -13258 -10396 -13482 -3513 456 -301 17390 21328 16267 -2944 -10123
$$ packed form
4744C0910l157j885r295j608k611J256J2034K3102j9133k5284j9019K991R656
4731b043L2538J444j4756N903m499P560K0012k6751k1357n941J1529L633r58L816
4717A0130m807r24K00n640Q999p469Q307p250j3045K42K9565J6305J345j1282
4703B4676j9129o857q206o425J4850M613l75k523m605K9306L0234J851o677N066
4689E5799k7540l6896r632Q346j8345q86J9755j496J9440L236N72q335k727Q965
4675A0256K831k4529J4210l18K418j340P898J2481j544j0528j0403j9477J4816
4662c229l740O850p115N292J1656j7404o930P406R974j315M326j4288k0824J6236
4648a3105p97O66j4577J3853P02K862l086R969L969p57J7691L938n061j9211p179
$$ plain form
4633 -10123 6139 13057 1901 -11869 -15660 -17381 -1336 9645 1327 -2174 -3159 -9195 -8979 11567
4619 11567 13326 18763 20509 31111 35962 19642 25940 22632 39742 52207 53754 40430 39436 35350
4605 35350 23209 2936 -12297 -16056 -11081 -4924 18671 13238 32144 36678 26352 19055 7138
4592 7138 27742 58487 40411 9777 19606 9892 -13162 -18876 4254 -14531 -22212 -5070 24395
4579 24395 31868 33740 10643 6376 -5973 -3941 -19608 -22930 -1626 17315 24548 11282 14464
4566 14464 11380 10660 31483 26794 3934 12363 5130 11548 9151 22049 49173 39755 41938 63177
4552 63177 61947 49030 20108 -20562 -31848 -5267 -5388 -2995 -5238 -21938 -16362 1556 1442
4539 1442 -9641 -4645 -13976 -26516 -16585 3296 -3922 1575 29448 47837 35236 7547 -16081
$$ packed form
4633a0123J6262O918j1156j3770l791j721J6045J0981q318l501r85o036K16K0546
4619A1567J759N437J746J0602M851j6320O298l308J7110J2465J547j3324r94m086
4605C5350j2141k0273j5233l759M975O157K3595n433J8906M534j0326p297j1917
4592G138K0604L0745j8076l0634R829r714k3054n714K3130j8785p681J7142K9465
4579B4395P473J872k3097m267j2349K032j5667l322K1304J8941P233j3266L182
4566A4464l084p20K0823m689k2860Q429p233O418k397J2898K7124r418K183K1239
4552F3177j230j2917k8922m0670j1286K6581j21K393k243j6700N576J7918j14
4539A442j1083M996r331j2540R931J9881p218N497K7873J8389j2601k7689k3628
$$ plain form
4526 -16081 -6436 23741 20606 27594 4701 18062 28478 4971 -14277 -23558 -8960 -8577 -21447
4513 -21447 -22098 -14274 -40657 -54982 -22343 -4330 -5862 -12237 -27333 -52071 -14603 18555 22918
4500 22918 21273 -824 8063 17718 30348 32717 22124 27114 13895 -3736 -29374 -38279 -29687
4487 -29687 -30106 -16172 -7848 -28740 -42058 -38619 -43905 -23401 1747 8223 -15964 -20230 2411
4474 2411 13046 35773 34459 19918 30965 45645 41815 55945 64956 71783 51114 9603 10242
4461 10242 27488 46308 24032 -10432 -5335 7140 4716 -1170 -8528 -14364 -952 19398 23282
4448 23282 45433 17493 9246 38314 30456 5618 -1812 -19783 -34687 -37431 -12279 25124 22771
4435 22771 12498 10881 5005 5342 19164 31446 33722 24380 14976 31563 25952 20938 38080 56370
$$ packed form
4526a6081R645L0177l135O988k2893J3361J0416k3507j9248r281J4598L83j2870
4513b1447o51P824k6383j4325L2639J8013j532o375j5096k4738L7468L3158M363
4500B2918j645k2097Q887R655J2630K369j0593M990j3219j7631k5638q905Q592
4487b9687m19J3934Q324k0892j3318L439n286K0504K5148O476k4187m266K2641
4474B411J0635K2727j314j4541J1047J4680l830J4130R011O827k0669m1511O39
4461A0242J7246J8820k2276l4464N097J2475k424n886p358n836J3412K0350L884
4448B3282K2151k7940q247K9068p858k4838p430j7971j4904k744K5152L7403k353
4435B2771j0273j617n876L37J3822J2282K276r342r404J6587n611n014J7142J8290
$$ plain form
4421 56370 38926 40826 58241 17894 -10305 -13446 6140 16530 12608 3647 -19152 -38984 -38219
4408 -38219 -33848 -25640 9699 22534 20208 9188 26445 18520 8461 241 -3973 -15613 -2740
4395 -2740 4120 -4359 -7848 -6519 19505 10363 -15248 -25404 -28455 -24216 -4624 18207 25776 17626
4381 17626 11732 13902 11628 13890 3215 -640 3813 11324 -5243 -15324 -34541 -40245 -4651
4368 -4651 13296 26031 31709 51241 52562 33701 15327 21574 15957 2077 18467 26716 13726
4355 13726 8605 4780 -16572 -25376 -15743 1457 3510 -1976 -4091 13920 19542 -271 -9920 8255
4341 8255 -12797 -25107 -7924 7345 9709 1744 -1742 -3109 -14391 -14140 14205 24932 21650
4328 21650 21676 20556 6446 -11049 -20732 -16566 -309 -11810 -4872 -13435 -31006 -33392 -23692 -18186
$$ packed form
4421E6370j7444J900J7415m0347k8199l141J9586J0390l922q961k2799j9832P65
4408c8219M371Q208L5339J2835k326j1020J7257p925j0059q220m214j1640J2873
4395b740O860q479l489J329K6024r142k5611j0156l051M239J9592K2831P569q150
4381A7626n894K170k274K262j0675l855M453P511j6567j0081j9217n704L5594
4368d651J7947J2735N678J9532J321j8861j8374O247n617j3880J6390Q249j2990
4355A3726n121l825k1352q804R633J7200K053n486k115J8011N622j9813r649J8175
4341H255k1052j2310J7183J5269K364p965l486j367j1282K51K8345J0727l282
4328B1650K6j120j4110j7495r683M166J6257j1501O938q563j7571k386R700N506
$$ plain form
4314 -18186 -12958 -13445 -275 9958 8047 15221 6926 11860 -4220 -15122 336 -11276 1415
4301 1415 14418 7782 11667 4039 10106 39322 43820 34670 21971 -9682 -29983 -8786 2434
4288 2434 -5561 12942 22275 30708 37482 34561 42852 34458 31169 46280 36427 10301 9937 5371
4274 5371 16712 15595 3389 971 -3167 -15422 2289 10438 16869 18614 19071 8712 29520 23115
4260 23115 4644 -7520 -17421 -20207 -16507 -156 -24843 -20221 -15937 -2200 10094 10959 8383
4247 8383 17753 15987 9119 -4472 -13764 -20942 3013 -3409 6236 -1190 7195 4781 17906 17845 -8822
4232 -8822 5552 -2244 -10890 -26328 -45440 -27241 18047 34162 27790 40547 30675 28411 27495
4219 27495 15828 19185 24675 28264 574 -6299 33464 30254 15220 11155 -7780 -41359 -27950
$$ packed form
4314a8186N228m87J3170J0233j911P174q295M934j6080j0902J5458j1612J2691
4301A415J3003o636L885p628O067K9216M498r150j2699l1653k0301K1197J1220
4288B434p995J8503R333Q433O774k921Q291q394l289J5111r853k6126l64m566
4274E371J1341j117j2206k418m138j2255J7711Q149O431J745M57j0359K0808o405
4260B3115j8471j2164r901k786L700J6351k4687M622M284J3737J2294Q65k576
4247H383R370j766o868j3591r292p178K3955o422R645p426Q385k414J3125o1k6667
4232h822J4374p796q646j5438j9112J8199M5288J6115o372J2757r872k264r16
4219B7495j1667L357N490L589k7690o873L9763l210j5034m065j8935l3579J3409
$$ plain form
4206 -27950 -13455 -26079 -27100 -8497 5913 2548 5364 -2206 21801 20701 15991 19964 24494
4193 24494 26373 34670 26834 14864 -6608 -25527 -37963 -8737 -3790 3777 4327 6698 18942
4180 18942 25809 42779 37510 21276 14633 24344 41372 36674 31240 29765 9630 -7576 -14934
4167 -14934 -15703 -16547 -8989 -8438 -3437 30142 25183 4480 -19940 -24088 -27053 -8467 5328 -6766
4153 -6766 -7847 -8216 -921 -6718 -12238 -5735 -10308 -19413 -18219 -5132 5358 24765 42700 68521
4139 68521 76090 55557 28735 21402 3239 -187 -15792 -8236 -3606 12763 17577 14167 26604
4126 26604 18575 21327 31787 30220 19146 19490 14616 -13511 -24912 -13556 14334 26693 24167
4113 24167 9571 17338 21280 12718 2080 -11102 -1176 6462 17475 10768 19206 28829 41705
$$ packed form
4206b7950J4495j2624j021J8603J4410l365K816p570K4007j100m710L973M530
4193B4494J879Q297p836j1970k1472j8919j2436K9226M947P567N50K371J2244
4180A8942O867J6970n269j6234o643R711J7028m698n434j475k0135j7206p358
4167a4934p69q44P558N51N001L3579m959k0703k4420m148k965J8586J3795j2094
4153f766j081l69P295n797n520O503m573r105J194J3087J0490J9407J7935K5821
4139F8521P569k0533k6822p333j8163l426j5605P556M630J6369M814l410J2437
4126B6604q029K752J0460j567j1074L44m874k8127j1401J1356K7890J2359k526
4113B4167j4596P767L942q562j0638j3182R926P638J1013o707Q438R623J2876
$$ plain form
4100 41705 43545 29640 23888 19981 15792 -3944 -17650 -8552 20375 1753 -13939 -25002 -20877
4087 -20877 -3782 1505 -10556 -13876 -8385 2988 7380 12308 4289 6042 -16799 -10196 -7178 18942
4073 18942 26945 20191 -2681 -6001 11556 37944 50825 36951 38928 61001 44615 25125 20703
4060 20703 22162 14287 3356 5349 25324 36406 35665 29339 10450 -14365 -29179 -14196 7644
4047 7644 21053 29406 24489 15929 -1652 -17050 -5720 1049 13127 38065 24743 -360 7679
4034 7679 14568 -6694 -21572 4791 15559 22141 29317 31382 25119 10414 -16537 -25560 -10886
4021 -10886 393 795 -16900 -32412 -12622 -10274 -13725 3333 -492 -27439 11467 40359 21283
4008 21283 1676 -10464 7553 24959 22400 40755 43853 23861 39362 51595 30927 21702
$$ packed form
4100D1705J840j3905n752l907m189j9736j3706R098K8927j8622j5692j1063M125
4087b0877J7095N287j2061l320N491J1373M392M928q019J753k2841O603L018K6120
4073A8942Q003o754k2872l320J7557K6388J2881j3874J977K2073j6386j9490m422
4060B0703J459p875j0931J993J9975J1082p41o326j8889k4815j4814J4983K1840
4047G644J3409Q353m917q560j7581j5398J1330O769J2078K4938j3322k5103Q039
4034G679O889k1262j4878K6363J0768O582P176K065o263j4705k6951r023J4674
4021a0886J1279M02j7695j5512J9790K348l451J7058l825k6947L8906K8892j9076
4008B1283j9607j2140J8017J7406k559J8355L098j9992J5501J2233k0668r225
$$ plain form
3996 21702 35493 11859 -29527 -47385 -43250 -25166 1978 13664 10912 12020 33771 46752
3984 46752 14379 13549 20108 37176 6627 -13225 -7599 19649 23570 3556 -9969 -4825 -13391
3971 -13391 -8217 1645 -11535 -15669 16742 16036 425 6858 21732 7897 19267 11626 2412
3958 2412 -27640 -47000 -38173 -52031 -33687 -21510 -31691 -37472 -34008 -24833 -17429 -5854 18365
3945 18365 31419 27406 34339 40779 20409 18335 21410 35312 31766 15829 9778 8586 -3210
3932 -3210 -17471 -14074 -26835 -28715 -21557 -12835 978 19322 20978 21015 3162 -9721 -206 4138
3918 4138 -52 19130 23858 23650 17605 23488 21700 -7274 -17038 -18339 -19283 -16411 -26056 -32740 -18767
3903 -18767 -12097 9489 30833 44997 31440 13466 -1580 -4669 -4968 -22684 -11222 -7661 -13621
$$ packed form
3996B1702J3791k3634m1386j7858M135J8084K7144J1686k752J108K1751J2981
3984D6752l2373q30O559J7068l0549j9852N626K7248L921k0014j3525N144q566
3971a3391N174R862j3180m134L2411p06j5611O433J4874j3835J1370p641r214
3958B412l0052j9360Q827j3858J8344J2177j0181n781L464R175P404J1575K4219
3945A8365J3054m013O933O440k0370k074L075J3902l546j5937o051j192j1796
3932c210j4261L397j2761j880P158Q722J3813J8344J656L7j7853j2883R515M344
3918D138m190J9182M728k08o045N883j788k8974r764j301r44K872r645o684J3973
3903a8767O670K1586K1344J4164j3557j7974j5046l089k99j7716J1462L561n960
$$ [...]
##END NTUPLES=NMR SPECTRUM
##END=
