##TITLE=Analysis number 309029
Compound Code cc 14713
Book Reference 302/176
Project Code adrs
Chemist Name toml
##JCAMPDX= 6.0         $$ Bruker NMR JCAMP-DX V2.0
##DATA TYPE= NMR SPECTRUM
##DATA CLASS= NTUPLES
##ORIGIN= Bruker BioSpin GmbH
##OWNER= NMR
$$ XWIN-NMR		Version 3.5
$$ Fri May 27 10:57:07 2005 GMT Daylight Time (UT+1h)  MAYBRIDGE\NMR@NMR_250MHZ
##.OBSERVE FREQUENCY= 250.131544655141
##.OBSERVE NUCLEUS= ^1H
##.ACQUISITION MODE= SIMULTANEOUS (DQD)
##.ACQUISITION SCHEME= undefined
##.AVERAGES= 16
##.DIGITISER RES= 18
##SPECTROMETER/DATA SYSTEM= dpx250
##.PULSE SEQUENCE= zg30
##.SOLVENT NAME= CDCl3
##.SHIFT REFERENCE= (INTERNAL, CDCl3, 0, 16.522)
##AUDIT TRAIL= $$ (NUMBER, WHEN, WHO, WHERE, WHAT)
$$ ##TITLE= Audit trail, XWIN-NMR		Version 3.5
$$ ##JCAMPDX= 5.01
$$ ##ORIGIN= Bruker BioSpin GmbH
$$ ##OWNER= NMR
$$ C:\u/data/dgb/nmr/ADRS/3630/pdata/1/auditp.txt
$$ ##AUDIT TRAIL=  $$ (NUMBER, WHEN, WHO, WHERE, WHAT)
(   1,<2005-05-27 10:56:45.95 +100>,<MAYBRIDGE\NMR>,<NMR_250MHZ>,
      <created by zg, POWCHK disabled, PULCHK disabled
       configuration hash MD5:
       62 19 C7 07 E1 42 D1 B7 37 6C 3D D0 77 39 F9 E6
       data hash MD5: 64K
       A4 6D FD 34 C9 49 35 0E 95 D7 52 DA E9 3C 6A CA>)
(   2,<2005-05-27 10:56:57.84 +100>,<MAYBRIDGE\NMR>,<NMR_250MHZ>,
      <Start of raw data processing
       ef LB = 0.3 FT_mod = 6 PKNL = 1 SI = 32K 
       data hash MD5: 32K
       6F 53 EC 23 C7 7F E6 6C 5A C6 E4 B5 06 32 3E 8A>)
(   3,<2005-05-27 10:56:59.98 +100>,<MAYBRIDGE\NMR>,<NMR_250MHZ>,
      <apk 
       data hash MD5: 32K
       22 0C 52 84 85 B4 07 E0 5B D4 E4 26 61 BE 66 57>)
(   4,<2005-05-27 10:57:00.73 +100>,<MAYBRIDGE\NMR>,<NMR_250MHZ>,
      <abs ABSG = 5 
       data hash MD5: 32K
       A0 6E 1D 09 15 EB 6C CA 30 50 2C 74 2B EC 45 A8>)
$$ ##END=
$$ 
$$ hash MD5
$$ 85 12 A7 2D 7C BE 75 5D C1 87 E4 EE 7E 9D 6C CB
##$RELAX= 
##$RELAX= 
##$RELAX= 
##$RELAX= 
##$RELAX= 
##$RELAX= 
##$RELAX= 
$$ Bruker specific parameters
$$ --------------------------
##$DU= <C:\u>
##$EXPNO= 3630
##$NAME= <ADRS>
##$PROCNO= 1
##$TYPE= <nmr>
##$USER= <dgb>
##$AMP= (0..31)
100 100 100 100 100 100 100 100 100 100 100 100 100 100 100 100 100 100 
100 100 100 100 100 100 100 100 100 100 100 100 100 100 
##$AQSEQ= 0
##$AQ_mod= 3
##$AUNM= <au_zg>
##$AUTOPOS= <5 >
##$BF1= 250.13
##$BF2= 250.13
##$BF3= 250.13
##$BF4= 250.13
##$BF5= 500.13
##$BF6= 500.13
##$BF7= 500.13
##$BF8= 500.13
##$BYTORDA= 1
##$CFDGTYP= 0
##$CFRGTYP= 5
##$CHEMSTR= <none>
##$CNST= (0..31)
1 1 145 1 1 1 1 1 1 1 1 1 1 1 1 1 1 1 1 1 1 1 1 1 1 1 1 1 1 1 1 1 
##$CPDPRG= <>
##$CPDPRG1= <>
##$CPDPRG2= <>
##$CPDPRG3= <>
##$CPDPRG4= <mlev>
##$CPDPRG5= <mlev>
##$CPDPRG6= <mlev>
##$CPDPRG7= <mlev>
##$CPDPRG8= <mlev>
##$CPDPRGB= <>
##$CPDPRGT= <>
##$D= (0..31)
0 1 0 0 0 0 0 0 0 0.06 0 0 0 0 0 0 0.0002 0 0 0 0 0 0 0 0 0 0 0 0 0 0 
0 
##$DATE= 1117187805
##$DBL= (0..7)
120 120 120 120 120 120 120 120 
##$DBP= (0..7)
150 150 150 150 150 150 150 150 
##$DBP07= 0
##$DBPNAM0= <>
##$DBPNAM1= <>
$$ [...]
##$SUBNAM7= <"">
##$SUBNAM8= <"">
##$SUBNAM9= <"">
##$SW= 20.6930455092707
##$SWIBOX= (0..15)
0 0 3 0 0 0 0 0 0 0 0 0 0 0 0 0 
##$SW_h= 5175.983436853
##$TD= 65536
##$TD0= 1
##$TE= 295.16
##$TE2= 300
##$TE3= 300
##$TEG= 300
##$TL= (0..7)
0 120 120 120 120 120 120 120 
##$TP= (0..7)
150 150 150 150 150 150 150 150 
##$TP07= 0
##$TPNAME0= <>
##$TPNAME1= <>
##$TPNAME2= <>
##$TPNAME3= <>
##$TPNAME4= <>
##$TPNAME5= <>
##$TPNAME6= <>
##$TPNAME7= <>
##$TPOAL= (0..7)
0.5 0.5 0.5 0.5 0.5 0.5 0.5 0.5 
##$TPOFFS= (0..7)
0 0 0 0 0 0 0 0 
##$TUNHIN= 0
##$TUNHOUT= 0
##$TUNXOUT= 0
##$USERA1= <user>
##$USERA2= <user>
##$USERA3= <user>
##$USERA4= <user>
##$USERA5= <user>
##$V9= 5
##$VALIST= <valist>
##$VCLIST= <CCCCCCCCCCCCCCC>
##$VD= 0
##$VDLIST= <DDDDDDDDDDDDDDD>
##$VPLIST= <PPPPPPPPPPPPPPP>
##$VTLIST= <TTTTTTTTTTTTTTT>
##$WBST= 1024
##$WBSW= 4
##$XGAIN= (0..3)
0 0 0 0 
##$XL= 0
##$YL= 0
##$YMAX_a= 654694
##$YMIN_a= -545420
##$ZGOPTNS= <>
##$ZL1= 120
##$ZL2= 120
##$ZL3= 120
##$ZL4= 120
##$ABSF1= 16.522
##$ABSF2= -4.171173
##$ABSG= 5
##$ABSL= 3
##$ALPHA= 0
##$AQORDER= 0
##$ASSFAC= 0
##$ASSFACI= 0
##$ASSFACX= 0
##$ASSWID= 0
##$AUNMP= <proc_1d>
##$AZFE= 0.1
##$AZFW= 0.1
##$BCFW= 0
##$BC_mod= 0
##$BYTORDP= 0
##$COROFFS= 0
##$CY= 12.5
##$DATMOD= 1
##$DC= 0
##$DFILT= <>
##$DTYPP= 0
##$F1P= 14.0000005364418
##$F2P= -0.99999901652339
##$FCOR= 0.5
##$FTSIZE= 32768
##$FT_mod= 6
##$GAMMA= 0
##$GB= 0
##$INTBC= 1
##$INTSCL= 1
##$ISEN= 128
##$LB= 0.3
##$LEV0= 0
##$LPBIN= 0
##$MAXI= 10000
##$MC2= 0
##$MEAN= 0
##$ME_mod= 0
##$MI= 0
##$NCOEF= 0
##$NC_proc= -3
##$NLEV= 6
##$NOISF1= 0
##$NOISF2= 0
##$NSP= 0
##$NTH_PI= 0
##$NZP= 0
##$OFFSET= 16.522
##$PC= 1
##$PHC0= 142.0102
##$PHC1= -9.439454
##$PH_mod= 1
##$PKNL= yes
##$PPARMOD= 0
##$PSCAL= 4
##$PSIGN= 0
##$REVERSE= no
##$SF= 250.13
##$SI= 32768
##$SIGF1= 0
##$SIGF2= 0
##$SINO= 400
##$SIOLD= 32768
##$SREGLST= <1H.CDCl3>
##$SSB= 0
##$STSI= 32768
##$STSR= 0
##$SW_p= 5175.98343685301
##$SYMM= 0
##$S_DEV= 0
##$TDeff= 65536
##$TDoff= 0
##$TI= <Analysis number 999999
Compound Code 99
Book Reference 9
Project Code 9>
##$TILT= no
##$TM1= 0
##$TM2= 0
##$TOPLEV= 0
##$USERP1= <user>
##$USERP2= <user>
##$USERP3= <user>
##$USERP4= <user>
##$USERP5= <user>
##$WDW= 1
##$XDIM= 32768
##$YMAX_p= 505112232
##$YMIN_p= -29035
$$ End of Bruker specific parameters
$$ ---------------------------------
##NTUPLES= NMR SPECTRUM
##VAR_NAME=  FREQUENCY,     SPECTRUM/REAL,   SPECTRUM/IMAG
##SYMBOL=    X,             R,               I
##VAR_TYPE=  INDEPENDENT,   DEPENDENT,       DEPENDENT
##VAR_FORM=  AFFN,          ASDF,            ASDF
##VAR_DIM=   32768,         32768,           32768
##UNITS=     HZ,            ARBITRARY UNITS, ARBITRARY UNITS
##FACTOR=    0.157963299565203, 1,           1
##FIRST=     4132.6476996994, 0,             0
##LAST=      -1043.33573715361, 0,           0
##MIN=       -1043.33573715361, -29035,      0
##MAX=       4132.6476996994, 505112232,     0
$$ Real data points
##PAGE= N=1
##DATA TABLE= (X++(R..R)), XYDATA
$$ [...]
$$ plain form
16444 555 -5868 -6495 -2269 1179 727 -5285 -7452 -7237 -4596 -3707 -2068 -837 -4886 -6612 -5691 -1488
16428 -1488 1492 -1486 -2890 -3177 -714 3039 6370 1130 -5885 -9620 -7847 -5962 -1853 -1935 -1001 -1437
16412 -1437 -1062 -2258 521 -207 -6515 -7479 -7216 -7918 -10385 -9943 -2961 1219 1385 -348 -3282 -2079
16396 -2079 -2506 -320 -2021 -4364 -1797 346 1289 1664 -2659 -5026 -5351 -7413 -10169 -10314 -10514 -8523
16380 -8523 -7829 -4756 -5117 -8088 -3947 307 -2661 -1975 -612 -3584 -5626 -5485 -1070 2478 4092 5241
16364 5241 986 -1058 -4582 -4741 -3573 -6485 -6531 -5914 -7696 -5827 -6081 -6990 -5357 -5107 -3674 -2300
16348 -2300 -980 -2614 -7757 -11066 -8207 -1696 -2343 -6264 -9185 -9471 -3420 -2747 -6145 -6137 -5783 -9728
16332 -9728 -10519 -9307 -8923 -6872 -6986 -6369 -7455 -4916 -2437 -4450 -6616 -4804 -3928 -5670 -4069 -5193
$$ packed form
16444E55o423o27M226L448m52o012k167K15K641Q89J639J231m049j726R21M203
16428a488K980k978j404k87K463L753L331n240p015l735J773J885M109q2R34m36
16412a437L75j196K779p28o308r64K63p02k467M42O982M180J66j733k934J203
16396b079m27K186j701k343K567K143R43L75m323k367l25k062k756j45k00J991
16380h523O94L073l61k971M141M254k968O86J363k972k042J41M415L548J614J149
16364E241m255k044l524j59J168k912m6O17j782J869k54r09J633K50J433J374
16348b300J320j634n143l309K859O511o47l921k921k86O051O73l398QL54l945
16332i728p91J212L84K051j14O17j086K539K479k013k166J812Q76j742J601j124
$$ plain form
16316 -5193 -8795 -7692 -5641 -1488 2911 4035 2583 1204 99 -1220 -3318 -2037 3060 4146 3650
16301 3650 6186 5421 3322 412 -650 -884 -4964 -8777 -9501 -8283 -5769 -5370 -4906 -7053 -5753 -5301
16285 -5301 -4821 -3191 -442 -3220 -8615 -8437 -2860 -118 -599 -3545 -1845 -4220 -105 1310 -2387
16270 -2387 -3561 -5064 -4948 -2318 -5296 -6126 -3591 2899 5108 1902 -292 -5797 -7581 -5356 -1235
16255 -1235 3374 8919 7394 -36 -6028 -8601 -3578 -1479 793 -191 -2275 -1558 -4136 -5066 -419
16240 -419 390 969 -2051 -3152 -452 -1694 -4752 -5098 -4887 -4321 -3169 -5088 -6771 -6267 -4832 -4147 -4737
16223 -4737 -5388 -7300 -7796 -5616 -8102 -11223 -13641 -15342 -12793 -15652 -15104 -13117 -13084 -11148 -7374 -1510
16207 -1510 -2993 -4944 -9130 -10952 -8835 -5592 -3351 -7874 -7643 -4100 -3620 -1862 -930 662 342 -3487
$$ packed form
16316e193l602J103K051M153M399J124j452j379j105j319k098J281N097J086m96
16301C650K536p65k099k910j062k34m080l813p24J218K514L99M64k147J300M52
16285e301M80J630K749k778n395J78N577K742m81k946J700k375M115J415l697
16270b387j174j503J16K630k978q30K535O490K209l206k194n505j784K225M121
16255a235M609N545j525p430n992k573N023K099K272r84k084P17k578r30M647
16240d19Q09N79l020j101K700j242l058l46K11N66J152j919j683N04J435O85n90
16223d737o51j912m96K180k486l121k418j701K549k859N48J987L3J936L774N864
16207a510j483j951m186j822K117L243K241m523K31L543M80J758R32J592l20l829
$$ plain form
16191 -3487 -2047 544 100 -624 881 1337 1004 -3039 -1494 -770 -6531 -10114 -6410 -7365 -5661 -963
16175 -963 -1404 -7185 -9643 -10398 -8013 -5082 -6626 -4343 -3413 -3946 -5367 -2460 -755 1159 778 -1281
16159 -1281 -3707 -432 956 -153 -926 266 665 1070 664 2487 151 1537 -668 647 -229 -686
16143 -686 -217 -1677 -2923 -2200 -1634 -291 -1170 -5298 -4852 -4592 -6156 -8095 -7483 -7177 -9611 -12798 -14393
16126 -14393 -11221 -7330 -7825 -7855 -5424 -3583 -4207 -2019 -1914 -5130 -10441 -10417 -8783 -9707 -7755 -4415
16110 -4415 -5915 -5798 -3725 -1744 -1908 -3326 1201 5373 3125 90 458 1918 1857 -2673 -3155 -1825
16094 -1825 -3866 -5304 -542 4043 2856 342 -4348 -5116 -2114 -1058 -3784 -3248 -7527 -12491 -11377
16079 -11377 -8957 -6629 -6792 -8888 -4813 -2518 -5542 -5928 -4408 -1628 -2868 -5244 -4034 -396 1066
$$ packed form
16191c487J440K591m44p24J505M56l33m043J545P24n761l583L704r55J704M698
16175i63m41n781k458p55K385K931j544K283R30n33j421K907J705J914l81k059
16159a281k426L275J388j109p73J192L99M05m06J823k336J386k205J315q76m57
16143f86M69j460j246P23N66J343q79m128M46K60j564j939O12L06k434l187j595
16126a4393L172L891m95l0K431J841o24K188J05l216n311K4J634r24J952L340
16110d415j500J17K073J981j64j418M527M172k248l035L68J460o1m530m82J330
16094a825k041j438M762M585j187k514m690p68L002J056k726N36m279m964J114
16079a1377K420K328j63k096M075K295l024l86J520K780j240k376J210L638J462
$$ plain form
16064 1066 1334 1908 593 2856 1135 -1733 -2090 -4436 -2630 -3104 -3775 -2538 1540 230 302 898 -1659
16047 -1659 -3950 -4376 1048 1706 -1277 -3539 -1326 -356 1238 -958 -2257 -1651 -1279 1203 556 -453
16031 -453 -1927 -2886 -4094 -1692 1964 1285 -529 -4991 -7450 -6313 -6713 -9013 -9574 -4708 -4819 -6976
16015 -6976 -8160 -6350 -4754 -4838 -3034 1419 1045 -2947 -2019 -6185 -3574 270 -1147 -2581 -4071 -5300
15999 -5300 -3212 1225 1556 -3281 -1921 2454 1767 -2132 -5486 -948 1103 3224 5061 4371 804
15984 804 888 3336 4559 4617 3753 -1096 -2271 -1350 -2393 1590 1253 -4433 -5509 -7620 -8407 -9329 -5908
15967 -5908 -7125 -3548 -1268 -976 151 479 4489 3239 2072 1862 2413 -318 -703 -716 -4774 -3514
15951 -3514 19 -2347 231 140 448 2541 -2738 -4640 -3373 -2560 -3102 -3236 -2809 -1621 784 563 -4437
$$ packed form
16064A066K68N74j315K263j721k868l57k346J806m74o71J237M078j310P2N96k557
16047a659k291m26N424O58k983k262K213R70J594k196j299O06L72K482o47j009
16031d53j474r59j208K402L656o79j814m462k459J137m00k300n61M866j11k157
16015f976j184J810J596q4J804M453l74l992R28m166K611L844j417j434j490j229
15999e300K088M437L31m837J360M375o87l899l354M538K051K121J837o90l567
15984H04Q4K448J223N8q64m849j175R21j043L983l37n686j076k111p87r22L421
15967e908j217L577K280K92J127L28M010j250j167k10N51k731l85j3m058J260
15951c514L533k366K578r1L08K093n279j902J267Q13n42j34M27J188K405k21n000
$$ plain form
15934 -4437 -6867 -6279 -7589 -6326 -7173 -8939 -9327 -7243 -2612 -2794 -5684 -6064 -8570 -7465 -4227 -3667
15918 -3667 -6598 -11980 -10770 -5953 -3167 -1037 -2277 2702 5986 731 -4326 -8524 -6941 -6910 -3795
15903 -3795 -2160 -3293 -7262 -5549 -5502 -5041 -3189 -6190 -8107 -5863 -3084 -6406 -11371 -7563 -2179
15888 -2179 279 2475 -3314 -4631 -3479 -4912 -2874 -935 -2858 -5390 -6318 -3639 -2416 1907 554
15873 554 -1894 1480 -1370 -4180 -2468 1686 3867 4836 -2591 -7943 -5181 -4701 573 1672 2237 1184
15857 1184 1955 -1723 -837 -546 -5039 -5141 -2602 -3610 -7735 -8146 -3959 -2530 -7074 -8476 -7945 -7664
15841 -7664 -5457 -1471 -715 -848 1317 -3081 -10181 -8900 -6072 -7425 -6001 -4302 -4570 -5941 -4559
15826 -4559 -3120 -1052 -2057 -3100 -4636 -4284 -5001 -3082 -1669 -1154 -900 -4328 -4864 -3230 -5023 -7145
$$ packed form
15934d437k430N88j310J263q47j766l88K084M631j82k890l80k506J105L238N60
15918c667k931n382J210M817K786K130j240M979L284n255n057m198J583L1L115
15903c795J635j133l969J713M7M61J852l001j917K244K779l322m965L808N384
15888b179K458K196n789j317J152j433K038J939j923k532r28K679J223M323j353
15873E54k448L374k850k810J712M154K181R69p427n352K762M80N274J099N65j053
15857A184P71l678Q86K91m493j02K539j008m125m11M187J429m544j402N31K81
15841g664K207L986P56j33K165m398p100J281K828j353J424J699k68j371J382
15826d559J439K068j005j043j536L52p17J919J413N15K54l428n36J634j793k122
$$ plain form
15810 -7145 -8296 -9871 -8533 -3011 -3157 -6776 -9214 -8325 -6187 -5336 -5281 -4414 -4178 -1862 1212 1645 4021
15793 4021 1530 -1518 -2828 -4957 -6345 -5614 -2864 125 200 2134 6086 6609 5273 8053 8091 6424
15777 6424 1341 -4483 -3650 -3250 -4997 -6527 -7487 -7542 -4896 -3774 -1122 -1899 -325 -672 -3438 -2196
15761 -2196 -3412 -3442 -6156 -3782 -705 2739 196 -363 1129 -2667 -2424 -2626 -4747 -4016 104 -1046
15745 -1046 -1572 -695 1992 310 -3356 -4218 -3305 -4115 -6921 -8242 -9199 -5613 -3265 -2881 -413 -2091
15729 -2091 -6019 -7599 -6554 -5648 -1437 1720 445 1080 4434 4836 1543 -98 -2703 -2053 1385 2223
15713 2223 -912 -1648 -558 -485 626 2623 2437 -442 -523 -396 -2246 -4401 -2403 -1615 -4074 -4091 -3326
15696 -3326 -4082 -3665 -6120 -7539 -6321 -2619 -4742 -7163 -5550 -4513 -5853 -3160 -497 -5039 -6320
$$ packed form
15810g145j151j575J338N522j46l619k438Q89K138Q51N5Q67K36K316L074M33K376
15793D021k491l048j310k129j388P31K750K989P5J934L952N23j336K780L8j667
15777F424n083n824Q33M00j747j530r60n5K646J122K652p77J574l47k766J242
15761b196j216l0k714K374L077L444k543n59J492l796K43k02k121P31M120j150
15745a046n26Q77K687j682l666q62R13q10k806j321r57L586K348L84K468j678
15729b091l928j580J045R06M211L157j275O35L354M02l293j641k605O50L438Q38
15713B223l135p36J090P3J111J997j86k879q1J27j850k155J998P88k459j7P65
15696c326p56M17k455j419J218L702k123k421J613J037j340K693K663m542j281
$$ plain form
15681 -6320 -6303 -8454 -7636 -7547 -5149 -3979 -2755 -2522 -3026 -3972 -5097 -7609 -10932 -10263 -7074 -7468 -6727
15664 -6727 -4359 -4199 -4014 -3550 -4106 -7068 -4507 -3264 -2301 -6813 -5911 -7619 -6838 -7768 -3465 -3695 -5426
15647 -5426 -5435 -5644 -9391 -10071 -7594 -4529 -3371 -4437 -1897 1016 1037 -101 -1701 -4491 -5440 -5787 -11775
15630 -11775 -15043 -13110 -12363 -9191 -5008 -4188 -3854 -5234 -3305 -1418 1208 1444 762 3647 1540 -171
15614 -171 -3644 -457 2880 2919 2242 4831 2908 -2759 -5735 -9300 -8372 -6426 -6282 -4112 -1895 -1490
15598 -1490 -3001 -5349 -3127 -5203 -4117 -1987 -257 5598 4654 2721 682 -3002 -1375 -1062 -1371
15583 -1371 -1225 -1751 621 -2004 -1355 -217 -806 1262 2938 6569 8028 6292 4189 7552 11496 12267
15567 12267 14175 16745 15827 11070 7776 3737 -698 -3642 -4393 -1775 -2937 -4325 -8325 -8551 -9702
$$ packed form
15681f320J7k151Q18Q9K398J170J224K33n04r46j125k512l323O69L189l94P41
15664f727K368J60J85M64n56k962K561J243R63m512R02j708P81r30M303k30j731
15647e426rk09l747o80K477L065J158j066K540K913K1j138j600k790r49l47n988
15630a1775l268J933P47L172M183Q20L34j380J929J887K626K36o82K885k107j711
15614a71l473L187L337L9o77K589j923n667k976l565R28J946J44K170K217M05
15598a490j511k348K222k076J086K130J730N855r44j933k039l684J627L13l09
15583a371J46n26K372k625O49J138n89K068J676L631J459j736k103L363L944P71
15567A2267J908K570r18m757l294m039m435k944p51K618j162j388m000k26j151
$$ plain form
15552 -9702 -10723 -9291 -7261 -6423 -7407 -6343 -6261 -5431 -6640 -4188 -636 -262 1541 2793 1448 -466
15536 -466 -1044 -3185 -4877 -5145 -5581 -5629 -4309 -2752 -1016 -1198 -2808 -4162 -2853 -3869 -5842 -5424 -2521
15519 -2521 -1873 -774 -181 -1141 1246 993 -4642 -6190 -5629 -5433 -3396 -5813 -7701 -2843 -790 -2679
15503 -2679 -5081 -5174 -5939 -6344 -6584 -4257 -2154 807 923 592 3114 356 -2519 -3426 -6861 -8914 -10461
15486 -10461 -7571 -5089 -3805 -5371 -4484 -7570 -8223 -10833 -11158 -6851 -8209 -8743 -5332 -6387 -6334 -5512
15470 -5512 -5040 -2769 790 806 -2221 -1979 -4263 -3353 -1402 -4056 -5827 -6332 -4794 -4320 -2469 -4656
15454 -4656 -9873 -7039 -5016 -1532 2152 4072 996 -3123 -6507 -8654 -8126 -6539 -7611 -8343 -5944
15439 -5944 -6973 -8503 -10211 -9567 -7966 -7073 -5493 -4900 -3949 -3013 -842 -2794 -4919 -6017 -8957 -10829
$$ packed form
15552i702j021J432K030Q38r84J064Q2Q30j209K452L552L74J803J252j345j914
15536d66n78k141j692k68m36m8J320J557J736j82j610j354J309j016j973M18K903
15519b521O48J099N93r60K387k53n635j548N61J96K037k417j888M858K053j889
15503b679k402r3p65m05k40K327K103K961J16l31K522k758k875r07l435k053j547
15486a0461K890K482J284j566Q87l086o53k610l25M307j358n34L411j055N3Q22
15470e512M72K271L559J6l027K42k284R10J951k654j771n05J538M74J851k187
15454d656n217K834K023L484L684J920l076m119l384k147N28J587j072p32K399
15439e944j029j530j708O44J601Q93J580N93R51R36K171j952k125j098k940j872
$$ plain form
15423 -10829 -11534 -8023 -8547 -9706 -3906 -3381 -3651 -3327 -5988 -5215 -3694 -2225 766 2732 3630 1623
15407 1623 -747 -2498 -5806 -4824 -149 975 1343 2133 4025 6183 5995 6288 4315 4327 5085 1921 -2476
15390 -2476 -3898 -1422 -2297 -2619 -4904 -1685 943 4293 4525 3601 2294 -144 -2764 -2211 -1478 -1168
15374 -1168 -5554 -7395 -5867 -2656 -5705 -9442 -9782 -6763 -7910 -8289 -5587 -1564 518 -2372 -4438
15359 -4438 -9639 -13273 -13808 -14145 -11394 -7735 -2649 -821 -2276 -5245 -3851 -2986 -6112 -2745 -3736 -6389
15343 -6389 -7924 -10488 -9119 -6116 -3454 -2081 2489 -843 -2625 -708 -2797 -4882 -3980 -1874 -2285
15328 -2285 -4020 -4937 -6080 -6872 -8669 -7443 -5392 -2203 2071 3740 5034 5686 1368 -4591 -7633
15313 -7633 -4934 -2829 -744 1146 1005 -2910 -3000 -4032 -2462 286 949 -1798 -4825 -4798 -4582 -4230 -4091
$$ packed form
15423a0829p05L511n24j159N800N25k70L24k661P73J521J469K991J966Q98k007
15407A623k370j751l308R82M675J124L68P90J892K158j88K93j973J2P58l164m397
15390b476j422K476q75l22k285L219K628L350K32r24j307k438k620N53P33L10
15374a168m386j841J528L211l049l737l40L019j147l79K702M023K082k890k066
15359d438n201l634n35l37K751L659N086J828j455k969J394Q65l126L367r91k653
15343f389j535k564J369L003K662J373M570l332j782J917k089k085R02K106m11
15328b285j735r17j143p92j797J226K051L189M274J669J294O52m318n959l042
15313g633K699K105K085J890j41l915r0j032J570K748O63k747l027K7K16L52J39
$$ plain form
15296 -4091 670 6429 5247 2576 1068 -2806 -4565 -5109 -6797 -7125 -5753 -6841 -7200 -6016 -4409
15281 -4409 -2800 -3415 -5836 -8272 -11155 -11097 -7232 -4606 -1589 -2362 -3108 -1395 657 738 -673 -1666 -1604
15264 -1604 -436 -4006 -4947 -6588 -9831 -4878 1787 -452 -6222 -7984 -6085 -5029 -5635 -5471 -1542
15249 -1542 2211 1535 -1207 -3236 -3458 -5628 -3056 -4237 -6244 -8359 -9852 -9516 -7250 -4871 -2655
15234 -2655 -3438 -6238 -5166 -5234 -7740 -7459 -9459 -12810 -14353 -14054 -13723 -10824 -7590 -7722 -14070 -14585 -13426
15217 -13426 -10850 -5741 -4981 -6208 -1292 2291 -1668 -5607 -4737 -736 4047 1738 -2450 -1451 -493
15202 -493 976 -1236 -3228 -5859 -4354 -1950 -1799 -3041 -2507 -1405 -879 -891 2893 6030 2653 -505
15186 -505 1895 -472 -6685 -8582 -8472 -6676 -6850 -5038 -3936 -2526 -658 -3677 -6724 -3802 -1393
$$ packed form
15296d091M761N759j182k671j508l874j759n44j688l28J372j088l59J184J607
15281d409J609o15k421k436k883N8L865K626L017p73p46J713K052Q1j411r93O2
15264a604J168l570r41j641l243M953O665k239n770j762J899J056o06J64L929
15249a542L753o76k742k029k22k170K572j181k007k115j493L36K266K379K216
15234b655p83k800J072o8k506K81k000l351j543K99L31K899L234j32o348n15J159
15217a3426K576N109P60j227M916L583l959l939Q70M001M783k309m188R99R58
15202d93J469k212j992k631J505K404J51j242N34J102N26j2L784L137l377l158
15186e05K400k367o213j897J10J796j74J812J102J410J868l019l047K922K409
$$ plain form
15171 -1393 -511 -679 469 3471 -145 2897 5253 5219 4040 911 -1565 -2354 -5476 -6240 -8409 -7687
15155 -7687 -6752 -7337 -6816 -6699 -3031 1021 -3973 -8042 -7911 -8627 -9021 -9544 -5601 -1846 -620 -2800 -7540
15138 -7540 -7986 -6934 -9386 -10626 -8115 -6952 -3401 -2185 -4008 -7132 -8408 -11949 -13225 -12362 -8628
15123 -8628 -5456 -3888 -5964 -2598 -1282 -4238 -9068 -5114 -37 -4816 -6891 -6175 -6665 -9398 -8030
15108 -8030 -2190 548 -547 -860 -5159 -9452 -6488 -1713 -2948 -386 -1194 -3258 -1776 -1141 -1896 -4109
15092 -4109 -2830 -2738 -7174 -9261 -5858 -3461 -5814 -3545 1916 -1265 -5583 -4614 -3890 -2030 -1774 -2638
15076 -2638 -1475 -2022 -5067 -5360 -5526 -6250 -6661 -4466 -4903 -6667 -6151 -3743 -3114 -6264 -7773 -4044 -5390
15059 -5390 -2403 -3741 -4020 -3995 -4804 -7910 -6227 -3407 -2025 241 -515 -6587 -9574 -7582 -4979 -4852
$$ packed form
15171a393Q82j68J148L002l616L042K356l4j179l129k476p89l122p64k169P22
15155g687R35n85N21J17L668M052m994m069J31p16l94n23L943L755J226k180m740
15138g540m46J052k452j240K511J163L551J216j823l124j276l541j276Q63L734
15123h628L172J568k076L366J316k956m830L954N077m779k075P16m90k733J368
15108h030N840K738j095l13m299m293K964M775j235K562q08k064J482O35p55k213
15092d109J279R2m436k087L403K397k353K269N461l181m318R69P24J860K56q64
15076b638J163n47l045k93j66p24m11K195m37j764N16K408O29l150j509L729j346
15059e390K987j338k79K5q09l106J683K820J382K266p56o072k987J992K603J27
$$ plain form
15043 -4852 -6931 -7957 -6699 -2789 59 296 650 -3098 -3966 -2754 -3298 -1158 554 -2528 -5491 -5052
15027 -5052 -5400 -6607 -6737 -5807 -5230 -8184 -7887 -8310 -9063 -11579 -10301 -6036 -5070 -8371 -9682 -12157 -10707
15010 -10707 -9668 -8978 -5231 -3519 -6836 -6115 -7820 -7631 -7599 -6262 -8114 -8830 -5102 -7193 -9492 -8615
14994 -8615 -5597 -7777 -10353 -12550 -12757 -11961 -16640 -15202 -6938 -2643 -2040 477 968 1871 1517 -1705
14978 -1705 -2584 638 772 3274 2216 -2433 -3341 -4713 -7811 -9201 -10699 -11669 -9510 -4119 -1624 -1440
14962 -1440 1704 4402 2699 2421 -1622 -2567 -1033 -4052 -4487 -1772 251 -1633 -1726 -1109 -4239 -8885
14946 -8885 -11117 -9558 -7982 -8244 -8148 -6324 -4819 -5180 -4556 -5572 -7723 -10690 -8263 -3497 -2194 -4091
14930 -4091 615 3512 4353 578 -3466 818 3121 2434 698 -6989 -9709 -5050 -5001 -3070 -3194 -6918
$$ packed form
15043d852k079j026J258L910K848K37L54l748q68J212n44K140J712l082k963M39
15027e052l48j207j30R30N77k954K97m23p53k516J278M265R66l301j311k475J450
15010a0707J039O90L747J712l317P21j705J89L2J337j852p16L728k091k299Q77
14994h615L018k180k576k197k07P96m679J438Q264M295O03K517M91R03l54l222
14978a705q79L222J34K502j058m649r08j372l098j390j498r70K159N391K495J84
14962a440L144K698j703k78m043r45J534l019m35K715K023j884r3O17l130m646
14946h885k232J559J576k62R6J824J505l61O24j016k151k967K427M766J303j897
14930d091M706K897Q41l775m044M284K303o87j736p687k720M659M9J931j24l724
$$ plain form
14914 -6918 -5872 -732 1454 -1012 -80 -850 1272 271 -3053 -4532 -6105 -5780 -4568 -6492 -6848 -7928
14898 -7928 -9460 -12561 -11940 -10137 -7347 -6008 -4192 -3548 -6825 -10576 -7625 -6972 -7245 -6162 -6290 -5508
14882 -5508 -3367 -2666 -842 293 3590 2242 -6029 -8685 -3246 751 -2014 -4481 -8609 -8917 -6067
14867 -6067 -4662 -4160 -3280 -3296 -6631 -9297 -9373 -9447 -7622 -5189 -4421 -8124 -10115 -11130 -14208 -15707 -14722
14850 -14722 -11153 -8270 -6869 -9034 -8676 -9671 -9946 -10465 -5456 -5243 -8072 -10593 -8235 -8235 -7727 -7474 -8471
14833 -8471 -9207 -8319 -5960 -4985 -1447 293 218 538 3681 4436 6044 4870 5305 7364 4264 3317 -1288
14816 -1288 -2081 -917 -451 -2264 -1967 -530 1499 -1134 -1450 -2350 -2620 -4336 -2495 -878 -3648 -8759
14800 -8759 -11741 -8201 -5012 -7299 -6866 -5490 -7340 -3155 2142 1181 -2403 -2257 -2263 -3955 -3537 -4522 -8244
$$ packed form
14914f918J046N140K186k466R32p70K122j001l324j479j573L25J212j924l56j080
14898g928j532l101O21J803K790J339J816O44l277l751K951O53k73J083j28P82
14882e508K141P01J824J135L297j348q271k656N439L997k765k467m128l08K850
14867f067J405N02Q80j6l335k666p6p4J825K433P68l703j991j015l078j499R85
14850a4722L569K883J401k165L58r95k75n19N009K13k829k521K358%N08K53r97
14833h471p36Q88K359R75L538J740p5L20L143P55J608j174M35K059l100r47m605
14816a288p93J164M66j813K97J437K029k633l16r00k70j716J841J617k770n111
14800h759k982L540L189k287M33J376j850M185N297r61l584J46oj692M18r85l722
$$ plain form
14783 -8244 -10051 -7509 -5941 -6788 -9049 -7550 -1508 2095 1767 2740 3520 4022 4550 -170 -7703 -9225
14767 -9225 -8962 -3167 -1558 -445 -901 -707 -2437 -1682 -4742 -3443 655 -1287 -3683 -2826 -2714 -6814
14751 -6814 -12733 -10152 -7045 -7217 -7302 -5977 -7661 -6242 -10230 -15917 -15026 -10224 -9059 -4033 -3419 -6707
14735 -6707 -7341 -8949 -5489 -7288 -6813 -5090 -993 -355 -538 -1839 -3547 -2196 -1630 -4028 -3479 -4560
14719 -4560 -3722 -6283 -6107 -1353 -323 -1580 -2650 -3144 -6580 -2464 -1823 -1623 155 3898 3282 3147
14703 3147 3776 4245 7533 8970 4797 3462 3626 2464 318 70 -2970 -5993 -8083 -11908 -10319 -5738
14687 -5738 -2662 -681 -1073 -3804 -5318 -5379 -5104 -4109 -3733 -7560 -9549 -6324 -5761 -4727 -3421 -7606
14671 -7606 -8848 -8420 -10017 -11880 -8252 -3273 -3718 -2013 -3251 -5298 242 2086 -1176 568 -378
$$ packed form
14783h244j807K542J568q47k261J499O042L603l28R73P80N02N28m720p533j522
14767i225K63N795J609J113m56J94j730P55l060J299M098j942k396Q57J12m100
14751f814n919K581L107j72q5J325j684J419l988n687Q91M802J165N026O14l288
14735f707o34j608L460j799M75J723M097O38j83j301j708J351N66k398N49j081
14719d560Q38k561J76M754J030j257j070m94l436M116O41K00J778L743o16j35
14703C147O29M69L288J437m173j335J64j162k146k48l040l023k090l825J589M581
14687e738L076J981l92k731j514o1K75R95L76l827j989L225N63J034J306m185
14671g606j242M28j597j863L628M979m45J705j238k047N540J844l262J744r46
$$ plain form
14656 -378 -2104 -4127 -6550 -8292 -6904 -7158 -8557 -4890 -3076 -3737 -6233 -8316 -7115 -8386 -8167 -12571
14640 -12571 -14149 -13576 -13074 -12445 -10490 -7315 84 523 -760 2107 3771 6290 7156 5166 4684 5822
14624 5822 5410 3223 1309 -2175 -8186 -4769 1568 9960 14207 13451 7224 3018 -4158 -9018 -12440
14609 -12440 -14344 -11958 -5411 -2255 872 772 187 21 -317 -1722 -3597 -5121 -9326 -7774 -305
14594 -305 3677 4088 8211 10707 5387 -2703 -5916 -9854 -6254 -6060 -5451 -6282 -2322 -2367 -2103 -5867 -5030
14577 -5030 -1711 -153 405 166 1134 -5972 -9523 -12853 -14440 -16737 -14954 -11469 -8419 -8406 -3749 -3426
14561 -3426 -5390 -6015 -7486 -6376 -5601 -10887 -12279 -7534 -4859 -3645 -3098 974 3948 4203 1330 -2375
14545 -2375 -7720 -12546 -10753 -8594 -5141 -5456 -4965 -6548 -5286 -2645 -3023 -3437 -2367 -2456 -967 1371
$$ packed form
14656c78j726k023k423j742J388k54j399L667J814o61k496k083J201j271K19m404
14640a2571j578N73N02O29J955L175P399M39j283K867J664K519Q66j990m82J138
14624E822m12k187j914l484o011L417O337Q392M247p56o227m206p176m860l422
14609a2440j904K386O547L156L127j00n85j66l38j405j875j524m205J552P469
14594c05L982M11M123K496n320q090l213l938L600J94O09q31L960m5K64l764Q37
14577e030L319J558N58k39R68p106l551l330j587k297J783L485L050J3M657L23
14561c426j964o25j471J110P75n286j392M745K675J214N47M072K974K55k873l705
14545b375n345m826J793K159L453l15M91j583J262K641l78m14J070q9J489K338
$$ plain form
14529 1371 578 -1332 -2488 -4003 -6044 -11054 -9128 -4258 -2817 -2063 -360 -1398 -2819 -9337 -11763
14514 -11763 -7225 -3751 -4334 -3256 -4869 -8213 -13955 -23179 -29035 -25072 -16141 -1769 6649 7157 4714
14499 4714 4246 10249 9004 -902 -11077 -12844 -5917 1839 4217 -1813 -7541 -14377 -17544 -15937 -8832
14484 -8832 6003 19228 28718 25131 11565 -9631 -26234 -27712 -20047 -8527 -3119 -4396 -7745
14471 -7745 -9216 -6536 -2267 -1287 -904 -6441 -9224 -6268 -6396 -3739 6357 14290 16230 15343 13954
14456 13954 11464 9308 4446 -945 -5052 -5614 -2513 -2804 -1254 -1658 -1944 -4900 -5906 -996 2683
14441 2683 5540 3503 -927 -5223 -9494 -17305 -22130 -20141 -14480 -10257 -7120 -4861 -4491 -4548 -7104
14426 -7104 -6508 -4244 -1676 -2337 -2939 -2302 1623 5242 5932 4434 2670 585 -1951 -3471 -2896 -2340
$$ packed form
14529A371p93j910j156j515k041n010J926M870J441P54J703j038j421o518k426
14514a1763M538L474n83J078j613l344n742r224n856L963Q931J4372Q418N08k443
14499D714m68O003j245r906j0175j767O927P756K378o030n728o836l167J607P105
14484h832J4835J3225R490l587j3566k1196j6603j478P665J1520N408j277l349
14471g745j471K680M269R80L83n537k783K956j28K657J0096P933J940q87j389
14456A3954k490k156m862n391m107n62L101k91J550m04k86k956j006M910L679
14441B683K857k037m430m296m271p811m825J989N661M223L137K259L70n7k556
14426g104N96K264K568o61o02O37L925L619O90j498j764k085k536j520N75N56
$$ plain form
14410 -2340 -3217 -3473 -5175 -3001 -5466 -5141 -4259 -3826 -3533 -7639 -6487 -1391 -2994 -5341 -7543 -8367
14394 -8367 -6080 -1545 -732 -5173 -9009 -9181 -7006 -8973 -7181 -6179 -5764 -7477 -6672 -7537 -6034 -1531
14378 -1531 -2809 -6184 -5535 -1730 -4836 -11641 -12190 -7994 -2852 -128 -7504 -8779 -6707 1064 5415
14363 5415 3742 -1664 -9675 -15233 -5795 4578 3011 -9471 -19394 -23659 -20716 -8162 325 -1100
14349 -1100 -754 2292 7972 5653 -7430 -17765 -17868 -6667 2529 4766 -1078 -6085 -11972 -8364
14335 -8364 -1448 1250 -2714 -8429 -11839 -10251 -3862 177 2429 2471 1204 1490 4962 4725 -3292 -10084
14319 -10084 -11356 -8655 -5284 -4022 -4325 -5561 -6684 -7990 -8639 -4619 -3446 -2531 -2696 -2610 -2041 -2599
14303 -2599 -2342 -5000 -6073 -5746 -7137 -6699 -4402 -3382 -2897 -412 -685 248 6196 4352 292 -106
$$ packed form
14410b340q77k56j702K174k465L25Q82M33K93m106J152N096j603k347k202q24
14394h367K287M535Q13m441l836j72K175j967J792J002M15j713Q05q65J503M503
14378a531j278l375O49L805l106o805n49M196N142K724p376j275K072P771M351
14363E415j673n406q011n558R438J0373j567j2482r923m265K943J2554Q487j425
14349a100L46L046N680k319j3083j0335j03J1201R196K237n844n007n887L608
14335h364O916K698l964n715l410J588O389M039K252M2j267K86L472k37q017o792
14319a0084j272K701L371J262l03j236j123j306o49M020J173R15j65Q6N69n58
14303b599K57k658j073L27j391M38K297J020M85K485k73R33N948j844m060l98
$$ plain form
14287 -106 777 1999 3473 1855 -899 -4976 -7354 -5679 -3326 -4731 -3863 -4985 -6231 -4700 -4341 -9001
14271 -9001 -8218 -6779 -3630 -2614 -3850 -4115 -6174 -7361 -3599 -5311 -8581 -8305 -5740 -5312 -6685 -5767
14255 -5767 -3250 -1061 992 2122 -3161 -4051 202 876 -3080 -10219 -12797 -11631 -10375 -11521 -11944
14240 -11944 -5288 2023 3874 3512 3520 -882 -6125 -7257 -7852 -9893 -7225 -3325 -5414 -11084 -10503 -6137
14224 -6137 -4069 -2924 -1192 -1878 -743 -1191 -964 -950 472 3069 -1500 -5505 -7784 -4437 965 7060
14208 7060 3512 -2761 -4869 -3957 -389 -844 -612 -4940 -12022 -16214 -11749 -4199 1156 -1250 -4028
14193 -4028 -1720 -3886 -1995 1434 -107 -4304 -4188 -2026 -1734 -1597 -794 -2112 -6274 -8801 -8989 -7195
14177 -7195 -9050 -5763 -2775 -5290 -6348 -9666 -6521 813 -508 -2223 -3340 -5245 -2547 927 -738
$$ packed form
14287a06Q83J222J474j618k754m077k378J675K353j405Q68j122j246J531L59m660
14271i001P83J439L149J016j236k65k059j187L762j712l270K76K565M28j373R18
14255e767K517K189K053J130n283q90M253O74l956p139k578J166J256j146m23
14240a1944O656P311J851l62Qm402n243j132n95k041K668L900k089n670N81M366
14224f137K068J145J732o86J135m48K27J4J422K597m569m005k279L347N402O095
14208G060l548o273k108R12L568m55K32m328p082m192M465P550N355k406k778
14193d028K308k166J891L429j541m197J16K162K92J37Q03j318m162k527j88J794
14177g195j855L287K988k515j058l318L145P334j321j715j117j905K698L474j665
$$ plain form
14162 -738 1502 3110 -431 505 1595 -5792 -10160 -9133 -8291 -5635 -4724 -1011 -1873 -8302 -7043 -3135
14146 -3135 -2578 -5750 -7461 -5226 -2011 89 738 -3159 -2798 -2064 -3451 -1615 -1213 -860 -3952 -5533
14130 -5533 -6975 -6535 -5199 -698 554 -2114 -7440 -7399 -10142 -10363 -9476 -8176 -7043 -2808 -4120 -3259
14114 -3259 -5050 -5422 -4361 -6456 -5696 -5347 -5005 -3512 -6673 -7187 -8619 -7950 -3503 -1186 351 257 531
14097 531 1976 1942 -616 -6697 -3474 -4604 -3463 -3167 -1556 -1404 -847 442 -236 -489 -2206 -3500 -3175
14080 -3175 1522 3533 5243 31 -4469 -3315 -1440 3243 7067 5046 2510 -377 -2311 -1420 -392
14065 -392 712 1547 -1588 -3789 -2897 -3305 -2450 -922 -970 469 -685 2973 2619 -2617 -2114 -4384 -5250
14048 -5250 -6077 -3983 258 2268 -200 1924 668 -3142 -3245 -2962 -1576 -4542 -7410 -7167 -8701 -10170
$$ packed form
14162g38K240J608l541R36J090p387m368J027Q42K656R11L713q62o429J259L908
14146c135N57l172j711K235L215K100O49l897L61P34j387J836M02L53l092j581
14130e533j442M40J336M501J252k668n326M1k743k21Q87J300J133M235j312Q61
14114c259j791l72J061k095P60L49L42J493l161n14j432O69M447K317J537r4K74
14097E31J445l4k558o081L223j130J141K96J611J52N57J289o78k53j717j294L25
14080c175M697K011J710n212m500J154J875M683L824k021k536k887j934Q91J028
14065c92J104Q35l135k201Q92m08Q55J528m8J439j154L658l54n236N03k270q66
14048e250q27K094M241K010k468K124j256l810j03K83J386k966k868K43j534j469
$$ plain form
14032 -10170 -7660 -5992 -2856 1340 -305 1602 2609 2841 3887 6782 5160 2430 1972 2432 170
14017 170 -1475 556 -219 1047 2229 1407 744 1963 1712 -1153 -4481 -2303 -1240 -2030 297 3514
14001 3514 2479 -1931 -986 1208 -72 -948 3605 6313 548 -5168 -4927 -8093 -8224 -5656 -4684 -1788
13985 -1788 -1926 -2785 -2394 -3182 -2813 -3309 -2925 -4569 -7267 -7393 -6191 -5872 -6435 -9816 -9036 -4585 -3401
13968 -3401 -4238 -3931 -3047 -2650 -647 -4456 -3105 1569 -3396 -3211 -1203 -649 -2166 -4765 -4378 -2195
13952 -2195 -570 -2999 -6762 -8360 -6726 -2023 -1200 -753 1175 1113 -542 -985 -1254 -2871 -2569 -3895
13936 -3895 -4818 -4766 -3548 -3964 -3168 34 1486 -952 446 1507 1321 -162 3389 2569 8429 6142
13920 6142 2233 3677 5178 3622 -1199 1101 3787 3099 1398 -2180 2702 10412 11654 11137 9973
$$ packed form
14032a0170K510J668L136M196j645J907J007K32J046K895j622k730m58M60k262
14017A70j645K031p75J266J182q22o63J219k51k865l328K178J063p90K327L217
14001C514j035m410R45K194j280q76M553K708n765n716K41l166j31K568R72K896
13985a788j38q59L91p88L69m96L84j644k698j26J202L19n63l381P80M451J184
13968c401q37L07Q84L97K003l809J351M674m965J85K008N54j517k599L87K183
13952b195J625k429l763j598J634M703Q23M47J928o2j655m43k69j617L02j326
13936c895r23N2J218m16P96L202J452k438J398J061j86j483L551q20N860k287
13920F142l909J444J501j556m821K300K686o88j701l578M882P710J242n17j164
$$ plain form
13905 9973 8359 8130 7041 4386 2766 1693 1328 -2891 1225 2147 1037 -188 1221 2238 4161
13890 4161 2063 472 529 1502 1162 -2637 -1821 -6004 -6838 -3799 -591 -109 1117 -2830 -5628 -1301
13874 -1301 -1015 -468 755 217 3039 8585 6633 3069 4034 3999 2724 4585 10160 11828 12336 15627
13858 15627 15870 14020 11316 5719 5796 3723 6109 6600 6292 3991 2131 3433 5160 5729 8113 11795
13842 11795 11706 7226 7391 3024 3277 5154 3592 3800 5509 4421 6202 7582 7101 6411 5556 2715
13826 2715 1679 1774 5998 10409 12111 9813 9002 6574 3954 3641 3012 3004 6040 5534 7321 9982 9548
13809 9548 8860 8419 4693 3713 6620 6348 7268 4581 6477 12100 12781 14196 16338 16757 13351 11224
13793 11224 11660 11073 9322 10180 9258 6634 4698 4836 7773 8524 5859 5102 6126 3857 3074 4135
$$ packed form
13905I973j614k29j089k655j620j073l65m219M116R22j110j225J409J017J923
13890D161k098j591N7R73l40l799Q16m183q34L039L208M82J226l947k798M327
13874a301K86N47J223n38K822N546j952l564R65l5j275J861N575J668N08L291
13858A5627K43j850k704n597P7k073K386M91l08k301j860J302J727N69K384L682
13842A1795q9m480J65m367K53J877j562K08J709j088J781J380m81o90q55k841
13826B715j036R5M224M411J702k298q11k428k620l13o29qL036n06J787K661m34
13809I548o88m41l726r80K907k72R20k687J896N623O81J415K142M19l406k127
13793A1224M36n87j751Q58r22k624j936J38K937P51k665p57J024k269p83J061
$$ plain form
13777 4135 6200 12036 14417 9218 5645 1815 529 2701 4376 5481 7537 8775 12223 12261 10867
13762 10867 10580 14129 16097 16845 20967 23490 23865 23155 17333 10429 4173 -3664 -5311 -1591 1977
13747 1977 2257 4342 2611 -48 -739 1360 1663 2140 2636 1610 -301 1265 4010 -344 -2177 -4092
13731 -4092 -3363 706 3033 3738 3897 -218 -3122 -797 4606 7443 4553 1446 1532 759 -3632 -3107
13715 -3107 -1582 -3776 -3683 -1938 267 2136 2261 -3721 -6250 -2126 6039 4878 2266 2878 -1666 -1788
13699 -1788 1162 939 1888 665 -1037 -1509 -851 3203 5781 3989 1191 -3868 -7006 -115 -113 -2436
13683 -2436 -2123 1745 4060 9063 9411 6746 5605 5364 5386 5451 1825 2462 5160 5009 2844 3340 2482
13666 2482 -710 -1604 -271 80 -168 -2100 -2020 1614 2763 1052 1769 2065 908 -86 5295 7636 7012
$$ packed form
13777D135K065N836K381n199l573l830j286K172J675J105K056J238L448L8j394
13762A0867k87L549J968P48M122K523L75p10n822o904o256p837j647L720L568
13747A977K80K085j731k659o91K099L03M77M96j026j911J566K745m354j833j915
13731d092P29M069K327P05J59m115k904K325N403K837k890l107Q6p73m391N25
13715c107J525k194R3J745K205J869J25n982k529M124Q165j161k612O12m544j22
13699a788K950k23R49j223j702m72O58M054K578j792k798n059l138O891Kk323
13683b436L13L868K315N003L48k665j141k41K2O5l626O37K698j51k165M96q58
13666B482l192q94J333L51k48j932Q0L634J149j711P17K96j157r94N381K341o24
$$ plain form
13649 7012 4586 251 1072 -425 -1289 -5732 -7201 1358 6308 8224 5856 4920 4290 1124 144 2700
13633 2700 6856 9607 6995 8712 5864 5988 5109 3848 3005 2843 3486 2561 -93 -2003 -3631 -6853
13617 -6853 -8445 -8763 -5580 -1762 2795 -272 -3009 -4351 -7847 -7997 -2014 515 -490 462 1380 2083
13601 2083 343 -1889 -2991 -4632 -6873 -3909 -3740 -5649 -7834 -6309 -2190 -783 776 -22 -2646
13586 -2646 -4549 -5992 -2846 -597 2187 2988 1092 3406 5003 3950 1540 1630 -2583 -268 3485
13571 3485 4855 3570 997 -1159 -339 -5534 -6820 -6612 -5170 -2347 -712 2731 3739 -1155 -3476
13556 -3476 -6714 -5691 -5902 -4267 -2610 -3706 -1991 -1639 1551 4553 1666 -269 -182 1922 913 4805
13540 4805 6082 3175 1728 4488 5561 3600 2366 5116 6815 5088 5674 3262 -3690 -3530 -3406
$$ packed form
13649G012k426m335Q21j497q64m443j469Q559M950J916k368r36o30l166r80K556
13633B700M156K751k612J717k848J24q79j261q43j62O43r25k654j910j628l222
13617f853j592l18L183L818M557l067k737j342l496j50N983K529j005R52R18P03
13601B083j740k232j102j641k241K964J69j909k185J525M119J407J559p98k624
13586b646j903j443L146K249K784Q01j896K314J597j053k410R0m213K315L753
13571C485J370j285k573k156Q20n195j286K08J442K823J635L443J008m894k321
13556c476l238J023k11J635J657j096J715L52L190L002k887j935Q7K104j009L892
13540D805J277k907j447K760J073j961j234K750J699j727N86k412o952J60J24
$$ plain form
13525 -3406 -1509 1246 1807 1402 1996 2038 1206 4738 7762 9714 11936 10571 9625 17927 24171 32310
13509 32310 38861 47567 56168 63594 65013 62454 60182 58593 54556 58498 61598 65947 67595 62679
13495 62679 53162 44674 35966 26661 17981 9254 9093 10033 8279 9581 8996 8154 6297 2711 2067 4375
13479 4375 6847 4324 3826 172 4324 7993 5714 2112 2930 3249 2806 5650 7621 10537 7640 5065
13463 5065 395 2054 3184 5380 8312 6951 5465 6697 10660 10040 9386 8404 6417 7314 5083 5697
13447 5697 5405 2539 7263 11120 13455 13927 13452 16879 20049 20481 21700 27508 32881 41913 55380
13432 55380 67713 77299 85319 90893 102209 121543 143693 177474 231692 318883 456876 675327
13420 675327 1022632 1490015 1940919 2143442 1980107 1568097 1122054 768972 531721 379473
$$ packed form
13525c406J897K755N61m05N94M2q32L532L024J952K222j365r46Q302O244Q139
13509C2310O551Q706Q601P426J419k559k272j589m037L942L100M349J648m916
13495F2679r517q488q708r305q680q727j61R40j754J302n85q42j857l586o44K308
13479D375K472k523m98l654M152L669k279l602Q18L19m43K844J971K916k897k575
13463E065m670J659J130K196K932j361j486J232L963o20o54r82j987Q97k231O14
13447E697k92k866M724L857K335M72m75L427L170M32J219N808N373R032J3467
13432E5380J2333R586Q020N574J1316J9334K2150L3781N4218Q7191J37993K18451
13420F75327L47305M67383M50904K02523j63335m12010m46043l53082k37251j52248
$$ plain form
13410 379473 286394 227797 182409 153383 136515 125935 120988 111859 102206 92842 83208 73133
13398 73133 60311 52340 50104 47151 41965 36743 32540 28634 28423 24960 26236 27321 23351 23482 25557
13383 25557 27316 19026 17531 21252 20537 17026 17992 14825 14293 16555 18993 21050 20156 18924 19598 23367
13367 23367 21817 17749 14069 10072 8372 12952 13094 16806 18728 16332 16156 13637 8502 6656 7452
13352 7452 11059 10187 5453 957 2838 6274 6727 6693 5715 3122 4322 3556 1208 493 3290 3880 755
13335 755 -2886 3854 7360 9016 8399 7507 5184 2828 4015 5879 5725 5093 5478 5170 4358 4779 2237
13318 2237 1333 5814 6688 2334 1755 -2232 -5161 -2725 3129 4607 -188 -264 -1844 -1311 -1838 265
13302 265 2463 3395 3957 6017 6449 4356 1195 320 3929 5408 1651 710 858 380 497 -53 3182
$$ packed form
13410C79473r3079n8597m5388k9026j6868j0580m947r129r653r364r634j0075
13398G3133j2822p971k236k953n186n222m203l906k11l463J276J085l970J31K075
13383B5557J759q290j495L721p15l511R66l167n32K262K438K057q94j232O74L769
13367B3367j550m068l680l997j700M580J42L712J922k396j76k519n135j846P96
13352G452L607q72m734m496J881L436M53l4r78k593J200p66k348p15K797N90l125
13335G55l641O740L506J656o17q92k323k356J187J864j54o32L85l08q12M21k542
13318B237r04M481Q74m354n79l987k929K436N854J478m795p6j580N33n27K103
13302B65K198R32N62K060M32k093l161q75L609J479l757r41J48m78J17n50L235
$$ plain form
13285 3182 6356 8660 9576 12957 14319 18132 18414 18253 16367 17916 20650 24290 25791 32589 38305
13270 38305 36664 37996 43998 46255 49784 51209 59367 66528 69216 72983 69498 57794 52593 46606
13256 46606 46324 51304 57051 55713 50212 41860 37436 32713 33138 29664 22659 19713 16966 13886 12087
13241 12087 9312 2493 2067 3656 2681 -216 -831 -2190 -3086 -2472 -1954 474 473 -1962 1256 2930 4484
13224 4484 1708 3712 5669 2699 463 2604 2492 1824 3268 2967 2593 2423 3948 4001 -668 -842 972
13207 972 918 940 -567 -983 -2416 -4237 -4773 -5927 -4144 -2114 -4027 -5081 -5126 602 5197 4329 -137
13190 -137 -4732 -5711 449 2296 2916 4655 3328 2318 479 6190 9674 7222 7070 8573 5522 1574
13174 1574 2174 1971 2388 2002 1094 3292 3683 8988 10602 8725 8635 8467 9256 9399 9228 5047 1016 2237
$$ packed form
13285C182L174K304R16L381J362L813K82j61j886J549K734L640J501O798N716
13270C8305j641J332O002K257L529J425Q158P161K688L767l485j1704n201n987
13256D6606k82M980N747j338n501q352m424m723M25l474p005k946k747l080j799
13241A2087k775o819m26J589r75k897o15j359q96O14N18K428jk435L218J674J554
13224D484k776K004J957k970k236K141j12o68J444l01l74j70J525N3m669j74J814
13207I72n4K2j507m16j433j821n36j154J783K030j913j054m5N728M595q68m466
13190a37m595r79O160J847O20J739j327j010j839N711L484k452j52J503l051l948
13174A574O00k03M17l86r08K198L91N305J614j877r0j68P89J43j71m181m031J221
$$ plain form
13156 2237 58 93 2166 3135 3995 5163 5634 5837 4346 3827 5400 5051 4986 6104 3628 2105 4777
13139 4777 4050 -99 2896 2144 -1314 -994 1835 2405 3337 1201 -3663 -3948 -2928 -2063 -2735 -4963 -3725
13122 -3725 -1667 244 578 -563 -1258 -2182 -4898 -6939 -5032 -3399 -3669 -5074 -7357 -1916 2841 4002
13106 4002 4475 2949 -38 1486 1116 3523 294 -3157 -4226 -3970 -678 -980 -434 -54 1047 -640
13090 -640 1179 1224 511 -885 -3186 1211 3066 2898 3837 6571 7723 8513 7627 3825 546 -39 -2061
13073 -2061 -3470 -5805 -4780 569 3279 3619 2503 1112 699 1913 -5208 -6620 -4475 -3343 -798
13058 -798 5959 8742 5104 3206 4331 8821 8945 6551 5730 1571 -1814 -1691 -1881 995 -2370 -1186
13042 -1186 4768 5514 6574 8116 5747 5414 2917 -150 -1742 -3438 -3194 -6047 -5616 -2031 -2933 -3093
$$ packed form
13156B237k179L5K073R69Q60J168M71K03j491n19J573l49o5J118k476j523K672
13139D777p27m149K995p52l458L20K829N70R32k136m864k85J020Q65o72k228J238
13122c725K058J911L34j141o95r24k716k041J907J633k70j405k283N441M757J161
13106D002M73j526k987J524l70K407l229l451j069K56L292l02N46L80J101j687
13090f40J819M5p13j396k301M397J855j68R39K734J152P90q86l802l279n85k022
13073b061j409k335J025N349K710L40j116j391m13J214p121j412K145J132K545
13058g98O757K783l638j898J125M490J24k394q21m159l385J23j90K876l365J184
13042a186N954P46J060J542k369l33k497l067j592j696K44k853M31L585r02j60
$$ plain form
13026 -3093 -2204 -1421 -1980 -1945 839 5191 5816 4643 6326 6094 4034 7525 7815 5999 6694 7480 9923
13009 9923 15581 18193 14123 8021 3643 3858 8601 9418 6614 6386 3246 -509 770 3915 5438
12994 5438 4570 3156 907 1019 4135 4397 8964 10389 11415 8895 6719 6090 6425 8433 8315 7915
12978 7915 9281 10472 8746 7327 2935 1472 2131 3226 7909 12037 12756 12636 12502 9038 3675 1014
12962 1014 2617 3627 3763 208 1510 4809 6373 9760 11099 14976 16364 19980 22518 21208 16100
12947 16100 13686 10543 12886 17401 18878 17509 18598 14795 12818 14061 12608 14957 15789 15733 14546
12932 14546 15491 18776 20422 23094 23884 22925 22662 26956 29151 33019 33942 34417 34208 32871 36713 37970
12916 37970 33650 30815 29392 27110 25981 28653 30153 34718 35217 33362 35776 35946 33501 28767 30746
$$ packed form
13026c093Q89P83n59L5K784M352O25j173J683k32k060L491K90j816O95P86K443
13009I923N658K612m070o102m378K15M743Q17k804k28l140l755J279L145J523
12994E438q68j414k249J12L116K62M567J425J026k520k176o29L35K008j18m00
12978G915J366J191j726j419m392j463O59J095M683M128P19j20j34l464n363k661
12962A014J603J010J36l555J302L299J564L387J339L877J388L616K538j310n108
12947A6100k414l143K343M515J477j369J089l803j977J243j453K349Q32n6j187
12932A4546R45L285J646K672P90r59k63M294K195L868R23M75k09j337L842J257
12916C7970m320k835j423k282j129K672J500M565M99j855K414J70k445m734J979
$$ plain form
12901 30746 32543 31162 33600 33208 34391 31314 30585 35522 37244 36986 29617 25981 28257 30148 31372
12886 31372 34274 35748 37426 34985 34865 34002 33418 33194 36255 36450 37600 37826 35820 34496 32905 31592
12870 31592 30433 31989 28569 30136 31517 31517 28912 27355 26410 23609 23165 26094 27474 26806 26761 28589
12854 28589 29000 30527 30550 25361 27205 29014 28671 29876 26037 23456 28587 31997 27970 23449 21220
12839 21220 20494 20275 16770 10890 6923 8002 12619 15187 16926 19552 18674 16661 15678 12983 8778
12824 8778 11594 15947 16959 22486 26540 23054 23094 25060 21860 24350 22932 24014 25468 28210 28740
12809 28740 31366 30117 28419 23814 19838 17325 16399 17967 20789 19585 19119 20382 16962 19360 20248
12794 20248 20246 18876 23224 19915 17087 20807 20872 17858 16523 18105 23268 24136 25884 28403 29736 30054
$$ packed form
12901C0746J797j381K438l92J183l077p29M937J722k58p369l636K276J891J224
12886C1372K902J474J678k441j20q63n84k24L061J95J150K26k006j324j591j313
12870C1592j159J556l420J567J381%k605j557r45k801m44K929J380o68m5J828
12854B8589M11J527K3n189J844J809l43J205l839k581N131L410m027m521k229
12839B1220p26k19l505n880l967J079M617K568J739K626q78k013r83k695m205
12824H778K816M353J012N527M054l486M0J966l200K490j418J082J454K742N30
12809B8740K626j249j698m605l976k513r26J568K822j204m66J263l420K398Q88
12794B0248kj370M348l309k828L720O5l014j335J582N163Q68J748K519J333L18
$$ plain form
12778 30054 32761 41196 41454 43810 39182 35606 36853 34837 33053 31827 31126 33384 37722 37768 35118
12763 35118 31053 28382 22186 18576 18135 14369 12590 7702 4418 2216 -1013 -2532 690 2810 5523
12748 5523 11240 15607 15177 17659 22568 26441 28139 29767 28707 23380 22638 24245 30276 33392 32052
12733 32052 30943 32509 30901 33228 37650 42970 44413 40524 44535 47012 50092 53786 61084 66776
12719 66776 75508 89111 101389 112092 132882 162315 200474 254183 328377 434874 593839
12708 593839 840816 1204375 1680047 2194726 2606268 2774984 2632185 2239677 1734439 1258784
12698 1258784 891549 640760 479691 373838 297864 244931 200257 171316 152525 138056
12688 138056 131820 125718 122877 119726 114606 109437 102394 97898 91270 84995 79918 77448 76630 75973 71335
$$ packed form
12778C0054K707Q435K58K356m628l576J247k016j784j226p01K258M338M6k650
12763C5118m065k671o196l610m41l766j779m888l284k202l229j519L222K120K713
12748E523N717M367m30K482M909L873J698J628j060n327p42J607O031L116j340
12733C2052j109J566j608K327M422N320J443l889M011K477L080L694P298N692
12719F6776Q732J3603J2278J0703K0790K9433L8159N3709P4194J06497J58965
12708E93839K46977L63559M75672N14679M11542J68716j42799l92508n05238m75655
12698A258784l67235k50789j61069j05853p5974n2933m4674k8941j8791j4469
12688A38056o236o102k841l151n120n169p043m496o628o275n077k470q18o57m638
$$ plain form
12673 71335 68187 64515 62384 62027 62381 60285 56560 52309 48695 48064 47297 44857 39232 35019 38319
12658 38319 46148 47081 45616 46491 46772 47178 48155 46085 49645 55649 64022 67275 64175 67946 74122 76470
12642 76470 74786 71506 68947 60872 56299 55252 55441 58975 58053 53655 47437 42861 38796 34453 28615
12627 28615 25534 20524 15906 15595 15879 19425 24127 26448 29211 32515 39086 41368 44159 48952 50832
12612 50832 53495 53510 47467 46224 46239 46516 48189 46336 41719 40276 40773 35843 30518 25268 22562 24908
12596 24908 32391 37812 40455 45135 52103 54986 58759 59777 59087 60005 62583 64887 68612 68708 68983 69883
12580 69883 68811 62310 54225 45515 35203 23106 10672 6617 11402 22278 31900 41787 52944
12567 52944 62849 79179 96502 126918 175589 238188 329440 463003 671638 972804 1352307
$$ packed form
12673G1335l148l672k131l57L54k096l725m251l614o31p67k440n625m213L300
12658C8319P829R33j465Q75K81M06R77k070L560O004Q373L253l100L771O176K348
12642G6470j684l280k559q075m573j047J89L534r22m398o218m576m065m343n838
12627B8615l081n010m618l11K84L546M702K321K763L304O571K282K791M793J880
12612E0832K663J5o043j243J5K77J673j853m617j443M97m930n325n250k706K346
12596B4908P483N421K643M680O968K883L773J018o90R18K578K304L725R6K75R00
12580F9883j072o501q085q710j0312j2097j2434m055M785J0876R622R887J1157
12567E2944R905J6330J7323L0416M8671O2599R1252J33563K08635L01166L79503
$$ plain form
12556 1352307 1719148 1911373 1832024 1535861 1164628 845863 621409 483182 405401 359452
12546 359452 328597 303634 280957 257640 233607 209615 191482 168970 147721 132949 124603 118785
12534 118785 116938 121919 128004 129721 133137 135467 148637 163416 176650 196902 227552 272626 329737
12521 329737 388430 436496 466244 462199 426122 367572 305458 252566 212120 184334 161324 145050
12509 145050 136320 125633 117533 116114 118111 116922 112464 104327 88825 72785 60609 49543 45346
12496 45346 47909 47788 48036 47637 45917 48086 54677 53254 47144 48499 45576 41804 45312 57541 74956
12481 74956 95536 113921 129670 142122 151747 158597 157030 146543 128119 107738 86927 67788
12469 67788 56593 53934 56912 72523 88063 101798 116569 130156 137420 141185 144055 148302 158520
$$ packed form
12556A352307L66841J92225p9349k96163l71233l18765k24454j38227p7781m5949
12546C59452l0855k4963k2677k3317k4033k3992j8133k2512k1249j4772q346n818
12534A18785j847M981O085J717L416K330J3170J4779J3234K0252L0650M5074N7111
12521C29737N8693M8066K9748m045l6077n8550o2114n2892m0446k7786k3010j6274
12509A45050q730j0687q100j419J997j189m458q137j5502j6040j2176j1066m197
12496D5346K563j21K48l99j720K169O591j423o110J355k923l772L508J2229J7415
12481G4956K0580J8385J5749J2452R625O850j567j0487j8424k0381k0811j9139
12469F7788j1195k659K978J5611J5540J3735J4771J3587P264L765K870M247J0218
$$ plain form
12456 158520 179069 202480 223077 241016 249272 251607 247397 232930 220084 199647 175067 154354
12444 154354 130717 109999 91524 75332 66271 62652 63994 69792 77990 80501 83914 95630 104167
12431 104167 105712 106635 106226 105603 105683 108569 117804 138697 173076 218392 262193 286232 299771 302760
12417 302760 296887 284162 269989 264550 267120 274863 277366 281924 290611 295728 301850 311780 333926
12404 333926 372651 425916 492095 567716 644158 712068 780273 851708 918265 965756 971011 917469
12392 917469 802667 664168 531512 432912 390083 394001 411847 425696 414984 380985 329655
12381 329655 276641 233646 199217 174532 157375 143615 145944 162897 183904 208202 222552 227351
12369 227351 216269 195232 168238 147598 133504 125737 126572 129947 129130 128436 133010 149396 169033
$$ packed form
12456A58520K0549K3411K0597J7939Q256K335m210j4467j2846k0437k4580k0713
12444A54354k3637k0718j8475j6192r061l619J342N798Q198K511L413J1716Q537
12431A04167J545R23m09o23Q0K886R235K0893L4379M5316M3801K4039J3539K989
12417C02760n873j2725j4173n439K570P743K503M558Q687N117O122R930K2146
12404C33926L8725N3265O6179P5621P6442O7910O8205P1435O6557M7491N255n3542
12392I17469j14802j38499j32656r8600m2829L918J7846J3849j0712l3999n1330
12381C29655n3014m2995l4429k4685j7157j3760K329J6953K1007K4298J4350M799
12369B27351j1082k1037k6994k0640j4094p767Q35L375q17o94M574J6386J9637
$$ plain form
12356 169033 198155 227395 251693 266236 270535 264845 256252 249929 246256 247550 251243 275506 309726
12343 309726 348958 396482 441990 497201 561165 634851 711850 788468 867096 942036 1018439
12332 1018439 1095953 1179962 1281738 1418313 1609754 1880606 2224961 2591661 2879627 2991195
12322 2991195 2903343 2668451 2381430 2116242 1901120 1739055 1612656 1532647 1488138 1465070
12312 1465070 1465267 1486813 1534921 1610018 1711362 1819411 1932516 2044823 2152837 2268928
12302 2268928 2394882 2532334 2680863 2838032 3015521 3215350 3449026 3724899 4045376
12293 4045376 4400956 4784035 5208832 5690972 6269443 6976711 7846136 8889164 10118516
12284 10118516 11559585 13274705 15374164 18017608 21423895 25863310 31736347 39613308
$$ packed form
12356A69033K9122K9240K4298J4543M299n690q593o323l673J294L693K4263L4220
12343C09726L9232M7524M5508N5211O3964P3686P6999P6618P8628P4940P6403
12332A018439P7514Q4009J01776J36575J91441K70852L44355L66700K87966J11568
12322B991195q7852k34892k87021k65188k15122j62065j26399q0009m4509k3068
12312A465070J97K1546M8108P5097J01344J08049J13105J12307J08014J16091
12302B268928J25954J37452J48529J57169J77489J99829K33676K75873L20477
12293D045376L55580L83079M24797M82140N78471P07268Q69425J043028J229352
12284A0118516J441069J715120K099459K643444L406287M439415N873037P876961
$$ plain form
12276 39613308 50347436 65312312 86933189 119351092 168066165 236521763 319704671
12269 319704671 401072096 459066827 478964200 457399544 400974304 324663201 246469348
12262 246469348 180492513 132074700 99159568 77054245 61697444 50519381 42055911
12255 42055911 35468082 30261822 26129114 22855997 20256592 18177328 16496312 15116050
12247 15116050 13945964 12929854 12025860 11201651 10455986 9796197 9222300 8724963 8283435
12238 8283435 7887332 7524713 7180568 6858030 6551068 6271414 6026965 5816418 5634651
12229 5634651 5471530 5323452 5183652 5049885 4927164 4818783 4728384 4653190 4582601 4501158
12219 4501158 4406221 4292652 4153188 4000107 3843790 3682863 3524364 3373355 3233836 3098090
$$ packed form
12276C9613308J0734128J4964876K1620877L2417903M8715073O8455598Q3182908
12269C19704671Q1367425N7994731J9897373k1564656n6425240p6311103p8193853
12262B46469348o5976835m8417813l2915132k2105323j5356801j1178063q463470
12255D2055911o587829n206260m132708l273117k599405k079264j681016j380262
12247A5116050j170086j016110r03994q24209p45665o59789n73897m97337m41528
12238H283435l96103l62619l44145l22538l06962k79654k44449k10547j81767
12229E634651j63121j48078j39800j33767j22721j08381r0399p5194p0589q1443
12219D501158r4937j13569j39464j53081j56317j60927j58499j51009j39519j35746
$$ plain form
12209 3098090 2961998 2827224 2706660 2612507 2538759 2484080 2436998 2391982 2349276 2306692 2281474
12198 2281474 2274419 2281607 2287868 2280028 2256410 2225012 2195163 2168640 2146575 2126007 2109054 2093794
12186 2093794 2060905 2011615 1942044 1869026 1811689 1785242 1790809 1805914 1822704 1840455 1862021
12175 1862021 1894961 1943666 1999587 2060060 2111837 2155099 2211889 2284104 2362152 2440479 2514383
12164 2514383 2602807 2726634 2893057 3108856 3368546 3642329 3927164 4247546 4649407 5195249
12154 5195249 5952689 7023369 8525212 10521069 12841710 15000892 16540827 17525859
12146 17525859 18544866 20282668 23211528 27697915 34306132 44081045 58884628 81950418
12138 81950418 118252283 172788853 243524567 312657729 352225939 345243707 297347668
$$ packed form
12209C098090j36092j34774j20564r4153p3748n4679m7082m5016m2706m2584k5218
12198B281474p055P188O261p840k3618l1398k9849k6523k2065k0568j6953j5260
12186B093794l2889m9290o9571p3018n7337k6447N567J5105J6790J7751K1566
12175A862021L2940M8705N5921O0473N1777M3262N6790P2215P8048P8327P3904
12164B514383Q8424J23827J66423K15799K59690K73783K84835L20382M01861N45842
12154E195249P57440J070680J501843J995857K320641K159182J539935R85032
12146A7525859J019007J737802K928860M486387O608217R774913J4803583K3065790
12138H1950418L6301865N4536570P0735714O9133162L9568210o982232m7896039
$$ plain form
12131 297347668 230091532 166109216 117441254 84529194 62943509 48569281 38771291
12124 38771291 32015084 27392560 24364979 22569410 21601558 20849947 19690614 17892104
12116 17892104 15719231 13641921 11949962 10658267 9664008 8850273 8161572 7578765 7092765
12107 7092765 6694500 6360036 6066475 5788742 5525220 5279768 5055487 4849456 4656844
12098 4656844 4476949 4307656 4154801 4030403 3932950 3852474 3779351 3699903 3614192 3529824
12088 3529824 3447252 3370932 3293775 3211079 3107180 2985655 2871199 2774008 2692959 2621952 2546482
12077 2546482 2460719 2365776 2263046 2159273 2056535 1962427 1881303 1816895 1756610 1701033 1653073
12066 1653073 1612687 1578394 1554015 1528481 1503615 1479352 1449296 1417915 1403730 1396239 1386110
$$ packed form
12131B97347668o7256136o3982316m8667962l2912060k1585685j4374228r797990
12124C8771291o756207m622524l027581j795569r67852p51611j159333j798510
12116A7892104k172873k077310j691959j291695r94259q13735o88701n82807m86000
12107G092765l98265l34464k93561k77733k63522k45452k24281k06031j92612
12098D656844j79895j69293j52855j24398r7453q0476p3123p9448q5711q4368
12088C529824q2572p6320p7157q2696j03899j21525j14456r7191q1049p1007p5470
12077B546482q5763r4943j02730j03773j02738r4108q1124o4408o0285n5577m7960
12066A653073m0386l4293k4379k5534k4866k4263l0056l1381j4185p491j0129
$$ plain form
12055 1386110 1367101 1337210 1304902 1269760 1227574 1188750 1155925 1126324 1101391 1079501 1068072
12044 1068072 1063996 1052695 1034716 1012606 990570 974874 966156 952600 929548 893317 850450 805504
12032 805504 772994 755012 740409 734987 733758 731500 729176 723609 710922 704498 700460 700155 709868
12019 709868 728414 753753 790452 839620 905753 979021 1038691 1065778 1042714 967060 856247
12008 856247 757243 674636 588951 509376 446415 408507 386929 377235 376603 380605 382569 379225 374389
11995 374389 365794 360201 352616 347902 338278 319585 301300 290826 276822 263407 253478 247460 246186
11982 246186 253497 262840 273774 282833 287107 294196 304770 319391 333960 345084 348980 348745 348018
11969 348018 348964 350541 351759 357499 365185 372389 376322 376573 369822 356271 343289 330943 320038 310580
$$ packed form
12055A386110j9009k9891l2308l5142m2186l8824l2825k9601k4933k1890j1429
12044A068072m076j1301j7979k2110k2036j5696q718j3556k3052l6231m2867m4946
12032H05504l2510j7982j4603n422j229k258k324n567j2687o424m038l05R713
12019G09868J8546K5339L6699M9168O6133P3268N9670K7087k3064p5654j10813
12008H56247r9004q2607q5685p9575o2961l7908k1578r694o32M002J964l344m836
11995C74389q595n593p585m714r624j8693j8285j0474j4004j3415r929o018j274
11982B46186P311R343J0934R059M274P089J0574J4621J4569J1124L896k35p27
11969C48018R46J577J218N740P686P204L933K51o751j3551j2982j2346j0905r458
$$ plain form
11955 310580 297187 283314 272988 262432 247068 231523 221964 219532 228126 243476 256403 266442
11943 266442 272311 269641 263434 261028 264763 276334 288054 297846 308543 320958 324374 317273 308380
11930 308380 292424 271705 255086 236844 220981 212233 212950 215868 222654 232331 243250 252636 260649
11917 260649 271576 273017 272520 269145 268184 269329 271498 273953 277637 279088 273407 271117 269411 263381
11903 263381 256173 253346 248341 243621 235525 223213 221336 227072 234235 248968 270040 287279 301260
11890 301260 310313 311935 309555 312968 328041 356562 400253 458873 511117 531032 507993 459382
11878 459382 411295 384166 383669 397491 423362 451637 461605 437434 388496 340791 302294 281705
11866 281705 274414 276667 286089 289102 281715 262164 237666 214264 197208 172599 158891 146951
$$ packed form
11955C10580j3393j3873j0326j0556j5364j5545r559k432Q594J5350J2927J0039
11943B66442N869k670o207k406L735J1571J1720R792J0697J2415L416p101q893
11930C08380j5956k0719j6619j8242j5863q748P17K918O786R677J0919R386Q013
11917B60649J0927J441m97l375r61J145K169K455L684J451n681k290j706o030
11903B63381p208k827n005m720q096j2312j877N736P163J4733K1072J7239J3981
11890C01260R053J622k380L413J5073K8521M3691N8620N2244J9915k3039m8611
11878D59382m8087k7129m97J3822K5871K8275R968k4171m8938m7705l8497k0589
11866B81705p291K253R422L013p387j9551k4498k3402j7056k4609j3708j1940
$$ plain form
11854 146951 145604 150939 157170 164598 171917 179355 187459 197637 207130 212499 216696 223309 229278 235163
11840 235163 248245 261603 281832 308337 338294 371456 411581 459898 526852 628896 793777
11829 793777 1046500 1419134 1896433 2403685 2801677 2951581 2795986 2395778 1890235 1414241
11819 1414241 1042765 790663 625529 515920 445434 399155 357259 327350 300704 280332
11809 280332 265930 259322 257106 256710 260961 273407 285295 302046 321438 330924 327586 315590 309462
11796 309462 307601 319329 353552 412429 487078 538839 533050 479031 414500 370039 359105 379551
11784 379551 433114 507242 563011 562484 506034 430766 370562 334377 313724 307259 313830 318195
11772 318195 311694 287917 259926 234871 213158 201178 192979 185459 174556 164045 161159 156883
$$ packed form
11854A46951j347N335O231P428P319P438Q104J0178R493N369M197O613N969N885
11840B35163J3082J3358K0229K6505K9957L3162M0125M8317O6954J02044J64881
11829G93777K52723L72634M77299N07252L97992J49904j55595m00208n05543m75994
11819A414241l71476k52102j65134j09609p0486m6279m1896k9909k6646k0372
11809B80332j4402o608k216l96M251J2446J1888J6751J9392R486l338j1996o128
11796C09462j861J1728L4223N8877P4649N1761n789n4019o4531m4461j0934K0446
11784C79551N3563P4128N5769n27n6450p5268o0204l6185k0653o465O571M365
11772C18195o501k3777k7991k5055k1713j1980q199p520j0903j0511k886m276
$$ plain form
11760 156883 154472 147744 145687 148385 151114 149230 145656 146408 150952 151230 153373 156876 157384 159452 160121
11745 160121 154511 153950 154565 152626 150150 150759 150662 148417 148990 146207 145238 140896 136166 132569 129360 127566
11729 127566 130840 132485 133379 135510 139124 150061 157407 162001 169609 178505 184494 191974 204415 223644
11715 223644 249725 288179 345017 424754 544202 738279 1023260 1390789 1770160 1998490
11705 1998490 1959471 1687229 1320043 986960 734873 565362 455042 381229 329933 292050
11695 292050 262950 239388 222806 214643 207499 197527 187261 182900 174196 160988 150103 147324 144641
11682 144641 138678 138290 137904 138697 138242 133259 130938 129520 126349 125748 127596 130570 128701 124492 120157
11667 120157 117404 115243 117958 116694 117343 117506 117015 117612 118335 117344 120995 121713 124106 127382 128336 129911
$$ packed form
11760A56883k411o728k057K698K729j884l574P52M544K78K143L503N08K068O69
11745A60121n610n61O15j939k476O09r7k245N73k783r69m342m730l597l209j794
11729A27566L274J645Q94K131L614J0937P346M594P608Q896N989P480J2441J9229
11715B23644K6081L8454N6838P9737J19448J94077K84981L67529L79371K28330
11705A998490l9019k72242l67186l33083k52087j69511j10320p3813n1296l7883
11695B92050k9100k3562j6582q163p144r972j0266m361q704j3208j0885k779k683
11682A44641n963l88l86P93m55m983k321j418l171o01J848K974j869m209m335
11667A20157k753k161K715j264O49J63m91N97P23r91L651P18K393L276R54J575
$$ plain form
11651 129911 134474 135125 130089 127023 127915 126896 128368 130824 128337 124884 121939 121461 119328 116410 111399
11636 111399 108490 109686 111229 115101 119985 122953 121132 116288 116956 116035 114051 114486 115408 120022 122540
11621 122540 121866 120585 121819 121611 118958 119611 120202 117215 114230 113346 114144 113338 108509 105553 103906 102624
11605 102624 102614 103102 101732 98984 99901 100528 100233 101175 96904 96216 94254 89163 90543 93074 94878 94670
11589 94670 90674 94384 96519 95576 92596 89577 93793 95098 100303 105549 112418 118440 117317 112655 111206
11574 111206 113004 112675 115409 118466 118448 121780 122679 120906 116632 112286 104999 104341 104466 99904 94924 92498
11558 92498 88654 86493 86935 88425 91575 91581 88934 87514 87906 89706 91526 94495 96430 98962 100484 97395
11542 97395 96039 98497 98952 96806 95553 103954 107018 108649 110703 109692 104617 100970 101016 101932 102034 100288
$$ packed form
11651A29911M563O51n036l066Q92j019J472K456k487l453k945m78k133k918n011
11636A11399k909J196J543L872M884K968j821m844O68r21j984M35R22M614K518
11621A22540o74j281J234k08k653O53N91k987k985q84P98q06m829k956j647j282
11605A02624j0M88j370k748R17O27k95R42m271o88j962n091J380K531J804k08
11589I4670l996L710K135r43k980l019M216J305N205N246O869O022j123m662j449
11574A11206J798l29K734L057j8L332Q99j773m274m346p287o58J25m562m980k426
11558I2498l844k161M42J490L150Ok647j420L92J800J820K969J935K532J522l089
11542I7395j356K458M55k146j253Q401L064J631K054j011n075l647M6R16J02j746
$$ plain form
11526 100288 99918 102223 101772 99123 99819 102619 108274 114367 123285 133193 149583 172885 194889 214554
11512 214554 220041 213227 198996 185519 172474 154602 135998 123159 114841 112092 106522 102344 101013
11499 101013 101183 100814 101562 98144 96286 104381 108753 111765 111594 111810 114169 115995 115713 117683 118877 117970
11483 117970 119380 121882 133428 150232 175873 214748 272566 344219 407423 434294 420557 375952
11471 375952 334307 310148 303358 290586 265481 232933 202419 177267 160393 148987 136284 127804
11459 127804 122072 122190 123267 123936 125782 124058 126393 136228 143931 145671 142739 141629 140757 137903 141039
11444 141039 144613 149506 161837 181874 211054 260274 325854 391937 434333 432586 388492 333200
11432 333200 287743 264295 260275 269316 276529 269301 251455 233682 224132 217277 208183 196796 178740
$$ packed form
11526A00288l70K305m51k649O96K800N655O093Q918R908J6390K3302K2004J9665
11512B14554N487o814j4231j3477j3045j7872j8604j2839q318k749n570m178j331
11499A01013J70l69P48l418j858Q095M372L012j71K16K359J826k82J970J194r07
11483A17970J410K502J1546J6804K5641L8875N7818P1653O3204K6871j3737m4605
11471C75952m1645k4159o790j2772k5105l2548l0514k5152j6874j1406j2703q480
11459A27804n732J18J077O69J846j724K335R835P703J740k932j110q72k854L136
11444A41039L574M893J2331K0037K9180M9220O5580O6083M2396j747m4094n5292
11432C33200m5457k3448m020R041P213p228j7846j7773r550o855r094j1387j8056
$$ plain form
11419 178740 162555 149895 141946 142258 147424 153521 165994 186266 204450 223424 229894 224164 209274
11406 209274 192222 171743 157639 154076 154410 163313 181509 197933 214000 218992 209141 189521 172191
11393 172191 162708 158732 160135 170709 186770 206877 232739 260535 291406 312806 305843 278224
11381 278224 240126 205101 178701 159218 149496 143370 137184 137053 146266 160150 181604 206038 221186
11368 221186 222651 209670 185097 160733 140507 125159 118229 111083 106937 105852 105725 106420 106286 106109
11354 106109 109879 113944 118029 126703 141114 167771 202602 246458 287617 302869 287702 249697
11342 249697 207433 172680 146790 132370 121856 118166 115485 110541 106708 107900 112331 123407 130546
11329 130546 136214 135306 127334 118735 114570 112001 110858 108100 105239 100062 98624 94091 94237 95839 92699
$$ packed form
11419A78740j6185j2660p949L12N166O097J2473K0272J8184J8974O470n730j4890
11406B09274j7052k0479j4104l563L34Q903J8196J6424J6067M992r851j9620j7330
11393A72191r483l976J403J0574J6061K0107K5862K7796L0871K1400o963k7619
11381B78224l8098l5025k6400j9483r722o126o186j31R213J3884K1454K4434J5148
11368B21186J465j2981k4573k4364k0226j5348o930p146m146j085j27O95j34j77
11354A06109L770M065M085Q674J4411K6657L4831M3856M1159J5252j5167l8005
11342B49697m2264l4753k5890j4420j0514l690k681m944l833J192M431J1076P139
11329A30546N668r08p972q599m165k569j143k758k861n177j438m533J46J602l140
$$ plain form
11314 92699 94898 99006 103028 107209 121172 137526 150010 158489 155995 147765 131322 116359 108436
11301 108436 103577 99584 97779 93162 91350 89860 87734 87798 88966 89938 90419 86223 84615 87697 85241
11286 85241 84196 85145 86339 83853 83292 83868 85061 82819 80236 81925 84313 82872 80799 81260 82685
11271 82685 83355 81790 79749 76355 76900 80606 81870 82374 84220 81362 79464 81960 80836 79138 78633
11256 78633 80832 84845 87452 84564 83556 83484 84207 82711 83114 81799 79517 77598 76807 72776 72988 72381
11240 72381 69992 71818 73357 72188 79034 80875 81474 80705 81603 82606 82162 79559 78102 78298 78825 78018
11224 78018 76675 79056 78205 76831 76615 79766 79958 82329 83142 76299 75895 78525 84378 87643 83682 80391
11208 80391 82787 86006 89450 93817 91424 94749 98881 96767 95948 90702 85016 81819 82727 81278 79164
$$ packed form
11314I2699K199M108M022M181J3963J6354J2484Q479k494q230j6443j4963p923
11301A08436m859l993j805m617j812j490k126O4J168R72M81m196j608L082k456
11286H5241j045R49J194k486n61N76J193k242k583J689K388j441k073M61J425
11271H2685O70j565k041l394N45L706J264N04J846k858j898K496j124j698n05
11256G8633K199M013K607k888j008p2P23j496M03j315k282j919p91m031K12o07
11240G2381k389J826J539j169O846J841N99p69Q98J003m44k603j457J96N27q07
11224G8018j343K381q51j374k16L151J92K371Q13o843m04K630N853L265l961l291
11208H0391K396L219L444M367k393L325M132k114q19n246n686l197R08j449k114
$$ plain form
11193 79164 81681 84070 87557 88134 88077 95897 101560 107472 109266 107374 104567 96568 83992 80051 79228
11178 79228 80795 81192 80304 82942 85273 85325 84853 85991 82777 80935 79086 81042 80006 81114 80661 80603
11162 80603 81514 82001 83298 83506 83180 78438 78778 81539 84144 81588 81966 83446 84179 80222 81491 81322
11146 81322 81684 79960 80720 79042 74813 75893 76275 77442 79772 80279 81281 84680 86472 80963 78948
11131 78948 77168 76240 81244 80033 76596 80637 84547 82159 82636 86395 85187 84137 82380 75976 73509
11116 73509 74855 73092 73704 80173 81150 79316 77910 78241 80498 80558 80847 79549 79053 79737 82194 82879 83865
11099 83865 83966 83416 81818 79415 79420 79930 79854 77649 79314 82500 82838 83600 82617 83420 87729 86041 83356
11082 83356 83208 80658 83855 85070 85016 83535 84057 89390 93112 95047 100328 103412 106884 103385 95667
$$ packed form
11193G9164K517K389L487N77n7P820N663N912J794j892k807p999j2576l941q23
11178G9228J567L97q88K638K331N2m72J138l214j842j849J956j036J108m53n8
11162H0603R11M87J297K08l26m742L40K761K605k556L78J480P33l957J269j69
11146H1322L62j724P60j678m229J080L82J167K330N07J002L399J792n509k015
11131G8948j780r28N004j211l437M041L910k388M77L759j208j050j757o404k467
11116G3509J346j763O12O469R77j834j406L31K257O0K89j298m96O84K457O85R86
11099H3865J01n50j598k403NN10p6k205J665L186L38P62r83Q03M309j688k685
11082H3356j48k550L197J215n4j481N22N333L722J935N281L084L472l499p718
$$ plain form
11067 95667 91497 91700 94299 99721 103317 108419 112585 114278 112356 106884 102351 99909 93071 87458 86576
11052 86576 87578 83382 83737 84275 82646 84424 87709 92383 94347 99612 98541 98524 103951 106105 110678
11037 110678 110035 107533 105418 106386 109305 109298 110071 111431 108646 105198 100793 98173 98463 99595 99024 102369
11021 102369 102212 101131 100109 100377 105165 111633 114135 119632 119757 113260 105573 96727 90923 91704 88825
11006 88825 85470 87818 89307 88274 85814 85001 85745 85415 85583 83552 81841 81872 87637 94182 99434 98736
10990 98736 94235 91113 88614 89830 86400 83812 83230 86878 85247 85581 86074 87210 91776 98038 99193
10975 99193 98747 98258 101183 110048 117051 121119 121878 114910 108190 102345 97297 94639 90441 91091 93079
10960 93079 89758 89761 90589 88752 89118 88079 88463 91540 92702 93229 91403 90746 88021 89639 87882 83990
$$ packed form
11067I5667m170K03K599N422L596N102M166J693j922n472m533k442o838n613q82
11052H6576J002m196L55N38j629J778L285M674J964N265j071j7N427K154M573
11037A10678o43k502k115R68K919pP73J360k785l448m405k620K90J132n71L345
11021A02369j57j081j022K68M788O468K502N497J25o497p687q846n804P81k879
11006H8825l355K348J489j033k460q13P44l30J68k031j711L1N765O545N252o98
10990I8736m501l122k499J216l430k588n82L648j631L34M93J136M566O262J155
10975I9193m46m89K925Q865P003M068P59o968o720n845n048k658m198O50J988
10960I3079l321LQ28j837L66j039L84L077J162N27j826o57k725J618j757l892
$$ plain form
10944 83990 82770 83240 85264 85381 82517 84516 84072 83373 85203 86339 89459 93343 95524 93736 93749 91133
10928 91133 89621 90857 94167 95001 95530 93801 89250 88425 85343 85420 85573 91394 91684 90573 88010 82681
10912 82681 84692 88518 93349 95843 94414 91020 87445 87452 90146 91453 90916 88020 86712 83453 80358
10897 80358 82023 85271 86398 92104 92048 94180 93751 91677 90615 91602 93038 94364 97262 97495 92540 86310
10881 86310 89165 88832 89799 89786 88337 83239 84031 82387 79912 78708 79042 81906 85103 85338 86109 81428
10865 81428 84037 83053 84781 87097 89208 89247 90701 90120 91218 90896 92644 95102 92080 95483 97924 99057
10849 99057 102903 100751 96772 94872 96221 98115 95825 96154 97034 98758 99719 97260 93898 94584 97552
10834 97552 100437 103679 105253 104428 101105 104144 106670 105462 107019 108805 106263 101457 102519 102640 102710
$$ packed form
10944H3990j220M70K024J17k864J999m44o99J830J136L120L884K181j788J3k616
10928I1133j512J236L310Q34N29j729m551q25l082P7J53N821K90j111k563n329
10912H2681K011L826M831K494j429l394l575PK694J307n37k896j308l259l095
10897H0358J665L248J127N706n6K132m29k074j062R87J436J326K898K33m955o230
10881H6310K855l33R67j3j449n098P92j644k475j204L34K864L197K35P71m681
10865H1428K609r84J728K316K111L9J454n81J098l22J748K458l022L403K441J133
10849I9057L846k152l979j900J349J894k290L29Q80J724R61k459l362O86K968
10834I7552K885L242J574q25l323L039K526j208J557J786k542m806J062J21P0
$$ plain form
10819 102710 100427 101310 101822 104370 108638 115143 114739 112654 112837 111303 111106 113721 113525 110973 110557 113135
10803 113135 117828 121552 121985 127442 133290 132746 136525 140029 147241 152301 160602 172164 186155 194183
10789 194183 200505 212247 225912 245184 277276 321128 387336 489163 652441 913622 1312999
10778 1312999 1825693 2272349 2404779 2159056 1706231 1261104 934586 732722 623466
10769 623466 574093 568296 601016 671581 789239 989667 1331965 1902860 2789183 3904737
10759 3904737 4805527 4927466 4212637 3138323 2171924 1494717 1073514 812278 643858
10750 643858 528158 449537 395213 359390 332578 313524 300573 287951 274498 258681 242922
10739 242922 227592 219269 216816 212582 212549 217862 226930 238840 260652 290370 315200 315302 288743
$$ packed form
10819A02710k283Q83N12K548M268O505m04k085J83j534j97K615j96k552m16K578
10803A13135M693L724M33N457N848n44L779L504P212N060Q301J1562J3991Q028
10789A94183O322J1742J3665J9272L2092M3852O6208J01827J63278K61181L99377
10778A312999N12694M46656J32430k45723m52825m45127l26518k01864j09256
10769F23466m9373n797L2720P0565J17658K00428L42298N70895Q86323J115554
10759C904737R00790J21939p14829j074314r66399o77207m21203k61236j68420
10750F43858j15700p8621n4324l5823k6812j9054j2951j2622j3453j5817j5759
10739B42922j5330q323k453m234l3N313R068J1910K1812K9718K4830J02k6559
$$ plain form
10726 288743 253041 224467 201053 183990 168480 161624 159651 157723 155446 153839 151785 151580 148891
10713 148891 145101 145329 144573 143006 144578 147298 152194 158152 165197 162702 155822 148120 140809 133080 133166
10698 133166 135167 131517 128048 130243 133502 134779 138160 134720 135915 139808 139460 138540 136231 131521 128689
10683 128689 129789 127610 125578 125960 124049 122031 122616 122626 120588 122091 125987 132846 141437 144141 141629
10668 141629 139720 134547 130003 128348 127001 126534 124421 127357 128613 127634 129742 129515 136429 143564 150868
10653 150868 156055 157328 150584 142901 134593 123683 118050 116400 116308 117585 115884 116009 120803 126470 137558
10638 137558 156124 186334 224527 243353 229823 202318 178793 164268 158714 162767 170693 181535
10626 181535 195447 210702 202613 179204 157999 142953 134963 127893 120513 120087 121842 117591 112559
$$ packed form
10726B88743l5702k8574k3414j7063j5510o856j973j928k277j607k054k05k689
10713A48891l790K28p56j567J572K720M896N958P045k495o880p702p311p729Q6
10698A33166K001l650l469K195L259J277L381l440J195L893l48r20k309m710k832
10683A28689J100k179k032L82j911k018N85J0k038J503L896O859Q591K704k512
10668A41629j909n173m544j655j347m67k113K936J256r79K108k27O914P135P304
10653A50868N187J273o744p683q308j0910n633j650r2J277j701J25M794N667J1088
10638A37558J8566L0210L8193J8826j3530k7505k3525j4525n554M053P926J0842
10626A81535J3912J5255q089k3409k1205j5046p990p070p380m26J755m251n032
$$ plain form
10613 112559 110147 106742 105422 104365 105178 108831 111480 115987 121442 125501 125006 126889 125768 124956 122615
10598 122615 121644 122212 122670 125699 124759 122038 120843 120676 122074 117706 118424 121614 123964 131702 140351 153911
10582 153911 178393 200221 210012 209251 197043 178363 171732 166686 161155 152384 145384 137242 133881
10569 133881 132822 133906 132652 127497 122269 122272 122750 120896 119995 121562 125263 128774 128264 124280 124837 129586
10553 129586 132887 138578 141010 139860 138553 141077 139819 134566 132530 130422 131461 133870 138582 138291
10539 138291 139321 146192 148042 154802 163368 165710 160270 154286 149337 146491 146908 146149 147169 148873 146719
10524 146719 145537 144447 145600 143298 138649 134160 135106 137729 136619 138392 140319 140731 139531 139052 142652
10509 142652 146137 144977 144996 147864 144959 140399 138871 138066 140099 139050 138682 143344 146616 146227 148070
$$ packed form
10613A12559k412l405j320j057Q13L653K649M507N455M059m95J883j121q12k341
10598A22615r71N68M58L029r40k721j195j67J398m368P18L190K350P738Q649J3560
10582A53911K4482K1828R791p61j2208j8680o631n046n531q771p000q142l361
10569A33881j059J084j254n155n228LM78j854r01J567L701L511n10l984N57M749
10553A29586L301N691K432j150j307K524j258n253k036k108J039K409M712k91
10539A38291J030O871J850O760Q566K342n440n984m949k846M17p59J020J704k154
10524A46719j182j090J153k302m649m489R46K623j110J773J927M12j200m79L600
10509A42652L485j160J9K868k905m560j528q05K033j049l68M662L272l89J843
$$ plain form
10494 148070 151240 158150 158180 157132 157390 155615 150947 153431 152973 152121 157162 162573 161984 161933 160527 159327
10478 159327 159124 160939 163905 167783 168971 172903 173672 171038 169570 167391 163962 161263 158740 161546 162894
10463 162894 163399 166910 176397 184216 186582 188898 189955 188151 189262 187018 184487 185943 185845 186356 182391
10448 182391 177541 176450 175936 172499 167090 163034 160679 155413 155058 157421 160775 162942 159769 157842 159686
10433 159686 161261 161794 161889 164638 166843 170280 173276 171723 169146 168609 167489 166859 168682 172221 175356
10418 175356 177599 171737 167064 166282 164989 164890 165435 170422 172383 174062 173075 166801 159444 156906 157371 157947
10402 157947 160121 162468 165606 169521 172739 175383 178829 181094 180262 181541 185664 187176 188349 187376 183310
10387 183310 182552 185344 185913 182743 176896 171979 162076 157946 156516 152764 149708 150913 157318 168524
$$ packed form
10494A48070L170O910L0j048K58j775m668K484m58q52N041N411n89n1j406j200
10478A59327k03J815K966L878J188L932P69k634j468k179l429k699k523K806J348
10463A62894N05L511R487P819K366K316J057j804J111k244k531J456r8N11l965
10448A82391m850j091n14l437n409m056k355n266l55K363L354K167l173j927J844
10433A59686J575N33R5K749K205L437K996j553k577n37j120o30J823L539L135
10418A75356K243n862m673p82j293r9N45M987J961J679r87o274p357k538M65N76
10402A57947K174K347L138L915L218K644L446K265q32J279M123J512J173r73m066
10387A83310p58K792N69l170n847m917r903m130j430l752l056J205O405J1206
$$ plain form
10373 168524 181398 189415 194016 198312 204955 206376 206539 210529 216095 226563 234289 244524 257279
10360 257279 266070 266626 265320 264015 263596 266385 279006 297549 324206 366073 422360 498975 611384
10347 611384 775073 1023644 1383304 1844661 2354060 2783849 3001629 2936824 2613772 2148371
10337 2148371 1673172 1282024 1004762 830062 729009 675527 657201 667778 705187 778740
10327 778740 913402 1136323 1490084 1993887 2588008 3113788 3354063 3186025 2694118 2087246
10317 2087246 1541474 1139092 873147 706870 601012 530024 478732 438249 408163 382684
10307 382684 365988 353985 346073 339644 334938 333536 332701 327482 323182 322002 319174 314846 312400 310904
10293 310904 308920 311524 309683 307715 302785 294580 286505 284884 283135 283578 283130 282458 281233 274461 267361
$$ packed form
10373A68524J2874Q017M601M296O643J421J63L990N566J0468P726J0235J2755
10360B57279Q791N56j306j305m19K789J2621J8543K6657M1867N6287P6615J12409
10347F11384J63689K48571L59660M61357N09399M29789K17780o4805l23052m65401
10337B148371m75199l91148k77262j74700j01053n3482j8326J0577L7409P3553
10327G78740J34662K22921L53761N03803N94121N25780K40275j68038m91907o06872
10317B087246n45772m02382k65945j66277j05858p0988n1292m0483l0086k5479
10307C82684j6696j2003p912o429m706j402q35n219m300j180k828m328k446j496
10293C10904j984K604j841j968m930q205q075j621j749M43m48o72j225o772p100
$$ plain form
10278 267361 260958 254880 252839 250619 251561 252420 256867 263530 270205 281986 291015 296992 301202 303455
10264 303455 303323 299761 295555 292457 289775 291055 292221 288332 282208 274921 271058 261294 253266 242327
10250 242327 231756 232924 241783 254634 269878 278879 285162 290090 288926 283518 278984 281582 287855
10237 287855 299095 318741 341873 370612 406524 446315 490338 521151 528130 499451 446675 391676
10225 391676 359817 348734 352566 362852 370676 371544 365347 351434 335079 319943 304293 296315 293612
10212 293612 296633 302637 303780 315721 328464 340296 346788 354217 369373 392927 422703 464093
10200 464093 516515 576962 647498 713413 764171 793351 797016 760224 698969 631587 564890 510626
10188 510626 474780 451988 439729 428285 432720 447480 466340 489004 515421 543608 571081 600059
$$ packed form
10278B67361o403o078k041k220R42Q59M447O663O675J1781R029N977M210K253
10264C03455j32l562m206l098k682J280J166l889o124p287l863r764q028j0939
10250B42327j0571J168Q859J2851J5244R001O283M928j164n408m534K598O273
10237B87855J1240J9646K3132K8739L5912L9791M4023L0813O979k8679n2776n4999
10225C91676l1859j1083L832J0286P824Q68o197j3913j6355j5136j5650p978k703
10212B93612L021O004J143J1941J2743J1832O492P429J5156K3554K9776M1390
10200D64093N2422O0447P0536O5915N0758K9180L665l6792o1255o7382o6697n4264
10188E10626l5846k2792j2259j1444M435J4760J8860K2664K6417K8187K7473K8978
$$ plain form
10176 600059 643709 714310 822707 974699 1181564 1456785 1789145 2127399 2369760 2407379
10166 2407379 2209124 1848480 1450319 1111984 873957 720472 625100 568943 538540 527449
10156 527449 532999 541205 544986 538734 528025 509879 492259 471897 451656 433224 419619 407778
10144 407778 407234 414808 422724 430397 440384 446781 452654 460678 466221 476889 492780 519047 553288
10131 553288 591122 626802 655281 673602 675882 665025 639993 601189 560332 527248 508055 497782
10119 497782 498806 513022 537878 563351 583850 593197 598760 603555 618595 650683 707117 781517
10107 781517 860226 914943 933023 905017 847840 786639 736999 706098 697159 707759 729997 756368
10095 756368 783167 802300 804999 789987 768346 742355 722865 714857 719407 737226 762306 793924
$$ packed form
10176F00059M3650P0601J08397J51992K06865K75221L32360L38254K42361L7619
10166B407379j98255l60644l98161l38335k38027j53485r5372n6157l0403j1091
10156E27449N550Q206L781o252j0709j8146j7620k0362k0241j8432j3605j1841
10144D07778n44P574P916P673R987O397N873Q024N543J0668J5891K6267L4241
10131E53288L7834L5680K8479J8321K280j0857k5032l8804m0857l3084j9193j0273
10119D97782J024J4216K4856K5473K0499R347N563M795J5040L2088N6434P4400
10107G81517P8709N4717J8080k8006n7177o1201m9640l0901q939J0600K2238K6371
10095G56368K6799J9133K699j5012k1641k5991j9490q008M550J7819K5080L1618
$$ plain form
10083 793924 832276 874087 917340 966556 1034037 1114942 1214795 1343991 1511766 1731180 2026635
10072 2026635 2420851 2894338 3316498 3493149 3311846 2827701 2234837 1708184 1336465
10063 1336465 1113841 996695 954096 951284 962663 977315 1002045 1040672 1091493 1155977 1224716
10052 1224716 1294758 1368129 1439550 1509923 1586499 1662354 1694845 1646914 1516321 1331114 1140542
10041 1140542 986776 895425 854810 848770 863866 893679 928637 960752 993625 1019482 1044129
10030 1044129 1063140 1080290 1105704 1137493 1171275 1218941 1276853 1357793 1480223 1648048 1824291
10019 1824291 1976591 2123532 2303430 2485373 2576195 2573712 2546310 2520223 2472508 2388956 2301647
10008 2301647 2245486 2223474 2224615 2237420 2245835 2248960 2242226 2234280 2236421 2253113 2293102 2359902
$$ packed form
10083G93924L8352M1811M3253M9216O7481Q0905R9853J29196J67775K19414K95455
10072B026635L94216M73487M22160J76651j81303m84145n92864n26653l71719
10063A336465k22624j17146m2599k812J1379J4652K4730L8627N0821O4484O8739
10052A224716P0042P3371P1421P0373P6576P5855L2491m7931j30593j85207j90572
10041A140542j53766r1351m0615o040J5096K9813L4958L2115L2873K5857K4647
10030A044129J9011J7150K5414L1789L3782M7666N7912Q0940J22430J67825J76243
10019A824291J52300J46941J79898J81943R0822k483k7402k6087m7715q3552q7309
10008B301647n6161k2012J141J2805Q415L125o734p946K141J6692L9989O6800
$$ plain form
9996 2359902 2441542 2527748 2611174 2692723 2779909 2881357 3004494 3148179 3302539 3459684
9986 3459684 3613825 3772104 3934419 4112886 4301696 4490495 4677522 4863352 5050243 5246963
9976 5246963 5464350 5714819 6004063 6342619 6724287 7151062 7629488 8167833 8797273 9567474
9966 9567474 10527758 11688683 12985216 14313202 15583630 16779900 18007916 19453292
9958 19453292 21342629 23900241 27347677 31897703 37776007 45288784 54963248 67865201
9950 67865201 86065476 113054940 153586470 211600878 285581601 364561315 430441009
9943 430441009 466732210 465370540 427969677 363966426 288259134 216163588 158044974
9936 158044974 116770307 89840936 73127324 63192979 57858270 55889656 56589428 59643923
$$ packed form
9996B359902Q1640Q6206Q3426Q1549Q7186J01448J23137J43685J54360J57145
9986C459684J54141J58279J62315J78467J88810J88799J87027J85830J86891J96720
9976E246963K17387K50469K89244L38556L81668M26775M78426N38345O29440P70201
9966I567474R60284J160925J296533J327986J270428J196270J228016J445376
9958A9453292J889337K557612L447436M550026N878304P512777R674464J2901953
9950F7865201J8200275K6989464M0531530N8014408P3980723P8979714O5879694
9943D30441009L6291201j361670l7400863o4003251p5707292p2095546n8118614
9936A58044974m1274667k6929371j6713612r934345n334709j968614O99772L054495
$$ plain form
9928 59643923 65287330 74621660 89997655 115364531 156463790 219267738 304136695
9921 304136695 397516801 472727756 505112232 485941643 423776557 338776806 253856980
9914 253856980 184679406 135373009 102427179 80585222 65698663 55049781 46988469
9907 46988469 40612594 35484087 31393422 28184673 25724383 23914404 22675180 21875594
9899 21875594 21256836 20498229 19400920 17998507 16506482 15142379 14002006 13078680 12320376
9890 12320376 11660992 11065323 10515365 10002812 9525633 9094198 8708752 8354665 8030317
9881 8030317 7731973 7450006 7186552 6946452 6742469 6566625 6415061 6283303 6161666 6042720
9871 6042720 5916328 5775180 5606887 5420039 5234966 5047976 4855004 4660154 4451768 4226622
$$ packed form
9928E9643923N643407R334330J5375995K5366876M1099259O2803948Q4868957
9921C04136695R3380106P5210955L2384476j9170589o2165086q4999751q4919826
9914B53856980o9177574m9306397l2945830k1841957j4886559j0648882q061312
9907D6988469o375875n128507m090665l208749k460290j809979j239224p99586
9899B1875594o18758p58607j097309j402413j492025j364103j140373r23326p58304
9890A2320376o59384n95669n49958n12553m77179m31435l85446l54087l24348
9881H030317k98344k81967k63454k40100k03983j75844j51564j31758j21637j18946
9871F042720j26392j41148j68293j86848j85073j86990j92972j94850k08386k25146
$$ plain form
9861 4226622 3995602 3771372 3558655 3359344 3184277 3032544 2908646 2799653 2707751 2635162
9851 2635162 2577378 2539452 2517661 2494792 2468068 2426677 2372348 2314223 2256980 2207338 2155820
9840 2155820 2105006 2050596 1982602 1900248 1808412 1723099 1650163 1596068 1561806 1545082 1547359 1562859
9828 1562859 1587106 1610711 1633778 1651278 1660459 1657627 1651048 1629401 1580480 1495109 1375192 1245358
9816 1245358 1113755 992538 890380 815546 759059 721356 699908 683528 663310 635543 608228
9805 608228 592079 594811 611615 640195 679103 720951 755909 784869 793111 767396 705287 615971
9793 615971 522745 433642 349089 283488 245891 236932 245807 255459 261734 260565 246843 233787 225037
9780 225037 224163 234370 251097 268595 280660 283954 275010 255831 232284 206769 177382 150547
$$ packed form
9861D226622k31020k24230k12717j99311j75067j51733j23898j08993r1902p2589
9851B635162n7784l7926k1791k2869k6724m1391n4329n8125n7243m9642n1518
9840B155820n0814n4410o7994q2354r1836q5313p2936n4095l4262j6724K277J5500
9828A562859K4247K3605K3067J7500R181k832o579k1647m8921q5371j19917j29834
9816A245358j31603j21217j02158p4834n6487l7703k1448j6380k0218k7767k7315
9805F08228j6149K732J6804K8580L8908M1848L4958K8960Q242k5715o2109q9316
9793F15971r3226q9103q4553o5601l7597q959Q875R652O275j169j3722j3056q750
9780B25037q74J0207J6727J7498J2065L294q944j9179k3547k5515k9387k6835
$$ plain form
9768 150547 139688 143789 156075 165622 172999 177643 174271 171378 171696 171531 168466 170150 178923 191656
9754 191656 209577 230691 249834 263135 269005 271168 266785 262024 260755 264630 276165 287605 297920
9741 297920 300052 289518 265574 230191 189166 149165 121197 108057 115968 141826 175140 211610
9729 211610 245702 271592 291579 301028 310965 316118 328028 349756 377587 418233 464915 508725
9717 508725 555018 613268 694130 811428 1012713 1364441 1911439 2606465 3245961 3577560
9707 3577560 3528601 3230152 2891055 2705985 2797400 3155031 3607206 3862056 3668687 3064986
9697 3064986 2319798 1686347 1248570 979586 816368 708348 638431 589933 547442 503005
9687 503005 458695 413998 366066 324512 292649 275146 264433 256673 253368 253200 252412 249085 246492
$$ packed form
9768A50547j0859M101J2286R547P377M644l372k893L18j65l065J684Q773J2733
9754A91656J7921K1114J9143J3301N870K163m383m761j269L875J1535J1440J0315
9741B97920K132j0534k3944l5383m1025m0001k7968j3140P911K5858L3314L6470
9729B11610L4092K5890J9987R449R937N153J1910K1728K7831M0646M6682M3810
9717E08725M6293N8250Q0862J17298K01285L51728N46998O95026O39496L31599
9707C577560m8959k98449l39097j85070R1415L57631M52175K54850j93369o03701
9697C064986p45188o33451m37777k68984j63218j08020o9917m8498m2491m4437
9687E03005m4310m4697m7932m1554l1863j7503j0713p760l305j68p88l327k593
$$ plain form
9674 246492 249170 255737 258954 259886 256824 255607 255441 251754 240432 223555 204018 185299 178039 173217
9660 173217 171154 171170 169946 165679 157316 142650 130990 126459 131183 138997 145066 149955 154522 156235
9646 156235 151622 141761 123919 107491 95863 87130 84774 90362 103249 121266 130652 130546 121633
9633 121633 106858 89582 76448 65664 60688 60927 66623 76318 86646 93939 95854 104040 107005
9620 107005 103289 101210 99279 97467 104857 116938 130301 140397 143942 134792 120091 101601 84428
9607 84428 68183 56180 52038 51365 51217 52798 58659 57319 55863 55352 57491 55757 57541 63028 67457
9592 67457 69222 76213 85112 90363 92322 97938 101935 103123 102964 97539 91578 85488 81169 74276 71574
9577 71574 73050 72974 72366 67773 61217 57951 64292 71286 75211 86074 100641 113542 123568 131610
$$ packed form
9674B46492K678O567L217R32l062j217j66l687j1322j6877j9537j8719p260m822
9660A73217k063J6j224m267q363j4666j1660m531M724P814O069M889M567J713
9646A56235m613r861j7842j6428j1628q733k356N588J2887J8017R386j06q913
9633A21633j4775j7276j3134j0784m976K39N696R695J0328P293J915Q186K965
9620A07005l716k079j931j812P390J2081J3363J0096L545r150j4701j8490j7173
9607H4428j6245j2003m142o73j48J581N861j340j456n11K139j734J784N487M429
9592F7457J765O991Q899N251J959N616L997J188j59n425n961o090m319o893k702
9577G1574J476p6o08m593o556l266O341O994L925J0863J4567J2901J0026Q042
$$ plain form
9563 131610 141167 147389 149106 150908 156852 162245 157318 151343 149223 154479 160461 171803 197555 228848
9549 228848 267491 311924 371246 462056 603993 817640 1129688 1548751 2044778 2516988
9539 2516988 2829941 2876986 2653971 2242675 1763594 1330293 1001020 778944 634148 533051
9529 533051 458918 402892 362476 331923 309538 303980 313893 332513 360607 399112 460872 556179
9517 556179 697243 928088 1293055 1808350 2417975 2944653 3176723 3007288 2519072 1924356
9507 1924356 1401345 1016985 759700 582380 457342 370310 311630 275909 254840 239605
9497 239605 224680 211218 196017 184756 178695 175342 173654 174326 175181 176523 179032 180415 183947 191716
9483 191716 203156 219888 244760 266479 276298 270566 250115 219856 189050 168849 163020 168974
$$ packed form
9563A31610R557O222J717J802N944N393m927n975k120N256N982J1342K5752L1293
9549B28848L8643M4433N9322R0810J41937K13647L12048M19063M96027M72210
9539B516988L12953M7045k23015m11296m79081m33301l29273k22076j44796j01097
9529E33051p4133n6026m0416l0553k2385n558R913J8620K8094L8505O1760R5307
9517E56179J41064K30845L64967N15295O09625N26678K32070j69435m88216n94716
9507A924356n23011l84360k57285j77320j25038q7032n8680l5721k1069j5235
9497B39605j4925j3462j5201j1261o061l353j688O72Q55J342K509J383L532P769
9483A91716J1440J6732K4872K1719R819n732k0451l0259l0806k0201n829N954
$$ plain form
9471 168974 170618 161703 141532 122811 112599 114799 123500 137167 152517 157497 145787 129775 116197
9458 116197 108661 101488 97832 94458 87800 81901 80331 74573 67961 63726 61358 60316 56961 58683
9444 58683 61725 63057 64250 64997 64013 64422 66243 67979 66039 63654 59786 56016 52570 49856 50724 53156
9428 53156 49030 51093 58402 59830 59647 57926 58327 61055 62885 65634 68173 62458 54666 47835 45415
9413 45415 43509 42665 46578 45126 37177 32727 29763 26043 21359 22911 23946 23169 22499 27389 31228
9398 31228 31400 29521 31496 33173 29837 27573 26545 22952 24068 26381 26518 26786 30188 29014 29496 27899
9382 27899 25510 27208 26360 24767 25551 24643 24391 25110 23801 23465 20564 18354 18452 16175 15786 15671 13554
9365 13554 15930 13420 15148 18344 22274 28690 28283 26565 22914 20848 21199 22571 27596 26373 29306
$$ packed form
9471A68974J644q915k0171j8721j0212K200Q701J3667J5350M980j1710j6012j3578
9458A16197p536p173l656l374o658n899j570n758o612m235k368j042l355J722
9444E8683L042J332J193P47r84M09J821J736j940k385l868l770l446k714Q68K432
9428E3156m126K063P309J428j83j721M01K728J830K749K539n715p792o831k420
9413D5415j906q44L913j452p949m450k964l720m684J552J035p77o70M890L839
9398C1228J72j879J975J677l336k264j028l593J116K313J37K68L402j174M82j597
9382B7899k389J698q48j593P84r08k52P19j309l36k901k210R8k277l89j15k117
9365A3554K376k510J728L196L930O416m07j718l651k066L51J372N025j223K933
$$ plain form
9350 29306 29055 30913 30437 31701 33932 32312 32553 35312 33411 29897 30418 34193 31827 28975 26434 21714
9334 21714 23806 26169 26585 26442 27816 29333 29978 27745 31254 36771 36062 38247 38059 37522 34366 33807
9318 33807 34222 37114 38589 35209 34164 34044 30311 29184 33525 35106 35509 39233 40200 40925 45637 51198
9302 51198 53844 54430 59369 62902 67162 69586 64195 62954 61521 61801 57828 54162 51593 49194 50940
9287 50940 51799 49932 52641 50173 48594 48180 48719 48025 47796 47284 51928 51977 51088 51540 51961 53473 54878
9270 54878 52097 47852 42811 41109 41566 42987 40620 38765 39995 40372 37139 32816 36342 41324 43273
9255 43273 46726 54535 59028 62647 62448 67155 67799 64498 58711 54397 56667 55289 51058 47117 45707
9240 45707 40706 38464 37107 33944 34031 34172 33593 36387 36209 35419 37661 41677 44614 48991 50886 53155
$$ packed form
9350B9306k51J858m76J264K231j620K41K759j901l514N21L775k366k852k541m720
9334B1714K092K363M16j43J374J517O45k233L509N517p09K185j88n37l156n59
9318C3807M15K892J475l380j045j20l733j127M341J581M03L724R67P25M712N561
9302E1198K646N86M939L533M260K424n391j241j433K80l973l666k569k399J746
9287E0940Q59j867K709k468j579m14N39o94k29n12M644M9q89M52M21J512J405
9270E4878k781m245n041j702M57J421k367j855J230L77l233m323L526M982J949
9255D3273L453P809M493L619j99M707O44l301n787m314K270j378m231l941j410
9240D5707n001k242j357l163Q7J41n79K794j78p90K242M016K937M377J895K269
$$ plain form
9224 53155 56105 58412 61284 66758 69318 68329 70801 70361 67726 61968 56080 55616 54808 55375 53255 48612
9208 48612 49401 50980 51333 55392 56403 55853 56943 54884 55732 56140 59498 60051 56736 59770 62728 66392
9192 66392 65526 62062 64158 66339 64945 63908 67209 67527 64756 60624 60890 62437 70695 75068 73774
9177 73774 72482 70537 65761 65249 66472 69672 67265 61713 58560 59904 62693 63841 62342 63437 64723
9162 64723 62232 59932 59150 56988 56330 58537 59861 67509 71590 67411 64446 62910 57947 54449 52600
9147 52600 50613 52790 55834 55929 59874 64181 62495 57789 55835 53748 53024 52186 51255 49238 46505 45965
9131 45965 47714 52890 54304 58347 59292 61044 61120 64660 69355 70574 67662 70151 73355 69329 68543 66994
9115 66994 66425 66297 69124 71492 73041 68888 70004 71273 69299 65995 64248 66337 64328 66137 69817
$$ packed form
9224E3155K950K307K872N474K560r89K472m40k635n758n888m64q08N67k120m643
9208D8612P89J579L53M059J011n50J090k059Q48M08L358N53l315L034K958L664
9192F6392q66l464K096K181j394j037L301L18k771m132K66J547Q258M373j294
9177G3774j292j945m776n12J223L200k407n552l153J344K789J148j499J095J286
9162F4723k491k300p82k162o58K207J324P648M081m179k965j536m963l498j849
9147E2600j987K177L044R5L945M307j686m706j954k087p24q38r31k017k733n40
9131D5965J749N176J414M043R45J752P6L540M695J219k912K489L204m026p86j549
9115F6994n69j28K827K368J549m153J116J269j974l304j747K089k009J809L680
$$ plain form
9100 69817 72513 73466 73562 76497 78234 79677 84019 82060 76907 73166 73713 76480 78365 77076 73590 70455
9084 70455 67170 69578 71418 77136 83803 86403 91510 95244 97760 101946 102389 105818 109876 109179 103645
9069 103645 94353 84333 76984 73422 69280 70511 75076 80385 86285 94498 100179 106121 114326 112412
9055 112412 106410 101160 94396 87517 84822 81644 86397 87177 79704 77878 85183 88758 90982 92846 95335
9040 95335 94417 97106 98326 97673 100710 98090 92290 90784 88147 86429 85720 84487 82130 79633 83364
9025 83364 87784 92766 101583 112874 131921 151899 165082 161793 154545 140489 124291 113572 103537
9012 103537 100122 96590 94317 92337 94112 96925 99424 102310 99817 97477 103051 106671 108218 108169 105656
8997 105656 105490 102720 101847 99898 95840 92040 85189 83780 84160 84951 85497 87332 92890 99951 103946 106137
$$ packed form
9100F9817K696R53R6K935J737J443M342j959n153l741N47K767J885j289l486l135
9084G0455l285K408J840N718O667K600N107L734K516M186M43L429M058o97n534
9069A03645r292j0020p349l562m142J231M565N309N900Q213N681N942Q205j914
9055A12412o002n250o764o879k695l178M753P80p473j826P305L575K224J864K489
9040I5335r18K689J220o53L037k620n800j506k637j718p09j233k357k497L731
9025H3364M420M982Q817J1291J9047J9978J3183l289p248j4056j6198j0719j0035
9012A03537l415l532k273j980J775K813K499K886k493k340N574L620J547m9k513
8997A05656j66k770q73j949m058l800o851j409L80P91N46J835N558P061L995K191
$$ plain form
8981 106137 108928 109588 104834 98631 91987 86532 83663 84719 86252 85832 83627 80502 81505 84329 84901
8966 84901 85463 88198 87110 86364 84788 83389 83911 85791 85434 85655 87247 88959 91460 93264 90705 90261
8950 90261 93458 94668 94643 97297 93662 93998 95434 93208 91710 91424 91460 94211 96932 101800 100697 99587
8934 99587 100737 103036 103807 105976 104166 102558 103464 101016 99210 96454 98648 100711 96805 95065 96342
8919 96342 95896 96830 100247 98192 96645 92092 91526 94805 96735 95371 97475 98376 98264 99479 100498 105106
8903 105106 107703 108258 106917 106007 104640 103024 103896 108394 107171 101827 100433 102771 104523 102245 101853
8888 101853 102379 102780 106916 106211 103352 101755 102065 102173 102116 104212 107400 108591 107868 108598 105224 105225 106080 108833
8870 108833 111002 110977 113386 116402 117177 116614 113004 113045 117025 119682 124359 124273 120357 120736 122346 120930 125481
$$ packed form
8981A06137K791O60m754o203o644n455k869J056J533m20k205l125J003K824N72
8966H4901N62K735j088p46j576j399N22J880l57K21J592J712K501J804k559m44
8950I0261L197J210k5K654l635L36J436k226j498k86L6K751K721M868j103j110
8934I9587J150K299P71K169j810j608R06k448j806k756K194K063l906j740J277
8919I6342m46R34L417k055j547m553n66L279J930j364K104R01j12J215J019M608
8903A05106K597N55j341r10j367j616Q72M498j223n344j394K338J752k278l92
8888A01853N26M01M136p05k859j597L10J08n7K096L188J191p23P30l374JQ55K753
8870A08833K169k5K409L016P75n63l610M1L980K657M677q6l916L79J610j416M551
$$ plain form
8853 125481 126901 126840 123586 122202 124485 124146 124861 127341 129863 126282 124165 123975 128077 130439 129895 129112
8837 129112 129177 129930 133963 136890 137973 138660 137645 139233 136105 131668 130723 133606 135422 138080 138830 142741
8821 142741 141742 141573 137687 135836 139096 141772 141494 138098 137526 142871 146036 149391 148432 146810 147731 150296
8805 150296 151246 150502 145652 143394 142685 142397 138986 136617 133546 138971 144695 146093 146277 142921 140197 141600
8789 141600 144671 144941 146141 148030 154414 158758 159798 156711 151983 147498 148596 149803 146829 151195 152921
8774 152921 153950 156376 155245 152129 154404 157439 161210 160240 161046 163573 162537 161883 165939 166949 166522
8759 166522 168161 167839 166620 167435 174576 172788 172199 176738 183773 186780 187142 190414 195873 198037 198333 202871
8743 202871 206239 209581 211232 214281 219570 223863 226678 227409 230426 232544 238036 248959 259457 265486
$$ packed form
8853A25481J420o1l254j384K283l39P15K480K522l581k117j90M102K362n44p83
8837A29112O5P53M033K927J083O87j015J588l128m437r45K883J816K658P50L911
8821A42741r99j69l886j851L260K676k78l396n72N345L165L355r59j622R21K565
8805A50296R50p44m850k258p09k88l411k369l071N425N724J398J84l356k724J403
8789A41600L071K70J200J889O384M344J040l087m728m485J098J207k974M366J726
8774A52921J029K426j131l116K275L035L771r70Q06K527j036o54M056J010m27
8759A66522J639l22j219Q15P141j788n89M539P035L007L62L272N459K164K96M538
8743B02871L368L342J651L049N289M293K815P31L017K118N492J0923J0498O029
$$ plain form
8729 265486 274624 289338 306815 331417 360549 396308 446634 527347 653309 835449 1050865
8718 1050865 1218356 1275284 1203314 1033897 840592 679781 570834 510254 480192 460363
8708 460363 454044 458062 467433 490679 527130 575480 637298 731108 866500 1075031 1405634 1887563
8696 1887563 2454742 2867375 2888005 2556816 2113665 1760794 1553591 1461586 1447808 1510988
8686 1510988 1668102 1946731 2408634 3143750 4321280 6133303 8539691 10743931 11387219
8677 11387219 10133627 7919696 5757906 4126827 3022166 2299775 1831441 1528448 1335197
8668 1335197 1220384 1142709 1089013 1046607 1024020 1031110 1073007 1173018 1367658 1692175 2147010
8657 2147010 2582186 2728163 2472985 1983605 1494841 1130282 896375 744110 645370 573883
$$ packed form
8729B65486R138J4714J7477K4602K9132L5759N0326Q0713J25962J82140K15416
8718A050865J67491N6928p1970j69417j93305j60811j08947o0580l0062j9829
8708D60363o319M018R371K3246L6451M8350O1818R3810J35392K08531L30603M81929
8696A887563N67179M12633K0630l31189m43151l52871k07203r2005j3778O3180
8686A510988J57114K78629M61903P35116J177530J812023K406388K204240O43288
8677A1387219j253592k213931k161790j631079j104661p22391m68334l02993j93251
8668A335197j14813p7675n3696m2406k2587P090M1897J00011J94640L24517M54835
8657B147010M35176J45977k55178m89380m88764l64559k33907j52265r8740p1487
$$ plain form
8647 573883 524388 491661 469181 448241 430100 421084 412350 401673 392204 384080 375194 365122 363326
8634 363326 356982 350566 346993 347432 348278 346833 344279 344127 341474 337957 339431 337827 335220 329688 328144
8619 328144 323721 318283 316302 316045 315450 312547 309157 309899 308871 306542 305170 306889 309596 309737 310482 311019
8603 311019 312926 312998 312198 311705 308460 308363 309249 312682 313846 311618 308052 307700 311463 313834 313612 312771 316118
8586 316118 319945 324358 332290 334567 336177 336605 340025 345125 348025 347729 352102 355621 357545 358425 361813
8571 361813 366375 371031 370101 369094 374542 378329 380446 379736 385683 389129 391307 394502 398224 407104 411410
8556 411410 413281 415505 421676 423958 426686 431337 433176 434610 435235 438891 444462 450632 453320 452441 454015
8541 454015 460215 465513 470446 471948 470821 470066 473982 476014 476683 478933 478311 474258 474695 475494 477616 476386
$$ packed form
8647E73883m9495l2727k2480k0940j8141r016q734j0677r469q124q886j0072j796
8634C63326o344o416l573M39Q46j445k554j52k653l517J474j604k607n532j544
8619C28144m423n438j981k57n95k903l390P42j028k329j372J719K707J41P45N37
8603C11019J907P2q00m93l245r7Q86L433J164k228l566l52L763K371k22q41L347
8586C16118L827M413P932K277J610M28L420N100K900k96M373L519J924Q80L388
8571C61813M562M656r30j007N448L787K117p10N947L446K178L195L722Q880M306
8556D11410J871K224O171K282K728M651J839J434O25L656N571O170K688q79J574
8541D54015O200N298M933J502j127p55L916K032O69K250o22m053M37P99K122j230
$$ plain form
8525 476386 473789 473189 476913 482815 487200 486034 484995 487003 493734 501662 506612 507260 510519 513865 512111
8510 512111 516209 521091 526836 530988 540115 546978 551085 554007 559769 562427 566982 572084 574778 583069
8496 583069 587954 591913 595109 599633 607012 610213 613021 622689 628141 635437 645712 655264 662222 668606
8482 668606 677560 687924 699347 709934 726062 750458 775132 788934 789480 781210 775042 774917 775622
8469 775622 779807 786673 791923 798964 811575 822331 826462 827720 830584 836228 840536 849255 856833 861766
8455 861766 870794 884585 899100 909645 923372 936499 950390 960689 971367 981127 992498 1009227
8443 1009227 1025849 1044059 1063427 1086970 1118237 1148439 1172635 1184469 1186807 1188173 1197802 1213199
8431 1213199 1225565 1239628 1259267 1279626 1297271 1321397 1349499 1372550 1394916 1417973 1438046
$$ packed form
8525D76386k597o00L724N902M385j166j039K008O731P928M950O48L259L346j754
8510E12111M098M882N745M152R127O863M107K922N762K658M555N102K694Q291
8496E83069M885L959L196M524P379L201K808R668N452P296J0275R552O958O384
8482F68606Q954J0364J1423J0587J6128K4396K4674J3802N46q270o168j25P05
8469G75622M185O866N250P041J2611J0756M131J258K864N644M308Q719P578M933
8455H61766R028J3791J4515J0545J3727J3127J3891J0299J0678R760J1371J6729
8443A009227J6622J8210J9368K3543L1267L0202K4196J1834K338J366R629J5397
8431A213199J2366J4063J9639K0359J7645K4126K8102K3051K2366K3057K0073
$$ plain form
8420 1438046 1459740 1480289 1498257 1519883 1540636 1558362 1577750 1593112 1607696 1615330 1616118 1613788
8408 1613788 1612661 1611823 1614351 1620976 1629279 1640563 1649736 1664314 1681788 1704255 1729572 1749629 1775673
8395 1775673 1799348 1826762 1858051 1885077 1913392 1947714 1978782 2012619 2047695 2079328 2116542
8384 2116542 2155302 2194606 2235717 2283276 2332198 2376628 2421626 2465519 2518024 2575856 2635387
8373 2635387 2696027 2758211 2822504 2890177 2958085 3032376 3104059 3178253 3255753 3337875 3419315
8362 3419315 3504649 3597007 3694738 3796314 3900235 4006900 4118230 4234699 4356517 4482687
8352 4482687 4610448 4738743 4878551 5026982 5180956 5340558 5508394 5682731 5863874 6058428
8342 6058428 6263846 6473821 6692203 6926519 7173637 7430244 7705536 7999981 8308428 8635103
$$ packed form
8420A438046K1694K0549J7968K1626K0753J7726J9388J5362J4584P634P88k330
8408A613788j127q38K528O625Q303J1284R173J4578J7474K2467K5317K0057K6044
8395A775673K3675K7414L1289K7026K8315L4322L1068L3837L5076L1633L7214
8384B116542L8760L9304M1111M7559M8922M4430M4998M3893N2505N7832N9531
8373B635387O0640O2184O4293O7673O7908P4291P1683P4194P7500Q2122Q1440
8362C419315Q5334R2358R7731J01576J03921J06665J11330J16469J21818J26170
8352D482687J27761J28295J39808J48431J53974J59602J67836J74337J81143J94554
8342F058428K05418K09975K18382K34316K47118K56607K75292K94445L08447L26675
$$ plain form
8332 8635103 8982849 9351376 9748210 10163815 10605186 11078860 11581040 12119839 12696843 13310806
8322 13310806 13972568 14680902 15438475 16250750 17125388 18069648 19088342 20180175 21359023
8313 21359023 22628963 23995523 25469254 27059686 28776933 30626433 32612257 34736264
8305 34736264 37001942 39414935 41968622 44656387 47457797 50354865 53313997 56282787
8297 56282787 59215354 62042469 64685945 67067681 69097765 70702547 71814304 72379791
8289 72379791 72383595 71820266 70712289 69109729 67081744 64709120 62078772 59264492 56347919
8280 56347919 53395666 50459543 47584073 44807469 42145537 39620657 37232893 34985615
8272 34985615 32883000 30925727 29100148 27403564 25825624 24361686 23006431 21748514
$$ packed form
8332H635103L47746L68527L96834M15605M41371M73674N02180N38799N77004O13963
8322A3310806O61762P08334P57573Q12275Q74638R44260J018694J091833J178848
8313B1359023J269940J366560J473731J590432J717247J849500J985824K124007
8305C4736264K265678K412993K553687K687765K801410K897068K959132K968790
8297E6282787K932567K827115K643476K381736K030084J604782J111757N65487
8289G2379791L804n63329j107977j602560k027985k372624k630348k814280k916573
8280E6347919k952253k936123k875470k776604k661932k524880k387764k247278
8272C4985615k102615j957273j825579j696584j577940j463938j355255j257917
$$ plain form
8264 21748514 20583001 19501068 18492948 17558425 16690387 15878548 15121202 14418163 13758421
8255 13758421 13141482 12563579 12023901 11521275 11050638 10609792 10188041 9790163 9411739
8246 9411739 9051652 8713537 8393611 8086489 7797785 7526681 7265652 7010375 6768678 6546977
8236 6546977 6332861 6119258 5920650 5732042 5551297 5383409 5228691 5079905 4930982 4777627
8226 4777627 4630844 4485556 4348703 4217235 4095058 3978854 3871923 3776406 3690028 3604407
8216 3604407 3516348 3424312 3325283 3228537 3142344 3059865 2978366 2895086 2812522 2735301 2667603
8205 2667603 2600257 2538506 2474203 2413984 2355056 2296201 2246322 2196624 2146428 2097512 2049349
8194 2049349 1997034 1948356 1909105 1871016 1835196 1796185 1757375 1724237 1695972 1677288 1665449
$$ packed form
8264B1748514j165513j081933j008120r34523q68038q11839p57346p03039o59742
8255A3758421o16939n77903n39678n02626m70637m40846m21751l97878l78424
8246I411739l60087l38115l19926l07122k88704k71104k61029k55277k41697k21701
8236F546977k14116k13603j98608j88608j80745j67888j54718j48786j48923j53355
8226D777627j46783j45288j36853j31468j22177j16204j06931r5517q6378q5621
8216C604407q8059r2036r9029r6746q6193q2479q1499q3280q2564p7221o7698
8205B667603o7346o1751o4303o0219n8928n8855m9879m9698n0196m8916m8163
8194B049349n2315m8678l9251l8089l5820l9011l8810l3138k8265j8684j1839
$$ plain form
8183 1665449 1662625 1659913 1637215 1592469 1543290 1498261 1461112 1432757 1419569 1422383 1429984 1436949
8171 1436949 1419411 1372905 1321801 1279799 1246079 1210135 1167969 1122810 1085188 1051608 1023486
8160 1023486 995353 969589 947254 925527 907697 889123 871151 856531 839017 823008 810565
8149 810565 797813 780702 761546 743089 730193 722576 715381 707534 696937 684524 679279 681560 686727
8136 686727 690287 686166 672822 654862 638708 627974 622046 623385 629430 634009 636370 627863 607010
8123 607010 588630 576987 565685 553896 539305 527946 515337 501002 492342 484996 477078 468591
8111 468591 460149 449916 442752 444463 440909 430408 424360 420954 414386 410896 407061 402923 397590 391082
8097 391082 389496 382996 380132 380930 380132 376205 369857 366646 360866 358211 353254 349306 349119 346849 341898
$$ packed form
8183A665449k824k712k2698m4746m9179m5029l7149k8355j3188K814P601O965
8171A436949j7538m6506n1104m2002l3720l5944m2166m5159l7622l3580k8122
8160A023486k8133k5764k2335k1727j7830j8574j7972j4620j7514j6009j2443
8149H10565j2752j7111j9156j8457j2896p617p195p847j0597j2413n245K281N167
8136F86727L560m121j3344j7960j6154j0734n928J339O045M579K361q507k0853
8123F07010j8380j1643j1302j1789j4591j1359j2609j4335q660p346p918q487
8111D68591q442j0233p164J711l554j0501o048l406o568l490l835m138n333o508
8097C91082j586o500k864P98p98l927o348l211n780k655m957l948j87k270m951
$$ plain form
8082 341898 336857 333612 328615 322579 321280 323251 323149 321478 320234 321203 319390 310708 302393 298361 295710
8067 295710 288235 285491 285477 286407 283853 278894 269445 266241 268499 269565 265795 264475 263121 260675 260342
8052 260342 258628 256408 248801 246263 242724 238772 239784 242589 242784 241943 237184 235068 231410 227379 227046
8037 227046 227897 227069 223222 221212 220742 219994 215823 205980 199554 197226 197588 199264 199303 195185 188662 186438
8021 186438 180920 181272 178734 173855 170698 170507 167859 165216 164025 165876 161616 156660 153384 156716 159767
8006 159767 158685 153180 151052 147515 147695 150051 146857 146589 146352 146169 150192 150684 152539 154291 155850 149274
7990 149274 144768 142874 141391 137379 132174 134736 134032 133455 133974 129478 127638 123354 120639 121702 124152
7975 124152 120528 114051 108473 105191 105584 111497 112080 108546 107412 105464 101043 100073 103247 103938 104629 102433
$$ packed form
8082C41898n041l245m997o036j299J971j02j671j244R69j813q682q315m032k651
8067B95710p475k744j4R30k554m959r449l204K258J066l770j320j354k446l33
8052B60342j714k220p607k538l539l952J012K805J95q41m759k116l658m031l33
8037B27046Q51q28l847k010m70p48m171r843o426k328L62J676L9m118o523k224
8021A86438n518L52k538m879l157j91k648k643j191J851m260m956l276L332L051
8006A59767j082n505k128l537J80K356l194k68k37j83M023M92J855J752J559o576
7990A49274m506j894j483m012n205K562p04n77N19m496j840m284k715J063K450
7975A24152l624o477n578l282L93N913N83l534j134j948m421r70L174O91O91k196
$$ plain form
7959 102433 98875 98800 97472 95601 99614 101632 102318 103173 105931 108437 107836 109818 108205 99547 95027 92656
7943 92656 93551 94794 95063 96598 97119 97159 97650 100688 98249 89616 85414 86392 87413 80988 79720 81325
7927 81325 81976 82767 79408 76103 77342 80293 79834 81133 76778 74373 76404 74839 73353 76148 74318
7912 74318 67861 66661 69766 71405 76055 78548 76259 73458 68974 64035 59273 58665 62522 64257 65085
7897 65085 64998 67842 70934 70094 71343 73468 70519 69429 67514 64824 65597 65476 65172 61607 55813 55040
7881 55040 56661 57972 56862 55397 53801 61748 65504 63158 62898 64066 62579 61746 67942 66958 65699
7866 65699 66435 64564 58801 50863 50005 45731 47720 55009 65036 70975 70668 65907 65406 70029 75400
7851 75400 73031 68842 59975 56557 52320 54701 56868 61396 65972 62755 61333 62550 59907 59519 56892
$$ packed form
7959A02433l558p5j328j871M013K018O86Q55K758K506o01J982j613q658m520k371
7943I2656Q95J243K69J535N21M0M91L038k439q633m202R78J021o425j268J605
7927H1325O51P91l359l305J239K951m59J299m355k405K031j565j486K795j830
7912G4318o457j200L105J639M650K493k289k801m484m939m762o08L857J735Q28
7897F5085q7K844L092q40J249K125k949j090j915k690P73j21l04l565n794p73
7881E5040J621J311j110j465j596P947L756k346k60J168j487q33O196r84j259
7866F5699P36j871n763p938q58m274J989P289J0027N939l07m761n01M623N371
7851G5400k369m189q867l418m237K381K167M528M576l217j422J217k643l88k627
$$ plain form
7836 56892 53205 54831 58169 61588 64433 67375 63902 59522 59636 57348 58248 58667 58713 56726 58523 61068
7820 61068 65252 66089 64567 68700 74296 77350 78584 79601 83990 84217 81243 74943 67112 67714 73273
7805 73273 71633 68936 62506 55805 51831 48233 46934 49071 48947 48704 46750 44476 44769 45207 46285 49427
7789 49427 50685 51178 52493 56423 53455 51473 48912 51960 57989 57805 53733 50897 51459 57663 59834
7774 59834 61267 60050 60205 60801 65056 66567 64913 61843 56796 53012 53088 53650 51070 45334 41940 39377
7758 39377 34699 31939 30935 34785 39856 40127 42787 44438 42570 37227 30826 29795 27528 26255 30604
7743 30604 36322 34630 28205 28792 36302 43194 45147 40476 34218 27897 21177 22263 30573 41448 52418
7728 52418 58169 54999 43991 31891 19031 10412 10569 14177 19952 19824 15663 11335 11048 19544 29931
$$ packed form
7836E6892l687J626L338L419K845K942l473m380J14k288R00M19M6j987J797K545
7820F1068M184Q37j522M133N596L054J234J017M389K27k974o300p831O02N559
7805G3273j640k697o430o701l974l598j299K137j24k43j954k274K93M38J078L142
7789D9427J258M93J315L930k968j982k561L048O029j84m072k836N62O204K171
7774E9834J433j217J55N96M255J511j654l070n047l784P6N62k580n736l394k563
7758C9377m678k760j004L850N071K71K660J651j868n343o401j031k267j273M349
7743C0604N718j692o425N87P510O892J953m671o258o321o720J086Q310J0875J0970
7728E2418N751l170j1008j2100j2860q619J57L608N775j28m161m328k87Q496J0387
$$ plain form
7713 29931 31847 26161 16127 9714 18878 22979 28476 35909 42821 44774 38026 31154 19342 12268
7699 12268 9047 11171 18187 18896 15178 10728 7033 11173 16278 19637 18646 15503 13304 15660 18529
7684 18529 17917 15322 14867 15109 12014 9820 7763 13813 13961 12895 13068 10807 6579 5125 11935 12764
7668 12764 11600 10131 7588 6307 8554 5886 6997 9977 12044 6309 2564 3970 4644 5635 2846
7653 2846 4016 8512 6371 4042 4084 4815 6587 8812 10817 5614 730 177 1405 3533 5622 7785
7637 7785 9247 12652 16073 19636 19764 20182 16698 12832 10129 9523 11924 9503 7531 8518 8880 12581
7621 12581 11723 11579 12541 17812 18906 14749 9613 6345 2928 2004 2035 4302 8245 6253 6967 7773 7242
7604 7242 7690 8916 9624 6361 2424 4495 11391 24357 37441 49760 49172 38830 26096 15736
$$ packed form
7713B9931J916n686j0034o413R164M101N497P433O912J953o748o872j1812p074
7699A2268l221K124P016P09l718m450l695M140N105L359r91l143k199K356K869
7684A8529o12k595m55K42l095k194k057O050J48j066J73k261m228j454O810Q29
7668A2764j164j469k543j281K247k668J111K980K067n735l745J406O74R91k789
7653B846J170M496k141k329M2P31J772K225K005n203m884n53J228K128K089K163
7637G785J462L405L421L563J28M18l484l866k703o06K401k421j972R87L62L701
7621A2581q58j44R62N271J094m157n136l268l417r24L1K267L943j992P14Q06n31
7604G242M48J226P08l263l937K071O896J2966J3084J2319n88j0342j2734j0360
$$ plain form
7590 15736 5291 -2846 -6682 -2962 3830 2032 4144 4969 289 -2348 -1737 248 -1505 -3071 -10474
7575 -10474 -6834 2105 12266 21144 26581 26366 18815 6195 -2272 -4750 -2009 875 -163 -2654
7561 -2654 -3716 -729 7031 8886 9450 11688 8183 1504 -2065 1893 4436 2651 -1413 -2187 2435
7546 2435 3850 2771 216 -1706 702 2559 1007 -2973 -1801 373 1287 1612 -454 -1780 -2761 -2523
7530 -2523 -4480 -7722 -3730 -2650 520 2974 129 765 -1872 -47 241 -1944 -322 2906 6449
7515 6449 4285 4819 7732 11137 13359 11597 8222 9199 8103 5578 2968 -730 491 -1661 -2158 -18
7499 -18 -916 -3834 -5155 -4591 -3083 -285 934 2476 1375 592 4578 6668 3873 2447 5615 7108
7483 7108 5298 -571 1429 106 -3141 -2409 -3946 -3094 -2553 -2074 -2837 -2370 -2052 659 523 2132 1505
$$ packed form
7590A5736j0445q137l836L720O792j798K112Q25m680k637O11J985j753j566p403
7575a0474L640Q939J0161Q878N437k15p551j2620q467k478K741K884j038k491
7561b654j062K987P760J855N64K238l505o679l569L958K543j785m064p74M622
7546B435J415j079k555j922K408J857j552l980J172K174R14L25k066j326r81K38
7530b523j957l242L992J080L170K454k845O36k637J825K88k185J622L228L543
7515F449k164N34K913L405K222j762l375R77j096k525k610l698J221k152m97K140
7499a8q98k918j321N64J508K798J219J542j101p83L986K090k795j426L168J493
7483G108j810n869K000j323l247P32j537Q52N41M79p63M67L18K711j36J609o27
$$ plain form
7466 1505 -1658 -7603 -13225 -19767 -26466 -28309 -25661 -22232 -13741 -7864 -4607 -2312 -3446 -6149 -3165
7451 -3165 -3924 -4014 1885 2847 -1212 -918 -13 -61 1863 4360 2496 -2510 -6253 -5011 -3554 -3738 -3538
7434 -3538 -3670 -2474 -2055 -5114 -1342 5177 4535 1285 2233 1330 903 -2669 -6352 -2531 -2429 -3523 -1441
7417 -1441 7 3214 5771 7341 2682 1869 603 -2161 -3022 -2900 -2169 -1891 -781 2717 5991 6701
7401 6701 7749 8956 8912 8149 2822 -4023 -5692 -5284 -5269 -7123 -8285 -6889 -5263 -5075 -6129 -4990 -2168
7384 -2168 -1601 -3135 -4741 -7152 -6453 -5064 -3101 -5889 -5517 -2731 -2411 -6773 -5014 -7058 -7628 -4579
7368 -4579 -1396 -3776 -7153 -6562 -4088 -1549 -2275 -2791 -2506 -1589 -3914 -4688 -6402 -8533 -12304 -15072
7352 -15072 -14467 -11828 -5871 -6068 -6275 -6235 -2102 959 -214 331 -1236 -2047 -954 -725 -3309 -5281 -3174
$$ packed form
7466A505l163n945n622o542o699j843K648L429Q491N877L257K295j134k703K984
7451c165p59r0N899R62m059K94R05m8J924K497j864n006l743J242J457j84K00
7434c538j32J196M19l059L772O519o42l250R48r03m27l572l683L821J02j094K082
7417a441J448L207K557J570m659q13j266k764q61J22P31K78J110L498L274P10
7401F701J048J207m4p63n327o845j669M08J5j854j162J396J626J88j054J139K822
7384b168N67j534j606k411O99J389J963k788L72K786L20m362J759k044n70L049
7368d579L183k380l377N91K474K539p26n16K85R17k325p74j714k131l771k768
7352a5072O05K639N957j97k07M0M133L061j173N45j567q11J093K29k584j972K107
$$ plain form
7335 -3174 -1336 -924 -2975 -522 1571 886 -392 34 105 -2559 -3321 -3219 -5339 -3328 -849 -1543 -344
7318 -344 -3134 -5401 -4311 -1487 -601 -3916 -3072 -6580 -12388 -11251 -13925 -13786 -14436 -5646 -6482 -11987
7302 -11987 -9454 -6276 -1625 649 -2398 -3033 -2893 -3140 -6894 -12395 -13173 -13305 -11756 -9130 -4736 -514
7286 -514 -112 278 -5454 -10888 -11459 -8705 -5460 -2631 -696 -975 -387 -418 670 -2466 -3843 -3664 -3207
7269 -3207 -1517 400 -1697 -3851 -2951 -2306 -8015 -11306 -10584 -9268 -9008 -6665 -3108 -2266 1334 6293
7253 6293 3267 -2873 -5608 -8310 -6472 -4749 -6624 -7763 -9024 -5200 -4254 -6497 -6925 -3670 -2512
7238 -2512 -1196 -2427 -8925 -13153 -11994 -8579 -10358 -6707 -1061 1109 -141 -1806 -3849 -3449 -368
7223 -368 21 3150 3113 741 705 2304 1665 -2358 -1744 2753 -197 -4016 -6825 -3792 1118 105 -2496
$$ packed form
7335c174J838M12k051K453K093o85j278M26P1k664p62J02k120K011K479o94J199
7318c44k790k267J090K824Q86l315Q44l508n808J137k674J39o50Q790q36n505
7302a1987K533L178M651K274l047o35J40k47l754n501p78j32J549K626M394M222
7286e14M02L90n732n434n71K754L245K829J935k79N88l1J088l136j377J79M57
7269c207J690J917k097k154R00O45n709l291P22J316K60K343L557Q42L600M959
7253F293l026o140k735k702J838J723j875j139j261L824R46k243m28L255J158
7238b512J316j231o498m228J159L415j779L651N646K170j250j665k043M00L081
7223c68L89L129l7k372l6J599o39m023O14M497k950l819k809L033M910j013k601
$$ plain form
7206 -2496 -5455 -4110 -3429 -2284 -451 -3378 -6218 -6204 -6522 -5126 -3092 -4366 -5597 -6272 -7667 -11713
7190 -11713 -9710 -9848 -13198 -10932 -9513 -6381 -4866 -7040 -11479 -12861 -11540 -10371 -8256 -5294 -2485
7175 -2485 -2572 -3888 -5433 -9925 -10453 -5472 -6877 -5485 -1150 893 -1504 -5080 -2229 448 2496 -927
7159 -927 733 -3110 -7462 -10890 -8869 -9304 -10720 -10505 -11233 -12745 -10916 -12288 -12208 -12196 -10456 -6146 -4505
7142 -4505 -8755 -8014 -5365 -3425 -3531 -7340 -10898 -10575 -7851 -7366 -4103 -3726 -2158 -237 -2821 -562
7126 -562 1872 1344 1591 2719 110 -2796 -4827 -3855 -4476 -5605 -8509 -8606 -7901 -7494 -5829 -4818 -3383
7109 -3383 1479 1324 803 -972 -4843 -7292 -8703 -10495 -6241 -1975 -2685 -446 -1675 -4514 -5255 -6812
7093 -6812 -8187 -3644 -5198 -4099 -3906 -7026 -5181 -2582 -1274 -2257 -2346 -1021 -658 -2582 -3621 -8240
$$ packed form
7206b496k959J345O81J145J833k927k840J4l18J396K034j274j231o75j395m046
7190a1713K003j38l350K266J419L132J515k174m439j382J321J169K115K962K809
7175b485q7j316j545m492n28M981j405J392M335K043k397l576K851K677K048l423
7159i27J660l843m352l428K021m35j416K15p28j512J829j372Q0J2J740M310J641
7142d505m250P41K649J940j06l809l558L23K724M85L263L77J568J921k584K259
7126e62K434n28K47J128k609k906k031R72o21j129k904r7P05M07J665J011J435
7109c383M862j55n21j775l871k449j411j792M254M266p10K239j229k839p41j557
7093f812j375M543j554J099J93l120J845K599J308r83q9J325L63j924j039m619
$$ plain form
7077 -8240 -12730 -10682 -9281 -8316 -10024 -11440 -7896 -2116 4359 4016 5480 4245 -340 -3992 -5720
7062 -5720 -2816 -1147 -775 2154 2952 3055 87 -1753 -2116 -2487 -2057 -4686 -8842 -7701 264 1165 -3767
7045 -3767 -6840 -7673 -1689 230 -5232 -10549 -10179 -6564 792 515 -3010 -5553 -6255 -9477 -8068 -7196
7029 -7196 -5106 -1489 -1748 -1803 -3334 -5245 -5675 -6590 -5191 -5811 -4094 -3338 -1648 -2746 -1662 -357 -134
7012 -134 -3415 -5290 -6964 -9246 -9712 -8872 -6099 -2768 -7380 -11723 -8594 -2734 -1761 -7040 -8653 -6440
6996 -6440 -10142 -9537 -8597 -7814 -8702 -7355 -7088 -9125 -10656 -7928 -7235 -8737 -8502 -10889 -11449 -10980 -8555
6979 -8555 -7637 -7272 -4512 -9241 -10016 -10563 -9731 -6667 -3897 -3805 -675 -3805 -7234 -10956 -9743 -7866 -5938
6962 -5938 -3974 -4566 -4075 -4706 -8204 -6277 -2317 -1843 -1092 -2890 -680 540 -5717 -6953 -6005 -5066 -6914
$$ packed form
7077h240m490K048J401R65j708j416L544N780O475l43J464j235m585l652j728
7062e720K904J669L72K929P98J03k968j840l63l71M30k629m156J141P965R01m932
7045c767l073q33N984J919n462n317L70L615P356k77l525k543p02l222J409Q72
7029g196K090L617k59n5j531j911m30r15J399o20J717P56J690j098J084J305K23
7012a34l281j875j674k282m66Q40K773L331m612m343L129N860R73n279j613K213
6996f440l702O05R40P83q88J347K67k037j531K728O93j502K35k387n60M69K425
6979h555R18L65K760m729p75n47Q32L064K770R2L130l130l429l722J213J877J928
6962e938J964n92M91o31l498J927L960M74P51j798K210J220o257j236R48R39j848
$$ plain form
6945 -6914 -8665 -6762 -5354 -4714 -2814 -1148 -332 -3546 -9349 -7967 -5726 -6106 -4478 -2707 -6458 -7489
6929 -7489 -7503 -5862 -3987 -1177 -2627 -2642 -700 912 -2292 -3906 -9354 -13899 -12976 -11110 -6644 -6185
6913 -6185 -6132 -8155 -7099 -2106 -562 -3249 -5325 -7297 -5913 -2867 -2388 -1231 3341 3559 2024 1555
6897 1555 -1205 -3547 -4521 -5292 -6051 -4941 -3844 -1748 -2943 -2453 -3078 -4777 -5030 -4052 -2320 -2365 -5540
6880 -5540 -9355 -10271 -6886 -3964 -365 -35 -3199 -918 -774 -3115 -1743 819 -977 -3886 -4195 -4684
6864 -4684 -4287 -3088 -1542 -2009 1465 -1632 -4025 -5711 -7343 -4105 -2664 -2671 -4959 -6513 -6268 -4888
6848 -4888 -1189 -118 -4870 -6831 -7283 -3315 -1119 63 -1212 1217 860 -212 -244 94 -504 267 3825
6831 3825 4863 3813 3806 6566 6093 3592 2319 1943 -988 -4641 -9125 -9856 -6435 -6871 -6453 -4634 -3317
$$ packed form
6945f914j751J903J408O40J900J666Q16l214n803J382K241l80J628J771l751j031
6929g489j4J641J875K810j450j5J942J612l204j614n448m545R23J866M466M59
6913f185N3k023J056M993J544k687k076j972J384L046M79J157M572K18j535m69
6897A555k760k342r74p71p59J110J097K096j195M90o25j699k53R78J732m5l175
6880e540l815r16L385K922L599L30l164K281J44k341J372K562j796k909l09m89
6864d684L97J199J546m67L474l097k393j686j632L238J441pk288j554K45J380
6848d888L699J071m752j961m52L968K196J182j275K429l57j072l2L38n98P71L558
6831C825J038j050pK760m73k501j273l76k931l653m484p31L421m36M18J819J317
$$ plain form
6814 -3317 -8197 -11190 -8949 -7402 -11017 -13422 -14318 -10936 -7117 -6905 -5907 -3818 -6103 -6283 -6964 -8598
6798 -8598 -3869 -1223 -5035 -10252 -11238 -13575 -13366 -8068 -8588 -7907 -7627 -5206 -2638 -3496 -1680 -349
6782 -349 -837 -4450 -7461 -9508 -6934 -4920 -4891 -916 1276 2388 -1703 -4687 -4997 -5579 -5755 -7985 -6629
6765 -6629 -5148 -4261 -4675 -3391 -4491 -2958 -2652 -387 415 2609 4089 4040 -215 -437 -1236 -3070 -5839
6748 -5839 -5680 -4960 -4800 -6358 -5318 -5510 -7405 -4525 -1972 -987 1452 -981 -3825 -3340 -318 -909 -4872
6731 -4872 -5562 -7785 -9745 -7194 -7376 -6941 -7769 -7435 -2565 -133 3291 3536 2980 2321 661 792 3242
6714 3242 6477 4923 4895 4456 1375 -1720 -1142 -2606 -2513 436 2884 5173 8279 13908 16138 14231
6698 14231 14278 20662 33721 52262 79094 122112 177679 211239 197872 145569 93178 58637 34288
$$ packed form
6814c317m880k993K241J547l615k405q96L382L819K12R98K089k285j80o81j634
6798h598M729K646l812n217r86k337K09N298n20O81K80K421K568q58J816J331
6782c49m88l613l011k047K574K014K9L975K192J112m091k984l10n82j76k230J356
6765f629J481Q87m14J284j100J533L06K265Q02K194J480m9m255k22p99j834k769
6748e839J59P20J60j558J040j92j895K880K553R85K439k433k844M85L022n91l963
6731d872o90k223j960K551j82M35q28L34M870K432L424K45n56o59j660J31K450
6714C242L235j554k8m39l081l095N78j464R3K949K448K289L106N629K230j907
6698A4231M7O384J3059J8541K6832M3018N5567L3560j3367n2303n2391l4541k4349
$$ plain form
6685 34288 20173 14116 13391 13960 10443 4531 3764 3670 4850 2484 3939 8859 10580 9684 9957 1672
6669 1672 191 1883 6576 9050 6747 2929 993 -398 979 419 905 1593 2660 3937 3374 3289
6653 3289 3535 2229 29 -2120 -3581 -3042 672 3567 3655 1654 -1027 2236 1205 2040 280 3794
6637 3794 7444 11621 16811 17573 14298 9350 9612 8142 9987 12101 11131 5377 1934 30 -724 -1005
6621 -1005 -2324 -3219 -3511 -773 2230 5508 5235 5278 4812 5036 9026 10364 8102 4146 1430 -2049 268
6604 268 11722 17783 21204 15751 11663 17098 18871 15947 17013 18396 21649 23090 25430 30302 40175
6589 40175 57170 77551 92935 89529 70694 50273 40661 39864 38353 39510 51444 67784 95262
6576 95262 135373 162841 158480 131986 103196 81425 67954 60445 62577 82878 108256 117070 102894
$$ packed form
6685C4288j4115o057p25N69l517n912p67r4J180k366J455M920J721q96K73q285
6669A672j481J692M693K474k303l818j936j391J377n60M86O88J067J277n63q5
6653C289K46j306k200k149j461N39L714K895Q8k001k681L263j031Q35j760L514
6637C794L650M177N190P62l275m948K62j470J845K114r70n754l443j904p54k81
6621a005j319q95k92K738L003L278k73M3m66K24L990J338k262l956k716l479K317
6604B68J1454O061L421n453m088N435J773k924J066J383L253J441K340M872R873
6589D0175J6995K0381J5384l406j8835k0421r612p97j511J157J1934J6340K7478
6576I5262M0111K7468m361k6494k8790k1771j3471p509K132K0301K5378Q814j4176
$$ plain form
6563 102894 81785 60201 46055 36303 32440 30113 29926 28060 25765 27350 27325 23708 21068 21967 20206
6548 20206 13329 8680 8889 6162 2594 -3470 -4168 -199 -443 -473 -656 -59 1613 1324 -1246 -3482 -7004
6531 -7004 -8372 -6138 -4931 -7663 -7100 -10367 -10961 -9624 -8887 -8133 -4067 -5797 -7809 -6940 -3845 -4890
6515 -4890 -1822 -796 -2754 -2702 -2738 -3094 -2989 1746 3876 132 -2570 -5313 -3025 -86 -4179 -6617
6499 -6617 -6566 -5563 -2291 -2972 -5051 -7472 -5886 -3316 -5524 -2856 -470 -373 1604 -1081 -2038 230
6483 230 3464 1773 3771 4492 6910 2382 -4681 -4185 -1703 -5632 -5166 -7175 -9924 -11384 -14519 -17020
6467 -17020 -15082 -13533 -15049 -9376 -9425 -10193 -11347 -13019 -12075 -7578 -3057 -2724 -3336 -2151 419 -1059
6451 -1059 -4623 -6919 -8918 -8674 -8256 -9136 -8563 -3602 -3983 -5220 -4301 -3753 -4413 -4823 -3928 -5976 -1339
$$ packed form
6563A02894k1109k1584j4146r752l863k327j87j866k295J585k5l617k640Q99j761
6548B0206o877m649K09k727l568o064o98L969k44l0j83N97J672k89k570k236l522
6531g004j368K234J207k732N63l267n94J337P37P54M066j730k012Q69L095j045
6515d890L068J026j958N2l6l56J05M735K130l744k702k743K288K939m093k438
6499f617N1J003L272o81k079k421J586K570k208K668K386R7J977k685r57K268
6483B30L234j691J998P21K418m528p063M96K482l929M66k009k749j460l135k501
6467a7020J938J549j516N673m9p68j154j672R44M497M521L33o12J185K570j478
6451a059l564k296j999K44M18q80N73M961l81j237R19N48o60m10Q95k048M637
$$ plain form
6434 -1339 -473 -3714 -3747 -6924 -8449 -7181 -7781 -8111 -8441 -6815 -2483 1648 817 -4012 -5178 -2440 -4759
6417 -4759 -3561 2364 3491 -1161 -4330 -3029 1303 920 -2084 519 1484 -3499 -4008 -2410 -2011 -4814
6401 -4814 -5893 -9892 -11377 -8441 -3678 -3610 -2464 -2885 -3887 -6799 -5435 -6143 -9315 -9064 -6911 -5027
6385 -5027 -7377 -8628 -7007 -5238 -6880 -8858 -5879 -5734 -2386 -3123 -4939 -10972 -13491 -9029 -7800
6370 -7800 -7270 -5532 -1506 873 -1502 -4699 -4583 -5354 -7870 -3946 2657 1365 -986 -659 1057 -2815
6354 -2815 -3677 -4556 -6904 -5727 -722 3995 2994 -1248 -4645 -4867 -4436 -3000 -49 686 -2308 -1329
6338 -1329 -1172 -1437 -1185 -1220 1381 6905 5247 5724 4190 4012 554 -2954 -7112 -8531 -7988 -6210 -1525
6321 -1525 -631 3275 1828 -3234 -5442 -8897 -7049 -1702 -5 750 -1217 -660 -2215 -1839 -3052 -9091
$$ packed form
6434a339Q66l241l3l177j525J268o00l30l30J626M332M131q31m829j166K738k319
6417d759J198N925J127m652l169J301M332l83l004K603R65m983n09J598L99k803
6401d814j079l999j485K936M763O8J146m21j002k912J364p08l172K51K153J884
6385e027k350j251J621J769j642j978K979J45L348p37j816o033k519M462J229
6370g800N30J738M026K379k375l197J16p71k516L924O603j292k351L27J716l872
6354b815q62q79k348J177N005M717j001m242l397k22M31J436K951P35k994R79
6338a329J57k65K52l5K601N524j658M77j534j78l458l508m158j419N43J778M685
6321a525Q94L906j447n062k208l455J848N347J697P55j967N57j555L76j213o039
$$ plain form
6305 -9091 -9105 -5378 -5471 -9303 -9404 -5817 -5230 -8585 -7037 -5459 -426 -286 -1774 -5730 -9981 -11110 -10571
6288 -10571 -9144 -6341 -4869 -2110 -2462 -1499 -1017 62 -1681 -6757 -6611 -3004 -2330 -5790 -8264 -10841
6272 -10841 -8151 -9168 -10136 -10567 -7666 -8585 -8518 -8020 -4974 -5792 -8750 -10815 -13511 -10226 -9823 -8259 -4765
6255 -4765 -6909 -6932 -5946 -4308 -2096 -5174 -5905 -2113 -1114 -2348 -3137 -1316 3113 3231 -777 -4814 -7382
6238 -7382 -6723 -4893 -2656 -1566 -2708 -3513 1923 2673 -564 -3775 -4464 -8690 -6207 -3980 -3739 -1523
6222 -1523 -781 -2342 -3682 -1937 -4087 -6456 -6662 -4025 -2748 -1325 -1000 -1016 1323 3433 1250 -861
6206 -861 -3110 -9432 -12507 -9939 -4022 -2456 -3988 -3048 -1604 276 3296 747 -1608 -1610 3174 2177
6190 2177 524 -3472 -2772 -1787 1508 269 143 347 -2318 -2219 -4679 -6532 -7494 -4543 -5110 -3406 864
$$ packed form
6305i091j4L727r3l832j01L587N87l355J548J578N033J40j488l956m251j129N39
6288a0571J427K803J472K759l52R63M82J079j743n076J46L607O74l460k474k577
6272a0841K690j017r68m31K901r19O7M98L046q18k958k065k696L285M03J564L494
6255d765k144k3R86J638K212l078p31L792R99j234p89J821M429J18m008m037k568
6238g382O59J830K237J090j142q05N436P50l237l211o89m226K483K227K41K216
6222a523P42j561j340J745k150k369k06K637J277J423L25j6K339K110k183k111
6206h61k249o322l075K568N917J566j532R40J444J880L020k549k355kM784r97
6190B177j653l996P00R85L295j239j26K04k665R9k460j853r62K951n67J704M270
$$ plain form
6173 864 3376 -46 -6329 -9895 -8641 -4085 -6385 -12030 -11717 -10885 -7151 -5342 -509 646 -1570 -1405
6157 -1405 557 -4979 -7005 -5071 -3641 -3902 -10668 -9977 -6810 -6556 -3255 -1201 -363 -1919 -3558 -3185
6141 -3185 -66 1455 -1416 -3043 -1472 -1278 -5153 -7497 -5363 -4875 -481 1632 1092 -2090 -4103 -1891
6125 -1891 -2967 -7284 -7117 -3660 -936 -4124 -5499 -5415 -7004 -8409 -5768 -3990 -1684 1035 -1864 -1808
6109 -1808 887 -903 -3086 -2104 -3200 -2718 -1986 -6372 -7179 -2535 195 -1816 318 -910 -1084 -3969
6093 -3969 -8205 -3295 2811 315 -1057 -2977 -6914 -8336 -7123 -5585 -4524 -3017 -1533 -965 4535
6078 4535 6811 6560 4750 2123 -1956 -99 -2597 -9981 -7989 -2922 -388 -101 806 -825 -106 -343
6062 -343 -5308 -4430 -2577 -2009 -4933 -6522 -6956 -8562 -8613 -7124 -5238 -4168 -3287 1384 -1543 -5038 -5884
$$ packed form
6173H64K512l422o283l566J254M556k300n645L13Q32L734J809M833J155k216J65
6157a405J962n536k026J934J430k61o766O91L167K54L301K054Q38j556j639L73
6141c185L119J521k871j627J571J94l875k344K134M88M394K113n40l182k013K212
6125a891j076m317J67L457K724l188j375Q4j589j405K641J778K306K719k899N6
6109a808K695j790k183R82j096M82P32m386q07M644K730k011K134j228j74k885
6093c969m236M910O106k496j372j920l937j422J213J538J061J507J484N68N500
6078D535K276k51j810k627m079J857k498p384J992N067K534K87R07j631P19k37
6062c43m965Q78J853N68k924j589m34j606n1J489J886J070Q81M671k927l495q46
$$ plain form
6045 -5884 -10287 -7367 -4294 -4618 -4410 -343 -2728 -6441 -4697 -4921 -3631 -3322 -3699 -3207 -1069 555
6029 555 2408 -2429 -3843 -907 1094 -2060 -3792 -3936 -6978 -6434 -6000 -3882 -5167 -1983 -1389 -1829
6013 -1829 -536 -347 -1747 -4275 -1307 -108 -1048 -1952 -47 2128 3988 2584 -4 -3096 -6652 -3193
5997 -3193 -3390 -2142 -231 -6857 -10119 -7461 -7528 -8235 -4232 1135 2577 5704 8232 8202 7199 4592
5981 4592 399 -952 -3837 -4027 -5117 -2293 -4186 -2391 -825 -887 -149 1886 8505 8007 3072 3311
5965 3311 2735 1040 345 4222 3989 1383 688 -201 -3539 -4479 -6781 -2848 2345 396 -344 -2606 -2444
5948 -2444 744 4684 4138 4122 258 1588 1786 1186 822 -1800 -6363 -7287 -3722 -1453 1168 -796 -5420
5931 -5420 -8376 -12412 -12265 -8966 -10499 -9675 -5588 -2862 -4865 -5110 -3688 -1239 -2130 276 -5152 -5261
$$ packed form
6045e884m403K920L073l24K08M067k385l713J744k24J290L09l77M92K138J624
6029E55J853m837j414K936K001l154j732j44l042N44M34K118j285L184N94m40
6013a829J293J89j400k528K968J199r40r04J905K175J860j404k588l092l556L459
5997c193j97J248J911o626l262K658o7p07M003N367J442L127K528l0j003k607
5981D592m193j351k885j90j090K824j893J795J566o2P38K035O619m98m935K39
5965C311n76j695o95L877k33k606o95q89l338r40k302L933N193j949p40k262J62
5948b444L188L940n46j6l864J330J98o00l64k622m563r24L565K269K621j964m624
5931e420k956m036J47L299j533Q24M087K726k003k45J422K449q91K406n428j09
$$ plain form
5915 -5261 -8486 -12081 -10453 -7107 -2206 -4043 -5740 -5049 -5983 -10238 -6955 -5018 -3559 -6231 -10929
5900 -10929 -14006 -13296 -9446 -7635 -5321 -4244 -3682 -1409 -4091 -6886 -5804 -6156 -8078 -6454 -3968
5885 -3968 -6279 -9802 -8331 -7477 -6682 -6233 -4770 -3725 -4191 -2170 -5793 -10157 -9305 -4016 -600 -1013
5869 -1013 -831 -815 -378 -887 -2561 -1513 -2403 -1668 1596 2397 1585 3553 -1004 -352 260 -844 115 -2515
5851 -2515 -1825 -1967 -3975 -995 1005 539 1769 6247 5160 1219 -2170 -4138 -2339 -565 -6244 -10707
5835 -10707 -11538 -11106 -8127 -3989 -4091 -1049 -2049 169 -1243 -1731 -4169 -6540 -2132 -2342 -2661 1252
5819 1252 1694 68 -2110 -1238 567 -4577 -4690 -2325 -1851 649 -1505 -3401 -2223 -3174 -28 1797
5803 1797 537 1489 31 -1308 -5033 -6204 -4301 -1070 -118 800 3201 4698 3364 1932 -2670 -3095
$$ packed form
5915e261l225l595J628L346M901j837j697O91r34m255L283J937J459k672m698
5900a0929l077P10L850J811K314J077N62K273k682k795J082l52j922J624K486
5885c968k311l523J471Q54P95M49J463J045m66K021l623m364Q52N289L416m13
5869a013J82J6M37n09j674J048q90P35L264Q01q12J968m557O52O12j104R59k630
5851b515O90j42k008K980K000m66J230M478j087l941l389j968J799J774n679m463
5835a0707q31M32K979M138j02L042j000K218j412m88k438k371M408k10l19L913
5819A252M42j626k178Q72J805n144j13K365M74K500k154j896J178r51L146J825
5803A797j260R52j458j339l725j171J903L231R52R18K401J497j334j432m602m25
$$ plain form
5787 -3095 -3489 -5346 -4074 -834 -1409 -162 -2575 -3142 -3203 -3409 -3291 -1985 467 620 1000 2254 -1249
5770 -1249 1898 6579 2023 4149 4465 3277 4117 2748 216 -3505 -6363 -8468 -8657 -9092 -7132 -6182
5754 -6182 -4616 -3192 1854 6202 7414 3894 973 1856 3990 1169 -1930 1683 19 -2919 -5789
5739 -5789 -2386 162 -2253 -1666 -664 1308 1217 3511 4999 3220 -1002 -4711 -4812 -5146 -3143 -3480
5723 -3480 395 -1012 -2959 -1140 997 1374 2350 1412 -2138 -4765 -6117 -6945 -6657 -1491 1667 337
5707 337 -3366 -5560 -4799 -404 -1252 -3201 -1286 3433 2760 1328 1553 1863 4556 -2428 -6242 -8464
5691 -8464 -10918 -9325 -10078 -8110 -6834 -4217 -5474 -9004 -6150 -7692 -7176 -7921 -5812 -1205 -1657 -2806
5675 -2806 -890 -2365 -1746 2115 4884 693 -3134 -4712 -3993 -4130 -1877 -2140 -1705 -672 -4538 -5679
$$ packed form
5787c095l94j857J272L240n75J247k413n67o1k06J18J306K452J53L80J254l503
5770a249L147M681m556K126L16j188Q40j369k532l721k858k105j89m35J960R50
5754f182J566J424N046M348J212l520k921Q83K134k821l099L613j664k938k870
5739e789L403K548k415N87J002J972r1K294J488j779m222l709j01l34K003l37
5723c480L875j407j947J819K137L77R76r38l550k627j352q28K88N166L158j330
5707C37l703k194P61M395q48j949J915M719o73j432K25L10K693o984l814k222
5691h464k454J593p53J968J276K617j257l530K854j542N16p45K109M607m52j149
5675b806J916j475O19L861K769m191l827j578P19j37K253k63M35J033l866j141
$$ plain form
5659 -5679 -3433 975 1755 2923 1603 -1939 -2786 -292 -834 -4075 -6580 -5479 -180 3250 1814 -131
5643 -131 -1754 -2306 -897 -2027 -2711 2624 5359 2631 2614 366 648 -505 -1644 -2094 -2714 -2242 157
5626 157 1842 -1180 -4675 -5179 -4535 273 2942 1443 -3462 -4415 -3993 1709 2178 3071 3009 2722 353
5609 353 3224 8400 8554 4228 -1732 1701 1049 -550 -602 -1827 -2433 -5154 -9760 -6921 -3928 -653
5593 -653 -1363 -3881 -6196 -4198 -6085 -7305 -5982 -5315 -1649 953 2677 5789 6858 5460 1453 -2393
5577 -2393 -1665 -2830 219 1361 2316 1887 169 4369 1060 -4093 -4082 -3532 -5096 -3323 -974 -4852
5561 -4852 -13225 -12849 -9745 -2155 660 1506 738 -4540 -8098 -8826 -4185 -5254 -6517 -4974 -2081 523
5545 523 -4552 -4865 -2915 -2261 -736 830 742 425 -4622 -3482 -745 -281 333 -6925 -11658 -15878 -16086
$$ packed form
5659e679K246M408P80J168j320l542q47K494n42l241k505J101N299L430j436j945
5643a31j623n52J409j130o84N335K735k728j7k248K82j153j139m50o20M72K399
5626A57J685l022l495n04O44M808K669j499m905r53M22N702M69Q93o2k87k369
5609C53K871N176J54m326n960L433o52j599n2j225o06k721m606K839K993L275
5593f53p10k518k315J998j887j220J323O67L666K602J724L112J069j398m007l846
5577b393P28j165L049J142R55m29j718M200l309n153J1N50j564J773K349l878
5561d852q373L76L104P590K815Q46p68n278l558p28M641j069j263J543K893K604
5545E23n075l13J950O54J525J566q8l17n047J140K737M64O14p258m733m220k08
$$ plain form
5528 -16086 -11860 -10652 -9647 -7206 -5856 -1936 793 268 -1181 -2644 -902 -2605 -1714 -1632 22 -2414
5512 -2414 -1537 -1195 1849 3210 2690 117 390 1652 4828 3131 1806 -1088 -1174 -1689 -1898 2331 2211
5495 2211 -2719 -6335 -4131 -4832 -2406 -4051 -8937 -9327 -8361 -4931 -1772 -1720 -1464 -3534 -2276 -1357 1811
5478 1811 -271 -3071 -1822 -3010 -5043 -4480 -945 -914 -3291 -3862 -1678 264 -480 2109 3957 1828
5462 1828 461 -2174 -5486 -2130 -2487 -5986 -7829 -3192 -4500 -4871 -1305 1416 2529 1031 -3585
5447 -3585 -6074 -5026 -2452 925 -1668 -6614 -8308 -9037 -1726 3877 5636 4737 3576 -315 -2618
5432 -2618 -604 2024 2134 -1120 -3308 -1451 -2689 -3505 -3786 -5314 -3178 1785 3622 2873 5181 4107
5416 4107 3774 2737 4270 -1556 -891 2949 648 -91 -3820 -9934 -15592 -16477 -22818 -27706 -22367 -12899
$$ packed form
5528a6086M226J208J005K441J350L920K729n25j449j463J742j703Q91Q2J654k436
5512b414Q77L42L044J361n20k573K73J262L176j697j325k894q6n15k09M229j20
5495B211m930l616K204p01K426j645m886l90R66L430L159N2K56k070J258R19L168
5478A811k082k800J249j188k033N63L535L1k377n71K184J942p44K589J848k129
5462A828j367k635l312L356l57l499j843M637j308l71L566K721J113j498m616
5447c585k489J048K574L377k593m946j694p29P311N603J759q99j161l891k303
5432b618K014K628J10l254k188J857j238q16k81j528K136M963J837p49K308j074
5416D107l33j037J533n826O65L840k301p39l729o114n658q85o341m888N339R468
$$ plain form
5400 -12899 -4323 -1662 6879 14578 11011 5605 8392 7469 4461 1814 686 946 1771 5026 6575
5385 6575 6421 -2270 -8762 -11260 -19712 -24130 -21137 -14080 -2025 6912 9155 7786 4049 -697 724
5370 724 2916 3695 6007 7066 2926 296 77 1168 5860 8235 9173 7214 3021 688 -1452 396
5354 396 2825 1843 4484 6314 3142 -2122 -1147 -241 -348 -38 2004 2629 5890 5649 3893 2700 4233
5337 4233 300 -1016 3675 3680 7889 10740 7358 5020 1727 -1689 -1921 2054 2962 1463 2141 490
5321 490 -1141 828 2469 4121 439 -1281 -1461 -2907 -3848 -4497 -6232 -2090 -746 401 1282 -2551
5305 -2551 -2641 -1046 1127 1795 2244 3496 3670 1753 1892 2772 1453 2425 2951 4602 4846 3187 2837 3327
5287 3327 576 -1016 1285 870 2683 5565 6193 3645 950 1763 6119 194 -5607 -4901 -4186 -6715
$$ packed form
5400a2899Q576K661Q541P699l567n406K787r23l008k647j128K60Q25L255J549
5385F575j54q691o492k498q452m418K993P057J2055Q937K243j369l737m746J421
5370G24K192P79K312J059m140k630k19J091M692K375R38j959m193k333k140J848
5354C96K429r82K641J830l172n264R75R06j07L10K042O25L261k41j756j193J533
5337D233l933j316M691NM209K851l382k338l293l416k32L975R08j499O78j651
5321D90j631J969J641J652l682j720j80j446r41o49j735M142J344J147Q81l833
5305b551r0J595K173O68M49J252J74j917J39Q80j319R72N26J651K44j659l50M90
5287C327k751j592K301m15J813K882O28k548k695Q13M356n925n801P06P15k529
$$ plain form
5271 -6715 -8039 -6133 -6290 -2657 1775 5335 7729 5975 1543 4004 4133 -87 62 0 -1463 -2305
5255 -2305 83 2592 -2406 -4798 -1298 -1472 -7861 -9941 -16306 -16046 -11813 -7455 702 5270 168
5240 168 -3255 -3568 -3065 -245 -119 2031 2202 -2692 -2132 329 2589 2601 995 -1567 1391 2030 -2756
5223 -2756 -7500 -6558 -4770 -2219 -1821 -2823 -345 25 2219 4912 3896 2591 2000 227 28 -372
5207 -372 -1025 -910 -346 -1341 -1856 -1788 -2741 -572 1513 -396 -783 1106 765 946 -450 1328 567 2093
5189 2093 1655 1628 1624 2849 1965 -394 -1724 -929 1559 -1768 -4862 -858 2118 16 -949 -1970 3117
5172 3117 1724 -1632 -5151 -6019 -7520 -1945 465 -1871 -2419 -3094 -5616 -1799 2843 2825 2317 2406 542
5155 542 808 2142 -177 1006 3405 4112 3638 6397 9122 14146 9417 2798 -493 381 2170 6205
$$ packed form
5271f715j324J906j57L633M432L560K394j754m432K461J29m220J49o2j463q42
5255b305K388K509m998k392L500j74o389k080o365K60M233M358Q157M568n102
5240A68l423l13N03K820J26K150J71m894N60K461K260J2j606k562K958O39m786
5223b756m744R42J788K551L98j002K478L70K194K693j016j305n91j773j99m00
5207c72o53J15N64r95n15O8r53K169K085j909l87J889l41J81j396J778p61J526
5189B093m38k7mJ225q84k359j330P95K488l327l094M004K976k102r65j021N087
5172C117j393l356l519q68j501N575K410k336n48o75k522L817M642j8n08Q9j864
5155E42K66J334k319J183K399P07m74K759K725N024m729o619l291Q74J789M035
$$ plain form
5139 6205 5877 3434 1400 3182 4044 826 -2045 -2 2122 2143 -1186 -4994 -5514 -2201 -2512 -1436
5123 -1436 -1837 -5208 -4673 1371 4939 1964 -790 1673 5244 6401 6657 5084 4851 2647 1891 3095
5107 3095 6552 11144 14549 11431 5254 2092 162 3559 9069 8787 4903 5480 8630 6781 2074
5092 2074 1782 634 1131 -5167 -8422 -5045 496 -1426 -3393 -4669 -2685 -777 638 1796 1584 1090
5076 1090 2523 3729 3412 2083 3348 3488 5698 5106 4856 5300 774 -1226 3028 2584 2230 5390 5636
5059 5636 4621 -3085 -2477 1657 2936 -833 -4981 -6283 -3940 -1044 1912 5159 5809 4183 5193
5044 5193 7898 12395 13581 13693 11075 6310 5865 5199 4930 6110 4050 1838 4630 4175 2816 5159
5028 5159 6135 4168 655 1144 5225 5274 6190 2822 -2328 -4380 -3033 206 679 -1448 -1462 -1012 698
$$ packed form
5139F205l28k443k034J782Q62l218k871K043K124K1l329l808n20L313l11J076
5123a436m01l371N35O044L568k975k754K463L571J157K56j573k33k204p56J204
5107C095L457M592L405l118o177l162j930L397N510k82l884N77L150j849m707
5092B074k92j148M97o298l255L377N541j922j967j276J984J908J415J158k12m94
5076A090J433J206l17j329J265J40K210n92k50M44m526k000M254m44l54L160K46
5059E636j015p706O08M134J279l769m148j302K343K896K956L247O50j626J010
5044E193K705M497J186J12k618m765m45o66k69J180k060k212K792m55j359K343
5028E159R76j967l513M89M081M9R16l368n150k052J347L239M73k127j4M50J710
$$ plain form
5011 698 137 -1269 414 -508 -1899 -5401 -7093 -2462 -616 2353 5083 2181 -3106 -5120 -3721 -1242
4995 -1242 -216 3153 4083 4515 9084 6018 3815 -481 -2302 -2139 1458 4287 4064 5027 4437 6186
4979 6186 4764 51 -1259 2586 2322 1080 -1141 -3054 -3626 -7773 -9774 -10306 -11394 -10970 -7861 -4942
4963 -4942 -6374 -6005 -803 1589 3977 6592 7580 5213 7819 11331 11736 9301 3423 -2478 -1745 -770
4947 -770 -1747 514 5277 3879 56 -2946 -4499 -4656 -4736 -3421 -3588 -899 -685 -2000 513 1252 1800
4930 1800 1936 4011 4398 4304 4584 1324 642 727 -589 170 2324 1948 -3497 -4545 -1205 4727 8030
4913 8030 10168 8216 2390 -246 1801 -201 -2055 -5658 -5245 -1731 -408 -1557 -486 -1955 -962
4898 -962 2061 3718 4345 2358 5243 8832 7044 4049 3380 3771 6125 11955 7171 1917 565 4813
$$ packed form
5011F98n61j406J683r22j391l502j692M631J846K969K730k902n287k014J399K479
4995a242J026L369R30M32M569l066k203m296j821J63L597K829k23R63n90J749
4979F186j422m713j310L845k64j242k221j913n72m147k001n32j088M24L109K919
4963d942j432L69N202K392K388K615R88k367K606L512M05k435n878n901P33R75
4947g70r77K261M763j398l823l002j553j57q0J315j67K689K14j315K513P39N48
4930A800J36K075L87r4K80l260o82Q5j316P59K154l76n445j048L340N932L303
4913H030K138j952n826k636K047k002j854l603M13L514J323j149J071j469R93
4898i62L023J657O27j987K885L589j788k995o69L91K354N830m784n254j352M248
$$ plain form
4882 4813 4635 1648 -1537 208 -2154 -4050 -2796 -2549 -1001 2680 537 -3308 -9101 -8416 -4642 -1609
4866 -1609 -6172 -6427 -6207 -4313 -2977 -827 -1070 -2850 -3572 -661 -1932 -966 -2761 -4055 -4767 -2333
4850 -2333 1656 1528 2821 1667 2792 4154 3580 2015 -931 20 2229 5105 6684 4716 5361 8354
4834 8354 8601 5482 6268 6317 4042 1728 1489 70 -1835 -1147 4423 3502 1869 231 3141 4090 3798
4817 3798 8143 8907 5768 5310 5419 1978 -263 1192 1978 5704 7357 7163 2815 -2565 1442 2292
4801 2292 3661 4887 7653 5485 8262 11571 7747 5769 5196 4515 -1282 -2387 -623 -757 1776 4437
4785 4437 5840 4586 3186 7 227 1166 2692 5426 5148 7498 5202 1305 1723 -753 2607 8723
4769 8723 12880 10431 2958 -408 -2133 -2434 -4128 -6348 -3194 -1016 2209 4903 9981 9204 7942
$$ packed form
4882D813j78k987l185J745k362j896J254K47J548L681k143l845n793O85L774L033
4866a609m563k55K20J894J336K150k43j780p22K911j271R66j795j294p12K434
4850b333L989j28J293j154J125J362n74j565k946R51K209K876J579j968O45K993
4834H354K47l119P86M9k275k314k39j419j905O88N570r21j633j638K910R49k92
4817C798M345P64l139m58J09l441k241J455P86L726J653j94m348n380M007Q50
4801B292J369J226K766k168K777L309l824j978n73o81n797j105J764j34K533K661
4785D437J403j254j400l179K20R39J526K734k78K350k296l897M18k476L360O116
4769H723M157k449p473l366j725l01j694k220L154K178L225K694N078p77j262
$$ plain form
4754 7942 7151 6551 3521 2103 2846 -249 -2614 -1412 4394 10748 8082 5074 3751 3016 -67 214
4738 214 -3 -4655 -6148 -1791 -2093 1004 1385 1469 -1805 -1471 119 3662 3750 5505 3538 758 -298
4721 -298 1150 -1631 -1145 2844 3168 -520 -1517 -1396 -4721 -6061 -4485 -975 1243 -2401 -3216 336
4705 336 397 -6072 -6906 -4786 -1911 -1448 -1659 -924 692 -1274 -1277 1279 1445 1915 579 -4680 -3583 -1844
4687 -1844 -2152 -514 3261 3423 4371 4424 5137 6302 3526 2115 -2516 -4588 -3713 -3043 -353 -711 -1865
4670 -1865 -3718 -2793 2722 6104 6002 7033 4381 1132 -3377 -3565 -3041 -3586 -3980 -4467 -1282 2880 4288
4653 4288 4841 5559 8377 8278 3323 4067 5564 2901 4271 3754 8082 8554 4973 4832 3301 1562 2294
4636 2294 1854 -4047 -5246 -1223 867 2653 3052 4132 -419 -2641 25 3917 6389 4772 6323
$$ packed form
4754G942p91o00l030j418P43l095k365J202N806O354k666l008j323p35l083K81
4738B14k17m652j493M357l02L097L81Q4l274L34J590L543Q8J755j967k780j056
4721b98J448k781M86L989L24l688r97J21l325j340J576L510K218l644q15L552
4705C36O1o469q34K120K875M63k11P35J616j966lK556J66M70j336n259J097J739
4687a844l08J638L775J62R48N3P13J165k776j411m631k072Q75O70K690l58j154
4670a865j853R25N515L382j02J031k652l249m509j88N24n45l94m87L185M162J408
4653D288N53P18K818r9m955P44J497k663J370n17M328M72l581j41j531j739P32
4636B294m40n901j199M023K090J786L99J080m551k222K666L892K472j617J551
$$ plain form
4621 6323 7264 7342 4892 4119 7058 10996 9745 8523 5155 763 -1539 2428 6713 7721 10634 12557
4605 12557 13928 9180 7947 7659 4519 2931 5006 1217 -3852 -3851 -3780 -3846 -1627 -411 -1224 -1078 -1576
4588 -1576 -1593 905 4252 1307 1959 2858 1306 -1535 -1560 -483 3694 5057 -123 2052 5986 4723
4572 4723 3143 2425 4432 6718 2857 2007 1152 2446 581 2359 1054 2887 6049 8890 2340 104
4556 104 4042 2316 2718 2931 3249 5734 8188 4861 4826 2409 -1577 -2246 -1915 -2990 -4178 -2474 -4956
4539 -4956 -5199 814 4427 447 2595 7170 8806 8398 7138 5462 3727 6144 6903 8229 7088 2206
4523 2206 5612 8561 7734 8273 4396 993 144 -62 -523 1473 2104 274 258 526 -3954 606 3131
4506 3131 2222 1004 -1862 -1776 1777 -390 80 3772 2621 2757 648 -279 3091 5874 7271 4887
$$ packed form
4621F323R41P8k450p73K939L938j251j222l368m392k302L967M285J008K913J923
4605A2557J371m748j233k88l140j588K075l789n069JP1o6K219J216q13J46m98
4588a576j7K498L347k945O52Q99j552k841k5J077M177J363n180K175L934j263
4572D723j580p18K007K286l861q50q55J294j865J778j305J833L162K841o550k236
4556A04L938j726M02K13L18K485K454l327l5k417l986o69L31j075j188J704k482
4539d956k43O013L613l980K148M575J636m08j260j676j735K417P59J326j141m882
4523B206L406K949q27N39l877l403q49k06m61J996O31j830j6K68m480M560K525
4506C131r09j218k866Q6L553k167M70L692j151J36k109r27L370K783J397k384
$$ plain form
4490 4887 4504 5286 2619 1137 469 3050 7069 4860 235 -1918 1496 5017 4820 304 -1425 915
4474 915 2610 2126 241 -1197 510 3570 3992 4545 2173 4619 1894 -108 1715 4231 2268 940
4458 940 -469 1033 4046 3269 4267 5087 7451 4176 2521 -474 -1796 -473 -1475 -211 989 4015
4442 4015 4153 4902 3902 6872 10049 7500 7980 4511 2184 3231 4234 3186 2003 5813 6685 3904
4426 3904 2293 2507 2791 5860 3975 3135 5393 4221 5831 8122 6752 3582 -1703 -652 1032 -1508
4410 -1508 -3723 -2908 -1648 -26 1337 2482 2059 -2630 -6756 -5626 -793 1922 -472 -1396 -2112 86
4394 86 1142 -114 -898 1658 1388 -1036 -1335 -1614 108 2596 610 1089 4302 3673 1816 16 137
4377 137 1481 798 925 -2848 -104 -2331 -3430 1081 720 3589 2329 2315 -536 -2708 -3880 -1899
$$ packed form
4490D887l83P82k667j482o68K581M019k209m625k153L414L521j97m516j729K340
4474I15J695m84j885j438J707L060M22N53k372K446k725k002J823K516j963j328
4458I40j409J502L013p77R98Q20K364l275j655k995j322J323j002J264J200L026
4442D015J38P49j000K970L177k549M80l469k327J047J003j048j183L810Q72k781
4426C904j611K14K84L069j885q40K258j172J610K291j370l170n285J051J684k540
4410a508k215Q15J260J622J363J145m23m689m126J130M833K715k394r24p16K198
4394H6J056j256p84K556k70k424k99k79J722K488j986M79L213o29j857j800J21
4377A37J344o83J27l773K744k227j099M511l61K869j260j4k851k172j172J981
$$ plain form
4361 -1899 -2329 -1763 1371 698 -2482 -1246 1986 -76 -6199 -7941 -8421 -5657 -3003 2496 4238 4858
4345 4858 1336 1174 937 630 -227 2914 4835 5732 4330 740 -2392 -6306 -8146 -8172 -5258 78 1524
4328 1524 175 456 -2270 -5325 -7660 -6709 -7979 -6558 -3588 -4759 -1157 -1272 -2970 196 1142 -47
4312 -47 3849 1983 -4519 -7492 -4582 1414 3209 1804 -577 3314 3872 8 -1361 2484 3620 -18
4296 -18 -3372 -4263 -2298 4155 7841 8803 8335 5206 3080 3141 344 2920 2753 1392 4466 3909 5026
4279 5026 5065 4647 -2192 -549 -1337 648 2765 7605 9391 5923 5717 6042 5526 5258 5902 4575 6003
4262 6003 7657 8719 4637 2716 1553 741 1060 -1436 401 -1411 -3686 -3922 1303 3922 4862 7078
4246 7078 2289 -4073 -2360 -1552 -1247 -614 642 5444 5266 2981 558 52 3842 5287 3568 2039
$$ packed form
4361a899m30N66L134o73l180J236L232k062o123j742m80K764K654N499J742O20
4345D858l522j62k37l07q57L141J921Q97j402l590l132l914j840k6K914N336J446
4328A524j349K81k726l055k335R51j270J421K970j171L602j15j698L166R46j189
4312d7L896j866o502k973K910N996J795j405k381L891N58l864j369L845J136l638
4296a8l354q91J965O453L686R62m68l129k126O1k797K576j67j361L074n57J117
4279E026L9m18o839J643p88J985K117M840J786l468k06L25n16k68O44j327J428
4262F003J654J062m082j921j163q12L19k496J837j812k275k36N225K619R40K216
4246G078m789o362J713Q08L05O33J256M802j78k285k423n06L790J445j719j529
$$ plain form
4230 2039 1500 489 -2488 1454 5319 3713 4001 4414 3848 2130 2198 1965 3791 1139 -1771 1559 -957
4213 -957 -2566 -407 -287 1056 -3981 -2039 -1664 -69 -1248 -2726 1159 2230 874 -1327 637 8432
4197 8432 8919 7071 3486 1979 3592 3373 4382 5176 6446 4386 5288 5871 2136 -2758 278 3389
4181 3389 1483 -3710 -5924 -5551 -2436 -4578 -2326 -1929 -632 818 1353 2201 4117 5158 9586 9790
4165 9790 7710 3353 1506 -517 1126 -408 -62 41 -2250 -2985 -3508 1509 1796 2586 3413 -64 -3909
4148 -3909 -6156 -4764 -3267 -1989 -1030 305 925 2969 -372 -695 396 -2738 -4962 -1865 1779 3745
4132 3745 1754 1459 -166 -1029 496 194 1630 -1059 -1130 1605 1687 4318 4909 3017 4546 5238 3655
4115 3655 4069 5115 4301 2734 2146 1520 680 881 -91 926 843 -102 380 -1124 -2037 -3727 1148 3671
$$ packed form
4230B039n39j011k977L942L865j606K88M13n66j718O8k33J826k652k910L330k516
4213i57j609K159J20J343n037J942L75J595j179j478L885J071j356k201J964P795
4197H432M87j848l585j507J613k19J009P94J270k060R02N83l735m894L036L111
4181C389j906n193k214L73L115k142K252L97J297J450N35Q48J916J041M428K04
4165I790k080m357j847k023J643j534L46J03k291p35n23N017K87P90Q27l477l845
4148c909k247J392J497J278R59J335O20K044l341l23J091l134k224L097L644J966
4132C745j991k95j625q63J525l02J436k689p1K735Q2K631N91j892J529O92j583
4115C655M14J046q14j567n88o26q40K01r72J017q3r45M82j504r13j690M875K523
$$ plain form
4097 3671 4055 3760 5202 6169 10178 6930 849 -1814 -2312 -2697 -6513 -7849 -4080 728 2666 2078
4081 2078 -1192 -1899 -2666 -624 3290 1162 -1336 -5504 -3643 -47 1854 -55 -1014 -1418 -579 -522 -325
4064 -325 1337 988 -1096 412 -940 -4791 -4380 -2153 -589 1688 -1545 -861 1472 880 4448 6422
4048 6422 4382 2287 3414 241 -2749 -3674 148 1848 2507 3859 4119 4121 5899 844 -1644 2290
4032 2290 1863 1295 7374 7873 2670 -802 -230 485 32 476 2742 6538 5996 4432 2179 2920 3042
4015 3042 5827 8718 4906 -783 1454 3660 3234 3637 2604 83 326 -632 -1677 -2291 -4969 -4827
3999 -4827 -3619 -1504 1154 2038 1460 -991 -3015 -2540 2414 5476 2747 4064 4738 3545 2398 256
3983 256 1383 4765 3365 1448 4752 6980 3751 3894 4488 4922 5068 7567 12191 9555 5220 3312
$$ packed form
4097C671L84k95J442R67M009l248o081k663m98l85l816j336L769M808J938n88
4081B078l270p07p67K042L914k128k498m168J861L596J901j909r59m04Q39N7J97
4064c25J662l49k084J508j352l851M11K227J564K277l233O84K333n92L568J974
4048F422k040k095J127l173k990r25L822J700O59J352K60KJ778n055k488L934
4032B290m27n68O079M99n203l472N72P15m53M44K266L796n42j564k253P41J22
4015C042K785K891l812n689K237K206m26M03j033k521K43r58j045o14k678J42
3999d827J208K115K658Q84n78k451k024M75M954L062k729J317O74j193j147k142
3983B56J127L382j400j917L304K228l229J43N94M34J46K499M624k636m335j908
$$ plain form
3967 3312 2021 1624 -1301 -4323 -3090 -2960 -1553 -1457 269 4679 6689 7230 3344 5743 5751 3033 236
3950 236 -834 915 1368 1561 155 -2093 -2389 -498 -442 -2532 -3798 -356 2772 7756 12616 11345
3934 11345 7031 4365 2403 1445 -1684 -5194 -1859 -203 2564 5354 4956 7423 8056 5908 6620 7233
3918 7233 6581 5789 4579 5220 6632 6453 6683 3655 -3059 -3603 -4203 -3012 -2473 -5518 -7466 -7634 -4845
3901 -4845 -3981 -5492 -6008 -2694 408 -1513 -2873 -1323 2006 -95 -4844 -5447 -4014 -1871 833 1280
3885 1280 1298 1234 472 65 -821 -1212 1629 4067 2799 1161 -1771 1639 728 2223 565 -1674 -1006
3868 -1006 -460 1641 2448 5241 4291 1280 2353 5707 4959 1719 -1150 -2717 -1390 -1096 1741 1488
3852 1488 3212 2427 1037 550 2172 2707 4130 2473 1938 5089 5953 1613 28 1013 1722 4071 4047
$$ packed form
3967C312j291l97k925l022J233J30J407R6J726M410K010N41l886K399Qk718k797
3950B36j070J749M53J93j406k248k96J891N6k090j266L442L128M984M860j271
3934A1345m314k666j962r58l129l510L335J656K767K790l98K467O33k148P12O13
3918G233o52p92j210O41J412j79K30l028o714n44o00J191N39l045j948j68K789
3901d845Q64j511n16L314L102j921j360J550L329k101m749o03J433K143K704M47
3885A280J8o4p62m07q86l91K841K438j268j638k932L410r11J495j658k239O68
3868a006N46K101Q07K793r50l011J073L354p48l240k869j567J327K94K837k53
3852A488J724p85j390m87J622N35J423j657n35L151Q64m340j585R85P09K349k4
$$ plain form
3835 4047 2158 5705 10470 11250 8228 6850 6560 7817 6430 3351 1249 852 980 2071 4478 5846
3819 5846 5739 5446 5799 4267 584 4419 5062 3387 6924 7493 4511 1600 5452 10498 7674 4396
3803 4396 3279 2482 2567 1650 6903 7587 2399 -1098 3319 8395 9431 8124 2676 -1761 -2569 -798
3787 -798 985 -1387 -2400 1155 656 586 1606 1578 2102 2814 -65 -1905 -3379 -2882 -2588 -2667 -1535 -206
3769 -206 -1886 -3450 853 1740 1136 -958 2084 1045 -82 1257 -4258 -1600 4320 5378 2727 -474
3753 -474 -239 -1247 -2548 -905 -1055 -2189 -1350 -1054 -1794 -3268 -4306 -6518 -5890 -4532 -1563 -297 2107
3736 2107 5647 6789 5727 -990 -6027 -5937 -2844 -2630 -216 93 -1940 -1997 -1776 1104 3352 2985 1059
3719 1059 -855 -743 2763 5393 4551 2063 -1211 -1905 259 5503 7054 5274 553 -2206 1431 2423
$$ packed form
3835D047j889L547M765P80l022j378k90J257j387l079k102l97J28J091K407J368
3819E846j07k93L53j532l683L835O43j675L537N69k982k911L852N046k824l278
3803D396j117p97Q5r17N253O84n188l497M417N076J036j307n448m437q08J771
3787g98J783k372j013L555m99p0J020k8N24P12k879j840j474M97K94p9J132J329
3769b06j680j564M303Q87o04k094L042j039j127J339n515K658N920J058k651l201
3753d74K35j008j301J643j50j134Q39K96p40j474j038k212O28J358K969J266K404
3736B107L540J142j062o717n037R0L093K14K414L09k033n7K21K880K248l67j926
3719A059j914J12L506K630q42k488l274o94K164N244J551j780m721k759L637R92
$$ plain form
3703 2423 4033 5794 5415 3433 2049 2517 361 -1278 -12 484 2623 3008 2798 2456 3939 7438
3687 7438 7673 3652 -2008 1292 3655 6908 6991 3322 -1411 -4716 -2023 -395 -1546 3697 5587 5257
3671 5257 4823 1503 1317 2655 4014 4442 7663 8030 4729 3723 2944 2812 5671 3741 227 -2313
3655 -2313 -1156 3029 2626 -1120 -1768 -1573 -3744 990 4220 5168 3652 5423 5437 5524 6015 2386 -2716
3638 -2716 -1053 3006 3664 4677 3109 3321 5849 5613 5448 7181 9754 5892 7029 6929 1572 394
3622 394 6871 12114 10241 5578 483 -2145 -3363 -2114 -597 -470 -784 4238 544 -1105 -3082 -6027
3606 -6027 -3617 2337 7458 5264 2418 -1438 -2611 724 3546 855 3720 1408 -1378 -166 725
3591 725 2689 32 768 4243 5222 4184 2142 546 998 3942 3365 3544 5129 5419 2478 4136 5935
$$ packed form
3703B423J610J761l79j982j384M68k156j639J266M96K139L85k10l42J483L499
3687G438K35m021n660L300K363L253Q3l669m733l305K693J628j151N243J890l30
3671E257m34l320j86J338J359M28L221L67l301j006p79j32K859j930l514k540
3655b313J157M185m03l746o48J95k171M734L230R48j516J771J4Q7M91l629n102
3638b716J663M059O58J013j568K12K528k36j65J733K573l862J137j00n357j178
3622C94O477N243j873m663n095k628j218J249J517J27l14N022l694j649j977k945
3606f027K410N954N121k194k846l856j173L335K822k691K865k312k786J212Q91
3591G25J964k657P36L475R79j038k042j596M52K944n77J79J585K90k941J658J799
$$ plain form
3574 5935 2596 -1908 -1940 162 1282 2556 493 3160 6373 6959 6763 2270 1168 3506 2516 5750
3558 5750 5939 5115 5672 3546 -1818 -7048 -6186 -1349 2848 1536 5434 6300 3042 2893 3974 6615
3542 6615 8729 9146 5646 4266 -370 -1292 -89 1278 323 4296 6262 3985 3694 906 -2101 3096
3526 3096 7491 5690 5597 5718 814 1651 3703 -235 -515 1346 2836 -4090 -4622 -3378 -1764 -2282 -2267
3509 -2267 -1538 -4395 -5240 -2511 -2529 16 3388 8221 10767 8416 7032 5698 4369 3797 5281 8025
3493 8025 6114 -107 1603 2410 6257 5724 5770 6216 4775 8078 13173 11107 6049 1995 -1010 -3250
3477 -3250 -1012 2119 -1104 -1651 1399 265 -2122 -2873 1400 5541 6954 6958 3844 1136 -362 769
3461 769 2775 2151 -9 480 3713 6690 5365 2322 4111 6189 5000 4775 1979 3666 4305 3139
$$ packed form
3574E935l339m504l2K102J120J274k063K667L213N86j96m493j102K338r90L234
3558E750J89q24N57k126n364n230Q62M837M197j312L898Q66l258j49J081K641
3542F615K114M17l500j380m636r22J203J367r55L973J966k277k91k788l007N197
3526C096M395j801r3J21m904Q37K052l938k80J861J490o926n32J244J614n18J5
3509b267P29k857q45K729j8K545L372M833K546k351j384j334j329n72J484K744
3493H025j911o221J710Q07L847n33M6M46j441L303N095k066n058m054l005k240
3477c250K238L131l223n47L050j134k387p51M273M141J413Ml114k708j498J131
3461G69K006o24k160M89L233K977j325l043J789K078j189k25k796J687O39j166
$$ plain form
3445 3139 -3278 -3458 -242 1765 4994 6216 6339 7413 5928 -1031 -5206 -4910 -3514 3329 4681 3312
3429 3312 4290 4914 816 3464 6209 4142 967 1550 2936 1016 -1705 -3400 -406 4737 5647 6131
3413 6131 6268 5877 4018 6095 7995 6654 3395 2411 1056 -1632 92 1585 4394 7699 7129 2956
3397 2956 2616 3406 698 -295 1186 2017 3162 3526 4796 2308 -17 2468 7247 11921 11955 8334 6201
3380 6201 2822 93 626 9659 14722 16832 16693 11977 7009 4168 820 -897 -2230 2911 4434
3365 4434 4088 3462 137 -712 -1038 -2472 -680 2897 5871 8268 6629 6250 5738 3256 -1626 -3848
3349 -3848 -1809 347 608 5969 9184 9851 6988 2694 1755 133 187 1879 2567 4304 4895 4585 3007
3332 3007 1025 -2216 -2117 -2142 1131 3146 3842 5690 4589 849 2768 5648 2089 3220 2496 485
$$ packed form
3445C139o417j80L216K007L229J222J23J074j485o959m175K96J396O843J352j369
3429C312R78O24m098K648K745k067l175N83J386j920k721j695K994N143R10M84
3413F131J37l91j859K077J900j341l259r84j355k688J724J493K809L305n70m173
3397B956l40P90k708r93J481Q31J145L64J270k488k325K485M779M674L4l621k133
3380F201l379k729N33R033N063K110j39m716m968k841l348j717j333N141J523
3365D434l46o26l325q49l26j434J792L577K974K397j639l79n12k482m882k222
3349c848K039K156K61N361L215O67k863m294r39j622N4J692O88J737N91l10j578
3332C007j982l241R9k5L273K015O96J848j101l740J919K880l559J131p24k011
$$ plain form
3316 485 2449 2183 785 -945 2958 7062 5392 3500 2183 -1958 -3180 -5521 -2117 -386 -3002
3301 -3002 -4072 -6281 -4942 -5395 -1960 -1477 -2529 -2130 -2561 -4571 -3509 -3738 -5611 -5335 -6598 -6418 -2525
3284 -2525 -3054 -4054 -4249 -7322 -7040 -2535 390 2989 3651 5028 7071 9307 8511 5715 4499 4630
3268 4630 4397 3560 2400 -173 -1875 -2260 1434 -647 -101 -3039 -1903 1226 -871 1570 1830 6312
3252 6312 8531 6386 5415 3019 2191 5384 3213 2428 106 148 -507 1040 3730 6412 5033 1715
3236 1715 4452 7216 9465 9421 7876 3845 792 214 1714 -1600 209 4450 6056 4949 -1485 416
3220 416 2794 1435 -1105 -625 -1454 2354 4397 6661 7657 3551 -3267 -4954 -4393 -824 3303 5467
3204 5467 4811 2970 -415 -4993 -3378 611 -1019 2640 6125 1339 -280 2333 1766 5100 12052
$$ packed form
3316D85J964k66j398j730L903M104j670j892j317m141j222k341L404J731k616
3301c002j070k209J339m53L435M83j052L99m31k010J062k29j873K76j263J80L893
3284b525n29j000j95l073K82M505K925K599O62J377K043K236p96k796j216J31
3268D630k33q37j160k573j702l85L694k081N46k938J136L129k097K441K60M482
3252F312K219k145r71k396q28L193k171p85k322M2o55J547K690K682j379l318
3236A715K737K764K249m4j545m031l053n78J500l314J809M241J606j107o434J901
3220D16K378j359k540M80q29L808K043K264R96m106o818j687N61L569M127K164
3204E467o56j841l385m578J615L989j630L659L485m786j619K613n67L334O952
$$ plain form
3189 12052 11285 10823 8457 3835 -982 -706 1318 4121 4426 3120 2389 4067 2068 887 3425 2791
3173 2791 75 895 2509 2904 4645 2680 5751 9220 9921 9614 6013 2606 48 -1682 1371 5641
3157 5641 8644 10210 8472 652 -1358 -158 472 -1744 -2435 -1999 2171 2024 -1203 1020 2066 1593
3141 1593 2459 3877 5689 5378 2745 2961 3607 1790 3872 2241 -1434 -1846 -1088 -3620 -3269 -2376 -236
3124 -236 2406 -81 -687 1462 3179 532 -1991 -1008 4085 8451 10324 5296 1331 1104 1254 3678
3108 3678 7994 10111 6759 7466 7022 5364 4992 5015 1178 -2144 75 3619 5466 4941 3912 4857 6676
$$ packed form
3189A2052p67m62k366m622m817K76K024K803L05j306p31J678j999j181K538o34
3173B791k716Q20J614L95J741j965L071L469P01l07l601l407k558j730L053M270
3157E641L003J566j738p820k010J200O30k216o91M36M170j47l227K223J046m73
3141A593Q66J418J812l11k633K16O46j817K082j631l675m12P58k532L51Q93K140
3124b36K642k487o06K149J717k647k523R83N093M366J873n028l965k27J50K424
3108C678M316K117l352P07m44j658l72K3l837l322K219L544J847n25j029R45J819
$$ [...]
##END NTUPLES=NMR SPECTRUM
##END=
