##TITLE=Analysis number 312092
Compound Code cc 15503
Project Code adrs
Chemist Name fudan
##JCAMPDX= 6.0         $$ Bruker NMR JCAMP-DX V2.0
##DATA TYPE= NMR SPECTRUM
##DATA CLASS= NTUPLES
##ORIGIN= Bruker BioSpin GmbH
##OWNER= NMR
$$ XWIN-NMR		Version 3.5
$$ Mon Jul 25 12:55:18 2005 GMT Daylight Time (UT+1h)  MAYBRIDGE\NMR@NMR_250MHZ
##.OBSERVE FREQUENCY= 250.131544655141
##.OBSERVE NUCLEUS= ^1H
##.ACQUISITION MODE= SIMULTANEOUS (DQD)
##.ACQUISITION SCHEME= undefined
##.AVERAGES= 16
##.DIGITISER RES= 18
##SPECTROMETER/DATA SYSTEM= dpx250
##.PULSE SEQUENCE= zg30
##.SOLVENT NAME= CDCl3
##.SHIFT REFERENCE= (INTERNAL, CDCl3, 0, 16.522)
##AUDIT TRAIL= $$ (NUMBER, WHEN, WHO, WHERE, WHAT)
$$ ##TITLE= Audit trail, XWIN-NMR		Version 3.5
$$ ##JCAMPDX= 5.01
$$ ##ORIGIN= Bruker BioSpin GmbH
$$ ##OWNER= NMR
$$ C:\u/data/dgb/nmr/ADRS/6500/pdata/1/auditp.txt
$$ ##AUDIT TRAIL=  $$ (NUMBER, WHEN, WHO, WHERE, WHAT)
(   1,<2005-07-25 12:54:54.75 +100>,<MAYBRIDGE\NMR>,<NMR_250MHZ>,
      <created by zg, POWCHK disabled, PULCHK disabled
       configuration hash MD5:
       62 19 C7 07 E1 42 D1 B7 37 6C 3D D0 77 39 F9 E6
       data hash MD5: 64K
       5E 41 32 BD 7B C7 16 C2 58 86 13 5D 09 06 7A B6>)
(   2,<2005-07-25 12:55:08.33 +100>,<MAYBRIDGE\NMR>,<NMR_250MHZ>,
      <Start of raw data processing
       ef LB = 0.3 FT_mod = 6 PKNL = 1 SI = 32K 
       data hash MD5: 32K
       9B E7 E6 6E A5 F4 4F 90 AD 8A 5F A7 93 9C 9D F1>)
(   3,<2005-07-25 12:55:10.27 +100>,<MAYBRIDGE\NMR>,<NMR_250MHZ>,
      <apk 
       data hash MD5: 32K
       78 38 0F 62 DE 75 0D 9F 66 5C EA 24 4F A0 11 CF>)
(   4,<2005-07-25 12:55:10.97 +100>,<MAYBRIDGE\NMR>,<NMR_250MHZ>,
      <abs ABSG = 5 
       data hash MD5: 32K
       EE 74 62 A5 B9 0B FC D0 9C D2 27 A9 E8 71 18 C6>)
$$ ##END=
$$ 
$$ hash MD5
$$ 89 94 14 CA A7 1E 50 9E F1 C2 0D BA CB 72 2A FD
##$RELAX= 
##$RELAX= 
##$RELAX= 
##$RELAX= 
##$RELAX= 
##$RELAX= 
##$RELAX= 
$$ Bruker specific parameters
$$ --------------------------
##$DU= <C:\u>
##$EXPNO= 6500
##$NAME= <ADRS>
##$PROCNO= 1
##$TYPE= <nmr>
##$USER= <dgb>
##$AMP= (0..31)
100 100 100 100 100 100 100 100 100 100 100 100 100 100 100 100 100 100 
100 100 100 100 100 100 100 100 100 100 100 100 100 100 
##$AQSEQ= 0
##$AQ_mod= 3
##$AUNM= <au_zg>
##$AUTOPOS= <19 >
##$BF1= 250.13
##$BF2= 250.13
##$BF3= 250.13
##$BF4= 250.13
##$BF5= 500.13
##$BF6= 500.13
##$BF7= 500.13
##$BF8= 500.13
##$BYTORDA= 1
##$CFDGTYP= 0
##$CFRGTYP= 5
##$CHEMSTR= <none>
##$CNST= (0..31)
1 1 145 1 1 1 1 1 1 1 1 1 1 1 1 1 1 1 1 1 1 1 1 1 1 1 1 1 1 1 1 1 
##$CPDPRG= <>
##$CPDPRG1= <>
##$CPDPRG2= <>
##$CPDPRG3= <>
##$CPDPRG4= <mlev>
##$CPDPRG5= <mlev>
##$CPDPRG6= <mlev>
##$CPDPRG7= <mlev>
##$CPDPRG8= <mlev>
##$CPDPRGB= <>
##$CPDPRGT= <>
##$D= (0..31)
0 1 0 0 0 0 0 0 0 0.06 0 0 0 0 0 0 0.0002 0 0 0 0 0 0 0 0 0 0 0 0 0 0 
0 
##$DATE= 1122292493
##$DBL= (0..7)
120 120 120 120 120 120 120 120 
##$DBP= (0..7)
150 150 150 150 150 150 150 150 
##$DBP07= 0
##$DBPNAM0= <>
##$DBPNAM1= <>
##$DBPNAM2= <>
$$ [...]
##$SUBNAM7= <"">
##$SUBNAM8= <"">
##$SUBNAM9= <"">
##$SW= 20.6930455092707
##$SWIBOX= (0..15)
0 0 3 0 0 0 0 0 0 0 0 0 0 0 0 0 
##$SW_h= 5175.983436853
##$TD= 65536
##$TD0= 1
##$TE= 296.16
##$TE2= 300
##$TE3= 300
##$TEG= 300
##$TL= (0..7)
0 120 120 120 120 120 120 120 
##$TP= (0..7)
150 150 150 150 150 150 150 150 
##$TP07= 0
##$TPNAME0= <>
##$TPNAME1= <>
##$TPNAME2= <>
##$TPNAME3= <>
##$TPNAME4= <>
##$TPNAME5= <>
##$TPNAME6= <>
##$TPNAME7= <>
##$TPOAL= (0..7)
0.5 0.5 0.5 0.5 0.5 0.5 0.5 0.5 
##$TPOFFS= (0..7)
0 0 0 0 0 0 0 0 
##$TUNHIN= 0
##$TUNHOUT= 0
##$TUNXOUT= 0
##$USERA1= <user>
##$USERA2= <user>
##$USERA3= <user>
##$USERA4= <user>
##$USERA5= <user>
##$V9= 5
##$VALIST= <valist>
##$VCLIST= <CCCCCCCCCCCCCCC>
##$VD= 0
##$VDLIST= <DDDDDDDDDDDDDDD>
##$VPLIST= <PPPPPPPPPPPPPPP>
##$VTLIST= <TTTTTTTTTTTTTTT>
##$WBST= 1024
##$WBSW= 4
##$XGAIN= (0..3)
0 0 0 0 
##$XL= 0
##$YL= 0
##$YMAX_a= 390029
##$YMIN_a= -393628
##$ZGOPTNS= <>
##$ZL1= 120
##$ZL2= 120
##$ZL3= 120
##$ZL4= 120
##$ABSF1= 16.522
##$ABSF2= -4.171173
##$ABSG= 5
##$ABSL= 3
##$ALPHA= 0
##$AQORDER= 0
##$ASSFAC= 0
##$ASSFACI= 0
##$ASSFACX= 0
##$ASSWID= 0
##$AUNMP= <proc_1d>
##$AZFE= 0.1
##$AZFW= 0.1
##$BCFW= 0
##$BC_mod= 0
##$BYTORDP= 0
##$COROFFS= 0
##$CY= 12.5
##$DATMOD= 1
##$DC= 0
##$DFILT= <>
##$DTYPP= 0
##$F1P= 14.0000005364418
##$F2P= -0.99999901652339
##$FCOR= 0.5
##$FTSIZE= 32768
##$FT_mod= 6
##$GAMMA= 0
##$GB= 0
##$INTBC= 1
##$INTSCL= 1
##$ISEN= 128
##$LB= 0.3
##$LEV0= 0
##$LPBIN= 0
##$MAXI= 10000
##$MC2= 0
##$MEAN= 0
##$ME_mod= 0
##$MI= 0
##$NCOEF= 0
##$NC_proc= -3
##$NLEV= 6
##$NOISF1= 0
##$NOISF2= 0
##$NSP= 0
##$NTH_PI= 0
##$NZP= 0
##$OFFSET= 16.522
##$PC= 1
##$PHC0= -81.17911
##$PHC1= 5.690828
##$PH_mod= 1
##$PKNL= yes
##$PPARMOD= 0
##$PSCAL= 4
##$PSIGN= 0
##$REVERSE= no
##$SF= 250.13
##$SI= 32768
##$SIGF1= 0
##$SIGF2= 0
##$SINO= 400
##$SIOLD= 32768
##$SREGLST= <1H.CDCl3>
##$SSB= 0
##$STSI= 32768
##$STSR= 0
##$SW_p= 5175.98343685301
##$SYMM= 0
##$S_DEV= 0
##$TDeff= 65536
##$TDoff= 0
##$TI= <Analysis number 999999
Compound Code 99
Book Reference 9
Project Code 9>
##$TILT= no
##$TM1= 0
##$TM2= 0
##$TOPLEV= 0
##$USERP1= <user>
##$USERP2= <user>
##$USERP3= <user>
##$USERP4= <user>
##$USERP5= <user>
##$WDW= 1
##$XDIM= 32768
##$YMAX_p= 473291283
##$YMIN_p= -101390
$$ End of Bruker specific parameters
$$ ---------------------------------
##NTUPLES= NMR SPECTRUM
##VAR_NAME=  FREQUENCY,     SPECTRUM/REAL,   SPECTRUM/IMAG
##SYMBOL=    X,             R,               I
##VAR_TYPE=  INDEPENDENT,   DEPENDENT,       DEPENDENT
##VAR_FORM=  AFFN,          ASDF,            ASDF
##VAR_DIM=   32768,         32768,           32768
##UNITS=     HZ,            ARBITRARY UNITS, ARBITRARY UNITS
##FACTOR=    0.157963299565203, 1,           1
##FIRST=     4132.6476996994, 0,             0
##LAST=      -1043.33573715361, 0,           0
##MIN=       -1043.33573715361, -101390,     0
##MAX=       4132.6476996994, 473291283,     0
$$ Real data points
##PAGE= N=1
##DATA TABLE= (X++(R..R)), XYDATA
$$ [...]
21134 2322 13436 42110 64846 62943 38676 20440 -6233 -17800 -12374 19573 11548 -21842
21122 -21842 -8175 -10161 -18456 2687 -2037 -7087 -2719 4832 1462 8055 12682 26334 24969 12669
21108 12669 -5624 1692 7076 -14865 -33920 -19496 -3269 -6709 -3756 -7728 17332 42154 33956
21095 33956 12889 -4714 2938 5513 7517 44025 53185 46484 38382 43574 20650 6703 22999
21082 22999 41370 29034 23256 22481 33347 35217 44045 45056 32822 -4109 -15342 -2265 -5063
21069 -5063 -2934 3356 16946 39052 8842 -18084 -9227 -14404 7301 -1353 -31424 -44291 -48048
21056 -48048 -28418 2826 33215 45365 13036 -23557 -5655 -8118 -18078 -30949 -38886 -8208
21044 -8208 43184 47750 50286 52447 35596 34960 46277 14897 -10155 -25541 -19714 1578 28903
21031 28903 15572 20730 10023 45410 67470 50846 -5416 -31388 -11591 7632 4330 28251
21019 28251 61126 62865 54128 61773 62967 62088 58374 39118 17054 -22781 -25233 -30530 -33402 -16620
21005 -16620 18535 37488 24612 16533 11764 -4979 -24305 -16222 11290 -2427 -11582 10910
20993 10910 29103 44268 69042 71571 64499 44074 28017 20460 14603 37883 27223 -2484
20981 -2484 5189 15689 41357 24473 37802 57263 70527 48230 61472 56937 72364 80274
20969 80274 35767 16682 -9321 -25668 -22606 -3052 14739 -443 -9540 -1607 -14890 -38703
20957 -38703 -48599 -28059 -19900 18190 49853 42922 49457 23597 19307 13515 8531 11015 5689
20944 5689 -3288 27658 13326 7171 -4530 -17338 544 -4163 -7861 -20870 -16088 -6527 -24790
20931 -24790 -27507 -24398 -18977 -7384 10906 34816 33824 47912 26667 36691 7430 12273 -7491
20918 -7491 -37951 -15873 3233 30755 33489 18884 -13743 -8980 -1156 88 20738 22816 20405
20905 20405 13862 16288 35976 24825 47980 83783 78455 48525 24915 -1761 4382 -20317
20893 -20317 -41843 -32469 -9774 -17373 -43416 -49211 -50440 -20829 2204 -17765 -14725 -29699 -35728
20880 -35728 -33828 -29602 -4089 1603 -1817 -7545 3287 -4283 -41602 -45368 -546 18390 24251
20867 24251 16782 25358 19156 14563 4976 4072 2918 -27119 -44732 -65197 -68811 -23605 -22703 -25355
20853 -25355 -20686 -19813 -29112 -26692 -20558 -27167 -23553 335 -10035 12422 27098 26559 42901 55280
20839 55280 47960 44082 24995 24755 55459 41590 18294 -20709 -20055 -45822 -33854 11627 40537
20826 40537 24625 15296 24858 16055 2789 -19708 -17164 -16447 -10543 -16877 -24378 -37967 -39690 -44052
20812 -44052 -15616 -21432 -16276 696 14896 23857 46428 63384 59710 35550 8212 -16935
20800 -16935 -24543 21922 16353 -19496 -37109 -17361 -8173 -6054 -26352 -23084 15140 15565 435
20787 435 16818 57618 63938 41881 42608 54432 66182 53074 9823 -9219 -21010 -30786 -12221
20774 -12221 -19849 -11175 26849 39385 43818 49204 34212 21835 -1197 -18778 -12955 -34282 -62290
20761 -62290 -80689 -61324 -33862 -42610 -61036 -38253 -17607 -34810 -57081 -54757 -4419 15130
20749 15130 16045 16475 12401 26276 52062 34707 11695 -9104 -15562 -6165 2224 14945 11124
20736 11124 -15397 -1232 -4362 460 6687 -18595 -56859 -64321 -48397 -37241 -41307 -50059 -39868
20723 -39868 -31354 -57988 -69213 -65650 -50503 -20627 2424 -15768 -22940 -35807 -33995 -46902
20711 -46902 -52521 -53591 -29154 4930 7896 -7532 28574 34835 25026 17603 17313 -8353 -49844
20698 -49844 -48956 -3466 6564 5834 -5293 -17844 -40363 -18060 -26985 -20808 -13272 -29571 -11902
20685 -11902 -14016 -12193 -7066 -34091 -12597 25894 21684 37449 54756 29152 11033 10625 -1896
20672 -1896 27501 60492 54124 27119 6229 -3743 -20366 -12215 -23088 -29342 -35239 -14698 -19343
20659 -19343 14743 16112 7155 17118 17571 20550 -25327 -37088 -29772 -28250 8028 20638 44261
20646 44261 65860 62929 43593 39995 55306 39468 20349 27063 34318 8449 -32020 -49021
20634 -49021 -61299 -77011 -59437 -39213 -30333 -13473 -24287 -13459 6648 17622 42512 34333
20622 34333 52176 56166 36929 27680 47390 33431 18090 25604 46095 37396 20673 -12600
20610 -12600 -48401 -34925 -17718 -44456 -76780 -77010 -35529 -20727 -21790 -10800 12221 28386
20598 28386 -8256 -28424 -14225 -13493 -17358 -15310 -10727 10956 30129 21525 26062 23681 34498
20585 34498 33097 13881 -143 -10153 -10448 9795 18285 19541 1112 -10020 -32826 -54252 -48960
20572 -48960 -9443 -4714 6045 6336 -19180 -15760 -13137 -21029 -11327 7980 11753 2568 -1593 13911
20558 13911 28783 41781 21787 -11598 -29750 -41578 -56252 -66760 -57498 -53048 -30161 -218
20546 -218 2626 6784 10897 -6808 3837 28621 41699 42158 44485 36532 35851 39001 33006 8476
20532 8476 15688 12854 -6065 -28966 -25808 -14484 -41571 -75644 -67416 -27650 -15076 -31065 -33650
20519 -33650 -30478 -13733 -8100 21456 23020 -7649 244 17179 17775 -9916 -24736 -15702 -9049
20506 -9049 -9434 -14262 21114 42161 37339 51636 59081 40044 -1083 -5356 6842 31353 44752
20493 44752 26634 15808 2799 -9095 -10958 4653 5157 168 -2349 18 -4249 2463 -25236
20480 -25236 -39848 -27045 5626 18952 7490 -16616 -20155 -12772 -11656 96 10511 16937
20468 16937 57527 50543 22387 7531 -1426 14674 9018 -11099 -20349 -5961 -19468 -22737 -26419
20455 -26419 -16755 4511 1345 -2595 3264 8065 147 10967 29252 20373 15636 1809 -7936
20442 -7936 -21932 -33282 -25246 -23754 -15212 -3350 -26407 -549 29169 37740 19395 -7293 5024
20429 5024 18826 24547 38751 62540 47997 35653 23073 32068 43157 47829 61482 53262 41401
20416 41401 28757 6401 -21921 -22296 -29943 -18750 -14693 3179 739 6228 28642 20495 15380
20403 15380 31199 58614 44171 41025 57330 57874 35723 11544 16683 37354 29340 24443 12831
20390 12831 4738 18540 21240 7679 8811 16912 15671 -1039 17913 47844 29722 14864 -4206
20377 -4206 -11642 3523 58502 63945 57445 21604 -3314 -18708 -8412 -9633 -19644 12173 25321
20364 25321 31850 22437 28125 24054 25072 24730 12062 -23009 -36944 -21132 3452 4456 -18543
20351 -18543 -26350 -10630 -27125 -40639 -61344 -37834 -10498 6236 21808 21011 29426 39701
20339 39701 16698 8935 36079 45007 47713 53243 26368 8972 24053 39960 48787 40401 42951
20326 42951 46437 47313 41850 58316 43305 15068 12492 -17654 -8549 -11533 -25487 -26863 -1299
20313 -1299 28500 25190 23019 21028 17357 14522 16646 13053 37746 62319 59544 39386 33948 28171
20299 28171 6183 -17098 -14544 -20724 -28659 -26603 6249 21621 -5210 -1299 32815 20171 -22473
20286 -22473 -29074 -50058 -10780 -4113 3970 6762 22770 38536 43333 69108 55045 31250 37532
20273 37532 29535 19519 22074 31917 30333 22699 41372 20955 3972 8840 32062 18320 -12840
20260 -12840 -25273 -27522 2701 14697 27850 44394 62770 63205 47487 20876 -14990 -31806
20248 -31806 -45313 6009 17438 39324 49280 22804 -1617 -16484 -9920 5901 22614 34482
20236 34482 24960 7334 53057 44787 -8198 -23796 -5189 4984 12696 29609 19673 3039
20224 3039 -12158 -21293 -11327 -7421 2667 16572 34109 19412 9614 13231 12576 -320 -3216
20211 -3216 -4845 -3250 -17931 29540 45930 32670 16807 -6290 -16250 -16678 -35075 -29542 3499
20198 3499 -2630 -15439 -11658 -17436 -3177 40779 26184 30988 43978 39734 8527 5473 6527
20185 6527 24456 2093 -28235 -48392 -11652 12383 -33631 -22480 -22469 -20562 -4582 -15297 -15430
20172 -15430 -31642 -31042 -31483 -25151 -21888 -18006 -5817 -22767 -32155 -24729 7259 21423 21622 21809
20158 21809 12730 5805 29545 42523 42034 16316 34066 37058 31866 41943 35306 5300 4151
20145 4151 21285 27657 14539 8831 6046 28576 27870 12682 24 5522 5140 22459 30878 9151
20131 9151 -16521 -20973 -3764 13114 31831 36570 34545 39594 26412 35936 57791 72769 55027
20118 55027 46456 32264 26751 24340 2458 -2362 -2488 -37844 -47434 -9815 -8113 7776 36913
20105 36913 69888 57391 44453 31143 3801 11863 -8761 -18726 7977 30486 50740 62922
20093 62922 54184 21513 5406 -7357 5119 3901 19728 21367 47095 48414 42677 50518 37481
20080 37481 29122 33935 20779 28267 61216 84798 80222 74219 64869 51964 26962 23089 24193
20067 24193 37734 22976 23198 48113 47236 63334 48974 10333 43830 105731 124186 96043
20055 96043 79760 116274 121146 137767 158476 134235 127902 148316 161906 223361 285050 345985
20043 345985 421262 517283 591360 645405 654659 603234 538675 477878 379118 316632 270409 227404
20031 227404 207334 161802 126005 106145 96942 53672 17606 26492 30153 31500 49586 44094
20019 44094 39899 15715 2474 32864 59353 53519 72496 40523 24588 34770 48201 67719
20007 67719 79385 63894 52614 39160 11653 -5353 17275 21732 32498 10400 -21540 -22828
19995 -22828 -5727 15952 10904 -12912 -48555 -35582 20031 33762 34537 35503 29708 866 -15134
19982 -15134 11882 39810 50468 45711 51920 61974 70770 85996 101892 128524 131275 99513
19970 99513 45243 5750 8312 12824 4261 -3022 -8633 -13426 -6342 -3335 18492 -3595 15724
19957 15724 40733 40788 66197 85369 71818 30589 -47 14358 18613 14646 6472 -10469 -12042
19944 -12042 -29800 -23101 5997 15389 14109 6306 -3694 -9377 -43488 -16563 -13946 -809 14207
19931 14207 13931 11361 25596 47942 62817 49669 63359 48568 15538 29973 25175 -15393
19919 -15393 -14268 20931 25930 -16411 -19746 18549 60363 33420 10189 6785 28214 9519
19907 9519 -4956 4209 4171 16353 23032 31947 34799 34650 50489 52825 22487 9410 19943 25128
19893 25128 12919 6185 -10702 7421 -5202 -17624 -332 -1923 -12692 14860 14469 -3697
19881 -3697 -15577 -43669 -28273 -2901 25388 52272 95919 80424 71450 49203 16920 3221
19869 3221 5177 10126 24557 35533 11465 20766 28785 13647 11185 40091 45080 31527 34608
19856 34608 51015 45100 43577 60910 75879 61900 42787 39419 52230 47475 40308 55855 85781
19843 85781 100867 86740 53145 22435 38286 33329 39329 18023 30173 84336 104691 97599
19831 97599 76763 82933 95620 67102 55625 44480 5259 -6095 19711 45607 46655 61495
19819 61495 68656 52230 13574 20996 31023 33063 30720 40076 51727 58045 55510 75120 87530
19806 87530 71899 46185 13577 13295 38503 34079 11402 -9468 4939 17301 46883 41600
19794 41600 38642 58931 76321 39921 12723 22854 43653 78914 79392 62901 41917 13835
19782 13835 27679 45736 52521 56210 44536 37174 36040 52016 56497 41446 24672 43765 63173
19769 63173 39452 19453 21470 26353 21302 10570 -5378 -19355 4986 14847 21791 -10207 -1058
19756 -1058 -2236 -25779 -23099 6462 -6948 -27330 -14069 -25583 -4305 10685 16205 -4055
19744 -4055 5322 49377 89096 90761 88118 74579 70071 86790 51751 18493 36010 62082 54220
19731 54220 49347 79964 79953 67630 83568 78037 62148 62052 63783 65717 56692 44205 11015 323
19717 323 -19420 -31674 -7599 11917 12238 11970 30946 41900 26311 37800 68644 65517 62714
19704 62714 59924 34005 2729 1125 20196 17300 29801 43310 62755 61213 51669 27591 35958
19691 35958 46804 35677 56293 67345 48618 26075 18879 27285 44154 65052 56472 56854 66384
19678 66384 77063 84941 88844 87744 102564 83946 58513 39720 66359 89636 91386 59510
19666 59510 70282 82667 56349 60661 92653 88401 103558 98889 105065 91304 61195 59794 64847
19653 64847 51513 54207 62482 69815 56239 52708 61262 59855 37783 40888 41925 36375 26965 22467
19639 22467 10208 43000 79604 104788 123545 107458 95482 90949 84643 70489 102731 111119
19627 111119 58562 11748 11851 5335 26124 50002 61169 65782 86621 86677 74748 71656 73427
19614 73427 65000 61778 82025 100002 117456 111897 87161 65233 45975 46452 48646 73834 72486
19601 72486 88311 80046 69544 71569 89299 79446 50363 34304 26112 48781 59009 64697 64880
19588 64880 52556 54246 62982 76888 86286 90766 84469 84753 100582 124197 121276 84939 88389
19575 88389 105646 102428 135208 144198 146691 133492 144627 174119 154715 118507 140744 185862
19563 185862 178308 161858 138083 138090 131082 134152 159089 184757 208584 248322 242650 228006 213719
19550 213719 226481 271157 320655 375046 398502 400371 379706 375597 336152 261651 200178 169536
19538 169536 134566 157931 182356 149275 138656 138800 126475 147405 147255 138478 141737 150108 152782
19525 152782 135043 131719 139952 166482 170356 182872 162924 162276 174187 192693 213518 232303
19513 232303 239864 233880 245737 256445 254995 230582 230516 228112 222077 228907 226364 217010 238239 286829
19499 286829 301531 288439 271690 259100 291469 303870 320948 336396 340995 369016 377301 382198
19487 382198 400508 429274 432146 409700 409634 416162 439437 460920 470879 450837 435847 453445 478376
19474 478376 477086 486639 519246 544282 582401 603460 639650 677419 710127 736073 785501 835634
19462 835634 910348 1007816 1089782 1151919 1210624 1308391 1389195 1443053 1492839 1592269 1727192
19451 1727192 1837994 1980904 2145999 2314125 2520812 2739555 2907776 3033702 3155975
19442 3155975 3263239 3369903 3525424 3785207 4103726 4488135 4967214 5551197 6225644
19433 6225644 7102745 8177713 9462484 11080999 13101376 15668955 19042381 23582986
19425 23582986 29827572 38441081 50050727 64583500 81225125 97538100 110982734
19418 110982734 119245499 120064521 113498197 101282626 85598749 69104899 54047037
19411 54047037 41571025 31927027 24827467 19666401 15849906 12963332 10768457 9046211
19403 9046211 7675138 6590101 5746290 5046357 4502015 4066707 3743456 3498927 3286365
19394 3286365 3114097 3021589 2965959 2915971 2861488 2759199 2624699 2462776 2287547 2088439
19384 2088439 1897298 1739482 1568334 1406617 1331770 1277367 1232006 1241736 1228891 1192799 1136621
19373 1136621 1055822 981436 926522 890599 814764 727820 676391 651292 644624 630514 591095
19362 591095 552618 510128 479633 472839 462948 457402 443318 430275 397240 395650 401767 397754 366581
19349 366581 356985 357490 359904 374896 371595 365371 361721 333209 312902 336324 335715 305081 290383
19336 290383 290727 293005 269448 254445 239814 215560 193848 202764 206753 196374 178436 174600 157951
19323 157951 117559 102246 108081 125288 168852 158901 152204 139164 154520 165563 174336 172772
19311 172772 206989 207548 193706 196892 199116 211165 221947 199630 175733 174730 189116 191021 210394
19298 210394 245961 248256 260984 255010 273524 288572 264078 217305 205902 217121 188923 145061
19286 145061 118283 97258 79960 84680 93334 94904 99504 78930 105838 141611 143969 125437
19274 125437 84895 82542 90674 113972 108619 81507 61012 40863 34997 68580 79345 95944
19262 95944 103404 96514 99773 124450 130951 125330 115616 118545 84676 67611 63854 99819 95073
19249 95073 67693 70537 93907 98451 112022 137474 132415 124017 88412 82069 93625 101324 102413
19236 102413 125487 131945 125870 88407 59726 58941 63822 61583 71328 63810 82582 88071 70818
19223 70818 85428 113073 98598 76342 53078 42975 58237 80020 81984 85401 77255 41949
19211 41949 30508 46265 38682 48543 54233 49465 65112 71279 68688 69499 43211 18140 79610
19198 79610 108072 98242 76058 86767 98643 84336 74303 71726 63111 54052 72730 81379 88558
19185 88558 68391 44494 49220 57240 54036 48662 58183 62765 57394 31873 31903 40072 29908 51666
19171 51666 80561 85297 80506 84871 96490 116611 107570 104057 143399 157059 144962 126329 142272
19158 142272 180079 198886 196903 166161 138489 126345 127416 111251 127870 160142 162971 150066
19146 150066 173905 228707 239394 235437 231404 218410 193863 164818 154469 132572 124493 115367
19134 115367 95974 116686 118659 133853 154191 167365 169085 162559 159149 150336 120131 111119 137135
19121 137135 179453 187248 207719 209863 263922 317295 359329 348896 311007 309519 333107 354260
19109 354260 330011 313511 286912 291975 310777 364702 403318 412899 439506 465009 488785 495811
19097 495811 473288 411531 348960 292111 257920 241694 224304 226684 226449 239305 257361 287349
19085 287349 284890 270092 251188 220321 210092 185511 157671 137536 149720 172382 159283 153924
19073 153924 193877 177382 179226 201223 173303 175106 217521 253583 267751 283730 313819 346372
19061 346372 377658 424064 448655 460863 454567 450328 449252 464652 456953 417365 374215 337019
19049 337019 306039 296901 287800 310732 306770 260572 234337 219182 204295 177266 188643 178620
19037 178620 144351 113828 101243 119225 99715 90678 104189 133946 150061 142738 116946 100587
19025 100587 111087 100206 70359 83849 110569 112230 111224 109588 153769 184874 180992 172845
19013 172845 188012 191061 193269 163101 138313 120410 108225 102691 86946 79390 90157 112630
19001 112630 124737 155898 138663 112145 91293 102814 94148 110685 115033 96777 77621 85366
18989 85366 116864 161191 150014 118883 114512 97948 85059 125093 139018 85140 72164 101988
18977 101988 93310 87119 96310 75042 68995 112860 130029 76422 50155 65408 77106 83008
18965 83008 83710 76072 108050 111851 108582 116364 133155 124414 104772 117186 140548 170064 163276
18952 163276 137431 118492 140486 161949 192581 218852 208281 200234 175595 184683 189188 172435
18940 172435 161409 181873 202900 186846 204951 245129 250612 272832 276302 265915 250367 235633
18928 235633 214177 201779 206113 239960 280951 343968 386063 366553 375739 392828 354543 335762
18916 335762 293483 243148 208233 205935 238661 261359 268997 280238 314795 330660 350139 367937
18904 367937 362404 345531 332014 354326 364945 379840 387557 374799 326897 278030 264802 234626
18892 234626 210887 212526 228132 260088 279651 298697 326043 343517 336133 329348 361503 375290
18880 375290 351541 327846 303634 270092 229079 224886 236905 274060 305518 295074 266569 266023
18868 266023 279310 261886 239512 203547 170365 159634 151546 161327 151477 149606 143104 144118 174933
18855 174933 209227 225657 232319 212824 190163 166826 146989 162464 192518 163096 160700 188319
18843 188319 195006 203980 217712 201491 193137 187756 214550 231111 208056 211125 208696 171717 138670
18830 138670 142866 178385 195657 188380 177993 160866 167291 216759 242436 204258 188498 221917
18818 221917 213547 209716 198164 202206 227438 212143 200434 224317 235181 239457 237789 214736
18806 214736 186938 182817 235348 255494 255094 262265 272273 302752 334106 341131 353698 390802
18794 390802 417214 490205 588055 693534 772255 833961 892947 898757 873085 821076 720829
18783 720829 624195 520170 435379 364026 306927 302832 304640 316549 303725 292480 303752 305910
18771 305910 294694 295315 314714 349075 426497 483600 500832 484777 409663 380818 355790 345524
18759 345524 333962 346150 319053 301353 293830 299647 316898 279883 300632 323512 326157 334950
18747 334950 307093 254467 238378 261645 250644 247552 261700 276421 288365 324003 373043 409848
18735 409848 441164 445601 459717 422011 387573 428568 461083 450702 416344 390162 367985 361112
18723 361112 363137 377595 412280 432033 405781 398954 386678 385294 363464 385189 429248 470654
18711 470654 490558 502495 508147 479616 454604 450207 430448 452846 461972 485118 497872 505983
18699 505983 551587 596495 630050 643729 637285 629918 646429 671690 696517 692241 673189 670502
18687 670502 712362 744873 776662 853545 909285 997645 1075072 1121066 1176391 1183465 1171361 1173139
18675 1173139 1116139 1090465 1092828 1111920 1160339 1248137 1355404 1471900 1632358 1842715 2110424
18664 2110424 2491777 3162683 4194050 5436157 6397511 6846681 6748049 6143544 5208813
18655 5208813 4325866 3664271 3269302 3177518 3350614 3755618 4325265 4767558 4947933 4932149
18645 4932149 4705233 4364389 4129405 4127407 4360532 4830189 5540352 6371427 7294788 8588894
18635 8588894 10373311 12122770 13040661 13278491 12833406 11669817 10411997 9697836 9480017
18626 9480017 9595664 10045781 10798376 11622571 12048252 11985016 11469054 10515257 9380217
18617 9380217 8471114 7992137 7947353 8315788 9144313 10527900 12647546 15420879 18528897
18608 18528897 22228934 27174129 33606360 40298553 46561924 52301161 55259455 54744937
18600 54744937 52690963 49875635 46107431 42724220 40742978 39400244 38154252 37944342
18592 37944342 38803160 39265622 38765981 37957933 37105179 36550949 37056796 38577781 39452329
18583 39452329 38876859 36961977 33841994 30278581 27556156 26328978 26695559 28796598
18575 28796598 33066628 40204226 50465052 62285157 72849981 81701882 89546441 95781625
18567 95781625 100674587 105357884 108531818 107755951 102922073 96090396 89835431 87661686
18559 87661686 92354221 102801978 116153780 128104898 134323215 133720629 126162155 111781071
18551 111781071 94220336 76633318 60273607 46586794 36444447 29551820 25011647
18544 25011647 22210233 20871871 20982674 22523060 24676775 26639707 28761007 31248384
18536 31248384 33354705 33750636 32464379 29898415 25923105 21275004 17333288 14826166
18528 14826166 13888459 14375663 15713340 16725412 16764336 15941503 14139343 11570998 9102126
18519 9102126 7260476 6016397 5155469 4534310 4051647 3651336 3377415 3159305 3010485
18510 3010485 2907819 2816066 2720145 2605378 2503638 2391922 2335372 2378464 2477240 2649773
18500 2649773 2990910 3554254 4314352 4870810 5069684 5003666 4592715 3914187 3296536 2907327
18490 2907327 2645842 2524774 2599907 2828900 3225893 3611875 3840933 3911587 3815631 3586055
18480 3586055 3390174 3303571 3277782 3329218 3477975 3608145 3713736 3781462 3747699 3584943
18470 3584943 3307770 2988452 2701505 2483867 2346554 2294016 2317389 2424758 2627414 3018425
18460 3018425 3577542 4160039 4551384 4688226 4619152 4282451 3802294 3365599 3056197 2917986
18450 2917986 2882437 2888541 2927593 3039396 3249137 3546690 3966521 4443202 5074322 5937231
18440 5937231 7017611 8146663 9114098 10003519 10901814 11986003 13316878 14457956 15305581
18431 15305581 15981148 16538576 17229435 18311789 19850271 22089206 25345086 30335682
18423 30335682 38571449 51119049 66083066 78953542 86061722 86009566 79037671 67503009
18415 67503009 55450397 46132708 40091337 36368923 34254873 33240405 33314992 34969937
18407 34969937 38083811 41759773 45848402 50343176 53644229 54126310 52634374 50069312
18399 50069312 46705673 42978097 39310509 36248082 33716169 31601775 30702537 31992445
18391 31992445 34958821 37407017 38061710 36964053 34162794 30600540 28127214 27715937
18383 27715937 28257665 28442666 27772130 26050912 23474017 20914460 19361870 19335183 21056332
18374 21056332 24742412 30172824 36795081 43312796 48606723 51830982 51319334 47418263
18366 47418263 41769738 35367775 29422503 25287612 23680456 24939017 29217263 35199069
18358 35199069 39447597 40695867 39285582 34863975 28322537 22023505 17199628 13773778
18350 13773778 11370903 9641855 8327973 7283335 6347215 5481741 4761397 4235916 3846517
18341 3846517 3597315 3429640 3356839 3435110 3637368 3916531 4049332 3987699 3764154 3368594
18331 3368594 2877109 2422792 2095016 1896492 1788337 1707242 1617514 1523690 1447580 1410964
18321 1410964 1414858 1430434 1442462 1457142 1448310 1416763 1367492 1317937 1248065 1147353 1041305
18310 1041305 939777 843878 765974 682610 635930 636926 591629 584058 594318 594818 613848 617490
18298 617490 631257 622121 623986 614918 578249 544642 519423 436539 375079 371868 395331 390398
18286 390398 350570 359835 383025 403981 410340 386206 392484 374269 332338 315346 335857 328301
18274 328301 312339 301412 278110 298909 300725 274398 250651 272348 275423 236607 222046 224717
18262 224717 241203 257691 248663 241720 229962 229424 221024 197266 180866 183492 187168 207572 176660
18249 176660 132733 158424 192822 218830 216645 237197 214911 212373 222972 234573 215853 223362
18237 223362 250603 283765 287030 267025 257022 209365 161676 93483 66741 74751 113234 150845
18225 150845 163626 141025 155985 155666 144620 133898 95503 87870 104102 94927 92210 82695 100315
18212 100315 95223 84036 102566 116022 131729 124952 137905 117287 82218 85263 95432 114893
18200 114893 132181 130623 107497 74366 73439 85622 92633 87839 81775 107423 90668 92800 81713
18187 81713 46615 63053 75376 72426 77589 95905 120169 154947 171899 159652 137459 130292
18175 130292 111738 105086 91404 111414 136206 156222 134300 113942 133928 130927 112031 111061
18163 111061 118694 121543 146616 152707 135843 153339 187802 187367 175666 177604 197288 219313 213386
18150 213386 206366 216489 240240 282994 313715 326657 327302 320488 317492 275927 259633 272061
18138 272061 304311 320890 349627 364782 396451 410798 441785 489762 551519 618022 701647
18127 701647 787076 900044 1027414 1169931 1320021 1537419 1732955 1972223 2243491 2556860
18117 2556860 2980079 3556079 4359673 5465777 7093844 9651573 14025860 21839656 33737062
18108 33737062 43041059 46230045 45809123 40464669 30438973 20674020 13773137 9485653
18100 9485653 6851591 5141233 4010181 3186745 2568567 2151031 1828382 1568083 1363798
18091 1363798 1230239 1075119 937062 835798 765529 706510 700981 690495 663528 662449 678551
18080 678551 692061 695204 687682 645386 634048 630624 577263 510818 444004 443799 445174 462220 506007
18067 506007 531489 564656 572637 530837 494664 464112 422528 377523 325732 284053 260759 272432
18055 272432 297911 313284 289948 274644 257618 257914 231860 211914 227830 212329 183194 177459
18043 177459 174495 169611 204100 244711 290504 327852 356564 336167 320483 320626 298432 287099
18031 287099 302255 327116 351752 365044 389161 395467 377742 365947 340432 291790 249638 202902
18019 202902 164445 170503 185963 197845 152215 124808 124176 144604 162527 145992 136117 136164 150842
18006 150842 171019 161573 139421 107494 74814 71138 64682 70610 62175 24461 10618 26330
17994 26330 48447 70455 84817 81662 84285 94313 120049 134644 126014 116028 130035 167155
17982 167155 176586 176306 200330 162941 112328 109886 104712 87814 109845 105024 80596 69136 98132
17969 98132 113110 94065 75765 67415 50928 23133 34368 24078 14303 5310 -13332 -19586
17957 -19586 -2013 30248 27560 39784 60683 80083 56553 60365 88563 76518 58562 57698
17945 57698 53993 50868 33878 54229 61417 63992 64607 42493 12381 31283 42644 51131 43041
17932 43041 11431 -1924 -21938 -40326 -7052 17991 31208 46438 45312 33609 16308 11192
17920 11192 30111 33384 59425 86031 97098 85498 79689 84875 115865 165896 217643 214438
17908 214438 201249 211194 217363 191019 177347 151126 167517 172096 188967 211160 211725 250148
17896 250148 335263 390952 453844 476010 451578 397549 317195 259342 240190 204076 164646
17885 164646 142167 165568 165307 151768 133822 104807 83311 78799 76080 74143 55960 38479
17873 38479 32107 31516 39420 55065 114847 158333 186411 205393 224731 241578 240795 220792 218715
17860 218715 230203 234375 248875 259083 260353 275108 268561 257145 230463 220382 213414 197626
17848 197626 212634 215280 214430 229993 217575 200353 162915 121481 67419 54234 74862 100638
17836 100638 110800 142483 160260 174174 182703 160877 118064 72354 65926 65072 55855 44744
17824 44744 45786 27957 38022 46371 29212 8924 3190 29651 10441 -16947 7450 14846
17812 14846 33459 5053 -28862 2049 33493 6802 -3942 -17047 -53732 -47348 -40470 -51929
17800 -51929 -17991 -14299 -18546 2321 11205 6903 1172 -828 -5917 -13573 -38972 -37340 -25557
17787 -25557 5919 57 12461 2087 -20535 -1214 7854 -7778 1990 20965 27263 9762
17775 9762 -1177 -1969 -27042 -30310 -23724 -23612 -16451 -3638 18315 46660 48207 40765 -8780 -37208
17761 -37208 -31665 -17251 -24916 12898 13069 -14654 -25727 -34787 -32477 -24439 -16876 3425 6076
17748 6076 14655 -5731 -7053 -2402 -1509 -27602 -21229 -120 -15066 -33136 -15261 -27223 -37818
17735 -37818 -31922 -24588 -31385 -52484 -74984 -34788 -29208 -28035 -15517 -4456 15815 9944 25492
17722 25492 29740 16670 3902 6332 4433 -16325 -24243 -7033 17016 -1664 -8267 17929 30079
17709 30079 21392 10052 15331 -5743 -2350 -2477 1075 -36190 -53967 -45160 5102 28709 9313
17696 9313 -3852 -742 1229 -3831 -10270 -3127 30067 24996 -20063 -39580 -59424 -47871 2320
17683 2320 11902 -25247 -55431 -36310 -30409 -27341 -32814 -51710 -85437 -83119 -58437 -40368 -26299
17670 -26299 -18162 -31005 3431 12546 9305 13925 -8290 -26929 -33869 -47155 -35346 -34441 -30676
17657 -30676 -51218 -51727 -34854 -23328 -18901 -18347 -8568 16792 34410 21877 21235 15851 13645 17271
17643 17271 2282 -18491 -43436 -43537 -17297 -21931 -51218 -53287 -35969 -3591 23726 40756
17631 40756 28024 23565 -1471 -18139 -47110 -59884 -65854 -57241 -44048 -54538 -47247 -20125
17619 -20125 -23656 -14035 20895 25739 -920 -33900 -69367 -77170 -36148 -11301 11396 -5050
17607 -5050 -41225 -40230 -36871 -45310 -33544 -18316 -20086 -25078 -40960 -56073 -55213 -18249 -7795
17594 -7795 -7432 -39969 -81349 -70204 -27144 -8121 -537 7561 -19381 -50549 -55272 -49555 -32666
17581 -32666 -36577 -32434 -41439 -46064 -47906 -50670 -54742 -50330 -76237 -68018 -62064 -51503 -32218 -19156
17567 -19156 3725 -4254 -16385 -11853 -31235 -64799 -66041 -51993 -45360 -31842 3412 1126 -18573
17554 -18573 -14267 -10166 4660 -15767 -28624 -8945 12839 -30244 -20116 23225 11921 -12238
17542 -12238 -25428 -14223 19899 37593 26153 22367 -808 1539 -6541 -9878 -21260 -7407
17530 -7407 -5444 -27340 -37283 -37429 -47032 -46005 -41179 -48986 -37086 -29861 -12554 11031 18912 -9243
17516 -9243 -26628 -9513 4008 32514 29724 9684 -15953 -24895 -5849 6147 -5466 -1192
17504 -1192 -14670 -34263 -42241 -31287 -35306 -38368 -18599 -39748 -23989 -6262 -18319 -49903
17492 -49903 -33367 -13786 -14192 -6540 18548 35442 11841 -13727 -17522 -11022 -11260 -36809 -43618
17479 -43618 -46691 -35631 -25477 -21594 -48182 -33054 -6187 -19328 -15024 -13237 -3923 2749 19716
17466 19716 18179 4279 12723 -3904 -22603 -14317 -26420 -35437 -12672 6544 12244 16418 -9143
17453 -9143 -33397 -22382 6660 35325 41688 33049 20432 4461 21180 49942 128486 221130
17441 221130 267728 250583 224060 157495 125461 109697 68995 29197 -24316 -42820 -10435
17430 -10435 -5846 8822 -193 -391 -4525 379 19983 13140 -8523 -7684 -22564 -26702 -59879 -41250
17416 -41250 16751 47407 21400 7376 -14714 -47036 -56514 -25067 2676 30877 30472 33564
17404 33564 8677 -14446 -6984 -24345 -20815 460 -1739 6588 7540 7470 20274 22576 -14668 -38956
17390 -38956 -53803 -23099 -3273 -14081 -2610 -20412 3100 38266 16228 10380 12961 18548
17378 18548 20997 17183 9580 18728 19705 -7774 -5675 15717 14086 21303 32768 41286 6185 2846
17364 2846 -2813 -32811 -48762 -23365 -15151 -33412 -44881 -34696 -3539 -9504 -29743 -27870 -25941
17351 -25941 -31396 -38310 -56588 -51941 -25446 -47676 -45287 -22563 -30273 -16417 6732 -5469 -12171
17338 -12171 35797 47436 29267 52376 71603 64911 25777 -823 30049 56100 46609 14221
17326 14221 -7130 -22977 -5285 33631 25974 -4668 -16613 1905 12183 18780 10522 -7524
17314 -7524 -22985 -28796 -37149 -19004 -34401 -44048 -42268 -14822 1994 -1238 238 16657 11184
17301 11184 -13096 -24877 -43141 -46854 -11482 -230 -28302 -48645 -45861 -16497 -2682 -19695
17289 -19695 -41191 -47004 -16369 -14420 -39965 -38987 -23135 -5758 -5007 6417 -7962 -7078 2806
17276 2806 8196 -2866 -23576 -6856 7228 -3281 -5402 26276 11414 9369 13157 22062 34395
17263 34395 31183 27945 36067 27553 23069 -3009 -26593 -24296 7679 5566 -9357 7756 -11905
17250 -11905 -36231 -34246 -44387 -28711 13028 18348 13874 -7527 -807 -9643 -17259 7105 14674
17237 14674 1535 -4143 -11154 -36447 -39134 -14225 3515 2807 2313 -1960 -12360 -35619 -76299
17224 -76299 -52915 -20975 -42127 -26706 -17037 -31587 -42355 -35994 -32847 -30052 7568 21959
17212 21959 -2877 -17097 -38945 -29082 -23334 -5774 -12832 -47044 -76898 -67402 -48444 -45331 -56944
17199 -56944 -29560 -621 -26298 -19317 -30801 -52901 -52644 -54601 -38531 -44609 -27602 -28681 -17352
17186 -17352 4201 -634 -21981 -24418 -20388 -4769 3422 -7921 17118 32098 22451 9817 8961
17173 8961 -2158 -11845 -14858 -33979 -42219 -336 16430 -15606 -35429 4980 10796 -29358 -19575
17160 -19575 -7732 -14385 -14782 -17262 -24958 -22402 -33958 -23189 -7829 35882 52613 33310 29549
17147 29549 31070 56249 35966 15743 49600 46533 14489 5174 12342 -3288 -3503 -27818 -56793
17134 -56793 -63333 -39082 -32163 -28557 -17329 -3883 -5205 -23120 -26312 -42425 -47024 -43698 -30539
17121 -30539 -23296 -9508 -8811 -22618 -29230 -26780 -43088 -19838 -7370 -19337 -53534 -59114 -21577
17108 -21577 -30721 -38526 -39669 -40739 -34262 -13655 6143 -1880 -28203 -27234 -29207 -29229 -30828 -24014
17094 -24014 -23920 -12843 1120 -13259 -28906 -14080 10558 12311 16724 5568 -1076 7289 10345
17081 10345 32804 25728 7663 16431 -19256 -25937 -11315 -8540 -18789 -8972 -14115 -16221 -25337
17068 -25337 -36039 -59939 -57869 -36593 -14433 16832 -1209 -43579 -38804 -21295 -36345 -57835
17056 -57835 -33882 8054 -19705 -22774 -2103 -3754 -24286 -9869 -7880 12005 19209 13874 4678
17043 4678 23182 38127 22601 4374 -7304 1812 13291 -4006 -10378 -25557 -26662 -27181 -6230
17030 -6230 4744 13689 -26002 -45256 -55074 -50746 -45363 -31958 -19787 19083 24004 22731 31268
17017 31268 20471 -20787 -13510 -12717 -45924 -26415 -6345 -945 18793 39314 53566 35725
17005 35725 20400 27987 -13300 -5762 11697 10801 -4028 -13971 -16877 -3061 18525 26766 34856
16992 34856 50627 35696 19666 1641 -2585 -15947 -15343 4985 28540 35976 9870 -1373
16980 -1373 9423 -8101 -8423 15141 12869 22883 22926 -165 2883 3729 -37513 -31787 -9947 -16489
16966 -16489 -14522 -8183 -17769 -41244 -35789 -50108 -63759 -43513 -31904 -1266 31161 57061
16954 57061 54946 29040 29235 14196 12096 4722 10388 14651 -21252 -25737 -14275 19914 34854
16941 34854 21901 20671 11938 12007 -2971 1986 -15359 13146 22756 8377 8959 -8374 -44077
16928 -44077 -52586 -23128 -16089 -49797 -58746 -31350 -33320 -31598 -23800 -32297 -25156 -12007 -28940
16915 -28940 -43320 -38285 -8834 -7962 -8858 -24406 -17133 -9622 -5161 4682 -5458 -18340 -28933
16902 -28933 -15847 -4158 -877 -13820 -18983 -29246 -32188 -34897 -47362 -53654 -51470 -60570 -75091
16889 -75091 -92418 -85014 -67037 -34666 -14692 101 -1456 -24705 -30595 -32096 -22225 9413 12455
16876 12455 -12870 -557 4971 7448 5539 -28911 -26996 -4842 -31716 -4134 4211 -30998 -52766
16863 -52766 -42448 -5724 -3025 -11503 -9023 -2914 14115 28725 29461 41295 20675 -853 -13770
16850 -13770 -17316 -23070 -38405 -21515 -9173 -41686 -44039 -11404 29594 19389 -15718 -15035 -1744
16837 -1744 -5541 -6977 5906 -3665 -9546 -8783 12149 2972 694 33696 31065 -10324 -8132 -4997
16823 -4997 -8849 -9 4878 -16913 -18094 -30263 -52737 -59949 -23474 -11608 -15975 -37004 -31068
16810 -31068 -11381 1546 20970 35127 30904 11254 -16959 -6244 47102 57310 31819 8173
16798 8173 -10292 5879 3229 -9435 -4670 -32878 -51837 12111 8364 -8583 -5451 11665 29570
16785 29570 30481 29038 29595 12909 -14150 -27270 -31224 -21582 -22069 -21076 -16725 -4257 20296 9271
16771 9271 27085 31940 31395 -17721 -18999 -16650 -36599 -7671 -667 13348 5379 -23290 -28133
16758 -28133 -33731 -25754 -11918 -805 -18651 -18240 -13253 -875 17485 17804 13367 22972 25964 17699
16744 17699 12922 22333 12556 -2031 15401 -4477 14955 13850 8212 -25112 -22467 -15229 -3743
16731 -3743 21371 24830 14316 -16000 -38299 -32769 -12300 2672 3687 -6139 -6353 -198 3072
16718 3072 14629 -3983 -18066 -12776 -17731 -119 -12553 -27619 -13654 -17374 -29677 -12525
16706 -12525 -10463 -11155 11336 24095 15737 -18781 -30355 -16659 -10161 -12049 -20223 -35518 -21389
16693 -21389 -14065 -29163 -25833 -22829 -8963 38 -10574 -56720 -50795 -30214 -5409 14436 31015
16680 31015 3601 -12906 -19832 -16497 -40785 -44426 -28690 -10839 -24021 -18786 2193 11361 20966
16667 20966 18308 7615 1857 17940 -6262 11111 39869 48413 48056 8240 -17489 -22699 -38920
16654 -38920 -29757 -16806 -12659 -2648 110 13755 22948 9642 -11638 -22388 -28679 -20952 -18225
16641 -18225 7497 -3337 -15412 8645 -5033 -9904 9039 -8047 -1564 -12969 -13603 -20666 -13744
16628 -13744 22661 19006 -2349 -26685 -37831 -42378 -39075 -53403 -41908 -6762 -5119 -14351 -17641
16615 -17641 -33667 328 12418 29019 27656 21090 41645 44894 27492 11533 395 16244
16603 16244 12147 4187 18424 5923 7808 21561 -145 -766 -22724 -33648 -18926 15967 37449
16590 37449 43287 35694 6075 23729 32489 27060 36842 36967 24999 -6825 -1152 -12754 -13852
16577 -13852 9005 10975 -9888 -4483 22030 48227 44488 58413 73111 41069 15076 6128
16565 6128 -12314 -25705 -16741 1332 24640 52161 27358 -13565 -16383 -11999 -32081 -22462 4633
16552 4633 -2621 -14352 -22429 -39745 -34388 -5467 23373 35197 35784 59204 28610 23059 32307
16539 32307 29463 30079 59011 66408 47570 -659 -51503 -25174 -8566 -19012 -20906 -724 16490
16526 16490 6785 18447 25242 50301 37581 -16096 -39743 -21210 -2293 -20156 -3390 15926
16514 15926 29301 30485 -18411 -36471 -43705 -43864 -34809 -17405 -845 -31876 -47877 -46889 -30209
16501 -30209 -25988 1837 -14952 -3515 -7415 -12911 7257 6457 28320 -1667 1963 14420 33473
16488 33473 13043 -13838 -5769 -11810 -10976 12240 36671 24575 -24869 -46146 593 34192
16476 34192 14904 -287 -28641 -31746 -22167 -35792 -46416 -19347 3708 3891 -16059 -27484
16464 -27484 805 -19177 10132 15491 -16146 -14509 -18499 -16518 -23258 -36181 -47605 -37459 -45676
16451 -45676 -34059 804 15339 24609 20696 -4508 -15336 -18094 36623 56542 32951 21338
16439 21338 4154 -13344 -14413 -14414 -1912 14958 499 -8923 13297 28625 5415 -3371 -5946
16426 -5946 -13522 -30477 -26834 -4084 -1106 -1176 16177 15226 -9382 14231 21922 -1863 3116 9747
16412 9747 4627 3330 463 2470 22404 24494 39549 50884 19042 -32200 -42116 -52098 -22410
16399 -22410 5649 2118 -8189 -20154 -8254 -12118 -27227 -17557 -9574 -605 10029 33201 22853
16386 22853 -11006 -982 339 6924 6973 -13130 -15631 -21696 -32462 -11478 15612 -14989 -5670
16373 -5670 6097 3451 -8524 -22980 -36612 -44323 -49011 -62409 -76218 -45597 14322 16566 860
16360 860 1025 14390 1760 -16834 -2662 5423 19020 12172 10544 17754 -8138 -10492 -37339
16347 -37339 -34401 -19075 -9910 -23329 14494 66428 70643 33542 18793 -20625 -20499 -3383 9536
16334 9536 19736 15737 4361 -24870 -32440 -23911 -12551 -15156 -24245 -42151 -31367 -31827 -34033
16321 -34033 -38252 -55807 -30966 1163 18519 -13254 -16803 -21970 -18864 -32597 -60810 -80838
16309 -80838 -80241 -54152 -48133 -27517 -25564 -32053 -15313 24429 6565 -24091 -40953 -46808 -64049
16296 -64049 -51407 -48883 -54218 -27631 -11974 -43279 -55155 -16040 -14591 -12792 1502 3229 7104
16283 7104 -9867 -6335 6417 38192 37574 19962 -5519 -5492 -2395 15237 52259 48673 29089
16270 29089 26763 22625 24601 76741 93411 83140 51169 20797 16081 41878 27198 18972 19336
16257 19336 25960 24900 37619 27947 -6155 -16727 -29814 -57693 -49364 -26615 3308 7318 11394
16244 11394 22498 -6058 -10181 -20803 10997 42192 13220 -2757 24746 17488 4075 7987
16232 7987 27760 -14945 -41272 -40632 -47289 -17224 18418 9100 22539 29856 41990 13198 10504
16219 10504 -9835 -30423 -50662 -18502 12387 8449 -18095 -15103 -7997 -6435 -3253 12068 25080
16206 25080 -3048 -57144 -79117 -78037 -56615 -62788 -84562 -95131 -53017 3156 21499 25399
16194 25399 28645 21332 24641 5820 -10600 3046 16013 19718 4306 -8092 -2811 -10184 -26306
16181 -26306 -14170 18647 -8823 -16937 -83 -31832 -23102 16408 3239 -25044 -17790 -12818
16169 -12818 -13325 -31662 -22463 2318 34401 21656 -10140 -36435 -34376 -16792 -17556 -57283 -45868
16156 -45868 -16371 -42435 -42660 -27128 -1481 -5974 12442 28496 12924 12436 1887 21315 -9988
16143 -9988 -19040 -24600 -43131 -60284 -44520 -8537 -3839 -801 -14748 -35489 -30153 -12728 9145
16130 9145 28604 48567 30301 36653 26774 -5212 2663 12057 5511 14818 -7341 -8567 -5973
16117 -5973 7789 13312 -4353 739 8346 -7281 -9728 -38665 -33686 -12273 -34728 -39877 -19780
16104 -19780 -8719 -10014 33320 62701 35513 -7512 -2029 7223 17711 22724 16489 24649 24240
16091 24240 10598 9102 -3246 8800 15786 18639 22688 38900 18357 -23146 -47243 -31577
16079 -31577 -5537 1171 11985 10716 -5703 -25293 -35626 -14979 3002 -5851 1580 15885
16067 15885 7177 3791 4572 -29672 -48020 -33841 -17156 -14794 -30995 -18271 -4577 -7070 -8807
16054 -8807 6372 -3285 -20270 -13988 8573 31781 31593 27421 36049 33275 23563 49726 19671
16041 19671 -23325 -56064 -49947 -51775 -34587 -12482 -3640 4362 -11913 -1513 -18355 -27589 -37685
16028 -37685 -27476 5714 23515 -7574 -7026 -12910 -23327 -33171 -31268 -32735 -27497 -10523 -34346
16015 -34346 -13492 -4232 -1453 -19907 -10074 -36684 -65358 -59244 -40949 -35737 -27799 -12599 -5222
16002 -5222 -16006 -16006 -23557 -8368 10700 5716 -1522 -2136 -7447 12652 -4153 -16944 21945 42428
15988 42428 47070 25762 9865 -5476 -8200 -6533 -1193 16285 20595 16760 31284 21454 3598
15975 3598 258 15909 30732 37054 32329 32172 11432 -8257 -2473 -22205 -21271 -25215 -26433 -17322
15961 -17322 -9659 -15579 -7654 -13155 -403 -23800 -30492 -13834 -6138 15156 25682 26436 29528
15948 29528 -2702 -18050 -8914 -6895 -28455 -29111 3288 23851 24207 13788 39487 58439 39316
15935 39316 29572 35576 40602 42627 48637 15487 -14846 -41613 -24583 -12189 -44305 -57471 -36806
15922 -36806 -39374 -59565 -52258 -25930 5588 20274 44162 42205 8566 -18186 -15164 -19392 -4149
15909 -4149 -7873 -1733 7895 27890 24450 8280 -979 -4804 2571 13741 -22554 -43296 -34817
15896 -34817 -32322 -37663 -33132 -45738 -24690 -12893 1455 16743 8594 -11775 -39665 -34277 -30044
15883 -30044 -2386 22432 35412 15451 4317 -9764 -24194 11391 27177 28072 11062 12304
15871 12304 21382 49365 30495 14156 12691 -10596 -10646 5070 742 6488 -1208 -6945 -11955 12600
15857 12600 24745 4946 5805 25469 25469 27783 44213 25404 -7505 -11382 -8851 1540 2064 3249
15843 3249 -117 -19933 11854 -1525 -19174 26637 35433 9801 1343 -4740 -628 6070 555
15830 555 8612 17311 22332 10236 27861 42905 21276 9068 -14710 -18622 -27046 -5706 6233
15817 6233 2320 -13259 10276 -2133 -20185 -21352 -2188 -14597 12139 1934 -10628 -34343
15805 -34343 -19999 22046 50685 32443 -1577 -27425 -38119 -13021 8967 16837 43976 37333
15793 37333 51056 55009 41221 9981 -10363 -21856 -10870 -4794 -20059 3746 1448 -12401
15781 -12401 -5387 3872 14750 37927 23107 -6316 -14931 -742 -10153 -3102 17568 -24739 -40983
15768 -40983 -71941 -98300 -76222 -61902 -21534 15718 -7596 -22107 -20652 -22454 10375 3395
15756 3395 -32717 -23476 3269 12173 10503 28263 210 -38980 -25517 -17879 -30145 -19127 4619
15743 4619 13196 37989 21937 17746 30300 34308 33725 37733 52451 56711 34543 14493 36863
15730 36863 39951 3741 9068 18690 29751 39628 30608 10433 -22082 -42743 -63603 -67822 -46352
15717 -46352 -3969 16270 27301 33774 -9193 -17560 8668 22253 22080 13246 10480 10684 17638
15704 17638 12431 -10105 -31158 -34878 -20214 -36871 -31926 -32025 -26525 6244 27388 -5538 -38353
15691 -38353 -46680 -14578 -2382 -12105 -17458 -18038 -20935 -19385 -14304 -20203 -39283 -48134 -29537 -15137
15677 -15137 -25262 -35608 -32335 -54549 -25307 1659 2 -8427 -27207 -24140 8308 29664
15665 29664 35419 30978 22820 16458 -16238 -45866 -57669 -50465 -39872 -24848 -3973 -4783 -1169
15652 -1169 1340 -4391 -24823 -17457 -14265 -2149 19671 26940 7695 14764 6611 -2963 -10747 -31500
15638 -31500 -9058 -20254 -11092 -21068 -39302 -41303 -17054 -11466 -21835 -48904 -37265 -25208
15626 -25208 -28586 -25094 -6449 -5019 -10456 19063 23145 -5778 -19126 -21543 -10243 -26254 -31539
15613 -31539 -21413 -7622 -2455 -2974 9352 17561 7642 -18761 -8538 -11452 -47789 -61060 -31606
15600 -31606 -15010 -38008 -36974 -31834 -25794 -27521 -16786 -11907 -24930 -34781 -37819 -35549 -38253
15587 -38253 -41942 -48750 -37856 -20915 -21060 1662 3267 5264 16946 33789 8948 -25073 -21745
15574 -21745 -33536 -3392 15323 23469 45608 18970 -10116 -33840 -28549 -3909 7534 -4526
15562 -4526 -26574 -19602 -2322 47396 47494 36534 9827 -30761 -41413 -54454 -29947 966 6010
15549 6010 1832 7676 -7081 -56479 -76400 -47723 -33054 -54011 -51828 -39502 -42081 -33883 -30598
15536 -30598 -25408 -17253 -15149 -35072 -10609 -434 -3117 25080 31540 10020 8549 6502 5850
15523 5850 15925 23995 24978 17987 -2289 -9188 17055 35652 33915 40988 21767 6518 -21013
15510 -21013 -31969 -42107 -40823 -45436 -56320 -28182 -11205 -6872 -1021 4243 5489 -439 2286
15497 2286 -25325 -40913 -25313 -27181 -13329 9499 21835 8709 -5374 -22711 -55260 -63010
15485 -63010 -44115 -17174 -5001 -1994 -13944 -22972 -6181 -5011 142 34093 33543 -2985 -46681
15472 -46681 -58365 -63762 -59612 -47315 -39782 -11200 -2116 -16262 14264 18539 10354 29424 37880
15459 37880 34911 29873 36448 55433 26952 -16998 -14487 -12726 -22867 -23620 -9631 -19422 -16652
15446 -16652 -18771 -9366 -7841 -20125 -30170 -38520 -11345 12767 19442 44748 37287 31649 32695
15433 32695 3821 -5016 5431 5081 6821 15628 12215 -8427 -52753 -38915 -13777 -15595 -1117
15420 -1117 15117 3519 -14245 -28752 -39457 -48362 -54166 -55317 -59805 -36635 -35317 -41005 -12498
15407 -12498 -4177 14589 13916 -6352 913 43540 28628 26088 10192 -28269 -56677 -38418 -41564
15394 -41564 -47541 -40086 -24100 -8617 -7438 -29166 -40422 -40919 -20280 14530 -2491 -23217 -27101
15381 -27101 -41263 -43095 -63529 -93642 -71237 -47411 -25966 -1750 20821 16028 4585 -10854
15369 -10854 -20266 1340 -26944 -24281 -26427 -21823 -5733 8028 11996 21526 42703 21666 7171
15356 7171 -5634 -14752 -5996 7150 5455 14393 12493 15734 21867 4262 20679 39621 11433
15343 11433 16658 52919 66520 59380 17973 1774 1607 11797 18861 20560 5654 -25741 -53507
15330 -53507 -60572 -24780 -5182 -18635 -3241 -3110 -779 16245 -12548 -35401 -37249 -28378 -27433
15317 -27433 -27426 -32520 -33409 -48437 -63577 -68550 -66401 -54126 5773 1346 -6763 -1978 15462 28350
15303 28350 12131 -2858 -8129 -18158 -25713 -3960 6168 10385 9802 2984 -15044 -28174 -40611
15290 -40611 -30555 -10197 -15074 -14094 -25314 -6108 -14595 -19120 -7635 -130 -1476 -3147 -6824
15277 -6824 -21237 -37625 -27511 -8861 -17081 3576 34011 25152 4100 -4311 -22698 -22298 3076
15264 3076 16501 11113 8047 24261 37634 75219 59543 34186 15433 -8370 -4482 -15059
15252 -15059 -29778 -25919 -20255 -31116 -46364 -44258 -41139 -44544 -30649 -32624 -38112 -31736 -10344
15239 -10344 -9854 -18363 -15641 2151 4422 3250 -4244 -16333 -34937 -32610 -464 25276 21581
15226 21581 -14571 -62187 -51574 -52832 -32282 -11800 -7224 -21211 -8967 -15121 -53149 -55278
15214 -55278 -38512 -26460 -32477 -9441 6111 16688 2818 -9146 15747 35712 10511 -22527
15202 -22527 -7063 23188 2544 9717 20402 -2210 -23246 60 6747 -13478 -31084 -16413
15190 -16413 4570 -20098 -42193 -59988 -62849 -54452 -25922 -34752 -16522 8202 13691 18236 -2703
15177 -2703 2700 17006 -4530 2008 21504 -21 -9162 1104 -14405 -6973 -816 -13671 -19682
15164 -19682 -27133 -12850 -31541 -26066 -23243 7980 3974 -3925 2617 20172 26667 17110 -12446
15151 -12446 -38384 -31819 -7572 -1775 -9377 -33961 -22557 -13065 -2992 9576 28640 24663 19789
15138 19789 19336 39777 57428 60024 13185 -31625 -18281 12848 15735 13129 -14261 -40332 269
15125 269 36223 9948 -2956 827 2665 37363 31298 41214 40846 18370 5126 -24992 -30942
15112 -30942 -5546 -23611 -21843 5900 29957 31486 15598 -23156 -14386 -1648 -12282 -37323
15100 -37323 -39605 -27295 -26581 -20039 1313 27282 20023 17796 18108 6271 -8001 37827 60180
15087 60180 53603 10351 17632 54884 67998 46496 11481 0 23993 14307 16008 42743
15075 42743 21741 10716 16352 -7501 -22201 22035 35501 13488 -1347 22207 12731 14231
15063 14231 21234 17128 6976 -15521 -42469 -34651 -31572 -14596 -16035 -1488 11229 35637 42636
15050 42636 17179 -14 -24201 -36832 -20161 -20418 -34898 -52851 -54270 -64534 -32365 -40033
15038 -40033 -54984 -39320 -20289 8678 30053 17069 9716 33196 28440 6818 -3812 -2947
15026 -2947 -30040 -22388 -17307 -16002 -19446 -36573 -52872 -31541 -19813 -31406 -25464 -1203 17422
15013 17422 12310 -6523 -24424 -15038 -5711 -12913 -33248 -62752 -69737 -28864 -4111 -25041 -23748
15000 -23748 -28466 -17478 -11080 30724 26990 -20851 -17950 11720 18174 -1939 -11462 -15120 -15145 -262
14986 -262 -10788 22776 60415 65931 5435 -24463 120 -3374 -14748 -17673 -6763 -7360 -12311
14973 -12311 21153 38661 20310 -2049 -2153 -32048 -49611 -34607 -9837 -14841 -19831 -33451
14961 -33451 -11654 -6478 -625 18057 37113 14281 1726 12988 22899 39990 21856 6621
14949 6621 -7419 -29741 -27649 -4066 9818 -737 614 -12494 -22620 -6507 16568 24709
14937 24709 26918 396 -22445 -10377 -19874 -477 21664 17934 10542 16818 33392 48809 47000
14924 47000 29965 12254 3205 -10458 -36536 -55338 -24726 21130 13489 -4035 -360 -2964
14912 -2964 -9385 16421 22221 11194 8551 2738 25315 44120 56879 43929 45796 47329 36041
14899 36041 13540 5986 1346 3941 -13541 -30395 -23834 -5525 -431 10253 4896 11020 13671
14886 13671 588 -6103 -3702 -3372 -6530 -11187 -11752 19234 34682 37427 53472 64637 69222 45995
14872 45995 9985 -13942 -23984 -46542 -46688 -23563 9417 20779 12781 -20750 -53268 -61003
14860 -61003 -22930 -3094 8800 5937 378 -8496 -14387 5141 5102 24285 31552 17751 29781
14847 29781 36298 27693 27567 35059 36155 18068 4111 -2866 -18336 -29855 -18589 -15284 -26857
14834 -26857 -16401 6358 -3205 -7680 -10023 -26828 -21001 9128 9051 19369 11318 23334 42879
14821 42879 53152 32706 5923 -25401 -38506 -45533 -23885 -15557 -21165 -35402 -48876 -44062
14809 -44062 -46927 -39426 -9247 -14821 -2233 30563 48597 35611 4897 -23724 -36094 -13311
14797 -13311 -15327 -21155 -15678 -289 34966 14918 4066 12597 1880 9020 26797 8191 -28763
14784 -28763 -44848 -42396 -35541 -34175 -21689 -17463 -45003 -67315 -48343 -13849 6749 -5864
14772 -5864 -17608 -25924 -30235 5484 17178 12699 21083 63259 64845 52375 24186 29550 38675
14759 38675 16146 5686 -2300 1818 16529 37107 25716 13718 13872 40736 58260 59486 37897
14746 37897 17240 13423 24551 18835 7698 11754 35590 29022 7991 14245 24774 13194 10475
14733 10475 8823 1283 9374 -12120 -34246 -32910 -12860 6477 4543 -10327 -33980 -40138 2004
14720 2004 16201 2785 -13021 -12961 -12388 -13733 5631 5815 4893 15581 24013 26815 20626 10286
14706 10286 -16159 -8858 14834 32715 23362 -5565 3802 16887 338 -5790 -16593 -14787 -21774
14693 -21774 -54977 -50375 -21603 18336 19038 24643 17309 15647 27067 26213 1805 3838 12004 7139
14679 7139 -23832 -31483 10518 31772 2351 -10445 -2184 -19294 -55535 -32807 -34108 -43019 5830
14666 5830 44701 58942 43032 42908 41755 16337 514 9979 37337 57500 50439 46341 37447
14653 37447 31436 30991 5685 4577 -16802 -38305 -33823 -18342 -4830 6514 16580 27931 16788
14640 16788 -36627 -56347 -45245 -58615 -28723 -13351 -18895 3182 17910 -1984 -18293 -2731
14628 -2731 6746 34829 12032 -18592 -27367 -3222 18867 10367 -10331 -13472 -36922 -67053 -54801
14615 -54801 -43825 -27390 -14734 -23647 -17586 2696 37593 41895 11673 4563 -13816 -47415
14603 -47415 -47679 -24183 18557 -2739 5574 3299 17039 31403 15817 -10809 -29807 -49786
14591 -49786 -52837 -19094 -93 10453 -3247 -14398 -2586 6397 -6342 -3227 12245 22194
14579 22194 8800 -22767 -13076 12314 12329 -6088 -30963 -39793 -25726 -19009 -23926 -20188 -40770
14566 -40770 -30866 9548 30432 35972 37191 14979 16310 5702 3335 -22320 -65968 -64018 -42703
14553 -42703 -6860 1856 2733 6330 24074 12857 -1012 8151 32392 7879 -21756 -47295 -64318
14540 -64318 -91577 -83110 -41757 -26562 -26871 -20997 -42644 -14616 1245 -14751 -3339 -5057 -43659
14527 -43659 -50653 -19970 -21255 -11941 5242 -4093 -9668 25787 29019 -19309 -31199 -44135 -45638
14514 -45638 -36681 -31826 -47438 -9349 -7973 -43076 -46753 -237 20289 25584 28024 33402 20385
14501 20385 18379 20009 24986 7450 -5160 -6122 -5074 -650 21718 19978 8218 25883 8215
14488 8215 -9999 -10140 -36565 -69460 -52407 -14282 3657 -12368 -6042 752 14331 22820 12711
14475 12711 -13790 -21198 -39634 -81977 -101390 -79839 -30817 22798 12607 15617 11182 2992
14463 2992 11280 25395 16312 12271 38979 49269 41774 21027 -37881 -39779 26350 47186 22578
14450 22578 18910 30364 29377 38260 39962 31716 1012 -33884 -44510 -29909 -25178 -21087 12096
14437 12096 41909 57089 30771 -15674 -21357 -17914 -36682 -47214 -24188 -18482 -1472 -18657
14425 -18657 -38819 -28453 -10474 603 -10757 -27317 -19534 -23364 -28440 -46126 -63203 -21097
14413 -21097 3630 5579 7334 7579 -4109 -29050 -14735 8644 15510 30440 37333 16642 14493
14400 14493 23641 2196 -11923 -1998 34950 31143 -5137 -14311 -8685 -17066 -6964 -8926 22404
14387 22404 50044 17244 -9553 -4018 -11431 -7879 -2284 4440 -7619 -19077 -22670 -25858 -58822
14374 -58822 -63752 -32524 -13690 -37120 -46832 -15246 -10761 -18903 -2158 16936 -9292 -6995 -14346
14361 -14346 -26663 2075 -6814 -28099 -21469 -22294 -2964 -16684 -19802 21805 31 -7887 -18295
14348 -18295 -7506 -4406 -28430 -30572 -2957 12445 6625 18057 25781 -5963 -13540 7565 6098
14335 6098 -11031 -23349 -10801 -3660 -26321 -27320 -45858 -46239 -6132 16159 -16674 -25637 762
14322 762 14853 2942 -9959 -8752 5853 -1670 -2180 309 804 11199 -26148 -54113 -42262
14309 -42262 -16173 790 -12480 -25903 -40509 -36482 -8585 8507 -8258 -15980 24567 4406
14297 4406 -3098 766 14392 30744 2398 -5750 -4703 -14409 -16422 -19207 -5874 32523 41231
14284 41231 21838 -7903 -21191 -31377 -49028 -71950 -62777 -34136 -6976 -8075 -4977 -6655
14272 -6655 -2017 8923 4947 -3917 -8846 -16107 -29453 -25156 -13749 -18646 25738 19945 -1156
14259 -1156 -35871 -20616 -8924 -15291 -1945 -18807 -16471 -11024 -6516 1466 8813 -8254 -19014
14246 -19014 -28609 -51660 -91271 -63595 -45665 -20472 -8900 -10962 17566 15909 4878 -3750
14234 -3750 -17735 -21801 -36467 -40593 -51611 -55744 -49571 -44058 -47289 -35956 -15360 11760 28453
14221 28453 -3136 -31069 -36163 -3167 8992 4323 -902 -8607 -6703 -8052 -14182 -30995 -33470
14208 -33470 -33208 -49622 -28112 -12824 -33627 -32536 -17904 -21486 -12816 -20757 -19667 -13667 6472
14195 6472 23107 16185 39048 32350 2308 6934 8318 27032 23173 31682 23045 -6856 5056
14182 5056 25477 5011 -6235 -14496 -21850 4543 7167 -23102 -39438 -8631 18111 17438 2480
14169 2480 576 -16409 -16781 -24351 -47922 -40280 -18478 -14766 -11332 -13120 -8353 -4609 16089 21840
14155 21840 30626 40638 49500 30539 14922 11403 21041 5121 -9650 20257 9678 -3483
14143 -3483 -18590 -20146 -23582 -23614 -16259 12437 31679 -2668 -30286 -30756 -11395 -38800 -49641
14130 -49641 -43386 -35115 -27923 -22834 -11533 -10961 -18480 -24181 6276 3868 24794 13559 -14477
14117 -14477 -12430 -3696 22836 18351 -197 7302 13527 17476 -6219 -49496 -47234 -38090 -14208
14104 -14208 -6648 -20483 -21642 -5433 -25726 -30898 -25194 -12487 -19179 7325 34851 6358 -43086
14091 -43086 -39603 -26791 -22359 -17974 -22152 -19844 -11213 -11545 -11982 -25892 -38487 -20148 16813 43604
14077 43604 47319 37777 32481 45961 56011 11054 8891 22959 4749 -15573 -21617 3708 -3641
14064 -3641 -772 1261 -10337 -4436 13137 4232 1938 -7683 -13630 9652 21336 -41 7016
14051 7016 29032 440 -39897 -48834 -55058 -50404 -15198 2982 9290 20365 25001 6528 -18979
14038 -18979 -12524 842 -252 -8472 -25471 -30259 -21616 8053 13804 18237 -5339 -13797 -21808
14025 -21808 -28656 -17015 12811 -2234 -1328 -5242 -6950 -5410 -11375 -8630 13923 -7605 -28933
14012 -28933 -14629 -22314 -19450 -40234 -46215 -42219 -35871 -7355 -4811 -19055 -23248 -49135 -38457
13999 -38457 -2321 25982 30601 8408 6941 5543 9025 -24465 -44870 -15514 11183 29076
13987 29076 57980 53978 15486 -6454 -14905 -25713 -4332 17640 3428 -1637 36874 52119
13975 52119 38461 23289 7008 -14922 2197 28133 18927 12776 -7455 -26608 -2116 22922
13963 22922 39414 14021 -9309 -28078 -31163 -17952 -38094 -57715 -37634 3566 -1761 -5822
13951 -5822 8856 30379 35879 21515 -1115 -55859 -57260 -25049 -13058 8206 25731 -1765
13939 -1765 -13405 -32532 -40048 -29814 -4790 -1926 6286 -10764 -17732 13961 24527 14250 -3463
13926 -3463 -8658 -5223 22763 35516 38948 39910 39603 21956 -687 -4575 7880 5017 897 -1249
13912 -1249 -162 -14629 -32066 -36235 -11361 -7906 -29854 -32775 -18042 24884 36870 33806 22946
13899 22946 -5108 -17090 -5450 7603 -6345 -12924 -37816 -21932 -5823 -15245 -16495 -41390
13887 -41390 -26111 -8567 -14175 -7372 9437 2688 24676 -2996 2680 104 15836 35840 45071
13874 45071 36848 27597 30713 21122 5446 -30038 -18727 -7264 2734 -18774 -32015 -19069 -7697
13861 -7697 -6614 -14486 -14639 2902 1212 -17016 -17566 -17478 -11870 -19237 -32622 -12967 -10147 -17252 2173
13846 2173 10175 -571 2091 3251 -360 1372 22471 12364 -24859 -40788 -19516 -22770 -25943
13833 -25943 -26136 -16094 -32776 -32666 -7281 14206 20142 1339 1065 10986 4493 5731 6225 13635
13819 13635 26780 32440 5561 -21129 -16169 10487 13206 -12193 -28446 -20307 5665 22973
13807 22973 13137 -6118 -4993 -5094 -23289 -11113 -16896 -39821 -58163 -53480 -45048 -34854 -5695
13794 -5695 6616 4071 -1903 8809 27897 46611 32798 20394 4566 -9806 -411 12659
13782 12659 -3350 -14317 11666 25417 8465 7844 -51 16134 29717 32559 8884 11001 14410
13769 14410 -15725 -38763 -43362 -32213 -46176 -15122 9092 5868 15545 11377 33021 53946
13757 53946 65829 53939 12333 -19155 -28817 -13898 16205 6253 -1169 16183 1412 -17293
13745 -17293 -15781 -31287 -52314 -44812 -15415 -18745 3144 -4728 -5041 22409 13359 -7965 -29719
13732 -29719 -45660 -40507 -8710 -23600 -40105 -32000 -43941 -29968 10659 30574 995 -18112
13720 -18112 -13813 10217 23945 11730 19640 3541 -24861 -16792 -5521 23470 58730 62542
13708 62542 50481 28618 12029 -4621 11502 45367 18770 -6646 -16615 -20749 -6869 -42400
13696 -42400 -40063 -29607 -21292 -26744 -10885 -11456 5109 27618 12469 -6549 -6948 9372 -1726
13683 -1726 -20801 -34042 -11089 -6556 2783 -26476 -45023 -45876 -43879 -42636 -39388 -37997 -16066
13670 -16066 3231 40559 33592 32653 30312 -3919 -49131 -61312 -31980 -21232 -40311 -40693 -33662
13657 -33662 12412 27746 23394 10768 3374 -20537 -33007 1578 17626 34405 25152 -3255
13645 -3255 -15915 -598 34296 46283 20474 -8594 -4303 8011 3132 3288 -12631 -21295 -5644
13632 -5644 -12452 19211 9605 -26340 -28876 -17875 2974 20922 4067 -24422 -29590 -25148 -34867
13619 -34867 -67879 -73772 -47367 -25869 14429 17007 -4262 -8949 -25397 4977 40146 30716
13607 30716 6750 -14663 -7450 7278 27580 23341 9726 17183 -3068 -35627 -45026 -6750
13595 -6750 7297 49769 71173 37962 2054 6128 22605 24677 23213 15159 9654 -583 -7552
13582 -7552 -15488 -16656 15060 13128 20706 -262 -33789 -30993 -5946 19521 25741 17161 -13499
13569 -13499 -31361 4380 24947 18262 14766 27973 51601 53334 31495 40926 43867 23775 2397
13556 2397 -33332 -37607 -7736 20864 18679 -6294 3287 16260 17720 5357 -902 9112 8792
13543 8792 16980 43106 66078 47710 27849 23523 7011 -12428 -25136 -13690 -5060 -4823 -18433
13530 -18433 -40017 -45624 -38518 -8679 5819 -26783 -64102 -73527 -70634 -74406 -93840 -41300 -30901
13517 -30901 -27950 -14627 1222 -3273 -11682 -9942 -7054 -7010 9870 10575 -2004 30367 12839 -17485
13503 -17485 -139 25824 21831 1914 -9010 -23282 -46225 -51711 -52449 -29253 7551 24789
13491 24789 35080 16888 10277 19501 37329 47535 13388 12373 25692 9290 4461 12051 -10126
13478 -10126 -46844 -73412 -76952 -52118 -28672 -18372 -4271 -15449 -15722 8382 24583 24910 1931
13465 1931 -18501 -27118 -26038 -9545 1465 9635 -9624 -29863 -28708 -32935 -8587 -7854 6720
13452 6720 -9276 -51907 -51464 -39945 -11961 -2833 10568 540 -20710 -12103 673 -12029 -8772
13439 -8772 10076 30588 50535 24885 27894 34645 15168 25049 31083 12434 28454 35931 11022
13426 11022 -12941 -8324 -6639 2798 8945 14573 5945 -27142 -21641 -6857 -8336 14517 -920
13413 -920 14377 15502 10476 3277 7175 6516 -17298 -23017 3304 18855 4276 -319 25195 558
13399 558 -12917 26718 28873 19998 40035 25196 13468 -3386 -10072 23144 -1452 -22373 -54234
13386 -54234 -44429 -3633 23111 9184 -27297 -34339 -33761 -5753 1861 -34439 -22874 -3058 162
13373 162 24808 2535 -23181 -27715 -5176 -8604 -2434 -9443 15339 41580 47682 13973 -25050
13360 -25050 -41919 -53210 -30625 -28246 -32975 -16795 -25094 -27529 -30383 -20556 -14727 -9620 -15373
13347 -15373 -11663 11699 1874 -1400 -6879 -16538 -22989 -13324 -8815 -22042 -23371 -614 12669
13334 12669 9834 4239 -13311 -27048 -3454 8481 39222 51650 23614 -3492 2757 14676
13322 14676 3136 -1480 -3448 -3526 1814 -4565 -13150 -7572 5536 1208 -17443 -14722 -3176 33
13308 33 -13738 -41125 -17543 -16255 4711 2370 -7749 -18187 -49158 -54853 -12323 37603 65964
13295 65964 65893 48617 30624 25708 9351 -21502 -8308 23565 27012 16239 471 -21366 -9389
13282 -9389 18486 16604 2206 10099 10235 -29461 -32586 -39988 -13468 15212 11492 -2739 -12331
13269 -12331 -3696 500 -2248 -13516 -20893 19405 24773 469 2036 22145 27075 43427 44795
13256 44795 7272 -7797 4987 -3723 -23469 2859 27679 28544 -1656 -2358 26990 -3824 -32400
13243 -32400 -48528 -17132 2038 18099 32698 23458 398 -11956 12568 24862 19996 1567
13231 1567 -25413 -9453 8733 -27412 -43039 -38426 2142 21002 9471 17464 13782 21418 14835
13218 14835 -7841 -15883 -4157 1594 23824 11569 -24303 -26961 -25657 -2918 -11517 -30923 -26811
13205 -26811 -15677 9702 33442 40451 6712 -37985 -43725 -7108 19296 17416 18298 20052 -6502
13192 -6502 -38194 -58373 -76214 -41523 -31318 -22767 -10137 -17701 17045 34911 16867 -11202
13180 -11202 -11858 1501 -3487 -19995 -23514 -23 4376 -3035 3236 23304 22415 -20362 -11989 11347
13166 11347 10019 4096 -22509 -30206 -28817 -33975 -20845 4590 18980 16766 23054 50047 59165
13153 59165 68935 82603 92642 71797 48583 44179 23658 15199 22762 -9703 -14513 -19076 -4091
13140 -4091 15872 20570 18897 -4894 -21835 -13504 -11187 2271 3473 2686 -16083 -36255 -33004
13127 -33004 -12906 -3001 -5719 -20349 -17656 101 -15998 -21895 -30100 -10492 35574 69806 59787
13114 59787 34403 35147 23641 27800 25593 41901 30365 21885 23303 7536 -34147 -13987 21959
13101 21959 41047 71888 63911 63560 27577 23589 31387 47891 40277 -1908 -2109 -5988 -883 -3199
13087 -3199 -24868 -41114 -34325 -14574 -5357 461 16891 27702 24480 23529 34146 33416 -6373
13074 -6373 -4858 7871 679 4927 11502 14868 19790 33326 25397 13619 1820 25497 48279
13061 48279 23687 13288 13299 24274 33847 12320 -7325 -28247 -24757 12628 30855 11019 -15188
13048 -15188 -24279 -16565 -25273 -29927 -50972 -35051 -428 338 -10726 -25657 -2267 22631 23549
13035 23549 11320 432 -18817 1774 -3942 -7536 3565 -9974 -2986 681 -21584 -16740 -8454
13022 -8454 7223 114 -10409 -41528 -42481 -25697 998 -17039 -24786 2629 -4936 -15890 -29399
13009 -29399 -11234 17360 -3606 -3170 32355 61888 41632 28685 27870 29552 21857 10689 29432
12996 29432 24324 6847 27572 17635 -5815 18512 14285 21275 27712 27730 45563 68484 40914
12983 40914 3675 -8452 4836 2565 -8759 -8007 -2594 4993 13925 4504 17564 13417 6079
12970 6079 -1588 -6395 -3402 -28890 -13256 -4769 -2441 3393 234 -12242 -44499 -38000 -16883
12957 -16883 -2688 -1164 7130 -10996 -4464 -13661 -15754 -9712 -11790 -23885 1428 21397 27462
12944 27462 24399 36226 22297 25454 17212 26861 28255 53291 57021 11558 -7395 -6533 -20064
12931 -20064 -19338 -1293 -15699 -31219 -17861 796 15318 8622 -4623 -19061 -23282 5108
12919 5108 21939 60815 49262 4414 5343 8555 -11919 -10340 -6563 -2218 -7833 -10381 -16291 -30026
12905 -30026 -1644 31900 52193 41661 61229 63256 46846 31556 55663 70334 41256 32757
12893 32757 23871 28597 -5972 -3642 5557 -209 21981 19639 12637 15193 -1864 10874 41846
12880 41846 14854 -6054 -13043 -24744 -31398 -11929 2732 10564 -7107 -11738 1662 1322 1320 7678
12866 7678 13562 15280 27108 21461 5276 16676 12620 13384 42192 23357 3425 3671 -22813
12853 -22813 -37709 -40331 -43064 -43375 -10908 12968 -11661 -17589 -4053 24868 22862 5685 6755
12840 6755 26437 33950 45096 46150 52631 53531 26235 12584 15527 -1768 -6081 -19962 -35867
12827 -35867 -11143 7253 7705 -15787 -26042 -14737 -11582 -10648 15473 4133 -433 22969 28029
12814 28029 21029 16043 23325 3515 -20050 9311 32675 37203 44629 47961 22553 -6091 -5305
12801 -5305 541 8602 -549 3989 -6166 -30949 -35533 -46678 -29635 -32915 -26629 -23271 -22452 -17857
12787 -17857 -25053 -9269 17169 24019 -324 8616 21561 21627 -337 1692 -867 474 5155 34262
12773 34262 42198 25516 12258 33059 44646 43774 22952 9066 15590 30066 17049 9805 -4792
12760 -4792 -6598 -18942 -15931 -19629 -6305 32258 33293 14707 25879 32359 23498 6690 -12792
12747 -12792 -22666 -2000 21391 9656 15531 22200 21250 16240 31755 32581 22949 6711 15894 23969
12733 23969 9052 12224 8191 386 -7893 -18661 -42204 -31693 -31812 -41892 -25002 -183 3612
12720 3612 -4624 -9026 5029 -4348 -7144 10602 3214 14383 11329 -4536 -13422 -20829 -7665
12707 -7665 -8831 -20046 -21543 -16576 -36195 -14787 16231 8998 -287 -4299 7827 23665 29776
12694 29776 -757 -23584 -25531 8694 20005 45095 73240 77989 49160 47381 49073 38978
12682 38978 26142 2626 -37444 -35105 7636 22483 31151 35909 17452 4879 -34436 -36088
12670 -36088 -24889 -17521 -22056 -15677 13213 28130 26426 22213 32767 1791 -13301 -9858 13691
12657 13691 37470 14988 -16827 -23636 -7551 10644 180 -16669 -16668 -12699 -4501 3103 -11147
12644 -11147 -23699 -2959 -9368 -10696 -3132 8979 7851 9619 -2932 -5950 6157 3054 16698
12631 16698 57266 66236 27878 24869 16498 -6533 -47486 -75829 -61294 -39793 -47641 -16954
12619 -16954 -8400 -9942 -5838 4320 10898 16732 3741 -15314 -30088 -32886 -13425 7280 -7347
12606 -7347 -32328 -13451 -321 -10570 -20822 -1799 -392 -15495 16503 22884 12093 2401
12594 2401 -22644 1755 -3793 -22417 -14670 -6597 4950 9762 -15169 -11348 -34137 -40779 -18051
12581 -18051 -5433 -1196 8813 1769 14705 9183 21410 25028 14804 -4467 5076 25586 -4375
12568 -4375 -5652 -3638 338 8059 12836 4628 -5350 -15226 -2432 5907 -2250 -6878 -13666 -32877
12554 -32877 -36416 -19629 -36351 -45383 -21673 20022 7287 -28016 -42024 -23300 29165 45522
12542 45522 48643 28705 -22488 -53801 -54136 -44151 -34770 -6606 26190 18893 14634 1556 -13994
12529 -13994 -284 25694 15472 18176 20484 16175 14008 -22891 -44317 -48204 -22027 -11854 275
12516 275 -5337 -18880 -23595 -27794 -39440 942 11076 510 4674 4512 -8731 -27287 -24201
12503 -24201 -10525 -8432 14390 10863 -8383 -23583 -12088 22841 42682 -9965 -44246 -32564
12491 -32564 -26532 -13128 -734 -12136 -23340 -4189 14268 13652 564 -18791 -24870 -39152
12479 -39152 -32867 -3352 267 6424 19608 6654 18288 19365 1157 -43473 -28775 5038
12467 5038 -7615 -42954 -42892 -20113 -10452 -27752 -13193 20865 15950 3261 4715 13916 21888
12454 21888 6180 -18843 -17676 -3024 -2650 -2763 4948 10092 -9280 -27867 -5265 -6602 -24998
12441 -24998 -22040 -10798 -12291 -5603 -1380 8474 11865 3779 -12618 4027 -5413 -19346 5921
12428 5921 10593 -4941 11530 3642 -9916 -10974 -18379 -34495 -58648 -61682 -71050 -59230 -32741
12415 -32741 3330 30673 16735 7972 16846 26911 35589 22709 5429 -20688 -22608 -17236 3765
12402 3765 -6299 -5208 -7361 -8070 -8973 22577 30970 20807 20277 28352 46303 32675 20201 14395
12388 14395 29721 34122 36449 12820 14457 4043 16408 6570 14679 33111 15743 20451 35486
12375 35486 8651 2161 25665 12425 -4013 -21414 -21010 2839 -867 7820 2946 -8315 -10954
12362 -10954 -45604 -43697 -47828 -46279 -18015 -22637 -28615 -36351 -3237 4662 -33873 -74661 -69321
12349 -69321 -37263 -33545 -3630 9262 24111 -7022 -44591 -3234 19232 -7739 10294 10438
12337 10438 -7707 -16106 17138 41460 -653 -35749 -17178 -24134 -14032 3893 -7550 -43725
12325 -43725 -22495 5141 26812 11547 -159 -14251 -40488 -35137 -237 18507 29379 36182
12313 36182 51505 37464 15008 18309 6802 -35158 -49528 -17524 -2710 7622 1538 11118
12301 11118 -5847 -21067 -14483 -32057 -31205 -32648 -26087 -11345 2728 -13189 -29166 -55528 -51029
12288 -51029 -47827 -13152 10701 27560 16387 -3683 -20357 -11498 -14495 26003 63553 77485
12276 77485 49388 24974 25421 36341 31426 26218 16868 17056 1433 -10090 24351 35015 19841
12263 19841 31348 32197 32471 15739 22053 18547 -6690 -19530 -13122 -5701 16162 22738 -10417
12250 -10417 -4074 23677 30291 -13725 -13513 18433 42525 32013 13040 49231 30513 -5783
12238 -5783 2830 11979 23975 18124 2720 -18253 -23496 -34436 -32399 -28311 -24482 -18213 -7722
12225 -7722 -19745 4206 4041 -15845 -38658 -52044 -47881 -22493 -9322 15180 4568 6378 4551
12212 4551 -6190 1215 -1486 -13121 -22692 -38711 -42743 -10151 9510 -648 -31150 -38692 -150
12199 -150 34769 36161 24679 4445 -16002 -33562 -17348 -5995 6755 -9315 -9243 -19161 -6199
12186 -6199 19848 -13843 5025 19049 -5029 -7903 -7362 -23370 -2380 16658 -875 -13198
12174 -13198 -4364 -4424 3638 -3711 -24111 -45444 -28343 -28436 -14032 -4131 1179 27218 14061 33731
12160 33731 37633 36223 53913 13466 -3874 41393 58734 33948 21605 31436 1879 17249
12148 17249 -10144 -11184 -31012 -20157 -20956 -26979 -40972 -76 44623 31724 -3890 -16533
12136 -16533 -12462 12171 16540 21836 -7460 -22417 -27670 -1612 10877 20799 34863 15780 251
12123 251 -9111 -30565 -18347 -4754 22579 29085 6445 24339 2062 5268 40483 33860 10273
12110 10273 -328 -12692 -5874 32282 27674 16789 -15591 -8089 26005 30689 23831 26900 15429
12097 15429 -7895 -18084 -23617 -19159 -22242 -7864 13098 29155 37361 51596 24441 19849 20246
12084 20246 16727 26741 38780 29248 2988 12503 54661 56370 26074 31330 425 -25908 -21463
12071 -21463 -5812 -2356 -12102 -2028 28748 31229 32807 23605 -13464 -41771 -55723 -58082 -53458
12058 -53458 -33066 -26130 -26836 -10961 11444 8389 -3691 -18425 710 -2073 -31094 -67539 -35637
12045 -35637 -11453 316 18011 6566 -662 -6141 1675 3488 -18916 -12743 -9745 -27439 -21278
12032 -21278 -16755 -31437 -19515 -757 7843 15957 22355 -16231 -25864 -15946 13053 45320 44355
12019 44355 35298 -2809 -9681 -12932 -19239 -28099 -21661 5805 3702 11326 -4679 -11623 -14225 -534
12005 -534 -1533 -16046 -17517 -21050 3614 20626 7066 2509 -4907 -4588 8592 3331 -28535 -28912
11991 -28912 -7347 879 17273 26715 24652 25135 27414 20122 44960 41980 30784 37691 21096
11978 21096 19628 6001 -10263 -976 -26112 -26598 -29589 -22257 -13948 -12507 13425 38403 51510
11965 51510 53138 52300 44583 29518 20587 13116 -8782 -33658 -31574 10448 31839 18167 46560
11952 46560 42316 51867 29302 23801 50881 62869 42444 34301 41355 26020 -25207 -13906 1199
11939 1199 6157 -10523 -15335 22200 48185 74864 92633 77944 31581 -16982 -18001 -777
11927 -777 -5475 4832 7868 -13204 -197 3201 7912 15044 30540 36880 34931 34811 7196 -5251
11913 -5251 17297 42093 24601 -6213 -10220 845 -8586 -10372 7765 -14800 -34884 -37017 -21899
11900 -21899 -12999 -8285 11763 26097 9398 -26222 -44232 -37460 -10422 -5707 -16706 -6073
11888 -6073 -19985 -23144 4382 14716 22771 31444 21260 35233 57623 62489 39353 14144 3962
11875 3962 -2781 -23474 -21441 -1568 16582 20933 -1084 -4789 10732 28438 7737 -11681 -20755
11862 -20755 -18480 -18140 -14704 18354 10653 6204 4725 8965 14124 9090 -9813 -11678 -8280 -4297
11848 -4297 1519 2597 5498 21558 29621 30046 29623 52302 47255 37054 45531 32955 -4370 -11408
11834 -11408 -18813 -42847 -28292 -773 21263 21635 14051 7590 -19962 -30724 -42489 -39530 -34963
11821 -34963 -38324 -27528 -4888 -997 19596 11872 8863 4229 -7681 -26260 -30884 -26469 -678
11808 -678 12084 9978 24960 27187 23744 10195 -2624 -14318 -28819 -30285 -14792 13281 3317
11795 3317 8002 21477 24356 42616 47563 35867 21154 23908 46285 57110 55948 68527 48055
11782 48055 -2295 -16513 -13223 -13567 -964 1795 -2429 -17917 -10753 -14008 -9583 -20651 -24329
11769 -24329 -14053 -7779 -3059 14009 12498 31413 40336 51515 83807 77704 39907 33916 14824
11756 14824 19795 3808 -9932 -43570 -54757 -27236 -3232 22331 25524 17309 -16110 -857
11744 -857 14035 10110 -12815 -1228 25869 47852 40358 39185 35120 26573 22170 2962 -16671
11731 -16671 -17873 -26105 -17416 4844 29396 36179 31103 29335 29156 34690 26838 -5302 -29347 -20738
11717 -20738 -22173 -65478 -66911 -9229 -6702 -22512 3334 16322 5762 18755 29357 6135
11705 6135 -21356 -43039 -32709 -17426 -3637 -23067 -17409 6645 32435 52119 56480 15297
11693 15297 5949 18092 19607 25926 30503 49501 57190 17338 -22667 -16199 -12053 -21140 -18437
11680 -18437 4377 7192 22705 30674 29409 25124 45244 56437 50978 48750 63337 42030 36041
11667 36041 44244 33570 32712 25753 -4959 -20606 -552 22401 51872 39832 27739 21856 27379
11654 27379 45164 49163 65124 58533 36537 11347 -2763 -4333 22884 36879 48480 43655
11642 43655 21053 -4416 -9365 -4221 3832 26516 1891 2493 -10701 -23709 20024 44053 78617
11629 78617 88962 66377 32739 7099 -35002 -38144 -6614 18729 33852 32013 24013 25735
11617 25735 3195 -4344 -274 -10789 -14956 -8616 28237 31308 18833 -2473 -13693 14337 27525
11604 27525 -5038 -17992 -2995 -24684 -42874 -40517 -61863 -55969 -15978 14704 13488 1218
11592 1218 10039 35518 39835 62814 63788 43633 13004 -19862 401 35365 33455 22282 -12021
11579 -12021 -32984 1128 8851 -19147 5205 31528 44524 27846 301 11397 38150 70260
11567 70260 49977 28980 22097 34106 39093 23233 23428 38260 33382 26839 38178 65430 41657
11554 41657 42749 42046 47211 62332 56359 66005 46672 44836 38600 52867 45860 23251 11836
11541 11836 15296 10459 10139 9227 5203 12662 7021 201 17327 28735 21923 10798 -11960 13916
11527 13916 22120 35629 61659 62657 48376 47385 38322 30675 20389 39119 58211 63197 51825
11514 51825 42209 40004 31303 34754 58085 53985 33647 37545 53993 74690 39782 -721 -2441
11501 -2441 -2027 27397 45645 64840 60551 57520 53090 30221 31952 57897 82293 92406 70874
11488 70874 56893 72306 47784 43087 38039 426 -28163 199 -11872 -9844 -3265 -4908 15502
11475 15502 31569 14271 818 27213 17741 17809 26310 31886 38419 19277 -13659 -2860 -25255
11462 -25255 -33446 -17259 -32860 -57913 -25538 12168 42273 21813 34865 41827 78059 89353
11450 89353 85387 57774 58165 23132 -20404 -29658 -8702 17241 2459 3001 30407 46182 39319
11437 39319 29050 60110 51327 42206 17770 14533 16292 22399 30977 15950 11862 10984 8939 16998
11423 16998 24594 32813 48823 37403 35932 42331 50851 33176 22738 3139 1311 -15013 -13455
11410 -13455 -19720 -1052 13501 9284 6854 -17845 -43345 -40256 -19192 11602 22934 43785
11398 43785 39181 14799 26851 23429 41470 29653 30033 55714 47940 31679 33923 36929 42173
11385 42173 31521 20362 28895 20914 30637 76688 107436 90338 56351 38833 34489 25076 3775
11372 3775 -3218 16117 52560 49679 54046 70721 46879 10945 4210 27846 36530 17070 -24192
11359 -24192 -13821 28929 39764 42298 26518 39730 48542 26050 9278 17429 10929 7457 1399
11346 1399 32812 52500 50384 42847 33109 19182 15753 26132 27296 3797 -13851 -34021 -2970
11333 -2970 32396 9389 13362 45175 28602 11208 -7950 -4677 6541 48303 58350 54059
11321 54059 85447 97025 75333 84584 96350 102659 50258 38221 64539 63321 43731 47092
11309 47092 30143 27246 10321 24420 39808 31999 39895 36119 24957 13295 23548 14752 -5771
11296 -5771 -2990 -17112 -7252 3721 7929 911 -9529 14015 20261 -2316 -17062 -5898 20547
11283 20547 35003 49342 49469 33793 28948 24490 12925 3745 -1123 13952 -3897 -11759 -9152
11270 -9152 -12156 -18677 -22350 -19181 18149 65704 91685 80575 44633 26228 13379 10165 45843
11257 45843 64481 61150 66689 76884 66367 53243 52324 62465 72127 61182 29541 30981 24230
11244 24230 7130 283 -8556 1741 11567 6252 -12459 -21239 6930 35696 61139 67365 68634
11231 68634 76654 77007 62092 59939 82164 61973 21438 22586 37777 10293 7417 6721 18062
11218 18062 32332 15378 32976 30169 16246 -21537 -56449 -40984 20932 45990 14892 15481
11206 15481 942 5318 1764 12563 39756 44570 30644 49392 64675 73925 84996 84170 62555
11193 62555 86685 94627 90418 78824 63595 37712 10474 26940 62206 58413 57116 65354 71862
11180 71862 81995 92870 105738 131802 141427 168078 194616 237030 261619 272989 303164 330267
11168 330267 358447 457702 653372 938219 1349909 1822831 2246380 2556926 2636611 2462336
11158 2462336 2133487 1719099 1286286 932863 679986 522363 414053 315966 239332 196544
11148 196544 187204 136210 116161 125030 126879 100083 89887 63545 43562 61074 100038 100188
11136 100188 102332 95408 64293 44439 55685 64297 82595 89424 72768 58883 33243 36979
11124 36979 60262 72019 77856 83733 91979 65798 47680 67365 87789 100973 114886 99989
11112 99989 77303 96069 93428 59161 77982 107420 98444 79780 68344 90759 117159 116224
11100 116224 99783 63967 56802 69003 66177 52913 37315 56675 65792 50804 11929 -16081
11088 -16081 -25604 -15061 25902 60639 62762 81184 97881 90572 71051 60734 47815 57744
11076 57744 65893 57486 90891 99027 99552 112008 104014 93438 91413 87905 99754 109320 101080 72104
11062 72104 52950 68912 78471 73527 69668 49942 30070 22036 36366 16351 16981 33478 15327
11049 15327 33678 25679 -9882 20735 45922 52432 69127 60987 36723 23683 505 7621
11037 7621 13399 21476 46732 73781 79366 62739 80273 100284 99629 104030 114993 125708 134038
11024 134038 157308 141673 122217 101256 68101 54460 80103 78967 74791 79771 117142 128915
11012 128915 132899 151006 154406 157891 171397 140916 126572 156603 210162 244752 226195 187006
11000 187006 208984 224887 210648 180452 187862 206660 183416 172430 177721 182182 169726 137517
10988 137517 138349 129450 95150 81304 106166 113149 120646 126037 142248 167964 158105 163486 148490
10975 148490 126108 111870 92407 96942 95519 101088 126715 131018 119168 107089 112347 69866
10963 69866 48580 79745 114770 137618 130694 142269 147715 144994 142749 129849 127485 149559 179385
10950 179385 160717 176483 169311 164480 169563 179588 177194 141872 135998 175974 182069 139358 103536
10937 103536 95246 120866 158903 172006 175282 170426 155219 165262 175427 158883 147667 154398
10925 154398 140737 145724 150096 133766 98601 80112 73546 98747 130739 176573 178308 179377
10913 179377 209884 243222 250745 236551 193678 202817 229974 213523 234931 262897 290582 284819
10901 284819 282538 301933 334665 340928 312043 309490 333407 348017 350863 349455 338655 313744
10889 313744 311845 284820 284565 313382 338036 381833 442631 449458 518890 548971 605417 686910
10877 686910 828876 993754 1171478 1315503 1332951 1134110 849727 540427 246916 138614
10867 138614 163456 202092 222095 236043 249114 264130 277570 303893 295959 303950 288206 273260
10855 273260 245011 248681 291682 345606 419438 445191 452760 488276 510070 500377 483309 480238
10843 480238 496051 523334 571748 583551 564144 517697 533987 531483 540374 538062 527753 522773
10831 522773 516651 527646 534143 540598 576395 629029 670426 735935 749085 737906 745046 778195
10819 778195 822751 887595 933955 982566 1012671 1031916 1005004 995880 1010779 1021603 1017735 989373
10807 989373 1003610 1012204 1017465 1040262 1052775 1103403 1135206 1177973 1247617 1317250 1409176 1521762
10795 1521762 1616343 1695230 1780276 1870089 1953382 2045729 2140530 2231455 2341510 2469622 2573492
10784 2573492 2696489 2851147 3032958 3220914 3419277 3630974 3872358 4135521 4439886
10775 4439886 4830613 5279350 5795618 6511974 7433110 8497453 9678125 10922356 12090343
10766 12090343 13119979 14115315 15202574 16582963 18455253 20958591 24235079 28338256
10758 28338256 33377298 39689230 47607042 57922729 72182616 93123043 125930995
10751 125930995 178733278 256328669 340380677 414129910 468068973 473291283 433010636
10744 433010636 366852885 286354070 208333603 147739625 106498108 79570718 61610247
10737 61610247 49153965 40034979 32936168 27296191 22844259 19311595 16560889 14516830
10729 14516830 13006834 11950618 11269883 10789044 10404115 9954003 9315984 8532969 7675011
10720 7675011 6796642 6015650 5380087 4903170 4509871 4155484 3834702 3565064 3316297
10711 3316297 3089956 2916711 2763224 2629204 2496811 2371471 2262791 2130096 1985560
10702 1985560 1886427 1808905 1727796 1668262 1640499 1597249 1542887 1501264 1489009 1471681 1422190
10691 1422190 1350539 1266948 1198133 1121062 1099756 1098559 1045748 985956 956124 926056 871149
10680 871149 848761 817543 793699 773250 779086 794155 810922 761568 743882 722686 692450 691234
10668 691234 692669 699205 716118 708240 680365 677491 667534 627755 605430 550140 495544 471004
10656 471004 442582 416846 418427 381127 333356 335156 375611 360715 368104 352174 371140 378696
10644 378696 356328 347217 336837 354601 383597 405210 421878 428030 400962 362293 363948 396701
10632 396701 399265 383531 371883 410072 446430 494791 572940 656685 731156 763276 771918 779418
10620 779418 679891 582470 523167 425868 339197 319373 306637 289691 275059 267629 231539 208475
10608 208475 192290 177751 174288 142837 90785 95158 94317 64356 57412 57594 61379 61306 30931 -7717
10594 -7717 -25138 -22778 13000 46503 51238 18989 28784 64838 98968 129905 139032 120613 127319
10581 127319 122082 121137 92476 101167 123567 147707 142775 172114 188894 154834 131076 160539
10569 160539 183729 179684 156548 153035 173017 160238 138103 142926 155841 125470 98575 77834
10557 77834 52738 38382 64294 54867 49469 59301 78113 98042 115879 116008 113426 89539 65803
10544 65803 63478 90825 98476 118653 130795 108697 72494 45837 43800 56599 63412 92761
10532 92761 97192 93282 81889 90379 113035 85714 64906 72272 57671 49717 27658 11660 24260
10519 24260 45050 10249 4119 24018 47869 46132 33193 6274 -13751 1005 34435 44253
10507 44253 28548 38514 67731 84155 57165 40849 65553 48732 27850 16995 43078 89658
10495 89658 102158 111660 111882 113740 89045 57900 45611 52353 53825 26063 5106 13323 11771
10482 11771 -15148 -45680 -28093 -20284 -11277 9783 31651 38109 28430 28667 41782 9725 5580
10469 5580 24187 62358 56476 47831 13561 -3063 28557 49223 83725 92159 92070 120738 141208
10456 141208 156549 179504 182097 167339 168283 160481 157064 150929 128575 125784 124577 107506 91124
10443 91124 58983 38828 45411 41313 18100 39296 47372 37741 15267 54426 75979 64140
10431 64140 58359 47668 50755 50198 42339 29986 34517 20125 -3735 -9779 -32676 -25134 -8275
10418 -8275 14869 15129 11250 -10803 -22035 -11427 1292 19294 18883 34131 26605 29845 34345
10405 34345 13769 28510 53463 57190 94341 98381 68192 54238 19799 7976 11751 5034
10393 5034 -10038 -15625 2917 -4777 -2095 -11210 -8099 -27569 11368 18647 -10029 -31607 -14544
10380 -14544 -3895 -3402 -3022 4648 14969 17287 -5449 -14008 -27499 -8431 21159 28498 24932
10367 24932 40036 46956 47059 77826 87859 94715 68427 36347 45442 45667 61020 59473 56689
10354 56689 57197 19749 16789 64503 65075 100004 128749 132796 99841 57498 45754 58127 76289
10341 76289 125465 148107 155096 163358 208848 279816 372790 477461 596520 836269 1205917
10330 1205917 1656275 2063394 2422912 2587848 2487943 2187917 1776827 1339068 974281 696846
10320 696846 497391 385213 288308 237834 224939 224047 202897 165151 147328 133814 122783
10309 122783 113164 115091 111925 121117 144666 138049 137085 99048 89052 108802 87313 63180 83978
10296 83978 98215 132655 159474 180865 228381 284002 364523 468110 623030 854685 1097146
10285 1097146 1343933 1530017 1528533 1400098 1170908 913691 644744 439297 320074 253052
10275 253052 170942 141531 111258 59912 60479 93854 109324 86607 62750 49603 44845 40359
10263 40359 15575 14127 -3382 -14536 6914 40717 34315 34378 32857 24797 21230 33077 33453 10465
10249 10465 -13296 -19837 -21025 -4649 16669 3197 -8575 -10522 953 -18885 -14316 -276
10237 -276 7569 -1738 10764 15729 16613 1968 18010 23461 45626 72325 62275 41621 659
10224 659 15750 -4635 -16386 4962 16226 14108 6047 -7890 -6911 -5097 -17810 -42960 -52364
10211 -52364 -43171 -26338 -23024 -13679 -5589 -2451 -32818 -54214 -48389 -42076 -28293 -6100 3165
10198 3165 17027 3018 -4177 1425 -3985 4930 21194 -3960 1417 2668 6250 39777 30514
10185 30514 23025 -1890 2639 14291 31389 7898 -1717 -23166 -55143 -61492 -50161 -30450
10173 -30450 -4055 406 -4154 -368 12369 25891 24330 27670 38568 68630 54775 25457 23177
10160 23177 52593 45568 3798 -7609 2848 -7349 -9162 -24147 -42786 -22632 9876 14050
10148 14050 1656 9255 5482 23115 43554 62037 59510 61897 59520 39496 31130 30178 23208
10135 23208 12500 6882 -11092 11884 25707 41000 39191 8805 -10397 -5714 -20950 -40180
10123 -40180 -16872 3373 -4965 -8395 -9215 -48938 -33469 -29539 -21706 1741 -11927 -43835 -50968
10110 -50968 -15303 16907 43944 17306 -9739 -55572 -31462 -11652 25703 25147 8406 -15521
10098 -15521 -27987 -55680 -53341 -24546 887 -5120 -8158 14613 16558 16488 10781 32146 25265
10085 25265 15909 4918 26620 30030 12426 14831 4867 1795 20700 24607 -21414 -69494 -54538
10072 -54538 -42815 -35628 -9222 -26443 -47012 -56501 -12443 -5402 -11575 -9319 -7381 -16393 -25547
10059 -25547 -14521 -1551 -6641 10920 29849 35813 48950 51898 34761 5090 24944 46937
10047 46937 73128 108690 110571 90824 65983 54796 27105 32890 35561 26622 344 -49279
10035 -49279 -25851 -33648 -23509 14270 7767 2060 10963 -4501 -28538 -9909 22325 22999 -9106
10022 -9106 -19225 -30273 -26949 -19020 -17093 3526 -16284 -38840 -51545 -59952 -54265 -45234 -21181
10009 -21181 -24941 -35512 -46856 -36841 -20015 -20198 -18978 -27460 -23518 -20472 -8897 -14965 -29400
9996 -29400 -21564 -6794 -24849 -10616 9593 -3838 -32110 -11496 25815 27542 32299 8686
9984 8686 -6041 -14678 -20114 -29092 -21270 1864 22482 26397 32307 12477 -4811 -13022 -15379 -1090
9970 -1090 -4604 21381 13212 2729 -3883 14858 5592 -30092 -35169 -16649 -1355 20981 13920
9957 13920 -19801 -17948 -16631 -24218 -21637 3966 31726 13617 -1518 6493 -13457 -25178 -30919
9944 -30919 -11092 12381 -112 35045 17544 4765 -11905 -10206 -28742 -45503 -52457 -45079
9932 -45079 -23949 -23253 -15055 -14834 19242 36642 42234 9066 -2651 2120 -12291 -18024 -16799 -10712
9918 -10712 -2483 -10417 -6319 -7720 -26281 -29948 -16467 -5198 -7460 6235 25974 81731 105064
9905 105064 95866 81325 37981 -13366 -28462 -12630 47128 45980 21749 -18071 -41904 -25998
9893 -25998 -12524 -14488 -14617 -14457 -12642 -31926 -37964 -22405 -29738 -22746 -2236 12853 27589 31714
9879 31714 23180 18397 11972 2297 5760 -9917 -7872 -3863 4809 3409 -34184 -63441 -34465 -9432
9865 -9432 -23497 -31078 -1455 8324 5436 21165 29943 17794 37529 47620 60684 66186 71062
9852 71062 53064 34729 83835 126666 194322 262262 310167 318945 305665 251668 171001 134550
9840 134550 133848 91309 81705 50484 21462 18445 25435 -9498 -21748 -38967 -15046 14027 -5561
9827 -5561 -12148 -26091 -40500 20534 44977 7552 -11267 -21652 -24750 -18684 -24844 -11385 -813
9814 -813 -22587 -16929 -25809 -24424 3558 29108 12267 -26766 -22008 -8415 1385 -4570 12967
9801 12967 17245 32426 44044 52445 35157 -3214 -12114 -16963 -29627 -20684 -31479 -23411 -8939
9788 -8939 22829 16799 4757 12548 4747 -8656 -37294 -34338 -34566 -27319 -11592 8117 10689 -30084
9774 -30084 -25336 -26091 -17067 -18950 -15265 -14954 -29323 -41739 -5688 15744 26948 46545 30057
9761 30057 13571 23107 45758 42300 35482 10983 13632 12863 -17826 -13974 -51 21297 39913
9748 39913 15441 -5628 -16656 -16710 11233 3067 -9783 16824 27580 -21270 -7413 8218 29290
9735 29290 29411 26421 12835 23358 38430 15379 -11080 -19714 -42444 -18260 5812 18571 26060
9722 26060 14832 312 -20723 -9812 31265 51636 24385 8397 16384 18244 17712 7829 25605
9709 25605 33070 15961 16907 13146 -10563 -28755 -22685 -5637 876 23039 -662 -11712 -15281
9696 -15281 -38921 -16232 2990 6111 -14002 -16022 2419 30294 62445 94204 65977 45318
9684 45318 30953 22328 19492 39914 46447 26305 19303 27810 46604 46504 41916 35399 50505 68576
9670 68576 52054 45124 60905 48458 51343 34035 16037 -1646 -23769 -19312 -21873 -19761 4930
9657 4930 30712 32387 4084 -2101 -4690 2104 2131 16059 36264 16775 -7913 3835 22649
9644 22649 52696 47161 23010 23119 40528 54204 65571 77653 49951 48059 34521 3239 -11637
9631 -11637 205 27091 62779 47140 52309 43496 39888 39815 50515 20189 13052 5404 7335 6761
9617 6761 18573 27590 39325 27118 7251 3756 37602 14607 -24022 -41950 -34345 -12581 -1034
9604 -1034 3237 48537 81184 57165 26799 8470 -19925 -24257 -7067 -2593 25366 11181 18422
9591 18422 36543 22622 16437 26601 54148 28910 10821 24516 18271 -14577 -10973 -12143 -29156
9578 -29156 -20511 -25663 -26838 -11924 22548 44147 32358 36312 49881 65463 63411 57041 60289
9565 60289 56902 54233 45117 21401 29238 51899 53063 40350 55615 57379 49895 43272 46708 25847
9551 25847 13328 43534 46144 51160 61578 58414 40146 16656 15100 37327 35642 64960 57893
9538 57893 534 -44436 -30807 26078 106317 120738 94325 71664 36836 11379 -6078 27250
9526 27250 85877 107218 69852 55574 49950 36194 30698 24849 14389 31810 48152 46925 48323
9513 48323 67565 78467 74382 99528 104382 85795 79615 85488 101425 109867 113003 98913 72400
9500 72400 76882 85786 78585 70910 57848 66004 65022 56602 72122 109243 119327 97438 90028 78494
9486 78494 93533 109158 119095 134590 104580 103059 104501 121783 119058 108152 107732 123477 104968
9473 104968 95518 106016 122959 132978 129035 148893 167041 139834 148537 132818 117700 119760
9461 119760 99435 107645 119915 121471 120818 121623 136544 171454 168444 158636 160635 139234 139767 146349
9447 146349 151883 179297 175048 177307 185942 168579 135032 125080 147398 179257 200630 172333 158427
9434 158427 148041 168915 209427 233899 218244 195581 179074 181430 165714 124554 129796 133034
9422 133034 176030 188870 173571 176542 184634 172397 185500 205276 214076 197351 206090 215656 240751
9409 240751 241403 238581 241674 239355 236749 238604 236939 265243 281534 259407 255439 231841 223019 269817
9395 269817 310798 373204 413590 409081 388846 387344 390925 384115 381589 382849 362616 367454 362851
9382 362851 374391 401025 419428 399170 411249 430391 428737 414617 408522 407167 413714 434284
9370 434284 462815 484680 502386 490768 488596 508431 523220 561354 592613 591139 587267 596381
9358 596381 626442 666844 698089 691869 708581 719089 745315 773482 788251 780394 788421 810659
9346 810659 844175 843764 867377 898929 927255 942325 973920 980919 992109 1018582 1033611 1062585
9334 1062585 1100452 1145193 1186054 1224087 1246556 1244354 1253416 1286088 1310240 1349592 1362085 1365616
9322 1365616 1396545 1423353 1430211 1466745 1509303 1523780 1522139 1531065 1560399 1561425 1584503 1619007
9310 1619007 1656601 1673418 1695383 1703558 1706979 1710744 1713348 1693545 1690635 1707917 1705759 1672562 1669237
9297 1669237 1693594 1711354 1668514 1668549 1642051 1632088 1639096 1620284 1572522 1563970 1580687 1591216 1554524
9284 1554524 1534056 1495916 1456250 1444268 1428374 1398564 1379559 1374758 1339596 1315198 1272612 1245997
9272 1245997 1231767 1204248 1162544 1139856 1126960 1127830 1101687 1047159 993456 984858 1007344 992490
9260 992490 912396 853399 839217 825276 823259 842531 830619 812958 767604 747467 732901 713687
9248 713687 719556 698879 682705 627761 613576 606719 588081 591259 600966 599814 595299 601357 569854
9235 569854 571753 573714 559159 534099 495980 476786 452597 429290 411731 425137 457783 438295
9223 438295 438753 437185 407932 381269 377088 409562 412713 403301 402367 410232 384695 371084 347289
9210 347289 327973 323484 311510 287629 289089 300402 277028 241313 244656 258742 262409 247204
9198 247204 239519 234784 230078 251504 276767 288031 268997 251859 231834 193470 155348 132512
9186 132512 156970 196301 217927 226931 222531 222930 191043 180203 152282 124643 145671 192167
9174 192167 197837 177203 159998 155700 176950 152476 138263 155001 153456 149874 155435 160533 180847
9161 180847 169967 178000 167163 160151 166656 146488 135875 150475 150233 107645 83266 83324 84971
9148 84971 92705 111942 167083 157835 133155 135480 126721 141309 126057 145004 141541 123368 137801
9135 137801 128096 109548 118063 106966 120508 128270 99373 86120 78593 92837 99447 100555 107575
9122 107575 113020 116220 113206 121414 146992 141202 113780 126917 134443 139626 113196 104469 89497
9109 89497 63982 89792 117703 113038 102392 123313 124312 140677 134392 106741 103195 110988 113709
9096 113709 111348 78918 36356 54021 68625 62151 40546 54111 84339 85577 97729 128134
9084 128134 123413 120674 113928 113506 93797 87484 68424 65094 81535 64404 54670 51412 74325
9071 74325 91280 116332 88588 79784 77329 77171 54808 37444 50403 65872 67397 53386 62162
9058 62162 78500 85183 84231 60847 58187 70797 90697 93179 85170 96382 49642 28532 36291
9045 36291 52366 66938 57946 43632 64801 78992 81060 88632 95811 87460 86707 79077 69401 16727
9031 16727 27589 52287 54684 62559 46963 32716 43261 67108 77229 42349 27642 21013
9019 21013 5505 8261 27422 43521 56981 44624 24990 27191 33923 21315 27247 40903 55356
9006 55356 43698 34421 8927 2086 22330 28878 12628 1179 -324 14478 8945 -106 12736
8993 12736 10910 33871 30527 39037 50154 66606 88711 115951 106616 111398 127742 124761 88612
8980 88612 71059 60893 48929 44096 27748 833 21201 10806 11921 24246 44982 43704
8968 43704 29531 35377 29877 18277 6756 11028 28198 32790 40710 21691 -12802 -20477 -14784
8955 -14784 -28612 -30930 12364 16717 23903 30533 50735 58125 28527 27394 37255 28209 6715
8942 6715 14132 45089 50503 47640 27543 -6040 -23235 -14182 30327 44633 38892 52334 61384
8929 61384 49997 15752 14698 25166 33653 3222 22246 11113 -7194 -14424 4281 5186 7631
8916 7631 14142 38371 42786 54819 41746 43743 26946 6147 22623 34924 -5217 -21237 -13991
8903 -13991 11266 15319 848 17029 17987 18990 3300 -23224 -18708 18097 32466 55395 54615
8890 54615 2512 13769 2521 -1483 19821 45893 19043 17865 57386 49488 37936 33753 16046
8877 16046 20724 23638 31006 36246 43579 42394 28815 38133 42572 27001 56494 55655 34847 23939
8863 23939 19563 16430 34974 10114 -20834 -30769 -11673 10884 18198 13385 21892 -19058 -48787
8850 -48787 -67941 -56240 -31925 -13452 11986 34476 30348 49488 42845 35020 46363 53036 70903
8837 70903 63633 50439 43957 59596 66984 81690 65672 42098 50385 29149 -8019 -1892 14319
8824 14319 29382 47511 61664 49623 32881 8011 8828 21039 40259 45166 55714 57133 45660
8811 45660 19657 2514 -5246 -1614 6823 18745 20987 20700 33699 37394 32827 28433 60248 89093
8797 89093 40809 -6346 617 12078 19488 29373 38719 20380 -3435 -4627 409 23909 34245
8784 34245 23317 13615 9360 41577 26379 7947 10629 30763 49099 62427 46979 33378
8772 33378 40683 15722 9552 39950 30532 3513 11636 49753 55732 73361 99426 77034 49695
8759 49695 28859 19823 8682 -9945 -4116 30759 31223 19638 32269 12025 8451 33678 45610
8746 45610 80972 93463 87915 59292 36495 30899 25053 23306 30364 21527 37607 81816 112520
8733 112520 102199 83744 71565 66381 58182 57495 54968 58802 94461 91531 112971 109152 101488
8720 101488 103842 87786 51014 59721 65603 19183 -21961 -6591 38516 44002 52891 56463 32384
8707 32384 21863 15269 23399 37594 67935 76131 73589 67558 91263 96545 97073 87466 99274 91604
8693 91604 95375 95542 94124 71448 77952 83765 80066 55175 66902 65381 77594 88385 88614 98775
8679 98775 131721 138224 130070 109642 98861 92879 79372 86045 138095 123418 105806 115945 126645
8666 126645 133464 133127 155655 149479 118489 102687 92556 94126 95727 124739 115585 152937 160124
8653 160124 145056 160738 173525 155628 174217 217190 243317 277364 262762 258766 243394 235269
8641 235269 275026 282172 239189 232719 196617 176725 183521 197328 228707 243802 217490 229726
8629 229726 261442 273355 269393 241119 227898 234278 260376 263572 289941 315468 339782 386699
8617 386699 398468 411675 426119 448194 464884 450578 439703 431214 404769 397711 410485 421783
8605 421783 429746 446445 470320 510396 558507 588885 589132 569489 578339 585588 570989 531136 497955
8592 497955 469555 438114 408510 369821 326088 285041 257629 252865 223283 177731 187445 176817
8580 176817 159563 149396 150924 131712 111060 98944 74786 69949 102596 124319 107810 95650
8568 95650 84141 70428 73081 90791 72335 77153 60550 52807 54493 87245 116394 123398 114319
8555 114319 110094 120422 100997 78585 62614 49682 34235 42035 60015 70084 34740 43294
8543 43294 55568 38071 33441 22571 39164 34990 34896 40898 65946 40503 40139 30748 36050 39876
8529 39876 40090 48648 14317 6078 -4221 -2459 -11941 -20594 -14121 5360 16683 12955 7980 -17231
8515 -17231 -21491 -9316 12160 60554 80529 44036 21725 31286 27601 22444 2496 -5795 24747
8502 24747 34414 40928 51950 47445 45220 35871 39499 32908 13824 25928 54788 70444 71695
8489 71695 63685 43341 16845 -803 1993 5271 10455 7902 17167 37590 45459 44484 51640 59628
8475 59628 38831 17187 29685 69430 82404 80988 90374 95993 64021 38653 41239 54107 58708
8462 58708 64086 24545 18333 26083 19604 36709 54209 54174 75596 82273 64021 50839 54687 39141
8448 39141 34137 68724 71749 88537 84586 64348 55338 61449 67334 77320 94546 91565 57691
8435 57691 46023 25604 21056 22921 33306 11205 -3019 9839 18586 1309 9968 35572 90071
8422 90071 105251 97286 74921 75591 55108 36796 56147 33350 32938 43824 30432 10166 35974
8409 35974 57607 42480 40042 69985 102819 88270 49153 32260 33859 28759 14259 4683 18799
8396 18799 28181 28249 20387 25882 53407 87997 97348 44108 54400 74769 77528 90417 101864
8383 101864 105055 83371 61772 84656 88457 43803 15366 5593 7539 -13337 -4583 28244 30767
8370 30767 3564 4992 -11471 -2066 -535 4871 2266 -822 12679 -2832 -25644 -36944 -36090
8357 -36090 -21513 -37819 -46010 -31726 -6186 15133 29039 49076 54972 62650 72206 71367 74794
8344 74794 82947 69148 35872 29988 56102 46543 32461 13222 11261 13469 7784 5920 25995
8331 25995 37441 35540 24317 2123 -24240 -12071 464 -3826 18686 44488 40399 43510 32662
8318 32662 33808 18745 15477 25002 15608 39127 54406 35752 24937 38141 19656 -449 20302
8305 20302 40464 39732 8345 5014 3216 30531 49004 51644 50019 41951 41022 26464 13328 2381
8291 2381 -2973 2453 -14646 -25777 -24031 -14154 5526 13052 26947 31470 2526 -11767 -5576
8278 -5576 -8971 11676 29528 35001 38306 39771 41431 28556 13282 30115 600 -15579 -7215
8265 -7215 9984 -14482 -42027 -27424 2045 3938 -1740 1337 -9403 7525 15832 -3158 -15624
8252 -15624 -1923 -106 11720 23863 12495 12784 -385 -15190 -24518 -21838 -17285 -23932 -27393
8239 -27393 -10073 10542 14344 17962 19394 22804 5472 -27394 -36223 -34069 -4700 -6826 11793
8226 11793 21309 10506 22138 25421 27453 7622 3709 -28156 -16275 9052 29689 37181 53678
8213 53678 51580 38003 29455 19515 18166 5951 -43 7747 -1920 -11773 -38001 -37843 -11249 -5779
8199 -5779 -5274 -11715 -3801 13707 -2620 -4544 -901 -20030 -51272 -39098 -20154 -22840 -9719
8186 -9719 34930 21188 -6639 -31877 -17568 754 -2508 -13655 -3512 4612 20746 15630 9966
8173 9966 -3738 -23162 -24939 -15467 -4858 -9889 -10541 -14951 -7990 2337 25662 -160 -2134 16311
8159 16311 9135 21581 42333 43346 67603 89368 82859 39079 12304 -4817 -27932 -40223
8147 -40223 -26792 -6854 3570 20720 -3112 -18616 -31951 -25848 1143 19664 32122 24680
8135 24680 -5805 -5375 -14601 -11248 -5436 5622 39919 16163 -19331 -38976 -34595 -22298 12335
8122 12335 34477 23391 17978 21724 13862 35167 37973 63995 73144 87838 60053 21838 -4575
8109 -4575 17700 9357 2700 -9806 5238 12639 14204 422 6839 4004 15557 13435 -2483
8096 -2483 2900 -14819 -35474 -40771 -4561 33170 24587 16559 17057 10661 16508 -7606 -11301 23057
8082 23057 33948 4501 -23702 -17837 1074 -1982 -24744 -1459 51728 76544 44914 35555
8070 35555 42843 29631 41324 28143 23387 29343 18674 16903 14968 20341 16868 13556 22980 51200
8056 51200 54867 68645 75580 81751 70431 76020 105716 111889 119599 161462 159874 161958 156261 159650
8042 159650 171948 192511 212493 213934 234305 235814 199031 153629 152345 165497 170943 171558 195304
8029 195304 173408 161407 117908 97994 95241 115159 145792 150066 132488 139719 138718 141687 147126
8016 147126 162857 190534 191199 191377 228430 273500 304382 314142 334145 398041 520910 627642
8004 627642 688479 703319 655604 581529 531458 491224 464649 482681 512736 537678 654245
7993 654245 792989 874422 873900 796717 646817 487568 371143 299158 244888 214295 201410
7982 201410 184371 183113 204317 197946 193362 170242 158062 165176 217426 280219 297658 308975
7970 308975 306344 290895 320235 336901 365137 406611 464227 542654 619483 713871 802285 856207
7958 856207 843644 793466 749043 705712 678139 700511 764623 823279 866606 828304 723514
7947 723514 634062 504317 429034 391480 350196 301873 238957 217640 183701 157519 145017
7936 145017 147908 139393 118938 124103 131187 124873 103284 109720 120374 109217 92050 107844 164012
7923 164012 197218 206721 235865 311073 350264 365076 365917 349666 322503 269361 241451 210261
7911 210261 209446 214640 209739 185873 173109 165658 169603 184359 177433 134604 69944 51261 34911
7898 34911 17116 28307 34024 41292 54902 53454 43543 31888 9141 -4316 26400 61984 52459
7885 52459 18672 -16842 -32176 -7934 18735 -8965 -51832 -61349 -40644 -31259 -16965 -7720
7873 -7720 -18995 -2282 11391 26870 42471 34179 28639 8580 -13153 -1896 -13091 -10287 -1871
7860 -1871 -197 21059 24484 12054 29299 46005 49887 35437 1645 9664 3700 -19908 9623
7847 9623 29427 6682 13270 37517 10906 -2287 -48 -17271 -19241 -12888 -23876 11687 40845
7834 40845 5883 -9546 -6424 2087 13425 11725 40986 37157 9864 -3426 40590 55231 43318
7821 43318 38914 41582 31377 26482 13687 8708 1404 -2446 -34272 -55971 -30720 -1462 3421
7808 3421 719 24801 12672 -20255 -34258 -31817 8624 42454 14551 -27784 -33667 -13947 -6056
7795 -6056 -19227 -9961 -11241 758 17671 24280 34288 43726 40786 31332 7085 -27495 -23297
7782 -23297 1125 4206 -21020 -15443 12172 50818 44648 36498 47886 33814 18650 -9947 -11268
7769 -11268 12155 6808 -4537 -48632 -89449 -99266 -66633 -49930 -9277 26679 21600 -1058
7757 -1058 1900 -16094 -46108 -30786 -26452 -26165 -2354 11730 -10493 -23215 -6906 -2318 1452
7744 1452 -12337 -13027 1216 11000 5036 29965 76630 76290 46183 26959 6216 50955 85775
7731 85775 31936 3070 -12095 -10984 25251 19860 -25259 -29841 -22952 -4519 25637 24422 1554
7718 1554 -321 2438 -5575 -14942 -26683 -39935 -52182 -52855 -23417 3035 4428 -2156 2129 26913
7704 26913 42705 26652 14596 -8368 -31936 -28178 -16629 -12925 -16482 -30176 -26427 -8310 -17101
7691 -17101 -29960 -35223 -28666 80 -4598 -17488 -20654 -10009 28195 51243 52712 49849 29547
7678 29547 -6408 -9531 -15873 -8744 29142 37224 19858 9632 16349 15960 26189 28441 32628 17600
7664 17600 18394 39336 40681 15817 -4457 -39333 -11034 -22029 -62679 -58458 -57645 -38667 -24876
7651 -24876 -47078 -59990 -31758 -8041 15772 21744 -4244 -15456 -1116 24034 15610 667
7639 667 -31987 -58305 -59468 -41084 -41214 -33097 -4462 14410 -7906 -20741 -3427 1799 2486 39286
7625 39286 37003 27013 29972 24295 27196 29771 36880 39488 22454 2869 -696 -12688 -60788 -61818
7611 -61818 -38987 -35912 -42715 -42354 -19589 -23054 8179 21311 37523 39158 7836 -14361 8361
7598 8361 38561 28344 21710 21683 -3830 -7697 -48919 -61573 -39336 -25496 -47318 -66796 -56603
7585 -56603 -25767 -14795 21583 17322 1648 2267 5967 24034 30659 28837 28046 37575 32419 19064
7571 19064 17181 1537 -18478 -2209 -10161 -32506 -48010 -35723 -35156 -31136 -57214 -56703 -29714
7558 -29714 -31880 -38989 -4406 19837 18336 -8218 -9071 -21470 -50420 -53491 -10337 -653 -9967
7545 -9967 4017 -11162 -30453 -11735 17280 -1706 -21034 -13094 2310 2741 -3736 -16297 -1890
7532 -1890 -9179 -8036 921 -3590 -12072 -38161 -54061 -37888 -29494 -32689 -58233 -22762 7804
7519 7804 5199 6268 -17208 -32555 -30650 -33512 -6693 -19850 -32775 -23708 -53324 -30739 12070
7506 12070 25334 17531 24602 32036 8350 22886 34508 -321 -40124 -36575 -21712 -22902 -34139
7493 -34139 -45819 -27285 -31967 -17729 -8362 -19169 -18771 -19351 -13077 3885 -1783 -21553 -2002
7480 -2002 -14090 -3638 -15881 -21945 -22932 5377 10557 1372 -1311 -32315 -42965 -59795 -58671
7467 -58671 -62663 -23391 -24472 -54773 -35137 -17133 -24865 -57830 -63600 -37774 -6788 13058 30050
7454 30050 61517 53308 33262 14444 18731 17056 -5734 23888 27214 24037 21840 7392 -3094
7441 -3094 -4393 -27609 -8261 4318 -13164 -12394 -11805 5599 -5252 -18929 -16619 -27949 -43946
7428 -43946 -35043 -28138 10468 19987 23213 20154 -9334 -34566 -45166 -29666 -53593 -45411 -33670
7415 -33670 -10085 21440 30313 18474 25963 3158 16982 56534 70448 55071 10682 -6478
7403 -6478 -14601 -18247 -6886 10580 -3856 11709 25646 22575 48543 60813 42697 15837 -19335
7390 -19335 -46784 -25620 25527 19648 -113 -24472 -33332 -47024 -54685 -61218 -37561 -51437 -51376
7377 -51376 -39093 -34924 5658 47274 54091 23626 10801 47476 38923 3481 -30341 -5947
7365 -5947 20934 33181 41638 47226 34844 7499 -10325 -15366 -10033 6045 17900 -2639 -2889
7352 -2889 5024 24182 37033 -2877 -40195 -57515 -32980 -24660 6285 28654 16208 42655
7340 42655 40749 14412 -18216 -20449 -21041 -6889 78 10194 11474 -13055 -26309 -3469 19823
7327 19823 2369 20497 21458 9608 9832 -16697 -28625 -11161 7827 -1445 -36036 -20582 -7721
7314 -7721 -11468 -24066 -30234 -4393 23505 -7472 -39515 -46846 -43818 -29425 -17594 -1014 -26331
7301 -26331 -44826 -26486 -15106 -9658 -10004 -29575 -25132 -30636 -16939 8238 2374 -26025 -48263
7288 -48263 -54608 -36500 332 3660 -15819 7677 -2069 -31622 -23416 -7407 24055 20177 163
7275 163 -5254 1211 612 12246 8953 4770 -20144 -18436 -11956 1460 14933 29811 -1929 -48971
7261 -48971 -46156 -32500 -22025 -12277 21528 32557 15674 -8333 -2682 3293 4058 -7836 -1347
7248 -1347 -15760 -46080 -43835 -30322 -27529 -47432 -23012 -4426 -37652 -53495 -41923 -16587
7236 -16587 -34859 -15002 6366 21177 4913 -3436 -17088 -7691 -844 -31479 -32198 -25165 -34454
7223 -34454 -54140 -75811 -49063 -16141 15829 38371 32192 37074 13918 20355 12118 9852 9151
7210 9151 2010 879 -1777 -8138 -1586 1719 24364 18505 15203 26808 16210 14770 -9260 -20132
7196 -20132 -23249 -27646 -30469 -36428 -46271 -43693 -64603 -52712 -39127 -20474 -24557 -48057 -40612
7183 -40612 -18415 -31026 -10240 -18498 -58552 -38654 -3538 -13523 -56651 -42494 -2996 7738
7171 7738 13008 19167 21034 8913 28807 55913 24577 15187 24600 24178 18600 9512 27160 37535
7157 37535 22749 18926 5752 -8603 -16897 -21696 -15430 -11260 -28297 -39232 -50995 -29510 -7852
7144 -7852 -19075 -28889 -52919 -54956 -32356 3206 26394 28452 18629 -7005 -6110 -31804 -34400
7131 -34400 1169 1273 -3305 13978 8178 5945 7242 25586 11550 10697 16760 -16498 -8638 19045
7117 19045 51761 33600 14105 -43378 -68010 -49327 -3434 -23937 -12416 16648 -3584 -28080
7105 -28080 -22956 -35028 -47916 -29321 -61872 -80585 -63848 -35241 -32498 -19113 -19168 -14748 -2416
7092 -2416 -75337 -78462 -54591 -41736 -43278 -12882 -4588 14861 27392 -7375 -45891 -31556 -27217
7079 -27217 9889 33074 -3304 -38964 -20745 -28849 -12908 -886 -22614 -27294 -37122 -38577 -26254
7066 -26254 -3298 10385 12216 13711 -6856 -26669 -40693 -53461 -49863 -48635 -26016 -9843 -11539
7053 -11539 -7449 -6970 -7038 6800 26950 25947 12530 10834 2969 -8610 4178 -6538 -33647 -35277
7039 -35277 -20789 -26843 -52495 -34603 19654 32969 16762 11845 -241 13849 13667 21489 32384
7026 32384 23337 13876 9002 18558 49988 61902 27161 9777 13053 54644 74010 53733 30026
7013 30026 22692 27247 24447 10535 -2476 -37301 -52628 -25666 -3922 -8510 -13824 -23470 -11600
7000 -11600 2950 -2322 -4129 -6679 -16977 -1362 10878 -2132 -24934 -12238 7167 9949 13604
6987 13604 20687 21527 -6869 -26817 -30646 -59536 -68984 -39695 -45235 -47898 -44698 -64355 -88119
6974 -88119 -75321 -45515 -45313 -28355 -20263 -24544 -13898 -6349 -6690 10178 10453 -3742 -11983 -7072
6960 -7072 -19924 -15571 -31466 -62251 -81880 -61145 -39677 -27452 -10843 -1772 -28700 -25669 -22549
6947 -22549 -11480 -27543 -26408 -27239 -24620 -3254 3537 18545 24950 43622 26176 6463 7797
6934 7797 34426 45640 16592 12732 29255 15842 35279 30915 52523 81534 94287 71676
6922 71676 31724 7042 -12332 -10395 -8822 8301 5905 13090 8595 -465 3489 7997 5611 -23073
6908 -23073 -29066 -916 10123 23402 10028 -8003 9202 -3846 -19889 -7899 12393 28589
6896 28589 38660 14018 -16435 -36033 -26491 -8001 5983 11470 13461 18861 17239 10579 5890
6883 5890 14042 28417 45896 30978 28555 24071 8435 30273 19818 8802 -8927 -30948 -22797
6870 -22797 -27437 -22000 18651 4577 -6327 -7238 -24658 -35873 -24330 -116 -16269 12356 19229
6857 19229 12220 25951 17860 -5348 -10295 2385 21533 30221 30465 26810 12052 12425 24270 7939
6843 7939 -14612 -18357 -1284 5700 -8715 -29027 -65087 -40863 -21689 -34515 -21742 -26932 -29885
6830 -29885 -6498 10129 12121 8579 -3489 -1350 36433 42915 14 -3857 -7924 -35776 -25661
6817 -25661 -29564 -20897 -33571 -18536 -3102 7314 15079 1044 5509 7262 3400 18461 30504
6804 30504 26796 45506 18306 13947 23019 10853 23194 28625 -4504 -22830 -7307 13008 -5115
6791 -5115 -138 15569 28906 39526 27353 -7707 -18698 -29779 -24650 11802 9648 22875 41443
6778 41443 44024 17073 -7027 -6926 -33459 -12212 -10364 -19364 -22336 11955 12013 5545 -10532 -13219
6764 -13219 7607 36099 13133 -6599 -4485 -4415 3221 41064 34093 14478 5396 6073 -28359 -26897
6750 -26897 -38879 -20046 -6600 -10647 13137 11655 8420 28215 27039 30279 37629 43757 22971
6737 22971 -23971 -48590 -33053 -2394 18140 10745 -24113 -66967 -43067 -25568 -11224 26744
6725 26744 54765 60859 36967 36828 51955 67787 53814 34105 17559 16121 1585 -10865 12995
6712 12995 17750 35797 27417 4226 -4798 -22145 -1519 -2740 -24635 -24573 -16027 -36591 -64586
6699 -64586 -41451 -19429 -25491 -12101 -3155 -32994 -57457 -74041 -82709 -83906 -73693 -58120 -24252
6686 -24252 -4901 11296 17543 27396 2194 8633 -8553 -7016 18334 27915 17379 4665 -1757
6673 -1757 7174 -5865 -28468 -28928 -16462 -12043 3764 46209 76157 62709 30580 14093 8732
6660 8732 10733 -18925 -13152 8591 21198 289 -7466 12012 -1695 15786 42640 31563 35044
6647 35044 50562 25844 6740 6819 15649 24000 12621 -11929 -36220 -32221 10781 24528 -37825
6634 -37825 -23750 3358 4328 12204 13930 19484 6489 10105 13623 4859 -19391 -13946 509 -13772
6620 -13772 -948 19717 -3029 -25210 -30376 -18173 -36187 -60441 -38096 24298 29933 9680
6608 9680 26968 12510 10162 2932 11403 43312 27407 -9928 -19563 -17007 2467 3115 22685
6595 22685 35260 40390 27395 16336 9591 -1626 20830 18873 27768 34364 21355 -2829 248
6582 248 20967 34427 20412 18826 7857 -3091 -11605 21274 57522 57930 46716 27651 -12174
6569 -12174 -34193 -20212 -9657 3736 8960 -5401 -37923 -40721 -42476 -41807 -54143 -49605 -41461
6556 -41461 -42101 -13603 -6077 -3182 5852 6610 16912 13959 -19575 -38682 -24795 472 -962 -3537
6542 -3537 26823 10175 -2967 15249 45133 49177 30669 14464 -6859 17703 26059 13499
6530 13499 -5866 -3038 -30210 -35440 -34073 -33719 -20 -31692 -72603 -74290 -53880 -44552 -27186
6517 -27186 -11086 -2205 -17338 -22654 -17354 -13855 13235 3306 -27210 -42094 -26352 9390 11278
6504 11278 -10020 -2413 -6551 1372 -9195 -17134 -4610 11823 30410 19272 -13590 -21705 -13800
6491 -13800 2660 20138 35853 46217 19507 28052 58529 50761 29291 12114 10385 543 386
6478 386 -16530 -22831 -35163 -8604 11604 2668 -6282 -25940 -17917 -20070 -26497 -4562 8572
6465 8572 13451 18080 10676 -6688 -47256 -66843 -62199 -29374 -2156 537 20985 16283 9384
6452 9384 20519 -3998 -31169 -60026 -49905 -12860 2403 5458 8775 -20501 -45121 -38700 2524
6439 2524 486 1315 4960 1814 5687 12003 3835 32570 44855 38428 15709 17444 -12192 -14779
6425 -14779 4412 -16667 -616 14446 14568 -16624 -5500 28029 61062 40139 8264 -12675
6413 -12675 -40593 -52271 -68123 -56048 -60771 -67978 -72555 -62641 -25030 -38673 -27085 -14578 -25434
6400 -25434 -21367 -35415 -39446 -28133 -31748 -44208 -51173 -39435 -39765 -44814 -42553 -33222 -9280 -24835
6386 -24835 -25349 -18159 -32006 -12680 -5364 -13421 -1646 -12148 -38671 -51034 -45687 -39244 -24367
6373 -24367 -32996 -57602 -57744 -47381 -41495 -53067 -57283 -42198 -34454 -29130 -52898 -58856 -49319 -19584
6359 -19584 6414 25452 14320 1538 15317 16012 -1518 -31273 -43257 -43469 -6447 28767 26766
6346 26766 30746 12295 11614 33100 64800 49909 34360 23642 20322 11585 -88 -27892 -32873
6333 -32873 -20182 -15345 -36788 -17877 -25402 -11545 -18511 -49925 -60239 -56265 -41498 -26594 -12223
6320 -12223 7862 40769 46960 36619 22111 -17747 -58121 -58157 -65271 -48366 -38522 -45340 -40529
6307 -40529 -15714 3755 42149 20242 3930 12528 -19587 -48927 -53741 -35380 -39790 -50194
6295 -50194 -63066 -55216 -22089 -37230 -24549 -8365 11191 6474 -1153 -12334 -886 3730 -19504
6282 -19504 -30659 -8142 11234 27270 23718 9513 -7430 -5221 5100 18868 22014 34711
6270 34711 21794 -20124 -30208 -29912 -43869 -29077 -32974 -49714 -44626 -52430 -34587 -30503 -34309
6257 -34309 -24672 -46572 -52256 -31538 -30426 -25921 -18785 3288 10243 28480 14425 14496 16735 36609
6243 36609 12679 -5073 -8003 -16624 -28229 -30273 28110 40282 31017 19284 -4290 -25488 -33193
6230 -33193 -34913 -17610 11919 -198 -3084 -8133 -10872 -18524 -30154 -52081 -28520 -8763 -9686
6217 -9686 -8366 -11983 -5737 3043 -7013 -45203 -38181 -3206 -5246 -16399 -5588 -2343 -11042 -15308
6203 -15308 -13766 -4720 20200 26956 30681 34677 23656 -11796 -30430 -28248 -11271 5625 9014
6190 9014 5568 -17809 -47335 -47127 -35900 -37943 -29761 -17277 23549 21724 -11102 2218 2595 -2795
6176 -2795 -27638 -20076 3858 -9291 -26209 -44904 -24847 8276 2226 8445 -2370 -20535 -25672
6163 -25672 -7068 11905 -508 -17992 -26732 -13504 -11470 -34297 -33315 -16105 13501 -7778 -23168
6150 -23168 -38301 -18311 5801 -336 14439 -6813 -34344 -38279 -51740 -58400 -66010 -56325 -40945
6137 -40945 -23022 -9396 -12091 -28491 -41945 -28744 -36447 -63016 -72945 -33802 14586 22737 -14813
6124 -14813 -16747 -8547 -4271 4671 26558 8184 14495 20860 19164 34362 39671 26874 35497 40289
6110 40289 15793 -7915 -8622 -125 -15488 -30523 -3820 15966 -11156 -33312 491 10287 15068
6097 15068 21741 10371 9420 4881 5104 18904 11162 21952 12568 -28456 -55124 -43689 -19001
6084 -19001 -25507 -18641 -16793 1550 13302 15894 -24735 -42458 -38701 -18616 -21680 -23215 -20415
6071 -20415 -31556 -33832 -61625 -48573 -45797 -58391 -74150 -66484 -42938 -44526 -47719 -15983 -11149
6058 -11149 -39501 -59512 -59227 -54946 -47476 -51018 -40697 -24277 -16010 -33199 -45248 -25923 -47422
6045 -47422 -80872 -63102 -54962 -41938 -58625 -42985 -33939 -25467 -23721 -11730 -4673 -9382 -27501
6032 -27501 -48347 -80517 -79169 -56092 -44780 -39631 -17122 -9540 -11819 -7465 10443 10580 -1410
6019 -1410 6385 -16658 -9557 -9201 -14905 -22592 -43473 -32006 -8261 4420 9460 19637 36977
6006 36977 24414 -25038 -71747 -49110 -10715 18541 19309 33908 41901 49136 48608 15281 -16760
5993 -16760 -6567 -6233 -335 -987 -20909 -20919 2259 16490 19277 9682 -755 -16486 -16194 -26088
5979 -26088 -16972 -23496 -53254 -53379 -31763 -17406 -30011 -43984 -22974 5744 1582 -6617 2403
5966 2403 -3193 2630 -17794 -20965 -17057 -7626 -12498 -25774 -33383 -47548 -47338 -21522 2100 14992
5952 14992 21336 8390 6329 7601 893 14808 39622 14898 -5914 6237 10590 23114 14794
5939 14794 9844 13163 2772 4018 8430 2520 -15729 -34541 -25383 -13446 -28460 -33819 -23735
5926 -23735 -21396 -16187 4455 18329 5065 -10316 6663 -6154 8516 1330 -18194 -15492 -6810
5913 -6810 -22090 -26349 -11954 -425 14036 25413 22251 14556 10755 30268 21794 26424 30090
5900 30090 23040 39496 20539 -9918 -21603 -32291 -29486 -11025 1867 -18584 -786 24133
5888 24133 14666 -3831 231 13239 10081 2596 -28823 -35492 -9167 -2335 -17707 -35848 -36436
5875 -36436 -57214 -30483 -32214 -19773 -15423 4973 4710 11470 -6419 -34111 -35798 -60232 -63994
5862 -63994 -65724 -52304 -11284 -8812 -38032 -47658 -33803 -40778 -48520 -59930 -49579 -39145 -31624
5849 -31624 11759 17870 24307 3231 12390 -11862 -44587 -70806 -65366 -25011 -21112 -13002 1368
5836 1368 2789 -17086 -30825 -9297 4967 6888 26702 33388 10422 -5257 8779 22336 2437
5823 2437 -14289 -15288 -32487 -50584 -48300 -35945 4085 -6432 -39534 -3640 -3256 -24746 -51423
5810 -51423 -35635 -17636 -12470 -14437 -27604 -3923 33769 35904 19372 2387 -870 -3519 2954
5797 2954 7885 5202 5376 -16254 -12509 -413 -5333 5917 9911 -3291 6044 30654 37636 17942
5783 17942 -23699 -5817 12635 604 -11919 -42657 -24098 -14147 -10607 15502 29391 42377
5771 42377 64638 62692 43772 34610 22406 -1579 -379 -6564 11303 20862 34791 39461 39351
5758 39351 53395 49797 5475 -25508 -20588 12121 30777 12615 14584 8880 8367 -9652 -22250
5745 -22250 -17066 -17351 -19493 -271 -12530 -27514 -26745 -31271 -42815 -58353 -23392 22697 39299
5732 39299 39367 6416 -18766 -17203 -36138 -57891 -60757 -24863 6336 362 -8443 -14573 -20108 -12728
5718 -12728 -15019 -25530 -33373 -4574 3415 8138 -7814 -20169 -29753 -29640 -25066 -29553 -23468 -17095
5704 -17095 3895 10213 23685 -25378 -47280 -43303 -41980 -47832 -41951 -21458 -15696 6407 4172
5691 4172 -10829 8375 4542 -7038 893 -25089 -27644 -941 -6804 -27793 -43316 -16628 366
5678 366 1731 910 150 19377 -4539 13825 35705 31123 -15648 -10295 -14908 -27229 -15165 12719
5664 12719 12934 12481 17319 -9875 -237 12427 11273 4135 -5244 -7226 9729 22163 7145 -17258
5650 -17258 -38912 -31676 2695 41038 38939 37805 20995 -879 477 17883 11746 2790 9881
5637 9881 13149 25502 38040 9957 -28359 -26841 -34202 -37437 -48280 -59917 -75618 -48937 -37118
5624 -37118 -33844 -7606 -7014 -24235 -34769 -24996 2940 -3984 -19450 -23978 -25777 -20595 13037
5611 13037 43569 55905 42251 25347 20085 24302 11125 13974 12538 3928 12623 -8842 -22712
5598 -22712 4362 36189 51758 39134 11298 7242 507 -5605 -17173 -31867 -15567 -17243 -8119
5585 -8119 -1170 24839 33553 20726 21542 -474 -25122 -3786 -3776 -20492 -31775 -19000 -22933 -9165
5571 -9165 20032 17876 -10718 -3622 -13414 -13001 -5886 -34317 -41570 -39217 -34008 -22604 -26476 -1227
5557 -1227 5039 16194 11544 19134 26048 35904 13474 -5024 -18167 -27154 -22774 -5120 13488
5544 13488 -24094 -23368 2241 4227 -18186 -58924 -54139 -49695 -28468 -11467 -3824 15091 17435
5531 17435 13115 12335 8849 -19015 -17387 -8453 18243 14985 26524 6885 2624 34085 37419 9617
5517 9617 -3836 -10100 -27883 -21877 -34903 -37744 -46932 -83570 -57114 -26466 -28761 -29375 -14389
5504 -14389 -15907 -23018 -29178 -15193 -9084 1319 39434 22451 -1550 -3643 -16507 -24782 -53476
5491 -53476 -65232 -39517 -15997 -30406 -24641 -1732 -16571 -21697 -23740 -22896 -15531 1391 -1120
5478 -1120 11532 -19101 -39545 -9318 3562 -32467 -34364 -21921 -10323 -13308 -10982 -37221 -40528
5465 -40528 -42628 -29941 -28971 -48127 -43427 6080 20036 19344 10694 -12363 -21618 -34792 -15593
5452 -15593 -14604 -25841 -30023 -41891 -42182 -7805 -14716 -5082 -10057 -30083 -29673 -28689 -3942 6279
5438 6279 4731 9798 49034 40122 38241 45042 51560 22530 -19915 -12120 9465 153 -31699 -46170
5424 -46170 -22698 -7764 -10762 -6401 2432 -20379 -34321 -22597 8235 14927 13592 -15482 -41844
5411 -41844 -49828 -33955 -45916 -20087 -6374 -38104 -23906 5496 -11737 -2837 -8724 18102
5399 18102 48821 80193 87061 71579 36234 9129 8168 -17631 -29744 -25862 -19873 -27831 -12846
5386 -12846 508 11987 17637 -14380 -64383 -77398 -47881 -33704 -19424 -31657 -43186 -40078
5374 -40078 -12889 12621 15952 -6019 -30209 -32603 4412 31201 17403 -18382 -11962 10581
5362 10581 10012 18657 11908 20660 25937 2463 -1946 -4051 5032 1748 3109 12574 26606 28371
5348 28371 1818 -13785 35276 64969 53617 34462 31858 20717 9964 -16118 -24721 -17863
5336 -17863 -1019 -7010 -26732 -7544 -18795 7197 41274 1329 -23207 -32773 -13435 -26562
5324 -26562 -43285 -27873 -39348 -21692 -20915 -38817 -41784 -22043 -1252 -3523 7733 -9632 -18939
5311 -18939 -1637 13756 15323 25024 29326 29305 43853 25414 14985 -15835 -33299 -16513 -10423
5298 -10423 -8623 -44812 -53702 -39420 -13795 -5472 2788 -9989 6714 2467 -36453 -51031 -51603
5285 -51603 -2276 -7738 -13206 -12605 -24514 -7744 8374 12031 26814 22031 -2325 -29559 -2763
5272 -2763 -2900 -9059 3246 10201 17411 20935 26824 22270 26837 26202 28529 42572 33120 -742 -24487
5257 -24487 -63408 -50616 -15339 16690 14071 4539 -20979 -26702 -31379 -29884 -5534 18007 16061
5244 16061 18344 27542 29064 15845 -17536 -5951 41010 40641 26702 28028 31469 9485 10592
5231 10592 -12368 -15088 -26084 -21776 -22905 -24532 -23226 -29150 -12628 -1761 -7537 -8040 -2209 -24566
5217 -24566 -42909 -15394 -4020 -8778 14650 30674 26271 21383 -8799 -31708 -33771 -21183 -17278
5204 -17278 -16293 -7556 -972 8345 3510 -6369 -30292 -16655 -21054 -43285 -45213 -28661 -23459 -34939
5190 -34939 -17854 -6883 -28783 -17214 37712 48652 -1670 -18828 -14387 -9353 -3233 1894 -18783
5177 -18783 -25613 -20181 6596 -5633 -29696 -21366 -1219 2735 -23857 -21100 -7720 -18188 -10491
5164 -10491 -1167 -2691 -7207 8229 2283 -21438 -15467 -7668 -27338 -9686 -16021 3890 35301
5151 35301 31234 5633 5844 7369 -3179 -21610 -15334 -7427 -11038 -7405 -4703 1641 29371 28500
5137 28500 -10363 -15213 -1717 -8873 8034 -18424 -34925 -12219 -38161 -16917 3113 -3488
5125 -3488 -40652 -53468 -28972 -37530 -12896 19291 19754 -29157 -44963 -14816 -3615 18978 -12433
5112 -12433 5734 19344 -12854 6162 12408 4601 10346 27941 33069 5860 3318 18508 11865
5099 11865 -11832 -27353 -33705 -29684 -15148 -6796 2054 -21865 -58 10023 31852 34527 33414
5086 33414 37247 10545 37470 73343 79439 55210 25014 -5636 10232 -9889 -41961 -65643
5074 -65643 -78878 -44838 -24073 -311 7587 22197 32047 33212 9328 12752 34388 42409 27578
5061 27578 39105 35377 28806 35129 23347 35272 21247 -2300 -28893 -39540 -22565 -15144 -10351
5048 -10351 -20842 -14592 -7608 -8873 -4521 -9614 -12316 -19686 -26006 -46002 -30431 -11485 -26149
5035 -26149 -18645 2119 1533 -7560 -27499 -37248 -40764 -32244 -26782 -23402 -14749 -2064 -4327 1064
5021 1064 1512 -15983 -21253 -24375 -27511 -57617 -54091 -21461 2383 10791 18337 40918 48092 33881
5007 33881 14937 26915 39206 28080 34073 30211 18463 30896 18626 20970 15403 26603 21191
4994 21191 19527 -4054 721 1716 34569 22701 30462 26272 5545 14104 8745 12121 6327 9369
4980 9369 45201 67456 44863 20250 -11663 7923 768 1259 -6184 1685 21174 44687 48108
4967 48108 23335 7147 -11376 -545 -13273 -3680 5728 526 13008 11085 20321 22391 -3321
4954 -3321 -33713 -51383 -62399 -19238 15557 12582 20617 10137 3413 7507 10955 -4765 13494
4941 13494 27889 -2290 -3887 -13845 -41274 -35643 -17950 -28539 -47660 -42424 -19831 -6388 -2446
4928 -2446 321 1347 3925 3720 1667 7551 5739 1066 -13430 -10221 -547 -5373 3230 346 31780
4913 31780 2240 -18515 21518 44482 -8066 -33678 -40219 -45482 -38384 -43329 -57800 -45093 -32295
4900 -32295 -1825 -13867 -29510 -42880 -41802 -28322 -22114 -14202 -31261 -10327 -1700 8036 -23159
4887 -23159 -48923 -12664 18528 19459 -917 -26616 -37665 -28868 -12496 -23930 -64784 -48064
4875 -48064 -10317 -26288 -16838 -8287 -28510 -49264 -23834 -4982 -12385 -18814 -8189 -12028 7189
4862 7189 6300 -15648 -9391 -16932 8143 4670 -9778 5150 -472 -17885 -12486 13166 12368 589
4848 589 -30265 -47791 -26794 1374 37832 53276 39526 20403 -26886 -48279 -70792 -82417
4836 -82417 -60852 -44274 -25306 -10407 -5142 -32453 -60942 -33178 4094 16338 408 -6100
4824 -6100 -6869 -1476 -304 -10827 -33894 -27851 4027 21740 18817 -858 -34604 -54410 -66893
4811 -66893 -48744 -37621 -32308 -30891 -12204 10840 16508 -3780 -17355 -20405 -20219 -48201 -32082
4798 -32082 -12060 -32071 -34037 -41340 -27946 -3051 2627 -18446 -13210 -9102 -27909 -29216 -13742
4785 -13742 -19692 -34029 -28307 -40785 -40820 -11118 -11027 -18968 -8809 -26922 -21632 -18524 -22040 -9638
4771 -9638 1982 34433 30179 14456 16482 11905 26277 20356 -12803 -40442 -32335 -1070 10587
4758 10587 1613 18887 24917 11802 15338 14986 17457 -13009 -26793 -18942 -15636 -22869 -783 21607
4744 21607 -14391 -44561 -37985 -17178 -6261 14486 9756 -889 -16744 -10334 -10663 -5912 16522
4731 16522 49694 29098 -16808 -18597 -25908 -37599 -22850 -15213 782 -8879 31099 50520 34372
4718 34372 21639 13399 9850 -6049 -9723 -15901 -25017 -6899 4857 3248 8408 4774 3496 -26547
4704 -26547 -35555 -17408 -10660 19968 30060 10044 -3903 27282 39386 24334 1265 11504
4692 11504 10431 6431 17250 17763 -3465 -13146 -17662 -16796 -3399 -2244 -7276 -21447 -14214 -13784
4678 -13784 -33349 -15275 10426 17769 16335 21996 3884 -12582 -13561 6230 27619 18923 18518
4665 18518 4677 -17915 -27648 -2587 -2720 -20947 -18801 -24302 -76 12301 17935 4770 2092
4652 2092 -5671 -9307 -14057 -11740 -38342 -37996 -44265 -63163 -46384 -49763 -44256 -33171 -12346 -3910
4638 -3910 -16482 -13665 -11200 10037 -11491 -33272 -4772 20320 -294 -26874 -35154 -24516 -6754
4625 -6754 21265 29525 15674 -14821 -17975 -9231 -21411 -31145 -37854 -29983 15883 7493 -32785
4612 -32785 5770 26563 -11904 -14013 15876 17893 -17028 -18493 3420 12924 26352 15689 16374
4599 16374 9311 24678 24452 -8702 -9498 2199 5254 20192 36366 23565 8350 2757 9299
4586 9299 8021 -196 11068 10257 -29145 -12353 22676 37073 22004 32633 3254 -19134 -957
4573 -957 -16105 -21888 409 -4974 -20499 -18134 -24692 -9948 28940 13912 286 7759 17285
4560 17285 31603 29898 4778 -41401 -18955 -3774 -15727 -24098 -30419 -25551 -27830 -33429 -10779
4547 -10779 -33528 -45038 -13459 -6678 -6175 -20611 -24478 -21628 -16542 -11971 -23406 -9431 -5749
4534 -5749 401 -30044 -59735 -40700 -32475 -34337 -14750 -7198 -28216 -16182 -12365 -8415 -24232
4521 -24232 -24164 -16046 5540 22674 -2211 -3525 -15554 -18701 119 7935 -11446 -2973 30183
4508 30183 9195 3312 1348 7693 19968 440 -17034 -49884 -64184 -36308 -3350 4468 20124
4495 20124 12464 6569 1619 -19874 -7538 2427 8212 -4430 -5528 -3378 26220 14916 -13198
4482 -13198 -26348 -19643 9066 14516 36777 24327 15979 32114 34676 25701 26024 13434 9091
4469 9091 9295 22783 -22832 -32113 37055 67534 57899 25548 -20549 -29774 -24859 -18314 -34802
4456 -34802 -1791 19397 27767 50481 33713 6427 -15324 -33395 -20692 3828 8079 -11107
4444 -11107 -20683 -22168 -8096 -58 11751 -22446 -28333 -17873 -27141 -43479 -22176 24134 47220
4431 47220 37616 22434 -847 2790 -48038 -71709 -34280 -2634 -248 -4976 -8676 -6911 -7379
4418 -7379 -5934 -13181 -6628 20150 32844 11553 15158 31369 16355 6492 -17871 -15092 -5969
4405 -5969 -15645 16858 27969 14899 20384 23087 8998 -2467 -28669 -54800 -46424 -36917 -48478
4392 -48478 -32240 -1512 -6019 -42378 -44402 -31661 -7307 10628 32658 44470 11147 -20361
4380 -20361 -47999 -66821 -45613 -25961 -23520 -31234 -31337 -27979 -36942 -17683 -11074 644 -35820
4367 -35820 -42305 -38516 -30616 1791 9985 -36389 -56138 -58429 -22242 -28810 -33632 -35257 -31605 -18264
4353 -18264 -19568 -6092 -612 -18966 -29360 -40255 -20952 -14919 9687 17246 36985 34280 21974
4340 21974 -7444 -31891 7143 11130 -8657 974 12743 31715 14446 -4228 -31546 -21439
4328 -21439 -23301 -23639 -15920 -28479 -31688 -53468 -61746 -45426 -12785 34806 52591 37115 5707
4315 5707 -10394 -1440 -8311 -31321 -31940 -28045 -32656 -22044 -17590 -14816 18819 21308 1729 -25287
4301 -25287 -30311 1312 7182 -956 1119 11664 11100 -1947 -10710 14941 28035 28516 35274 42200
4287 42200 32777 -2907 -21813 7698 16744 38145 22000 25901 18744 11636 17819 16337 -1613
4274 -1613 -45032 -33358 -25156 -11370 9856 8585 336 4633 7896 -4682 11561 9514 -7886
4261 -7886 -16489 -26999 -12792 -15251 -25255 -3411 25565 -6502 2437 7346 20528 4808 -28837
4248 -28837 -32779 -14696 -3217 -4469 -2262 12001 16321 32194 29663 37110 633 -52348 -18656
4235 -18656 4040 9561 -26050 -38037 -27435 -8857 -8407 4905 50113 68801 55955 19954
4223 19954 -10282 -9910 14583 4832 2911 2214 1729 -18598 -10101 -16727 -19145 -9410 -11641 -21854
4209 -21854 2304 13090 15425 26216 12728 13315 -21743 -43218 -41633 -19855 -2130 21283 7620
4196 7620 376 -21865 1479 2543 14238 11053 -12307 -14718 -3231 24092 35528 17727 12196
4183 12196 13843 -3919 6900 12694 21112 25226 9722 20833 2235 -19484 4149 19429 24988
4170 24988 -937 -17743 4138 2886 -5559 -10241 -6240 15040 -5903 -37248 -9209 11701 -1590
4157 -1590 10799 3287 5427 21263 25539 25797 17610 9914 -3477 -11411 9457 21949 27352 17317
4143 17317 22709 8858 -20561 -26987 -19793 -22925 -30539 -36151 -17671 22420 11291 -25507 -38357
4130 -38357 -26088 -4577 26828 35774 33538 35752 17329 -11741 5675 4258 -29251 -34668 -44887
4117 -44887 -23893 -22433 -30150 -37495 -11223 17555 15091 5243 5159 15715 -7222 13547 34011
4104 34011 49427 13286 -3484 -14285 -34873 -43776 -57102 -79522 -76313 -42299 -14053 -13889 7272
4091 7272 -15730 -22599 -25416 -10966 11847 26038 45966 58142 66613 72661 45263 8303 -162
4078 -162 42533 71501 36526 13602 2522 -3415 -1877 -29451 -34602 -43315 -30141 -5950 -8827
4065 -8827 12733 36452 41081 34255 18987 -10423 4460 -7521 -12655 -27113 -27512 -20846 -34852
4052 -34852 -43628 -24824 14571 39350 36153 18452 -3146 -12330 10201 3317 285 28101 22307
4039 22307 15084 -7108 -23161 -30553 -38255 -62146 -63265 -47619 -56251 -67133 -55337 -50400 -36815
4026 -36815 -21647 14799 7658 1800 -7828 -21341 -16095 -3191 -8174 -5128 -9834 18261 14216
4013 14216 -20712 -22528 -32597 -32354 -16464 -4748 -20187 -19448 -18718 -27298 -17349 -15468 -33284 -27536
3999 -27536 -16229 -27627 -14558 8739 24542 14534 -24155 -27237 -28174 -43270 -25197 -3897
3987 -3897 -13676 -2859 7658 -6979 -18973 -20275 13635 41557 34885 24088 20696 28145 53579
3974 53579 42830 8670 -422 5500 -1804 -7994 33112 37193 18871 9569 -821 -2928 -11730
3961 -11730 4434 11875 22344 5808 12530 29179 1438 -12417 1299 18989 -13990 -33048
3949 -33048 -23821 -28544 -7295 -11274 -38231 -47753 -38654 -29419 -27878 -49330 -29895 -11393 -10574 -613
3935 -613 23490 44329 28123 27064 -145 -15108 -6674 -3417 -25632 21239 29728 -5959 7034
3922 7034 22103 11034 -998 -8268 -7695 -31491 -53635 -39691 -14729 -2599 9089 13667 26932
3909 26932 12034 1643 8580 25496 27376 38386 69392 92420 68722 47388 42051 43606 27605
3896 27605 -174 7072 14532 265 -642 -2363 -25839 -40137 -30704 -16666 -15589 13314 15878
3883 15878 -6449 -32874 -34430 -8704 -3481 -2335 -1225 22311 48123 45664 19203 -12619 -30802
3870 -30802 -13699 212 19196 22775 47371 56045 31607 34249 44228 5563 1835 22665 50389
3857 50389 20938 9758 -4512 -1427 10361 15034 3962 11354 30998 51768 28923 7036
3845 7036 12021 29395 47902 35829 28060 35857 28769 19499 17695 -4859 17955 15989 -3930
3832 -3930 952 1885 -6371 -29199 -30389 -4704 664 -4863 3379 -3962 -14759 -4665 11344 7336
3818 7336 9665 -1287 15044 21160 1933 2650 15723 5783 6485 -2662 -22359 -43184 -39534 -18696
3804 -18696 -10929 -15466 -16153 -7788 24477 31218 24208 23988 24203 37821 3029 -3088 -8489 -42681
3790 -42681 -21256 -8177 10557 26664 1189 -7285 -15471 -40114 -34642 -36795 -26312 -17815 -35325
3777 -35325 -67010 -71232 -37163 -8373 12262 19933 22715 57120 40059 -11506 -39387 -43667 -13283
3764 -13283 9595 19044 -6838 -18037 -13205 -30425 -27358 4569 9154 7084 20516 22472 20680
3751 20680 13139 13942 6961 7643 32582 30594 15258 20776 17787 1324 -9286 -39011 -47192 -8383
3737 -8383 -11650 10836 4700 8909 12011 654 -18822 6066 20075 22135 7896 10210 11876
3724 11876 1506 -26366 -24078 1380 -10292 -20264 -9325 -795 16221 16554 12487 -6007 -22174
3711 -22174 -18540 -25458 -35765 2609 32056 19982 2677 -5519 -16505 -27669 -17802 -6210 -27571
3698 -27571 -11812 -7406 22384 30442 5825 -24152 -12345 352 11169 -1967 -8015 -18042
3686 -18042 -25333 -9095 -1665 32212 63538 85782 94005 51134 -1948 -31005 -17455 19279
3674 19279 26607 11750 16023 6640 21183 30768 32141 62 -31296 -45128 -40405 -31544 -40769
3661 -40769 -34927 -32407 -43712 -42123 -34480 -27143 -25572 -17440 -14475 4545 1655 -20142 -13865 -22004
3647 -22004 -30574 -35677 -27510 -28226 -38894 -43003 -29670 -4053 20545 17205 34645 49869 47796
3634 47796 22734 14270 25199 37908 34892 45273 28550 23371 29300 24587 12772 13031 29029
3621 29029 36281 27977 5532 -6458 -31746 -12138 13800 29446 10853 23991 41653 41743 22207
3608 22207 -5093 -1623 6772 8886 -8767 10969 18810 -1149 -3588 -9993 -10901 -11469 -13497 -20878
3594 -20878 -35341 -52836 -55917 -25070 -20827 -20556 -13279 3232 -37588 -59361 -52228 -32098 -26968
3581 -26968 -266 16931 -12868 -17987 -4509 -17396 -44706 -40975 -59284 -36148 -4430 -9662
3569 -9662 5300 32919 40516 28177 36394 33507 12908 6655 7735 16549 31697 26249 7461
3556 7461 29115 11529 4059 39750 50784 58443 45060 46604 34496 12644 11783 835 -5935
3543 -5935 2429 -3188 5717 -13821 9263 9092 -23673 -31881 -6222 3062 7219 5911 16527 -1818
3529 -1818 -28608 -29193 -50431 -42998 -24525 -4257 -25500 -28246 11145 28374 26043 29688 22468
3516 22468 1391 -18406 -23004 -3181 625 -2450 -6449 -5237 8119 15306 9603 20998 18563
3503 18563 54353 67559 62063 50154 18957 -1689 7067 8357 17893 27839 2162 -29344 4717
3490 4717 30346 26982 32983 41069 50048 55142 57707 52015 33025 31376 25502 16386 10826 30342
3476 30342 7911 3268 44297 73622 69213 23852 10840 14479 42440 38771 18201 1725 2150
3463 2150 -4043 4402 13845 24846 14322 2189 -4250 -2315 12659 3184 -15536 -6840 -3914 -13215
3449 -13215 -8283 -10774 -3101 12432 -1588 -29731 -36693 -47401 -20549 -16700 -39935 -45151 -49105
3436 -49105 -51385 -29093 -9679 -240 -14407 -30124 -17030 -4957 1638 3877 8366 -3771 11134
3423 11134 20088 -2087 -16452 -27163 -28047 -4129 15053 -2382 -34962 -34418 -20213 -11897 -20180
3410 -20180 -8444 7357 -7476 -26443 -7513 1469 -1805 16762 15595 -9290 -14244 10952 45964
3397 45964 43255 29490 19120 1078 -5143 -14379 32834 33717 25665 2378 10670 8895 -11406
3384 -11406 -2273 -16013 -5926 -4549 17154 42970 93020 84181 83358 73349 42020 15658 17631
3371 17631 17203 35012 439 998 11386 30446 35566 57202 53762 37926 -3754 -41084 -34842
3358 -34842 2948 15116 -6273 -4574 18422 20060 -2548 -13563 -15540 -20523 -7012 27711 32412
3345 32412 1040 -27302 -21593 -27880 -4224 -4184 -27319 -25849 -5248 -13945 914 14216 27863
3332 27863 18480 8456 -7067 -17420 -11789 -19795 -27509 -47483 -36074 -29985 -19245 46021 53212
3319 53212 41720 29064 7944 -9780 -21598 -30632 -12340 -5942 -33355 -26829 -16883 -3917 9617
3306 9617 14843 7997 -6689 5651 17613 24290 20004 -23758 -32257 -36771 -33428 -26095 2608 17784
3292 17784 18047 9065 22593 16949 22988 40759 34289 24067 17728 -7558 -19704 10696 14159
3279 14159 3376 -10468 -11711 -14471 -6162 3187 -7638 13214 1510 -2227 -9168 -5451 -19109
3266 -19109 -7898 -17494 142 -16242 -35059 -38849 -26202 -2171 30887 24268 -14436 -31048
3254 -31048 -26263 -18395 -14829 -14966 2585 -9662 -23189 -25617 -29157 -2966 -13029 -5178 20891
3241 20891 25898 -2511 -28078 -4339 3964 -15647 -24526 -18997 -43925 -55003 -52900 -37431 -46699
3228 -46699 -23493 11455 7011 -6787 -18641 -16423 18531 13418 -21552 -35169 -51375 -42175 -57334
3215 -57334 -41358 1019 1600 -2412 10413 10109 -3729 -26473 -34992 -21861 -34005 -47635 -74889
3202 -74889 -75195 -52635 -30210 -28749 -28907 -1792 7568 -6039 1412 10101 14763 14693 -14240 -30860
3188 -30860 -15093 -7494 4470 -10958 -27210 -15714 -9473 13246 24273 44201 45573 19619
3176 19619 -882 9878 13428 12408 4344 -26508 -10755 16063 36824 29821 15043 26555 25319
3163 25319 14008 7890 -10921 -21076 -24518 -30822 -18423 -18907 -45499 -47989 4923 35322 26475
3150 26475 15780 -14658 -23718 -5301 -104 6584 3214 9051 -7176 -21107 -19450 -18800 -17860 -24250
3136 -24250 -20333 -2187 230 -13716 -49943 -49860 -16206 21048 57686 50484 30141 -10069 -23834
3123 -23834 -30423 -11937 -7111 -23945 -11603 40339 44157 46281 27144 -9091 1688 -21285 -18351
3110 -18351 -9270 -17 3740 18082 15726 33457 38540 16772 3024 -24153 -56411 -36580 -26178
3097 -26178 -17090 -20666 -25020 8902 17537 30244 42687 32562 6798 9300 15711 26470 36242
3084 36242 35113 27569 60334 76323 48751 53079 69398 37246 34816 72313 58241 29184 11324
3071 11324 858 -21315 -9906 -19975 -30726 5108 16975 17340 31871 42790 55365 24944
3059 24944 -46346 -70683 -65623 -58224 -48534 -30625 -35027 -34785 -16649 8291 17960 19042 22134 3366
3045 3366 26105 43124 25010 -21767 -35056 -31778 -34026 -36557 -17952 -7979 -42387 -54370 -48160
3032 -48160 -63207 -49657 -27265 -26193 -10384 16638 16132 31019 31376 17186 13739 22727 67232
3019 67232 72904 60772 49274 38286 24179 28538 41414 50845 31469 -23326 -54627 -41382
3007 -41382 -31342 -24221 1052 30302 25250 36315 14547 -5821 -7376 7483 18811 14747 12489
2994 12489 3912 -25758 -3616 3286 1895 16222 14645 -8097 15301 -526 -32180 -40182 -11690
2981 -11690 -2043 2193 -24132 -28713 -13274 8912 -2183 -4157 3726 10207 13781 22286 23972 7256
2967 7256 -4955 -14294 -6982 6734 -18173 -25480 -24296 -6739 13306 14591 60395 85707 82176
2954 82176 27330 -5308 7509 20578 6024 7456 5577 -5160 10295 -9882 -18231 13895
2942 13895 18820 -2336 9674 1643 4248 26726 42786 36555 -10710 -20457 -13310 -1061 -2698
2929 -2698 -20078 -31392 -9279 26709 1753 -30621 -31366 -21005 -23108 -25708 -16172 8785 -764
2916 -764 -12814 -20390 -1922 -16643 -32064 -66074 -74171 -61055 -70558 -37796 -11929 -1596 -5974
2903 -5974 -24293 -12060 -1328 -3268 -28078 -9394 -16765 -19210 -5933 12319 27285 28495 25062
2890 25062 10561 8606 20802 42629 57245 18580 -7649 -9205 -1303 3977 6176 17807 25433
2877 25433 36443 36383 31939 34870 21444 17554 12871 1766 -8716 1838 11928 33 -4279
2864 -4279 1230 20604 296 -3474 -2634 3999 14384 -402 -14839 -28978 -38232 -40662 -46693 -37741
2850 -37741 -12963 10935 17767 26191 33035 9224 42996 52914 35947 46761 37931 42444 21695
2837 21695 -6072 18512 12289 3070 -686 12842 19113 3312 1890 -5113 -10580 -20827 -27945
2824 -27945 -39892 -40690 -33709 -41769 -9885 27431 7803 1010 9183 20971 14053 -296 818
2811 818 -2815 11890 20616 21606 7177 17090 16475 346 6764 1314 11828 11963 -12148 -12233 -7665
2796 -7665 -3921 -32527 -34726 -6320 21750 34427 33234 20731 11381 803 -13418 -8501 5370
2783 5370 39191 17042 -8650 -28354 -27332 12706 27299 3563 2115 734 -27421 -28363 -18779
2770 -18779 -480 13692 17942 24221 27247 19730 -6269 18679 32759 13588 20941 15502 -8393
2757 -8393 5561 7043 23221 -1896 -10485 -11770 4105 -355 13227 14988 -10728 -34076 -19507
2744 -19507 -25024 -27541 -37653 -33450 -11480 6143 21684 16996 26681 21033 17574 5054 -9097
2731 -9097 -2983 22626 7544 17183 31540 30819 19763 9070 19501 16947 -6014 -28259 -42364
2718 -42364 -44029 -34243 3660 5623 16563 20704 17498 17865 -3199 1373 -3554 4310 5703 17980
2704 17980 43902 13338 -3974 -363 -9043 -9108 -18018 -10544 -11173 -5408 18867 53243 36331 10703
2690 10703 -5613 -7388 -101 6031 153 -12982 24751 24990 15904 11959 8443 -6325 -43992 -41107
2676 -41107 -13855 -4912 -1537 -27766 -26445 664 -3976 -19392 -11993 -6255 3044 -9761 -26366
2663 -26366 -41150 -44567 -23146 -9251 4996 36 -8874 13576 36227 22428 -1827 -25641
2651 -25641 -28079 -13094 13790 16708 3428 -560 9656 20109 44672 16870 -5288 11154
2639 11154 23179 12386 7140 -5657 -17176 -26764 -28168 -11763 -7204 -28774 -11578 17199 17535
2626 17535 30470 42762 24129 -15693 -36119 -47482 -34468 -34504 -23052 3648 -9861 4030
2614 4030 40337 36528 27281 8686 3041 -2118 -21341 -1811 15362 29696 16751 21320 -19240
2601 -19240 -36063 -8075 1768 -1556 3401 -65 -2708 -14320 -29070 -22937 -2782 -2514 4935 30168
2587 30168 8408 4772 -12019 -28485 -9477 6504 27974 37827 17146 -7990 -36705 -43767
2575 -43767 -34394 -5582 12138 8262 14444 11680 429 -8071 -23251 -53312 -59955 -64081 -53264
2562 -53264 -39831 -48339 -18395 -19914 8571 24570 19783 16579 -3916 -19367 -12957 4396 30453
2549 30453 26918 9541 28777 28611 6793 -26035 -14205 12786 1750 17822 50928 36116
2537 36116 20957 40994 8207 -24532 -33259 -10579 -1024 -25054 -10488 17307 44354 44829 10239
2524 10239 -24412 -22268 -26803 -58724 -64592 -41453 -17179 -4614 10478 9216 -1633 10124 16214
2511 16214 6353 6519 12586 15784 -6333 5973 2384 -22103 -25281 -37570 -36554 -29858 -26761 -30389
2497 -30389 -52666 -72665 -75090 -32822 -377 15299 2779 11793 6169 10323 13560 -435 21953
2484 21953 36575 25644 1470 9194 4878 10418 -7070 -24715 -5827 9236 -1657 -3802 17540
2471 17540 -2448 -35092 -35968 -39734 -33317 4029 9194 7964 13217 -6247 -26876 -36922 -6524
2458 -6524 -14049 -7366 10478 -4812 42276 55967 42234 34484 35213 -793 -24123 -26745 -15618
2445 -15618 15106 31130 19713 15762 -7797 -927 12768 20935 4908 -9034 -28334 -44938
2433 -44938 -45263 -53068 -64994 -72479 -50927 -18496 21266 28656 18182 -841 -11827 -12832 -12694
2420 -12694 -27376 -57706 -45937 -5420 8182 18600 27465 35072 14478 7900 16233 7054 19730
2407 19730 5225 -8612 -21625 -17903 -31797 -27810 -3530 10462 -44 -5828 11137 9284 -15345
2394 -15345 -22332 -9448 -22961 -41716 -39148 -14397 9770 25422 15120 2835 -7033 -21652
2382 -21652 8839 29664 33003 31626 25843 26198 22256 7997 -13136 -2641 -10023 -7141 -5043 20961
2368 20961 29715 21755 11236 -6104 -23527 -33361 -43423 -42848 -22599 -28821 -5371 523 52 -792
2354 -792 17346 -11581 -6169 8219 -17566 -36201 -26433 -18875 -20448 -22950 -25924 -44027 -69597
2341 -69597 -35803 4110 12177 16414 37223 38508 50289 46237 24469 33935 22325 -14035 -20569
2328 -20569 -21515 963 23500 26376 9123 17184 8633 16197 569 5734 18584 -2656 -4835
2315 -4835 12839 45416 30878 17162 1244 9509 5152 14861 25892 42147 48200 47898 42170
2302 42170 31566 25534 25934 5990 -8545 -9916 3421 21068 29899 23273 6271 -11406 -378
2289 -378 -6287 5132 23350 45598 50506 35489 28948 24100 35702 12644 5297 24359 53306
2276 53306 35443 15848 19883 31760 42176 35855 36606 19256 -3501 -2599 -33756 -59616 -34669
2263 -34669 -16376 1237 -9163 -6551 2049 -9181 -13898 -8597 -10410 -2646 36813 47652 42980
2250 42980 13302 8924 -15612 -24836 -19563 -31083 -37214 -14895 -3854 1158 21587 7171 5203
2237 5203 -8146 -28585 -6100 -12432 -28458 -28292 -10593 -33448 -40586 -11816 -3506 -7496 -5302
2224 -5302 -26428 -24163 1413 8397 14596 10279 -2367 -9625 -16855 -10641 -20124 -16513 -39826 -7479
2210 -7479 -1844 -202 7450 3053 -232 -11140 289 17542 29253 35564 41206 37885 16683 10359
2196 10359 12609 17258 20286 -13345 -28421 -53814 -39648 10762 41449 12964 -4349 3363 17917
2183 17917 26127 15888 -7018 3503 2779 786 7842 2189 -8359 -14525 18421 9314 2299 -6389
2169 -6389 7963 -26818 -39607 -26605 -4065 30218 25460 -33568 -49635 -52061 -33698 -37872 -54067
2156 -54067 -10479 -888 721 -11071 -17959 -20821 -4476 20354 3158 -11424 -6722 -16554 7245
2143 7245 18319 44068 35678 671 -23546 -2197 8593 -16040 -64753 -50574 -9270 26025
2131 26025 7810 7775 -12913 32199 51408 72592 44047 43842 58173 35364 32061 30741 6874
2118 6874 -19794 -16394 31198 55572 51009 -8665 12281 22269 11557 1924 10947 5207 -22868
2105 -22868 -26127 -35170 -29658 -27566 14549 26612 10636 5250 4715 13882 10052 10051 -11451 -9421 11271
2090 11271 8745 4182 12491 9744 47207 55547 40931 14986 -18978 -45759 -33363 -3160 46406
2077 46406 64892 43840 57977 46190 27500 -4537 -32919 -41638 -28178 -29433 -19887 -46779
2065 -46779 -55632 -40671 919 4968 16358 2973 9461 12420 -3129 1154 1008 13618 18362
2052 18362 8607 -24703 -12703 12039 10858 4475 -45916 -39576 -21975 -41430 -35830 6707 -10170
2039 -10170 -29410 -21579 -16713 3732 -306 23348 34957 26640 3113 -23283 -35091 -38251 -26399
2026 -26399 18131 37145 59934 57720 46262 55268 59846 42688 9979 -25182 -11337 5980
2014 5980 22018 23675 -6675 -24811 -13948 -17884 -34041 -29641 -16745 -7753 6653 43628 48726
2001 48726 42025 42069 9101 -1142 -15200 -35815 4263 29623 15350 21861 20019 41350 33534
1988 33534 1890 -13007 17012 29710 18533 -18868 -23317 379 17727 19100 40003 62055
1976 62055 44180 9022 21373 -18465 -41068 -45165 -44404 -15484 5170 13678 4404 -2191 1134
1963 1134 7201 4201 13108 19112 4723 -21064 -19966 -7825 -20074 -23179 15237 24113 18832 22671
1949 22671 23992 8892 -9572 12747 -2000 -20413 -19050 -21723 -22836 -42716 -49872 -2981 6392
1936 6392 -25990 -36504 -13346 16804 15747 27990 38328 25882 6989 17017 37735 19808
1924 19808 -13753 3326 2766 -9158 -10515 10275 12783 11550 12668 818 -42470 -31840 6089
1911 6089 -4846 -19801 -18449 -12474 -467 14521 10280 14763 25570 14981 31370 3287 -27904
1898 -27904 -34192 -32014 -23033 -32591 -16234 -6421 -16081 -4017 -33617 -54314 -42272 -17950 -31543
1885 -31543 -46390 -23384 -27445 -55699 -33262 10295 -4062 -1648 43966 34330 12748 23527
1873 23527 11873 13916 27588 25194 17217 9017 13353 14036 20334 5522 -11810 -10144 17957 32054
1859 32054 -3423 -21416 -22263 -38052 -41200 -11792 11911 -18 -24543 -38782 -30940 -23100 -9383
1846 -9383 11012 36343 34441 42222 51431 39561 6600 186 23366 20828 8178 -4918 -14096
1833 -14096 -38480 -11838 -6585 -14027 -27853 -1940 32275 47144 33272 21670 14694 -6510
1821 -6510 -27042 -25149 -23955 -16236 -7838 -2325 -541 5917 5559 -30500 -756 30514 24993 -19503
1807 -19503 -39867 -29186 -23005 -30601 -16374 -15226 1184 -28196 -11110 4063 20389 41296
1795 41296 29380 1910 -22671 -22432 -47216 -74796 -47245 -30924 -32217 -15254 -4767 -5278 -32945
1782 -32945 -18249 1581 7488 -7878 -1082 -14044 -4657 35480 23406 8948 -4443 -1901 6678
1769 6678 -19164 -19572 -16176 -19100 -7953 19734 28060 4915 -20728 -45274 -43002 -28770 -2933
1756 -2933 18026 19961 46417 57861 51378 38929 27803 19952 9373 -4879 -9782 7084 5690
1743 5690 10873 15314 15279 50180 71064 23288 12019 -6603 -40456 -20979 2718 -31507 -26316
1730 -26316 -4350 12265 11861 35221 43012 35298 28047 17492 16660 41342 59573 52972 32617
1717 32617 26128 -9286 -12570 -14862 2641 -29301 -33266 7302 12473 -10230 -21213 570 17092
1704 17092 35357 11806 6579 1305 10427 10175 10489 23271 31934 25780 17889 4762 -21565 -29431
1690 -29431 -29696 -7565 12547 10927 -1750 14622 38528 33383 30362 6424 -15845 -35009 -41075
1677 -41075 -4303 -5804 -41735 -59900 -40838 -17554 -9524 -1558 5441 -50063 -57517 -38532 -12931
1664 -12931 -325 -5708 -3822 -2938 -11607 -10852 858 -27892 -52342 -47572 -54865 -67201 -64983 -5705
1650 -5705 26205 24660 47351 24835 13263 43954 63764 46757 23358 22417 33288 17546 13685
1637 13685 39932 61771 57416 37038 40793 26141 13098 37609 54702 53341 41729 23380
1625 23380 18104 25996 18582 25075 51077 75303 55985 31948 3931 -8993 -5027 23510 24191
1612 24191 -9744 -37835 -25573 -18213 16218 12974 6148 31977 29559 42894 46173 42842 47293
1599 47293 28955 6879 13755 340 14130 45127 16870 -15534 2319 12539 -8209 -22457
1587 -22457 -23187 -8497 3240 29715 27402 11114 -933 11261 23524 22726 6333 -19402 -42544
1574 -42544 -33206 -8434 19558 20324 13057 -4703 6642 -177 -21476 -1704 10242 -29173 -44821
1561 -44821 -37010 -28801 -44283 -28490 -13968 5235 36943 59931 68018 67152 34972 11017 -9590
1548 -9590 -34739 -40597 -49511 -44220 -52980 -30390 7903 22500 11278 -13915 -988 642 -19758
1535 -19758 -11029 -10118 1030 8632 -30072 -64516 -71610 -58693 -57517 -73763 -75188 -19715 2747
1522 2747 3346 768 22595 25541 5623 -6598 5041 5508 -2533 -10410 13446 23757 -1335 -8489
1508 -8489 -6678 6993 22895 24922 -3810 -15646 -12160 909 -8130 -14735 10312 26090 30216
1495 30216 16169 31640 183 -49285 -26066 23573 50467 50067 39024 42353 60827 73809
1483 73809 56357 29208 27304 29353 1171 -1443 -1999 -11543 -17375 -6640 18064 31775 46392
1470 46392 43759 42758 15893 -37228 -39848 -12276 -38373 -16067 16481 20286 15856 -10371 -25656
1457 -25656 -21697 -9531 13557 9306 133 -846 -792 1948 -15637 -19652 -14994 -2437 -6440 -5822 -9605
1442 -9605 -11010 -23613 -36042 -55726 -16516 15323 1155 12109 -5740 -14642 -40483 -32826 844
1429 844 5864 457 -6209 -14580 8409 29798 45685 24171 33763 30437 17990 10571 13973 29293
1415 29293 10546 -10753 -2353 5092 10484 10928 889 -16470 -29950 -17378 4129 -8809 -32165
1402 -32165 -19369 -7210 -18344 -30855 -33243 -8553 5602 17065 18276 11029 14238 -10490 -21775
1389 -21775 4423 25469 29335 8803 -17637 -32076 -3368 19252 8779 3428 12393 42850
1377 42850 50625 51997 32084 28416 34155 29076 4390 -3130 8565 16727 64596 91806 83979
1364 83979 57148 30378 12381 10192 12708 -1960 -34241 -55124 -38888 -14089 -12870 -52178
1352 -52178 -48220 -8465 17408 24006 21866 -1032 -3001 8129 2268 16764 23632 42340 48487
1339 48487 57558 56611 28114 9489 27446 13890 -18715 -26187 4217 23091 33938 36551 15595
1326 15595 23637 6478 11837 5460 -3772 18117 20963 5176 -19809 -22696 -20389 -13057 -2378
1313 -2378 -3698 7236 16400 12618 10511 17604 9894 7552 3849 -8189 13524 42592 26652 587
1299 587 4676 9889 28019 36363 37515 48553 57769 47581 12347 -5640 -10037 2920 2912 33823
1285 33823 31238 427 -3523 23434 21899 -1527 -24677 -23640 6882 20301 22762 36234 21317
1272 21317 22185 11304 3569 5951 -19149 -692 12788 5416 -17167 -28081 -8717 16557 18306
1259 18306 10298 18552 16717 -4869 6327 21709 7752 21291 -8868 -27808 -2838 892 -16218
1246 -16218 -14294 -3232 905 15513 7653 -7658 -42256 -22783 -4430 -940 -16354 -12340 -5793
1233 -5793 624 18954 -1657 5912 43452 64788 51275 47570 70550 59792 42038 42969 33386
1220 33386 10202 -8958 -16197 -14175 3124 39797 52526 69272 66419 53396 18137 -1173
1208 -1173 2975 -5796 10917 15414 1334 -19969 -17264 4350 23740 31514 18479 14919 61
1195 61 -30290 -34461 -19366 -16909 -36086 -38551 -8913 8235 -9858 -19164 -5640 26160 27584
1182 27584 23296 -7584 -8191 7962 26871 12295 16994 25699 39463 59617 55610 42371 33882
1169 33882 8145 -3844 11692 4453 -10942 9944 22766 6241 -10707 19722 24045 -5328
1157 -5328 -38135 -30221 -7332 20238 -8321 -24619 -9512 10595 8068 5213 3513 13163 9935
1144 9935 1678 9205 6427 9146 -19880 -19224 13272 31685 47739 48368 58840 29076 3184 -28558
1130 -28558 -21883 -27389 -53080 -53564 -37298 -72 -18104 -18269 1149 3436 -21560 -30060 -2036
1117 -2036 29377 16092 -31358 -36476 -12942 5786 -2814 -17637 12152 20645 4345 1815 23657
1104 23657 25404 34107 23405 -624 -8922 -19649 -12705 -35 1321 11466 14135 -4129 -344
1091 -344 6539 30874 19025 2955 7307 -9723 -15036 -8831 32163 47228 1100 -18083 9505
1078 9505 26954 19770 3473 -6196 25108 59227 70036 70499 55956 48690 43104 9844 -24916
1065 -24916 -12770 39193 51333 16561 18574 17120 -12082 -1189 -2776 -4149 11096 -633 -18708
1052 -18708 -27029 4954 48586 52287 8135 -9792 6103 -10933 -7726 -1955 1748 -12741 -26331
1039 -26331 -43982 -38005 -18538 -1099 25481 -1286 14352 32743 24349 -9025 -3413 -38027
1027 -38027 -51588 -13986 27435 -18091 -36530 -23452 -8312 13093 20837 8199 -2269 3918
1015 3918 -97 3561 -2942 -38350 -38481 -31088 -22350 -37224 -40211 -36961 -27360 -39502 -20173 -18161
1001 -18161 -45456 -35367 3141 15342 -109 -4135 29777 56443 28224 15361 15110 11497 18130
988 18130 32058 10682 22532 21705 27719 35714 28935 3260 11820 45940 49429 35594 18989
975 18989 4101 20940 3457 -7989 -27551 -30077 -29456 -38970 -63405 -39488 4584 -20978 -45642
962 -45642 -55717 -31519 -5132 1620 8844 -770 3426 16549 -9816 9924 8697 -17381 -2379
949 -2379 42487 34148 -9 5381 21923 22101 -5669 -25463 -15256 -11777 -27959 -9593 49052
936 49052 67898 33846 -1031 2651 11202 5756 -13135 20161 43488 12341 -6378 -3833 -1241
923 -1241 -2626 17329 34057 16289 -15122 -10916 1687 -13951 -11450 -25215 -36674 -42773 -56510
910 -56510 -80068 -67502 -19986 -5791 -22033 3578 29851 9233 -1820 15722 13819 12450
898 12450 19411 12311 8253 -20421 -26741 -8979 -11396 5506 54249 34584 34919 37068 39824 30278
884 30278 7515 -9902 -9524 -1078 -12195 4044 -7725 -41136 -47893 -46339 -51290 -33533 -26320
871 -26320 -30308 -31758 -38530 -21214 -26064 -23860 -13184 -21362 -9063 -4193 14322 24101 28296 27381
857 27381 19222 6079 10366 34974 34316 36382 42825 41862 15066 11385 5118 4098 29568 32297
843 32297 34106 27845 9228 -5710 12052 3469 -23216 -26786 266 29413 24705 21678 31099
830 31099 48115 21591 -5520 -2962 -2037 -6515 13868 22808 -8048 -18661 -7562 4710 -6273
817 -6273 11699 8296 -5569 -6482 19644 49081 52805 42338 29270 23550 18193 3012 -8001
804 -8001 -415 15619 10388 12261 27373 23007 6056 -6757 -24023 -34656 -20544 11722 6125
791 6125 4440 7677 1862 9123 -18560 -10886 -924 -21524 10580 40890 27818 26859 28857 11743
777 11743 -22180 -14080 14927 2819 22449 45630 47536 34628 -271 2839 1976 -7892 32
764 32 5614 20696 32506 11624 -18887 -25913 -7953 1468 10402 19195 -10058 -35697 -14743 -13140
750 -13140 -2756 1574 22495 11733 8456 1040 14785 -576 7524 12551 11511 -8923 22189
737 22189 33966 -3744 4588 -11484 -24173 4720 25431 27655 39761 24090 -563 1599 -6606
724 -6606 -8965 -38629 -20226 -14804 9232 23907 16958 -21135 -30313 -23073 -30246 -27857 3173 24976
710 24976 36039 20479 9998 -29790 -45156 -2183 21057 28379 26703 7442 -22048 -3102
698 -3102 31740 25362 -3810 -11962 7311 12527 14461 9881 30801 61457 45888 23349 9841
685 9841 1157 11263 16828 17062 12791 23046 31646 26917 33893 31600 15601 -2984 32184 47568
671 47568 27189 12374 21075 2733 12257 24691 43092 35958 40815 43588 28627 30890 17966
658 17966 33676 7358 5442 27205 36711 51819 87962 77346 43261 37030 16525 7632 -5229
645 -5229 16537 41171 83285 72575 40908 -8379 -27617 7592 22243 28770 31696 7967 1092
632 1092 -10279 22120 21483 -4433 -28952 -39657 -44094 -10906 -5929 -16328 -5506 6463 18177
619 18177 9190 33808 58316 53646 28547 -12262 -1373 -7820 4232 26207 18293 13854 4786
606 4786 -106 12093 31455 33661 22301 3257 32159 10847 -15143 -25335 -12572 -12662 -7775
593 -7775 2837 19227 14623 16528 2920 3638 7846 -13722 -13222 -6585 -20348 -16657 -20841 -26990
579 -26990 -19970 -29353 -36836 -35294 -2463 3590 8142 -4286 -9038 974 -5077 -5443 -19259 -22479
565 -22479 -27455 -18386 -11605 -11018 -24275 -25138 -19788 -45975 -42632 -23919 -6426 10597 15346 -10806
551 -10806 -27041 -15635 -29525 -22213 152 13888 27148 33645 57328 65148 43713 30564 64585
538 64585 73685 48393 9103 204 12381 12733 -2817 -3197 3260 24978 23516 13239 1549 12582
524 12582 25707 30003 23002 43117 55512 30652 29510 29550 27602 9139 1285 -35955 -49048 -16419
510 -16419 -15752 -2801 1037 -9849 -10359 -2110 3783 9896 34348 15098 -14037 -32123 -9512 -6243
496 -6243 -25464 -28289 -14621 -8915 -6102 16951 23008 36449 45550 19144 14668 3441 -28649
483 -28649 -43169 -25713 -12962 622 4867 12136 -6141 -37307 -10967 1562 16132 41946
471 41946 18662 4341 4872 -10351 -17096 19045 41353 31305 10617 -9247 -28079 -40053 -36242
458 -36242 -11376 -20766 -16512 4130 23666 11051 8003 34077 20682 13816 -4339 2200 10940
445 10940 8508 38883 59710 44720 37356 51395 48567 44205 26277 -3879 5065 11564 102
432 102 22275 8937 -10361 -19593 4526 30926 40763 32494 37002 37613 45147 35260 8480 -22356
418 -22356 -40458 -16533 16206 5647 4016 -8248 -16907 -5011 13973 14995 -3096 -1206 -15266
405 -15266 -15582 -7069 -1634 36035 33162 11482 11604 9031 19559 27398 34725 22883 22993 11992
391 11992 -11302 -5017 28090 30772 41293 33686 18007 2973 -14132 -7805 18389 21430 -19829
378 -19829 -19884 13065 31504 30797 6802 -2231 2514 13789 16086 11984 19429 -2770 72 -5450
364 -5450 -14428 -27122 -16541 24956 48037 63381 59747 53295 51091 57032 24146 3105 7555
351 7555 16879 36503 50888 31732 27200 8167 -10247 -12532 -12437 623 -21724 -16164 1569 3423
337 3423 10703 27476 41477 25154 38247 38636 16232 -8904 -31326 -29503 -21806 -376 25957
324 25957 6168 7268 15758 12478 25836 17838 6188 18886 55180 36538 38045 14262 24564
311 24564 40708 49460 30957 32927 17488 13856 -5436 6367 -7301 -28815 -32031 -33802 -25712
298 -25712 -10423 -3619 1922 4301 7403 15424 1884 -14562 18434 29663 3246 -9418 -11165
285 -11165 -4176 -27317 -42200 -51153 -27444 -524 2407 829 20675 44502 35368 17267 -2307
272 -2307 -7249 -4775 4736 -10772 -28222 -15320 1578 16801 -1119 6445 11345 -13549 8629
259 8629 15349 31401 18586 -29397 -5875 9727 12096 15214 40793 26428 5740 5656 9322 23172
245 23172 10659 -12610 -26792 462 5576 -22909 -28928 -8713 11901 12245 16823 15095 -9323
232 -9323 -1226 2221 11214 9411 3568 -5818 -11709 4124 3150 26570 25857 10465 -2397 -1374 5233
217 5233 17164 12431 6272 13798 15801 13803 -3244 15940 9337 -5724 -5997 13063 37851 34257
203 34257 53064 43881 45147 28786 8234 -10744 -7328 3335 15161 -7642 -11426 3351 9726
190 9726 13889 18249 31689 9886 -3956 -19209 -14553 -4888 4852 -5609 -10972 -14325 2906 -340
176 -340 -12493 -12123 -31903 -50617 -41306 -10203 -13582 -20870 -10144 2915 -4171 -20255 -4770 549
162 549 -369 6298 -5762 -1251 18030 9812 -18062 -14207 13239 21261 23040 17711 6101 -3592
148 -3592 12765 33250 26077 19066 19349 14162 11820 19476 3490 -16726 -22805 -27392 -26357 14456
134 14456 27703 29671 23263 29048 22953 10666 9111 29179 30125 -1044 -14515 14474 26570
121 26570 7565 10946 15743 15365 6368 26304 13875 17714 17984 23737 1870 1669 16829 24608
107 24608 39541 50964 53240 37209 31383 19231 -9099 -2760 24201 11672 10090 -6721 -17721
94 -17721 -23027 -16716 -6063 1335 12134 6289 -927 9471 5730 7743 -11667 9601 19253 25490
80 25490 19404 17782 5726 10429 357 -9820 -11701 -6600 2553 9510 1209 -9304 -9719 -2496
66 -2496 -11095 -6962 -1693 6404 10176 6156 4784 18088 7823 -10852 7550 22384 19484 8509
52 8509 14148 19870 26043 24523 16557 1932 -71 -11564 671 21252 34682 31171 46057 47394
38 47394 28534 20381 18257 17238 -19232 -46382 -15585 -14737 -7080 16484 17217 12685 915 -9609
24 -9609 -12690 -10801 -20583 -21835 -16051 -939 803 -5132 5027 8549 25533 26405 9474 20551
10 20551 6549 -8248 -4513 10778 22253 20644 24846 23526 -10160 -20430
0 -20430
$$ Imaginary data points
##PAGE= N=2
##DATA TABLE= (X++(I..I)), XYDATA
32767 138380 133927 122511 104819 82422 85046 94129 97173 71805 84417 109297 123593 112439
32755 112439 106284 105026 103634 105444 80911 75680 86287 105802 96581 84342 101824 115742 123619
32742 123619 117504 116797 126993 119618 102510 101655 123407 123562 115703 106936 88386 102137 128121
32729 128121 147986 157578 147652 153092 175079 182798 174554 150914 146940 150478 148621 139190 147516
$$ [...]
##END NTUPLES=NMR SPECTRUM
##END=
