##TITLE=Analysis number 310947
Compound Code cc 15506
Book Reference 441/83
Project Code adrs
Chemist Name colinb
##JCAMPDX= 6.0         $$ Bruker NMR JCAMP-DX V2.0
##DATA TYPE= NMR SPECTRUM
##DATA CLASS= NTUPLES
##ORIGIN= Bruker BioSpin GmbH
##OWNER= NMR
$$ XWIN-NMR		Version 3.5
$$ Tue Jun 28 10:16:29 2005 GMT Daylight Time (UT+1h)  MAYBRIDGE\NMR@NMR_250MHZ
##.OBSERVE FREQUENCY= 250.131544655141
##.OBSERVE NUCLEUS= ^1H
##.ACQUISITION MODE= SIMULTANEOUS (DQD)
##.ACQUISITION SCHEME= undefined
##.AVERAGES= 16
##.DIGITISER RES= 18
##SPECTROMETER/DATA SYSTEM= dpx250
##.PULSE SEQUENCE= zg30
##.SOLVENT NAME= CDCl3
##.SHIFT REFERENCE= (INTERNAL, CDCl3, 0, 16.4498)
##AUDIT TRAIL= $$ (NUMBER, WHEN, WHO, WHERE, WHAT)
$$ ##TITLE= Audit trail, XWIN-NMR		Version 3.5
$$ ##JCAMPDX= 5.01
$$ ##ORIGIN= Bruker BioSpin GmbH
$$ ##OWNER= NMR
$$ C:\u/data/dgb/nmr/ADRS/4870/pdata/1/auditp.txt
$$ ##AUDIT TRAIL=  $$ (NUMBER, WHEN, WHO, WHERE, WHAT)
(   1,<2005-06-28 10:16:09.30 +100>,<MAYBRIDGE\NMR>,<NMR_250MHZ>,
      <created by zg, POWCHK disabled, PULCHK disabled
       configuration hash MD5:
       62 19 C7 07 E1 42 D1 B7 37 6C 3D D0 77 39 F9 E6
       data hash MD5: 64K
       D2 E7 3E 26 78 6D 11 DC 78 57 64 3A 60 2E A4 1E>)
(   2,<2005-06-28 10:16:20.30 +100>,<MAYBRIDGE\NMR>,<NMR_250MHZ>,
      <Start of raw data processing
       ef LB = 0.3 FT_mod = 6 PKNL = 1 SI = 32K 
       data hash MD5: 32K
       D8 67 86 0D AB 40 C2 D7 87 08 DD 16 31 1D AF 28>)
(   3,<2005-06-28 10:16:22.19 +100>,<MAYBRIDGE\NMR>,<NMR_250MHZ>,
      <apk 
       data hash MD5: 32K
       7C 65 C7 FF DF 65 1F 7E DB B4 B5 06 17 7B BC BA>)
(   4,<2005-06-28 10:16:22.94 +100>,<MAYBRIDGE\NMR>,<NMR_250MHZ>,
      <abs ABSG = 5 
       data hash MD5: 32K
       CB A5 66 D3 59 1D 69 E8 BD 8B FC 56 98 34 22 72>)
$$ ##END=
$$ 
$$ hash MD5
$$ 40 68 68 54 7D 88 DE F6 F8 32 C0 E2 9A 80 BA 78
##$RELAX= 
##$RELAX= 
##$RELAX= 
##$RELAX= 
##$RELAX= 
##$RELAX= 
##$RELAX= 
$$ Bruker specific parameters
$$ --------------------------
##$DU= <C:\u>
##$EXPNO= 4870
##$NAME= <ADRS>
##$PROCNO= 1
##$TYPE= <nmr>
##$USER= <dgb>
##$AMP= (0..31)
100 100 100 100 100 100 100 100 100 100 100 100 100 100 100 100 100 100 
100 100 100 100 100 100 100 100 100 100 100 100 100 100 
##$AQSEQ= 0
##$AQ_mod= 3
##$AUNM= <au_zg>
##$AUTOPOS= <13 >
##$BF1= 250.13
##$BF2= 250.13
##$BF3= 250.13
##$BF4= 250.13
##$BF5= 500.13
##$BF6= 500.13
##$BF7= 500.13
##$BF8= 500.13
##$BYTORDA= 1
##$CFDGTYP= 0
##$CFRGTYP= 5
##$CHEMSTR= <none>
##$CNST= (0..31)
1 1 145 1 1 1 1 1 1 1 1 1 1 1 1 1 1 1 1 1 1 1 1 1 1 1 1 1 1 1 1 1 
##$CPDPRG= <>
##$CPDPRG1= <>
##$CPDPRG2= <>
##$CPDPRG3= <>
##$CPDPRG4= <mlev>
##$CPDPRG5= <mlev>
##$CPDPRG6= <mlev>
##$CPDPRG7= <mlev>
##$CPDPRG8= <mlev>
##$CPDPRGB= <>
##$CPDPRGT= <>
##$D= (0..31)
0 1 0 0 0 0 0 0 0 0.06 0 0 0 0 0 0 0.0002 0 0 0 0 0 0 0 0 0 0 0 0 0 0 
0 
##$DATE= 1119950168
##$DBL= (0..7)
120 120 120 120 120 120 120 120 
##$DBP= (0..7)
150 150 150 150 150 150 150 150 
##$DBP07= 0
##$DBPNAM0= <>
##$DBPNAM1= <>
$$ [...]
##$SUBNAM7= <"">
##$SUBNAM8= <"">
##$SUBNAM9= <"">
##$SW= 20.6930455092707
##$SWIBOX= (0..15)
0 0 3 0 0 0 0 0 0 0 0 0 0 0 0 0 
##$SW_h= 5175.983436853
##$TD= 65536
##$TD0= 1
##$TE= 295.16
##$TE2= 300
##$TE3= 300
##$TEG= 300
##$TL= (0..7)
0 120 120 120 120 120 120 120 
##$TP= (0..7)
150 150 150 150 150 150 150 150 
##$TP07= 0
##$TPNAME0= <>
##$TPNAME1= <>
##$TPNAME2= <>
##$TPNAME3= <>
##$TPNAME4= <>
##$TPNAME5= <>
##$TPNAME6= <>
##$TPNAME7= <>
##$TPOAL= (0..7)
0.5 0.5 0.5 0.5 0.5 0.5 0.5 0.5 
##$TPOFFS= (0..7)
0 0 0 0 0 0 0 0 
##$TUNHIN= 0
##$TUNHOUT= 0
##$TUNXOUT= 0
##$USERA1= <user>
##$USERA2= <user>
##$USERA3= <user>
##$USERA4= <user>
##$USERA5= <user>
##$V9= 5
##$VALIST= <valist>
##$VCLIST= <CCCCCCCCCCCCCCC>
##$VD= 0
##$VDLIST= <DDDDDDDDDDDDDDD>
##$VPLIST= <PPPPPPPPPPPPPPP>
##$VTLIST= <TTTTTTTTTTTTTTT>
##$WBST= 1024
##$WBSW= 4
##$XGAIN= (0..3)
0 0 0 0 
##$XL= 0
##$YL= 0
##$YMAX_a= 280203
##$YMIN_a= -262225
##$ZGOPTNS= <>
##$ZL1= 120
##$ZL2= 120
##$ZL3= 120
##$ZL4= 120
##$ABSF1= 16.44978
##$ABSF2= -4.243393
##$ABSG= 5
##$ABSL= 3
##$ALPHA= 0
##$AQORDER= 0
##$ASSFAC= 0
##$ASSFACI= 0
##$ASSFACX= 0
##$ASSWID= 0
##$AUNMP= <proc_1d>
##$AZFE= 0.1
##$AZFW= 0.1
##$BCFW= 0
##$BC_mod= 0
##$BYTORDP= 0
##$COROFFS= 0
##$CY= 12.5
##$DATMOD= 1
##$DC= 0
##$DFILT= <>
##$DTYPP= 0
##$F1P= 14.0000005364418
##$F2P= -0.99999901652339
##$FCOR= 0.5
##$FTSIZE= 32768
##$FT_mod= 6
##$GAMMA= 0
##$GB= 0
##$INTBC= 1
##$INTSCL= 1
##$ISEN= 128
##$LB= 0.3
##$LEV0= 0
##$LPBIN= 0
##$MAXI= 10000
##$MC2= 0
##$MEAN= 0
##$ME_mod= 0
##$MI= 0
##$NCOEF= 0
##$NC_proc= -4
##$NLEV= 6
##$NOISF1= 0
##$NOISF2= 0
##$NSP= 0
##$NTH_PI= 0
##$NZP= 0
##$OFFSET= 16.44978
##$PC= 1
##$PHC0= -72.67706
##$PHC1= 5.632701
##$PH_mod= 1
##$PKNL= yes
##$PPARMOD= 0
##$PSCAL= 4
##$PSIGN= 0
##$REVERSE= no
##$SF= 250.130018063148
##$SI= 32768
##$SIGF1= 0
##$SIGF2= 0
##$SINO= 400
##$SIOLD= 32768
##$SREGLST= <1H.CDCl3>
##$SSB= 0
##$STSI= 32768
##$STSR= 0
##$SW_p= 5175.98343685301
##$SYMM= 0
##$S_DEV= 0
##$TDeff= 65536
##$TDoff= 0
##$TI= <Analysis number 999999
Compound Code 99
Book Reference 9
Project Code 9>
##$TILT= no
##$TM1= 0
##$TM2= 0
##$TOPLEV= 0
##$USERP1= <user>
##$USERP2= <user>
##$USERP3= <user>
##$USERP4= <user>
##$USERP5= <user>
##$WDW= 1
##$XDIM= 32768
##$YMAX_p= 325655019
##$YMIN_p= -498575
$$ End of Bruker specific parameters
$$ ---------------------------------
##NTUPLES= NMR SPECTRUM
##VAR_NAME=  FREQUENCY,     SPECTRUM/REAL,   SPECTRUM/IMAG
##SYMBOL=    X,             R,               I
##VAR_TYPE=  INDEPENDENT,   DEPENDENT,       DEPENDENT
##VAR_FORM=  AFFN,          ASDF,            ASDF
##VAR_DIM=   32768,         32768,           32768
##UNITS=     HZ,            ARBITRARY UNITS, ARBITRARY UNITS
##FACTOR=    0.157963299565203, 1,           1
##FIRST=     4114.58364609568, 0,            0
##LAST=      -1061.39979075733, 0,           0
##MIN=       -1061.39979075733, -498575,     0
##MAX=       4114.58364609568, 325655019,    0
$$ Real data points
##PAGE= N=1
##DATA TABLE= (X++(R..R)), XYDATA
$$ [...]
15720A63146k6703o990k2887J18217Q716q0973l8950J6984r2995l1161L1633M6731
$$ 163146 136443 129453 106566 224783 233499 152526 113576 130560 37565 6404 38037 84768
15708H4768M1450K3363o2799r6763K2460J134r3061N5407J17626m7677j28774
$$ 84768 126218 149581 86782 -9981 12479 13613 -79448 -24041 93585 45908 -82866
15697h2866n3609L8980O6389n5565J07182P2015j53963L8796N8409n7110Q0917
$$ -82866 -136475 -97495 -31106 -86671 20511 92526 -61437 -22641 35768 -21342 59575
15686E9575J39306k9599m2545o2739r4567K0583p524j1658k4965N131O7441n4805
$$ 59575 198881 169282 126737 63998 -30569 -9986 -17510 -29168 -54133 -49002 18439 -36366
15674c6366q806J58050O6462P7815j25806j32596K6021O632M2679J35121R5424
$$ -36366 -45172 112878 179340 257155 131349 -1247 24774 31406 74085 209206 304630
15663C04630L8100q5793j51895j28031K7852N3632N5299j29615l8944l2248O3302
$$ 304630 342730 256937 105042 -22989 4863 58495 113794 -15821 -54765 -87013 -23711
15652b3711R5009r3208q6815O512N9816q0044M3579J02098M3249l0762j00831
$$ -23711 71298 -21910 -108725 -102213 -42397 -122441 -78862 23236 66485 35723 -65108
15641f5108k0363M0553m2500K2510l7114j15426M3427P8075R9276m6833k1234
$$ -65108 -85471 -44918 -87418 -64908 -102022 -217448 -174021 -95946 3330 -43503 -64737
15630f4737J7578r451J02427L189r8957K8132M5623j9901L4790K8588j01999o9831
$$ -64737 -47159 -56610 45817 49006 -49951 -21819 23804 3903 38693 67281 -34718 -104549
15618a04549m0938M6975P3744r2581P3288J31541L225l949M4912M1116j63701
$$ -104549 -145487 -98512 -24768 -117349 -44061 87480 90705 86756 131668 172784 9083
15607I083n8120K5040O9274l583q9404J6920r3799l5115P1980J08549P4528k4668
$$ 9083 -49037 -23997 45277 41694 -47710 -30790 -124589 -159704 -87724 20825 95353 70685
15595G0685j73327p7844M113N4033Q1048J9156j65858N3364J12331L8347q0965
$$ 70685 -102642 -180486 -176373 -122340 -41292 -22136 -187994 -134630 -22299 16048 -64917
15584f4917N7876R6612k7535K1850O2074j9001j23463k5208q9993l0740j42717
$$ -64917 -7041 89571 62036 83886 145960 126959 3496 -21712 -111705 -142445 -285162
15573b85162L5239L6690Q0920m8780M4933O7028M9739K2318R9292R2373J9123
$$ -285162 -249923 -213233 -132313 -181093 -136160 -69132 -19393 2925 102217 194590 213713
15562B13713m5948k6191r9167j32691M3501J17174P2076N1303j5666J35k4719
$$ 213713 167765 141574 42407 -90284 -46783 70391 142467 193770 178104 178239 153520
15551A53520r5817P9562n57r0032q2308m2918K6503j0658m4827l8527J48537o4041
$$ 153520 57703 137265 136708 46676 -35632 -78550 -52047 -62705 -107532 -146059 2478 -61563
15539f1563j41643K3954J08637R2611j6871J859J7432L3257J8870J28085N0292
$$ -61563 -203206 -179252 -70615 21996 5125 6984 24416 57673 76543 204628 254920
15528B54920l8366K2378l2316n1997q4121l1698L8007J3860N057J2308O745p115
$$ 254920 216554 238932 206616 154619 70498 38800 76807 90667 95724 108032 114777 107662
15516A07662o2945k6774k3963m3931j23288j1614M3586L1593L5154Q3025J4749
$$ 107662 44717 17943 -6020 -49951 -173239 -184853 -141267 -109674 -74520 8505 23254
15505B3254j94183o6479O4268k2097k1268P9110Q0121J62821J21510j26059K0250
$$ 23254 -170929 -237408 -173140 -195237 -216505 -137395 -57274 105547 227057 100998 121248
15494A21248Q3713m5523j7856j31100p2359p7054k8563P3593Q3933J8571j17764
$$ 121248 204961 159438 141582 10482 -61877 -138931 -167494 -93901 -9968 8603 -109161
15483a09161k6863L7095O5282J2057m7240M1107J9004l8840O6607j26526Q5414
$$ -109161 -136024 -98929 -33647 -21590 -68830 -27723 -8719 -47559 19048 -107478 -22064
15472b2064J16489O3514Q5389o2249n1650K8171m4641k7722m684K5405p4136n1558
$$ -22064 94425 157939 243328 181079 129429 157600 112959 85237 80553 105958 31822 -19736
15460a9736p0626k0141m1757M7756P0428m1057q944J31920j5021p3819J1938K1945
$$ -19736 -90362 -110503 -152260 -104504 -34076 -75133 -84077 47843 32822 -40997 -29059 -7114
15448g114J2979l6272o7884n2869O8824J11197j26811r3279p606R458M1217J57800
$$ -7114 5865 -30407 -98291 -151160 -82336 28861 -97950 -191229 -198835 -189377 -148160 9640
15436I640n536j14659j12738N9657R0070j4179l5031l6662K7419L9812K7219J54314
$$ 9640 4104 -110555 -223293 -163636 -73566 -87745 -122776 -159438 -132019 -92207 -64988 89326
15424H9326P648r8066J1009O9488Q248O880l9286l7212n3090M6642m850N1019
$$ 89326 96974 -1092 9917 79405 87653 94533 55247 18035 -35055 11587 6737 57756
15412E7756n1729n5257Q6178N8031J38881k2396M5680P8285K08j40885j44453
$$ 57756 6027 -49230 36948 94979 233860 211464 257144 335429 335637 194752 50299
15401E0299m6719l0440l91P5267J56742l9519n5730p9340k02968P145R799L8988
$$ 50299 3580 -26860 -27251 48016 204758 165239 109509 30169 -172799 -165654 -155855 -116867
15389a16867P3624M3312N8819P819k2503J4610K0217K248p6950N3826L686r4593
$$ -116867 -43243 69 58888 66707 44204 58814 79031 81279 4329 58155 61841 -32752
15377c2752j19241O9789M9388o2879n0125J16468P7091p7695l1527p1365O5064
$$ -32752 -151993 -82204 -32816 -95695 -145820 -29352 47739 -29956 -61483 -132848 -67784
15366f7784J09874K677o0117l9742J7211O3496k9659J36696J94749J8709j54610
$$ -67784 42090 44767 -15350 -55092 -37881 25615 -4044 132652 327401 346110 191500
15355A91500n7253L7050m9407R2750K161K5152J4290m9596K0387j9928j81321
$$ 191500 134247 171297 121890 214640 216801 241953 256243 206647 227034 207106 25785
15344B5785m1626K935J643M3855J3344N942j39090k3115R4345L1364n5774O619
$$ 25785 -15841 -12906 -11263 32592 45936 51878 -87212 -110327 -15982 15382 -40392 -33773
15332c3773p2755k9600J13144q6996J7707J03758M6451m6724L1153j3791o6485
$$ -33773 -106528 -136128 -22984 -109980 -92273 11485 57936 11212 42365 28574 -37911
15321c7911q8628l087r9230N9722J19581J16372l8354l0506p786N6367o9228j08024
$$ -37911 -126539 -129626 -228856 -169134 -49553 66819 28465 -2041 -9827 46540 -22688 -130712
15309a30712j4783O0746J9146J48475J833l6521J0872N7499R8863K397j29838
$$ -130712 -145495 -84749 -65603 82872 84705 48184 59056 116555 215418 217815 87977
15298H7977o4071m1235j4598n3781l4997P8130N0349O6055l3259k2817L1728K1118
$$ 87977 23906 -17329 -31927 -85708 -120705 -42575 7774 73829 40570 17753 49481 70599
15286G0599j57566K3628N1177j5384K9255J22937L632j23312j32282o5262N2685
$$ 70599 -86967 -63339 -12162 -27546 1709 124646 128278 4966 -127316 -192578 -139893
15275a39893L5210Q2583P6790j00356m8090k2331N5939J33988R6313m1540j5999
$$ -139893 -104683 -22100 54690 -45666 -93756 -116087 -60148 73840 170153 128613 112614
15264A12614o2818n0206l4192J788k1439n6235O2458Q5691M7237O0136m2940r127
$$ 112614 49796 -410 -34602 -32814 -54253 -110488 -48030 37661 84898 145034 102094 92967
15252I2967j57170J2645K6456N1901Q5139O9407k46k7640p9257k9771P4025Q0095
$$ 92967 -64203 -51558 -25102 26799 111938 181345 181099 153459 74202 44431 118456 198551
15240A98551K188j77883r1961R7613J26400L735k1258j33575j38637J31362R7646
$$ 198551 200739 22856 -69105 28508 154908 158643 137385 3810 -134827 -3465 94181
15229I4181j15820m6026O0426J6809l6993k6976n5570K2723L842Q4005K0825j39571
$$ 94181 -21639 -67665 -7239 9570 -27423 -54399 -109969 -87246 -83404 601 21426 -118145
15217a18145L5900J3328l691l8810J78584N1262j13096j2768m5979k9186Q6631
$$ -118145 -82245 -68917 -72608 -111418 67166 118428 5332 -7436 -53415 -82601 4030
15206D030j6590r9196n4085M9828m2108q0979L6638J68567J51050Q35j27511N1525
$$ 4030 -12560 -111756 -165841 -116013 -158121 -239100 -202462 -33895 117155 117990 -9521 42004
15194D2004K937o6442l8139o1525n1705Q7103n2268Q0210J10577N4595k1660q9419
$$ 42004 44941 -21501 -59640 -121165 -172870 -85767 -138035 -57825 52752 107347 85687 -3732
15182c732Q573N3985K2565j27131M2407Q9919J4577j34431n0361j73765Q3466
$$ -3732 4841 58826 81391 -45740 -3333 86586 101163 -33268 -83629 -257394 -173928
15171a73928L1963M5775Q8933j0419j09892J7455q2650N040J37171J224P2958
$$ -173928 -141965 -96190 -7257 -17676 -127568 -110113 -192763 -187723 -50552 -49328 23630
15160B3630J17809J5981q2282q392O4056J03119Q1769N4824j07271j07916j5551
$$ 23630 141439 157420 75138 66746 130802 233921 315690 370514 263243 155327 139776
15149A39776l7201k8081p6583k8574L2726m6378L7575O9612R920k8382m6364r1525
$$ 139776 102575 74494 -2089 -30663 2063 -44315 -6740 62872 72792 44410 -1954 -93479
15137i3479p116J66953J22216j34259q1832K9028M7277l3628m0016l3452r1401
$$ -93479 -100595 66358 188574 54315 -27517 1511 48788 15160 -24856 -58308 -149709
15126a49709R7364J10734J7786Q052L489j12804j77386O8830J16150J07378L6565
$$ -149709 -52345 58389 76175 84227 87716 -25088 -202474 -133644 -17494 89884 126449
15115A26449n136J3508n6754k5195k0336j25580q8094j2569j7139J6795M7101
$$ 126449 121313 134821 78067 52872 32536 -93044 -181138 -193707 -210846 -194051 -146950
15104a46950P4858O1379L66n1184R7775N9216l9493q1167j4725k8462j5762J50631
$$ -146950 -72092 -10713 -10347 -61531 36244 95460 55967 -25200 -39925 -68387 -84149 66482
15092F6482J4789n1988n253k3577m1818j456J6715J9530j15849L5289Q9395M2428
$$ 66482 81271 29283 24030 453 -41365 -42821 -26106 -6576 -122425 -87136 2259 44687
15080D4687K5058J0278o406q5904j03924q1511j5178N2705J06986p6122q5122
$$ 44687 69745 80023 73617 -12287 -116211 -197722 -212900 -160195 -53209 -129331 -214453
15069b14453J21033O3299m1529L964k1092J410K6553Q6899J6835N0997n1549j9924
$$ -214453 -93420 -30121 -71650 -67686 -88778 -87368 -60815 26084 42919 93916 42367 22443
15057B2443m2169M7002K777l4146r046L1370N3303K8157k2357R9019K5288r6722
$$ 22443 -19726 27276 30053 -4093 -13139 18231 71534 99691 77334 176353 201641 104919
15045A04919J1326r0492j09031l58m7263j01402j1739O6044J47078R9559o9737
$$ 104919 116245 25753 -83278 -83636 -130899 -232301 -244040 -177996 -30918 68641 -1096
15034a096m4421K5640O5857M6397j01111m0084j7149L9517M5740N5062j9549L3611
$$ -1096 -45517 -19877 45980 92377 -8734 -48818 -65967 -26450 19290 74352 54803 88414
15022H8414R8298j0789j97041n8438O1775N4179R272O7735p3220o3812K8032j1756
$$ 88414 186712 175923 -21118 -79556 -17781 36398 45670 113405 40185 -23627 4405 -7351
15010g351J9228m0135k9663o7876j90921j3784J48129J71438q119j01076o2586
$$ -7351 11877 -28258 -57921 -125797 -316718 -330502 -182373 -10935 -19054 -120130 -182716
14999a82716N5721N9254N6393l4645r743k8781J04688l7151j0587M4386m9806
$$ -182716 -126995 -67741 -11348 -45993 -55736 -84517 20171 -16980 -27567 16819 -32987
14988c2987o850N9719L5737j0601n3412o1434M3683J00068L2641m8849j02593
$$ -32987 -39837 19882 55619 45018 -8394 -69828 -26145 73923 106564 57715 -44878
14977d4878K7508L1113J706l2019m3889k896K0844k8154O1615l1699L4395n0271
$$ -44878 -17370 13743 15449 -16570 -60459 -63355 -42511 -70665 -9050 -40749 -6354 -56625
14965e6625L998L2835P0785L2374j56925q7223m128L3873K709k1922j09486j15821
$$ -56625 -52627 -19792 50993 83367 -73558 -160781 -164909 -131036 -128327 -150249 -259735 -375556
14953c75556J30362J48395m3729K0598P6380n546m8894M0889m0650M8888O0394
$$ -375556 -245194 -96799 -140528 -119930 -43550 -49096 -97990 -57101 -97751 -48863 11531
14942A1531m1585p4371n841n612n2150L8747L5984R3796J897p2694r216M8805
$$ 11531 -30054 -104425 -110266 -115878 -168028 -129281 -93297 499 2396 -70298 -79514 -30709
14930c0709o712K1642r2931q1657P6889N8475J06284J01850n9653j37181J16089
$$ -30709 -37421 -15779 -108710 -190367 -113478 -55003 51281 153131 93478 -43703 72386
14919G2386p4864o5409n1336J64981J28760o1356p2611k1508p6128m7477p9961
$$ 72386 -2478 -67887 -119223 45758 174518 113162 40551 19043 -57085 -104562 -184523
14908a84523k704P8481k0715J4793J24112M1226j37607Q601J8797n5904n8346
$$ -184523 -187227 -108746 -129461 -114668 9444 50670 -86937 -78336 -59539 -115443 -173789
14897a73789P044j1382M2993M7741O645K6055P4633J05755j1058m3208Q3671l4144
$$ -173789 -166745 -178127 -135134 -87393 -80748 -54693 19940 125695 114637 71429 155100 120956
14885A20956l8846q2868l0377r1599N0172Q0949L3672L2863j4019m2547Q3167
$$ 120956 82110 -758 -31135 -122734 -72562 8387 42059 74922 60903 18356 101523
14874A01523L3272l3410R8573N6008m0488p1660k096J2587j28754j54760j0741
$$ 101523 134795 101385 199958 255966 215478 143818 141722 154309 25555 -129205 -139946
14863a39946K9101n0291O1368J07823J9646j3395k0527k8778J6457N6465L3517
$$ -139946 -110845 -161136 -99768 8055 27701 14306 -6221 -34999 -18542 37923 71440
14852G1440m3901J4378j2148K8422l622Q4687L6797j01531J3649m9580K3916n5194
$$ 71440 27539 41917 29769 58191 54569 139256 176053 74522 88171 38591 62507 7313
14840G313R090J09416K9680o2874P199M148K5378l9863L9267j7831L9250j03812
$$ 7313 16403 125819 155499 92625 99824 103972 129350 89487 128754 110923 150173 46361
14828D6361j11258K8686N4696O8999n3379j74800J0216Q1361m1442L4850k5657
$$ 46361 -64897 -36211 18485 87484 34105 -140695 -130479 -49118 -90560 -55710 -81367
14817h1367m3279L9620J00102L9362j6502p0628k1433K8408k4605n1567m9561
$$ -81367 -124646 -85026 15076 54438 37936 -32692 -54125 -25717 -50322 -101889 -151450
14806a51450m388P0591n5627M2624O5507N2925L2941M9752M477j4074l5378j14962
$$ -151450 -155838 -85247 -140874 -98250 -32743 20182 53123 102875 107352 93278 57900 -57062
14794e7062k1729o3050N0669M5641J3992L5905P7769r9565p7443m5838M9801R7009
$$ -57062 -78791 -141841 -91172 -45531 -31539 4366 82135 -17430 -94873 -140711 -90910 6099
14782F099J9097n1551m6264O9865N7493q9137j00324m1466J3960N1982M5931n6440
$$ 6099 25196 -26355 -72619 -2754 54739 -34398 -134722 -176188 -162228 -110246 -64315 -120755
14770a20755p6588M1192Q4394M6760M6153J5474J02506q1236j37656Q1919L6420
$$ -120755 -197343 -156151 -71757 -24997 21156 36630 139136 57900 -79756 2163 38583
14759C8583m4224q4073R1642J12846j0377R6659o5210L2449r759k3882J5229k4248
$$ 38583 -5641 -89714 1928 114774 104397 201056 135846 168295 158536 134654 149883 125635
14747A25635p6522j14708k3745n7436k698M8092p7388K2380j5476J4558O5925
$$ 125635 49113 -65595 -89340 -146776 -149474 -101382 -178770 -156390 -171866 -157308 -91383
14736i1383J19817j065j28418J4310N0147o2006p6762J6841J38164Q2136m9756
$$ -91383 28434 27369 -101049 -86739 -36592 -98598 -175360 -158519 -20355 61781 12025
14725A2025j14525j49702P9335O4418N4164k8645r2706P0451P2533p0769J6368
$$ 12025 -102500 -252202 -172867 -108449 -54285 -82930 -175636 -105185 -32652 -103421 -87053
14714h7053J81720j1164p0424M4624J16980J0541k2661l892p8770j16593k1595
$$ -87053 94667 83503 13079 57703 174683 185224 162563 158671 79901 -36692 -58287
14703e8287K1161o3394M3962M0208j70n6061L8605m4744m1734r226R4257J51127
$$ -58287 -37126 -100520 -56558 -16350 -16520 -72581 -33976 -78720 -120454 -129680 -35423 115704
14691A15704J4264j15322q1222Q0769N407J4887L8035k896o2896q9925N2391O0793
$$ 115704 129968 14646 -66576 14193 19600 34487 72522 69626 6730 -83195 -30804 29989
14679B9989M8732k8413M6281m7350l5283k7205o7499r9164N6999J22528O0465
$$ 29989 78721 50308 96589 49239 13956 -13249 -80748 -179912 -122913 -385 60080
14668F0080j0671k5363p5928r384J3254R7144m7020j1074j0291M519Q3819m0417
$$ 60080 49409 24046 -51882 -61266 -48012 49132 2112 -8962 -19253 -14734 69085 28668
14656B8668j3108o0656j1823j6275k8207L5243K1866q2287k4255J7426L7276Q716
$$ 28668 15560 -45096 -56919 -73194 -101401 -66158 -44292 -126579 -150834 -133408 -96132 -87416
14644h7416k1812R0320N0056j61497l3818N2018k6715J0937J3435j9829j7348
$$ -87416 -109228 -18908 31148 -130349 -164167 -112149 -138864 -127927 -114492 -134321 -151669
14633a51669M6793O8401K0499N6897r0988K7466l2423N0641p9422J6286R0320
$$ -151669 -104876 -36475 -15976 40921 -50067 -22601 -55024 -4383 -83805 -67519 22801
14622B2801P8132J5160M2654q1429j15219Q073n6118q610K8703K5900J1945J31798
$$ 22801 100933 116093 158747 77318 -37901 -29828 -85946 -94556 -65853 -39953 -28008 103790
14610A03790M816L900N993n7469P0824o1607j53548l6360R1410O4671P8803P5683
$$ 103790 108606 112506 118499 61030 131854 70247 -83301 -119661 -28251 36420 115223 190906
14598A90906M6954p0877j20668m3675j01008m8716q453N0008J40693j6027p914
$$ 190906 237860 166983 46315 2640 -98368 -147084 -155537 -105529 35164 19137 11223
14587A1223M0684l7741R0431Q999j17096O4311J16437k7095L1572o052q5286L9886
$$ 11223 51907 14166 104597 113596 -3500 60811 177248 150153 181725 175673 90387 130273
14575A30273r1277j27804O7055J6247O919j22180j254J26701J5158q4341o5014
$$ 130273 38996 -88808 -21753 -5506 1413 -120767 -122021 4680 19838 -64503 -129517
14564a29517J01174J56629p0053j88133l8427J34217M6235k5027p0898J6399J52090
$$ -129517 -28343 128286 58233 -129900 -168327 -34110 12125 -12902 -83800 -67401 84689
14553H4689R2974j9872j45096j63275O4164J42108N7860o7926j00040p6071K2255
$$ 84689 177663 157791 12695 -150580 -86416 55692 113552 45626 -54414 -130485 -108230
14542a08230O1057l2009j2259N515J04436J66646j8758N0529j649l8337n7547
$$ -108230 -47173 -79182 -91441 -85926 18510 185156 166398 216927 215278 176941 119394
14531A19394o5247k14977n5238R3506J6839p7557l2157O4949q1490M5307P2467
$$ 119394 54147 -160830 -216068 -122562 -105723 -183280 -215437 -150488 -231978 -186671 -114204
14520a14204P824n5498L5876k5929k6444j2569L6607J82330N9258r380n4165j33788
$$ -114204 -106380 -161878 -126002 -151931 -178375 -190944 -154337 27993 87251 77871 23706 -110082
14508a10082K0065R2075m9253L2440j822p441N5449O769K6018r3073j9163k178
$$ -110082 -90017 2058 -47195 -14755 -16577 -24018 31431 38200 64218 -28855 -48018 -50196
14496e0196n3123M0853O9560l8351K3953L349K6475N2065k76r1797j02239p0292
$$ -50196 -103319 -62466 7094 -31257 -7304 -3955 22520 74585 74309 -17488 -119727 -190019
14484a90019P0672M4155j18991o1472J3988K0203p554J96808M2549l718q4796
$$ -190019 -119347 -75192 -194183 -255655 -241667 -221464 -229018 -32210 10339 6621 -78175
14473g8175p9726P6619M1412K6877J02192N8946k0026j87226L7846J28972o9205
$$ -78175 -157901 -81282 -39870 -12993 89199 148145 128119 -59107 -21261 107711 38506
14462C8506K062P7731j5476k4594j08009p1204J1466n3072N0470M2865J17819
$$ 38506 40568 118299 102823 78229 -29780 -100984 -89518 -142590 -92120 -49255 68564
14451F8564K5880k1601K2641j9718k8479p7828o0251N9759j6486q085O3366p184
$$ 68564 94444 72843 95484 75766 47287 -30541 -90792 -31033 -47519 -55604 7762 578
14439E78o5916J4603M8474N4741Q2557K0147L6503j4475p3653m449k8267N5094
$$ 578 -65338 -50735 -2261 52480 135037 155184 191687 177212 103559 99110 70843 125937
14427A25937p1152j61341r7481J2153J41165R2290L8189p4442R7166J5826j65488
$$ 125937 54785 -106556 -204037 -191884 -50719 41571 79760 5318 102484 118310 -47178
14416d7178j56769K5083J08086M6106q7875l6104O5218Q8504L5326k7178K3553
$$ -47178 -203947 -178864 -70778 -24672 -112547 -148651 -83433 5071 40397 13219 36772
14405C6772L3666k4277p1568r4204l8120j32406Q2423M2258N3556p2122O1977
$$ 36772 70438 46161 -25407 -119611 -157731 -290137 -207714 -165456 -111900 -184022 -122045
14394a22045P8451q5153P407O2815P9809j8478N5676j0766j22604n055L2001N2701
$$ -122045 -43594 -128747 -121340 -58525 21284 2806 58482 47716 -74888 -79943 -47942 4759
14382D759J100K602k8387m3138J23220k2559p1359q6756K5975Q1823M6144k7386
$$ 4759 5859 8461 -19926 -63064 60156 37597 -33762 -120518 -94543 -12720 33424 6038
14370F038l9642N1554O0088l057m7276j4599J61083r771j06829n8545k3929n9820
$$ 6038 -33604 17950 78038 74981 27705 13106 174189 164418 57589 -956 -24885 -84705
14358h4705p867P881O6566M4372M7777P189L8154J1667m7527j73162O7713J61282
$$ -84705 -92572 -84691 -18125 26247 74024 81213 119367 131034 83507 -89655 -21942 139340
14346A39340N5517J2185k8809l9325j18826k4843n7659J0193q344N5630M505r4134
$$ 139340 194857 207042 178233 138908 20082 -4761 -62420 -52227 -60571 -4941 -436 -94570
14334i4570o2007L6074k3556O1810k2391m1336l3188R9727J62719M9043j1083
$$ -94570 -156577 -120503 -144059 -82249 -104640 -145976 -179164 -79437 83282 132325 121242
14323A21242k2473j32J081n5363p8397j9473Q7820n7787J2834J21169k7332m5543
$$ 121242 98769 98637 99718 44355 -34042 -53515 34305 -23482 -10648 110521 83189 37646
14311C7646j11492Q2525N7739j64380J6807L4402p8963O887l5o5713P4888J34513
$$ 37646 -73846 8679 66418 -97962 -81155 -46753 -125716 -118829 -118864 -184577 -109689 24824
14299B4824L4672o7442R094O6436l1843j2199Q9869k2255l4523q2750O2221j50
$$ 24824 59496 -7946 1148 67584 35741 23542 113411 91156 56633 -26117 36104 35954
14287C5954n6714J9650R372R7O2718q9365R457L3185m4327o2812P1141N3791O0192
$$ 35954 -20760 -1110 8262 8359 71077 -18288 -8831 24354 -19973 -82785 -11644 42147 102339
14274A02339R8550K0876N370o0011p5964r3865k6342J01131l7497P4500L0701
$$ 102339 200889 221765 227135 167124 91160 -2705 -29047 72084 34587 109087 139788
14263A39788p9835q7612K11215J08270j66396j30459N659O5210J5619o455r1782
$$ 139788 59953 -27659 183556 291826 125430 -5029 630 65840 81459 75004 -16778
14252a6778j06987J45462R4277r0859q6455N447r0215Q6985q7479n8497K3908
$$ -16778 -123765 21697 115974 25115 -61340 -55893 -146108 -59123 -146602 -205099 -181191
14241a81191J04132J46211j1125q1674P960n73j40796q6817L753P1012J54345
$$ -181191 -77059 69152 58027 -23647 -15687 -16260 -157056 -243873 -240120 -169108 -14763
14230a4763O273Q4979j34018j0837J30380o6776o4532j0112J16386K0782j31385
$$ -14763 -8490 76489 -57529 -68366 62014 -4762 -69294 -79406 36980 57762 -73623
14219g3623j25015R2973J79637M1567n9242j13767Q1690j8391p4166n7457o4355
$$ -73623 -198638 -105665 73972 115539 56297 -57470 24220 5829 -68337 -125794 -190149
14208a90149n397J867N7461N0803o8407n215J90971m6932q7634j12623j7285l9593
$$ -190149 -195546 -193679 -136218 -85415 -153822 -159037 31934 -14998 -102632 -215255 -232540 -272133
14196b72133P999J09301Q322l2481J17431J9882N926N3316Q9707j9836o3270j12457
$$ -272133 -264134 -154833 -146511 -178992 -61561 -41679 -35753 17563 107270 87434 24164 -88293
14184h8293J4135N3850J52358L4941l6273o0829l4008l7149O5320K5792m5071
$$ -88293 -74158 -20308 132050 166991 130718 69889 35881 -1268 64052 89844 44773
14173D4773r5324p4975J7203J00403J07959J6528o5386q9064J6892N2176P44L3477
$$ 44773 -50551 -125526 -108323 -7920 100039 116567 51181 -37883 -20991 31185 31929 65406
14161F5406K8130n7731R6681L7301k9208n4524l9444K5489J5486r861J3225N9011
$$ 65406 93536 35805 132486 169787 140579 86055 46611 72100 87586 77725 90950 149961
14149A49961l3030m5277k3105p2520m3256M4458J16728O8993j13211j9545J5752
$$ 149961 116931 71654 48549 -23971 -67227 -22769 93959 162952 49741 30196 45948
14138D5948l1921j39692N7481J09866L92M8867k0736J0817k2135K6250K3735n0710
$$ 45948 14027 -125665 -68184 41682 42074 90941 70205 81022 58887 85137 108872 58162
14126E8162j23706N7398M1031k3599p4172o1685j6537R1665r303m6858J21675
$$ 58162 -65544 -8146 32885 9286 -64886 -126571 -143108 -51443 -60746 -107604 14071
14115A4071J16644k9722j04837J8675M9448L4980q5825j08992q8163J10752J39845
$$ 14071 130715 100993 -3844 14831 64279 99259 13434 -95558 -183721 -72969 66876
14104F6876K1681N5978m3047j3133m7117Q594k7912k5066q9028n6903j7318P0115
$$ 66876 88557 144535 101488 88355 41238 49832 21920 -3146 -92174 -149077 -166395 -96280
14092i6280N5394j74167p683r888j4167R5902J32164L5403P556Q37J10877Q1696
$$ -96280 -40886 -215053 -222736 -232624 -246791 -150889 -18725 16678 24234 25071 135948 217644
14080B17644o1548j02565o1104l3173j0786r1788l6764J46327R6436l1656K0663
$$ 217644 156096 53531 -7573 -40746 -51532 -143320 -180084 -33757 62679 31023 51686
14069E1686j07489l9082N2496K1795r8508j2714j3871J17635N3581n8216j23003
$$ 51686 -55803 -94885 -42389 -20594 -119102 -131816 -145687 -28052 25529 -32687 -155690
14058a55690p6581Q0759J12349M9178J1730o806l3989L718K7904J02049J7533
$$ -155690 -232271 -151512 -39163 10015 21745 14939 -19050 -15332 12572 114621 132154
14047A32154n2448J4879p285K5306L0455o1801m6086k8004J19090l1834p8346
$$ 132154 79706 94585 87300 112606 143061 81260 35174 7170 126260 94426 16080
14036A6080j6653o7738j58013M1542L0731N2365N8625J32973J6092p3195n240
$$ 16080 -573 -68311 -226324 -184782 -154051 -101686 -43061 89912 106004 32809 27569
14025B7569K6793M1345Q6986p8922j16477J2385J1427p4664q4624K5660R5495
$$ 27569 54362 95707 182693 103771 -12706 -321 11106 -63558 -148182 -122522 -27027
14014b7027j3049n7761o0271K7032P1515m9882j28547k2324K08134J32013o2038
$$ -27027 -40076 -97837 -158108 -131076 -59561 -109443 -237990 -260314 -52180 79833 17795
14003A7795p3559j0261O1429j049q5948m5651o6466R474L1830J63815J04702M7135
$$ 17795 -55764 -66025 -4596 -5645 -91593 -137244 -203710 -194236 -162406 1409 106111 153246
13991A53246j07037r0117M5450m727N2328l110l3989j2375J6193r522p0518q7345
$$ 153246 46209 -43908 1542 -3185 49143 46033 12044 -331 15862 6340 -64178 -151523
13979a51523p7213l4644J35777J49204J03671m1316j08186m7068l7221p8937N087
$$ -151523 -228736 -263380 -127603 21601 125272 83956 -24230 -71298 -108519 -187456 -182369
13968a82369J12276l9827J3597R266k4830J27054P0748N0822m1116K421j08633
$$ -182369 -70093 -109920 -96323 -87057 -111887 15167 85915 136737 95621 98042 -10591
13957a0591k5741R4509l4787p9229n7530n3291L7382J68745J374r1530j11383
$$ -10591 -36332 58177 23390 -55839 -113369 -166660 -129278 39467 40841 -50689 -162072
13946a62072N1256L0974R5380J62604J98326M2420j99830j96363q9305O3495L1453
$$ -162072 -110816 -79842 15538 178142 376468 418888 219058 22695 -66610 -3115 28338
13935B8338p0304k8504o6801N7077J18394P5714j65370p6487Q8285J12306K6232
$$ 28338 -41966 -70470 -137271 -80194 38200 113914 -51456 -127943 -39658 72648 98880
13924I8880m2351j22455k3919O0050J13731j1624q1577n0030p8518L8779N0785
$$ 98880 56529 -65926 -89845 -29795 83936 72312 -9265 -59295 -137813 -99034 -48249
13913d8249Q6453R4697J9741r6491J6280N7008K2952l8979m6381k824R2137j2934
$$ -48249 38204 132901 152642 56151 72431 129439 152391 113412 67031 64207 156344 143410
13901A43410o5283o3975P7376P7894m9391j53976m0510K198L5993O0926o4300
$$ 143410 78127 14152 91528 169422 120031 -33945 -74455 -72257 -36264 24662 -39638
13890c9638k4291l4293M964Q7022m0850K694p5764o3744J4706J09985o5473j17492
$$ -39638 -63929 -98222 -93258 -6236 -47086 -44392 -120156 -183900 -169194 -59209 -124682 -242174
13878b42174o615P815J33961N3094N5906R2230M1911j07989j05733R769Q1504
$$ -242174 -248789 -240974 -107013 -53919 1987 94217 136128 28139 -77594 -67825 13679
13867A3679P2216k6405j07069j19536N1219P6622Q648P5543J02479n8320j14926
$$ 13679 85895 59490 -47579 -167115 -115896 -39274 -30626 44917 147396 89076 -25850
13856b5850j38842O4528P0526j02643K4674O188j6358O8411J08660N7853p3568
$$ -25850 -164692 -100164 -29638 -132281 -107607 -101419 -117777 -49366 59294 117147 43579
13845D3579q2836N5434Q0650p4002k1588p9414P1111M3011j29159O0518L3855
$$ 43579 -39257 16177 96827 22825 1237 -78177 -7066 35945 -93214 -32696 1159
13834A159M021m5978P0993j14110p0101j5246K06430P3825l6346j3223k4667q795
$$ 1159 5180 -40798 30195 -83915 -154016 -169262 37168 110993 74647 61424 36757 27962
13822B7962k0699p9051n860N5518k9607L0577k3527K8612O6477l6782J2911O5842
$$ 27962 7263 -71788 -77648 -22130 -51737 -21160 -44687 -16075 50402 13620 26531 92373
13810I2373N9330m7778k2418J4814o5961n4475o745L4868Q3565N0885j03089K1225
$$ 92373 151703 103925 81507 96321 30360 -24115 -30860 4008 87573 138458 35369 56594
13798E6594o2395P399N9638o4650R0427J46309K114m8260k26955l22K5946j18069
$$ 56594 -5801 1598 61236 -3414 87013 233322 235436 187176 -39779 -40101 -14155 -132224
13786a32224j9966J47598Q0389N3752o8713q3271n1174Q669l0651m7515m8369
$$ -132224 -152190 -4592 75797 129549 60836 -22435 -73609 -64940 -95591 -143106 -191475
13775a91475q710K2657j7698l0128m8370Q0040J17174J22359m1378n7420j03819
$$ -191475 -200185 -177528 -195226 -225354 -273724 -193684 -76510 45849 4471 -52949 -156768
13764a56768P6312J11673l2779m2911k6254n7611l4662P9756M5119k7461J10671
$$ -156768 -80456 31217 -1562 -44473 -70727 -128338 -163000 -83244 -38125 -65586 45085
13753D5085Q1263n5362K8214q6225j61788Q660J8942J6743J1626K906J4286K3785
$$ 45085 126348 70986 99200 12975 -148813 -140153 -121211 -104468 -92842 -89936 -75650 -51865
13741e1865N6072O2983O6734L6232q1198n1823m8864l8972j3606J10487K1307
$$ -51865 4207 67190 133924 170156 88958 37135 -11729 -50701 -64307 46180 67487
13730F7487K5988m822m2521p6051j8490K7095m4059j4045M5133R158k0534l208
$$ 67487 93475 88653 46132 -29919 -48409 -21314 -65373 -79418 -34285 -25127 -45661 -48869
13718d8869L1270k9792j682J30400N305L1522m3529l6201l220m1241r8742k3358
$$ -48869 -17599 -47391 -49073 81327 86632 118154 74625 38424 35204 -6037 -104779 -128137
13706a28137J05329P8415m7615r7591j12684Q5355O5469N4983R618L6928K0926
$$ -128137 -22808 55607 7992 -89599 -202283 -116928 -51459 3524 13142 50070 70996
13695G0996K182K6899N801p6658p6227Q0817M7525J0885l833k0326m8254j19712
$$ 70996 73178 100077 105878 29220 -47007 33810 81335 92220 88387 68061 19807 -99905
13683i9905j59997J42437N3748L7135L8049k5440l377l6984R4143L0412o6389
$$ -99905 -259902 -117465 -63717 -26582 11467 -13973 -17350 -54334 39809 70221 3832
13672C832l1724K13029Q5601n2506k9300o7247l1011l6119q3387J08130J00240
$$ 3832 -27892 185137 270738 218232 188932 121685 90674 54555 -28832 79298 179538
13661A79538q9805j06270r5241j4786R058L8736L4351R702L5673J9421M450j32480
$$ 179538 89733 -16537 -111778 -126564 -117506 -78770 -44419 -34717 956 20377 24827 -107653
13649a07653r6534o998J76060O2956m7736L4961O0867L2155K2397Q7477j1481
$$ -107653 -204187 -211185 -35125 27831 -19905 15056 75923 108078 130475 217952 206471
13638B06471m4930j19476j8896l2672m0762J42423L0971q1019o1458l5443L773
$$ 206471 161541 42065 23169 -9503 -50265 92158 123129 42110 -19348 -54791 -51018
13627e1018l713Q5798M0492n2036j43202p1289J01269n9520L5017J25024L6089
$$ -51018 -54731 31067 71559 19523 -123679 -194968 -93699 -153219 -118202 6822 42911
13616D2911j9925k8681n8110P638L2745Q2509O2974R8058L1749p5644q4704K2443
$$ 42911 22986 -5695 -63805 -56167 -23422 59087 122061 220119 251868 176224 91520 113963
13604A13963p669m3851L789k371m7117j1562Q0587j6642m5505j1008K0035n9985
$$ 113963 106294 62443 66232 63861 16744 5182 85769 69127 23622 12614 32649 -27336
13592b7336l5975K3165R0738q7973j64061J8427Q2604O1646R8526o6505o8399
$$ -27336 -63311 -40146 50592 -37381 -201442 -183015 -100411 -38765 59761 -6744 -75143
13581g5143Q8436o610p8514l9826l127j7376J6777Q8784L7059R7129L5711N5779
$$ -75143 13293 6683 -71831 -111657 -114784 -132160 -115383 -26599 10460 107589 143300 199079
13569A99079p75m5013j13333Q8050j8383j33736l0585J4491L0898N3007J322m3309
$$ 199079 198304 153291 39958 128008 109625 -24111 -54696 -40205 -9307 43700 45022 1713
13557A713K4565R2749l734K684n6540m734n8406j20639J675J10237K009l7228
$$ 1713 26278 119027 115293 117977 61437 56703 -1703 -122342 -120667 -10430 -8421 -45649
13545d5649q507J580N4098l8085j10727J243P686o0550J9575m849m0618L947j8731
$$ -45649 -54156 -52576 1522 -36563 -147290 -146047 -138361 -198911 -179336 -184185 -224803 -220856 -239587
13532b39587r7781L7556J32975L1782J8372k8627M7025J98208O0551q6835r5162
$$ -239587 -337368 -299812 -166837 -135055 -116683 -145310 -98285 99923 160474 73639 -21523
13521b1523r3085N5815J27511K955M408P1701n2955J211m0931o8494p8420J435
$$ -21523 -114608 -58793 68718 71673 76081 147782 94827 96038 55107 -13387 -91807 -90372
13509i0372L4813Q2112R1534p9504n9820n822R1263P1362r0025q3332n500J3901
$$ -90372 -55559 26553 118087 38583 -21237 -27059 64204 135566 45541 -37791 -43291 -29390
13497b9390J4707o1685j09409K9137J75180P2464r7040j0590r1870r8419q7377
$$ -29390 -14683 -76368 -185777 -156640 18540 91004 -6036 -16626 -108496 -206915 -294292
13486b94292J11361O9221J08417n5950L895j3336k5205K1615P3410J07012n4685
$$ -294292 -182931 -113710 -5293 -61243 -57348 -70684 -95889 -74274 -864 106148 51463
13475E1463O1859k0934n8473N131P4050M4201p6562o0315l0084j08205L1320J32956
$$ 51463 113322 92388 33915 39046 113096 157297 80735 20420 -9664 -117869 -86549 46407
13463D6407R8633o813p2587r2525j7184P2552L5932k0480l6993L7681N7740n8329
$$ 46407 145040 138227 65640 -26885 -44069 28483 64415 43935 6942 44623 102363 44034
13451D4034n3224K0794M0772j513O1746m4859n934l6137N1182m1434m7895q848
$$ 44034 -9190 11604 52376 50863 112609 67750 61816 25679 76861 35427 -12468 -21316
13439b1316j51435K9186m266J18924J9598q1879J09405M3549m6155J63007M789
$$ -21316 -172751 -143565 -147831 -28907 -9309 -91188 18217 61766 15611 178618 183407
13428A83407j71143r5928J20162L1908J6864k2835m2730j6465J0280J35333m3307
$$ 183407 12264 -83664 36498 68406 85270 62435 19705 3240 13520 148853 105546
13417A05546o6357J0687L0125N1764r9505j32180N5353j718N6047J15173O2559
$$ 105546 39189 49876 80001 131765 32260 -99920 -44567 -46285 9762 124935 187494
13406A87494J9218n7227Q6578K9108J0936n9190o2777j55412m2903N8660N8159
$$ 187494 206712 149485 236063 265171 276107 216917 154140 -1272 -44175 14485 72644
13395G2644N366p262p90N2718K257M5990L9468k0096m6466o41M5343j9630q4625
$$ 72644 78010 70748 69958 122676 124933 170923 210391 190295 143829 143188 188531 168901 84276
13382H4276n859J51494J1773o0852j0262k1111J8571j7012m2772q1641k2853K0666
$$ 84276 78417 229911 241684 180832 170570 149459 168030 151018 108246 26605 3752 24418
13370B4418m1946o9835J03262m8237L9242J84996r2556j45608j19239o3926L2660
$$ 24418 -17528 -87363 15899 -32338 6904 191900 99344 -46264 -165503 -229429 -196769
13359a96769l8003Q3288L2122J44874J61263J34828m1706p8979j07021o7340j4963
$$ -196769 -234772 -151484 -119362 25512 186775 321603 279897 200918 93897 26557 11594
13348A1594M5265n0427l1080N7038J3904K2069n3366k7829m393q1432l4933L0629
$$ 11594 56859 6432 -24648 32390 46294 68363 14997 -12832 -17225 -98657 -133590 -102961
13336a02961q5591N1386J03603J03446O9820o9599O9478j29799m6710M1272J82
$$ -102961 -188552 -137166 -33563 69883 139703 70104 139582 9783 -36927 4345 4527
13325D527l0775J11430J3231j4486j01983k7724r182l3178l390O3915J06264M140
$$ 4527 -26248 85182 98413 83927 -18056 -45780 -54962 -88140 -91530 -27615 78649 82789
13313H2789l7790j4212k3768m2373j58322K3928J53354l1477l5744m9087N1976
$$ 82789 44999 30787 7019 -35354 -193676 -169748 -16394 -47871 -83615 -132702 -80726
13302h0726P3545J63991Q7763k13007l9866R0956k6178r7825O6659M9743k1370
$$ -80726 -7181 156810 244573 31566 -8300 82656 56478 -41347 25312 75055 53685
13291E3685p0929j2563N9343J7919o4776p9825K355K2341K213K5479J10394l1823
$$ 53685 -17244 -29807 29536 47455 -17321 -97146 -94791 -72450 -70237 -44758 65636 33813
13279C3813L0252l73k7076q5299r3091m0506L5912R8336O0260J2019l9214J70926
$$ 33813 64065 63692 36616 -48683 -141774 -182280 -146368 -48032 12228 24247 -14967 155959
13267A55959N1447J3071j79637l9307R9118J3404K7438k4552L2225n0480l9453
$$ 155959 207406 220477 40840 1533 100651 114055 141493 116941 149166 98686 59233
13256E9233j11389K187M5490j29576R608R9356J8178R157n7007m4617j51491Q4207
$$ 59233 -52156 -49969 -4479 -134055 -124447 -25091 -6913 2244 -54763 -99380 -250871 -166664
13244a66664M3799Q3801J179N1086L682j05432L1930J35249n7907j31925q6263
$$ -166664 -122865 -39064 -37885 13201 16883 -88549 -56619 78630 20723 -111202 -197465
13233a97465M4936Q0926L8960q7775J20766N1485n5596o9454N6094n5291n3172
$$ -197465 -152529 -71603 -32643 -120418 348 51833 -3763 -73217 -17123 -72414 -125586
13222a25586K9021J24585L5501l5573N2467p3434j8896P8742q093j06539j13962
$$ -125586 -96565 28020 63521 27948 80415 6981 -11915 66827 58734 -47805 -161767
13211a61767L4665n914l4394P3406J35034N3721P8696j8483j82952j6618J38508
$$ -161767 -127102 -133016 -167410 -94004 41030 94751 173447 154964 -27988 -44606 93902
13200I3902K2214p4723j38291r7049L9754J07370K09063L7358q7604m5834j277
$$ 93902 116116 41393 -96898 -193947 -154193 -46823 162240 199598 111994 66160 64883
13189F4883l0245p3472k5766j1927J33133j203o7696o657k6806k7990Q6420J19322
$$ 64883 34638 -38834 -64600 -76527 56606 55403 -12293 -18950 -45756 -73746 12674 131996
13177A31996Q5811K9785m3299r7037J9314r1776j47529m1124l3215J60719J4723
$$ 131996 217807 247592 204293 107256 126570 34794 -112735 -153859 -187074 -26355 -11632
13166a1632k9813P9296K3953j41448n7425M9987J64579p234m7679m6966J0049
$$ -11632 -41445 37851 61804 -79644 -137069 -87082 77497 70263 22584 -24382 -14333
13155a4333k3265o5749J73285J14396L3322r3453j15424r8661m030R9906N7305
$$ -14333 -37598 -103347 69938 184334 217656 124203 8779 -89882 -93912 5994 63299
13144F3299R2667r1693j52291o9395k9601R2622p659k900Q6885m7726j06921O9982
$$ 63299 155966 64273 -88018 -157413 -187014 -94392 -102051 -104951 -18066 -65792 -172713 -102731
13132a02731J30910p5710r8126m0247R1656J20701r1442j7491o6910O3970J20137
$$ -102731 28179 -47531 -145657 -185904 -94248 26453 -64989 -82480 -149390 -85420 34717
13121C4717M2470l9753K9876o4730j352N2024r4859J4648L2184l8329j25266O0112
$$ 34717 77187 37434 67310 2580 1228 53252 -41607 -26959 5225 -33104 -158370 -98258
13109i8258R778k6299j4873l1282K2073J06417L7243O0746p8371l2150R9703m2019
$$ -98258 -88480 -114779 -129652 -160934 -138861 -32444 4799 65545 -12826 -44976 54727 12708
13097A2708M3475j2582P331l2767j6090J2978j00645L5055O3331m4138K2518m4428
$$ 12708 56183 43601 50932 18165 2075 15053 -85592 -50537 12794 -31344 -8826 -53254
13085e3254l1229Q440M3481M3863R732K8480j5576j48439q1926K0294J5184J22619
$$ -53254 -84483 -76043 -32562 11301 21033 49513 33937 -114502 -196428 -176134 -160950 -38331
13073c8331J6093J2007k6947j658q1224m4964J5282j1407J21592J33078p683J4015
$$ -38331 -22238 -10231 -37178 -38836 -120060 -165024 -149742 -161149 -39557 93521 85838 99853
13061I9853j1384j61332j21496P4536J91405J63964l0080l9540o2721k05882j4138
$$ 99853 88469 -72863 -194359 -119823 71582 235546 205466 165926 103205 -102677 -116815
13050a16815N9597Q3598R2925m0736k9704j5473q8092m8861l5578J3934K0056
$$ -116815 -57218 26380 119305 78569 48865 33392 -54700 -103561 -139139 -125205 -105149
13039a05149J30256O3596p9291q8665j13630j2894J22730R7869p9090j3173J0835
$$ -105149 25107 88703 9412 -79253 -192883 -205777 -83047 14822 -64268 -77441 -66606
13028f6606L414r0063j9502J57241J21530k6951p0468j72157n7121J14332n0324
$$ -66606 -63192 -153255 -172757 -15516 106014 79063 8595 -163562 -220683 -106351 -156675
13017a56675j06380j23P4364K2622j9694j96O6539O6451j09258j6499l1763m2941
$$ -156675 -263055 -263178 -188814 -166192 -185886 -186082 -119543 -53092 -162350 -178849 -210612 -253553
13005b53553M5968j9042j6896J47135K0906J25724L2447O98Q7598o3102j39537
$$ -253553 -207585 -226627 -243523 -96388 -75482 50242 82689 83387 170985 107883 -31654
12994c1654k5625P0209J478l213k5519l7888K6389L323n9193R219k3366O900r153
$$ -31654 -57279 12930 14408 11195 -14324 -52212 -25823 -22500 -81693 -72474 -95840 -88940 -98093
12981i8093K7583J1268L5363o6687m4940p9549Q025J76195J20808J9669r7432
$$ -98093 -70510 -59242 -23879 -90566 -135506 -215055 -207030 -30835 89973 109642 12210
12970A2210m8309N4420P5325k9344m1871k9883J5057J3680m7266j08854j0874
$$ 12210 -36099 18321 93646 64302 22431 -7452 7605 21285 -25981 -134835 -145709
12959a45709O0803J4857k4110P077Q4962o920L47j5120q9522p6156K0834J26504
$$ -145709 -84906 -70049 -94159 -87082 -2120 -9040 -8693 -23813 -113335 -189491 -168657 -42153
12947d2153L6104L0255J7440j2047m9508J0945M8791K7712o1717j29406J21301
$$ -42153 -6049 24206 41646 29599 -19909 -8964 39827 67539 5822 -123584 -2283
12936b283M4084K2037p6198j04754k7802k3144j8835O6421K9947j40561l6499
$$ -2283 41801 63838 -12360 -117114 -144916 -168060 -186895 -120474 -90527 -231088 -267587
12925b67587P7681J04426J02224l3616j34575K0588J58161Q1941R3220k5369j86380
$$ -267587 -189906 -85480 16744 -16872 -151447 -130859 27302 109243 202463 177094 -9286
12914i286q2291j02881L6692j28430q088J09296J18473K2859K1047L2666m5065
$$ -9286 -91577 -194458 -157766 -286196 -294284 -184988 -66515 -43656 -22609 10057 -35008
12903c5008r7421o6676J04302M8832l9069O5564k4316o7228n3351k2213O669J3331
$$ -35008 -132429 -199105 -94803 -45971 -85040 -19476 -43792 -111020 -164371 -186584 -179915 -166584
12891a66584j9554Q4484K4129m6227M0108J22945j6533o1405r247P0031M9809
$$ -166584 -186138 -101654 -77525 -123752 -83644 39301 22768 -38637 -47884 22147 71956
12880G1956j3178K3238p3441k1872K0452m4292o3475M4416m895K7306J42667L650
$$ 71956 58778 82016 8575 -13297 7155 -37137 -100612 -56196 -61091 -33785 108882 112532
12868A12532j07434q3571n1513j0916k0230O4053k5m5641O5964M4382P2770L2901
$$ 112532 5098 -78473 -129986 -140902 -161132 -97079 -97104 -142745 -76781 -32399 40371 73272
12856G3272Q041Q2719n9556r3260K408P7467P1026m9603k2200o3164J4812m5971
$$ 73272 81313 164032 104476 11216 13624 91091 162117 112514 90314 27150 41962 -4009
12844d009j31314Q4762Q8090k7159m7418l718N4594j146p8702j3984L6343n2998
$$ -4009 -135323 -50561 37529 10370 -37048 -40766 13828 12682 -66020 -80004 -43661 -96659
12832i6659J7768Q048l6851O2851J1147M132o6142j5898K9249N3564k6691L8353
$$ -96659 -78891 -70843 -107694 -44843 -33696 -29564 -95706 -111604 -82355 -28791 -55482 -17129
12820a7129L6476R581M635P1747k1698l1890q362j34168p8183P04j0896J09258
$$ -17129 19347 28928 33563 105310 83612 51722 43360 -90808 -168991 -168287 -179183 -69925
12808f9925M6357L7559L4264k3201J007p1491J1176K2803L7264k8900J6982P456
$$ -69925 -23568 13991 48255 25054 26061 -45430 -34254 -11451 25813 -3087 13895 21351
12796B1351j61951j414k9523R9923J04474M1572R460L4966o7990o5511L2995K4097
$$ 21351 -140600 -142014 -171537 -71614 32860 74432 83892 118858 50868 -14643 18352 42449
12784D2449N6037J36431j4386j19500j7456L5377l6198q6659n337L7279n6745
$$ 42449 98486 234917 220531 101031 83575 118952 82754 -3905 -9242 28037 -28708
12773b8708j4625J28253O5472j6211k3987K9853j6585m9341p8863K1194R6339
$$ -28708 -43333 84920 150392 134181 110194 140047 123462 74121 -4742 16452 112791
12762A12791M2342L5717J333j38436N9732j79809j06146L5381R7195O3425J06877
$$ 112791 155133 190850 192183 53747 113479 -66330 -172476 -137095 -39900 23525 130402
12751A30402p6610q3228k496n5458k25553R4885K37973n3809j20180m8306L7452
$$ 130402 53792 -29436 -31932 -87390 -312943 -218058 19915 -33894 -154074 -202380 -164928
12740a64928Q9787J1103P9006n7970p9547J9645N5898K2569J55595J4871n0089
$$ -164928 -75141 -64038 14968 -43002 -122549 -102904 -47006 -24437 131158 146029 95940
12729I5940j0062J8489l4850l1823l6123J6687j2979K1400l4255j3852j6986N3438
$$ 95940 85878 104367 69517 37694 1571 18258 5279 26679 -7576 -21428 -38414 15024
12717A5024M7384K8618R4877o1836P60p5561p175k0517q131K7163l9816k6869
$$ 15024 62408 91026 185903 124067 124827 49266 42091 21574 13443 40606 790 -26079
12705b6079n4036o0413L3357J7805O0842J19975p211P9453J16478r936j27770
$$ -26079 -80115 -140528 -107171 -89366 -28524 91451 84240 163693 280171 270235 142465
12694A42465p2094J40317M7258p1480q2015k5815M3891k237l9436j05437J8455
$$ 142465 70371 210688 257946 186466 104451 78636 122527 120290 80854 -24583 -6128
12683f128J02537J5286L0428p3857j07570k6980K7038j0198J04157j30921k7033
$$ -6128 96409 111695 142123 68266 -39304 -66284 -39246 -49444 54713 -76208 -103241
12672a03241O1830K1839P0325l3854p7541J07108O8381M892j21899j20245k7894
$$ -103241 -41411 -19572 50753 16899 -60642 46466 114847 119739 -2160 -122405 -150299
12661a50299l4118J39248k6502k3010m090L459P3555J9706L5617N6443n0914m9892
$$ -150299 -184417 -45169 -71671 -94681 -98771 -95312 -21757 -2051 33566 90009 39095 -10797
12649a0797m041N8604m4922N1408M2151L8499n9410j21009j05679n3464m9779
$$ -10797 -14838 43766 -1156 50252 92403 130902 71492 -49517 -155196 -208660 -258439
12638b58439K09843L086p2616N0903k7949l836J1547J9833J6469j8615q2085K2488
$$ -258439 -48596 -45510 -118126 -67223 -95172 -99008 -87461 -67628 -51159 -69774 -151859 -129371
12626a29371N7952K16505K4094n7688r6265j2011k8820q5055J4983J20535J56497
$$ -129371 -71419 145086 169180 111492 15227 3216 -25604 -110659 -95676 24859 181356
12615A81356l4723p5016L6307q4262o413r1842j08370m4822J30362P3768L447
$$ 181356 146633 71617 107924 23662 17249 -74593 -182963 -227785 -97423 -23655 -20208
12604b0208j1693l9209l7792j856R4572J4776l0599j07752l4175K7991K6225p8269
$$ -20208 -31901 -71110 -108902 -110758 -16186 -1410 -32009 -139761 -173936 -145945 -119720 -197989
12592a97989L9016P257J6271N2172L3750o9505J8260K4818O0387J47751j20955
$$ -197989 -158973 -151716 -135445 -83273 -49523 -119028 -100768 -75950 -15563 132188 11233
12581A1233j63381M1409N9950M7667k1969j00955N2534M4544p0096q8905o5827
$$ 11233 -152148 -110739 -50789 -3122 -25091 -126046 -73512 -28968 -99064 -187969 -253796
12570b53796j1730M1948Q2867O6507j3023J02825P7103r5920L4608N2957M4753
$$ -253796 -265526 -223578 -140711 -74204 -87227 15598 92701 -3219 31389 84346 129099
12559A29099J9149n1591p4156K360P194J6770L7412K4793r799l2457M293M6044
$$ 129099 148248 96657 22501 24861 32055 48825 86237 111030 101231 68774 73067 119111
12547A19111m2073q1230o4970L2104o1066R7664M472N8631j0223Q3J03027N7608
$$ 119111 77038 -4192 -69162 -37058 -98124 -460 4012 62643 52420 52503 155530 213138
12535B13138p5066o1522l7701o239l9959j22164O4897Q5611J30081p3744j50224
$$ 213138 138072 76550 38849 32610 -7349 -129513 -64616 20995 151076 77332 -72892
12524g2892L156p014M0128L5089l687j8881l0611j02130K5809P5041J17044k3188
$$ -72892 -69736 -76750 -36622 -1533 -5220 -24101 -54712 -156842 -131033 -55992 61052 37864
12512C7864l8709m887O0934M2649r5977J2154R8511p5695n7225J18287L4575M756
$$ 37864 -845 -5732 55202 97851 1874 14028 112539 36844 -20381 97906 132481 137237
12500A37237j1186j02605j0868P1324J744K6389p395n5640q44J8280K1572n0964
$$ 137237 126051 23446 12578 83902 85646 112035 104640 49000 48156 66436 88008 37044
12488C7044q0758m474N8306J00362L5475j92076p4067q4531L633O4919L241J3687
$$ 37044 -43714 -48188 10118 110480 145955 -46121 -120188 -204719 -201086 -136167 -132926 -119239
12476a19239J1998N5210O620m6875o7493L2354J88715l9975o3331n0815K0793
$$ -119239 -107241 -52031 -45411 -92286 -159779 -127425 61290 21315 -42016 -92831 -72038
12465g2038J06941k0341k7624R6101J10349J0344j50106q1511l5610o8594O3954
$$ -72038 34903 14562 -13062 83039 193388 203732 53626 -27885 -63495 -132089 -68135
12454f8135M3988m6989J2779Q5284Q9078j41591j58400L0231J04215L1623M4073
$$ -68135 -24147 -71136 -58357 26927 116005 -25586 -183986 -153755 -49540 -17917 26156
12443B6156J5802M9659P3020K5029j8633l3914n2148j0556j11565J586n7262j2001
$$ 26156 41958 91617 164637 189666 171033 137119 84971 74415 -37150 -35564 -92826 -104827
12431a04827J40341l580n6352M8931K9434l2787n4632N8138K2228m1921l4447
$$ -104827 35514 31934 -24418 24513 53947 21160 -33472 24666 46894 4973 -29474
12420b9474R5654N8669K2537j05671k5821l7606K1770N8714Q9542n4520k23325
$$ -29474 66180 124849 147386 41715 15894 -21712 58 58772 148314 93794 -129531
12409a29531m9121L5307l7567J27321P0144M162J9627o735n4323L8627j62687
$$ -129531 -178652 -143345 -180912 -53591 16553 20715 40342 33607 -20716 17911 -144776
12398a44776j13231P3787J45625J215M3223j9448m2115K210m7220O9075N4356
$$ -144776 -258007 -184220 -38595 -37380 5843 -13605 -55720 -53510 -100730 -31655 22701
12387B2701L698k5067k9146K9067p9525l713J10088J80662M0391j44572p8476
$$ 22701 26399 1332 -27814 1253 -78272 -81985 28103 208765 249156 104584 26108
12376B6108p5644M0660P9213L2480N5507j3151q6615P2215l2695j44l0305j2374
$$ 26108 -49536 -8876 70337 102817 158324 145173 58558 130773 98078 97934 67629 55255
12364E5255p9895Q6988n5664O9620L6292p8980K6182k1519o5043n6217m8689q103
$$ 55255 -24640 62348 6684 76304 112596 33616 59798 38279 -26764 -82981 -131670 -139773
12352a39773k9044m985P967P9472J54319J17160J13708n7118j12647j50720j1129
$$ -139773 -168817 -173802 -165835 -86363 67956 185116 298824 241706 129059 -21661 -32790
12341c2790J50342K906j64474L7856m2689j12685L1106P9229j27776r4751J54201
$$ -32790 117552 120458 -44016 -6160 -48849 -161534 -130428 -51199 -178975 -273726 -119525
12330a19525J03384M2497r6004k9425M5438N6201J15307J04958o7227j42129p3198
$$ -119525 -16141 26356 -69648 -99073 -53635 2566 117873 222831 155604 13475 -59723
12319e9723J67094J40661j04143n6100Q8582O9883l7503l0181k0283r522M9105
$$ -59723 107371 248032 143889 87789 176371 246254 208751 178570 158287 148765 197870
12308A97870J2389q4359j00143O9489K9422M5973k9204q8499n2132L1725o5463
$$ 197870 210259 125900 25757 95246 124668 170641 141437 52938 806 32531 -32932
12297c2932M5285n148l5387m2457L3274M4259J02976k1071j16814N1904L6479
$$ -32932 12353 7205 -28182 -70639 -37365 6894 109870 88799 -28015 23889 60368
12286F0368r6774j05748j6262J13863J61169n8986j20346j0132m1829j287j3646
$$ 60368 -36406 -142154 -158416 -44553 116616 57630 -62716 -72848 -114677 -115964 -129610
12275a29610j27474p764K00513N7478N3898q8300N7036q9873o7100P0640J69865
$$ -129610 -257084 -264848 -64335 -6857 47041 -41259 15777 -74096 -141196 -70556 99309
12264I9309J8191j20019l9229J27609J80922j907j69416r9111n8548p5858n2358
$$ 99309 117500 -2519 -41748 85861 266783 264876 95460 -3651 -62199 -138057 -190415
12253a90415k2183L562J18805K5765L4117m755K9348q69O748O8067N7868M6194
$$ -190415 -212598 -209036 -90231 -64466 -30349 -35104 -5756 -6625 123 68190 126058 172252
12241A72252n7290p3608m9783p1971M5017P7527N5421j18703j16124j4902J15165
$$ 172252 114962 41354 -8429 -80400 -35383 42144 97565 -21138 -137262 -152164 -36999
12230c6999p806N3305r9421j47401J00815L4439o6197n4034J28204J70351p2474
$$ -36999 -44805 8500 -90921 -238322 -137507 -103068 -169265 -223299 -95095 75256 2782
12219B782j485O5587Q262n9484p520j06132m2852K0384J6741M1001M7138L7389
$$ 2782 1297 66884 75146 15662 8142 -97990 -140842 -120458 -103717 -62716 -15578 21811
12207B1811k3035j9245K0164N1675p3839k2782J04724O5558n6450p2296r9707
$$ 21811 -1224 -20469 -305 51370 -22469 -45251 59473 125031 68581 -3715 -103422
12196a03422j6435k1993j17481J02700J13309K9502p6167J24195J22143l9982
$$ -103422 -119857 -141850 -259331 -156631 -43322 -13820 -89987 34208 156351 116369
12186A16369q045l4496o0077j8763l4356j7121J0876N0684L9171j17559o6890
$$ 116369 108324 73828 13751 -5012 -39368 -56489 -45613 5071 44242 -73317 -140207
12175a40207m7240q6507M6094J78889R7077l7956n2860N7594J7782J9672k0279
$$ -140207 -187447 -273954 -227860 -48971 48106 10150 -42710 14884 32666 52338 32059
12164C2059M337o9272j21810R6463k4059k39R1923l1221j8851n9155J12821J35558
$$ 32059 36396 -32876 -154686 -58223 -82282 -82521 9402 -21819 -40670 -99825 12996 148554
12152A48554L9907j044M82p598J6847r4418l0179p5527q7789l7582L6233J43672
$$ 148554 188461 187417 187899 180301 197148 102730 72551 -2976 -90765 -128347 -92114 51558
12140E1558O4791O036m8069m5276O4518L892j67851o7495j461Q0899Q5752N3937
$$ 51558 116349 122385 74316 29040 93558 97450 -70401 -137896 -139357 -58458 27294 81231
12128H1231l0200p3825M5775Q1668j8390O2972p0936k60661j00204L837J15873
$$ 81231 51031 -22794 22981 104649 86259 149231 78295 -182366 -282570 -278733 -162860
12117a62860P3918P5703q485J9772p567J08364Q5733L9426q3073j25826m3058
$$ -162860 -88942 -13239 -21724 -1952 -9519 98845 184578 224004 140931 15105 -27953
12106b7953L4586J5725j6884J4964O154O8781n3645l4517L162K7786q1219J831
$$ -27953 6633 22358 5474 20438 26592 95373 41728 7211 10373 38159 -43060 -41229
12094d1229Q6091n7142N7889P6179j13367q4196J20160M3168n8078k6399q0880
$$ -41229 44862 -12280 45609 121788 8421 -75775 44385 87553 29475 3076 -77804
12083g7804l3380O7153k1232r9392J12549M2438m7964Q8892O0365l3894j07257
$$ -77804 -111184 -44031 -65263 -164655 -52106 -9668 -57632 31260 91625 57731 -49526
12072d9526l0135r6995p5311J19306O7282k2766k7235J32540L8040o8545Q820
$$ -49526 -79661 -176656 -251967 -132661 -65379 -88145 -115380 17160 55200 -13345 -4525
12061d525O0202L3741J089j00035L2490o9314j10523O8712P9899L0417K1683r4117
$$ -4525 55677 89418 90507 -9528 22962 -46352 -156875 -88163 -8264 22153 43836 -50281
12049e0281l9906o4375O5313O5369O1244p660O0590p6252q7595q4761P3149M9000
$$ -50281 -90187 -154562 -89249 -23880 37364 29704 90294 14042 -73553 -158314 -85165 -36165
12037c6165k7035Q020P8057j2465l9705M3533R7237J2798j02203k28267j1012
$$ -36165 -63200 -55180 22877 10412 -29293 14240 111477 124275 22072 -206195 -217207
12026b17207Q3266n439k529O0749n4896J5891R325j669K8991J3919k0070k0731
$$ -217207 -133941 -139380 -141909 -81160 -136056 -120165 -110840 -112509 -83518 -69599 -89669 -110400
12014a10400o0381J2329k1816r9360J00244J08360J3087o4865R0565Q4580P744
$$ -110400 -170781 -158452 -180268 -279628 -179384 -71024 -57937 -122802 -32237 52343 60087
12003F0087k3980k1042r3535M283Q4769j77954j9306J41729Q7898J03159N8836
$$ 60087 36107 15065 -78470 -74187 10582 -167372 -186678 -44949 42949 146108 204944
11992B04944L0529j9874j19316o1117J92497M5822M343j00265L926o3708j36401
$$ 204944 235473 215599 96283 35166 227663 273485 277828 177563 181489 117781 -18620
11981a8620L9875L7774k8528n6450j23503l9061Q527J50126J15880j6312n7062
$$ -18620 21255 59029 30501 -25949 -149452 -188513 -179986 -29860 86020 69708 12646
11970A2646j6379j21253j7592J03763Q533K4095J7289j3153q8094l9883N28l0431
$$ 12646 -3733 -124986 -142578 -38815 -30282 -6187 11102 -2051 -90145 -130028 -129500 -159931
11958a59931l5783O7013O9576J2272J7958j0939r9257m8962P149k084k6986j9905
$$ -159931 -195714 -128701 -59125 -46853 -28895 -39834 -139091 -188053 -180904 -182988 -209974 -229879
11946b29879J3191L2827K7508j5592k1249M8346n8129J00971Q0760M0191J2957
$$ -229879 -216688 -183861 -156353 -171945 -193194 -144848 -202977 -102006 -21246 18945 31902
11935C1902L2248M7669o401j25177o694J36666o0170j49397L084N0584L898J13321
$$ 31902 64150 111819 105418 -19759 -26453 110213 50043 -99354 -96270 -45686 -41788 71533
11923G1533J25670k3727j31172j67776q543K9296l3866O556m3225o3242K9171
$$ 71533 197203 173476 42304 -125472 -134015 -104719 -138585 -132029 -175254 -238496 -209325
11912b09325J62676R3592r997n5950q3408L9307M5321R2826K0430r904n0134N5755
$$ -209325 -46649 46943 36946 -19004 -102412 -63105 -17784 75042 95472 85568 35434 91189
11900I1189l7930j26055L2194k3046K0725K16476j4764r5971p0943J41769J32077
$$ 91189 53259 -72796 -40602 -63648 -42923 173553 158789 62818 -8125 133644 265721
11889B65721r2573j52739j6280O4351n7506N9259n0841n7037m8248L1133L2435
$$ 265721 173148 20409 4129 68480 10974 70233 19392 -37645 -85893 -54760 -22325
11878b2325K8741P3668m5500j07538K4672k019K2317O1158K0836o938j0373q348
$$ -22325 6416 80084 34584 -72954 -48282 -50301 -27984 33174 54010 47072 36699 28351
11866B8351k016p5686L0189L8823J35065Q2153p8449K3390N0418l0194l5450K0798
$$ 28351 26335 -49351 -19162 19661 154726 236879 158430 181820 232238 202044 166594 187392
11854A87392j22625o8314K6398j09275o3171k6489o1046J34674J05388k2754m2115
$$ 187392 64767 -3547 22851 -86424 -149595 -176084 -237130 -102456 2932 -19822 -61937
11843f1937K024j54496m6566O3398R3232N6724K90N3925O6829j0216n8529O1050
$$ -61937 -59913 -214409 -260975 -197577 -104345 -47621 -47331 6594 73423 63207 4678 65728
11831F5728P6803r5827j62442P825J00487J11936Q7669o684j00846j03526r335
$$ 65728 142531 46704 -115738 -107913 -7426 104510 192179 185495 84649 -18877 -28212
11820b8212j2041K2292J55637j7218q7258J3249M3401Q4554n1433j08787l3166
$$ -28212 -40253 -17961 137676 120458 33200 46449 89850 174404 122971 14184 -18982
11809a8982q9610R1338J25166o4134l2991K9886M2081j39916j2140M0104q700
$$ -18982 -108592 -17254 107912 43778 10787 40673 82754 -57162 -69302 -29198 -37898
11798c7898K5688J13586p7691n2120r8139m1162k7493m165N662Q1257J05731O1535
$$ -37898 -12210 101376 23685 -28435 -126574 -167736 -195229 -199394 -193732 -112475 -6744 54791
11786E4791O9890q5293j8316n7146o4987J01173N7940j10645L3017n495o1794
$$ 54791 124681 39388 21072 -36074 -101061 112 58052 -52593 -19576 -25071 -86865
11775h6865M4559J60867J05485m8553l3596l8279k3680o4908j16652q6674q0398
$$ -86865 -42306 118561 224046 175493 141897 103618 79938 15030 -101622 -188296 -268694
11764b68694J28933N2662q3476L4589J75531J13402k3080J45m1350n3630J26371
$$ -268694 -139761 -87099 -170575 -135986 39545 152947 129867 130012 88662 35032 161403
11753A61403P4358o1090m4942j5945p6767o2733k3100p7948N9140l724k5043J0165
$$ 161403 235761 174671 129729 113784 37017 -25716 -48816 -126764 -67624 -71348 -96391 -86226
11741h6226m3482M1658O3089J2914k272n081k6362n25J4518J24092L8006m356
$$ -86226 -129708 -88050 -24961 -12047 -14319 -19400 -45762 -46287 -31769 92323 130329 125973
11729A25973o1185p308J15177j8842j90888K7806O3477k5479m2633K2750n58j40858
$$ 125973 64788 57480 172657 153815 -37073 -9267 54210 28731 -13902 8848 8290 -132568
11717a32568L3872R7051o7715N4922Q7381n6090j388O6052m1878L7398J36405
$$ -132568 -98696 -1645 -69360 -14438 72943 16853 15465 81517 39639 77037 213442
11706B13442L9057q2344J7565q0544j12905n5992k7855n958N7422R1155Q489M9961
$$ 213442 252499 170155 187720 107176 -5729 -61721 -89576 -95534 -38112 53043 61532 111493
11694A11493L337o0902r2672m9524j8969N9292Q8191k7354o6447L3574j756p398
$$ 111493 114830 53928 -38744 -88268 -107237 -47945 40246 12892 -53555 -19981 -21737 -29135
11682b9135M4802r0483j66009J3439J67155O2842q8753J07945L3434o1129P059
$$ -29135 15667 -74816 -240825 -227386 -60231 2611 -86142 21803 55237 -5892 1167
11671A167m2660K4194R8016P6640R886q2893k2043j4372p2912q893L4744p9387
$$ 1167 -41493 -17299 80717 157357 167243 84350 62307 47935 -24977 -33870 874 -78513
11659g8513k4050j8003n0383K1659J61066l3633j8176L5576n856N5909J9156j3368
$$ -78513 -102563 -120566 -170949 -149290 11776 -21857 -40033 -4457 -10313 45596 64752 51384
11647E1384j1955p4350m6419j01334O1498R6707L250J01429J40301p9958j04758
$$ 51384 39429 -34921 -81340 -182674 -121176 -24469 -21219 80210 220511 140553 35795
11636C5795j27041q3810J60627K697j73996k0482J08284L8683l7259J53736M3797
$$ 35795 -91246 -175056 -14429 -11732 -185728 -206210 -97926 -59243 -96502 57234 101031
11625A01031n2032k5805O831K3867M5310J16432l3909j10229P2010K7958L3223
$$ 101031 48999 23194 30025 53892 99202 215634 181725 71496 143506 171464 204687
11614B04687l1918p4309q6906J6037J02706Q0525M536N737n2549m5892l036n0956
$$ 204687 172769 98460 11554 27591 130297 210822 215358 221095 168546 122654 119618 68662
11602F8662j5159j2751N781j8579m189k8681o0049J6647Q3178Q4434l3647k9205
$$ 68662 53503 40752 46533 27954 23765 -4916 -64965 -48318 34860 119294 85647 56442
11590E6442n3081o8235P3513r8423n3836l0999j8789P7732J854P9737o6643l2766
$$ 56442 3361 -64874 8639 -89784 -143620 -174619 -193408 -115676 -113822 -34085 -100728 -133494
11578a33494J3404l6255J31P5857O6752k687O9980L5081k9333j91013j4780n1970
$$ -133494 -120090 -156345 -156214 -80357 -13605 -16292 53688 88769 59436 -131577 -146357 -198327
11566a98327J27315N3981L7593M549K6519l649J0825J24107p5060m7792K6002
$$ -198327 -71012 -17031 20562 25111 51630 47981 58806 182913 107853 60061 86063
11555H6063j9613L291M3240J07086Jp4414n1811M6682o0293j23101K2624K7104
$$ 86063 66450 69741 112981 220067 220068 145654 93843 140525 80232 -42869 -20245 6859
11543F859j0444k7188J4592r76N221j03750m8073N9822M0000K4333J08721m3625
$$ 6859 -3585 -30773 -16181 -17157 -11936 -115686 -163759 -103937 -63937 -39604 69117 25492
11531B5492l5623N2415K7220q297l3687m3140n8019J11959r1367p1168J7247m0939
$$ 25492 -10131 42284 69504 61207 27520 -15620 -73639 38320 -53047 -124215 -106968 -147907
11519a47907M5799m6641n337N4490j5642N8522Q0898p899K6778j4291N500o1397
$$ -147907 -102108 -148749 -154086 -99596 -115238 -56716 24182 16283 43061 28770 34270 -27127
11507b7127m2320m7023K9502j3672q570K5415J06827m8756K9281l3002N1783J39707
$$ -27127 -69447 -116470 -86968 -100640 -109210 -83795 23032 -25724 3557 -29445 22338 162045
11495A62045N5818k4448k2909k913j1810l5378j35798j19556J03367j6671R568
$$ 162045 217863 193415 170506 167593 155783 120405 -15393 -134949 -31582 -48253 -38685
11484c8685P0524m484P114J9363l2224L2999J21973o3432j09190M5475M8445k7945
$$ -38685 31839 27355 34469 53832 21608 54607 176580 113148 3958 49433 97878 69933
11472F9933l4980k3735K4772J09996K698Q4960q006k3733j50637L7544J37585
$$ 69933 34953 11218 35990 145986 148684 233644 225638 201905 51268 88812 226397
11461B26397Q639p6576o3365o1442J19022j5445q9035n932j46988m243J36029
$$ 226397 235036 158460 95095 33653 152675 137230 48195 42263 -104725 -108968 27061
11450B7061N9691O1402m9768O2655Q9799k4860o411o1569k7968Q9718N6600k4435
$$ 27061 86752 148154 98386 161041 250840 225980 219569 158000 130032 219750 276350 251915
11438B51915p1516l1965K0284R0243l8705p6046m8725K508l2898j64339n6136
$$ 251915 180399 148434 168718 258961 220256 144210 95485 97993 65095 -99244 -155380
11427a55380O3890k3812j0040R3864J2108J2313M4214p5265q6036j02997M4371
$$ -155380 -91490 -115302 -125342 -31478 -19370 -7057 37157 -38108 -124144 -227141 -182770
11416a82770J38011J7091o3245m4605M9724O8841M2946m4547J5512M959N2221
$$ -182770 -44759 -27668 -90913 -135518 -85794 -16953 25993 -18554 -3042 1917 54138
11405E4138o211L9101Q1251j06863q2144P8568R0478J2044q158j25658j86711
$$ 54138 47927 87028 168279 61416 -20728 57840 148318 160362 152204 26546 -160165
11394a60165o6273J28424J36113k9903r9650j4214Q1539J7622N6608k5604j41364
$$ -160165 -226438 -98014 38099 8196 -91454 -105668 -24129 -6507 50101 24497 -116867
11383a16867m1115J3863K5507R9941J09880j02127j8677j10555m3174R7199q044
$$ -116867 -157982 -144119 -118612 -18671 91209 -10918 -29595 -140150 -183324 -86125 -94169
11372i4169M3854J58502O7113k2012K8146o9686o0918k2780p8593P8673P6390
$$ -94169 -50315 108187 175300 153288 181434 111748 50830 28050 -50543 28130 104520
11361A04520n8355j07865N7801J12742p0028o8947J9761k4213M5256j171k7274
$$ 104520 46165 -61700 -3899 108843 38815 -30132 -10371 -34584 10672 9501 -17773
11350a7773l7728n3800Q7992L8049N0165j2023j04653r0258L2377L3142l4067
$$ -17773 -55501 -109301 -21309 16740 66905 54882 -49771 -140029 -107652 -74510 -108577
11339a08577j46943o0038J30682J32441n4335m6633m460m7617n5567P7932K0941
$$ -108577 -255520 -315558 -184876 -52435 -106770 -153403 -157863 -205480 -261047 -183115 -162174
11328a62174N3127P9687P8232l9867r5350J62J22930L0738m5993p2100j23770
$$ -162174 -109047 -29360 48872 9005 -86345 -86183 36747 67485 21492 -50608 -174378
11317a74378k288J15066M7072L0016j91320p4254L4646J05996R3250n0836k1292
$$ -174378 -176666 -61600 -14528 15488 -175832 -250086 -215440 -109444 -16194 -67030 -88322
11306h8322O799Q7467J15257l2763P8292M5396M601q3566k5524j29047j65948
$$ -88322 -81523 5944 121201 88438 166730 212126 216727 133161 107637 -21410 -187358
11295a87358M9935J61660l2466j8070l3342R8637K04815M9961j32798m774m0022
$$ -187358 -137423 24237 -8229 -26299 -59641 38996 243811 293772 160974 156200 116178
11284A16178n0628k3571j26488j32076k2706Q7254J39226n6659r870J08611o4086
$$ 116178 65550 41979 -84509 -216585 -239291 -152037 -12811 -69470 -79340 29271 -34815
11273c4815j2083l7877J754M3308M2083j1519l7573Q3863J17436K7024Q7349N3188
$$ -34815 -46898 -84775 -83021 -39713 2370 -9149 -46722 37141 154577 181601 268950 322138
11261C22138j4320q1004k04792r8842J35782M0912n4347o1022j24034J1422P6618
$$ 322138 307818 226814 22022 -76820 58962 99874 45527 -15495 -139529 -128107 -51489
11250e1489K5697J50295J13587k3281j21163M0797K0043j44551r7122o26j9257
$$ -51489 -25792 124503 238090 214809 93646 134443 154486 9935 -87187 -87813 -107070
11239a07070O3780K3577M9042l198J06374O4465k964r5312k1480l3656n1907l9724
$$ -107070 -43290 -19713 29329 26131 132505 196970 194006 98694 77214 43558 -8349 -48073
11227d8073L2632o1821L3267Q2692m2664r878M8152l7149m2998j60853m1900J12615
$$ -48073 -15441 -77262 -43995 38697 -3967 -13845 34307 -2842 -45840 -206693 -248593 -135978
11215a35978J93879O7567k2983n8848J4489L3996K063m9588K7879o9930m3172
$$ -135978 57901 125468 102485 43637 58126 92122 94185 44597 72476 2546 -40626
11204d0626k0934N9286Q9142n9297j08826K0811n06q6195k9547P9623K1487n6686
$$ -40626 -61560 -2274 86868 27571 -81255 -60444 -60950 -147145 -176692 -97069 -75582 -132268
11192a32268N9862K8377r1302M1397J1001p553R0039q169j1858m9958k6338k7167
$$ -132268 -72406 -44029 -135331 -93934 -82933 -90486 -447 -8616 -20474 -70432 -96770 -123937
11180a23937j04091K5748J15035K1742M941O4727K7060J18794M1024p8830m979
$$ -123937 -228028 -202280 -87245 -65503 -60562 4165 31225 150019 191043 112213 107234
11169A07234j15687Q007j1403o3090n5846j5246N5285R6554m2874q7395l1473
$$ 107234 -8453 -446 -11849 -74939 -130785 -146031 -90746 5808 -37066 -124461 -155934
11158a55934J42364J0384J2407j4641l2280K0248m3848K5372k9877n0204m9427
$$ -155934 -13570 -3186 9221 -5420 -37700 -17452 -61300 -35928 -65805 -116009 -165436
11147a65436M2164N7781P0138M5345k2751Q1844Q0818q0588j2730O3698m9190
$$ -165436 -123272 -65491 4647 49992 27241 109085 189903 109315 96585 160283 111093
11136A11093J6059l1760r9750P801M2274j06182l4229O4479m9406M7860P162K7311
$$ 111093 127152 95392 -4358 3443 45717 -60465 -94694 -30215 -79621 -31761 -24599 2712
11124B712L5570L3106j4237o6706J05758M6972M0621j40659j20163l3830M3989
$$ 2712 38282 71388 57151 -9555 96203 143175 183796 43137 -77026 -110856 -66867
11113f6867k7998J10787m6235l4980j9141Q569q313j908o4752J18435P9219j8125
$$ -66867 -94865 15922 -30313 -65293 -84434 -75865 -84178 -86086 -150838 -32403 46816 28691
11101B8691o7322j48090J528R5870N1731l4182J8519l6520r0711p6176K0539J18081
$$ 28691 -38631 -186721 -185193 -89323 -37592 -71774 -53255 -89775 -180486 -256662 -236123 -118042
11089a18042L9010M5667O4983l7347m974o5399Q0870Q0176O5826m8131p265N0996
$$ -118042 -79032 -33365 31618 -5729 -10703 -76102 4768 84944 150770 102639 95374 146370
11077A46370m3305q181j18744o1627M8108O8000L9852O3907M6636j70015r1512
$$ 146370 103065 94884 -23860 -85487 -37379 30621 70473 134380 181016 11001 -80511
11066h0511K3256P0768l2434J9107l7034P6099J08078L0547o0321o9225R677M1417
$$ -80511 -57255 13513 -18921 186 -36848 39251 147329 177876 117555 48330 58007 99424
11054I9424n0091j4354o6362j19735o171J23191R5495n0825j39099r941J11056
$$ 99424 49333 34979 -31383 -151118 -157289 -34098 61397 10572 -128527 -138468 -27412
11043b7412N6781N811p2407N1249R7676n2318M9102K3641n5613q8140j30951M1991
$$ -27412 29369 35180 -37227 14022 111698 59380 108482 132123 76510 -11630 -142581 -100590
11031a00590J06933M1195l3134k0741n8632J01554n0572L5464j0893m3743L5431
$$ -100590 6343 47538 14404 -6337 -64969 36585 -13987 21477 10584 -33159 2272
11020B272K3770K486m525Q1072j3708p3805q0052j05936q2443o1038Q0340J06553
$$ 2272 26042 28528 24003 105075 91367 17562 -62490 -168426 -250869 -311907 -231567 -125014
11008a25014R92j11645Q1871O9851j27862k3673J48481P2951j8054R6952L4900
$$ -125014 -124022 -235667 -153796 -83945 -211807 -235480 -86999 -14048 -32102 64850 99750
10997I9750K871n3443k2366n6481r286M9200p4675J1021J10268M2755j9031M1394
$$ 99750 102621 49178 26812 -29669 -38955 10245 -64430 -53409 56859 99614 80583 121977
10985A21977L330l685q6005l3972Q8500R7578m9315n1413R5453L113o6287n9341
$$ 121977 125307 121622 35617 1645 90145 187723 138408 86995 182448 185561 119274 59933
10973E9933M8033n9548l4612l1157J9943P5805N1529r2991o6527K7854n6027k8087
$$ 59933 107966 48418 13806 -17351 2592 78397 129926 36935 -29592 -1738 -57765 -85852
10961h5852P0744J06778k3628n9109O6827K5118n7423L121P0887j0438q470K1432
$$ -85852 -15108 91670 68042 8933 75760 100878 43455 46576 117463 107025 98555 119987
10949A19987Q3330q9216j51969K5945P1328n3538m6685p1130r2981J1338J80885
$$ 119987 203317 114101 -37868 -11923 59405 5867 -40818 -111948 -204929 -193591 -12706
10938a2706J30395N472J7616N1881l0319N1780j35243j48124m3092J17120m8713
$$ -12706 117689 123161 140777 192658 162339 214119 78876 -69248 -112340 4780 -43933
10927d3933j35190P1831J12215J48999R0721q2186o0945j58K060p9291m5537N3013
$$ -43933 -179123 -107292 4923 153922 244643 162457 101512 101354 103414 24123 -21414 31599
10915C1599R7022m5540p5057o3581M4478J1799L8951O8652P3550J6903p4734n7767
$$ 31599 128621 83081 8024 -55557 -11079 720 39671 108323 181873 198776 124042 66275
10903F6275N5832J9149p9657K6052k4148l3411p8159K0409P791K0354P1750N2602
$$ 66275 122107 141256 61599 87651 63503 30092 -48067 -27658 -19867 487 72237 124839
10891A24839m4671L4431N7081m014m3115P918o4265L9792q8453L4792K4356J623
$$ 124839 80168 114599 171680 167666 124551 132469 68204 107996 19543 54335 78691 80314
10879H0314r9436n4431L4331O6886L7939J24204j57058n7368n9914R2820K0844
$$ 80314 -19122 -73553 -39222 27664 65603 189807 32749 -24619 -84533 8287 29131
10868B9131j17727j4050o9073j7189j8453J51404J19685l707o118n3191j74877
$$ 29131 -88596 -102646 -171719 -188908 -207361 -55957 63728 60021 53903 712 -174165
10857a74165q6188M769R0448P0835J46067P7773j0148j88422n6550O5409k6635
$$ -174165 -260353 -255584 -165136 -94301 51766 129539 119391 -69031 -125581 -60172 -86807
10846h6807m5254O3206K3224l3970l0197M4372N6949o9307O5595J15796k4768
$$ -86807 -132061 -68855 -45631 -79601 -109798 -65426 -8477 -77784 -12189 103607 78839
10835G8839J314o6851j22451q2030O9260K5171n687L1628Q6433J44835K3736p0510
$$ 78839 80153 13302 -109149 -191179 -121919 -96748 -102435 -70807 15626 160461 184197 113687
10823A13687M0424n092J8569O643o8617L804j58787o0621J72920J4274l5454J25659
$$ 113687 154111 149019 167588 174231 105614 109418 -49369 -109990 62930 77204 41750 167409
10811A67409j5155o7044m9219J17823L8928l0654j53847p8133J30672m9171L0034
$$ 167409 152254 85210 35991 153814 192742 162088 8241 -69892 60780 11609 41643
10800D1643J1937k7233L5901L1599P7794k2789j95926N246R0881M7493j1104R195
$$ 41643 53580 26347 62248 93847 171641 148852 -47074 -41828 49053 96546 85442 94637
10788I4637k0817n4162O2150m8530J48015K9883K3478j27836k20012J3151R8621
$$ 94637 73820 19658 81808 33278 181293 211176 234654 106818 -113194 -100043 -1422
10777a422L9082K2697K1089N7501j4763K9835r731r75J3430J6993L7877L6784
$$ -1422 37660 60357 81446 138947 124184 154019 144288 143313 156743 173736 211613 248397
10765B48397j5949j00174R858j0118P0052l2163O2921J71617o555m8144m6147
$$ 248397 232448 132274 142132 132014 202066 169903 232824 404441 397886 349742 303595
10754C03595K8014j1895m0506j40522M6322P4707J7768K6852K6732l0361M9524
$$ 303595 331609 319714 279208 138686 185008 259715 277483 304335 331067 300706 350230
10743C50230J2303j05159j03948R9226o591j94808N1748J0724j1306q5206q7918
$$ 350230 362533 257374 153426 252652 246061 51253 103001 113725 102419 17213 -70705
10732g0705J5226N9946J10903L3004J9974M7684J0811m2898N923m5649m2158j2902
$$ -70705 -55479 4467 115370 148374 168348 216032 226843 183945 189868 144219 102061 89159
10720H9159L0476L8216o38j24037j21709P8190O4633L3116O825K3242j9740q1736
$$ 89159 119635 157851 157213 33176 -88533 -10343 54290 87406 94231 117473 97733 15997
10708A5997o4541J27239J35787K7566M657J1001l5301l0134j20414L514L7178
$$ 15997 -48544 78695 214482 242048 246705 257706 222405 192271 71857 75371 112549
10697A12549q049o7379j7721P3350K02636q0981j60151j7529J13928M4898o9134
$$ 112549 104500 37121 19400 92750 295386 214405 54254 36725 150653 195551 126417
10686A26417O1458M5997m2184L6021k7155J1354J12267J33942J18161J39850J37186
$$ 126417 187875 233872 191688 227709 200554 211908 324175 458117 576278 716128 853314
10675H53314p5424n6071J69716L00766J84705K56352J79488L0805q8704q2966
$$ 853314 777890 721819 891535 1192301 1377006 1633358 1812846 1843651 1754947 1671981
10665A671981j61482k69615k83359j61068j6340m9814n3591L9065m9728p5126
$$ 1671981 1510499 1240884 957525 796457 780117 730303 676712 715777 666049 590923
10655E90923M3050j09313q1905j15981N5993J33815j3131Q1478K2293J2346j15938
$$ 590923 633973 524660 442755 326774 382767 516582 503451 584929 607222 619568 503630
10644E03630q0607k8472O6673r4432k4346o655k9988j2440O4925O0928J52339
$$ 503630 423023 394551 461224 366792 342446 335791 305803 293363 358288 419216 571555
10633E71555o1696j62002k1253m5904q8336j28607J01207L2109k6494K0354k5315
$$ 571555 509859 347857 326604 280700 192364 63757 164964 197073 170579 190933 165618
10622A65618m5134J10550l052L7457l5161k3534J6693K1594n3398m0851K7367
$$ 165618 120484 231034 227982 265439 230278 206744 223437 245031 191633 150782 178149
10611A78149J991k1011P067q7098K387l9505j4195R7751P1p901O1148J03771m0122
$$ 178149 180140 159129 166196 79098 81485 41980 27785 125536 125607 117706 178854 282625 242503
10598B42503j0861K6836o4032p9426o1304l9645N360J01512N6444M8506J80434
$$ 242503 231642 258478 194446 115020 53716 14071 19431 120943 177387 225893 406327
10587D06327M6028p8892j4843q4607j94196n9652J90255N673j47144q1334R3530
$$ 406327 452355 373463 358620 274013 79817 20165 210420 216093 68949 -12385 81145
10576H1145O4452Q249K2889J8131m2532j16916L4091K133k5256q128J16823K5256
$$ 81145 145597 153846 176735 194866 152334 35418 69509 71642 46386 38258 155081 180337
10564A80337j221j00060j12550n8504J0238O9201Q4186n16K5391L0578p2722m4109
$$ 180337 179116 79056 -33494 -91998 -81760 -12559 71627 71111 96502 127080 54358 10249
10552A0249O8987P9980M5778n6894p045P6337p1456k1714P8223l8296Q5176n064
$$ 10249 79236 159216 204994 148100 141055 217392 145936 124222 202445 164149 249325 244261
10540B44261N8004n5207l3375P757r541J07550k3208j02328r7209L5768K5447
$$ 244261 302265 247058 213683 221440 211899 319449 296241 193913 96704 132472 157919
10529A57919Q2521o5353r913J21267Q0088K5319j166N0014p6031k6560R5520J3062
$$ 157919 240440 175087 165174 286441 366529 391848 390682 440696 364665 338105 433625 446687
10517D46687r780l5910N5678L8667K5180m7351m2540M5024k2776m0678K3883n6052
$$ 446687 436907 400997 456675 495342 520522 473171 430631 475655 452879 412201 436084 380032
10505C80032o6945Q455p9747n6392l6046K8070O9605K6141p968j35654O4431Q1322
$$ 380032 313087 321542 241795 185403 149357 177427 247032 273173 265205 129551 193982 275304
10493B75304Q816J28503N273q8487o9827K1412J6184k0241J9631j16637l8761
$$ 275304 284120 412623 417896 329409 259582 280994 297178 276937 296568 179931 141170
10482A41170j02026m7797J25167J53066O1067n3303j56108J2865L4966Q2521R6731
$$ 141170 39144 -8653 116514 269580 330647 277344 121236 134101 169067 251588 348319
10471C48319j19670J0324J9446R6937M8790P548k4687l198L5803j82940j14468
$$ 348319 228649 238973 258419 355356 404146 411694 387007 383809 419612 236672 122204
10460A22204P4676J37037J13004o9789K4906n3981j07242L9701j3119n9990L237
$$ 122204 196880 333917 446921 377132 402038 348057 240815 280516 267397 207407 210644
10449B10644N2610R9861J8297q9126o0282j3184K9360p621J16933M1643K4633
$$ 210644 263254 363115 381412 292286 232004 218820 248180 240559 357492 399135 423768
10438D23768R9921O0626r8712j08065K1983O4089o0252J08394R6512m0697j9691
$$ 423768 523689 584315 485603 377538 399521 463610 403358 511752 608264 567567 547876
10427E47876n8211r3766O7715q267j2176q494j3170J19317O8402j01214n6942
$$ 547876 489665 395899 463614 455347 443171 434677 421507 540824 609226 508012 451070
10416D51070j7323J7922P3762K02946J6348k4267K8066L6610J91733J59581K07359
$$ 451070 433747 451669 525431 728377 744725 720458 748524 785134 976867 1136448 1343807
10405A343807J57165J48796J84460K57375K88956L88848K92101K95161J94425
$$ 1343807 1500972 1649768 1834228 2091603 2380559 2769407 3061508 3356669 3551094
10396C551094O3677q7647j08077k34762m04991m30604j85498n5629q6363j99164
$$ 3551094 3614771 3527124 3419047 3184285 2779294 2348690 2163192 2107563 2021200 1822036
10386A822036k44259j81101k9445P6817J4875j19397k9057L4720j06042L760j8918
$$ 1822036 1577777 1396676 1367231 1444048 1458923 1339526 1310469 1345189 1239147 1242907 1223989
10375A223989O5987J5581o7002N5876M9802m0142J5654r2514j84518K8738K28757
$$ 1223989 1289976 1305557 1238555 1294431 1344233 1304091 1319745 1227231 1042713 1071451 1300208
10364A300208O8283L1878m3086P9824L4548J2519R3188K9794O5726Q1918J6306
$$ 1300208 1368491 1400369 1357283 1437107 1471655 1484174 1577362 1607156 1672882 1754800 1771106
10353A771106Q7956K06154J87082l5724Q0668K11780J76519O5062K22334K03864
$$ 1771106 1859062 2065216 2252298 2216574 2297242 2509022 2685541 2750603 2972937 3176801
10343C176801J48788J93965J08009n6430K4291j19443j63264j07018K2702J13657
$$ 3176801 3325589 3519554 3627563 3571133 3595424 3475981 3312717 3205699 3228401 3342058
10333C342058l1140j5371l2655Q216j23218N7128J28535L2073j1064Q3947J07658
$$ 3342058 3310918 3295547 3262892 3271108 3147890 3205018 3333553 3365626 3354562 3438509 3546167
10322C546167q1661J5954L4600q9864n9576j15088Q8677J71519Q3656j5173K9583
$$ 3546167 3464506 3480460 3515060 3425196 3365620 3250532 3339209 3510728 3594384 3579211 3608794
10311C608794l2971O6541J61243J44748J35514R9805m5562k0765K9162J61094
$$ 3608794 3575823 3642364 3803607 3948355 4083869 4183674 4138112 4117347 4146509 4307603
10301D307603K86250K23058o763J53729J88938L30051M07181L74618M60510N12571
$$ 4307603 4593853 4816911 4810148 4963877 5152815 5482866 5890047 6264665 6725175 7237746
10291G237746M29376M88984N97642O44859O82608Q32717J007004J128359J441994
$$ 7237746 7667122 8156106 8753748 9398607 10081215 10913932 11920936 13049295 14491289
10282A4491289J483088J503819J824417K207234K496361K883657L400135M121927
$$ 14491289 15974377 17478196 19302613 21509847 24006208 26889865 30290000 34411927
10274C4411927N071271N950590P022979Q613750J0365910J2418459J5153879J8799906
$$ 34411927 39483198 45433788 52456767 61070517 71436427 83854886 99008765 117808671
10266A17808671K3802841K9891747L7222891M3216692M0259512K5817133P635532
$$ 117808671 141611512 171503259 208726150 251942842 292202354 318019487 325655019
10259C25655019j1677250l0236195m0963740m1092833l4061799k5230273j8068879
$$ 325655019 313977769 283741574 242777834 201685001 167623202 142392929 124324050
10252A24324050j3179765r810891p379718n726969m733150m243988l841720l657270
$$ 124324050 111144285 101333394 93953676 88226707 83493557 79249569 75407849 71750579
10244G1750579l307100k924218k525749k208632j945995j721052j686908j583590
$$ 71750579 68443479 65519261 62993512 60784880 58838885 57117833 55430925 53847335
10236E3847335j400050j164009r79677p20683k74082j29951k74643k83489m81915
$$ 53847335 52447285 51283276 50303599 49582916 49308834 49178883 48904240 48620751 48138836
10227D8138836p97110j118436j336753j439515j680402j797054j933711k006514
$$ 48138836 47341726 46223290 44886537 43447022 41766620 39969566 38035855 36029341
10219C6029341j918178j918083j851368j627600j562067j587990j412134j336377
$$ 36029341 34111163 32193080 30341712 28714112 27152045 25564055 24151921 22815544
10211B2815544j330519j131441j098926j153012j090988r33010p95958q92186
$$ 22815544 21485025 20353584 19254658 18101646 17010658 16077648 15281690 14389504
10203A4389504q04399o96628n71286o60530o51838o27561n16908n05688m72669
$$ 14389504 13585105 12888477 12317191 11656661 11004823 10377262 9860354 9354666 8881997
10194H881997l54355l27101l75915j69596k62582l27002l85989l11488k76041
$$ 8881997 8527642 8200541 7824626 7655030 7392448 7065446 6679457 6367969 6091928
10185F091928j57682j83860k09218j99117k53337k89934l39760j44020r5272k97957
$$ 6091928 5934246 5750386 5541168 5342051 5088714 4798780 4459020 4315000 4219728 3921771
10175C921771k53781r1793j15762j26685j55406k54391p9112j52902k61267j26940
$$ 3921771 3667990 3576197 3460435 3333750 3178344 2923953 2844841 2691939 2430672 2303732
10165B303732m442r4379r5949o3259J75724j4071j38482k3756q4689k34259j98785
$$ 2303732 2299290 2204911 2108962 2045703 2221427 2207356 2068874 2045118 1960429 1726170 1527385
10154A527385j21441L8266j06610k0674R1440p2902p263o4673L6344K8964M7503
$$ 1527385 1405944 1444210 1337600 1316926 1408366 1335464 1328201 1263528 1299872 1328836 1376339
10143A376339j03884j00051K0410J41833M1055n9872j14505L7891J4951L7701
$$ 1376339 1272455 1172404 1192814 1334647 1375702 1315830 1201325 1239216 1254167 1291868
10133A291868O6911l0313j32739p1241j01351m1491j54305j02730j01563M737
$$ 1291868 1358779 1328466 1195727 1124486 1023135 981644 827339 724609 623046 627783
10123F27783K8806k2059j5305J0497O5168j88144j35803J51135R0476N9606P9926
$$ 627783 656589 634530 619225 629722 694890 506746 370943 522078 612554 672160 752086
10112G52086j0587k20034n2509O8492l8415p6456Q1941J20660J37647O0834l1830
$$ 752086 741499 521465 468956 537448 499033 422577 504518 625178 762825 823659 791829
10101G91829n1680J12722O6922M4788k4781J0421n8528N46J18240o1238n432J14287
$$ 791829 740149 852871 919793 964581 939800 950221 891693 892239 1010479 949241 943809 1058096
10089A058096P3078j0100k514K2410j9j07297P3296J87514j7241L1670O7060m4363
$$ 1058096 1131174 1121074 1118560 1140970 1140951 1033654 1106950 1294464 1277223 1308893 1375953 1331590
10077A331590j04645j01922j0715J7588n6444N2256K0559N2207r4813L3155M942
$$ 1331590 1226945 1125023 1114308 1131896 1075452 1127708 1148267 1200474 1105661 1138816 1143758
10066A143758n2098l2360M3849j67321j17111L3803O0165O2848Q3416l9177j41127
$$ 1143758 1091660 1059300 1103149 935828 818717 852520 912685 975533 1058949 1019772 878645
10055H78645p0439R3733k7113l3086j1294N3294N3776p9026l1103R3632J39j08434
$$ 878645 808206 901939 874826 841740 830446 883740 937516 858490 827387 921019 921158 812724
10043H12724q8064l1132O020j6975k8012m4084j9463J02672n8885j63458m3220
$$ 812724 724660 693528 699548 682573 654561 610477 591014 693686 634801 471343 428123
10032D28123j23670n4521J70102J01547L7404M4236l5658n0083p5079Q0031l2684
$$ 428123 304453 249932 420034 521581 558985 603221 567563 517480 442401 522432 489748
10021D89748p3576M0540J5687l5225j7833q3204L7308q0732L7611J06251n4079
$$ 489748 416172 456712 472399 437174 419341 336137 373445 292713 330324 436575 382496
10010C82496L9880k9755o467l4204j86797r3866R3369J21317k2524K451L5926
$$ 382496 422376 392621 386154 351950 165153 71287 164656 285973 263449 265900 301826
9999C01826n8767j23611n095M4127j931l1076j04319o132j3656R7724Q1953N033
$$ 301826 243059 119448 114353 158480 156549 125473 21154 15022 1366 99090 181043 186076
9987A86076o6344J05765r32L4186Q8735p3300J1955P3799j06178n0445n4806K9140
$$ 186076 119732 225497 224565 258751 347486 274186 286141 359940 253762 203317 148511 177651
9975A77651L9566p5711J1072k4704o4528K7368J9480M2157P315J632N4501j09512
$$ 177651 217217 141506 152578 127874 63346 90714 110194 152351 159666 161298 215799 106287
9963A06287n4822J64014J58765n7888j06021rK2833K0584M7581j7366P745k6638
$$ 106287 51465 215479 374244 316356 210335 210326 233159 253743 301324 283958 291703 265065
9951B65065M1829J2078j68122k3325R1853N6662N5210n5769j05345o798r6645
$$ 265065 306894 318972 150850 127525 219378 276040 331250 275481 170136 163338 66693
9940F6693m9645J14114K04425O3502m2240o1803L8597O2324k7547q5899k8271
$$ 66693 17048 131162 335587 399089 356849 295046 333643 395967 368420 282521 254250
9929B54250P8884O3757k6617o902P0080J75011m3162k12118p2999o8718m6608
$$ 254250 333134 396891 370274 363372 433452 608463 565301 353183 280184 211466 164858
9918A64858n9920O5730m3964l4491M4990j10327J1469M6045l3163M891J46542
$$ 164858 104938 170668 126704 92213 137203 26876 38345 84390 51227 56118 202660
9907B02660Q1460m0274K1337O8720P2524n2785k9505p5044m3531M3358L4647j5889
$$ 202660 284120 243846 265183 333903 406427 353642 324137 249093 205562 248920 283567 267678
9895B67678K6959L1428K5407Q6782M4591r0693m4286l3756j3533M7019p0711L0188
$$ 267678 294637 326065 351472 438254 482845 392152 347866 314110 300577 347596 276885 307073
9883C07073R4457J7694o6316j29556o5347q4387K1465R0148l669j20497p2661
$$ 307073 401530 419224 352908 223352 158005 73618 95083 185231 181562 61065 -11596
9872a1596O2157r5200o0043Q6182P5768J13366P4893P0782m5674N3346O8906j04541
$$ -11596 50561 -44639 -104682 -18500 57268 170634 245527 316309 270635 323981 392887 288346
9860B88346k7629J43679J85092Q9085n201J0908p5919M2258K17487K57013K40669
$$ 288346 260717 404396 589488 678573 673372 684280 608361 650619 868106 1125119 1365788
9849A365788J85962J69387Q4206K3414j13966j93148k57591j62619j84266j76792
$$ 1365788 1551750 1721137 1805343 1828757 1714791 1521643 1264052 1101433 917167 740375
9839G40375k3710r8161m7980j75450J0203J40301O2872k3595k5306p9892n9522
$$ 740375 716665 618504 570524 395074 405277 545578 608450 584855 559549 479657 420135
9828D20135M4791M5058n7012J7983M3531K4807k9071n8482k7943p2399K17777
$$ 420135 464926 509984 452972 470955 514486 539293 510222 451740 423797 351398 569175
9817E69175L9691n7250j66946j35188m5431M9438J19113r630J5017n2412M3228
$$ 569175 608866 551616 384670 249482 204051 253489 372602 362972 377989 325577 368805
9806C68805N6668o7136o9128J08367J96254q403o6927K7119R458m7115r5665K5581
$$ 368805 425473 358337 289209 397576 593830 585427 518500 545619 555077 507962 412297 437878
9794D37878P3193J7482R7984Q8889l958j21920j24089l6882o7155P755l3600K5064
$$ 437878 511071 528553 626537 715426 711468 589548 465459 428577 361422 369177 335577 360641
9782C60641n3486J0373l1958J7582M0024p6715P9199p2972j54409O45Q2653M2103
$$ 360641 307155 317528 285570 303152 343176 266461 345660 272688 118279 118924 201577 243680
9770B43680M6014K6879k9207j19711l078P58k6289l656M0172K791o5395m0698
$$ 243680 289694 316573 287366 167655 164577 165335 139046 135390 175562 178353 112958 72260
9758G2260p6740J14971N3763R2107q2185q4462n4100p0647k3678J0991N1805N4902
$$ 72260 -4480 110491 164254 256361 174176 89714 35614 -35033 -58711 -47720 4085 58987
9746E8987p5815l21k0202l2629j2929j3736O1727O7616l7480M4922o8948j40919
$$ 58987 -16828 -17149 -37351 -69980 -82909 -96645 -34918 32698 -4782 40140 -28808 -169727
9734a69727L0979Q4243r745o0269Q6838J43445p735r0343o9949j03615K6951L9507
$$ -169727 -138748 -54505 -64250 -124519 -37681 105764 98029 7686 -62263 -165878 -138927 -99420
9722i9420M9870M6517K1235r3153k0890M2528R1007j22538o5975Q4354l2784k1520
$$ -99420 -49550 -3033 18202 -74951 -95841 -53313 37694 -84844 -150819 -66465 -99249 -120769
9710a20769Q3024O4929J12194k485j12901o8590m2287N0342P3271J79516j12388
$$ -120769 -37745 27184 139378 136893 23992 -44598 -86885 -36543 36728 216244 103856
9699A03856j78067o3043l3344j6388K7786J09967J12354m9639M0805M9556M0509
$$ 103856 -74211 -137254 -170598 -186986 -159200 -49233 63121 13482 54287 103843 144352
9688A44352R4195R912j67507j09233m2716m1462O83k3630l3956J80205R6175m652
$$ 144352 238547 248459 80952 -28281 -70997 -112459 -111776 -135406 -169362 10843 107018 102366
9676A02366n2075j1232p5268p7662K8167K0328J23042J19615p3198m2630k8422
$$ 102366 50291 39059 -36209 -113871 -85704 -65376 57666 177281 104083 61453 33031
9665C3031N9676m9016p088j21999K8237N0912J07R9452K5690r678j7558k24191
$$ 33031 92707 43691 36603 -85396 -57159 -6247 -6140 93312 119002 109324 91766 -132425
9653a32425j67579L3942J64726J27021Q7966J01215k225l9639l1551j15924Q0856
$$ -132425 -300004 -266062 -101336 25685 113651 214866 212641 173002 141451 25527 106383
9642A06383R0384L0909K1283K1259j02894j03628K2548J4448M8533j61544k3455
$$ 106383 196767 227676 248959 270218 167324 63696 86244 100692 149225 -12319 -35774
9631c5774J21596o6596j11034K0916R1902J86426p5615j31257j550M7573n6018
$$ -35774 85822 19226 -91808 -70892 21010 207436 131821 564 -986 46587 -9431
9620i431J2141p885o3599k4265n762J12657J47575N1990m0911j9770J852k8871
$$ -9431 2710 -5175 -68774 -93039 -98801 13856 161431 213421 172510 152740 154592 125721
9608A25721j27362J28512P8913r6471j55860L8519Q8719n0517r5973j34655R4652
$$ 125721 -1641 126871 205784 109313 -46547 -8028 80691 30174 -65799 -200454 -105802
9597a05802Q5903O7058J09735n5661l9424l6317m919m0676K9525Q0198L1794j26604
$$ -105802 -19899 47159 156894 101233 61809 25492 20573 -20103 9422 89620 121414 -5190
9585e190l1063O4699O8977j9685n875r8157j32736K670P3029O5984J10856N71
$$ -5190 -36253 28446 97423 77738 71863 -26294 -159030 -156360 -83331 -17347 93509 94080
9573I4080J2949l6700n3941L7805j19479j13498J39783P1565R342N442o4932J9830
$$ 94080 107029 70329 16388 54193 -65286 -178784 -39001 32564 41906 47348 -17584 2246
9561B246M6900k1060k2899j09727L6712M7531q7198l0798j2960J7129L0884K5741
$$ 2246 49146 28086 5187 -104540 -67828 -20297 -107495 -138293 -151253 -134124 -103240 -77499
9549g7499N3102o4194o969R5206J8993k0240n9556m5828O5197P6387j26214k3238
$$ -77499 -24397 -88591 -95560 -354 18639 -1601 -61157 -106985 -41788 34599 -91615 -114853
9537a14853L5433J6640J1132P2417r6221l7421q477J49994l8555q0585K7899L2099
$$ -114853 -79420 -62780 -51648 20769 -75452 -112873 -121350 28644 -9911 -90496 -62597 -30498
9525c0498N5329j3651n8931M6488Q7060K1240n3750k5493l5517M3343n4195K4269
$$ -30498 24831 11180 -47751 -1263 85797 107037 53287 27794 -7723 35620 -18575 5694
9513E694n7010q8185o113K3382J2326l072R7755J13484J05501l3657j21565j17111
$$ 5694 -51316 -139501 -145614 -122232 -109906 -112978 -15223 98261 203762 170105 48540 -68571
9501f8571p1481J05435N4639K7065M9247k2359j92737n6525O2462J19021K1152
$$ -68571 -140052 -34617 20022 47087 96334 73975 -118762 -175287 -112825 6196 27348
9490B7348P2168J1019M2795l0038n56Q9566p3461o9975K5509M726o9252j68303
$$ 27348 99516 110535 153330 123292 122736 212302 138841 68866 94375 99101 29849 -138454
9478a38454J6640Q9320J9238J60798J61586n9650q3635p9638l179j8291j9368
$$ -138454 -121814 -32494 -13256 147542 309128 249478 165843 86205 83026 64735 45367
9467D5367j2186j4640J50306J24714k1607j70801j46572J28267N6290k9267j36695
$$ 45367 33181 18541 168847 293561 271954 101153 -45419 82848 139138 109871 -26824
9456b6824o1828N9602m5398J12491m6312J6210J60275M4744r5082n5714r4476
$$ -26824 -88652 -29050 -74448 38043 -8269 7941 168216 212960 117878 62164 -32312
9445c2312J8613j6138k680n4033q9624n5151J5804O7068J04710K2817p1253M3372
$$ -32312 -13699 -29837 -32517 -86550 -176174 -231325 -215521 -148453 -43743 -20926 -92179 -48807
9433d8807k8548J13445L1097K5706n1404j31641L791K5289m4237R8962J4171q615
$$ -48807 -77355 36090 67187 92893 41489 -90152 -86361 -61072 -105309 -6347 7824 -791
9421g91k4208J25586l1558n2473M2753l0934L0526n5265k3197J9808Q6565J00391
$$ -791 -24999 100587 69029 16556 59309 28375 58901 3636 -19561 247 86812 187203
9409A87203m1188n020M1773R2321q7267j33682j44445n5951O0601K9319M1770
$$ 187203 146015 140995 182768 275089 187822 54140 -90305 -146256 -85655 -56336 -14566
9398a4566J05728J7076L4512O6493N3808r9527K2617m3453K2859Q1037l8092m1324
$$ -14566 91162 108238 142750 209243 263051 163524 186141 142688 165547 246584 208492 167168
9386A67168p7614q5394n9909K4629N2200M3543p1965P283N4132Q9065r5418j10473
$$ 167168 89554 4160 -55749 -31120 21080 64623 -7342 -59 54073 143138 47720 -62753
9374f2753M3379L6223J5693k7519m3951m819k993Q204j7395L1603O7043Q728m3948
$$ -62753 -19374 16849 32542 5023 -38928 -43747 -46740 -38536 -55931 -24328 42715 51443 7495
9361G495j05209o5642J15487O9044J04658O0988j04539j30173l4115J0379J15524
$$ 7495 -97714 -163356 -47869 21175 125833 186821 82282 -47891 -82006 -71627 43897
9350D3897J30295L5564r7128m4635L7350j09662n047J0961Q676K7907k6291P0591
$$ 43897 174192 209756 112628 67993 105343 -4319 -9366 1595 10271 38178 11887 82478
9338H2478J8122L6501m0333k487q171j3299M7058o0449l5445j9703L3325l7130
$$ 82478 100600 137101 96768 94281 86110 72811 119869 59420 23975 4272 37597 467
9326D67j24788J02470J44214n3119j20038L0321J42189k0299p0637l944N5237
$$ 467 -124321 -21851 122363 69244 -50794 -20473 121716 101417 30780 26836 82073
9315H2073N8251M4660j3111l2754m1965N7363o6181j36620O486K0005L8033m8810
$$ 82073 140324 184984 171873 139119 97154 154517 88336 -48284 -41798 -21793 16240 -32570
9303c2570n595l5794j6645l8006P8388M8302m7285j25201L5042k0479J39180J00207
$$ -32570 -38165 -73959 -90604 -128610 -50222 -1920 -49205 -174406 -139364 -159843 -20663 79544
9291G9544l5172L863K5349n5037K3561k618K4637M4116J12954j6901r108n2317
$$ 79544 44372 48235 73584 18547 42108 39490 64127 108243 221197 204296 195188 142871
9279A42871q7220R7255j2100l5413o08r4740q6118R1107M4087l2208O1685J817
$$ 142871 55651 152906 140806 105393 104785 10045 -76073 15034 59121 26913 88598 90415
9267I0415o4223o3663J08843J04309n6335j08915r568K7988O4112k5292m8225
$$ 90415 26192 -37471 71372 175681 119346 10431 863 28851 92963 67671 19446
9256A9446j14989O7174O8591M1964j13757p2942j0208p8991Q2676J05362M4125
$$ 19446 -95543 -28369 40222 82186 -31571 -104513 -114721 -193712 -111036 -5674 38451
9245C8451L8054O8955M427O5325o5828j62436M2313O1069n9443j0510L1328p1344
$$ 38451 76505 145460 149887 215212 149384 -13052 29261 90330 30887 20377 51705 -19639
9233a9639J9476m9663m2063J35858N1802N2036m1085m4766j2437O4406n1385o4890
$$ -19639 -163 -49826 -91889 43969 95771 147807 106722 61956 49519 113925 62540 -2350
9221b350L3392J16176J08066p6516m5194o7745l029n9796M4307L1438j58389p5462
$$ -2350 31042 147218 255284 178768 133574 65829 62800 3004 47311 78749 -79640 -155102
9209a55102P5419J03476o313l6195K4541p0599j61049J090P4620J28433J52495
$$ -155102 -79683 23793 17480 -18715 5826 -64773 -225822 -224732 -150112 -21679 130816
9198A30816J22013M9398m826j63007r2796j04444k001J32698J08445m2775K5677
$$ 130816 252829 302227 297401 134394 41598 -62846 -64847 67851 176296 133521 159198
9187A59198K4372o1012r9255o1837j6434N8003M1470j7157J01171m0839r4518
$$ 159198 183570 122558 23303 -38534 -54968 3035 44505 27348 128519 87680 -6838
9176f838n2377J09999Q3718M6479L1477O7280n7762L67O756J56986P5151k4254
$$ -6838 -59215 50784 134502 180981 212458 279738 221976 222343 229099 386085 461236 436982
9164D36982n773j06634j2310j3035m4143p9058J68798J87952j5553k12148r5918
$$ 436982 431209 324575 312265 299230 255087 176029 344827 532779 517226 305078 209160
9153B09160j11618K44581J19676n2508m4263R4458L3111o3343p9371J7821p5303
$$ 209160 97542 342123 461799 409291 365028 459486 492597 429254 349883 367704 292401
9142B92401l0080J14455J45335R5611l6309j9543P8361L4920o70j04986q5906
$$ 292401 262321 376776 522111 617722 581413 561870 640231 675151 674481 569495 483589
9131D83589M1847Q3416J02614J80707j1724j6953P8486l5154J7397R6286J85342
$$ 483589 525436 608852 711466 892173 880449 863496 941982 906828 924225 1020511 1205853
9120A205853J03651J56904J26213J11454K03458K66422L61586M74018L63411N35450
$$ 1205853 1309504 1466408 1592621 1704075 1907533 2173955 2535541 3009559 3372970 3908420
9110C908420P16906R64216J157677J327044J667473K128614K504216L157284M032304
$$ 3908420 4625326 5589542 6747219 8074263 9741736 11870350 14374566 17531850 21564154
9101B1564154N091596N979722N734389K991375j527949m873091o044735n374840
$$ 21564154 26655750 32635472 38369861 41361236 39833287 34960196 28915461 23540621
9093B3540621m042485k946361k218262j597287j236879j048210r03196n83146
$$ 23540621 19498136 16551775 14333513 12736226 11499347 10451137 9547941 8964795
9085H964795n68903n06330l57944k64265k90211k96109j03552j22096k83113k42254
$$ 8964795 8395892 7889562 7531618 7267353 6977142 6681033 6577481 6455385 6172272 5930018
9075E930018k01188j42677O474j1571r3790p3685N2863o0131L450l8080J3382
$$ 5930018 5728830 5586153 5592627 5581056 5487266 5413581 5466444 5406313 5409763 5371683 5385065
9064E385065j2227r1234k74598l01548j72512j57998l73666k51287k42386j72478
$$ 5385065 5372838 5281604 5007006 4705458 4532946 4374948 4001282 3749995 3507609 3335131
9054C335131j58787j56576j29980k07029j44836j25243k38280m9222j03912n9670
$$ 3335131 3176344 3019768 2889788 2682759 2537923 2412680 2174400 2125178 2021266 1961596
9044A961596o6733p7350j17744k04116j90125l7529P0545l0701m5980o9521m6193
$$ 1961596 1894863 1817513 1699769 1495653 1305528 1267999 1338544 1307843 1261863 1192342 1146149
9033A146149j29676j18034O3529K1154p0125j09385j09360R5038k5147p7656N7024
$$ 1146149 1016473 898439 961968 983122 912997 803612 694252 789290 764143 686487 743511
9022G43511j31983j80421m0127j5610J21664k7197q4734j05856l9127J11526M639
$$ 743511 611528 431107 390980 375370 497034 469837 385103 279247 240120 351646 356285
9011C56285R4844J7673k3967j3245j1314p3741o6358j13381o8710L9769O9486
$$ 356285 451129 468802 444835 431590 420276 346535 280177 166796 98086 137855 207341
9000B07341O67l5244j28626n3884K9597L8208L2537p0884O1319j1853P5320Q594
$$ 207341 208008 172764 44138 -9746 19851 58059 90596 19712 81031 69178 144498 153092
8988A53092m9682J6669K5103r9918p6767R944M6560J31823J261o7810n8005P7594
$$ 153092 103410 120079 145182 45264 -31503 -21559 25001 156824 158085 90275 32270 109864
8976A09864j26373q6432J900j0553m8201l3668L02075P7433m3987O2068l7246
$$ 109864 -16509 -102941 -101041 -111594 -159795 -193463 108612 186045 142058 204126 166880
8965A66880o481R0936j2154j32806r7511j5637n4687L8495J7361J5516K8577M6899
$$ 166880 160399 251335 239181 106375 8864 -6773 -61460 -22965 -5604 9912 38489 85388
8953H5388K3926P7785j2352o2640q2550m0030J04530R7954M8851j16659l6892
$$ 85388 109314 187099 174747 112107 29557 -10473 94057 192011 240862 124203 87311
8942H7311R5071k7859j27619l788L4108L6658O7064M3958m2798n2238J0159j9283
$$ 87311 182382 154523 26904 23116 57224 93882 160946 204904 162106 109868 120027 100744
8930A00744R0400k4806R067R1913p9067p5498N6291o833k2359p227K9181J13402
$$ 100744 191144 166338 175405 267318 188251 112753 169044 162211 139852 132625 161806 275208
8918B75208n826K1589J0507l1714R633L3335l8231P9801N6205q520o8281j9011
$$ 275208 269382 290971 301478 269764 279397 312732 274501 354302 410507 401987 333706 314695
8906C14695J01509K7138o7826l1648j26649j33783p3380O1337J8679K6099O3266
$$ 314695 416204 443342 375516 343868 217219 83436 10056 71393 90072 116171 179437
8895A79437M0094q0866J2559k0562o0217q134L2043L619m8136O2983k6297j27510
$$ 179437 219531 138665 151224 130662 70445 62311 94354 97973 49837 112820 86523 -40987
8883d0987K0874J26468K4028r8545q1826P0616J9553L7469k4789n9941J79681
$$ -40987 -20113 106355 130383 31838 -49988 20628 40181 77650 52861 -7080 172601
8872A72601J10023j17100l0086P5176m8633m4762O2497j53321q9497N9321k4519
$$ 172601 282624 165524 135438 210614 161981 117219 179716 26395 -63102 -3781 -28300
8861b8300J01224K8375J5747R3683M880p0341j2804l2669o1472N1052J25885M467
$$ -28300 72924 101299 117046 210729 215609 145268 132464 99795 38323 89375 215260 219727
8849B19727n7494k4891m5419K546M1248R1124L2428k1201j84387j18831p092J18402
$$ 219727 162233 137342 91923 94469 135717 226841 259269 238068 53681 -65150 -72242 46160
8837D6160L806K3166k698o5787m8929r588J184p9481M3505N594j6604K2374o4308
$$ 46160 49966 73132 70434 4647 -44282 -53870 -52686 -132167 -88662 -83068 -99672 -77298 -141606
8824a41606P8179M6721R4931P5241j78332n9930o8931J83231J55980J609n1452
$$ -141606 -63427 -16706 78225 153466 -24866 -84796 -153727 29504 185484 187093 135641
8813A35641o2589r991N0293m2401j19439O4072M2128K422O9000k3960j05928p7693
$$ 135641 73052 63061 113354 70953 -48486 15586 57714 60136 129136 105176 -752 -78445
8801g8445M4463L3174J10157R1290p434J635J9662r1013q6529P062J01018o9085
$$ -78445 -33982 -808 109349 200639 193205 194840 214502 123489 36960 44022 145040 75955
8789G5955j30220j03444M0742j24155M505R5131m1724m4978Q3791P9929K2585
$$ 75955 -54265 -157709 -116967 -241122 -236617 -141486 -183210 -228188 -144397 -64468 -41883
8778d1883q0786N0309j869l8260O8934J28131J07228l7223P4956m469j31385r2949
$$ -41883 -122669 -72360 -74229 -112489 -43555 84576 191804 154581 229537 225068 93683 734
8766G34k9907J3661J34803J9530m2479J8517n4372q1062n775J31736N2331q3294
$$ 734 -29173 -15512 119291 138821 96342 114859 60487 -20575 -26350 105386 157717 74423
8754G4423k3512q2905j30170j1782l7860K6296L1942m3713l0388N2698m2834o4267
$$ 74423 50911 -31994 -162164 -173946 -211806 -185510 -153568 -197281 -227669 -174971 -217805 -282072
8742b82072N965Q8080R1687j11041N4537Q5656N6109N1901J0189Q3015P2185L6817
$$ -282072 -276107 -188027 -96340 -207381 -152844 -67188 -11079 40822 51011 134026 206211 243028
8730B43028j53108K2400Q1157N7023q4164m5717P6352P2706n1812j24416q2155
$$ 243028 89920 112320 193477 250500 166336 120619 196971 269677 217865 93449 11294
8719A1294p1355Q4905J8198n8322m0477L4481J69805J40058N5478o0906r5047
$$ 11294 -60061 24844 43042 -15280 -55757 -21276 148529 288587 344065 283159 188112
8708A88112p7900m0211k1667o3279p098R7574L4060L0927p125p0620l3940j08370
$$ 188112 110212 70001 48334 -14945 -22043 75531 109591 140518 133393 62773 28833 -79537
8696g9537O4748J27725J05061J22199j3952q5554o31n9506k9988m0602m3835N5430
$$ -79537 -14789 112936 217997 340196 326244 240690 240059 180553 150565 109963 66128 121558
8684A21558L2930J07361j4319j03514m2889p940m5868o3512P7706l2257J3177
$$ 121558 154488 261849 247530 144016 101127 93187 47319 -16193 61513 29256 42433
8673D2433K327J42485M7976j27751q1901Q1813O3873j2647L125m0600j8428J08927
$$ 42433 44760 187245 235221 107470 25569 107382 171255 158608 161733 121133 102705 211632
8661B11632O4794j0315J5846j2353j31216k5588O605N5310j7311L9563j7186K1735
$$ 211632 276426 266111 281957 269604 138388 112800 119405 174715 157404 196967 179781 201516
8649B01516j22125m0175N5106j0029M3242M5020k5348p7862j04851p1055L9788
$$ 201516 79391 39216 94322 84293 127535 172555 147207 69345 -35506 -106561 -66773
8638f6773J8124J4500N0804l1459l5954N9868O5194O45l3070k9320J9293L6328
$$ -66773 -48649 -34149 16655 -14804 -50758 9110 74304 74949 41879 12559 31852 68180
8626F8180j7564M6031p7682n7676N8387r5777r1646J25849J03317j05260k4828
$$ 68180 50616 96647 18965 -38711 19676 -76101 -167747 -41898 61419 -43841 -68669
8615f8669J27141P0005r3175J7724O8210K1545M8312j2068J3752R1249p8279j29267
$$ -68669 58472 128477 35302 53026 121236 142781 191093 179025 192777 284026 205747 76480
8603G6480m9805K4144J3256M5423J1982j0113m8696K9556R4571O8811o0637j80100
$$ 76480 26675 50819 64075 109498 121480 111367 62671 92227 186798 255609 194972 14872
8591A4872l1450J3370M1066L2844N3484l142J36858k0734m3572l0054J06559p790
$$ 14872 -16578 -3208 37858 70702 124186 121044 257902 237168 193596 163542 270101 262311
8579B62311j14871j42670j36524J4469P5741J35071M1777R806j254k8744j32847
$$ 262311 147440 4770 -131754 -117285 -41544 93527 135304 145110 143856 115112 -17735
8568a7735n1837j8686r069m2089R8309N8568Q3196k5066O372r027J9742O5699
$$ -17735 -69572 -88258 -97327 -139416 -41107 17461 100657 75591 81963 72936 92678 158377
8556A58377k0764n4543R6010n7915j25964K193K9254m9056J7917l4633L2599r234
$$ 158377 137613 83070 179080 121165 -4799 -2606 26648 -22408 -4491 -39124 -6525 -15759
8544a5759l1996M4844m8497K2232N8521j3424p5406P6243R4675L718J2254n3506
$$ -15759 -47755 -2911 -51408 -29176 29345 15921 -59485 16758 111433 115151 127405 73899
8532G3899m4670p9513r1851P6123J36668O1651j61211j08439l8608M3356Q2220
$$ 73899 29229 -50284 -142135 -66012 70656 132307 -28904 -137343 -175951 -132595 -50375
8521e0375p1257j8358j0128Q1353J23201l7725l9044k8146P273J8189q502K9296
$$ -50375 -121632 -139990 -150118 -68765 54436 16711 -22333 -50479 -43206 -25017 -33519 -4223
8509d223K1717o7903l128K6747J3005R865j8760J8673k460k2744M2621N1988N3482
$$ -4223 17494 -50409 -53537 -26790 -13785 -3920 -22680 -4007 -6467 -29211 13410 65398 118880
8496A18880n2499o9931j7459r746j0114m7712m0651q5851n4814J25233L7569K3421
$$ 118880 66381 -3550 -21009 -30755 -40869 -88581 -129232 -215083 -269897 -144664 -107095 -83674
8484h3674l7564K8695J41568N267j20925q8644J5786J32698J5604o5608j08684
$$ -83674 -121238 -92543 49025 54292 -66633 -155277 -139491 -6793 8811 -56797 -165481
8473a65481P6294J55328k9831j17185o4222Q5414J17569L2765L3733q2390K3723
$$ -165481 -89187 66141 36310 -80875 -145097 -59683 57886 90651 124384 41994 65717
8462F5717L3036n2971L9668K1688M5067k5069j17051n9947m9250j3863k4459Q606
$$ 65717 98753 45782 85450 107138 152205 127136 10085 -49862 -99112 -112975 -137434 -128828
8450a28828J65764N0636m5650N1180J6294p5491J2615q5443j08404k4154L8871
$$ -128828 36936 87572 41922 93102 109396 33905 46520 -38923 -147327 -171481 -132610
8439a32610J31861J9010N3443l1646l5377m9199k5431K8979N3979O2618J1405
$$ -132610 -749 18261 71704 40058 4681 -44518 -69949 -40970 13009 75627 87032
8428H7032k4378n1980o369j2603j21327N7471O8867M4964N4944J2680K7458m7827
$$ 87032 62654 10674 4305 -8298 -129625 -72154 -3287 41677 96621 109301 136759 88932
8416H8932j24657O1518J97778L7370k49476j15389N7099J34943J6894j23766K2996
$$ 88932 -35725 25793 223571 260941 11465 -103924 -46825 88118 105012 -18754 4242
8405D242J40495O1137n0741o4570m4143m0297o4191J935j2980p1921n9086j7751
$$ 4242 144737 205874 155133 90563 46420 6123 -58068 -56133 -69113 -141034 -200120 -217871
8393b17871N9905R1123J51288O2230q6203j0750k6290K1774P6749L212o8106k7624
$$ -217871 -157966 -66843 84445 146675 60472 49722 23432 45206 121955 125167 57061 29437
8381B9437r8064j6973J02003J52841r2137l9994N7890n5162j8607j2164o0536
$$ 29437 -68627 -85600 16403 169244 77107 37113 95003 39841 21234 9070 -51466
8370e1466J4036J25833r3851r9999M6422J2038m2545Q4857r9438l1078l1736K9973
$$ -51466 -37430 88403 -5448 -105447 -59025 -46987 -89532 -4675 -104113 -135191 -166927 -136954
8358a36954j5392q6986N6899R9476p922k0988p3021q1469N2451Q777J31378J33101
$$ -136954 -152346 -239332 -182433 -82957 -90879 -111867 -184888 -266357 -213906 -205129 -73751 59350
8346E9350J18181m4264L519j7887l4625q1837l0336J35445k6134m3989j5352J23599
$$ 59350 177531 133267 136786 118899 84274 2437 -27899 107546 81412 37423 22071 145670
8334A45670L2748j29103L0683Q622k8879j64499n2506M835N0145N6913J5975n093
$$ 145670 178418 49315 79998 88620 59741 -104758 -157264 -152429 -102284 -45371 -29396 -34489
8322c4489o4191p3547l5641O2960K4385J42362Q163N2061J3810J9572N536j5178
$$ -34489 -98680 -172227 -207868 -144908 -120523 21839 30002 82063 95873 115445 120981 105803
8310A05803q2497p0143m7866L3021J1708n832Q5671k8593n8991l3234k635N9910
$$ 105803 23306 -46837 -94703 -61682 -49974 -55806 29865 1272 -57719 -90953 -93588 -33678
8298c3678R9802O7089L0349L3619o9579l7220o5062m9730M1500M219m0928J912
$$ -33678 66124 133213 163562 197181 127602 90382 25320 -24410 17090 21309 -19619 -17707
8286a7707q809K0565o2147q3060J23564R6070n9191m7205l576N1097J41737M7485
$$ -17707 -26516 -5951 -68098 -151158 -27594 68476 9285 -37920 -41496 9601 151338 198823
8274A98823l0038P0430R039j07375J6847Q8178L9355p4125o2723j26058k0413
$$ 198823 168785 239215 248254 140879 157726 245904 285259 211134 148411 22353 1940
8263A940k0372J6696l5913N681N7002N221m4574Q6052P950O8802q4605j36458
$$ 1940 -18432 -1736 -37649 -31968 25034 30255 -14319 71733 79683 148485 63880 -72578
8251g2578M0372m4768M2488O2505o1023l8964M7287O9162m2825L2946K6315L7689
$$ -72578 -32206 -76974 -34486 28019 -33004 -71968 -24681 44481 1656 34602 60917 98606
8239I8606M3265p1109q0491n7529k794n229m9473j4556K2809P7268K325o9454
$$ 98606 141871 70762 -9729 -67258 -70052 -75281 -124754 -139310 -116501 -39233 -36908 -106362
8227a06362L9750R6252j7919J1021j0776l4874J9801N9771J6850j7243k0465J2493
$$ -106362 -66612 29640 11721 22742 11966 -22908 -3107 56664 73514 56271 35806 48299
8215D8299j12640k6287K6106R5823J6560j14340p4949R8547J2771m122N2167O2608
$$ 48299 -64341 -90628 -64522 31301 47861 -66479 -141428 -42881 -30110 -34232 17935 80543
8203H0543P0754k8721p9135p6442n0424j75923L3036O916J02044M9078k1469P4505
$$ 80543 151297 122576 43441 -33001 -83425 -259348 -226312 -219396 -117352 -68274 -89743 -15238
8191a5238P6862p4996L0849P4248j31800m9646m523R555l8527J800J51779P8589
$$ -15238 61624 -13372 17477 91725 -40075 -89721 -94244 -84689 -123216 -121416 30363 108952
8179A08952J00320j169n1200k2040j19836j28048L9704j0941Q5050L050J30074
$$ 108952 209272 208103 156903 134863 15027 -113021 -73317 -84258 792 3842 133916
8168A33916J2812q4972k067L4177p87J5409l6778o997M1389p4619m0602P5095
$$ 133916 146728 61756 59689 93866 93079 108488 71710 64713 106102 31483 -9119 65976
8156F5976M6867k1893q4682o5309o8092k428q90J18420J41410J6799m6304K6137
$$ 65976 112843 90950 6268 -59041 -127133 -129561 -130451 -12031 129379 146178 99874 126011
8144A26011R1550l6000j63031q0554M8273l6969R29K8467m9032j950R4598J04992
$$ 126011 217561 181561 18530 -62024 -13751 -50720 -49791 -21324 -70356 -72306 22292 127284
8132A27284o7390K7035j255K2354K3377q085n8391L4713K4565l369k7803j97792
$$ 127284 59894 86929 85674 108028 131405 123320 64929 99642 124207 120838 93035 -104757
8120a04757j13312K3092J0301M7953P4395q2535k882J7818r4117O051n2786q2166
$$ -104757 -218069 -194977 -184676 -136723 -62328 -144863 -147745 -129927 -224044 -217993 -270779 -352945
8108c52945K4830J20416J96591m2018r3028k4590K1772J5195N5485N8120O5212
$$ -352945 -328115 -207699 -11108 -53126 -146154 -170744 -148972 -133777 -78292 -20172 45040
8097D5040J11803J5802K9609J2471j50571r8739Q2153k9974k6867Q2165M5141
$$ 45040 156843 172645 202254 214725 64154 -34585 47568 17594 -9273 72892 118033
8086A18033j06797r5783j06978K4847L6346L9947J8134m9344J25430J66504J4020
$$ 118033 11236 -84547 -191525 -166678 -130332 -90385 -72251 -121595 3835 170339 184359
8075A84359m9800p0490L4523K0538O2506r2582J5200R6801J32286r7143l7868
$$ 184359 134559 64069 98592 119130 181636 89054 104254 201055 333341 236198 198330
8064A98330j05944q1787q9396O8145q668p281k7586O898j3739K2486P4961Q274
$$ 198330 92386 10599 -78797 -10652 -19320 -26601 -54187 -47289 -61028 -38542 36419 44693
8052D4693j02567j07032L5658R4188O4178m368p5934o5194p9517P3924Q2784k6341
$$ 44693 -57874 -164906 -129248 -35060 29118 24750 -51184 -116378 -195895 -121971 -39187 -65528
8040f5528K7725J11806j17408L2418J13073r9998m1650J45060P9965O306P2019
$$ -65528 -37803 74003 -43405 -10987 102086 2088 -39562 105498 185463 191769 263788
8029B63788N4739o7940o6475j52263j32403J36461L3988l718l1931k2957L8754
$$ 263788 318527 250587 184112 31849 -100554 35907 69895 66177 34246 11289 50043
8018E0043k8161n8644M5393L3160q869J953J9961j04140r0787R782M6514k6320
$$ 50043 21882 -36762 8631 41791 32922 34875 54836 -49304 -140091 -130309 -83795 -110115
8006a10115j01521n1449J15336N1448L7290o9356l7080P5433J06515L7148l4646
$$ -110115 -211636 -263085 -147749 -96301 -59011 -128367 -165447 -90014 16501 53649 19003
7995A9003N2288J02509k2080K4068j6134k9320j8783j01090m2642O5083J20058
$$ 19003 71291 173800 151720 175788 159654 130334 111551 10461 -32181 32902 152960
7984A52960k5838l6566J2470j8061L9005n6822q5395m6090N0949K9640J7330P7733
$$ 152960 127122 90556 103026 84965 123970 67148 -18247 -64337 -13388 16252 33582 111315
7972A11315k8778q6899M8469J66912K2291j33222j34607K467J00659L6126m2622
$$ 111315 82537 -4362 44107 211019 233310 100088 -34519 -32052 68607 104733 62111
7961F2111N509L7668k8837L2655L4190J8375j10479l7413O0941j4799O687L6315
$$ 62111 67620 105288 76451 109106 143296 161671 51192 13779 74720 59921 66608 102923
7949A02923r926N802Q0287N8856o6626j01023j63460N753R1281r1789p3711K4951
$$ 102923 92997 98799 179086 237942 171316 70293 -93167 -87414 3867 -87922 -161633 -136682
7937a36682L6005R0259K5287k4725O1568q352k4224J0908l0016l6849o909P0093
$$ -136682 -100677 -10418 14869 -9856 51712 43360 19136 30044 28 -36821 -43730 26363
7925B6363K8262o3159R3154l753k5579Q7963O6995M2155l6564o4932q2705p5633
$$ 26363 54625 -8534 84620 80867 55288 143251 210246 252401 215837 150905 68200 -7433
7913g433O9582Q7049l9607j22402m4302l6920R5601L6474N2640J0729l7193o5892
$$ -7433 62149 149198 109591 -12811 -57113 -94033 1568 38042 90682 101411 64218 -1674
7901a674N5720J7269L8839Q523o0889m1521k5025k8638k9571J28338J3745j07265
$$ -1674 54046 71315 110154 118677 57788 16267 -8758 -37396 -66967 61371 75116 -32149
7889c2149j81300P6912J9128r6059N2457O3875k4356J02753n6315l5798J44105
$$ -32149 -213449 -136537 -117409 -213468 -161011 -97136 -121492 -18739 -75054 -110852 33253
7878C3253J65518j0555j31600j93903P5252J21541n0323j25116j3012P57j3424
$$ 33253 198771 188216 56616 -137287 -62035 59506 9183 -115933 -128945 -128188 -141612
7867a41612J2235J80546O7131l4631R5405n1068l9834k9002l18l0811p7203q1566
$$ -141612 -129377 51169 118300 83669 179074 128006 88172 59170 58852 28041 -49162 -130728
7855a30728J03472J49871L6203o0690j24684R697M7103m7802K4511J03016m5900
$$ -130728 -27256 122615 158818 98128 -26556 -16859 30244 -17558 6953 109969 64069
7844F4069K9946m0410o1829r9679q1j1134J04864J21114N6397m9634j38675q0939
$$ 64069 94015 53605 -8224 -107903 -107984 -119118 -14254 106860 163257 113623 -25052 -105991
7832a05991J77705K4604m5067p3115R662p201R8553q3406r0981K0840J12850L494
$$ -105991 71714 96318 51251 -21864 -12202 -19403 79150 -4256 -95237 -74397 38453 41947
7820D1947q5331J09996J54723M9574n6682q9819p1352j13024j8966r9583M591
$$ 41947 -43384 66612 221335 270909 214227 124408 53056 -59968 -78934 -178517 -173926
7809a73926N0233P8428j14588o036N620o8647O3229M9504Q5773O3053Q2618K8449
$$ -173926 -123693 -45265 -159853 -165889 -160269 -228916 -165687 -116183 -30410 32643 115261 143710
7797A43710R4539j50555m045P9055Q892L6921r8962j2511L7540M1926p9655n5410
$$ 143710 238249 87694 83649 162704 171596 208517 109555 97044 134584 176510 96855 41445
7785D1445R0409K2153o2053L8774n7890J9887r161R0057k3931q0043K8338o1867
$$ 41445 131854 154007 91954 130728 72838 92725 83564 173621 149690 69647 97985 36118
7773C6118m5049O0583j1813m1479k261O215p2690N075m5565N3159R8180N6542
$$ 36118 -8931 51652 39839 -1640 -3901 2314 -70376 -65301 -110866 -57707 40473 97015
7761I7015n6813j9549N8790J614n4917Q2201L0620k6652j02201l8319N3804m5990
$$ 97015 40202 20653 79443 81057 26140 108341 138961 112309 10108 -28211 25593 -20397
7749b0397j31071k8092n2432m9636M9499M4458M1116P8431J55435k5577n4655
$$ -20397 -151468 -179560 -231992 -281628 -232129 -187671 -146555 -68124 87311 61734 7079
7738G079j7654O0027P7662p479J7505L3546n2284r0880k2883L7191J4765j445
$$ 7079 -10575 49452 127114 119635 137140 170686 118402 27522 4639 41830 56595 55150
7726E5150n1466k2625m238j9067Q8149m738k2894R472p376L3601K3402j7009p5075
$$ 55150 3684 -18941 -23179 -42246 45903 41165 18271 27743 20367 53968 77370 60361 -14714
7713a4714o166j1530q133O1677Q7613K3892r7386k2579n8598m1498l8346P1561
$$ -14714 -20880 -32410 -40543 21134 108747 132639 35253 12674 -45924 -87422 -125768 -54207
7701e4207l6859l0760p5000K2869P2180n1598J2640M0977j02731j12030q507R2990
$$ -54207 -91066 -121826 -196826 -173957 -101777 -153375 -140735 -99758 -202489 -314519 -323026 -230036
7689b30036J7726K5456K2833M7926M5058L4737l5383n6407r685R1977m3526O407
$$ -230036 -212310 -186854 -164021 -116095 -71037 -36300 -71683 -128090 -137775 -45798 -89324 -82917
7677h2917J08694N2495m7579r5343Q777O3146Q4198J0875M638N6172N8464n5209
$$ -82917 25777 78272 30693 -64650 -55873 7273 91471 102346 106984 163156 221620 166411
7665A66411j43393n6M4767l4939n5797j5650R8693O6078j0174j03501O0411J2205
$$ 166411 23018 22962 67729 32790 -23007 -38657 60036 126114 115940 12439 72850 85055
7653H5055m0974l2556n2983l366m8471j08068k4113K0513K02277l0248p1144K5445
$$ 85055 44081 11525 -41458 -44824 -93295 -201363 -225476 -204963 -2686 -32934 -104078 -78633
7641g8633n1138p448J07367k1186j01005J28202N9288j61264l3339O4369o6846
$$ -78633 -129771 -137219 -29852 -51038 -152043 -23841 35447 -125817 -159156 -94787 -161633
7630a61633J8838N1907m3628l4748o6276j0603m3650J16555Q1024r05q2405J0343
$$ -161633 -142795 -90888 -134516 -169264 -235540 -246143 -289793 -173238 -92214 -93119 -175524 -165181
7618a65181O9927O5880n0726K6960P1586K3315r4281l8119o080N6357R5777l819
$$ -165181 -95254 -29374 -80100 -53140 18446 41761 -52520 -90639 -96719 -40362 55415 51596
7606E1596m4729L107O1964M5742m0486m5943o8908K12721J37857o6899j18059
$$ 51596 6867 9974 71938 117680 77194 31251 -37657 175064 312921 246022 127963
7595A27963p3469Q4100N6457j2298r0233o7495O062J252J8006j55991K9713m2960
$$ 127963 54494 138594 195051 182753 92520 25025 31087 32339 50345 -105646 -75933 -118893
7583a18893p251J49347K636m8676M9144O6651l2366r1437r1l6152J2838R2445
$$ -118893 -126144 23203 25839 -22837 26307 92958 60592 -30845 -30936 -67088 -54250 38195
7571C8195J06126O5586P7238p6544k32092j01351q91j2980J2896K381J11967L8963
$$ 38195 144321 209907 287145 210601 -21491 -122842 -123733 -136713 -123817 -121436 -9469 29494
7559B9494J103l3978j15998p918n7098N6011k6291O589N4252J4655O3681J9790
$$ 29494 30597 -3381 -119379 -127297 -184395 -128384 -154675 -148086 -93834 -79179 -15498 4292
7547D292J08449Q1600J6731p3741K6970l6590j30456k7024J2414O9138r397N0904
$$ 4292 112741 194341 211072 137331 164301 127711 -2745 -29769 -17355 51783 42386 93290
7535I3290k8379j1870O5254Q837P29o245r841j36713M0284O8826l1324J6223P6711
$$ 93290 64911 53041 118295 127132 127861 121616 111775 -24938 15346 84172 52848 69071 145782
7522A45782J065j42264N7948P1278p0590k930O216k4362O3242J4167o4022Q7211
$$ 145782 146847 4583 62531 133809 63219 60289 66505 42143 105385 119552 55530 142741
7510A42741r7148j18179K6598R8806J63440L676r1310k9028j02385q1375M5648
$$ 142741 45593 -72586 -45988 52818 216258 219934 128624 99596 -2789 -84164 -38516
7499c8516L0179P9732K3005r4895p3561J8367J13840J6138r7487K0358P0397l6600
$$ -38516 -8337 71395 94400 -495 -74056 -55689 58151 74289 -23198 -2840 67557 30957
7487C0957q7483L6642p24l4548O645K6919j1952N2527o7149p1529j08645O4709
$$ 30957 -56526 -19884 -20608 -55156 -48511 -21592 -33544 18983 -48166 -119695 -228340 -163631
7475a63631R2853K9055m874N2756j6938n1602P6651Q6824p733P5280J0883n2718
$$ -163631 -70778 -41723 -46597 6159 -10779 -62381 14270 101094 93361 168641 179524 126806
7463A26806p4153O6090M4487m4929j05599r3259J6976M0356j1511O352k1290j9002
$$ 126806 52653 118743 163230 118301 12702 -80557 -63581 -23225 -34736 -28384 -49674 -68676
7451f8676j29452p4816R3763m8908N566j7046J31368J34062Q30o8955l3038K9501
$$ -68676 -198128 -272944 -179181 -228089 -222523 -239569 -108201 25861 26691 -42264 -75302 -45801
7439d5801J6382L7019j6690K1284l6559o3277l6406R5707J2528p596r487p3572
$$ -45801 -29419 7600 -9090 12194 -24365 -87642 -124048 -28341 -15813 -23409 -32896 -106468
7427a06468o0264J5056Q8734N4340q3264r457R975N7513N373r3189l9588L9368
$$ -106468 -166732 -151676 -62942 -8602 -91866 -101323 -91348 -33835 -28462 -121651 -161239 -121871
7415a21871L1084p8654L2483J23895P3686n4276M390k9981n6863K0095J23802
$$ -121871 -90787 -169441 -136958 -13063 60623 6347 10737 -19244 -76107 -56012 67790
7404F7790L5810j37414o6345m3665k541P1334j5136Q180J9805R2637k6664j55126
$$ 67790 103600 -33814 -100159 -143824 -146365 -75031 -90167 -81987 -62182 30455 3791 -151335
7392a51335l759K9189r054N3481P7190Q6203P7896r3662m2023q5724j5113P5479
$$ -151335 -155094 -125905 -134959 -81478 -4288 81915 159811 66149 24126 -61598 -76711 -1232
7380a232J9055j7293k5051O9747J37371M567j13434r7433j39596L5318R0055j5375
$$ -1232 17823 530 -24521 45226 182597 187164 73730 -23703 -163299 -127981 -37926 -53301
7368e3301M9964J21103m6409o8702j9583M1856K010n2480j08858P8957K9341Q8620
$$ -53301 -3337 117766 71357 2655 -16928 24928 26938 -25542 -134400 -55443 -26102 62518
7356F2518J08014o4608q9566j82140o3746K2723n5252M7281M8918K19718k1299
$$ 62518 170532 105924 16358 -165782 -229528 -206805 -262057 -214776 -165858 53860 32561
7345C2561P0362N0877R243j12776n8593o9807N925Q8065P7547m1322q3583m3178
$$ 32561 102923 153800 163043 50267 -8326 -78133 -72208 15857 93404 52082 -31501 -74679
7333g4679M437J19243M0299r824r8296j4618M7344j55291Q0162J20105n677j35725
$$ -74679 -70242 49001 89300 79476 -18820 -33438 13906 -141385 -61223 58882 53205 -82520
7321h2520M8884Q3907M2178l4074q4144K604k3331k6170O8118J18388R639o0068
$$ -82520 -33636 50271 92449 58375 -25769 -23165 -46496 -72666 -4548 113840 123479 63411
7309F3411n1454L7016L2086k7736j07853l6117K5620L4009m6330J0186J18748
$$ 63411 11957 48973 81059 53323 -54530 -90647 -65027 -31018 -77348 -67162 51586
7298E1586M2755r129M8056j05861j49095R706j02219k1408J37959J17221m5783
$$ 51586 94341 85212 133268 27407 -121688 -111982 -214201 -235609 -97650 19571 -26212
7287b6212O426P3620q0798J2223J41571j03037j05011L6878k2612R853O5647J1824
$$ -26212 -19786 53834 -26964 -14741 126830 23793 -81218 -44340 -66952 -57099 8548 20372
7275B0372L4614J28414J1268j54023m7246J34138j2913j51534o0829N3073n9373
$$ 20372 54986 183400 194668 40645 -6601 127537 114624 -36910 -97739 -44666 -104039
7264a04039n1857L2539m1540l7623R7352L1834k7612M1764j3234j17517l020K5701
$$ -104039 -155896 -123357 -164897 -202520 -105168 -73334 -100946 -59182 -72416 -189933 -192953 -167252
7252a67252k8641o7615m6925J604J05129J37504M3766J440j08102j05046K0295
$$ -167252 -195893 -263508 -310433 -308829 -203700 -66196 -22430 -20990 -129092 -234138 -213843
7241b13843R5938k7811O3611N345n6767K865L8744n4684J6038K981L9521M5763
$$ -213843 -117905 -145716 -82105 -76760 -133527 -130662 -91918 -146602 -130564 -127583 -88062 -42299
7229d2299J08655O6941p5105j04825P5996J2367K9625p1444k2414L2688o0275
$$ -42299 66356 133297 58192 -46633 29363 41730 71355 -89 -22503 10185 -50090
7218e0090r0696l1467J81527N0732p353m3391P5993l557j13847m6689O9741J5517
$$ -50090 -140786 -172253 9274 60006 52653 9262 85255 81698 -32149 -78838 -9097 6420
7206F420j4806j05406j7563O1476O1433j1755j17929K0214J23996K083M8284P5530
$$ 6420 -8386 -113792 -131355 -69879 -8446 -20201 -138130 -117916 6080 8163 56447 131977
7194A31977j7121n7521p8750l3112j39617n2008O1671J19400J09962j05610m0791
$$ 131977 114856 57335 -21415 -54527 -194144 -246152 -184481 -65081 44881 -60729 -101520
7183a01520j5917O6903k3023o2528k6173L5739J6129J07924J07310l8386m1229
$$ -101520 -117437 -50534 -73557 -136085 -162258 -126519 -110390 -2466 104844 66458 25229
7172B5229j9167j9118j10390p3395k5677N1787R1273j293P2028p1843L7487l0637
$$ 25229 6062 -13056 -123446 -196841 -222518 -170731 -79458 -80751 -8723 -80566 -43079 -73716
7160g3716r4891L0098m3751N4095J196L6655J4481o2103L0723l2784L4523m7077
$$ -73716 -168607 -138509 -182260 -128165 -126969 -90314 -75833 -137936 -107213 -139997 -105474 -152551
7148a52551k4958P5096R0220Q5801L4273Q2031j33752q0362K2808J8969r7394
$$ -152551 -177509 -102413 -12193 73608 107881 189912 56160 -24202 -1394 17575 -79819
7137g9819m544l8979q5028j50J05262q890O6046k5055k2322J9847N2175n24J61161
$$ -79819 -84363 -123342 -208370 -208520 -103258 -112148 -46102 -71157 -93479 -73632 -21457 -21981 139180
7124A39180j8368J232o2008o1732O2665J15221O7355o1627j57977L147o9380o2528
$$ 139180 120812 122044 60036 -1696 60969 176190 243545 181918 23941 27088 -42292 -104820
7112a04820J25201O2950m45q4l4490m2250J12344J3402o7219j18454l5980o6401
$$ -104820 20381 83331 82886 82802 48312 6062 118406 131808 64589 -53865 -89845 -156246
7100a56246r1988K8715J03263j7321J06144r7400m6518K7528k6959m3757P8737
$$ -156246 -248234 -219519 -116256 -133577 -27433 -124833 -171351 -143823 -170782 -214539 -135802
7089a35802R9103q0548j8277j5880J23128J27955K5428n9717j60651l5151P4407
$$ -135802 -36699 -117247 -135524 -151404 -28276 99679 125107 65390 -95261 -130412 -56005
7078e6005K4102p493k353m7222m3473K6306M362J34013N0011l8716r4513l4122
$$ -56005 -31903 -39396 -41749 -88971 -132444 -106138 -101776 32237 82248 43532 -50981 -85103
7066h5103p6221Q0900Q9483O9709K3719L026J5784p4980n7735K7102Q3100n6955
$$ -85103 -161324 -80424 9059 78768 102487 105513 121297 46317 -11418 15684 98784 41829
7054D1829j63313l6212n777k5021k6987N5477J42022L3037l4461N8213L038M9650
$$ 41829 -121484 -157696 -163473 -188494 -215481 -160004 -17982 15055 -19406 38807 41845 91495
7042I1495R5201J43562n9279j12128j00007O6828L2067m4207j70595j14286L6468
$$ 91495 186696 330258 270979 158851 58844 125672 157739 113532 -57063 -171349 -134881
7031a34881k900L9437J12660J102j63260K2711O8373N8272r2898m1318P2740M4535
$$ -134881 -137781 -98344 14316 15418 -147842 -125131 -56758 1514 -91384 -132702 -59962 -15427
7019a5427l1121q0841m5925l7092M2513q6363J21K4214m5559L2114N0658Q1019
$$ -15427 -46548 -127389 -173314 -210406 -167893 -254256 -254135 -229921 -275480 -243366 -192708 -111689
7007a11689N1656K9991r2925J6166O2432Q5518j0608L4382o5429m2770n0412K1326
$$ -111689 -60033 -30042 -122967 -106801 -44369 41149 30541 64923 -506 -43276 -93688 -72362
6995g2362O3856n4885j03629k8560j4801O8887r41N7891Q0225J17506N5427J05153
$$ -72362 -8506 -63391 -167020 -195580 -210381 -141494 -142435 -84544 -4319 113187 168614 273767
6983B73767P4188o0722j15493j65070j10095N2412P9731l3911j69984j27387n918
$$ 273767 347955 287233 171740 6670 -103425 -51013 28718 -5193 -175177 -302564 -308482
6972c08482J57273l3157K0041O5792M5878J562k3925K7781l7290n4682L2564J07500
$$ -308482 -151209 -184366 -164325 -98533 -52655 -51093 -75018 -47237 -84527 -139209 -106645 855
6960H55N616q9932O7823P962O7061r2545j9867J7253j23352o5430k8010N4250
$$ 855 6471 -83461 -15638 -7676 59385 -33160 -53027 -35774 -159126 -224556 -252566 -198316
6948a98316j6784Q290P0502k2427J04774N4738j8531k4367n3696M1123J26623
$$ -198316 -215100 -206810 -136308 -158735 -53961 777 -17754 -42121 -95817 -54694 71929
6937G1929O6654j091n3714o8313n2681L8866K7263R1987N0822J3513N2732J17180
$$ 71929 138583 137492 83778 15465 -37216 1650 28913 120900 171722 185235 237967 355147
6925C55147o4135k47512j9539J33044m6790j35131j10228K689q8979J2633L5485
$$ 355147 291012 43500 23961 157005 110215 -24916 -135144 -132455 -221434 -208801 -173316
6914a73316N2322N244L5505K0492J28849O2738q5298p9280p0573k3159M8929k956
$$ -173316 -120994 -115750 -80245 -59753 69096 131834 46536 -32744 -103317 -126476 -77547 -80503
6902h0503q404n697J68066r7511j64521J5103R7649Q4789l0365K65n7705o1299
$$ -80503 -88907 -94604 73462 -24049 -188570 -173467 -75818 8971 -21394 -21129 -78834 -140133
6890a40133R8960J13773J2418l3868P9166o3230j63072L2613J01396k6683m7358
$$ -140133 -41173 72600 85018 51150 130316 67086 -95986 -63373 38023 11340 -36018
6879c6018J48020j8972l0818M0726m4342k692q2438j6543J48408O4411J7902P1441
$$ -36018 112002 93030 62212 102938 58596 55904 -26534 -43077 105331 169742 187644 259085
6867B59085J6126j63545k1562J6666j26248j10084k771p3190N3048n1613O0510
$$ 259085 275211 111666 90104 106770 -19478 -129562 -132333 -205523 -152475 -204088 -143578
6856a43578N7020O2455l2905j41151P0771K01548K165p9580q6645j4632J2336
$$ -143578 -86558 -24103 -57008 -198159 -127388 74160 76325 -3255 -89900 -104532 -92196
6845i2196l3980J4177N088q8929N3722K25927p4231K8749j5898j53351n524m6880
$$ -92196 -126176 -111999 -106911 -195840 -142118 83809 9578 38327 22429 -130922 -136446 -183326
6833a83326l2452J13467J7042m1277J3211k6323j09389K5343J04176M0999l023
$$ -183326 -215778 -102311 -85269 -126546 -113335 -139658 -249047 -223704 -119528 -78529 -81552
6822h1552L1105n457k6043J5614q5516j01121J0870J61233J35985L380r2175q8827
$$ -81552 -50447 -55904 -81947 -66333 -151849 -252970 -242100 -80867 55118 58498 -33677 -122504
6810a22504l241o1594N6456J35749m9882j4746Q9168j25785m586P4654N3922N3516
$$ -122504 -125745 -187339 -130883 4866 -45016 -59762 29406 -96379 -100965 -26311 27611 81127
6798H1127m5441j2636M0004O9113N490q3027m2240M5715K2003n740J8244m0412
$$ 81127 35686 23050 63054 132167 137657 54630 12390 58105 80108 74368 92612 52200
6786E2200m6956j7532L359N6420R4734M6144m7051k1907n5530J5695m4090j44933
$$ 52200 5244 -12288 -8929 47491 142225 188369 141318 119411 63881 79576 35486 -109447
6774a09447M4400M0121L4877L6656n0149j4520k8625j34268j5222L7021L7946
$$ -109447 -65047 -24926 9951 46607 -3542 -18062 -46687 -180955 -196177 -159156 -121210
6763a21210Q9165p9634J02914N1090m0225j15043J05283J20530K935j07493j4117
$$ -121210 -32045 -111679 -8765 42325 2100 -112943 -7660 112870 115805 8312 -5805
6752e805J11364M0022j01786j30190l7941J9713P2053P873L3133N2800n2577M5168
$$ -5805 105559 145581 43795 -86395 -124336 -104623 -32570 -24697 8436 61236 8659 53827
6740E3827J05600j2595j21540m6404o8678n7570J17181J6438J64989K36141R0382
$$ 53827 159427 146832 25292 -21112 -89790 -147360 -30179 -13741 151248 387389 477771
6729D77771J5303J22566J25249K60615J82749K20336J23688K29254J85826K06496
$$ 477771 493074 615640 740889 1001504 1184253 1404589 1528277 1757531 1943357 2149853
6719B149853L655k75511l37805l19494k09819j09524j08716j02019r3274j31292
$$ 2149853 2153508 1877997 1540192 1220698 1010879 901355 792639 690620 597346 466054
6709D66054p0571L941n7276n1612n7318P1108Q2890m973O574l1191K0905m9114
$$ 466054 395483 399424 342148 290536 233218 304326 387216 382243 388817 357626 378531 329417
6697C29417K8710j9928l0551r0744k3426L8917l5160J1382J15433K0804r0381
$$ 329417 358127 338199 307648 216904 193478 232395 197235 208617 324050 344854 254473
6686B54473j9654o4757l2121n9828j8370K9603k7219P1530J44244j0658l4916
$$ 254473 234819 170062 137941 78113 59743 89346 62127 133657 277901 267243 232327
6675B32327j04224j20083m7840J20785j0339l4723M5766L8786Q7775M2517k4734
$$ 232327 128103 8020 -39820 80965 70626 35903 81669 120455 208230 250747 226013
6664B26013m6447J1387q5367j7280q5120P7045J2764M0040j18324l0027J2020
$$ 226013 179566 190953 105586 88306 3186 80231 92995 133035 14711 -15316 -3296
6653c296o012Q7614J9625L1756n6173l6269M4758r1907q2958n7758N0857J3084
$$ -3296 -9308 78306 97931 129687 73514 37245 82003 -9904 -92862 -150620 -99763 -86679
6641h6679J31244j0470q7372o4466k367J31991P9203q6267l7569j5817r3342L6119
$$ -86679 44565 34095 -53277 -117743 -120110 11881 91084 4817 -32752 -48569 -141911 -105792
6629a05792j8468q1247n91J47596K0571k2355N403P2685r540N1383L4651q6903
$$ -105792 -124260 -205507 -206098 -58502 -37931 -60286 -54883 17802 8262 59645 94296 7393
6617G393j70442m0555O0365J1494p1224L7118J04965Q4836k0962j58249r980K16735
$$ 7393 -163049 -203604 -143239 -131745 -202969 -165851 -60886 23950 2988 -155261 -165241 51494
6605E1494Q1825k4110j47640j32670Q3352N9278j4615M1871q086K3058M067o9481
$$ 51494 133319 109209 -38431 -171101 -87749 -28471 -43086 -1215 -9301 13757 17824 -51657
6593e1657m2536q581L9753J27054J52659n1118p3247o7286k1933l4730Q341k2711
$$ -51657 -94193 -102774 -63021 64033 216692 165574 92327 25041 3108 -31622 -23281 -45992
6581d5992N3662j0548l6627J02479p32J09885j67014j73865q1809J4012J03778
$$ -45992 7670 -2878 -39505 62974 62242 172127 5113 -168752 -250561 -236549 -132771
6570a32771K2933j0215K5890j4236m7951J59126j33535m8735J08522L0214O3334
$$ -132771 -109838 -120053 -94163 -108399 -156350 2776 -130759 -179494 -70972 -40758 22576
6559B2576J01761m3544j14978M9825K5887P4834o1772j8433k9040m7399r7624
$$ 22576 124337 80793 -34185 15640 41527 116361 54589 36156 7116 -40283 -137907
6548a37907L6168J24283P089N253o6016m9166J14497K0181m4758j6852M0714J2782
$$ -137907 -101739 22544 29633 34886 -31130 -80296 34201 54382 9624 -7228 33486 46268
6536D6268L0615K1621o3891k6803M3539K9431q2669m7234P664l2285M9783N8465
$$ 46268 76883 98504 34613 7810 51349 80780 -1889 -49123 -41459 -73744 -23961 34504
6524C4504m0704O3158J03370k2667j31054j20472q0725M0627j11O463R0834Q239
$$ 34504 -6200 56958 160328 137661 6607 -113865 -194590 -153963 -154074 -147611 -56777 -48538
6512d8538p4709J4227k739Q7760N5039j3511m3898l884L3935P324J48202Q5839
$$ -48538 -123247 -109020 -111759 -23999 31040 17529 -26369 -30253 3682 11006 159208 245047
6500B45047q6930r1532m3828L3684L7955j9332r1148p9879l5721N1017M4104L9111
$$ 245047 158117 66585 22757 56441 94396 75064 -16084 -95963 -131684 -80667 -36563 2548
6488B548j00202L815M9880L996N9904L0397r4004n8908j4514M7465o6772l8161
$$ 2548 -97654 -93839 -43959 -39963 19941 50338 -43666 -102574 -117088 -69623 -136395 -174556
6476a74556J60205P7194n8780n3043l7779l5900O5242L3727j25770k9492P5445
$$ -174556 -14351 62843 4063 -48980 -86759 -122659 -57417 -23690 -149460 -178952 -103507
6465a03507L2496M5221J2973L4610l103k1844j32961r0057L5464j7983N9978J28748
$$ -103507 -71011 -25790 -12817 21793 18690 -3154 -136115 -226172 -190708 -208691 -148713 -19965
6453a9965P3993M0595l4724q451q608l9952m6740L3241m4250n5090N9186N2212
$$ -19965 54028 94623 59899 51448 42840 2888 -43852 -10611 -54861 -109951 -50765 1447
6441A447P2622O8430o1312R450n9173r2880m1441J60861N0462j15918M0969m5892
$$ 1447 74069 142499 81187 90637 31464 -61416 -102857 58004 108466 -7452 33517 -12375
6429a2375m1871m4541J21764K6876p7659K2902m2193o6056j06082m1997r8295
$$ -12375 -54246 -98787 22977 49853 -27806 -4904 -47097 -113153 -219235 -261232 -359527
6418c59527J05686P9246P9695l7111j11397n5406L0102R8486J0994m315O7269
$$ -359527 -253841 -174595 -94900 -132011 -243408 -298814 -268712 -170226 -159232 -163547 -96278
6407i6278o3612p5718L4141R3900O0489J7913o1309O2131l9514O6849J3031p3243
$$ -96278 -159890 -235608 -201467 -107567 -47078 -29165 -90474 -28343 -67857 -1008 12023 -61220
6395f1220R7481J38847m3849j78028o930L1916O3031j00054L259L9668o5891o697
$$ -61220 36261 175108 131259 -46769 -53699 -21783 41248 -58806 -55547 -15879 -81770 -88467
6383h8467Q0579O499n6294k9691k798O0150n3682o7228K8962l6866O0970J18338
$$ -88467 -7888 -1389 -57683 -87374 -90172 -30022 -83704 -150932 -121970 -158836 -97866 20472
6371B0472q1938L9860L307j03365j40965n9999l9662J0297J14623J91184k1048
$$ 20472 -61466 -21606 -18299 -121664 -262629 -322628 -362290 -351993 -237370 -46186 -67234
6360f7234l5261J19272P6642j5326k4328k4087L7443n0998M3989N022l8375j9930
$$ -67234 -102495 16777 93419 78093 53765 29678 67121 16123 60112 65134 26759 6829
6348F829m4497j8542M8070L6916l7765o5127r7015o5852L1694K139L6890p495
$$ 6829 -37668 -56210 -8140 28776 -8989 -74116 -171131 -236983 -205289 -203150 -166260 -173755
6336a73755J6630n8716O7386P9339j4072j16127j14700K6575J25051M4306m847
$$ -173755 -157125 -215841 -148455 -69116 -83188 -199315 -314015 -287440 -162389 -118083 -122930
6325a22930L9136l148J3582J7280P7862r7104o1018Q5549P7127j7044K5295O515
$$ -122930 -83794 -86942 -73360 -56080 21782 -75322 -136340 -50791 26336 9292 34587 41102
6313D1102N8137o940r9061M1527n3297j34903q1200J75139Q2927o167j57083k4448
$$ 41102 99239 92299 -6762 34765 -18532 -153435 -234635 -59496 23431 17264 -139819 -164267
6301a64267J96569J37455k5914q0890N5496q4252l8449M1853j46035k3795q418
$$ -164267 32302 169757 143843 62953 118449 34197 -4252 37601 -108434 -132229 -140647
6290a40647m0893j1398P9613n0029n3470R438N4209m0850k4547L6400Q028Q6980
$$ -140647 -181540 -192938 -113325 -163354 -216824 -207386 -153177 -194027 -218574 -182174 -174146 -87166
6278h7166K8825Q101P419o600J0801m0821R3688N9724l2388l4849p8160j51626
$$ -87166 -58341 -50240 -42821 -49421 -38620 -79441 14247 73971 41583 6734 -71426 -223052
6266b23052p167M3325M56j0842R2772n355K5289q6167L0543N6262P9963J78887
$$ -223052 -230219 -186894 -186438 -197280 -104508 -109863 -84574 -170741 -140198 -83936 -3973 174914
6254A74914P772o0188q0329j94617j12009O3997M0843j8676J45863M0073m6247
$$ 174914 182686 122498 42169 -152448 -264457 -200460 -159617 -178293 -32430 7643 -38604
6243c8604n2591J13819M6502j04815j51000o7257o0885j535l0281m0769M6587
$$ -38604 -91195 22624 69126 -35689 -186689 -253946 -314831 -316366 -346647 -387416 -340829
6232c40829Q6348J38026O9495K918J5342M8173K8279o7652j07521q8395P8513
$$ -340829 -254481 -116455 -46960 -44042 -28700 19473 47752 -19900 -127421 -215816 -137303
6221a37303L5583m9946M4117N1429l5722J33544J54494o3632j52585n6007p2451
$$ -137303 -101720 -151666 -107549 -56120 -91842 41702 196196 132564 -20021 -76028 -148479
6210a48479L2092L339j28491k5496K8999Q5499L2241m9438J257K7104k2172n9617
$$ -148479 -116387 -113048 -241539 -267035 -238036 -152537 -120296 -169734 -168477 -141373 -163545 -223162
6198b23162M3507J04580J18500K3000m573j49025n3565L7050M0029J6796R3440
$$ -223162 -179655 -75075 43425 66425 61852 -87173 -140738 -103688 -63659 -46863 46577
6187D6577r0613l8188N3530N781l944N1167O9348O7785k4454p8080J2444M9921
$$ 46577 -44036 -82224 -28694 -22913 -26857 24310 93658 161443 136989 58909 71353 121274
6175A21274k8144J3010r8864j08022P539Q3174O3089P0454L6304r6737q6192k6540
$$ 121274 93130 106140 7276 -100746 -93207 -10033 53056 123510 159814 63077 -23115 -49655
6163d9655O0824P3141j3491k8639N7224N2178j27815K9056l9403o7717j1949o6677
$$ -49655 11169 84310 70819 42180 99404 151582 23767 52823 13420 -54297 -66246 -132923
6151a32923J2399J89219P1003L3008J8679j10810k2990o1735J2681k5580K9754
$$ -132923 -120524 68695 139698 172706 191385 80575 57585 -4150 8531 -17049 12705
6140A2705N3692q1976j8499R373K0269j56222m8631J37417K2371n2528l7379n5854
$$ 12705 66397 -15579 -34078 -24705 -4436 -160658 -209289 -71872 -49501 -102029 -139408 -195262
6128a95262p178J17681N4765J7335O388P2372j0747l5260l9281O419N2519R5914
$$ -195262 -202440 -84759 -29994 -12659 -6271 66101 55354 20094 -19187 -12768 39751 135665
6116A35665P120j07889o613J20767l2969n136J6040l7510l6182r407l4725n3925
$$ 135665 142785 34896 28283 149050 116081 110945 126985 89475 53293 43886 9161 -44764
6104d4764N9515K98J29857q5723l0402l7937N5901M4621r8587p7359j0902J44585
$$ -44764 14751 15049 144906 59183 28781 -9156 46745 91366 -7221 -84580 -95482 49103
6092D9103P3314j08831k4672J16113N2724j03599q1941j56R6919r180R554o7498
$$ 49103 122417 13586 -11086 105027 157751 54152 -27789 -27945 68974 59794 69348 1850
6080A850J3177Q775m621K6811o7337n5552k3699R8080j15080q1914M6910Q1834
$$ 1850 15027 23802 19181 45992 -21345 -76897 -100596 -2516 -117596 -199510 -152600 -70766
6068g0766K38302l0831j40352O8478r0619j19588k5191N8950J31506l1958m3608
$$ -70766 167536 136705 -3647 64831 -25788 -145376 -170567 -111617 19889 -12069 -55677
6057e5677r469Q8821K5227o60m1496N4962m2482o0810l7205O9673R1163J10397
$$ -55677 -65146 23675 48902 48242 6746 61708 19226 -41584 -78789 -9116 82047 192444
6045A92444m6058M5576q1768p1511N7005P4453R0767j34782k50513q5885k2822
$$ 192444 146386 191962 110194 38683 95688 170141 260908 126126 -124387 -210272 -233094
6034b33094P212R7456K308J79754P8483p4994o4591O5779n5345j24807k914l7609
$$ -233094 -225882 -128426 -126118 53636 132119 57125 -7466 58313 2968 -121839 -124753 -162362
6022a62362m7876q454J43652J96761j9015j28182j24721R597n1848J35214L3682
$$ -162362 -210238 -218692 -75040 121721 102706 -25476 -150197 -140600 -192448 -57234 -23552
6011b3552p7075o5653P4122J12517J32958p7973j17202r1591q0160j507Q2059
$$ -23552 -100627 -166280 -92158 20359 153317 75344 -41858 -133449 -213609 -215116 -133057
6000a33057N6136k92O7972m5953k2406P6970m2679j0786r122o508o8979J10556
$$ -133057 -76921 -77213 -9241 -55194 -77600 -630 -43309 -54095 -63217 -69725 -138704 -28148
5988b8148P038o7180J2350L4759j6056r6503O4008P6351N0579l7240M8589P1102
$$ -28148 -21110 -88290 -75940 -41181 -57237 -153740 -89732 -13381 37198 -42 48547 119649
5976A19649l2273J7554l3803n2177k2495O232q9166l9783N5945K0070o4694n7737
$$ 119649 87376 104930 71127 18950 -3545 2687 -86479 -126262 -70317 -50247 -114941 -172678
5964a72678J45436k064L2557P9757j23421K3059J6363J2165K1601j1094N2570
$$ -172678 -27242 -29306 3251 83008 -40413 -17354 -991 11174 32775 21681 74251
5953G4251J2239o7900l4554j4752P1397J3649K036r957O2216J650k3101j06651
$$ 74251 86490 18590 -15964 -30716 40681 54330 56366 46409 108625 110275 87174 -19477
5941a9477j00213J4632P1784N8572p1456J4679N9652M6344r7043O4622L6007N7182
$$ -19477 -119690 -105058 -33274 25298 -46158 -31479 28173 74517 -22526 42096 78103 135285
5929A35285n9558j32363o7070m0186P8181J9034L7042j08011m4818J03083J2253
$$ 135285 75727 -56636 -123706 -163892 -85711 -66677 -29635 -137646 -182464 -79381 -67128
5918f7128J128p4952p1556N8485m0024j4362M3262M3566j8026p5519P080Q4646
$$ -67128 -66000 -140952 -212508 -154023 -194047 -208409 -165147 -121581 -139607 -215126 -208046 -123400
5906a23400L427N6024J9405r475j78023j0643l3500J04202J06162l0977J4904
$$ -123400 -119973 -63949 -44544 -54019 -232042 -242685 -276185 -171983 -65821 -96798 -81894
5895h1894Q3408J01250j08906K6159P7076p8734n7329J7386m9599K6991L9587
$$ -81894 1514 102764 -6142 20017 97093 18359 -38970 -21584 -71183 -44192 -4605
5884d605J9381R7788n7143j10624q792K6280J30241P333J480m0465m986p4470
$$ -4605 14776 112564 55421 -55203 -63995 -37715 92526 99859 101339 60874 55888 -18582
5872a8582K2683k3703p9811m5146m1824J4228O3561Q1255M30j73960q216M5551
$$ -18582 4101 -19602 -99413 -144559 -186383 -172155 -108594 -27339 -26909 -200869 -209085 -163534
5860a63534L4439L2427O3723J0191P4409P2482J77645k7667q9591P360j0901o8850
$$ -163534 -129095 -96668 -32945 -22754 51655 124137 301782 274115 184524 191884 180983 112133
5848A12133j881q6648r2352J11110k8271j83205M7186M1578J11730L1424N1636
$$ 112133 110252 23604 -68748 42362 14091 -169114 -121928 -80350 31380 62804 114440
5837A14440K0830q1320r9477K7446J6573j56755n8663O177J38776O2943o1781
$$ 114440 135270 53950 -45527 -18081 -1508 -158263 -216926 -210749 -71973 -9030 -70811
5826g0811k449P3302L6921O1702l1324o4309k3583J10099P7764j176K2450l8784
$$ -70811 -73260 42 36963 98665 67341 3032 -20551 89548 167312 166136 188586 149802
5814A49802k8161m2546k2639J17240q9688m1291j3696J5076J9354K1566K9397
$$ 149802 121641 79095 56456 173696 84008 42717 29021 44097 63451 85017 114414
5803A14414o6n2841j30945n6276J403P7135r0714q4099Q7686R836O3582J08002
$$ 114414 114348 61507 -69438 -125714 -124311 -47176 -137890 -221989 -134303 -124467 -60885 47117
5791D7117j16716Q067j65n7345q155J04494J9387O414K883J07606L4653J3313
$$ 47117 -69599 -61532 -61697 -119042 -127197 -22703 -3316 3098 5981 113587 148240 161553
5779A61553L1612n3974k6275j4221l8961j1724k2813k9515L2514o2102r8904l1656
$$ 161553 193165 139191 112916 98695 59734 48010 25197 -4318 28196 -33906 -132810 -164466
5767a64466J1178J11058J02987J41080J9519r5308j13656o9129J10409R8953L4946
$$ -164466 -153288 -42230 60757 201837 221356 126048 12392 -56737 53672 152625 187571
5756A87571j09290q1221j45085p8368J19534M3889J13488L9461j46504m7819N5047
$$ 187571 78281 -2940 -148025 -226393 -106859 -62970 50518 89979 -56525 -104344 -49297
5745d9297J7623O4334L1549J37848O5637p0191j3350q549n8273P3184J9637o629
$$ -49297 -31674 32660 64209 202057 267694 197503 184153 175604 117331 190515 210152 203523
5733B03523L615n2443q6335M0228l8574q7512K1499r2499P4533K1201m4870j03732
$$ 203523 207138 154695 68360 108588 70014 -17498 4001 -88498 -13965 7236 -37634 -141366
5721a41366j11432R3956J28427K3294o1711n772O5310J9710n9906j57466n0118
$$ -141366 -252798 -158842 -30415 -7121 -68832 -74604 -9294 10416 -49490 -206956 -257074
5710b57074N2109J48538R6135j53693p6592J8614J8466P8480p4242o6955L374
$$ -257074 -204965 -56427 39708 -113985 -190577 -171963 -153497 -75017 -149259 -216214 -212840
5699b12840K4134K8652P5522N1341M4668P4316k2725P7653o9123J8773n7138j3788
$$ -212840 -188706 -160054 -84532 -33191 11477 85793 63068 140721 71598 90371 33233 19445
5687A9445p8897m7323r563j56951p2485J21448J74193J71345m6338j1284K8453
$$ 19445 -59452 -106775 -116338 -273289 -345774 -224326 -50133 121212 74874 63590 92043
5676I2043q4957l0111R051P5761l6122j886l9151n3508m5961l4460M4843J04371
$$ 92043 7086 -23025 -13974 61787 25665 23779 -15372 -68880 -114841 -149301 -104458 -87
5664h7J3078j70248Q0551J40929O5595l828k4815L716o202o2203q5099P922K1663
$$ -87 12991 -157257 -76706 64223 129818 125990 101175 104891 98689 36486 -48613 -40691 -19028
5651a9028p7042j4449K8758N3735J54667K7113P179r0127l5439M1157k8931N0635
$$ -19028 -96070 -110519 -81761 -28026 126641 153754 160933 70806 35367 76524 47593 98228
5639I8228k7269L5968p361j98585j39505R301j1970M4077J44332N3809K0963j1884
$$ 98228 70959 106927 99566 -99019 -238524 -229223 -241193 -197116 -52784 1025 21988 10104
5627A0104J2478m0325N9697P5167L847j03612L0116N1910R4841N7612j15723j10058
$$ 10104 22582 -17743 41954 117121 120968 17356 47472 99382 194223 251835 136112 26054
5615B6054l6752n1974p0683o6107l5725J52760J74288k8539n3596m4124K9008
$$ 26054 -10698 -62672 -133355 -199462 -235187 -82427 91861 63322 9726 -34398 -5390
5604e390L5374m570k8486o7455j14399J7519J78838J1455k5790O2760M0174j27642
$$ -5390 29984 25414 -3072 -70527 -184926 -167407 11431 22886 -2904 59856 100030 -27612
5592b7612r6097j2257Q7540r952J03990k4983J867P2661o7953O8549L8275j28083
$$ -27612 -123709 -135966 -48426 -58378 45612 20629 22496 95157 27204 95753 134028 5945
5580E945o4416N0200J41210K0598q1250p724N288m5406Q2376N7081n4297p9860
$$ 5945 -58471 -8271 132939 153537 72287 64563 69851 24445 106821 163902 109605 29745
5568B9745r6163r1375l1136J31514J32352j4765N0049r4649o8322M781L6726O1564
$$ 29745 -66418 -157793 -188929 -57415 74937 60172 110221 15572 -52750 -47969 -11243 50321
5556E0321R3002r0515m4473M5961k5666n4340O5995k9651j59198m1570J6492L1492
$$ 50321 143323 52808 8335 54296 28630 -25710 40285 10634 -148564 -190134 -173642 -142150
5544a42150o3296J1073P2733O0700R5731J2198Q6060J0983j30480j02401N3988
$$ -142150 -205446 -194373 -121640 -60940 34791 46989 133049 144032 13552 -88849 -34861
5533c4861P9466k0995j50601l7697L8444R1429J7666p4757k5283r7245L3147J19905
$$ -34861 44605 23610 -126991 -164688 -126244 -34815 -17149 -91906 -117189 -214434 -181287 -61382
5521f1382j9981M2187k537O2122J51408j9162o4382j12785m6856J66759J20412
$$ -61382 -81363 -39176 -41713 20409 171817 152655 88273 -24512 -71368 95391 215803
5510B15803J2114j11764r3689J29734L1024K6218j08179j59156j8550J00324p867
$$ 215803 227917 116153 22464 152198 183222 209440 101261 -57895 -76445 23879 16012
5499A6012K8644P1736k3929r932J3898j27518o0445N2139J30051N4773k2600j16263
$$ 16012 44656 116392 92463 82531 96429 -31089 -91534 -39395 90656 145429 122829 6566
5487F566p4507m712N4912R7697n6920n7551P9942P2944j04234l8243J08055m4655
$$ 6566 -67941 -72653 -17741 79956 23036 -34515 45427 118371 14137 -24106 83949 39294
5475C9294j45367j79398p4465N9103P2709M1693O7176L493k4108J01891J05598
$$ 39294 -106073 -285471 -359936 -300833 -228124 -186431 -119255 -115762 -139870 -37979 67619
5464F7619l2448K217j6443O7009n6728J32268J48577L987j20462j08705l8550
$$ 67619 35171 37388 20945 87954 31226 163494 312071 316058 195596 86891 48341
5453D8341k9946j26876N3833J64087j557l9021l801m8314k1006M6664Q8993l9682
$$ 48341 18395 -108481 -54648 109439 107882 68861 65060 16746 -4260 42404 131397 91715
5441I1715m5221j8029J5005j5666m2931r1043n4597N9025R1861J23602M6272r0610
$$ 91715 46494 28465 43470 27804 -15127 -106170 -160767 -101742 -9881 113721 159993 69383
5429F9383K0924j16383q3146k781L2430k1153K5066n8507L1923q2775O5349r40
$$ 69383 90307 -26076 -109222 -112003 -79573 -100726 -75660 -134167 -102244 -185019 -119670 -120610
5417a20610K8279R277L9710J16941j3587j13715j92850k32743Q7752J90118J0782
$$ -120610 -92331 -83054 -43344 73597 60010 -53705 -246555 -479298 -391546 -201428 -190646
5406a90646L6532J00879j9749O5291p6891l2800Q968N6818J5721J7471O4342K3704
$$ -190646 -154114 -53235 -72984 -7693 -84584 -117384 -108416 -51598 -35877 -18406 45936 69640
5394F9640L7791n4664m6018q5941p3166K9934J9393l5695Q607m4268J2813j78976
$$ 69640 107431 52767 6749 -79192 -152358 -122424 -103031 -138726 -130119 -174387 -161574 -340550
5382c40550m189K20002J63666L4723k9182k460M7867R0238K7910j21813j33090
$$ -340550 -344739 -124737 38929 73652 44470 42010 89877 180115 208025 86212 -46878
5371d6878K0660j0770q9464j03571J14968O1001O2800l0432Q2016j9943o8641
$$ -46878 -26218 -36988 -126452 -230023 -115055 -54054 8746 -21686 60330 40387 -28254
5360b8254q0491J24242M2460j15518Q488J27978K812k4263K20593l3941k09209
$$ -28254 -108745 15497 57957 -57561 -49073 78905 81717 57454 278047 244106 34897
5349C4897J3412K1536k3168K4415l1875J014q4356p9985j6805N8343L0897N8028
$$ 34897 48309 69845 46677 71092 39217 40231 -44125 -124110 -140915 -82572 -51675 6353
5337F353Q2777o7859l3293r8015J5697j3968n3645R7935N4772K974m8145j25866
$$ 6353 89130 21271 -12022 -110037 -94340 -108308 -161953 -64018 -9246 -6272 -54417 -180283
5325a80283L1538M0299j7531r1844J8930O9653J1510l8068N3968N143j6174O3434
$$ -180283 -148745 -108446 -125977 -217821 -198891 -129238 -117728 -155796 -101828 -96685 -112859 -49425
5313d9425K5929J4053o8790J363P8763N6489O6445k1730P7789L4737j02947r4736
$$ -49425 -23496 -9443 -78233 -76870 1893 58382 124827 103097 180886 215623 112676 17940
5301A7940m0535l5101M0534K5267j5852l9486K6078Q5505n1152N8099Q9252r1972
$$ 17940 -22595 -57696 -17162 8105 -7747 -47233 -21155 64350 13198 71297 160549 68577
5289F8577m2694J3175p4999n3775j8445n2349N4696J22356n6291k6557J03600
$$ 68577 25883 39058 -35941 -89716 -108161 -160510 -105814 16542 -39749 -66306 37294
5278C7294j6372P5199k0527j34547K0596k9683o9713R292M187j1534p3879O8862
$$ 37294 20922 96121 75594 -58953 -38357 -68040 -137753 -128461 -124274 -135808 -209687 -140825
5266a40825n585K3577m127J14178K9526L5716j215j25452J6174P5541k3613o7824
$$ -140825 -146410 -122833 -126960 -12782 16744 52460 51245 -74207 -58033 17508 -6105 -73929
5254g3929N8835j2408j5366l0628p80J34920j1134p2595j21154K8372L2044J0424
$$ -73929 -15094 -27502 -42868 -73496 -74276 60644 49510 -23085 -144239 -115867 -83823 -73399
5242g3399N5928j467l9177l3494P2717k9109P3890P1708R9500m0970n9420p7422
$$ -73399 -17471 -18938 -58115 -91609 -18892 -48001 25889 97597 197097 156127 96707 19285
5230A9285L381p3616j3102M3365M9215p5320q0978Q0639K1276q422n0649N6702
$$ 19285 22666 -50950 -64052 -20687 28528 -46792 -127770 -47131 -25855 -34277 -84926 -28224
5218b8224Q2704o2891q5246J09626J6011m6589j9597q1007n201J15607j3782J2407
$$ -28224 54480 -8411 -93657 15969 31980 -14609 -34206 -115213 -120414 -4807 -18589 -6182
5206f182k8533m7785J11078K2794k3598M422n8329N4241L1441L3458l2329l9665
$$ -6182 -34715 -82500 28578 51372 27774 32196 -26133 28108 59549 93007 60678 21013
5194B1013O1631n9916o6225n3198j7572J19435J67m8740q6310P8033N1617m6618
$$ 21013 82644 22728 -43497 -96695 -114267 5168 5335 -43405 -129715 -51682 -65 -46683
5182d6683j90288P8777P5547Q3448L6554L6114j0008k7090m8001m9843J14945
$$ -46683 -236971 -158194 -82647 801 37355 73469 63461 36371 -11630 -61473 53472
5171E3472l1662p5687n1437j6550L7411R1933R6197J23532r8834o8157L7313l9692
$$ 53472 21810 -53877 -105314 -121864 -84453 7480 103677 227209 128375 60218 97531 57839
5159E7839o8506o9554L0507J28980J48789j63291j12815R9301N0666r3015k003
$$ 57839 -10667 -80221 -49714 79266 228055 64764 -48051 51250 101916 8901 6898
5148F898J4317L5588J72687p219j2913M0225j0332r750P728k841j31799p5408
$$ 6898 21215 56803 229490 222271 209358 249583 239251 229501 237229 234388 102589 27181
5136B7181p8441n0718Q0288R8111j39940r8847O6773K31069P7742k4507p8051
$$ 27181 -51260 -101978 -21690 76421 -63519 -162366 -95593 135476 213218 188711 110660
5125A10660k52721n521P8056K6039J25269p942j27330k6860k2658L0672O8190
$$ 110660 -142061 -147582 -69526 -43487 81782 73840 -53490 -80350 -103008 -72336 -4146
5114d146Q4109m7167m1492o126P405k7622j00914M7562J49829M2147l1487j00631
$$ -4146 79963 32796 -8696 -14822 -7417 -35039 -135953 -88391 61438 103585 72098 -28533
5102b8533o8952Q9606p719J5666O0076l3338M9911K0582j25848k7746J1453Q368
$$ -28533 -97485 -7879 -15598 68 60144 26806 76717 97299 -28549 -56295 -44842 -36474
5090c6474P5383p3536p1613p833O0739n317l6089q5684N6569K07984J19463j2953
$$ -36474 38909 -34627 -106240 -114073 -53334 -58651 -94740 -180424 -123855 84129 203592 190639
5078A90639J6822n6872n5712l7411m9827p9697N0589M9650q835R4355j2M7384
$$ 190639 207461 150589 94877 57466 7639 -72058 -21469 28181 19346 113701 113689 161073
5066A61073L651r4520m9123n2657m8637K6578J7078K7582J085P5608P6314r7863
$$ 161073 164724 70204 21081 -31576 -80213 -53635 -36557 -8975 -7890 67718 144032 46169
5054D6169m8972J3241j953l677n0458m1500n7104j6168J58662J06621L7744K0610
$$ 46169 -2803 10438 8485 4808 -45650 -87150 -144254 -160422 -1760 104861 142605 163215
5042A63215q5264m3072N9647N6477o7676J8178p0078k7701N8843J64271p8834
$$ 163215 77951 34879 94526 151003 83327 101505 31427 3726 62569 226840 148006
5031A48006n9691m3989k7770P8506P5566j9852j4630m4301l6713l845k9565m3154
$$ 148006 88315 44326 16556 95062 170628 150776 136146 91845 55132 51287 21722 -21432
5019b1432R0149P0266j9368l2657M744K8803o9215K6694M9859p5086K1769m893
$$ -21432 68717 138983 119615 86958 91702 120505 51290 77984 127843 52757 74526 69633
5007F9633r5292o5389k8086m4093k8474P3711j6648Q927J10215L490k5581J8104
$$ 69633 -25659 -91048 -119134 -163227 -191701 -117990 -134638 -125711 -15496 -12006 -37587 -19483
4995a9483J39611M560m4956k5687N2554n7452N6212l1966r1533j072M6670o6633
$$ -19483 120128 124688 79732 54045 106599 49147 105359 73393 -18140 -19212 27458 -39175
4983c9175N8237K4917j30913m5899J01970O6855m9906m0286q505P0792P736L0869
$$ -39175 19062 43979 -86934 -132833 -30863 35992 -13914 -54200 -62705 8087 15823 46692
4971D6692j3542o6192j5384O7218M2519O1884j4361P820k6445L08k5121p913l2673
$$ 46692 33150 -33042 -48426 18792 61311 123195 108834 116654 90209 90517 65396 57483 24810
4958B4810J5841J03741J1312n3200o3371j34811o343J8915N3001o451o7230N7665
$$ 24810 40651 144392 155704 102504 39133 -95678 -102021 -83106 -30105 -36556 -103786 -46121
4946d6121Q0277L12L287j02496q9948M1338J4997o7255M2896M1021m5810J18687
$$ -46121 34156 34468 37755 -64741 -154689 -113351 -98354 -165609 -122713 -81692 -127502 -8815
4934h815J20112j3392K9134p5307N4489P9585j04829j54963o1874k3110Q5951
$$ -8815 111297 97905 127039 51732 106221 185806 80977 -73986 -135860 -158970 -73019
4923g3019J27969n1092m5549o568j7270Q0936j7248q2128J1468J87501Q2861k0353
$$ -73019 54950 3858 -41691 -48259 -65529 15407 -1841 -83969 -72501 115000 197861 177508
4911A77508m7453l6613J3023j0043q5731M6816K3463J8196l0206j997j49722r3006
$$ 177508 130055 93442 106465 96422 10691 57507 80970 99166 68960 66963 -82759 -175765
4899a75765Q9569J63995m762j5956K0733j43442q9051K5799M2071k5475M4176
$$ -175765 -86196 77799 73037 57081 77814 -65628 -154679 -128880 -86809 -112284 -68108
4888f8108k899q147j7624m4746L4793k5090J46060J19745r1426j73165q0763j9277
$$ -68108 -71007 -79154 -96778 -141524 -106731 -131821 14239 133984 42558 -130607 -211370 -230647
4876b30647P4937J69596O1621j25904j19079p1670o1344J9216M6566J4018J47485
$$ -230647 -155710 13886 75507 -50397 -169476 -241146 -302490 -283274 -236708 -222690 -75205
4865g5205L4862l969J1157P0943R3721q7289o4302m727k9218P0416n8326q4347
$$ -75205 -40343 -44312 -33155 37788 131509 44220 -20082 -24809 -54027 16389 -41937 -126284
4853a26284m5357n4103j8218J7525M8154J72368P7400K5777k6020o123J945o0952
$$ -126284 -171641 -225744 -243962 -226437 -178283 -5915 71485 97262 71242 65119 67064 6112
4841F112j84018k6430k9875M0768J59066P97n2791P1245M0589M5534k5276q8009
$$ 6112 -177906 -204336 -234211 -193443 -34377 -33580 -86371 -15126 25463 70997 45721 -42288
4829d2288r8834k2215Q6766J7694j6979J2363n3914N0295N0579j39609J1338J7173
$$ -42288 -141122 -163337 -76571 -58877 -75856 -63493 -117407 -67112 -16533 -156142 -144804 -127631
4817a27631J5708N3204j4130M9154L3215l5034n5559r544j8145K4356L0836J7815
$$ -127631 -111923 -58719 -72849 -23695 9520 -25514 -81073 -90617 -108762 -84406 -53570 -35755
4805c5755P6186M6322L4620L0113l0563p3323n8948N3114J14748n9332j13480
$$ -35755 40431 86753 121373 151486 120923 47600 -11348 41766 156514 97182 -16298
4794a6298l0765O6483J3229L176M2706l5734J9444K7273P0011k9262P346K799
$$ -16298 -47063 19420 32649 35825 78531 42797 62241 89514 159525 130263 137609 140408
4782A40408j00786p3952N0994M1825l8477K4840r8419j20884p2961M0906M5606
$$ 140408 39622 -34330 16664 58489 20012 44852 -53567 -174451 -247412 -206506 -160900
4771a60900K4801J04498k4005Q6618K5362o3835m9236L1551J28156M5280j41127
$$ -160900 -136099 -31601 -55606 31012 56374 -7461 -56697 -25146 103010 148290 7163
4760G163j169M9971j10186m3854N2449m0984o3371J57318J2686O2609O4240m0039
$$ 7163 5994 55965 -54221 -98075 -45626 -86610 -149981 7337 20023 82632 146872 106833
4748A06833j09913j4520l4677q5028J21374O4172q357l6803n595p8994q0466M815
$$ 106833 -3080 -17600 -52277 -137305 -15931 48241 39884 3081 -2514 -81508 -161974 -157159
4736a57159J6112R4134J65289r9665m5004P2577O1694o9317P65l3234Q5609L0636
$$ -157159 -141047 -46913 118376 18711 -26293 46284 107978 38661 39426 6192 91801 122437
4724A22437n8899k0443m7689L6527J12757R376L4694r3747k05505r213J669k1944
$$ 122437 63538 43095 -4594 31933 144690 154066 188760 95013 -110492 -119705 -118036 -139980
4712a39980O6310R5774o7322n7331m0543J5027K4316O6095r4811j3036J35910
$$ -139980 -73670 22104 -45218 -102549 -143092 -128065 -103749 -37654 -132465 -145501 -9591
$$ [...]
##END NTUPLES=NMR SPECTRUM
##END=
