##TITLE=Analysis number 312465
Compound Code cc 15701
Book Reference 397/60/5
Project Code adrs
Chemist Name brucer
##JCAMPDX= 6.0         $$ Bruker NMR JCAMP-DX V2.0
##DATA TYPE= NMR SPECTRUM
##DATA CLASS= NTUPLES
##ORIGIN= Bruker BioSpin GmbH
##OWNER= NMR
$$ XWIN-NMR		Version 3.5
$$ Thu Aug  4 14:57:49 2005 GMT Daylight Time (UT+1h)  MAYBRIDGE\NMR@NMR_250MHZ
##.OBSERVE FREQUENCY= 250.131544655141
##.OBSERVE NUCLEUS= ^1H
##.ACQUISITION MODE= SIMULTANEOUS (DQD)
##.ACQUISITION SCHEME= undefined
##.AVERAGES= 16
##.DIGITISER RES= 18
##SPECTROMETER/DATA SYSTEM= dpx250
##.PULSE SEQUENCE= zg30
##.SOLVENT NAME= DMSO
##.SHIFT REFERENCE= (INTERNAL, DMSO, 0, 16.522)
##AUDIT TRAIL= $$ (NUMBER, WHEN, WHO, WHERE, WHAT)
$$ ##TITLE= Audit trail, XWIN-NMR		Version 3.5
$$ ##JCAMPDX= 5.01
$$ ##ORIGIN= Bruker BioSpin GmbH
$$ ##OWNER= NMR
$$ C:\u/data/dgb/nmr/ADRS/7160/pdata/1/auditp.txt
$$ ##AUDIT TRAIL=  $$ (NUMBER, WHEN, WHO, WHERE, WHAT)
(   1,<2005-08-04 14:57:30.42 +100>,<MAYBRIDGE\NMR>,<NMR_250MHZ>,
      <created by zg, POWCHK disabled, PULCHK disabled
       configuration hash MD5:
       62 19 C7 07 E1 42 D1 B7 37 6C 3D D0 77 39 F9 E6
       data hash MD5: 64K
       D7 B1 73 CF 3A B4 11 02 E9 D4 26 43 0C C6 7D C2>)
(   2,<2005-08-04 14:57:41.40 +100>,<MAYBRIDGE\NMR>,<NMR_250MHZ>,
      <Start of raw data processing
       ef LB = 0.3 FT_mod = 6 PKNL = 1 SI = 32K 
       data hash MD5: 32K
       0C 39 80 A3 08 39 83 F1 1A 87 97 48 B6 3B 05 45>)
(   3,<2005-08-04 14:57:43.42 +100>,<MAYBRIDGE\NMR>,<NMR_250MHZ>,
      <apk 
       data hash MD5: 32K
       47 55 44 4D 34 3D 13 4D E9 B9 F0 8F A3 E4 55 57>)
(   4,<2005-08-04 14:57:44.18 +100>,<MAYBRIDGE\NMR>,<NMR_250MHZ>,
      <abs ABSG = 5 
       data hash MD5: 32K
       AA 65 4D AC 66 13 6A AC E0 45 5D A9 FE 66 05 E4>)
$$ ##END=
$$ 
$$ hash MD5
$$ 99 9B 33 F8 06 40 1E 1C ED CA 23 7F DB A1 11 9D
##$RELAX= 
##$RELAX= 
##$RELAX= 
##$RELAX= 
##$RELAX= 
##$RELAX= 
##$RELAX= 
$$ Bruker specific parameters
$$ --------------------------
##$DU= <C:\u>
##$EXPNO= 7160
##$NAME= <ADRS>
##$PROCNO= 1
##$TYPE= <nmr>
##$USER= <dgb>
##$AMP= (0..31)
100 100 100 100 100 100 100 100 100 100 100 100 100 100 100 100 100 100 
100 100 100 100 100 100 100 100 100 100 100 100 100 100 
##$AQSEQ= 0
##$AQ_mod= 3
##$AUNM= <au_zg>
##$AUTOPOS= <36 >
##$BF1= 250.13
##$BF2= 250.13
##$BF3= 250.13
##$BF4= 250.13
##$BF5= 500.13
##$BF6= 500.13
##$BF7= 500.13
##$BF8= 500.13
##$BYTORDA= 1
##$CFDGTYP= 0
##$CFRGTYP= 5
##$CHEMSTR= <none>
##$CNST= (0..31)
1 1 145 1 1 1 1 1 1 1 1 1 1 1 1 1 1 1 1 1 1 1 1 1 1 1 1 1 1 1 1 1 
##$CPDPRG= <>
##$CPDPRG1= <>
##$CPDPRG2= <>
##$CPDPRG3= <>
##$CPDPRG4= <mlev>
##$CPDPRG5= <mlev>
##$CPDPRG6= <mlev>
##$CPDPRG7= <mlev>
##$CPDPRG8= <mlev>
##$CPDPRGB= <>
##$CPDPRGT= <>
##$D= (0..31)
0 1 0 0 0 0 0 0 0 0.06 0 0 0 0 0 0 0.0002 0 0 0 0 0 0 0 0 0 0 0 0 0 0 
0 
##$DATE= 1123163849
##$DBL= (0..7)
120 120 120 120 120 120 120 120 
##$DBP= (0..7)
150 150 150 150 150 150 150 150 
##$DBP07= 0
##$DBPNAM0= <>
##$DBPNAM1= <>
$$ [...]
##$SUBNAM7= <"">
##$SUBNAM8= <"">
##$SUBNAM9= <"">
##$SW= 20.6930455092707
##$SWIBOX= (0..15)
0 0 3 0 0 0 0 0 0 0 0 0 0 0 0 0 
##$SW_h= 5175.983436853
##$TD= 65536
##$TD0= 1
##$TE= 296.16
##$TE2= 300
##$TE3= 300
##$TEG= 300
##$TL= (0..7)
0 120 120 120 120 120 120 120 
##$TP= (0..7)
150 150 150 150 150 150 150 150 
##$TP07= 0
##$TPNAME0= <>
##$TPNAME1= <>
##$TPNAME2= <>
##$TPNAME3= <>
##$TPNAME4= <>
##$TPNAME5= <>
##$TPNAME6= <>
##$TPNAME7= <>
##$TPOAL= (0..7)
0.5 0.5 0.5 0.5 0.5 0.5 0.5 0.5 
##$TPOFFS= (0..7)
0 0 0 0 0 0 0 0 
##$TUNHIN= 0
##$TUNHOUT= 0
##$TUNXOUT= 0
##$USERA1= <user>
##$USERA2= <user>
##$USERA3= <user>
##$USERA4= <user>
##$USERA5= <user>
##$V9= 5
##$VALIST= <valist>
##$VCLIST= <CCCCCCCCCCCCCCC>
##$VD= 0
##$VDLIST= <DDDDDDDDDDDDDDD>
##$VPLIST= <PPPPPPPPPPPPPPP>
##$VTLIST= <TTTTTTTTTTTTTTT>
##$WBST= 1024
##$WBSW= 4
##$XGAIN= (0..3)
0 0 0 0 
##$XL= 0
##$YL= 0
##$YMAX_a= 360673
##$YMIN_a= -351295
##$ZGOPTNS= <>
##$ZL1= 120
##$ZL2= 120
##$ZL3= 120
##$ZL4= 120
##$ABSF1= 16.522
##$ABSF2= -4.171173
##$ABSG= 5
##$ABSL= 3
##$ALPHA= 0
##$AQORDER= 0
##$ASSFAC= 0
##$ASSFACI= 0
##$ASSFACX= 0
##$ASSWID= 0
##$AUNMP= <proc_1d>
##$AZFE= 0.1
##$AZFW= 0.1
##$BCFW= 0
##$BC_mod= 0
##$BYTORDP= 0
##$COROFFS= 0
##$CY= 12.5
##$DATMOD= 1
##$DC= 0
##$DFILT= <>
##$DTYPP= 0
##$F1P= 14.0000005364418
##$F2P= -0.99999901652339
##$FCOR= 0.5
##$FTSIZE= 32768
##$FT_mod= 6
##$GAMMA= 0
##$GB= 0
##$INTBC= 1
##$INTSCL= 1
##$ISEN= 128
##$LB= 0.3
##$LEV0= 0
##$LPBIN= 0
##$MAXI= 10000
##$MC2= 0
##$MEAN= 0
##$ME_mod= 0
##$MI= 0
##$NCOEF= 0
##$NC_proc= -2
##$NLEV= 6
##$NOISF1= 0
##$NOISF2= 0
##$NSP= 0
##$NTH_PI= 0
##$NZP= 0
##$OFFSET= 16.522
##$PC= 1
##$PHC0= -92.72632
##$PHC1= 12.0063
##$PH_mod= 1
##$PKNL= yes
##$PPARMOD= 0
##$PSCAL= 4
##$PSIGN= 0
##$REVERSE= no
##$SF= 250.13
##$SI= 32768
##$SIGF1= 0
##$SIGF2= 0
##$SINO= 400
##$SIOLD= 32768
##$SREGLST= <1H.DMSO>
##$SSB= 0
##$STSI= 32768
##$STSR= 0
##$SW_p= 5175.98343685301
##$SYMM= 0
##$S_DEV= 0
##$TDeff= 65536
##$TDoff= 0
##$TI= <Analysis number 999999
Compound Code 99
Book Reference 9
Project Code 9>
##$TILT= no
##$TM1= 0
##$TM2= 0
##$TOPLEV= 0
##$USERP1= <user>
##$USERP2= <user>
##$USERP3= <user>
##$USERP4= <user>
##$USERP5= <user>
##$WDW= 1
##$XDIM= 32768
##$YMAX_p= 278507063
##$YMIN_p= -325958
$$ End of Bruker specific parameters
$$ ---------------------------------
##NTUPLES= NMR SPECTRUM
##VAR_NAME=  FREQUENCY,     SPECTRUM/REAL,   SPECTRUM/IMAG
##SYMBOL=    X,             R,               I
##VAR_TYPE=  INDEPENDENT,   DEPENDENT,       DEPENDENT
##VAR_FORM=  AFFN,          ASDF,            ASDF
##VAR_DIM=   32768,         32768,           32768
##UNITS=     HZ,            ARBITRARY UNITS, ARBITRARY UNITS
##FACTOR=    0.157963299565203, 1,           1
##FIRST=     4132.6476996994, 0,             0
##LAST=      -1043.33573715361, 0,           0
##MIN=       -1043.33573715361, -325958,     0
##MAX=       4132.6476996994, 278507063,     0
$$ Real data points
##PAGE= N=1
##DATA TABLE= (X++(R..R)), XYDATA
$$ [...]
16020i137j0667j343J3517L883p68L648j0144Q827O556m381N100J3560m039j5160
$$ -9137 -19804 -21147 -7630 -3747 -4515 -867 -11011 -2184 4372 -9 5091 18651 14612 -548
16006e48J4538R752m835q02o774J271O081j3660q007j3513K540L023O206J599
$$ -548 13990 23742 18907 18105 11331 12602 18683 5023 -2984 -16497 -13957 -10934 -4728 -3129
15992c129p789l393j8199M289K4806J1582J966O165m349m431m096R04J4142r871
$$ -3129 -10918 -14311 -32510 -28221 -3415 8167 10133 16298 11949 7518 3422 4326 18468 8597
15978H597j3919p717L604R750J0923j4516j4011O851j4297K211l082j761N449
$$ 8597 -5322 -13039 -9435 315 11238 -3278 -17289 -10438 -24735 -22524 -25606 -27367 -21918
15965b1918J1680J4185J3514M265r917j9246j821J8479N510j5010K786R627J3294
$$ -21918 -10238 3947 17461 21726 11809 -7437 -9258 9221 14731 -279 2507 12134 25428
15952B5428K989j0058k0938L035R746n314j1338j282J3129L96O911K014J446m895
$$ 25428 28417 18359 -2579 456 10202 4888 -6450 -7732 5397 5793 12704 14718 16164 11269
15938A1269n896o310k541l468q395p51J6377L614M416J081m148J0366M153m202
$$ 11269 5373 -937 -3478 -6946 -15341 -16092 285 3899 8315 9396 5248 15614 19767 15565
15924A5565n513p273n959K436J493M77P25J167k894N926J421L151J1297K483q282
$$ 15565 10052 2779 -3180 -744 749 1226 1951 3118 224 6150 7571 10722 22019 24502 16220
15909A6220m416j476l027P690o16Q173K142P27j9178m119L95J758J575k094r909
$$ 16220 11804 10328 7301 14991 14375 22548 24690 25417 6239 2120 2515 4273 5848 3754 -6155
15894f155o541o937K1729J5275j729r275k1500n049J2313J3068J0283j1569n644
$$ -6155 -12696 -19633 2096 17371 15642 6367 -15133 -20182 -7869 5199 15482 3913 -1731
15881a731j780J488j1099q138l869k903J1749J7052P504q315k118L455L653k0557
$$ -1731 -3511 -2023 -13122 -21260 -25129 -28032 -16283 769 8273 -42 -2160 1295 4948 -15609
15867a5609l15L604j2425q689J0915J4597J9862l447r877j2596J0570L729L54
$$ -15609 -15924 -12320 -24745 -33434 -22519 -7922 11940 8493 -1384 -13980 -3410 319 673
15854F73J7154J3846j0809j0480j0233M808O764q743J5962l147j5273l190m795
$$ 673 17827 31673 20864 10384 151 4959 11723 2980 18942 15795 522 -2668 -7463
15841g463J3057L504K744j0002j9204j1987P729J6776K3350M604j2626o471Q087
$$ -7463 5594 9098 11842 1840 -17364 -29351 -21622 -4846 18504 23108 10482 4011 12098
15828A2098L921p111o071j385J3450J028k985K054q065L441o729J299n715q087
$$ 12098 16019 8908 2837 1452 14902 15930 12945 14999 6934 10375 3646 4945 -770 -8857
15814h857q090J5134q931j4403M04J7961K3377J0185j474M196q266j0697j2926
$$ -8857 -16947 -1813 -10744 -25147 -24743 -6782 16595 26780 25306 29502 21236 10539 -2387
15801b387r319O10J6099k800J229j0958N601K4718M104j8739j4752K753P41M739
$$ -2387 -11706 -11096 5003 2203 3432 -7526 -1925 22793 26897 8158 -6594 -3841 -3100 1639
15787A639J2864J661p790o689J999M983J6973o147r145J2091m006q224p397n834
$$ 1639 14503 16164 8374 1685 3684 8667 25640 19493 10348 22439 18433 10209 2812 -3022
15773c022l857K622Q860n426j3296P779J8662q08q648j6352j9115J220P164R710
$$ -3022 -6879 -4257 4603 -823 -14119 -6340 12322 11514 2866 -13486 -32601 -31381 -24217 -14507
15759a4507p15N994J4267j906j0981Q046J4520K4558K0628K7186O0637Q4802J59925
$$ -14507 -15222 -9228 5039 3133 -7848 198 14718 39276 59904 87090 147727 232529 392454
15746C92454K04201R8334o4588j26964j39270j21306p3946m9781l0043q386j7409
$$ 392454 596655 694989 630401 503437 364167 242861 168915 119134 89091 80705 63296
15735F3296j8832j2675j9891L658l369k445K777N944k055k0652j3532j3539k166
$$ 63296 44464 31789 11898 15556 12187 9742 12519 18463 16408 -4244 -17776 -31315 -33481
15722c3481k41M477P121q464j901J8159J8635J5765O663J0713q835q288J587j9748
$$ -33481 -33722 -29245 -22124 -30588 -32489 -14330 4305 20070 26733 37446 28611 20323 21910 2162
15708B162j801J6642j1097j0338k030m94N35j3662k195L520N531o538m9r20J4372
$$ 2162 361 17003 5906 -4432 -6462 -6956 -6421 -20083 -22278 -18758 -13227 -19765 -19814 -20734 -6362
15693f362n615J5894k898k0801L15J9908L908L197R495j4464j8005q969q618M432
$$ -6362 -11977 3917 1019 -19782 -19467 441 4349 7546 17041 2577 -15428 -24397 -33015 -28583
15679b8583m394j2074J9384K0563j961O136k878j7564P457O348K319L368J9305
$$ -28583 -32977 -45051 -25667 -5104 -7065 -929 -3807 -21371 -13914 -7566 -5247 -1879 17426
15666A7426N567j3702n060q000o117L480P951Q462p081r306k128R719j045R830
$$ 17426 22993 9291 4231 -3769 -9886 -6406 1545 10007 2926 -6380 -8508 1211 166 9996
15652I996L867j0323j5295l086o762R62J8710%J3091n784O62p974L78k026J4132
$$ 9996 13863 3540 -11755 -14841 -21603 -20641 -1931 -1931 11160 5376 6038 -1936 -1558 -3584 10548
15637A0548j461j2815n077K3209O597p695Q459n875p471Q182j214j4513r181r495
$$ 10548 9087 -3728 -8805 14404 21001 13306 21765 15890 8419 16601 15387 874 -8307 -17802
15623a7802J2827j705l341M880P417l518n262o787o528m792M074K682Q604J0164
$$ -17802 -4975 -6680 -10021 -5141 2276 -1242 -6504 -13291 -19819 -24611 -20537 -17855 -9251 913
15609I13K799r461q034L666P638j854J6855K297Q89J993j5295j0506l230M746
$$ 913 3712 -5749 -13783 -10117 -2479 -4333 12522 14819 15708 17701 2406 -8100 -11330 -6584
15595f584j196J1000o623j637L532R052O001j0665l108L483J6800P54P1j016m748
$$ -6584 -7780 3220 -3403 -5040 -1508 7544 13545 2880 -228 3255 20055 20809 20880 19864 15116
15580A5116j7334o713P559Q022l086K222K363K118j5899N896k870r766O47j2786
$$ 15116 -2218 -8931 -1372 6650 3564 5786 8149 10267 -5632 264 -2606 -12372 -11725 -24511
15566b4511o011J1068K2923J0726J3366J161o28j870j662j4539j2411M867m43
$$ -24511 -30522 -19454 3469 14195 27561 28722 28094 26224 24562 10023 -2388 2479 2036
15553B036J2601J4369P728j6951o418k044p086m188j238L525Q539L597r843Q21
$$ 2036 14637 29006 36734 19783 13365 11321 4235 47 -1191 2334 10873 14470 4627 5448
15539E448j201m074j3941j2626J5308K7721L770j3102j2667p666n585m803N303
$$ 5448 4247 173 -13768 -26394 -11086 16635 20405 7303 -5364 -13030 -18615 -23418 -18115
15526a8115J319O220M41j5993K6585J9662n953Q05j0102j6016p952P657j005Q082
$$ -18115 -16796 -10576 -10135 -26128 457 20119 14166 14971 4869 -11147 -19099 -11442 -12447 -4365
15512d365R159k1434J5303K8508J4468j3363p336k4150p134J6502N363N129n982
$$ -4365 4794 -16640 -1337 27171 41639 28276 20940 -3210 -10344 6158 11521 16650 10668
15499A0668M962k031p967j0473o859P76R874K812q499N124q427j2062m520J7799
$$ 10668 15630 13599 5632 -4841 -11700 -10924 -1050 1762 -6737 -1613 -10040 -22102 -26622 -8823
15485h823J7280j9586n560R400j0441m684J657P187J3436J166P129J1225K236
$$ -8823 8457 -11129 -16689 -7289 -17730 -22414 -20757 -13570 -134 1032 8161 19386 21622
15472B1622j9690r942l706R193O057p969J3239K2195j1107q983m940r647J714
$$ 21622 1932 -8010 -11716 -2523 3534 -4435 8804 30999 19892 10909 5969 -3678 -1964
15459a964n404j9355m32j3769j0292J7540J6405q303p326J1435O826P794m028
$$ -1964 -7368 -26723 -27155 -40924 -51216 -33676 -17271 -25574 -32900 -21465 -14639 -6845 -10873
15446a0873J3201J1008p102j3687j0787p934K2694K0969K341q787k103Q463L455
$$ -10873 2328 13336 6234 -7453 -18240 -26174 -3480 17489 19830 11043 8940 17403 20858
15433B0858j2945o402n083N819R253L191m395q253r505p816k916Q475R06j3395
$$ 20858 7913 1511 -3572 2247 11500 14691 10296 2043 -7462 -15278 -18194 -9719 -8813 -22208
15419b2208l835P324l116K798K756L459M024K729r12n60k188j0452k520n715M905
$$ -22208 -26043 -18719 -21835 -19037 -16281 -12822 -8798 -6069 -6981 -7541 -9729 -20181 -22701 -28416 -23511
15404b3511m654J653K1069J1920P577n662j617Q982k4j4205k44m82n803j1775
$$ -23511 -28165 -26512 -5443 6477 14054 8392 6775 15757 15733 1528 1284 802 -5001 -16776
15390a6776P047p183J740q460Q184J3555l172j2355j2117m982J531J4261p60k131
$$ -16776 -9729 -16912 -15172 -23632 -15448 -1893 -5065 -17420 -29537 -34519 -32988 -18727 -19487 -21618
15376b1618K5660R370j4259j6961R141J9670m729j4906P59J1088n408j7923o62
$$ -21618 4042 13412 -847 -17808 -8667 11003 6274 -8632 -7873 3215 -2193 -20116 -20778
15363b0778j023M187J0189l450m104L16n023m148J9890Q717j4498N533J4326M457
$$ -20778 -21801 -17614 -7425 -10875 -14979 -14663 -19686 -23834 -3944 4773 -9725 -4192 10134 14591
15349A4591j9853o866j2804r947J4979J6354j094o479R888l877N01O383j0208
$$ 14591 -5262 -12128 -24932 -34879 -19900 -3546 -4640 -11119 -1231 -5108 -4607 1776 -8432
15336h432O91P608Q489n021j5437J3539J2271R685k5995j8238m421o935R327J4227
$$ -8432 -7741 -133 8356 3335 -12102 1437 13708 23393 -2602 -20840 -25261 -32196 -22869 -8642
15322h642O410P768j3247J800K949l292J0361R278l697p201j4477j933N760Q238
$$ -8642 -2232 5536 -7711 -5911 -2962 -6254 4107 13385 9688 2487 -11990 -13923 -8163 75
15308G5K4401j2796k7440L813J3822J0924k475o239r862M191l25J7210N484P694
$$ 75 24476 11680 -15760 -11947 1875 12799 10324 4085 -5777 -1586 -1911 15299 20783 28477
15294B8477P79j1533j6027R562p686o409J8122k559k1682j3693l654R205P737
$$ 28477 29256 17723 1696 11258 3572 -2837 15285 12726 -8956 -22649 -26303 -17098 -9361
15281i361O784K7132k799k3683O964n847K744O595j2504j5790k844k96J5093J1160
$$ -9361 -2577 24555 21756 -1927 5037 -810 1934 8529 -3975 -19765 -22609 -22905 -7812 3348
15267C348K07r181P277O517N552J828r689N374Q260j7818j3948n8J193l782J4190
$$ 3348 3555 -5626 1651 8168 13720 15548 5859 11233 19493 1675 -12273 -12331 -11138 -14920 -730
15252g30j112j1836J2430O116R649n554l785n850j2909o116J7366o772L60r878
$$ -730 -1842 -13678 -1248 4868 14517 8963 5178 -672 -13581 -19697 -2331 -9103 -8743 -18621
15238a8621K593P424N228K4634O573j8581j9917n605r797P99J2109J6175J814
$$ -18621 -16028 -8604 -3376 21258 27831 9250 -10667 -16272 -26069 -25270 -13161 3014 4828
15225D828j037M029k977J839l267j2007j374L705J279R493N023k56q104j8645
$$ 4828 3791 7820 4843 6682 3415 -8592 -9966 -6261 -4982 4511 9534 9278 1174 -17471
15211a7471J0440L294r98l82J269L501o533J0209O846j5963Q118j0465j5161O413
$$ -17471 -7031 -3737 -4735 -5117 -3848 -347 -6880 3329 10175 -5788 2330 -8135 -23296 -16883
15197a6883O082o120n319J0266J8361P241j2279m487m999r19J1244J760M409J0080
$$ -16883 -10801 -16921 -22240 -11974 6387 13628 1349 -3138 -8137 -9056 2188 3948 8357 18437
15183A8437k344j2683l1085r395L124J0647l504r064J1859J2337O721L961N38
$$ 18437 16093 3410 -27675 -37070 -33946 -23299 -26803 -35867 -24008 -11671 -4950 -989 -451
15170d51P57K408p137L596K92j287n797J1789O956q76J5029r246o710m174q695
$$ -451 306 2714 -4423 -827 -535 -1822 -7619 4170 11126 10250 25279 16033 9323 5149 -3546
15155c546m202K0122J7329j3838j544o965j6856j1244P721J7297J596j8856j619
$$ -3546 -7748 12374 29703 15865 14321 7356 -9500 -20744 -13023 4274 5870 -12986 -14605
15142a4605J7698k407n444l497j223R506k227O629l315j5517J2339L380n969j6428
$$ -14605 3093 686 -4758 -8255 -9478 28 -2199 4430 1115 -14402 -2063 1317 -4652 -21080
15128b1080N09J3025J1389p325J1519J7387N255p546j5775j2329O104K21K314
$$ -21080 -20571 -7546 3843 -3482 8037 25424 30679 23133 7358 -4971 1133 1354 3668
15115C668p020M679L629j1396j0137L074k333P500p595r6k419L188R046j309m273
$$ 3668 -3352 1327 4956 -6440 -16577 -13503 -15836 -8336 -15931 -16027 -18446 -15258 -6212 -7521 -11794
15100a1794K084J734o26o815j0696P708O826O959J2589j7187j2640o353q852J898
$$ -11794 -9710 -7976 -8602 -15417 -26113 -18405 -11579 -4620 7969 -9218 -21858 -28211 -37063 -35165
15086c5165P959p529J4373N943j4320M960J1244J4766K325o577r27o681J1531
$$ -35165 -27206 -34735 -20362 -14419 -28739 -23779 -12535 2231 4556 -2021 -2948 -9629 1902
15073A902J115o051k940m908r289m978m576L231R080J0225p337o461N497l573
$$ 1902 3017 -3034 -5974 -10882 -20171 -25149 -29725 -26494 -17414 -7189 -14526 -20987 -15490 -19063
15059a9063L922L542J510N199r2Q044j84J796M464Q77J0637K047j6399j0313m105
$$ -19063 -15141 -11599 -10089 -4890 -4982 3062 2878 4674 9138 10015 20652 22699 6300 -4013 -8118
15044h118N55O877J5869l166k2897j3231k621J5919J52P850j933r735j361o539
$$ -8118 -7563 -686 15183 12017 -10880 -24111 -26732 -10813 -10661 -2811 -4744 -14479 -15840 -22379
15030b2379J0118K1228J5738L853j4842j2657J0847o301o991J2609K0935l657
$$ -22379 -12261 8967 24705 28558 13716 1059 11906 5605 -1386 11223 32158 28501
15018B8501q774r066o073j2729K341M496j422m332M397J0001N61j3783r073Q591
$$ 28501 19727 10661 4588 -8141 -5800 -1304 -2726 -7058 -2661 7340 7901 -5882 -14955 -6364
15004f364L203q966o035k028L633O888j158r52J578r874R43K4235J4863p532k1380
$$ -6364 -3161 -12127 -18162 -20190 -16557 -9669 -10827 -11779 -10201 -20075 -19132 5103 19966 12434 -8946
14989h946r609L943J7653L560k843l214l104m350N387Q835m351j6897J1213R395
$$ -8946 -18555 -14612 3041 6601 3758 544 -2560 -6910 -1523 7312 2961 -13936 -2723 6672
14975F672Q55N29K782k059j320j619M313l507j0447N694j651O835p414j0357K0223
$$ 6672 7527 8056 10838 8779 7459 5840 10153 6646 -3801 1893 242 7077 -337 -10694 9529
14960I529q694l851J254o360j83q777K51J8201O418j3832J325P942p796j0870
$$ 9529 835 -3016 -1762 -8122 -8305 -17082 -16831 1370 7788 -6044 -4719 3223 -4573 -15443
14946a5443N950J3987M714J601n173J979N501j0588l966K231Q914j692j7179l566
$$ -15443 -9493 4494 9208 10809 5636 7615 13116 2528 -1438 793 9707 8015 -9164 -12730
14932a2730k15M650N567l584k907K886R386N525p356n610m082L748J3857k918
$$ -12730 -12945 -8295 -2728 -6312 -9219 -6333 3053 8578 1222 -4388 -8470 -4722 9135 6217
14918F217j0771j895r618j5148K97J2793J6298K0735k953r553J01N251k1176k9886
$$ 6217 -4554 -6449 -16067 -31215 -30918 -18125 -1827 18908 15955 6402 6503 11754 -9422 -39308
14904c9308l525J6125J2117O547L379m695m348l652j456K009j3372J3221J5134
$$ -39308 -42833 -26708 -14591 -8044 -4665 -9360 -13708 -17360 -18816 -16807 -30179 -16958 -1824
14891a824k61k208m013j004q8J4815Q964j036M961M550r301n922N906j9704m576
$$ -1824 -2085 -4293 -8306 -9310 -9398 5417 14381 13345 18306 22856 13555 7633 13539 -6165 -10741
14876a0741j5394J2641J6384J1865K073l294m270k073N435M117N536j254j1936
$$ -10741 -26135 -13494 2890 14755 16828 13534 9264 7191 12626 16743 22279 21025 9089
14863I089J827k61N438j2936L464K793K22m910L07O798j9296K472l969M661J3044
$$ 9089 10916 10655 16093 3157 6621 9414 9636 4726 5033 11831 -7465 -4993 -8962 -4301 8743
14848H743R60j2942p832N673O778O588j3655q507J6772N482o057j3221m613J891
$$ 8743 9703 -3239 -11071 -5398 1380 7968 -5687 -14194 2578 8060 2003 -11218 -15831 -13940
14834a3940J997J3116J3730l669k6446r956L829J630P689J3546j192j5075p169
$$ -13940 -11943 1173 14903 11234 -15212 -25168 -21339 -19709 -12020 1526 334 -14741 -21910
14821b1910L604l624J0594J343j2758j489J1990P713j1885o302J2598O114q928
$$ -21910 -18306 -21930 -11336 -9993 -22751 -24240 -12250 -4537 -16422 -22724 -10126 -4012 -12940
14808a2940K436q097J1537M752j101n82j2690j0961N365J196N087L701j2207J1289
$$ -12940 -10504 -18601 -7064 -2312 -3413 -3995 -16685 -27646 -22281 -21085 -15998 -12297 -24504 -13215
14794a3215J5914j559j2337J418J1822J0987M661o761m822k631l935N897j248
$$ -13215 2699 1140 -11197 -9779 2043 13030 17691 10930 6108 3477 -458 5439 4191
14781D191P064L114p319L416l77j6086p978P515P205l964k053L149j2213j1761
$$ 4191 11255 14369 7050 10466 10089 -5997 -13975 -6460 745 -3219 -5272 -2123 -14336 -26097
14767b6097P445j5225n243P060n337N857R256L309K1052k038L608l465j0480N787
$$ -26097 -18652 -33877 -39120 -32060 -37397 -31540 -22284 -18975 2077 39 3647 182 -10298 -4511
14753d511J2132k0576M944J6419j012n772l311j2312J4930N360l781L041N437
$$ -4511 7621 -12955 -8011 8408 7396 1624 -1687 -13999 931 6291 2510 5551 10988
14740A0988K65N823l620k757m509j3477R071Q550j228q984K306Q293L916j0715
$$ 10988 11253 17076 13456 10699 6190 -7287 1784 10334 9106 122 2428 10721 14637 3922
14726C922l157J66j3901l562n972Q95M861J0871K1439J054j5091K591j235M438
$$ 3922 765 931 -12970 -16532 -22504 -21609 -16748 -5877 15562 16616 1525 4116 2881 7319
14712G319j4799r541J785R256J2080M41O9j0063M618J4113j135m752P102P151
$$ 7319 -7480 -17021 -15236 -5980 6100 6541 6610 -3453 1165 15278 14143 9391 16493 23644
14698B3644q500n697j0089J4197N94j4512n594J7559k448o692L221l463r430o791
$$ 23644 15144 9447 -642 13555 14149 -363 -5957 11602 9154 2462 5683 2220 -7210 -14001
14684a4001J7779M045L200p559n487p320O197Q769l168r57o846j3842J3603J1437
$$ -14001 3778 7823 11023 3464 -2023 -9343 -3146 5623 2455 1498 -5348 -19190 -5587 5850
14670E850j249n59p970j0686L635J1217K0200J7611o611j4073j3006j9661N172
$$ 5850 4601 4042 -3928 -14614 -10979 238 20438 38049 31438 17365 4359 -15302 -10130
14657a0130L123J8544n26k2081r592J2859l613j8168R875J8787m12k783j1077
$$ -10130 -7007 11537 11011 -11070 -20662 -7803 -11416 -29584 -19709 -922 -1334 -4117 -15194
14644a5194j4490M08q96O046J6970J1569K715j9254j201M202l881j0791M758j135
$$ -15194 -29684 -29276 -30172 -24126 -7156 4413 7128 -12126 -13327 -9125 -13006 -23797 -19039 -20174
14630b0174J6769J5388J7972q050j4555j3680R817P02j4138q521L954p396M582
$$ -20174 -3405 11983 29955 21905 7350 -6330 3487 4189 -9949 -18470 -14516 -21912 -17330
14617a7330J6650p864q149l70Q233O503K277J7557J3553j5441j2115m30K618m142
$$ -17330 -680 -8544 -16693 -17063 -8830 -2327 -50 17507 31060 15619 3504 3074 5692 1550
14603A550j5975q339J0714j957M424l172n075N14J823J8658J1221M021j710M02
$$ 1550 -14425 -22764 -12050 -14007 -9583 -12755 -17830 -17316 -15493 3165 14386 18407 16697 17099
14589A7099l926M744j7639k823M35m702l663p467Q08P151K562R26Q223q279k7550
$$ 17099 13173 17917 278 -2545 -2110 -6812 -10475 -17942 -17134 -9983 -7421 -6495 1728 -6551 -34101
14574c4101j198J2761k459J0480Q481K088l124k573J54M51Q649n515m446j2400
$$ -34101 -35299 -22538 -24997 -14517 -6036 -3948 -7072 -9645 -9491 -9040 -391 -5906 -10352 -22752
14560b2752j492J1835L849N538L296J422J9920K4277J93j8138k0237n179j9422
$$ -22752 -24244 -12409 -8560 -3022 274 1696 21616 45893 46086 27948 7711 2532 -16890
14547a6890J6777Q304M815q768M275L884n358n931m570Q640K0754o754l1156r127
$$ -16890 -113 8191 13006 4238 8513 12397 7039 1108 -3462 5178 25932 19178 -11978 -21105
14533b1105J3594r378k0564O243J2861j2491j3412P721O309J2247J1041J0429
$$ -21105 -7511 -16889 -37453 -31210 -18349 -30840 -44252 -36531 -30222 -17975 -6934 3495
14521C495M943J4859o490j6380j1542L407k023n866J9806o338m235P166j4346
$$ 3495 8438 23297 16807 427 -11115 -7708 -9731 -15597 4209 -2129 -6364 802 -13544
14508a3544j3619M829J0630l448k042j4825L968R615J3917P932j2607O462r604
$$ -13544 -27163 -22334 -11704 -15152 -17194 -32019 -28051 -18436 -4519 3413 -9194 -2732 -12336
14495a2336p767K304M305KP868j023P453p71p449j8531L148L708j4650N643Q083
$$ -12336 -20103 -17799 -13494 -13492 -5624 -6647 806 35 -7414 -25945 -22797 -19089 -33739 -28096 -20013
14480b0013j536J6820J6212O038N3J714k8135j9478J0836O031j752R882O271p495
$$ -20013 -21549 -4729 11483 17521 17574 19288 -8847 -28325 -17489 -11458 -13210 -3328 2943 -4552
14466d552m845O725L18K067q519P908j6657Q572J6086m33L84j0048J5875j6138
$$ -4552 -9397 -2672 -2354 -287 -8806 -898 -17555 -8983 7103 6670 7054 -2994 12881 -3257
14452c257j6735O425l106m563J3133L217o847P93k991n750k422o24N970Q449K91
$$ -3257 -19992 -13567 -16673 -21236 -8103 -4886 -11733 -10940 -13931 -19681 -22103 -22727 -16757 -8308 -8017
14437h017J3995L5165N140o277j9279j881m894n609j6466r226q05M60j923J0394
$$ -8017 5978 41143 46283 40006 20727 18846 13952 8343 -8123 -17349 -18154 -17694 -19617 -9223
14423i223J0183m135l596l66r7M191K167N865p931q786J0901P378j5914R855K560
$$ -9223 960 -3175 -6771 -7137 -7234 -3043 -876 4989 -2942 -11728 -827 6551 -9363 492 3052
14408C052m50k3859L739J1038J98M203m86l697P936k401O405N912P465N775K145
$$ 3052 2602 -21257 -17518 -6480 -6282 -2079 -2565 -6262 1674 -727 5678 11590 19055 24830 26975
14393B6975m760j4049J461j3766j5118O568J5081K99m015p882L599k869l400p391
$$ 26975 22215 8166 9627 -4139 -19257 -12689 2392 2691 -1324 -9206 -5607 -8476 -11876 -19267
14379a9267o359k715K92K255J4777n460M658O043m126j153N760j274J473j4028
$$ -19267 -25626 -28341 -28049 -25794 -11017 -16477 -11819 -5776 -9902 -11055 -5295 -6569 -5096 -19124
14365a9124N998j0265L460P317O81R739O201L714q215o569K702L822j617k2459
$$ -19124 -13126 -23391 -19931 -12614 -11933 -2194 4007 7721 -494 -7063 -4361 -539 -2156 -24615
14351b4615L667o242k751J5052K0504J0883n525j825n136o943K822R012n751r124
$$ -24615 -20948 -27190 -29941 -14889 5615 16498 10973 9148 4012 -2931 -109 8903 3152 -5972
14337e972l120n128J1281J3042L424j8924q711l529l636L2534K2522p657k520
$$ -5972 -9092 -14220 -2939 10103 13527 -5397 -14108 -17637 -21273 11261 33783 26126 23606
14324B3606l486J660j2511j8464j2777O739n212j358J6572K5793j789j4060J881
$$ 23606 20120 21780 9269 -9195 -21972 -15233 -20445 -21803 -5231 20562 18773 4713 6594
14311F594K648J8823P650j0278j5718j4214K023j691K133K568J7063n674l661
$$ 6594 9242 28065 35715 25437 9719 -4495 -2472 -4163 -2030 538 17601 11927 8266
14298H266q43J268j5291j5489J1055J7872O265p812j0306p390p496k275P371J595
$$ 8266 7423 8691 -6600 -22089 -11034 6838 13103 5291 -5015 -12405 -19901 -22176 -14805 -13210
14284a3210m733Q249J1265N268l27J3229N000q969l835n655k116m386r27l308
$$ -13210 -17943 -9694 1571 6839 6512 19741 24741 15772 11937 6282 4166 -220 -1147 -4455
14270d455p888J1313K3880j1684k1925q343J7892J3168j735j664j5K027m770j2567
$$ -4455 -12343 -1030 22850 11166 -10759 -19102 -1210 11958 10223 8559 8544 10571 5801 -6766
14256f766o591m070J2308J2776P701N933m91L228k584j5955l288L537l398o136
$$ -6766 -13357 -17427 -5119 7657 15358 21291 20800 24028 21444 5489 2201 5738 2340 -3796
14242c796r739J4381J1151J402J821j358o560k311N131O41k692O327o849r457
$$ -3796 -13535 846 11997 13399 15220 13862 7302 4991 10122 10763 8071 14398 7549 -1908
14228a908o784q675j3156J1802K0180j1051n797P218M563J624n571M751J7192
$$ -1908 -8692 -17367 -30523 -18721 1459 -9592 -15389 -8171 -3608 -1984 -7555 -2804 14388
14215A4388q118j0864j4347O622o436k6803k071n030K280J1701J8284M47P120
$$ 14388 6270 -4594 -18941 -12319 -18755 -45558 -47629 -52659 -50379 -38678 -20394 -19947 -12827
14202a2827N475Q344O532R208j1821j1461J1557Q473j5331o236L092j977K830
$$ -12827 -7352 992 7524 16732 4911 -6550 5007 13480 -1851 -8087 -4995 -6972 -4142
14189d142J543q720m170N741M920l009j0522j395J0134L918P03P452m43J1964
$$ -4142 -2599 -11319 -15489 -9748 -4828 -7837 -18359 -19754 -9620 -5702 -4999 2453 2010 13974
14175A3974J0960k463K993j7401j1970Q3J6045o961j0860q057O389N378j864k58
$$ 13974 24934 22471 25464 8063 -3907 -3824 12221 5260 -5600 -13657 -7268 -1890 -3754 -4012
14161d012q691p226J4157J0567l494j1124K673m530K4962k088r30j0707j7479
$$ -4012 -12703 -19929 -5772 4795 1301 -9823 -7150 -11680 13282 11194 10264 -443 -17922
14148a7922q884L398o47J4958Q22O101Q574N921q994k1346P356l016l648Q648
$$ -17922 -26806 -23408 -24055 -9097 -8275 -2174 6400 12321 3327 -18019 -10663 -13679 -17327 -8679
14134h679k054o322o61R216N315m297Q161j1723P269K341j28q301J1155J6361
$$ -8679 -10733 -17055 -17716 -8500 -3185 -7482 679 -11044 -3775 -1434 -1562 -9863 1292 17653
14120A7653O273N946L329j5718k2349n448j490r915r44P741K85J0133o79n672
$$ 17653 23926 29872 33201 17483 -4866 -10314 -11804 -21719 -22663 -14922 -14637 -4504 -5183 -10855
14106a0855j830M440q045M890R275O556j10Q043J1523o298K047j5395q673o04
$$ -10855 -12685 -8245 -16290 -11400 -2125 4431 4321 12364 23887 17589 19636 4241 -4432 -5036
14092e036L570j013p679o563j0197q55l194J847J0495M48J921J524J1716N002
$$ -5036 -1466 -2479 -10158 -16721 -26918 -27773 -30967 -29120 -18625 -18177 -16256 -14732 -3016 1986
14078A986j7692o801K0864K4151j7065k4609j372k741R743k282N34l853p225K8512
$$ 1986 -15706 -22507 -1643 22508 5443 -19166 -20538 -23279 -13536 -15818 -15284 -19137 -26362 2150
14064B150J3361o043j0003J4338P829k0755o667P794j566p589o741R33K5422O713
$$ 2150 15511 9468 -535 13803 21632 877 -5790 2004 438 -7151 -13892 -12959 12463 19176
14050A9176p24q312r879j2042m625p199n590R872J1750M884j9770j214L890o573
$$ 19176 18452 10140 261 -11781 -16406 -23605 -29195 -19323 -7573 -2689 -22459 -23673 -19783 -26356
14036b6356J1627J8117J9307p359k3698M0J0320K483J0586J630o21j3322P097
$$ -26356 -14729 3388 22695 15336 -8362 -8322 1998 4481 15067 16697 16076 2754 9851
14023I851k872Q08K614K075j7121j75K5584J4770k550k2256k1114J7042K295j4743
$$ 9851 6979 7787 10401 12476 -4645 -4820 20764 35534 32984 10728 -10386 6656 8951 -5792
14009e792J1850Q130j3152l733r836J2686J4458J3958O756l36o776r828O111p024
$$ -5792 6058 14188 1036 -2697 -12533 153 14611 28569 35325 34989 28213 18385 24496 17472
13995A7472k2622p861J3009m426L225O053K608O736p750j0455J906N486k926j126
$$ 17472 -5150 -13011 -2 -4428 -1203 4850 7458 14194 6444 -4011 -2105 3381 455 -671
13981f71J472p860j657k478M692P837J7390j2814j8933p3l202L452J2197J3282
$$ -671 801 -7059 -8716 -11194 -6502 1335 18725 5911 -13022 -13095 -16297 -12845 -648 12634
13967A2634J0854m711q300K143L510k552p1j6948j2914k777N623P079N802k98
$$ 12634 23488 18777 10477 12620 16130 13578 13507 -3441 -16355 -19132 -13509 -6430 -628 -926
13953i26n742P967N098p765L866k0518J3J0524J3632Q443j3334m158l702j5500
$$ -926 -6668 1299 6397 -1368 2498 -18020 -18007 -7483 6149 14592 1258 -2900 -6602 -22102
13939b2102j746j6976M515J0690o752Q252J7412R85j1047K372Q28P886K4775J0756
$$ -22102 -23848 -40824 -36309 -25619 -32371 -24119 -6707 -5722 -16769 -14397 -13569 -5683 19092 29848
13925B9848j4482j6854k2156N908Q447l272n346P578J0310l545J797o734k226
$$ 29848 15366 -1488 -23644 -17736 -9289 -12561 -17907 -10329 -19 -3564 -1767 -8501 -10727
13912a0727k155J171M234o361j597r542J21P296n98J649J1918P218j2921j7767
$$ -10727 -12882 -11711 -7477 -13838 -15435 -24977 -24856 -17560 -18158 -16509 -4591 2627 -10294 -28061
13898b8061L860J8610M225j6026J1916r275j6194L841o285K177J3746J0719j411
$$ -28061 -24201 -5591 -1366 -17392 -5476 -14751 -30945 -27104 -33389 -31212 -17466 -6747 -8158
13885h158k1231K6972O128n994l7N444k822R300o475J774k3261l219J0225P785
$$ -8158 -29389 -2417 3711 -2283 -2320 3124 302 9602 3127 4901 -18360 -21579 -11354 -3569
13871c569Q440K210j851o773j4437J14N934J0973R368k228j0438J1887L584R890
$$ -3569 4871 7081 5230 -1543 -15980 -15866 -9932 1041 10409 8181 -2257 9630 13214 23104
13857B3104J1359l119j2130o065p954k604j6197m225K044O313R689m147j2316
$$ 23104 34463 31344 19214 13149 5195 2591 -13606 -17831 -15787 -9474 215 -3932 -16248
13844a6248K824J3021O621o886K247J354m528N304J1713J3429q777r679J3500
$$ -16248 -13424 -403 6218 -668 1579 2933 -1595 3709 15422 28851 20074 10395 23895
13831B3895l733j9274j140r47p447n12m86l122Q801j0137jj0298p977J6141L814
$$ 23895 20162 888 -252 -1199 -8646 -9158 -9644 -12766 -3965 -14102 -14103 -24401 -32378 -16237 -12423
13816a2423L078l942J2560J5867l72K220j0667J899N38j742r120j3623M465J0573
$$ -12423 -9345 -13287 -727 15140 14768 16988 6321 8220 8758 7016 -2104 -15727 -11262 -689
13802f89J1311J4806J657N428l226j1869O174O156k6172m82p043J765P317M979
$$ -689 10622 25428 27085 32513 29287 17418 23592 29748 3576 3094 -3949 -2184 5133 10112
13788A0112j2644j340M458n875j2090J6581J5939p876J28j6222p216o004o289
$$ 10112 -2532 -3872 586 -5289 -17379 -798 15141 7265 7393 -8829 -16045 -22049 -28338
13775b8338K595J4212J4441Q574L90M156k862p566J0558m347j3290k280m156R35
$$ -28338 -25743 -11531 2910 11484 11874 16030 13168 5602 16160 11813 -1477 -3757 -7913 -6978
13761f978J1742p729J114K4313q616l473j9923M100L383p381M201J0226N370O030
$$ -6978 4764 -2965 -1851 22462 13846 10373 -9550 -5450 -2067 -9448 -5247 4979 10349 16379
13747A6379J8913j6532l7634n432j412N290m554L491J1431L654J1926L606j136
$$ 16379 35292 18760 -18874 -24306 -25718 -20428 -24982 -21491 -10060 -6406 5520 9126 7990
13734G990O799j1789j1657p108k2852k165K5644K0004l124Q007k220j1730L012
$$ 7990 14789 3000 -8657 -15765 -38617 -40782 -15138 4866 1742 9749 7529 -4201 -1189
13721a189L914q864N290q645j0205j8898p406J9248K5811j035M75J4978M660j5796
$$ -1189 2725 -6139 -849 -9494 -19699 -38597 -46003 -26755 -944 -1979 -1504 13474 18134 2338
13707B338j46j7493k805J2635M774n753K4766L5o806k1140j9613k2K8110J2288
$$ 2338 2192 -15301 -18106 -5471 -697 -6450 18316 18351 11545 -9595 -29208 -29230 -1120 11168
13693A1168o727m971k0381J41J1010J1692k0802j453J3351k504l531K2164O58
$$ 11168 4441 -530 -20911 -20770 -9760 1932 -18870 -20323 -6972 -9476 -13007 9157 9815
13680I815R7R513p624j283J2907m52j5154n005K997o282J8L632N69l404M657Q993
$$ 9815 9912 19425 11801 10518 23425 22973 7819 2814 5811 -471 -453 3179 3748 344 5001 13994
13664A3994n222n840O869k173j4157J0040J675O81O475j2623M741M555k161p587
$$ 13994 8772 2932 9801 7628 -6529 3511 5186 5867 12342 -281 4460 9015 6854 -733
13650g33r700J0505N405j5352j4699J0759Q356Q629J5575J6636r723j5027l4691
$$ -733 -10433 72 5477 -9875 -24574 -13815 -5459 3170 18745 35381 25658 10631 -24060
13637b4060k889K6107O397o98j6708q62R034o539J2620K066q019R474P59J2460
$$ -24060 -26949 -842 5555 4857 -11851 -12713 -3679 -10218 2402 4468 -3551 5923 6682 19142
13623A9142Q164r436J936k107j3287K868N136N162j6953M593L561L491r042r290
$$ 19142 27306 17870 19806 17699 4412 7280 12416 17578 625 5218 8779 12270 3228 -6062
13609f062L847m859n128Q198J4175j5520k2265p107K3318J1863l410j4831N235
$$ -6062 -2215 -7074 -12202 -4004 10171 -5349 -27614 -34721 -11403 460 -2950 -17781 -12546
13596a2546J3218N862o472L748R330o61p865J841N551N066J521P887j5j40r58
$$ -12546 672 6534 62 3810 13140 12479 4614 6455 12006 17072 18593 26480 26465 26325 25367
13581B5367J5257R242K05k4954j5513j4673j4359m525R354M276J676J9203R649
$$ 25367 40624 49866 50071 25117 9604 -5069 -19428 -23953 -14599 -10323 -8647 10556 20205
13568B0205O166M060l381J181k668k792k1423r208l557K734J2578M761r311J1692
$$ 20205 26371 30431 27050 28231 25563 22771 1348 -7860 -11417 -8683 3895 8656 -655 11037
13554A1037R888K113N500m768m766r379m139J5452J1287N913j4234j0177o561
$$ 11037 20925 23038 28538 23770 19004 9625 5486 20938 32225 38138 23904 13727 7166
13541G166p828j3987J919K0249J5805o907q182M952J744Q173M979o025j3967k0438
$$ 7166 -662 -14649 -12730 7519 23324 16417 8235 13187 14931 23104 28083 22058 8091 -12347
13527a2347Q56J1766n492l60J4485J903K88p938m168k962K837R582J0704l110
$$ -12347 -11491 275 -5217 -5577 8908 10811 11099 3161 -1007 -3969 -1132 8450 19154 16044
13513A6044j1767l482j845J5092J1167j2020q577K74J072R209K859o808j2329
$$ 16044 4277 795 -1050 14042 25209 13189 4612 4886 5958 15167 18026 11218 -1111
13500a111k459P105N455N41Q78j4804N908Q550J7J2212J6299p076j6684j1556
$$ -1111 -3570 3535 8990 9531 10409 -4395 1513 10063 10080 22292 38591 31515 14831 3275
13486C275n141J149L748o463j2405O149J3568J8897J2420m340O372m69j0543j2084
$$ 3275 -1866 -717 3031 -3432 -15837 -9688 3880 22777 35197 30857 37229 36760 26217 14133
13472A4133j225j821l606N519j6372P52j403R329m042m150m360Q055P093J1743
$$ 14133 12908 11087 7481 13000 -3372 -2620 -4023 5306 1264 -2886 -7246 809 7902 19645
13458A9645J1407o683j2641k3177j50k429k67J8360N885j2896j4503r49j1462
$$ 19645 31052 24369 11728 -11449 -11599 -14028 -14295 4065 9950 -2946 -17449 -18398 -29860
13445b9860j330O048N300M690J0280P390K0783r303N874O576j6589l798K1541
$$ -29860 -31190 -25142 -19842 -15152 -4872 2518 23301 13998 19872 26448 9859 6061 27602
13432B7602l932k0142l528Q889m719K219l425j5271L844N465J3236j613m44M508
$$ 27602 23670 3528 0 8889 4170 6389 2964 -12307 -8463 -2998 10238 8625 8181 12689
13418A2689l737P145J1841K429L83L795r617n075j2978P684R396J0554m801k0336
$$ 12689 8952 16097 27938 30367 30750 34545 24928 19853 6875 14559 23955 34509 29708 9372
13404I372j2220j679J1584j2311L261K4780n325j0372J1785p115j0921O118J4292
$$ 9372 -2848 -4527 7057 -5254 -1993 22787 17462 7090 18875 11760 839 6957 21249
13391B1249n516n259j9021O977L4J4808j0889q679j550m332R883J792J2446r85
$$ 21249 15733 10474 -8547 -1570 -1536 13272 2383 -6296 -7846 -12178 -2295 -503 11943 10958
13377A0958M54J0174J840j6389J4490R662j6642k104J523N344O892M590j693o975
$$ 10958 11412 21586 23426 7037 21527 31189 14547 12443 13966 19310 26202 30792 29099 22124
13363B2124Q378P954m141j2221p047n624n997q601M060L903L953K898J1718L852
$$ 22124 30502 38456 34315 22094 15047 9423 3426 -5175 -1115 2788 6741 9639 21357 25209
13349B5209P364K641q053J020j140q667n924o198p418m728O021J077l37M630j208
$$ 25209 32573 35214 27161 28181 27041 18374 12450 6252 -1166 -5894 127 1204 867 5497 4289
13334D289o918J3357J5522m350N362L866P10n987K511m497r194n538O086J6240
$$ 4289 -2629 10728 26250 21900 27262 31128 31838 25851 28362 23865 14671 9133 15219 31459
13320C1459P347O582m416k0555J4501M447j6986j843L408M372Q79J682j0337P643
$$ 31459 38806 45388 40972 20417 34918 39365 22379 20536 23944 28316 29195 30877 20540 28183
13306B8183o818j1212O226l192p35k00r178M902N245J7475l527q245N438Q454
$$ 28183 21365 10153 16379 13187 12452 12252 3074 7976 13221 30696 27169 18924 24362 32816
13292C2816m686K347J1117m080j0809m762L038n050j1234J0218P605J5352J6635
$$ 32816 28130 30477 41594 37514 26705 21943 24981 19931 8697 18915 26520 41872 58507
13279E8507n658nk7304j413j0952k4414K864P216j201R146J4289J926n232L477
$$ 58507 52849 52844 25540 24127 13175 -11239 -8375 -1159 -2360 6786 21075 23001 17769 21246
13265B1246n979M065M335j4462o016Q488Q027K364n889K7871l190j4136k168J343
$$ 21246 15267 19332 23667 9205 3189 11677 19704 22068 16179 44050 40860 26724 24556 25899
13251B5899k756j2673j6686J237J8703O400Q114J1681k1641j1738n021K278K119
$$ 25899 23143 10470 -6216 -4979 13724 20124 28238 39919 18278 6540 1519 3797 5916
13238E916L398n133j0474k608N176L734J2506O811L27p438m657j1389J4321J84
$$ 5916 9314 4181 -6293 -8901 -3725 9 12515 19326 19653 12215 7558 -3831 10490 10674
13224A0674n40p528P563R242Q067L558j5168j2143q529Q395R269j6725j295J1638
$$ 10674 10134 2606 10169 19411 27478 31036 15868 3725 -4804 3591 12860 -3865 -5160 6478
13210F478K110J4687J7184K271J3716m059j9078q426O364p929m610j3865m050
$$ 6478 8588 23275 40459 42730 56446 52387 33309 24883 31247 23318 18708 4843 793
13197G93L420R089K619J5131K3105j457j7100r077j3999j0388L1595J4857m53
$$ 793 4213 13302 15921 31052 54157 52700 35600 26523 12524 2136 33731 48588 48135
13184D8135k0525n508k807n586j991J3829k487N192m593j780L27L795m260m883
$$ 48135 27610 22102 19295 13709 11718 25547 23060 28252 23659 21879 22206 26001 21741 16858
13170A6858M390l339Q633N303j2430j7750j1484j568j0608M335J2055J802j58
$$ 16858 21248 17909 26542 31845 19415 1665 -9819 -11387 -21995 -17660 -5605 -3803 -3961
13157c961K8215M459j5302m750J9028J3340l628o004j5373j0362Q037O624J2610
$$ -3961 24254 28713 13411 8661 27689 41029 37401 31397 16024 5662 13699 20323 32933
13144C2933J0824J0240j4760k0889l682N566R951J0082M847j3949l906j3960l325
$$ 32933 43757 53997 39237 18348 14666 20232 30183 40265 45112 31163 27257 13297 9972
13131I972n400j4929N302R180J1133j884o301M659N080K3046j1011k893o404o687
$$ 9972 4572 -10357 -5055 4125 15258 13374 7073 11732 16812 39858 28847 25954 19550 12863
13117A2863K556J5450M318O102p10j1831k772O702O022L373o946J840k293R20
$$ 12863 15419 30869 35187 41289 40579 28748 25976 32678 38700 42073 35127 36967 34674 35594
13103C5594r079J683N61J133R033P486K885j2120j3792Qo988J9705Q727l340M770
$$ 35594 26515 28198 28759 29892 38925 46411 49296 37176 23384 23392 16404 36109 44836 41496 46266
13088D6266p749j6753j2338N577J2460j542l017K607J3761P530j2828k0610M8
$$ 46266 38517 21764 9426 15003 27463 25921 22904 25511 39272 46802 33974 13364 13412
13075A3412J9093J7610n178L79n645O177R756j2838j1463J469j8223l863O641
$$ 13412 32505 50115 44937 45316 39671 45848 55604 42766 31303 32772 14549 10686 17327
13062A7327J95J2228n236j5493P507Q595Q287j3456j3240q54N027J9086J521m84
$$ 17327 17522 29750 24514 9021 16528 25123 33410 19954 6714 5860 10887 29973 31494 31010
13048C1010P23l760k59M772K1481M517j4582m507q320o047L190R429L256j0636
$$ 31010 31733 27973 27714 32486 53967 58484 43902 39395 31075 25028 28218 37647 40903 30267
13034C0267j3161l38J5697J0510j0393q924J900p975o819j1249J2454N970M297
$$ 30267 17106 16768 32465 42975 32582 23658 25558 17583 10764 -485 11969 17939 22236
13021B2236O659J710J2740Q030N695O343r572p088M554j4P32p694K629r387p120
$$ 22236 28895 30605 43345 51375 57070 63413 53841 46753 51307 51293 52025 44331 46960 37573 30453
13006C0453l728j5423N132J9265J3602K753P185J831r735j757J973K473L143M530
$$ 30453 26725 11302 16434 35699 49301 52054 59239 61070 51335 49578 51551 54024 57167 61697
12992F1697J1545k0293k8407k1459Q130K4525n326r803r66K7014l95k1416j7645
$$ 61697 73242 52949 24542 3083 11213 35738 30412 20609 19643 46657 46262 24846 7201
12979G201J2979J3829Q621n20o51J6780K847k2940j6279J2319J5687l238L504
$$ 7201 20180 34009 42630 42110 41459 58239 61086 38146 21867 34186 49873 46635 50139
12966E0139j3028r247N64J3312J2491j4930q087o450Q768R852p78J848Q844q058
$$ 50139 37111 27864 28428 41740 54231 39301 31214 24764 33532 43384 42606 44454 53298 45240
12952D5240O32n557n985J2869k6508j7460M752J1261J2109Q974K771M54r321j5306
$$ 45240 45872 40315 34330 47199 20691 3231 7983 19244 31353 40327 43098 43552 34231 18925
12938A8925p169k213q467P85K353Q808J1501n02q610j471M575J832r844M41Q064
$$ 18925 11756 9543 1076 1861 4214 13022 24523 24021 15411 13940 18515 20347 10503 10944 19008
12923A9008J1761J9322R791j4545o204j4396P574R307N121L620L0533p48j1946
$$ 19008 30769 50091 59882 45337 39133 24737 32311 41618 46739 50359 80892 80144 68198
12910F8198j0487j4147q573n145n015M32R315P597J473N187l531r355M620J0840
$$ 68198 57711 43564 34991 29846 24831 25263 34578 42175 43648 48835 45304 35949 40569 51409
12896E1409L764o524n327l222Q729P147m841Q344P235j2391k2629n456Q423K649
$$ 51409 55173 48649 43322 40100 48829 55976 51135 59479 66714 54323 31694 26238 34661 37310
12882C7310J622O470P594R26J1311n499n671N724J9634q913k0904j6714j7394
$$ 37310 38932 45402 52996 53922 65233 59734 54063 59787 79421 70508 49604 32890 15496
12869A5496P769Q623J3409J5105j3387L946L32m200J579k52k311L022N42k647
$$ 15496 23265 31888 45297 60402 47015 50961 51293 47093 48672 48420 46109 49131 49673 47026
12855D7026L139J6944j4925j3245o835J3180J3231n757K124M878j1166J356K842
$$ 47026 50165 67109 52184 38939 32104 45284 58515 52758 54882 59760 48594 49950 52792
12842E2792o666m305l785P910k480J16K272L728N175J241p896l409L918j461J3710
$$ 52792 46126 41821 38036 45946 43466 43582 45854 49582 54757 55998 48102 44693 48611 47150 60860
12827F0860J758j3216P859j7340j9653m902K0524K8746O587R294q613J293K583
$$ 60860 62618 49402 57261 39921 20268 15366 35890 64636 71223 80517 71904 73197 75780
12814G5780L611Q596L701k3544r777R033J0761N335l446J82K347M482n11j4301
$$ 75780 79391 87987 91688 68144 58367 67400 78161 83496 80050 80232 82579 87061 86550 72249
12800G2249j3494j4563L260r530m272P307P131J819J2893O797j5752L115L0714
$$ 72249 58755 44192 47452 37922 33650 40957 48088 49907 62800 69597 53845 56960 87674
12787H7674M590l571j2906j6889n808J655N137N275M887j6517j4856R930k496
$$ 87674 92264 88693 75787 58898 53090 54745 59882 65157 70044 53527 38671 48601 46105
12774D6105P888K468J117Q637O083j3009L660j4253L654R843J626m289l773l897
$$ 46105 53993 56461 57578 66215 72298 59289 62949 48696 52350 62193 63819 59530 55757 51860
12760E1860R054K783p478J848k133p472L495l524j1006K0593Q543L900p725k104
$$ 51860 60914 63697 56219 58067 55934 48462 51957 48433 37427 58020 66563 70463 62738 60634
12746F0634l03J0332J979L336J678r034J951Q598K285m838j0509l172K993k338
$$ 60634 60331 70663 72642 75978 77656 68622 70573 79171 81456 76618 66109 62937 65930 63592
12732F3592J6967J958q123j0076o547j68R117o644o931J775j203J3882L802k0750
$$ 63592 80559 82517 74394 64318 57771 57603 66720 60076 53145 54920 53717 67599 71401 50651
12718E0651Q963P293J3767R737k3521r176O174J6793M201J4308m58l2748r828
$$ 50651 59614 66907 80674 90411 66890 57714 63888 80681 84882 99190 98732 65984 56156
12705E6156K557K3423Q908j2192j1804n668P390L128O505q004O116k621o134k666
$$ 56156 58713 82136 91044 78852 67048 61380 68770 71898 78403 70399 76515 73894 67760 65094
12691F5094n287q028J2532L666r034N292m607K93J4240k440j1639R929K574q740
$$ 65094 59807 51779 64311 67977 58943 64235 59628 59921 74161 71721 60082 70011 72585 63845
12677F3845L733R244L055j0786j2603K918q813l802O216m368M506J6965l547j475
$$ 63845 67578 76822 79877 69091 56488 59406 50593 46791 53007 48639 53145 70110 66563 65088
12663F5088K32J4963J4658K062r519j6567j3249O890J3761k852j4138P073R164
$$ 65088 65320 80283 94941 97003 87484 70917 57668 64558 78319 75467 61329 68402 77566
12650G7566Q651m026M309lj151n323K097J5309r174j5724L697N876k448L475N339
$$ 77566 86217 82191 86500 86497 85346 80023 82120 97429 88255 72531 76228 82104 79656 83131 88470
12635H8470O201n485l845R581J6267o456k2352K615Q387k72P508K468m991m615
$$ 88470 94671 89186 85341 94922 111189 104733 82381 84996 93383 93111 100619 103087 98096 93481
12621I3481k2603j45N354J0632J7617j1822j970j902O647o313j9941j9666M352
$$ 93481 70878 70733 76087 86719 104336 92514 90544 88642 95289 88976 69035 49369 53721
12608E3721P397n296M929j325l927K1583J0326j0073R496J7819r677O264k2803
$$ 53721 61118 55822 60751 59426 55499 77082 87408 77335 86831 104650 94973 101237 78434
12595G8434j7732Q610L146q455O59N436J1059J66J0640n643j854k758Q893m39
$$ 78434 60702 69312 72458 64003 64662 70098 81157 81323 91963 86320 84466 81708 90601 90162
12581I0162O494j1031K131j213k067J10J6157J1730o193j9378m22M332P449R758
$$ 90162 96656 85625 87756 86543 84476 84586 100743 112473 106280 86902 86480 90812 98261 108019
12567A08019o852R001J044j2692j5110P980Q586l116j3639N139R389J119J3424
$$ 108019 101167 110168 111212 98520 83410 91390 99976 96860 83221 88360 97749 98868 112292
12554A12292o211r720k627L65R977l974K971P933k607P60k126j3886J6468j690
$$ 112292 106081 96361 93734 94099 104076 100102 103073 111006 108399 109159 107033 93147 109615 107925
12540A07925n471J5037m914j1809J878n052j0905j346o66N105J5404K403Q129
$$ 107925 102454 117491 112577 100768 102646 97594 86689 85343 84677 89782 105186 107589 115718
12527A15718j2213l608R866R250j0694q32p384q54K5509J8009j9673j9271l668
$$ 115718 103505 99897 109763 119013 108319 107487 100103 99249 124758 142767 123094 103823 100155
12514A00155M997o62j4309j779J5408P044o475n098J0522j528j539P471P029l108
$$ 100155 105152 104490 90181 88402 103810 110854 104379 99281 109803 108275 106736 114207 121236 118128
12500A18128J265m49m237l365Q337R761q389l967l903o942M994J2589q092n933
$$ 118128 119393 118944 114707 111342 119679 129440 121051 117084 113181 106239 111233 123822 115730 109797
12486A09797l364J7118n359l462J0390K029M534M542j3589j8618R137J5702J1705
$$ 109797 106433 123551 118192 114730 125120 127149 131683 136225 122636 104018 113155 128857 140562
12473A40562j2927j5110J2858M207k917J6284K4117m724l2876j0322q630J1023
$$ 140562 127635 112525 125383 129590 126673 142957 167074 162350 129474 119152 110522 121545
12461A21545M073q738M443K723J9889J0434k1255r811q38O302k004M820J010l273
$$ 121545 125618 116880 121323 124046 143935 154369 133114 123303 122465 128767 126763 131583 132593 129320
12447A29320N89m915r196q109J8986j613j4581k2204M412J5053N988O736P674
$$ 129320 129909 124994 115798 107689 126675 125062 110481 88277 92689 107742 113730 120466 128140
12434A28140o179J2597o5Q90N357k742j68R581L149K352K3812r772q46L116j4754
$$ 128140 121961 134558 134493 135383 140740 137998 137830 147411 150560 152912 176724 166952 166106 169222 154468
12419A54468j1342o301ll219q987M93R808n474J4844J9331n330N642K293j785
$$ 154468 143126 136825 136822 133603 124616 125109 134917 129443 144287 163618 158288 163930 166223 164438
12405A64438n024o558J121n664O384p869m488j2657k098R345O517J1578o836j3141
$$ 164438 159414 152856 153977 148313 154697 146828 142340 129683 127585 136930 143447 155025 148189 135048
12391A35048m372K2391J1083K837r17l305j0911M410J102o767j9062q763P696
$$ 135048 130676 153067 164150 166987 166070 162765 151854 156264 157366 150599 131537 122774 130470
12378A30470J985m036N678L846L412J773R770Q350J8590O015j7689j989J7342
$$ 130470 132455 128419 134097 137943 141355 143128 152898 161248 179838 185853 168164 166175 183517
12365A83517M773p990K714k857r098n980j1232J1362J0110N912o718j4074j858
$$ 183517 188290 180300 183014 180157 171059 165079 153847 165209 175319 181231 174513 160439 158581
12352A58581J4445j0334j0279K0817J3807j9181j9637k695k994J5807J7867l65
$$ 158581 173026 162692 152413 173230 187037 167856 148219 145524 142530 158337 176204 175839
12340A75839r169n97M486J1680j0308j1594J546J1880j776j0746J5736k49L535
$$ 175839 166670 166073 170559 182239 171931 160337 161883 173763 171987 161241 176977 176728 180263
12327A80263J4765k11j0510J4306N652m277m357j8519j3938O3J9610L959j1594
$$ 180263 195028 194817 184307 198613 204265 199988 195631 177112 163174 163237 182847 186806 175212
12314A75212M83N026K102j4914l539L179n974K673Q825L184N491p86K3054M001
$$ 175212 175695 180721 182823 167909 164370 167549 161575 164248 173073 176257 181748 180962 204016 208017
12300B08017n64l107j4543o32P102j1403o350M227J587j0382j4352O276P033j1597
$$ 208017 207453 204346 189803 189171 196273 184870 178520 182747 184334 173952 159600 165876 172909 161312
12286A61312r670j741K6126K5053j9994j7567l116Q123K2207Q760k646k09j194
$$ 161312 151642 149901 176027 201080 181086 163519 160403 168526 190733 199493 196847 196638 195444
12273A95444J1644p428j8440R83j5123j5414r39J4362r18O627p177p099R370J9441
$$ 195444 207088 199660 181220 182203 167080 151666 150727 165089 164171 170798 163621 156522 165892 185333
12259A85333J3690J9437k0932k8642J011J1564M404J0205L050k866l219j619J790
$$ 185333 199023 218460 197528 168886 169897 181461 185865 196070 199120 196254 193035 191416 193206
12246A93206N207L234J2701p444J094J225p737O292M138j0265l971j0231p512
$$ 193206 198413 201647 214348 206904 207998 209223 201486 207778 211916 201651 197680 187449 179937
12233A79937Q273J0799O955N049L317M217q819p085M152q524j920m293j3050Q941
$$ 179937 188210 199009 205964 211013 214330 218547 209728 202643 206795 198271 196351 192058 179008 187949
12219A87949J2598Q453K4489o47l815p898m752J0436N762M569q289k039p39j1983
$$ 187949 200547 209000 233489 232842 229027 221129 216377 226813 232575 237144 228855 226816 226077 214094
12205B14094M91J4123J747l42Q532k4369k1218K652J1605J2851q417k332Q200
$$ 214094 214585 228708 230455 230113 238645 214276 193058 195710 207315 220166 211749 209417 217617
12192B17617q977Q59J7444k709n558J012N544J2073n329j356J1697Q499p941m001
$$ 217617 208640 209499 226943 224234 218676 219688 225232 237305 231976 230620 242317 250816 242875 238874
12178B38874O44K457P138j2712r771P441L3k439p552o19J0825l636J6746P623
$$ 238874 239518 241975 249113 236401 226630 234071 234104 231665 224113 223494 234319 230683 247429 255052
12164B55052j98M005N366R370R428j5098j6809J0223l00o636J1672j028j1311
$$ 255052 254854 258859 264225 273595 283023 267925 251116 261339 261039 254403 266075 265047 253736
12151B53736J153L131j8378m301M939q992k432J0928j835j5173j32j4516n793
$$ 253736 254889 258020 239642 235341 240280 231288 228856 239784 237949 222776 222644 208128 202335
12138B02335J4034N110M481r30p45P238M579J9487J281n556q038o060Q269J1903
$$ 202335 216369 221479 225960 225030 224285 231523 236102 255589 256870 251314 243276 237216 245485 257388
12124B57388J1692J88L678K887j2739k0426J206j852l497k94O549K0669j3705
$$ 257388 269080 269268 272946 275833 263094 242668 243874 242022 238525 238231 244780 265449 251744
12111B51744k1816o92M814n482K5283J0079j0357q191r136J496J6012k996j8817
$$ 251744 229928 229236 234050 228568 253851 263930 253573 245382 236246 237742 253754 250758 231941
12098B31941j448m315K117N464j649J4700J59L99pJ023M26J4238m2p507P293J562
$$ 231941 230493 226178 228295 233759 232110 246810 246969 247368 247361 248384 248810 263048 263006 255499 262792 264354
12082B64354p496K267l015M146K2751O161q472j2616o041L134l383j704K2123
$$ 264354 256858 259125 256110 260256 283007 289168 280696 268080 262039 265173 261790 260086 282209
12069B82209M13j922j4553J901J52l029j5406m745K0528Q847o270R268k661k7261
$$ 282209 282622 280700 266147 268048 268200 265171 249765 245020 265548 274395 268125 277393 274732 247471
12055B47471N458J0238N758j4249k1349j1430o051n651O770K3606J4056J2717
$$ 247471 252929 263167 268925 254676 233327 221897 215846 210195 216965 240571 254627 267344
12043B67344j0800j4362o291J298R914n927N44J8603J6183p77j1913j1173J9648
$$ 267344 256544 242182 235891 237189 247103 241176 241720 260323 276506 275729 263816 252643 272291
12030B72291O332j3852j1203o782p467L644K2327J9023J0321M163k3353r001j145
$$ 272291 278623 264771 253568 246786 239319 242963 265290 284313 294634 298797 275444 266443 265298
12017B65298K112N866j0887k2321R980n212k65J5875J2961j542o737R73J5107
$$ 265298 267410 273276 262389 240068 250048 244836 244571 260446 273407 271865 265128 266101 281208
12004B81208q693J229j3514j5714l232k765P671M388k018K504K499j905K119m0
$$ 281208 272515 273744 260230 244516 241284 238519 246190 250578 248560 251064 253563 251658 253777 253737
11990B53737j991J1287N117p062J2118n963J3010J2387k439k0651k132m545K780
$$ 253737 251746 263033 268150 261088 273206 267243 280253 292640 290201 269550 267418 262873 265653
11977B65653k315R772O843P218J3589j0827l033N174l28o027N504k442j7584r751
$$ 265653 263338 273110 279953 287171 300760 289933 286900 292074 291746 285719 291223 288781 271197 261446
11963B61446P80N507l839j3469K8717K2843j6811J592m690j0391K1015j3468k2254
$$ 261446 262226 267733 263894 250425 279142 301985 285174 286766 282076 271685 292700 279232 256978
11950B56978Q956K0925O83j903n308k296n968M061n022J605J3011J0387l826j8605
$$ 256978 265934 286859 287542 285639 280331 278035 272067 276128 271106 272711 285722 296109 292283 273678
11936B73678j2240j075J2593R941J2600K365j8411J510j1554N651J5952M100J2607
$$ 273678 261438 260363 272956 282897 295497 297862 279451 280961 269407 275058 291010 295110 307717
11923C07717R485r545j436R931q742m460j9313j2811m790J0214P001j9218K786
$$ 307717 317202 307657 306221 316152 307410 302950 283637 270826 266036 276250 283251 264033 266819
11910B66819M460P04k473n166J230K2445R049k145N397p317M297O116k606n860
$$ 266819 271279 271983 269510 264344 265574 288019 297068 294923 300320 293003 297300 303416 300810 294950
11896B94950o30k4304o142J86j7115P955K5704q628m119J7262j6113k1645l01
$$ 294950 294320 270016 263874 264060 246945 254900 280604 271976 267857 285119 269006 247361 247060
11883B47060Q160j3907n033J545K5067P125P211P193o634r222m17J5016k627j2724
$$ 247060 255220 241313 236280 237825 262892 270017 277228 284421 277787 268565 268148 283164 280537 267813
11869B67813n091k190J900n82J1137K2536j1205j4051J829l043j1970p951J7846
$$ 267813 262722 260532 262432 261850 272987 295523 284318 270267 272096 269053 257083 249132 266978
11856B66978R118n352Q126j0417n877m123n583k976O005N266r183O447m017J1459
$$ 266978 276096 270744 278870 268453 262576 258453 252870 249894 255899 261165 251982 258429 254412 265871
11842B65871K068O446J149p710j7671O562Q591k8127k6521P677J2438L015K888
$$ 265871 267939 274385 275534 267824 250153 256715 265306 237179 210658 218335 230773 233788 236676
11829B36676J5161M233Q21m268j3877j989j318p086N057q102K306o74J4441J1338
$$ 236676 251837 256070 256891 252623 238746 236757 235439 228353 233410 225308 227614 226940 241381 252719
11815B52719L638P098k806m349j1298J586J7053n557o293L435j3570P564k636
$$ 252719 256357 263455 260649 256300 245002 246588 263641 258084 251791 255226 241656 249220 246584
11802B46584k468K6389O246j5010Q443L104k6380n436J2919P945o00j0012p44
$$ 246584 244116 270505 276751 261741 270184 273288 246908 241472 254391 262336 261736 251724 250980
11789B50980L592j2748j523J001o095j0687M434l35j1193O301P702L706M704M687
$$ 250980 254572 241824 240301 241302 235207 224520 228954 228619 217426 223727 231429 235135 239839 244526
11775B44526q450j7108N759l338j924m185P501j2139P879N672q74k67J1441P411
$$ 244526 236076 218968 224727 221389 219465 215280 222781 210642 218521 224193 223319 223052 234493 241904
11761B41904o695L522n594j0072J4867N543K616q526o189L579p061J326O426q388
$$ 241904 235209 238731 233137 223065 237932 243475 246091 237565 231376 234955 227894 229220 235646 227258
11747B27258j0842m619j623n040P439J4091j0668p809L917p826o0P566P505O717
$$ 227258 216416 211797 210174 205134 212573 226664 215996 208187 212104 204278 204218 211784 219289 226006
11733B26006J0437j2799M303Q491m66K738k946q017M296L582K300j0058N36K339
$$ 226006 236443 223644 227947 236438 235972 238710 235764 227747 232043 235625 237925 227867 228403 230742
11719B30742m58j448j7528N656J5373J692J868j807o439L30j2429m044J8332k633
$$ 230742 230284 228836 211308 216964 232337 234029 235897 234090 227651 227981 215552 211508 229840 227207
11705B27207j7570j1342Q185n28r463J1013j895O408J808M434l436l306o263j370
$$ 227207 209637 198295 206480 205952 196489 207502 205607 212015 213823 218257 214821 211515 205252 203882
11691B03882k0114Q57O121K804J0853J3488M304j90K847j0178j2299O130J5146
$$ 203882 183768 184625 190746 193550 204403 217891 222195 222005 224852 214674 202375 208505 223651
11678B23651j561j9282K09J201P86m639k339J941M240L784j2606r806N747K6479
$$ 223651 222090 202808 203017 204218 205004 200365 198026 199967 204207 207991 195385 185579 191326 217805
11664B17805J1504j4020m255O110l054k1770n910J5376R085M610r180O835j1570
$$ 217805 229309 215289 211034 217144 214090 192320 186410 201786 210871 215481 206301 213136 201566
11651B01566k905m628L069O190j2658q788J1892Q743P95j826p064o506J4048P859
$$ 201566 198661 194033 197102 203292 190634 181846 193738 202481 203276 201450 194386 187880 201928 209787
11637B09787q854O18j7422o090k50q130J0615l360p636n933L649J0771J6622P797
$$ 209787 200933 201551 184129 178039 177789 169659 180274 176914 169278 163345 166994 177765 194387 202184
11623B02184j489j2633j4349k047r312q480J1448N871K638k281J2562J14n973
$$ 202184 200695 188062 173713 171666 162354 153874 165322 171193 173831 171550 184112 184226 178253
11610A78253r432l74O659O02R676L058K016K45L913k21j3605l0770J112K4906
$$ 178253 168821 168447 175106 175708 185384 188442 190458 190703 194616 194395 180790 150020 151132 176038
11596A76038J1824j7557J3746J765p508n199J0512P349o450r702k301R457q081
$$ 176038 187862 170305 184051 185816 178308 173109 183621 190970 184520 174818 172517 181974 173893
11583A73893j290J008j327n297j4013j294N96J2399L445j4091l02J4352J2198
$$ 173893 172603 173611 172284 166987 152974 151680 152276 164675 168120 154029 153727 168079 180277
11570A80277j6536j6009Q049R159j1248j335j4398K186k758j4716Q946J3638N909
$$ 180277 163741 147732 155781 164940 153692 152357 137959 140145 137387 122671 131617 145255 151164
11557A51164N408k115J851J080M241n242j0357M801k138k732l982j522J1856k326
$$ 151164 156572 154457 156308 157388 161629 156387 146030 150831 148693 145961 141979 140457 152313 149987
11543A49987K651L101n591j1478r62N231L564r081n329J6070j274r77J0487M967
$$ 149987 152638 155739 150148 138670 137708 142939 146503 137422 132093 148163 146889 145912 156399 161366
11529A61366j336j5405j1658n065R478m570n680K681J4988k076K158J851J0015
$$ 161366 160030 144625 132967 127902 137380 132810 127130 129811 144799 142723 144881 146732 156747
11516A56747r08j2640j366l07q783j5822J219l185J326J1156k130N207P458L773
$$ 156747 155839 143199 141833 141526 132743 116921 118140 114955 116281 127437 125307 130514 137972 141745
11502A41745n961q950n540j129j1944R648J0280R509m436m005k888j2380Q524
$$ 141745 135784 126834 121294 120165 108221 117869 128149 137658 133222 129217 126329 113949 122473
11489A22473j305j3433L346R41K354M836j4014j989P046J408N948n694j471M522
$$ 122473 121168 107735 111081 112022 114376 119212 105198 103209 110255 111663 117611 111917 110446 114968
11475A14968L907J4632M369N513r024j1887j5012j8290n004l65j680J4494k24
$$ 114968 118875 133507 137876 143389 134365 122478 107466 89176 84172 83807 82127 96621 96397
11462I6397p517L827K8729q070j7031P074l779p283J544o124j367J2524l469N270
$$ 96397 88880 92707 121436 113366 96335 103409 99630 92347 93891 87767 86400 98924 95455 100725
11448A00725J1606l437n681j1777K057J556o511r693O887J0246j4172j0885K49
$$ 100725 112331 108894 103213 91436 93493 95049 88538 78845 85732 95978 81806 70921 71170
11435G1170N499R038L53J3797o327j4493j2219J1016J2128o741j401M838J700
$$ 71170 76669 85707 86060 99857 93530 79037 66818 77834 89962 83221 81820 86658 88358
11422H8358Q489P654l189K460J4840r15q520L282o604o162p978r955L502N360
$$ 88358 96847 104501 101312 103772 118612 117697 109177 112459 105855 99693 91715 81760 85262 90622
11408I0622O199N774P450P445j7133M972J2622Q275j9333M074j4756k883p628
$$ 90622 96821 102595 110045 117490 100357 105329 117951 126226 106893 110967 96211 93328 85700
11395H5700R84m822m105K537n58j1636N020J1443P108L069j1437J121o558j0611
$$ 85700 86684 81862 77757 80294 79736 68100 73120 84563 91671 94740 83303 84424 77866 67255
11381F7255L828l306r206j238M818l564N05P310J2187Q716m80L811M833j2714
$$ 67255 71083 67777 58571 57333 62151 58587 59092 66402 78589 87305 86825 90636 95469 82755
11367H2755l000R006K595O255J0185n519o670k0704J3104J6437k2264k1236K7010
$$ 82755 79755 88761 91356 97611 107796 102277 95607 74903 88007 104444 82180 60944 87954
11354H7954J5394r239q415j3482n327J4157J3701K474j0970L242j155j4651n224
$$ 87954 103348 94109 85694 72212 66885 81042 94743 97217 86247 89489 88334 73683 68459
11341F8459N854R803p662m926K445r673l050J1206L346j5685M794R375N970k6607
$$ 68459 74313 84116 76454 71528 73973 64300 61250 72456 75802 60117 64911 74286 80256 53649
11327E3649j6140P981J4518M381k728k632R862N957o45j8674J754L282n105n071
$$ 53649 37509 45490 60008 64389 61661 59029 68891 74848 74203 55529 57283 60565 55460 50389
11313E0389Q314O689P993j1807k2666l939J8540J082l760N663j580L147o749p824
$$ 50389 58703 65392 73385 61578 38912 34973 53513 54595 50835 56498 54918 58065 51316 43492
11299D3492K1219J8501j3186n86j1131r678j521L076r61M885j426m781K3679M464
$$ 43492 64711 83212 70026 69440 58309 48631 47110 50186 49225 54110 52684 47903 71582 76046
11285G6046k8841n361K2987j051j6526n131n447N598M181L876N949l987l785o691
$$ 76046 47205 41844 64831 63780 47254 42123 36676 42274 46455 50331 56280 52293 48508 41817
11271D1817m263M850L766R300k253L863k062j841J3541j4401k1669J875k512N79
$$ 41817 37554 42404 46170 55470 53217 57080 55018 53177 66718 52317 30648 32523 30011 30590
11257C0590K441p087L856O770Q370J701m161j1991j3211J784K0440J2855J0883
$$ 30590 33031 25944 29800 36570 44940 46641 42480 30489 17278 19062 39502 52357 63240
11244F3240j1025j1860P241R082j100L721O104n463j5789j8876m767k404J2269
$$ 63240 52215 40355 47596 56678 55578 59299 65403 59940 44151 25275 20508 18104 30373
11231C0373l853k166J329n827N002j4076j8947K299m857J307J49Q735J8665N826
$$ 30373 26520 24354 25683 19856 24858 10782 -8165 -5866 -10723 -9416 -9267 -532 18133 23959
11217B3959J3995l561J276q480q940L241O57J890J6641J2323p177j7190O521J2749
$$ 23959 37954 34393 35669 27189 18249 21490 22147 24037 40678 53001 45824 28634 35155 47904
11203D7904k672l700J3777m00n854k348j0853p9P768M150J185o828j0234K306
$$ 47904 45232 41532 55309 54909 49055 46707 35854 35775 43543 47693 48878 42050 31816 34122
11189C4122P070L23j1721r938J5245N320o06o768l665n663o643o497j6088k0019
$$ 34122 41192 41515 29794 19856 35101 40421 39815 33047 29382 23719 17076 10579 -5509 -25528
11175b5528J4048K0509L675P243N551j044q827r47K468l672p429N905J5836m111
$$ -25528 -11480 9029 12704 19947 25498 24454 15627 14680 17148 13476 6047 11952 27788 23677
11161B3677p083O671N055j3079j0451J1943K581J4904M898r374j1346o824R110
$$ 23677 16594 23265 28320 15241 4790 16733 19314 34218 39116 29742 18396 11572 20682
11148B0682N518n851j3666j87l121J66n439J4714m504k276J0805L534j2311r34
$$ 20682 26200 20349 6683 6496 3375 3541 -1898 12816 8312 6036 16841 20375 8064 7130
11134G130M319o114m980l800R912K379R829L838N885P035o790k0131k178O224
$$ 7130 11449 5335 355 -3445 6467 8846 18675 22513 28398 35433 28643 8512 6334 12558
11120A2558O796J17o976j1704j5368N45M302j2540J6305J1931l566j2465r96m908
$$ 12558 19354 19471 12495 791 -14577 -14032 -9730 -22270 -5965 5966 2400 -10065 -11061 -15969
11106a5969J0140J6181n211j697p764L789l006M96r469j8102J4J0288k424j490
$$ -15969 -5829 10352 5141 3444 -4320 -531 -3537 -3041 -12510 -30612 -30598 -20310 -22734 -24224
11092b4224J1570J4319K574j9804k387J0238K011M984r550o615R004K0333l59
$$ -24224 -12654 1665 4239 -15565 -17952 -7714 -5703 -719 -10269 -16884 -7880 12453 12094
11079A2094q266m53j277P97q27P241J018j3894j5720l813N625q704R597R376J8195
$$ 12094 3828 3375 2098 2895 2068 9309 10327 -3567 -19287 -23100 -17475 -26179 -16582 -7206 10989
11064A0989pj3347J621N954j5499j348O299j173p174J885J0901j0129j8558j441
$$ 10989 10982 -2365 -744 5210 -10289 -11637 -5338 -6511 -13685 -11800 -899 -11028 -29586 -31027
11050c1027J1513q474J900J4281J2840J7746J8282J174l08K498j1267j3019L843
$$ -31027 -19514 -27988 -26088 -11807 1033 18779 37061 38235 37927 40425 29158 16139 19982
11037A9982P29J1183O362M020L863J9244J229L588J5713j16L315n276p756J187
$$ 19982 20711 31894 38256 42276 46139 65383 66612 70200 85913 85797 89112 83836 76080 77267
11023G7267K682k975L858J2711R569o368n165J4759N280k0146j2995r176J225
$$ 77267 79949 76974 80832 93543 103112 96744 91579 106338 111618 91472 78477 69301 70526
11010G0526J8281J1564J3411k455k6077k7257k5488j5410r976l847j89m872J3940
$$ 70526 88807 100371 113782 111327 85250 57993 32505 17095 7119 3272 3083 -1789 12151
10997A2151O930Q052M400m254n943m575l0590k0352J6699j155k855J9330L719
$$ 12151 19081 27133 31533 27279 21336 16761 -13829 -34181 -17482 -18637 -21492 -2162 1557
10984A557n710Q633Q975q109Q8k873j1620l064J1457k93L464J9085m327k2042
$$ 1557 -4153 4480 13455 5346 5434 2561 -9059 -12123 -666 -959 2505 21590 17263 -4779
10970d779O439N388r332k098p51r261q646r137j3850l767Q540P946o972L342K6053
$$ -4779 1660 7048 -2284 -4382 -5133 -14394 -23040 -32177 -46027 -49794 -41254 -33308 -40280 -36938 -10885
10955a0885K719r097m960J2746M116p741j169m173k23J588j9476J2385J0413j3675
$$ -10885 -8166 -17263 -22223 -9477 -5361 -13102 -14271 -18444 -18667 -17079 -36555 -24170 -13757 -27432
10941b7432M126j1047P363L744N017k09K309J3828o827j7740K490O769k55j041
$$ -27432 -23306 -34353 -26990 -23246 -18229 -18438 -16129 -2301 -9128 -26868 -24378 -17609 -17864 -18905
10927a8905p369m254j863j368O147q258r148j838L787L087L480J1239k12o767
$$ -18905 -26274 -30528 -32391 -33759 -27612 -35870 -45018 -46856 -43069 -39982 -36502 -25263 -25475 -32242
10913c2242p129J0487J1554j0031p655K383m715J4744J506J711k992J904n734
$$ -32242 -39371 -28884 -17330 -27361 -35016 -32633 -37348 -22604 -21098 -19387 -22379 -20475 -26209
10900b6209J196M226k0444Q004J7943j4479M69N487m582n780o565j0227m276R022
$$ -26209 -25013 -20787 -41231 -33227 -15284 -29763 -29294 -23807 -28389 -34169 -40734 -50961 -55237 -46215
10886d6215O079q342J1173M363L57J03o361r329o820J0696Q126q069m294j4394
$$ -46215 -40136 -48478 -37305 -32942 -32585 -32482 -38843 -48172 -54992 -44296 -36170 -44239 -48533 -62927
10872f2927j1407J429n088J948K169J9044L472n188j0696Q607J6344R027k623
$$ -62927 -74334 -72905 -77993 -76045 -73876 -54832 -51360 -56548 -67244 -58637 -42293 -33266 -35889
10859c5889k08L797l841o389O65q11j153l270L29L332m302r428J6357J8286j013
$$ -35889 -36097 -32300 -36141 -42530 -41865 -42676 -43829 -47099 -46770 -43438 -47740 -57168 -40811 -22525 -23538
10844b3538o212o171j0036o661J3903J022k4349n456J0743K866M845r217J9605
$$ -23538 -29750 -35921 -45957 -52618 -38715 -37693 -62042 -67498 -56755 -53889 -49044 -58261 -38656
10831c8656j25j0768j4641J6859Q113O790j2225k893l093r451M451J4129p649
$$ -38656 -38781 -49549 -64190 -47331 -39218 -32428 -44653 -47546 -50639 -60090 -55639 -41510 -49159
10818d9159l319l118l127j2743k210K326J3821J279q040k571P027N963L828O268
$$ -49159 -52478 -55596 -58723 -71466 -73676 -71350 -57529 -56250 -64290 -66861 -59834 -53871 -50043 -43775
10804d3775k1717K657l837p013M479O636m901p321k164O757P106M625N649j297
$$ -43775 -65492 -62835 -66672 -73685 -69206 -62570 -67471 -74792 -76956 -70199 -63093 -58468 -52819 -54116
10790e4116K931L508O479j1452j4436r550J675Q573M245j1920n644O300j606j3222
$$ -54116 -51185 -47677 -41198 -52650 -67086 -76636 -74961 -66388 -62143 -74063 -79707 -73407 -75013 -88235
10776h8235K932j3947m942J3014J4989j2702k574m220p580q941p287M328J7588
$$ -88235 -85303 -99250 -104192 -91178 -76189 -88891 -91465 -95685 -103265 -112206 -119493 -115165 -97577
10763i7577L703j6793N944p79R788JQ954m73m167m587l28m023J7336k743k591
$$ -97577 -93874 -110667 -104723 -105502 -95714 -95713 -86759 -87232 -91399 -95986 -96314 -100337 -83001 -85744 -88335
10748h8335q28J6188Q448J30k1354n414J3334M237J759j1593k1777j0830J2144
$$ -88335 -89163 -72975 -64527 -64397 -85751 -91165 -77831 -73594 -71835 -83428 -105205 -116035 -103891
10735a03891J7477K385j1687k627L98J6407K3301p253p655j1745j5832O33j114
$$ -103891 -86414 -84029 -95716 -98343 -97945 -81538 -58237 -65490 -73145 -84890 -100722 -100089 -101203
10722a01203J0867O836q645m39k035O089O418m331j1173j6047q074K841J9973
$$ -101203 -90336 -83500 -92145 -92584 -94619 -88530 -82112 -86443 -97616 -113663 -121737 -118896 -98923
10709i8923O588o295J579j2234O932o003l227L176Q81m494K103j2372l202O780
$$ -98923 -92335 -98630 -97051 -109285 -102353 -108356 -111583 -108407 -107526 -112020 -109917 -122289 -125491 -118711
10695a18711j035J2510J4952p92o644l540n561j964Q428L009k139j0581N114M330
$$ -118711 -119746 -107236 -92284 -93076 -99720 -103260 -108821 -110785 -102357 -99348 -101487 -112068 -106954 -102624
10681a02624P309j3457j1928m41p33j1786j1790k700O101o868J015N412j654o858
$$ -102624 -95315 -108772 -120700 -121141 -121874 -133660 -145450 -148150 -142049 -148917 -147902 -142490 -144144 -151002
10667a51002o417o038J6550m429K856L268N161R39n328L270j0294l542J1577j8172
$$ -151002 -157419 -163457 -146907 -151336 -148480 -145212 -140051 -139112 -144440 -141170 -151464 -155006 -143429 -161601
10653a61601l205J5709o676r617q080J3787K0916R1j952k886j3119L428K969Q232
$$ -161601 -164806 -149097 -155773 -165390 -173470 -159683 -138767 -138676 -140628 -143514 -156633 -153205 -150236 -142004
10639a42004J2785N222Q87K7626O718K043J6159L7325K5674L5125L3603L9386
$$ -142004 -129219 -123997 -123110 -95484 -88766 -86723 -70564 -33239 -7565 27560 61163 100549
10627A00549L4861M6845M4974O9396P3041J20290J95706K57251L43010M75524
$$ 100549 135410 182255 227229 296625 369666 489956 685662 942913 1285923 1761447
10617A761447O50874Q50637J000700J016033Q02418M01890N3527j52207k00585
$$ 1761447 2412321 3262958 4263658 5279691 6082109 6483999 6537526 6385319 6184734
10608F184734q1114J83634N76881J037912J547562J954322J950629J366776L91552
$$ 6184734 6103620 6287254 6864135 7902047 9449609 11403931 13354560 14721336 15112888
10599A5112888n09970r94126j022255o97408j72699M96048J234647J948398K445318
$$ 15112888 14602918 13608792 12586537 11889129 11716430 12212478 13447125 15395523 17840841
10590A7840841K325421J330075j85821j492325k133790k101297j687231j079333
$$ 17840841 20166262 21496337 21310516 19818191 17684401 15583104 13895873 12816540
10582A2816540m01579K56541Q21163J179991J046864L14950o99859j479114j787709
$$ 12816540 12414961 12671502 13492665 14672656 15719520 16034470 15334611 13855497 12067788
10573A2067788j711096j363550r44571n26051j78634R2638K28153J38862j80682
$$ 12067788 10356692 8993142 8048571 7522520 7343886 7436524 7664677 7803539 7622857
10564G622857n57984q41614r67835r37940q07324o32959n03777l83188k85423
$$ 7622857 7064873 6223259 5255424 4317484 3510160 2877201 2373424 1990236 1704813
10555A704813k17567j69262j48152j30845r6742o9854o8371n5452m3389n2908
$$ 1704813 1487246 1317984 1169832 1038987 942245 872391 804020 748568 705179 652271
10545F52271n7746l1825k1136l2675k8248j9564j6810j7567j1212k3726j7559
$$ 652271 594525 562700 541564 508889 480641 461077 444267 426700 415488 391762 374203
10534C74203r888j8213k8321r37J9154n24j2770k7279j3079k1263j5455K557r759
$$ 374203 364315 346102 317781 316844 335998 335474 322704 295425 282346 261083 245628 248185 238426
10521B38426j9311p483r069j6258j6240J496J8813k291k2399m231J6965J4584
$$ 238426 219115 211632 202563 186305 170065 171561 190374 188083 165684 161453 178418 193002
10509A93002j7753n473J101j5649k4978l553M241O242L109j4791r084p567O932
$$ 193002 175249 169776 170877 155228 130250 126697 130938 137180 140289 125498 116414 108847 115779
10496A15779n905m266O362M391o05Q636P420j820R64k0529K082M233J7395j1500
$$ 115779 109874 105608 111970 116361 115756 124392 131812 129992 130956 110427 112509 116742 134137 122637
10482A22637k6952k0631Q703Q138m42O106L596k8781o390q693J0377P120q923
$$ 122637 95685 75054 83757 91895 91453 97559 101155 72374 65984 57291 67668 74788 65865
10469F5865k420k504J405k192Q229Q045Q378j676R032O88l079l286o483j6757
$$ 65865 63445 60941 62346 60154 68383 76428 84806 83130 92162 92850 89771 86485 80002 63245
10455F3245l039R164j0618j0985M595J1230N24k17P50J1113k604l197M837k114
$$ 63245 60206 69370 58752 47767 52362 63592 64116 63899 64649 75762 73158 69961 74798 72684
10441G2684k5151o704P816J4560j4604j2288o172Q603l825o613j5275J4452J4141
$$ 72684 47533 40829 48645 63205 48601 36313 30141 38744 34919 28306 13031 27483 41624
10428D1624m519r272n69l342J0227J0215P14J749j1713q857J0221J941k5607m207
$$ 41624 37105 27833 27264 23922 34149 44364 45078 46827 35114 26257 36478 38419 12812 8605
10414H605L407N979K2288l034j099L656j2498J26j5311j427j0717M289Q641K138
$$ 8605 12012 17991 40279 37245 36146 39802 27304 27430 12119 10692 -25 4264 12905 15043
10400A5043l170r055j4682l686J0868J8879j519k1801o83n68j458m549K209L393
$$ 15043 11873 2818 -11864 -15550 -4682 14197 12678 -9123 -9806 -10374 -11832 -16381 -14172 -10779
10386a0779L148j4145o249j3979L112J4167N377l687J51J2831J0721j0622O17
$$ -10779 -7631 -21776 -28025 -42004 -38892 -24725 -19348 -23035 -22884 -10053 668 -9954 -9337
10373i337j633P961p39j1653q8O206j2724P29L259O284L452n164J51Q920m155
$$ -9337 -10970 -3009 -3748 -15401 -15489 -9283 -22007 -21278 -18019 -11735 -8283 -13447 -13296 -4376 -8531
10358h531j4188q723j391k792J247k913L078J3986k131j537r842k165k210q430
$$ -8531 -22719 -31442 -32833 -35625 -34378 -37291 -34213 -20227 -22358 -23895 -33737 -35902 -38112 -46542
10344d6542R237M41M367J8565k841j7706o647p114m094R943P298j404j5632j766
$$ -46542 -37305 -36864 -32497 -13932 -16773 -34479 -41126 -48240 -52334 -42391 -35093 -36497 -52129 -53895
10330e3895O794K9486O337M522m163j9024j2839J1591J2130R377J7919k2444j3387
$$ -53895 -47101 -17615 -11278 -6756 -10919 -29943 -42782 -31191 -19061 -9684 8235 -14209 -27596
10317b7596n764k247M460Q267p271j787m474j3893j1783R8J1127M137pJ004J139
$$ -27596 -33360 -35607 -31147 -22880 -30151 -31938 -36412 -50305 -62088 -61990 -50863 -46726 -46733 -45729 -44590
10302d4590O181M212K08K229r975o195N668N371p008Q1k935M117J2519K852Q759
$$ -44590 -38409 -34197 -33989 -31760 -41735 -47930 -42262 -36891 -43899 -43818 -46753 -42636 -30117 -27265 -18506
10287a8506j244j3582k87M874m278j8485K313k877j773r14L280O752O961J863
$$ -18506 -19750 -33332 -33619 -28745 -33023 -51508 -49195 -52072 -53845 -54759 -51479 -44727 -37766 -35903
10273c5903k495p782j1173P032o819j621J6721J8140L016J06k9921k2343P348
$$ -35903 -38398 -46180 -57353 -50321 -57140 -58761 -42040 -23900 -20884 -20778 -50699 -73042 -65694
10260f5694K0012Q85N701l275j0455j0350P853L230q284M94k607p910j0629L258
$$ -65694 -45682 -44797 -39096 -42371 -52826 -63176 -55323 -52093 -60377 -59883 -62490 -70400 -81029 -77771
10246g7771P512R562J3081q176p632P16j2381j3655j881J7474Q055o744J0681
$$ -77771 -70259 -60697 -47616 -55792 -63424 -62708 -75089 -88744 -90625 -73151 -65096 -71840 -61159
10233f1159M44l23j876P235l958j0017l458J4139K816L210m513k44k0736K376
$$ -61159 -60715 -61038 -62914 -55679 -59637 -69654 -73112 -58973 -56157 -52947 -57460 -57704 -78440 -76064
10219g6064K15j958O62R397m6Q84K85Q218j5726o821Q609R153l053j40n276K603
$$ -76064 -75849 -77807 -77145 -67748 -67794 -66910 -66625 -58407 -74133 -80954 -72345 -63192 -66245 -66385 -71661 -69058
10203f9058J4959M009J2670K2993L726J8339L1016K5978K1864L6012O7229R2355
$$ -69058 -54099 -50090 -37420 -14427 -10701 7638 38654 64632 86496 122508 189737 282092
10191B82092J16752J43991J67413J93085J94175J37625j1660j20918j61696j83092
$$ 282092 398844 542835 710248 903333 1097508 1235133 1223473 1102555 940859 757767
10181G57767j64677j26799j02583p7542o1583l7893j9218k5301j4370k3201k8885
$$ 757767 593090 466291 363708 286166 224583 186690 167472 142171 127801 104600 75715
10170G5715r656j6959j0409j710K783M64j4659L325p791q006P639j4399q373p058
$$ 75715 66059 49100 38691 36981 39764 40228 25569 28894 21103 13097 20736 6337 -2036 -9094
10156i094P893O176l480J0451K0092p479q875L048j163k1121L38O482m648j0224
$$ -9094 -1201 4975 1495 11946 32038 24559 15684 18732 17569 -3552 -3214 3268 -1380 -11604
10142a1604P89M884j023J5666r122j8930j3771j7102J593j692P821P597J73m102
$$ -11604 -10815 -5931 -6954 8712 -410 -19340 -33111 -50213 -48620 -50312 -42491 -34894 -34721 -38823
10128c8823j3991M18r433j5153j2901k528J0079r847r399Q88J1982J8576l502
$$ -38823 -52814 -52396 -61829 -76982 -89883 -92411 -82332 -92179 -101578 -100690 -88708 -70132 -73634
10115g3634j7846p908K0719P651o028j953j1547j9567L353P418J1706k792J73
$$ -73634 -91480 -99388 -78669 -71018 -77046 -78999 -90546 -110113 -106760 -99342 -87636 -90428 -90255
10102i0255M46J1186L9907P22J570R413J5327R702k8892k7853j0974r803j5314
$$ -90255 -89809 -78623 -38716 -37994 -36424 -27011 -11684 -1982 -30874 -58727 -69701 -79504 -94818
10089i4818k49j23j87Q420O712J070j5323n952Q302R771j3470j185q5k4448j4475
$$ -94818 -95067 -95190 -95377 -86957 -80245 -79175 -94498 -100450 -92148 -82377 -95847 -97032 -97117 -121565 -136040
10074a36040j0531O118Q977J4294m788j2814p882k59p23J814M43j8302r33K4717
$$ -136040 -146571 -140453 -131476 -117182 -121970 -134784 -142666 -142925 -143648 -141834 -141391 -159693 -160626 -135909
10060a35909P147R053j2229L520O250Q90j305J1356l541l501p138l218J866o251
$$ -135909 -128762 -119709 -131938 -128418 -122168 -121278 -122583 -111227 -114768 -118269 -125407 -128625 -126759 -133010
10046a33010R382J6446J7550J9231K9322L3954K4327K0302P692k6166k9941k6650
$$ -133010 -123628 -107182 -89632 -70401 -41079 -7125 17202 37504 45196 19030 -10911 -37561
10034c7561k2972j6690j1114k7881k279P099q314j5781k48l291j2657k175J8514
$$ -37561 -60533 -77223 -88337 -116218 -118497 -111398 -119712 -135493 -135741 -139032 -151689 -153864 -135350
10021a35350J7814l914r648q648m939j3771P085J1525l08n240J2763J860l111
$$ -135350 -117536 -121450 -131098 -139746 -144685 -158456 -151371 -139846 -140154 -145394 -132631 -130771 -133882
10008a33882o688j6106k038J2250P222m281j2107j2925j0931J0967J5137N337
$$ -133882 -140570 -156676 -158714 -146464 -139242 -143523 -155630 -168555 -179486 -168519 -153382 -148045
9996a48045o342k3455j523L04O625J2077R55N18k3051j4527J1402N906K1321J0754
$$ -148045 -154387 -177842 -179365 -179061 -172436 -160359 -159404 -158886 -181937 -196464 -185062 -179156 -157835 -147081
9982a47081p567j3249o325j9394j2528j5880j1572j6001j2406O185l369n611Q885
$$ -147081 -154648 -167897 -174222 -193616 -206144 -222024 -233596 -249597 -262003 -255818 -259187 -264798 -255913
9969b55913J2929P355L951p176r795M566J0313p842p185l797K636J803o14n67
$$ -255913 -242984 -235629 -231678 -238854 -248649 -244083 -233770 -241612 -248797 -252594 -249958 -248155 -248769 -249336
9955b49336J918q275J605o136j4200n605o802n181j2091j3798q057K994L531J215
$$ -249336 -247418 -255693 -254088 -260224 -274424 -280029 -286831 -292012 -304103 -317901 -325958 -322964 -319433 -318218
9941c18218J2407L3222J4454M072l736q544N377Q368J0709J9034J4641O778n121
$$ -318218 -305811 -272589 -258135 -254063 -257799 -266343 -260966 -252598 -241889 -222855 -208214 -201436 -206557
9928b06557m442j0070o206J4635J5778J4096J6813K4116M90J7353j38K873N863
$$ -206557 -210999 -221069 -227275 -212640 -196862 -182766 -165953 -141837 -141347 -123994 -124132 -121259 -115396
9915a15396o591l7446o9218l2340M8739N0488K3476p787j9661j2046k0942k9034
$$ -115396 -121987 -159433 -228651 -260991 -212252 -161764 -138288 -146075 -165736 -177782 -198724 -227758
9903b27758O183n812j2643k6953j2989j4295l71K391o331j7348O51J3297J0130
$$ -227758 -221575 -227387 -240030 -266983 -279972 -294267 -294638 -292247 -298578 -315926 -315275 -301978 -291848
9890b91848R489J959R574J0879J0449k1909J3285L082j5455K41n380n813p633
$$ -291848 -282359 -280400 -270826 -259947 -249498 -271407 -258122 -255040 -270495 -270254 -275634 -281447 -289080
9877b89080j362q603L561Q77J2729o103j3315r855L7K3883N065n975n61K0473
$$ -289080 -290442 -299045 -295484 -294607 -281878 -287981 -301296 -311151 -311114 -287231 -282166 -288141 -288702 -268229
9863b68229J3119Q443n070k383R786J6142J1791M722J1726Q885M365L028j226
$$ -268229 -255110 -246667 -251737 -254120 -244334 -228192 -216401 -211679 -199953 -191068 -186703 -183675 -184901
9850a84901K244N461J5434K5821N389k628r281R533N359L684N298R240K7767K8592
$$ -184901 -182657 -177196 -161762 -135941 -130552 -133180 -142461 -132928 -127569 -123885 -118587 -109347 -81580 -52988
9836e2988J9431K7955K8026K3550K3421K1277L0617L7917K4453L7633N3457N1858
$$ -52988 -33557 -5602 22424 45974 69395 90672 121289 159206 183659 221292 274749 326607
9824C26607O2910O5894Q0120R2842J29911J42902J52964J83074J78360J91195
$$ 326607 389517 455411 535531 628373 758284 901186 1054150 1237224 1415584 1606779
9814A606779K20594K66403L01296L67697M62827N33744O51267P29559P02785O44754
$$ 1606779 1827373 2093776 2395072 2762769 3225596 3759340 4410607 5140166 5842951 6487705
9804F487705O69457P61359R63573J243753J610611K098488K697722L456232M385704
$$ 6487705 7157162 7918521 8882094 10125847 11736458 13834946 16532668 19988900 24374604
9795B4374604N578483P371119J0136708J4414502K0762921K9632768M0634253
$$ 24374604 29953087 37324206 47460914 61875416 82638337 112271105 152905358
9788A52905358N0367068M9051267K6183370p696288l2252852m1772353m0391808
$$ 152905358 203272426 252323693 278507063 270810775 238557923 196785570 156393762
9781A56393762l3705665k5952110j9429724j4566518j1094583q646276o867880
$$ 156393762 122688097 96735987 77306263 62739745 51645162 42998886 36131006
9774C6131006n504952m409633l500530k773353k194242j703927j342157j071301
$$ 36131006 30626054 26216421 22715891 19942538 17748296 16044369 14702212 13630911
9766A3630911q60904p65869p59098q06392q24496p79929o88225o14802n24841
$$ 13630911 12770007 12004138 11245040 10438648 9614152 8834223 8145998 7531196 7006355
9757G006355m56218l97820l32612k99374k59213k31813k41015k18217j94422j67504
$$ 7006355 6550137 6152317 5819705 5520331 5261118 5029305 4788290 4570073 4375651 4208147
9747D208147j58067j66931j62061j49960j35376j29696j30504j18091r1107j00552
$$ 4208147 4050080 3883149 3721088 3571128 3435752 3306056 3175552 3057461 2966354 2865802
9737B865802q2854p9524p1410p8521q5023p8550o3903o2534p2905o0170l7852
$$ 2865802 2782948 2703424 2632014 2553493 2468470 2389920 2326017 2263483 2190578 2130408 2092556
9726B092556o7644q4337n5621l4388n4373n5053l7060k5673m1040m6504m9314
$$ 2092556 2024912 1940575 1884954 1850566 1796193 1741140 1704080 1678407 1637367 1590863 1541549
9715A541549l0748j7568j2823j5441k5535j9950j4772l3114k4906j5187p118k8002
$$ 1541549 1510801 1493233 1480410 1464969 1439434 1419484 1404712 1371598 1346692 1331505 1324387 1296385
9703A296385k8102k5670k2404l7609k6900m326p657P299P65k3830j9042r526k2736
$$ 1296385 1268283 1242613 1220209 1182600 1155700 1151374 1143717 1151016 1151781 1127951 1108909 1099383 1076647
9690A076647k4980j7970j6983k6108j7647j5921l2203k6684N209J7293o196q914
$$ 1076647 1051667 1033697 1016714 990606 972959 957038 924835 898151 903360 920653 914457 905543
9678I05543Q62j9707k651l134j4792p277P376K667J273Q713j711j6699J3804K8477
$$ 905543 906405 886698 884047 880913 866121 858844 866220 868887 870160 878873 877162 860463 874267 902744
9664I02744K7620L5772L6442M7819N3174P780k4461l3267l2063k4904L0855N8678
$$ 902744 930364 966136 1002578 1050397 1103571 1111351 1086890 1053623 1021560 996656 1027511 1086189
9652A086189Q4192P8982p498p4260r4853r2604j02891p6064n2695j8108k6431
$$ 1086189 1170381 1249363 1241865 1167605 1072752 980148 877257 801193 748498 730390 703959
9641G03959l5657l1550j8623l254J258K215o33m529J3953J8318q56R648m35N110
$$ 703959 668302 636752 618129 614875 616133 618348 617715 613186 627139 645457 644601 654249 653814 658924
9627F58924J520j6450r044j5375k1547k230j4943J0795m692r120k0656p433J842
$$ 658924 660444 643994 634950 619575 598028 595798 580855 591650 586958 577838 557182 549749 551591
9614E51591j84k095j7655p949O309K43j4077j7286n806j0704j6056M634J5711
$$ 551591 551407 549312 531657 523708 530017 530260 516183 498897 493091 482387 466331 470965 486676
9601D86676P611J964O111r714O439N829n219k8740m3423l1761j6080J228K432
$$ 486676 494287 496251 502362 492648 499087 504916 499697 470957 427534 395773 379693 380921 383353
9588C83353L771J5131J4100J794j6402j9285m802l425k0085j0941J4053P589l745
$$ 383353 387124 402255 416355 418149 401747 382462 377660 374235 354150 343209 357262 364851 361106
9575C61106M289q115n61J3469j5258j5400j4850J294J062J1185o592r480p768
$$ 361106 365395 357280 356719 370188 354930 339530 324680 325974 327036 338221 331629 322149 314381
9562C14381J4366p10j4140r477j1456M601J1170l71L298M096M529O148l023R819
$$ 314381 328747 328037 313897 304420 292964 297565 308735 308364 311662 315758 320287 326435 323412 333231
9548C33231P975N955J0928j4575N606L076j228l712N409N759J2444l132J1206
$$ 333231 341206 347161 358089 343514 349120 352196 350968 347256 352665 358424 370868 367736 378942
9535C78942K6704L3687L5479J7933o953l0021l5248k3635j1763k1577j3860j683
$$ 378942 405646 439333 474812 492745 485792 455771 420523 396888 385125 363548 349688 348005
9523C48005o102k3300j3879k378P712n008k2101j4629K419J0981N608N944K716
$$ 348005 341903 318603 304724 302346 310058 305050 282949 268320 270739 281720 287328 293272 295988
9510B95988j0057p706Q258M56k09j103J0964r719o834K4350J0165p609p594l738
$$ 295988 285931 278225 286483 286939 286730 285627 296591 286872 280038 304388 314553 306944 299350 295612
9496B95612j7954l0651r352m853n870P137j864j5915p346Q864j1530o046J974
$$ 295612 277658 247007 237655 232802 226932 234069 232205 216290 208944 217808 206278 200232 202206
9483B02206J023J1419Q661j5162P747j0655j2501j0613K998M252R345o533K641
$$ 202206 203229 214648 223309 208147 215894 205239 192738 182125 185123 189375 198720 192187 194828
9470A94828J0257J8437J2524m447j1635J748M135m040l584R877J2770J391k73
$$ 194828 205085 223522 236046 231599 219964 221712 225847 221807 218223 228100 240870 242261 241988
9457B41988n383p050k041m977k2830n353K2453J3537L049k9809j0496J70M649
$$ 241988 236605 229555 227514 222537 199707 194354 216807 230344 233393 203584 193088 193258 197907
9444A97907K0219L640J511j784K042j5540n362R770j1493p553P318m404K862J69
$$ 197907 218126 221766 223277 221493 223535 207995 202633 212403 200910 193357 200675 196271 199133 199302
9430A99302P292L536j1351o466J2867J7182K753j0550O2r253j3861j517P77L395
$$ 199302 206594 210130 198779 192313 205180 222362 225115 214565 214627 205374 191513 189996 190773 194168
9416A94168P695M519Q330m513r016l597l183R483J8294L58Q285K162Q7p028J823
$$ 194168 201863 206382 214712 210199 201183 197586 194403 203886 222180 222538 230823 232985 233072 226044 227867
9401B27867m937k305O356N416R637j284O260J2021L1004J7379J5102K9752M8024
$$ 227867 222930 220625 226981 232397 242034 240750 247010 259031 290035 307414 322516 352268 400292
9388D00292L4507N6571R1673J35266J76484K13229K18949J58390L3369r0142j50522
$$ 400292 434799 491370 583043 718309 894793 1108022 1326971 1485361 1518730 1428588 1278066
9377A278066j71536j71319j42141j11771j04973q8674o8493l5407j9474k2309
$$ 1278066 1106530 935211 793070 681299 576326 487652 419159 383752 364278 341969
9367C41969l0195k4800j4330L094m193r999j0212l015j5582k098j0031j8697j1454
$$ 341969 311774 286974 272644 275738 271545 261546 251334 248319 232737 230639 220608 201911 190457
9354A90457Q098l11K934R82J936j1002k0474k335j0847m679J3935J1383m77j798
$$ 190457 198555 198244 201178 202160 204096 193094 172620 170285 159438 154759 168694 180077 179600 177802
9340A77802k024m14N433n221n194Q19P473R209J5846J0400j7409j5340l370q897
$$ 177802 175778 175364 180797 175576 170382 171201 178674 187883 203729 214129 196720 181380 178010 169113
9326A69113j5980j5444J859K0280N63n307P869j8471j9573q50J6586J4132%n401
$$ 169113 153133 137689 139548 159828 160391 155084 162953 144482 124909 124059 140645 154777 154777 149376
9312A49376j3734P97m394L912r171k073N899J0714Q991l568l869r263K536M680
$$ 149376 135642 136439 132045 135957 126786 124713 130612 141326 150317 146749 142880 133617 136153 140833
9298A40833K2661J7241n607k4887j5312L68j9606j5124R894N943j786k346J7571
$$ 140833 163494 180735 175128 150241 134929 135297 115691 100567 110461 116404 114618 112272 129843
9285A29843J3981K3K0630J2822j2923j1120m733j4873l232J3960Q797j1247j6019
$$ 129843 143824 143847 164477 177299 164376 153256 148523 133650 130418 144378 153175 141928 125909
9272A25909j0138N388R491M021o271J3196M683m298K511j3736j6725l164k095
$$ 125909 115771 121159 130650 134671 128400 141596 146279 141981 144492 130756 114031 110867 108772
9259A08772O138L374m487M983L157M667N165N112J1933j2732j9575j9478m298
$$ 108772 114910 118284 113797 118780 121937 126604 131769 136881 148814 136082 116507 97029 92731
9246I2731o267J640j2810P938o448q441K3226J4088o430J3197J2387j2986j0839
$$ 92731 86464 88104 75294 83232 76784 68343 91569 105657 99227 112424 124811 111825 100986
9233A00986L728N387l74j9549j057R471r846k5247m598K2789J9919N277L820J1266
$$ 100986 104714 110101 109727 90178 89121 98592 88746 63499 58901 81690 101609 106886 110706 121972
9219A21972L520m26L998k3319j5497L789K4685J2585K574J163j0027q033o009
$$ 121972 125492 125066 129064 105745 90248 94037 118722 131307 133881 135044 125017 116984 110975
9206A10975M822P532J7891r484k0153n886J3889Q542j2411r678j5425M446P600
$$ 110975 115797 123329 141220 131736 111583 105697 119586 128128 115717 106039 90614 95060 102660
9193A02660K144J1879Oj2709j2543M210J1012j3580l514O245O258m917j0987Q139
$$ 102660 104804 116683 116689 103980 91437 95647 106659 93079 89565 95810 102068 97151 86164 94303
9179I4303R681J0675J0582l595k2443p094j872N669K105O508Q105P888O253n158
$$ 94303 103984 114659 125241 121646 99203 92109 90237 95906 98011 104519 112624 120512 126765 121607
9165A21607p235r068j739J171J5509j2567L759j4754P989J1903j4379j887J1996
$$ 121607 114372 105304 103565 104736 120245 107678 111437 96683 104672 116575 102196 100309 112305
9152A12305j5613Q76K9970J3664j298k0906l3839o207m764J394N955J1704M168
$$ 112305 96692 97568 127538 141202 139904 118998 85159 78952 74188 75582 81537 93241 97409
9139I7409Q748J512q128j2812P408m187J3801O705r791P742J908J0467j8916q419
$$ 97409 106157 107669 99541 86729 94137 89950 103751 110456 100665 108407 110315 120782 101866 93447
9125I3447O946L781Q329o027k7884q261K0660J5808j8443j304K978j0647r584
$$ 93447 100393 104174 112503 106476 78592 70331 90991 106799 88356 87052 90030 79383 69799
9112F9799N850M227o279K888J1252O361p679N27m48Q207L049k818r274n005J561
$$ 69799 75649 79876 73597 76485 87737 94098 86419 86946 86498 94705 97754 94936 85662 80657 82218
9097H2218J3757O388n166j0354p990N954k127N167K3683K111k1337j4851J1507
$$ 82218 95975 102363 97197 86843 78853 84807 82680 87847 111530 113641 92304 77453 88960
9084H8960K6570m252o655M821j6498O648R086K9793Q776l2133j9628j2548Q157
$$ 88960 115530 111278 104623 109444 92946 99594 108680 138473 147249 115116 95488 82940 91097
9071I1097k757r883n930N124P692J1492K293n980M601R609J4636p054j5468J2881
$$ 91097 88340 78457 72527 77651 85343 96835 99128 93148 97749 107358 121994 114940 99472 112353
9057A12353P968q222L41J4856P752m762j7169n386r6O0Q398L821m727o123M298
$$ 112353 120321 112099 112440 127296 135048 130286 113117 107731 107635 107695 116093 119914 115187 109064 113362
9042A13362K212O402p903r158j39J4918n266k215N32l876n158q544m165m644j899
$$ 113362 115574 121976 114073 104915 104776 119694 114428 112213 112745 108869 103711 95167 91002 86358 84459
9027H4459Q652q346l093J6867J7640O005k033n071l944Q65O573q559j1661J5149
$$ 84459 93111 84765 81672 98539 116179 122184 120151 115080 111136 112001 118574 110015 98354 113503
9013A13503J2615k132r825K475j929r950q634M396j4909J390m606n718K6069M396
$$ 113503 126118 123986 114161 116636 114707 104757 96123 100519 85610 87000 82394 76676 102745 107141
8999A07141j2458n050O250K482r445R055J4936o110o230j9190p134K314O541j3163
$$ 107141 94683 89633 95883 98365 88920 97975 112911 106801 100571 81381 74247 76561 83102 69939
8985F9939J129J5176l097k799o802k401o55j384j9001Q515J8864O196k581j800
$$ 69939 71068 86244 83147 80348 73546 71145 70490 69106 50105 58620 77484 83680 81099 79299
8971G9299J06m845j1754J807J2675J2636Q531N099j9920j4753l373n710N0p226
$$ 79299 79405 74560 62806 64613 77288 89924 98455 103554 83634 68881 65508 59798 59848 52622
8957E2622j6905j5186O220J4935j9132N567R751J2254J7172L034l063K7775J9496
$$ 52622 35717 20531 26751 41686 22554 28121 37872 50126 67298 70332 67269 95044 114540
8944A14540j3162j6898m49o70J1360m889O424N26L472J448j1603j674r460j085
$$ 114540 101378 84480 84031 83361 94721 89832 96256 96782 100254 101702 90099 88425 78965 77880
8930G7880M088P905j1630J37N027M59j495j0939J0134p462j4518J6547n003J1702
$$ 77880 81968 89873 78243 78380 83407 83866 82371 71432 81566 74104 59586 76133 71130 82832
8916H2832J3498o221m94p592q359r051J1255J5010j549L022p158O832j510j17
$$ 82832 96330 90109 89615 82023 73664 64613 75868 90878 89329 92351 85193 92025 90515 90398
8902I0398k1458k2139P589N980J168o454o09k279o001j082J0124K3146n044m954
$$ 90398 68940 46801 54390 60370 61538 55084 54475 52196 46195 45113 55237 78383 73339 68385
8888F8385J9067R458p203k3266n201O052Q958l671p638m657l272k575j5636j5914
$$ 68385 87452 96910 89707 66441 61240 67292 76250 72579 64941 60284 57012 54437 38801 22887
8874B2887J0273N787J9406K2013N456K116Q746j4932q119P173N757j0096j6396
$$ 22887 33160 38947 58353 80366 85822 87938 96684 81752 73633 80806 86563 76467 60071
8861F0071L651J5478J0439j2458j4364Q711J3635j5277r418l852N806P572q416
$$ 60071 63722 79200 89639 77181 62817 71528 85163 69886 60468 56616 62422 69994 61578
8848F1578R8J35P450j2564j0679K300J1965J0866O930j087l625Q860j593M668
$$ 61578 61676 61811 69261 56697 46018 48318 60283 71149 78079 76992 73367 82227 80634 85302
8834H5302j0985o964l120R074p54o674JJ1172J2875o107k5872j7194Q69J3619
$$ 85302 74317 67353 64233 73307 72553 65879 65880 77052 89927 83820 57948 40754 41623 55242
8820E5242J851J881Q449n727J684K3432M429j3278J59o421r896m856J2002m369
$$ 55242 57093 58974 67423 61696 63380 86812 91241 77963 78122 71701 61805 56949 68951 64582
8806F4582r259n736R6J429J1773j4549k528J6209Q042R801m876p110K0585P22
$$ 64582 55323 49587 49683 51112 62885 48336 45808 62017 70059 79860 74984 67874 88459 89181
8792H9181j0212j3159K59m925J010J2511J722n568m153J1403N900o508j0591k266
$$ 89181 78969 65810 66069 61144 62154 74665 76387 70819 66666 78069 83969 77461 66870 64604
8778F4604r032J899j2040P333p020j1310m16L225P229K1268K457j3832J0168P177
$$ 64604 55572 57471 45431 52764 45744 34434 34018 37243 44472 65740 68197 54365 64533 71710
8764G1710p168j2689P797m971j0170p853L653Q485J58j4766j158L907J0542K1986
$$ 71710 64542 51853 59650 54679 44509 36656 40309 48794 48952 34186 33028 36935 47477 69463
8750F9463q07N70J2229L940J3333m716k0551j8162L739Q488r307l430j6817j068
$$ 69463 68656 69226 81455 85395 98728 94012 73461 55299 59038 67526 58219 54789 37972 36904
8736C6904M420J734J0957J3878q39r629n5p583j4612j3597o360K0136J7415k197
$$ 36904 41324 43058 54015 67893 67054 57425 57370 49787 35175 21578 15218 35354 52769 50572
8722E0572J0632Q823j2582j791o931Q140J771o360Q001K152J815r838L351j1438
$$ 50572 61204 70027 57445 55654 48723 56863 58634 52274 60275 62427 64242 54404 57755 46317
8708D6317q672R113J4051J777q276L664j0870m046P896j855L101n418j689M11
$$ 46317 37645 46758 60809 62586 54310 57974 47104 43058 50954 49099 52200 46782 45093 45504
8694D5504J6127l017p973N67K2762K0768j109j5048p640j0719N880L086R957K14
$$ 45504 61631 58614 50641 51208 73970 94738 93629 78581 70941 60222 66102 69188 79145 79359
8680G9359j4551q575J4104Q134j0531k485r689p313N025O463j0117m297l526O600
$$ 79359 64808 56233 70337 78471 67940 65455 55766 48453 53478 59941 49824 45527 42001 48601
8666D8601K0433q390j982J0434K949l21j3894N456l542p696j5867J1578J3337
$$ 48601 69034 60644 58662 69096 72045 71724 57830 63286 59744 52048 36181 47759 61096
8653F1096j9818m81K0088J8443K8335j0188r549K100l994j493j5331j9829o904
$$ 61096 41278 40797 60885 79328 107663 97475 87926 90026 86032 84539 69208 49379 42475
8640D2475J5906J7634R784J0106j096n354j2705k696M689m59j1631J184N514K595
$$ 42475 58381 76015 85799 95905 94809 89455 76750 74054 78743 78284 66653 67837 73351 75946
8626G5946J0631N402J288L497K177M968m454p15J562K201j7289j323N780P143
$$ 75946 86577 91979 93267 96764 98941 103909 99455 98740 100302 102503 85214 83891 89671 96814
8612I6814l742J0174J8999k681n017K1335R076p023Q425Q527J1764r789N401J0712
$$ 96814 93072 103246 122245 119564 114547 135882 144958 137935 146360 154887 166651 156862 162263 172975
8598A72975q632R922J3779M866R314K5734Q933J6527L168L9020L2309M2523O2262
$$ 172975 164343 174265 188044 192910 202224 227958 236891 253418 256586 295606 327915 370438 432700
8585D32700R0199O9942N7219O3566M8558L6926K5421o261m4112l9743n4916p2792
$$ 432700 522899 592841 650060 713626 762184 799110 824531 818270 774158 734415 679499 606707
8573F06707q1818o1151n8808n0796j6113m0031l4735l5514k8407k2857k2506N981
$$ 606707 524889 463738 404930 354134 338021 297990 263255 227741 199334 176477 153971 159952
8561A59952k082K126K563j4053j6570k026n02j1791j7599M890M649p437Q50l193
$$ 159952 157870 159996 162559 148506 131936 129910 129408 117617 100018 104908 109557 102120 102970 99777
8547I9777p227j115Lj2875j8256L40J3943j189q693k734M132M657N809N966p606
$$ 99777 92550 91435 91438 78563 60307 60647 74590 73401 64708 61974 66106 70763 76572 82538 74932
8532G4932p618j7016m937P623M254k36n67K66L243J017m355k619J587j6534j044
$$ 74932 67314 50298 45361 52984 57238 57002 56435 56701 59944 60961 56606 53987 55574 39040 37996
8517C7996l461p208L274J3809j0526J20J3094N085R734Q029j0153M769J4637j3255
$$ 37996 34535 27327 30601 44410 33884 34004 47098 52183 61917 69946 59793 64562 79199 65944
8503F5944r558m39j446j2768j026K726J3188j182p779n531R025L930K392K962
$$ 65944 56386 55947 54501 41733 40707 43433 56621 55439 47660 42129 51154 55084 57476 60438
8489F0438n6j666n282M804P869r797j2781o767P646J4708l122r392m515j1619
$$ 60438 60382 58716 53434 58238 66107 56310 43529 36762 44408 59116 55994 46602 42087 30468
8475C0468k679J1562m893j9664j150J5976l300J49K590J1333M858J0639J128j281
$$ 30468 27789 39351 34458 14794 13644 29620 26320 26469 29059 40392 45250 55889 57017 55736
8461E5736J886J761j6039n090j815M147M867j888k0985l793J2074M661L849M43
$$ 55736 57622 59383 43344 38254 36439 40586 45453 43565 22580 18787 30861 35522 39371 39814
8447C9814J456J8866J8287q987n389j0629K527R960k154M778K567q401j3978o595
$$ 39814 41270 60136 78423 69436 64047 53418 55945 65905 63751 68529 71096 62695 48717 42122
8433D2122L171K041L461k598J1276K2054q228j1297j5772j0982P995L332K537
$$ 42122 45293 47334 50795 48197 59473 81527 73299 62002 46230 35248 43243 46575 49112
8420D9112m607K079r818q294J0374m775r95J349M322m363M67K0607P783M21L616
$$ 49112 44505 46584 36766 28472 38846 34071 33076 34425 38747 34384 34851 55458 63241 63662 67278
8405F7278p829n999Q09q347k0704j7518J4019j211P1J0047J322m423l176Q712
$$ 67278 59449 53450 54259 45912 25208 7690 21709 20498 20569 30616 31938 27515 24339 33051
8391C3051M853O992j1380M417p692k995N415J7892l899k879J7240j5875j7087
$$ 33051 37904 44896 33516 37933 30241 27246 32661 50553 46654 43775 61015 45140 28053
8378B8053J5555J6806r6j3667j9704n938M842l83J557l77K560j0442M317j3115
$$ 28053 43608 60414 60318 46651 26947 21009 25851 25468 27025 26648 29208 18766 23083 9968
8364I968K383P373n952l696J4065J5556J8728p487J423P079q116q691j9982q904
$$ 9968 12351 19724 13772 10076 24141 39697 58425 50938 52361 59440 51324 42633 22651 13747
8350A3747J2995P180o714o4M031M18J4013J233j3148j437R83m623O956O987k829
$$ 13747 26742 33922 27208 27144 31175 31593 45606 46839 33691 32254 33237 28614 35570 42557 39728
8335C9728j6492n118L545J0146p66m052p519J4642q432k3172j1548J1757L1710
$$ 39728 23236 18118 21663 31809 31043 26991 19472 34114 25682 2510 -9038 2719 34429
8322C4429J2891P126J5456j9223j0033R6Q621j1384j2980J367R391M141k140J7348
$$ 34429 47320 54446 69902 50679 40646 40742 49363 37979 24999 26366 35757 39898 37758 55106
8308E5106J1515K513k1826k2557j1648P916R569L195o008j881N290J4512J3104
$$ 55106 66621 69134 47308 24751 13103 21019 30588 33783 27775 25894 31184 45696 58800
8295E8800R63p442j034J230j4786j0295o221l773O955J7410N39J321J6968n666
$$ 58800 59763 52321 51287 52517 37731 27436 21215 17442 24397 41807 42346 43667 60635 54969
8281E4969p41j1736j4419R214j173N909J3807L463J1425M93o493j629J937M87
$$ 54969 54228 42492 28073 37287 36114 42023 55830 59293 70718 71211 64718 63089 65026 65513
8267F5513q085j3964j0713J0471j821q757J1170J6078M759p513k140M795p438
$$ 65513 57428 43464 32751 43222 41401 32644 43814 59892 64651 57138 54998 59793 52355
8254E2355n921Q11j4574P749O795J0478M176j7826j5911j874q027o089M63J6960
$$ 52355 46434 47245 32671 40420 47215 57693 61869 44043 28132 26258 18231 12142 12605 29565
8240B9565N879j2927J1856J236K117O82o684j5077j4756o852M348Q704O879N823
$$ 29565 35444 22517 34373 35609 37726 38408 31724 16647 1891 -4961 -613 8091 14970 20793
8226B0793O652n529l845j456j542K876J1106N480R328J4291P948j1050O607P222
$$ 20793 27445 21916 18071 16615 15073 17949 29055 34535 43863 58154 66102 55052 61659 68881
8212F8881R001K381n538k3178O550j7479n059M790J926j359K963j3462r81p72
$$ 68881 77882 80263 74725 51547 58097 40618 35559 40349 42275 40916 43879 30417 29436 28664
8198B8664k221L343K20R445J111j946q26Q07J0686q895N534n194j3589r814k1712
$$ 28664 26443 29786 30006 39451 40562 38616 37790 38597 49283 40388 45922 40728 27139 17325 -4387
8183d387R753J6330J1671O03p194p182R374O264N652n465j0527n021p43j0K429
$$ -4387 5366 21696 33367 33970 26776 19594 28968 35232 40884 35419 24892 19871 19128 19118 21547
8168B1547O258Q897J729L1054J3939j4632k7836J309J629p521l202j09M85M642
$$ 21547 27805 36702 38431 69485 83424 68792 40956 42265 43894 36373 33171 33062 33547 38189
8154C8189R774R053o270j5275o357R063j941L86Q7L976o254M339j399K627j703
$$ 38189 47963 57016 50746 35471 29114 38177 36236 36622 36709 40685 34431 38770 37371 39998 38295
8139C8295j9126o154M351J3654L172P48r95J6100l936j6941M606o036m544M880
$$ 38295 19169 13015 17366 31020 34192 34940 33945 50045 46109 29168 33774 27738 23194 28074
8125B8074O542j7343j2175M099J4769k803P40l314j2975L141O010j7005L835q868
$$ 28074 34616 17273 5098 9197 23966 21163 21903 18589 5614 8755 14765 -2240 1595 -7273
8111g273P206O018P962O397j7491r62K50O728J5383R803L38l722Q658J422q171
$$ -7273 -67 5951 13913 20310 2819 1857 2107 8835 24218 34021 34359 30637 39295 40717 32546
8096C2546l198j120K622J2971q765k3198R648J1792j493o352K30M401o668m85
$$ 32546 29348 28228 30850 43821 35056 11858 21506 33298 31805 25453 25683 30084 23416 22931
8082B2931j07R560m392r266r8M15K063P387r1M415M549j2135o535j750l16J3290
$$ 22931 22824 32384 27992 18726 18628 19043 21106 28493 28402 32817 37366 25231 18696 16946 16630 29920
8066B9920R897L53j5754n308J6984K312l216j7394O7J2064J818n242p665J239
$$ 29920 39817 40170 24416 19108 36092 38404 35188 17794 17861 29925 31743 26501 18836 20075
8052B0075j518J0313j08j0240O390N479l372j0459N93L024p414o101J85J6786
$$ 20075 18557 28870 28762 18522 24912 30391 27019 16560 17153 20177 12763 6662 6847 23633
8038B3633J702O653L176l363J709M609Q624n238j2246K794Q675j5994p010L218
$$ 23633 25335 31988 35164 31801 33510 38119 46743 41505 29259 32053 40728 24734 17724 20942
8024B0942J2850J4607M533j0010q522j0865n234n273J5238q311q710M823R733
$$ 20942 33792 48399 52932 42922 34400 23535 18301 13028 28266 19955 11245 16068 25801
8011B5801Q492J3034j659N130l242j5561l985N874K54M663K495k770O019J3951
$$ 25801 34293 47327 45668 50798 47556 31995 28010 33884 34138 38801 41296 38526 44545 58496
7997E8496M559L277r497j1601p04M924o59Q921N906K028P990r043j0887j4494
$$ 58496 63055 66332 56835 45234 44530 49454 48795 57716 63622 65650 73640 64597 53710 39216
7983C9216r809O598J8412M969J405J1358K3642O008j397j0179j232j579j153k151
$$ 39216 29407 36005 54417 59386 60791 72149 95791 101799 100402 90223 88991 87412 86259 84108
7969H4108j433k960j6264p507p28n419j758J7433n166O82J4077N18j4939J53o737
$$ 84108 82675 79715 63451 55944 55216 49797 48039 65472 60306 60988 75065 75583 60644 60797 54060
7954E4060J841p900j7548m694r678M567Q064J2669j203o456r785J0386J4590J0290
$$ 54060 55901 48001 30453 25759 16081 20648 28712 41381 40178 33722 23937 34323 48913 59203
7940E9203l458j3343r258N940R400L998L251q197k0354Q499L021Q190P424K013
$$ 59203 55745 42402 33144 39084 48484 52482 55733 47536 27182 35681 38702 46892 54316 56329
7926E6329J0573J174j1192k8227q472Q620K904K531K3555j3265j2159N956M590
$$ 56329 66902 68076 56884 28657 20185 28805 31709 34240 57795 44530 32371 38327 42917
7913D2917j487K440l29R714j6325r793o783n926o936P903J1341M839k912o372
$$ 42917 41430 43870 43541 53255 36930 27137 20354 14428 7492 15395 26736 31575 28663 22291
7899B2291K340j0440j1487p18M402J4068P171n493R840J294L065j1545p197j1998
$$ 22291 24631 14191 2704 1986 6388 20456 27627 22134 31974 33268 36333 24788 17591 5593
7885E593N271J3091k106o832J2176J7L94N064m480k485o102O054Q726N341m823
$$ 5593 10864 23955 21849 15017 27193 27210 27604 32668 28188 25703 19601 25655 34381 39722 34899
7870C4899o631j8995J6023J6965n687j1430j4492j2900J0029K3598P724P78j4902
$$ 34899 28268 9273 25296 42261 36574 25144 10652 -2248 7781 31379 39103 39881 24979
7857B4979p07J0995j836P500j5815p561o783J727K947m258j041N907o29j6209
$$ 24979 24272 35267 33431 40931 25116 17555 10772 12499 15446 11188 10147 16054 15425 -784
7843g84j600J8297K942M285l60K968j0716j2867r43M075N80Q95M152r903q133
$$ -784 -2384 15913 18855 23140 22780 25748 15032 2165 1222 5297 5877 6772 10924 1021 -7112
7828g112J2987O61L611n965p173K0171L33j6023n816K1963L989o241Q380K537
$$ -7112 5875 6536 10147 4182 -2991 17180 17513 1490 -4326 17637 21626 15385 23765 26302
7814B6302k0682j94K456J1176k713l613R048J0757n044j3755L372n76O266l102
$$ 26302 5620 5426 7882 19058 16345 12732 21780 32537 27493 13738 17110 16534 22800 19698
7800A9698J966K1465J553j6680O303J4307L266j3234p235K353R321r49j039o964
$$ 19698 21664 43129 44682 28002 34305 48612 51878 38644 31409 33762 43083 42134 41095 34131
7786C4131Q401m321n74j0792q130j81N299K226L179j0691m725J547j4595Q414
$$ 34131 42532 38211 37637 26845 18715 18534 23833 26059 29238 18547 13822 15369 774 9188
7772I188J5051L460j6246p005J6787o911J1611J3856k819M464l496j3226l045
$$ 9188 24239 27699 11453 4448 21235 14324 25935 39791 36972 41436 37940 24714 21669
7759B1669k685K343o799K55J940k787M27j1107o381J5104J0148n261L328L748
$$ 21669 18984 21327 14528 14783 16723 13936 14363 3256 -3125 11979 22127 16866 20194 23942
7745B3942j2490p023P811M095q332Q373P686l030k2903J0472O860J4045o058j59
$$ 23942 11452 4429 12240 16335 8003 16376 24062 21032 -1871 8601 15461 29506 23448 23289
7731B3289M85J1505N473J6426M461j1324j2396J497M751M705n993r106j315o993
$$ 23289 23774 35279 40752 57178 61639 50315 37919 39416 44167 48872 42879 33773 32458 25465
7717B5465N187L613n141M12k224j0113O890n771o979q69J1332J3179P646m461
$$ 25465 30652 34265 29124 29536 27312 17199 24089 18318 11339 10470 21802 34981 42627 38166
7703C8166j393l166Q805M820m735k5506n722k842N033R368P769o962r87k074j2764
$$ 38166 36773 33607 42412 47232 42497 16991 11269 8427 13460 22828 30597 23635 22648 20574 7810
7688G810P257P516L725k201L59K604Q669j870N574K721j2665j0157N738N340k7854
$$ 7810 15067 22583 26308 24107 24466 27070 35739 33869 39443 42164 29499 19342 25080 30420 2566
7673B566n538q666J2999J1962J955K790R959P451j6223k9558N39J0412R554J1632
$$ 2566 -2972 -11638 1361 13323 15278 18068 28027 35478 19255 -10303 -9764 648 10202 21834
7659B1834k090J1231K623o174P80K245r45j6212j746R235M269k372q227j0929
$$ 21834 19744 30975 33598 27424 28204 30449 29504 13292 11546 20781 25050 22678 14451 3522
7645C522j1852Q58J7872K0689j8397O097J6281k0836l028J2050N401j1072j0505
$$ 3522 -8330 -7472 10400 31089 12692 18789 35070 14234 11206 23256 28657 17585 7080
7632G080k760J213L689L095j71j9337r310j0705J1344M716Q317J0278L3122K5999
$$ 7080 4320 5533 9222 12317 12146 -7191 -16501 -27206 -15862 -11146 -2829 7449 40571 66570
7618F6570K94p897j2010j0364j529j0784o77M139k823J2837l173j4736j4338j81
$$ 66570 66864 58967 46957 36593 35064 24280 23603 27742 24919 37756 34583 19847 5509 5328
7604E328Q995J0747p9n312j8435J535O273J024P075J2907n059k904j0440q005
$$ 5328 14323 25070 24991 19679 1244 2779 9052 10076 17151 30058 24999 22095 11655 3650
7590C650k739N642J2238J882l81K468n924q755j316R402J567n969p804Q572K975
$$ 3650 911 6553 18791 20673 20292 22760 16836 8081 6765 16167 17734 11765 3961 12533 15508
7575A5508l868q228R61k952P897J0438k631O965Q579o96M014j1277j6054O023
$$ 15508 11640 3412 4373 1421 9318 19756 17125 24090 32669 31973 35987 24710 8656 14679
7561A4679K244n11r997P65K878l628o125O602o793j531l300L870J1360o650q202
$$ 14679 16923 16412 6415 7180 10058 6430 305 6907 114 -1417 -4717 -847 10513 3863 -4339
7546d339j054J3938k224j21O953J408J0237J3140j0693m478J862J1114J0722j3738
$$ -4339 -5393 8545 6321 6200 13153 14561 24798 37938 27245 22767 24629 35743 46465 32727
7532C2727j8034l180j3138l530J8792o566n310R894J4836k543J4120j642n559
$$ 32727 14693 11513 -1625 -5155 13637 7071 1761 11655 26491 23948 38068 36426 30867
7519C0867J0417m384p606q681j3598k67J7245K235j391j1812n621k472J7121j601
$$ 30867 41284 36900 29294 20613 7015 6748 23993 26228 24837 13025 7404 4932 22053 20452
7505B0452k862M494r77j3172k781O603k770p909j2788Q45J4287M303L800N715
$$ 20452 17590 22084 21107 7935 5154 11757 8987 1078 -11710 -10865 3422 7725 11525 17240
7491A7240P649N976k143j2995j3495k948J1413k744m662J3592o571N21m980q468
$$ 17240 24889 30865 28722 15727 2232 -716 10697 7953 3291 16883 10312 10833 5853 -2615
7477b615n509J0943R959p242j9650j4874L020J4622J6405J1283n356J1002K473
$$ -2615 -8124 2819 12778 5536 -14114 -28988 -25968 -11346 5059 16342 10986 21988 24461
7464B4461M895Q213j0108n279P59j8947j9949L549J1648J1519p224j304J1028
$$ 24461 29356 37569 27461 22182 22941 3994 -15955 -12406 -758 10761 3537 2233 13261
7451A3261l051l201j2707K060R541l421Q417L245k797j5243J1257K2166N331n262
$$ 13261 10210 7009 -5698 -3638 5903 2482 10899 14144 11347 -3896 7361 29527 34858 29596
7437B9596j9511m295l85R010R552k656J47R89k438k4231o107p764Q315K8699n829
$$ 29596 10085 5790 5405 14415 23967 21311 21458 22447 20009 -4222 -10329 -18093 -9778 18921 13092
7422A3092n861K243J3336P720j0211q476j8838n612k74o264J1608K818L408J588
$$ 13092 7231 9474 22810 30530 20319 11843 -6995 -12607 -12881 -19145 -7537 -4719 -1311 277
7408B77q092j8205J4943J2984P72J198j3399J4062R863m127j4909K299N766J4066
$$ 277 -7815 -26020 -11077 1907 2679 3877 -9522 4540 14403 10276 -4633 -2334 3432 17498
7394A7498N359m641l220n737n399J108M325j944K180k580J5861J4652j0903j4335
$$ 17498 22857 18216 14996 9259 3860 4968 9293 7349 9529 6949 22810 37462 26559 12224
7380A2224o016k358K631J389n143k3110k92k945K106K833j2124R000J0383j7822
$$ 12224 6208 3850 6481 7870 2727 -20383 -20675 -23620 -21514 -18681 -30805 -21805 -11422 -29244
7366b9244r351K0642J5615r573o903R017P294O947M730J81j2083l264K969R595
$$ -29244 -38595 -17953 -2338 -11911 -18814 -9797 -2503 4444 9174 9355 -2728 -5992 -3023 6572
7352F572R952M998j0690p584k863l375j388r073J0683J0963q609o193n176p72
$$ 6572 16524 21522 10832 3248 385 -2990 -4378 -13451 -2768 8195 -414 -6607 -11783 -12555
7338a2555N634O364K1058R887j8758n541Q378M56j6638l720J1346J873N601r977
$$ -12555 -6921 -557 20501 30388 11630 6089 14467 14923 -1715 -5435 5911 7784 13385 3408
7324C408j1897o650J9739m252j1902K5100P488m208q109J289Q698Q98k93M229
$$ 3408 -8489 -15139 4600 348 -11554 13546 21034 16826 8717 10006 18704 19602 19309 23538
7310B3538L459J4639n769j5604P140K0563j7847j4850r236j7328m883J0400j354
$$ 23538 26997 41636 35867 20263 27403 47966 30119 15269 6033 -11295 -16178 -5778 -7132
7297g132J450M592R181j7064j5583J6271K1093p346j1536P168R932N319j398j4559
$$ -7132 -5682 -1090 8091 -8973 -24556 -8285 12808 5462 -6074 1094 11026 16345 14947 388
7283C88K388n07o349Q731J8770J458j63q929k2363l612J1743O710R463M469q974
$$ 388 2776 2269 -4080 4651 23421 24879 24716 15787 -6576 -10188 1555 8265 17728 22197 13223
7268A3223j1825K091r753j4792o567R466j12N033l654j0903J1288J0993K1056
$$ 13223 1398 3489 -6264 -21056 -27623 -18157 -18269 -13236 -16890 -27793 -16505 -5512 15544
7255A5544M806l058j4721n345K2538N566k0965l682P150J7218K87m867p473j1043
$$ 15544 20350 17292 2571 -2774 19764 25330 4365 683 7833 25051 25338 20471 12998 1955
7241A955m687Q41R679Q169J617J4823k3813k3657L706p517j694N899J2677N658
$$ 1955 -2732 -1891 7788 15957 17574 32397 8584 -15073 -11367 -18884 -20578 -14679 -2002 3656
7227C656J3968j6233J5057M976k408m438R50j194r643K281J0024q886j0941R729
$$ 3656 17624 1391 16448 21424 19016 14578 15528 14334 4691 6972 16996 8110 -2831 6898
7213F898J526L262J0708J501k446N626j9003l093j0250j6087j0942k042J571K5955
$$ 6898 8424 11686 22394 23895 21449 27075 8072 4979 -5271 -21358 -32300 -34342 -32771 -6816
7199f816J0133o540m979j390J000J9640J1244n161r621j9054n705L048O580q07
$$ -6816 3317 -3223 -8202 -9592 -8592 11048 22292 17131 7510 -11544 -17249 -14201 -7621 -8428
7185h428j378Q138K775m108L470K418j2032L491Q395J5265J0216j7945q914J0282
$$ -8428 -9806 -1668 1107 -3001 469 2887 -9145 -5654 2741 18006 28222 10277 1363 11645
7171A1645J4281j4625j1104p168q317j9373J1503K0489J8980J1403j2951j834
$$ 11645 25926 11301 197 -6971 -15288 -34661 -23158 -2669 16311 27714 14763 12929
7159A2929J6973J3685j3429p510J832l232j6438o329L331K1604J4937k621j2776
$$ 12929 29902 43587 30158 22648 24480 21248 4810 -1519 1812 23416 38353 35732 22956
7146B2956Q353l391n903l394l815j7355j2400K158K537p167J384L612J548l78
$$ 22956 31309 27918 22015 18621 14806 -2549 -14949 -12791 -10254 -17421 -16037 -12425 -10877 -11255
7132a1255J5248R470j149j5245m343P494l673j7516p084J3530N029M381q220J9354
$$ -11255 3993 13463 12314 -2931 -7274 220 -3453 -20969 -28053 -14523 -9494 -5113 -13333 6021
7118F021K2571n080j5957R662J2017k568o132q309k766r96j7959j9232M889J0068
$$ 6021 28592 23512 7555 17217 29234 26666 20534 12225 9459 8463 -9496 -28728 -23839 -13771
7104a3771J7829L489J6180j751r333o443j3792j7780O466J3831K070L088R83n471
$$ -13771 4058 7547 23727 21976 12643 6200 -7592 -25372 -18906 -5075 -3005 83 1066 -4405
7090d405N597p188o925J1636M469r433P676k000l55k470J70l167J5712q896j5111
$$ -4405 1192 -5996 -12921 -1285 3184 -6249 1427 -573 -928 -3398 -3228 -6395 9317 421 -14690
7075a4690R032j0838J9075J690O981Q551r67m807n16o974j3611K456R470J0969
$$ -14690 -5658 -16496 2579 4269 11250 19801 18834 14027 13511 6537 -7074 -4618 4852 15821
7061A5821o620J2956k896j388l614p412J434L555J4195j3626j8681R083O915P863
$$ 15821 9201 22157 19261 17873 14259 6847 8281 11836 26031 12405 -6276 2807 9722 17585
7047A7585N207l170j4777r354m519Q195J7201r17j4059r089M641L964J0049P802
$$ 17585 22792 19622 4845 -4509 -9028 -833 16368 15451 1392 -7697 -3056 908 10957 18759
7033A8759M351p171k5362m053J2688O936j1403l649o745o62Q140N470K6260M005
$$ 18759 23110 15939 -9423 -13476 -788 6148 -5255 -8904 -15649 -16311 -8171 -2701 23559 27564
7019B7564j4224q71j736K955N445J1113q456m838N564j1495N631O222M54n039
$$ 27564 13340 12469 10733 13688 19133 30246 21790 16952 22516 11021 16652 22874 23328 18289
7005A8289P301j448k4655j0902J4491j778J1384k775j0945K596O909P031Q036
$$ 18289 25590 24142 -513 -11415 3076 1298 12682 9907 -1038 1558 8467 15498 23534
6992B3534l248r250P76K898j4343j389Q611K120j1879r05O86J0388L260q978k843
$$ 23534 20286 11036 11812 14710 367 -1022 7589 9709 -2170 -3075 -2389 7999 11259 2281 -562
6977e62K166l445J091J5908j3576j0953L287J0338j459k7110P828J5192k997k957
$$ -562 1604 -1841 -750 15158 1582 -9371 -6084 4254 2795 -24315 -16487 -1295 -4292 -7249
6963g249R116J2669p011P039j4112q991n463J0802N98K23j0692N954J6587J4302
$$ -7249 1867 14536 7525 14564 452 -8539 -14002 -3200 -2602 -2379 -13071 -7117 9470 23772
6949B3772j3263j390O653J108j535m240N43j6636j1474N468J6507o951j932J489
$$ 23772 10509 9119 15772 16880 15345 11105 11648 -4988 -16462 -10994 5513 -1438 -3370 -1881
6935a881n10P180J0594K370k2922L837Q637q579p405l162j1009j2854J129K7496
$$ -1881 -2391 4789 15383 17753 -5169 -1332 7305 -1274 -8679 -11841 -22850 -35704 -34575 -7079
6921g079J6196J8406J0272r883j1582j2174j1555k180M542O253R935j976j944
$$ -7079 9117 27523 37795 27912 16330 4156 -7399 -9579 -5037 1216 11151 9175 7231
6908G231K219k3891j7790K7234K3737m569j1496r20J017j7117L036J922m80K255
$$ 7231 9450 -14441 -32231 -4997 18740 14171 2675 1755 2772 -14345 -11309 -9387 -9867 -7612
6894g612J9359J5872r788k0712p35m21K213R058J2104J1270R979K419n201l855
$$ -7612 11747 27619 17831 -2881 -3616 -4037 -1824 7234 19338 30608 40587 43006 37805 33950
6880C3950j5656P7j7660o518l977L070R730M805k512j129J1542J0648J0563q638
$$ 33950 18294 18371 711 -5807 -9784 -6714 3016 7821 5309 4180 15722 26370 36933 28295
6866B8295j2380m208m389k382J3865J0774j642J53l893j1383j5486K352k662J7
$$ 28295 15915 11707 7318 4936 18801 29575 27933 28086 24193 12810 -2676 -324 -2986 -2969
6852b969R870j511O400Q355M945l86M98L766m858j0432l082L35J0056O854L108
$$ -2969 6901 5390 11790 20145 25090 24704 25202 28968 24110 13678 10596 10931 20987 27841 30949
6837C0949m893j1068o302p630l22O86j5159j7916R694J5759N928P132q108Q9J3343
$$ 30949 26056 14988 8686 1056 734 1420 -13739 -31655 -21961 -6202 -274 6858 -1250 -1161 12182
6822A2182j0825n784m70J0832j988j1576l846j222J0841M497K22K914J3914l354
$$ 12182 1357 -4427 -4897 5935 3947 -7629 -11475 -12697 -1856 2641 2863 5777 19691 16337
6808A6337j6760j4544K921k80J4676r823P301l348M049J504n452l316j564J4614
$$ 16337 -423 -14967 -12046 -12326 2350 -7473 -172 -3520 529 2033 -3419 -6735 -8299 6315
6794F315J022P578J775L445L540Q18l898j994q211n123r86j6717j824R346j556
$$ 6315 7337 14915 16690 20135 23675 24493 20595 18601 10390 5267 4281 -12436 -14260 -4914 -6470
6779f470j2222M770j093k440j428J471m670m968l703N417K17O503K956K179J6681
$$ -6470 -18692 -13922 -15015 -17455 -18883 -17412 -22082 -27050 -30753 -25336 -25119 -18616 -15660 -13481 3200
6764C200K1959p19k3724k0825o96R917O601j0253O784J6588k069J873M063L925
$$ 3200 25159 24440 716 -20109 -20805 -10888 -4287 -14540 -7756 8832 6763 8636 12699 16624
6750A6624q764j3560o347J16O797O134n978n176j101K575j328r537K025Q445J183
$$ 16624 7860 -5700 -12047 -11931 -5134 1000 -4978 -10154 -11255 -8680 -10008 -19545 -17520 -9075 -7892
6735g892l090J4203O028j1665k765J0722j862M411m172l058n933q666O644O469
$$ -7892 -10982 3221 9249 -2416 -5181 5541 3679 8090 3918 860 -5073 -13739 -7095 -626
6721f26Q335J0219N665n724n800L168m272j050K093j0874p613l953Q533p426O56
$$ -626 7709 17928 23593 17869 12069 15237 10965 9915 12008 1134 -6479 -10432 -1899 -9325 -8669
6706h669J3829Q435j2144j7359P720M771l097J821R823J4338j285j8729J0100
$$ -8669 5160 13595 1451 -15908 -8188 -3417 -6514 -4693 5130 19468 18183 -546 9554
6693I554J3466j1338j6816q559j0935J7347J8387K9095n641j3237k612o383n546
$$ 9554 23020 11682 -5134 -13693 -24628 -7281 11106 40201 34560 21323 18711 12328 6782
6680F782j727l868M367k416M210O356j444L864P485j7904j5081r207N679J4816
$$ 6782 5055 1187 5554 3138 7348 13704 12260 16124 23609 5705 -9376 -18583 -12904 1912
6666A912Q152R978j037j692J0212j535n082j8109k163J4326J4956J144j2651j2543
$$ 1912 10064 20042 19005 17313 27525 25990 20908 2799 636 14962 29918 31062 18411 5868
6652E868N261j7263J486N643N637r491j0432J4640J3861m815n023M576q659M889
$$ 5868 11129 -6134 -4648 995 6632 -2859 -13291 1349 15210 10395 5372 9948 1289 6178
6638F178p6J578P08O34P297j7574q215N96m35Q757J3006r978R833J1080k126J510
$$ 6178 6102 7680 8388 9022 16319 -1255 -9470 -8874 -9309 -552 12454 2476 12309 23389 21263 22773
6622B2773O887j0430j3740j217M104K066j4013L474K464j1401K514J2048J1400
$$ 22773 29660 19230 5490 4273 8377 10443 -3570 -96 2368 -9033 -6519 5529 16929
6609A6929l29n154p021l707k634j7455o326Q237J0688j4196M008N684K3740K1015
$$ 16929 16600 11446 4425 718 -1916 -19371 -25697 -17460 -6772 -20968 -16960 -11276 12464 33479
6595C3479k742l983K847m264j2402j8443r710K510J0325K0113J2435o330k7283
$$ 33479 30737 26754 29601 25337 12935 -5508 -15218 -12708 -2383 17730 30165 23835 -3448
6582c448j6540j219l066K2645K0531K448j0102K12j2803J4083P968j0825p535
$$ -3448 -19988 -21207 -24273 -1628 18903 21351 11249 11461 -1342 12741 20709 9884 2349
6569B349r358j2649L66P029O665R895l435j7487J881Q789o065l118j1911r913
$$ 2349 -7009 -19658 -19292 -12263 -5598 4297 862 -16625 -14744 -5955 -12020 -15138 -27049 -36962
6555c6962N259K5238J7945L458M770p103K183o103k0541o961m580j5722R265J0003
$$ -36962 -31703 -6465 11480 14938 19708 12605 14788 8685 -11856 -18817 -23397 -39119 -29854 -19851
6541a9851K371n55P833J3236J1886k026O092M346j4191j1733M810K235j626J1263
$$ -19851 -17480 -18035 -10202 3034 14920 12894 18986 23332 9141 -2592 2218 4453 2827 14090
6527A4090n462K949o096j1507j0211M852K72p893p19K7248J7866k0048j1108L449
$$ 14090 8628 11577 5481 -6026 -16237 -11385 -11113 -19006 -19725 7523 25389 5341 -5767 -2318
6513b318J2703J2510k22j2192p180k352o69m490j711J3336R450j4765q580j2505
$$ -2318 10385 22895 22673 10481 3301 949 280 -4210 -5921 7415 16865 2100 -6480 -18985
6499a8985P314K0858R019J005m79j3791j7174J2166K684k0567P644K0811O06p912
$$ -18985 -11671 9187 18206 19211 18732 4941 -12233 -67 2617 -17950 -10306 10505 11111 3199
6485C199j4900K478P815j3267R302J6069j4529k604J1591o130l159N047K907m442
$$ 3199 -11701 -9223 -1408 -14675 -5373 10696 -3833 -6437 5154 -976 -4135 912 3819 -623
6471f23j7277o959R464n402P176l597N565Q837k112m245j039q671J610K454J4076
$$ -623 -17900 -24859 -15395 -20797 -13621 -17218 -11653 -2816 -4928 -9173 -10212 -18883 -17273 -14819 -743
6456g43J4249j2372J27R687R84l800k515L694j1041j2583j983R07N946J5546J832
$$ -743 13506 1134 1261 10948 11932 8132 5617 9311 -1730 -14313 -16296 -15389 -9443 6103 7935
6441G935k011K857L392j106p349k5194J0235P609J301N040J29q261j2599p564
$$ 7935 5924 8781 12173 11067 3718 -21476 -11241 -3632 -2331 2709 2838 -5423 -18022 -25586
6427b5586K144J3923J5995P684l54j4166r210K993n40P00k929j0967K306J113
$$ -25586 -23442 -9519 6476 14160 13806 -360 -9570 -6577 -7117 -6417 -9346 -20313 -18007 -16894
6413a6894L577R609j472J7669j1177j7844j1983L312O941j0226K399j723J9619
$$ -16894 -13317 -3708 -5180 12489 1312 -16532 -28515 -25203 -18262 -28488 -26089 -27812 -8193
6400h193J7619j231j2128m65j556p20N322k331J1304r804o813J8809L530r644
$$ -8193 9426 8195 -3933 -4398 -5954 -6674 -1352 -3683 7621 -2183 -8996 9813 13343 3699
6386C699N9q946o149M445O289J0605o772o621o14L670k169O649J626m793J0860
$$ 3699 3758 -5188 -11337 -6892 -603 10002 3230 -3391 -4005 -335 -2504 4145 5771 978 11838
6371A1838j1007J3413O880o37k2623j3356O959N658O819j0969M520M686j7271
$$ 11838 831 14244 21124 20487 -2136 -15492 -8533 -2875 3944 -7025 -2505 2181 -15090
6358a5090J1587K1176J285n386n519k0714l709K866J7847p145l208L329r337l272
$$ -15090 -3503 17673 18958 13572 8053 -12661 -16370 -13504 4343 -2802 -6010 -2681 -12018 -15290
6344a5290j2968R232P758K97M815l671j973j2190J576K5789J1337n814J943p621
$$ -15290 -28258 -19026 -11268 -10971 -6156 -9827 -11800 -23990 -22414 3375 14712 8898 10841 3220
6330C220J3195J1539J83j4335P907j4952j6874n616j7038m601L061J6020L974
$$ 3220 16415 27954 28137 13802 21709 6757 -10117 -15733 -32771 -37372 -34311 -18291 -14317
6317a4317p842N434j038j3437J3475J571N873j0928n632R39J7924J9176j513n501
$$ -14317 -22159 -16725 -17763 -31200 -17725 -16154 -10281 -21209 -26841 -25902 -7978 11198 9685 4184
6303D184j5382M534L617n782j4769k835Q579R368j4675Q626J2734j5832m964J2045
$$ 4184 -11198 -6664 -3047 -8829 -23598 -26433 -17854 -8486 -23161 -14535 -1801 -17633 -22597 -10552
6289a0552m752m403J3214j3863j7627J477K7703n117o958N695J1707j8580p835
$$ -10552 -15304 -19707 -6493 -20356 -37983 -36506 -8803 -13920 -20878 -15183 -3476 -22056 -29891
6276b9891n199N785Q225K149J4343J605o632R377Q844j4536k8208k292K0840P621
$$ -29891 -35090 -29305 -21080 -18931 -4588 -2983 -9615 -238 8606 -5930 -34138 -36430 -15590 -7969
6262g969L678M846Q141J403n115k54n767l351j532K747L3K458O707q720M506m299
$$ -7969 -4291 555 8696 10099 4984 4730 -1037 -4388 -5920 -3173 -3140 -682 6025 -2695 1811 -2488
6246b488M24j15L459L861K24j619P180l191j11p779q88M896o802M096J815j6356
$$ -2488 -2064 -2179 1280 5141 5365 3746 10926 7735 7624 -155 -1043 3853 -2949 1147 2962 -13394
6230a3394J6615j0188r027q610k301m773J3084J1215R067J3510j266k129J127
$$ -13394 3221 -6967 -15994 -24604 -26905 -31678 -18594 -7379 1688 15198 13932 11803 12930
6217A2930P329K214j0998J4303Q867L961j6634o700k4381j4815j0169L784J7925
$$ 12930 20259 22473 11475 25778 34645 38606 21972 15272 -9109 -23924 -34093 -30309 -12384
6204a2384K2872Q55j6732q400M056N808K253J3489q922J379J415j2031k2879J792
$$ -12384 10488 11343 -5389 -13789 -9733 -3925 -1672 11817 2895 4274 5689 -6342 -29221 -27429
6190b7429J2423J277q225J1067O485k689K0459M848M679j1322j014j261p376j3500
$$ -27429 -15006 -13729 -21954 -10887 -4402 -7091 13368 18216 22895 11573 10559 9298 1922 -11578
6176a1578P785Q299j2768R985K761J2712m735j0491j156M116P105q799j3488K405
$$ -11578 -3793 4506 -8262 1723 4484 17196 12461 1970 814 4930 12035 3236 -10252 -7847
6162g847Q457r26j4477K95J0737K616O726J7267n751o586j8522M10J1037n109
$$ -7847 610 -316 -14793 -14498 -3761 -1145 5581 22848 17097 10511 -8011 -7601 3436 -1673
6148a673j042J3484o549n588J924J0315j1878j4269K678J4352Q640N839p488j2217
$$ -1673 -2715 10769 4220 -1368 556 10871 -1007 -15276 -12598 1754 10394 16233 8745 -3472
6134c472n5j3063k31N668J2574M343r501m300l742Q4M988O664Q595N588q588j5435
$$ -3472 -3527 -16590 -16821 -11153 1421 5764 -3737 -8037 -11779 -11695 -6707 -43 8552 14140 5552 -9883
6118i883Q536J6584k866K413P961M26n058j4709r25j1982j0074j3915l598J6201
$$ -9883 -1347 15237 12371 14784 22745 23171 18113 3404 2479 -9503 -19577 -33492 -37090 -20889
6104b0889N720q652J0124J1854J751j0762j724j0114k407l308J4743O338N59J2730
$$ -20889 -15169 -23821 -13697 -1843 -92 -10854 -12578 -22692 -25099 -28407 -13664 -7326 -6767 5963
6090E963Q436l330j4539J84N416L154J7356M202j3454q443m508l11J133q246M540
$$ 5963 14399 11069 -3470 -3286 2130 5284 22640 26842 13388 4945 437 126 1259 -6987 -2447
6075b447l157L525Q737N726p103j114O126M332L186j6892j5626J6781O166J566
$$ -2447 -5604 -2079 6658 12384 5281 4167 10293 14625 17811 919 -14707 2074 8240 9806
6061I806M362K085o611j585Q26j513o560m118j0929j6004K5982N690o838k880
$$ 9806 14168 16253 9642 8057 8883 7370 810 -3308 -14237 -30241 -4259 1431 -5407 -8287
6047h287m229P8K341J1230m725K415p694o338l123J033N103J0843p526O400k787
$$ -8287 -12516 -12438 -10097 1133 -3592 -1177 -8871 -15209 -18332 -17299 -12196 -1353 -8879 -2479 -5266
6032e266j4986j6152J101J593L131J4181J8081q02k423n742J1139K1716P1r438
$$ -5266 -20252 -36404 -35303 -33710 -30579 -16398 1683 881 -1542 -7284 3855 25571 25642 16204
6018A6204j8703k1694r887o584J4973O786R662L073K075n37m35K1280N799k719
$$ 16204 -2499 -24193 -34080 -40664 -25691 -18905 -9243 -6170 -4095 -4632 -5067 16213 22012 19293
6004A9293j6085r014o72O49m309O950L625N743N865k592J12J083M315J5391j8593
$$ 19293 3208 -5806 -6478 -5829 -10138 -3188 437 6180 12045 9453 9565 10648 14963 30354 11761
5989A1761j3354J464O899j3932m979l20M828l551J418J8110l910n669K091K2953
$$ 11761 -1593 -129 6770 -7162 -12141 -12461 -7633 -11184 -9766 8344 4434 -1235 856 23809
5975B3809q314k0726l687j5775p523O812J0222m413R20J2999J2563J4709P86P404
$$ 23809 15495 -5231 -8918 -24693 -32216 -25404 -15182 -19595 -18675 -5676 6887 21596 22382 29786
5961B9786p221k590r876j3070k426n317j04M055n190p095Q147P056J921J0021
$$ 29786 22565 19975 10099 -2971 -5397 -10714 -10818 -6763 -11953 -19048 -10901 -3845 -1924 8097
5947H097j4758j4265R578J3246O826o287Q886O946J427O264r191p129P48l706
$$ 8097 -6661 -20926 -11348 1898 8724 2437 11323 18269 19696 25960 16769 9640 10388 6682
5933F682j6395q883j77N906K449M101K4482j0061j4427j088L117L386N269J8547
$$ 6682 -9713 -18596 -18773 -12867 -10418 -6317 18165 8104 -6323 -7411 -4294 -908 4361 22908
5919B2908O822j4614j4668N639J2478j2215j2753j102J6135n05o631l439O053
$$ 22908 29730 15116 448 6087 18565 6350 -6403 -7505 8630 8125 1494 -1945 4108
5906D108Q046O707R700J808o676o856r758r02j6246j756Q979R843P086M609o57
$$ 4108 12154 18861 28561 30369 23693 16837 7079 6177 -10069 -11825 -2846 6997 14083 18692 18035
5891A8035N011j1289J14J0449p885k8096q338r449n40K1192J8406K299K698J930
$$ 18035 23046 11757 11871 22320 14435 -13661 -21999 -31448 -31988 -10796 7610 9909 12607 14537
5877A4537j3491m059R89n436j7843j2876R692Q391J3736L454o65L967j9756m582
$$ 14537 1046 -3013 -2024 -7460 -25303 -38179 -28487 -20096 -6360 -2906 -3571 396 -19360 -23942
5863b3942O154l513k467P912J5388L928p700n197P158M260k089J1380o222K222
$$ -23942 -17788 -21301 -23768 -15856 -468 3460 -4240 -9437 -2279 1981 -108 11272 5050 7272
5849G272j221j1031k711J0961J7895k873j5038k506J9924J4243j7137k2395N609
$$ 7272 6051 -4980 -7691 3270 21165 18292 3254 748 20672 34915 17778 -4617 992
5836I92R982J4803p604j6742j2804N878J5979j6689j6692j1182l59J3336K3966
$$ 992 10974 25777 18173 1431 -11373 -5495 10484 -6205 -22897 -34079 -34438 -21102 2864
5823B864j2083j0666R966J6619j2865j0179N377Q666M210O45o483j15l031o696
$$ 2864 -9219 -19885 -9919 6700 -6165 -16344 -10967 -2301 1909 2554 -3929 -4044 -7075 -13771
5809a3771J0056o438o425J3857j457j630m727k8375j228J7447J9084l47l366K626
$$ -13771 -3715 -10153 -16578 -2721 -4178 -5808 -10535 -38910 -40138 -22691 -3607 -3954 -7320 -4694
5795d694p84k344P074q272p665q222q204P526Q363l669M403K625M930q492N854
$$ -4694 -5478 -7822 -748 -9020 -16685 -24907 -33111 -25585 -17222 -20891 -16488 -13863 -8933 -17425 -11571
5780a1571j033L043L544J420m166J1244J1190J304J3821j568l2783p062k318M231
$$ -11571 -12604 -9561 -6017 -4597 -8763 2481 13671 14975 28796 27228 -5555 -12617 -14935 -10704
5766a0704J12k724M751k941k3919p348J9880R040K819J0947J5000M946k5235k5959
$$ -10704 -10592 -13316 -8565 -11506 -35425 -42773 -22893 -13853 -11034 -87 14913 19859 -5376 -31335
5752c1335M551L202J3394J2668l013O386J0619j810j6736M222o616j0752m763
$$ -31335 -26784 -23582 -10188 2480 -533 5853 16472 14662 -2074 2148 -4468 -15220 -19983
5739a9983m745J164N094M543K5j5354m694K0421R029k505j455o61p314j5570q079
$$ -19983 -24728 -23564 -18470 -13927 -13902 -29256 -33950 -13529 -4500 -7005 -8460 -9121 -16435 -32005 -40084
5724d0084J4709L777q152n183L794J5286M217J0228k204M345J2669j4478j5635
$$ -40084 -25375 -21598 -29750 -34933 -31139 -15853 -11636 -1408 -3612 733 13402 -1076 -16711
5711a6711N487l768j2176J408Q764P595P444J1591J9265K733m170L533k06j8813
$$ -16711 -11224 -14992 -27168 -25760 -16996 -9401 -1957 9634 28899 31632 27462 30995 30789 11976
5697A1976q059R120M343j269o335l53J34m732J671Q396p733k0860k291o926O518
$$ 11976 3917 13037 17380 16111 9776 9423 9557 4825 6496 14892 7159 -13701 -15992 -22918 -16400
5682a6400j2104j3942J3109J069j087K811Q938J3999R381J2813j2904q184p746
$$ -16400 -28504 -42446 -29337 -28268 -29355 -26544 -17606 -3607 5774 18587 5683 -2501 -10247
5669a0247R704J2848l053k36M358O708N887j6497r420p522j6800L623O689M341
$$ -10247 -543 12305 9252 9016 13374 20082 25969 9472 52 -7470 -24270 -20647 -13958 -9617
5655i617l396m32K6220J942L689p601j4349j1556K697n18O438k693r156m93J0561
$$ -9617 -13013 -13445 12775 14717 18406 10805 -3544 -15100 -12403 -12921 -6483 -9176 -18332 -18825 -8264
5640h264N876J6894L479m535k80k708j7490j3818j4652J291R138K338R809J402
$$ -8264 -2388 14506 17985 13450 13170 10462 -7028 -20846 -35498 -34207 -25069 -22731 -12922 -11520
5626a1520J0352k09q49k628j6188q76K362o940M29N736J0029P696k094L857m25
$$ -11520 -1168 -1377 -2226 -4854 -21042 -21918 -19556 -26496 -26067 -20331 -10302 -2606 -4700 -843 -1268
5611a268R530l428j5036j3421j7248J0801K0366R207j189j9362j1711N832J3191
$$ -1268 8262 4834 -10202 -23623 -40871 -30070 -9704 -497 -1686 -21048 -32759 -26927 -13736
5598a3736M255J907J5142J605j2616J1422K581j4003O61N954p550j6796O164J0013
$$ -13736 -9481 -7574 7568 9173 -3443 7979 10560 -3443 -2782 3172 -4378 -21174 -15010 -4997
5584d997k639Q187j2866j1400J3439N362k467q044O047R030k253P72J0911J1402
$$ -4997 -7636 551 -12315 -23715 -10276 -4914 -7381 -15425 -9378 -348 -2601 -1829 9082 20484
5570B0484r031k628p903k1248J0081J4548J208j9472j3422l967M580m138M862
$$ 20484 11453 8825 922 -20326 -10245 4303 5511 -13961 -27383 -31350 -26770 -30908 -26046
5557b6046P989l752q895J0314j623O210N651P315j4355m62K1168m455k889R560
$$ -26046 -18057 -21809 -30704 -20390 -22013 -15803 -10152 -2837 -17192 -17654 3514 -941 -3830 5730
5543E730j9839k2930p90J0594J7928K079n192J1931P475N109q899j5732j4738
$$ 5730 -14109 -37039 -37829 -27235 -9307 -7228 -12420 -489 6986 12095 3196 -12536 -27274
5530b7274q210K215L299N415K491P836J291j4615o941J2365J5160N541J3615O526
$$ -27274 -35484 -33269 -29970 -24555 -22064 -14228 -12937 -27552 -34493 -22128 -6968 -1427 12188 18714
5516A8714K465q703l699r725M689L502L871J744j0530j1177m917r71Q348j437
$$ 18714 21179 12476 8777 -948 3741 7243 11114 12858 2328 -8849 -13766 -14737 -6389 -7826
5502g826p313K607N619n594j6991J062J5172J1427p457j2840J592O97J4928l197
$$ -7826 -15139 -12532 -6913 -12507 -29498 -28436 -13264 -1837 -9294 -22134 -20542 -19845 -4917 -8114
5488h114r548O148j3612q507K4819K173J2830J3256O096j489p307k1234j3383
$$ -8114 -17662 -11514 -25126 -33633 -8814 -6641 6189 19445 25541 24052 16745 -4489 -17872
5475a7872n987R521J8322J3824N258m955J0229o354j3374j1682N718O13J957j3575
$$ -17872 -23859 -14338 3984 17808 23066 18111 28340 21986 8612 -3070 2648 3261 5218 -8357
5461h357J0931P69P751M842o338j8300o866k722J3507J1784P665j6184k2753m943
$$ -8357 2574 3343 11094 15936 9598 -8702 -15568 -18290 -4783 7001 14666 -1518 -24271 -29214
5447b9214L338K485N041j2101K340J509l974J7560J9797j035J7357l587k2241
$$ -29214 -25876 -23391 -18350 -30451 -28111 -26602 -30576 -13016 6781 5746 23103 19516 -2725
5434b725n600J5512J3565k8800m421J8019l785j0590j754o476m026P116n352M233
$$ -2725 -8325 7187 20752 -8048 -12469 5550 1765 -8825 -10579 -17055 -21081 -13965 -19317 -15084
5420a5084Q310J1595o816n979k0121m941N466L366R823l953R721J4715j1504j0291
$$ -15084 -6774 4821 -1995 -7974 -28095 -33036 -27570 -24204 -14381 -18334 -8613 6102 -5402 -15693
5406a5693K5721R576j5005p011j1848k1560r682o736J1802O073M731J5034N683
$$ -15693 10028 19604 4599 -2412 -14260 -35820 -45502 -52238 -40436 -34363 -29632 -14598 -8915
5393h915J1660P773o032j4126L005Q97J2132n002j4925o217L631l630M272k692
$$ -8915 2745 10518 4486 -9640 -6635 -5738 6394 1392 -13533 -19750 -16119 -19749 -15477 -18169
5379a8169L232K2084J2257j8951K230L120n330p270r984J3435L123j8987m207
$$ -18169 -14937 7147 19404 453 2683 5803 473 -6797 -16781 -3346 -223 -19210 -23417
5366b3417J5929J157K809p309l209J1296J0135J0667l5261p317l193J554P655
$$ -23417 -7488 -6331 -3522 -10831 -14040 -2744 7391 18058 -17203 -24520 -27713 -26159 -18504
5353a8504m214p778N205Q701K104m270O954Q546L263k820r18k454P475r491n64
$$ -18504 -22718 -30496 -25291 -16590 -14486 -18756 -11802 -3256 7 -2813 -3731 -6185 1290 -8201 -8765
5338h765M945J18m950j3632O445M430K071j2774o805l017L294j2377J7358J8815
$$ -8765 -3820 -3702 -8652 -22284 -15839 -11409 -9338 -22112 -28917 -31934 -28640 -41017 -23659 -4844
5324d844J8687k22j0932j1056j694p857p814O511l599l866k726N091J491k723
$$ -4844 13843 13621 2689 -8367 -10061 -17918 -25732 -19221 -22820 -26686 -29412 -24321 -22830 -25553
5310b5553J7829M672o020q284O387J7346l61j013q844n400J387J4773m661K508
$$ -25553 -7724 -3052 -9072 -17356 -10969 6377 6016 5003 -3841 -9241 -7854 6919 2258 4766
5296D766R429m223j6049r128k80j3836L582J4481k0340o621Q924n411J186M879
$$ 4766 14195 9972 -6077 -15205 -15485 -29321 -25739 -11258 -31598 -38219 -29295 -34706 -33520 -28641
5282b8641J4914J5270J1185j3221j2357K927O070k749j5211k555J0227J7885k445
$$ -28641 -13727 1543 12728 -493 -12850 -9923 -3853 -6602 -21813 -24368 -14141 3744 1299
5269A299p498j4730m80J9083O226j151P612P079o532Q055l788j4436j5314r161
$$ 1299 -6199 -20929 -21409 -2326 3900 2749 10361 17440 10908 18963 15175 739 -14575 -23736
5255b3736j3096R329M765j1125n511N977o510L457K1627J7119K2212r033j4311
$$ -23736 -36832 -27503 -22738 -33863 -39374 -33397 -39907 -36450 -14823 2296 24508 15475 1164
5242A164M95k117O704Q977j75p808j2124k262k19k38K740k1532m648r764K5111
$$ 1164 1659 -458 6246 15223 15048 7240 -4884 -7146 -7365 -7603 -4863 -26395 -31043 -40807 -15696
5227a5696N745j6250K971J7040J3872N02m254j8142M922r77j5530P509O152J0577
$$ -15696 -9951 -26201 -23230 -6190 7682 8184 3930 -14212 -9290 -10267 -25797 -18288 -12136 -1559
5213a559J425j2096n63O580p737N016j4873j9049L661J9847P304p813j0998R821
$$ -1559 -134 -12230 -12793 -6213 -13950 -8934 -23807 -42856 -39195 -19348 -12044 -19857 -30855 -21034
5199b1034K939j2844P67J3288l745K241l052P573j634r837L598R966N271j1005
$$ -21034 -18095 -30939 -30172 -16884 -20629 -18388 -21440 -13867 -15501 -25338 -21740 -11774 -6503 -17508
5185a7508j6454q918L11K4521R176m733L828K073k625j732J5531M869l669j8342
$$ -17508 -33962 -42880 -42569 -18048 -8872 -13605 -9777 -7704 -10329 -12061 3470 8339 4670 -13672
5171a3672j2698n625O51P852m690M82J1104J3m350J973o713K0213K7302j2099
$$ -13672 -26370 -31995 -31344 -23492 -28182 -27700 -16596 -16583 -20933 -18960 -25673 -5460 21842 9743
5157I743j4664o69m952k37o57j0782M41j5981j6609J0326J3754R703K009m905
$$ 9743 -4921 -5590 -10542 -10779 -11436 -22218 -21777 -37758 -54367 -44041 -30287 -20584 -18575 -23480
5143b3480P415J2618K834l968m788L738M023K339j0320j2139k950K2733K199Q12
$$ -23480 -16065 -3447 -613 -4581 -9369 -5631 -1608 731 -9589 -21728 -24678 -1945 254 1066
5129A066o772n613J1327J7586j4528j306K0009N607L986o151l0659j1530m303
$$ 1066 -5706 -11319 8 17594 3066 1760 21769 27376 31362 25211 -5448 -16978 -21281
5116b1281K005M326J6729O170p125j2820k2473k469J0478j9l118n795O540R889
$$ -21281 -19276 -14950 1779 7949 824 -11996 -34469 -36938 -26460 -26479 -29597 -35392 -28852 -18963
5102a8963K967K989R887o366K758J9722O110J230k022n341j0737q60q242o016
$$ -18963 -15996 -13007 -3120 -9486 -6728 12994 19104 20334 18312 12971 2234 1374 -6868 -12884
5088a2884M757r17K993L905r963m929l079j2654m796J9073J1973o661K178K7057
$$ -12884 -8127 -9044 -6051 -2146 -12109 -17038 -20117 -32771 -37567 -18494 -6521 -13182 -11004 16053
5074A6053J0302Q862j023K986l785n627p588j2697r056r566K804m56q288r25J0540
$$ 16053 26355 35217 34194 37180 33395 27768 20180 7483 -1573 -11139 -8335 -8791 -17079 -18004 -7464
5059g464r310j1367k488K4170M462j3438l399K146P261Q290k508j0040j1130J1222
$$ -7464 -16774 -28141 -30629 -6459 -1997 -15435 -18834 -16688 -9427 -1137 -3645 -13685 -24815 -13593
5045a3593J5125L553j3420m878P868Q510J6785p265r248k3539j5473K2594J5688
$$ -13593 1532 5085 -8335 -13213 -5345 3165 19950 12685 3437 -20102 -35575 -12981 2707
5032B707J639n70Q545p240j8221o592r384J0565J1950M961J1635k9859j1563M965
$$ 2707 4346 3776 12321 5081 -13140 -19732 -29116 -18551 -6601 -1640 9995 -19864 -31427 -26462
5018b6462l503O369M509K940K502K0132r472k0953L069m226P630J5935J6272n832
$$ -26462 -29965 -23596 -19087 -16147 -13645 6487 -2985 -23938 -20869 -25095 -17465 -1530 14742 8910
5004H910Q60k310q176j2033o385P249k735J1910l953M584O623j7035j242J3698
$$ 8910 9770 7460 -716 -12749 -19134 -11885 -14620 -2710 -6663 -2079 4544 -12491 -13733 -35
4990c5M729j0746j9263l024K0559N500l343l133M740K107m173K650k137q979K761
$$ -35 4694 -6052 -25315 -28339 -7780 -2280 -5623 -8756 -4016 -1909 -6082 -3432 -5569 -14548 -11787
4975a1787J063j9689N89J7598M746M265P013N61M899m292o887j6695m532K873
$$ -11787 -10724 -30413 -29824 -12226 -7480 -3215 3798 4359 9258 4966 -1921 -18616 -23148 -20275
4961b0275L390J2603J3664m911K548p117j2500q478M286M065p969J2393k566j3583
$$ -20275 -16885 -4282 9382 4471 7019 -98 -12598 -21076 -16790 -12725 -20694 -8301 -10867 -24450
4947b4450J0522n016j290q98m400q16J5279om323l089j27J530j1344l947Q766
$$ -24450 -13928 -18944 -20234 -21132 -25532 -26348 -11069 -11075 -15398 -18487 -18614 -17084 -28428 -32375 -23609
4932b3609n696p4J722O10o424L835P859j733p314J1230k074o158O545J5258J2616
$$ -23609 -29305 -29379 -27657 -27047 -33471 -29636 -21777 -23510 -30824 -19594 -21668 -27826 -21281 -6023 6593
4917F593j0282j3241j871O256o664j5507J4309K0074m228M473J4296j0002j8010
$$ 6593 -3689 -16930 -18801 -12545 -19209 -34716 -20407 -333 -4561 -88 14208 4206 -13804
4904a3804P024J1532k1986j2737k142Q41j6355J1084J1247K971n893o114O461
$$ -13804 -6780 4752 -17234 -29971 -32113 -31272 -47627 -36543 -25296 -22325 -28218 -34332 -27871
4891b7871K3889J4902j6600N605R575n914j2258j957J5930O76p064n402J390Q144
$$ -27871 -3982 10920 -5680 -75 9500 3586 -8672 -10629 5301 5977 -1087 -6489 -5099 3045
4877C045l445j2132K181K231M255j2013n234r99O474k760N869P238k750r153j2533
$$ 3045 -400 -12532 -10351 -8120 -3865 -15878 -21112 -22111 -15637 -18397 -12528 -5290 -8040 -17193 -29726
4862b9726J171J8565R566O286j3618j2983o781K0807J0138r216j3727j951J1819
$$ -29726 -28555 -9990 -424 5862 -7756 -20739 -27520 -6713 3425 -5791 -19518 -21469 -9650
4849i650J0366L749J6507k1155j1878r708M580p256J999M518p009L845J5026J3184
$$ -9650 716 4465 20972 -183 -12061 -21769 -17189 -24445 -22446 -17928 -24937 -21092 -6066 7118
4835G118J4081J4612j4034J42n180o860M547j4322J51O134m472j6085j4460J6110
$$ 7118 21199 35811 21777 21919 16739 9879 14426 104 255 6389 1917 -14168 -28628 -12518
4821a2518J0292j8209l463J8325J716j7283m435k993O435M417j2017o982k961
$$ -12518 -2226 -20435 -23898 -5573 -3857 -21140 -25575 -28568 -22133 -17716 -29733 -36715 -39676
4808c9676J5335O076j0522J4071l246j6652J3868J7041l830M946K256O496K0664
$$ -39676 -24341 -18265 -28787 -14716 -17962 -34614 -20746 -3705 -7535 -2589 -333 6163 26827
4795B6827J493k2943j4702p004j4370O314J0843o9L938m207l262j02M029M502
$$ 26827 28320 5377 -9325 -16329 -30699 -24385 -13542 -13611 -9673 -13880 -17142 -17244 -13215 -8713
4781h713k2893j0795K945K2894O761j4722l859R035K0070P264j584l091j344J1206
$$ -8713 -31606 -42401 -39456 -16562 -9801 -24523 -28382 -19347 723 7987 6403 3312 1968 13174
4767A3174k1616j2493J3977K4851j691n689j4060O165M529p29j259j0644k03K673
$$ 13174 -8442 -20935 -6958 17893 16202 10513 -3547 2618 7147 6418 5159 -5485 -5688 -3015
4753c015O593N544M303L685P524j4644j8656K105O59Q596k494j8498j4304O418
$$ -3015 3578 9122 13425 17110 24634 9990 -8666 -6561 -5902 2694 200 -18298 -32602 -26184
4739b6184P455O247l982n997q470M152P795J2566j128n088k018J3486J0428K903
$$ -26184 -18729 -12482 -16464 -22461 -30931 -26779 -18984 -6418 -7546 -12634 -14652 -1166 9262 12165
4725A2165P112j0580l540j2015J8315M255Q121N147K715M39r454j6222j37q026
$$ 12165 19277 8697 5157 -6858 11457 15712 23833 28980 31695 32134 22680 6458 6321 -1705
4711a705j2016l606q171N291j701j6746R884P634r09J2114J6393j4415j370J4097
$$ -1705 -13721 -17327 -25498 -20207 -21908 -38654 -28770 -21136 -22045 -9931 6462 -7953 -9323 4774
4697D774P86p265j8547j4059j17J3424K3034J1033n450l306j2681j717M336N395
$$ 4774 5560 -1705 -20252 -34311 -34428 -21004 2030 13063 7613 4307 -8374 -10091 -5755 -360
4683c60m319k103j1621M712O66J7160J4573n735r425m958j745J0724p796j1273
$$ -360 -4679 -6782 -18403 -13691 -13025 4135 18708 12973 3548 -1410 -3155 7569 -227 -11500
4669a1500R237j9339j873J8187l449j1668P878O179K277j1771k139k679J1401
$$ -11500 -2263 -21602 -23475 -5288 -8737 -20405 -12527 -6348 -4071 -15842 -17981 -20660 -9259
4656i259o277p281J9218N59R754l431k94j3215q037l423N039N383J638J0917J2380
$$ -9259 -15536 -22817 -3599 -3040 6714 3283 2989 -10226 -18263 -21686 -16647 -11264 -9626 1291 13671
4641A3671K154l621o709J2576J1933M59j6130n727n97j6652j3262K84J7070R054
$$ 13671 15825 12204 5495 18071 30004 30463 14333 8606 8009 -8643 -21905 -21621 -4551 4503
4627D503P291P292K964o471o286j0628o093K396J958p668q982R39j5343r639J1510
$$ 4503 11794 19086 22050 15579 9293 -1335 -7428 -5032 -3074 -10742 -19724 -18785 -34128 -43767 -32257
4612c2257J3766P533L422p925j2889j190J5574j6574r886R595J5957r111o758
$$ -32257 -18491 -10958 -7536 -15461 -28350 -29540 -13966 -30540 -40426 -30831 -14874 -23985 -30743
4599c0743K5N863j7647O22K0393N780o030J4050J0802o051o634P285O623j211
$$ -30743 -30718 -24855 -42502 -41880 -21487 -15707 -21737 -7687 3115 -2936 -9570 -2285 4338 3127
4585C127j3500J1523R574j3222m50L895o755j2293n664J6515l52j0495P176L380
$$ 3127 -10373 1150 10724 -2498 -2948 947 -5808 -18101 -23765 -7250 -7602 -18097 -10921 -7541
4571g541l171n09J1504j839j3734N717j691o817K718R211o96p19j7196Q110K0650
$$ -7541 -10712 -11221 283 -1556 -15290 -9573 -11264 -18081 -15363 -6152 -6848 -7567 -24763 -16653 3997
4556C997J1684j3558J3712k809j0622n066j491Q045L959j321j5172l480k3822
$$ 3997 15681 2123 15835 13026 2404 -2662 -4153 3892 7851 6530 -8642 -12122 -35944
4543c5944K113J7195Q231R787L673l664k069N707p752m564q485R093R534R387
$$ -35944 -33831 -16636 -8405 1382 5055 1391 -678 5029 -2723 -7287 -15772 -6679 2855 12242
4529A2242K416j2653j4354k349L605l285Q00n883J579O530L429P210J745o9q187
$$ 12242 14658 2005 -12349 -14698 -11093 -14378 -13578 -19461 -17882 -11352 -7923 -713 1032 963 -7224
4514g224O517l451j1198M25N261k337J7746j3295k5905l701J0987J2950J0127
$$ -7224 -707 -4158 -15356 -14931 -9670 -12007 5739 -7556 -33461 -37162 -26175 -13225 -3098
4501c098p10j2436L740O643Q206k550j4690M89J0388R081j629J4422j398j5274
$$ -3098 -3808 -16244 -12504 -5861 2345 -205 -14895 -14406 -4018 5063 3434 17856 16458 1184
4487A184j6844q058J1904R585j732k3211P75P843O674m608j1671o550n517K8853
$$ 1184 -15660 -23718 -11814 -2229 -3961 -27172 -26397 -18554 -11880 -16488 -28159 -34709 -40226 -11373
4473a1373L7947n592n012j7924k969p265p153N902Q704j1017P661O775M403r690
$$ -11373 26574 20982 15970 -1954 -4923 -12188 -19341 -13439 -4735 -15752 -8091 -1316 3087 -6603
4459f603j3168Q925L01j0105j0415P572j0481J4523J9607M446K819M8r231r651
$$ -6603 -19771 -10846 -10545 -20650 -31065 -23493 -33974 -19451 156 4602 7421 7469 -1762 -11413
4445a1413J3559k538o239k706m230l597P460J0806j2105j2334K601O745J2693
$$ -11413 2146 -392 -6631 -9337 -13567 -17164 -9704 1102 -11003 -23337 -20736 -13991 -1298
4432a298J76r943Q326J5024r148O171J055k7247j5171J2662k973j2813J1169R164
$$ -1298 -1122 -11065 -2739 12285 3137 9308 10363 -16884 -32055 -19393 -22366 -35179 -24010 -14846
4418a4846j478M196P665m549n776K8529K0166n623k1429j2228R702k786j1049
$$ -14846 -16324 -12128 -4463 -9012 -14788 13741 33907 28284 6855 -5373 4329 1543 -9506
4405i506k667J3940J51j3426n705J3074k902P887J7953J1799m936l906k0933j4409
$$ -9506 -12173 1767 1918 -11508 -17213 -4139 -7041 846 18799 30598 25662 21756 823 -13586
4391a3586L44K35k172m796j6116J718J870R100J1192J0941j0653j4446j0006J6905
$$ -13586 -13242 -13007 -15179 -19975 -36091 -34373 -32503 -23403 -12211 -1270 -11923 -26369 -36375 -19470
4377a9470J6272J0100j706J0492m054j8192L421P42j8491M395J2735J3149l151
$$ -19470 -3198 6902 5196 15688 11634 -6558 -3137 -2395 -20886 -16491 -3756 9393 6242
4364F242j1570j3502j5371J0433q227L616m641J557L512k853lJ1448p20J4004
$$ 6242 -5328 -18830 -34201 -23768 -31995 -28379 -33020 -31463 -27951 -30804 -30807 -19359 -20079 -6075
4350f075N191n668m367l817R83K655K23j1766l757J4203P463K697j0182k427J5687
$$ -6075 -884 -6552 -10919 -14736 -13753 -11098 -10875 -22641 -26398 -12195 -4732 -2035 -12217 -14644 1043
4335A043k085m492J4325K410j3853q857j07N359O433L508k1129j9236J926J0466
$$ 1043 -1042 -5534 8791 11201 -2652 -11509 -11616 -6257 176 3684 -17445 -36681 -34755 -24289
4321b4289O47J0101J7472m874l324L081M889k439j1999k936k942L240J8161J5629
$$ -24289 -23642 -13541 3931 -943 -4267 -1186 3703 1264 -10735 -13671 -16613 -13373 4788 20417
4307B0417l025k4134J055L392L317M338j846o355m788J439J1980j1652j0415j6872
$$ 20417 17392 -6742 -5687 -2295 1022 5360 3514 -2841 -7629 -6190 5790 -5862 -16277 -33149
4293c3149l340J8807M918N95q696j887P157Q835K4695O364j3129n569R431j863
$$ -33149 -36489 -17682 -12764 -12169 -20865 -22752 -15595 -6760 17935 24299 11170 5601 15032 13169
4279A3169K656j4673l778J3082j0698q391K587P960L529R611R441j538r102k3581
$$ 13169 15825 1152 -2626 10456 -242 -8633 -6046 1914 5443 15054 24495 22957 13855 -9726
4265i726K246J5025n868j2412Q639J9102l914q404q665n424K841k784n315L851
$$ -9726 -7480 7545 1677 -10735 -2096 17006 13092 4688 -3977 -9401 -6560 -9344 -14659 -10808
4251a0808O396P115j5456k6190n625J0792R164J3711J5017L041k0827J1654p21
$$ -10808 -4412 2703 -12753 -38943 -44568 -33776 -24612 -10901 4116 7157 -13670 -2016 -2737
4238b737K891j818P291q860q44q778m491J6616K253r213O896J510L353o049L071
$$ -2737 154 -1664 5627 -3233 -4077 -12855 -17346 -730 1523 -7690 -794 716 4069 -1980 1091
4223A091K4669p118k7954j3304N97J9241Q633k679m629l001q228P991M819k65
$$ 1091 25760 18642 -9312 -22616 -22019 -2778 5855 3176 -1453 -4454 -12682 -4691 128 -137
4209a37j0936j0145J4293J994J986p80j4678p311K324M752M758J2877Q599j337
$$ -137 -11073 -21218 -6925 -4931 -2945 -3725 -18403 -25714 -23390 -18638 -13880 -1003 7596 6259
4195F259K890K785j711L717j0325m55J343Q958l179r466m713o283O301j681j8585
$$ 6259 9149 11934 10223 13940 3615 3160 4503 13461 10282 816 -3897 -10180 -3879 -5560 -24145
4180b4145K326J9985J9979j0897j074n310j2289Q6J7909L478j2303r219O750n876
$$ -24145 -21819 -1834 18145 7248 6174 864 -11425 -11339 6570 10048 -2255 -11474 -4724 -10600
4166a0600J4382m947q931n934j0704K191J8037J1340j0808M078J853P954o798
$$ -10600 3782 -1165 -10096 -16030 -26734 -24543 -6506 4834 -5974 -1896 -43 7911 1113
4153A113k1105M279J7551K063n51N539l351j3281p964j2280P563l0J0912l78r896
$$ 1113 -19992 -15713 1838 3901 3350 8889 5538 -7743 -15707 -27987 -20424 -20454 -9542 -9920 -19816
4138a9816J908Q84J7525j882L035l150j999n037K012r698K736p4j0492L126M659
$$ -19816 -17908 -17024 501 -1381 1654 -1496 -3495 -8532 -6520 -16218 -13482 -13556 -24048 -20922 -16263
4123a6263p905p71R91k0636K332J0601N555O574K75o144R514J3551k030R592L118
$$ -16263 -24168 -24939 -23948 -44584 -42252 -31651 -26096 -19522 -19247 -25391 -15877 -2326 -4356 5236 8354
4108H354p948R353m157K454M643k508k1120p314O864J4282j5173r74O315K901
$$ 8354 406 9759 5602 8056 12699 10191 -10929 -18243 -11379 2903 -12270 -13244 -6929 -4028
4094d028J671q490j8892M065K835P479J5301j5269m322J6696P428p418M39l691
$$ -4028 -2357 -10847 -29739 -25674 -22839 -15360 -59 -15328 -19650 -2954 4474 -2944 -2505 -6196
4080f196m223J802N815O918q458k620m057J008o335J5837o771j488M362j615O405
$$ -6196 -10419 -8617 -2802 4116 -4342 -6962 -11019 -10011 -16346 -509 -7280 -8768 -4406 -6021 384
4065C84j195l519j4224j4054J1376N754J1160q553j0236J4060K7523J1309j1428
$$ 384 -811 -4330 -18554 -32608 -21232 -15478 -4318 -12871 -23107 -9047 18476 29785 18357
4052A8357o114m661r625L190p416j391l143J392L5p527r486j45L8P246R748l482
$$ 18357 12243 7582 -2043 1147 -6269 -7660 -10803 -9411 -9376 -16903 -26389 -26534 -26496 -19250 -9502 -12984
4036a2984j1840J5565R409l680J1462N141p124N11Q959P39j8048p006n678K808
$$ -12984 -24824 -9259 150 -3530 7932 13073 5949 6460 15419 16158 -1890 -8896 -14574 -11766
4022a1766l35q414j3599k814J4195O356P656r355j5286j760R979l95M764m847
$$ -11766 -12101 -20515 -34114 -36928 -22733 -16377 -8721 -18076 -33362 -35122 -25143 -25538 -20774 -25621
4008b5621k889L188L85m220m028J4162m544j677M041J0886Q299j0538q884O771
$$ -25621 -28510 -25322 -24937 -29157 -33185 -19023 -23567 -25244 -21203 -10317 -2018 -12556 -21440 -14669
3994a4669k719L405K415p049O332P24l908K3624q07j8786j7310q679J951J505
$$ -14669 -17388 -13983 -11568 -18617 -12285 -11561 -15469 8155 7348 -11438 -28748 -37427 -35476 -33971
3980c3971P517J4605j033l757M615J902j5717j0819K7886J0356k0842q8j461r910
$$ -33971 -26454 -11849 -12882 -16639 -12024 -10122 -25839 -36658 -8772 1584 -19258 -19346 -20807 -30717
3966c0717l605K384J6845O677K990j3156o600l945O543Q216k497j1323o274M023
$$ -30717 -34322 -31938 -15093 -8416 -5426 -18582 -25182 -29127 -22584 -14368 -16865 -28188 -34462 -30439
3952c0439K5569M943J1010J682j6621k4032l513J8374n124P934O716J621l4122
$$ -30439 -4870 73 11083 12765 -3856 -27888 -31401 -13027 -18151 -10217 -3501 -1880 -36002
3939c6002m080J4099J2144O119L608n944j0294m972r145K495J3548N688J667K3700
$$ -36002 -40082 -25983 -13839 -7720 -4112 -10056 -20350 -25322 -34467 -31972 -18424 -12736 -11069 12631
3925A2631k19p374j2239M144R468j4100j2094J3890J4090n123o027r158m951K066
$$ 12631 12412 5038 -7201 -3057 6411 -7689 -19783 -5893 8197 3074 -2953 -12111 -17062 -14996
3911a4996j1642N290m226l400l631O687P526Q396J2210k572k359n080j8384N298
$$ -14996 -26638 -21348 -25574 -28974 -32605 -25918 -18392 -9996 2214 -358 -2717 -7797 -26181 -20883
3897b0883o408J7189N749k882q80j749L558J8235N623P015l0603k2080J19J4579
$$ -20883 -27291 -10102 -4353 -7235 -8115 -9864 -6306 11929 17552 24567 -6036 -28116 -27997 -13418
3883a3418J6267K737q436j276q835j3823o248N654J3072J1188j228j3658Q789
$$ -13418 2849 5586 -2850 -4126 -12961 -26784 -33032 -27378 -14306 -3118 -4346 -18004 -9215
3870i215J6812N788l992O922m393k9599L017L842O774J090r467j4661q496J0152
$$ -9215 7597 13385 9393 16315 11922 -17677 -14660 -10818 -4044 -2954 -12421 -27082 -35578 -25426
3856b5426O250K389P458m505k8R993J427p096p676P5m735J581K0272J3151o161
$$ -25426 -19176 -16787 -9329 -13834 -13862 -3869 -2442 -9538 -17214 -17139 -21874 -20293 -21 13130 6969
3841F969q974j4066K114L914j98O849l718n535q484M843o914J0185R614Q135K678
$$ 6969 -2005 -16071 -13957 -10043 -10241 -3392 -7110 -12645 -21129 -16286 -23200 -13015 -3401 4734 7412
3826G412J6963L253j7267m594K977J770n071j2590q601L351N382M956J4437J1961
$$ 7412 24375 27628 10361 5767 8744 10514 5443 -7147 -15748 -12397 -7015 -2059 12378 24339
3812B4339j1563p340j1111j0392l960J8608k035K61j455J0073r09r90n273m535
$$ 24339 12776 5436 -5675 -16067 -20027 -1419 -3454 -3193 -4648 5425 4516 3526 -1747 -6282
3798f282J2333P237L013J280J04L490k298q972k059o48j371N999o399j2997j7111
$$ -6282 6051 13288 16301 17581 17685 21175 18877 9905 7846 7198 5827 11826 5427 -7570 -24681
3783b4681j143O657Q707l572j2726l790o28J5284J0410l254j1116J0952J1382
$$ -24681 -25824 -19167 -10460 -14032 -26758 -30548 -31176 -15892 -5482 -8736 -19852 -8900 2482
3770B482P015l835q999o187J6326j0104j5638k747l275M92K465R000O553O53j6277
$$ 2482 9497 5662 -3337 -9524 6802 -3302 -18940 -21687 -24962 -24470 -22005 -13005 -6452 -5799 -22076
3755b2076j0284L077J3359K4248q232j0621J0207O025l172j955Q119o186M756
$$ -22076 -32360 -29283 -15924 8324 92 -10529 -322 5703 2531 576 8695 2509 7265
3742G265N399M839K961O834j316k8912o38J8971l404j344n986r481n752j593o01
$$ 7265 12664 17503 20464 27298 25982 -2930 -3568 15403 11999 10655 4669 -4812 -10564 -12157 -12758
3727a2758J696j062R94M305J1607r22r472J0243k177j1870J2409K311r066l262
$$ -12758 -11062 -12124 -11130 -6825 4782 3860 -5612 4631 2454 -9416 2993 5304 -3762 -7024
3713g024o721j7459j3386J3887L332J1320K0012J1880l451p831k174k182K424
$$ -7024 -13745 -31204 -44590 -30703 -27371 -16051 3961 15841 12390 4559 2385 203 2627
3700B627K874n53q678J1663M041j5698k698K2j6014J501O714R413L568o423o974
$$ 2627 5501 4948 -3730 7933 11974 -3724 -6422 -6400 -22414 -20913 -14199 -4786 -1218 -7641 -14615
3685a4615r080r632J884J4853j2557R14M551j0035J6665o635L312J0905p50q575
$$ -14615 -23695 -33327 -31443 -16590 -29147 -28233 -23682 -33717 -17052 -23687 -20375 -9470 -10220 -18795
3671a8795o812o593J5150K3172j0325m080K044n87L343K0540j1206k4619q128
$$ -18795 -25607 -32200 -17050 6122 -4203 -8283 -6239 -6826 -3483 17057 5851 -18768 -26896
3658b6896j4848O653q86J2761K258l414Q54K483J1135L097P726n291J400J3579
$$ -26896 -41744 -35091 -35977 -23216 -20958 -24372 -23518 -21035 -9900 -6803 923 -4368 -2968 10611
3644A0611j454M680L147j1785J2129j767j6681Q635P111k5025l194k855r229n921
$$ 10611 9157 13837 16984 5199 17328 15561 -1120 7515 14626 -10399 -13593 -16448 -25677 -31598
3630c1598J4336J7972P278J1405Q743j1295m231K497N960j4544q058q684l843
$$ -31598 -17262 710 7988 19393 28136 16841 12610 15107 21067 6523 -1535 -10219 -14062
3617a4062J9043n607p808j9291J1510J6855O326M457M136q302p322M683j081k278
$$ -14062 4981 -626 -8434 -27725 -16215 640 6966 11423 15559 7257 -65 4618 3537 1259
3603A259m368M821o03k1175o393p693J2600J1748N7P283O597O295j3687M097K505
$$ 1259 -3109 1712 1109 -20066 -26459 -34152 -21552 -9804 -9747 -2464 4133 10428 -3259 838 3343
3588C343j368j4514J1695J4787j76j6816l766O518M279Q452m299l920p039p725
$$ 3343 1975 -12539 -844 13943 13767 -3049 -6815 -297 3982 12434 8135 4215 -2824 -10549
3574a0549j382k274j5375l560l841Q532J3760L732o116M061q59L527N379J6970
$$ -10549 -11931 -14205 -29580 -33140 -36981 -28449 -14689 -10957 -17073 -13012 -13871 -10344 -4965 12005
3560A2005p48j5938j528N025m510j2904J399K140j5139N71J2416l294N987J1255
$$ 12005 11257 -4681 -6209 -1184 -5694 -18598 -17199 -15059 -30198 -29627 -17211 -20505 -14518 -3263
3546c263O877R951L188j0000Q70k149L055J110j299j9850j793M837l610k906j0063
$$ -3263 3614 13565 16753 6753 7623 5474 8529 9639 8340 -11510 -13303 -8466 -12076 -14982 -25045
3531b5045k352J1729N940K727Q454j784N312n257N227N754j15j850j5294k3222
$$ -25045 -27397 -15668 -9728 -7001 1453 -331 4981 -276 4951 10705 10590 8740 -6554 -29776
3517b9776p01J3047Q205M48K539q68n384m221J2158k653j0782J3234r7P827R086
$$ -29776 -30477 -17430 -9225 -8777 -6238 -7106 -12490 -16711 -4553 -7206 -17988 -4754 -4851 2976 12062
3502A2062J1747Q316j7582j6415k494R740l53p203q83Q901k2192j067Q202L604
$$ 12062 23809 32125 14543 -1872 -4366 5374 5021 -2182 -3065 5836 -16356 -17423 -9221 -5617
3488e617J761j2817N284J9368n471J895J4452qm488j5491k664R088p293o577L562
$$ -5617 -3856 -16673 -11389 7979 2508 4403 18855 18847 14359 -1132 -3796 5292 -2001 -8578 -5016
3473e016j1160J17j667P314n632l49P223j408L707rQ819M046J977j9495r950O434
$$ -5016 -16176 -16059 -17726 -10412 -16044 -16393 -9170 -10578 -6871 -6880 1939 5985 7962 -11533 -21483 -15049
3457a5049K031N455R134j1448r275n64L177Q130N672m659j0143q010J7905j570
$$ -15049 -13018 -7563 1571 -9877 -19152 -19716 -16539 -8409 -2737 -7396 -17539 -25549 -7644 -9214
3443i214q220K889j039Q22n560j480Q628j2410n702p773M02O480q031O725O014
$$ -9214 -17434 -14545 -15584 -14762 -20322 -21802 -13174 -25584 -31286 -39059 -38657 -32177 -40208 -33483 -27469
3428b7469L666K6189J1896j4075j7670n681N959P977M411J957N789j0174j0693
$$ -27469 -23803 2386 14282 207 -17463 -23144 -17185 -9208 -4797 -2840 2949 -7225 -17918
3415a7918j166M927K672o346J694J601j913m873m682L890l147L788o673J5997
$$ -17918 -19084 -14157 -11485 -17831 -16137 -14536 -16449 -21322 -26004 -22114 -25261 -21473 -28146 -12149
3401a2149k389j7171k468J048J0360P451j963L273N318k633L90L977O645L136
$$ -12149 -14538 -31709 -34177 -33129 -22769 -15318 -17281 -14008 -8690 -11323 -10933 -6956 -311 2825
3387B825K282l441R68J1262l470j621j284o067J6761r121O385j4733l333n095
$$ 2825 5107 1666 2634 13896 10426 8805 7521 1454 18215 9094 15479 746 -2587 -7682
$$ [...]
##END NTUPLES=NMR SPECTRUM
##END=
