##TITLE=Analysis number 312763
Compound Code cc 16401
Book Reference 350/114/10
Project Code adrs
Chemist Name chrisr
##JCAMPDX= 6.0         $$ Bruker NMR JCAMP-DX V2.0
##DATA TYPE= NMR SPECTRUM
##DATA CLASS= NTUPLES
##ORIGIN= Bruker BioSpin GmbH
##OWNER= NMR
$$ XWIN-NMR		Version 3.5
$$ Fri Aug 12 10:32:03 2005 GMT Daylight Time (UT+1h)  MAYBRIDGE\NMR@NMR_250MHZ
##.OBSERVE FREQUENCY= 250.131544655141
##.OBSERVE NUCLEUS= ^1H
##.ACQUISITION MODE= SIMULTANEOUS (DQD)
##.ACQUISITION SCHEME= undefined
##.AVERAGES= 16
##.DIGITISER RES= 18
##SPECTROMETER/DATA SYSTEM= dpx250
##.PULSE SEQUENCE= zg30
##.SOLVENT NAME= DMSO
##.SHIFT REFERENCE= (INTERNAL, DMSO, 0, 16.522)
##AUDIT TRAIL= $$ (NUMBER, WHEN, WHO, WHERE, WHAT)
$$ ##TITLE= Audit trail, XWIN-NMR		Version 3.5
$$ ##JCAMPDX= 5.01
$$ ##ORIGIN= Bruker BioSpin GmbH
$$ ##OWNER= NMR
$$ C:\u/data/dgb/nmr/ADRS/7730/pdata/1/auditp.txt
$$ ##AUDIT TRAIL=  $$ (NUMBER, WHEN, WHO, WHERE, WHAT)
(   1,<2005-08-12 10:31:43.10 +100>,<MAYBRIDGE\NMR>,<NMR_250MHZ>,
      <created by zg, POWCHK disabled, PULCHK disabled
       configuration hash MD5:
       62 19 C7 07 E1 42 D1 B7 37 6C 3D D0 77 39 F9 E6
       data hash MD5: 64K
       28 35 68 33 5F 58 60 8F FC F7 CF 1B 16 E8 72 CE>)
(   2,<2005-08-12 10:31:55.84 +100>,<MAYBRIDGE\NMR>,<NMR_250MHZ>,
      <Start of raw data processing
       ef LB = 0.3 FT_mod = 6 PKNL = 1 SI = 32K 
       data hash MD5: 32K
       CB 6A 4F 94 CD 40 BE F4 3C BE 25 01 FB DC 35 AD>)
(   3,<2005-08-12 10:31:57.89 +100>,<MAYBRIDGE\NMR>,<NMR_250MHZ>,
      <apk 
       data hash MD5: 32K
       2C 91 FE D7 93 77 55 A0 93 EA 0E 90 7E 82 DA B3>)
(   4,<2005-08-12 10:31:58.67 +100>,<MAYBRIDGE\NMR>,<NMR_250MHZ>,
      <abs ABSG = 5 
       data hash MD5: 32K
       DF CA 21 7E E3 7E 74 98 4A C8 A9 BA DA 22 22 86>)
$$ ##END=
$$ 
$$ hash MD5
$$ 5A F5 21 1A 3E 20 BE 10 50 C1 C1 0D B9 4B 21 10
##$RELAX= 
##$RELAX= 
##$RELAX= 
##$RELAX= 
##$RELAX= 
##$RELAX= 
##$RELAX= 
$$ Bruker specific parameters
$$ --------------------------
##$DU= <C:\u>
##$EXPNO= 7730
##$NAME= <ADRS>
##$PROCNO= 1
##$TYPE= <nmr>
##$USER= <dgb>
##$AMP= (0..31)
100 100 100 100 100 100 100 100 100 100 100 100 100 100 100 100 100 100 
100 100 100 100 100 100 100 100 100 100 100 100 100 100 
##$AQSEQ= 0
##$AQ_mod= 3
##$AUNM= <au_zg>
##$AUTOPOS= <10 >
##$BF1= 250.13
##$BF2= 250.13
##$BF3= 250.13
##$BF4= 250.13
##$BF5= 500.13
##$BF6= 500.13
##$BF7= 500.13
##$BF8= 500.13
##$BYTORDA= 1
##$CFDGTYP= 0
##$CFRGTYP= 5
##$CHEMSTR= <none>
##$CNST= (0..31)
1 1 145 1 1 1 1 1 1 1 1 1 1 1 1 1 1 1 1 1 1 1 1 1 1 1 1 1 1 1 1 1 
##$CPDPRG= <>
##$CPDPRG1= <>
##$CPDPRG2= <>
##$CPDPRG3= <>
##$CPDPRG4= <mlev>
##$CPDPRG5= <mlev>
##$CPDPRG6= <mlev>
##$CPDPRG7= <mlev>
##$CPDPRG8= <mlev>
##$CPDPRGB= <>
##$CPDPRGT= <>
##$D= (0..31)
0 1 0 0 0 0 0 0 0 0.06 0 0 0 0 0 0 0.0002 0 0 0 0 0 0 0 0 0 0 0 0 0 0 
0 
##$DATE= 1123839102
##$DBL= (0..7)
120 120 120 120 120 120 120 120 
##$DBP= (0..7)
150 150 150 150 150 150 150 150 
##$DBP07= 0
##$DBPNAM0= <>
##$DBPNAM1= <>
$$ [...]
##$SUBNAM7= <"">
##$SUBNAM8= <"">
##$SUBNAM9= <"">
##$SW= 20.6930455092707
##$SWIBOX= (0..15)
0 0 3 0 0 0 0 0 0 0 0 0 0 0 0 0 
##$SW_h= 5175.983436853
##$TD= 65536
##$TD0= 1
##$TE= 296.16
##$TE2= 300
##$TE3= 300
##$TEG= 300
##$TL= (0..7)
0 120 120 120 120 120 120 120 
##$TP= (0..7)
150 150 150 150 150 150 150 150 
##$TP07= 0
##$TPNAME0= <>
##$TPNAME1= <>
##$TPNAME2= <>
##$TPNAME3= <>
##$TPNAME4= <>
##$TPNAME5= <>
##$TPNAME6= <>
##$TPNAME7= <>
##$TPOAL= (0..7)
0.5 0.5 0.5 0.5 0.5 0.5 0.5 0.5 
##$TPOFFS= (0..7)
0 0 0 0 0 0 0 0 
##$TUNHIN= 0
##$TUNHOUT= 0
##$TUNXOUT= 0
##$USERA1= <user>
##$USERA2= <user>
##$USERA3= <user>
##$USERA4= <user>
##$USERA5= <user>
##$V9= 5
##$VALIST= <valist>
##$VCLIST= <CCCCCCCCCCCCCCC>
##$VD= 0
##$VDLIST= <DDDDDDDDDDDDDDD>
##$VPLIST= <PPPPPPPPPPPPPPP>
##$VTLIST= <TTTTTTTTTTTTTTT>
##$WBST= 1024
##$WBSW= 4
##$XGAIN= (0..3)
0 0 0 0 
##$XL= 0
##$YL= 0
##$YMAX_a= 348769
##$YMIN_a= -256497
##$ZGOPTNS= <>
##$ZL1= 120
##$ZL2= 120
##$ZL3= 120
##$ZL4= 120
##$ABSF1= 16.522
##$ABSF2= -4.171173
##$ABSG= 5
##$ABSL= 3
##$ALPHA= 0
##$AQORDER= 0
##$ASSFAC= 0
##$ASSFACI= 0
##$ASSFACX= 0
##$ASSWID= 0
##$AUNMP= <proc_1d>
##$AZFE= 0.1
##$AZFW= 0.1
##$BCFW= 0
##$BC_mod= 0
##$BYTORDP= 0
##$COROFFS= 0
##$CY= 12.5
##$DATMOD= 1
##$DC= 0
##$DFILT= <>
##$DTYPP= 0
##$F1P= 14.0000005364418
##$F2P= -0.99999901652339
##$FCOR= 0.5
##$FTSIZE= 32768
##$FT_mod= 6
##$GAMMA= 0
##$GB= 0
##$INTBC= 1
##$INTSCL= 1
##$ISEN= 128
##$LB= 0.3
##$LEV0= 0
##$LPBIN= 0
##$MAXI= 10000
##$MC2= 0
##$MEAN= 0
##$ME_mod= 0
##$MI= 0
##$NCOEF= 0
##$NC_proc= -3
##$NLEV= 6
##$NOISF1= 0
##$NOISF2= 0
##$NSP= 0
##$NTH_PI= 0
##$NZP= 0
##$OFFSET= 16.522
##$PC= 1
##$PHC0= -90.85607
##$PHC1= 4.06736
##$PH_mod= 1
##$PKNL= yes
##$PPARMOD= 0
##$PSCAL= 4
##$PSIGN= 0
##$REVERSE= no
##$SF= 250.13
##$SI= 32768
##$SIGF1= 0
##$SIGF2= 0
##$SINO= 400
##$SIOLD= 32768
##$SREGLST= <1H.DMSO>
##$SSB= 0
##$STSI= 32768
##$STSR= 0
##$SW_p= 5175.98343685301
##$SYMM= 0
##$S_DEV= 0
##$TDeff= 65536
##$TDoff= 0
##$TI= <Analysis number 999999
Compound Code 99
Book Reference 9
Project Code 9>
##$TILT= no
##$TM1= 0
##$TM2= 0
##$TOPLEV= 0
##$USERP1= <user>
##$USERP2= <user>
##$USERP3= <user>
##$USERP4= <user>
##$USERP5= <user>
##$WDW= 1
##$XDIM= 32768
##$YMAX_p= 270299223
##$YMIN_p= -148424
$$ End of Bruker specific parameters
$$ ---------------------------------
##NTUPLES= NMR SPECTRUM
##VAR_NAME=  FREQUENCY,     SPECTRUM/REAL,   SPECTRUM/IMAG
##SYMBOL=    X,             R,               I
##VAR_TYPE=  INDEPENDENT,   DEPENDENT,       DEPENDENT
##VAR_FORM=  AFFN,          ASDF,            ASDF
##VAR_DIM=   32768,         32768,           32768
##UNITS=     HZ,            ARBITRARY UNITS, ARBITRARY UNITS
##FACTOR=    0.157963299565203, 1,           1
##FIRST=     4132.6476996994, 0,             0
##LAST=      -1043.33573715361, 0,           0
##MIN=       -1043.33573715361, -148424,     0
##MAX=       4132.6476996994, 270299223,     0
$$ Real data points
##PAGE= N=1
##DATA TABLE= (X++(R..R)), XYDATA
$$ [...]
$$ plain form
28122 2239 -1582 17423 9138 -29386 -33671 -41062 -26060 -11217 -21956 -31912 91 -9901 -11473
28109 -11473 13777 18490 37308 29445 15906 843 22118 29493 29045 18686 20531 26185 41077
28096 41077 25605 9207 3876 3394 -2992 -1495 5546 15644 15618 24347 24449 14665 6163 35604
28082 35604 41506 40770 40622 27255 34042 58252 57340 34486 2670 -7435 -20614 -30004 -10382
28069 -10382 -3255 20033 -1688 -13760 -12637 3539 26955 15808 25272 32712 22410 3828
28057 3828 -8219 4821 23439 22040 1171 -17373 -13589 14219 39184 22498 -5242 10145
28045 10145 17102 11716 20699 6388 1413 18062 22348 -3425 -13140 -5153 -17378 -9598 -19900
28032 -19900 -47483 -37468 -33288 -17768 -15334 7714 32062 35698 21505 11527 -13742 24309
$$ packed form
28122B239l821J9005q285l8524m285p391J5002J4843j0739r956L2003r992j572
28109a1473K5250M713J8818p863j3539j5063K1275P375m48j0359J845N654J4892
28096D1077j5472j6398n331m82o386J497P041J0098k6Q729J02r784q502K9441
28082C5604N902p36j48j3367O787K4210r12k2854l1816j0105j3179r390J9622
28069a0382P127K3288k1721j2072J123J6176K3416j1147R464P440j0302j8582
28057C828j2047J3040J8618j399k0869j8544L784K7808K4965j6686k7740J5387
28045A0145O957n386Q983j4311m975J6649M286k5773r715P987j2225P780j0302
28032a9900k7583J0015M180J5520K434K3048K4348L636j4193r978k5269L8051
$$ plain form
28020 24309 43889 69271 91790 83008 75169 51930 19345 2785 1983 16046 35430 40957 26773
28007 26773 4378 888 28850 17457 15278 32823 4775 10460 13604 31428 28478 11102 13455
27994 13455 33444 50434 53001 42701 48571 28138 20322 -1873 -19110 -22531 -15552 4697 4771
27981 4771 22885 27288 50247 74277 73390 35249 37175 51805 32263 24712 19209 45630 45499
27968 45499 26193 23760 31007 13509 -15423 -44241 17121 39301 22015 36306 37565 30429
27956 30429 31346 712 -3836 19629 38261 32118 47116 24528 25764 31208 20160 4529 19447
27943 19447 23473 20005 -3270 12958 14498 20679 47530 76499 89988 55731 47268 54147 64315
27930 64315 40392 32117 13215 6506 901 7301 1800 -12589 -4669 17078 -8739 -27563 -21129
$$ packed form
28020B4309J9580K5382K2519q782p839k3239l2585j6560q02J4063J9384N527j4184
28007B6773k2395l490K7962j1393k179J7545k8048N685L144J7824k950j7376K353
27994A3455J9989J6990K567j0300N870k0433p816k2195j7237l421O979K0249P4
27981D771J8114M403K2959K4030q87l8141J926J4630j9542p551n503K6421j31
27968D5499j9306k433P247j7498k8932k8818O1362K2180j7286J4291J259p136
27956C0429R17l0634m548K3465J8632o143J4998k2588J236N444j1048j5631J4918
27943A9447M026l468k3275J6228J540O181K6851K8969J3489l4257q463O879J0168
27930F4315k3923q275j8902o709n605O400n501j4389P920K1747k5817j8824O434
$$ plain form
27917 -21129 -10220 12961 27941 34889 28050 9200 4820 6935 455 -20947 -2854 13683 5272
27904 5272 26698 28441 18522 -5424 -16391 11349 29339 46351 51608 56758 18505 -6478 -32322
27891 -32322 13617 37051 10139 -1866 -5715 19354 38183 38663 16929 19872 57552 69904
27879 69904 58084 45734 13252 31463 58413 61265 13856 -14277 -12440 6105 3750 27611
27867 27611 39028 20996 25094 34038 14097 8767 24189 27210 14024 34543 15237 6945 21575
27854 21575 18420 -4680 -1832 -637 -11729 -21225 -26532 -3817 -6115 7482 21197 35024 29344
27841 29344 31425 32874 25859 6034 28511 38078 50651 53099 17832 9580 25094 24613 20469
27828 20469 21258 11292 32146 44567 79007 75429 63749 64864 59587 39508 26645 28132 23748
$$ packed form
27917b1129J0909K3181J4980O948o839j8850m380K115o480k1402J8093J6537q411
27904E272K1426J743r919k3946j0967K7740J7990J7012N257N150l8253k4983k5844
27891c2322M5939K3434k6912j2005l849K5069J8829M80k1734K943L7680J2352
27879F9904j1820j2350l2482J8211K6950K852m7409k8133J837J8545k355K3861
27867B7611J1417j8032M098Q944j9941n330J5422L021j3186K0519j9306q292J4630
27854B1575l155k3100K848J195j1092r496n307K2715k298J3597J3715J3827n680
27841B9344K081J449p015j9825K2477R567J2573K448l5267q252J5514m81m144
27828B0469P89r966K0854J2421L4440l578j1680J115n277k0079j2863J487m384
$$ plain form
27815 23748 16260 27437 32518 51686 67880 70870 83756 88103 89275 66624 18183 548 9536
27802 9536 32235 44017 50115 53776 31973 -1723 21496 52228 43899 29779 13783 33245
27790 33245 43582 25163 7921 20351 35972 27857 55140 44887 18218 -17125 -7356 11882
27778 11882 38513 69937 54941 37290 9829 -1660 7121 -19077 -19123 -15675 -26549 18535 49949
27765 49949 73246 80647 82063 78124 73620 84117 51047 13861 3394 18281 30288 24813 54164
27752 54164 70948 64348 76701 65866 31613 32280 39799 35567 46608 43278 51318 75756 68807
27739 68807 57366 36898 44267 34917 54433 59289 40147 26555 1761 -12453 1213 24832
27727 24832 -451 1915 32121 39196 44514 47445 60967 55826 42670 47220 48472 25451 33950
$$ packed form
27815B3748p488J1177N081J9168J6194K990J2886M347J172k2651m8441j7635Q988
27802I536K2699J1782O098L661k1803l3696K3219L0732q329j4120j5996J9462
27790C3245J0337j8419j7242J2430J5621q115K7283j0253k6669l5343R769J9238
27778A1882K6631L1424j4996j7651k7461j1489Q781k6198m6L448j0874M5084L1414
27765D9949K3297P401J416l939m504J0497l3070l7186j0467J4887J2007n475K9351
27752E4164J6784o600J2353j0835l4253O67P519m232J1041l330Q040K4438o949
27739F8807j1441k0468P369r350J9516M856j9142j3592k4794j4214J3666K3619
27727B4832k5283K366L0206P075N318K931J3522n141j3156M550J252k3021Q499
$$ plain form
27714 33950 84166 83633 50361 28744 24456 43854 52673 20833 4844 26137 15964 12680 1678
27701 1678 454 -25023 -11339 38760 51389 47395 24697 6861 35814 53897 42001 40816
27689 40816 26397 10983 2076 22480 26939 64603 42139 -8783 -4144 1752 241 19328 15960
27676 15960 -2185 4567 1244 22361 25396 46278 64545 61882 56335 24640 17792 38956 48690
27663 48690 23337 29752 33025 22948 21986 56121 53191 38085 46486 48975 60246 66030 62536
27650 62536 66189 64577 32698 14039 15425 15184 28876 39580 53339 49386 48058 17339 34559
27637 34559 35274 17835 27168 29563 44741 46972 46695 43787 62975 58591 43666 42703 41494 57956
27623 57956 67588 65142 48784 49587 68678 70091 65587 74955 54878 39593 56670 56224 46784 58274
$$ packed form
27714C3950N0216n33l3272k1617m288J9398Q819l1840j5989K1293j0173l284j1002
27701A678j224k5477J3684N0099J2629l994k2698j7836K8953J8083j1896j185
27689D0816j4419j5414q907K0404M459L7664k2464n0922M639N896j511J9087l368
27676A5960j8145O752l323K1117L035K0882J8267k663n547l1695o848K1164R734
27663D8690k5353O415L273j0077r62L4135k930j5106Q401K489J1271N784l494
27650F2536L653j612l1879j8659J386k41J3692J0704J3759l953j328l0719J7220
27637C4559P15j7439R333K395J5178K231k77k908J9188m384j4925r63j209J6462
27623E7956R632k446j6358Q03J9091J413m504R368k0077j5285J7077m46r440J1490
$$ plain form
27609 58274 62956 38196 33130 66222 99017 84188 77484 61235 48377 66098 42484 41820 72443
27596 72443 55576 27812 36539 53612 46799 28687 38842 40197 23793 26804 33540 14781 4619
27583 4619 38332 36626 22678 37066 69292 62702 55887 71404 46068 58984 72426 40286
27571 40286 46106 59413 96322 89779 63727 60081 83508 100324 90607 57206 54722 27896 13632
27558 13632 35909 51559 83909 98119 95922 84161 58506 44359 32065 11963 12730 5896
27546 5896 20464 8146 33187 53961 76131 103180 101319 76182 68340 77726 68827 56165 63144
27533 63144 50610 29878 33828 38923 41797 72048 64277 52868 68629 74413 59393 33469 11164
27520 11164 21093 29395 24325 32548 77544 105651 116991 90909 55447 32448 19734 45700
$$ packed form
27609E8274M682k4760n066L3092L2795j4829o704j6249j2858J7721k3614o64L0623
27596G2443j6867k7764Q727J7073o813j8112J0155J355j6404L011O736j8759j0162
27583D619L3713j706j3948J4388L2226o590o815J5517k5336J2916J3442l2140
27571D0286N820J3307L6909o543k6052l646K3427J6816r717l3401k484k6826j4264
27558A3632K2277J5650L2350J4210k197j1761k5655j4147j2294k0102P67o834
27546E896J4568j2318K5041K0774K2170K7049j861k5137p842R386q899j2662O979
27533F3144j2534k0732L950N095K874L0251p771j1409J5761N784j5020k5924k2305
27520A1164R929Q302n070Q223M4996K8107J1340k6082l5462k2999j2714K5966
$$ plain form
27508 45700 31029 10414 20583 33715 15693 2580 24969 32802 3973 -4449 21815 33292
27496 33292 24210 37123 49483 65749 75289 61401 51069 40615 31188 28041 62038 75163
27484 75163 63120 70264 39360 42392 60084 60075 71293 80542 89103 69438 64121 75122 73889 61534
27470 61534 39126 47021 89659 123160 81407 31477 -6305 10061 32626 39670 50354 57353
27458 57353 54026 36918 28446 19534 59035 70750 63533 66046 66092 46844 21836 20028 23531 31227
27444 31227 54369 90935 78414 62050 61067 78460 88030 71177 80507 99786 97120 93155 88161
27431 88161 65521 35084 21612 13254 -5969 -35081 -36366 -39109 4125 73848 100620 76768
27419 76768 80184 72728 86951 82420 80023 78758 68116 63693 50278 60872 75206 66916 59903
$$ packed form
27508D5700j4671k0615J0169J3132j8022j3113K2389P833k8829q422K6264J1477
27496C3292r082J2913J2360J6266R540j3888j0332j0454r427l147L3997J3125
27484G5163j2043P144l0904L032J7692rJ1218R249Q561j9665n317J1001j233j2355
27470F1534k2408P895M2638L3501m1753m9930l7782J6366K2565P044J0684O999
27458E7353l327j7108q472q912L9501J1715p217K513M6j9248k5008j808L503P696
27444C1227K3142L6566j2521j6364r83J7393R570j6853R330J9279k666l965m994
27431H8161k2640l0437j3472q358j9223k9112j285k743M3234O9723K6772k3852
27419G6768L416p456J4223m531k397j265j0642m423j3415J0594J4334q290p013
$$ plain form
27406 59903 66699 67107 70745 57483 63795 42351 38110 43440 46081 60715 66472 76410 40900 20779
27392 20779 18864 12386 28563 58054 66602 73494 57999 38407 32301 49990 70942 97322 108667
27379 108667 100628 84156 47089 40975 23529 21343 43211 63919 74494 78019 58263 46416
27367 46416 38391 38584 54626 69000 85849 107801 125196 122327 93719 71679 74776 84650 99014
27354 99014 87325 80216 73973 81617 100295 106151 103177 66358 28177 25246 47142 62690 83518
27341 83518 94169 119747 116102 97366 78951 91039 78099 59312 55487 59055 60864 64278 58554
27328 58554 50685 58881 49798 29862 56449 33718 15037 13184 30621 45146 53627 50450 59177
27315 59177 63565 71992 79563 100585 97263 101510 95438 93189 57616 63116 53727 60080 84460 94901
$$ packed form
27406E9903O796M08L638j3262O312k1444m241N330K641J4634N757R938l5510k0121
27392B0779j915o478J6177K9491Q548O892j5495j9592o106J7689K0952K6380J1345
27379A08667q039j6472l7067o114j7446k186K1868K0708J0575L525j9756j1847
27367D6416q025J93J6042J4374J6849K1952J7395k869k8608k2040L097R874J4364
27354I9014j1689p109o243P644J8678N856k974l6819l8181k931K1896J5548K0828
27341H3518J0651K5578l645j8736j8415J2088j2940j8787l825L568J809L414n724
27328E8554p869Q196r083j9936K6587k2731j8681j853J7437J4525Q481l177Q727
27315E9177M388Q427P571K1022l322M247o072k249l5573N500r389O353K4380J0441
$$ plain form
27301 94901 117204 114590 97510 102691 96515 65250 52138 70170 87897 85054 69338 73791 79344
27288 79344 84250 55272 35477 35956 43800 68483 90980 69761 50421 57514 45771 58331 63809
27275 63809 66355 70067 52628 40989 51856 60189 71193 56722 66596 60197 42586 41699 55392
27262 55392 47249 52138 63167 51361 66127 71012 75796 93162 99334 99253 90986 73165 62063
27249 62063 45446 38654 22280 35961 27691 16333 8976 12513 13378 11843 35142 70754 97421
27236 97421 94815 74192 51567 50028 40753 55227 52853 59944 85965 69652 50297 70584 109624
27223 109624 111360 81958 87449 90524 71246 93134 116816 102585 71132 65201 86038 91287
27211 91287 71405 63732 78401 65162 63096 66803 59626 44573 19693 -1563 15282 31520
$$ packed form
27301I4901K2303k614j7080N181o176l1265j3112J8032J7727k843j5716M453N553
27288G9344M906k8978j9795M79P844K4683K2497k1219j9340P093j1743J2560N478
27275F3809K546L712j7439j1639J0867Q333J1004j4471R874o399j7611q87J3693
27262E5392q143M889J1029j1806J4766M885M784J7366O172q1q267j7821j1102
27249F2063j6617o792j6374J3681q270j1358p357L537Q65j535K3299L5612K6667
27236I7421k606k0623k2625j539r275J4474k374P091K6021j6313j9355K0287L9040
27223A09624J736k9402N491L075j9278K1888K3682j4231l1453n931K0837N249
27211I1287j9882p673J4669j3239k066L707p177j5053k4880k1256J6845J6238
$$ plain form
27199 31520 42344 61817 69545 67949 94608 126623 120859 143137 135480 105317 94214 113818
27187 113818 104291 74096 57296 59447 55410 50268 49190 60626 84515 77524 62051 63742 63761
27174 63761 94193 93844 54690 63337 91267 97107 87875 79986 67397 26227 29600 33355 31968
27161 31968 41802 43707 56584 69174 71055 79006 74220 102977 118602 89757 77244 86002 94555
27148 94555 92665 88504 94023 93722 77354 71917 64380 73354 85555 78845 101797 116414 114559 100072
27134 100072 110525 129767 119607 100372 95757 65915 44884 48015 45604 65552 87312 64106
27122 64106 79385 111100 91377 73784 75106 66679 64095 65917 50448 57640 62671 83739 102486
27109 102486 85586 56188 59007 82545 81489 48782 42808 77208 109736 110890 110317 83139 87595
$$ packed form
27199C1520J0824J9473P728j596K6659L2015n764K2278p657l0163j1103J9604
27187A13818r527l0195j6800K151m037n142j078J1436K3889o991j5473J691J9
27174F3761L0432l49l9154Q647K7930N840r232p889j2589m1170L373L755j387
27161C1968R834J905J2877J2590J881P951m786K8757J5625k8845j2513Q758Q553
27148I4555j890m161N519l01j6368n437p537Q974J2201o710K2952J4617j855j4487
27134A00072J0453J9242j0160j9235m615k9842k1031L131k411J9948K1760k3206
27122F4106J5279L1715j9723j7593J322q427k584J822j5469P192N031K1068J8747
27109A02486j6900k9398K819K3538j056l2707n974L4400L2528J154n73k7178M456
$$ plain form
27096 87595 97017 81801 85400 85916 75341 64107 70326 109702 118181 89273 90965 82308 61754
27083 61754 27645 53189 66401 67619 45422 34174 33288 34140 57561 82548 88862 109651 99227
27070 99227 90173 62843 34499 27101 14570 5276 41888 62354 74417 96173 91249 80364
27058 80364 104741 79479 49179 87999 90470 70033 61963 57795 76561 102882 103699 64832 40808
27045 40808 45719 37879 61050 73430 78832 71723 48115 62452 62683 82802 73657 75787 86014
27032 86014 85521 39906 22424 26466 36497 52447 55920 73473 106150 107777 75644 44551 62297
27019 62297 62233 33770 41361 67782 70153 72112 84054 54657 38784 31628 42342 66947 87151
27006 87151 71684 56461 47149 67223 82406 58136 45349 49347 53550 64100 63619 65075 66876
$$ packed form
27096H7595R422j5216L599N16j0575j1234O219L9376Q479k8908J692q657k0554
27083F1754l4109K5544J3212J218k2197j1248q86Q52K3421K4987O314K0789j0424
27070I9227r054k7330k8344p398j2531r294L6612K0466J2063K1756m924j0885
27058H0364K4377k5262l0300L8820K471k0437q070m168J8766K6321Q17l8867k4024
27045D0808M911p840K3171J2380N402p109k3608J4337K31K0119r145K130J0227
27032H6014m93m5615j7482M042J0031J5950L473J7553L2677J627l2133l1093J7746
27019F2297o4k8463P591K6421K371J959J1942k9397j5873p156J0714K4605K0204
27006H7151j5467j5223r312K0074J5183k4270j2787L998M203J0550m81J456J801
$$ plain form
26993 66876 71097 93604 73441 78628 83887 80113 81068 92904 77308 41104 53984 60718 33895
26980 33895 43019 65232 70714 65925 63190 77830 58123 35404 3575 16351 65745 75451 53310
26967 53310 47484 49739 72183 66983 83635 74753 40401 12306 2833 10172 39772 67593 33518
26954 33518 20430 48765 57582 95498 103756 87140 80003 79042 70126 44281 56412 75854 47100
26941 47100 55596 59180 52220 43070 30711 46681 61646 67031 80453 95557 84320 89508 73136
26928 73136 66509 68233 78779 89186 88718 76165 57215 63769 70362 70243 56207 66350 72128
26915 72128 84880 84277 89628 95479 119346 127686 127587 108340 81878 64795 34204 10438 27563
26902 27563 89754 118670 101528 86985 92350 63313 62517 77532 70383 83174 98188 100791 85417
$$ packed form
26993F6876M221K2507k0163N187N259l774R55J1836j5596l6204J2880O734k6823
26980C3895R124K2213N482m789k735J4640j9707k2719l1829J2776M9394R706k2141
26967E3310n826K255K2444n200J6652q882l4352k8095r473P339K9600K7821l4075
26954C3518j3088K8335Q817L7916Q258j6616p137r61q916k5845J2131J9442k8754
26941D7100Q496L584o960r150j2359J5970J4965N385J3422J5104j1237N188j6372
26928G3136o627J724J0546J0407m68j2553j8950O554O593j19j4036J0143N778
26915G2128J2752o03N351N851K3867Q340r9j9247k6462j7083l0591k3766J7125
26902B7563O2191K8916j7142j4543N365k9037p96J5015p149J2791J5014K603j5374
$$ plain form
26889 85417 78950 94098 81586 78521 71438 61300 58698 62959 63220 38441 71602 79112 65825
26876 65825 54594 72293 80508 91947 101737 107453 100778 84123 92941 81089 72093 41082 30272
26863 30272 26512 45115 74159 92782 115860 128683 132953 122302 91411 78259 92968 72895
26851 72895 66329 85034 87154 80480 60011 50207 61069 53267 49296 35764 22789 47918 71298
26838 71298 98889 118025 95567 94736 101988 87238 81206 86504 61708 73599 68641 88459 107651
26825 107651 87571 69654 75868 69021 69155 74481 77310 76883 72096 82553 103553 113513 123001 129084
26811 129084 143240 125708 103754 87824 80422 87091 76245 67137 69451 47628 42347 32145
26799 32145 31583 31331 48015 70367 60615 50157 31029 9759 30528 51442 86374 92999 78942
$$ packed form
26889H5417o467J5148j2512l065p083j0138k602M261K61k4779L3161P510j3287
26876F5825j1231J7699Q215J1439R790N716o675j6655Q818j1852q996l1011j0810
26863C0272l760J8603K9044J8623K3078J2823M270j0651l0891j3152J4709k0073
26851G2895o566J8705K120o674k0469r804J0862p802l971j3532j2975K5129K3380
26838G1298K7591J9136k2458q31P252j4750o032N298k4796J1891m958J9818J9192
26825A07651k0080j7917O214o847J34N326K829m27m787J0457K1000R960R488O083
26811A29084J4156j7532k1954j5930p402O669j0846r108K314k1823n281j0202
26799C2145n62k52J6684K2352r752j0458j9128k1270K0769K0914L4932O625j4057
$$ plain form
26786 78942 86665 93302 90254 89483 88644 99846 88379 59863 72820 97122 95058 66821 51151
26773 51151 70488 100057 87410 80169 99093 87911 69573 71241 72735 85659 74224 56748
26761 56748 76113 81119 63477 67805 74437 85773 79240 85831 74638 81649 90854 84855 68207
26748 68207 62918 85844 74505 69216 77744 82969 102260 101741 70581 46849 52928 40320 43500
26735 43500 84997 117911 133599 161808 176002 150264 108602 76821 76132 68207 78984 103805
26723 103805 111548 68183 67781 93168 89636 68974 80069 93654 88129 80749 84741 84245 76342
26710 76342 85922 78223 75169 76276 79729 87416 90641 86461 86150 82611 103837 133461 137724 127908
26696 127908 101284 84826 70544 68969 59695 54862 76127 121382 137436 106348 70807 81340
$$ packed form
26786G8942P723O637l048p71q39J1202j1467k8516J2957K4302k064k8237j5670
26773E1151J9337K9569j2647p241J8924j1182j8338J668J494J2924j1435j7476
26761E6748J9365N006j7642M328O632J1336o533O591j1193P011R205n999j6648
26748F8207n289K2926j1339n289Q528N225J9291n19l1160k3732O079j2608L180
26735D3500M1497L2914J5688K8209J4194k5738m1662l1781o89p925J0777K4821
26723A03805P743m3365m02K5387l532k0662J1095J3585n525p380L992m96p903
26710G6342R580p699l054J107L453P687L225m180l11l539K1226K9624M263r816
26696A27908k6624j6458j4282j575r274m833K1265M5255J6054l1088l5541J0533
$$ plain form
26684 81340 97435 101010 86481 77897 103800 94270 71946 50270 47479 41320 52699 48101 58530
26671 58530 83747 66408 48273 48606 36848 63687 98793 90860 72982 77683 65389 91028
26659 91028 72914 48223 58314 96911 94454 103505 106369 78182 85855 105627 122881 101505
26647 101505 90469 116724 117041 91945 90686 86430 63345 69818 78416 71962 47495 48389 77823
26634 77823 123907 138424 106695 108761 85085 76493 58899 57538 58830 46774 68092 70255 35695
26621 35695 36295 26370 40087 99443 112332 110720 110699 129253 132351 108754 116479 109180 103360 97664
26607 97664 77371 46954 57836 73201 83229 90258 81986 50552 43517 46633 70147 55452
26595 55452 38018 32485 63861 65443 91062 142421 152615 138714 144302 154090 141765 112131
$$ packed form
26684H1340J6095L575j4529q584K5903r530k2324k1676k791o159J1379m598J0429
26671E8530K5217j7339j8135L33j1758K6839L5106p933j7878M701j2294K5639
26659I1028j8114k4691J0091L8597k457R051K864k8187P673J9772J7254k1376
26647A01505j1036K6255L17k5096j259m256k3085O473Q598o454k4467Q94K9434
26634G7823M6084J4517l1729K066k3676q592j7594j361J292j2056K1318K163l4560
26621C5695O00r925J3717N9356J2889j612k1J8554L098k3597P725p299n820n696
26607I7664k0293l0417J0882J5365J0028P029q272l1434p035L116K3514j4695
26595E5452j7434n533L1376J582K5619N1359J0194j3901N588R788j2325k9634
$$ plain form
26583 112131 81407 88714 96434 107036 87049 67288 87048 92055 84263 89197 68091 61247 87816
26570 87816 101544 96009 124533 154231 116428 101549 104262 116689 119977 111403 79404 94955
26558 94955 103267 94730 100628 114955 99779 114359 112140 115692 107766 104370 88107 92180 98832
26545 98832 66615 76756 113321 118877 109815 82754 87828 104869 101035 104627 104254 113543 130859
26532 130859 132858 126297 122394 144788 130917 105116 126865 126308 114249 116061 125572 129634 119552
26519 119552 99166 99747 99220 79191 73459 61925 32475 33335 43899 51026 43544 27321 29616
26506 29616 59216 46131 32461 76246 69339 46779 72734 77713 52139 51517 48294 46244 86859
26493 86859 123891 122029 110351 91013 89178 90885 86976 96983 101299 76784 64856 81810 83481
$$ packed form
26583A12131l0724P307P720J0602j9987j9761J9760N007p792M934k1106o844K6569
26570H7816J3728n535K8524K9698l7803j4879K713J2427L288q574l1999J5551
26558I4955Q312q537N898J4327j5176J4580k219L552p926l396j6263M073O652
26545I8832l2217J0141L6565N556r062k7061N074J7041l834L592l73R289J7316
26532A30859J999o561l903K2394j3871k5801K1749n57j2059J812R511M062j0082
26519A19552k0386N81n27k0029n732j1534k9450Q60J0564P127p482j6223K295
26506B9616K9600j3085j3670M3785o907k2560K5955M979k5574o22l223k050M0615
26493H6859L7032j862j1678j9338j835J707l909J0007M316k4515j1928J6954J671
$$ plain form
26480 83481 70184 71330 85781 72478 40648 22625 35472 60796 60661 47878 47892 47090 38731
26467 38731 45305 41587 22578 45207 48125 65818 93511 103427 96261 104387 81959 66958 80047
26454 80047 88925 69243 39716 39621 72284 72404 51961 43964 70717 78330 82428 84939 78845 88366
26440 88366 89170 81470 78104 79600 71119 75724 111141 115217 122121 116417 116588 133033 118438 117429
26426 117429 141342 153853 159762 120349 96133 104366 85836 61950 60532 21169 6989 21079
26414 21079 34049 32434 44744 63642 85519 106532 117241 103528 95113 102756 98205 107800 103308
26401 103308 98165 72703 80389 99844 96309 105337 86563 92866 97024 91312 86315 81842 76466
26388 76466 79980 63784 59311 54301 28871 77776 101597 108978 91083 81998 58223 48905 53954
$$ packed form
26480H3481j3297J146J4451j3303l1830j8023J2847K5324j35j2783J4q02q359
26467C8731O574l718j9009K2629K918J7693K7693R916p166Q126k2428j5001J3089
26454H0047Q878j9682k9527r5L2663J20k0443p997K6753P613M098K511o094R521
26440H8366Q04p700l366J496q481M605L5417M076O904n704J71J6445j4595j009
26426A17429K3913J2511N909l9413k4216Q233j8530k3886j418l9363j4180J4090
26414B1079J2970j615J2310J8898K1877K1013J0709j3713q415P643m551R595m492
26401A03308n143k5462P686J9455l535R028j8774O303M158n712m997m473n376
26388G6466L514j6196m473n010k5430M8905K3821P381j7895r085k3775r318N049
$$ plain form
26375 53954 73606 75468 99357 83711 100776 137757 105524 82123 89823 112790 102264 71168
26363 71168 85152 93236 90054 126791 133174 101470 99963 98170 99804 100765 87515 72076 67404
26350 67404 54785 81026 103916 113809 110011 98443 83009 64764 57421 65142 78093 87869 111923
26337 111923 125752 122063 117608 113856 123957 120593 89210 67337 91491 103591 91740 94087
26325 94087 122018 112705 82235 57464 68331 78339 78135 78210 95071 92555 103919 106096 92378
26312 92378 83621 86868 81572 77035 74681 90748 92543 106763 106493 85209 68146 57213 65180
26299 65180 83267 89903 60179 57921 69644 55766 57031 56737 51262 48368 37369 54237 63742
26286 63742 71241 53608 46870 92310 108205 100060 97163 94768 94114 85415 98622 104716 129660
$$ packed form
26375E3954J9652J862K3889j5646J7065L6981l2233k3401P700K2967j0526l1096
26363G1168J3984Q084l182L6737O383l1704j507j793J634R61j3250j5439m672
26350F7404j2619K6241K2890R893l798j1568j5434j8245p343P721J2951R776K4054
26337A11923J3829l689m455l752J0101l364l1383k1873K4154J2100j1851K347
26325I4087K7931r313l0470k4771J0867J0008k04P5J6861k516J1364K177j3718
26312I2378q757L247n296m537k354J6067J795J4220k70k1284j7063j0933P967
26299F5180J8087O636k9724k258J1723j3878J265k94n475k894j0999J6868R505
26286F3742P499j7633o738M5440J5895q145k897k395o54q699J3207O094K4944
$$ plain form
26273 129660 141924 126880 100910 63319 52939 59926 77368 76823 64638 79606 110440 139905
26261 139905 151440 131628 92284 38425 19577 12911 42006 72022 63247 57346 57182 42756
26249 42756 33236 41567 57962 64217 75189 84217 88107 88266 77060 100008 105361 123002 116206
26236 116206 79058 67232 76550 84827 100165 111034 101474 96526 99882 85109 73364 87348
26224 87348 91653 92688 99402 112988 115616 102079 103921 119488 103287 102725 103351 94237 94220 84518
26210 84518 71633 57274 53449 29539 7506 36956 49347 58005 59406 57338 60994 52961 32147
26197 32147 17877 56784 70974 69834 64795 52464 61633 87549 87300 87131 98794 75071 67856
26184 67856 62013 79561 95319 101707 93054 73692 68302 65203 56554 57717 79463 98323 123042
$$ packed form
26273A29660J2264j5044k5970l7591j0380O987J7442n45j2185J4968L0834K9465
26261A39905J1535j9812l9344n3859j8848o666K9095L0016q775n901j64j4426
26249D2756r520Q331J6395O255J0972R028L890J59j1206K2948N353J7641o796
26236A16206l7148j1826R318Q277J5338J0869r560m948L356j4773j1745J3984
26224H7348M305J035O714J3586K628j3537J842J5567j6201n62O26r114j7r702
26210H4518j2885j4359l825k3910k2033K9450J2391Q658J401k068L656q033k0814
26197C2147j4270L8907J4190j140n039j2331R169K5916k49j69J1663k3723p215
26184F7856n843J7548J5758O388q653j9362n390l099q649J163K1746J8860K4719
$$ plain form
26171 123042 94835 64509 42435 47973 70784 101935 134872 144810 142222 143197 106364 105021 97056
26158 97056 104196 111352 92247 87626 115689 125193 90098 65992 65253 49940 82279 103157 81017
26145 81017 87065 112996 114523 111965 105648 80050 94865 88429 70660 81811 83996 80205 109715
26132 109715 150079 157986 141105 116062 121778 162227 160971 143051 150153 116487 63461 76578
26120 76578 66843 73058 107706 133907 151170 165570 143368 138213 149387 110009 76545 90841
26108 90841 70007 60065 61841 87773 60945 78007 113313 123339 112251 88703 93508 116177
26096 116177 134158 121091 98601 109321 133952 139953 120753 121647 113779 116526 104761 86267
26084 86267 70430 73046 74591 55882 38407 55372 61145 61521 66058 110810 95238 68163 75088
$$ packed form
26171A23042k8207l0326k2074N538K2811L1151L2937R938k588R75l6833j343p965
26158I7056P140P156j9105m621K8063R504l5095k4106p39j5313L2339K0878k2140
26145H1017O048K5931J527k558o317k5598J4815o436j7769J1151K185l791K9510
26132A09715M0364P907j6881k5043N716M0449j256j7920P102l3666n3026J3117
26120G6578r735O215L4648K6201J7263J4400k2202n155J1174l9378l3464J4296
26108I0841k0834r942J776K5932k6828J7062L5306J0026j1088k3548M805K2669
26096A16177J7981j3067k2490J0720K4631O001j9200Q94p868K747j1765j8494
26084H6267j5837K616J545j8709j7475J6965N773L76M537M4752j5572k7075O925
$$ plain form
26071 75088 120929 144512 139531 128014 111110 95286 80395 69124 71114 72410 75029 80856 84595
26058 84595 70710 79650 74718 75896 78215 105452 110260 108280 113402 88312 91334 79661 85681
26045 85681 81961 67581 53055 44126 50383 70165 90079 75241 78703 100555 96801 93437 106405
26032 106405 83874 66193 68423 87330 101883 121996 92176 76488 75533 88030 98119 109027
26020 109027 95129 86873 80080 82209 110807 139323 145810 107011 66890 43236 63642 70058
26008 70058 71386 85827 103874 116202 122949 112942 103720 92658 97226 96595 96090 66549 50813
25995 50813 63493 90890 99801 89736 72531 74236 80019 92846 105746 80210 59023 73222
25983 73222 76099 85872 98161 121161 126363 142495 148195 141209 80469 73063 83799 101499 98169
$$ packed form
26071G5088M5841K3583m981j1517j6904j5824j4891j1271J990J296K619N827L739
26058H4595j3885Q940m932J178K319K7237M808j980N122k5090L022j1673O020
26045H5681l720j4380j4526q929O257J9782J9914j4838L462K1852l754l364J2968
26032A06405k2531j7681K230J8907J4553K0113k9820j5688r55J2497J0089J0908
26020A09027j3898q256o793K129K8598K8516O487l8799m0121k3654K0406O416
26008G0058J328J4441J8047J2328O747j0007r222j1062M568o31n05k9541j5736
25995E0813J2680K7397Q911j0065j7205J705N783J2827J2900k5536k1187J4199
25983G3222K877R773J2289K3000N202J6132N700o986o0740p406J0736J7700l330
$$ plain form
25970 98169 107753 131834 118925 94299 52390 31018 43810 63657 97400 103301 110368 110141 112959
25957 112959 126772 126801 139705 143788 121428 119819 110505 92386 82445 70129 72437 72223 80479 76683
25943 76683 87063 100979 81411 89681 82023 77965 84642 87577 73531 49075 48635 53005 56383
25930 56383 56124 62430 73706 67542 58021 51069 30902 31447 46980 46322 59178 64745 60790 73167
25916 73167 84649 89916 114146 126992 134553 86158 64108 62974 93719 100939 89322 65672
25904 65672 67241 56367 45492 64574 75396 93770 95078 96173 78429 71932 77752 59641 46021
25891 46021 61651 83826 79785 67580 48041 44060 42690 46162 51369 48736 61219 74957 94142
25878 94142 88150 84783 75740 96958 93606 67952 52991 69124 71880 75127 61513 62333 63841
$$ packed form
25970I8169R584K4081j2909k4626m1909k1372J2792J9847L3743N901P067k27K818
25957A12959J3813K9J2904M083k2360j609r314j8119r941j2316K308k14Q256l796
25943G6683J0380J3916j9568Q270p658m058O677K935j4046k4456m40M370L378
25930E6383k59O306J1276o164r521o952k0167N45J5533o58J2856N567l955J2377
25916G3167J1482N267K4230J2846P561m8395k2050j134L0745P220j1617k3650
25904F5672J569j0874j0875J9082J0822J8374J308J095j7744o497N820j8111j3620
25891D6021J5630K2175m041j2205j9539l981j370L472N207k633J2483J3738J9185
25878I4142n992l367r043K1218l352k5654j4961J6133K756L247j3614Q20J508
$$ plain form
25865 63841 75103 100754 94312 105599 138982 128735 60702 22881 36915 65458 74895 51233
25853 51233 65568 118241 103695 66825 62281 67664 65204 67762 82872 76299 85238 88667 89028
25840 89028 96460 93895 81685 71256 85789 96599 100977 105338 89632 62846 56974 82589 81566
25827 81566 71502 97214 112555 104434 112107 107412 99050 102117 105223 98908 101757 102073 93443 87949
25813 87949 84520 95355 102750 65367 27217 37269 62155 27864 13333 26897 36952 51997
25801 51997 72610 110228 85835 69979 67010 48176 53965 61834 34885 12200 30743 58440
25789 58440 76978 84132 77988 72962 81807 87810 74612 70603 76798 60918 69128 81736 82076 78611
25775 78611 46188 53053 63750 75264 50007 66753 87673 88868 70728 51688 57118 54135
$$ packed form
25865F3841J1262K5651o442J1287L3383j0247o8033l7821J4034K8543R437k3662
25853E1233J4335N2673j4546l6870m544N383k460K558J5110o573Q939L429L61
25840H9028P432k565j2210j0429J4533J0810M378M361j5706k6786n872K5615j023
25827H1566j0064K5712J5341q121P673m695q362L067L106o315K849L16q630n494
25813H7949l429J0835P395l7383l8150J0052K4886l4291j4531J3564J0055J5045
25801E1997K0613L7618k4393j5856k969j8834N789P869k6949k2685J8543K7697
25789E8440J8538P154o144n026Q845O003j3198m009O195j5880Q210J2608L40l465
25775G8611l2423O865J0697J1514k5257J6746K0920J195j8140j9040N430k983
$$ plain form
25763 54135 47271 57835 81707 61324 85564 92199 85713 78505 100394 105923 101804 87473 77355
25750 77355 91971 137282 124895 106367 104394 81172 82819 81582 70053 67043 67004 71166 76774
25737 76774 96739 93710 94499 102313 125180 148167 128697 126246 138085 116566 103230 106855 99486
25724 99486 73078 60693 68161 56208 59926 74246 107917 123533 78344 47091 47433 79707
25712 79707 53740 30391 29176 46931 80290 84308 59188 69294 90825 93142 91533 91179 82329
25699 82329 81116 99100 119699 135103 133894 117887 107186 84631 70245 73689 80773 70698
25687 70698 85232 71094 55406 55655 70461 45326 43244 46071 50403 57402 51987 46261 76055
25674 76055 68188 33815 37622 64354 73012 95532 124721 65026 41224 62870 68916 106391
$$ packed form
25763E4135o864J0564K3872k0383K4240O635o486p208K1889N529m119j4331j0118
25750G7355J4616M5311j2387j8528j973k3222J647j237j1529l010l9M162N608
25737G6774J9965l029P89P814K2867K2987j9470k451J1839k1519j3336L625p369
25724I9486k6408j2385P468j1953L718J4320L3671J5616m5189l1253L42L2274
25712G9707k5967k3349j215J7755L3359M018k5120J0106K1531K317j609l54q850
25699H2329j213J7984K0599J5404j209j6007j0701k2555j4386L444P084j0075
25687G0698J4534j4138j5688K49J4806k5135k082K827M332O999n415n726K9794
25674G6055p867l4373L807K6732Q658K2520K9189n9695k3802K1646O046L7475
$$ plain form
25662 106391 121212 131697 120587 99133 84251 60444 65634 93527 92048 99407 123072 142467
25650 142467 111043 95316 94151 105569 110916 104172 109285 110152 102074 99539 101474 87075 83777
25637 83777 109788 85416 69883 40160 28256 33905 38073 39933 62110 98692 118235 107627
25625 107627 95707 88637 80261 73588 71400 71821 54148 50491 40260 50120 63718 68388 43115
25612 43115 40101 50179 82343 67023 63767 43814 34031 58634 81890 80895 84206 66802 62222
25599 62222 67386 66563 62857 33963 28870 53111 68832 90208 82758 93360 93860 93309 90379 62688
25585 62688 67309 104274 86757 61692 72248 94635 116509 115080 105928 72259 92267 96453
25573 96453 90053 93632 89120 65118 71507 94510 85912 90238 109275 98844 78458 63928 55509
$$ packed form
25662A06391J4821J0485j1110k1454j4882k3807N190K7893j479P359K3665J9395
25650A42467l1424j5727j165J1418N347o744N113Q67q078k535J935j4399l298
25637H3777K6011k4372j5533k9723j1904N649M168J860K2177L6582J9543j0608
25625A07627j1920p070q376o673k188M21j7673l657j0231R860J3598M670k5273
25612D3115l014J0078L2164j5320l256j9953r783K4603K3256r95L311j7404m580
25599F2222N164q23l706k8894n093K4241J5721K1376p450J0602N00n51k930k7691
25585F2688M621L6965j7517k5065J0556K2387K1874j429r152l3669K0008M186
25573I6453o400L579m512k4002O389K3003q598M326J9037j0431k0386j4530q419
$$ plain form
25560 55509 19500 5058 15606 15803 42975 68589 82069 74183 51673 21199 38885 49037
25548 49037 38874 22351 42776 70337 65789 53047 34197 50307 66052 63938 33035 39909
25536 39909 65417 71816 68384 69288 75508 81050 91591 91613 65122 55944 50991 57889 55222 58355
25522 58355 75878 79059 60609 57967 66976 90988 84633 87634 78701 59055 77084 84768 72028
25509 72028 57339 41502 39609 41530 53195 54437 60248 65253 73009 106237 83063 43011 45979
25496 45979 63591 58094 67188 91533 106895 79973 60313 42079 40411 77630 69966 61931 70400
25483 70400 52249 27479 20580 26762 28213 60473 79877 67553 32790 12409 32556 48099
25471 48099 71924 77977 39695 16420 22010 41363 62527 70553 100467 102426 62699 42549
$$ packed form
25560E5509l6009j4442J0548J97K7172K5614J3480p886k2510l0474J7686J0152
25548D9037j0163j6523K0425K7561m548j2742j8850J6110J5745k114l0903O874
25536C9909K5508O399l432R04O220N542J0541K2k6491r178m953O898k667L133
25522E8355J7523L181j8450k642R009K4012o355L001q933j9646J8029P684j2740
25509G2028j4689j5837j893J921J1665J242N811N005P756L3228k3174m0052K968
25496D5979J7612n497R094K4345J5362k6922j9660j8234j668L7219p664q035Q469
25483G0400j8151k4770o899O182J451L2260J9404j2324l4763k0381K0147J5543
25471D8099K3825O053l8282k3275N590J9353K1164Q026K9914J959l9727k0150
$$ plain form
25459 42549 32726 18038 37609 42857 52602 32180 31689 57557 46862 37895 49927 52726 71668
25446 71668 52163 20999 32300 24269 13609 23310 71766 82115 67797 59786 60720 65433 55460
25433 55460 53895 60819 62692 58966 43227 43340 54255 31678 40769 29447 13619 44912 83485
25420 83485 85137 88764 107704 111108 95409 66859 41093 30565 15381 18414 34999 34049 38889
25407 38889 40762 25920 39532 57262 95979 118995 93979 72823 81885 81185 74070 54595 58390
25394 58390 79609 46390 9713 8064 34953 72649 95049 91746 94369 95997 84742 106916
25382 106916 107903 95288 80820 74017 65034 70311 71149 77723 51533 17387 35231 74367 98866
25369 98866 89173 113647 127430 124740 108450 74961 32890 52952 69290 50758 49656 33674
$$ packed form
25459D2549r823j4688J9571N248R745k0422m91K5868j0695q967J2032K799J8942
25446G1668j9505l1164J1301q031j0660R701M8456J0349j4318q011R34M713r973
25433E5460j565O924J873l726j5739J13J0915k2577R091j1322j5828L1293L8573
25420H3485J652L627J8940L404j5699k8550k5766j0528j5184L033J6585r50M840
25407C8889J873j4842J3612J7730L8717K3016k5016k1156R062p00p115j9475L795
25394E8390K1219l3219l6677j649K6889L7696K2400l303K623J628j1255K2174
25382A06916R87j2615j4468o803q983N277Q38O574k6190l4146J7844L9136K4499
25369I8866r693K4474J3783k690j6290l3489m2071K0062J6338j8532j102j5982
$$ plain form
25357 33674 24095 57072 48726 44243 36408 33638 36306 40011 39141 62211 82902 85890 92999 68679
25343 68679 38090 31170 58094 47486 35351 11557 10256 71752 82142 68348 48862 53842
25331 53842 94482 92635 67284 49039 50814 39431 32236 43381 38528 31326 37491 37422 41911 76101
25317 76101 98711 84733 47950 65628 85702 92777 99172 75136 45961 16564 13415 28810
25305 28810 51038 45798 50427 50733 46846 51403 83105 125709 116450 84295 62614 71070 82778
25292 82778 98411 111113 82976 96284 98119 88619 95225 74230 77296 82167 85562 51591 48054
25279 48054 33601 30045 19362 20720 66223 62185 54160 40706 31662 30490 25214 28285 37532
25266 37532 50320 65223 82751 73528 79596 92376 78175 78567 83199 94563 108993 107147 126430
$$ packed form
25357C3674r579L2977q346m483p835k770K668L705q70K3070K0691K988P109k4320
25343F8679l0589o920K6924j0608j2135k3794j301O1496J0390j3794j9486M980
25331E3842M0640j847k5351j8245J775j1383p195J1145m853p202O165o9M489L4190
25317G6101K2610j3978l6783J7678K0074P075O395k4036k9175k9397l149J5395
25305B8810K2228n240M629L06l887M557L1702M2604r259l2155k1681Q456J1708
25292H2778J5633J2702k8137J3308J835r500O606k0995L066M871L395l3971l537
25279D8054j4453l556j0683J358M5503m038q025j3454r044j172n276L071R247
25266C7532J2788J4903J7528r223O068J2780j4201L92M632J1364J4430j846J9283
$$ plain form
25253 126430 101629 77613 77139 76387 55662 20049 23384 30053 19535 40946 45749 51807 49854
25240 49854 52161 36798 52024 55284 44775 60668 66992 38413 12794 4502 -8491 -23804
25228 -23804 1121 16905 45192 52665 46021 41132 44213 50195 20023 17023 27893 47451 93178
25215 93178 84541 73564 45816 61115 56082 43241 56428 68895 65225 52056 38398 46578
25203 46578 46456 57161 70980 50344 38763 50062 45450 62067 69933 88260 76260 43797
25191 43797 10571 14657 27974 30757 40283 35696 43554 73725 84711 66395 50209 73927 63718
25178 63718 43827 37392 41263 54871 49847 22764 3897 -10033 -21661 -7059 21089 18002
25166 18002 21220 17205 19203 18477 39968 71358 66826 44550 70527 81247 70344 33265 35208
$$ packed form
25253A26430k4801k4016m74p52k0725l5613L335O669j0518K1411M803O058j953
25240D9854K307j5363J5226L260j0509J5893O324k8579k5619q292j2993j5313
25228b3804K4925J5784K8287P473o644m889L081N982l0172l000J0870J9558M5727
25215I3178q637j0977k7748J5299n033j2841J3187J2467l670j3169j3658Q180
25203D6578j22J0705J3819k0636j1581J1299m612J6617P866J8327j2000l2463
25191D3797l3226M086J3317K783R526m587P858L0171J0986j8316j6186K3718j0209
25178F3718j9891o435L871J3608n024k7083j8867j3930j1628J4602K8148l087
25166A8002L218m015J998p26K1491L1390m532k2276K5977J0720j0903l7079J943
$$ plain form
25153 35208 53860 56791 63532 86987 94622 97356 71790 63234 48378 7238 -3651 5350 22567
25140 22567 33370 42130 48365 62766 56250 66052 42770 15410 12215 14519 31959 50017 67048
25127 67048 47751 26429 8039 10001 14529 12694 45037 54868 58152 77269 69926 73648 65486
25114 65486 31303 38159 69690 114365 95466 54799 54595 35143 26398 24433 60696 68018 56342
25101 56342 49958 67836 67041 48600 25494 25687 45985 71866 79355 91650 90916 73241 56974
25088 56974 28033 30296 35352 35448 38404 33139 50039 67124 75294 81827 80704 80647 103270 114030
25074 114030 124736 142463 118008 68323 63761 69875 85588 84692 48936 30052 52836 57068
25062 57068 26807 19224 20247 19396 19407 17973 46568 33352 22771 48780 37266 21672 21387 41638
$$ packed form
25153C5208J8652K931O741K3455P635K734k5566q556j4856m1140j0889R001J7217
25140B2567J0803Q760O235J4401o516R802k3282k7360l195K304J7440J8058J7031
25127F7048j9297k1322j8390J962M528j835L2343R831L284J9117p343L722q162
25114F5486l4183O856L1531M4675j8899m0667k04j9452q745j965L6263P322j1676
25101E6342o384J7878p95j8441k3106J93K0298K5881P489J2295p34j7675j6267
25088E6974k8941K263N056R6K956n265J6900J7085Q170O533j123n7K2623J0760
25074A14030J0706J7727k4455m9685m562O114J5713q96l5756j8884K2784M232
25062E7068l0261p583J023q51J1j434K8595j3216j0581K6009j1514j5594k85K0251
$$ plain form
25048 41638 69735 52726 17866 16586 21868 48298 42609 33508 49649 58998 43083 35713 32718
25035 32718 42866 56482 52085 8212 6220 11760 1514 5142 18989 27607 30425 59330 67410
25022 67410 41061 28591 40627 50976 35674 21829 22267 44282 76986 75091 86108 85855 73314
25009 73314 58715 59951 51596 56533 57077 38207 33830 48214 73160 69937 46385 53397 39088
24996 39088 32821 75598 98817 77412 43841 59905 65214 58224 66507 61159 50182 63217 64881
24983 64881 36307 -8966 9148 38825 44342 52176 28345 544 226 28471 35253 15776 17807
24970 17807 41407 53223 35993 51324 54772 57313 73336 92540 86527 68561 49031 21720
24958 21720 11567 23343 -2528 -17418 3912 26412 29035 16890 29681 49803 62363 60750
$$ packed form
25048D1638K8097j7009l4860j280N282K6430n689r101J6141R349j5915p370k995
25035C2718J0148J3616m397m3873j992N540j0246L628J3847Q618K818K8905Q080
25022F7410k6349j2470J2036J0349j5302j3845M38K2015L2704j895J1017k53j2541
25009G3314j4599J236q355M937N44j8870m377J4384K4946l223k3552P012j4309
24996C9088o267M2777K3219k1405l3571J6064N309o990Q283n348j0977J3035J664
24983F4881k8574m5273J8114K9677N517P834k3831k7801l18K8245O782j9477K031
24970A7807K3600J1816j7230J5331L448K541J6023J9204o013j7966j9530k7311
24958B1720j0153J1776k5871j4890K1330K2500K623j2145J2791K0122J2560j613
$$ plain form
24946 60750 31072 22539 32195 20951 44152 44851 35554 36591 54060 51752 38608 37917 22332
24933 22332 16648 15258 23173 25486 36554 37500 12113 -3259 8390 4989 -10254 29850 47574
24920 47574 41103 13394 12334 25338 35912 44788 51611 30022 12427 37514 51344 40563
24908 40563 203 -29539 -39986 -36610 12655 72353 87850 77353 37067 52036 60974 36224
24896 36224 18164 25505 39448 99064 90923 29599 8303 51932 62438 39324 10633 -19588
24884 -19588 14391 48104 56780 46151 56473 68199 57351 60011 58517 63545 49856 50620 65813
24871 65813 77279 59280 36267 17501 5424 26734 33087 9435 -1680 21426 37508 32451
24859 32451 60500 60159 44172 60779 77222 92087 83475 56372 31493 12858 16363 29227
$$ packed form
24946F0750k9678q533R656j1244K3201O99r297J037J7469k308j3144o91j5585
24933B2332n684j390P915K313J1068R46k5387j5372J1649l401j5243M0104J7724
24920D7574o471k7709j060J3004J0574Q876O823k1589j7595K5087J3830j0781
24908D0563m0360k9742j0447L376M9265N9698J5497j0497m0286J4969Q938k4750
24896C6224j8060P341J3943N9616q141o1324k1296M3629J0506k3114k8691l0221
24884a9588L3979L3713Q676j0629J0322J1726j0848K660j494N028j3689P64J5193
24871F5813J1466j7999k3013j8766j2077K1310O353k3652j1115K3106J6082n057
24859C2451K8049l41j5987J6607J6443J4865q612k7103k4879j8635L505J2864
$$ plain form
24847 29227 57049 30051 6911 30201 57414 67830 68459 67716 51965 30679 13528 -7165
24835 -7165 -14639 -19991 5227 24688 13825 16376 10066 -329 517 3011 -12287 -28189 -24733
24822 -24733 -8865 25818 51194 52570 39434 49779 47042 53046 48653 -1466 -4736 33419 65211
24809 65211 60601 34061 57388 57472 17259 -2531 -10159 20010 36481 49030 54016 43233 40261
24796 40261 72655 106564 85423 59832 56487 64832 36208 41694 44497 34042 34585 11221 -15794
24783 -15794 -4936 18225 4564 15609 22561 3406 17775 39849 41197 13426 -26897 2052
24771 2052 43137 55904 40475 32925 9511 11210 16789 13642 38457 49689 49997 49436 26197
24758 26197 -2695 -12720 17320 1528 13399 51799 62699 51707 13581 -1448 9776 997
$$ packed form
24847B9227K7822k6998k3140K3290K7213J0416O29p43j5751k1286j7151k0693
24835g165p474n352K5218J9461j0863K551o310j0395Q46K494j5298j5902L456
24822b4733J5868L4683K5376J376j3136J0345k737O004m393n0119l270L8155L1792
24809F5211m610k6540K3327Q4m0213j9790p628L0169J6471J2549M986j0783k972
24796D0261L2394L3909k1141k5591l345Q345k8624N486K803j0455N43k3364k7015
24783a5794J0858K3161j3661J1045O952j9155J4369K2074J348k7771m0323K8949
24771B052M1085J2767j5429p550k3414J699N579l147K4815J1232L08n61k3239
24758B6197k8892j0025L0040j5792J1871L8400J0900j0992l8126j5029J1224q779
$$ plain form
24746 997 -6435 -1596 16784 50497 49338 24119 48562 39393 33320 37584 41241 37648 43113 48812
24732 48812 54059 51317 4482 -36138 -62755 -28958 -20121 -15113 15815 53830 60518 32355 5594
24719 5594 -1425 -15332 -8664 29699 40393 33282 10729 14725 33239 54417 51782 28502 40306
24706 40306 51787 47599 40811 21484 7542 2613 17471 19321 36160 32194 21802 55990 77781
24693 77781 73385 58453 32444 41272 26718 10440 -5384 -15220 -28470 -42709 -50971 -24193
24681 -24193 45 4104 290 -12500 -8516 11655 14633 34815 49937 32080 23448 37182 37217
24668 37217 27940 33324 37644 45189 58651 58771 40155 37794 18355 7558 13214 -10615 4329
24655 4329 -7529 -33504 -25114 -33235 -23710 -9910 -16394 -25852 -24083 -12053 -13060 -61 41743
$$ packed form
24746I97p432M839J8380L3713j159k5219K4443r169o073M264L657l593N465N699
24732D8812N247k742m6835m0620k6617L3797Q837N008L0928L8015O688k8163k6761
24719E594p019j3907O668L8363J0694p111k2553L996J8514K1178k635k3280J1804
24706D0306J1481m188o788j9327j3942m929J4858J850J6839l966j0392L4188K1791
24693G7781m396j4932k6009Q828j4554j6278j5824r836j3250j4239q262K6778
24681b4193K4238M059l814j2790L984K0171K978K0182J5122j7857q632J3734L5
24668C7217r277N384M320P545J3462J20j8616k361j9439j0797N656k3829J4944
24655D329j1858k5975Q390q121R525J3800o484r458J769J2030j007J2999M1804
$$ plain form
24642 41743 41208 35726 13003 -10297 -5499 16373 47099 50033 46406 44107 30970 5795 -17428
24629 -17428 -3855 504 -2931 -4020 7264 30505 25985 5413 -15912 -23756 -455 10819 23957
24616 23957 33318 34041 40352 49126 51729 44761 51331 57927 69650 88231 74966 64019 40308
24603 40308 -533 9126 32269 14748 12983 -14353 -23321 -17983 -3287 -9159 -27169 -4668 23869
24590 23869 31169 22566 -6076 -444 13579 35820 56932 72986 54274 41710 16047 3463
24578 3463 -7404 8430 35096 38642 14330 -3545 22378 26467 8155 -1147 28577 12159
24566 12159 1871 -7214 -4527 -10713 -26055 -37801 -72185 -58675 -29813 -27571 -47213 -38091 -3531
24553 -3531 21650 3067 -31994 -20373 7640 -757 -31019 -44756 -13930 19358 27147 7472
$$ packed form
24642D1743n35n482k2723k3300M798K1872L0726K934l627k299j3137k5175k3223
24629a7428J3573M359l435j089J1284K3241m520k0572k1325p844K3301J1274J3138
24616B3957R361P23O311Q774K603o968O570O596J1723J8581j3265j0947k3711
24603D0308m0841R659K3143j7521j765k7336q968N338J4696n872j8010K2501K8537
24590B3869P300q603k8642N632J4023K2241K1112J6054j8712j2564k5663j2584
24578C463j0867J5834K6666L546k4312j7875K5923M089j8312r302K9724j6418
24566A2159j0288r085K687o186j5342j1746l4384J3510K8862K242j9642R122L4560
24553c531K5181j8583l5061J1621K8013q397l0262j3737L0826L3288P789j9675
$$ plain form
24541 7472 23668 23210 10087 13320 45 16406 39064 37575 11587 8170 18338 27007 35528
24528 35528 50551 49526 47077 67494 67139 44907 25422 -6059 -1156 -10034 -15644 -19468 -2312
24515 -2312 -1240 17424 38791 29860 14915 20920 3757 -11667 5653 12240 7182 -8514 -20261
24502 -20261 -16855 35478 39057 23224 -8847 -16368 -21424 -35919 -1305 30892 49581 32453
24490 32453 21847 22633 14761 16620 18869 31447 20051 5853 24833 -19345 -50584 -30685 -14775
24477 -14775 -7841 -25221 -14689 -16743 -19517 1451 7189 12036 3623 -15249 -40752 -14469 -7018
24464 -7018 9777 19406 14042 20972 -940 -6867 2392 -7403 -22688 -38612 -10399 34544 39337
24451 39337 9640 -37802 -51216 -22269 -11539 -14982 -11497 4328 2005 11540 -584 13276
$$ packed form
24541G472J6196m58j3123L233j3275J6361K2658j489k5988l417J0168Q669Q521
24528C5528J5023j025k449K0417l55k2232j9485l1481M903q878n610l824J7156
24515b312J072J8664K1367q931j4945O005j7163j5424J7320O587n058j5696j1747
24502b0261L406N2333L579j5833l2071p521n056j4495L4614L2197J8689j7128
24490C2453j0606P86p872J859K249J2578j1396j4198J8980m4178l1239J9899J5910
24477a4775O934j7380J0532k054k774K0968N738M847q413j8872k5503K6283P451
24464g018J6795R629n364O930k1912n927R259r795j5285j5924K8213M4943M793
24451C9337k9697m7442j3414K8947J0730l443L485J5825k323R535j2124J3860
$$ plain form
24439 13276 31783 17812 29487 28108 22096 -1897 -9383 -16825 -1967 6551 8944 35064 50926
24426 50926 23933 -12919 -27334 -32617 -25225 -23323 -23289 -54145 -53551 -5296 23280 24226 26810 18694
24412 18694 16943 9127 -399 -12562 -19779 -22607 -19356 -34339 -48282 -19924 3278 -8467 -14349
24399 -14349 -20131 -6137 22170 18677 860 -774 -22106 -11551 22397 14022 15965 16273 22841
24386 22841 38731 46165 45345 31449 16651 15925 3520 -9153 17215 28050 16554 1034 1174
24373 1174 -4329 -22044 -40454 -15849 24904 31460 662 -24911 -35061 -43392 -47775 -45868 -64688
24360 -64688 -27400 -5704 -5211 2499 -13660 -21826 19452 27675 25448 17687 33285 24601 8752
24347 8752 10333 -4466 11879 17835 2964 -9517 -22456 -43069 -60495 -51969 -25795 -20800 -14405
$$ packed form
24439A3276J8507j3971J1675j379o012k3993p486p442J4858Q518K393K6120J5862
24426E0926k6993l6852j4415n283P392J902L4l0856N94M8255K8576R46K584q116
24412A8694j751p816r526j2163p217k828L251j4983j3943K8358K3202j1745n882
24399a4349n782J3994K8307l493j7817j634k1332J0555L3948q375J943L08O568
24386B2841J5890P434q20j3896j4798p26j2405j2673K6368J0835j1496j5520J40
24373A174n503j7715j8410K4605M0753O556l0798k5573j0150q331m383J907j8820
24360f4688L7288K1696M93P710j6159q166M1278Q223k227p761J5598q684j5849
24347H752J581j4799J6345N956j4871j2481j2939k0613j7426Q526K6174M995O395
$$ plain form
24334 -14405 -14290 -16585 8235 15778 28639 23774 20874 24623 33146 25217 17057 20807 35771 17781
24320 17781 -5505 -11920 -18351 -32370 -10678 -16539 -31111 -29051 -25325 3831 5244 1887 -27816
24307 -27816 -30554 -34314 -49374 -47492 -11343 34653 12584 6101 27830 61728 87543 41477
24295 41477 10588 27092 24197 -5172 9990 23654 14758 -9175 -23697 -47624 -60818 -42030
24283 -42030 -29321 -44179 -25910 -33567 12062 35548 22889 19570 14865 1124 -1613 -7107 -17149
24270 -17149 -22903 -23830 -32406 -37822 -15842 -4520 -8522 -18121 -27322 -18220 -19090 -14393 567 9555
24256 9555 8352 20258 8326 -2568 11433 2700 -6718 -14383 -3832 11138 16103 -6682 -1052
24243 -1052 -17858 -14042 781 4965 28251 43843 49775 17866 -7462 -42153 -28774 -8488
$$ packed form
24334a4405J15k295K4820P543J2861m865k900L749Q523p929q160L750J4964j7990
24320A7781k3286o415o431j4019K1692n861j4572K060L726K9156J413l357k9703
24307b7816k738l760j5060J882L6149M5996k2069o483K1729L3898K5815m6066
24295D1477l0889J6504k895k9369J5162J3664q896k3933j4522k3927j3194J8788
24283d2030J2709j4858J8269p657M5629K3486j2659l319m705j3741k737n494j0042
24270a7149n754r27q576n416K1980J1322m002r599r201R102q70M697J4960Q988
24256I555j203J1906j1932j0894J4001q733r418p665J0551J4970M965k2785N630
24243a052j6806L816J4823M184K3286J5592N932l1909k5328l4691J3379K0286
$$ plain form
24231 -8488 -10221 -25683 -43889 -33789 -17005 -25188 -9803 -14384 -12354 -4778 22488 31280 7683
24218 7683 -4685 -26066 -29406 -25050 6471 12592 -6222 -1589 6434 -22724 -29384 -23120 -8458
24205 -8458 -14999 649 16840 11262 -3568 -10693 6136 2132 -5335 3761 9178 470 -39707
24192 -39707 -47959 -52692 -51103 -57548 -60097 -37544 -22126 4125 -8422 -54409 -72908 -70499 -54849
24179 -54849 -20394 3203 1219 -11634 -4724 -19746 -29608 -35164 -43482 -56337 -57381 -22459 -11484
24166 -11484 -14554 -3343 -16838 2458 6230 -8717 -17107 5333 16719 3283 -14475 -33520
24154 -33520 -36302 -22516 4446 20191 45127 26461 38702 62792 45163 39449 35658 35362 36450
24141 36450 38871 26597 -17384 -32612 -15025 33428 55387 39972 1207 -9084 3584 7141
$$ packed form
24231h488j733j5462j8206J0100J6784q183J5385m581K030P576K7266Q792k3597
24218G683j2368k1381l340M356L1521O121j8814M633Q023k9158o660O264J4662
24205h458o541J5648J6191n578j4830p125J6829m004p467R096N417q708m0177
24192c9707q252m733J589o445k549K2553J5418K6251j2547m5987j8499K409J5650
24179e4849L4455K3597j984j2853O910j5022r862n556q318j2855j044L4922J0975
24166a1484l070J1211j3495J9296L772j4947q390K2440J1386j3436j7758j9045
24154c3520k782J3786K6962J5745K4936j8666J2241K4090j7629n714l791k96J088
24141C6450K421j2274m3981j5228J7587M8453K1959j5415l8765j0291J2668L557
$$ plain form
24129 7141 24015 37055 32019 42360 20281 -6461 -10086 -15781 -44884 -70681 -73184 -43075 -35641
24116 -35641 -20695 -30259 -70243 -66606 -22809 14398 44549 41101 30978 19032 17837 9205 -4838
24103 -4838 -18309 -34356 -26438 -29750 -26100 6846 30348 11199 9182 14421 32617 21269 12327
24090 12327 12342 14536 14084 31864 20260 22678 30201 10326 -6144 -16212 -10165 2078 -4686 -12550
24076 -12550 -23624 -7230 6366 7152 10262 7103 209 4786 -20400 -20874 -32017 -49578 -32856
24063 -32856 1518 -4336 -19547 -15201 -4251 -8630 -24030 -18595 -9078 5202 127 -21880 -6843
24050 -6843 9623 -15542 -13238 -24944 -31340 -33475 -37332 -29462 9012 37439 25159 -18179 -50665
24037 -50665 -44970 -43474 -30914 -8035 -5045 -19008 -21270 -29394 -17548 -17724 3733 6300 23185
$$ packed form
24129G141J6874J3040n036J0341k2079k6742l625n695k9103k5797k503L0109P434
24116c5641J4946r564l9984L637M3797L7207L0151l448j0123j1946j195q632j4043
24103d838j3471j6047P918l312L650L2946K3502j9149k017N239J8196j1348q942
24090A2327J5K194m52J7780j1604K418P523j9875j6470j0068O047J2243o764p864
24076a2550j1074J6394J3596P86L110l159o894M577k5186m74j1143j7561J6722
24063c2856L4374n854j5211M346J0950m379j5400N435R517J4280n075k2007J5037
24050f843J6466k5165K304j1706o396k135l857P870L8474K8427j2280m3338l2486
24037e0665N695J496J2560K2879K990j3963k262q124J1846j76K1457K567J6885
$$ plain form
24024 23185 16298 1070 -5436 -6483 -22579 -7862 5038 3877 -13450 -11307 -8120 22449 21378
24011 21378 20562 14925 -11617 -5694 154 13262 -2149 -23656 389 844 -7046 -21905 -24846
23998 -24846 -41770 -25287 -23607 -13505 13403 -19487 -26770 -19737 13873 34819 18722 -16599
23986 -16599 -39723 -51143 -28099 -45288 -58530 -65822 -75800 -83980 -76707 -46636 -56908 -41971
23974 -41971 -59778 -77677 -71885 -61669 -56364 -21473 13443 11031 -11853 -32527 -46690 -37534
23962 -37534 -25495 -11468 9590 -1903 -27339 -8000 -17662 -10314 1505 18245 29385 6121
23950 6121 7503 10333 -16811 -5855 3068 2282 -777 -20608 -17182 14508 5182 -26296 -18164 -26650
23936 -26650 -17570 36808 46787 6628 -47697 -50440 -11757 7608 24346 44561 38490 40300 46648
$$ packed form
24024B3185o887j5228o506j047j6096J4717J2900j161j7327K143L187L0569j071
24011B1378q16n637k6542N923N848J3108j5411k1507K4045M55p890j4859k941
23998b4846j6924J6483J680J0102K6908l2890p283P033L3610K0946j6097l5321
23986a6599k3124j1420K3044j7189j3242p292r978q180P273L0071j0272J4937
23974d1971j7807j7899N792J0216N305L4891L4916k412k2884k0674j4163R156
23962c7534J2039J4027K1058j1493k5436J9339r662P348J1819J6740J1140k3264
23950F121J382K830k7144J0956Q923p86l059j9831L426L1690r326l1478Q132q486
23936b6650R080N4378R979m0159n4325k743L8683J9365J6738K0215o071J810O348
$$ plain form
23923 46648 36066 8303 -12728 -16753 -3836 18739 18482 19675 36441 8323 -12731 3440
23911 3440 34 -17549 -20746 -2335 -13132 -32064 -38576 -39567 -62814 -51446 -37855 -13865 -9793
23898 -9793 -10520 -40721 -27124 -28159 -21387 -11386 -36623 -34511 -26504 -22427 -9352 -11397 -21676
23885 -21676 -18019 -20997 -23399 -16906 -23423 -16157 -24013 1425 3696 -603 -3966 -9348 -19676 -14826
23871 -14826 -5200 6527 24317 22058 18142 -20425 -34638 -6847 5582 12846 21381 7390 -17007
23858 -17007 -21841 -24052 -13246 -14489 16501 41081 37321 -6811 -49315 -50207 -43301 -37580 -39854
23845 -39854 -39156 -27761 -7884 12156 -11304 -49685 -51744 -53927 -41495 -36436 -36526 -19916 -1746
23832 -1746 4637 -12045 -27674 -34443 -3484 10601 -4206 -11161 1602 37926 31675 -3110 -20648
$$ packed form
23923D6648j0582k7763k1031m025J2917K2575k57J193J6766k8118k1054J6171
23911C440l406j7583l197J8411j0797j8932o512r91k3247J1368J3591K3990M072
23898i793p27l0201J3597j035O772J0001k5237K112Q007M077J3075k045j0279
23885b1676L657k978k402O493o517P266p856K5438K271m299l363n382j0328M850
23871a4826R626J1727J7790k259l916l8567j4213K7791J2429P264Q535j3991k4397
23858a7007m834k211J0806j243L0990K4580l760m4132m2504q92O906N721k274
23845c9854O98J1395J9877K0040k3460l8381k059k183J2432N059r0J6610J8170
23832a746O383j6682j5629o769L0959J4085j4807o955J2763L6324o251l4785j7538
$$ plain form
23819 -20648 -32915 -51053 -60294 -44374 -57064 -58501 -50968 -48502 -57138 -44516 -29911 -30688 -54921
23806 -54921 -30439 -28584 -28846 -28359 -36261 -28605 -22853 -36199 -37113 -35959 -13118 5986 14407 19271
23792 19271 -21209 -41284 -34319 -20810 -12580 -12034 -1354 4869 -10040 -2887 -9376 -8156 6987
23779 6987 2098 -28643 -37639 -60900 -37213 -14969 -19766 -23838 -51275 -47994 -26727 -28264 -32124
23766 -32124 -33693 -24151 -27018 -18749 -30648 -63163 -76209 -62004 -39405 -39992 -39852 -63016 -36020
23753 -36020 -36049 -33116 -18949 -27987 -39577 -24875 -20839 -35639 -71584 -81790 -37598 -3652 -11645
23740 -11645 -43944 -57292 -45700 -37910 -46262 -35549 -23077 -608 10582 22729 30917 42877
23728 42877 28795 13033 1738 -26181 -41309 -43801 -48009 -72776 -84333 -64430 -51205 -37720
$$ packed form
23819b0648j2267j8138r241J5920j2690j437P533K466q636J2622J4605p77k4233
23806e4921K4482J855k62M87p902P656N752j3346r14J154K2841J9104Q421M864
23792A9271m0480k0075O965J3509Q230N46J0680O223j4909P153o489J220J5143
23779F987m889l0741q996k3261K3687K2244m797m072k7437L281K1267j537l860
23766c2124j569R542k867Q269j1899l2515j3046J4205K2599n87J40k3164K6996
23753c6020k9K933J4167r038j1590J4702M036j4800l5945j0206M4192L3946p993
23740a1645l2299j3348J1592P790q352J0713J2472K2469J1190J2147Q188J1960
23728D2877j4082j5762j1295k7919j5128k492m208k4767j1557J9903J3225J3485
$$ plain form
23716 -37720 -4894 -20022 -51550 -51164 -40911 -23489 -26327 -49896 -43618 -7771 -23397 -19290 -15071
23703 -15071 -39790 -42191 -53364 -62426 -65181 -91729 -87262 -49889 10146 12582 1876 5446 6272
23690 6272 -11643 -39624 -11921 -11089 -16222 -4046 -8069 -28250 -42035 -10494 35835 42321 26987
23677 26987 25352 -15337 -60506 -63329 -36343 -12201 -1732 -35783 -43025 -33181 -20517 -18838 -6435
23664 -6435 -17653 -35943 -28175 -11136 -7161 19306 17962 -3655 -31920 -36225 -20174 -11433 -22879
23651 -22879 -36256 -33505 -21853 -18996 -34603 -15621 -21721 -22884 -30489 -42241 -38780 -22844 -23927
23638 -23927 -21659 -36930 -45800 -35782 -28696 -47509 -35092 -28793 -40254 -48683 -55631 -39424 -37047
23625 -37047 -43103 -49105 -3166 7487 -6163 -3179 3791 -3319 -20927 -37742 -45168 -41490 -8936
$$ packed form
23716c7720L2826j5128l1528L86J0253J7422k838k3569O278L5847j5626M107M219
23703a5071k4719k401j1173r062k755k6548M467L7373O0035K436j0706L570Q26
23690F272j7915k7981K7703Q32n133J2176m023k0181j3785L1541M6329O486j5334
23677B6987j635m0689m5169k823K6986K4142J0469l4051p242R844J2664J679J2403
23664f435j1218j8290P768J7039L975K6467j344k1617k8265m305J6051Q741j1446
23651b2879j3377K751J1652K857j5607J8982o100j163p605j1752L461J5936j083
23638b3927K268j5271q870J0018P086j8813J2417O299j1461q429o948J6207K377
23625c7047o056o002M5939J0653j3650K984O970p110j7608j6815p426L678L2554
$$ plain form
23612 -8936 7297 -16357 -34842 -38063 -28741 -43137 -28746 -14220 -8127 -11532 3599 15264 -9774
23599 -9774 -44063 -58401 -39690 -38340 -27789 -35259 -29829 -20427 1768 20760 12104 -1390 -20018
23586 -20018 -17424 -14089 -3716 -10979 -23373 -6608 -929 -13478 -15102 -8605 -11041 -16495 -46229
23573 -46229 -63351 -82257 -73328 -43760 -21474 -23258 -11108 -18651 -24802 12425 23308 18660 801
23560 801 -19800 -36684 -14838 -11170 1398 31925 32334 -6845 -36909 -60076 -28059 -10826 -850
23547 -850 -10806 -40273 -60654 -63768 -62714 -56259 -27851 -19880 -5118 14978 -7665 -48944 -53499
23534 -53499 -38721 -13626 -13164 -21369 -28135 -29314 -32081 -43040 -36504 -1337 6200 -38967 -37325
23521 -37325 -60489 -72704 -40869 3195 26952 26436 -21042 -49128 -19264 -6333 -15749 -20490
$$ packed form
23612h936J6233k3654j8485l221R322j4396J4391J4526O093l405J5131J1665k5038
23599i774l4289j4338J8711J350J0551p470N430R402K2195J8992q656j3494j8628
23586b0018K594L335J0373p263j2394J6765N679j2549j624O497k436n454k9734
23573d6229j7122j8906Q929K9568K2286j784J2150p543o151L7227J0883m648j7859
23560H01k0601j6884K1846L668J2568L0527M09l9179l0064k3167L2017J7233R976
23547h50r956k9467k0381l114J054O455K8408P971J4762K0096k2643m1279m555
23534e3499J4778K5095M62q205o766j179k767j0959O536L5167P537m5167J642
23521c7325k3164j2215L1835M4064K3757n16m7478k8086K9864J2931r416m741
$$ plain form
23509 -20490 -22864 -40456 -39026 -49907 -37751 -16261 -24179 -6139 -18791 -48629 -65947 -74414
23497 -74414 -84518 -63692 -30282 -6976 -13014 -35738 -19025 9791 -16812 -14388 -25952 -19097
23485 -19097 -32320 -54356 -66424 -55351 -46099 -22939 -18144 -7136 -43514 -70732 -53624 -18012
23473 -18012 -19800 -17513 -12311 -25933 -28775 -44855 -25700 -33579 -43950 -21350 -3592 -7430 -4660
23460 -4660 9140 13253 23225 7873 -36165 -45829 -50499 -56999 -63034 -62965 -62273 -46655 -49118 -43106
23446 -43106 -47990 -15794 -5941 -27665 -28869 -12319 -44891 -71372 -63834 -28009 -21856 -44304 -54394
23433 -54394 -55326 -23322 10971 16302 8586 2120 454 -18213 -25709 -3966 -22239 -45411 -58520
23420 -58520 -49002 -34224 -21639 -13550 5625 1276 -14784 -26994 -16631 -19961 -17268 110 -5265
$$ packed form
23509b0490k374j7592J430j0881J2156K1490p918J8040j2652k9838j7318q467
23497g4414j0104K0826L3410K3306o038k2724J6713K8816k6603K424j1564O855
23485a9097j3223k2036j2068J1073R252K3160M795J1008l6378k7218J7108L5612
23473a8012j788K287N202j3622k842j6080J9155p879j0371K2600J7758l838K770
23460d660J3800M113R972j5352m4038r664m670o500o035O9O92J5618k463O012
23446d3106m884L2196R853k1724j204J6550l2572k6481P538L5825O153k2448j0090
23433e4394r32L2004L4293N331p716o466j666j8667p496K1743j8273k3172j3109
23420e8520R518J4778J2585Q089J9175m349j6060j2210J0363l330K693J7378n375
$$ plain form
23407 -5265 5051 -12981 -20317 -27973 -59857 -54261 -39315 -49061 -46930 -53975 -73261 -85196 -75996
23394 -75996 -57160 -49620 -63284 -56010 -29730 -49092 -60648 -50775 -40242 -40642 -71765 -67743 -59395
23381 -59395 -63035 -56057 -37721 -25197 -17723 -41239 -23445 30685 18339 -522 -4411 -22249
23369 -22249 -18170 -15844 -32707 -52453 -52441 -29972 -37296 -59213 -66808 -55489 -51599 -77182 -84851
23356 -84851 -69673 -55493 -37617 -17158 -14912 -13404 11208 15359 5080 -3479 -749 11281 5283
23343 5283 4612 15299 20702 15022 -2025 -19265 -6589 -3717 3366 22673 14994 -12146 -27164
23330 -27164 -30752 -21691 -28005 -12478 -1932 4244 -21224 -48276 -29837 -1636 -10244 -67984 -76074
23317 -76074 -45523 -24271 1513 4729 -5934 -22560 -29948 -33438 -47154 -76687 -73015 -68122 -58527
$$ packed form
23407e265J0316j8032p336p656l1884N596J4946r746K131p045j9286j1935R200
23394g5996J8836P540j3664P274K6280j9362j1556R873J0533m00l1123M022Q348
23381e9395l640O978J8336J2524P474k3516J7794N4130j2346j8861l889j7838
23369b2249M079K326j6863j9746J2K2469p324k1917p595J1319L890k5583p669
23356h4851J5178J4180J7876K0459K246J508K4612M151j0279q559K730J2030n998
23343E283o71J0687N403n680j7047j7240J2676K872P083J9307p679k7140j5018
23330b7164l588R061o314J5527J0546O176k5468k7052J8439K8201q608n7740q090
23317g6074L0551K1252K5784L216j0663j6626p388l490j3716k9533L672M893R595
$$ plain form
23304 -58527 -82167 -67964 -60547 -51860 -27167 -17217 -26036 -14125 -10500 -14708 -15048 -25056 -39172
23291 -39172 -48691 -52051 -61058 -38804 -34360 -61199 -61173 -43043 -50995 -52119 -62372 -54225 -61198 -99332
23277 -99332 -72382 -47790 -49325 -43394 -39787 -43604 -61387 -56813 -37607 -56379 -22722 -5763 -17824
23264 -17824 -20636 -23975 -40094 -43893 -44827 -46428 -43142 -40314 -36730 -44805 -52478 -43208 -17474 -9964
23250 -9964 -49019 -59460 -35918 -21237 -36754 -54563 -93000 -82661 -83466 -67519 -35654 -21757
23238 -21757 -1783 -9477 -23960 -13194 -3870 -2059 -32659 -27157 -14858 -10727 -16775 -39493 -24201
23225 -24201 -22558 -33417 -33191 -39308 -30956 -25067 -10114 -22873 -54566 -67595 -47407 -51505 -68126
23212 -68126 -62598 -48447 -40895 -47028 -44632 -22435 -11379 -9410 -3997 -11544 -9375 -13343 -27285
$$ packed form
23304e8527k3640J4203P417Q687K4693R950q819J1911L625m208l40j0008j4116
23291c9172r519l360r007K2254M444k6839K6J8130p952j124j0253Q147o973l8134
23277i9332K6950K4592j535N931L607l817j7783M574J9206j8772L3657J6959j2061
23264a7824k812l339j6119l799r34j601L286K828L584q075p673R270K5734P510
23250i964l9055j0441K3542J4681j5517j7809l8437J0339q05J5947L1865J3897
23238b1757J9974p694j4483J0766R324J811l0600N502J2299M131o048k2718J5292
23225b4201J643j0859K26o117Q352N889J4953j2759l1693j3029K0188m098j6621
23212f8126N528J4151P552o133K396K2197J1056J969N413p547K169l968j3942
$$ plain form
23199 -27285 -34049 -38310 -38051 -33750 -58625 -76179 -53740 -47842 -53887 -47882 -41589 -42302 -37584 -35015
23185 -35015 -40662 -58276 -65633 -66692 -73714 -55694 -40229 -46544 -42327 -59900 -63324 -53521 -75867
23172 -75867 -87928 -90865 -94353 -111815 -79440 -69651 -60489 -78653 -55810 -44595 -80966 -93348
23160 -93348 -59625 -36916 -34553 -42845 -49796 -49518 -56833 -64080 -61867 -27807 -14769 -14203 -32325 -69026
23146 -69026 -77806 -64469 -32710 -27347 -56852 -58265 -62420 -52703 -53639 -70426 -47563 -14737 -16847
23133 -16847 -29426 -34763 -11481 -27272 -43602 -54841 -46682 -56030 -15973 17583 -24478 -38831
23121 -38831 -33124 -28909 -58895 -77232 -43338 -24811 -51464 -99619 -108398 -89003 -97030 -75468
23109 -75468 -68905 -60023 -47418 -44370 -55685 -34194 -13294 -40931 -69677 -46299 -28721 -43349
$$ packed form
23199b7285o764m261K59M301k4875j7554K2439N898o045O005O293p13M718K569
23185c5015n647j7614p357j059p022J8020J5465o315M217j7573l424R803k2346
23172g5867j2061k937l488j7462L2375R789R162j8164K2843J1215l6371j2382
23160i3348L3723K2709K363q292o951K78p315p247K213L4060J3038N66j8122l6701
23146f9026q780J3337L1759N363k9505j413m155R717r36j6787K2863L2826k110
23133a6847j2579n337K3282j5791j6330j1239Q159r348M0057L3556m2061j4353
23121c8831N707M215k9986j8337L3894J8527k6653m8155q779J9395q027K1562
23109g5468O563Q882J2605L048j1315K1491K0900k7637k8746K3378J7578j4628
$$ plain form
23097 -43349 -64982 -67109 -51624 -66127 -65889 -70111 -75819 -61587 -46073 -42667 -50053 -47666 -32041
23084 -32041 -31440 -9887 -35724 -44299 -34526 -44409 -68425 -36029 -10357 -21734 -14432 9142 5027
23071 5027 2294 20328 23582 -1439 -2252 6415 -3218 8820 2199 -21349 -52852 -56135 -64188 -66685
23057 -66685 -68736 -69945 -48779 -56910 -75670 -98523 -70952 -40254 -83973 -101528 -83891 -49319
23045 -49319 -36770 -18898 -59276 -80230 -68750 -37498 -30768 -15964 -25303 -46936 -55201 -52984
23033 -52984 -39558 -27722 -36901 -53189 -67098 -74217 -59545 -30539 799 10617 -1428 -19466
23021 -19466 -24598 -37519 -54358 -88293 -92595 -61760 -50470 -67380 -58718 -28809 -13544 -16412
23009 -16412 -11346 -18881 -27685 -44021 -69248 -68933 -65589 -59047 -79047 -79719 -43777 -28216 -43621
$$ packed form
23097d3349k1633k127J5485j4503K38m222n708J4232J5514L406p386K387J5625
23084c2041O01K1553k5837q575R773r883k4016L2396K5672j1377P302K3574m115
23071E027k733J8034L254k5021q13Q667r633J2038o621k3548l1503l283q053k497
23057f6685k051j209K1166q131j8760k2853K7571L0698m3719j7555J7637L4572
23045d9319J2549J7872m0378k0954J1480L1252O730J4804r339k1633q265K217
23033e2984J3426J1836r179j6288j3909p119J4672K9006L1338R818j2045j8038
23021a9466n132j2921j6839l3935m302L0835J1290j6910Q662K9909J5265k868
23009a6412N066p535q804j6336k5227L15L344O542k0000o72L5942J5561j5405
$$ plain form
22996 -43621 -67950 -64610 -47130 -22265 -19129 -25885 -28147 -26734 -1831 -6475 -24938 -32039 -55138
22983 -55138 -29653 -8239 9923 -2526 1837 28148 38831 63775 123092 183327 212993 196379
22971 196379 141378 105108 86163 38679 17868 -11069 -20582 -14696 -6920 -30315 -42216 -47761
22959 -47761 -43770 -44236 -14577 -15717 -32434 -45573 -65577 -50345 -42439 -44865 -55990 -102219 -113739
22946 -113739 -111705 -57636 -30411 -24900 -32318 -38437 -23057 -38470 -21341 -27932 -35226 -53844 -65834
22933 -65834 -29604 -14307 -27512 -31172 -52077 -64801 -88723 -96886 -84579 -96580 -81089 -48689
22921 -48689 -28488 -56949 -43920 -21194 -23583 -21290 -29668 -48844 -58822 -68268 -47813 -47351 -60225
22908 -60225 -70819 -69646 -47944 -59150 -54216 -60177 -70752 -56216 -67744 -65309 -56420 -38719 -38341
$$ packed form
22996d3621k4329L340J7480K4865L136o756k262J413K4903m644j8463p101k3099
22983e5138K5485K1414J8162j2449M363K6311J0683K4944N9317O0235K9666j6614
22971A96379n5001l6270j8945m7484k0811k8937r513N886P776k3395j1901n545
22959d7761L991m66K9659j140j6717j3139k0004J5232P906k426j1125m6229j1520
22946a13739K034N4069K7225N511p418o119J5380j5413J7129o591p294j8618j1990
22933f5834L6230J5297j3205l660k0905j2724k3922q163J2307j2001J5491L2400
22921d8689K0201k8461J3029K2726k389K293q378j9176r978r446K0455M62j2874
22908f0225j0594J173K1702j1206M934n961j0575J4536j1528K435Q889J7701L78
$$ plain form
22895 -38341 -59677 -51426 -69207 -81937 -66731 -50641 -41469 -85887 -110887 -94903 -55173 -32702
22883 -32702 -20136 -35926 -67941 -95564 -94221 -84070 -63477 -68922 -95153 -84886 -54321 -32661
22871 -32661 -52234 -47673 -46293 -56641 -66817 -48391 -52578 -47271 -55189 -80370 -66215 -34562 -36545
22858 -36545 -13762 -2112 -18506 -33323 -54551 -69875 -58306 -32032 -43092 -30770 -33701 -38435
22846 -38435 -52190 -52381 -43379 -61470 -52964 -57143 -52541 -28771 -43985 -57787 -74561 -114320 -133470
22833 -133470 -114976 -81222 -65622 -48593 -61209 -72730 -76915 -64346 -16516 -18153 -45160 -41911
22821 -41911 -17613 -380 -194 -15456 -21812 -13964 603 3737 -11788 -40291 -33211 -24635 -30968
22808 -30968 -26372 -37263 -43140 -13700 -4383 -17088 -15989 -962 -15959 -25081 -19002 -35100 -26002
$$ packed form
22895c8341k1336Q251j7781j2730J5206J6090R172m4418k5000J5984L9730K2471
22883c2702J2566j5790l2015k7623J343J0151K0593n445k6231J0267L0565K1660
22871c2661j9573M561J380j0348j0176J8426m187N307p918k5181J4155L1653j983
22858c6545K2783J1650j6394j4817k1228j5324J1569K6274j1060J2322k931m734
22846c8435j3755j91R002j8091Q506m179M602K3770j5214j3802j6774l9759j9150
22833a33470J8494L3754J5600J7029j2616j1521m185J2569M7830j637k7007L249
22821d1911K4298J7233J86j5262o356P848J4567L134j5525k8503P080Q576o333
22808c0968M596j0891n877K9440R317j2705J099J5027j4997r122O079j6098R098
$$ plain form
22795 -26002 -21752 -58612 -74018 -59656 -13949 -1680 -7945 -503 8697 -19182 -28909 -37996 -41717
22782 -41717 -49247 -33211 -16746 -7277 -18627 -7407 -19496 -21533 -27314 -25994 -27874 1260 20654
22769 20654 -6963 -59210 -74180 -71727 -43840 -48705 -61775 -50823 -61671 -67289 -46711 -32479
22757 -32479 -17313 -16998 -41431 -41742 -28906 -19163 -23336 -56292 -56102 -42192 -34242 -34727 -28990 -16605
22743 -16605 -6923 3435 14559 9812 -263 44469 71338 80707 93859 138677 195064 308777
22731 308777 442925 638794 854130 1016567 1003943 830975 622827 441593 292092 204816
22721 204816 159469 120218 92023 65076 75237 61131 37375 43731 36583 62288 63255 32688
22709 32688 23330 1804 3289 6950 9887 -4851 -30371 -12336 -7346 -26732 -32873 -20433 4987
$$ packed form
22795b6002M250l6860j5406J4362M5707J2269o265P442R200k7879r727r087l721
22782d1717p530J6036J6465R469j1350J1220j2089k037n781J320j880K9134J9394
22769B0654k7617n2247j4970K453K7887m865j3070J0952j0848n618K0578J4232
22757c2479J5166L15k4433l11J2836R743m173l2956J90J3910P950m85N737J2385
22743a6605R682J0358J1124m747j0075M4732K6869R369J3152M4818N6387J13713
22731C08777J34148J95869K15336J62437j2624j72968k08148j81234j49501q7276
22721B04816m5347l9251k8195k6947J0161j4106k3756O356p148K5705R67l0567
22709C2688r358k1526J485L661K937j4738k5520J8035M990j9386o141J2440K5420
$$ plain form
22696 4987 -1670 -19670 -23885 -13413 4028 -8473 -20163 2103 -17212 -1214 15558 -6296
22684 -6296 -5782 -2368 -21643 -34426 -59752 -37433 -41494 -61396 -54930 -67257 -87277 -77694 -63317
22671 -63317 -57480 -45647 -26976 -15406 -32272 -23803 -25495 -20406 -7946 3295 5468 -8382 -25493
22658 -25493 -21763 -17223 -10207 6609 2406 9025 10934 -4184 -28046 -56351 -29179 -25635 -57092
22645 -57092 -63239 -38961 -52287 -59466 -39792 -18609 -21400 -24937 -29941 -35974 -59833 -60226 -42002
22632 -42002 -42096 -77548 -109487 -90367 -49991 -24364 -57205 -56620 -11111 -6700 -16205 -32474 -35172
22619 -35172 -16483 -15829 -36956 -75622 -77301 -76400 -66434 -78938 -82345 -72779 -61397 -44042 -67761
22606 -67761 -93136 -97455 -53444 -31829 -21099 -3372 4722 -3208 22032 21716 4602 -29200 -76501
$$ packed form
22696D987o657j8000m215J0472J7441j2501j1690K2266j9315J5998J6772k1854
22684f296N14L414j9275j2783k5326K2319m061j9902O466j2327k0020R583J4377
22671f3317N837J1833J8671J1570j6866Q469j692N089J2460J1241K173j3850j7111
22658b5493L730M540P016J6816m203O619J909j5118k3862k8305K7172L544l1457
22645e7092o147K4278j3326p179J9674K1183k791l537n004o033k3859l93J8224
22632d2002r4l5452l1939J9120M0376K5627l2841N85M5509M411r505j6269k698
22619c5172J8689O54k1127l8666j679R01R966j2504l407R566J1382J7355k3719
22606f7761k5375m319M4011K1615J0730J7727Q094p930K5240l16j7114l3802m7301
$$ plain form
22593 -76501 -77977 -80102 -44232 -44676 -86026 -67984 -59127 -58595 -53799 -63740 -68388 -75398 -56832 -53636
22579 -53636 -42521 -36350 -21775 -16725 6284 -29057 -45846 -44231 -27932 -8650 8894 19467
22567 19467 2905 -7142 -11308 2098 990 -25365 -35199 -45802 -31489 -27632 -26399 -38641 -53046
22554 -53046 -43719 -30651 -16822 -3788 5499 3177 -19679 -28287 -36951 -37691 -42353 -28389 17299
22541 17299 18047 -16552 -39306 -6587 6792 -12472 -26753 -30339 -20436 -18020 -39768 -36581 -50164
22528 -50164 -70073 -74108 -69323 -75321 -51997 -13998 -16779 -46037 -32650 -19363 -26449 -15121 -25830
22515 -25830 -29509 -29267 -46331 -65361 -45185 -39117 -65536 -69355 -71513 -92008 -55789 -20754 -27853
22502 -27853 -43062 -63813 -75934 -73384 -69348 -34858 -37913 -41872 -28068 -17874 -7055 -4280 -15459
$$ packed form
22593g6501j476k125L5870m44m1350J8042Q857N32M796r941m648p010J8566L196
22579e3636J1115O171J4575N050K3009l5341j6789J615J6299J9282J7544J0573
22567A9467j6562j0047m166J3406j108k6355r834j0603J4313L857J233j2242j4405
22554e3046R327J3068J3829J3034R287k322k2856q608q664p40m662J3964M5688
22541A7299P48l4599k2754L2719J3379j9264j4281l586R903K416k1748L187j3583
22528e0164j9909m035M785n998K3324L7999k781k9258J3387J3287p086J1328j0709
22515b5830l679K42j7064j9030K0176O068k6419l819k158k0495L6219L5035p099
22502b7853j5209k0751j2121K550M036L4490l055l959J3804J0194J0819K775j1179
$$ plain form
22489 -15459 -31803 -7712 3943 -15521 -35417 -44550 -34153 -45757 -28092 -13995 -24716 -18667
22477 -18667 -6481 -19711 -37603 -51117 -65464 -74495 -67616 -83495 -65105 -29399 -37143 -37300 -37741
22464 -37741 -37867 -34518 -22920 -10328 -47856 -9709 22015 24340 6669 -37103 -53313 -52979 -71517
22451 -71517 -65954 -22333 -2594 10728 21666 16848 -3302 -5383 -4344 -14644 -16001 -11896 -30166
22438 -30166 -34137 -47169 -57650 -880 61467 60152 53846 44169 38994 47106 38748 34159 16843
22425 16843 13923 -1361 -12450 -2153 12740 5452 -15589 -19139 -35998 -56737 -41086 -38233
22413 -38233 -31974 -36481 -43256 -71399 -63811 -69703 -63325 -61777 -53701 -41093 -31572 -37111 -48666 -33024
22399 -33024 -13289 32487 38763 21445 8007 16506 28543 26443 27802 -10167 -44590 -36347 -1421
$$ packed form
22489a5459j6344K4091J1655j9464j9896r133J0397j1604J7665J4097j0721O049
22477a8667J2186j3230j7892j3514j4347r031O879j5879J8390L5706p744j57m41
22464c7741j26L349J1598J2592l7528L8147L1724K325j7671m3772j6210L34j8538
22451g1517N563M3621J9739J3322J0938m818k0150k081J039j0300j357M105j8270
22438c0166l971j3032j0481N6770O2347j315o306r677n175Q112q358m589j7316
22425A6843k920j5284j1089J0297J4893p288k1041l550j6859k0739J5651K853
22413c8233O259m507o775k8143P588n892O378J548Q076J2608R521n539j1555J5642
22399c3024J9735M5776O276j7318j3438Q499J2037k100J359l7969l4423Q243L4926
$$ plain form
22386 -1421 -34631 -42217 -30210 -12999 -14815 -50368 -60558 -48589 -50852 -7600 10852 -1866
22374 -1866 -15945 530 -6066 13560 55955 120810 137557 109087 72420 35248 15204 4819
22362 4819 -17427 -34821 -25105 -11698 -10489 -1637 2283 -777 7014 -16606 -27180 -50042 -66862
22349 -66862 -57728 -48687 -46394 -39167 -29568 6086 23391 6577 14525 5172 -7210 -12327 -24721
22336 -24721 -16926 5102 -6946 -26294 -17705 -34616 -35254 -19546 -5803 17875 20389 11429 27199
22323 27199 63450 50572 46623 67165 83823 93501 73410 55595 46846 63196 82813 79850
22311 79850 70905 33407 9859 2556 -10787 -18226 -63214 -73480 -84723 -90715 -41059 -19777
22299 -19777 -32617 -31697 -56048 -50745 -35070 -26020 -33993 -48566 -42976 -6619 2451 -13426 -35827
$$ packed form
22386a421l3210p586J2007J7211j816l5553j0190J1969k263M3252J8452j2718
22374a866j4079J6475o596J9626M2395O4855J6747k8470l6667l7172k0044j0385
22362D819k2246j7394R716J3407J209Q852L920l060P791k3620j0574k2862j6820
22349f6862R134R041K293P227R599L5654J7305j6814P948r353j2382n117j2394
22336b4721P795K2028j2048j9348Q589j6911o38J5708J3743K3678K514q960J5770
22323B7199L6251j2878l949K0542J6658R678k0091j7815q749J6350J9617k963
22311G9850q945l7498k3548p303j3343p439m4988j0266j1243n992M9656K1282
22299a9777j2840R20k4351N303J5675R050p973j4573N590L6357R070j5877k2401
$$ plain form
22286 -35827 -15192 -3392 6111 21930 33796 57474 45474 3329 -10089 4119 8761 28403
22274 28403 29838 5921 -18771 6929 15766 27795 36954 33249 23606 39583 47883 35905 19979
22261 19979 35751 43540 40478 32918 16324 36720 48488 44779 38185 63587 83757 103826 112358
22248 112358 105204 117870 112218 118296 120204 150689 248825 303670 257095 204784 190441 182747
22236 182747 156090 124566 121562 126547 123955 119628 99152 67838 52822 81885 113380 110405
22224 110405 87507 79301 78847 92881 105294 93476 93051 105303 134934 157073 145510 127833
22212 127833 75317 55891 101776 127140 138138 142002 137664 120825 155387 154099 135079 146063
22200 146063 194552 173588 170113 166460 156296 148477 165500 177390 204459 242263 237339 218097
$$ packed form
22286c5827K0635J1800R503J5819J1866K3678j2000m2145j3418J4208M642J9642
22274B8403J435k3917k4692K5700Q837J2029R159l705r643J5977Q300j1978j5926
22261A9979J5772P789l062p560j6594K0396J1768l709o594K5402K0170K0069Q532
22248A12358p154J2666n652O078J908L0485R8136N4845m6575n2311j4343p694
22236A82747k6657l1524l004M985k592m327k0476l1314j5016K9063L1495k975
22224A10405k2898q206m54J4034J2413j1818m25J2252K9631K2139j1563j7677
22212A27833n2516j9426M5885K5364J0998L864m338j6839L4562j288j9020J0984
22200A46063M8489k0964l475l653j0164p819J7023J1890K7069L7804m924j9242
$$ plain form
22188 218097 250574 237954 221158 230290 254348 281530 278389 268518 285405 301410 325203 337180
22176 337180 350123 357678 360028 364001 393840 430901 478488 502425 510740 524767 556918 535839
22164 535839 539934 537691 538463 582354 601282 614117 613769 640113 693451 759233 843253 918470 970317
22151 970317 1014348 1127272 1311527 1515582 1660019 1770265 1904769 2124283 2401896 2626403
22141 2626403 2820071 3117712 3601884 4019743 4114567 3990671 3909478 3986894 4229750 4619879
22131 4619879 5140701 5827445 6759357 8020064 9622339 11592015 14099081 17516597 22686246
22122 22686246 30818406 44044360 66285943 104819431 168025974 241992511 270299223
22115 270299223 229737877 161796319 106274844 70841016 49186210 35560183 26646667
$$ packed form
22188B18097L2477j2620j6796R132K4058K7182l141r871J6887J6005K3793J1977
22176C37180J2943P555K350L973K9839L7061M7587K3937Q315J4027L2151k1079
22164E35839M095k243P72M3891J8928J2835l48K6344N3338O5782Q4020P5217N1847
22151I70317M4031J12924J84255K04055J44437J10246J34504K19514K77613K24507
22141B626403J93668K97641M84172M17859R4824j23896q1193P7416K42856L90129
22131D619879N20822O86744R31912J260707J602275J969676K507066L417516N169649
22122B2686246Q132160J3225954K2241583L8533488O3206543P3966537K8306712
22115B70299223m0561346o7941558n5521475l5433828k1654806j3626027q913516
$$ plain form
22108 26646667 20615228 16383989 13186275 10676728 8777361 7310904 6206372 5334692
22100 5334692 4645029 4108014 3648037 3298362 3086188 2993611 3041550 3237757 3372598 3137834
22090 3137834 2662381 2210249 1902263 1693261 1553039 1439562 1376185 1343335 1287267 1157709
22080 1157709 1044933 972722 903126 873552 867955 861808 878566 914551 959768 1012843 983639
22069 983639 858571 725749 638860 576101 533979 507124 516428 556684 617837 661903 683879
22058 683879 597172 461448 366347 317746 281980 260649 253461 256059 229805 209486 160310 159764
22046 159764 196841 216243 198269 173359 180884 168971 161790 152538 144452 126292 123951 114329 90005
22033 90005 77091 70313 74401 76749 89387 87367 77841 90713 76840 66390 86335 88919 51146
$$ packed form
22108B6646667o031439m231239l197714k509547j899367j466457j104532q71680
22100E334692o89663n37015m59977l49675k12174r2577M7939J96207J34841k34764
22090C137834m75453m52132l07986k09002j40222j13477o3377l2850n6068j29558
22080A157709j12776p2211o9596k9574n597o147J6758L5985M5217N3075k9204
22069I83639j25068j32822q6889o2759m2122k6855R304M0256O1153M4066K1976
22058F83879q6707j35724r5101m8601l5766k1331p188K598k6254k0319m9176n46
22046A59764L7077J9402j7974k4910P525j1913p181r252q086j8160k341r622k4324
22033I0005j2914o778M088K348J2638k020r526J2872j3873j0450J9945K584l7773
$$ plain form
22020 51146 44346 60618 45898 14537 11547 32128 23680 2236 11447 12011 6027 -9274 2223
22007 2223 19387 41659 37420 34579 48420 29108 25010 21264 39323 21875 25830 52880 76642
21994 76642 123981 191520 266145 331828 376723 392185 350129 279093 191363 150442 120435 75797
21982 75797 67434 82286 84847 97708 70525 37208 29767 16035 32086 44637 56554 106451
21970 106451 124942 132354 129694 105658 93334 61012 28249 31258 20191 3554 -5485 11760
21958 11760 30350 67952 34562 36109 17387 -164 6548 10588 -290 -3441 -20056 -45496
21946 -45496 -50893 -40549 -21961 -18996 -17435 -17827 -36560 -46586 -70721 -59438 -32903 -28274 -3893
21933 -3893 24097 47447 61331 98180 79866 78526 69025 37417 3465 2654 6930 38251 35233
$$ packed form
22020E1146o800J6272j4720l1361k990K0581q448k1444R211N64n984j5301J1497
22007B223J7164K2272m239k841J3841j9312m098l746J8059j7448L955K7050K3762
21994G6642M7339O7539P4625O5683M4895J5462m2056p1036q7730m0921l0007m4638
21982G5797q363J4852K561J2861k7183l3317p441j3732J6051J2551J1917M9897
21970A06451J8491P412k660k4036j2324l2322l2763L009j1067j6637r039J7245
21958A1760J8590L7602l3390J547j8722j7551O712M040j0878l151j6615k5440
21946d5496n397J0344J8588K965J561l92j8733j0026k4135J1283K6535M629K4381
21933c893K7990K3350J3884L6849j8314j340r501l1608l3952q11M276L1321l018
$$ plain form
21920 35233 -1285 -26085 -53248 -63233 -85380 -103762 -100385 -79280 -92109 -87693 -70879 -40434
21908 -40434 -44629 -37546 -31160 -63916 -74946 -65374 -52455 -54261 -82806 -63314 -35859 -24655 -55196
21895 -55196 -89904 -66202 -52634 -42536 -32466 -21906 -22043 -21830 -57233 -87685 -78780 -82542 -69627
21882 -69627 -34667 -33514 -31718 -61788 -83359 -52097 -20156 -29268 -43039 -58574 -73824 -79699
21870 -79699 -63205 -43785 -29723 -20372 -32244 -25809 3833 589 -5417 -13784 -36358 -66782 -73906
21857 -73906 -49237 -32485 -28503 -29407 -17773 -36132 -73084 -101338 -99704 -85221 -58490 -52626 -71375
21844 -71375 -105902 -123546 -109889 -115345 -81330 -49523 -50528 -56382 -46693 -39460 -72642 -89152 -59210
21831 -59210 -35856 -48803 -62893 -81053 -96491 -120001 -81780 -40979 -35366 -49160 -55284 -50286
$$ packed form
21920C5233l6518k4800k7163r985k2147j8382L377K1105j2829M416J6814L0445
21908d0434m195P083O386l2756j1030R572J2919j806k8545J9492K7455J1204l0541
21895e5196l4708K3702J3568J0098J0070J0560j37K13l5403l0452Q905l762J2915
21882f9627L4960J153J796l0070k1571L1262L1941r112j3771j5535j5250n875
21870g9699J6494J9420J4062R351j1872O435K9642l244o006q367k2574l0424p124
21857g3906K4669J6752L982r04J1634j8359l6952k8254J634J4483K6731N864j8749
21844g1375l4527j7644J3657n456L4015L1807j005n854R689P233l3182j6510K9942
21831e9210K3354j2947j4090j8160j5438k3510L8221M0801N613j3794o124M998
$$ plain form
21819 -50286 -68907 -63063 -52064 -48392 -70977 -79809 -87604 -101310 -104052 -80820 -69517 -80329 -99254
21806 -99254 -80649 -43841 -43264 -48181 -53651 -49340 -37135 -26942 -56072 -66501 -90146 -95445 -98870
21793 -98870 -93605 -66303 -43217 -31798 -45892 -52236 -51196 -38314 -69987 -80439 -78762 -59714
21781 -59714 -54493 -37953 -31100 -27498 668 -15670 -38710 -42817 -42763 -58409 -58757 -62454 -60899 -46099
21767 -46099 -60987 -82794 -87266 -51666 -34649 -42207 -69191 -78150 -78753 -70855 -67696 -91809 -106126
21754 -106126 -86490 -71688 -69513 -105277 -92350 -79136 -67128 -63003 -55464 -39964 -48751 -34589
21742 -34589 -38222 -61763 -97614 -108623 -91893 -80244 -81281 -72442 -63235 -45057 -36791 -40108 -72832
21729 -72832 -97552 -60570 -54315 -88895 -91383 -59630 -44745 -42686 -24907 -22526 -38637 -63272
$$ packed form
21819e0286j8621N844J0999L672k2585q832p795j3706k742K3232J1303j0812j8925
21806i9254J8605L6808N77m917n470M311J2205J0193k9130j0429k3645n299l425
21793i8870N265K7302K3086J1419j4094o344J040J2882l1673j0452J677J9048
21781e9714N221J6540O853L602K8166j6338k3040m107N4j5646l48l697J555J4800
21767d6099j4888k1807m472L5600J7017p558k6984q959o03P898L159k4113j4317
21754a06126J9636J4802K175l5764J2927J3214J2008M125P539J5500q787J4162
21742c4589l633k3541l5851j1009J6730J1649j037Q839R207J8178Q266l317l2724
21729g2832k4720L6982O255l4580k488L1753J4885K059J7779K381j6111k4635
$$ plain form
21717 -63272 -70515 -62361 -50853 -64168 -74830 -54186 -59902 -55021 -67501 -63431 -60922 -57989 -65513
21704 -65513 -82032 -77670 -48080 -38102 -29667 -60119 -82314 -66678 -54385 -56053 -70520 -82673
21692 -82673 -78793 -92779 -90713 -77922 -53398 -80236 -97342 -121829 -132408 -83855 -82602 -91804
21680 -91804 -64801 -50761 -76887 -60712 -83029 -109292 -104643 -89806 -78733 -90433 -144267 -140483
21668 -140483 -122486 -99133 -99765 -96738 -93992 -88779 -83061 -74499 -54612 -82901 -85814 -59183 -55593
21655 -55593 -79175 -109247 -115674 -128174 -148243 -106390 -51896 -5049 -13809 -25771 -28930 -39958
21643 -39958 -37318 -40817 -24957 -13824 -19013 -17111 -27742 -38051 -22547 -18621 -1817 -5516 -25128
21630 -25128 -51684 -54786 -53824 -63190 -72397 -71604 -82104 -83669 -96290 -80407 -50453 -42141 -60265
$$ packed form
21717f3272p243Q154J1508j3315j0662K0644n716M881j2480M070K509K933p524
21704f5513j6519M362K9590R978Q435l0452k2195J5636J2293j668j4467j2153
21692h2673L880j3986K066J2791K4524k6838j7106k4487j0579M8553J253r202
21680i1804K7003J4040k6126J6175k2317k6263M649J4837J1073j1700n3834L784
21668a40483J7997K3353o32L027K746N213N718Q562J9887k8289k913K6631L590
21655e5593k3582l0072o427j2500k0069M1853N4494M6847q760j1962l159j1028
21643c9958K640l499J5860J1133n189J902j0631j0309J5504L926J6804l699j9612
21630b5128k6556l102R62r366r207P93j0500j565j2621J5883K9954Q312j8124
$$ plain form
21617 -60265 -79883 -83861 -81251 -83130 -65957 -41677 -34506 -36552 -46223 -26407 -14652 -25180 -31763
21604 -31763 -58849 -70384 -89899 -88580 -79551 -97287 -101074 -77368 -56807 -47177 -79898 -77967 -73295
21591 -73295 -59661 -44365 -55966 -88246 -78928 -73056 -41101 -42707 -47564 -47729 -58952 -84983 -94914
21578 -94914 -106688 -78247 -36666 -52398 -52378 -71509 -66967 -67551 -75552 -90828 -114504 -111858 -91363
21565 -91363 -86396 -77372 -79783 -104465 -127594 -116983 -128855 -123512 -86487 -75056 -68426 -72659 -82912
21552 -82912 -53344 -41201 -31559 -6874 -36504 -64466 -60527 -72472 -79908 -43434 -32318 -32064 -49749
21539 -49749 -38567 -45064 -53978 -33939 -49555 -75093 -78286 -47219 -39278 -31334 -51532 -68502 -63909
21526 -63909 -53611 -69937 -94944 -82023 -60618 -34714 3869 27725 2695 -13608 -39659 -76945
$$ packed form
21617f0265j9618l978K610j879J7173K4280P171k046r671J9816J1755j0528o583
21604c1763k7086j1535j9515J319R029j7736l787K3706K0561R630l2721J931M672
21591g3295J3634J5296j1601l2280R318N872L1955j606m857j65j1223k6031r931
21578i4914j1774K8441M1581j5732K0j9131M542n84q001j5276k3676K646K0495
21565i1363M967R024k411k4682k3129J0611j1872N343L7025J1431O630m233j0253
21552h2912K9568J2143R642K4685k9630k7962L939j1945p436L6474J1116K54j7685
21539d9749J1182o497q914K0039j5616k5538l193L1067P941P944k0198j6970M593
21526f3909J0298j6326k5007J2921K1405K5904L8583K3856k5030j6303k6051l7286
$$ plain form
21514 -76945 -78367 -35060 -12545 -19463 -16101 -11726 7653 33091 62482 62208 78041 135010 191681
21501 191681 262858 399846 582622 781369 945617 977362 863475 678152 483234 355463
21491 355463 248969 181453 117640 101866 85822 42984 16 -6364 -2191 23047 30132 21931
21479 21931 -17744 -38974 -42077 -40516 -39959 -47641 -42363 -19504 11841 23287 28022 11709 -365
21466 -365 -6458 -36852 -65163 -74735 -81734 -63449 -44707 -40581 -35349 -17088 -11989 -29314 -48528
21453 -48528 -68656 -69307 -58832 -25010 -29286 -25683 -6297 -14829 -64208 -58673 -58382 -36753 -20183
21440 -20183 -42858 -71240 -79401 -57010 -54915 -63782 -73421 -80967 -67536 -36962 -38588 -75334 -83318
21427 -83318 -84339 -97204 -80303 -48149 -28627 -39402 -37483 -47964 -48575 -67283 -88008 -81756 -64882
$$ packed form
21514g6945j422M3307K2515o918L362M375J9379K5438K9391k74J5833N6969N6671
21501A91681P1177J36988J82776J98747J64248L1745j13887j85323j94918j27771
21491C55463j06494o7516o3813j5774j6044m2838m2968o380M173K5238P085q201
21479B1931l9675k1230l103J561N57p682N278K2859L1345J1446M735j6313j2074
21466c65o093l0394k8311r572o999J8285J8742M126N232J8261N099j7325j9214
21453d8528k0128o51J0475L3822m276L603J9386q532m9379N535K91K1629J6570
21440b0183k2675k8382q161K2391K095q867r639p546J3431L0574j626l6746p984
21427h3318j021j2865J6901L2154J9522j0775J919j0481o11j8708k0725O252J6874
$$ plain form
21414 -64882 -69568 -80171 -77891 -75303 -86926 -57221 -48944 -64881 -60829 -60021 -71738 -67070 -46002
21401 -46002 -36983 -34714 -46964 -48597 -54972 -52518 -60752 -49879 -71830 -85315 -51079 -33629 -5363
21388 -5363 -21324 -59362 -61382 -68647 -61785 -67583 -75948 -61749 -48492 -32863 -30212 -36716 -44861
21375 -44861 -29049 -41402 -58213 -57600 -49627 -46798 -50230 -37734 -56417 -51327 -54260 -41752 -17268
21362 -17268 -35425 -34997 -25554 -36878 -51719 -49633 -44790 -46564 -65068 -58843 -60810 -74459 -68976
21349 -68976 -35837 -26030 -38861 -51388 -57291 -65218 -79450 -72598 -50368 -74725 -72982 -75507 -80537
21336 -80537 -74540 -59079 -55548 -48846 -52544 -69374 -75635 -68871 -61452 -27675 -28397 -39102 -43778 -47055
21322 -47055 -43146 4021 -13485 -15747 -32934 -62382 -79048 -89590 -79231 -69209 -57766 -61465
$$ packed form
21414f4882m686j0603K280K588j1623K9705Q277j5937M052Q08j1717M668K1068
21401d6002R019K269j2250j633o375K454q234J0873k1951j3485L4236J7450K8266
21388e363j5961l8038k020p265O862n798q365J4199J3257J5629K651o504q145
21375d4861J5812j2353j6811O13P973K829l432J2496j8683N090k933J2508K4484
21362a7268j8157M28R443j1324j4841K086M843j774j8504O225j967j3649N483
21349f8976L3139R807j2831j2527n903p927j4232O852K2230k4357J743k525n030
21336h0537N997J5461L531O702l698j6830o261O764P419L3777p22j0705m676l277
21322d7055L909M7167j7506k262j7187k9448j6666j0542J0359J0022J1443l699
$$ plain form
21310 -61465 -86366 -76170 -65669 -54842 -47895 -33240 -61971 -64548 -42498 -39878 -46294 -64397
21298 -64397 -74014 -72747 -50346 -54324 -70064 -55582 -67519 -88846 -76403 -59579 -49251 -33323
21286 -33323 -55239 -62250 -87615 -70275 -43615 -37304 -34534 -45153 -42911 -66807 -83459 -94929
21274 -94929 -106436 -81712 -71099 -56272 -41611 -56319 -36446 -45524 -77526 -76695 -77248 -72254 -76527
21261 -76527 -61092 -61007 -61662 -63648 -62787 -48361 -42354 -55384 -81685 -84406 -69405 -40310 -34384 -62647
21247 -62647 -90317 -83244 -70879 -69501 -69623 -64489 -71961 -52518 -44701 -39973 -47704 -47424 -64718 -54128
21233 -54128 -48550 -56270 -53837 -48322 -40773 -30688 -38210 -43631 -61827 -102486 -118898 -111481 -77079
21220 -77079 -53910 -67460 -78171 -87733 -75805 -101982 -108448 -94089 -94344 -74887 -68799 -78685 -85765
$$ packed form
21310f1465k4901J0196J0501J0827O947J4655k8731k577K2050K620o416j8103
21298f4397r617J267K2401l978j5740J4482j1937k1327J2443J6824J0328J5928
21286c3323k1916p011k5365J7340K6660O311K770j0619K242k3896j6652j1470
21274i4929j1507K4724J0613J4827J4661j4708J9873r078l2002Q31n53M994m273
21261g6527J5435Q5o55j986Q61J4426O007j3030k6301k721J5001K9095N926k8263
21247f2647k7670P073J2365J378j22N134p472J9443P817M728p731K80j7294J0590
21233e4128N578p720K433N515P549J0085p522n421j8196m0659j6412P417L4402
21220g7079K3169j3550j0711r562J1928k6177o466J4359k55J9457O088r886p080
$$ plain form
21207 -85765 -103190 -92094 -84433 -74264 -69849 -98855 -115978 -114766 -92540 -109456 -148424 -145994
21195 -145994 -115346 -87634 -74133 -69722 -67903 -48526 -44978 -85738 -90030 -97846 -102836 -94424 -75648
21182 -75648 -61066 -61811 -64127 -45997 -51027 -69721 -68463 -72222 -74778 -82513 -68536 -80384 -99119
21169 -99119 -89044 -50921 -46720 -97386 -114489 -114656 -105841 -74141 -32712 -16829 -3390 -32996
21157 -32996 -59101 -63143 -76444 -98002 -103766 -102752 -90208 -95682 -81689 -91119 -95062 -80316 -76429
21144 -76429 -56633 -70464 -57457 -79321 -100091 -117397 -121457 -105573 -68223 -83058 -93234 -91207
21132 -91207 -101529 -106873 -81459 -95966 -107322 -120226 -128172 -120460 -108439 -98632 -87745 -80110 -89023
21119 -89023 -79420 -65032 -45461 -62063 -62252 -36497 -34981 -38049 -45531 -62695 -74926 -73816 -38972
$$ packed form
21207h5765j7425J1096P661J0169M415k9006j7123J212K2226j6916l8968K430
21195a45994L0648K7712J3501M411J819J9377L548m0760m292p816m990Q412J8776
21182g5648J4582p45k316J8130n030j8694J258l759k556p735J3977j1848j8735
21169i9119J0075L8123M201n0666j7103j67Q815L1700M1429J5883J3439k9606
21157c2996k6105m042j3301k1558n764J014J2544n474J3993r430l943J4746L887
21144g6429J9796j3831J3007k1864k0770j7306m060J5884L7350j4835j0176K027
21132i1207j0322n344K5414j4507j1356j2904p946P712J2021R807J0887P635q913
21119h9023R603J4388J9571j6602j89K5755J516l068p482j7164j2231J110L4844
$$ plain form
21106 -38972 -67477 -109755 -95357 -77656 -47264 -55937 -58585 -48370 -48417 -54541 -51492 -47364 -54094
21093 -54094 -55771 -62874 -72939 -58733 -43080 -40327 -69569 -64823 -69203 -66780 -75567 -78312 -69212
21080 -69212 -36225 -17760 -20291 -13110 -15046 -8185 -7572 -55875 -77114 -83002 -49828 -26431 -16903
21067 -16903 -12495 -1767 -18415 -25722 -45627 -49297 -24581 -20257 -55181 -50973 -54415 -53557 -44215
21054 -44215 -45888 -60703 -39442 -30300 -48320 -57345 -60123 -51528 -46936 -54778 -25298 -10186 -22940
21041 -22940 -10973 -15059 -25926 -49234 -58693 -57702 -45211 4862 13643 3977 -20296 -41777 -30202
21028 -30202 -24070 -35858 -34579 -44175 -49324 -28567 -24612 -32367 -63974 -98709 -70510 -67361 -42601
21015 -42601 -31123 -28760 -59827 -79932 -72517 -89841 -87790 -69316 -67472 -92233 -106522 -97544 -75239
$$ packed form
21106c8972k8505m2278J4398J7701L0392q673k648J0215m7o124L049M128o730
21093e4094j677p103j0065J4206J5653K753k9242M746m380K423q787k745R100
21080f9212L2987J8465k531P181j936O861O13m8303k1239n888L3174K3397R528
21067a6903M408J0728j6648p307j9905l670K4716M324l4924M208l442Q58R342
21054d4215j673j4815K1261R142j8020r025k778Q595M592p842K9480J5112j2754
21041b2940J1967m086j0867k3308r459R91J2491N0073Q781r666k4273k1481J1575
21028c0202O132j1788J279r596n149K0757L955p755l1607l4735K8199L149K4760
21015d2601J1478K363l1067k0105P415j7324K051J8474J844k4761j4289Q978K2305
$$ plain form
21002 -75239 -60492 -34376 -13486 -20234 -25513 -57658 -79726 -61590 -40361 -37227 -7383 -24179
20990 -24179 -15714 18329 10699 -29781 -87222 -93216 -68832 -61169 -55707 -60674 -74332 -68099 -60605
20977 -60605 -64568 -78872 -103319 -123871 -98943 -64839 -46738 -52197 -31664 -3224 12189 32788
20965 32788 23552 11129 9599 -12710 -26094 3546 11742 -3363 -5924 -23585 -19440 -9034 -40021
20952 -40021 -68884 -71212 -92922 -68755 -32439 -41422 -47240 -42766 -27617 -57003 -78053 -88920
20940 -88920 -78453 -84848 -89250 -122398 -97523 -75297 -51236 -27366 -40613 -69362 -86456 -97766
20928 -97766 -104704 -96899 -81860 -61945 -62543 -67516 -73180 -87428 -69392 -34330 -42000 -68027 -61993
20915 -61993 -71275 -97333 -107355 -88235 -85669 -88045 -73336 -55425 -42605 -32633 -43214 -74015
$$ packed form
21002g5239J4747K6116K0890o748n279l2145k2068J8136K1229L134K9844j6796
20990b4179Q465L4043p630m0480n7441n994K4384P663N462m967j3658O233P494
20977f0605l963j4304k4447k0552K4928L4104J8101n459K0533K8440J5413K0599
20965C2788r236j2423j530k2309j3384K9640Q196j5105k561j7661M145J0406l0987
20952d0021k8863k328k1710K4167L6316q983n818M474J5149k9386k1050j0867
20940h8920J0467o395m402l3148K4875K2226K4061K3870j3247k8749j7094j1310
20928i7766o938P805J5039J9915n98m973n664j4248J8036L5062p670k6027O034
20915f1993r282k6058j0022J9120K566k376J4709J7911J2820R972j0581l0801
$$ plain form
20903 -74015 -67735 -59769 -68752 -84507 -62292 -49171 -45536 -38306 -47315 -39616 -54815 -55484 -33850
20890 -33850 -17286 -41400 -54433 -87004 -98052 -82682 -82371 -74006 -72051 -78996 -54814 -15647 -12352
20877 -12352 -35056 -55728 -47915 -64358 -65360 -57767 -54426 -59250 -54050 -43603 -36713 -41272 -60653
20864 -60653 -65531 -77057 -84739 -54952 -39052 -39251 -47573 -36464 -839 1123 -14654 -11657 -42411
20851 -42411 -42478 -56748 -64490 -69327 -65121 -51366 -72946 -112695 -114741 -99915 -94254 -85981 -40612
20838 -40612 -34345 -10009 14252 11052 -12338 -49573 -55742 -59234 -56054 -11716 -16314 -59041 -89615
20825 -89615 -81915 -64426 -31423 -10642 -17255 -12936 4097 -15882 -27365 -25743 -48531 -70753
20813 -70753 -81344 -68230 -37214 -52975 -63595 -53520 -54476 -5025 -102 -25730 -40706 -54732
$$ packed form
20903g4015O280P966q983j5755K2215J3121L635P230r009P699j5199o69K1634
20890c3850J6564k4114j3033l2571j1048J5370L11Q365J955o945K4182L9167L295
20877a2352k2704k0672P813j6443j002P593L341m824N200J0447O890m559j9381
20864f0653m878j1526p682K9787J5900j99q322J1109L5625J962j5777K997l0754
20851d2411o7j4270p742m837M206J3755k1580l9749k046J4826N661Q273M5369
20838d0612O267K4336K4261l200k3390l7235o169l492L180M4338m598m2727l0574
20825h9615P700J7489L3003K0781o613M319J7033j9979j1483J622k2788k2222
20813g0753j0591J3114L1016j5761j0620J0075r56M9451M923k5628j4976j4026
$$ plain form
20801 -54732 -54191 -58694 -67893 -77893 -71116 -68875 -58571 -34364 -65591 -102473 -111075 -91988 -71119
20788 -71119 -49893 -38512 -52889 -83319 -89551 -67262 -35415 -54876 -82312 -84094 -70122 -80529
20776 -80529 -108943 -88573 -52970 -39697 -50742 -49187 -26151 -12416 -9943 -44209 -67669 -48770
20764 -48770 -23526 -27408 -18595 -16719 -23700 -39363 -54780 -43329 -46590 -52263 -54552 -46589 -31256
20751 -31256 -38635 -41257 -38774 -31976 -39977 -88832 -119758 -92554 -66102 -19098 -5374 -29144 -40888
20738 -40888 -35186 -60009 -74421 -78018 -65969 -46899 -50937 -26646 -16980 -18985 -7979 -19704 -33872
20725 -33872 -26454 -20800 -53398 -67580 -57168 -83533 -115264 -103306 -81449 -60621 -43924 -38644
20713 -38644 -42045 -43939 -20949 5388 -29406 -16778 -33763 -45401 -7598 5180 -268 -6239
$$ packed form
20801e4732N41m503r199j0000O777K241J0304K4207l1227l6882q602J9087K0869
20788g1119K1226J1381j4377l0430o232K2289L1847j9461k7436j782J3972j0407
20776h0529k8414K0370L5603J3273j1045J555K3036J3735K473l4266k3460J8899
20764d8770K5244l882Q813J876o981j5663j5417J1451l261n673k289P963J5333
20751c1256p379k622K483O798q001m8855l0926K7204K6452M7004J3724k3770j1744
20738d0888N702k4823j4412l597J2049J9070m038K4291R666k005J1006j1725j4168
20725c3872P418N654l2598j4182J0412k6365l1731J1958K1857K0828J6697N280
20713c8644l401j894K2990K6337l4794J2628j6985j1638L7803J2778n448n971
$$ plain form
20701 -6239 -22306 -8173 -8452 885 -9094 -8307 1820 3339 3000 -8266 -14447 20751 12352 -13668
20687 -13668 -366 25203 46364 38678 10599 14311 33084 31899 46095 9393 -32612 -46909
20675 -46909 -33066 -36301 -44612 -13447 -10048 -1003 26914 22707 27262 5769 44 -1853 -2699 11588
20661 11588 -1199 -5573 36877 49733 4295 -12390 -11666 -16183 -23659 -9013 -20405 -15037 238
20648 238 -6713 -36175 -36747 -41260 -26160 -40956 -21841 -22377 -36460 -18787 -1905 -6692 20703
20635 20703 -5116 -13237 -15067 -18519 -21610 -30362 -46796 -37648 -15881 -22200 -38332 -47792 -62657
20622 -62657 -46641 -51646 -45469 -10879 10735 8152 1934 2557 7410 1876 -25278 -49064 -48225 -13760
20608 -13760 -15782 -13621 -27760 -31666 -32151 -20159 -2465 -15113 -37983 -47994 -48344 -51565 -78025
$$ packed form
20701f239j6067J4133k79R337r979P87J0127J519l39j1266o181L5198q399k6020
20687a3668J3302K5569K1161p686k8079L712J8773j185J4196l6702m2005j4297
20675d6909J3843l235q311L1165L399R045K7917m207M555k1493n725j897q46J4287
20661A1588j2787m374M2450J2856m5438j6685P24m517p476J4646j1392N368J5275
20648B38o951k9462n72m513J5100j4796J9115n36j4083J7673J6882m787K7395
20635B0703k5819q121j830l452l091q752j6434R148K1767o319j6132r460j4865
20622f2657J6016n005O177L4590K1614k583o218O23M853n534k7154k3786Q39L4465
20608a3760k022K161j4139l906m85J1992J7694j2648k2870j0011l50l221k6460
$$ plain form
20595 -78025 -74637 -39316 -10027 3399 13072 22342 49249 32094 -10020 -25072 679 35855
20583 35855 35319 17871 35684 59870 32618 33173 22906 -785 -13122 -23347 -2449 -19448
20571 -19448 -4384 -957 -42983 -33684 5450 9186 15273 29039 43106 46071 46876 23581 14187
20558 14187 6164 24186 31658 43721 29515 25268 -2822 15872 23165 44299 80701 71121 62070
20545 62070 50232 12617 -2728 -21 31422 31306 52155 71843 50089 47419 61367 62054 66618
20532 66618 58579 31217 -250 14056 51198 67096 64311 49231 32212 31381 42062 56616
20520 56616 91233 144566 168958 180300 176909 173422 144100 110448 94498 88509 94206 98679 116180
20507 116180 116488 114461 92266 112049 96298 81647 71927 47568 34136 23031 38659 54777
$$ packed form
20595g8025L388L5321K9289J3426R673R270K6907j7155m2114j5052K5751L5176
20583C5855n36j7448J7813K4186k7252N55j0267k3691j2337j0225K0898j6999
20571a9448J5064L427m2026R299L9134L736O087J3766J4067K965Q05k3295r394
20558A4187q023J8022P472J2063j4206m247k8090J8694P293K1134L6402r580r051
20545F2070j1838l7615j5345K707L1443j16K0849J9688k1754k670J3948O87M564
20532F6618q039k7362l1467J4306L7142J5898k785j5080j7019q31J0681J4554
20520E6616L4617N3333K4392J1342l391l487k9322l3652j5950n989N697M473J7501
20507A16180L08k027k2195J9783j5751j4651r720k4359j3432j1105J5628J6118
$$ plain form
20495 54777 80922 117727 120820 72048 25217 24516 39825 13862 39729 63476 88396 96507
20483 96507 105820 92020 38537 53498 67912 70941 101719 148621 173041 176873 135188 69604
20471 69604 60096 66413 55657 66574 99226 129011 144612 190322 198955 170837 139691 121150
20459 121150 103820 81787 71188 69703 78856 80755 87810 73025 102046 123787 104779 100981
20447 100981 105570 125290 107879 95353 95025 105409 107916 118393 117488 103520 63912 72451 85262
20434 85262 107647 108030 86986 86268 84383 76978 79715 84777 90445 58276 39990 48708 55134 32649
20420 32649 38330 59696 77531 87135 56456 33470 45498 48113 29535 31590 43204 38301 60439
20407 60439 53912 26597 17549 196 983 50005 55305 31102 9229 -20826 -2560 17905 7380
$$ packed form
20495E4777K6145L6805L093m8772m6831p01J5309k5963K5867K3747K4920Q111
20483I6507R313j3800n3483J4961J4414L029L0778M6902K4420L832m1685o5584
20471F9604r508O317j0756J0917L2652K9785J5601M5710Q633k8118l1146j8541
20459A21150j7330k2033j0599j485R153J899P055j4785K9021K1741j9008l798
20447A00981M589J9720j7411j2526l28J0384K507J0477r05j3968l9608Q539J2811
20434H5262K2385L83k1044p18j885p405K737N062N668l2169j8286Q718O426k2485
20420C2649N681K1366J7835R604l0679k2986J2028K615j8578K055J1614m903K2138
20407F0439o527k7315r048j7353P87M9022N300k4203k1873l0055J8266K0465j0525
$$ plain form
20394 7380 20096 31388 33816 34249 42799 62636 83740 40083 16577 18706 42649 73258 61364
20381 61364 58022 84881 117152 139003 148726 136199 108098 92579 71819 57667 48412 73838
20369 73838 66758 43954 42721 44804 39068 33792 28398 20728 5226 -382 17114 30081 30299 30023
20355 30023 37258 54418 77860 80081 65530 42192 54934 48533 40257 40681 35814 40629 54823
20342 54823 54247 47671 47159 50637 64114 87791 65806 57705 93295 96959 88497 80732 52350 42941
20328 42941 65130 86267 89356 77604 78917 56529 62731 60575 65099 77366 80165 43578 12838
20315 12838 11941 25076 9223 6057 36333 51573 59304 52889 73772 89206 62958 40687 50977
20302 50977 63951 69650 106218 122987 88604 64175 49797 17631 13722 20695 29636 59166
$$ packed form
20394G380J2716J1292K428M33Q550J9837K1104m3657k3506K129K3943L0609j1894
20381F1364l342K6859L2271K1851R723j2527k8101j5519k0760j4152r255K5426
20369G3838p080k2804j233K083n736n276n394p670j5502n608J7496J2967K18k76
20355C0023P235J7160K3442K221j4551k3338J2742o401q276M24m867M815J4194
20342E4823n76o576n12L478J3477K3677k1985q101L5590L664q462p765k8382r409
20328D2941K2189K1137L089j1752J313k2388O202k156M524J2267K799l6587l0740
20315A2838q97J3135j5853l166L0276J5240P731o415K0883J5434k6248k2271J0290
20302E0977J2974N699L6568J6769l4383k4429j4378l2166l909O973Q941K9530
$$ plain form
20290 59166 81003 99147 84979 88807 96262 120239 190249 250438 304243 340365 365894 360226
20278 360226 324325 269991 249365 215414 204072 248707 292606 304533 320331 350716 414046
20267 414046 443502 432690 411452 389565 376008 326786 282652 250304 210158 172805 130280
20256 130280 99254 78485 60285 42078 34124 65439 63306 42616 51271 76037 86084 82634
20244 82634 83831 87425 97915 125739 110146 116853 114828 100694 109248 123704 139735 145493 155978
20231 155978 181476 198879 233771 267527 344603 420256 459922 477669 469610 461038 465347 472496
20219 472496 487091 485835 475629 446545 425774 440280 449019 439165 373851 328194 295321 258443
20207 258443 230265 194703 199829 208605 180888 151320 156173 163977 150794 142750 122981 104440
$$ packed form
20290E9166K1837J8144j4168L828P455K3977P0010O0189N3805L6122K5529n668
20278C60226l5901n4334k0626l3951j1342M4635M3899J1927J5798L0385O3330
20267D14046K9456j0812k1238k1887j3557m9222m4134l2348m0146l7353m2525
20256A30280l1026k0769j8200j8207p954L1315k133k0690Q655K4766J0047l450
20244H2634J197L594J0490K7824j5593O707k025j4134Q554J4456J6031N758J0485
20231A55978K5498J7403L4892L3756P7076P5653L9666J7747q059q572M309P149
20219D72496J4595j256j0206k9084k0771J4506Q739r854o5314m5657l2873l6878
20207B58443k8178l5562N126Q776k7717k9568M853P804j3183q044j9769j8541
$$ plain form
20195 104440 85858 79850 63286 30454 1858 -2358 20576 33978 50671 44276 81632 97356
20183 97356 72535 73251 60382 82594 96960 78094 53434 77633 103775 119125 102373 89602
20171 89602 75273 67338 75203 80193 95637 105674 111624 125598 117515 113332 116270 101464 81371
20158 81371 85476 86172 77389 75433 73381 72296 63818 87418 97449 99715 116943 121394 86500 92987
20144 92987 133301 138484 134666 118662 115945 126617 139183 166432 178365 155885 151728 136688
20132 136688 120726 106477 113777 128228 124247 141875 133545 107371 99337 87267 104422 122331
20120 122331 135887 137930 121084 112864 107153 106583 134086 143443 130585 130903 130544 145581 133319
20107 133319 154349 159044 141676 166057 172836 156195 118244 93613 104412 124294 147084 154514
$$ packed form
20195A04440j8582o008j6564l2832k8596m216K2934J3402J6693o395L7356J5724
20183I7356k4821P16j2869K2212J4366j8866k4660K4199K6142J5350j6752j2771
20171H9602j4329p935P865M990J5444J0037N950J3974q083m183K938j4806k0093
20158H1371M105O96q783j956k052j085q478K3600J0031K266J7228M451l4894O487
20144I2987M0314N183l818j6004k717J0672J2566K7249J1933k2480m157j5040
20132A36688j5962j4249P300J4451l981J7628q330k6174q034j2070J7155J7909
20120A22331J3556K043j6846q220n711n70K7503R357j2858L18l59J5037j2262
20107A33319K1030M695j7368K4381O779j6641l7951k4631J0799J9882K2790P430
$$ plain form
20095 154514 134130 130799 124963 128447 114939 106739 119079 104011 90663 96044 125312 150472
20083 150472 148447 128803 145580 167386 178164 181614 167618 145191 130135 162824 167234 146119
20071 146119 140977 193215 236537 235901 243766 226623 215913 186174 163802 160815 157980 155590 169595
20058 169595 153321 121046 143425 188109 193164 208400 226972 231810 222430 200966 174921 182617
20046 182617 180184 137220 127334 143467 143830 142389 172406 184634 178682 172274 163501 165607 154215
20033 154215 117326 115233 131713 132499 109446 108558 125833 159110 173026 176379 205047 215706 237340
20020 237340 252052 285352 302732 320568 340886 363177 364999 384928 421416 454431 491034 510248
20008 510248 478243 424161 408494 417819 423367 428438 456043 488843 554568 588452 582552 594052
$$ packed form
20095A54514k0384l331n836L484j3508q200J2340j5068j3348N381K9268K5160
20083A50472k025j9644J6777K1806J0778L450j3996k2427j5056L2689M410k1115
20071A46119n142N2238M3322o36P865j7143j0710k9739k2372k987k835k390J4005
20058A69595j6274l2275K2379M4684N055J5236J8572M838r380k1464k6045P696
20046A82617k433m2964r886J6133L63j441L0017J2228n952o408q773K106j1392
20033A54215l6889k093J6480P86k3053q88J7275L3277J3916L353K8668J0659K1634
20020B37340J4712L3300J7380J7836K0318K2291J822J9929L6488L3015L6603J9214
20008E10248l2005n4082j5667R325N548N071K7605L2800O5725L3884n900J1500
$$ plain form
19996 594052 564987 508070 486545 479402 453748 437042 436720 421250 406184 412740 390159 379183
19984 379183 339388 289273 278451 274480 285656 290577 271600 283743 316531 329132 322237 311811
19972 311811 337987 335176 321801 317642 340160 367386 401956 442119 483947 506274 518963 539876
19960 539876 546476 559005 613337 706624 751950 782641 824946 834534 840303 830843 788234 736208
19948 736208 664603 639357 637326 677309 698806 713319 751018 756109 729846 699305 661401 590652
19936 590652 505281 467702 418600 407787 415699 414155 404570 395764 372059 366561 347939 335284
19924 335284 354801 370986 418806 443678 422796 415045 396335 370191 376517 362998 352006 325412
19912 325412 322475 319828 326155 307028 325420 327182 319376 332588 313530 306663 283299 276878 269406
$$ packed form
19996E94052k9065n6917k1525p143k5654j6706l22j5470j5066O556k2581j0976
19984C79183l9795n0115j0822l971J1176M921j8977J2143L2788J2601o895j0426
19972C11811K6176k811j3375m159K2518K7226L4570M0163M1828K2327J2689K0913
19960E39876O600J2529N4332R3287M5326L0691M2305R588N769r460m2609n2026
19948G36208p1605k5246k031L9983K1497J4513L7699N091k6263l0541l7904p0749
19936E90652q5371l7579m9102j0813P912j544r585q806k3705n498j8622j2655
19924C35284J9517J6185M7820K4872k0882p751j8710k6144O326j3519j0992k6594
19912C25412k937k647O327j9127J8392J762p806J3212j9058o867k3364o421p472
$$ plain form
19899 269406 247287 231867 224765 234992 253742 272806 293814 308006 334651 372377 372170 401538
19887 401538 463584 460831 435201 405031 390138 368744 359948 355594 365427 365980 378774 400319 416171
19874 416171 413955 416804 427334 462230 488658 494462 510461 513994 511996 524114 502061 519210
19862 519210 542517 557276 566917 586334 562024 549143 546158 541441 546385 521058 496543 477548
19850 477548 438613 447481 474139 484891 484022 488996 517598 536564 551537 574666 588822 587250
19838 587250 593069 601709 647247 718371 754271 763786 803746 860516 882236 929704 1028029 1164585
19826 1164585 1315554 1357336 1256246 1113083 989506 943119 907123 884326 875494 892405 927743
19815 927743 925695 907641 893079 906296 912465 938642 958503 1006551 1065314 1111361 1112224 1131898
$$ packed form
19899B69406k2119j5420p102J0227J8750J9064K1008J4192K6645L7726k07K9368
19887D01538O2046k753k5630l0170j4893k1394q796m354R833N53J2794K1545J5852
19874D16171k216K849J0530L4896K6428N804J5999L533j998J2118k2053J7149
19862E19210K3307J4759R641J9417k4310j2881k985m717M944k5327k4515j8995
19850D77548l8935Q868K6658J0752q69M974K8602J8966J4973K3129J4156j572
19838E87250N819Q640M5538P1124L5900R515L9960N6770K1720M7468R8325J36556
19826A164585J50969M1782j01090j43163j23577m6387l5996k2797q832J6911L5338
19815I27743k048j8054j4562J3217O169K6177J9861M8048N8763M6047Q63J9674
$$ plain form
19803 1131898 1191989 1246407 1305625 1400868 1502642 1599251 1668852 1763564 1865312 1969291 2057820
19792 2057820 2125534 2234242 2374374 2561015 2803428 3072149 3347995 3608946 3831530 4056917
19782 4056917 4358470 4702086 5132974 5759440 6595182 7830398 9626481 12063219 14930440
19773 14930440 17405642 18593042 18572901 18326621 18828166 20703731 24515478 31185361 42179424
19764 42179424 59283213 82236254 103351834 110847478 105424399 97916219 91997633 82058400
19756 82058400 67229280 52927487 43047087 37907951 36676037 38278135 40706137 40980898
19748 40980898 37396097 31235449 24867662 19686762 15920200 13282490 11441235 10129101
19740 10129101 9266661 8743724 8428820 8204961 8072893 8046293 8153860 8292629 8496566
$$ packed form
19803A131898O0091N4418N9218R5243J01774R6609O9601R4712J01748J03979Q8529
19792B057820O7714J08708J40132J86641K42413K68721K75846K60951K22584K25387
19782D056917L01553L43616M30888O26466Q35742J235216J796083K436738K867221
19773A4930440K475202J187400k0141k46280N01545J875565L811747O669883J0994063
19764D2179424J7103789K2953041K1115580P495644n423079p508180n918586r939233
19756H2058400j4829120j4301793r880400n139136j231914J602098K428002K74761
19748D0980898l584801o160648o367787n180900l766562k637710j841255j312134
19740A0129101q62440n22937l14904k23859j32068k6600J07567J38769K03937
$$ plain form
19731 8496566 8770187 9090429 9510422 10112483 11084910 12574155 14792863 18086850 22933690
19722 22933690 29561030 37460726 44427849 47592071 46404893 43254372 40896350 41073997
19714 41073997 44876559 53596436 69115491 92402441 118432549 139120908 155576913
19707 155576913 168200817 165279790 141732054 109211688 80542706 60037334 46637173
19700 46637173 38436764 34097548 32661329 32872044 32384504 29368370 24497307 19518336
19692 19518336 15473758 12486486 10294041 8711929 7564190 6751517 6165689 5685533
19684 5685533 5315961 5008253 4635313 4219143 3832413 3482683 3155177 2884797 2663329
19675 2663329 2499423 2342254 2198846 2058421 1951024 1849993 1719405 1592648 1455606
$$ packed form
19731H496566K73621L20242M19993O02061R72427J489245K218708L293987M846840
19722B2933690O627340P899696O967123L164222j187178l150521k358022J77647
19714D1073997L802562Q719877J5519055K3286950K6030108K0688359J6456005
19707A55576913J2623904k921027k3547736l2520366k8668982k0505372j3400161
19700D6637173q200409m339216j436219K10715m87540l016134m871063m978971
19692A9518336m044578k987272k192445j582112j147739q12673n85828m80156
19684E685533l69572l07708l72940m16170l86730l49730l27506k70380k21468
19675B663329j63906j57169j43408j40425j07397j01031j30588j26757j37042
$$ plain form
19666 1455606 1386439 1320544 1260410 1226244 1182386 1123484 1073265 1038507 1019266 1004866 985053
19655 985053 923255 879187 853305 851443 844598 834136 826489 806254 787882 775951 744676 754270
19643 754270 797692 822142 846636 867163 895923 944976 969717 1001328 991967 974244 931997 875926
19631 875926 850344 848166 807040 756318 730796 703104 691327 682292 681807 646768 617953 593469
19619 593469 569071 584964 570193 561776 535214 547596 570490 566582 568951 586898 610722 658070
19607 658070 693254 708921 669241 645033 634583 588507 552881 542921 544998 557671 568330 575938
19595 575938 599442 607790 618261 619879 632046 645739 647984 629660 645637 688071 734358 739445
19583 739445 753140 813869 859306 880699 827336 784734 757974 730335 720487 744268 740258 742755
$$ packed form
19666A455606o9167o5895o0134l4166m3858n8902n0219l4758j9241j4400j9813
19655I85053o1798m4068k5882j862o845j0462p647k0235j8372j1931l1275R594
19643G54270M3422K4450K4494K0527K8760M9053K4741L1611r361j7723m2247n6071
19631H75926k5582k178m1126n0722k5522k7692j1777r035m85l5039k8815k4484
19619E93469k4398J5893j4771q417k6562J2382K2894l908K369J7947K3824M7348
19607F58070L5184J5667l9680k4208j0450m6076l5626r960K077J2673J0659P608
19595E75938K3504Q348J0471J618J2167J3693K245j8324J5977M2434M6287N087
19583G39445J3695O0729M5437K1393n3363m2602k6760k7639r848K3781m010K497
$$ plain form
19571 742755 755328 744107 768712 779227 783007 777934 749214 741631 759826 763938 734115 713338
19559 713338 701075 716221 721934 732890 772188 784522 795479 839108 850339 827786 817000 813332
19547 813332 842053 872894 906448 928939 938246 958068 993428 1033620 1071999 1084532 1111654 1150071
19535 1150071 1213868 1265146 1306904 1336023 1349900 1365027 1386185 1425369 1510899 1573259 1605197
19524 1605197 1637687 1685924 1705421 1735968 1814951 1900113 1970596 2088506 2185462 2306574 2451003
19513 2451003 2628629 2829485 3045180 3330681 3692233 4090595 4479152 4761147 4955933
19504 4955933 5154012 5423015 5730977 6144600 6787703 7718264 9008598 10807645 13323374
19495 13323374 16830960 21466630 26532899 30159717 31191217 30678864 30753903 32924469
$$ packed form
19571G42755J2573j1221K4605J0515L780n073k8720p583J8195M112k9823k0777
19559G13338j2263J5146N713J0956L9298J2334J0957M3629J1231k2553j0786l668
19547H13332K8721L0841L3554K2491R307J9822L5360M0192L8379J2533K7122L8417
19535A150071O3797N1278M1758K9119J3877J5127K1158L9184Q5530O2360L1938
19524A605197L2490M8237J9497L0547P8983Q5162P0483J17910R6956J21112J44429
19513B451003J77626K00856K15695K85501L61552L98362L88557K81995J94786
19504D955933J98079K69003L07962M13623O43103R30561J290334J799047K515729
19495A3323374L507586M635670N066269L626818J031500n12353P5039K170566
$$ plain form
19487 32924469 38269087 48168421 64792212 90736011 125090956 156349221 168871734
19480 168871734 163454359 150616521 131919236 107154684 82642306 64002598 52051274
19473 52051274 45495916 43152077 44099785 46986569 49264064 47798230 41979076 34164405
19465 34164405 26875939 21145776 17004823 14070133 12022005 10635359 9757927 9228430
19457 9228430 8922653 8681340 8462610 8296945 8206917 8156841 8087185 8026895 8083915 8330677
19447 8330677 8844330 9718975 11077797 13132722 16197458 20653819 26735429 33617668
19439 33617668 38818083 40070021 38120901 35731251 35190330 37857603 44978242 57590170
19431 57590170 73686236 86616755 94518349 103441256 113650872 113154037 96300768 72520193
$$ packed form
19487C2924469N344618R899334J6623791K5943799L4354945L1258265J2522513
19480A68871734n417375j2837838j8697285k4764552k4512378j8639708j1951324
19473E2051274o555358k343839R47708K886784K277495j465834n819154p814671
19465C4164405p288466n730163m140953k934690k048128j386646q77432n29497
19457I228430l05777k41313k18730j65665r0028n0076o9656o0290N7020K46762
19447H330677N13653Q74645J358822K054925L064736M456361O081610O882239
19439C3617668N200415J251938j949120k389650n40921K667273P120639J2611928
19431E7590170J6096066J2930519P901594Q922907J0209616m96835j6853269k3780575
$$ plain form
19423 72520193 52113743 38015830 28985870 23407435 20250269 18805049 18628281 18931782
19415 18931782 18364672 16263544 13347425 10571947 8385931 6844084 5761016 5002185
19407 5002185 4454098 4091392 3824964 3610537 3457898 3358698 3231786 3004105 2723716 2446196
19397 2446196 2208214 1989657 1843331 1691268 1593354 1522720 1464704 1410869 1350957 1297012
19387 1297012 1246545 1192661 1096477 1060327 1030237 1035122 1034035 1015790 986306 950099 936653 916260
19375 916260 888648 868966 877203 874917 874273 886477 912182 921240 892579 906504 918784 944996
19363 944996 1010431 1057808 1107368 1208639 1463615 1870525 2406764 3023978 3314408 3045673
19353 3045673 2490711 2012708 1675038 1388948 1198450 1087952 1011496 972957 920914 871406
$$ packed form
19423G2520193k0406450j4097913r029960n578435l157166j445220j76768L03501
19415A8931782n67110k101128k916119k775478k186016j541847j083068p58831
19407E002185n48087l62706k66428k14427j52639r9200j26912k27681k80389k77520
19397B446196k37982k18557j46326j52063r7914p0634n8016n3835n9912n3945
19387A297012n0467n3884r6184l6150l0090M885j087j8245k9484l6207j3446k0393
19375I16260k7612j9682Q237k286o44J2204K5705R058k8661J3925J2280K6212
19363I44996O5435M7377M9560J01271K54976M06910N36239O17214K90430k68735
19353C045673n54962m78003l37670k86090j90498j10498p6456l8539n2043m9508
$$ plain form
19343 871406 865894 859484 830817 790316 746369 710837 642219 612030 569298 512591 536379 564661
19331 564661 546551 545526 567034 619586 646503 661178 687943 690788 662782 659775 649773 618535
19319 618535 622769 642965 672811 691462 715040 752624 761578 715327 687952 649040 624670 604446
19307 604446 583949 589504 582301 576081 568845 562829 569149 592878 591100 552890 488642 442783 430834
19294 430834 428006 429343 418493 402973 418018 373761 389610 406167 383286 362809 369886 387116
19282 387116 389541 396147 420335 424162 440692 456768 462730 459958 464793 472806 475889 421934 376484
19269 376484 340540 309746 301154 294820 299726 323538 322978 321064 354069 395147 425015 448937 453761
19256 453761 477268 471996 463313 460333 463719 450620 462105 457204 484349 529146 576742 672735
$$ packed form
19343H71406n512o410k8667m0501m3947l5532o8618l0189m2732n6707K3788K8282
19331E64661j8110j025K1508N2552K6917J4675K6765K845k8006l007j0002l1238
19319F18535M234K0196K9846J8651K3578L7584Q954m6251k7375l8912k4370k0224
19307F04446k0497N555p203o220p236o016O320K3729j778l8210o4248m5859j1949
19294D30834k828J337j0850j5520J5045m4257J5849J6557k2881k0477P077J7230
19282C87116K425O606K4188L827J6530J6076N962k772M835Q013L083n3955m5450
19269C76484l5944l0794q592o334M906K3812n60j914L3005M1078K9868K3922M824
19256D53761K3507n272q683k980L386j3099J1485m901K7145M4797M7596R5993
$$ plain form
19244 672735 731000 725294 713929 686270 667225 660057 677445 707913 736643 759603 793623 777825
19232 777825 752140 742796 707382 642476 601966 567591 516794 484582 459243 454505 449748 436659
19220 436659 418868 400655 390988 363294 339322 355354 366306 353080 317584 294570 273745 275711
19208 275711 289683 305832 299221 329700 359501 369959 367273 357846 359925 387184 376749 390861
19196 390861 393895 383708 380869 394197 392776 410082 438030 478088 526162 524096 454066 408588
19184 408588 370677 352780 317289 297507 277297 302640 334047 361708 406923 423471 417271 354971
19172 354971 292936 274652 273866 242844 238657 223986 186153 187450 167064 158287 148056 144085 143349
19159 143349 126413 142360 152193 143855 163721 143289 101224 82188 114528 119391 102597 99843
$$ packed form
19244F72735N8265n706j1365k7659j9045p168J7388L0468K8730K2960L4020j5798
19232G77825k5685r344l5414o4906m0510l4375n0797l2212k5339m738m757j3089
19220D36659j7791j8213r667k7694k3972J6032J0952j3226l5496k3014k0825J966
19208B75711J3972J6149o611L0479K9801J0458k686r427K079K7259j0435J4112
19196C90861L034j0187k839J3328j421J7306K7948M0058M8074k066p0030m5478
19184D08588l7911j7897l5491j9782k0210K5343L1407K7661M5215J6548o200o2300
19172C54971o2035j8284p86l1022m187j4671l7833J297k0386q777j0231l971p36
19159A43349j6936J5947R833q338J9866k0432m2065j9036L2340M863j6794k754
$$ plain form
19147 99843 112986 125597 144498 140278 137879 115826 92497 84893 97116 92971 105124 119646
19135 119646 113990 125642 126608 129147 109805 111178 118720 118014 82615 92362 97990 107059 83982 53077
19121 53077 45958 58602 64495 54689 27861 44152 74708 86124 76580 41353 53352 61348 70127
19108 70127 76354 77213 72207 82343 97365 103280 128632 142449 141463 165066 169494 142901 104716
19095 104716 101189 113016 90082 60248 62036 95315 106364 134058 133987 98531 82977 54930
19083 54930 40251 54462 66577 73220 82420 91139 95023 108316 99000 97847 85921 62592 31245
19070 31245 41911 46869 49667 94530 103526 70537 71951 80765 81028 102223 73603 48520 48553 50424
19056 50424 29155 56150 66753 59901 54320 36035 24685 40420 51444 42110 35019 55806
$$ packed form
19147I9843J3143J2611J8901m220k399k2053k3329p604J2223m145J2153J4522
19135A19646n656J1652R66K539j9342J373P542p06l5399R747N628R069k3077l0905
19121E3077p119J2644N893r806k6828J6291L0556J1416r544l5227J1999P996Q779
19108G0127O227Q59n006J0136J5022N915K5352J3817r86K3603M428k6593l8185
19095A04716l527J1827k2934k9834J788L3279J1049K7694p1l5456j5554k8047
19083E4930j4679J4211J2115O643R200Q719L884J3293r316j153j1926k3329l1347
19070C1245J0666M958K798M4863Q996l2989J414Q814K63K1195k8620k5083L3J871
19056E0424k1269K6995J0603o852n581j8285j1350J5735J1024r334p091K0787
$$ plain form
19044 55806 54499 47869 33167 44892 35460 67556 77154 78456 57152 68230 77681 90955 73435
19031 73435 39869 50802 61240 64326 55945 29332 30416 44028 65261 68544 78841 83008 81293
19018 81293 110409 109189 91992 98916 90304 100973 97471 96151 103818 119201 142632 149207 117827
19005 117827 97725 83606 64373 47416 70287 72937 73108 82175 62784 74026 86392 107305
18993 107305 128346 125791 114309 101312 84623 79046 93568 103180 95405 96235 95774 93361 111750
18980 111750 121347 110645 105129 104437 107365 140329 153645 176053 171472 196134 246983 289366 319518
18967 319518 367677 410944 411094 411603 453728 479616 484385 464230 468784 490678 508552 540156 513751
18954 513751 442490 379664 319545 270137 237206 205375 188737 174532 174459 182804 147792 122386
$$ packed form
19044E5806j307o630j4702J1725r432L2096R598J302k1304J1078R451J3274j7520
19031G3435l3566J0933J0438L086q381k6613J084J3612K1233L283J0297M167j715
19018H1293K9116j220j7197O924q612J0669l502j320P667J5383K3431O575l1380
19005A17827k0102j4119j9233j6957K2871K650J71R067j9391J1242J2366K0913
18993A07305K1041k555j1482j2997j6689n577J4522R612p775Q30m61k413J8389
18980A11750R597j0702n516o92K928L2964J3316K2408m581K4662N0849M2383L0152
18967C19518M8159M3267J50N09M2125K5888M769k0155M554K1894J7874L1604k6405
18954E13751p1261o2826o0119m9408l2931l1831j6638j4205p3Q345l5012k5406
$$ plain form
18942 122386 118572 105284 126241 141544 117261 119362 134875 139330 142977 141233 131531 111482 132157
18929 132157 109920 103079 79183 60741 78265 119286 136761 178821 214015 246744 296258 336065
18917 336065 373074 373249 381018 423971 454213 422595 360300 327280 292345 259516 248655 263476
18905 263476 275409 318471 339899 394340 424258 428543 388795 329575 269723 195997 160642 164876
18893 164876 155222 119421 95864 90031 91949 85504 49034 36982 53724 44180 44808 46169 21850
18880 21850 25608 24240 7119 7479 43113 52249 52468 58722 71365 84273 68389 50951 8318
18867 8318 25018 23897 28355 78921 95249 82045 80903 51612 45823 57067 45972 29615 31230
18854 31230 23372 9824 24828 31024 49327 48998 16944 -14448 -33493 -30047 -13058 -6356 12305
$$ packed form
18942A22386l814j3288K0957J5303k4283K101J5513M455L647j744r702k0049K0675
18929A32157k2237o841k3896j8442J7524M1021J7475M2060L5194L2729M9514L9807
18917C36065L7009J75P769M2953L0242l1618o2295l3020l4935l2829j0861J4821
18905B63476J1933M3062K1428N4441K9918M285l9748n9220n9852p3726l5355M234
18893A64876r654l5801k3557n833J918o445l6470j2052J6742r544O28J361k4319
18880B1850L758j368j7121L60L5634R136K19O254J2643J2908j5884j7438m2633
18867H318J6700j121M458N0566J6328j3204j142k9291n789J1244j1095j6357J615
18854C1230p858j3548J5004O196J8303l29l2054l1392j9045L446J6989O702J8661
$$ plain form
18841 12305 25643 50177 53548 34729 26700 24598 18770 11548 -20619 -47560 -47704 -26837 3607
18828 3607 18867 20248 10309 15025 -6346 15219 54349 66005 42433 25294 6035 -7168
18816 -7168 -8109 -17271 7165 28048 34477 22667 25680 30880 27942 64721 54980 26993 32643 39343
18802 39343 49541 58114 69890 61579 37982 32485 14335 -5958 -2393 24159 24878 7416 -12730
18789 -12730 -18272 -16478 -12932 -5967 -11909 -24906 -20809 -5875 -21330 -8733 12688 -14933 -30987
18776 -30987 -5500 -8591 -14825 -11046 -7388 14630 12993 621 -7294 -9271 8085 16676 -14828
18763 -14828 -24200 -3749 4210 -31749 -41667 -31529 650 19921 24741 42238 46713 52169 58989
18750 58989 25194 28369 16578 -1748 -16571 -15854 2698 6680 -4983 -19915 -18753 -1572 16925
$$ packed form
18841A2305J3338K4534L371j8819q029k102n828p222l2167k6941j44K0867L0444
18828C607J5260J381r939M716k1371K1565L9130J1656k3572j7139j9259j3203
18816g168r41r162K4436K0883O429j1810L013N200k938L6779r741k7987N650O700
18802C9343J0198Q573J1776q311k3597n497j8150k0293L565K6552P19j7462k0146
18789a2730n542J794L546O965n942j2997M097J4934j5455J2597K1421k7621j6054
18776c0987K5487l091o234L779L658K2018j637j2372p915j977J7356Q591l1504
18763a4828r372K0451P959l5959r918J0138L2179J9271M820J7497M475N456O820
18750E8989l3795L175j1791j8326j4823P17J8552L982j1663j4932J162J7181J8497
$$ plain form
18737 16925 42324 45858 31284 32841 27899 34935 66512 80598 97734 101143 95014 78759 91870
18724 91870 127607 106160 82447 73082 60105 37979 29907 42785 58843 65143 35327 25298
18712 25298 59533 47598 21419 13759 20870 40318 43041 30532 17193 10765 23575 33485 27513
18699 27513 25964 25760 27988 17698 29362 39837 18275 1767 -2305 1297 13616 6215 17994
18686 17994 38983 14781 -24274 -24912 -17434 19704 54932 67701 34547 11252 11109 17003 52953
18673 52953 60269 63820 73231 89234 103162 91446 64972 53401 40885 20858 -4630 -26148
18661 -26148 -47516 -1557 31439 34785 32999 27713 22374 34010 15068 6645 -4715 2225 3274
18648 3274 54264 96902 74475 49685 45104 30977 10060 54786 65279 42838 14243 21593
$$ packed form
18737A6925K5399L534j4574J557m942P036L1577J4086J7136L409o129j6255J3111
18724I1870L5737k1447k3713r365j2977k2126q072J2878J6058O300k9816j0029
18712B5298L4235j1935k6179p660P111J9448K723j2509j3339o428J2810R910n972
18699B7513j549k04K228j0290J1664J0475k1562j6508m072L602J2319p401J1779
18686A7994K0989k4202l9055o38P478L7138L5228J2769l3154k3295j43N894L5950
18673E2953P316L551R411J6003J3928j1716k6474j1571j2516k0027k5488k1518
18661b6148k1368M5959L2996L346j786n286n339J1636j8942q423j1360O940J049
18648C274N0990M2638k2427k4790m581j4127k0917M4726J0493k2441k8595P350
$$ plain form
18636 21593 24428 667 10822 30337 13485 23657 42564 35858 611 12617 32663 23584
18624 23584 23727 -13216 -22987 -887 6970 19433 24460 21455 19916 21632 17658 10806 3366 -16085
18610 -16085 -22438 28957 40648 32807 19807 27598 52728 32420 25147 61846 104993 88283
18598 88283 80523 73655 61075 72390 93676 81146 44028 34226 63779 68314 53101 34778
18586 34778 14900 11810 1696 7206 29121 38003 48421 43205 33075 9833 -13226 25812
18574 25812 48883 23589 27987 22278 42252 49019 47536 27018 -3413 7449 51120 52346 52040
18561 52040 37446 44135 30973 -2329 -11298 10337 31112 29831 -32 4738 24065 31019 45575
18548 45575 36879 31204 56293 48311 49028 58678 78752 69099 71749 75516 37702 -5794 -17444
$$ packed form
18636B1593K835k3761J0155J9515j6852J0172J8907o706l5247J2006K0046r079
18624B3584J43l6943r771K2100P857J2463N027l005j539J716l974o852p440j9451
18610a6085o353N1395J1691p841j3000P791K5130k0308p273L6699M3147j6710
18598H8283p760o868j2580J1315K1286j2530l7118r802K9553M535j5213j8323
18586C4778j9878l090j0114N510K1915Q882J0418n216j0130k3242k3059L9038
18574B5812K3071k5294M398n709J9974O767j483k0518l0431J0862M3671J226l06
18561E2040j4594O689j3162l3302q969K1635K0775j281k9863M770J9327O954J4556
18548D5575q696n675K5089p982P17R650K0074r653K650L767l7814m3496j1650
$$ plain form
18535 -17444 -6676 5500 14113 21748 58449 52971 37188 51988 30419 -10903 -36550 -37991
18523 -37991 -18343 -31450 -14720 24067 34841 13808 35738 34718 -3206 -35966 -29290 -16984
18511 -16984 -9147 -6216 -826 11819 17525 15724 7531 42757 42917 6666 -19001 3708 6504
18498 6504 -17217 -2596 20968 59426 68257 59132 62911 71379 57682 36293 31384 39851 34439
18485 34439 5842 7493 56930 73666 44637 33015 -3779 -22318 -13437 8197 -4487 -10758
18473 -10758 -158 13906 -4409 1862 10182 6288 22854 38927 20115 16610 19648 24179 3370
18460 3370 -10277 11826 20267 6778 -22625 -33296 -40916 -28586 13820 34905 22095 15919
18448 15919 15387 -444 7218 15534 17206 25045 27619 53156 57428 64158 53105 47321 49519 55427
$$ packed form
18535a7444J0768J2176Q613P635L6701n478j5783J4800k1569m1322k5647j441
18523c7991J9648j3107J6730L8787J0774k1033K1930j020l7924l2760O676J2306
18511a6984P837K931N390J2645N706j801q193L5226J60l6251k5667K2709K796
18498F504k3721J4621K3564L8458Q831r125L779Q468j3697k1389m909Q467n412
18485C4439k8597J651M9437J6736k9029j1622l6794j8539Q881K1634j2684o271
18473a0758J0600J4064j8315O271Q320l894J6566J6073j8812l505L038M531k0809
18460C370j3647K2103Q441j3489k9403j0671p620J2330M2406K1085j2810o176
18448A5919n32j5831P662Q316J672P839K574K5537M272O730j1053n784K198N908
$$ plain form
18434 55427 42005 49946 42392 58276 39022 -7347 14806 63037 72233 58140 33641 21197
18422 21197 16483 19010 18064 29277 58113 63193 89526 124612 117882 90233 78915 75958 76146
18409 76146 85894 79577 72654 65505 82579 71608 78269 94150 105537 100543 63062 31572 17998
18396 17998 10275 16874 35395 30350 6334 27797 21287 3395 2757 20208 -8312 -4163 17205
18383 17205 34774 46854 10963 -12579 -12183 -29273 -21940 -19191 -3106 -18108 -20765 21323 19869
18370 19869 27300 27859 20814 -5202 -55195 -74959 -57399 -52807 -46151 -27601 -14042 -48803 -63047
18357 -63047 -68045 -65641 -12275 11784 8735 -14323 -21472 -35138 -21186 -6168 -5891 10565 9777
18344 9777 208 -12440 -14279 -36781 -46493 -21029 -10696 -16464 -13453 -16212 -24174 -22956 -9937
$$ packed form
18434E5427j3422P941p554J5884j9254m6369K2153M8231R196j4093k4499j2444
18422B1197m714K527r46J1213K8836N080K6333L5086o730k7649j1318k957J88
18409G6146R748o317o923p149J7074j0971O661J5881J1387m994l7481l1490j3574
18396A7998p723O599J8521n045k4016K1463o510j7892o38J7451k8520M149K1368
18383A7205J7569J2080l5891k3542L96j7090P333K749J6085j5002k657M2088j454
18370A9869P431N59p045k6016m9993j9764J7560M592O656J8550J3559l4761j4244
18357f3047m998K404N3366K4059l049k3058p149j3666J3952J5018K77J6456p88
18344I777r569j2648j839k2502r712K5464J0333n768L011k759p962J218J3019
$$ plain form
18331 -9937 -6033 -15602 -13890 15614 18289 12442 6165 -4250 -8043 -29705 -17435 -16389 -16232 -31810
18317 -31810 -37166 -14184 2978 3382 3589 43512 46817 46257 48152 33004 8277 257 -17110 -12818
18303 -12818 30919 35058 18117 8435 -3171 6425 27236 69402 91292 88630 96758 122192 154645
18290 154645 162824 169810 235386 256796 257897 271806 264431 228236 183237 164005 116655 106190
18278 106190 69432 47830 52943 50997 29385 17758 17057 1889 17498 25837 27319 9330 -20871
18265 -20871 -3949 1969 -10327 -13034 -24101 -24548 -1672 14078 25518 30772 13083 -13110 -46731
18252 -46731 -46524 -16832 -37780 -33534 -25999 -12691 -17658 -3865 31935 37331 24878 25142 30462
18239 30462 37265 30711 8856 -11208 8742 37640 6314 -26565 -7928 -25952 -22432 -14561
$$ packed form
18331i937L904r569J712K9504K675n847o277j0415l793k1662J2270J046J57j5578
18317c1810n356K2982J7162M04K07L9923L305n60J895j5148k4727q020j7367M292
18303a2818M3737M139j6941r682j1606R596K0811M2166K1890k662Q128K5434L2453
18290A54645Q179O986O5576K1410J101J3909p375l6195m4999j9232m7350j0465
18278A06190l6758k1602N113j946k1612j1627p01j5168J5609Q339J482j7989l0201
18265b0871J6922N918j2296k707j1067m47K2876J5750J1440N254j7689k6193l3621
18252d6731K07K9692k0948M246P535J3308m967J3793L5800N396j2453K64N320
18239C0462O803o554k1855k0064J9950K8898l1326l2879J8637j8024L520P871
$$ plain form
18227 -14561 -16639 -30097 -33513 -47414 -53439 -42171 -34437 -6340 -6938 -12741 -30491 -51878 -59480
18214 -59480 -45522 -18616 -12662 4210 -5098 -15908 3803 13198 -6526 -16436 -27443 -49866
18202 -49866 -53880 -39081 -18074 4023 -13104 -18464 -25346 -18515 -21851 -12558 -1225 -738 -19884
18189 -19884 -19893 -8342 15471 12055 11871 1109 -8403 -32900 -42406 -25822 8718 -7442 -10598 2355
18175 2355 -1156 20237 25913 19214 31230 21638 13306 -3499 14288 15986 3885 6958 4452
18162 4452 19772 35883 16953 17539 29608 19193 11041 18990 21994 23236 30364 31125 13040 -15695
18148 -15695 -25225 -27622 16271 22556 9660 -31047 -24756 -773 35070 59391 56349 62816 53416
18135 53416 15927 7881 7848 20576 29772 31374 21675 4081 7393 -9283 -13227 -22146 -30311 -35261
$$ packed form
18227a4561k078j3458l416j3901o025J1268P734K8097n98n803j7750k1387p602
18214e9480J3958K6906N954J6872r308j0810J9711R395j9724r910j1007k2423
18202d9866m014J4799K1007K2097j7127n360o882O831l336R293J1333M87j9146
18189a9884rJ1551K3813l416j84j0762r512k4497r506J6584L4540j6160l156J2953
18175B355l511K1393N676o699J2016r592q332j6805J7787J698j2101L073k506
18162D452J5320J6111j8930N86J2069j0415q152P949L004J242P128P61j8085k8735
18148a5695r530k397M3893O285j2896m0707O291K3983L5843K4321l042O467r400
18135E3416l7489q046l3J2728R196J602r699j7594L312j6676l944q919q165m950
$$ plain form
18121 -35261 -51162 -37144 -19622 -9233 -9303 -11897 -7404 13441 -236 -44675 -62649 -41748 -37579
18108 -37579 -38395 -57386 -71423 -38202 9801 30322 46971 68400 86783 107411 118983 114748
18096 114748 96182 95481 113666 130513 137008 112567 107949 98434 95775 77006 64339 84350 75129
18083 75129 70196 39916 46426 42210 28214 50539 55684 24817 34371 19766 -13622 -8922 9079
18070 9079 34139 33098 27043 18629 4608 7065 31928 43057 29258 34271 60551 62334 12482
18057 12482 -10458 -13666 14163 27793 18265 50907 95841 122138 148568 175063 157807 165732
18045 165732 188044 190394 171949 143452 101723 78825 71556 66839 74395 48201 16449 -121
18033 -121 -21715 -285 34506 20409 4221 4542 -21115 -36058 -40918 -34678 -30588 -36822 -18658
$$ packed form
18121c5261j5901J4018J7522J0389p0k594M493K0845j3677m4439j7974K0901M169
18108c7579q16j8991j4037L3221M8003K0521J6649K1429J8383K0628J1572m235
18096A14748j8566p01J8185J6847O495k4441m618r515k659j8769j2667K0011r221
18083G5129m933l0280O510m216j3996K2325N145l0867R554j4605l3388M700J8001
18070I079K5060j041o055q414j4021K457K4863J1129j3799N013K6280J783m9852
18057A2482k2940l208K7829J3630r528L2642M4934K6297K6430K6495j7256P925
18045A65732K2312K350j8445k8497m1729k2898p269m717P556k6194l1752j6570
18033a21k1594K1430L4791j4097j6188L21k5657j4943m860O240M090o234J8164
$$ plain form
18020 -18658 -5253 -13005 -20861 -6781 5242 6479 14945 5592 -38313 -30231 -8375 23822 21933
18007 21933 22324 7917 -14214 -20270 -8763 17414 51100 72292 71331 58055 67464 79303 107262
17994 107262 125026 133061 154589 175327 181607 180396 193579 212339 214255 220396 245290 252559 280504
17981 280504 280940 227147 197326 182170 167565 125158 90634 73077 85636 73251 94045 147729
17969 147729 184377 202054 203082 262078 309199 337446 353497 399648 395151 335981 299846 256582
17957 256582 199754 151871 138976 126166 125794 144143 137538 117888 119602 91713 89140 75871
17945 75871 93377 111316 107385 105824 134264 128954 98371 113266 124444 126472 136990 123098
17933 123098 107156 87077 84160 68575 61034 47423 29813 21523 36860 12750 20405 37831
$$ packed form
18020a8658J3405p752p856J4080J2023J237Q466r353m3905Q082K1856L2197j889
18007B1933L91j4407k2131o056J1507K6177L3686K1192r61j3276R409J1839K7959
17994A07262J7764Q035K1528K0738O280j211J3183J8760J916O141K4894P269K7945
17981B80504M36n3793k9821j5156j4605m2407l4524j7557J2559j2385K0794N3684
17969A47729L6648J7677J028N8996M7121K8247J6051M6151m497n9170l6135m3264
17957B56582n6828m7883j2895j2810l72J8349o605j9650J714k7889k573j3269
17945G5871J7506J7939l931j561K8440n310l0583J4895J1178K028J0518j3892
17933A23098j5942k0079k917j5585p541j3611j7610q290J5337k4110P655J7426
$$ plain form
17921 37831 68317 98932 95195 84178 75698 77542 80082 95271 118572 113979 85202 63241 44384
17908 44384 38994 62563 50566 55713 42212 36883 31680 52563 33081 28879 48689 40413 44312
17895 44312 55040 33815 29942 32957 -4180 -43027 -26628 37474 71613 46023 29858 29321
17883 29321 55007 38847 63774 76952 52048 30624 12574 26250 21199 -6431 12702 29719
17871 29719 14081 -18595 -24071 -39985 -25512 20004 34879 32194 17700 42192 47809 45501
17859 45501 35258 37633 26547 12942 13689 1 -5505 6719 1529 -5476 -9871 -8274 -2151
17846 -2151 -2112 -19087 -15936 5272 -473 -36 -2966 -23422 -60831 -65216 -60525 -30351 -41170 -44123
17832 -44123 -36843 -21496 19705 20504 8911 4303 23935 33137 35011 33559 2626 -29421 -40139
$$ packed form
17921C7831L0486L0615l737j1017q480J844K540J5189K3301m593k8777k1961j8857
17908D4384n390K3569j1997N147j3501n329n203K0883j9482m202J9810q276L899
17895D4312J0728k1225l873L015l7137l8847J6399O4102L4139k5590j6165n37
17883B9321K5686j6160K4927J3178k4904k1424j8050J3676n051k7630J9133J7017
17871B9719j5638l2676n476j5914J4473M5516J4875k685j4494K4492N617k308
17859D5501j0243K375j1086j3605P47j3688n506J2224n190p005m395J597O123
17846b151L9j6975L151K1208n745M37k930k0456l7409m385M691L0174j0819k953
17832d4123P280J5347M1201P99j1593m608J9632R202J874j452l0933l2047j0718
$$ plain form
17819 -40139 -28706 -31290 -31527 -23929 -27519 -19614 -21245 -38597 -29284 -40692 -47077 -61446 -55617 -46846
17805 -46846 -41102 -35405 -14555 12391 17740 -12365 -3246 -9232 -15595 -33556 -31616 -28819 -23577
17792 -23577 -14525 -28186 -21483 -16883 -23241 -10925 -18011 -26343 -22291 -29557 -8072 -7890 -25996 -34498
17778 -34498 -22483 -40281 -59460 -69649 -41900 -29655 -38471 -55656 -45079 -50249 -46852 -22171
17766 -22171 -27441 -25138 -22920 -40157 -24265 -17804 -9831 -20384 -49708 -52304 -54588 -43418 -39328
17753 -39328 -56403 -44789 -16287 -22817 -27733 -22300 15536 8120 -16602 -60239 -53204 -68034 -52170
17740 -52170 -50715 -78292 -100760 -100638 -80146 -66911 -67719 -64684 -47631 -31182 -51021 -76838 -66019
17727 -66019 -70913 -67296 -84916 -75996 -44554 -37885 -64186 -54489 -43354 -33652 -17822 -12805 4128
$$ packed form
17819d0139J1433k584k37P598l590P905j631j7352R313j1408o385j4369N829Q771
17805d6846N744N697K0850K6946N349l0105R119n986o363j7961J940K797N242
17792b3577R052j3661O703M600o358J2316p086q332M052p266K1485J82j8106q502
17778c4498J2015j7798j9179j0189K7749J2245q816j7185J0577n170L397K4681
17766b2171n270K303K218j7237J5892O461P973j0553k9324k596k284J1170M090
17753c9328j7075J1614K8502o530m916N433L7836p416k4722m3637P035j4830J5864
17740e2170J455k7577k2468J22K0492J3235q08L035J7053J6449j9839k5817J0819
17727f6019m894L617j7620Q920L1442O669k6301R697J1135R702J5830N017J6933
$$ plain form
17714 4128 -5142 -4349 -5345 -4999 -23606 -52049 -55673 -19819 -29413 -50425 -30970 -10203 25404 16730
17700 16730 37933 27657 -7344 -32228 -17760 -2041 -5527 993 -22771 -32177 -22184 -14892 -50542
17687 -50542 -46488 -1275 4045 -13249 -35374 -41167 -14246 -6314 -11373 3661 11035 -346 -1788
17674 -1788 -15760 -31594 -37531 -45794 -44519 -34854 -23110 489 -8813 -25595 11738 47749 21820
17661 21820 15287 33559 27783 -7858 -21568 16727 16134 -5489 1604 13568 9652 13467 29263
17648 29263 53185 86810 71285 52267 84641 121755 136794 153986 213981 281809 293968 261956
17636 261956 222283 186492 123651 84368 86872 76808 45375 30895 4445 5542 -12752 -38550
17624 -38550 -35601 -46106 -45399 -40070 -31368 -10712 -14877 -11034 -2474 -13410 -4059 -8398 -4876 -26716
$$ packed form
17714D128r270P93r96L46j8607k8443l624L5854r594k1012J9455K0767L5607q674
17700A6730K1203j0276l5001k4884J4468J5719l486O520k3764r406R993P292l5650
17687e0542M054M5213N320j7294k2125n793K6921P932n059J5034P374j1381j442
17674a788j3972j5834n937q263J275R665J1744K3599r302j6782L7333L6011k5929
17661B1820o533J8272n776l5641j3710L8295n93k1623P093J1964l916L815J5796
17648B9263K3922L3625j5525j9018L2374L7114J5039J7192N9995O7828J2159l2012
17636B61956l9673l5791o2841l9283K504j0064l1433j4480k6450J097j8294k5798
17624c8550K949j0505P07N329Q702K0656m165L843Q560j0936R351m339L522k1840
$$ plain form
17610 -26716 -36820 -32460 -11801 6521 11129 30484 34486 23508 28058 8856 -14924 -24327 -51124
17597 -51124 -43664 -29136 -13116 1666 13739 24025 6893 -36945 -64921 -55808 -37516 -31183
17585 -31183 -20946 -18456 -45328 -49538 -51375 -52886 -48553 -31303 -31551 -54002 -68957 -56321 -51976
17572 -51976 -54645 -50517 -51838 -57260 -28328 -25065 -23574 -18831 -40943 -61912 -53899 -58197 -58764 -58219
17558 -58219 -49110 -44256 -54018 -48617 -61184 -56323 -38573 -3001 17035 16761 3290 -8688 -1848
17545 -1848 6976 21590 6575 592 6479 17407 18292 2483 -1782 -36146 -21761 2059 -11893
17532 -11893 -22192 -47530 -41078 -33086 -12078 -11905 -1996 -12684 -25400 -50152 -38289 -21496 -9761
17519 -9761 -6650 -29692 -32370 -34194 -51874 -37308 -12226 -19559 -10257 -7455 -49919 -76104 -77411
$$ packed form
17610b6716j0104M360K0659J8322M608J9355M002j0978M550j9202k3780r403k6797
17597e1124P460J4528J6020J4782J2073J0286j7132m3838k7976R113J8292O333
17585c1183J0237K490k6872m210j837j511M333J7250k48k2451j4955J2636M345
17572e1976k669M128j321n422K8932L263J491M743k2112k0969Q013m298n67N45
17558e8219R109M854r762N401j2567M861J7750L5572K0036k74j3471j1978O840
17545a848Q824J4614j5015n983N887J0928Q85j5809m265l4364J4385K3820j3952
17532a1893j0299k5338O452P992K1008J73R909j0688j2716k4752J1863J6793J1735
17519i761L111k3042k678j824j7680J4566K5082p333R302K802m2464k6185j307
$$ plain form
17506 -77411 -46834 -26432 -50796 -73412 -38313 -31912 -22545 -10237 -23355 -35278 -63928 -49853
17494 -49853 -59897 -65434 -80611 -82557 -99519 -107874 -91642 -70934 -61082 -70878 -78850 -72857 -86238
17481 -86238 -83792 -58252 -42716 -31179 -38148 -38655 -40517 -37920 -39357 -50824 -34511 6918 -3162
17468 -3162 9749 -4995 -34758 -49581 -20970 -7335 -18187 -37761 -46744 -62731 -81081 -95624
17456 -95624 -74144 -53969 -63843 -49598 -28476 -7033 -28026 -22424 9318 19393 8653 -6005
17444 -6005 2166 31143 34515 16903 23452 35305 19878 -3212 -4653 -12797 -38662 -32820 -19205
17431 -19205 21845 26022 5843 12585 16787 -7325 -30562 -45730 -38521 -29991 -14231 -14221 -25849
17418 -25849 -11288 -1650 -11989 -44233 -47520 -45149 -41435 -37004 -60655 -83224 -60509 -55302 -60068
$$ packed form
17506g7411L0577K0402k4364k2616L5099O401R367J2308j3118j1923k8650J4075
17494d9853j0044n537j5177j946j6962q355J6232K0708R852r796p972N993j3381
17481h6238K446K5540J5536J1537o969n07j862K597j437j1467J6313M1429j0080
17468c162J2911j4744k9763j4823K8611J3635j0852j9574q983j5987j8350j4543
17456i5624K1480K0175r874J4245K1122K1443k0993N602L1742J0075j0740j4658
17444f005Q171K8977L372j7612O549J1853j5427k3090j441q144k5865N842J3615
17431a9205M1050M177k0179O742M202k4112k3237j5168P209Q530J5760J0j1628
17418b5849J4561R638j0339l2244l287K371L714M431k3651k2569K2715N207m766
$$ plain form
17405 -60068 -54702 -38864 -51263 -51028 -35166 -51536 -41592 -5306 6286 2242 -28856 -41524 -34517
17392 -34517 -18033 -62637 -72024 -47913 -43840 -35134 -17962 -25603 -18878 4778 3821 -6742 -18741
17379 -18741 -12704 -46058 -40868 -67465 -64608 -57200 -43564 -33165 -30724 -34317 -12412 -33641 -26304
17366 -26304 -45925 -35348 -12137 -18281 -28399 -31242 -29743 -35184 -31288 -43401 -51412 -30478 -25255
17353 -25255 -33134 -43371 -46947 -40332 -49650 -66576 -102769 -86736 -56819 -37976 -48128 -70589
17341 -70589 -60294 -59580 -43060 -42448 -45764 -41304 -55288 -70722 -72054 -75478 -82612 -66898 -42615
17328 -42615 -19915 11265 -2916 -3756 -1093 -7072 -9941 -10277 -24119 -23137 -22249 -22849 -19979 10329
17314 10329 16957 14572 1080 -26219 -48480 -54164 -43477 -36474 -27606 -21591 -38488 -60829 -41655
$$ packed form
17405f0068N366J5838j2399K35J5862j6370R944L6286J1592m044l1098j2668P007
17392c4517J6484m4604r387K4111M073Q706J7172p641O725K3656r57j0563j1999
17379a8741O037l3354N190k6597K857P408J3636J0399K441l593K1905k1229P337
17366b6304j9621J0577K3211o144j0118k843J499n441L896j2113q011K0934N223
17353b5255p879j0237l576O615r318j6926l6193J6033K9917J8843j0152k2461
17341g0589J0295P14J6520O12l316M460j3984j5434j332l424p134J5714K4283
17328d2615K2700L1180j4181q40K663n979k869l36j3842R82Q88o00K870L0308
17314A0329O628k385j3492k7299k2261n684J0687P003Q868O015j6897k2341J9174
$$ plain form
17301 -41655 -8294 -16989 -20333 -42803 -50827 -33594 -25853 -62471 -77583 -45357 -26355 -10012
17289 -10012 -46364 -74643 -81602 -62203 -35853 12088 8703 18824 11650 -34118 -56495 -58791
17277 -58791 -49990 -52024 -35996 -26459 -24919 -47157 -40989 -47200 -53680 -36946 -49774 -79188 -75861
17264 -75861 -59470 -69600 -54912 -22548 -52282 -82801 -81027 -78702 -67792 -50673 -68987 -59902
17252 -59902 -48345 -30831 -27970 -24859 -27135 -24814 -16372 -47120 -88105 -125983 -122911 -85881 -59745
17239 -59745 -48570 -18029 -3895 -28825 -13280 923 -16773 -9822 -24092 -35363 -54768 -41057
17227 -41057 -21552 -43346 -72584 -91333 -85672 -89636 -76438 -35862 -49227 -54078 -34868 -47459
17215 -47459 -51335 -32807 -53911 -54912 -26937 -11307 6798 -2362 -28104 -41593 -54172 -49724
$$ packed form
17301d1655L3361q695l344k2470q024J7233P741l6618j5112L2226J9002J6343
17289a0012l6352k8279o959J9399K6350M7941l385J0121p174m5768k2377k296
17277e8791Q801k034J6028R537J540k2238O168o211o480J6734j2828k9414L327
17264g5861J6391j0130J4688L2364k9734l0519J774K325J0910J7119j8314R085
17252e9902J1557J7514K861L111k276K321Q442l0748m0985l7878L072L7030K6136
17239e9745J1175L0541J4134k4930J5545J4203j7696O951j4270j1271j9405J3711
17227d1057J9505k1794k9238j8749N661l964J3198M0576j3365m851J9210j2591
17215d7459l876J8528k1104j001K7975J5630J8105r160k5742j3489j2579M448
$$ plain form
17203 -49724 -30925 -37120 -44649 -15252 -15975 -20309 -12284 -21581 -24865 -30460 -45311 -40055 -46576 -43522
17189 -43522 -49881 -51672 -62031 -65610 -83804 -80560 -75296 -70620 -51518 -55919 -44293 -43531 -70703
17176 -70703 -74169 -64438 -54644 -31409 -28535 5365 15436 -17934 -19216 -15171 -15421 -3314 -1997
17163 -1997 -10157 96 -4916 -31266 -28146 -3661 -19104 -17464 -17299 -3158 -11973 -51231 -55144
17150 -55144 -55653 -34405 -20425 -13925 -6769 -5249 -11820 -30799 -24548 -25953 -57159 -73347 -45916
17137 -45916 -13838 -13712 -8596 -111 9576 -2524 381 -2172 -3694 2016 5427 16799 10072 -25024
17123 -25024 -28161 -36388 -28339 -30167 -39437 -46312 -46779 -39472 -28529 -5997 7538 -27998 -41651
17110 -41651 -48955 -38216 -8619 -14588 -40041 -76284 -46698 -38225 -52589 -38398 -41055 -48607 -57423
$$ packed form
17203d9724J8799o195p529K9397p23m334Q025r297l284n595j4851N256o521L054
17189d3522o359j791j0359l579j8194L244N264M676J9102m401J1626P62k7172
17176g0703l466R731R794K3235K874L3900J0071l3370j282M045k50J2107J317
17163a997q160J0253n012k6350L120K4485j5443J640J65J4141q815l9258l913
17150e5144n09K1248J3980O500P156J520o571j8979O251j405l1206j6188K7431
17137d5916L2078J26N116Q485R687j2100K905k553j522N710L411J1372o727l5096
17123b5024l137q227Q049j828r270o875m67P307J0943K2532J3535l5536j3653
17110d1651p304J0739K9597n969k5453l6243K9586Q473j4364J4191k657p552q816
$$ plain form
17097 -57423 -60520 -63902 -55094 -82398 -88478 -66900 -54370 -61598 -31672 -22769 -40344 -54032 -57678
17084 -57678 -5733 5165 11191 27647 -304 -42761 -45118 -56210 -57311 -18243 6507 17866
17072 17866 20621 8875 -13223 -4866 1863 -45188 -76732 -77717 -42893 -43912 -34578 -25444 -24839 -22649
17058 -22649 -10919 -20001 -790 8779 10802 29615 23596 -8572 -17416 -16068 -22930 -7678 19841
17045 19841 6892 -1679 30224 22812 41563 91327 101575 127683 166851 176495 186785 200975
17033 200975 246339 250691 221061 182895 173104 152939 129304 103855 91988 75947 45214 29466
17021 29466 24681 27029 19452 -3223 -32509 -66463 -40247 -8986 -4018 -27611 -66700 -61333 -73382
17008 -73382 -82853 -85950 -59217 -46167 -43124 -43467 -9150 8200 -12802 -30715 -45298 -59214 -62650
$$ packed form
17097e7423l097l382Q808k7304o080K1578J2530p228K9926Q903j7575j3688l646
17084e7678N1945J0898O026J6456k7951m2457k357j1092j101L9068K4750J1359
17072A7866K755j1746k2098Q357O729m7051l1544r85L4824j019R334R134O05K190
17058b2649J1730r082J9211R569K023J8813o019l2168q844J348o862J5252K7519
17045A9841j2949q571L1903p412J8751M9764J0248K6108L9168R644J0290J4190
17033B00975M5364M352k9630l8166r791k0165k3635k5449j1867j6041l0733j5748
17021B9466m785K348p577k2675k9286l3954K6216L1261M968k3593l9089N367j2049
17008g3382r471l097K6733J3050L043l43L4317J7350k1002j7913j4583j3916l436
$$ plain form
16995 -62650 -58009 -65116 -41780 -25120 -35445 -48721 -74829 -58354 -23336 -28210 -36863 -45537 -63923
16982 -63923 -50453 -44243 -90161 -110227 -93824 -95663 -102776 -99361 -91402 -69572 -49794 -23877 -39882
16969 -39882 -50165 -42051 -38071 -50788 -83922 -76508 -51104 -58535 -79581 -56699 -18641 -39159
16957 -39159 -37781 -22301 -20319 -7416 12669 16375 -11158 -2575 9577 8370 5923 -9971 -33386
16944 -33386 -61469 -78060 -79117 -51558 -37732 -40205 -43755 -72911 -76223 -58354 -42460 -52413 -44290
16931 -44290 -60887 -47656 -4411 9563 -12991 -11351 -26996 -46786 -41293 -32750 -41886 -56969
16919 -56969 -54281 -37301 -13731 -12053 -36862 -54071 -60151 -46034 -28578 -1757 -18164 -64375
16907 -64375 -70962 -16539 -820 -7985 -52375 -72712 -66810 -63617 -68011 -71781 -59353 -44707 -59976
$$ packed form
16995f2650M641p107K3336J6660j0325j3276k6108J6475L5018m874q653q674j8386
16982f3923J3470O210m5918k0066J6403j839p113L415P959K1830J9778K5917j6005
16969c9882j0283Q114L980j2717l3134P414K5404p431k1046K2882L8058k0518
16957c9159J378J5480J982J2903K0085L706k7533Q583J2152j207k447j5894k3415
16944c3386k8083j6591j057K7559J3826k473l550k9156l312J7869J5894r953Q123
16931d4290j6597J3231M3245J3974k2554J640j5645j9790N493Q543r136j5083
16919e6969K688J6980K3570J678k4809j7209o080J4117J7456K6821j6407m6211
16907f4375o587N4423J5719p165m4390k0337N902L193m394l770J2428J4646j5269
$$ plain form
16894 -59976 -51173 -19482 -21369 -20557 -30677 -40693 -17517 -17554 -36750 -36728 -31426 -38120 -51150 -45802
16880 -45802 -34160 -34731 -42724 -35691 -36620 -25401 -14926 -25966 -28265 -21750 -39665 -44062 -70143
16867 -70143 -71582 -69028 -71648 -83563 -86664 -39724 -48126 -62858 -73239 -85559 -83890 -63589 -41000
16854 -41000 -30164 -38592 -43681 -32219 -40657 -14028 -25659 -42491 -63675 -47819 -23133 -35044
16842 -35044 -43323 -58303 -58550 -39001 -21479 -15350 -33062 -39071 -26469 -29930 -48606 -47984 -34666
16829 -34666 -52532 -55159 -58253 -4660 14484 582 -41399 -57306 -44049 -23493 -597 -14118
16817 -14118 -5793 -22754 -58021 -45623 -1178 19639 22027 13373 571 4521 -15042 -42580
16805 -42580 -20180 -17655 -18788 -14801 -36347 -44576 -32946 -72247 -83572 -44379 -14446 -7583 -1438
$$ packed form
16894e9976Q803L1691j887Q12j0120j0016K3176l7j9196K2N302o694j3030N348
16880d5802J1642n71p993P033r29J1219J0475j1040k299O515j7915m397k6081
16867g0143j439K554k620j1915l101M6940q402j4732j0381j2320J669K0301K2589
16854d1000J0836q428n089J1462q438K6629j1631j6832k1184J5856K4686j1911
16842c5044q279j4980k47J9549J7522O129j7712o009J2602l461j8676O22J3318
16829c4666j7866k627l094N3593J9144j3902m1981j5907J3257K0556K2896j3521
16817a4118Q325j6961l5267J2398M4445K0817K388q654j2802L950j9563k7538
16805d2580K2400K525j133L987k1546q229J1630l9301j1325L9193K9933O863O145
$$ plain form
16792 -1438 17784 811 -32780 -29432 -42649 -55255 -42818 1123 -9063 -21550 -32498 -59068
16780 -59068 -57109 -50138 -27825 -31002 -31271 -15079 -13325 -3574 4978 14017 -9770 -25903 -36505
16767 -36505 -48003 -65940 -55299 -13639 -2100 -15931 -27539 -26593 -40690 -32200 -14202 1311
16755 1311 -4829 -5883 -24484 -45487 -62013 -65818 -79594 -64848 -31682 -30377 -18352 -6445 -19090
16742 -19090 -31047 -37106 -17853 -31502 -49523 -55575 -42515 -31047 -6409 -505 -42069 -65361
16730 -65361 -50981 -44983 -48915 -34975 -11881 -16893 -28157 -42296 -37632 -42091 -60094 -59236 -36741
16717 -36741 -40758 -23201 -26516 -18126 -12537 -37819 -37981 -50614 -52519 -49898 -44468 -44131 -44054 -18654
16703 -18654 -18881 -7894 5728 9986 -771 -35330 -29091 -23003 -29002 -20019 -23795 -57358 -47747
$$ packed form
16792a438J9222j6973l3591L348j3217j2606J2437M3941j0186j2487j0948k6570
16780e9068J959O971K2313l177k69J6192J754R751Q552R039k3787j6133j0602
16767c6505j1498j7937J0641M1660J1539j3831j1608R46j4097Q490J7998J5513
16755A311o140j054j8601k1003j6526l805j3776J4746L3166J305J2025J1907j2645
16742a9090j1957o059J9253j3649j8021o052J3060J1468K4638N904m1564k3292
16730f5361J4380N998l932J3940K3094n012j1264j4139M664m459j8003Q58K2495
16717c6741m017J7557l315Q390N589k5282j62j2633j905K621N430L37P7K5400
16703a8654k27J0987J3622M258j0757l4559O239O088n999Q983l776l3563R611
$$ plain form
16690 -47747 -34609 -17338 -5679 17227 17079 -19158 -6853 18582 9985 -9583 10733 8253
16678 8253 -37221 -34982 -30116 -47911 -27669 -30073 -9957 3302 6304 -9096 -29844 -54634 -60368
16665 -60368 -45139 -56064 -46349 -21156 -53966 -63828 -49823 -30077 -7370 -16970 -21094 -31933
16653 -31933 -40199 -51316 -29687 -14283 -15454 -18587 -33608 -24119 -7689 -29015 -59476 -69852
16641 -69852 -55676 -53006 -71488 -63648 -44559 -10479 6462 -2735 -4045 -8524 -8981 -40056 -43852
16628 -43852 -14311 -8138 -12963 -31154 -24006 -29429 -45320 -40328 -19651 -19015 -37691 -56054 -51628
16615 -51628 -38841 -33530 -8010 6172 16636 35159 9217 5099 -5165 -11495 -15392 -15198 -35864
16602 -35864 -50114 -49500 -22743 -7243 -3037 4795 2861 2966 -5756 -27701 -48472 -59394 -78100
$$ packed form
16690d7747J3138J7271J1659K2906j48l6237J2305K5435q597j9568K0316k480
16678H253m5474K239M866j7795K0242k404K0116J3259L002j5400k0748k4790n734
16665f0368J5229j0925R715K5193l2810r862J4005J9746K2707r600m124j0839
16653c1933q266j1117K1629J5404j171l133j5021R489J6430k1326l0461j0376
16641f9852J4176K670j8482P840J9089L4080J6941r197j310m479m57l1075l796
16628d3852K9541O173m825j8191P148n423j5891M992K0677O36j8676j8363M426
16615e1628J2787N311K5520J4182J0464J8523k5942m118j0264o330l897J94k0666
16602c5864j4250O14K6757J5500M206P832j934J05q722k1945k0771j0922j8706
$$ plain form
16589 -78100 -101287 -100454 -76971 -40715 -3229 -6137 9785 27484 22183 5950 -7768 -8544 -20241
16576 -20241 -27492 -45150 -36533 -40225 -38210 -54273 -74354 -57217 -25324 6273 -6504 -15827 -21202
16563 -21202 -23878 -19665 -4811 -5616 3205 -7781 -27533 -41388 -53928 -46921 -39891 -39217 -20191
16550 -20191 -7558 -34639 -49507 -38855 -26396 1423 12814 -2562 -17541 -19308 -18670 -24412
16538 -24412 -10848 -18838 -64158 -51584 -14979 -19683 -28300 -35353 -42712 -31949 -43308 -36446 -21889
16525 -21889 -39029 -55543 -43257 -29725 -36322 -63274 -58566 -47936 -37202 -45464 -35997 -60114
16513 -60114 -64955 -34863 -10023 1876 -30934 -40372 -40908 -20512 -45877 -45568 -38572 -25545 -27200
16500 -27200 -10745 -2104 -30851 -33226 -18555 -12303 -19204 -43950 -32987 -32776 -24348 -36092 -44425
$$ packed form
16589g8100k3187Q33K3483L6256L7486k908J5922J7699n301j6233j3718p76j1697
16576b0241p251j7658Q617l692K015j6063k0081J7137L1893L1597j2777r323n375
16563b1202k676M213J4854q05Q821j0986j9752j3855j2540P007P030O74J9026
16550b0191J2633k7081j4868J0652J2459K7819J1391j5376j4979j767O38n742
16538b4412J3564p990m5320J2574L6605m704q617p053p359J0763j1359O862J4557
16525b1889j7140j6514J2286J3532o597k6952M708J0630J0734q262R467k4117
16513f0114m841L0092K4840J1899l2810r438n36K0396k5365L09O996J3027j655
16500b7200J6455Q641k8747k375J4671O252o901k4746J0963K11Q428j1744q333
$$ plain form
16487 -44425 -77493 -77548 -73739 -31547 -17690 -43177 -39458 -44775 -42971 -41003 -36730 -26975 -38295 -46258
16473 -46258 -35404 -16984 4316 23101 15111 4869 -8839 -29585 -31383 -46281 -54365 -50582
16461 -50582 -60026 -83295 -90388 -72785 -56072 -54942 -42619 -38189 -28561 -23989 -21037 -36969 -48855
16448 -48855 -57081 -52941 -44873 -37801 -31655 -38386 -34440 -28969 -22277 -25895 -17960 -37704 -54803 -78221
16434 -78221 -62905 -26266 -31874 -46151 -74942 -75346 -45340 -19443 -20541 -19636 -42369 -47900 -43202
16421 -43202 -21568 -27751 -23134 -18873 8578 -3455 -28336 -26144 -36687 -55781 -40988 -39046 -24052
16408 -24052 -37877 -31811 -2747 -20614 -29419 -32209 -53904 -39585 -63741 -74220 -60573 -24052
16396 -24052 33354 51371 47455 22753 1797 -2577 -4950 -21856 -44043 -17953 -11560 3552
$$ packed form
16487d4425l3068n5L809M2192J3857k5487L719n317J804J968M273R755j1320p963
16473d6258J0854J8420K1300J8785p990j0242j3708k0746j798j4898q084L783
16461e0582r444k3269p093J7603J6713J130J2323M430R628M572K952j5932j1886
16448d8855q226M140Q068P072O146o731L946N471O692l618P935j9744j7099k3418
16434g8221J5316L6639n608j4277k8791m04L0006K5897j098R05k2733n531M698
16421d3202K1634o183M617M261K7451j2033k4881K192j0543j9094J4793J942J4994
16408b4052j3825O066K9064j7867q805k790k1695J4319k4156j0479J3647L6521
16396b4052N7406J8017l916k4702k0956m374k373j6906k2187K6090O393J5112
$$ plain form
16384 3552 4602 29695 46516 20714 10562 4998 -3729 -6124 -15797 -32659 -21875 -11569 -3788
16371 -3788 -21889 -26032 -58892 -47515 -18899 -3637 -19258 -13350 -3123 10223 -22300 -39460
16359 -39460 -33216 -493 -9797 -43555 -39447 -45591 -44339 -39047 -14791 -1189 -14270 -23798 -16798
16346 -16798 -3813 -15515 -24240 -10699 8267 15865 17527 -8338 -26192 -19326 -29166 -13006 -12519
16333 -12519 -10325 -9237 -24192 -35505 -27474 -3822 -3630 3094 3325 4014 16474 18603 -8529 -18341
16319 -18341 3048 -7798 -29536 -35603 -44662 -45450 -24848 -23221 -17629 -35082 -41162 -37346 -16345
16306 -16345 -23292 -48771 -47268 -54282 -41719 -11369 11536 19093 11227 14460 5478 -16330 -19129
$$ packed form
16384C552J050K5093J6821k5802j0152n564q727k395r673j6862J0784J0306P781
16371c788j8101m143l2860J1377K8616J5262j5621N908J0227J3346l2523j7160
16359c9460O244L2723r304l3758M108o144J252N292K4256J3602j3081r528P000
16346a6798J2985j1702q725J3541J8966P598J662k5865j7854O866r840J6160M87
16333a2519K194J088j4955j1313Q031K3652J92O724K31O89J2460K129k7132r812
16319a8341K1389j0846k1738o067r059p88K0602J627N592j7453o080L816K1001
16306a6345o947k5479J503p014J2563L0350K2905P557p866L233q982k1808k799
$$ [...]
##END NTUPLES=NMR SPECTRUM
##END=
