##TITLE=Analysis number 308022
Compound Code cc 17409
Book Reference 436/22
Project Code adrs
Chemist Name williamk
##JCAMPDX= 6.0         $$ Bruker NMR JCAMP-DX V2.0
##DATA TYPE= NMR SPECTRUM
##DATA CLASS= NTUPLES
##ORIGIN= Bruker BioSpin GmbH
##OWNER= NMR
$$ XWIN-NMR		Version 3.5
$$ Thu May 19 09:12:55 2005 GMT Daylight Time (UT+1h)  MAYBRIDGE\NMR@NMR_250MHZ
##.OBSERVE FREQUENCY= 250.131544655141
##.OBSERVE NUCLEUS= ^1H
##.ACQUISITION MODE= SIMULTANEOUS (DQD)
##.ACQUISITION SCHEME= undefined
##.AVERAGES= 16
##.DIGITISER RES= 18
##SPECTROMETER/DATA SYSTEM= dpx250
##.PULSE SEQUENCE= zg30
##.SOLVENT NAME= CDCl3
##.SHIFT REFERENCE= (INTERNAL, CDCl3, 0, 16.4495)
##AUDIT TRAIL= $$ (NUMBER, WHEN, WHO, WHERE, WHAT)
$$ ##TITLE= Audit trail, XWIN-NMR		Version 3.5
$$ ##JCAMPDX= 5.01
$$ ##ORIGIN= Bruker BioSpin GmbH
$$ ##OWNER= NMR
$$ C:\u/data/dgb/nmr/ADRS/3170/pdata/1/auditp.txt
$$ ##AUDIT TRAIL=  $$ (NUMBER, WHEN, WHO, WHERE, WHAT)
(   1,<2005-05-19 09:12:34.92 +100>,<MAYBRIDGE\NMR>,<NMR_250MHZ>,
      <created by zg, POWCHK disabled, PULCHK disabled
       configuration hash MD5:
       62 19 C7 07 E1 42 D1 B7 37 6C 3D D0 77 39 F9 E6
       data hash MD5: 64K
       B7 02 41 1A 90 46 E5 02 BA 2C 57 D6 E1 A8 04 13>)
(   2,<2005-05-19 09:12:46.76 +100>,<MAYBRIDGE\NMR>,<NMR_250MHZ>,
      <Start of raw data processing
       ef LB = 0.3 FT_mod = 6 PKNL = 1 SI = 32K 
       data hash MD5: 32K
       EE 6D E8 49 D7 25 F2 AD ED E4 CA 60 15 DE 39 E9>)
(   3,<2005-05-19 09:12:48.42 +100>,<MAYBRIDGE\NMR>,<NMR_250MHZ>,
      <apk 
       data hash MD5: 32K
       89 AF AC 69 4E 5E ED 1D E2 E3 8E D7 93 76 E1 BA>)
(   4,<2005-05-19 09:12:49.09 +100>,<MAYBRIDGE\NMR>,<NMR_250MHZ>,
      <abs ABSG = 5 
       data hash MD5: 32K
       8A 9B 6C DE 55 A7 88 76 C5 74 EE 8E 37 C4 18 F4>)
$$ ##END=
$$ 
$$ hash MD5
$$ 4C 51 16 EE B5 DF 26 43 B9 A4 DE CF F1 E4 05 BA
##$RELAX= 
##$RELAX= 
##$RELAX= 
##$RELAX= 
##$RELAX= 
##$RELAX= 
##$RELAX= 
$$ Bruker specific parameters
$$ --------------------------
##$DU= <C:\u>
##$EXPNO= 3170
##$NAME= <ADRS>
##$PROCNO= 1
##$TYPE= <nmr>
##$USER= <dgb>
##$AMP= (0..31)
100 100 100 100 100 100 100 100 100 100 100 100 100 100 100 100 100 100 
100 100 100 100 100 100 100 100 100 100 100 100 100 100 
##$AQSEQ= 0
##$AQ_mod= 3
##$AUNM= <au_zg>
##$AUTOPOS= <12 >
##$BF1= 250.13
##$BF2= 250.13
##$BF3= 250.13
##$BF4= 250.13
##$BF5= 500.13
##$BF6= 500.13
##$BF7= 500.13
##$BF8= 500.13
##$BYTORDA= 1
##$CFDGTYP= 0
##$CFRGTYP= 5
##$CHEMSTR= <none>
##$CNST= (0..31)
1 1 145 1 1 1 1 1 1 1 1 1 1 1 1 1 1 1 1 1 1 1 1 1 1 1 1 1 1 1 1 1 
##$CPDPRG= <>
##$CPDPRG1= <>
##$CPDPRG2= <>
##$CPDPRG3= <>
##$CPDPRG4= <mlev>
##$CPDPRG5= <mlev>
##$CPDPRG6= <mlev>
##$CPDPRG7= <mlev>
##$CPDPRG8= <mlev>
##$CPDPRGB= <>
##$CPDPRGT= <>
##$D= (0..31)
0 1 0 0 0 0 0 0 0 0.06 0 0 0 0 0 0 0.0002 0 0 0 0 0 0 0 0 0 0 0 0 0 0 
0 
##$DATE= 1116490353
##$DBL= (0..7)
120 120 120 120 120 120 120 120 
##$DBP= (0..7)
150 150 150 150 150 150 150 150 
##$DBP07= 0
##$DBPNAM0= <>
##$DBPNAM1= <>
$$ [...]
##$SUBNAM7= <"">
##$SUBNAM8= <"">
##$SUBNAM9= <"">
##$SW= 20.6930455092707
##$SWIBOX= (0..15)
0 0 3 0 0 0 0 0 0 0 0 0 0 0 0 0 
##$SW_h= 5175.983436853
##$TD= 65536
##$TD0= 1
##$TE= 295.16
##$TE2= 300
##$TE3= 300
##$TEG= 300
##$TL= (0..7)
0 120 120 120 120 120 120 120 
##$TP= (0..7)
150 150 150 150 150 150 150 150 
##$TP07= 0
##$TPNAME0= <>
##$TPNAME1= <>
##$TPNAME2= <>
##$TPNAME3= <>
##$TPNAME4= <>
##$TPNAME5= <>
##$TPNAME6= <>
##$TPNAME7= <>
##$TPOAL= (0..7)
0.5 0.5 0.5 0.5 0.5 0.5 0.5 0.5 
##$TPOFFS= (0..7)
0 0 0 0 0 0 0 0 
##$TUNHIN= 0
##$TUNHOUT= 0
##$TUNXOUT= 0
##$USERA1= <user>
##$USERA2= <user>
##$USERA3= <user>
##$USERA4= <user>
##$USERA5= <user>
##$V9= 5
##$VALIST= <valist>
##$VCLIST= <CCCCCCCCCCCCCCC>
##$VD= 0
##$VDLIST= <DDDDDDDDDDDDDDD>
##$VPLIST= <PPPPPPPPPPPPPPP>
##$VTLIST= <TTTTTTTTTTTTTTT>
##$WBST= 1024
##$WBSW= 4
##$XGAIN= (0..3)
0 0 0 0 
##$XL= 0
##$YL= 0
##$YMAX_a= 319217
##$YMIN_a= -403892
##$ZGOPTNS= <>
##$ZL1= 120
##$ZL2= 120
##$ZL3= 120
##$ZL4= 120
##$ABSF1= 16.4495
##$ABSF2= -4.243673
##$ABSG= 5
##$ABSL= 3
##$ALPHA= 0
##$AQORDER= 0
##$ASSFAC= 0
##$ASSFACI= 0
##$ASSFACX= 0
##$ASSWID= 0
##$AUNMP= <proc_1d>
##$AZFE= 0.1
##$AZFW= 0.1
##$BCFW= 0
##$BC_mod= 0
##$BYTORDP= 0
##$COROFFS= 0
##$CY= 12.5
##$DATMOD= 1
##$DC= 0
##$DFILT= <>
##$DTYPP= 0
##$F1P= 14.0000005364418
##$F2P= -0.99999901652339
##$FCOR= 0.5
##$FTSIZE= 32768
##$FT_mod= 6
##$GAMMA= 0
##$GB= 0
##$INTBC= 1
##$INTSCL= 1
##$ISEN= 128
##$LB= 0.3
##$LEV0= 0
##$LPBIN= 0
##$MAXI= 10000
##$MC2= 0
##$MEAN= 0
##$ME_mod= 0
##$MI= 0
##$NCOEF= 0
##$NC_proc= -5
##$NLEV= 6
##$NOISF1= 0
##$NOISF2= 0
##$NSP= 0
##$NTH_PI= 0
##$NZP= 0
##$OFFSET= 16.4495
##$PC= 1
##$PHC0= -76.06733
##$PHC1= 11.31559
##$PH_mod= 1
##$PKNL= yes
##$PPARMOD= 0
##$PSCAL= 4
##$PSIGN= 0
##$REVERSE= no
##$SF= 250.130018134106
##$SI= 32768
##$SIGF1= 0
##$SIGF2= 0
##$SINO= 400
##$SIOLD= 32768
##$SREGLST= <1H.CDCl3>
##$SSB= 0
##$STSI= 32768
##$STSR= 0
##$SW_p= 5175.98343685301
##$SYMM= 0
##$S_DEV= 0
##$TDeff= 65536
##$TDoff= 0
##$TI= <Analysis number 999999
Compound Code 99
Book Reference 9
Project Code 9>
##$TILT= no
##$TM1= 0
##$TM2= 0
##$TOPLEV= 0
##$USERP1= <user>
##$USERP2= <user>
##$USERP3= <user>
##$USERP4= <user>
##$USERP5= <user>
##$WDW= 1
##$XDIM= 32768
##$YMAX_p= 300836727
##$YMIN_p= -581486
$$ End of Bruker specific parameters
$$ ---------------------------------
##NTUPLES= NMR SPECTRUM
##VAR_NAME=  FREQUENCY,     SPECTRUM/REAL,   SPECTRUM/IMAG
##SYMBOL=    X,             R,               I
##VAR_TYPE=  INDEPENDENT,   DEPENDENT,       DEPENDENT
##VAR_FORM=  AFFN,          ASDF,            ASDF
##VAR_DIM=   32768,         32768,           32768
##UNITS=     HZ,            ARBITRARY UNITS, ARBITRARY UNITS
##FACTOR=    0.157963299565203, 1,           1
##FIRST=     4114.51351574615, 0,            0
##LAST=      -1061.46992110686, 0,           0
##MIN=       -1061.46992110686, -581486,     0
##MAX=       4114.51351574615, 300836727,    0
$$ Real data points
##PAGE= N=1
##DATA TABLE= (X++(R..R)), XYDATA
$$ [...]
17965B84677K5923O4275M2721O2213P273n4276j4995j85L8493n6892o2328J61707
$$ 284677 310600 374875 417596 479809 487082 432806 417811 417626 456119 399227 336899 498606
17953D98606j9203j04974o6710P3177k5447j10839O6170J03255k9549J5261J44525
$$ 498606 479403 374429 307719 380896 355449 244610 310780 414035 384486 399747 544272
17942E44272N2574p7044j27421l1103j02302r5782J4864L1868M1826j15872K0349
$$ 544272 596846 519802 392381 361278 258976 163194 178058 209926 251752 135880 156229
17931A56229J04363j6333p8272N9597N4435K0620q4399J07393J24883k14115k47156
$$ 156229 260592 244259 165987 225584 280019 300639 216240 323633 448516 234401 -12755
17920a2755m5724L5481P5074M5123l3982k2391N530J90381P5000p4381r1116n0630
$$ -12755 -58479 -22998 52076 97199 63217 40826 46356 236737 311737 237356 146240 95610
17908I5610L1834J16348k4477M4984K0306l0796j15882N8214j03826j30595l912
$$ 95610 127444 243792 219315 264299 284605 253809 137927 196141 92315 -38280 -42192
17897d2192K25860N3877o2431r727k6345p1043j17679k867K3216P6701J16607
$$ -42192 183668 237545 175114 165387 139042 67999 -49680 -52547 -29331 47370 163977
17886A63977J35990Q8852M7016j5457k51919k46415p8133K09332J26532j46618
$$ 163977 299967 388819 435835 420378 168459 -77956 -156089 53243 179775 33157
17876C3157O5545O7656J32080M017m3430l5278n8343p478r3498R9510j7522l8988
$$ 33157 98702 166358 298438 302455 259025 223747 165404 157926 64428 163938 146416 107428
17864A07428Q6788k2555J4398R1604K4902J7454L0707O1540p5066k9931m9894
$$ 107428 194216 171661 186059 277663 302565 320019 350726 412266 337200 307269 257375
17853B57375j14095j6333m1559j8864m3043O2946P8472l5772P5082J24114n2625
$$ 257375 143280 126947 85388 66524 23481 86427 164899 129127 204209 328323 275698
17842B75698r4832j41278N4719n0815L5674J23343Q6323R5495l4285N2566q4758
$$ 275698 180866 39588 94307 43492 79166 202509 288832 384327 350042 402608 317850
17831C17850r8786J37692m6526L773J07646O0139o4135n9639j5718L5683m5973
$$ 317850 219064 356756 310230 314003 421649 481788 417653 358014 342296 377979 332006
17820C32006l082N5966P408n8885j07942j8542N4060P8945m7792j38132k3095
$$ 332006 328924 384890 392298 333413 225471 206929 260989 339934 292142 154010 130915
17809A30915M3059l1980K3948N421K8327j5685l8879j0033O4923K013m6101P7448
$$ 130915 173974 141994 165942 171363 199690 184005 145126 135093 200016 202029 155928 233376
17797B33376J41514P3023j17101j23201j881l060n4523J64801J4082j06864J39125
$$ 233376 374890 447913 330812 207611 205730 202670 148147 312948 327030 220166 359291
17786C59291m9201j09846l8258P2293J69656J31116j5518l0447r9767j49069J31439
$$ 359291 310090 200244 161986 234279 403935 535051 519533 489086 389319 240250 371689
17775C71689K5997j14470O1103J00972N0356j66952j06346J8178L4738M5209J37377
$$ 371689 397686 283216 344319 445291 495647 328695 222349 240527 275265 320474 457851
17764D57851Pj9854r1399j88446j36113J52002M9771J15081Q6926j16319M6095
$$ 457851 457858 438004 346605 158159 22046 174048 223819 338900 425826 309507 355602
17753C55602R4341q3500k29201n1027L8521Q1215J03246n8391N8051j0327j23424
$$ 355602 449943 366443 137242 86215 124736 205951 309197 250806 308857 298530 175106
17742A75106k4935Q4059O6094L596m9260j2815l2178J82502N7568n0936m7362
$$ 175106 150171 234230 300324 303920 254660 241845 209667 392169 449737 398801 351439
17731C51439n4642k7333n0312N7932m469R2552M0175O611o898R0254N6570N3420
$$ 351439 296797 269464 219152 277084 272615 365167 405342 411953 405055 495309 551879 605299
17719F05299j8462k431M2752o5142j00194L3891K2202o9159l4259n6306p4678
$$ 605299 586837 584406 627158 562016 461822 495713 517915 448756 414497 358191 283513
17708B83513J8817q5923l7911J53463j051R3070K2792m6602j19162L7136J54163
$$ 283513 302330 216407 178496 331959 330908 423978 446770 400168 281006 318142 472305
17697D72305q292N6427J66396R806Q4451M0590N0488j13631M3586Q2219O8935
$$ 472305 464013 520440 686836 696642 781093 821683 872171 758540 802126 884345 953280
17686I53280J07650k6064j80905L1884K18231M1532N7104J11812j5492j19692
$$ 953280 1060930 1034866 853961 885845 1104076 1145608 1202712 1314524 1299032 1179340
17676A179340j02876j62925o1616k8981M4970q0019j50790n3594o2247J13432
$$ 1179340 1076464 913539 851923 822942 867912 787893 637103 583509 521262 634694
17666F34694J45877k5149m2918O4348L0522L2820L6370p5778p770J22889J38940
$$ 634694 780571 755422 712504 776852 807374 840194 876564 800786 793016 915905 1054845
17655A054845N5479J187m1585m8000J03645J2503N177j9036J50317K00255J49141
$$ 1054845 1110324 1111511 1069926 1021926 1125571 1138074 1143251 1124215 1274532 1474787 1623928
17644A623928k5693k5651J17170J87218O9567P0415L0289Q1545J01387O5715L5585
$$ 1623928 1598235 1572584 1689754 1876972 1946539 2016954 2047243 2128788 2230175 2295890 2331475
17633B331475j27331m4179m7651r4196n7976J28309Q3846R7578K26705Q869J04947
$$ 2331475 2204144 2159965 2112314 2018118 1960142 2088451 2172297 2269875 2496580 2505449 2610396
17622B610396J78757J90377p253m9905L8319J79277Q2775j7895j20486J49448
$$ 2610396 2789153 2979530 2972277 2922372 2960691 3139968 3222743 3204848 3084362 3233810
17612C233810O9174J53556K39349K45045M96899N79618O27776N71788O82338J009756
$$ 3233810 3302984 3456540 3695889 3940934 4437833 5017451 5645227 6217015 6899353 7909109
17602G909109J416235J780103K253433K909426L467811L536216K913409J580479
$$ 7909109 9325344 11105447 13358880 16268306 19736117 23272333 26185742 27766221
17594B7766221K26016o88988r38773j034576p78729K093J027959K512329M462270
$$ 27766221 27992237 27303249 26364476 25329900 24551171 24553264 25581223 28093552 32555822
17585C2555822P491417J1870054J7967323K5753402L3066856L6491088L3333012
$$ 32555822 40047239 51917293 69884616 95638018 128704874 165195962 198528974
17578A98528974K3361532R536144m481963j5537148k2981036k6133471k5532037
$$ 198528974 221890506 231426650 226944687 211407539 188426503 162293032 136760995
17571A36760995k1962987j6924353j1284948n872024j520862J169175J406185
$$ 136760995 114798008 97873655 86588707 80716683 79195821 80364996 81771181
17564H1771181k04745l308623o351222q402599q971895q652958p632488o187879
$$ 81771181 81566436 78257813 71906591 63503992 54532097 45879139 38246651 32058772
17556C2058772m663645l379053k464990j719956j502350j099047q05875n40908
$$ 32058772 27395127 24016074 21551084 19831128 18328778 17229731 16423856 15882948
17548A5882948k69118l2379L51211P23878R88148J580743K656164M162122N927580
$$ 15882948 15613830 15581451 15932662 16656540 17644688 19225431 21881595 26043717 31971297
17539C1971297P407033Q471796Q092513O058574L132510L44822j324310j237309
$$ 31971297 39378330 47850126 55942639 62001213 65133723 65478545 64154235 62916926
17531F2916926K96628L482862P631666J2313247J7236810K1333094K3957356K3169155
$$ 62916926 63213554 66696416 74328082 86641329 103878139 125211233 149168589 172337744
17523A72337744J7413757O685103n909419j6761967k3502673k5985993k4917036
$$ 172337744 189751501 196436604 190527185 173765218 150262545 124276552 99359516
17516I9359516k1395697j6771413j2333622q559712n840504m035855k883045j751734
$$ 99359516 77963819 61192406 48858784 40299072 34458568 30422713 27539668 25787934
17508B5787934o82111o0346K42495M1302o50571j475150k164703k472076k384375
$$ 25787934 25105823 25045477 25287972 25329274 24678703 23203553 21038850 18566774 16182399
17499A6182399k324000j934094j613624j383766j064467r91225r04034o71148
$$ 16182399 13858399 11924305 10310681 8926915 7862448 6871223 5967189 5296041
17491E296041n49467l94620k68248l15413l10815k59435k62006k9843P4836l4199
$$ 5296041 4746574 4351954 4083706 3768293 3457478 3198043 2936037 2906194 2981030 2946831
17481B946831k71982k53406j66201k19012k09398J4581M1670L7477J14375Q5090
$$ 2946831 2674849 2421443 2255242 2036230 1826832 1841413 1883083 1920560 2034935 2120025
17471B120025Q6338K6800M84o5154q4855j85339k05985j40277j63842r4721J8113
$$ 2120025 2206363 2233163 2233647 2168493 2083638 1898299 1692314 1552037 1388195 1293474 1311587
17460A311587O0224o6351j50562M3714K3514o3813P2193r1032k524O76j20597
$$ 1311587 1371811 1305460 1154898 1198612 1222126 1158313 1230506 1139474 1136950 1137626 1017029
17449A017029l757j04753n6934J22147J77118J62779L59073L71190J02500j40729
$$ 1017029 1013272 908519 851585 973732 1150850 1313629 1672702 2043892 2146392 2005663
17439B005663k47181j91972j86328k33670j35220n9094q535j7688q9260o7775
$$ 2005663 1758482 1566510 1380182 1146512 1011292 952198 943663 925975 836715 768940
17429G68940o5502j6245r0153R218K0803m7805J5026j15880J7258J5909r9625
$$ 768940 703438 687193 597040 606258 627061 579256 594282 478402 495660 511569 411944
17418D11944n6361L2000J43083N1445J4701n8074j99617L845Q6040j6351j74578
$$ 411944 355583 387583 530666 582111 596812 538738 339121 342966 429006 412655 238077
17407B38077q8558J64015L6979r7274R209K4467p7261K279p2262J21598K5486
$$ 238077 149519 313534 350513 253239 262448 286915 209654 211933 139671 261269 286755
17396B86755j7249J50600j86417q9651K1244J30073n1354o1199p2289j4481J5582
$$ 286755 269506 420106 233689 144038 165282 295355 244001 182802 110513 96032 111614
17385A11614n1015j27866M3709j7221J02554J7848L991N0982P5092N2590q1871
$$ 111614 60599 -67267 -23558 -40779 61775 79623 83614 134596 209688 262278 180407
17374A80407o2014Q7648L6598j71663q3324k5363n3235r6552o2719l3024N2587
$$ 180407 118393 206041 242639 70976 -12348 -37711 -90946 -187498 -250217 -283241 -230654
17363b30654J38765N0264Q6933n0028j09027k2415R8857M7411Q2157p9051n8983
$$ -230654 -91889 -41625 45308 -4720 -113747 -136162 -37305 10106 92263 13212 -45771
17352d5771m2879j6123l4878r3538O1725J40371J2776k9856J4994M7972P8546
$$ -45771 -88650 -104773 -139651 -233189 -171464 -31093 -18317 -48173 -33179 14793 93339
17341I3339m4214Q1410N9096R124l1250p9225l0823k2924k8293k5487j32172K6988
$$ 93339 49125 130535 189631 198755 167505 88280 57457 34533 6240 -19247 -151419 -124431
17329a24431Q7523P3676O4281l4228j35362j01795M658J0823K990r673K3931l4320
$$ -124431 -36908 36768 101049 66821 -68541 -170336 -165678 -154855 -151865 -161538 -137607 -171927
17317a71927P2138O7995L5914K2701j7983j259k662N0251M6858O1770K3098j11819
$$ -171927 -99789 -31794 4120 26821 8838 7579 4917 55168 102026 163796 186894 75075
17305G5075k01181K2963l7263n6972L7653m0714j739L5226o9015J07695J76816
$$ 75075 -126106 -103143 -140406 -197378 -159725 -200439 -202178 -166952 -235967 -128272 48544
17294D8544M4224q1112l5086J30464J152j57544o4952k725q6107j04406L775J21439
$$ 48544 92768 11656 -23430 107034 108186 -49358 -114310 -117035 -203142 -307548 -303773 -182334
17282a82334J15132J5235o776n835L3354o1978j00721k1393P1576o203J3619J012
$$ -182334 -67202 -51967 -58743 -64578 -31224 -93202 -193923 -215316 -143740 -149943 -136324 -135312
17270a35312j2590M1722R8261J45153j33486j58539q7295N3770O4323l8857j7546
$$ -135312 -147902 -106180 -7919 137234 3748 -154791 -242086 -188316 -123993 -162850 -180396
17259a80396k7382O5631L1926O2788j31340m5837n5416J14774J27759M4239L1029
$$ -180396 -207778 -142147 -110221 -47433 -178773 -224610 -280026 -165252 -37493 6746 37775
17248C7775j19078j8897O6L0638k7318n4803N2532O9577L8203l683K01669l6990
$$ 37775 -81303 -100200 -100134 -69496 -96814 -151617 -99085 -29508 8695 5012 206681 169691
17236A69691j02885O8017l1497j18155K3093N8959m7000n9761J24562N1495k2276
$$ 169691 66806 134823 103326 -14829 8264 67223 20223 -39538 85024 136519 114243
17225A14243j57667p3170J5792q993l1558M8235O0044K4506N266j33915j6828
$$ 114243 -43424 -116594 -100802 -109795 -141353 -93118 -33074 -8568 -3302 -137217 -154045
17214a54045P4814n4623o0396j02174l5695N3958J40535J19020L0051j9879j61022
$$ -154045 -79231 -133854 -194250 -296424 -332119 -278161 -137626 -18606 11445 -8434 -169456
17203a69456r2304n7176K114M9039J60003q232n0678K9176J4974k6973J3540P6301
$$ -169456 -261760 -318936 -316822 -267783 -107780 -116012 -166690 -137514 -122540 -149513 -135973 -59672
17191e9672j2438L4599q5510J27125Q3719j854j21207n6141o3097K985Q4573Q4496
$$ -59672 -72110 -37511 -123021 4104 87823 85969 -35238 -91379 -154476 -151491 -66918 17578
17179A7578k7307P679j8794r347l3812r660l5170p0026j10251J19188J35091M6828
$$ 17578 -9729 -2050 -20844 -30191 -64003 -73663 -108833 -178859 -289110 -169922 -34831 11997
17167A1997r1499j0296k44J1964j3132k6904Q8768Q5243k154j4528q1224n2854
$$ 11997 -79502 -89798 -90042 -78078 -91210 -118114 -29346 55897 53743 39215 -42009 -94863
17155i4863j82543O1677P6666J10564L7410P5425k0891r6760L1609J1439n0784
$$ -94863 -277406 -215729 -139063 -28499 8911 84336 63445 -33315 -1706 9733 -41051
17144d1051j68853j55752J43312K91024q9939p4896L9854m9680j01772P9372N3694
$$ -41051 -209904 -365656 -222344 68680 -21259 -96155 -56301 -105981 -207753 -128381 -74687
17133g4687J44890Q0585r4336k6395k524j0508L0823p3465q1900J6959J33253
$$ -74687 70203 150788 56452 30057 27533 17025 47848 -25617 -107517 -90558 42695
17122D2695Q5918k721m8760k6366j0661O1812N4738j38027k0499K3413k5238p7271
$$ 42695 128613 125892 77132 50766 40105 101917 156655 18628 -1871 21542 -3696 -80967
17110h0967K4702O8776j05674j33937n8165J25618L2846j09463J02444J09972
$$ -80967 -56265 12511 -93163 -227100 -285265 -159647 -126801 -236264 -133820 -23848
17100b3848J03514J11358q943j0301l6994p6579j1766M7902J81793M4559j5145
$$ -23848 79666 191024 182081 171780 134786 58207 46441 94343 276136 320695 305550
17089C05550J0794P3227K0928M9523J57817O3044J0019P551q949j65299j78565
$$ 305550 316344 389571 410499 460022 617839 680883 690902 698453 689504 524205 345640
17078C45640k05010P0288J51093J42952K6112M9199Q616P18j27091R002j04948
$$ 345640 140630 210918 362011 504963 531075 580274 588890 589608 462517 471519 366571
17067C66571o2565l2864n2062q6523j59439L2245R8447j0645n7753K9431O549
$$ 366571 304006 271142 219080 132557 -26882 5363 103810 93165 35412 64843 71392
17056G1392n6508m9666M2852j5301L6088j17272q4240K72198L7302o3853q4382
$$ 71392 14884 -34782 8070 -7231 28857 -88415 -172655 99543 136845 72992 -11390
17045a1390J0512J01217J52178N9158M3312m5712J02748J10746l4710k4244Q1211
$$ -11390 -878 100339 252517 311675 354987 309275 412023 522769 488059 463815 545026
17034E45026Q5098K2972k5098l1058N3312n0463j2964M8288r1961j66153j13045
$$ 545026 630124 653096 627998 596940 650252 599789 586825 635113 543152 376999 263954
17023B63954j8428J08339j2756K0152J39866O4624p7242Q9174N6475K5175p493
$$ 263954 245526 353865 341109 361261 501127 565751 488509 577683 634158 659333 651840
17012F51840q6217j26850j31968j24958q5285n7545j05196J6788n201M5239J15292
$$ 651840 565623 438773 306805 181847 96562 39017 -66179 -49391 -54592 -9353 105939
17001A05939O6617p7408o2025M3176q006j12551l7486J6919q667j27913j39172
$$ 105939 172556 95148 33123 76299 68293 -44258 -81744 -64825 -73492 -201405 -340577
16990c40577J30765J55007O136N6423O3602j0469q2583j15220r6691P2442J09330
$$ -340577 -209812 -54805 -48669 7754 71356 60887 -21696 -136916 -233607 -161165 -51835
16979e1835J1878J12360R6528J9728K2162m5533k00656l8680L0320o7250j12299
$$ -51835 -39957 72403 168931 188659 210821 165288 -35368 -74048 -43728 -110978 -223277
16968b23277M49J15287L6053P7839L9617P3592L3010q5109p3186J14180j48841
$$ -223277 -222828 -107541 -71488 6351 45968 119560 152570 67461 -5725 108455 -40386
16957d0386k37280J1127J42273o7703R3889R6066N5j20480p7365K9584Q2022k5694
$$ -40386 -277666 -266539 -124266 -191969 -98080 -2014 -1959 -122439 -199804 -170220 -88198 -113892
16945a13892j20411R9460J34489m6160m5096o1861J6178p909K0824Q8566J62036
$$ -113892 -234303 -134843 -354 -46514 -91610 -153471 -137293 -145202 -124378 -35812 126224
16934A26224L1984j20170r9869l8253O8660Q1444N449p318J16505j46044q8528
$$ 126224 158208 38038 -61831 -100084 -31424 50020 55469 48151 164656 18612 -69916
16923f9916l5243o5962O3011J16090K6457o7229j3920m6951K1786q0244o3757
$$ -69916 -105159 -171121 -108110 7980 34437 -32792 -46712 -93663 -71877 -152121 -215878
16912b15878j9336J25103J19368J13789k0975l7601M736k215j09670L4478k2319
$$ -215878 -235214 -110111 9257 123046 102071 64470 69206 66991 -42679 -8201 -30520
16901c0520q2360N9051O3096r3417K1383N0559l628N590K8132l886j77979N7468
$$ -30520 -112880 -53829 9267 -84150 -62767 -12208 -15836 -10246 17886 14000 -163979 -106511
16889a06511K1490p3513n264j15064J05637N8348l584L8296k0040O0663L9508
$$ -106511 -85021 -158534 -163798 -278862 -173225 -114877 -118461 -80165 -100205 -39542 -34
16878c4k4681n4851j3104L3463J30728J30538p3117o5240l5658k3168K7705j5279
$$ -34 -24715 -79566 -92670 -59207 71521 202059 128942 63702 28044 4876 32581 17302
16866A7302q4489m8545m8261m5234R3504J27018K7193K9679L8423Q2809j15105
$$ 17302 -67187 -115732 -163993 -209227 -115723 11295 38488 68167 106590 189399 74294
16855G4294L820q7942r6507r1156k4508J15615L513k4506K9410L9460P7444J34743
$$ 74294 78114 -9828 -106335 -197491 -221999 -106384 -102871 -127377 -97967 -58507 18937 153680
16843A53680N0819j12073n2476P914K6119J19158M8232J2213R4869n2045j82226
$$ 153680 204499 92426 39950 47864 73983 193141 241373 253586 348455 296410 114184
16832A14184j18208J9918j2267o929K4708L7161n0858K94k9480k0032J4810j16889
$$ 114184 -4024 15894 3627 -3302 21406 58567 7709 8003 -21477 -41509 -26699 -143588
16820a43588n2018Q008M7124o7133J77167L9388L4830j3242r4360o7467o7555
$$ -143588 -195606 -187598 -140474 -207607 -30440 8948 43778 30536 -63824 -131291 -198846
16809a98846k9569J16345J53446m5179j0522o8700k1040M7836L4911K7293J8224
$$ -198846 -228415 -112070 41376 -3803 -14325 -83025 -104065 -56229 -21318 5975 24199
16798B4199j24614M5098P591J11092J60501K4443j76892k24884n8887L6544J0260
$$ 24199 -100415 -55317 -47726 63366 223867 248310 71418 -153466 -212353 -175809 -165549
16787a65549P2489J83919o8827j04290p5053O5063J18312l1655k9493o6213l3306
$$ -165549 -93060 90859 22032 -82258 -157311 -92248 26064 -5591 -35084 -101297 -134603
16776a34603O2504O2637p6504L1595o9636r3041L8174K7103N1744Q3320O4960
$$ -134603 -72099 -9462 -85966 -54371 -124007 -217048 -178874 -151771 -100027 -16707 48253
16765D8253n128p3901o6440o3396o1692l859M3399J13032q0566l5184J24021J07385
$$ 48253 43125 -30776 -97216 -160612 -222304 -226163 -182764 -69732 -150298 -185482 -61461 45924
16753D5924N7044N894p3056k29089o2015J05168m6359k04633j3382K5956p7969
$$ 45924 102968 108862 35806 -193283 -255298 -150130 -196489 -401122 -414504 -388548 -466517
16742d66517N9892K08493J08517k6636l2263j34148Q463P4718J3291j795j5248
$$ -466517 -406625 -198132 -89615 -116251 -148514 -282662 -274199 -199481 -186190 -187985 -203233
16731b03233k0130K321J74863Q0870m5171k6020N8557j04743N4789o2167N8798
$$ -203233 -223363 -221042 -46179 34691 -10480 -36500 22057 -82686 -27897 -90064 -31266
16720c1266q4558L561j09593J10353J866K1268R2149N0090M7233r0009k5819r6582
$$ -31266 -115824 -112263 -221856 -111503 -109637 -88369 3780 53870 101103 11094 -14725 -111307
16708a11307K4409R5285O351q4431j18304O004P6993K0123P6375M1970j62597
$$ -111307 -86898 8387 14738 -69693 -187997 -181993 -105000 -84877 -8502 33468 -129129
16697a29129O1739R7495j9059P305%j3475J0641l8971n2371n1017r5344j26456
$$ -129129 -67390 30105 11046 18351 18351 4876 15517 -23454 -75825 -126842 -222186 -348642
16685c48642k1070P9884k5799J6056J08204K470L9287J8494R0534k3650N927L5919
$$ -348642 -369712 -289828 -315627 -299571 -191367 -188897 -149610 -131116 -40582 -64232 -58305 -22386
16673b2386l2763o7464N6479m665k3659m1772k1837K738k2713J9232j4143l3764
$$ -22386 -55149 -122613 -66134 -70799 -94458 -136230 -158067 -155329 -178042 -158810 -172953 -206717
16661b06717K0245Q6269L8108m371k6000p6599j962J13045R26j3205r4171j23573
$$ -206717 -186472 -100203 -62095 -66466 -92466 -169065 -171027 -57982 -57056 -70261 -164432 -288005
16649b88005q984P4776J23754Q7227O597M476O0700k6227m5500K1805q5505j9402
$$ -288005 -296989 -222213 -98459 -11232 -4635 -159 60541 34314 -11186 10619 -74886 -94288
16637i4288l8678m6755P0411P8623P9666n4291N8128P8862l6178k5702p4432j8348
$$ -94288 -132966 -179721 -109310 -30687 48979 -5312 52816 131678 95500 69798 -4634 -22982
16625b2982Q1526K7072J5002j33719q3828L6704r816n2210L1645K06075j87j06284
$$ -22982 58544 85616 100618 -33101 -116929 -80225 -90041 -142251 -110606 95469 95282 -11002
16613a1002J7430j54891j12508l2454J25549Q2141j49338q4954L2551J01072J86708
$$ -11002 6428 -148463 -260971 -293425 -167876 -85735 -235073 -320027 -287476 -186404 304
16602C04N6087k7203r428O0039Q5335p4113o0430m2203r7902N0573O1313L8617
$$ 304 56391 29188 19760 79799 165134 91021 30591 -11612 -109514 -58941 2372 40989
16590D0989J2417Q7809j37327q8277P5037j10871n4606L4708j8755M653M7974
$$ 40989 53406 141215 3888 -84389 -9352 -120223 -174829 -140121 -158876 -154223 -106249
16579a06249R5185L0116l5013j43208n5435j6729L7274l0164J6444J11726m5972
$$ -106249 -11064 19052 -15961 -159169 -214604 -231333 -194059 -224223 -207779 -96053 -142025
16568a42025p3794j03280K5754R9701J73337L9866j8222j652M5070j14315j48784
$$ -142025 -215819 -319099 -293345 -193644 -20307 19559 1337 -315 44755 -69560 -218344
16557b18344P5825o3303K5239L0271N560l4036L0229r3124Q4757N2982k7158l9605
$$ -218344 -142519 -205822 -180583 -150312 -144752 -178788 -148559 -241683 -156926 -103944 -131102 -170707
16545a70707k588Q7275O7618l286m9479K7154L1363P6214k6027l7242O8747P2595
$$ -170707 -173295 -86020 -18402 -21688 -71167 -44013 -12650 63564 37537 295 69042 141637
16533A41637P0048J520R878K9369M0834j9717J2119r3477j25843P7058P7372K0629
$$ 141637 211685 213205 223083 252452 293286 273569 285688 192211 66368 143426 220798 241427
16521B41427r0866L5449q0458j5043J6695j30274j33807J7218J74925L6039j62640
$$ 241427 150561 186010 105552 90509 107204 -23070 -156877 -139659 35266 71305 -91335
16510i1335j04868Q7439k3566q6205O0926M7284N4090n6608k4028L9046M9107
$$ -91335 -196203 -108764 -132330 -218535 -157609 -110325 -56235 -112843 -136871 -97825 -48718
16499d8718o6333r7388K5966O7047J03201J2525k9616j1378j03424r1013o9679
$$ -48718 -115051 -212439 -186473 -119426 -16225 -3700 -33316 -44694 -148118 -239131 -308810
16488c08810J54152j1799J10678K9946m8863q1781m6151M80m7315L6018J10734
$$ -308810 -154658 -166457 -55779 -25833 -74696 -156477 -202628 -202148 -249463 -213445 -102711
16477a02711J2254Q5461Q7827j77125j08400P4771M172M5489k4309j72809q8305
$$ -102711 -90457 -4996 82831 -94294 -202694 -127923 -123751 -78262 -102571 -275380 -363685
16466c63685J20882K21861j3877j01211p624Q2280L3131j33760k06518J23188
$$ -363685 -242803 -20942 -34819 -136030 -143654 -61374 -28243 -162003 -368521 -245333
16456b45333J44969k2887k7851L494J42526J74250j33866n6004l1772P9458j9037
$$ -245333 -100364 -123251 -151102 -147608 -5082 169168 35302 -20702 -52474 26984 7947
16445G947m7144K1875j0709j844o3454N470N3231O6680J7760r6890q7218m015
$$ 7947 -39197 -17322 -28031 -29875 -93329 -87859 -34628 32052 49812 -47078 -134296 -138311
16433a38311j4005J5619L6981J80414P3j5600j02119r8592M9671J03363m0063
$$ -138311 -152316 -136697 -99716 80698 80771 65171 -36948 -135540 -85869 17494 -22569
16422b2569J6213j35130K7738L6880k2489o9849K1881J39493J53802N0779m8404
$$ -22569 -6356 -141486 -113748 -76868 -99357 -169206 -147325 -7832 145970 196749 148345
16411A48345o1744m4343m2825M9114R8761r369o6822P1927K0113r9204p6157r3135
$$ 148345 86601 42258 -567 48547 147308 137939 71117 143044 163157 63953 -12204 -105339
16399a05339O8384J34685K945n9697o6112j11414k7026O5730J30590q4347K1918
$$ -105339 -36955 97730 100675 40978 -25134 -136548 -163574 -97844 32746 -51601 -29683
16388b9683K039l0051R0975Q1715j23895n0403J07021r744K7325n904l4012j36105
$$ -29683 -27644 -57695 33280 114995 -8900 -59303 47718 37974 65299 59395 25383 -110722
16376a10722N9260R7229O1092j12309m8076J56045J80344k9674p0079r054r1137
$$ -110722 -51462 45767 106859 -5450 -53526 102519 282863 253189 183110 174056 82919
16365H2919r0121M9045L3426p8820l8555J848m6084q623l2931J4055L3759J35987
$$ 82919 -7202 41843 75269 -3551 -42106 -40258 -86342 -94965 -127896 -113841 -80082 55905
16353E5905N4049o732j65848m0475k9872k7737o5772k209J14191K0267l5868o0696
$$ 55905 109954 103222 -62626 -103101 -132973 -160710 -226482 -228691 -114500 -94233 -130101 -190797
16341a90797J05686n9142j20807j12233l0432M70K3640J39377L1408k2524J954
$$ -190797 -85111 -144253 -265060 -377293 -407725 -407255 -383615 -244238 -212830 -235354 -233400
16330b33400K8515P7848Q9196N7931j3457M4100L3424J07830P5211J09331j72904
$$ -233400 -204885 -127037 -37841 20090 6633 50733 84157 191987 267198 376529 203625
16319B03625k29453r9714M3997K8162O5268n3739j28450P337J3342n3352M6148
$$ 203625 -25828 -125542 -81545 -53383 11885 -41854 -170304 -162967 -149625 -202977 -156829
16308a56829K8973O2960J1729j1589j3577l6567j3142P2329l9234J53329K05135
$$ -156829 -127856 -64896 -53167 -64756 -78333 -114900 -128042 -55713 -94947 58382 263517
16297B63517J56853j83031j90388j0970J6715j09653N780Q7368J00664n9003r7343
$$ 263517 420370 237339 46951 35981 52696 -56957 -51177 36191 136855 77852 -19491
16286a9491Q934O5504p9880r9390Q759R6048l3176O3264K8838o5927j26383j23733
$$ -19491 -10557 54947 -24933 -124323 -115564 -19516 -52692 10572 39410 -26517 -152900 -276633
16274b76633L6730k0963J65020J70553N4098Q3912o5085k8332k3793l3293k7405
$$ -276633 -239903 -260866 -95846 74707 128805 212717 147632 119300 95507 62214 34809
16263C4809o6521L7013P8501M5051k74464l8154R2219l6033J2359J73368L8227
$$ 34809 -31712 5301 83802 128853 -145611 -183765 -91546 -127579 -115220 58148 96375
16252I6375m9152r9236j1253N2322o119j25243L2305l6719K457P9095o4195J46916
$$ 96375 47223 -52013 -63266 -10944 -17063 -142306 -110001 -146720 -144263 -65168 -129363 17553
16240A7553N6456j33123j19096p0900O7613J31144R6536k5667j02821j41994P8128
$$ 17553 74009 -59114 -178210 -249110 -181497 -50353 46183 20516 -82305 -224299 -146171
16229a46171P7483P292O8999J15129M8765L1399j11902k9979J17857j05708j43256
$$ -146171 -68688 -61396 7603 122732 171497 202896 90994 61015 178872 73164 -70092
16218g0092m0832K3857J57057J85281J10375j09520j44419j38176q3711P8077
$$ -70092 -110924 -87067 69990 255271 365646 256126 111707 -26469 -110180 -32103
16208c2103J6983p164l7884o2986R6033J3741j2935N5567p4554o9544J81104l5024
$$ -32103 -15120 -22284 -60168 -123154 -27121 -13380 -26315 29252 -45302 -114846 66258 31234
16196C1234k20569j4071J06478O5261P955l3495q1802j12367L3939J5669J16211
$$ 31234 -189335 -203406 -96928 -31667 -23712 -57207 -139009 -251376 -217437 -201768 -85557
16185h5557R6371n9923q1366J0073J33526N3401j38440r9815j27598J20517J78929
$$ -85557 10814 -49109 -130475 -120402 13124 66525 -71915 -171730 -299328 -178811 118
16174A18Q1908o2928o9515m4805m670O1522o6707o3366L5384J18602k098J2228
$$ 118 82026 19098 -50417 -95222 -99892 -38370 -105077 -168443 -133059 -14457 -16555 -4327
16162d327j18066o5473j3513J16558J22968R9192J06825j22493k12939j04810
$$ -4327 -122393 -187866 -201379 -84821 38147 137339 244164 121671 -91268 -196078
16152a96078K5556J40355K003r6141q8137l5492O7859J652j07716K7864J78163
$$ -196078 -170522 -30167 -28164 -124305 -212442 -247934 -180075 -178423 -286139 -258275 -80112
16141h0112J3763p3308J4719O4294L8440j3694P6365m1622r3413L9900k023m6688
$$ -80112 -66349 -139657 -124938 -60644 -22204 -35898 40467 -1155 -94568 -54668 -56691 -103379
16129a03379Q5884L0158j2002j58084r5030J74256J45692j3893k1533N3229j5325
$$ -103379 -17495 12663 661 -157423 -252453 -78197 67495 53602 32069 85298 69973
16118F9973j25636j82350J04599J86655M0522j90511j90831J5186J66781J11422
$$ 69973 -55663 -238013 -133414 53241 93763 -96748 -287579 -272393 -105612 5810
16108E810K1874m7325o3232L6324Q3283j3540P015l7973n8298R7761J43825J09414
$$ 5810 27684 -19641 -82873 -46549 36734 23194 30209 -7764 -66062 31699 175524 284938
16096B84938M9623j74565r2372l7635m6761j18923J5731O7463J09297N6434k140
$$ 284938 334561 159996 67624 29989 -16772 -135695 -119964 -52501 56796 113230 111090
16085A11090j2555R7508j75064p512j30938p5800J13851J83069O2291j04147l3389
$$ 111090 98535 196043 20979 13467 -117471 -193271 -79420 103649 165940 61793 28404
16074B8404p1688j05936j25211O8517K23774J7267K2221n4678p3805M1543R9284
$$ 28404 -43284 -149220 -274431 -205914 17860 35127 57348 2670 -71135 -29592 69692
16063F9692l3048q8317M8340Q8735l9174j50163q723P8743j3096j2145Q8624J25981
$$ 69692 36644 -51673 -3333 85402 46228 -103935 -112658 -33915 -47011 -59156 29468 155449
16051A55449L3140o2778j87870k8450N4720J13686p1319q6245O0981J3952m0071
$$ 155449 188589 125811 -62059 -90509 -35789 77897 6578 -79667 -18686 -4734 -44805
16040d4805j11678o3834j17945K560J43180O5681L6043j0446k6261J27320j54319
$$ -44805 -156483 -220317 -338262 -335702 -192522 -126841 -90798 -101244 -127505 -185 -154504
16029a54504l0391J45410P8809q5235k5314J57637j24021r3615J52134o727j3449
$$ -154504 -184895 -39485 39324 -45911 -71225 86412 -37609 -131224 20910 14183 734
16018G34j71891m2323J0485n7585j8426q9172n9341J04943R1314J4706j46382
$$ 734 -171157 -213480 -202995 -260580 -279006 -368178 -427519 -322576 -231262 -216556 -362938
16007c62938Q9275P1583r0247J02984J34065j0246p5097o5085L7655j472m0369
$$ -362938 -273663 -202080 -292327 -189343 -55278 -65524 -140621 -205706 -168051 -169523 -209892
15996b09892Q6304J72959J63460L6672k4619l5537j90879l0839J5983P9196q2426
$$ -209892 -123588 49371 212831 249503 224884 189347 -1532 -32371 -16388 62808 -19618
15985a9618m8439R155l7517n1524L4751J4473j31640j00540N8863M7749J79942
$$ -19618 -68057 -58902 -96419 -147943 -113192 -98719 -230359 -330899 -272036 -224287 -44345
15974d4345K1049O743q1620N8236O1284P6466L2463r1709j9817r1317Q444r107
$$ -44345 -23296 -16553 -98173 -39937 21347 97813 130276 38567 18750 -72567 -64123 -73230
15962g3230o100J28922J01053J1077o1203j51797j8632J61251j10570j00685m7739
$$ -73230 -79330 49592 150645 161722 100519 -51278 -69910 91341 -19229 -119914 -167653
15951a67653p6972j9873L3082L2746J21751l6811K7556K8503J3871r3892p8585
$$ -167653 -244625 -264498 -231416 -198670 -76919 -113730 -86174 -57671 -43800 -137692 -216277
15940b16277Q1588J43834j0992N1439j24299o0474M4609k0145l1516l1391Q0146
$$ -216277 -134689 9145 -1847 49592 -74707 -135181 -90572 -110717 -142233 -173624 -93478
15929i3478J00783L319j7331k8344j46902Q0441Q6162M341J27565P4505L7233
$$ -93478 7305 10624 -6707 -35051 -181953 -101512 -15350 -11009 116556 191061 228294
15918B28294Q1471k39363k18009p4560J31237J9925M8529j5049j07479M6761p1079
$$ 228294 309765 70402 -147607 -222167 -90930 -71005 -22476 -37525 -145004 -98243 -169322
15907a69322K7493L3450r372l2053P2345J0931P922q2618K7823J3410K2395M131
$$ -169322 -141829 -108379 -117751 -149804 -77459 -66528 -58606 -141224 -113401 -99991 -77596 -73465
15895g3465L064K5124k4532j54177N4585Q7719J23911O8492m6682o3211q2683
$$ -73465 -70401 -45277 -69809 -223986 -169401 -81682 42229 110721 64039 828 -81855
15884h1855j58356j01276J03900R5524n3220J6622N7518k8837j03338K7702R5410
$$ -81855 -240211 -341487 -237587 -142063 -195283 -178661 -121143 -149980 -253318 -225616 -130206
15873a30206r5030O1136M7585p5087K2329L6819J29892O3174p33r7483J06316
$$ -130206 -225236 -164100 -116515 -191602 -169273 -132454 -2562 60612 59879 -37604 68712
15862F8712J51019L0956j3053k01955q4528q7738r6529K0740K0288k0972R2641
$$ 68712 219731 250687 237634 35679 -48849 -136587 -233116 -212376 -192088 -213060 -120419
15851a20419J08396k2209j10108L5896M6989k3116k2659j12497l0276Q5942R9591
$$ -120419 -12023 -34232 -144340 -108444 -61455 -84571 -107230 -219727 -250003 -164061 -64470
15840f4470K1206J31035O7783j43412k1659O8972K1572l6950P204K6975K4380
$$ -64470 -43264 87771 155554 12142 -9517 59455 81027 44077 51281 78256 102636
15829A02636j49130J22159L1396n9131k6191r4923J629M1102p3367L968k7889
$$ 102636 -46494 75665 107061 47930 21739 -73184 -71555 -30453 -103820 -99852 -127741
15818a27741J13226N8104q5984j4474J52221j0928m9177k8548P19m3717m6030
$$ -127741 -14515 43589 -42395 -56869 95352 84424 35247 6699 7418 -36299 -82329
15807h2329o4773o9537N4652J65852R2374m1345Q8509p514r931j25966q9230l1448
$$ -82329 -147102 -216639 -161987 3865 96239 54894 143403 135889 125958 -8 -89238 -120686
15795a20686p05J79856R6790j06060r1674O5670N3671l2083j58460k8191P561
$$ -120686 -121391 58465 155255 49195 -42479 23191 76862 44779 -113681 -141872 -134311
15784a34311R8300K9100O8810l2023P1657j323R3162j32394P662l4464k3505o2001
$$ -134311 -36011 -6911 61899 29876 101533 100210 193372 60978 68640 34176 10671 -51330
15772e1330j0791j24959j12631J65588O8311j67982n9716J04586M0090p3229K7472
$$ -51330 -62121 -187080 -299711 -134123 -65812 -233794 -293510 -188924 -148834 -222063 -194591
15761a94591l493N8140J63605P697j83299K391O8220N4741n3397K7067L8111p1073
$$ -194591 -198084 -139944 23661 31358 -151941 -149550 -81330 -26589 -79986 -52919 -14808 -85881
15749h5881j25431k9400o6067j942J85211M4929M9487L4234j1712l9547O2854
$$ -85881 -211312 -240712 -306779 -308721 -123510 -78581 -29094 5140 -6572 -46119 16735
15738A6735J4670l1255K7640L7944p8949k8333k4895j35517j7296P0328R8793
$$ 16735 31405 150 27790 65734 -13215 -41548 -66443 -201960 -219256 -148928 -50135
15727e0135M623k9007R6080j49182j9650K3666L0040O8259J6833j18213p7939
$$ -50135 -45512 -74519 21561 -127621 -147271 -123605 -93565 -25306 -8473 -126686 -204625
15716b04625J10898K7873q8800L1282J37795k458r5812M0176J1411q7643o5886
$$ -204625 -93727 -65854 -154654 -123372 14423 11965 -83847 -43671 -32260 -119903 -185789
15705a85789J489R2511K5475l1630P9415j30166P3737J9693m2612O4382n2346
$$ -185789 -184300 -91789 -66314 -97944 -18529 -148695 -74958 -55265 -97877 -33495 -85841
15694h5841n1068J91011l3467j30218o2033o8416J26313J64148K5617P899q4758
$$ -85841 -136909 54102 20635 -109583 -171616 -240032 -113719 50429 76046 83945 -813
15683h13L7824j01800r1074K17934K3381j03567n1712O4905j12115k8305n170
$$ -813 37011 -64789 -155863 62071 85452 -18115 -69827 -4922 -117037 -145342 -150512
15672a50512o094P6170p8818j16474J3476Q4334M6603J4310n3602k5184L9058
$$ -150512 -156606 -80436 -159254 -275728 -262252 -177918 -131315 -117005 -170607 -195791 -156733
15661a56733Q040q2027J4862J12683o8063o0570J89659J83897j56824r0629m6
$$ -156733 -148693 -230720 -215858 -103175 -171238 -231808 -42149 141748 -15076 -105705 -105751
15650a05751P8361R326j8723M3671l6353N3262j88830q3613j8870L4048j196l8801
$$ -105751 -27390 -18064 -36787 6884 -29469 23793 -165037 -248650 -267520 -233472 -234668 -273469
15638b73469N0160R9003J29975r3512r9013k6961p869J23086N1507j06184m8585
$$ -273469 -223309 -124306 5669 -87843 -186856 -213817 -221686 -98600 -47093 -153277 -201862
15627b01862J28302j2759R0504O5136l9235K0626O1666j3935q0857k061j3765
$$ -201862 -73560 -86319 4185 69321 30086 50712 112378 98443 17586 15525 1760
15616A760j01478l4691J2545J43312N6543j09097r9010L6084R4363J21936L181
$$ 1760 -99718 -134409 -121864 21448 77991 -31106 -130116 -94032 331 122267 125448
15605A25448r9863O1144j8058j597J9165q1296j4724M6000M5928l3264l7376o8587
$$ 125448 25585 86729 68671 67074 86239 4943 -9781 36219 82147 48883 11507 -57080
15593e7080p8246l8047J18997K7604j87554j33833M009K7838J01152J05204M1646
$$ -57080 -135326 -173373 -54376 -26772 -214326 -348159 -344150 -316312 -215160 -109956 -68310
15582f8310j002O5309K1756R4401o1355k3924L4919k8702K8033J7287k5001p0740
$$ -68310 -69312 -4003 17753 112154 50799 26875 61794 33092 61125 78412 53411 -17329
15570a7329o2440J45031l7768k2558J06355Q40j29584m3023j08323L6976M1302
$$ -17329 -79769 65262 27494 4936 111291 112131 -17453 -60476 -168799 -131823 -90521
15559i0521k5618k7075O3890L5588j13668O5049L2953l0780Q6850J98301r9277
$$ -90521 -116139 -143214 -79324 -43736 -157404 -92355 -59402 -90182 -3332 194969 95692
15548I5692r4169j62784L6533J0592k7148J15148J33216R4703p1949p6041M8938
$$ 95692 1523 -161261 -124728 -114136 -141284 -26136 107080 201783 129834 53793 102731
15537A02731j44532K6841M7510q5455J24757M7237k5349N5208p1049o5486l5910
$$ 102731 -41801 -14960 32550 -52905 71852 119089 93740 148948 77899 12413 -23497
15526b3497k00813M3548J62554L7865R3264n4870q0985L3105K5047K1833J71506
$$ -23497 -224310 -180762 -18208 19657 112921 58051 -22934 10171 35218 57051 228557
15515B28557m4993j67397J2689l2099j67356N301j8052j8970j3234q403R5959
$$ 228557 183564 16167 28856 -3243 -170599 -165298 -183350 -202320 -215554 -223957 -127998
15504a27998J03986r9551j7108o346J8431N6585j4201n9466r8188J3333P3684
$$ -127998 -24012 -123563 -140671 -147017 -128586 -72001 -86202 -145668 -243856 -230523 -156839
15493a56839p8274j00669Q8471M8914k2993J16622O0404j5606J804k5139n8425
$$ -156839 -235113 -335782 -247311 -198397 -221390 -104768 -44364 -59970 -58166 -83305 -141730
15482a41730K0098J36565n7283m3690O7909j6623j18681N3228J16968j06293R3271
$$ -141730 -121632 14933 -42350 -86040 -18131 -34754 -153435 -100207 16761 -89532 3739
15471C739p0247n8874r0981K9253J52480L7407p9507j17617l4413P3991K4275
$$ 3739 -66508 -125382 -216363 -187110 -34630 2777 -76730 -194347 -228760 -154769 -130494
15460a30494J68978J8669k05095m7564J79009N1029k9931k0404k1814J70054L1201
$$ -130494 38484 57153 -147942 -195506 -16497 34532 4601 -15803 -37617 132437 163638
15449A63638q7247j8261O4480L083k6245n3558j35534l3653k464N0264J5272j38047
$$ 163638 76391 58130 122610 125693 99448 45890 -89644 -123297 -125761 -75497 -60225 -198272
15437a98272q675P0733n8871k6899P8031j0789l9256K4891J99323O5393j04222
$$ -198272 -206947 -136214 -195085 -221984 -143953 -154742 -193998 -169107 30216 95609 -8613
15426h613L0691J23669k9564M4181l8510j63279l9212J2017J39349K0635L2230
$$ -8613 22078 145747 116183 160364 121854 -41425 -80637 -68620 70729 91364 123594
15415A23594P9466Q6495o2158J75936P4990p7616p9750k27522j34421K4312O3407
$$ 123594 203060 289555 227397 403333 478323 400707 320957 93435 -40986 -16674 46733
15404D6733R9212o1192K414M189L6240j2850R6122M9825q6203p4799l056J1090
$$ 46733 145945 84753 87167 91356 127596 114746 210868 260693 174490 99691 96635 107725
15392A07725P0159J8434j5512l4453q3812n2578o5537j3590K0558j05324l7782
$$ 107725 177884 196318 180806 146353 62541 9963 -55574 -69164 -48606 -153930 -191712
15381a91712P3521J00698J7488l2900q9275j22640O053J77968J43120Q8594r334
$$ -191712 -118191 -17493 -5 -32905 -122180 -244820 -238767 -60799 82321 170915 161581
15370A61581K3625j3287l7821o2706J8258o4765R0136j07482j48942j7676J2836
$$ 161581 185206 171919 134098 71392 89650 24885 115021 7539 -141403 -159079 -146243
15359a46243N4923n1859J5368P380M4447K6441m1041l2250N6437J80591j8307
$$ -146243 -91320 -143179 -127811 -120431 -75984 -49543 -90584 -122834 -66397 114194 95887
15348I5887l1645q8369l748N5242R7353M4616j18126j67251k41792J24632O7299
$$ 95887 64242 -24127 -27875 27367 124720 169336 51210 -116041 -357833 -233201 -165902
15337a65902k130j0997N7079K8314q4192p5496J25729P4833q6379N9858J12849
$$ -165902 -168032 -179029 -121950 -93636 -177828 -253324 -127595 -52762 -139141 -79283 33566
15326C3566O9702j00984j43054o9789K57211O2116j05108N6666m8139m9313j18770
$$ 33566 103268 2284 -140770 -210559 46652 108768 3660 60326 12187 -37126 -155896
15315a55896j3190r2482M1898k478r7648K3014M3093R0696J24498N2755J34390
$$ -155896 -169086 -261568 -219670 -222148 -319796 -296782 -253689 -162993 -38495 14260 148650
15304A48650J2278l7203m7062n4534p8746N1825j2490L4626J9612K2754j02861
$$ 148650 160928 123725 76663 22129 -56617 -4792 -17282 17344 36956 59710 -43151
15293d3151m1030R7323J7950K5240r8321J8887J04225J5795j68355o2521j03743
$$ -43151 -84181 13142 31092 56332 -41989 -23102 81123 96918 -71437 -133958 -237701
15282b37701J19155p0117j0039Q1313K6987m7423K9170j25668q3021M0585O2424
$$ -237701 -118546 -188663 -198702 -117389 -90402 -137825 -108655 -234323 -317344 -276759 -214335
15271b14335N6076N7206K2423m0928J6458L3676O9298O1666j71323J0322P5095
$$ -214335 -158259 -101053 -78630 -119558 -103100 -69424 -126 61540 -109783 -99461 -24366
15260b4366j5113k9196r1698K3571L5390J3858J8175j9415O014q0187m964L5237
$$ -24366 -39479 -68675 -160373 -136802 -101412 -87554 -69379 -88794 -82780 -162967 -167931 -132694
15248a32694J15762P3278j1078j54557J7553m0891n3921O0578J19378N5960q0821
$$ -132694 -16932 56346 45268 -109289 -91736 -132627 -186548 -125970 -6592 49368 -31453
15237c1453j05387o6799P4537O0683L4931j55903n9456J45253Q8457N5183o4801
$$ -31453 -136840 -203639 -129102 -68419 -33488 -189391 -248847 -103594 -15137 40046 -24755
15226b4755p9874n8861J6905L1458N9704o9697j15425K5158K9448j25686k6052
$$ -24755 -104629 -163490 -146585 -115127 -55423 -125120 -240545 -215387 -185939 -311625 -337677
15215c37677J04423J26588j38926L0728L3129n3163k3623J79631J17330N6149
$$ -337677 -233254 -106666 -245592 -214864 -181735 -234898 -258521 -78890 38440 94589
15205I4589o5166o3032r4091J3584k9255k03775L9181N6077J03413O6982q4532
$$ 94589 29423 -33609 -127700 -114116 -143371 -347146 -307965 -251888 -148475 -81493 -166025
15194a66025k7948K8527j0391N646j9161J44081J48208O6638p9860n3944M7618
$$ -166025 -193973 -165446 -175837 -170191 -189352 -45271 102937 169575 89715 35771 83389
15183H3389Q0168M4644K9467k1501j17319J383M3031k1454q1199p463J0064K5968
$$ 83389 163557 208201 237668 216167 98848 100231 143262 121808 40609 33146 43210 69178
15171F9178o1653m8426k2003l267l569k2331J7675l3434K7901J38133n7520n3176
$$ 69178 7525 -40901 -62904 -66171 -69740 -92071 -74396 -107830 -79929 58204 684 -52492
15159e2492O2576L1416J2036l8009j41164j47270o7256L7724J54615o6800r9153
$$ -52492 10084 41500 53536 15527 -125637 -272907 -340163 -302439 -147824 -214624 -313777
15148c13777J29000R4126O9787Q1652p8747Q8992j1041l4223Q9257J0938q6609
$$ -313777 -184777 -90651 -20864 60788 -17959 71033 59992 25769 115026 125964 39355
15137C9355l6256M7230o9291j61369N8768P8674j2212o2541J36562l3792M5165
$$ 39355 3099 50329 -18962 -180331 -121563 -42889 -55101 -117642 18920 -14872 30293
15126C0293M6626p6116k1927m3950n8022l1213J63717k3529j15064k8089Q9180
$$ 30293 76919 803 -21124 -65074 -123096 -154309 9408 -14121 -129185 -157274 -68094
15115f8094J29881q319L7804K3379k3778j50095o8671N2310N1390k0079n5387
$$ -68094 61787 53468 91272 114651 90873 -59222 -127893 -75583 -24193 -44272 -99659
15104i9659j03659J42951n4678l3665j1714q5071Q9298R6204J86889j6611j67581
$$ -99659 -203318 -60367 -115045 -148710 -160424 -245495 -156197 -59993 126896 110285 -57296
15093e7296o4617K6555J07088J5735j58345j16011J4073L5544K7426l5424N0274
$$ -57296 -121913 -95358 11730 27465 -130880 -246891 -232818 -197274 -169848 -205272 -154998
15082a54998J4025R9574O6414L1665R4964K5253o1294l7318m7384J6334l6011
$$ -154998 -140973 -41399 25015 56680 151644 176897 115603 78285 30901 47235 11224
15071A1224M876j9522J0466N1317R3133K06687n4362r4950r9854L0619j14807
$$ 11224 16100 -3422 7044 58361 151494 358181 303819 208869 109015 139634 24827
15060B4827M2126m3251q3159J50446n2965k5632J7461O8155K7454j27027p5545
$$ 24827 66953 23702 -59457 90989 38024 12392 29853 98008 125462 -1565 -77110
15049g7110K14749O9204q1211k4192K9183m5308J17732o1356j80809j00754M394
$$ -77110 137639 206843 125632 101440 130623 85315 203047 141691 -39118 -139872 -135478
15038a35478j4164O5687J3367j7015m5821P8748j899l5136Q1480p566n4762l3777
$$ -135478 -149642 -83955 -70588 -87603 -133424 -54676 -56575 -91711 -10231 -17797 -72559 -106336
15026a06336O6194Q4471k4061o2474J06695P0255q0088L4267l6570q500n4802
$$ -106336 -40142 44329 20268 -42206 64489 134744 54656 88923 52353 43853 -10949
15015a0949N6757N4171j32172m5452Q7785m7938j11569J04158O3713k8661p352
$$ -10949 45808 99979 -32193 -77645 10140 -37798 -149367 -45209 18504 -10157 -17509
15004a7509L2615k9919j03505j12725J16745P7838p1157j6534J40500N6215o425
$$ -17509 15106 -14813 -118318 -231043 -114298 -36460 -107617 -124151 16349 72564 66139
14993F6139l0500j0430J5662J03921N0298j12944r7859M5590J9597q3144p4213
$$ 66139 35639 25209 40871 144792 195090 82146 -15713 29877 49474 -33670 -107883
14982a07883J54699Q2780j02612p762M6627Q3113m4380j52550p1482o1837J189
$$ -107883 46816 129596 26984 19222 65849 148962 104582 -47968 -119450 -181287 -180098
14971a80098K682J16062K2764n0100k1765r1842M2203m7513M8960N9722p3161
$$ -180098 -177416 -61354 -38590 -88690 -110455 -202297 -160094 -207607 -158647 -98925 -172086
14960a72086k8244j4378q6159J71037K1891k05136L7587J32565J83564q7440O0324
$$ -172086 -200330 -214708 -300867 -129830 -107939 -313075 -275488 -142923 40641 -46799 13525
14949A3525J06056q8090o6172L925o7216O0587K0122j01770o0587J27706J51199
$$ 13525 119581 31491 -34681 -30756 -97972 -37385 -17263 -119033 -179620 -51914 99285
14938I9285N0919n7728k0396J4467K20j63259o3941k4119L3938J0394k797p1509
$$ 99285 150204 92476 72080 86547 86767 -76492 -140433 -164552 -130614 -120220 -123017 -194526
14926a94526K4601J59946O3579q3240o206q1325j7041L4287P1359n5399j09679
$$ -194526 -169925 -9979 53600 -29640 -35846 -117171 -134212 -99925 -28566 -83965 -193644
14915a93644J56322J52461j0422m8322R0498m9464K4301l7832j08748Q189P4554
$$ -193644 -37322 115139 104717 56395 146893 97429 121730 83898 -24850 -16661 57893
14904E7893j5817M4977j5594o4644j29756K1472J00228j15877q3319j3032N9945
$$ 57893 42076 87053 71459 6815 -122941 -101469 -1241 -117118 -200437 -213469 -153524
14893a53524L3197n4701K0141k1349j4392O5489n1258k4905M2952J23799n7907
$$ -153524 -120327 -175028 -154887 -176236 -190628 -125139 -176397 -201302 -158350 -34551 -92458
14882i2458n5764m3791k7830O52N8253K0108R2080M4113Q6501q4982p5185P5327
$$ -92458 -148222 -192013 -219843 -219191 -160938 -140830 -48750 -4637 81864 -3118 -78303 -2976
14870b976M7445o5181q8055N2040j0005q475q6525o8591J133N6614P6192m5611
$$ -2976 44469 -20712 -108767 -56727 -66732 -75207 -161732 -230323 -229190 -172576 -96384 -141995
14858a41995r803L274j02016j1241N1981N6793L2020m9941L9285J27407J71954
$$ -141995 -151798 -148524 -250540 -261781 -209800 -153007 -120987 -170928 -131643 -4236 167718
14847A67718j12131m1910j0157L1522o466k671j5931k6198j9214r8919k0159J39465
$$ 167718 55587 13677 3520 35042 28576 25905 9974 -16224 -35438 -134357 -154516 -15051
14835a5051M8554n7462q9376j09183j4081J63943l923j7106m3158r5388O412Q6625
$$ -15051 33503 -23959 -113335 -222518 -236599 -72656 -76579 -93685 -136843 -232231 -225819 -139194
14823a39194J5058J34143J45236K1125o5515m9763j40666n419L8309n6396M2236
$$ -139194 -124136 10007 155243 176368 110853 61090 -79576 -84995 -46686 -103082 -60846
14812f0846R7598J2177j59415m7796j40259R3430O7813l6905N9241j10167o4982
$$ -60846 36752 48929 -110486 -158282 -298541 -205111 -137298 -174203 -114962 -225129 -290111
14801b90111k5632N6283J00019n253L5117M0101J44555j8150j9198L2556Q8703
$$ -290111 -315743 -259460 -159441 -164694 -129577 -89476 55079 36929 17731 50287 138990
14790A38990o100l2710l2839O6627k2834N0880J56191j51511k93040o9536n5660
$$ 138990 132890 100180 67341 133968 111134 162014 318205 166694 -126346 -195882 -251542
14779b51542o8835J38500Q6278k2046L0791O3037J66624j05336K2375j4976j16374
$$ -251542 -320377 -181877 -95599 -117645 -86854 -23817 142807 37471 59846 44870 -71504
14768g1504q1603m6283L1440P6608J11423M5555O2346j7099j35927r2688k4501
$$ -71504 -153107 -199390 -167950 -91342 20081 65636 127982 110883 -25044 -117732 -142233
14757a42233P0896R2652n8010k9538M8145R8411J1293m6661J01190L7604k5269
$$ -142233 -71337 21315 -36695 -66233 -18088 80323 91616 44955 146145 183749 158480
14746A58480P0952n1890P5656P5621p3793j36203o4094l6014m8489l4390J81663
$$ 158480 229432 177542 253198 328819 255026 118823 54729 18715 -29774 -64164 117499
14735A17499O4245q1883r5676k3752q7435j16904J12664L9889J8972O6885n6026
$$ 117499 181744 99861 4185 -19567 -107002 -223906 -111242 -71353 -52381 14504 -41522
14724d1522J390J56137k9972j87934q622R8307l0022J2816R4707q675l7124k3164
$$ -41522 -40132 116005 86033 -101901 -110523 -12216 -42238 -29422 65285 56610 19486 -3678
14712c678R3700R3807P4927j16370r1341j07047o7778p6077N0133K6971M2837
$$ -3678 90022 183829 258756 142386 51045 -56002 -123780 -199857 -149724 -122753 -79916
14701g9916q5995J03248J06440n3766O8946Q6829j0413m4239o8817o3404k4701
$$ -79916 -165911 -62663 43777 -9989 58957 145786 135373 91134 22317 -41087 -65788
14690f5788k3382K7535M5209L10j07192r854J64791N9530l6225r7862m9207n0342
$$ -65788 -89170 -61635 -16426 -16116 -123308 -133162 31629 91159 54934 -42928 -92135 -142477
14678a42477K6888q5380r0060k3419J28398P5576l4189J44485Q1350M1220r609
$$ -142477 -115589 -200969 -291029 -314448 -186050 -110474 -144663 -178 81172 122392 112783
14667A12783j76752j32648J02260O7365o2759j90336r8978N7148J82402Q4558
$$ 112783 -63969 -196617 -94357 -26992 -89751 -280087 -379065 -321917 -139515 -54957
14657e4957K3464n5950j6232l4441R1164J06975J03298n2975j7510K306k8528
$$ -54957 -31493 -87443 -103675 -138116 -46952 60023 163321 110346 92836 95142 66614
14646F6614o7003k0478j25783o6332J73264L8722M943R1893O8996M648r6094j98656
$$ 66614 -389 -20867 -146650 -212982 -39718 -996 3947 95840 164836 169484 73390 -125266
14634a25266l1598K17726Q4046j0845k1474n2772q8529m0979N7884j12193n624
$$ -125266 -156864 60862 144908 134063 112589 59817 -28712 -69691 -11807 -124000 -129624
14623a29624j0698m5932O7765K10138j0638m6932J35877J2907j9255q2467q0521
$$ -129624 -140322 -186254 -118489 91649 81011 34079 169956 182863 163608 81141 620
14612F20j15310l7536J5249L8360l2956M9117J37619J03737k5676j02857L034
$$ 620 -114690 -152226 -136977 -98617 -131573 -82456 55163 158900 133224 30367 33401
14601C3401M0962Q8365q6567n0884j1793K8466j28365r2263K712N5439O5441L5855
$$ 33401 74363 162728 76161 25277 13484 41950 -86415 -178678 -175966 -120527 -55086 -19231
14589a9231j28958P6456R3722Q7981k3548k8657k5884Q825L1081J53688K8550
$$ -19231 -148189 -71733 21989 109970 86422 57765 31881 40706 71787 225475 254025
14578B54025j02118j27648r5953M7306J8189J93469Q3829J02994J82539K67384
$$ 254025 151907 24259 -71694 -24388 -6199 187270 271099 374093 556632 824016
14568H24016K08589L6946N075J02675j87583k23803o9583o8162j48111j25711
$$ 824016 1032605 1069551 1074626 1177301 989718 765915 696332 628170 480059 354348
14558C54348q7765J3872j04264j04290P2000j07851l5860k7169m3345R8850P6745
$$ 354348 266583 280455 176191 71901 143901 36050 190 -26979 -70324 28526 105271
14547A05271p8863r4536n5321r9565K9231J5704m4933J7871l973n9207o5070K8871
$$ 105271 26408 -68128 -123449 -223014 -193783 -178079 -223012 -205141 -209114 -268321 -333391 -304520
14535c04520J52958J93989R9331k6405m9952j44098M977M8428j9486O8022M6933
$$ -304520 -151562 42427 141758 115353 65401 -78697 -73720 -25292 -44778 23244 70177
14524G0177M0153R514q0756j6122r6596K06427p492l17280j42435P8565J02348
$$ 70177 110330 119844 39088 22966 -73630 132797 125305 -191975 -334410 -255845 -153497
14513a53497J16628j4587m7476j06395L3725q3432N2124R9068j1979j19794J11638
$$ -153497 -36869 -51456 -98932 -205327 -171602 -255034 -202910 -103842 -115821 -235615 -123977
14502a23977k4298k4857p6144n687J42958k4873K3750O5618O9170K6089o1544
$$ -123977 -148275 -173132 -249276 -254963 -112005 -136878 -113128 -47510 21660 47749 -13795
14491a3795K4689o3592o1437j6570O6134m2435K0224o2370J8368R0584M0786O7505
$$ -13795 10894 -52698 -114135 -130705 -64571 -107006 -86782 -149152 -130784 -40200 586 68091
14479F8091O6051k914o8545L9484r2031j00266p0843P9679m2730j37605Q7151
$$ 68091 134142 131228 62683 102167 10136 -90130 -160973 -81294 -124024 -261629 -174478
14468a74478J74922K076m0289m0211l3974p7493k9726k6433o5411r318k6750J75159
$$ -174478 444 2520 -37769 -77980 -111954 -189447 -219173 -245606 -311017 -320335 -347085 -171926
14456a71926k3041N7504J48309J9409n3325j19622K2751L2117l8113J50791j443
$$ -171926 -194967 -137463 10846 30255 -23070 -142692 -119941 -87824 -125937 24854 23411
14445B3411j49038M6783j5179n915R5356J58125K8582j15640J4346M4398r426
$$ 23411 -125627 -78844 -94023 -99938 -4582 153543 182125 66485 80831 125229 115803
14434A15803k26060j21145O5799J29538J7345O964R6515m9318n7091j15746J4846
$$ 115803 -110257 -231402 -165603 -36065 -18720 -11756 84759 35441 -21650 -137396 -122550
14423a22550L9163k3093j4768M0300J64781Q8581m0576l125J0125r9133j32929
$$ -122550 -83387 -106480 -121248 -80948 83833 172414 131838 128713 138838 39705 -93224
14412i3224n5517L4888M3224j51938l8817P8531P0838l514L2125J37173M6480
$$ -93224 -148741 -113853 -70629 -222567 -261384 -182853 -112015 -115529 -83404 53769 100249
14401A00249P4839L5725J635j36964k41708o0811J74647J03988J28647o9264L527
$$ 100249 175088 210813 212448 75484 -166224 -227035 -52388 51600 180247 110983 114510
14390A14510K5433l3944L3893P720k0891M2408n9104R20N4852Q973K7466J1654
$$ 114510 139943 105999 139892 147612 126721 169129 110025 110945 165797 174770 202236 213890
14378B13890p8904j1474J5386N0173R6574O9359J26959m6865M2608J34276J76805
$$ 213890 134986 123512 138898 189071 285645 355004 481963 435098 477706 611982 788787
14367G88787K7994j10847L7207l2190J37208O1791o3705l7088M0949J19681j7678
$$ 788787 816781 705934 743141 710951 848159 909950 846245 809157 850106 969787 952109
14356I52109j22228j43914o8367k3308j04136j47350j41054N6658K70332M9841
$$ 952109 829881 685967 617600 594292 490156 342806 201752 258410 528742 578583
14346E78583j00723M7275J11078l8486m8479n503K6976J45619J36591J13633m7662
$$ 578583 477860 525135 636213 597727 549248 543745 570721 716340 852931 966564 918902
14335I18902J1471K6188l9315p5807Q262l6058L6642j9774m5928p828j49723n9602
$$ 918902 930373 956561 917246 841439 849701 813643 850285 830511 784583 776755 627032 567430
14323E67430k3455q2936j67315L8284m926j81194O1818P8735M5829R2642J1561
$$ 567430 543975 461039 293724 332008 327082 145888 207706 286441 332270 424912 436473
14312D36473Q0334r5329j36582J04890K21775P6717N2330J79634K18169L00794
$$ 436473 516807 421478 284896 389786 611561 688278 740608 920242 1138411 1439205
14302A439205J23412K44979J44224J91995R2523o9022M690j05278j87559k71946
$$ 1439205 1562617 1807596 1951820 2143815 2236338 2167316 2172006 2066728 1879169 1607223
14292A607223j98020k05479j04711n8798j84654l40P2759j43430k67875r2754
$$ 1607223 1409203 1203724 1099013 1040215 855561 855221 927980 784550 516675 423921
14282D23921l3690K7037Q2179K6333N5881P0545j5709Q3605J09840o1293R3146
$$ 423921 390231 417268 499447 525780 581661 652206 636497 720102 829942 768649 861795
14271H61795J25696n4318K5823r3183k05655k11255j12443k77178o1495J45981
$$ 861795 987491 933173 958996 865813 660158 448903 336460 59282 -2213 143768
14261A43768m9765o6757j4708N2872j8392k6592P190j04J04465M9713J45051J0173
$$ 143768 94003 27246 12538 65410 47018 20426 27616 27512 131977 181690 326741 336914
14249C36914J7729K5511j38522j08674p0098j51908m7349j32678l6251J87963
$$ 336914 354643 380154 241632 132958 62860 -89048 -136397 -269075 -305326 -117363
14239a17363J65683J28070m8521j5929R0375j23306O4297N2351j29163j88647
$$ -117363 48320 176390 127869 111940 202315 79009 143306 195657 66494 -122153
14229a22153j09734L1601N9592j3169N4321R5529J10710Q4674j4162q9591l1791
$$ -122153 -231887 -200286 -140694 -153863 -99542 -4013 106697 191371 177209 87618 55827
14218E5827j13830j13449j0385R6282J87403l5572m9888n8610j03665O2429P0491
$$ 55827 -58003 -171452 -181837 -85555 101848 66276 16388 -42222 -145887 -83458 -12967
14207a2967j66228j4231K6462K7935J19735P536k8010K3448o2735N5773O0407
$$ -12967 -179195 -193426 -166964 -139029 -19294 -11758 -39768 -16320 -79055 -23282 37125
14196C7125R4857k1869k0644k4703M9740l7054Q6076q4675n9894r9446p1984R7243
$$ 37125 131982 110113 89469 64766 114506 77452 163528 78853 18959 -80487 -152471 -55228
14184e5228K470J0820o5722R3142J29088J20877K4194j87058o9776N5461N6347
$$ -55228 -52758 -41938 -107660 -14518 114570 235447 259641 72583 2807 58268 114615
14173A14615J0920L4332P875j2247j76003O3973J06518Q1380p5978l9493J00100
$$ 114615 125535 159867 167742 155495 -20508 43465 149983 231363 155385 115892 215992
14162B15992K2562P6830r3981j1132k7194m2524r1196M8534L1968O9686o1672
$$ 215992 238554 315384 221403 210271 183077 140553 49357 97891 129859 199545 137873
14151A37873m1911k6169q471K0480K9291k4794m7985J10983k8730k268L952j7416
$$ 137873 95962 69793 61322 81802 111093 86299 38314 149297 120567 118299 122251 104835
14139A04835p0320J11075Q7621o1136l3748J2636j2901K0504m5158o0190O6445
$$ 104835 34515 145590 233211 172075 138327 150963 138062 158566 113408 53218 119663
14128A19663m318n460n7754q630j12346M8153m1050q9265N0392Q5238R0343m6232
$$ 119663 115345 109885 52131 43501 -68845 -20692 -61742 -151007 -100615 -15377 74966 28734
14116B8734j12610P8354O9657K6488l0017n1873M8012k2613j05093l396J0396
$$ 28734 -83876 -5522 64135 90623 60606 8733 56745 34132 -70961 -74357 -63961
14105f3961j01409M4927O3069P4366J37686k0845j72082j82562j01437J43483
$$ -63961 -165370 -120443 -57374 16992 154678 133833 -38249 -220811 -322248 -178765
14095a78765m707O0967R7111J3081m4199R2544K07819j654o5888P3468o415j67439
$$ -178765 -183472 -122505 -25394 -12313 -56512 36032 243851 242197 176309 249777 243362 75923
14083G5923p4853Q6342Q1278l233q4666p4627j1392N8134J82585n7520J10629
$$ 75923 1070 87412 168690 165457 80791 6164 -5228 52906 235491 177971 288600
14072B88600J13225o7933k21339m5903K57377J04961q0538l8531j05644p5221
$$ 288600 401825 333892 112553 66650 324027 428988 348450 309919 204275 129054
14062A29054n6485j35011j7930J16346J48554M0198M6448L1134j64605j09441
$$ 129054 72569 -62442 -80372 35974 184528 224726 271174 302308 137703 28262
14052B8262l9570M7666Q6972L3018Q6818J73448P2221J7262j28894P3832L8909
$$ 28262 -11308 36358 123330 156348 243166 416614 488835 506097 377203 451035 489944
14041D89944K0822k8657k6699O5737R0991P1480j3614l5007p079m7294r3088J31585
$$ 489944 510766 482109 455410 521147 612138 683618 670004 634997 627918 580624 487536 619121
14029F19121n6873j3957Q1347m337O0170O6158j01335L805o511j43998j77442
$$ 619121 562248 548291 629638 625301 685471 751629 650294 654099 647588 503590 326148
14018C26148j9730O0278J07051K0925j21718j05428R9318O8018J72773K0658j21347
$$ 326148 306418 366696 473747 494672 372954 267526 366844 434862 607635 628293 506946
14007E06946m0319J20181M0320o7230P2254L5150m6211O963J43168J10222j4243
$$ 506946 466627 586808 627128 559898 632152 667302 621091 628054 771222 881444 867201
13996H67201j04983Q0038L9300L8132q3530m730p2644J21125J8835J2078k7477
$$ 867201 762218 842256 881556 919688 836158 831428 758784 879909 898744 910822 883345
13985H83345O324p2703R6758J48298J40294M9785j11790j79457M183J92540P8979
$$ 883345 889669 816966 913724 1062022 1202316 1252101 1140311 960854 965037 1157577 1236556
13974A236556N9285Q0830m6319n9931p736J78106K86919j03140j63499J59700
$$ 1236556 1295841 1376671 1330352 1270421 1262685 1440791 1727710 1624570 1461071 1620771
13964A620771J76670J68461O5490K58388K22479J00297N0694J67017K94484K86503
$$ 1620771 1797441 1965902 2031392 2289780 2512259 2612556 2663250 2830267 3124751 3411254
13954C411254J60962K75485L45960K62946L22756L14980M68604M37511N56999
$$ 3411254 3572216 3847701 4193661 4456607 4779363 5094343 5562947 6000458 6557457
13945F557457O43111O02971Q07057Q08189Q82506J065713J296714J639746J864609
$$ 6557457 7200568 7803539 8610596 9418785 10301291 11367004 12663718 14303464 16168073
13936A6168073K006146K344452K651563L320948M055358M504731N223378O255973
$$ 16168073 18174219 20518671 23170234 26491182 30546540 35051271 40274649 46530622
13928D6530622P457461Q536727R616747J0367843J1050518J1233192J0650919
$$ 46530622 53988083 62524810 72141557 82509400 93559918 104793110 115444029
13921A15444029R831175Q403257O304446L952445J548118o85159k736757m250357
$$ 115444029 125275204 133678461 139982907 143935352 145483470 144798311 142061554 137811197
13913A37811197n355636o156498o405169o228340n763002n202901m466645l833722
$$ 137811197 132455561 126299063 119893894 113665554 107902552 102699651 98233006 94399284
13905I4399284l198347k584822j982957j266946o53433L4445P54597J265616K103042
$$ 94399284 91200937 88616115 86633158 85366212 84712779 84747224 85501821 86767437 88870479
13896H8870479K962987L780407M485739N318450O277212O842376P076618O882816
$$ 88870479 91833466 95613873 100099612 105418062 111695274 118537650 125614268 132497084
13888A32497084O224568N106004L666692J571727p17154l201196n595624p646659
$$ 132497084 138721652 143827656 147494348 149066075 148348921 145147725 139552101 131905442
13880A31905442r197066j0084668j0600875j0606245j0292326r374314q518768
$$ 131905442 122708376 112623708 102022833 91416588 81124262 71749948 63231180
13873F3231180p569903o719138n857523n160585m547903l997344l228235k747025
$$ 63231180 55661277 48942139 43084616 37924031 33376128 29378784 26150549 23403524
13865B3403524k571556k359181k115619j722253j636126j365141j048126q44331
$$ 23403524 20831968 18472787 16357168 14634915 12998789 11633648 10585522 9741191
13857I741191r06993o56998p80192o25777n03401m68423m51461n06594l93674
$$ 9741191 8834198 8177200 7397008 6771231 6267830 5799407 5347946 4841352 4447678
13848D447678l31778k69291j43675k21271k40996j07136j58838j30460j04786
$$ 4447678 4115900 3846609 3702934 3481663 3240667 3133531 2974693 2844233 2739447
13839B739447k82782j96210m8223q6503j25213q5321k02009p8676P1769j5506
$$ 2739447 2456665 2260455 2212232 2125729 2000516 1915195 1713186 1634510 1706279 1690773
13829A690773n8543M0211j27825j6875M7557j06393j59354K0948N9986j23852
$$ 1690773 1632230 1672441 1544616 1527741 1575298 1468905 1309551 1330499 1390485 1266633
13819A266633j01532P0085M672j17363r6902j0156N8771j99756j71970l5745J9015
$$ 1266633 1165101 1235186 1239858 1122495 1025593 1015437 1074208 874452 702482 666737 685752
13808F85752j3444M0882p2189l694k3564J0129M2170L9074L7847l7995j3219p1133
$$ 685752 672308 713190 641001 637307 613743 623872 666042 705116 742963 704968 691749 620616
13796F20616m2086P9955L3185l896p5942j7489M6613j08156n6071l0012N0801
$$ 620616 578530 658485 691670 687774 611832 594343 640956 532800 476729 446717 497518
13785D97518L8451j03865J8515m4593j56901M2762J51221N939m9074Q387O1330
$$ 497518 535969 432104 450619 406026 249125 291887 443108 449047 399973 408360 469690
13774D69690k7567j48912K957j54374M2694R0468j9681k4447M0863m1169L0941
$$ 469690 442123 293211 296168 141794 184488 274956 255275 230828 271691 230522 261463
13763B61463J37145j21017O1016n1672q5646l6393j4707l9753J21840L6328j60927
$$ 261463 398608 277591 338607 286935 201289 164896 150189 110436 232276 268604 107677
13752A07677J5171O0062j24775o6667P7898J26542n6109n2774P6410J30315m8531
$$ 107677 122848 182910 58135 -8532 69366 195908 139799 87025 163435 293750 245219
13741B45219q4485j0900j11027m477O8552N3305j9121l4479l4716J19223r246
$$ 245219 160734 149834 38807 34330 102882 156187 137066 102587 67871 187094 177848
13730A77848m1242j37303k8096R8400m4661J35508J53982k5442j11413p2037O0705
$$ 177848 136606 -697 -28793 69607 24946 160454 314436 288994 177581 105544 166249
13719A66249J167O8123n6738k4434L6223l9831Q3209l5911J01903j9803o4747
$$ 166249 167416 235539 178801 154367 190590 150759 233968 198057 299960 280157 215410
13708B15410J9535M896J5438L7576k12140m7810O5297L8361R1016j89829j09210
$$ 215410 234945 239841 255279 292855 80715 32905 98202 136563 227579 37750 -71460
13697g1460j7066K7664J40496J49455O6168n9280j24029l2614n7460q577K7851
$$ -71460 -88526 -60862 79634 229089 295257 235977 111948 79334 21874 13297 41148
13686D1148J4932m5492J8537O2274j0900n0894L6835J12520k1602n1165J2714
$$ 41148 56080 10588 29125 91399 80499 29605 66440 178960 157358 106193 118907
13675A18907Q4974j63249r2181j56405J21307J48303k7490j7464n8055j9472M0127
$$ 118907 203881 40632 -51549 -207954 -86647 61656 34166 16702 -41353 -60825 -20698
13664b0698J09197n9838k9977J4388p7727P477J26746J01582j45819l4491o8919
$$ -20698 88499 28661 -1316 13072 -64655 -57178 69568 171150 25331 -9160 -78079
13653g8079l549p8100m0057J4006r5640N3627K39772l2448j13734p0928J5546
$$ -78079 -81628 -159728 -199785 -185779 -281419 -227792 11980 -20468 -134202 -205130 -189584
13642a89584J61750q8073N1818J58708P7959j7333K10J01886R5013j01271j82630
$$ -189584 -27834 -115907 -64089 94619 172578 155245 155455 257341 352354 251083 68453
13631F8453L0289L74Q3O862Q1240n7028j50261n4432R6663P2396n7205K1629Q5198
$$ 68453 98742 99116 99199 106061 187301 130273 -19988 -74420 22243 94639 37434 59063 144261
13618A44261P8985k3342j9301l1638j52254r3768J95031J07678M1019j15572l6820
$$ 144261 223246 199904 180603 148965 -3289 -97057 97974 205652 246671 131099 94279
13607I4279j40714j4858K1910P9260J22111j00446j32857K6421L125j18416N2134
$$ 94279 -46435 -61293 -39383 39877 161988 61542 -71315 -44894 -41769 -160185 -108051
13596a08051l1018J03155m5628L9206m1115J404J74241K7511j4544n350R3428
$$ -108051 -139069 -35914 -81542 -42336 -83451 -82047 92194 119705 105161 99811 193239
13585A93239l9700L0043O3350m5039j53135j00059Q739l9490Q4046K0116O8782
$$ 193239 153539 183582 246932 201893 48758 -51301 -42562 -82052 1994 22110 90892
13574I0892Q6357K6174l1902j06112o7791P0399j4882j19014l5535M1464L8159
$$ 90892 177249 203423 171521 65409 -2382 68017 53135 -65879 -101414 -59950 -21791
13563b1791N5089R010K9090m6647j13266k3654l0095n2864M0461O3854j4743Q6146
$$ -21791 33298 42308 71398 24751 -88515 -112169 -142264 -195128 -154667 -90813 -105556 -19410
13551a9410P3798j20748k6823J27508P3713p1499L7428L5739J5571Q690p1403
$$ -19410 54388 -66360 -93183 34325 108038 36539 73967 109706 125277 133967 62564
13540F2564p7715o2547K9442L1305L6613M6288p9811J09708R1565p1837J9274
$$ 62564 -15151 -77698 -48256 -16951 19662 65950 -13861 95847 187412 115575 134849
13529A34849J25059j4196l2399k9976j30091m8585J3147o4973n4923O9443R1279
$$ 134849 259908 245712 213313 183337 53246 4661 17808 -47165 -102088 -32645 58634
13518E8634J49433L5511k11370j07663K3465j12383p254n6222J19205J51304J21921
$$ 58634 208067 243578 32208 -75455 -51990 -164373 -171627 -227849 -108644 42660 164581
13507A64581o8966n1785J6689L3298R4303l3217j9573p4782j30796L391J16484
$$ 164581 95615 43830 60519 93817 188120 154903 135330 60548 -70248 -66857 49627
13496D9627j46292M9275P8217l2663p2581j14308M9688M8416o0514J3919J19683
$$ 49627 -96665 -47390 30827 -1836 -74417 -188725 -139037 -90621 -151135 -137216 -17533
13485a7533n4076R753L5911J62004O6181m4228r593M8746J74262k162J8221P0171
$$ -17533 -71609 -61856 -25945 136059 202240 158012 148419 197165 371427 369265 387486 457657
13473D57657k1733R1512J51369p1360q4605p2995J87143R0840j85100O511R6098
$$ 457657 435924 527436 678805 607445 522840 449845 636988 727828 542728 549239 645337
13462F45337P4418N545l7839j593J7624j13105q0902J8830m6718j6036O8588o7886
$$ 645337 719755 725300 687461 685868 703492 590387 509485 528315 481597 465561 534149 466263
13450D66263R901n4660k2467J49880N1579j26044j65234j00030J49652P9293K07030
$$ 466263 476164 421504 399037 548917 600496 474452 309218 209188 358840 438133 645163
13439F45163n0802j14979J06014N7724J9394J35514K8675K7412n3066j43663j17438
$$ 645163 594361 479382 585396 643120 662514 798028 826703 854115 801049 657386 539948
13428E39948j511n1649r0795J05623m0399j12356k7735q7141q1663j23185j2194
$$ 539948 538437 486788 395993 501616 461217 348861 321126 233985 152322 29137 16943
13417A6943j227N6903K2267L5506N9584j6544J04185q489q1473M136r2492N0095
$$ 16943 15716 72619 94886 130392 189976 173432 277617 269128 187655 191791 99299 149394
13405A49394Q14m8301o83L3286n907m6394n045N4760M5628m8815r0805o9327M7103
$$ 149394 150208 101907 101224 134510 128603 82209 77164 131924 177552 128737 37932 -31395 15708
13392A5708M1018J0111Q050q5031l4556r6684Q0816R4982K30683J36300q3774
$$ 15708 56726 66837 74887 -10144 -44700 -141384 -60568 34414 265097 401397 317623
13381C17623k16005j07798l6050n8017r7431N628M5413J18476J44819m209J158
$$ 317623 101618 -6180 -42230 -100247 -197678 -192050 -146637 -28161 116658 112449 113607
13370A13607p1598J8021l9486q584J1208k13943j1993J31102N5618M2550Q6361
$$ 113607 42009 60030 20544 11960 23168 -190775 -202768 -71666 -16048 26502 112863
13359A12863Q7040L0035j68911n1981k6228N0226l1165N566P913q2228L7501r46
$$ 112863 199903 229938 61027 9046 -17182 33044 1879 7445 15358 -66870 -29369 -30315
13347c0315N0538M5469P9770n7998j71644M7456r327m9334j02802M0815j5470
$$ -30315 20223 65692 145462 87464 -84180 -36724 -46051 -95385 -198187 -157372 -172842
13336a72842P0401n4256K3207k2240l5090M9269K9213J6882k1905L9431K9815
$$ -172842 -102441 -156697 -133490 -155730 -190820 -141551 -112338 -95456 -117361 -77930 -48115
13325d8115J9172k0910n3306m837m8785j1905p0176J856M3597M3450Q2882K07928
$$ -48115 -28943 -49853 -103159 -107996 -156781 -168686 -238862 -237006 -193409 -149959 -67077 140851
13313A40851R5101o5286j8189N5029l7169k49651l6265P0250O6447Q4085J13772
$$ 140851 235952 170666 152477 207506 170337 -79314 -115579 -45329 21118 105203 218975
13302B18975j3832l718j15430k4173r545l2461n3028J040J68402J961j48390o3610
$$ 218975 205143 201425 85995 61822 52277 19816 -33212 -32172 136230 138191 -10199 -73809
13290g3809l7380O4904q106j11514k7244O9421J09089K0234q5578M5877J40122
$$ -73809 -111189 -46285 -54391 -165905 -193149 -123728 -14639 5595 -79983 -34106 106016
13279A06016M174p2254p3112k6770l0428Q4707L6452r0162j26009j11390J08090
$$ 106016 110190 37936 -35176 -61946 -92374 -7667 28785 -61377 -187386 -298776 -190686
13268a90686Q9389L0698j1345K5833q8749q6653J85325J03060N9708o2714Q097
$$ -190686 -101297 -70599 -81944 -56111 -144860 -231513 -46188 56872 116580 53866 61963
13257F1963m7266J2939L5629N1919r6268l0654J45893J06286L2064k5533n3489
$$ 61963 14697 27636 63265 115184 18916 -11738 134155 240441 272505 246972 193483
13246A93483j32016L7771J09900j23414L6079O4751N0825J6598m3398l7048j1983
$$ 193483 61467 99238 209138 85724 121803 186554 237379 253977 210579 173531 161548
13235A61548o5461K9618K881l2025j14441J7905L9618p8028k2007N478q09N2465
$$ 161548 96087 125705 128586 96561 -17880 25 39643 -38385 -60392 -54914 -55723 -3258
13223c258l3120j44137K5157J94524L7296j15910N215J14559L66271K31992J58456
$$ -3258 -36378 -180515 -155358 39166 76462 -39448 -34233 80326 446597 678589 837045
13212H37045J60644J52979Q9286J00254p5423q8919m0850J03087N4050q0187j38661
$$ 837045 997689 1150668 1239954 1340208 1264785 1175866 1135016 1238103 1292153 1211966 1073305
13201A073305j65789p4851m8708l8080m3033k3513n7499l2724Q1824J04148J58400
$$ 1073305 907516 832665 783957 745877 702844 679331 621832 589108 670932 775080 933480
13190I33480k7104P3561J09397m5997q954Q6811K7852J70389J73194O1079J11507
$$ 933480 906376 979937 1089334 1043337 1034383 1121194 1149046 1319435 1492629 1553708 1665215
13179A665215n727j26324j29732k13113n2591j55437n3689N342J60009J2632r2197
$$ 1665215 1659488 1533164 1403432 1190319 1137728 982291 928602 933944 1093953 1106585 1014388
13168A014388L3469J9086l2404L8065j2748O8135j7194L5127Q6141L22355J06662
$$ 1014388 1047857 1066943 1034539 1072604 1059856 1127991 1110797 1145924 1232065 1554420 1661082
13157A661082J07990N7572q8622j14053m5551p0460m5586P8501l0523L7741j4358
$$ 1661082 1769072 1826644 1738022 1623969 1578418 1507958 1462372 1540873 1510350 1548091 1533733
13146A533733j62098j88174k15345l6431j71466j39451p6054j43814j54530P6917
$$ 1533733 1371635 1183461 968116 931685 760219 620768 544714 400900 246370 323287
13136C23287L0808o0504Q488n8166m0980M3016J9523n8378k4824K6566O3418j45604
$$ 323287 354095 293591 302079 243913 202933 245949 265472 207094 182270 208836 272254 126650
13124A26650K3764k3357K9002L5331L6356P3670L7367J80293J05226K00682K44802
$$ 126650 150414 127057 156059 191390 227746 301416 338783 519076 624302 824984 1069786
13113A069786J51625J25323k340j38908j37970j82252j46483l56977k52127o7105
$$ 1069786 1221411 1346734 1344394 1205486 1067516 885264 738781 381804 129677 62572
13103F2572J9057n4740l9433J78601K5961k8488m4102q6230J14591q6563o4638
$$ 62572 81629 26889 -12544 166057 192018 163530 119428 33198 147789 61226 -3412
13092c412n9889J59576J2486j90219j38433R5060J80807M6799Q823J349j342j27723
$$ -3412 -63301 96275 108761 -81458 -219891 -124831 55976 102775 111598 112947 111605 -16118
13080a6118n7415n3962J49808J43747Q54j7143k7562J28763L3648M8184P7161
$$ -16118 -73533 -127495 22313 166060 166914 149771 122209 250972 284620 332804 409965
13069D09965J48336K5707P0240n5519j51592j8038J2500L0236n099j53900j35253
$$ 409965 558301 584008 654248 598729 447137 429099 441599 471835 466736 312836 177583
13058A77583p1509J3855m840O4854q9335n8102o4998r5720P8487J17664J8306
$$ 177583 106074 119929 115089 179943 90608 32506 -32492 -128212 -49725 67939 86245
13047H6245q4191n3476p511K6320k3878n5452j17975J46673K13559N6748j12068
$$ 86245 2054 -51422 -58933 -32613 -56491 -111943 -229918 -83245 130314 187062 74994
13036G4994j16243L3909J95413M6207j07080k2036P9627M891k67616k00288M8310
$$ 74994 -41249 -7340 188073 234280 127200 105164 184791 189682 -77934 -278222 -229912
13025b29912K13337O2243R818M2388q9451L6861J5046R605R1693R2606r062k2003
$$ -229912 -16575 45668 55486 97874 8423 45284 60330 69935 161628 254234 245172 223169
13013B23169J8433o8252q1434R082K50439J19705n3643j01569k02692j46102Q006
$$ 223169 241602 173350 91916 100998 351437 471142 417499 315930 113238 -32864 -24858
13002b4858Q4988N1218K01243J11216j97476p3682O1303R2576K1045J17053o7185
$$ -24858 60130 111348 312591 423807 226331 152649 213952 306528 327573 444626 377441
12991C77441j04427l8554N3335J00332N4068O335J16810K1000j91137r520R0279
$$ 377441 273014 234460 287795 388127 442195 448530 565340 586340 395203 385683 475962
12980D75962M3888M6760n7964j62651K3315J05277q7628r4377n625K2434k9343
$$ 475962 519850 566610 508646 345995 369310 474587 386959 292582 286957 309391 280048
12969B80048m7467K6574J30776K3724J6136j39912n1099M5552J36342O6045l1652
$$ 280048 232581 259155 389931 413655 429791 289879 238780 284332 420674 486719 455067
12958D55067N026O0443J213k9477J2581M3804o2975L4494j09165q4254l6705K1893
$$ 455067 460093 520536 521749 492272 504853 548657 485682 520176 411011 326757 290052 311945
12946C11945R1707M8197o3373j43808j98765o9646N4570N4194l635P5372K7286
$$ 311945 403652 451849 388476 244668 45903 -23743 30827 85021 81386 156758 184044
12935A84044n447J6188N9812N1114o2997j36923k942L2052n7088N3549Q9104l8181
$$ 184044 178597 194785 254597 305711 242714 105791 102849 134901 77813 131362 220466 182285
12923A82285O8421o529J4025J3998J30686O3518p8667o3595J656O1375l802J16477
$$ 182285 250706 244177 258202 272200 402886 466404 387737 324142 325798 387173 383371 499848
12911D99848K3815n2421M0972j72q268j4814j23295j00697j13691M7041L05358
$$ 499848 523663 471242 512214 512042 503774 488960 365665 264968 151277 198318 503676
12900E03676K13173j5682j43605l0762n4422m8912J21886P7820l6818q5706l6678
$$ 503676 716849 701167 557562 526800 472378 423466 545352 623172 586354 500648 463970
12889D63970J08055J43918R3497l4002m1026l1521r7420J2899R9273J41323J92457
$$ 463970 572025 715943 809440 775438 734412 702891 605471 618370 717643 858966 1051423
12878A051423P7275J19828J44334p9376k31997j8399o3783n6787K3142m2589q384
$$ 1051423 1128698 1248526 1392860 1313484 1081487 1063088 999305 942518 965660 923071 914687
12867I14687l4334q9747n3007m1648j13456j6687R0856Q7007O7354m3413k0078
$$ 914687 880353 790606 737599 695951 582495 565808 656664 743671 811025 767612 747534
12856G47534m6457p6882J28942P9322J534j21791O0868O1255k652K3176J3813
$$ 747534 701077 624195 753137 832459 833993 712202 773070 834325 831673 854849 868662
12845H68662o9651o0952J98500J36045o5715k27573j63811K8089P2213P7521l2987
$$ 868662 799011 738059 936559 1072604 1006889 779316 615505 643594 715807 793328 760341
12834G60341k5758l4914J12033J6701K2294K6839l2024m1776J39691J19087J04864
$$ 760341 734583 699669 811702 828403 850697 877536 845512 803736 943427 1062514 1167378
12823A167378Q323N2768O6969M2167J8191q0450j5620J52382P3140j4599k2761
$$ 1167378 1175701 1228469 1295438 1337605 1355796 1275346 1259726 1412108 1485248 1470649 1447888
12812A447888P3745K3504J53347J11258K414r440R9629J91697J5430J4488K03892
$$ 1447888 1521633 1545137 1698484 1809742 1812156 1802716 1902345 2094042 2109472 2123960 2327852
12801B327852K31794K10053J03361O3700K7651J29193K13060J67551J43158J10034
$$ 2327852 2559646 2769699 2873060 2936760 2964411 3093604 3306664 3474215 3617373 3727407
12791C727407K77934K48893J58955J55292K12781K72544L59981K78618M77373
$$ 3727407 4005341 4254234 4413189 4568481 4781262 5053806 5413787 5692405 6169778
12782F169778N33314P22227O42351O93111R55755J313908J398361J431744J648636
$$ 6169778 6703092 7425319 8067670 8760781 9716536 11030444 12428805 13860549 15509185
12773A5509185J884403K220693K837355L619295M733872O457619R026135J2766136
$$ 15509185 17393588 19614281 22451636 26070931 30804803 37262422 46288557 59054693
12765E9054693J8069988K4977862L2915044L9911025M1633039L2413113J4455788
$$ 59054693 77124681 102102543 135017587 174928612 216561651 248974764 263430552
12758B63430552l525196j7252089k6571295l0721046k9404735k4914579j9189701
$$ 263430552 259905356 242653267 216081972 185360926 155956191 131041612 111851911
12751A11851911j3624626q684865m417205j051541J804494M694419P775798J0543843
$$ 111851911 98227285 89542420 85125215 84073674 85878168 90572587 98348385 108892228
12743A08892228J2710219J3663185J2624349J0171758P390107N167172M106477
$$ 108892228 121602447 135265632 147889981 158061739 165451846 170619018 174725495
12736A74725495M919430P942131J2828376J8696443K3715601K5422954K1173941
$$ 174725495 179644925 187587056 200415432 219111875 242827476 268250430 289424371
12729B89424371J0565783k140637j2448019j9050234k2028646k1252219j8058894
$$ 289424371 299990154 297849517 285401498 266351264 244322618 223070399 205011505
12722B05011505j3184022q020451l659311p82020K68779r65408l921071p731568
$$ 205011505 191827483 183807032 180147721 179365701 179634480 178669072 174748001 167016433
12714A67016433j1096430j3012214j3405730j2514761j0793865q467983n535840
$$ 167016433 155920003 142907789 129502059 116987298 106193433 97725450 92189610
12707I2189610j981712K196189P200242J3558138K1624639L0512657L8082435
$$ 92189610 90207898 92404087 99604329 113162467 134787106 165299763 203382198
12700B03382198M0936776L5250811J8981550k568731k0260200l1072134l6554982
$$ 203382198 244318974 279569785 298551335 295982604 275722404 244650270 208095288
12693B08095288l6929923l2918701k7079509k0783116j5534322j1655477r019182
$$ 208095288 171165365 138246664 111167155 90384039 74849717 63194240 54175058
12686E4175058p209131n831389n058914m460334l750296l150796k758244k453858
$$ 54175058 46965927 41134538 36075624 31615290 27864994 24714198 21955954 19502096
12678A9502096k034124j825029j675777j232854j140554j057164r15440q47871
$$ 19502096 17467972 15642943 13967166 12734312 11593758 10536594 9621154 8773283
12670H773283n54316n13534m97609m54289k64732k74321m20075l45484k14832
$$ 8773283 8218967 7705433 7207824 6753535 6488803 6214482 5794407 5448923 5234091
12661E234091k91650j59676k28121l28722j91226k39342k56549k82489j58274
$$ 5234091 4942441 4782765 4554644 4225922 4034696 3795354 3538805 3256316 3098042
12652C098042j0022p2093m2995L0624j35336r4086M5034O4776m3168j23171j13664
$$ 3098042 3088020 3015927 2972932 3003556 2868220 2774134 2819168 2883944 2840776 2717605 2603941
12641B603941p6262J8912n7255j5395q9596j54327j8461L7202j4544j29405j16202
$$ 2603941 2527679 2546591 2489336 2473941 2384345 2230018 2211557 2248759 2234215 2104810 1988608
12630A988608l2429J40743j06044j88814p9064j46974j3306N9950O0679J37830
$$ 1988608 1956179 2096922 1990878 1802064 1723000 1576026 1562720 1622670 1683349 1821179
12620A821179L1994j16407n3051j39598J3410L9847j18966r4821l5759L7735j9080
$$ 1821179 1853173 1736766 1683715 1544117 1557527 1597374 1478408 1383587 1347828 1385563 1366483
12609A366483j19288J547k853n9096J4836R54O4197O2862l9859n1652L711M2991
$$ 1366483 1247195 1248742 1245889 1186793 1201629 1202583 1266780 1329642 1289783 1238131 1241842 1284833
12597A284833L3566j06407j08750p6167r4235K3519J66633o433O6705l4328Q8837
$$ 1284833 1318399 1211992 1103242 1027075 932840 956359 1122992 1116559 1183264 1148936 1237773
12586A237773J28949P5519r634m4513j11831K21285L51312j02531j09359n0109
$$ 1237773 1366722 1442241 1432607 1388094 1276263 1497548 1848860 1746329 1636970 1586861
12576A586861j31962q7633P2542j03735r7822O2223j04951k51832j37776k19157
$$ 1586861 1454899 1367266 1439808 1336073 1238251 1300474 1195523 943691 805915 586758
12566E86758r3439Q1583K17903O8349l4879r7294l7445j99378j6696R73M6524
$$ 586758 493319 574902 792805 861154 826275 728981 691536 492158 475462 476435 522959
12555E22959k771r0565j9424J40169j6800j63102R208N8187l6369r9514P4645
$$ 522959 520188 429623 410199 550368 533568 370466 379674 437861 401492 301978 376623
12544C76623N2878L3572r9132m8783n7293j132Q4634N6467j4388j00020O201K2438
$$ 376623 429501 463073 363941 315158 257865 256733 341367 397834 383446 283426 289627 312065
12532C12065O9799j15124j6172j8665Q7096J9949r8711O4949N1938L1070r4437
$$ 312065 381864 266740 250568 231903 318999 338948 240237 305186 357124 388194 293757
12521B93757l5981p0183l8345R5139J35520j8312n3081M8555L7055o7072m3322
$$ 293757 257776 187593 149248 244387 379907 361595 308514 357069 394124 327052 283730
12510B83730R5909M0839j14573o7803m2336K2458O1780l7498Q6955N3794j3988
$$ 283730 379639 420478 305905 238102 195766 218224 280004 242506 329461 383255 369267
12499C69267M9985R2286M8362N9660j1056j09157o0572n3031M5647k4250j06146
$$ 369267 419252 511538 559900 619560 608504 499347 438775 385744 431391 407141 300995
12488C00995m9671J07577L0851P5669J18901J16043p8766j24903j6223m6988j26933
$$ 300995 251324 358901 389752 465421 584322 700365 621599 496696 480473 433485 306552
12477C06552J07062R4469j46004k23427q8116J15991J47067l5787J44342R109
$$ 306552 413614 508083 362079 138652 50536 166527 313594 277807 422149 431258
12467D31258p9564n6350N576k5531j4215L4871N0912k8594M9222r8813j86399
$$ 431258 351694 295344 300920 275389 261174 296045 346957 318363 367585 268772 82373
12456H2373O5196O3817m2618J0830n03N7111P5408k3939n5367J7215J124j9480
$$ 82373 147569 211386 168768 179598 179095 236206 311614 287675 232308 249523 250647 231167
12444B31167k5144m5477n8525n5515Q1639L3932j0379R4338Q9254K3221p0846
$$ 231167 206023 160546 102021 46506 128145 162077 151698 246036 335290 358511 287665
12433B87665o421l6017J3163J50501j1033n7642j28906j1567J33627P958l1451
$$ 287665 281244 245227 258390 408891 397858 340216 211310 199743 333370 341328 309877
12422C09877N0190L4827j13095p9951N5748n2577j73643m0813M1535P7022J86605
$$ 309877 360067 394894 281799 201848 257596 205019 31376 -9437 32098 109120 295725
12411B95725L4325n4652L0619o9029q6726j9965N4364N7808k2192k23102j4958
$$ 295725 330050 275398 306017 236988 150262 130297 184661 242469 220277 -2825 -17783
12400a7783J58159P8883J00622N8930o086J11664l0259j8681J93042K1065m0591
$$ -17783 140376 219259 319881 378811 372725 484389 454130 435449 628491 649556 608965
12389F08965j59489r0397M1019M5198J233L9968j63201M5289O6163M6801o9276
$$ 608965 449476 359079 400098 445296 446529 486497 323296 368585 434748 481549 412273
12378D12273p1973Q1756j61417j39283l1320J18951M742Q6524n9540o5102m6140
$$ 412273 340300 422056 260639 121356 90036 208987 213729 300253 240713 175611 129471
12367A29471p710O3936O0344N6237j4532o2365O7325m7751j4832J8408L6222l5604
$$ 129471 121761 185697 246041 302278 287746 225381 292706 244955 230123 248531 284753 249149
12355B49149J5819j4942M1791Q7137p8100r3535L9134J03502Q4344L0972m4925
$$ 249149 264968 250026 291817 378954 300854 207319 246453 349955 434299 465271 420346
12344D20346m6459k3087m7404l4173Q6514L94K4631J12742m4194m4477p183R435
$$ 420346 373887 350800 303396 269223 355737 356131 380762 493504 449310 404833 397650 407085
12332D07085j13811k8697J06845n0172l3215L6519j61889K397N559m1228M7373
$$ 407085 293274 264577 371422 321250 288035 324554 162665 165062 170621 129393 176766
12321A76766O8536J17471K3236n7195M08r5505q7794N0783r6990J6710K3174J66843
$$ 176766 245302 362773 386009 328814 329222 233717 145923 196706 99716 116426 139600 306443
12309C06443Q9862O5398J55817k577J48413J85397J38563J21181K6955m1596k7843
$$ 306443 396305 461703 617520 614943 763356 948753 1087316 1208497 1235452 1193856 1166013
12298A166013j73527j04605r3144N844N0823j31555p5606j72661k1197K1101P3310
$$ 1166013 992486 887881 794737 800581 851404 719849 644243 471582 450385 471486 544796
12287E44796J22199J92096J15707P526k5353N616J48665J23996l5756l9734m4321
$$ 544796 666995 859091 974798 982324 956971 962587 1111252 1235248 1199492 1159758 1115437
12276A115437O2622J14295J67632J55420P3607j47775q4046p8587q7576j34779
$$ 1115437 1178059 1292354 1459986 1615406 1689013 1541238 1457192 1378605 1291029 1156250
12266A156250p896k6089r4676o7303J05685j637K0584j25347k12483j26376r6314
$$ 1156250 1148354 1122265 1027589 960286 1065971 1064334 1084918 959571 747088 620712 524398
12255E24398J04626P8223n8738k6911j06539q9526J46626R7018J66522J13852
$$ 524398 629024 707247 648509 621598 515059 425533 572159 669177 835699 949551
12245I49551P5999R0624J68722K07963J20593K2893r1847k35113j04597o2112
$$ 949551 1025550 1116174 1284896 1492859 1613452 1636345 1544498 1309385 1204788 1142676
12235A142676j61033k66242k44084J8533Q9891l7973o6263n8022j03889j13948
$$ 1142676 981643 715401 471317 489850 579741 541768 475505 417483 313594 199646
12225A99646l0298m7788j11556o0411j64231K4845J47102j71932o913L9970N5312
$$ 199646 169348 121560 10004 -50407 -214638 -189793 -42691 -214623 -221536 -181566 -126254
12214a26254q1037k6582K3262r590J30123J2860o2121p7935N2380M1655j2387
$$ -126254 -207291 -233873 -210611 -220201 -90078 -77218 -139339 -217274 -164894 -123239 -135626
12203a35626P308q2820j16528M4825J24617J87374Q8913q6528L1068l6580M3139
$$ -135626 -128318 -211138 -327666 -282841 -158224 29150 118063 31535 62603 26023 69162
12192F9162r6191r9143J52866J30274q5338O4984O9707j08249j35016N7534P6201
$$ 69162 -27029 -126172 26694 156968 71630 136614 206321 98072 -36944 20590 96791
12181I6791q4994N2436J86648k2293k2614M0467L8819r806L5119Q9208N8580m6839
$$ 96791 11797 64233 250881 228588 205974 246441 285260 275454 310573 399781 458361 411522
12169D11522j40056p4551q1923L6597P8330J3391q4905P8518l2855o5680J1736
$$ 411522 271466 196915 114992 151589 229919 243310 158405 236923 204068 138388 150124
12158A50124j13446j66750l1744J10361O7306j1810J5194n7794L6728J1197R3745
$$ 150124 36678 -130072 -161816 -51455 15851 4041 19235 -38559 -1831 9366 103111
12147A03111R8672o9453k576L0876N4479O0784R3673N6115J51328r7926o2103
$$ 103111 201783 132330 129754 160630 215109 275893 369566 425681 577009 479083 416980
12136D16980J10025M4862l4067K24597N0735j8061k8474j34961j7047O6042n2845
$$ 416980 527005 571867 537800 762397 813132 795071 766597 631636 614589 680631 627786
12125F27786J57817p3980p6539p6976q5614j2127j33712j88471O8550l5580j67031
$$ 627786 785603 711623 635084 558108 472494 460367 326655 138184 206734 171154 4123
12114D123j28176j0016R3045J3546L4802j08310q8678K2216K9493N585P0404Q1520
$$ 4123 -124053 -134069 -41024 -27478 7324 -100986 -189664 -167448 -137955 -132370 -61966 19554
12102A9554P8582j3355O9450M7868o6254m2158J29925J24917J35132L0596p5324
$$ 19554 98136 84781 154231 202099 135845 93687 223612 348529 483661 514257 438933
12091D38933m5709k8401P2850o3434l4056R8029R9286m0541N3085J63664K24k1505
$$ 438933 393224 364823 437673 374239 340183 438212 537498 496957 550042 713706 713930 692425
12079F92425q3227K2525O7401N0677P480m8352j42372J621L2946J9484j06593
$$ 692425 609198 631723 699124 749801 757281 708929 566557 568178 601124 620608 514015
12068E14015k8022K83024L45797J40410J48678J44338O8083J07859l9073k41173
$$ 514015 485993 769017 1114814 1255224 1403902 1548240 1616323 1724182 1685109 1443936
12058A443936k24888j05915j10563j36301R530j624r2132k2141L4139K11423M1287
$$ 1443936 1219048 1113133 1002570 866269 875799 874175 782043 759902 794041 1005464 1046751
12047A046751j49679l6486K31247l7878k27483N1496J3470P3626K4035J06699
$$ 1046751 897072 860586 1091833 1053955 826472 877968 891438 965064 989099 1095798
12037A095798l7569O4450K22100K77215Q8675n2324j731K9573j2634r6430j29988
$$ 1095798 1058229 1122679 1344779 1621994 1710669 1658345 1656614 1686187 1673553 1577123 1447135
12026A447135J16653J2034j21811o9844m8236k2823k5839r0661j39428n9808J9498
$$ 1447135 1563788 1575822 1454011 1384167 1335931 1313108 1287269 1196608 1057180 997372 1016870
12015A016870J12288m5209J47368K07384K40764M91028O56995O58658P77751N02474
$$ 1016870 1129158 1083949 1231317 1438701 1679465 2170493 2827488 3486146 4263897 4766371
12005D766371P0217j91644l91419m70894n65118n29944m38423k46994j09458k65646
$$ 4766371 4836588 4644944 4253525 3782631 3217513 2687569 2249146 2002152 1892694 1627048
11995A627048k11367j32810j35824o2310k00261j95989J3619L5957p6129O6334
$$ 1627048 1415681 1282871 1147047 1084737 884476 688487 702106 738063 661934 728268
11985G28268q168N0261l605J9565q3995k9770L436J72637J1814j23845K1376Q2559
$$ 728268 720100 770361 766756 786321 702326 672556 675992 848629 860443 736598 757974 840533
11973H40533J14941O5168J49125K83229K47754N62209M22858M25254O96052P85544
$$ 840533 955474 1020642 1169767 1452996 1700750 2262959 2685817 3111071 3807123 4592667
11963D592667P69732M08766Q5259j27288k18118k40737m14643n02326o25659o07893
$$ 4592667 5362399 5771165 5856424 5729136 5511018 5270281 4855638 4353312 3727653 3119760
11953C119760m42001m44260l90476k89575k07789k81178l36033m8905o2424r0486
$$ 3119760 2677759 2233499 1843023 1553448 1345659 1064481 728448 679543 617119 526633
11943E26633n0977J99538P4685L4612o2148q7548j10538m4592J85224J01932j17593
$$ 526633 475656 675194 749879 784491 722343 634795 524257 479665 664889 766821 649228
11932F49228j19668j22470r6661J01297n2813R5346R6888Q5413J62077J45668
$$ 649228 529560 407090 310429 411726 358913 454259 551147 636560 798637 944305
11922I44305L62652L55856M71938Q44971O57632M68089L01481p8693m04422m75402
$$ 944305 1306957 1662813 2134751 2979722 3637354 4105443 4406924 4328231 3923809 3448407
11912C448407o77139n84843m91303l22385j31736j90500k77917k27669p1358p5285
$$ 3448407 2771268 2186425 1695122 1372737 1241001 1050501 772584 544915 473557 398272
11902C98272j11726j1317J21285K4226l3980j78394m6229J24193J1045q4154j49449
$$ 398272 286546 275229 396514 420740 386760 208366 162137 286330 297375 213221 63772
11891F3772L1807J83227K7754l6558m203j42928m0595L5456l5925n5902M8097
$$ 63772 95579 278806 306560 270002 265799 122871 82276 117732 81807 25905 74002
11880G4002O0607r0728R172L3028J13137n4023j03924K2680O1464J6553K42O8860
$$ 74002 134609 43881 53053 86081 199218 145195 41271 63951 125415 141968 142210 211070
11868B11070Q8837r2263P3176J31705m5383r82q3180l6914n3341O8848J13131
$$ 211070 299907 207644 280820 412525 367142 366160 282980 246066 192725 261573 374704
11857C74704L2888L0776N615o169P9394O7419n4275l1414O118k5545K8527J15544
$$ 374704 407592 438368 443983 437814 517208 584627 530352 498938 505056 479511 508038 623582
11845F23582n1788o7465l8743p5463j46210j49124K635Q7973O5494l4328L2371
$$ 623582 571794 504329 465586 390123 243913 94789 97424 185397 250891 216563 248934
11834B48934N217K397M899k7119j5836n8096m6187j3269Q8181O6748m0606j45030
$$ 248934 254151 256548 261447 234328 218492 160396 114209 100940 189121 255869 215263 70233
11822G0233P7223J98950N91p4245p6825J47094K11909p9263o3195o1446k6289
$$ 70233 147456 346406 346997 272752 195927 343021 554930 475667 412472 351026 324737
11811C24737L5501Q6667K3245L4724K8327m0345p732j8600m2955j1507l6377o843
$$ 324737 360238 446905 470150 504874 533201 492856 485124 466524 423569 412062 375685 368842
11799C68842n0958L3202M7153J52562j1855K2540O284l9890m5836l229J04888
$$ 368842 317884 351086 398239 550801 538946 561486 567770 527880 482044 478815 583703
11788E83703n5425q9781p2247n5789k1907L4429J85345J09636M8051o1522j29114
$$ 583703 528278 438497 366250 310461 288554 322983 508328 617964 666015 604493 475379
11777D75379K821K7837j8217o4639J02891N3710P9672j04870J50809J62417J77769
$$ 475379 478200 506037 487820 423181 526072 579782 659454 554584 705393 867810 1045579
11766A045579m703o5771R3798R1951P6889L4363J90171R2530Q4535J02644j5828
$$ 1045579 1040876 975105 1068903 1160854 1237743 1272106 1462277 1554807 1639342 1741986 1726158
11755A726158M2060r3754j00006l6410j18036j87714j32006K2208p567l9492O378
$$ 1726158 1768218 1674464 1574458 1538048 1420012 1232298 1100292 1122500 1114933 1075441 1081819
11744A081819M3739Q7138O5180J48790J19052P9614P3136o0065J9987o7855j73554
$$ 1081819 1125558 1212696 1277876 1426666 1545718 1625332 1698468 1638403 1658390 1590535 1416981
11733A416981r6556M5092M8332o0491l1918j8864r959o8695q6172M3477J32196
$$ 1416981 1320425 1365517 1413849 1353358 1321440 1302576 1292617 1223922 1137750 1181227 1313423
11722A313423Q6282M745n0663J3645m293J19619J22214L3003K6399J23537J67767
$$ 1313423 1399705 1404450 1353787 1367432 1363139 1482758 1604972 1637975 1664374 1787911 1955678
11711A955678J4333J79513J11251K00735L47907L27013P0340k2009l5089j34127
$$ 1955678 1970011 2149524 2260775 2461510 2809417 3136430 3206770 3184761 3149672 3015545
11701C015545m0308p5195j80393o0455J5583j5201N0855m3906p6078k1099p4074
$$ 3015545 2975237 2900042 2719649 2659194 2674777 2659576 2710431 2666525 2590447 2569348 2495274
11690B495274M6816l1354J63652n1510j3324J38468J75903K9438k3660K08615
$$ 2495274 2542090 2510736 2674388 2622878 2609554 2748022 2923925 2953363 2929703 3138318
11680C138318J22745J27786J93942J06533K26096J89230J82843J89566K31779
$$ 3138318 3261063 3388849 3582791 3689324 3915420 4104650 4287493 4477059 4708838
11671D708838J46819K20356K43593K24040K63393J44206J25662L24111M50379
$$ 4708838 4855657 5076013 5319606 5543646 5807039 5951245 6076907 6401018 6851397
11662F851397M90531M53509N90820O93100R56860J135763J212999J416718J797608
$$ 6851397 7341928 7795437 8386257 9079357 10036217 11171980 12384979 13801697 15599305
11653A5599305K163261K631317L081957L598799M294955N609792P728382J0900102
$$ 15599305 17762566 20393883 23475840 27074639 31369594 36979386 44707768 55607870
11645E5607870J5486543K1432500K8825711L6787439M1999826M0291155K9270367
$$ 55607870 71094413 92526913 121352624 158140063 200139889 240431044 269701411
11638B69701411J2354545n043157j9070781k8070093l1488130l0376696k6056248
$$ 269701411 282055956 277012799 257942018 229871925 198383795 168007099 141950851
11631A41950851j9980643j3973919q647620m010871Q6475M007183P349318R947219
$$ 141950851 121970208 107996289 99348669 95337798 95424273 99431456 106780774 116727993
11623A16727993J1221978J1212815J0091105Q287495N548484K693656o5955j767839
$$ 116727993 127949971 139162786 149253891 157541386 163089870 165783526 165717571 163949732
11615A63949732r05274K502516Q397427J5861761K3224476K8106871K8106539
$$ 163949732 163044458 165546974 173944401 189806162 213030638 241137509 269244048
11608B69244048K1558377J0034302k921166j3869179k0465887k1970930j9549825
$$ 269244048 290802425 300836727 297915561 284046382 263580495 241609565 222059740
11601B22059740j4741219r761650o323463m341826m075339n355970p760207j0651703
$$ 222059740 207318521 197556871 191233408 186891582 182816243 177460273 169700066 159048363
11593A59048363j2869218j4109461j3928631j2436052j0069347p184678m117640
$$ 159048363 146179145 132069684 118141053 105705001 95635654 88450976 84333336
11586H4333336q72252K719367P110565J2238957J8341083K5195008L1266800L3688638
$$ 84333336 83461084 86180451 93291016 105529973 123871056 149066064 180332864 214021502
11578B14021502K8554624J5637737j083893j6137130k5939741l0834079l1458394
$$ 214021502 242576126 258213863 257129970 240992840 215053099 184219020 152760626
11571A52760626k8583296k3662809j8347491j3714967j0316557p867769o225411
$$ 152760626 124177330 100514521 82167030 68452063 58135506 50267737 44042326
11564D4042326n240424m661523m192091l746335l301471k809759k329860j813690
$$ 44042326 38801902 34140379 29948288 26201953 22900482 20090723 17760863 15947173
11556A5947173j526533j304554j026183j026551q91533p00504o01269n34437n15170
$$ 15947173 14420640 13116086 12089903 11063352 10171819 9471315 8870046 8335609 7820439
11547G820439n06630m14888l53441l22196l75165k32298k72919k80325k90121
$$ 7820439 7313809 6898921 6545480 6223284 5848119 5615821 5342902 5062577 4772456
11538D772456j53156q2072j27185k01930j60654k43284j91620j24434o6870L4846
$$ 4772456 4619300 4537228 4410043 4208113 4047459 3804175 3612555 3488121 3421251 3456097
11528C456097K9551r5117j08842j68556n0566P4825j82136k32901j66000j8906
$$ 3456097 3485648 3390531 3281689 3113133 3062567 3137392 2955256 2722355 2556355 2537449
11518B537449J17071O3819j16273j58925q245r1566j11827q4716n1997r1616o0318
$$ 2537449 2654520 2718339 2602066 2443141 2434896 2343330 2231503 2146787 2094790 2003174 1942856
11507A942856L6737N3453m2249j28833j48165J43645Q9246l5204l6120o4199j61525
$$ 1942856 1979593 2033046 1990797 1861964 1713799 1857444 1946690 1911486 1875366 1811167 1649642
11496A649642j72744Q058J37621M5937m3163l5449l0268p4743l2432p910r9724
$$ 1649642 1476898 1484956 1622577 1668514 1625351 1589902 1559634 1484891 1452459 1444549 1344825
11485A344825j4748o4708N4929l216n4507j6466L3400j44646l0202j2015J0511
$$ 1344825 1330077 1265369 1320298 1317082 1262575 1246109 1279509 1134863 1104661 1092646 1103157
11474A103157J30916K065Q2788O8220O0492j3380j7333L0280m913j20787j59340
$$ 1103157 1234073 1236138 1318926 1387146 1447638 1434258 1416925 1447205 1442292 1321505 1162165
11463A162165J06683J20066j3858m641k904R1987j13215l155Q2529K0737l1262
$$ 1162165 1268848 1388914 1375056 1370415 1367511 1459498 1346283 1343128 1425657 1446394 1415132
11452A415132j10809K6987n7196j24301n1545j40390o0401J1938J1112O2541j12244
$$ 1415132 1304323 1331310 1274114 1149813 1098268 957878 897477 909415 920527 983068 870824
11441H70824l8365m7510P7869Q2482q214l2953m0667p6959J915N2051k3950O7066
$$ 870824 832459 784949 862818 945300 937086 904133 863466 786507 788422 840473 816523 883589
11429H83589N4767J51959p4377p5384P4871O2584J4287O7880J14165j01006q9893
$$ 883589 938356 1090315 1015938 940554 1015425 1078009 1092296 1160176 1274341 1173335 1083442
11418A083442m1534O4695j69622r0462J89757m695q1754m9322Q0373p503L4707
$$ 1083442 1041908 1106603 936981 846519 1036276 1031581 949827 900505 980878 973375 1008082
11407A008082M7621J0915n3758j76880J5168k3801N709k9257M747N3561k3121
$$ 1008082 1055703 1066618 1012860 835980 851148 827347 833056 803799 808546 862107 838986
11396H38986q6454p437k5962k6558M4337J5602l832l1174k0763l6753n0933j12656
$$ 838986 752532 745095 719133 692575 736912 752514 748682 717508 696745 659992 609059 496403
11384D96403o9783J12254K1503N5469m7547Q9940J57890K0759k2784o9501j47211
$$ 496403 426620 538874 560377 615846 568299 658239 816129 836888 814104 744603 597392
11373E97392n9100o7113J11361J40150J55461J21197j35065N5278J94871m2889
$$ 597392 538292 471179 582540 722690 878151 999348 864283 919561 1114432 1071543
11363A071543M1305J23302O8823K54969K38133L91415L66137K43846K28316J04586
$$ 1071543 1112848 1236150 1304973 1559942 1798075 2189490 2555627 2799473 3027789 3132375
11353C132375l9415k32279l85230m51223k74791r0404k8267k36909k38425j44463
$$ 3132375 3092960 2860681 2475451 2024228 1749437 1659033 1630766 1393857 1155432 1010969
11343A010969o3427n8895m0245k02762R290J5080J3772j1354M0037O3809M4838
$$ 1010969 947542 888647 848402 645640 654930 670010 683782 672428 712465 776274 821112
11332H21112j85155K4768K12353J27993k7262K9633r2212j57388j22466j03304
$$ 821112 635957 660725 873078 1001071 973809 1003442 911230 753842 631376 528072
11322E28072K6663p8107j63877r6814j32990P3402J87080M7197Q3692j26580k0067
$$ 528072 554735 476628 312751 215937 82947 156349 343429 390626 474318 347738 327671
11311C27671j43009L9982r856Q9575R2072o354J8548Q0475m8142j5863O064J6630
$$ 327671 184662 224644 214788 304363 396435 390081 408629 489104 440962 425099 431163 447793
11299D47793l2768n3439J1365j8345n7003k6117O3653Q4011l319J06657m3293
$$ 447793 415025 361586 372951 354606 297603 271486 335139 419150 415831 522488 479195
11288D79195J7179J29857J7923j17289n8327r098M3262o511j28564l9150J3199
$$ 479195 496374 626231 644154 526865 468538 459440 502702 496191 367627 328477 341676
11277C41676N2564N6409r8435L1706J53124p7686q4789j06580r1757j3002o9090
$$ 341676 394240 450649 352214 383920 537044 459358 374569 267989 176232 163230 94140
11266I4140L0526P7571n9688N3662K12843j7589l5384L2442P908j16515k6235
$$ 94140 124666 202237 142549 196211 409054 391465 356081 388523 396431 279916 253681
11255B53681M6789L6970j9855l393o2487N1291K79335M1503J40106Q6429N2874
$$ 253681 300470 337440 317585 314192 251705 302996 582331 623834 763940 850369 903243
11244I03243K7121j11408l13579k61230m7825m6413Q4907J78113k5811j39745
$$ 903243 930364 818956 505377 244147 196322 149909 234816 412929 387118 247373
11234B47373o5031n9515j83375J4089J28831J09756R6787p9041k575J56058l6193
$$ 247373 182342 122827 -60548 -46459 82372 192128 288915 209874 207299 363357 327164
11223C27164j18263L8777K2305j0256k5810l785J1613M5293J09650J21125J90940
$$ 327164 208901 247678 269983 259727 233917 230132 241745 287038 396688 517813 708753
11212G08753J92192J75057J70758J56020m3746k5773K48987J16378k16497l22282
$$ 708753 900945 1076002 1246760 1402780 1359034 1333261 1582248 1698626 1482129 1159847
11202A159847k20646q1530k0286j26468p3688M7400J6627j1678J60698J53096
$$ 1159847 939201 857671 837385 710917 637229 684629 701256 689578 850276 1003372
11192A003372N9732m9721j76229K0494J18454k0102K3625P6105n794j4272J90079
$$ 1003372 1063104 1013383 837154 857648 976102 956000 979625 1055730 1049936 1035664 1225743
11181A225743J16222L5497O9769J10309L4944Q9137N7174J8573j02037p1133o7751
$$ 1225743 1341965 1377462 1447231 1557540 1592484 1681621 1738795 1757368 1655331 1584198 1516447
11170A516447M0544j3078j2532j44487k40369R897p1877j32404o8126p6611j19327
$$ 1516447 1556991 1543913 1531381 1386894 1146525 1156422 1084545 952141 884015 807404 688077
11159F88077j08699r0814m5972J7176J45778O1676J48943N390J50747J89232P8555
$$ 688077 579378 488564 442592 459768 605546 667222 816165 821555 972302 1161534 1240089
11148A240089K6335Q2524J31518n9111P6044p8221j97794k27819k03655m9940
$$ 1240089 1266424 1348948 1480466 1421355 1497399 1419178 1221384 993565 789910 739970
11138G39970m5159j7911j552q583p687m0491K2991o4102O2183K401P6490J17961
$$ 739970 694811 676900 675348 666765 659078 618587 641578 577476 639659 642060 718550 836511
11126H36511J61115K01060K60996K44931M24658P71767R51230J403630J958595
$$ 836511 997626 1198686 1459682 1704613 2129271 2901038 3852268 5255898 7214493
11117G214493K012441J649144J389770K052279K571626K206285O19540p45768
$$ 7214493 9226934 10876078 12265848 14318127 16889753 19096038 19715578 18969810
11109A8969810j002293q47755j128303j919771k060459j987688j848234j510501
$$ 18969810 17967517 17119762 15991459 14071688 12011229 10023541 8175307 6664806
11101F664806j201507j000129p17130o06339n16393l94264j53370k08829j91084
$$ 6664806 5463299 4463170 3746040 3139701 2623308 2229044 2075674 1866845 1675761
11092A675761l16686l28674j95793K8652J1476j72926q0676l6047L2283n1905
$$ 1675761 1359075 1030401 834608 863260 874736 701810 621134 585087 617370 565465
11082E65465m0210N6878o0487j05725N7181m1997j27699l1250j35010J649J39902
$$ 565465 525255 582133 521646 415921 473102 431105 303406 272156 137146 138795 278697
11071B78697o7237J48784p235Q188r1160j63612r1911n657J15370j5082P3095
$$ 278697 211460 360244 353009 361197 270037 106425 14514 8857 124227 109145 182240
11060A82240M4750j7002j59040r4474O17R4397J32979K4487k9851K7891j53842
$$ 182240 226990 209988 50948 -43526 -42909 51488 184467 208954 179103 206994 53152
11049E3152p472K808j53141k0509J46299o6903K1793L14782j1437j14533J0942
$$ 53152 45680 48488 -104653 -125162 21137 -45766 -23973 290809 279372 164839 175781
11038A75781k16896n6917J33131J18683O557l5129P562j54998j3077k8983J16654
$$ 175781 -41115 -98032 35099 153782 160339 125210 132772 -22226 -35303 -64286 52368
11027E2368K39512Q4461m7770l1885k0673j69359j32973P9932Q8318J7909l1207
$$ 52368 291880 376341 328571 296686 276013 106654 -26319 53613 141931 159840 128633
11016A28633n0865n2082m6756P6558k5897q5158o3798O7732R9691M7775p5051
$$ 128633 77768 25686 -21070 55488 29591 -55567 -119365 -51633 48058 95833 20782
11005B0782j67098N2674J03566Q3548L5683P3418K1780O066m179N2948M0980k7811
$$ 20782 -146316 -93642 9924 93472 129155 202573 224353 230419 226240 279188 320168 292357
10993B92357O818N8174K95j05175j46071K2036k2442k9078l9759j0303L0828q3875
$$ 292357 299175 357349 357644 252469 106398 128434 105992 76914 37155 26852 57680 -26195
10981b6195M9166L3110O3550k1271k3246m0225l4526j48098J5310J22434J67383
$$ -26195 22971 56081 119631 98360 75114 34889 363 -147735 -132425 -9991 157392
10970A57392J1741j56080k7155O1845J6376M2706Q3098j2153J554p6799q4591
$$ 157392 169133 13053 -14102 47743 64119 106825 189923 177770 179324 102525 17934
10959A7934k3161k0141M1024J32613R2704j69763j57588j16294J46846Q6216Q0869
$$ 17934 -5227 -25368 15656 148269 240973 71210 -86378 -202672 -55826 30390 111259
10948A11259n2567l3751P694P3557K9041j60678K9152P3940Q6261O6237J20459
$$ 111259 58692 24941 32635 106192 135233 -25445 3707 77647 163908 230145 350604
10937C50604q0772l0239p4157q50j7675J5691j27397M7732J19256j02220l1259
$$ 350604 269832 239593 165436 164586 146911 162602 35205 82937 202193 99973 68714
10926F8714k3681n0485m1610P4469Q3958p905l6256J10129J02390N4422l7021
$$ 68714 45033 -5452 -47062 27407 111365 103460 67204 177333 279723 334145 297124
10915B97124q8075q2119P527k7353K4437j39548j18726q968J5230o1680k1741
$$ 297124 209049 126930 134457 107104 131541 -8007 -126733 -135701 -120471 -182151 -203892
10904b03892M8124K83J9126J55382J12894J9379j02758l7737L2748k4285L5463
$$ -203892 -155768 -155485 -136359 19023 131917 151296 48538 10801 43549 19264 54727
10893E4727q711q4812k2732J2755L6166k2638N37K3209q2206O1778J94993k9236
$$ 54727 46016 -38796 -61528 -48773 -12607 -35245 -34708 -11499 -93705 -31927 163066 133830
10881A33830r382O7638n7670p3421N5422k1860q9263J2577R0109Q6035q8835j4359
$$ 133830 124448 192086 134416 60995 116417 94557 5294 17871 107980 194015 105180 90821
10869I0821l6878n5552L3072N092p2643n8419L3800L1997L4389J16639P0818o9503
$$ 90821 53943 -1609 31463 36555 -36088 -94507 -60707 -28710 5679 122318 193136 123633
10857A23633l0659l0290N3482p743n6363l7808n5177N9506N2761O3820o857r1450
$$ 123633 92974 62684 116166 108423 52060 14252 -40925 18581 71342 135162 128305 36855
10845C6855j1959K49995M6107k03178l5138k8509l1088m1677q3949q0127N6818
$$ 36855 24896 274891 320998 117820 82682 54173 23085 -18592 -102541 -182668 -125850
10834a25850R0612N5210j1618N2145j6877J91278Q4488n9586n1033r6353j04462
$$ -125850 -35238 19972 8354 60499 43622 234900 319388 259802 208769 112416 7954
10823G954N0280k374K3271N8903m1147L6021k6114L0922N0636r1073p8137j8732
$$ 7954 58234 55860 79131 138034 96887 132908 106794 137716 188352 97279 19142 410
10811D10R2844K167M3852O2595j22791r1400K953P1790J6547j087J04962o5169
$$ 410 93254 95421 139273 201868 79077 -12323 -9370 62420 78967 77880 182842 117673
10799A17673L5930M4123N4637M1942p6489o1660J1092j29069j86141Q0999J19753
$$ 117673 153603 197726 252363 294305 217816 156156 167248 38179 -147962 -66963 52790
10788E2790j1255m5804q1078R1951R1286l8381O0718m440j28118p2811o8340P0959
$$ 52790 41535 -4269 -85347 6604 97890 59509 120227 115787 -12331 -85142 -153482 -82523
10776h2523Q0870P1658J4699m3088p153k00123j04893J36426J17066k5219N1126
$$ -82523 -1653 70005 84704 41616 34463 -165660 -270553 -134127 -17061 -42280 8846
10765H846L5868K6954o8709L9710J31164J29678n5126j19920k9756j00683m5146
$$ 8846 44714 71668 2959 42669 173833 303511 248385 128465 98709 -1974 -47120
10754d7120N9471M4646k2390q7310K5584R2047M6458j8147k5255j8525N5859J01873
$$ -47120 12351 56997 34607 -52703 -27119 64928 111386 93239 67984 49459 105318 207191
10742B07191J00725l2280n6094j73460p8891L6862l5328k3537K3961M8446o4015
$$ 207191 307916 275636 219542 46082 -32809 4053 -31275 -54812 -30851 17595 -46420
10731d6420m3739Q0771o1272q6069J3914J64863M0385j03206o5504p4663N1413
$$ -46420 -90159 -9388 -70660 -156729 -142815 22048 62433 -40773 -106277 -180940 -129527
10720a29527R0405o662p9982r9759P0607R5090m6291R372L6932j45498J3377M6883
$$ -129527 -39122 -45784 -125766 -225525 -154918 -59828 -106119 -96747 -59815 -205313 -191936 -145053
10708a45053Q334O7474J45283k1040o174J82844N0622r3695Q2282j3544j36030
$$ -145053 -136719 -69245 76038 54998 48824 231668 282290 188595 270877 257333 121303
10697A21303q9076q5000o3460Q5852O2222J1425q4935N9875O4855L8236k3048
$$ 121303 32227 -52773 -116233 -30381 31841 43266 -41669 18206 83061 121297 98249
10686I8249J45217L0480j5495o8342n5467P2768n5131p9693L6711m5104O7350
$$ 98249 243466 273946 258451 190109 134642 207410 152279 72586 109297 64193 131543
10675A31543p5169R2771M135p5839j9876K8553k555J36282n3292l3759r4888j23518
$$ 131543 56374 149145 153280 77441 57565 86118 83563 219845 166553 132794 37906 -85612
10663h5612j22305j79969Q2118J09981L0649O0079L4120J48005O7232j0465P3061
$$ -85612 -207917 -387886 -305768 -195787 -165138 -105059 -70939 77066 144298 133833 206894
10652B06894P110j5801m2222k9601j65937o3050J26299J24437K5017r6858k9584
$$ 206894 214004 198203 155981 126380 -39557 -102607 23692 148129 173146 76288 46704
10641D6704m8415M5316J03458j3835M6001k266k9422m3196k1517R885l1940q5741
$$ 46704 -1711 43605 147063 133228 179229 176963 147541 104345 82828 92713 60773 -24968
10629b4968O7545O5643K167l9068j0732O4702n0930p3618j0638K1259N7702j41200
$$ -24968 42577 108220 110387 71319 60587 125289 74359 741 -9897 11362 69064 -72136
10617g2136n3328K2392Q4612m9309j06539J4272J35658j59221l3440J53955R0940
$$ -72136 -125464 -103072 -18460 -67769 -174308 -160036 -24378 -183599 -217039 -63084 27856
10606B7856l1189j00227J6527N9988Q5209P259j38404j61681O0536K2793q5772
$$ 27856 -3333 -103560 -87033 -27045 58164 65423 -72981 -234662 -174126 -151333 -237105
10595b37105J06014J30013P9917p202r1902M2492j3588K3057N5004l7267m2881
$$ -237105 -131091 -1078 78839 71637 -20265 22227 8639 31696 86700 49433 6552
10584F552J19989J2722p2886M6068J1333J4019r7079r7213M7962l9625J7114r6332
$$ 6552 126541 139263 66377 112445 123778 137797 40718 -56495 -8533 -48158 -31044 -127376
10572a27376m4433P0947M9026r832O5067J54762n3327j74854K2361K5564j21890
$$ -127376 -171809 -100862 -51836 -61668 3399 158161 104834 -70020 -47659 -22095 -143985
10561a43985q8483k9169K08131Q6811j9839K3727J00751L1988M4698R160o5265
$$ -143985 -232468 -261637 -53506 33305 13466 37193 137944 169932 214630 223790 158525
10550A58525o9366j33002Q3929J24776j15396k0391N48k4131Q44k2519k8746P9517
$$ 158525 89159 -43843 40086 164862 49466 29075 29623 5492 6336 -16183 -44929 34588
10538C4588J32579P6586J3935p526l8475r1865j00156n1092L9417P218J26566
$$ 34588 167167 243753 257688 250162 211687 119822 19666 -31426 7991 15209 141775
10527A41775k001j05579N6348M4831p3948m5280Q4464R6450n356N4174j05323
$$ 141775 139774 34195 90543 135374 61426 16146 100610 197060 191704 245878 140555
10516A40555j30289o9488l283K6595L8892K8777l7925j11411M5018R2020j4867
$$ 140555 10266 -59222 -62505 -35910 2982 31759 -6166 -117577 -72559 19461 4594
10505D594p7423l988k7467L0999P6128L0384R5203O7225m9566j9931j28392n4327
$$ 4594 -72829 -76817 -104284 -73285 2843 33227 128430 195655 146089 126158 -2234 -56561
10493e6561J34938P2014j09946j53116p3235R6687Q0556P7847Q2983j3888j6443
$$ -56561 78377 150391 40445 -112671 -185906 -89219 -8663 69184 152167 138279 121836
10482A21836j7386k7601n4006N4036P4562j87883j00386K3068O0908l9807P452
$$ 121836 104450 76849 22843 76879 151441 -36442 -136828 -113760 -52852 -92659 -85207
10471h5207P1704N0131J2392P3492R96N5413m071o8571m3971j00541J4784P16
$$ -85207 -13503 36628 49020 122512 123508 178921 174850 106279 62308 -38233 -23449 -22733
10459b2733R2027J48090m6436j72085n6116K8450j020J54162O1775j9334N5272
$$ -22733 69294 217384 170948 -1137 -57253 -28803 -29823 124339 186114 166780 222052
10448B22052j13700r5299j95052n5080Q7982J60518M2724R6793M0766O2912j12842
$$ 222052 108352 13053 -181999 -237079 -149097 11421 54145 150938 191704 254616 141774
10437A41774j3494P043K5543J33739Q8456l2359r4415J49373m4030L6755Q9722
$$ 141774 128280 135323 160866 294605 383061 350702 256287 405660 361630 398385 488107
10426D88107K00554K30393J59182K25570K24319R1368O3686K28075K54521Q7855
$$ 488107 688661 919054 1078236 1303806 1528125 1619493 1683179 1911254 2165775 2253630
10416B253630j53621j02083j47628o4445J59079j01967k43087j32806k03043k01317
$$ 2253630 2100009 1997926 1850298 1785853 1944932 1842965 1599878 1467072 1264029 1062712
10406A062712j92232k81579k45141m9372M2818j00158r4283O7836J02478o1941
$$ 1062712 870480 588901 343760 294388 337206 237048 142765 210601 313079 251138
10396B51138j43388N7945J36139k0646N1856n9794o3662M0514M1983k5441O7071
$$ 251138 107750 165695 301834 281188 333044 273250 209588 250102 292085 266644 333715
10385C33715n9505P1578N9852M7092J87946K0859n5540K19611L96399M60119L72013
$$ 333715 274210 345788 405640 452732 640678 661537 605997 825608 1222007 1682126 2054139
10374B054139K78484K65898L91624L31463K58617J76208K10001J2173k1244j20125
$$ 2054139 2332623 2598521 2990145 3321608 3580225 3756433 3966434 3978607 3957363 3837238
10364C837238M3262p8373k45399k46555k31900j49182j27241l00139l38478k16008
$$ 3837238 3880500 3802127 3556728 3310173 3078273 2929091 2801850 2501711 2163233 1947225
10354A947225l16493l00708m7715q6711j88913k53486j63760p2555K2873L5359
$$ 1947225 1630732 1330024 1282309 1195598 1006685 753199 589439 516884 539757 575116
10344E75116J01082K1977m6696j83784m4173q4110j55130n4405M4940R7058J40435
$$ 575116 676198 698175 651479 467695 423522 339412 184282 129877 174817 271875 412310
10333D12310J6966j1584M380q0227L5072K24961M4117J47257K08161J72142J70114
$$ 412310 429276 417692 422072 341845 376917 601878 645995 793252 1001413 1173555 1343669
10322A343669L13499K94952K11886J48526R4596K94607K17209J24076P7062m7681
$$ 1343669 1657168 1952120 2164006 2312532 2407128 2701735 2918944 3043020 3120082 3072401
10312C072401l6864p4902l05887m08419l23927j62684j18646k55306j56794j25369
$$ 3072401 3035537 2960635 2654748 2246329 1922402 1759718 1641072 1385766 1228972 1103603
10302A103603k70490j19224l8625j57582j69984j42015j45374J16634N1427M9552
$$ 1103603 833113 713889 675264 517682 347698 205683 60309 176943 228370 277922
10292B77922j3624p9284j005r4602m4593o9830L550R7314j18124J4658K9573p604
$$ 277922 264298 185014 184009 89407 44814 -25016 -21466 75848 -42276 -27618 1955 -5649
10280e649m196K1877J0987K9953k6842q0124k6150K3547Q3600P8084J9461q9557
$$ -5649 -9845 12032 23019 52972 26130 -53994 -80144 -56597 27003 105087 124548 34991
10268C4991m2412L148J9554k8492N9542J69325r809j25097p9343n4669J41688
$$ 34991 -7421 -4273 15281 -13211 46331 215656 205847 80750 1407 -53262 88426
10257H8426Q5553j45059M4933J8438M493J28788P0649j52248l3259l2200j9603
$$ 88426 173979 28920 73853 92291 96784 225572 296221 143973 110714 78514 58911
10246E8911j11n5400n0971l0556J24018J02599n8523p2569m7054k1284J32793
$$ 58911 58800 3400 -47571 -78127 45891 148490 89967 17398 -29656 -50940 81853
10235H1853N6405r9826P5497j01990j13163J04810P610o2288r131J10248k6336
$$ 81853 138258 38432 113929 11939 -101224 3586 11196 -51092 -60223 50025 23689
10224B3689J46624N2821j55173k7885J9606Q1589K6507L9262r020j07174j63128
$$ 23689 170313 223134 67961 40076 59682 141271 167778 207040 198020 90846 -72282
10213g2282P136R958J1966J83367j12702j17928N0438m7075L2994J54948j61183
$$ -72282 -65146 -55188 -43222 140145 27443 -90485 -40047 -87122 -54128 100820 -60363
10202f0363o1445K3811O4236k877q1094k094K1363M8652q5829n3283o2494O6486
$$ -60363 -121808 -97997 -33761 -36638 -117732 -119826 -98463 -49811 -135640 -188923 -251417 -184931
10190a84931P2473J37131J01744O1950j37362j83158K1139J93609K4745k7499
$$ -184931 -112458 24673 126417 188367 51005 -132153 -111014 82595 107340 79841
10180G9841j5932k093j00257P5813l5146r6238n0290K746L0672R5646j5349o7047
$$ 79841 63909 61816 -38441 37372 2226 -94012 -144302 -141556 -110884 -15238 -30587 -97634
10168i7634p0247J12898p2097J31753J06585N279k7023n0476j12J6419L7773r6279
$$ -97634 -167881 -54983 -127080 4673 111258 116537 89514 39038 38926 55345 93118 -3161
10156c161j8712N094l3484K3979o4236l9942M3683l8622j4296r9116K0818J06185
$$ -3161 -21873 -16779 -50263 -26284 -90520 -130462 -86779 -125401 -139697 -238813 -217995 -111810
10144a11810O5945P4200m3781l2989K439j16771n9141J63585L5697O7081L1573
$$ -111810 -45865 28335 -15446 -48435 -45996 -162767 -221908 -58323 -22626 44455 76028
10133G6028M2648o1803n8842o9447Q954L2265J25041q2452j8866L2501p9121k1876
$$ 76028 118676 56873 -1969 -71416 -62462 -30197 94844 12392 -6474 26027 -53094 -74970
10121g4970Q4373k7381l9440K2471k3967r5138J37388K3801p5157M628K0597o0507
$$ -74970 9403 -17978 -57418 -34947 -58914 -154052 -16664 7137 -68020 -63392 -42795 -103302
10109a03302o9414J20396J72468l3224j1373m5485j0916j0889L5071j8294k7678
$$ -103302 -172716 -52320 120148 86924 75551 30066 19150 8261 43332 25038 -2640
10098b640R0236M7552j8150m5595R4694J8498m9895K9850j6210q0310m5751R628
$$ -2640 87596 135148 116998 71403 166097 184595 134700 164550 148340 68030 22279 31907
10086C1907P7739j44408Q194N6259r1149M6268M7753o8396k4365k351L262p0773
$$ 31907 109646 -34762 -26568 29691 -61458 -15190 32563 -35833 -60198 -62549 -59287 -130060
10074a30060m3387L7735Q5206J56199R4320q6697J3285l2387k37373o3876P8984
$$ -130060 -173447 -135712 -50506 105693 200013 113316 126601 94214 -143159 -207035 -128051
10063a28051M1556o8196j6772N6116M0581q3756N9738J83510K7843m1752l2413
$$ -128051 -86495 -154691 -171463 -115347 -74766 -158522 -98784 84726 112569 70817 38404
10052C8404n043p1524P6216m1973L3231J03692l4462L0148q9792m3895l7947L9208
$$ 38404 33361 -38163 38053 -3920 29311 133003 98541 128689 38897 -4998 -42945 -3737
10040c737K2091l5389j2026R3337p1924j80700k8472K2430N4159J4581n3091m8348
$$ -3737 18354 -17035 -29061 64276 -7648 -188348 -216820 -194390 -140231 -125650 -178741 -227089
10028b27089L4395O7511p0178R3855L5577n932m7265N838Q5166M051N0967J16954
$$ -227089 -192694 -125183 -195361 -101506 -65929 -71861 -119126 -113288 -28122 -24071 26896 143850
10016A43850K8057L7427j2053l6758q8666k5937O6485p7639m903l795j46897r8168
$$ 143850 171907 209334 197281 160523 71857 45920 112405 34766 29863 26068 -120829 -218997
10004b18997N4995J06636L0858J42834K8675m3687k1321L4330q5062o7956J61508
$$ -218997 -164002 -57366 -26508 116326 145001 101314 79993 114323 29261 -38695 122813
9993A22813l4294j42253j8068r5063m7127R4091J29452Q2509J7122l0088n0697
$$ 122813 88519 -53734 -71802 -166865 -213992 -119901 9551 92060 109182 79094 28397
9982B8397N8406l2072j4397r2360l4353n9402K1970l2710m6875Q4754J18607L1110
$$ 28397 86803 54731 40334 -52026 -86379 -145781 -123811 -156521 -203396 -118642 -35 31075
9970C1075J4852n9272n4325Q4089J46443j5711j11742l8528j11020M0066J30943
$$ 31075 45927 -13345 -67670 16419 162862 147151 35409 -3119 -114139 -74073 56870
9959E6870j6924M3281L5706n9339m5822O0810n2353J0476j06931n627n2413o2361
$$ 56870 39946 83227 118933 59594 13772 74582 22229 32705 -74226 -79853 -132266 -194627
9947a94627J18781O7210N5195N4280L7897n1438j8018j4556o2454j554P9366m6761
$$ -194627 -75846 -8636 46559 100839 138736 87298 69280 54724 -7730 -9284 70082 23321
9935B3321r5769n6985P8602J01209l8922l9055M5049o933j1311m0844q033p980
$$ 23321 -72448 -129433 -50831 50378 11456 -27599 17450 10517 -794 -41638 -49671 -57651
9923e7651K2365j35842n7575J3878K53803O2881m8347o1678N5313J44015k1280
$$ -57651 -35286 -171128 -228703 -214825 38978 101859 53512 -8166 47147 191162 169882
9912A69882j13421j69059m6058K68676J72875M7766J25383M2982J55083J71802
$$ 169882 56461 -112598 -158656 110020 282895 330661 456044 499026 654109 825911
9902H25911J59565P8237J68752J46268P1996J6013m8025j26432R3988J04488j07768
$$ 825911 985476 1063713 1232465 1378733 1450729 1466742 1418717 1292285 1386273 1490761 1382993
9891A382993K17176M58825L82102K0354k71434k39795k24157l30880k78892j69730
$$ 1382993 1600169 2058994 2441096 2461450 2190016 1950221 1726064 1395184 1116292 946562
9881I46562j35024p1416j18352n5047j44082j31288O371J14847J1425j7667j36952
$$ 946562 811538 740122 621770 566723 422641 291353 297724 412571 423996 406329 269377
9870B69377j5498m0108O7090J59792J60749P7677n4507P3078Q6412J94579L09877
$$ 269377 253879 213771 280861 440653 601402 679079 624572 697650 784062 978641 1288518
9859A288518M00175L52472M12073M49566M17141M25869N89627Q01674J118911
$$ 1288518 1688693 2041165 2453238 2902804 3319945 3745814 4335441 5137115 6256026
9850F256026J078333M24399l49612p15539q54398r48352j051483p66753n65459
$$ 6256026 7334359 7758758 7409146 6693607 5839209 4890857 3839374 3072621 2507162
9841B507162n39717m23346k80798j11993p3914j8882q7442k6001R04j88204q7179
$$ 2507162 1967445 1544099 1263301 1151308 1077394 1058512 971070 945069 945973 757769 670590
9830F70590J30817p0619k08565k66630Q7223l2737o9678J00640J37683K6253k2907
$$ 670590 801407 730788 522223 255593 342816 310079 240401 341041 478724 504977 482070
9819D82070j6083P9572J46305K9647J48171J91597M16122L02975K21232L67409
$$ 482070 465987 545559 691864 721511 869682 1061279 1477401 1780376 2001608 2369017
9809B369017K91988K28203J32585K2555r7691k2198k07874j17073M6122n5140
$$ 2369017 2661005 2889208 3021793 3044348 2946657 2924459 2716585 2599512 2645634 2590494
9799B590494J1019N3613p1904k46374l27741n4320k11423k42040l21661j41282
$$ 2590494 2601513 2655126 2583222 2336848 2009107 1954787 1743364 1501324 1179663 1038381
9789A038381o7262j52418k69995p283o2388m3669R307K6268J8880J48960O3666
$$ 1038381 971119 818701 548706 541423 479035 435366 444673 470941 489821 638781 702447
9778G02447O0774o7483k9296p6353K4466j26047n1284N0830o2920j27735N1813
$$ 702447 763221 695738 666442 590089 614555 488508 437224 488054 425134 297399 349212
9767C49212J10462J88407J75598n5422J41139J76067J90420L68254K28150L4086
$$ 349212 459674 648081 823679 768257 909396 1085463 1275883 1644137 1872287 1906373
9757A906373J92060L1316q1227j90989j78032j31492j41793j00403O1462J045
$$ 1906373 2098433 2129749 2048522 1857533 1679501 1548009 1406216 1305813 1367275 1368320
9747A368320j95450j72514k16332j33952j51346q3827m9719n3392o0329N6888
$$ 1368320 1172870 1000356 784024 650072 498726 414899 365180 311788 251459 308347
9737C08347N4024j01905O4748K5891Q3628r744l3868j56448q1730K2857M5107
$$ 308347 362371 260466 325214 351105 434733 424989 391121 234673 152943 175800 220907
9726B20907O4467J0126K25j19876P61j04669j4253M6277k2718n8019r2852N2453
$$ 220907 285374 295500 295725 175849 176610 71941 57688 103965 81247 23228 -69624 -17171
9714a7171J41844K16198K30907J46992R308M2203J364K9845m7260j72969Q3962
$$ -17171 124673 340871 571778 718770 728078 770281 771645 801490 754230 581261 665223
9703F65223M9489r7286j89859q3657m2536k29593k3642l7703N5127J96244n3304
$$ 665223 714712 617426 427567 343910 301374 71781 48139 10436 65563 261807 208503
9692B08503j04120j02208L6959L9631M3136O7410o0285j80625j31835J3515J37972
$$ 208503 104383 2175 39134 78765 121901 189311 129026 -51599 -183434 -169919 -31947
9681c1947O6810P953n1177j19568M0017l5170M4120J77913O4140L1261M1173M0313
$$ -31947 34863 42816 -8361 -127929 -87912 -123082 -78962 98951 163091 194352 235525 275838
9669B75838o7835j78348L8733Q003J35r7245r710L293l9100m4138r9266K8087
$$ 275838 208003 29655 68388 76391 76526 -20719 -30429 -27136 -66236 -110374 -209640 -181553
9657a81553J50081M4300l4606R0203M1829J9186R5414j36589q0613L4289K11318
$$ -181553 -31472 12828 -21778 68425 110254 129440 224854 88265 7652 41941 253259
9646B53259P7940j54933j03795r026j369q1507j45228m4232Q9681J10930M5752
$$ 253259 331199 176266 72471 63445 62076 -19431 -164659 -208891 -119210 -8280 37472
9635C7472m6249q2871j4961J10227P1472R0260O6285M8966q3802j21512l3495
$$ 37472 -8777 -91648 -106609 3618 75090 165350 231635 280601 196799 75287 41792
9624D1792O913o8567o445K607Q0540k3590q4256o2983l4741J23566J1590p0635
$$ 41792 48705 -19862 -26307 -23700 56840 33250 -51006 -113989 -148730 -25164 -13574 -84209
9612h4209O9653P9582O6364P2290J3194p7771K5938l9319n6275m0528N137j42054
$$ -84209 -14556 65026 131390 203680 216874 139103 165041 125722 69447 28919 34056 -107998
9600a07998q1576K9823n5211O6018R4658L5383Q477k212L2435n2849j47016p4376
$$ -107998 -189574 -159751 -214962 -148944 -54286 -18903 -10426 -12638 19797 -33052 -180068 -254444
9588b54444N0138J00823j333J02090R6805J03743j63209q2129p2437R054J46678
$$ -254444 -204306 -103483 -104816 -2726 94079 197822 34613 -47516 -119953 -110899 35779
9577C5779q687m3187J175M5373l8458M6401q698K3938k30039k7390l6119O9422
$$ 35779 27092 -16095 -14920 30453 -8005 38396 29698 53636 -176403 -203793 -239912 -170490
9565a70490O1541p6091N3721L933n5793N8392L6033L2710j48808k2471N7112o1361
$$ -170490 -108949 -185040 -131319 -127386 -183179 -124787 -88754 -56044 -204852 -227323 -170211 -231572
9553b31572K1703k1971n5292P0248Q3020J42294k9382r5586n7941J9224M9019
$$ -231572 -209869 -231840 -287132 -216884 -133864 8430 -20952 -116538 -174479 -155255 -106236
9542a06236M5938J14500L2345J6344R3593j21417k31912m6728O0851O6037p460
$$ -106236 -60298 54202 86547 102891 196484 75067 -156845 -203573 -142722 -76685 -84145
9531h4145k553P3079L3606L4683p7125P303J03232r9274o1360P2047K9026r1265
$$ -84145 -86698 -13619 19987 54670 -22455 -15152 88080 -11194 -72554 -507 28519 -62746
9519f2746o0670J23498M0514K3832L8048P9693r249k10317n1546J53997l0166
$$ -62746 -123416 82 40596 64428 102476 182169 172920 -37397 -88943 65054 34888
9508C4888k1693L7769J4409O7825m2436j54353J05103J27764p8003n3069k7147
$$ 34888 13195 50964 65373 133198 90762 -63591 41512 169276 91273 38204 11057
9497A1057O2038j4804M4016K20434L5968q5033l8227j9063j6531k00324O3042
$$ 11057 73095 58291 102307 322741 358709 273676 235449 216386 199855 -469 62573
9486F2573Q8048o0573j531m5884l0137N1304p4244j1093J16120N1095L1699q2548
$$ 62573 150621 90048 88517 42633 12496 63800 -10444 -21537 94583 145678 177377 94829
9474I4829L6922K945J40949K7804q4084j65807L5043N2369M2618k2910j42020
$$ 94829 131751 134696 275645 303449 219365 53558 88601 140970 183588 160678 18658
9463A8658j68906M5378J26625M3481O4553l7535L2952J22465o9317j4046K0795
$$ 18658 -150248 -104870 21755 65236 129789 92254 125206 247671 178354 164308 185103
9452A85103q3874j37973n3285M3255j0009J73881m9806j78986q8080R8258N3248
$$ 185103 101229 -36744 -90029 -46774 -56783 117098 67292 -111694 -199774 -101516 -48268
9441d8268N9082q6167l1785J1941N7936m5926p2815P776j5356P1259Q1863l712
$$ -48268 10814 -75353 -107138 -95197 -37261 -83187 -156002 -148226 -163582 -92323 -10460 -14172
9429a4172r6696K0115J42834P0833r0138k10099j11278p2992J11092J58639R9731
$$ -14172 -110868 -90753 52081 122914 32776 -177323 -288601 -361593 -250501 -91862 7869
9418G869L2177k085O0869k0105k5203j51071q3104P9403L5762l1844N8739J13066
$$ 7869 40046 37961 98830 78725 53522 -97549 -180653 -101250 -65488 -97332 -38593 74473
9406G4473J04940n334m7509r2199j42309m0700l0949M0636P3452J84736P2044
$$ 74473 179413 174079 126570 34371 -107938 -148638 -179587 -138951 -65499 119237 191281
9395A91281p6322j04036q3231j18675O9437J85210o394n3008P8943J89553o2002
$$ 191281 114959 10923 -72308 -190983 -121546 63664 57270 4262 83205 272758 210756
9384B10756j65570p6286P1659O8096p1035j02692K2545N129O8968M0078O1138
$$ 210756 45186 -31100 40559 108655 37620 -65072 -42527 -37398 31570 71648 132786
9373A32786L7143p1548n1588q1293j02978J23700Q2579r0397n7131J57414n4421
$$ 132786 169929 98381 46793 -34500 -137478 -13778 68801 -21596 -78727 78687 24266
9362B4266O203J1801P2038J8212n1735j8952Q7839j09546o479N9181J3566l1252
$$ 24266 30469 42270 114308 132520 80785 61833 149672 40126 33647 92828 106394 75142
9350G5142J9784N5352j4160j07869J14520m869r1414j18634j24N7160N0659J3324
$$ 75142 94926 150278 136118 28249 142769 137900 46486 -72148 -72272 -15112 35547 48871
9338D8871j04756N8855K706m4953k9513M9039P2496k2954O9351J06419o4043k32312
$$ 48871 -55885 2970 5676 -39277 -68790 -19751 52745 29791 99142 205561 141518 -90794
9326i0794j5020j3181O3941M9547o990p6955Q1436m787j9362p64M988J07709J24841
$$ -90794 -105814 -118995 -55054 -5507 -12497 -89452 -8016 -12803 -32165 -32929 -27941 79768 204609
9313B04609N4259j9630J4101p9132k9899l6037k295l076P433M8922o5350o8289
$$ 204609 258868 239238 253339 174207 144308 108271 105976 102900 110333 159255 93905 25616
9301B5616m2908J1889J10627j56635J5109P7315n9378p3831O2325P9405O7386
$$ 25616 -17292 -5403 105224 -51411 -36302 41013 -18365 -92196 -29871 49534 116920
9290A16920M5924j6569O2667k2042j660p6879q1981N4198N4304L9619j15162n2713
$$ 116920 162844 146275 208942 186900 185240 108361 26380 80578 134882 174501 59339 6626
9278F626J1353k0596P3899r103n021M2780J09828O2779L8740P5529l0372k5230
$$ 6626 17979 -2617 71282 62179 57158 99938 209766 272545 311285 386814 356442 331212
9266C31212K0333o4803j49027j31190J71383K40895k5626L1174j74156o0546k1421
$$ 331212 351545 286742 137715 6525 177908 418803 393177 424351 250195 189649 168228
9255A68228j3439p5411l371L2263q0578O0688J21225N5985J32375n43n7075m4534
$$ 168228 154789 79378 76007 108270 27692 88380 209605 265590 397965 397422 340347 295813
9243B95813J53852j7344j85143m6822k3879O7079j4324n5350j10725j0335M0568
$$ 295813 449665 432321 247178 200356 176477 243556 229232 173882 63157 52822 93390
9232I3390Q8049R4328J1748j14580N1460K5163M0683j917p3519O8752N3859O593
$$ 93390 181439 275767 287515 172935 224395 249558 290241 288324 214805 283557 337416 344009
9220C44009Q2980j15981j12205P3001J04159L6066K2092N2949L0535J04759p9988
$$ 344009 426989 311008 198803 271804 375963 412029 434121 487070 517605 622364 542376
9209E42376K6434J07655J81881l4851m1003R3143J50573J34724l4617M6636m2969
$$ 542376 568810 676465 858346 823495 782492 875635 1026208 1160932 1126315 1172951 1129982
9198A129982r6559l0272K4075K7101L1259R0400P1518J48898J51742n6537N4467
$$ 1129982 1033423 1003151 1027226 1054327 1085586 1175986 1247504 1396402 1548144 1491607 1546074
9187A546074J75255J56135J01775O5811J06775J87345K12362J7291J85276L43068
$$ 1546074 1721329 1877464 1979239 2045050 2151825 2339170 2551532 2568823 2754099 3097167
9177C097167L11023K10068J25600K65982L39220M68595N58746N52645N71779O31078
$$ 3097167 3408190 3618258 3743858 4009840 4349060 4817655 5376401 5929046 6500825 7131903
9167G131903Q56544R53385J123991J145611J429771J777643K183468K530101K947198
$$ 7131903 7988447 8941832 10065823 11211434 12641205 14418848 16602316 19132417 22079615
9158B2079615L233981L782596M484571M894452N147669N441015N230940M279665
$$ 22079615 25313596 29096192 33580763 38475215 43622884 49063899 54294839 58574504
9150E8574504L437580K526539J263175K68701q77306j834022k265104k681466
$$ 58574504 62012084 64538623 65801798 66070499 65193193 63359171 61094067 58412601
9142E8412601k845187k987750k943662k700346k592520k262170j998927j806847
$$ 58412601 55567414 52579664 49636002 46935656 44343136 42080966 40082039 38275192
9134C8275192j636216j357056j110050q47804o96644l72248m2230J02647L31138
$$ 38275192 36638976 35281920 34171870 33324066 32627422 32255174 32212944 32315591 32646729
9125C2646729N08336Q26110J170243J449277J844186K197040K641398K977369
$$ 32646729 33155065 33981175 35151418 36600695 38444881 40641921 43283319 46260688
9117D6260688L489147L829335M013522M075149L769470L277596K444274J237173
$$ 46260688 49749835 53579170 57592692 61667841 65437311 68714907 71159181 72396354
9109G2396354q8442j286623k563407l333937l959751m158352m256738m064719
$$ 72396354 72307912 71021289 68457882 65123945 61164194 57005842 52749104 48684385
9101D8684385l815936l425179l182201k862157k511298k054638j749708j554120
$$ 48684385 44868449 41443270 38261069 35398912 32887614 30832976 29083268 27529148
9093B7529148j212218j045758j019610q76049m42755m15593k73794K9207J56146
$$ 27529148 26316930 25271172 24251562 23375513 22932758 22517165 22243371 22272578 22428724
9084B2428724J64635M01765N00859O29393P37882M60585N77316P17003N27485
$$ 22428724 22593359 22995124 23495983 24125376 24863258 25323843 25901159 26618162 27145647
9075B7145647K98921J37018m4691k38144p58413j215618j381402j415229j502189
$$ 27145647 27444568 27581586 27536895 27298751 26540338 25324720 23943318 22528089 21025900
9066B1025900j479230j446128j621653j393488j414912j317465j020683r86629
$$ 21025900 19546670 18100542 16478889 15085401 13670489 12353024 11332341 10345712
9058A0345712r53029p78458o65756o96437n92562o02714m07487l05001l47026
$$ 10345712 9392683 8614225 7948469 7252032 6659470 6056756 5649269 5344268 4997242
9049D997242m42993l17110k20426k20425l57488m08022l78454j91577K8102l3230
$$ 4997242 4554249 4237139 4016713 3796288 3438800 3030778 2652324 2460747 2488849 2455619
9039B455619j00970j90182j33423n6023q9481j83069l7050K6094m2181k30527
$$ 2455619 2354649 2164467 2031044 1975021 1885540 1702471 1665421 1691515 1649334 1418807
9029A418807j07529R5847J47355m5731p1336j81992m4422J29316n9157o9691k8615
$$ 1418807 1311278 1407125 1554480 1508749 1437413 1255421 1210999 1340315 1281158 1211467 1182852
9018A182852o6400j8127j9871p5946q9595o155J3945j44084m1336J26011K8484
$$ 1182852 1116452 1098325 1078454 1002508 912913 906758 920703 776619 735283 861294 889778
9007H89778k24417j26519J88645L9791m5861n1450J49906R9992j90435o4401k8822
$$ 889778 665361 538842 727487 767278 721417 669967 819873 919865 729430 665029 636207
8996F36207j52767Q0037Q4896j17245k1690R2359J15935K7163O1527j40941J28942
$$ 636207 483440 563477 648373 531128 509438 601797 717732 744895 806422 665481 794423
8985G94423J074j14892L9208o8402n7379k3471r2025j36956q9082j0842J9568
$$ 794423 795497 680605 719813 651411 594032 570561 478536 341580 252498 241656 261224
8974B61224J78428m7407L7002l8581N3033J41965r7147o8842n9791k24876m9758
$$ 261224 439652 392245 429247 390666 443699 585664 488517 419675 359884 135008 85250
8963H5250J3031m3338M8287o8435R3982Q7213M6226Q8123j07182n1041R945k62
$$ 85250 98281 54943 103230 34795 128777 215990 262216 350339 243157 192116 202061 201799
8951B01799M3868l336M1191m1603n9479j1388k535M3188n0346j08217o2366r105
$$ 201799 245667 242331 283522 241919 182440 171052 168517 211705 161359 53142 -9224 -18329
8939a8329J42106Q2650O9634M0454j5981N7684M0271o5188N6508q357r0891o274
$$ -18329 123777 206427 276061 316515 300534 358218 398489 333301 389809 381452 290561 284287
8927B84287L2837K4305k9035j12963l3438N2656l0557o1948L3115l1989j2026
$$ 284287 317124 341429 312394 199431 165993 218649 188092 126144 159259 127270 115244
8916A15244p8062j5110N7338r0516P684N7774J20670o036N0265p6228O4042o4605
$$ 115244 37182 22072 79410 -11106 -3422 54352 175022 168986 219251 143023 207065 142460
8904A42460J04692j4078j52599M1406J0577J11195j02517J5015O9717l8419K7383
$$ 142460 247152 233074 80475 121881 132458 243653 141136 156151 225868 187449 214832
8893B14832M6464J4032k01887n7004Q3175J07218r7146N1797J07664j02747k04656
$$ 214832 261296 275328 73441 16437 99612 206830 109684 161481 269145 166398 -38258
8882c8258n0667N5480N6094M7281m7881o07Q0022M2999n7428j08387J9139K1727
$$ -38258 -88925 -33445 22649 69930 22049 21442 101464 144463 87035 -21352 -2213 19514
8870A9514n713J10118R6377o3760l797M2733N2635J9557l9882j37705M4355Q6365
$$ 19514 13801 123919 220296 156536 152739 195472 248107 267664 227782 90077 134432 220797
8858B20797Q8934J03571m8229j16391K1198q0412M4593P32j43625j03053N5511
$$ 220797 309731 413302 365073 248682 269880 189468 234061 234793 91168 -11885 43626
8847D3626L2351j01428P3724J78295p692k43402q7907J80657R6815n3386O2118
$$ 43626 75977 -25451 48273 226568 218876 -24526 -112433 68224 165039 111653 173771
8836A73771o826j58533p9683K810J0673O6067M9692m5314k4648p4513O8190P5596
$$ 173771 166945 8412 -71271 -68461 -57788 8279 57971 12657 -11991 -86504 -18314 57282
8824E7282l9396p2246P1593J27725k6330J1031Q2325N3815J36956k3274N3273
$$ 57282 17886 -54360 17233 144958 118628 129659 211984 265799 402755 379481 432754
8813D32754k28292p6359k825Q4874r3247N7376O5118r4958J00140K634J24427
$$ 432754 204462 128103 125278 210152 116905 174281 239399 144441 244581 247215 371642
8802C71642j912p6911j47425R1584j0575n2246Q3007r9157j12926O5896J33291
$$ 371642 369730 292819 145394 236978 226403 174157 257164 158007 45081 110977 244268
8791B44268K7806Q030J8630k5227m0323r670J48616K30491R7234J3934l1856j72688
$$ 244268 272074 280104 298734 273507 233184 223514 372130 602621 699855 713789 681933 509245
8779E09245j36704j25998p1171M1141J9087Q3337n4650j77792R132K2536Q5620
$$ 509245 372541 246543 175372 216513 235600 318937 264287 86495 95627 118163 203783
8768B03783J33949k0371j5802n6387j16082J8588N1552j6794J04935l6523l3580
$$ 203783 337732 317361 301559 245172 129090 147678 199230 182436 287371 250848 217268
8757B17268j801K1905n6672j7806n1515L751P1732N4691m9248p9533J94858J60683
$$ 217268 215467 237372 180700 162894 111379 115130 186862 241553 192305 112772 307630 468313
8745D68313P4206K01523Q6369k63639j11063M9002L1411J23539j69111j73000
$$ 468313 542519 744042 830411 566772 455709 504711 536122 659661 490550 317550
8735C17550j41855j07998J2490r3854R2880O3151k5496L6146l8558N583N3270
$$ 317550 175695 67697 80187 -13667 79213 142364 116868 153014 114456 120039 173309
8724A73309R3118J2774o3601N1535m6972m6214l3105O2691l9348p0575j06414
$$ 173309 266427 279201 215600 267135 220163 173949 140844 203535 164187 93612 -12802
8713a2802o6118J49058N5543K7048n9580P4799J46230J08315j28893j14769j07079
$$ -12802 -78920 70138 125681 152729 93149 167948 314178 422493 293600 178831 71752
8702G1752p7640P2477r67o2739Q4264L0482n8947p852r650K5339q2736L5510J17285
$$ 71752 -5888 66589 65622 2883 87147 117629 58682 50830 41180 66519 -16217 19293 136578
8689A36578R478L5174P0139k9058J29164R0603r4337j68550q1640j17385p7268
$$ 136578 146056 181230 251369 222311 351475 442078 347741 179191 97551 -19834 -97102
8678i7102k6535J00963J29189n651P9677N5145K8317J3799j06248j4167l1334
$$ -97102 -123637 -22674 106515 100864 180541 235686 264003 277802 171554 157387 126053
8667A26053l8772N2639K4343j31813K9479J12163k7753K104k8562Q029r814K0957
$$ 126053 87281 139920 164263 32450 61929 174092 146339 148443 119881 127910 118096 139053
8655A39053R0121K75946K75150L12669K60581J75224P7059j14434k34487j84624
$$ 139053 229174 505120 780270 1092939 1353520 1528744 1605803 1491369 1256882 1072258
8645A072258k03562j14728j252k69653j97726o022R7964p6543j00263j9971O2223
$$ 1072258 868696 753968 752716 483063 285337 279315 377279 300736 200473 180502 242725
8634B42725j2640j41242J124J44400M2678R220k203l5138o931o5017p1013L4000
$$ 242725 230085 88843 89967 234367 277045 286265 284062 248924 241993 176976 105963 139963
8622A39963J04920P5027J09040j9915j15469M0194N3461m1386J64850J42567q714
$$ 139963 244883 319910 428950 409035 293566 333760 387221 345835 510685 653252 644538
8611F44538P730N4270K08429K23668L32911Q49872P60404J65964j29545j28765
$$ 644538 652268 706538 914967 1138635 1471546 2321418 3081822 3247786 3118241 2989476
8601B989476l93099m57869l87017k16451j44453q3853R7184r1780j07362j50144
$$ 2989476 2596377 2138508 1751491 1535040 1390587 1306734 1403918 1312138 1204776 1054632
8591A054632o4394j09334o7773j49720k9408o765o4399j41737L736m6365o3479
$$ 1054632 990238 880904 813131 663411 634003 627238 562839 421102 424838 378473 314994
8580C14994p6938k7584Q5809P1920K0861J17683m924o0996L4968j6885J12468
$$ 314994 238056 210472 296281 368201 389062 506745 501821 440825 475793 458908 571376
8569E71376o4473j43415j65973j09390N2748N9898J36454K37112M53589M39311
$$ 571376 506903 363488 197515 88125 140873 200771 337225 574337 1027926 1467237
8559A467237J44811r5407j89220j58208j66194j38304j57660j21162J00077q8790
$$ 1467237 1612048 1516641 1327421 1169213 1003019 864715 707055 585893 685970 597180
8549E97180o8471l9531m7816n4127n540O3587j70600j42192P7784M1876P295j79438
$$ 597180 528709 489178 441362 387235 381695 445282 274682 132490 210274 252150 259445 80007
8537H0007q3974n51Q4223P6451o1891P9127J2768k0446r5280j8998K8288n4706
$$ 80007 -3967 -4518 79705 156156 94265 173392 186160 165714 70434 51436 79724 25018
8525B5018l8827o7125o3022J60272P9525J89549k7221N5241K4694j55060q2889
$$ 25018 -13809 -80934 -143956 16316 95841 285390 258169 313410 338104 183044 100155
8514A00155n414m4117J12668J29186j00363p2245L834j23306k6497K46699Q4547
$$ 100155 94741 50624 163292 292478 192115 119870 123704 398 -26099 220600 305147
8503C05147O807M539l574l0565K5806M158n3539q5910j22914k6097J13888k1243
$$ 305147 311954 316493 312919 282354 308160 312318 258779 172869 49955 23858 137746 116503
8491A16503M2728N6354j37855j02472J40059J13741j15067J3825Q2211l2569n6804
$$ 116503 159231 215585 77730 -24742 115317 229058 113991 127816 210027 177458 120654
8480A20654m0099j9299M0097J2655P8722q772j28272p5874j04016o3715j08745
$$ 120654 80555 61256 101353 114008 192730 183958 55686 -20188 -124204 -187919 -296664
8469b96664J57330J59604J21764j01086j8074O1811K883r1911o6166n7733P4674
$$ -296664 -139334 20270 142034 40948 22874 84685 87568 -4343 -70509 -128242 -53568
8458e3568M9253N852q134J02969K3396j32683n7922R4643p5181m1655N2449O1881
$$ -53568 -4315 1537 -6597 96372 119768 -12915 -70837 23806 -51375 -93030 -40581 21300
8446B1300j07034k0283Q2622j7301M6849J26871R0086J9215P8933q180k4918j54662
$$ 21300 -85734 -106017 -23395 -40696 6153 133024 223110 242325 321258 313078 288160 133498
8434A33498j50097q4286K524J1748M5031Q7421J7886O9923R626m2983Q8940n7257
$$ 133498 -16599 -100885 -98361 -86613 -41582 45839 63725 133648 143274 100291 189231 131974
8422A31974o6234L8371P980o0865J4672Q7066J91078N0182k1773j9721l3517j14422
$$ 131974 65740 104111 112091 51226 65898 152964 344042 394224 372451 352730 319213 204791
8410B04791q5914P584O9460p5563j20289n2072L8083N2852J07744r904j07960
$$ 204791 118877 126461 195921 120358 69 -52003 -13920 38932 146676 136772 28812
8399B8812j44672r3544J2676Q0698N1976O0709J24244J09201l9603j07654L0371
$$ 28812 -115860 -209404 -196728 -116030 -64054 -3345 120899 230100 190497 82843 113214
8388A13214N862l9928l3111k7705q5926N002N4228M397N4823N5376o3605P1225
$$ 113214 119076 79148 46037 18332 -67594 -62592 -8364 -3967 50856 106232 42627 113852
8376A13852q5380j45328j01907R7043J20254L9343J23655o3992l0533J17702L5509
$$ 113852 28472 -116856 -218763 -121720 -1466 37877 161532 97540 67007 184709 220218
8365B20218R4269o3690j45149m9569o8524P303K306L246l6664N324q0424L3281
$$ 220218 314487 250797 105648 56079 -12445 -5142 -2836 410 -36254 -30930 -111354 -78073
8353g8073K1632j2939K9879m722J84298L8201j02329O2876p5574p0634q6296m0387
$$ -78073 -56441 -69380 -39501 -44223 140075 178276 75947 138823 63249 -7385 -93681 -134068
8341a34068Q9419k05465j0270J48584R9015J22597J6284q6895r6782k1425N8821
$$ -134068 -44649 -250114 -260384 -111800 -12785 109812 126096 39201 -57581 -79006 -20185
8330b0185Q0902n1152L3440J41208l3088j34405j7942n236M1041J21501n6283
$$ -20185 60717 9565 43005 184213 151125 16720 -1222 -6458 34583 156084 99801
8319I9801k051J4294r6706r513j3695K1835K6148j02780k5979R8582j30665r6989
$$ 99801 97750 112044 15338 5825 -7870 13965 40113 -62667 -88646 9936 -120729 -217718
8307b17718Q2647J51559J123M4550R449l6567j93250Q694M5215J09899l3294l2738
$$ -217718 -135071 16488 17611 62161 71610 35043 -158207 -149513 -104298 5601 -27693 -60431
8295f0431O6850l6903o3400l7846l5429J29334o7475j6182k3868J05601r0515
$$ -60431 6419 -30484 -93884 -131730 -167159 -37825 -105300 -121482 -145350 -39749 -130264
8284a30264p5150O0577O5145m30K8698M3477J4447j0111o0735K7095n7077N0669
$$ -130264 -205414 -144837 -79692 -80122 -51424 -7947 6500 -3611 -64346 -37251 -94328 -43659
8272d3659P9467L3374m7721m1839L0303M7631K4041P9687r949j11950m2041q3273
$$ -43659 35808 69182 21461 -20378 9925 57556 81597 161284 151335 39385 -2656 -85929
8260h5929M6701M7066J55759Q55j78387P2070K2033K9364P7749O5388j3073L2316
$$ -85929 -39228 7838 163597 164452 -13935 58135 80168 109532 187281 252669 239596 271912
8248B71912n3816j8927j78129j64165r5398L6522J50850J8703J1451L0974K3772
$$ 271912 218096 199169 21040 -143125 -238523 -202001 -51151 -32448 -20997 9977 33749
8237C3749N8107J04389K6129m0170Q559K1246l9994P5353l8441p3778l7148r778
$$ 33749 91856 196245 222374 182204 190763 212009 172015 247368 208927 135149 98001 88223
8225H8223q5256o5960J15738o5659r5282l6278J09645N4801M1770l7622k5503
$$ 88223 2967 -62993 52745 -12914 -108196 -144474 -34829 19972 61742 24120 -1383
8214a383r2946l4954J14563J5182l27j28168J2422J53694J9354k8532l050j18533
$$ -1383 -94329 -129283 -14720 462 135 -128033 -115611 38083 57437 28905 25855 -92678
8202i2678o1755n5740k0548J20533J35007l5508n3075J15762J04544j21112j02764
$$ -92678 -154433 -210173 -230721 -110188 24819 -10689 -63764 51998 156542 35430 -67334
8191f7334o3064j5513M2631Q7073Q8267l3147J6170L5472J325l1711q6626K2105
$$ -67334 -130398 -145911 -103280 -16207 72060 38913 55083 90555 91880 60169 -26457 -4352
8179d352L4212J11022K1737r7295p7691j8780K2702K8591p7262L664J62558N7523
$$ -4352 29860 140882 162619 65324 -12367 -31147 -8445 20146 -57116 -53452 109106 166629
8167A66629k1669r7458m4671M5287J6582N9247m9826p399J32637L7923m8724n7955
$$ 166629 144960 47502 2831 48118 64700 123947 74121 66722 199359 237282 188558 130603
8155A30603J03954L6815j00367k06487q0081J89439J39484K9728j04167p5519
$$ 130603 234557 271372 171005 -35482 -115563 73876 213360 243088 138921 63402
8145F3402J1870r7505j9368O8949n2506j882m3026q0177L0215L5595j3056k4100
$$ 63402 75272 -22233 -41601 27348 -25158 -27040 -70066 -150243 -120028 -84433 -97489 -121589
8133a21589J24407K0819j19345R7750J31101K0161j1049k1042Q6322o6560j7989
$$ -121589 2818 23637 -95708 2042 133143 153304 142255 121213 207535 140975 122986
8122A22986q1446n6393q7388j90746J71232K02419J36871L2847m8097p4847j74375
$$ 122986 41540 -14853 -102241 -292987 -121755 80664 217535 250382 202285 127438 -46937
8111d6937j4945M2845m5179q5436K9683J34497M4874m0485j14861j2472R5050
$$ -46937 -61882 -19037 -64216 -149652 -119969 14528 59402 18917 -95944 -108416 -13366
8100a3366r886k4214l563r8173N3267J34637O1497p3343q0142K3124K8633J00464
$$ -13366 -23252 -47466 -51029 -149202 -95935 38702 100199 26856 -53286 -30162 -1529 98935
8088I8935J77947j590J216k39125r0361k3731J04121N869j03913N4438O2665M942
$$ 98935 276882 275292 276508 37383 -52978 -76709 27412 33281 -70632 -16194 46471 51413
8076E1413Q3190k1628P826P6739j5727M9798j7752p2173l1872l0586P7957N7496
$$ 51413 134603 112975 120801 197540 181813 231611 213859 141686 109814 79228 157185 214681
8064B14681k10951L3418J35193n191M319r5453n8795O4826M7193j312L7887p1368
$$ 214681 3730 37148 172341 167150 171469 76016 17221 82047 129240 127928 165815 94447
8052I4447N7566J04618L7160l6507j07964N0312k8740j55275n2206J979o5913
$$ 94447 152013 256631 293791 257284 149320 199632 170892 15617 -36589 -34610 -100523
8041a00523l443j0739K6346j5820P3851J1454O1347Q8410J5847l4378M8333J8201
$$ -100523 -103966 -114705 -88359 -104179 -30328 -18874 42473 130883 146730 112352 160685 178886
8029A78886l5294O6870L8489n3996j09815j12635O2467m6127N3076L448r9366
$$ 178886 143592 210462 248951 194955 85140 -27495 34972 -11155 41921 45369 -53997
8018e3997j36457Q113L8076L8234J53230J63597R7212N6891q0518j51249l0638
$$ -53997 -190454 -182341 -144265 -106031 47199 210796 308008 364899 284381 133132 102494
8007A02494J22470K64730o356r7510j64202j29452L3012k9041P7685K16179o3244
$$ 102494 224964 489694 483338 385828 221626 92174 125186 96145 173830 390009 326765
7996C26765j40935k8136P1393N0365L6822j41600q7752J10539N1200k6062j34775
$$ 326765 185830 157694 229087 279452 316274 174674 86922 197461 248661 222599 87824
7985H7824n0449P3579P3118Q846p4499j18389k4582K9518l2956R7349J00804o0964
$$ 87824 37375 110954 184072 192918 118419 30 -24552 4966 -27990 69359 170163 109199
7973A09199j05128L6458K17473m3218j40040j46290L5892P9971P9930k5245m1420
$$ 109199 4071 40529 258002 214784 74744 -71546 -35654 44317 124247 99002 57582
7962E7582l2121J9411J38500P9561P2688l703K2886j74246k7874k721m800L570
$$ 57582 25461 44872 183372 262933 335621 331918 354804 180558 152684 149963 145163 148733
7950A48733J34317n5911n7103M3397N6341j4971m2346M0036l619p062Q9691j15638
$$ 148733 283050 227139 170036 213433 269774 254803 212457 252493 248874 241812 331503 215865
7938B15865j99185k637J16005J26646O5715n2410j49922q5890l4489o4617K6027
$$ 215865 16680 14043 130048 256694 322409 269999 120077 34187 -302 -64919 -38892
7927c8892L9115J04933l1552K3259J04757n4935q7355K2137R8152m3299J0195
$$ -38892 223 105156 73604 96863 201620 146685 59330 81467 179619 136320 146515
7916A46515N7723L4105k9211Q2740k7443l7365o1035q9255n8022M5514N2148P8315
$$ 146515 204238 238343 209132 291872 264429 227064 166029 76774 18752 64266 116414 194729
7904A94729k3132l8133K3518l8725j18569j01597J26356O0968q5747M663J57521
$$ 194729 171597 133464 156982 118257 -312 -101909 24447 85415 -332 4331 161852
7893A61852m582k5603L1361m5007n2539k9622k3693l7636k6378L4449O4110L293
$$ 161852 157270 131667 163028 118021 65482 35860 12167 -25469 -51847 -17398 46712 50005
7881E0005K1294K7742J24142q2353P498J45138j19547j12289j50122J17273j0984
$$ 50005 71299 99041 223183 140830 148328 293466 173919 61630 -88492 28781 17797
7870A7797j67089m7323R5628J05185o2253O6950J8557r6538j15680O4091J68865
$$ 17797 -149292 -196615 -100987 4198 -58055 8895 27452 -69086 -184766 -120675 48190
7859D8190M2255J5078R6860j13555j36880j3455J36060k730M058q5927j07562
$$ 48190 90445 105523 202383 88828 -48052 -61507 74553 71823 75881 -10046 -117608
7848a17608q8382K7617J39269J1097m2432O3981N3991j0471L7355j3049p192J0787
$$ -117608 -205990 -178373 -39104 -28007 -70439 -6458 47533 37062 74417 61368 54176 64963
7836F4963O0203r2778j06937n8404n4557n3132M2715P1728O9207M5768m5412j1411
$$ 64963 125166 32388 -74549 -132953 -187510 -240642 -197927 -126199 -56992 -11224 -56636 -68047
7824f8047q5596Q7166J55249n1928j29303L7940L9925m2876m3161j25620j35297
$$ -68047 -153643 -66477 88772 36844 -92459 -54519 -14594 -57470 -100631 -226251 -361548
7813c61548K559L4580J56212M9057o538n7004L3971J68374L3419j51658N2871
$$ -361548 -358989 -324409 -168197 -119140 -125678 -182682 -148711 19663 53082 -98576 -45705
7802d5705J66221k436p56j8610n4413q1099L3644K9071Q0119J10517o9474q9303
$$ -45705 120516 118080 117324 98714 44301 -36798 -3154 25917 106036 216553 147079 57776
7790E7776J17385L7635j11646j20611O8095l3637r824J3904K5637r2104j0575
$$ 57776 175161 212796 101150 -19461 48634 14997 5173 19077 44714 -47390 -57965
7779e7965O6929L4605L4965j4941P7643O9294p054N930j40129P0377Q6367j27946
$$ -57965 8964 43569 78534 63593 141236 210530 203476 209406 69277 139654 226021 98075
7767I8075j69714m2503J23267m189M6758P6672K6112L5245K6092j50001k14491
$$ 98075 -71639 -114142 9125 4936 51694 128366 154478 189723 215815 65814 -148677
7756a48677P1210N628o09k8618J3863p3721p9998L4784M9489L137J56925P0639
$$ -148677 -77467 -71839 -72448 -101066 -87203 -160924 -240922 -206138 -156649 -153512 3413 74052
7744G4052j38912P9671L4022j17462n9362k6671j02552J4113P809O9775N4794
$$ 74052 -64860 14811 48833 -68629 -127991 -154662 -257214 -243101 -235292 -165517 -110723
7733a10723K8353r9768J20943J03419q230K9157j52711j32706j59233K7781J85729
$$ -110723 -82370 -182138 -61195 42224 33994 63151 -89560 -222266 -381499 -353718 -167989
7722a67989n8305l8337J59651J54415L2339q3181j1188M0801m218j21810O9938
$$ -167989 -226294 -264631 -104980 49435 81774 -1407 -12595 28206 23988 -97822 -27884
7711b7884J07037J06225q8720j16576j65157J66783Q2786j73254M0930k8476l1061
$$ -27884 79153 185378 96658 -19918 -185075 -18292 64494 -108760 -67830 -96306 -127367
7700a27367P4483M7739K0194m3006j9528n9023J7873K8011L7185K3532K5088J3441
$$ -127367 -52884 -5145 15049 -27957 -47485 -106508 -88635 -60624 -23439 93 25181 38622
7688C8622j50076q6580J22547R9523Q5402J27407M1541j019o8490j07509p5402
$$ 38622 -111454 -198034 -75487 24036 109438 236845 278386 277367 208877 101368 25966
7677B5966j05832P457n6628j84936J03533N35L2314J60267o9220K6394l0165k3
$$ 25966 -79866 -72409 -129037 -313973 -210440 -209905 -177591 -17324 -86544 -60150 -90315 -90338
7665i0338J06910J28583r1329l5377j56335J12123n5279L4669J57492R944j75580
$$ -90338 16572 145155 53826 18449 -137886 -25763 -81042 -46373 111119 121063 -54517
7654e4517j68631N9607J74408R8893n6335J5944j04765o8215j7842j7264m2827
$$ -54517 -223148 -163541 10867 109760 53425 69369 -35396 -103611 -121453 -138717 -181544
7643a81544L5869q7264J1450J99880k3036j22858r3520N746P40K20343O6976Q4092
$$ -181544 -145675 -232939 -221489 -21609 -44645 -167503 -261023 -255277 -254537 -34194 32782 116874
7631A16874J0925m7659p7279K2768l168o7779p5363L2320L6882o8516k922K7056
$$ 116874 127799 80140 2861 25629 22461 -45318 -120681 -88361 -51479 -119995 -122917 -95861
7619i5861O9980J48029n7361j33320M8598L2752l4588p3253l5540l6034J07507
$$ -95861 -25881 122148 64787 -68533 -19935 12817 -21771 -95024 -130564 -166598 -59091
7608e9091J71576O3379o248k5000K8585j13572p1963r0613k3275J07166J17937
$$ -59091 112485 175864 169616 144616 173201 59629 -12334 -102947 -126222 -19056 98881
7597I8881j14163l2796m5315o0304J6403P1518L993j19957P4136L0621j42548
$$ 98881 -15282 -48078 -93393 -153697 -137294 -65776 -61783 -181740 -107604 -76983 -219531
7586b19531k4136M9777J03430L9242q8413k0492j1378J38830R6195Q2890j57181
$$ -219531 -243667 -193890 -90460 -51218 -139631 -160123 -171501 -32671 63524 146414 -10767
7575a0767j36752J39008Q8754k0542j58840M9687K51014k1080j60168q5296k9632
$$ -10767 -147519 -8511 80243 59701 -99139 -49452 201562 180482 20314 -64982 -94614
7564i4614O436l7900J25884P2966j17656n0736J23686J00810K735l6375r0453
$$ -94614 -88178 -126078 -194 72772 -44884 -95620 28066 128876 131611 95236 4783
7553D783j45707N7080Q4731M9728P6684j2960Q4236J9910q7457K2841j33829J8772
$$ 4783 -140924 -83844 887 50615 127299 114339 198575 218485 131028 153869 20040 38812
7541C8812O1611j26822M2100J9307o6321j63122p1192l4053O1176j6778m0137
$$ 38812 100423 -26399 15701 35008 -31313 -194435 -265627 -299680 -238504 -255282 -295419
7530b95419P6569K916o7854J29706N2102J6691j5506J19292J07001K2982q8964
$$ -295419 -218850 -215934 -283788 -154082 -101980 -85289 -100795 18497 125498 148480 59516
7519E9516J5504J23506m8288J0080k7840k3022o5448m2641L1862J10528N4076
$$ 59516 75020 198526 150238 160318 132478 109456 44008 1367 33229 143757 197833
7508A97833j18647m0936k2063n9193K8201N0513O6382k36966p6891Q3236l5331
$$ 197833 79186 38250 16187 -43006 -14805 35708 102090 -134876 -211767 -128531 -163862
$$ [...]
##END NTUPLES=NMR SPECTRUM
##END=
