##TITLE=Analysis number 313006
Compound Code cc 17539
Book Reference 423/36
Project Code adrs
Chemist Name bruced
##JCAMPDX= 6.0         $$ Bruker NMR JCAMP-DX V2.0
##DATA TYPE= NMR SPECTRUM
##DATA CLASS= NTUPLES
##ORIGIN= Bruker BioSpin GmbH
##OWNER= NMR
$$ XWIN-NMR		Version 3.5
$$ Tue Aug 23 09:44:06 2005 GMT Daylight Time (UT+1h)  MAYBRIDGE\NMR@NMR_250MHZ
##.OBSERVE FREQUENCY= 250.131544655141
##.OBSERVE NUCLEUS= ^1H
##.ACQUISITION MODE= SIMULTANEOUS (DQD)
##.ACQUISITION SCHEME= undefined
##.AVERAGES= 16
##.DIGITISER RES= 18
##SPECTROMETER/DATA SYSTEM= dpx250
##.PULSE SEQUENCE= zg30
##.SOLVENT NAME= DMSO
##.SHIFT REFERENCE= (INTERNAL, DMSO, 0, 16.522)
##AUDIT TRAIL= $$ (NUMBER, WHEN, WHO, WHERE, WHAT)
$$ ##TITLE= Audit trail, XWIN-NMR		Version 3.5
$$ ##JCAMPDX= 5.01
$$ ##ORIGIN= Bruker BioSpin GmbH
$$ ##OWNER= NMR
$$ C:\u/data/dgb/nmr/ADRS/8350/pdata/1/auditp.txt
$$ ##AUDIT TRAIL=  $$ (NUMBER, WHEN, WHO, WHERE, WHAT)
(   1,<2005-08-23 09:43:28.92 +100>,<MAYBRIDGE\NMR>,<NMR_250MHZ>,
      <created by zg, POWCHK disabled, PULCHK disabled
       configuration hash MD5:
       62 19 C7 07 E1 42 D1 B7 37 6C 3D D0 77 39 F9 E6
       data hash MD5: 64K
       A6 A2 00 6D 7C EE C2 CD D4 E3 6E CB 46 32 CA CB>)
(   2,<2005-08-23 09:43:43.92 +100>,<MAYBRIDGE\NMR>,<NMR_250MHZ>,
      <Start of raw data processing
       ef LB = 0.3 FT_mod = 6 PKNL = 1 SI = 32K 
       data hash MD5: 32K
       07 01 E9 57 15 54 39 9D 82 23 C4 59 DA 0E 4B BA>)
(   3,<2005-08-23 09:43:49.69 +100>,<MAYBRIDGE\NMR>,<NMR_250MHZ>,
      <apk 
       data hash MD5: 32K
       3B AD 96 B4 B0 F7 6F CF 01 66 09 18 72 40 8F BB>)
(   4,<2005-08-23 09:43:51.38 +100>,<MAYBRIDGE\NMR>,<NMR_250MHZ>,
      <abs ABSG = 5 
       data hash MD5: 32K
       1C 64 73 E3 22 46 84 64 E5 A0 1A FE 3E 3D A2 14>)
$$ ##END=
$$ 
$$ hash MD5
$$ 13 E1 4D A1 A2 84 4A 13 1D F4 5B AF DB 25 84 07
##$RELAX= 
##$RELAX= 
##$RELAX= 
##$RELAX= 
##$RELAX= 
##$RELAX= 
##$RELAX= 
$$ Bruker specific parameters
$$ --------------------------
##$DU= <C:\u>
##$EXPNO= 8350
##$NAME= <ADRS>
##$PROCNO= 1
##$TYPE= <nmr>
##$USER= <dgb>
##$AMP= (0..31)
100 100 100 100 100 100 100 100 100 100 100 100 100 100 100 100 100 100 
100 100 100 100 100 100 100 100 100 100 100 100 100 100 
##$AQSEQ= 0
##$AQ_mod= 3
##$AUNM= <au_zg>
##$AUTOPOS= <6 >
##$BF1= 250.13
##$BF2= 250.13
##$BF3= 250.13
##$BF4= 250.13
##$BF5= 500.13
##$BF6= 500.13
##$BF7= 500.13
##$BF8= 500.13
##$BYTORDA= 1
##$CFDGTYP= 0
##$CFRGTYP= 5
##$CHEMSTR= <none>
##$CNST= (0..31)
1 1 145 1 1 1 1 1 1 1 1 1 1 1 1 1 1 1 1 1 1 1 1 1 1 1 1 1 1 1 1 1 
##$CPDPRG= <>
##$CPDPRG1= <>
##$CPDPRG2= <>
##$CPDPRG3= <>
##$CPDPRG4= <mlev>
##$CPDPRG5= <mlev>
##$CPDPRG6= <mlev>
##$CPDPRG7= <mlev>
##$CPDPRG8= <mlev>
##$CPDPRGB= <>
##$CPDPRGT= <>
##$D= (0..31)
0 1 0 0 0 0 0 0 0 0.06 0 0 0 0 0 0 0.0002 0 0 0 0 0 0 0 0 0 0 0 0 0 0 
0 
##$DATE= 1124786606
##$DBL= (0..7)
120 120 120 120 120 120 120 120 
##$DBP= (0..7)
150 150 150 150 150 150 150 150 
##$DBP07= 0
##$DBPNAM0= <>
##$DBPNAM1= <>
$$ [...]
##$SUBNAM7= <"">
##$SUBNAM8= <"">
##$SUBNAM9= <"">
##$SW= 20.6930455092707
##$SWIBOX= (0..15)
0 0 3 0 0 0 0 0 0 0 0 0 0 0 0 0 
##$SW_h= 5175.983436853
##$TD= 65536
##$TD0= 1
##$TE= 295.16
##$TE2= 300
##$TE3= 300
##$TEG= 300
##$TL= (0..7)
0 120 120 120 120 120 120 120 
##$TP= (0..7)
150 150 150 150 150 150 150 150 
##$TP07= 0
##$TPNAME0= <>
##$TPNAME1= <>
##$TPNAME2= <>
##$TPNAME3= <>
##$TPNAME4= <>
##$TPNAME5= <>
##$TPNAME6= <>
##$TPNAME7= <>
##$TPOAL= (0..7)
0.5 0.5 0.5 0.5 0.5 0.5 0.5 0.5 
##$TPOFFS= (0..7)
0 0 0 0 0 0 0 0 
##$TUNHIN= 0
##$TUNHOUT= 0
##$TUNXOUT= 0
##$USERA1= <user>
##$USERA2= <user>
##$USERA3= <user>
##$USERA4= <user>
##$USERA5= <user>
##$V9= 5
##$VALIST= <valist>
##$VCLIST= <CCCCCCCCCCCCCCC>
##$VD= 0
##$VDLIST= <DDDDDDDDDDDDDDD>
##$VPLIST= <PPPPPPPPPPPPPPP>
##$VTLIST= <TTTTTTTTTTTTTTT>
##$WBST= 1024
##$WBSW= 4
##$XGAIN= (0..3)
0 0 0 0 
##$XL= 0
##$YL= 0
##$YMAX_a= 341233
##$YMIN_a= -487462
##$ZGOPTNS= <>
##$ZL1= 120
##$ZL2= 120
##$ZL3= 120
##$ZL4= 120
##$ABSF1= 16.522
##$ABSF2= -4.171173
##$ABSG= 5
##$ABSL= 3
##$ALPHA= 0
##$AQORDER= 0
##$ASSFAC= 0
##$ASSFACI= 0
##$ASSFACX= 0
##$ASSWID= 0
##$AUNMP= <proc_1d>
##$AZFE= 0.1
##$AZFW= 0.1
##$BCFW= 0
##$BC_mod= 0
##$BYTORDP= 0
##$COROFFS= 0
##$CY= 12.5
##$DATMOD= 1
##$DC= 0
##$DFILT= <>
##$DTYPP= 0
##$F1P= 14.0000005364418
##$F2P= -0.99999901652339
##$FCOR= 0.5
##$FTSIZE= 32768
##$FT_mod= 6
##$GAMMA= 0
##$GB= 0
##$INTBC= 1
##$INTSCL= 1
##$ISEN= 128
##$LB= 0.3
##$LEV0= 0
##$LPBIN= 0
##$MAXI= 10000
##$MC2= 0
##$MEAN= 0
##$ME_mod= 0
##$MI= 0
##$NCOEF= 0
##$NC_proc= -3
##$NLEV= 6
##$NOISF1= 0
##$NOISF2= 0
##$NSP= 0
##$NTH_PI= 0
##$NZP= 0
##$OFFSET= 16.522
##$PC= 1
##$PHC0= -84.06685
##$PHC1= 5.912175
##$PH_mod= 1
##$PKNL= yes
##$PPARMOD= 0
##$PSCAL= 4
##$PSIGN= 0
##$REVERSE= no
##$SF= 250.13
##$SI= 32768
##$SIGF1= 0
##$SIGF2= 0
##$SINO= 400
##$SIOLD= 32768
##$SREGLST= <1H.DMSO>
##$SSB= 0
##$STSI= 32768
##$STSR= 0
##$SW_p= 5175.98343685301
##$SYMM= 0
##$S_DEV= 0
##$TDeff= 65536
##$TDoff= 0
##$TI= <Analysis number 999999
Compound Code 99
Book Reference 9
Project Code 9>
##$TILT= no
##$TM1= 0
##$TM2= 0
##$TOPLEV= 0
##$USERP1= <user>
##$USERP2= <user>
##$USERP3= <user>
##$USERP4= <user>
##$USERP5= <user>
##$WDW= 1
##$XDIM= 32768
##$YMAX_p= 354237925
##$YMIN_p= -162739
$$ End of Bruker specific parameters
$$ ---------------------------------
##NTUPLES= NMR SPECTRUM
##VAR_NAME=  FREQUENCY,     SPECTRUM/REAL,   SPECTRUM/IMAG
##SYMBOL=    X,             R,               I
##VAR_TYPE=  INDEPENDENT,   DEPENDENT,       DEPENDENT
##VAR_FORM=  AFFN,          ASDF,            ASDF
##VAR_DIM=   32768,         32768,           32768
##UNITS=     HZ,            ARBITRARY UNITS, ARBITRARY UNITS
##FACTOR=    0.157963299565203, 1,           1
##FIRST=     4132.6476996994, 0,             0
##LAST=      -1043.33573715361, 0,           0
##MIN=       -1043.33573715361, -162739,     0
##MAX=       4132.6476996994, 354237925,     0
$$ Real data points
##PAGE= N=1
##DATA TABLE= (X++(R..R)), XYDATA
$$ [...]
18744 229436 205606 191990 205689 194150 158116 148382 163204 138748 142516 212671 253869 207528
18732 207528 160025 157058 173241 164185 155791 193931 177531 150367 162266 148675 167939 178792
18720 178792 166705 131952 126093 116954 108986 87011 73933 44406 52820 88841 87370 86569 49640
18707 49640 33089 25853 36761 72910 65580 47786 53022 55536 42181 50289 64061 118713 155963
18694 155963 118159 82686 103020 86801 72869 76703 46098 66914 82534 91608 118543 109365
18682 109365 109759 90970 78887 73446 100088 74701 86620 106750 116425 135555 155955 178440
18670 178440 170165 137366 138792 159514 156784 164495 172451 120149 93796 109366 112631 92817 66578
18657 66578 90539 129640 130239 145853 144813 108632 83084 116390 130027 109931 97775 91620
18645 91620 133265 140438 110238 74794 58513 54664 96182 103575 89079 93962 80873 47499
18633 47499 61979 84550 104005 110930 100596 101824 99890 117911 121725 109066 133214 112152
18621 112152 74622 55166 70613 73622 71265 48910 66767 91175 118743 117288 141864 123380
18609 123380 97202 120678 109503 70049 33324 66348 79404 71868 92173 58647 30967 53607
18597 53607 68960 115325 147768 159691 180186 177524 132148 83442 75282 137945 158812 121741
18585 121741 142087 200399 220679 182766 153710 140365 101577 62392 81429 85816 119339 116526
18573 116526 108198 120567 141772 109218 94456 95036 139601 189864 163818 140564 123275 132290
18561 132290 174151 129890 123225 142820 140222 99525 105694 162742 212199 197140 158345 124991
18549 124991 102150 81514 57771 45026 80479 122900 137583 116212 127476 130697 146677 173261
18537 173261 155611 88108 72827 70214 83462 101273 140255 159175 128292 116751 135509 130634
18525 130634 101861 64562 25035 62723 71284 93044 97463 84467 56212 53853 26150 47461
18513 47461 64396 79173 87568 74024 46630 28899 59880 90280 111578 112618 114043 120118
18501 120118 104155 103993 137117 112250 98617 84424 46708 -1740 -7643 24839 31869 60188
18489 60188 94820 68261 45734 94277 100610 100492 63446 86436 80302 76355 107039 105833 90201
18476 90201 111676 87987 52652 68941 99919 100160 59038 36477 47996 50215 60142 63466 55792
18463 55792 42709 89668 88164 54092 39061 56307 56476 49105 40305 20942 29689 44438 5592
18450 5592 10562 17203 51540 56179 71611 90208 97566 71800 32547 -4317 -25888 -3004 64450
18437 64450 89312 85856 38680 -7303 -16793 71132 109297 71931 29913 41620 60332 68326
18425 68326 96259 95215 99750 111666 72175 74805 87107 78569 56268 17054 513 43288
18413 43288 82879 70362 28051 6163 26998 34256 51288 58557 45370 29982 11106 -6765
18401 -6765 16141 62712 91888 94016 109107 106098 104434 122178 99980 96426 61659 29454 -25837
18388 -25837 -14973 38352 43762 -9062 -2632 57451 49993 50071 43831 26131 -8371 37201 65003
18375 65003 77139 74791 37499 23997 28579 34748 13166 20468 42750 67897 65128 40547 56443
18362 56443 21548 19621 47322 35604 31058 84336 102328 102409 107704 105896 107810 91191 83556
18349 83556 77630 68420 65128 69690 75622 52965 71807 94073 105198 66997 67686 66736 21691
18336 21691 17421 53231 53493 42419 52123 39833 64195 107026 86843 91677 70793 62721 48305
18323 48305 35076 11299 -389 -41602 -45471 7692 42066 -2321 -28963 -49161 -18690 53749
18311 53749 86817 76539 50315 57011 52526 57053 36202 52526 87305 87982 62358 34540 52614
18298 52614 65055 71372 76136 47102 -28666 -59581 -18919 19045 31225 14262 42857 22463
18286 22463 1026 27764 32299 9696 51887 62007 11208 2004 11218 26900 37196 41220
18274 41220 55459 33238 -15097 20436 22784 -20054 -46863 -34412 -26483 -27095 14821 7278 -16372
18261 -16372 11777 17553 45961 71506 74721 63989 36709 3552 19307 31288 35585 15095
18249 15095 15221 21499 -16751 -32194 -13830 5777 20880 40166 46896 31554 10023 -7451
18237 -7451 14192 2999 -12354 -43341 -47058 -13545 34194 49899 46048 44332 -359 -25851
18225 -25851 -19286 -36124 -3202 26523 28285 -18396 -19696 -47824 -68083 -60356 -43191 -18413
18213 -18413 -3916 -8265 -7165 13311 37097 6999 -29365 -74909 -26838 43943 71732 61066
18201 61066 60611 53602 53101 49933 -344 20076 7754 -9559 -5916 -19533 17317 2404 1660
18188 1660 9540 9187 6917 -13698 2578 818 -18542 -13 32634 46123 74658 85836 52611
18175 52611 18166 13150 18121 6248 45687 64381 19562 -16509 -20036 -23074 -20448 1690 27352
18162 27352 56319 88951 71333 43096 24891 -13491 -61530 -56800 11044 23811 7569 -38257
18150 -38257 -31760 -19520 2215 14157 43049 71146 58839 14820 -7426 -6353 -23472 -35097
18138 -35097 -39568 -41426 -67416 -61073 -41665 6561 8597 14739 -30054 -94297 -127690 -109231 -28846
18125 -28846 23853 13253 13117 4072 9600 5275 -25128 -35251 -26576 26351 28723 27924 12384
18112 12384 -13030 18686 21685 22352 27860 37342 64728 40350 8776 12071 -2603 -55157 -79819
18099 -79819 -59737 -23387 6548 25941 60355 40074 55 -12367 -34768 -30929 -34513 -22097
18087 -22097 -11218 4741 -20598 -50311 -77231 -76708 -28510 -8145 -17359 -9704 5394 -18950
18075 -18950 -14176 18301 33732 -19792 -83207 -74438 -36153 -1136 -4844 -4464 -19104 -29396 -5118
18062 -5118 22201 14204 47487 94704 60417 -40144 -65982 -45880 -29341 -16158 -9964 -17640
18050 -17640 -34584 -48812 -19627 4084 24159 22703 29309 -13696 -42877 -30576 -40591 -17454
18038 -17454 -40505 -24780 20420 9583 -15190 -20985 6039 32775 43394 -17352 -15468 19311
18026 19311 3826 -46101 -93114 -76830 -53672 -5460 29265 37636 -2851 -11096 53724 85032
18014 85032 34884 21360 16568 38129 251 -41384 -11161 57926 71357 48873 30434 18011
18002 18011 33145 27356 37522 62849 45574 274 -10092 23106 13139 -3927 7972 4332
17990 4332 8262 -4511 -48448 -38749 -63791 -60517 -13257 12628 9884 -1271 21046 36158 38825
17977 38825 30519 28392 -24641 -44035 -51045 -39934 -12841 27870 12384 1575 -42520 -69829
17965 -69829 -70699 -33763 6005 5169 -11355 -27935 19433 37488 46621 60531 56320 53634 36209
17952 36209 36752 35619 12348 -26830 -50716 -51812 -16475 2332 25402 45660 17949 43081
17940 43081 39069 -4589 -36201 -25517 2880 -5666 -54912 -31415 -4397 -38916 -61414 -45390
17928 -45390 -9531 4257 -15541 9482 49205 85213 75342 101956 55355 9234 24243 25916
17916 25916 40442 32557 33226 58994 81521 62301 56399 29941 58691 61463 23889 10771 -6435
17903 -6435 8409 -2264 11961 -19886 -41513 -53295 -79592 -66438 -27281 -15804 -36432 -62255
17891 -62255 -54455 -34823 -26758 -20707 -47820 -40847 16222 64571 71965 13973 -10335 -31898 -70847
17878 -70847 -38726 22886 22752 -14179 2554 7845 11305 32276 94010 117474 150222 190513
17866 190513 191255 139633 64783 -1538 13183 29367 23446 50627 32395 2803 46145 56330
17854 56330 29593 -30143 -22949 18207 35735 82469 122593 122939 118035 141809 81691 38050
17842 38050 -11763 -6163 -14172 -18653 -35096 6933 26271 20986 22054 -9577 -45313 -66258 8413
17829 8413 38307 31092 15555 2287 -3981 -15971 -6474 -6864 5776 52312 78575 68830 29561
17816 29561 43520 101044 146043 144134 157874 170746 188700 169414 152966 104890 68653 35799
17804 35799 29496 725 12001 24972 54412 30350 20371 -59 12450 46937 60167 80920
17792 80920 117311 137913 187683 191623 148146 103641 73478 91062 127308 113906 114202 52785
17780 52785 34465 35482 33466 -4481 -4569 24992 25755 -9849 8131 31134 51656 -487 44274
17767 44274 47712 7945 -17467 -42574 -99314 -59416 -1338 -10864 -6973 -1800 298 -20366 -52527
17754 -52527 -45210 -52534 -76711 -49602 -20853 11976 -7023 -17990 -12442 1035 17105 7497
17742 7497 -12612 9496 17929 13208 13001 8615 14263 23531 418 -8491 -15702 -28316 -13490 -18379
17728 -18379 11757 33262 8197 -6722 -18729 -39113 -48181 -21848 -4688 16886 -14308 -36294
17716 -36294 -11269 8218 -10310 12177 1549 5124 -18090 -12979 -24139 -22051 -22571 -19047 -34827
17703 -34827 -17837 -3485 2874 2249 25188 21529 -10426 -56035 -101041 -112427 -67952 16730
17691 16730 37522 23767 534 15640 45537 44232 17600 20132 8816 -7808 -45746 -61774
17679 -61774 -23577 -5571 2037 -3042 -56633 -81792 -52141 1526 6832 -31368 -21747 -21288 -46599
17666 -46599 -105388 -76604 -71243 -4664 21434 -11249 -8554 385 -5528 -4033 -21454 -47822 -60347
17653 -60347 -46965 -62063 -28758 4018 21227 33917 36592 28309 13269 -1589 -3984 -928
17641 -928 -7019 6470 1619 -2153 -7060 4954 13163 -11749 6151 19463 31684 65547 86203
17628 86203 66080 52792 27602 27343 49743 58570 71762 72565 69687 91265 82251 80806 85107
17615 85107 71348 97406 107228 67902 34498 42858 70220 54355 24205 25188 51568 29465
17603 29465 26964 41351 83832 135895 156405 209178 238311 280347 342898 384018 442670 493542
17591 493542 486436 478539 449454 469271 463149 525719 506616 446586 374511 295203 252869 232786
17579 232786 184012 126143 122435 155478 192321 192750 184677 145336 109349 127387 159558 178354
17567 178354 155265 121865 125988 111510 72189 77490 72580 97699 100515 78411 90127 94189
17555 94189 125408 183411 187078 152250 117702 83776 94471 109578 87874 120664 166496 193827
17543 193827 197029 186246 192288 257074 333323 380461 426266 472271 512602 548545 564362 568657
17531 568657 556122 540027 462117 384348 338030 330677 288160 268692 255321 212877 152558 129483
17519 129483 137074 147801 185365 185483 166055 126134 105462 109974 116970 159893 165555 144035 120092
17506 120092 122465 94821 82293 135970 150475 166104 175956 168138 130221 108438 119397 134928
17494 134928 98904 73764 83479 82612 133540 164690 171804 147625 122202 127119 141654 144409 151419
17481 151419 101062 66460 70471 95135 126697 144273 140135 123112 85686 121937 113929 80911
17469 80911 88419 81243 67932 85285 141165 136118 113016 167375 194933 160882 140683 175342
17457 175342 170211 190745 235841 276160 280692 279230 292649 252540 247035 248026 310603 365381 369462
17444 369462 373482 364483 427861 462800 410506 415947 397291 409229 452489 485315 538601 595615
17432 595615 692063 738310 816173 892997 985660 1143136 1262257 1423305 1614761 1813649
17422 1813649 2113635 2478396 2941651 3569431 4390220 5373874 6458828 7754188 9177753
17413 9177753 10477843 11543201 12289905 12659746 12724234 12628447 12425933 11977332 11162150
17404 11162150 10020861 8730986 7464428 6337288 5456351 4735110 4122320 3637627 3289299
17395 3289299 3034835 2797291 2596102 2433832 2317816 2273551 2223838 2167662 2061665 1965120
17385 1965120 1901591 1862721 1856805 1827100 1830526 1860216 1808906 1776357 1761953 1779196 1827186 1868418
17373 1868418 1914330 1966319 2001149 2064396 2197277 2436872 2713561 3080516 3558128 4081226
17363 4081226 4776884 5713310 6730489 7873783 9130735 10305034 11222570 11825502 12072038
17354 12072038 12089331 11946288 11649755 11118006 10283235 9170796 7925133 6731862 5676873
17345 5676873 4828013 4158356 3651261 3257632 2901695 2600554 2417617 2284032 2161679
17336 2161679 2046878 1964028 1939976 1848758 1763278 1715225 1674515 1602795 1508337 1446236 1392637
17325 1392637 1324265 1269203 1211848 1127747 1098130 1034676 933427 876313 837616 792614 729090
17314 729090 732848 740080 679104 581891 566294 549248 503364 464630 446345 416624 428846 435239
17302 435239 417417 397694 385268 360367 358089 371749 389139 376160 343156 358519 384967 397599
17290 397599 396911 423384 400039 371325 393578 365616 297409 265709 270159 252432 214536 173695
17278 173695 186728 198322 169476 143762 150903 167791 157300 143493 141669 126371 77487 74700
17266 74700 124627 155028 118745 86561 82805 59845 82118 97042 151523 153739 123886 96168
17254 96168 109078 107523 86171 54605 34169 49924 59531 68126 53716 32821 43222 92813
17242 92813 122150 140706 179724 199250 178037 188780 243651 243074 224100 246253 245743 228679
17230 228679 212782 205351 147581 102913 121740 162152 141863 107407 95926 78509 32399 13852
17218 13852 34840 36849 25518 27658 62336 56961 42806 39603 27204 -23332 -16148 27591 62500
17205 62500 21928 -29303 -19516 -2238 60214 80628 43799 20548 -201 30173 36368 31872
17193 31872 37384 20155 67675 105717 106285 64644 66061 73752 51478 46492 42727 49542 59331
17180 59331 52004 -8913 -58086 -23410 9290 8931 -6468 -31739 -62472 -13223 53771 80449
17168 80449 94053 96516 62677 31415 7932 22778 32689 36840 25914 39748 30911 42796
17156 42796 24808 19119 2241 -30098 -29098 -26809 30618 52133 16824 2593 22002 19330
17144 19330 -16401 453 -1778 -14065 -6935 -34466 -27860 15566 41983 32825 36586 16719 29284
17131 29284 -17093 -74188 -64393 -37602 -19037 35226 58440 40423 67788 79563 28701 -19993
17119 -19993 -11314 3942 -5373 28877 42361 38758 45968 39622 25783 11434 3248 -49654 -90642
17106 -90642 -87739 -93121 -60731 20806 37595 30859 17520 -34252 -44139 -53193 -51231 -51992 -84952
17093 -84952 -93106 -60549 -38217 -8089 12663 26274 13775 -7982 -30141 -21989 15487 8063
17081 8063 13525 12617 12544 -22925 2411 46607 74304 86370 63398 27578 14377 8919 1043
17068 1043 3484 21064 36953 21303 21365 33990 60460 57921 41965 45095 25685 41229 50840
17055 50840 55049 55005 -21644 -49563 -59247 -28727 4747 30964 18605 -4249 -23602 -13084 16439
17042 16439 4146 -24955 -55835 -53592 -1921 32504 10051 29337 11738 13699 14903 30473
17030 30473 28399 -2830 11659 8291 51434 62374 65757 52184 59296 31534 7427 -27175
17018 -27175 12027 36022 32456 8897 28028 89367 93784 75223 54728 33107 9139 24750
17006 24750 30961 13084 8462 9319 -22082 -24536 20120 34731 28587 4604 -17702 12187 12327
16993 12327 27006 38171 5063 12622 21422 14305 27600 37985 47527 27596 6595 13343 -3828
16980 -3828 -47609 -71372 -15859 14143 45305 15020 44582 30369 23267 2291 -13992 5280
16968 5280 -8725 14029 7318 21503 38057 18956 8185 -9949 -17550 4370 -23852 -16357
16956 -16357 24069 38575 34631 15648 5064 -10487 -7075 -26326 -30760 -13657 -34049 -51076
16944 -51076 -87940 -82080 -60484 -45162 -8969 12876 60389 60448 63947 69454 51760 50806 22693
16931 22693 -34756 -38075 -12133 -36048 -9507 -13493 -70047 -71319 -64522 -49123 -41123 -6536 -10892
16918 -10892 2856 34608 5549 -22146 -36632 -26323 -3680 11639 22790 5769 -12924 -40522
16906 -40522 -60842 -43416 4957 -35099 -51175 15256 78101 78699 63433 38323 20121 27502
16894 27502 55980 80100 52238 37760 -17364 -35266 -29264 134 14429 23548 8680 -2346
16882 -2346 -42484 -74070 -59202 -47408 -33715 -20895 -47295 -24595 11559 6315 4009 -15974
16870 -15974 -28094 -38432 -33203 -7537 -14709 -52580 -22471 -17592 -41475 -23186 -8954 4793
16858 4793 12808 8099 -10206 -50630 -71189 -879 56618 44446 -10613 -6563 15514 21611 -189
16845 -189 17913 19958 17259 25066 64129 95671 71915 28875 -1895 4230 4463 27567 4661
16832 4661 17960 9204 27707 41787 46665 31553 27616 -1631 -16823 27339 5799 814 6951
16819 6951 -60590 -88427 -48111 -20471 -46913 -73259 -32397 -4663 -2383 55203 84768 40840
16807 40840 9595 -6086 -19719 -5444 8245 -10626 -13604 -46813 -30109 -8468 17761 -395
16795 -395 -16712 -27069 -31251 -87165 -62493 -23741 -19510 -4765 13819 -46742 -64343 -71206 -67769
16782 -67769 -47216 -33195 -37918 -49260 -46772 -68686 -62117 -39575 -20520 -6977 -874 17497
16770 17497 40155 44407 8236 -66389 -61956 -38044 -70496 -113798 -116973 -114552 -63386 -53731 -35479
16757 -35479 2341 26335 13364 22901 46496 11679 -18711 -33201 -48209 -75920 -79262 -109686
16745 -109686 -117052 -71763 -8681 -4080 17697 41905 45661 825 5033 30776 36206 1024
16733 1024 32599 28438 -5271 -33499 -2185 29989 56263 49746 61848 42345 10894 -18153
16721 -18153 1532 17176 23733 24186 47447 34606 -32105 -34265 -4595 18830 8707 29553
16709 29553 58781 47004 30729 28565 9326 19212 23434 26974 3794 -346 -16290 -57095 -86440
16696 -86440 -43985 -24267 15105 14679 4873 19505 26129 -1210 1844 -2438 -30165 -7554 -23723
16683 -23723 -798 35082 2839 11285 758 -9872 33090 29564 -14626 -11175 -26457 -46338
16671 -46338 -47955 -45925 -35739 -10607 2410 -710 -4691 24907 8659 6410 39530 53757 31099
16658 31099 9138 9825 22413 24786 21808 -12088 -2577 35187 -9963 -25386 -8681 18802 26711
16645 26711 35326 76632 54332 8595 4444 26987 54705 35594 -15689 11575 -5079 16885
16633 16885 19312 -13500 -29563 -48572 -62368 -76957 -88771 -75513 -65593 -65161 -76626 -66471
16621 -66471 -54987 -28381 -9793 7053 -2333 53994 32547 7215 -19051 -33243 -50857 -28911
16609 -28911 29511 32119 -14843 -48986 -45348 -65514 -49885 -27278 -5628 25922 38480 30211
16597 30211 87362 75568 9781 -26863 5104 8369 -8427 -37135 -58711 -102381 -88303 -49044
16585 -49044 -79885 -89486 -104299 -112442 -40665 -687 3380 -27650 -83917 -79985 -65705 -78272
16573 -78272 -79741 -92195 -118485 -123040 -105242 -86552 -51390 -39910 -33137 -34916 -22203 18011
16561 18011 16143 -7160 -1174 -7203 -28454 8615 -3456 2074 15990 25339 -17813 -29138 -31673
16548 -31673 2063 27708 12876 9880 42010 48310 -4747 -37319 -26743 -1166 -14833 -31425
16536 -31425 -65530 -50809 -8630 24942 21105 20775 -6955 -8404 -27419 -21098 -27330 -49944 -31165
16523 -31165 -48235 -52331 -17601 4433 -2953 -38847 -30635 -19648 -47161 -42484 -58554 -59641 -57828
16510 -57828 -55108 -38543 -38665 -12986 15549 22194 -2952 14996 22645 23365 14 -24457 9068
16497 9068 34364 12063 -12280 -8298 -21163 -52935 -90020 -104936 -112747 -85753 -69211 -73752
16485 -73752 -81127 -82553 -48042 -45404 -33447 -49836 -48164 -22295 -23593 -30673 -40453 -44760 -61343
16472 -61343 -38450 -4433 -5217 -37332 -67594 -27327 14508 20665 31414 -7805 -44098 -16448
16460 -16448 20814 607 -37463 -40076 -35580 23663 6364 -7416 -12986 -1340 -22691 -61162
16448 -61162 -42621 -48088 -59311 -42363 -36731 -32647 -20464 -36185 -48078 -51773 -89374 -117334
16436 -117334 -81620 -15941 4941 5923 10031 32553 8988 -1333 1704 -10373 -2444 6597 -11019
16423 -11019 -40306 -58495 -84314 -64002 -58960 -44146 -11056 -2254 -14628 -49061 -101966 -110908
16411 -110908 -94627 -39477 -18331 -42370 -29769 -6395 98 -18818 -10434 5748 -9922 7701
16399 7701 -8673 -17315 -38700 -53088 -69701 -33047 -25980 -18072 16618 44034 45531 54594 12588
16386 12588 -6261 -9608 -20741 -41822 -42151 -5583 -11580 -17461 -14281 15197 38913 -26997 -60257
16373 -60257 -85255 -66367 -70122 -77087 -99317 -92202 -117230 -129693 -98865 -45120 12678 12265 -13342
16360 -13342 -25567 -40888 -40811 -21860 14435 -27490 -68147 -56847 -49542 -64274 -87645 -83493 -48795
16347 -48795 -20704 8479 28727 5467 -22167 1061 18195 15096 11704 21577 4532 26502
16335 26502 43884 25424 1863 -50889 -90 5122 -26345 -45322 -44737 -682 43623 61270
16323 61270 -4850 -23329 9731 685 -13561 -13831 3619 11015 -18448 -51894 -53947 -54958 -41122
16310 -41122 -42330 -58875 -42504 33837 17240 -3732 -12544 -42214 -63377 -44320 -41450 -30807
16298 -30807 -3268 28915 37802 26312 19903 -3486 -19230 24257 15041 -15617 768 24583
16286 24583 13460 33356 45417 7335 -26786 -40925 -83514 -127157 -100992 -18469 5052 22916
16274 22916 23730 -16776 -35027 -43321 -49518 -32059 -43758 -60715 -77961 -86323 -61376 -50531 -44172
16261 -44172 -21797 -34574 -46980 -4141 -48598 -90614 -44794 -38868 -43062 -65354 -81112 -76894
16249 -76894 -79216 -50207 -6417 -27900 -41923 10058 -23241 -41464 -35386 -27655 -19196 9476
16237 9476 33584 -762 22182 26753 26727 56056 63232 59926 54917 18156 -24621 -31430 -73154
16224 -73154 -83114 -60550 -35678 131 -6156 9205 2661 3287 27523 42607 6418 -11844 -19426
16211 -19426 -42427 -45084 -4918 9810 -6681 -27630 7580 7396 31885 33251 24709 -2671 -24000
16198 -24000 -27487 -38709 -54800 -113865 -106739 -87944 -67734 -45494 -30027 -18309 -22073 13623
16186 13623 -3475 -34521 -31783 -27748 -18170 -24305 -12924 26216 -19744 -63932 -77771 -87237 -81236
16173 -81236 -119450 -85579 -66696 -36142 -52785 -43178 -11351 -9355 -13083 -11894 -22728 -59260
16161 -59260 -66285 -40230 -26265 -61318 -89386 -100705 -78533 -55921 -54882 -74378 -100569 -63461
16149 -63461 -60009 -64989 -38655 -24131 -26697 -35259 -6616 -4165 -42652 -60273 -47471 -33245 -50178
16136 -50178 -77735 -46419 -53779 -74847 -98473 -78683 -51449 -56139 -75997 -37517 -57660 -63543
16124 -63543 -10459 -15685 -28017 -23881 -498 5786 -19831 -14039 39590 19526 -69 18318
16112 18318 37255 -26285 -87073 -65695 -61316 -62971 -3278 15218 -26466 -36310 -23536 -9904
16100 -9904 1849 14017 -349 34544 60362 32630 52281 51858 -3000 -27087 -34361 -28131 -2791
16087 -2791 14209 11373 15017 50146 36487 9453 14839 13041 21181 11049 2221 -29912 -65517
16074 -65517 -70982 -45928 -38060 -57310 -85180 -99768 -85243 -49649 -12952 -12474 -22176 -74264 -82362
16061 -82362 -42612 -23793 113 11807 9645 26395 26579 7152 -32006 -55072 -42846 -44529
16049 -44529 -66629 -85253 -60083 -44877 -78513 -55929 3374 37809 36919 42521 42387 17959 2214
16036 2214 -18136 -29592 -34181 -8137 35191 30936 6570 5980 -21485 -75229 -76427 -31031 -29470
16023 -29470 -38819 -25099 -2364 -32943 -40644 -36176 -28856 -20333 6710 14200 -10375 -15852 -1331
16010 -1331 3309 -27577 -54279 -59353 5387 46555 18334 -4084 33501 31314 -40676 -51408
15998 -51408 -12055 10226 24064 38407 1294 -40161 -13923 14569 9574 -5882 8318 19149
15986 19149 18290 8067 -26624 -11657 -8479 -13866 -15144 46532 39067 23506 -2845 -42095 -61614
15973 -61614 -28888 4725 4392 -1490 -1421 11694 49937 27679 3782 12904 34587 15537 18575
15960 18575 16101 3201 5510 12984 35500 31207 32561 22630 34882 39770 16774 13403 -6495
15947 -6495 -7534 -21607 -44800 -17939 10155 19869 17119 -28649 -34227 -8697 -61426 -112858 -106358
15934 -106358 -68589 -67406 -67096 -32142 -36973 -46743 -56458 -71863 -56121 -43421 -48874 -25683 -16945
15921 -16945 -6475 -34975 -62895 -43159 -14723 -9633 -100092 -86014 -53514 -11773 47428 167
15909 167 -61058 -31256 -6789 -3698 26591 37300 20153 -20567 -8038 -32117 -65783 -82207
15897 -82207 -46685 -44224 -22182 -17130 -21019 -7277 1569 -65705 -99766 -67023 -21887 1870
15885 1870 -4635 23092 29462 20864 15677 5362 -609 25066 -3382 35175 45161 5932 -26162
15872 -26162 -25470 -23902 -39324 -42710 -42347 -69319 -86948 -117305 -117388 -61537 -43606 -75756 -105494
15859 -105494 -111021 -130012 -162739 -122468 -103084 -111617 -53607 -44008 -7431 26404 27376 23990 16798
15846 16798 -4235 -21966 -992 -17720 -31235 -45955 -43108 -20767 -14871 -16034 -31559 -53080
15834 -53080 -40886 -46196 -5266 14782 19544 36663 8085 -14881 -25390 -28071 -31044 -89802
15822 -89802 -91415 -78901 -27483 -22231 -46131 -63016 -68747 -46433 -38744 -58296 -28496 8581
15810 8581 7310 26816 29010 -14385 -46239 -45840 -21826 6169 12771 -14605 -53614 -40602 -11790
15797 -11790 26112 -25172 -68108 -32720 -14816 -47234 -57687 -29738 -5663 28994 71210 47336
15785 47336 46025 33683 23778 44364 42636 29656 14286 -4783 -46709 -19783 -3626 -18226
15773 -18226 -12321 -9515 -31332 -7556 -4620 -26363 -9980 18084 8042 -15368 -31823 -71384
15761 -71384 -49366 -39470 -41972 -32067 -52302 -60250 -28451 -13140 -34221 -11550 32297 25157 -10191
15748 -10191 -10043 13932 30059 27775 13852 3990 7998 24673 20465 38756 17972 10024 -6463
15735 -6463 2612 24997 4590 -31003 -34050 -38880 -44099 -35568 7879 13158 6033 23715 5748
15722 5748 -6464 30041 -7986 -41279 -40074 -43116 -42301 11282 30614 15254 -11430 22093 2959
15709 2959 -76404 -83678 -22773 -7394 -40891 -46908 -64280 -65053 -70258 -49064 -51340 -70030 -71787
15696 -71787 -45199 6182 40206 39856 29767 30931 6810 -28321 -88704 -93388 -104261 -83307
15684 -83307 -86397 -84092 -77204 -3639 44036 54673 37558 24402 12706 6025 14783 14183 24896
15671 24896 27645 2566 -31394 -23362 16115 -4146 -25281 -40085 -47067 -47665 -42372 -31622 -21361
15658 -21361 -43206 -95569 -66453 -32643 -18072 -12441 -2232 -27961 -8801 16676 -10506 -53383
15646 -53383 -42818 -21506 -40997 -74810 -73131 -75983 -59789 -54282 -46267 -21812 -29280 -30132 -25111
15633 -25111 -24756 -7207 6849 10657 35013 9271 -11608 -15278 -15568 -9326 -11536 -12522 4464 7427
15619 7427 8541 -7422 -21643 -56396 -20639 -32833 -48281 -25387 -12669 -44485 -58818 -37844
15607 -37844 -28888 -28084 -47311 -20689 22474 53922 64252 51190 30184 7255 -16212 -26383
15595 -26383 -2639 25357 18061 14417 -11780 -19312 -2024 -24549 -26582 -19478 -39241 -55538 -83702
15582 -83702 -63741 -55010 -83931 -90328 -29679 -2678 -235 -73300 -101479 -34767 -33417 -71119
15570 -71119 -31987 19944 16481 21529 19928 17728 22772 -10380 -29437 -13469 -20354 -24425 6493
15557 6493 15361 -7120 -13503 -13515 5286 -38274 -68113 -120043 -127705 -106869 -89081 -63950 -40432
15544 -40432 -39951 -68061 -80459 -26992 18542 624 -5161 -2059 12273 19056 -2067 7635 40948
15531 40948 44789 36655 64510 49107 21353 -29408 -41309 -17716 1300 -7262 -15392 16457
15519 16457 43646 55168 63464 56099 7518 -22073 -42715 -55465 -36048 -69435 -77145 -24310
15507 -24310 -18238 -48036 -67789 -81422 -72437 -55461 -26541 -24654 -49909 -39269 -4412 -9695
15495 -9695 11790 18435 13624 16110 44564 57521 51684 25748 45817 25043 37090 51312 48677
15482 48677 16187 -12949 -21098 -458 6901 -40245 -66218 -37729 -3296 9182 -2175 2731
15470 2731 1926 -2477 -20287 7673 -6271 -12316 22870 40515 -26155 -19264 -6981 -34387 -34633
15457 -34633 -30474 -24759 1752 7556 15413 25880 -7849 -64333 -73948 -73304 -60695 -69366 -47525
15444 -47525 -12241 11987 46752 36517 11563 43102 40192 -5241 32640 29703 -4673 -14103
15432 -14103 -25387 -45495 -63731 -56257 -21212 -8763 -16023 7358 -24710 -47448 -20438 21005
15420 21005 28763 45914 70961 47135 28812 -30 -44829 -32834 -25543 -26677 295 -18097
15408 -18097 204 23395 50536 38909 9494 -23563 -39640 -26587 -3166 -17824 -41395 -29573
15396 -29573 -9330 1639 20738 -7579 -50814 -30110 1587 -7117 4744 -31784 -46532 -30447
15384 -30447 -53471 -63013 -73957 -46301 -19638 -6888 -19885 -14583 -5431 -24834 -23243 -17809 -32128
15371 -32128 -53837 -53483 -49984 1024 23999 47208 16884 -29099 -20174 -35230 -13889 -22654 -38636
15358 -38636 -28811 -29194 -31558 -45448 -43528 -32235 -26542 -39329 -32698 -7470 -31354 -73654 -49807
15345 -49807 -28652 4885 11467 -4505 -16268 -58186 -82634 -81273 -86229 -46596 -26390 -51912
15333 -51912 -74458 -47867 -23609 9476 -3411 -14809 -18293 -40725 -20330 -12899 -35943 -37748
15321 -37748 4890 -1278 -34115 -65836 -50932 -23256 -686 -9270 -14626 -46601 -30217 -24803
15309 -24803 -10874 -43185 -68217 -74238 -62895 -41828 2709 19366 10920 -39269 -94415 -104401
15297 -104401 -86168 -78890 -82991 3786 43336 20602 -23276 52 58201 44748 55251 62025
15285 62025 39990 -23943 -51301 -51938 -59020 -68838 -75768 -56612 -31556 -61764 -98354 -86062 -68616
15272 -68616 -55370 -70629 -53223 -16200 11712 17388 15875 -13717 -12808 -29401 -30546 19801 13607
15259 13607 -13491 -12141 -28736 -29633 -307 -11722 -41516 -40698 -42963 -8566 -1022 -61530 -55612
15246 -55612 -10104 14329 -784 663 -21872 -40682 -47661 -37943 880 45636 14955 -7234
15234 -7234 -36697 -56834 -63852 -43909 -17966 3636 33716 16284 -954 14255 9564 19996
15222 19996 40867 6185 -35189 -40994 -22616 -11281 -18684 -34899 -38578 -35419 -16121 -16395 -25276
15209 -25276 -10369 2678 -26515 -71294 -63443 12038 47889 28568 -18805 -16273 -14112 3534
15197 3534 13022 -44510 -27447 -7395 -28241 -16261 25041 24085 1299 -12323 -24154 -5446
15185 -5446 -21578 -58388 -50491 -56597 -25382 31166 60010 62202 57342 53947 48247 21571 -14538
15172 -14538 -11026 2810 -17876 -22469 -14363 -35740 -70577 -51647 -60424 -81913 -72639 -6739 1898
15159 1898 -23087 -36482 -35517 -42183 -53435 -91035 -89804 -64433 -42153 -27578 -44771 -43885 -59391
15146 -59391 -38325 -35197 -37965 -61631 -47795 -5961 43790 22723 4653 17311 1411 3500
15134 3500 7929 -28108 -48381 -22242 -12205 -31260 9631 -4492 15594 36503 32416 44002
15122 44002 52260 40044 53781 51332 -3867 -48855 -71414 -72867 -24212 -10026 -45978 -89895
15110 -89895 -91885 -89942 -103211 -83649 -78243 -71724 -9643 -8112 -28394 -53214 -68143 -58854 -5486
15097 -5486 -6149 20676 -14172 -28501 -21987 -37438 -68968 -65837 -52727 -53997 -84159 -64664 -40485
15084 -40485 -18056 -29083 -66835 -76394 -83227 -49198 -5628 4512 20309 -9431 -3917 33278
15072 33278 33101 -3906 -31514 -12614 -11488 7981 21115 12938 -18861 -26936 -37790 -49160 -55941
15059 -55941 -54611 -12251 -6621 -24278 -30353 7376 28871 7704 -22588 -56147 -81337 -60753
15047 -60753 -31233 -39741 -53887 -68431 -83985 -44740 -12977 -4793 -6605 -24051 -55500 -53250
15035 -53250 -25653 -18400 16412 7690 -9109 4534 15743 7307 -332 2509 27801 4652 -52382
15022 -52382 -56217 -13343 -14548 -41981 -65609 -87299 -113264 -120668 -64900 -15034 31461 46843
15010 46843 -2738 -76595 -109562 -126170 -50998 5667 -35672 -66232 -71807 -54867 -5670 -21773
14998 -21773 -45599 -42939 -70411 -57982 -53177 -46561 -11737 39055 58436 45754 -32577 -84368
14986 -84368 -96443 -69255 -53781 -48677 -17186 -44876 -70399 -60034 -78860 -74453 -56413 -48838
14974 -48838 -27040 -18944 -14231 -15693 -11517 -9340 -29354 -65805 -76646 -35949 -24308 -45141 -53125
14961 -53125 6748 41856 -15671 -42332 -82615 -83657 -75582 -33376 -18126 11808 29128 37058
14949 37058 12752 -30229 -4049 14858 11091 3673 9290 -1233 -548 18506 -6186 -33831 -29289
14936 -29289 -74363 -131097 -103287 -51554 -23337 -7024 -22490 -34208 -2217 6992 10816 -27679
14924 -27679 -59206 -42365 -26483 4051 3018 30751 18015 -29399 -30026 -44354 7937 11597
14912 11597 -7436 -64151 -99218 -65417 -6799 -8089 -17157 -14767 -3585 11588 -15010 -47682
14900 -47682 -21744 -1545 -41130 -31490 -15489 -12743 -11535 13704 60747 21997 -4093 -21330
14888 -21330 -33916 -68234 -90543 -75206 -27177 -22537 -41302 -38467 -29482 -28419 -11652 -6742 -2617
14875 -2617 -730 4670 -9154 -3995 -36166 -64879 -73709 -19751 28269 14809 -30522 -31308 -28264
14862 -28264 -30639 -47785 -76199 -89997 -99143 -38958 -55056 -75922 -83020 -75135 -46720 -56599 -42942
14849 -42942 -10814 -24246 -50917 -65465 -62237 -65592 -13047 -20236 -26344 -35091 -65077 -48567 -11899
14836 -11899 -28311 -39395 -55260 -59493 -11116 5527 6984 19262 27435 10667 -11699 -30241
14824 -30241 -59403 -79386 -87406 -43029 -6916 -20435 -30148 -52142 -71024 -44754 -10887 39810
14812 39810 63279 30084 -10452 -8958 21349 43428 12606 -14628 21733 56955 25919 -46742
14800 -46742 -67902 -30028 -23140 -18004 -16438 6424 30168 34764 25606 -4270 -4279 12978 32503
14787 32503 19686 37378 25157 3123 -40246 -18231 20210 -5262 -15704 -7658 -12293 -15925
14775 -15925 15754 16258 -49501 -71003 -25826 -3456 12106 31753 7846 -22324 950 23978
14763 23978 -19224 -41138 -23543 -3389 -4695 -16599 -55881 -70990 -51125 -39943 -55640 -20238
14751 -20238 -3657 -23418 -6897 15074 13520 -6663 -8397 -11739 -22096 -33604 -3627 -5212
14739 -5212 -34482 -35650 -67312 -102843 -95565 -83015 -85379 -67583 -57497 -46767 -16059 35360
14727 35360 42743 3292 24771 17790 9630 20217 -14166 -38130 -53155 -17834 9225 10044 -13700
14714 -13700 -29777 -30225 -24014 -20041 -16993 5288 946 -22203 -35183 -19898 -5599 2953 -13027
14701 -13027 -16911 -45906 -72562 -47514 2238 21662 -11113 -4704 -2223 -19897 -23005 -39737
14689 -39737 -42313 -44022 -56488 -106457 -75066 -50297 -48500 -53175 -33032 8198 46033 28846
14677 28846 34908 -623 -13404 -23053 -45783 -38419 -27203 24563 58204 60047 70635 75852 65167
14664 65167 76835 44564 11411 42101 61805 31795 720 25983 32558 51692 62693 53609
14652 53609 45663 8110 -38110 -33193 -1359 -11266 -52928 -77599 -69293 -17612 -577 19735
14640 19735 23296 2890 -1656 -48479 -35361 -15640 -3783 -13950 8081 17924 12181 -12539
14628 -12539 -33576 -69330 -47120 -29925 -32636 -24712 844 -12473 -1641 5810 12696 35168
14616 35168 23552 5220 -5950 20366 45506 50595 25116 10333 45582 69371 62364 40140
14604 40140 -15343 -18135 -5620 -26794 -37086 -17161 -24740 -16589 13420 310 14367 6358
14592 6358 11075 -2326 -47067 -77966 -44036 416 2203 -34355 -68371 -32276 -11452 5553
14580 5553 11791 4373 -19134 -69335 -85136 -77426 -70239 -17986 -3326 -1854 -24400 -24523 36323
14567 36323 43052 23878 18373 -15585 -22644 10691 9064 -41187 -71290 -37993 -37498 -55042 -57090
14554 -57090 -9325 6529 13751 24535 26656 2628 -16711 -25112 33024 60557 41562 15751
14542 15751 -13436 18505 26244 -24752 -60288 -36753 -2071 27719 32494 -6222 5457 33579
14530 33579 3495 -41534 -29127 -31235 -38790 -27852 -25449 -14366 -10241 -3235 4112 15166 15502
14517 15502 40209 16103 -36545 -64403 -102396 -96863 -40763 -53779 -60229 -42949 -48399 -44582
14505 -44582 -19597 9923 -8719 -15190 6282 -29890 -30036 -60069 -62989 -66465 -61848 -99052 -132818
14492 -132818 -83675 -62415 -50657 -46092 -3591 16709 -16122 -29781 -54973 -18623 6825 -30118
14480 -30118 -38485 -8103 -3353 6537 -1991 -118 -16494 -21825 -54578 -22931 15329 -23346 -54042
14467 -54042 -52938 -42813 -32614 -60850 -78471 -53542 -34567 -27741 -19904 -33353 -37532 -44176 -47898
14454 -47898 -52912 -75097 -25840 -5686 1337 9391 44786 38688 -616 -21526 -18914 -50433 -79765
14441 -79765 -75669 -42760 -22826 22640 18999 13978 6583 300 4767 -16385 7500 33062 42477
14428 42477 86159 109258 48039 26352 22321 11714 -7517 -33311 -11933 -3255 31525 18597
14416 18597 -12554 -23451 -19169 -22790 -2352 -6480 -13647 -5961 -32210 1025 44507 61998 6709
14403 6709 -57727 -83605 -77471 -61014 -46981 -21119 -2516 8127 -15710 -35444 -3193 -12531
14391 -12531 -80247 -71917 -81564 -120951 -76166 -30125 8087 18772 10324 -28546 -55741 -65504
14379 -65504 1156 42060 55384 56272 34325 -2425 -8450 -7668 11263 -6382 -28697 -314 -20785
14366 -20785 -42477 -81213 -78340 -82204 -99340 -79162 -62734 -45294 -51389 -34852 -17602 -26865
14354 -26865 -15835 -11196 -24818 -36858 -40966 -36973 -22173 20584 25270 22692 -10512 -30663 -9633
14341 -9633 -10013 8730 6762 5003 37830 41051 15685 -6341 -48194 -43749 -73424 -70448 -44633
14328 -44633 4824 29193 -4414 -39055 -63175 -32486 -22521 -24046 -40134 -54002 -64751 -77618
14316 -77618 -73356 -40368 -22433 10351 -28579 -56538 -61479 -20503 29925 28072 -17541 -45108
14304 -45108 -18871 -3117 21180 65556 23603 -1574 6413 7749 40568 19928 -134 -6385
14292 -6385 -5110 12121 29034 30629 24125 12740 14649 21127 6010 -21150 -5868 16005 24090
14279 24090 -4761 12964 -2022 -51798 -47573 -40334 -53763 -62661 11882 73416 36038 -6125
14267 -6125 -38134 -70038 -110913 -131832 -101868 -105925 -110451 -147756 -158021 -89687 -21870 -36696
14255 -36696 -34398 -60234 -81358 -68505 -65089 -52695 -42586 -45530 -43472 -68259 -14842 42501
14243 42501 -3480 -28476 -21142 -6618 -5146 -2432 17722 800 -42547 -41763 -40005 -32032 -14863
14230 -14863 -31099 -65744 -76490 -83868 -67762 -62337 -68312 -67401 -30778 4766 33227 37926 -2142
14217 -2142 -11053 -19659 -19288 19133 32371 44602 51035 4119 -13699 -44554 -19138 13301 41252
14204 41252 23608 -15071 -45697 -59159 -25088 23282 29408 -7970 -21142 -34615 -11215 -4592
14192 -4592 -20814 -861 -36025 -55338 -61900 -32207 33244 72446 72875 37982 -16645 -20880 -63670
14179 -63670 -52759 10544 25603 6135 25190 62505 89115 67684 42244 14452 -20634 -2995
14167 -2995 9617 25083 20431 -2970 12809 50262 52524 1194 -19918 -19514 -12870 -32201 -51301
14154 -51301 -30624 9237 32434 49969 78438 84076 72975 50934 39992 -10479 -26208 -40679
14142 -40679 -39500 -39974 -29137 17584 41229 83720 74398 -3427 -2087 -10223 -10733 15179 16002 29233
14128 29233 58519 52965 36228 24878 29907 33128 46412 17606 12798 16489 -9135 33535 80570
14115 80570 70504 -3977 -44892 -40416 -5501 38978 34507 8992 1432 7867 -3846 -28868
14103 -28868 -10644 -2490 34112 27233 13484 2961 28287 32224 7055 -37669 -32203 -9832
14091 -9832 25537 28244 -17674 -69548 -85031 -51123 14399 25037 7169 29293 32005 -37762
14079 -37762 -47468 -4545 58227 73036 58938 -3263 -9393 3115 13841 20974 12342 -3710
14067 -3710 -13509 -27726 -17720 -834 1595 25693 56027 33066 5558 9214 -14421 -68981
14055 -68981 -80426 -22913 18043 54284 23827 -13775 -34168 -42821 -20412 16615 -19497 -37679
14043 -37679 -53957 -45625 -59651 -75407 -77794 -65204 -37040 -37446 -31939 -33440 -42223 -47071 -13284
14030 -13284 26027 -26310 -35037 -9087 -14066 4167 32037 23112 10007 -28812 -23053 13377
14018 13377 17649 28128 33745 -6981 1235 -18117 -40275 3002 37958 17854 -20625 -26156
14006 -26156 -29755 -37284 -2544 59024 36308 33850 -440 11278 39281 38207 52033 59107 50792
13993 50792 21187 -3981 22261 25177 17557 17816 53247 26308 38269 92028 107043 69102
13981 69102 24004 14220 19757 27105 26320 -11686 -4395 -45843 -21861 3005 4068 -24622 -22162
13968 -22162 5456 -1482 -24591 -13339 40912 28853 -4470 -13526 -29199 -27036 -58102 -46552
13956 -46552 -51066 -16425 13660 17343 11906 -37009 -59886 -54143 -35056 -23297 -64788 -106840
13944 -106840 -65350 -60654 -51414 -16669 -22796 -39410 -34612 -30221 -42518 -16431 1896 -6056 13158
13931 13158 6514 -17632 -32856 -23372 35691 56200 42940 40067 54969 54727 51017 59061 18748
13918 18748 -3039 -5095 28160 49805 27029 18941 33654 1400 17982 -7245 -57896 -41023
13906 -41023 -62704 -82799 -57668 -8204 -4237 -14494 -12856 2916 -19016 -54171 -3734 2423
13894 2423 -20081 8571 9483 34192 54223 58553 54382 84392 71626 11529 -14677 -34027 -50573
13881 -50573 -14753 -8068 -9046 29729 39498 16465 -5026 -73 -22708 -40344 -68434 -22228 -5318
13868 -5318 -17004 -40177 -25496 21417 26083 6070 26212 36145 14384 -31663 -28508 14601
13856 14601 16875 -11201 -29887 -2828 16218 47204 80627 57857 42197 -7889 -17668 -27373
13844 -27373 -61342 -51349 -26372 -15833 8281 22699 -13589 -17242 19243 76223 19545 -29853
13832 -29853 21277 61687 48127 40673 38910 18687 7078 6391 58146 46634 20487 42320
13820 42320 66112 57254 82424 77674 52481 28965 49139 43403 32137 76179 57506 25605
13808 25605 13562 -61402 -86774 -89616 -72761 -5083 17310 28842 -2151 -61303 -66822 9379
13796 9379 51087 40382 52730 56283 52059 46359 49928 40514 16113 -39701 -65732 -21466 -4828
13783 -4828 12798 64426 83956 89091 62618 55266 13642 -40720 -28719 29658 40247 32705
13771 32705 27980 33444 36926 48930 55540 29797 -10054 -55404 -41882 -14770 38350 42837 77533
13758 77533 106421 91936 43455 -8988 -13484 -28219 9627 26711 56311 71473 24487 6849
13746 6849 10664 19736 32754 7696 -7520 21585 54331 42634 7314 -9637 11045 32686
13734 32686 49409 74114 92406 50591 39542 71837 60751 49910 15265 43040 60468 13962
13722 13962 37630 59677 75122 83710 42021 48543 60394 61962 25376 -16110 -20699 -11493 -6362
13709 -6362 -14936 -40794 -19390 -22600 -27503 -8981 1548 -15155 -10179 -7278 5412 47645 64295
13696 64295 65121 68114 58735 44312 10017 -11434 -9752 14255 5871 30430 21273 -2931 45184
13683 45184 24364 -10278 -5864 37885 43056 62999 87775 64705 44373 4887 -13874 6096
13671 6096 -587 -9305 -15171 -21485 -13086 -16012 4690 36343 8630 -10170 21241 41438 27914
13658 27914 27949 -399 -12627 16610 37561 27593 25316 18252 8275 22917 4732 -50158 -28198
13645 -28198 1401 24029 30942 14043 1242 39129 59822 55483 877 -16878 -17322 25245
13633 25245 30278 16067 73024 40844 -8109 -10059 25092 76305 75214 65731 -4180 -53642
13621 -53642 -81695 -79914 -859 64720 43363 9656 13599 15784 3559 -30342 -35358 -23277
13609 -23277 -5117 -23324 -7710 20371 46478 68482 94006 59097 51834 37584 -13777 32357
13597 32357 23232 13651 16166 26934 45816 19385 20550 9759 16928 31769 15742 458 3537
13584 3537 10065 -52864 -63916 -32673 -29675 -34602 10369 13478 -7504 -2668 44852 -3129 -23977
13571 -23977 -23721 -43550 -38456 -23802 -920 -3473 110 18427 75725 103191 73556 50148 69222
13558 69222 45527 27527 41601 6502 -8497 22291 14167 17233 3965 -31759 -25412 -39559
13546 -39559 -7113 23106 52440 13524 12948 6738 36336 32321 -1140 -21720 -18017 8052 11508
13533 11508 14864 12110 -21684 -21974 -28217 -38771 -35590 -36788 -9728 15985 32599 44088 45197
13520 45197 25746 36985 47835 61520 81667 70137 54566 44422 37229 12267 -15456 4048
13508 4048 15398 -13220 4755 -6618 -43629 -50727 -9050 34743 33687 11037 31343 43964
13496 43964 33824 33570 963 -43104 -23762 -10740 11538 23048 25391 29160 47857 41165 18098
13483 18098 1296 -5476 19061 105 -41530 -45946 -28233 -1386 25171 28673 -16543 577
13471 577 16702 10853 37190 34308 -1334 -8361 7087 -9374 -3456 -6998 -28049 -27815 14722
13458 14722 39067 -985 -10645 -15356 -5547 -11248 -31017 -11788 -16382 -29492 -62048 -18341 41740
13445 41740 78357 70094 32991 22935 23615 45772 57491 54239 36084 43170 34635 19020 -2229
13432 -2229 -36844 -68336 -63263 -19875 300 -10109 -4097 -17423 -25567 -24523 -5124 -5969 -8684
13419 -8684 -46593 -40743 5514 29331 69889 47375 -387 -34547 -24930 -19239 -9647 -1275 24682
13406 24682 17229 27360 49045 40250 26798 29983 10761 30665 8909 -55012 -28586 15724
13394 15724 28412 34674 39458 24986 -26922 -21410 -25590 -31371 -12655 12118 16629 22633 15241
13381 15241 -968 -22173 -40656 -25724 -29482 -45428 -41502 -3567 16966 38533 27280 762
13369 762 -35521 -47167 -57027 -54527 -49751 -43157 -20063 10290 20654 -3628 -2106 -22892 -14056
13356 -14056 -2029 -6349 -25248 -1570 645 -8886 -34195 -50798 -64733 -68170 -32389 17548
13344 17548 21215 42908 37914 21270 16188 26146 40278 23043 -25436 -10388 35611 30311 12950
13331 12950 -2702 -18403 -22667 497 23247 5900 -21285 -40073 -43081 10196 -13642 3627
13319 3627 16582 53869 53147 1959 -7184 28877 44206 32500 26456 26193 -12315 -20951 15228
13306 15228 24495 25336 24114 26963 19737 -27306 -6986 31469 50522 27963 51183 35906 -4472
13293 -4472 -6909 10794 14250 -25537 -9808 9309 2073 33244 23482 17495 22874 7532 -2021
13280 -2021 1960 -9127 -38879 -20953 -24828 -3443 39021 3993 7725 -9278 -44264 -54311
13268 -54311 -33538 -10384 -6062 8001 6957 -19564 -43516 -34386 -27210 -32928 -34180 -29603 -51696
13255 -51696 -87354 -104381 -59728 -21725 2854 40780 15575 32771 46309 66701 85765 19564
13243 19564 4005 -17728 -20316 -8580 9869 14607 8521 -11035 -7170 -31602 -43310 -46309 -44903
13230 -44903 -6070 -17352 -33932 -11016 -22037 -44935 -14215 3057 -6489 11952 46755 25090
13218 25090 -20955 -37106 -27208 -13794 -6285 1051 6514 -8094 -1190 41548 29401 -6152 10553
13205 10553 60596 26457 -11215 -2257 -34313 -50497 -25046 -30257 -53874 -59497 -4852 30863
13193 30863 13162 -7949 -14010 -17851 -21323 -42507 -71725 -25816 13433 28226 38991 32291
13181 32291 29508 24808 18634 -10423 -49809 -41474 3682 -21906 -14830 -17492 24520 44095 21479
13168 21479 33185 833 -749 13358 -43949 -56339 -51336 -31364 24912 -10410 -28805 -24316
13156 -24316 982 7480 5906 38756 56056 39458 15648 -20306 -4664 12019 12939 -25983
13144 -25983 -10754 12490 11307 -7969 -9722 3566 -33717 -40296 -50596 -54321 -48376 -62631 -26003
13131 -26003 -32281 -31143 -27622 -25958 212 -2263 15328 43094 41461 11028 -8193 -62110 -77655
13118 -77655 -38551 -3666 -18864 -32639 1072 47549 32845 2038 -3900 44817 72574 44377
13106 44377 25244 -16265 -25385 -515 -54 -2705 9455 37017 49692 19521 -13345 -25583
13094 -25583 -5337 15558 -2467 -49713 -64599 -43855 2739 8996 -16455 -7518 40113 45677
13082 45677 47712 57291 38209 23602 22509 11865 24584 54001 104746 111232 98011 95999 108510
13069 108510 87239 41605 42211 27347 48066 51330 72459 37131 -3824 -546 15719 29860
13057 29860 57336 21083 -649 -26393 -8867 11519 -13015 -20599 7138 -1879 -4643 14789
13045 14789 4239 13323 -30278 -18336 -842 14161 15904 39084 70008 105687 120611 102437
13033 102437 103212 131965 164410 161865 165506 155017 115211 129411 125468 126455 67921 45937 42876
13020 42876 25700 31515 33752 42405 20200 73782 66872 73294 95976 49911 36037 48616 39623
13007 39623 35400 49666 38562 31809 14962 2711 11170 24889 24127 67543 93203 62491 74943
12994 74943 83584 63680 84915 90616 127622 96868 85803 121216 140308 151845 190780 187641
12982 187641 189353 206387 168006 144595 101275 57931 39238 28319 14477 31523 16256 8653
12970 8653 6026 -27299 -12805 36308 51187 41386 10983 12605 36675 19516 -15162 -22542 4209
12957 4209 15355 22358 14039 57479 71280 83995 84998 48023 49776 60292 50666 55739 20999
12944 20999 24297 26566 37162 26255 29170 42356 37987 37545 22932 29628 12949 31110 31722
12931 31722 13668 3348 80622 135724 135294 120671 87881 46245 50035 61548 81020 126066
12919 126066 177203 171100 183944 182170 141690 115428 116086 78545 97552 107491 88547 83764 96442
12906 96442 101114 141518 152707 155080 138093 150764 165680 176630 183244 219659 226469 230933 242732
12893 242732 281720 276298 240769 229535 238136 196401 196191 217513 195374 149320 120832 132195
12881 132195 148954 122733 93611 111385 122483 111437 104170 105936 102785 130367 101484 51085
12869 51085 74102 102095 122083 126859 92825 82879 102188 136783 166910 174564 186781 155205
12857 155205 172552 166553 131309 113013 132725 111910 35120 23729 30565 71194 102012 86074
12845 86074 38248 27631 16520 15219 5800 15236 9878 4812 14164 32015 60566 41543 14129
12832 14129 4253 -5336 -17114 -29054 -37819 -17783 2664 32149 27755 18392 9242 21876 31410
12819 31410 52075 57656 31343 16689 74888 136985 143094 112474 93585 66217 41879 15786
12807 15786 24989 31835 49615 40619 8989 1051 -3861 39793 77319 70975 65762 114937 120949
12794 120949 73876 52771 69087 82742 73169 61656 21353 17210 -5067 -12119 139 -3931
12782 -3931 -4556 9893 58917 72032 81871 76337 56687 77239 98071 43658 -12136 -26414 -23846
12769 -23846 -44580 -7565 -19947 13951 47340 53469 24470 8200 1054 50776 80855 55049
12757 55049 31704 48534 100319 113533 89646 61882 89530 120041 115285 83521 73880 90133
12745 90133 105407 103541 90867 84574 56006 33930 22750 -53797 -83987 -53378 -18616 12704
12733 12704 -21966 2584 14278 26867 15124 7782 41580 50590 46426 62091 99253 118191
12721 118191 131326 114795 89597 92213 63330 72139 93585 39898 14959 13636 31657 66388
12709 66388 70340 29368 24690 48617 30669 41608 58833 44175 15794 10584 11185 20164 28072
12696 28072 48380 76374 72636 78167 76383 73221 105186 119368 105789 76650 133116 143296
12684 143296 99025 65751 76629 73097 72141 104054 114739 116763 80799 38457 29300 40818
12672 40818 74927 91865 67744 49565 84490 103021 83126 69949 53111 63771 86453 112121
12660 112121 110572 92960 119175 110364 115036 122094 143806 167415 152580 156750 152016 138847 151164
12647 151164 188269 222141 157525 137570 190161 209949 187746 163140 145428 139568 145508 139461
12635 139461 177760 201643 187530 168783 179764 169826 212720 250183 241191 231230 247542 270378
12623 270378 295423 321084 329418 328630 319979 312499 318239 301627 311617 290711 302923 329108 363732
12610 363732 334425 314618 336566 351029 342963 329087 279094 266296 279631 287134 302548 329390
12598 329390 309086 311842 352568 393929 431707 388592 329746 314155 330670 359744 355568 326093
12586 326093 307020 332891 292891 272695 260784 307775 332365 331556 301560 317912 326852 325541
12574 325541 310162 300747 320337 344505 330071 343747 368677 370112 315968 296874 282393 288649
12562 288649 270155 264867 280512 239642 284395 313957 337497 368392 367797 395873 428856 476917
12550 476917 516671 546864 573472 627945 656698 696196 777134 797622 822081 925410 1011813
12539 1011813 1065866 1128594 1213207 1269066 1325983 1339730 1332818 1316061 1283468 1281899 1260692 1277043
12527 1277043 1279135 1236512 1196841 1197857 1197955 1224225 1276201 1344465 1430272 1481437 1535233 1626668
12515 1626668 1723925 1797680 1887802 2029435 2159829 2255460 2356303 2432442 2524961 2610798 2633962
12504 2633962 2645334 2640221 2639778 2658610 2673360 2681443 2754740 2862698 2976102 3076548 3188946
12493 3188946 3285269 3392024 3486729 3624535 3743830 3943604 4181078 4482818 4930846 5499280
12483 5499280 6100347 6901995 7877631 9056942 10482642 12139774 14008349 16015599 18087643
12474 18087643 19977009 21423032 22326223 22613899 22349703 21538451 20422064 19122022 17812727
12465 17812727 16616515 15645288 14923555 14467110 14297723 14340147 14544926 14879620 15346901
12456 15346901 15958455 16691455 17487327 18464281 19811028 21558551 23699635 26234902 29027306
12447 29027306 31877848 34465344 36499414 37821762 38259420 37908774 36874449 35383470
12439 35383470 33619752 31858559 30272381 29025354 28114384 27546036 27116363 26624670 25970149
12430 25970149 25022069 23905688 22806126 21855296 21130017 20706271 20557047 20660737 20974319
12421 20974319 21432235 22025897 22763077 23779745 25193560 26991911 29199528 31711842
12413 31711842 34278253 36480207 37929102 38276532 37260602 35097366 32070656 28585023
12405 28585023 25147731 21985059 19237724 16896643 15011788 13434004 12126104 11088107
12397 11088107 10211741 9449082 8781730 8228272 7740868 7319173 6926876 6536170 6247473
12388 6247473 6008678 5788462 5560481 5362523 5195613 4990301 4784216 4573968 4344038
12379 4344038 4117455 3881785 3681746 3508841 3340671 3168497 2997941 2821388 2650293
12370 2650293 2501976 2377263 2291543 2186618 2096523 2009867 1916586 1824162 1747283 1727942 1655689
12359 1655689 1570122 1539675 1490019 1438969 1382554 1333126 1253396 1220146 1185929 1156186 1163865
12348 1163865 1151923 1127605 1160449 1205866 1215271 1230358 1209206 1224316 1250344 1309929 1347897
12337 1347897 1358476 1324443 1323302 1320775 1299447 1221518 1168918 1094078 996656 947181 918244 891290
12325 891290 845558 837614 818651 829263 797911 726717 682381 694558 678512 675544 689799 642878
12313 642878 636896 652845 665700 683071 690542 688910 711972 738163 787307 791915 775719 732954
12301 732954 721404 737333 718646 711793 711822 761690 840766 901927 955250 1046130 1116435 1115487 1149582
12288 1149582 1215684 1303341 1333988 1311807 1237140 1178519 1117212 1070240 1021971 961388 943208
12277 943208 986234 995397 962010 951897 947759 974198 954269 944614 937081 941271 940523 941716 971375
12264 971375 951262 950284 967503 1013665 977240 944536 1000011 1050392 1066623 1101669 1150031 1159935
12252 1159935 1206367 1267171 1306855 1337925 1369190 1400002 1417311 1450341 1522678 1554245 1559695
12241 1559695 1631047 1719078 1797494 1910970 2009441 2145445 2292703 2445537 2620952 2819840
12231 2819840 3074932 3381599 3729960 4109127 4533525 5078052 5754492 6529567 7444983
12222 7444983 8574837 9933887 11603440 13594761 15958342 18744607 21854656 25117320
12214 25117320 28352758 31216206 33294323 34249939 33976665 32606330 30424695 27975530
12206 27975530 25603054 23563743 21971507 20796472 20014888 19500359 19132174 18847175 18636003
12197 18636003 18632757 18809695 19281654 20059211 21059059 22233998 23466225 24605307 25609549
12188 25609549 26482805 27263738 28088957 29122746 30433355 32004515 33715725 35332544
12180 35332544 36731072 37728794 38141433 37839376 36727416 34876685 32526642 29890493
12172 29890493 27235067 24836103 22782714 21178730 20019830 19160961 18474728 17916218
12164 17916218 17472478 17065787 16656476 16409391 16386198 16564721 17016900 17676230 18573750
12155 18573750 19688156 20895676 22050021 23066279 23795500 24094866 23905573 23165331 21921646
12146 21921646 20278458 18448681 16592009 14842186 13320485 12087788 11069032 10216403
12138 10216403 9474400 8823510 8266575 7742127 7246256 6815556 6406237 6017923 5687546
12129 5687546 5419017 5181400 5001394 4865581 4733370 4596895 4419887 4277068 4147685
12120 4147685 4011479 3864828 3774326 3706842 3690440 3629339 3514884 3398730 3304943 3229161
12110 3229161 3184705 3163031 3140539 3098217 3043856 2989575 2951289 2876762 2754913 2643075 2553116
12099 2553116 2479116 2390804 2256637 2094897 1969657 1889999 1793069 1722896 1629314 1546023 1562399
12088 1562399 1530233 1512370 1488486 1480934 1480642 1476719 1461589 1462497 1485129 1506788 1530488 1610597
12076 1610597 1636974 1632137 1601599 1544968 1494599 1377601 1276851 1226927 1162922 1119560 1083228
12065 1083228 1025884 967462 915723 890765 820370 762035 752246 726762 685561 670466 679098 652367
12053 652367 596687 581436 614970 639835 657220 599451 580961 577130 542825 521390 527282 540826
12041 540826 559549 574951 618395 573861 501711 539049 575774 622011 621387 611345 588080 551839
12029 551839 509013 470119 494690 528728 533723 543264 508736 485251 473457 451191 442900 453872
12017 453872 445634 457728 459090 413006 413475 478191 547995 560760 535973 547431 514112 525923
12005 525923 561541 573808 576640 560448 546754 539015 545052 523445 483490 460741 457225 473660
11993 473660 449266 456898 496032 542011 524533 531141 542008 546283 574068 614699 573908 525283
11981 525283 514642 519454 535826 564791 584909 580940 557481 596762 631331 597851 565016 539112
11969 539112 514380 537775 533636 499895 493291 517570 568753 612638 624315 614579 651687 662156
11957 662156 660592 671905 649885 636877 640983 666510 656707 655620 645872 679522 728054 760071
11945 760071 776765 786198 826117 855653 897787 918332 931260 959805 980605 1024019 1136122
11934 1136122 1202586 1214357 1250149 1349804 1465194 1587435 1753742 1914369 2092939 2323022
11924 2323022 2628334 2973781 3368333 3852951 4513679 5265046 6213955 7527633 9217429
11915 9217429 11463051 14448517 18557647 24292941 32294252 43076858 56693548 72135866
11907 72135866 86647418 94751083 91711901 78244213 60069426 44014877 32610912
11900 32610912 25097939 20086836 16618885 14194209 12461884 11134785 10108219 9247000
11892 9247000 8548938 8043098 7573769 7177896 6878290 6606231 6386459 6193012 6077998
11883 6077998 6018195 6043636 6076126 6098817 6078682 5899717 5596345 5244573 4925399 4692486
11873 4692486 4463673 4182873 3943037 3787991 3642266 3423517 3209074 3040939 2880173
11864 2880173 2697689 2522927 2373207 2187578 2021700 1892524 1749151 1632633 1560684 1539799
11854 1539799 1499391 1447730 1370491 1318854 1228690 1125846 1058761 1000290 980926 926350 904729
11843 904729 888501 866100 869827 872801 823085 776226 754259 717133 676946 597610 532399 479909
11831 479909 471746 462234 451252 453929 477856 455838 451226 448564 401139 379874 352480 325787
11819 325787 345458 326180 289976 290413 271881 224267 224399 217799 217940 228156 253588 242590 224964
11806 224964 204176 207518 225565 200136 178537 153095 145825 170778 211652 224615 198866 161488
11794 161488 135529 121981 187164 220431 232207 249700 248809 271543 247102 241087 272996 302375
11782 302375 317096 340600 412082 486438 512654 515899 562198 552767 580719 630882 625959 577375
11770 577375 541067 522734 473538 405865 365913 367704 376200 381697 414112 444108 433007 408621
11758 408621 400994 399338 396198 408787 459819 491449 533251 530684 526250 571685 631403 623324 598755
11745 598755 635912 659854 682191 702407 741393 741570 727559 684280 662576 612684 596876 616058
11733 616058 569137 517498 492493 433172 397631 381834 393679 380732 432111 471745 477399 438476
11721 438476 402677 381956 384196 397856 402416 465277 490210 471081 480745 526233 611440 625397
11709 625397 579789 531209 465450 370219 309304 276445 255168 264516 235567 211207 219122 202902
11697 202902 192998 186927 192082 199614 179090 158487 135948 110349 99056 119156 132439 149020
11685 149020 144408 124919 151748 147058 126630 116550 77929 51418 59929 71903 84517 79706
11673 79706 37932 27358 46875 55041 73409 55860 38772 28597 5196 16122 28863 -13787
11661 -13787 -70 11083 -19155 -14329 -8641 -6205 20201 19445 3777 33102 21996 40652 48441
11648 48441 23496 39795 21735 -37995 -13909 39932 107139 124192 88771 44611 37853 25609
11636 25609 31920 27963 8386 -8649 32782 75199 66126 19393 -21917 -2364 42739 -12891
11624 -12891 -25254 -34463 -51041 -42192 -19289 -33919 -43939 -24789 7888 18240 23035 67490
11612 67490 54929 17062 1401 -1475 19125 60379 60097 44804 90687 71835 66334 71316 36857
11599 36857 43851 39447 -286 -6251 9672 40102 69231 81072 94001 80220 31401 18021
11587 18021 -12622 -30240 -12545 -25009 -5323 63653 91984 46963 -385 3733 47755 40281
11575 40281 48496 40357 18885 3601 3245 41584 81913 73664 36485 28342 1640 -28864 8128
11562 8128 13826 24731 67352 57561 17230 14120 -7199 16384 3322 -15870 1015 -5587 -15421
11549 -15421 18458 35718 20869 5220 17611 15123 5103 12830 28266 22821 17986 18944 45156
11536 45156 66690 40377 42712 43153 20071 -23493 -21319 -3324 -6321 -6446 -8393 -39420 -26894
11523 -26894 2183 17439 31913 4928 9057 13301 16303 31455 14117 28172 30044 6505
11511 6505 8261 26113 44100 14763 -12206 -11955 -11577 17298 11965 38894 37080 10773 36457
11498 36457 55731 93546 78973 45114 33166 29347 62442 91218 44219 3114 -668 -22652
11486 -22652 1826 48444 45046 10563 -5954 20231 17934 36806 55196 53620 64239 80805
11474 80805 70002 73915 48587 23196 27108 33070 58398 84792 79929 60830 59717 79596 87543
11461 87543 82969 36930 52136 36645 67432 64291 65704 36637 2859 26761 45231 72774
11449 72774 159322 173971 149287 113927 79379 71195 97325 117356 100368 70263 38325 33390
11437 33390 -9858 -35253 -48438 -69444 -64129 -21427 -19388 25592 15415 37588 39530 26022
11425 26022 14958 41606 56567 19635 14290 23275 -20488 -49720 -44546 -56017 -37742 -33561
11413 -33561 -33793 118 37924 36550 38486 3902 -2057 -15133 -37120 -41559 -24180 -9929 9133
11400 9133 5026 10977 -4178 67 16379 -16687 -25307 -38600 -32119 2960 16134 -19135 -7852
11387 -7852 1443 -16907 954 -8295 -4336 47391 23811 -32361 -40944 -12459 16047 26459 17625
11374 17625 -15504 -26947 -1203 -17702 -37729 -18805 11859 11602 31465 -1097 -24754 -48170
11362 -48170 8976 40887 51654 28229 -19205 -46174 -17808 -6204 6559 -5101 -40706 -67164
11350 -67164 -71368 -47225 -21180 12556 17184 52187 51236 21520 -9600 -7581 6878 2671 31471
11337 31471 5536 -9151 -26671 -26724 -26853 -73934 -8070 28006 9060 -19406 -19885 -15124 11283
11324 11283 9311 -15793 -21812 -12825 133 39122 -4674 -494 -1170 8467 -21987 -24221 -4598
11311 -4598 21054 9773 8234 11968 -26270 -12786 10606 -35377 -33533 -1919 41424 9245
11299 9245 -6882 3714 19437 6981 29682 51244 59044 110627 139995 74168 23814 10829
11287 10829 14853 65758 74667 61745 60395 32247 -2068 -27561 -34464 17259 25799 4892 -4832
11274 -4832 -40979 -37932 -23111 -2918 -12798 -33633 -74044 -31413 -23447 -5966 40472 56965
11262 56965 81495 63952 36127 7752 10902 17559 27605 31358 8581 -11912 14518 17915
11250 17915 27680 56525 71040 39497 -4324 15924 32271 42806 13873 -8335 5426 5828
11238 5828 8935 -7950 -46568 -49782 -6386 -1536 -33193 -23117 -2999 -1787 18563 10374 -33339
11225 -33339 -70889 -48048 -41470 -55301 -46305 -57849 -42149 -28270 -825 -2369 -13704 6960
11213 6960 40730 33462 23593 29667 53846 74666 62316 45618 33186 -14371 -17418 -13779 -3362
11200 -3362 -43984 -66207 -52813 -38994 -51939 -54800 -52733 -38901 -56768 -69937 -63892 -55583 -75885
11187 -75885 -106339 -75745 -14116 -36276 -64362 -76777 -67419 -110097 -69835 -43467 -55613 -57425
11175 -57425 -72838 -69812 -45524 -41823 -16249 29942 30438 2194 -54807 -63517 -54979 -59757 -67514
11162 -67514 -32104 -2029 23350 22641 27287 -3292 -1412 -6027 -23071 -29783 -3057 -9927 -2003
11149 -2003 -23332 -25459 -46251 -40171 -23103 23044 39756 73518 63114 36691 43775 49210 38032
11136 38032 14341 -9276 -8253 -7264 239 24690 -4844 -9541 -29064 -33721 -20300 -22636 -49952
11123 -49952 -36284 -24322 12653 4965 -9298 -22586 -82477 -68501 -30007 19716 28337 23730
11111 23730 -15098 -40960 -997 11780 23472 -5968 -61359 -62074 -31300 -3166 -5876 20031
11099 20031 16902 -14800 -14199 -22595 -22441 -4032 -1048 33229 18781 27402 2615 -1925 30567
11086 30567 2223 4695 31589 26456 -6251 -27684 -5304 -13562 38227 94586 66554 43508
11074 43508 20477 -16718 -47858 -12008 22208 32722 17829 30336 38825 55972 92511 22400
11062 22400 1053 -1883 1037 46823 71684 40012 -24038 -33022 14301 53377 44823 4584
11050 4584 23721 46951 35596 7085 775 1802 10429 58856 118699 119979 116942 75279 62668
11037 62668 47183 64680 131036 217131 289887 254876 242169 245678 232676 201257 174090 186562
11025 186562 214036 235845 188608 163380 242325 311279 297149 243669 219331 173639 170479 141694
11013 141694 166345 219193 194752 189057 171697 172691 153231 166782 130484 108233 100959 124442
11001 124442 152040 160303 122612 135156 129585 80159 77485 79120 33447 13348 -10402 -13842
10989 -13842 -23570 -10841 -1189 16417 47741 54311 61969 88120 83661 70760 36783 38790 82267
10976 82267 94259 88223 91740 122792 102653 33018 -12814 3931 49933 72042 89913 104760
10964 104760 99699 61260 48793 44164 50829 53833 28590 -5959 -6575 -39153 -46840 -47150 -15525
10951 -15525 17982 44955 59436 32082 14954 17653 12152 36102 51225 30216 2207 10426
10939 10426 43049 44141 25583 8876 52570 59967 38575 51273 55214 70882 13363 -31227
10927 -31227 -42170 -25048 -38788 -64150 -12100 3811 17949 -5546 -50912 -65557 -80861 -48821
10915 -48821 -5554 18575 -6388 -5883 19856 21599 -6531 10926 5827 -27301 -50645 -17566
10903 -17566 -3058 -795 -1737 1207 3892 3394 -29549 -32395 -42033 -46943 -47455 -70108 -50626 -46284
10889 -46284 -76935 -63565 -56776 -1909 32135 11970 -32716 -49599 -8048 9854 9661 26026
10877 26026 58249 73593 64797 74562 88562 56034 -572 -10014 -18375 2926 14707 7267 20854
10864 20854 62054 102909 95502 67739 26121 33982 44659 21341 5280 25456 50979 47700
10852 47700 10625 -15618 -4921 8690 57917 79940 77572 85954 86503 105814 69073 12729
10840 12729 -35511 -8788 12784 28630 11761 30769 9662 -15905 5397 24924 23700 36350
10828 36350 58064 84637 31318 7681 23520 12920 -13986 -7127 2807 13082 16311 42884
10816 42884 44774 19432 1273 5659 13955 26547 20579 34072 69252 67701 47132 13373 -17114
10803 -17114 34449 58662 79584 78478 48631 57486 79133 69645 64864 61314 37983 20734 6109
10790 6109 14541 18281 38483 60270 53190 52148 27735 80987 71491 24264 43769 47717 27578
10777 27578 19235 65543 80274 69200 90897 120524 111937 67446 49698 48354 33545 56563
10765 56563 66558 73749 83251 106000 106452 118618 84770 41995 38275 38715 3529 2165 9688 26849
10751 26849 23092 -14810 -66148 -25045 11122 25328 35964 61819 82910 76819 78003 56379
10739 56379 47769 58366 42363 17285 52323 53005 20907 32131 41361 46351 65674 101722 117668
10726 117668 122626 129984 193990 212393 163914 110500 100561 51807 44687 43477 43516 33385 9778
10713 9778 41567 81828 62808 47071 53450 70101 95604 113440 91995 86009 91063 82196 72919
10700 72919 45348 32825 83595 115923 98732 118940 126232 131063 155477 163483 169088 190600
10688 190600 156709 151192 162903 177515 193778 205249 207631 172118 144212 146082 184458 173967
10676 173967 146635 150701 181552 182978 177518 201106 267284 307101 310190 235844 196790 220187
10664 220187 280358 349650 315185 262672 274544 303279 341877 377909 383958 382751 393302 391130
10652 391130 400814 447280 457349 457383 426484 455542 505244 519827 540199 567544 564900 573639 602306
10639 602306 614790 646091 691726 744310 822626 879615 952578 1071428 1168802 1249591 1367435
10628 1367435 1523906 1679340 1858374 2102295 2415150 2781501 3258283 3864563 4691460
10619 4691460 5732633 6994592 8552670 10382899 12253560 14016855 15440753 16200508
10611 16200508 16418147 16359372 16403955 16835222 17900507 19758182 22386239 25628016 29062984
10602 29062984 32154423 34179489 34664320 33720839 32071810 30643065 30110992 30778694 32733200
10593 32733200 35805425 39626698 43609611 46862424 48193451 47123867 44022225 39951961
10585 39951961 36181673 33461562 32047546 31935790 32897774 34542760 36254099 37376402
10577 37376402 37196445 35328807 32217779 28700175 25510026 23106127 21560058 20741267
10569 20741267 20507090 20567263 20651387 20453200 19735554 18425769 16594038 14591182 12674572
10560 12674572 11045533 9761915 8731675 7882151 7260640 6782661 6398026 6043761 5675661
10551 5675661 5354808 5100789 4832273 4582916 4361401 4136625 3887881 3630876 3452625
10542 3452625 3298903 3153251 3073978 2925751 2712703 2566723 2430007 2298841 2193171 2096220
10532 2096220 1998460 1901336 1791903 1692125 1587680 1465216 1372870 1305200 1200791 1115700
10522 1115700 1077119 1045745 1016961 983594 945753 918528 868591 784020 739727 694361 646317
10511 646317 641081 619143 573009 514925 489008 501567 513559 517476 470550 416714 368587 346576
10499 346576 383508 411975 376395 383208 354028 320392 286860 252913 236812 252310 253529 264560
10487 264560 247310 214558 199111 196856 181635 154102 165994 176968 164380 122351 88510 128848
10475 128848 180064 178677 139061 130826 141517 126117 147339 146776 123010 128146 131196 161341 171581
10462 171581 125558 121598 131472 91335 76514 132636 129816 109220 114076 106444 109722 125889 139560
10449 139560 115214 114004 141709 107896 90728 94450 116834 152204 146842 146405 166998 185410
10437 185410 181498 151576 109008 94196 110181 109710 116581 142266 120483 99855 120561 146184
10425 146184 144555 108893 87516 101484 106241 133812 127220 88843 53473 91197 93078 70018
10413 70018 53293 82597 101540 119777 88250 44743 77045 133813 167417 167800 151072 163762
10401 163762 155177 175146 171047 179296 155596 107849 79583 77078 92833 100852 135732 137900 72476
10388 72476 44444 66781 67759 62575 54915 34542 23105 31183 13600 -5748 35759 62574 62454
10375 62454 97762 52790 50347 55340 39943 40838 21114 -2265 14176 72581 97284 78054
10363 78054 105746 120387 96989 80646 50711 68394 84266 91832 66127 57682 74632 93430
10351 93430 76164 87383 57762 80447 78663 37872 55238 102417 126272 125295 87706 52386
10339 52386 48807 74785 74036 67772 67983 40963 -4265 -10276 15377 -15323 -21756 -42025 -47541
10326 -47541 -61757 -68591 -63235 -64976 -61882 -50630 -33680 15748 40704 -1244 -11420 -4830 -11663
10313 -11663 3649 54638 91138 88166 44727 5985 1562 -1052 -21295 -20401 -119 -10503 -12817
10300 -12817 34823 60300 26027 -20286 -7450 13517 -23437 -27925 -15944 -10902 38191 80674
10288 80674 50417 58454 45911 -10003 -28620 -26755 -18722 11489 54587 80748 52779 25448
10276 25448 26813 31312 61549 57194 56883 71684 90862 41103 19310 59201 69102 68093 50023
10263 50023 52251 51065 27575 39651 10679 -10556 2093 15496 12919 2216 30099 37103
10251 37103 37731 72628 56911 5457 -3129 -3264 -18019 -34472 -9229 -19903 -27009 2113 -1204
10238 -1204 15427 -14921 -337 20420 14673 38457 27132 -1277 45489 59426 19254 -7054
10226 -7054 -17767 -16247 -1890 16553 10375 1311 2960 -2102 -39753 -27275 22124 32266 57803
10213 57803 66193 59929 21104 16866 -7957 -28801 -70886 -65175 -32358 -52962 -57784 -62730 -56685
10200 -56685 -38315 -57211 -28705 -11784 -6868 -44562 -66096 -34701 -33070 -47172 -40746 -42142
10188 -42142 -13924 15633 78918 83458 57906 89559 68036 65646 103263 106187 65944 45156
10176 45156 62835 24262 18645 65270 115403 126033 95958 120253 142333 151292 172968 198814
10164 198814 211412 205094 218291 196521 141409 129673 174918 159358 148490 188121 207641 240271
10152 240271 290110 280900 276583 239469 201759 186185 207201 229892 206636 201383 224884 223033
10140 223033 226037 214849 201172 205111 201541 135922 97761 95690 122288 147650 161523 179854
10128 179854 189413 167285 190277 189638 160982 119698 125581 85000 100242 90693 82155 115133 138485
10115 138485 144603 131685 131583 114251 88230 61953 59660 58596 53676 60354 32017 4565 25198
10102 25198 33104 41695 35054 37605 53794 59578 58128 83499 99363 102442 71972 56452 40207
10089 40207 1538 7085 34301 56166 48960 63228 43584 43974 31998 11788 12503 -9771 -5064
10076 -5064 -10139 -13130 -1644 -4662 -14109 -15172 20958 37638 30255 -11835 -41030 -10682 -4489
10063 -4489 -12444 -5264 4464 -17438 -11949 -15290 -11611 -8071 -26319 9577 9976 -30234 -22525 -716
10049 -716 -6453 -29480 -18896 -20995 -48610 -55459 -24610 7742 17284 40515 34959 20936 27463
10036 27463 18485 -7925 -48513 -35013 -21145 -22275 1297 28281 31850 29144 46599 15558
10024 15558 -22840 -35353 916 -17596 -29450 9450 42633 20167 -4123 -17027 -6146 -5843
10012 -5843 -4310 -10653 8183 28095 31833 34422 27821 -11657 -47852 -34885 -44653 -10718 -8411
9999 -8411 -11351 16702 -6749 -14467 -1805 -2937 -4555 -4031 25363 1016 -18609 -31103 -35322
9986 -35322 -34040 37786 81698 94597 74326 35971 13445 32000 30167 17911 -32670 -54058
9974 -54058 -35563 -63104 -42274 -27330 11047 2981 -23596 -7804 36628 51492 25684 23627
9962 23627 11590 34059 -7309 -34758 -35563 -29549 -12279 -55242 -73930 -41259 -28042 20506
9950 20506 19398 27918 49607 40898 53477 16721 -12198 7690 34813 -7548 -7842 -24835 -65525
9937 -65525 -100398 -49208 6041 34021 32422 41154 35700 -13683 -48152 -42538 -40 -4047 -20403
9924 -20403 -13838 26399 22662 -22183 -19618 -24341 -48108 -69719 -41416 -49423 -18911 -2472 28481
9911 28481 24016 14314 -3327 -28064 -34371 19239 47764 13091 -634 26805 35222 22562 27026
9898 27026 20658 -16258 -1875 25423 19103 -28327 -42077 -30677 -22667 -38439 -28633 -18295 659
9885 659 17005 1284 13200 -4849 -34348 -36926 -20683 -7589 -9672 964 -9425 3825 -47840
9872 -47840 -63243 -15276 1 15316 22156 -9966 -19402 4022 -15400 -35225 -51415 -42891
9860 -42891 -33132 -15810 -4722 3507 -11368 -39759 -16788 8682 -26257 -74228 -69492 -92368
9848 -92368 -61821 -58362 -96885 -128151 -149084 -120315 -55356 12295 9310 4296 -30155 -3535
9836 -3535 -6581 -5312 -16775 -6398 21974 9592 30358 26125 13405 4934 16111 21684 23527
9823 23527 3136 -35248 -60803 -52997 -22509 -1180 -38942 -22588 19799 11302 -4404 -30517
9811 -30517 -16746 805 16131 24037 6278 -34806 -30202 -25741 -37148 -42380 -26140 -20133 32899
9798 32899 36327 3960 23650 32938 39229 35735 51971 52018 39400 -12803 4858 42613 77140
9785 77140 110631 179245 207347 258253 323236 416019 522469 606429 664896 594651 484140
9774 484140 393145 266140 154628 87101 103065 99822 88983 78684 23053 18099 22227 34051
9762 34051 66027 99448 110670 79390 40589 68377 48474 56066 35750 17131 16406 -11517
9750 -11517 13191 45023 61542 64416 68778 26242 5215 51957 41768 -10131 -17158 40446
9738 40446 66536 57849 21924 -7795 3214 577 -22975 -34766 -9831 28552 18886 17517 24799
9725 24799 41608 32850 14179 4941 7325 49973 75219 70492 26088 1933 2582 24311 7180
9712 7180 6613 50706 39649 34763 47681 98573 55422 44805 82337 77277 87512 75128 81786
9699 81786 93600 37837 804 31649 25420 -20426 -28922 -13957 -37233 -21376 12919 50255
9687 50255 51179 41843 17157 17622 19401 -18202 -34054 -23232 4851 21418 -10610 -28492 -1497
9674 -1497 29394 22696 5293 -10596 -55771 -63651 -11274 -3387 -1140 12077 31450 15749 -19320
9661 -19320 -25245 -35747 -54433 -25271 20972 -127 11962 -4524 -35904 -21223 29382 82992
9649 82992 73002 50561 51849 11890 34318 22876 33951 30840 18548 29030 17227 -13788
9637 -13788 -31714 -37440 -24958 -8214 7225 -35492 -21170 -19508 -29792 17756 21370 3977
9625 3977 20263 38530 101391 106172 84229 -2224 -15622 17703 2200 -12347 -16982 -24290 -5244
9612 -5244 10002 27449 -5905 -11855 11473 21882 43437 12920 21933 13136 -40960 -12169 27399
9599 27399 6618 57770 47189 1 -21545 -18605 -13042 -26784 -26859 5607 53278 8485 -49204
9586 -49204 -67324 -68623 -21440 13913 -10050 -50948 -48692 -25469 -32780 -27949 -17586 -21581 -17463
9573 -17463 -27450 -63372 -61776 -6392 2906 -30207 -27170 -17637 -11839 -15689 -16265 -36852 -16917 10800
9559 10800 44516 44093 12580 -31024 -37697 -31407 -25423 -66972 -61180 -47786 -72144 -66683 -46575
9546 -46575 -6252 -22253 -15889 -2823 -28721 -33568 -38324 -36386 -9627 -913 -23122 -17025 -18196
9533 -18196 -8907 1944 18023 23984 6219 -41658 -17285 21516 47956 52869 53561 39606 35474
9520 35474 14130 32316 6649 -27487 -16382 -3456 46031 23771 19764 34128 57543 20385
9508 20385 13697 49070 28799 -17263 -18991 -12746 3069 -10807 -5138 1638 13221 13216 15236 -1331
9494 -1331 17660 22470 21044 33909 45734 78237 74019 51306 66013 68192 98918 104139 53209
9481 53209 13587 21195 22797 41372 53091 60999 39315 10500 -1204 1185 50959 32104 9846
9468 9846 -1638 25131 30567 28984 49238 69121 90844 115657 91736 71700 25656 4334
9456 4334 -2617 14187 57764 37561 6058 23502 16003 -37172 -8287 3454 -24909 35031
9444 35031 68743 24632 39618 46775 24161 -8869 -589 26406 26046 24773 59338 73455 54503
9431 54503 20960 -11700 -27514 -12514 -8426 -59928 -80225 -68975 -53225 -38565 -31638 -38463
9419 -38463 -6706 29555 27044 7024 3444 10889 29262 26890 23378 616 -15853 39818 47742
9406 47742 35646 42441 36126 37834 37312 17700 -8831 -22017 -26328 -568 35407 4026 -29424
9393 -29424 -40955 -9218 6356 -10921 2390 51560 59730 29766 6911 12125 35250 45517
9381 45517 65915 100117 90825 74559 47203 -16116 -66034 -21462 -25023 -10990 4104 -20018
9369 -20018 6886 12619 17532 22526 -4184 -31928 -41320 -23945 -4424 -1922 -25613 -25635 -7999
9356 -7999 -27403 -25847 -25402 -14939 -7595 27783 20762 -47928 -40468 -30979 -58597 -88451 -76489
9343 -76489 -64356 -79821 -46760 24397 48666 28926 13086 -35385 -14229 54683 78791 57923
9331 57923 38889 64729 56164 23251 -12443 -23107 -8184 -8585 -32501 -35594 6741 10626 -10524
9318 -10524 -32336 -36396 -44624 -42111 -35696 -43612 -17675 10998 15745 4081 3447 13418 54583 44830
9304 44830 -9059 -28343 -24187 -37880 -47761 -65522 -38044 -27731 -45673 8260 14989 -30909
9292 -30909 -28685 -8842 -17654 -19654 -33505 -36925 -24817 -24081 -24294 14777 16554 -12301 -2583 16596
9278 16596 13460 6859 33869 25582 -18123 -43976 -22686 25528 36757 42072 50427 64802 18157
9265 18157 10989 -2478 -11801 39866 35821 18280 11828 -9631 -53022 -51593 -43886 -37529 -14431
9252 -14431 10964 11221 -1648 -32304 -35143 -4730 16085 15570 10663 23780 39659 47359 44305
9239 44305 42727 37437 22130 19632 52495 62006 8070 2211 79083 71502 42263 31081 17868
9226 17868 24440 46870 56405 30893 -18812 -38905 -22763 4008 4991 3712 -9863 -29127 -58892
9213 -58892 -56119 -24878 -12179 -6096 15429 -27228 -56519 -46507 -41028 -53820 -21295 28663
9201 28663 23919 12331 22907 16750 -694 20548 -26035 -21951 -24933 -16983 -20229 -21600 -8484
9188 -8484 10185 22785 -792 -20597 6766 5823 30441 17791 45044 59809 38842 19325
9176 19325 16758 -9261 -36926 -2247 12236 11332 20544 50877 56275 78797 84447 36242 -22290
9163 -22290 -44028 -14098 23074 58870 71400 57556 38664 17240 38421 4351 -51013 -31948
9151 -31948 -2945 13514 44583 67490 39138 8400 -22803 -4001 721 9524 -11626 -24677
9139 -24677 -3741 -11838 -3721 24807 58690 51396 54066 52878 47113 36851 18216 9505 -5058
9126 -5058 16736 33052 57445 65383 62802 83124 94774 80993 62305 66680 40758 55673 47578
9113 47578 30122 11710 -28566 -24985 264 28075 68766 72745 71316 34572 3712 23894
9101 23894 45247 26584 41009 55679 40202 32113 -18219 -7051 -873 5860 20101 28298 33276
9088 33276 15292 -7913 -5720 13388 24002 22537 19018 53038 64617 81662 62224 57517 65676
9075 65676 70597 88114 69726 69194 101979 102256 121232 108591 119804 98599 83798 73399 63493
9062 63493 40382 61706 63190 58434 66289 48383 72865 70838 119437 189833 221898 224572 266347
9049 266347 272412 279318 325684 344805 378901 407457 457428 584128 665133 724923 838443 928266
9037 928266 995361 1080118 1195008 1303736 1378659 1435910 1465468 1407711 1267587 1184738 1096321
9026 1096321 995963 915396 853345 750317 692082 609755 552991 571332 577027 486232 437458
9015 437458 411657 399493 376331 376001 385203 379641 342764 318052 304909 222489 215043 247305 243559
9002 243559 207859 203109 259904 253693 230445 230334 194257 177399 170802 153379 162467 168376 175792
8989 175792 202554 169516 135468 137470 145693 152023 151725 165861 175494 152411 135813 151815 165405
8976 165405 128094 86551 110897 106725 99160 84002 102690 91138 64000 19681 7288 79941
8964 79941 82817 61784 61287 79544 71940 58402 97358 116457 88955 59926 41521 58910 62782
8951 62782 90111 103525 104808 88483 81732 111656 125658 107946 76504 51995 71690 69779
8939 69779 88533 109638 103858 102568 82274 97923 117497 112096 112746 142047 175569 161029 121459
8926 121459 115863 90335 116334 149904 122535 108778 138245 171129 190326 208237 179942 157606
8914 157606 104935 111181 180374 219554 206044 173253 180719 204798 156173 119869 152909 178735
8902 178735 167919 146768 179460 254236 310017 298839 292539 322376 332583 339166 346123 347134
8890 347134 408739 416569 401363 413551 380321 400577 414171 368640 314855 351636 338046 300776
8878 300776 290543 263396 218010 211432 228516 210184 167810 174872 140284 120584 118816 113812
8866 113812 135021 170367 214079 245575 261926 212489 167212 165606 195690 217391 217412 213656 200630
8853 200630 193567 182463 199671 155242 157134 192432 201590 234340 273841 273297 245017 290602 340680
8840 340680 361946 387131 419044 446544 428951 437605 421283 380072 387656 408956 429019 442724
8828 442724 412994 362870 337862 377754 383052 375680 397882 375321 293556 259064 248920 281617
8816 281617 309171 315385 330399 320885 292885 308389 332966 331343 348467 355891 377460 427193
8804 427193 457129 485796 475278 460545 462879 447377 413076 365594 347661 378457 429052 434166
8792 434166 412209 389210 384818 406971 423822 440058 445067 461805 451329 441110 409830 410852
8780 410852 426760 416110 429986 485035 507903 516224 526079 491700 470441 508590 538285 579275
8768 579275 659475 704372 670376 668622 694327 728911 764154 787942 820023 875116 864710 861102
8756 861102 847798 809260 745561 740328 728256 693223 674195 673269 690685 724412 767037 827304
8744 827304 824028 791466 774686 781208 824331 852618 854547 881387 922482 962077 968191 993373
8732 993373 1019093 1048437 1040669 1081795 1159119 1189929 1212796 1296355 1390274 1453448 1454271 1469787
8720 1469787 1499497 1493785 1501345 1548948 1557600 1581327 1637694 1672299 1717476 1811561 1823572 1851105
8708 1851105 1867553 1891323 1959392 1995086 2028652 2061390 2088226 2135750 2207465 2261721 2351382
8697 2351382 2424875 2481381 2503048 2575781 2669325 2788868 2905715 2969255 3052586 3172172 3299767
8686 3299767 3405258 3480095 3565352 3701825 3866162 4050901 4205866 4374184 4567363 4818801
8676 4818801 5077453 5277177 5530350 5763268 6018321 6269212 6523090 6831675 7180304 7564243
8666 7564243 8048787 8536451 9038356 9617202 10300347 11063122 11952200 13036364 14261195
8657 14261195 15584096 17144124 18896867 20951825 23340714 26161622 29471159 33425412
8649 33425412 38117260 43686323 50269512 58107483 67553790 79006571 93160151 110930595
8641 110930595 133333644 161276289 195101281 234064417 275580476 314553493 343412004
8634 343412004 354237925 342982622 312446179 271012375 228063705 189944359 158903822
8627 158903822 134665866 115985227 101588850 90328513 81324497 74016735 67958734
8620 67958734 62870613 58474656 54606616 51178395 48207409 45641865 43502895 41690290
8612 41690290 40197653 39016147 37985587 37049566 36123855 35081760 33836097 32309228
8604 32309228 30590438 28816077 27089818 25449745 23870441 22413065 20994504 19724809
8596 19724809 18595166 17558115 16572153 15642125 14757911 13944659 13226886 12536675 11860809
8587 11860809 11236182 10668387 10094309 9556229 9099345 8696413 8303296 7918248 7563614
8578 7563614 7230007 6913419 6646638 6382210 6096408 5821631 5572672 5361435 5142037 4914334
8568 4914334 4715477 4538174 4318017 4086926 3913919 3815304 3662759 3470712 3326326 3179697
8558 3179697 3081859 3011313 2882494 2771274 2663504 2585771 2566849 2505882 2368910 2240531
8548 2240531 2126693 2050364 1992927 1921321 1848072 1838045 1793901 1714079 1652224 1631970 1603487
8537 1603487 1538379 1496347 1486766 1479424 1446843 1471634 1462024 1427101 1322548 1214314 1137274 1108177
8525 1108177 1090544 1063032 1029331 1025676 1026501 1008031 1017435 1009250 1040042 1064602 1033180 1014690
8513 1014690 1031142 1028992 1057450 1136019 1161189 1132548 1133691 1128588 1081396 1068509 1018071 973054
8501 973054 910461 875667 892617 875077 841451 826049 791460 751003 727742 723436 717742 749390
8489 749390 787138 855969 943857 912731 841134 764889 710065 663136 637223 678667 687529 643850
8477 643850 610768 645266 664965 721732 696041 665246 655732 649171 688847 721179 713806 743062
8465 743062 735102 723881 750252 765737 792398 836843 860473 834233 761726 685243 698077 725039
8453 725039 718629 688502 688209 707007 679297 635657 621130 646542 649542 627249 622129 641905 637132
8440 637132 619632 596755 544608 489568 444827 458623 482503 480365 471393 433626 400605 366958
8428 366958 353441 361973 373390 380586 345715 333742 330715 329598 317728 298677 293735 346617 388477
8415 388477 350429 329824 326327 320647 314290 344483 343922 310953 314695 319384 313300 300220 311436
8402 311436 294406 260015 234033 250933 271661 258106 257176 226598 233909 233255 241698 229669 223734
8389 223734 249220 283826 303952 335248 314798 309607 276357 216583 179786 133287 161556 177052
8377 177052 206440 221067 223445 200554 206210 217724 202282 179362 195752 201346 182747 151113
8365 151113 164632 186214 182965 163540 171564 151968 120213 114050 145165 164743 147162 132141
8353 132141 134028 211556 222191 190346 164991 131561 145514 172468 179961 177207 187884 211955
8341 211955 198062 212476 210732 203758 205319 255416 275226 232215 213915 178201 147945 114089
8329 114089 58514 114447 158965 196396 208073 176227 170761 194741 217996 209154 187232 194931
8317 194931 197095 187707 198801 166940 174660 184340 160065 176626 192839 185744 161541 155091 164768
8304 164768 165259 184349 184388 192293 197342 187930 206442 242670 183953 142593 131517 134510 114289
8291 114289 104539 114326 116773 113993 106343 88318 58715 88015 65889 75624 89970 90805 112381
8278 112381 108104 85805 62380 64591 80588 95559 91699 107716 136759 136966 163440 129856 91476
8265 91476 82230 92816 73868 79624 103178 119022 132119 153433 211031 229485 215168 212344
8253 212344 204242 177107 186598 207593 233225 240432 267913 320364 344214 392781 447954 505083
8241 505083 592952 667495 715406 829419 970857 1112826 1209980 1320594 1399866 1434229 1420508
8230 1420508 1420154 1403174 1301547 1195708 1090402 995818 841697 758822 684865 625825 562368
8219 562368 474532 410098 390220 389548 387722 350682 300676 308298 334221 350735 339998 289588
8207 289588 302918 326084 314805 268746 231878 221542 201026 171720 165660 201289 197726 190956
8195 190956 172907 199476 185232 136432 148107 147911 106874 91336 102852 122416 120494 147511
8183 147511 181980 199337 173461 103388 83002 124691 132174 122340 112508 77621 62087 71656
8171 71656 34706 76806 97215 131502 162373 174396 153118 139032 122576 136365 177051 155675
8159 155675 142858 144160 148516 129765 119283 76845 61768 102075 114657 94707 58983 46502
8147 46502 80792 70539 74514 133874 155867 133375 92032 61698 48547 40430 55142 58358
8135 58358 56733 21669 3704 22512 12734 7422 -7707 -10078 16443 1938 -49937 -52492 -3456
8122 -3456 24230 -10788 -27523 -46209 -52829 -46835 -63806 -39130 37628 46428 -16426 -89812 -70011
8109 -70011 -15324 18365 61988 81822 101837 81773 57032 76901 33495 19236 53040 35533
8097 35533 18843 5971 15507 34191 32717 23670 33191 24532 38726 81292 96582 90379 76900
8084 76900 115324 103562 60195 39090 39085 24573 -12652 -31917 -16828 31465 21225 13828 -15702
8071 -15702 -17846 -37964 -14730 -28548 15946 52032 70549 56915 20303 14940 -4972 12860
8059 12860 19438 -23143 -41625 -710 6942 6814 -4349 -46554 -25261 -36087 -406 25964 36882
8046 36882 80360 81792 68580 66866 76943 57948 45576 28716 19377 33376 64136 44227
8034 44227 38582 29321 37560 71675 63959 64983 68846 64521 86701 90573 84469 92859 84875 84547
8020 84547 95413 111239 135057 114472 69810 44483 35023 78624 104255 72203 28673 10816
8008 10816 19141 -20352 8032 87253 97050 33633 7768 -9900 23428 41159 32509 52220
7996 52220 38745 63043 89674 74962 78324 66655 75167 91311 115319 143902 161237 148907
7984 148907 112883 76592 79876 86807 68694 48738 45597 74824 42096 30983 44704 44454 82172
7971 82172 98931 106977 110082 82973 76424 73192 128806 126569 104108 56326 19712 46407 80255
7958 80255 82363 87321 80817 62621 62217 87607 87787 88305 59637 55977 65897 87651 114475 149501
7944 149501 141488 146733 145792 116155 84679 96480 109775 97966 55159 62420 60637 41043 66063
7931 66063 86432 102487 62756 23493 35979 54794 64195 42249 -627 -8750 -30575 -68124
7919 -68124 -28508 15826 15939 -11523 28537 73871 91575 81527 47036 24387 15362 48966
7907 48966 21688 -13918 -13633 19202 13672 36751 78872 100865 84484 81118 29790 5374 9232
7894 9232 14994 37533 13833 -9676 -11789 -6827 -2629 -2649 -50148 -62472 -2069 15848 -6978
7881 -6978 -22126 -2900 -20798 -36566 -19728 21152 50095 59004 13015 -9110 1432 -8104
7869 -8104 -32042 -61956 -54402 -52631 -64007 -50101 -18990 -4950 -5994 -5964 -7248 -40411 -55689
7856 -55689 -29247 -16200 -10442 38142 20762 7185 19961 -8841 -27052 7224 57793 50707
7844 50707 25140 14555 -27509 509 26160 31257 31286 38364 23794 18005 50930 45694 -727
7831 -727 -36200 -46268 -28737 27362 14349 -5702 16470 -14194 -87546 -83561 -41722 -10534
7819 -10534 -2144 -27273 -32317 -42340 -41666 -38649 -25428 -19612 -18174 -12706 -42250 -66451 -51167
7806 -51167 -50763 -51249 -28868 -48434 -88348 -82377 -61615 -40539 -13184 34133 79671 86422 87021
7793 87021 46410 -54 -14664 -44224 -60521 -10440 77725 38829 -32466 -41265 -22758 377
7781 377 9802 31965 38059 10126 11282 29698 13068 17563 46399 14187 -20147 -9614 6118
7768 6118 26127 20615 23694 30574 54368 28061 -29781 -24925 -3654 -3861 -21722 -32802 -16856
7755 -16856 -3008 -3784 3777 -29842 -37537 -19331 11543 58778 72499 44678 10631 -19565 -18118
7742 -18118 -24269 -27693 -30205 -17585 -20527 -36216 -27973 -22083 -24556 11222 46164 41888 -12617
7729 -12617 -31011 -42080 -42381 -35241 -55000 -78284 -82569 -81727 -72846 -56655 -39243 -20471 -18980
7716 -18980 -1685 -4328 -5441 2609 44758 81211 76124 55885 35264 56663 49514 68429 33015
7703 33015 21534 19978 27715 39497 2655 -24332 25088 17127 2715 11770 20264 -4570 -28811
7690 -28811 -29791 -40984 -73716 -82600 -30439 9926 6253 -10097 -27280 31733 30799 2708 18805
7677 18805 442 -34677 -81916 -64243 -16606 -7126 18439 34576 55086 65425 48414 51911
7665 51911 2340 -22385 -25284 -3373 13285 -3165 -21095 15656 16141 4764 8616 8910 -24428
7652 -24428 -52068 -38321 4124 -27529 -40919 -29475 -16354 7440 20885 -4241 -22031 -22982
7640 -22982 -33518 -48317 -35682 -21274 -33067 -13030 -31964 -53844 -60565 -55015 -30768 3198
7628 3198 -32320 -29023 -46493 -46267 -32336 -49883 -45820 -15589 -7331 -12973 4164 31011 19148
7615 19148 1046 -9243 -6780 -26540 -22718 33364 44644 18749 8093 92934 85348 50954
7603 50954 28739 17377 37489 64894 51704 -14689 -5280 34220 10007 47996 67337 27401
7591 27401 3235 -8905 2757 -2604 -13545 -9700 8794 -17326 -15792 19938 42769 44737 38591
7578 38591 14149 -14126 -33374 -26398 -25730 -56405 -43263 -17159 -18144 -5233 18961 8080 -20977
7565 -20977 5679 75268 86832 44239 2826 13121 37108 43123 40882 69188 62072 34864
7553 34864 34711 52625 9695 -8303 -1157 -13110 -58348 -31964 16833 39312 32171 42713 27894
7540 27894 -12381 24189 16218 2476 -37924 -5818 46533 14617 -27803 -22223 4205 -5745
7528 -5745 -469 -43369 -36048 -30359 -37081 -47982 -5464 22857 12978 8820 20288 7700 -5402
7515 -5402 17335 16944 -9464 -9052 26333 40866 20153 -6387 -101 -16211 -21837 -3918 878
7502 878 20687 45119 44113 19525 36695 49894 57408 53644 33684 -22274 -27654 -10551 9260
7489 9260 14972 39101 12926 28297 30311 24678 42493 30646 -8469 -8279 22777 -5232 -12565
7476 -12565 -5749 72325 99483 49942 37842 11309 -10641 -16754 -45696 -58290 -24939 24484
7464 24484 62636 51065 55257 53342 18626 -5825 -34878 -81635 -103900 -63399 -57005 -55002 -36071
7451 -36071 -53339 -61247 -14726 -18488 -20972 -13844 -35409 -79279 -75346 -49914 -32012 28728 37237
7438 37237 16151 -1109 8064 55341 31971 -24103 -37831 -47720 -27257 -17599 -4417 12873
7426 12873 25060 36727 59696 20433 11583 35785 67948 69998 62013 78868 69796 50239 34082
7413 34082 21974 42846 25621 13020 7375 -15150 -17995 -13015 -15428 9228 78374 47483 -6162
7400 -6162 -12949 -13615 -19673 -16455 8221 33217 -9048 -351 -21931 -54087 -48068 -58052 -27609 -18645
7386 -18645 -27360 -18202 -4849 20762 30886 -6026 -14801 -7144 -12939 -54513 -54327 -38445 -955
7373 -955 14441 -1279 -5005 553 12850 -16589 -20346 -26780 -25992 -44562 -41413 4154 16439 7331
7359 7331 818 -20660 -26402 -9653 -25490 -45196 -27408 -44663 -46309 -4324 11696 12768 59786
7346 59786 61986 45008 11367 703 -21326 -15441 3030 17847 67257 78796 62805 34856
7334 34856 15628 6454 3079 -14184 -53754 -82110 -102166 -86484 -40885 -20553 -7705 40531
7322 40531 37573 18507 -31663 -17805 -1987 -10310 11455 43073 35789 14645 -4268 1489 -198
7309 -198 10386 13865 36636 49203 33597 35504 2998 -5849 -21499 -37831 -61969 -37652 13933
7296 13933 40737 12137 -8536 -9478 -20265 -28790 -33407 -60794 -29377 22364 11945 13167 23694
7283 23694 20449 18630 35066 28379 -28964 -20763 10393 27314 26277 5488 -3525 8311 -26934
7270 -26934 -58257 -82727 -58742 -21814 19468 8717 16581 19654 7230 -40261 -74158 -57635
7258 -57635 -43125 -41156 -16567 -36939 -35147 -8214 -2061 -21835 -16667 12253 -10061 -37241 2781
7245 2781 26793 46764 -6675 -39123 -14971 6788 -1597 -3765 -5284 9996 25809 -16882 -42759
7232 -42759 -55590 -57793 -16026 39509 48926 16017 -5919 6698 31090 57407 45915 38455
7220 38455 77274 75382 78301 12477 -28422 -20631 -31875 -20891 18164 44584 91824 85431 44228
7207 44228 10677 -1538 -34788 -58078 -62951 -41668 -36519 -48181 -9039 -9395 -57180 -78873 -71414
7194 -71414 -61867 -22343 12405 -10756 -37678 -8329 1695 -6061 -16382 -50738 -30977 -18081
7182 -18081 -43738 -38936 -709 40685 42899 53391 49932 27137 38420 72765 34462 -22122
7170 -22122 -16538 -8321 -10211 -26734 -45242 -29071 321 12401 39584 35103 42695 33140 -33605
7157 -33605 -28240 -18191 -34849 -52758 -57426 -21734 15323 16735 -13434 -31218 -66599 -47569
7145 -47569 -37522 -49641 -17151 2288 12636 3832 39916 42336 8361 -6237 -17210 -26685
7133 -26685 -9992 -10050 -1624 49917 29065 -4900 -12086 -23582 -28784 -34066 -33396 -4355 9366 -18114
7119 -18114 -43 -20782 -41844 -49423 -50814 -12382 22258 33385 22426 54117 90693 30151
7107 30151 -46101 -72248 -10787 2679 -2608 -4936 -543 -26526 -46905 -5901 21357 15130 -24511
7094 -24511 -1006 47159 55500 33792 -10085 -27308 -5148 -29814 -105070 -134441 -115619 -89372
7082 -89372 -39534 22187 40315 18440 -6992 45744 57753 49525 54707 17422 1865 -8719
7070 -8719 -9352 -3031 -26033 -68636 -77005 -40548 -7290 -31201 4829 11825 25354 20702 40543
7057 40543 16635 -1827 -12603 1491 41117 28099 -21922 -58610 -25221 -2432 19224 -2198
7045 -2198 -6656 16629 43597 48087 7296 -12692 -10543 -61919 -95208 -75599 -54197 -65941 -62480
7032 -62480 -28373 -2211 1337 57923 112805 71475 47551 61635 22534 2825 -49185 -65738
7020 -65738 -21467 -8677 -11067 -18713 -19047 -4014 22904 83283 93801 60334 33118 41850 12595
7007 12595 -7800 14023 10705 2273 9162 -37646 -10095 3500 -1190 -16904 -27731 -23212 -11797
6994 -11797 -39420 -86048 -48868 1334 36983 11593 -6710 -10437 -31007 -22822 -22400 -47048 -75538
6981 -75538 -71231 -40103 -2034 29193 -4316 -22107 -26655 -81681 -71490 -26241 2870 5713
6969 5713 -29591 -36634 -29147 -1378 37257 37875 10643 -1405 -5913 -27467 -5083 3944 -15402
6956 -15402 -18136 -16123 7648 23521 23742 16076 26799 56038 75113 33151 45572 59204 38189
6943 38189 -22868 -552 -4602 -23059 -65918 -36237 22913 46351 23791 43663 50005 6522
6931 6522 -16801 -30840 -28501 -9776 17846 12978 -14899 -28422 -39245 -79698 -88575 -39418 -9567
6918 -9567 -23741 -61807 -61029 -17585 -4293 -9836 -25885 -43896 -69243 -58414 -19761 -21002 -64986
6905 -64986 -70516 -74065 -54733 -31377 -16726 -12032 3134 -2411 -6770 -29380 -27679 -9393 -16065
6892 -16065 -7329 3441 11024 20142 3429 -10546 1182 -7360 -14168 -11492 4045 30479 51384
6879 51384 12606 -21733 -23192 -1448 10600 -18290 -46131 -862 6634 -21326 -24541 -1457
6867 -1457 10140 10051 -15193 -36129 -38091 -14616 1414 20927 55401 60253 22490 6781 3406
6854 3406 22358 -10967 -41445 -62163 -49126 -16878 -18214 -28172 -29586 -13728 -17175 -52407 -91934
6841 -91934 -57394 -44966 -49416 -37985 -3970 38781 5657 -2350 37124 25689 -7099 12505
6829 12505 55497 65387 33367 29620 24595 45367 36916 3542 -37893 -57944 -56478 -100512 -111369
6816 -111369 -98458 -76582 -68127 -51247 -31474 -41638 4015 35811 37901 53558 72749 67814
6804 67814 75143 49328 10971 14358 12505 -26574 -38503 -25512 -5958 25232 29596 -29002 -18729
6791 -18729 23121 13685 -5864 -38101 -31239 -6888 -5487 -33855 -3449 31894 35862 38454 28154
6778 28154 22190 -13787 -8018 28932 29709 25795 -6018 -17389 -1148 15342 3717 -53455 -77613
6765 -77613 -50970 -30861 -20457 -25542 -39011 -53244 -51186 2185 31472 57585 86351 122702
6753 122702 94222 66898 48894 25925 70167 78369 41902 24666 5171 3296 16028 -3258
6741 -3258 -23121 -15405 -14177 17672 -5786 -6638 -17879 -26088 37346 81019 65667 70005 67528
6728 67528 64654 50796 41436 45439 55477 33279 64080 46770 -5330 -40824 1714 20029
6716 20029 22422 4412 24564 39924 35054 24361 19432 23818 32369 32691 28295 86044 108237
6703 108237 76521 60133 44013 17652 10947 -3493 -10617 -31664 -38052 -32630 -6220 11222
6691 11222 -21762 -43807 -33515 -20722 -9124 4867 36473 39983 -8883 -1152 32315 58164
6679 58164 61308 15171 -18622 -1325 34543 24685 26391 33660 8534 -4655 -8411 623 -7022
6666 -7022 -8585 42957 93170 83241 46061 -18169 -1141 -10321 -27053 10971 43161 39905 12351
6653 12351 5994 18608 65183 81485 33811 -32272 -37685 -27745 18744 21047 7793 18184 46266
6640 46266 84145 55936 53420 22344 3008 -21398 -18537 -20337 -5031 37878 53421 44441 46322
6627 46322 92329 90637 72094 57957 32443 40663 47626 50162 31075 20733 18430 65684 70345
6614 70345 90086 128592 116252 76325 65068 55550 58265 30779 -8645 -26594 -20635 4364
6602 4364 47235 60365 50983 39826 61687 67411 55150 60582 46750 10580 -19131 -20658 -9706
6589 -9706 -13125 105 35336 54645 79854 98277 75342 48392 67014 98074 63652 4403
6577 4403 -27555 -22827 -2436 -5946 -34865 10994 51176 32431 33601 38888 31206 62117 78882
6564 78882 91920 69723 60480 67884 51697 49088 27873 30135 58224 76505 77121 70325 77474
6551 77474 64516 44482 50790 57314 58035 75609 56710 26486 70092 106256 144927 91335 25438
6538 25438 -7131 -24352 -28366 8970 49619 65712 101508 121846 121300 91321 68353 51475
6526 51475 52274 64018 37717 52880 52737 47049 38370 30643 -17007 -19457 52110 104644 97919 45297
6512 45297 53847 81599 127208 101767 81451 57763 81327 95982 46429 10334 60450 86347
6500 86347 71022 70644 58343 59395 67000 78669 30454 -3028 39093 28907 7281 57910 106409
6487 106409 47070 3480 45702 67750 100997 105482 84989 99184 106615 92384 86789 56992
6475 56992 60463 101226 94147 65816 26675 2203 18024 10388 44007 47529 58246 72923 50775
6462 50775 40419 22455 -20546 8266 58487 19536 -37061 -24432 5553 21924 47418 98730
6450 98730 105882 73763 36683 47407 64281 81876 84599 24858 39952 54878 82848 51097
6438 51097 25855 42606 46946 57728 77374 111870 58620 -6489 33065 49358 45943 56900
6426 56900 55660 79914 56907 73138 38698 28550 27861 38748 51581 44883 48600 51525 22783
6413 22783 -9964 56526 96288 111879 112375 98584 79712 55863 16567 32810 915 -10464
6401 -10464 -19782 40676 40917 27933 39068 7814 5124 24353 -9059 -21509 -4150 6883 28811
6388 28811 61079 -792 -46261 -25119 -7732 -28332 -40680 12812 47796 4120 26517 41262
6376 41262 46367 49237 18615 -17280 -44102 -41460 1399 35061 43555 51052 49724 60744 99479
6363 99479 125598 102836 94602 91192 99284 100183 97008 57265 5853 5180 16184 43652 44512 48460
6349 48460 53285 66612 31511 -10099 4132 53923 67630 57303 28489 4763 12641 15785
6337 15785 5653 -14465 -27394 -4199 20391 -13418 -4664 8566 39344 31163 -26438 -38364
6325 -38364 -3244 -8292 -40721 -24348 20676 13256 6866 -611 -6730 29703 62944 89193 71321
6312 71321 27085 23592 42365 51227 47856 47572 59448 72188 64254 51405 58350 48073 58954
6299 58954 27435 6769 11740 8262 -20681 -22105 26343 31537 23345 3969 -15326 -10523 8840
6286 8840 9737 19246 20867 8533 9174 9429 30883 46922 46289 26674 -9226 -36289 -3284 22081
6272 22081 62451 83930 54396 16964 7744 38782 61036 13387 -9716 -17019 -16607 -32577 -7548
6259 -7548 24375 -752 -22263 -28000 8569 5071 22099 53124 61985 20529 -1170 17687 34313
6246 34313 53496 37309 19523 63744 89158 105827 102231 45397 2664 -8176 -36306 -45737
6234 -45737 -40863 -24304 -3826 38615 20564 -5155 -56945 -66595 -65937 -37656 16624 23985 15966
6221 15966 16160 -10461 -26030 -21653 10654 15176 17183 36484 -145 -30640 -8294 4730 2470
6208 2470 -19138 -20997 -39710 -71130 -77629 -53836 3020 19020 27237 32436 51875 21302 -15548
6195 -15548 -53194 -55378 -27038 -29327 -30313 -27211 -7938 -12038 52617 78520 36067 17649 917
6182 917 -6942 -9327 -37655 -75207 -29694 -3835 -3905 13605 45889 48150 22131 28652 23818 35155
6168 35155 32885 17921 -12793 -36458 -39774 -65611 -55719 -57233 -80988 -84419 -76303 -33257 -25184
6155 -25184 21450 70570 72421 49090 33723 30379 47297 10608 -12197 -29040 -7158 8724
6143 8724 -12404 -21704 8690 38546 50001 24599 34356 49120 62528 61186 41397 4629 5181
6130 5181 31583 -3655 -42518 -90328 -96984 -91089 -23394 966 10946 5594 2602 -17883 -19272
6117 -19272 -73004 -58398 -369 24775 3972 -16407 -24442 -18785 -27822 -1647 18026 -42704
6105 -42704 -42779 -79715 -58999 -38883 -58348 -78748 -38140 1931 -559 11360 10911 -18460 -37690
6092 -37690 -44294 -54573 -3124 35238 -7617 -55165 -59905 -28328 -34914 -17554 -47143 -91062
6080 -91062 -61837 3993 6060 -47461 -43683 -9987 10291 64803 48874 23846 -10451 -15937
6068 -15937 -18139 25363 83141 69812 68895 38564 -33711 -57394 -46392 -11850 -4951 -8145 -18035
6055 -18035 -39623 -56140 -28146 -7790 -29723 -36755 -31513 4528 36812 52902 52053 48754 23063
6042 23063 14500 824 14617 13239 -16179 -20000 675 2233 -58684 -65223 -60719 -48775 -49123
6029 -49123 -28226 4566 -20296 -17249 4265 22990 40482 47290 15812 10923 32264 21640
6017 21640 -40754 -55550 -8043 -9872 -32932 -13076 -7658 -28318 -22596 -11366 7767 27595
6005 27595 46951 29426 -1809 -30247 -4887 -29445 -58906 -76838 -45833 -40317 -40496 -44424 -36279
5992 -36279 -13427 -29974 -38196 -20533 29594 66472 46338 51824 26213 -18048 -9331 -21796
5980 -21796 -41933 -20528 -1105 20117 21556 -12322 -44296 -12885 -2697 127 33959 29379
5968 29379 -21155 -36030 -29300 -28437 -39098 5139 -8273 -36040 -50286 -47150 -76731 -60684 -31122
5955 -31122 -50209 -5452 37278 4434 4647 -25834 -37790 -61236 -30171 6533 -7208 -17177
5943 -17177 -7292 2653 -28738 -63231 -41617 -25251 -20387 -12173 -31717 -10942 14404 15344 18614
5930 18614 -14624 -35226 -21720 -16326 -3470 26453 37494 8952 16668 38505 49650 31312
5918 31312 5373 -5412 -15034 -13107 18689 11056 -22053 -53976 -39130 -33276 -51272 -79631 -63031
5905 -63031 -39469 -27518 -7345 -3899 4837 44190 64709 31789 44779 71655 51279 24739
5893 24739 1750 -11180 10056 -5336 11469 32795 14387 14042 31239 21185 16619 -1183
5881 -1183 -40828 -25469 -11126 14435 20176 10423 -1002 -28194 -12633 -36702 -54310 -32254
5869 -32254 -35013 -44361 -29935 -11168 -17414 -41236 -28469 -19898 -25510 6286 17257 12621 -9212
5856 -9212 10976 13043 11511 11571 -3299 -1526 -1406 6401 -30063 -75489 -64241 -25956 -16242 -3648
5842 -3648 -12331 16432 30798 39510 45529 71695 50019 43118 21535 -21409 -829 13235 19008
5829 19008 45472 57605 21108 -18664 -31191 -41946 -45217 -38390 -17444 17139 10078 -7186
5817 -7186 -1969 -10356 -9527 10188 5077 -5433 1761 2617 28296 63939 71295 22435 -42451 -96585
5803 -96585 -133086 -113318 -73890 -65451 -67135 -117607 -149702 -139956 -128787 -98998 -100495 -84070 -16789
5790 -16789 36235 11214 -21182 -11800 -11355 -7848 11046 20019 26322 -2771 -3225 2337 3748 -17966
5776 -17966 -25044 -10177 25021 12895 6055 -26820 -54511 -3988 38161 24807 5085 9037
5764 9037 29290 40968 3985 -18231 -28049 -16085 4029 -21937 -41964 -23751 -3823 16720
5752 16720 55118 61145 53262 26011 8215 14218 18573 38291 60277 71430 77102 22546 -47937
5739 -47937 -62454 -45178 14372 50468 52723 25952 3239 16972 37883 36039 20146 45272
5727 45272 16622 40024 17573 45971 55555 39198 11603 38134 28225 3726 3043 -881 -3543
5714 -3543 -46204 -53988 -23213 -6074 -23991 -33434 -16889 -25285 -16787 47268 63946 45659 5495
5701 5495 -27778 14971 40190 54641 41175 8456 3014 -182 -302 -6984 -6613 5925 -2926 -19605
5687 -19605 -65474 -78554 -76639 -48609 -27014 -28010 -16859 -24206 -31850 -41884 -54968 -26042 -29119
5674 -29119 -46512 -11657 622 -31915 -1701 40769 57245 10933 -33037 -38582 -57364 -45113
5662 -45113 -43322 -13730 -20905 -24949 -16543 -15491 -20535 -11729 -9455 -23873 -47168 -45939 -35363 -58151
5648 -58151 -81403 -69044 -36689 -27263 -16259 -58530 -69215 -48664 -14646 -16350 -45025 -76075
5636 -76075 -83549 -85367 -59022 -43141 -71744 -29409 -33914 -62375 -66247 -50993 -19753 -37001 -14496
5623 -14496 -10480 -37138 -66719 -74562 -81527 -90950 -56211 -67883 -42875 2415 -3674 -16427 -11075
5610 -11075 -4386 6199 15368 -8209 -11548 -13918 -34097 -70549 -79611 -73203 -71153 -32129 -61897
5597 -61897 -62367 -57516 -55419 -51087 -62153 -71732 -77384 -72651 -23591 -8847 28771 36494 31391 29829
5583 29829 42695 54394 20517 13614 3624 2306 -11571 5145 33024 18379 48495 18572
5571 18572 23063 23387 17270 3540 -44463 -66376 -41015 -63849 -80086 -70151 -58188 -59789 -8948
5558 -8948 17380 2746 8469 27959 20919 -5863 8866 -8670 -14801 9534 12721 -26855 -59777
5545 -59777 -33758 -40475 -59450 -32563 32771 37419 -6252 -13613 -59536 -47048 -453 23347
5533 23347 714 -35712 -55506 -51418 -60148 -30521 13637 20855 -8910 6699 -1084 25975 66223
5520 66223 -12067 -39105 -70317 -25525 13577 23452 5034 -7364 9029 -16179 -38828 -51660
5508 -51660 -70962 -30880 -30378 -20393 -15648 5997 -18515 -44796 -26084 -42521 -29376 -18416 -39362
5495 -39362 -65667 -22844 -14242 -24961 -28990 -56121 -55113 -39348 -23584 -21466 -19487 17431 32075
5482 32075 1903 1326 2958 11978 -10768 -36820 -30095 19959 32342 -44637 -85529 -65823 -27774
5469 -27774 -7984 -38948 -68766 -80462 -66935 -47975 -78517 -76573 -52311 -32523 -36396 -15240
5457 -15240 51084 66334 68527 2321 -36333 -39798 -64476 -35676 -28286 -30137 -65448 -76228 -50452
5444 -50452 -56061 -75172 -100854 -96698 -50010 -18898 -6104 -9978 -14649 -30629 -40605 -20014 16338
5431 16338 -30828 -37834 -22001 -3051 -29362 -51318 -32879 -35045 -54507 -93848 -71039 -37778
5419 -37778 -45164 -32146 -19083 -22576 -30581 -30037 -9763 -10137 -13966 -23685 -16964 -2931 7945 8069
5405 8069 32698 46522 42028 75237 59540 19148 3597 9232 47049 68627 62190 39275 21662
5392 21662 -16854 -22875 12222 53298 95609 100012 71407 46322 50496 16820 5651 1804 28406
5379 28406 54491 19664 -32142 -53797 -29732 17445 -6566 -54537 -50044 -26351 -32150 -30712
5367 -30712 -9422 11742 17460 40836 99450 87347 61158 41225 27602 18950 14444 13838 -1044
5354 -1044 18960 5523 7899 11014 -9333 -18145 -17101 -31353 -27711 -7242 21776 35394 41084
5341 41084 37371 43686 59132 21351 -3097 8607 1709 17107 -24801 -48763 -18661 9795
5329 9795 40786 77966 79628 55166 76239 54693 51369 44160 12287 -9819 -11944 -10157 12088
5316 12088 24587 36390 14380 -21825 -5702 25 -25507 -4273 38367 44040 38330 21901
5304 21901 -15660 -35053 6599 4511 8152 8364 -23987 7421 10120 25186 48517 1285 14302
5291 14302 10453 -23687 -24626 -32000 -33944 -15717 42122 61725 56254 -3765 -35288 -47869 -50555
5278 -50555 -118512 -151391 -116668 -52878 -17097 -13303 -4131 -13535 -6511 -16007 -8719 11738 7407
5265 7407 42793 34120 -15745 -24774 -54985 -75448 -55374 -21300 -16806 17792 5709 -8516 -15392
5252 -15392 -37584 -29418 -5837 -14286 5403 -6843 -59249 -84323 -83404 -44341 -33022 -47686 -65779
5239 -65779 -49397 -11351 -15169 14143 8917 -10344 3594 20180 27308 -5062 -48076 -69686
5227 -69686 -37078 23045 42522 -7359 -5941 -8704 -16499 5599 -2964 1406 37971 18769 -22839
5214 -22839 -24565 -28305 -54842 -49969 -64655 -53211 -43170 -11187 -1019 15405 -6018 -23627
5202 -23627 -29736 -9361 -26701 -60649 -22934 -22794 -32322 -54392 -38927 2665 198 -7782 16004
5189 16004 -2979 421 1357 -4819 -17103 -20941 -27001 -23131 5329 4328 -69213 -110993 -102470 -69391
5175 -69391 -16717 10709 34198 6009 -17119 -42647 -35003 -35456 -50676 -57539 -70305 -75874 -75716
5162 -75716 -30350 17958 41222 51112 44586 9946 -10101 11021 -8844 -12832 -18278 -31715 -53876
5149 -53876 -58842 -64361 -24003 14505 -4874 2439 -128 -38811 -67667 -71231 -31283 -31978 18476
5136 18476 52080 30776 14257 30175 35901 53222 55778 43172 -26022 -31764 5323 50432
5124 50432 21512 -36725 -24218 -15766 -38441 -49027 -25491 4999 -14660 -36893 -12312 16728
5112 16728 12054 1648 -3873 -31302 -44882 -42374 -44019 -31740 467 -5573 -42732 -46809 -6254
5099 -6254 13988 -23026 -35745 -9215 12447 103 -13058 -15240 -16708 -23859 -17944 9151 57730
5086 57730 55243 43477 59694 -12608 -71206 -95085 -125055 -61512 -10216 15923 25375 19765
5074 19765 121 2298 36025 35768 29360 41947 25793 -37149 -87215 -64342 -35990 -54022 -60432
5061 -60432 -45499 -13845 17464 210 14127 3255 -12800 -14590 -23085 -13317 -21514 -16734 297
5048 297 22829 17353 10399 -3162 -54003 -18798 -8278 -16466 22559 26072 37418 16244 -42989
5035 -42989 -38851 10102 4220 -34051 -14852 -3932 -45655 -60667 -56226 -35206 -11372 -23812
5023 -23812 -7287 40885 38675 50731 57495 28707 -18509 -61973 -44893 -18641 -18957 -6523 22567
5010 22567 20833 -29346 -28266 -35858 -16777 30774 45357 6186 -3746 -3843 -30361 -42906 -49429
4997 -49429 -38083 -1777 26791 -8633 -45611 -58126 -42070 -29752 -24212 -47761 -10057 4903
4985 4903 16031 29703 24704 -10618 647 11699 23670 41777 32480 27276 18316 9961 5299
4972 5299 -4768 3043 -26103 -29631 -37067 -66283 -37254 -7082 8543 15332 -9998 -40175 -50386
4959 -50386 -45723 -8262 885 -22083 -29424 -3499 20380 22617 -25971 -35757 -31689 -32845 -6541
4946 -6541 -19294 -16814 13503 31780 11572 -5261 -11612 -7667 33745 30444 -8768 -18532 -28236
4933 -28236 -36301 -36221 -61319 -39997 -14960 13283 -3721 -33669 -14473 17614 30933 20140 -1662
4920 -1662 -28445 -26110 -28397 -15287 20359 8944 -14951 6914 35020 45306 13603 -22641
4908 -22641 -46352 -52903 -47508 -60231 -18536 -1870 772 -4830 13049 12890 -1401 14801 34681
4895 34681 -19359 -13165 -13587 -34606 -20892 -54607 -60057 -52533 -62803 -61436 -54204 -40799 -22446
4882 -22446 -8590 -55292 -95422 -92261 -60258 -28622 -18012 -8605 26340 33887 67524 30714
4870 30714 16612 12818 17989 -319 -13389 -32343 -45908 -49597 -33740 -10855 -25983 712
4858 712 -18483 -30426 -18703 12238 23884 -20680 -34268 -58146 -101509 -107685 -110764 -94915 -69845
4845 -69845 -61534 -63486 -28582 6176 -22248 -39482 -35109 -37465 -36053 -6006 31363 48284 45824
4832 45824 14918 -1870 4638 16163 -44319 -34364 38232 80452 52239 18708 -3981 -6422
4820 -6422 -42217 -62694 -69731 -39930 -15830 -41536 -62420 11691 30929 40293 -24761 -56395
4808 -56395 -39894 -10470 -27948 -46157 -5088 16487 -47565 -69087 -31719 -20108 -39243 -57460
4796 -57460 -82051 -89266 -92879 -71491 -58560 -26305 -54122 -101424 -109965 -97889 -51909 -17901
4784 -17901 -10277 -46083 -93287 -97048 -108593 -62985 -19498 -35901 -55815 -39361 -2859 -36775
4772 -36775 -60508 -37140 -34582 -64593 -40262 -32639 -62795 -99763 -57231 -55753 -44709 -39774 -79958
4759 -79958 -71258 -19101 12955 27409 1668 -12143 -49803 -28040 -5447 542 -17950 -80592
4747 -80592 -86491 -60016 -20188 -8182 8670 4261 4150 11611 23 -18235 -41000 -65244 -67795
4734 -67795 -36200 -11231 4741 -23884 -54454 -42418 -19028 -18028 -64381 -73785 -28690 40315
4722 40315 26867 27056 -15704 -32448 15761 74052 85045 73085 73598 32789 -53021 -59574 -16924
4709 -16924 6492 -4429 -12795 6605 -3671 -8627 -4163 -17942 -36612 -51336 -51429 -34279 10641
4696 10641 8123 16606 38921 40917 37662 -1240 -82681 -33471 18670 49052 14623 18518 26944
4683 26944 32873 11518 15477 31502 16175 22230 45691 21126 2237 13608 -10076 -28905
4671 -28905 -39331 -30045 -32432 -63345 -40846 -40497 -44232 -28343 -37408 -34789 -13238 28189 58393
4658 58393 43862 11314 -13469 -31406 -33249 -22719 -2532 -9649 -15391 -6199 -1076 28043 31300
4645 31300 -8056 -23116 -41894 -50251 -63598 -64387 -52668 -42614 -32634 15594 5960 -5331 3047
4632 3047 35390 30147 57832 74213 83018 66594 37109 6527 -6311 -16795 -5050 36649
4620 36649 32502 -3024 -6087 -31735 -87126 -91619 -39298 36718 73094 22762 -15960 -61176
4608 -61176 -68555 -60388 -33458 -29092 -13428 -23670 -24812 -26916 -57799 -34820 -14836 -47757 -51980
4595 -51980 -29197 27139 65694 6113 19803 16456 44771 36498 6519 -36635 -20533 -22941
4583 -22941 -42513 -24143 -16686 -14955 -49031 -55230 -51625 -33573 -24606 -47874 -52637 -53103 -19629
4570 -19629 23770 41137 48204 59880 84753 40784 2659 4639 -13504 -13419 -21447 10044 7464
4557 7464 5024 1175 -43622 -32760 -6968 -24514 -45607 -63216 -8412 1266 12928 46013 60677
4544 60677 39113 7114 2044 11444 -11352 -31738 -41827 -32410 15587 26642 -3545 -19384
4532 -19384 -21603 -1671 33840 74093 71996 18842 -31370 -46817 -25260 -3239 22618 51007
4520 51007 41044 -4903 -40496 -73284 -45626 -8366 32702 60537 49176 -541 -19208 -47699
4508 -47699 -21671 -19326 -13210 30308 15372 -22021 -8063 -6223 28732 66702 62279 53216 30512
4495 30512 35890 8438 -3922 -17539 -4804 -14419 7891 9336 -29439 -40158 -27456 -14907
4483 -14907 14512 21522 7589 28777 36165 43772 87586 91081 59406 36432 26778 6195 -3015
4470 -3015 -17723 -28967 -21507 -932 -12192 10834 32942 -1173 -37746 -43213 1380 -21338
4458 -21338 -27896 -8311 -25643 -28993 -10144 -40973 -25931 -12647 709 -9547 17890 32246
4446 32246 27758 33623 39033 45584 35003 -5966 -11153 -9364 14513 -1913 -2815 -41799 -39309 -40920
4432 -40920 -32221 -25433 -7677 9801 -14763 -30099 -54279 -69019 -70509 -27005 13161 6479 37968
4419 37968 890 -20780 -17916 -5130 26893 28487 8927 2902 -14481 -30892 -51019 -72676
4407 -72676 -32334 -7510 -2911 -9619 407 6062 2684 3356 4304 13651 16683 28266 44760 43303
4393 43303 5194 -10591 -9885 10292 53770 46378 10890 3843 21036 -7958 -43858 -79406 -61411
4380 -61411 -6412 21946 34944 -7767 -4640 29511 25183 21337 -20221 -35766 -48154 -80225
4368 -80225 -83946 -74695 -73909 -53486 -41843 -55567 -37888 -60488 -73019 6112 43241 42771 40385
4355 40385 40239 45399 26956 -22871 -26471 -12456 13268 -26446 -79389 -82349 -20830 33960 185
4342 185 -55738 -59694 -57256 -24419 13602 68625 74984 32359 10138 -2377 3332 -8319 2844
4329 2844 -12820 -26342 7987 30288 -11357 9899 7789 10477 -6462 -57333 -44229 -43222 -6574
4316 -6574 14176 -54191 -80661 -67958 -20903 44365 55515 43976 30346 27915 1090 -5523
4304 -5523 1191 5321 2219 -12086 -38400 -32369 6443 37586 27344 -18032 26299 46170 55222
4291 55222 49977 63044 31447 8322 -9446 -46544 -50355 -48493 -48606 -58321 -54502 -5065 12363
4278 12363 4051 -2987 -36983 -37566 -41468 -28932 -51903 -66144 -74250 -73962 -11018 1614 -17799
4265 -17799 -46613 -28804 12269 -11594 1568 -3089 -21572 22140 41519 1451 -35252 -39672
4253 -39672 -53547 -71779 -45308 -49518 -64478 -29799 -42848 -33216 -23743 -26730 -40998 1966 12681
4240 12681 22580 68768 80364 41286 9636 -4205 1244 -6979 17065 14085 11410 26977 -22990
4227 -22990 -44680 -11174 10137 4132 10016 669 -46468 -78893 -90440 -62284 -37681 -21624
4215 -21624 -23465 -21517 -24770 -15237 10982 -13246 -54526 -65864 -30517 -20031 -52017 -60574 -42250
4202 -42250 -13207 25070 15111 10342 8023 7726 -1858 9045 1637 -2515 -11907 3366 3551 -37155
4188 -37155 -37711 -26341 -44393 -20335 -19798 -39997 -36619 -19514 -46239 -73821 -43093 -15316 -23695
4175 -23695 -63075 -41703 722 39534 31067 6397 10579 8873 -7749 -39067 -21497 8604
4163 8604 5260 11199 16276 67364 109071 106843 103699 56380 -28952 -55867 -64920 -59979 -36427
4150 -36427 -12840 2186 -18776 8369 -1028 -28719 -28260 -10256 -15976 -39338 -91108 -68323 -11386
4137 -11386 5716 -7504 -26025 15954 37311 43597 7425 28094 45080 63346 33147 24761
4125 24761 25111 25988 15479 21706 -5069 -30686 -19185 -1769 5190 25762 -9238 -33206 -1115
4112 -1115 -36858 -56531 -35718 -21312 -42156 -65742 -71316 -57825 -85251 -80107 -20512 -19203 -35396
4099 -35396 -24694 -15902 -9606 -13701 -18589 -6785 -4927 -10756 -13058 -29127 -20562 -34511 -30808 -48262
4085 -48262 -61198 -50299 -26803 -31443 -21150 -28007 -16921 24567 41915 25630 4379 7842
4073 7842 -28272 -50649 -46932 -26385 11546 63319 67602 87050 75647 83041 89955 88452 59824
4060 59824 16716 -11271 6382 -13906 -30327 -11586 4417 4906 -12198 4679 -14253 -29858
4048 -29858 -29786 -36472 10083 53346 29350 -33547 -16608 38983 61362 72911 75745 44703 -34307
4035 -34307 -39777 -20788 1160 15438 40442 32951 38992 33979 -7143 -47453 -19926 40098 44873
4022 44873 30741 -11736 -55321 -66947 -61022 -46399 -45474 -61291 -63849 -67251 -87057 -98259 -58457
4009 -58457 -19999 14529 52194 34539 -7147 -21789 -37397 -50199 -34144 -58579 -34941 -40840
3997 -40840 -34910 -49413 -81690 -80271 -75560 -60004 -90423 -63711 13038 29044 8576 -8156
3985 -8156 8246 31868 2785 -634 11021 -6938 14761 26951 31699 39728 40273 7482 9560
3972 9560 10434 -10951 -34963 -27035 -3931 -18055 19478 -3806 -63032 -58265 -27114 43073 50525
3959 50525 29498 12746 36806 11431 -30156 -71631 -77539 -78550 -62106 -61552 -56979 -62354 -49246
3946 -49246 -60260 -41117 -42048 -37170 -42928 -67910 -52823 -14182 3781 1803 -60569 -57355 -8565
3933 -8565 35852 16523 8565 42985 -2088 -14031 -2320 -8670 -43951 -46786 -43540 -13638 11482
3920 11482 48161 48316 26283 24724 15089 -678 -7112 -36686 -72922 -99956 -65600 -18889 -60761
3907 -60761 -92433 -70165 -33268 -32756 -55115 -13017 -2081 18449 14162 -16162 8940 -68 -27189
3894 -27189 4622 45027 60134 9299 -16160 -2155 25060 22278 2282 -54301 -63415 -2267
3882 -2267 12773 25057 41734 26035 13418 22159 17533 10859 17866 3790 31434 38435 23545
3869 23545 3939 24182 23850 -25442 -45366 -50929 -67341 -73675 -62944 -66787 -36901 -31735 -15039
3856 -15039 -5227 -3646 -11159 -40252 -40673 -40936 -34625 -79702 -112811 -98577 -61832 -51267 -9098
3843 -9098 -2730 -48871 -64403 -12463 399 -508 -22849 -44976 -47667 -15587 3218 -2244 -43326
3830 -43326 -38913 -13494 -24494 -20177 -9960 -21211 -45299 -31863 -35671 -51343 -40951 -22105
3818 -22105 24276 73948 103413 81575 39815 12392 -11351 18340 996 -41433 -30083 -26143
3806 -26143 18977 24748 -4591 -12837 -46065 -26424 10971 10545 -7801 41544 14232 -6361 -43563
3793 -43563 -84051 -52689 -30360 -59305 -54725 -5374 -7495 -54087 -63119 -40205 -47777 -29218 -31363
3780 -31363 8251 20441 8316 21829 19447 -11451 -34253 -42775 -28550 -21494 -15824 -22638 -26795
3767 -26795 -30946 -30109 -34118 -13278 -18068 -25813 290 18250 -13115 -34962 -46081 -32677 -3142
3754 -3142 -2366 -8723 28416 16880 7599 -1037 6640 29734 47110 50873 63141 51642 27683
3741 27683 -19073 -23743 -32497 -2264 -18329 -16959 -1567 16834 58099 55931 65590 62381 23314
3728 23314 33165 49414 34168 24202 26760 50529 18213 -32754 -25373 15022 38622 52523 -4817
3715 -4817 -18496 20065 30230 59252 64332 40682 48980 38600 -9887 -37603 -8736 -3890 -17454
3702 -17454 -20242 1792 -18222 -34928 -62519 -49675 -26180 -29320 -17487 11201 10781 -22271 -35870
3689 -35870 -42052 -9872 -15434 -9311 -2468 27586 45833 65886 61476 29277 -3279 -47840 -47587
3676 -47587 -30296 -35672 -48299 -27723 -778 -32435 -7947 -10571 -40322 -42207 -26265 -68515
3664 -68515 -66797 -79735 -72455 -24064 -20348 -12346 -27902 -31350 410 35550 68555 57649 15013
3651 15013 4840 -41103 -36189 -55576 -69339 -49985 -49143 -45958 -67251 -77412 -82799 -105861 -91021
3638 -91021 -71061 -47579 -46438 -49797 -50199 -69518 -56100 -17978 -17940 -5569 26470 4900 -27803
3625 -27803 -33077 -14843 -7034 13192 -37054 -26741 -30718 -20406 -29150 -43794 -23371 -59932 -49865
3612 -49865 5747 24800 -6381 -34389 -17647 -16452 -27010 20579 21598 -8809 -3036 -5985 -6139
3599 -6139 -34015 -23144 -1660 -14402 -28208 -44463 -25736 -12455 -28495 -40985 -29248 14434
3587 14434 13924 -5293 -5448 14771 -15047 -24511 -36280 -39379 -1893 -8625 -34591 -33510 -4566
3574 -4566 -5250 -22438 -27258 33316 35210 35541 68498 76721 32821 44198 1848 -32264 -16666
3561 -16666 22308 4247 -24416 7541 59790 42322 2500 14412 22107 25438 30120 -13480
3549 -13480 -1719 -22271 -66360 -74330 -75966 -59149 -59998 -48461 -89191 -91451 -81639 -88212 -90888
3536 -90888 -81955 -58743 -37281 -11161 -67566 -69053 -73669 -85815 -100128 -86641 -62746 -7429
3524 -7429 18450 7394 1294 -4998 -40010 -15793 -12301 12104 50905 27479 2850 -22870 -21114
3511 -21114 -22798 -50009 -68546 -38353 3280 49165 45358 -16685 -6630 -4900 14910 -2089
3499 -2089 24679 -9381 -24673 13995 -17735 -4588 -4063 9120 5204 -26231 -28051 -2628 7435
3486 7435 37318 13682 -3811 -29138 -69408 -91059 -50763 -32151 -37959 -47219 -39528 -54708 -56631
3473 -56631 -20314 -1543 -3453 14037 40213 18350 5666 59353 67455 41615 60804 46286
3461 46286 19599 30167 13818 3629 215 -7393 4417 29070 55351 53709 35510 23605
3449 23605 -12110 3714 43830 -877 -46536 -37646 -37832 -54859 -8557 -11486 -34244 -22412 -342
3436 -342 -14387 -33462 -50103 -27271 -12518 -13775 4414 -58529 -69034 -17424 32357 59647
3424 59647 77891 99319 79318 -17117 4496 85965 119582 113883 85236 46938 -5895 -49640
3412 -49640 -35621 -925 -32306 -48318 -19041 18158 17284 17393 31613 54301 -5613 -18887 -6203
3399 -6203 -27574 -29128 -16977 -46877 -37451 -46492 -53354 -24763 27704 -8192 -5463 2330 -27272
3386 -27272 -34106 -71198 -67466 -70919 -57699 -33787 -19680 -25239 -3205 -8478 -40941 -30255 -25961
3373 -25961 -21658 -25167 -5831 8183 -43031 -19351 -15094 -25794 12081 9032 -21982 -28874 -52737
3360 -52737 -25275 28042 63754 47263 26080 30069 22141 9589 17739 -6505 -20108 -38520
3348 -38520 -39000 -39552 -51000 -42229 -15853 17425 36119 52085 17791 -12635 -34697 -9821 -14130
3335 -14130 -23860 3199 -11820 3578 27596 43855 16979 -4283 7074 1095 -321 24606
3323 24606 25431 10609 -32242 -44516 -49220 -51986 -40492 -2839 -4585 -63204 -36424 -29137 1158
3310 1158 8421 28092 20690 -9170 -11604 -13122 15715 34359 50045 21237 -7816 -6330 -18171
3297 -18171 -1030 41748 24622 -39198 -37428 4530 9228 18395 16655 7904 10429 4706 44570
3284 44570 20653 20815 36133 64795 30532 24979 56444 54591 89734 87778 40343 6778 -27185
3271 -27185 -70284 -90529 -68489 -25542 8781 26333 36051 61643 92416 49015 -35747 -63963
3259 -63963 -23609 8314 46197 62703 65078 61942 38707 50126 50658 30802 -845 10356 33133
3246 33133 61001 58451 20617 -33455 -32622 -39957 -32616 -24798 -19865 -592 26122 15003 -34797
3233 -34797 -28602 -49907 -47257 -60263 -63276 -44769 -5016 -12521 -45910 -56302 -11607 4788 7585
3220 7585 -28991 -18260 -4054 35364 7824 -21019 -27529 -7779 1026 -32312 -28906 14330 65872
3207 65872 70574 61694 14575 -22496 -29138 -39697 -43950 -41054 -10741 39932 57110 64852 47271
3194 47271 -5475 4128 16687 33371 53266 43877 6182 8831 31222 19833 14980 -15234 -21926
3181 -21926 -40062 -41799 -59899 -39836 -38217 -45177 -30205 5465 51592 49553 72117 71515 55174
3168 55174 54941 50665 71528 70451 54218 33224 3239 29694 42381 31497 -25296 -49941 -6410
3155 -6410 34969 -8847 -58795 -54162 -23907 -11722 9603 -31232 -66111 -21825 29142 -12975
3143 -12975 -46935 -24561 -25213 -52697 -10229 24533 18213 -5479 -16567 46738 54742 57847 53832
3130 53832 41161 17025 1013 -13852 -63896 -41240 -11462 -21939 -3770 33296 54573 20039
3118 20039 -12484 -2557 2977 -38792 -67094 -26051 -21144 -9285 30276 33999 26104 -10736 -45738
3105 -45738 -21699 -2705 12536 -14917 -25011 -71087 -74432 -42091 -27740 628 18779 18692 22340
3092 22340 28461 -6748 -15265 -43823 -21644 16940 25918 2108 -44322 -80393 -72542 -55438 -46869
3079 -46869 -21485 26808 34115 28150 -403 -41204 -38680 -29940 -15723 -20608 -60883 -32518 -25878
3066 -25878 -39743 -31257 -8667 -17557 -42358 -46220 -54317 -10145 55743 39738 3416 -1407 -19574
3053 -19574 -42360 -68912 -36439 23196 17517 2724 -5348 29082 32922 6604 34944 39335 18138
3040 18138 17461 -20459 -324 -23319 -76588 -69590 -13967 19780 -9552 -43181 -65946 -70891 -97413
3027 -97413 -73768 -16574 19785 23164 14696 15032 7909 -5407 -3755 14293 29882 33515 18000
3014 18000 -5336 -47858 -24673 36863 65876 67082 66873 74809 79239 83652 78038 59177 41023
3001 41023 -4419 -59459 -52177 -40829 -40116 -30519 -21254 -20098 -4245 23752 32121 17577 21021
2988 21021 47519 36051 10856 18351 4280 -38124 -59384 19742 73485 47742 37433 47776
2976 47776 49069 -2184 -33374 -24960 -47094 -30110 12858 -5069 -30760 -30652 -37301 -5273 6379
2963 6379 6283 4436 -11099 -12657 -50270 -64109 -25822 -18881 -8816 -7197 -24911 -30713 -9764 -19570
2949 -19570 -22097 -29872 -45480 -63748 -41792 -44649 -35405 -10935 3338 9846 11021 -1097 -10497
2936 -10497 -15328 -12007 -31772 -28433 3716 31139 45599 23879 30234 19211 18298 31955 23891
2923 23891 31409 31450 9114 25352 41935 43149 44947 50643 25304 -14140 871 2593 -28708
2910 -28708 -9760 -40418 -38924 -14499 -2816 13524 -4235 -27899 -46154 -46619 -54729 -48086 -30481
2897 -30481 -24132 -10388 -38549 -47538 -5849 -8433 -7397 15135 22419 10254 13928 27723 28545
2884 28545 8528 6025 19118 8199 9373 -38786 -66091 -64515 -32210 -18904 -9030 2164 25829
2871 25829 33717 15621 8910 -17419 -8589 -4273 24236 24095 23048 -5154 -55494 -48420 -42124 -60226
2857 -60226 -55432 -23072 -42599 -66858 -55591 -32308 -55501 -32075 1083 -19835 -39938 -68976
2845 -68976 -57061 -68393 -77225 -53314 -12364 19402 -8594 35815 84699 92101 56001 14675
2833 14675 19756 47622 45412 37148 30299 7493 -24830 -8135 1598 40659 71438 58615 92199
2820 92199 109075 81858 56812 41934 39864 32956 51926 79983 82395 41933 35536 45411 82079
2807 82079 81443 12948 -1745 8224 16821 -14502 -16591 -17982 -21193 -47700 -12045 29580 50604
2794 50604 41228 31892 2435 16482 17905 1277 -57698 -52252 -31740 -39304 -19683 -19061 -45929
2781 -45929 -22185 -5880 -5489 2509 1657 11574 15635 46049 45052 51633 82145 47149 407 22250
2767 22250 -15565 -57244 -54952 -23109 35410 64508 59398 49324 25574 26708 3618 3049 -5217
2754 -5217 -14515 6964 17816 16809 -31618 -73280 -102737 -115138 -107632 -67524 -53290 3776 50968
2741 50968 64146 76045 20522 5156 2631 -15388 -18389 -5994 36091 40363 21337 56440
2729 56440 90330 74097 22659 305 28375 -2108 -25579 20962 61639 82628 59850 26313
2717 26313 -23069 -62715 -53036 -23698 -8339 -6802 -28000 -32284 -4376 38048 57437 56422 24761
2704 24761 13552 5648 646 2001 5388 -12474 -30123 -24828 -17499 -2475 17377 -32531 -72530
2691 -72530 -54944 -44404 -30361 -38494 -37548 24839 27302 5950 -44347 -14784 12801 17503 26496
2678 26496 20239 4678 9816 21104 7816 -11275 -12466 29566 11158 -13319 -28248 -906
2666 -906 6694 27191 17196 808 224 -16896 -39077 -37664 -12236 -10012 -22964 13804 19627 -22
2652 -22 -51106 -84676 -66055 -75281 -48250 -25194 -12155 25236 44369 8118 -30149 -20117 18048
2639 18048 -2537 16842 9888 -16107 -22962 -12655 26774 18020 -40018 -51730 -6198 -52876
2627 -52876 -66174 -34688 -2462 12373 -29506 -9427 7627 21192 52431 29682 -13572 -26035
2615 -26035 13041 34074 37708 42740 49143 43288 10006 -2826 -19337 -71508 -49694 17124 60431
2602 60431 46799 9512 -23737 -16369 13468 4483 -10267 -8825 -12534 14111 1148 16339 40266
2589 40266 40164 42326 21930 -24550 -31803 -40715 -31161 10852 -10996 -10618 11610 -5380 -18111
2576 -18111 14095 14553 4216 28597 39878 30258 -4857 -19292 27695 27446 1386 -4697 -6423
2563 -6423 1013 15375 630 12969 26968 17663 -3432 2266 5236 46315 33952 37555 53146
2550 53146 47822 46144 8470 -19159 -40587 -44472 -55506 -29031 -29401 -46374 -26836 -6040 -15092
2537 -15092 -14190 -42999 -26913 7063 3339 -44842 -46152 -17777 -22175 -14565 -6105 9723 1377
2524 1377 -41757 -43994 -253 3771 2618 -40191 -58932 -45807 6928 11759 15692 -9124 -17169
2511 -17169 2760 -885 4374 41285 -10355 -20845 2959 19973 -12286 -26088 -9437 6820
2499 6820 19113 -8855 -4189 12757 3226 13413 21691 32919 19490 -25135 -69888 -74438 -59562
2486 -59562 -30515 -33485 10438 71511 76748 61745 48621 11225 11235 28708 39877 57084 49291
2473 49291 23414 36360 24872 36581 44116 22126 -1006 -11057 -17229 -34531 -36519 -22680
2461 -22680 12518 55961 55121 40968 6294 -48147 -40657 -60659 -48065 -14786 -1226 -31388
2449 -31388 -34113 10275 15308 2945 -22393 -37268 -29915 -26065 -10001 -22029 -37892 -42969 -23088
2436 -23088 -14061 -2272 80 1617 39913 5223 5267 10255 7544 -36729 -28229 -41412 -48020 -39705
2422 -39705 -79882 -74824 -50951 -28327 -39782 -74212 -68136 -49900 -15359 -16710 -8354 51882 56012
2409 56012 14628 14697 41256 32989 -5679 -19339 -4748 -23349 -16947 -14956 -29489 -3003 -1783
2396 -1783 -20887 -28265 -20295 17370 13114 11173 21069 -6128 -4539 23632 36680 35394 33620 19083
2382 19083 29018 41272 80417 102684 60057 16306 -21071 -35565 4013 35305 58678 38270
2370 38270 38818 26920 21039 16392 36730 21864 14500 1188 -25351 20094 72283 94496 72219
2357 72219 100083 61425 30126 -108 -21149 -26584 -5128 24047 5660 21031 4170 29835
2345 29835 34883 26758 20068 1716 -22957 4008 39772 41669 32192 12483 15115 7156 31945
2332 31945 77123 99950 82296 18723 7825 10080 -16475 -32341 -19275 795 12898 7133
2320 7133 13404 7174 9819 -14692 -36598 -60047 -70971 -29230 27731 33659 32940 26395 48536
2307 48536 85501 83140 36895 3422 5118 34689 13499 -2402 -138 2233 -438 9518 39561
2294 39561 24634 10507 -18646 -52905 -47387 -25889 29141 58152 43787 36694 54372 69196
2282 69196 38485 -3470 -26004 -8796 15296 28565 48050 41218 28987 36026 31635 42494
2270 42494 36510 38356 54898 53426 31525 -41690 -35491 5528 36856 43122 14079 -21039 -8586
2257 -8586 -2551 21952 42058 31507 -13994 -23308 -20456 34299 45993 65179 78844 99522 47954
2244 47954 33229 37933 37693 61946 44384 17341 44111 13363 8281 16207 40668 15391 18894
2231 18894 35075 -15838 -38778 -46157 -77955 -101516 -77537 -31471 -8188 18050 22175 -5909
2219 -5909 24382 22998 -7936 -17750 -35982 -17270 -7733 41066 67188 39373 -3651 -13264 30452
2206 30452 43966 64026 35264 2850 13063 -49113 -47859 -33079 -8163 15177 59504 73285
2194 73285 55177 -22721 -55887 -13391 45228 -70 -22677 -2032 -14148 -11685 -27371 -46694
2182 -46694 -27134 -22934 -46441 -35973 27079 43356 17682 -12009 -32170 -28504 -11068 19934
2170 19934 50444 53296 49036 -6351 -11676 -11304 -59441 -75238 -69321 -16027 7300 2139 -11104
2157 -11104 -4512 40340 39123 11505 33542 52820 27517 6798 13436 71764 66754 62428 30520
2144 30520 15048 27668 43277 78637 91337 31938 -54158 -69625 -58099 -36558 18010 20730
2132 20730 17708 55766 48752 32953 2737 -18725 -12882 11024 21967 50834 38129 55704
2120 55704 39109 -10626 -58320 -49162 10562 39802 49288 35019 11407 -29010 -13865 5527
2108 5527 -29405 -78513 -65242 -60408 -27185 7695 2673 7415 12304 -17915 -71961 -66721 -62348
2095 -62348 -70469 -99045 -73108 -59595 -57354 -35946 -19420 8986 29124 5868 -15902 -15844 9616
2082 9616 5548 7527 8605 -25658 -47672 -8811 9608 -4953 -1283 43914 13341 -37055 -5012
2069 -5012 20021 26371 26001 23066 37194 29109 26684 -17292 -29136 1963 19655 -5033 9437
2056 9437 20024 39144 27848 13273 12134 23969 10264 -28508 -10167 7834 -6353 265
2044 265 16598 7688 7313 25493 -16047 -47069 -11723 2850 6689 24647 -5238 -12710 4937
2031 4937 21806 14146 -12301 -42059 -24820 5258 -12151 21432 9703 -5938 -2989 -31357
2019 -31357 -93550 -75664 -21543 -12589 -25062 -13127 -15596 -11885 -25407 -44529 -35729 -20194 -20051
2006 -20051 -25247 -7884 -3057 -27720 -7309 -8745 -37141 -47390 -46735 -73729 -106221 -95167 -86769
1993 -86769 -65812 -78713 -53377 -18838 7333 5851 17164 42720 39116 15329 49206 53013
1981 53013 60874 77610 53044 25956 31085 16514 -5849 -4679 4884 -18027 -29674 -52883 -83943
1968 -83943 -79802 -43562 -11736 -18816 -7834 -17439 -27349 -35471 -5736 20587 55342 43201 -8670
1955 -8670 -13989 10182 57746 87792 85890 111883 121227 81376 16059 -7556 -2385 -40514 -31811
1942 -31811 -15299 -167 4646 16889 -5183 -22825 17010 20292 17977 -9346 -37899 -34820 -77304
1929 -77304 -108876 -93376 -83990 -43136 -8591 15174 29075 13918 21574 -2072 -10825 -15461 -45707
1916 -45707 -48861 -50607 -50328 21252 73037 61401 46422 16058 -31399 -34027 -9511 -10378 17036
1903 17036 18796 13776 -11084 -3773 2801 -17299 -28335 -13632 44224 34024 -859 20924 14776
1890 14776 -2165 -23306 -11866 -13774 -15502 4326 6706 19548 16106 28958 26245 37160 26608
1877 26608 -19790 -1139 30999 66305 83451 73391 70242 63110 44842 31679 55008 36952
1865 36952 18984 4976 9533 31588 -24838 -68510 -51986 -25894 18327 31221 -373 -25757
1853 -25757 -45543 -43894 -98826 -81616 -24931 16148 24477 -12830 -20083 -19407 -46119 -52473 -48693
1840 -48693 -47120 -23918 25733 40418 39625 21370 2344 -19636 -19432 -13239 -43783 -37055 -41709
1827 -41709 -56245 -65806 -41904 -21697 -11300 -6462 -28253 -89003 -65159 3860 -4015 -23233
1815 -23233 -17536 -42330 -63462 -46616 2133 24643 39126 53399 27867 -16450 -32301 4074
1803 4074 30425 15861 11117 5885 19948 -3775 -9472 -5586 -13791 659 7551 23106 35063
1790 35063 53056 39143 20114 21774 -20300 -32849 -13076 11223 -27865 -18454 7525 16109
1778 16109 27103 53818 55143 89257 95920 70137 62001 31364 20483 -32459 -39655 10246 344
1765 344 2939 12795 2000 -8482 -7816 37430 56096 74306 73667 34001 29797 39638 29600 39433
1751 39433 29603 33166 12728 24637 42408 40544 -14344 -14916 4626 8952 40704 42648 40152
1738 40152 29648 16896 11321 14703 23924 37256 58134 70851 58917 10305 -5641 26248
1726 26248 82297 115565 80707 23925 31964 61508 45539 22937 -7833 -54478 -94366 -78224
1714 -78224 -48826 -53726 -55175 -38562 -8438 22042 17742 7014 -50360 -37940 -45231 -47149 -15756
1701 -15756 94 -10339 -13063 -7757 10426 8399 8814 4734 18247 29769 21621 2989 -32279
1688 -32279 -9173 23798 -3506 -25615 -52107 -2005 24823 5096 19862 14193 1118 7143
1676 7143 -10192 10093 28543 -18945 -16755 -1990 12153 -5730 -9714 -23249 -53508 -48595 -8318
1663 -8318 23932 8837 -15704 -29469 -7366 -5666 4215 11444 39267 94261 104141 56999 13191
1650 13191 -2512 14531 43646 64603 32647 4529 7220 24555 -3268 -39707 -2483 21212
1638 21212 23311 1536 -11811 25097 -3821 -51375 -40035 -27266 -25067 4829 19165 58725
1626 58725 34263 -2843 12289 -19907 -58258 -71051 -56302 -84829 -82525 -57553 -10159 46901
1614 46901 45098 57927 44526 39704 40310 45714 38117 48508 78476 88679 81642 109552 100989
1601 100989 49688 31215 40075 36702 22860 28680 51008 58034 43725 27632 12021 19356 2669
1588 2669 -9068 -37614 -44747 -55626 -25819 30799 18511 -24766 -36299 6702 28155 25481
1576 25481 25429 -10419 -16880 1754 15200 -3860 2711 26462 12687 -5007 -13149 4605 3164
1563 3164 -17983 24639 29724 15688 49514 52614 -9180 -25557 -33065 -27015 -41421 -30515 8357
1550 8357 63059 34537 14874 4316 22247 37771 43911 61178 75389 56882 10924 -23367
1538 -23367 1846 -6758 750 22249 -13009 -3571 44084 60787 42353 20183 41548 54223
1526 54223 13171 10320 52689 99244 54632 50139 49178 26131 44991 46654 67747 96639 77740
1513 77740 60161 60732 25600 11434 -9031 -16967 16222 71709 75501 53110 11206 38006 56004
1500 56004 70070 67777 33829 27884 15581 25768 35611 37939 39759 62027 132475 148055 130135
1487 130135 99146 68196 12825 -25052 -21133 -5341 66748 112969 77448 39713 7675 38923
1475 38923 24424 -8303 -13938 -28127 -14091 -17621 -21832 15891 61009 44264 14455 -21507
1463 -21507 -33560 -22234 -14151 -12344 20762 36121 32369 27370 15360 -3638 -23989 9662 45371
1450 45371 53643 26290 -11736 -39801 -22387 18284 4812 23188 -8676 -25494 -36751 -19464
1438 -19464 40195 71784 18711 15904 51073 81133 128172 101683 59051 2743 -40986 -36229
1426 -36229 -22919 -48093 -61410 -22947 -33446 -2812 43280 33573 35995 16974 -153 -38620
1414 -38620 -41687 -24320 -20281 -18902 -7711 -20016 -27288 -10466 -17734 -59929 -63269 -25918 -7922
1401 -7922 1823 -28311 -20811 6551 -8262 -17498 -39714 -52076 -348 59181 56106 20289 27933
1388 27933 37701 44874 54082 43367 -13732 -2191 33764 -1814 -984 -4222 20723 16275 14866
1375 14866 19714 33201 9446 22383 49096 29853 33828 47569 72295 60089 40837 59436
1363 59436 10828 -26041 -37482 -9127 31636 33876 -39093 -66532 -11524 -8238 -30312 -42448
1351 -42448 -4150 68882 28884 -2781 -15292 1419 -3785 9030 41573 38114 45076 25772
1339 25772 47822 71475 71602 51207 70860 73158 37080 34219 46643 38437 17193 1755 9870
1326 9870 -9095 -19525 -44930 -53375 1491 20668 20234 27984 20900 28050 21523 52052 22902
1313 22902 -18099 -8440 9400 -9327 -5774 1912 -10183 -7047 22578 56464 89734 58849 20512
1300 20512 -19456 20210 66589 69771 19534 15305 6792 41328 46141 13069 -4684 1401 21718
1287 21718 -6586 18695 40170 826 -36029 -29041 -381 10525 -10640 -3504 22520 8580
1275 8580 2768 34181 34033 28937 -3247 -14345 14316 4804 1395 -29901 -12136 12482 -8231
1262 -8231 -27298 -35893 -58413 -58184 -5916 5297 -28482 -60995 -10825 -5822 6532 1300 -35615
1249 -35615 -46916 -11106 3627 -21871 -30783 8302 51659 44629 3997 -20220 6584 22316
1237 22316 45171 18096 4027 -29980 -37640 -32470 3816 27670 3769 3874 22111 46843 49413
1224 49413 37271 44594 28314 31025 49039 43837 34112 38923 34177 29701 47223 47459 58201 25979
1210 25979 -18441 -18617 -19629 -24170 -19795 -53809 -4981 35450 22945 31351 62351 58965 25183
1197 25183 -14646 -79340 -101929 -76685 -53346 -32853 -576 1702 -25549 -27886 -23368 -23148 4184
1184 4184 41277 45475 28832 49623 62734 61769 65806 80264 52321 20131 -10225 -58728 -48084
1171 -48084 -23374 -29836 -34365 -29014 -16817 -8878 9593 -1144 -20637 -32456 -26953 -26790 -16551
1158 -16551 -20050 -23046 876 2522 -4629 24295 33948 3022 -8758 -13359 -18237 -25811 12947
1145 12947 54439 62931 50328 26588 5473 15495 34263 14366 -21209 -13444 10343 -14795
1133 -14795 -50340 -34946 8494 18100 26900 25932 8377 21009 12634 36267 54320 75749 34887
1120 34887 -1832 1478 -7232 -25015 -46988 -13455 35603 8405 -36539 -25838 -32838 -57882
1108 -57882 -25339 -39215 -30557 10584 76892 71001 39670 58539 66534 51273 -9919 -30400
1096 -30400 -13182 11446 -5602 -31201 -29379 15860 24762 24665 44161 37281 41719 38615 76009
1083 76009 57495 45962 55872 28650 -887 -6457 14463 14735 -25616 -60020 -60789 -36854 31763
1070 31763 18521 23808 45368 34890 -6255 -6647 6966 -22809 -22382 35773 147 6785 23801
1057 23801 23976 11110 -12423 870 11742 6913 35618 17919 16703 8640 -11917 -33303 -20212
1044 -20212 890 -32782 -47689 -18724 39897 69632 77629 91869 94993 24935 19217 32066
1032 32066 22034 5590 -11520 -26286 -31610 -38047 -27202 -10493 -19726 -33200 -27798 6435 26755
1019 26755 27725 1028 18308 58290 90804 78456 19099 7116 2503 -11202 -2476 3638 14519
1006 14519 23280 -2574 -20181 -17765 -25231 -49362 -48317 -29694 -13056 39958 48571 67757 60237
993 60237 60021 13765 -16600 -16549 -25413 -13025 -14794 12397 5375 -3770 31607 54932 37505 3425
979 3425 -31110 -47972 -39155 -59598 -50063 9709 30264 18122 7770 83457 68797 39207 23383
966 23383 -12922 1260 -9709 -3548 12583 -29009 -71290 5056 60905 57267 43413 26799
954 26799 18251 35886 35057 31390 35428 44839 95923 88541 88805 96621 87410 70168 42866 18594
940 18594 -15355 -22452 -46879 -19074 -41606 -48337 -41318 -23403 -29649 -23333 5319 19981 -12492
927 -12492 -36167 -44650 4718 -7444 -1514 28893 53072 56785 25549 -7012 -27490 -24089 23268
914 23268 16256 29630 12065 13904 59820 72806 54055 42963 22543 -28055 -60331 -55870 -18764
901 -18764 10842 3419 3828 -27598 -38279 -33360 -23783 -24132 -9123 14991 12405 13898 -17021 -11963
887 -11963 6452 -26020 -9751 -690 22079 16345 12668 10397 15860 54438 68516 48188 60621
874 60621 26336 13224 13043 13693 -1049 -12392 4550 12684 -18595 -38040 -26928 -12597 -6637
861 -6637 -4079 12285 18814 2081 -28994 -35689 -35261 -27099 -3907 12382 -10942 -75769 -54459
848 -54459 13862 45744 22209 -554 33773 29980 10762 -11539 -20435 -19600 -17168 18284 1130
835 1130 -51312 -31192 -13187 12920 -425 -45413 -31417 -16312 -13086 -31932 -30145 -16455 -14848
822 -14848 -24476 -18868 -5905 -19987 -25707 13689 18765 20053 40674 20948 30420 54400 40060
809 40060 10671 32473 35924 8055 -18512 -16957 -7589 36527 20703 27437 9093 -3883 -10691
796 -10691 748 7576 21791 36898 51955 67672 78304 71084 48848 68662 59579 37586 38588
783 38588 39433 47190 80741 103825 52369 1344 -1757 -30873 -42019 -5436 -12562 -2246 13258
770 13258 27328 56987 27312 9941 24944 22666 28147 25471 45769 48885 67596 68279 30679
757 30679 -31389 -39088 -9787 30342 19685 9415 -3605 9604 -25980 -13384 -25770 -40661
745 -40661 -2440 -14581 -38934 -19382 -15227 -8934 26412 66708 80776 77425 43681 29432 15298
732 15298 -1220 10440 -17516 -16382 5426 -28083 -35568 -53423 -39126 -2741 65789 88936
720 88936 87974 21162 10472 -24877 -56038 -26216 26583 18810 28355 45439 66776 48380 23012
707 23012 16167 29614 21177 2403 -15437 -44402 -6041 34563 41292 -12088 12254 11288 -10717
694 -10717 -17076 -12355 19524 43827 33331 34569 69527 92550 82014 26058 -7653 -50242 -50176
681 -50176 -43817 -56321 -35790 -26567 11450 8172 22709 15636 -148 19373 30453 34383 57855
668 57855 24913 15419 26609 46671 88441 63396 41384 22947 30645 42525 19255 3376
656 3376 -41420 -54041 -24551 8057 26131 21601 30918 15078 -1331 25097 9618 10989 25329
643 25329 15983 7212 16505 17894 9921 36799 38164 39642 18598 -5800 -20514 -1332 15686
630 15686 -3373 -19326 -17562 42622 58470 47724 39732 50958 12631 -5557 16338 12318 -29647
617 -29647 -62446 -15421 57307 71542 13114 -18983 17222 24366 3867 -8724 -36671 -42534
605 -42534 -78807 -72134 -17256 -20834 8181 25837 15446 5550 19862 36305 39560 87644 100222
592 100222 49732 50931 125729 151191 150547 101231 59920 33665 43820 17543 21341 54301 71323
579 71323 50391 32844 8098 -24611 31054 55915 28011 28428 51868 54458 23227 16900 11975
566 11975 -44613 -51192 -67448 -70109 -50765 -36564 -64833 -80102 -60872 -4732 38089 57541
554 57541 38674 34087 62136 80084 48519 38916 50139 60518 46970 11976 26125 73126
542 73126 66767 38555 49219 -5337 5807 60850 55982 42602 63220 99481 36128 -4626
530 -4626 -16099 341 -4348 15067 50398 68378 70814 40936 31167 29483 14744 39055 69720
517 69720 79002 41503 -8422 19928 27900 25085 -9696 -19066 -14053 -11506 -11922 -16465 6260 30805
503 30805 6526 3399 -5530 -3426 7723 53813 63350 62682 34631 23902 32607 22329 22737 57751
489 57751 49257 37740 28970 -5185 19745 22211 32722 11576 17402 19233 46084 60720 72
476 72 -35053 -50731 -41551 -25651 -35413 -24630 -28796 -46384 -38377 -47468 -21265 7883 25182 24386
462 24386 -29965 -41288 5108 65557 37852 -11173 -43028 -35619 4227 11899 -25523 -33808 -25097
449 -25097 -32866 -38712 2272 30117 40376 17549 -4560 -16520 -16384 30553 72524 70620 63579
436 63579 72155 85450 81319 49694 57996 86667 83598 26274 -1980 -7353 2198 -13138 -67098
423 -67098 -63010 -13995 1643 18041 42902 20732 17554 25596 3464 -1505 -45435 6108 7829
410 7829 -31703 -43823 -54626 -35099 -49489 -39366 970 11622 27113 14017 1891 -10298
398 -10298 -16785 -43237 -31621 20942 57663 48265 43821 1658 8596 49227 48758 27938 23943
385 23943 15312 41669 60518 57769 11272 -10248 -1676 -22946 -18249 -20980 -17763 -2524 13041
372 13041 66618 75321 40034 -15060 -10333 13142 15110 2570 -88 -2948 2095 35403 34886 10106
358 10106 2644 4110 -11920 -23762 -48723 -42139 -17618 -28866 -30258 -34088 -28638 18979 17617
345 17617 -19934 -29412 -4509 -3402 -18688 -37286 -28992 -40257 -10107 -24129 -29216 4581 9469
332 9469 -1753 29704 18484 -30989 -13129 13237 -25941 -61970 -64984 11440 42849 15825
320 15825 12379 -1903 9256 18108 4401 18754 28250 17224 35200 63870 57463 62510 33136
307 33136 -1894 10371 43140 59709 60028 68928 84624 47491 41896 38299 6055 13200 59068
294 59068 57507 48618 53745 5957 -17655 -23919 15043 48553 -3716 -17296 2313 35711 25687
281 25687 20844 1852 -10977 -21590 -31137 -5277 29399 43896 49488 54568 51046 43316 33769
268 33769 -9458 6077 16162 5298 19364 33941 45322 49155 50266 46963 77177 56954 16171
255 16171 -6981 -27862 -28009 12660 28647 -13929 -27982 -11080 -21358 -50823 -45343 -20554 4677
242 4677 27673 36793 25806 19503 -3071 24203 4756 -46574 -59256 -28924 29160 32345 23928
229 23928 16988 30058 54943 58040 80015 70225 75150 58027 35402 44842 64358 15166 7315
216 7315 35469 37137 8603 15704 24206 24816 49185 53866 39580 44045 21676 -13371 -16245 -19071
202 -19071 -21896 -8916 15406 -11570 -38059 -5884 33158 51822 47604 43233 32302 11605 -25303
189 -25303 -23523 -28070 -5077 -21818 -19117 5654 12354 13238 -7703 4208 31737 11050 -4618
176 -4618 -18849 -19052 -21709 -23896 -14477 -22996 19788 15965 2845 -5203 -11649 6184 29380 44400
162 44400 15295 8578 9628 21764 7294 6650 4228 9595 8598 -15102 -32098 290 35628 58681
148 58681 53143 44734 35571 19005 6986 -4303 -2204 26255 25370 5763 -7478 -14727 -19335 1301
134 1301 21240 64188 59652 61308 58142 62629 7059 16353 -2330 -24570 -8963 -28279 -65137
121 -65137 -66232 -63877 -43335 -2755 -9118 -9839 -14199 9289 -7343 4438 22769 20060 20496 34061
107 34061 18037 16729 -6927 3468 25321 19131 1605 -9039 709 3272 40324 32815 9420
94 9420 -45462 -49640 -15490 730 24206 47684 5599 -23152 -8400 -22409 -42986 -23069 -23958
81 -23958 -14984 -31700 -12571 18701 34349 28917 4351 -26020 -36962 -37077 -46899 -15096 -2087
68 -2087 -3548 -13114 -7194 -1469 -3329 908 27566 8995 -4857 -4809 -7383 1150 36357 35265 8264
53 8264 5748 7759 4177 14680 12182 -11195 -13244 -1458 14676 39764 43242 49201 32372 30587
39 30587 48654 47277 15529 32468 45618 38292 31336 25646 22596 12701 20912 13295 18651 41591
25 41591 44186 41227 52931 59084 41387 35524 47130 24963 -10649 -29899 -27710 -32196 -21472
12 -21472 -41337 -33012 -8797 9011 21510 47101 16452 -8246 -13701 -27014 -42209 -43528
0 -43528
$$ Imaginary data points
##PAGE= N=2
##DATA TABLE= (X++(I..I)), XYDATA
32767 40383 37200 41932 33487 27041 50531 43445 57815 80898 67022 37702 40662 41065 57501
32754 57501 38008 30827 30454 -1727 -10964 -8979 13395 35357 59978 44893 39120 41254 51852
32741 51852 85964 84267 57842 61100 68630 67956 51974 75916 113299 82320 50473 60589 56358
32728 56358 57490 67619 75169 60683 59461 58526 55856 38002 24657 45930 56332 52272 39361
32715 39361 62561 68598 58133 69739 72142 70863 87968 82612 59293 41100 52366 50105 35938
32702 35938 38629 29874 72543 92878 93303 78177 67989 75944 61251 59761 72622 84650 75405
32689 75405 80679 76600 63995 69013 77995 87242 87077 90418 80221 105989 129468 114599 100803
32676 100803 92355 93937 113527 124822 111101 108106 117032 96938 55483 50831 71002 73161 81789
32663 81789 67945 46385 73979 91331 89047 100479 108894 113916 105893 109902 77638 78872 124338
32650 124338 166798 167678 158040 151841 146767 116725 114958 126081 131965 119798 121631 143682 138196
32637 138196 117040 121759 126881 123147 150902 137122 106090 144945 178688 189685 158308 169576
32625 169576 166645 136940 137825 110396 127017 144372 174921 186246 179843 171333 150431 118573
32613 118573 111583 133930 139107 133917 117034 98497 85183 110089 142960 149117 155959 163563 136207
32600 136207 138676 134643 152097 188095 187442 178586 165746 183295 196890 180947 164683 172117 189572
32587 189572 193762 170330 182694 225264 227847 209571 177746 154032 152379 170466 162746 165176
32575 165176 174657 173473 170887 182971 186824 230279 223158 248759 255548 218838 178176 165719 189626
32562 189626 179858 180010 242961 278478 262053 249391 227499 177319 139484 178388 186104 200129
32550 200129 196954 178593 192191 222928 230880 215846 212758 203544 203924 219261 257291 236310 248324
32537 248324 248142 215990 214743 215124 210437 223443 234697 214651 191785 182806 150208 179284 211957
32524 211957 232885 262966 245303 241466 234245 211094 235358 264558 261874 217793 178793 165767
32512 165767 202241 218047 259682 248871 238939 211101 213502 191855 172625 176046 134782 126519
32500 126519 146338 147736 182922 176903 205857 230411 258606 279874 261802 247489 232300 231340
32488 231340 250554 259379 259252 285083 278558 266851 224148 195952 180949 205357 233830 248137
32476 248137 240512 252934 284227 252714 239480 247604 245330 229985 224445 239064 245137 274765
32464 274765 249100 233331 263441 245355 259226 256543 251633 230423 242414 252718 236098 242936
32452 242936 273923 273433 298885 287199 302216 291011 282198 307490 360778 371488 342625 283032
32440 283032 215341 174580 187274 242414 287805 310475 309348 308362 278710 277520 294508 300532
32428 300532 254307 219320 219126 225230 223236 219623 243115 259243 275614 268291 269963 285212 290039
32415 290039 249543 210935 242896 271539 240176 228730 243467 232670 209053 216390 223343 232895
32403 232895 268492 236547 204726 191147 195446 211811 198765 171849 195877 252162 276459 285182
32391 285182 285150 289086 315484 289017 307481 341870 318672 288880 297106 334583 324892 299099 300737
32378 300737 313123 310364 331063 331701 334901 314678 334781 309153 245992 272038 282598 293019
32366 293019 287304 280308 292977 303830 312809 315437 328341 319589 320631 310393 311301 311956 309600 305006
32352 305006 297403 282436 303707 325170 332783 307127 304600 298932 279812 282875 275238 260208 262597
32339 262597 255569 238832 224071 247642 235471 235785 226532 267356 293313 337941 325416 269589
32327 269589 263099 254683 286993 272345 290423 318280 338014 358825 371055 398079 397945 339629
32315 339629 311228 325750 338385 307959 280618 302921 332180 333904 287113 229992 209781 228575
32303 228575 226392 252223 220020 215560 229746 243372 268904 322357 309799 270776 227514 214028
32291 214028 232506 217966 219428 259011 302290 303690 271251 264244 274333 262666 188867 192286
32279 192286 245276 254889 262381 265709 286533 322067 316670 277556 255488 263399 286334 330645
32267 330645 340293 338435 301723 316123 307089 296418 317504 324252 337537 371779 331467 290263
32255 290263 272260 277634 278678 281558 287962 289258 231999 211208 246627 299626 338230 329570 332119
32242 332119 318727 311214 314084 295105 282866 261998 260653 260007 261927 294439 315954 289767 270748
32229 270748 271727 320603 339430 309209 293519 278474 285551 316101 327497 331073 327215 335817 339769
32216 339769 355118 357168 362466 354984 356428 316387 284488 260034 282615 265392 267259 232452
32204 232452 231203 262041 284039 322579 352563 325540 359993 377831 351455 368604 390869 392347
32192 392347 394786 406281 379403 357846 312331 284538 286379 320980 282658 230276 238750 252114
32180 252114 237260 234360 237407 265908 321047 343729 319159 300571 246370 243621 248159 253712
32168 253712 268907 308360 353447 364470 328754 323991 343674 313451 290681 278895 277717 265880
32156 265880 303930 316447 309420 330007 318247 300993 312290 315183 307010 335471 328468 306258
32144 306258 307698 334715 303395 297032 288020 285910 280392 227301 201109 252551 282491 283874 292996
32131 292996 288586 289963 294417 256720 233621 237573 267385 302476 286594 283677 313369 347383
32119 347383 323233 306588 320883 324116 351583 304903 257275 252522 290129 319466 307664 292759
32107 292759 300444 292404 262636 261941 302622 326943 320103 329524 334312 344076 350903 319817 325475
32094 325475 317945 304127 308713 306510 291540 310854 308029 277938 298541 334189 319865 316617
32082 316617 311196 322094 319212 289149 268615 281956 314016 345716 345421 311425 337353 365427
32070 365427 388453 358990 319510 312034 339870 345733 342045 326720 316184 337783 333033 333541 335632
32057 335632 343665 353529 347226 323447 337210 365952 360459 341540 328550 333861 326818 313080 328474
32044 328474 309428 311093 361302 339689 336585 312949 314409 323436 321953 312770 340437 328911 286242
32031 286242 278870 323786 348764 355698 341140 341669 358421 352463 357235 355838 288813 274680 323827
32018 323827 332490 315512 314075 336843 311401 266214 266379 265748 247347 243017 261960 263147 273885
32005 273885 268193 275884 259336 247423 274503 271385 263601 264434 289697 279655 314796 320734 306807
31992 306807 306794 300283 271414 281600 293439 291069 293558 271948 287010 298233 283191 303343 314703
31979 314703 329795 285163 229516 238116 278181 320448 320372 314659 293693 286318 300131 289608 306232
31966 306232 286815 254365 250130 266156 267862 241843 227687 247612 329730 365883 369013 368268
31954 368268 366142 355916 331933 294477 312061 318341 296295 264686 228252 262492 295257 247617
31942 247617 225540 267384 271968 242898 264694 314350 340872 322616 297321 298177 284287 274268
31930 274268 285481 282113 282831 312649 292683 238953 197920 210708 237688 275505 283210 267621
31918 267621 286539 281835 258206 257195 284741 323305 264378 272698 281351 258641 257953 259997 283233
31905 283233 306971 300675 325304 297310 255984 274507 302935 334489 365372 386531 381756 368282
31893 368282 325388 274146 271360 322354 325549 319183 312194 319423 336995 354970 328091 332335 316373
31880 316373 302526 333345 361309 380526 333999 294892 271065 288397 263461 262633 290136 319739
31868 319739 341252 349174 317566 276494 332036 351078 341391 315790 286277 280013 310671 338686
31856 338686 333596 341162 319381 301990 287539 276784 281700 354614 388883 363768 387483 418736
31844 418736 396459 340854 279954 233944 219450 214282 230054 250857 288625 314463 348809 325357
31832 325357 324595 362343 339161 296666 262472 257492 316817 356616 319933 298946 301182 339138
31820 339138 323017 326298 324353 284610 264334 294104 315775 309844 313052 376433 394309 356077
31808 356077 282518 284497 314181 334110 267134 257908 245958 270238 300982 321058 321096 317743 299083
31795 299083 307977 330561 310055 298191 290804 287894 292668 273512 271512 275483 279732 292833 335642
31782 335642 395572 380777 328056 322905 326748 326817 275848 217188 253812 296602 307126 310051 322415
31769 322415 295620 330821 332037 338771 341799 370434 371524 336384 337981 283223 214732 239508
31757 239508 275929 284541 242333 230240 248586 253263 258721 230518 256254 241163 255435 273800
31745 273800 293082 273287 260389 242390 195993 208935 246982 271053 321591 338595 294366
31734 294366 273820 284699 290908 297870 255620 245044 257092 286870 312914 321618 314665 325843
31722 325843 357705 362918 300959 278305 255014 278897 279189 298964 282932 275582 240750 239264
31710 239264 260754 281884 301095 280435 316152 318758 350384 357732 378046 389750 378491 333366
31698 333366 285980 304173 319600 340114 336915 332278 317685 295396 283570 277679 254513 257067
31686 257067 248077 204267 208196 239069 253065 272474 325720 337976 297896 238171 228899 235327
31674 235327 227137 236657 235710 250286 303835 347762 332941 291456 263736 272502 302584 351215
31662 351215 334486 301123 315019 296680 295214 307051 279290 296780 326694 328718 341876 320701
31650 320701 318240 329844 327753 320953 294927 288297 303118 290243 348900 364065 345136 342122
31638 342122 345729 304727 273294 306371 300969 283554 273294 265720 295157 307051 347503 360266
31626 360266 330452 305405 293401 318472 338387 336610 297624 292085 309101 310903 278043 303425
31614 303425 297947 314073 310664 301118 338956 358983 348689 334502 328419 320730 312124 325036 302218
31601 302218 301216 263574 227943 240481 305748 304063 288304 299949 291385 312085 357849 423725
31589 423725 387798 336830 295051 241030 251352 330706 336292 314428 324029 333911 354699 328935
31577 328935 277613 238578 220414 223824 250954 282778 241913 250925 269128 284857 347458 354161
31565 354161 362589 354589 331135 327510 316603 285651 300178 292072 292377 302316 325271 352063 374070
31552 374070 361321 318054 280867 243198 268438 288205 250307 264989 322033 341790 352991
31541 352991 323768 279471 237363 260051 265588 260212 260757 260728 283587 287425 283002 319041 383191
31528 383191 409169 367076 344389 331361 313245 337405 319615 330482 324188 298091 261833 308496
31516 308496 387093 361451 302776 290172 312265 312690 344985 402232 362243 328810 312029 328036
31504 328036 323931 293006 302932 346021 317704 328599 317216 297325 305894 319297 311573 296711
31492 296711 257306 224004 274379 318299 314631 263424 235038 275875 327505 307631 252665 237799
31480 237799 276186 297685 308406 321457 345447 328301 338649 368953 381938 359880 314922
31469 314922 294684 337945 374051 329894 284949 321632 310401 283003 308226 370767 377461 410216
31457 410216 431450 381159 343474 333593 316136 324935 314432 304098 308900 301432 257300 237627
31445 237627 254682 308521 305822 306932 308837 298524 313263 319520 290572 305486 322130 340660
31433 340660 300031 278525 295718 303902 291085 303338 321603 373335 364830 350930 367944 335043
31421 335043 349206 332183 311711 342634 366215 357409 336311 322527 316669 305135 307242 292883
31409 292883 291624 285345 307475 311335 283059 271481 271302 250616 249107 300747 305969 262482 264271
31396 264271 275718 243140 275901 318144 345704 327962 309521 310733 317413 320273 286846 284196
31384 284196 321492 316121 286356 238944 207794 250377 263528 280096 280988 312033 318775 304551
31372 304551 295246 328395 367189 326985 303435 245504 218059 238076 264292 290747 302932 325522
31360 325522 357274 392790 375484 327269 304871 346102 330865 356455 361960 368747 379451 399473
31348 399473 400455 360790 334804 278358 233735 263624 280812 274389 307717 306070 294590 290740
31336 290740 270722 294125 306027 304608 335661 380959 382244 380893 362010 311851 306180 306328 325014
31323 325014 353094 344901 362806 349244 309715 324126 294286 292810 314908 302735 289995 337324
31311 337324 333083 318150 321936 337573 373048 415671 366462 351928 379778 380352 381295 371820 341778
31298 341778 321647 361881 440902 437220 385671 411490 419559 429619 401553 334079 314135 316062
31286 316062 298980 281536 287822 302112 358785 388978 350596 346716 318213 349753 335920 339336
31274 339336 373167 364048 356079 325872 290368 273925 268559 252565 269046 303928 308327 301105
31262 301105 268567 274049 293957 259390 265580 286693 250897 231111 209062 226190 267115 311205
31250 311205 312647 320294 326858 349097 311342 275871 273446 339679 326846 313353 291786 285188
31238 285188 274128 298732 310555 298026 279345 305721 322323 374830 407365 413803 416437 400343
31226 400343 349561 296422 259633 275572 229941 182905 223990 298895 337332 352893 353398 309873
31214 309873 302491 303922 314400 320331 327551 316699 301119 296836 290252 302719 317358 334502 312849
31201 312849 294622 299317 318730 345970 379662 364100 380386 380241 336787 313525 323888 338296
31189 338296 303053 317905 318293 337040 350244 346378 322109 307021 285991 265033 255340 260655
31177 260655 304350 314843 310419 319170 299205 294892 326184 352884 335205 322102 334662 350113
31165 350113 376058 384826 340192 317641 315618 306821 329160 343032 327682 338871 329356 301075
31153 301075 259690 263695 263062 273100 304280 275026 227790 256399 298947 292761 302839 325240
31141 325240 320625 341462 326607 314552 333545 347326 330315 290894 285054 290026 296713 316866
31129 316866 337987 348828 340693 338750 352239 380766 391697 378083 351089 315458 270164 275701
31117 275701 286537 244823 288721 335863 354984 363258 397224 392971 373369 356431 329978 351523
31105 351523 335568 367212 379972 400453 392791 381659 381937 337397 334253 350276 359948 372566
31093 372566 354633 334873 338546 377806 394725 369750 353295 301795 291673 318344 340234 319964
31081 319964 286547 247262 233664 277770 297879 327309 315417 307233 340587 367542 348491 313838
31069 313838 330706 383977 404130 366891 332127 318753 334057 340110 332553 332036 348291 363550
31057 363550 388838 338649 319190 282533 269591 261058 256662 267826 322928 363332 384735 370440
31045 370440 364992 392086 376439 316625 273876 258088 250800 286664 302741 285096 289636 293860
31033 293860 282394 243363 238196 239322 269245 273677 291463 299735 303834 324543 345656 360880
31021 360880 346139 330736 313589 310617 310525 277234 273154 308897 321270 319521 317941 332308 336976
31008 336976 276341 226661 265094 294168 293198 288828 367001 378310 334981 316311 320193 310031
30996 310031 324658 299255 278554 296763 315283 316004 314209 316695 334368 357414 320751 322098
30984 322098 313664 301090 314726 366460 372768 379940 394893 380678 346246 357325 315095 291668
30972 291668 331536 324685 309144 308073 319370 273283 272201 291825 295371 344021 332664 319712
30960 319712 325185 342940 320866 321254 306673 291621 278597 289993 320957 315152 317052 326507 309256
30947 309256 306337 295841 278208 279835 285206 329769 306598 275016 294561 331788 330790 328233 310084
$$ [...]
##END NTUPLES=NMR SPECTRUM
##END=
