##TITLE=Analysis number 312981
Compound Code cc 18401
Project Code adrs
Chemist Name endeavour
##JCAMPDX= 6.0         $$ Bruker NMR JCAMP-DX V2.0
##DATA TYPE= NMR SPECTRUM
##DATA CLASS= NTUPLES
##ORIGIN= Bruker BioSpin GmbH
##OWNER= NMR
$$ XWIN-NMR		Version 3.5
$$ Mon Aug 22 13:10:20 2005 GMT Daylight Time (UT+1h)  MAYBRIDGE\NMR@NMR_250MHZ
##.OBSERVE FREQUENCY= 250.131544655141
##.OBSERVE NUCLEUS= ^1H
##.ACQUISITION MODE= SIMULTANEOUS (DQD)
##.ACQUISITION SCHEME= undefined
##.AVERAGES= 16
##.DIGITISER RES= 18
##SPECTROMETER/DATA SYSTEM= dpx250
##.PULSE SEQUENCE= zg30
##.SOLVENT NAME= DMSO
##.SHIFT REFERENCE= (INTERNAL, DMSO, 0, 16.522)
##AUDIT TRAIL= $$ (NUMBER, WHEN, WHO, WHERE, WHAT)
$$ ##TITLE= Audit trail, XWIN-NMR		Version 3.5
$$ ##JCAMPDX= 5.01
$$ ##ORIGIN= Bruker BioSpin GmbH
$$ ##OWNER= NMR
$$ C:\u/data/dgb/nmr/ADRS/8300/pdata/1/auditp.txt
$$ ##AUDIT TRAIL=  $$ (NUMBER, WHEN, WHO, WHERE, WHAT)
(   1,<2005-08-22 13:10:01.35 +100>,<MAYBRIDGE\NMR>,<NMR_250MHZ>,
      <created by zg, POWCHK disabled, PULCHK disabled
       configuration hash MD5:
       62 19 C7 07 E1 42 D1 B7 37 6C 3D D0 77 39 F9 E6
       data hash MD5: 64K
       91 6E 2B 42 B0 13 C4 3A 92 43 69 CF 54 5A 1B AF>)
(   2,<2005-08-22 13:10:12.91 +100>,<MAYBRIDGE\NMR>,<NMR_250MHZ>,
      <Start of raw data processing
       ef LB = 0.3 FT_mod = 6 PKNL = 1 SI = 32K 
       data hash MD5: 32K
       65 AD 50 BA 1C 63 67 A0 6D AC 39 1C 39 84 C2 BE>)
(   3,<2005-08-22 13:10:14.63 +100>,<MAYBRIDGE\NMR>,<NMR_250MHZ>,
      <apk 
       data hash MD5: 32K
       9E C7 EE 5A CF C9 AC 56 5D EC 0E A5 CF BB 0B 16>)
(   4,<2005-08-22 13:10:15.30 +100>,<MAYBRIDGE\NMR>,<NMR_250MHZ>,
      <abs ABSG = 5 
       data hash MD5: 32K
       3C AD C4 72 A0 E1 F3 C8 90 53 65 32 60 FE CD 3D>)
$$ ##END=
$$ 
$$ hash MD5
$$ BA 9A C6 B2 51 89 51 7C A8 4D 08 D6 34 68 90 82
##$RELAX= 
##$RELAX= 
##$RELAX= 
##$RELAX= 
##$RELAX= 
##$RELAX= 
##$RELAX= 
$$ Bruker specific parameters
$$ --------------------------
##$DU= <C:\u>
##$EXPNO= 8300
##$NAME= <ADRS>
##$PROCNO= 1
##$TYPE= <nmr>
##$USER= <dgb>
##$AMP= (0..31)
100 100 100 100 100 100 100 100 100 100 100 100 100 100 100 100 100 100 
100 100 100 100 100 100 100 100 100 100 100 100 100 100 
##$AQSEQ= 0
##$AQ_mod= 3
##$AUNM= <au_zg>
##$AUTOPOS= <16 >
##$BF1= 250.13
##$BF2= 250.13
##$BF3= 250.13
##$BF4= 250.13
##$BF5= 500.13
##$BF6= 500.13
##$BF7= 500.13
##$BF8= 500.13
##$BYTORDA= 1
##$CFDGTYP= 0
##$CFRGTYP= 5
##$CHEMSTR= <none>
##$CNST= (0..31)
1 1 145 1 1 1 1 1 1 1 1 1 1 1 1 1 1 1 1 1 1 1 1 1 1 1 1 1 1 1 1 1 
##$CPDPRG= <>
##$CPDPRG1= <>
##$CPDPRG2= <>
##$CPDPRG3= <>
##$CPDPRG4= <mlev>
##$CPDPRG5= <mlev>
##$CPDPRG6= <mlev>
##$CPDPRG7= <mlev>
##$CPDPRG8= <mlev>
##$CPDPRGB= <>
##$CPDPRGT= <>
##$D= (0..31)
0 1 0 0 0 0 0 0 0 0.06 0 0 0 0 0 0 0.0002 0 0 0 0 0 0 0 0 0 0 0 0 0 0 
0 
##$DATE= 1124712600
##$DBL= (0..7)
120 120 120 120 120 120 120 120 
##$DBP= (0..7)
150 150 150 150 150 150 150 150 
##$DBP07= 0
##$DBPNAM0= <>
##$DBPNAM1= <>
##$DBPNAM2= <>
$$ [...]
##$SUBNAM7= <"">
##$SUBNAM8= <"">
##$SUBNAM9= <"">
##$SW= 20.6930455092707
##$SWIBOX= (0..15)
0 0 3 0 0 0 0 0 0 0 0 0 0 0 0 0 
##$SW_h= 5175.983436853
##$TD= 65536
##$TD0= 1
##$TE= 295.16
##$TE2= 300
##$TE3= 300
##$TEG= 300
##$TL= (0..7)
0 120 120 120 120 120 120 120 
##$TP= (0..7)
150 150 150 150 150 150 150 150 
##$TP07= 0
##$TPNAME0= <>
##$TPNAME1= <>
##$TPNAME2= <>
##$TPNAME3= <>
##$TPNAME4= <>
##$TPNAME5= <>
##$TPNAME6= <>
##$TPNAME7= <>
##$TPOAL= (0..7)
0.5 0.5 0.5 0.5 0.5 0.5 0.5 0.5 
##$TPOFFS= (0..7)
0 0 0 0 0 0 0 0 
##$TUNHIN= 0
##$TUNHOUT= 0
##$TUNXOUT= 0
##$USERA1= <user>
##$USERA2= <user>
##$USERA3= <user>
##$USERA4= <user>
##$USERA5= <user>
##$V9= 5
##$VALIST= <valist>
##$VCLIST= <CCCCCCCCCCCCCCC>
##$VD= 0
##$VDLIST= <DDDDDDDDDDDDDDD>
##$VPLIST= <PPPPPPPPPPPPPPP>
##$VTLIST= <TTTTTTTTTTTTTTT>
##$WBST= 1024
##$WBSW= 4
##$XGAIN= (0..3)
0 0 0 0 
##$XL= 0
##$YL= 0
##$YMAX_a= 310575
##$YMIN_a= -253553
##$ZGOPTNS= <>
##$ZL1= 120
##$ZL2= 120
##$ZL3= 120
##$ZL4= 120
##$ABSF1= 16.522
##$ABSF2= -4.171173
##$ABSG= 5
##$ABSL= 3
##$ALPHA= 0
##$AQORDER= 0
##$ASSFAC= 0
##$ASSFACI= 0
##$ASSFACX= 0
##$ASSWID= 0
##$AUNMP= <proc_1d>
##$AZFE= 0.1
##$AZFW= 0.1
##$BCFW= 0
##$BC_mod= 0
##$BYTORDP= 0
##$COROFFS= 0
##$CY= 12.5
##$DATMOD= 1
##$DC= 0
##$DFILT= <>
##$DTYPP= 0
##$F1P= 14.0000005364418
##$F2P= -0.99999901652339
##$FCOR= 0.5
##$FTSIZE= 32768
##$FT_mod= 6
##$GAMMA= 0
##$GB= 0
##$INTBC= 1
##$INTSCL= 1
##$ISEN= 128
##$LB= 0.3
##$LEV0= 0
##$LPBIN= 0
##$MAXI= 10000
##$MC2= 0
##$MEAN= 0
##$ME_mod= 0
##$MI= 0
##$NCOEF= 0
##$NC_proc= -5
##$NLEV= 6
##$NOISF1= 0
##$NOISF2= 0
##$NSP= 0
##$NTH_PI= 0
##$NZP= 0
##$OFFSET= 16.522
##$PC= 1
##$PHC0= -86.76233
##$PHC1= 9.293319
##$PH_mod= 1
##$PKNL= yes
##$PPARMOD= 0
##$PSCAL= 4
##$PSIGN= 0
##$REVERSE= no
##$SF= 250.13
##$SI= 32768
##$SIGF1= 0
##$SIGF2= 0
##$SINO= 400
##$SIOLD= 32768
##$SREGLST= <1H.DMSO>
##$SSB= 0
##$STSI= 32768
##$STSR= 0
##$SW_p= 5175.98343685301
##$SYMM= 0
##$S_DEV= 0
##$TDeff= 65536
##$TDoff= 0
##$TI= <Analysis number 999999
Compound Code 99
Book Reference 9
Project Code 9>
##$TILT= no
##$TM1= 0
##$TM2= 0
##$TOPLEV= 0
##$USERP1= <user>
##$USERP2= <user>
##$USERP3= <user>
##$USERP4= <user>
##$USERP5= <user>
##$WDW= 1
##$XDIM= 32768
##$YMAX_p= 360645513
##$YMIN_p= -814461
$$ End of Bruker specific parameters
$$ ---------------------------------
##NTUPLES= NMR SPECTRUM
##VAR_NAME=  FREQUENCY,     SPECTRUM/REAL,   SPECTRUM/IMAG
##SYMBOL=    X,             R,               I
##VAR_TYPE=  INDEPENDENT,   DEPENDENT,       DEPENDENT
##VAR_FORM=  AFFN,          ASDF,            ASDF
##VAR_DIM=   32768,         32768,           32768
##UNITS=     HZ,            ARBITRARY UNITS, ARBITRARY UNITS
##FACTOR=    0.157963299565203, 1,           1
##FIRST=     4132.6476996994, 0,             0
##LAST=      -1043.33573715361, 0,           0
##MIN=       -1043.33573715361, -814461,     0
##MAX=       4132.6476996994, 360645513,     0
$$ Real data points
##PAGE= N=1
##DATA TABLE= (X++(R..R)), XYDATA
$$ [...]
$$ plain form
24434 150060 126351 73093 -31468 -29367 -26894 -6938 -13585 7129 179942 282934 52930
24423 52930 -26081 88773 81177 -30110 37294 -8043 -134906 -81703 -65027 -118359 91601
24412 91601 155540 312672 143874 90581 -65550 -67460 108409 103070 -57070 -224439 -427111
24401 -427111 -196828 -316857 -256041 12493 -226932 -275904 -69399 -44605 -40298 -156248
24391 -156248 -165898 -351930 -501229 -372115 -276501 -203653 -366958 -199899 59375 115625
24381 115625 -70525 -160412 -39992 -3464 -191134 -295250 -206799 -74294 -125460 -253552
24371 -253552 -334943 -397941 -465559 -362714 -248132 -221693 -183673 -76774 -244504 -131068
24361 -131068 -2413 119495 -42619 -177057 -66619 -35684 -182646 -244651 -54319 130848
$$ packed form
24434A50060k3709n3258j04561K101K473J9956o647K0714J72813J02992k30004
24423E2930p9011J14854p596j11287O7404m5337j26863N3203J6676n3332K09960
24412I1601O3939J57132j68798n3293j56131j910J75869n339j60140j67369k02672
24401d27111K30283j20029O0816K68534k39425m8972K06505K4794M307j15950
24391a56248r650j86032j49299J29114R5614P2848j63305J67059K59274N6250
24381A15625j86150q9887J20420L6528j87670j04116Q8451J32505n1166j28092
24371b53552q1391o2998o7618J02845J14582K6439L8020J06899j67730J13436
24361a31068J28655J21908j62114j34438J10438L0935j46962o2005J90332J85167
$$ plain form
24351 130848 200169 -23460 -227053 -357821 -433274 -490266 -321833 -122986 -110984 -63048
24341 -63048 -127496 -362298 -181298 -43216 -58856 -109763 -130200 -78924 -115780 -154475 113726
24330 113726 339719 405547 410836 365430 374823 216949 -13084 -114972 64141 195569 201596
24319 201596 -77824 -112786 -141277 -96340 119204 105921 -108327 -53827 127459 26128
24309 26128 -11531 77685 -51287 -102017 -67422 1381 -100675 -173297 -149503 -14074 29533
24298 29533 -142602 -129893 -291370 -197655 107045 373286 152783 129435 59259 135449 161706
24287 161706 -128930 -227521 -165297 187411 288903 170289 158783 64365 259536 493924
24277 493924 288903 99116 26546 6469 37888 249539 376949 338847 352582 264691 186127
$$ packed form
24351A30848O9321k23629k03593j30768p5453n6992J68433J98847J2002M7936
24341f3048o4448k34802J81000J38082j5640n0907k0437N1276l6856l8695K68201
24330A13726K25993O5828N289m5406R393j57874k30033j01888J79113J31428O027
24319B01596k79420l4962k8491M4937K15544j3283k14248N4500J81286j01331
24309B6128l7659Q9216j28972n0730L4595O8803j02056p2622K3794J35429M3607
24298B9533j72135J2709j61477R3715L04700K66241k20503k3348p0176P6190K6257
24287A61706k90636r8591O2224L52708J01492j18614j1506r4418J95171K34388
24277D93924k05021j89787p2570k0077L1419K11651J27410l8102J3735q7891p8564
$$ plain form
24266 186127 330306 439534 341602 322199 278670 387563 465057 292049 163228 229587
24256 229587 180267 129588 23334 -42608 115598 343373 430356 508237 217675 95248
24246 95248 216948 309880 154664 -118671 -174561 21483 199271 241780 155716 371605
24236 371605 267563 91281 -24356 -74790 -113134 -6141 44921 -23659 -258903 -283773
24226 -283773 -217294 -265284 44730 154896 64052 26219 -10803 -6066 29364 146132 136885
24215 136885 55825 -107089 -88336 10518 28521 209542 252796 282005 179598 120485 -23370
24204 -23370 -100717 5254 -6030 -109631 -80848 -21914 -180715 -336887 -207390 55955
24194 55955 165734 -37787 72673 225173 110961 -106704 -120146 56617 -45885 -88454
$$ packed form
24266A86127J44179J09228r7932j9403m3529J08893P7494j73008j28821O6359
24256B29587m9320n0679j06254o5942J58206K27775Q6983P7881k90562j22427
24246I5248J21700R2932j55216k73335n5890J96044J77788M2509q6064K15889
24236C71605j04042j76282j15637n0434l8344J06993N1062o8580k35244k4870
24226b83773O6479m7990L10014J10166r0844l7833l7022M737L5430J16768r247
24215A36885q1060j62914J8753R8854J8003J81021M3254K9209j02407n9113j43855
24204b3370p7347J05971j1284j03601K8783N8934j58801j56172J29497K63345
24194E5955J09779k03521J10460J52500j14212k17665j3442J76763j02502m2569
$$ plain form
24184 -88454 -162927 28923 79134 -149536 -148776 -7446 -377031 -714370 -384506 -78758 79799
24173 79799 -61001 -279490 -133312 -107465 -32136 -60147 -124254 -90052 -133670 -153256 -48115
24162 -48115 -82131 -210184 -112434 31994 90038 158195 30270 -31289 39530 81142 70310
24151 70310 -115163 12781 104936 290166 350669 347610 170172 46475 17007 10809 258591
24140 258591 -13444 -125117 -77980 19039 220350 287291 135558 -653 -54702 -119976
24130 -119976 -216683 -126629 -45310 -11182 -135290 -79429 -298452 -312664 -131133 46459 74082
24119 74082 -44079 -131579 -96051 -184115 -248506 -179755 -159726 -173592 -97702 14339 268198
24108 268198 458670 356289 282149 109997 143275 205652 72860 -169150 -278434 -200962
$$ packed form
24184h8454p4473J91850N0211k28670P60J41330l69585l37339L29864L05748J58557
24173G9799j40800k18489J46178K5847P5329k8011o4107L4202m3618j9586J05141
24162d8115l4016j28053R7750J44428N8044O8157j27925o1559P0819M1612j0832
24151G0310j85473J27944R2155J85230O0503l059j77438j23697k9468o198K47782
24140B58591k72035j11673M7137R7019K01311O6941j51733j36211n4049o5274
24130a19976r6707R0054Q1319L4128j24108N5861k19023j4212J81531J77592K7623
24119G4082j18161q7500L5528q8064o4391O8751K0029j3866P5890J12041K53859
24108B68198J90472j02381p4140j72152L3278O2377j32792k42010j09284P7472
$$ plain form
24098 -200962 10477 93256 -131312 -344829 -68781 126356 279131 173220 113825 33445
24088 33445 175300 277253 332839 232170 149805 8597 9212 32810 120779 115825 113952 176949
24076 176949 200339 95318 169212 331452 307648 208325 81156 -110189 -145093 -121497 -107448
24065 -107448 -215709 -389832 -359690 -131022 159172 304387 470844 384151 251881 235090
24055 235090 -34956 -260210 -186110 -131295 77300 142550 6417 -120165 -212985 -103216
24045 -103216 25896 47608 237203 145093 186973 24327 -207916 -176075 -6154 42658
24035 42658 6253 -70266 -159452 -149879 -121338 -194660 -288228 -532754 -280960 90213 226955
24024 226955 86285 -101675 -23113 52436 -4115 -131836 -113766 -5761 88849 191466
$$ packed form
24098b00962K11439Q2779k24568k13517K76048J95137J52775j05911n9395q0380
24088C3445J41855J01953N5586j00669q2365j41208O15K3598Q7969m954j873O2997
24076A76949K3390j05021P3894J62240k3804r9323j27169j91345l4904K3596J4049
24065a07448j08261j74123L0142K28668K90194J45215J66457q6693j32270j6791
24055B35090k70046k25254P4100N4815K08595O5250j36133j26582r2820J09769
24045a03216J29112K1712J89595r2110M1880j62646k32243L1841J69921M8812
24035D2658l6405p6519q9186R573K8541p3322r3568k44526K51794L71173J36742
24024B26955j40670j87960P8562P5549n6551j27721J8070J08005R4610J02617
$$ plain form
24014 191466 184572 265411 247512 -50451 -12016 122340 232126 134376 153213 24516 -63074
24003 -63074 -7318 -56641 -112291 -75390 -68883 -34330 193285 136252 148525 214062 188354 209461
23991 209461 44966 146775 37898 -99078 -95463 -63603 100131 14078 -218277 -207741
23981 -207741 -87929 24155 32964 -32529 -327697 -427447 -273313 -129179 -130263 -160263 -92582
23970 -92582 -4953 -43253 -151470 -127273 -82727 -346659 -358858 17055 159303 112446 71880
23959 71880 -27007 -9413 115652 66498 -83494 -199579 -161548 -88224 1235 -219015 -436273
23948 -436273 -187532 133588 227211 -130511 -460643 -250187 -57056 22267 92753 -15291
23938 -15291 -8885 133770 60257 6071 4888 8626 135109 112352 14426 75315 61641 28994
$$ packed form
24014A91466o894Q0839j7899k97963L8435J34356J09786r7750J8837j28697q7590
24003f3074N5756m9323n5650L6901O507L4553K27615n7033J2273O5537k5708K1107
23991B09461j64495J01809j08877j36976L615L1860J63734q6053k32355J0536
23981b07741J19812J12084Q809o5493k95168r9750J54134J44134j084l0000O7681
23970i2582Q7629l8300j08217K4197M4546k63932j2199L75913J42248m6857m0566
23959G1880r8887J7594J25065m9154j49992j16085L8031P3324Q9459k20250k17258
23948d36273K48741L21120R3623l57722l30132K10456J93131P9323P0486j08044
23938a5291O406J42655p3513n4186j183L738J26483k2757r7926O0889j3674l2647
$$ plain form
23926 28994 258301 236388 91414 89973 130428 23303 -210019 -301922 -247651 -349440 -394335
23915 -394335 -266202 -377777 -418910 -281981 -248028 -316149 -440003 -349075 -164457 -175355
23905 -175355 -154124 -232085 -142660 -33097 66043 120437 -88547 -167781 -302655 -239262 -120034
23894 -120034 107858 1818 -72461 -241203 -385656 -229390 -155084 111187 22980 -150847
23884 -150847 -119992 52584 -142414 -187647 -115657 -144213 -123482 -46491 8558 -40140 -112427
23873 -112427 -133126 -217477 -222874 -175917 -192147 65094 97021 60354 164630 106481 -33439
23862 -33439 63196 207556 121644 121489 219272 5924 -73350 -94965 -132123 -101120 -192171 -167672
23850 -167672 -58386 -51308 -305144 -319582 32820 -83868 -145817 50840 191020 186920 79404
$$ packed form
23926B8994K29307k1913j44974j441M0455j07125k33322r1903N4271j01789m4895
23915c94335J28133j11575m1133J36929L3953o8121j23854R0928J84618j0898
23905a75355K1231p7961Q9425J09563R9140N4394k08984p9234j34874O3393J19228
23894a20034K27892j06040p4279j68742j44453J56266P4306K66271q8207j73827
23884a50847L0855J72576j94998m5233P1990k8556K0731P6991N5049m8698p2287
23873a12427k0699q4351n397M6957j6230K57241L1927l6667J04276n8149j39920
23862c3439R6635J44360q5912j55R7783k13348p9274k1615l7158L1003r1051K4499
23850a67672J09286P078k53836j4438L52402j16688o1949J96657J40180m100j07516
$$ plain form
23839 79404 128096 141961 1561 -97225 -191311 -376482 -250163 -44203 -211172 -237499 -215259
23828 -215259 34057 -7093 -123610 -68521 -98398 -140354 -119404 -63947 -205585 -53602 12227
23817 12227 -34970 69488 37961 -61562 -115814 -58941 59527 108798 63709 66411 -76134
23806 -76134 -90367 181887 234364 219342 236101 320131 305223 93927 -98571 30465 138632
23795 138632 190641 56203 -250627 -208000 -164070 -52042 -93594 -322915 -505109 -390153
23785 -390153 -111505 -37306 186682 39347 28518 17010 293160 440951 250948 -22490
23775 -22490 -185633 -147279 26656 100424 57093 9612 107692 128713 25153 -88879 -52421
23764 -52421 -214888 -54056 29819 110880 192767 59192 -37983 49176 90378 -29563 28841
$$ packed form
23839G9404M8692J3865j40400r8786r4086j85171J26319K05960j66969k6327K2240
23828b15259K49316m1150j16517N5089k9877m1956K0950N5457j41638J51983O5829
23817A2227m7197J04458l1527r9523n4252N6873J18468M9271m5089K702j42545
23806g6134j4233K72254N2477j5022J6759Q4030j4908k11296j92498J29036J08167
23795A38632N2009j34438l06830M2627M3930J12028m1552k29321j82194J14956
23785c90153K78648P4199K23988j47335j0829j1508K76150J47791j90003k73438
23775b2490j63143L8354J73935P3768m3331m7481R8080K1021j03560j14032L6458
23764e2421j62467J60832Q3875Q1061Q1887j33575r7175Q7159M1202j19941N8404
$$ plain form
23753 28841 -37481 -174433 -100220 -81212 -45538 -208049 -402865 -375415 -308907 -279601 -333731
23742 -333731 -226642 -32409 52819 88950 55399 -29054 -229833 -263860 -312322 -212056 -171947
23731 -171947 -258389 -309222 -351856 -208097 -79676 -24714 99758 218943 147190 150075 223865
23720 223865 126967 89450 183547 152392 11257 -177468 -184191 -52827 55623 102564 110723
23709 110723 -147189 -213355 -176392 -245413 -261846 -52125 -151681 -261574 -237674 -186224 -231079
23698 -231079 -121136 -40028 -58617 -87195 36771 8379 -141600 12866 77453 -9408 58629
23687 58629 122207 4406 41406 16705 -191312 -157355 41704 182789 16855 -145020
23677 -145020 -96102 -2878 -13456 -36200 -3457 88758 100577 138201 275449 463749 330531
$$ packed form
23753B8841o6322j36952P4213J9008L5674j62511j94816K7450O6508K9306n4130
23742c33731J07089J94233Q5228L6131l3551q4453k00779l4027m8462J00266M0109
23731a71947q6442n0833m2634J43759J28421N4962J24472J19185p1753K885P3790
23720B23865r6898l7517R4097l1155j41135j88725o723J31364J08450M6941Q159
23709A10723k57912o6166L6963o9021j6433K09721r9556j09893K3900N1450m4855
23698b31079J09943Q1108j8589k8578J23966k8392j49979J54466O4587q6861O8037
23687E8629O3578j17801L7000k4701k08017L3957J99059J41085j65934j61875
23677a45020M8918R3224j0578k2744L2743R2215J1819L7624J37248J88300j33218
$$ plain form
23666 330531 36322 -171203 -93775 102831 250811 257545 199684 143799 143938 186610 131869
23655 131869 27984 26462 13812 92305 98394 109824 44212 -7520 32102 -144119 -167157
23644 -167157 -154925 -161708 6853 52629 -44188 -22951 -178283 -214960 -47481 -136464 75722
23633 75722 -12992 -141841 -218543 -60697 14313 14392 913 85512 199715 50880 -50828
23622 -50828 -117108 -139807 -210572 -207426 -94288 113537 120154 22164 134026 186824 195898 142314
23610 142314 49214 -159346 -247075 -182792 -198960 -58773 19930 161691 178591 55036 -2776
23599 -2776 -78771 -36868 -91785 21711 56666 -98389 -275357 -343542 -210025 -73982 -66862
23588 -66862 -38591 128314 280805 317254 295851 84785 29688 -41174 -52187 -112163 -144556
$$ packed form
23666C30531k94209k07525P7428J96606J47980O734n7861n5885J39M2672n4741
23655A31869j03885j522j2650P8493O089J1430o5612n1732L9622j76221k3038
23644a67157J2232o783J68561M5776r6817K1237j55332l6677J67479q8983K12186
23633G5722q8714j28849p6702J57846P5010P9j3479Q4599J14203j48835j01708
23622e0828o6280k2699p0765L146J13138K07825O617r7990J11862N2798R074n3584
23610A42314r3100k08560q7729O4283j6168J40187P8703J41761J6900j23555n7812
23599b776p5995M1903n4917J13496L4955j55055j76968o8185J33517J36043P120
23588f6862K8271J66905J52491L6449k1403k11066n5097p0862j1013n9976l2393
$$ plain form
23577 -144556 -177267 -138053 -80546 -72868 -151992 -273150 -404864 -259075 -151255 58867 170191
23566 170191 158341 133882 -59988 -81935 -12397 66839 -10674 -159315 -204948 -135349 -54245
23555 -54245 15553 132358 189222 163165 233061 185630 15865 -20507 -35997 78895 211661
23544 211661 1262 -161447 -88782 -40070 -82167 -56950 -114669 -273631 -409681 -399955 -359900
23533 -359900 -300712 -410356 -305688 -241268 -71869 11935 -47116 66913 92391 -4267 -136226
23522 -136226 43239 320173 197106 197321 249607 -4942 -64836 -157583 -249084 -174884 -122664
23511 -122664 -48126 116315 48270 -50699 -201828 -370726 -423281 -362476 -268730 -327939 -224677
23500 -224677 -153345 -258711 -205320 7747 149914 45880 -64678 -48940 -46888 -227596
$$ packed form
23577a44556l2711L9214N7507P678p9124j21158j31714J45789J07820K10122J11324
23566A70191j1850k4459j93870k1947O9538P9236p7513j48641m5633O9599Q1104
23555e4245O9798J16805N6864k6057O9896m7431j69765l6372j5490J14892J32766
23544B11661k10399j62709P2665M8712m2097K5217n7719j58962j36050R726M0055
23533c59900N9188j09644J04668O4420J69399Q3804n9051J14029K5478r6658j31959
23522a36226J79465K76934j23067K15N2286k54549n9894r2747r1501P4200N2220
23511a22664P4538J64441o8045r8969j51129j68898n2555O0805R3746n9209J03262
23500b24677P1332j05366N3391K13067J42167j04034j10558J5738K052j80708
$$ plain form
23490 -227596 -426978 -504924 -404037 -199093 -192858 -83107 -23607 -18304 -217190 -150989 38947
23479 38947 141640 -7044 -222436 -168208 -134110 -130699 -114513 -403963 -600478 -533793 -518063
23468 -518063 -388566 -303937 -190916 63451 -24934 -175290 -191629 -73953 23128 -132281
23458 -132281 -179779 -174770 -104520 -155403 -163083 -201857 -202518 -94987 1899 -16619 -191621 -326202
23446 -326202 -389269 -454419 -621230 -276379 -71827 -38697 -177917 -89412 -149927 -294804
23436 -294804 -502106 -474492 -281679 -260056 -187178 -83304 -14397 -56493 -133332 -184630 -63866
23425 -63866 -39814 -208277 -312487 -186604 -239704 -159870 -218609 -201277 -129679 -111957 -376335
23414 -376335 -343699 -134598 -67736 -50602 -12799 220210 203341 57559 -125661 34988
$$ packed form
23490b27596j99382p7946J00887K04944O235J09751N9500N303j98886O6201J89936
23479C8947J02693j48684k15392N4228L4098L411J6186k89450j96515O6685J5730
23468e18063J29497Q4629J13021K54367q8385j50356j6339J17676R7081j55409
23458a32281m7498N009P0250n0883p680l8774o61J07531R6886j8518j75002j34581
23446c26202o3067o5150j66811L44851K04552L3130j39220Q8505o0515j44877
23436b94804k07302K7614J92813K1623P2878J03874O8907m2096p6839n1298J20764
23425f3866K4052j68463j04210J25883n3100P9834n8739J7332P1598J7722k64378
23414c76335L2636K09101O6862J7134L7803K33009j6869j45782j83220J60649
$$ plain form
23404 34988 121219 103573 143583 97002 63235 26058 -551 183828 276135 18937 -97362
23393 -97362 -121454 4730 32380 -35856 33962 51422 -180821 -343525 -219158 -183265 -143381
23382 -143381 -217461 -130069 -89391 34166 140962 43436 -79105 -155314 -274883 -202717 -245235
23371 -245235 -252915 -142143 -248141 -337898 -129368 -31005 -173504 -266472 -190320 30575 117409
23360 117409 180553 177789 34920 -83803 -207775 -169804 -82588 -21214 117965 186264 176696
23349 176696 272335 342093 178943 65956 76013 114103 213474 187271 131332 -21246 -145780
23338 -145780 -62396 -115940 -80479 26092 91826 313677 432241 474448 349631 232448
23328 232448 161237 207391 24865 11959 14259 -102127 -126823 52449 203731 34428 -183120
$$ packed form
23404C4988Q6231j7646M0010m6581l3767l7177k6609J84379R2307k57198j16299
23393i7362k4092J26184K7650o8236O9818J7460k32243j62704J24367L5893L9884
23382a43381p4080Q7392M0678J23557J06796r7526j22541p6209j19569P2166m2518
23371b45235p680J10772j05998q9757K08530R8363j42499r2968P6152K20895Q6834
23360A17409O3144k764j42869j18723j23972L7971Q7216O1374J39179O8299r568
23349A76696R5639O9758j63150j12987J0057L8090R9371k6203n5939j52578j24534
23338a45780Q3384n3544L5461J06571O5734K21851J18564M2207j24817j17183
23328B32448p1211M6154j82526j2906K300j16386k4696J79272J51282j69303k17548
$$ plain form
23317 -183120 -244740 -327656 -437335 -243667 42637 215000 316069 149439 136864 202748
23307 202748 -98803 -249436 -295818 -335161 -272179 -272232 -152019 -100886 42026 90126 27044
23296 27044 -228879 -304579 -214096 -142626 -79930 -187982 -112265 -52561 -158323 -150255 -14833
23285 -14833 43355 -82573 -122531 -288606 -201893 -3451 150018 196716 113084 24314 -69009
23274 -69009 -52791 174201 330370 366167 63717 149593 303892 273757 287949 300967 252812
23263 252812 35689 -69726 1051 64058 -101107 -170573 103433 140877 85467 -117457
23253 -117457 -255434 -198392 -176598 -144840 -232346 -222215 -107824 -49856 -193829 -171695 56380
23242 56380 -489 66965 208214 238856 168177 53112 104183 112696 77130 -104481 -209663
$$ packed form
23317a83120o1620q2916j09679J93668K86304J72363J01069j66630j2575O5884
23307B02748l01551j50633m6382l9343O2982n3J20213N1133J42912M8100o3082
23296B7044k55923p5700R0483P1470O2696j08052P5717N9704j05762Q068J35422
23285a4833N8188j25928l9958j66075Q6713J98442J53469M6698q3632q8770r3323
23274f9009J6218K26992J56169L5797l02450Q5876J54299l0135J4192J3018m8155
23263B52812k17123j05415P0777O3007j65165o9466K74006L7444n5410k02924
23253a17457j37977N7042K1794L1758q7506J0131J14391N7968j43973K2134K28075
23242E6380n6869O7454J41249L0642p0679j15065N1071Q513l5566j81611j05182
$$ plain form
23231 -209663 -246233 -207284 -411128 -208509 -208827 -55106 102133 -40434 -167343 -229743 -275710
23220 -275710 -261581 -124668 -107394 -199435 -155524 -136251 4347 -22936 20042 621 91963
23209 91963 183813 92408 -100289 -132409 -23764 -238964 -534923 -436221 -175738 -251569 -248168
23198 -248168 -395701 -489961 -332356 -240593 -66190 80556 37505 -10972 -130172 -308354
23188 -308354 -431252 -417648 -666864 -675073 -460373 -272162 -139030 -157477 -27827 107335
23178 107335 221106 217249 69331 -102255 -93946 -32489 16787 88071 177947 170791 142870
23167 142870 123839 65694 -49572 -97371 -47585 135641 187893 135206 -110455 -57942 152180
23156 152180 -44154 -282512 -358962 -424842 -498700 -207813 81491 158723 47167 -59853
$$ packed form
23231b09663l6570L8949k03844K02619l18J53721J57239j42567j26909o2400m5967
23220b75710J4129J36913J7274r2041M3911J9273J40598k7283M2978j9421R1342
23209I1963R1850r1405j92697l2120J08645k15200k95959R8702K60483p5831L401
23198b48168j47533r4260J57605R1763J74403J46746m3051m8477j19200j78182
23188c08354j22898J3604k49216q209K14700J88211J33132j8447J29650J35162
23178A07335J13771l857j47918j71586Q309O1457M9276P1284Q9876p156k7921
23167A42870j9031n8145j15266m7799M9786J83226N2252n2687k45661N2513K10122
23156A52180j96334k38358p6450o5880p3858K90887K89304P7232j11556j07020
$$ plain form
23146 -59853 -27652 4319 121612 129946 146261 -24097 132233 38222 -32827 -211411 -163551
23135 -163551 -86142 -3434 123706 62441 -25478 -64074 23821 116676 147550 135687 180722
23124 180722 255140 90723 -9696 56748 193029 297976 306743 121333 44150 92511 127988
23113 127988 167126 21211 -19726 -38178 -31414 -104129 -224454 -213862 -259740 -110731 48666
23102 48666 71615 63803 123084 103420 -75021 -572 199606 216597 171031 -7051 25328
23091 25328 83483 24146 25634 16659 212034 215999 117943 188353 119435 39419 -45770 36398
23079 36398 65601 -114858 -99985 -271100 -256058 -196065 -381598 -411005 -234384 -203605 -208523
23068 -208523 -126235 -156528 -87793 -209652 109374 251393 202595 177648 24001 -39845 38614
$$ packed form
23146e9853L2201L1971J17293Q334J6315j70358J56330r4011p1049j78584M7860
23135a63551P7409Q2708J27140o1265q7919l8596Q7895R2855L0874j1863M5035
23124A80722P4418j64417j00419O6444J36281J04947Q767j85410p7183M8361L5477
23113A27988L9138j45915m0937j8452O764p2715j20325J0592m5878J49009J59397
23102D8666K2949p812N9281j9664j78441P4449K00178J6991m5566j78082L2379
23091B5328N8155n9337J488q975J95375L965r8056P0410o8918q0016q5189Q2168
23079C6398K9203j80459J4873j71115J5042N9993j85533k9407J76621L0779m918
23068b08523Q2288l0293O8735j21859L19026J42019m8798k4947j53647o3846P8459
$$ plain form
23057 38614 -38947 -163763 -181037 -42260 65849 136607 118469 162764 232935 212554 140948
23046 140948 -58896 -124248 24846 5282 34087 22046 136086 219361 281574 343763 340405
23035 340405 148905 99258 185181 292869 128377 31878 171791 161257 27388 17936 218566
23024 218566 248039 141119 41557 -157708 -193772 -93103 124368 126230 -39692 -28997 -50883
23013 -50883 -8427 924 -236 3263 -198104 -296817 -248775 -123626 -85506 76098 -51979
23002 -51979 -124383 13404 76703 138480 160700 163072 160626 141674 152228 17805 148236
22991 148236 29618 -53997 -26684 -110811 -67371 17636 80366 249695 152542 126780 -93196
22980 -93196 -88251 -197427 -286369 -294823 -316499 -225489 -1597 202663 186646 50933 -81017
$$ packed form
23057C8614p7561j24816j7274J38777J08109P0758j8138M4295P0171k0381p1606
23046A40948j99844o5352J49094j9564K8805j2041J14040Q3275O2213O2189l358
23035C40405j91500m9647Q5923J07688j64492r6499J39913j0534j33869r452K00630
23024B18566K9473j06920r9562j99265l6064J00669K17471J862j65922J0695k1886
23013e0883M2456R351j160L499k01367r8713M8042J25149L8120J61604j28077
23002e1979p2404J37787O3299O1777K2220K372k446j8952J0554j34423J30431
22991A48236j18618q3615K7313q4127M3440Q5007O2730J69329r7153k5762k19976
22980i3196M945j09176q8942q454k1676R1010K23892K04260j6017j35713j31950
$$ plain form
22969 -81017 -107297 -39372 -5274 -19775 -53274 4088 -134625 -268501 -410692 -370111 -266484
22958 -266484 -100523 -252814 -279937 -340195 -215862 -217704 -152357 -207306 21259 221537 43334
22947 43334 -325151 -423268 -371794 -250733 -180346 44551 73518 173719 -26745 -150862
22937 -150862 -240573 -225518 -158643 -126930 -162807 -18005 -49165 -247608 -364490 -272953 -196453
22926 -196453 -328021 -251807 -125173 88702 -22344 -113749 -150022 -237565 -324354 -297427 -62038
22915 -62038 -124974 -186658 -56679 -73587 -126309 -222546 -425935 -293277 91860 119775 -75784
22904 -75784 -112859 -91013 -283254 -229678 -62699 -127802 -238209 -175888 -191302 -121026 -221863
22893 -221863 -170561 -289983 -190902 -121011 -37018 138933 168188 -91206 -207306 -187017 -73357
$$ packed form
22969h1017k6280O7925L4098j4501l3499N7362j38713j33876j42191M0581J03627
22958b66484J65961j52291k7123o0258J24333j842O5347n4949K28565K00278j78203
22947D3334l68485r8117N1474J21061P0387K24897K8967J00201k00464j24117
22937a50862q9711J5055O6875L1713l5877J44802l1160j98443j16882R1537P6500
22926a96453j31568P6214J26634K13875j11046r1405l6273q7543q6789K6927K35389
22915f2038o2936o1684J29979j6908n2722r6237k03389J32658L85137K7915j95559
22904g5784l7075K1846j92241N3576J66979o5103j10407O2321j5414P0276j00837
22893b21863N1302j19422R9081O9891Q3993J75951K9255k59394j16100K0289J13660
$$ plain form
22882 -73357 23695 -124626 -189401 -175138 -31508 -43565 -100801 -117504 -205224 -194843 -200012
22871 -200012 -157146 -74226 41481 32575 -155990 -32362 -16316 -133396 122507 124786 113388
22860 113388 73509 96113 68491 7008 -15348 57132 13980 -148490 -164628 -246090 -224741
22849 -224741 -179697 -29621 -100389 -274951 -380379 -192885 -65492 1375 -241578 -188484
22839 -188484 17666 -26569 -183864 -124435 -154029 -182196 -149511 -196995 -209594 -306733 -322886
22828 -322886 -271289 -109366 44233 95909 139580 -20450 -51502 86033 99992 146060 130461
22817 130461 136596 -114492 -140880 -250919 -180702 26905 -9562 -43619 -105870 -429540 -475613
22806 -475613 -440776 -315981 -291273 -52355 168365 265275 241212 134791 35344 12446 111181
$$ packed form
22882g3357R7052j48321o4775J4263J43630j2057n7236j6703q7720J0381n169
22871b00012M2866Q2920J15707q906j88565J23628J6046j17080K55903K279j1398
22860A13388l9879K2604k7622o1483k2356P2480m3152j62470j6138q1462K1349
22849b24741M5044J50076p0768j74562j05428J87494J27393O6867k42953N3094
22839a88484K06150m4235j57295N9429k9594k8167L2685m7484j2599r7139j6153
22828c22886N1597J61923J53599N1676M3671j60030l1052J37535J3959M6068j5599
22817A30461O135k51088k6388j10039P0217K07607l6467l4057o2251l23670m6073
22806d75613L4837J24795K4708K38918K20720R6910k4063j06421r9447k2898R8735
$$ plain form
22795 111181 179741 158500 -32721 -224778 -427195 -390555 -163913 -173768 -397976 -267951
22785 -267951 -157863 -176519 -191307 -262124 -234083 -22518 108117 6826 -14765 -124234
22775 -124234 -134499 -160968 -187144 -114948 -119716 -184417 -180067 53705 210450 -34242 -141086
22764 -141086 -105851 142202 245089 145438 -48219 -169993 -164450 -26804 109455 313840
22754 313840 254304 226296 18278 -37259 -159596 -191309 -52382 132 -179984 -329243
22744 -329243 -265326 -253430 -231896 -182544 -46653 -45477 -21628 143100 -45125 -160183 -55651
22733 -55651 26555 131078 120348 -10899 64441 39394 -160775 -224544 -142328 -171791 -160267
22722 -160267 -271439 -346131 -368801 -324916 -348983 -186212 66995 96850 -66555 -280776
$$ packed form
22795A11181O8560k1241j91221j92057k02417L6640K26642r855k24208J30025
22785b67951J10088j8656j4788p0817K8041K11565J30635j01291k1591j09469
22775a24234j0265k6469k6176P2196m768o4701M350K33772J56745k44692j06844
22764a41086L5235K48053J02887r9651j93657j21774N543J37646J36259K04385
22754C13840n9536k8008k08018n5537j22337l1713J38927N2514j80116j49259
22744c29243O3917J1896K1534M9352J35891J176K3849J64728j88225j15058J04532
22733e5651Q2206J04523j0730j31247P5340k5047k00169o3769Q2216k9463J1524
22722a60267j11172p4692k2670M3885k4067J62771K53207K9855j63405k14221
$$ plain form
22712 -280776 -273384 -56308 -176660 -178421 -67174 -28661 33482 -40133 43984 86412 112367
22701 112367 155417 137071 117485 144180 198518 192289 71229 52937 148709 156922 83563 -175486
22689 -175486 -159735 -189751 -85133 -91401 -255165 -368895 -410309 -258930 -98879 19732
22679 19732 -48600 -93798 210575 327413 78278 -154443 -212224 -216208 -185691 -180134 -254017
22668 -254017 -390881 -553786 -539857 -498100 -140853 20225 -22864 -142859 -71518 -190376
22658 -190376 -306884 -219545 -54546 -81469 -109418 -187844 44386 60419 -140007 -49807 130976
22647 130976 9232 -29127 211515 101648 81526 -62220 -148623 -136574 -141328 -136241 -208185
22636 -208185 -126517 -132421 -30416 137209 269900 325953 297078 143622 -89413 -125524 -42287
$$ packed form
22712b80776P392K17076j20352j761J11247L8513O2143p3615Q4117M2428K5955
22701A12367M3050j8346j9586K6695N4338o229j21060j8292R5772Q213p3359k59049
22689a75486J5751l0016J04618o268j63764j13730m1414J51379J60051J18611
22679A9732o8332m5198L04373J16838k49135k32721n7781l984L0517N557p3883
22668b54017j36864j62905J3929M1757L57247J61078m3089j19995P1341j18858
22658a90376j16508Q7339J64999k6923k7949p8426K32230J6033k00426R0200J80783
22647A30976j21744l8359K40642j09867k0122j43746q6403J2049m754N087p1944
22636b08185Q1668n904J02005J67625J32691N6053k8875j53456k33035l6111Q3237
$$ plain form
22625 -42287 18496 29157 -258 -2998 -60795 -141809 -138898 -184986 -238439 -179569 -176050 -169944
22613 -169944 -112875 69597 106668 -62220 38824 227674 143176 -101926 -199000 -252424
22603 -252424 -279407 -45853 -721 -12222 -23050 -215505 -240610 -229332 -94049 205396 229765
22592 229765 112674 -81563 -291037 -154188 -39491 97774 73678 -26608 -35869 114107
22582 114107 138210 106337 54317 61074 -19577 -255661 -201335 -49050 14847 -43182 -182942
22571 -182942 -74611 -120039 -305960 -237599 -243744 -257441 -319550 -412795 -307485 -336307 -320860
22560 -320860 -253415 -265401 -347602 -488576 -477662 -415631 -338134 -46779 542 -16873 -30749
22549 -30749 -73236 -58477 20107 -79437 -55073 163719 199727 201239 136368 -45632 -60931
$$ packed form
22625d2287O0783J0661k9415k740n7797q1014K911m6088n3453N8870L519O106
22613a69944N7069J82472L7071j68888J01044J88850q4498k45102r7074n3424
22603b52424k6983K33554M5132j1501j0828j92455k5105J1278J35283K99445K4369
22592B29765j17091j94237k09474J36849J14697J37265k4096j00286r261J49976
22582A14107K4103l1873n2020O757q0651k36084N4326J52285O3897n8029j39760
22571a82942J08331m5428j85921O8361o145j3697o2109r3245J05310k8822J5447
22560c20860O7445j1986q2201j40974J0914O2031P7497K91355M7321j7415j3876
22549c0749m2487J4759P8584r9544K4364K18792L6008J512o4871j82000j5299
$$ plain form
22538 -60931 -219424 -194243 119513 112205 -56072 -316401 -373937 -300561 -32713 136055 22921
22527 22921 -2851 -191822 -214373 -135955 -204119 -240447 -180771 -128897 130609 69288 82866
22516 82866 74720 -107226 14426 54745 -117702 -153079 1921 -6971 -94380 -100493 -252150
22505 -252150 -440542 -306577 -14815 -83849 -139346 -92475 -91815 9237 -67394 -160846 -244636
22494 -244636 405 132980 -41185 -84985 -43961 -48286 -224889 -240102 -241859 -126873 -116083
22483 -116083 -41155 -38175 -83976 -119076 -223096 -416427 -288662 137033 42469 -39063 -108450
22472 -108450 -90281 -86978 82700 265269 117656 -49571 -300911 -401499 -377281 -267581
22462 -267581 -351114 -384856 -115175 -68593 -104569 -60038 -7443 31238 -43699 34754 97174
$$ packed form
22538f0931j58493K5181L13756p308j68277k60329n7536P3376K67848J68768j13134
22527B2921k5772j88971k2551P8418o8164l6328N9676N1874K59506o1321J3578
22516H2866q146j81946J21652M0319j72447l5377J55000q892q7409o113j51657
22505b52150j88392J33965K91762o9034n5497M6871O60J01052p6631r3452q3790
22494b44636K45041J32575j74165m3800M1024m325j76603j5213j757J14986J0790
22483a16083P4928K980m5801l5100j04020j93331J27765M25695r4564q1532o9387
22472a08450J8169L303J69678J82569j47613j67227k51340j00588K4218J09700
22462b67581q3533l3742K69681M6582l5976M4531N2595L8681p4937P8453O2420
$$ plain form
22451 97174 170693 152504 18347 -128489 -310629 -423824 -148193 -138292 -278755 -228751 -273695
22440 -273695 -144840 161372 82158 2934 -18004 37821 74199 134591 28207 -199945 -281005
22429 -281005 -156447 -282389 -394966 -276680 -266503 -204550 -136720 -98791 -102933 -13700 -59906
22418 -59906 -304587 -465632 -227509 -234549 -310979 -302470 -336147 -561581 -639163 -474369 -404187
22407 -404187 -470567 -354696 -269449 -315312 -319227 -408082 -378569 -241139 -160576 -224352 -257554
22396 -257554 -474944 -358184 -239823 46129 261236 170570 206293 213844 182227 6394
22386 6394 -38457 -34553 -64376 -170541 -66583 -70669 -264323 -172217 -1830 58319 157091
22375 157091 252590 225218 47266 -25791 89786 223488 330024 507916 391279 214726
$$ packed form
22451I7174P3519j8189j34157j46836j82140j13195K75631R901j40463N0004m4944
22440b73695J28855L06212p9214p9224k0938N5825L6378O0392j06384k28152q1060
22429b81005J24558j25942j12577J18286J0177O1953O7830L7929m142Q9233m6206
22418e9906k44681j61045K38123p040p6430Q509l3677k25434p7582J64794P0182
22407d04187o6380J15871Q5247m5863l915q8855K9513J37430Q0563o3776l3202
22396b57554k17390J16760J18361K85952K15107r0666L5723P551l1617j75833
22386F394m4851L904k9823j06165J03958m086j93654R2106J70387O0149R8772
22375A57091R5499k7372j77952p3057J15577J33702J06536J77892j16637j76553
$$ plain form
22365 214726 130658 11108 -106703 -28877 97268 174361 -157652 -350192 -235884 -3383
22355 -3383 161849 183653 -43102 -97035 -21794 -24784 -41145 -14448 -43147 -50603 34483 19177
22343 19177 -121348 -240383 -123320 -76879 -93889 -175621 -93266 -37977 -147863 -175331 -176541
22332 -176541 -87343 -5587 36756 -134894 -196907 -105149 -115109 -157458 -115177 -153080 -64862
22321 -64862 35096 -21073 -187048 -146083 -145982 -2060 199642 212893 157831 -17780 -120205
22310 -120205 -115956 -122692 -170338 -263655 -219730 -89043 -39316 -102345 -158335 -230222 -288221 -190965
22298 -190965 -110601 -150136 -68720 24458 41524 5232 -110915 -91366 -26288 -61764 -33171
22287 -33171 86303 -65443 -62275 -35727 358137 370620 243063 206963 304365 178353 -122826
$$ packed form
22365B14726q4068j19550j17811P7826J26145P7093l32013j92540J14308K32501
22355c383J65232K1804k26755n3933P5241k990j6361K6697k8699p456Q5086j5306
22343A9177j40525j19035J17063M6441j7010q1732Q2355N5289j09886k7468j210
22332a76541Q9198Q1756M2343j71650o2013R1758r960m2349M2281l7903Q8218
22321f4862R9958n6169j65975M0965J01J43922K01702J3251n5062j75611j02425
22310a20205M249o736m7646r3317M3925J30687M9727o3029n5990p1887n7999R7256
22298a90965Q0364l9535Q1416R3178J7066l6292j16147J9549O5078l5476K8593
22287c3171J19474j51746L168K6548L93864J2483j27557l6100R7402j26012l01179
$$ plain form
22276 -122826 -154472 50620 -55523 -195276 -143038 -92229 -108638 -129016 -170387 -135664 37903
22265 37903 272262 318730 140093 147811 133020 136423 68624 26085 25548 -97646 -274928 -303982
22253 -303982 -316238 -269414 -260810 -135501 -43890 31973 -20682 217063 151204 -15364 -72147
22242 -72147 -115471 -134359 -155358 -60623 -4478 -63971 -132356 -62210 42088 -17051 -27884
22231 -27884 -41818 -91175 210376 316944 311703 207742 49285 -108025 -171018 -358946 -349778
22220 -349778 51338 62226 -110772 36166 87064 -39807 -60767 -115245 -235722 -151990
22210 -151990 -150521 -305307 -123565 -13932 118332 179191 103783 175356 279638 253918 76519
22199 76519 58191 -28677 -76375 -86168 -235821 -147534 -193594 -413829 -233712 -114262 -105758
$$ packed form
22276a22826l1646K05092j06143j39753N2238N0809j6409k0378m1371L4723J73567
22265C7903K34359M6468j78637P718j4791L403o7799m2539n37j23194j77282k9054
22253c03982j2256M6824Q604J25309R1611P5863n2655K37745o5859j66568n6783
22242g2147m3324j8888k0999R4735N6145n9493o8385P0146J04298n9139j0833
22231b7884j3934m9357L01551J06568n241j03961j58457j57310o2993j87928R168
22220c49778M01116J0888j72998J46938N0898j26871k0960n4478j20477Q3732
22210a51990J469j54786J81742J09633J32264O0859p5408P1573J04282k5720j77399
22199G6519j8328q6868m7698r793j49653Q8287m6060k20235J80117J19450Q504
$$ plain form
22188 -105758 -222982 -132769 -167556 -42203 187317 129828 -72024 -87437 18713 156224
22178 156224 172570 119682 70165 -32963 70666 19689 -175445 -250399 -317756 -301189 -255702
22167 -255702 -307329 -267229 -206652 -274881 -117761 -300970 -417002 -199530 -34294 2353
22157 2353 -109928 -357125 -390279 -188351 -107287 -86713 -57246 -44934 204505 327086 48282
22146 48282 -20263 139312 273442 198119 281783 287411 117242 -106127 -187171 -245758 -193414
22135 -193414 40094 265251 211425 29425 -227571 -435977 -465720 -410289 -216953 -134119
22125 -134119 -135521 -276985 -96804 -57090 -279969 -163564 88341 55091 42012 38067 218594
22114 218594 169613 22268 85478 276966 167287 136661 267743 201566 38931 -129578
$$ packed form
22188a05758j17224R0213l4787J25353K29520n7489k01852j5413J06150J37511
22178A56224J6346n2888m9517j03128J03629n0977j95134p4954o7357J6567M5487
22167b55702n1627M0100O0577o8229J57120j83209j16032K17472J65236L6647
22157B353j12281k47197l3154K01928Q1064K0574K9467J2312K49439J22581k78804
22146D8282o8545J59575J34130p5323Q3664N628j70169k23369q1044n8587N2344
22135a93414K33508K25157n3826j82000k56996k08406k9743N5431J93336Q2834
22125a34119j402j41464J80181L9714k22879J16405K51905l3250j3079l945J80527
22114B18594m8981j47345O3210J91488j09679l0626J31082o6177j62635j68509
$$ plain form
22104 -129578 -261211 -270415 -183628 -22439 75908 -9220 13867 -9498 30122 -67810 -110502
22093 -110502 -98035 -75926 -163250 -405726 -505313 -473612 -418649 -353423 -226605 47850 120426
22082 120426 55604 -214044 -239974 -318411 -244227 -163922 -104991 92290 232480 169192 131713
22071 131713 123372 166557 64994 -140129 -161626 -117680 -253285 -428047 -327857 -232869 -254625
22060 -254625 -20436 306529 214265 50933 161769 7110 -246431 -224684 -25449 9245
22050 9245 -89626 -20335 -47281 -7530 -50947 -125755 -212025 -212160 -153875 -327297 -262928 -233189
22038 -233189 -143589 39402 234250 365256 391764 296371 166836 156787 59762 -115108
22028 -115108 -41198 76848 -90977 -87601 -53267 -76634 -162668 -1698 143013 35302 -86075
$$ packed form
22104a29578j31633r204Q6787J61189R8347q5128K3087k3365L9620r7932m2692
22093a10502J2467K2109q7324k42476r9587L1701N4963O5226J26818K74455P2576
22082A20426o4822k69648k5930p8437P4184Q0305N8931J97281J40190o3288l7479
22071A31713q341M3185j01563k05123k1497M3946j35605j74762J00190R4988k1756
22060b54625K34189L26965r2264j63332J10836j54659k53541K1747J99235L4694
22050I245r8871O9291k6946L9751m3417p4808q6270j35N8285j73422O4369K9739
22038b33189Q9600J82991J94848J31006K6508r5393j29535j0049r7025j74870
22028a15108P3910J18046j67825L376L4334k3367q6034J60970J44711j07711j21377
$$ plain form
22017 -86075 -201667 -86959 -181844 -241761 -272922 -333581 -202888 -161308 -169000 -171635 -189121
22006 -189121 -345674 -493369 -380504 -88177 11373 -55703 -29412 -44015 -82442 -168134 -240830
21995 -240830 -221885 -230594 -214278 -226226 -138642 -192136 -64324 221120 264847 322388 221747
21984 221747 53830 122433 186723 85251 90341 177786 320589 281772 287320 261920 32944
21973 32944 -106344 20279 -39583 -38648 -7308 68038 36302 124446 -3178 -97212 -71880
21962 -71880 -38054 -111450 -195331 -167595 -4725 8685 7796 -224829 -404951 -336644 -287248
21951 -287248 -84076 17107 -99804 -225907 -381547 -299802 -99967 -213362 -208197 -84558
21941 -84558 -44136 -77369 -245530 -367646 -123063 56148 -6722 -63210 -178605 -108178 -128828
$$ packed form
22017h6075j15592J14708r4885n9917l1161o0659J30693M1580p692k635j7486
22006a89121j56553j47695J12865K92327R9550o7076K6291j4603l8427q5692p2696
21995b40830J8945q709J6316j1948Q7584n3494J27812K85444M3727N7541j00641
21984B21747j67917O8603O4290j01472N090Q7445J42803l8817N548k5400k28976
21973C2944j39288J26623n9862R35L1340P5346l1736Q8144j27624r4034K5332
21962g1880L3826p3396q3881K7736J62870J3410q89k32625j80122O8307M9396
21951b87248K03172J01183j16911j26103j55640Q1745J99835j13395N165J23639
21941h4558M0422l3233j68161j22116K44583J79211o2870n6488j15395P0427k0650
$$ plain form
21930 -128828 -161925 -81694 75462 190344 168853 150460 136301 -2314 -16231 34645 -30841
21919 -30841 -43146 -57099 -64249 -214119 -319329 -309310 -328020 -305877 -72059 -79393 -144931
21908 -144931 -190523 -223227 -242260 -197657 -222927 -196085 -318616 -69591 -92850 -110870 -169068
21897 -169068 -291322 -241875 -249305 -373094 -352751 -315680 -280179 -404314 -345544 -258409 -162201
21886 -162201 23185 64680 143091 159579 -46606 -17382 128678 236493 193838 94404 -173902
21875 -173902 -316770 -260874 -294939 -250320 -33965 39312 65204 -40194 -101009 -10364 197605
21864 197605 109878 43611 148811 106514 54069 173584 321248 173818 12967 -26879
21854 -26879 -44399 -36659 -137282 -161969 -95702 -272921 -293827 -203043 85880 100164 108551
$$ packed form
21930a28828l3097Q0231J57156J14882k1491j8393j4159j38615j3917N0876o5486
21919c0841j2305j3953p150j49870j05210J0019j8710K2143K33818p334o5538
21908a44931m5592l2704j9033M4603k5270K6842j22531K49025k3259j8020n8198
21897a69068j22254M9447p430j23789K0343L7071L5501j24135N8770Q7135R6208
21886a62201J85386M1495P8411J6488k06185K9224J46060J07815m2655r9434k68306
21875a73902j42868N5896l4065M4619K16355P3277K5892j05398o0815R0645K07969
21864A97605q7727o6267J05200m2297n2445J19515J47664j47430j60851l9846
21854b6879j7520P740j00623k4687O6267j77219k0906R0784K88923J4284Q387
$$ plain form
21843 108551 -47710 -40057 61443 -26402 -123283 -24126 26480 -223783 -317942 -270731 56430
21832 56430 90090 128586 95058 116164 149503 -135561 -270986 -359582 -374941 -453737 -402548
21821 -402548 -377565 -413474 -557845 -451149 -69165 24482 -54011 -313292 -452211 -366844
21811 -366844 -220303 -222314 -287348 -364728 -267171 -268413 -22196 226278 181063 122471 192380
21800 192380 153291 24999 -145382 -235488 -163327 -260399 -167842 -94582 -66615 10558 95788
21789 95788 141330 141413 31918 118540 -26022 -77420 30324 -75002 -172400 -59333 -82225
21778 -82225 -81934 -5420 -38003 -132309 -124972 -23406 -221487 -376343 -333453 -307750 -184674
21767 -184674 16125 -84326 -72209 64076 138400 92914 26800 -80272 -100937 -149389 -107088
$$ packed form
21843A08551j56261P653J01500q7845r6881R9157N0606k50263r4159M7211L27161
21832E6430L3660L8496l3528K1106L3339k85064j35425q8596j5359p8796N1189
21821d02548K4983l5909j44371J06696L81984R3647p8493k59281j38919Q5367
21811c66844J46541k011o5034p7380R7557j242K46217K48474m5215n8592O9909
21800A92380l9089j28292j70381r0106P2161r7072R2557P3260K7967P7173Q5230
21789I5788M5542Q3j09495Q6622j44562n1398J07744j05326r7398J13067k2892
21778h2225K91P6514l2583r4306P337J01566j98081j54856M2890K5703J23076
21767a84674K00799j00451J2117J36285P4324m5486o6114j07072k0665m8452M2301
$$ plain form
21756 -107088 111764 141745 44231 -103406 -235714 -330301 -62772 170948 147857 18535
21746 18535 10941 78818 -8740 91693 163700 284751 278560 244338 72707 28561 -11358
21735 -11358 -87888 957 32959 239114 156419 97211 -78139 -273746 -169663 -135943 -49914
21724 -49914 -103126 -13793 9485 -89585 -32575 -18339 -5792 9295 174797 244093 124936
21713 124936 12033 20874 -101358 -108219 -131761 -228550 -264843 -206145 -105128 -204597 -419096
21702 -419096 -279620 -253120 -316839 -96107 101342 150938 21465 -87219 26304 20132
21692 20132 -81445 -147456 -244589 -322003 -312473 -461430 -593071 -772195 -759564 -814461 -559519
21681 -559519 -257943 -189194 -220557 -207499 -94721 35314 149915 188754 57534 -124670
$$ packed form
21756a07088K18852K9981r7514j47637j32308r4587K67529K33720k3091j29322
21746A8535p594O7877q7558J00433P2007J21051o191l4222j71631m4146l9919
21735a1358p6530Q8845L2002K06155q2695n9208j75350j95607J04083L3720Q6029
21724d9914n3212Q9333K3278r9070N7010J4236J2547J5087J65502O9296j19157
21713A24936j12903Q841j22232o861k3542r6789l6293N8698J01017r9469k14499
21702d19096J39476K6500o3719K20732J97449M9596j29473j08684J13523o172
21692B0132j01577o6011r7133p7414R530j48957j31641j79124J2631n4897K54942
21681e59519L01576O8749l1363J3058J12778J30035J14601L8839j31220j82204
$$ plain form
21671 -124670 -180623 -247021 -89434 66688 -158403 -305006 -339306 -221142 -84577 -56001
21661 -56001 -53354 -99359 -31953 56009 113323 23465 37033 85246 -13704 155726 228873 195246
21649 195246 86027 118352 163078 21963 37794 -18562 -29273 22150 -78020 -251927 -44778
21638 -44778 173044 166510 120247 259252 192057 66333 55644 50493 10419 -93574 -104538
21627 -104538 -140285 -7790 -34308 -163528 -142547 -216294 -426962 -268268 -180295 -60009
21617 -60009 111452 -4381 -196510 -284377 -169149 -173139 -95267 -247285 -185893 -140023 -16119
21606 -16119 22410 1401 125013 79710 2730 268712 323734 88850 48606 -117537 -262966
21595 -262966 -255723 -185004 -327452 -282408 -122519 68778 105942 6359 -93938 -130783 -222089
$$ packed form
21671a24670n5953o6398J57587J56122k25091j46603l4300J18164J36565K8576
21661e6001K647m6005O7406Q7962N7314q9858J3568M8213r8950J69430P3147l3627
21649A95246j09219L2325M4726j41115J5831n6356j0711N1423j00170j73907K07149
21638d4778K17822o534m6263J39005o7195j25724j0689n151m0074j03993j0964
21627a04538l5747J32495k6518j29220K0981p3747k10668J58694Q7973J20286
21617f0009J71461j15833j92129q7867J15228l990P7872j52018O1392M5870J23904
21606a6119L8529k1009J23612m5303p6980K65982N5022k34884m0244j66143j45429
21595b62966P243P0719j42448M5044J59889J91297L7164r9583j00297l6845r1306
$$ plain form
21584 -222089 -264603 -352095 -248946 6036 133 -151873 -293125 -416651 -182274 115552
21574 115552 102213 -22672 2437 -35181 -23418 -66784 -161591 -115388 -8822 43537 21637
21563 21637 100293 267515 105975 -40917 -122542 28509 33996 -40797 -192697 -282394 -170810
21552 -170810 -15682 78 173697 25798 -136110 -197014 -180208 -108199 -216632 -225779 29723
21541 29723 33863 -176764 -188968 127410 15218 3796 157260 98884 -172640 -320480 -167501
21530 -167501 -89284 163760 241913 182508 40201 -75119 12576 120453 140320 172759 231774
21519 231774 114184 11258 85895 176691 14366 -72510 -28314 -162964 -200208 -15771
21509 -15771 80409 70651 31799 46975 -83190 -215693 -261332 -60405 91432 321850 314316
$$ packed form
21584b22089m2514q7492J03149K54982n903j52006j41252j23526K34377K97826
21574A15552j3339j24885K5109l7618J1763m3366r4807M6203J06566N2359k1900
21563B1637P8656J67222j61540j46892q1625J51051N487p4793j51900q9697J11584
21552a70810J55128J5760J73619j47899j61908o0904J6806P2009j08433r147K55502
21541B9723M140k10627j2204L16378j12192j1422J53464n8376k71524j47840J52979
21530a67501P8217K53044P8153n9405j42307j15320Q7695J07877J9867L2439N9015
21519B31774j17590j02926P4637R0796j62325q6876M4196j34650l7244J84437
21509a5771R6180r758l8852J5176j30165j32503m5639K00927J51837K30418p534
$$ plain form
21498 314316 128400 -13234 105525 155198 191502 153436 93898 118781 23954 232623 195234
21487 195234 -59000 -117024 -144601 -177509 -256388 -334718 -301008 -184913 -211158 -230813 -92010
21476 -92010 -40244 66675 74868 -80605 -114959 -253849 -178102 -60893 -22071 5853 -4668
21465 -4668 -32536 -38947 21801 10705 -250907 -258094 -185818 105528 75741 323973 422488 287662
21453 287662 103567 -21339 -119570 -142162 -30978 -98915 -97541 -82920 -67012 -93505 -133590
21442 -133590 -22668 46325 127255 210824 -2022 72800 -37599 -227939 -249660 -191496 -151889
21431 -151889 -293203 -245331 -31070 146378 50326 104570 -22565 -248580 -270132 -176794
21421 -176794 -302260 -243812 -50896 -39412 -163242 -223336 -287957 -314834 -450624 -359366 -254151
$$ packed form
21498C14316j85916j41634J18759M9673L6304l8066n9538K4883r4827K08669l7389
21487A95234k54234n8024k7577l2908p8879p8330L3710J16095k6245j9655J38803
21476i2010N1766J06919Q193j55473l4354j38890P5747J17209L8822K7924j0521
21465d668k7868o411O0748j1096k61612p187P2276K91346k9787K48232R8515j34826
21453B87662j84095j24906r8231k2592J11184o7937J374J4621J5908k6493m0085
21442a33590J10922O8993Q0930Q3569k12846P4822j10399j90340k1721N8164L9607
21431a51889j41314M7872K14261J77448r6052N4244j27135k26015k1552R3338
21421a76794j25466N8448J92916J1484j23830o0094o4621k6877j35790R1258J05215
$$ plain form
21410 -254151 -118517 834 113382 22708 -25162 -30174 -167581 -206220 94888 274369
21400 274369 167250 -27106 -260714 -263429 -116753 -150950 143080 289114 179797 216999
21390 216999 267292 318360 210101 203974 240220 153935 16147 103218 107162 61345 106887
21379 106887 269537 165428 -21169 -30991 -30164 -7014 -18865 19893 -32204 -101390 -159774
21368 -159774 -242890 -250694 -359044 -154129 -128957 -129995 -48821 -18707 -57564 -155249 -269613
21357 -269613 -250730 22584 -68761 -161399 -82229 60161 -90079 -122397 -105484 -64441 -61388
21346 -61388 -47180 -330113 -167182 -236669 -419040 -402703 -397672 -124218 44357 -15543 -143720
21335 -143720 107731 103296 -569 37328 15318 -289472 -294059 -211011 -90981 -109030 -217609
$$ packed form
21410b54151J35634J19351J12548r0674m7870n012j37407l8639L01108J79481
21400B74369j07119j94356k33608k715J46676l4197K94030J46034j09317L7202
21390B16999N0293N1068j08259o127L6246q6285j37788Q7071L944m5817M5542
21379A06887J62650j04109j86597r822Q27K3150j1851L8758n2097o9186n8384
21368a59774q3116p804j08350K04915K5172j038Q1174L0114l8857r7685j14364
21357b69613J8883K73314r1345r2638P9170J42390j50240l2318J6913M1043L053
21346f1388J4208k82933J62931o9487j82371J6337N031K73454J68575n9900j28177
21335a43720K51451m435j03865L7897k2010l04790m587Q3048J20030j8049j08579
$$ plain form
21324 -217609 -213937 -95954 -27881 -117128 -46718 36763 15640 129 -97017 -76300 -17227
21313 -17227 -132006 -4976 -78683 3987 217761 206665 249611 124343 86417 223965 189181
21302 189181 -53141 -148696 -225862 -157920 -64862 15976 46123 -90770 -208377 -214477 -163284
21291 -163284 95448 147915 132459 -141671 -231617 -111536 -159497 -42824 8319 -60510 -186146
21280 -186146 -130444 59721 86790 21960 137501 137313 219277 167445 -115769 -36329 -83443
21269 -83443 -350173 -452143 -336552 -167314 -242730 -473632 -600587 -446923 -114223 -53369
21259 -53369 -68049 -261031 -572031 -570444 -463820 -444119 -424983 -353184 -260928 -211299 -179853
21248 -179853 -262379 -171443 -80261 -48087 -104703 -283095 -413023 -278028 -82162 8668 -10535
$$ packed form
21324b17609L672J17983O8073q9247P0410Q3481k1123j5511r7146K0717N9073
21313a7227j14779J27030p3707Q2670K13774j1096M2946j25268l7926J37548l4784
21302A89181k42322r5555p7166O7942R3058Q0838L0147j36893j17607o100N1193
21291a63284K58732N2467j5456k74130q9946J20081m7961J16673N1143o8829j25636
21280a86146N5702J90165K7069o4830J15541j88Q1964n1832k83214P9440m7114
21269h3443k66730j01970J15591J69238p5416k30902j26955J53664L32700O0854
21259e3369j4680j92982l11000J587J06624J9701J9136P1799R2256M9629L1446
21248a79853q2526R0936R1182L2174n6616j78392j29928J34995J95866R0830j9203
$$ plain form
21237 -10535 -112625 -28608 19080 3901 -64847 -215366 -341056 -262262 -198464 -91248 -194154
21226 -194154 -317081 -230929 -78886 -149347 -198603 -225030 -189893 -94356 -48439 -108321 -73660
21215 -73660 -9660 -76968 -49194 -68759 -82882 -99195 -25448 -31377 -236089 -330991 -281247 -99280
21203 -99280 7305 126208 108225 77316 -12804 101495 180092 88525 79913 46247 22769
21192 22769 -66771 -205980 -123434 -113017 -133906 -136617 -56047 27467 55587 40707 151692
21181 151692 146360 9188 -138456 -46859 169068 86055 -162159 -150481 -126249 -273115 -388111
21170 -388111 -205964 70954 -127784 -174888 128199 176100 204298 158293 39516 85551
21160 85551 172758 302445 252473 -77221 -339579 -241817 -63623 -68025 3095 -45463 -54977
$$ packed form
21237a0535j02090Q4017M7688j5179o8748j50519j25690P8794O3798J07216j02906
21226a94154j22927Q6152J52043p0461m9256k6427L5137R5537M5917n9882L4661
21215g3660O4000o7308K7774j9565j4123j6313P3747n929k04712r4902M9744J81967
21203i9280J06585J18903j7983l0909r0120J14299P8597r1567q612l3666k3478
21192B2769q9540j39209Q2546J0417k0889k711Q0570Q3514K8120j4880J10985
21181A51692n332j37172j47644R1597K15927q3013k48214J1678K4232j46866j14996
21170c88111J82147K76918j98738m7104L03087M7901K8198m6005j18777M6035
21160H5551Q7207J29687m9972l29694k62358R7762J78194m402P1120m8558r514
$$ plain form
21149 -54977 45277 78695 1460 76882 -125016 -339896 -511987 -266905 -166223 -140063
21139 -140063 -8642 -52927 -125113 -133463 -206150 -278792 -291838 -313053 -335480 -235574 -145870
21128 -145870 -135124 -67699 -126646 -61333 31119 -52443 -75823 69442 175833 88192 70853
21117 70853 54597 18162 36713 40529 -2684 -80053 -77467 -58259 -65831 44810 140148 16432
21105 16432 -208786 -136260 -128359 -129198 -218028 -212132 -97566 155837 170798 -2912 -134283
21094 -134283 -63675 -44730 30077 130989 79968 176670 237232 216204 214534 149642 148629 94671
21082 94671 76058 98176 214082 224820 86893 -42730 -184091 -278852 -323076 -301382 -150010
21071 -150010 -152729 -244123 -88475 312993 285172 240053 277320 93123 -87235 -44407 -262510
$$ packed form
21149e4977J00254L3418p7235P5422k01898k14880j72091K45082J00682K6160
21139a40063J31421m4285p2186q350p2687p2642j3046k1215k2427R9906Q9704
21128a45870J0746O7425n8947O5313R2452q3562k3380J45265J06391q7641j7339
21117G0853j6256l6435J8551L816m3213p7369K586J9208p572J10641R5338j23716
21105A6432k25218P2526P901q39q8830N896J14566K53403J4961j73710j31371
21094a34283P0608J8945P4807J00912n1021R6702O0562k1028j670o4892j013n3958
21082I4671j8613K2118J15906J0738j37927j29623j41361r4761m4224K1694J51372
21071a50010k719r1394J55648M01468k7821m5119L7267j84197j80358M2828k18103
$$ plain form
21060 -262510 -300192 -162292 -80267 -98257 -264136 -199873 -9720 88568 257157 278037 90710
21049 90710 1855 -106438 -202583 -159633 -86894 40353 31231 -27113 -76810 12506 -85363
21038 -85363 -25137 178811 310408 285982 141454 187019 221175 310616 55687 -261998 -254802
21027 -254802 -231650 -242982 -180126 -125308 -198623 -198068 -136140 -58806 40065 99844 169113 86455
21015 86455 -45883 -299459 -409316 -189048 51906 150300 264079 458089 289223 -82145
21005 -82145 -199834 -78702 -87510 -100112 21044 146184 120885 -95011 -253467 -313133 -350702
20994 -350702 -267078 -163336 -171138 -139759 42780 -46057 -104136 -104634 -255059 -2223 55219
20983 55219 -3292 -76021 102999 174032 26940 11439 -91996 -7298 114885 155755 161776
$$ packed form
21060b62510l7682J37900Q2025j7990j65879O4263J90153R8288J68589K0880j87327
21049I0710q8855j08293r6145M2950P2739J27247r122n8344m9697Q9316r7869
21038h5363O0226K03948J31597k4426j44528M5565L4156Q9441k54929l17685P196
21027b54802K3152j1332O2856N4818p3315N55O1928P7334R8871N9779O9269q2658
21015H6455j32338k53576j09857K20268K40954R8394J13779J94010j68866l71368
21005h2145j17689J21132q808j2602J21156J25140k5299k15896j58456n9666l7569
20994c50702Q3624J03742p802L1379J82539q8837n8079m98j50425K52836N7442
20983E5219n8511p2729J79020P1033j47092j5501j03435Q4698J22183M0870O021
$$ plain form
20972 161776 12055 -65736 -1364 -36593 -161514 -143823 -150680 -125099 -165909 38759 241456
20961 241456 7628 -259081 -460094 -377991 -162782 -182357 -303108 -325474 -314000 -315479 -309027
20950 -309027 -318659 -110976 -125956 -68443 -48203 -31728 -11312 -54932 -116891 -195467 -66998
20939 -66998 -15134 -35918 -71971 -183828 -119526 10391 -260253 -578491 -467345 -286076
20929 -286076 -337426 -331983 -408602 -381670 -333276 -166199 -145497 -247423 -101879 -17703 134672
20918 134672 145437 237924 229166 484296 522171 473960 458297 604861 706507 597405 563869
20907 563869 637127 411307 130722 48526 -61914 148312 170323 181951 297643 331360
20897 331360 444494 458254 394211 405226 531598 590970 514779 457824 418017 633673 557616
$$ packed form
20972A61776j49721p7791O4372l5229j24921J7691o857K5581m0810K04668K02697
20961B41456k33828k66709k01013Q2103K15209j9575j20751k2366J1474j479O452
20950c09027r632K07683j4980N7513K0240J6475K0416m3620o1959p8576J28469
20939f6998N1864k0784l6053j11857O4302J29917k70644l18238J11146J81269
20929b86076n1350N443p6619K6932M8394J67077K0702j01926J45544Q4176J52375
20918A34672J0765R2487q758K55130L7875m8211j5663J46564J01646j09102l3536
20907E63869P3258k25820k80585q2196j10440K10226K2011J1628J15692L3717
20897C31360J13134J3760o4043J1015J26372N9372p6191n6955l9807K15656p6057
$$ plain form
20886 557616 371204 411207 358413 69283 -223225 -282544 29219 229442 226187 42584
20876 42584 50691 101368 128807 -7871 -25297 -4978 -159412 -252768 -254207 -176476 24746
20865 24746 -27927 33174 123126 183843 149428 82627 125986 189684 166670 76771 86478 -80173
20853 -80173 -132716 27817 -139885 -145471 -80091 -85498 -164764 -58864 40780 -51986 -50724 -228687
20841 -228687 -342807 -160767 -34495 -40433 59404 94168 -108070 -301504 -180339 -42632
20831 -42632 -82186 -111044 -304596 -325830 -282521 -239907 -237642 -197325 -64162 -85662 -7909
20820 -7909 106622 159233 -8905 -32939 129637 258350 151463 60593 20055 -129821 -122985
20809 -122985 -44997 -78046 -94573 210475 306316 54302 82585 137651 122551 -141842 -196881
$$ packed form
20886E57616j86412M0003n2794k89130k92508n9319L11763K00223l255j83603
20876D2584Q107N0677K7439j36678j7426K0319j54434r3356j439P7731K01222
20865B4746n2673O1101Q9952O0717l4415o6801M3359O3698k3014q9899R707j66651
20853h0173n2543J60533j67702n586O5380n407p9266J05900R9644r2766J262j77963
20841b28687j14120J82040J26272n938R9837L4764k02238j93434J21165J37707
20831d2632l9554k8858j93552k1234M3309M2614K265M0317J33163k1500P7753
20820g909J14531N2611j68138k4034J62576J28713j06887r0870m0538j49876O836
20809a22985P7988l3049j6527L05048R5841k52014K8283N5066j5100k64393n5039
$$ plain form
20798 -196881 -164723 -104169 3090 16826 46309 80645 42619 -2846 26611 80626 -88231
20787 -88231 24509 59591 -234836 -565366 -418136 -260896 -181436 118161 325211 185780
20777 185780 26947 -10372 38357 -64788 -206879 -240909 -364703 -242365 -103108 -86964
20767 -86964 -68816 -57704 27551 6089 -96486 626 130028 175836 131313 66913 928
20756 928 -309968 -362984 -323343 -253015 -140466 -93535 9379 14742 -82130 -81818 27286 -35035
20744 -35035 -225218 -143108 -92668 -45012 -33420 -21979 99463 170791 120964 -70706 -175618
20733 -175618 -162045 -58654 -131548 -247842 -319031 -335061 -208359 -3499 38639 9841 -123449
20722 -123449 -145349 47923 -22225 -227568 -167192 -150194 -139529 -86092 46057 315295 334268
$$ packed form
20798a96881L2158O0554J07259J3736K9483L4336l8026m5465K9457N4015j68857
20787h8231J12740L5082k94427l30530J47230J57240P9460K99597K07050j39431
20777A85780j58833l7319M8729j03145j42091l4030j23794J22338J39257J6144
20767h6964J8148J1112Q5255k1462j02575R7112J29402M5808m4523o4400o5985
20756I28l10896n3016L9641P0328J12549M6931J02914N363r6872L12J09104o2321
20744c5035j90183Q2110N0440M7656J1592J1441J21442P1328m9827j91670j04912
20733a75618J3573J03391p2894j16294p1189j6030J26702K04860M2138k8798j33290
20722a23449k1900J93272p0148k05343O0376J6998J0665N3437J32149K69238J8973
$$ plain form
20711 334268 147325 -100829 -149947 -61697 40246 121113 144493 120598 36026 -14709 -81056
20700 -81056 -210587 -344417 -204623 -275235 -248784 -25136 191000 134319 34483 144023
20690 144023 88171 198981 49333 -111078 80236 34837 134960 122170 205077 211314 151107
20679 151107 132703 -33092 -247543 -236999 -193542 -277385 -112588 230457 222542 129563 20474
20668 20474 -98591 -181970 -202523 -147690 54631 49931 106268 191694 183652 232381 160233 26718
20656 26718 9768 201043 181022 -72338 -69557 51286 -74958 -186652 -204489 -168002 -200654
20645 -200654 7631 68339 -96140 -205206 -122512 -37817 -26082 -189625 -239773 -265533 -25341
20634 -25341 54431 17019 -58848 62314 127949 33589 12057 -99700 -298476 -316985 -223659
$$ packed form
20711C34268j86943k48154m9118Q8250J01943Q0867K3380k3895q4572n0735o6347
20700h1056j29531j33830J39794p0612K6451K23648K16136n6681r9836J09540
20690A44023n5852J10810j49648j60411J91314m5399J00123j2790Q2907O237o0207
20679A51107j8404j65795k14451J0544M3457q3843J64797L43045p915r2979j09089
20668B0474j19065q3379k0553N4833K02321m700N6337Q5426q042M8729p2148j33515
20656B6718j6950J91275k0021k53360K781J20843j26244j11694j7837L6487l2652
20645b00654K08285O0708j64479j09066Q2694Q4695J1735j63543n0148k5760K40192
20634b5341P9772l7412p5867J21162O5635r4360k1532j11757j98776j8509R3326
$$ plain form
20623 -223659 -41890 -208808 -124613 -212060 -309057 -147629 -120685 28684 324280 247765
20613 247765 129655 308014 280143 222169 -1722 -113589 -133222 -25027 11263 -273770
20603 -273770 -371945 -345164 -125051 -119432 -5620 283098 305945 195963 173328 150485 98374
20592 98374 187814 473128 365013 73933 -4511 -91697 -147791 -287789 -355743 -360141 -153595
20581 -153595 -174598 -60273 -5309 37429 -7155 -135783 7213 241718 187322 36363
20571 36363 -70424 -38520 83916 22699 -66806 -128300 -81115 -136437 15171 34768 -102474
20560 -102474 -259213 -128279 -14558 38223 23510 118632 116105 231109 107662 206996 264170
20549 264170 57787 31441 178749 186672 107534 217820 219998 43679 12087 107387 153920
$$ packed form
20623b23659J81769j66918Q4195q7447r6997J61428K6944J49369K95596p6515
20613B47765j18110J78359k7871n7974k23891j11867j9633J08195L6290k85033
20603b73770r8175K6781K20113N619J13812K88718K2847j09982k2635k2843n2111
20592I8374Q9440K85314j08115k91080p8444q7186n6094j39998o7954m398K06546
20581a53595k1003J14325N4964M2738m4584j28628J42996K34505n4396j50959
20571C6363j06787L1904J22436o1217q9505o1494M7185n5322J51608J9597j37242
20560a02474j56739J30934J13721N2781j4713R5122k527J15004j23447R9334N7174
20549B64170k06383k6346J47308P923p9138J10286K178j76319l1592R5300M6533
$$ plain form
20538 153920 167810 -479 -53413 -137420 -175954 -47495 -35587 -205403 -112713 -253071 -238579
20527 -238579 -92888 108309 176312 75740 3136 -128394 -40577 93862 -13077 -247239
20517 -247239 25475 107849 245676 265940 79752 147836 204641 -126319 -219538 -176438 -53965
20506 -53965 105304 31634 34450 128558 30134 50249 49020 -185010 -257603 -144070 -172487
20495 -172487 -146324 -12022 78149 82461 122876 276607 110312 -37828 -150449 -134137 -204418
20484 -204418 -295976 -257670 -293307 -211389 -338648 -287699 -266931 -283255 -328210 -402470 -410786
20473 -410786 -325997 -85305 94907 166961 241397 98054 82860 102892 21060 85578 -15323
20462 -15323 -141350 -198080 -164853 -123909 -85529 -279363 -265955 -61186 185681 148823 140447
$$ packed form
20538A53920J3890j68289n2934q4007l8534J28459J1908j69816R2690j40358J4492
20527b38579J45691K01197O8003j00572p2604j31530Q7817J34439j06939k34162
20517b47239K72714Q2374J37827K0264j86188O8084N6805l30960r3219M3100J22473
20506e3965J59269p3670K816R4108r8424K0115j229k34030p2593J13533k8417
20495a72487K6163J34302R0171M312M0415J53731j66295j48140j12621J6312p0281
20484b04418r1558L8306l5637Q1918j27259N0949K0768j6324m4955p4260q316
20473d10786Q4789K40692J80212P2054P4436j43343j5194K0032q1832O4518j00901
20462a5323j26027n6730L3227M0944L8380j93834J3408K04769K46867l6858q376
$$ plain form
20451 140447 165265 56158 -116776 -96665 -31321 89822 -14884 6964 -187670 -162576
20441 -162576 -77410 154678 163842 9996 12783 195690 214853 346684 508591 376340 265359
20430 265359 405450 366850 399346 391933 318513 286060 136260 194466 351694 631815 637843
20419 637843 609573 796317 836123 810450 762371 850333 696877 493616 435174 550905 635212
20408 635212 380081 226806 180973 232786 360682 372107 462266 403768 446714 458595 264144
20397 264144 188117 333385 232960 223056 477037 645474 717861 801584 894263 954364 912426
20386 912426 987324 906533 858902 698411 702763 684695 553852 506560 485993 700215 668204
20375 668204 609360 751396 989494 1149627 1139060 1033073 1083762 1151417 1217225 1256544 1267338
$$ packed form
20451A40447K4818j09107j72934K0111O5344J21143j04706K1848j94634K5094
20441a62576Q5166K32088R164j53846K787J82907J9163J31831J61907j32251j10981
20430B65359J40091l8600L2496p413p3420l2453j49800N8206J57228K80121O028
20419F37843k8270J86744L9806k5673m8079Q7962j53456k03261n8442J15731Q4307
20408F35212k55131j53275m5833N1813J27896J1425R0159n8498M2946J1881j94451
20397B64144p6027J45268j00425r904K53981J68437P2387Q3723R2679O0101m1938
20386I12426P4898q0791m7631j60491M352j8068j30843m7292k0567K14222l2011
20375F68204n8844J42036K38098J60133j0567j05987N0689O7655O5808L9319J0794
$$ plain form
20364 1267338 1301794 1260396 1119835 1262280 1343426 1275836 1381984 1513430 1388718 1167137
20354 1167137 1280029 1484969 1455601 1275762 1344940 1678623 1876141 2079272 2206229 2228870
20344 2228870 2320710 2239722 2461902 2830053 3041144 3431062 3951023 4171305 4283393 4475491
20334 4475491 4841753 5159513 5437925 5558169 5735858 6099053 6535682 7160127 7829811
20325 7829811 8699554 9841939 11293661 13412091 16158177 19504040 23458158 28843209
20317 28843209 35920403 44866137 56755539 71840544 90109864 110413506 129530296
20310 129530296 142103250 146282110 145175159 139805813 127988252 110193521 91982993
20303 91982993 77756400 69332426 66410183 68149618 74242103 84591650 99033539 116872372
$$ packed form
20364A267338L4456m1398j40561J42445Q1146o7590J06148J31446j24712k21581
20354A167137J12892K04940k9368j79839O9178L33683J97518K03131J26957K2641
20344B228870R1840q0988K22180L68151K11091L89918N19961K20282J12088J92098
20334D475491L66262L17760K78412J20244J77689L63195M36629O24445O69684
20325G829811Q69743J142385J451722K118430K746086L345863L954118N385051
20317B8843209P077194Q945734J1889402J5085005J8269320K0303642J9116790
20310A29530296J2572954M178860j106951n369346j1817561j7794731j8210528
20303I1982993j4226593q423974k922243J739435O092485J0349547J4441889J7838833
$$ plain form
20295 116872372 135663229 150350022 156192384 154537388 148713337 138087696 120470583
20288 120470583 99086241 79504420 64005044 52924208 45372188 39993676 35957788
20281 35957788 32736779 29981791 27661442 25700672 24057181 22587281 21186749 19944585
20273 19944585 19035631 18370707 17812134 17381477 16987520 16619619 16268592 15853561 15341541
20264 15341541 14651829 13662484 12585039 11858808 11150461 10399275 9559119 9081000 8685531
20255 8685531 8247736 7877665 7473986 6972628 6452377 5997234 5675336 5536718 5276410
20246 5276410 5036829 4641448 4436412 4191211 4147160 4121937 3758795 3432107 3421839 3416331
20236 3416331 3373199 3246220 2811355 2481991 2379449 2317107 2078171 1858165 1804544 1853093
$$ packed form
20295A16872372J8790857J4686793N842362j654996n824051j0625641j7617113
20288A20470583k1384342j9581821j5499376j1080836p552020n378512m035888
20281C5957788l221009k754988k320349j960770j643491j469900j400532j242164
20273A9944585r08954o64924n58573m30657l93957l67901l51027m15031n12020
20264A5341541o89712r89345j077445p26231p08347p51186q40156m78119l95469
20255H685531m37795l70071m03679n01358n20251m55143l21898j38618k60308
20246E276410k39581l95381k05036k45201m4051k5223l63142l26688j0268n508
20236C416331m3132j26979m34865l29364j02542o2342k38936k20006n3621M8549
$$ plain form
20226 1853093 1801238 1771418 1619494 1672719 1621723 1492503 1452231 1403476 1356794 1321904 1257758
20215 1257758 1166302 1274729 1336322 1359671 1157740 756642 746933 988079 1013555 961729 994027
20204 994027 773048 586699 365273 345358 299923 168856 334006 528574 569837 397670
20194 397670 444860 436342 410156 178568 156720 222648 209118 84540 118817 272136 348550
20183 348550 309180 324917 336665 404505 460683 361593 147184 188705 159334 246854 327187
20172 327187 182885 179562 386462 335151 149596 191790 312798 445550 470515 404885 386110
20161 386110 341329 363276 366438 336060 285781 242891 321258 445389 538015 531183 486336 620203
20149 620203 669589 708583 575486 470697 226513 124784 240336 422902 420662 567748
$$ packed form
20226A853093n1855k9820j51924N3225n0996j29220m0272m8755m6682l4890o4146
20215A257758r1456J08427O1593K3349k01931m01098r709K41146K5476n1826L2298
20204I94027k20979j86349k21426j9915m5435j31067J65150J94568M1263j72167
20194C97670M7190q518k6186k31588k1848O5928j3530j24578L4277J53319P6414
20183C48550l9370J5737J1748O7840N6178r9090k14409M1521k9371Q7520Q0333
20172C27187j44302l323K06900n1311j85555M2194J21008J32752K4965o5630j8775
20161C86110m4781K1947L162l0378n0279m2890P8367J24131R2626o832m4847J33867
20149F20203M9386L8994j33097j04789k44184j01729J15552J82566k240J47086
$$ plain form
20139 567748 664039 528600 237662 160000 105102 181637 313429 303767 305954 237422 220261
20128 220261 191395 336915 251342 159451 315238 527286 584705 701897 663937 537893
20118 537893 608748 605856 564806 477003 355848 292438 282308 241333 309262 353739 428336
20107 428336 319631 364634 231848 79537 154724 211498 356342 429507 273639 94376
20097 94376 -154403 -143651 -45480 32647 11847 -130406 -127912 140671 52785 15794 112121
20086 112121 22334 -76379 -176173 -124567 -125656 70915 140260 135437 146983 141791 142466 209098
20074 209098 23022 -250733 -388506 -325578 -302504 -283541 -400592 -351893 -176709 130254
20064 130254 321518 315322 315761 265740 196929 84116 80141 157344 89740 168378 194275 188654
$$ packed form
20139E67748R6291j35439k90938p7662n4898P6535J31792r662K187o8532j7161
20128B20261k8866J45520q5573r1891J55787K12048N7419J17192l7960j26044
20118E37893P0855k892m1050q7803j21155o3410j0130m0975O7929M4477P4597
20107D28336j08705M5003j32786j52311P5187N6774J44844P3165j55868j79263
20097I4376k48779J0752R8171P8127k0800j42253K494K68583q7886l6991R6327
20086A12121q9787r8713r9794N1606j089J96571O9345m823J1546n192O75O6632
20074B09098j86076k73755j37773O2928K3074J8963j17051M8699J75184L06963
20064A30254J91264o196M39n0021o8811j12813l975P7203o7604P8638K5897n621
$$ plain form
20052 188654 250770 163379 137834 330278 206204 284608 427570 392936 480726 436669 291564
20041 291564 268167 208854 -23797 -138047 -9265 223623 181321 -50448 -171950 -214348
20031 -214348 -148597 -209352 -185851 -200241 1202 158868 112500 263942 382720 252583
20021 252583 175863 101634 61593 -136515 -208804 -74112 22294 -5461 -48621 -32129 -33616
20010 -33616 81984 -76881 5838 101193 166461 175994 95891 106053 190904 225998 250055
19999 250055 -63488 -247050 -224857 -190451 -258714 -302385 -154975 120244 67703 -107309
19989 -107309 -24345 20655 -6837 89251 -914 -91563 -94541 35645 209331 285003 305809
19978 305809 304424 128898 -463 54579 147502 258893 60724 5054 52618 205414 158118
$$ packed form
20052A88654O2116q7391k5545J92444j24074P8404J42962l4634Q7790m4057j45105
20041B91564k3397n9313k32651j14250J28782K32888m2302k31769j21502m2398
20031b14348O5751o0755K3501j4390K01443J57666m6368J51442J18778j30137
20021B52583p6720p4229m0041j98108p2289J34692R6406k7755m3160J6492j487
20010c3616J15600j58865Q2719R5355O5268R533q0103J0162Q4851L5094K4057
19999B50055l13543j83562K2193L4406o8263m3671J47410K75219n2541j75012
19989a07309Q2964M5000k7492R6088r0165r0649k978J30186J73686P5672K0806
19978C05809j385j75526j29361N5042R2923J11391j98169n5670M7564J52796m7296
$$ plain form
19967 158118 245924 642022 656489 458265 352008 581964 401715 362594 269471 170130
19957 170130 180625 43006 -12015 7544 50210 232957 331007 399578 211982 151033 165919
19946 165919 133766 195902 281825 212760 125057 192391 240673 218953 273892 394374 375853
19935 375853 296144 463591 537932 446913 468489 549772 501281 545150 577790 495498 466900
19924 466900 369301 386667 418850 415029 445333 491787 525047 476413 451777 613786 596419
19913 596419 428176 304151 509682 667523 559723 463021 370027 433803 363932 335127
19903 335127 276436 195800 245173 423905 385073 180607 128650 215436 328249 260302 228435
19892 228435 168262 76476 133650 189548 271051 215556 257497 487493 521093 400352 389442
$$ packed form
19967A58118Q7806L96098J4467j98224j06257K29956j80249l9121r3123r9341
19957A70130J0495j37619n5021J9559M2666J82747R8050O8571j87596o0949J4886
19946A65919l2153O2136Q5923o9065q7703O7334M8282k1720N4939J20482j8521
19935C75853p9709J67447P4341r1019K1576Q1283m8491M3869L2640q2292k8598
19924D66900r7599J7366L2183l821L0304M6454L3260m8634k4636J62009j7367
19913E96419j68243j24025K05531J57841j07800r6702r2994O3776o9871k8805
19903C35127n8691q0636M9373J78732l8832k04466n1957Q6786J12813o7947l1867
19892B28435o0173r1786N7174N5898Q1503n5495M1941K29996L3600j20741j0910
$$ plain form
19881 389442 498895 330423 254264 380314 440172 311912 456900 574608 603634 568316
19871 568316 607217 578394 726065 688138 724625 850611 948599 1199608 1220406 1045163 859935
19860 859935 720978 838657 681845 623696 653170 727401 710983 477705 306427 231642
19850 231642 362094 516086 444408 359194 226255 155616 72941 32271 63124 201299 381107
19839 381107 556446 603016 560296 384894 368261 324874 333990 314425 353829 434039 442001
19828 442001 445568 516755 425899 179370 220660 464235 541364 713058 749199 655542 684163
19817 684163 792046 692457 458025 415158 246697 301659 458101 405186 295982 457521
19807 457521 402437 408969 357000 328742 288583 229006 84464 87555 293525 396078 284566
$$ packed form
19881C89442J09453j68472p6159J26050N9858j28260J44988J17708K9026l5318
19871E68316L8901k8823J47671l7927L6487J25986R7988K51009K0798j75243j85228
19860H59935j38957J17679j56812n8149K9474P4231j6418k33278j71278p4785
19850B31642J30452J53992p1678q5214j32939p0639q2675m0670L0853J38175J79808
19839C81107J75339M6570m2720j75402j6633m3387R116j9565L9404Q0210P962
19828D42001L567P1187r0856k46529M1290K43575P7129J71694L6141r3657K8621
19817F84163J07883r9589k34432m2867j68461N4962J56442n2915j09204J61539
19807D57521n5084O532n1969k8258m0159n9577j44542L091K05970J02553j11512
$$ plain form
19796 284566 300663 500770 514808 332796 354983 426169 560567 587053 447146 313476
19786 313476 310702 341001 161582 306815 501461 391007 506073 546724 471572 506548 527461
19775 527461 421884 550184 627490 571289 712813 791585 584829 463089 491211 413459
19765 413459 450463 645696 828644 860387 979592 956404 706335 503384 522255 681580
19755 681580 658441 520609 232236 153708 223887 127305 -4509 33329 87823 170426 222195
19744 222195 264286 200210 50292 118096 232285 364177 397762 285835 364379 104645
19734 104645 112629 182689 122939 120895 168361 210970 377898 250114 -5147 -123822 -45886
19723 -45886 112754 -91491 -198651 -128561 153216 256090 69952 -1587 -119568 -7906
$$ packed form
19796B84566J6097K00107J4038j82012K2187P1186J34398K6486j39907j33670
19786C13476k774L0299j79419J45233J94646j10454J15066M0651p5152L4976K0913
19775E27461j05577J28300P7306n6201J41524P8772k06756j21740K8122p7752
19765D13459L7004J95233J82948L1743J19205k3188k50069k02951J8871J59325
19755F81580k3139j37832k88373p8528P0179r6582j31814L7838N4494Q2603N1769
19744B22195M2091o4076j49918O7804J14189J31892L3585j11927P8544k59734
19734A04645P984P0060n9750k044M7466M2609J66928j27784k55261j18675P7936
19723d5886J58640k04245j07160P0090K81777J02874j86138p1539j17981J11662
$$ plain form
19713 -7906 296676 407653 402516 412590 470559 335053 151705 237163 316646 615093 771616
19702 771616 604800 688271 673603 634778 712492 540836 451762 538630 408702 227382 265487
19691 265487 245650 387150 443889 457771 597160 780413 887362 848420 822312 698017
19681 698017 846004 741997 550587 481070 509253 375307 274108 441276 447717 399936
19671 399936 320885 285243 257297 159581 66311 83627 196061 252857 307954 284285 350763
19660 350763 431966 304189 147393 96183 -148456 -65312 145323 228206 222059 -32 40884
19649 40884 12899 75874 -35687 -21264 29383 -126110 -45004 -61756 -76188 -33055 109818
19638 109818 162422 -13248 -13955 -90492 102008 74258 -94609 -83827 104205 114556 56478
$$ packed form
19713g906L04582J10977n137J0074N7969j35506j83348Q5458P9483K98447J56523
19702G71616j66816Q3471j4668l8825P7714j71656q9074Q6868j29928j81320L8105
19691B65487j9837J41500N6739J3882J39389J83253J06949l8942k6108j24295
19681F98017J47987j04007j91410o9517K8183j33946j01199J67168O441m7781
19671C99936p9051l5642k7946r7716r3270J7316J12434N6796N5097k3669O6478
19660C50763Q1203j27777j56796n1210k44639Q3144K10635Q2883o147k22091M0916
19649D0884k7985O2975j11561J4423N0647j55493Q1106j6752j4432M3133J42873
19638A09818N2604j75670p07p6537J92500k7750j68867J0782J88032J0351n8078
$$ plain form
19627 56478 126353 290117 273852 178534 119357 117988 177233 217913 169209 228674 145631 93804
19615 93804 -88558 -96283 -103654 -9748 404233 598399 702965 857326 1107406 1321148 1395638
19604 1395638 1180989 960690 901790 917140 814161 638033 620050 686985 747794 764499
19594 764499 642970 626190 650448 784266 727084 774407 796976 589609 474201 367444
19584 367444 149550 136407 193898 169103 71042 -47903 -16126 125431 173329 366525 402633
19573 402633 453708 343335 302464 514914 749589 829606 661789 481318 447557 469578
19563 469578 366865 221830 220706 259094 353006 409849 375945 305218 276192 257592 284931
19552 284931 376067 584379 624952 645446 546635 559698 445218 260859 113646 100750 54270
$$ packed form
19627E6478O9875J63764j6265r5318n9177j369N9245M0680m8704N9465q3043n1827
19615I3804j82362p725p371R3906M13981J94166J04566J54361K50080K13742P4490
19604A395638k14649k20299n8900J5350j02979j76128j7983O6935O0809J6705
19594G64499j21529j6780K4258J33818n7182M7323K2569k07367j15408j06757
19584C67444k17894j3143N7491k4795r8061j18945L1777J41557M7898J93196L6108
19573D02633N1075j10373m0871K12450K34675Q0017j67817j80471l3761K2021
19563D69578j02713j45035j124L8388R3912N6843l3904p0727k9026j8600K7339
19552B84931R1136K08312M0573K0494r8811J3063j14480j84359j47213j2896m6480
$$ plain form
19541 54270 -48983 428 -85774 -42916 78236 273280 432101 523379 399916 194776
19531 194776 259083 358616 334471 258176 -29216 -17535 128651 271944 199502 102870 405151
19520 405151 471059 494785 263756 160705 203517 347402 453244 560997 497850 251274
19510 251274 60306 24626 229498 256136 157818 217326 247290 266483 358384 336727 228250
19499 228250 309594 365946 311371 236416 348929 457858 545695 466489 666701 655984 467638
19488 467638 259732 219593 108533 173078 206143 334771 420556 671412 978057 1320080
19478 1320080 1404947 1455908 1635048 1476871 1318105 1260416 1178400 1041664 966445 1022325
19468 1022325 1147121 1209496 1345832 1260515 1162876 1187046 1226056 1180762 1252442 1138146 1197857
$$ packed form
19541E4270j03253M9411q6202M2858J21152J95044J58821R1278j23463k05140
19531A94776O4307R9533k4145p6295k87392J1681J46186J43293p2442r6632L02281
19520D05151O5908K3726k31029j03051M2812J43885J05842J07753o3147k46576
19510B51274j90968l5680K04872K6638r8318N9508K9964J9193R1901k1657j08477
19499B28250Q1344N6352n4575p4955J12513J08929Q7837p9206K00212j0717j88346
19488D67638k07906m0139j11060O4545L3065J28628Q5785K50856L06645L42023
19478A320080Q4867N0961J79140j58177j58766n7689q2016j36736p5219N5880
19468A022325J24796O2375J36336q5317r7639K4170L9010m5294P1680j14296N9711
$$ plain form
19457 1197857 1346679 1261469 1254068 1434745 1493734 1648135 1850556 2007125 1993907 1961126
19447 1961126 1916518 1950400 1998512 2070414 2191918 2428002 2599899 2744242 3109766 3304299
19437 3304299 3491904 3908356 4145075 4429542 4856677 5047292 5297022 5654433 6277536
19428 6277536 6957804 8200042 9600372 11334968 13513144 15899521 18564140 20995265
19420 20995265 22891213 24300652 26164873 29034479 33297620 40084674 49583472 61826924
19412 61826924 76758385 93545529 108828708 116995539 116119301 109377453 100903877 92382130
19404 92382130 83134967 73146304 63856023 56793596 52583318 50882874 51421345 53028966
19396 53028966 54667816 54770492 52148542 47249409 41145648 35754811 31373298 28436426
$$ packed form
19457A197857J48822q5210p401J80677N8989J54401K02421J56569j3218l2781
19447A961126m4608L3882M8112P1902J21504K36084J71897J44343L65524J94533
19437C304299J87605M16452K36719K84467M27135J90615K49730L57411O23103
19428F277536O80268J242238J400330J734596K178176K386377K664619K431125
19420B0995265J895948J409439J864221K869606M263141O787054R498798J2243452
19412F1826924J4931461J6787144J5283179Q166831q76238o741848q473576q521747
19404I2382130r247163r988663r290281p062427m210278j700444N38471J607621
19396E3028966J638850J02676k621950m899133o103761n390837m381513k936872
$$ plain form
19388 28436426 26572567 25453273 24930308 24889426 24723598 24581684 24619901 24736725 24942747
19379 24942747 25454864 26036305 26999103 28196338 30168196 33257827 37258565 42418886
19371 42418886 49047471 56979450 65588118 73957201 80259692 83392894 83623625 83122491
19363 83122491 83838391 87392532 95076849 107966860 127338575 153830038 188427566 230447362
19355 230447362 275930351 318182576 349043636 360645513 347923321 313150011 265283070
19348 265283070 216376083 175651885 146092015 126884914 115715440 109967170 106502989
19341 106502989 102589857 95834456 86419247 76112719 66868722 59409260 53782712 49680689
19333 49680689 46760618 44776898 43425164 42728275 42284238 42034434 41442138 40912619 40146042
$$ packed form
19388B8436426j863859j119294n22965m0882j65828j41914L8217J16824K06022
19379B4942747N12117N81441R62798J197235J971858L089631M000738N160321
19371D2418886O628585P931979Q608668Q369083O302491L133202K30731n01134
19363H3122491P15900L554141P684317J2890011J9371715K6491463L4597528M2019796
19355B30447362M5482989M2252225L0861060J1601877j2722192l4773310m7866941
19348B65283070m8906987m0724198k9559870j9207101j1169474n748270l464181
19341A06502989l913132o755401r415209j0306528r243997p459462n626548m102023
19333D9680689k920071j983720j351734o96889m44037k49804n92296n29519p66577
$$ plain form
19324 40146042 38980157 37713370 36569289 35710202 35318629 35216939 35351976 35654763 36448852
19315 36448852 37586834 39389498 42297121 46418345 51900130 58978233 67466234 77102391
19307 77102391 86845227 95183059 102293543 110088077 121175476 138125748 162488037 194655935
19299 194655935 233894820 276980836 316891234 343972616 350622971 334517157 300161289
19292 300161289 256573877 212885202 175280812 145994327 125074740 111304652 102931607
19285 102931607 98347193 96660664 96991059 97897246 97618036 94763506 88732944 80633482
19277 80633482 72197904 64271856 58062632 53470021 49860308 46979027 45042138 43246719
19269 43246719 41295854 39326034 37576679 36078044 34920454 33808641 33149289 32971351
$$ packed form
19324D0146042j165885j266787j144081q59087l91573j01690J35037L02787P94089
19315C6448852J137982J802664K907623M121224N481785P078103Q488001R636157
19307G7102391R742836Q337832P110484P794534J1087399J6950272K4362289L2167898
19299A94655935L9238885M3086016L9910398K7081382O650355j6105814l4355868
19292C00161289m3587412m3688675l7604390k9286485k0919587j3770088q373045
19285A02931607m584414j686529L30395R06187k79210k854530o030562q099462
19277H0633482q435578p926048o209224m592611l609713k881281j936889j795419
19269D3246719j950865j969820j749355j498635j157590j111813o59352j77938
$$ plain form
19261 32971351 33167668 33792488 35223024 37513800 40581948 44246380 48500113 53078017
19253 53078017 56889311 59055043 59074487 57606000 56316563 56645542 59322328 64559884
19245 64559884 72343787 82440132 93356857 102837919 110275831 115939249 119840098 119714521
19237 119714521 112277408 97802667 80539683 64903210 53211314 45162837 39914361
19230 39914361 36678092 34618917 33191214 31834129 30276239 28472109 26448851 24316526
19222 24316526 22364749 20812005 19619582 18685373 17850989 16986983 16337161 15722718 15040511
19213 15040511 14446103 13660907 12766453 12116468 11449564 10697042 10092643 9595228 9006584
19204 9006584 8332037 7828488 7595172 7328653 7215798 6924262 6582773 6609046 6548082 6256662
$$ packed form
19261C2971351J96317O24820J430536K290776L068148L664432M253733M577904
19253E3078017L811294K165732J9444j468487j289437L28979K676786N237556
19245F4559884P783903J0096345J0916725R481062P437912N663418L900849j25577
19237A19714521p437113j4474741j7262984j5636473j1691896q048477n248476
19230C9914361l236269k059175j427703j357085j557890j804130k023258k132325
19222B4316526j951777j552744j192423r34209q34384q64006o49822o14443o82207
19213A5040511n94408p85196q94454o49985o66904p52522o04399m97415n88644
19204I006584o74547n03549k33316k66519j12855k91536l41489K6273o0964k91420
$$ plain form
19194 6256662 5973558 5558576 5108227 4927691 4754496 4497821 4385331 4430174 4188734 3965718
19184 3965718 3952829 3884202 3691317 3487098 3393739 3189703 3019699 2940362 2882303 2751398
19174 2751398 2638286 2252721 2058801 2091528 2107303 2017783 2073289 2030502 2176144 2126510
19164 2126510 2115110 2153884 2055229 1958866 1845952 1742194 1678868 1680053 1523242 1445099 1457838
19153 1457838 1473446 1417075 1322658 1312595 1453492 1375044 1324137 1543475 1541886 1427327 1424792
19142 1424792 1511049 1613195 1776214 1849856 1820845 1821565 1593619 1465127 1474436 1547176 1618438
19131 1618438 1618506 1682361 1867719 1760664 1692729 1660530 1625399 1666933 1768939 1818103 1767018
19120 1767018 1638521 1692467 1808377 1778422 1791408 1901865 2012225 1875368 1757183 1753827
$$ packed form
19194F256662k83104m14982m50349j80536j73195k56675j12490M4843k41440k23016
19184C965718j2889o8627j92885k04219r3359k04036j70004p9337n8059j30905
19174B751398j13112l85565j93920L2727J5775q9520N5506m2787J45642m9634
19164B126510j1400L8774r8655r6363j12914j03758o3326J185j56811p8143J2739
19153A457838J5608n6371r4417j0063J40897p8448n0907K19338j589j14559k535
19142A424792Q6257J02146J63019P3642k9011P20k27946j28492R309P2740P1262
19131A618438O8O3855J85358j07055o7935l2199l5131M1534J02006M9164n1085
19120A767018j28497N3946J15910k9955J2986J10457J10360j36857j18185l356
$$ plain form
19110 1753827 1801877 1727061 1574534 1666257 1669368 1647058 1570700 1447768 1313948 1447655 1491563
19099 1491563 1510356 1694969 1768869 1732108 1594413 1424245 1345865 1280822 1405880 1435146
19089 1435146 1340501 1351045 1411519 1570545 1533752 1609982 1599325 1517429 1332740 1409002 1370482
19078 1370482 1488686 1596139 1614146 1619439 1689947 1812928 1921856 1865403 1905426 2057997
19068 2057997 2131352 1972235 2078890 2202357 2103077 1753022 1701377 1917161 2066759 2385125
19058 2385125 2587366 2527066 2577975 2553536 2840357 3088938 3199652 3216638 3248069 3232594
19048 3232594 3337409 3656145 3853595 3849521 3813409 3901219 4209411 4468037 4979346 5257711
19038 5257711 5441882 5859046 6223524 6634975 7274551 7959635 8748136 9733160 10965555
$$ packed form
19110A753827M8050p4816j52527R1723L111k2310p6358j22932j33820J33707M3908
19099A491563J8793J84613P3900l6761j37695j70168p8380o5043J25058K9266
19089A435146r4645J0544O0474J59026l6793P6230j0657q1896j84689P6262l8520
19078A370482J18204J07453J8007N293P0508J22981J08928n6453M0023J52571
19068B057997P3355j59117J06655J23467r9280l50055n1645K15784J49598L18366
19058B385125K02241o0300N0909k4439K86821K48581J10714J6986L1431j5475
19048C232594J04815L18736J97450m074l6112Q7810L08192K58626N11309K78365
19038E257711J84171M17164L64478M11451O39576O85084P88501R85024J232395
$$ plain form
19029 10965555 12727432 14889585 17806283 21663743 27204392 34850076 45034137 58451389
19021 58451389 75806872 96959774 120589044 142707890 158046198 165274586 165354657 158584431
19013 158584431 146700105 133825691 125611405 125696887 134513547 149067018 163392430 171199495
19005 171199495 170755208 163258056 148467816 126935262 102867025 81017642 63960719
18998 63960719 51834457 43675547 38126145 34403827 31636455 29453012 27958463 26735096
18990 26735096 25542237 24534716 23536602 22528356 21635543 20779769 19953285 19449835 19031488
18981 19031488 18327242 17768472 17157557 16466288 15576226 14574828 13933462 13323243 12634721
18972 12634721 12067008 11283642 10452258 9599517 8910358 8390112 7945724 7569634 7169407
$$ packed form
19029A0965555J761877K162153K916698L857460N540649P645684J0184061J3417252
19021E8451389J7355483K1152902K3629270K2118846J5338308P228388Q0071o770226
19013A58584431j1884326j2874414q214286Q5482Q816660J4553471J4325412P807065
19005A71199495m44287p497152j4790240k1532554k4068237k1849383j7056923
18998F3960719j2126262q158910n549402l722318k767372k183443j494549j223367
18990B6735096j192859j007521r98114j008246q92813q55774q26484n03450m18347
18981A9031488p04246n58770o10915o91269q90062j001398o41366o10219o88522
18972A2634721n67713p83366q31384q52741o89159n20246m44388l76090m00227
$$ plain form
18963 7169407 6855805 6563243 6265750 5896077 5593620 5327268 5204529 4811813 4617327
18954 4617327 4540177 4207003 3668617 3661946 3809196 3545980 3260320 3107372 2890774 2815087
18944 2815087 2817875 2655978 2502081 2560929 2452587 2175911 1972764 1831165 1730019 1865151
18934 1865151 1850821 1778964 1752845 1564011 1406995 1530851 1465064 1358910 1137530 1065011
18924 1065011 1112981 1071353 1281789 1321719 1071949 1072810 1067839 937041 1020421 1186695 1168762
18913 1168762 1210819 1225924 1019831 829179 697075 599048 599134 757675 690584 626817 476756
18902 476756 347629 392737 346047 504235 701607 684528 714885 783573 834731 722622 758353
18891 758353 932434 790039 880872 964076 1027231 1041572 1173720 1286062 1361940 1182692
$$ packed form
18963G169407l13602k92562k97493l69673l02457k66352j22739l92716j94486
18954D617327p7150l33174n38386o671J47250k63216k85660j52948k16598p5687
18944B815087K788j61897j53897N8848j08342k76676k03147j41599j01146J35132
18934A865151j4330p1857k6119j88834j57016J23856o5787j06154k21380p2519
18924A065011M7970m1628K10436L9930k49770Q61m971j30798Q3380J66274j7933
18913A168762M2057J5105k06093j90652j32104r8027Q6J58541o7091o3767j50061
18902D76756j29127M5108m6690J58188J97372j7079L0357O8688N1158j12109L5731
18891G58353J74081j42395R0833Q3204O3155J4341J32148J12342P5878j79248
$$ plain form
18881 1182692 1139764 1064880 1012665 958291 931229 1051850 1074127 1021238 1128321 1092062 1161266
18870 1161266 1159152 1087527 1099605 1125490 1129298 904777 927111 952195 726746 827032 1147369
18859 1147369 1252815 1037106 750859 595823 508701 449938 455619 577429 625533 582843
18849 582843 551164 442994 380015 368502 605910 696969 703160 928782 1231529 1063703 819873
18838 819873 1030771 1168124 1053090 1079652 997662 872484 823868 1122369 1280596 1255810
18828 1255810 1369006 1330973 1165482 1160885 1239407 1138549 948164 970321 1069542 1186438
18818 1186438 1361073 1104520 716966 487514 309557 227248 310559 558427 582223 659714
18808 659714 860220 781742 658757 670070 649280 597696 537377 295252 248938 405420 448249
$$ packed form
18881A182692m2928p4884n2215n4374k7062J20621K2277n2889J07083l6259O9204
18870A161266k114p1625J2078K5885L808k24521K2334K5084k25449J00286L20337
18859A147369J05446k15709k86247j55036q7122n8763N681J21810M8104m2690
18849E82843l1679j08170o2979j1513K37408R1059O191K25622L02747j67826k43830
18838H19873K10898J37353j15034K6562q1990j25178m8616K98501J58227k4786
18828A255810J13196l8033j65491m597P8522j00858j90385K2157R9221J16896
18818A186438J74635k56553l87554k29452j77957q2309Q3311K47868K3796P7491
18808F59714K00506p8478j22985J1313k0790n1584o0319k42125m6314J56482M2829
$$ plain form
18797 448249 687206 937587 784751 597850 541014 682535 699858 839520 702356 535952
18787 535952 517997 643136 773564 792914 860995 749691 917773 944474 965041 908253 908673
18776 908673 938609 1025973 1018061 1054371 943501 702948 505099 655484 898050 1014150
18766 1014150 1109598 946935 817821 613459 642002 644473 745799 610715 432260 371477
18756 371477 513334 546511 494337 530912 444411 331129 435248 402360 397504 518023 790347
18745 790347 729259 602454 602884 482442 346316 251212 361132 549662 520332 253153 197945
18734 197945 547382 938626 1023622 987951 879994 752893 837783 918423 1000677 807041
18724 807041 776209 839229 585749 528281 494278 530755 604515 717267 706138 837039 880644
$$ packed form
18797D48249K38957K50381j52836j86901n6836J41521J7323J39662j37164j66404
18787E35952j7955J25139J30428J9350O8081j11304J68082K6701K0567n6788M20
18776I08673K9936Q7364p912L6310j10870k40553j97849J50385K42566J16100
18766A014150R5448j62663j29114k04362K8543K471J01326j35084j78455o0783
18756C71477J41857L3177n2174L6575q6501j13282J04119l2888m856J20519K72324
18745G90347o1088j26805M30j20442j36126r5104J09920J88530k9330k67179n5208
18734A97945L49437L91244Q4996l5671j07957j27101Q4890Q0640Q2254j93636
18724H07041l0832O3020k53480n7468l4003L6477P3760J12752j1129J30901M3605
$$ plain form
18713 880644 881590 854095 848242 510419 581139 762927 675594 680484 527629 413672 377748
18702 377748 561097 583547 620420 633235 501942 396499 485855 426228 380840 492090 467782
18691 467782 413267 335453 241866 299327 120610 91460 -110541 -188128 -207735 -105149 138567
18680 138567 264388 317712 286852 208739 -21402 -55294 -192813 -210537 -215306 -149642 -249220
18669 -249220 -127797 -16399 313945 434824 304252 158277 143055 135892 250198 408755
18659 408755 441716 276300 59667 265569 513562 426966 415849 391887 216684 110896
18649 110896 218079 346267 347223 452344 266249 128927 180580 146286 174296 212190 206747
18638 206747 84931 56383 116964 204346 181101 71691 200751 233145 287089 320350 214812
$$ packed form
18713H80644R46k7495n853l37823P0720J81788q7333M890j52855j13957l5924
18702C77748J83349K2450L6873J2815j31293j05443Q9356n9627m5388J11250k4308
18691D67782n4515p7814r3587N7461j78717k9150k02001p7587j9607J02586K43716
18680A38567J25821N3324l0860p8113k30141l3892j37519j7724m769O5664r9578
18669b49220J21423J11398L30344J20879j30572j45975j5222p163J14306J58557
18659D08755L2961j65416k16633K05902K47993q6596j1117k3962j75203j05788
18649A10896J07183J28188R56J05121j86095j37322N1653l4294K8010L7894n443
18638B06747j21816k8548O0581Q7382k3245j09410J29060L2394N3944L3261j05538
$$ plain form
18627 214812 161032 289671 283850 134140 159604 -6521 -182660 -44745 92807 159764
18617 159764 198530 211503 268303 402966 302423 324458 184421 33302 87980 261403
18607 261403 326482 326561 240951 210908 362879 308548 204758 159201 83695 30132 79730 102477
18595 102477 25908 -87221 -283656 -120171 -241147 -336975 -327478 -247802 -126207 -3736
18585 -3736 131797 162399 -8285 -34888 -73383 -38282 -30876 -64873 -132233 -82876 -29022 92149
18573 92149 414304 490966 329262 300844 131625 57713 -41773 -19279 133354 229153 14397
18562 14397 -226526 -259461 -169506 -44987 -79259 112970 344763 199574 -72391 -131937
18552 -131937 -89839 -102259 50244 120641 60059 63295 84208 147341 158275 145203 221313
$$ packed form
18627B14812n3780J28639n821j49710K5464j66125j76139J37915J37552O6957
18617A59764L8766J2973N6800J34663j00543K2035j40037j51119N4678J73423
18607B61403O5079P9q5610l0043J51971n4331j03790m5557p5506n3563M9598K2747
18595A02477p6569j13129j96435J63485j20976r5828R497P9676J21595J22471
18585c736J35533L0602j70684k6603l8495L5101P406l3997o7360M9357N3854J21171
18573I2149L22155P6662j61704k8418j69219p3912r9486K2494J52633R5799k14756
18562A4397k40923l2935Q9955J24519l4272J92229K31793j45189k71965n9546
18552a31937M2098j2420J52503P0397o0582L236K0913O3133J0934j3072P6110
$$ plain form
18541 221313 215315 227931 319339 209124 196463 210434 -51934 -94551 -147939 -198612 -38787
18530 -38787 210636 351447 431621 512530 504150 516782 182253 -9104 -109171 30271 111766
18519 111766 119395 182797 304513 268221 300872 240822 108450 3262 46531 20646 176855
18508 176855 187824 146407 126799 97310 -77918 -143488 -80061 123646 84585 -134117 -86419
18497 -86419 -124611 -83994 83656 34812 -30954 82551 199507 32849 -172658 -236236 -209519
18486 -209519 -89326 -134772 -68749 188972 282044 161319 76381 -55488 -92016 172441
18476 172441 238353 145388 -70832 -114083 -134049 -132114 -288264 -490919 -329593 -41518 -12295
18465 -12295 -236567 -142954 -191641 -214680 -214626 -368562 -287355 -40438 27606 155545 106449
$$ packed form
18541B21313n998J2616R1408j10215j2661J3971k62368m2617n3388n0673J59825
18530c8787K49423J40811Q0174Q0909q380J2632l34529j91357j00067J39442Q1495
18519A11766P629O3402J21716l6292L2651o0050j32372j05188M3269k5885J56209
18508A76855J0969m1417j9608k9489j75228o5570O3427K03707l9061k18702M7698
18497h6419l8192M0617J67650m8844o5766J13505J16956j66658k05507o3578K6717
18486b09519J20193m5446O6023K57721R3072j20725q4938j31869l6528K64457
18476A72441O5912r2965k16220m3251j9966J935j56150k02655J61326K88075K9223
18465a2295k24272R3613m8687k3039N4j53936Q1207K46917O8044J27939m9096
$$ plain form
18454 106449 -23651 -22622 203718 212200 -85838 -190554 -215477 -166316 -187575 -136899 -174581
18443 -174581 -318587 -75260 6969 -62501 -195572 -47638 111166 108211 395229 351670
18433 351670 158594 20542 207320 203419 213694 262591 478247 584193 516259 640528
18423 640528 806642 695271 965088 974629 829704 807826 840142 832036 843081 835725 821374
18412 821374 945217 983995 992702 921871 929060 744772 751042 866072 719135 422174 301909
18401 301909 251218 294451 188910 196229 310994 150884 136356 138959 172096 360840 384517
18390 384517 348342 317714 409598 440076 379378 297860 259042 182439 90155 -52671 -65211
18379 -65211 -90645 -240674 -192745 -191134 -284750 -314324 -63575 81420 -19446 -14353 -132710
$$ packed form
18454A06449j30100J029K26340Q482k98038j04716k4923M9161k1259N0676l7682
18443a74581j44006K43327Q2229o9470j33071J47934J58804k955K87018m3559
18433C51670j93076j38052J86778l901J0275M8897K15656J05946o7934J24269
18423F40528J66114j11371K69817R541j44925k1878L2316q106J1045p356j4351
18412H21374J23843L8778Q707p0831P189j84288O270J15030j46937k96961j20265
18401C01909n0691M3233j05541P319J14765j60110j4528K603L3137J88744K3677
18390C84517l6175l0628R1884L0478o0698q1518l8818p6603r2284j42826j2540
18379f5211k5434j50029M7929J611r3616k9574K50749J44995j00866N093j18357
$$ plain form
18368 -132710 -142180 -352073 -339015 -221727 -262444 -124118 25941 146079 69929 130227 226535
18357 226535 196436 47771 877 85891 58189 -90228 -97390 3289 24182 13197 -192412
18346 -192412 -230063 -287157 -207730 -117207 6635 -59619 -283193 -382535 -161737 -50614 -14959
18335 -14959 -29037 -142216 -121614 -129059 -38552 7234 -120425 -178461 -287589 -387330 -320464
18324 -320464 -337557 -306885 1079 121401 148608 358203 204626 -73173 -26813 76914
18314 76914 74806 112436 7146 -60914 -11342 -75232 -111902 -25878 81823 259627 324965
18303 324965 23465 16734 33886 33323 39755 152453 146167 220175 410748 260065 313984 279605
18291 279605 190113 171237 306417 278900 409993 199076 -138628 -245791 -164462 -132024
$$ packed form
18368a32710r470k09893J3058J17288m0717J38326J50059J20138p6150O0298R6308
18357B26535l0099j48665m6894Q5014k7702j48417p162J00679K0893j0985k05609
18346a92412l7651n7094P9427R0523J23842o6254k23574r9342K20798J11123L5655
18335a4959j4078j13179K0602p445R0507M5786j27659n8036j09128r9741O6866
18324c20464j7093L0672L07964J20322K7207K09595j53577k77799M6360J03727
18314G6914k108L7630j05290o8060M9572o3890l6670Q6024J07701J77804O5338
18303C24965l01500o731J7152n63O432J12698o286P4008J90573j50683N3919l4379
18291B79605q9492j8876J35180k7517J31093k10917l37704j07163Q1329L2438
$$ plain form
18281 -132024 158286 314994 299207 190324 57985 91594 174841 251517 361001 268267
18271 268267 345018 453186 450434 328727 207407 141010 45983 81500 155046 111557 117862
18260 117862 31684 -9153 219316 192821 143986 258436 95579 30775 8171 214439 149348
18249 149348 172032 116905 215778 103946 91242 123710 243379 131177 9354 -26524 -135118
18238 -135118 -1586 65963 120368 171679 192168 215316 213661 180119 241020 376016 355985
18227 355985 42000 3333 276804 427158 404374 266535 164173 140884 319750 150294
18217 150294 -30545 3038 -10221 -38720 -17265 212966 134768 134205 153356 190095 78117
18206 78117 7385 3929 -89073 -94899 -3726 -65052 -88684 92932 217572 427476 334648
$$ packed form
18281a32024K90310J56708j5787j08883j32339L3609Q3247P6676J09484r2734
18271B68267P6751J08168k752j21707j21320o6397r5027L5517P3546m3489O305
18260A17862q6178m0837K28469k6495m8835J14450j62857o4804k2604K06268o5091
18249A49348K2684n5127R8873j11832j2704L2468J19669j12202j21823l5878j08594
18238a35118J33532O7549N4405N1311K0489K3148j655l3542O0901J34996k0031
18227C55985l13985l8667K73471J50354k2784j37839j02362k3289J78866j69456
18217A50294j80839L3583j3259k8499K1455K30231p8198n63J9151L6739j11978
18206G8117p0732l456r3002n826R1173o1326k3632J81616J24640K09904r2828
$$ plain form
18195 334648 248505 121248 71470 93500 92994 41542 20058 -58469 -123430 -217594 -220569 -261190
18183 -261190 -186826 -102765 -67530 134105 280790 364702 371488 422271 343542 265886 197841
18172 197841 145978 186749 113370 -30926 -40276 -282157 -194739 -48357 -13793 40687 -39378
18161 -39378 -186138 -194205 -245952 -10689 166432 -1830 3716 -7441 26642 -57787 -155508
18150 -155508 -149448 -37823 -34383 -173197 -119753 14423 -126101 606 77647 112136 204952
18139 204952 243632 225882 148907 108869 -91173 -170847 102283 181445 11454 -84445 -137422
18128 -137422 -47254 -37538 -170729 -168645 -205910 32007 153985 75257 76408 82370 58666 -74370
18116 -74370 -78532 -36771 -67127 50489 181637 205817 140233 79929 111782 112848 160733 130781
$$ packed form
18195C34648q6143j27257m9778K2030n06n1452k1484p8527o4961r4164k975m0621
18183b61190P4364Q4061L5235K01635J46685Q3912O786N0783p8729p7656o8045
18172A97841n1863M0771p3379j44296r350k41881Q7418J46382L4564N4480q0065
18161c9378j46760q067n1747K35263J77121j68262N546j1157L4083q4429r7721
18150a55508O060J11625L440j38814N3444J34176j40524J26707P7041L4489R2816
18139B04952L8680j7750p6975m0038k00042p9674K73130P9162j69991r5899n2977
18128a37422R0168R716j33191K084l7265K37917J21978p8728J151N962k3704j33036
18116g4370m162M1761l0356J17616J31148K4180o5584o0304L1853J066M7885k9952
$$ plain form
18104 130781 237705 329723 372343 308490 259911 135346 -4628 -128287 -127470 -6006 130652
18093 130652 238918 261624 159434 51428 75511 101043 46778 -91459 -133557 90582
18083 90582 194610 185559 174677 12591 -147848 -10913 108529 48181 -88387 -143589 -113198
18072 -113198 -144739 -322419 -229368 -116064 -135581 -198078 -274230 -256936 -4765 107946 83130
18061 83130 94351 51136 26335 59375 188159 169219 24132 -43008 -262168 -345249 -251222
18050 -251222 7664 67009 82740 127862 186723 204460 278421 16431 -123606 -278248 -368723
18039 -368723 -315597 -240356 -19701 -162098 -156452 98820 74210 32351 165897 1559 55239
18028 55239 246337 148138 154562 347912 372659 327760 356412 245902 92428 59194 12806
$$ packed form
18104A30781J06924R2018M2620o3853m8579j24565j39974j23659Q17J21464J36658
18093A30652J08266K2706j02190j08006K4083K5532n4265j38237m2098K24139
18083I0582J04028r051j0882j62086j60439J36935J19442o0348j36568n5202L0391
18072a13198l1541j77680R3051J13304j9517o2497p6152J7294K52171J12711k4816
18061H3130J1221m3215k4801L3040J28784j8940j45087o7140k19160q3081R4027
18050b51222K58886N9345J5731M5122N8861J7737P3961k61990j40037j54642r0475
18039c68723N3126P5241K20655j42397N646K55272k4610m1859J33546j64338N3680
18028E5239J91098r8199O424J93350K4747m4899K8652j10510j53474l3234m6388
$$ plain form
18017 12806 -39911 -11952 -51421 -119564 -46678 54442 37379 -59053 -109889 63661 39771
18006 39771 -107545 -180643 37132 282176 330820 238274 76055 -135916 -52965 214511
17996 214511 111044 -59098 -116902 -83289 -32349 -129876 -108068 -129659 -134346 30089 2425
17985 2425 -160781 -69685 -50198 -79294 -7354 98661 19395 -76962 -94536 -12994 -25846
17974 -25846 36122 -103670 -158252 -160659 91739 296230 227436 50655 -6512 96946 123167
17963 123167 136448 51671 3709 69310 108029 196324 299335 307945 163197 -65743 -135891
17952 -135891 -25185 107441 320979 344431 431339 418585 210445 130385 51778 -109406
17942 -109406 -80666 -199421 -185778 -218790 -60179 129179 85718 87622 46463 -77602 -152030
$$ packed form
18017A2806n2717K7959l9469o8143P2886J01120j7063r6432n0836J73550k3890
18006C9771j47316p3098K17775K45044M8644r2546j62219k11971Q2951K67476
17996B14511j03467j70142n7804L3613N0940r7527K1808k1591m687J64435k7664
17985B425j63206R1096J9487k9096P1940J06015p9266r6357j7574Q1542j2852
17974b5846O1968j39792n4582k407K52398K04491o8794j76781n7167J03458K6221
17963A23167J3281q4777m7962O5601L8719Q8295J03011Q610j44748k28940p0148
17952a35891J10706J32626K13538K3452Q6908j2754k08140q0060p8607j61184
17942a09406K8740j18755J3643l3012J58611J89358m3461J904m1159j24065p4428
$$ plain form
17931 -152030 -58617 -44812 -42976 33356 267281 80306 40780 182319 229281 348218 275195
17920 275195 235217 136873 -173046 -437048 -227055 -161785 -327273 -436436 -396443 -246153
17910 -246153 -292528 -377831 -199727 -144004 -161401 -265332 -91362 57427 56808 -13089 46010
17899 46010 48882 -194462 -244089 -77616 -127950 -107130 8673 -51340 -60288 223357 263676
17888 263676 228487 143845 211931 94687 199936 160882 -28764 -141913 -197052 -184733 -262658
17877 -262658 -167597 -5606 -55822 26170 10756 -11532 46892 136535 86553 82000 -28030
17866 -28030 123222 246498 561 -210068 -116357 -58276 73625 112586 100366 115815 161335
17855 161335 -59218 -213578 -72303 -2988 -25194 273016 325894 110725 -104958 -237079
$$ packed form
17931a52030R3413J3805J836P6332K33925j86975l9526J41539M6962J18937p3023
17920B75195l9978r8344l09919k64002K09993O5270j65488j09163L9993J50290
17910b46153m6375q5303J78104N5723j7397j03931J73970J48789o19o9897N9099
17899D6010K872k43344m9627J66473n0334K0820J15803o0013q948K83645M0319
17888B63676l5189q4642O8086j17244J05249l9054j89646j13149n5139J2319p7925
17877b62658R5061J61991n0216Q1992j5414k2288N8424Q9643m9982m553j10030
17866b8030J51252J23276k45937k10629R3711N8081J31901L8961j2220J5449M5520
17855A61335k20553j54360J41275O9315k2206K98210N2878k15169k15683j32121
$$ plain form
17845 -237079 -183734 -88421 -152339 -136194 -99098 -151688 150695 262148 -14406 -204153 -240068
17834 -240068 -265377 -176409 -268851 -335231 -211771 -104125 -90056 -164795 -13333 -18874 -89039
17823 -89039 1501 -74796 -271948 -272213 11894 -23083 -98608 -230888 -151077 -10397 -263185
17812 -263185 -226710 -98647 -59607 -58099 -137365 -23044 140820 203751 155565 64602 14981
17801 14981 -57553 -115282 -101833 -244335 -262747 -144068 -227529 -319269 -108415 90628 21116
17790 21116 -60905 958 145112 243935 147545 29424 231053 382368 195218 16061
17780 16061 -147729 95593 256800 252585 120460 -90674 -239117 -243258 54805 296793
17770 296793 18766 -213353 68965 206294 31711 -101823 -79594 4528 141237 113891
$$ packed form
17845b37079N3345R5313o3918J6145L7096n2590L02383J11453k76554j89747l5915
17834b40068k5309Q8968r2442o6380J23460J07646J4069p4739J51462n541p0165
17823h9039R0540p6297j97152k65K84107l4977p5525j32280P9811J40680k52788
17812b63185L6475J28063L9040J508p9266J14321J63864O2931m8186r0963m9621
17801A4981p2534n7729J3449j42502j8412J18679q3461r1740K10854J99043o9512
17790B1116q2021O1863J44154R8823r6390j18121K01629J51315j87150j79157
17780A6061j63790K43322J61207m215j32125k11134j48443m141K98063K41988
17770B96793k78027k32119K82318J37329j74583j33534K2229Q4122J36709k7346
$$ plain form
17760 113891 321238 202833 -47542 122022 317611 179720 57395 20298 -131021 -194568
17750 -194568 -330790 -346548 -110195 -56463 -68591 37873 1801 63711 120075 114092 77931
17739 77931 -332762 -486193 -274913 -164824 71581 290150 273248 208212 264925 261694 347013
17728 347013 277087 -37036 65102 288698 268460 171183 104743 1499 -17622 151489
17718 151489 -10046 -7505 -121374 -47885 86285 192682 86387 25076 115893 255902
17708 255902 242076 247275 39241 -45939 -10463 134372 120477 115078 38607 53076 86763
17697 86763 182373 208227 339187 287560 218232 165366 241181 263674 182891 105947 -44495
17686 -44495 -170728 -127484 -295720 -82540 -57084 3357 -38035 62328 417681 628924
$$ packed form
17760A13891K07347j18405k50375J69564J95589j37891j22325l7097j51319o3547
17750a94568j36222j5758K36353N3732j2128J06464l6072O1910N6364n983l6161
17739G7931m10693j53431K11280J10089K36405K18569j6902o5036N6713l231Q5319
17728C47013o9926l14123J02138K23596k0238r7277o6440j03244j9121J69111
17718A51489j61535K541j13869P3489J34170J06397j06295o1311R0817J40009
17708B55902j3826N199k08034q5180L5476J44835j3895n399p6471J4469L3687
17697H6763R5610K5854J30960n1627o9328n2866P5815K2493q0783p6944j50442
17686d4495j26233M3244j68236K13180K5456O0441m1392J00363L55353K11243
$$ plain form
17676 628924 532654 472102 491318 522185 581067 637055 641593 802161 886612 1024279 933182
17665 933182 855989 769900 624251 559843 437182 361360 288310 311441 365365 467603 485294
17654 485294 474612 552249 543222 551362 362061 287161 370369 455021 575192 564381 482733
17643 482733 519751 525905 418437 460081 525901 518836 632036 873602 925156 793819 844576
17632 844576 439912 39877 50207 123002 15742 -22723 78664 187751 3407 18489
17622 18489 21246 -20765 46631 240028 186518 29312 -25946 156544 91598 60084 192389
17611 192389 115899 213106 165699 350809 453247 421020 119948 12854 173195 107740
17601 107740 -59505 106243 166542 237262 42793 -262852 -226081 4823 116228 277985
$$ packed form
17676F28924r6270o0552J9216L0867N8882N5988M538J60568Q4451J37667r1097
17665I33182p7193q6089j45649o4408j22661p5822p3050K3131N3924J02238J7691
17654D85294j0682P7637r027Q140j89301p4900Q3208Q4652J20171j0811q1648
17643D82733L7018O154j07468M1644O5820p065J13200K41566N1554j31337N0757
17632H44576m04664m00035J0330P2795j07260l8465J01387J09087j84344J5082
17622A8489K757m2011O7396J93397n3510j57206n5258J82490o4946l1514J32305
17611A92389p6490R7207m7407J85110J02438l2227l01072j07094J60341o5455
17601A07740j67245J65748O0299P0720j94469l05645L6771K30904J11405J61757
$$ plain form
17591 277985 168389 66256 32909 -80075 -220043 -363417 -215423 -48111 48314 51218
17581 51218 49196 36392 109843 120518 20871 -81617 -157929 -108178 -27700 56663 -20231 -80586
17569 -80586 -133706 -15199 370616 633323 594934 405190 321400 197344 -22257 70593
17559 70593 17929 -72941 16316 97859 135315 175711 213143 107843 4885 -20605 128806
17548 128806 174062 30008 115813 -23352 -127748 -253094 -6815 -112630 -37696 -154465
17538 -154465 -284281 -73190 113979 38573 28938 2163 227022 306535 193958 170702 222243
17527 222243 67919 -36153 -170116 -274114 -309987 -252469 -133195 -102866 16316 221518
17517 221518 128913 37116 -77740 -116747 -149600 -174721 -170809 -210206 -88685 -105593 -117755
$$ packed form
17591B77985j09596j02133l3347j12984j39968j43374J47994J67312R6425K904
17581E1218k022j2804P3451J0675r9647j02488p6312M9751Q0478Q4363p6894o0355
17569h0586n3120J18507L85815K62707l8389j89744q3790j24056k19601R2850
17559G0593n2664r0870Q9257Q1543L7456M0396L7432j05300j02958k5490J49411
17548A28806M5256j44054Q5805j39165j04396j25346K46279j05815P4934j16769
17538a54465j29816K11091J87169p5406r635k6775K24859P9513j12577k3256N1541
17527B22243j54324j04072j33963j03998l5873N7518J19274L0329J19182K05202
17517B21518r2605r1797j14856l9007l2853k5121L912l9397J21521j6908j2162
$$ plain form
17506 -117755 -75151 -147898 2320 -17943 -137017 -225580 -184440 -182746 -68029 -79587 -11458
17495 -11458 85468 95250 63159 89421 80675 113576 291909 489319 471790 309369 105603
17484 105603 50381 26443 -40629 -161389 -48994 -222632 -196287 -200226 -63529 -247533 -199899
17473 -199899 -97460 -33590 -57754 -58461 -86583 -7917 162287 311319 196174 152977 208454
17462 208454 101577 -66808 -199079 -153431 223065 432980 262579 -79716 -108407 34434
17452 34434 70011 25599 45119 92101 -34409 39568 133674 55071 27521 104744 26040
17441 26040 -30632 44669 126132 161322 118098 146482 28784 128673 240355 69469 -133579
17430 -133579 -6403 66045 69747 -228111 -480299 -401198 -191367 -231680 -405057 -439735 -147046
$$ packed form
17506a17755M2604p2747J50218k0263j19074q8563M1140J694J14717j1558O8129
17495a1458R6926R782l2091K6262q746L2901J78333J97410j7529j62421k03766
17484A05603n5222k3938o7072j20760J12395j73638K6345l939J36697j84004M7634
17473a99899J02439O3870k4164p07k8122P8666J70204J49032j15145m3197N5477
17462B08454j06877j68385j32271M5648L76496K09915j70401l42295k8691J42841
17452C4434L5577m4412J9520M6982j26510P3977R4106p8603k7550P7223p8704
17441B6040n6672P5301Q1463L5190m3224K8384j17698R9889J11682j70886k03048
17430a33579J27176P2448L702k97858k52188P9101K09831m0313j73377l4678K92689
$$ plain form
17419 -147046 -158951 -39554 15233 -42710 -2357 -50987 -126926 -195843 -101935 -148013 -228992
17408 -228992 -302666 -283744 -306346 -257891 -338042 -392020 -403347 -383949 -377799 -344446 -204485
17397 -204485 -40819 -88394 14628 51738 -119960 -103357 -74967 -4557 -154848 -242177 -178923
17386 -178923 10380 148111 -4060 -140476 -269553 -174061 132364 196799 196699 201783 -2219
17375 -2219 4598 103706 25527 -105193 -77718 114831 87231 207226 242179 155986 45905
17364 45905 38330 -32926 31293 162855 136667 55888 9276 41258 -76722 -65067 -101809
17353 -101809 -47794 145701 185289 96289 54309 142766 137570 6744 -28886 42537 125821
17342 125821 199774 207507 88288 214526 352851 295695 250409 397067 349905 304881 254532
$$ packed form
17419a47046j1905J19397N4787n7943M0353m8630p5939o8917R3908m6078q0979
17408b28992p3674J8922k2602M8455q0151n3978j1327J9398O150L3353J39961
17397b04485J63666m7575J03022L7110j71698J6603K8390P0410j50291q7329O3254
17386a78923J89303J37731j52171j36416j29077R5492L06425O4435j00N084k04002
17375b219O817R9108p8179j30720K7475J92549k7600J19995L4953q6193j10081
17364D5905p575p1256O4219J31562k6188q0779m6612L1982j17980J1655l6742
17353a01809N4015J93495L9588q9000m1980Q8457n196j30826l5630P1423Q3284
17342A25821P3953P733j19219J26238J38325n7156m5286J46658m7162m5024n0349
$$ plain form
17331 254532 178001 48860 10873 -17592 -152188 -213688 -32183 -71180 -244985 -158548 -177821
17320 -177821 -227408 -273934 -112465 -54612 -113360 -133147 -213996 -22464 134564 71390 -19853
17309 -19853 -28229 -164833 -221101 -57067 27792 65584 -120675 20398 188160 116334 106141
17298 106141 232177 155538 106283 126994 88498 121063 64450 25110 -70368 -173482 -123712
17287 -123712 -127392 -149587 -124492 -27442 -25484 -110648 -395681 -335529 -238693 -332774 -199447
17276 -199447 -154524 -57387 -65283 -18453 -14476 -6284 -40472 -184202 -278862 -265888 -79936 -18823
17264 -18823 8715 100239 -33081 -57571 -124195 -304345 -370661 -497545 -470414 -333490 -159227
17253 -159227 -13160 5582 -35774 -135107 -154879 -140173 -36931 -149438 -268449 -257798 -266094
$$ packed form
17331B54532p6531j29141l7987k8465j34596o1500J81505l8997j73805Q6437j9273
17320a77821m9587m6526J61469N7853n8748j9787q0849J91532J57028o3174r1243
17309a9853q376j36604n6268J64034Q4859L7792j86259J41073J67762p1826j0193
17298A06141J26036p6639m9255K0711l8496L2565n6613l9340r5478j03114M9770
17287a23712l680k2195K5095R7050J958q5164k85033O0152R6836r4081J33327
17276a99447M4923R7137p896M6830L977Q192l4188j43730r4660J2974J85952O1113
17264a8823K7538R1524j33320k4490o6624j80150o6316j26884K7131J36924J74263
17253a59227J46067J8742m1356r9333j9772J4706J03242j12507j19011J0651q296
$$ plain form
17242 -266094 -180021 -169806 -217942 -31751 -170848 -231819 -96014 -199323 -193558 20120 -80807
17231 -80807 -236307 -194757 -26009 54598 85119 126568 95560 9530 -57076 -55486 91563
17220 91563 296558 512198 606207 633135 402803 308105 388792 540161 478917 332515 393590
17209 393590 274965 191142 235866 209111 231640 217290 226014 368023 419804 492669 396654
17198 396654 418672 444362 381548 227062 199977 234079 249825 234740 382309 379322 279582
17187 279582 310610 397092 437057 434981 495415 487023 319750 385872 314706 216949 365635
17176 365635 543080 445528 671776 871799 759472 839313 948485 1006408 836088 600531
17166 600531 513718 450111 709445 776466 814192 815247 790596 866851 847040 774777 495182
$$ packed form
17242b66094Q6073J0215m8136J86191j39097o0971J35805j03309N765K13678j00927
17231h0807j55500M1550J68748Q0607L0521M1449l1008q6030o6606J590J47049
17220I1563K04995K15640R4009K6928k30332r4698Q0687J51369o1244j46402O1075
17209C93590j18625q3823M4724k6755K2529j4350Q724J42009N1781P2865r6015
17198C96654K2018K5690o2814j54486k7085L4102J5746j5085J47569k987r9740
17187B79582L1028Q6482L9965k076O0434q392j67273O6122p1166r7757J48686
17176C65635J77445r7552K26248K00023j12327P9841J09172N7923j70320k35557
17166F00531q6813o3607K59334O7021L7726J055k4651P6255j9811p2263k79595
$$ plain form
17155 495182 418365 527495 482116 603389 750284 782479 870445 909433 880301 752427 720643
17144 720643 789307 833406 945776 1201873 1258927 1147806 848874 993079 1289009 1304672
17134 1304672 1536986 1544041 1653698 1900005 2158339 2158375 2282384 2422486 2685714 3103691
17124 3103691 3431850 3687820 3865370 4209267 4626872 4916446 5559486 6348688 7256476
17115 7256476 8260048 9395227 10972644 13417865 16471512 20564029 26479799 34356231
17107 34356231 44564644 57465532 72935816 89311049 102108365 104721697 96419303
17100 96419303 82945256 71472316 65469175 65930162 71902220 82564255 97275649 114430271
17092 114430271 129470431 137117696 137229870 134664328 133886705 134391818 130644157 119304919
$$ packed form
17155D95182p6817J09130m5379J21273J46895L2195Q7966L8988k9132j27874l1784
17144G20643O8664M4099J12370K56097N7054j11121k98932J44205K95930J5663
17134A304672K32314P055J09657K46307K58334L6J24009J40102K63228M17977
17124C103691L28159K55970J77550L43897M17605K89574O43040P89202R07788
17115G256476J003572J135179J577417K445221L053647M092517N915770P876432
17107C4356231J0208413J2900888J5470284J6375233J2797316K613332q302394
17100I6419303j3474047j1472940o003141M60987N972058J0662035J4711394J7154622
17092A14430271J5040160P647265J12174k565542p77623N05113l747661j1339238
$$ plain form
17084 119304919 102924690 87379081 76779262 72501318 73964225 79891104 89440975
17077 89440975 101626566 112226388 113933341 103724669 86097410 67985283 53433743
17070 53433743 43446266 36867257 32384067 29315002 27078924 25233113 23515698 22245353
17062 22245353 21131925 20198377 19080315 18063809 17284913 16519564 15612300 14763258 14076211
17053 14076211 13468416 13059866 12674493 12184985 11627261 10912951 10261219 9678524 9094919
17044 9094919 8642555 8198027 7576304 6960529 6703255 6338759 5874864 5546951 5462365 5532795
17034 5532795 5235936 4977936 4551849 4171564 3969752 3786364 3353155 3176596 2983963
17025 2983963 2988420 2680004 2609215 2820984 2774726 2759490 2541880 2348724 2140231 1960412
$$ packed form
17084A19304919j6380229j5545609j0599819m277944J462907N926879R549871
17077H9440975J2185591J0599822J706953j0208672j7627259j8112127j4551540
17070E3433743r987477o579009m483190l069065k236078j845811j717415j270345
17062B2245353j113428r33548j118062j016506p78896p65349r07264q49042o87047
17053A4076211o07795m08550l85373m89508n57724p14310o51732n82695n83605
17044I094919m52364m44528o21723o15775k57274l64496m63895l27913q4586P0430
17034E532795k96859k58000m26087l80285k01812j83388m33209j76559j92633
17025B983963M457l08416p0789K11769m6258j5236k17610j93156k08493j79819
$$ plain form
17015 1960412 1913730 1695596 1507620 1356753 1321744 1297845 1174934 1126580 1198722 1243834
17005 1243834 1003714 947693 795503 767853 822630 677070 496159 419349 478485 503283
16995 503283 705630 758121 645087 579678 535107 431554 573651 571424 560222 512309 403395
16984 403395 504165 498438 390302 526433 504281 347198 155415 219845 330144 334000 276059
16973 276059 286717 588693 565942 316185 -18383 153759 113867 -117737 -2888 272497
16963 272497 446776 448074 447783 330650 364131 313723 267906 170187 76387 11181 105891 141376
16951 141376 264921 305989 310407 231576 246274 207886 346444 458876 559497 523689 390479
16940 390479 360076 395719 346138 451480 452627 396786 281814 438334 502355 558531 445886
$$ packed form
17015A960412m6682k18134j87976j50867l5009k3899j22911m8354P2142M5112
17005A243834k40120n6021j52190k7650N4777j45560j80911p6810N9136K4798
16995E03283K02347N2491j13034o5409m4571j03553J42097k227j1202m7913j08914
16984D03395J00770n727j08136J36131k2152j57083j91783O4430J10299L856n7941
16973B76059J0658L01976k2751k49757l34568J72142l9892k31604J14849K75385
16963B72497J74279J298k91j17133L3481n0408m5817r7719r3800o5206R4710L5485
16951A41376J23545M1068M418p8831J4698l8388J38558J12432J00621l5808j33210
16940C90479l0403L5643m9581J05342J147n5841j14972J56520O4021N6176j12645
$$ plain form
16929 445886 427362 318351 339284 382587 507763 875695 944859 954734 765792 489805 325269
16918 325269 414521 415568 394786 358844 158785 226208 414882 810545 729581 450065 428545
16907 428545 382486 364944 354177 324398 373243 299195 340226 317819 270820 231821 401556
16896 401556 545073 523270 267660 130542 133635 224315 318031 157841 143712 303503 267754
16885 267754 190675 47246 -92542 -94610 -104009 -132956 23749 -41579 -155599 -41536 145331
16874 145331 35916 -200055 -190636 -87340 -236468 -144603 15836 186665 242729 45055
16864 45055 18697 98363 200078 182411 103312 153980 111534 54151 173212 140138 48478
16853 48478 114728 96579 100894 131329 51554 39585 160214 41111 77853 98522 222154
$$ packed form
16929D45886j8524j09011K0933M3303J25176L67932O9164R875j88942k75987j64536
16918C25269Q9252J047k0782l5942k00059O7423J88674L95663q0964k79516k1520
16907D28545m6059j7542j0767k9779M8845p4048M1031k2407m6999l8999J69735
16896D01556J43517k1803k55610j37118L093R0680R3716j60190j4129J59791l5749
16885B67754p7079j43429j39788k068r399k8947J56705o5328j14020J14063J86867
16874A45331j09415k35971R419J03296j49128R1865J60439J70829N6064j97674
16864D5055k6358P9666J01715j7667p9099N0668m2446n7383J19061l3074r1660
16853D8478O6250j8149M315L0435p9775j1969J20629j19103L6742K0669J23632
$$ plain form
16842 222154 -28940 -330048 -247469 1234 215463 19147 -35469 -39410 28031 56769 44986
16831 44986 255717 156644 -29879 -79834 -4475 145584 233107 9615 -45042 5761 152192
16820 152192 194149 9200 -15914 157682 123719 291337 251371 246246 242383 175623 98526
16809 98526 115316 69542 -81337 -63902 -123165 -227862 -14417 119639 127172 132083 200168
16798 200168 86523 110615 22063 -84137 -62334 -14746 -66721 -21345 -125863 -83569 141369
16787 141369 372460 404781 199427 -65126 -109869 25960 240942 301145 441538 398054
16777 398054 319340 422615 351938 148971 118082 150630 273290 131823 -29036 -212479
16767 -212479 -251939 -45451 226106 159387 264235 322110 206960 216642 291585 205747 26851
$$ packed form
16842B22154k51094l01108Q2579K48703K14229j96316n4616l941O7441K8738j1783
16831D4986K10731r9073j86523m9955P5359J50059Q7523k23492n4657N0803J46431
16820A52192M1957j84949k5114J73596l3963J67618l9966n125l863o6760p7097
16809I8526J6790m5774j50879J7435n9263j04697K13445J34056P533M911O8085
16798B00168j13645K4092q8552j06200K1803M7588n1975M5376j04518M2294K24938
16787A41369K31091L2321k05354k64553m4743J35829K14982O0203J40393m3484
16777C98054p8714J03275p0677k02967l0889L2548J22660j41467j60859j83443
16767b12479l9460K06488K71557o6719J04848N7875j15150R682P4943q5838j78896
$$ plain form
16756 26851 -61056 -193009 -260535 32901 304275 342824 270637 94481 176937 224970 126064
16745 126064 136635 77115 -34116 82201 242190 143035 34057 191837 310401 122359
16735 122359 -86575 -246882 -162617 -134810 -100812 -148830 -53628 171213 281459 199982 -62026
16724 -62026 -52931 5620 29193 60193 -33218 -43176 -70966 -26316 164443 128197 8347 -50977
16712 -50977 -91991 -134495 -179769 -199395 -75372 -59265 -135460 -127411 1932 204128 265546
16701 265546 158288 14711 112415 150225 95062 21682 -7642 -47703 -258250 -286004 -230807
16690 -230807 -259415 -133086 -153056 -225584 -182993 15208 -6957 -88090 -25695 107443 195593
16679 195593 301170 327029 75645 115907 291108 309888 48708 102342 242474 104138
$$ packed form
16756B6851q7907j31953o7526K93436K71374L8549p2187j76156Q2456M8033r8906
16745A26064J0571n9520j11231J16317J59989r9155j08978J57780J18564j88042
16735A22359k08934j60307Q4265K7807L3998m8018R5202K24841J10246q1477k62008
16724f2026R095N8551K3573L1000r3411r958k7790M4650J90759l6246j19850n9324
16712e0977m1014m2504m5274j9626J24023J6107p6195Q049J29343K02196O1418
16701B65546j07258j43577R7704L7810n5163p3380k9324m0061k10547k7754N5197
16690b30807k8608J26329j9970p2528M2591J98201k2165q1133O2395J33138Q8150
16679A95593J05577K5859k51384M0262J75201J8780k61180N3634J40132j38336
$$ plain form
16669 104138 36637 -69364 37565 114112 181850 321730 122766 15214 175073 212745
16659 212745 100908 33063 174336 224218 43664 -164228 -57597 -28779 29551 108002
16649 108002 54615 57126 -85055 167529 230051 164370 273285 372348 210900 -64803 -51391
16638 -51391 -69487 24244 -92268 166340 420202 334513 218385 126841 102016 282095 274605
16627 274605 78741 108419 146931 58893 47569 67193 -68820 -82067 79200 50194 -13331
16616 -13331 -68449 -83729 -101369 -30676 145113 219044 171869 141677 -57048 44279 113190
16605 113190 253316 286106 391943 439334 385535 256008 167458 73845 21465 194899 389581
16594 389581 261570 131758 149693 176060 235078 219128 422613 536285 333885 210995
$$ packed form
16669A04138o7501j06001J06929P6547O7738J39880j98964j07552J59859L7672
16659B12745j11837o7845J41273M9882j80554k07892J06631K8818N8330P8451
16649A08002n3387K511j42181K52584O2522o5681J08915R9063j61448k75703J3412
16638e1391j8096R3731j16512K58608K53862q5689j16128r1544k4825J80079p490
16627B74605j95864K9678L8512q8038j1324J9624j36013j3247J61267k9006o3525
16616a3331n5118j5280j7640P0693J75789P3931m7175l0192j98725J01327O8911
16605A13190J40126L2790J05837M7391n3799j29527q8550r3613n2380J73434J94682
16594C89581j28011j29812J7935K6367N9018j5950K03485J13672k02400j22890
$$ plain form
16584 210995 200295 15985 -45282 -91499 -137549 -3402 95547 84126 -88526 -72953 -88420
16573 -88420 62366 15974 -74996 -112735 121281 83329 127637 115372 107267 78326 24166
16562 24166 -60144 -28372 102726 88353 135116 114798 -65434 -112065 61009 222290 161451
16551 161451 76011 179253 141410 -16453 -151057 -95511 64283 136887 152593 39574
16541 39574 94749 155858 322594 306797 410821 430825 382484 407388 363855 517507 636679
16530 636679 875699 852603 1022591 955096 794371 688314 810711 994328 1083691 965296
16520 965296 818983 798203 684741 423751 435043 569960 421902 322553 307602 271970
16510 271970 428597 532527 528481 315847 210938 128427 -7292 3060 10659 193901 265446
$$ packed form
16584B10995j0700j84310o1267m6217m6050J34147R8949j1421j72652J5573j5467
16573h8420J50786m6392r0970l7739K34016l7952M4308j2265q105k8941n4160
16562B4166q4310L1772J31098j4373M6763k0318j80232m6631J73074J61281o0839
16551A61451q5440J03242l7843j57863j34604N5546J59794P2604J5706j13019
16541C9574N5175O1109J66736j5797J04024K0004m8341K4904m3533J53652J19172
16530F36679K39020k3096J69988o7495j60725j06057J22397J83617Q9363j18395
16520I65296j46313k0780j13462k60990J1292J34917j48058r9349j4951l5632
16510B71970J56627J03930m046k12634j04909q2511j35719J0352P599J83242P1545
$$ plain form
16499 265446 151537 229164 379043 387288 242217 219592 118830 -54776 -91649 -171155 -176114
16488 -176114 -94128 -67037 -35259 8796 145852 78261 -95543 -217487 -158320 -66204 -80914
16477 -80914 -18984 34362 17984 68978 167905 145496 77268 141332 101078 36191 42534 111231
16465 111231 19219 76376 124248 93128 13880 102810 -20566 -7906 -12041 157569 323097
16454 323097 196285 -49514 8923 58816 164157 353097 425245 77566 -100953 -110506
16444 -110506 -37289 -24900 114634 242780 211576 112662 44788 -5132 67343 242277 257978
16433 257978 173869 48757 102329 283282 204442 259230 214916 289358 236119 212691 111267
16422 111267 80866 81656 36443 -11878 -118096 -85518 -31519 37805 213675 298578 210328
$$ packed form
16499B65446j13909P7627J49879Q245j45071k2625j00762j73606l6873p9506m959
16488a76114Q1986K7091L1778M4055J37056o7591j73804j21944N9167R2116j4710
16477h0914O1930N3346j6378N0994R8927k2409o8228O4064m0254o4887O343O8697
16465A11231r2012N7157M7872l1120p9248Q8930j23376J2660m135J69610J65528
16454C23097j26812k45799N8437M9893J05341J88940P2148l47679j78519r553
16444a10506P3217J2389J39534J28146l1204r8914o7874m9920P2475J74934J5701
16433B57978q4109j25112N3572J80953p8840N4788m4314P4442n3239k3428j01424
16422A11267l0401P90m5213m8321j06218L2578N3999O9324J75870Q4903q8250
$$ plain form
16411 210328 -51217 -24859 -19672 -53763 -20512 48005 52497 94847 34496 196762 255139
16400 255139 283899 -86816 -284820 -37610 20099 -11272 14243 -63305 11098 41419 78590
16389 78590 33032 -155918 -316576 -396947 -314211 -197737 -102859 -158007 -122996 -128306 -17320
16378 -17320 -3511 -32032 -88104 -143883 -223492 -266747 -271380 -262550 -128691 -200811 -215206 -162682
16366 -162682 -185069 -162872 -128 5787 -22912 -27770 -177608 -1362 183529 145645 104632
16355 104632 -27176 -142461 -295255 -331711 -157652 -78589 -100416 -73768 34830 81280
16345 81280 -10071 -36223 213016 292855 475479 295759 170250 -1865 112841 17410
16335 17410 -65189 -64542 -7242 -78048 -105996 512 -8499 -57373 28637 96998 86490 -44530
$$ packed form
16411B10328k61545K6358N187l4091L3251O8517M492M2350o0351J62266N8377
16400B55139K8760l70715j98004K47210N7709l1371K5515p7548P4403L0321L7171
16389G8590m5558j88950j60658q0371Q2736J16474R4878n5148L5011n310J10986
16378a7320J3809k8521n6072n5779p9609m3255m633Q830J33859p2120j4395N2524
16366a62682k2387K2197J62744N915k8699m858j49838J76246J84891l7884m1013
16355A04632j31808j15285j52794l6456J74059P9063k1827K6648J08598M6450
16345H1280r1351k6152K49239P9839J82624j79720j25509j72115J14706r5431
16335A7410q2599O47N7300p0806k7948J06508r011m8874Q6010O8361j0508j31020
$$ plain form
16323 -44530 -9531 -32472 114414 213521 170558 174327 418 -107474 -209755 -419367 -439738
16312 -439738 -278724 -118991 -204957 -269247 -339707 -268105 -159247 -18919 27196 -53889 58276
16301 58276 112539 86129 53603 -33585 -131954 -84948 103464 111744 10718 -83240 59941
16290 59941 -54199 -86647 -43152 -17775 -30708 688 -86126 -186816 -195533 -88328 -200533
16279 -200533 -260287 -271656 -103663 -101433 -120496 -53522 2032 19241 91060 297222 295364
16268 295364 423184 222005 64892 -89869 -295453 -335263 -204085 -57754 -163999 -141259
16258 -141259 -137975 -25070 -52357 -212712 -314263 -156332 -8548 149277 331374 402111
16248 402111 321420 191477 -11746 -154111 -30364 206143 319234 344749 162195 126052
$$ packed form
16323d4530L4999k2941J46886R9107m2963L769j73909j07892j02281k09612k0371
16312d39738J61014J59733q5966o4290p0460P1602J08858J40328M6115q1085J12165
16301E8276N4263k6410l2526q7188r8369M7006J88412Q280j01026r3958J43181
16290E9941j14140l2448M3495K5377j2933L1396q6814j00690q717J07205j12205
16279b00533n9754j1369J67993K230j9063O6974N5554J7209P1819K06162j858
16268B95364J27820k01179j57113j54761k05584l9810J31178J46331j06245K2740
16258a41259L284J12905k7287j60355j01551J57931J47784J57825J82097P0737
16248D02111q0691j29943k03223j42365J23747K36507J13091K5515j82554l6143
$$ plain form
16238 126052 173740 -22131 127052 161753 65478 -81419 -5175 42153 -112050 -147860 -150083
16227 -150083 -166718 -219842 -161454 19793 130133 54670 6120 107573 326667 404126 362897
16216 362897 239235 185086 120275 140254 127630 2592 15997 88156 -96842 -70483 -77321
16205 -77321 -26604 -168110 -60156 80179 84367 -27766 -89022 -75979 -109087 -74172 -61564
16194 -61564 -86700 75320 87199 119329 -6052 -7135 39493 -190087 -190716 -117149 -159719 -25763
16182 -25763 -125966 -71575 -49686 -11754 21310 177120 198515 274342 287964 78112 -7401
16171 -7401 103325 91194 35083 24833 -98473 -89352 -37857 79057 138632 135206 -29734
16160 -29734 -139103 -225510 -87047 36066 -55642 -102999 -91173 1180 8995 -212555 -187739
$$ packed form
16238A26052M7688j95871J49183L4701r6275j46897P6244M7328j54203l5810k223
16227a50083j6635n3124N8388J81247J10340p5463m8550J01453K19094P7459m1229
16216C62897j23662n4149o4811J9979j2624j25038J3405P2159j84998K6359o838
16205g7321N0717j41506J07954J40335M188j12133o1256J3043l3108L4915J2608
16194f1564k5136J62020J1879L2130j25381j083M6628k29580o29P3567m2570J33956
16182b5763j00203N4391K1889L7932L3064J55810K1395P5827J3622k09852q5513
16171g401J10726j2131n6111j0250j23306R121N1495J16914N9575l426j64940
16160b9734j09369q6407J38463J23113r1708m7357J1826R2353P815k21550K4816
$$ plain form
16149 -187739 -249607 -180132 -133896 -147240 -207766 -50779 60238 131954 91283 180100 210488
16138 210488 97083 -131422 30112 236175 125742 16050 16755 56760 -45794 -92732
16128 -92732 -107542 -32754 94073 -28637 -37458 100504 18457 21105 -23446 -39285 -44966 81410
16116 81410 207956 128358 -80541 -284831 -164523 139485 207090 57139 -143233 2560
16106 2560 69949 127851 154914 155993 55337 -96941 -79838 57629 128639 63848 18550
16095 18550 -122982 -129215 -12603 -98407 -283027 -288764 -94242 -9434 -92020 -43330 -168727
16084 -168727 -162894 -125470 -59109 251312 307162 256046 -45787 -328423 -293102 -195009 -110648
16073 -110648 -47665 -56908 -52361 -131145 -196002 -150446 -41005 -46214 -162397 -83789 -133384 -121117
$$ packed form
16149a87739o1868O9475M6236j3344o0526J56987J11017P1716m0671Q8817L0388
16138B10488j13405k28505J61534K06063j10433j09692P05M0005j02554m6938
16128i2732j4810P4788J26827j22710q821J37962q2047K648m4551j5839n681J26376
16116H1410J26546p9598k08899k04290J20308L04008O7605j49951k00372J45793
16106B560O7389N7902K7063J079j00656j52278J7103J37467P1010o4791m5298
16095A8550j41532o233J16612q5804j84620n737J94522Q4808q2586M8690j25397
16084a68727N833L7424O6361L10421N5850n1116l01833k82636L5321R8093Q4361
16073a10648O2983r243M547p8784o4857M5556J09441n209j16183P8608m9595J2267
$$ plain form
16061 -121117 -148846 9714 -67547 10985 67498 150593 16313 -1522 -44065 5966 20076
16050 20076 190409 306709 212753 35343 -86959 -58927 91902 289807 400449 284263
16040 284263 43553 -72066 85738 -77034 -350541 -319041 -131239 112939 240775 239216
16030 239216 108814 -76571 -176972 -352692 -381706 -425438 -518101 -419628 -461775 -454279 -289461
16019 -289461 -193432 -188029 -123028 10348 92003 -61967 -138537 -110519 -43333 -3699 81505
16008 81505 149073 62096 -169425 -215432 -13281 161910 387195 495623 440860 232902
15998 232902 98627 195557 40748 -58620 -244497 -276880 -221818 -201867 -222699 -373513 -379074
15987 -379074 -157443 -223111 -255541 -362845 -441460 -387612 -197494 58203 143421 104825 57776
$$ packed form
16061a21117k7729J58560p7261P8532N6513Q3095j34280j7835m2543N0031J4110
16050B0076J70333J16300r3956j77410j22302K8032J50829J97905J10642j16186
16040B84263k40710j15619J57804j62772k73507L1500J87802K44178J27836j559
16030B39216j30402j85385j00401j75720k9014m3732r2663R8473m2147P496J64818
16019b89461R6029N403O5001J33376Q1655j53970p6570K8018O7186L9634Q5204
16008H1505O7568q6977k31521m6007K02151J75191K25285J08428n4763k07958
15998B32902j34275R6930j54809r9368j85877l2383N5062J9951k0832j50814n561
15987c79074K21631o5668l2430j07304p8615N3848J90118K55697Q5218l8596m7049
$$ plain form
15976 57776 -23493 -101735 42032 246478 17960 -272163 -277215 -115131 105610 205017 -24246
15965 -24246 -243171 -195723 -39653 -50303 7050 -37873 -157027 -65566 -97842 -96946 -81094
15954 -81094 -133631 -172912 -22274 159297 71690 -170867 -172423 -175136 -162533 -175014 -64375
15943 -64375 -62844 -137018 -100841 174276 200225 231245 -50817 -120225 41 -23425 -64759
15932 -64759 -1958 247842 317979 157796 130274 -18437 -12523 -117434 114730 302274 211794
15921 211794 202039 122013 93481 18291 154252 151845 -36578 -28060 -145904 -156665 -14034
15910 -14034 -1046 -19157 117972 -7696 -59786 108042 57683 -11064 -163410 -276951 -548792
15899 -548792 -339333 -285278 -320655 -213606 -60333 240040 403723 240610 -111816 -140328
$$ packed form
15976E7776q1269p8242J43767K04446k28518k90123n052J62084K20741R9407k29263
15965b4246k18925M7448J56070j0650N7353m4923j19154R1461l2276Q96J5852
15954h1094n2537l9281J50638J81571q7607k42557j556k713J2603j2481J10639
15943f4375J531p4174L6177K75117K5949L1020k82062o9408J20266k3466m1334
15932f4759O2801K49800P0137j60183k7522j48711N914j04911K32164J87544r0480
15921B11794r755q0026k8532p5190J35961k407j88423Q518j17844j0761J42631
15910a4034J2988j8111J37129j25668n2090J67828n0359o8747j52346j13541k71841
15899e48792K09459N4055l5377J07049J53273L00373J63683j63113l52426k8512
$$ plain form
15889 -140328 -92077 -228357 46335 45846 -34562 173660 278065 268648 236426 204224 115700
15878 115700 111584 251193 299438 127953 -86094 -224387 -142735 83791 244514 12353
15868 12353 -95888 -121220 -74066 50667 -15487 -167973 51277 291521 207798 41664
15858 41664 -70955 -10096 193968 239012 42233 -76809 -125647 -125158 -194729 -61305 148794
15847 148794 -32460 -69209 -4052 84062 168186 170532 147163 136219 -8897 -156105 -320703
15836 -320703 -513058 -460381 -337640 -396925 -528442 -394642 -293541 -200418 -27414 10839
15826 10839 -31143 106548 265772 247160 45783 90864 91930 40038 27453 -179979 -280011
15815 -280011 -137786 -74347 31424 -16908 -186905 -169835 -54017 -132485 -206800 -308797
$$ packed form
15889a40328M8251j36280K74692m89q0408K08222J04405r417l2222l2202q8524
15878A15700m116J39609M8245j71485k14047j38293Q1652K26526J60723k32161
15868A2353j08241k5332M7154J24733o6154j52486K19250K40244q3723j66134
15858D1664j12619O0859K04064M5044j96779j19042m8838M89o9571J33424K10099
15847A48794j81254l6749O5157Q8114Q4124K346k3369j0944j45116j47208j64598
15836c20703j92355N2677J22741n9285j31517J33800J01101R3123J73004L8253
15826A0839m1982J37691J59224j8612k01377M5081J066n1892j2585k07432j00032
15815b80011J42225O3439J05771m8332j69997J7070J15818p8468p4315j01997
$$ plain form
15805 -308797 -151763 81617 106304 155131 71430 -292638 -473900 -453370 -314112 -176455
15795 -176455 46514 26683 87835 32993 -116137 -181816 -210724 -301839 -231267 -13109 19111
15784 19111 29747 165921 209992 160654 141748 290489 291642 224488 106178 43324 -166198
15773 -166198 -286252 -363779 -289296 -196520 -250040 -238138 -125060 143541 40960 30816 -94729
15762 -94729 -214688 21131 126894 194278 190511 164031 336079 330090 -48345 -78669 87036
15751 87036 170274 273648 244673 -60486 -26069 -49993 31765 178607 265086 296561 343116
15740 343116 68737 -108220 -116413 5117 -49801 -270557 -202569 12635 -70646 -176137
15730 -176137 -311103 -351662 -214018 -102771 1139 100940 40934 -82751 -94097 -153360
$$ packed form
15805c08797J57034K33380K4687M8827q3701l64068j81262K0530J39258J37657
15795a76455K22969j9831O1152n4842j49130o5679k8908r1115P0572K18158L2220
15784A9111J0636J36174M4071m9338j8906J48741J153o7154j18310o2854k09522
15773a66198j20054p7527P4483R2776n3520J1902J13078K68601j02581j0144j25545
15762i4729j19959K35819J05763O7384l767k6480J72048n989l78435l0324J65705
15751H7036Q3238J03374k8975l05159L4417k3924Q1758J46842Q6479L1475M6555
15740C43116k74379j76957q193J21530n4918k20756O7988K15204q3281j05491
15730a76137j34966m0559J37644J11247J03910R9801o0006j23685j1346n9263
$$ plain form
15720 -153360 -112179 -77841 -182738 -162048 41835 248859 314008 282829 110921 31226 40517
15709 40517 -83105 -91424 -17458 27989 -14289 20538 106160 -34766 -68312 129611 164433
15698 164433 234489 95899 138485 80078 -106344 -187383 -284065 -173203 -53951 -32067 58274
15687 58274 -3500 4544 -13995 74595 -113636 -251609 -341479 -448576 -474135 -325085 -279234
15676 -279234 -325388 -314854 -93719 41680 34462 -143622 -130382 -179155 -269191 -167519 -78911
15665 -78911 -78789 -133958 -188438 -90640 -185019 -275690 -237054 -103021 -72680 -102842 -224218 -390140
15653 -390140 -413631 -483440 -313458 -80594 126003 237509 84047 25876 -76710 -123886
15643 -123886 -133472 -250937 -221164 -110630 45300 59763 289415 287897 84500 61178 -5615
$$ packed form
15720a53360M1181L4338j04897K0690K03883K07024O5149l1179j71908p9695R291
15709D0517j23622q319P3966M5447m2278L4827Q5622j40926l3546J97923L4822
15698A64433P0056j38590M2586n8407j86422q1039r6682J10862J19252K1884R0341
15687E8274o1774Q044j8539Q8590j88231j37973q9870j07097k5559J49050M5851
15676b79234m6154J0534K21135J35399p218j78084J3240m8773r0036J01672Q8608
15665g8911J22n5169n4480R7798r4379r0671L8636J34033L0341l0162j21376j65922
15653c90140k3491o9809J69982K32864K06597J11506j53462n8171j02586m7176
15643a23886r586j17465K9773J10534J55930J4463K29652j518k03397k3322o6793
$$ plain form
15632 -5615 -151835 45676 15261 4687 171817 113620 -12382 -45080 -62394 21452 80997
15621 80997 -25191 -143605 37093 23250 -70349 15863 138057 217667 106453 5170
15611 5170 34072 88081 2850 69917 -139442 -266868 -294147 -247786 -45602 30296 -54694
15600 -54694 65049 102787 -32234 -26619 148944 63642 -37777 -116050 -85064 88638 219951
15589 219951 105235 -44023 -37599 19709 45094 -1415 -36335 -81051 30242 -235773 -340323
15578 -340323 -286725 -165777 -36706 86802 93058 -45220 -187230 -23974 99814 125861
15568 125861 -22634 -9291 -46578 -125428 55896 104298 228495 190888 -70973 -34491 -55833
15557 -55833 -154799 -220684 -70322 220806 250491 325097 455792 617302 280628 -52373
$$ packed form
15632e615j46220J97511l0415j0574J67130n8197j26002l2698j7314Q3846N9545
15621H0997j06188j18414J80698j3843r3599Q6212J22194P9610j11214j01283
15611E170K8902N4009q5231O7067k09359j27426k7279M6361K02184P5898q4990
15600e4694J19743L7738j35021N615J75563q5302j01419p8273L0986J73702J31313
15589B19951j14716j49258O424N7308K5385m6509l4920m4716J11293k66015j04550
15578c40323N3598J20948J29071J23508O256j38278j42010J63256J23788K6047
15568A25861j48495J3343l7287p8850J81324M8402J24197l7607k61861L6482k1342
15557e5833r8966o5885J50362K91128K9685P4606J30695J61510l36674l33001
$$ plain form
15547 -52373 -102837 85317 115850 122128 77585 123201 -107015 -79077 -11181 -84811 -190226
15536 -190226 -191852 7027 54197 -30861 -133065 -123662 -194053 -289028 -231221 -5488 10191
15525 10191 -145347 -356568 -368547 -201121 -148324 -123399 -67817 -7534 55184 40088 101447
15514 101447 60943 -135666 -231250 -241640 -209157 -131639 -108281 -233157 -136938 33678 -53901
15503 -53901 -61884 -257641 -311198 -163714 84979 -6040 -282797 -314122 -111387 126007 131514
15492 131514 -168833 -102122 -148894 -158238 -25306 -76218 -178505 -271781 -342310 -274317 -167351
15481 -167351 -79326 32329 153503 133097 32737 -133 28854 -97667 -239084 -246896 -285085
15470 -285085 -281783 -154820 85806 -76694 -203464 -296185 -259753 -254715 -291396 -185249 -138846
$$ packed form
15547e2373n0464J88154L0533O278m4543M5616k30216K7938O7896p3630j05415
15536a90226j626J98879M7170q5058j02204R403p0391r4975N7807K25733J5679
15525A0191j55538k11221j1979J67426N2797K4925N5582O0283O2718j5096O1359
15514A01447m0504j96609r5584j0390L2483P7518K3358j24876R6219J70616q7579
15503e3901p983j95757n3557J47484K48693r1019k76757l1325K02735K37394N507
15492A31514l00347O6711m6772r344J32932n0912j02287r3276p0529O7993J06966
15481a67351Q8025J11655J21174k0406j00360l2870K8987j26521j41417p812l8189
15470b85085L302J26963K40626j62500j26770r2721L6432N038l6681J06147M6403
$$ plain form
15459 -138846 52458 322968 257329 137891 132595 90205 -102880 -208833 -254147 -80849
15449 -80849 32639 -122532 -240089 -142036 -30763 -21661 -100257 -112914 -98545 -269865 -401759
15438 -401759 -365875 -205196 87763 142888 76793 86650 60918 -70269 -248540 -265502 -43353
15427 -43353 -67194 54918 122328 82661 87684 56721 147917 4306 -25662 16548 -219731
15416 -219731 -281906 -307818 -133678 23821 168969 283649 227713 343658 318967 271137
15406 271137 252695 211056 84048 90746 43978 -26070 135379 103473 163605 117493 186594
15395 186594 273055 385307 362080 362952 275717 281291 61927 9755 -37404 -108857 -14781 53544
15383 53544 146039 239154 118373 27719 -25841 -140924 -241495 -214885 -104003 -210906 -368475
$$ packed form
15459a38846J91304K70510o5639j19438n296m2390j93085j05953m5314J73298
15449h0849J13488j55171j17557R8053J11273R102p8596j2657J4369j71320j31894
15438d01759L5884J60679K92959N5125o6095R857k5732j31187j78271j6962K22149
15427d3353k3841J22112O7410l9667N023l0963R1196j43611k9968M2210k36279
15416b19731o2175k5912J74140J57499J45148J14680n5936J15945k4691m7830
15406B71137j8442m1639j27008O698m6768p0048J61449l1906O0132m6112O9101
15395A86594Q6461J12252k3227Q72q7235N574k19364n2172m7159p1453R4076O8325
15383E3544R2495R3115j20781r0654n3560j15083j00571K6610J10882j06903j57569
$$ plain form
15372 -368475 -234650 31265 282237 180353 35323 16060 248498 162160 63794 65827
15362 65827 111008 132324 59959 34382 -133437 -193369 -320903 -181650 -107125 7844 78314
15351 78314 107163 -78556 -138813 -232035 -259304 -136478 -130024 -7520 -113747 -130948 -103735
15340 -103735 -117631 -181537 -137709 -21545 191069 124074 31049 -59718 -97747 -210327 -310215
15329 -310215 -238689 -101769 105075 237561 153159 -65291 -65075 -34347 -100498 -227600 -225306
15318 -225306 -352200 -473641 -298627 -95894 -105190 -312829 -262002 2300 77564 -74338
15308 -74338 18123 -60652 -260301 -150866 -26100 -85637 -274687 -343619 -362563 -162021 -166844
15297 -166844 -230739 -148144 94145 39619 -68062 -196837 -76648 -110793 -171135 -68550
$$ packed form
15372c68475J33825K65915K50972j01884j45030j9263K32438q6338r8366K033
15362F5827M5181K1316p2365k5577j67819n9932j27534J39253P4525J14969P0470
15351G8314K8849j85719o0257r3222k7269J22826O454J22504j06227j7201K7213
15340a03735j3896o3906M3828J16164K12614o6995r3025r0767l8029j12580r9888
15329c10215P1526J36920K06844J32486q4402k18450K16L0728o6151j27102K294
15318b25306j26894j21441J75014K02733r296k07639N0827K64302P5264j51902
15308g4338R2461p8775j99649J09435J24766n9537j89050o8932j8944K00542m823
15297a66844o3895Q2595K42289n4526j07681j28775J20189l4145o0342J02585
$$ plain form
15287 -68550 -28213 142968 145872 90078 253429 231603 212914 111346 -67643 -169180 -264979
15276 -264979 -66193 88078 109382 51914 144308 161778 153744 261643 111628 12251 98165
15265 98165 106473 256239 408870 326301 178668 -19930 -24454 -254849 -477229 -341201 -301401
15254 -301401 -212073 -245121 -266250 -133947 704 76921 141160 72703 150571 275309 131959
15243 131959 51 -44628 -122265 -173436 -145543 -40711 59139 178103 363163 408614 359717
15232 359717 303806 355527 350690 217699 62257 110164 214975 336724 379845 225060 84581
15221 84581 -54778 -125579 -28137 -74058 -78430 -43566 -131530 -175858 -191681 -64363 207849
15210 207849 139725 -36960 21997 219930 386458 207588 53592 -104275 -52481 194401
$$ packed form
15287f8550M0337J71181K904n5794J63351k1826j8689j01568j78989j01537r5799
15276b64979J98786J54271K1304n7468R2394J7470q034J07899j50015r9377Q5914
15265I8165Q308J49766J52631q2569j47633j98598m524k30395k22380J36028L9800
15254c01401Q9328l3048k1129J32303J34651P6217O4239o8457P7868J24738j43350
15243A31959j31908m4679p7637n1171K7893J04832R9850J18964J85060M5451m8897
15232C59717n5911N1721m837j32991j55442M7907J04811J21749M3121j54785j40479
15221H4581j39359p0801R7442m5921m372L4864q7964m4328j5823J27318K72212
15210B07849o8124j76685N8957J97933J66528j78870j53996j57867N1794K46882
$$ plain form
15200 194401 410913 294541 164214 109534 106714 95660 162210 329922 411205 341918 379896
15189 379896 294686 223924 219406 354126 492593 352721 171151 180046 -9200 -68035 -66238
15178 -66238 -40990 -65029 -45470 -119453 -324909 -154318 121355 169395 -83513 -147616 -13544
15167 -13544 8219 -76428 -232437 -250742 -148135 -102448 -210724 -332502 -324748 -136053 -29584
15156 -29584 -99432 -353096 -314459 -122956 153072 153350 96586 244476 147769 137018 167317
15145 167317 30993 6191 -274776 -299970 -6100 -178481 -256410 -102639 42244 96398
15135 96398 69308 97648 1099 -121712 -73885 -60027 -114390 -133475 -45986 89474 -18107
15124 -18107 -64749 28717 -13022 -44559 -55135 -176068 -71722 115145 192985 -36999 -185049
$$ packed form
15200A94401K16512j16372j30327n4680k820j1054O6550J67712Q1283o9287L7978
15189C79896q5210p0762m518J34720J38467j39872j81570Q895j89246n8835J797
15178f6238K5248k4039J9559p3983k05456J70591K75673M8040k52908o4103J34072
15167a3544K1763q4647j56009j8305J02607M5687j08276j21778P754J88695J06469
15156b9584o9848k53664L8637J91503K76028K78n6764J47890r6707j0751L0299
15145A67317j36324k4802k80967k5194K93870j72381p7929J53771J44883N4154
15135I6398k7090K8340r6549j22811M7827J3858n4363j9085Q7489J35460j07581
15124a8107m6642R3466m1739l1537j0576j20933J04346J86867P7840k29984j48050
$$ plain form
15113 -185049 -266324 -284817 -77626 51304 127719 81996 107290 103894 123430 -10512 -92962
15102 -92962 -157254 -171139 -56337 -85452 21016 41604 29427 57562 125867 96517 50547
15091 50547 15394 -99464 110738 91137 5705 -20906 28189 3143 -125289 -150196 -95503
15080 -95503 20054 56591 26095 21817 -127820 -226741 -193098 -187205 -106088 -84965 9568 50537
15068 50537 -19345 -223600 -168106 -96719 44456 107740 69117 52465 -29169 147954 236079
15057 236079 72068 -82234 -104188 -259265 -180040 -207879 -258037 -181195 171583 345508
15047 345508 302837 155244 64315 11053 -277308 -119836 136546 151001 108951 1972
15037 1972 -9185 139476 17937 -858 23972 -58218 -67675 -44603 -82887 230894 269273
$$ packed form
15113a85049q1275j8493K07191J28930P6415m5723K5294l396J9536j33942q2450
15102i2962o4292j3885J14802k9115J06468K0588j2177K8135O8305k9350m5970
15091E0547l5153j14858K10202j9601q5432k6611M9095k5046j28432k4907N4693
15080i5503J15557L6537l0496m278j49637r8921L3643N893Q1117K1123R4533M0969
15068E0537o9882k04255N5494P1387J41175O3284l8623j6652q1634J77123Q8125
15057B36079j64011j54302k1954j55077P9225k7839n0158P6842L52778J73925
15047C45508m2671j47593r0929n3262k88361J57472K56382J4455m2050j06979
15037A972j1157J48661j21539j8795K4830q2190r457K3072l8284L13781L8379
$$ plain form
15026 269273 -42697 -50896 -38158 150322 -5568 -156527 -118912 4690 -15270 -91384 -34787
15015 -34787 -71460 -65564 -36784 38215 73290 85896 146297 64073 175798 136876 13156
15004 13156 27230 19474 -20355 -38987 79094 138622 -47833 -208143 -302322 -249106 -157521
14993 -157521 -70332 343 40897 17494 9505 -48646 86 -65402 -108668 154028 330190
14982 330190 425497 383480 69161 -26366 -3843 202162 191025 -75155 -154262 -121853 -9135
14971 -9135 132351 124782 164427 119841 31167 60659 100561 174824 225978 40687 -21950 -110608
14959 -110608 -75818 -1458 19576 50710 2806 -172222 -241433 -221594 -213099 -176229 -101000
14948 -101000 138419 189448 172274 69895 221241 198934 188921 128154 62791 59761 76473
$$ packed form
15026B69273l11970q199J2738J88480j55890j50959L7615J23602j9960p6114N6597
15015c4787l6673N896K8780P4999L5075J2606O0401q2224J11725l8922j23720
15004A3156J4074p756l9829j8632J18081N9528j86455j60310r4179N3216R1585
14993a57521Q7189P0675M0554k3403p989n8151M8732o5488m3266K62696J76162
14982C30190R5307m2017l14319r5527K2523K06005j1137k66180p9107L2409J12718
14971i135J41486p569L9645m4586q8674K9492L9902P4263N1154j85291o2637q8658
14959a10608L4790P4360K1034L1134m7904j75028o9211J9839Q495L6870P5229
14948a01000K39419N1029j7174j02379J51346k2307j0013o0767o5363l030J6712
$$ plain form
14937 76473 102676 114249 165239 145726 45540 -146343 -192594 -103857 52242 81047 125008
14926 125008 17252 137320 141937 19465 -178720 -97718 116653 233132 205598 -55731
14916 -55731 -242694 -247339 -159542 5828 175989 1367 -224951 -196053 -72933 -270792
14906 -270792 -328436 -153477 -329316 -336349 -318850 -144142 -153338 -83779 200608 94664 -4809
14895 -4809 -205374 -78774 -167018 -88424 -73586 -10693 48011 34348 33140 42889 176525 215629
14883 215629 143507 -32764 -135529 28458 208859 327538 163212 -2889 -68826 -111799
14873 -111799 -240853 -197440 -103180 -92596 -69415 -353679 -411669 -278163 -243115 -183203 -269558
14862 -269558 -279455 -189438 -27644 162963 257307 -9180 -216733 -227653 -54060 -123788 15951
$$ packed form
14937G6473K6203J1573N0990j9513j00186j91883m6251Q8737J56099K8805M3961
14926A25008j07756J20068M617j22472j98185Q1002K14371J16479k7534k61329
14916e5731j86963m645Q7797J65370J70161j74622k26318K8898J23120j97859
14906b70792n7644J74959j75839p033J7499J74708r196O9559K84387j05944r9473
14895d809k00565J26600q8244P8594J4838O2893N8704j3663j208R749J33636L9104
14883B15629p2122j76271j02765J63987J80401J18679j64326j66101o5937m2973
14873a11799j29054M3413R4260J0584K3181k84264n7990J33506L5048N9912q6355
14862b69558r897R0017J61794J90607R4344k66487k07553j0920J73593o9728J39739
$$ plain form
14851 15951 -40657 -89056 93942 -181798 -315884 -334846 -293249 -213041 -180321 -103271 -48183
14840 -48183 173608 180991 103782 154211 6534 -298419 -237859 -141319 -127428 -35892 -21816
14829 -21816 -34677 -124772 -146193 -114979 -139721 -52839 57909 66672 -122612 -60209 68355
14818 68355 7039 -114547 -28233 -64715 102637 75709 128516 44081 -76870 -91119 -93700
14807 -93700 54249 229082 151253 32281 -123091 -12731 90720 46527 81629 93089
14797 93089 -58774 -149352 -57815 -71638 -160951 -234471 -337963 -265286 -187584 -230065 -275971
14786 -275971 -141340 -135952 -137777 -122874 -121410 -44989 -119902 -196754 -253798 -183264 -76749 -64056
14774 -64056 -243954 -291736 -149173 -184785 -42765 -7965 -206619 -126776 2666 101439 69583
$$ packed form
14851A5951n6608m8399J82998k75740j34086j8962M1597Q0208L2720P7050N5088
14840d8183K21791P383p7209N0429j47677l04953O0560R6540J3891R1536J4076
14829b1816j2861r0095k1421L1214k4742Q6882J10748Q763j89284O2403J28564
14818F8355o1316j21586Q6314l6482J67352k6928N2807q4435j20951j4249k581
14807i3700J47949J74833p7829j18972j55372J10360J03451m4193L5102J1460
14797I3089j51863r0578R1537j3823q9313p3520j03492P2677P7702m2481m5906
14786b75971J34631N388j825J4903J464P6421p4913p6852n7044P0534J06515J2693
14774f4056j79898m7782J42563l5612J42020L4800j98654P9843J29442R8773l1856
$$ plain form
14763 69583 -181931 -297298 -304794 -105600 -24719 42066 144960 -18599 -164841 6189
14753 6189 142262 87019 121304 65372 -5548 -76832 -42439 -135476 -164913 -110159 -6057
14742 -6057 34136 21822 -33516 -268380 -176023 -118120 -5039 130217 93202 -130555 -282259
14731 -282259 -273153 -78014 -36630 19197 12178 83293 112286 -137802 -100565 11292 6347
14720 6347 -66343 -123174 -221747 -121262 -117726 -169122 -115168 -170243 -152307 -80261 -52501 31241
14708 31241 -26971 -16947 -45931 -177483 -206904 -229699 -185611 -267038 -394082 -300742 -297358
14697 -297358 -333718 -150441 -21743 6788 61527 140075 -4124 99242 -6891 7890
14687 7890 70380 47674 47835 132594 188785 112277 12070 -184399 -200920 43542 95000 72376
$$ packed form
14763F9583k51514j15367p496J99194Q0881O6785J02894j63559j46242J71030
14753F189J36073n5243L4285n5932p0920p1284L4393r3037k9437N4754J04102
14742f057M0193j2314n5338k34864R2357N7903J13081J35256l7015k23757j51704
14731b82259R106J95139M1384N5827p019P1115K8993k50088L7237J11857m945
14720F347p2690n6831r8573J00485L536n1396N3954n5075J7936P2046K7760Q3742
14708C1241n8212J0024k8984j31552k9421k2795M4088q1427j27044R3340L384
14697b97358l6360J83277J28698K8531N4739P8548j44199J03366j06133J4781
14687G890O2490k2706J61Q4759N6191p6508j00207j96469j6521K44462N1458k2624
$$ plain form
14675 72376 113430 156524 130444 138728 100754 7383 -2484 96220 -39716 -192667 -23914
14664 -23914 44282 175887 91301 15383 -105478 -335156 -67231 169836 161179 -90748 -54557
14653 -54557 46654 -19906 -242264 -309538 -77728 77662 24346 -45053 48195 78677 61256
14642 61256 85685 -19191 86875 223264 119587 126692 173243 204500 202405 105766 -124624
14631 -124624 -113594 147681 230990 96538 -202758 -275345 -232671 -432981 -486927 -360660
14621 -360660 -372647 -325911 -419246 -440941 -141919 -57001 -233325 -315726 -111932 144022 146238
14610 146238 -21367 -83923 -79219 131 177007 246325 182778 135942 190982 131158 158563
14599 158563 -28975 -53214 93380 60234 79348 192617 10605 57972 32627 -14810 -173549
$$ packed form
14675G2376M1054M3094k6080Q284l7974r3371r867R8704j35936j52951J68753
14664b3914O8196J31605q4586p5918j20861k29678K67925K37067q657k51927L6191
14653e4557J01211o6560k22358o7274K31810J55390n3316o9399R3248L0482j7421
14642F1256K4429j04876J06066J36389j03677P105M6551L1257k095r6639k30390
14631a24624J1030K61275Q3309j34452k99296p2587M2674k00310n3946J26267
14621c60660j1987M6736r3335k1695K99022Q4918j76324q2401K03794K55954K216
14610A46238j67605o2556M704P9350J76876O9318o3547m6836N5040n9824K7405
14599A58563j87538k4239J46594l3146J9114J13269j82012M7367k5345m7437j58739
$$ plain form
14588 -173549 -332466 -471093 -276784 -101195 -28070 61692 -71369 4400 31174 202735
14578 202735 170539 72845 39702 -51104 -159748 -197606 -360435 -343914 -161122 40077 39839
14567 39839 -131229 -250839 -458368 -380501 -175971 59331 174522 86434 14931 -120383
14557 -120383 34917 72272 -19743 16766 162319 143311 76611 55851 93925 20393 -223612
14546 -223612 -102160 -59560 -122704 -152671 -57834 -169949 -267936 -279405 -265710 -146703 -190354
14535 -190354 -447414 -479651 -295680 -113269 9952 119542 33887 -106982 -177132 -279425
14525 -279425 -272217 -182566 -217573 -49204 21375 76677 -108454 -252812 -241335 -208637 -141751
14514 -141751 261 61224 26938 31095 -23770 -109651 -47277 -76258 -48261 -4667 87035
$$ packed form
14588a73549j58917j38627J94309J75589P3125Q9762j33061P5769K6774J71561
14578B02735l2196r7694l3143r0806j08644l7858j62829J6521J82792K01199k38
14567C9839j71068j19610k07529P7867K04530K35302J15191q8088p1503j35314
14557a20383J55300L7355r2015L6509J45553j9008o6700k0760L8074p3532k44005
14546b23612J21452M2600o3144k9967R4837j12115r7987j1469J3695J19007m3651
14535a90354k57060l2237J83971J82411J23221J09590q5655j40869p0150j02293
14525b79425P208Q9651l5007J68369P0579N5302j85131j44358J1477L2698O6886
14514a41751J42012O0963l4286M157n4865q5881O2374k8981K7997M3594R1702
$$ plain form
14503 87035 -19691 -88100 -83971 86653 232393 82486 -42186 -202499 -205829 -238123 -193448
14492 -193448 64045 157784 159419 112225 140355 58473 -62156 -218218 -232975 42500 126261
14481 126261 -12190 -179391 -81948 -132274 -152807 -94780 -49916 -71668 -109519 -23482 4732
14470 4732 -145208 -308787 -253377 -202043 -4739 229138 332517 243122 154934 287756 193123
14459 193123 40788 147043 35729 -183915 -45336 124903 189996 68273 -127286 -89897
14449 -89897 3469 -28082 -25653 -171276 -286734 -249599 -203366 53128 54903 -133143 -214307
14438 -214307 -221282 -206853 -94455 -232920 -279949 -200182 -159955 -142386 -73617 -169595 -11821
14427 -11821 75017 -18614 -50054 -50032 -139092 -154351 -42639 114038 -76468 -103902 -50210 998
$$ packed form
14503H7035j06726o8409M129J70624J45740j49907j24672j60313l330l2294M4675
14492a93448K57493R3739J635m7194K8130q1882j20629j56062j4757K75475Q3761
14481A26261j38451j67201R7443n0326k0533N8027M4864k1752l7851Q6037K8214
14470D732j49940j63579N5410N1334J97304K33877J03379q9395q8188J32822r4633
14459A93123j52335J06255j11314k19644J38579J70239O5093j21723j95559L7389
14449h9897R3366l1551K429j45623j15458L7135M6233K56494J775j88046q1164
14438b14307o975J4429J12398j38465m7029P9767M0227J7569O8769r5978J57774
14427a1821Q6838r3631l1440K2q9060j5259J11712J56677j90506k7434N3692N1208
$$ plain form
14415 998 -67943 -140166 -244433 -226194 -217921 -122835 -166436 -239542 -288414 -418519 -344343 -12971
14403 -12971 110438 -16623 -110887 -117869 9448 39654 3642 -61613 178276 395533 462316
14392 462316 294046 154987 130137 226901 54738 2470 112178 54540 -105213 -138415
14382 -138415 -210489 -176704 -434195 -271660 -272489 -238845 -190945 4319 136731 6041 -74092
14371 -74092 -190557 -174537 -73222 -53595 -204731 -85571 100091 147473 -122802 -217089
14361 -217089 -167905 -207933 -63618 229370 41660 -104676 -4009 170705 245411 150884
14351 150884 57352 -85265 -69004 1621 112279 64750 71047 -48598 -52996 -22544 59900
14340 59900 61341 49700 -15184 -168755 -166137 -27068 -25641 -92762 -211190 -264066 -296504 -436120
$$ packed form
14415I98o8941p2223j04267J8239Q273R5086m3601p3106m8872j30105P4176L31372
14403a2971J23409j27061r4264o982J27317L0206l6012o5255K39889K17257O6783
14392D62316j68270j39059k4850R6764j72163n2268J09708n7638j59753l3202
14382a38415p2074L3785k57491J62535q29L3644M7900J95264J32412j30690q0133
14371g4092j16465J6020J01315J9627j51136J19160J85662M7382k70275r4287
14361b17089M9184m0028J44315K92988j87710j46336J00667J74714P4706r4527
14351A50884r3532j42617J6261P0625J10658m7529O297j19645m398L0452Q2444
14340E9900J441j1641o4884j53571K618J39069J427o7121j18428n2876l2438j39616
$$ plain form
14328 -436120 -388785 -339271 -219167 -104757 -113927 -91182 18281 215224 206260 5483 -143492
14317 -143492 -135630 -403596 -496083 -385486 -239649 35605 284674 269492 248696 144050
14307 144050 -22741 -98747 70784 48771 -89843 -339659 -250708 -237082 -285046 -236372 -95011
14296 -95011 178364 16959 -148666 -105980 -8025 97401 -48296 -148369 -141625 -111654 -94345
14285 -94345 -24307 -45394 -27224 136895 221711 272879 153697 137654 194293 188885 119813
14274 119813 224638 322722 239791 165504 112615 109872 -30132 -182662 -121597 -35989 5647
14263 5647 -91906 -148783 -96691 -55684 1111 -38785 -17068 137894 146845 208405 260132 202127
14251 202127 241040 242408 105878 130926 82166 -74761 -223384 -251697 -330542 -174619 -160267
$$ packed form
14328d36120M7335M9514J20104J14410r170K2745J09463J96943q964k00777j48975
14317a43492P862k67966r2487J10597J45837K75254K49069j5182k0796j04646
14307A44050j66791p6006J69531k2013j38614k49816Q8951J3626m7964M8674J41361
14296i5011K73375j61405j65625M2686R7955J05426j45697j00073O744K9971J7309
14285i4345P0038k1087J8170J64119Q4816N1168j19182j6043N6639n408o9072
14274A19813J04825R8084q2931p4287n2889k743j40004j52530O1065Q5608M1636
14263E647r7553n6877N2092M1007N6795l9896K1717J54962Q951O1560N1727n8005
14251B02127L8913J368j36530K5048m8760j56927j48623k8313p8845J55923J4352
$$ plain form
14240 -160267 -214206 -136032 159 5839 -198244 -254673 -210791 -100912 -7018 81463 113195
14229 113195 235704 256849 94574 -132379 -117860 -26768 49716 -107610 -469137 -481770
14219 -481770 -288623 -198332 -268029 -378382 -522284 -302753 -17622 7107 -163764 -282404
14209 -282404 -178603 -154055 -150706 -210601 -208742 -129667 107252 86153 95557 42397 -15877 126591
14197 126591 53155 -106462 -104917 -306050 -257292 -211897 -113868 116278 208025 -61065 -297884
14186 -297884 -322153 -194282 -193728 -178072 -100288 -218517 15712 59013 -23084 -121892 116244
14175 116244 162511 -13972 49575 -17840 -52050 -125695 -164038 -123074 -46515 198246 210195
14164 210195 186989 130616 19504 -15307 -92190 -23444 174607 299647 211781 136497 -142476
$$ packed form
14240a60267n3939P8174J36191N680k04083n6429M3882J09879R3894Q8481L1732
14229A13195J22509K1145j62275k26953J4519R1092P6484j57326l61527j2633
14219d81770J93147R0291o9697j10353j43902K19531K85131K4729j70871j18640
14209b82404J03801K4548L349n9895J859P9075K36919k1099R404n3160n8274J42468
14197A26591p3436j59617J545k01133M8758M5395R8029K30146R1747k69090k36819
14186b97884k4269J27871N54J5656P7784j18229K34229M3301q2097r8808K38136
14175A16244M6267j76483O3547o7415l4210p3645l8343M0964P6559K44761J1949
14164B10195k3206n6373j11112l4811p6883O8746J98051J25040q7866p5284k78973
$$ plain form
14153 -142476 -351072 -358880 -233859 -142381 -84111 -105832 -165649 -89167 87879 -4480 88602
$$ packed form
14153a42476k08596p808J25021R1478N8270k1721n9817P6482J77046r2359R3082
$$ [...]
##END NTUPLES=NMR SPECTRUM
##END=
