##TITLE=Analysis number 312263
Compound Code cc 18413
Project Code adrs
Chemist Name endeavour
##JCAMPDX= 6.0         $$ Bruker NMR JCAMP-DX V2.0
##DATA TYPE= NMR SPECTRUM
##DATA CLASS= NTUPLES
##ORIGIN= Bruker BioSpin GmbH
##OWNER= NMR
$$ XWIN-NMR		Version 3.5
$$ Mon Aug  1 10:14:42 2005 GMT Daylight Time (UT+1h)  MAYBRIDGE\NMR@NMR_250MHZ
##.OBSERVE FREQUENCY= 250.131544655141
##.OBSERVE NUCLEUS= ^1H
##.ACQUISITION MODE= SIMULTANEOUS (DQD)
##.ACQUISITION SCHEME= undefined
##.AVERAGES= 16
##.DIGITISER RES= 18
##SPECTROMETER/DATA SYSTEM= dpx250
##.PULSE SEQUENCE= zg30
##.SOLVENT NAME= CDCl3
##.SHIFT REFERENCE= (INTERNAL, CDCl3, 0, 16.522)
##AUDIT TRAIL= $$ (NUMBER, WHEN, WHO, WHERE, WHAT)
$$ ##TITLE= Audit trail, XWIN-NMR		Version 3.5
$$ ##JCAMPDX= 5.01
$$ ##ORIGIN= Bruker BioSpin GmbH
$$ ##OWNER= NMR
$$ C:\u/data/dgb/nmr/ADRS/6890/pdata/1/auditp.txt
$$ ##AUDIT TRAIL=  $$ (NUMBER, WHEN, WHO, WHERE, WHAT)
(   1,<2005-08-01 10:14:24.23 +100>,<MAYBRIDGE\NMR>,<NMR_250MHZ>,
      <created by zg, POWCHK disabled, PULCHK disabled
       configuration hash MD5:
       62 19 C7 07 E1 42 D1 B7 37 6C 3D D0 77 39 F9 E6
       data hash MD5: 64K
       D3 83 B1 6C 01 6D 3C 2C B1 25 D6 5A 50 DA 68 ED>)
(   2,<2005-08-01 10:14:35.26 +100>,<MAYBRIDGE\NMR>,<NMR_250MHZ>,
      <Start of raw data processing
       ef LB = 0.3 FT_mod = 6 PKNL = 1 SI = 32K 
       data hash MD5: 32K
       25 25 61 12 85 00 B2 C5 28 B6 47 A3 05 8F 2B 82>)
(   3,<2005-08-01 10:14:37.15 +100>,<MAYBRIDGE\NMR>,<NMR_250MHZ>,
      <apk 
       data hash MD5: 32K
       F6 FC 6F 0C 3C 08 C3 4F E8 82 23 0D 70 32 87 77>)
(   4,<2005-08-01 10:14:37.82 +100>,<MAYBRIDGE\NMR>,<NMR_250MHZ>,
      <abs ABSG = 5 
       data hash MD5: 32K
       4B FA 95 E0 D0 DF 4A 96 0F AD 5A 62 2F A8 62 CA>)
$$ ##END=
$$ 
$$ hash MD5
$$ 6D 15 3E 8A 30 13 A2 05 43 8A 2D 26 E8 47 0F E2
##$RELAX= 
##$RELAX= 
##$RELAX= 
##$RELAX= 
##$RELAX= 
##$RELAX= 
##$RELAX= 
$$ Bruker specific parameters
$$ --------------------------
##$DU= <C:\u>
##$EXPNO= 6890
##$NAME= <ADRS>
##$PROCNO= 1
##$TYPE= <nmr>
##$USER= <dgb>
##$AMP= (0..31)
100 100 100 100 100 100 100 100 100 100 100 100 100 100 100 100 100 100 
100 100 100 100 100 100 100 100 100 100 100 100 100 100 
##$AQSEQ= 0
##$AQ_mod= 3
##$AUNM= <au_zg>
##$AUTOPOS= <7 >
##$BF1= 250.13
##$BF2= 250.13
##$BF3= 250.13
##$BF4= 250.13
##$BF5= 500.13
##$BF6= 500.13
##$BF7= 500.13
##$BF8= 500.13
##$BYTORDA= 1
##$CFDGTYP= 0
##$CFRGTYP= 5
##$CHEMSTR= <none>
##$CNST= (0..31)
1 1 145 1 1 1 1 1 1 1 1 1 1 1 1 1 1 1 1 1 1 1 1 1 1 1 1 1 1 1 1 1 
##$CPDPRG= <>
##$CPDPRG1= <>
##$CPDPRG2= <>
##$CPDPRG3= <>
##$CPDPRG4= <mlev>
##$CPDPRG5= <mlev>
##$CPDPRG6= <mlev>
##$CPDPRG7= <mlev>
##$CPDPRG8= <mlev>
##$CPDPRGB= <>
##$CPDPRGT= <>
##$D= (0..31)
0 1 0 0 0 0 0 0 0 0.06 0 0 0 0 0 0 0.0002 0 0 0 0 0 0 0 0 0 0 0 0 0 0 
0 
##$DATE= 1122887663
##$DBL= (0..7)
120 120 120 120 120 120 120 120 
##$DBP= (0..7)
150 150 150 150 150 150 150 150 
##$DBP07= 0
##$DBPNAM0= <>
##$DBPNAM1= <>
##$DBPNAM2= <>
$$ [...]
##$SUBNAM7= <"">
##$SUBNAM8= <"">
##$SUBNAM9= <"">
##$SW= 20.6930455092707
##$SWIBOX= (0..15)
0 0 3 0 0 0 0 0 0 0 0 0 0 0 0 0 
##$SW_h= 5175.983436853
##$TD= 65536
##$TD0= 1
##$TE= 295.16
##$TE2= 300
##$TE3= 300
##$TEG= 300
##$TL= (0..7)
0 120 120 120 120 120 120 120 
##$TP= (0..7)
150 150 150 150 150 150 150 150 
##$TP07= 0
##$TPNAME0= <>
##$TPNAME1= <>
##$TPNAME2= <>
##$TPNAME3= <>
##$TPNAME4= <>
##$TPNAME5= <>
##$TPNAME6= <>
##$TPNAME7= <>
##$TPOAL= (0..7)
0.5 0.5 0.5 0.5 0.5 0.5 0.5 0.5 
##$TPOFFS= (0..7)
0 0 0 0 0 0 0 0 
##$TUNHIN= 0
##$TUNHOUT= 0
##$TUNXOUT= 0
##$USERA1= <user>
##$USERA2= <user>
##$USERA3= <user>
##$USERA4= <user>
##$USERA5= <user>
##$V9= 5
##$VALIST= <valist>
##$VCLIST= <CCCCCCCCCCCCCCC>
##$VD= 0
##$VDLIST= <DDDDDDDDDDDDDDD>
##$VPLIST= <PPPPPPPPPPPPPPP>
##$VTLIST= <TTTTTTTTTTTTTTT>
##$WBST= 1024
##$WBSW= 4
##$XGAIN= (0..3)
0 0 0 0 
##$XL= 0
##$YL= 0
##$YMAX_a= 308811
##$YMIN_a= -309318
##$ZGOPTNS= <>
##$ZL1= 120
##$ZL2= 120
##$ZL3= 120
##$ZL4= 120
##$ABSF1= 16.522
##$ABSF2= -4.171173
##$ABSG= 5
##$ABSL= 3
##$ALPHA= 0
##$AQORDER= 0
##$ASSFAC= 0
##$ASSFACI= 0
##$ASSFACX= 0
##$ASSWID= 0
##$AUNMP= <proc_1d>
##$AZFE= 0.1
##$AZFW= 0.1
##$BCFW= 0
##$BC_mod= 0
##$BYTORDP= 0
##$COROFFS= 0
##$CY= 12.5
##$DATMOD= 1
##$DC= 0
##$DFILT= <>
##$DTYPP= 0
##$F1P= 14.0000005364418
##$F2P= -0.99999901652339
##$FCOR= 0.5
##$FTSIZE= 32768
##$FT_mod= 6
##$GAMMA= 0
##$GB= 0
##$INTBC= 1
##$INTSCL= 1
##$ISEN= 128
##$LB= 0.3
##$LEV0= 0
##$LPBIN= 0
##$MAXI= 10000
##$MC2= 0
##$MEAN= 0
##$ME_mod= 0
##$MI= 0
##$NCOEF= 0
##$NC_proc= -4
##$NLEV= 6
##$NOISF1= 0
##$NOISF2= 0
##$NSP= 0
##$NTH_PI= 0
##$NZP= 0
##$OFFSET= 16.522
##$PC= 1
##$PHC0= -76.72457
##$PHC1= 6.50712
##$PH_mod= 1
##$PKNL= yes
##$PPARMOD= 0
##$PSCAL= 4
##$PSIGN= 0
##$REVERSE= no
##$SF= 250.13
##$SI= 32768
##$SIGF1= 0
##$SIGF2= 0
##$SINO= 400
##$SIOLD= 32768
##$SREGLST= <1H.CDCl3>
##$SSB= 0
##$STSI= 32768
##$STSR= 0
##$SW_p= 5175.98343685301
##$SYMM= 0
##$S_DEV= 0
##$TDeff= 65536
##$TDoff= 0
##$TI= <Analysis number 999999
Compound Code 99
Book Reference 9
Project Code 9>
##$TILT= no
##$TM1= 0
##$TM2= 0
##$TOPLEV= 0
##$USERP1= <user>
##$USERP2= <user>
##$USERP3= <user>
##$USERP4= <user>
##$USERP5= <user>
##$WDW= 1
##$XDIM= 32768
##$YMAX_p= 306159844
##$YMIN_p= -218317
$$ End of Bruker specific parameters
$$ ---------------------------------
##NTUPLES= NMR SPECTRUM
##VAR_NAME=  FREQUENCY,     SPECTRUM/REAL,   SPECTRUM/IMAG
##SYMBOL=    X,             R,               I
##VAR_TYPE=  INDEPENDENT,   DEPENDENT,       DEPENDENT
##VAR_FORM=  AFFN,          ASDF,            ASDF
##VAR_DIM=   32768,         32768,           32768
##UNITS=     HZ,            ARBITRARY UNITS, ARBITRARY UNITS
##FACTOR=    0.157963299565203, 1,           1
##FIRST=     4132.6476996994, 0,             0
##LAST=      -1043.33573715361, 0,           0
##MIN=       -1043.33573715361, -218317,     0
##MAX=       4132.6476996994, 306159844,     0
$$ Real data points
##PAGE= N=1
##DATA TABLE= (X++(R..R)), XYDATA
$$ [...]
$$ plain form
18417 1619983 1772672 1911031 2069852 2247011 2496361 2687483 2729455 2787540 2785833 2813080
18407 2813080 2807998 2760255 2648896 2544339 2471172 2415332 2371404 2347581 2331418 2263721 2146067
18396 2146067 2092684 2084376 2058864 2068420 2176797 2296333 2454751 2673119 2865151 3099587
18386 3099587 3386627 3607280 3884732 4105151 4293076 4554971 4879400 5288168 5834823
18377 5834823 6796428 8104606 9734539 11591605 13617165 15817819 18014704 19812364
18369 19812364 21095053 21988093 22633661 23194192 24128278 26132581 29677757 35907462 45446756
18360 45446756 57908691 72217438 88198161 105675002 122469664 135420124 143173996
18353 143173996 145818700 142803152 134960028 123839979 110936889 97308907 84655630
$$ packed form
18417A619983J52689J38359J58821J77159K49350J91122M1972N8085j707K7247
18407B813080n082m7743j11359j04557p3167n5840m3928k3823j6163o7697j17654
18396B146067n3383q308k5512R556J08377J19536J58418K18368J92032K34436
18386C099587K87040K20653K77452K20419J87925K61895L24429M08768N46655
18377E834823R61605J308178J629933J857066K025560K200654K196885J797660
18369A9812364J282689Q93040O45568N60531R34086K004303L545176O229705R539294
18360D5446756J2461935J4308747J5980723J7476841J6794662J2950460P753872
18353A43173996K644704l015548p843124j1120049j2903090j3627982j2653277
$$ plain form
18346 84655630 74101111 65974230 60106299 56209680 53446412 50802076 47839001 44280510
18338 44280510 40036062 35485264 30730193 26222002 21900761 18151083 15209321 13097400
18330 13097400 11595859 10580087 9912259 9524412 9254584 9167890 9282413 9548273 10100595
18321 10100595 11052859 12682007 15086237 18093850 21536900 25359283 29488262 33594460
18313 33594460 37104289 39773692 41880956 43717076 45871119 48875387 53462161 60244378
18305 60244378 69113381 78996010 88699248 98111626 106338752 111584578 112203830 108502524
18297 108502524 101104731 90517520 78356755 66003652 54205754 43324749 34295076
18290 34295076 27686193 23069794 19939828 17914031 16701658 15933424 15185535 14308906
$$ packed form
18346H4655630j0554519q126881n867931l896619k763268k644336k963075l558491
18338D4280510m244448m550798m755071m508191m321241l749678k941762k111921
18330A3097400j501541j015772o67828l87847k69828q6694J14523K65860N52322
18321A0100595R52264J629148K404230L007613L443050L822383M128979M106198
18313C3594460L509829K669403K107264J836120K154043L004268M586774O782217
18305F0244378Q869003R882629R703238R412378Q227126N245826O19252l701306
18297A08502524p397793j0587211j2160765j2353103j1797898j0881005r029673
18290C4295076o608883m616399l129966k025797j212373p68234p47889q76629
$$ plain form
18282 14308906 13242737 12001615 10655325 9268405 7941637 6679948 5562419 4704843
18274 4704843 4006201 3527833 3228832 3001899 2789325 2542824 2342720 2190565 2013863
18265 2013863 1784552 1613618 1432789 1288458 1227114 1176139 1115708 1083067 1059854 1068756 1035282
18254 1035282 1061302 1091970 1135439 1164930 1185596 1183282 1218041 1290695 1283220 1306670 1305028 1273344
18242 1273344 1219121 1165377 1116329 1133889 1184103 1180229 1302749 1530523 1682774 1646829 1468638
18231 1468638 1371404 1312045 1162791 1015084 909486 872750 809962 807388 807449 785589 747532
18220 747532 692535 639048 598202 592338 558718 498715 510071 490771 445627 429601 454218 439263
18208 439263 439760 390263 359592 355257 322425 360773 390031 442124 469938 483833 449851 431213
$$ packed form
18282A4308906j066169j241122j346290j386920j326768j261689j117529q57576
18274D704843o98642m78368k99001k26933k12574k46501k00104j52155j76702
18265B013863k29311j70934j80829j44331o1344n0975o0431l2641k3213Q902l3474
18254A035282K6020L0668M3469K9491K0666k314L4759P2654p475K3450j642l1684
18242A273344n4223n3744m9048J7560N0214l874J22520K27774J52251l5945j78191
18231A468638r7234n9359j49254j47707j05598l6736o2788k574O1k1860l8057
18220G47532n4997n3487m0846n864l3620o0003J1356j9300m5144j6026K4617j4955
18208D39263M97m9497l0671m335l2832L8348K9258N2093K7814J3895l3982j8638
$$ plain form
18196 431213 390100 396801 419699 433645 427091 450660 496040 477081 479232 504110 455267 405197
18184 405197 353123 331082 279035 270656 271031 274249 338515 377341 394702 426116 442554 404940
18172 404940 339579 370603 401257 387733 441907 470283 403788 376908 368640 321668 281455 256029
18160 256029 315998 355398 409668 447043 448776 422860 403638 426596 437406 434525 458844 447773
18148 447773 456668 450273 457697 411339 400706 446115 500519 527330 517982 495083 556536 665960
18136 665960 773713 861418 851509 840650 862072 880320 951281 1038680 1148422 1226004 1303858
18125 1303858 1433541 1589183 1760317 1929172 2222295 2622449 3140637 3783920 4615095
18116 4615095 5874918 7777832 10744345 15671377 24552354 40481220 64334671 89246197
$$ packed form
18196D31213m1113O701K2898J3946o554K3569M5380j8959K151K4878m8843n0070
18184D05197n2074k2041n2047q379L75L218O4266L8826J7361L1414J6438l7614
18172D04940o5361L1024L0654j3524N4174K8376o6495k6880q268m6972m0213k5426
18160B56029N9969L9400N4270L7375J733k5916j9222K2958J0810k881K4319j1071
18148D47773Q895o395P424m6358j0633M5409N4404K6811r348k2899O1453J09424
18136F65960J07753Q7705r909j0859K1422J8248P0961Q7399J09742P7582P7854
18125A303858J29683J55642J71134J68855K93123M00154N18188O43283Q31175
18116D615095J259823J902914K966513M927032Q880977J5928866K3853451K4911526
$$ plain form
18108 89246197 102849632 103178016 92247376 72288495 53133087 38550685 28345865
18101 28345865 20665018 14987538 11075173 8278348 6341590 4975460 3945271 3170153
18093 3170153 2591701 2117624 1785617 1572840 1320074 1124192 969299 851774 724240
18084 724240 641447 553027 518865 529648 483208 404124 351648 387370 424817 436460 448540
18073 448540 431138 359873 270188 242944 252235 238162 161024 198917 199184 232764 234594 220776
18061 220776 227120 279804 235184 219993 212940 156753 147997 170283 196180 172356 177146 122414
18049 122414 110583 42599 44787 14133 -17582 -16945 44005 65298 71398 93081 75013 92855
18037 92855 120721 108955 33412 2973 -3094 47579 105646 112504 41992 -14556 -18887 21033
$$ packed form
18108H9246197J3603435L28384j0930640j9958881j9155408j4582402j0204820
18101B8345865p680847n677480l912365k796825j936758j366130j030189p75118
18093C170153n78452m74077l32007k12777k52766j95882j54893j17525j27534
18084G24240q2793q8420l4162J0783m6440p9084n2476L5722L7447J1643J2080
18073D48540j7402p1265q9685k7244R291j4073p7138L7893K67L3580J830j3818
18061B20776O344N2684m4620j5191p053n6187q756K2286K5897k3824M790n4732
18049A22414j1831o7984K188l0654l1715O37O0950K1293O100K1683j8068J7842
18037I2855K7866j1766p5543l0439o067N0673N8067O858p0512n6548m331L9920
$$ plain form
18025 21033 88735 122887 149120 125685 89841 99968 50514 6053 -7080 -38439 -56341 -103955
18013 -103955 -81152 -92565 -17846 -6086 931 14345 53761 25270 -52248 -113423 -92746 -71635
18001 -71635 -127776 -157785 -151204 -163539 -93048 7462 -14924 -89219 -111366 -143410 -141264 -139331
17989 -139331 -104308 -122834 -143790 -131472 -143498 -120501 -102449 -175937 -166894 -31509 108687
17978 108687 117351 132484 69931 42327 6945 18563 80989 107960 30510 27661 45164 68048
17966 68048 132783 138427 87395 37294 42024 3810 20084 83589 47305 -6858 -10618 -46748
17954 -46748 -40644 -55270 -42307 -19462 26108 49002 34623 57317 36854 -18089 -21381 -81640
17942 -81640 -141913 -209644 -177475 -86287 -27461 -27625 -35077 -68779 -58963 -1822 -21405 -32489
$$ packed form
18025B1033O7702L4152K6233k3435l5844J0127m9454m4461j3133l1359j7902m7614
18013a03955K2803j1413P4719J1760P017J3414L9416k8491p7518o1175K0677K1111
18001g1635n6141l0009O581j2335P0491J00510k2386p4295k2147l2044K146J933
17989a39331L5023j8526k0956J2318j2026K2997J8052p3488R043J35385J40196
17978A08687Q664J5133o2553k7604l5382J1618O2426K6971p7450k849J7503K2884
17966F8048O4735N644n1032n0101M730l8214J6274O3505l6284n4163l760l6130
17954d6748O104j4626J2963K2845M5570K2894j4379K2694k0463n4943l292o0259
17942h1640o0273o7731L2169R1188N8826j64p452l3702R816N7141j9583j1084
$$ plain form
17930 -32489 19728 39316 -25971 -86066 -111994 -65473 5479 5704 -4722 -9030 -70254 -66036
17918 -66036 -73329 -73699 -71871 -57702 -58779 -17728 -13629 2860 32466 20335 -30923 -61060 -89224
17905 -89224 -1461 56977 55840 69982 27225 21225 43538 59641 93358 66751 -4094 37233
17893 37233 66034 66580 17845 -2894 28896 61734 72011 80491 73985 92973 68273 46305
17881 46305 21090 42217 63797 108576 75758 64204 97368 114553 73680 42119 77386 90129
17869 90129 81019 49415 73300 119515 224420 257840 209611 214067 281731 314063 380444 379815
17857 379815 381456 335708 364814 440019 478384 487317 537369 542136 471190 440238 427422 485859
17845 485859 593637 568546 412558 340686 317621 251316 205848 204569 205459 214057 173757 194081
$$ packed form
17930c2489N2217J9588o5287o0095k5928M6521P0952K25j0426m308o1224M218
17918f6036p293l70J828J4169j077M1051M099J6489K9606j2131n1258l0137k8164
17905h9224Q7763N8438j137J4142m2757o000K2313J6103L3717k6607p0845M1327
17893C7233K8801N46m8735k0739L1790L2838J0277Q480o506J8988k4700k1968
17881D6305k5215K1127K1580M4779l2818j1554L3164J7185m0873l1561L5267J2743
17869I0129r110l1604K3885M6215J04905L3420m8229M456O7664L2332O6381o29
17857C79815J641m5748K9106P5205L8365Q933N0052M767p0946l0952j2816N8437
17845D85859J07778k5091j55988p1872k3065o6305m5468j279Q90Q598m0300K0324
$$ plain form
17833 194081 248399 191048 142759 123919 134206 140107 105491 69248 93222 125779 136029 96113
17821 96113 114167 153778 150943 108436 12115 -47371 -5825 45652 60371 71365 90925 75416
17809 75416 141095 178556 255853 326511 303594 298805 317085 264773 280654 287365 278126 275556
17797 275556 276368 213027 191104 252282 277346 313805 355295 356791 382368 377988 393841 363566
17785 363566 279446 203958 139223 124242 103779 64729 63985 92989 94009 89737 39247 -11788
17773 -11788 -13599 16974 -32630 -75555 -60310 -72486 -40123 -21353 -30775 -43585 -38516 -94231
17761 -94231 -103744 -78677 -16650 23706 30297 -5474 -34777 -24370 27541 53490 58575 18354
17749 18354 -52203 -145949 -115386 -34627 -10266 29527 42084 12332 480 -58591 -16620 26183
$$ packed form
17833A94081N4318n7351m8289j8840J0287N901l4616l6243K3974L2557J0250l9916
17821I6113J8054L9611k835m2507r6321n9486M1546N1477J4719J0994J9560j5509
17809G5416O5679L7461P7297P0658k2917m789J8280n2312J5881O711r239k570
17797B75556Q12o3341k1923O1178K5064L6459M1490J496K5577m380J5853l0275
17785C63566q4120p5488o4735j4981k0463l9050p44K9004J020m272n0490n1035
17773a1788j811L0573m9604m2925J5245j2176L2363J8770r422j2810N069n5715
17761i4231r513K5067O2027M0356O591l5771k9303J0407N1911K5949N085m0221
17749A8354p0557r3746L0563Q0759K4361L9793J2557k9752j1852n9071M1971M2803
$$ plain form
17737 26183 30080 59347 70793 80460 37043 33624 52427 -624 -30521 57501 30811 19341
17725 19341 398 -24105 -15082 -963 -2542 -19975 40428 43993 8790 12905 31440 3712
17713 3712 9906 11311 -6883 -21616 10049 15979 39831 17686 -969 -21562 -55109 -25011
17701 -25011 -8648 -52372 -2236 48444 37236 93554 20555 -78843 -110008 -29142 13206 20230
17689 20230 34960 49100 32088 -5767 13556 42452 49530 90905 79902 77280 76659 114982
17677 114982 80256 62133 48199 66956 119895 177100 237086 236048 228057 241174 294895 369654
17665 369654 424062 540345 631599 672671 692483 689647 677044 686803 697660 606485 544861 496724
17653 496724 407791 363485 291993 207879 178475 140861 82957 57423 -21900 -32049 -5963
$$ packed form
17737B6183L897K9267J1446R667m3417l419J8803n3051k9897Q8022k6690j1470
17725A9341j8943k4503R023J4119j579j7433O0403L565l5203M115J8535k7728
17713C712O194J405j8194j4733L1665N930K3852k2145j8655k0593l3547L0098
17701b5011J6363m3724N0136N0680j1208N6318p2999r9398l1165Q0866M2348P024
17689B0230J4730J4140j7012l7855J9323K8896P078M1375j1003k622o21L8323
17677A14982l4726j8123j3934J8757N2939N7205N9986j038p991J3117N3721P4759
17665C69654N4408J16283R1254M1072J9812k836j2603R759J0857r1175o1624m8137
17653D96724q8933m4306p1492q4114k9404l7614n7904k5534p9323j0149K6086
$$ plain form
17642 -5963 26401 42271 49042 1116 -34778 -24558 -6508 -26615 -13485 16909 32305 95511
17630 95511 84111 20583 -9776 -18423 30540 69231 35016 54622 62924 64457 45723 25441
17618 25441 -7709 49308 20892 -45520 -36148 -9392 -5952 -9775 -69228 -112829 -84431 -45450
17606 -45450 -49833 -16515 5775 -7240 12036 7650 -29437 -47248 -54057 30488 5915 -11330
17594 -11330 908 34368 58428 80518 35659 15996 53 44021 32157 1286 19957 31214
17582 31214 11649 -4214 -896 13834 -21533 -40755 -37232 -64023 -41652 -41105 -69125 -26556
17570 -26556 23248 -17833 -11530 -54104 -81183 -73120 -53507 38012 44024 52085 65153 61551 17338
17557 17338 32117 76977 75693 118816 87723 56043 100659 65878 50561 8093 -25178 -25906
$$ packed form
17642e963L2364J5870O771m7926l5894J0220J8050k0107J3130L0394J5396O3206
17630I5511j1400o3528l0359q647M8963L8691l4215J9606Q302J533j8734k0282
17618B5441l3150N7017k8416o6412R372K6756L440l823n9453m3601K8398L8981
17606d5450m383L3318K2290j3015J9276m386l7087j7811o809Q4545k4573j7245
17594a1330J2238L3460K4060K2090m4859j9663j5943M3968j1864l0871J8671J1257
17582C1214j9565j5863L318J4730l5367j9222L523k6791K2371N47k8020M2569
17570b6556M9804m1081O303m2574k7079Q063J9613R1519O012Q061J3068l602m4213
17557A7338J4779M4860j284M3123l1093l1680M4616l4781j5317m2468l3271p28
$$ plain form
17545 -25906 14252 49813 26494 32629 29785 -23123 -102210 -102829 -137372 -205109 -121284 5196
17533 5196 88812 40554 -51221 -53597 -26261 -60396 -57206 -23766 2228 3682 10744 -8804 44470
17520 44470 32546 15007 24569 31788 -1743 -25528 -70777 -105274 -93449 -29232 -12295 19707
17508 19707 63578 78741 45658 58318 28594 34853 31499 6642 -23485 -19788 -20400 -22111 -6791
17495 -6791 51250 87262 32657 -56675 -95033 -87443 -90895 -58593 -74478 -87953 -39014 -42016
17483 -42016 -72565 -85610 -63671 -67230 -66667 -63654 -66681 15724 33231 -32578 -70601 -75979 -42937
17470 -42937 -45019 -35365 -30159 -64517 -6016 -2296 -51442 -62715 -61541 -71689 -71045 -45049 -77739
17457 -77739 -46182 -85780 -144135 -114104 -90245 -86710 -141748 -87635 -18851 -19360 -10475 10335
$$ packed form
17545b5906M0158L5561k3319O135k844n2908p9087o19l4543o7737Q3825J26480
17533E196Q3616m8258r1775k376K7336l4135L190L3440K5994J454P062j9548N3274
17520D4470j1924j7539R562P219l3531k3785m5249l4497J1825O4217J6937L2002
17508A9707M3871J5163l3083J2660k9724O259l354k4857l0127L697o12j711J5320
17495f791N8041L6012n4605q9332l8358P590l452L2302j5885j3475M8939l002
17483d2016l0549j3045K1939l559N63L013l027Q2405J7507o5809l8023n378L3042
17470d2937k082R654N206l4358N8501L720m9146j1273J174j0148O44K5996l2690
17457g7739L1557l9598n8355L0031K3859L535n5038N4113O8784n09Q885K0810
$$ plain form
17445 10335 88129 239989 433514 536734 483085 454430 418875 315935 216152 191157 141987
17434 141987 123762 74486 78842 85910 61338 18565 31912 38387 40523 87018 89146 59175
17422 59175 34810 -37842 -3692 63143 65676 105903 146091 154730 222998 231419 218446 237874
17410 237874 281294 220910 159443 163832 158126 132919 165560 178847 254715 329244 381537 415793
17398 415793 436889 441794 451222 441139 369265 341997 277697 172528 112896 114853 175140 234868
17386 234868 305643 335760 302725 277004 267288 189794 168202 122991 112063 76355 26717 -5861
17374 -5861 -9937 -74646 -128597 -125745 -84632 -44453 -19326 -20953 -13221 -14966 -34962 -32420 66
17361 66 -27789 -23378 -45189 -51366 -116051 -121527 -85718 -66523 -19737 17169 17397 -22493 -61891
$$ packed form
17445A0335P7794J51860J93525J03220n3649k8655l5555j02940r9783k4995m9170
17434A41987j8225m9276M356P068k4572m2773J3347O475K136M6495K128k9971
17422E9175k4365p2652L4150O6835K533M0227M0188Q639O8268Q421j2973J9428
17410B37874M3420o0384o1467M389n706k5207L2641J3287P5868P4529N2293L4256
17398D15793K1096M905R428j0083p1874k7268o4300j05169n9632J957O0287N9728
17386B34868P0775L0117l3035k5721r716p7494k1592m5211j0928l5708m9638l2578
17374e861m076o4709n3951K852M1113M0179K5127j627P732j745j9996K542L2486
17361F6k7855M411k1811o177o4685n476L5809J9195M6786L6906K28l9890l9398
$$ plain form
17348 -61891 -91423 -72252 -54887 -64342 -68664 -42041 -65283 -112616 -109355 -97377 -71034 -66550
17336 -66550 -26832 -29059 13035 68738 73701 -4592 -63707 -90629 -68291 8450 33734 -23408
17324 -23408 -74509 -77301 -69269 -66806 -61552 -90412 -96381 -73015 -63257 -18593 -26757 -55290 -78484
17311 -78484 -76823 -46992 -70951 -100514 -73677 -63150 -95618 -103242 -62391 -43667 -20197 -10604
17299 -10604 -18498 -93249 -22104 70301 29882 -5790 -10716 -30820 -29862 30429 7397 -23676
17287 -23676 14966 -1495 -24678 -28036 11757 89458 60472 54250 72573 49516 59967 55823
17275 55823 -10278 -74983 -48366 -36935 -42289 -67608 -2932 5539 13903 3316 -8383 -18236
17263 -18236 -25526 35631 22625 -52733 -95834 -73377 -71986 -120432 -124859 -108051 -60079 -67453
$$ packed form
17348f1891k9532J9171J7365r455m322K6623k3242m7333L261J1978K6343M484
17336f6550L9718k227M2094N5703M963p8293n9115k6922K2338P6741K5284n7142
17324b3408n1101k792Q032K463N254k8860n969K3366R758M4664q164k8533k3194
17311g8484J661K9831k3959k9563K6837J0527l2468p624M0851J8724K3470R593
17299a0604p894p4751P1145R2405m0419l5672m926k0104R58O0291k3032l1073
17287b3676L8642j6461k3183l358L9793P7701k8986o222J8323k3057J0451m144
17275E5823o6101o4705K6617J1431n354k5319O4676Q471Q364j0587j1699r853
17263a8236p290O1157j3006p5358m3101K2457J391m8446m427J6808M7972p374
$$ plain form
17251 -67453 -47788 -74216 -85249 -41298 7163 -46447 -88503 -75238 -19005 -54480 -76695 -55690
17239 -55690 22837 33879 -25448 -24260 -15568 -9148 -12264 -52403 -51081 -42613 -5544 12259 40878
17226 40878 46724 47940 44094 45767 10364 38853 77151 3824 -44335 -22354 -18482 -60401 -18812
17213 -18812 -3370 14378 -18568 25799 29252 41877 1467 -1813 -23178 -17783 -18742 -10653 3998
17200 3998 15830 14255 6937 -42587 -32429 -6963 11629 -29364 -28148 -40832 -34828 -31276 -30669
17187 -30669 -53175 21539 84337 96238 86229 66051 50401 22882 17640 -35322 -24949 22510
17175 22510 52533 60759 16149 -146 61652 41106 2773 34999 39452 22516 42495 32057
17163 32057 -5117 -33281 -16484 14699 -5953 -6383 12748 25521 72062 9637 -17560 -22465
$$ packed form
17251f7453J9665k6428j1033M3951M8461n3610m2056J3265N6233l5475k2215K1005
17239e5690P8527J1042n9327J188Q692O420l116m0139J322Q468L7069J7803K8619
17226D0878N846J216l846J673l5403K8489L8298p3327m8159K1981L872m1919M1589
17213a8812J5442J7748l2946M4367L453J2625m0410l280k1365N395r59Q089J4651
17200C998J1832j575p318m9524J0158K5466J8592m0993J216j2684O004L552O07
17187c0669k2506P4714O2798J1901j0009k0178j5650k7519n242n2962J0373M7459
17175B2510L0023Q226m4610j6295O1798k0546l8333L2226M453j6936J9979j0438
17163C2057l7174k8164J6797L1183k0652m30J9131J2773M6541o2425k7197m905
$$ plain form
17151 -22465 -1889 7261 -18039 -17451 26142 65266 65636 -5506 -58512 -96454 -98913 -88553 -70601
17138 -70601 -62652 17894 76763 75239 11881 -22963 -64948 -58344 -12410 72409 116261 46190
17126 46190 -1797 27403 15193 9166 38507 18969 -43783 -92790 -83472 -48932 -35264 -66707
17114 -66707 -61372 3235 1697 6771 9728 -9721 -11727 -43243 29804 22320 -14759 -22922 31459
17101 31459 78781 81806 69469 24007 26487 102208 90031 57217 100933 79507 22533 -13023
17089 -13023 -45601 -47166 -32791 -36529 3506 22353 8694 -1448 9287 74924 69748 73491
17077 73491 108696 86054 23900 16165 68367 66951 66490 83391 84760 106742 87567 95682 86900
17064 86900 59284 -14055 -37006 42680 63952 84147 130719 111957 61995 -4359 -66886 -73715
$$ packed form
17151b2465K0576R150k5300N88M3593L9124L70p1142n3006l7942k459J0360J7952
17138g0601P949Q0546N8869j524o3358l4844m1985O604M5934Q4819M3852p0071
17126D6190m7987K9200j2210o027K9341j9538o2752m9007R318L4540J3668l1443
17114f6707N335O4607j538N074K957j9449k006l1516P3047p484l7079q163N4381
17101C1459M7322L025j2337m5462K480P5721j2177l2814M3716k1426n6974l5556
17089a3023l2578j565J4375l738M0035J8847j3659j0142J0735O5637n176L743
17077G3491L5205k2642o2154p735N2202j416m61J6901J369K1982j9175Q115q782
17064H6900k7616p3339k2951P9686K1272K0195M6572j8762m9962o6354o2527o829
$$ plain form
17052 -73715 -81338 -69938 -103436 -121651 -114138 -56657 -6177 20192 19068 30132 46437 57164
17040 57164 74958 94051 103462 67584 -16523 -11450 88942 113934 109924 143472 119182 51865
17028 51865 46709 87706 53313 32462 31365 22512 34072 59576 39346 49219 32891 57099
17016 57099 90832 89023 12403 49919 61197 19252 -8916 5290 42128 56300 79353 133400
17004 133400 167055 104013 53090 54411 35861 32175 24899 -6186 -39712 -10642 4169 -40787
16992 -40787 -14089 43421 74340 59982 57428 48286 54612 61040 32342 25261 4793 84438 171164
16979 171164 239629 263526 221342 231409 209508 137405 116402 30878 23128 68887 152095 225413
16967 225413 238416 223033 281970 318646 366968 372844 376503 369416 397347 329122 216850 198577
$$ packed form
17052g3715p623J1400l3498j8215P513N7481N0480K6369j124J1064J6305J0727
17040E7164J7794J9093R411l5878q4107N073J00392K4992m010L3548k4290o7317
17028E1865n156M0997l4393k0851j097q853J1560K5504k0230R873j6328K4208
17016E7099L3733j809p6620L7516J1278m1945k8168J4206L6838J4172K3053N4047
17004A33400L3655o3042n0923J321j8550l686p276l1085l3526K9070J4811m4956
16992d0787K6698N7510L0919j4358k554r142O326O428k8698p081k0468P9645Q6726
16979A71164O8465K3897m2184J0067k1901p2103k1003q5524p750M5759Q3208P3318
16967B25413J3003j5383N8937L6676M8322N876L659p087K7931o8225j12272j8273
$$ plain form
16955 198577 250755 366371 436625 457052 475696 535411 512818 472600 430749 371511 352454
16944 352454 357939 372496 309975 283205 388649 390258 377677 410627 422030 417884 411609 389164
16932 389164 405548 381102 348619 321662 371582 436789 478200 487074 469735 508891 533368 524755
16920 524755 504217 486808 530286 591939 618183 611669 624943 715504 820874 914810 995375
16909 995375 1101183 1163676 1124253 1021274 947408 974443 967756 955541 1021342 1093135 1197801
16898 1197801 1313327 1411393 1481636 1492503 1508563 1566144 1490323 1389502 1289498 1190996 1206374
16887 1206374 1243889 1364062 1500436 1681681 1867468 2019731 2109212 2190757 2127844 2095395
16877 2095395 2088606 2177720 2248505 2376119 2616787 2843696 3062416 3297685 3552604 3817718
$$ packed form
16955A98577N2178J15616P0254K0427J8644N9715k2593m0218m1851n9238j9057
16944C52454N485J4557o2521k6770J05444J609j2581L2950J1403m146o275k2445
16932C89164J6384k4446l2483k6957M9920O5207M1411Q874j7339L9156K4477q613
16920E24755k0538j7409M3478O1653K6244o514J3274R0561J05370R3936Q0565
16909I95375J05808O2493l9423j02979p3866K7035o687j2215O5801P1793J04666
16898A197801J15526R8066P0243J0867J6060N7581p5821j00821j00004r8502J5378
16887A206374L7515J20173J36374J81245J85787J52263Q9481Q1545o2913l2449
16877B095395o789Q9114P0785J27614K40668K26909K18720K35269K54919K65114
$$ plain form
16867 3817718 4072278 4373628 4877683 5534049 6357224 7387993 8938943 11173597 14493541
16858 14493541 19606612 27488207 38543743 50762719 60341526 64430586 62826920 56630039
16850 56630039 48757374 42184582 38352232 37740363 41068523 48853821 60294400 72360690
16842 72360690 82221201 89453406 94283931 96092917 94033330 87880753 78200481 66218246
16834 66218246 54700321 45783365 40276628 38392451 40652702 47076766 55654641 62476259
16826 62476259 64350526 60885654 52907997 42907002 33627867 26154678 20359912 15823493
16818 15823493 12381041 9886319 7972476 6576203 5562910 4777897 4236561 3818285
16810 3818285 3480259 3240563 3031258 2900666 2680185 2356534 2049300 1814803 1642290
$$ packed form
16867C817718K54560L01350N04055O56366Q23175J030769J550950K234654L319944
16858A4493541N113071P881595J1055536J2218976R578807M089060j603666o196881
16850E6630039p872665o572792l832350o11869L328160P785298J1440579J2066290
16842G2360690R860511P232205M830525J808986k059587o152577r680272j1982235
16834F6218246j1517925q916956n506737j884177K260251O424064Q577875O821618
16826F2476259J874267l464872p977657j0000995r279135p473189n794766m536419
16818A5823493l442452k494722j913843j396273j013293p85013n41336m18276
16810C818285l38026k39696k09305j30592k20481l23651l07234k34497j72513
$$ plain form
16801 1642290 1526937 1469201 1472531 1407544 1327274 1259497 1188573 1087551 969561 828686 724407
16790 724407 630140 515625 468341 489971 534134 488031 458536 488941 431400 345647 324931
16779 324931 341847 388760 406204 381185 342334 263340 226580 226194 252687 234855 177126 140661
16767 140661 143399 159004 155513 95157 15029 27780 17883 1149 5046 -15032 -30407 -43426
16755 -43426 -6248 80615 117658 113361 79581 84312 61140 -37820 -22634 20878 22932 57819
16743 57819 77561 53417 -27388 -20056 -9471 12908 -94371 -186546 -171361 -151137 -144275 -127034
16731 -127034 -153760 -210090 -169927 -152945 -146084 -95092 -57983 -11907 -23181 -117162 -149389 -74558
16719 -74558 -73202 -45996 -97211 -143462 -99016 -19209 -6995 22220 93051 75207 102137 107365
$$ packed form
16801A642290j15353n7736L330o4987q0270o7777p0924j01022j17990j40875j04279
16790G24407r4267j14515m7284K1630M4163m6103k9495L0405n7541q5753k0716
16779C24931J6916M6913J7444k5019l8851p8994l6760l86K6493j7832n7729l6465
16767A40661K738J5605l491o0356q0128J2751r897j6734L897k0078j5375j3019
16755d3426L7178Q6863L7043m297l3780M731k3172r8960J5186M3512K054L4887
16743E7819J9742k4144q0805P332J0585K2379j07279r2175J5185K0224O862J7241
16731a27034k6726n6330M0163J6982O861N0992L7109M6076j1274r3981l2227P4831
16719g4558J356K7206n1215m6251M4446P9807J2214K9215P0831j7844K6930N228
$$ plain form
16707 107365 124541 113625 40669 12058 2693 -4198 21146 53767 104488 182644 190824 197069
16695 197069 185552 125772 56085 100459 141069 109957 72578 61276 82722 100804 122798
16684 122798 83811 25623 15343 56978 97673 61696 70573 116014 177273 156589 123408 73734
16672 73734 33097 -15687 -54897 -34550 -9164 -20041 -15477 -2831 -23596 9755 49858 74194
16660 74194 71989 39571 -27577 -83446 -88534 -43833 -57271 -74400 -76163 -33657 18482 19246 28563
16647 28563 7776 2756 34278 79579 67578 42999 10363 -18793 -4435 -7013 -60484 -54820
16635 -54820 -60517 -25420 -38040 -59428 -45523 -36758 10298 78061 110229 114793 119840 92767
16623 92767 49959 20027 -1936 118 30676 -32714 -31741 51298 73826 44051 19235 -32214
$$ packed form
16707A07365J7176j0916p2956k8611r365o891K5344L2621N0721P8156Q180O245
16695A97069j1517n9780o9687M4374M0610l1112l7379j1302K1446J8082K1994
16684A22798l8987n8188j0280M1635M0695l5977Q877M5441O1259k0684l3181m9674
16672G3734m0637m8784l9210K0347K5386j0877M564J2646k0765L3351M0103K4336
16660G4194k205l2418o7148n5869n088M4701j3438j7129j763M2506N2139P64R317
16647B8563k0787n020L1522M5301j2001k4579l2636k9156J4358k578n3471N664
16635e4820n697L5097j2620k1388J3905Q765M7056O7763L2168M564N047k7073
16623I2767m2808k9932k1963K054L0558o3390R73Q3039K2528k9775k4816n1449
$$ plain form
16611 -32214 -34699 -56684 -30559 21313 79304 112074 63310 44121 76469 47048 -25868 1513
16599 1513 42963 16568 -76611 -89327 -53562 -15031 26283 41076 50338 15320 54516 42283
16587 42283 -46528 -64834 -40278 23959 28975 29216 -1150 -38649 -12170 1959 68083 100729
16575 100729 106312 71975 25148 25628 52051 51971 -33305 -38235 -1393 48642 70592 66904 59222
16562 59222 26468 -44752 -60733 -61350 -68320 -52799 -24059 -27027 48641 152856 110168 21279
16550 21279 -26681 -34386 -43099 -53465 -20187 -47418 -78454 -112191 -107359 -107060 -48152 -44353 -85963
16537 -85963 -71128 -80449 -63676 -33771 -29328 -26860 -32383 -40132 -37464 -33543 8915 -39859 -54629
16524 -54629 -107704 -119462 -97296 -126938 -84731 -88666 -152504 -156134 -126016 -33630 -56577 -75358
$$ packed form
16611c2214k485k1985K6125N1872N7991L2770m8764j9189L2348k9421p2916K7381
16599A513M1450k6395r3179j2716L5765L8531M1314J4793R262l5018L9196j2233
16587D2283q8811j8306K4556O4237N016K41l0366l7499K6479J4129O6124L2646
16575A00729N583l4337m6827M80K6423q0q5276m930L6842N0035K1950l688p682
16562E9222l2754p1220j5981o17o970J5521K8740k968P5668J04215m2688q8889
16550B1279m7960p705q713j0366L3278k7231l1036l3737M832K99N8908L799m1610
16537h5963J4835r321J6773K9905M443K468n523p749K668L921M2458m8774j4770
16524e4629n3075j1758K2166k9642M2207l935o3838l630L0118R2386k2947j8781
$$ plain form
16512 -75358 -26591 13022 34879 82366 44004 -3442 -57399 -21311 22427 30043 -16836 -38253
16500 -38253 -69250 -108712 -151630 -88684 -94758 -118149 -90387 -99979 -85882 -23130 25588 -4940
16488 -4940 -49492 -113371 -95785 -37752 24696 12777 -17990 -5436 -43046 -64696 -53052 -57240
16476 -57240 -25300 1090 -48667 -59452 -104545 -159773 -149240 -157285 -116318 -55545 12063 -6329
16464 -6329 -112143 -161280 -120743 -874 71237 25801 -39494 -72936 -1779 -18924 -40663
16453 -40663 -56860 -40295 -2489 38636 36929 7273 -26859 -28924 -13125 -37864 -24726 -62590
16441 -62590 -47246 -70757 -2998 -20925 -56884 -46034 5207 31893 60898 38806 -6807 3328
16429 3328 17034 10334 -36526 -63388 -82186 -82278 11916 -961 -34199 14550 52771 16801 -10377
$$ packed form
16512g5358M8767L9613K1857M7487l8362m7446n3957L6088M3738P616m6879k1417
16500c8253l0997l9462m2918O2946o074k3391K7762r592J4097O2752M8718l0528
16488d940m4552o3879J7586N8033O2448j1919l0767J2554l7610k1650J1644m188
16476e7240L1940K6390m9757j0785m5093n5228J0533q045M0967O0773O7608j8392
16464f329j05814m9137M0537J19869P2111m5436o5295l3442P1157j7145k1739
16453d0663j6197J6565L7806M1125j707k9656l4132k065J5799k4739J3138l7864
16441f2590J5344k3511O7759j7927l5959J0850N1241K6686K9005k2092m5613J0135
16429C328J3706o700m6860k6862j8798r2R4194j2877l3238M8749L8221l5970k7178
$$ plain form
16416 -10377 17080 34334 34228 16812 -15766 -37467 -79169 -144210 -114818 -81771 -86651 -98855
16404 -98855 -84811 -66821 -47786 -56463 -102820 -79781 -89258 -95688 -71013 -36982 -30669 -61060
16392 -61060 -80795 -59982 4705 20544 33995 -53988 -31012 26187 12580 -6951 -58906 -60696
16380 -60696 -71838 -64106 -29786 7078 42186 -37898 -153184 -136637 -41327 3390 -24594 -25649
16368 -25649 5628 66244 86816 41034 45634 55886 38449 25781 2912 -41182 -64192 21574
16356 21574 71490 74997 82711 38114 -28112 -24681 -1337 5940 -14200 -33688 -7700 48747
16344 48747 25608 2419 12848 -8138 -31982 20264 56499 58955 9368 -19847 -24051 -6016
16332 -6016 -19626 -73244 -46285 31872 66332 -5045 -45099 -83824 -96333 -155530 -161174 -96785
$$ packed form
16416a0377K7457J7254j06j7416l2578k1701m1702o5041K9392L3047m880j2204
16404i8855J4044J7990J9035q677m6357K3039r477o430K4675L4031O313l0391
16392f1060j9735K0813O4687J5839J3451q7983K2976N7199j3607j9531n1955j790
16380f0696j1142P732L4320L6864L5108q0084j15286J6547R5310M4717k7984j055
16368b5649L1277O0616K0572m5782M600J0252j7437j2668k2869m4094k3010Q5766
16356B1574M9916L507P714m4597o6226L431K3344P277k0140j9488K5988N6447
16344D8747k3139k3189J0429k0986k3844N2246L6235K456m9587k9215m204J8035
16332f016j3610n3618K6959P8157L4460p1377m0054l8725j2509n9197n644O4389
$$ plain form
16320 -96785 -17228 -46971 -59339 -50217 -18772 14757 38233 -12866 -40722 -12159 -801 14027
16308 14027 -19865 5251 -24215 -14162 8464 -19910 -68351 3367 -282 -34352 -47242 -47755
16296 -47755 -22590 -39590 8832 37052 91115 169243 242101 242082 240819 294190 321681 335235
16284 335235 325961 318133 301724 295445 303572 403412 443113 473604 490655 464911 447056 480066
16272 480066 466263 418928 339376 311331 325659 279729 213597 186604 186248 264256 277561 246874
16260 246874 260607 254020 208517 142403 26248 11227 -3534 -15274 -54471 -81001 -57323
16249 -57323 -12998 -112636 -139786 -144944 -107126 -70700 -54859 -36674 2346 -11245 -28748 -48660
16237 -48660 -37546 -16636 -57358 -72157 -70854 -50787 -61893 -124828 -74740 -32901 -3469 -35328
$$ packed form
16320i6785P9557k9743j2368R122L1445L3529K3476n1099k7856K8563J1358J4828
16308A4027l3892K5116k9466J0053K2626k8374m8441P1718l649l4070j2890n13
16296d7755K5165j7000M8422K8220N4063P8128P2858j9j263N3371K7491J3554
16284C35235r274p828j6409o279Q127R9840L9701L0491J7051k5744j7855L3010
16272D80066j3803m7335p9552k8045J4328m5930o6132k6993l56P8008J3305l0687
16260B46874J3733o587m5503o6114j16155j5021j4761j1740l9197k6530K3678
16249e7323M4325r9638k7150n158L7818L6426J5841J8185L9020j3591j7503j9912
16237d8660J1114K0910m0722j4799J303K0067j1106o2935N0088M1839K9432l1859
$$ plain form
16225 -35328 -105376 -98873 -66081 -44111 25903 64704 53144 13764 -32327 -27977 -49026 -102023
16213 -102023 -102779 -99066 -106301 -64159 -69825 -56844 -6444 61066 33990 -37188 -61069 -3754
16201 -3754 7431 -65334 -61024 12518 -25940 -13181 -12620 -6874 -42168 -51448 -7111 -4199 2273
16188 2273 -21085 -39351 -87874 -132737 -105092 -109248 -100536 -82924 -131083 -151132 -125364 -57283
16176 -57283 -51514 -118038 -124800 -80802 -56356 -24665 -65767 -115589 -102361 -38861 -66076 -145050
16164 -145050 -98928 -26698 -14327 20275 -32346 -36397 -43567 -43444 -24263 -2347 -2859 6482 2502
16151 2502 -17639 -30216 -26547 -23100 -52393 -77085 -97308 -82715 -46474 -45361 -74580 -91574
16139 -91574 -66583 -51584 -72060 -103285 -67284 -40479 -46613 -87307 -94684 -62404 -95953 -149540
$$ packed form
16225c5328p0048O503L2792K1970P0014L8801j1560l9380m6091M350k1049n2997
16213a02023p56L713p235M2142n666J2981N0400O7510k7076p1178k3881N7315
16201c754J1185p2765M310P3542l8458J2759N61N746l5294r280M4337K912O472
16188B273k3358j8266m8523m4863K7645m156Q712J7612m8159k0049K5768O8081
16176e7283N769o6524o762M3998K4446L1691m1102m9822J3228O3500k7215p8974
16164a45050M6122P2230J2371L4602n2621m051p170J23J9181K1916n12R341l980
16151B502k0141j2577L669L447k9293k4692k0223J4593L6241J113k9219j6994
16139i1574K4991J4999k0476l1225L6001K6805o134m0694p377L2280l3549n3587
$$ plain form
16127 -149540 -133443 -142804 -83288 -4983 -9259 -68860 -60876 -7242 -33247 -98445 -128559 -126460
16115 -126460 -95133 -53925 -52031 -93767 -52819 5278 16128 6115 -27240 -28638 -58403 -95201
16103 -95201 -86006 -21976 17588 60505 34538 15101 2324 -3269 -52662 -54169 -11022 -9442
16091 -9442 -2451 36724 35783 29565 198 -2535 34484 -7767 -55040 -77051 -93185 -77306 -18458
16078 -18458 -62251 -44595 -33565 -84005 -122768 -99024 3846 -6983 -19669 -67717 -74582 -69547
16066 -69547 -56105 -51411 -58980 -86582 -126167 -148882 -112186 -80897 -66253 -43854 -26210 -1368
16054 -1368 9567 27834 48597 76318 60835 17540 33378 12305 -14915 -31614 -9323 -45958
16042 -45958 -99140 -64711 -11480 -56485 -52689 -25943 5532 -10210 -117775 -123604 -137017 -136402
$$ packed form
16127a49540J6097r361N9516P8305m276n9601P984N3634k6005o5198l0114K099
16115a26460L1327M1208J894m1736M0948N8097J0850j0013l3355j398k9765l6798
16103i5201R195O4030L9564M2917k5967j9437j2777n593m9393j507M3147J580
16091i442O991L9175r41o218k9367k733L7019m2251m7273k2011j6134J5879N8848
16078a8458m3793J7656J1030n0440l8763K3744J02870j0829j2686m8048o865N035
16066f9547J3442M694p569k7602l9585k2715L6696L1289J4644K2399J7644K4842
16054a368J0935J8267K0763K7721j5483m3295J5838k1073k7220j6699K2291l6635
16042d5958n3182L4429N3231m5005L796K6746L1475j5742j07565n829j3413O15
$$ plain form
16030 -136402 -45690 53889 93027 104304 81726 5213 -12898 -42481 -56283 21787 -2414
16019 -2414 -45425 -27508 896 26093 -9077 -3814 13487 42796 4933 -24974 -12175 -61935
16007 -61935 -74786 -38157 -70776 -72730 -35940 -14201 29418 45029 -20098 -60439 -59594 -107123
15995 -107123 -96100 -79196 -62213 -60823 -25151 2141 -44837 -102909 -114777 -112019 -77600 -47569
15983 -47569 -7373 13296 59761 17086 -15324 43840 27630 32958 -10117 -20711 -4871 25455
15971 25455 26857 19500 24311 32178 -45040 -46218 -43634 -90486 -127101 -93002 -86346 -54157 16759
15958 16759 37609 15123 16620 -1480 -36528 -12778 -56830 -31349 41193 46197 58154 13845
15946 13845 -65259 -116109 -141144 -103437 -35373 17590 -35281 -39786 -26355 -108658 -173426 -143194
$$ packed form
16030a36402R0712R9579L9138J1277k2578p6513j8111k9583j3802P8070k4201
16019b414m3011J7917K8404K5197l5170N263J7301K9309l7863k9907J2799m9760
16007f1935j2851L6629l2619j954L6790K1739M3619J5611o5127m0341Q45m7529
15995a07123J1023J6904J6983J390L5672K7292m6978n8072j1868K758L4419L0031
15983d7569M0196K0669M6465m2675l2410N9164j6210N328m3075j0594J5840L0326
15971B5455J402p357M811P867p7218j178K584m6852l6615L4099O656L2189P0916
15958A6759K0850k2486J497j8100l5048K3750m4052K5481P2542N004J1957m4309
15946A3845p9104n0850k5035L7707O8064N2963n2871m505J3431q2303o4768L0232
$$ plain form
15934 -143194 -86397 -68581 -86625 -47091 -28810 46737 38765 -1178 12917 -18216 -39537 -11839
15922 -11839 -7064 8265 26326 7143 60170 74921 18900 26029 69639 30587 63702 69013
15910 69013 3134 10741 2718 -23712 -23469 20524 54800 25672 22825 26135 9588 -52325 -104750
15897 -104750 -103506 -76366 -24787 -8386 33768 41062 15603 1671 -7372 12985 -28108 -5639
15885 -5639 -17029 -63897 -16927 24168 11392 12942 -35084 -131713 -151363 -79070 -25279 -49783
15873 -49783 -90559 -138379 -108836 -64317 -44571 -38146 -72387 -89615 -1090 28284 4759 -4902
15861 -4902 -7427 39261 93568 43489 38861 46414 37137 66565 48118 -24855 -55216 -74030 4541
15848 4541 114269 20548 -31297 -72847 -48228 -12561 -35907 -70789 -67059 -48282 -3871 45165
$$ packed form
15934a43194N6797J7816j8044L9534J8281P5547p972l9943J4095l1133k1321K7698
15922a1839M775J5329J8061j9183N3027J4751n6021P129M3610l9052L3115N311
15910F9013o5879P607q023k6430K43M3993L4276k9128k847L310j6547o1913n2425
15897a04750J244K7140N1579J6401M2154P294k5459j3932r043K0357m1093K2469
15885e639j1390m6868M6970M1095j2776J550m8026r6629j9650P2293N3791k4504
15873d9783m0776m7820K9543M4519J9746O425l4241j7228Q8525K9374k3525r661
15861d902k525M6688N4307n0079m628P553r277K9428j8447p2973l0361j8814P8571
15848D541J09728r3721n1845m1550K4619L5667k3346l4882L730J8777M4411M9036
$$ plain form
15836 45165 92805 30463 -9267 -19102 -21114 -31112 -48756 -102370 -172987 -173613 -90377 -33617 -85316
15823 -85316 -66378 -68656 -100861 -52750 -30177 -35156 -43715 -48786 -27796 4132 -56253 -98948
15811 -98948 -126844 -115637 -160149 -122654 -55401 -16454 4196 28492 15049 -49821 -69051 -64482
15799 -64482 -39623 8196 3300 -44848 -9800 -7113 -2248 -27351 -13717 -44522 -83337 -84897
15787 -84897 -46654 -4109 13011 37987 35726 5347 -24243 15764 49020 64726 52999 56184
15775 56184 98565 8390 -29730 -41178 -22603 450 13213 -16403 -12693 -59998 -43204 -15666
15763 -15666 -14308 -44122 -61331 -27261 -6468 -13189 -18408 -65814 -59358 -17401 -36192 -59863
15751 -59863 -41795 11641 -17556 -53297 -60929 -118636 -113629 -64742 -86505 -106987 -98043 -51261
$$ packed form
15836D5165M7640o2342l9730r835k012r998j7644n3614p0617o26Q3236N6760n1699
15823h5316J8938k278l2205M8111K2573m979q559n071K0990L1928o0385m2695
15811i8948k7896J1207m4512L7495O7253L8947K0650K4296j3443o4870j9230M569
15799f4482K4859M7819m896m8148L5048K687M865k5103J3634l0805l8815j560
15787h4897L8243M2545J7120K4976k261l0379k9590M0007L3256J5706j1727L185
15775E6184M2381r0175l8120j1448J8575K3053J2763k9616L710m7305J6794K7538
15763a5666J358k9814j7209L4070K0793o721n219m7406O456M1957j8791k3671
15751e9863J8068N3436k9197l5741p632n7707N007M8887k1763k0482Q944M6782
$$ plain form
15739 -51261 -34748 -73129 -57866 -54735 -102938 -93044 -85199 -51997 -112 2733 12400 -6844 -12621
15726 -12621 -73115 -66017 -77083 -105617 -47535 -7072 3142 -39622 -54458 -29674 -97252 -137927
15714 -137927 -119181 -95156 -104265 -67440 -71205 -52016 -97902 -118983 -85481 -59104 31423 27464
15702 27464 -20383 -35525 10477 29785 -14038 -54359 -31823 -46418 -54524 9928 71738 18304
15690 18304 -16348 28773 42933 56950 65607 50976 28385 -2935 13587 -20905 -59385 -23316
15678 -23316 -51803 -39974 -88963 -51686 -39821 -115311 -113814 -65132 692 1271 -16705 -18568
15666 -18568 14109 77775 101598 103219 89075 28761 -40819 22491 78562 51762 46307 47369
15654 47369 10455 -16953 -2472 52812 57010 47835 102171 73387 56351 59629 66400 78424
$$ packed form
15739e1261J6513l8381J5263L131m8203R894P845L3202N1885K845R667j9244n777
15726a2621o0494P098j1066k8534N8082M0463J0214m2764j4836K4784o7578m0675
15714a37927J8746K4025r109L6825l765J9189m5886k1081L3502K6377R0527l959
15702B7464m7847j5142M6002J9308m3823m0321K2536j4595q106O4452O1810n3434
15690A8304l4652M5121J4160J4017Q657j4631k2591l1320J6522l4492l8480L6069
15678b3316k8487J1829m8989L7277J1865p5490J497M8682O5824N79j7976j863
15666a8568L2677O3666K3823J621j4144o0314o9580O3310N6071k6800n455J062
15654D7369l6914k7408J4481N5284M198r175N4336k8784j7036L278O771J2024
$$ plain form
15642 78424 53958 44789 -16622 -78747 -29288 33080 56771 55738 3808 -43275 5219 794
15630 794 -8714 -81802 -88989 -62087 -15738 -16185 -1469 -37261 -18093 1851 49636 17569 -39723
15617 -39723 -23726 773 -45031 -61634 -29580 -33183 -146299 -167309 -138026 -59111 -23061 -66010
15605 -66010 -86729 -104415 -86410 -73442 -52036 -42822 -16229 -6820 -61362 -87811 -51951 31246
15593 31246 49277 -55099 -66094 -10294 -9721 -17090 46837 62172 44804 73789 62547 92874
15581 92874 89254 77625 79422 40967 -31251 -53800 -25712 -28674 -59303 -123471 -171296 -89295
15569 -89295 36676 68017 43182 28052 33065 15595 -22120 7779 -41196 -115376 -140029 -117974
15557 -117974 -87495 -107695 -57038 -11091 -9125 -36933 -62210 -38658 -44800 -119280 -76768 -24216
$$ packed form
15642G8424k4466r169o1411o2125M9459O2368K3691j033n1930m7083M8494m425
15630G94r508p3088p187K6902M6349m47J4716l5792J9168J9944M7785l2067n7292
15617c9723J5997K4499m5804j6603L2054l603j13116k1010K9283P8915L6050m2949
15605f6010k0719j7686J8005J2968K1406R214K6593R409n4542k6449L5860Q3197
15593C1246J8031j04376j0995N5800N73p369O3927J5335j7368K8985j1242L0327
15581I2874l620j1629J797l8455p2218k2549K8088k962l0629o4168m7825Q2001
15569h9295J25971L1341k4835j5130N013j7470l7715K9899m8975p4180k4653K2055
15557a17974L0479k0200N0657M5947J966k7808k5277K3552o142p4480M2512N2552
$$ plain form
15545 -24216 -5155 5761 39136 -16924 -69697 -76222 -57024 -37691 -71271 -85178 -37235 -13411
15533 -13411 -20179 -29535 -24345 7862 41855 12300 -7474 -18996 -16780 15839 -30266 -33452 13363
15520 13363 -13141 -23262 -6179 14479 -11866 -44444 -43206 -53422 -49444 11634 26041 50670
15508 50670 -12567 -36372 -34679 454 2259 -27806 -22156 -72693 -81537 -98044 -125719 -129763 -109732
15495 -109732 -99852 -132193 -106009 -14053 -40635 -3795 -3034 -17588 -14040 -28918 -29762 -30290 -49686
15482 -49686 -99291 -57904 -11504 -10830 -50498 -107957 -118402 -54383 -43374 -76923 -63220 -35261
15470 -35261 -11502 25140 26508 54495 48415 30303 42441 20674 10536 4524 4295 -34238 -106009
15457 -106009 -96301 -98020 -48069 44970 77647 89489 75234 42145 -19173 -30366 -63789 -53650
$$ packed form
15545b4216J9061J0916L3375n6060n2773o525J9198J9333l3580j3907M7943K3824
15533a3411o768r356N190L2207L3993k9555j9774j1522K216L2619m6105l186M6815
15520A3363k6504j0121J7083K0658k6345l2578J238j0216L978O1078J4407K4629
15508E0670o3237k3805J693L5133J805l0065N650n0537q844j6507k7675m044K0031
15495a09732R880l2341K6184R1956k6582L6840P61j4554L548j4878q44n28j9396
15482d9686m9605M1387M6400O74l9668n7459j0445O4019J1009l3549J3703K7959
15470c5261K3759L6642J368K7987o080j8112J2138k1767j0138o012k29l8533p1771
15457a06009R708j719M9951R3039L2677J1842j4255l3089o1318j1193l3423J0139
$$ plain form
15445 -53650 4416 27872 509 -28163 -12973 7430 -21243 39906 71640 14844 -18031 23967
15433 23967 10388 -45780 -58192 -13859 21067 2586 19626 25175 -13424 -44934 -32409 -42812
15421 -42812 -43754 -82192 -115944 -81097 -27919 -62408 -101384 -84709 -104327 -93100 -29069 -34925
15409 -34925 -76024 -83562 -106209 -97507 -105954 -93276 -62500 -61143 -19861 13493 -42787 -55007
15397 -55007 -35921 -60210 -68507 12414 -20276 4335 57628 49442 -19522 -44746 -85977 -52414
15385 -52414 -877 75477 69454 6489 -512 -14272 -74277 -114146 -88352 -66348 -60582 -79674
15373 -79674 -99354 -54743 -38259 -11712 -20593 -39029 31491 27648 53763 19164 -5633 4194
15361 4194 22831 20389 32289 69797 39463 8952 -4418 -13668 3686 -3716 -13911 19721
$$ packed form
15445e3650N8066K3456k7363k8672J5190K0403k8673O1149L1734n6796l2875M1998
15433B3967j3579n6168j2412M4333L4926j8481J7040N549l8599l1510J2525j0403
15421d2812r42l8438l3752L4847N3178l4489l8976J6675j9618J1227O4031n856
15409c4925m1099p538k2647Q702q447J2678L0776J357M1282L3354n6280j2220
15397e5007J9086k4289q297Q0921l2690K4611N3293q186o8964k5224m1231L3563
15385e2414N1537P6354o023o2965p001j3760o0005l9869K5794K2004N766j9092
15373g9674j9680M4611J6484K6547q881j8436P0520l843K6115l4599k4797R827
15361D194J8637k442J1900L7508l0334l0511j3370r250J7354p402j0195L3632
$$ plain form
15349 19721 37724 3058 -14832 -14721 -35124 -47946 -70367 -41915 -65946 -54717 -69172 -63674
15337 -63674 -39675 -51922 -88507 -93106 -58612 3749 -29652 -75762 -59781 -41440 -4359 -7674
15325 -7674 -19140 -9801 -1630 -25606 -38373 -71378 -99876 -98861 -137239 -142654 -116863 -102730 -79481
15312 -79481 -71465 -68662 -24604 39399 89357 66582 6946 -11095 -14584 -41287 -80626 -59109
15300 -59109 -13246 28486 67570 40721 35142 7735 -43555 -57094 -14207 -25559 -81363 -36716
15288 -36716 361 -24010 -8373 -7707 -20103 -24741 -26062 4390 56602 61427 63515 79610 24277
15275 24277 -44073 -54370 -7057 34155 -5879 -25069 -8689 33635 -2940 828 12700 23277
15263 23277 -16906 -32038 -72251 -99170 -122372 -153197 -85592 -55377 -43053 26616 37677 78302
$$ packed form
15349A9721J8003l4666j7890J11k0403j2822k2421K8452k4031J1229j4455N498
15337f3674K3999j2247l6585m599L4494O2361l3401m6110J5981J8341L7081l315
15325g674j1466R339Q171k3976j2767l3005k8498J015l8378n415K5791J4133K3249
15312g9481Q016K803M4058O4003M9958k2775n9636j8041l489k6703l9339K1517
15300e9109M5863M1732L9084k6849n579k7407n1290j3539M2887j1352n5804M4647
15288c6716L7077k4371J5637O66j2396m638j321L0452N2212M825K088J6095n5333
15275B4277o8350j0297M7313M1212m0034j9190J6380M2324l6575L768J1872J0577
15263B3277m0183j5132m0213k6919k3202l0825O7605L0215J2324O9669J1061M0625
$$ plain form
15251 78302 62876 47561 38056 26720 -24546 -63066 -40998 -38983 -42977 -44556 -14785 7789
15239 7789 34285 -13780 -24133 -39479 -61755 -53583 -47476 -68249 -41065 -8652 -21476 -29839
15227 -29839 -67864 -38325 16017 -36455 -44666 -11865 -18443 -48933 -37672 1082 -42540 -55293
15215 -55293 -41188 -39511 -3203 -2419 -23152 -42976 -32188 -16262 -22086 -34135 -10635 -12640 -91688
15202 -91688 -112757 -75652 -82224 -123851 -86026 -34844 -52870 -68188 -91090 -75617 -28780 -6311
15190 -6311 -91335 -137748 -122567 -64750 -35528 -46489 -43645 -45139 -85211 -52614 -47886 3165
15178 3165 25975 70036 76061 104448 33635 -61517 -102517 -24381 -5764 52903 48859 1912
15166 1912 -28749 -55108 -43211 -78890 -37575 -35081 -81466 -89037 -85862 -107112 -73934 -7121
$$ packed form
15251G8302j5426j5315r505j1336n1266l8520K2068K015l994j579K9771K2574
15239G789K6496m8065j0353j5346k2276Q172O107k0773K7184L2413j2824q363
15227b9839l8025K9539N4342n2472q211L2801o578l0490J1261L8754m3622j2753
15215e5293J4105J677L6308P84k0733j9824J0788J5926n824j2049K3500k005p9048
15202i1688k1069L7105o572m1627L7825N1182j8026j5318k2902J5473M6837K2469
15190f311q5024m6413J5181N7817K9222j0961K844j494m0072L2597M728N1051
15178C165K2810M4061O025K8387p0813r5152m1000P8136J8617N8667m044m6947
15166A912l0661k6359J1897l5679M1315K494m6385p571L175k1250L3178O6813
$$ plain form
15154 -7121 3820 36245 -5820 -65312 -81278 -98754 -111422 -125145 -107753 -47636 8843 36367
15142 36367 36876 -6000 -14262 -20513 -41006 -49564 -53448 -34957 -25994 14791 -15221 -31268 -67088
15129 -67088 -78006 -17896 47231 78803 83694 88259 67917 13279 -56067 -67142 -89289 -62278
15117 -62278 -51046 -32028 -27241 -61064 20724 62037 9763 25931 26686 37128 46597 8192
15105 8192 -31497 20477 69886 115406 147561 94305 36020 49809 91630 99423 75471 30731
15093 30731 -16729 -14691 21584 35475 -923 21934 94121 67107 31282 72394 -5890 -47045
15081 -47045 -28064 -43568 -32591 9618 -34548 -65616 -77205 -65622 -68176 -6421 -22177 -75394
15069 -75394 -54441 -16796 16985 -2551 -45405 -10735 -30746 -78796 -58985 -9589 -11866 26906
$$ packed form
15154g121J0941L2425m2065n9492j5966j7476j2668j3723J7392O0117N6479K7524
15142C6367N09m2876q262o251k0493q558l884J8491Q963M0785l0012j6047l5820
15129f7088j0918O0110O5127L1572M891M565k0342n4638o9346j1075k2147K7011
15117f2278J1232J9018M787l3823Q1788M1313n2274J6168P55J0442R469l8405
15105H192l9689N1974M9409M5520L2155n3256n8285J3789M1821P793k3952m4740
15093C0731m7460K038L6275J3891l6398K2857P2187k7014l5825M1112p8284m1155
15081d7045J8981j5504J0977M2209m4166l1068j1589J1583k554O1755j5756n3217
15069g5394K0953L7645L3781j9536m2854L4670k0011m8050J9811M9396k277L8772
$$ plain form
15057 26906 -27346 -61658 -63576 -84016 -79840 -125162 -123539 -90871 -119932 -157849 -141205 -108832
15045 -108832 -18847 -23120 -35407 -7722 -11451 -13255 -12337 -36681 -36887 -34597 -55400 -38838 -39372
15032 -39372 -67058 -38391 -5108 45023 54686 13028 -37419 -107146 -109525 -102452 -90596 -10663
15020 -10663 14304 2152 11380 26855 46378 22118 10728 23781 27227 40616 78532 39765
15008 39765 -40287 -39761 -74729 -86651 -27046 -34191 -56189 -12559 28257 8646 18620 61371
14996 61371 103059 145336 204451 237648 198389 136453 75570 65735 63011 69543 121254 114273
14984 114273 77765 40977 -14128 -83335 -94560 -42482 15983 67415 21659 -45074 -45377 -12045
14972 -12045 -47761 -78126 -44008 -46004 -49206 -23808 8870 -29437 -19492 19901 9025 -35270
$$ packed form
15057B6906n4252l4312j918k0440M176m5322J623L2668k9061l7917J6644L2373
15045a08832Q9985m273j2287K7685l729j804R18k4344k06K290k0803J6562n34
15032c9372k7686K8667L3283N0131R663m1658n0447o9727k379P073J1856P9933
15020a0663K4967j2152R228J5475J9523k4260j1390J3053L446J3389L7916l8767
15008C9765q0052N26l4968j1922N9605p145k1998M3630M0816j9611R974M2751
14996F1371M1688M2277N9115L3197l9259o1936o0883r835k724O532N1711o981
14984A14273l6508l6788n5105o9207j1225N2078N8465N1432m5756o6733l03L3332
14972a2045l5716l0365L4118j996l202K5398L2678l8307R945L9393j0876m4295
$$ plain form
14960 -35270 -52256 -33237 4737 9849 26722 46894 37341 -2977 -9965 -33728 -45907 -111560
14948 -111560 -108723 -83343 -55233 20741 58057 56914 45187 -18046 -13510 31242 12759 -34939
14936 -34939 -76412 -30653 -29219 -36733 -41854 -62157 -78103 -119228 -149866 -134737 -106483 -99372
14924 -99372 -126786 -136490 -120662 -142815 -76955 -84490 -84348 -70873 -41493 -93125 -62186 -50570
14912 -50570 -68586 -82076 -47741 -38024 -6231 23586 -5267 -44102 -75511 -41877 -24029 -31778
14900 -31778 -1089 11361 44958 53192 -458 -28999 -81696 -28123 -10742 -18958 -9588 -7930
14888 -7930 -25009 -29169 -34141 -44488 -70029 -40511 -15539 -62330 -73486 -51612 -30080 -27556
14876 -27556 -25320 -19620 -34430 -92652 -95680 -64060 -35849 -17301 -43120 -9678 1131 -13036
$$ packed form
14960c5270j6986J9019L7974N112J6873K0172r553m0318o988k3763j2179o5653
14948a11560K837K5380K8110P5974L7316j143j1727o3233M536M4752j8483m7698
14936c4939m1473M5759J434p514n121k0303j5946m1125l0638J5129K8254P111
14924i9372k7414r704J5828k2153O5860p535J42J3475K9380n1632L0939J1616
14912e0570j8016j3490L4335R717L1793K9817k8853l8835l1409L3634J7848p749
14900c1778L0689J2450L3597Q234n3650k8541n2697N3573J7381q216R370J658
14888g930j7079m160m972j0347k5541K9518K4972m6791j1156K1874K1532K524
14876b7556K236N700j4810n8222l028L1620K8211J8548k5819L3442J0809j4167
$$ plain form
14864 -13036 -30876 -24203 -25528 -102736 -142336 -141509 -104048 -78433 -415 27598 -14162 -28836
14852 -28836 -1876 -13736 -4625 74820 92412 40484 1384 22068 -4022 -47703 -70104 -52147
14840 -52147 -51839 -116811 -103394 -54103 -111754 -88086 -103277 -83289 -28488 20097 6417 -48049
14828 -48049 -40495 -18473 -55929 -27602 -59344 -3692 54588 78059 39392 1465 -14036 -35077
14816 -35077 -54149 -97343 -101422 -124867 -96354 -23310 30558 48420 68638 70721 35415 22992
14804 22992 -36049 -46236 -13077 -39371 -112143 -90623 -88036 -31927 5629 49190 65003 60400
14792 60400 17275 -58783 -119375 -87864 -61775 -41867 34749 99576 44193 -24473 -82755 -76074
14780 -76074 -25739 -36045 -18415 3195 -3794 649 47420 27182 -10622 -62013 -95649 -91579
$$ packed form
14864a3036j7840O673j325p7208l9600Q27L7461K5615P8018K8013m1760j4674
14852b8836K6960j1860R111P9445J7592n1928l9100K0684k6090m3681k2401J7957
14840e2147L08o4972J3417M9291n7651K3668j5191J9988N4801M8585j3680n4466
14828d8049P554K2022l7456K8327l1742N5652N8280K3471l8667l7927j5501k1041
14816c5077j9072m3194m079k3445K8513P3044N3868J7862K0218K083l5306j2423
14804B2992n9041j0187L3159k6294p2772K1520K587N6109L7556M3561J5813m603
14792F0400m3125p6058o0592L1511K6089J9908P6616O4827n5383o8666n8282O681
14780g6074N0335j0306J7630K1610o989M443M6771k0238l7804n1391l3636M070
$$ plain form
14768 -91579 -130138 -189789 -145225 -141328 -169358 -189642 -157494 -143156 -131937 -121523 -132633 -151179
14756 -151179 -110465 -80331 -76084 -59276 -85324 -136165 -162498 -149377 -132437 -146228 -74887 -80375
14744 -80375 -62696 -30232 16368 33714 37860 34545 54178 -10232 -77379 -65289 -76184 -56800
14732 -56800 35376 66206 72599 79017 15992 50438 -1706 -82531 -39949 1348 39099 18008
14720 18008 -60693 -120256 -128365 -93416 -42840 -54737 11887 9389 -43620 -47810 15046 -16520
14708 -16520 -22466 8760 44811 72408 59599 16309 -17119 -5171 25848 -10236 -59865 -68142
14696 -68142 -63668 -19711 -6293 19148 14150 11729 63605 48072 -15858 -18923 -49839 -62495
14684 -62495 -95236 -72750 -20609 -10527 -26083 -57766 -34470 -41831 -55770 7210 9284 9928
$$ packed form
14768i1579l8559n9651M4564L897k8030k0284L2148J4338J1219J0414j1110j8546
14756a51179M0714L0134M247J6808k6048n0841k6333J3121J6940j3791P1341n488
14744h0375J7679L2464M6600J7346M146l315J9633o4410o7147J2090j0895J9384
14732e6800R2176L0830O393O418o3025L4446n2144q0825M2582M1297L7751k1091
14720A8008p8701n9563q109L4949N0576j1897O6624k498n3009m190O2856l1566
14708a6520n946L1226L6051K7597j2809m3290l3428J1948L1019l6084m9629q277
14696f8142M474M3957J3418K5441m998k421N1876j5533o3930l065l0916j2656
14684f2495l2741K2486N2141J0082j5556l1683K3296p361j3939O2980K074O44
$$ plain form
14672 9928 46183 10716 -72317 -30285 1781 -60076 -15258 24170 -14048 -17329 -22940 -52203
14660 -52203 -54733 -37851 -30017 -4 67482 67841 47259 30607 20896 -41673 -96720 -124209 -89071
14647 -89071 -35600 1281 -28934 -44361 -52447 27733 50413 10354 -32253 17533 23152 -4716
14635 -4716 -83426 -97484 -66348 25438 49597 -15021 2857 13107 -4599 -4016 8523 66677
14623 66677 90718 57702 10802 -5589 6961 -159 973 17614 -26226 -86715 -52219 -5195
14611 -5195 -233 -12796 -59179 2883 46474 16545 -14517 5226 12130 -4144 10139 -17280
14599 -17280 36682 38317 65540 44920 20736 50539 66802 47250 83520 143641 182250 111610
14587 111610 87485 83333 28066 24550 70114 102162 113091 80128 14270 3572 44118 6894
$$ packed form
14672I928L6255l5467q3033M2032L2066o1857M4818L9428l8218l281n611k9263
14660e2203k530J6882P834L0013O7486L59k0582j6652r711o2569n5047k7489L5138
14647h9071N3471L6881l0215j5427q086Q0180K2680m0059m2607M9786N619k7868
14635d716p8710j4058L1136R1786K4159o4618J7878J0250j7706N83J2539N8154
14623F6677K4041l3016m6900j6391J2550p120J132J6641m3840o0489L4496M7024
14611e195M962j2563m6383O2062M3591k9929l1062J9743O904j6274J4283k7419
14599a7280N3962J635K7223k0620k4184K9803J6263j9552L6270O0121L8609p0640
14587A11610k4125m152n5267l516M5564L2048J0929l2963o5858j0698M0546l7224
$$ plain form
14575 6894 -32046 -168 7344 40331 26776 22030 11034 417 18473 -7630 -14178 18704
14563 18704 -3704 -112 29596 31370 -5175 14241 60716 70165 94003 76002 82279 68318
14551 68318 20339 7748 -6452 6807 84592 58810 -6037 14220 -2507 25658 105105 143006
14539 143006 61188 13168 -18568 -11211 -1160 30811 54187 40768 4203 -33610 -27299 -21965
14527 -21965 -29120 4401 38501 26831 22837 12813 -9045 -42226 28202 65666 74731 52969
14515 52969 34166 65854 86457 36887 21594 57047 121514 155511 139209 192392 235456 272201
14503 272201 271492 239956 198948 201907 156894 108624 72714 50465 12818 5341 68876 52044
14491 52044 42534 34092 38162 -21537 -33813 541 39193 65337 34352 -31400 -11340 -1560
$$ packed form
14575F894l8940L1878P512L2987j3555m746j0996j0617J8056k6103o548L2882
14563A8704k2408L592K9708J774l6545J9416M6475R449K3838j8001O277j3961
14551F8318m7979j2591j4200J3259P7785k5782o4847K0257j6727K8165P9447L7901
14539A43006q1818m8020l1736P357J0051L1971K3376j3419l6565l7813O311N334
14527b1965p155L3521L4100j1670l994j0024k1858l3181P0428L7464R065k1762
14515E2969j8803L1688K0603m9570j5293L5453O4467L3997j6302N3183M3064L6745
14503B72201p09l1536m1008K959m5013m8270l5910k2249l7647p477O3535j6832
14491E2044r510q442M070n9699j2276L4354L8652K6144l0985o5752K0060R780
$$ plain form
14479 -1560 -43624 -65916 -28977 -21355 -33509 -39497 -26437 1298 44277 57693 46176 21826
14467 21826 -7158 -34100 -96979 -4095 50570 33254 -6803 -25378 33520 67743 61222 -501
14455 -501 -4903 34927 -4553 -8997 3940 -10463 45057 54667 18692 23619 42406 67949 77269
14442 77269 43369 34425 59023 39704 22589 41538 79321 79914 36531 22218 1287 -7059
14430 -7059 -4977 -16245 31294 56389 13410 -9006 -52433 -71348 -95145 -96162 -67124 -55427
14418 -55427 -40530 -68667 -113983 -40632 -16640 -38084 -34010 -68657 -146751 -105338 -73054 -23277
14406 -23277 -21812 -55514 -100143 -9632 53637 38686 15412 74144 52243 23071 61344 -3663
14394 -3663 -48623 -51605 -26108 35433 43152 15868 -60893 -81554 -16185 32762 3760 12025
$$ packed form
14479a560m2064k2292L6939P622j2154n988J3060K7735M2979J3416j1517k4350
14467B1826k8984k6942o2879R2884N4665j7316m0057j8575N8898L4223o521o1723
14455e01m402L9830l9480m444J2937j4403N5520R610l5975M927J8787K5543R320
14442G7269l3900q944K4598j9319j7115J8949L7783N93m3383j4313k0931q346
14430g059K082j1268M7539K5095m2979k2416m3427j8915k3797j017K9038J1697
14418e5427J4897k8137m5316P3351K3992k1444M074l4647p8094M1413L2284M9777
14406b3277J465l3702m4629R0511O3269j4951k3274N8732k1901k9172L8273o5007
14394c663m4960k982K5497O1541P719k7284p6761k0661O5369M8947k9002Q265
$$ plain form
14382 12025 61160 57854 -21417 -26430 3675 11022 -334 16152 31848 25351 70412 52296
14370 52296 21590 -16745 39552 51692 9668 49710 137038 150734 129507 101987 38485 -7380
14358 -7380 18768 95781 120558 143849 164650 158763 163021 133162 113143 44597 56284 123914
14346 123914 83835 68282 113172 100000 70461 55048 73763 65737 15479 15297 57897 56385
14334 56385 91740 117340 147550 182650 235439 300781 254904 275021 295391 345365 408052 556874
14322 556874 723462 861439 968338 1102793 1301797 1501273 1598475 1689189 1799679 1894052
14312 1894052 1998577 1981422 1952969 1905186 1796778 1731301 1679193 1549087 1432276 1325037
14302 1325037 1183137 1005269 820571 680351 497345 399141 375565 298251 203702 195931
$$ packed form
14382A2025M9135l306p9271n013L0105P347j1356J6486J5696o497M5061j8116
14370E2296l0706l8335N6297J2140m2024M0042Q7328J3696k1227k7520o3502m5865
14358g380K6148P7013K4777K3291K0801n887M258k9859k0019o8546J1687O7630
14346A23914m0079j5553M4890j3172k9539j5413J8715q026n0258j82M2600j512
14334E6385L5355K5600L0210L5100N2789O5342m5877K0117K0370M9974O2687J48822
14322E56874J66588J37977J06899J34455J99004J99476R7202R0714J10490R4373
14312A894052J04525j7155k8453m7783j08408o5477n2108j30106j16811j07239
14302A325037j41900j77868j84698j40220j83006r8204k3576p7314r4549p771
$$ plain form
14292 195931 174659 172017 186014 141136 113875 130290 132633 124539 95277 60743 63729 83536
14280 83536 73172 36880 22778 12268 2600 -18305 -48376 -44276 881 15054 79564 127566
14268 127566 136094 116108 103600 108887 103147 25437 -10898 7956 7768 39430 14162 -42460
14256 -42460 -57641 -76168 -76162 13098 4521 -7092 -8034 -461 -17560 -23752 -91254 -100316 -100213 -64916
14242 -64916 -58063 -64616 11159 26910 41729 -16197 -21941 28172 23039 74361 111211 100641
14230 100641 44475 -12902 -29263 -57057 -10016 -51742 -72243 -104549 -65953 -21111 -43315
14219 -43315 -34996 -92543 -95666 -91382 -35763 -4771 22659 15098 14369 1321 10329 76164 121669
14206 121669 46182 -35840 -85878 -82031 -51408 -23886 22713 104254 83977 26228 10941 -24153
$$ packed form
14292A95931k1272k642J3997m4878k7261J6415K343q094k9262l4534K986J9807
14280H3536j0364l6292j4102j0510r668k0905l0071M100M5157J4173O4510M8002
14268A27566Q528j9986j2508N287n740p7710l6335J8854j88L1662k5268n6622
14256d2460j5181j8527OQ9260q577j1613r42P573j7099o192o7502r062J03L5297
14242f4916O853o553P5775J5751J4819n7926n744N0113n133N1322L6850j0570
14230A00641n6166n7377j6361k7794M7041m1726k0501l2306L8596M4842k2204
14219d3315Q319n7547l123M284N5619L0992K7430p561p29j3048R008O5835M5505
14206A21669p5487q2022n0038L847L0623K7522M6599Q1541k0277n7749j5287l5094
$$ plain form
14194 -24153 -62123 -57419 -45976 -4988 -21831 -79400 -50167 -21019 -12919 3843 13608 -13652
14182 -13652 -17118 48140 112308 128798 86339 66516 36795 24702 41157 -44070 -41223 -32465
14170 -32465 32262 67612 38568 -32227 -55924 -75671 -43973 -24849 2575 -16163 -79471 -73524
14158 -73524 -5576 34572 -10042 -48376 -77551 -84139 -3462 -19763 -48147 -15914 -17054 -41330
14146 -41330 -25912 -13955 22813 26802 -20868 -58630 -46606 31030 55375 55513 95226 122967
14134 122967 158061 137508 74634 -22098 -51367 -44764 -42087 -43444 -8391 22385 -4755 -59656
14122 -59656 -74522 -43069 -104186 -98321 -41312 -24310 29780 43170 15 94 51109 22522
14110 22522 -12952 7719 -24195 -91239 -110764 -80855 -82814 -55352 -79106 -91267 -48325 23244
$$ packed form
14194b4153l7970M704J1443M0988j6843n7569K9233K9148Q100J6762R765k7260
14182a3652l466O5258O4168J6490m2459j9823k9721j2093J6455q5227K847Q758
14170c2465O4727L5350k9044p0795k3697j9747L1698J9124K7424j8738o3308N947
14158g3524O7948M0148m4614l8334k9175o588Q0677j6301k8384L2233j140k4276
14146d1330J5418J1957L6768L989m7670l7762J2024P7636K4345J38L9713K7741
14134A22967L5094k0553o2874r6732k9269O603K677j357L5053L0776k7140n4901
14122e9656j4866L1453o1117N865N7009J7002N4090J3390m3155P9N1015k8587
14110B2522l5474K0671l1914o7044j9525K9909j959K7462k3754j2161M2942P1569
$$ plain form
14098 23244 42335 -1519 -23970 -40490 -10180 -34201 -23844 -69996 -141997 -154523 -218317 -178914
14086 -178914 -88923 -106437 -44300 38440 53515 44983 -7896 -50700 26856 85180 50746 9241
14074 9241 -8432 -36137 -56685 23049 33455 -11044 -42405 -95534 -64716 -19893 19273 44757
14062 44757 25604 22439 52947 38194 3485 3695 96440 37088 -34068 -34179 -49584 -90182 -104041
14049 -104041 -31881 -15277 2811 14234 4291 -50152 -58977 -37270 34210 50919 7961 12900
14037 12900 28493 54456 61680 47697 12132 -41956 -45583 19151 70547 21211 63453 139131
14025 139131 138953 114055 118993 129477 59610 31460 79202 91126 65538 92498 72319 24440
14013 24440 36800 27438 25585 -21785 -23045 -8100 12109 53215 48039 37551 34677 -326 -45178
$$ packed form
14098B3244J9091m3854k2451j6520L0310k4021J0357m6152p2001j2526o3794L9403
14086a78914Q9991j7514O2137Q2740J5075q532n2879m2804P7556N8324l4434m1505
14074I241j7673k7705k0548P9734J0406m4499l1361n3129L0818M4823L9166K5484
14062D4757j9153l165L0508j4753l4709K10R2745n9352p1156j11j5405m0598j3859
14049a04041P2160J6604J8088J1423r943n4443q825K1707P1480J6709m2958M939
14037A2900J5593K5963P224j3983l5565n4088l627O4734N1396m9336M2242P5678
14025A39131j78k4898M938J0484o9867k8150M7742J1924k5588K6960k0179m7879
14013B4440J2360r362j853m7370j260J4945K0209M1106n176j0488k874l5003m4852
$$ plain form
14000 -45178 -63732 -9391 41570 -33239 -10892 38362 68859 94212 110616 99006 125383 109432
13988 109432 135377 110133 150328 141300 96246 100257 125333 162064 120790 101144 118684 35479
13976 35479 -4975 39822 36653 -1203 -36612 -54760 -63410 -46253 -8312 10 18892 13820
13964 13820 14980 -21290 -51876 14359 54696 75564 96405 115737 83086 41878 1232 44898
13952 44898 34319 -173 25706 55900 32451 5495 32025 62460 -11439 -30193 -4489 42377
13940 42377 102860 28931 -5428 60202 70111 36967 30788 23624 -40449 -54805 -2699 25809
13928 25809 5495 -9259 5452 -16545 -67789 -87708 -50195 -40554 -27049 -3118 34758 -36561
13916 -36561 -51969 -24647 45258 95733 78262 88770 68991 58749 70714 113167 182272 130826
$$ packed form
14000d5178j8554N4341N0961p4809K2347M9254L0497K5353J6404j1610K6377j5951
13988A09432K5945k5244M0195r028m5054M011K5076L6731m1274j9646J7540q3205
13976C5479m0454M4797l169l7856l5409j8148q650J7157L7941Q322J8882n072
13964A3820J160l6270l0586O6235M0337K0868K0841J9332l2651m1208m0646M3666
13952D4898j0579l4492K5879L0194k3449k6956K6530L0435p3899j8754K5704M6866
13940D2377O0483p3929l4359O5630R909l3144o179p164o4073j4356N2106K8508
13928B5809k0314j4754J4711k1997n1244j9919L7513R641J3505K3931L7876p1319
13916c6561j5408K7322O9905N0475j7471J0508j9779j0242J1965M2453O9105n1446
$$ plain form
13904 130826 45569 44930 34001 89964 88969 115936 124933 132355 110093 121097 70426 16897 433
13891 433 -36502 -19657 2173 48687 108981 61881 -24698 -69900 -43260 -29238 -4364 55297
13879 55297 67638 36374 2004 -30479 -9345 15605 12640 -16159 -26442 -49814 -48677 -24355
13867 -24355 37809 -1385 6687 -52718 -81658 -60961 7386 50763 40513 59577 59896 9307
13855 9307 -24642 -31672 -64209 -24075 -32309 -73064 -47643 -55632 1870 21986 -35875 -94342
13843 -94342 -92165 -52616 21729 89236 36331 -55447 -128833 -148715 -131312 -29607 -8866 24963
13831 24963 34418 42733 -35806 3925 127345 163215 149797 98060 116584 127761 125429 97136
13819 97136 98348 86671 75679 65418 6891 -21242 -60161 -71500 -93725 -68838 -38594 46143
$$ packed form
13904A30826q5257o39j0929N5963r95K6967Q997P422k2262J1004n0671n3529j6464
13891D33l6935J6845K1830M6514O0294m7100q6579m5202K6640J4022K4874N9661
13879E5297J2341l1264l4370l2483K1134K4950k965k8799j0283k3372J137K4322
13867b4355O2164l9194Q072n9405k8940K0697O8347M3377j0250J9064L19n0589
13855I307l3949p030l2537M0134q234m0755K5421p989N7502K0116n7861n8467
13843i4342K177L9549P4345O7507n2905r1778p3386j9882J7403J01705K0741L3829
13831B4963R455Q315p8539L9731J23420L5870j3418n1737J8524J1177k332k8293
13819I7136J212j1677j0992j0261n8527k8133l8919j1339k2225K4887L0244Q4737
$$ plain form
13807 46143 84237 118591 120321 117446 80440 -16961 -68331 -65460 -19093 -13298 -1368 16803
13795 16803 -17627 -25301 -47516 -5732 -8438 5331 6617 -10904 1149 67156 48602 51274
13783 51274 51964 80323 92480 57717 56090 38639 63295 40361 45078 72362 59342 9772
13771 9772 -46686 -347 14896 -27796 -38975 -66804 -112527 -82612 -30540 18514 48790 43017
13759 43017 42808 34020 13136 -6335 -7371 16958 -19062 -50783 -84649 -116286 -91180 -73993
13747 -73993 -82469 -57254 6931 5022 48792 67463 50251 -37853 -51769 -28855 23280 66863
13735 66863 69703 46289 -6527 -40090 16980 -22587 -40876 3691 -10370 7901 -51281 -114475
13723 -114475 -126121 -94651 1205 39787 55957 43127 26972 -43529 -48436 -55430 -9232 -13295
$$ packed form
13807D6143L8094L4354J730k875l7006r7401n1370K871M6367N795J1930J8171
13795A6803l4430p674k2215M1784k706J3769J286j7521J2053O6007j8554K672
13783E1274O90K8359J2157l4763j627j7451K4656k2934M717K7284j3020m9570
13771I772n6458M6339J5243m2692j1179k7829m5723K9915N2072M9054L0276n773
13759D3017k09q788k0884j9471j036K4329l6020l1721l3866l1637K5106J7187
13747g3993q476K5215O4185j909M3770J8671j7212q8104j3916K2914N2135M3583
13735F6863K840k3414n2816l3563N7070l9567j8289M4567j4061J8271n9182o3194
13723a14475j1646L1470R5856L8582J6170j2830j6155p0501m907o994M6198m063
$$ plain form
13711 -13295 -871 18319 -44856 -94768 -85813 -48653 -6937 -42672 -30408 -51712 -40117 -36606
13699 -36606 -24218 -22030 -30955 -49502 -58048 -22146 -29897 -53152 -51100 -7159 868 -12210 -20004
13686 -20004 -74027 -66389 -82905 -112297 -65816 -29625 -13876 -355 -11704 -9636 3717 3216
13674 3216 11055 43229 42883 84035 83532 42374 3654 -11359 -10689 -2468 -2605 -28160 -29086 52814
13660 52814 83282 111904 115948 141971 126928 31646 17465 70146 76059 -33315 -46358 31441
13648 31441 67960 -13365 -63338 -22411 16747 -731 42917 26201 -7409 11130 -17565 20773
13636 20773 21014 47752 79559 120246 99095 24984 -20421 -358 51019 3466 -96589 -54397
13624 -54397 -16459 4508 3183 16490 58275 70836 36452 38740 21893 18692 -17991 -15601
$$ packed form
13711a3295J2424J9190o3175m9912Q955L7160M1716l5735J2264k1304J1595L511
13699c6606J2388K188q925j8547q546L5902p751k3255K052M3941Q027j3078p794
13686b0004n4023P638j6516k9392M6481L6191J5749J3521j1349K068J3353n01
13674C216P839L2174l46M1152n03m1158l8720j5013O70Q221j37k5555r26Q1900
13660E2814L0468K8622M044K6023j5043r5282j4181N2681N913j09374j3043P7799
13648C1441L6519q1325m9973M0927L9158j7478M3648j6716l3610J8539k8695L8338
13636B0773K41K6738L1807M0687k1151p4111m5405K0063N1377m7553j00055M2192
13624e4397L7938K0967j325J3307M1785J2561l4384K288j6847l201l6683K390
$$ plain form
13612 -15601 -15966 -55350 -96678 -117814 -91949 -50585 -91693 -75730 -45412 6292 35001 39177
13600 39177 569 -30357 -70542 -70571 -48073 7794 21331 34551 56632 23709 12197 -31723
13588 -31723 -34212 36542 74741 51486 -24405 -68184 -40945 16991 -17720 18235 -43117 -40269
13576 -40269 -12550 -49918 -107248 -91593 -58750 -38621 -43884 -6393 42050 51667 45646 18710
13564 18710 -25300 -77193 -79092 -68458 -41422 8898 28809 72096 84862 -5339 -102390 -68786
13552 -68786 -61841 -59051 -49751 -31743 -2392 13835 80818 121581 46284 -11914 -28953 -9122
13540 -9122 17113 -12448 28677 34639 20665 35603 84466 95174 70625 64078 47216 27522
13528 27522 36978 51900 -8751 -52286 -11668 77524 97952 45309 -51362 -78061 -22269 13548
$$ packed form
13612a5601l65l9384m1328k1136K5865M1364m1108J5963L0318N1704K8709M176
13600C9177l8608l0926m0185k9K2498N5867J3537J3220K2081l2923j1512m3920
13588c1723k489P0754L8199k3255p5891m3779K7239N7936l4711L5955o1352K848
13576d0269K7719l7368n7330J5655L2843K0129n263L7491M8443R617o021k6936
13564A8710m4010n1893j899J0634K7036N0320J9911M3287J2766r0201r7051L3604
13552f8786O945K790R300J8008K9351J6227O6983M0763p5297n8198j7039J9831
13540i122K6235k9561M1125N962j3974J4938M8863J0708k4549o547j6862j9694
13528B7522R456J4922o0651m3535M0618Q9192K0428n2643r6671k6699N5792L5817
$$ plain form
13516 13548 -232 -6897 -37072 -5818 4457 618 7305 7143 32467 67891 37425 -15061 11210
13503 11210 -4967 -49508 -22253 -32389 -30302 2027 49170 54880 33451 34168 21774 -38488
13491 -38488 13655 39782 -8174 6451 88577 83198 -23669 -63591 -14989 26811 23107 16898
13479 16898 -21153 -92105 -97010 -81183 -12635 4649 -32897 -74580 -57392 -46141 -55236 -60913
13467 -60913 -60059 -32636 -3143 4482 115077 128394 100212 82591 90141 65130 100125 84488
13455 84488 14408 12070 -79 -15396 13961 -183 2758 -4964 30263 120993 169124 104275
13443 104275 92348 48874 16380 -8676 -19598 -57481 -83753 -61021 -110516 -110594 -62192 -57644
13431 -57644 -71956 -12094 33003 29927 78836 83323 18868 -38001 1456 -5653 -17593 -26148
$$ packed form
13516A3548j3780o665l0175L1254J0275l839O687j62K5324L5424l0466n2486K6271
13503A1210j6177m4541K7255j0136K087L2329M7143N710k1429P17j2394o0262
13491c8488N2143K6127m7956J4625Q2126n379j06867l9922M8602M1800l704o209
13479A6898l8051p0952m905J5827O8548J7284l7546m1683J7188J1251r095n677
13467f0913Q54K7423K9493P625J10595J3317k8182j7621P550k5011L4995j5637
13455H4488p0080k338j2149j5317K9357j4144K941p722L5227R0730M8131o4849
13443A04275j1927m3474l2494k5056j0922l7883k6272K2732m9495p8M8402M548
13431e7644j4312N9862M5097l076M8909M487o4455n6869L9457p109j1940q555
$$ plain form
13419 -26148 -36190 -61933 -54556 -74323 -735 -17430 -5140 15768 -26394 -13135 -11688 2119
13407 2119 -6343 -16110 -10536 6399 -6832 53976 37166 18823 53326 77577 51911 48635 34337
13394 34337 63798 27833 -52700 -29221 -28828 -8756 -40264 -87846 -90217 -58098 61402 29011
13382 29011 -64440 -62044 -22690 -66906 -40031 33708 56242 42848 55362 36638 21529 71674
13370 71674 68293 -8855 -47523 -49561 13312 64750 85894 71690 65602 -14058 24126 19685
13358 19685 -26398 -97133 -61534 7668 -12356 -24133 32765 10687 -22062 -16375 8711 2624
13346 2624 -6717 -11825 5312 -16130 18849 -43121 -102057 -52303 -15160 -57865 -80441 -49439
13334 -49439 2814 44272 47434 32107 -36253 -47593 -69232 -41681 -4431 16251 39366 58434
$$ packed form
13419b6148j0042k5743P377j9767P3588j6695J2290K0908m2162J3259J447J3807
13407B119q462r767N574J6935j3231O0808j6810j8343L4503K4251k5666l276j4298
13394C4337K9461l5965q0533K3479L93K0072l1508m7582k371L2119J19500l2391
13382B9011r3451K396L9354m4216K6875P3739K2534j3394J2514j8724j5109N0145
13370G1674l381p7148l8668k038O2873N1438K1144j4204o088p9660L8184m441
13358A9685m6083p0735L5599O9202k0024j1777N6898k2078l2749N687K5086o087
13346B624r341n108J7137k1442L4979o1970n8936M9754L7143m2705k2576L1002
13334d9439N2253M1458L162j5327o8360j1340k1639K7551L7250K0682K3115J9068
$$ plain form
13322 58434 135530 125105 103450 92434 80617 -3119 -41296 -8099 -17808 -43010 -8758 24518
13310 24518 -27418 4721 16368 33241 28405 -62682 -69812 -8874 -23468 -86303 -92508 -97360
13298 -97360 -55491 27600 1990 -21322 14412 -23718 -26437 94942 68026 -2433 29085 41474
13286 41474 48973 87602 74210 18865 -26634 -38838 -9276 36335 16298 31145 41891 14578
13274 14578 23391 49440 -1144 -18362 -12199 49241 87294 70987 61223 69941 27203 9998
13262 9998 49697 90023 110216 89943 34777 -25147 6081 5385 55833 109914 90350 54683
13250 54683 57249 108425 145728 152382 126608 152233 130971 136044 144682 151506 187221 195762 238937
13237 238937 316450 373359 406065 438478 583644 706012 870419 1074788 1278212 1414550
$$ packed form
13322E8434P7096j0425k1655j1016j1817q3736l8177L3197r709k5202L4252L3276
13310B4518n1936L2139J1647J6873m836r1087p130O0938j4594o2835o205m852
13298i7360M1869Q3091k5610k3312L5734l8130k719J21379k6916p0459L1518J2389
13286D1474P499L8629j3392n5345m5499j2204K9562M5611k0037J4847J0746k7313
13274A4578Q813K6049n0584j7218O163O1440L8053j6307r764Q718m2738j7205
13262I998L9699M0326K0193k0273n5166n9924L1228o96N0448N4081j9564l5667
13250E4683K566N1176L7303O654k5774K5625k1262N073Q638O824L5715Q541M3175
13237B38937P7513N6909L2706L2413J45166J22368J64407K04369K03424J36338
$$ plain form
13227 1414550 1562042 1656308 1649495 1608487 1550881 1423756 1233570 997128 846833 762495
13217 762495 653707 544843 408086 348040 353440 330364 228310 150141 152824 192624 221092
13206 221092 206525 174814 156819 205609 204771 162722 115348 98205 124304 125454 135143 160881
13194 160881 108425 92351 102677 87960 29361 26037 36618 56987 67792 51680 89731 35067
13182 35067 3527 32508 71354 138596 142684 105594 43681 35813 41739 105260 51975 -36722
13170 -36722 17146 90258 148736 168548 137718 119120 62754 -41481 -35787 30209 115528 91156
13158 91156 77107 101497 116871 73152 56260 82357 77443 57393 39269 34432 -23641 -39864
13146 -39864 -36281 25218 27086 45384 66473 71061 68133 49384 81520 71800 53558 28600 31837
$$ packed form
13227A414550J47492R4266o813m1008n7606j27125j90186k36442j50295q4338
13217G62495j08788j08864j36757o0046N400k3076j02054p8169K683L9800K8468
13206B21092j4567l1711j7995M8790q38m2049m7374j7143K6099J150R689K5738
13194A60881n2456j6074J0326j4717n8599l324J0581K0369J0805j6112L8051n4664
13182C5067l1540K8981L8846O7242M088l7090o1913p868N926O3521n3285q8697
13170c6722N3868P3112N8478J9812l0830j8598n6366j04235N694O5996Q5319k4372
13158I1156j4049K4390J5374m3719j6892K6097m914k0050j8124m837n8073j6223
13146c9864L583O1499J868J8298K1089M588k928j8749L2136r720j8242k4958L237
$$ plain form
13133 31837 82635 85892 55878 57295 71035 50177 38316 18109 -8468 61188 127576 136740
13121 136740 190182 216618 252749 258796 258991 287152 331163 318585 331398 282604 215652 210916
13109 210916 203519 177830 133452 132463 113521 57225 62470 44392 46817 64776 34804 47063
13097 47063 85886 99237 105384 114764 188480 207887 148137 70804 70018 102579 109802 133048 138543
13084 138543 60369 3219 -27242 -5424 28469 29182 38927 39756 26762 74836 130921 91229
13072 91229 69377 164009 210931 194926 163407 145722 102167 101135 120328 116396 181975 184135
13060 184135 227348 311360 343744 333965 358599 377048 349067 298207 296036 270321 268711 240600
13048 240600 230956 249048 261592 238844 173592 96086 32942 42513 20342 -49021 -33033 23445
$$ packed form
13133C1837N0798L257l0014J417J3740k0858j1861k0207k6577O9656O6388R164
13121A36740N3442K6436L6131O047J95K8161M4011j2578J2813m8794o6952m736
13109B10916p397k5689m4378r89j8942n6296N245j8078K425J7959k9972J2259
13097D7063L8823J3351O147R380P3716J9407n9750p7333p86L2561P223K3246N495
13084A38543p8174n7150l0461K1818L3893P13R745Q29j2994M8074N6085l9692
13072I1229k1852R4632M6922j6005l1519j7685m3555j032J9193l932O5579K160
13060A84135M3213Q4012L2384r779K4634J8449k7981n0860k171k5715j610k8111
13048B40600r644J8092J2544k2748o5252p7506o3144R571k2171o9363J5988N6478
$$ plain form
13036 23445 68843 34993 -43766 -40124 -242 13833 30135 83147 76538 43106 56132 94916
13024 94916 68972 42308 82600 113270 49647 29208 19219 -17584 79007 89315 23258 46091
13012 46091 50874 24137 9294 48248 23797 44866 43939 92909 94910 70108 66835 79334 82288
12999 82288 91253 127341 74578 69533 104324 166064 134599 129867 139468 148621 146127 125500 125376
12986 125376 129659 166116 122370 93586 125426 117979 125463 122322 151207 132908 153356 199991
12974 199991 215456 234038 253375 223774 183019 232137 194718 112926 112031 54115 86842 109852
12962 109852 47584 102410 108737 110732 106012 102037 123393 112199 47525 -34086 -62026 -14291
12950 -14291 -10692 -34480 -72699 -84338 8480 48680 37577 33243 21171 -41262 -92305 -110470
$$ packed form
13036B3445M5398l3850p8759L642L9882J4075J6302N3012o609l3432J3026L8784
13024I4916k5944k6664M0292L0670o3623k0439r989l6803R6591J0308o6057K2833
13012D6091M783k6737j4843L8954k4451K1069r27M8970K001k4802l273J2499K954
12999H2288Q965L6088n2763n045L4791O1740l1465m732R601R153k494k0627j24
12986A25376M283L6457m3746k8784L1840p447P484l141K8885j8299K0448M6635
12974A99991J5465J8582J9337k9601m0755M9118l7419q1792q95n7916L2727K3010
12962A09852o2268N4826O327J995m720l975K1356j1194o4674q1611k7940M7735
12950a4291L599k3788l8219j1639R2818M0200j1103m334j2072o2433n1043j8165
$$ plain form
12938 -110470 -138992 -188877 -199818 -179892 -64949 88831 245858 423024 601062 732329
12928 732329 864953 962445 1072530 1171944 1223847 1208140 1179897 1096255 1003155 931439 896439
12917 896439 858141 786119 779305 768170 753871 754516 763218 727768 673805 615932 587448 605217
12905 605217 648924 672465 676026 665139 613164 629027 637934 650815 680890 668898 663868 680327
12893 680327 713623 693117 667945 710839 718521 727871 783254 886622 875629 815159 841081 826187
12881 826187 788782 714218 688201 730025 743745 768970 817245 861243 858791 901626 943515 1022834
12869 1022834 1087424 1058696 1130274 1179264 1191207 1162860 1205236 1217732 1233482 1327031 1340278
12858 1340278 1389258 1439351 1478838 1557998 1608763 1531528 1535816 1585188 1611902 1674034 1726098
$$ packed form
12938a10470k8522m9885j0941J9926J14943J53780J57027J77166J78038J31267
12928G32329J32624R7492J10085R9414N1903j5707k8243q3642r3100p1716l5000
12917H96439l8298p2022o814j1135j4299O45Q702l5450n3963n7873k8484J7769
12905F05217M3707K3541L561j0887n1975J5863Q907J2881L0075j1992n030J6459
12893F80327L3296k0506k5172M2894P682R350N5383J03368j0993o0470K5922j4894
12881H26187l7405p4564k6017M1824J3720K5225M8275M3998k452M2835M1889P9319
12869A022834O4590k8728P1578M8990J1943k8347M2376J2496J5750R3549J3247
12858A340278M8980N0093L9487P9160N0765p7235M288M9372K6714O2132N2064
$$ plain form
12847 1726098 1781149 1897587 1951350 2029123 2098572 2199005 2354185 2542020 2690346 2854594
12837 2854594 2979519 3124747 3354851 3629615 3889061 4153548 4455722 4822789 5251320
12828 5251320 5744863 6272988 6831339 7518988 8333116 9372664 10501528 11838129 13407538
12819 13407538 15218589 17277797 19718720 22560524 26023090 30431876 36409854 44888803
12811 44888803 57136598 74325548 96981924 124822660 156754369 190895635 225128004
12804 225128004 256771806 282689616 299830086 306159844 301360368 286198582 262897158
12797 262897158 233817139 201650292 168804594 137814876 110435720 87702145 69706462
12790 69706462 55877795 45441145 37475519 31286195 26463366 22577517 19355290 16650997
$$ packed form
12847A726098N5051J16438N3763P7773O9449J00433J55180J87835J48326J64248
12837B854594J24925J45228K30104K74764K59446K64487L02174L67067M28531
12828E251320M93543N28125N58351O87649Q14128J039548J128864J336601J569409
12819A3407538J811051K059208K440923K841804L462566M408786N977978Q478949
12811D4888803J2247795J7188950K2656376K7840736L1931709L4141266L4232369
12804B25128004L1643802K5917810J7140470O329758m799476j5161786k3301424
12797B62897158k9080019l2166847l2845698l0989718k7379156k2733575j7995683
12790F9706462j3828667j0436650p965626o189324m822829l885849l222227k704293
$$ plain form
12782 16650997 14341127 12369538 10705552 9268667 8087635 7078355 6220580 5597035
12774 5597035 5080007 4582636 4111920 3787004 3564227 3371668 3195948 3021127 2880706
12765 2880706 2672237 2549853 2453001 2437695 2460345 2395390 2319066 2318828 2254751 2222257 2191021
12754 2191021 2063662 1909053 1772302 1687556 1615138 1568586 1483250 1334810 1196643 1049456
12744 1049456 988217 957243 910987 889947 812907 770327 846509 864235 845987 845071 761879 655176
12732 655176 592219 568554 619661 654511 627048 524277 546594 546814 501169 473847 422119 417307
12720 417307 430557 386997 386548 389093 433508 453304 473492 438312 435365 451165 466664 437498
12708 437498 451011 511744 642786 762347 975483 1169292 1301443 1423274 1618042 1743775
$$ packed form
12782A6650997k309870j971589j663986j436885j181032j009280q57775o23545
12774E597035n17028m97371m70716l24916k22777j92559j75720j74821j40421
12765B880706k08469j22384r6852j5306K2650o4955p6324k38o4077l2494l1236
12754B191021j27359j54609j36751q4746p2418m6552q5336j48440j38167j47187
12744A049456o1239l0974m6256k1040p7040m2580P6182J7726j8248r16q3192j06703
12732F55176o2957k3665N1107L4850k7463j02771K2317K20m5645k7322n1728m812
12720D17307J3250m3560m49K545M4415J9796K0188l5180k947J5800J5499k9166
12708D37498J3513O0733J31042J19561K13136J93809J32151J21831J94768J25733
$$ plain form
12698 1743775 1794042 1797455 1746449 1758852 1692127 1461107 1247840 1004033 783464 667009
12688 667009 549235 440137 381412 335779 305982 209211 98295 11864 -28264 11545 14417
12677 14417 -2802 55044 113874 216086 296981 338213 421619 494236 488671 481815 521862 582906
12665 582906 622507 601420 578799 501192 416077 405018 416280 421573 384950 343147 315418 294085
12653 294085 303145 322294 316657 245757 220084 228480 257146 310804 341008 280448 267842 261487
12641 261487 271639 217527 198860 171261 148311 180722 168547 130413 99245 111527 124983
12630 124983 126964 92627 48005 -15247 -79564 -102613 -40320 17643 51817 30830 50093 82535
12618 82535 122768 95484 31006 45968 83243 77225 148070 194413 191836 168831 158205 177373
$$ packed form
12698A743775N0267L413n1006J2403o6725k31020k13267k43807k20569j16455
12688F67009j17774j09098n8725m5633k9797r6771j10916q6431m0128L9809K872
12677A4417j7219N7846N8830J02212Q0895M1232Q3406P2617n565o856M0047O1044
12665E82906L9601k1087k2621p7607q5115j1059J1262N293l6623m1803k7729k1333
12653B94085R060J9149n637p0900k5673Q396K8666N3658L0204o0560j2606o355
12641B61487J0152n4112j8667k7599k2950L2411j2175l8134l1168J2282J3456
12630A24983J981l4337m4622o3252o4317k3049O2293N7963L4174k0987J9263L2442
12618H2535M0233k7284o4478J4962L7275o018P0845M6343k577k3005j0626J9168
$$ plain form
12606 177373 221727 241968 196715 193179 190062 214704 173253 125176 143667 106469 56848 45029
12594 45029 64485 70120 68841 123329 119375 30235 105316 116305 133922 135565 93149 143288
12582 143288 179979 156122 155779 142407 159120 193644 206571 227567 215108 212879 134104 89819
12570 89819 99822 120222 87425 32744 58816 82599 93843 83758 104261 128359 64249 60887
12558 60887 85668 68399 63597 109927 154979 138286 209087 199253 191619 140232 120603 115761
12546 115761 145296 135846 166990 192532 213111 202001 176041 248785 299979 360311 450552 512597
12534 512597 541902 488678 420227 327858 283107 296618 253522 225800 199829 184179 147657
12523 147657 88154 71742 106535 85323 24975 9184 20477 21520 21315 15610 -9222 30128
$$ packed form
12606A77373M4354K0241m5253l536l117K4642m1451m8077J8491l7198m9621j1819
12594D5029J9456N635j279N4488l954q9140P5081J0989J7617J643m2416N0139
12582A43288L6691k3857l43j3372J6713L4524J2927K0996j2459k229p8775m4285
12570H9819J0003K0400l2797n4681K6072K3783J1244j0085K0503K4098o4110l362
12558F0887K4781j7269m802M6330M5052j6693P0801r834p634n1387j9629m842
12546A15761K9535r450L1144K5542K0579j1110k5960P2744N1194O0332R0241O2045
12534E12597K9305n3224o8451r2369m4751J3511m3096k7722k5971j5650l6522
12523A47657n9503j6412L4793k1212o0348j5791J1293J043k05n705k4832L9350
$$ plain form
12511 30128 77639 35430 20880 52713 44480 7117 23360 30260 70986 109320 41217 848
12499 848 17811 63175 63355 96656 84524 30942 15010 -27022 -53132 4824 61317 50078
12487 50078 11267 19529 15405 42551 117447 116053 75272 85479 139519 169799 172551 156346
12475 156346 144005 85012 82948 96289 44109 21826 14289 79982 92872 67158 55630 67734
12463 67734 135882 178845 127747 95195 79417 116760 150931 152021 129734 180018 135000 77602
12451 77602 83420 108703 93701 98040 85730 148139 191176 183274 152715 143329 158936 159909 166273
12438 166273 185438 183675 249105 316719 291118 259443 296868 283023 292162 338459 323062 359274
12426 359274 355005 363021 243939 176806 215481 223607 258652 249280 299089 282300 191476 121762
$$ packed form
12511C0128M7511m2209j4550L1833q233l7363J6243O900M0726L8334o8103m0369
12499H48J6963M5364J80L3301j2132n3582j5932m2032k6110N7956N6493j1239
12487E0078l8811Q262m124K7146P4896j394m0781J0207N4040L0280K752j6205
12475A56346j2341n8993k064J3341n2180k2283p537O5693J2890k5714j1528J2104
12463F7734O8148M2963n1098l2552j5778L7343L4171J090k2287N0284m5018n7398
12451G7602N818K5283j5002M339j2310O2409M3037p902l0559r386J5607R73O364
12438A66273J9165j763O5430O7614k5601l1675L7425j3845R139M6297j5397L6212
12426C59274m269Q016j19082o7133L8675Q126L5045r372M9809j6789r0824o9714
$$ plain form
12414 121762 149123 115377 71918 174211 177559 93294 151455 226365 203527 154208 152950 184768
12402 184768 265179 335242 372391 362574 341139 324562 349246 386225 408312 397869 366983 308618
12390 308618 273480 293029 234889 198508 244666 248348 267661 274489 334673 396565 471003 574185
12378 574185 724466 848554 1033233 1278560 1411140 1520706 1582117 1578023 1670171 1674712 1505941
12367 1505941 1367877 1228168 1022803 888231 757697 579527 429002 329993 284399 225510
12357 225510 151408 148931 138971 142333 143968 116745 42366 42168 6407 32269 45168 -49019 -119508
12344 -119508 -133374 -78769 -27794 -15630 -35338 -27635 -1504 -4787 44439 82210 105707 102504
12332 102504 43232 58541 120433 109876 36242 41725 30143 72924 20989 66740 103867 107264
$$ packed form
12414A21762K7361l3746m3459J02293L348q4265N8161P4910k2838m9319j258L1818
12402A84768Q0411P0063L7149r817k1435j6577K4684L6979K2087j0443l0886n8365
12390C08618l5138J9549n8140l6381M6158L682J9313O828O0184O1892P4438J03182
12378E74185J50281J24088J84679K45327J32580J09566O1411m094R2148M541j68771
12367A505941j38064j39709k05365j34572j30534j78170j50525r9009m5594n8889
12357B25510p4102k477r960L362J635k7223p4379j98l5761K5862J2899r4187p0489
12344a19508j3866N4605N0975J2164j9708P703K6131l283M9226L7771K3497l203
12332A02504n9272J5309O1892j0557p3634N483j1582M2781n1935M5751L7127L397
$$ plain form
12320 107264 75011 36446 25697 45598 109707 95782 37936 -368 -10939 11390 61962
12309 61962 90827 81450 12852 -28994 2636 76462 30213 -5270 -52499 -77952 -25186 27037
12297 27037 81311 86601 62020 -22060 -66659 -57396 2706 -27716 -96621 -108623 -71185 2091
12285 2091 14649 -18467 -15305 -15952 -605 32780 -975 -14446 -15699 23840 25035 8631 17459
12272 17459 20740 54811 45319 72553 57128 46857 80233 105872 24002 -49107 -23360 7454
12260 7454 7436 -28142 -79246 -82966 -71789 -56761 -21576 -50885 -66237 -89745 -107904 -108228 -78118
12247 -78118 1295 60319 89082 17865 -47155 -17676 -22498 -60271 -54405 -48555 -28281 390
12235 390 22342 52683 58319 60392 80598 94952 88796 39805 23733 61965 83314 30696 -30138
$$ packed form
12320A07264l2253l8565j0749J9901O4109j3925n7846l8304j0571K2329N0572
12309F1962K8865r377o8598m1846L1630P3826m6249l5483m7229k5453N2766N2223
12297B7037N4274N290k4581q4080m4599R263O0102l0422o8905j2002L7438P3276
12285B091J2558l3116L162o47J5347L3385l3755j3471j253L9539J195j6404Q828
12272A7459L281L4071r492K7234j5425j0271L3376K5639q1870p3109K5747L0814
12260G454j8l5578n1104l720J1177J5028L5185k9309j5352k3508j8159l24L0110
12247g8118P9413N9024K8763p1217o5020K9479m822l7773N866N850K0274K8671
12235C90K1952L0341N636K073K0206J4354o156m8991j6072L8232K1349n2618o0834
$$ plain form
12222 -30138 23175 69438 71656 56716 23712 7456 26128 54729 58443 21376 4864 12588
12210 12588 77457 57728 9358 53339 58265 34679 18531 48534 37415 11453 -18590 -52727
12198 -52727 -48437 -44182 -60664 -57930 -39389 -65411 -109915 -138232 -105697 -8103 -35412 -94246
12186 -94246 -66575 -4197 31112 38246 25332 40291 -6407 6771 5640 12899 -36845 36007
12174 36007 67088 27163 -75063 -61855 -95072 -130394 -115934 -151901 -145107 -130783 -66969 -13623
12162 -13623 -40296 -7166 87319 17514 208 1715 -11628 11364 35844 65494 46839 6621
12150 6621 48934 75139 141567 169758 83060 -19453 -74936 -58420 17487 25713 -3693 -23350
12138 -23350 -1242 1971 -38504 -97127 -104984 -62279 -33570 21801 68039 80722 55051 63005
$$ packed form
12222c0138N3313M6263K218j4940l3004j6256J8672K8601L714l7067j6512P724
12210A2588O4869j9729m8370M3981M926k3586j6148L0003j1119k5962l0043l4137
12198e2727M290M255j6482K734J8541k6022m4504k8317L2535R7594k7309n8834
12186i4246K7671O2378L5309P134j2914J4959m6698J3178j131P259m9744P2852
12174C6007L1081l9925j02226J3208l3217l5322J4460l5967O794J4324O3814N3346
12162a3623k6673L3130R4485o9805j7306J507j3343K2992K4480K9650j8655m0218
12150F621M2313K6205O6428K8191q6698j02513n5483J6516P5907Q226k9406j9657
12138b3350K2108L213m0475n8623p857M2705K8709N5371M6238J2683k5671P954
$$ plain form
12126 63005 107688 122328 82647 -26095 -55298 -65460 -8834 25819 8431 -30322 -67722
12115 -67722 -90626 -114925 -74913 -55926 -28327 -35291 -20780 -58487 -32719 -4393 66907 38818
12103 38818 12376 -89986 -95907 -51918 -12808 -50806 -89028 -68190 8231 -24456 -39417 -20306
12091 -20306 8578 5191 -58684 -72119 -65227 -54053 -33768 -24419 -30404 1855 -6636 -100434 -106332
12078 -106332 -23942 84146 150913 86025 19568 23740 25345 28848 16491 36128 61492 162820
12066 162820 140584 73304 34128 63299 126467 149366 114636 52892 -34555 -89311 -94392 -114136
12054 -114136 -112734 -67818 -63613 -19385 30432 76506 14327 -32795 37195 -11931 -49157 -97405
12042 -97405 -19045 31652 19825 24219 27478 36062 51126 97634 81511 10131 -40688 20496
$$ packed form
12126F3005M4683J4640l9681j08742k9203j0162N6626L4653j7388l8753l7400
12115f7722k2904k4299M0012J8987K7599o964J4511l7707K5768K8326P1300k8089
12103C8818k6442j02362n921M3989L9110l7998l8222K0838P6421l2687j4961J9111
12091b0306K8884l387o3875j3435O892J1174K0285R349n985L2259q491r3798n898
12078a06332Q2390J08088O6767o4888o6457M172J605L503j2357J9637K5364J01328
12066A62820k2236o7280l9176K9171O3168K2899l4730o1744q7447n4756n081j9744
12054a14136J402M4916M205M4228M9817M6074o2179m7122O9990m9126l7226m8248
12042i7405P8360N0697j1827M394L259Q584J5064M6508j6123p1380n0819O1184
$$ plain form
12030 20496 54306 45329 40891 -1267 -47232 -14152 60667 35909 -9136 37406 34961 -18773
12018 -18773 -57251 -6505 46376 24076 41769 51590 102226 89338 41497 3737 -5806 10950
12006 10950 -11624 20852 -35673 -61233 -51085 19655 64618 -11363 -14346 27518 59428 61891
11994 61891 39123 70056 145917 113764 50306 27929 16132 8064 -7532 -13149 -48932 -10838
11982 -10838 -32355 -45635 -96307 -53604 -9065 -11006 22502 56795 13857 47905 77276 68740
11970 68740 14757 -11693 8011 43899 52482 61253 34586 77924 73537 24813 2813 -35676
11958 -35676 -10145 3333 -12495 14737 48018 74155 42825 -46197 -82891 -78936 -84189 -73927
11946 -73927 -63472 -51421 -57701 -71562 -81652 -64766 -16982 18358 33743 42825 123639 130068
$$ packed form
12030B0496L3810q977m438m2158m5965L3080P4819k4758m5045M6542k445n3734
12018a8773l8478N0746N2881k2300J7693R821N0636j2888m7841l7760r543J6756
12006A0950k2574L2476n6525k5560J0148P0740M4963p5981k983M1864L1910K463
11994F1891k2768L0933P5861l2153o3458k2377j1797q068j5596n617l5783L8094
11982a0838k1517j3280n0672M2703M4539j941L3508L4293m2938L4048K9371q536
11970F8740n3983k6450J9704L5888Q583Q771k6667M3338m387m8724k2000l8489
11958c5676K5531J3478j5828K7232L3281K6137l1330q9022l6694L955n253J0262
11946g3927J0455J2051o280j3861j0090J6886M7784L5340J5385R082Q0814O429
$$ plain form
11934 130068 113221 84909 46770 54457 129340 142935 113899 112649 117757 85046 7847 -47335
11922 -47335 -18701 4393 -27197 -25294 -20874 -11392 -43503 -110489 -100996 -84521 -78596 -40339 -12316
11909 -12316 -28131 38778 104174 109877 72750 8900 -3972 -525 12710 -47666 -52451 -12434
11897 -12434 -24263 -26206 -5522 -5917 1699 -14313 44949 15505 -19644 30281 8617 -23866
11885 -23866 -35190 -7462 7701 -3176 -11872 44955 35548 28999 6748 -6372 -35936 -51760
11873 -51760 -35308 -50833 -11913 -19534 2702 -1464 -18709 -9765 -2630 9785 4443 -10568 15231
11860 15231 32170 -2215 132 26095 20579 2111 -39442 7095 8259 21780 -50485 -71927
11848 -71927 -24847 -13758 -34576 -21859 -48356 19536 -7198 -40217 -47331 -64154 -89482 -42958
$$ packed form
11934A30068j6847k8312l8139P687P4883J3595k9036j250N108l2711p7199n5182
11922d7335K8634K3094l1590J903M420R482l2111o6986R493J6475N925L8257K8023
11909a2316j5815O6909O5396N703l7127o3850j2872L447J3235o0376m785M0017
11897a2434j1829j943K0684l95P616j6012N9262k9444l5149M9925k1664l2483
11885b3866j1324K7728J5163j0877q696N6827r407o549k2251j3120k9564j5824
11873e1760J6452j5525L8920p621K2236m166j7245Q944P135J2415n342j5011K5799
11860A5231J6939l4385K347K5963n516j8468m1553M6537J164J3521p2265k1442
11848g1927M7080J1089k0818J2717k6497O7892k6734l3019p114j6823k5328M6524
$$ plain form
11836 -42958 -27290 1171 -5901 -16934 2405 17335 -6266 -28379 -4512 -34783 -74334 -49096
11824 -49096 -50319 -7696 -53003 -73107 -75795 -63982 -27109 57240 75159 53049 55278 51606
11812 51606 -25387 -91075 -105593 -23148 -11976 -511 -18957 -694 31598 33974 -4985 -11433
11800 -11433 27776 12292 15255 37205 -1232 -34641 -36963 -38895 -79983 -72740 -38411 -74041
11788 -74041 -54283 -56226 -89834 -70154 -14006 -2765 12987 -14918 -7507 -34917 -113957 -88646
11776 -88646 -66905 -62585 -22380 33556 34934 45330 45937 3569 34143 79495 112931 131800
11764 131800 133971 114891 99326 84794 61227 88346 83377 65258 114205 64435 -11573 -34328
11752 -34328 -51027 5583 44889 58538 47310 45252 15751 -1945 11029 -65808 -116388 -60031
$$ packed form
11836d2958J5668K8461p072j1033J9339J4930k3601k2113K3867l0271l9551K5238
11824d9096j223M2623m5307k0104k688J1813L6873Q4349J7919k2110K229l672
11812E1606p6993o5688j4518Q2445J1172J1465j8446J8263L2292K376l8959o448
11800a1433L9209j5484K963K1950l8437l3409k322j932m1088P243L4329l5630
11788g4041J9758j943l3608J9680N6148J1241J5752k7905P411k7410p9040K5311
11776h8646K1741M320M0205N5936J378J0396O07m2368L0574M5352L3436J8869
11764A31800K171j9080j5565j4532k3567K7119m969j8119M8947m9770p6008k2755
11752c4328j6699N6610L9306J3649j1228k058k9501j7696J2974p6837n0580N6357
$$ plain form
11740 -60031 -57474 -55387 -56384 -28955 17970 78685 88979 -35504 -70501 -78635 -65683 -49960
11728 -49960 -67912 -131521 -159240 -126357 -52350 30395 58837 34265 -46535 -46868 -29235 -34686
11716 -34686 -85247 -88629 -68677 -38848 -5193 7059 35110 -2154 -53607 -82191 -119464 -100141
11704 -100141 -81876 -52781 -18012 -8593 -77120 -95218 -79256 -44433 -53534 -80677 -68123 -54286
11692 -54286 -61088 -31418 14850 -22157 -12112 24490 -30214 -76903 -56411 -62708 -78381 -72352
11680 -72352 -32164 -16363 -39314 -95083 -122458 -65305 27468 41393 65501 85819 45503 5767
11668 5767 -27436 8057 -22633 -71882 -86671 -92114 -59772 -89947 -142119 -129971 -59609 -47135
11656 -47135 -53080 -70355 -109311 -136323 -138144 -98959 -106342 -134257 -134287 -97116 -55183 -11906 -39533
$$ packed form
11740f0031K557K087r97K7429M6925O0715J0294j24483l4997q134J2952J5723
11728d9960j7952o3609k7719L2883P4007Q2745K8442k4572q0800l33J7633n451
11716c4686n0561l382J9952K9829L3655J2252K8051l7264n1453k8584l7273J9323
11704a00141J8265K9095L4769R419o8527j8098J5962L4823r101k7143J2554J3837
11692e4286o802K9670M6268l7007J0045L6602n4704m6689K0492o297j5673O029
11680g2352M0188J5801k2951n5769k7375N7153R2773J3925K4108K0318m0316l9736
11668E767l3203L5493l0690m9249j4789n443L2342l0175n2172J2148P0362J2474
11656d7135n945j7275l8956k7012j821L9185p383k7915l0L7171M1933M3277k7627
$$ plain form
11643 -39533 -42899 102 -52403 -71024 -89714 -81428 -50800 -3790 4253 35055 27669 -10906
11631 -10906 -73855 -73222 -51929 -28096 -5716 11819 -12022 -58613 -71385 3046 34939 -13541
11619 -13541 -47350 -37617 21901 41967 46770 49521 -16192 -26592 17570 8390 20732 6615
11607 6615 -11905 -63919 -71126 -13644 27421 8903 -10359 -2301 -34037 -52985 -42859 3705
11595 3705 36281 18658 -20711 -7899 -13126 -39261 -37477 26619 54784 -10009 -82522 -84594
11583 -84594 -88939 -66968 -38450 -13837 -2925 38703 84228 143886 141410 75688 7688 -56672
11571 -56672 -86452 -84099 -62968 -28753 2438 58352 18281 -39216 -64019 -43971 -45463 -39664
11559 -39664 -42382 101 34699 107680 119061 112955 63955 88204 94341 92465 107847 57876
$$ packed form
11643c9533l366M3001n2505j8621j8690Q286L0628M7010Q043L0802p386l8575
11631a0906o2949O33K1293K3833K2380J7535k3841m6591j2772P4431L1893m8480
11619a3541l3809R733N9518K0066M803K751o5713j0400M4162r180J2342j4117
11607F615j8520n2014p207N7482M1065j8518j9262Q058l1736j8948J0126M6564
11595C705L2576j7623l9369J2812n227k6135J784O4096K8165o4793p2513k072
11583h4594m345K1971K8518K4613J0912M1628M5525N9658k476o5722o8000o4360
11571e6672k9780K353K1131L4215L1191N5914m0071n7497k4803K0048j492N799
11559c9664k718M2483L4598P2981J1381o106m9000K4249O137j876J5382m9971
$$ plain form
11547 57876 73513 77729 43869 -1135 7580 19426 8921 27713 34352 16388 20654 -36655
11535 -36655 -73443 -47386 -58357 -66898 18754 51423 59657 32139 -29458 -13116 8142 -5971
11523 -5971 -43386 -36194 -39385 -71055 9357 11897 -21736 -42505 -51225 -14515 -45930 -16971 30292
11510 30292 80308 50090 -21530 -7466 28806 70861 82811 14066 36825 16285 68388 76904
11498 76904 45757 56349 37004 14681 -2440 -10973 18784 65021 61500 -5038 27349 92411
11486 92411 35311 23866 15219 -25413 -41977 -31155 -62965 -16919 7418 -11468 -73976 -97212
11474 -97212 -31076 14861 27111 55598 24005 -41789 -49538 -77759 -14396 29126 73810 78212
11462 78212 41787 36385 22841 1323 -30960 -17695 3412 20384 21422 -9568 1126 -31572
$$ packed form
11547E7876J5637M216l3860m5004Q715J1846j0505J8792O639j7964M266n7309
11535c6655l6788K6057j0971q541Q5652L2669Q234k7518o1597J6342K1258j4113
11523e971l7415P192l191l1670Q0412K540l3633k0769q720L6710l1415K8959M7263
11510C0292N0016l0218p1620J4064L6272M2055J1950o8745K2759k0540N2103Q516
11498G6904l1147J0592j9345k2323j7121q533K9757M6237l521o6538L2387O5062
11486I2411n7100j1445q647m0632j6564J0822l1810M6046K4337j8886o2508k3236
11474i7212O6136M5937J2250K8487l1593o5794p749k8221O3363M3522M4684M402
11462G8212l6425n402j3544k1518l2283J3265K1107J6972J038l0990J0694l2698
$$ plain form
11450 -31572 -5319 38696 39629 -17240 -79508 -87666 -112588 -65350 -53767 -52065 -61076 -59590 -70913
11437 -70913 -121743 -95063 -56544 -3805 6755 6918 -7211 24130 56592 28180 5666 -31552
11425 -31552 4395 -18315 -44143 -67822 -76391 -34189 -26944 896 -24222 -15498 -11601 24801
11413 24801 12749 -25232 -23050 -7423 -68783 -140896 -129662 -53821 -25113 -6428 -3998 -40195
11401 -40195 -62436 -70277 -68298 -83211 -24664 -65374 -103263 -91888 -65815 6204 29388 -73770
11389 -73770 -145795 -133442 -79325 -85751 -158416 -158812 -114291 -79502 -80889 -78820 -30711 13861 -25230
11376 -25230 -81047 -94394 -107997 -70855 -23895 -23897 -24739 -26635 -67029 -24869 49625 66913 53053
11363 53053 58964 64298 54960 -178 -60404 -39596 -25461 21289 47649 59495 25240 -28355
$$ packed form
11450c1572K6253M4015R33n6869o2268q158k4922M7238J1583J702r011J486j1323
11437g0913n0830K6680L8519N2739J0560J63j4129L1341L2462k8412k2514l7218
11425c1552L5947k2710k5828k3679q569M2202P245K7840k5118Q724L897L6402
11413B4801j2052l7981K182J5627o1360p2113J1234P5841K8708J8685K430l6197
11401d0195k2241p841J979j4913N8547m0710l7889J1375K6073P2019K3184j03158
11389g3770p2025J2353N4117o426p2665l96M4521L4789j387K069M8109M4572l9091
11376b5230n5817j3347j3603L7142M6960kq42j896m0394M2160P4494J7288j3860
11363E3053N911N334r338n5138o0226K0808J4135M6750K6360J1846l4255n3595
$$ plain form
11351 -28355 -10492 -3525 -50237 -50957 -34569 -22951 -40030 -43502 -70277 -54593 -12148 -18678 -108040
11338 -108040 -97399 -79313 -112846 -94471 -72711 -84021 -23767 12737 -24736 -16428 1793 4520
11326 4520 -20964 -35823 -5499 17329 -9674 50965 74207 86404 61200 30946 49086 37834
11314 37834 40701 -10069 -20759 -11303 -25252 9838 66707 56190 41326 29641 25560 1708
11302 1708 54023 15682 -25838 23143 82214 63527 16948 5478 -40903 -104594 -60112 -66008
11290 -66008 -100267 -100685 -77980 -31687 44535 66810 62412 82233 66653 46506 7242 -25974
11278 -25974 35226 21719 -32717 -22018 -7683 10498 5137 -19086 15192 20539 44508 73408
11266 73408 31503 4583 2541 -15555 -111315 -110203 -89625 -92737 -73452 -62647 -31011 -50117
$$ packed form
11351b8355J7863O967m6712p20J6388J1618j7079l472k6775J5684M2445o530q9362
11338a08040J0641J8086l3533J8375K1760j1310O0254L6504l7473Q308J8221K727
11326D520k5484j4859L0324K2828k7003O0639K3242J2197k5204l0254J8140j1252
11314C7834K867n0770j0690R456j3949L5090N6869j0517j4864j1685m081k3852
11302A708N2315l8341m1520M8981N9071j8687m6579j1470m6381o3691M4482n896
11290f6008l4259m18K2705M6293P6222K2275m398J9821j5580k0147l9264l3216
11278b5974O1200j3507n4436J0699J4335J8181n361k4223L4278N347K3969K8900
11266G3408m1905k6920k042j8096r5760J112K0578l112J9285J0805L1636j9106
$$ plain form
11254 -50117 -70000 -56712 -45506 -42500 -59798 -45803 -18675 -4300 -46615 -59512 -83751 -106731
11242 -106731 -84932 -37882 19006 21319 -19810 -29221 26244 41168 77735 3536 -42174 -62441
11230 -62441 -29623 -4516 -1068 -23417 -18925 -14893 15196 16850 -26988 -17406 -22354 18527 29867
11217 29867 3462 -62668 -16183 39363 -430 10059 22566 43961 13260 -15317 -49868 -32490
11205 -32490 -8476 59365 93570 68416 30179 -22085 -67440 -15868 -5910 2505 90991 85339
11193 85339 40103 1187 -23347 -76747 -92472 -29030 9113 -31060 -77379 -72509 -32603 -25931
11181 -25931 -39083 -50041 -15114 5894 33593 23533 -13719 -5016 -21730 -77611 -66003 -27048
11169 -27048 -13335 -70544 -51247 -49059 -51749 -73033 -49511 -79356 -106185 -42599 9200 36975
$$ packed form
11254e0117j9883J3288J1206L006j7298J3995K7128J4375m2315j2897k4239k2980
11242a06731K1799M7050N6888K313m1129r411N5465J4924L6567p4199m5710k0267
11230f2441L2818K5107L448k2349M492M032L0089J654m3838R582m948M0881J1340
11217B9867k6405o6130M6485N5546l9793J0489J2507K1395l0701k8577l4551J7378
11205c2490K4014O7841L4205k5154l8237n2264m5355N1572R958Q415Q8486n652
11193H5339m5236l8916k4534n3400j5725O3442L8143m0173m6319M870L9906O672
11181b5931j3152j0958L4927K1008K7699j0060l7252Q703j6714n5881J1608L8955
11169b7048J3713n7209J9297K188k690k1284K3522k9845k6829O3586N1799K7775
$$ plain form
11157 36975 26440 33517 47135 6551 -67915 -57611 -30566 -21425 -65956 -26877 -36474 -31842
11145 -31842 -24870 -43129 -34616 -25326 -35566 -44468 -36563 -19024 23316 47182 4276 -20728 63963
11132 63963 69745 -3323 -17046 43346 91346 43341 -47859 -54909 -6115 -5501 3936 10811 37189
11119 37189 45282 23793 19162 8167 -26295 -51135 -44214 19980 6433 -39994 -158063 -171233
11107 -171233 -138467 -104893 -69648 -33470 22883 16983 -7215 21745 45361 35210 -2845 -36493
11095 -36493 -48167 -37423 -64019 -4604 -9624 44660 92664 122468 140984 105358 22348 -7104
11083 -7104 -4961 -29141 -81095 -77405 -68762 -52710 -59520 -56065 19525 8254 -31599 -15213 -4066
11070 -4066 1271 8942 36904 63652 49712 65353 18135 46604 70200 2931 -2154 5529 2446
$$ packed form
11157C6975j0535P077J3618m0584p4466J0304K7045R141m4531L9079r597M632
11145c1842O972j8259Q513R290j0240q902P905J7539M2340K3866m2906k5004Q4691
11132F3963N782p3068j3723O0392M8000m8005r1200p050M8794O14R437O875K6378
11119C7189Q093k1489m631j0995l4462k4840O921O4194j3547m6427j18069j3170
11107a71233L2766L3574L5245L6178N6353n900k4198K8960K3616j0151l8055l3648
11095c6493j1674J0744k6596N9415n020N4284M8004K9804J8516l5626q3010k9452
11083g104K143k4180n1954L690Q643J6052o810L455P5590j1271l9853J6386J1147
11070d066N337P671K7962K6748j3940J5641m7218K8469K3596o7269n085P683l083
$$ plain form
11057 2446 25896 66116 -5525 -45639 -21143 22484 -14457 -47825 -70606 6284 20425 -12059
11045 -12059 4952 20569 -14486 21269 74168 -15323 -72599 -44857 -40965 -25969 -3163 -2573
11033 -2573 3291 60257 54170 57389 10223 -18168 -60360 -2326 70800 75882 42678 -13279 -32626
11020 -32626 -23916 -13490 -15231 -8547 25603 21000 40017 81945 104290 72031 -20274 -104260
11008 -104260 -43050 74615 101510 61760 63562 -8270 -57725 -92055 -95643 -76743 -24362 -31779
10996 -31779 -59621 -61633 37494 93203 37756 44700 16595 -13842 -95944 -79089 -47663 -29230
10984 -29230 -39014 -15576 -16115 -39931 -64545 -88602 -44430 -16476 23339 79740 94068 111569
10972 111569 92140 54620 20497 -3935 -14544 -36690 -66363 -123303 -104936 -128810 -152897
$$ packed form
11057B446K3450M0220p1641m0114K4496M3627l6941l3368k2781P6890J4141l2484
11045a2059J7011J5617l5055L5755N2899q9491n7276K7742L892J4996K2806N90
11033b573N864N6966o087L219m7166k8391m2192N8034P3126N082l3204n5957j9347
11020c2626Q710J0426j741O684L4150m603J9017M1928K2345l2259r2305q3986
11008a04260O1210J17665K6895l9750J802p1832m9455l4330l588J8900N2381p417
10996c1779k7842k012R9127N5709n5447O944k8105l0437q2102J6855L1426J8433
10984b9230r784K3438n39k3816k4614k4057M4172K7954L9815N6401J4328J7501
10972A11569j9429l7520l4123k4432j0609k2146k9673n6940J8367k3874k4087
$$ plain form
10961 -152897 -76613 16107 -8586 -45985 -53388 -31612 -57487 -52792 8490 31359 23802 20381
10949 20381 7108 18796 4580 -29934 -87679 -54702 -63257 -37779 -30208 -51608 -49553 -109651
10937 -109651 -57898 12350 19887 43506 6715 -104936 -103105 -75283 -41588 -72619 -98428 -84924
10925 -84924 -115710 -102918 -68202 -45345 -2007 -16084 -51645 -61810 -40473 -33569 -37023 -10971
10913 -10971 -25537 -25993 -78404 -130412 -130724 -57090 -34733 -49763 -21931 -435 -9273 -688 20325
10900 20325 -7693 -46261 -39349 -99859 -117226 -108948 -85018 -96210 -95236 -71778 -104920 -80031
10888 -80031 -76610 -120923 -137608 -121194 -84450 -25498 39689 24653 -7314 -26305 -36336 -58796
10876 -58796 -49266 -39009 -31007 -80605 -96767 -34527 -14937 -27603 -33823 -60174 -20814 -10887
$$ packed form
10961a52897P6284R2720k4693l7399p403K1776k5875M695O1282K2869p557l421
10949B0381j3273J1688j4216l4514n7745L2977q555K5478P571k1400K055o0098
10937a09651N1753P0248P537K3619l6791j11651J831K7822L3695l1031k5809J3504
10925h4924l0786J2792L4716K2857M3338j4077l5561j0165K1337O904l454K6052
10913a0971j4566m56n2411n2008l12P3634K2357j5030K7832K1496q838Q585K1013
10900B0325k8018l8568O912o0510j7367Q278K3930j1192R74K3458l3142K4889
10888h0031L421m4313j6685J6414L6744N8952O5187j5036l1967j8991j0031k2460
10876e8796R530J0257Q002m9598j6162O2240J9590j2666o220k6351L9360R927
$$ plain form
10864 -10887 6186 43774 83842 80554 64649 -3781 -3785 64819 53477 48493 80957 20796 -5827
10851 -5827 20596 14498 61666 115344 119679 70479 73739 110256 62694 -9090 6472 49251
10839 49251 52109 71984 24319 -7957 35019 33533 27632 10073 -11652 -10856 26587 40426 -4063
10826 -4063 -48155 -22326 -12154 -54137 -77826 -92820 -32495 40149 42895 -23863 -81452 -104420
10814 -104420 -83636 -1236 78323 99355 98830 72369 26797 -1974 -14662 -2967 6638 -6847
10802 -6847 -23585 17098 28919 -3665 65789 55108 -17280 27281 57275 16352 -105 5490
10790 5490 29360 36701 5896 -13691 -78621 343 46860 1369 17629 54803 69246 35828
10778 35828 50827 51462 2544 4801 36988 74512 61619 50091 68212 10153 -7021 -31321
$$ packed form
10864a0887J7073L7588M0068l288j5905o8430mO8604j1342m984L2464o0161k6623
10851e827K6423o098M7168N3678M335m9200L260L6517m7562p1784J5562M2779
10839D9251K858J9875m7665l2276M2976j486n901j7559k1725P96L7443J3839m4489
10826d063m4092K5829J0172m1983k3689j4994O0325P2644K746o6758n7589k2968
10814a04420K0784Q2400P9559K1032n25k6461m5572k8771j2688J1695R605j3485
10802f847j6738M0683J1821l2584O9454j0681p2388M4561K9994m0923j6457N595
10790E490K3870P341l0805j9587o4930P8964M6517m5491J6260L7174J4443l3418
10778C5828J4999O35m8918K257L2187L7524j2893j1528J8121n8059j7174k4300
$$ plain form
10766 -31321 -37781 -79641 -74790 -78985 -87648 -45799 -20189 -46712 -31038 -100187 -127614 -104716
10754 -104716 -41669 -31476 9177 31541 27265 22248 36235 29344 17290 2942 24871 36265
10742 36265 14002 9362 23585 6060 32033 16133 -10278 2357 42336 96103 109512 -10471
10730 -10471 -63525 -42664 -40689 -52398 -79395 -51410 -6338 -13650 -33870 -62611 -66474 -18900
10718 -18900 52956 38204 -9112 35274 65420 73818 30104 -11494 61074 118227 86602 15096
10706 15096 -21971 -24937 -36191 15440 26954 14504 3864 38429 49285 -34794 -62136 -44115
10694 -44115 21643 48543 -744 -31713 34366 66244 20705 19447 -4208 -13050 -59162 -64171
10682 -64171 -31814 -10858 -56578 -2700 -6090 -55571 -119845 -91406 13979 49044 19853 -3726
$$ packed form
10766c1321o460m1860M851m195q663M1849K5610k6523J5674o9149k7427K2898
10754a04716O3047J0193M0653K2364m276n017J3987o891j2054j4348K1929J1394
10742C6265k2263m640J4223j7525K5973j5900k6411J2635L9979N3767J3409j19983
10730a0471n3054K0861J975j1709k6997K7985M5072p312k0220k8741l863M7574
10718a8900P1856j4752m7316M4386L0146Q398m3714m1598P2568N7153l1625p1506
10706A5096l7067k966j1254N1631J1514j2450j0640L4565J0856q4079k7342J8021
10694d4115O5758K6900m9287l0969O6079L1878m5539j258k3655q842m6112n009
10682f4171L2357K0956m5720N3878l390m9481o4274K8439J05385L5065k9191k3579
$$ plain form
10670 -3726 12763 -2461 -31152 12588 60291 73996 54804 28420 53765 93518 64612 65208
10658 65208 82486 52653 23610 56674 73169 84449 82202 36395 32626 -9143 16521 73680
10646 73680 71427 79733 72114 4516 -6423 22725 22142 28575 22680 7088 29069 367 -9987
10633 -9987 44504 49879 4045 -5307 -20838 -22286 -56248 -88388 -57991 -14573 9268 57537
10621 57537 102934 81262 35929 -9252 -78105 -66472 -12092 -23416 -35545 -27542 -43259 -27156
10609 -27156 -27025 -644 29492 46993 6927 -13661 10345 -44895 -34765 -29046 7515 68132
10597 68132 47994 20717 32485 41407 48409 31174 10093 31867 28382 28860 31005 54287 39770
10584 39770 -5683 3731 9442 59715 55514 -2316 -9430 45146 39629 38919 38485 45049 22043 57706
$$ packed form
10670c726J6489j5224k8691M3740M7703J3705j9192k6384K5345L9753k8906N96
10658F5208J7278k9833k9043L3064J6495J1280k247m5807l769m1769K5664N7159
10646G3680k253Q306p619o7598j0939K9148n83O433n895j5592K1981k8702j0354
10633i987N4491N375m5834r352j5531j448l3962l2140L0397M3418K3841M8269
10621E7537M5397k1672m5333m5181o8853J1633N4380j1324j2129Q003j5717J6103
10609b7156J31K6381L0136J7501m0066k0588K4006n5240J0130N719L6561O0617
10597F8132k0138k7277J1768Q922P002j7235k1081K1774l485M78K145K3282j4517
10584C9770m5453R414N711N0273m201n7830p114N4576n517p10m34O564k3006L5663
$$ plain form
10570 57706 70471 57157 63107 38625 9038 62566 99095 105200 72120 37510 48624 6809
10558 6809 28521 63883 10122 30450 46882 29073 2296 32984 54077 29153 -62606 -86192
10546 -86192 -68058 -6931 14884 32377 19167 10433 11554 -5380 27728 19044 15427 3028
10534 3028 -22105 -3539 53777 77462 65724 6360 33860 65868 76484 22151 -21210 -8019
10522 -8019 -8615 -17155 -69853 -5459 71978 84632 97475 36459 22880 55841 48659 3916 32117
10509 32117 100098 115022 58892 30331 -6202 -45384 -15043 -14953 13026 17321 39824 95250
10497 95250 59523 -40602 -69483 8119 107874 114901 59471 44442 23599 -9781 -28448 -21111
10485 -21111 -32250 -69968 -106610 -95528 -66401 -20132 2477 -37114 -99679 -114233 -123679 -102729
$$ packed form
10570E7706J2765j3314N950k4482k9587N3528L6529O105l3080l4610J1114m1815
10558F809K1712L5362n3761K0328J6432j7809k6777L0688K1093k4924r1759k3586
10546h6192J8134O1127K1815J7493j3210q734J121j6934L3108q684l617j2399
10534C028k5133J8566N7316K3685j1738n9364K7500L2008J0616n4333m3361J3191
10522h019n96q540n2698O4394P7437J2654J2843o1016j3579L2961p182m4743K8201
10509C2117O7981J4924n6130k8561l6533l9182L0341R0K7979M295K2503N5426
10497I5250l5727j00125k8881P7602R9755P027n5430j5029k0843l3380j8667P337
10485b1111j1139l7718l6642J1082K9127M6269K2609l9591o2565j4554r446K0950
$$ plain form
10473 -102729 -83676 -69907 -79905 -27079 41508 66150 85467 90741 111391 77316 34361 156
10461 156 25668 42480 45667 -29787 -65323 -34148 28865 47574 31019 17680 41088 73884
10449 73884 4846 -32581 -20674 -14352 -78781 -93881 -71229 -39033 -1928 79946 47541 -9718
10437 -9718 -14565 34959 78444 84794 73885 27720 54628 54368 25673 70396 107305 98740 85246
10424 85246 19356 12243 2245 5369 34904 45238 43548 21128 9601 -38262 -65124 2800
10412 2800 70053 111367 132855 109149 35106 5808 27619 15999 25691 18336 10743 73825
10400 73825 65047 19472 -14888 51699 53272 23678 17706 10450 -59302 -97609 -5509 60520
10388 60520 86899 114597 113012 60466 57539 -7437 -2393 40001 18583 57657 73979 87456
$$ packed form
10473a02729J9053J3769r998N2826O8587K4642J9317N274K0650l4075m2955l4205
10461A56K5512J6812L187p5454l5536L1175O3013J8709j6555j3339K3408L2796
10449G3884o9038l7427J1907O322o4429j5100K2652L2196L7105Q1874l2405n7259
10437i718m847M9524M3485O350j0909m6165K6908k60k8695M4723L6909q565j3494
10424H5246o5890p113r998L124K9535J0334j690k2420j1527m7863k6862O7924
10412B800O7253M1314K1488k3706p4043k9298K1811j1620R692p355p593O3082
10400G3825q778m5575l4360O6587J573k9594n972p256o9752l8307R2100O6029
10388F0520K6379K7698j585n2546k927o4976N044M2394k1418L9074J6322J3477
$$ plain form
10376 87456 107880 93319 103788 115683 129062 125068 179317 206237 153333 137795 132096 100260
10364 100260 54029 10918 13977 59502 81922 82867 55446 109246 171347 183510 190972 134853
10352 134853 68453 10982 -30449 -14269 7671 -31258 -100880 -31363 -28564 3831 78080 36694
10340 36694 66555 101543 104113 89860 13394 29326 -6935 17572 49571 15675 -19959 -26841
10328 -26841 -49721 -15799 -47040 -51739 -16929 50245 45069 13522 -1582 -16665 -65267 -76461
10316 -76461 -118996 -132179 -66773 -19069 -1838 36709 26927 20150 40820 48837 41757 68210
10304 68210 7918 -25856 15781 29516 -5528 -56854 -31374 29887 36216 40360 85709 112204
10292 112204 98734 47333 11031 -13335 -18301 18318 4768 18980 62354 94629 54468 46787
$$ packed form
10376H7456K0424j4561J0469J1895J3379l994N4249K6920n2904j5538n699l1836
10364A00260m6231m3111L059M5525K2420R45k7421N3800O2101J2163P462n6119
10352A34853o6400n7471m1431J6180K1940l8929o9622O9517K799L2395P4249m1386
10340C6694K9861L4988K570j4253p6466J5932l6261K4507L1999l3896l5634o882
10328b6841k2880L3922l1241m699L4810O7174n176l1547j5104j5083m8602j1194
10316g6461m2535j3183O5406M7704J7231L8547r782o777K0670Q017p080K6453
10304F8210o0292l3774M1637J3735l5044n1326K5480O1261O329M144M5349K6495
10292A12204j3470n1401l6302k4366m966L6619j3550J4212M3374L2275m0161p681
$$ plain form
10280 46787 90968 90499 73287 67817 60720 78196 101340 96993 84614 35715 29471 39468 32629
10267 32629 12656 29586 -14482 -64548 -27627 49782 97878 102934 68592 77823 55636 25213
10255 25213 50370 27956 -32117 -13092 6754 34016 71049 107709 105051 89341 -3412 -49712
10243 -49712 -58204 -21804 39275 29903 5436 18146 53068 88466 62810 59993 117624 79301
10231 79301 44861 40276 43391 -13814 -15352 -26205 -66992 -86401 -27672 26930 78984 99635
10219 99635 149439 208330 218005 211114 214073 180685 162651 196037 245336 392373 582748 736590
10207 736590 852218 993525 1113478 1213348 1272441 1222951 1173445 1131882 1011128 880622
10197 880622 744629 600931 438558 370093 308794 229164 151593 69522 94817 115868 126147
$$ packed form
10280D6787M4181m69j7212n470p097J7476K3144m347j2379m8899o244R997o839
10267C2629j9973J6930m4068n0066L6921P7409M8096N056l4342R231k2187l0423
10255B5213K5157k2414o0073J9025J9846K7262L7033L6660k658j5710r2753m6300
10243d9712q492L6400O1079r372k4467J2710L4922L5398k5656k817N7631l8323
10231G9301l4440m585L115n7205j538j0853m0787j9409N8729N4602N2054K0651
10219I9635M9804N8891R675o891K959l3388j8034L3386M9299J47037J90375J53842
10207G36590J15628J41307J19953R9870N9093m9490m9506m1563j20754j30506
10197H80622j35993j43698j62373o8465o1299p9630p7571q2071K5295K1051J0279
$$ plain form
10186 126147 153924 129058 114020 94611 127510 100953 59105 30993 29502 26166 37888 39152
10174 39152 34023 52380 55907 20013 21954 1253 -42875 -44145 -31304 19636 77975 89948
10162 89948 126285 125094 125106 131968 125309 132723 91011 25458 54905 31178 -24973 -9788 -48565
10149 -48565 -64032 -38873 -10965 7735 -4861 26127 43996 98231 96927 82414 81948 -8236
10137 -8236 -17018 -25515 6128 -8253 -16286 46603 87580 68874 77615 102436 131425 146288 159294
10124 159294 137260 140095 115906 73366 89575 102768 102773 87741 29709 66084 99257 37904
10112 37904 31638 66297 56182 21229 52925 110416 101422 117295 146344 158200 126512 110024
10100 110024 86918 65433 36712 58981 63494 48548 83179 111656 105150 96804 45743 4059
$$ packed form
10186A26147K7777k4866j5038j9409L2899k6557m1848k8112j491l336J1722J264
10174C9152n129J8357L527l5894J941k0701m4128j270J2841N0940N8339J1973
10162H9948L6337j191J2O862o659P414m1712o5553K9447k3727n6151J5185l8777
10149d8565j5467K5159K7908J8700j2596L0988J7869N4235j304j4513m66r0184
10137h236q782q497L1643j4381q033O2889M0977j8706Q741K4821K8989J4863J3006
10124A59294k2034K835k4189m2540J6209J3193Nj5032n8032L6375L3173o1353
10112C7904o266L4659j0115l4953L1696N7491q994J5873K9049J1856l1688j6488
10100A10024k3106k1485k8721K2269M513j4946L4631K8477o506q346n1061m1684
$$ plain form
10088 4059 5613 -5365 17243 59224 89944 114132 137435 127339 173338 172113 136461 94167
10076 94167 70498 102627 95669 65353 91490 89849 90473 154667 141782 73344 21232 26455 35162
10063 35162 43014 20712 -11680 -11175 36999 16113 -15611 23004 81074 103318 37554 79226
10051 79226 107585 36484 -9593 -43200 -35349 -28697 14016 61367 71427 33018 10305 15149
10039 15149 19344 42110 60626 80607 88903 82333 56850 69557 71859 64380 76366 83032 40891
10026 40891 49918 86666 98852 84971 89056 106237 117980 171147 156580 103726 80367 89043
10014 89043 46948 21422 43252 61062 114031 136189 157333 130594 73454 51486 71453 92104
10002 92104 132791 135561 106349 88686 97617 101572 110433 69819 -15565 17118 83720 100335
$$ packed form
10088D059J554j0978K2608M1981L0720K4188K3303j0096M5999j225l5652m2294
10076I4167k3669L2129o958l0316K6137j641O24O4194j2885o8438n2112N223Q707
10063C5162P852k2302l2392N05M8174k0886l1724L8615N8070K2244o5764M1672
10051G9226K8359p1101m6077l3607P851O652M2713M7351J0060l8409k2713M844
10039A5149M195K2766J8516J9981Q296o570k5483J2707K302p479J1986O666m2141
10026D0891R027L6748J2186j3881M085J7181J1743N3167j4567n2854k3359Q676
10014H9043m2095k5526K1830J7810N2969K2158K1144k6739n7140k1968J9967K0651
10002I2104M0687K770k9212j7663Q931L955Q861m0614q5384L2683O6602J6615
$$ plain form
9990 100335 146093 168709 117786 34153 45238 59019 72243 61584 14960 29190 93211 130273
9978 130273 119454 114038 112983 75050 37176 53515 67826 109498 130385 119680 121702 127336
9966 127336 128484 149319 216503 198923 150129 97997 50265 29124 56896 81429 98169 110162
9954 110162 91786 66503 119910 194872 163138 84671 56530 45580 76107 69004 17765 -2440
9942 -2440 27592 55381 69204 89167 41701 5938 1977 57006 96642 91083 9474 9575 38212
9929 38212 90133 79335 65522 53628 98219 130668 168446 197536 206903 222570 199234 177297
9917 177297 186054 219487 216380 142626 105845 42105 27347 -18447 -59225 -18164 51546 148502
9905 148502 106723 62773 45262 32519 40582 52700 83763 103445 102868 20667 38653 28664
$$ packed form
9990A00335M5758K2616n0923q3633J1085J3781J3224j0659m6624J4230O4021L7062
9978A30273j0819n416j055l7933l7874J6339J4311M1672K0887j0705K022N634
9966A27336J148K0835O7184j7580m8794n2132m7732k1141K7772K4533J6740J1993
9954A10162j8376k5283N3407P4962l1734p8467k8141j0950L0527p103n1239k0205
9942b440L0032K7789J3823J9963m7466l5763l961N5029L9636n559q1609J01K8637
9929C8212N1921j0798j3813j1894M4591L2449L7778K9090R367J5667k3336k1937
9917A77297Q757L3433l107p3754l6781o3740j4758m5794m0778M1061O9710R6956
9905A48502m1779m3950j7511j2743Q063J2118L1063J9682n77q2201J7986r989
$$ plain form
9893 28664 -6642 29559 -2416 -16739 59620 115907 76584 43717 39534 80605 85503 19355
9881 19355 56574 55928 76964 80788 19958 -13192 18551 72237 62058 21908 -1632 29309
9869 29309 13207 87270 111519 98892 62993 39192 69081 8456 -32517 -21271 -32587 -13842
9857 -13842 34334 60219 30689 -5370 36943 113635 145280 167786 203065 170939 85034 22498
9845 22498 -3502 37452 105148 126459 74813 17207 -1175 -1320 2125 28223 52480 83317
9833 83317 135795 124742 132953 144524 111577 85226 146085 164868 137080 68710 15262 22543
9821 22543 60400 82552 83035 72315 55396 -11845 -27519 -44999 -130363 -71269 63023 126445
9809 126445 90163 61554 84142 35737 64926 103484 55377 43470 50410 60324 47957 5064
$$ packed form
9893B8664l5306L6201l1975j4323P6359N6287l9323l2867m183M1071M898o6148
9881A9355L7219o46K1036L824o0830l3150L1743N3686j0179m0150k3540L0941
9869B9309j6102P4063K4249j2627l5899k3801K9889o0625m0973J1246j1316J8745
9857a3842M8176K5885k9530l6059M2313P6692L1645K2506L5279l2126q5905o2536
9845B2498k6000M0954O7696K1311n1646n7606j8382j45L445K6098K4257L0837
9833H3317N2478j1053Q211J1571l2947k6351O0859J8783k7788o8370n3448P281
9821B2543L7857K2152M83j0720j6919o7241j5674j7480q5364N9094J34292O3422
9809A26445l6282k8609K2588m8405K9189L8558m8107j1907O940R914j2367m2893
$$ plain form
9797 5064 19162 41907 61493 118143 92349 53456 68065 86152 93283 97074 78665 34552
9785 34552 64083 60896 16114 57078 32634 73531 61362 78189 70669 38415 48877 73674
9773 73674 120287 142824 113691 54405 81586 106800 47327 35144 87957 136049 158958 167719
9761 167719 144307 130149 114490 75918 76987 96578 93099 185901 243748 230130 131155 95082
9749 95082 129048 119271 100685 107921 71659 80177 104574 157906 174969 159979 147118 155822 118615
9736 118615 88429 73810 49089 21989 47880 68712 90242 143651 146183 131194 89107 85307
9724 85307 108982 56781 62676 88712 103864 51509 104133 138499 120651 128847 129925 85652
9712 85652 94033 152360 139512 119288 88838 135175 144097 131952 146203 81891 35417 59932
$$ packed form
9797E064J4098K2745J9586N6650k5794l8893J4609J8087P131L791j8409m4113
9785C4552K9531l187m4782M0964k4444M0897j2169J6827p520l2254J0462K4797
9773G3674M6613K2537k9133n9286K7181K5214n9473j2183N2813M8092K2909Q761
9761A67719k3412j4158j5659l8572J069J9591l479R2802N7847j3618r8975l6073
9749I5082L3966r777j8586P236l6262Q518K4397N3332J7063j4990j2861Q704l7207
9736A18615l0186j4619k4721k7100K5891K0832K1530N3409K532j4989m2087l800
9724H5307K3675n2201N895K6036J5152n2355N2624L4366j7848Q196J078m4273
9712H5652Q381N8327j2848k0224l0450M6337Q922j2145J4251o4312m6474K4515
$$ plain form
9700 59932 61603 10114 -17751 23929 41967 17955 7215 40515 543 -641 2890 45086
9688 45086 76180 60979 14582 -13919 85957 89851 68369 14175 69944 68752 47926 58476
9676 58476 81493 100176 81697 82878 177590 144643 106581 139754 180061 183058 109325 36393
9664 36393 46670 83148 79195 12535 49036 117499 130405 105999 74755 116667 96030 77635
9652 77635 159818 140292 99685 132458 134038 134827 155965 135060 92379 84715 75291 19703 -74
9639 -74 61851 96269 63834 17546 57012 133861 131626 117201 54483 11742 54054 81305 174085
9626 174085 176670 74347 79289 100197 74232 119448 145980 141269 160880 101994 111856 159674
9614 159674 155076 158992 175903 172028 163626 106178 89272 93779 107791 129265 143209 159235 153994
$$ packed form
9700E9932J671n1489k7865M1680J8038k4012j0740L3300l9972j184L531M2196
9688D5086L1094j5201m6397k8501R9876L894k1482n4194N5769j192k0826J0550
9676E8476K3017J8683j8479J181R4712l2947l8062L3173M0307K997p3733p2932
9664C6393J0277L6478l953o6660L6501O8463J2906k4406l1244M1912k0637j8395
9652G7635Q2183j9526m0607L2773J580P89K1138k0905m2681p664r424n5588j9777
9639g4O1925L4418l2435m6288L9466P6849k235j4425o2718m2741M2312K7251R2780
9626A74085K585j02323M942K0908k5965M5216K6532m711J9611n8886R862M7818
9614A59674m598L916J6911l875q402n7448j6906M507J4012K1474J3944J6026n241
$$ plain form
9601 153994 152047 108430 116907 180967 199375 264142 244182 180601 124967 152256 152135 168043
9589 168043 167540 220469 273509 199071 95153 95548 124049 128968 135421 175693 154178 183342 195130
9576 195130 217727 234025 243611 218290 162412 90159 60277 38832 55367 54821 59685 71462
9564 71462 115385 134197 137165 108604 143222 134713 203218 225814 195848 200788 233301 233056 220363
9551 220363 241695 227326 214417 199991 199697 246919 262087 218719 238912 239286 239013 259249 338253
9538 338253 401207 427930 362551 339541 303781 290924 253475 261530 235331 244949 249933 250149 261487
9525 261487 275854 252783 245363 256100 208500 254972 243235 198823 173903 163836 151833 154808
9513 154808 138872 171534 181743 204297 251559 213198 218651 204436 175902 225409 258036 258890
$$ packed form
9601A53994j947m3617Q477O4060J8408O4767j9960o3581n5634K7289j21J5908
9589A68043n03N2929N3040p4438j03918L95K8501M919O453M0272k1515K9164J1788
9576A95130K2597J6298R586k5321n5878p2253k9882k1445J6535n46M864J1777
9564G1462M3923J8812K968k8561L4618q509O8505K2596k9966M940L2513k45j2693
9551B20363K1332j4369j2909j4426k94M7222J5168m3368K0193L74k73K0236P9004
9538C38253O2954K6723o5379k3010l5760j2857l7449Q055k6199R618M984K16J1338
9525B61487J4367k3071p420J0737m7600M6472j1737m4412k4920j0067j2003K975
9513A54808j5936L2662J0209K2554M7262l8361N453j4215k8534M9507L2627Q54
$$ plain form
9501 258890 187678 158995 154576 176145 162167 201312 265000 263516 237436 247773 257549 280000
9489 280000 287804 214181 186723 229605 184684 145567 116470 157453 195445 258291 252604 215901
9477 215901 234945 244350 226367 205751 190075 250750 265151 194447 208338 260844 233712 213006
9465 213006 196418 218402 190539 206785 229656 261161 210237 190888 226509 235260 305728 293774
9453 293774 227638 253894 274755 229673 229442 251950 270138 232212 183541 171115 184404 173966
9441 173966 177482 222408 295736 315800 325945 312293 297813 251917 232171 212991 245834 258458
9429 258458 236229 191316 248050 257329 230501 174609 143237 240479 328934 320319 269922 249480
9417 249480 229761 168721 161102 238996 294541 280780 247124 231818 253466 288977 250069 231234
$$ packed form
9501B58890p1212k8683m419K1569j3978L9145O3688j484k6080J0337R776K2451
9489B80000P804p3623k7458M2882m4921l9117k9097M0983L7992O2846n687l6703
9477B15901J9044R405j7983k0616j5676O0675J4401p0704J3891N2506k7132k0706
9465B13006j6588K1984k7863J6246K2871L1505n0924j9349L5621Q751P0468j1954
9453B93774o6136K6256K0861m5082k31K2508J8188l7926m8671j2426J3289j0438
9441A73966L516M4926P3328K0064J0145j3652j4480m5896j9746j9180L2843J2624
9429B58458k2229m4913N6734R279k6828n5892l1372R7242Q8455q615n0397k0442
9417B49480j9719o1040p619P7894N5545j3761l3656j5306K1648L5511l8908j8835
$$ plain form
9405 231234 275623 332913 339780 364570 338409 279263 223354 284741 337451 332412 317895 367331
9393 367331 327819 285618 271705 243871 223473 215262 188072 237383 264291 298722 336526 341938
9381 341938 296465 315789 327126 263165 231085 204044 220067 257912 325012 323003 330410 391605
9369 391605 423135 465461 423606 375992 317467 343295 375439 368992 376400 384167 381324 325830
9357 325830 324671 321266 312734 339421 369546 347365 307800 316605 320965 327776 309349 269199 326076
9344 326076 374626 368160 357100 429719 429119 423711 429609 375443 343769 347854 302495 291130 313733
9331 313733 343254 369886 377597 392595 408649 397652 406458 405197 439416 466321 466537 445652 446402
9318 446402 462995 514985 544255 478753 464871 456014 447882 409759 426702 433017 396077 427189
$$ packed form
9405B31234M4389N7290O867K4790k6161n9146n5909O1387N2710n039j4517M9436
9393C67331l9512m2201j3913k7834k0398q211k7190M9311K6908L4431L7804N412
9381C41938m5473J9324J1337o3961l2080k7041J6023L7845O7100k009P407O1195
9369C91605L1530M2326m1855m7614n8525K5828L2144o447P408P767k843n5494
9357C25830j159l405q532K6687L0125k2181l9565Q805M360O811j8427m0150N6877
9344C26076M8550o466j1060P2619o00n408N898n4166l1674M085m5359j1365K2603
9331C13733K9521K6632P711J4998J6054j0997Q806j261L4219K6905K16k0885P50
9318D46402J6593N1990K9270o5502j3882q857q132l8123J6943O315l6940L1112
$$ plain form
9306 427189 428926 461592 509115 461638 436273 414418 450246 504872 544178 578864 609052 589740
9294 589740 518288 539449 549104 516437 521222 533320 502058 531419 555742 577087 570541 540700
9282 540700 507868 554032 611639 668990 680507 575859 542129 497239 511175 527937 568853
9271 568853 603829 624376 587820 574972 623403 614647 622742 681620 702695 760486 900844 926717
9259 926717 901766 871157 858809 776767 703578 681376 669145 663463 690760 714117 658283 606716
9247 606716 593598 584020 589024 588665 620710 721399 737282 695959 724496 701896 732848 772530
9235 772530 796302 757382 734780 728318 689889 676450 692267 687774 715027 655474 682400 780928
9223 780928 832746 887822 837795 744350 736939 745382 797653 809252 784090 796058 783164 755817
$$ packed form
9306D27189J737L2666M7523m7477k5365k1855L5828N4626L9306L4686L0188j9312
9294E89740p1452K1161R655l2667M785J2098l1262K9361K4323K1345o546k9841
9282E40700l2832M6164N7607N7351J1517j04648l3730m4890J3936J6762M0916
9271E68853L4976K0547l6556j2848M8431q756Q095N8878K1075N7791J40358K5873
9259I26717k4951l0609j2348q2042p3189k2202j2231n682K7297K3357n5834n1567
9247F06716j3118r578N004l59L2045J00689J5883m1323K8537k2600L0952L9682
9235G72530K3772l8920k2602o462l8429j3439J5817m493K7253n9553K6926R8528
9223G80928N1818N5076n0027r3445p411Q443N2271J1599k5162J1968j2894k7347
$$ plain form
9211 755817 730944 731487 731513 760572 779637 850478 901131 936601 959228 925170 887530 885382 835468
9198 835468 830145 814825 807141 860447 895820 896078 951835 961057 961356 932210 941291 963388 976826
9185 976826 1002892 1007543 1017574 1029291 1032565 993372 954452 1011460 1046396 1022525 1023121 1043282
9173 1043282 1077647 1061600 1050778 1047194 1057154 1072430 1026972 959730 985080 1011247 1061823 1123340
9161 1123340 1162520 1162017 1163707 1177359 1177993 1196232 1204572 1171519 1187518 1163394 1187561 1181965 1144655
9148 1144655 1166119 1196432 1231849 1227634 1313528 1351751 1372094 1379747 1369602 1358823 1319976 1270830
9136 1270830 1307049 1349280 1354607 1341178 1363527 1416286 1418487 1427357 1456190 1523384 1543484 1519880
9124 1519880 1537010 1562443 1595793 1594192 1599705 1655074 1645210 1662806 1714742 1703946 1687862 1685620
$$ packed form
9211G55817k4873N43K6K9059J9065P0841N0653L5470K2627l4058l7640k148m9914
9198H35468n323j5320p684N3306L5373K58N5757R222K99k9146R081K2097J3438
9185I76826K6066M651J0031J1717L274l9193l8920N7008L4936k3871N96K0161
9173A043282L4365j6047j0822l584R960J5276m5458o7242K5350K6167N0576O1517
9161A123340L9180n03J690J3652O34J8239Q340l3053J5999k4124K4167n596l7310
9148A144655K1464L0313L5417m215Q5894L8223K0343P653j0145j0779l8847m9146
9136A270830L6219M2231N327j3429K2349N2759K201Q870K8833O7194K0100k3604
9124A519880J7130K5433L3350j601N513N5369r864J7596N1936j0796j6084k242
$$ plain form
9112 1685620 1729699 1760760 1760024 1788630 1839815 1836165 1838766 1821591 1861342 1918344 1958307 1963692
9100 1963692 1995077 2029099 1990530 1973371 1992515 2006183 2027817 2080018 2124670 2124362 2119288 2170064
9088 2170064 2195198 2153321 2195923 2243876 2267132 2320928 2457897 2512827 2529711 2432348 2418999
9077 2418999 2480461 2537022 2574794 2653802 2729707 2747306 2793535 2848405 2856162 2863357 2951739 3037280
9065 3037280 3048886 2994641 3047008 3159758 3227128 3291722 3362107 3425866 3427585 3435937 3494406 3572867
9053 3572867 3616259 3646155 3701690 3804745 3876088 3970451 4007960 4011662 4072053 4180932 4285542
9042 4285542 4286137 4254845 4317180 4383273 4483545 4560669 4623040 4740503 4854408 4943978 5084621
9031 5084621 5130194 5178733 5192411 5291023 5446396 5517220 5583527 5625659 5722059 5823463 5993963
$$ packed form
9112A685620M4079L1061p36K8606N1185l650K601j7175L9751N7002L9963N385
9100A963692L1385L4022l8569j7159J9144J3668K1634N2201M4652l08n074N0776
9088B170064K5134m1877M2602M7953K3256N3796J36969N4930J6884r7363j3349
9077B418999O1462N6561L7772P9008P5905J7599M6229N4870P757P195Q8382Q5541
9065C037280J1606n4245N2367J12750O7370O4594P0385O3759J719Q352N8469P8461
9053C572867M3392K9896N5535J03055P1343R4363L7509L702O0391J08879J04610
9042D285542N95l1292O2335O6093J00272P7124O2371J17463J13905Q9570J40643
9031E084621M5573M8539J3678R8612J55373P0824O6307M2132R6400J01404J70500
$$ plain form
9020 5993963 6107471 6191235 6385337 6504587 6588708 6736970 6827861 6891388 6984692 7156014
9010 7156014 7339688 7462547 7607930 7838764 7973031 8172409 8382003 8575227 8693021 8838591
9000 8838591 9010615 9239682 9482447 9741806 9956828 10189590 10399595 10575326 10809073 11123771
8990 11123771 11457925 11737356 12007415 12352042 12675255 12983459 13359293 13689102 14029854
8981 14029854 14390932 14752173 15136403 15539622 15973800 16425395 16944235 17420508 17897078
8972 17897078 18394464 18931472 19431123 19943627 20491560 21130826 21748191 22406571 23141865
8963 23141865 23874316 24619154 25403237 26179327 26925890 27717680 28558220 29449542 30391329
8954 30391329 31370178 32301045 33290991 34205580 35194840 36250857 37294806 38362001 39454406
$$ packed form
9020E993963J13508Q3764J94102J19250Q4121J48262R0891O3527R3304J71322
9010G156014J83674J22859J45383K30834J34267J99378K09594J93224J17794J45570
9000H838591J72024K29067K42765K59359K15022K32762K10005J75731K33747L14698
8990A1123771L34154K79431K70059L44627L23213L08204L75834L29809L40752
8981A4029854L61078L61241L84230M03219M34178M51595N18840M76273M76570
8972A7897078M97386N37008M99651N12504N47933O39266O17365O58380P35294
8963B3141865P32451P44838P84083P76090P46563P91790Q40540Q91322R41787
8954C0391329R78849R30867R89946R14589R89260J056017J043949J067195J092405
$$ plain form
8945 39454406 40535429 41591131 42537239 43514429 44538830 45521793 46448551 47357101 48303676
8936 48303676 49174720 49960990 50641039 51294941 51911627 52420458 52874981 53182250 53403166
8927 53403166 53534544 53522294 53414604 53257340 52970342 52570048 52155444 51584522 50995125 50317939
8917 50317939 49572191 48784424 47928800 47045797 46080738 45078343 44123316 43081361 41971272
8908 41971272 40862177 39833434 38837271 37788135 36679484 35605989 34615436 33614786
8900 33614786 32703673 31732571 30740853 29794401 28878375 28036378 27237047 26445191 25693834
8891 25693834 24961038 24288702 23674343 22974236 22290049 21718625 21124626 20579655 20005913
8882 20005913 19465601 19029793 18617938 18224633 17937036 17845358 18053673 18721408 19927721
$$ packed form
8945C9454406J081023J055702R46108R77190J024401R82963R26758R08550R46575
8936D8303676Q71044P86270O80049O53902O16686N08831M54523L07269K20916
8927E3403166J31378j2250j07690j57264k86998m00294m14604n70922n89397o77186
8917E0317939p45748p87767q55624q83003r65059j002395r55027j041955j110089
8908D1971272j109095j028743r96163j049136j108651j073495r90553j000650
8900C3614786r11113r71102r91718r46452r16026q41997p99331p91856p51357
8891B5693834p32796o72336o14359p00107o84187n71424n93999n44971n73742
8882B0005913n40312m35808m11855l93305k87597r1678K08315O67735J206313
$$ plain form
8873 19927721 21514860 22841255 23343432 22933555 21594962 19732583 17846307 16281766
8865 16281766 14952226 13874327 12966691 12199272 11652974 11220717 10892782 10551738 10154438
8856 10154438 9821910 9557712 9299593 9018419 8758760 8518816 8343630 8127387 7894716
8847 7894716 7703981 7586411 7416393 7253597 7044091 6896867 6734309 6605284 6491703 6372386
8837 6372386 6266486 6134164 5994941 5853773 5746305 5640097 5537750 5449844 5357748 5232337
8827 5232337 5123882 5013465 4884826 4762542 4686969 4596630 4494176 4405224 4359736 4306332
8817 4306332 4256084 4195064 4162299 4124618 4075525 3990298 3927622 3878558 3800633 3751662 3699702
8806 3699702 3592754 3488475 3456508 3427964 3372115 3349183 3344412 3280631 3244913 3139301 3036305
$$ packed form
8873A9927721J587139J326395N02177m09877j338593j862379j886276j564541
8865A6281766j329540j077899r07636p67419n46298m32257l27935l41044l97300
8856A0154438l32528k64198k58119k81174k59659k39944j75186k16243k32671
8847G894716j90735j17570j70018j62796k09506j47224j62558j29025j13581j19317
8837F372386j05900j32322j39223j41168j07468j06208j02347q7906r2096j25411
8827E232337j08455j10417j28639j22284p5573r0339j02454q8952m5488n3404
8817D306332n0248o1020l2765l7681m9093q5227o2676m9064p7925m8971n1960
8806C699702j06948j04279l1967k8544n5849k2932m771o3781l5718j05612j02996
$$ plain form
8795 3036305 2967019 2934179 2909799 2907737 2895506 2897620 2859850 2802921 2753405 2746329 2766454 2729515
8783 2729515 2696896 2660354 2627864 2519450 2424098 2422868 2449944 2415435 2347861 2374778 2346634
8772 2346634 2282038 2286582 2241607 2125390 2095335 2084272 2030894 2020081 1992717 1962532 1941026
8761 1941026 1908723 1900564 1913702 1866613 1846755 1852984 1848425 1812473 1803184 1755825 1747098 1785310
8749 1785310 1725604 1661991 1648476 1614208 1601998 1548606 1491074 1510621 1560305 1523493 1461236
8738 1461236 1434399 1405647 1456765 1554396 1568165 1567197 1532196 1441443 1370415 1345113 1358613 1362833
8726 1362833 1331968 1311606 1355718 1345350 1291796 1285078 1296032 1288626 1282168 1243063 1194802 1166726
8714 1166726 1164688 1179108 1148066 1114617 1054885 1019800 1005276 1017338 1051149 1094299 1098430 1115615
$$ packed form
8795C036305o9286l2840k4380k062j2231K114l7770n6929m9516p076K0125l6939
8783B729515l2619l6542l2490j08414r5352j230K7076l4509o7574K6917k8144
8772B346634o4596M544m4975j16217l0055j1063n3378j0813k7364l0185k1506
8761A941026l2303q159J3138m7089j9858O229m559l5952r289m7359q727L8212
8749A785310n9706o3613j3515l4268j2210n3392n7532J9547M9684l6812o2257
8738A461236k6837k8752N1118R7631J3769r68l5001r0753p1028k5302J3500M220
8726A362833l0865k0362M4112j0368n3554o718J0954p406o458l9105m8261k8076
8714A166726k038J4420l1042l3449n9732l5085j4524J2062L3811M3150M131J7185
$$ plain form
8702 1115615 1135300 1094554 1085623 1057841 1022443 1000892 964503 958071 955923 963493 1055054 1097730
8690 1097730 1057599 1020566 1011896 982067 950967 934434 946845 900984 857992 787659 790830 859045
8678 859045 879933 893231 858236 837332 901931 963687 1002207 951580 852170 754423 784677 831561
8666 831561 880445 888000 843802 837475 804426 779005 771447 778243 839763 804396 776597 756959
8654 756959 757786 731540 749042 773111 817286 788588 737597 770130 731011 689490 730429 774031
8642 774031 814856 819837 837093 871560 848701 783950 724608 612161 595533 687097 728874 671624
8630 671624 649520 594895 596371 645328 647479 634447 624779 574250 640437 658032 621399 580703
8618 580703 668383 746741 690760 655168 621495 572029 566585 616780 684251 680709 632845 619440
$$ packed form
8702A115615J9685m0746q931k7782l5398k1551l6389o432k148P570R1561M2676
8690A097730m0131l7033q670k9829l1100j6533J2411m5861m2992p0333L171O8215
8678H59045K0888J3298l4995k0904O4599O1756L8520n0627r9410r7747L0254M6884
8666H31561M8884P555m4198o327l3049k5421p558O796O1520l5367k7799j9638
8654G56959Q27k6246J7502K4069M4175k8698n0991L2533l9119m1521M0939M3602
8642G74031M0825M981J7256L4467k2859o4751n9342j12447j6628R1564M1777n7250
8630F71624k2104n4625J476M8957K151j3032r668n0529O6187J7595l6633m0696
8618E80703Q7680P8358n5981l5592l3673m9466n444N0195O7471l542m7864j3405
$$ plain form
8606 619440 620131 622950 600933 557377 520725 579524 592185 574915 555830 533341 568458 601109
8594 601109 623210 625817 660249 677012 679278 723992 711804 704448 623596 547592 546776 573167 563692
8581 563692 616463 647915 601384 543519 496640 462140 405902 344235 337589 302002 312478 350330
8569 350330 372573 388181 424661 396695 403286 434242 468887 485669 409142 351249 377788 392519
8557 392519 383506 392860 384218 382516 381463 387389 454813 431025 338121 334218 361820 370695 357346
8544 357346 365349 339893 451838 513132 468712 409250 390077 361327 330745 290570 276470 248687
8532 248687 266638 305183 334963 307764 245337 256032 292037 287086 326919 345495 304344 309510
8520 309510 335302 321421 316916 322991 343833 313532 257988 201871 203126 216298 212329 245294
$$ packed form
8606F19440O91K819k2017m3556l6652N8799J2661j7270j9085k2489L5117L2651
8594F01109K2101K607L4432J6763K266M4714j2188p356q0852p6004q16K6391r475
8581E63692N2771L1452m6531n7865m6879l4500n6238o1667o646l5587J0476L7852
8569C50330K2243J5608L6480k7966O591L0956L4645J6782p6527n7893K6539J4731
8557C92519r013R354q642j702j053N926O7424k3788r2904l903K7602Q875j3349
8544C57346Q003k5456J11945O1294m4420n9462j9173k8750l0582m0175j4100k7783
8532B48687J7951L8545K9780k7199o2427J0695L6005m951L9833J8576m1151N166
8520C09510K5792j3881m505O075K0842l0301n5544n6117J255J3172l969L2965
$$ plain form
8508 245294 276346 303295 326144 326083 300329 321730 330854 347860 365815 347572 328153 337297 276873
8495 276873 256217 258403 255749 293222 334908 305287 271839 261622 287372 269432 253250 220698
8483 220698 232706 244622 231633 248746 303196 314467 290375 294899 307084 267944 265240 224603
8471 224603 246382 263588 252628 264614 302296 305051 263581 257057 255151 207634 184094 130709
8459 130709 157537 194512 280514 279620 182369 226136 234217 209146 189629 194204 222542 155741
8447 155741 120279 145758 148364 183251 232100 189549 168282 167908 198049 217452 203109 224056
8435 224056 231444 242504 220016 183941 210596 284668 324059 321063 332078 313367 259511 205439
8423 205439 182857 201347 151684 170615 227750 278653 278170 283280 259534 245698 226968 159459
$$ packed form
8508B45294L1052K6949K2849o1k5754K1401R124J7006J7955j8243j9419R144o0424
8495B76873k0656K186k654L7473M1686k9621l3448j0217K5750j7940j6182l2552
8483B20698J2008J1916j2989J7113N4450J1271k4092M524J2185l9140k704m0637
8471B24603K1779J7206j0960J1986L7682K755m1470o524j906m7517k3540n3385
8459A30709K6828L6975Q6002q94r7251M3767Q081k5071j9517M575K8338o6801
8447A55741l5462K5479K606L4887M8849m2551k1267l74L0141J9403j4343K0947
8435B24056P388J1060k2488l6075K6655P4072L9391k996J1015j8711n3856n4072
8423B05439k2582J8490m9663J8931N7135N0903m83N110k3746j3836j8730o7509
$$ plain form
8411 159459 134267 168120 171920 189932 176833 215466 227724 261207 205901 141233 73029 39099
8399 39099 75279 96322 56141 46255 92369 141192 207138 260978 317264 329216 266032 224215
8387 224215 194705 178856 216447 281000 302889 254149 238334 222927 165021 87717 130125 166196
8375 166196 181947 127142 114356 160119 131151 96492 143213 110953 84251 139228 173842 173445
8363 173445 121844 75909 90805 164712 223048 231640 172702 177325 231812 276447 266666 226071
8351 226071 220291 228842 211535 176164 172150 198917 225912 203783 234322 269988 243343 215577
8339 215577 208788 224171 193952 214991 242088 271293 221702 151372 102005 123377 119652 130895
8327 130895 155819 124143 142018 169138 159090 100150 46708 83645 141328 180958 156265 127575
$$ packed form
8411A59459k5192L3853L800J8012j3099L8633J2258L3483n5306o4668o8204l3930
8399C9099L6180K1043m0181r886M6114M8823O5946N3840N6286J1952o3184m1817
8387B24215k9510j5849L7591O4553K1889m8740j5815j5407n7906p7304M2408L6071
8375A66196J5751n4805j2786M5763k8968l4659M6721l2260k6702N4977L4614l97
8363A73445n1601m5935J4896P3907N8336Q592n8938M623N4487M4635r781m0595
8351B26071n780Q551j7307l5371m014K6767K6995k2129L0539L5666k6645k7766
8339B15577o789J5383l0219K1039K7097K9205m9591p0330m9367K1372l725J1243
8327A30895K4924l1676J7875K7120j0048n8940n3442L6937N7683L9630k4693k8690
$$ plain form
8315 127575 64394 39074 79461 106282 103193 101464 88894 105400 135240 148379 146457 124698
8303 124698 85482 96249 84200 88350 84743 82136 76419 44078 38029 75333 69523 77051 82502
8290 82502 64561 105033 107185 138210 133519 101156 129514 97719 115469 82102 61964 54428
8278 54428 11282 37610 97014 89371 62225 46156 34694 21800 1234 31374 17500 4360
8266 4360 60236 98041 45473 18493 12094 8739 35760 30841 30570 16133 76824 60488 27830
8253 27830 25423 72979 63490 58302 121550 197146 186961 138949 63326 55395 100085 122582 176576
8240 176576 160081 152642 120158 75833 64117 82788 97276 107446 106000 100306 70691 33074
8228 33074 49149 65878 44953 41002 50209 69884 81959 96679 75203 58677 34309 53526
$$ packed form
8315A27575o3181k5320M0387K6821l089j729j2570J6506K9840J3139j922k1759
8303A24698l9216J0767j2049M150l607k607n717l2341o049L7304n810P528N451
8290H2502j7941M0472K152L1025m691l2363K8358l1795J7750l3367k0138p536
8278E4428m3146K6328N9404p643k7146j6069j1462j2894k0566L0140j3874j3140
8266D360N5876L7805n2568k6980o399l355K7021m919k71j4437O0691j6336l2658
8253B7830k407M7556r489n188O3248P5596j0185m8012p5623p931M4690K2497N3994
8240A76576j6495p439l2484m4325j1716J8671J4488J0170j446n694k9615l7617
8228C3074J6075J6729k0925l951R207J9675J2075J4720k1476j6526k4368J9217
$$ plain form
8216 53526 122771 173245 145273 102569 128523 127476 122566 126349 48797 -24834 -11229 26021
8204 26021 51861 65651 58518 88201 58344 -14034 -9837 19710 10448 35471 66452 93759
8192 93759 62508 25341 3706 33995 76027 107014 74600 31879 52591 50291 18879 50507
8180 50507 46170 9079 12629 -13311 -33976 -27909 -45099 -58670 -2772 42006 61097 33947
8168 33947 -17700 29250 96530 83490 61382 66878 102123 107988 57448 -10038 -17152 41622
8156 41622 140006 191697 253042 183703 92136 114045 98116 61987 89784 134506 107902 67646
8144 67646 31082 10374 81284 90858 91248 72721 -6809 -11082 35768 59535 55300 10788 -12134
8131 -12134 19111 46074 27470 39380 35160 42529 51609 38212 39400 62643 94818 56259 9034
$$ packed form
8216E3526O9245N0474k7972m2704K5954j047m910L783p7552p3631J3605L7250
8204B6021K5840J3790p133K9683k9857p2378M197K9547r262K5023L0981K7307
8192I3759l1251l7167k1635L0289M2032L0987l2414m2721K0712k300l1412L1628
8180E0507m337l7091L550k5940k0665O067j7190j3571N5898M4778J9091k7150
8168C3947n1647M6950O7280j3040k2108N496L5245N865n0540o7486p114N8774
8156D1622R8384N1691O1345o9339r1567K1909j5929l6129K7797M4722k6604m0256
8144F7646l6564k0708P0910R574L90j8527p9530m273M6850K3767m235m4512k2922
8131a2134L1245K6963j8604J1910m220P369R080j3397J188K3243L2175l8559m7225
$$ plain form
8118 9034 31198 16974 24646 78370 82555 110175 119739 66853 13056 56706 19693 -3245 32712
8105 32712 98722 108207 103553 97095 40505 -16303 -27995 32138 81215 45285 60507 73278
8093 73278 45846 50035 10811 8196 7316 16223 -6687 -45471 -5019 81021 88177 81183 166381
8080 166381 203191 146064 54665 71039 30082 419 3468 30967 62492 93591 103508 55819
8068 55819 50399 117464 142960 53101 992 -11167 -19369 9846 -11794 -6033 41303 52477
8056 52477 64845 131685 124451 131312 116319 42844 -23020 -28280 -63472 -55055 6641 19724 -61129
8043 -61129 -67447 -91042 -112642 -913 91225 58164 39520 49639 32657 41487 20499 3920
8031 3920 -17302 -37173 -36391 38268 17190 -20775 -29105 -35688 -13456 7837 38411 52847 47214
$$ packed form
8118I034K2164j4224P672N3724M185K7620R564n2886n3797M3650l7013k2938L5957
8105C2712O6010R485m654o458n6590n6808j1692O0133M9077l5930J5222J2771
8093G3278k7432M189l9224k615q80Q907k2910l8784M0452Q6040P156o994Q5198
8080A66381L6810n7127r1399J6374m0957k9663L049K7499L1525L1099R917m7689
8068E5819n420O7065K5496q9859n2109j2159q202K9215k1640N761M7336J1174
8056E2477J2368O6840p234O861j4993p3475o5864n260l5192Q417O1696J3083q0853
8043f1129o318k3595k1600J11729R2138l3061j8644J0119j6982Q830k0988j6579
8031C920k1222j9871P82P4659k1078l7965q330o583K2232K1293L0574J4436n633
$$ plain form
8018 47214 37887 -11012 -37423 -35387 55883 144480 94138 35012 -17148 -1142 -31447 -43024
8006 -43024 -18724 -46914 38590 114237 144378 179200 146068 134381 123414 106448 78931 27051
7994 27051 -3812 -26722 -7022 91448 200141 151700 109609 68145 111295 135250 101571 100537
7982 100537 130357 140325 124085 91729 46385 28288 21760 29397 51478 75510 78193 96848
7970 96848 91030 131157 138961 92281 79065 96271 113946 101609 74935 69282 45391 60416
7958 60416 50036 73203 93816 37482 -18588 -21404 -22673 -38149 -30991 14443 43263 93029
7946 93029 113477 138631 125785 80161 90904 93275 34667 31599 3962 -30176 24090 111170
7934 111170 160193 128364 85792 76853 68962 41208 14914 12459 6003 35915 34394 47011 28137
$$ packed form
8018D7214r327m8899k6411K036R1270Q8597n0342n9126n2160J6006l0305j1577
8006d3024K4300k8190Q5504P5647L0141L4822l3132j1687j0967j6966k7517n1880
7994B7051l0863k2910J9700R8470J08693m8441m2091m1464M3150K3955l3679j034
7982A00537K9820R968j6240l2356m5344j8097o528P637K2081K4032K683J8655
7970I6848n818M0127P804m6680j3216J7206J7675j2337k6674n653k3891J5025
7958F0416j0380K3167K0613n6334n6070k816j269j5476P158M5434K8820M9766
7946I3029K0448K5154j2846m5624J0743K371n8608l068k7637l4138N4266Q7080
7934A11170M9023l1829m2572q939p891k7754k6294k455o456K9912j521J2617j8874
$$ plain form
7921 28137 57238 73492 20848 -16468 20111 56487 95013 75047 36905 42198 54836 32644
7909 32644 -5535 39389 46894 -2047 59518 41209 53478 77873 57518 25708 53565 64625
7897 64625 97318 44185 58503 61725 46552 33866 9963 35211 63930 84024 41804 34973
7885 34973 64447 -33076 -11676 26380 61915 81984 11271 19610 55248 3855 62482 112167
7873 112167 140345 171634 172070 170787 183624 119544 13596 -23868 -34756 -66894 -12545 57165
7861 57165 70225 57809 43919 66902 66163 17508 33661 -12187 27420 59854 7790 -3685
7849 -3685 -15292 7553 34541 -6905 -1062 16298 63110 51374 -30172 -65452 1349 34171
7837 34171 -899 -8267 -8365 -42611 -15194 30654 42284 34342 66051 -14299 -60747 -70302 -32123
$$ packed form
7921B8137K9101J6254n2644l7316L6579L6376L8526j9966l8142N293J2638k2192
7909C2644l8179M4924P505m8941O1565j8309J2269K4395k0355l1810K7857J1060
7897F4625L2693n3133J4318L222j5173j2686k3903K5248K8719K0094m2220o831
7885C4973K9474r7523K1400L8056L5535K0069p0713Q339L5638n1393N8627M9685
7873A12167K8178L1289M36j283J2837o4080j05948l7464j0888l2138N4349O9710
7861E7165J3060j2416j3890K2983p39m8655J6153m5848L9607L2434n2064j1475
7849c685j1607K2845K6988m1446N843J7360M6812j1736q1546l5280O6801L2822
7837C4171l5070p368r8l4246K7417M5848J1630p942L1709q0350m6448r555L8179
$$ plain form
7824 -32123 8231 5851 -54563 9603 51381 61333 51518 23647 17252 52614 60513 87082 49492
7811 49492 51770 18825 -32235 -39084 -32981 8155 1709 62356 46575 56547 67829 74633 81110
7798 81110 51116 58251 115574 123060 104344 46629 -10754 12893 41610 77684 49497 23392
7786 23392 -5661 -17787 26198 58695 41429 41557 66045 23460 35666 48280 41078 66105
7774 66105 75659 95479 94515 85309 60388 26130 26596 45592 60765 45776 10817 -31954 25240
7761 25240 30703 44070 44614 61943 74318 86664 98391 112029 81319 32280 -6156 -39037
7749 -39037 -20015 31470 78412 34325 -41475 -69154 -57549 -14573 34499 27814 22626 -31599
7737 -31599 -44985 48945 70277 42206 -70480 -146307 -116506 -54943 30887 50871 47232 -30870
$$ packed form
7824c2123M0354k380o0414O4166M1778R952r815k7871o395L5362P899K6569l7590
7811D9492K278l2945n1060o849O103M1136o446O0647j5781R972J1282O804O477
7798H1110k9994P135N7323P486j8716n7715n7383K3647K8717L6074k8187k6105
7786B3392k9053j2126M3985L2497j7266J28K4488m2585J2206J2614p202K5027
7774F6105R554J9820r64r206k4921l4258M66J8996J5173j4989l4959m2771N7194
7761B5240N463J3367N44J7329J2375J2346J1727J3638l0710m9039l8436l2881
7749c9037J9022N1485M6942m4087p5800k7679J1605M2976M9072o685n188n4225
7737c1599j3386R3930K1332k8071j12686p5827K9801O1563Q5830J9984l639p8102
$$ plain form
7725 -30870 -77170 -101317 -92520 -88709 -5731 -9224 45213 6439 -32505 3507 37165 39340 7342
7712 7342 -3114 -18799 12113 40102 43066 65719 44543 58834 65519 2266 -25736 8813
7700 8813 26141 35832 55456 67631 69725 48787 -6560 582 43585 65766 53041 12399 -18447
7687 -18447 8904 27702 57096 33742 -57570 -43137 47470 65912 42885 37752 48888 24894
7675 24894 43122 68733 67663 11511 -1463 11266 13460 -24519 -50631 -33812 -10721 -52519
7663 -52519 -80728 -48277 -19327 -43175 -63659 -79809 -102285 -133238 -102375 -32922 2150 -14594
7651 -14594 -18303 -3345 28666 70177 89998 74552 36176 54355 90748 63433 1269 -4245
7639 -4245 13661 -5609 -68186 -20858 56427 67619 30825 28088 47643 40236 43624 50532 41266
$$ packed form
7725c0870m6300k4147Q797L811Q2978l493N4437l8774l8944L6012L3658K175l1998
7712G342j0456j5685L0912K7989K964K2653k1176J4291O685o3253k8002L4549
7700H813J7328R691J9624J2175K094k0938n5347P142M3003K2181j2725m0642l0846
7687a8447K7351J8798K9394k3354r1312J4433R0607J8442k3027n133J1136k3994
7675B4894J8228K5611j070n6152j2974J2729K194l7979k6112J6819K3091m1798
7663e2519k8209L2451K8950k3848k0484j6150k2476l0953L0863O9453L5072j6744
7651a4594l709J4958L2011M1511J9821j5446l8376J8179L6393k7315o2164n514
7639d245J7906j9270o2577M7328P7285J1192l6794k737J9555p407L388O908r266
$$ plain form
7626 41266 -1430 19100 82497 113132 67754 4485 -13008 -242 -16142 -25308 11502 10682
7614 10682 35176 53716 53427 32552 14250 15383 -840 -23265 -24165 -29887 -29029 45725 137886
7601 137886 121321 28858 -13784 -24064 -3633 25257 34246 34265 75974 67176 50106 31951 -54956
7588 -54956 -66318 -71567 -53696 -18575 -21010 11818 -23411 -26818 -43320 -54167 -51508 -16481 59276
7575 59276 79158 67440 42576 36520 71270 117507 115530 55074 -1417 -59655 -11193 35184
7563 35184 -11883 -34507 -14614 25397 25052 -24363 -56617 -27581 33773 44289 33826 61714
7551 61714 64477 79292 85882 25903 -31970 -105887 -111529 -88662 -85293 -82039 -75179 -47691 4208
7538 4208 -29092 -42591 -43335 -62306 -14712 -24759 6573 56833 81121 48891 -22461 -44745
$$ packed form
7626D1266m2696K0530O3397L0635m5378o3269j7493J2766j5900r166L6810q20
7614A0682K4494J8540k89k0875j8302J133j6223k2425r00n722Q58P4754R2161
7601A37886j6565r2463m2642j0280K0431K8890Q989J9M1709q798j7070j8155q6907
7588e4956j1362n249J7871L5121k435L2828l5229l407j6502j0847K659L5027P5757
7575E9276J9882j1718k4864o056L4750M6237j977o0456n6491n8238M8462M6377
7563C5184m7067k2624J9893M0011l45m9415l2254K9036O1354J0516j0463K7888
7551F1714K763J4815O590n9979n7873p3917n642K2867L369L254O860K7488N1899
7538D208l3300j3499p44j8971M7594j0047L1332N0260K4288l2230p1352k2284
$$ plain form
7526 -44745 -4484 2507 3465 8832 31724 27920 9912 -15913 -20067 -22870 -59068 8817 45283
7513 45283 34164 -8394 -17885 -28448 -41548 -57260 -58787 -53872 -32160 11679 52999 60969 30037
7500 30037 13049 26595 -1506 392 22816 71270 93969 75640 46672 25580 18245 -27090
7488 -27090 -43316 -83846 -95554 -61510 -28031 -33542 -71943 -99528 -86669 -76175 -78782 -120900
7476 -120900 -148950 -106426 -106937 -115305 -76907 -38570 -51036 15705 24908 20182 -40934 -64810 -22337
7463 -22337 11880 -10802 -15809 -5335 16178 55827 35739 -31254 -23968 -67845 -40616 -28358
7451 -28358 -18701 -45904 -14182 -30334 11435 26888 -40132 -38891 17229 41294 18981 50562
7439 50562 38769 -27511 -17625 39129 85653 21044 -22844 20319 73353 29763 -5022 -2501
$$ packed form
7526d4745M0261O991R58N367K2892l804j8008k5825m154k803l6198O7885L6466
7513D5283j1119m2558r491j0563j3100j5712j527M915K1712M3839M1320P970l0932
7500C0037j6988J3546k8101J898K2424M8454K2699j8329k8968k1092p335m5335
7488b7090j6226m0530j1708L4044L3479n511l8401k7585J2859J0494k607m2118
7476a20900k8050M2524n11q368L8398L8337j2466O6741R203m726o1116k3876M2473
7463b2337L4217k2682n007J0474K1513L9649k0088o6993P286m3877K7229J2258
7451b8358R657k7203L1722j6152M1769J5453o7020J241N6120K4065k2313L1581
7439E0562j1793o6280R886N6754M6524o4609m3888M3163N3034m3590l4785K521
$$ plain form
7427 -2501 -26849 -48210 -15828 3474 2678 -50392 -32522 21512 -20308 -73277 -85058 -29594
7415 -29594 18906 27224 20998 -37467 -86765 -70132 -63216 -71119 -64722 -14891 -15942 17371 85476
7402 85476 78296 19263 20419 47217 48205 57835 48571 30497 27366 57135 21524 6217 -5433
7389 -5433 -24216 2916 50686 39298 33140 25959 -17095 -92944 -89436 -66962 -58920 -104521 -163072
7376 -163072 -173111 -159636 -140009 -110319 -71599 -80268 -68456 672 22186 -24017 34892 15570
7364 15570 -18346 -2668 34255 -8323 -118558 -122083 -73629 -53892 -30400 20913 56163 79199
7352 79199 40239 2657 4237 25006 53635 -12 17653 25218 -17464 -34594 -47199 -39161
7340 -39161 -24660 -10727 -42305 -44312 -33743 -33243 31608 -2043 -32131 -20825 -73367 -77382 74336
$$ packed form
7427b501k4348k1361L2382J9302p96n3070J7870N4034m1820n2969j1781N5464
7415b9594M8500Q318o226n8465m9298J6633O916p903O397M9831j051L3313O8105
7402H5476p180n9033J156K6798R88R630r264j8074l131K9769l5611j5307j1650
7389e433j8783K7132M7770j1388o158p181m3054p5849L508K2474Q042m5601n8551
7376a63072j0039J3475J9627K9690L8720q669J1812O9128K1514m6203N8909j9322
7364A5570l3916J5678L6923m2578j10235l525M8454J9737K3492N1313L5250K3036
7352G9199l8960l7582J580K0769K8629n3647J7665P565m2682j7130j2605Q038
7340c9161J4501J3933l1578k007J0569N00O4851l3651l0088J1306n2542m015J51718
$$ plain form
7327 74336 116564 11708 -34550 -16621 -40350 -8094 -24995 -91811 -139590 -130045 -69553 -83799
7315 -83799 -45884 -50232 -46320 -37336 -20180 2231 18410 33160 22126 44638 -12806 -26936
7303 -26936 -8585 5490 15008 -1404 17865 32315 24651 16833 -30638 -70550 -34967 53416
7291 53416 64889 18253 3028 -16059 837 33018 46483 81216 103557 23595 -34025 -44689
7279 -44689 -19301 -16195 -27213 -24548 -2174 27259 -11730 -52252 -19680 -6391 -8619 -46367
7267 -46367 37365 29829 -69438 -92552 -93480 -36711 -10516 12041 1050 45746 45808 13797 -25027
7254 -25027 4364 38897 45417 -21377 -31425 -7293 8617 44237 53265 30814 -25463 -47438
7242 -47438 8766 -13343 -87727 -96705 -80414 -13877 -7060 -56031 -87747 -143536 -164601 -106783
$$ packed form
7327G4336M2228j04856m6258J7929k3729L2256j6901o6816m7779R545O0492j4246
7315h3799L7915m348L912Q984J7156K2411J6179J4750j1034K2512n7444j4130
7303b6936J8351J4075R518j6412J9269J4450p664p818m7471l9912L5583Q8383
7291E3416J1473m6636j5225j9087J6896L2181J3465L4733K2341p9962n7620j0664
7279d4689K5388L106j1018K665K2374K9433l8989m0522L2572J3289k228l7748
7267d6367Q3732p536r9267k3114r28N6769K6195K2557j0991M4696O2l2011l8824
7254b5027K9391L4533O520o6794j0048K4132J5910L5620R028k2451n6277k1975
7242d7438N6204k2109p4384q978J6291O6537O817m8971l1716n5789k1065N7818
$$ plain form
7230 -106783 -76022 -23682 -1493 -29703 -42651 1678 37425 53494 100105 109519 102008 103762
7218 103762 76507 11230 14681 31383 10573 37025 -9993 -67736 -68451 -28952 4657 20106
7206 20106 28758 16905 24367 -15723 -50857 -21446 54463 25986 -23472 -33230 -52882 -34289
7194 -34289 10389 -7485 -16293 3902 -10150 -48472 -29211 -3162 -7328 -8909 -7625 -32071 -36358
7181 -36358 -52338 -33070 -19986 -68987 -59422 -57629 -19775 -12692 -41498 -50631 -46002 -20463 -33047
7168 -33047 -71699 -100364 -33290 24494 52132 30269 -8765 -54792 -80292 -32154 -29397 -52727
7156 -52727 -73656 -55988 -7063 28208 17905 -39311 -5487 -10892 -58978 -51357 -87946 -95350
7144 -95350 -90311 -23243 7440 -5567 -15227 -7494 2423 19172 30691 45653 40507 25702 64293
$$ packed form
7230a06783L0761N2340K2189k8210j2948M4329L5747J6069M6611R414p511J754
7218A03762k7255o5277L451J6702k0810K6452m7018n7743p15L9499L3609J5449
7206B0106Q652j1853P462m0090l5134K9411P5909k8477m9458r758j9652J8593
7194c4289M4678j7874q808K0195j4052l8322J9261K6049m166j581J284k4446m287
7181c6358j5980J9268J3084m9001R565J793L7854P083k8806r133M629K5539j2584
7168c3047l8652k8665O7074N7784K7638k1863l9034m6027k5500M8138K757k3330
7156e2727k0929J7668M8925L5271j0303n7216L3824n405m8086P621l6589p404
7144i5350N039O7068L0683j3007r660P733R917J6749J1519J4962n146j4805L8591
$$ plain form
7131 64293 51662 -13172 -22188 -19772 11227 13165 -46283 -83912 -89774 -80475 2657 15898 -31927
7118 -31927 -72382 -34881 14010 38223 64386 15104 -55284 -88110 -51229 -44692 -46574 -31179
7106 -31179 -40534 14276 21084 27015 13229 1697 -45194 -40109 -21299 3700 -33460 -59934 -33452
7093 -33452 -12855 -48593 -87109 -50738 -17985 8562 -59283 -133087 -87190 -7005 19443 -14083
7081 -14083 -72920 -61307 -75121 -126826 -159122 -160209 -124412 -60976 -6429 -20855 -51477 -112243
$$ packed form
7131F4293j2631o4834r016K416L0999J938n9448l7629n862R299Q3132J3241m7825
7118c1927m0455L7501M8891K4213K6163m9282p0388l2826L6881O537j882J5395
7106c1179r355N4810O808N931j3786j1532m6891N085J8810K4999l7160k6474K6482
7093c3452K0597l5738l8516L6371L2753K6547o7845p3804M5897Q0185K6448l3526
7081a4083n8837J1613j3814n1705l2296j087L5797O3436N4547j4426l0622o0766
$$ [...]
##END NTUPLES=NMR SPECTRUM
##END=
