##TITLE=Analysis number 311565
Compound Code cc 18546
Book Reference 409/166/3
Project Code qc-cat
Chemist Name peted
##JCAMPDX= 6.0         $$ Bruker NMR JCAMP-DX V2.0
##DATA TYPE= NMR SPECTRUM
##DATA CLASS= NTUPLES
##ORIGIN= Bruker BioSpin GmbH
##OWNER= NMR
$$ XWIN-NMR		Version 3.5
$$ Wed Jul 13 10:08:21 2005 GMT Daylight Time (UT+1h)  MAYBRIDGE\NMR@NMR_250MHZ
##.OBSERVE FREQUENCY= 250.131544655141
##.OBSERVE NUCLEUS= ^1H
##.ACQUISITION MODE= SIMULTANEOUS (DQD)
##.ACQUISITION SCHEME= undefined
##.AVERAGES= 16
##.DIGITISER RES= 18
##SPECTROMETER/DATA SYSTEM= dpx250
##.PULSE SEQUENCE= zg30
##.SOLVENT NAME= CDCl3
##.SHIFT REFERENCE= (INTERNAL, CDCl3, 0, 16.522)
##AUDIT TRAIL= $$ (NUMBER, WHEN, WHO, WHERE, WHAT)
$$ ##TITLE= Audit trail, XWIN-NMR		Version 3.5
$$ ##JCAMPDX= 5.01
$$ ##ORIGIN= Bruker BioSpin GmbH
$$ ##OWNER= NMR
$$ C:\u/data/dgb/nmr/ADRS/5750/pdata/1/auditp.txt
$$ ##AUDIT TRAIL=  $$ (NUMBER, WHEN, WHO, WHERE, WHAT)
(   1,<2005-07-13 10:08:02.69 +100>,<MAYBRIDGE\NMR>,<NMR_250MHZ>,
      <created by zg, POWCHK disabled, PULCHK disabled
       configuration hash MD5:
       62 19 C7 07 E1 42 D1 B7 37 6C 3D D0 77 39 F9 E6
       data hash MD5: 64K
       E3 91 54 47 CE 7C 54 08 C9 8D 02 49 E0 42 E9 C0>)
(   2,<2005-07-13 10:08:13.35 +100>,<MAYBRIDGE\NMR>,<NMR_250MHZ>,
      <Start of raw data processing
       ef LB = 0.3 FT_mod = 6 PKNL = 1 SI = 32K 
       data hash MD5: 32K
       E5 82 6A 86 E1 AB 33 5A CF 85 CB AC 2C 7C 42 0B>)
(   3,<2005-07-13 10:08:15.16 +100>,<MAYBRIDGE\NMR>,<NMR_250MHZ>,
      <apk 
       data hash MD5: 32K
       C0 A5 BA D4 55 6B FA CA 9B 7F 14 E6 D2 F3 5C AD>)
(   4,<2005-07-13 10:08:15.83 +100>,<MAYBRIDGE\NMR>,<NMR_250MHZ>,
      <abs ABSG = 5 
       data hash MD5: 32K
       A6 A3 60 32 7F B5 02 84 15 2E 2E BC 4A 26 E6 E1>)
$$ ##END=
$$ 
$$ hash MD5
$$ 6A 30 24 92 E7 A5 A9 E6 BA 2C BB 87 5F EE 5C 30
##$RELAX= 
##$RELAX= 
##$RELAX= 
##$RELAX= 
##$RELAX= 
##$RELAX= 
##$RELAX= 
$$ Bruker specific parameters
$$ --------------------------
##$DU= <C:\u>
##$EXPNO= 5750
##$NAME= <ADRS>
##$PROCNO= 1
##$TYPE= <nmr>
##$USER= <dgb>
##$AMP= (0..31)
100 100 100 100 100 100 100 100 100 100 100 100 100 100 100 100 100 100 
100 100 100 100 100 100 100 100 100 100 100 100 100 100 
##$AQSEQ= 0
##$AQ_mod= 3
##$AUNM= <au_zg>
##$AUTOPOS= <5 >
##$BF1= 250.13
##$BF2= 250.13
##$BF3= 250.13
##$BF4= 250.13
##$BF5= 500.13
##$BF6= 500.13
##$BF7= 500.13
##$BF8= 500.13
##$BYTORDA= 1
##$CFDGTYP= 0
##$CFRGTYP= 5
##$CHEMSTR= <none>
##$CNST= (0..31)
1 1 145 1 1 1 1 1 1 1 1 1 1 1 1 1 1 1 1 1 1 1 1 1 1 1 1 1 1 1 1 1 
##$CPDPRG= <>
##$CPDPRG1= <>
##$CPDPRG2= <>
##$CPDPRG3= <>
##$CPDPRG4= <mlev>
##$CPDPRG5= <mlev>
##$CPDPRG6= <mlev>
##$CPDPRG7= <mlev>
##$CPDPRG8= <mlev>
##$CPDPRGB= <>
##$CPDPRGT= <>
##$D= (0..31)
0 1 0 0 0 0 0 0 0 0.06 0 0 0 0 0 0 0.0002 0 0 0 0 0 0 0 0 0 0 0 0 0 0 
0 
##$DATE= 1121245681
##$DBL= (0..7)
120 120 120 120 120 120 120 120 
##$DBP= (0..7)
150 150 150 150 150 150 150 150 
##$DBP07= 0
##$DBPNAM0= <>
##$DBPNAM1= <>
$$ [...]
##$SUBNAM7= <"">
##$SUBNAM8= <"">
##$SUBNAM9= <"">
##$SW= 20.6930455092707
##$SWIBOX= (0..15)
0 0 3 0 0 0 0 0 0 0 0 0 0 0 0 0 
##$SW_h= 5175.983436853
##$TD= 65536
##$TD0= 1
##$TE= 295.16
##$TE2= 300
##$TE3= 300
##$TEG= 300
##$TL= (0..7)
0 120 120 120 120 120 120 120 
##$TP= (0..7)
150 150 150 150 150 150 150 150 
##$TP07= 0
##$TPNAME0= <>
##$TPNAME1= <>
##$TPNAME2= <>
##$TPNAME3= <>
##$TPNAME4= <>
##$TPNAME5= <>
##$TPNAME6= <>
##$TPNAME7= <>
##$TPOAL= (0..7)
0.5 0.5 0.5 0.5 0.5 0.5 0.5 0.5 
##$TPOFFS= (0..7)
0 0 0 0 0 0 0 0 
##$TUNHIN= 0
##$TUNHOUT= 0
##$TUNXOUT= 0
##$USERA1= <user>
##$USERA2= <user>
##$USERA3= <user>
##$USERA4= <user>
##$USERA5= <user>
##$V9= 5
##$VALIST= <valist>
##$VCLIST= <CCCCCCCCCCCCCCC>
##$VD= 0
##$VDLIST= <DDDDDDDDDDDDDDD>
##$VPLIST= <PPPPPPPPPPPPPPP>
##$VTLIST= <TTTTTTTTTTTTTTT>
##$WBST= 1024
##$WBSW= 4
##$XGAIN= (0..3)
0 0 0 0 
##$XL= 0
##$YL= 0
##$YMAX_a= 335944
##$YMIN_a= -436309
##$ZGOPTNS= <>
##$ZL1= 120
##$ZL2= 120
##$ZL3= 120
##$ZL4= 120
##$ABSF1= 16.522
##$ABSF2= -4.171173
##$ABSG= 5
##$ABSL= 3
##$ALPHA= 0
##$AQORDER= 0
##$ASSFAC= 0
##$ASSFACI= 0
##$ASSFACX= 0
##$ASSWID= 0
##$AUNMP= <proc_1d>
##$AZFE= 0.1
##$AZFW= 0.1
##$BCFW= 0
##$BC_mod= 0
##$BYTORDP= 0
##$COROFFS= 0
##$CY= 12.5
##$DATMOD= 1
##$DC= 0
##$DFILT= <>
##$DTYPP= 0
##$F1P= 14.0000005364418
##$F2P= -0.99999901652339
##$FCOR= 0.5
##$FTSIZE= 32768
##$FT_mod= 6
##$GAMMA= 0
##$GB= 0
##$INTBC= 1
##$INTSCL= 1
##$ISEN= 128
##$LB= 0.3
##$LEV0= 0
##$LPBIN= 0
##$MAXI= 10000
##$MC2= 0
##$MEAN= 0
##$ME_mod= 0
##$MI= 0
##$NCOEF= 0
##$NC_proc= -3
##$NLEV= 6
##$NOISF1= 0
##$NOISF2= 0
##$NSP= 0
##$NTH_PI= 0
##$NZP= 0
##$OFFSET= 16.522
##$PC= 1
##$PHC0= -80.91393
##$PHC1= 4.940515
##$PH_mod= 1
##$PKNL= yes
##$PPARMOD= 0
##$PSCAL= 4
##$PSIGN= 0
##$REVERSE= no
##$SF= 250.13
##$SI= 32768
##$SIGF1= 0
##$SIGF2= 0
##$SINO= 400
##$SIOLD= 32768
##$SREGLST= <1H.CDCl3>
##$SSB= 0
##$STSI= 32768
##$STSR= 0
##$SW_p= 5175.98343685301
##$SYMM= 0
##$S_DEV= 0
##$TDeff= 65536
##$TDoff= 0
##$TI= <Analysis number 999999
Compound Code 99
Book Reference 9
Project Code 9>
##$TILT= no
##$TM1= 0
##$TM2= 0
##$TOPLEV= 0
##$USERP1= <user>
##$USERP2= <user>
##$USERP3= <user>
##$USERP4= <user>
##$USERP5= <user>
##$WDW= 1
##$XDIM= 32768
##$YMAX_p= 330319411
##$YMIN_p= -74736
$$ End of Bruker specific parameters
$$ ---------------------------------
##NTUPLES= NMR SPECTRUM
##VAR_NAME=  FREQUENCY,     SPECTRUM/REAL,   SPECTRUM/IMAG
##SYMBOL=    X,             R,               I
##VAR_TYPE=  INDEPENDENT,   DEPENDENT,       DEPENDENT
##VAR_FORM=  AFFN,          ASDF,            ASDF
##VAR_DIM=   32768,         32768,           32768
##UNITS=     HZ,            ARBITRARY UNITS, ARBITRARY UNITS
##FACTOR=    0.157963299565203, 1,           1
##FIRST=     4132.6476996994, 0,             0
##LAST=      -1043.33573715361, 0,           0
##MIN=       -1043.33573715361, -74736,      0
##MAX=       4132.6476996994, 330319411,     0
$$ Real data points
##PAGE= N=1
##DATA TABLE= (X++(R..R)), XYDATA
$$ [...]
20826 -13576 -17972 -22448 -33201 -20056 -17235 -37221 -30084 -11730 -519 -479 -6972 -21804 -32925
20813 -32925 -23744 -17220 -14593 -8515 -26887 -31247 -41520 -21177 4990 7636 20071 22605 14328
20800 14328 10099 -13575 -23675 -13776 3693 -556 -6891 -12983 -8895 -3372 9039 1289 -24449
20787 -24449 -21692 -6669 20760 24578 18515 5389 16204 31377 21824 22026 16694 14344 2304
20774 2304 9535 175 1506 10967 4660 18267 14681 16214 8435 9352 14844 19472 8482 -4918
20760 -4918 -29095 -38536 -49247 -27232 -10702 -1792 20756 17152 3030 -2445 -16339 -1228 -1435
20747 -1435 -5358 -28371 -30295 -13853 -7006 5066 13638 21062 23921 1098 9564 5616 2571 12900
20733 12900 9651 962 6405 -6332 -5797 7186 -4183 -21402 -15566 -17892 -19690 -22715 -32782
20720 -32782 -31932 -18987 -4853 677 11933 6863 13334 9156 -2835 -16398 -15566 -28504 -35274
20707 -35274 -29559 -18701 -15258 830 10314 18455 16968 10422 7765 2478 14573 23338 29968 32148
20693 32148 15572 23447 44735 34359 7128 -1662 -5351 1101 1759 -9685 8567 14575 25721
20680 25721 16000 16147 12713 9386 14754 15396 15774 25793 23820 38982 32802 14582 8908 17315
20666 17315 19632 23537 14424 6990 8168 3114 -4832 14959 30626 14299 23980 18593 5892
20653 5892 -3506 -7877 6405 8028 -2016 -4681 -8627 -7497 12767 24025 5161 -20901 -24760
20640 -24760 -22448 -17415 -24168 -16551 -7040 -292 3248 -1640 6430 16732 2310 -2935 6077 9531
20626 9531 13905 -323 1323 -387 -13752 -21985 -19538 -2699 2488 17460 30860 26769 28288
20613 28288 14454 11859 5354 2046 8199 -8533 -19699 -33535 -17312 5970 3185 8161 21443
20600 21443 15455 8343 -2465 -1765 -5176 -18345 -19955 -27165 -29892 -22661 -28421 -28121 -11866 5698
20586 5698 11747 23185 8941 -12189 -24498 -23898 -15603 -21966 -29064 -33120 -24906 -18477 -10896 -445
20572 -445 -189 -14306 -13652 -19217 -15124 -6906 3274 3971 19121 36051 30501 9853 -15586 -20124
20558 -20124 -17346 -19929 -25672 -31712 -32324 -13422 9992 20470 28501 12775 -21706 -35385 -19513
20545 -19513 -17137 -24113 -21400 -12037 -7594 -20405 -22514 -11880 255 21506 37435 37878 35626
20532 35626 17478 15009 22047 14368 25471 12109 1111 -13702 -8412 20501 40506 38479 7249
20519 7249 2661 -2672 320 -2573 -2750 -196 -11304 -1376 11429 21385 31488 29288 11863 -9363
20505 -9363 -9695 -19681 -29554 -28028 -17381 151 20752 7904 -3781 -21917 -46169 -41536 -16564
20492 -16564 -5005 -12587 1794 10727 11718 10590 19526 26657 19868 13775 -1613 -27516 -30269 -42666
20478 -42666 -59302 -52557 -16755 -20398 -43585 -30099 -28526 -17665 5705 5639 -8122 -1051 2088
20465 2088 9152 10835 18242 7474 -5984 -1370 6071 23299 37026 21519 5819 14972 15262
20452 15262 29989 30753 45430 52999 45616 27581 26112 25682 -804 17941 25348 20646 11382 -1078
20438 -1078 -12532 -15547 1255 15027 5786 5122 1044 282 4926 2384 -8036 -16297 -9909 -3424
20424 -3424 17523 38552 42836 29614 21752 26153 34421 24347 -5179 -1599 18599 19255 13488
20411 13488 393 -16836 -794 28352 30086 20623 7608 -8408 -7492 -13098 -19811 1131 -2534
20398 -2534 -5414 -9970 -1070 -9330 -1618 8368 17065 25087 17294 23639 15110 8547 -1712 -9443
20384 -9443 -749 9688 22829 16081 5598 -3574 -3471 4911 5019 -8749 68 4965 -13093 -12380
20370 -12380 1953 13170 13184 4549 6842 16133 6088 -9125 6305 20230 28942 19892 12731
20357 12731 21931 34191 38154 34851 34629 26916 21973 15795 29603 33221 36632 36470 24493 32419
20343 32419 24737 29433 27243 31409 25360 5407 3223 -600 1266 12317 8284 11541 8401 -3545
20329 -3545 -19841 -10058 2173 -12615 629 -3065 -27500 -27851 -24981 -9835 8129 17596 10474
20316 10474 2155 15988 42642 35010 8008 16476 25671 15272 34605 42554 39606 19712 11787
20303 11787 20579 39053 41650 29055 28891 28257 19679 -1684 1149 3306 -5202 -10699 -5484 -15053
20289 -15053 6887 15519 14035 9417 1762 14323 20643 13690 14763 9317 3863 6066 -6859 -2746
20275 -2746 3631 8978 19956 26179 14445 12629 2426 -9208 -4476 -2357 12129 25069 27471
20262 27471 21430 6657 12314 16387 17588 20109 11020 4001 15934 15189 19838 20318 25496 27989
20248 27989 33050 27940 25437 10654 4294 903 2353 10493 35095 33739 23326 4790 9499
20235 9499 11755 -12316 -21329 -27326 -31073 -26575 -21142 -27218 -21929 3594 17577 17303 33402 29500
20221 29500 24114 7537 4612 -1241 -12745 -18120 -17487 2122 22681 11236 -3965 10886 21202
20208 21202 32518 34791 29863 36543 32130 21943 18406 18041 10220 23885 49381 37187 26249
20195 26249 20430 25445 35457 30903 34808 40461 33914 21159 23216 19434 20985 2487 6407 5792
20181 5792 -18804 -17419 4576 9197 14189 5293 -5045 5474 15476 31061 39369 23279 14210
20168 14210 13333 3166 -9889 -10907 1466 27903 11566 -5797 4426 12429 13209 677 5955
20155 5955 6578 10667 11856 -5930 332 11089 2887 8538 -10913 -8593 -3279 3148 23935 22679
20141 22679 11669 6119 165 7530 32502 47854 22254 34644 34300 8138 12943 10964 -6712
20128 -6712 -15352 -18676 -17845 -14770 5710 15392 2649 10393 9825 9570 15715 24757 39472 18354
20114 18354 6413 14826 13644 20981 24428 18379 7947 -11783 -4590 11776 20952 22566 6140
20101 6140 10449 4882 -8972 645 2633 2256 7443 -2667 5433 7018 9287 -1040 7022 21562
20087 21562 18556 19780 23711 23343 33098 29939 27681 7758 -16574 -839 -15184 -47027 -48347
20074 -48347 -37211 -27791 -16878 -3690 6756 9342 -6999 5264 37656 51756 54285 54411 52439
20061 52439 31409 13509 18932 16080 28453 32051 32743 31210 15211 18964 2551 -5746 2364
20048 2364 8101 16503 19057 12178 8530 12876 9107 17451 35073 39093 31588 7917 -2953 -1974
20034 -1974 8521 10438 2981 2848 -7041 -7260 3115 13047 6554 15279 19928 11265 18633 17058 9580
20019 9580 970 9432 26527 38735 33390 23415 20116 32367 3537 608 8669 15402 12524 24139
20005 24139 23120 -2250 -13929 -16032 8784 36373 52029 35033 36847 35486 38661 39509 48830
19992 48830 31030 11580 1716 6895 38556 42941 37527 28966 30553 22230 25493 43345 43161 27254
19978 27254 19971 7877 12695 23281 22211 25972 7364 4901 -2140 -6644 2051 6330 16312 22618
19964 22618 19495 21349 13474 11947 12015 27823 30140 15287 8107 10013 20864 14515 -4110 4956
19950 4956 11660 11697 18730 31521 21126 14005 18396 13499 7326 12800 15142 16333 6191 10818
19936 10818 19893 8618 11467 13442 4482 12696 -5714 -18752 -19061 -12624 -1390 23108 37649
19923 37649 31305 28051 30142 24743 7332 -5581 -8928 -1197 19674 27023 42850 34190 23708
19910 23708 29665 28049 36986 37715 28884 29949 32305 41596 18314 4527 13629 16201 18866 2938
19896 2938 19861 33082 43605 19580 3693 2023 -9667 1106 15171 30477 51000 39294
19884 39294 29821 36302 39445 46353 61553 73387 47819 42010 38489 41133 39210 25040 27106
19871 27106 19835 12832 29307 43163 57135 62634 56660 30920 10053 8910 22925 -6313 -16753
19858 -16753 -5292 13856 16535 19565 25367 11888 -4370 -1103 11653 29196 23729 30862 29827
19845 29827 16127 -18643 -9767 8981 29811 42810 40001 21977 15036 -2268 3005 2934 -6464
19832 -6464 10960 10294 -8291 -4581 4837 12241 13448 6579 -7244 -2343 1373 4636 -7820 -14524
19818 -14524 -25800 -32285 -12921 29394 32740 38887 16567 -13112 -9585 14059 19761 18681 16584
19805 16584 29763 23283 23177 24833 8625 15255 29402 19984 29535 29828 20672 28655 27570 18369
19791 18369 17956 31908 27127 25826 28629 27634 20215 22775 20040 23974 32048 9465 -4492 13759
19777 13759 38983 51531 54077 74135 88640 81925 59942 57867 73803 86778 106724 114888
19765 114888 115163 126828 151668 166283 182399 193030 212196 216019 209800 217614 217208 199935 189476
19752 189476 182382 194282 197763 198621 207541 201169 177497 158722 134760 129531 119195 97337 87482
19739 87482 94272 96467 104319 108334 82462 46465 39326 51975 54701 39485 35590 44639 56730
19726 56730 54001 52237 63547 50110 35325 36676 19724 -507 7304 21143 36979 33149 30959
19713 30959 29718 31402 25819 30013 38136 40016 39954 34443 29700 28904 33523 52972 61263 64265 64475
19698 64475 46481 42269 39315 31943 24585 8939 16540 32187 48267 52589 58812 53178 34709
19685 34709 41590 61971 67175 54175 72480 70670 67254 91952 120772 139257 166967 172804 165080
19672 165080 201789 234150 257489 269399 269455 292790 316871 304596 282092 249268 223221 221476
19660 221476 206127 195294 196065 192789 168264 157529 150561 137391 130425 97153 70547 74368 73145
19647 73145 72110 72880 81744 77877 62388 54250 49202 62350 66972 44637 51943 44294 40337 38425
19633 38425 50449 50502 41666 51492 46270 22936 24589 40458 43448 35053 23558 26080 6050 15042
19619 15042 20076 21411 20155 26297 31757 17676 11440 6483 8038 13591 12074 17432 19606 19113
19605 19113 26822 24820 7240 2036 12485 9806 22445 32576 16397 1443 -8359 8695 19312
19592 19312 22563 1864 10583 17401 16073 19300 26109 44495 26304 10733 13139 18325 16111
19579 16111 20186 28702 23306 11218 13083 33303 40967 39936 24508 15969 23085 29451 19374
19566 19374 26840 12856 8711 12236 13263 11149 6563 7078 27094 49173 64025 53884 63754
19553 63754 57710 51759 38203 34985 30708 22557 15417 26129 26208 35405 19833 17982 27946 41527
19539 41527 49884 46330 67639 70289 53866 35990 28595 24401 15345 17633 14234 20084 22074 26942
19525 26942 26443 39267 55150 62806 53227 58246 54991 60018 60883 55548 49251 42143 43449 52252
19511 52252 39528 38803 41798 43253 43281 51124 60271 47474 19835 9477 23193 55124 68624
19498 68624 73082 71612 66042 46501 41086 41628 54034 55159 30048 22091 18618 9611 -855 15738
19484 15738 36442 37787 24041 44507 48514 56136 45841 32261 19549 18900 24460 26204 23965
19471 23965 21373 18358 2699 9578 16017 32708 46198 50123 71726 81007 70008 59786 76170
19458 76170 86239 75318 77382 67492 61403 51859 45084 55032 47766 70327 74042 68728 42403
19445 42403 27707 18811 39400 39412 43437 51908 44061 25604 3848 20830 32654 35063 28188
19432 28188 20263 26490 27872 46607 50067 15529 12869 19581 8900 11252 44589 61947 59576
19419 59576 48659 37570 36033 46819 51175 46428 34547 32624 50499 54896 59267 62208 61548
19406 61548 41415 31945 39713 29289 27928 52243 59762 67526 70272 59079 51629 35931 45616
19393 45616 50129 66771 57671 43852 50112 43026 32163 32265 26647 23290 40878 53202 58951
19380 58951 54668 34289 32655 39457 36492 25400 25037 37063 35836 24249 29731 50327 57971
19367 57971 51283 31908 22826 33525 39689 36997 30472 32984 47928 54351 56527 52300 34311
19354 34311 27382 38311 47288 38147 25568 26182 31829 64480 57417 61116 75203 68421 74071 81683
19340 81683 68198 56118 55042 42580 38427 29197 39650 38362 51753 68280 83981 91587 69999
19327 69999 49368 73552 78959 75983 88923 73786 76146 76304 68300 75564 83955 79031 64279
19314 64279 48178 40114 49711 66285 68334 67987 71115 79770 95091 81976 84988 84526 70656 90850
19300 90850 103990 112181 108277 99211 105235 105129 90622 91337 78783 50978 51577 75071 84079 84569
19286 84569 90326 107759 112112 95723 97603 105300 99934 119988 140323 145676 138557 136820 131554
19273 131554 145759 134902 137093 147151 163416 186967 196269 190875 166852 159473 158696 164790 153042
19260 153042 140497 132142 139406 136579 135889 123899 116962 120773 125742 115913 116280 116608 101498 112308
19246 112308 109458 103576 124784 132323 123912 123759 125542 109193 95700 98955 91629 96765 96542 110051
19232 110051 127350 136578 123796 99336 97722 109483 123385 118889 103479 97239 99836 109750 129653
19219 129653 139115 130012 102038 82952 85605 100144 112180 107731 109663 99407 87318 93670 105395
19206 105395 91112 97415 109390 103352 111015 100263 105631 116297 110240 122602 129885 119946 103683
19193 103683 80478 77248 98771 100402 101244 101661 118095 125345 126100 129166 126326 140513 130453 107099
19179 107099 100907 112931 123372 125481 121523 134321 156684 159430 143123 126419 131190 128119 132649
19166 132649 148656 167256 170799 181476 184018 175095 171126 171169 176925 178945 188203 192451 172247 155885
19152 155885 170559 193342 211961 208311 223334 233240 238011 250544 257800 268246 266996 254975
19140 254975 279167 301163 300608 308564 327657 340499 334871 309170 305312 294675 287833 282226 274635
19127 274635 280670 326331 345168 376896 410272 436621 486471 523573 541587 571223 610063 644165
19115 644165 676115 689482 667142 645482 650091 645605 639322 623404 588007 562671 541715 505371
19103 505371 466984 435581 416638 370115 343900 351368 369931 370339 364994 377899 389977 398615
19091 398615 391171 373571 382001 415372 435341 444720 446773 467569 478585 476396 501753 524564
19079 524564 544483 552247 548525 538118 534606 539049 541883 574795 598809 591834 580286 593908 626180
19066 626180 646291 648420 659797 687411 711492 751131 788312 808805 857973 892027 943878 1002187
19054 1002187 1073973 1149764 1234291 1306855 1373955 1456676 1535173 1603699 1688175 1776910 1864850
19043 1864850 1966706 2064655 2141234 2225277 2310920 2417681 2542271 2671319 2821799 3008976
19033 3008976 3218380 3471720 3809222 4205768 4713622 5342859 6111282 7089951 8243104
19024 8243104 9541066 11043431 12887227 15264530 18454365 22654060 27788710 33127525
19016 33127525 37426158 39938898 41296697 42806504 45412581 49132562 52856381 55282739
19008 55282739 55570164 53364724 49449592 45307255 42139844 40233812 38640283 35977962
19000 35977962 31873395 26946513 21995373 17589586 14029325 11330058 9320657 7808274
18992 7808274 6653978 5747435 5067539 4489315 4004181 3595529 3237856 2973999 2778479
18983 2778479 2606965 2460294 2337806 2245942 2140621 2031738 1934779 1845415 1774480 1721263
18973 1721263 1670929 1614737 1541095 1461084 1393326 1332620 1290454 1239344 1193618 1130923 1078787
18962 1078787 1016638 957729 929727 916376 924467 937049 953434 969112 959127 926694 881227 840632
18950 840632 773759 704954 660781 611842 580536 562036 524615 498139 485957 493969 477396 448480
18938 448480 431618 428129 439764 456964 421711 396447 379957 371391 350052 330194 325741 344484
18926 344484 335452 340790 353388 365352 348188 336401 328900 315637 334073 352073 376289 369555
18914 369555 358691 378556 402439 409530 408528 402474 407316 405993 404872 377662 357896 360074 353247
18901 353247 348572 368949 390301 394266 414765 418589 399977 389941 386033 380833 377409 401436 387355
18888 387355 340261 319233 323866 310718 271741 255367 250325 241894 245107 239628 233809 238979 219479
18875 219479 199976 192326 189337 187645 203260 225783 237861 240599 231841 238142 249428 251722 254840
18862 254840 252775 248717 257385 268577 287754 306028 331182 338061 337432 366611 403052 412611 413241
18849 413241 404508 379622 376629 370312 364993 364781 354260 355799 358540 331091 311825 303499 284461
18836 284461 272220 235421 206603 200314 198208 195575 180937 175174 168671 158488 152162 147891 157731
18823 157731 165119 168323 143367 130184 126673 126540 138887 147811 154665 161264 147404 127632 110185
18810 110185 107710 115294 122419 123254 127050 131327 137283 122523 125843 159402 165286 157427 174569 176519
18796 176519 154473 146731 153900 134777 145073 162255 153238 144082 132822 128105 141295 175018
18784 175018 191150 177562 192095 224359 232859 222626 248877 282444 310901 312206 327274 327581
18772 327581 310150 307670 328014 357340 380576 421764 466490 467747 459642 458711 450246 453565 453811
18759 453811 431227 408049 402900 377286 354668 360607 375697 386067 396554 396543 404935 411363 436930
18746 436930 464881 493502 531498 574469 605206 637315 690611 746331 778367 809931 824334
18735 824334 825005 817873 816816 809695 783000 738979 735423 725981 700374 658731 592938 541116 516848
18722 516848 495451 500289 513234 512922 546493 600638 659071 707028 712825 693099 662154 641646
18710 641646 624349 618765 638093 681303 729751 737314 723598 697597 652168 622287 603363 587644
18698 587644 576814 572382 536138 461854 407826 377563 349190 326174 310232 293901 291325 302677
18686 302677 300569 301648 301108 295363 266241 253130 230246 212038 205086 197073 198055 203334 199837 201485
18672 201485 195193 182772 173205 175853 182275 184828 188653 196507 186774 178017 152951 146523 175267
18659 175267 185877 189106 196159 183262 152698 153579 180229 191140 188984 182087 201350 208645 213682
18646 213682 233229 220757 199072 175744 165739 158353 157996 160699 165443 162140 170971 180627 165401
18633 165401 166783 190109 204145 207516 223259 218848 207935 207922 215579 233679 235519 247972 271498
18620 271498 289342 283651 287819 305179 322570 315584 290807 285252 289432 287429 288869 298741 314816
18607 314816 331788 346569 343382 370880 390839 380509 383800 374132 368253 369520 375642 380538 381428
18594 381428 406207 426115 442914 446230 455537 482754 528011 557515 545990 523843 505144 483210
18582 483210 464582 454624 462118 456092 437641 411882 381834 351798 330150 300370 275750 276917
18570 276917 299327 311634 314763 308755 310932 307582 292317 273020 253059 258678 268156 274518 283898
18557 283898 288171 277592 293476 321701 349093 368211 365895 375753 366587 348898 339687 332801 361596
18544 361596 375886 373043 363411 370312 389160 399389 404637 394082 394903 418648 435265 445070 454552
18531 454552 474656 498568 497198 495164 494735 512233 519866 514757 523442 523875 510311 504221 497180 490179
18517 490179 479135 477526 478460 492115 484133 464506 449983 446968 461152 476838 482818 496929 508549
18504 508549 505097 506644 538198 555869 569951 585871 623681 659456 680617 707911 763467 811296
18492 811296 821364 826850 848777 833320 824272 823566 831428 843700 853172 857434 851207 857806 865194
18479 865194 881361 896687 909867 897801 858685 832087 809484 779920 760415 746270 743894 740324
18467 740324 739940 776738 790621 801847 842055 888258 918961 951178 994561 1045372 1105175 1136502
18455 1136502 1145084 1173337 1221844 1252076 1283792 1302143 1339765 1377957 1444110 1534745 1629639
18444 1629639 1720119 1797227 1905213 1982764 2024211 2070498 2114144 2157732 2195941 2247616 2302052
18433 2302052 2366646 2439863 2528321 2644252 2778368 2950159 3158039 3408403 3723947 4133653
18423 4133653 4600662 5074066 5572029 6117689 6670893 7159959 7559964 7945825 8430301
18414 8430301 9114821 10134631 11696800 13997683 17179535 21022535 25076622 29392252
18406 29392252 33953908 37786865 39793532 40222551 39518933 37755523 34996327 31604242
18398 31604242 28201507 25259738 22950713 21221338 19987377 19241675 18855704 18373556
18390 18373556 17470749 16258414 14901356 13442706 11901127 10447405 9212861 8271179
18382 8271179 7603326 7179399 6960542 6907788 6994618 7193153 7513014 7939777 8507787 9238163
18372 9238163 10186209 11396995 12936089 14811964 16876122 18992279 21179512 23326102
18364 23326102 24995215 26010981 26666222 27303525 28219953 29812691 32490964 36534496
18356 36534496 42178426 49497573 57875813 66032133 73197072 79142092 82734989 82545611
18348 82545611 78457919 71680118 63368429 54316374 45355292 37390956 30988172 26262119
18340 26262119 22986725 20878320 19599571 18681258 17633000 16334984 14934897 13416589
18332 13416589 11825237 10311227 8961216 7834911 6982277 6374153 5983033 5780400 5719493
18323 5719493 5771560 5941349 6192814 6470492 6693254 6841140 6887422 6748999 6431927 5972939
18313 5972939 5435045 4893252 4386801 3932370 3561332 3300498 3118453 2990389 2917315 2854371
18303 2854371 2766517 2679471 2598737 2509755 2432656 2390825 2378020 2365917 2382639 2427914 2468104
18292 2468104 2516004 2602627 2726779 2813667 2901954 2988545 3065044 3114928 3183714 3266514 3379306
18281 3379306 3536803 3724959 3968900 4267748 4631897 5054708 5493139 5996478 6603911
18272 6603911 7370862 8412935 9876895 11858831 14280869 16694661 18512661 19495104
18264 19495104 19846463 20127799 20881119 22567006 25525526 30242800 37292881 47245865
18256 47245865 60116780 74558829 87623356 95832994 97108114 91757993 81811284 69651565
18248 69651565 57441098 46717910 38256671 32222933 28430706 26648427 26640244 27959467
18240 27959467 29803938 31035947 30734465 28713919 25477769 21782602 18266167 15287122
18232 15287122 12972353 11247206 10000797 9145079 8584044 8221781 8024800 7900098 7804864
18223 7804864 7736821 7669463 7627162 7711649 7988532 8511905 9378802 10728461 12639113 15027249
18213 15027249 17496663 19420627 20287615 20172506 19514687 18985061 19129618 20302303 22623248
18204 22623248 25967948 29956920 34249083 38685046 42939584 46009343 46447309 43536181
18196 43536181 38016344 31266825 24766138 19361007 15354914 12623710 10909624 9913189
18188 9913189 9459695 9362462 9444703 9505884 9350992 8899211 8158052 7231779 6291238 5482546
18178 5482546 4856937 4375303 3994047 3699977 3472477 3269045 3094547 2915055 2731096
18169 2731096 2561072 2400345 2262805 2133394 2024329 1951353 1896508 1886395 1870795 1866281
18159 1866281 1884945 1917660 1930804 1911081 1896732 1892819 1865885 1841029 1828373 1831406 1861962 1911973
18147 1911973 1968430 2013574 2073161 2157807 2244803 2330997 2386025 2465747 2605197 2775693 2954916
18136 2954916 3102665 3231691 3359909 3529785 3727374 3983181 4338351 4807118 5350413
18127 5350413 5921666 6587701 7423286 8559173 9991503 11685553 13756056 16599824 20782249
18118 20782249 26763009 33981720 39831647 42321156 42461814 42095913 43322129 48345387
18110 48345387 59162807 75908764 92158906 96718237 89074397 75584901 61226413
18103 61226413 49667366 42788840 40810444 42057921 42799569 39961803 34336609 27780763
18095 27780763 21620696 16616209 12965968 10453516 8707052 7474569 6590312 5945021
18087 5945021 5460645 5027753 4660689 4310098 3964221 3651359 3362650 3125647 2948927
18078 2948927 2789232 2662699 2563881 2443807 2334221 2194818 2045554 1944701 1864102 1799665
18068 1799665 1740451 1678952 1630916 1560952 1479877 1416236 1366125 1327758 1306728 1283248 1244388
18057 1244388 1229311 1213681 1211312 1221600 1242717 1264601 1298310 1356274 1433942 1517143 1576758
18046 1576758 1633044 1654177 1691275 1738017 1792478 1839706 1888239 1943445 2004127 2042498 2061851
18035 2061851 2112187 2197742 2295181 2363182 2400990 2416410 2415311 2402331 2403839 2369519 2340289 2353292
18023 2353292 2381367 2408214 2430612 2460803 2501173 2560162 2624377 2706975 2780234 2874213 2991117
18012 2991117 3142584 3310107 3506506 3755633 4102259 4534744 5036030 5692839 6566970
18003 6566970 7659284 9037486 10836473 13173037 16423785 21061831 27374505 34712839
17995 34712839 40792080 43740323 44440635 45029512 47277820 51597006 56397330 59626412
17987 59626412 60395992 57911073 52744596 47067366 42827284 40855365 40131158 38241823
17979 38241823 34112860 28588231 22840764 17749960 13693736 10735059 8646153 7156293
17971 7156293 6055764 5210233 4547472 4019395 3589206 3245826 2977801 2778175 2595847
17962 2595847 2425940 2277651 2166312 2059407 1950155 1868351 1798132 1731013 1664837 1584341
17952 1584341 1524923 1454554 1365864 1327825 1284938 1228675 1173296 1114625 1061189 1019678 998242
17941 998242 991605 991344 978473 940917 936589 955122 974670 980114 974540 941614 896886 883063 845849
17928 845849 804578 787379 753959 707255 681011 661153 635536 606032 577018 543076 545946 543156
17916 543156 545002 538419 514623 503631 500155 499626 467026 449534 431903 424735 441892 441618 449520
17903 449520 465549 485168 503083 497682 517891 514137 528149 540353 545590 528665 516620 514689
17891 514689 507719 505105 511696 519231 520587 523920 557495 598885 624259 628257 604116 565345 547095
17878 547095 550070 544898 535771 543146 557978 565678 545477 518406 489910 477491 474668 481278 474034
17865 474034 476821 482501 484361 482462 477067 464306 454124 441132 444529 462680 469608 464210 462460
17852 462460 465049 478835 499626 521938 541169 539714 547687 540613 541098 560040 558054 564320 590030
17839 590030 585160 585305 597407 599965 603927 636432 659320 708270 766163 836492 905641 1030704
17827 1030704 1220736 1473644 1726870 1919044 1979231 1967105 1932569 1944338 1987199 2014456
17817 2014456 1946417 1767436 1567613 1349992 1153770 994428 859830 751241 670232 621853
17807 621853 594740 551943 505092 474782 454511 413081 379006 368515 343055 315351 296729
17796 296729 293061 311089 334535 341763 364461 366481 349504 317474 305138 293116 289241 266437
17784 266437 241090 232760 230465 249683 261692 280838 280268 288745 292921 307587 322308 309187 301894
17771 301894 302350 291107 304583 298189 290617 271851 273447 286372 289811 295335 293695 308015 319774
17758 319774 312081 310198 325739 359410 379090 409182 426635 427814 448086 451176 423491 411724
17746 411724 387544 364510 340689 344848 376705 418343 455611 497357 558897 580022 566969 512405
17734 512405 446579 376744 312813 285777 234924 205693 199113 191218 187578 199103 208262 225524
17722 225524 221933 218328 224145 241316 236946 234847 224302 208268 198255 183269 177718 180933 174885
17709 174885 176285 208487 236383 255995 285140 306431 341756 374788 408058 404867 383288 365721
17697 365721 345299 324510 292215 252404 225870 233513 233165 220375 204436 204335 220495 236453
17685 236453 272070 312790 369032 398434 387121 357845 312258 274398 274108 263187 237034 205438
17673 205438 171305 178586 193373 159845 143968 162805 163508 176874 187437 173906 167372 161625
17661 161625 166528 163236 150940 145386 157188 158485 134561 148975 153926 174042 199968 218871
17649 218871 231633 233816 224357 236092 259380 270914 267420 249234 236532 227205 228657 231183 257637
17636 257637 278257 299393 313179 334984 377909 394132 384303 368266 352735 322520 278436 240412
17624 240412 225099 197819 177985 180792 174642 157074 162631 181991 183072 171350 165868 158493 160361
17611 160361 142498 130122 115147 98107 80912 79952 60774 51162 51176 64652 85809 110471 88469
17598 88469 68480 86154 90918 79793 68996 80377 93851 101597 113355 120350 126762 124417 104176
17585 104176 113949 124324 117616 137780 163137 180766 206041 227228 248172 247766 232421 212010
17573 212010 195471 175940 138340 90449 79421 92796 82368 61036 51801 65195 72203 68418
17561 68418 69782 93814 121237 115604 93218 63965 41454 25539 31031 47783 48963 39112 32164
17548 32164 43992 32855 16869 22917 43518 49331 55349 58562 59933 71306 79666 68985 60637
17535 60637 70323 97928 104278 90842 71405 53820 47899 47423 48445 49983 54476 67948 78063
17522 78063 88725 86824 72166 63852 71899 82260 95501 100397 95556 126345 157428 184341 235880
17509 235880 265525 263244 247792 248264 256787 290074 349632 399840 410513 395311 354121 328470
17497 328470 315691 316144 332737 352198 384174 403213 397318 386524 385792 388012 369093 333666 306603
17484 306603 285796 270069 271861 253046 239496 234812 218004 205472 192396 166538 138317 112453
17472 112453 103079 80647 51997 37102 42828 63869 71389 57909 61147 43152 47958 45741 23140
17459 23140 22284 36043 55498 49910 42003 34533 39369 49642 39441 47092 51340 63014 89388
17446 89388 109350 129036 156902 174454 193772 222425 245030 261632 239107 200220 175550 177857
17434 177857 160883 155045 135598 115234 104022 109600 104728 91735 72846 78197 90662 105371
17422 105371 115044 82383 57525 51296 34190 20738 27400 35902 34513 32916 33750 37713 27968
17409 27968 30319 14780 9287 17301 28832 44017 48205 46755 40692 43667 45685 42294 47483 62976
17395 62976 72283 67001 81708 102134 147691 189908 205907 215640 233238 236087 248872 273874
17383 273874 288031 296097 297310 295235 266624 236214 211845 192934 200724 200223 182998 162978 116730
17370 116730 85575 70151 53041 57996 49832 46758 56731 33933 16627 7925 14244 20351 19432
17357 19432 1542 -4388 980 8587 21889 21249 5675 519 -1974 -11794 -1930 -7883 -13080 -11788
17343 -11788 -5279 8306 2825 -9403 4199 10018 13427 10500 2434 24051 12685 -697 -1056
17330 -1056 -6120 1417 27659 31579 24714 6750 -10337 4207 6296 223 -32554 -28654 -17098
17317 -17098 -23673 -25422 -15024 9241 30440 16950 7682 -108 -14773 -3851 10839 14964 17968
17304 17968 19946 19515 14803 13488 14387 5913 2150 7563 26055 40415 15446 -2770 -11740 -9948
17290 -9948 5851 19839 18951 5930 14871 3224 3259 3474 -17056 -18379 -9385 5355 -5749 -12388
17276 -12388 143 16830 20362 22461 33336 32327 7514 -3886 -12280 5341 12854 14945 11227
17263 11227 7285 -336 7713 19818 32301 38799 57409 55866 52022 53551 59111 47893 36996
17250 36996 34216 24573 24248 52327 72881 88468 90123 88433 75443 65833 67403 88852 103252
17237 103252 126415 159447 184106 223843 301124 351526 411816 500880 562441 581321 559899
17226 559899 505769 430513 368021 336543 304209 272970 252609 242180 239999 228136 221457 197801
17214 197801 173747 178916 172011 150189 131265 101836 97274 116607 118563 97940 93915 93158 95365
17201 95365 89635 91624 84669 78911 71638 59290 72296 80952 71639 64850 79012 100270 118394
17188 118394 141416 174939 183375 186802 207139 203592 186337 192536 218227 246676 289374 329516
17176 329516 389360 443428 481802 501580 488564 452990 404057 322353 240656 183036 152197
17165 152197 126921 90840 89627 68484 59636 47178 54721 68349 73702 74693 58958 64962 81344
17152 81344 79871 79060 66802 59012 57936 43128 36679 17876 -1496 1258 21042 17380 -3621
17139 -3621 -21778 -22635 -22621 -22558 -19060 -13853 -7222 -10117 -5014 -106 9543 19091 17639 10835 6389 -3282
17123 -3282 -1310 5362 115 -12281 -9716 -22204 -21487 -8070 5419 3526 -12868 -17055 -17175 -15855
17109 -15855 -14895 -2086 -2104 135 8489 -8991 -27301 -13136 -2811 -3113 -2758 -16947 -18552 -6033
17095 -6033 3010 -5292 -16968 -9241 -8930 -6426 -2701 5719 8479 4377 -8384 -8706 -18330 -33579
17081 -33579 -40757 -43213 -54362 -54843 -54966 -41083 -39449 -40588 -43770 -21051 -7043 -8305 2329 8476
17067 8476 -87 5687 3505 -2977 -35853 -36592 -17747 -10186 -33874 -34220 -19547 -13306 -9653 -2973
17053 -2973 -27281 -29200 -40916 -40753 -32486 -21542 -21818 -31017 -39600 -32885 -28955 -25665 -10114 -11923
17039 -11923 2306 20307 6243 17645 13251 5200 -4135 -8963 7779 17937 12092 5263 9417
17026 9417 -1175 -27820 -24501 -14797 -26408 -27919 -17766 -16525 -21313 -10186 -3788 10069 6564
17013 6564 -5974 -13815 -23963 -24840 -21067 -13216 9332 2146 -15963 -18611 3762 18640 9917
17000 9917 7348 14988 21584 13075 24608 49355 67811 82773 97590 87244 77467 75156 76622
16987 76622 63614 56140 35789 28577 26148 17252 -7705 -40160 -32472 -8652 -2350 330 -7002
16974 -7002 -5156 3793 10290 17643 31678 25878 11557 -5412 -25817 -21944 -16095 -14972 15559
16961 15559 17603 16513 6952 -7760 -17284 -22865 -12079 7312 8302 -11001 -25301 -36229 -40674
16948 -40674 -36824 -42866 -39918 -40893 -27424 -38034 -61414 -62414 -37170 -18804 -21472 -17039 -4888
16935 -4888 -9790 -12766 -4834 -10223 -19499 -27276 -20021 -20029 -18443 -2214 -273 -2348 -2860 -1035 4102
16920 4102 -2807 8963 18263 7081 4601 -3629 -17019 -13095 -10557 -20364 -13820 -7120 -4314 1970
16906 1970 3297 -5798 -1513 -13925 -31245 -28527 -9008 9997 11716 2659 5484 -9467 -22807
16893 -22807 -27282 -16820 11384 -2276 -8252 -3367 12393 22855 26019 16649 7731 7656 -6908
16880 -6908 -7796 1846 -1265 -6088 -19609 -865 12105 -1888 -16745 -14836 -7461 -9912 -30846
16867 -30846 -24076 -12481 -7462 -12653 -16541 -16234 2207 19474 12808 8024 -20604 -20684 -31563 -26016
16853 -26016 -4509 -10773 -17259 -17227 -11321 -6876 -22450 -35945 -12402 -3087 -15153 -20385 -8082
16840 -8082 -2891 8260 4548 6138 14529 17057 5949 9725 -5967 -21624 -16321 -21186 -44792
16827 -44792 -33721 -4040 6069 16629 22246 -5313 -32505 -41866 -30902 -24502 -14601 -18100 -10375
16814 -10375 7925 13298 1000 -9444 -19034 4505 -6766 -12805 -26172 -14098 -11359 -11461 -17317
16801 -17317 -11296 1926 -15749 -30744 -25214 -21660 -24420 -20276 -16368 -24980 -40912 -59883 -65544
16788 -65544 -68187 -39328 -13328 -9851 -36139 -45256 -39172 -45883 -40048 -36811 -37434 -35115 -20024 272
16774 272 -11734 -4851 3066 -6776 -4861 -31151 -37546 -31933 1583 1449 -10917 -23943 -10151 11385
16760 11385 17536 889 -11807 -22790 -26175 -27528 -17500 -14219 -905 1657 6370 3100 -3507
16747 -3507 -13188 -31300 -39803 -34694 -11500 -5647 -9419 -9928 203 11065 -3884 -21169 -12358
16734 -12358 -7711 -4234 -29799 -33220 -26575 -27602 -22085 -29822 -21399 -9140 -14047 -19074 -33680 -28027
16720 -28027 -11918 -412 -10518 -18967 -15941 -4861 -20759 -12866 -4521 -20763 -25464 -1059 -3499
16707 -3499 -31635 -11836 19936 33368 14997 8983 4900 -14974 -20304 -32339 -38800 -27140 -15504
16694 -15504 -22107 -16358 6611 -4477 -18488 -27332 -23856 561 6502 3794 -3075 -1398 896
16681 896 -5128 784 2840 -10108 -15772 -4468 -11429 -3086 -2531 -10056 3283 4786 -17874 -21907
16667 -21907 -33344 -48242 -46209 -40618 -36118 -19056 -13995 -10661 -28255 -28254 -12053 -10098 -14422 -6507
16653 -6507 6832 -3229 -11832 -15978 -26466 -30498 -23581 -10116 -17649 -28573 -24051 -19573 -29291
16640 -29291 -23941 -22813 -28787 -33968 -37824 -32677 -25359 -17566 -18566 -28018 -43836 -52804 -58431 -44177
16626 -44177 -24820 -15789 -12903 -23168 -21267 -16297 -17493 -17007 -6611 -18780 -25678 -17433 -10347 9739
16612 9739 19813 16571 9165 -4696 -22669 -28236 -36546 -43111 -33879 -15355 -14237 -7024 -10674 -3395
16598 -3395 1077 -1600 7139 7296 -7674 -5681 -23711 -44114 -63963 -39263 -27081 -33462 -39805
16585 -39805 -66262 -49278 -16729 -6611 -18367 -14784 -607 -15188 -23429 -17215 -7973 14202
16573 14202 18623 9836 13095 -3008 7630 -701 -19471 -22694 -18901 -3645 -4923 -34848 -38813
16560 -38813 -25759 -30765 -35936 -22180 -25518 -36963 -24887 -3482 5911 11600 6433 -1882 -2863
16547 -2863 3637 819 -1665 -22086 -25426 -34065 -23634 2943 1120 -17513 -16061 -19490 -20690 -27342
16533 -27342 -31599 -25965 -19846 -31120 -27821 -32114 -39229 -42016 -14600 4677 9429 3267 -3399 -14642
16519 -14642 -26280 -17523 -6224 -27183 -37878 -17270 -11206 -20417 -11168 -5650 -13506 -3964 -7519
16506 -7519 -10592 -14322 -18754 -10690 -1660 -931 11019 -816 -12130 -16417 -10454 -14107 -23995 -31421
16492 -31421 -25268 -28423 -8925 -3550 -13734 -25297 -30103 -22980 -5108 -5182 -5411 -25559 -38699 -46856
16478 -46856 -45445 -30407 -21826 -18159 -17082 -7505 -6845 -4314 6414 1829 -18689 -24063 -33578 -37222
16464 -37222 -33426 -11111 -13434 -21152 -14261 1509 610 -20731 -26269 -5177 -430 -16929 -16833 -23965
16450 -23965 -14528 -20191 -17902 -10333 -14952 -24692 -31163 -28755 -15573 -7448 2306 -11042 -17380 -8780
16436 -8780 -269 -1835 -14930 -19536 -4373 9055 2644 -14390 -30839 -38762 -10794 1782 2690
16423 2690 -2878 7340 -3119 -14477 -33926 -41318 -37142 -15265 -16033 -25375 -24425 -22751 -30940 -25935
16409 -25935 -40945 -58988 -47828 -36460 -20985 -7831 -17766 -31195 -42319 -38683 -15191 -18618
16397 -18618 -16046 -5504 -6704 -11627 -29690 -36406 -40263 -36372 -17813 -17024 -37504 -49571 -39208
16384 -39208 -21202 2390 -15901 -33036 -31523 -20079 -8938 -2525 5997 -12993 -7536 482 -560
16371 -560 -9837 -1986 -3878 -1424 7020 114 -2227 -13921 -17530 -18581 -20131 -19809 -36024 -34788 -25121
16356 -25121 -16557 -4401 -2572 1898 -19167 -28010 -29419 -28909 -31634 -42045 -21194 -3935 -626
16343 -626 -12672 -1678 -20653 -33458 -16952 -18082 -19873 -10687 -12261 -22786 -38401 -31474 -15032
16330 -15032 -10563 -17554 -12280 -11243 -34047 -36572 -29874 -21089 -27967 -17006 -9098 -8985 -13751 -11374
16316 -11374 876 14491 3888 -17193 -25933 -8424 19877 18821 -2148 -5566 1056 -1576 -9886
16303 -9886 1988 4504 -10232 1731 -11811 -29584 -42667 -34003 -27341 -34762 -15549 -13537 -14951
16290 -14951 -27253 -33765 -21205 -32404 -40028 -36687 -49463 -67737 -36709 -17757 -18522 -23651 -35152
16277 -35152 -27889 -12440 -28833 -39453 -36984 -36904 -28332 -10692 -6694 -9028 -22863 -33808 -30987
16264 -30987 -22666 -23728 -9771 238 -732 -13800 -31206 -22507 -11119 -11807 -13353 -15476 -22731 -11098
16250 -11098 6405 20422 12487 -5772 -41642 -34144 -36353 -42099 -44006 -52376 -36935 -35516 -28888
16237 -28888 -11912 -11269 -22725 -24953 -17183 -26215 -16284 -17044 -10082 -11169 -8278 -3063 -486 14052
16223 14052 15769 300 2356 322 -9914 -19003 -41732 -36531 -20904 -6132 1120 12465 -14631
16210 -14631 -14528 5645 8747 19375 23115 -10554 -28567 -11985 12718 25256 34655 28781 21126
16197 21126 33158 41809 36035 26288 8359 8815 27106 24240 25272 11717 8712 9623 15485 12670
16183 12670 1356 4265 -2245 -5856 -10592 -21101 -16529 -3158 5029 -5832 2677 -1060 -18570
16170 -18570 -19035 -16 -16833 -16922 -6941 289 -9303 -9603 -26532 -37317 -30938 -25039 -34346 -40974
16156 -40974 -40193 -29172 -4739 1175 -6211 12802 16053 7753 15 -13578 -26972 -28302 -29781
16143 -29781 -27318 -14460 -8075 -9089 -18587 -3226 9086 18985 23552 -3215 -25525 -27377 -28351
16130 -28351 -5103 -7518 -29887 -34775 -21522 -13981 -24627 -27579 -42444 -38328 -34768 -39552 -21867
16117 -21867 -6304 -1413 -4993 -16339 -17893 -1990 -12981 -22763 -35118 -20938 -6427 4400
16105 4400 12758 -11411 -15145 -16805 -7668 -13747 -17157 -13385 -10498 -24325 -14159 19760 27803 22655
16091 22655 29391 17478 6353 -9918 -25295 -22839 -11567 -4800 -24754 -40672 -37629 -25976
16079 -25976 -30193 -11267 -9496 -8023 -3420 -13485 -3195 -190 -8620 5566 6245 8718 5087 -563
16065 -563 -8914 -14041 -765 3284 5153 1139 8457 -2232 -17934 -11051 6629 -10782 -36379
16052 -36379 -24448 -12953 -696 8454 -5453 -31647 -29252 -30115 -36414 -38423 -35279 -33175 -29568
16039 -29568 -39345 -18946 -20253 -15991 7546 5766 564 5386 1106 -17476 -52796 -45911 -17445
16026 -17445 -2791 -9869 -5138 1798 9883 13059 5747 -1819 -12296 -26256 -10338 -10605 -6835 2039
16012 2039 2163 -3060 -23289 -15929 -11637 -7297 -602 -14967 -9164 8347 6644 8761 3321 -15607
15998 -15607 -33277 -20046 -28021 -20593 3856 22086 20904 -3114 -5832 3231 15971 37888 39710
15985 39710 31131 29461 23929 20882 -6930 -14451 -10431 -15089 -11163 -27088 -42539 -39718 -35552 -22412
15971 -22412 -480 1848 -12848 -11703 7642 30686 29024 12141 6318 -10593 -10713 -10826 -21964
15958 -21964 -2576 11397 -8166 -16524 -15103 -21976 -26120 -29510 -10070 -7212 -12727 -14197 -11903
15945 -11903 -23641 -16142 4637 -13403 -22422 -14936 -7997 2435 -1167 940 5067 11871 13518
15932 13518 12390 -2230 -20561 -42404 -28868 -42820 -55995 -38599 -3741 7832 -5006 -9135
15920 -9135 6427 -4035 -4904 4428 8282 -5671 -9849 -5601 -15532 -14866 -31024 -35406 -21929 1237
15906 1237 16343 -7874 -25067 -44074 -58635 -45130 -16286 8169 9503 -6376 -22623 -18328
15894 -18328 -6783 -6081 6545 1480 3497 -11178 -39041 -50189 -48494 -34382 -7006 20507 17123
15881 17123 4376 6201 -8218 -17112 -22713 -19482 -2527 -7958 -21999 -17277 -20246 -19834 -31727
15868 -31727 -43208 -27111 -18980 11085 16356 9162 10207 13469 12012 19196 4258 -17930 -22698
15855 -22698 -8355 -9047 -10492 -10341 -6597 -3923 -12 13080 6692 5431 13770 -2708 -14800 -13154
15841 -13154 -16879 -12274 3791 -11529 -27887 -26392 -16092 -20904 -30295 -37122 -35484 -37008 -21374
15828 -21374 -6748 -8926 -22391 -30996 -917 -1839 -21023 -29036 -3502 20349 19269 -6876 -4840
15815 -4840 11181 -1617 -12663 -8060 -14932 -30807 -27658 -21609 -32709 -28486 -12970 6863 18931
15802 18931 16040 3830 -5416 2104 -3350 -15174 -17688 -14576 13458 28520 10698 10547 930
15789 930 17665 19037 64 -3099 -4261 -14057 -26428 -12991 -12986 -14862 -11136 -12137 -19165 -22000 -25906
15774 -25906 -22671 -21966 -29010 -28939 -21314 -33460 -32682 1083 25084 16512 9589 4437 -3571 -2069 1320
15759 1320 -1415 2334 28557 31944 17936 21869 8808 5085 2406 -4720 -6540 3947 11182 17017
15745 17017 12997 5961 10330 -4877 -7785 -11998 -30535 -41153 -34833 -31011 -35567 -20511 -6635
15732 -6635 -1493 10626 6190 13050 21754 -4761 -29212 -18382 -9623 -16401 -33847 -39613 -36336
15719 -36336 -33489 -27619 -20369 -25399 -28487 -10483 8780 17879 8164 -5581 -20654 -8290 2521
15706 2521 10961 8222 2033 -13896 -17817 -10815 4765 -2422 2211 13517 29925 26325 30365 23194
15692 23194 6641 -7225 -17398 -13925 -17261 -24700 -19830 -18744 3594 13003 19069 -1646 -42872
15679 -42872 -34525 -26594 -6898 -2027 -2789 -19466 -10898 3869 -8980 -11213 -11510 -22614 -28164 -20882
15665 -20882 -19428 -4302 12667 20183 -6133 -12135 -7292 -12589 -31680 -40779 -41823 -43845 -36310
15652 -36310 -30724 -25922 -24345 -14670 -8498 451 8843 -2945 -23099 -26828 -32450 -24163 3696 9616
15638 9616 -2445 -5685 12468 27753 31849 22752 20023 10545 -1800 -2072 -9647 -6774 16139 12067
15624 12067 2939 -5835 -2000 -1851 -10809 -12429 -649 -2014 -8689 3424 11846 -3916 -668 -7045
15610 -7045 -4316 -14645 -23332 -12861 -11679 5329 18489 8139 -2954 1205 -18293 -27025 -23405
15597 -23405 -24994 -34504 -42096 -53950 -42560 -34313 -26949 -23628 -20003 -16096 -33844 -39331 -57063
15584 -57063 -49057 -28330 -7605 3012 15231 22838 21564 -1201 -1763 2936 -15861 -5746 -6508
15571 -6508 -21353 -14312 -18796 -19567 -5645 -7148 -36700 -38071 -13629 3793 -7474 -3446 323
15558 323 1820 3855 21 -3381 9988 -11384 -352 190 -9326 -17187 2023 10473 6556 6277
15544 6277 7922 -15315 -21051 -19650 -33625 -28313 -27045 -29265 -19006 -4607 -1313 -8466 -17006 -18248
15530 -18248 -29750 -23044 -5262 -7412 5234 20433 22098 -4067 -24608 5395 11400 222
15518 222 5764 7719 -2196 -4884 -18309 -15683 -8842 -19377 -21111 -39154 -26642 -23151 -27825 -29411
15504 -29411 -16741 -8546 -13930 -12425 -14933 -17925 -12873 -11408 -18235 -13764 -9261 -2593 -23345 -34805
15490 -34805 -45228 -41450 -26840 -34888 -28597 -10893 -12152 -8513 -3580 9227 5787 440 -1423
15477 -1423 -8991 -8218 -15086 -6714 9907 5661 3564 -6388 -25514 -10912 -4904 -13866 -13590 -6046
15463 -6046 6739 14377 5300 -8341 -17434 -15731 -9278 -12436 -14891 -39152 -44918 -27582 -29726 -28952
15449 -28952 -22518 -17195 -12621 -32204 -44851 -8600 2952 11435 24845 20986 -9811 -23479 -16473
15436 -16473 -5981 -5338 -14673 -15491 -4406 -5194 -17120 -14587 -14435 -8861 -10280 -640 -1686 -9273 -10754
15421 -10754 -14146 4268 1718 -13148 -4698 13522 7941 -4569 8003 648 -10944 398 -2925
15408 -2925 -1928 -1367 326 -3347 4523 3770 -3114 -7630 -12330 -4463 3928 1571 -12794 -27837 -12119
15393 -12119 -13816 -5190 -6047 -11918 -15738 -12797 -21439 -5870 15703 16899 11134 11370 -2826 -1520
15379 -1520 18146 19218 28520 35528 17150 -6432 -9150 -9805 -15389 6008 20039 21129 12329 -773
15365 -773 -12392 -16834 -20141 -20862 -13756 -15616 -10794 -259 -3623 -7659 -3541 4252 16938 17695 29580
15350 29580 19294 18629 11177 989 -5692 -17530 -11617 -18025 4525 -6567 -17996 -21003 -10683
15337 -10683 1499 16439 4142 -10944 -10327 -15905 -8212 -6601 -12805 -14200 -15429 -16206 -21999 -28234
15323 -28234 -19787 -18085 5418 10297 10892 12367 9365 -1473 -19613 -30214 -38450 -23591 -8259
15310 -8259 10256 -3293 -10790 -2508 19483 2422 -11917 -8622 991 1175 -15239 -14477 -7836 18762
15296 18762 24970 29332 18571 715 -6793 -8471 -15562 -16419 -14491 -23555 -23954 -14855 8906 18477
15282 18477 15744 7060 13313 2276 -1801 -25264 -25914 -24196 -30139 -25583 -8440 -9607 -14101 -25674
15268 -25674 -43006 -41360 -23235 -12937 -11064 1883 -2697 -20878 -14040 -6634 16204 27053 34730
15255 34730 9602 -5245 -5199 3379 25895 28041 8005 15886 23855 18391 27929 31830 490 -30977
15241 -30977 -43252 -39891 -13856 8422 5663 7469 3662 -2651 -7133 -11312 -8798 -17310 -17874 -7664
15227 -7664 -20405 -23256 -15705 -17288 -26294 -20637 1262 10078 369 -1756 2885 -4154 8268 -21
15213 -21 -14077 343 11448 7393 -9586 -13516 -4470 1653 -9621 -8369 4549 -4490 68 1850
15199 1850 7325 4963 4462 -4888 -3329 4065 1748 -9364 1658 -10109 -20313 -15476 -2199 2010
15185 2010 13120 10190 -6151 -6840 -9202 4332 25027 28052 11680 12953 18668 3543 -4809
15172 -4809 -6947 1922 7291 13326 3843 -9016 -2983 5372 5125 11804 -8460 -1492 3648 -11742
15158 -11742 -26129 -24643 -7653 -7482 -8261 -3322 -2672 -2952 -9758 -22467 -22312 -22135 -12481 -14586 -20022
15143 -20022 -16550 -13885 -23787 -26855 -16359 -15822 -2517 18098 15009 8528 6120 3440 -5795 -11419
15129 -11419 -7156 -734 12659 18905 6028 -10672 -4939 -13301 -9365 -7513 -14389 -4771 13787
15116 13787 15870 7747 -2479 9185 7812 279 6843 7226 -9005 -19952 -21575 -18243 -28341
15103 -28341 -7024 -6454 -23255 -3896 -3596 -8375 -5958 -16236 -32211 -21878 -19261 -23876 -18909
15090 -18909 -13313 -2578 -5515 -3381 -3282 9294 4521 -6047 -12583 -11026 2653 -11129 -9835 1445
15076 1445 -9189 -9808 -13455 -765 19878 7043 -13715 -13192 -12745 -19909 -6292 2964 18505 8668
15062 8668 1158 995 -2672 -22747 -30010 -21262 -9536 -14380 -12305 -1908 14200 16484 -17943 -16795
15048 -16795 -15848 -11054 -4321 -13038 -26394 -11711 611 -29293 -35247 -19651 -23911 -39174 -30364
15035 -30364 -27578 -29409 -7736 -2060 -2339 16944 18928 12093 15380 17637 10185 4732 21115 24949
15021 24949 28864 44645 22729 18006 29084 36077 17164 8808 8683 599 -658 -14812 -2029
15008 -2029 17719 22784 19907 9736 14286 14749 17974 17455 8212 13328 21002 -9238 -17897 2498
14994 2498 5826 4199 22508 22738 4701 -11064 -4399 -1632 -8053 -4228 9839 10579 25581 30451
14980 30451 248 -6148 5498 30976 41675 30504 26563 26078 13000 11797 9438 3292 -3894
14967 -3894 -6222 4132 10047 5601 11459 20279 11604 -14429 12945 36922 22038 11461 31033
14954 31033 46833 59118 68555 57067 57287 81439 89718 80959 68112 56378 34916 17898 6952
14941 6952 5505 -12140 -3315 -9088 -21632 -26647 -16861 -4259 3957 -10209 -28544 -33449 -22659
14928 -22659 -11335 -9711 -11597 -28067 -36066 -30099 -19976 -5703 10334 -2160 -28 4447 -11539
14915 -11539 -5293 -6662 -13322 -9901 -3144 6575 6662 40170 46925 36051 14934 14175 -6113 -8365
14901 -8365 -9994 -31528 -9873 5091 6009 7148 14993 16994 17180 16275 23976 7348 -3673 -17531
14887 -17531 -12313 -10807 6553 -8597 -25466 -5292 2414 -16446 -15077 -17737 -31485 -38703 -28568
14874 -28568 -22524 -26027 -45227 -32563 -25497 4653 1982 -14218 -15683 -3767 7970 33 13505
14861 13505 5805 5519 11483 4125 -2603 -4824 4507 4262 -3871 -2572 -4678 16576 28566 8590
14847 8590 -142 16803 17286 26386 23500 15016 23336 21277 -2199 -11707 -16767 6873 34260 29941
14833 29941 25131 2517 -13282 -12930 -9717 -2308 -7331 -3986 1742 16213 21308 19433 6471 2447
14819 2447 5198 3371 1087 5509 -1109 2018 2743 -10977 -16741 -22186 -7856 1770 -16216 -14128
14805 -14128 -16864 -2121 -7882 -9750 -9528 -3244 -7113 -12108 -19029 -9358 -1951 5865 25707 28705
14791 28705 20230 7661 3673 13585 17789 14860 21186 14965 12598 23063 28776 22455 19260 8042
14777 8042 9645 5003 6661 24996 24790 9554 11217 1474 1007 -7779 -2436 12087 17788 7795
14763 7795 2397 -9601 -24145 -10080 3393 7969 -10088 -23932 -18358 -2758 19367 -763
14751 -763 -13773 -1176 24174 33325 29017 36503 29371 20318 9219 962 4982 30515 37233 28792
14737 28792 13255 601 -6849 -9986 6252 8950 17307 18251 -7234 -28297 -24747 -7331 8567
14724 8567 4491 5410 10675 13230 18288 29127 15972 11115 20547 39588 33640 17722 9591 10304
14710 10304 13655 9934 12918 12104 17848 36401 29742 6853 -2504 -10846 -12896 -9101 -6909 -5418
14696 -5418 3640 27439 36809 27805 11000 13339 25734 9172 -15484 -21709 -11348 -12166 -9182
14683 -9182 -25415 -8569 -9742 -21463 -31400 -23976 -19376 3691 -7486 -34709 -40395 -35619 -22366
14670 -22366 -14745 -8315 15431 28237 30110 32925 48783 60761 49533 60721 60541 82218 117087
14657 117087 125961 147892 177520 213439 247114 286330 321698 339167 330179 335174 318970 314223
14645 314223 301437 294512 283065 248215 200463 164133 140844 104010 84361 73134 64501 69853
14633 69853 64077 26717 -550 -1322 5206 14310 1034 17727 21631 34131 39002 18935 -451
14620 -451 -4422 -11705 -14086 -13342 -8918 -7185 -12761 -7121 -816 -3266 -23058 -14828 -8080 -10582 -3636
14605 -3636 11564 20273 27141 24602 6953 3313 -4523 -18184 -15273 -30395 -35850 -23090 -6089
14592 -6089 -4667 -13262 3700 30643 6911 -4343 -16130 -21346 -21778 -19714 -13636 -27771 -10390
14579 -10390 -4802 6125 4769 -8495 -1282 8306 15466 9310 -6006 -16357 -7988 -7616 -11118 -23061
14565 -23061 -12328 -24350 -37859 -27021 -23258 -21065 -6431 6061 12686 22365 5044 12215 -2445
14552 -2445 -4302 -1709 13456 15934 21981 18917 13588 -3088 -28136 -21762 -3734 -2192 -4890 -2266
14538 -2266 -23460 -35427 -27384 -10353 12530 25158 15415 10213 -1269 9316 14711 7795 -454
14525 -454 -10749 11415 19495 12827 2831 8312 8438 1076 -2517 1385 -19108 -21357 -15870 -26167
14511 -26167 -23463 -7544 -7272 -12690 -24057 -28168 -9696 2818 -1849 -3223 174 -9090 -16302 3008
14497 3008 21607 8812 -1094 -10863 -6217 -21369 -26430 -10391 20 7834 10262 -15836 -16188
14484 -16188 -19294 -22702 -25408 -3897 -178 3874 8958 20677 27366 6005 -1328 12890 -4720
14471 -4720 -25397 -30341 -9480 927 2215 -2103 -17300 -8438 903 10306 22611 20068 14357
14458 14357 -7159 -10038 -17531 -12497 -16915 -19353 -19425 818 11885 14019 13003 44873 45536 17749
14444 17749 3839 9263 8050 3962 -1242 -5316 1515 777 -10548 -26773 -16818 -3343 -4840 -4133
14430 -4133 5026 4230 12102 9115 -796 -1417 13083 2935 -11412 -20210 -11670 -8731 -3233 14962
14416 14962 12070 21103 34483 37837 34810 26944 6029 9011 23853 27915 19548 9757 -1910
14403 -1910 -2068 4702 4394 13738 30144 17212 -14136 -25228 -16275 -13185 -4622 6966 5335 10699
14389 10699 20341 10339 8348 12609 1870 -3984 3899 5576 8742 3773 -6817 -6569 -8055 1619
14375 1619 5852 -5814 -24416 -7202 17345 10964 2916 21333 15059 1534 9636 38573 42402
14362 42402 28530 16160 30625 35975 31238 32938 31663 22980 18585 6024 1538 11127 15403
14349 15403 17748 31318 31035 17977 26941 21326 12633 17854 10511 1250 8225 11943 -4399 -21797
14335 -21797 -20395 7523 11527 4939 5093 3989 5431 17369 16853 15586 26374 24208 36185 33085
14321 33085 32473 40053 39869 31320 34568 16326 7372 -5662 -30865 -23646 7481 20030 12626 19300
14307 19300 4796 -1753 12064 27494 9436 4677 -4730 -5011 1535 7587 30638 32599 17600
14294 17600 11913 15213 10203 -3531 -8346 -2599 -8504 -15280 -10193 3736 -1325 -5321 -381 16821
14280 16821 25168 15241 6284 8977 5562 16663 23578 11980 9641 9455 122 -4617 5696 1555
14266 1555 -15243 939 31926 31983 12198 -10704 -22624 -10548 -4358 744 232 5437 13567 17769
14252 17769 12115 18751 14640 6969 5622 -614 5567 16522 12395 -11143 -4465 6079 6257 7805
14238 7805 10986 6395 -9380 -7710 4533 1512 8361 3984 -5542 -10242 -4678 14638 15716 2202
14224 2202 10819 24139 18032 11492 11013 -81 5705 583 7564 18136 4400 8780 5813 4104
14210 4104 31314 45108 58055 73888 76709 78617 69084 47856 55089 72023 95349 116893 128902
14197 128902 168246 182502 181929 188522 182339 174272 165825 141881 112587 91496 76484 53582 31443
14184 31443 34472 43444 25108 15008 12329 25353 24201 15349 25086 35480 29153 26371 17894
14171 17894 9568 15049 7482 -5821 516 -8713 -1268 -889 3782 -596 9169 16829 23693 16363
14157 16363 8975 17396 23455 17135 14585 9636 29641 44141 37881 33489 36075 32781 25674 26398
14143 26398 23310 4694 31237 59671 61817 72827 79089 106251 131895 165836 210704 268583
14131 268583 324655 382541 462281 536195 588684 611698 614223 589343 545682 515448 471544 404888
14119 404888 348756 287910 245000 195111 138026 115067 90122 91905 91757 67745 59166 56537
14107 56537 53844 43656 37752 27244 -9327 -3368 15052 20335 18890 16090 11766 24646 16631
14094 16631 4433 4612 9537 13607 26872 17922 2083 4182 9587 -6973 -10689 16138 24656
14081 24656 13548 3702 5593 21442 18964 23372 33294 26846 10273 6822 195 -5459 -733 -9326
14067 -9326 506 877 -8827 -1462 18331 31051 30911 16887 12751 -65 2116 5753 6881 -3909
14053 -3909 3524 3210 -12332 -8462 -860 11792 -4329 -13722 4452 14456 13734 29486 29356 17433
14039 17433 16862 10345 -4100 -23327 -23839 -18617 -11141 -1037 4537 3745 -395 4195 -1120 4564
14025 4564 16827 1055 -7239 11616 26938 16338 12247 3064 -10602 -11369 6411 9888 15618
14012 15618 12454 19007 23646 15781 11570 21501 21942 19245 19771 11773 4692 8138 18771 6667
13998 6667 -12106 -5343 11670 28727 42131 41783 15616 1533 13259 39066 50479 62514
13986 62514 69029 73731 90091 96511 97688 117176 124694 136006 150876 143567 148487 151064 161541
13973 161541 166288 148877 129201 107609 101719 90105 63435 41856 33556 35812 39133 34797 21400
13960 21400 23477 29239 38614 33909 19652 19295 19120 31345 22549 -252 8339 15649 11405 2607
13946 2607 -1197 -4304 9046 14593 1385 -561 44 -3315 -12211 -10957 -3062 13914 14150 8357
13932 8357 9274 6943 12060 11853 14827 16068 7109 -6404 -29448 -27028 -20947 -15436 -22985 -19234 -14535
13917 -14535 -10388 5720 11082 25425 26265 8189 -15442 -16540 -14597 -15043 4938 19864 3900
13904 3900 -2416 -1609 -2110 -3883 1303 7114 -6211 -10104 1491 4769 1391 -5394 3513 16710
13890 16710 17146 18712 16585 7559 -10753 -14201 -14209 -24395 -18941 366 -13295 -1776 7679 3680
13876 3680 -5909 -14795 5945 18136 26185 30178 34094 13481 4532 3244 13415 11367 -9334
13863 -9334 3881 22221 8027 -2593 10342 39920 29775 12806 13422 -2104 -13120 -6409
13851 -6409 5110 14668 17611 7775 -8879 7196 6025 3380 2629 7522 26766 24114 -1777 -1770
13837 -1770 21521 27573 20518 6443 3224 5907 16036 17613 1874 -9786 3747 40096 58660
13824 58660 44501 42860 34502 36453 52540 75384 82579 73158 73488 80593 67753 34220 22610
13811 22610 20618 28413 38150 37824 21469 60 -8605 4098 34037 49594 59914 58022 44433
13798 44433 35846 40379 61543 67939 41776 39515 38744 45763 44300 41571 34308 18214 20938 27930
13784 27930 27719 33673 35673 44280 37960 14118 17418 21863 18983 4952 18035 16943 -907 -5109
13770 -5109 -9802 7456 7528 8141 23142 27326 15501 17090 30610 31487 33126 36188 32359 33737 30474
13755 30474 38770 33032 28823 19807 12079 7988 8688 -1910 -4373 -5424 -27055 -28784 -24239 -8042
13741 -8042 7632 2040 -1933 -21230 -34389 -24869 -15503 -29708 -23467 -10403 4401 12926 14673
13728 14673 8438 20413 22256 19689 23197 17652 3680 22389 27254 17000 36258 36725 19276
13715 19276 4117 -8272 -10228 -3728 2430 19151 23565 10423 8333 14764 17578 12799 2527
13702 2527 8851 6264 15626 17490 19473 -5114 -9325 550 15618 19853 5042 -10517 -3832 -420
13688 -420 3688 -627 2090 10978 8465 -536 14273 24159 32916 16604 10192 12940 1961 -10288
13674 -10288 -15465 4042 4200 12591 4592 15662 31092 36479 23884 12251 22541 34019 29477
13661 29477 21761 14103 12903 3901 -9172 -23319 -25268 -10546 -15889 -9938 -7001 -18591 -7574
13648 -7574 -11340 -6290 20848 5351 -6485 -14970 -4709 3870 16731 14640 15144 26132 25526 13877
13634 13877 29703 24523 9970 10561 7025 16454 21723 32604 18117 18253 11973 6150 -1372 16004
13620 16004 34254 19695 19070 20497 18083 -1373 5352 20593 14078 10519 13487 25275 18483
13607 18483 16968 12282 8977 22434 9145 -7240 -1396 10548 -13845 -12064 1473 8138 9930
13594 9930 15786 12773 10283 22992 19933 22666 34571 24524 4043 -8598 -12239 4154 1174
13581 1174 -8788 -1069 3385 4707 5649 -1447 -206 14801 6193 2979 12350 3083 -180 6987 9910
13566 9910 -6489 -1724 -5924 -20519 -3819 32768 42300 38453 39053 25734 1737 -4028 815
13553 815 19103 10413 26220 21235 16695 8621 442 7641 5068 4244 12952 13593 942 -3681 -5100
13538 -5100 1476 5185 21272 21826 8563 21614 43260 38896 24454 11077 5518 28776 42980
13525 42980 38888 33205 21593 12757 25646 18581 24511 23307 15351 19928 14511 -2337 -17479
13512 -17479 -24972 -11017 -4106 -1370 6909 5489 16987 29664 15719 1057 -6348 -14027 -17057
13499 -17057 -13676 9068 20928 16856 -3892 -14501 5824 26614 53662 45411 18666 5337
13487 5337 4175 -6898 -14223 -12701 -20005 -23413 5316 22475 24558 22252 32583 40057 26641
13474 26641 23697 35242 32062 12078 13889 13428 12130 16848 6602 2003 6509 7214 18224 30046
13460 30046 49972 43191 20763 4755 -5691 -13491 -21234 -26375 -38909 -34795 -1517 -7691 -21499
13447 -21499 -15746 9853 45138 42246 21291 2758 12005 8956 342 20724 43197 45674 36714
13434 36714 31658 19894 29977 35806 -3962 -12353 17350 24117 22033 2770 4021 -11947 -4450
13421 -4450 -876 1318 10716 51 -6390 -9254 7337 26369 9763 -15858 -21421 -9493 11436
13408 11436 16003 21436 32751 13571 -20232 -18646 -3780 1750 3935 405 8736 2889 10120
13395 10120 9038 -2053 1080 2754 17853 29059 44418 59585 52519 36991 10581 22141
13383 22141 22206 24348 26831 25823 43027 39117 17362 15787 27337 38538 25656 34565 48965
13370 48965 36241 19434 18580 18480 30630 38688 32398 18754 8042 4243 9517 10599 -13087
13357 -13087 -25447 -14100 -2261 14020 26035 24005 8777 32883 37030 15539 -3657 -9881
13345 -9881 15122 24132 22742 24204 25356 22930 19740 19420 15849 29757 40752 39220 44222 48460
13331 48460 46868 45384 34972 14150 -5534 -279 4956 24793 45559 34228 29240 33570 27398
13318 27398 29782 40436 37561 33954 26594 24993 32489 35005 35322 21506 7233 -4605 -14772
13305 -14772 10091 20910 29678 38288 39181 46504 43617 27960 39599 44540 34249 23019 7248
13292 7248 18537 34989 26830 24113 21549 6978 11454 15860 14800 11529 19103 23549 22547 13399
13278 13399 1758 12547 24352 8979 14184 21903 27360 37068 38447 33459 30319 30461 32051 24793
13264 24793 18405 9889 11253 8066 12925 2076 743 3767 12742 16225 18448 26299 33113 18388
13250 18388 9017 12619 22489 12005 20905 23479 9515 -1308 6271 35192 27036 12206 11886
13237 11886 15613 24182 42268 38640 25053 2003 9000 13418 -8229 -6249 10870 20857 31468
13224 31468 41800 30300 28225 20731 -9199 -1675 32682 41693 22560 17382 18703 916 5244
13211 5244 21746 17040 1667 -8047 8560 -8300 -11061 1045 16200 15678 5391 9305 6182
13198 6182 20753 41546 53384 53158 33920 10097 15811 25224 41734 59360 62509 53668 42076
13185 42076 31637 40542 31459 23352 25627 10898 -14430 -12425 23244 42445 47948 60832 60308
13172 60308 49072 50695 45689 47847 53048 47660 32673 23665 28737 50837 77002 78252 58459
13159 58459 51508 23090 7127 20010 38464 34321 53481 60510 68723 63411 57963 65567 45768
13146 45768 44145 41431 26198 14280 14911 25567 14269 29071 32228 46613 49231 35675 24720
13133 24720 7907 -3394 8578 7176 18252 25035 27425 25340 15769 5786 -139 16586 19178
13120 19178 13916 20190 10266 12162 10220 13004 19964 26843 29602 13620 15520 30206 42845 26885
13106 26885 31378 33419 30238 22092 11918 9466 23249 9900 9974 27948 32663 17090 17630 40484
13092 40484 49621 54722 39831 43772 32774 28504 15553 3044 15022 42196 46603 39164 53484
13079 53484 68140 75202 82467 74975 64860 68016 68644 66432 65467 82039 94719 74225 63791
13066 63791 65684 75334 90193 104661 93279 71152 69827 96186 98451 102286 107220 91359 69503
13053 69503 91843 126162 126883 140609 154100 167398 206746 245457 300631 342862 413986 496577
13041 496577 591074 694255 773766 840725 881985 898790 916172 892965 841331 772516 691647
13030 691647 631680 551306 478790 398676 326362 266182 229554 205481 172776 152490 148113 134056
13018 134056 121427 117149 116585 113878 114937 113938 94854 81794 77208 93174 108623 106437 95247
13005 95247 95444 83359 91474 91039 90600 79489 81394 88648 99977 89084 76019 73703 62307 51904
12991 51904 49635 46885 60701 57489 64612 80569 40414 28334 54196 55879 55824 55289 53550 53564
12977 53564 64216 87526 85677 83708 79981 72671 67162 61437 68775 80083 77354 47538 33440
12964 33440 43137 75709 93962 86479 50940 50222 63714 75185 67205 72215 79568 87069 80604
12951 80604 59248 45689 35962 47859 63974 74010 68218 78410 86593 97278 98169 86266 90230
12938 90230 96797 78322 59415 63501 87583 108924 115099 95122 88787 55674 54941 42127 33703
12925 33703 43195 59670 70807 59626 63229 52798 67083 84731 90016 85523 83602 75104 63987
12912 63987 78959 99345 106329 112296 107472 84457 76528 78944 89841 95793 94456 89531 83610
12899 83610 98020 90560 88110 86884 84626 71887 66393 70687 76664 86724 102599 86766 79663
12886 79663 84581 81531 75379 92868 101563 98813 75543 67807 89862 103333 118487 152604 171322
12873 171322 163944 144831 149708 159882 159984 160479 150187 135977 140746 145316 137410 147316 123801
12860 123801 118037 137155 126169 111855 114201 122796 129053 132497 119763 121397 130341 139680 144350
12847 144350 148812 171466 166133 146005 120386 124065 133838 145362 137628 128889 129181 106382 74937
12834 74937 64837 82789 96096 104356 107603 123309 125034 130937 130966 130678 126470 115319 126298 129224
12820 129224 124362 126494 132544 145889 145455 137631 139031 125296 125508 117177 122675 121185 110733 105456
12806 105456 109917 125211 131329 117510 109123 115880 114760 138622 127943 112048 101489 96252 116745
12793 116745 130986 135031 125562 115967 118152 117184 122462 130015 132486 125393 116603 108786 103680 106072
12779 106072 119001 128500 130544 135821 135184 151144 167420 175359 187621 191742 181068 176918 208666
12766 208666 206259 223111 234457 236652 244872 253082 268366 285303 288099 285594 284321 285983 301953
12753 301953 303989 312543 322394 328167 360031 391718 425299 458115 484679 520416 529430 529915 512003
12740 512003 513116 489970 459173 439056 415407 389209 356656 324096 319789 323557 326582 323402
12728 323402 329969 319877 305864 310516 322632 355967 356975 357100 362095 351816 341911 351674 344656
12715 344656 352182 363844 373232 374027 367646 360545 370401 383655 394508 390043 398817 389601 403684
12702 403684 439528 463247 463583 492025 518567 536932 556159 581133 588705 588687 570762 580013 606982
12689 606982 645188 657576 662853 654702 674894 695573 710877 739453 757115 757990 777295 812007
12677 812007 824592 842615 854277 875628 906130 924719 944420 969702 1005829 1075336 1148097
12666 1148097 1216929 1275222 1323539 1381410 1440184 1505402 1583357 1667159 1703843 1749214 1831542
12655 1831542 1898876 1979287 2071559 2165963 2281158 2379087 2490140 2623161 2749373 2920036
12645 2920036 3110699 3333672 3594115 3890589 4245313 4662082 5149448 5699319 6370616
12636 6370616 7159676 8086756 9147143 10366521 11755013 13335462 15122635 17222630
12628 17222630 19777146 23033227 27360292 33226709 41267551 52025008 65582157 81255514
12620 81255514 97969285 114483290 129291680 140521847 146499122 146334620 140243331 129231789
12612 129231789 114646999 97992147 80893498 64880766 51148964 40182519 31891882
12605 31891882 25847315 21519220 18392106 16026305 14121142 12528271 11144351 9898997
12597 9898997 8745372 7689576 6756004 5955323 5266833 4693033 4237885 3855876 3536363
12588 3536363 3253792 3001466 2788208 2590538 2403568 2224187 2082559 1934602 1805460
12579 1805460 1687651 1581864 1499661 1417257 1354409 1301695 1230306 1170903 1117785 1069729 1030830
12568 1030830 1004283 1003515 989644 968255 954836 929942 906437 894044 883173 866158 837093 822087
12556 822087 818764 828737 834170 851867 882812 918694 974117 1066695 1169547 1272661 1365966 1443342
12544 1443342 1500313 1516830 1485340 1437869 1314613 1170375 1035950 909600 821680 742366
12534 742366 669110 628180 616369 613997 595864 584080 599010 610970 628222 647412 681276 711128
12522 711128 730833 781944 848025 922662 987936 1025973 1033105 1009523 962670 902048 850737 780891
12510 780891 710733 650003 596283 550045 490840 455504 458712 448653 426547 405501 398490 400279
12498 400279 394060 381842 388566 398869 424836 423673 393885 375025 379346 379749 376492 359289 335913
12485 335913 308940 277914 256656 234787 232514 230166 205413 175753 154827 165042 175857 185712
12473 185712 184162 173676 162261 150048 131185 145368 153244 167336 180837 210170 232659 229907
12461 229907 231339 238656 231846 236367 261237 271464 270828 280105 279784 289067 296396 298059 304200 307789
12447 307789 316531 346492 349708 352103 368342 376346 375387 383130 424822 476381 514102 531266 545701
12434 545701 575479 602696 629258 665614 702629 748924 836056 918801 996290 1072067 1166412
12423 1166412 1270431 1343255 1397814 1431470 1414106 1356096 1285337 1194909 1081405 974911 859422
12412 859422 745526 643874 559416 502941 435932 381847 361269 317134 280427 270755 251949
12401 251949 223840 207404 201082 188072 169025 158532 140504 138417 138902 121640 113420 104299 105112
12388 105112 130957 133857 132517 136299 129134 109178 108252 108051 114792 90005 58354 64823 54604
12375 54604 69925 78266 78355 88240 99340 89818 78755 84204 93968 98216 100001 105458 111639 123718
12361 123718 129246 108666 103652 112582 117550 86057 80221 69787 63494 60966 66026 64166 98488
12348 98488 110498 108142 106215 117552 123609 130813 122922 111689 118778 151443 135101 122205 109892
12335 109892 107058 111985 115380 117196 107324 95580 77934 96834 101100 92022 79515 70604 79077
12322 79077 74816 75831 76644 72066 79059 83685 76254 76638 98946 105524 96967 95529 109302 114276
12308 114276 114860 104892 97478 100634 118375 143457 153945 151568 177544 203328 220412 225520 243303
12295 243303 238823 222938 206187 174564 161535 145306 141640 136934 137190 144136 130351 115728 123310
12282 123310 106686 98258 96833 100843 104318 116500 124890 114891 113878 111866 130933 131137 134714 143081
12268 143081 133292 142446 151200 166181 174922 165326 167882 143723 127999 124335 119371 119914 109993 108504
12254 108504 112553 107237 100583 90332 81532 84651 73220 69359 70302 74889 68645 57658 54225 69015
12240 69015 81167 94279 92844 99523 100873 92199 97363 95860 84187 86771 113800 140812 149695
12227 149695 164649 188039 203809 232650 281578 336302 393648 478674 587492 721529 842161
12216 842161 895800 876822 819586 731219 663797 626834 649895 717195 801986 885206 942674
12205 942674 966949 929904 833680 734404 641407 591582 546988 509751 507782 531118 590661 641516
12193 641516 698202 779368 845283 863153 854043 858249 834274 790257 740055 665220 570311 475403
12181 475403 384907 340342 290379 244519 187313 163080 161750 154681 148798 144039 114649 102300
12169 102300 111844 124890 115436 132945 150255 139756 126985 124624 115634 106448 100990 132853 138064
12156 138064 122184 99488 114263 119406 110136 110211 135927 143300 134129 129467 106566 94263 98439
12143 98439 105173 99144 105536 112193 94270 89586 93939 95024 95956 94085 107476 108903 111371 118247
12129 118247 116508 130654 115151 91472 80364 70908 72800 67692 39654 39764 41224 62137 88986
12116 88986 100823 101696 93463 93858 80859 96739 107845 111656 114111 97783 106661 129300 135596
12103 135596 127507 129247 135044 134043 147099 147714 136991 146991 148734 154984 187865 195728 197974
12090 197974 212970 240606 271087 323207 363908 393081 451827 517046 574728 638079 708582
12079 708582 791351 884251 1009885 1162792 1369220 1625882 1987688 2449216 3037853 3708124
12069 3708124 4459975 5229145 5926447 6478050 6803739 6879775 6700124 6275783 5647340 4906450
12059 4906450 4118863 3373932 2719207 2181543 1767426 1449001 1192574 987433 861976
12050 861976 760993 678021 598670 535443 480166 432053 385056 347923 309916 272673 232898
12039 232898 202549 206516 194801 174103 148303 118205 114066 107247 96551 89925 81218 62679
12027 62679 65737 53337 52363 66668 79162 81231 52224 38069 41787 43857 48843 52925 59316
12014 59316 62852 59585 47119 36354 40696 48127 57590 55567 63069 59649 51079 36827 46684 47233
12000 47233 43254 43036 24320 20853 19030 23357 37327 42454 65928 72227 49546 34744 38145
11987 38145 50122 61595 41865 3270 -13548 1668 5537 13116 18919 28058 38189 32960 45910
11974 45910 61039 59712 55213 52690 48299 54847 53274 69412 86807 84821 77427 89961 107268
11961 107268 127324 155738 176712 179294 177677 202563 216108 223937 241504 248488 236597 235923 212414
11948 212414 185646 168431 152188 104606 83849 69371 50620 40828 41017 53901 47056 50562
11936 50562 50605 43518 26540 31979 32839 7696 11637 10120 4916 -11786 -8051 -77 -1101 3055
11922 3055 -16052 -15397 9881 16673 16883 24899 42832 50265 50763 55490 64771 50073 29080 7440
11908 7440 6165 4183 28519 49443 45531 19054 18671 20470 19094 10305 1508 833 11012 34720
11894 34720 46096 47028 51499 31141 44698 62874 50697 57634 69452 93596 86128 77215 64021
11881 64021 50183 47922 22626 30335 26297 18000 12542 33840 39532 53277 57424 50024 39618
11868 39618 23767 20697 42384 25168 10512 -4049 1080 9016 15585 18022 10004 10367 10516 -5487
11854 -5487 5462 -1465 -10244 11504 36907 17221 5580 9880 119 -7853 -2657 719 -7803
11841 -7803 -20805 -23931 -9128 -21013 -18340 -14634 4184 10001 7363 16005 32610 27089 10174
11828 10174 24154 47256 53380 39417 39764 28518 24817 22621 17463 17800 24617 5993 -6377
11815 -6377 -4615 6644 32197 43909 30485 14245 26007 33944 11776 -5625 -25203 -16135
11803 -16135 3487 15751 11789 24207 16937 11499 37109 47276 29169 19810 14775 -2154 -3936
11790 -3936 -2329 -2808 31543 57006 50106 41747 30128 14879 5536 20571 15201 7515 27296
11777 27296 28139 7148 -1109 7195 25663 28098 30098 36059 33427 28729 23690 38953 40337 22110
11763 22110 22101 30055 25076 23734 29977 44420 34138 35373 46748 30182 21846 11252 9553 16243
11749 16243 18794 6829 6606 4941 26350 50299 42665 51934 47996 22404 10966 13867 14312 26534
11735 26534 31455 21342 19637 14793 7410 6381 22583 31364 18486 2301 -14637 -21431 -15994
11722 -15994 -2414 3076 -2925 2689 5517 18107 11107 6869 8548 8158 3924 4423 4121 1527 9594
11707 9594 -349 -4549 -18535 -19339 -18560 -3185 555 16869 36834 32695 9459 -7257 -11581 -8168
11693 -8168 4323 23098 16197 -6453 -539 -687 4590 2531 -5719 3994 10970 14444 4050 -13319
11679 -13319 -18676 -6312 10616 18707 13276 18853 35171 30681 31720 40850 37497 24294 19727
11666 19727 17164 16166 29721 29765 7155 -9238 6124 7657 5074 24970 46389 28035 25212
11653 25212 37938 44001 35394 41086 55127 74257 102325 93033 64926 57523 65581 82080 97660
11640 97660 78146 57141 48461 62387 78594 74744 51355 27159 18565 10509 23335 14064 19187
11627 19187 12475 3675 3979 6018 10450 18213 10867 27411 28803 22872 27935 26894 26703 41104
11613 41104 37564 37337 25782 7557 24413 30704 22416 25629 25854 35869 42251 40410 30779 10922
11599 10922 -9790 -12818 -5315 8048 -9300 -13029 -1483 17725 22760 13951 9266 8099 15989
11586 15989 13431 5326 3547 20569 18069 9778 24304 31695 27332 25554 20904 19392 27096 28483
11572 28483 14377 10830 5948 22045 35316 39193 34938 30721 20034 16422 476 -6319 -10942
11559 -10942 -7731 13141 1176 -10795 5176 7218 20231 27019 7208 8637 17318 8500 12850
11546 12850 12305 14006 9138 6183 15774 6712 -264 -8753 11446 23283 27375 44176 47734 20629
11532 20629 6315 -2181 -7736 -2135 -6152 -3069 14238 35679 31004 26519 28705 26593 31623 50943
11518 50943 49265 39400 28689 7984 6475 6705 18190 22494 32550 22134 29024 19007 17143
11505 17143 2505 22183 20892 21902 28880 13929 22701 32697 33498 50693 55799 42444 48889
11492 48889 62138 73606 82706 84053 83237 74585 67792 80158 109811 135762 153685 163419 181755
11479 181755 199828 225528 233293 265337 322344 402942 492405 572775 669801 761890 810636 791491
11467 791491 762268 673596 569852 464327 376222 295686 255586 216589 182509 157886 144598
11456 144598 124812 99102 88991 87498 88656 97362 80287 68052 63069 68825 45609 34577
11444 34577 28151 27792 50698 61680 49671 47219 54294 43269 40731 43172 40713 32878 40722 34761
11430 34761 33276 55587 72550 77659 69299 49533 31387 23721 28924 40437 50926 66497 74740
11417 74740 65567 36691 27130 44810 42408 22088 22493 31462 26095 33686 30672 23623 47839 67701
11403 67701 66317 61430 62991 72859 81301 68976 53454 56128 57220 42376 49232 59743 61429
11390 61429 52821 44255 41706 54519 54793 58219 39168 27470 35359 25327 30654 38616 39194 47075
11376 47075 50077 42701 33081 20902 21055 28437 53364 56049 45318 47218 59585 67149 72403 67801
11362 67801 78047 81355 65641 73940 73131 67318 72062 70224 70039 67745 66287 57034 63678 58166
11348 58166 58506 64488 57010 60275 41617 38757 43418 47357 46367 50987 44831 53323 53098 31310 26293
11333 26293 47415 38281 20832 19225 28430 40760 46834 48558 47369 50279 33935 20859 48201
11320 48201 61522 61613 47251 49521 45720 47329 29496 20708 32658 54435 56529 38289 38586 42116
11306 42116 42400 46614 62881 64230 69524 68617 58693 57897 59764 81263 72768 68730 81504 78262
11292 78262 66659 72154 73692 71475 68655 67894 81267 95742 95364 97818 98935 94835 83857 82133
11278 82133 89786 105936 116818 115914 102073 116784 146310 176305 217905 269099 327530 376674
11266 376674 405435 419490 391130 334155 286997 228914 206915 192225 182744 181553 173540 169639
11254 169639 190411 220672 233130 270069 302037 307928 328363 349609 381165 421117 481650 553546
11242 553546 628188 708427 790211 879903 995488 1124624 1218434 1242174 1204724 1161086 1126887
11231 1126887 1155789 1239062 1419126 1720968 2195564 2910906 3773261 4530367 4828453 4544167
11221 4544167 3876717 3054466 2299673 1703858 1279581 974386 764265 620686 529166 463113
11211 463113 396101 338606 315390 287261 254206 225554 200063 198762 213254 209682 183767 170054
11199 170054 180343 187005 172095 181761 193125 180855 180984 159845 141270 132911 129399 156795 172854
11186 172854 175157 163309 163003 160885 153789 143709 148533 176829 173546 141225 136164 142752 127151
11173 127151 107686 88554 68589 68756 54474 54144 44327 39383 57442 69846 66671 71337 85960
11160 85960 108832 115919 121173 119800 132204 153685 196097 253048 290238 326707 342406 324656
11148 324656 312662 283164 241755 200731 159935 132285 108597 102326 101789 90642 60148 52227
11136 52227 46042 38176 17451 22076 18903 27256 35920 50626 52287 38981 31432 38273 55630
11123 55630 59523 59867 76724 81264 77205 69697 69537 58079 45593 40734 51633 62190 60704 44606
11109 44606 42565 44487 31330 28142 25692 22664 13665 15760 29590 60240 73144 61363 50322
11096 50322 61301 37771 16485 15379 27507 43674 65489 55508 55358 56716 54735 80745 81808
11083 81808 74623 58929 59311 60757 68653 81230 78506 63394 57149 45691 57319 72329 77186
11070 77186 67293 69213 84040 108345 104645 89009 71184 62456 60247 70170 77875 45704 13080
11057 13080 25457 41888 31599 35557 34683 55799 71161 75554 84764 106226 126017 130549 104265
11044 104265 99394 107041 105176 80994 75409 74454 61349 57627 49650 54152 59199 50274 55961 60736
11030 60736 48520 51338 49092 60869 66529 72300 82454 83150 67780 58995 61791 60162 54252 61785
11016 61785 57888 76516 74109 71288 76767 65598 58078 46731 42471 28185 40864 50500 49635
11003 49635 51337 45047 48469 46569 28966 9944 22250 47001 47843 38048 63494 63793 56103 44049
10989 44049 36968 31200 35020 51199 69818 76658 86811 76188 43883 33590 27252 5809 926
10976 926 22391 31094 54219 84449 86373 94556 97290 80141 88605 97363 101163 106915 116924 133698
10962 133698 118876 134453 159561 143928 115080 98198 110056 114815 111612 133395 161556 170096
10950 170096 181498 172981 181804 211687 235066 270376 306783 361756 429884 527901 671288 878640
10938 878640 1155757 1467231 1731319 1779281 1653216 1401064 1099778 835397 626285 469829
10928 469829 352463 304109 282780 249478 212544 179376 165942 162704 139366 147257 180178 183276
10916 183276 167202 137423 118344 122637 118121 118375 107717 122581 125342 108546 107127 105395 88603
10903 88603 84111 91841 78701 78271 84828 70252 56383 63700 75585 73972 78212 87191 98575
10890 98575 97689 103707 122115 128573 132060 140497 147152 134172 115574 106607 116037 113583 104679 90479
10876 90479 90163 73271 74612 74124 87136 99034 100073 82730 71909 65108 56187 55130 64676 71165
10862 71165 90139 109440 111922 104907 73427 76610 92299 95940 102874 119795 132411 131309 121249
10849 121249 105745 93916 99641 103950 107747 135474 126745 96719 94046 84539 76552 73508 78010
10836 78010 95055 109271 103477 111993 84366 98653 110882 116899 147137 134889 101753 88294
10824 88294 77328 63894 79775 82300 77157 95978 106246 123508 109635 103338 118416 122001
10812 122001 124972 128493 119545 110525 111894 104219 85537 80327 81754 107409 133859 153179 157862
10799 157862 146722 150599 157472 147495 146205 150026 150542 129525 126766 137514 150359 159027 162029
10786 162029 174529 180148 171846 171010 176699 173830 172476 174123 174003 173655 186533 210677 230773 253660
10772 253660 278330 297674 279873 261003 232013 206810 208247 232618 246699 224282 220111 219878
10760 219878 200334 191674 172953 147500 138114 152573 170261 157371 154292 164508 184101 196519
10748 196519 201599 187833 181956 177890 176108 165718 157740 150198 133956 129020 130253 150097 157315
10735 157315 155809 170729 178436 173702 182574 194146 186569 181487 182462 184869 197122 193276 181196
10722 181196 176727 203186 230506 232708 228626 232363 226564 231979 231470 222835 208138 208456 205118 198914
10708 198914 211396 219107 202069 205894 212410 191404 179355 175373 155151 148310 134685 175061
10696 175061 214581 232634 242121 251788 236471 236272 235563 232420 224179 214803 207031 223641 237871
10683 237871 235253 229904 228409 212731 202074 205376 222215 224462 207015 193743 216381 224810 242480
10670 242480 262176 283492 290214 317081 337200 361425 375670 394467 401342 409374 408272 395956
10658 395956 398735 401781 411449 438798 464996 498602 534954 539198 564006 600974 645822 693023
10646 693023 742797 800410 891178 967688 989079 917835 821392 734357 642028 564014 504262
10635 504262 452804 443952 445933 436423 435154 440455 448424 471032 482176 482774 493255 500860 501975
10622 501975 526853 562171 571386 557455 568095 564334 568359 583077 582787 591414 613499 619783 604811
10609 604811 596906 596920 603590 636376 658986 683563 688057 687653 692879 704374 716012 744959 771334
10596 771334 805477 832585 877642 926461 977939 1021225 1055873 1085065 1090762 1093835 1082336 1086366
10584 1086366 1110593 1124434 1140617 1156954 1177407 1177539 1182506 1190470 1201922 1246031 1302087 1356239
10572 1356239 1411296 1444171 1473245 1509675 1585227 1677199 1755982 1835350 1905706 1989969 2083931
10561 2083931 2199697 2314093 2420663 2537868 2655365 2777676 2883835 2975982 3085668 3189242
10551 3189242 3299964 3433126 3580112 3729171 3925539 4151833 4424313 4725443 5050672
10542 5050672 5442684 5870504 6355039 6929828 7599792 8398612 9393494 10541765 11719459
10533 11719459 12895176 14108606 15498907 17218904 19454537 22396656 26328480 31521834
10525 31521834 38292478 47005461 58330737 73602556 95300232 127421602 174554278
10518 174554278 236715731 298629570 330319411 317476007 273441065 217175527 162983662
10511 162983662 118934840 87096980 65481239 50991305 41165240 34242032 29009750
10504 29009750 24885237 21617039 18995121 16878314 15172575 13768504 12498119 11288969
10496 11288969 10152837 9082624 8115603 7290045 6601566 5991542 5469694 5012411 4629121
10487 4629121 4296431 3983141 3685587 3413677 3148882 2908233 2694882 2512338 2349399
10478 2349399 2202960 2066477 1948223 1846595 1772011 1692018 1615815 1552831 1490234 1473308
10468 1473308 1457722 1441340 1434322 1440353 1424345 1392868 1330503 1258222 1208884 1179016 1175711 1177456
10456 1177456 1158255 1129883 1098242 1053798 989842 942674 914000 923606 954930 1010338 1019985 995695
10444 995695 945348 888541 823086 727565 655213 606449 568362 557029 557956 536806 516807 504038
10432 504038 501781 503987 505886 509007 495775 488883 475851 457541 446625 431854 420564 411373 407393
10419 407393 390626 361463 350232 353347 339817 332531 330170 319778 320683 323606 325388 342484 342928
10406 342928 341882 336512 328216 337515 352124 382979 393124 384813 377608 394770 433643 459466 463720
10393 463720 485309 507006 509773 488703 441251 384134 326806 281407 245235 214532 172417 151864
10381 151864 148930 133211 155843 175977 163845 144322 138465 128256 139775 155913 164335 167043
10369 167043 159409 159327 154540 147419 134618 142498 170226 190034 182498 195014 200920 212315 205583
10356 205583 217424 211541 194151 214690 212816 179873 168601 168600 184557 188392 183405 170635 167093
10343 167093 172770 167410 155026 161673 150022 148467 159881 156839 172375 188813 206124 222203
10331 222203 215387 190931 168788 149778 137563 127121 134630 156100 166611 172930 176104 175459 167152
10318 167152 165917 154171 154318 155782 143972 121644 113138 121887 134265 137783 145652 165979 182176
10305 182176 167885 145969 137710 132579 151749 155163 168703 194154 208876 193268 194402 181127
10293 181127 159249 161656 143872 155913 174394 181800 182242 182459 191814 217608 253646 278340 309606
10280 309606 354895 387367 438515 484468 501789 505746 489125 461160 432047 404750 375251 331686
10268 331686 292195 269547 265767 262765 253504 254466 249998 237788 224594 214190 196574 187944 186318
10255 186318 184084 188096 196327 190336 185365 178143 180213 187487 193142 201613 193601 181670 172890 162122
10241 162122 163764 168316 171078 191245 209723 223474 216424 216454 228116 234256 234119 235497 248569 275802
10227 275802 309472 321788 316289 319882 311149 294346 297944 313126 331200 355069 357035 362552 372767
10214 372767 380931 385421 409612 431296 458781 480933 494887 498364 490252 501281 523362 542642
10202 542642 557175 594447 627319 665577 703833 760145 845209 921070 987974 1070871 1178394
10191 1178394 1314714 1438303 1566209 1727186 1897145 2107424 2342009 2608071 2980374
10182 2980374 3451577 4087764 4912902 5980599 7418749 9366827 12093215 15835173 20652067
10173 20652067 25890013 29961452 31257227 29413718 25385251 20510682 15859608 11980341
10165 11980341 9067141 6993338 5539482 4507471 3793005 3261853 2876267 2615379 2470853
10156 2470853 2415002 2393230 2321218 2196186 2005014 1769592 1559160 1395468 1260495 1151274
10146 1151274 1068289 1027179 1014498 1017509 1040244 1051161 1002932 915953 820399 734975 669445
10135 669445 583303 528926 508716 492804 485269 465063 436896 435310 450050 442522 442863 451010 464499
10122 464499 478553 467825 441348 435059 425508 408912 409364 391356 370918 350278 338915 335428
10110 335428 329580 323867 325796 317796 327452 348097 341626 338345 347595 373087 405025 439170 473838
10097 473838 531799 636381 783593 977922 1229042 1547655 1857156 1968070 1850826 1616008
10087 1616008 1340363 1084343 867687 727877 648179 592688 531220 490181 442121 396864
10077 396864 363427 330457 284553 275867 288356 281959 273421 261776 249688 257104 255038 240263
10065 240263 249562 251334 256151 271915 283668 301023 324552 349637 396031 426738 460543 487603
10053 487603 514023 513056 526713 522018 516110 512377 522014 536129 550445 557917 602864 660476 739879
10040 739879 807796 899644 1002873 1101828 1210445 1281594 1307618 1286713 1204066 1126085 1012133
10029 1012133 894084 800737 708685 620120 563702 525386 495728 481462 460519 438249 435324
10018 435324 445924 435912 438677 458001 457521 435286 408495 386446 364149 298877 278247 264201
10006 264201 246130 226173 211081 215845 221398 224005 211780 202406 206628 214136 202293 193019 195729
9993 195729 199309 211618 206861 203049 191141 207417 209254 204588 189291 181927 185681 186184 179854 184038
9979 184038 196927 201469 192535 187378 191829 196268 214989 222864 219917 200200 186551 204855 217476
9966 217476 214531 220787 240665 254393 257451 262196 240737 236395 245332 251165 238147 228006 229465
9953 229465 224314 223839 222732 200074 203739 219434 231430 230811 229997 226636 225015 240161 246115 241631
9939 241631 237162 215697 211477 220834 210028 195963 208247 213211 223338 224834 220590 211638 194136
9926 194136 187878 179036 192188 211742 212015 205012 222473 233421 241924 234058 244895 242207 242300 248615
9912 248615 248994 254833 254616 242166 242764 258469 261423 261664 260547 270049 267264 269790 270242 279506 266810
9897 266810 242969 245520 243319 256023 264406 249249 253041 269074 280467 285384 273785 257110 267606
9884 267606 268371 258361 264470 267331 266244 265916 278928 284845 300385 311472 300076 290310 299832 316056
9870 316056 312576 308812 308233 310371 322034 329176 323138 316022 338964 347812 345905 336543 351743 367546
9856 367546 365054 358439 360723 358183 353106 357914 367803 364942 384459 390596 389546 397303 384337 363670
9842 363670 353129 372789 399173 400734 414767 397739 399023 418221 426348 413759 426724 458173
9830 458173 472546 458480 465933 475143 491409 484936 480563 508291 518338 500936 487853 494787 508539
9817 508539 507493 489699 479053 493165 520822 533910 532231 543783 565828 559091 573694 576568
9805 576568 566013 569081 570865 576392 584355 583352 581549 579822 588923 614022 636678 652031 650120
9792 650120 658538 660351 656040 664084 678287 701053 732014 749051 744881 759766 766456 773213 772513
9779 772513 794238 838446 832254 818419 833033 850469 863454 871363 885514 904800 899365 884882
9767 884882 908748 943998 959035 980297 1024034 1044177 1060319 1066565 1056843 1069292 1085300 1101596
9755 1101596 1113578 1140897 1175214 1213559 1230162 1257795 1308286 1331444 1365579 1389117 1411904
9744 1411904 1413099 1420710 1421333 1428824 1430899 1452082 1469039 1481932 1505487 1533035 1543508 1555654 1570276
9731 1570276 1593788 1623000 1654802 1677354 1714603 1755077 1786500 1809178 1848803 1913055 1950497
9720 1950497 2005811 2047059 2086715 2118042 2159654 2199911 2246517 2296133 2344083 2388020 2436967
9709 2436967 2505616 2577925 2653962 2698150 2754797 2826992 2881858 2951639 3035166 3099749 3146398
9698 3146398 3236730 3332300 3421602 3510059 3588730 3690546 3782016 3888768 3993816 4104410 4211029
9687 4211029 4334485 4462460 4572036 4706931 4857887 5003732 5154957 5290246 5438423 5603122
9677 5603122 5775062 5955745 6141179 6329398 6524252 6703373 6891078 7100875 7340865 7575475
9667 7575475 7832154 8076555 8312173 8567213 8834934 9112473 9404055 9689565 9967859 10248133
9657 10248133 10553724 10841553 11123980 11412194 11720172 12002150 12301645 12611171 12885746
9648 12885746 13148814 13394670 13638714 13875970 14088612 14281971 14484352 14648978 14756715
9639 14756715 14822800 14878279 14906631 14913913 14889941 14860373 14789621 14675653 14545219 14404729 14223019
9628 14223019 14006283 13782360 13554955 13290349 13015073 12728551 12452842 12154330 11846496
9619 11846496 11559649 11258111 10967052 10664423 10365010 10054232 9760580 9463094 9163908
9610 9163908 8886796 8624138 8358184 8103858 7830498 7578827 7348548 7116189 6902631 6701173
9600 6701173 6501795 6312650 6123559 5929554 5757723 5572684 5388931 5232159 5067132 4897567
9590 4897567 4764100 4638942 4510785 4364430 4235341 4114152 4010608 3900272 3798720 3704347
9580 3704347 3608241 3517995 3428625 3340538 3240715 3146521 3059194 2996583 2922480 2847037 2774360
9569 2774360 2711201 2656039 2601804 2540676 2484654 2431044 2370960 2318756 2262153 2207773 2163999
9558 2163999 2110630 2063470 2027224 1983694 1948349 1899334 1856809 1808332 1772300 1738464 1693803
9547 1693803 1657024 1621904 1607016 1598883 1565193 1526611 1500762 1475906 1461240 1421776 1376556 1355906
9535 1355906 1340603 1313816 1287492 1263794 1243362 1221336 1203875 1178925 1144698 1142955 1130181 1102497
9523 1102497 1077207 1055923 1038987 1035137 1045134 1044163 1037984 1020164 993743 959708 919486 905497
9511 905497 907814 895324 885417 883325 860861 837395 829860 841854 835995 819082 789887 772959 779851
9498 779851 762884 735228 707887 674272 661593 680165 685344 681696 663741 655214 646072 635147
9486 635147 620541 589844 587498 606705 613358 597607 573705 553705 566434 580242 568257 568432
9474 568432 565424 565315 563849 553293 531265 511141 514083 517257 514683 502068 481673 469304 462260
9461 462260 459449 443687 433632 435616 443494 425333 417669 419328 405761 397836 377396 375602 382447
9448 382447 388140 378134 368315 356623 363843 378147 382087 368932 357787 360376 359574 354663 352583
9435 352583 338156 325695 321262 343847 346326 309307 289659 297637 294464 315301 319002 294816 276527
9422 276527 289775 301627 304336 293547 292002 273449 255955 259336 263848 274807 261808 254194 253365
9409 253365 257133 263047 270689 253228 241688 246736 225555 210145 228136 237000 239509 236594 240109
9396 240109 235228 216990 226730 235223 245503 235774 225823 229079 242367 233908 220003 232955 237468
9383 237468 225623 240107 221800 194004 194037 199053 209889 218823 203541 192546 193799 199905 189769
9370 189769 181807 195347 188334 183930 167694 172234 194727 201636 194053 195363 180000 170148 168580
9357 168580 166909 165536 166464 172914 178133 168024 149009 143590 153235 172155 171506 146373 141816 143064
9343 143064 146684 158314 141570 132944 141076 157751 150759 154198 156512 136898 151795 156191 156004
9330 156004 156912 169190 179858 177474 165563 146976 128812 134223 142060 140314 130659 120196 105780
9317 105780 114828 111413 87280 91514 109830 129739 143703 154685 140456 115861 112570 105265 94692
9304 94692 82616 104032 123701 127635 126624 122263 122542 121500 123939 129660 134768 149046 148043 134702
9290 134702 133568 139049 139803 131381 116569 100814 94446 89487 102499 125280 121242 110061 103066
9277 103066 86331 57702 53887 55497 48162 75119 92688 91238 86525 86722 75352 79562 81579
9264 81579 51219 56475 81794 86818 59114 47329 37853 48099 65734 74366 83981 94354 102235
9251 102235 97573 102327 91866 80999 63241 71592 77074 66655 50923 62537 52637 53124 64806
9238 64806 72519 76527 89301 85427 80721 77130 75427 81427 74021 56132 45262 55407 62931 51383
9224 51383 45129 45803 59092 55172 48580 50868 59016 56353 76281 84564 73954 62130 45454 45540
9210 45540 54378 57446 42206 51521 49484 64595 75905 77786 83096 68247 67146 65537 67155 63165
9196 63165 73307 72399 74736 78241 72937 64855 74689 68821 43550 58536 69800 70024 86816 86768
9182 86768 64200 50734 40778 41223 55239 61344 48390 48169 51109 69856 64852 73360 51542 27954
9168 27954 43846 47070 49197 61396 60312 60809 42003 24580 6133 20648 26344 34179 50671
9155 50671 43075 31990 42731 62507 67513 45405 29477 50684 46674 49547 44045 46898 61755
9142 61755 48754 46345 44633 42489 56229 33009 31901 29625 52744 61384 58441 63960 75095
9129 75095 47018 37003 50726 51890 25261 34596 62367 40204 31214 37214 41230 39651 49322
9116 49322 40859 32411 26660 28804 53846 49753 42439 20541 11260 4400 16713 21591 30365 22960
9102 22960 32266 19161 15884 17112 34322 41257 32266 29433 28925 24334 34531 41836 18078 14892
9088 14892 10476 -6387 -14488 -11046 1525 29622 31455 17946 12338 18481 33554 33560 32792 17012
9074 17012 17475 17478 15446 6037 17195 22158 23719 19746 23848 25784 10216 14236 38488 47013 48587
9059 48587 67391 46094 35486 41429 48352 40747 33071 37054 41815 45665 44625 30537 23557 36725
9045 36725 34854 34475 34643 34395 30142 18210 20975 33192 40486 38353 36848 34782 31248 33142 32278
9030 32278 17294 15977 32244 32855 27873 3567 565 13119 17448 35590 45340 17606 13494
9017 13494 25734 38257 28064 28038 24504 24131 29861 17527 5036 13312 26214 30976 28465 13674
9003 13674 14466 22937 22429 32660 29970 44624 46521 36659 32973 24211 1888 -13659 1161 5308
8989 5308 35498 39699 25663 27562 43595 34992 26403 3582 -10485 -2036 28111 38116 57852
8976 57852 55413 27762 30064 8137 10100 19835 34547 31380 41302 63256 50959 33086 32364
8963 32364 29143 35998 36513 33678 37027 23127 7221 -3695 -8660 9784 22753 30651 27341 27659
8949 27659 44572 55909 52747 44779 43434 19486 10805 12277 7728 -4856 -5454 -1857 -2930 22858
8935 22858 30998 35916 30528 18229 27288 33095 23061 12429 13523 17632 12515 18419 37492 37167
8921 37167 25378 25243 25251 19920 30260 34436 22210 6150 8950 15964 27596 29133 31356 35961
8907 35961 56572 42285 8640 2694 19910 13615 -2263 8870 11261 20037 33420 38443 7777
8894 7777 -2666 3772 11062 13363 23157 17138 8430 -559 6549 5468 3424 9890 -13737 347
8880 347 6442 -6765 7924 18465 1584 -17564 -11825 -1730 20704 38422 31936 39889 35520
8867 35520 28300 10018 10981 15679 11928 4933 -1589 6607 6576 -2732 -13432 -10458 5587 30655
8853 30655 18927 14173 7546 1729 -1865 9639 1057 2927 4159 4163 -5450 -10475 13753 26446
8839 26446 10614 5012 -5473 -8294 -3042 7146 10381 1337 -1375 -2070 -2581 -8795 -17731 2185
8825 2185 15501 35124 49656 40128 27234 34785 55628 62762 55904 40955 42714 38060 30856
8812 30856 40347 38082 19100 -5929 -12529 3209 13037 26464 27997 45320 42248 37985 40043
8799 40043 37469 35970 31091 9811 -11714 -8584 7203 14717 12219 7198 8936 18396 18354 7720
8785 7720 -10124 -5414 -14556 -7395 5456 11883 5120 12195 25844 40535 33429 20722 23017 15713
8771 15713 29874 29248 29387 37657 34623 27589 43213 47231 35396 34312 17320 4468 18183 18416
8757 18416 23766 21476 19165 32862 34238 17508 9401 24615 35855 17233 4816 -4542 -3081
8744 -3081 21069 39261 33062 28705 26508 37015 31726 32624 36949 39830 37267 34930 43718 43126 29861
8729 29861 38657 26489 6414 9044 15025 20825 24414 38040 42291 28818 2899 6443 18126
8716 18126 19279 25521 29296 38214 24016 15463 7036 -6578 -11209 13056 10176 17059 36399 42676
8702 42676 26065 38217 47891 36838 38501 31797 17817 17906 15349 38888 57678 47778 28197
8689 28197 25232 20825 9129 2928 20469 33092 38725 53231 55466 40874 51906 51970 53362 54925
8675 54925 55509 55946 52198 30599 16698 3597 10941 22768 23669 25727 38224 59159 48300 39707
8661 39707 52745 38941 23998 12606 28649 37000 55267 47649 34055 47821 64391 38935
8649 38935 39573 38419 25802 16416 9257 34859 42541 34222 51261 52569 47358 44940 50947 59998
8635 59998 65040 72751 59585 58858 61065 50792 42796 51792 63738 77304 82637 74980 81198 90735
8621 90735 82389 76012 85829 85416 78232 69994 77722 82751 73193 84106 110946 113213 97261 78253
8607 78253 71352 72364 70010 61925 68560 80340 86201 85854 94731 102611 85372 86229 96750 111844
8593 111844 121606 142088 163256 163620 160501 169524 156733 141961 171516 189071 200958 216427 231236
8580 231236 222163 237495 261598 268437 276489 285240 293219 286400 266092 229055 217150 223465 203988
8567 203988 195781 179491 164191 127024 91498 84870 94875 107042 111207 110254 95242 60883 60995
8554 60995 82125 87885 75200 74257 57794 42436 42728 53255 55485 50435 46988 43249 42350 52404
8540 52404 61832 82879 70871 49675 32116 25424 34784 44298 46616 51444 59493 41866 32919
8527 32919 33406 27109 26409 39882 31287 25224 49517 66182 57714 43747 44911 41281 28761 19869
8513 19869 19489 24524 25565 20116 37930 30026 22877 24936 31097 12544 16406 38802 37236 45771
8499 45771 45838 10295 -21409 -25822 -4753 24764 41397 52056 52941 46821 53048 49308 47022 43449
8485 43449 59465 55747 32915 33822 39105 18380 15155 19555 18929 8841 32652 34225 26675 14180
8471 14180 8892 -662 -10772 -20625 -10050 8248 4709 -17850 -13734 5097 3650 1547 5287
8458 5287 13578 12246 4259 1345 -10132 -14003 -7635 375 -7317 -21369 -3349 16965 14797 3834
8444 3834 -12978 -14713 -6890 -5858 1550 2856 67 5206 1935 18435 34985 36620 29608 21417
8430 21417 736 -15689 -4428 2630 -1971 -7705 -2007 -1221 5798 13995 31235 61895 63973 70052
8416 70052 70495 70647 62728 31808 4706 -6116 -16272 -7863 1720 13040 -5708 -3093 6486 7733
8402 7733 -8824 4623 18988 12534 10801 7997 11040 4888 -4979 16492 31796 35380 36089 40853
8388 40853 36765 26311 8244 1877 -325 10203 6999 7978 25602 30851 37282 48843 32452
8375 32452 19422 4598 -1911 -5274 349 -1017 -10900 -18025 234 6461 -2605 -9119 -11625 -6046
8361 -6046 9183 10422 -11248 -10088 1189 263 4968 24602 39716 51686 54917 38141 14636
8348 14636 995 5167 12749 12161 8794 13069 15548 10403 5023 14083 35750 54004 61995 43768
8334 43768 46809 60279 70609 99089 111091 133186 190850 221612 221728 197648 149280 89792
8322 89792 69879 63280 44954 37621 56148 51922 43894 47633 46938 44840 38134 32469 41686 45885
8308 45885 50321 38433 31427 28882 39166 45977 33459 23154 19270 2447 4271 16320 1154
8295 1154 -1306 21652 42584 48744 59434 53787 53556 86012 139449 176453 201385 204420 193534
8282 193534 170574 130717 74417 27496 17680 53279 66849 45144 51588 43827 35658 31667 19089
8269 19089 4047 -9467 -11713 -13142 -7858 -2530 10562 5327 -8396 -975 -5435 -5140 4432 -3632
8255 -3632 -15143 -18412 -6818 -8281 28573 31510 23164 26865 28879 3250 -22303 -12580 15839
8242 15839 13303 -1679 6715 23277 4255 -11041 -9247 -4862 -7736 -16897 -26043 -46663 -40820
8229 -40820 -12154 -666 -5025 7409 9607 -2403 -6968 -10297 -9489 -3250 -3255 2431 -97 -26062
8215 -26062 -33018 -17984 -10177 -152 -1122 -13214 8120 12460 14230 18307 11118 16675 13278 8689
8201 8689 2556 2057 9762 5784 -462 -2022 5488 7721 7139 15366 8610 -7255 -15297 1423 5814
8186 5814 -6853 -2890 -10616 -8262 15300 16542 12895 7207 3627 -6336 681 -4833 -7305 -8114 814
8171 814 1902 -4097 -7293 -17217 -11581 -7568 -6155 5020 12858 -4709 -23603 -28985 -37783 -21900
8157 -21900 -7284 -10638 -18867 -20924 -14082 -7557 1289 12168 520 -16389 -31862 -13626 736
8144 736 3799 3981 5209 24519 15297 -10663 -14852 7045 18466 23414 11173 2268 15331 7264
8130 7264 4248 10647 19663 27273 23631 12948 -5886 -5688 3049 11730 959 -3727 -1458 4175
8116 4175 7519 17644 20111 16917 27045 24700 17819 33524 52692 63355 38964 13069 -334
8103 -334 12821 29377 7528 3315 23819 31392 28995 20977 24605 19428 25669 29645 23989 15717
8089 15717 6795 12752 18781 11878 18235 12850 10028 4478 -6820 6546 7917 643 3479 29539
8075 29539 34601 35725 32598 35080 20721 25562 25956 15749 14287 16726 25034 7335 -14368 -20820
8061 -20820 -11340 3874 6159 11292 -5887 -17072 -13177 -1064 -2910 3397 -13379 -17684 -16576
8048 -16576 -15792 -98 5108 7668 17511 10745 2045 5070 17445 18716 9395 17295 26321 25031
8034 25031 34677 39287 24585 13872 11261 6175 20776 41325 47399 42436 20770 13290 40043
8021 40043 24192 25074 49748 44568 50297 62291 53369 45058 59929 75780 59441 46050 38205
8008 38205 30773 37943 52424 51082 38855 38403 41291 46712 37647 36314 54596 44140 18120 13357
7994 13357 30988 21925 30564 36573 37057 31086 32841 52452 60620 47510 56500 55323 46303 24662
7980 24662 32490 34032 39136 52855 66356 74701 55695 37043 48776 52403 47867 40234 21664
7967 21664 15173 28352 42001 33539 38984 48990 59028 63774 62280 60703 71835 63705 65384
7954 65384 66595 56393 64885 71848 70560 35686 24652 27231 26306 33629 43547 34301 67668 82840
7940 82840 84816 92691 109676 113047 114062 115359 99122 98723 94886 92967 101760 112690 96914 84010
7926 84010 61270 43519 51160 50753 67490 80342 65945 52821 46842 42538 42630 51447 57997 45463
7912 45463 28985 41512 62820 65927 54789 25172 14434 10971 24995 38109 57388 63555
7900 63555 46645 20893 33297 48360 50368 54026 47558 37094 43857 48600 50555 58820 66842
7887 66842 57878 40455 40674 32470 29226 41261 34974 31884 31974 23002 19650 14511 22158 29106 25091
7872 25091 25105 30803 32134 37465 39040 33002 17325 18273 35807 29564 21958 28667 21380 26740 17543
7857 17543 30857 32158 20014 10128 7755 15716 37527 42296 50866 45555 25640 -4691 -17125
7844 -17125 -8720 -20204 4904 12056 4359 -16221 -11156 11964 25014 19032 13181 11327 17175
7831 17175 -4995 11053 26559 3162 1732 20787 12412 3822 1747 -6739 -3682 -15274 -6746
7818 -6746 3268 -6362 -22370 -9572 9764 28910 25707 14921 20382 8270 6339 18646 20224
7805 20224 17524 17728 2292 -1286 3966 639 -12284 -19811 -15435 -12132 -18980 -16283 -4753 -17241
7791 -17241 -12353 1702 14194 12975 1208 -32802 -56695 -39446 -29946 -23102 -19220 -2797 16688
7778 16688 19613 16274 -4677 -25555 -1336 6799 2801 6373 -516 -13839 3742 -3822 -8873
7765 -8873 -4827 -5500 -8516 -1183 11143 21276 -4611 -28225 -35163 -43555 -34586 -22705 3401 13495
7751 13495 9886 -271 -15232 7673 20229 7043 5884 3522 9399 1397 -2 14057 29828
7738 29828 27266 5190 -9922 -10867 -2209 4396 32149 28231 28535 29318 20819 18279 20895 3590
7724 3590 1083 6288 3010 1311 -6580 -6330 -938 8736 7137 -15868 -22572 -9708 3904 2051
7710 2051 15949 35703 29354 15330 -4765 -10603 -12085 2555 12450 1633 -6700 -1169 -7750
7697 -7750 5842 -1177 -9241 -17721 -4833 -7633 -24219 -24612 -24648 -18433 -25051 -21080 -10079 905
7683 905 3016 -2914 499 -7990 -22826 -10098 9900 8327 16791 23954 26494 21494 23670 24469 25556
7668 25556 10653 -4046 -1225 -2890 -6341 -8938 -25475 -31088 -35015 -39262 -38850 -26541 -15679 -8721
7654 -8721 -2156 -4689 -11358 -45080 -37083 -27467 -11306 516 -7364 -16197 -26056 -11725 -495 1836
7640 1836 -11308 -8277 4578 -5815 -7132 8430 1686 22071 40788 58226 38464 4840 -9845
7627 -9845 -10882 -8928 -5479 -7441 -16453 -18413 -15870 -36015 -44148 -38991 -30044 -25884 -19614 4025
7613 4025 24904 39622 47203 24553 -11584 -28296 -14219 -4323 -9667 -1830 4493 -3967 -16031
7600 -16031 -17752 -14277 -29426 -54399 -57809 -46816 -13201 4344 26241 21822 -2999 -29868 -18031
7587 -18031 -1315 -4940 -1558 -5398 -14915 -7165 4428 -5982 -9895 1782 6953 19470 14307
7574 14307 -165 -29083 -37053 -28504 -4390 6460 -2665 -23691 -28785 -20628 -30907 -45877 -31046
7561 -31046 -20575 -11065 -17110 -13987 -27426 -21864 -32676 -12936 1535 -16412 -26763 3351 28907
7548 28907 33486 41898 29085 4465 -8114 -1791 19157 16382 -2670 -1190 9168 18085 27745
7535 27745 22106 16260 -5154 -17397 -9417 -8272 -10871 -10377 -9617 1180 6801 18863 26438 18143
7521 18143 -469 3595 1574 -3378 -22965 -29318 -31970 -35979 -26884 -8696 -8347 -22418 -38296 -31228
7507 -31228 -29760 -34745 -39050 -41370 -36813 -10232 -4836 -13558 -33341 -6828 9409 3873 -10786
7494 -10786 -17416 -14522 -16976 -26853 -16875 -11150 -4116 -18318 -35554 -21363 -8105 -21065 -28395
7481 -28395 -21775 -8834 -158 2129 2765 762 309 -9677 -25407 -33479 -22149 -5429 -6159 -13315
7467 -13315 -29617 -32190 -10382 -1004 -1989 6992 3936 5189 2385 -11516 640 17114 4507
7454 4507 -22634 -27025 -22456 -32831 -28338 -26622 5426 23740 9593 -5276 -9162 4517 9626
7441 9626 -6817 -9377 2762 10853 14548 19119 10381 14765 5016 -6305 -13986 6790 16198 20804
7427 20804 22589 19959 -1862 -11952 -16134 -8912 -16373 -7196 151 -1145 -2002 8368 3229 -26988
7413 -26988 -41964 -41318 -20300 14344 14337 3300 6235 -3597 -795 19859 21213 7806 -685 3031
7399 3031 -20104 -6605 -856 -1545 -22738 -29440 -33376 -40668 -47742 -31178 -33411 -33710 -32611 -21757
7385 -21757 -4057 -3459 -12712 -29717 -21109 -22419 -31130 -14458 -11782 -16150 -19307 -29913 -24910 2385
7371 2385 5012 -4782 5101 4501 -7476 -10432 5681 20907 16893 8509 5471 3800 6074 2382
7357 2382 -11431 -5799 -810 152 19589 35414 42738 40933 28900 19534 10485 5946 10014 21481
7343 21481 10788 2277 2817 12293 -1249 -11448 7605 -15001 -21430 -13749 -23043 -12655 6332
7330 6332 -6672 -11739 -7020 -16163 -21006 -16163 -21358 -25601 -16165 -4466 -9035 3079 1472 -27287
7316 -27287 -25261 -25735 -41813 -37037 -28536 -35078 -43122 -33854 -23143 -18697 -21157 -23713 -15594 588
7302 588 6589 3603 -4077 833 -17438 -37644 -30085 -3002 5783 685 -22566 -32854 -23194 -20558
7288 -20558 -12588 -3050 -2780 -18711 -16656 -17670 -17765 -27250 -17708 -10334 -17479 -1993 3834 9358 19123
7273 19123 3731 13210 9043 -2841 -4786 5534 13610 14134 12813 2131 -7979 -9478 -14155 -34079
7259 -34079 -32935 -20658 -34608 -24455 -10694 -13710 -13361 -12776 -10897 -12393 -28696 -15261 -23684 -8524
7245 -8524 11327 -2426 -21567 -25386 -16961 -16770 3853 32331 30686 21147 8265 5328 -4520 -13948
7231 -13948 -10361 -13246 -26959 -8765 -5682 -15038 -18443 -8289 -15609 -14963 -21055 -15688 -10081 -18940
7217 -18940 -38699 -47644 -33083 -31748 -36172 -39907 -37997 -27565 -12021 -12794 -13931 -28261 -27485 -7401
7203 -7401 -5102 -19948 -21663 -17274 -19220 -30042 -24457 -16289 -18822 -32575 -22717 -10707 -5571 -18204
7189 -18204 -10329 -7042 -7974 -2868 13595 15986 12999 976 1038 -2234 -6303 150 -4389 -9939 -23569
7174 -23569 -39004 -36582 -18664 22420 24865 4744 -9219 -20132 -22331 -3028 12439 4805 -3437
7161 -3437 -29088 -48782 -28710 -30898 -24108 -6856 -20956 -35892 -31746 -24866 -23033 -18773 -7212
7148 -7212 544 4776 2484 -2303 4255 234 -5436 -19852 -20131 -13523 -3922 -1603 -7388 7452 -251
7133 -251 17594 8901 -15691 -12122 -8366 4414 20637 12827 -2104 -15896 -15111 -20324 -26396 -11001
7119 -11001 5652 -8670 -11501 9145 6489 -3870 -10750 -15100 -25049 -29563 -19431 -5505 11244
7106 11244 3011 -1816 -8617 -8559 -1142 -9124 -1361 12597 28692 32418 29178 11970 -4489 1268
7092 1268 -11789 -24065 -12618 7153 17473 7687 12896 14951 -2226 -24851 -35753 -34558 -24713
7079 -24713 -21866 -16937 -14609 -9984 -12003 -15819 3929 10791 7447 1157 15552 20311 20980 24353
7065 24353 16459 24839 15795 4829 -10422 -13692 7629 -3823 -11906 -12299 -8584 -6437 -8254 -25364
7051 -25364 -29363 -27583 -16473 -7086 -13732 -14221 -9691 -4683 -8094 -1534 -9222 -20342 -32018 -20771
7037 -20771 -4260 4220 -8823 -18461 -946 10723 -1016 -26798 -18724 -1372 -20080 -28147 -22865
7024 -22865 -20571 -4366 -3006 6652 7814 -20393 -31652 -20270 4486 -5419 -7187 -1831 -8233
7011 -8233 4386 13966 27141 28785 10039 -15384 -23698 -17183 -11596 -4742 -18480 -26398 -20261 -11981
6997 -11981 -5191 -5940 -8096 177 -20171 -37505 -37404 -40481 -37362 -26316 -11772 -12210 -8365 -23849
6983 -23849 -23157 -10499 -2029 352 5161 5729 -3442 -24387 -17241 -11399 -1959 -8209 -9548 -19174 -7232
6968 -7232 -5256 -68 2213 6930 2227 6461 52 3147 3485 -4595 520 2135 -10797 -20465 -13811
6953 -13811 -4860 -6399 -13330 -14693 -35558 -43843 -25795 -12532 -11901 -9600 7611 8384 14422 7388
6939 7388 5731 -16522 -34535 -41437 -51428 -39515 -20920 -10566 2108 -1881 -4347 7970 5450
6926 5450 23436 21979 -10849 -12258 -26338 -22457 -15886 -20728 -21108 -2930 -1945 -17683 -19637 -21308
6912 -21308 -31028 -24663 -19043 -12579 -18421 -17413 -19389 -24228 -37843 -42768 -29876 -14446 -10546 -3459
6898 -3459 -9483 -51614 -44995 -12938 3988 -3366 -15681 -14839 2749 -1530 -19925 -23027 -21187 -21163
6884 -21163 -12240 -14744 -6470 266 -7562 -10694 -20814 -27525 -22209 -32944 -27824 -14213 -16009 -7021
6870 -7021 -6374 -6225 -3848 3812 2185 -28648 -30673 1785 -7673 -30349 -26898 -19306 -7039 -347
6856 -347 10462 6056 -10995 5719 -1424 -19147 -6689 -5382 -2750 4700 17486 -336 -17184
6843 -17184 -23526 -22473 -8357 -17400 -38800 -40602 -27966 -10301 -4104 -7796 -13070 -20831 -14083 -11432
6829 -11432 -18834 -8243 -2827 -11380 -22909 -9200 4015 775 12303 6072 17411 28136 10653
6816 10653 -461 11370 10651 11015 10390 10280 9541 6705 -2678 -4993 -19379 -12834 -12692 -7715 -14571
6801 -14571 -8240 -1330 -10025 -21402 -21458 -30114 -31465 -20818 -21301 -26779 -17745 -21972 -20883 -4539 -5693
6786 -5693 -6994 -6944 -24184 -38519 -40165 -23238 -13262 -11045 3111 12850 24077 24278 15302 10717
6772 10717 3216 -1182 11432 22816 21642 34618 32532 2423 -22759 -14408 6534 25483 32653
6759 32653 36798 35433 18591 11162 4498 7785 11356 3203 -7295 -6792 11882 17899 17797 17737 20408
6744 20408 16004 13843 5656 4659 3185 -4497 -13493 -7673 5298 13887 21474 24734 11766 -7698
6730 -7698 -23388 -24701 -5764 23850 19582 -114 369 1315 -9892 -2285 10718 16054 20237 4094
6716 4094 2015 7788 3459 3359 29608 29903 4678 15362 20707 26066 44671 38699 32368 46454
6702 46454 48098 22177 15946 18152 11405 16388 4206 -20352 -19775 12248 20143 -6008 -13002 -5681
6688 -5681 4333 246 -6096 -3614 -6560 -9552 -14243 -26331 -14169 8904 17748 13260 6446 -2767
6674 -2767 -9016 -8980 5479 -837 -10762 -26955 -25225 -22541 -16945 -7620 6608 7733 -7422 -27793
6660 -27793 -21545 -9942 -17061 -2931 13306 23108 11299 -21285 -45925 -46214 -24351 -23191 -29809
6647 -29809 -22349 -10261 -29280 -20417 -7883 -12733 -7549 -1711 -4849 5721 16431 9048 -3076
6634 -3076 -6862 -19827 -1262 7120 1494 -7082 -12601 -12245 -14256 -5983 -8425 -1209 8840 21920
6620 21920 13420 3825 -4761 -3818 -4846 -16175 -21254 -22037 -42731 -59975 -51577 -27083 -27850 -36356
6606 -36356 -37801 -32092 -38237 -27592 8257 15545 22837 39554 14511 11713 34423 21026 16344
6593 16344 25613 20733 11367 9337 2771 4450 -1251 282 20624 24719 11916 -1557 -2887 4670
6579 4670 472 1086 850 10070 14967 3721 -9473 -15343 -12584 -18381 -23362 -39700 -27010 -30573
6565 -30573 -7697 4355 -12494 -17688 1025 -165 -5521 -8257 -19654 11187 31948 34882 19266
6552 19266 10406 24424 13095 -2873 12154 17668 15860 5234 23955 29097 5653 8168 18830
6539 18830 27273 22534 23202 25390 28723 27027 17661 12586 13070 19190 11447 12244 729 -6800 -6868 -1418
6523 -1418 1445 -6561 10968 7366 -653 -1244 -6253 -13541 -12548 -9843 6513 8426 961 4816 8296
6508 8296 10736 8830 -9751 -13659 -13434 -9870 -15182 -16681 -9684 -12100 -10821 -13005 -9004 -17259 -23962
6493 -23962 -35217 -46385 -37099 -18047 -16188 4619 4889 8335 11559 2559 -6364 17092 14508 -1175
6479 -1175 8859 2690 -6693 -5742 -10088 -10602 -21539 -22296 -12266 2856 1578 -4828 -8359 -11711 -230
6464 -230 14794 13876 7918 -7775 -22250 -24267 -15307 -11101 -7565 -1963 -21367 -24083 -10192 8734
6450 8734 13910 -9877 -22084 -20822 -3980 9805 -2737 -23483 -8465 2346 7687 -292 -15120
6437 -15120 73 11590 7643 4675 2465 6547 17836 4638 -19851 -33768 -39963 -28683 -24738
6424 -24738 -21297 -15947 -23679 -35893 -36239 -29262 -16602 -10153 -15223 -23385 -32816 -35770 -28480 -29068 -30381
6409 -30381 -33216 -28910 -19646 -7641 -2171 -7011 -17543 -14848 12472 15392 6285 11421 23279 15292
6395 15292 16015 13984 13507 19550 20205 -16521 -40269 -36196 -33119 -16828 -12135 -9176 -9652 -9003 -9118
6380 -9118 -1951 -19723 -24603 -23685 -15881 2502 23804 18943 2669 -10954 -22163 -16163 -21924 -12180
6366 -12180 -10294 -591 14692 18096 8238 15713 30776 15625 -3922 -21101 -26499 -23630 -8401
6353 -8401 -16040 -31158 -23396 -20992 -7110 8857 9266 1093 -5290 -16021 -8717 61 -9126 -7600
6339 -7600 4149 -10000 -19082 -13889 -15140 -4475 7790 6831 -11882 -23046 -9831 -1282 -7499
6326 -7499 -15205 -12288 -13409 -8707 -12253 -7409 -15550 -14141 -18959 -11961 -10657 1688 -582 8646 11382
6311 11382 -16651 -26645 -14084 -444 -4419 -21474 -34778 -29531 -14359 -3701 13104 17543 3278
6298 3278 7984 8460 -1969 -4948 2394 618 -5413 -11684 -9421 -12263 -17161 -11403 2427 760 -1211
6283 -1211 607 5851 -9525 -184 8666 7784 3719 -5377 -19796 -20646 -1569 -2146 -23037 -13914 11405
6268 11405 25836 4612 -933 1042 -13444 -6729 -3953 -4036 -7181 10671 11299 -3677 -23206 -35047
6254 -35047 -31272 -41659 -37692 -28359 -33715 -17926 -17930 -22437 -7999 2562 5325 4552 -9828 -32964
6240 -32964 -45214 -36060 -22084 -8246 6475 24294 34765 38829 33650 5148 -28682 -30111 -22297
6227 -22297 2855 27321 12850 438 -2830 12662 9840 17614 17312 15020 23650 28109 24700 19766
6213 19766 28472 27264 7746 -20244 -18943 1593 10031 4313 4332 33830 27859 6618 -1150 -2922
6199 -2922 -5538 7066 14552 12923 16385 21563 13666 -157 -8540 6532 -9318 -16061 -8538 -14465
6185 -14465 -8004 -12342 -29560 -33985 -33599 -46640 -37284 -34916 -16349 7346 1821 13240 11996 -2140
6171 -2140 -11338 -6389 -10912 -16816 -14527 -16737 -20035 -16887 -8286 -1921 -3771 -7091 2598 -7253 -17052
6156 -17052 -17979 -13620 11846 15251 10514 16033 7265 -6246 -25935 -42575 -37922 -29733 -15678 -19659
6142 -19659 -8849 -13753 -8203 14050 9202 -12225 1135 6312 -80 -12975 -18248 -1072 -2854
6129 -2854 -1128 -6966 -25370 -27282 -26322 -24141 -29250 -30642 -21335 -10732 -3591 -5424 9273 17207
6115 17207 -1322 -6608 4241 8475 -2149 -20959 -18768 -11319 -10992 1245 4176 7719 -22308
6102 -22308 -23862 -27699 -32793 -7864 -7904 -15441 -10787 -10619 -20305 -19907 -21184 -28890 -37146 -19416 -11628
6087 -11628 7108 2246 -12385 -13658 4317 889 -3324 -9224 -19349 -20869 -5015 -3913 -9440
6074 -9440 -22610 -26084 -24565 -30407 -21871 -19207 -5538 5331 5646 -4265 -29414 -43592 -43793 -18615
6060 -18615 -8320 -10381 -21200 -38433 -35256 -33933 -35213 -24048 -18156 -13589 -6147 -15023 -17766 -19757
6046 -19757 -29983 -25693 -35066 -30123 -22022 -18687 -23853 -11234 -13825 -30939 -15992 53 -8902
6033 -8902 -11239 -20148 -18074 -32503 -39489 -57364 -56374 -34926 -34389 -37085 -23040 -11932 -20126 -16015
6019 -16015 -23346 -28970 -10603 -2713 -4767 -15138 -11486 -11293 -12781 332 5613 16802 11561 10382
6005 10382 -5648 -44914 -59134 -37197 -25870 -18264 -10605 -28009 -28745 -3564 16556 22746 26175
5992 26175 11424 -21894 -28368 -23188 -16671 -8583 5653 -4682 8719 13454 -4990 -9774 -7057
5979 -7057 -9163 -5074 -13911 -12460 -11565 -14384 -22866 -35441 -13909 -11071 -16697 -18648 -17940 -14177 -17106
5964 -17106 -23276 -21698 -28080 -27273 -20307 -8072 11022 15912 -1884 -32058 -34776 -15449 1554
5951 1554 -14728 -12975 -21164 3215 8999 17977 14420 14457 -16048 -33288 -24521 -18660 -587 14122
5937 14122 24747 12247 8727 11089 10961 11041 10502 30709 29187 15895 -3825 -11574 -22706 -21857
5923 -21857 -38468 -58984 -52017 -24092 -35167 -27319 -3213 -309 6341 -553 4808 13526 28191
5910 28191 33886 8505 -27409 -33843 -36798 -24620 -6069 -2173 5561 27247 32835 19831 12963
5897 12963 4489 -1078 -3458 -16641 -4500 8263 -1802 -88 4371 -5827 -1440 -1417 -13792 -3529
5883 -3529 1561 12057 21124 15643 17947 21055 15531 5006 -4951 -10414 -23338 -15894 -600 -10579
5869 -10579 -10095 -18614 -24626 -16083 -2135 -4992 165 -184 -16096 -26585 -4593 12034 1814 -5471
5855 -5471 849 -6805 -26444 -9228 -449 -15916 -31587 -27670 -26434 -33564 -23306 14486 4554
5842 4554 -14867 -31431 -35921 -11863 919 -18249 -28109 -11574 9214 7478 -10645 -17421 -13886
5829 -13886 -10107 11907 24085 8111 -11484 -1927 -3720 -14734 -18700 -5497 317 -8438 5552
5816 5552 18840 26287 15902 4387 2672 2361 3914 -6185 6248 6604 -5825 -6916 3258 18196
5802 18196 23468 37528 45079 32088 25018 20082 18336 748 -19607 -3503 11015 50 -7631
5789 -7631 -20716 -26219 -18938 -20124 -35378 -34130 -17034 7266 9363 -11660 -19013 -14236 -16098 -29601
5775 -29601 -38567 -26980 -18366 -10868 964 10270 10070 1925 4852 4618 1794 10634 9109 5599 7495
5760 7495 -166 -18091 -26279 -23881 -20754 -8445 -6410 -100 -12591 -20323 -18476 -29012 -30085 -15172
5746 -15172 -4843 7045 -1281 -19196 -33457 -13211 7178 5557 3433 -13641 -13280 -25050 -26854
5733 -26854 -11284 2071 16178 25605 27339 19815 11714 -2553 -28475 -10190 11832 11590 -13404
5720 -13404 -2642 1465 6672 6551 18483 26163 17416 -14868 -19011 -5041 17856 24334 28106 41290
5706 41290 33465 49484 49273 17247 6288 -36 3159 -5887 -13786 -14349 -11210 -14226 -1882 -12371
5692 -12371 856 9598 2004 -1165 -7708 -9905 -14208 -24431 -26282 -18941 -8841 -5292 -7416 -4649
5678 -4649 -4051 9871 6896 -16621 -29417 -12502 -1239 -3022 -7815 -20683 -20860 -5280 -1371 -23382
5664 -23382 -20944 -2166 -3221 2947 809 -11679 299 3662 -22402 -37566 -15476 -15841 3018
5651 3018 23715 26730 9274 -2914 -2928 -14594 -28034 -24964 -27750 -20079 -11460 3555 3738 13412
5637 13412 24887 9833 8014 -1061 -6726 1356 -6175 -2133 -4615 -23611 -18532 -24906 -12493 -7848
5623 -7848 -16800 -17678 -14492 -14452 -23126 -31868 -29231 -26956 -26868 -23427 -20292 -20468 -26275 -30304 -16473 -6469
5607 -6469 -18745 -18155 -26621 -36747 -22564 -26714 -23722 -15631 -9624 7256 26669 39119 27419
5594 27419 22057 27825 23072 24683 9103 -6503 14860 22229 14479 -3635 -1567 12089 16938
5581 16938 12085 5803 12095 -9933 -21712 -26334 -20730 -6420 -2281 -11480 -17604 -13728 -12204 -14126
5567 -14126 -10204 4395 15176 4647 -9121 1710 15061 10504 15385 15377 5131 -8382 -7382
5554 -7382 4186 6380 10516 9969 1202 -1491 -8965 -9544 -17975 -23482 -21266 -20233 -20243 -19257 -20989 -16369
5538 -16369 -12372 -16379 -23869 -26706 -15556 -9003 -21841 -28626 -40722 -48268 -48643 -46863 -37751 -8377
5524 -8377 -8221 -15957 -7747 -7363 -8964 -5065 -1268 -5307 -43 -34781 -33638 -13019 409 -1094 301
5509 301 -7082 -24426 -31824 -24037 -25471 -36352 -29810 -19677 -33735 -28228 -4543 4533 -486 -12562
5495 -12562 -22282 -27593 -24978 -3887 -4188 -12340 -30828 -30457 -18257 -5894 -2604 6087 8982 6250
5481 6250 -12511 -9634 -9597 -14608 -15820 -1985 8720 -8819 -1620 24365 25317 8613 -10194 -19514
5467 -19514 -24566 -26456 -16898 -17787 -18413 2110 12584 17810 -4984 -21581 -23019 -13001 -13086 -27244
5453 -27244 -31565 -12447 -23132 -18749 -17274 -9776 -27864 -25566 -12243 872 -479 -5154 -18626
5440 -18626 -34142 -19547 -7698 2703 -2988 6050 25474 33927 10231 6638 10055 -10559 994
5427 994 -1221 -24976 -35826 -37793 -11837 -8283 -987 11809 8916 18728 32426 41049 22571 10472
5413 10472 7208 10655 13751 3337 -7835 -7656 -5228 12163 17217 24860 8997 21597 38780
5400 38780 28524 25479 42393 48093 30276 16072 7326 -1498 -11078 -5898 -13382 -25038 -29908
5387 -29908 -13952 -3551 2450 -6222 -8885 -21916 -14508 -7429 -17187 -21335 -26134 -39094 -54911
5374 -54911 -27546 11228 -2675 -12331 7842 15070 675 -19818 -22941 -19849 -16116 1825 1369
5361 1369 -7304 7820 23806 15266 -3945 -8719 -25153 -42085 -40335 -34724 -28033 -15334 -6298
5348 -6298 -2551 -3533 381 5671 9426 14815 -2915 -4971 3426 977 1836 10305 23287 33961 29357
5333 29357 20540 12801 3879 -4553 -7386 -13995 -6145 -6394 -25012 -20297 -13957 -1475 6062 -6700
5319 -6700 -26828 -37696 -41363 -34431 -28028 -27399 -28956 -30931 -22160 -32063 -30398 -18864 2446 987
5305 987 -5304 1310 -2532 2877 -114 -8568 -16750 -19695 -12986 -6394 6945 14796 12298 10650 6398
5290 6398 9248 3693 -21338 -25081 -21464 -8430 3211 6096 25469 22067 9088 14818 -1130
5277 -1130 -5090 -16433 -12966 -18751 -7188 3759 831 -13675 -23163 -2727 13187 23452 26468
5264 26468 8880 -10672 -29741 -47679 -49791 -21266 -16802 -10087 2109 -4132 -7983 -19932 -21657
5251 -21657 -25397 -24260 -21196 -688 4479 -766 -22000 -28495 -35428 -8460 2257 -3462 -16643
5238 -16643 -7546 3758 -7943 -33143 -36787 -37997 -15954 -21438 -16 5117 -8559 9823 8113
5225 8113 -7248 -3946 1126 1567 7628 32946 31132 19782 15620 7358 6534 5658 17062 12134 -1011
5210 -1011 -11778 -6274 -2367 -9531 -9276 6029 4515 11144 22061 24144 12229 -3709 -6780 2474
5196 2474 15661 15146 14980 6900 11579 12401 6607 -13181 -7827 2006 1155 -7914 -5321 19294 20845
5181 20845 7417 4052 18606 30252 27998 36835 29027 17105 11340 -1118 -15914 -18672 -20795
5168 -20795 -16372 -3154 1351 3036 -986 -12777 -9574 2234 3395 -10081 -19811 -5933 4250
5155 4250 -351 -23252 -42594 -5547 9805 -7859 -23013 -22598 -31712 -22718 -9625 5624 11682
5142 11682 8804 -8483 -22108 -18213 -14761 7023 16798 1603 -7390 -24922 -25740 -30387 -22053 -14023
5128 -14023 1037 -4048 608 3252 6427 2820 -8465 -5723 6913 28460 34270 34649 32833 23250
5114 23250 14124 -1579 -3060 -9492 -14791 -12387 -5892 -17885 -41462 -25656 -13575 -37349 -35585
5101 -35585 -30291 -21225 -7401 12367 7955 -7183 -10031 -7388 10027 17239 18091 20861 18509 7476
5087 7476 1570 -8377 -14749 -30905 -26985 -14273 -1112 -16616 -2295 -12686 -29826 -18792 -25288
5074 -25288 -33258 -27305 -11891 13484 1316 -7933 9569 18175 9467 -6889 -6871 -10488 -7598 -13102
5060 -13102 -15334 -17906 -19761 -16545 -21667 -28673 -33242 -28936 -34417 -42157 -38376 -21423 -16141 -13546
5046 -13546 9459 22803 11184 -5758 -6152 -5657 -3649 -5773 -10193 -19947 -18055 -17071 -17146 961 7113
5031 7113 19500 16935 21868 46520 51554 54309 46370 9813 -16240 -23349 -35514 -37984 -17739
5018 -17739 -3602 6100 7847 10098 21249 15651 -1631 2693 -284 6550 -3703 -6539 16166
5005 16166 4822 -5116 -11007 9425 -1721 -22413 -29895 -23672 -9147 -10554 -11329 8264 15214
4992 15214 2671 2421 21 -14003 -41702 -41552 -25205 -21407 4594 9422 -2665 -4871 -18771
4979 -18771 -34213 -24679 -16213 -31423 -30517 -27526 -4549 3531 12277 10260 -130 7638 27042 15981
4965 15981 7914 14041 17039 26175 19382 7536 14458 -1802 -18843 -14090 17205 15362 9308 13656
4951 13656 31800 17057 -4943 -15005 -22430 -27705 -15599 -23839 -31391 -34233 -46065 -63654 -44535
4938 -44535 -19281 -39 6357 17458 45373 49333 39381 18093 17 8909 10045 -2407 -5274
4925 -5274 14584 14575 20360 26022 21218 10857 7430 -4865 -21120 -22132 -11262 -3492 10036 13580
4911 13580 8445 1506 2184 2196 -6347 -5265 -15131 -5054 12522 1937 12341 21222 17740 2083
4897 2083 -17858 -26642 1349 11650 7752 -2849 -9801 -6345 -9264 -5429 -408 1920 18617 17475
4883 17475 13310 -3514 -18178 1553 21578 51284 53526 43218 34691 15180 11882 2603 -138
4870 -138 -2783 -3840 826 -13422 -13194 -2810 -6978 -333 -9464 -15417 -7286 3156 7974 649 132
4855 132 10576 10763 23231 21016 15437 11760 1008 8643 15860 15502 1234 -4657 -11538 -14824 -14092
4840 -14092 -17252 -22416 -25063 -22385 -16194 -21162 -10691 -2324 -7134 -23329 -4496 8626 1216 959
4826 959 5512 6623 4355 5039 9723 3909 -1123 596 16626 16500 15418 19779 20830 6616 4513
4811 4513 -767 -18639 -9689 -9960 -12605 9978 18869 18587 4757 -12875 -12571 1236 8663 15855
4797 15855 17528 20850 11911 13974 -10548 -28327 -17376 4165 22279 37692 44023 26279 11055
4784 11055 10806 26455 36902 27857 7216 2013 20726 32607 12394 12387 -4843 -8504 -8717 10390
4770 10390 13339 18836 22440 13822 6314 -3987 -8062 6873 21906 14495 8422 11039 -3237 -4958
4756 -4958 12150 16492 22909 25979 7065 761 21550 20561 6186 -18275 -11596 -22572 -28681 -33276
4742 -33276 -24722 -10786 -5273 4629 8818 -3178 -7443 -5518 -10938 -15934 -11181 -2810 -16181 -40907
4728 -40907 -31025 -16775 -9475 -10985 -4880 -4296 -12919 -4663 -2829 3104 8418 -18239 -31398 -12481
4714 -12481 2123 19153 31548 24620 24791 5021 -11724 -3844 306 4448 6603 -6681 -14228
4701 -14228 -23850 -30463 -33322 -43753 -20439 -12995 1451 227 -6692 -14974 -29427 -24675 -14259
4688 -14259 223 -6344 -7098 3905 -5324 -1739 -1965 -562 16410 21073 4234 9897 16988 6388
4674 6388 -13070 -3271 -12174 -941 6079 -8086 -21366 -34738 -23874 -10763 2451 -2028 -14611
4661 -14611 -18378 -29462 -27558 -25172 -30034 -45581 -40421 -31962 -21337 -16017 -1775 -5149 4874
4648 4874 -1068 1991 14757 -2343 -21991 -9342 -17087 -24979 -11004 -6250 -11907 -21650 -21525 -26558
4634 -26558 -2530 -882 -10083 -23508 -12152 -13733 -9210 -83 -11723 -7259 -8138 2215 -19768
4621 -19768 -36641 -39720 -19208 -10819 -6459 -4250 -1736 -7199 -11004 -6386 11745 25718 18566 20080
4607 20080 3770 -14823 -33798 -16712 11550 19887 20181 1445 -1405 -1118 14151 17625 23278
4594 23278 21646 6657 9505 21809 15481 269 -1604 6464 -880 -493 -4681 -149 28095 28981
4580 28981 9386 1406 1905 6507 -1120 -5558 -5996 4718 -318 -6033 -1280 6848 26295 19949
4566 19949 16643 9322 -22659 -30301 -14658 -6449 -23989 -36374 -18169 -5056 -10714 -24147 -42493
4553 -42493 -45213 -55477 -48405 -40286 -48649 -28426 -14403 11543 -9124 -15188 -15932 -15872 -2227 2740
4539 2740 8246 17441 30828 17957 12176 17600 9930 12142 6585 135 -3286 -18124 -10448 -14019
4525 -14019 -22432 -31069 -25038 -17552 -19048 -16808 -6947 -8291 -15668 -13903 -29166 -21599 -10031 15479
4511 15479 41491 59768 40219 -3416 -7643 7375 2835 -3069 437 6151 -5888 -6010 -4119
4498 -4119 -22442 -23539 880 758 4391 3480 7194 -5410 -3476 -7119 -19912 -9919 10478 10738
4484 10738 16991 18772 16377 7137 15151 10528 10193 10282 -5909 -23075 -13266 -15433 -2927 15980
4470 15980 25425 5831 9798 22339 20113 13050 5516 8080 15793 10495 -81 3801 9641 20616
4456 20616 15007 -4193 -12906 178 10908 18852 23160 23797 16211 21513 9003 1590 10232 12607
4442 12607 11718 17741 14554 -1404 -32525 -24823 -10347 -7165 -13397 -12047 -8663 -5700 -2975 12733
4428 12733 12223 17265 8508 18414 20523 11533 7054 9955 10639 15053 26972 13326 -21994 -21713 -18795
4413 -18795 -37308 -25947 -4601 -1236 -13373 -6774 8342 6746 -7782 -23613 -10279 3341
4401 3341 -4983 -7389 -17216 -19241 -10425 -1920 2849 -16177 -39540 -36698 6257 27242 26651 11630
4387 11630 13184 1768 3086 4668 -2983 -18179 -32636 -16169 -12777 -7308 -5156 -14004 -17107 -3765
4373 -3765 1126 -2240 -4719 -2169 3381 -60 -1136 -7285 -3106 5800 -10426 -10935 -9667 -10245 -3103
4358 -3103 7005 -3111 -7088 4212 9833 1030 3792 11712 6356 -8009 -17589 -10961 -9489 -299
4344 -299 8272 21635 30917 12471 12984 24143 -2208 -8402 19785 19469 3166 8363 15897 27240
4330 27240 25740 19256 19869 34061 41721 46207 47618 34379 21259 13509 19342 23193 12136 -2967
4316 -2967 -7275 -4274 8362 10291 10143 15757 20202 11135 -7272 -9177 -8788 -11658 -3423 8606 13333
4301 13333 8245 10001 10532 20853 10918 13695 -7180 -9949 3107 7607 -1590 -12813 -3761 -1831
4287 -1831 2858 6561 3186 5611 18221 51536 51818 47093 49515 19288 8612 4760 16877 22158
4273 22158 14229 19517 16881 5169 -1896 -331 1122 5826 10032 13311 -10388 -29967 -22344 -22402
4259 -22402 -9243 9253 3642 2689 7244 302 10726 9090 11569 -4559 10063 22145 10213
4246 10213 -8326 -7440 -7105 23560 17118 -12862 -25474 -17871 -5895 -4403 -8586 -14304 -15298 -23442
4232 -23442 -9973 -3105 -3627 -10904 -15617 -16394 -2200 -12683 -8698 -11877 -3695 5223 7278 4998
4218 4998 11685 38970 43747 26275 11426 12030 -3572 -9729 -55 16140 10935 -366 11225
4205 11225 15208 13380 5382 5761 -10823 -14157 13734 23269 22328 12524 246 818 -3281 -4798 -9571
4190 -9571 11024 19150 16124 217 -5570 -15726 -16557 -13810 -13946 -16075 -13136 -7997 2387 6666
4176 6666 -711 2171 -7738 -9755 2297 937 -6044 -17050 -10544 15264 13425 8968 4039 3477
4162 3477 6734 -7265 -5571 -12542 -19201 -8249 13002 27550 29895 26967 40124 20295 -2482
4149 -2482 10892 14236 10216 -2531 -19759 -32521 -21564 -14148 -30205 -27158 -4435 -5042 -11136
4136 -11136 -16057 -2714 6250 2165 -4515 6047 -2433 -19663 -23564 -2319 6873 10934 377
4123 377 -213 -13214 -22411 -4719 12707 24898 37967 32397 22484 14714 -2938 -22097 2116
4110 2116 -9644 -27983 -40762 -23236 8410 -8962 -21987 -14920 7483 6199 -5992 -13694 -7144
4097 -7144 5227 -6408 -8951 -5702 -3915 -3661 6926 -3292 -17488 -28573 -26209 -16735 -2890
4084 -2890 -3237 12635 1548 -13598 -11367 -1643 34034 44288 33386 14701 1864 10565 21478
4071 21478 26208 38218 29711 14267 23939 26076 32812 20509 25830 35531 20786 15067 17881 21263
4057 21263 9491 -13762 -14575 2116 -5525 -518 16634 22342 23845 19622 6383 15706 27344
4044 27344 28578 28348 18172 10056 9423 -9854 -23611 -23337 -6654 -11251 -22973 -6339 -15587 -27399
4030 -27399 -34725 -40373 -48422 -41977 -31284 -4831 4792 -5743 -2923 636 -4308 8728 6447 9184
4016 9184 5738 12209 -784 996 8592 20824 27350 25131 36978 19299 1827 -2641 1779 -15265
4002 -15265 -34808 -44148 -25635 -979 -3562 -4143 -12960 21399 21248 146 -172 23486 22812 19906
3988 19906 19435 14381 21934 5437 -16912 -25183 -15223 -4160 5819 -5808 -6555 -8407 5776 20545
3974 20545 11796 1750 -3700 -28881 -40108 -48633 -50111 -26626 -14733 -5711 3959 1428 12108
3961 12108 28076 6467 4692 2208 5639 24418 23715 -6110 -11597 -24293 -13275 817 14822
3948 14822 14428 20190 14802 20063 13148 6239 -3139 -6356 -6281 -4492 1078 -4861 -11168 3015 -9407
3933 -9407 -31253 -33098 -20577 -26982 -24371 -15586 -12037 -10982 -3042 2801 -9501 -10000 -8183 -4719
3919 -4719 -10697 -16855 -7184 -14388 -15087 -21360 -17952 -22002 -24025 -22615 -22200 -7768 18986 23461 -4813
3904 -4813 -22591 -27689 -21379 -8981 -12263 -22987 -21185 -13119 -23883 -25741 -5654 -5645 -7932 2672
3890 2672 12171 14826 14330 16400 13362 2086 -13018 -17521 -20564 -19676 -24032 -19797 -15293 -10498 -14489
3875 -14489 -3462 2459 -4985 -13019 -14126 1550 24972 27689 35334 36205 42899 40262 -612 -20138
3861 -20138 -17636 -11500 -22045 -24389 -17110 -24623 -3667 -1528 -8035 -21252 -25887 -20221 -18551 -36873
3847 -36873 -24873 -32886 -33624 -21694 -10666 -3440 6073 -6673 -3925 22785 24465 3693 -5634
3834 -5634 -5766 -5439 -5121 3936 -12435 -17252 1390 5030 201 -6334 9117 15107 -3357 3213 7409
3819 7409 -4151 -21295 -26259 -2181 -2722 -9751 -14002 -9154 -8753 -2051 3734 -1563 3911 13108 6475
3804 6475 -16694 -22618 -34521 -20653 -13344 -11594 -13749 -10236 -6835 1051 20031 19753 4633 -3140
3790 -3140 7829 3866 5789 10795 27192 16967 -2379 1036 -39 7465 13713 22604 31283 26525
3776 26525 25519 6395 -3471 -11326 -25009 -17401 -6251 13112 5380 -2196 976 9275 23783
3763 23783 2946 924 -1449 4504 20646 23195 7684 10307 6772 2750 17573 23813 3492
3750 3492 -9678 -16537 -8369 8994 7624 -3230 -24282 -33321 -40417 -15325 6347 18151 20153
3737 20153 18900 76 -20323 -19885 -21835 -16318 -10295 10033 4508 1113 6497 10388 14992 6036
3723 6036 -5915 546 -7980 -4615 -6887 -13236 -928 14560 35634 34171 15534 15712 6035 -15625
3709 -15625 636 33135 25437 20116 31374 25855 10695 6436 11626 9803 994 4125 1040 -21473
3695 -21473 -20677 -5720 4558 -2210 -24168 -22429 -25786 -27263 -15654 -20279 -14238 -26990 -40460
3682 -40460 -28426 -14462 -18901 -6437 -29 -9562 -17423 -6888 -1439 12689 21422 15644 4367
3669 4367 5172 -10834 -26160 -10796 5993 4332 1697 11319 18922 13181 7732 20135 25262 26571
3655 26571 18566 8650 -3420 2820 10256 12509 21517 13227 -8528 -15875 -11596 -13117 -14625 -10870
3641 -10870 -9043 4244 9161 549 -10738 -10531 -9138 633 1027 -551 -13088 -22785 -35135 -27666
3627 -27666 -24437 -32098 -21418 -2626 -1388 -14490 -18795 -16686 -12358 -2695 -38459 -33264 -16949
3614 -16949 -17386 -3880 -6924 903 10561 7096 15730 20289 18412 21928 9448 3448 4288 4842 17649
3599 17649 20433 -3516 -5234 1581 3288 16167 14150 9773 12357 -16136 -29854 -20600 -13051 -2761
3585 -2761 7277 -747 -8711 10151 7920 8819 8734 3396 -3339 -24292 -21130 -3621 -1946 5619 2287
3570 2287 -853 -5422 -4656 8569 8872 7574 20453 21546 32565 38958 43549 50425 41391 20088
3556 20088 -2134 -14882 -6643 1124 -4603 -12273 -23103 -30143 -31682 -20199 -15743 15683 19352
3543 19352 17960 7673 -21404 -33539 -40327 -22754 1617 15971 28881 26468 25052 28719 28062
3530 28062 11546 3767 -9148 -17286 -20320 -14850 -17466 -37884 -26716 -14078 -8903 -3836 25465
3517 25465 41644 44388 31889 16254 13368 12430 15871 2497 -18398 -10829 -10821 -17076 -12799 -3018
3503 -3018 25442 40314 29302 13214 -3617 -7041 -12099 -4955 4961 17474 21009 11833 -252
3490 -252 -17753 -17328 -1878 -2948 -1048 1190 -2486 11925 21280 15223 9489 14666 1233 -9739
3476 -9739 2120 -2119 14530 33837 11070 3462 13258 11652 -3432 -14691 13231 31659 22687
3463 22687 3164 16967 23195 30189 20536 17146 19641 20160 16761 15153 28762 37953 34400 40723
3449 40723 50826 34763 21962 8559 -6369 -18065 -1877 6423 32344 31905 13435 -4743
3437 -4743 -14830 -14045 -14013 -14942 -7008 15037 10471 11064 9239 8967 13210 442 1487 10219 5382 -2152
3421 -2152 -1211 -10082 -2560 2782 3446 1805 1879 -3712 -19251 -8848 9245 12988 -9382 -10266 7490
3406 7490 9446 14301 22600 11848 -3632 6177 21425 5010 1661 -1163 -4581 -20040 -21650 -8150
3392 -8150 11325 22634 29290 25351 2409 -23769 -26940 -11624 657 7238 19288 25736 23187
3379 23187 17747 3263 -2861 -6805 -23840 -28611 -34548 -37327 -29520 -6798 9165 30242 30296 20929
3365 20929 229 -3182 10014 -1860 -17885 -16913 -12777 -10684 -6712 -4123 -16120 -27295 -13871
3352 -13871 -382 7211 10328 24922 17926 -3894 -9585 -17454 -17699 7057 -5162 -23092 -16218
3339 -16218 1081 -3312 -6356 5068 19190 13334 -3368 -11247 -7862 11066 -20 -800 -2866
3326 -2866 -9160 -5069 11767 7172 9074 367 -7972 7940 12033 14451 -767 -3433 4131 -4812
3312 -4812 -5604 345 -15165 -15703 -18453 -2153 -7875 4999 15399 5310 -60 -15631 -8996 12809
3298 12809 4479 -4494 -10477 -2941 -6628 2487 4923 1594 -9178 -16205 -7340 9048 15969 12414
3284 12414 1917 3037 13916 20610 1636 -19506 -16270 -23261 -22047 -22348 -15605 -2868 3587 -8112
3270 -8112 -14075 4200 15783 24600 23079 15290 10922 1143 -6991 -17766 -25328 -23439 -17497 6427
3256 6427 -13756 -14882 -12839 -8259 -2486 -11199 -4118 2107 -17707 -34999 -21448 -7220 -4090 -3214
3242 -3214 6318 30175 40741 29263 35238 25371 21709 25784 31780 23960 30763 22547 18421 21193
3228 21193 3899 -5297 10075 14548 9206 -2100 19036 23190 15002 4890 11978 13970 -13244
3215 -13244 -22655 -6193 9028 9658 16119 27426 28846 15959 16180 16275 23666 16577 -9900 6357
3201 6357 18799 6155 4978 -1401 -9262 -484 12567 9311 9655 11997 -10570 -28554 -17382 4072
3187 4072 -6227 654 14193 12475 -5759 -6004 2615 11929 -45 -6748 -8364 -5728 -16944 -33645
3173 -33645 -30282 -6434 6448 -17476 -30385 -29359 -19099 -11930 -20777 -30253 -16308 13944 28619
3160 28619 10961 7016 819 10862 16469 21051 16952 17202 21602 10057 5933 10031 10903 -3287
3146 -3287 -14661 -15351 -21542 -17786 -8141 -18440 -27130 -22596 -16025 -16270 -8433 4036 8939 15250 25203
3131 25203 27133 13129 -4314 -10302 -8155 1485 14272 28205 25240 11011 13651 16096 7963
3118 7963 -4882 -15659 -19979 -18273 -22487 2259 17000 17224 8710 1056 6264 8286 6831 5697
3104 5697 5625 2876 -10292 -18649 -9651 -4715 -4151 -12712 8367 37476 22163 3028 -5602 16440
3090 16440 32355 24142 6702 15804 21964 31614 12516 -3549 -19247 -10289 -12472 -26377 -22825
3077 -22825 -7863 -118 29234 47705 17325 6629 19476 21462 20766 27368 39846 41501 24125
3064 24125 9156 2384 6254 8829 3852 9034 -5525 -20154 -35728 -22141 -12781 -1087 2531
3051 2531 2323 12572 27816 29863 30342 22586 8205 11484 19038 26243 19535 9125 15459 8847
3037 8847 10624 841 18657 21905 11582 -4996 -13761 -12096 -6132 -3306 -5551 -2790 -1409 -2927
3023 -2927 -6600 -4240 6921 5449 4870 -3405 -5185 -24551 -29772 -29653 -28752 -23845 377 16390 17101
3008 17101 14556 15014 9124 860 17786 24059 14840 4100 10631 19373 11236 -4627 4476 -4595
2994 -4595 -28890 -26413 -17528 -27822 -22355 -1268 1266 5998 4011 8732 -7431 -2486 1229 -21488
2980 -21488 -18694 120 -14289 -29032 -15384 5205 29994 23526 16316 14423 6524 20953 30179
2967 30179 27549 22241 14930 -6028 -16288 -7051 -14635 -12298 -26968 -49896 -42174 -24390 -12065
2954 -12065 -4579 -12621 -13033 -5984 -3432 12670 30307 20355 -9335 -19755 -10642 -21450 -3977
2941 -3977 -1093 -8945 -19139 -3239 6659 474 -17605 -7116 7597 13584 5210 -8348 -1066
2928 -1066 14305 21393 12195 9463 11199 -547 -12635 -22311 -67451 -74736 -52489 -7157 14922
2915 14922 23148 26360 4956 -21745 -14080 1038 -6772 -18633 -6078 -6473 -9112 -4426 -10252 -30543
2901 -30543 -29194 -5198 -3443 -4215 13135 17749 21300 30700 15279 -2538 -9163 -3848 -1230 18622
2887 18622 32257 31877 10195 -10242 -13506 -3966 4754 4442 1769 16125 -11554 -32898 -27310 -29797
2873 -29797 -20641 -1790 6261 18011 24341 11012 16351 -2737 -4063 4062 15081 36823 34183
2860 34183 20400 -5629 -14455 -15020 -6471 16905 17728 13432 15055 9962 2771 -1678 6956 4365
2846 4365 11664 21394 28815 12478 -5822 -5049 -18079 -18955 -27602 -22442 -8046 4432 15061 32107
2832 32107 32016 3486 -24024 -31413 -37389 -30590 -16908 -13612 -3700 14269 8896 9530 23700 38252
2818 38252 18825 9417 3121 -15783 -18979 1934 37596 33720 8329 -9612 -11182 -23858 -34179
2805 -34179 -29883 -26987 -14005 -8324 -13650 -23046 -33761 -43298 -20435 1787 10431 5482 12427 22765
2791 22765 28483 20403 11563 -957 5400 3419 -9425 5438 22994 38726 37447 58117 60292
2778 60292 49060 23765 11241 11704 -3542 -11412 -14551 -1184 12961 19929 19290 14139 11644 20852
2764 20852 26457 36082 41674 32615 13230 19307 11767 -2335 8122 10190 13198 2399 4973 26527
2750 26527 23185 26963 13393 5801 -11754 -9593 -15881 -24711 -20777 -11170 -8861 -12418 -9914 8711
2736 8711 17868 22585 13798 1101 6183 6897 4634 -7387 -14009 -5748 9890 -5506 56 -1709
2722 -1709 -18909 3462 20154 14121 7891 -3793 -4801 -5396 -7023 -21927 -29459 -9559 -5515 -14433
2708 -14433 -29266 -15617 -701 -17959 -30575 -5689 -18133 -1132 7574 8863 29039 26551
2696 26551 8387 2632 3207 7152 -8049 -18958 -15668 -12941 131 4582 13175 11230 11641 4473
2682 4473 -2617 27401 43732 44834 38307 24420 8705 -6720 -19407 -16717 -7166 -1951 -20714
2669 -20714 -25869 -29173 -19836 -17561 -5827 6956 14747 -6889 -28637 -24869 -13650 -4378 10101
2656 10101 -579 3206 5119 11181 -2161 -25748 -16634 -14686 -8072 -5459 -7997 3949 25724
2643 25724 23988 17319 26386 28113 25408 25956 1189 6269 3987 -9340 -18321 -10632 -2519 6978
2629 6978 10368 11776 16820 42068 36313 23075 12516 14367 30733 40893 38583 14405 18666
2616 18666 2306 -11849 -7860 -23173 -17528 -6731 10013 7159 4764 13240 9983 10560 7987 16296
2602 16296 29673 15580 -6387 -24327 -21335 -14503 -22849 -38363 -19616 7783 12056 18922 22838
2589 22838 26355 32734 38756 25032 4709 -10597 973 12096 4592 20627 27952 37383 17136
2576 17136 1201 5537 -3580 -17535 -31195 -35324 -19866 -18460 -24623 -26443 -25540 -10262 -2045 -7784
2562 -7784 -9969 -11199 -24890 -22561 1793 8070 11553 5505 6933 -4486 -14006 -10464 -13691 -9805
2548 -9805 -1479 755 -7866 -19425 -13615 -10859 -12092 -8954 2142 1561 -11611 -11437 -30366 -18685
2534 -18685 -10637 -6191 -4058 8408 -4588 -15876 -15347 -14819 -19101 -8795 -1325 -6324 -8367 2416
2520 2416 -14124 -28103 -19550 -6264 -6712 -11261 5154 12709 5131 -10360 -8819 5181 -19858
2507 -19858 -10037 167 1523 -1489 -11210 -17270 -11731 -5712 -877 -11026 -7339 14511 16994 4827
2493 4827 -2148 -5941 -1215 9248 17766 29962 23617 16459 947 -9379 -23603 -41659 -51193
2480 -51193 -42090 -42706 -36164 -32024 -27538 -29309 -34955 -18330 969 18900 35635 25990 19432 25268
2466 25268 26145 16627 21595 37474 20307 31918 28499 20559 21201 19748 20244 23107 11552 -6705
2452 -6705 -5761 11482 24934 17322 18900 30756 16222 1545 11532 17703 3034 -7060 -2703
2439 -2703 -5385 4469 13410 25676 15284 3804 27203 21211 13246 9882 16521 17306 17741 27215
2425 27215 4162 -4104 13911 19826 29275 21488 4030 -10596 -11795 1621 -1127 3047 -2691
2412 -2691 10164 3677 -3186 659 9261 9036 -5018 -14796 -23972 -10912 1378 3907 10577 17255
2398 17255 29348 42662 38441 43853 24187 9566 8334 5495 4033 -921 -1202 -12730 -8939 -5116
2384 -5116 -15107 -12939 -7039 -13993 -7945 11023 21499 15811 5414 5576 11701 -2363 -5835 -20696
2370 -20696 -24131 -23914 -31556 -40346 -51471 -52476 -60190 -54869 -34250 -31787 -25651 -14953 -27278 -31200
2356 -31200 -5534 5912 6610 -8991 -14329 -9940 -7013 -13250 -25766 -32217 -18616 -6873 -1830
2343 -1830 15162 34477 28714 27101 9059 -3026 -11592 -32768 -18283 -20649 -14593 -8115 -18552
2330 -18552 -21068 -12003 -20925 -11906 4985 13132 14878 22407 11640 -6521 -10746 768 -5247 -7309
2316 -7309 -7111 -7137 -19496 -25430 2722 13827 13341 13103 13510 11588 10714 9350 7501 -3702 -2361 -6280
2300 -6280 -22406 -24201 -13505 -11720 -9076 -21714 -30501 -16918 8138 3472 -11697 -11550 -5690 -3276
2286 -3276 -5461 5565 27690 22994 -5050 -7327 6996 8939 15550 22483 23545 19098 9277 10025
2272 10025 8306 7944 877 -1150 -2126 -6722 -3883 -22706 -39848 -42412 -25091 1051 -21892 -28578
2258 -28578 -24073 -8432 -701 -8884 -8652 -11342 -1405 5002 -12846 -36003 -19587 16996 19795 1267
2244 1267 5776 20820 14560 6209 22024 48302 42530 29941 41752 32322 10210 7597 21448
2231 21448 12147 2495 9592 16467 4565 3652 16545 7733 -10900 -9871 1508 -7671 -17850 -10902
2217 -10902 9437 25953 42917 27723 16307 14932 16987 17258 10050 472 4521 8616 -2138
2204 -2138 -4370 15861 16233 7962 2402 1029 5633 10674 21048 21898 8869 -12675 -25204 -16470
2190 -16470 -7396 5258 7066 -12655 -19038 -11316 2420 8372 12230 18371 32719 39837 19674
2177 19674 147 -9423 -8673 3611 4579 -4578 2621 13236 21605 17781 12229 10938 2487 -6790
2163 -6790 -25446 -34518 -6238 10504 6889 -10633 -24993 -12522 -1079 12867 30977 50734
2151 50734 40715 11727 -2206 2262 -2342 -18106 -35811 -38223 3323 33484 34935 23669 26771
2138 26771 22720 9066 7302 6900 -2800 551 -11430 -11039 -4763 14303 12533 -5653 -3420 -7230
2124 -7230 -2809 -7969 -12695 6994 19781 8218 8964 16756 1990 -14116 -9790 -10294 10438 6685
2110 6685 -2806 -12537 -1010 10959 16695 16436 16044 7636 -7448 -16449 -1608 -4846 -8733 6390
2096 6390 15263 27128 30421 13135 -3676 2225 7125 6536 -6503 -3647 -51 -18875 -33083 -23708
2082 -23708 3889 17543 12775 19 -257 14690 28097 23631 18713 25244 23802 11600 11851 1111
2068 1111 4732 20716 8391 19080 17372 8035 -5666 -10420 -14613 -9408 -19779 -24166 -15619 -17081
2054 -17081 -24268 -11844 -12075 3506 9266 14361 -10032 -544 -7881 -30382 -29754 -24710 -8892 -19363
2040 -19363 -27097 -7196 -5984 -21702 -1292 30756 16056 18526 25828 34558 35903 13874 4611
2027 4611 27892 44736 21372 1169 12497 10841 870 8568 11693 -767 -11696 -23159 -30668
2014 -30668 -31590 -27645 -9099 10896 15256 -4978 -5241 -10634 -9882 2757 6297 7545 -16931 -23422
2000 -23422 -28729 -7249 -1722 6076 6086 -15106 -21426 -18580 -11789 -4974 -4248 -241 7510 8354 -2425
1985 -2425 -647 5662 -1959 -10871 -17434 -6664 2865 -2227 3339 8088 -7521 -3651 -6109 -10566
1971 -10566 -7187 -12581 -24268 -10076 15944 35070 36188 18213 27995 45968 39072 27585 22093
1958 22093 23578 39220 43323 25649 7657 1714 -4024 -13180 -15424 -20203 -19285 -11608 6379 20343
1944 20343 21528 22128 11314 -2514 -2425 -6465 -8252 -21576 -15239 -9812 -975 14647 20177 3570
1930 3570 -4537 1806 7736 8377 9224 5633 -10132 -23952 -13122 -17086 -22286 -14802 -13360 5434
1916 5434 7332 7792 -4995 -15688 -6404 8715 -585 3607 12086 18454 15587 13101 -1503 9294
1902 9294 8284 -5090 3898 1261 -9404 -5634 1608 21756 27747 11928 9493 17862 7039 -5212
1888 -5212 6547 13812 21782 40178 56710 43870 38687 40162 14838 5780 12103 -5907 -7670
1875 -7670 1557 6443 6054 924 2211 -6057 -16865 -25711 -1975 -11683 -9803 408 270 -9136 7030
1860 7030 24816 3953 2605 7567 16149 31646 22843 4649 -8225 -10979 -10664 -4822 -2229 3927
1846 3927 20125 19434 13131 20948 10976 22054 28537 41432 46931 37230 30228 21429 16659 18712
1832 18712 10324 19265 28352 24662 23581 33320 23425 4726 -2839 -13328 5226 9452 7681 2628
1818 2628 -22212 -15491 1442 2628 -856 19749 9296 -4394 -21046 -17887 -3429 -8016 6640
1805 6640 11119 3611 21508 27422 26204 12231 9753 21440 10313 4657 14168 3174 -13979
1792 -13979 -3597 14050 16099 18454 17869 15786 1899 -17054 -6987 -4117 -4421 -6504 -5979 -304
1778 -304 271 9353 20069 17735 12184 14326 13551 15828 22685 10070 -1742 -2346 -651 7421 15385
1763 15385 33556 23369 4030 -857 -9950 -12626 -9580 -12034 -11983 -2066 9453 12278 20362 24864
1749 24864 28839 24335 24540 19248 21233 25780 22821 29456 32122 39190 13037 -9934 -5130 5985
1735 5985 9264 2073 -19567 -11005 -4993 -141 31983 32368 -1132 -10520 7686 17365 22136 18307
1721 18307 3785 356 -6920 -2946 10203 18599 29227 33101 18599 20968 19246 22398 25961 16534
1707 16534 -3185 -3764 -10240 3410 4849 4714 -1936 -558 8355 14189 6406 -347 -17322 -26203
1693 -26203 -18886 -19034 -7276 -2846 10058 8557 7430 9199 6111 -13021 -7136 786 -11483 -16900
1679 -16900 -13501 -20904 -7559 -4234 6211 22547 24274 14865 -6815 -29919 -25799 -16404 307
1666 307 5401 2598 3193 -3438 -2419 10594 22407 17495 12719 -11598 -18198 -8808 -9748 -13175 -15621
1651 -15621 -11059 -10769 -5812 -3748 -18043 -5952 8109 -2377 -13211 -4278 6067 7412 -11052
1638 -11052 -17436 1213 3290 12432 13408 21952 34079 28247 20314 10355 -9562 -6022 -8348 -14689
1624 -14689 -12806 -8288 794 19459 26930 18155 7890 -439 -12577 -32270 -33997 -19893 2041
1611 2041 13700 8363 -1113 -9796 -6215 12793 21387 20032 25102 15366 -382 8071 6947 13444
1597 13444 28729 33069 24491 23548 23473 22217 20567 7330 -4376 -20331 -25148 -5319 21916 14465
1583 14465 26591 29432 35174 41671 22929 26911 29123 10493 9806 19572 2739 -15600 -3555
1570 -3555 -13443 -11229 -7630 1543 2109 -1518 2938 -10706 999 7356 -5951 -17539 -4780 21043
1556 21043 36261 34472 7498 -18270 -7678 3269 -1555 -1084 10454 32546 23200 -2716 -10092
1543 -10092 10601 14858 11118 331 -12513 619 -2586 -1206 5304 7957 8237 9494 690 -2942
1529 -2942 3506 8672 7357 14566 10502 -7127 -13268 -25026 -20352 -13815 -5914 -20715 -29573 -15259
1515 -15259 -7045 -5145 -1519 409 1470 -18279 -39871 -37707 -14669 -6417 -16758 -1108 19437
1502 19437 13621 11480 9992 2011 4946 6733 -1001 -9788 1179 27656 22979 17042 -3835 -27333
1488 -27333 -28403 -5538 18581 26153 14056 9098 -11801 -6362 -6551 -25198 -20251 -34349 -19145
1475 -19145 -2278 -20238 -21835 -21902 -24385 -33562 -23484 -17255 -1107 -7007 -28834 -23775 -25663 -24510
1461 -24510 -17807 5705 22157 25959 -1636 -18263 -10819 -10865 -16663 -13877 -1307 948 16762 13707
1447 13707 -6903 -7922 5997 16266 11989 450 2245 7752 2483 6158 477 14 4389 9896
1433 9896 -896 17150 25064 5653 -12943 -6901 15105 5137 -10101 -13543 -18932 -26434 -41616
1420 -41616 -19834 4293 11768 -4942 -13664 4388 8293 -4294 -12874 -5993 -6616 2908 15464
1407 15464 17211 20894 -168 -20062 -23964 -39153 -28204 -23501 -35148 -29954 -15088 -10773 4887
1394 4887 -4669 -3641 -8499 3751 21066 31268 14524 7489 20501 9379 20590 16718 -855
1381 -855 -1125 -7501 1484 21626 14040 13596 -3033 3737 -7673 -19820 -15347 17617 34940 25506
1367 25506 2506 3597 11439 18048 33943 25244 21116 13847 16247 11729 16782 12307 26131 24177
1353 24177 35339 24689 3490 -943 -1793 -10177 -277 7100 18010 19428 26863 31117 16399 1684
1339 1684 -1198 22789 27121 31557 27553 1176 -11681 3877 6384 -1724 -3999 -8948 -971 -2349
1325 -2349 5168 14644 16154 14417 -4063 -7877 -16162 -25662 -24175 -15673 -21973 -11861 1399 5200
1311 5200 23215 33729 22597 6442 -7659 -4552 3906 10282 2832 -8569 -40318 -51748 -41486
1298 -41486 -32592 -14702 5900 13162 7773 12141 -1099 -20834 -11848 -1637 2824 4373 7132
1285 7132 14433 10402 -10823 -25517 -24324 -19269 -16602 -13540 -7279 -10305 -5647 18872 26239 7531
1271 7531 21581 27098 5136 7081 12859 16384 24165 24515 38752 22171 17996 7463 -11572 -1691
1257 -1691 -2301 -7755 -612 -695 -1161 -3887 -10637 -20550 -7601 -3394 -9493 -6530 -2427 -2567 -6581 -21745
1241 -21745 -22124 -31503 -23947 1630 17026 13455 6435 -6819 -177 7858 4196 -2280 -9292 -14179
1227 -14179 -401 24315 11401 41 -4714 12636 12046 -1610 -12238 -8438 -13917 -18214 -13480
1214 -13480 6773 -7558 -17740 -28569 -21521 -16836 7276 13436 1815 -2372 -2419 -10543 -10881 -4125
1200 -4125 1293 -818 -1360 7418 20770 27766 14242 4128 13644 19439 10982 -1516 -2671 4962
1186 4962 -276 756 12232 14635 32285 47020 37267 24752 21779 10644 -10633 -21306 -17878
1173 -17878 -6790 -11770 -17108 -1955 -6459 -14271 -17935 3308 20969 19368 6716 -780 13750
1160 13750 11506 -5302 -23370 -18448 -21370 -21882 -13253 -369 6486 18488 14806 20674 21647 17914
1146 17914 2924 3113 5337 2476 3792 18328 11520 11468 15136 28506 24998 1111 -30272 -35947
1132 -35947 -29432 -4232 10899 13079 16406 26476 22630 20212 26236 14670 14425 27819 30298 19087
1118 19087 10282 11953 19960 41927 55820 35607 -747 -9632 -17037 -2692 20217 5641 13402
1105 13402 23399 21872 17266 12743 22102 37322 17017 -10000 -11477 -670 12120 8222 4594
1092 4594 -5296 -15165 730 4562 1095 9736 28681 22362 17123 20095 -730 3936 9146 -16045
1078 -16045 -23003 -10568 719 -1809 -18866 -9540 -2112 4358 8327 5431 -6267 -20345 -28203
1065 -28203 -21477 -22904 -31073 -27420 -24551 -10781 1075 7938 4765 -774 -18900 -28024 -7790 -413
1051 -413 14722 10565 21278 14092 7477 -7614 -8049 -11814 6321 30638 11631 -26708 -25169 -16538
1037 -16538 -10301 -9020 -1393 11515 16709 27746 17587 7553 -5551 -17950 -13368 -20531 -28810
1024 -28810 -33696 -27049 -5564 -6052 -13041 -27506 -38066 -27612 -26270 -17703 -7242 -26340 -42744
1011 -42744 -29097 -17024 -2069 -467 -12674 -23593 -33269 -17722 -7036 -17623 -19167 -412
999 -412 3514 -2330 -9095 -8121 1568 1266 1398 6157 21475 29002 17305 -4576 -18108 -10595 -30793
984 -30793 -28958 -1468 8299 -11628 12835 30946 24063 26406 26161 16765 7373 -7265 -16637 -8280
970 -8280 5356 -4933 929 11932 3502 -3107 -11669 -7357 -4827 -3938 -11446 -12381 3040 -600 -9999
955 -9999 -14638 -17046 -10749 -22747 -33657 -8267 19727 29385 23871 5706 -2418 6630 4992 -2336
941 -2336 -9931 -15241 -3248 11601 23175 22642 10467 -5296 6915 12881 -10971 -18422 5393
928 5393 -965 -19559 -17101 299 25310 19847 21970 17430 24177 12601 -703 5307 -12130 -11602
914 -11602 -26562 -27473 -16934 -14266 -15560 -14290 -16568 -18061 -15895 -21487 -23875 -1591 13495 6055
900 6055 12823 4146 -5074 -15241 561 14903 3901 -21101 -28202 -21183 6801 1554 -3050 -17515
886 -17515 -20620 9174 4078 16598 27082 28850 7584 -566 2155 -8816 -9824 -18337 -19023 -2602
872 -2602 10800 1505 2067 -4748 -20042 -15924 -19174 -28026 -40204 -29716 -17762 -2101 10609 442
858 442 -2418 5006 3946 -1986 4665 18326 24682 21709 16870 30628 41679 16359 -65 12134
844 12134 25977 5275 -9528 -19356 -12403 264 22782 35290 26475 6707 6338 -8509 -112
831 -112 15572 2855 -20448 -29782 -36486 -36946 -30736 -32684 -45649 -48102 -23658 -858 9434 179
817 179 12935 24650 20097 32223 19841 1049 -1232 10851 34241 10469 16185 28807 26207
804 26207 8502 -4919 8753 1716 -15108 -17082 -25338 -11833 12929 18496 10416 611 -11810
791 -11810 7596 23760 13643 8565 -9586 -5303 -15336 -10248 -14294 -10135 -5554 -930 10226
778 10226 18700 23043 29938 38880 24840 15130 17541 2212 -5708 -8985 -16829 -1588 7014 1735
764 1735 -12329 10254 27439 21009 14566 13436 -4738 880 10588 18587 9040 1973 -12854 -17943
750 -17943 -16694 -2698 -7199 -14538 -22652 -31438 -22777 -10912 -8191 1097 1050 2505 7578 13644 11301
735 11301 13538 12990 3536 3612 3513 -19996 -16254 -11047 8487 19172 18685 3467 5684 23481 11736
720 11736 12121 30911 27765 25584 3091 -1069 -18583 -26269 -1191 8421 19056 29235 33520 13498
706 13498 1892 26627 46765 39964 20133 21254 4683 -14224 -786 20733 27913 17072 23413
693 23413 31946 12376 12976 1071 1716 10977 -1951 -2354 4842 4713 13898 22136 18123 40991 42703
678 42703 24625 11203 11229 10423 -1290 2244 15808 7217 -444 5161 11041 3034 -1270 2695 -8399
663 -8399 -15804 -3894 -3402 9622 11750 6421 20062 24635 9468 11256 3982 19297 17241 10903
649 10903 462 11629 17719 9153 9337 10611 11965 5466 3184 7745 11992 11043 16191 11704 5364
634 5364 18691 11813 8291 17597 25666 15396 23751 29470 15847 11523 15331 -2560 -22671 -15444
620 -15444 6690 3225 -3125 2353 9284 18951 7898 -9341 -22513 -6037 -13992 -5321 10043
607 10043 24727 -227 -14218 -1644 5016 2972 2759 3774 19610 33072 32450 12937 13583 826
593 826 10594 14079 7415 -10776 -26860 -31650 -28869 -34644 -26993 -29007 -28638 -30988 -26053 -16942 -12661
578 -12661 -14827 19981 25442 2429 -441 17023 10163 13246 11202 -4540 -630 5862 -5449 -10260
564 -10260 -5012 463 5667 14816 31325 24595 19201 34683 30507 20867 17410 13308 4696 19103
550 19103 27432 14335 -10869 -13137 -20074 -26678 -22792 -15772 -5175 -13373 -25288 -15174 -14236 -6956
536 -6956 800 -539 -5180 -5952 -13506 -6247 -11344 -15899 -25876 -12075 -6192 -16151 -8081 -6897 -10198
521 -10198 -8456 -13247 -13965 -17124 -4860 5909 15596 4233 -5679 7195 16847 27668 23356 23810
507 23810 16436 -2067 -2908 11594 6754 11617 6341 11938 12839 8816 22442 19465 19614 16011 28379
492 28379 27227 10499 3046 12322 -4368 3557 -622 -5606 11576 19105 13263 12354 454 -9632
478 -9632 1275 17598 22395 29919 30651 44018 44037 36892 21626 17497 11834 -3872 -19062 -6938
464 -6938 -4033 -7228 -11487 -4661 10474 18493 15910 41116 42923 15350 -509 7757 15082 11685
450 11685 3891 2519 -9000 -9819 912 13291 18581 12467 6312 7309 -15113 4264 45351 49977
436 49977 28877 12600 494 3133 3106 108 -12622 -15050 -4188 33105 35281 26847 20079 20934
422 20934 8251 4231 7602 14401 30627 34073 46003 31228 19159 9423 1142 2411 -12839
409 -12839 -39110 -38879 -17864 -1280 -3283 4158 12236 18832 25895 38595 28374 2622 1327 419
395 419 3031 -9899 -5199 16341 10173 2657 -5430 -6780 -5419 -7685 -7919 -16321 -5484 -2329 16537
380 16537 27773 24464 11226 1812 -130 6667 -7825 -24223 -32383 -20797 -4620 6097 7120
367 7120 21711 24156 16595 3417 -3859 -932 -5044 -5582 7236 13196 7750 6453 18694 9993
353 9993 2607 -6189 -9733 -2672 -7445 -8376 -6689 -10507 -16139 -7283 178 15213 35537 19601 -1708
338 -1708 -16351 1024 -10249 -2106 17547 11401 5264 8231 -2056 -4965 2239 4275 4498 -4415
324 -4415 -10774 -4870 -9307 -25112 -30911 -28588 -5759 -19832 -22824 -21323 -16552 -11122 -8835 -8948 -4181
309 -4181 2462 -3780 4254 15740 21559 14019 13449 11823 5538 -6121 2742 -1498 -7095 -523 9378
294 9378 18737 15937 14848 13555 73 -9813 4389 4769 -6407 -19974 -23630 -4731 10892 2196
280 2196 -15867 -10108 -13603 -16805 6214 6583 3159 2572 -5994 8109 5825 14622 32462 22594 8300
265 8300 3785 3232 25081 37676 27991 19178 13568 -6434 -16470 310 5246 -2912 11988 33962
251 33962 29762 21202 23068 20305 17058 19175 6148 -1358 5046 18846 23856 26841 28936 22901
237 22901 3780 -5923 -605 261 11980 10405 2059 -162 -3722 -3017 -4579 -15939 -14675 -9384 10159
222 10159 10975 -2187 205 4091 8012 4318 -14095 -5405 -5951 -18571 -26715 -24565 -1442 5944
208 5944 4582 7798 9312 -1543 6072 -21 -11437 5237 8098 10098 -3020 -2789 1797 -2612
194 -2612 -7289 -18377 -11877 12073 13554 1000 1435 3881 6391 7832 4194 9821 16749 35800
180 35800 34947 19688 12398 11261 6378 12602 -2080 -8480 -6559 -8611 -23886 -9244 5118 14785
166 14785 12691 9286 8674 6105 16963 27624 19486 15635 8306 7372 -997 -9632 -12960 -17338 -20188
151 -20188 -14536 -8148 -7313 2649 3909 5818 9885 16927 21753 20095 13803 1920 2730 9968 11855
136 11855 5949 7871 11729 19130 20924 14609 10189 19536 32864 28018 18168 11871 6171 1467 -5668
121 -5668 -5485 -6224 -6316 -1351 5772 3962 6507 5702 -1886 7747 12373 6318 -5246 -12404 -4045 -9653
105 -9653 -12744 -5280 -1501 4174 -4634 -14396 -19550 -9526 837 10513 4887 -6601 -15330 -18135
91 -18135 -10006 -8002 7084 12695 15584 6634 -1108 2520 951 -1804 -8307 -12682 2762 -2984 -11900
76 -11900 -12728 -3296 5555 11491 15643 7804 1686 -7828 -14234 -11073 -10659 -4075 -1173 -928 -8345 -8173
60 -8173 7216 20505 22113 13039 22461 21651 8428 3938 6815 16661 21011 7643 1229 -1100 -14783
45 -14783 -19738 -10338 -13140 -11035 -9344 -10068 -8105 5568 14378 19528 10407 -871 -3662 -12000 -9136
30 -9136 -1870 -6721 -9984 -13710 -2786 13191 6262 5144 4847 -11327 -8173 -1079 7057 6040 2216
15 2216 -1769 -1276 6514 13075 8069 11807 14890 -6074 -12326 5950 21255 19584 18176 13121 2425
0 2425
$$ Imaginary data points
##PAGE= N=2
##DATA TABLE= (X++(I..I)), XYDATA
32767 109212 102115 92923 85509 95541 94283 86153 79097 78211 93328 108420 112003 116515 108613 103362
32753 103362 101072 102142 105297 100245 101151 102702 92081 97665 99143 89509 88667 84158 104051 128128
32739 128128 128854 124886 131553 119941 113162 121107 123892 122660 136623 150382 146710 147093 135416 126473
32725 126473 138313 144752 144975 135781 135716 134682 142467 139202 125018 119916 129039 132336 123099 115256
32711 115256 126937 140631 142376 141085 145065 135917 136192 143221 141897 152092 145072 140008 141597 148404
32697 148404 152765 139710 148305 145765 152706 162771 157433 170999 173657 180050 174722 183886 193452
32684 193452 199699 196233 180294 173879 173666 172795 173878 170571 181921 177057 168913 170186 176298 177639
32670 177639 190881 187405 180741 185958 183261 176814 180420 188011 182492 179156 179490 190631 197083 193551
32656 193551 209207 202238 205618 200879 202387 203187 201361 203846 202542 199971 203654 200265 202524 193394
32642 193394 192002 203557 202664 208205 206793 212236 212618 213211 215657 210784 208592 217096 216654 198380 198013
32627 198013 213689 212670 213725 222068 221525 222656 217308 213842 213872 215150 210943 224013 233650 228882
32613 228882 213942 198909 199726 216145 226659 231494 241909 251400 246378 235044 219055 210258 215487
32600 215487 232700 244181 263931 260523 249858 244059 237611 235266 246896 246085 244255 250670 249386
32587 249386 244249 245857 235583 228734 231655 230366 238684 244764 249476 249388 247347 248387 265753 264468
32573 264468 253057 245691 241997 241872 236580 228899 229495 235546 235785 229012 221004 233722 241078 242492
32559 242492 251323 265014 283897 279578 264331 257970 247709 238491 235416 242087 258150 252212 248501
32546 248501 266897 264498 261796 266396 278114 285717 264946 262339 285139 286536 289419 288278 295740
32533 295740 288328 275433 275861 291613 296639 289721 282786 305274 308846 299130 304821 306586 303427 306049
32519 306049 305832 305971 296457 288443 276249 279091 287217 293403 295901 294000 282550 280722 279564 262654
32505 262654 254499 259653 254991 256977 261793 277121 293303 296643 276895 271953 278503 293442 289012
32492 289012 286752 278539 284810 300529 305809 320522 317490 306834 294513 293276 281722 289977 294367
32479 294367 295549 287445 288204 299133 297097 300331 291862 295249 300384 298362 286032 277194 266993 264997
32465 264997 289377 310935 302555 305009 321919 333132 310281 297789 289061 288432 309802 308307 307357
32452 307357 293566 296157 304744 296734 291918 295717 304087 315756 326726 335611 323995 309665 311186
32439 311186 309522 310837 314838 313570 309586 311805 312444 321461 326747 309171 308494 316803 322369 317775
32425 317775 310443 308075 316206 327656 332659 352501 369482 354220 345060 327017 319952 313035 320280
32412 320280 325869 343799 339766 324617 326695 328564 312486 305093 313002 312996 320840 333374 339546 337589
32398 337589 326868 320042 323538 329228 330396 340383 354784 349002 334637 307046 305614 307306 312986
32385 312986 333955 352134 360283 360909 348253 333197 332727 342606 350299 354323 343912 345803 343543
32372 343543 351798 360184 371455 364467 348395 347306 340064 333383 331553 321221 330314 343921 353338
$$ [...]
##END NTUPLES=NMR SPECTRUM
##END=
