##TITLE=Analysis number 313364
Compound Code cc 18601
Book Reference 439/59/12
Project Code adrs
Chemist Name ronp
##JCAMPDX= 6.0         $$ Bruker NMR JCAMP-DX V2.0
##DATA TYPE= NMR SPECTRUM
##DATA CLASS= NTUPLES
##ORIGIN= Bruker BioSpin GmbH
##OWNER= NMR
$$ XWIN-NMR		Version 3.5
$$ Wed Sep  7 11:20:57 2005 GMT Daylight Time (UT+1h)  MAYBRIDGE\NMR@NMR_250MHZ
##.OBSERVE FREQUENCY= 250.131544655141
##.OBSERVE NUCLEUS= ^1H
##.ACQUISITION MODE= SIMULTANEOUS (DQD)
##.ACQUISITION SCHEME= undefined
##.AVERAGES= 16
##.DIGITISER RES= 18
##SPECTROMETER/DATA SYSTEM= dpx250
##.PULSE SEQUENCE= zg30
##.SOLVENT NAME= DMSO
##.SHIFT REFERENCE= (INTERNAL, DMSO, 0, 16.522)
##AUDIT TRAIL= $$ (NUMBER, WHEN, WHO, WHERE, WHAT)
$$ ##TITLE= Audit trail, XWIN-NMR		Version 3.5
$$ ##JCAMPDX= 5.01
$$ ##ORIGIN= Bruker BioSpin GmbH
$$ ##OWNER= NMR
$$ C:\u/data/dgb/nmr/ADRS/9060/pdata/1/auditp.txt
$$ ##AUDIT TRAIL=  $$ (NUMBER, WHEN, WHO, WHERE, WHAT)
(   1,<2005-09-07 11:20:38.60 +100>,<MAYBRIDGE\NMR>,<NMR_250MHZ>,
      <created by zg, POWCHK disabled, PULCHK disabled
       configuration hash MD5:
       62 19 C7 07 E1 42 D1 B7 37 6C 3D D0 77 39 F9 E6
       data hash MD5: 64K
       57 0A 90 8D 98 A1 5F A0 DF C7 12 58 39 09 FF 11>)
(   2,<2005-09-07 11:20:49.38 +100>,<MAYBRIDGE\NMR>,<NMR_250MHZ>,
      <Start of raw data processing
       ef LB = 0.3 FT_mod = 6 PKNL = 1 SI = 32K 
       data hash MD5: 32K
       FE AD 78 CC 65 62 3D E0 DC C2 4B B6 1A 70 07 DA>)
(   3,<2005-09-07 11:20:51.46 +100>,<MAYBRIDGE\NMR>,<NMR_250MHZ>,
      <apk 
       data hash MD5: 32K
       49 94 BE 23 36 7C 8B 08 3F 42 19 77 E9 99 6E 80>)
(   4,<2005-09-07 11:20:52.19 +100>,<MAYBRIDGE\NMR>,<NMR_250MHZ>,
      <abs ABSG = 5 
       data hash MD5: 32K
       41 CC 64 A1 87 6D A1 AE 13 DC A8 AD 4E D9 B7 DC>)
$$ ##END=
$$ 
$$ hash MD5
$$ F6 B9 1D D6 66 C5 C8 49 3D 7A A6 93 B2 0C DC 64
##$RELAX= 
##$RELAX= 
##$RELAX= 
##$RELAX= 
##$RELAX= 
##$RELAX= 
##$RELAX= 
$$ Bruker specific parameters
$$ --------------------------
##$DU= <C:\u>
##$EXPNO= 9060
##$NAME= <ADRS>
##$PROCNO= 1
##$TYPE= <nmr>
##$USER= <dgb>
##$AMP= (0..31)
100 100 100 100 100 100 100 100 100 100 100 100 100 100 100 100 100 100 
100 100 100 100 100 100 100 100 100 100 100 100 100 100 
##$AQSEQ= 0
##$AQ_mod= 3
##$AUNM= <au_zg>
##$AUTOPOS= <10 >
##$BF1= 250.13
##$BF2= 250.13
##$BF3= 250.13
##$BF4= 250.13
##$BF5= 500.13
##$BF6= 500.13
##$BF7= 500.13
##$BF8= 500.13
##$BYTORDA= 1
##$CFDGTYP= 0
##$CFRGTYP= 5
##$CHEMSTR= <none>
##$CNST= (0..31)
1 1 145 1 1 1 1 1 1 1 1 1 1 1 1 1 1 1 1 1 1 1 1 1 1 1 1 1 1 1 1 1 
##$CPDPRG= <>
##$CPDPRG1= <>
##$CPDPRG2= <>
##$CPDPRG3= <>
##$CPDPRG4= <mlev>
##$CPDPRG5= <mlev>
##$CPDPRG6= <mlev>
##$CPDPRG7= <mlev>
##$CPDPRG8= <mlev>
##$CPDPRGB= <>
##$CPDPRGT= <>
##$D= (0..31)
0 1 0 0 0 0 0 0 0 0.06 0 0 0 0 0 0 0.0002 0 0 0 0 0 0 0 0 0 0 0 0 0 0 
0 
##$DATE= 1126088437
##$DBL= (0..7)
120 120 120 120 120 120 120 120 
##$DBP= (0..7)
150 150 150 150 150 150 150 150 
##$DBP07= 0
##$DBPNAM0= <>
##$DBPNAM1= <>
$$ [...]
##$SUBNAM7= <"">
##$SUBNAM8= <"">
##$SUBNAM9= <"">
##$SW= 20.6930455092707
##$SWIBOX= (0..15)
0 0 3 0 0 0 0 0 0 0 0 0 0 0 0 0 
##$SW_h= 5175.983436853
##$TD= 65536
##$TD0= 1
##$TE= 296.16
##$TE2= 300
##$TE3= 300
##$TEG= 300
##$TL= (0..7)
0 120 120 120 120 120 120 120 
##$TP= (0..7)
150 150 150 150 150 150 150 150 
##$TP07= 0
##$TPNAME0= <>
##$TPNAME1= <>
##$TPNAME2= <>
##$TPNAME3= <>
##$TPNAME4= <>
##$TPNAME5= <>
##$TPNAME6= <>
##$TPNAME7= <>
##$TPOAL= (0..7)
0.5 0.5 0.5 0.5 0.5 0.5 0.5 0.5 
##$TPOFFS= (0..7)
0 0 0 0 0 0 0 0 
##$TUNHIN= 0
##$TUNHOUT= 0
##$TUNXOUT= 0
##$USERA1= <user>
##$USERA2= <user>
##$USERA3= <user>
##$USERA4= <user>
##$USERA5= <user>
##$V9= 5
##$VALIST= <valist>
##$VCLIST= <CCCCCCCCCCCCCCC>
##$VD= 0
##$VDLIST= <DDDDDDDDDDDDDDD>
##$VPLIST= <PPPPPPPPPPPPPPP>
##$VTLIST= <TTTTTTTTTTTTTTT>
##$WBST= 1024
##$WBSW= 4
##$XGAIN= (0..3)
0 0 0 0 
##$XL= 0
##$YL= 0
##$YMAX_a= 444740
##$YMIN_a= -316146
##$ZGOPTNS= <>
##$ZL1= 120
##$ZL2= 120
##$ZL3= 120
##$ZL4= 120
##$ABSF1= 16.522
##$ABSF2= -4.171173
##$ABSG= 5
##$ABSL= 3
##$ALPHA= 0
##$AQORDER= 0
##$ASSFAC= 0
##$ASSFACI= 0
##$ASSFACX= 0
##$ASSWID= 0
##$AUNMP= <proc_1d>
##$AZFE= 0.1
##$AZFW= 0.1
##$BCFW= 0
##$BC_mod= 0
##$BYTORDP= 0
##$COROFFS= 0
##$CY= 12.5
##$DATMOD= 1
##$DC= 0
##$DFILT= <>
##$DTYPP= 0
##$F1P= 14.0000005364418
##$F2P= -0.99999901652339
##$FCOR= 0.5
##$FTSIZE= 32768
##$FT_mod= 6
##$GAMMA= 0
##$GB= 0
##$INTBC= 1
##$INTSCL= 1
##$ISEN= 128
##$LB= 0.3
##$LEV0= 0
##$LPBIN= 0
##$MAXI= 10000
##$MC2= 0
##$MEAN= 0
##$ME_mod= 0
##$MI= 0
##$NCOEF= 0
##$NC_proc= -4
##$NLEV= 6
##$NOISF1= 0
##$NOISF2= 0
##$NSP= 0
##$NTH_PI= 0
##$NZP= 0
##$OFFSET= 16.522
##$PC= 1
##$PHC0= -88.69565
##$PHC1= 10.31765
##$PH_mod= 1
##$PKNL= yes
##$PPARMOD= 0
##$PSCAL= 4
##$PSIGN= 0
##$REVERSE= no
##$SF= 250.13
##$SI= 32768
##$SIGF1= 0
##$SIGF2= 0
##$SINO= 400
##$SIOLD= 32768
##$SREGLST= <1H.DMSO>
##$SSB= 0
##$STSI= 32768
##$STSR= 0
##$SW_p= 5175.98343685301
##$SYMM= 0
##$S_DEV= 0
##$TDeff= 65536
##$TDoff= 0
##$TI= <Analysis number 999999
Compound Code 99
Book Reference 9
Project Code 9>
##$TILT= no
##$TM1= 0
##$TM2= 0
##$TOPLEV= 0
##$USERP1= <user>
##$USERP2= <user>
##$USERP3= <user>
##$USERP4= <user>
##$USERP5= <user>
##$WDW= 1
##$XDIM= 32768
##$YMAX_p= 427872697
##$YMIN_p= -330203
$$ End of Bruker specific parameters
$$ ---------------------------------
##NTUPLES= NMR SPECTRUM
##VAR_NAME=  FREQUENCY,     SPECTRUM/REAL,   SPECTRUM/IMAG
##SYMBOL=    X,             R,               I
##VAR_TYPE=  INDEPENDENT,   DEPENDENT,       DEPENDENT
##VAR_FORM=  AFFN,          ASDF,            ASDF
##VAR_DIM=   32768,         32768,           32768
##UNITS=     HZ,            ARBITRARY UNITS, ARBITRARY UNITS
##FACTOR=    0.157963299565203, 1,           1
##FIRST=     4132.6476996994, 0,             0
##LAST=      -1043.33573715361, 0,           0
##MIN=       -1043.33573715361, -330203,     0
##MAX=       4132.6476996994, 427872697,     0
$$ Real data points
##PAGE= N=1
##DATA TABLE= (X++(R..R)), XYDATA
$$ [...]
29580 41236 -73501 -111166 -2840 29769 15980 -5466 -29302 16793 -30521 13649 112753
29569 112753 93160 68243 32881 -41552 -38833 -25896 -16651 48259 94125 32884 -99362 -124883
29557 -124883 -210823 -148066 -72296 -44586 -33466 29015 75688 42760 -81723 -99202 35002
29546 35002 95563 50938 36167 70826 -19906 -98106 -117356 -63771 -92726 -39452 -16079 -48261
29534 -48261 -48970 -62166 2304 39486 48973 93907 65307 10410 -48658 -62452 9515 84392
29522 84392 110409 61657 76041 20522 -36534 -9204 -10479 -70952 15063 72435 36423 -18201
29510 -18201 -28640 7788 1946 -8992 -2372 6181 -9457 39128 37093 3760 -56851 -50611 -62549
29497 -62549 -38466 38943 139800 169441 116710 92719 36952 -61785 -100669 -97367 -40048 40491
29485 40491 84519 58004 65179 97744 35470 -63939 -93987 -48185 -35511 137 47719 144297
29473 144297 97519 42226 11524 29138 13841 16548 43681 36211 37377 -21732 -18529 27961
29461 27961 48437 70154 17437 -4855 -16100 -6393 -30344 -50433 -26903 -23628 -13584 -53866
29449 -53866 -47475 -8818 -57779 34077 96623 52817 11211 -49989 -19058 -23159 -15258 42482
29437 42482 52345 -18191 -90664 -92727 -122842 -78619 -9282 -77066 -43710 25999 13036 -5841
29425 -5841 -5803 41661 36394 52195 110620 105923 21350 -41148 -28275 -63289 -59403 -26171 -66166
29412 -66166 -45310 -56623 -25064 5027 -62921 -88774 -111052 -118371 -82703 9899 19490 -9807
29400 -9807 -71017 -41586 47874 59987 67916 36528 -11228 44586 31904 -49490 -52919 -45544
29388 -45544 -11327 47999 48117 5877 -7769 -36216 -113440 -45154 78167 127764 112329 70834
29376 70834 2127 -56321 -82834 -38142 31288 47160 8197 -59590 -98663 -75524 -72417 -12867
29364 -12867 4892 2339 -72362 -117350 -47080 -9385 -42561 -78749 -10416 43664 44251 50924
29352 50924 63513 42203 -13333 -30080 -4002 -1789 32684 69283 109873 130719 196060 163900
29340 163900 58409 3168 -57079 -60051 -23493 2082 13685 73997 38277 89202 60346
29329 60346 8266 -64566 -52987 -12839 -67845 -37379 -13778 16567 -10232 -8357 16582 -17618
29317 -17618 -24866 -15941 -1478 8967 -48339 -24166 -37439 -113896 -144227 -64194 7657 -4252
29305 -4252 -3218 35748 11854 -11552 -35863 -90547 -52347 -43840 56587 103467 18206 -29517
29293 -29517 -22702 -45890 -52416 -69563 -51009 15596 163505 192969 34649 -25021 -83288 -39890
29281 -39890 -16477 -3654 3311 -32361 -13607 15033 104064 101300 4270 -43977 -1041 58686
29269 58686 85238 119485 22587 32495 79739 90150 18454 83041 74862 24357 -28210 -45258
29257 -45258 -5197 5605 15190 -29649 8419 -30738 -81802 -15884 45177 58784 82066 82392
29245 82392 51771 -18401 -46144 -55009 -89616 -58571 -69559 -72287 -6247 -20227 -40791 15150
29233 15150 1308 -31103 6531 48263 75102 57907 15646 21937 78130 103254 55319 54313
29221 54313 -26067 -346 36505 -21188 -7940 27716 19311 12014 12280 -36414 -53608 -53996 11943
29208 11943 42350 9271 -9890 8901 110079 97651 86761 17234 -62188 -44116 -24516
29197 -24516 -55893 6767 35153 -13238 -44908 34126 157815 175941 118782 58796 22909
29186 22909 39594 16076 -47433 -28327 1106 9011 -53826 -70409 -11089 95257 97156 -34911
29174 -34911 -105044 -104506 -47649 -55304 -25397 -2104 -30588 -103038 -139598 8210 94261 33868
29162 33868 50405 42851 -26669 -12929 46123 66507 6839 -41890 22877 115832 73215 -54654
29150 -54654 -7100 97840 23471 -39988 -38453 -38400 -21403 -9618 36836 69305 59803 27190
29138 27190 1500 -24736 -91797 -120916 -116731 -34693 39059 68287 36995 13877 68636 120057
29126 120057 137848 81119 58292 -4934 -46881 -59547 -9675 23654 20302 7080 3386 45017
29114 45017 23744 9714 9628 -9870 26038 37666 -13143 64123 81570 66755 45543 59140
29102 59140 108520 72034 29088 -5367 -24702 31312 -32564 -155150 -152746 -60669 11207 59321
29090 59321 110530 46062 89943 35114 60651 14844 -35684 -74098 -99972 -98637 -60017 21960
29078 21960 16306 8542 -10188 47980 110328 96531 51102 237 -19886 41623 91696 60774
29066 60774 69510 17903 27630 21878 28116 80184 88763 33578 22763 -15085 -54410 -1759 70939
29053 70939 102800 235120 189880 128852 100919 106237 45800 37377 -5031 27657 -28220 13449
29041 13449 -10575 10275 45405 26167 -12180 9741 29891 106213 116695 40658 30279 51016
29029 51016 92645 43083 45950 -9319 9875 10254 34687 -29664 -35603 -95936 -59760 -37502
29017 -37502 -19633 -29317 6343 -15113 -9199 39183 -2176 -550 110805 153620 165061 76501
29005 76501 40200 61682 -37703 -66079 -96891 -92641 -51940 10874 30356 19442 -35472 -95272
28993 -95272 -89688 -77885 -72335 23238 67228 52099 107397 143381 99876 14044 -22715 -17195
28981 -17195 64019 67991 -23451 -67830 -112643 -148135 -42747 1869 -36726 44602 3197 -107043
28969 -107043 -136981 -117159 -5336 64830 30674 44131 60844 -9213 -48047 -3768 21397
28958 21397 29285 16155 28605 75060 -22930 -68004 -49394 -20148 1702 20376 -49530 -97413
28946 -97413 -41469 -24312 -29225 -42250 -111951 -160966 -146181 -127653 -161466 -169540 -81694 -35280
28934 -35280 -20913 -74650 -64626 -13092 -42400 -128555 -140720 -51439 22465 11030 -10102 7895
28922 7895 18060 56178 15047 -81906 -114477 -69024 -131003 -147600 -65673 -82710 -55384 -5078
28910 -5078 -31099 -54866 -20089 -46516 -6752 -13208 -50799 -59836 -67006 -184622 -175774 -58105
28898 -58105 -15345 -63381 -99430 -35193 -20485 -47413 -28835 -20409 31950 99999 126681 137599
28886 137599 105482 73520 43139 17480 81675 168478 145425 94359 73928 39578 29434
28875 29434 76842 98387 106860 86347 4523 64806 90377 117385 129128 92705 41539 -48293
28863 -48293 -140065 -156384 -59286 8394 42582 47791 62405 86122 82615 90420 87763 33361
28851 33361 -21594 -13297 -14370 -4801 6203 22494 55238 48833 -50962 -114382 -92846 -2049
28839 -2049 58338 115844 193242 140724 116456 94440 165819 179513 124404 90643 61178 67772
28827 67772 73259 85059 156444 130144 -13989 -51425 -23129 -7024 54713 119686 118588 166670
28815 166670 196151 114496 122329 132038 90258 103064 84549 80404 15971 76000 117830 116872
28803 116872 -10505 -45032 -23644 -40750 -109895 -192111 -221757 -168053 -102136 -45781 -25659
28792 -25659 40898 28074 58629 -2010 -111765 -86085 -58461 -51311 -25823 9714 13798 75588
28780 75588 69568 68426 102915 83939 35026 11213 10433 15360 131490 177701 83334 66885
28768 66885 20449 -57107 -29414 -4049 9321 36371 23733 58893 121443 127644 187423 176212
28756 176212 109270 63292 38328 23506 -7148 -4171 -58311 -104259 -85470 -48342 -35931 -10270
28744 -10270 16385 46094 54000 78112 44547 66000 63362 18234 9240 28526 20027 -43783
28732 -43783 -43383 18043 108813 140127 122808 50509 -41561 -119641 -88515 -22727 -8745 -29468
28720 -29468 -27291 -2576 -27101 -43849 16012 8161 55511 123589 131559 134332 176594 141505
28708 141505 39662 55116 67597 1197 4642 49236 64478 121834 31732 9472 37252
28697 37252 -17437 -19938 2558 50213 10475 -54547 -58960 -38851 16113 122396 64865 19523
28685 19523 41364 32634 72248 108429 92109 33984 21936 -62195 -74381 -907 65365 6529
28673 6529 27264 54313 109809 89083 113273 75488 53616 14491 -16080 -13229 -46843 -68470
28661 -68470 -28698 -24710 20672 45140 34173 65900 33783 66655 149266 146768 27902 -30791
28649 -30791 63306 94979 116491 84390 52851 73311 53096 2286 90132 36414 -41484 -37168
28637 -37168 -34737 5785 37757 20486 -49216 29979 43826 109574 74837 75337 71551 -1547
28625 -1547 -23515 5565 35553 35941 -7955 -16306 -5792 77490 45539 28962 11043 -30974
28613 -30974 -22352 10648 62614 36136 9050 14177 29135 -2533 -64209 -75445 -100947 -75656
28601 -75656 6357 67952 157505 36270 -30454 32117 98910 47806 -6158 -20788 20576
28590 20576 955 -36878 -2716 31807 32648 -25494 37813 80135 42920 36439 71331 42067
28578 42067 54720 31756 -10490 28045 77613 65548 58940 -10597 -1856 -54852 -41103 76068
28566 76068 142692 117550 80316 32188 -15982 -54710 -43495 64103 111998 102233 72926 80516
28554 80516 126328 82692 45497 60873 78801 6365 -20091 18146 -29564 -94746 -58485 45042
28542 45042 29238 -906 57764 91210 55192 42356 13683 48397 25368 6067 37731 67946
28530 67946 128283 133297 143124 194742 243187 206110 121961 42208 -10850 49504 52032 61865
28518 61865 8706 -31244 -19061 12390 -2753 -13904 -30614 -26429 21144 80683 58804 75437
28506 75437 49274 16368 13937 -23740 -64078 -88991 -86420 -36605 45909 144565 210392 226324
28494 226324 195294 81146 53324 73295 67795 10624 49146 108918 86768 36776 51835
28483 51835 172621 230340 131443 163809 128647 135064 131651 121561 78271 52655 56589 56002
28471 56002 17398 60172 114960 123763 69146 37911 -595 -80506 -187231 -98992 -9235 -16506
28459 -16506 -18992 -88211 -122285 -104493 -134516 -193510 -184045 -151362 -103417 -129819 -64633 21811
28447 21811 83839 81641 48968 791 -76573 -42361 8033 47177 48204 79620 36838 -20040
28435 -20040 29866 14835 17475 10746 46477 92348 108102 109831 80876 163865 207191 119775
28423 119775 14681 -21132 31444 148329 204301 185633 197760 181018 145311 56900 37398
28412 37398 83528 162615 171855 116973 81228 71408 91742 10058 -41011 3774 135087 108483
28400 108483 55227 55347 24616 6729 7878 34798 80268 96897 62549 69663 69009 82290 40213
28387 40213 36427 -14414 -60591 25651 30101 12871 3723 64581 50558 58965 24842 -59651
28375 -59651 -153225 -137483 10846 72885 71226 15793 -22097 -30573 -13984 -35580 -20993 -14720
28363 -14720 16319 2439 34480 51108 49806 52204 124353 110818 60851 21543 57795 99344
28351 99344 38100 78874 127393 47084 14970 -14858 -12971 12514 1065 24160 48439 32893
28339 32893 102690 120859 54486 -21346 -25234 -11848 49500 117656 195372 226167 226936 177689
28327 177689 63138 7649 -19850 -33569 33838 101684 62535 28429 92433 70169 57697
28316 57697 8373 36540 60088 37328 -26591 -18164 52052 28081 -18794 -27447 -47646 -49227
28304 -49227 -5110 25828 37243 88692 180755 202419 186756 126366 131002 142392 124362 100766
28292 100766 115219 155630 66387 50129 62368 95762 131000 124163 117916 133358 85050 119303
28280 119303 207806 175780 165741 101853 28983 5460 -24488 -2686 78277 138153 124575
28269 124575 204379 257782 147827 75379 -10358 -20353 -58366 -37307 12559 38936 61066
28258 61066 87519 85517 37049 37144 104574 125920 68685 -57393 -22339 2863 75839 32324
28246 32324 -50403 -83734 -19779 66650 141525 110203 46409 32136 51671 63419 53660 25867
28234 25867 -32329 -124035 -161264 -80519 -7641 42480 30058 -26384 12562 82809 160349 234040
28222 234040 226816 134113 42016 41203 -12139 -36851 -39392 -62063 58987 148061 148376 133375
28210 133375 190387 271452 213665 189396 147798 123503 199367 220493 186725 110894 105342 19541
28198 19541 -49398 -40345 17739 56489 45680 72206 95509 106322 136717 121399 127571 136060
28186 136060 151530 56249 65983 148538 209163 204882 213570 151382 127710 93983 105247 159459
28174 159459 73519 1193 58840 135802 107890 180056 143358 128023 173159 42767 -1286
28163 -1286 68753 37678 -9552 27330 91735 106001 114399 39956 31754 105385 156426 167490
28151 167490 121582 147565 155477 166039 201253 205224 150126 131057 90906 70506 92044 5814
28139 5814 -25553 27118 115352 58465 22562 95827 185947 167976 106600 97897 101183 36495
28127 36495 24836 52060 -48440 -86714 -12233 67977 138779 190103 171669 87546 103481
28116 103481 124362 165689 231559 244013 193142 129469 77158 129594 202121 187287 66132
28105 66132 63413 65921 89386 148260 159928 119225 36883 -1405 1944 42366 54803 124316
28093 124316 170645 156507 107019 99271 97790 120116 155261 193013 170365 184258 144143 144065
28081 144065 119277 102093 57172 55298 121208 101027 94982 104446 127365 200030 237852 244837
28069 244837 167684 176829 217538 247039 233345 124896 82818 136874 201561 180642 148878
28058 148878 159075 191019 178919 158519 134109 107889 155368 148178 150344 101561 121163 132942
28046 132942 160048 187383 175978 172894 188488 150787 203570 213075 165439 111393 181686 203897
28034 203897 163530 166920 163031 154945 215703 280769 322984 328682 310987 201081 171207 225184
28022 225184 225078 124672 105920 168195 238435 198319 240005 159657 48013 -2176 15597
28011 15597 92595 94776 82542 65604 28318 -9259 -1059 6588 11847 106465 147601 207635
27999 207635 221882 242965 247343 200341 272851 283629 189760 158720 216075 203126 168253 153373
27987 153373 197002 233295 193001 183591 254442 319010 361644 308943 219475 213096 220661 196109
27975 196109 239680 221860 211178 237911 280726 216697 253146 360722 353359 276181 202704
27964 202704 252867 285268 259387 213852 181845 258184 230852 167581 184125 214061 236266
27953 236266 290475 315285 323370 279638 267089 273113 313169 335214 386534 410168 356300 296227
27941 296227 290007 305428 319384 353634 393088 376273 407528 393549 386940 342193 320470 295530
27929 295530 292692 253338 336106 357149 284339 237408 272331 286078 285708 252366 163269 132924
27917 132924 223195 304304 336748 312085 353695 347026 364572 356721 301582 267804 329203 345815
27905 345815 356036 333591 347391 419425 434309 406947 481538 477046 439969 408728 333708 304567
27893 304567 273068 229298 352116 471851 453073 470286 451296 396684 347442 316739 370815
27882 370815 391169 443899 463856 427265 415848 452251 451182 416487 369008 315462 365974 436587
27870 436587 429042 428918 422320 389350 362544 387774 442111 451010 412115 423732 462128 524937
27858 524937 517042 459369 421587 397963 450043 480276 455665 477045 456614 433170 334613 396118
27846 396118 481688 497427 489807 467951 502577 471301 449455 445909 443447 446835 394019 373352
27834 373352 377724 375992 432135 467822 395602 389029 447353 479533 495782 385540 395140 433878
27822 433878 531782 561064 523619 506278 517015 570764 478226 515791 649012 614005 498152
27811 498152 423703 490805 551899 608153 544146 501369 498183 499013 539056 528438 496347 603669
27799 603669 746786 785023 737816 678609 656569 645666 708158 728450 735391 796719 822602
27788 822602 787079 783241 732147 698955 700768 772758 862186 852994 829938 799924 724723 744347
27776 744347 733875 744958 750881 686089 644412 670383 703367 765242 823009 796426 775047 811742
27764 811742 731249 697665 719957 672057 655274 760623 766016 791217 834458 896266 927928
27753 927928 977871 1002116 899458 870333 896203 884803 916546 950270 988829 992749 966565
27742 966565 964042 904089 855393 917772 935789 882620 926757 1011589 944402 945137 950161 973485
27730 973485 974425 908653 953645 1084636 1056388 1086999 1163340 1090138 999969 1030495 1116119 1151446
27718 1151446 1232625 1196650 1130449 1145066 1123723 1169228 1169097 1175019 1177206 1230741 1244076 1172191
27706 1172191 1085460 1199296 1263977 1258315 1295207 1249140 1202902 1227027 1228551 1272832 1250906
27695 1250906 1228825 1285658 1283071 1233465 1262758 1358687 1395645 1406096 1422413 1391258 1361878
27684 1361878 1421451 1395197 1489673 1593738 1604108 1576021 1553744 1551591 1551549 1610940 1633379 1688940
27672 1688940 1759280 1790605 1810717 1887125 1910327 1860097 1872555 1882643 1924418 1926814 1894175
27661 1894175 1911958 1867112 1891699 2026717 2148185 2197810 2204161 2140710 2154059 2186502 2228723
27650 2228723 2252430 2294066 2364800 2348208 2275183 2301225 2366902 2397688 2452994 2460536 2534228
27639 2534228 2645847 2668316 2669130 2716101 2673643 2703126 2766540 2834296 2893280 2893232 2965014 3018332
27627 3018332 3079542 3109452 3152875 3185601 3189142 3291560 3397421 3442671 3448091 3498633 3564245
27616 3564245 3580438 3606821 3640985 3785212 3916675 4031530 4083806 4168466 4349749 4416312
27606 4416312 4510714 4536660 4570139 4653204 4687269 4729095 4824744 4878626 4893145 5001812 5164476
27595 5164476 5316544 5356913 5451312 5574403 5677341 5766912 5882262 6011048 6176727 6303736
27585 6303736 6400717 6591779 6735334 6888964 6937576 7014718 7235627 7488900 7683349 7869760
27575 7869760 8082325 8202990 8353043 8533601 8700594 8858055 9077312 9349389 9595426
27566 9595426 9840988 10033825 10291962 10590795 10835173 11092811 11308793 11569787 11874550
27557 11874550 12197530 12517728 12823091 13189238 13544650 13901305 14245630 14608914 14868301
27548 14868301 15275816 15751957 16225529 16640396 16971039 17297866 17765502 18226344 18761663
27539 18761663 19241168 19710892 20192814 20683235 21204025 21743673 22234353 22754892 23166670
27530 23166670 23749686 24262981 24780986 25299521 25788702 26347012 26842050 27290642 27775259
27521 27775259 28218301 28600260 28953667 29315690 29601751 29888522 30147704 30397083 30540387
27512 30540387 30692494 30802265 30870248 30902342 30943786 30860837 30749245 30626677 30435717 30191342
27502 30191342 29922524 29696816 29429803 29125116 28744133 28356195 27989561 27540027 27108127
27493 27108127 26627510 26113988 25526944 25025253 24526391 23964378 23416537 22965973 22468211
27484 22468211 21950367 21524453 21033794 20515739 19993900 19462453 18970388 18465859 17993709
27475 17993709 17549849 17158348 16679551 16214163 15763311 15308514 14918122 14645569 14321531
27466 14321531 13882371 13549652 13200858 12830653 12530237 12275144 11899547 11579292 11339219
27457 11339219 11052561 10897760 10695699 10404410 10067382 9771335 9488633 9238376 9050412
27448 9050412 8844293 8702715 8536960 8309845 8158418 7987433 7823420 7684486 7451959
27439 7451959 7229560 7111990 7013831 6924496 6761570 6575353 6420073 6260409 6185698 6079834
27429 6079834 5929312 5828268 5751701 5572081 5445547 5356492 5253136 5223362 5168252 5016229
27419 5016229 4867169 4767217 4634705 4616896 4571795 4478178 4276589 4171392 4106727 4075417
27409 4075417 4034281 3962718 3859798 3782554 3750964 3695997 3665493 3591725 3559804 3517741 3417374
27398 3417374 3265155 3170682 3150650 3090422 3017063 2964539 2910690 2899778 2888565 2808755 2763828
27387 2763828 2724102 2631684 2585224 2529665 2448890 2507569 2533372 2572379 2560403 2482292 2394137
27376 2394137 2335207 2224333 2143091 2111478 2064877 2064867 2092944 2131062 2240278 2217059 2171941
27365 2171941 2101282 2020232 1980839 1931716 1885250 1891826 1886866 1946231 1908873 1815854 1794541 1774689
27353 1774689 1798103 1741254 1723130 1712692 1708249 1673351 1589141 1560285 1599018 1533106 1368920
27342 1368920 1307492 1305954 1318697 1395082 1396220 1347595 1353699 1321728 1329810 1295116 1195080 1160583
27330 1160583 1246120 1300426 1358595 1354156 1322195 1346383 1312430 1261863 1211529 1169101 1153239
27319 1153239 1098710 1088112 1072646 1095632 1096132 1055155 1025173 1019553 1048982 988701 1005095 1065087
27307 1065087 1034160 1025739 949921 914200 930675 933177 974884 949556 909192 847103 815401 831465
27295 831465 819249 851780 872431 844088 835553 875739 863050 857128 873982 812095 778421 780866
27283 780866 795207 754470 747192 801613 824909 751246 669741 736661 749308 738440 784172 843214
27271 843214 763126 691624 699896 706490 717215 761250 784526 708830 637280 605326 629992 681592
27259 681592 681047 640228 711037 687817 644228 609904 583729 581416 606430 677538 686237 645304
27247 645304 628339 617898 604323 588891 649655 692112 572657 521157 506907 480711 527452
27236 527452 580408 575577 575280 560802 526764 531355 572002 588769 529349 523821 544995 540612 469331
27223 469331 414357 409335 407890 409031 346696 399084 528147 531895 463473 366574 388060 377739
27211 377739 412174 448477 447017 392517 407257 448890 470969 510184 505221 463884 385206 366122
27199 366122 305178 381830 446811 459441 441368 361260 346068 440875 458004 410824 340563
27188 340563 318081 345526 418803 468861 483964 493080 445199 428700 425868 489845 391253 230755
27176 230755 291411 307583 321886 356910 395573 299295 289245 357987 368976 269880 207111
27165 207111 268683 374246 297498 363667 441987 426245 375029 389470 407583 394627 365170
27154 365170 348627 295071 320751 358020 294813 300765 309923 348264 365241 321123 346647 360620
27142 360620 358016 356895 325059 255094 257840 216697 142760 102627 160760 232741 219666 197654
27130 197654 177703 144575 136549 232228 239236 214923 212544 203211 179778 204613 202836 198904 247545
27117 247545 201610 98772 1579 16895 138664 223430 276122 213475 138126 160589 154803
27106 154803 87906 87059 109466 170771 217685 239732 184673 140355 113989 178685 265322 282863
27094 282863 340016 352763 252553 226502 278756 276015 318908 313315 197174 160678 184538
27083 184538 299025 334842 317272 313840 300139 295685 239838 207868 203341 270449 293237 305865
27071 305865 248758 226931 196689 157293 159710 167765 184161 270919 285271 328264 277909 229767
27059 229767 235590 209815 239837 237494 211953 174348 153915 184651 282336 374031 318258 261861
27047 261861 185506 163325 211387 171651 158371 155787 105035 110544 61417 99930 54610 46171
27035 46171 62187 106971 163032 239878 250690 252955 342793 289770 220596 233616 209968 168720
27023 168720 193090 169228 163292 229540 217417 146992 161104 179782 157308 80263 138275 94062
27011 94062 41416 143026 167305 117369 156334 129220 100743 104239 54622 105280 170373 172545
26999 172545 148937 203978 223878 204674 199311 174540 118885 164462 213319 171236 132910 183551
26987 183551 134315 84009 15477 -18878 -26408 87240 119839 132936 84532 45998 66660
26976 66660 92226 82393 26435 65226 113891 154099 131952 91855 82463 82287 89634 166490 207564
26963 207564 174787 248799 298000 271164 259717 284704 269636 201671 153412 177506 263990
26952 263990 260922 187711 147906 141524 151572 144138 129333 205741 308401 224731 197493 205568
26940 205568 141195 -369 4983 115986 102436 73198 126355 137275 113815 118576 141948
26929 141948 118676 111336 162235 169156 133031 50769 43950 52128 73553 15371 87111 87449 86705
26916 86705 54602 36663 103808 171161 136207 116096 115956 148684 164282 175646 182071 141844
26904 141844 101419 78853 96093 95304 96906 85959 63935 4451 15219 -23944 1181 42336
26892 42336 39191 88925 154600 219062 131847 77870 45810 28449 25538 75075 90746 26922
26880 26922 -24325 21537 88398 82163 115331 119892 72258 58746 76446 -10397 10953 82171
26868 82171 98074 72427 99060 112036 88856 13379 -43541 -113323 -72565 -22271 52157 111791
26856 111791 169859 75659 28795 115531 192465 150533 33430 50449 53920 -32550 -82449
26845 -82449 -65981 -108168 -108632 -72051 -3690 18951 52989 13638 -1141 68961 202812 153388
26833 153388 110027 79741 44779 42956 4628 -56189 -27219 -91504 -122346 -16261 89298
26822 89298 106420 95143 90558 59885 51906 49368 46898 106489 120072 88369 69372 74524 144386
26809 144386 187230 125050 88072 96637 114287 34296 17098 1978 46823 90884 181581 207734
26797 207734 171805 159619 119200 140831 149931 73455 83443 41118 50845 130715 155718 166885
26785 166885 148165 211239 151194 152009 201011 212128 116313 37576 -16573 -52059 -11552 23206
26773 23206 39396 33573 28038 87548 114788 168549 121216 82518 90021 56837 27042 33858
26761 33858 76981 140964 91820 34923 -74212 -59533 22092 81308 125704 144504 122772
26750 122772 119250 135232 36816 -107274 -115699 -85362 -46599 -54564 -49917 59069 70328 80455
26738 80455 85253 83063 144557 107691 113531 169409 146653 71095 -5538 -2775 43234 75482
26726 75482 98101 114996 76530 97126 95112 191066 196012 174280 167456 118950 128866 118244
26714 118244 38904 -55731 -41817 47491 -4554 -4349 50250 115709 53823 -41823 17658 129475
26702 129475 142470 166019 133758 128778 96364 56980 112946 188919 248513 200895 141626 91130
26690 91130 28930 27216 40943 -21115 -107996 -67194 -39055 -26003 53631 113474 65038 -31493
26678 -31493 -30833 2542 16990 18042 38514 55869 36427 54950 82806 95317 207125 223899
26666 223899 234784 205168 165451 110107 147403 134737 57375 98438 93939 82546 51584 -24868
26654 -24868 2275 -665 -12304 27993 95887 58082 38670 47842 -17786 -4290 72042 4057
26642 4057 -16381 8819 -37295 -172911 -190819 -141610 -208689 -190863 -148361 -69144 -8005 -5967
26630 -5967 -31163 -37143 83891 96894 132654 155954 104078 29024 -37036 -52736 12473 39309
26618 39309 65434 40887 6789 48977 63527 10367 -13560 -29285 19582 107741 121268 93782
26606 93782 -27799 -47481 25285 66218 71835 30394 60293 8545 -37528 -45229 -3700 16131
26594 16131 -29755 -129771 -61774 38718 51764 52587 87442 89458 59257 24227 44169 -3081
26582 -3081 11763 -31609 -125069 -136678 -39970 -25567 -38364 -39953 -9047 76120 100452 -41136
26570 -41136 -94246 -21089 31177 73841 110476 110778 68393 32385 24466 52353 77656 71988
26558 71988 89999 68086 -9536 -8103 -14533 25575 57228 -19027 -14575 91878 167516 154301
26546 154301 131626 9075 -117424 -51839 -6155 -15195 -10171 9341 -10543 -13209 -97350 -39953
26534 -39953 23443 92413 117603 20781 -74767 -168329 -167087 -83316 19225 68160 -51103
26523 -51103 -74621 58122 50363 1510 34061 75437 76455 576 -62713 -54668 -19347 14799
26511 14799 84484 63657 -28621 -78360 -43506 3179 -6987 -29445 -524 -63591 -134322 -179570
26499 -179570 -99883 -53112 37880 22836 -730 -32590 -8156 -19443 -43586 -57564 -57894 500
26487 500 8206 -78783 -47092 52593 68791 76395 112285 125997 127523 156441 76758 12650 -16377
26474 -16377 336 -38672 -36445 -73636 -108379 -42352 5579 -50530 -4645 85815 119714 95106
26462 95106 36957 72213 112798 111161 85298 88259 92674 77335 -4644 45136 145393 107952
26450 107952 114571 102139 56863 112785 124404 111794 80327 92415 86451 94715 50474 101843
26438 101843 216491 210236 88796 36790 17466 35489 63136 58791 46739 43357 79144 104072
26426 104072 179038 124696 54771 57794 76334 90003 26107 76057 85094 -4574 -22464 3856
26414 3856 -65832 -48126 -40369 -32026 14516 -16179 30946 16339 -106691 -126492 -127953 -57776
26402 -57776 -25840 -1662 17347 86714 108450 10563 -5600 29162 87092 77620 52739 57074
26390 57074 -58749 -67473 -38620 -71182 -120627 -106253 -117273 -140371 -104786 -124084 -140206 -59800
26378 -59800 -50089 -132334 -153485 -54053 -23303 -79893 -25013 -2512 -28274 77834 121262 95965
26366 95965 69228 134190 133931 118010 131752 52663 -26310 -63981 -31435 853 73362 59455
26354 59455 1235 -17114 -22219 -9349 -10080 -36292 -71060 -52150 -36169 -45485 -10608 53622
26342 53622 48271 -64496 -19911 824 -91388 -102763 -32971 -41779 -99846 -43134 -52156 -36958
26330 -36958 -41278 14910 -10383 -18795 1799 57178 83600 91470 82104 -13754 -58573 -42991
26318 -42991 17635 72943 93369 54575 45386 64837 75159 24939 53680 38491 -9642 -27854
26306 -27854 -40548 -81785 -95994 -134881 -186355 -168837 -116123 -105557 -52380 18805 -4851 -91113
26294 -91113 -102531 -117022 -157179 -138399 -61134 -15851 -66990 -127959 -102359 -26851 -26428 -22478
26282 -22478 -10593 -54300 -77756 -91488 -147553 -23738 56780 87013 76639 42239 -4328
26271 -4328 -44260 -28584 22316 97002 72659 91946 73435 17487 45701 4551 -46316 -20442
26259 -20442 -74150 -40368 -50794 -36827 -4632 10989 -35682 4773 -24557 -31564 -18970 -12855
26247 -12855 -82 39569 26996 -103690 -42455 -23910 -58681 -42577 12653 24129 -43421
26236 -43421 -69690 -38874 -22661 -64155 -45838 -34899 -49048 -10459 -82830 -102125 -111080 -76956
26224 -76956 -52095 -25439 -39288 -40156 -22023 -88837 -80077 47091 -4686 -55713 -168918 -186791
26212 -186791 -149825 -184479 -155263 -86673 -111666 -109176 -109093 -115904 -140722 -220466 -205401 -128404
26200 -128404 -57502 -69575 -95056 -73324 -27360 3822 -39363 -514 2421 24210 -6611 6760
26188 6760 -7494 15646 -924 106301 113660 111234 95680 97060 45838 57524 110794 92146
26176 92146 29974 39310 23147 -33483 -48350 -114866 -106374 -123732 -76845 -11853 25187 51235
26164 51235 66237 25390 31384 10794 -49693 -135027 -77170 -718 -35215 5830 47789 92945
26152 92945 168274 54755 27590 8592 26535 32244 -38347 -39659 -5415 -107462 -148541 -7463
26140 -7463 165217 93711 26842 -3654 -2565 -22756 3986 -4723 39010 84345 108672 37672
26128 37672 6934 39531 62832 86180 -26485 -62341 -54923 -68267 -15314 73381 88622 -17921
26116 -17921 -79343 -9545 -19554 -120951 -132941 -63272 -70807 -68527 -53053 40173 43466 12843
26104 12843 75543 117441 111775 104792 129841 128723 64488 24659 3790 -17405 10503 33079
26092 33079 -4277 -149712 -221713 -300272 -232965 -99665 -90077 -62599 -50090 -18481 51851
26081 51851 48229 44338 -30726 -81876 -87385 -123670 -173502 -102051 -87942 -66739 -20272 93351
26069 93351 165507 190161 151553 103005 58593 101499 28661 -52690 -57914 1494 -21661 -29882
26057 -29882 23005 63235 59722 9006 18613 13850 -67517 -107660 -156274 -95011 -30915 -47867
26045 -47867 -146231 -160061 -27494 -34454 -53273 -63295 -35811 -32086 -17082 -25993 3072 29974
26033 29974 22374 48245 95575 115013 49737 -46389 -28257 97214 79166 15932 -82753 -66037
26021 -66037 -19853 -66981 -110710 -75655 60055 97319 99256 -38263 -167574 -114070 21216
26010 21216 83874 50502 -12326 -16486 40279 135638 199423 194808 110766 53443 50630 6074
25998 6074 -5126 -50989 -26413 -32629 -80268 -121369 -77248 -51126 1841 -42009 -81065 -45682
25986 -45682 -34248 -26712 -74010 -105010 -173119 -200691 -151069 -90327 -79272 -37594 -71808 -61722
25974 -61722 -44998 -76237 -4536 28859 -16286 671 27521 45144 86856 30367 95446 132958
25962 132958 39919 52586 14841 -62021 -84915 -85227 -77713 -19058 -29398 20198 117313 132898
25950 132898 10320 -48460 -99311 -25803 -22729 -52600 -86165 -19095 17425 52120 -372
25939 -372 -33839 -8894 -30615 -72871 -31028 -84481 8653 113869 136670 158713 83353 6209
25927 6209 47829 68867 35003 -33103 11753 108510 119741 65829 36320 24068 -66580 -79106
25915 -79106 -63968 -13654 40874 -3458 -70783 -86372 -125422 -122532 -124897 -99445 -104762 -95282
25903 -95282 -98741 -2432 44239 -27684 -83272 -42640 -3542 10907 -23742 -42229 -102872 -165803
25891 -165803 -81352 -36563 11233 17179 86600 99487 34570 35133 83355 100094 69656 104645
25879 104645 110902 69775 48804 21193 61939 92577 65848 -62565 -105223 -44536 -6475
25868 -6475 25198 22489 -95 -33697 -29742 96086 86689 47025 29918 21659 61598 78012
25856 78012 60068 82712 98147 109508 109377 104181 60767 64058 49875 14699 12608 98068 117926
25843 117926 53931 -4833 -31930 -18898 18499 -7535 -68806 5892 -41589 -200077 -191052
25832 -191052 -119051 -62230 -13945 8039 -14412 -44198 -61949 -140659 -156858 -162009 -152354 -153931
25820 -153931 -179718 -214043 -244462 -176348 -161070 -85460 13626 31800 -9696 -4417 -12605 22940
25808 22940 52959 21938 -24067 -1205 -8409 -97 73536 66602 -7982 -67958 -94035 -147074
25796 -147074 -107378 -32326 -24948 17414 417 -43016 1679 -25369 -25519 8360 90906 77420
25784 77420 59028 -41516 -68177 -34135 -37498 40140 86982 41004 -91669 -106527 -35547
25773 -35547 -32193 28934 76403 13722 -109174 -164575 -171122 -187807 -189357 -147052 -149480 -82135
25761 -82135 -35506 -101807 -160727 -100819 -132809 -117273 -55646 -58517 -9135 57577 23245 46257
25749 46257 61740 -49275 -73251 -114968 -146043 -143763 -108637 -3134 86726 149012 62245
25738 62245 -10256 -26464 31079 53209 30731 35022 26912 46124 86866 48684 -4041 -92223
25726 -92223 -150800 -74548 -21095 -10942 -15551 18518 79561 73096 27161 -40650 -24376 -10605
25714 -10605 -71670 -101486 -38692 80636 94895 67619 40127 4822 -30400 35932 41845 -33551
25702 -33551 -29520 30360 9747 17492 15062 27315 29123 74676 62874 64361 65069 -15375 -28669
25689 -28669 -28225 -39966 -91660 -175138 -173820 -118877 -109051 6808 30239 35543 -1764 -7326 37962
25676 37962 19870 -45491 -112069 -98670 -30116 18988 56360 69291 39810 -42506 -43839 -95227
25664 -95227 -124655 -77439 -51201 -92211 -82294 -14997 -4313 -63635 -145867 -93763 -13613 -5372
25652 -5372 34232 69410 88644 103982 57667 17782 91458 109639 46049 33793 108184 120957
25640 120957 24853 -53046 -65124 -90002 -90871 -154740 -103985 -51813 -106009 -175786 -121061 -19502
25628 -19502 73234 117859 127637 134863 92877 102313 88257 -24353 -85126 -164501 -175573 -180455
25616 -180455 -136882 -126820 -140009 -137110 -141960 -134522 -162114 -136440 -71696 -90638 -61031 -47673
25604 -47673 -62978 -6193 73965 58550 -79345 -130476 -178085 -89049 33263 29656 23793 25423
25592 25423 -28936 -50128 -102640 -34831 44631 28360 -2006 -60604 -9498 -10675 -54616 -39973
25580 -39973 60920 90626 92642 58949 -10960 -10475 -47301 -32614 -2875 16034 9560 -810
25568 -810 -60929 -51072 -73230 46854 115833 36675 24621 4962 -55280 -7079 79268 121748
25556 121748 37696 42436 54502 10998 10001 59465 64875 81157 31578 -11598 -50199 -60723
25544 -60723 -103352 -135517 -105906 -22598 -33866 -52783 19253 17454 -44427 -26978 -75663 -41406
25532 -41406 -15721 -22914 -73179 -13301 -56964 -65547 -417 100361 80421 36643 55906 -25081
25520 -25081 -19259 6418 30172 69345 95540 97787 37626 -18139 -45606 -25087 -12148 -23278
25508 -23278 29027 28867 -37165 -58335 -55362 -78617 -77547 -39066 52481 24124 23899 72700 68549
25495 68549 114771 144620 144719 135109 164895 146206 84140 24927 31593 28881 40674 72816 20551
25482 20551 -71211 -130966 -184880 -60709 -318 43216 64418 12138 25389 44822 79066
25471 79066 43421 -13422 -60498 -64875 -43858 -82443 36864 -9918 -109890 -65307 -59974 -91100
25459 -91100 -122266 -121593 -83739 -60907 4522 18456 119738 133689 110549 52470 -9719 -42071
25447 -42071 1489 -30335 -45162 -70176 -153278 -132860 -90321 -52159 14469 37049 -49632 -48517
25435 -48517 -28245 -22946 -98355 -125982 -101329 -80995 -95711 -78711 -69900 -57612 -30068 27381
25423 27381 27647 -5745 51672 65070 96651 123166 55234 53319 42413 73117 87000 124338
25411 124338 77836 -729 -20138 34106 39238 -26132 -3112 84617 70120 75987 172122 184542
25399 184542 91273 -219 -74621 -61494 56231 5372 -84387 -78898 -35301 -77246 -121880
25388 -121880 -118039 -58366 -86281 -153276 -140691 -103565 -105771 -102859 -113138 -82447 -25151 29919
25376 29919 16878 20690 35729 48369 52869 -74074 -140428 -66072 -76217 -102965 -33450 34403
25364 34403 95476 95499 25444 -25814 -21690 -15776 -22388 30778 20930 4879 -20751 -54189 -84662
25351 -84662 3860 21796 -69487 -147720 -210478 -159982 -45541 37652 46718 -14059 -1071 56126
25339 56126 15956 -49318 814 94135 23750 -120276 -132101 -142138 -58414 -2971 62417
25328 62417 84851 8351 -31667 -6209 21006 17761 -53763 -39107 1365 -16751 -2795 -13355
25316 -13355 -26627 -103050 -128826 -101094 -28109 2702 29679 37745 1930 -16277 -43432 78115
25304 78115 77842 55958 53422 16846 33708 42001 19126 74803 51991 24918 20017 38335 39139
25291 39139 52955 110226 49759 -32190 -15456 27230 31763 74530 84445 66301 72164 15607
25279 15607 26729 28466 -55779 -119037 -133828 -74716 -25621 -89435 -107243 -185019 -196173 -132877
25267 -132877 -135055 -140634 -30171 -63860 -109345 -103384 -73920 -44571 -19683 20849 -56150 -54519
25255 -54519 -94481 -184167 -246105 -85575 30674 42818 45286 45360 -4833 -17798 46225 46701
25243 46701 35169 -24424 -71727 -46738 23061 68225 80814 22246 -35669 3430 89179 111263
25231 111263 117738 86562 31729 13874 -15099 43581 -4663 -23698 -48972 -122978 -14924
25220 -14924 11990 95282 130135 117524 48714 39314 232 -66613 -14152 16947 -3530 21613
25208 21613 8094 58062 18370 -71293 -119096 -103709 -131582 -110949 -182229 -150866 -164868 -181574
25196 -181574 -104223 -68262 -63928 -53847 -52184 -52674 -128028 -138916 -73743 -18821 -18197 -67515 -120537
25183 -120537 -144899 -120647 -32713 7799 56853 31202 -31086 -85449 -12927 -72320 -9200
25172 -9200 82663 68554 123358 63592 34520 -4169 -24311 -56270 7124 -6086 -26095 -43232
25160 -43232 -105838 -74431 -99971 -64426 -79381 -87947 -15439 16048 -13826 -106694 -114180 -138249
25148 -138249 -136451 -172101 -103840 -20169 24931 77530 102327 42668 18192 69 -10872 -41746
25136 -41746 29134 147832 67077 38748 -53725 -159410 -143984 -150887 -174757 -166032 -102464 -72359
25124 -72359 26394 117062 67397 70618 146232 92933 -3909 39281 53855 -35803 -94696 -80510
25112 -80510 -53930 -83352 -110859 -60063 -47800 -22387 43739 57829 -18480 11329 -42391 -19933
25100 -19933 -40215 -43568 64814 90682 45131 41335 74021 86251 51634 17537 51609 42452
25088 42452 8937 30781 27924 -19640 -8364 -10787 -51259 -36057 -55705 -93101 -119997 -136951
25076 -136951 -38756 41175 8536 -76826 -4305 55638 476 -12447 -36211 -48796 -68058
25065 -68058 -51638 -73065 -158072 -218788 -70128 -62935 -117555 -33932 60151 93149 161780 155440
25053 155440 77702 38275 66057 25770 -37539 -79607 -101839 -54984 -81687 -37048 -52227
25042 -52227 -51960 42509 82269 -2317 -96191 -103015 -29495 3321 11922 -58621 -73573 -76765 -37828
25029 -37828 43786 100939 133045 97869 99754 62849 9910 -61107 -46046 31395 22970 -22683
25017 -22683 -45637 -101229 -82399 -34995 -8986 -51328 -63546 -104274 -126686 -125602 -78666 -43894
25005 -43894 -34479 -25527 -90248 -103853 -40010 42392 15458 -28757 -76122 -71600 -116923 -120192
24993 -120192 -112377 -68772 34410 31601 27699 20331 20197 22974 -61826 -141346 -131398 -47382 -83062
24980 -83062 -55674 -63919 -34843 -6730 -109376 -85569 13790 124843 52953 -87943 -94681
24969 -94681 11922 34758 62186 41385 -29532 -74083 -42861 -11789 -36021 -64684 -100710
24958 -100710 -197869 -157844 -60811 -14106 -2966 -660 65092 61453 45890 102258 95361 68929
24946 68929 42029 102735 81851 54573 19467 -38227 -64705 -81416 -77017 -12912 7697 -22046
24934 -22046 -76302 -142452 -179262 -117496 -683 79011 78166 69858 77568 39438 34077 59710
24922 59710 13748 13638 22466 -48117 -98573 -48490 -49983 -59887 -55315 -46721 -22137 45908 51611
24909 51611 52493 -10525 -80402 -53957 -12986 -22501 -59230 -58885 -103276 -130515 -77349 20831 57867
24896 57867 54646 -2137 -46011 -132597 -89129 28320 53937 70500 68341 70569 38216 -30870
24884 -30870 -95579 -102685 -68404 -39176 -66845 -30682 -1404 -35557 -64384 -74046 -61035 10597
24872 10597 34675 -15476 -94047 -106272 -106520 -122099 -125299 -70932 -74500 -166814 -193936 -156760
24860 -156760 -175638 -183244 -98985 11866 54188 80433 3697 -47328 -113273 -96640 -30466
24849 -30466 -5634 -12088 43840 79340 2507 -5886 -9504 18673 83589 109613 119600 126221 108491
24836 108491 89157 66354 74567 40139 -58452 -131741 -142284 -87332 6812 80303 113711 111526
24824 111526 69676 78744 70943 81751 76679 78846 -31856 -59974 -2196 8743 -14222 -364
24812 -364 -81204 -80524 -61104 -49898 -65898 -43846 -31719 40781 66485 -19439 -59148 -30414
24800 -30414 14586 47819 9204 -17844 -32875 -80537 -68322 41101 67007 35228 29863 -6511
24788 -6511 -82916 -87574 -36453 -26263 -12749 54496 99917 154391 90740 138190 151035 90239
24776 90239 12015 31587 -47654 -60617 48343 69404 16260 -74237 -117299 -120715 -39057 6061
24764 6061 4601 -60231 -78513 -24850 41363 9315 -12885 -9597 -86914 -81633 -71378 -123464
24752 -123464 -105399 -153141 -128109 -77421 -28251 -37016 -73562 -146756 -154314 -83543 -27907 89811
24740 89811 91348 25226 47548 63430 33834 55625 79185 51248 33929 2959 8911 -14751
24728 -14751 15708 81921 103389 54781 -25874 -64766 56033 57359 16244 -14842 -23544 -118293
24716 -118293 -76084 -58554 -108944 -212853 -194684 -202198 -183227 -93142 -40518 19878 -38492
24705 -38492 -92533 -32854 -61875 -58268 30678 104889 133538 141315 93327 15929 69590 144596
24693 144596 171360 152897 54164 -21489 -66268 -4672 12306 7887 73170 85987 121234 112192
24681 112192 37055 -26376 -96806 -94281 -130821 -5240 54330 15593 -11408 -20627 43751 11277
24669 11277 -66602 -59597 -53206 -50764 -51427 -10765 -62805 -76318 -85070 -27611 -24219 -123475 -115434
24656 -115434 -124650 -60481 -42560 -137833 -187622 -133394 -20618 4592 18957 55375 15785
24645 15785 -43231 -102388 -71539 -63374 -72925 -64178 3501 19428 -34967 -126618 -206551 -166081
24633 -166081 -57566 -64620 -49657 -46240 -18881 17967 42612 18859 -14963 -82520 -69602 -91214
24621 -91214 -72007 -81181 -37951 -39811 -106504 -61193 15278 27929 -117186 -63828 -48356 -44958
24609 -44958 -111211 -97239 -80516 -49756 -28293 3357 -21237 -56143 -88362 -87545 -76974 -109090
24597 -109090 -144931 -173256 -65043 -52331 -37751 -11687 -25452 -93933 -73414 -86774 -45994
24586 -45994 -91477 -67573 1796 36973 88623 109606 66631 28780 -32776 -60302 -128508 -180619
24574 -180619 -172247 -183323 -90230 -16506 -28271 -47291 -30101 -32063 -125367 -124028 -76218 -72577
24562 -72577 -54760 -46851 -17283 -53145 -136165 -150123 -122677 -73152 -56884 -88125 -53787 -32611
24550 -32611 -52766 -84460 -114824 -158171 -134281 -51441 -78458 -135352 -86021 -57172 -91406 -46091
24538 -46091 -58767 31081 85480 34188 -19988 -78009 -87408 -88567 26549 83752 15419 -50255
24526 -50255 -58526 -89093 -53710 -92557 -54590 70414 112307 44388 -23595 -19849 48193 89488
24514 89488 93825 25752 14586 36887 -14696 -43318 -77849 -89916 -92696 -43329 -44575 -20776
24502 -20776 -26049 -67389 -65246 -56248 -74115 -94941 -137380 -124395 -58026 -13934 -9255 30390
24490 30390 34756 31191 -59588 -90936 -49465 -56217 -45668 10190 40359 36052 23481 42347
24478 42347 16194 -13743 17614 38162 9527 -18088 -4424 -38108 -60304 -36101 -25855 -42684
24466 -42684 -47628 -77384 -102676 -67583 -12159 -58247 -113545 -84341 -120891 -117437 -64257 -53255
24454 -53255 -784 2519 -49118 -93784 -62874 -45515 -61006 -148522 -126782 -65301 -39342 -58698
24442 -58698 -65264 -41111 -90827 -149973 -134330 -71546 -95922 -104888 -148337 -74610 -57314 -51294
24430 -51294 -57828 -42312 4123 30318 19019 -14835 -20728 -33498 -101778 -189538 -163866 -47752
24418 -47752 36206 130127 109795 78153 126 -44123 -28404 -65263 -113290 -122602 -99487 -76879
24406 -76879 -82693 -66755 -95714 -124695 -110097 -48001 10156 38513 4645 -15562 -12252 -116201
24394 -116201 -172437 -165609 -197700 -132357 -73579 -61982 15476 46620 23685 32154 65020 146559
24382 146559 63205 24681 -17794 -78609 -60367 -1694 35404 80369 95268 113869 105442 109136
24370 109136 47690 -15674 -40673 13212 -3300 -25329 -9054 26556 18837 7172 -38678 -105540
24358 -105540 -49321 37467 18841 -29541 -11408 -590 -112969 -125589 -132606 -74995 30212
24347 30212 138833 99824 20461 -42791 -32834 3369 -16677 -10443 -17316 59691 109406 99480
24335 99480 103582 71722 7823 -20404 15206 54956 45307 -14714 -46177 6185 59703 -43969
24323 -43969 -120773 -84700 16577 32163 13006 45809 -6965 8504 29719 -62154 -106040
24312 -106040 -71267 -76090 -70444 23067 49093 -22287 -41116 23186 92800 104143 74792 -62965
24300 -62965 -51370 26750 13964 17012 42660 89751 87654 54290 20521 -26798 -53543 -38379
24288 -38379 24265 25014 -13338 -42646 -53746 -37797 8847 25872 -97182 -73643 -17255 28643
24276 28643 27877 5606 18128 55884 73729 113876 83995 55681 2748 -2090 -81401 -109281
24264 -109281 -51634 -41791 -71963 -59137 -73987 -133665 -146411 -132892 -76264 -87156 -80115 -42162
24252 -42162 -69858 -69980 -36228 -33965 -42972 -33865 -29448 -34988 -71118 -100509 -67817 -64656 -122667
24239 -122667 -155476 -130525 -93003 -80216 -58921 13075 73022 51007 27369 50387 17429
24228 17429 45267 36649 -15258 17642 63195 2670 -16599 44377 99417 69762 10275 -44704
24216 -44704 -87166 -105209 -96318 -43236 -63573 -84247 -60907 -31745 -5135 -8120 -9758 25011
24204 25011 -30065 -148223 -200595 -171047 -115970 -109918 -150134 -152502 -153561 -179671 -166198 -129728
24192 -129728 -52090 3197 -3585 10234 -16417 11474 -23021 -134427 -192700 -159222 -128241
24181 -128241 -46295 60404 48408 17799 -1512 14929 16546 88298 93172 56444 6870 -20816
24169 -20816 -20768 -68314 -102194 -118743 -83639 -7725 14567 -87313 -146899 -140717 -40699 26607
24157 26607 38575 3662 38473 140709 194483 136968 95871 63104 28562 -42562 -100681
24146 -100681 -42563 -7846 9787 39358 41908 36249 11118 -45706 -17567 -28720 334 -12222
24134 -12222 -23170 -51242 -38325 3618 43679 30056 -63970 -131465 -41980 61506 87946
24123 87946 31502 -47380 -39618 60676 84899 94592 126058 120612 93188 104975 52108 -92289
24111 -92289 -148683 -74269 -22061 24500 13034 15535 -4231 -75858 -129641 -76363 -43313 -44377
24099 -44377 -23342 -38703 -83407 -26700 16878 60497 99082 -10353 -94189 -94259 -45477 -4918
24087 -4918 -93724 -118435 -84964 -30407 -391 -81064 -12792 67586 32131 17784 69833 95866
24075 95866 104851 95630 11399 -76823 -135709 -121830 -75532 -54576 35141 36825 -64764 -43510
24063 -43510 3214 17169 -16759 968 108398 149098 47741 19756 29799 -21684 -27842
24052 -27842 3291 10785 -18109 -31982 -110382 -78645 -20938 23145 6216 -26449 -47168 -74545
24040 -74545 -93954 -24627 59934 61588 -33414 -94977 -96764 -43757 56129 82223 103370 89111
24028 89111 81067 113817 61372 82831 140148 155985 154292 175539 150684 57132 36107 45886
24016 45886 64499 -34078 -139896 -114298 -45847 -63331 -56468 -43885 -70814 -107593 -129081 -113116
24004 -113116 -36496 19784 14796 10380 4190 65802 96892 78875 11121 -48021 43096 76780
23992 76780 72960 31838 9626 -20885 -41708 -8567 10483 24050 41933 18070 4209 -21651
23980 -21651 -99071 -107534 -103351 -9126 61249 1517 -53100 -64383 -101137 -52563 -128957 -131994
23968 -131994 -133376 -154139 -130979 -100384 -48883 -109567 -116228 -39781 -11432 -15682 -7321 -73276
23956 -73276 -91837 -69668 -64349 -96329 -114880 -112538 -90211 -51678 -39243 11849 -38435 -54990
23944 -54990 -86825 -124911 -116079 -47396 -58458 -89425 -13323 -47274 -108319 -65071 6087 -59954
23932 -59954 -52195 -22184 31754 17695 -21431 -76370 -71861 -74505 872 49372 -60807 -187517
23920 -187517 -169597 -156262 -113003 12979 49946 -7450 -74760 -79229 -34282 -70059 -24844
23909 -24844 -42152 -95797 -150685 -79899 -12940 -77805 -167403 -144618 372 16985 -24175
23898 -24175 -82248 -15811 86623 -3634 -79922 -57285 -71629 -47917 -29626 46788 -31641
23887 -31641 -146425 -111392 -23875 -99955 -103288 -28212 -8527 -35606 -22413 -61813 -52299 -38564
23875 -38564 -62618 12583 29757 -1628 -52771 -51647 43254 140311 119326 43902 16498 6678
23863 6678 34308 54170 67150 67289 128844 104254 40176 26727 88025 89077 52292 91294
23851 91294 111363 131239 166880 141777 61863 20942 36164 5579 68064 46951 11042 -66202
23839 -66202 -105186 -95302 -63120 3682 -9757 8088 102984 138256 121653 30903 -33539 -128211
23827 -128211 -218391 -171784 -142840 -89284 -21751 34514 -1136 -751 947 -13066 71382 80671
23815 80671 82422 109330 79464 -32906 -133881 -229240 -145928 -8375 58084 75519 -18440
23804 -18440 -80011 -2691 97488 170084 103644 -23814 -62347 11658 29043 35662 81807
23793 81807 19216 -64966 -107443 -73887 -94678 -72093 76817 114832 54412 62092 76460 -32573
23781 -32573 441 14895 -5057 12092 66663 77745 5942 -45088 -24752 -55817 -732 22081
23769 22081 38919 96962 127843 67487 17939 -29199 -77779 -77037 -91835 -108305 -69068 -18993
23757 -18993 38451 21418 -8430 67769 34433 -33325 -72799 -77111 -38535 -109811 -102331 -61142
23745 -61142 8062 27547 96285 38971 -62369 -128645 -170725 -130726 -150847 -158325 -113491 -104502
23733 -104502 -139633 -100675 -11289 50687 112898 100587 46174 60684 33485 9170 -46182
23722 -46182 -75691 -77248 -88977 -33011 31712 85942 97941 38942 7365 -15988 2068 20587
23710 20587 73959 46638 -46569 -69249 -59102 -62571 -58789 13991 99859 146583 127580 78110
23698 78110 28009 9640 4489 18566 32165 -14603 -36973 -47570 -75507 -5510 -29407 -13948
23686 -13948 -31816 -125299 -142208 -100630 -48660 41873 49424 87592 97530 24998 -5771 -20448
23674 -20448 20869 70533 68834 35461 -6647 -13707 -8128 13546 98781 91937 -10932 -63800
23662 -63800 -35046 14585 -9299 -27266 -1750 41471 13047 -41293 -72450 -94157 -170479 -125292
23650 -125292 -93503 -123716 -50398 -2745 62737 19910 -30172 -61486 -43365 17500 71536
23639 71536 76425 74709 -2101 -16427 29019 -28689 7791 21870 -15144 -45323 -76538 -127930
23627 -127930 -176427 -137008 -70569 -57958 -47282 -49442 -46564 2750 27578 -18494 -70005 -132824
23615 -132824 -172095 -159403 -112632 -126618 -49627 -24046 -47399 -43124 -85700 -123310 -151355 -70927
23603 -70927 -16623 -15178 -62562 -99059 -135545 -86090 13757 11283 -13946 -16929 -52268 -65408
23591 -65408 -109495 -88523 -28759 58636 50469 -5021 -12166 -63149 -75938 -27461 1740 -6435
23579 -6435 -6914 -3876 -47828 34931 86452 90901 11189 -36661 -19602 75253 70408 108685 87770
23566 87770 88956 71225 -6038 -85496 -67055 -68081 2858 58612 89821 95592 35065 91449
23554 91449 122349 178029 166436 72469 60138 133090 69102 -15318 -103004 -69649 -50082 -54865
23542 -54865 -83805 -48543 10280 -33942 -48535 -80085 -133451 -139441 -89901 -16561 19080 -103096
23530 -103096 -115511 -127037 -197049 -80173 -25286 -45305 -75402 -67888 -40628 -7699 -47129
23519 -47129 -27084 -41032 -4263 -6325 -42501 27903 -9110 -79436 -28455 14902 62649 70395
23507 70395 45578 -7679 -25478 -31957 -27236 19795 1985 52033 20559 -73925 -137454 -69090
23495 -69090 -15692 3010 17298 -53340 -157010 -202657 -210850 -266584 -217511 -148401 -121726 -110390
23483 -110390 -102216 -82203 -16819 46114 110972 65638 20587 48604 14635 -63765 -27310 -17150
23471 -17150 -48220 -18167 -4009 4812 -39823 -11750 -40059 -81039 -107405 -110181 -63286 -13540
23459 -13540 -41980 -46427 -8 -7366 -32416 -147843 -172775 -130169 -68193 -95414 -48441 11941
23447 11941 44612 41731 90622 8411 -35753 11858 -6078 -98869 -93667 -79994 -86002 -18548
23435 -18548 18442 -36602 -26879 54805 31039 -48238 -98908 -64368 -13005 22341 -1908 -34498
23423 -34498 30968 122254 160036 150754 111616 38042 -42515 -24976 58637 29310 -30611 9646
23411 9646 -5891 -45035 -47522 -15371 -48580 -104139 -182928 -151357 -86277 -18142 -83839 -87268
23399 -87268 -90835 -94364 -65702 17876 60084 41912 -44100 -190381 -202007 -156676 -118291 -97447
23387 -97447 -105907 -55963 -101703 -130860 -136814 -103205 -150819 -174462 -141717 -61579 -116623 -157308
23375 -157308 -79351 -82239 -176008 -60871 82577 -7184 -74698 -41760 -45301 -40983 -9949 -14018
23363 -14018 -23287 -62109 14169 110383 123282 75128 15716 14301 72668 99440 97823 36400
23351 36400 -14272 -80653 -58262 -41057 -38613 -30111 -64465 -76676 -60597 -1523 42027 100259
23339 100259 67386 26061 39593 77976 -30155 -70345 -81448 -89984 -9371 -19297 -81097 -53795
23327 -53795 3496 -56687 -167002 -191287 -186669 -98138 64998 164036 134199 126629 80514 31293
23315 31293 88742 86857 53325 -47079 -114201 -85300 12102 67688 -37652 -8376 89209
23304 89209 96056 17930 -100980 -104168 -75626 -85709 -149575 -119423 4038 62308 74698 134336
23292 134336 153956 111715 63116 -1288 -15184 -43407 -7047 -42338 -83224 -88313 -122094 -144610
23280 -144610 -143007 -88264 26675 32778 -54935 -7773 -5647 -38620 -65806 -20738 15802 -43038
23268 -43038 -84979 -93874 -124467 -187967 -157058 -26592 94059 91829 65677 44971 -5071 -98466
23256 -98466 -114278 -133279 -177807 -144816 -65184 -73877 -128046 -129968 -137759 -167000 -120402 -60559
23244 -60559 -291 36241 -29386 -35493 2573 43892 -16637 -66557 -100992 -36691 -15294 -5837
23232 -5837 86781 146764 116938 74908 131454 101719 32259 -2446 17987 51060 -31882 -72088
23220 -72088 -43704 -61045 -77080 -152920 -78115 19286 50991 -26620 -20920 3080 -60517 -166847
23208 -166847 -182510 -163434 -113010 -15495 12135 45839 90798 13315 -17342 -53529 -77797
23197 -77797 16162 44879 77177 26052 -38862 -89981 -63870 -37869 4484 -2588 -18736 29986
23185 29986 32986 -31576 -147828 -141033 578 112004 120834 116509 129341 105336 22734 63897
23173 63897 -16918 -120173 -85036 -125181 3308 91545 50282 -24508 -68941 -39607 -82367
23162 -82367 -129141 -123967 -49213 -36957 -8030 24571 4998 -35284 -20359 -37330 21799 81277
23150 81277 18040 -91825 -96142 -67254 -65516 47296 -3166 90707 92304 -24185 -59097 -31602
23138 -31602 13781 64155 131114 104316 11960 -77329 -68590 -4618 55235 40713 -47715 -133898
23126 -133898 -164680 -114553 -48201 2844 52580 -22367 -42654 51482 63450 -24291 -47427
23115 -47427 -61500 -22848 113053 118948 66066 81966 120673 63962 47545 55710 109226 116417
23103 116417 135906 77961 49866 38370 3832 -55144 -93036 -129411 -147640 -151422 -98872 -71600
23091 -71600 -65729 -81687 -47111 -45475 -100994 -137298 -160609 -38852 3844 -73884 -151816 -177364
23079 -177364 -141125 -43116 30093 27135 -77289 -92523 -48658 -47 50834 10087 -8040
23068 -8040 -3347 -61450 -78499 -39174 -21624 -14413 8527 35220 16694 -54149 -30535 21464
23056 21464 1298 35678 30810 29123 34297 -16396 -114297 -121800 -126071 -120263 -85636 -102681 -141306
23043 -141306 -145473 -76869 -118177 -86291 -58161 12720 36292 42227 35197 -9328 2128 -19591
23031 -19591 2108 55816 54384 11745 26438 764 -47198 -6717 -16970 -4489 -22118 -47784
23019 -47784 -31477 -73913 -43379 -88925 -84545 -41151 -28166 -67120 3641 20914 -5514 -34864
23007 -34864 2025 32885 50744 74242 -81888 -145437 -163658 -162615 -93978 -76213 -48132 -2691
22995 -2691 -10453 -60869 -1078 17882 -50530 -63085 27931 43992 32084 38220 45114 -50903
22983 -50903 -100131 -71802 -24444 -34952 -7061 -104812 -117874 -87553 -40275 5450 -42138 -84530
22971 -84530 -75138 -46943 -80638 -76837 -25408 126807 123068 97180 56371 13027 -9748 -35566
22959 -35566 -17687 -101380 -171330 -245189 -184395 -138018 -95794 -11230 -21955 -57007 -17278 66120
22947 66120 121654 177003 157689 95163 13697 -23363 -10518 22896 756 88421 107794 6880
22935 6880 4170 29117 10041 -37054 -41526 -65183 -53125 -31996 55898 109993 83049 77196
22923 77196 50423 -23443 2288 2480 42124 69367 -59856 -157592 -182267 -141047 -93823 -106081
22911 -106081 -48288 -66687 -77551 -55535 -18469 34268 56520 38255 -3328 -45799 -144857
22900 -144857 -239587 -158591 -98215 -40917 -82469 -205846 -244532 -130618 -96504 -22519 33610
22889 33610 30737 -31752 -82568 -88230 -56472 -43900 1248 71539 91850 55023 95411 101901
22877 101901 33063 -11611 -7479 15986 -47220 -56125 -49379 -85579 -68318 -86159 -154399 -101503
22865 -101503 -41201 -86007 -115674 -55306 -57737 -70192 -71959 -54048 -64372 -39352 32495 79596
22853 79596 112173 120215 116940 67805 24464 24944 -66184 -38600 -56358 -79238 -64652 -67493 -6239
22840 -6239 33443 -57865 -105814 -10939 71749 -18287 -38495 -21488 21867 60019 20411 42909
22828 42909 22662 -61790 -78833 -36715 -114952 -165083 -168805 -101349 -35008 -32583 -119845 -182163
22816 -182163 -162190 -89875 -108828 79 74337 24233 -7288 -9012 -43344 -52006 -43080 -57323
22804 -57323 -47936 -3573 10416 -64066 -79594 -44774 -36166 -94261 -63639 -47239 -8185 118867
22792 118867 96356 40810 40775 10606 -58184 -78955 -75988 -88246 -60999 -64617 -42402 -51863 -47902
22779 -47902 -83207 -64298 -28376 -24017 -35252 -4004 -34829 58618 112870 107648 126953 30678
22767 30678 -7307 -18371 -57749 -78411 -18907 10949 71999 53030 89339 107962 87638 -4308
22755 -4308 -45321 -2953 30109 31396 -8164 1961 42614 1863 -35128 -74235 -10477 -49429
22743 -49429 20297 75433 -6389 -36957 -74433 -123003 1664 87575 76030 -22419 -80746
22732 -80746 -5725 49033 10945 -47437 17923 -52779 -106938 17524 64625 7904 45400
22721 45400 29038 38032 -4591 -105207 -145403 -125668 -34184 -30191 -80965 -47469 -9388 -25049
22709 -25049 -14287 -35675 2852 68046 77963 39911 -13647 -46117 -81043 -63188 37507 4795
22697 4795 -73879 -80335 -44606 -21773 13789 10355 138479 181049 157757 148038 53201 -10447
22685 -10447 2160 -16150 -72410 -37330 -39776 -41465 25079 -13909 -21597 18138 74385 69586
22673 69586 54651 -27978 -126837 -76338 -47151 -37648 -22164 -73122 -104861 -180782 -121592 -81109
22661 -81109 -80258 -52471 -62727 -72802 -12117 87985 -15510 -177207 -190527 -229297 -194482
22650 -194482 -167899 -103532 -63983 -97938 -92303 -97381 -107795 -115450 -147390 -128060 -118819 -40315
22638 -40315 8679 114072 108883 70739 64782 109812 99942 46480 37741 -13238 -53325 -116751
22626 -116751 -92412 13868 70721 93793 64838 68756 61269 82970 27913 -60037 -84542 -73209
22614 -73209 -98749 -85426 -73275 33446 36826 -36508 -99524 -80158 -89834 8552 -14280 -72641
22602 -72641 -158139 -199601 -218026 -174194 -98451 21984 67168 18546 -20708 -28765 -76871 -81321
22590 -81321 -65767 -82043 -79898 -85160 -63157 1762 -17116 -67943 -94508 -75280 -79225 -37232
22578 -37232 -52843 -111680 -127176 -62808 -37111 -5198 24267 15266 29493 -40628 -41002 -37716
22566 -37716 -47269 64 -29207 -25134 3658 548 -103423 -52617 44923 116088 84284 70949
22554 70949 136271 155414 150351 110671 58978 -22454 -43953 -49262 4401 19733 56081 60113
22542 60113 76868 94313 97805 118301 136274 130652 75852 44097 32049 33910 -2453 -51738
22530 -51738 -93588 -170280 -230830 -328277 -297181 -168631 -42477 38764 86313 45333 -51052
22519 -51052 -82726 -76773 -110988 -89516 65488 113266 143152 108681 73398 101661 89856 42362
22507 42362 -20869 19295 -20974 -46822 -96169 -93239 -57264 -19521 50475 35585 75410 70786
22495 70786 55097 136635 153240 162403 154277 143933 113748 76360 92993 -60818 -88148 -5547
22483 -5547 45270 91748 76500 45738 51562 38398 -3864 -40145 -17564 59056 28746 11326
22471 11326 72376 52244 -39087 -63474 -95122 -64368 -8253 -37203 -94334 -107659 8932
22460 8932 99319 4345 57408 181670 152926 38833 -10563 -43311 -21690 -88482 -107727
22449 -107727 -63454 30853 97345 -2506 20963 30153 -5784 -30432 -11220 3576 -14675 -110995
22437 -110995 -98160 -5409 36091 101739 76869 56524 -41015 -21410 56284 108740 123966
22426 123966 102918 91929 76777 66656 39277 -3510 2926 -9031 -65843 -72583 -65992 -33559
22414 -33559 -36624 -31407 -25418 -62757 -74833 -28690 -58037 -14970 23718 32783 47491 51687 72281
22401 72281 103495 111078 49008 -7049 -94469 -168678 -77197 -42802 -36075 68621 38198 -103737
22389 -103737 -80532 -15425 3675 -7990 -17922 -109951 -91312 -38294 19352 65246 71340 61069
22377 61069 30584 35505 70314 34754 -39772 16660 26555 -32638 -65202 482 45346 76222
22365 76222 117718 73822 -22516 -12131 -17235 -58234 -58912 -32449 1164 -30112 -162599 -200338
22353 -200338 -227161 -210167 -126924 -36230 39123 89378 75013 99349 73172 41979 107134
22342 107134 153628 78434 8121 -60782 -60719 -8058 14987 42753 50652 33823 -33838 31028
22330 31028 78381 50908 73239 84697 34066 -39067 1969 25593 62491 106510 60039 -32882
22318 -32882 -19721 45394 44447 18429 73906 90836 74463 65610 92400 42060 -22859 15085
22306 15085 93267 32780 -41220 -105600 -105742 -51246 5835 -2083 456 -7537 -819 -13403 24085
22293 24085 80483 63354 32523 -13217 -65510 -13515 37911 102413 77780 84473 99457 34509
22281 34509 26813 25810 29856 62406 92296 71537 21964 31945 53419 -46016 -28614 -9742
22269 -9742 38456 87571 35871 42798 3494 -10811 26394 88064 96837 136665 142995 162752
22257 162752 291503 364372 314376 371440 386854 450794 520944 805192 1170642 1441794 1655321
22246 1655321 1698550 1513909 1279388 1001999 797996 642855 496760 303796 203772 170670
22236 170670 120684 14285 75557 162795 111999 49547 59353 38843 -22526 -16508 37936 25401
22224 25401 34212 23116 20614 8483 13685 19374 -45827 -114601 -117422 -166285 -155068 -82193 -76327
22211 -76327 17108 108087 132264 85279 50135 25428 64425 49326 3798 -5356 24309 7034
22199 7034 -7748 -18750 -68365 -67870 -74025 -119810 -179266 -118578 -111005 -103997 -66603 -37837 -17013
22186 -17013 12199 49012 -19868 -45131 -30340 -14504 -9520 -56352 -111821 -99355 -80523 -66307
22174 -66307 -99230 -77657 12410 -19730 -28334 19821 30679 -26144 -95132 -37755 -8269 -13703
22162 -13703 44785 132847 99849 80371 4288 -55548 -71907 -47446 -48587 -37049 -13922 -16718
22150 -16718 10394 5310 -59112 -94646 -73408 -91046 -14641 52330 101515 81563 37107 25050
22138 25050 -3021 27180 79439 59474 26688 34316 2609 -18234 -62368 -90997 -90764 -135903
22126 -135903 -164039 -213784 -138107 3069 1946 71395 161612 164329 97593 69086 27007 30180
22114 30180 6240 -35408 -48885 54884 51536 58353 22755 -47236 -36788 49020 16663 -19533
22102 -19533 -49717 -34644 -6952 49852 71341 49954 82172 69648 5583 -57034 -12729 69604
22090 69604 62669 2063 88619 96824 131776 155307 65538 18002 26876 104532 128906 84123
22078 84123 48854 11870 9672 -7238 22818 64098 82475 129640 134556 115244 41241 -7220
22066 -7220 -62862 -45386 -25451 13725 17596 -65495 -105410 -67606 8737 23658 9516 45909
22054 45909 63020 101021 39653 12005 46658 59330 12951 -6156 -17074 -35575 10361 73304
22042 73304 59083 -894 44035 84588 39126 24410 66605 -2095 -64421 -28394 909 11359
22030 11359 -8804 14340 72092 170825 149414 -15020 -66661 -97894 -68110 -96491 -26629
22019 -26629 74480 70672 -1442 29872 26139 3726 33737 -16846 -43949 -63428 -54655 -122575
22007 -122575 -146076 -61501 -95508 -48319 20770 48284 59894 128459 62829 -48993 8224
21996 8224 13576 -28613 4909 57312 30407 38090 -62755 -75908 -45743 -7070 -21494 -11972
21984 -11972 15820 5627 18818 -6054 22361 53320 25155 -21473 -33497 3372 -1530 19443
21972 19443 -18806 4948 -73178 -80266 -52758 -52976 -7297 38248 41750 36808 -14304 -55568 -62625
21959 -62625 -63233 -6989 32719 -35698 -69147 36925 156940 141964 57668 55225 153511 245932
21947 245932 173762 32769 6933 129678 103429 105719 75194 15900 13547 86468 116968
21936 116968 34732 50836 1589 9438 73177 69191 60660 102572 101579 45492 24917 17954 30343
21923 30343 46640 10007 51850 88095 116693 101827 53993 -17940 -30752 21824 49709 12554
21911 12554 -29227 -124114 -171346 -152054 -77772 -128602 -94641 -61737 -72993 -24133 48508 138641
21899 138641 228554 284731 251117 131234 48219 3440 36804 165529 206994 82837 23776
21888 23776 98252 142498 82795 7255 -63859 -113813 -99763 24440 59068 20550 72459
21877 72459 105618 135715 123699 114173 174778 182317 173295 172438 145512 120091 96612 90523 62256
21864 62256 -15032 -51202 -88691 -33382 -12860 -26851 17279 52080 111236 83687 63239 84900
21852 84900 -14241 -29292 -43666 -15370 81805 32389 -1742 22769 34237 65082 70951 -2841
21840 -2841 -21943 52 4561 47094 108984 75869 113957 192783 164814 98195 165427 264793
21828 264793 245920 180265 117005 90708 53608 96174 139033 157648 118104 101072 98719 141618
21816 141618 182414 242458 258210 222887 81788 61010 63782 15886 -1394 -23094 -5970
21805 -5970 21844 124427 121316 102971 121263 181026 241439 192106 99432 35698 -13138 48654
21793 48654 35407 54132 78369 171840 210485 163535 88645 145044 158295 82924 71952 95461
21781 95461 170430 244791 271805 172566 109049 80500 92968 163304 185747 236761 221336 146724
21769 146724 145064 189767 187868 197894 213383 169373 183124 273176 300377 268969 48594 -129334
21757 -129334 -218177 -229812 -254953 -306639 -245535 -259445 -229351 -143791 -88878 -54277 -11666
21746 -11666 -32189 -157203 -132592 -50984 -34940 293 8802 67137 129460 53752 45540 10477
21734 10477 -13109 2782 5212 24383 32743 -251 -65602 -121192 -151382 -179872 -229868 -206295
21722 -206295 -105428 -63344 -49913 -70053 30700 49409 -50676 -28373 69258 173939 194796
21711 194796 217524 220457 210868 173791 150866 205700 222640 225209 316936 373431 355909 303071
21699 303071 322374 260959 193040 139386 74302 72284 75004 113055 217776 265502 290840 358191
21687 358191 294794 285068 306215 304696 320327 277389 255409 212641 214309 267928 247902 255472
21675 255472 275806 248357 268237 403972 492232 444215 423934 269664 221413 268006 351128
21664 351128 339697 266629 288579 313449 302633 289755 352388 367166 343393 325544 334145 365381
21652 365381 323434 267325 270138 388381 439690 520198 599109 624569 597716 497930 414908
21641 414908 380525 397670 532909 548725 577610 589851 640417 595144 561954 618851 635796
21630 635796 551909 566852 661419 702190 702840 736175 766110 777297 827959 861033 873246 997256
21618 997256 1053099 1080645 1069895 1272345 1464654 1678817 1991957 2434685 3027395 3805579
21608 3805579 4513456 4976687 5082278 4921141 4656736 4262889 3893414 3592750 3491962
21599 3491962 3572672 3673737 3856254 4038297 4152811 4205489 4330111 4469339 4667202 4956030
21589 4956030 5374647 5788018 6304884 7010573 7840735 8836432 9982130 11335391 13205543
21580 13205543 15558689 18584621 22628504 28146297 36010344 47404413 64780594 92666126
21572 92666126 138510283 210595209 302384684 379207862 407015402 372173361 296260630
21565 296260630 216074786 152635502 108753074 79356302 59394382 45484952 35652773
21558 35652773 28504780 23228459 19239216 16179687 13829683 11962503 10325390 9000496
21550 9000496 8080306 7273617 6561477 6010156 5404698 4877002 4493290 4272614 4168163
21541 4168163 4114348 4130813 4137723 4062214 3845390 3506730 3300616 3384067 3594700 3999571
21531 3999571 4438911 4637598 4436346 3958958 3501887 3100352 2636204 2305664 2017485
21522 2017485 1789445 1632277 1573283 1461408 1359074 1238222 1142053 1062120 1116269 1101076
21512 1101076 1027242 965873 964520 981365 946058 852437 750711 710614 650521 581186 588128
21501 588128 621159 580527 576312 655234 660436 593970 519491 545538 588260 577864 549779 523058
21489 523058 465821 383119 351702 371224 385230 403946 390900 348445 465927 555279 544002
21478 544002 429370 373952 323733 340694 390197 356973 336414 282229 243644 291568 312337
21467 312337 336616 351434 308281 161432 67679 109612 244119 308425 284922 313077 384179
21456 384179 532671 537935 426348 331867 324186 362776 332318 219717 177989 67462 101972
21445 101972 151933 194200 316931 387590 456160 497484 517542 444455 368466 276639 190103
21434 190103 52529 -101089 -189468 -118449 -81831 -83669 -16438 13181 123087 177434 227708
21423 227708 176155 170073 219549 264174 300420 214892 267369 419221 575835 595042 500572
21412 500572 439536 354111 296928 199078 272299 293795 262126 191679 250785 179881 131483
21401 131483 148500 83739 87920 131068 132077 67227 141694 236044 271713 328525 427658 402243
21389 402243 319548 277444 249541 226271 267165 240990 267535 310216 342536 343195 338434 280061
21377 280061 157419 -22223 -67533 -103638 -185322 -213222 -155856 -150922 -175813 -184865 -108594
21366 -108594 -69456 -69144 -85438 -61184 -110967 -77670 -11382 27972 27075 69327 115625 112666
21354 112666 102274 95040 39953 14158 66569 99961 44635 11080 6106 -61075 -83271 -3518
21342 -3518 130319 95503 9267 67343 56274 -43574 -31437 64166 140034 188321 185712 249864
21330 249864 290913 256664 273250 321411 427567 678843 1026245 1311693 1501455 1553571
21320 1553571 1364832 1037838 802528 654742 613499 552904 574677 600842 579092 560328
21310 560328 532940 440121 272661 266518 270450 256325 213422 229583 277074 306007 316678 304107
21298 304107 286130 295176 310931 385385 413374 466926 458810 533860 597028 709213 817186
21287 817186 769398 868127 1223510 1602525 2113727 2922451 4275102 6561095 10758962
21278 10758962 16760185 20254805 17771317 12911107 8782374 5929975 4119725 3053234
21270 3053234 2334329 1876508 1516697 1167638 927279 746563 595478 526086 530762 550554
21260 550554 459056 369601 364642 392783 406198 377507 369352 326655 384585 366841 344186 246972
21248 246972 127730 115681 119345 81633 162946 246342 330101 341930 328962 350490 303707
21237 303707 268968 261684 231140 144742 69931 28114 45531 63773 195702 231186 151544
21226 151544 46926 2429 -7409 -43100 -23712 -61636 -57109 -95748 -64024 -19045 -31772 -58448
21214 -58448 -132161 -137976 -157912 -88095 -113375 -134450 -26259 23006 226 -46281 -17025 14024
21202 14024 4011 -24593 644 49960 71458 3933 -72915 -43615 47217 60132 120390 154128
21190 154128 98183 104262 94473 46193 42582 30576 -62482 -56939 7342 13402 13789 -10552 -40209
21177 -40209 -44853 22832 67704 131519 156317 158450 93696 86079 79121 57078 65924 -27028 -94708
21164 -94708 -69750 -23737 7789 -9121 -26095 -57526 -52189 -8864 1846 -4889 47788 71794
21152 71794 86738 30082 -16564 56684 124211 13449 -4385 2648 -40084 -90869 -77760 -40845
21140 -40845 -48660 -21691 -46638 -44769 -69064 -2659 37822 -28314 -105260 -166520 -138961 -156970
21128 -156970 -96182 -55698 11064 18001 61998 92532 49048 94359 16800 -71100 -59217 70685
21116 70685 71148 7855 6151 47622 78969 69032 112094 91722 -92670 -145512 -1107 121735
21104 121735 55620 -32956 10436 21162 -23912 -32939 7148 -18715 -87394 -102852 -129908 -108239
21092 -108239 25790 120446 146681 141142 112382 42698 -26527 -99684 -131996 -73494 -63983 -62812
21080 -62812 -42736 47030 87499 31898 -31974 -73003 -81461 -77281 -24182 3276 -101497 -133870
21068 -133870 -139588 -64092 -50671 -84514 -69344 -122545 -211019 -162443 -162547 -158591 -80680 -43026
21056 -43026 -63838 -82577 -55171 -17245 -8824 7874 -15761 -33823 -2309 -5153 -36200 76993
21044 76993 132896 92571 91654 22795 59102 56434 17387 19388 44208 71097 99090 103537 -5158
21031 -5158 -112898 -159765 -176280 -133496 -52941 -18787 -29803 -18580 15826 13148 -60446 10835
21019 10835 18610 37607 10581 62451 32397 -35419 18240 86640 59668 39366 39976 120062
21007 120062 93646 35717 79297 154585 160310 206984 163996 72072 58992 59989 4492 -16154
20995 -16154 -26833 -52818 -26819 -95283 -136961 -132936 -103410 -42224 -42471 -28074 38392 49524
20983 49524 94790 94598 93421 119884 77302 57714 9867 46384 34392 18637 42929 103517
20971 103517 81455 27650 4597 2345 23151 -56770 -60053 -47626 -82895 -106481 -79882 -107804
20959 -107804 -122866 -178644 -139732 6502 55562 35808 25056 6500 -75006 -54079 27476
20948 27476 122561 123132 192171 129290 -12530 -34557 24249 67229 103421 128205 139010 187350
20936 187350 99689 94403 128125 119422 50070 237 -21805 15623 114841 71707 89779 123964
20924 123964 83865 -32816 -137931 -75229 -1917 88645 59431 33529 -44333 -62855 -11556
20913 -11556 -6704 12258 -33373 -60318 -17637 19608 12379 -34495 -45783 -18736 48654 38705
20901 38705 -21619 -72774 16749 31887 22179 -23580 -80100 -64809 34235 199629 233776 166296
20889 166296 171873 291400 421323 484700 660225 872034 1077054 1352173 1577862 1656765
20879 1656765 1533942 1280268 976491 747334 670007 493683 308199 252233 164323 116600
20869 116600 134846 65923 25744 53277 73499 -7405 -64349 -47712 4807 47877 -2942
20858 -2942 25048 89222 73520 66760 111783 171345 167390 68350 -18860 20723 42768 19154
20846 19154 -6433 -16054 -59028 -76906 -79637 -43993 -15236 -81445 -95531 -41093 -59357 -14493
20834 -14493 33685 63755 95277 65068 6745 115746 209264 168263 77899 -57462 -93336
20823 -93336 -22004 -32778 1780 55260 -49283 -129424 -172448 -152401 -78310 -9171 -68387
20812 -68387 -61365 -3523 56903 -1955 -48530 -25268 -3241 8538 -8463 -59556 -42254 -20053
20800 -20053 11300 48053 118983 80365 49248 60421 62543 -12066 -1612 12149 104202 94061
20788 94061 1685 -40595 11387 121789 140918 33219 54261 120768 48063 47042 -5230
20777 -5230 -29657 -111214 -148251 -127784 -34999 -28318 39977 26683 81711 88797 80808 19508
20765 19508 -634 86788 145628 91550 63112 91538 41328 -82635 -47096 -3987 -56411
20754 -56411 -91295 -34541 -100306 -175586 -119827 -139461 -147550 -121545 -171472 -118195 -55616 1319
20742 1319 -3249 41663 72466 83988 128980 166175 134456 94122 106769 50411 -27562 -35978
20730 -35978 -25846 -27812 -55774 -65147 -83868 -119082 -130244 -104771 -67520 -62294 -25482 -395
20718 -395 -38534 -64306 -9349 -24859 -11402 -54937 -122106 -55145 -905 -13415 -104473 -57384
20706 -57384 -23759 38536 79892 59293 33995 42531 114139 95053 -41141 -105622 -74512 -1155
20694 -1155 8562 57487 72882 -18821 -72656 -110679 -84015 -53336 -12867 -2330 -467 50816
20682 50816 76647 72317 60938 53640 49080 14012 33352 59282 48145 52024 53255 22935 -6062
20669 -6062 -16405 57310 81117 84014 142126 138360 144316 84860 -36861 -74828 -71261 -85746
20657 -85746 -98084 -68851 62238 16791 11642 58401 66162 59606 3752 -41810 -79777 -97658
20645 -97658 -55101 -67904 -48359 15097 -30316 -9977 7187 -5543 56685 62725 54258 33399
20633 33399 4992 -12346 -55329 36625 56460 61385 86553 37469 -8405 8522 44587 119488
20621 119488 116520 18897 -44560 31210 96854 98113 90039 52578 70005 83220 88085 55820
20609 55820 26532 50575 -37663 -57690 -42765 -72493 -79547 -33853 -12792 -60207 -51828 62748
20597 62748 103142 34206 -63873 -162089 -89394 26465 85651 48896 -43556 -77672 -75151 -54510
20585 -54510 -650 -3846 -57818 -38173 -68109 -105819 -66694 -57827 -64938 -51058 39419 59323
20573 59323 -38499 -63914 -18225 4259 28469 52359 -5270 -67137 -61540 48740 48297 -35840
20561 -35840 -1123 -1198 -77986 -111550 -56925 -12011 54278 88961 86995 74137 -38866 -173593
20549 -173593 -147387 -90346 -33748 22817 18509 -65922 -97866 -107446 -94181 -68680 -18581 22422
20537 22422 39769 45729 8485 -37999 -26165 22657 42027 -11278 -48343 -66468 -54732 -19342
20525 -19342 8878 -46455 -101256 -111540 -69148 -63141 -18054 2480 -36911 -119974 -93469 -15697
20513 -15697 -16899 -95046 -133475 -121244 -14357 25499 -11961 -2146 39610 12831 -1321 -47211
20501 -47211 -12339 7962 21606 -29496 -26897 -32968 -22057 8767 -8988 18203 4245 15532
20489 15532 -18155 -52325 6968 34628 75849 121163 81850 72921 22010 11717 28332 71108
20477 71108 87795 91644 123158 231360 188259 60832 32072 9746 20430 53035 113213
20466 113213 47286 6947 6597 -86540 -98098 -36424 -23348 62346 86460 88262 63474 97045
20454 97045 118142 175623 219564 179031 110988 76863 114554 196089 170929 122572 160914 169964
20442 169964 199818 265273 239421 355510 484955 622448 722206 983414 1305222 1521869
20432 1521869 1612945 1570205 1431581 1175195 893717 668521 483187 396246 263058 260662
20422 260662 263718 261965 229560 102953 58938 120926 140461 170961 160420 86626 71586 9027
20410 9027 -24594 -29613 27187 9017 9973 -9274 -55350 6172 98805 112672 50753 -85727
20398 -85727 -90101 -88416 -54139 -44156 -70637 -132024 -19095 22412 -32639 -73115 -90611 -102869
20386 -102869 -140636 -119190 -56716 8119 13826 45406 64581 19977 5300 88892 102129 80815
20374 80815 100805 59433 60758 60563 69578 -7678 -44924 22938 97130 98379 20112 -60163 -32529
20361 -32529 46794 76580 106076 120669 113529 101853 127895 115582 58996 55950 1083 -15420
20349 -15420 51394 50434 14534 77202 93792 80787 35871 112725 123347 4009 -62843 -83256
20337 -83256 -40989 -48896 -39024 3941 -14565 -7479 -5377 60920 69146 36212 -38972 -37742 -14037
20324 -14037 -12261 -34302 1391 26085 40108 -5574 -45412 -20199 -147454 -142887 -39455 175
20312 175 7437 -26114 -74861 -48984 -41406 -49602 -62236 -96341 -98427 7240 65950 86902 119676
20299 119676 51930 76196 48634 26769 -76518 -74450 -9749 54229 80930 67367 9314
20288 9314 -41870 -81037 -83203 -63708 -71511 -46674 -31755 -79128 -94935 -97177 -75202 -73709 -87096
20275 -87096 -98011 -67682 -80888 22805 76164 91430 52395 -8505 -23430 -17134 -25556 -59636
20263 -59636 -29982 54835 71134 69369 -31910 -63630 12470 9123 -10837 -20559 -52738 -32994
20251 -32994 -24955 -59604 -150786 -134553 -107875 -166305 -234867 -195822 -108717 82735 152914 129050
20239 129050 143198 141600 72446 83050 97772 59050 -11784 -33827 -35161 1871 75459 106690
20227 106690 51496 -37604 -53707 85259 172872 188946 199130 219320 153537 113857 60935
20216 60935 5689 -51577 -91449 -56159 1112 59127 161566 193716 181367 118063 73830
20205 73830 53645 -30349 -29325 9879 22178 -46796 12780 2243 -5 -59878 -49397 -24098
20193 -24098 -36691 -6585 -14395 5652 53326 114543 145081 56193 -42451 -44167 -42270 -33216
20181 -33216 -145712 -70561 55501 51697 27423 29409 16653 62013 71582 17048 -49103 -37729
20169 -37729 -9146 -8208 -16408 16656 104700 86425 62043 37937 17096 13205 21397 66001 -3087
20156 -3087 8484 33612 19583 -48853 -97043 -91659 -53298 60978 65998 35938 12459 -10681
20144 -10681 64777 68106 -8938 16261 66589 -31848 -77885 7691 31262 74199 118985 97998
20132 97998 52166 70578 71498 45887 41400 -34281 -19843 20290 75944 161845 77107 35835
20120 35835 51656 26366 19142 48075 63488 37798 10624 -30887 -128569 -171120 -102608 -60258
20108 -60258 -24558 33457 27906 47501 104125 35744 30492 -42890 -84451 -78565 44860 63227
20096 63227 6079 -28098 27683 -43626 -145143 -105803 -113598 -139199 -155397 -129255 -75778 19999
20084 19999 42112 91989 88702 114052 101747 86474 114354 93627 50427 64575 -8345 -103104
20072 -103104 -136426 -46076 71602 78185 33607 42390 98770 -36678 -45259 8773 -12298 22884
20060 22884 69000 112134 46326 -39416 -97683 -90620 32566 143220 205512 189229 118423
20049 118423 68669 109303 75627 -45305 -83849 -58365 1745 22405 44417 116601 181157
20038 181157 209607 152337 192257 184397 203537 236856 258024 240135 311788 388542 468217 579098
20026 579098 647861 639869 674939 683222 660667 610354 555146 568716 501712 475527 493557 506307
20014 506307 538442 692382 865302 943262 984394 907236 851104 729085 660069 648295 554590
20003 554590 509222 501288 414976 429052 341744 260711 226836 285626 255647 225148 230015 298147
19991 298147 256172 252910 245281 198733 246242 295622 318198 320737 272196 264073 274915 399044
19979 399044 485327 442580 407963 355333 320025 405558 405542 484898 614438 734436 825631 882230
19967 882230 859387 814114 751097 720001 756091 763861 749585 693003 592629 538469 503000
19956 503000 621900 649675 665477 620292 542899 557500 504164 507407 421448 349227 308408
19945 308408 305620 306957 263269 218844 160165 108035 106181 108271 112241 103610 34220 5203 -55958
19932 -55958 -119751 -229141 -328961 -289286 -207635 -120590 -99957 -116616 -69250 -96937 -92512 -10387
19920 -10387 12834 -5589 89467 174377 152591 125118 122798 130651 148296 123597 287477 359515
19908 359515 450709 488651 424966 272570 129397 52952 58044 68483 69796 113018 220410
19897 220410 375974 397393 383324 364848 307747 307312 357894 369887 338967 272410 247320 248659
19885 248659 323212 442938 559577 727730 784832 701183 680205 669583 580431 619168 665070
19874 665070 655114 777016 871721 837030 786615 782480 836495 817187 729968 660977 570771 569512
19862 569512 622985 531914 519230 531438 548965 500631 498127 448335 420941 392866 339789 373289
19850 373289 389969 375570 385016 338965 297625 372067 465019 504477 573979 631702 692714 730037
19838 730037 746687 760816 864464 1059345 1379688 1669473 1966946 1996876 1849707 1644731
19828 1644731 1555691 1543111 1710718 1961920 2188262 2356643 2289201 2165644 2060519 1968564
19818 1968564 1915762 1918612 2020416 2206727 2348739 2403120 2401605 2366660 2368908 2440102 2506014
19807 2506014 2653761 2769974 2895361 3013549 3227889 3492441 3958075 4663047 5376031
19798 5376031 5953622 6415511 6687990 6700719 6703198 6798539 7174069 7733379 8609997 9866469
19788 9866469 11581762 13835287 16460754 19547008 23677412 29710970 38827340 53300074
19780 53300074 77441219 119254294 190169798 291386472 387851858 427872697 389378212
19773 389378212 302433356 213393996 145976976 101477430 72655371 53615549 40757884
19766 40757884 31729227 25263228 20514946 17016287 14346011 12313397 10728481 9435558
19758 9435558 8545064 7935624 7604045 7441499 7231031 7017481 6739947 6302009 5732459
19749 5732459 5020800 4423217 3932723 3596132 3266643 2945340 2701326 2611568 2490832 2425863
19739 2425863 2379424 2396337 2412987 2515522 2733323 2737442 2550534 2353711 2072926 1844884
19729 1844884 1736874 1699311 1770021 1915805 2122917 2238177 2175929 2083577 1917420 1665829
19719 1665829 1457507 1331697 1219850 1064215 969758 866818 863712 912418 916005 971709 1025302
19708 1025302 1094186 1121039 994814 905788 890379 852279 731089 675324 775219 827639 851120
19697 851120 876801 872884 857413 851670 843193 817953 800279 834582 754656 700722 633099 568859
19685 568859 555375 550955 647350 710758 658932 679526 646035 642285 636020 667392 676922 635331
19673 635331 592169 576947 626769 784394 1004152 1354459 1744195 1953554 1955586 1866946 1659483
19662 1659483 1385015 1133332 941466 819409 665477 526118 468053 387542 338308 470638
19652 470638 571614 704857 887894 997799 1049786 969742 922010 921751 802165 601536 510443
19641 510443 538872 548708 664156 732864 794429 731427 603910 472582 371289 298382 288587
19630 288587 382263 463973 532730 492932 418388 379637 428812 543239 713311 859294 878135
19619 878135 868741 887809 901709 775314 658844 463482 358651 364099 443525 502746 596532
19608 596532 565466 502723 500150 468393 384342 312886 317384 317941 261741 208831 254527 312209
19596 312209 354973 331769 426281 528150 576232 673933 769604 790032 739924 687445 694963
19585 694963 706289 595217 535325 430354 494937 548726 676091 752578 781772 789561 710958
19574 710958 601294 511302 459760 454423 449225 489594 573745 716538 844949 928171 897803
19563 897803 824831 823820 825545 874641 896130 862920 926839 977991 952585 931846 1010753 1151168
19551 1151168 1336712 1504826 1647371 1734067 1809823 1835911 1861019 1968301 2013637 2043608
19541 2043608 2057314 2081727 2049368 2043796 2120235 2178801 2228002 2296332 2397561 2637171 2964679
19530 2964679 3284193 3399093 3437795 3537635 3666778 3798894 3997073 4258304 4725321 5371341
19520 5371341 6185409 7282644 8855427 11229469 14514100 18217973 21021379 21802099
19512 21802099 21105525 20168040 19960082 20846663 23104373 27220733 34066920 45437096
19504 45437096 64591327 94935818 133719203 162421706 166402730 155381485 142316121
19497 142316121 129763154 114253533 94953624 76392024 62790762 54894116 52247945
19490 52247945 54130682 59372192 64548208 64612321 57929747 47834604 38078002 30531119
19482 30531119 25074880 21249254 18742037 17271890 16554746 16609556 17132221 17652227 17791785
19473 17791785 17525370 16989003 16421676 15966076 15677659 15877424 16614918 18105980 20435643
19464 20435643 24077699 29409163 37107665 48060223 62072506 76112912 84437381 84302610
19456 84302610 78597346 71900719 67481689 66884169 71219389 82136439 102468101 136080037
19448 136080037 183829191 238466357 293981461 344251789 370183064 352141974 295865728
19441 295865728 227983238 169570231 126729343 97661677 78756009 67202520 61463575
19434 61463575 61003511 64371740 67643273 65265470 56627737 45726557 35983905 28630478
19426 28630478 23483137 20042159 17914561 16685555 16001569 15766475 15973055 16047666 15372306
19417 15372306 13904659 12489024 11163756 9815173 8662876 7545990 6680488 6118391
19409 6118391 5668511 5346423 5193304 5134485 5037468 4908356 4636844 4315196 4036913 3777784
19399 3777784 3559737 3465635 3343605 3185752 3091858 3095598 2977764 3010698 3091371 3077617 3118278
19388 3118278 3091267 3106167 3160362 3198103 3219348 3299012 3453011 3677106 4002279 4438177
19378 4438177 4954738 5368028 5688288 5969025 6249443 6489369 6803586 7188962 7660802
19369 7660802 8313944 9098371 9947063 10893573 11838857 12794947 14059042 15888731 18568385
19360 18568385 22600748 28746249 37399113 47601574 55837013 58973857 57641338 55419895
19352 55419895 55181706 58704312 67036693 81689816 105721239 143522421 198844511 266402935
19344 266402935 325697469 354105902 345019485 308663670 259662744 208866176 163909297
19337 163909297 128783755 104032981 87898261 78511596 74601809 75558503 80338912 85785080
19329 85785080 86618707 80043006 68279543 55560859 44619194 36345888 30405494 26144425
19321 26144425 23052339 20758998 18820968 17207263 15807245 14527666 13605495 12992109
19313 12992109 12510084 12285725 12297893 12594450 13190472 14048291 15431155 17539756 20725547
19304 20725547 25554613 32567413 42154352 52343428 59133906 59864675 56060392 51350095
19296 51350095 48625502 49591342 55299949 66824826 83962692 102984274 120105710 135279643
19288 135279643 152981664 169550534 168683526 146005681 113438388 83815623 62184507
19281 62184507 47684028 38044491 31516986 27228774 24743258 23797077 24052046 24440500
19273 24440500 23610789 21065166 17673880 14484559 12054126 10271983 8893622 7905730
19265 7905730 7211955 6721976 6208786 5684912 5201936 4767234 4376908 4145810 3938223
19256 3938223 3683705 3472508 3221052 3053322 2823346 2666697 2569694 2456677 2336877 2263330
19246 2263330 2173323 2088077 1965407 1858068 1775154 1676599 1554730 1545187 1480908 1478935 1470060
19235 1470060 1416090 1405100 1390201 1296928 1345904 1368551 1354468 1267349 1252748 1294128 1197501
19224 1197501 1102297 1067906 1002100 991194 969996 1006024 1042224 1113785 1156248 1091911 1093895
19213 1093895 1037860 937106 889672 793061 760129 717508 586914 592799 680017 688817 738051
19202 738051 823100 969731 1036914 984685 899288 852598 821936 814110 842758 846830 836393 934777
19190 934777 1043606 1076677 1117171 1112204 1033951 961475 935169 803071 679771 711341 685112
19179 685112 716710 635162 605835 543413 520061 626830 640930 642265 605757 583439 652766
19168 652766 678551 620963 610604 670142 609497 646135 715837 795490 874443 931679 909167
19157 909167 905039 890194 821210 755091 645549 492146 345653 327740 325458 292506 312307
19146 312307 383424 493231 548068 456202 496185 616076 619598 513213 462787 485139 543693
19135 543693 630366 717306 856889 995632 1210718 1326870 1305262 1198473 1050584 989592
19125 989592 1014197 1052651 1243107 1531306 1856802 2318896 2930094 3927584 5332562 6480158
19115 6480158 6857041 6657532 6163064 5603094 5155504 4716382 4233566 3792173 3366519
19106 3366519 3030508 2818269 2715847 2770749 2748380 2348803 1961567 1592212 1374567 1182540
19096 1182540 969443 856874 797163 786313 743124 595791 515155 502631 591849 640827 619713
19085 619713 621156 668510 645474 574571 505122 530559 611424 697043 923950 1180284 1379339
19074 1379339 1684659 1897449 2040776 2146919 2271606 2275902 2133662 2069337 2219757 2520347
19064 2520347 2958694 3407754 3924876 4478743 4931404 4947953 4423845 3502697 2583184 2000071
19054 2000071 1569340 1236104 1078339 954907 832913 823117 838020 886806 987091 1039840
19044 1039840 957770 855140 688491 595539 551387 455132 449618 455093 491747 534932 635057
19033 635057 579798 582965 603327 591349 591127 588022 578114 601694 570479 554817 551763 554268 546841
19020 546841 662033 801614 914526 1028065 1272260 1373160 1324873 1219447 996376 726817
19010 726817 616072 511145 472762 527698 517439 461879 373801 350214 375187 385897 445974
18999 445974 598298 669287 701682 822266 991851 1059428 982989 929279 895405 768566 621006
18988 621006 510183 470847 454148 449073 496891 605972 660603 746530 749931 849473 967463
18977 967463 1088662 1178409 1194195 1113137 1086161 1054873 1004005 967257 905232 1020465 1134178
18966 1134178 1169615 1267754 1402132 1498327 1463119 1390519 1345760 1169799 1110602 1002296 945016
18955 945016 980948 981238 951807 959681 920471 806998 765568 678357 742920 729949 687958 679913
18943 679913 785710 832619 848995 951609 976829 893500 772028 663512 617440 635732 711895
18932 711895 679621 723226 745435 785413 756050 727786 726810 710958 669971 653919 639633 638610
18920 638610 717357 717767 749375 848673 928926 958011 927917 896324 888255 806769 697942 609119
18908 609119 605172 564900 553857 617077 621296 556001 554030 489001 395814 412652 466651 479047
18896 479047 439508 401099 394591 361771 310345 221635 154485 143959 185424 306735 332082
18885 332082 309653 330399 344622 341015 346189 301165 265510 334550 394403 392075 339460 310558
18873 310558 369170 491538 429295 307415 303205 365495 337241 392594 577721 583949 466837
18862 466837 356382 361448 377134 403458 427265 450397 465512 448265 402246 332969 335124 323805
18850 323805 305000 364630 373256 359286 421519 459021 420695 425880 435484 404576 471638 485403
18838 485403 507953 554019 565265 503151 505403 472143 466572 492932 496573 422245 448191 672592
18826 672592 872442 939550 985882 995572 953257 955485 989294 946019 941285 990111 1118930 1421096
18814 1421096 1899465 2030647 1859759 1590915 1389531 1239898 976021 866415 714678
18805 714678 589099 502169 428211 392164 393715 388501 412158 340600 394703 403701 388157 385482
18793 385482 365101 429502 402192 361375 383958 470618 519438 452862 410347 353214 339499
18782 339499 351891 393331 510212 494285 535656 606761 664135 643324 693040 754205 824629
18771 824629 809652 821004 893160 863790 766143 613408 443597 333145 358842 362722 432405
18760 432405 526783 533874 568652 659781 712017 774095 847898 854799 806932 777504 639868 500855
18748 500855 466105 510436 520392 416046 313130 221602 178587 154616 193689 263271 280839
18737 280839 251475 230006 215409 188187 93741 -8913 41980 69094 58823 147402 205694
18726 205694 235605 209011 147765 158992 166531 99580 59856 132834 222543 204435 176997 140374
18714 140374 61824 -11214 26631 31728 22167 -511 27880 33552 50175 74971 8567 -4485
18702 -4485 42657 106546 152249 297316 340054 317342 253008 254817 271049 209043 174245 203391
18690 203391 202617 206276 223788 314323 313364 260298 303729 341153 415176 532181 659501 743989
18678 743989 887702 941270 908678 936427 935465 845192 723900 571505 486050 448407 387253
18667 387253 463186 414476 369695 310990 144518 140313 125813 169854 168285 176079 154913 87171
18655 87171 32301 74494 145975 212092 218488 219138 179410 195425 170574 97719 67176 59637
18643 59637 43370 71195 124543 125975 173373 227243 248275 320579 412427 367785 409535 320886
18631 320886 206158 250338 342883 468021 504194 529983 615838 622649 646229 683296 693829
18620 693829 681121 635685 485556 374291 266690 243841 274169 248030 249114 238299 175258
18609 175258 121732 81578 57591 83946 110098 103474 107157 109126 158338 94069 97868 111147
18597 111147 81978 146411 226845 242724 282711 282720 223609 217255 210978 155680 78119 80209 97235
18584 97235 60636 18820 30088 28563 15421 21785 46144 8628 80132 142110 107808 15208
18572 15208 -1043 37449 36090 5096 -25749 -4654 21430 11046 -5694 17929 80836 164984
18560 164984 161137 131969 80893 75311 83871 46007 54909 72027 68594 80451 90682 113791
18548 113791 108917 115704 200905 261226 248729 164721 151042 130435 156231 149989 159412 77172
18536 77172 9055 49544 66929 120519 111287 120976 153945 143903 95523 110050 91208 61866
18524 61866 63795 19154 63931 149597 195897 142308 25482 -64961 -79058 -5069 73203 50685
18512 50685 597 -66454 29508 69860 23636 3460 113173 140874 152203 154539 206662 197948
18500 197948 181228 154422 179747 149429 119417 170101 205328 204721 102399 11248 22918 26464
18488 26464 41264 122048 171806 101827 -107233 -121772 6482 -1527 12445 -34215 -3263
18477 -3263 34695 2655 -44594 -15540 46765 125949 128622 72148 72692 115307 86021 40593
18465 40593 1482 61544 111236 88199 98930 122043 85690 -18150 -94007 -55476 -40207
18454 -40207 -9136 15977 123031 138592 88304 10903 9209 6148 -66551 -73739 -6195 21454
18442 21454 107159 80473 45196 -3364 -33684 -63813 -68997 -58480 -44385 23542 52016 85092
18430 85092 152524 141521 176741 204550 148979 118915 44261 75562 77716 33931 44794 30378
18418 30378 -13184 -69386 20717 86555 2876 21916 -2431 -28709 -32142 -23507 -39500 10197
18406 10197 -13537 -52709 -46858 -52434 -35626 11071 57104 97871 28744 -5337 19108 92084
18394 92084 202562 280536 235065 224421 156423 150836 152411 97714 19121 97951 84021 28088
18382 28088 35637 100124 2729 13571 148461 52007 -35385 -78035 -18789 18921 23537 29142
18370 29142 80631 9470 14847 -49801 -53007 -36141 -107672 -79046 -44278 -7837 -46476 3465
18358 3465 33783 92931 200682 173546 127409 121036 29144 26183 58326 92079 45913 42190
18346 42190 32520 -28979 23460 81803 88390 39850 61933 193760 139508 72220 68351 114197
18334 114197 86626 34196 95240 41604 25277 121979 158915 146631 202129 299356 283782
18323 283782 222804 192104 175676 129818 117575 89699 47521 81740 164493 214537 185052
18312 185052 137113 93684 53687 17409 25171 -20587 6796 38842 72241 42546 -22470 19664
18300 19664 -56521 -124528 -109215 5707 -40150 -101944 -15448 73730 -12750 -30716 31972
18289 31972 8639 -1082 -29529 -10877 29404 -9213 -56737 -61676 -65530 -97882 -148241 -103900
18277 -103900 -38946 33452 85800 91377 45386 65476 94149 111402 92704 31995 21658 26020
18265 26020 1672 -43624 -1654 136552 198489 178008 159583 127775 75606 84245 143212 142760
18253 142760 127292 122537 104904 80777 1749 13181 399 -127103 -133250 -31821 -68900
18242 -68900 -39455 39200 93947 161677 163215 198848 128047 47959 117737 235198 225359 116708
18230 116708 46886 80659 117057 141412 174269 161594 77069 -16693 -6974 14999 117794
18219 117794 89297 -18974 -43961 -19331 -46045 -9278 -54760 -67990 -55208 -7230 104539
18208 104539 146719 54066 100587 94964 79208 107455 73729 -15512 -71030 -84747 -68516 -1927
18196 -1927 93272 109199 80509 68588 -29156 -75838 -67386 -26481 54586 28162 14658 1910
18184 1910 -20758 -18675 27788 -20087 -93752 -30328 36366 33169 35486 17838 38398 19053
18172 19053 21966 84584 8949 -65314 9242 104153 51877 58461 98907 70720 -7277 105764
18160 105764 170769 148572 83369 87264 120234 146880 129244 134764 99792 43506 136059 167159
18148 167159 101826 67669 29646 110634 125638 69505 13443 -38682 27747 51888 24158
18137 24158 36382 23270 37418 105475 101235 38320 -28853 -98339 -102067 -49484 -19430 71860
18125 71860 68652 14687 55861 55153 47703 8806 -10267 -32282 -20985 66356 53904 -35880
18113 -35880 1495 21282 91990 65557 32126 97442 100891 84411 62928 118653 86665 18961
18101 18961 -33224 7938 19663 99674 130278 115019 92910 43745 15342 -13526 78832 66534
18089 66534 31359 41163 49005 52429 -11988 20781 -44471 -110846 -125277 -126118 -52371 40452 155385
18076 155385 182675 104314 34064 -32973 -31591 -27877 40247 76033 24631 -10840 29617 87407
18064 87407 47868 -9857 -20734 -80857 -80820 -19220 -12767 -9348 24599 29161 34823 15201 -35146
18051 -35146 -51387 1085 18402 64154 101636 86206 1728 -47638 -12239 9069 7256 23838
18039 23838 2641 20252 77691 52137 87053 143329 96541 100897 89966 47387 4590 -4118
18027 -4118 37760 89849 89979 36865 46443 86070 163255 184695 70170 -86271 -46631 43060
18015 43060 56938 14906 -50683 -99374 -143164 -156731 -134016 -4473 84986 48504 -9605
18004 -9605 73976 91258 120773 128384 147878 88968 31039 43804 92066 72622 21720 20781
17992 20781 19879 20143 5267 18745 45377 46502 69070 35504 34232 91174 103572 108617 43181
17979 43181 -38239 -33941 73758 63889 32882 -13418 -81428 -99266 -97758 -17141 44379 90114
17967 90114 106765 34625 -85499 -46912 -8942 -14247 -70327 -43637 4365 100129 78691 114369
17955 114369 61244 -16489 -14159 1224 49100 123551 84041 -15668 -84616 -61866 13904 149177
17943 149177 211516 102096 -12571 -42822 -55977 -126986 -139380 -184123 -152187 -16623 68155
17932 68155 72093 -29309 36678 92013 22438 14480 32201 31363 43922 53945 34092 -31845
17920 -31845 -109195 -156549 -104510 -123293 -150029 -73272 -1722 -13638 -22151 -56585 -20015 -39617
17908 -39617 -53813 -127036 -151321 -104546 -51940 -24279 -62512 -85296 -693 53713 114549 158782
17896 158782 111448 64921 93756 101529 63690 -20520 27186 60866 70159 -27470 -93102 -74212
17884 -74212 -137641 -99567 -34049 12424 86422 126641 142873 160005 95182 67723 42947 56961
17872 56961 62527 71967 125833 120983 25890 -7546 -33502 -20002 8516 92901 222018 201967
17860 201967 84731 2591 6976 18225 11780 -25693 12259 44295 56393 84733 105880 81796
17848 81796 -25809 -44968 -7179 70573 37568 -52341 -63394 -48635 -17007 -7625 9515 38500
17836 38500 -7689 -101477 -75599 -78139 -104595 -41081 -54698 -35210 32835 123180 122455 -17080
17824 -17080 -92559 -54759 -64311 -36461 -21205 20625 45806 75153 -60246 -106072 -95700 -5749
17812 -5749 8997 40786 15619 27233 39616 47896 5012 22114 -7115 -73730 -86369 -100728
17800 -100728 -122565 -126142 -26990 31810 48025 116478 53000 30898 76952 66690 42728 -3067
17788 -3067 -40473 -55069 -135200 -99472 -66462 -76181 -25329 79530 111825 47522 130377 67278
17776 67278 55549 90466 -29950 -77333 -11082 -46764 -55522 -22333 -44504 -53229 -119087 -57702
17764 -57702 -39347 -28295 -52227 -43813 -117129 -137721 -102229 -93639 -109234 -111063 -98536 -97142
17752 -97142 -20531 -11063 60512 60001 18900 31295 77420 99701 136312 104732 -3603 -67849
17740 -67849 -82565 50894 110663 79492 106576 105236 46354 36744 -50318 -88248 -59134 -11578
17728 -11578 -50321 -93961 -105662 -88732 -109786 -49196 -54713 -55744 -42679 59717 69910 34950
17716 34950 -23131 -144610 -145684 -63942 -21398 1613 89607 126026 55923 58875 47059 27130
17704 27130 -17393 -38411 -90122 -92212 -115121 -78571 -2600 -7663 36279 52845 -38845 -104720
17692 -104720 -163074 -85474 -94932 -88995 -51612 -21265 -39703 -27196 -37710 -96209 -102445 -71731
17680 -71731 -57927 -23584 -46287 -61 -1292 -5022 59086 69473 61235 50370 -5366 -88180
17668 -88180 -92062 -27603 21594 19730 -61460 -74219 -66524 -29798 11203 75538 91476 164414
17656 164414 166276 111727 86673 54720 34237 -25160 -36114 19548 17754 5942 33065 91829
17644 91829 56276 51421 69329 64479 13469 -20549 -9992 1984 77421 71617 139307 163079
17632 163079 66137 -26192 5807 22001 16869 42217 83432 54389 34574 63717 81514 131315
17620 131315 20404 -58077 28754 61329 70485 40878 50863 27251 32368 29197 15672 8087
17608 8087 -12697 -45986 -155521 -229237 -178988 -121145 -96472 -120397 -164303 -136487 -194193 -212668
17596 -212668 -189055 -116785 -98710 -132656 -94361 43104 45898 -30983 -23543 -22948 -39897 -20254
17584 -20254 -15770 -32456 -30271 14004 -18838 -62432 -25130 -15854 32280 56251 30386 41818
17572 41818 10613 45140 68803 73269 6730 130 34822 -31850 -131455 -145664 -176593 -147171
17560 -147171 -161051 -83278 -2929 1144 -28025 -85095 -75395 -27639 -43647 -35363 -79747 -49445
17548 -49445 -25236 -79926 -123357 -167536 -112773 -20837 -9403 -20294 9145 67869 45419 22555
17536 22555 36578 20179 -10713 26117 69470 17236 -2507 -20627 -17767 -16221 30335 103767
17524 103767 90431 4132 -114980 -138532 -112654 -108823 -24650 -7640 -41032 -35868 59347 118538
17512 118538 5158 -2414 33075 13826 5540 22874 26320 97948 112204 41523 -25748 -48005
17500 -48005 -40714 -28605 -11457 -11641 4747 -18042 21744 141158 156149 77688 96019 62042
17488 62042 38054 -36311 -52856 -118997 -137926 -142031 -104505 -77629 -135289 -110392 -23908 -6338
17476 -6338 -7052 -34206 -83743 -45430 -20020 -739 -15506 -1179 -15666 -20823 -6023 10193
17464 10193 -34716 44576 61515 40757 64719 18093 49513 83535 106573 138191 100096 128019
17452 128019 88285 -2318 -89394 -150537 -127089 -58596 -61392 -100734 -66738 -47035 -44885 -12938
17440 -12938 518 18787 39737 -13542 -32282 -25108 -43957 -42773 32100 68216 15620 34794
17428 34794 -13823 8780 40951 97133 94995 84351 53907 6012 -1328 42736 61152 30403
17416 30403 -15336 -42550 -19011 28105 -48754 -103329 -180501 -120684 -72480 -106272 -111258 -164098
17404 -164098 -188174 -117096 -102195 -132712 -88856 -8787 -47220 -94489 -139746 -149573 -110775 -58451
17392 -58451 -82348 -124238 -33983 35794 -5813 -28178 -2727 -20011 -18893 -18388 13466 -101231
17380 -101231 -118127 -44832 -43650 -55039 -26218 16561 39550 47583 -10331 -53971 -71955 -133092
17368 -133092 -116084 -107423 -157035 -165022 -62856 -29597 9500 -26863 -104993 -43021 56201 77882
17356 77882 85004 -16372 26792 127588 152311 148428 114729 121564 83735 100257 61890 -65679
17344 -65679 -44866 -50072 -66379 -74703 -38102 15620 51441 16957 -35162 -90682 -119704 -86610
17332 -86610 -146345 -41957 49702 65556 6188 9539 13251 51535 60937 60381 76629 90420
17320 90420 90530 24118 55280 107144 16567 -96930 -43921 50338 92868 72954 88827 120475
17308 120475 33373 -20942 7870 8988 -78426 -91489 -75533 -56481 24559 -1665 -72611 11712
17296 11712 101200 68368 35053 -35009 -59597 -24388 -35158 -19273 41174 -23925 -21107 -62702
17284 -62702 -16295 -13602 -29084 -87993 -102599 -75116 -87277 -78131 -93962 -139525 -100459 -5258
17272 -5258 27175 31122 38018 45923 28116 58772 9322 35083 24718 9184 72403 42131
17260 42131 45903 20328 25642 -17520 -19762 -59319 -53917 -49809 -57938 -72650 -57237 -38963 20955
17247 20955 28962 43343 31609 24755 -25479 -34161 93929 196008 193070 140359 84401 59375
17235 59375 52163 14411 26506 80089 -15087 -55584 -12240 -54254 -152049 -135473 -65913 -52508
17223 -52508 -76783 -46339 16151 33608 9899 41102 48622 28816 66371 11382 -33754 -41007
17211 -41007 -114363 -91129 -45030 -15678 20732 92917 50746 -108474 -151286 -159537 -19055
17200 -19055 68199 6229 -23515 -41592 -42910 -34957 -57542 -32029 -36255 -19648 47846 23321
17188 23321 11912 94885 60321 -19668 -74579 -70092 -103589 -67668 -66654 -92103 -20551 60561
17176 60561 29174 -6080 7234 41050 134223 154013 128495 77063 66988 18689 1037 13958
17164 13958 136919 189511 210615 180844 213464 250039 202575 117901 148686 133478 40144
17153 40144 -28743 856 -41563 -18890 68669 54344 -42004 -66211 -133214 -141683 -139457 -105448
17141 -105448 -108159 -50332 -68952 -74391 -54052 -48559 -9929 17177 58146 6154 -10374 37
17129 37 33362 50527 -262 -109704 -79746 -48960 25447 91681 52673 21563 -29828 -69875
17117 -69875 -131129 -139421 -127249 -170947 -90596 -36938 -51775 -132885 -200468 -72779 53059
17106 53059 90670 166518 84569 -24510 -23443 -73024 -78985 -39272 50757 94463 150866 75494
17094 75494 -1989 -2648 -18237 -43609 -63322 -12712 -91037 -11953 73798 29394 -8857 1439
17082 1439 89307 92081 74213 113404 43158 89423 154331 108940 79692 55577 -35418 -110856
17070 -110856 -21474 64945 14698 -33509 -30183 -12979 -12930 -2375 -20646 34640 107464 99113
17058 99113 5090 -30788 -67488 -38747 23377 -6306 -61212 -112179 -38864 27247 37126 86461
17046 86461 63445 9939 2056 31088 -12470 61005 70581 34740 15881 49495 9044 2594
17034 2594 44270 -19123 -54268 -65605 -100274 -149861 -105465 -26590 -37965 -46332 -94521 -152909
17022 -152909 -112466 -41499 -31630 11921 -45064 -56058 -53617 -21359 -96984 -80821 -31624 13451
17010 13451 -9490 -34607 39372 -23080 -129478 -144414 -51661 -41093 -61499 -72751 -119873
16999 -119873 -152728 -138476 2046 28814 -663 -65518 -103402 -65900 -51869 -50517 -17699
16988 -17699 57126 98069 89581 53911 44830 49443 111609 78357 10757 48057 78140 76554
16976 76554 39529 23950 -784 -21697 17784 3542 -229 -6381 -30189 -46834 -31915 -16639
16964 -16639 5030 33792 39397 -23276 -140912 -164513 -106193 -18109 49919 -22064 -31637 -31158
16952 -31158 -37543 -16330 -53465 -27591 123035 144409 151040 141756 110434 74877 73461 70737
16940 70737 31856 33101 -22050 -24950 -26566 -16530 2582 -13937 1868 10205 27080 -17356
16928 -17356 -64688 -67874 -20784 388 -50109 -62536 -132697 -153236 -92745 -44614 -23938 -91592
16916 -91592 -105205 -34749 63456 139746 116024 97194 79931 42352 22187 25555 36264 19828
16904 19828 -79668 -89044 -33146 -17100 -17087 9793 -7176 11178 -18303 -39155 -3258 -87184
16892 -87184 -137185 -75258 -40362 -117083 -162899 -101898 -26162 -10556 -64150 -77480 -150557 -169302
16880 -169302 -105933 -59945 -127118 -110317 -39005 -3724 47834 80729 70945 15376 -41105 -82636
16868 -82636 -83206 -21276 -29101 17221 -74060 -157114 -102200 -50077 -72687 -44474 -48840 -71194
16856 -71194 -20450 -6695 44008 66064 14599 9326 -24989 50382 59167 108536 99214 25347
16844 25347 39496 146245 101829 90820 61743 -41227 -77571 -43239 -14060 -46684 -58620
16833 -58620 -30637 54591 151225 141335 138309 176739 191987 150953 53394 12704 59662 64844
16821 64844 63905 19300 -55452 -55501 -13075 -20266 -161338 -147324 -44017 75218 164981 65922
16809 65922 -67196 -51184 56915 132617 144937 138516 128849 117893 44651 27881 46324 13347
16797 13347 -16254 26720 54552 87275 29708 -38529 -16494 -22664 -28605 -30648 7068 12300
16785 12300 12590 34756 88732 74359 2512 -49791 -64010 -44294 -52287 -105813 -91597 -72392
16773 -72392 5304 68772 25377 -62514 -113447 -38329 3095 -772 48233 59983 36480 53000
16761 53000 6055 10097 48531 70076 37005 16174 -50144 -123841 -151203 -118428 -73786 -21183
16749 -21183 -13640 29860 21715 -159 -21780 27720 5177 -16473 -75709 -38716 24555 72279
16737 72279 64989 34141 -28839 -73755 -61782 1167 62541 110920 72715 29514 41268 80550
16725 80550 -23252 -44364 23473 -26894 -73025 -12473 -27780 -17543 -64833 -40842 14540
16714 14540 73122 68824 12322 -46289 -28231 -44490 -84133 -173859 -169907 -121674 -58784 -25206
16702 -25206 21520 23868 -5933 28163 59847 18653 -46039 -72268 -78991 -18571 -30426 -63520
16690 -63520 -23849 40557 79732 67175 1031 25822 76892 43155 -66889 -81737 -21092
16679 -21092 40701 64882 35960 59200 82254 39421 99860 119145 53641 8831 -56050 -136224
16667 -136224 -128732 -99058 -443 -15145 -12502 23343 -6275 -72243 -83323 -16528 -8271 -19187
16655 -19187 -5701 -28812 -73878 -80502 -112312 -93104 -95187 -46643 50641 92900 74801 111918
16643 111918 116971 70091 31302 -19850 -38696 -7622 -26597 -2819 68472 64356 69562 89321
16631 89321 54866 35184 56207 23482 1664 29681 96255 170813 78650 -11937 -35276 -94253
16619 -94253 -117373 -149854 -108227 -118996 -106060 -39240 29336 -24999 -62696 -42473 35581 68966
16607 68966 26523 25069 83083 118131 138620 118403 51432 -7461 -72239 -13121 11952 -6648
16595 -6648 -93928 -183217 -166224 -138948 -49939 -12659 -12394 -23109 -149715 -228292 -179168 -105283
16583 -105283 -17284 -1362 -93139 -176078 -197151 -163138 -133022 -9639 -54867 -76057 -8458
16572 -8458 105790 142237 126197 38388 -63265 -15953 17930 40574 -56057 -46312 -74911 -93134
16560 -93134 -5863 -2436 -26154 -37039 -99450 -31641 -44541 -61222 23264 -6590 -88486 -78218
16548 -78218 -105459 -94890 -156352 -149827 -69682 -29867 -76548 -120907 -126471 -131534 -74145 19957
16536 19957 27016 111246 91616 -14289 -40494 28222 77839 36878 23227 -29 25155 -78978
16524 -78978 -26551 7490 -84196 -76328 -78212 -146187 -259125 -227663 -166172 -154061 -169186 -122817
16512 -122817 -11928 8887 41970 16343 -31770 26043 102685 81396 36021 -11951 21205
16501 21205 39072 -59726 -171291 -160514 -72634 -53648 -10426 -29993 -45668 -11396 -2346 -62745
16489 -62745 -58964 -72514 -70801 -54708 -80992 -74756 -39824 -66095 -57197 -12210 10988 80371
16477 80371 95226 65696 67299 39099 58803 -5138 -9173 35247 -13102 -91693 -94695 -99313
16465 -99313 -78996 -10509 32628 38028 45063 5264 -83021 -60328 1674 7204 -66871 -108522
16453 -108522 -93325 -42422 7264 -6684 8753 50905 76066 35740 -4985 16681 -26035
16442 -26035 -27721 -30461 -68950 -52696 -16290 -42913 -14442 -37513 -82266 -88162 -62664 -39239
16430 -39239 52075 62685 8696 14571 -36181 -58019 -15464 46514 -32878 -43501 -29150 -28008
16418 -28008 -32845 -63913 -53131 -9756 -38282 -69154 -165967 -146391 -63870 19890 70006 118116
16406 118116 142855 117852 10430 -28124 -23122 -2888 -44385 -59793 -22304 97372 174875
16395 174875 159841 100847 11732 -43276 -96927 -77371 -34232 -64847 -127837 -73026 12022
16384 12022 9160 -51163 -52050 56295 67993 52062 -3374 -52362 -41261 1632 -36437 -38613
16372 -38613 -7684 -104426 -157401 -66975 -44591 -23311 2696 43576 26219 76231 32258 -26895
16360 -26895 -25164 21851 71501 60082 80571 76780 63643 73879 99988 100719 25551 30582 100401
16347 100401 127714 85849 43297 -1966 -21329 4408 -48364 -39985 -93325 -95497 -43558 -5762
16335 -5762 -20100 -13521 52673 103774 14485 -99726 -63246 -69172 -75557 -37719 -72832 -94314
16323 -94314 -73366 -18269 33043 -1096 11826 -41105 -143684 -187566 -143491 -78404 -95944
16312 -95944 -113519 -68425 -74451 -97788 -73900 -54540 -15881 -52612 -134464 -161054 -126972 -28828
16300 -28828 73061 17401 -50552 -9206 -24655 -2296 20326 49935 55081 -2161 -24959 -24592
16288 -24592 -59911 -28756 -6778 -22277 -10972 24102 -65919 -184952 -166709 -106315 -86339
16277 -86339 60735 158191 99468 -32281 -12585 12019 -22157 -59550 -78271 -43079 18106
16266 18106 19295 74749 98339 -7417 -106458 -60584 -184 -6133 35122 -38517 -75646 -37845
16254 -37845 -15529 -27844 19953 4138 -18653 37080 124671 188050 168839 118157 67497 -47021
16242 -47021 -107195 34388 121238 22783 49338 98164 48527 -12473 -27013 -97933 -110165
16231 -110165 -102500 -38579 -26381 -23681 -36788 -76703 -105532 -74636 -84801 -47381 -11039 21076
16219 21076 31947 29683 3618 -27725 -55683 -27304 -16540 -6519 -23190 -51465 -73009 -74593
16207 -74593 -58303 -37745 16289 37733 14282 -24298 33821 71050 43089 -18287 -65178 -67380
16195 -67380 -42580 -142680 -157649 -88081 -26985 -29759 -4262 -43237 1178 11493 17365 67065
16183 67065 56384 -12190 -45246 -121803 -110377 -125091 -78209 -46948 -19676 36870 25076 -2814
16171 -2814 8538 20537 -44491 -832 39795 37287 61194 39448 46425 87616 25220 32200
16159 32200 -1664 -74993 -13312 33775 -34728 -80913 -81190 -99325 -174567 -189978 -171323 -173004
16147 -173004 -216602 -194670 -122763 -61059 -48999 -139486 -111917 -65310 -65825 -42938 -48471 -14786
16135 -14786 65985 100263 35393 15580 -22137 -46231 -48117 -3903 -44686 -2143 72612 52228
16123 52228 -87640 -80627 -98528 -97160 -45829 16817 67464 -26606 -25347 47458 49253 7105
16111 7105 -15254 19360 65830 131393 135599 96663 85868 41464 -48637 -9360 -63762 -33357
16099 -33357 62830 83200 124679 118998 126811 144842 101145 -67274 -146309 -69252 -62669 -61405
16087 -61405 -143078 -203567 -165835 -92597 -63087 -90802 -80028 -15822 69902 -11835 -103490 -116846
16075 -116846 -116168 -90776 -89280 -40528 35694 31736 -33094 -52566 19033 54394 54725 40914 -53093
16062 -53093 -85415 -49697 28287 76150 89293 82240 78445 31097 -91047 -138093 -73113 -75288
16050 -75288 -7940 134698 158608 46038 -65463 -130388 -212985 -144898 -64496 -49224 -108102
16039 -108102 -121461 -147093 -71111 -70551 -108565 -76643 -76564 -75369 35391 97926 40465 -79001
16027 -79001 -105238 -109547 -63665 -32057 -79867 -35829 -58048 -53598 -4653 44379 25376 -60548
16015 -60548 -113501 -135017 -64685 -44674 -4941 47602 50354 8223 14630 -14375 -63393 29248
16003 29248 29239 -30106 -22327 -10802 -36743 -74925 -114557 -76380 -3323 24613 27786 -83328 -176966
15990 -176966 -170834 -104040 -15466 31707 80766 63071 58302 -22862 220 48594 61878 86577
15978 86577 95143 163493 144428 35103 -37765 -100590 -127914 -173874 -194489 -195425 -100627 -50756
15966 -50756 -111880 -180397 -189746 -115023 -40743 -26007 -49401 25020 -5962 -78687 -56466 16457
15954 16457 15679 27179 2748 -32504 14204 36381 85564 113498 107967 122920 68556 92706
15942 92706 35401 40763 4288 -31752 -38466 -4353 51941 119849 142636 74036 -5123 -85315
15930 -85315 -140891 -142954 -98338 -108071 -61504 -81031 -130798 -79896 -35614 -64541 -97812 -31472
15918 -31472 -51312 -93989 -43903 33424 47623 35761 61660 59933 60226 58455 -43894 -39682
15906 -39682 -44928 -39237 -71763 -77814 -76798 -18946 7891 26144 26929 119413 189405 105957 53557
15893 53557 97861 72561 -24254 17138 -15293 -115295 -96033 -68987 2735 78474 58424
15882 58424 70803 130799 60538 72217 99592 86067 99614 38625 -77732 -37456 -22109
15871 -22109 -57734 -49813 -115309 -101881 -1522 -38004 -63485 -62477 -37685 29075 66965 23531
15859 23531 18069 33786 84633 109937 84379 18167 20657 37092 70658 88725 144824 107886
15847 107886 47059 -33207 14741 -23505 -25937 8509 52988 70417 -28721 -67819 111793
15836 111793 164722 179413 125319 77549 40878 30484 -30021 -77780 -50850 -22889 -946
15825 -946 36413 95888 71288 27202 -13303 -36223 37041 69667 30760 63318 69934 62386
15813 62386 8228 11838 -17396 13602 40962 23548 -15776 -20869 -37683 -60832 -18514 -8540
15801 -8540 -1170 -123479 -169759 -46933 -137 -41131 -76503 -36941 -63169 -24392 -22420 12025
15789 12025 97699 153934 137592 42806 20059 41677 11598 4552 35192 44944 117099 91644
15777 91644 73029 56758 108282 155435 33352 -36491 14500 -590 -33490 50618 119954
15766 119954 103158 50661 4711 -12202 -45711 -44641 -35709 -112817 -82193 -45929 -30451 -41327
15754 -41327 -50001 -118785 -189650 -119854 -26748 95793 46767 4306 3599 -32517 19765 68275
15742 68275 124851 138938 91560 10948 -98891 -44320 10907 91684 93278 14885 47822 53260
15730 53260 27738 -41378 -94150 -80995 -45865 22197 17537 4341 35220 31781 -5836 -35703
15718 -35703 -19419 -35698 -89351 -147747 -136355 -23460 -30198 -37393 -118791 -141543 -122507 -73003
15706 -73003 -51292 -61820 -66665 -155579 -200815 -133702 -99214 -12757 42877 12275 75056 87282
15694 87282 10946 -8810 -23197 -116820 -86281 -116160 -156234 -126114 -44648 -69521 -60324 -52620
15682 -52620 -7133 27805 -6189 16919 42203 69527 66749 47109 55824 70289 102114 109592
15670 109592 75836 26615 41933 96570 40078 -70607 -91824 -47090 -44856 19165 109380
15659 109380 66908 -51249 -64826 -116548 -137462 -75015 -17895 -60913 -8732 13700 15524
15648 15524 41710 70946 36028 19995 -17557 -56709 -1600 18518 -21081 -113473 -120783 -155057
15636 -155057 -99543 -47932 -10878 50169 59567 27037 -10011 -4633 11013 -16932 35160 113914
15624 113914 126416 101020 37166 -17501 24355 -11044 -40927 5456 52932 43566 62051 82298
15612 82298 93287 94430 -1879 -74680 -69863 -61264 -99583 -97829 -40870 -33258 6918 -3219 -16947
15599 -16947 63519 36491 -33471 -27825 75648 78324 49786 26951 -26025 -21947 6117 4228
15587 4228 -65121 -81001 -46897 -11159 -25110 40937 117505 85094 10646 38031 41934 36125
15575 36125 -4075 -21114 -51865 -79161 -54447 -35240 3941 27892 48463 48082 46587 69296
15563 69296 79991 89002 150717 149783 54680 5795 -38045 -84726 -90485 -33405 -14128 -43369
15551 -43369 -52409 -13085 24325 83072 48227 -23660 5420 -21111 -42570 15051 13559 8327
15539 8327 58939 24860 -11801 -92513 -51787 -108732 -137617 -107202 -75608 -26454 23111 42849
15527 42849 -6274 -46887 -36359 55457 121309 62689 -40736 -56460 -47985 -44966 -46662 -11667
15515 -11667 -2634 27767 24891 -54182 -70843 -12564 55026 95171 87397 19276 -34121 18441
15503 18441 51511 36394 51199 71459 36206 37353 25312 31506 47209 58880 64864 109279
15491 109279 121493 -25394 -32261 7660 41496 5094 -34638 -60070 -40698 -45682 -78756 -59883
15479 -59883 -466 -10632 -37442 -20596 23523 45272 52337 115969 78936 -23088 -100540 -75116
15467 -75116 -89194 -102192 -117746 -141144 -63044 34327 31239 -76703 -111721 -90869 -39031 44082
15455 44082 87332 93098 54843 36714 -42302 -89511 -60261 -45840 -2952 8800 40371 13261
15443 13261 -112845 -60963 -10473 -15706 -42568 -30016 -21752 -106357 -167064 -120939 17182 17696
15431 17696 -6245 -10447 53200 85319 23658 -28769 -51886 -33717 -6375 3891 -19921 -99328
15419 -99328 -119108 -120443 -80224 -46645 19425 36795 -15054 -17244 48958 101483 86827 27061
15407 27061 -11916 -10547 76473 61321 37990 -8778 -40915 -30680 -8741 -27482 23662 52520
15395 52520 110474 123044 117093 146433 98843 42499 75799 44485 -33392 -18168 35668 28931
15383 28931 -11422 -53039 -74151 -59702 -27807 11490 43492 123865 115702 48781 96938 122894
15371 122894 134016 52382 34944 76116 7315 -12576 -24233 -30111 -83018 -66014 -17470 54795
15359 54795 115694 56265 28584 24998 -34528 -105786 -118456 -91873 -106338 -183134 -196031 -129475
15347 -129475 -5513 19537 -39598 -106328 -106554 -76600 -47986 -99564 -92271 -34884 -62971 -129793
15335 -129793 -122976 -93053 -60246 -695 -44027 -67475 -23669 14344 -30437 -168679 -166620 -144594
15323 -144594 -78566 11014 34036 -14941 -20037 -59902 -44059 -8875 18558 -71015 -80799 -35209
15311 -35209 37722 11899 40470 100465 144364 118685 146801 118643 51698 -32987 -45321 -33399
15299 -33399 15261 19473 -37489 -61349 -108342 -31167 -35542 -30598 -9207 42860 59831 23862
15287 23862 -71880 -78113 -69039 -62826 548 43531 76553 76592 72045 -19257 -1129 -50942 -28144
15274 -28144 -160397 -139798 -72306 -109279 -92567 -74226 -23388 -7953 -55514 -75050 -89294
15263 -89294 -124757 -13586 42976 24608 93964 77499 -29609 -99557 -65266 -134349 -144315
15252 -144315 -158489 -57981 57571 39180 5766 3112 5241 60130 62576 12974 -56880 -51590
15240 -51590 -48672 -107116 -95255 -19561 21023 14215 52204 127669 111734 69685 51183 -43884
15228 -43884 -42059 -78820 -87123 -73346 -22784 -14667 -100415 -152673 -137636 -150125 -181098 -91398
15216 -91398 -74776 6818 15613 23533 -3909 -38144 8497 28365 60761 119170 96269 70170
15204 70170 77024 19925 -19660 -10773 -12449 -32914 -14815 34833 31325 18001 -55654 -136273
15192 -136273 -186516 -117615 -118873 -146252 -58325 33648 69775 26825 -8722 1827 -17960 -16188
15180 -16188 -13300 -92530 -56780 -41685 -56397 -122470 -62312 -24049 39466 14008 -776 17395
15168 17395 52380 66166 35213 42257 40641 -18488 -84127 -2579 8748 -61442 -12860 -21223
15156 -21223 -43135 -4499 5002 39061 -40469 -68540 -98236 -136381 -128388 2008 -27145 -125011
15144 -125011 -72612 7184 -100967 -117535 -59784 57511 118309 53313 58704 19031 22139
15133 22139 15212 -15756 -35273 -32100 -80421 -68207 -142124 -53253 45251 85832 61378 -96548
15121 -96548 -219686 -192315 -101592 -33378 35707 86690 56921 31619 7213 11251 65974 89305
15109 89305 -24124 -79851 -50010 -37726 -74013 -23650 1098 73109 16911 -5965 -23048
15098 -23048 -80323 -91341 -70713 -40078 -24950 -31028 -47272 -26945 50525 95571 128973 101290
15086 101290 94018 191889 208494 133480 107761 198266 211696 118818 68733 36204 74110 2756
15074 2756 -77340 -63958 -33451 -15761 -54694 -34129 -20957 -310 82414 49442 -4892 43648
15062 43648 14136 -100733 -61252 -47480 -100615 -87627 -78460 -58331 -85563 -142503 -122048 -39216
15050 -39216 62003 98375 37106 -47805 -60437 -24098 -6075 -60405 -141582 -150437 -31154
15039 -31154 56587 61686 -18141 -26958 -48480 -39464 -4324 39097 -6282 -9991 -67955 59728
15027 59728 129815 73159 17027 41610 43550 63927 72269 56595 38546 -101 -27451 -144782
15015 -144782 -97873 7110 46648 -9001 -23183 -24715 -29057 -13256 -2435 -1043 40895 -13606
15003 -13606 -31799 10211 -15418 -73077 -96460 -98935 -67338 -113647 -92331 -60769 -64831 -70751
14991 -70751 -87829 -127548 -140068 -116726 -42550 -17609 -3711 -45001 -12863 72598 69124 37184
14979 37184 7 -23614 35285 98614 125439 14903 -100622 -30731 66763 22546 -6553
14968 -6553 -4615 39983 36125 -11974 -33178 -24101 -57247 -93152 -12758 26737 48468 30402
14956 30402 -49902 -30325 -11201 33669 78389 61395 -2352 -103803 -148227 -95080 -250
14945 -250 6688 -9631 -37922 -46470 19600 -27097 -5705 -18268 -39308 -71050 -19267 38521
14933 38521 48865 70763 5750 -522 40966 -10509 -35889 21759 70646 75317 81867 31457
14921 31457 -30417 -31997 -59080 -74149 -92090 -138743 -178808 -161577 -106811 -36833 31487 97729
14909 97729 33077 -4756 -53955 -95345 -8632 32570 -57204 -34152 -17870 -29592 18098 98148
14897 98148 135304 55596 -23512 -51657 -25986 19992 1025 61789 114678 135122 50431 -42384
14885 -42384 -21536 -5259 45096 88680 73561 19324 -25448 -3860 -23665 -35908 -57161 -87480
14873 -87480 -108315 -148703 -164201 -161359 -122654 -4264 1101 -15462 -31395 -97363 -109523 -125615
14861 -125615 -144566 -55442 -48350 -77167 -17814 28320 -14858 67570 3679 -56518 -9799 -55976
14849 -55976 -61512 4564 -58018 -56234 1190 -102897 -165550 -129692 -60927 -22778 16661 41091
14837 41091 45221 33468 138514 187953 139692 105398 78786 23144 36580 -1392 15178 103471
14825 103471 66963 -37900 -23952 41004 120950 148184 149695 109640 95264 115832 73395
14814 73395 34515 115461 108269 57035 69886 122556 91374 19067 5105 9732 73783 168275
14802 168275 192342 118616 105096 75661 42041 69596 859 -70439 -89424 -100051 -81641
14791 -81641 -120047 -137604 -114500 -90318 33910 126256 142779 94424 62910 79179 91846
14780 91846 73921 39393 8707 34811 25143 -36649 -37996 -28452 -28048 2261 16035 62881 88071
14767 88071 67696 29866 48814 136906 166563 149651 143838 122817 114441 97911 168629 127857
14755 127857 1990 -25181 30981 46169 -2037 -83308 -65640 -66272 -11300 50104 55097 92494
14743 92494 127528 125092 147286 131228 96429 130759 150300 220157 249717 311507 446505 630395
14731 630395 706702 779202 795931 838534 884989 854111 800045 699049 583670 456964 302971
14720 302971 197459 164480 168915 125119 56783 -59941 -99413 -42341 -63004 -9421 -33445
14709 -33445 -87610 -88937 2815 42353 -22223 -64974 -49495 4896 -36390 -73899 -134269 -173841
14697 -173841 -153925 -117340 -79674 -130759 -196732 -138136 -46403 10314 44448 31285 20010
14686 20010 -6243 4422 35550 17681 26417 47761 5921 -35764 -69059 -80314 -53063 -7889
14674 -7889 -11786 -76554 -10366 67695 -2972 -48585 -136840 -190960 -173311 -125049 -56704 13036
14662 13036 4525 -85639 -88471 -23613 52859 74391 83951 62932 49599 2418 -27575 -41187
14650 -41187 12208 15797 18248 18206 23635 32502 -7741 123291 130054 47506 113959 167958 80643
14637 80643 -90522 -174235 -132715 -59834 -69100 -157207 -93160 -4788 16940 -12878 7993 -19562
14625 -19562 -48149 -35625 -54789 -54081 -37356 -25878 11864 -74869 -130724 -113071 -107932 -78038
14613 -78038 -8871 -27336 -94094 -60027 -33296 -10128 15845 45139 33802 -31727 -122722 -76550
14601 -76550 -46204 -49984 -6848 -55181 -55576 -73600 -70802 -11180 58617 30021 6636 75548
14589 75548 52329 18742 8128 -82604 -81926 2166 95201 212236 186723 128678 134615 107944
14577 107944 -10268 -90101 -96318 -18762 -44353 -59574 -9251 55501 35800 -13109 -97486
14566 -97486 -212649 -287080 -223991 -239958 -195108 -123786 -85593 -16157 24216 -26251 -88142
14555 -88142 -87505 17702 31300 33443 32194 72428 71302 30577 43534 44248 15010 32595 -25505
14542 -25505 10490 38847 74114 84035 71903 -43417 -177213 -245589 -216134 -97248 -90840
14531 -90840 -106818 -73087 -86159 -95398 -30646 785 12535 47551 77613 45540 131244 161853
14519 161853 116153 -10065 -97279 -105030 -36752 -34129 -60062 -79421 -44749 876 -20984 -64383
14507 -64383 -42583 47034 61698 6302 -62886 -97162 -2594 13641 38535 54600 -9029 -72243
14495 -72243 -59491 -37853 -88516 -86817 -72218 -15569 4128 65601 37407 -24415 -7067 32209
14483 32209 -27013 -50417 -53343 41231 64397 41524 125986 103979 47858 -17066 -52857 -47487
14471 -47487 57957 113352 84333 57800 19386 -86025 -109613 -15451 27171 33366 86593
14460 86593 40848 30095 45297 38883 37852 24380 43257 76218 32543 57640 41264 -10385
14448 -10385 -9195 -3383 -75314 -112621 -109735 -128516 -90887 -27805 25748 -19326 -63822 1627
14436 1627 -12252 3957 34876 136024 204568 114124 50653 -14221 8462 -7736 -55600 -58656
14424 -58656 -57601 -42592 14214 3632 94623 41323 2783 -16466 6079 5755 47133 16436
14412 16436 -14169 -25432 -76533 -80169 -9170 -45539 -63893 -75726 -35823 6129 -16505 6086
14400 6086 33293 17892 47037 37199 34334 86527 105763 110743 61561 10584 -30217 40453
14388 40453 34099 -47507 -89143 -131251 -118145 -17932 -34479 -38739 4595 -1128 18808 32458
14376 32458 -11100 -64849 -158464 -168396 -175171 -259148 -238862 -259471 -244406 -213905 -164565 -133203
14364 -133203 -119661 -95138 -74051 -53360 8354 -28444 -28312 -11074 -67754 -51453 52436 26263
14352 26263 11058 66545 76619 117680 113178 28105 -78415 -59559 1266 67749 44214 7596
14340 7596 -13433 -37462 -55949 -648 44660 -43485 -84637 -18218 -13875 1932 -85355 -103996
14328 -103996 -65812 -10170 -15895 -14901 -37303 8168 -17122 -55189 -58727 -155869 -185825 -119066
14316 -119066 -36721 29102 55938 48095 54633 -38361 -106243 -86474 -55094 -26797 22172 33043
14304 33043 137315 269918 248959 190729 102958 47926 105595 145478 89029 -16124 90306
14293 90306 116949 91580 73920 73540 66630 40404 90673 179664 192165 167465 161778 144620
14281 144620 163900 206055 279418 236340 155714 87080 111018 173542 143971 113621 110846 77009
14269 77009 119572 168288 64578 35070 35079 -11737 -80660 -40224 71850 33039 13085 -11304
14257 -11304 -47212 3176 40127 36253 71059 65225 27312 41602 -10523 -95776 -83411 -68266
14245 -68266 -62071 -14706 -41622 3095 22252 41013 68607 54992 53516 70249 32342 -35383
14233 -35383 47228 137539 131881 108294 72393 63197 48622 28106 31321 -2199 12948 -23856
14221 -23856 41127 64679 33484 -16981 -55198 37114 115076 136846 111315 86896 22010 -57142
14209 -57142 -70849 -33061 40446 30205 -41088 -87763 -44104 41187 -50600 -93000 -96817 -39589
14197 -39589 -55454 -55625 7199 108954 81491 -18449 -83604 -44647 44661 53737 29551 -18241
14185 -18241 -48654 -88737 -75346 -64599 -25022 -38470 -5828 -45208 -68416 33140 -27442
14174 -27442 -58604 -24773 -24650 -121655 -155771 -184741 -253692 -166778 -75270 -47021 -102008 -169775
14162 -169775 -147992 -52293 -28058 -36359 -83968 -150239 -52788 -10221 -44391 -53321 -37643 -102470
14150 -102470 -164690 -142370 -98915 -94750 -64965 21396 21936 46571 125343 111109 90990 74761
14138 74761 17513 8580 -24604 30767 23610 -11600 -72304 -13162 -2438 -29631 -44804 -44952
14126 -44952 -30326 -43920 -49777 -45795 -56177 28912 106632 169928 161253 -14400 -19206 47739
14114 47739 41119 806 -49638 -54333 -12703 -37036 -4169 9356 -780 -74890 -121200 -154919
14102 -154919 -179680 -97887 -17279 24658 17656 58114 57878 78085 19043 52315 56686 3077
14090 3077 -6943 -66516 -16845 -7400 -98017 -79220 -52476 -69108 -22110 -27674 48435 120310
14078 120310 74294 -48302 -109338 -56563 -34159 -40173 -79484 33445 7117 -20723 -53883
14067 -53883 -98463 -105236 -177887 -213993 -227673 -167017 -112240 -48217 -35163 -80098 -74754 -17406
14055 -17406 -37791 -65062 -44011 -68362 -36786 37284 114369 105391 10031 -12769 -35396 -8671
14043 -8671 -3595 24868 25244 59016 -6592 -39264 -10988 -45904 -96886 -27032 20659 20560 -19556
14030 -19556 -70806 -12310 29600 -631 44675 -11615 25762 2137 23203 149026 152635 131753
14018 131753 107577 108364 -22199 3409 63804 72221 111266 74816 49599 69122 66367 78932
14006 78932 49019 22255 5133 -7103 -73881 -58795 -40522 -107377 -109436 17414 89378 123272
13994 123272 133996 171006 173600 197334 109691 2546 20667 36744 132791 165554 195532
13983 195532 171164 79443 4259 -37776 -19634 46829 28876 95315 155771 79120 47865
13972 47865 -3262 -49708 -92228 -129105 -128700 -89072 -104611 -81737 -83560 -84710 -79584 -65946 -94160
13959 -94160 -52205 -58269 -73879 -39194 29664 27957 -36491 -66546 -8590 90889 69169 -23150
13947 -23150 -66941 -42814 -2179 -6609 -40399 -21098 -22216 -5330 28918 99117 59803 -21482
13935 -21482 -24727 41927 -12098 -75601 -95383 -27722 4985 -12847 -15277 -39041 -7824 5663
13923 5663 101 -1500 -48252 10588 11311 -44135 -114933 -142040 -94902 19351 85742 57360
13911 57360 72852 69359 43501 31010 3888 9165 49022 35370 37102 40393 38286 37345 103788
13898 103788 163679 171052 97388 37479 23681 -23487 -33692 -43814 -29546 -36712 -88649 -73314
13886 -73314 8426 11950 -8307 -18901 -55768 -46717 -77590 -13942 -50275 -65830 -9701 84347
13874 84347 70082 139232 187644 126682 100016 133258 127442 73983 -31362 -96292 -104937 -18214
13862 -18214 -30301 -15548 52070 132465 51344 -22500 -65762 -67577 -57097 -117371 -170277 -178572
13850 -178572 -144880 -121327 -115217 -23060 8676 78651 12106 -63092 -15444 33785 -28345 -29768
13838 -29768 17632 61715 112877 93083 21636 3954 -41071 -44284 15158 95288 95615 153502
13826 153502 116885 45082 29364 10423 25081 -31125 -32314 -107203 -199433 -180400 -97580 -70080
13814 -70080 -27854 64527 146011 71780 -23261 -58435 -56517 -83013 -50522 -28601 -92242 -100150
13802 -100150 -96560 -42514 -6101 -32802 -51281 -17939 -73523 -108087 -95363 -124281 -41329 -41867
13790 -41867 -70193 14737 36957 -28610 -11258 32469 -57331 -43532 -40425 -27055 -15126 50261
13778 50261 46885 81918 47319 43085 -19080 -3367 -90827 -130820 -92924 -39452 -43487 -51376
13766 -51376 -59293 13518 -21505 -27037 -47203 -119725 -132344 -63460 -55338 -44564 6671 -2041
13754 -2041 -96689 -66583 63755 95777 52863 15302 2135 -25855 -21136 -59697 -73467 5218
13742 5218 37995 25496 -41252 -78618 -119458 -125586 -145785 -175345 -109943 -38401 24354 86972
13730 86972 13842 55544 83263 67473 3009 -65317 -58004 -40891 -44644 -9622 31499 55736
13718 55736 19948 -86939 -103188 10406 51431 23997 -7067 -44072 -92503 -194716 -181389
13707 -181389 -115499 -104145 -94854 -24403 1835 -4457 -78702 -133681 -133672 -73753 -19424 4559 10199
13694 10199 -18497 -23627 24280 20487 -11668 2493 21518 -71421 -77358 6965 54462 67034
13682 67034 26236 -85018 -102912 -120220 -92636 -73374 -86155 -112680 11092 -8045 -49481
13671 -49481 -16162 2559 -39545 -130295 -189488 -156526 -115020 -61618 -27110 -55100 -76287 -39886
13659 -39886 -72007 -74209 -45809 -75136 -57966 -69097 -82808 -26476 59951 107477 22686 13585
13647 13585 -34204 -53468 21458 97140 97360 75371 88879 46017 -2213 63869 90409 77295
13635 77295 66231 74122 35959 -10385 -26552 -86000 -90829 -35555 30431 46028 59488 130002
13623 130002 140613 171428 100442 2709 -113563 -169245 -128675 -73053 -61642 2124 13169
13612 13169 -47562 -84884 -35219 -68681 -80441 25176 133549 192995 99435 57782 39317
13601 39317 53057 49626 104726 65285 -3655 -110105 -80403 -70584 -26531 -1196 29859 -27011
13589 -27011 -25802 103305 87593 -5107 -42220 -28669 -27166 7851 48520 64478 69326 71114
13577 71114 47251 -38585 -104480 -91030 -54031 -59141 -61164 -71968 -125018 -164373 -159454 -111953
13565 -111953 16734 39375 -29015 9647 22004 65944 -9731 -39354 3283 -8653 -53043
13554 -53043 -73308 -87458 -86513 -26997 -59190 -110336 -50572 -52765 -110855 -113005 -129687 -78269
13542 -78269 -61665 -33620 16652 42102 46954 34990 48812 8739 47980 19762 -33288 -111116
13530 -111116 -98375 -71802 -66930 -35233 9813 56919 42362 35668 31538 30322 48322 -26987
13518 -26987 -137318 -97363 -127890 -128957 -80647 -122143 -114948 -81217 -85462 2128 26526 39941
13506 39941 -8933 -49938 -20046 76352 114526 104181 98340 -14134 -91784 -94789 -90670 -55025
13494 -55025 -39318 -61741 1170 42951 79030 20977 28174 58859 -47039 -118709 -149789 -155681
13482 -155681 -121749 -76750 -27467 -27849 -6255 30354 -10770 -70086 -26928 89003 76638 66387
13470 66387 53452 25528 2128 19158 76954 53850 15804 -28841 -41531 20430 -28885 -52874
13458 -52874 -87621 -44631 38509 -23846 -56247 -33557 54138 -9958 -88415 -96470 -17454 -13869
13446 -13869 -43985 -54743 -21752 -15349 59239 66625 103049 -2443 -95048 -107126 -57598 -80216
13434 -80216 -100931 -49339 -7012 -26208 -31898 -43531 -112403 -38429 35771 -27544 -38607 -18147
13422 -18147 -55127 -55479 -56172 -116932 -145198 -154955 -80989 -32125 -41125 -26110 13375 82150 84366
13409 84366 105350 49539 49402 -18065 -28578 -67474 -13029 -34753 -15320 -63961 -109290 -144903
13397 -144903 -155333 -149839 -143911 -72768 62997 102150 77583 48206 19648 88985 54518 52407
13385 52407 89896 46383 -9751 44919 82936 71603 31772 4577 -15926 -102617 -134806 -130297
13373 -130297 -25872 100358 35867 -64847 -120814 -87738 -42651 -71231 -108018 -116842 -60054
13362 -60054 -18970 -125328 -102441 9151 9171 -55308 -58940 11578 7959 -26730 -41871 10923
13350 10923 -3105 -7367 -30302 -21878 -74518 -90681 -95744 -84234 -67427 45400 69561 40201
13338 40201 14707 -35959 5787 -9878 -2218 2334 64516 33434 2494 1647 107321 53934
13326 53934 -11723 -44911 -10538 37332 36283 87581 80785 36161 61561 33535 64380 1899
13314 1899 -91238 -85765 -76101 18684 84946 65707 -71316 -27443 11750 -82706 -124657 -75886
13302 -75886 -60748 -31002 49146 47701 19726 -119950 -228291 -286077 -262198 -138600 -53788
13291 -53788 -13694 -29078 -53353 -67183 -121711 -123566 -109447 -40078 43237 16923 16022 8826
13279 8826 4205 -16022 -121 38272 58153 25639 -43183 -72336 -78261 -70015 -52526 -21164
13267 -21164 19709 36462 -38872 -83902 -86689 5251 -30581 81711 73286 78292 132327 161107
13255 161107 30294 -21287 56317 59041 -69839 -111180 -22839 7431 67600 37369 -35751
13244 -35751 -102482 -90914 -19898 -1566 -9455 -48793 67606 180383 180490 105010 -20803 -46748
13232 -46748 36242 45972 41109 17398 -33597 -81164 -23012 -3067 19355 -9124 -57448 -40318
13220 -40318 -106021 -114289 -46632 -69708 -99369 -84308 -68760 -7253 47699 62699 44272 -10329
13208 -10329 -93082 -82093 29236 62582 17410 43440 102852 137788 71195 68401 90414 54759
13196 54759 51488 83658 150353 178253 194377 117899 38632 1869 -76399 -61661 -38535 -40980
13184 -40980 -3382 -62725 -176358 -112804 -36388 34972 65035 77091 83306 122083 84004 26548
13172 26548 4235 -13816 -7483 2435 -32729 -24728 -53756 -26011 -31789 -75284 -105758 -104807 -117472
13159 -117472 -46019 -65793 -74078 -33537 4182 52930 52670 133802 79682 50438 -1627 -21535
13147 -21535 -48131 -85125 -48533 43537 23314 39495 -12919 -20331 12132 -3230 -49849 -28425
13135 -28425 -37377 17729 44080 70404 49891 63914 26381 9163 9413 -6807 79306 49073
13123 49073 -38984 -28821 5859 19190 84727 68192 4527 68254 156049 140938 22163
13112 22163 -35088 -104160 -30152 55480 58112 22823 43363 21171 -81391 -46896 -61258 21259
13100 21259 89438 89004 -8355 -77298 -119604 -125375 -86901 -123125 -105145 -45279 -15838 17161
13088 17161 7100 -70856 -110652 -113233 775 88914 -22737 -126283 -169909 -90152 -87313
13077 -87313 -38915 -25952 -40277 -64913 -32427 -54616 -105797 -50242 -56789 -149860 -110643 -30237
13065 -30237 -582 11526 -22595 -46125 -13626 -21987 -17181 -92821 -132998 -139394 -89947 -72294
13053 -72294 -99235 -68467 2642 -32035 18732 27564 118814 114266 -19854 15539 -46015 -102220
13041 -102220 -79188 32340 13541 -85896 -87403 -543 40298 25858 16375 -1433 -87136 -114026
13029 -114026 -159374 -171925 -135946 -80363 34498 7546 -109467 -148892 -46023 -21408 -27850
13018 -27850 1701 -1463 10389 96777 102508 73246 6272 -9418 25707 106218 140470 83911
13006 83911 14124 -8907 76631 27713 -21258 -10876 -61412 -72979 -87792 -59876 -56878 -35863
12994 -35863 32613 -21961 -20761 24416 76595 7842 7089 42665 55520 80690 90030 75891
12982 75891 -10919 -23416 36655 55853 36646 -62307 -57031 63083 73523 4038 -111902
12971 -111902 -159584 -89279 -34474 21851 24876 9905 22374 -11464 -71418 -19611 32717 18437
12959 18437 37350 123733 68652 35062 31397 68438 -19364 52448 69663 77592 110308 98847
12947 98847 72651 -22348 -17049 -13509 -46906 18506 34240 6256 -9302 -284 13193 4615
12935 4615 34082 109010 187725 116910 22479 -20797 -54286 -16313 11915 96322 110446 122484
12923 122484 130893 148841 27137 -96786 -57702 -44516 -18643 38940 4760 15318 19720
12912 19720 -47052 -19701 10901 -44076 -16728 -8450 -61597 6109 61905 -3867 -41247 -56955
12900 -56955 -91895 -89484 -49175 29859 -35381 -22033 35896 -17789 -20796 719 -22987 -16424
12888 -16424 13136 -8696 -25632 -46712 -19769 -29225 53693 50424 10828 7109 9550 37894
12876 37894 35505 3261 -16444 -38879 -39506 -70316 -76921 -141569 -114258 -140442 -172840 -166345 -117340
12863 -117340 -157263 -107294 29904 92721 68940 53366 76652 -7793 -49172 44070 129848
12852 129848 94620 47683 1207 46529 47171 -26839 -100480 -182726 -169773 -94423 -108154 -66095
12840 -66095 12489 -1841 -28507 -89197 -38921 25248 45998 67016 23087 -12632 10527 26471
12828 26471 63135 12356 -15285 -49470 -15457 57317 63329 50938 47447 2268 58075 146444
12816 146444 73847 98376 79833 15953 -37487 -33272 -2351 -13079 -38778 -110278 -115163 -78187
12804 -78187 16601 29966 62859 69902 -20532 -22955 37399 112142 123103 18242 -85480 -70956
12792 -70956 50894 10786 -13276 76645 146787 100452 108623 141606 100928 -1035 -27629
12781 -27629 7605 -63032 -46551 5110 50201 302 470 90529 202633 209561 264595 195543
12769 195543 174141 77241 48736 20415 -48867 -42934 32327 107292 119106 73835 2035 -14581
12757 -14581 53383 85727 37892 12049 37508 66927 -8261 -42603 -5963 14367 105780 100681
12745 100681 50942 156 -25560 40649 85194 110952 105612 79570 35813 -27655 -58752 -59153
12733 -59153 -20739 20039 2384 19668 1472 60812 134104 66862 82694 74268 131264 118183
12721 118183 53960 56671 114843 171911 164502 98926 -11105 -45197 -2965 80970 98737 124655
12709 124655 100863 27381 13709 83270 89455 41919 75919 130141 180309 196220 108072 53564
12697 53564 -10349 -39931 -65266 -74440 -60633 -12093 31450 74163 122608 127830 84140 -12307
12685 -12307 -29063 67443 66811 77138 123313 106522 105377 93202 -45808 -120870 -81769 -92292
12673 -92292 -56604 30649 61888 107172 96949 25393 21099 35590 -11446 -59038 -86824 -41076
12661 -41076 -61138 21697 78977 31700 -54946 -16907 20418 24112 74005 41469 -69356 -93584
12649 -93584 5948 9495 130809 137510 137928 77672 96648 28429 -20085 70425 44925 18796
12637 18796 -28665 -41062 -39871 -46929 -56217 -123635 -149733 -111695 -23182 -26869 -10204 44345
12625 44345 -2101 -53489 -15945 12811 -18 -20517 -16668 -1826 -6695 47245 124921 171826
12613 171826 139577 64382 7239 -65495 -64380 -128779 -80101 -7887 -9249 -31844 974 -20649
12601 -20649 -55984 -101830 -54439 -56536 -20529 -14213 -105329 -92570 19734 51493 -611 62265
12589 62265 36664 18953 -11921 39319 -49112 -86898 -52739 -7258 88581 103739 118539 127263
12577 127263 162772 191499 138738 133144 124874 145291 132661 57820 39866 101321 130063 116024
12565 116024 175103 150640 112378 105161 133719 57574 44484 48575 -1822 82704 132798 104842
12553 104842 45723 93300 12560 -26580 5542 -28583 -113869 -102111 -23144 32838 57255
12542 57255 66171 132720 146799 66151 -3754 11621 32099 62017 12094 36670 80288 56230
12530 56230 -29285 16760 114467 98836 53923 141547 128931 34084 -16145 23915 104084 105101
12518 105101 56163 110968 194777 158743 101628 194259 240724 290737 263997 228061 77056
12507 77056 10167 49745 28165 69611 69056 79632 67119 121129 158481 34415 -29271 -56998
12495 -56998 -4233 77476 132980 116263 9618 -45245 -60206 1901 70747 132085 156291
12484 156291 151298 120122 94795 36381 22248 -9276 -30140 45150 107212 109946 7660 66288
12472 66288 72406 95232 -3390 -53979 34496 104090 108793 69513 83131 152535 93557 103729
12460 103729 84689 25988 -15506 48340 102001 145295 131561 113021 74410 52778 67138
12449 67138 69891 78818 98021 51504 72561 87840 42528 93210 138595 211980 187208 107586
12437 107586 13776 40849 147136 63736 -11112 94542 203941 126155 113919 115715 23132
12426 23132 -9673 -25532 -43817 -34106 77370 206146 280896 150791 83290 11012 27205
12415 27205 74769 126747 155302 187864 92743 72537 75393 135475 178131 147661 83938 66900
12403 66900 121365 144028 125851 64379 88640 100993 136229 117751 143042 129764 99573 45918
12391 45918 108951 133133 117760 100466 38691 4934 46484 69084 41256 73870 119227 118024
12379 118024 110215 128230 152428 168051 157023 89318 26998 89510 38953 13172 41538 68057
12367 68057 109442 152962 164760 158620 88366 121088 214693 265687 220275 150683 120994 110661
12355 110661 78788 43369 63375 183505 164368 137925 147942 150486 199413 194584 190343 241433
12343 241433 300715 288532 255528 160250 82577 65092 98845 100154 50934 9427 79542 159430
12331 159430 183951 162138 119167 135273 138444 187512 232868 236954 113058 129869 178935 234922
12319 234922 206631 231826 245597 229865 159725 24767 14734 151146 201512 183452 175442
12308 175442 174034 251575 277319 286586 326506 387439 377331 377841 437540 446846 435541 457351
12296 457351 494009 503158 436006 432900 465002 435162 479870 536663 490843 656164 807088
12285 807088 864904 943691 958112 1015424 1165187 1335809 1590908 1938126 2407701 2994370
12275 2994370 3848094 5211261 7333352 11286204 19347807 34889994 53669377 57150463
12267 57150463 46268551 31470582 20228531 13666130 9836832 7365248 5664427 4472994
12259 4472994 3654706 3031791 2534256 2198814 1957507 1704264 1502570 1396974 1252935
12250 1252935 1145088 957823 987964 974869 913890 816780 805973 799636 762294 732886 680922
12239 680922 593354 541909 463571 452579 488711 521860 607011 561241 524223 549457 570049
12228 570049 649471 602971 545596 526780 508659 557391 520030 469665 577950 628207 556305
12217 556305 499708 472232 511612 568631 545336 529232 554762 565953 512514 500710 519308
12206 519308 562906 512767 509923 529693 489296 430774 503325 553023 538470 561624 628198 598111
12194 598111 530426 492865 510539 508561 508770 575127 562382 576650 605238 700503 768196 766977
12182 766977 732571 631515 553955 532909 590318 623953 531104 489124 596007 649191 658631
12171 658631 592277 616447 698468 700986 616858 657290 674681 683077 744742 647795 587628 650985
12159 650985 718428 734660 735513 658667 717504 738733 874473 938049 837149 738474 687725
12148 687725 661215 709859 730338 767924 771079 777812 717430 773340 930897 936274 901872 876249
12136 876249 842985 822682 759189 756103 742025 794921 845009 926928 976573 985609 977601 922323
12124 922323 839900 848525 815021 856848 990711 1015712 955875 1022672 1088287 1124645 1169184
12113 1169184 1187971 1147697 1192210 1122568 1090331 1085847 1059852 1036177 1067060 1068995 1026743 1013332
12101 1013332 1088829 1167774 1162235 1215858 1299478 1335937 1312051 1310472 1322694 1324048 1323491 1341879
12089 1341879 1383705 1436753 1455522 1530820 1528843 1512419 1504532 1488749 1583168 1574494 1569273 1573485
12077 1573485 1646842 1638261 1621667 1568893 1586384 1625996 1672867 1694751 1711206 1802465 1835883
12066 1835883 1816271 1834345 1824209 1806776 1823706 1859278 1890245 1944084 1982637 2057738 2063151
12055 2063151 2068764 2114061 2180814 2212798 2246394 2283044 2239873 2115655 2138421 2332393 2427587
12044 2427587 2458548 2425616 2349535 2369592 2414475 2490671 2621896 2819061 2935782 3015793 3081989
12033 3081989 3125583 3257216 3317938 3311539 3275135 3332864 3352088 3382988 3498503 3671802 3742605
12022 3742605 3801698 3815714 3779747 3771125 3874220 4028830 4093664 4111535 4189015 4330610 4504816
12011 4504816 4647373 4672800 4718474 4780612 4773887 4915702 5086053 5243820 5366221 5526263
12001 5526263 5673719 5730624 5885401 5975044 6116752 6261410 6300221 6445831 6671198 6813894
11991 6813894 6894220 7024529 7165912 7338360 7551738 7752224 8040841 8239218 8413277 8526178
11981 8526178 8678195 8872360 9065053 9338013 9628716 9875441 10120477 10362748 10661493
11972 10661493 10892126 11148439 11372319 11643246 11879775 12145466 12550384 12877107 13186429
11963 13186429 13475828 13836203 14213338 14449863 14795510 15159654 15490375 15759734 16102399
11954 16102399 16501694 16828856 17202802 17503377 17838182 18151071 18456686 18836791 19181970
11945 19181970 19463828 19731923 20009255 20311629 20515323 20690534 20877241 21139485 21321765
11936 21321765 21429173 21493845 21555252 21583591 21653032 21685287 21712303 21694894 21692174 21604307 21480493
11925 21480493 21266459 21110449 21022024 20859428 20686465 20456235 20178499 19875209 19595653
11916 19595653 19290235 18972846 18743774 18499288 18239199 17889524 17549012 17213347 16910800
11907 16910800 16533945 16189819 15857372 15624442 15268066 14825456 14487166 14266427 13924258
11898 13924258 13588901 13305053 13037369 12792556 12538050 12246985 11898005 11568493 11348937
11889 11348937 11163740 10869641 10590934 10317034 10114786 9862910 9574163 9407566 9191845
11880 9191845 8933887 8843794 8665666 8435873 8247121 8073899 7892861 7799454 7520963 7266648
11870 7266648 7143242 6975085 6885863 6742770 6534156 6394319 6324786 6204313 6105217 6008235
11860 6008235 5946671 5851324 5710541 5548086 5343615 5193413 5155293 5113239 5091598 4967239
11850 4967239 4890833 4841802 4740975 4620400 4557538 4486963 4329048 4265215 4174112 4008773
11840 4008773 3936970 3909631 3795575 3727050 3725620 3716400 3670651 3562689 3502442 3425146 3331134
11829 3331134 3271845 3240094 3275705 3251660 3219561 3153734 3067835 2987496 2945037 2895936 2752739
11818 2752739 2683414 2716175 2693921 2633915 2626910 2610898 2548839 2478507 2458593 2409331 2486659
11807 2486659 2420009 2411648 2478985 2517163 2533596 2500375 2379423 2215186 2031100 2024740 2103864
11796 2103864 2076448 2028831 1960087 1985293 2030178 2099375 2133779 2094715 2032855 1952772 1883020
11785 1883020 1779290 1684409 1748120 1853848 1863295 1815463 1749200 1643544 1616983 1623193 1588620
11774 1588620 1497287 1386552 1455858 1601112 1622757 1636674 1597157 1483507 1427687 1401508 1403048
11763 1403048 1437818 1506827 1474432 1405492 1351399 1312150 1348177 1381744 1336120 1288531 1144051
11752 1144051 1048502 1084782 1075135 1042587 1126806 1126724 1087627 1101417 1147119 1152832 1151514 1120257
11740 1120257 1137688 1131449 1036062 1044682 1061756 1023361 1030194 1080583 1053310 893496 885795 950680
11728 950680 975875 1007126 1016337 998703 882388 841774 846365 760453 742187 749855 746618 824381
11716 824381 791852 761794 855492 942649 925035 866757 853859 823117 753880 715145 707963 706399
11704 706399 688383 655802 670069 715961 713466 727583 737714 752801 741870 723351 729399 782946
11692 782946 851720 789345 698837 658795 743646 698202 664554 710894 727992 734099 669719 649731
11680 649731 655789 591291 600099 556368 572358 631505 647512 545884 454413 462007 495427 523459
11668 523459 548470 536895 555205 473505 441615 504049 537687 531819 565716 549191 523718 530434
11656 530434 557421 560303 517396 521960 489399 447142 420371 344654 322186 332942 410511 464284
11644 464284 469968 366172 301086 312892 335061 442711 475196 420539 384430 371162 424572
11633 424572 413947 439747 542761 570959 467800 401141 433002 404015 343298 381410 374713
11622 374713 339867 310648 336815 297653 314299 343168 364481 357222 312722 334861 340997 393195
11610 393195 500135 499488 444474 414006 426299 387312 341762 361656 371599 398520 411741 422924
11598 422924 451370 363936 358402 382610 408012 363124 343009 354370 380891 425498 407328 469338
11586 469338 429595 324545 334807 401895 375957 382495 350880 329635 229581 233796 214455
11575 214455 210782 221083 210606 220865 253896 236401 224712 316584 357225 314513 280581 250760
11563 250760 262727 242828 228960 145464 78703 98487 137527 242691 276503 273627 319419
11552 319419 274606 260525 370263 411670 463792 376605 171511 169339 230860 165346 155190
11541 155190 263295 308946 327555 307673 263309 193415 150622 159828 188190 211672 176012
11530 176012 173316 158792 140930 155504 116476 70627 79982 118543 128038 150034 149652 132313
11518 132313 106839 170602 213781 241687 357140 397501 335587 328287 343429 341737 376258 342605
11506 342605 292409 263111 230030 130166 120352 202089 245962 257792 248019 291564 326795 240080
11494 240080 160803 146429 162431 116764 79624 154504 193933 251339 262825 233788 235815 244134
11482 244134 269930 207383 141945 63537 91340 162869 144378 61373 94841 97755 61135 -3572
11470 -3572 18674 142426 167729 190404 150828 189144 246609 244257 233360 198945 203798 190434
11458 190434 225589 226231 199704 122791 105333 128353 118932 152810 184458 99201 71699 121430
11446 121430 65673 120877 180291 160119 56795 -44069 -22668 91178 165665 201474 137775
11435 137775 173900 205183 222766 220137 119591 99570 111906 84750 -2480 33497 10195
11424 10195 8089 58945 95950 -44609 -115588 -43908 47102 155537 178856 205400 151993
11413 151993 112135 81617 83104 37119 16772 135059 220706 181001 132253 156779 155202 175481
11401 175481 179182 92241 115352 83423 8671 57393 74621 68956 5901 -44860 -43353 31539
11389 31539 112162 96035 112776 24462 19868 37538 122490 105242 97013 14582 8382 119439
11377 119439 198158 115754 165968 187297 113330 38571 73198 103521 43664 29523 35059 86745
11365 86745 28452 -52645 5397 98559 128563 186956 174752 103871 90785 72263 57996 79916
11353 79916 157570 168136 43579 111277 133931 87063 4493 62044 97779 126020 165360
11342 165360 113943 178518 218963 148990 3255 -15517 37626 78669 113841 194550 97726
11331 97726 62101 64640 29430 29227 124191 116465 48279 149535 164220 147874 177715 218507
11319 218507 132381 23365 51732 115992 78692 54427 118213 178493 104340 84473 91699
11308 91699 81394 114109 126652 104721 92531 50503 79180 170357 175994 132005 167914 126615
11296 126615 35364 61950 177486 226607 186717 131252 47862 63103 32928 -4490 34178
11285 34178 94064 60466 24164 -1243 41639 94642 131639 66771 -12527 45558 57136 111521
11273 111521 90364 3650 -13567 -27053 36953 116541 71597 -153 30509 67718 27423
11262 27423 67200 96122 46470 -25936 -85879 -15073 1001 -40827 -42375 -29755 109741 149701
11250 149701 179251 139647 47676 -31407 -53240 -53572 -4545 101554 127235 74463 36750 130906
11238 130906 123390 106410 121004 73260 67130 88120 32995 49262 24166 72285 111729 103435
11226 103435 119704 101808 82945 69791 27548 29739 33035 3160 14650 -59452 -35099 -42677
11214 -42677 -77041 -33180 -15698 -37140 -25839 -58244 -98473 -43654 27274 52829 76199 90937
11202 90937 55095 62715 84977 82560 78566 64840 -68420 -124239 -48907 -30160 14530 64151
11190 64151 7327 -2975 -5391 33518 56213 32508 -37313 31131 94018 101987 -46110 -115542
11178 -115542 -102841 -65910 10939 70694 -7436 -53949 -51480 -71427 -644 9157 38220 53687
11166 53687 62435 46546 89874 56807 4901 18499 -15725 -18991 -18594 -103 33385 82012
11154 82012 112281 116052 80449 47971 24771 38693 55818 84858 43010 78797 72999 2632
11142 2632 6695 139103 106905 31265 -13841 39101 55423 75730 125048 117870 58447 -48834
11130 -48834 -53351 -71034 -53374 61647 43630 61137 40032 -47981 -28799 15707 39200 23499
11118 23499 45035 90025 44668 -287 74489 -1377 15176 67356 32669 47517 60645 92370
11106 92370 19457 15145 16458 -21585 37902 41749 46694 105970 128358 133230 -7600 36651
11094 36651 46063 718 -64026 -70508 -76322 -63917 2976 87801 35112 24305 32308 53265
11082 53265 77568 75421 88718 47114 35939 83611 49128 16717 84994 158067 154005 21951
11070 21951 -43308 -2163 27028 48264 37427 6380 -92572 -120841 -29354 14436 10006 38182
11058 38182 72628 128120 66287 21895 2733 52589 -14635 1255 53907 133175 112587 62811
11046 62811 132431 178688 174543 147027 128572 163780 256087 352083 288332 252540 219177 173344
11034 173344 245698 278378 444571 599288 593359 513902 481592 470699 427648 451641 481657
11023 481657 558310 588845 723699 779025 817194 740376 647211 528044 513954 441651 363962
11012 363962 324732 366994 505793 533694 538242 529258 435286 472308 440089 373584 245014
11001 245014 121052 75716 110674 118392 214244 266203 248030 260787 200082 163235 127923
10990 127923 145855 181580 97912 60964 20402 26013 122695 127449 58440 44078 16148 -10523
10978 -10523 -66263 -25396 -61345 -104522 -91674 -21845 -29290 -91858 -147231 -136696 -18548 48601
10966 48601 16813 33975 28561 -7985 56801 108632 63575 -35774 -113161 -59263 -8564 1949
10954 1949 3894 -21163 -74966 -190298 -160356 -9427 34791 7629 22120 -26702 -45048 -527
10942 -527 -35247 -63651 6815 19804 -85032 -121134 -113221 -140842 -81954 -42125 20914 43928
10930 43928 38725 136208 209179 89218 87435 56152 31625 51108 74014 148590 241641 145328
10918 145328 46602 48061 97178 35205 -3448 69926 21274 10466 -56395 -96347 -22609 -25057
10906 -25057 28064 58673 -463 27313 4276 -49036 -78849 -1700 -34424 -25591 -58543 -114098
10894 -114098 -79562 -7145 -57709 -90710 -16158 -25464 6603 24889 55614 73700 52060 -5466
10882 -5466 56174 63578 -12411 -40951 -26387 -14700 -2191 -70683 -120974 -148765 -87936 -87060
10870 -87060 -71223 -54898 -32965 -75126 -73205 4422 10979 -15940 -42395 -113533 -125489 -34512
10858 -34512 9897 40808 65460 16440 3457 38816 89496 54635 1823 -14536 -10325 -115047
10846 -115047 -142200 -87494 -45719 -47827 -43341 -48886 -42565 -72233 -56331 -56449 -29847 -30680 -5651
10833 -5651 -14099 -12509 573 7172 78821 157928 102504 41606 57669 121943 34567 -16310
10821 -16310 -60392 -53580 14812 127823 147194 100025 151530 196387 135588 -4341 -43946
10810 -43946 -24954 -26203 5600 13412 -16532 -49301 -17103 23814 80765 104329 53196 -2321
10798 -2321 23147 30158 12739 72050 141901 146448 140682 154291 137028 224358 294698 438868
10786 438868 766306 1279355 2159671 3414260 4472517 4503522 3645599 2611853 1824912
10777 1824912 1278315 994235 743391 538431 375576 298709 219045 189995 60039 -14525
10767 -14525 38012 46854 123537 57054 -95463 -173450 -268524 -225870 -164889 -221669 -315472 -329532
10755 -329532 -285340 -229970 -102546 -43247 -101752 -134904 -131275 -119290 -128947 -123098 -145142 -231073
10743 -231073 -228310 -262731 -311146 -330203 -252336 -209545 -254888 -179185 -172977 -224067 -169252 -70121
10731 -70121 -21109 -29906 -64816 -67955 -54485 -98887 -127016 -105863 -38238 -40183 -98888 -99077 -47769
10718 -47769 -89095 -147290 -180954 -113902 -37251 -57587 -84206 -25858 75146 79844 86165 35599
10706 35599 -54672 -116944 30171 85582 19495 -58218 -116760 -135338 -105925 -144095 -178557
10695 -178557 -168316 -134663 -205121 -224018 -194243 -115854 -106414 -146430 -75993 -36752 34787 27439
10683 27439 -495 6564 -57956 -60251 -33659 -162840 -166325 -116149 -62211 572 -98176 -113573
10671 -113573 -85193 -85545 -75590 -111563 -164995 -143773 -116667 -137903 -166295 -256197 -319921 -305244
10659 -305244 -186003 -150466 -166056 -178256 -150920 -135771 -151864 -147554 -101402 -47303 -64039
10648 -64039 -60589 -35272 -13732 34976 63107 60954 98837 155724 200305 228269 265996 372253
10636 372253 457319 509922 586009 597805 718892 843652 1045478 1311992 1482909 1680639
10626 1680639 1879371 2188963 2566810 3037669 3726851 4725286 5997481 7843343 10424700
10617 10424700 14048878 18991337 25240713 31964376 37267384 39388239 38565671 36365928
10609 36365928 34279883 33297602 34009653 36947454 42771373 52140469 64933011 78784587
10601 78784587 88303868 89338634 83366202 74935807 67445928 62821970 61701938 64474525
10593 64474525 71841307 84409001 101333198 118389353 127676165 124094057 111068195
10586 111068195 95293218 81523611 71525505 65694713 63970329 66332872 72681140 81848377
10578 81848377 90543560 93275931 87377342 75788355 63307377 52756854 45033622 40170811
10570 40170811 37759337 37494376 39093255 41585684 43433245 42798745 38832031 32897710
10562 32897710 26672500 21149504 16777597 13471615 11071288 9219925 7764079 6682151
10554 6682151 5905734 5284915 4709630 4221574 3820326 3514762 3196289 2946299 2829936
10545 2829936 2645915 2456561 2279662 2152517 2020570 1988726 1963090 1830571 1778410 1798599
10535 1798599 1717929 1632671 1563178 1587348 1553583 1440092 1282365 1182141 1126788 1122615 1093910
10524 1093910 1145025 1160755 1069548 1011610 956772 888729 960627 974107 968710 850986 835261
10513 835261 812019 714798 730563 707798 742314 887306 962357 945296 831110 681204 581145
10502 581145 528705 565311 614884 583152 584004 648251 646135 607034 653283 656851 631753 593455
10490 593455 486183 481929 513126 626522 679825 584381 521714 475370 503604 541886 592755
10479 592755 574060 548051 530616 544961 585070 542383 495584 500995 506220 547879 524998 478906
10467 478906 441104 388971 316340 388723 456206 482232 443738 441739 463219 424312 412733 341677
10455 341677 286584 309806 415164 471693 456470 503648 492816 448576 445058 489339 502496
10444 502496 431917 356871 342569 342660 345073 462895 421420 330689 365797 372005 389721 396200
10432 396200 461219 413571 354998 290043 275840 282138 323624 306685 220806 276908 302596 248788
10420 248788 238254 295420 254069 179933 130634 101217 245630 328765 306665 287982 293896
10409 293896 375754 385386 322667 300036 324641 308410 283925 367172 409413 338500 258836 213071
10397 213071 184275 145941 112728 119518 167728 231096 299311 406782 340908 224690 205977
10386 205977 203748 265435 256602 156101 77966 84516 73245 37144 99387 161399 138607 181013
10374 181013 271002 293996 239170 155676 154703 112329 12610 -35973 49485 171585 204375 178776
10362 178776 195229 144721 87133 51199 98939 140521 67504 46353 102768 168532 173491 225256
10350 225256 214310 173109 144982 146911 125452 70387 69916 135831 101572 -11509 43 76554
10338 76554 77606 89271 134206 129871 124448 116674 89554 88899 212175 201007 175385 148496 185430
10325 185430 227746 135727 18023 -76731 -8854 33488 -19703 -1404 60213 111377 161842
10314 161842 182550 102927 112349 207110 256889 223726 214669 151762 141501 60920 -9662 6907
10302 6907 42145 94090 94744 216181 135949 78058 164560 122442 141693 306369 308802 256207
10290 256207 195751 121985 43340 43946 15860 410 -10233 2532 134925 138836 149975 157761
10278 157761 167277 188237 184852 169655 110765 72489 119739 147868 161081 147749 223738 227035
10266 227035 213859 232076 200787 126774 160755 228353 276819 225309 210447 290882 281814 333633
10254 333633 333819 299088 261827 197969 180095 179031 161327 137408 110933 117799 177324 239380
10242 239380 198249 216294 239120 259578 202943 165701 145424 140697 129227 52435 1592 21076
10230 21076 59967 7976 73264 105172 89898 39534 32984 51971 96545 126565 119219 113314
10218 113314 105230 39155 -24108 -2658 49885 -2127 -4243 4687 88548 169085 233775 228540
10206 228540 116952 68811 81550 142869 204352 108735 33093 82927 186686 238573 155884
10195 155884 74537 76259 64811 91351 144956 191036 181883 181539 206362 152688 105989 78728
10183 78728 5428 19633 85217 127107 194342 224055 189735 166433 171686 270361 294887 230855
10171 230855 177673 157009 214953 327773 473387 537416 583423 654209 605353 496721 412636
10160 412636 406279 353635 355748 403679 407325 561021 686920 793133 808583 746340 641760
10149 641760 578030 499435 387989 373980 507558 561837 498602 526874 567221 614095 551955
10138 551955 562497 518676 417689 331289 271398 257434 232720 211433 222174 254981 196190
$$ [...]
##END NTUPLES=NMR SPECTRUM
##END=
