##TITLE=Analysis number 310656
Compound Code cc 19403
Book Reference 300/198
Project Code adrs
Chemist Name howarde
##JCAMPDX= 6.0         $$ Bruker NMR JCAMP-DX V2.0
##DATA TYPE= NMR SPECTRUM
##DATA CLASS= NTUPLES
##ORIGIN= Bruker BioSpin GmbH
##OWNER= NMR
$$ XWIN-NMR		Version 3.5
$$ Tue Jun 21 15:09:20 2005 GMT Daylight Time (UT+1h)  MAYBRIDGE\NMR@NMR_250MHZ
##.OBSERVE FREQUENCY= 250.131544655141
##.OBSERVE NUCLEUS= ^1H
##.ACQUISITION MODE= SIMULTANEOUS (DQD)
##.ACQUISITION SCHEME= undefined
##.AVERAGES= 16
##.DIGITISER RES= 18
##SPECTROMETER/DATA SYSTEM= dpx250
##.PULSE SEQUENCE= zg30
##.SOLVENT NAME= CDCl3
##.SHIFT REFERENCE= (INTERNAL, CDCl3, 0, 16.522)
##AUDIT TRAIL= $$ (NUMBER, WHEN, WHO, WHERE, WHAT)
$$ ##TITLE= Audit trail, XWIN-NMR		Version 3.5
$$ ##JCAMPDX= 5.01
$$ ##ORIGIN= Bruker BioSpin GmbH
$$ ##OWNER= NMR
$$ C:\u/data/dgb/nmr/ADRS/4480/pdata/1/auditp.txt
$$ ##AUDIT TRAIL=  $$ (NUMBER, WHEN, WHO, WHERE, WHAT)
(   1,<2005-06-21 15:09:00.58 +100>,<MAYBRIDGE\NMR>,<NMR_250MHZ>,
      <created by zg, POWCHK disabled, PULCHK disabled
       configuration hash MD5:
       62 19 C7 07 E1 42 D1 B7 37 6C 3D D0 77 39 F9 E6
       data hash MD5: 64K
       10 6E 1F 20 F8 C8 7A 79 DA AA 2C EE C2 E9 4A FE>)
(   2,<2005-06-21 15:09:12.88 +100>,<MAYBRIDGE\NMR>,<NMR_250MHZ>,
      <Start of raw data processing
       ef LB = 0.3 FT_mod = 6 PKNL = 1 SI = 32K 
       data hash MD5: 32K
       F6 29 5D F0 AD 75 1C 3E 3D 4C 59 65 64 94 19 CF>)
(   3,<2005-06-21 15:09:14.68 +100>,<MAYBRIDGE\NMR>,<NMR_250MHZ>,
      <apk 
       data hash MD5: 32K
       A1 0E F9 E8 69 41 EF 99 73 B7 77 E0 6F 7A C3 3E>)
(   4,<2005-06-21 15:09:15.39 +100>,<MAYBRIDGE\NMR>,<NMR_250MHZ>,
      <abs ABSG = 5 
       data hash MD5: 32K
       FC 81 64 AE 8F 6C 4A A2 E3 C2 DB DC CE 97 2D C6>)
$$ ##END=
$$ 
$$ hash MD5
$$ 50 F6 29 B3 4F 7D 15 64 2C D0 E8 EA 94 E2 10 EB
##$RELAX= 
##$RELAX= 
##$RELAX= 
##$RELAX= 
##$RELAX= 
##$RELAX= 
##$RELAX= 
$$ Bruker specific parameters
$$ --------------------------
##$DU= <C:\u>
##$EXPNO= 4480
##$NAME= <ADRS>
##$PROCNO= 1
##$TYPE= <nmr>
##$USER= <dgb>
##$AMP= (0..31)
100 100 100 100 100 100 100 100 100 100 100 100 100 100 100 100 100 100 
100 100 100 100 100 100 100 100 100 100 100 100 100 100 
##$AQSEQ= 0
##$AQ_mod= 3
##$AUNM= <au_zg>
##$AUTOPOS= <40 >
##$BF1= 250.13
##$BF2= 250.13
##$BF3= 250.13
##$BF4= 250.13
##$BF5= 500.13
##$BF6= 500.13
##$BF7= 500.13
##$BF8= 500.13
##$BYTORDA= 1
##$CFDGTYP= 0
##$CFRGTYP= 5
##$CHEMSTR= <none>
##$CNST= (0..31)
1 1 145 1 1 1 1 1 1 1 1 1 1 1 1 1 1 1 1 1 1 1 1 1 1 1 1 1 1 1 1 1 
##$CPDPRG= <>
##$CPDPRG1= <>
##$CPDPRG2= <>
##$CPDPRG3= <>
##$CPDPRG4= <mlev>
##$CPDPRG5= <mlev>
##$CPDPRG6= <mlev>
##$CPDPRG7= <mlev>
##$CPDPRG8= <mlev>
##$CPDPRGB= <>
##$CPDPRGT= <>
##$D= (0..31)
0 1 0 0 0 0 0 0 0 0.06 0 0 0 0 0 0 0.0002 0 0 0 0 0 0 0 0 0 0 0 0 0 0 
0 
##$DATE= 1119362939
##$DBL= (0..7)
120 120 120 120 120 120 120 120 
##$DBP= (0..7)
150 150 150 150 150 150 150 150 
##$DBP07= 0
##$DBPNAM0= <>
##$DBPNAM1= <>
$$ [...]
##$SUBNAM7= <"">
##$SUBNAM8= <"">
##$SUBNAM9= <"">
##$SW= 20.6930455092707
##$SWIBOX= (0..15)
0 0 3 0 0 0 0 0 0 0 0 0 0 0 0 0 
##$SW_h= 5175.983436853
##$TD= 65536
##$TD0= 1
##$TE= 295.16
##$TE2= 300
##$TE3= 300
##$TEG= 300
##$TL= (0..7)
0 120 120 120 120 120 120 120 
##$TP= (0..7)
150 150 150 150 150 150 150 150 
##$TP07= 0
##$TPNAME0= <>
##$TPNAME1= <>
##$TPNAME2= <>
##$TPNAME3= <>
##$TPNAME4= <>
##$TPNAME5= <>
##$TPNAME6= <>
##$TPNAME7= <>
##$TPOAL= (0..7)
0.5 0.5 0.5 0.5 0.5 0.5 0.5 0.5 
##$TPOFFS= (0..7)
0 0 0 0 0 0 0 0 
##$TUNHIN= 0
##$TUNHOUT= 0
##$TUNXOUT= 0
##$USERA1= <user>
##$USERA2= <user>
##$USERA3= <user>
##$USERA4= <user>
##$USERA5= <user>
##$V9= 5
##$VALIST= <valist>
##$VCLIST= <CCCCCCCCCCCCCCC>
##$VD= 0
##$VDLIST= <DDDDDDDDDDDDDDD>
##$VPLIST= <PPPPPPPPPPPPPPP>
##$VTLIST= <TTTTTTTTTTTTTTT>
##$WBST= 1024
##$WBSW= 4
##$XGAIN= (0..3)
0 0 0 0 
##$XL= 0
##$YL= 0
##$YMAX_a= 512158
##$YMIN_a= -386685
##$ZGOPTNS= <>
##$ZL1= 120
##$ZL2= 120
##$ZL3= 120
##$ZL4= 120
##$ABSF1= 16.522
##$ABSF2= -4.171173
##$ABSG= 5
##$ABSL= 3
##$ALPHA= 0
##$AQORDER= 0
##$ASSFAC= 0
##$ASSFACI= 0
##$ASSFACX= 0
##$ASSWID= 0
##$AUNMP= <proc_1d>
##$AZFE= 0.1
##$AZFW= 0.1
##$BCFW= 0
##$BC_mod= 0
##$BYTORDP= 0
##$COROFFS= 0
##$CY= 12.5
##$DATMOD= 1
##$DC= 0
##$DFILT= <>
##$DTYPP= 0
##$F1P= 14.0000005364418
##$F2P= -0.99999901652339
##$FCOR= 0.5
##$FTSIZE= 32768
##$FT_mod= 6
##$GAMMA= 0
##$GB= 0
##$INTBC= 1
##$INTSCL= 1
##$ISEN= 128
##$LB= 0.3
##$LEV0= 0
##$LPBIN= 0
##$MAXI= 10000
##$MC2= 0
##$MEAN= 0
##$ME_mod= 0
##$MI= 0
##$NCOEF= 0
##$NC_proc= -2
##$NLEV= 6
##$NOISF1= 0
##$NOISF2= 0
##$NSP= 0
##$NTH_PI= 0
##$NZP= 0
##$OFFSET= 16.522
##$PC= 1
##$PHC0= -79.57346
##$PHC1= 5.070305
##$PH_mod= 1
##$PKNL= yes
##$PPARMOD= 0
##$PSCAL= 4
##$PSIGN= 0
##$REVERSE= no
##$SF= 250.13
##$SI= 32768
##$SIGF1= 0
##$SIGF2= 0
##$SINO= 400
##$SIOLD= 32768
##$SREGLST= <1H.CDCl3>
##$SSB= 0
##$STSI= 32768
##$STSR= 0
##$SW_p= 5175.98343685301
##$SYMM= 0
##$S_DEV= 0
##$TDeff= 65536
##$TDoff= 0
##$TI= <Analysis number 999999
Compound Code 99
Book Reference 9
Project Code 9>
##$TILT= no
##$TM1= 0
##$TM2= 0
##$TOPLEV= 0
##$USERP1= <user>
##$USERP2= <user>
##$USERP3= <user>
##$USERP4= <user>
##$USERP5= <user>
##$WDW= 1
##$XDIM= 32768
##$YMAX_p= 300943089
##$YMIN_p= -48423
$$ End of Bruker specific parameters
$$ ---------------------------------
##NTUPLES= NMR SPECTRUM
##VAR_NAME=  FREQUENCY,     SPECTRUM/REAL,   SPECTRUM/IMAG
##SYMBOL=    X,             R,               I
##VAR_TYPE=  INDEPENDENT,   DEPENDENT,       DEPENDENT
##VAR_FORM=  AFFN,          ASDF,            ASDF
##VAR_DIM=   32768,         32768,           32768
##UNITS=     HZ,            ARBITRARY UNITS, ARBITRARY UNITS
##FACTOR=    0.157963299565203, 1,           1
##FIRST=     4132.6476996994, 0,             0
##LAST=      -1043.33573715361, 0,           0
##MIN=       -1043.33573715361, -48423,      0
##MAX=       4132.6476996994, 300943089,     0
$$ Real data points
##PAGE= N=1
##DATA TABLE= (X++(R..R)), XYDATA
$$ [...]
21884 -3638 -13633 -14128 -8230 3026 8180 -7212 -18277 -11840 -4789 -10701 -10589 -3647 -12962 -14258
21870 -14258 -14270 -4899 -5886 -8166 -6788 -3574 -839 -3822 -14366 -21880 -16805 -14356 -12880 -12826 -12136 -8971
21854 -8971 -5440 -9196 -12854 -7009 -1049 10161 12521 -1608 -5767 -7766 -347 4214 -3741 3699
21840 3699 4005 -617 2789 3132 820 5597 5284 17868 16133 10125 707 737 -6151 675 10757
21825 10757 6398 3736 10557 -1327 -4566 -3573 -8588 -9082 -9825 -1155 12129 6709 2050 -2264 -1478
21810 -1478 43 9087 13667 8465 -4113 -10418 -1718 2634 -8960 -17276 -11931 3258 20812 11208
21796 11208 13061 20717 13956 -4045 -10089 7403 20262 1873 -17216 -9176 5593 11686 15877
21783 15877 8845 6556 1718 -2554 -1789 -1286 -1297 6724 16799 18717 8481 1673 794 -1708 6332
21768 6332 18475 6903 3809 11356 9011 7364 12104 22431 32960 24444 7833 -322 -1110 -12443
21754 -12443 -10211 330 5491 10130 2525 -5433 1737 4371 -8149 -11227 -5612 4573 1434 -2018
21740 -2018 -5138 -3529 5487 14247 8393 -7397 -12150 -8648 -3751 6245 6446 9108 -4171 -9030
21726 -9030 -4009 4870 1963 863 6917 6490 7102 1425 -135 1096 8164 13656 16781 2147 -7958
21711 -7958 -2894 -4555 -6787 -8485 -3304 8732 6518 2597 4261 3106 -2889 -994 7473 2862
21697 2862 -4161 1500 103 -6930 -1607 1946 -8993 -23407 -15013 -13630 -3442 -624 -4077 -5142
21683 -5142 -2203 11448 9965 12684 9319 7246 6087 3644 2511 7827 9246 4578 3425 4866
21669 4866 -920 9287 8636 5867 6208 4539 3095 -9037 -17709 -18260 -8055 2802 19727 11935
21655 11935 2014 -11848 -19476 -19145 -14218 -6401 -2084 197 -577 6511 -8261 -19616 -11820 -5991
21641 -5991 -8726 -6428 -4711 -6450 -9726 -18079 -14916 -15186 -12542 -11712 -15839 -6734 3261 1590 6832
21626 6832 840 2300 5683 4592 596 -5596 -11118 -15596 -10569 -9728 -8226 5467 10241 404 -4410
21611 -4410 -3775 -4774 -10184 -6668 5769 6601 15152 7655 4089 -2629 -11106 1108 9547 9441 670
21596 670 -5227 -6322 6270 6749 6948 12139 12782 4199 5981 6157 25741 32537 22705 14876 2087
21581 2087 10424 16533 14312 16291 6876 -7234 1 12503 5813 -435 -1114 5105 11171 15249
21567 15249 9599 2167 -2518 -10745 -6275 -837 13461 9102 219 64 6365 2452 2127 7031 6268
21552 6268 -3367 -13363 -17162 -10995 -7592 -7417 -3779 -5092 -10324 -10500 9053 11414 6482 1076 3557
21537 3557 7907 5006 15925 18403 10768 6658 8626 19868 13582 -2530 -6236 -11253 1509 615
21523 615 5949 -248 6931 13630 7684 5959 13605 21280 11525 -4293 2258 12794 13629 12033 7622
21508 7622 -145 -5369 -6126 -9271 -4539 6731 8869 8784 5993 14521 8914 -9772 -20388 -17307 525
21493 525 -3613 -543 -133 -8962 -5363 -11129 -21375 -20966 -9294 -3540 1749 9535 9521 22780 39128
21478 39128 47290 38016 26603 26316 29940 23202 3532 4620 9872 -186 -1386 -7397 -4745 3932
21464 3932 5641 9438 8552 10001 21331 23178 13265 7663 -1209 -5746 5914 16059 10897 13447
21450 13447 238 -1357 -570 -2623 -13045 -10613 -5351 62 5434 4626 1732 10781 16510 16085 21552
21435 21552 28912 21363 16865 21801 18590 10696 19868 12494 1597 -2047 -4214 3470 5519 4224
21421 4224 10067 8951 1409 7124 12209 8408 9293 1833 327 -2593 -6226 3353 2389 -6950 -5762
21406 -5762 -7008 -399 8258 14986 11362 4605 694 -2053 833 -1612 6258 24397 28777 20349
21392 20349 10001 3649 7097 12935 17491 18855 13099 3705 4312 964 3618 5169 10287 6885
21378 6885 10487 6943 1390 6719 9404 -3139 -905 3359 4065 11998 9628 8533 4683 9485 8263
21363 8263 1224 -12188 -13843 -7433 6217 8543 9842 13510 8089 -2672 3215 1144 -7601 -7565
21349 -7565 10454 14018 15733 15532 15020 17848 -7530 -3531 3625 -12217 -18865 -20660 -15104 -9031
21335 -9031 -3683 -6738 -20996 -22197 -5235 -2645 -6296 -9326 -15791 -10870 -7149 -7664 -9076 -10962
21321 -10962 -2701 15414 23251 21867 13180 14192 11007 7031 3591 2701 10166 7839 -6187 -15575
21307 -15575 -9924 -2474 -3816 -4299 -2125 -2376 -431 -1114 6095 4076 -5885 -8957 -6777 -2049 2950
21292 2950 9534 1419 4816 15641 11771 11789 22029 14575 3572 3660 948 -2035 925 5429 -4694
21277 -4694 2787 4161 6791 912 -8826 -4772 -3557 6694 16278 8601 1326 664 -8752 -5076 2695
21262 2695 5341 7703 12797 11646 15624 14666 1609 -15119 -15789 -5260 -1797 -758 3697 6192
21248 6192 1363 1408 1931 875 2347 12746 19008 15030 4824 3623 8507 9099 6099 12909 29720
21233 29720 30629 16732 8546 8035 7350 14319 7576 -1844 -3412 3626 9846 14912 9000 8489 3544
21218 3544 -5262 588 3637 -248 12275 17696 15079 9757 11846 18543 19961 18415 7823 5931
21204 5931 17884 8978 7167 12129 17717 16291 13954 15843 26978 31712 35568 43430 41837 31039
21190 31039 21631 13836 7808 13651 6962 -1352 8487 23862 26951 22289 22882 26122 25760 27807 25770
21175 25770 17904 9609 18453 23435 22424 23699 25932 27921 15613 3845 4898 16288 27320
21162 27320 23597 11427 -2089 -174 7509 7593 4861 329 2117 8952 8798 4229 7406 5635 7624
21147 7624 2988 -11479 -15116 -10181 -11213 -1633 -3531 -5321 -4165 12840 15431 1271 -4309 -12594
21133 -12594 -13160 -1739 8495 12584 14560 5388 3678 13476 13531 15315 18684 -1289 -6082 -13404
21119 -13404 -8873 -12860 -4628 2543 5066 5363 -6292 -10264 1281 9092 21638 26812 17678 15300
21105 15300 14099 -124 -6082 -3616 -1756 -193 -2287 -2360 1090 1890 7737 5668 -1688 -7008 8702
21090 8702 1257 -9668 -8211 -9217 -3232 -1744 -11781 -6082 -3244 -5991 -1465 12297 9457 2045
21076 2045 -2204 -175 10901 16786 13631 14197 10913 8495 6471 4884 -1707 -4061 -4854 8640 11775
21061 11775 757 -1674 -332 9951 10871 22796 20695 24620 30473 18581 18439 19166 7149 901
21047 901 2603 14387 3007 -2618 3908 5715 16917 25937 17210 11314 9239 13377 10171 9618
21033 9618 14469 17312 13496 5831 -2701 -3114 -2348 1916 11767 20000 27793 27922 24973 12210 6908
21018 6908 -7327 -8163 -1711 12806 13302 562 5933 17336 23758 19350 16529 18010 12094 6992
21004 6992 2787 -3127 4036 -2751 -15333 -2668 7107 1216 -15986 -18164 870 11752 2273
20991 2273 -6759 -402 -545 -7835 -2895 9706 10082 2152 4104 10282 16285 19217 15923 14315 17090
20976 17090 18954 12838 20313 15750 17796 22516 15497 14971 18239 7366 5876 9266 10388 16121
20962 16121 8569 -8257 -15713 -2407 -1648 -9287 -1120 2692 117 8524 25452 30448 37791 37633
20948 37633 29743 26433 22376 15748 14669 9777 799 198 13832 12650 9839 991 -2937 -5861
20934 -5861 4998 3172 -8651 -2934 3773 902 6826 4603 4624 8930 22576 28896 22909 10736
20920 10736 12796 10240 -5937 -13298 -6640 -4867 -161 3099 6731 9553 15124 24076 22092 11913
20906 11913 1811 2723 9511 11654 2665 -11962 -9703 4042 16353 19029 15524 958 2406
20893 2406 9075 12948 7299 4961 7112 20834 28831 28314 16542 20469 27911 23244 17015 10444
20879 10444 12493 20979 19947 5763 -595 12258 27825 30720 33924 36667 36619 30216 26957 23436
20865 23436 19727 20914 21427 5491 1385 14303 21422 21783 25024 16375 18655 12601 10732 9449
20851 9449 12107 10986 5459 -1636 -160 345 -8725 5418 14744 23242 27549 51041 47075 44136
20837 44136 41546 36446 36684 38048 30099 21747 16217 33084 32916 27212 24679 30098 29304 32534 27928
20822 27928 32653 23396 17824 20853 26941 23245 13722 25162 33730 43844 37465 28923 21292 24104
20808 24104 24355 23558 21213 19891 16485 9821 10364 8725 -2281 3522 19745 23839 18592 14520 8984
20793 8984 12397 17906 16880 18304 15131 11724 8016 5888 1933 3126 -8405 -4521 8413 24053
20779 24053 28466 28197 29401 27052 19742 22140 29527 28384 28448 18809 9445 12849 7360 3159 -1640
20764 -1640 8038 16360 18892 29816 32209 27877 21157 10590 -2153 -4509 -4584 5894 24662 33519
20750 33519 36086 36705 34323 22513 17736 9884 12001 19443 18128 15297 24056 23321 20155 15201 13240
20735 13240 15614 18354 20847 22777 26804 24248 13425 20773 25003 24324 18144 20729 22354 32581
20721 32581 26828 17178 20640 24577 28781 26184 25749 21207 14498 15940 22123 27396 26052 12242
20707 12242 -5193 525 15038 32216 32292 31386 20245 12276 15079 12033 15878 25215 26662 16902
20693 16902 16134 18570 13344 25609 40353 49930 56850 58023 73919 108761 121916 128083 139186
20680 139186 148096 145858 133787 125562 122185 133568 158763 176514 201717 206629 214028 222821 216661
20667 216661 203518 185733 157774 136476 124840 127415 135091 141255 158460 157154 140100 135468
20655 135468 127976 115503 104569 92227 89682 73987 58905 57648 58835 67425 76040 71134 45987
20642 45987 43158 45140 53887 61127 52223 48557 39217 32031 38619 30565 27595 27146 26398 24318 29247
20627 29247 26411 16298 19427 21614 33187 41668 44284 36294 33033 36990 30615 28162 14582 11931
20613 11931 18160 21391 30207 44246 47474 37804 45076 54052 46303 39640 39894 32905 23772 23312 25322
20598 25322 32167 29244 35343 27388 15912 17172 16219 6117 1858 4708 16260 17455 14385 5937
20584 5937 13620 31189 39089 39101 40054 37827 26571 16179 22975 30664 36999 34079 36072 37871 29934
20569 29934 17021 10058 7455 16097 20553 22025 23494 40308 45745 35987 42292 44786 45714 45901
20555 45901 46735 49098 42609 18640 7292 21893 21745 16620 27783 33491 33404 24486 19922 33766
20541 33766 28943 21549 15597 21817 30472 21223 16209 7004 -3261 -4571 1581 11465 27979 22760
20527 22760 29300 30035 29513 16519 11270 23094 29868 23857 23113 29326 41346 41375 39915 41884 45388
20512 45388 50653 56704 42999 39264 35896 36444 39441 25656 23232 20911 16838 23184 29513 25245
20498 25245 16124 15776 21809 20496 16973 17518 15055 27564 31822 29132 25242 23562 25905 27311 28284
20483 28284 24213 33156 32542 23493 15724 12671 11444 12359 22925 31589 29500 23331 29945 33470 32665
20468 32665 37074 44786 38121 24434 32298 36684 41989 33893 36856 36727 37807 40558 45162 55993
20454 55993 37254 32443 43274 52393 57391 45667 33054 25946 26750 28500 27686 32480 35167 46712
20440 46712 55344 59589 46343 28358 34607 41037 45409 44910 42833 50218 55569 58175 65393 70873
20426 70873 73292 63139 60274 49342 49979 68110 81130 75072 73523 69947 70329 68688 64030 69995
20412 69995 85084 96658 93772 98899 105343 106499 100574 90352 94396 93091 76197 76801 84404 84781
20398 84781 87830 92561 95662 97636 104674 113281 97958 87404 81352 79119 81043 75436 69996 56421
20384 56421 61763 71039 71155 64493 59371 50049 59578 72130 69711 60614 62654 60211 62929 69564
20370 69564 70406 64737 56137 51436 49021 54566 59281 61489 64300 61035 58243 63058 63994 72272 77888
20355 77888 75777 59030 54058 50337 56939 61720 52024 60200 57005 46244 48640 51594 54200 58510
20341 58510 58775 52309 47350 46742 45376 49803 54458 63937 53475 52972 58591 54318 50870 62814 67913
20326 67913 64537 66902 68898 70080 79984 83889 89053 87222 90962 86015 70629 63587 75368 81317
20312 81317 79929 76540 78565 83317 80684 81644 82214 67967 62905 59749 66494 73176 68671 75096 75839
20297 75839 74173 70954 78849 85639 85460 92379 89134 83467 72232 72420 73815 79971 83431 75000 75807
20282 75807 74860 78174 82487 82458 90809 93063 91002 85349 79984 78630 75237 71513 82861 100160 113006
20267 113006 104054 91912 94409 94262 104028 100765 96145 100264 103978 110764 107147 105706 116148 112077
20253 112077 109334 114605 121926 122079 125418 124812 120184 118948 128212 136288 142260 138448 130597 141429
20239 141429 153946 154302 153410 151141 149316 158407 160684 159809 160455 179952 190654 195222 189324 185731
20225 185731 196972 206210 206978 219896 236665 238054 239329 249648 260511 260878 267893 278748 279318
20212 279318 293182 297473 306745 313503 321067 322308 319654 328501 357268 390434 398294 400003 421901
20199 421901 440044 433901 428081 431565 431207 443251 468705 489790 489977 476390 464321 457858 468710
20186 468710 475766 484560 504512 519154 534742 570470 600874 641031 672538 716586 765617 828866
20174 828866 905192 979381 1046969 1112778 1197815 1292153 1410996 1551051 1723492 1938513 2216653
20163 2216653 2561972 2993810 3538738 4243977 5146984 6401568 8375266 11393529 15304999
20154 15304999 18834436 20972374 22496497 23122103 21686701 19381690 17746918 17357021
20146 17357021 18594929 21856650 26998472 32533624 37393470 40988123 41698846 39691784
20138 39691784 35982083 30804998 25672787 21874712 19737421 19454818 21092645 23841285
20130 23841285 25585434 25798273 25575775 24026972 20520092 16620525 13375278 10892816
20122 10892816 9095677 7822353 6893658 6191394 5639608 5199538 4840597 4546666 4291976
20113 4291976 4082634 3924182 3781887 3651858 3537560 3429699 3331893 3247466 3176175 3089931
20103 3089931 2992654 2896112 2799412 2703937 2596369 2489057 2387906 2313107 2246166 2173832 2107351
20092 2107351 2042808 1974215 1893414 1807819 1720900 1624477 1539166 1471132 1401998 1320974 1254309
20081 1254309 1196604 1129428 1076943 1024355 956718 913680 867117 828194 786840 751115 716484
20070 716484 690653 648502 615410 597527 573484 544405 512097 490671 473910 447031 422903
20059 422903 404403 377180 359854 348593 346739 335554 325924 293312 270218 255790 250646 234008
20047 234008 233461 227305 214001 206398 206665 199336 194949 186487 185956 187701 182319 167419 167258 150064
20033 150064 136623 129646 122061 122204 125695 123511 115029 113607 115377 111937 111467 126554 138156 146585
20019 146585 147045 142966 139578 135467 135862 139974 138937 121741 118280 127559 123679 129800 135303 124759
20005 124759 121128 114997 103040 96929 92775 75345 65112 71353 73904 73730 63081 61022 56124
19992 56124 64226 66228 60144 54068 55456 45090 51877 41573 28714 26695 43653 37779 40467
19979 40467 47087 49544 52344 62637 77245 84907 81432 81795 80559 82011 83039 74699 59704 49420
19965 49420 50987 66581 96983 102326 100663 95730 109879 124084 110313 107267 100609 98792 104044
19952 104044 116882 125444 130235 127319 130085 125748 120657 125911 131950 122311 112481 110610 114380 106166
19938 106166 101152 97786 98707 98074 105760 111130 114434 114415 104624 101042 96311 94807 105101 114108 110073
19923 110073 105772 108978 113673 113686 109387 99195 96137 93572 85289 83833 84051 86482 82149 83479 86081
19908 86081 85139 74215 81375 91616 107694 108597 106080 106394 107281 97044 95913 104130 111320 113757
19894 113757 110043 98118 84937 90700 98983 99251 109265 101904 94425 102000 103287 106689 98544 94056
19880 94056 104768 102464 76286 66873 66743 70737 75689 83608 92506 77809 55089 59732 70340
19867 70340 61963 65970 67458 61240 61546 72419 67769 73963 71420 76682 74420 59505 64919 70488
19853 70488 71265 65291 71625 78661 76742 70589 60277 72690 77831 75694 76460 66562 51798 53560
19839 53560 55210 54185 54336 51681 50617 65934 70407 56049 65217 77567 70826 77068 81203 78665
19825 78665 78984 90032 104719 115239 122062 125562 125835 128949 132324 149514 149545 137862 136203 126262
19811 126262 116534 123364 139885 142918 138379 153656 174082 181171 167969 163139 146700 136670 131624
19798 131624 131263 138747 143239 160231 181258 190907 193854 206541 224192 229649 216631 214257 213378
19785 213378 218000 223396 234282 240831 235296 237569 237090 247952 263357 256948 254356 257731 264124 275533
19771 275533 285895 302189 300018 290796 265148 252855 248596 254525 252886 243031 242902 244027 245468
19758 245468 244993 254844 269257 277501 274750 258952 252986 273689 292212 297064 280723 273636 287511
19745 287511 299544 306809 319085 328219 342612 358716 360892 360829 374143 383715 397278 410879 433451
19732 433451 457101 469574 487052 499875 516138 531050 562505 581587 613123 637494 662199
19721 662199 699693 763030 811944 840559 860363 895845 939447 997817 1066636 1134201 1237928
19710 1237928 1367779 1497745 1655276 1862671 2137919 2511478 3007831 3659458 4561583
19701 4561583 5975688 8277664 11442083 14232456 14783797 13719206 12681028 12569237
19693 12569237 13879821 16544468 19054633 19611906 19416691 19881358 19989990 18343021 15893950
19684 15893950 13979185 13204617 13842525 15537351 16400797 14893242 12264531 9852776
19676 9852776 7948841 6539685 5531205 4817662 4311924 3948501 3675860 3473381 3316107
19667 3316107 3206127 3128243 3093521 3114747 3153404 3205380 3266882 3352677 3443447 3584791 3797964
19656 3797964 4093743 4495253 5043332 5781254 6845174 8606694 11467926 15110908 17580606
19647 17580606 17387570 15997666 15046731 15309886 17140046 20067846 22072135 22215998 22287592
19638 22287592 23044105 22638737 20266786 17527282 15666948 15184067 16259313 18008182
19630 18008182 18078502 15786783 12835682 10269010 8251550 6752956 5672207 4909669
19622 4909669 4364770 3988630 3724043 3512938 3334353 3163554 3014957 2883365 2760763
19613 2760763 2650882 2562743 2503990 2436372 2363337 2307971 2271278 2244589 2205729 2159299 2110419
19602 2110419 2045919 1972269 1886232 1801769 1733690 1669614 1606960 1544904 1477676 1420066 1352612
19591 1352612 1279891 1215910 1161376 1101788 1045064 983953 929397 889198 844340 798954 758551
19580 758551 731761 696062 666771 641224 601652 578921 560552 544619 529056 493816 464366
19569 464366 443837 428062 417411 412810 405897 393731 380364 368768 368502 361631 342129 333819 324033
19556 324033 307405 290386 282800 261947 246861 230739 213892 213385 214014 209289 202162 180779 166685
19543 166685 156077 145320 140894 148652 156824 158111 154194 148319 144634 142669 133376 124793 119654 125557
19529 125557 138997 150313 146322 136352 137370 144175 146852 151318 146874 141285 142114 142575 149533 159604
19515 159604 153395 152996 152736 159824 165849 159898 153679 147055 126799 127967 142038 140309 143162 134748
19501 134748 127268 141688 154831 162360 156423 147396 135825 123670 119779 128672 133130 133376 125535
19488 125535 129234 132146 130736 112549 105404 110199 104603 101132 113149 130946 129780 123368 113917
19475 113917 113591 112663 109850 120321 114289 112214 124288 117908 118916 117765 117123 129265 145941 147664
19461 147664 134601 126783 124069 128259 139125 141573 144727 131801 131917 134584 134127 134068 134609 137806 137364
19446 137364 131306 126075 118252 116851 129630 137619 123838 125660 124952 117620 111061 106589 108870 112959
19432 112959 106070 104627 99969 96341 93058 99197 103702 98240 96469 106675 102202 97812 103919 107036
19418 107036 100946 99096 101134 89397 78406 77827 79076 75774 81534 71972 70037 60035 57538 69586
19404 69586 82523 76338 80669 96248 93814 94912 106039 108785 107508 102218 97963 92913 91493 91598
19390 91598 84290 89371 92415 89899 92718 102637 100009 97208 110928 119234 111197 107199 106008 105157
19376 105157 107231 103654 103651 101927 99063 100067 104123 106049 102972 104659 107974 105169 102377 105549 111676
19361 111676 112273 109171 103493 98229 106078 105655 116783 127442 126342 123456 132957 138283 136207 134997
19347 134997 128183 120086 125795 133392 137563 144188 144165 141681 145817 155881 164741 174358 186953 195427
19333 195427 201981 224605 238928 242619 231630 224532 212921 213751 220218 225845 235773 257705 271429
19320 271429 284297 291330 289682 281007 274487 271584 280922 290455 286336 280656 279749 290187 310238 309299
19306 309299 298832 290859 286758 287304 293718 284919 286112 292683 298184 285056 287256 304965 302937 298953
19292 298953 291228 308902 330072 345136 365572 384221 406413 426726 453969 479690 509009 548250
19280 548250 575317 602479 629473 659768 694548 756944 826388 883900 927366 979211 1047694
19269 1047694 1161105 1302005 1461904 1650013 1889379 2202761 2638822 3230240 4017516
19260 4017516 5156334 6986141 9697388 12588466 13895408 13227478 12042994 11410722
19252 11410722 11889574 13626626 15706393 16232345 15053089 13804694 13632556 14713886
19244 14713886 16136718 16187379 14725019 13061183 12107275 12278213 13597998 14925877 14473782
19235 14473782 12373397 10046417 8123530 6643622 5565782 4783882 4236332 3859523
19227 3859523 3604712 3438438 3344933 3284383 3223469 3174782 3157032 3162091 3210046 3295321 3421927
19216 3421927 3574466 3762705 4010349 4358259 4885919 5619640 6655418 8322367 11052972
19207 11052972 14708571 17683619 18074728 16651870 15275406 14916474 16014143 18306551
19199 18306551 20061588 19635085 18023134 17064688 17652324 19556959 20873346 19859953
19191 19859953 17584383 15674867 14913996 15623113 17314138 18030559 16412536 13598358
19183 13598358 10950452 8826033 7177185 5976683 5113610 4498761 4054947 3705593 3423091
19174 3423091 3194614 3007348 2876584 2769162 2670546 2572719 2488887 2403954 2323363 2256342
19164 2256342 2205886 2169755 2107661 2031225 1942865 1856751 1795505 1743127 1694889 1636503 1574794
19153 1574794 1516440 1458333 1404735 1364024 1313691 1257334 1206401 1147369 1093977 1046026 992069
19142 992069 942655 907967 869019 844331 818080 765094 723557 703727 689115 682796 684035 673760
19130 673760 648758 615294 581868 560620 548345 536093 527084 518690 508768 498514 480302 461975
19118 461975 444759 405827 370389 356504 356751 346974 326985 309891 287676 269518 252134 247689
19106 247689 245018 239532 242116 234753 226956 222760 224434 225369 217086 215882 212840 219244 221444 222467
19092 222467 231008 233830 239968 254946 264642 250245 228121 206174 199394 206485 211716 221544 218179
19079 218179 218805 216886 220561 229868 244836 263403 276492 292111 326339 402974 512691 616464
19067 616464 643227 590264 506916 417500 340550 292660 261417 229766 206773 180012 164364
19056 164364 157187 141667 130780 116373 111642 112370 131533 146898 136188 130588 125454 136689 136152
19043 136152 142567 153797 146204 139767 138277 137746 148198 153474 155248 168669 175133 165952 151066
19030 151066 138364 142529 143629 130532 115487 110516 120441 114838 107309 106572 110522 123734 121329
19017 121329 114908 112070 108610 103581 108213 114990 120973 125365 122772 125006 120182 114224 109328 99918
19003 99918 92417 99703 108553 125061 124554 126856 128166 129133 115521 110020 120384 127267 132079 129051
18989 129051 142688 154804 151652 145559 135055 135696 139001 142841 150942 149385 142697 137505 135325 129277
18975 129277 127421 123600 125301 127739 127801 124719 133021 123356 105859 99949 115566 107363 101001 101242
18961 101242 98480 104519 104246 108215 112202 110443 111588 122028 114877 112533 110040 117307 118826 125869
18947 125869 144450 149648 144277 133762 128371 133286 126520 117575 105125 102983 97819 100162 109562
18934 109562 108805 106127 98948 88761 78606 82292 86428 93838 97766 105012 108632 104897 118130 128394
18920 128394 124219 123818 118866 113787 117123 119136 120365 125291 121614 103157 121656 144499 152672 149403
18906 149403 142593 152830 147020 141299 147352 139510 129096 135321 137142 144724 153037 151580 146893 140830
18892 140830 139144 134295 141631 155629 169241 171138 175064 178030 185900 169985 156466 152176 158561
18879 158561 157191 145232 138731 140151 142157 142268 137914 140544 142255 145594 149340 157512 163652 167513
18865 167513 164841 158470 161999 175868 184714 189099 196486 215854 223188 233088 242325 220051 214817
18852 214817 220675 221889 213104 212197 230385 239670 231762 234428 232255 221839 227849 250432 278540
18839 278540 282592 281134 277349 270776 268184 264668 251494 254524 268835 270586 276202 272511 259232
18826 259232 259165 262398 256116 263287 269406 270515 265789 263011 269954 296254 317469 344481 372455 386076
18812 386076 402811 431525 461342 509154 556843 596499 626942 661365 681772 706782 726723
18801 726723 750200 767476 784472 807292 843809 887152 938358 1016338 1112218 1231832 1401412
18790 1401412 1623964 1909479 2298564 2814599 3488098 4377893 5552703 7302839 10124736
18781 10124736 14315003 18974867 21831409 23070059 23787234 22358304 18544028 14477855
18773 14477855 11161326 8632015 6808235 5533238 4633744 3990451 3503102 3131962 2830986
18764 2830986 2584896 2404272 2288682 2224239 2178043 2143623 2138362 2150694 2174705 2177800 2187397
18753 2187397 2212274 2232738 2238012 2241545 2252931 2276736 2317407 2394385 2479925 2585965 2753211
18742 2753211 2969995 3231807 3581121 4049837 4669516 5476177 6551767 7967459 9861610
18733 9861610 12739640 17348602 24127473 31732795 36996212 39428592 40463404 38425480
18725 38425480 32529078 25598835 19720822 15191299 11864867 9525762 7859778 6624532
18717 6624532 5694145 4972946 4408968 3989996 3658267 3403903 3229605 3107945 3006176
18708 3006176 2936226 2886869 2854527 2831813 2806300 2772808 2741903 2716533 2689982 2683394 2685721 2696942
18696 2696942 2727454 2768232 2812652 2878838 2969477 3052512 3138659 3254833 3433279 3671138 4030183
18685 4030183 4535072 5207822 6236049 7990668 10769405 14244944 16787561 17783468 18361465
18676 18361465 17847091 15254040 12054206 9351313 7272399 5736867 4639315 3863091
18668 3863091 3301253 2864031 2533953 2281560 2072408 1906105 1770373 1659199 1560008 1481772
18658 1481772 1423960 1391227 1372734 1350303 1327914 1321054 1302655 1276871 1244858 1216883 1198873
18647 1198873 1178181 1150607 1124514 1101424 1077103 1055423 1019209 979350 946204 906668 862486
18636 862486 808643 771556 734955 691319 663829 628470 596620 557362 531993 514512 495212
18625 495212 491484 473051 452999 442879 431772 417984 402454 389085 381828 366563 351091 351239
18613 351239 351858 350017 362878 364958 352431 342193 349252 348656 344762 335647 317753 310611 297895
18600 297895 274191 258387 240014 239011 228873 220467 206087 194986 192749 203801 218217 207685
18588 207685 196041 203653 205619 201631 205887 208313 217995 224057 225935 236081 235023 211445 203328
18575 203328 204857 207256 209811 229634 236316 224151 229943 244004 257883 270609 276973 276859 278937
18562 278937 280467 288284 303838 315329 330903 339672 338194 335853 336544 332707 338654 334004 331400 326478
18548 326478 323146 334054 347518 350147 352980 373329 402161 432925 448578 439637 438658 433010 425103
18535 425103 419874 422423 440324 447659 457487 469843 478578 499554 519782 532561 536925 535894 547844
18522 547844 566478 577848 586210 600731 605832 613800 623837 641974 677221 727789 792710 851070
18510 851070 921981 1004966 1104204 1229618 1409906 1642552 1883595 2041055 2114212 2187970
18500 2187970 2307992 2518620 2816345 3169408 3520718 3917515 4438528 5177544 6178193
18491 6178193 7548615 9376560 11876212 15314674 19912593 26596140 38192592 58061244
18483 58061244 84257450 102894087 100223444 82368809 62639078 46455901 34354264
18476 34354264 25839648 20006186 15991213 13147041 11062417 9481012 8249224 7288430
18468 7288430 6575932 6077117 5769334 5572175 5366276 5102336 4836680 4663325 4597358 4507360
18458 4507360 4337437 4118353 3909399 3750693 3612501 3502657 3446281 3413901 3386749 3372104
18448 3372104 3387403 3418934 3422359 3409984 3367858 3266281 3126476 2973983 2815389 2665196
18438 2665196 2521363 2383234 2251183 2122461 2011937 1905575 1811769 1734711 1656566 1577192
18428 1577192 1498637 1423134 1359774 1287931 1221489 1163356 1111092 1076589 1039031 973943 918969
18417 918969 880502 851135 826758 784288 750398 725928 703138 660187 625170 586777 540298
18406 540298 515379 491155 472771 461235 440193 421166 399490 377663 374873 376007 368225 340929
18394 340929 328637 329166 322726 313143 289389 266603 250174 249956 247332 231273 219637 211906 205920
18381 205920 204057 194884 185439 179474 173299 175469 174601 170978 172253 163134 150361 143668 141127 137372
18367 137372 140282 142157 151650 163641 173298 181316 190188 200667 202038 215405 232817 240807 226505
18354 226505 210539 197877 173256 154598 138106 116562 101697 101616 97229 87800 88346 79275 67936
18341 67936 69787 76706 70529 69957 72597 60591 57703 66517 73217 67185 56714 60092 51016 51947
18327 51947 59444 66615 72710 77371 73579 60056 60972 62377 81465 108328 137485 132310 130729 135102
18313 135102 127628 119760 105882 89795 96496 108291 106410 100237 88311 82243 85799 90518 95570
18300 95570 101179 101091 99878 96311 93495 83271 80149 93726 100267 98873 104380 94810 84810 98675
18286 98675 110050 116336 120423 127112 137724 138212 148458 149274 151797 154679 153558 172894 183015 191363
18272 191363 195060 182193 169521 160869 140461 132211 123985 105841 113235 112434 117681 119854 114875
18259 114875 116935 124816 126360 122293 140648 165652 180178 184470 178691 164399 152419 141021 119228
18246 119228 104411 98415 85571 89202 89690 90372 90906 88257 93297 100225 107482 125420 163576 188561
18232 188561 191244 187917 187906 172184 172857 175047 173688 165081 172996 190866 221560 261839 301930 330991
18218 330991 315784 269504 215517 174534 154411 139192 131332 123449 123055 125412 130755 144448 170265
18205 170265 201148 235707 249613 247970 249849 252169 216622 189252 169754 150948 142111 133394
18193 133394 126403 123286 116043 110743 110314 104493 99958 109886 118576 127208 123706 129122 145191 144225
18179 144225 146099 154583 159321 162322 149508 140971 132722 131722 130255 135538 145591 143779 159315
18166 159315 164158 179056 184434 179585 170629 173065 178334 190502 207687 228464 248255 266407 289002
18153 289002 306705 308368 313611 323693 327043 322437 329341 344270 364783 379509 399980 412427
18141 412427 416405 440468 466538 502633 502774 463138 409180 370780 362984 361118 374240 383814 381319
18128 381319 389543 415202 436913 465244 511280 560520 610793 676474 763655 877862 1029003
18117 1029003 1241348 1505718 1848712 2347386 3043449 3972101 5494947 8448222 13339865
18108 13339865 18484840 18900971 15363495 11553154 8568896 6299782 4745644 3722076
18100 3722076 3038566 2576377 2250812 2014679 1835773 1688330 1573151 1456713 1343895
18091 1343895 1250646 1182840 1158578 1139163 1120292 1098233 1068975 1022214 960213 882784 819557
18080 819557 753069 707497 696143 678931 667044 673305 672532 677576 679130 694508 710334 712770 699225
18067 699225 682214 657607 629437 586548 546361 524369 504275 490913 470324 473201 500619 536856
18055 536856 580782 641910 715566 790553 846175 862113 847000 813520 790339 762335 730800
18044 730800 686322 606468 539738 490483 448148 404483 359518 323753 288496 248799 250464 235383
18032 235383 214276 205603 199507 189918 166968 149412 141832 144537 138170 125327 124961 118478 104219
18019 104219 93423 100609 105795 111464 114385 111717 109319 111966 109397 122017 113752 112537 110479 108239
18005 108239 119194 131468 135349 146438 158346 172176 194045 226959 267439 302829 328012 361663
17993 361663 405209 463976 530954 606475 685255 742115 795430 872947 975096 1044438 1067635
17982 1067635 1066511 1078528 1071846 1045537 995128 935678 888721 824650 731768 636432 556289 482871
17970 482871 418695 370872 338089 318621 302726 288543 272700 268069 266490 245211 229344 220863
17958 220863 215968 213457 224078 241190 246935 261681 271602 295897 316566 330592 353590 390212
17946 390212 410198 423450 431458 443754 471860 494902 502487 506358 529294 545243 549259 551252
17934 551252 554784 572610 569530 553730 543477 525458 505576 463658 425106 375840 344323 301679
17922 301679 248284 214137 189517 169281 149939 135975 137196 138988 134794 141456 145218 148518 158384
17909 158384 154688 139160 111665 95801 93830 104488 129022 122729 122057 130426 124049 123800 135692
17896 135692 155641 173732 196463 243469 308744 398610 526584 616906 622563 568921 477830
17885 477830 377629 304770 262864 227186 196641 169189 143129 127756 106110 101148 107459 99621
17873 99621 95800 78558 57574 45599 42831 44682 48606 45526 45331 44767 43233 43637 47038 49246
17859 49246 44413 42381 42483 37994 34523 34802 24134 16891 22825 26728 32077 29958 29953 24474 24646 16557
17843 16557 13555 24767 29781 24716 26427 19503 8852 13039 10790 12706 18824 8211 3004 -8083
17829 -8083 -14657 -7660 -7333 -16876 -20188 -20224 -10452 -594 11651 10007 5193 -1418 -12125 -9029 -6021
17814 -6021 -321 -4675 -13992 -6300 -11817 -13983 7347 418 -4319 -1424 -2381 -9024 -17509 -23516 -12418
17799 -12418 -1304 4714 -390 -486 -7795 -3303 14348 16324 11999 9568 23333 25845 21505 13502
17785 13502 17717 14882 11273 16610 21630 18796 11643 10422 14634 16555 18175 2960 -2253 -1549
17771 -1549 5090 4606 12746 20172 18463 9405 -10305 -10196 1088 -1103 -9176 -15870 -16133 -16894 -9095
17756 -9095 11921 20196 21888 26242 26742 21746 11285 198 336 8609 2339 -10774 -10395 -4263
17742 -4263 5600 4953 1379 -3893 3058 11135 23084 20182 8175 11162 23852 23922 24120 11450 8326
17727 8326 14255 19083 17531 13845 15952 21282 25169 25843 38081 40700 32691 4738 -13180 -6070
17713 -6070 1153 2996 -1617 4729 -2936 -6461 -7201 3575 14015 1970 -9851 -9730 -10416 -18097
17699 -18097 -13398 -7923 -5149 -9844 -9356 -1796 -16983 -24964 -11496 -895 3097 9680 8094 3476
17685 3476 1860 -2942 -9435 -13209 -7513 8129 8733 10081 10740 18518 18254 30040 39317 29462 19287
17670 19287 28888 25116 17163 3884 -1627 -4513 -5449 468 -4645 -13125 -12591 -335 1244 6391
17656 6391 9111 -1151 -1603 -12561 -6749 -663 9054 10078 11080 5905 -1554 7583 7739 -2926
17642 -2926 -5643 -4091 823 -5839 -13548 -11914 149 -1962 -23234 -29147 -20881 -24175 -24559 -11736
17628 -11736 -3294 613 23 -1552 -8320 -7660 -14943 -26416 -27075 -10258 5039 11208 5450 -669
17614 -669 -1653 -4119 -7118 -8681 -20438 -16728 -3226 -130 -1999 -3703 3222 4735 2807 3915 -8802
17599 -8802 -12822 -7903 -1680 -6917 -5540 -5425 -9725 -8724 -10581 -17119 -11364 -3293 3026 658 -12426
17584 -12426 -19936 -22205 -22590 -2512 -2371 453 498 -11402 -10236 -9583 -15444 -9708 2695 1998 -6070
17569 -6070 -4658 -1171 -7089 1553 -1416 -13611 -18347 -4797 3708 10798 14456 7621 2997 -3604
17555 -3604 -10557 -9177 -13736 -25685 -17844 -8136 -6020 7185 14326 3490 6063 1017 -19243 -8198
17541 -8198 3554 1533 377 -386 -11543 -19984 -11825 -1009 -7220 -19483 -14430 -8493 -14368 -8210
17527 -8210 -1727 118 -1558 -2541 -5841 -5784 -17386 -10788 1417 5503 15210 20603 8817 2127 -1567
17512 -1567 -7463 -6297 -3154 650 8799 13210 3804 -535 -14574 -16656 -2882 19314 23026 7414
17498 7414 5609 5982 4866 -157 -3624 -13046 -9513 -6950 -16258 -14488 -9255 175 -6795 -11777 -10179
17483 -10179 -4286 2288 373 -6583 -9232 -1240 -9829 255 3748 -4186 -8192 -9257 -2151 6500
17469 6500 4018 1738 3094 8676 -6352 -9286 -7223 -14315 -19313 -15104 -10518 3770 3502 -8075
17455 -8075 -4723 1734 -187 -4279 -2650 807 7550 10470 8110 4809 6719 16736 48266 88868
17441 88868 107912 90798 69302 57436 46547 36194 22598 23073 13588 3555 -7216 -4614
17429 -4614 6757 16828 23311 26237 26675 6550 -6624 -3479 -19815 -24161 -21080 -19344 -12719 -5148
17415 -5148 632 6410 1501 4105 19963 14821 5873 -12043 -9757 -5160 5946 10779 15230 14493
17401 14493 10938 -1929 -2521 -8220 -8443 -9192 -528 3359 -2956 -8686 -6833 -2841 -2974 1859 -5747
17386 -5747 -24502 -29113 -23295 -18000 -16878 -9749 -6670 -8986 -19405 -11866 -3509 2243 15100 8746
17372 8746 3463 1362 -5115 -13550 -20041 -17857 -5828 -9236 -11924 -17632 -19297 -12540 -12634 -4640 -6688
17357 -6688 -16479 -17482 -22551 -30411 -27463 -9542 -3406 56 5507 -8876 -4062 -3070 10042 18749
17343 18749 11316 15636 15409 2415 -327 -9862 -21587 -16578 -4255 -10752 -20403 -21495 -19836 -5680
17329 -5680 811 -6673 -10438 -647 1921 -4553 -2462 -10031 -14392 -8394 3270 13583 10384 4238
17315 4238 -8315 -5901 602 -960 -1120 -2626 -10757 -11650 -6397 -19563 -20891 -15082 -13434 -17019 -8238
17300 -8238 781 2739 647 -6909 -12398 -11758 -12217 -6766 2058 -3576 -5374 -616 -8298 -17906 -23787
17285 -23787 -18239 -12823 -16319 -18529 -24355 -27311 -15302 -17659 -24868 -27114 -34341 -29326 -21296 -20445
17271 -20445 -16178 -18400 -9760 -11194 -4540 -7912 -80 -828 -13783 -17488 -12997 -9996 -9941 -6324 -12893
17256 -12893 -12584 -9904 -11799 -17966 -15435 -4083 -856 5965 -4501 -13992 -16506 -22387 -14283 -13105
17242 -13105 -17903 -20708 -34243 -34932 -21998 -6755 621 -1738 7128 9830 4736 2136 -7319 -7095
17228 -7095 2025 2901 -10755 -18128 -20809 -1772 6883 2838 -2398 -8630 -12639 -11324 3451 21499
17214 21499 11999 -868 -22885 -31482 -33729 -20647 -20248 -31934 -27016 -12184 5370 9613 5149
17201 5149 577 -5783 -3410 1559 -1656 -13448 -11446 -10600 2029 20393 13889 -2276 -16806 -10616
17187 -10616 1998 -810 -5839 -11458 -2072 8769 10794 1639 -2046 -4154 -5181 -6515 -14597 -21999
17173 -21999 -10578 3441 13 -335 -1031 -4338 -11730 -8644 -1435 -856 781 -7331 -14558 -9614 6497
17158 6497 4781 -7493 -13949 -15617 -16292 -21404 -25897 -18929 -10018 -7076 -18524 -13239 -15032 -13150
17144 -13150 -8624 -18533 -16027 -4418 -6410 -8849 -8600 -2703 8167 7640 6627 3740 -5720 -13673
17130 -13673 -14318 -9100 -8466 -12824 -1061 3879 10112 9556 7027 5342 6997 -746 -10265 -12541 -9585
17115 -9585 -15749 -9438 -8392 -1706 -4014 -10098 -9207 -1966 2170 5492 -9225 -10888 -7895 -19690
17101 -19690 -20228 -14569 369 196 -9334 -14669 -12693 -14985 -16988 -7039 -2684 -8054 -5611 -3054 4034
17086 4034 10154 -2632 -3164 -2419 -2283 -4584 -9366 -8525 5226 6251 -170 7493 5643 -7065 -9644
17071 -9644 -6879 -5486 -374 5119 863 -18144 -22824 -20081 -21584 -18820 -15256 -19673 -20822 -15885
17057 -15885 -9518 -1783 14110 7673 -9994 -10063 507 640 -15157 -18781 -6779 -7718 -11489 -10510
17043 -10510 -11872 -8538 -450 -5560 -3015 -5431 -10370 -10358 -6828 -11329 -7712 617 3861 -5350 -6010
17028 -6010 176 -8453 -8552 -12140 -6671 -7079 -6915 -16680 -22593 -30819 -34216 -30105 -18886 -10527 -3016
17013 -3016 -8361 -27052 -45114 -48423 -42542 -21674 -6965 -10171 -7252 -368 -2994 -12462 -18199 -5247
16999 -5247 -6834 -3176 -1145 3983 -10645 -16976 -22786 -23305 -19798 -15204 -6137 -5659 -837 -1241 -1827
16984 -1827 -7802 -5602 -5543 1518 -7169 -16317 -17969 -8242 -10861 -31646 -33905 -31323 -24946 -15816 -10102
16969 -10102 -3986 7442 4637 -9006 -20743 -14682 -13282 -2433 5795 -1606 -11690 -9817 2539
16956 2539 15660 13835 11939 4585 -4102 -3205 -900 -3206 -12389 -9244 -2588 1854 19521 23587
16942 23587 10114 2790 -2841 -11909 -10898 -3312 10687 16260 -5230 -15759 -8070 -29 6308
16929 6308 6499 -4684 -8034 1919 9028 11721 1314 -10550 560 5063 2772 13067 5005 -4467
16915 -4467 -11066 -9540 6806 19141 13265 3104 10918 15788 3155 4620 10516 11016 2869 6429
16901 6429 8736 7828 2470 -1463 3417 907 -2803 -5042 680 -4153 -20254 -16022 -16028 -24999 -17203
16886 -17203 -6083 -2256 -4614 4166 1605 521 -7749 -21978 -29992 -27721 -23048 -23445 -12679 -10514
16872 -10514 -10593 -10307 -11630 -15762 -19524 -25879 -23326 -5744 -465 -2852 8322 8762 1580 135 -118
16857 -118 -12272 -16769 -10739 -9350 -6325 3081 19245 24297 30834 26108 17391 7410 8854 3264
16843 3264 1560 8029 13487 14159 10727 6670 458 -3742 -6071 -3637 1228 -10565 -12430 -4711 -13372
16828 -13372 -18733 -13353 -15986 -30011 -26364 -11073 3463 8536 2405 -7922 -9002 2215 3279
16815 3279 630 -60 -9174 -4859 130 2218 3130 -6958 -8491 -9804 -11581 -26673 -30258 -14817
16801 -14817 -11392 -19693 -20679 -18412 -17201 -14519 -16148 -10749 -12574 -2731 4939 3883 -5724 858 856
16786 856 -2841 -11122 -16757 -13867 -17695 -16291 -20049 -28243 -26599 -9186 -8561 -17262 -17098 -16567 40
16771 40 -10996 -19777 -14748 -19886 -24216 -14791 -10696 -9362 -8863 1942 8691 3396 1246 610 -6647
16756 -6647 -15172 -17907 -15607 -7667 -4042 -10412 -6023 -11413 -13812 -22566 -23170 -17326 -9860 -208 2132
16741 2132 12267 5785 -4003 -8534 -5690 8072 9829 7776 3623 824 6319 2755 -13643 -19698
16727 -19698 -22509 -24440 -32514 -22883 -12061 1337 5319 -4420 -7841 -9294 -15061 -11928 -6143 -3454
16713 -3454 -8486 -11064 -11126 -4805 -5389 -14789 -11294 -17745 -20757 -21740 -17828 -13454 -8635 6269 3496
16698 3496 9432 6990 10578 10709 75 -10427 -9218 -8032 -9275 -27017 -23901 -2651 11959 13859
16684 13859 677 -9495 -11026 -12059 -12940 -19877 -11162 -14431 -19704 -28783 -30063 -19076 -12420 -12007
16670 -12007 -4690 -9440 -11171 -11094 -7038 -3224 -4135 -438 10437 15073 9867 -2038 3592 23780
16656 23780 31865 32434 20981 5380 2484 -1515 -1012 5114 -817 -10791 -3686 -4944 -9497 -18029
16642 -18029 -17422 -1559 6500 1385 -11278 -13107 -4277 -8254 -13150 -9389 3068 16393 14026 13314
16628 13314 10478 4198 3957 -332 -7397 -15765 -9548 7110 5710 4431 5166 6795 4587 12265 17886
16613 17886 14485 4869 -2535 3148 -1317 -12877 -22536 -19320 -15757 -19573 -15772 -9913 -20295 -20603
16599 -20603 -9488 4468 12372 12428 6222 -9484 -9836 -8930 -14837 -12143 -18782 -23796 -14816 -12628 -12072
16584 -12072 -3958 3312 6862 13575 3361 4172 16800 23549 16487 13438 10638 10265 8804 11510
16570 11510 9944 20312 16354 10655 2825 -2956 719 -2944 -11633 -2679 1362 -3056 424 2126
16556 2126 823 -7478 -10827 -7684 -10369 -10371 8061 9213 723 2868 -3261 5521 15441 13371 11100
16541 11100 10352 13260 -3381 -2274 16006 11700 7396 10126 9362 -2213 5214 8860 -5430 -9086
16527 -9086 -11127 2228 8463 6647 2480 2613 -2242 -2146 7764 16694 1267 -2310 507 -3165 -9154
16512 -9154 -9099 3698 981 -12899 -9731 -4337 -2623 -9334 -12232 -8351 -9430 -8417 -8626 -12083 -3926
16497 -3926 -11739 -13012 327 -609 -9008 -20429 -28086 -27916 -19781 -2136 -10850 -22232 -13398 -15940
16483 -15940 -15485 -5867 -17674 -19551 -18865 -14101 -17958 -18709 -10265 -478 8650 7947 5602 7040 -3349
16468 -3349 -10822 -10576 -979 5656 1661 -6823 -13787 -19732 -12688 -433 -2436 -16161 -17265 -12677
16454 -12677 -10773 -6882 -10258 -3566 3632 5113 -2606 -106 -10970 -7022 -4473 2573 7735 -3817
16440 -3817 -15977 -19657 -9757 1515 -1568 -1891 -1135 -13729 -28627 -29739 -19969 -10958 -9111 -6821
16426 -6821 5693 -763 -1795 -2460 -2130 -3124 194 2792 -5704 -7468 -17488 -10614 1856 -7078 -10773
16411 -10773 -3971 4072 -1688 1823 7541 19898 26339 23641 11135 5785 -9249 -308 13881
16398 13881 17742 9615 394 -1468 7071 7004 4422 -1539 -5929 6310 5962 1741 857 2230 -2798
16383 -2798 -7428 -12171 -9370 -13175 -11705 -7255 2693 3757 -7054 -19984 -22372 -22608 -19767 -13558
16369 -13558 -2851 1477 -3908 -3558 -6743 -15751 -23289 -38512 -28123 -17742 -13858 2097 3388
16356 3388 1277 7511 14742 9516 6728 -3404 1310 2313 -51 -855 1975 2026 6517 6584 -472 -7287
16340 -7287 -13802 -8323 -3218 3915 6370 2833 4168 -1796 -12145 -19584 -13659 -3610 6440 -2816
16326 -2816 -5695 -2392 2782 -4753 -36 15262 18168 16245 7685 9546 7370 5536 4055 5832
16312 5832 10376 7653 2659 6965 10470 4117 4670 5196 234 1608 12859 18023 20230 13854 -1423
16297 -1423 -3269 3590 9990 3292 -7971 -11962 -5725 -6424 -5382 -4889 -19094 -20675 -11950 -8652 -13893
16282 -13893 -19633 -17468 -19365 -25490 -20951 -16730 -2421 629 -7894 -2493 1034 -3354 -4962 -6999
16268 -6999 -12751 -15592 -11952 -3694 -6587 -10959 -8142 -6560 -15399 -23083 -15892 -9111 -10551 -7258 -4051
16253 -4051 -10488 -7025 -9893 -13854 -16484 -7027 -1528 -4538 2394 14717 -939 -22352 -20798 -14364
16239 -14364 -19325 -22220 -17422 -7690 -4348 -9153 -17812 -12029 -6310 -8533 -12763 -8544 92 -3560
16225 -3560 -14046 -20278 -20580 -14910 2454 10869 -1390 1207 -5682 -10911 3593 4870 -4995 -7398
16211 -7398 -10242 -2271 -7947 -20244 -16744 -4493 1349 10843 16320 11182 8815 3965 2831 3377
16197 3377 14850 11888 2360 -10368 -9769 -11710 -9410 -14509 -14182 -23660 -26439 -15914 -6076 -2768
16183 -2768 -1170 -1092 -11434 -3216 7133 8452 -7584 -13945 -12745 -14222 -11489 -5656 7567 17038
16169 17038 21339 22477 28713 33009 25526 6316 -3137 -175 2542 8469 10183 13533 3347 -4287
16155 -4287 2796 -2334 1495 7436 10567 1054 -4164 -2088 -8891 -7221 -6798 -3220 4948 3535 -7608
16140 -7608 -14392 -9806 -2944 -786 8219 6203 8807 1331 1246 2821 2106 -3166 -9584 -11024 -13775
16125 -13775 -16037 -20115 -22602 -25022 -26273 -16371 -4111 -3106 -6310 -453 -4396 -7689 -24723 -22838
16111 -22838 -14796 -9185 354 -12474 -22594 -16224 -2128 3267 6817 4752 3992 6648 -1893 -7507
16097 -7507 -215 11803 10139 3107 2194 8620 11195 16783 8666 -2751 -11175 -7897 -4873 -832
16083 -832 9226 4553 -2110 -3242 -25 -12807 -16846 -11206 -3281 2840 -6658 -9222 -5881 -5099 -134
16068 -134 1645 -4 -1676 -4258 -5682 -2313 -4492 -9270 -12443 -12759 -7106 -7211 -8923 -5889 154
16053 154 3091 2046 -590 -18344 -24424 -19268 -16612 -20467 -13941 -19057 -17813 -10170 -2751 1755 11119
16038 11119 13268 21165 12618 -1318 -2764 1704 13349 15143 4810 4145 -4354 -2258 3017 -2452
16024 -2452 6204 13298 -4914 -15439 -12412 -11267 -1784 994 -3969 -10980 -12255 -6891 8788 15897
16010 15897 5963 -1085 -6301 -6498 3521 6099 10991 11649 10251 8955 4515 -1058 2121 12305
15996 12305 13319 3945 -846 3236 4803 -3103 454 12683 12505 10514 4728 -3062 -7959 -12216
15982 -12216 -10406 -9375 -10412 587 -4184 -3612 6936 16874 14121 10352 15657 17195 15377 15647
15968 15647 13709 1109 -10321 -19130 -16164 -328 2746 -5953 -10322 801 909 -10505 -20945
15955 -20945 -18934 -3243 3044 -8827 -16527 -7488 3581 10397 5150 -1410 -2320 -7451 -27229 -24168
15941 -24168 -14590 -13966 1061 16315 24455 11547 7118 2951 2449 -16810 -25744 -17827 -13173 -15429
15927 -15429 -10758 -4087 -7755 -12452 -16212 -19630 -13946 -5301 -8709 -18049 -8750 456 -4008 -11815
15913 -11815 -23859 -30762 -21400 -12158 -11759 -10318 1822 5409 4550 5862 13706 15162 13903 2151
15899 2151 2093 -5728 -8411 -10683 -9527 -10527 -11421 -6326 -4060 3303 8360 7691 -3182 -16662 -12641
15884 -12641 -3579 -9008 -3443 2514 2702 2669 -3119 4302 16507 11077 1493 -2840 -630 -1434 -12901
15869 -12901 -17137 324 10042 -2920 -9087 -3243 -603 -6450 -8869 -18220 -16120 8103 11764 7906
15855 7906 -2965 -2820 -3064 -4850 3754 10869 8145 2230 10516 9527 -2639 -5595 -8955 -13865 -19404
15840 -19404 -22449 -19745 -12590 -8990 -10688 -4149 -4311 -7520 -12571 -8407 -4843 -12579 -7899 -2052 -7660
15825 -7660 -15193 -7906 -3759 -2294 -2423 -5204 -2026 -3829 -12411 -17166 -9140 2955 1876 -1559 -9829
15810 -9829 -11282 -18379 -14762 -7836 -13147 -17992 -14736 -8148 -6410 -2073 -2074 -11519 -5523 223 2095
15795 2095 9108 17306 15934 6834 -6402 -11510 -1738 4325 -8226 -20972 -19394 -19282 -10805 3402
15781 3402 7954 9482 -1963 -8542 -17684 -14170 6141 17117 4591 1148 -8817 -24294 -24814 -15054
15767 -15054 1720 786 -1880 8436 13052 4511 -1018 6694 16162 14751 19403 5495 -64 2127
15753 2127 -7175 -24121 -22466 -4758 2072 1436 -1740 1509 9911 13835 6805 -4154 -4038 -980
15739 -980 -1205 -1759 641 -2365 -2431 -8223 -13407 -6712 -4305 -27720 -33964 -19254 -25524 -33405 -20193
15724 -20193 -14220 -5086 -2311 2446 1841 -671 5064 1498 -3806 7931 24107 21671 22401 17661
15710 17661 3323 760 -6446 2905 7983 6915 3908 -3189 -593 3894 -2674 -6755 -1920 12794
15696 12794 18645 10236 3213 -8551 -3188 2515 -1310 -6350 -3844 4901 7318 11617 -7088 -18305
15682 -18305 -5430 -1520 5483 13866 12286 4299 -5155 -12458 -6655 2239 643 -8455 -11988 -14819
15668 -14819 -9657 -9800 -15807 -12546 -1914 1573 -373 589 11447 14901 15933 14466 21381 16107
15654 16107 -1663 -4583 -10839 -7653 -10408 -11838 393 7037 10619 3621 3187 12193 10402 8513
15640 8513 11549 8488 8172 -948 -3914 -10577 -15442 -15938 -9471 7862 15945 14002 21900 18675 10603
15625 10603 11574 10403 -4263 -2646 -630 3031 -1460 -8680 -17285 -16682 -11418 -8623 -10389 -9390 -5878
15610 -5878 -2690 -5197 -7072 3222 -3 -12574 -13176 -17617 -23822 -15619 -2106 -1524 -8644 -10161
15596 -10161 -17715 -24751 -16037 -4906 -5448 2259 7230 12309 12780 9709 5451 -4361 -10731 -8194 -9586
15581 -9586 1458 11689 7497 14385 11059 3981 -5234 -2888 -12412 -7700 -4465 -16943 -25425 -23848
15567 -23848 -19647 -15647 -20487 -14323 -17623 -19916 -12872 -11058 -8787 -5424 -14818 -24066 -17467 -14430
15553 -14430 -13102 -14064 -9519 -10714 -7808 -3184 2780 5690 -7912 -2689 7872 8792 5143 -5333
15539 -5333 -3535 -3691 -8470 -12432 -14925 -14932 -14054 -3622 4346 6501 -12990 -40487 -32924 -16164 -13521
15524 -13521 -29176 -25911 -21191 -11877 -8503 -1022 -3950 -8326 -12390 -17668 -20423 -19485 -18562 -16379 -6957
15509 -6957 -19455 -28701 -12547 -7642 -8638 1002 11125 8987 6241 -6357 -13096 -4009 5270 6357
15495 6357 17973 22543 12204 8698 344 -11096 -11771 -2318 -2553 -9284 -9058 -17246 -31270 -31118 -16074
15480 -16074 -11065 -9887 -4750 2258 3397 6697 -7186 -17183 -13985 -702 -5787 -1915 -9441 -15160
15466 -15160 -11199 -1778 1906 2555 8439 7698 5636 4098 -10986 -15268 -6872 -4301 4109 4579 -398
15451 -398 106 2775 2299 -3206 1823 6243 3903 10492 8091 -4345 -9945 -6514 -13418 -26071 -25083
15436 -25083 -9986 -7637 -2213 -4316 3183 8360 1578 -9218 -13352 -14926 -15969 -5329 -1161 454
15422 454 13256 16607 4697 4134 69 -6370 -9562 -12093 -2295 5825 5115 -7241 -12512 -8564 -14257
15407 -14257 -16395 -7511 -515 -11332 -12709 6193 10744 4197 11277 5896 -10716 -7971 -8474 -17736
15393 -17736 -19465 -13510 666 5696 325 -10560 -23896 -28659 -30628 -35972 -31976 -29691 -30939 -15331
15379 -15331 -1613 13561 6302 -3690 -6768 -8758 -109 4016 5438 -9550 -16649 -2375 5724
15366 5724 9395 -4670 -12702 -23639 -22174 -17034 -24447 -13877 1793 -1255 -8594 -9478 -7876 -14753
15352 -14753 -22012 -16059 -13686 1138 3814 -4834 -16416 -8125 -6683 -18803 -16589 -11450 -7463 -11076
15338 -11076 -17082 -18115 -18651 -16404 -10225 -11063 -5521 893 148 1160 -4570 -6672 -2371 1461 2299
15323 2299 -6055 5597 1138 -4866 -2109 -3166 -3106 -6921 -13077 -9977 -4855 -12710 -15591 -15677 -2064
15308 -2064 -182 -3491 -12216 -9592 -5880 -4856 -158 -5222 -15344 -16641 -19718 -9692 -7 3170
15294 3170 -9692 -15039 -10472 -8910 -9183 -10634 -10516 -16075 -8323 -3327 -20524 -29077 -28323 -6620 -3258
15279 -3258 -11525 -3062 7668 692 -11133 -13371 -18251 -13028 -11223 -14807 -16908 -12134 381 -1615
15265 -1615 -7805 -6877 -4805 2850 -3214 -2090 -5626 -12826 -858 -5317 -485 557 1555 -6933 594
15250 594 15938 24614 22328 4461 -3815 1509 -12387 -17826 -18365 -12845 -9510 -8020 -9581 -19452
15236 -19452 -22925 -10782 -12674 -10819 -18390 -16542 -2871 -1651 -241 5801 7638 5145 1422 -10627
15222 -10627 -8842 -21181 -20039 -10716 -17623 -21221 -17676 -22201 -19332 864 11785 19676 13800 13016
15208 13016 19498 15377 5142 10301 13030 1435 -5309 -4125 6010 8651 7275 -667 5128 1731
15194 1731 -7674 -9529 -6706 -9429 -12967 -10464 -14657 -7706 -1911 -3183 -2859 2943 3809 4357 3112
15179 3112 -13779 -22154 -19935 -8835 -14777 -19168 -19066 -13207 -13397 -12039 7488 3607 -288 -4250
15165 -4250 -7070 -3951 -1084 2299 -5998 -5386 -11332 -15529 -14896 -16139 -12377 -11859 -9358 5752 6435
15150 6435 -7 6441 11608 4497 -3349 -8761 -21481 -21797 -15368 -9737 -9237 -7959 -4623 -6462 -2340
15135 -2340 1910 -2834 -12486 -10653 -9319 -3743 -2102 1086 -15533 -15863 -5679 613 -2676 -12773
15121 -12773 -13321 -9130 -12357 -6859 -4456 5303 8934 6339 2278 3749 1944 7762 1235 -446 -5507
15106 -5507 -15332 -22235 -26253 -23608 -21432 -21635 -15387 -5196 5335 16953 23446 23295 13293 12034
15092 12034 10303 -1126 -1999 2853 6427 -1278 1418 2733 4156 -5880 -6779 -3415 2487 -1756
15078 -1756 -3802 3778 8399 2366 1281 11612 3977 -746 -11993 -26052 -5680 10519 22179
15065 22179 19893 470 -3195 -2113 -143 -6840 -7385 -8653 -7876 -14692 -5824 -3759 -997 11696
15051 11696 6632 -790 -2380 -6587 7237 14676 15324 8027 7582 613 -5381 -3965 -5542 2462 10967
15036 10967 9966 798 -2711 212 14294 6580 -4383 8856 22250 32364 35467 23340 20468
15023 20468 24025 16366 3378 3488 6079 1634 4276 14399 12668 4192 -216 3630 13968 4857
15009 4857 1544 -12062 -18473 -5769 14889 27324 29401 28366 21959 20137 28717 49023 66219
14996 66219 75728 55692 41541 33108 14328 650 -2808 346 -2458 -1336 1140 -2980 9404
14983 9404 -5923 2433 11827 12259 13831 11999 16442 18911 19441 15915 11890 8327 9308 8200 7278
14968 7278 3070 -2405 -16231 -16802 -7637 -20277 -23871 -17796 -14929 -1220 2765 7793 8731 16793
14954 16793 18019 10681 3426 5146 12554 7080 -9974 -9218 -15113 -11498 -10850 -14134 -6692 -6692 -6797 -4032
14938 -4032 -193 -3848 -10703 -15175 -12659 3239 13951 10294 15203 14155 8361 -3830 -4145 1612
14924 1612 5956 16372 22779 16760 9239 7816 7257 1756 -3561 -4363 -14897 -33774 -26499 -11622
14910 -11622 -11943 -21069 -20983 -14935 -3599 -2563 -13873 -11852 1476 -3446 -12732 -24617 -17705 -6535
14896 -6535 -4416 2619 2050 -5173 -8936 -14399 -9161 -2864 -4612 -14751 -15007 -1409 4280 8715 11695
14881 11695 2165 5210 11876 7834 9095 5130 2055 1677 15414 19920 11958 6919 3778 2366
14867 2366 7356 13650 2441 -3326 -2350 1592 -4720 -12755 -9470 -10125 -2450 -5895 -13773 -5216 -9116
14852 -9116 -2167 510 -2401 -15453 -17762 -7839 -4248 -3751 -4964 24 -3245 1989 6177 2722 14370
14837 14370 8099 -6779 -17885 -10581 -6744 -3773 -1971 2030 6429 4451 -7057 -8491 -1175 306
14823 306 2559 -1085 9495 16744 23242 17309 5308 -6507 -5755 -8316 -13014 -12947 -7277 5903 12746
14808 12746 1739 -1227 2309 -5318 -11301 -12158 -11904 -25709 -21406 -1139 5014 13020 15992 17117
14794 17117 14567 18433 15414 -5469 -12771 -9238 -8681 2709 250 -641 15095 25153 14026 -12483
14780 -12483 -11648 -8909 -13157 -6894 -4376 -1642 -5109 -1049 -1003 -3431 481 -3573 -7782 -1158 2247
14765 2247 -3476 -11104 -13593 -7694 -4138 4786 4015 5454 1889 4155 6702 5359 14477 22461 12191
14750 12191 3865 -7878 -3430 -1733 2179 -3996 -6750 -4177 -3580 -2391 -10745 -12685 -11115 -17184
14736 -17184 -8928 -2416 -1132 4189 13919 14011 6983 10048 13635 12724 12492 -2736 -1673 5073 11390
14721 11390 14827 14437 4454 -8086 -11648 -14473 -2604 646 4273 3360 17102 17293 15653 15630 9135
14706 9135 -5211 -7880 -2427 -6251 -22608 -32680 -15107 -8618 3172 4893 9338 4201 5357
14693 5357 11441 9317 2552 -2518 -7104 -6469 3180 2413 -2276 -8874 -4242 -9286 -15678 -8665 -14855
14678 -14855 -7257 3438 13899 16670 24426 7361 7350 8550 7697 16338 7843 -6554 -2723 -10013
14664 -10013 -8604 2721 7368 12553 11241 3617 -2113 -13547 -10644 -12799 -20135 -21410 -18031 -9986
14650 -9986 -9477 -11003 -11560 1807 11160 49 717 -4289 -3604 1551 -4239 -14806 -18222 -10092 -7081
14635 -7081 -2155 12748 3031 -2518 -6329 -5421 -10419 -15804 -11538 -11364 -13329 -12072 -9923 -6443 2561
14620 2561 21283 30954 17513 12319 23460 24654 14222 10387 5077 -1661 -12241 -5112 -1070
14607 -1070 -4190 78 -7565 -5664 2693 3164 13635 7268 -9437 -3814 -2962 -1009 5018 2954 5248
14592 5248 11415 15820 14573 4890 -7894 -795 2779 -4122 -2109 4062 17754 5331 -13543 -7787
14578 -7787 4934 1825 -3321 -2802 -2851 12576 28663 30367 18199 13169 18129 20923 16299 5060
14564 5060 -5015 -8799 5877 5508 1 82 -2659 -3123 -1007 11453 7012 7446 8811 4291 7638
14549 7638 7877 5418 6347 2171 -8050 -15860 -7551 -4591 -10279 -8106 1212 8683 -1306 -13659 -21293
14534 -21293 -15064 -17362 -8673 19092 34617 32344 16731 -6778 -6343 3018 951 -5070 -2329 -2066
14520 -2066 8 -241 -6056 3817 8268 10593 1654 2780 2035 2590 -992 -4329 -7605 -13747 -12935 -10098
14504 -10098 -9658 -13988 -13186 -6069 -2953 9721 4242 8686 17096 13350 9662 -317 -7502 -6268 -12028
14489 -12028 -4010 3589 5459 5083 9789 15679 11663 2159 -9973 -5709 3723 10448 21130 16137
14475 16137 3296 -2029 -1761 12527 6237 -2370 -838 -4721 -637 3122 2825 -5442 -15067 -7502
14461 -7502 -609 12693 22883 30479 28227 30682 21406 11246 8378 18315 19268 6526 6838 7617
14447 7617 1426 -3664 -8466 -7841 -3531 -3531 -14719 -7477 6618 5165 2428 -2207 -905 4687 9252
14432 9252 14195 13781 12287 11868 16338 13398 12452 11867 12568 3075 6907 6135 8604 11089 15831 14252
14416 14252 6575 6670 -1066 4988 10317 8001 3141 562 584 1012 107 3578 6317 664 -1213 -5084
14400 -5084 -21794 -12835 -10573 -2460 1464 4841 7511 1602 13149 28573 20032 18869 16698 21406
14386 21406 35971 41834 38238 35454 27532 25010 14310 6509 7908 13038 14717 12690 43 -7295
14372 -7295 1702 -1094 -451 2429 -1490 -746 -4942 -7076 -6042 3779 4289 -6882 -6909 538 -4694 -9907
14356 -9907 -12414 -9328 -6903 -5759 -14161 -16063 -5997 -346 -4882 -1014 2990 4169 -881 1173
14342 1173 1052 -419 -12383 -15569 -12438 -5748 -13737 -19634 -13160 -1771 -1236 5392 -1384 2515 7175
14327 7175 13030 7012 -5204 -4448 10475 10837 4037 4639 5169 2323 7101 16214 15450 -1198 -8804
14312 -8804 -2258 599 3900 1375 6284 2553 8084 11608 22242 21703 9844 -4193 -3414 166
14298 166 -8077 -10240 -12397 -7837 -113 11545 16533 12256 3666 7395 13721 12040 4125 -2153 -7998
14283 -7998 -18683 -13410 -4491 -3993 -16854 -9141 -1347 -5130 -9929 -5457 -9850 -5854 3362 -2791
14269 -2791 -10318 -7730 -9913 -8534 -4581 -7924 -11253 1198 3169 2664 2229 -5359 -8048 -776 6432
14254 6432 3864 -9686 -8992 -6957 610 16316 5897 -16231 -30595 -31545 -30247 -36200 -41783 -20917
14240 -20917 -14851 -12592 -20160 -22778 -14460 -8585 -1647 601 197 -4085 -3129 -9868 -10221 1111 -9441
14225 -9441 -18686 -13839 -12503 -13044 -11299 -17189 -19004 -21976 -17064 -12089 -17061 -8415 -9638 -13271 -27289
14210 -27289 -36501 -28245 -15721 -9317 -13764 -6545 -16271 -7821 -4497 3011 12422 17730 8075 -2508
14196 -2508 -7623 -22478 -23937 -15835 -11606 -4869 -5295 -3031 -266 1875 596 -592 420 -5178 -11067
14181 -11067 -13317 -10121 -14952 -13107 -11353 -5981 -2945 -5958 -12419 -5316 7388 3204 -2876 -2151
14167 -2151 -2349 -2345 -203 4278 1369 16905 14191 6065 -10361 -4927 6276 3652 2764 -3496 -1071
14152 -1071 -516 2484 921 -2951 3597 16666 21317 5859 -1352 5519 10957 20359 20701 20546 5888
14137 5888 -11856 -2580 9966 6407 6876 3016 -7580 -10596 -5578 11939 22365 11878 1058
14124 1058 -1306 14213 13027 -4468 -9944 -6333 -1857 6167 13278 8682 -2833 -12870 -7573 450
14110 450 4767 11390 525 -4040 -9824 -13860 -9161 -4120 -4945 -13065 -17035 -14164 -8216 -1861 -3063
14095 -3063 1362 1642 -377 2490 7297 -1923 -16723 -6126 1072 4650 253 -14688 -21483 -5934
14081 -5934 -1216 -10384 1073 2101 -8496 -13970 -10781 -16562 -4356 3320 16261 14456 10363 6728
14067 6728 -995 -6908 -16007 -15476 -19289 -27996 -31916 -21922 -9175 -9781 -19848 -15300 -13438 -14551 -19911
14052 -19911 -18558 -15987 -6588 -9658 -12515 -9630 -8353 -8259 -4104 -5274 -3907 -533 -7356 -3229 6287
14037 6287 6474 8062 -6850 -18318 -4227 -1096 6106 17491 9969 -4234 -10515 -8583 -5030 -6298
14023 -6298 -3355 -4989 -6401 -1769 -9479 -11791 -986 -4502 3654 5061 11128 8143 16345 6176
14009 6176 -253 -3837 1198 11464 13795 14130 6916 7173 4198 -5555 8930 20839 13964 14340 12817
13994 12817 18539 12350 6924 6281 8444 -6129 -13299 -8987 -3394 1116 -655 -2251 -93 -3741
13980 -3741 -8989 2100 -7092 -6536 4686 8403 12646 6653 -3668 -10074 -7345 -4041 -9101 -11886
13966 -11886 -11172 -12658 -9204 -1054 2030 -10227 -18884 -16961 -17339 -12419 -6403 1220 -5987 -15514 -20686
13951 -20686 -17870 -10307 2106 9533 14153 10436 4325 -5865 -14126 -6529 -3248 -4772 7289 17316
13937 17316 16502 17808 14941 10960 11500 10949 12868 4696 -14178 -15150 -6124 5153 490 -2092 -1066
13922 -1066 3400 2068 497 8530 6909 -2903 -11042 -9380 -262 -3060 10670 14857 6575 2856
13908 2856 -13714 -18634 -20093 -7769 -397 -5611 -8932 -10684 -5247 -9531 -9407 4834 1401 -7255
13894 -7255 -20038 -24235 438 14817 13285 16177 10320 -3459 -9652 -8674 -9994 -8508 -10988 -3595
13880 -3595 3721 12047 12725 -3987 -4338 6045 1989 -7669 -9292 1032 13683 7304 6041 8558
13866 8558 1712 -6475 -10812 -13139 -10047 -7737 -1182 7279 7449 -14816 -16007 -3455 12187 14343
13852 14343 5355 7878 6995 4646 -2055 -13326 -16593 -24209 -24708 -20293 -18337 -14307 -10450 -7022 -1643
13837 -1643 1806 324 4110 9039 4113 86 -9997 -5722 891 12724 11860 8201 10102 13224
13823 13224 6393 405 -8641 -15738 -1013 4383 -1179 -1955 4684 4304 6728 8183 401 -14468
13809 -14468 -18840 -6075 12221 19484 5806 1967 12074 22458 30207 25515 14277 16093 3477
13796 3477 1162 -14952 -20424 -13845 -9269 -4225 -11936 -16999 -21854 -18406 -3557 -4697 -2674 3583
13782 3583 -10781 -5575 -3532 7562 15580 16117 17467 8318 4789 -1281 -3823 128 -92 3753 6343
13767 6343 6791 3820 5622 2970 -3020 1424 9305 4772 10434 6156 6236 6437 6768 5040 -727 -3192
13751 -3192 -17760 -16750 -11378 -5857 -3788 3725 7857 10112 -3324 -16398 -21116 -17219 -7582 -7005
13737 -7005 -21506 -32029 -21680 -9182 3283 9550 6162 996 50 2023 253 -3960 -13132 -8764
13723 -8764 4842 4970 7917 16798 8601 -2191 -3794 1386 735 8614 19983 15664 921 -2198
13709 -2198 743 -2597 -10475 -6373 2287 11334 18750 17144 14640 14267 3288 7164 11344 9017 7015
13694 7015 1201 -8033 2439 16547 17303 -1163 -8624 -10874 -5067 -1266 -1444 -5490 -13626 -16345
13680 -16345 -15640 -1502 4667 -417 -4988 -4037 -2407 5829 -52 -2890 -1638 -3536 -389 11650
13666 11650 9094 8061 12762 13892 3912 2047 4597 -5366 -16537 -15127 -19133 411 1359 -5663
13652 -5663 -2083 -4919 -6155 -9232 -5101 -4375 -16200 -13553 -12260 -1225 -4032 -9769 -9477 -3045 -2728
13637 -2728 3889 5172 -4094 -1787 -215 4683 11757 7431 -6833 -14455 -11942 -8342 9978 12966
13623 12966 18404 20298 21592 16566 220 -2320 3588 5633 -5468 -19346 -20241 -16992 -16135 -19432
13609 -19432 -19975 -18599 -12064 -3867 -4452 -1301 9032 16249 7512 9573 13455 8199 -6977 -2419
13595 -2419 4359 4632 2448 85 -8193 -8895 1773 -297 6585 5955 9377 19050 27131 17494 4144
13580 4144 7898 11058 8013 -2239 -998 -1192 -4584 -5544 -8063 -17218 -19176 -15047 -13964 -1961 -4936
13565 -4936 -9016 -24197 -20590 -12286 -2025 4942 1251 273 7990 9948 6605 2554 6112 9356
13551 9356 16421 11713 -386 -1251 1716 2475 14361 21380 22466 14804 4898 -3064 -7228 -7775 -14127
13536 -14127 -14130 -11135 -9796 -3527 731 6875 18635 8543 4395 12940 16708 9936 -7370 640
13522 640 8652 2704 -5133 -16568 -13942 0 -413 3553 5734 4057 2741 6182 9435 17800 14546
13507 14546 11367 10081 5904 3021 8088 4067 -3327 1822 14440 13845 74 -5721 -7846 -2784
13493 -2784 9397 10952 14106 14145 16984 18753 12423 14577 16564 9714 2634 -1704 -3865 950 5103
13478 5103 137 -10946 -17643 -18384 -11097 168 2804 1511 -5847 -3637 8562 7206 5500 12754
13464 12754 9677 15841 4685 -5874 -7364 -14057 -9843 -5629 -2305 -4447 3751 -4923 -2306 4136
13450 4136 15151 19038 17502 7421 2849 3038 -4156 -9842 -390 9515 18909 11176 7616 5124
13436 5124 192 -3 10854 17090 417 -15227 -5068 -2563 -560 -7327 -14447 -8565 -14110 -14830
13422 -14830 -23969 -35500 -34445 -37203 -32507 -15447 -2862 -6167 -8664 -10950 -8808 -9098 -5637 -6832
13408 -6832 -21598 -23023 -19412 -12704 -10212 -15870 -18206 -8613 -4324 -1562 4037 9427 3887 -103
13394 -103 -14555 -15641 -6503 -5006 4141 3326 -12182 -10883 -155 9382 11878 10986 10070 3548 -7641
13379 -7641 -7018 1670 2913 15118 25264 11524 8937 3679 3102 7293 3644 -1244 881 2884
13365 2884 6215 9979 4486 8599 10424 12660 19392 30565 27299 14737 9236 13806 10290 12108
13351 12108 9455 6115 8537 16467 14625 8933 7796 5556 4506 3063 -738 2600 3531 3563 -5701
13336 -5701 268 6687 13625 7605 1263 -5638 -12847 -17678 -11018 -6260 1366 4525 9815 8877 -1357
13321 -1357 -8512 -8144 -8296 -1541 -4285 -12971 -13481 -15557 -9670 -4300 2551 4021 217 8108 10510
13306 10510 5647 -1759 -3771 2483 812 -2620 -5195 -11641 -3007 -4717 -3717 -9203 -3383 5039
13292 5039 4120 -6969 -7119 -2285 -6426 1273 2743 2561 8662 5037 -166 -52 2399 -2901 7319
13277 7319 4124 -4196 -2772 -1521 -2962 -8061 -5411 2409 4981 728 1164 10283 13566 9310 6569
13262 6569 12706 18395 14883 6331 10036 6404 5982 8414 14246 13836 6305 1047 2256 5631 10112
13247 10112 24404 16347 11878 11636 12135 2141 -5422 -2434 -4167 3269 8373 20163 15227 9665
13233 9665 3548 5391 8653 6907 16705 28067 23036 16057 14564 1871 1336 8820 10303 15565
13219 15565 13331 5298 -4841 -4996 12518 21783 12431 9314 4257 -775 2033 7852 4154 -6814
13205 -6814 -3603 -5025 -3165 2586 6094 2729 2027 2613 7357 21979 16185 13117 5327 -10791 -9095
13190 -9095 -3205 119 15543 11648 10677 7288 -3060 -7392 -8817 -8255 -6214 3280 -11451 -8102
13176 -8102 -4874 -7691 -4340 15056 23844 14938 4491 235 -5025 4717 11667 15754 6590 4161
13162 4161 10879 12276 4819 -1979 250 1758 1474 35 -2304 -3732 -4543 4887 8017 20732 19971
13147 19971 27489 26018 16986 12277 16209 10665 614 -7069 -6504 -553 8899 8417 2474 -5258 -12978
13132 -12978 -10545 -16524 -15952 -9881 -7898 -3223 220 5637 -4186 -12463 -8940 -2687 -10567 -24547
13118 -24547 -21927 -17223 -9945 3316 7042 -937 1578 9816 13043 6343 -2171 -1142 17236 11595
13104 11595 3822 -7878 -11802 -7836 -3172 -880 394 7464 5361 2127 18200 18845 19023 25462
13090 25462 30698 30815 23102 4441 -1074 -2408 4502 -294 789 1540 4046 2775 10123 6552 -1622
13075 -1622 -6908 -1620 15195 11616 1095 -6569 -4259 6336 9696 8710 14762 19770 17629 14112
13061 14112 8260 6558 8152 14617 18726 22572 11092 -1791 3002 1455 -7860 -12429 -2931 9778
13047 9778 539 -2511 9301 14989 13613 7397 1009 7221 8601 3467 730 3996 6195 8851
13033 8851 8976 -5410 3818 6513 5435 456 -6553 8630 11721 8680 6676 1350 -153 -1958
13019 -1958 -4290 1790 889 5559 3298 -10367 1914 6532 5427 12308 14896 17437 13004 1647
13005 1647 754 211 -701 4747 -5506 -11393 -7676 201 -325 -2164 -6923 12 10550 14807 9295
12990 9295 14982 16197 5153 -389 1538 4748 5052 4860 3383 1776 4843 -329 89 3353 -1236
12975 -1236 -66 9717 20796 27670 16078 8786 732 -4455 4235 11126 11928 10741 13603 9653
12961 9653 15955 21634 22850 23850 12729 13738 5775 -4238 -5989 -1309 7937 3919 -1546 -564
12947 -564 -4727 -3653 -3041 432 3818 6481 3130 296 -6987 -3745 4440 2611 -1253 -1768 -9810
12932 -9810 -18111 -9809 -5323 -4002 -8892 -356 1355 12574 20966 21095 19485 22674 21396 14138 3046
12917 3046 -1857 -11553 -4867 6896 2230 -7273 -8744 -1629 -579 -5542 -6264 -1718 11300 16970
12903 16970 29333 23492 2976 -3774 -2622 -4699 -12651 -12624 -15208 -16504 -16097 -18461 -9547 -6405 -9634
12888 -9634 -6999 -3866 -6843 -15022 -220 2966 -4049 -5633 -6450 619 8651 15256 18447 8679 3512
12873 3512 608 1193 -9292 -11702 -2554 408 -10529 -9637 -8194 3054 7697 5080 1441 9675
12859 9675 15318 14725 17351 17556 9797 7084 -800 3475 6355 59 -5410 -6552 -5189 -2583 -4929
12844 -4929 -14193 -24183 -20494 -7186 -4746 -12398 -8318 7446 4790 -1911 4338 2451 -7653 -9095
12830 -9095 -8063 -3714 5954 6851 3459 12615 10407 7224 13298 14899 9014 12821 11907 5342 9470
12815 9470 14844 20606 17491 8620 1054 -3083 -10683 -12719 -20819 -14522 -12433 -12537 -2334 -4238 371
12800 371 11149 10281 -11387 -15942 -10054 -2148 1696 8833 9613 9933 9703 7176 6388 832 4252 8457
12784 8457 6683 -3341 -8423 1463 1257 465 -6238 -2641 13127 9947 3252 -2588 -4242 -10105 -8095
12769 -8095 -4928 13063 13318 10877 14194 13981 15542 16758 11639 13182 -3541 -17185 -12196 5027
12755 5027 22253 17328 7970 13208 19216 14250 11563 6560 -4002 -6443 -8128 1275 4596 13095
12741 13095 13955 19826 17424 11069 7540 5353 3357 3737 1132 3711 2609 14488 20389 14254 7133
12726 7133 -5881 -4700 7114 7265 10067 8118 173 4699 14617 19992 12084 8105 1393 13681
12712 13681 15046 11158 16339 2110 8937 18869 12498 -7173 -5432 3281 -2814 -5058 5127 4997
12698 4997 2957 6187 2784 -10026 -9223 -4944 3901 4835 9152 2599 2811 -4586 -14740 -26342 -15293
12683 -15293 5619 13663 12521 6499 13793 11841 -2594 -4794 1629 3955 8210 10917 6636 -6
12669 -6 8478 8685 1126 -1744 -669 -8193 -11775 -2040 13973 6753 7773 14770 16895 12368 12078 4721
12653 4721 -10245 2012 12078 2165 -9904 -6530 -14872 -17037 -6356 -2342 -244 -2796 9952
12640 9952 14602 3606 798 1416 5664 11930 995 -374 -445 -8091 -1999 8387 16491 18605 18083
12625 18083 19946 14131 2631 15031 21090 23643 17531 8458 10687 12951 14562 7123 -2449 9314
12611 9314 13231 24873 31956 24047 25050 21029 15513 17357 12072 2082 9611 2427 3351 4824 5424
12596 5424 16179 11148 -11172 -10280 -433 6666 4810 12011 7809 1552 -5320 -770 7405 16886
12582 16886 12171 9806 8639 14891 18105 17874 14130 25439 22100 9390 5496 10875 29582 26844
12568 26844 11239 8509 15943 18074 18938 22558 21532 10246 18202 12939 11064 19883 20432 21078 15195
12553 15195 5405 -329 -87 -3368 -14285 -18523 -23830 -22492 -11447 -1997 -817 6983 13915 11070
12539 11070 9494 7611 13631 19615 3370 -3373 4465 10506 15219 14900 15089 1748 -10126 -3020
12525 -3020 -1171 -931 6033 -1069 -1875 -8164 -12028 -17714 2200 18267 20173 18676 18282 17587 21286
12510 21286 28819 18177 486 -3722 4376 16128 19199 19959 2661 -14000 -17805 -8341 -1458
12497 -1458 7908 21610 30061 32604 28249 24082 20906 21730 20390 12376 17497 22236 24401 27993 23245
12482 23245 16854 10825 10137 2560 9014 17137 22090 14816 6372 10256 12620 -983 -6894 -2714
12468 -2714 -11405 -9077 -6438 1452 2782 4886 9668 6145 3171 5192 18792 15800 8426 9246 3810
12453 3810 481 8268 7125 13369 15978 5143 2025 8117 3438 6545 15215 12014 1287 7409
12439 7409 6672 15599 16395 15127 10346 16908 25485 18680 7026 1054 5659 15152 14843 7291 17465
12424 17465 28742 25205 21097 15028 11583 16651 24684 30501 32681 18629 22158 23692 11832 610
12410 610 4810 14681 13665 23691 26253 21551 22995 13707 9643 16817 9206 1557 4644 7794 4602
12395 4602 5667 11392 11487 5485 6769 -1276 -1941 758 7 2409 1041 478 5682 1188 -6005 16431
12379 16431 28553 27310 31690 27556 18655 451 1460 2929 -4591 7352 14063 1938 -8422
12366 -8422 6972 5924 8639 3380 -1798 -409 3205 12440 18190 15368 17099 3860 4915 7034
12352 7034 -13704 -15255 -5919 6001 4949 622 -6930 -9655 -12541 -3839 14043 18800 16134 11740
12338 11740 15438 12483 21242 32879 31750 27792 22170 17157 8636 -3648 -8261 -5347 15396 24894
12324 24894 11824 3029 12708 8475 2851 10708 22410 23626 19776 17182 15592 17952 13209 9280
12310 9280 706 27 -9728 -8708 -5231 -7162 4086 10477 7664 14558 22020 18526 23991 28333 18556
12295 18556 14137 20891 10373 608 1852 5722 15516 15997 17909 16568 16476 17478 8835 11841 24680
12280 24680 33037 34068 23127 19408 12065 9038 7237 11671 11352 2778 1862 11558 2441 443 -1226
12265 -1226 -10983 -781 1529 2447 -2698 -3968 -9907 -4271 11768 27189 19654 12583 20138 13192
12251 13192 141 4685 5639 -9080 -7202 -10972 -5409 7862 13037 10944 21348 31244 36711 35863
12237 35863 33723 28423 22448 28830 35464 35505 28513 21826 28648 30912 42225 41412 30227 16588
12223 16588 9850 11639 13629 10467 5700 12068 2617 -4817 10451 17547 11323 9514 12421 17867
12209 17867 18345 15767 12791 7270 14500 11782 7398 7189 5620 9124 358 -5103 -7372 -865 4966
12194 4966 5490 12773 16875 8483 4813 17046 22421 19514 20166 14544 1916 -1790 7278 8693 14953
12179 14953 21551 24085 13929 19515 17518 25934 38067 39991 24694 13010 1905 -3700 -821
12166 -821 -663 3701 6902 1290 3726 4455 4477 7209 11778 10693 7178 8931 13748 22746 21489 13093
12150 13093 17955 18599 12875 14424 11230 12457 19135 6019 3824 14059 13878 20054 20517 21679 12969
12135 12969 8692 13495 14435 15099 15980 17571 15921 9234 7419 2517 5604 7066 -5490 2771 7540
12120 7540 8412 1286 -1938 -78 3411 5133 13871 21222 14551 -3858 -7758 -12821 -8543 -3137 1672
12105 1672 15617 9614 13117 12517 6518 3595 13957 24326 25116 25724 20086 7902 7288 9987 18925
12090 18925 26047 29014 27911 18517 16809 20528 22052 32668 26605 19543 24627 25057 17592 15683
12076 15683 14718 10066 16385 19075 16314 13636 11827 10620 -2321 -2729 7487 16022 9020 7003
12062 7003 11001 6555 15219 18127 16823 11674 13107 12505 10953 3746 7260 20475 13188 21450 21335
12047 21335 17679 9749 2239 -13623 -17635 -15792 -4332 4518 4241 5457 9561 13852 28488 28019
12033 28019 12708 3510 7442 15823 24284 22980 18129 7406 -3849 -6908 -7686 3802 20337
12020 20337 10908 251 -1025 9942 14873 17446 1752 -708 6781 10029 14973 28916 45455
12007 45455 35729 21380 11673 19252 16272 8397 -1648 -7661 -12838 -3094 10615 12672 19230 34868
11993 34868 38364 26860 21752 21077 23580 23600 23584 12851 5176 4479 14165 21188 13848 20036 21855
11978 21855 19876 16367 6012 5767 10810 14884 17993 16687 11452 16159 11915 7779 5887 5979 10507
11963 10507 -288 -326 7249 8990 11283 14448 9533 20939 26365 25191 20934 22415 14161 22226
11949 22226 28485 31160 26307 14833 9237 23515 28030 27987 30654 31336 33265 36579 33781 22754
11935 22754 5716 6461 12701 13469 6600 -652 -1915 3204 9875 15333 14308 7554 21458 32727
11921 32727 45480 37832 26642 16443 13484 9582 7704 16951 19776 10392 13930 19380 25154 31242
11907 31242 25056 19167 18229 16238 14099 16051 16570 9217 21693 29154 33575 36074 27145 19881 24983
11892 24983 28214 18566 14137 8244 10023 18866 11629 3280 12979 9989 11659 12883 2971 405
11878 405 15262 14829 12060 2323 -2316 -4439 -855 19544 31689 17404 12032 19319 19885 19630 15603
11863 15603 32470 37111 41443 41015 33609 27880 37262 42959 40683 39395 31565 23166 26146 25740 26941
11848 26941 36000 27588 17477 14905 23611 23218 18234 20695 23451 15088 9756 17335 27486 28371
11834 28371 22851 14586 5032 11508 6491 6341 10444 6042 2759 -3546 -2817 -7041 4846 13456 9739
11819 9739 9290 17400 11425 16771 9838 -8679 -7484 13212 599 4146 19994 21573 25074 24943
11805 24943 17438 7724 1402 -2932 -172 4850 2736 4875 23647 23887 20879 13007 9582 17606
11791 17606 14807 12996 18885 12851 13223 18601 32300 35176 20439 14048 7498 6664 7729 15445
11777 15445 18483 13908 19225 21688 18954 12687 18307 29119 31088 31563 24160 17296 12195 20148
11763 20148 33954 31343 33767 25160 27089 33641 28476 33384 39373 37244 19595 25240 32099 23972
11749 23972 14728 18129 16808 29292 29921 19183 20381 28494 29038 30186 25895 12882 7552 12618
11735 12618 21118 31512 22281 21620 30505 26421 19958 16114 16714 15180 12655 18898 31349 24601
11721 24601 8689 2926 5703 6004 1787 6114 8162 14135 6346 -4429 -7678 -9126 3095 10541
11707 10541 25060 29250 19367 9545 19427 10410 12365 18118 13405 11439 23156 27218 27014 20023
11693 20023 19045 25437 18128 6983 8705 20383 20198 22680 28576 27120 22801 13365 7795 17717
11679 17717 23707 26560 32061 35508 31642 20489 5720 5535 5702 10123 19096 18285 24169 17669 11917
11664 11917 17662 11784 521 -6094 2821 18424 25596 23367 28772 36756 28190 26315 19526 7841
11650 7841 12462 15853 26083 32593 33610 28883 24885 30585 25226 31221 45622 41797 44048 41791
11636 41791 38375 32354 25651 16491 16395 14204 14267 18604 32487 48396 54066 44939 32941 35374 33703
11621 33703 38971 37264 31490 25275 31402 37047 34225 17054 19774 29092 26384 26436 31165 26238 24915
11606 24915 22657 9132 4134 14718 35270 29348 20995 26889 36014 29388 29091 37156 31382 23464
11592 23464 22642 26316 33304 38672 38076 37576 35036 32950 35900 40284 33803 28612 29559 29351 32056 30400
11576 30400 14485 14454 34987 39611 28282 13189 4816 811 -4257 4420 14356 18785 30473 30871
11562 30871 29020 27737 28535 29673 20331 15016 21492 26384 34010 31276 23658 26511 29553 19794 11869
11547 11869 20424 28584 35163 35627 38037 38084 37398 34336 37782 32969 36681 46822 49636 49371 53427
11532 53427 50870 39587 38833 44814 49680 56837 43406 35662 18194 7708 10324 30795 52577
11519 52577 52462 34635 27686 30464 36125 34162 24447 20625 19462 28090 24482 24299 26123 36454
11505 36454 48598 53859 43035 38070 41621 36359 39048 31044 34145 32822 25775 29526 27073 30365
11491 30365 33706 34648 43339 55926 63565 55499 47936 45056 55684 57253 51718 52422 63172 49952
11477 49952 40867 42439 46238 41748 45629 57945 64840 61813 57808 54488 58817 61839 56168 58514
11463 58514 68752 76724 73674 66339 63672 81367 86618 91957 92789 89236 93761 91963 84987 85628
11449 85628 86010 83483 93862 98294 98350 112017 118133 122970 156163 196478 243107 297970 382978
11436 382978 496719 666998 953298 1339804 1644102 1623108 1368826 1073558 806026 609434
11426 609434 465917 377361 318984 265607 234439 206112 182394 166210 156483 145747 134926
11415 134926 127381 135774 149674 144449 126113 130879 136179 139748 147313 143318 127389 114257 105357
11402 105357 96718 98117 110703 121337 123507 125063 118173 105420 97935 100683 102791 93818 90136
11389 90136 84167 71629 63918 80006 86269 77395 86140 84724 76829 71254 62311 59762 67284 67266
11375 67266 61979 58583 55321 54250 43752 37546 36212 33732 34378 39699 39988 31359 35698 28005 4401
11360 4401 -14523 -29938 -29951 -8959 31867 50452 55491 53355 48111 56271 49975 57005 68114 71190
11346 71190 67154 56883 49516 51358 55605 62196 70390 70241 69723 78603 100825 119036 130145 134608
11332 134608 131369 131884 119851 107213 100226 92011 85766 88858 80332 61763 65632 68210 72337 77161
11318 77161 74873 81684 80501 68870 83574 99332 100764 101926 82228 74838 82908 84093 88590
11305 88590 89349 86965 82902 86103 79421 71079 73116 87005 87382 80036 72714 73222 78738 88638 94655
11290 94655 95429 112150 133401 162596 183862 197807 216359 229684 254129 304384 340110 351603
11278 351603 376688 385796 384949 354446 297940 247337 209845 189829 181077 161895 145370 131322
11266 131322 130905 129539 127759 115078 109454 111609 111600 122836 135190 126290 115937 114634 120821 130179
11252 130179 132572 132234 120339 111295 102062 104593 102804 99320 109881 123575 110068 104268 104898 115472
11238 115472 118581 120279 109320 103060 104472 91795 76593 78237 75416 78211 79166 82272 92054 103694
11224 103694 123443 127971 132945 132644 125485 124811 137259 154136 177612 184304 170734 168727 179477
11211 179477 181561 180176 182260 174328 163326 167584 168070 170251 175097 167570 158278 157055 160887 158591
11197 158591 165898 171950 176645 168811 176081 191870 199059 197016 202868 205684 201331 207204 201575 187734
11183 187734 194364 193913 202651 211619 219943 219128 209846 196683 183106 172753 171103 159280 170134
11170 170134 186029 195574 203673 206022 209966 215097 217291 223797 229120 237799 246573 259860 259978 261487
11156 261487 286907 304647 324382 338770 348924 359149 363408 360557 359053 345406 313648 296641
11144 296641 298947 290851 286802 286341 280884 283532 283156 281822 290502 282550 274853 283653 294152 297457
11130 297457 306956 308244 305602 316264 333655 353585 374448 404804 413756 425307 429846 422732 425564
11117 425564 439649 446799 459397 465808 486550 522062 544624 554014 571547 595357 608189 629868
11105 629868 657040 678347 691260 707806 724980 745795 762902 788783 818653 844091 849133 844782
11093 844782 843710 839165 835037 831537 849781 882360 917929 943747 956757 976340 1000337 1030957
11081 1030957 1059481 1084222 1114779 1153495 1171865 1210270 1255980 1306686 1353845 1399477 1430725
11070 1430725 1458254 1483955 1534036 1587190 1635896 1695833 1776275 1860719 1928209 1992100 2047324
11059 2047324 2082810 2105867 2139810 2218837 2355361 2541899 2773948 3010101 3272920 3541235
11049 3541235 3859777 4294613 4902401 5615018 6184637 6423915 6566514 6791093 7132783
11040 7132783 7625998 8313501 9220756 10408670 11997093 14129406 16884119 20445238 25132545
11031 25132545 31005708 38541056 48901170 62921442 82776971 115321944 169501799
11024 169501799 243460077 300943089 292347140 241005695 186435983 140671512 105290754
11017 105290754 80190405 62828671 50778918 42136187 35638341 30556521 26479882
11010 26479882 23235277 20741284 18825389 17340273 16184969 15257032 14467183 13804075
11002 13804075 13324734 13086132 13054419 13073249 12846522 12364922 11864907 11449828 11154933 11008138
10992 11008138 11009771 11030663 10960381 10858148 10771389 10726542 10661655 10491308 10149837 9718191
10982 9718191 9251925 8778963 8290195 7799988 7333502 6899293 6508264 6142372 5806475
10973 5806475 5505790 5238733 5007164 4801414 4602523 4446830 4351475 4305104 4217926 4012165
10963 4012165 3748771 3508921 3288878 3095838 2928995 2767277 2633116 2510879 2390175
10954 2390175 2274500 2151201 2032717 1941005 1853050 1785793 1740662 1715467 1680876 1615334 1522794
10943 1522794 1418181 1318357 1234198 1164181 1112696 1074520 1024285 968845 909525 867257 835795
10932 835795 810562 791757 770658 760070 727966 677975 634013 598525 574241 569576 589211 620296
10920 620296 614147 586896 543758 501217 464292 438679 414490 395725 373215 354896 337263 328335
10908 328335 326328 332441 344006 365736 386170 413746 448499 481168 516254 569382 633914 659877
10896 659877 630197 554711 480994 420149 374197 334983 301270 273887 258380 249827 242000 225348
10884 225348 207478 195994 189002 166296 173188 194015 245655 280461 257197 223765 198078 177140
10872 177140 156723 130843 128565 123238 100269 77834 75925 70340 73791 80685 87553 102807 113756
10859 113756 107507 106831 100656 111067 126776 143255 166659 171187 161907 169724 178346 178942 183627 178821
10845 178821 178452 178857 180061 171939 169238 172037 169137 158508 151775 161131 153752 141925 139677 156234
10831 156234 171260 171398 163329 157080 163294 167143 175166 169677 155419 156877 167654 177568 170739 170041
10817 170041 169057 170255 169260 161369 156346 148672 143453 137240 133008 137346 151549 139545 125342 104408
10803 104408 98141 106387 103606 109337 109482 103895 97425 87084 68264 63085 67755 79249 92275
10790 92275 97531 87398 75185 74339 68634 70730 78507 79840 69738 61318 66858 71918 88410 96780
10776 96780 96334 101160 111536 116864 119246 107615 109089 113100 110636 89095 79867 56244 43421
10763 43421 34096 24402 12641 9277 16396 20251 12490 19467 16033 20047 19252 23426 24755 15577
10749 15577 7350 3447 9723 13627 -5284 -19072 -16257 -11312 -6108 -1592 -8664 -9821 -3960 221
10735 221 2669 8086 3841 -9105 -2962 4765 14810 23640 16169 17997 21985 9042 -2240 -5817
10721 -5817 -6404 -786 5151 596 -3142 -17598 -36160 -37556 -39218 -43720 -34051 -13420 8906 11925
10707 11925 20954 31166 28537 27200 28159 25359 29076 27840 27234 34252 27894 27738 26394 25187 21526
10692 21526 25230 42201 56520 75442 105616 129770 128382 118482 104988 87621 73521 72037
10680 72037 59353 44129 38318 34999 39727 45793 53318 55777 46544 43617 37928 38952 43745 49136
10666 49136 40242 37148 40025 41884 52832 52297 41295 36312 33860 36795 48298 55656 53507 55146
10652 55146 46171 44507 47107 47858 39671 49668 46268 39175 41264 39542 29301 28484 21979 14288 31549
10637 31549 39683 37862 46612 53423 47565 51469 62398 61977 63918 64222 58804 66922 67697 60489 57708
10622 57708 68610 79090 90357 88179 110359 144617 185571 234021 302304 382012 520157 743595
10610 743595 1063859 1454957 1639519 1490894 1216595 934069 690275 522484 409953 333802
10600 333802 267779 221867 179131 156668 142523 125119 101894 87245 76431 73179 79122 76461
10588 76461 72072 70258 57601 48097 49024 47856 56913 61318 50237 51464 57827 62091 55106 47874
10574 47874 43565 37615 61116 69188 58179 48933 25979 22307 26340 21005 25184 30560 22731 21985
10560 21985 34847 37149 34073 32387 27282 31836 34848 38605 32234 33073 31633 28737 19398 14506
10546 14506 10024 5034 2567 -823 -5833 4790 13657 22873 18552 19613 32571 29371 17450 13639
10532 13639 14917 26231 30440 26062 20195 5899 -337 -4603 300 3595 4968 10068 10703 12268
10518 12268 18136 23812 16462 8953 -1385 2983 1005 196 2346 5133 12865 12361 6874 1568 4875
10503 4875 -1849 -4796 -4586 -1277 4219 13270 22796 23729 16617 5916 -2448 -18626 -28656 -29013 -13193
10488 -13193 -6999 2181 5849 -395 -11719 -14382 -6529 -18526 -17628 -22493 -29773 -26733 -29503 -23675
10474 -23675 -6768 -14877 -13572 -10747 -17127 -9241 2460 8404 -10 5794 1854 -6204 -22589 -32070
10460 -32070 -16608 2491 -21 938 -695 -10298 -11515 -17108 -20195 -19123 -16265 -3075 8729 4805
10446 4805 1634 1161 -4444 1241 -582 -4939 -4789 -9527 1922 1556 -7130 -3335 -9403 -15051 -18580
10431 -18580 -21818 -23620 -17528 -15472 -19678 -14874 -2292 -2401 -1527 7882 14768 7512 2692 -1278 809
10416 809 -5192 -4678 -4123 -10786 -4523 10086 3367 6708 -3967 -7164 15851 20374 17441 20574 5424
10401 5424 -1078 -949 2510 4582 9078 9315 3334 5087 -877 -4518 6034 7439 -2479 -7566 -16713
10386 -16713 -10859 -7802 -127 79 10994 19042 24201 17480 21666 26432 20793 14404 17779 19379
10372 19379 14984 17314 23894 26243 26635 36419 27683 21487 19663 10450 10462 12100 15006 22556 34291
10357 34291 38752 35002 31153 27278 37575 48306 66507 88491 104478 102993 119562 142067 153799
10344 153799 167043 189707 211182 234126 294587 391484 526270 693819 909101 1157150 1444453
10333 1444453 1730980 2001841 2224969 2382429 2455798 2464086 2407143 2256839 2035109 1754865
10323 1754865 1482992 1245733 1028166 833276 668174 531984 449316 386678 337719 299013
10313 299013 266282 249356 234844 216909 213062 191552 178348 176053 169918 164980 158783 141797
10301 141797 137353 139846 140890 144689 149088 151463 154213 144591 139451 124067 120409 120683 115788 121730
10287 121730 117261 105339 97316 89169 89601 93896 93508 87366 71878 55655 47525 48842 60016 61357
10273 61357 51362 42790 32658 30527 26174 21116 28552 24174 25125 25940 22161 21463 12517 13853 18298
10258 18298 22566 21805 15910 8623 12637 21593 20928 26943 23827 5249 6186 9016 4054 2821 -10035
10243 -10035 -4945 883 1410 31 1234 12793 -1288 -13699 -26830 -30770 -19954 -13475 -11586
10230 -11586 -11112 -7886 -2639 4162 -8939 -11424 -3535 -1032 2010 -2529 -13007 -16539 -21794 -31306
10216 -31306 -15196 2847 11021 18221 14956 2228 11507 11347 9401 1799 -6254 -18588 -18503 -12821
10202 -12821 -10140 -9556 -11613 -16577 -9953 -9445 -1589 -2831 1996 -4203 -6813 -10315 -10686 -18940 -13330
10187 -13330 -16152 -16910 -12816 -2998 -11010 -12347 -18886 -16273 -3986 6664 1950 -9550 -11768 -10258
10173 -10258 -7413 -15791 -1724 9132 5650 3721 2860 -13515 -21319 -11493 -8178 -3807 -4538 -5766
10159 -5766 -10502 -4551 3196 8039 11167 -1060 4902 10491 3841 161 12422 7729 -4600 -4498
10145 -4498 -206 6231 14857 12190 6635 -226 632 -12493 -17058 -14305 -10589 -19505 -18209 -11295 -3655
10130 -3655 1197 7373 13958 6518 12926 5937 -2829 -7410 -4904 -8077 -9332 -4717 -5774 -19801
10116 -19801 -9140 4597 -1155 -5652 365 -6500 -5473 -1934 -3077 -2100 3093 7607 6336 -10801
10102 -10801 -14446 -8214 -9476 -21030 -25242 -26803 -24775 -20887 -16086 -4766 -713 2072 -6706 -5588
10088 -5588 -13659 -23620 -14236 -1719 10181 9551 16187 15953 13466 8576 -1705 470 -2561 -3240 -8148
10073 -8148 -70 1537 2023 -12620 -13473 -11062 -9319 -11155 -13157 -14285 -14031 -18912 -10154 -4961 -11125
10058 -11125 -12324 1051 -5746 4209 2112 -10057 -17043 -18347 -22864 -17460 -14489 -5057 -3251 1224
10044 1224 1662 -8846 -11300 -14706 -19725 -28011 -25179 -27643 -24945 -13384 -10861 -17456 -19601 -11376
10030 -11376 -21067 -40465 -33913 -18615 -7875 -16887 -16574 -7691 -2268 -4921 -15439 -14071 -938
10017 -938 8478 -709 -7033 -8694 -8350 -2863 -1429 -3107 -838 7642 -2011 -13183 -267 5496 12187
10002 12187 15441 6888 -5162 -6006 1190 5430 13981 5185 -3047 -16020 -11744 -5931 3171 -2231
9988 -2231 -5105 -397 17258 11589 5597 1541 -2579 584 -9706 -19273 -11889 3357 10242 9027
9974 9027 9121 13934 15646 4931 -9540 -19914 -14064 -12469 -3472 3493 -95 -3365 -10178 -671 -3811
9959 -3811 2159 17315 27326 20640 10072 1741 3510 9234 7152 6476 -3180 -3184 10748 4675 5422
9944 5422 -1941 1454 693 -8601 -12009 -7616 -6715 -7084 -5335 -3537 4704 9999 6978 21351 19120
9929 19120 20480 26262 34185 29009 32825 43121 67671 89831 96869 122018 172304 213185 199566
9916 199566 161296 119637 78695 55368 46784 35882 32415 20757 -668 833 11775 7002
9904 7002 7531 -151 3738 3872 6412 8800 1870 -454 5326 12121 17646 7310 1386 935 -6887
9889 -6887 -813 11088 12112 14744 6010 8420 19434 23090 10385 3703 -11293 -7788 3741 5331
9875 5331 -776 14507 25216 20243 9696 7037 5001 4524 -1164 -9331 -1975 430 -937 9723
9861 9723 14862 3429 1947 2617 12704 29922 38119 31081 22938 11470 9410 -1001 -10406 -6466
9847 -6466 4255 5730 11735 21525 9683 12917 12799 7205 -3881 -9378 -17803 -25539 -18440 49
9833 49 701 7033 10074 14685 10645 9684 19874 19741 13434 9413 1869 1174 -1435 -15806 -29762 -19797
9817 -19797 -15185 -6158 5492 -2389 -3498 -5618 -12948 -2970 -1395 -1511 -14197 -26885 -23181 -14711
9803 -14711 -13322 -15447 -9089 -10677 -14774 -3169 -3102 1591 6359 -794 -1570 -12603 -9385 -8401 -9701
9788 -9701 -16471 -17800 -4951 -5480 -2641 -7745 -5151 -3524 -2667 40 -2503 -3987 -2807 2726 1925
9773 1925 1158 10053 8052 6563 12496 13574 3609 -3016 -5127 4295 7394 7746 -3354 -4094 10171
9758 10171 19388 10328 4711 3349 1720 1970 7387 328 -10569 -992 -676 -7420 1873 19334 16009
9743 16009 21424 11999 -6893 -941 -1109 -3198 496 4426 8638 9401 2197 -2242 4172 -1925 -15037
9728 -15037 -24394 -19663 -2746 107 -1843 6925 6450 3410 9880 9574 16253 15307 13161 12357 -263
9713 -263 -8854 -8339 4997 13068 17313 15523 4833 455 462 -3617 -2729 2034 4811 4664 -6286 -4550
9697 -4550 -344 -288 -6878 -11209 -6454 5228 5562 -1203 -12486 -16434 -13670 -15958 -8419 1553 8575
9682 8575 16837 8868 403 -5075 -5591 -4728 -5817 5196 8867 -2046 -6431 -6793 -5063 -1075 12275
9667 12275 14972 -1119 -10053 -13380 -11103 -1184 15937 8135 -5607 -4479 10007 16472 12016 41
9653 41 -6282 -12438 -6615 -7252 -19288 -20348 -12849 -3606 1816 608 -1086 -7921 -8031 -1422 5085 11035
9637 11035 17491 13010 8016 2675 -4965 -214 -1137 3929 4833 -1345 5379 8475 11050 14085 3344
9622 3344 2108 10033 24224 13233 5243 6642 16166 16889 16627 29104 26663 23248 8492 -732
9608 -732 706 12426 18192 16613 8401 -1536 12590 8224 3619 6309 4038 9319 11407 10876 9442
9593 9442 5059 10358 14119 19616 17941 12554 14735 21369 24693 25181 16845 15147 19601 27469 12409
9578 12409 2436 8777 19590 33356 31933 23499 13214 -2635 10652 23061 17705 9907 11385
9565 11385 17341 24567 24308 14108 21139 18313 14025 23498 32706 22760 9865 9951 22130 25511 19875
9550 19875 5304 1789 -3146 12612 13765 17865 15095 6315 12696 16815 21725 26714 22525 16011
9536 16011 16612 22248 21330 25493 28630 30010 25110 20481 11804 8713 11441 5441 2106 21908 27221
9521 27221 28225 22327 21619 25878 38453 43393 39882 33862 22830 11331 14652 17436 22356 28919
9507 28919 30949 32894 27357 23564 17003 10588 11740 23972 25843 17602 10909 19075 27741 30638
9493 30638 26954 31230 40360 50543 44122 45251 42975 46410 49191 39292 34526 44073 38278 37154
9479 37154 34939 38507 52229 47362 31138 14885 20836 38454 42791 45566 48127 47097 45194 36950
9465 36950 37999 43037 47134 39086 32538 46415 49428 61901 57313 48315 55497 61535 62712 57964
9451 57964 58350 50931 41958 46839 50217 52026 56519 58159 56070 47049 45987 51611 44173 52331 57676
9436 57676 59670 62952 57607 54421 62707 69773 76146 74720 77958 82639 80431 66553 55888 58359
9422 58359 75200 77747 67076 74356 75900 78634 82267 78452 74483 81119 83620 90693 98541 109461
9408 109461 101612 97377 103052 104522 105266 99438 94706 94094 97397 107695 118757 128296 126159 124559
9394 124559 127790 131233 135855 138183 139330 135007 138880 148935 152184 152266 146651 151719 154571 153241 152005
9379 152005 156087 155749 156999 168399 177543 180848 182701 190751 191284 198539 191896 190119 207702 209402
9365 209402 214287 220083 221222 221731 231438 235867 236469 244212 259091 267376 276445 277294 279768 287884 298191
9350 298191 302044 307935 331647 341675 347649 340439 335890 350668 367897 378776 403622 421381 424321
9337 424321 428787 441997 458243 478554 487634 484615 493315 510773 536119 558601 582968 604297
9325 604297 618805 637047 667905 699493 723407 741922 775124 804952 836833 858982 877874 905341
9313 905341 933306 962028 994680 1031995 1062730 1083970 1099016 1127520 1156598 1190380 1215666 1241842
9301 1241842 1266795 1303231 1340256 1366298 1388240 1410970 1431960 1456766 1476508 1505703 1532350
9290 1532350 1543235 1556593 1567436 1567076 1565170 1544358 1536866 1544387 1536084 1521914 1516783 1494276 1472607
9277 1472607 1445603 1419295 1400346 1367358 1323589 1296395 1274085 1247823 1221549 1185071 1153513
9266 1153513 1124722 1090671 1059382 1033862 1008269 976838 956991 930776 906309 882110 854441
9255 854441 843369 822482 793426 769810 759252 730224 693643 673653 669283 648215 623441 609746
9243 609746 590762 560990 554618 540396 527549 511877 503493 495091 491533 476008 447769 421794
9231 421794 422948 414389 408198 403364 392360 371618 360275 341080 330691 329319 332495 321581 307056
9218 307056 301475 293987 281995 273911 257929 255373 258991 261573 269475 262987 253603 241820 228220
9205 228220 211055 199977 209301 205435 197577 201192 194498 184247 174374 186460 176746 167020 163689
9192 163689 171805 171765 170799 166047 161887 161007 154275 147057 141511 146370 144450 129475 125547 126662 126499
9177 126499 125485 118002 123567 136072 125520 118021 110577 110282 121312 128443 133769 125525 129040 119418
9163 119418 116423 111176 104252 107738 103068 99762 91175 80722 79489 84665 85048 83710 78782 82865
9149 82865 99692 89074 97442 99899 81045 58087 66790 73492 79168 85604 83389 90166 84601 77853
9135 77853 73030 69501 65292 47236 41980 67478 80880 80298 83227 89751 97353 85431 82670 82121
9121 82121 83441 82682 78992 75407 70691 68830 68275 60021 53114 52582 62157 71098 72575 62556 47759
9106 47759 46216 45660 57750 51605 51753 52042 52922 61723 71833 73111 78370 85161 72366 67634 50002
9091 50002 38032 41366 54382 58682 61135 60480 57131 54142 47648 46535 47039 49090 52024 39024
9077 39024 16595 20927 39552 54260 42813 30023 33972 44268 53344 53544 46737 46574 37291 25204
9063 25204 24226 22359 33939 35515 34731 38932 42052 52396 42145 31606 38621 38144 41637 38621
9049 38621 29032 29194 44689 50181 38037 35111 39890 42599 53192 49633 42791 47679 49787 38911
9035 38911 27891 33482 35372 38005 46027 40870 35660 34673 37131 32626 27494 27529 28012 29063 43759
9020 43759 45299 35575 37504 23779 13248 18948 15927 16228 13935 16806 18620 34711 48506 52430
9006 52430 45712 46279 42686 27696 27169 28936 25363 23567 29478 26613 26667 19117 12108 25951 33281
8991 33281 24698 18321 23547 23501 22416 24523 24166 18192 20815 20966 7819 13699 26170 33379 33624
8976 33624 29771 33793 30961 13303 3781 7276 7675 14931 25086 24338 34066 38749 39364 43399 41073
8961 41073 44677 28162 26097 34064 32282 24956 25363 20187 17668 20370 14602 11360 7707 8387 12193
8946 12193 16886 34336 43097 36690 36021 33701 36078 29723 19849 17907 23988 28940 18716 16302
8932 16302 22759 27228 24021 13953 111 -143 4533 6517 5421 10051 8951 4806 2709 9002
8918 9002 3712 1632 9899 4220 6869 10330 1122 2531 4679 18905 18856 12672 13334 16814 3781
8903 3781 -1634 6828 9290 -63 -5623 11203 23498 18063 6345 4815 5098 1330 608 -732 8557
8888 8557 14711 -2957 -7868 -7753 -5290 -3820 -1431 3550 11971 11349 10748 6350 -2096 -4915 1765
8873 1765 2664 -3441 -1251 13155 33796 38257 38323 40613 46467 48070 52757 57979 70371 78042 95671
8858 95671 142633 185188 194568 174314 146681 108542 70273 47264 42956 35960 41521 44777 40390
8845 40390 38902 38953 33505 28478 21595 30688 27212 27059 29518 30406 21102 14482 17220 8009 6937 6660
8829 6660 5315 5867 3382 5828 1874 5155 16164 14321 13125 17660 13048 8656 11870 9832 14401
8814 14401 20125 24659 25106 30710 22433 6842 -1563 -13515 -16554 -16592 -2888 -3153 -5660 -15871 -8146
8799 -8146 -4375 1472 1777 1835 1983 14350 19218 21708 18424 12455 10564 18862 12820 7853 6882 5386
8783 5386 -1496 6284 8293 5920 1059 2863 5673 25227 23313 11219 1104 -1233 525 -851
8769 -851 -4744 -5045 -1192 4862 9329 6942 7582 6320 13427 18806 4825 -10856 2047 12775 8657
8754 8657 -2789 -2535 3456 8294 6352 9157 3083 21527 31163 24611 25159 18933 17305 30245 33962
8739 33962 29727 23546 28929 25002 23951 18811 22476 10438 10529 23098 38100 42556 28927 28147
8725 28147 24510 19816 16729 17938 22838 28476 36645 43859 41381 33178 33364 30933 38023 33845 28674
8710 28674 29123 31325 19792 16105 8296 12636 7720 14476 26529 26553 18814 19180 30654 30657 29972 32314
8694 32314 37274 40541 42455 45442 52151 46590 43235 28798 20158 28283 26293 30679 47665 39465
8680 39465 29831 38564 35498 44281 56987 62812 57805 54381 55827 62038 56403 56546 55479 53717 50372
8665 50372 53658 61146 55619 58500 61078 63728 64903 72253 57370 48238 42343 55138 61454 58620
8651 58620 72118 80567 82552 77338 82042 92028 89168 88465 91373 88663 88487 93421 108193 109907 114151
8636 114151 113938 117670 124516 121380 122394 122360 117794 114711 115878 126132 131816 135338 137265 139091 155139
8621 155139 159056 154976 163437 167066 167650 175875 190136 210226 212105 218406 226769 241431 246447 258988
8607 258988 260670 265104 259425 253312 250285 245246 237493 237397 229554 218029 212611 206217 187619 178053
8593 178053 177290 193731 206319 202280 189891 188636 195466 189493 171698 164883 153888 130603 125143
8580 125143 129941 119626 110482 111401 105081 89230 98347 98036 89073 84091 90164 95339 82060 67660
8566 67660 51277 50915 60242 53102 55803 58745 55128 51535 46186 51269 43182 42332 51027 51264 51985
8551 51985 45500 36288 44966 52360 41155 29515 26411 25884 25451 19920 16839 21532 36092 45474
8537 45474 35731 31843 33472 31753 32090 33425 32032 30615 19178 13964 22116 23507 12161 16692
8523 16692 17558 19616 19754 20402 21261 29639 25009 18640 14717 20995 24866 33121 25186 19085 1676
8508 1676 -11283 -15722 6921 14118 16386 10234 3712 3125 14508 19986 15696 10063 1555 -4038
8494 -4038 6935 6996 1507 2918 11034 14792 18449 25679 24657 15689 10909 15501 11792 4703 8715
8479 8715 5893 7786 12485 16669 18690 21326 9416 6295 2869 408 2454 12090 18535 15959 4979
8464 4979 7133 13101 11333 5375 11854 25795 31904 22227 23620 13872 -2550 -8189 -2965 760
8450 760 -383 11157 28881 25867 22069 23544 22317 19317 6592 1556 6628 -8880 -4934 15060
8436 15060 23097 24326 18170 17387 31162 36181 30259 27190 29495 32039 27443 19178 17156 -1436
8422 -1436 4702 13693 15355 17921 8740 7778 16828 27236 29964 27308 29179 8676 11752 22897
8408 22897 32989 36713 27749 19612 15388 7349 1080 1631 -1587 10471 11593 7182 16246 24042
8394 24042 21702 6893 -989 1886 7148 13629 17459 12854 11663 12147 1306 5490 24083 34557
8380 34557 42395 32438 26048 20554 12344 11909 9776 9779 26681 30172 24845 23216 17329 15969 6250
8365 6250 12372 16770 7392 -3895 77 745 10250 24546 22289 11581 -463 10629 14483 6841
8351 6841 8088 9125 7985 12634 10618 16276 24229 29941 21307 30097 24204 12291 17701 21248 19024
8336 19024 7824 -2451 333 8183 15806 18523 18240 14672 18960 14097 6710 7979 9442 11316
8322 11316 4122 7357 5846 16618 25426 16219 25544 16371 6587 14650 11132 664 2878 3969
8308 3969 -1677 3195 -2165 -6198 -8969 -10625 -2731 12298 9820 6358 599 -22 4431 4561 17619
8293 17619 21533 14350 14375 11950 9501 6686 7916 18677 21093 18228 11337 -1669 -1420 3698 2224
8278 2224 6379 15682 9950 19679 16963 22270 24510 20630 17085 30551 32564 32381 31814 27543 25723
8263 25723 8929 -3127 503 2402 5024 6706 7066 5208 10280 21067 11521 1294 7047 8730
8249 8730 2050 -610 2401 2206 374 13077 13230 7843 3430 8301 14931 24514 25820 13725 7763
8234 7763 7564 -1022 6155 9293 8357 4537 8003 12882 17923 16277 16926 16728 1507 -1473 2626 6574
8218 6574 11187 16991 27725 18772 4360 -1919 6936 5132 7042 7307 2833 4146 11620 4357 -803
8203 -803 17989 22219 18501 21232 18033 22202 18860 15287 11690 14481 21932 14694 -1640 -6255 -7034
8188 -7034 -16036 -16168 -266 4722 -1600 -8833 -1145 10638 -392 -10901 -19846 -19764 -7456 -789
8174 -789 2908 18018 13498 7874 3670 -3797 -3787 -10972 -636 -680 -1043 -847 -4224 -1696 8167 8989
8158 8989 6995 13003 23049 20500 33894 52061 71498 92467 113157 111244 101820 79059 55340
8145 55340 45014 35905 23852 24923 24444 14638 14015 14571 13202 14092 17176 16724 18175 22663 20087
8130 20087 17594 11092 2400 -4837 -6554 -563 5884 7783 9933 828 2285 1181 -3454 -1708 -1748
8115 -1748 1578 1972 30876 71869 82268 105297 116587 106351 96732 83981 66994 56034 33568
8102 33568 23951 29527 27218 28663 17006 2925 4465 6247 18090 21440 10815 6062 4897 12970
8088 12970 20315 19603 29620 33573 40182 38075 28567 18218 13041 19376 23548 27686 28475 35126 27444
8073 27444 14685 18713 22246 12021 16536 20730 16245 12066 18006 17921 8485 -1485 1640 -2799 -4698
8058 -4698 -3280 7570 17527 23172 29094 39737 45277 44400 41440 39263 35344 31061 28873 42071
8044 42071 57065 75881 87475 91095 93763 92041 97209 93423 96385 104634 115778 112255 100825
8031 100825 100563 107916 118292 118872 101301 91682 85149 80373 87672 85326 89369 91055 81278 78869
8017 78869 79446 84803 89747 91357 89694 86996 81220 94986 103988 104959 126119 132928 144154 164004
8003 164004 193453 221631 266299 321024 370972 392591 379594 344546 295508 259291 234270 220221
7991 220221 210226 208842 236369 281646 320032 339709 314029 264053 216161 190690 171554 144107
7979 144107 124513 115105 117464 119830 120108 110416 99483 97812 95092 103766 96339 89785 97401 109748
7965 109748 106501 102219 128682 145599 164056 164676 165928 189605 216323 226614 241859 266889 281631
7952 281631 289679 287648 266501 256638 261228 270230 293350 313039 316494 294534 250067 224129 199584
7939 199584 167809 141418 122359 127110 125187 99922 77026 73968 81944 86486 81600 78801 88713
7926 88713 77591 59184 63860 64738 72810 69974 78438 79364 74237 89882 101394 113613 128645 130603
7912 130603 137520 136189 124218 111897 96707 84195 85511 86950 75062 65993 62663 56420 56935
7899 56935 65863 58971 54570 58316 57935 61723 65978 57561 46655 45876 44968 35372 18546 16030 21199
7884 21199 18914 34798 39867 35056 34671 34687 24232 23269 16600 11983 31903 47114 35284 27185
7870 27185 21191 15949 9639 9543 8054 13574 23198 26353 11531 11999 20923 18181 19365 23462 17875
7855 17875 -2592 4077 24159 20202 18514 11613 16882 13657 4972 1909 3877 8924 13841 17903
7841 17903 23161 22488 20052 10507 7725 -5218 -7231 -3953 -3601 5767 14237 6939 11874 15483 9512
7826 9512 6595 5346 8535 3662 45 -11112 -10665 -3511 1206 1273 333 -7054 -12125 -12493 -8368 -2138
7810 -2138 4428 11441 8771 -2853 -1525 3520 5018 -2077 -7764 -886 1303 -6494 -1756 -4852 -15906
7795 -15906 -10811 -6862 -9522 -24820 -38754 -44915 -34286 -9202 6438 7956 136 -10329 -13451
7782 -13451 -6188 -3523 -4505 1714 -10767 -16491 -17464 -18151 -11292 -4129 1958 3168 3693 -3582 -4077 -5694
7766 -5694 -7620 -16699 -14626 -789 -4332 343 3439 6830 16693 25908 29515 16968 1661 -4850
7752 -4850 -1953 -141 -9172 -13667 -9354 -12361 -952 17504 16172 6839 -1384 -2448 -12623 -20385
7738 -20385 -18880 -18113 -8597 -2138 -2213 3638 -1554 -12457 -9429 342 1992 8080 12378 13766 11656
7723 11656 6700 -12054 -12812 -7510 -7423 -3667 -8152 -2650 -11083 -22199 -24857 -23841 -18908 -18544 -9701
7708 -9701 927 -2412 126 3536 -1417 -3359 8625 -1670 -13949 -15403 -12183 -17373 -12897 -14241
7694 -14241 -9258 -11569 192 11269 16377 385 2227 4646 -2089 -168 6905 520 -9483 -10961
7680 -10961 -3104 -2074 -11023 -20193 -31309 -25161 -16437 -16212 -9622 7189 4211 -1101 6439 3829
7666 3829 3017 7466 3252 -18222 -33335 -22769 -5972 1666 2914 809 997 7665 19343 11008
7652 11008 1760 -12328 -10988 -4354 6756 10982 13249 13345 15492 13781 2134 -13760 -13261 -3586
7638 -3586 -2065 -15974 -26580 -11662 5076 8021 13387 5464 2287 -1713 4586 7466 8979 68
7624 68 115 -7358 -12697 -14717 -15455 -11161 -2871 -6834 -9787 -20415 -25442 -16126 -16685 -16195 -15500 -4332
7608 -4332 7896 15021 22703 20813 13148 6084 17410 27594 27652 23619 12321 3308 5110 9842
7594 9842 1754 4642 9125 12484 12587 17619 11423 7309 12482 -442 -6577 -8330 -7529 -9801 -5351
7579 -5351 -5385 -3679 -10658 -11056 2031 4822 15946 13724 3276 -4397 -2958 5798 -2511 -7541 -5759
7564 -5759 -999 3304 6110 13983 7067 -4735 -8276 1313 10097 4311 -6948 -7633 -17188 -19844 -18251
7549 -18251 -14891 -12443 -9047 3397 -6911 -5499 -2608 -4337 -770 7611 4892 8563 16457 14105
7535 14105 7570 -13958 -16262 -15685 -18260 -12279 -14057 -13276 -11965 -10480 -6816 7683 9741 4219 -61
7520 -61 13299 14845 16203 12382 3218 -1450 628 -5123 -6431 -9922 -1025 4641 5907 -2417 -3313
7505 -3313 1103 3140 10692 5595 3250 10875 17245 9143 -1560 -6957 -14230 -10587 -9387 -9251 -2228
7490 -2228 -6761 -16314 -11302 -3491 -10909 -12442 -9436 -16443 -10891 -7764 -6522 1636 -1943 -6034 5062
7475 5062 10094 6815 -12590 -22372 -20220 -16557 -21435 -9541 8286 2960 -10785 -12528 -6195 -1670
7461 -1670 11947 21178 18025 4633 -8566 -9580 -5388 2299 3670 6806 6863 10561 12138 13679 8981
7446 8981 -8534 -12868 -1841 -14044 -11898 -3434 15964 12953 -96 -12583 -15938 -10168 -19368
7433 -19368 -29196 -24921 -15229 2999 18655 12171 -249 -7186 -9676 -14549 -7352 -4036 -8222 -12306
7419 -12306 -9158 -5987 3948 4146 14621 21323 13627 3050 4585 906 2624 4276 -3499 -11352
7405 -11352 -2534 16406 33890 33304 22222 12988 7731 7235 6612 4751 -3107 -3469 -4417 -9554 -16896
7390 -16896 -17568 -8692 1031 10214 1845 -7775 -17335 -16074 -9119 -3314 -7856 -8907 -11591 -12374 -11919
7375 -11919 -16347 -23822 -32857 -43522 -42000 -25466 -20753 -23975 -8751 -915 -5644 -10227 -969 -2108
7361 -2108 -2420 -5837 -17626 -16423 -6328 -143 11050 3918 2308 -12589 -15951 -20987 -32851 -36919
7347 -36919 -24532 -13141 -11335 -3421 -12177 -14730 -18192 -63 12830 3758 5077 2305 -812 7514
7333 7514 5270 873 1256 -3068 -20242 -20495 -11985 1112 3124 2185 13291 13176 1444 6442 5966
7318 5966 -7331 -21183 -27972 -23950 -18940 -7176 2154 6211 4457 5665 -8296 -7946 -4870 -641
7304 -641 10203 13545 5130 -8963 -12955 -11286 -4494 -870 13 -2025 -321 -739 -7857 -22280 -25259
7289 -25259 -27202 -17088 -14621 -14686 -9765 755 -2626 -14188 -14940 -6766 -14966 -14653 -7194 -9964 -5541
7274 -5541 -5557 3462 15898 19596 20154 14794 10754 -382 -2513 1568 5310 5753 1693 1094 -6602 -9120
7258 -9120 -7399 -2706 -2743 3939 5512 6621 13746 9650 12691 473 -3205 -5439 -3866 -2068 510
7243 510 3271 612 10073 6013 7927 14096 15382 12817 6908 2216 7522 19304 19389 14909 15872 11624
7227 11624 -3337 5697 12410 11312 10495 1548 846 1024 1572 7772 5091 -317 -5296 -9741 -10259 -8855
7211 -8855 -17738 -8623 762 -913 -726 5286 4310 -4364 -7415 -2574 -393 -3037 -11317 -18972 -17337
7196 -17337 -12684 -7960 -18984 -22598 41 8981 3266 -1666 1012 -10170 -15753 -21819 -23697 -21358
7182 -21358 -10928 6486 5901 902 4024 7268 12003 7179 5914 14772 15065 2395 -731 7219
7168 7219 3057 2646 5896 3611 3781 -3242 2139 -4167 -5716 -11207 -8425 -6311 -2276 -3973 -871
7153 -871 1433 -1799 -3561 -9906 -19977 -16793 -3862 -3956 -15570 -14459 -12292 -21986 -25487 -25087 -11167
7138 -11167 554 -4063 -2050 -11077 -22358 -16468 -5178 5245 6619 -612 -3444 1962 13761
7125 13761 12281 6590 12665 11216 7558 199 -5271 -4527 6162 833 348 -8895 -5801 2838 -13127
7110 -13127 -3220 6692 -12163 -23271 -22658 -18024 -21001 -19638 -14847 -7440 -7307 -15418 -17592 -14930 -9731
7095 -9731 -13063 -9277 -16356 -19046 -21742 -17560 -11893 -9624 -4612 -2811 -6240 -770 157 -9205 -18747
7080 -18747 -16851 -10172 -11039 -10306 -6064 5742 3829 -4853 -8814 -2415 -1488 -9530 -9173 -2803 -9690
7065 -9690 -21458 -29220 -4773 14492 19026 18814 16220 26182 21463 5016 -6550 -14973 -8105 1276
7051 1276 11166 18609 12304 11337 8961 22 -328 2355 -3305 -4861 -5074 2056 6571 3447 9244 7476
7035 7476 -2694 -9128 -10647 -9461 -4894 2652 4823 2763 -1600 7213 -335 -1388 6077 10250 3047
7020 3047 -745 -9277 -8415 -536 1993 -6305 -21216 -26461 -19421 -20624 -15273 -7838 377 3283 6750
7005 6750 373 -12466 -6002 3091 -6524 -18640 -20275 -22601 -16704 -19546 -22183 -21363 -19468 -27201 -24010
6990 -24010 -15781 -17372 -17415 -6730 -1336 -7988 -20605 -19540 -8236 -9467 -12777 -5961 -5972 -1427 9192
6975 9192 7053 8621 7984 4526 16107 13617 15554 5955 -1136 -3958 1219 4788 -8750 -12411 -16389
6960 -16389 -24251 -26633 -7703 -241 879 -3047 -3969 -14298 -12202 4273 3129 -14346 -25871 -34257
6946 -34257 -28905 -20353 -11199 -4891 -2047 4608 11011 14301 12939 5499 -3865 -3152 -4630 6145 2093
6931 2093 -3541 -5676 -1824 -2243 -9758 -10670 -19524 -27080 -17632 3148 13482 11288 1310 -4883 -4183
6916 -4183 -7523 -10083 -12327 -12804 -6778 -869 -8826 -654 13843 3388 -10082 -12259 103 10442
6902 10442 4358 2423 2841 -4254 -13231 -361 12120 11520 4214 -4061 -6124 -6252 -3071 -1506 1665
6887 1665 11863 12688 1711 -3978 -4490 -13129 -19045 -16153 4688 11512 18057 25838 4401 4779 2840
6872 2840 -3047 -7119 3258 3549 4927 5121 2843 6072 -1241 -5323 -17561 -9679 1429 2536 2655
6857 2655 -2288 2118 8737 4770 -1920 -4060 2600 -4270 -819 -5695 -9363 -2708 -2461 -10396 -8245
6842 -8245 -1933 1113 2542 -4473 -1119 -3505 2513 -2693 -2936 -5882 -11035 -4492 1186 9131 14971
6827 14971 11750 3046 2713 11184 22570 24496 13997 15518 13170 14181 13582 2627 2337 1118 -5062
6812 -5062 -1055 3643 5167 2818 5423 1853 -4006 -1303 -201 1445 4423 11360 5843 1871 -2364
6797 -2364 -7667 -6728 4254 6803 9894 6043 662 1586 4707 3681 360 3834 -734 -2313 964
6782 964 -8468 -8534 12943 19650 15045 4303 -6416 -5351 -2363 1162 5385 4511 -9580 -11801 -8674
6767 -8674 -9216 -10001 -7357 -8130 -17954 -22439 -17428 -4682 -4180 -3444 -9403 -4454 -3706 -5681 -11877 -4905
6751 -4905 3250 -6354 -10561 -13194 -20792 -23502 -25268 -10630 2838 5492 12812 17620 19762 21072
6737 21072 6992 4240 7637 11645 6178 -14093 -11258 -2016 9762 7035 6816 4800 11341 19549
6723 19549 24334 9469 7579 12181 7648 7513 9408 4982 7048 5846 9340 1353 -5275 -3533 -5178
6708 -5178 -6271 -11265 -22232 -36663 -33691 -18783 -15022 -13294 -16277 -16270 -9371 5778 7555 5442 -9890
6693 -9890 -14150 -6210 -8220 -2838 -449 6919 11383 13923 10444 1903 -19465 -16728 -12142 -6597 -9503
6678 -9503 -9875 -6344 -1701 4167 2045 -7474 -24383 -17641 -17964 -4826 -9036 -14534 -6076 -8941 -18564
6663 -18564 -15973 -15045 -15255 -17427 -5826 -2993 -2134 -10091 -5520 5239 491 -3152 -13652 -14217 -2282
6648 -2282 -6077 -9013 1264 7787 1164 -2836 -5090 -4433 4173 8782 3961 -2559 -9090 -9335 5999
6633 5999 12108 28726 33397 39745 27802 12686 2131 -1343 8267 14995 14779 12650 7900 16438
6619 16438 22814 17232 5960 -258 1525 9811 4468 -10483 1396 -10066 -15853 -8156 -1047 7324
6605 7324 6054 664 -614 -1870 -669 -1994 7055 15667 5249 2146 4739 -2321 6408 3246 -14766
6590 -14766 -21916 -11461 -2454 5710 -536 -11448 -4523 5130 1199 1691 -8713 811 10273 5373
6576 5373 -5288 -7196 -5104 6890 5917 -8519 -20930 -12211 -18684 -20350 -20467 -18916 -3769 -2677
6562 -2677 -16667 -21754 -16133 -15605 -13278 -4242 -4478 -10189 -9656 -5390 -1458 4914 10133 -376 -7885
6547 -7885 -8493 -6413 -6792 -4180 -13547 -19678 -8715 -3663 -9826 -5729 1 -344 -2545 -748 5401
6532 5401 14034 15536 9131 -1775 -5417 -12532 -24112 -18567 -15127 -4618 2974 12863 11348 -2199
6518 -2199 -565 961 8617 8119 8332 7963 -329 -13408 -9121 6920 16908 22127 14059 4746 8060
6503 8060 2219 1344 11273 17117 8808 -7054 -19375 -14035 -15398 -12393 -12481 -12971 -13976 -23730 -21397
6488 -21397 -5810 -7790 -12828 1347 14608 11617 4709 1956 -1764 1279 7111 -5340 -15631
6475 -15631 -25997 -22161 -16407 -22375 -13439 1046 2558 -4148 7497 12666 -865 2058 -3607 -2226
6461 -2226 -15956 -14746 2252 10649 -410 -2889 -8156 -8625 -7189 -1434 -2121 -10531 -9318 -1628 6076
6446 6076 1197 -6118 -14572 -19136 -27868 -21186 -16116 -13802 -7929 3073 4202 7032 1245 5125 6642
6431 6642 -9624 -19922 -13332 -5189 -1616 -3747 -3840 2321 5034 -3001 6617 12985 5364 4481 8679
6416 8679 -4851 -11615 -3725 -9379 -16696 -22061 -21379 -22829 -23369 -34097 -33242 -39735 -36814 -15874 1745
6401 1745 -1905 -14017 -13061 -5789 2802 5831 -473 -4964 -6253 1616 3008 7433 -2580 -5730 -6936
6386 -6936 -5351 9149 8142 4464 -2961 1452 830 -3800 -8155 -7619 -6928 -4726 2922 2847 7651 15931
6370 15931 11565 8547 15109 10040 -2505 -2447 -1650 -17157 -32841 -31959 -18296 -23472 -10082 -12066
6356 -12066 -8817 -8299 -13051 -9730 -10821 -8400 -1677 3628 -2724 -10153 -11804 -11302 -16849 -10913 -12952
6341 -12952 -7338 -5755 -2848 -11298 -6889 -8906 -23089 -13976 -9975 -14388 -17758 -12057 -8506 -8936 -12511
6326 -12511 -21370 -33209 -40175 -24393 -8897 -3908 11235 9317 5919 -5502 -19504 -14959 -5649
6313 -5649 -5034 -3971 -1396 891 5688 4966 -5901 -2992 9358 8367 -629 -8147 -9846 -3480 -9334
6298 -9334 -8563 -9029 -11847 -9174 -6060 1607 15471 22003 21477 6926 -7186 -8151 -13000 -8458 -11175
6283 -11175 -9040 -9608 -16003 -13172 -14233 4732 11388 8742 9484 4536 6088 7844 356 -7754 -20083
6268 -20083 -14097 -9144 -3057 -1700 -1490 -6140 -10384 -4010 -1679 5923 5352 4026 -2671 -69 288
6253 288 8395 5251 -438 -9381 -16018 -11332 -14791 -16459 -22558 -20666 -15632 -11525 -10107 56 7096
6238 7096 50 815 4679 10696 7420 8610 8671 2105 -1808 12153 9194 2024 -4045 562 10130
6223 10130 17517 17060 -4818 -12984 -6769 -3007 2502 -3365 -4092 5509 12699 7376 -4464 -3225 -8262
6208 -8262 -5881 -1033 11750 21855 9315 1693 -6167 -16977 -20758 -17070 -8785 -19607 -29757
6195 -29757 -17638 -8706 -17895 -15999 1532 14899 19440 7745 4737 4629 -3088 -11203 -3882 -9641
6181 -9641 -7135 -5413 -8903 -4525 9437 4924 231 -9482 -8907 -7425 -13916 -15224 -13801 -19750 -21247
6166 -21247 -17447 -10044 -3883 -11730 -7845 5982 10753 1336 482 2054 -1788 -13130 -10397 -5121
6152 -5121 -11326 -10166 1939 3684 2562 3436 -4237 -10951 -12320 -4624 5827 2528 879 763 3368
6137 3368 -4253 -13083 -21516 -17536 -14755 -2117 9366 5670 651 -605 -1209 -12091 -19659 -16890
6123 -16890 -13224 -9454 -6786 -8817 -16309 -23691 -31380 -27730 -11079 3225 12252 6348 -4156 -9342
6109 -9342 -5592 2953 400 -7338 -9404 -2388 3642 -690 -8770 -14042 -12629 -15213 -12590 -8257 -10886
6094 -10886 -11094 -15203 -22789 -21462 -6234 -4936 -11323 -16958 -14388 -3458 7360 -3937 -4360 -5378
6080 -5378 -8685 -6845 -3597 -2935 -8928 -11609 -6680 -5651 -2112 -1500 -2781 -9497 -4472 -4224 -894 114
6064 114 11064 1436 -4035 -1694 -8919 -19954 -18277 -11665 -8376 -3209 2291 -4375 -4369 -1989 8548
6049 8548 4074 1601 -4134 -12863 -16846 -19680 -13811 -9301 -5955 -4814 -7412 -6012 -12423 -5149 -11222
6034 -11222 -14078 -9485 -4037 -1554 2585 7359 8481 -7343 -10527 -2568 3428 -6244 -15074 -11210
6020 -11210 -12888 -13307 -701 13251 21593 9564 -1339 3645 403 3972 5368 4939 -7479 -6559
6006 -6559 2978 7994 9014 7296 1722 -7983 -5914 -15134 -18034 -11489 -11423 -14472 -16681 -19053 -8700
5991 -8700 -8760 -6716 -1962 -2357 -7316 -5863 -8091 -9372 2257 6217 5385 -137 2688 771 -1888 -4218
5975 -4218 -2595 3768 8342 3832 -8325 -16020 -4647 4164 -291 -10302 -21283 -23579 -21042 -24766
5961 -24766 -6940 2149 -550 -1498 -502 10361 19823 15498 13976 12754 5759 -7040 -6415 -414 6890
5946 6890 17496 16489 9917 9525 10756 4014 -2654 -8260 -14976 -8731 -8551 -16375 -20526 -19318 -16528
5931 -16528 -6536 -91 -4849 -2506 -3522 -12303 -3523 5239 9871 4009 -1671 4082 6252 14642 15284
5916 15284 11992 -4735 -5572 3373 5561 -244 671 5871 -3820 -11503 -4960 -10277 -13847 -25569 -19883
5901 -19883 -10229 -12274 -14854 -13559 -10854 -10225 -6617 -6170 -6053 -9648 -4935 -1304 -2074 -1217 -5541 -8595
5885 -8595 -2530 -539 428 2356 3038 -10458 -29882 -32153 -16593 -11344 -13214 -16638 -15965 -21886 -21867
5870 -21867 -11953 -25514 -30388 -21043 -10386 -4528 11424 14381 13351 11194 6462 11697 14847 12825
5856 12825 4168 3118 12219 6166 -7474 -22392 -18935 6687 11369 -613 -9238 -8797 -2797 -10960
5842 -10960 -27836 -17312 -1888 2905 1695 14699 23962 24612 22088 5268 -2878 -10696 -2056 1103
5828 1103 5606 -6254 -16893 -12355 -11169 1057 18898 23546 18698 248 -20867 -22529 -14701
5815 -14701 -10377 -5201 4248 7744 10188 10630 -4292 -7160 194 15899 20445 16013 4242 -1285
5801 -1285 1970 3152 -641 -10351 -15555 -2542 5127 12155 7275 -3750 -1426 14482 24411 25993
5787 25993 10017 -22 -5597 -10724 -8726 -8971 -6033 -5581 -4140 2559 3068 -6773 -15861 -13011 -20896
5772 -20896 -26284 -23641 -24480 -32425 -30401 -19963 -17394 -8384 -9242 -10294 -15112 -17135 -16754 -23468 -16515
5757 -16515 -386 10233 14903 3763 -4552 -7018 -8020 -3347 6103 4785 2550 -3417 -8338 -11952
5743 -11952 4178 22970 19635 16171 13290 8826 1487 3410 18340 15008 10414 -5945 -7366 -6331
5729 -6331 -6177 -250 3845 4476 8288 9561 13996 12418 12143 9543 8146 1726 1055 3908 -2825 -3284
5713 -3284 -8816 -9848 -7320 -9668 -1083 431 -3568 542 -8417 -18675 -11043 -4202 -11301 -8263 4979
5698 4979 13269 10880 10822 7045 6077 9496 265 -7524 -6262 -7675 -19978 -22996 -8969 5967 11434
5683 11434 10308 13243 17568 9173 3059 3461 -8166 -11731 -14367 -8046 8430 14804 12116 3955
5669 3955 1970 4360 9820 -3314 -4445 4107 5825 -2595 -5145 3660 -4191 -9036 -12809 -11735 -7356
5654 -7356 -2907 -5326 -10878 -8201 -9637 -4516 7661 15671 12842 -8148 -17685 -15889 -12836 -10027
5640 -10027 -12037 -6848 -6525 -7947 -12124 -13949 -5952 2648 11258 2194 4756 17001 5751 -3566
5626 -3566 -3733 -5698 -781 -1609 1916 -11032 -8870 -1673 4743 10064 2640 9613 23276 25815 19924
5611 19924 9363 11614 25252 27613 21130 3943 -10877 128 5351 3178 1957 333 -7322
5598 -7322 477 -2755 -10211 -3298 1945 -6307 -6464 -1968 -4868 -3745 -6344 -5655 879 11964 6350
5583 6350 -6786 -11603 -11285 -8894 -9730 -10325 -8266 -2210 -12039 -20829 -7530 -885 -7215 -10329 -6547
5568 -6547 -1586 -12830 -23680 -26056 -20147 -15126 -6570 -4078 6714 15012 15273 15969 12620 6730 7568
5553 7568 6912 2374 -74 5134 13788 8326 15089 8980 2785 1298 5648 10028 9331 2465 -5780
5538 -5780 -6099 3471 12194 477 -12220 -13285 1389 2822 -205 7514 15771 11208 9210 16979
5524 16979 9946 -676 550 -2279 -9472 -4132 -3120 -10861 -17324 -17024 -7621 -6656 -9156 -2988 -4150
5509 -4150 -5718 -6704 -5865 -1443 149 1694 5591 7488 13202 434 -89 3506 4299 3934 -2410 -3457
5493 -3457 -2454 -6790 -6220 -6255 -10520 -17068 -12977 3340 -3448 -13557 -16987 -23267 -20757 4064 23227
5478 23227 12990 3946 1182 -215 8977 9380 4863 -16138 -10303 5676 14520 11050 33 1592
5464 1592 -724 -2595 -1525 -5697 -10224 -17492 -12569 -7435 -729 11738 2399 1314 2591 4710 5977
5449 5977 2736 6869 9874 426 -8774 -2572 -1262 4991 5968 -14 5463 4014 921 -8224 -4444
5434 -4444 4723 9217 10243 12093 13576 7171 6165 7443 -1769 -4828 3190 3491 -3764 -5481 -4706
5419 -4706 4565 2971 1974 -441 -8032 -12414 -7777 323 -8664 -17304 -9382 3156 2627 7108 14247
5404 14247 18987 16465 -2165 -3587 1349 3473 14450 13896 9963 3964 8062 8319 4468 -8867
5390 -8867 -12070 1548 17335 13945 26240 29173 15907 -408 -5346 -5108 2363 -2876 -1260 -1066
5376 -1066 -588 -6370 -9398 -3287 -596 3903 1955 -11816 -5485 -1501 -5156 -7474 -7535 -17154 -15092
5361 -15092 1954 7598 -2751 -11487 2391 747 -6346 -8026 -7659 -14065 -6313 -13666 -23927 -17784
5347 -17784 -14557 -12672 -10804 -8329 -2722 2101 -4546 603 11012 11527 2245 -8595 5531 2323
5333 2323 -13918 -13026 -1679 9405 13161 23926 22134 17047 5574 -4739 -1112 -4423 -5102 -2753
5319 -2753 -2601 5630 11734 15393 11151 4037 2461 -5571 -4948 12409 14161 4748 2401 -1219 -8674
5304 -8674 -14889 -10224 -9657 -14256 -11582 -11836 -20599 -29771 -25490 -14918 -22883 -23475 -18943 -25000 -22647
5289 -22647 -17191 -15368 -8532 -13576 -8492 -10846 -10228 -16874 -12310 8961 16883 5831 -11793 -10843
5275 -10843 -8991 -11026 346 -5373 -9189 -2676 8996 578 -9383 -11913 -13660 -8345 -2688 1368
5261 1368 7602 9448 233 11723 25797 18140 9522 13653 10357 4878 -6464 -10017 -2070 2612
5247 2612 5978 3624 4569 12192 24478 27555 17418 11292 17352 22537 19003 16119 11338 5806 -13723
5232 -13723 -12759 1942 -5695 -4451 -309 2616 463 -3774 -22407 -27495 -24221 -9500 -4220 -1993
5218 -1993 2800 15744 11321 -2555 -2265 -5777 -2481 944 799 -1327 -10686 -3639 3523 4957 -5004
5203 -5004 -14951 -20852 -17348 -12770 3448 10452 19053 17907 4051 2056 3471 12641 13568 21816 16289
5188 16289 1649 -6152 -6711 -7377 -11126 -16415 -17872 -1598 742 -11006 -1686 5675 11640 8580
5174 8580 11819 8810 5088 6302 -294 -5478 -6933 9187 13003 15639 22581 25241 21553 20680 8654
5159 8654 -1997 -4787 -10337 -13870 -10167 -11907 -9293 -10807 -7542 -12200 -17477 -13613 -13932 -6146 -13237
5144 -13237 -22108 -19291 -2255 12969 10491 2535 2145 9915 -1332 -11102 -7145 -3332 -3353 -7160 -3855
5129 -3855 2463 1881 -6224 -7950 -8149 3413 9467 1163 -4591 -8535 -12549 -11699 -15569 -15063 -12455 -3788
5113 -3788 8861 18033 9975 690 -11312 -13978 -10836 -8902 -12703 -12307 -5941 1647 6124 -6762
5099 -6762 -6958 6627 11179 33216 22200 10436 4706 -3435 -6678 -4744 -446 -5634 -12595 -16837
5085 -16837 -7984 1477 -815 -6780 -8654 -15974 -19031 -20261 -26761 -23874 -25485 -15455 -7307 -7159 -7478
5070 -7478 -7466 -8223 -970 425 -5209 -256 2479 -2320 5555 7085 1485 12278 24209 14193 2026
5055 2026 -4587 -3660 -8554 199 11218 10004 5080 -5310 -5744 2097 6839 2828 2472 7205 4768
5040 4768 -656 -8618 -763 5936 14035 5743 -1346 -304 -879 -10739 -5275 -3869 -1819 1578 6940
5025 6940 5942 5340 4195 3907 7180 10475 -1051 5715 3406 1934 -7558 -2800 7735 5916 -8177
5010 -8177 -7281 1907 4345 10967 9580 2428 -690 -4078 -8439 -14164 -11156 2490 8251 2463 -343
4995 -343 5235 7189 887 4630 8487 13979 10461 6612 7848 6786 -7944 -6609 -831 -5015 226
4980 226 -7254 -11946 -23312 -28435 -26699 -27760 -12792 7617 13056 4195 5269 17062 15770 17992
4966 17992 18838 7780 8171 4888 7200 -2715 -8636 -6749 2558 8476 1458 7167 1823 -5825 941
4951 941 1963 -4739 -580 4611 8306 2728 -5921 -1841 -2399 1658 63 189 -11957 -15346 -19622
4936 -19622 -16409 -10940 -4721 -5873 13192 17122 13900 19756 16948 22048 22036 14999 9434 10948 12881
4921 12881 9001 7344 -987 11545 13109 19892 12624 8166 8956 17639 15263 15170 8208 7891 8326 14711
4905 14711 8888 -2882 74 8918 -205 -10980 -8366 3569 6648 2843 -8830 -15399 -7066 -5482
4891 -5482 -1587 -2479 -1190 -3334 9780 14021 698 -6598 -4710 -18486 -10313 483 6611 10516
4877 10516 3665 1462 -3732 -7606 -10210 -9432 -15618 -12093 5747 6225 13392 23468 19745 12550 14473
4862 14473 12414 -5209 -6219 -251 1101 -2192 -2940 -7400 -3036 -8867 -10051 -6214 -19 2911 5577
4847 5577 12830 10208 3116 -1720 -13316 -14612 -16813 -22445 -18232 -8981 -7853 7075 15636 14755 12752
4832 12752 13588 5414 -500 -3932 2386 6012 6490 2521 4617 2417 -9425 -24833 -21288 -12398 -16386
4817 -16386 -20778 -13902 -7674 -166 -8062 -10352 -12651 12 3927 6592 12546 12691 14781 12129 8813
4802 8813 4138 1133 -11877 -16525 -16309 -7438 -10535 -11472 -17686 -34932 -30463 -12316 -3573 640 834
4787 834 -8508 -4798 -6539 -6114 -8064 -20363 -13924 -15271 -11148 -7952 -5739 -9778 -10564 -14555 -11601
4772 -11601 8517 18476 14026 9085 3706 -4794 -9524 -14957 -14410 -9111 -520 -6887 -11865 -25049
4758 -25049 -30867 -11972 1007 -5773 -7959 -3761 -529 -830 2502 -10327 -12062 -1432 -4173 -2969
4744 -2969 -1836 -4429 -1519 -2428 -3094 -466 7420 11315 10501 5654 11391 19157 19164 5580 -9444 -19850
4728 -19850 -11695 -2502 -7301 -7658 -5836 -4851 -6415 -3491 -5836 -8855 -2463 4733 4590 14402 4340
4713 4340 3862 9890 12318 5859 2438 14512 16459 2650 -12348 -18446 -16997 -10601 -11692 -10173
4699 -10173 -12067 -11248 -12570 -14186 -16313 -19894 -11944 -1709 4466 6279 370 -9069 -14694 -15120 -2886
4684 -2886 8134 -427 3205 7233 -2039 -12635 -2909 16514 14934 12680 3852 4306 6786 6707 17297
4669 17297 13007 11552 6698 -6486 -22615 -22231 -17241 -8301 5374 7325 6816 5441 -3830 -6411
4655 -6411 -3065 -917 -3156 8174 2131 -1973 1198 -152 3838 11562 20891 12398 11357 5956 -1790
4640 -1790 -11508 -10313 -13792 -28591 -33000 -25207 -14528 -14313 -4442 -1594 -7630 -6148 -7054 -11609 -7608
4625 -7608 4359 -10238 -18942 -17396 -14758 -22934 -12364 -12826 -12887 -6414 -12076 -11214 -5673 -6155 -13484
4610 -13484 -16747 -19131 -14447 1083 -1783 -5051 -5761 -6535 -4649 -11427 -11554 -1215 4312 13829 17211
4595 17211 13887 11176 -5885 -8129 -9752 -2952 3664 21215 21643 9643 9665 12943 10166 -8029
4581 -8029 387 1 2938 14379 18081 6041 -10506 3059 18312 33468 24637 1155 -4340
4568 -4340 -14374 -16711 -1933 -1259 79 -1803 -4599 -341 -2693 -14166 -4251 2902 7159 13831
4554 13831 7110 589 -484 -908 105 -1074 3875 969 -3380 -211 4793 3081 13319 17997 16145
4539 16145 11124 4564 -3688 -1490 3644 -2891 -6013 -8211 -12165 -14146 -15913 -4734 1864 2914
4525 2914 2706 -9216 -13209 -11953 1757 2058 -3494 -10790 -6555 2622 1701 -3227 -13800 -9960 -4138
4510 -4138 2035 -1195 -3900 11498 8122 1693 -18160 -15151 -1872 6741 604 -7914 -12367 -4003
4496 -4003 4941 -497 -2121 -7521 -9669 -11085 -9710 -8464 -8066 -7798 -10794 -3181 9367 6811 2679
4481 2679 -14656 -31837 -34544 -25162 -15036 -11730 -623 9585 5675 -8710 -13186 -2278 -5044
4468 -5044 -17121 -15481 -6477 3676 1965 -388 496 3410 3488 714 16339 18485 10629 1790 4948
4453 4948 -4898 41 -4224 -11561 -6673 4808 7923 6977 8325 2924 -6380 -13934 -16968 -11706 -18318
4438 -18318 -12551 -15232 -13644 -13090 -8042 -2485 705 -6581 -9652 -3871 4285 5820 2824 -2465 6117
4423 6117 10192 9558 9829 12765 5519 -2937 74 2374 334 4 2736 -5164 -13199 -10978 -6674 -9300
4407 -9300 -9976 -12458 -23538 -5897 7380 2934 3974 -3434 -11541 -9382 -1343 -8942 -12719 -19415
4393 -19415 -17720 -5895 7101 7315 9088 5382 -819 -5095 -13790 -24994 -17586 -10508 1367 -1374
4379 -1374 -12957 -12437 -5871 1734 7203 1607 -7233 -13040 -11777 -20570 -19371 -14034 -788 -2659 -3595
4364 -3595 4035 -10579 -28155 -36250 -29154 -18407 -4249 4383 2122 -3140 -6301 -6401 -1105 5764
4350 5764 4024 5061 5731 12712 16606 -592 -18473 -18656 -13195 -13410 -7217 -2299 3932 12542 8105
4335 8105 -5394 -16013 -15532 -7337 -1772 3118 6496 6020 1049 2250 -4112 -8620 -10090 -1938 172
4320 172 -4178 -5119 -6876 -1327 2625 -4538 -17114 -9188 -7286 1316 14431 13943 2979 -6781 -8420
4305 -8420 -10468 -2704 2982 5589 3454 -1327 -611 10213 14255 25032 17207 10046 2561 3471 6145
4290 6145 18510 19114 27151 27965 15922 3028 -559 3443 7118 12427 11410 691 -2346 6683
4276 6683 10789 11599 18865 17079 2291 -473 -13011 -20593 -19167 -12973 2002 17932 21577 25664
4262 25664 18004 8848 6401 6067 8785 11753 6058 5003 1152 -5573 -9843 -27230 -23097 -3978
4248 -3978 -3426 -3038 4161 11539 7959 6223 8157 18467 15562 1855 -2000 -11135 -18930 -11999 450
4233 450 -1275 -10904 -11495 -11801 -3858 -5775 -12128 -16503 -13031 -8403 1050 3137 -2671 -13207 -13508 -14069
4217 -14069 -12333 -13270 -19140 -20267 -17761 -10631 -9373 -18576 -20866 -14951 -5707 609 11490 13367 6645
4202 6645 -1454 -6551 -10730 -800 6714 16056 5131 1050 8700 4838 -6285 2318 6579 -11342
4188 -11342 -5384 2739 -278 -13212 -16316 -11559 -9242 -3404 -10051 -26862 -20823 -12033 -6160 -1127
4174 -1127 -1559 7021 11025 11621 6720 7245 15209 6063 4300 11383 20910 26383 15162 2282 3405
4159 3405 -5584 -13496 -18206 -18248 -13849 -10850 -19477 -21740 -8036 4870 5116 -10050 -22537 -10369
4145 -10369 -12514 -12598 1505 59 -2776 -5385 -12887 -19007 -17947 -6387 4753 7107 2391 1927 3655
4130 3655 9160 12104 22014 24888 19036 12681 3392 -2705 -5815 -8615 -9578 -15400 -1749 6667 9478
4115 9478 11377 -563 816 -7029 4420 12393 18504 1446 -7081 1088 2729 3251 4111 16024
4101 16024 1824 -4375 1618 3240 -3343 -14256 -10892 -9951 -7958 4140 183 -2246 -10415 -307
4087 -307 6955 -1896 -4652 -6720 11236 11156 -1212 -9906 -7485 -9097 -4623 -3644 -3563 1391 3645 6659
4071 6659 15128 15081 5809 12453 12298 2840 -854 347 1146 -6955 784 -8452 -18707 -18101 -6581 -12761
4055 -12761 -16129 -19075 -17297 -1149 12531 6485 -878 -11121 -8750 -10207 -16615 -13820 -4406 16635
4041 16635 22566 10571 1418 100 7801 4987 2815 4394 3381 -5932 -4058 11445 13466 469
4027 469 -3284 -2422 1736 -3598 -12976 -3437 -4184 2393 8421 2753 -3794 -1728 545 -8605 -11785 -21698
4011 -21698 -16805 -10550 -13926 -16848 -2038 886 -2171 -968 -12011 -20141 -23128 -18544 -6721 4924
3997 4924 -8627 -7506 -4728 1907 -283 -14127 -13701 -627 -4874 -10644 -17520 -17168 -10706 10743
3983 10743 9643 -3238 -20810 -10050 638 -6159 -16118 -13230 -13090 2385 15416 23001 31241
3970 31241 27612 19097 5236 6469 10541 -1895 -5051 -14015 -14460 -11169 -5482 1400 17301 27340
3956 27340 28860 11051 -8167 -11164 -11819 -13523 6307 12307 3181 1320 12049 10920 -179 -10891
3942 -10891 1609 7264 6582 3360 5759 -293 -3173 -4861 -795 8051 4186 6253 8539 3922 -4284
3927 -4284 -265 -5388 -18780 -21355 -23748 -21037 -16438 -8284 -3071 -11683 -12601 -12280 -8499 176 9384
3912 9384 -5447 -10084 -2314 -4082 -6572 -2293 -6642 -2362 10955 12235 231 -6334 -6960 -16489
3898 -16489 -18743 -19658 -25570 -23676 -26385 -22619 -19384 -11147 -4692 -10372 -3803 3902 -1600 8748 16038
3883 16038 14807 5460 -9079 -22140 -22814 -13686 -11329 -9652 -3297 -6223 -4040 4447 7017 6471 564
3868 564 947 -4225 3737 13530 20098 28322 20188 9710 1418 -3138 -15833 -24428 -14945 -17040 -5601
3853 -5601 8835 12520 -551 -6815 -11171 -5979 1613 5086 -3068 -7621 -10137 -16718 -12889 -5707
3839 -5707 -10012 -951 5480 10039 5771 6078 5244 5765 5048 1791 2040 10989 5426 845 11257 21123
3823 21123 30112 37075 16163 6475 5492 -2628 -9209 -13214 -12090 -15436 -16166 -15511 -15886 -14340 -13692 -2790
3807 -2790 -6605 -11003 -6391 -7969 -3229 606 14911 19978 14022 5757 4537 -238 5684 8520 7271
3792 7271 5155 3146 3111 -1711 996 3973 -4147 -5700 -5211 -14067 -20812 -14001 -10530 -18085 -14051 -23988
3776 -23988 -23724 -17037 -6545 -8323 -16441 -23934 -5695 -10413 -15399 -22850 -19308 -16999 -20339 -21857
3762 -21857 -18221 -18365 -7311 -5183 -14679 -18317 -10834 -19183 -19633 -14121 -11694 2503 -3331 -6413 -3429
3747 -3429 -5549 -9383 -240 17382 15826 3799 -7229 -3690 1659 -5710 -15549 -16599 -6262 1335
3733 1335 4779 14036 5104 3830 14917 9039 3673 -927 5621 6390 3290 6920 -913 -7819 -14990
3718 -14990 -14731 -11756 -5404 -5619 -4263 -11183 -20675 -19580 -17300 -11607 -6330 -4993 -6580 -10984 -16338
3703 -16338 -15391 -16438 -7185 1948 10881 12779 4953 5801 571 -4954 -13071 -6878 1295 5646 -1985
3688 -1985 -1374 -7402 -19303 -27821 -17639 -9870 4239 -4037 -12798 -10507 -3467 3341 1725 -1141
3674 -1141 -4871 -2156 14826 25584 23318 7891 6147 13285 16309 14815 7522 3487 -5844 -3977
3660 -3977 -6581 -9565 -10370 -4886 -8597 -24538 -14753 -8360 3673 9962 7890 -2119 -14635 -17695
3646 -17695 -17277 -15128 -927 -4402 -10730 -15833 -11970 -15241 -9457 -4110 -10614 -11247 -12479 -18991 -24285
3631 -24285 -14203 -6204 -7310 -9477 -9582 2227 15420 13200 2739 15040 6341 -16092 -18892
3618 -18892 -6466 -10473 -15039 -2484 10789 13136 5176 -3060 -11077 -11997 -10380 5227 694 7706
3604 7706 14959 11480 1578 1233 -2791 -2575 7085 6182 3525 -8768 -11419 -14540 -7469 693 3922
3589 3922 8626 8579 2272 4982 8185 12294 9919 4454 8280 14722 20417 21502 23604 22181 16100
3574 16100 12342 2196 -416 -4293 -5078 -13145 -16610 -22907 -968 19418 29956 31580 11289 -11940
3560 -11940 -5458 6576 5777 5975 5973 6976 3822 -4005 2783 3423 1323 4241 9146 6539 -8708 -14469
3544 -14469 -13926 -9436 745 812 -8157 -11955 -11476 -5948 2905 11155 16631 15054 11882 10709 6409
3529 6409 209 -6928 473 15074 25643 12295 818 -6827 -15263 -15032 -5701 3376 -3726 -10025
3515 -10025 -8503 -3646 599 -1707 -8050 -12054 -5816 -6234 -2889 -1834 6850 16356 4850 5280 -2375
3500 -2375 -4986 -3482 -5518 -10356 -8049 -10764 -5095 -7767 -2158 -3724 928 -723 -9728 -11631 -8012
3485 -8012 -5699 4678 10312 6931 12937 13704 7067 -4349 -6867 -12341 -8318 -7580 -13945 -9763 -4221
3470 -4221 -3264 1689 1768 537 -1488 -15257 -27907 -30642 -27672 -19249 -10591 -10466 -10373 -2294 7225 3660
3454 3660 1785 -7737 -4490 1594 -112 5401 2338 -1079 4043 -3683 1470 -3968 -3009 -7014 -2043
3439 -2043 5540 10523 6402 -2204 -3978 1118 1303 -2873 15374 11229 -6715 -7034 -7619 5907 17999
3424 17999 19945 15896 12388 9355 1702 1242 -11373 -18241 -15991 -6566 -4349 679 6986 5935 5256
3409 5256 589 -6799 -19319 -17808 -6247 -821 -5031 -5301 4939 6213 6629 8799 2400 -13515
3395 -13515 -11832 -16154 -7953 -4611 -17151 -24686 -16249 -5972 1748 5293 8463 4743 -184 -7932
3381 -7932 2452 11511 8015 3876 10665 22075 7669 -7583 -908 3781 1137 -3816 -8683 -8182
3367 -8182 -3014 2115 -188 5611 -2082 -13798 -2586 546 -11205 -11732 -14614 -21033 -14338 -14561 -27960
3352 -27960 -23473 -10911 -6043 323 9107 -3320 -9830 -12945 -10717 -14914 -15770 -19973 -10580 -18388
3338 -18388 -14228 -6 7932 20409 20721 14857 8649 10 -4932 -5911 8100 14414 802 -1359
3324 -1359 -3158 -11618 -1469 5113 2412 14889 21651 22427 13330 -1701 -18648 -14176 -10992 -22016
3310 -22016 -33885 -30371 -18916 -10145 -2564 -7623 -3844 2590 7118 5755 7131 7428 9703 -214
3296 -214 7912 6543 2833 -261 -3795 4350 6498 342 -9435 -14643 1096 4985 -3110 3156 12521
3281 12521 6329 -3358 870 3329 -1798 -3495 -58 6069 8238 11354 8118 7936 11271 13542 4626
3266 4626 1528 4990 5988 11247 12213 8200 4778 3918 893 -11115 -10315 -6417 -3980 5022 -5335
3251 -5335 -18704 -10235 -430 3587 1376 6787 -1557 -3547 -3941 -3073 4024 2382 -2168 -6158 -679
3236 -679 11431 6423 3754 13217 23554 22431 14710 -8068 -11544 -3988 989 -2197 -5066 -192
3222 -192 15699 16193 5806 -6521 -12213 -9523 -4629 -2040 -8972 -15645 -11754 971 5093 10639
3208 10639 11096 7097 -11548 -16006 -11823 -8091 -3121 -4708 1649 -1417 2131 16785 29636 33461
3194 33461 33332 35803 25019 -965 -13192 -14090 -4586 8466 4617 800 6914 7515 2062 -11573
3180 -11573 -15364 -6973 -1235 1448 3945 3959 -6457 -523 -710 -4356 -1360 -97 4311 10461 1546
3165 1546 -5897 -11190 -14922 -10500 -5139 -5889 -8933 -6117 -2911 -1487 8135 18706 20485 21415 20990
3150 20990 24671 19667 11837 6322 1343 2070 -8553 -3312 2424 8881 17321 12137 12334 4899 -4984
3135 -4984 -8356 558 6388 4754 -7769 -11936 -16645 -17198 -24925 -19275 -2947 -5704 -1345 -6454 -11504
3120 -11504 3227 4073 1416 -8649 -13715 -9639 -8469 -3578 7077 10848 10780 1298 -4994 -6919 1410
3105 1410 -2589 636 8432 17652 15337 10412 10549 11110 11925 21404 9709 6970 18387 29850 19920
3090 19920 6194 124 -1416 -8086 -7777 -258 -7968 -14298 -13151 -12177 -10546 -9950 -7625 -3669 -6304
3075 -6304 -606 -6131 -7964 -6490 -7571 950 2073 353 3935 13144 8791 3632 -5687 -6211 -3899
3060 -3899 2717 15593 11408 2104 6985 12109 12032 8268 8876 2465 4568 -3180 -13933 -18812 -20407
3045 -20407 -30030 -25282 -11355 326 237 -7418 -8218 -14106 -23300 -13256 -12845 -13177 -16447 -19453 -6887
3030 -6887 -4962 -6598 1695 7204 11402 15752 19546 21829 12357 6556 1595 -4757 2711 299 377
3015 377 9981 9681 4532 9153 13837 7407 4601 2162 4234 -4292 5804 15570 10388 2685 1219
3000 1219 -1784 388 11355 22807 18254 20169 16399 4768 11343 14878 16439 -8631 -12631 -6842
2986 -6842 1719 4666 2379 -279 6746 4240 3738 -326 4854 12217 28227 6756 -7815 -10139
2972 -10139 -10418 -12695 337 5198 9969 -13343 -10421 -158 -1709 2771 9420 12063 5366 1191
2958 1191 -13893 -21377 -12563 8421 -3121 -16928 -23676 -21272 -8812 9851 18236 14410 -2262
2945 -2262 1937 3020 3272 -6502 -8270 3062 20727 21803 10575 5098 3290 4749 5634 11121 8420
2930 8420 -2425 -694 -4503 -6622 -12146 -1543 -4290 -16027 -10242 845 8890 12820 6645 12008
2916 12008 15849 10505 16495 18428 5884 -612 7420 22660 9672 -6062 -8460 1400 8264 14390
2902 14390 14877 11674 1437 -5170 9299 6948 -7633 -15726 -13566 -8057 -11636 -12507 -19495 -8520
2888 -8520 3318 8869 4865 1933 -12381 -2370 2486 -2308 -6393 1258 23945 30194 13928 7670
2874 7670 12566 15387 12179 16921 18446 13728 14924 7636 2346 11090 8117 1729 7673 -3303 -10045
2859 -10045 -3222 -266 -1876 6853 13759 16500 19761 15209 8787 -4038 -9668 -2341 10043 10027 13057
2844 13057 10058 1640 -3126 -1792 10697 19453 14686 9183 184 -11151 -5413 -12876 -1354 563
2830 563 -5069 771 -8726 -13869 -6275 -13285 -20837 -14206 -10016 -3271 1966 7552 2701 3048 6318
2815 6318 -1379 -6055 -4345 -2867 -11211 -10371 -9448 -20318 -20788 -17931 -11343 -4317 -1196 5963 -10776
2800 -10776 -23743 -25777 -12706 147 13656 10683 6581 5226 1337 -4811 -930 -2552 -5182 -7708
2786 -7708 -8229 -5491 -11293 -3496 3317 -8122 -2201 5988 10309 1039 -12760 -10197 -6785 -10663 -2808
2771 -2808 1154 -4181 1321 -1161 -5264 -11872 -15135 -13867 -14014 -3891 -14963 -25060 -24603 -10640
2757 -10640 4348 7723 -1691 -4343 -1391 9557 22407 22956 21532 11161 -16077 -26647 -22984
2744 -22984 -16968 -9539 -5675 3223 -1313 1956 499 3510 4313 2294 193 -6527 -6924 13298 20486
2729 20486 13268 3735 -6086 -12244 -4177 5822 -4280 -4508 -6480 364 1120 -920 -405 5782 8233
2714 8233 12062 13437 11852 6916 -5841 -15759 -15101 -8880 6159 7344 1353 2557 8503 6341 950
2699 950 -7231 -504 3466 -4153 -13473 -12912 -17276 -17471 -13469 -10840 -10866 -8395 -11992 -20399 -17833 -12626
2683 -12626 -22453 -23977 -7651 -6538 3620 7875 5664 1901 3965 3671 2425 -6347 -8525 -12052
2669 -12052 -10884 -19288 -23820 -18489 -15168 -5177 -5710 -11814 -17521 -16020 -3803 8365 6601 2215
2655 2215 -4789 -16633 -19409 -20988 -15768 -2629 7025 -1871 4167 9895 5964 -4259 -4448 10521
2641 10521 14144 3650 3741 10744 7107 -2224 -3218 -1026 -2542 7990 6357 -2283 -2377 -10430 -4911
2626 -4911 10284 12593 1120 -2086 -13711 -15198 -17790 -7658 -6138 -2246 7899 9065 14225 16969
2612 16969 20227 17869 19366 18271 9512 8824 4050 1971 112 -3714 -5912 -12372 -8754 6794 9776
2597 9776 12316 19036 12260 6918 -682 1592 7111 6849 10706 24570 13856 17404 17726 10875 9985
2582 9985 5357 -2322 -15750 -28663 -13356 -6758 -7122 -9527 -15825 -9957 5609 13136 13043 3451 3310
2567 3310 14330 4525 -800 -4790 2527 -641 -7087 4765 -776 -9017 -6264 1171 5355 6588
2553 6588 1531 -10646 -23513 -21472 -18684 -9478 -1621 1313 1349 4585 3396 4468 12610 7922 4099
2538 4099 2028 -5141 -12876 -15808 -8129 -3152 5609 12990 6852 8908 -513 964 3503 9742 6015
2523 6015 2502 6467 16881 17796 17514 10134 3078 -1364 4889 3168 2541 -4128 8592 10627 3734
2508 3734 2697 1418 -2751 4828 7073 3287 2095 -1264 4384 -1655 -8768 -3272 4773 -556 -12791
2493 -12791 -9460 -11068 -1825 -1746 -1111 -4940 4812 17575 8809 8041 -4262 -7777 4405 11418 8296
2478 8296 6848 3041 509 3640 2936 12112 10277 4304 -2473 -7526 -3698 8432 13636 11040 4089
2463 4089 -808 -10159 -3852 1156 10601 12866 1729 -3838 -8182 -2464 10890 12207 10968 597
2449 597 -4043 -2622 4102 -2303 -344 9619 9869 -7188 -5372 -3322 -262 -4173 -728 -5302 -1139
2434 -1139 11042 5618 -6784 -6821 -11716 -18109 -10008 7314 7625 -1054 -4474 6696 4112 1339 -19254
2419 -19254 -24650 -9587 4943 9655 8780 6887 11019 3316 925 5801 -5934 -1146 -823 4296
2405 4296 6582 8185 5625 -3063 1883 22339 24850 14163 10360 7856 -2094 -3706 -112 4602
2391 4602 10586 6746 -4433 -1433 12058 1805 -2421 -10378 -7065 -11818 -17232 -11409 914 2942
2377 2942 5742 4228 360 -9660 -2253 -2033 -5161 -6859 -4767 6131 7056 13075 16050 21662 28023
2362 28023 34395 36405 31595 22364 14680 8079 10552 12548 17975 24185 29105 22488 21833 28464 19796
2347 19796 15540 14948 21575 16627 13605 7793 -685 -10618 -10315 -10345 3555 6393 5229 9766 -4288
2332 -4288 -10814 -17385 -24962 -21187 -9730 -6190 591 -1464 -12961 -6169 1423 -5822 -2957 1967
2318 1967 5282 724 -12316 -8474 -732 -6639 -2130 10649 13658 2120 9603 21968 27186 34078
2304 34078 20636 10438 2703 -4982 -9410 -10484 -4700 1232 -1305 -1700 1378 -2521 8938 9099
2290 9099 3128 389 7482 1817 -2038 -4194 2338 -2862 -16734 -21631 -10895 -7105 -6985 927 10696
2275 10696 2620 4353 14267 16362 24234 21211 8268 -6823 -9468 -8871 -6901 1409 -3228 3891
2261 3891 3723 195 -13755 -18154 -9948 -11372 -18526 -7838 -501 9509 5329 -7190 -18781 -13419
2247 -13419 -9532 -2434 -2817 194 9238 13937 7187 9420 12292 8184 4579 16227 12288 7017 12891
2232 12891 6805 8582 -6316 -7877 357 4237 5377 5696 11886 6926 7239 12719 18699 21019 14264
2217 14264 12779 14466 17064 7635 -867 5557 9084 9992 22139 27861 26457 15472 15619 13411 16318
2202 16318 14675 15708 18009 14033 5978 3296 8503 1862 -5892 -2511 7062 4582 3403 6298 -18
2187 -18 -933 -1808 3599 7218 268 7568 11502 12630 7714 15688 20131 14455 15094 28715 29356 25745
2171 25745 16336 8001 3928 6410 1006 7411 11001 15870 14432 -1873 3345 6431 556 4565
2157 4565 1211 -509 15813 19937 6342 -10303 -10281 -8789 -3499 5289 12364 20315 18388 4333
2143 4333 923 -3288 -6678 832 -3013 281 -1309 1019 4224 -737 -3619 -1536 -4592 -1508 -376
2128 -376 -5210 -8664 -5485 -3386 -4348 753 3755 -7858 -12393 -16278 -14135 -13116 -3127 -1863 -5632
2113 -5632 -1549 4859 4592 -589 -4554 -109 5319 5526 -7550 -16015 -22677 -17645 -10515 -2000 -739
2098 -739 2993 12035 18924 18537 12937 14963 11656 11086 12088 13630 3227 -6918 -13089 -17371 -18426
2083 -18426 -10722 -3109 2267 4259 3069 6023 9444 6100 -857 -1310 -2047 -4327 -17195 -16374 -10853
2068 -10853 -16007 -26635 -14540 -5060 3769 -1559 -4221 3749 4225 -3670 1592 9880 3470 8166
2054 8166 11298 24424 23331 19817 2110 -4323 1071 1674 4754 15092 13855 26129 28592 8994
2040 8994 -3352 2534 2286 5902 5009 -16 1096 3621 13468 15451 16837 13221 3903 5074 312
2025 312 1387 -1958 -13850 -13018 -3403 2806 3050 9134 16241 21767 18641 9718 -2179 -1303 3869
2010 3869 15891 27922 22962 12645 14670 12381 2873 -2655 -10551 -9811 -10034 -4531 -8271 -11361 -3962
1995 -3962 4111 -1855 -1990 -4927 1341 2602 2459 14155 18591 17415 18305 16267 5938 11600 11903
1980 11903 5559 1408 -10851 -12260 -14621 -18005 -15441 -11730 -3072 7291 15571 10143 1193 -650
1966 -650 -8755 -10988 -894 13509 13595 8489 -3661 -10367 -369 1755 -14984 -9323 -297 3504 9971
1951 9971 7695 -1002 -862 -5441 -6724 -8832 -5689 6652 14786 11299 7230 6735 -2185 -3344 6887
1936 6887 14453 4290 453 7845 1168 -9910 -6460 2207 9639 7345 -311 67 7263 1581 -6746
1921 -6746 -13241 -9560 -7051 1526 14898 19985 23646 15879 3050 3281 -122 1740 2032 3398 7141
1906 7141 10225 9253 5027 12170 2681 -3573 4349 9100 15114 17049 5561 -305 -2256 1367 4871
1891 4871 7863 7507 12159 9432 2560 4924 10843 3961 5062 3861 11871 12076 8081 4173 8837
1876 8837 10995 13357 9372 7241 16027 15343 4232 284 -3522 -14988 -18929 -25191 -27588 -24270 -17336
1861 -17336 -16136 -19939 -15083 -12991 -14918 -8972 -2135 -10191 -5038 10875 17877 26700 10521 -7166
1847 -7166 -12320 -6226 -13790 -18945 -16810 -21353 -14143 -11478 -16626 -19866 -11122 -6902 -4282 -5457 -6823
1832 -6823 -10912 -20980 -22756 -10616 -328 -93 -10469 -16523 -7557 13676 11338 10290 -6085 -7122
1818 -7122 5225 18996 26943 23698 13629 22490 22709 2644 -5173 -14923 -12667 -12755 -23449 -15302
1804 -15302 -9010 9663 23950 11924 -5906 -2022 6921 5828 5680 9388 10847 11051 1245 -7241
1790 -7241 -11324 -9497 -4917 -1009 -2492 4132 5318 3943 9858 -1260 -15134 -14808 -10331 4215
1776 4215 10401 9713 9807 4944 4256 3268 -4943 -5460 -1821 7077 8080 5754 -2431 -5560 -3347 -962
1760 -962 -6835 -3391 -303 -780 -16720 -22518 -14100 -14310 -15307 -7401 -3466 -3897 -1498 -13247 -14003 -5954
1744 -5954 -10264 -12534 -4630 -7880 -8345 -802 -692 1861 21509 16467 11043 10339 5787 -6809 -10702
1729 -10702 2693 12837 7016 1113 -11817 -16029 -12037 -14709 -10075 -6953 10521 13359 6733 3100
1715 3100 4245 -632 -1198 1119 9654 8802 5032 3501 4710 9112 2958 4781 10085 5129 622
1700 622 -3748 -9422 -12189 -17326 -22705 -20508 -18305 -8378 4105 10498 5990 1186 -2608 10252 4515
1685 4515 -1265 -7237 -13193 -13991 -14216 -12686 -13824 -11720 -2010 3213 -11120 -12494 -7511 -9618 -4274
1670 -4274 725 2442 -4885 -6387 -2224 -733 5782 -823 -3791 10709 22886 16027 445 -8750
1656 -8750 -9878 -11279 884 -342 -4972 -6806 -5380 -7270 2650 2976 1257 -1273 -1546 -4075 -121
1641 -121 -2906 -2329 -6056 -6512 -1641 8760 3882 -3101 -8942 -7415 7292 16645 14818 8002 -4275
1626 -4275 -3491 9171 8651 4296 3434 -13195 -21577 -8714 -5007 -8672 -4661 -3914 4071 10700 3617
1611 3617 -3141 -5675 -9879 -12241 -17837 -14601 -17294 -19324 -20359 -26395 -28626 -17428 -16380 -15088 -5872
1596 -5872 -7667 -6601 6377 -1282 -7905 -4943 6235 406 1988 2124 1622 -167 3370 11554 8508
1581 8508 2315 5095 7416 2201 -1340 -957 2490 915 216 5947 1171 -1128 -1303 -10505 -11952 -15060
1565 -15060 -3759 10787 12906 8477 11712 7963 889 3964 21440 20831 12245 -1679 -6830 -1198
1551 -1198 3888 2285 -1915 -6966 -8272 -9489 -6014 1995 3323 -119 -7743 -8276 -6366 350 10461
1536 10461 2692 -3005 4898 5600 -4924 156 2085 5226 8315 12889 11083 547 5561 9260
1522 9260 2737 6163 18874 20528 6482 8597 12527 -2789 -8405 -11921 -14437 -1623 2905 5304
1508 5304 3088 2175 -3748 -3844 -10921 -11 8962 7396 8157 13396 14376 8517 528 -6417 -6879 -8072
1492 -8072 -2493 1328 -6857 -11875 -24275 -22632 -19255 -17333 -4881 -725 -12358 -8255 6846 8868
1478 8868 -3973 -1027 13470 13371 7644 4634 14220 15560 9877 1512 8874 28602 24353 14049
1464 14049 13078 11330 5745 8916 -1831 9875 17039 15110 17311 7261 3046 2768 6341 3847
1450 3847 6442 16718 15987 17914 7516 420 1700 3723 4045 1321 -9034 -15759 -9988 -6934 4933
1435 4933 10818 11622 11333 10854 15441 7046 -2528 -6547 -18376 -14740 -3779 2333 -7405 -9579 398
1420 398 3106 2750 1764 4402 1145 -1110 4323 2365 980 2153 5192 17290 28361 35239 32773
1405 32773 19158 7427 9753 12651 22197 20035 15598 18605 8658 13041 14094 7788 11929 19880
1391 19880 18623 8057 -7008 -4255 9281 7551 12147 2544 -3370 -106 5975 -889 1623 -425
1377 -425 2248 -620 -424 -7675 -6449 -4477 -9480 800 2192 6921 16585 23258 1881 -2239 -744
1362 -744 364 -1964 -879 -5514 -196 -94 3770 1680 -13482 -21467 -18886 -32327 -28705 -18166 -11396
1347 -11396 -4921 -7676 -10829 -493 3198 7741 21534 25014 19920 13001 2567 5228 2156 -2258
1333 -2258 7109 13968 18038 4319 1233 1163 2805 10260 16310 17694 25599 20680 7606 5238 13247
1318 13247 6472 9148 8971 8261 15557 16149 4757 -666 -1671 1473 -5566 -2795 11008 8799 -1828
1303 -1828 -2921 -6689 -5508 1443 7004 10234 9232 -5672 -10592 -9268 -10697 -16451 -8973 -9494 -6027
1288 -6027 -8488 -11385 -7428 9124 10804 -2326 -799 4594 127 4143 7085 3830 -4680 -2713
1274 -2713 -5592 -15523 -9604 -5200 -4599 -765 2141 -113 8284 14586 3844 1023 3394 -3334 -7863
1259 -7863 -9498 8290 17417 10618 7246 13867 24269 27403 11831 4173 311 -104 -5831 -10556
1245 -10556 -414 9986 8620 6712 -309 -2649 4300 8730 7961 14243 22165 20349 11936 670
1231 670 -1286 -3121 -1804 -795 4458 11798 10904 15807 16612 25036 31021 31941 21437 10076 -3506
1216 -3506 4195 2744 -2725 -835 1618 -945 3149 -549 2115 19901 28319 20868 15949 13506 6357
1201 6357 -3653 2040 -3236 -8354 6156 3012 9965 14019 9738 -2562 -10517 -2406 4904 14196
1187 14196 21070 13204 4288 -4717 -1522 9416 11930 10349 7366 15945 14656 7842 -753 6078
1173 6078 -1145 -5420 8773 11464 5410 86 -5105 3876 10879 15604 20235 20146 15546 10055 3421
1158 3421 4468 5966 -534 -7230 -10246 -12216 -13845 -24023 -24600 -11701 -480 6155 3508 -10600
1144 -10600 -5375 6291 8741 2093 -1877 -4871 -9746 2995 16011 19393 12652 6450 9131 10591
1130 10591 4985 8633 12285 8870 8303 5459 14290 -2011 -8938 1498 -3669 -8259 -9543 464
1116 464 1441 -4712 -3326 246 -1663 -8006 -14767 -6073 -6721 -13010 -18089 -17653 -14409 -9733 -5263 2007
1100 2007 12932 10975 -578 -4706 -14780 -12601 -9870 -4526 -1676 8223 5877 10842 3173 -7865
1086 -7865 -7627 4372 6011 3117 -2789 11209 30257 33978 18178 3830 -11501 -10889 -17161 -20137
1072 -20137 -16862 -8556 873 774 -6703 -27774 -36446 -16731 705 1334 8801 13206 2819 2073 3859
1057 3859 7006 2241 -1309 12093 23189 12412 173 -12245 -3291 -3124 -3249 -3710 -5616 -13776
1043 -13776 1306 8145 -4815 -17077 -15902 -3350 2753 4608 10856 9603 24300 35187 19657
1030 19657 -2580 -5369 4297 5927 1917 478 8106 15914 23209 26560 15160 5059 -145 7597
1016 7597 9671 154 7536 3767 2775 -123 -10644 -9195 5760 4479 -212 -16008 -18104 -11442
1002 -11442 -3864 -11447 -880 1723 14413 21249 19510 14794 5260 -4819 -6080 -678 -4047 -7095
988 -7095 -8418 -11472 -83 11078 9092 1266 -6014 -3751 -10574 -20940 -22161 -22033 -15398 -6531 -7620
973 -7620 -638 -1828 -5688 -14403 -7791 -16896 -23667 -20310 -4217 8930 12610 6352 10058 3803 -1504
958 -1504 -3922 -6757 5464 17700 20815 9392 1953 4447 869 3077 12151 9208 1672 3209
944 3209 8357 12922 20301 28062 26621 12384 9111 -2344 -4060 1022 13222 11991 8219 15406
930 15406 20872 10003 11283 6657 -3006 -5754 -12001 2159 -10556 -10754 -5187 2652 13525 3190
916 3190 -4372 -4201 -2788 -6039 -6890 -7093 -8624 -1571 -11606 -10411 -3126 1932 4534 6528 12768 21504
900 21504 8925 -2433 -4413 5206 12638 16261 12252 6814 9336 2388 -4330 -6755 -12902 -2148
886 -2148 10332 2334 -5329 -191 -1480 -730 -4786 -6427 -7680 -3184 2728 3324 -14219 -23879 -16974
871 -16974 -9042 -5464 -9496 -20712 -15417 -2912 13667 11293 -3543 -5394 1879 15355 6129 -3648
857 -3648 -19398 -12907 -10821 -18037 -5550 6023 3901 9971 7427 3557 5389 -1630 -8797 -4131
843 -4131 3862 10266 19266 17627 10535 2721 -4547 -7773 2116 7135 6713 8625 13871 16280 14073
828 14073 8077 3552 7796 19237 22296 17906 12684 10705 9027 8577 12365 10826 8168 9282 24517
813 24517 29160 36238 23164 1087 -6271 -8602 -1469 -833 5370 18439 19260 10649 3998 10618 19024
798 19024 13006 7586 3587 8582 12511 16015 9479 7770 16167 29519 27893 14340 3151 5643
784 5643 6046 10713 17049 3530 6379 21759 21097 24453 25426 20139 17882 15234 10815 10905 6405 5466
768 5466 3851 9469 6137 7732 3298 -2354 -8449 -504 7136 13116 12110 10458 5745 13888 19856
753 19856 13168 9616 3656 10012 22039 17834 3616 6572 8939 3664 2547 16443 20312 24741
739 24741 32618 17062 7021 5503 16165 10043 10171 19985 14731 4074 11276 7066 3767 11565
725 11565 7554 -1815 11037 20826 36434 33619 25215 15023 21602 23217 16855 3039 -2934 2336
711 2336 -5768 -20990 -10802 -4604 -3631 -6623 -8589 -3161 -2638 -4121 -16003 -18931 -15828 -16572 1127
696 1127 11449 10513 15814 6856 10262 16947 12162 24167 27252 20040 14159 19854 25673 29475 32671
681 32671 22628 31977 31922 18385 18695 21745 18413 29491 28155 34629 28274 23501 16928 17007 11140
666 11140 14288 22146 21119 14155 11899 12138 8249 4443 13438 16759 8508 5990 6450 2365 3132 9126
650 9126 19069 19933 15310 9207 -862 -4261 3271 5312 8912 17219 8564 244 -14093 -14953 5786
635 5786 15825 29938 29206 22745 17936 14177 16291 15652 14377 11147 265 4340 7746 24179 23130
620 23130 11664 7211 9554 978 -7960 -11730 -7329 2168 15144 19019 15893 8939 6566 4554
606 4554 531 8735 14983 7467 10783 9736 6491 1669 -442 -2198 5332 5694 181 -5594 7778
591 7778 18817 19780 25965 32886 29461 25670 24393 24838 37574 36184 21069 12378 21491 22969 18335
576 18335 23590 31067 40575 30228 18657 17101 8839 3270 6683 2668 67 1392 2788 -2216
562 -2216 5695 4185 326 3817 7792 24884 28031 20383 22284 21279 13615 15254 7181 6436 6844
547 6844 -1626 2803 13754 22655 14719 17500 19182 22755 23230 22551 24092 12840 13739 12624 10060
532 10060 13435 8849 -52 10359 12399 12463 8307 7431 -2699 -16346 -16271 -3512 3479 982 7739
517 7739 12113 10504 7742 16802 19350 3437 -923 773 1982 -1633 -18440 -18587 -8874 -5043 -2775
502 -2775 10875 24356 22180 18212 15842 6592 6254 13365 15532 10079 15685 9611 15816 23767 23882
487 23882 25839 22177 15224 10312 1123 960 -2036 -9924 -15311 -1799 13686 13738 17095 18794 10701
472 10701 11274 3913 8075 16692 15779 11370 3708 -1861 -3083 10108 14661 17046 18171 21861 18789
457 18789 10025 7177 10188 5968 918 3712 -2208 1078 999 -2077 -1447 11429 13566 4760 5128 2573
441 2573 7548 14443 14936 11949 13753 7453 8057 -3185 -8287 1510 27651 37547 32837 28073 27791
426 27791 27692 13628 9927 16736 18853 11453 6093 4454 3517 5738 1160 -7001 4500 16698 28264
411 28264 22842 14646 20699 29799 25053 29786 24323 14149 23818 25721 24196 15077 1277 -3513
397 -3513 -49 10663 9024 22704 33878 18313 22517 29697 18831 10123 8934 5502 8975 2106
383 2106 9569 7848 8732 2447 14038 11226 14463 20424 20451 9521 3943 -1211 -9535 3376 15739
368 15739 23198 37038 35554 30636 18060 13577 12194 9125 6934 -1692 4741 5978 1913 -9636
354 -9636 -15468 -9608 -11366 -5706 8157 6811 2573 -2856 -5285 -2242 13275 27216 33522 35012
340 35012 28409 31184 33052 28044 19906 15688 14503 12550 15333 20350 13020 6678 -96 1365 10549
325 10549 16471 10654 11029 25973 25724 19953 26775 15387 4849 -1246 -1437 1430 7876 3405 8739
310 8739 -1547 -9042 -2696 6668 10170 13728 24293 30012 22736 15992 14214 16849 7674 -988 -13885
295 -13885 -11588 -973 9247 8052 9330 14406 20885 20283 22867 9687 7798 7497 8315 14520 14033
280 14033 17592 18498 23187 24134 16900 11843 13672 13320 -1352 2642 8408 16855 20234 22471 18054
265 18054 10877 1529 2379 -327 11588 22938 17640 12054 2499 5527 12577 11117 13975 10690 6904
250 6904 -4762 -11826 -6523 -1928 7139 11755 18396 17683 13386 11437 14119 6466 6862 4043 1813
235 1813 -2546 7171 12188 7486 5439 15429 19094 17700 12619 11371 10647 3752 -6151 -1663 15922
220 15922 21418 17629 11581 10019 13526 20143 28034 23977 26661 19475 15914 15829 20286 10630 5836
205 5836 6028 15658 16521 13385 11488 14632 9546 13555 17034 32409 30859 24710 21812 21464 10234
190 10234 4825 4162 6793 10615 9966 15878 17645 16410 5438 843 10789 17483 4551 595 -2678
175 -2678 -9249 -912 5901 13569 12991 8535 10214 5834 2948 9292 24611 28462 24573 17833 9437
160 9437 7884 10197 8628 13136 9728 11520 10030 9669 2775 6169 20847 18845 18284 16000 10423
145 10423 13366 13394 12580 12182 20584 19222 10089 10599 11820 11148 11841 10640 12034 19223 21031 16604 4507
128 4507 -3153 -1496 5805 18274 24250 22272 17877 9215 289 -1898 2856 3643 5282 10162 17439
113 17439 22481 24121 21776 19343 18677 13707 1079 7323 15430 16360 13076 11513 4033 -3569 -5622
98 -5622 -8496 682 7661 714 -10417 -3942 -2504 -4458 9039 17835 21146 15411 10888 6633 8282
83 8282 9269 12392 8838 7308 6875 6210 -2094 2078 12279 15695 11458 20829 30650 31016 26491 17491
67 17491 4942 7164 8490 16723 16204 11608 2945 -1721 5921 10660 14545 20640 16837 13707 12356
52 12356 7006 7095 5180 9044 14542 15014 15370 12177 9633 11357 20928 13980 10614 9319 4906 13054
36 13054 14256 6502 4021 3789 10528 11785 22212 15789 5221 -5530 -1087 -3051 -1480 3281 8504
21 8504 11830 15863 16941 15291 18166 14545 13630 16360 15224 15231 26689 24417 18552 21794 15430 11292
5 11292 16736 17703 13347 -1458 -3715
0 -3715
$$ Imaginary data points
##PAGE= N=2
##DATA TABLE= (X++(I..I)), XYDATA
32767 67358 59881 56101 55304 56873 59213 54251 50577 53239 56060 58630 63703 61225 55372 57370 64912
32752 64912 75189 69975 62273 69696 73023 68821 62298 68660 75937 76083 62450 64677 72720 62415
32738 62415 48681 49168 52018 57651 63912 68085 71409 76927 78562 78775 76764 68069 60010 60470 67137
32723 67137 73211 80818 81518 77640 70740 70030 70883 80335 91858 91790 93001 88512 85305 87666 86848 79547
32707 79547 74757 75380 82039 90592 92662 83310 71478 75320 81550 80315 73387 65873 72648 80600
32693 80600 89386 93684 98626 97204 88382 84985 101904 101294 91247 91200 92938 90655 88104 92528 91975
32678 91975 92615 101049 98135 96451 100665 101553 107442 108496 102217 97358 88192 86844 96269 107543 112227
32663 112227 116980 112679 107422 104244 99364 106662 107229 103982 107198 109890 116617 113309 116149 119716
32649 119716 108328 112583 115062 124836 122187 117657 113573 115979 109730 113259 113732 113485 110857 111785 119865
32634 119865 120108 121337 115776 108032 109799 119171 117091 113712 116955 119500 115303 109946 113394 117041
32620 117041 117268 120114 129788 133172 132115 125401 124555 122417 120347 117102 120897 124578 124744 132568 124440
32605 124440 116991 126080 131722 133693 135422 137062 133675 126854 120389 121531 123516 127816 124599 121875
32591 121875 124538 132334 140119 137076 134697 137385 143520 139625 133667 132757 138493 142719 134934 127227
32577 127227 126812 130051 125672 131396 144106 151576 156431 145542 141500 143468 134684 130250 139103 139446
32563 139446 132543 130936 136617 134443 134500 143678 144076 147367 148788 149976 149020 145034 141425 134281 136559
32548 136559 145730 146078 148898 152853 151008 151505 161909 172383 173799 159556 147876 148024 165587 172633
32534 172633 159386 147331 147425 156874 163525 167785 166333 166642 167453 161260 155921 164434 165118 156372 150459
32519 150459 153312 151048 150755 152218 143358 144102 154707 166409 162938 154496 153542 153743 157866 157504 164617
32504 164617 161578 154511 148406 155535 159785 157489 159009 162280 167659 159620 160061 159131 151479 152992 158853
32489 158853 166551 172365 170943 168454 166044 176702 176236 160217 147587 146809 157734 163065 163545 172222
32475 172222 165160 159567 164874 171487 152656 150991 164316 163299 156380 166571 171187 175913 190877
32462 190877 176321 173714 172537 163188 162693 166122 161693 165040 171780 173575 173196 171711 177678 181265
32448 181265 175914 175660 176671 176582 170776 161143 167191 174536 180000 179909 177890 176380 181794 185966 188316
32433 188316 183738 192071 191707 179167 169622 168795 181145 195380 188392 178107 174548 173890 176166 173903
32419 173903 170347 180359 190997 185493 182787 171508 162085 157196 152112 154262 163156 173355 175856
32406 175856 183067 178020 180794 173188 169767 167787 169935 184793 189508 188894 193549 195300 192105 203097
32392 203097 213601 209336 187298 179197 192865 201442 193453 185415 195017 190761 175755 179888 190537
32379 190537 199428 195411 188458 187350 189794 194773 201703 188015 182630 187420 183203 179901 185499 184879
32365 184879 184523 187790 183191 188359 203381 212685 215549 209973 209343 197311 188795 179139 183305 185026
32351 185026 178138 166128 180291 189262 196198 197848 189431 192771 192366 182140 190421 191873 188675 185117
$$ [...]
##END NTUPLES=NMR SPECTRUM
##END=
