##TITLE=Analysis number 311103
Compound Code cc 19408
Project Code adrs
Chemist Name simons
##JCAMPDX= 6.0         $$ Bruker NMR JCAMP-DX V2.0
##DATA TYPE= NMR SPECTRUM
##DATA CLASS= NTUPLES
##ORIGIN= Bruker BioSpin GmbH
##OWNER= NMR
$$ XWIN-NMR		Version 3.5
$$ Thu Jun 30 14:59:37 2005 GMT Daylight Time (UT+1h)  MAYBRIDGE\NMR@NMR_250MHZ
##.OBSERVE FREQUENCY= 250.131544655141
##.OBSERVE NUCLEUS= ^1H
##.ACQUISITION MODE= SIMULTANEOUS (DQD)
##.ACQUISITION SCHEME= undefined
##.AVERAGES= 16
##.DIGITISER RES= 18
##SPECTROMETER/DATA SYSTEM= dpx250
##.PULSE SEQUENCE= zg30
##.SOLVENT NAME= CDCl3
##.SHIFT REFERENCE= (INTERNAL, CDCl3, 0, 16.4464)
##AUDIT TRAIL= $$ (NUMBER, WHEN, WHO, WHERE, WHAT)
$$ ##TITLE= Audit trail, XWIN-NMR		Version 3.5
$$ ##JCAMPDX= 5.01
$$ ##ORIGIN= Bruker BioSpin GmbH
$$ ##OWNER= NMR
$$ C:\u/data/dgb/nmr/ADRS/5180/pdata/1/auditp.txt
$$ ##AUDIT TRAIL=  $$ (NUMBER, WHEN, WHO, WHERE, WHAT)
(   1,<2005-06-30 14:59:18.96 +100>,<MAYBRIDGE\NMR>,<NMR_250MHZ>,
      <created by zg, POWCHK disabled, PULCHK disabled
       configuration hash MD5:
       62 19 C7 07 E1 42 D1 B7 37 6C 3D D0 77 39 F9 E6
       data hash MD5: 64K
       22 2C D1 AC 32 2D 92 95 49 F0 4D 9A A0 A1 D6 EA>)
(   2,<2005-06-30 14:59:29.88 +100>,<MAYBRIDGE\NMR>,<NMR_250MHZ>,
      <Start of raw data processing
       ef LB = 0.3 FT_mod = 6 PKNL = 1 SI = 32K 
       data hash MD5: 32K
       31 DF 51 A7 00 60 95 5E 97 C3 A3 AE BE 4E 65 4D>)
(   3,<2005-06-30 14:59:31.63 +100>,<MAYBRIDGE\NMR>,<NMR_250MHZ>,
      <apk 
       data hash MD5: 32K
       3C 67 DE BE 04 3F B6 3A 49 61 DA 0F 7D 6B 32 8F>)
(   4,<2005-06-30 14:59:32.30 +100>,<MAYBRIDGE\NMR>,<NMR_250MHZ>,
      <abs ABSG = 5 
       data hash MD5: 32K
       AD FF B6 72 45 82 E7 A0 7D 40 80 6D 0F C7 CD CE>)
$$ ##END=
$$ 
$$ hash MD5
$$ 28 95 45 09 CC DE 0C 83 88 AA A6 08 A0 6E 75 4B
##$RELAX= 
##$RELAX= 
##$RELAX= 
##$RELAX= 
##$RELAX= 
##$RELAX= 
##$RELAX= 
$$ Bruker specific parameters
$$ --------------------------
##$DU= <C:\u>
##$EXPNO= 5180
##$NAME= <ADRS>
##$PROCNO= 1
##$TYPE= <nmr>
##$USER= <dgb>
##$AMP= (0..31)
100 100 100 100 100 100 100 100 100 100 100 100 100 100 100 100 100 100 
100 100 100 100 100 100 100 100 100 100 100 100 100 100 
##$AQSEQ= 0
##$AQ_mod= 3
##$AUNM= <au_zg>
##$AUTOPOS= <54 >
##$BF1= 250.13
##$BF2= 250.13
##$BF3= 250.13
##$BF4= 250.13
##$BF5= 500.13
##$BF6= 500.13
##$BF7= 500.13
##$BF8= 500.13
##$BYTORDA= 1
##$CFDGTYP= 0
##$CFRGTYP= 5
##$CHEMSTR= <none>
##$CNST= (0..31)
1 1 145 1 1 1 1 1 1 1 1 1 1 1 1 1 1 1 1 1 1 1 1 1 1 1 1 1 1 1 1 1 
##$CPDPRG= <>
##$CPDPRG1= <>
##$CPDPRG2= <>
##$CPDPRG3= <>
##$CPDPRG4= <mlev>
##$CPDPRG5= <mlev>
##$CPDPRG6= <mlev>
##$CPDPRG7= <mlev>
##$CPDPRG8= <mlev>
##$CPDPRGB= <>
##$CPDPRGT= <>
##$D= (0..31)
0 1 0 0 0 0 0 0 0 0.06 0 0 0 0 0 0 0.0002 0 0 0 0 0 0 0 0 0 0 0 0 0 0 
0 
##$DATE= 1120139958
##$DBL= (0..7)
120 120 120 120 120 120 120 120 
##$DBP= (0..7)
150 150 150 150 150 150 150 150 
##$DBP07= 0
##$DBPNAM0= <>
##$DBPNAM1= <>
##$DBPNAM2= <>
$$ [...]
##$SUBNAM7= <"">
##$SUBNAM8= <"">
##$SUBNAM9= <"">
##$SW= 20.6930455092707
##$SWIBOX= (0..15)
0 0 3 0 0 0 0 0 0 0 0 0 0 0 0 0 
##$SW_h= 5175.983436853
##$TD= 65536
##$TD0= 1
##$TE= 295.16
##$TE2= 300
##$TE3= 300
##$TEG= 300
##$TL= (0..7)
0 120 120 120 120 120 120 120 
##$TP= (0..7)
150 150 150 150 150 150 150 150 
##$TP07= 0
##$TPNAME0= <>
##$TPNAME1= <>
##$TPNAME2= <>
##$TPNAME3= <>
##$TPNAME4= <>
##$TPNAME5= <>
##$TPNAME6= <>
##$TPNAME7= <>
##$TPOAL= (0..7)
0.5 0.5 0.5 0.5 0.5 0.5 0.5 0.5 
##$TPOFFS= (0..7)
0 0 0 0 0 0 0 0 
##$TUNHIN= 0
##$TUNHOUT= 0
##$TUNXOUT= 0
##$USERA1= <user>
##$USERA2= <user>
##$USERA3= <user>
##$USERA4= <user>
##$USERA5= <user>
##$V9= 5
##$VALIST= <valist>
##$VCLIST= <CCCCCCCCCCCCCCC>
##$VD= 0
##$VDLIST= <DDDDDDDDDDDDDDD>
##$VPLIST= <PPPPPPPPPPPPPPP>
##$VTLIST= <TTTTTTTTTTTTTTT>
##$WBST= 1024
##$WBSW= 4
##$XGAIN= (0..3)
0 0 0 0 
##$XL= 0
##$YL= 0
##$YMAX_a= 334658
##$YMIN_a= -422660
##$ZGOPTNS= <>
##$ZL1= 120
##$ZL2= 120
##$ZL3= 120
##$ZL4= 120
##$ABSF1= 16.44639
##$ABSF2= -4.246782
##$ABSG= 5
##$ABSL= 3
##$ALPHA= 0
##$AQORDER= 0
##$ASSFAC= 0
##$ASSFACI= 0
##$ASSFACX= 0
##$ASSWID= 0
##$AUNMP= <proc_1d>
##$AZFE= 0.1
##$AZFW= 0.1
##$BCFW= 0
##$BC_mod= 0
##$BYTORDP= 0
##$COROFFS= 0
##$CY= 12.5
##$DATMOD= 1
##$DC= 0
##$DFILT= <>
##$DTYPP= 0
##$F1P= 14.0000005364418
##$F2P= -0.99999901652339
##$FCOR= 0.5
##$FTSIZE= 32768
##$FT_mod= 6
##$GAMMA= 0
##$GB= 0
##$INTBC= 1
##$INTSCL= 1
##$ISEN= 128
##$LB= 0.3
##$LEV0= 0
##$LPBIN= 0
##$MAXI= 10000
##$MC2= 0
##$MEAN= 0
##$ME_mod= 0
##$MI= 0
##$NCOEF= 0
##$NC_proc= -4
##$NLEV= 6
##$NOISF1= 0
##$NOISF2= 0
##$NSP= 0
##$NTH_PI= 0
##$NZP= 0
##$OFFSET= 16.44639
##$PC= 1
##$PHC0= -81.84485
##$PHC1= 15.31365
##$PH_mod= 1
##$PKNL= yes
##$PPARMOD= 0
##$PSCAL= 4
##$PSIGN= 0
##$REVERSE= no
##$SF= 250.130018911249
##$SI= 32768
##$SIGF1= 0
##$SIGF2= 0
##$SINO= 400
##$SIOLD= 32768
##$SREGLST= <1H.CDCl3>
##$SSB= 0
##$STSI= 32768
##$STSR= 0
##$SW_p= 5175.98343685301
##$SYMM= 0
##$S_DEV= 0
##$TDeff= 65536
##$TDoff= 0
##$TI= <Analysis number 999999
Compound Code 99
Book Reference 9
Project Code 9>
##$TILT= no
##$TM1= 0
##$TM2= 0
##$TOPLEV= 0
##$USERP1= <user>
##$USERP2= <user>
##$USERP3= <user>
##$USERP4= <user>
##$USERP5= <user>
##$WDW= 1
##$XDIM= 32768
##$YMAX_p= 517539395
##$YMIN_p= -494001
$$ End of Bruker specific parameters
$$ ---------------------------------
##NTUPLES= NMR SPECTRUM
##VAR_NAME=  FREQUENCY,     SPECTRUM/REAL,   SPECTRUM/IMAG
##SYMBOL=    X,             R,               I
##VAR_TYPE=  INDEPENDENT,   DEPENDENT,       DEPENDENT
##VAR_FORM=  AFFN,          ASDF,            ASDF
##VAR_DIM=   32768,         32768,           32768
##UNITS=     HZ,            ARBITRARY UNITS, ARBITRARY UNITS
##FACTOR=    0.157963299565203, 1,           1
##FIRST=     4113.73587973592, 0,            0
##LAST=      -1062.24755711709, 0,           0
##MIN=       -1062.24755711709, -494001,     0
##MAX=       4113.73587973592, 517539395,    0
$$ Real data points
##PAGE= N=1
##DATA TABLE= (X++(R..R)), XYDATA
$$ [...]
16539f5959N6198M192k0351R919n3371l8857k9055P177L8680K9703J8074N321
16527c8329J1032n7078k688M7104O489J1897l003K4929P641k0771j9890q3807
16515a16474j4836L0179N0293Q953p1023p1392k2145N8563n9072R774l7659N9409
16503a75430Q0368n550k1268P292O9858K2400n757K1071k1871K189J2310n3940
16491f8328l4195J777K231P24j4063K5580L7609q884R325o038M5631Q022m5764
16478d6373l5184K3541J21898m8392q0066k2618k5445j4013m4073k590M2725O0031
16466g0559L8722M7806K6295k159m0840O1349j9840m2594l6000j2018m4067L3368
16454f0537k8317M0870P6389l0041j8899K6825n822j9391j0344M4343N2360k9747
$$ plain form
16539 -65959 -9761 -5569 -25920 -16001 -69372 -108229 -137284 -130107 -91427 -61724 -43650 -38329
16527 -38329 -27297 -84375 -87063 -39959 -33470 -21573 -24576 353 7994 -12777 -32667 -116474
16515 -116474 -131310 -101131 -50838 -41885 -112908 -184300 -206445 -147882 -206954 -197180 -234839 -175430
16503 -175430 -95062 -100612 -121880 -114588 -44730 -22330 -28087 -7016 -28887 -26698 -14388 -68328
16491 -68328 -102523 -100746 -98515 -97791 -111854 -86274 -48665 -57549 -48224 -54262 -8631 -609 -46373
16478 -46373 -81557 -58016 63882 15490 -64576 -87194 -112639 -126652 -170725 -173315 -130590 -70559
16466 -70559 -31837 15969 42264 40105 -735 60614 40774 -1820 -37820 -49838 -93905 -60537
16454 -60537 -88854 -47984 28405 -1636 -20535 6290 468 -18923 -29267 15076 67436 37689
16442C7689m2746j2718m6492K1340n5319k1891M7161M1653o0253j8296P4958j2247
16430d7161K7954l240j4018p494l0899K5567R701n453M136k9822K4605O2269n6063
16417c9918j0099r582m941J7423M8607K1291p4744p9117J0669M5626L807Q272
16405f2706R218j295J4160J6485O42J5899j4414k2795O8292J0579k5533j7150
16393h618j4465K8598J2848o4982j8873k0525k8130j4323J5061K0722m146l0370
16381a27203K5490N2178j4589n936j1839n0057L056j09j8912J2907l9169J6422
16369a57761N7174K6580K1544j35K5568j8876L2644R225Q987l5249n5825j1329
16357i7453J6705P287O8941J6281m7600o614n9715j6351M0823K2541N2330K5986
$$ plain form
16442 37689 -5057 -17775 -64267 -42927 -98246 -120137 -72976 -31323 -91576 -109872 -34914 -47161
16430 -47161 -19207 -22447 -36465 -43959 -74858 -49291 -39590 -45043 -40907 -70729 -46124 16145 -39918
16417 -39918 -50017 -59599 -64540 -47117 1490 22781 -51963 -131080 -120411 -74785 -70978 -62706
16405 -62706 -53488 -54783 -40623 -24138 -23496 -7597 -22011 -44806 23486 34065 8532 -8618
16393 -8618 -23083 5515 18363 -46619 -65492 -86017 -114147 -128470 -113409 -92687 -96833 -127203
16381 -127203 -101713 -49535 -64124 -70060 -81899 -131956 -128900 -129009 -147921 -135014 -174183 -157761
16369 -157761 -100587 -74007 -52463 -52598 -27030 -45906 -13262 -4037 4950 -30299 -86124 -97453
16357 -97453 -80748 -73461 -4520 11761 -35839 -42453 -102168 -118519 -77696 -55155 -2825 23161
16345B3161m20o7521m291O5584J1933l6697J55n6730k7143J6445k2616k008q497
16332a08645J5846L3838k1862l1323K318M020N8429L3026M473n8927j4940J907
16320h1840J1063k6296k0786j7857L3652n3019n0762P3249P0497r602J3761O2284
16308D344k626p7732j4251q759m7578n4034k2183R5059J4672m004L5411N1296
16296c0385J8202K6798n1420k0361J496j0882K6325j8863j4928N7476l3859m7789
16284i8190K7926L6614M860K9181m1711l8838N4510K2916m4532j1818N1853R548
16272B319r813K4130q395k1745L9138K1971p7532l8174j4223J8289K9270l4477
16260f9242K078j7055l8869j1163O7350N1019n577o3654n5849K0022P5887R5560
$$ plain form
16345 23161 22741 -44780 -49071 16513 28446 -8251 -8096 -64826 -91969 -75524 -98140 -100148 -108645
16332 -108645 -92799 -58961 -80823 -112146 -109828 -105808 -47379 -14353 -9880 -68807 -83747 -81840
16320 -81840 -70777 -97073 -117859 -135716 -102064 -155083 -205845 -132596 -62099 -71701 -57940 4344
16308 4344 1718 -76014 -90265 -99024 -146602 -200636 -222819 -127760 -113088 -117092 -81681 -30385
16296 -30385 -12183 14615 -36805 -57166 -55670 -66552 -40227 -59090 -74018 -16542 -50401 -98190
16284 -98190 -70264 -33650 -28790 391 -41320 -80158 -25648 -2732 -47264 -59082 -7229 2319
16272 2319 -7494 16636 8241 -13504 25634 47605 -29927 -68101 -82324 -64035 -34765 -69242
16260 -69242 -67164 -84219 -123088 -134251 -66901 -15882 -21459 -85113 -140962 -120940 -45053 50507
16248E0507m2280l8963O3028M690r567l3196k7220M3542l2670r0363L987l8063
16236a46568m516M077O3840N6909Q636j3507K1605K4390k2782q079O8758o829
16224D5934j2386k2201M96J3913k9224l1486p985j857k3749K7727k8505j4293
16212h3616J6509M5066l7709k6513j934N7531k385K1712k1887q067J5121J3420
16200a2752m6621m9932N0526K3854M0172k442k4487l6074K3368L4308q95l4403
16188c5378n4101l0939P294K5943P000J1219J1720p0798k7567L7312M2002N412
16176g0881J7388L9626J3579o8375j9165q855L6754j1243J1989O6135O395J6041
16164B9388L3681k4915K4765k3079o0012o6263m8694L6684M4634k9112L4862n408
$$ plain form
16248 50507 8227 -30736 32292 36982 27415 -5781 -33001 10541 -22129 -112492 -108505 -146568
16236 -146568 -151084 -147007 -83167 -26258 -17622 -31129 -9524 14866 -7916 -15995 52763 45934
16224 45934 33548 11347 11843 25756 -3468 -34954 -42939 -44796 -68545 -40818 -69323 -83616
16212 -83616 -67107 -22041 -59750 -86263 -88197 -30666 -33051 -11339 -33226 -41293 -26172 -12752
16200 -12752 -59373 -109305 -58779 -34925 5247 2805 -21682 -57756 -34388 -80 -975 -35378
16188 -35378 -89479 -120418 -113124 -87181 -80181 -68962 -57242 -128040 -155607 -118295 -76293 -70881
16176 -70881 -53493 -13867 -288 -68663 -87828 -96683 -59929 -71172 -59183 6952 13347 29388
16164 29388 63069 38154 62919 39840 -20172 -86435 -135129 -98445 -53811 -82923 -48061 -53469
16152e3469R548k8904o3887K7100Q938k8445N2550N742n949L6803j8487k4650
16140h3110k1917k2754J7201P6741k422k9007L402l5753l633j9321R64N5902J1232
16127e2475l0694N7411N5484m6785Q797k8474K8820j8178m4752j396N4668L6241
16115A8667P400K0428k2039q6119q7413L8899L9667j0329K7167J1572r596J4702
16103c6994M8229J060L2760M0916N1003j07611m4450J4296k2870l9325j327J9077
16091d5236K1045l5927J3369K3221k7109l5130P3065K7495O8306K3133J6758k1144
16079A01846j455L3253l1668p2312p6819L8917k7920r4547j3236M0700P1309l5936
16067f7868L6744P3253n0429Q90K1349o769k2694j4424K3342M049j8445J7022
$$ plain form
16152 -53469 -43921 -72825 -136712 -109612 -100674 -129119 -76569 -70827 -76776 -39973 -58460 -83110
16140 -83110 -105027 -127781 -110580 -33839 -36261 -65268 -61866 -97619 -101252 -120573 -119609 -63707 -52475
16127 -52475 -83169 -25758 29726 -17059 -8262 -36736 -7916 -26094 -70846 -72242 -17574 18667
16115 18667 26067 46495 24456 -61663 -149076 -110177 -70510 -80839 -53672 -42100 -51696 -36994
16103 -36994 11235 12295 45055 85971 136974 29363 -15087 -791 -23661 -62986 -64313 -45236
16091 -45236 -24191 -60118 -46749 -23528 -50637 -85767 -12702 14793 83099 106232 122990 101846
16079 101846 100391 133644 101976 29664 -47155 -8238 -36158 -130705 -143941 -103241 -31932 -67868
16067 -67868 -31124 42129 -8300 -7410 13939 7170 -15524 -29948 -6606 -2557 -21002 -3980
16055c980J0043P027j088q4800n2827k799K4471K413k292o619J3221N1562K1678
16042b3990O3587O573o4893l1899J2523K1086K902j2189j4773k1031j4070M3005
16030c3169p027N9624m50n784J7180m2130j7101l0745K4633M2598M364M6072M864
16017F2929r8743n140j0608j5551L7853Q1593J5482j5603m3139k1852J264N879
16005e636O79k4317m6109m8684J8009K9672O0300M1468m2756l857K9688K2684
15993C1141m2881j6615M522M1270M4582M6566o3786p6266m7102K9876J3902j3568
15981d8359J5221P039K476M7207q1255l6837k3020L8087N9596o5258L4954O6309
15969A6160M5455J2735J3218l8476n6949l0807L9665k3007K6804j2118k0199p5868
$$ plain form
16055 -3980 6063 13090 12002 -72798 -125625 -128424 -103953 -101540 -103832 -110451 -97230 -45668 -23990
16042 -23990 39597 46170 -18723 -50622 -38099 -17013 -14111 -26300 -41073 -62104 -76174 -33169
16030 -33169 -40196 19428 18978 13194 30374 -11756 -28857 -59602 -34969 7629 11993 58065 62929
16017 62929 -35814 -40954 -51562 -67113 -29260 52333 67815 52212 9073 -12779 -11515 -5636
16005 -5636 -4957 -29274 -75383 -124067 -106058 -76386 -16086 25382 -17374 -21231 8457 31141
15993 31141 -11740 -28355 -23833 17437 62019 108585 44799 -31467 -78569 -48693 -34791 -48359
15981 -48359 -33138 -26099 -23623 23584 -57671 -94508 -117528 -79441 -19845 -85103 -50149 16160
15969 16160 61615 74350 87568 49092 -7857 -38664 1001 -22006 4798 -7320 -27519 -103387
15957a03387L7916L9110L6905M8821J7048n4722m0045K8838k591l5263N1958Q29
15945B5417l0687j8407M4265J8511j5409k3770p1417K1266R7023M767n1945l0017
15933c0403J8305n589j5289N3804K7624l338k3634Q601J0845k444P139m2227l8301
15920c4907J3280K966k7435l2546k9845N989J1206P7932O2422Q153k4049p2396
15908c9230l6052k4022L9442M4378m9525K2503K7798m2118O970M2898N6760k371
15896D7431j9125l1688o14l7867J4115L6722q6234k5701P8051K8444M6142N2565
15884A02241P83n9764k9878P732K5575m64j2981k2814r775K0527m6451l0082L3958
15871b1393j8670L4522M8082j3002l2880o524J6175j2903O735M2301M3038j3386
$$ plain form
15957 -103387 -65471 -26361 10544 59365 76413 21691 -18354 10484 7893 -27370 24588 25417
15945 25417 -5270 -23677 20588 39099 23690 -80 -71497 -50231 46792 51559 -386 -30403
15933 -30403 -12098 -17687 -32976 20828 48452 45114 21480 30081 40926 38482 45621 3394 -34907
15920 -34907 -21627 -18661 -46096 -78642 -108487 -102498 -91292 -13360 49062 57215 33166 -39230
15908 -39230 -75282 -99304 -59862 -15484 -65009 -42506 -14708 -56826 -49856 -6958 49802 47431
15896 47431 28306 -3382 -3996 -41863 -27748 8974 -77260 -102961 -24910 3534 49676 102241
15884 102241 103024 43260 13382 21114 46689 46225 33244 10430 655 21182 -25269 -55351 -21393
15871 -21393 -40063 -5541 42541 29539 -3341 -9865 6310 -6593 142 42443 85481 72095
15859G2095q325J5277k9899k9953J22j2004r631K0844l4854k4981K6314J3726
15847a269j193k4194L1642r991k8046J0637l8897N224M0696o688j2953Q0270K4270
15834F9508k4410m0064l1709J0757J5211K5134L7749l3772n5577J9349K7030k7179
15822g973o7960r769J1881J2230M9142o29M6505J9996j5293k0514j1585m096k6212
15809b4277J2920l876k6493Q149l216O123N2284O2520m0799o4871k1367K6509
15797a6394N0257q1946n8813M5058L8633J7406k3558j1494l0378P1135N2273J5268
15785F7447L079L6359p0342n1415p5249K0014O6764N4489P2036K3093Q313l7194
15773A17394j928J5603K9884n2357r496J2997q624j7314R2551R0744N432j9351
$$ plain form
15859 72095 63770 79047 49148 19195 19317 7313 -2318 18526 -16328 -41309 -14995 -1269
15847 -1269 -2462 -26656 4986 -5005 -33051 -22414 -61311 -56087 -15391 -22079 -35032 45238 69508
15834 69508 45098 5034 -26675 -15918 -707 24427 62176 28404 -27173 -7824 19206 -7973
15822 -7973 -75933 -85702 -73821 -61591 -12449 -13078 33427 53423 38130 17616 6031 1935 -24277
15809 -24277 -11357 -15233 -41726 -33577 -36793 -30670 21614 84134 43335 -21536 -42903 -16394
15797 -16394 33863 -48083 -106896 -61838 -23205 -5799 -29357 -40851 -71229 -94 52179 67447
15785 67447 70526 106885 36543 -14872 -90121 -70107 -3343 51146 123182 146275 154588 117394
15773 117394 115466 131069 160953 108596 99100 112097 103473 86159 178710 269454 274886 255535
15761B55535K522p416k2547m8818R4465Q7028k0119l3726j8426l2684L5353J49292
15749D40459K4038n3819L4453L960R543o3417o7367p0092j5306P5414P7934j467
15737C94333j9405j8573K0126k4750k561Q2427J21760J18337P938n3497L4752
15726F60887L4615R1385J14822O9131P8063J5499J13581J36298J19065J49172
15716A582518J46406Q6613R3231R324J950N1260o1854Q78n8877p3038q1917p4851
15704A621643p4295q1483j45696j05323j01239q0534j6572j22343r0183l9669
15694G64306o5254j6635l4488k8093J9424m0059k2471K4356j7545l1212m4131
15683E08198n377J5953K8282k9791j2028r583J4398q315l6713m6462o661k5628
$$ plain form
15761 255535 258057 250641 228094 179276 273741 360769 340650 306924 288498 255814 291167 440459
15749 440459 464497 410678 445131 449091 458634 395217 327850 257758 242452 317866 395800 394333
15737 394333 374928 356355 376481 351731 349170 431597 553357 671694 679632 626135 660887
15726 660887 695502 786887 901709 970840 1048903 1064402 1177983 1314281 1433346 1582518
15716 1582518 1728924 1815537 1908768 1918092 1920042 1971302 1909448 1910326 1851449 1778411 1696494 1621643
15704 1621643 1547348 1465865 1320169 1214846 1113607 1033073 1016501 894158 803975 764306
15694 764306 699052 682417 647929 619836 639260 599201 576730 601086 583541 552329 508198
15683 508198 502821 518774 547056 517265 505237 495654 510052 501737 465024 418562 411901 386273
15671C86273o6518j0398L6053p205M0834j9443p0873m4841m2323L99M8195l285
15659B46868K8884O8832j02627o0182N7823j591k6502n7209l2401J1863L0979
15648A64737j1159M941N542n7466j1718L9862O872O805J5616n337m4969n5953
15636E7773q256K6535R546L2620L2545j4003j4912k4988j6925J7J566n9291l5817
15623a3590l9777j5778k6186J5371L4967J5752K5497J2006k3802j7948j4879L6862
15611a1505m8504m3334p272Q9940J3560k8609J1339K3577n0163K3297L7867J7631
15599B7824l9547n2886J707M8662o212k5086p1586k0122O0962N6189L5635K2764
15587C8304j0811o9447n4181n0215L6850Q6065L8283O589j0528M5438l3891l7278
$$ plain form
15671 386273 319755 309357 345410 338205 379039 359596 288723 243882 201559 201958 250153 246868
15659 246868 275752 344584 241957 181775 239598 238007 211505 154296 121895 133758 164737
15648 164737 153578 158519 164061 106595 94877 134739 141611 148416 164032 158695 113726 57773
15636 57773 49517 76052 85598 118218 150763 136760 121848 96860 79935 79952 81518 22227 -13590
15623 -13590 -53367 -69145 -95331 -79960 -44993 -29241 -3744 8262 -15540 -33488 -48367 -11505
15611 -11505 -60009 -103343 -110615 -20675 -7115 -35724 -24385 -808 -50971 -27674 10193 27824
15599 27824 -11723 -64609 -62902 -14240 -20452 -45538 -117124 -137246 -76284 -20095 15540 38304
15587 38304 27493 -41954 -96135 -146350 -109500 -23435 14848 21437 10909 56347 22456 -14822
15575a4822o7911L3185M5698j0741l7664k9439l574O818o476J8120j221L6071
15563c1956N1764j6572o613L7814j6331j0903q081m1830k0845N793K7251K7939
15551b570J6488j581P802M4132l7281m9401K7822L4190j3849k1149J5329o4732
15539d4800K5208J6315l1562l1930K7759j2995M596R881J0261n4925j407M0073
15527d3526j2706j4710o065N3730K9156j2120l2035J4086l768j8522L9126k9753
15515c7107j7446k209j820J8003L3973j3591l2826R758N157j842K2891L8759J4434
15502C6134k6953Q993m1159L6772K8431J9755J2163J504l4852l5191O142l9359
15490b7620J1365J6906O591m8648M602K5813k8149N3782K99o4157k8220K5062
$$ plain form
15575 -14822 -82733 -49548 -3850 -14591 -52255 -81694 -85268 -78450 -84926 -66806 -68027 -31956
15563 -31956 19808 3236 -3377 34437 18106 7203 -878 -42708 -63553 -57760 -30509 -2570
15551 -2570 13918 12337 20139 64271 26990 -22411 5411 39601 25752 4603 19932 -44800
15539 -44800 -19592 -3277 -34839 -66769 -39010 -52005 -47409 -37528 -27267 -82192 -83599 -43526
15527 -43526 -56232 -70942 -77007 -23277 5879 -6241 -38276 -24190 -27958 -46480 -7354 -37107
15515 -37107 -54553 -56762 -58582 -40579 -6606 -20197 -53023 -43265 -38108 -39950 -17059 21700 36134
15502 36134 9181 18174 -22985 13787 42218 61973 74136 75640 40788 5597 11739 -27620
15490 -27620 -16255 651 7242 -41406 -36804 -10991 -39140 14642 14941 -49216 -77436 -52374
15478e2374K3233n7212k8412j186j327l983J2027L5505L8323j6289m4557M8687
15466d7565j7300k4420j561j0316P6770L5651K6387R445m3499k9410Q264O581
15454a0973L4986M7484K0136O776k9682j8040J0673n5515M5635J2974q675N1575
15442A07354K6890k4460m3357p6595r671K4803m63K8790k9464k3986j2205l942
15430c6306j6887K7814p765q958m78l3692L2779N1376L7746q66l1391j9368K1935
15417A5939L1294k0352l6268o4826J332J4779m0504J6434l081k2092J2706J5548
15405g9091m9171l1550L1923K5412J8964O843K495Q851P101L6975L6035K3155
15393C7942p1135o0805m1447M7245K5021l1396j3097N421K2521l1802M3680p51
$$ plain form
15478 -52374 -29141 -86353 -114765 -115951 -117278 -121261 -109234 -73729 -35406 -51695 -96252 -47565
15466 -47565 -64865 -89285 -90846 -101162 -24392 11259 37646 47091 3592 -25818 -17554 -10973
15454 -10973 24013 71497 91633 98409 68727 50687 61360 5845 51480 64454 55779 107354
15442 107354 134244 109784 66427 -10168 -19839 4964 4501 33291 3827 -20159 -32364 -36306
15430 -36306 -53193 -25379 -33144 -42102 -42580 -76272 -43493 7883 45629 44763 13372 -5996 15939
15417 15939 47233 26881 -9387 -74213 -72881 -58102 -98606 -82172 -85253 -107345 -94639 -79091
15405 -79091 -128262 -159812 -127889 -102477 -83513 -76670 -74175 -65324 -58223 -21248 14787 37942
15393 37942 -33193 -93998 -135445 -88200 -63179 -94575 -107672 -102251 -79730 -111532 -67852 -68603
15381f8603m2667M7648N6908k6442k834M0250q56j9809J2983L3042L955l615l3143
15368c183J1144M509j0435J7543K3042j8392m1802l9439N8763r751m6959m9161
15356a04121M3291M874m5539K113p04N8515R488J3345l1468k0477j7290J7420
15344g0553K4412p03M2840j0219m8528j6016L7629Q930M0156K6537K6913M950
15332F6348o599k9468n9830l5358k9187L716P3626N4460M2481P0704N216n6980
15320I9129q6153k8538j8673M5603M5099l841k2396K3878k3125j7645p7766n9229
15308a23657L5965L7557J0096J332n8313j05066N2166R6721k802o920l4983m6065
15296a43969K3071N315O1235k7374k3595n5370j4665J4297J01396Q2459m6416
$$ plain form
15381 -68603 -111270 -63622 -6714 -33156 -35990 4260 3404 -16405 -3422 29620 33575 29960 -3183
15368 -3183 7961 12470 2035 19578 42620 24228 -17574 -57013 1750 -8001 -54960 -104121
15356 -104121 -60830 -55956 -101495 -99382 -100086 -41571 -32083 -18738 -50206 -70683 -87973 -70553
15344 -70553 -46141 -46844 -4004 -14223 -62751 -78767 -41138 -32208 7948 34485 61398 66348
15332 66348 59749 30281 -29549 -64907 -94094 -90378 -16752 37708 80189 150893 156109 99129
15320 99129 12976 -15562 -34235 11368 56467 52626 30230 54108 30983 13338 -64428 -123657
15308 -123657 -87692 -50135 -40039 -38707 -97020 -202086 -149920 -53199 -56001 -62921 -97904 -143969
15296 -143969 -120898 -115583 -54348 -81722 -105317 -160687 -175352 -161055 -59659 22800 -23616
15285b3616L1634m4427N0430K0760j4579k4102k057M8127N7918J8750l0477l237
15273H5124m540n9203n6988n5654N046O273L5796M7889m915J1721K8668l0086
15261I131j8036k8253K1041M2434j6821J9510P90n212K3937l1170K823k5615n556
15248a0997K822P5633k4595L5741k6831n6154O232R892K1340L1761J8435o460
15236G6819n5397l4674j2013k8922l8986K8684J8829k2731j5807J7767N6763Q506
15224a162K26n4823J410j485J1973l7230l8353J4105l4774K5773L2167K2152K0717
15211c9304K7562J5771N0742l3075J6688J5230K232l277m3702n9055R72N2936
15199C720J0838j8601j4180k6500J917J1592p903k1391k3154M1897M4242m0048
$$ plain form
15285 -23616 8018 -36409 14021 34781 20202 -3900 -5957 42170 100088 118838 88361 85124
15273 85124 80584 21381 -35607 -91261 -86215 -79942 -44146 3743 -1172 10549 39217 9131
15261 9131 -8905 -37158 -16117 26317 9496 29006 29796 24584 48521 17351 20174 -5441 -10997
15248 -10997 -8175 67458 42863 78604 51773 -4381 1851 11743 33083 64844 83279 76819
15236 76819 21422 -13252 -25265 -54187 -93173 -64489 -45660 -68391 -84198 -66431 -9668 -1162
15224 -1162 -936 -55759 -54349 -55834 -43861 -81091 -119444 -105339 -140113 -114340 -82173 -60021 -39304
15211 -39304 -11742 4029 54771 21696 38384 53614 55846 52569 8867 -50188 -49216 3720
15199 3720 14558 -4043 -18223 -44723 -42806 -31214 -39117 -60508 -83662 -41765 2477 -37571
15187c7571K8577J2788l6566l4457j1076n2263L7110L3286J3693J1921m3274j7880
15175i5712J2167J6897p522m2222M2702L973l0750q750K4587L7724P432j5222
15163e4696M5978j6769o402J6157m5603l4042k1765J8769K3357j5299L8912N682
15151d5721J2216q973k7159l9820J3044M926N0891J6463p6147n3395L6316M0265
15139g7094K0921o5296k3729l959J9020M3505L4242j6297m0740j0245K1323m575
15127a02924J566k4587J9152J9690J6570m4339q917M0085L3558k5686K7548k658
15115e0942M584Q766m5320n6476J4360k0359J6115L2103l22k6695L9379M2092
15103d2715M6335Q793j0453n407l4507l7311M5248R6541L1970n2247n4649k7755
$$ plain form
15187 -37571 -8994 3794 -32772 -67229 -78305 -130568 -93458 -60172 -46479 -34558 -77832 -95712
15175 -95712 -83545 -66648 -74170 -116392 -73690 -69717 -100467 -109217 -84630 -46906 -39474 -54696
15163 -54696 -8718 -25487 -31889 -15732 -61335 -95377 -117142 -98373 -75016 -90315 -51403 -45721
15151 -45721 -33505 -42478 -69637 -109457 -96413 -91487 -40596 -24133 -100280 -153675 -117359 -77094
15139 -77094 -56173 -121469 -145198 -149157 -130137 -86632 -52390 -68687 -109427 -119672 -98349 -102924
15127 -102924 -101358 -125945 -106793 -87103 -70533 -114872 -123789 -83704 -50146 -75832 -48284 -50942
15115 -50942 -46358 -37592 -82912 -139388 -125028 -145387 -129272 -97169 -97491 -124186 -84807 -42715
15103 -42715 3620 12413 1960 -3447 -37954 -75265 -30017 66524 98494 46247 -8402 -36157
15091c6157J1160N8866K2161l4484n3488k8693N1143p086p3862N8962K7391r5268
15079i9355m9598K6631P3824L2095m3724o1060K0608N2508l5378M3176M528k4333
15067f0078J1021M5517L1567m9962o1778l4516L4821r577n2770N3618L8526k2505
15055g6116k6929j9011J2078k3198k4122j6199K5573J5700P5129Q1119K2995p776
15043C9243n2555l7600q599J1587P2489L1216N86n303l9670j1370Q091k9061J1009
15030i937J0089n5548l2517p002K8444m9993j3678q306j4694k6367M3582P6447
15018e9480O8904o443j4328K497j3548j3935N6495M8305K7150j9059l5415o1869
15006b0726L1353J9358o3474n2253M5174J6169m9527n0670L4377J17562J44497
$$ plain form
15091 -36157 -24997 33869 56030 21546 -31942 -60635 -9492 -16578 -90440 -31478 -4087 -99355
15079 -99355 -148953 -122322 -48498 -16403 -60127 -121187 -100579 -48071 -83449 -40273 -35745 -60078
15067 -60078 -49057 -3540 28027 -21935 -83713 -118229 -83408 -92985 -145755 -92137 -53611 -76116
15055 -76116 -103045 -122056 -109978 -133176 -157298 -173497 -147924 -132224 -57095 24024 47019 39243
15043 39243 -13312 -50912 -59511 -47924 24565 55781 56367 51064 11394 24 8115 -20946 -9937
15030 -9937 152 -55396 -87913 -94915 -66471 -116464 -130142 -138448 -153142 -179509 -135927 -59480
15018 -59480 9424 2981 -11347 -8850 -22398 -36333 20162 68467 95617 76558 41143 -20726
15006 -20726 10627 29985 -33489 -85742 -40568 -24399 -73926 -124596 -90219 27343 171840
14995A71840N2118n4757m7118m6720q1874m3617l214M5488P5595o4872q7090J2526
14983g1695K8711Q524k3378j8107K4878O0393N2335p302k0271J3236J351m7701
14971I74K697o838J0867n1993q7110r301M2294j1748K7936K6815M9692k82k2819
14958b8816M6685m646n1674J7691R376k1483L541j178o5266M0376K4747L1816
14946A169O1902J1572p546o0009o2311K1730J9517K9934j925q760M832q1338n0336
14933a21569L8909N7885n954m0542K5836L4139K5389q170j0041l5755l4154K849
14921g1178n657n911j3694J5467L6990p707m2471n0913P200O1554O5672n468n5527
14908g1643m0063p2496L4529O2254K3254K3499L5680M2861n9189o6212J9403k3465
$$ plain form
14995 171840 223958 169201 122083 75363 -6511 -50128 -53342 -7854 67741 2869 -84221 -71695
14983 -71695 -42984 -34460 -57838 -75945 -51067 9326 61661 54359 34088 47324 48675 974
14971 974 3671 -3167 7700 -44293 -131403 -140704 -98410 -110158 -82222 -55407 -5715 -5997 -28816
14958 -28816 17869 13223 -38451 -20760 -11384 -32867 -29326 -30504 -95770 -55394 -30647 1169
14946 1169 63071 74643 67097 7088 -55223 -33493 -13976 15958 14033 5273 10105 -71233 -121569
14933 -121569 -82660 -24775 -30729 -71271 -45435 -11296 14093 5923 -4118 -39873 -74027 -71178
14921 -71178 -76835 -82746 -96440 -80973 -43983 -51690 -94161 -145074 -137874 -76320 -10648 -16116 -71643
14908 -71643 -111706 -184202 -149673 -87419 -64165 -40666 -4986 37875 -21314 -87526 -68123 -91588
14896i1588j7089N1420J06039j8160J1026K2494o974l0602l8356j0552N2909O7393
14884I7960m8031r2079j6266L7654k1357q1753J1965O9404L8645J6221O1998O5563
14872A39924k2563q5077m718j2238J413m5688M3832j0813N593l37l296J9684q5227
14859e9511K7395M8514j3087o3689P580L6447M2975k1513k561m0549K053K0579
14847a5367J9350j3774k0937k9736k7235J4794J6026L982M9678j3977Q285m3008
14835e1919L6765j2267K3477j1676l7855L2664K6312p494O591N4340J5622l9035
14823C5525l8325J0958O1705O514k3468K3939P285q994m5603j8076n1695L9453
14811g82L9466M7742O442k6437K5323j134k3473j5439o9063k5961l940l5773L0023
$$ plain form
14896 -91588 -108677 -57257 48782 30622 41648 64142 57168 26566 -11790 -22342 30567 97960
14884 97960 49929 -42150 -58416 -20762 -42119 -123872 -111907 -42503 -3858 12363 74361 139924
14872 139924 117361 32284 27566 15328 16741 -28947 14885 4072 9665 9328 6032 25716 -59511
14859 -59511 -32116 16398 3311 -60378 -52798 -16351 26624 5111 2550 -37999 -35946 -15367
14847 -15367 3983 -9791 -30728 -60464 -87699 -72905 -56879 -52897 -3219 -17196 -8911 -51919
14835 -51919 -15154 -27421 -3944 -15620 -53475 -20811 5501 -1993 4598 58938 74560 35525
14823 35525 -2800 8158 69863 76377 52909 76848 84133 75139 29536 11460 -40235 -782
14811 -782 38684 86426 92868 66431 91754 90620 67147 51708 -17355 -43316 -47256 -83029 -53006
14798e3006N3671L6628l0773K962N3407J8252J0292M5618m248J2114J1583j6667
14786A39833k7405o6869k3932M0132M0731j059j314J0137R465J5363n8724l5489
14774D0869N1095P4242K4328P55M4534O4254M406J5259K5716K5849K8624M5547
14762D45478L6007k0342l3340R131k0188M789n4430k3273n7381j6387q350j1531
14750B50183K3496J0042K3139L2958k9390l0693j5244n4869J0257J1056N3549
14739B84484M4305k0938n0149L046J9755k5897o0111j2387L3834P822k7131j3650
14727A82983n7199p322M1472J1670O3685O9743J07961J3272l2837O2084L3777
14716D89289N902L025J2211k9761L976j6359j1384M7717L644N0182L3945J2003
$$ plain form
14798 -53006 665 37293 6520 9482 62889 81141 91433 137051 132803 144917 156500 139833
14786 139833 112428 45559 21627 61759 102490 101431 100117 110254 119719 135082 76358 40869
14774 40869 91964 166206 190534 191289 235823 300077 304483 319742 345458 371307 399931 445478
14762 445478 481485 461143 427803 436934 416746 421535 367105 343832 286451 270064 261714 250183
14750 250183 273679 283721 306860 339818 310428 279735 264491 209622 219879 230935 284484
14739 284484 328789 307851 257702 260748 280503 254606 194495 182108 215942 223764 196633 182983
14727 182983 125784 118462 159934 171604 235289 305032 412993 426265 393428 455512 489289
14716 489289 495191 498216 510427 480666 484642 468283 456899 504616 508260 558442 592387 604390
14704F04390n862K3912N9762J1604M2270K5919J638k1065o2668n4935j5903J0940
14692F20002l8575J251l6874m1404j4406J4684J8353k0223k9905k978J4508J172
14680D85605m6366p205j1260j2638k5762N0718O776J0514p336n6512K5472P2123
14668D84129P6304O3760j0197O961M1922K5300n324j2359J2731j6724l2489L422
14656F37436r851l5655M5408j3159p4720p5883l0197J8469k1194L1008j075l0344
14644D40243o1412n1912J9258J9506k1393l5388k7979M6215J5705j9435k748k076
14632C18584m3038J386j4166o9517j2026R04M4594Q007J4333J8917N2602O2164
14620C82744J51m7514k657K5093k1343K712j0740J769m4498k871J2383l8895j7296
$$ plain form
14704 604390 598528 622440 682202 693806 736076 761995 763633 742568 679900 624965 609062 620002
14692 620002 581427 582678 545804 504400 489994 504678 523031 502808 472903 469925 484433 485605
14680 485605 439239 432034 420774 408136 382374 433092 439868 450382 443046 386534 412006 484129
14668 484129 560433 624193 613996 620957 662879 688179 682855 670496 683227 666503 634014 637436
14656 637436 627585 591930 637338 624179 549459 473576 443379 461848 440654 471662 470587 440243
14644 440243 378831 326919 346177 365683 344290 308902 280923 327138 342843 323408 320660 318584
14632 318584 275546 276932 262766 193249 181223 182127 226721 234728 249061 267978 320580 382744
14620 382744 382895 335381 332724 357817 336474 339186 328446 330215 285717 282846 295229 256334 239038
14607B39038k6684l113q3404K6128N5605k3665l311N4731L727m4248k8387k0857
14595A45560k7789l6800j9737J5390O4735P4437p075K3258j4187K9211K4331J8858
14583B90192j4188o720L5262j2133n9598m2047K9230L0281k7554p3288l4711J3276
14571A28002k603J8416L830K6086l2070K7947M6300N5182Q7062j1967q3370q1243
14559A81572L8705O5589m9732j3764m1999l7051J429j7142k1234P5916n411l8130
14547A38748K0656N6015r634l5290m1746k6999P780J5380O9690J1481n3261j6141
14535A36679N9316L1939n5776k1554J4883K3303R240l3576l7877j989L3930J9437
14523A77955L4546l904m7394p683l5871k1473M6704J6934k2407J469M2663n6535
$$ plain form
14607 239038 212354 209241 125837 151965 207570 183905 180594 235325 239052 194804 166417 145560
14595 145560 117771 80971 61234 76624 141359 215796 208721 231979 217792 247003 271334 290192
14583 290192 276004 269284 304546 292413 232815 190768 219998 250279 222725 149437 114726 128002
14571 128002 125399 143815 147645 173731 141661 169608 215908 271090 358152 346185 262815 181572
14559 181572 220277 285866 236134 222370 180371 143320 144749 127607 106373 182289 176878 138748
14547 138748 159404 215419 205785 170495 128749 101750 109530 124910 194600 206081 152820 136679
14535 136679 195995 227934 172158 150604 165487 188790 198030 164454 126577 124588 158518 177955
14523 177955 212501 208597 161203 153520 117649 96176 142880 159814 137407 138876 181539 125004
14511A25004L0036O16J7602j4871o2252M826M3908p497J2629P270n90k4308r45
14498A31428q276N0872J2638l7592l2356K9980O3416N804J3316o394k2064l8643
14486A62129J363M347j130k1776j5596J6612k8599k4275K4949K0769m0999K3854
14474A21648n2567L027o7318m5253J3081l085l6521l1072M5217Q9875J4573L458
14462E5063k876k4364l0135R791Q0178l0531n5003n2555l438m5882m554Q6398
14450a7908M8741M9085L7373m5225j11155l4909L6646L2680K486p921M3769l684
14438B9978L5635m4328k6884o873j3110l3162N712L620o506n6977L3013J4553
14426f5329n438Q557M5593J111J3778m748j0544p2621n2836M9136Q7128J3010
$$ plain form
14511 125004 155040 155656 173258 158387 96135 100961 144869 137372 150001 157271 156681 132373 131428
14498 131428 123152 174024 186662 149070 116714 146694 210110 215914 229230 222836 200772 162129
14486 162129 163492 167839 166709 144933 129337 145949 117350 93075 118024 138793 97794 121648
14474 121648 69081 72108 4790 -40463 -27382 -30467 -66988 -98060 -52843 37032 51605 55063
14462 55063 52187 27823 -2312 7479 87657 57126 2123 -50432 -53870 -99752 -104306 -17908
14450 -17908 30833 79918 117291 72066 -39089 -73998 -37352 -4672 -2186 -10107 33662 29978
14438 29978 65613 21285 -5599 -12472 -25582 -58744 -53032 -49412 -55918 -112895 -79882 -65329
14426 -65329 -70767 -62210 -16617 -15506 -1728 -6476 -17020 -89641 -142477 -93341 -6213 6797
14414F797M7577J0454l062r2588k3360N8984k0328l9621J4066O568m4826K0268
14402e9071M5991K8879K7329k1261m2685m1037L462k1383M5176N7379J6965M0288
14390H0032L9313l1547m6895k3200L095p4769j2301k941M9403O822k9084J6083
14378b5989N3848M1421k5726l2512m3964l5582p985J3298J0060P064J3874N4033
14366B1840J8604j069J2077J1911K86l1868j1223N4223j4239m0281k3275L4703
14354C1689K3215m4897J3412K2044M3714N29n1710n4765j5022m846L7273l0046
14342b9410k0492k9213k8264K9955N7983K5517J5683n4866m5088j1776p7366O0947
14330a06390Q803n6419M9716Q6057j9000L9780O176n8696k9378M8638L8762m6249
$$ plain form
14414 6797 54374 64828 61766 -30822 -54182 4802 -15526 -55147 -41081 -34513 -79339 -59071
14402 -59071 -13080 15799 43128 21867 -20818 -61855 -58393 -79776 -34600 22779 39744 80032
14390 80032 119345 87798 40903 17703 20798 -53971 -66272 -69213 -19810 -12988 -42072 -25989
14378 -25989 27859 69280 43554 11042 -32922 -68504 -76489 -63191 -53131 -46067 -32193 21840
14366 21840 40444 39375 51452 63363 63649 31781 20558 74781 60542 20261 -3014 31689
14354 31689 54904 10007 23419 45463 89177 89706 37996 -16769 -31791 -36637 636 -29410
14342 -29410 -49902 -79115 -107379 -77424 -19441 6076 21759 -33107 -78195 -89971 -167337 -106390
14330 -106390 -97587 -154006 -104290 -18233 -37233 2547 8723 -49973 -79351 -30713 8049 -38200
14318c8200m3406K0978J8202O3373j9212m6803K7707K6358Q3157L4777q3099q6326
14306d2494l87M115K5030N2640l9871j3180O0042P1251M57O0122Q0739R119R2919
14293C60502J12137J32865K30744J95996J18331R2235L982n8066p0209j58001
14283I60516j70271r3521n1776j2550o6494q7004q8027l6455n6086n6197l6029
14272B06106K728N130R834K5216n3354p0973k2810K2363J6069M2232L9026p176
14260B14391M936m1680k0983L1945K7643J5120n315m3847k5282n5449K0672K5878
14248A48029J446l8002o8489j6207J1137k878l9647q866J7216K7503L0066j0965
14236E0343k2641N693M9270Q3456q307m0405j6658l5273m6026Q9685p332k8257
$$ plain form
14318 -38200 -81606 -60628 -42426 20947 1735 -45068 -17361 8997 92154 126931 43832 -42494
14306 -42494 -42881 -38766 -13736 38904 -967 -14147 45895 117146 117603 177725 258464 267583 360502
14293 360502 472639 605504 836248 1032244 1150575 1242810 1246792 1188726 1118517 960516
14283 960516 790245 696724 644948 632398 565904 478900 390873 354418 298332 242135 206106
14272 206106 208834 213964 223798 249014 195660 124687 101877 124240 140309 182541 221567 214391
14260 214391 219327 177647 156664 188609 216252 231372 226057 182210 156928 101479 122151 148029
14248 148029 149475 111473 42984 26777 37914 35036 -4611 -13477 3739 31242 61308 50343
14236 50343 27702 33395 82665 166121 157814 117409 100751 65478 19452 109137 101805 73548
14224G3548M3002p724j9349k9936J0797K2680o996Q268J1236j3312N151n8476
14212C8889K220k6885l2201J5L5798J4993l7397p282R3425J1142l9263k6611m8641
14199b1798j7012n134r085N8128R699R171M7937j7191N76M6135O993J8119o0361
14186F6177J7174M2962j4419Q188m7877m6271p55M2127j8649Q012L4263r546j3072
14173F8314L2202j8444M767N9491P5988P501j6666l933J4009Q363n0459M6959
14161B28092O8250L3112O1468K7012Q2077J10943N9264J4947Q786J00475K30001
14150A024427L24524L17850K11904K54280L03961L98000M84689O27501O92616
14141D639752Q97930J087316J262223J275859J204912J139250R04104M55578Q9852
$$ plain form
14224 73548 116550 108826 89477 59541 70338 93018 86022 94290 105526 92214 97365 38889
14212 38889 41109 14224 -17977 -17962 17836 32829 -4568 -11850 81575 92717 53454 26843 -21798
14199 -21798 -38810 -43944 -53029 5099 14798 23969 71906 54715 55291 101426 108419 126538 66177
14186 66177 83351 126313 111894 120082 72205 25934 25179 67306 48657 56669 90932 81386 68314
14173 68314 100516 82072 86839 146330 222318 229819 213153 209220 223229 231592 181133 228092
14161 228092 296342 329454 390922 417934 500011 610954 670218 685165 693951 794426 1024427
14150 1024427 1348951 1666801 1878705 2132985 2436946 2834946 3319635 3947136 4639752
14141 4639752 5537682 6624998 7887221 9163080 10367992 11507242 12411346 12866924 12956776
14132A2956776k67041p13703j029798j099863j106411j120114j073788r15312
14124E630746o11764n26842l66910k88840k93598k01385j93817j13445j49747
14115B884398q2617k6443r5688j58070r4344k3310m7255k1145p2905p0548K8497
14104B220570P197q004j1225j1290j2931q3851k9768o4334j01030n6043l7448
14093A811843p2712j23561j21976o2083p0859r8597m7285n8293j14074q5913r4963
14082H61527q3860k4802L7740M4550o0383n2592n6143k0560R859J0788L1517K1539
14070G19180K9861j7595N9130P3250J1283O576N3978P8262K4780L2374m8027m2600
14058I80452M8040l052m7079j04141j15849q2255p7522o1632k4559J8563K8253
$$ plain form
14132 12956776 12689735 11976032 10946234 9846371 8739960 7619846 6546058 5630746
14124 5630746 5018982 4492140 4125230 3836390 3542792 3341407 3147590 3034145 2884398
14115 2884398 2801781 2775338 2679650 2521580 2427236 2403926 2356671 2335526 2262621 2192073 2220570
14104 2220570 2227767 2219763 2208538 2197248 2184317 2100466 2070698 2006364 1905334 1849291 1811843
14093 1811843 1739131 1615570 1493594 1431511 1360652 1262055 1214770 1156477 1042403 956490 861527
14082 861527 777667 752865 790605 835155 774772 722180 666037 645477 655336 666124 697641 719180
14070 719180 749041 731446 790576 863826 875109 881685 935663 1013925 1038705 1071079 1023052 980452
14058 980452 1028492 1025440 978361 874220 758371 676116 598594 536962 512403 530966 559219
14047E59219l3745m1778J0322j4071J581Q633K0380J0381R319K2436L0695J0923
14035E94295J9868N711J1309K6740p4534m6051p4474m517l8673l0638p598l4912
14023C46526l6499r295k7569K1567Q765J3560L868n6339l7368r2924j5018N0258
14011A69532M8795J8285l6790L1225N2282m2845m281M9308J9031J3288J9066l4121
13999C02775O54o2250O42N8489K3132L3764K274N6708m656q1428k0842K2383k6736
13986C04909j6358J6974J4233p50n3745k5515J1138N6454M2293M5930O2558J7752
13974D75873L7546j5418j9881K7357N7857R4221R4448q077J9690J77637K07652
13963A148905J33732P9706R9476K38954L78532L71502M03220L96489L83423L21354
$$ plain form
14047 559219 525474 483696 494018 479947 481528 490161 510541 520922 530241 552677 583372 594295
14035 594295 614163 619874 631183 657923 583389 537338 462864 458347 419674 389036 381438 346526
14023 346526 310027 300732 273163 294730 303495 317055 320923 264584 227216 134292 119274 169532
14011 169532 218327 236612 199822 231047 283329 240484 236203 285511 304542 317830 336896 302775
13999 302775 303429 241179 241821 300310 323442 357206 359480 416188 411532 330104 309262 331645 304909
13986 304909 288551 305525 319758 319008 265263 239748 250886 307340 349633 395563 458121 475873
13974 475873 513419 498001 478120 505477 563334 657555 752003 743926 763616 941253 1148905
13963 1148905 1282637 1362343 1461819 1700773 2079305 2450807 2854027 3250516 3633939 3955293
13953C955293J88703J08444M1119j45860l13519m03357m34180l51458l20503k51267
13943B073415j60997j34318j55499j10312m5073n0036p8949J9690k9197q0204
13933A248520p9627j3920J8323l9368r0731j00280j05215J1832N8442r182l7921
13922H60873l238K0646L4023o291n6140k5278n2306P3827O5494k422l4045j5091
13910H60052n7888L1941o491n5854p3385M006J09547R1965N0433O5395L4345m9318
13898A004748Q773J03335Q0337J28388K7975o2581o7413K2398j047L1603K8098
13887A304614M7252J09911k3376N4067M604L4567O792N2780M1987J1962L6259
13876A681419M294r5585p4675K0763M034M5330L1934o4303j8288P1631J5730L2086
$$ plain form
13953 3955293 4143996 4252440 4293559 4147699 3834180 3430823 2996643 2645185 2324682 2073415
13943 2073415 1912418 1778100 1622601 1512289 1467216 1417180 1338231 1357921 1328724 1248520
13933 1248520 1168893 1154973 1173296 1133928 1043197 942917 837702 849534 907976 898794 860873
13922 860873 857635 878281 912304 906013 849873 824595 772289 846116 911610 909188 875143 860052
13910 860052 802164 834105 827614 771760 698375 702381 811928 903893 954326 1019721 1054066 1004748
13898 1004748 1013521 1116856 1197193 1325581 1353556 1290975 1223562 1245960 1244913 1276516 1304614
13887 1304614 1351866 1461777 1438401 1492468 1497072 1531639 1538431 1591211 1633198 1645160 1681419
13876 1681419 1685713 1590128 1515453 1536216 1540250 1585580 1617514 1553211 1534923 1606554 1622284 1654370
13864A654370M2699P3650K9844M9446J2666M6652J23924L0079L6444J54014J15842
13853B369630J05171Q9852Q9141L8927N8589J39391J95309K29843K59456K82696
13843C858005K31947J05870J03517Q1223J38801J46631J01686J24533K50812L28254
13833E471279L91740N53939P02102Q88483R68024J201505J516945J836436K130795
13824A5661248K457744K848059L407584L983772M581975N189441N903587O694044
13816E0727454P801905R336656J1991952J6417871K2940035L0628217L5698618
13809A85542708L4576651K6341579J1979833o064351k2373614l1283109l2167721
13802A66551976k8331512k2654376j6888337j2195057q960238o737753n274150
$$ plain form
13864 1654370 1697069 1770719 1800563 1850009 1862675 1909327 2033251 2063330 2099774 2253788 2369630
13853 2369630 2474801 2564653 2653794 2692721 2751310 2890701 3086010 3315853 3575309 3858005
13843 3858005 4089952 4195822 4299339 4380562 4519363 4665994 4767680 4892213 5143025 5471279
13833 5471279 5863019 6416958 7119060 8007543 8975567 10177072 11694017 13530453 15661248
13824 15661248 18118992 20967051 24374635 28358407 32940382 38129823 44033410 50727454
13816 50727454 58529359 67866015 79857967 96275838 119215873 149844090 185542708
13809 185542708 220119359 246460938 258440771 252376420 230002806 198719697 166551976
13802 166551976 138220464 115566088 98677751 86482694 77522456 70784703 65510553
13795F5510553m280673l469370k949907k543551k196784k002823j915507j827368
13787D4324570j676561j471738j292019j029332p98179o94025n26238l64802k28561
13778C6243115j79675m1460O2479L4116j54917l96646p04509q96559j153266j399380
13768C1413298j454910j462194j528911j472365j380185j254650j215453j189065
13760B0455565j082033j050521j015334r59400q10214p68880p55823o77037o35391
13751A2700932n81814n50593n68295n58275n40314m82571l92733m06737l86957
13742H232643m11083l36450k87236l20205l36733l76181k77875k17947k32125
13733E436808k12231k25153k19575j92590j68323k00051j69910j72438j96334
$$ plain form
13795 65510553 61229880 57760510 54810603 52267052 50070268 48067445 46151938 44324570
13787 44324570 42648009 41176271 39884252 38854920 38056741 37362716 36836478 36471676 36243115
13778 36243115 36063440 36021980 36084459 36118575 35963658 35567012 34862503 33965944 32812678 31413298
13768 31413298 29958388 28496194 26967283 25494918 24114733 22860083 21644630 20455565
13760 20455565 19373532 18323011 17307677 16348277 15538063 14769183 14013360 13336323 12700932
13751 12700932 12119118 11568525 11000230 10441955 9901641 9419070 9026337 8619600 8232643
13742 8232643 7821560 7485110 7197874 6877669 6540936 6164755 5886880 5668933 5436808
13733 5436808 5224577 4999424 4779849 4587259 4418936 4218885 4048975 3876537 3680203
13724C680203j65950j05740j40068j34569j24192p2071j31380j12083n6933n5292
13714B581925l0710q9861n6634o9776o6816j21571j22161j23665q2643j08059
13704A710029m7524P655k2118l6324n8981n8365J1185K7841k5774q4333J0046
13693A433337n0882o0608l0346K7931L5720J1210P648m4703j6012l6016n3029
13682A224250o5848m1063r4317O542K0895m0558p645L0862O5139j5483p0800l5266
13670I76708l5037p4812l852N0364O3443L899o7069j9553k28j4420n9434K6937
13658H46946P3966J0572Q4018J2101o156M1410R2552p029L1213L4219l1907l381
13646A178524k0583P9825L2116j464k0874j0917L2259J9286m9725J5190L3249
$$ plain form
13724 3680203 3514253 3408513 3268445 3133876 3009684 2937613 2806233 2694150 2637217 2581925
13714 2581925 2551215 2461354 2404720 2334944 2268128 2146557 2024396 1900731 1818088 1710029
13704 1710029 1662505 1670160 1648042 1611718 1552737 1494372 1505557 1533398 1507624 1423291 1433337
13693 1433337 1382455 1321847 1291501 1319432 1355152 1366362 1374010 1329307 1313295 1277279 1224250
13682 1224250 1158402 1117339 1023022 1029564 1050459 1009901 1002256 1033118 1098257 1082774 1011974 976708
13670 976708 941671 866859 863007 913371 976814 980713 913644 894091 893863 879443 820009 846946
13658 846946 920912 931484 1015502 1027603 1021447 1062857 1155409 1148380 1179593 1213812 1181905 1178524
13646 1178524 1157941 1237766 1269882 1268418 1247544 1236627 1268886 1288172 1238447 1253637 1286886
13635A286886P0396O0343O8850j0965k2264M4276M9678J00013Q3775O0471j0763
13624A780696O2938R1387M3881K1272R6363J66063K27511L19114L15878L16409
13614C441512K41761J68791J26164m8875j28954j87720l48458l56802k66266k11085
13604B430068j86609j02840j31602j36144j16949l1861o2316n6923M5971o3996
13594A586799r3283n3819m4564q3690o4242j268k1287m915m17L8310o2855p7032
13582A117737K2220l22l3239M2354k9943j21030J0941p2J3571M116l2908l1823
13570I61602j8916l369k7054o2658m6731J0058J539K0757k2531K3413l7530p6349
13558G22231K0658L0392K0765o394m8328k1274J5368p2630o7255j3854j3889j6915
$$ plain form
13635 1286886 1357282 1417625 1486475 1475510 1453246 1497522 1547200 1647213 1730988 1791459 1780696
13624 1780696 1843634 1935021 1978902 2000174 2096537 2262600 2490111 2809225 3125103 3441512
13614 3441512 3683273 3852064 3978228 3929353 3800399 3612679 3264221 2907419 2641153 2430068
13604 2430068 2243459 2140619 2009017 1872873 1755924 1724063 1661747 1604824 1650795 1586799
13594 1586799 1493516 1439697 1395133 1311443 1247201 1245933 1224646 1219731 1219314 1257624 1194769 1117737
13582 1117737 1139957 1139635 1106396 1148750 1118807 997777 1008718 1008646 1022217 1026333 993425 961602
13570 961602 942686 939317 912263 849605 802874 812932 814471 835228 812697 836110 798580 722231
13558 722231 742889 773281 794046 787652 739324 718050 733418 660788 593533 579679 565790 548875
13546E48875Q540K379l6984q8844K4178J1748M7917M3864k7972o0694J3518N0296
13534E36821L9161J4653O504j0478K0285k8251l45K2468P9080J0149M3335Q1031
13522H14413Q6532J3251L5390J176N420o1054Q560L1107p6336j24305k4308p6363
13510F33483n4645M0327P498m656J5320m4968r3956O433K1379L8153O4453o0924
13498E67897n6744K5405R0116m4o5940Q58J6201j5361k4649j5383P6675P39J7363
13485F17133m0275J4823J748K7963k537p9065n1880m0475k2645j360k8029o827
13473C88574R747K0788k2734j2979l590k705l6878o403P445J1509L2844K8689
13461D14307k2172j8955o4522K7247J1878K1135L6174n0949k304K4509J99j778
$$ plain form
13546 548875 557415 559794 522810 433966 458144 469892 517809 561673 533701 473007 486525 536821
13534 536821 575982 590635 597139 586661 606946 578695 578350 600818 679898 690047 733382 814413
13522 814413 900945 914196 949586 950762 956182 895128 903688 934795 858459 734154 709846 633483
13510 633483 578838 619165 626663 622007 637327 592359 498403 504836 526215 564368 628821 567897
13498 567897 511153 536558 626674 626630 560690 561548 577749 562388 537739 522356 599031 599770 617133
13485 617133 576858 591681 593429 621392 618855 539790 487910 447435 424790 423430 395401 388574
13473 388574 398321 419109 396375 383396 379806 377101 340223 333820 341265 352774 385618 414307
13461 414307 392135 373180 308658 335905 347783 368918 405092 354143 351839 376348 376547 374769
13449C74769K4485J0091J0201k3901p2854J1436L2089j7894J7055J495q837n1454
13437C06681m9367j8001l6716K0501M4396J7202k2881j4759K1597J8137m739L3718
13425C15769p2743n1146L912K8958k8453m2701L1099L0119j3509J155l0906Q318
13413A79872m3801P3503K9970k6150L2831K3988n2371K8697k6857m9654j3733
13402A56295K05k1883p0674K6062J9426K0975L3354j251j8029j036k770J1933
13390A52607K1567L8128m392o1302l0261Q87j5816J5704M6530L3086M1842J5357
13378B53937q43j6787P002l2221k8653j155l4356m0495J1550M0231Q421j483j7221
13365A47927L1769L2682m4587k9294j3493O430K8549L3149j649K5518M7406j6636
$$ plain form
13449 374769 399254 409345 419546 395645 322791 334227 366316 348422 365477 366972 358135 306681
13437 306681 257314 239313 202597 223098 267494 284696 261815 247056 268653 286790 282051 315769
13425 315769 243026 191880 195792 224750 196297 153596 184695 214814 201305 202460 171554 179872
13413 179872 136071 209574 239544 213394 246225 270213 217842 246539 219682 170028 156295
13402 156295 156500 134617 63943 90005 109431 130406 163760 162509 144480 143444 140674 152607
13390 152607 174174 212302 207910 146608 116347 117234 101418 117122 163652 196738 238580 253937
13378 253937 253094 236307 243309 211088 182435 181280 146924 106429 117979 158210 166631 165148 147927
13365 147927 179696 212378 167791 138497 125004 131434 159983 193132 191483 217001 264407 247771
13353B47771l2478l8152p769l8552l1821L6442K9916j3926J1359J7037k6038k4365
13341A29424L8415Q3159J0123n650k705m0646L2923Q1592k5445M098K8527P6156
13329D09971Q3006K7794N3568R6742J32359J58088J17688R9193J76372N7453R153
13318A421387l5670j18498j26051j03107j82730j42012m0382r0906n1754l4204
13308D96073p3042j9386k8214L1183m384j3951n2810k6587q741l1004J7392K5825
13296C12354M1816K3722k6626P002o5794k8873J8431J5205J1173m685j8053k0344
13284B65328o0516K5152M3712J3105m5314m3416l262P614j3058o0515j66j2268
13272A16396q284j0559m10k5730k0375p0839r118Q4520K4697P1221J2501n2901
$$ plain form
13353 247771 215293 177141 169372 130820 98999 135441 165357 151431 162790 179827 153789 129424
13341 129424 167839 250998 261121 255471 252766 212120 245043 326635 301190 305288 333815 409971
13329 409971 492977 520771 574339 671081 803440 961528 1079216 1178409 1354781 1412234 1421387
13318 1421387 1385717 1267219 1141168 1038061 855331 713319 672937 582031 530277 496073
13308 496073 423031 403645 375431 406614 402230 388279 335469 308882 300141 269137 286529 312354
13296 312354 354170 377892 351266 358268 292474 263601 282032 297237 308410 303725 285672 265328
13284 265328 204812 229964 273676 286781 241467 198051 194789 202403 189345 128830 128664 116396
13272 116396 108112 97553 97143 71413 51038 -19801 -28919 55601 80298 151519 164020 111119
13260A11119l4500l7110K0479o7242n754M7595L5202l1056J3122L6490J3131k3210
13248G8266m7458j4764m068p2906q011N9221k7731K2944o502P4120N2602R933
13236A15646J8125K4324O1738k6214k43l9728l8638m3160j5946Q438N872N4440
13224A24654J4914m8683k1607N895L5944O1055Q8783n721p8678k8892N9596l7502
13212A69758l9731J9117J4419k6032l9505N5419j6389N756q380K5493k2397M935
13200A42463K0629k0269p085L4376J2910L7233N6306m8686K5592J0971o0027k4007
13188A80406N7467N1444l452J39779M9629k7121k5598J5129L1538N5368n476K67
13176E19380K8768l1609j10310j8667R932l4065l8079k7565N546k7485k1458l4008
$$ plain form
13260 111119 76619 39509 59988 -7254 -13008 34587 69789 38733 51855 88345 101476 78266
13248 78266 30808 16044 11976 -60930 -68941 -9720 -37451 -14507 -21009 53111 105713 115646
13236 115646 133771 158095 219833 193619 193376 153648 115010 71850 55904 64342 70214 124654
13224 124654 139568 90885 69278 75173 111117 172172 260955 255234 176556 147664 207260 169758
13212 169758 130027 149144 163563 137531 98026 153445 137056 142812 134432 159925 137528 142463
13200 142463 163092 142823 135738 170114 183024 220257 276563 227877 253469 264440 204413 180406
13188 180406 237873 289317 285865 425644 475273 448152 422554 437683 469221 524589 519113 519380
13176 519380 548148 516539 406229 387562 397494 363429 325350 297785 303331 275846 254388 220380
13164B20380N8162L6221m5919M2782L4939J8955p6837r7209m5388L7172K1961
13153B05219O8825m1589l5625m4380l6993O6393M8818m8834j8472P473n3622J8925
13141A36138Q3700m127j6312n1024m9003J1023J7345N76n9115R931J4549J817
13129I5498j380J6486P4840j7767J2169M1356m4529J4620j8791m245k062L5566
13117B01761J5199J2397O478n3371j7107J2946L6379N8238p04j3867k7163N1563
13105B82749L389k5477N9414K0147l8466J8698N6640j6209k3886Q59Q864Q4981
13093D31703J13767J0197o785n1625j8909P3757j4563j2768L2358K7327j07590
13082D76869k5479M7778m6200k0201o883k4869o2580m0543K3926k844J4235Q656
$$ plain form
13164 220380 278542 314763 268844 311626 346565 365520 288683 191474 146086 183258 205219
13153 205219 274044 232455 196830 152450 115457 181850 230668 181834 163362 170835 117213 136138
13141 136138 219838 215711 199399 148375 99372 110395 127740 128316 69201 79132 93681 95498
13129 95498 94118 110604 185444 167677 179846 221202 176673 191293 172502 168257 166195 201761
13117 201761 216960 229357 235835 182464 165357 178303 214682 272920 272216 258349 231186 282749
13105 282749 286138 260661 320075 340222 301756 320454 377094 360885 336999 337858 346722 431703
13093 431703 545470 555667 548882 497257 478348 552105 537542 524774 557132 584459 476869
13082 476869 451390 499168 452968 432767 425884 401015 338435 297892 321818 318974 333209 341865
13070C41865k5779O911l3351j1566J2925j3903L3336k241k2070m7559J0305J5994
13058B64867m0615P3886J318j1823j5513J3463j1181p6877n9425q000P6932k3553
13046A83479J7389J3591j5752J0328j8292m0751J6743J0701m7136P9376M4007
13035B53683j3947m2033k9445k5651J9209L5063k5713Q572L4795k4250m9713k3450
13023A17120J5251l2294L6126m6408k7680J1682K4816Q2281N2888K8982j5621
13012B47143n0665r0667J8081O7591M2894J2258q9118l8376j3882N1446l3804
13001A22901l9890J321R94r704J3223K6515K1194K1219q756l8657J1866J5449
12989A37675l7016K8308j7833l6023J9266L3912R765n6839l757j4790J12245J3123
$$ plain form
13070 341865 316086 322997 289646 278080 291005 277102 310438 308197 286127 238568 248873 264867
13058 264867 224252 298138 299456 287633 272120 285583 274402 197525 138100 130100 207032 183479
13046 183479 200868 214459 198707 209035 190743 149992 166735 177436 130300 209676 253683
13035 253683 239736 197703 168258 142607 161816 196879 171166 179738 214533 190283 140570 117120
13023 117120 132371 100077 136203 89795 62115 73797 98613 180894 233782 262764 247143
13012 247143 196478 105811 123892 191483 234377 246635 157517 119141 105259 156705 122901
13001 122901 83011 84332 85326 75622 88845 115360 136554 157773 149017 110360 122226 137675
12989 137675 100659 128967 111134 75111 94377 128289 138054 81215 77458 62668 174913 188036
12977A88036o8433p5575K6571P1266j6549l2913o8496K4284L2044j2392j8349
12966D9494m719K9456j858R134q43j5032k2181j6359q4611k7368L0146J6837N4308
12953A6404k1992k5536p72k5515P118M5728P0246k373J9687k7615l0252R248N2802
12940H7178O942j4212L4481J8632N185N64R879J2727l7120K963K4348j7979l2347
12927A01241k8898m215O7568J3437j2283o646l1006k3048K3881n0312j1605K6536
12915F4650o7517k6348r874M8279L4579L9630p87K2960K5267Q82n725l4590l9956
12902E1450N4575J6012j3046j4969J3895p771K9143N876k0853l0684m0259k5753
12890A7616k9978q153P4575k299N7158j8226k2025J549r770M5140k4050p0755
$$ plain form
12977 188036 119603 44028 70599 141865 125316 92403 23907 48191 80235 67843 49494
12966 49494 44775 74231 72373 81507 80664 65632 43451 27092 -57519 -84887 -54741 -37904 16404
12953 16404 -5588 -31124 -31896 -57411 -50293 -4565 65681 63308 82995 55380 25128 34376 87178
12940 87178 94120 79908 114389 133021 138206 138770 148649 161376 124256 127219 151567 133588 101241
12927 101241 72343 68128 135696 149133 136850 130204 99198 76150 100031 49719 38114 64650
12915 64650 -2867 -29215 -39089 9190 43769 83399 82612 105572 130839 131721 125996 91406 51450
12902 51450 106025 122037 108991 94022 107917 100146 129289 135165 114312 83628 43369 17616
12890 17616 -12362 -20515 54060 51761 108919 90693 68668 70217 60447 105587 81537 10782
12878A0782n3312L1715k146m1883L3329M9460L3053L127n6358p432Q4925N1853
12866A37113J2106N173m4221l3093o7995m648M1430M4806N2882J10698l6809q4078
12854A33364p1362J749l0545p5948O3329k987r102j96k4002L3010k9049O714O2442
12841E7417k5228m4090k5231J8784Q834j1081k90L7624J016K2153R294L6386n2739
12828C2849K290J0268m4015J5793O3437j7967j5500j3945l2m1059j9848K6502
12816a227m2990m6406M4931J6439k5745L200j0701K700R00L7894L0958J1703J3949
12803C5605o3175l4496M5605K4405q6480m1229j1643J1507k546J934J4492P3405
12791c2616K8488m7830j8683O3233K2358k0297l5405N8701J0707k6022L6475j4237
$$ plain form
12878 10782 -42530 -10815 -12961 -54844 -21515 27945 60998 64125 7767 335 85260 137113
12866 137113 149219 154392 110171 77078 9083 4435 45865 90671 143553 254251 217442 133364
12854 133364 62002 63751 33206 -42742 20587 17600 8498 8302 -15700 17310 -11739 -5025 57417
12841 57417 32189 -11901 -37132 -18348 -9514 -20595 -20885 16739 17755 39908 49202 85588 32849
12828 32849 35139 45407 1392 17185 80622 62655 47155 33210 33178 -7881 -27729 -1227
12816 -1227 -44217 -90623 -45692 -29253 -54998 -51798 -62499 -59799 -58899 -21005 9953 21656 35605
12803 35605 -27570 -62066 -16461 7944 -78536 -119765 -131408 -119901 -122447 -120513 -106021 -32616
12791 -32616 -4128 -51958 -70641 -7408 14950 -5347 -40752 17949 28656 2634 39109 24872
12779B4872l3829K128O290j647k0344K6222K0162N390J287O9572N674L2153M0698
12766A78628k6146l8496K6682R367q966o297p3089k4733j6809K1577k6040P222
12754B2900L2146L0012k521l4762j2807K3533N0573j5534K527p401p883l2419
12742D8364j5219n7204n467j5335k9887J0298J13377L7158p9840p9972m2137L9287
12730g6577O5098N076P636l2320K8515j743P5379K5232l8082k8977R749k078L748
12717D0656l4405l6408n03M4522J9768J3053J649m1560M095L4742N405k5399k6169
12704e54Q987N0407R192m0443R69M8616L5778k0174n0653k0833K3131q395l0231
12691E797m9116K3870k0434M0010L7005L8174J3396k1782k8402l797n7331l2942
$$ plain form
12779 24872 -8957 -6829 -539 -2186 -22530 3692 23854 29244 30531 100103 105777 137930 178628
12766 178628 152482 113986 140668 150035 141069 134772 61683 36950 20141 41718 15678 22900
12754 22900 55046 85058 82537 47775 34968 58501 109074 93540 96067 88666 80783 48364
12742 48364 33145 -24059 -29526 -44861 -74748 -64450 48927 86085 6245 -73727 -115864 -76577
12730 -76577 -11479 -6403 1233 -31087 -2572 -4315 71064 96296 58214 29237 38986 36908 40656
12717 40656 6251 -30157 -30660 13862 33630 46683 48332 6772 10867 45609 51014 25615 -554
12704 -554 8433 58840 68032 27589 28558 77174 112952 92778 42125 21292 44423 36028 5797
12691 5797 -43319 -19449 -39883 127 37132 75306 88702 66920 38518 34721 -22610 -55552
12679e5552J961j1086J2343J4996L0644J678l7256m1458K169M6351L2798m0374
12667d2786K7529K2189n9079P633l0464P7077J2708m699M219j8788j3337J2735
12655e063K4411l8539l6535K9768n586o4739m571M4031Q3248O0941m4274p269
12643C5823J9276K536K1988J29286l6748p2238n6586J6002k9799l1751k5620K8597
12631G66L6106n164p818j0350P516L7360l8603k8270l5326O971L611L3548M4534
12618D4881O3750l651j5069J8700k2360k4284j0760J5564l0729l2868r380M1453
12606C5247q065m7517O8629J6268J0366L0565k3756j9549O910J800Q101K0695
12594I9694n9901k0355J4582M2452J7462o531n7559n6301P684L6805J9311k5150
$$ plain form
12679 -55552 -53591 -64677 -52334 -37338 -6694 -5016 -42272 -83730 -81561 -35210 -2412 -42786
12667 -42786 -15257 6932 -52147 -44514 -74978 2099 14807 10108 14327 -4461 -17798 -5063
12655 -5063 19348 -19191 -55726 -25958 -31544 -96283 -100854 -56823 26425 87366 43092 35823
12643 35823 55099 57635 79623 208909 172161 99923 43337 59339 29540 -2211 -27831 766
12631 766 36872 31708 23890 13540 21056 58416 19813 -8457 -43783 -36812 -33201 347 44881
12618 44881 108631 104980 89911 108611 86251 61967 51207 66771 36042 3174 -6206 35247
12606 35247 27182 -20335 48294 64562 74928 105493 81737 62188 69098 70898 78999 99694
12594 99694 39793 19438 34020 76472 93934 87403 29844 -26457 -18773 18032 37343 12193
12582A2193K3502k2443K9444P151j7592O0492O0848N9566L9794j7751n3016j3409
12570A68779k0857K5446l8409l7489K6587K0821K5125P908n824p227J01707J01415
12558C67982J0705o2120j04235p1224k5656l2105K408L1982K4160L6816M5489
12547B24202M7360M2183j7738J1716K9234J5789j9609m3163K9485M7928k1518
12536C45869L4092J3053p6019p1027n7903L6159L1677J3152l2253p1245R487m9212
12524A25830j0736j85N934n5208J6500K0520j1239m480K8855N0509m863l6281
12512A25156J7437p3128K0976N9731M5981R3283K5447m6128R318k4760m0841L4512
12500B46984J9710p0736j5703j2741J8612N3912j1564j706q136o9856R530n611
$$ plain form
12582 12193 35695 13252 42696 49847 32255 92747 153595 213161 252955 235204 182188 168779
12570 168779 147922 173368 134959 97470 124057 144878 170003 177911 172087 164860 266567 367982
12558 367982 378687 316567 212332 141108 115452 83347 85755 117737 141897 178713 224202
12547 224202 271562 313745 296007 307723 336957 352746 333137 289974 319459 367387 345869
12536 345869 379961 393014 316995 245968 188065 224224 255901 269053 236800 165555 175042 125830
12524 125830 115094 114909 120843 65635 82135 102655 91416 86936 115791 166300 161437 125156
12512 125156 142593 69465 90441 150172 196153 289436 314883 268755 278073 253313 212472 246984
12500 246984 266694 195958 180255 167514 186126 240038 228474 226768 218632 148776 158306 152695
12488A52695m0583L2303P9222J19707Q6817P8961N2553n6044r6957k3183n46J4170
12476C99115p7480l8775J2506M3833O9620K0910k8302P885j5283J5492L33m5504
12464C64350l5865k9797o9483m8616M1164N3742j4761l3330N5177L7321J4540
12453C34442Q501J1525K2717k4089M6490M2749n7975N533K7221j4616N4827R7357
12441E54682O3115L8225M5442R3042Q4279Q5847R0933J8517K514n9921o0970m2669
12429I13036L409J776M7537j951n935L4293N7315J00926J25138Q6284R9236Q7216
12417A548280O1281q036m6532p7073j15270j09751q3965j32280r8236o9851o7700
12406H00867j9493o2502l4140J4756K3295M877p2641k3837l0108m1048r621L834
$$ plain form
12488 152695 112112 144415 223637 343344 430161 509122 561675 505631 408674 385491 384945 399115
12476 399115 321635 282860 295366 339199 408819 429729 401427 409312 394029 409521 409854 364350
12464 364350 328485 298688 229205 180589 221753 275495 260734 227404 282581 319902 334442
12453 334442 342943 354468 377185 353096 399586 442335 384360 389893 417114 402498 457325 554682
12441 554682 617797 656022 701464 794506 878785 964632 1055565 1074082 1076596 1016675 955705 913036
12429 913036 916445 918221 965758 963807 957872 992165 1049480 1150406 1275544 1361828 1461064 1548280
12417 1548280 1609561 1601525 1554993 1477920 1362650 1252899 1168934 1036654 938418 868567 800867
12406 800867 781374 718872 684732 699488 722783 727660 655019 631182 601074 560026 550405 554239
12394E54239l0508J02j2829l7824K6593N8097r516L412m0142n3469p2750m2085
12382C43320R236L1098k8178k5727m5109M6736K0293j114J4505n057L1952q876
12370C83079k7759n3353L496J2691j4839m1864l5894m0190j9310J7413J2409J1299
12358B07178O8192q55o1743j2389o5395L3838O0960J5891R1424J247q7697j2662
12346B37989L6752j06308L3195K6591J3489l9742l7590N477l5317l8382J6797
12335A12951J0250k5567m0414j065K9926j6582L3106O626l040l0787J5687j2960
12323G8131J8604L3657k044R205m1542m0188N6865P6166M6231q936k8807J4307
12311B11649Q444j7811o283K1979q129K5301j6954o9753k4638l7732K6279O1072
$$ plain form
12394 554239 523731 523833 511004 473180 499773 557870 548354 551766 511624 458155 385405 343320
12382 343320 352556 383654 355476 329749 284640 331376 351669 350555 365060 360003 391955 383079
12370 383079 355320 301967 305463 318154 303315 261451 225557 185367 166057 183470 195879 207178
12358 207178 275370 274515 212772 200383 134988 168826 229786 245677 337101 338348 250651 237989
12346 237989 274741 168433 201628 228219 241708 201966 164376 169853 134536 96154 112951
12335 112951 123201 97634 57220 56155 86081 69499 102605 109231 106191 75404 91091 78131
12323 78131 96735 130392 128348 137553 96011 55823 112688 188854 235085 226149 197342 211649
12311 211649 220093 202282 195999 217978 209849 235150 218196 148443 123805 86073 112352 173424
12299A73424J0216k7381p272k1158j2822j1131j8234j8519l621l7250r7067J9584
12287e1231K7236J0112R3777L7624m0867M869K4804q424k5827P6815J641k9947
12275A20582k4555M5568m2877m3112j7969O4324P456k5509j3245O44l9661J3672
12263D5318J6879m5511l5469P8420K949l2103l0429P053M3935J5001n676K2536
12251H2903N3616m7008p0872L2025N6994J1172k3395j8145j694q448K1147j480
12239H6815k6661k5388m1845O4189J7756m477o278m5245o9031j0007K0753K3259
12227a6160O675O4037O2673K1692K017l8027p7387Q531q949J1155k9267k0458
12215a3468j1880j3828M6329K3821o3014o2468J585J7048N255M7849j5737k5447
$$ plain form
12299 173424 183640 156259 148987 127829 115007 103876 85642 67123 63502 26252 -70815 -51231
12287 -51231 -23995 -13883 79894 117518 76651 81520 106324 97900 72073 148888 150529 120582
12275 120582 96027 141595 98718 55606 37637 101961 109417 83908 70663 71307 31646 45318
12263 45318 62197 16686 -18783 59637 62586 30483 54 7107 51042 66043 60367 82903
12251 82903 136519 89511 18639 50664 107658 118830 95435 77290 75596 67148 88295 86815
12239 86815 60154 34766 -7079 57110 74866 70389 64111 18866 -50165 -60172 -39419 -16160
12227 -16160 -9485 54552 117225 138917 140934 102907 25520 34051 25102 36257 6990 -13468
12215 -13468 -25348 -39176 7153 30974 -32040 -94508 -92923 -75875 -70620 -22771 -38508 -63955
12203f3955K0168Q3264R5248K4730j4544l1645l8118k4301k5336m569l2934j3689
12191b5681l4244j0972L3376j0249L5636L1702O7491p235o1334o3791j6642p366
12179f9309J2498O8874K7494k03o2324l2130n662K7116N99L3901K7196j8881M778
12166A3947p4074o5774J01912M2420p720J670q420k741p486K9750r099l1913k1442
12153c8970j7766n5843O723M2391O442P944J9317k9132L874J2559n0132M5207
12141d7386P0203l4831m7649K8339J7271j7839k0717j648O0747O7267j5433k7085
12129C1239k5527J2432J222J0629J6954K1813k4240N1589K5189l1274l5882m3905
12117A0239J5381j8148L142O65J1760P114M1194L0597j2266l6086o0098k6077
$$ plain form
12203 -63955 -43787 39477 134725 159455 144911 113266 75148 50847 25511 20942 -11992 -25681
12191 -25681 -59925 -70897 -37521 -47770 -12134 19568 87059 79824 18490 -45301 -61943 -69309
12179 -69309 -56811 12063 39557 39354 -22970 -55100 -60762 -33646 -33047 854 28050 9169 13947
12166 13947 -60127 -125901 -23989 18431 10711 12381 3961 1220 -6266 23484 14385 -17528 -38970
12153 -38970 -56736 -112579 -105856 -63465 -57023 -49079 -29762 -58894 -55020 -42461 -92593 -47386
12141 -47386 22817 -12014 -59663 -31324 -14053 -31892 -52609 -54257 6490 73757 58324 31239
12129 31239 5712 18144 19366 29995 46949 68762 44522 96111 121300 90026 54144 10239
12117 10239 25620 7472 10614 11279 23039 30153 71347 101944 89678 53592 -6506 -32583
12105c2583Q3866L8867l2878l5128m6321L1309P915J5623l5829j7057M942J1526
12093e748J9357j8373q264M4465O3367k7732n4339j070m0750k3396j7292N2267
12081a7508M1054K5570L5569M3809j0227j34352l6438M0158l1400O41M4327K2883
12069B4086L878j821J72K0515L377K5860M0364N5712K8487L5752l4110Q508R570
12056B20350J4914m2564r4942l4916j4664o8458J3434M6177O3018P0085K3361
12045A95795m2711p1530K843L0869o5105n56M0201Q119m5252j0411l7099l9398
12033c4235O4215J00048N5900Q6431O2765k8775J5064k0350K8460O5862K5243
12022D20628k0718l8898m8328k1293o3564k6945M7949J6693K397k1720m2698K9983
$$ plain form
12105 -32583 51283 90150 57272 22144 -24177 7132 15047 30670 -5159 -22216 -17274 -5748
12093 -5748 13609 -4764 -13028 31437 94804 67072 12733 11663 -29087 -52483 -69775 -17508
12081 -17508 23546 49116 84685 128494 118267 -16085 -52523 -12365 -43765 -43124 1203 24086
12069 24086 27964 26143 26315 46830 50207 76067 116431 172143 200630 236382 202272 210780 220350
12056 220350 235264 192700 97758 62842 48178 -20280 -6846 39331 102349 172434 195795
12045 195795 153084 81554 84397 115266 50161 49605 89806 97925 52673 42262 5163 -34235
12033 -34235 29980 130028 185928 272359 335124 306349 321413 301063 329523 395385 420628
12022 420628 399910 361012 312684 291391 227827 200882 248831 265524 267921 246201 203503 233486
12010B33486L5736K8662m1789m8505L7372M1484K6188L84O447R650m4105j1099
11998B73911j00724p3997L484k6747k159K8922M940j5113J1637K0487N9927m36
11986A84132j1241o6554k1270n3708N583R0308J093N1100M2550j057o419j7296
11974A97221O5574N9308P2918N9712L4700J0868M096l094J5907K4208M3524N0287
11962F35229K7815q949L8514N0483J25331P9816Q2354P4565J87699K43979K96369
11951A833205O3004k30558l47739k88303j65983m8220j2936k0018n5168j2302
11941G14982N20P779J9437O511K0941P9038P3539L4314Q2322J40140R9412L4105
11929A313040m0209l3222o8912k00751j67576j26107r2864q4006p6754J2324L0287
$$ plain form
12010 233486 269222 297884 256095 207590 244962 286446 312634 313018 319465 329115 285010 273911
11998 273911 173187 99190 102674 75927 73768 102690 107630 92517 104154 124641 184568 184132
11986 184132 172891 106337 85067 31359 36942 127250 128343 179443 221993 220936 214517 197221
11974 197221 262795 322103 395021 454733 489433 500301 504397 501303 517210 541418 584942 635229
11962 635229 663044 654095 692609 743092 868423 948239 1030593 1105158 1292857 1536836 1833205
11951 1833205 1896209 1665651 1317912 1029609 863626 815406 802470 782452 727284 714982
11941 714982 715502 723281 742718 749229 770170 849208 922747 957061 1039383 1179523 1278935 1313040
11929 1313040 1272831 1239609 1170697 969946 802370 676263 583399 499393 422639 434963 465250
11918D65250L7829j6474q5121k011P0297N0445Q105p9728p2382n822m5522k793
11906C22073n5145l5183J2554J1425L1113J9439l225l257Q221l2608j4348J5610
11894B76669K8865k5254K0493P8906K0785K1319l956o8348L7410K3304k3404n1286
11882C35503J743k708l3939o4854l1744N145o5670k9230P4036M1709J0068m4229
11870A95830k8562M36L4540J4934K6734N4046L3265j3430k5567o081m0015j358
11858B44772j0232m0806J7110o1320P2717P084m7894j1675K4601L5261j01444
11847A28174P591J7135J5002K3579L3429m415J9311m2214k3351l0443m6434n1487
11835D5877k7386O8510M4462m3491n6899J586K3350M8758M078k8407M9078N1546
$$ plain form
11918 465250 503079 486605 401484 399473 469770 520215 528320 448592 376210 370388 324866 322073
11906 322073 266928 231745 244299 255724 286837 306276 303051 299794 308015 275407 261059 276669
11894 276669 305534 280280 300773 379679 400464 421783 417827 349479 386889 410193 386789 335503
11882 335503 337246 334538 300599 235745 204001 209146 143476 114246 188282 229991 240059 195830
11870 195830 167268 167704 202244 217178 243912 297958 331223 317793 292226 286145 246130 244772
11858 244772 234540 193734 210844 149524 222241 229325 181431 169756 194357 229618 128174
11847 128174 135765 152900 167902 191481 224910 220495 239806 197592 174241 143798 97364 45877
11835 45877 18491 87001 131463 87972 31073 32659 56009 104767 108845 80438 129516 181062
11823A81062j1919l4370n6434o7139k5909L2490N088Q28M2928O3237L6249Q034
11811A74145R460j0324q3795m2461j3680M4843L0364l3834K1042l2919J922o905
11799E7858Q612M6337J7656n399j4556k7246m9992j3028M1284j9877j9605n0335
11787b8291N5356M9626j1983n046O620j1166m6969o4623M535L9744L7313L5525
11775F0641J3565m1359J2170j551N7208K0728R182r6832o311Q925J1548P50k2671
11762B5993J904J4384j1145j0851K9599M897k5710l4628N91K1288M2540L5372
11750I4234J5935r7477m5784L1109k1182K6960J6948m888K8314K9060l494j0142
11738E9593k2396j777m6761O839L8881L0458l5536M2771J3811l3324k4699o995
$$ plain form
11823 181062 169143 134773 78339 11200 -14709 17781 22869 23697 66625 129862 166111 174145
11811 174145 183605 173281 89486 47025 33345 78188 108552 74718 95760 62841 64763 57858
11799 57858 66470 112807 130463 125064 110508 83262 33270 20242 61526 41649 22044 -28291
11787 -28291 27065 76691 64708 59662 66282 55116 8147 -56476 -51941 -12197 25116 60641
11775 60641 74206 32847 45017 43466 100674 121402 130584 33752 27441 36366 47914 48664 25993
11762 25993 27897 42281 31136 20285 49884 54781 29071 -5557 -4966 16322 58862 94234
11750 94234 110169 12692 -33092 -1983 -23165 3795 20743 15855 44169 73229 69735 59593
11738 59593 37197 35420 -11341 -4502 34379 64837 29301 72072 85883 52559 27860 20865
11726B0865P139p0867L0348Q434p122j6554K8191J4706l6122o3860j6319O2598
11714c8563L8861k188l5858K7199K237j3026o645k8177M0876L8776J3542m324
11702C2710m5082n1883j1125K3315r8747o6827M8218P1243M0372m627k8742k2947
11690a14122M302P57j0025n8851J3523L8988O1423J0580J2794Q654l92p50q489
11677d1608o6216k5617j6190N4748N0040N2789O367p517m2172p853N2033O3653
11665G2457J60K0421j3751k5653J4004L4353M2884j6112j2201N606m075l6738
11653H1355p3378n3154P3802K7873J3944m5180l9919L4824R7539k7579l758k6411
11641E9958P6064m5060o8043L8134P7834Q208J0776M8636k0327M3161p966J6238
$$ plain form
11726 20865 28004 -42863 -12515 -4081 -11203 -27757 434 15140 -20982 -84842 -101161 -38563
11714 -38563 298 -1890 -37748 -10549 -8312 -21338 -27983 -56160 -15284 23492 37034 32710
11702 32710 -12372 -64255 -75380 -52065 -150812 -217639 -169421 -98178 -57806 -62433 -91175 -114122
11690 -114122 -109820 -109063 -119088 -177939 -164416 -125428 -64005 -53425 -40631 -31977 -32369 -33119 -41608
11677 -41608 -107824 -133441 -149631 -94883 -44843 7946 14313 6796 -35376 -43229 8804 72457
11665 72457 72617 93038 79287 53634 67638 101991 144875 128763 116562 122168 118093 81355
11653 81355 7977 -45177 28625 56498 70442 25262 -14657 20167 117706 90127 86369 59958
11641 59958 136022 90962 22919 61053 138887 147095 157871 206507 186180 229341 221375 237613
11629B37613M6370K2520J4471K3801l1945L4123J34393J78211R7884J14576J07582
11618I79599P8206J70299K02924K24776L15044L26149M45926O60442O77394M97092
11608D577851K49017o7075l89893n65719n18159m02098l30202k03783k09041j33050
11598B007848j34572r3546p576k5908m3049j4196m3280K56r554r5712r0849m2257
11586A407605l0416q4268n3462J1590K2101j01189p4278q2193j7596k7171m6188
11575I24535L782J6009M7939o7068o5035j0758j6555o8174K351l3902m0414P465
11563G00175K9180n8968m8515N9893K380k5113r247l8517k7427m4458k9160J2210
11551E22433Q276m1387n2647l2641q3950r4800m3644J2091J7225K7706m0080m2557
$$ plain form
11629 237613 283983 306503 320974 344775 312830 346953 481346 659557 757441 872017 979599
11618 979599 1057805 1228104 1431028 1655804 1970848 2296997 2742923 3403365 4080759 4577851
11608 4577851 4826868 4759793 4369900 3804181 3286022 2883924 2553722 2349939 2140898 2007848
11598 2007848 1873276 1779730 1772154 1746246 1703197 1689001 1645721 1645977 1636423 1540711 1449862 1407605
11586 1407605 1377189 1292921 1239459 1251049 1273150 1171961 1097683 1015490 997894 970723 924535
11575 924535 928317 944326 992265 925197 860162 849404 832849 764675 767026 733124 692710 700175
11563 700175 729355 670387 621872 681765 684145 659032 649785 611268 583841 539383 510223 522433
11551 522433 530709 489322 436675 404034 320084 225284 181640 193731 210956 238662 198582 156025
11539A56025K580o109J7460K2504O4014J2205j9313j4984l5978k0899j5058k1196
11527A41251k0583j397j9400q060j6603p9716j1671L5878P3201K3874J493n06
11515A17761K0516j1386o3300l5468L8582l0898L5511L0752n3761K9136K0348
11504I7793k4551l9217K3025M0369k3324n8139p8550k0200J7165K8115j8407J7657
11492c8264M1016o785J7632L6176J0754L4791n7368K7596m001o5411j9062j6953
11480c9879L4556m7013k1064O9750l4765n5322K9428M5536n1698J0919K0845o1700
11468a00407m3534m475j3837Q589M7762M5998m010K7048L4586J3407m9037R822
11456b8088L8140K7620L1268j8390l8902k3886l1854L985q445J7056N963K7700
$$ plain form
11539 156025 158605 152496 169956 192460 256474 268679 249366 234382 198404 177505 162447 141251
11527 141251 120668 119271 99871 91811 75208 -4508 -16179 19699 92900 116774 118267 117761
11515 117761 138277 126891 63591 28123 66705 35807 71318 102070 48309 77445 97793
11504 97793 73242 34025 57050 97419 74095 15956 -62594 -82794 -65629 -37514 -55921 -38264
11492 -38264 2752 -4033 13599 49775 60529 95320 37952 65548 61547 -3864 -22926 -39879
11480 -39879 -5323 -52336 -73400 -3650 -38415 -93737 -64309 -18773 -70471 -59552 -38707 -100407
11468 -100407 -143941 -148416 -162253 -153664 -105902 -59904 -63914 -36866 -2280 11127 -37910 -28088
11456 -28088 10052 37672 68940 50550 11648 -12238 -44092 -40107 -48552 -31496 -25533 2167
11444B167k0400L2410K6896k2740p372J1099L9036L5356Q908M9710N8234N2692
11432B65996O5040O2291J09218P2296K0441N3566J84693K00902K85066L92274
11422A711783N08156M59170J20922l80426n32591m01658k51187j95691j17496
11413I20982m1917j15681o5414M80l5281j00493l5991k1930l8027k0863j187l8663
11401D06015j3219m6970L6605n8773n0470K2528j4913l6715L9989j6888M6146
11390C13335M1260k7424q63n0970k6045K7108j4907l8353j0696K9380p604o796
11378B27425j2738o1171n6028J8065l3402J3485K7311K7689J2609j9555j4483
11367A29207K237n2345k8414K5659K0626o1453k6127J8335q718K7015m516K0297
$$ plain form
11444 2167 -18233 14177 41073 18333 10961 22060 61096 96452 105360 155070 213304 265996
11432 265996 331036 393327 502545 574841 595282 648848 833541 1034443 1319509 1711783
11422 1711783 2219939 2679109 2800031 2419605 1887014 1485356 1234169 1038478 920982
11413 920982 879065 763384 697970 698450 663169 562676 526685 504755 466728 445865 444678 406015
11401 406015 392796 345826 382431 323658 273188 295716 280803 244088 284077 267189 313335
11390 313335 354595 327171 326308 275338 249293 276401 261494 223141 212445 241825 234221 227425
11378 227425 214687 153516 97488 115553 82151 95636 122947 150636 163245 143690 129207
11367 129207 131444 79099 50685 76344 96970 35517 9390 27725 19007 46022 41506 61803
11355F1803R150p6925n583N8488j421M9183o410k0608l6074l6648J098N0498m2072
11342D479n5815K38O063m4964L3533J7979l7922l7041m9160J597L4627P4689O0844
11329I147l4664p7836J1472M0319k1759p8212N842k1853l8485j305M0232L3093
11317a34009L2721j6281l5330l9395J1448l8646l8856J1143M5826O9813M1334
11306i0232K5899j8820m3302Q340M8984j5554o71j8875k2860k3780L0964n350
11294a25257K4409J79k7210l5032j2157J0270J8451J88K3822K6085j5002k6695
11282a37949j5319J1008k6438J7042J12541J40080M1730N9059J546M4957O6521
11271C14778P9605R1864J1112l5676L797R4402N0142n8494p5417p8987j39206
$$ plain form
11355 61803 70953 -5972 -11555 46933 45512 94695 88285 67677 31603 -5045 -3947 46551 4479
11342 4479 -51336 -51098 -45035 -89999 -56466 -38487 -76409 -113450 -162610 -161013 -126386 -51697 9147
11329 9147 -25517 -103353 -91881 -51562 -73321 -151533 -145691 -167544 -206029 -207334 -167102 -134009
11317 -134009 -101288 -117569 -152899 -192294 -180846 -219492 -258348 -247205 -201379 -131566 -90232
11306 -90232 -64333 -83153 -126455 -118115 -69131 -84685 -85356 -104231 -127091 -150871 -119907 -125257
11294 -125257 -100848 -100669 -127879 -162911 -175068 -164798 -146347 -146159 -122337 -96252 -111254 -137949
11282 -137949 -153268 -142260 -168698 -151656 -39115 100965 142695 201754 203300 248257 314778
11271 314778 394383 486247 497359 461683 465480 559882 610024 551530 476113 397126 257920
11260B57920q4288m2817o9026p5795J0169m1528k5326k9336l4317J7123J4784
11249a02437J4379k6891j1078L5117j5573j2031M5852j7804j0664l9877l3581
11238a74588k1935p6965j8491O2271n494n5264M3939N0128N5533O1513p986k2517
11226a09856n2286p564j6378k1710P036p003p7420k0181Q5795J3607P937K6292
11214a71731N1292l8498p0131k6458K8133j1119J4614k6787m192O1005M9475j9249
11202a63646q9844m0507K2240k7046J4588M8328M7983M4339r1527o8551O673p044
11190c04014l2471K7134N9664l7870l5966L3519N6470L7126J8973K3382k5521
11179a79574j6036j2296o7907k8779O8002J9501m1073n9328n5742q49R102l2509
$$ plain form
11260 257920 173632 130815 61789 -14006 -3837 -45365 -70691 -100027 -134344 -117221 -102437
11249 -102437 -88058 -114949 -126027 -90910 -106483 -118514 -72662 -90466 -101130 -141007 -174588
11238 -174588 -196523 -273488 -291979 -229708 -235202 -290466 -246527 -196399 -140866 -79353 -87339 -109856
11226 -109856 -162142 -169706 -186084 -207794 -200758 -207761 -285181 -305362 -219567 -205960 -198023 -171731
11214 -171731 -120439 -158937 -229068 -255526 -227393 -238512 -223898 -250685 -254877 -193872 -144397 -163646
11202 -163646 -253490 -293997 -271757 -298803 -284215 -235887 -187904 -143565 -235092 -303643 -296970 -304014
11190 -304014 -336485 -309351 -249687 -287557 -323523 -290004 -233534 -196408 -177435 -154053 -179574
11179 -179574 -195610 -207906 -275813 -304592 -236590 -217089 -258162 -317490 -373232 -374081 -364979 -397488
11167c97488n2841l2117j1555K9982m646j1845M3138J7094L916N272Q0009J0323
11155c20758o5524K7041O8535M5100K7153J6329j5457j9326K8662j305n6226L566
11143b62210l0598Q037N294L0461K03806K29210m8737k14377q3342p9102m7043
11132b88601k2228O2906K7292m268N2974l3226n334M8724J7041l3365k1756N6501
11120a43340P9372l934l7600K9848O5552P4999O635J2686M8096Q3295L9619L6866
11108B92094J1659O1451J52349J30710R3351P6255P6290R1244J15717J00045R1911
11097A293076K3924O1355Q3158O7889M5263O2584J05402K8210n2192J0202p3256
11086A655615l6769l531K7923R3449K6694L0761J475k700j5549j8253O0467R9677
$$ plain form
11167 -397488 -450329 -482446 -494001 -464019 -468665 -480510 -437372 -420278 -416362 -411090 -331081 -320758
11155 -320758 -386282 -359241 -290706 -245606 -218453 -202124 -217581 -236907 -208245 -209550 -265776 -262210
11143 -262210 -292808 -284771 -279477 -249016 -45210 184000 135263 -79114 -162456 -241558 -288601
11132 -288601 -310829 -247923 -220631 -224899 -171925 -205151 -210485 -161761 -144720 -178085 -199841 -143340
11120 -143340 -63968 -67902 -105502 -75654 -10102 64897 71532 84218 132314 215609 255228 292094
11108 292094 303753 365204 517553 648263 741614 817869 894159 985403 1101120 1201165 1293076
11097 1293076 1317000 1378355 1461513 1529402 1574665 1637249 1742651 1770861 1718669 1728871 1655615
11086 1655615 1618846 1615315 1643238 1736687 1763381 1794142 1795617 1792917 1777368 1759115 1819582 1919259
11074A919259P2335M4942J468P2956J14549J75734J36411J74816J23427J76354
11064C012251J23830M9524P9541K3043O7670J27633N5560L4993N2162O9269J13676
11053C809152J60363J89274K18094J75753K01517J64619K30474K55402L91424
11044E796072M33623M83604N47624N28782O10234Q32148J087528J350906J786564
11035A3457085K178000K427767K471052K275769J729209J445195K182877L420306
11027C1587260M831742O217567P488338Q713793J0017466J1278542J2536591J4677680
11019A07348979J8060389K3496666L1980933M3748052O0575462Q4715929R5977409
11012D65903819N1635576l5888859q9510147q3301900n7659138l9078628k8826805
$$ plain form
11074 1919259 1991594 2036536 2038004 2110960 2225509 2401243 2537654 2712470 2835897 3012251
11064 3012251 3136081 3185605 3265146 3288189 3355859 3483492 3539052 3574045 3626207 3695476 3809152
11053 3809152 3969515 4158789 4376883 4552636 4754153 4918772 5149246 5404648 5796072
11044 5796072 6229695 6713299 7260923 7789705 8399939 9232087 10319615 11670521 13457085
11035 13457085 15635085 18062852 20533904 22809673 24538882 25984077 28166954 31587260
11027 31587260 36419002 42636569 50124907 58838700 68856166 80134708 92671299 107348979
11019 107348979 125409368 148906034 180886967 224635019 285210481 369926410 465903819
11012 465903819 517539395 481650536 392140389 308838489 251179351 212100723 183273918
11005A83273918k2401802j7171019j2899717r916438p983190o533518n278767
10998A01089467m220210l426759k856307k582897k684646k847604k601148j969681
10990G7900215j349792j006270j226392j626280j875513j639616j172512p55651
10982F7248189l50007J58438M49680J29895o63192j167417j495646j857959k302711
10973F0149270k668784k701657k698369k621631k373584k184948k216265k183088
10965D0500944k084437j917475j789955j671323j534376j425651j294387j160954
10957B7622386j117656j058000r80181q77192q07362p61135p50014p15315n61777
10948A9993754m65670m60520l53386j84830j76196l63808o01337p28500o89242
$$ plain form
11005 183273918 160872116 143701097 130801380 120884942 112901752 106368234 101089467
10998 101089467 96869257 93442498 90586191 88003294 85318648 82471044 79869896 77900215
10990 77900215 76550423 75544153 74317761 72691481 70815968 69176352 68003840 67248189
10982 67248189 66898182 67056620 67506300 67636195 66973003 65805586 64309940 62451981 60149270
10973 60149270 57480486 54778829 52080460 49458829 47085245 44900297 42684032 40500944
10965 40500944 38416507 36499032 34709077 33037754 31503378 30077727 28783340 27622386
10957 27622386 26504730 25446730 24466549 23589357 22781995 22020860 21270846 20555531 19993754
10948 19993754 19528084 19067564 18714178 18529348 18353152 17989344 17388007 16659507 15970265
10939A5970265o51268n94388p13467q05912q06555o42369n66231n09590m13853
10930A0266632m17148m17428l45143l39601l28563k26536k90385k84749k38149
10921G378930k51250k28704k37883j93038j44278k13625k57884j57217j53450
10912E541601j89246j53948j35000j51154j83994j35049o4455n3960r5743r3438
10902D285614j15593p2866o669q3235l6850m5572p9671r8519n2201l3704K701
10891C663435p0417m5324j5336j21629l70088l48117O0853J07096j3669m9719
10881B797085r1987m1548o2249j03679o265n147q3065p0874o0943m4199j5495
10870B211634J8741l7871o5746o1436j00254k5880K8128O9232L2187p2680L7957
$$ plain form
10939 15970265 15318997 14724609 14011142 13205230 12398675 11756306 11190075 10680485 10266632
10930 10266632 9849484 9432056 9086913 8747312 8418749 8192213 7901828 7617079 7378930
10921 7378930 7127680 6898976 6661093 6468055 6323777 6110152 5852268 5695051 5541601
10912 5541601 5352355 5198407 5063407 4912253 4728259 4593210 4528755 4474795 4379052 4285614
10902 4285614 4170021 4097155 4090486 4007251 3970401 3924829 3845158 3746639 3694438 3660734 3663435
10891 3663435 3593018 3547694 3532358 3410729 3040641 2692524 2753377 2860473 2846804 2797085
10881 2797085 2705098 2663550 2601301 2497622 2491357 2486210 2403145 2332271 2271328 2227129 2211634
10870 2211634 2230375 2192504 2126758 2065322 1965068 1939188 1967316 2036548 2068735 1996055 2034012
10859B034012M4038J754M9539M64J822j7606m0854J8996N1674N6744L0880K5204
10847B256667K2085R146J2801J9475P5628L7071j4315j4225j8021N0209P6748
10836B513269k0341o8454o8661k1855O071M1827L4318m9817p9631r9462K2369
10825B209633N5169l3096n2900n8570J9282N6009J6952k0315o0427l6223l5933
10814B059581m0960R237o16m9196j6106l209m6016K484J2447j1151l3993k3725
10802A858777j1992j5198o5866j19480r0642j8489M9225k5981o1332O461q97p6842
10790A427744l7745N6867k0474k7390J290P487k4912p7068o2738j8559N359j5069
10778A214792n150r5277k7035K8533L3712J6576K1579J9716m1068l7524N7425
$$ plain form
10859 2034012 2078050 2079804 2129343 2129807 2131629 2114023 2073169 2092165 2143839 2200583 2231463 2256667
10847 2256667 2278752 2287898 2300699 2320174 2395802 2432873 2418558 2404333 2386312 2436521 2513269
10836 2513269 2492928 2424474 2355813 2333958 2340029 2381856 2416174 2366357 2286726 2187264 2209633
10825 2209633 2264802 2231706 2178806 2120236 2139518 2195527 2212479 2192164 2131737 2095514 2059581
10814 2059581 2018621 2027858 2027242 1978046 1961940 1958731 1912715 1915199 1927646 1916495 1882502 1858777
10802 1858777 1846785 1831587 1765721 1646241 1555599 1537110 1586335 1560354 1499022 1505483 1504586 1427744
10790 1427744 1389999 1446866 1426392 1399002 1400292 1407779 1382867 1305799 1243061 1224502 1229861 1214792
10778 1214792 1209642 1114365 1087330 1115863 1149575 1166151 1187730 1207446 1166378 1128854 1186279
10767A186279l0623j3626j0496p4414Q971N5246q976o037M0434J6662k1542l5385
10755A106493o6394o5043k9811j5759o5080k7014k005k0976J5691O4906k4832
10744H70176L2493n873l4150j2513J0165n964p7315j1960J1374Q310O2475k2822
10732H24396k8474o2356m6937L9015K963L3579L2298o9349L146J828n5409m478
10720F70222j0924k3342O5534J1348m0249M8475J925j9729m3512N5981M2746l6340
10708G22135o705J8684P8750P2622l6157o634k4701j1812j6230J8471o1070l0721
10696G16632K5045P4394j7593j017k3070J481p059k4618O5715q039j3649j9805
10684G68417J3220q053n677p2328n8900L4708N2838n25o695k2778J4928p926k681
$$ plain form
10767 1186279 1155656 1142030 1131534 1057120 1066091 1121337 1112361 1106324 1146758 1163420 1141878 1106493
10755 1106493 1040099 975056 945245 929486 864406 837392 835387 814411 830102 895008 870176
10744 870176 902669 896796 862646 850133 860298 854334 777019 765059 776433 784743 847218 824396
10732 824396 795922 733566 686629 725644 728607 762186 794484 725135 728281 730109 674700 670222
10720 670222 659298 635956 701490 712838 672589 721064 722989 703260 659748 715729 758475 722135
10708 722135 715430 734114 812864 885486 849329 842695 817994 806182 789952 808423 747353 716632
10696 716632 741677 816071 798478 797461 774391 775872 768813 744195 809910 801871 788222 768417
10684 768417 781637 773584 767907 695579 636679 671387 724225 723700 717005 694227 709155 701229 698548
10671F98548J8690O349j8860l5248l3232M9739Q452k5707L5695p314l6145k7306
10659F33661j5967n8422m046K62K6084J5855M250o585L3263o9362j6803J2736
10647E54926J1453m702L0110M9300k7469l3554L7212m105o1272J4544J5335j0388
10635E71390l9055l4289j0073l2999M9868M989J0062k4531k6929k1852L7654K7141
10623E11376P3663N1941K8410J0825k9320p968l243k3851J1531O3371K4608k8593
10611F82750P2453P9505P4350P6728N8499J7183O3940J62592K18269K87267L33993
10600B127529M86275M93031J49516k30071m73370m44616l48722k20903j64160
10591A374509j14443j09669n1680o7043p142N157q854m3705l8874p392k6301L3208
$$ plain form
10671 698548 717238 723587 704727 669479 636247 685986 694438 668731 704426 697112 660967 633661
10659 633661 617694 559272 555226 555488 581572 597427 601677 595092 628355 558993 542190 554926
10647 554926 566379 561677 591787 641087 613618 580064 617276 613171 551899 566443 581778 571390
10635 571390 532335 498046 487973 454974 504842 509831 519893 495362 468433 446581 484235 511376
10623 511376 585039 636980 665390 676215 646895 638927 635684 611833 623364 686735 711343 682750
10611 682750 755203 834708 909058 985786 1044285 1061468 1125408 1288000 1506269 1793536 2127529
10600 2127529 2613804 3106835 3256351 3026280 2552910 2108294 1759572 1538669 1374509
10591 1374509 1260066 1150397 1098717 1031674 1024532 1029689 1020835 977130 938256 930864 904563 937771
10579I37771J5550K5280m2759K2034K0923M776l5594p5671J8176L231j3859O7304
10567I47162M3674k9284k332o2999n3596l3254M3537J947m7038P224j7734r722
10555G87585l6468m7847m6233l1730K4376p064l5840j4980m2942O479M6948l7446
10543E64838L585M1967p838j9590q029l2673K4687O8643o170o2929K0439L006
10531E89936K536K3062M5161l6308r9540l4294J7613K5283P6702K5456p980k8936
10519E98691m6966l828m1684n4481N2761N3467j9621k5792p6728M3458K2569l8258
10507D63588k4158J8220Q806o59k5921k1201l8835k8526K5082O5415N4704L7348
10495E33863K4902j7129o5958k5079M3244m1483J778N0607L5311L785M922n7324
$$ plain form
10579 937771 953321 978601 935842 957876 978799 983575 947981 872310 890486 893717 879858 947162
10567 947162 990836 961552 959220 896221 842625 809371 852908 854855 807817 815041 797307 787585
10555 787585 751117 703270 657037 625307 649683 642619 606779 591799 548857 555336 602284 564838
10543 564838 568423 610390 602552 582962 574933 542260 566947 635590 629420 566491 586930 589936
10531 589936 592472 615534 660695 624387 524847 490553 508166 533449 610151 635607 627627 598691
10519 598691 551725 547897 506213 451732 504493 557960 538339 512547 435819 479277 501846 463588
10507 463588 439430 457650 466456 465797 439876 418675 379840 351314 376396 441811 496515 533863
10495 533863 558765 541636 475678 450599 493843 452360 454138 504745 540056 543841 548763 491439
10483D91439j1217P619J1041O337k472k5008j4352J0365k1977N1532N038L8973
10471E47318j0707M1414K6000j1376m4106p2236m7936J9335K1982q620L6909l9455
10459D58522K4616K6931M3483l777J155m4370J0087J629M4958l6695k523K3608
10447E47624L4238M2177m7216k7952r132L5116L2922k8979m2688J6796K0825N2190
10435F25921q006j5605N05k740J2213K6907J4456M718K9357J2726l9223j7518
10423F43711l6965j3412M6553R191n419l1020K8475L3326k6589j2333n149K0433
10411F50802L6465r585J3517P0376M0448k1103l8839l1688j9559m4553r57n133
10399F40191J8823N1170J106K1499k5493J0951L4813l6607P833L5309l2310j8557
$$ plain form
10483 491439 480222 487841 498882 505219 502747 477739 463387 473752 451775 503307 508345 547318
10471 547318 536611 578025 604025 592649 548543 476307 428371 447706 469688 461068 497977 458522
10459 458522 483138 510069 553552 549775 550930 506560 516647 518276 563234 526539 524016 547624
10447 547624 581862 624039 576823 548871 539739 574855 607777 578798 536110 552906 573731 625921
10435 625921 617915 602310 602815 600075 612288 639195 653651 658369 687726 700452 661229 643711
10423 643711 606746 593334 639887 649078 643659 612639 641114 674440 647851 635518 630369 650802
10411 650802 687267 677682 691199 761575 802023 780920 742081 710393 690834 646281 645324 640191
10399 640191 659014 710184 711290 732789 707296 718247 753060 716453 724286 759595 727285 708728
10387G08728J7821M5867J6239k1010L0424K2640k8103m3260p0575O455k4746L3122
10375F93602L3211J4223M3817l0987k3167N8411J6181j8448J4509K1733j7765
10364H05320J8241M9740j8113K8103O8568M4675R8828J11131N2394O7159K5058
10353A351104P768Q1967J97040J67568J72101K79896L38419M28303N08869M87663
10343D020698M73985N39689M61817L45507K30270M9129o5679j82733l82138m44136
10333E046409m46665m16215m08562k80623l31890k47343j82662o9187j14765j10500
10323B437997k1627m703r0615k0361o8482m6436m8718m9279K1098j8915l154q763
10311B078042j4401l106O0086N2046J8744r634O356L343P66L9693r4688p4472
$$ plain form
10387 708728 726549 772416 788655 767645 798069 820709 792606 749346 678771 685226 660480 693602
10375 693602 726813 741036 784853 753866 730699 789110 805291 786843 801352 823085 805320
10364 805320 823561 873301 855188 883291 951859 996534 1095362 1206493 1258887 1326046 1351104
10353 1351104 1358872 1440839 1637879 1805447 1977548 2257444 2595863 3024166 3533035 4020698
10343 4020698 4494683 5034372 5496189 5841696 6071966 6121095 6055416 5872683 5490545 5046409
10333 5046409 4599744 4183529 3774967 3494344 3162454 2915111 2732449 2663262 2548497 2437997
10323 2437997 2416370 2411667 2321052 2300691 2232209 2185773 2137055 2087776 2108874 2089959 2086805 2078042
10311 2078042 2063641 2060535 2120621 2172667 2191411 2181777 2188133 2191476 2192242 2231935 2137247 2062775
10299B062775j5114J04340j4574p1902j09339j3063L2119l2267M159J6935n473
10288A958596K3153l6468J2516M8012m7155n5674N2531K522r827j8236O882L9863
10276A976715L7944K039j1345O0108o713l137k5416P7556P2757K0530M033N4543
10264B259614L8282q669l8596o4684M1823O4218J1920r633p598l775l1005L8853
10252B290750P6969O1200l9333J995N5730j9084l7581O0151J0812m4693K628j346
10240B418198J3882R2433M5415J9720l4944J7083N6581J0305P1755M0423j6899
10229B733952J818K270P2279J2721L0483L7255L3717k1341K8165m833J0504N5734
10217B992724L7421L754j3858N9082M5193N2228L0452l5183k2686K3974M8540
$$ plain form
10299 2062775 2047661 2152001 2137427 2065525 1956186 1943123 1975242 1942975 1947134 1964069 1958596
10288 1958596 1981749 1945281 1957797 2005809 1958654 1902980 1955511 1958033 1948206 1929970 1936852 1976715
10276 1976715 2014659 2016698 2005353 2065461 2058748 2055611 2030195 2107751 2180508 2201038 2205071 2259614
10264 2259614 2297896 2289227 2250631 2185947 2227770 2291988 2303908 2294275 2286677 2282902 2251897 2290750
10252 2290750 2367719 2428919 2389586 2391581 2447311 2428227 2390646 2450797 2461609 2416916 2419544 2418198
10240 2418198 2432080 2524513 2569928 2589648 2554704 2571787 2628368 2638673 2710428 2750851 2733952
10229 2733952 2735770 2738040 2810319 2823040 2853523 2890778 2924495 2903154 2931319 2926486 2936990 2992724
10217 2992724 3030145 3033899 3020041 3079123 3124316 3176544 3206996 3171813 3149127 3173101 3221641
10206C221641K4985N9113K9868K906O5788L8134o0688M0198L4858k4435P180M2029
10194C481577P9978M864K7699l1792m2064L6005L3236J1518l5560n3067O0123
10183C572517K3994n1781j09086m444Q705N9542N8200K0699j5067o1224l4448
10172C467607K5610j4373p488k9245K02J7919K5073k4112j6245R253p468m9367
10160C397366m6617j1500J6520o309l7474j8488M754J7188l0887j1665K1098o0503
10148C233483l9285j8055r2847o8493M7132O3693L8796J1716n4965n6804k2426
10137C041945m0459l7331k7064j1771R135J2992q2751j9341k080m2311n0533n057
10125B745374r211R258j2849m3438j4146o7797j7801J3762m757k1306o8952k2161
$$ plain form
10206 3221641 3246626 3305739 3335607 3338513 3404301 3442435 3381747 3421945 3456803 3432368 3439548 3481577
10194 3481577 3561555 3566419 3594118 3562326 3520262 3556267 3589503 3601021 3565461 3512394 3572517
10183 3572517 3596511 3544730 3435644 3431200 3439905 3499447 3557647 3578346 3563279 3502055 3467607
10172 3467607 3493217 3478844 3471356 3442111 3442313 3460232 3485305 3461193 3444948 3454201 3446733 3397366
10160 3397366 3350749 3339249 3355769 3349460 3311986 3293498 3298252 3315440 3284553 3272888 3293986 3233483
10148 3233483 3194198 3176143 3083296 3014803 3061935 3125628 3164424 3176140 3121175 3064371 3041945
10137 3041945 3001486 2964155 2937091 2925320 2934455 2947447 2864696 2845355 2843275 2800964 2750431 2745374
10125 2745374 2736163 2745421 2732572 2689134 2674988 2607191 2589390 2603152 2598395 2577089 2508137 2485976
10113B485976P943j10546r0157m682O6501j5169q091J5809l9175K4797k393l5785
10101B295028q6395m4215L4203m947n1410l3174l5835j01138o0193l5622J7484
10090A893786K3735j0591J8806K3489K5233m0946o0517j9907K124m1J9358p0419
10078A804110k2793J8434p248k1940m0056l2458M4258k3858l6718j9429n4778
10067A607524K9612k3128j759k3712p4349J8897Q162o00l4787M4303N5570n707
10055A600026k8590O078o934L4073Q9356K8663K7158J48619K19702J92198L9492
10044B349841k12898k58454j27190j40116q5972l7418l1998n6742o4963l5775
10034A298315M4216J0681l597n3456l5042m6003n9839J2291J0991J1988o1035
$$ plain form
10113 2485976 2493919 2383373 2293216 2288534 2355035 2339866 2331775 2347584 2308409 2333206 2330813 2295028
10101 2295028 2208633 2164418 2198621 2193674 2142264 2109090 2073255 1972117 1911924 1876302 1893786
10090 1893786 1917521 1906930 1925736 1949225 1974458 1933512 1872995 1853088 1855212 1855171 1874529 1804110
10078 1804110 1781317 1799751 1792503 1770563 1730507 1698049 1742307 1718449 1681731 1662302 1607524
10067 1607524 1637136 1614008 1612249 1588537 1514188 1533085 1541247 1540647 1505860 1550163 1605733 1600026
10055 1600026 1571436 1577514 1570580 1604653 1694009 1722672 1749830 1898449 2118151 2310349 2349841
10044 2349841 2136943 1878489 1751299 1611183 1525211 1487793 1455795 1399053 1334090 1298315
10034 1298315 1342531 1353212 1349615 1296159 1261117 1215114 1155275 1167566 1178557 1190545 1129510
10023A129510n0538J0730K8649P0505k3407N257M0775n539m5562j4917m6584k344
10011A096535p3297n171N3206R508l468m6551p7475j7805j9855l0462r825l8839
9999H36501K3761R9021M720p2443j9631o9324N979L671M2453k6441n8953K2713
9987G92027K153N489K0366J1375Q157j542M7175K8702o6123r2493l567M6742l2752
9974G65709k3332L3322l1049j1108J3691J0403N072k3621m5026L0514J16627L5151
9962H76353m1784L309k8532p2852j01370m7144r962J8625n6358K1579R4475L2385
9950F88724r457N4084n845k4038l8381m5279K5678n2029k4103n966L7956j7301
9938E84043k5236O124K7031O8043m4164k1247k6731m1913p420N0269J0440j7025
$$ plain form
10023 1129510 1078972 1089702 1118351 1188856 1165449 1170706 1211481 1205942 1160380 1145463 1098879 1096535
10011 1096535 1023238 1018067 1071273 1080781 1077313 1030762 953287 935482 915627 885165 875340 836501
9999 836501 860262 959283 964003 891560 871929 802605 808584 812255 854708 828267 769314 792027
9987 792027 794180 799669 820035 831410 839567 838025 885200 913902 847779 755286 751719 798461 765709
9974 765709 742377 775699 744650 733542 747233 757636 762708 739087 694061 724575 841202 876353
9962 876353 834569 837878 809346 736494 635124 587980 578018 596643 540285 561864 656339 688724
9950 688724 679267 733351 727506 703468 665087 619808 645486 593457 569354 563388 601344 584043
9938 584043 558807 564931 591962 660005 615841 594594 567863 525950 518530 568799 579239 562214
9926E62214L1341m6463n693J9664k8590K9206l6395P4949N5327o2442m4463P7370
9914F26025L570o3358j3518Q373O136j4167q2294n7965J1284Q2995N6582Q4620
9902F48283L6705L0731p137o2382r933P2300K2315k292K9002n0631K0934k0532
9890G07363P6557P1337R897O1693Q5199Q8856K12650K60710M04562K59064n5990
9879B181898l53021l32277j43662j32526q2776q5643K9723L9940n139l9471m0713
9868A036333n1979n4797j01277o1291K316l9897n8764l9302k6465R9j3047J36
9856E92065P0525N8870m2146k857L6505K6842K0744J5646o5041p352L6947o552
9844G34196n2763m7895j624k4292o852L540J163j9533j1082k0412K1883J2082
$$ plain form
9926 562214 593555 547092 541399 561063 532473 561679 525284 600233 655560 593118 548655 626025
9914 626025 629595 566237 552719 561092 567228 553061 470767 412802 424086 507081 563663 648283
9902 648283 684988 715719 708582 646200 636267 708567 730882 728590 757592 706961 727895 707363
9890 707363 783920 855257 865154 926847 1012046 1100902 1313552 1574262 1978824 2237888 2181898
9879 2181898 1828877 1496600 1352938 1220412 1137636 1051993 1081716 1121656 1116517 1077046 1036333
9868 1036333 984354 929557 828280 766989 769305 729408 670644 631342 604877 604976 591929 592065
9856 592065 662590 721460 679314 676457 712962 739804 760548 776194 711153 703801 740748 734196
9844 734196 681433 633538 631914 607622 600770 604310 605473 585940 574858 554446 576329 588411
9832E88411j5314M5137M3845L6676P5391m352m8297o3709p3968l9809n0377O017
9820D99651k8656O026j458r3483n3570l3925J9529j93K348L6072j4576N2268L2452
9807D22485n0665l0417k4451j1943L4396j1712K9078P7364J4146j3702l0229J2248
9795D16598l5072J0682J4259l0995N4386q0406m4780K4690L5272n854j0637j2042
9783C36101N296N9743m0848m1303k518m9979m0792J6145j2248J4579P2678M0951
9771C57805O845p246K6807L913l3800r528K3851J5110q1185n6522m5625l314L9891
9758B37002M629k5953l5865N7002P1420m4764m7247K8K472L1913M2622m0174M9585
9745C02670J8399m4571L5504K2898n1451l343L2781j6170j422o8493j3034N916
$$ plain form
9832 588411 573097 618234 662079 698755 774146 769794 721497 657788 583820 544011 493634 499651
9820 499651 470995 477021 475563 382080 328510 294585 314114 313921 316269 352341 337765 390033 422485
9807 422485 371820 341403 316952 305009 339405 327693 356771 434135 448281 434579 404350 416598
9795 416598 381526 392208 406467 375472 429858 349452 304672 329362 364634 358780 348143 336101
9783 336101 341397 401140 360292 318989 316471 266492 225700 241845 229597 244176 316854 357805
9771 357805 364650 357404 384211 388124 354324 344796 368647 383757 302572 246050 200425 197111 237002
9758 237002 241631 215678 179813 236815 308235 263471 216224 216252 218724 250637 293259 253085 302670
9745 302670 321069 276498 312002 334900 283449 280106 312887 296717 295295 226802 213768 219684
9733B19684J2912J1357k0709K3030J9453K9304L824n8622o4858K1808L0483p553
9721B20113N326M286J0602L6980l281r908k7659O470l6949J5888K7263o6673l3631
9708A48827K5695M3764P645j6049j5361K0269J5995N4306m8205k8634j3255K9104
9696B24101n8853k7599M7790p20j1736K5590k1052M151M376K7511L9803q000m25
9683B44937j4166J2209K5624L6753o1939n6025j2712j1141m2100j1977K4669O6205
9671B00337l9231l3419O7979L7003l9936k4762n345k5781J8983M3157N5717r675
9659B45027m0907r042K1020m4045K2352J2099J5371O069m2807J3626M0791l2416
9647B07138J8610j3091j9116N5666J0810l5491r879R372L5574k5366k3423l6582
$$ plain form
9733 219684 232596 243953 223244 246274 265727 295031 298855 240233 175375 197183 227666 220113
9721 220113 225439 229725 240327 277307 274026 264118 236459 242929 205980 221868 249131 182458 148827
9708 148827 174522 218286 225931 209882 194521 214790 230785 285091 236886 208252 194997 224101
9696 224101 165248 137649 185439 184719 172983 198573 177521 181672 186048 213559 253362 245362 244937
9683 244937 230771 242980 268604 305357 243418 187393 174681 163540 121440 109463 134132 200337
9671 200337 161106 127687 195666 232669 192733 167971 162626 136845 155828 198985 254702 245027
9659 245027 204120 195078 216098 172053 194405 206504 221875 227944 185137 198763 239554 207138
9647 207138 225748 212657 193541 249207 260017 224526 214647 224019 259593 234227 210804 174222
9635A74222M1024j1473j6008m2492l3474k7757o221R394Q2588J9127K3819N9720
9623B72469l7258k7871K7266m350n0209n1465N0005p60n8410r7447K9583Q3854
9611A35407J8445l470K7865N277k5765o5176m0560L2128N5103K0188k7058n378
9599A27006K5683J6641L9809j9954l287j3286Q436N4090K0662j6783L8747K6258
9587C04022l8388N259k6214p8147o3644J2823J290O380M6832L107N1511N2519
9575B77350l2085q983j5522k5208l2835l1316l167M7949j7379o3579J4235L1275
9563A40735J3030k9536J906q321j4592j667Q171J1097l85k5810k4727L1767N170
9550A06838k5659m707N5348J4597m595M2112j3858p7698k0153o560P131J6095
$$ plain form
9635 174222 215246 203773 187765 145273 111799 84042 77821 87215 169803 188930 212749 272469
9623 272469 235211 207340 234606 230256 180047 128582 178587 177827 119417 21970 51553 135407
9611 135407 153852 150382 178247 183524 157759 92583 52023 84151 139254 159442 132384 127006
9599 127006 152689 169330 209139 189185 185898 172612 181048 235138 255800 239017 277764 304022
9587 304022 265634 270893 244679 166532 102888 115711 117001 123381 170213 173320 224831 277350
9575 277350 245265 236282 220760 195552 162717 131401 128234 176183 158804 95225 109460 140735
9563 140735 153765 124229 126135 117814 103222 101555 109726 120823 120438 94628 69901 101668 106838
9550 106838 81179 76472 131820 146417 141822 183934 170076 92378 72225 65665 72796 88891
9538H8891J0067j5482L8016k8313K319J694K9864m195l2404k2948r30M3210N4878
9525A64667j1322m6936J2067K7144O186J954j1786p78N998L8630r741m4880L0303
9512A61506J5590j9735m5798J3081p003l1474K7746M2885K6052M0192K0902n36
9500B43408l7683n237K7842n873n5857l2772R050j9965M5044o4823o7210K4546
9488F0470N5566K730j2620o273m6956K311J9200l4680L2498k7170M0424M1629
9476A27129m9747L367l5120k3692K2912O0484N8630K8532J592j9659k3000j07645
9464D3783k5175K8404M7398K3422J5078J1950K2963J8454l1317k0234m0250O88
9452I5164L4312K1212J568o0068K400L1208j9600m2555N2233L9564O1886q514
$$ plain form
9538 88891 98958 83476 121492 93179 95498 97192 127056 122861 90457 67509 66579 109789 164667
9525 164667 153345 106409 118476 145620 151806 153760 141974 141196 147194 185824 176083 131203 161506
9512 161506 177096 157361 111563 124644 117641 86167 113913 156798 182850 223042 243944 243408
9500 243408 205725 200488 228330 222457 166600 133828 142878 122913 167957 103134 35924 60470
9488 60470 116036 118766 106146 99873 52917 55228 74428 39748 72246 45076 85500 127129
9476 127129 77382 80749 45629 21937 44849 105333 163963 192495 194087 174428 151428 43783
9464 43783 18608 47012 94410 117832 132910 144860 167823 186277 154960 134726 94476 95164
9452 95164 129476 150688 152256 92188 94588 125796 106196 63641 115874 155438 217324 208810
9440B08810p5011l535J7908M5970K3372K0631j10702n9245N347Q2128n1781n61
9428A03331K1913j2797m8076k6550M4738O0037K8394m83k4580k4209K2916m5852
9416I8782n8524R801J9393j6655l296M8705J6958J4374M6424K3794j9734m0914
9404A39108k9302M1228J1906m4984n0086M0320r733l2039M0998N028k4633j5968
9392G1843P082O4450K7727k7646L0052p323j1777j6360j8438l1005J3877J8728
9380A21210K2543q612p08j9127J9092J7595J6478J5123J5933m4209m9M6893J5476
9367B17638k9724r354m8670l910k385N345m0921L1748J2930n331K6851M5717k340
9354A97594o0119k9815K0694L295k1439l1963k9803O406L1264O8059K1954q442
$$ plain form
9440 208810 133799 130264 148172 194142 217514 238145 127443 68198 73545 155673 103892 103331
9428 103331 125244 112447 64371 37821 82559 142596 170990 170507 145927 121718 144634 98782
9416 98782 40258 50059 69452 52797 49501 98206 115164 129538 175962 199756 180022 139108
9404 139108 109806 151034 162940 117956 67870 108190 98457 66418 107416 112444 87811 71843
9392 71843 78925 143375 171102 143456 173508 166185 154408 138048 119610 88605 102482 121210
9380 121210 143753 135141 134433 115306 134398 151993 168471 183594 199527 155318 155269 202162 217638
9367 217638 187914 178560 129890 125980 123595 128940 88019 119767 132697 127366 154217 199934 197594
9354 197594 137475 107660 128354 131649 110210 78247 48444 54850 86114 154173 176127 167685
9342A67685l3397L6608k548m6419Q557J2846J3394K705m2790p7391J0371Q8360
9330A37981J0813J6647j9502k9018K5762K6980l2729L712k6039j1651o9N019N9360
9317A67266L1799K6204J61k6161k3003k7204k282K022Q510L4272Q3078k7424l5041
9304B12197R16k0979k7643m0310k3559J3033J2716M038O62J2257J9721Q881m1790
9291A30140j8919J8275K5077L5152o2440k8065J0725M7218K1842n8243k4190p6
9279I6496R016P974K7631K4563p545l3368J787J6732K7251k0779J1961O5352j1631
9266B15440P587K4026n649M876M573J1897l3434n7187K2097M495k6682j5124k0145
9253A36770q299l3466J1747j6327M9936J9486j6238o049j3033l8823J6748j802
$$ plain form
9342 167685 134288 170896 168348 121929 130486 143332 156726 159431 116641 39250 49621 137981
9330 137981 148794 165441 145939 116921 142683 169663 136934 140646 114607 102956 102887 107906 167266
9317 167266 199065 225269 225430 199269 176266 149062 146780 148802 157312 191584 274662 247238 212197
9304 212197 213113 192134 164491 124181 100622 113655 126371 130409 131071 143328 163049 171930 130140
9291 130140 111221 129496 154573 189725 127285 99220 109945 157163 179005 120762 96572 96496
9279 96496 105512 113486 141117 165680 158135 124767 126554 143286 170537 149758 161719 227071 215440
9266 215440 223027 247053 241404 246280 250853 262750 229316 172129 194226 198721 172039 156915 136770
9253 136770 128471 95005 106752 90425 140361 159847 143609 137560 124527 85704 102452 100650
9241A00650r349m594M7352J0092p318m784M4520p474l2483m8551O5793J2162L163
9228A69179L6316K8841n207j5158k6634k4717j4648j2103j5173l5074Q052N7966
9216A51640l2658L6934K068k5210K7563L046j8249l4501j3196K4509J103K1300
9204A44349K6199J8699l5106l1231k7781L2174P643k6199P4382M1532K0892k5520
9192B20033J3699j1835q4033o3542P406M139O103O6633M575o1434l761L939J605
9179A03527o720k618J0680L9243O1125k6350l2957J7685Q7008k7380q5792m9939
9167H7512l8163j3229J6752L2946L4264N557l4254K0894L3682J9524l1441k9196
9155A04848l4374L34j0063M119K2534M9427N5607N971q4086m6424J7545O5828
$$ plain form
9241 100650 91301 86707 134059 144151 136833 132049 176569 169095 136612 88061 153854 166016 169179
9228 169179 205495 234336 229129 213971 187337 162620 147972 135869 120696 85622 93674 151640
9216 151640 118982 155916 157984 132774 160337 163383 145134 110633 97437 121946 123049 144349
9204 144349 170548 189247 154141 122910 95129 127303 134946 108747 183129 224661 245553 220033
9192 220033 233732 221897 137864 74322 81728 85867 91970 158603 163178 101744 97983 101922 103527
9179 103527 96807 94189 104869 144112 205237 178887 145930 163615 250623 223243 137451 87512
9167 87512 49349 36120 52872 85818 120082 125639 91385 112279 145961 165485 134044 104848
9155 104848 70474 70808 60745 64864 87398 136825 192432 198403 114317 67893 85438 151266
9143A51266J6534N7343j1315L579j3376k4298j5057M0620N0400l0717q5443j251
9131A38285P3196k7183j4227q1436L4647M8694k0538J4429l3351j7679n0701L248
9119F7384L8661K1196K3338J72J7394m577j0963k2591j399J4694j8002L1241m8378
9106A08170m0967L2074M9976Q832M875l8497m8812o480M908M6214P4245J6695
9094B11233m6468N479M505m7080q048k455K5241J2374N423j6827j342J0189j0681
9081A41543n0694k9377K8016L7205j9780J4152J0096o2359L198K5690J6901l2438
9069H2153K1215O4071O1447j7411m0375m4978j7691k8560k4246M0370O628L3199
9057A35822K0248j5259j6622K225J05905L6609o1630n0146J9970k0217M4535r235
$$ plain form
9143 151266 167800 225143 213828 217407 204031 179733 164676 205296 255696 224979 139536 138285
9131 138285 211481 184298 170071 88635 123282 171976 151438 165867 132516 114837 64136 67384
9119 67384 106045 127241 150579 150751 168145 163568 152605 130014 128615 143309 125307 156548 108170
9106 108170 67203 99277 149253 158085 162960 124463 75651 69171 74079 120293 194538 211233
9094 211233 164765 170244 174749 127669 119621 117166 142407 154781 160204 143377 142035 152224 141543
9081 141543 90849 61472 89488 126693 106913 121065 131161 68802 72000 97690 114591 82153
9069 82153 103368 167439 228886 211475 171100 126122 108431 79871 55625 95995 102623 135822
9057 135822 156070 140811 124189 126414 232319 268928 207298 157152 177122 156905 201440 192205
9045A92205l8799k3840j2585k3992j3174Q8874N600m9702j7257r372l220l8753
9033E5985J7526J4181P670K4851M4525J0711m8635j3289r458J6071l7436p173
9021G5529L1549J0837K5649m5083J9970k328M0431N1715j3932m252l809J5228
9009B01504N769j3631J802j7388n6250K443L7935n379m9995J0136L0997k1467
8997A26476J3031l253O1293N9595k5282L2344K1452M709o2757j00952p3971m715
8985D7970J7970N8959M5300L3839j7123m031J0958m7342m5507K0290q421q265
8973A04597o9746j4965M224L821O5876N9321L6508k0794j0701K178O621l4618
8961A32322k958J2207j4096l7223J9979M6124O4806k8247p7609M3789K9246o4841
$$ plain form
9045 192205 153406 129566 116981 92989 79815 168689 174289 124587 107330 97958 94738 55985
9033 55985 73511 87692 95362 120213 164738 175449 126814 113525 104067 120138 82702 75529
9021 75529 107078 117915 143564 98481 118451 116123 156554 208269 194337 190085 186276 201504
9009 201504 207273 193642 195444 178056 121806 124249 162184 156805 106810 116946 147943 126476
8997 126476 139507 136254 197547 257142 231860 264204 285656 290365 227608 126656 52685 47970
8985 47970 65940 124899 170199 204038 186915 182884 193842 146500 100993 121283 112862 104597
8973 104597 34851 19886 24110 27931 93807 153128 189636 168842 158141 160319 166940 132322
8961 132322 129364 141571 127475 90252 110231 156355 221161 192914 115305 159094 188340 123499
8949A23499J1236L1115J0205N979Q949m8763l3743N2706J06704l6279o4393J6886
8937A84101q864l6977m0194k577n0239K4259L5589O8758J9602p9140K170J2254
8925A28742P1721n392n4406k1776M2105P3517k5062p7250o2363L5919K9712K8508
8913A63975j315J9543m865J7423J5810N8941j4957l0031l3844l5726L5165L7043
8901B27162j8262l1810R0174O804k3894l1572j9054j2873o09k4058J8310O2117
8889B42435N498O450K2512k9397m7691n7170P6543l5210r418M5569k8604M0809
8877B32326M5551m7403j2122l5029L9487K9954k6167o0608M5662k7257M972M6087
8865B35453l5967l6172k5757L6788k0298o1030L57Q7029M9343j5281m4442K9045
$$ plain form
8949 123499 134735 165850 176055 182034 190983 142220 108477 161183 267887 231608 167215 184101
8937 184101 175237 138260 98066 95489 45250 69509 105098 173856 193458 114318 116488 128742
8925 128742 200463 195071 140665 118889 160994 234511 209449 132199 69836 105755 135467 163975
8913 163975 162660 182203 177338 194761 210571 269512 254555 224524 190680 154954 190119 227162
8901 227162 208900 177090 267264 274068 250174 218602 199548 186675 186066 162008 180318 242435
8889 242435 247933 254383 276895 247498 199807 142637 219180 183970 174552 220121 191517 232326
8877 232326 277877 230474 218352 183323 222810 252764 226597 165989 211651 184394 189366 235453
8865 235453 199486 163314 137557 174345 154047 93017 93374 180403 229746 214465 170023 199068
8853A99068Q5073j7551l1247M256K0439M6480K1179r990r2400n6650O421Q0540
8841B55618J495p6955j11145K4456N6292M7634l4596j7173k7901j568P393P7323
8829B00873K0416n1710n0026m8553P3076L5726M5930Q410j14315q574m4481J4270
8817H1042N4670j9581k2995O145K2287L7300J4787j9040P35K6646k3773k7221
8805A31002m982J4662K2804m5510J0619l259K4197k8266j0649j2757j1812k4513
8793F1536K5257l5074O8008N2383J1645n9366l518K0507L9121L8897o819j1317
8781B01260l3644J5425N5333j1469n7628K9590o586k20L2404R0925L6328k4961
8769C26757j7968J52o831j0243J309k6899k155j9740n6042k4934P1645O9692q207
$$ plain form
8853 199068 284141 266590 235343 239599 260038 306518 327697 317707 225307 168657 175078 255618
8841 255618 257113 180158 69013 93469 149761 197395 162799 145626 117725 116157 123550 200873
8829 200873 221289 169579 119553 71000 144076 179802 225732 234142 119827 111253 66772 81042
8817 81042 135712 116131 93136 99281 121568 158868 173655 154615 155350 181996 158223 131002
8805 131002 126020 140682 163486 117976 128595 125336 149533 121267 110618 97861 86049 61536
8793 61536 86793 51719 119727 172110 183755 124389 120871 141378 180499 219396 212577 201260
8781 201260 167616 183041 238374 226905 169277 198867 192281 192061 224465 315390 351718 326757
8769 326757 308789 308941 302110 291867 293176 266277 264122 244382 188340 163406 235051 304743 296536
8756B96536J531m052j8350N4989l0512k6310J4645m2425j7380J6199K2867M1717
8744C09455K3342J8455J284n7268n9050k4822M6557O2416Q3817L0535m4343k6142
8732C64236m99L8220J2125M2672J6891k1872r417r406q532l515M0176j086M2524
8719E02517l8497J2766l3395l180r095n533k1510J8384k043o4609l3093m1949
8707B80763P389K7702L2623j0530r284l5159k4849J1021K9197M704j0285K3406
8695C26698j7479k612k5246L9731r914q760P20M4462M6266m0388m1413M2610J4564
8682C69239m864m4934n0521K4566Q7590J52l5478N778N5931L4472M470l5063K724
8669D14062m1329m7612k0820p331J9517P4070R3183N1984o7278o8216j326M0668
$$ plain form
8756 296536 298067 294015 275665 330654 300142 273832 288477 246052 228672 244871 267738 309455
8744 309455 332797 351252 352536 295268 236218 211396 257953 320369 404186 434721 390378 364236
8732 364236 363737 401957 414082 456754 473645 451773 442356 432950 424418 420903 461079 459993 502517
8719 502517 464020 476786 443391 440211 431116 425583 404073 422457 420414 355805 322712 280763
8707 280763 288152 315854 348477 337947 328663 293504 268655 279676 308873 313577 303292 326698
8695 326698 309219 306607 281361 321092 311178 302418 303138 347600 393866 353478 312065 354675 369239
8682 369239 364375 319441 268920 293486 381076 381228 345750 351528 407459 441931 446401 411338 414062
8669 414062 372733 325121 304301 296970 316487 390557 483740 535724 468446 400230 398904 439572
8657D39572L7935l604j9153L6604l5918m2933J4995l907n2097N3619N2359r824
8645D67648l756j4085J5291J5719q825o2649k760J6820M4107M8957J0289k8682
8633D98074K8312L6127J0690J8329n6207r2776Q325R1313N4524K9096M9792m1897
8621F33702n0756K3740m721J9403M8334J00395P5710P7761O2906P938L5374m0313
8609I89473p576R8272K6361M5377J36906L6472M5463L8144K5347M2726K9627J24548
8597A631140J15638J7319q882k9543k5446o0522r6033o1622j7438j8345L7408
8586A483674J66882J85056Q7288m9656j61985k01450j38607j9127r7133m6869
8576A208073p1877q3038K759p0039l4621L2259r815l4922K0532j0564q7061L8642
$$ plain form
8657 439572 477507 473903 454750 491354 455436 412503 427498 423591 371494 425113 477472 467648
8645 467648 463892 449807 465098 480817 471992 409343 406583 423403 467510 516467 526756 498074
8633 498074 526386 562513 573203 591532 535325 442549 450874 542187 596711 625807 675599 633702
8621 633702 582946 606686 601965 621368 669702 770097 845807 923568 986474 994412 1029786 989473
8609 989473 981897 1080169 1106530 1151907 1288813 1325285 1370748 1408892 1434239 1476965 1506592 1631140
8597 1631140 1746778 1764097 1755215 1725672 1700226 1639704 1543671 1482049 1464611 1446266 1483674
8586 1483674 1650556 1835612 1922900 1873244 1711259 1509809 1371202 1352075 1254942 1208073
8576 1208073 1136196 1053158 1055917 985878 951257 983516 973701 938779 959311 948747 861686 900328
8564I00328L6597l0150j00109m7537k0063j956J6822k1308l966K1524Q565J017
8552G59764R864j5086o153K5546J8450N5484J11637J47641J90653P9655l9844
8541A337611r5739j82127j58064j14806j38490p778m0193m5729K7268Q895J0536
8530F01384o962L2471L0763l4662o8815p5740o5042l8490L401J5116J2679R618
8518D15721K2604l6301K5746p883j1643M9582o815j2901k5108k5150k4886K0476
8506C83442k0917n080K1038k973l9145n4381o6427j6899k0768K9867M6712Q890
8494B63359L0557O032j7931J0245m3602J9142N5595j3014m0430n2526n3651J6716
8482A80492J2291j8228J9173j4653M7810J9996r866N0533n0063J6257L1249k1317
$$ plain form
8564 900328 936925 906775 806666 759129 739066 737110 753932 732624 728658 750182 758747 759764
8552 759764 769628 754542 748389 773935 792385 847869 959506 1107147 1297800 1377455 1337611
8541 1337611 1241872 1059745 901681 786875 648385 640607 600414 554685 581953 590848 601384
8530 601384 594422 626893 657656 622994 554179 478439 413397 374907 378308 393424 406103 415721
8518 415721 438325 402024 427770 419887 408244 457826 451011 438110 413002 387852 362966 383442
8506 383442 362525 357445 378483 375510 336365 281984 215557 198658 177890 207757 254469 263359
8494 263359 293916 299948 282017 292262 248660 267802 323397 310383 269953 217427 163776 180492
8482 180492 192783 174555 193728 179075 226885 246881 237015 287548 237485 253742 284991 263674
8470B63674o0398m8621j1255J4087J8037l2070K7403M2849k6886m46m1698j3711
8458A30965p543l1542L3590N1720L6160l460J5912m323k241N2724j5791J908k4702
8445B33377K2006L077L8240P5577m3776n2981l1855n2827k0751O756L9064j3271
8433B02636p420J0148J257N815K7525N205J156Q608l521M3627l4258J1630j1500
8420B60908m1789o1605J9765J8549K7694l5499m2716K6477R597q914K268J3010
8408A87745n6573k5292M477J4654M9237O4876r017l9458K408j9593k5753j3092
8396A34619M9164p666K5810n220P2811k575r0556L56l2666o9697O7948J08806
8384B51134Q9941m251o1233k2551k6955k6274R947J2424J0480l5976n9135J096
$$ plain form
8470 263674 203276 154655 143400 157487 175524 143454 170857 213706 186820 186374 144676 130965
8458 130965 123422 91880 125470 177190 213350 209890 225802 221479 219238 271962 256171 258079 233377
8445 233377 255383 258460 296700 372277 328501 275520 243665 190838 170087 176843 215907 202636
8433 202636 195216 205364 206621 212436 239961 245166 246322 254930 251409 295036 260778 272408 260908
8420 260908 219119 157514 177279 195828 223522 188023 145307 171784 181381 172467 174735 187745
8408 187745 131172 105880 110357 125011 174248 239124 230107 190649 193057 173464 147711 134619
8396 134619 183783 176117 201927 196707 269518 266943 176387 176743 144077 74380 142328 251134
8384 251134 341075 336824 275591 253040 226085 199811 209758 222182 232662 196686 137551 138647
8372A38647J1284j9991n7589K1859k518J2061K7161J7089O7j9993N1226J5290
8360A94593k0193k6047l0548M2763K7411J2544l8532M1648J9311m598k0289l3922
8348A64141L3827Q1194j9315p8724m8518o8113l0288K2903J9767p04l6448q792
8336C0930L3854J138M3369M4753J5170J2827K4157k7339j01604l4586P428m552
8324D5545N12L2890J9328K6356K403k0869J2559K2180N2241k9554q3339N169k1607
8311F3814n0876j271K7773N3234P2921j5586m9595m3342N8742L8931p6771j7269
8299F0705l5020j3220K6391j0307M6351Q8844j4230p4573m2652N7291N4138O417
8287A50135r771j7881o119n791L909N825m3501j7320J4055K2338k3888j259M381
$$ plain form
8372 138647 149931 129940 72351 94210 91692 103753 130914 148003 148070 128077 179303 194593
8360 194593 174400 148353 117805 160568 187979 200523 161991 203639 222950 218352 198063 164141
8348 164141 197968 279162 259847 181123 132605 64492 34204 57107 76874 76170 39722 30930
8336 30930 64784 65922 109291 154044 169214 182041 206198 178859 77255 42669 50097 45545
8324 45545 46057 78947 98275 124631 127034 106165 118724 140904 193145 163591 80252 85421 63814
8311 63814 12938 11667 39440 92674 165595 150009 100414 57072 115814 154745 77974 60705
8299 60705 25685 12465 38856 28549 74900 163744 149514 74941 32289 89580 143718 150135
8287 150135 140364 122483 116364 110573 114482 120307 76806 59486 73541 95879 71991 70732 75113
8274G5113K9720L7593o719j08482m5692n53R3121J3256l2090j5348M435L4274
8262G8628J2393L5080m8682l0458K7191O772J484j3009J456k9242J1797N8565
8250A11975R27O6400K7301J2712q771o129l6703o5731k6312j3214J1027j6216
8238E7266K3070O0973R630n669l2887J0601r728k8205P758l7500m4228k6492P0506
8225E5095J5733K2052l7253K2703O9387J9339n330K4482J1008J5828j1629k0479
8213A80936j2503m6927p3981j0707L2142O0403J2771O441J8811K8183k0955k8512
8201A46102l6046o759L2822R414o7365l9047M0338N2519P0038j8232m4815q372
8189A30597l7110R426k932K94J0641l5005j9091M820O101O8559k1135j5685M1030
$$ plain form
8274 75113 104833 142426 135707 27225 -18467 -19020 74101 87357 55267 39919 44354 78628
8262 78628 91021 126101 77419 46961 74152 80924 82408 69399 70855 41613 53410 111975
8250 111975 112902 179302 206603 219315 210544 204415 167712 101981 75669 62455 73482 57266
8238 57266 80336 141309 150939 145270 112383 122984 113256 85051 92809 55309 11081 -15411 55095
8225 55095 70828 92880 55627 78330 147717 167056 161726 186208 197216 213044 201415 180936
8213 180936 168433 121506 47525 36818 68960 129363 142134 148575 167386 195569 174614 146102
8201 146102 110056 103297 136119 145533 78168 39121 79459 131978 202016 183784 138969 130597
8189 130597 93487 102913 99981 100275 110916 75911 56820 61640 67741 136300 115165 99480 140510
8176A40510K0403q2171l6744M2115K154O4727L0338l3815r325M5803L6371p1348
8164A49018j9701l7992L797K993n3205q72L8145j4428l581k8419O4044N6620K5100
8151A81519L0015k8995j7005K8051M3106q9488m8200M8387K9540Q389k0946k0514
8139A43859j3663p223M4516M6716l0659j20305J3375J9363j1763q368k3343K0644
8127G3149K3934K4914j2512M929k6952j1739J8328J3938M306K5791L0728P975
8115A76789n472k5661l5525M2980k0392j690M2128l0374o1588K6186O2147p718
8103A61810j01937J3224M1114j521K71m1261m2570O3283Q4412m302p9775p2407
8091B0341j9194N3694M0692K6380L9842j425R076j9771n273K8388j9713M063j1445
$$ plain form
8176 140510 160913 78742 41998 84113 86267 150994 181332 147517 138192 183995 220366 149018
8164 149018 129317 91325 95122 98115 44910 44038 82183 67755 64174 35755 99799 156419 181519
8151 181519 211534 182539 165534 193585 236691 147203 99003 147390 176930 185319 164373 143859
8139 143859 130196 122973 167489 214205 183546 63241 76616 95979 84216 75848 52505 73149
8127 73149 97083 121997 109485 114414 87462 75723 94051 107989 112295 138086 168814 176789
8115 176789 171317 145656 110131 153111 132719 131029 173157 142783 81195 107381 169528 161810
8103 161810 59873 73097 114211 112690 112961 71700 29130 92413 176825 172523 92748 20341
8091 20341 1147 54841 95533 121913 161755 160330 169406 149635 144362 172750 153037 157100 145655
8078A45655l1457j3955K1940L8359K0673J8878j0562J5223M258K0506n962K5251
8066B48807k9914K9730k8567l1256J0959n065L3854M1785J6241k8024l3618l9680
8054A85252m701j3486j2102k3713K0672J7414l8681R5188L0454L614O535m735
8042B61711j693n8611p1640L5404L3540L324K941j1005l375L375Q2015O7248M933
8029C48167K6348L9017k6382j2694m1767k388K2281O3697K538m6911M4526R8223
8017E14655r988o5655q386K7059K1204k7933m0858J0546M4693J8481M6735J0951
8005E41504l1020K3096j8272m8784m1010K376k7951l0265M1063P3601L6747M114
7993E25199k4456j895J0823L2630K022l2412q6656o6269L3972O2389L6547k7419
$$ plain form
8078 145655 114198 100243 122183 160542 181215 200093 189531 204754 209012 229518 223556 248807
8066 248807 218893 248623 220056 188800 199759 194694 228548 270333 286574 258550 224932 185252
8054 185252 180551 167065 154963 131250 151922 169336 130655 225843 256297 259911 266446 261711
8042 261711 260018 201407 129767 165171 198711 202035 204976 193971 190596 193971 275986 343234 348167
8029 348167 374515 413532 387150 374456 332689 330301 352582 416279 418817 371906 416432 514655
8017 514655 504667 439012 430626 457685 478889 450956 410098 420644 465337 483818 530553 541504
8005 541504 510484 533580 515308 466524 425514 427890 399939 369674 410737 484338 521085 525199
7993 525199 500743 498848 509671 542301 544323 511911 425255 358986 392958 455347 491894 464475
7981D64475O895K6194R312J788N6212j8441l5471l8367J6287n190M5127M3546
7969E72367J969j7614K9250J1197m7205M3102N0781L0319K4728j0151n3575n1616
7957E83552K8847k0349M908l6928k1725M6519K2948k5191R292m0465l3163m6936
7945D71309l592k7053J8472J8671m7540l4203n0466R411J0570R567K375J33068
7933E10589M0280n6206n1197r203J2903J291K2347N3324K0304M672j2658r4688
7921D41758m2569L842o141K4226j8971l5634k2154K2628q963N1574J0592l1316
7909C88872R594n9304k8411j1203N948N317J4310k1656K8712j4259n003j6660
7897B96257k2657j7250l3597L3229M2407O4251q2873l5090K7055N9715l52m1910
$$ plain form
7981 464475 471370 497564 506876 508664 564876 546435 510964 472597 488884 483694 528821 572367
7969 572367 574336 556722 585972 597169 549964 593066 643847 674166 698894 688743 635168 583552
7957 583552 612399 592050 596958 560030 538305 584824 607772 582581 591873 551408 518245 471309
7945 471309 467717 440664 459136 477807 430267 396064 345598 355009 365579 375146 377521 510589
7933 510589 550869 494663 443466 434263 447166 448457 470804 524128 544432 549104 536446 441758
7921 441758 399189 403031 396890 421116 402145 366511 344357 366985 358022 409596 420188 388872
7909 388872 398466 339162 310751 299548 305496 310813 325123 303467 332179 317920 312917 296257
7897 296257 273600 256350 222753 255982 298389 362640 279767 244677 271732 331447 331095 289185
7885B89185o828k759j910l2367J7090m7362o4000N7077j4653L2308L8413O5832
7873C30026l9000k5266j6333J5738L3475m2704m199k3504m4879q4878j0281j3100
7861G5095K1479n579P2639N3053k551r0241m7058L7302N3085N2897k993m4380
7849A72748o797Q550m8646L3741J9234p5316l2542l2906J2454N1360L4001N6897
7837A92778J7998k9486K7906j3408p1766J0369K8926m962k0654j049M9605M1847
7825B28104n9958P324K1753o9272l2947l1186J3524J9865j2975p2782P4177P1592
7813A57219K9619m2792l6191n080l9804m2384J5264O5581K8691J431J9366m316
7801A46604O258J1255p60J81k5126k8369R161N3790J7582m4007m573m5930p508
$$ plain form
7885 289185 282357 279598 277688 245321 262411 215049 151049 208126 193473 225781 264194 330026
7873 330026 291026 265760 249427 265165 298640 255936 251737 228233 183354 98476 88195 75095
7861 75095 96574 90995 163634 216687 214136 123895 76837 114139 167224 220121 217128 172748
7849 172748 165951 174501 125855 159596 178830 103514 70972 38066 50520 101880 135881 192778
7837 192778 210776 181290 209196 195788 124022 134391 163317 158355 137701 136652 186257 228104
7825 228104 168146 175470 197223 127951 95004 63818 77342 97207 84232 11450 85627 157219
7813 157219 186838 144046 107855 102775 62971 20587 35851 101432 130123 131554 150920 146604
7801 146604 152862 164117 163357 163538 138412 110043 119204 172994 190576 146569 141996 96066 88558
7788H8558M4802N470N5846j9767k8895nr9696K9206l1694k1639O8360M1946p323
7775A25169l4770P4655m6757o7733N6482L2516m0766o1425m5259K6248J01767
7764A20127M0741o2626j6255n702j2639J8761L9554N836J3439q860r5861m707
7752C1808K2725j4398l8301j762L4388J898j6551K5361J6649N3324K5870l6451
7740A04560J1773Q582m5460k3639O786k6605l2793L466M1547j6336k5927j5152
7728i198J576j9172R084L7290j8684l624O3999L6761l3583p4082l5999r029R518
7715d5143k3270M90P4697M1858l8406j1339k002l1645j3419m5113L3135O9739
7703I582N9972M5209n386k0725j6613l2365j709K7728l1183n2905J7064o2286
$$ plain form
7788 88558 133360 138830 194676 174909 146014 146009 46313 75519 43825 22186 90546 132492 125169
7775 125169 90399 165054 118297 50564 107046 139562 98796 37371 -7888 18360 120127
7764 120127 160868 98242 81987 76285 63646 82407 121961 127797 141236 132376 36515 31808
7752 31808 54533 40135 1834 72 34460 36358 19807 45168 61817 115141 141011 104560
7740 104560 116333 124915 79455 55816 62602 35997 3204 6670 48217 31881 5954 -9198
7728 -9198 -7622 -26794 -17710 19580 896 -2728 61271 98032 64449 -9633 -45632 -54661 -45143
7715 -45143 -68413 -67923 6774 48632 10226 -1113 -3115 -34760 -48179 -93292 -60157 9582
7703 9582 69554 114763 109377 88652 72039 39674 37965 65693 34510 -18395 -1331 -63617
7691f3617j235L6311P6024K4560p1018n2674j3209K6747M6237N5436r415l1729
7679B2418J7252J7048o170n1836n3012K8279k554j5979M6454N2057P311m887Q352
7666F4733k505n1232k3788O6210L2024k8158l7019M5125K1767o699N196j0693
7654G4961l8241M3923j1548m3097j0018q951o193N6249q06l4088o860o9847o50
7641e5166K448N311J6855M4503K1535N1376K1091l2174p8928m1426M8907K1090
7629B5422L0819o9752R796k895j739M0224N8252l1496q3583k6475L0833P2497
7617E1903q160K8637l9884o8027M2451L5337K0149K579O883M0309k7101j2392
7605G2684m0232m4872J2163k1288M906N209k2057j1792n8760l4771J113N1354
$$ plain form
7691 -63617 -64852 -28541 47483 72043 1025 -51649 -64858 -38111 8126 63562 54147 22418
7679 22418 39670 56718 50548 -1288 -54300 -26021 -28575 -44554 1900 53957 61268 56381 64733
7666 64733 62228 10996 -12792 53418 85442 57284 20265 65390 87157 80458 85654 74961
7654 74961 36720 80643 69095 25998 15980 7029 836 57085 56279 22191 15331 -54516 -55166
7641 -55166 -52718 -47407 -30552 13951 35486 86862 107953 75779 -3149 -44575 4332 25422
7629 25422 56241 -13511 -3715 -6610 -8349 31875 90127 58631 -24952 -51427 -20594 51903
7617 51903 43743 72380 32496 -35531 6920 42257 62406 64985 71868 112177 85076 72684
7605 72684 32452 -12420 -257 -21545 -16639 -11430 -33487 -45279 -104039 -138810 -137697 -86343
7593h6343M1909L8777l3661k7143o756J8636L6934k5454L0163K8809M4166k6914
7581C3123m2512P2755K8559m4577m5026j3578R046O742k1065j8024J6322K3870
7569E635O111m0423j7538J8324K73J2886O28l0770j839M2667q392k562o4856R411
7555g0445N4114J4178j0035j9827m0833P201O9863K9139m6249J4734L5095n727
7543C1208l0405K9192m5607M3538j8934J1513l8628Q288P9861K1466q6817l9057
7531c4382L8797K2756M3814k3756m1243k7300m0085K060r407L3703J9970n1561
7519f6634k0426N0563L1071M4669j8313o8168l898O0825l1102l2222K9255o5699
7507i0079P463N7906N4035l1915m9779o9741M954N1828j5062j6145K8724r365
$$ plain form
7593 -86343 -44434 -5657 -39318 -66461 -73217 -54581 -17647 -43101 -12938 15871 60037 33123
7581 33123 -9389 63366 91925 47348 2322 -11256 -2210 4532 -16533 -34557 -18235 5635
7569 5635 11746 -28677 -46215 -27891 -27618 -14732 -14104 -44874 -46713 -4046 -12438 -15000 -79856 -70445
7555 -70445 -16331 -2153 -12188 -32015 -72848 -65647 4216 33355 -12894 1840 36935 31208
7543 31208 803 29995 -15612 27926 8992 20505 -18123 -9835 70026 91492 4675 -34382
7531 -34382 4415 27171 70985 47229 5986 -21314 -61399 -59339 -68746 -35043 -15073 -66634
7519 -66634 -87060 -36497 -5426 39243 20930 -47238 -51136 9689 -21413 -53635 -24380 -90079
7507 -90079 -82616 -24710 29325 -2590 -52369 -122110 -117156 -65328 -80390 -96535 -67811 -77176
7495g7176m579R1976L1339l334n96J5681j4934L4691k1829j01030n9433N6152
7483e3072Q1647O7155j9743n5831p8139O680L39P1393K7924P550l7529j217J5522
7470C2679J9663J2709r178m8582q1977K6032M3334k2077k8757Q244L7950K3265
7458A3305k2004M4116K453r010m5952n2901m5912J7613K0855M3056J4672k6430
7446d6139m174K7974K7951L079k7426N2908N5516J300n421m9345k0863j6725K8729
7433B7364Q6656j1263J9888m5172j9783o3714o0614o230P446J6347k3796k8105
7421a00976K1621M3452K7316l5983L8295m66j5610j7731J4830J2260L1324k8890
7409a0558L1527N5047l7996n4256L5670K9955j081j6150o501m679L93k5999J7505
$$ plain form
7495 -77176 -81755 10221 41560 38226 37630 53311 38377 73068 51239 -49791 -109224 -53072
7483 -53072 28575 95730 75987 20156 -57983 -51303 -50964 20429 48353 55903 18374 17157 32679
7470 32679 52342 65051 55873 7291 -74686 -48654 -5320 -27397 -56154 -47910 -9960 13305
7458 13305 -8699 35417 37870 28860 -17092 -69993 -115905 -98292 -77437 -34381 -19709 -46139
7446 -46139 -50313 -22339 5612 8691 -18735 34173 89689 90989 85568 36223 15360 -1365 27364
7433 27364 114020 102757 122645 77473 57690 -6024 -66638 -72868 -65422 -49075 -72871 -100976
7421 -100976 -79355 -35903 -8587 -44570 -6275 -6741 -22351 -40082 -25252 -12992 18332 -10558
7409 -10558 20969 76016 38020 -16236 19434 49389 48308 32158 25657 20978 21371 -4628 12877
7396A2877n341J1816k6006K1141j8948J0687k3400k0891P843J9120K6206r005
7384F099l6917m8032m5499P5904O9617J5197J3620k4907J374l5284m5289j1774
7372f5891j6670l173M4327L9664J0062J2308J4986j1680p7038M9004p167j09906
7360a21174K1714J7784J2669J851M6241M8237O7589p0m9793m4481k8776k6645
7348e4854R828M3930N1659M6319l3138k993K6196L1309n5494q205J9457p8500
7336d486n2365N8779L2014J5650j4882m0124m5871N835j1651P8958L0569l5808
7324A6618m036J947K5427k061l7986J712O161J2454n0792o2397J09R265K8222
7311e5357k90L0877L3115j4263q574m3417M0252Q7743q457p0649k0297O3343K9865
$$ plain form
7396 12877 7536 19352 -6654 14487 -4461 6226 -17174 -38065 -30222 -11102 15104 6099
7384 6099 -30818 -78850 -124349 -48445 21172 36369 49989 25082 26456 -8828 -54117 -65891
7372 -65891 -82561 -85734 -41407 -1743 8319 20627 35613 23933 -53105 -4101 -11268 -121174
7360 -121174 -99460 -81676 -69007 -67156 -20915 27322 94911 94841 45048 567 -28209 -54854
7348 -54854 -45026 -1096 50563 96882 63744 60751 86947 118256 62762 54557 74014 -4486
7336 -4486 -56851 1928 33942 49592 34710 -5414 -51285 -45450 -57101 21857 52426 16618
7324 16618 12582 14529 39956 37895 -91 1621 7782 20236 -30556 -92953 -92844 -83579 -55357
7311 -55357 -55647 -24770 8345 -5918 -14492 -57909 -17657 70086 61629 -9020 -29317 34026 63891
7298F3891q304m9664j3433j2825Q870l1026k3728J8856K6436L0260R0156L4781
7286A34270L114M1210k7841o6167m5694l8745J2378m410N154n8q4275j3799j259
7273h6122N2677K3695M7871r516K61o341j0390L647n654K4526J2158P2714l6113
7260H3413o7116k5795n200k8618O2312N2596K8319P407j9172k0176p855K5608
7248H5723J0282n8709m080M6717l6051M247L7972O3870k3209j2908n4956Q815
7236F7713p519K5218n693o8189J0658O1192l6624M238l8313p3409L2251J0999
7224a7478L2114k6528J6766L6463n4689q2324j799K1164k2793l9285R3712N5934
7212A1257k5111J0663O0893L9765L711k1781j5468n1239l8994l3823k8294L9779
$$ plain form
7298 63891 55587 5923 -7510 -20335 -11465 -42491 -66219 -47363 -20927 9333 99489 134270
7286 134270 137384 178594 150753 84586 38892 147 12525 8115 13269 13211 -71064 -84863 -86122
7273 -86122 -33445 -9750 38121 28605 28866 22525 12135 15782 10128 34654 46812 119526 83413
7260 83413 16297 -9498 -14698 -43316 18996 71592 99911 107318 88146 67970 60115 85723
7248 85723 96005 37296 33216 79933 43882 48129 86101 149971 126762 113854 58898 67713
7236 67713 60194 85412 79719 11530 22188 83380 46756 50994 12681 -60728 -28477 -17478
7224 -17478 14636 -11892 4874 41337 -13352 -95676 -97475 -76311 -99104 -138389 -44677 11257
7212 11257 -13854 -3191 57702 97467 101178 79397 63929 12690 -26304 -60127 -88421 -48642
7200d8642L5601m3322K5071M7101o695j8378K3492M1544J1226l1810n8991L2795
7188H992M1500J4312q0252r295l4209J1031P2653N7830j1901n0834l9367j8156
7176c7696j5908n2614k4177L9963Q5279j4110k129k2282k7835K7749K4126L6132
7164A6498j6963l8620N4773L096J2546J6264L939o1033m4343j4017L587L2946
7152c1327L7984j5073o5360k3087l043K9268j6246L6003O4724j7650n7090P581
7140e3316J7526O1020M9418o7623q0884m4603O4058P4689R297Q574K4923j1625
7128E1454O3536J8526p9479k0172k6773j1787n0355l5161Q61K4356L2885l6373
7116f8482o0200k2973J0498K6780J4552M4413l809l330O3197M7091J6346p2108
$$ plain form
7200 -48642 -13041 -56363 -31292 15809 9114 -9264 14228 55772 66998 35188 -23803 8992
7188 8992 50492 64804 -15448 -24743 -58952 -47921 24732 82562 70661 19827 -19540 -37696
7176 -37696 -53604 -106218 -130395 -90432 -5153 -19263 -21392 -43674 -71509 -43760 -19634 16498
7164 16498 -465 -39085 15688 18784 31330 47594 51533 -9500 -53843 -67860 -64273 -31327
7152 -31327 6657 -8416 -73776 -96863 -99906 -70638 -86884 -50881 13843 -3807 -60897 -53316
7140 -53316 -35790 25230 74648 7025 -73859 -118462 -54404 20285 29582 38156 63079 51454
7128 51454 114990 133516 54037 33865 7092 -4695 -55050 -90211 -89350 -64994 -32109 -68482
7116 -68482 -128682 -151655 -141157 -114377 -99825 -55412 -59221 -62551 646 47737 64083 -8025
7104h025m6341M5919j2235Q375O6414K0029o4553j8928J0130L2998K3396k5614
7092C1565j2258m4981l8010j3909L0962K2739p176O155O147n4221M5641O4370
7080C7024m1938k5673K9222P927l6655m5351k0655N5942N6907P7880K9172l3996
7068H9806p1666p5197O38K8991J3483K6075K1250o7274K0376L7709m2955L1492
7056A2728k9467o627Q8044L8237k1522k5038m2267m099m33j7107K1902m4157K3019
7043f787J7417K4789N312j6583L896n1660K4380L6134p6385J8894K0310J7663
7031A7380l5411k6795q35J8124j953k7771j9657J5159R6027M4644L2840k1760
7019H9992q5106k9461p120j4191J4049l1880J2978M6590L9922n6744l4435n28
$$ plain form
7104 -8025 -54366 -8447 -20682 -12307 54107 74136 9583 -9345 785 33783 57179 31565
7092 31565 19307 -25674 -63684 -77593 -46631 -23892 -31068 -24913 -18766 -72987 -27346 37024
7080 37024 -4914 -30587 -1365 6562 -30093 -75444 -96099 -40157 16750 94630 123802 89806
7068 89806 18140 -57057 -56419 -27428 -13945 12130 33380 -33894 -13518 24191 -18764 12728
7056 12728 -16739 -23366 64678 102915 81393 56355 14088 9989 9556 -7551 14351 -29806 -6787
7043 -6787 10630 35419 40731 24148 28044 -23616 764 36898 -39487 -20593 -283 17380
7031 17380 -18031 -44826 -45661 -27537 -29490 -57261 -76918 -61759 34268 78912 111752 89992
7019 89992 4886 -24575 -31695 -45886 -31837 -63717 -50739 -4149 35773 -20971 -55406 -55934
7007e5934M1049M5177n2185l9208M8809M2475l4259r0908J0855L2836M7113k3754
6995b7934m1964J9636L1119L2676n960O6126J2032k8240l6929n997P146J277K5129
6982D8117j2961o850j6066l0182J941j3199j3969L1799M2349L2318j916l7211
6970B4170J7095K0078M4882l3015l2384L6373j1459L3119o2628l9863k175R110
6958C303l0398J5649L8133L1526n756r9616k3485L2549P2845M7002l1312n0438
6946BK3107Q903m1162K6082J7407j5792m1412N0329J6580n4884J3199j0072j781
6933i494k2617o800L6801j4300m2677o7304K806M5084L0028K5201m4161o0561
6921a27994P3025J7303o1571K8448o806j1840k2663q783J5302J01537o217O920
$$ plain form
7007 -55934 -14885 30292 -21893 -61101 -12292 30183 -4076 -94984 -84129 -51293 -4180 -27934
6995 -27934 -69898 -50262 -19143 13533 7573 73699 85731 57491 20562 14565 21711 22988 48117
6982 48117 35156 28306 12240 -17942 -16001 -29200 -43169 -11370 30979 63297 61381 24170
6970 24170 41265 61343 106225 73210 40826 77199 65740 98859 36231 -3632 -5807 3303
6958 3303 -27095 -11446 26687 58213 52457 -47159 -70644 -38095 34750 81752 50440 2
6946 2 23109 32012 -9150 16932 34339 18547 -22865 27464 44044 -10840 2359 -7713 -9494
6933 -9494 -32111 -38911 -2110 -16410 -59087 -126391 -123585 -78501 -48473 -23272 -67433 -127994
6921 -127994 -54969 -37666 -99237 -70789 -77595 -89435 -112098 -120881 -105579 -4042 -10259 -3339
6909c339L7517l8636K0715n215k2776l7480Q27Q0706p563j516m7330K022q578
6896c0646J0171j8271L0886K7561k6946K3563o197J6558L5081p4993o9198j2691
6884i5122N5975M194p3146p1773p269M4532P8559K3375O5515N8539m9784l9705
6872f110n3791q7672N6647M1737N0102L638r409Q565k1798j837L3046J5145k6309
6859A954K4766l5414m8659O016N2592M6432K0077j4393r011q891J8097k1408n9083
6846b6925M8J2988K2728o733l0749j0158M0867J6629J8483j9714K6664J8808j3182
6833D9754l9026q877N2620K1160m2627k7856L7042M39J4781j7416p1031n0564
6821h1601M7976L4897K9259J1319j4078K445L2595j1576L6018J4091m7186o4747
$$ plain form
6909 -3339 34178 -4458 16257 11042 -11734 -49214 -48387 32319 24756 23240 -24090 -22068 -30646
6896 -30646 -20475 -38746 -7860 19701 -7245 16318 10121 26679 61760 -13233 -82431 -95122
6884 -95122 -39147 -34953 -108099 -179872 -187141 -142609 -64050 -40675 24840 83379 33595 -6110
6872 -6110 -59901 -147573 -90926 -49189 913 4551 -4858 3707 -18091 -19928 13118 28263 1954
6859 1954 26720 -8694 -57353 -51337 1255 47687 67764 53371 44360 35469 53566 32158 -26925
6846 -26925 -26877 -13889 8839 2106 -28643 -38801 2066 18695 37178 17464 44128 62936 49754
6833 49754 10728 1851 54471 75631 33004 5148 42190 42629 57410 39994 -31037 -81601
6821 -81601 -33625 1272 30531 41850 27772 30217 62812 51236 87254 101345 54159 -10588
6809a0588l3355M9229L282k8914M0086J6803l9109M7816K8088n5260J321O7628
6797H7027K5488o3766o4480k3814k2120Q527J0406j5960l2400L4094N6650l9793
6785d0141m7686J9033k8187J9525L0462O5826K628q00P1301L5230n7705J4423
6773H3909j420k7478n3309l8903P600j2896K3719M5273N7721n9719K66P616n13
6760C1866M1791q654n5300R884l3221J8377m9740n2659K4507M286J1957L9984
6748a6922P5170l0582n6106L3460L3045o996j325r998L5649J02839N7433q134
6736B07533L0557k9241m8461j7458M8175O4663Q6291J69036J49665J15770J23191
6725H99721J00735n5496j63301j29248j43238n9278q5988j13392l5440j5657L0770
$$ plain form
6809 -10588 -43943 5286 8568 -20346 19740 36543 -2566 45250 73338 18078 19399 87027
6797 87027 112515 48749 -15731 -39545 -61665 -53138 -42732 -58692 -91092 -56998 -348 -40141
6785 -40141 -87827 -68794 -96981 -77456 -46994 18832 21460 20660 91961 127191 69486 83909
6773 83909 82489 55011 1702 -37201 -29601 -42497 -18778 26495 84216 24497 24763 32379 31866
6760 31866 73657 65003 9703 19587 -13634 4743 -44997 -97656 -73149 -68863 -56906 -16922
6748 -16922 58248 27666 -28440 5020 38065 31069 29744 19746 55395 158234 215667 207533
6736 207533 238090 208849 160388 142930 191105 255768 342059 511095 660760 776530 899721
6725 899721 1000456 944960 781659 652411 509173 449895 363907 250515 215075 199418 230188
6714B30188M0366O178l5427m4669J4925j6136n5693q816j5157m3146j9936M2365
6702I5042M732q3654k9789P7132O8190l814l3543J6386m3934J002P1307K2310
6690A61367l4176m999L890n806n046k2062j1966M441R708L8956p4758q6656L6539
6677I432M0716O1513n282K0723l6975n3539K238l7776J1998P7932J7462p0805
6665C7637n5306N292M514L9352K0694l9976K6407J8478n1589K7898k9365k0011
6653a5975K8537K7670N3345K9143m913k6311j1964k677j4987p210m3490k1656
6641a0488j2643n6744J117J1205k9432M2470P7132p1062J3390M0373k0053K4493
6629I758j4968j100l2093K4245J7387l2376Q829o7714n555O888L9069N9683K0947
$$ plain form
6714 230188 270554 276732 241305 196636 211561 195425 139732 130916 115759 72613 52677 95042
6702 95042 99774 16120 -13669 63463 131653 127839 94296 110682 66748 67750 139057 161367
6690 161367 127191 122192 126082 120276 115230 93168 81202 85643 95351 134307 59549 -27107 9432
6677 9432 50148 111661 106379 127102 90127 36588 38826 1050 13048 90980 108442 37637
6665 37637 -17669 -12377 -7863 31489 52183 12207 38614 57092 5503 33401 4036 -15975
6653 -15975 12562 40232 93577 122720 117807 91496 79532 76855 61868 54658 11168 -10488
6641 -10488 -23131 -79875 -78758 -67553 -96985 -54515 22617 -48445 -35055 5318 -14735 9758
6629 9758 -5210 -6310 -38403 -14158 3229 -29147 -20318 -88032 -93587 -86699 -47630 12053 33000
6616C3000k9846k5056O086P3916L5266j6772n1807J3739j7697l7409K7277L2062
6604D2759J8355j5476q189j6853m2748K1082k0278j6687L2974J8938O409r947
6592A0339l4851J8936L1394r942J3301k453o2097L9365J0255j8731K5019n339
6580A5196k8784J4674K6938K8597q336k2082l9046l3660Q964n252j1369k1705
6568g5865J3142K0516k9112J9160M9875j650j370N7289n786r0218j0128P6909
6556B2762o278J0668M0705Q817m881m1205j7840j9863l9307K0368N7198J4743
6544D5887j8255K210M476j526m8758k8474J2992M6624j704l9187n439O9103R67
6531C8916n2611L7188K513l043J8563J1911q8904m2578M576M5284J5050Q169L842
$$ plain form
6616 33000 3154 -21902 -15816 58100 93366 76594 24787 38526 20829 -16580 10697 42759
6604 42759 61114 45638 37449 20596 -22152 -1070 -21348 -38035 -5061 13877 20286 10339
6592 10339 -24512 -5576 25818 15876 29177 26724 -35373 3992 14247 -4484 20535 15196
6580 15196 -13588 1086 28024 56621 48285 26203 -12843 -46503 -37539 -42791 -54160 -75865
6568 -75865 -62723 -42207 -71319 -52159 -2284 -3934 -5304 51985 46199 -44019 -54147 22762
6556 22762 16484 27152 67857 76674 71793 30588 12748 -7115 -46422 -26054 31144 45887
6544 45887 27632 29842 34318 32792 -15966 -44440 -31448 15176 13472 -25715 -31154 37949 38916
6531 38916 -13695 23493 26006 22963 41526 53437 -35467 -78045 -73469 -28185 -13135 -4966 -1124
6518a124P973k2916l021k115l6143L6143P7935o684j6113l454j9924k952L1102
6505C8707j4967M1215Q179l4296q223m3452m9546j1696k317J1623L2514K4298
6493g961K5876j8703L0620l6497r7312l4657J6119J2206J9882j1098L1230j3166
6481h3461J2849L7479j2627L0251J9343K2238k402N644k8759j8258K6782Q987
6469A8066l8144l760j5633m9227J166M0309N4375N2041m4863j9591L2095j3876
6457A2958l4559j6463m917M7757L4602o6488k5795M6844L2187N112L1598l0399
6445C2437j0473L1120o0413m3154k0002M1908J0208K3M7799J9038p4060l3268
6433e8837Q751K9295O012l9134j3034O701j3917l2828M4218o169K5997J2580M513
$$ plain form
6518 -1124 6849 -16067 -19088 -21203 -57346 -21203 56732 50048 33935 30481 10557 7605 38707
6505 38707 23740 64955 73134 38838 30615 -12837 -62383 -74079 -76396 -64773 -32259 -7961
6493 -7961 17915 -788 29832 -6665 -103977 -138634 -122515 -110309 -90427 -101525 -70295 -83461
6481 -83461 -70612 -33133 -45760 -15509 3834 26072 23670 29314 555 -17703 9079 18066
6469 18066 -20078 -23838 -39471 -88698 -87532 -47223 7152 59193 14330 -5261 26834 12958
6457 12958 -21601 -38064 -42981 4776 39378 -27110 -52905 -6061 26126 31238 62836 32437
6445 32437 21964 53084 -7329 -50483 -70485 -28577 -18369 -18346 29453 48491 -25569 -58837
6433 -58837 -50086 -20791 -14779 -53913 -66947 -60246 -74163 -106991 -62773 -68942 -42945 -30365 -25852
6420b5852N8862k1474k3202j5389k5386q969L6422O7997J6496K269m8291R389
6408B2872k2832m3393n8975j2969j1251M7671J3930M0353O4313K8630J1806o4153
6396A6002K7182J0812j6034K4353K2436J9455l226k3442j8489k1159J0674K0100
6384F8664k7114p9220p061o283N448m8936n879P1478M9738n262J6298L0513j117
6371F1267m7463L4738l4259K001L9973l5794K634k261m3242m0455l9516j7116
6359a19493P9659n170o3590K5242N0717K3996Q285j8808P553J2010M144q49j6816
6346a3120K6633K7113N1414l6068m4406n4507o8381j2156M0606L5080M3295j5379
6334a9876Q954k0737M8625M0511k1447o8361k1503J5312M9967N8786J9528o6094
$$ plain form
6420 -25852 33010 11536 -11666 -27055 -52441 -61410 -24988 43009 59505 61774 13483 22872
6408 22872 40 -43353 -102328 -115297 -126548 -78877 -64947 -24594 39719 68349 80155 16002
6396 16002 43184 53996 37962 62315 84751 104206 100980 77538 59049 37890 48564 68664
6384 68664 41550 -37670 -44731 -51014 -45566 -94502 -100381 -28903 20835 15573 31871 62384 61267
6371 61267 13804 48542 14283 16284 56257 20463 23097 20836 -22406 -62861 -102377 -119493
6359 -119493 -39834 -45004 -108594 -83352 -32635 -8639 -354 -19162 -11609 401 4545 3696 -13120
6346 -13120 13513 40626 92040 55972 11566 -42941 -111322 -123478 -82872 -47792 -4497 -19876
6334 -19876 -10922 -31659 16966 57477 36030 -32331 -53834 -38522 11445 70231 89759 23665
6322B3665o1152N1218O9430j6369K383J2296m2402o3264l6777o480J0737K0206
6310c6509N4556j1197q307k1623K333k0017l6472M4053L4697l1666j5329j527
6298d7008l3690m49L8898k6643m2104j1423L6174O055N1892K6596j4470pM4683
6285B8504k6742O2056k387l0030m3401L1589O4675J6267L5240J4577l266J0678
6273A57760m6067p2239K0686n7994m7336r446k4039J6695K3756L3202O6837l52
6261F1463m1470p7319K8375J05862m5200r4957l7698L4157P5146k1806k0104N3553
6249B0002j337J9773q025o5405n6690K8908O030P031M3676l7280k842N0145L2316
6236C6302K233j925P908j6802k0696j9282j042r3181l7395N3533O3960M5049L187
$$ plain form
6322 23665 -37487 13731 83161 66792 69175 81471 39069 -24195 -60972 -67452 -56715 -36509
6310 -36509 18047 6850 -1457 -23080 -20747 -40764 -77236 -33183 1514 -30152 -45481 -47008
6298 -47008 -80698 -81147 -42249 -68892 -110996 -122419 -86245 -80190 -28298 -1702 -16172 -16179 28504
6285 28504 1762 63818 61431 31401 -12000 19589 84264 100531 135771 150348 147082 157760
6273 157760 111693 39454 60140 2146 -45190 -54636 -78675 -61980 -38224 -5022 61815 61463
6261 61463 19993 -57326 -28951 76911 31711 -63246 -100944 -66787 8359 -13447 -33551 20002
6249 20002 18665 38438 30413 -34992 -91682 -62774 -56744 -49713 -6037 -43317 -46159 3986 36302
6236 36302 38535 36610 44518 27716 7020 -12262 -13304 -106485 -143880 -90347 -26387 18662 21849
6223B1849O195l4970P742O6848K3010j3086o0499o9572n729P7478r867p2884J4723
6210d8762n38J000j5627L280j8884k1251l9366P4110K5214L1149l2396J1792K2039
6197h240l0507O7304j9120p8593K2063M2155p247L1600K6460j9622o0229l9672
6185g3648k556r789M3059O6857l0411k4600K4306n039J3079K2333Q444k9078k3894
6172b0937O549K1628j1703q416N910p293N2298q698m6015j2183j9850K2760n9104
6159h5054j6350J5532J7709l364K2015j0304O153K430k3483Q551J8937K262l4653
6146g9619P165P6859L3489N795j0492j2495J2791L9315p1204r5699K2614M0677
6134c0804p1184j7627r576j9068J6765M4204J5042N155n135l7599l574K7371r934
$$ plain form
6223 21849 28044 -6926 816 67664 90674 77588 17089 -52483 -58212 19266 9399 -63485 -48762
6210 -48762 -49300 -48300 -63927 -60647 -79531 -100782 -140148 -66038 -40824 -9675 -42071 -30279 -8240
6197 -8240 -38747 28557 9437 -69156 -47093 -4938 -12185 19415 45875 26253 -33976 -73648
6185 -73648 -76204 -85993 -42934 23923 -6488 -31088 -6782 -11821 1258 23591 32035 2957 -20937
6172 -20937 -14388 7240 -4463 -12879 -6969 -14262 38036 29338 -16677 -28860 -48710 -25950 -85054
6159 -85054 -101404 -85872 -68163 -71527 -49512 -59816 -53663 -51233 -74716 -66165 -47228 -44966 -79619
6146 -79619 -72454 4405 37894 43689 33197 20702 33493 72808 1604 -94095 -71481 -30804
6134 -30804 -101988 -119615 -129191 -148259 -131494 -87290 -72248 -67093 -72228 -109827 -113401 -86030 -95964
6121i5964M9018J6075L5305p1969j39P743K9990N547M1977L1947l3293m6705j9360
6108d9828j2329n5898n3467k1207J4612L3679L4565J0091K2605k3656j141L1273
6096g0701N7873J0155k647n707r77k9405M2864m1675J2953j9306j6178N1586k6518
6083c7683m2205Q048L4542j305k3776l2029N7960N5325m7587m6662R600L711j9316
6070h1377K2674J9246L5064J7230l219L921k0502P170j9505j5157k2841n3727
6058a11023r700Q873k1617J7857l269K0374O3545K0421k389N5223K4146m9431
6046A3010j4108K1174J4068n4875j4685J7853J5718L5343o9396n2774K0511O9083
6034I22K8104n5918k1871k5653K785j2334j6918K6136L7001l4062m4687K2849
$$ plain form
6121 -95964 -46946 -30871 4434 -67535 -67674 -59931 -29941 -24394 17583 49530 16237 -30468 -49828
6108 -49828 -62157 -118055 -171522 -192729 -178117 -144438 -109873 -99782 -77177 -100833 -101974 -70701
6096 -70701 -12828 -2673 -5320 -11027 -12004 -41409 1455 -40220 -27267 -46573 -62751 -11165 -37683
6083 -37683 -79888 -71840 -37298 -38603 -62379 -94408 -36448 18877 -28710 -75372 -65772 -62061 -81377
6070 -81377 -58703 -39457 -4393 12837 9618 13539 -6963 207 -19298 -34455 -57296 -111023
6058 -111023 -120723 -111850 -133467 -115610 -118879 -98505 -34960 -14539 -16928 38295 62441 13010
6046 13010 -1098 20076 34144 -20731 -35416 -17563 -1845 33498 -35898 -88672 -68161 922
6034 922 29026 -26892 -48763 -74416 -71631 -83965 -100883 -74747 -37746 -71808 -116495 -93646
6022i3646M6862O5629R555J7979p8189n9054J3742P8687k8239n6543m2467O1873
6010f3811L4490J6284O1077L8389L707p5063j15816L9559J02152K614q2038J594
5998c6862L919k746K5921l5837j9732J3197m0382m8343m0650J2410J7725P4150
5986g7230L6882K4014L6662j6676j2033J1160o2350j5065J7638O2824O3356q5763
5974a6581o1610j5526L469K7117l277k22p730M1826J7182k4876o6L4544K1396
5961A5646k8471l4973J8759J077K9506O505j9491N371J0216m7669O278m2339M3307
5948c6278R633J7795k2467l381m3321l5176j4458N7259L5199M0399L261n6815
5936d8350m6451L0502M2768j7155J2688j4386R176m1266P868N9286J0738j5163
$$ plain form
6022 -93646 -46784 18845 28400 46379 -31810 -90864 -77122 1565 -26674 -83217 -125684 -63811
6010 -63811 -29321 -13037 48040 86429 90136 15073 -100743 -61184 40968 43582 -38456 -36862
5998 -36862 -32943 -35689 -9768 -45605 -65337 -52140 -92522 -140865 -181515 -169105 -151380 -77230
5986 -77230 -40348 -16334 20328 3652 -8381 2779 -59571 -74636 -56998 5826 69182 -16581
5974 -16581 -78191 -93717 -90248 -63131 -66408 -66630 -74360 -32534 -15352 -40228 -40294 -5750 15646
5961 15646 -12825 -47798 -29039 -27962 1544 8049 -11442 -6071 4145 -43524 -37246 -79585 -36278
5948 -36278 -26645 -8850 -31317 -34698 -78019 -113195 -127653 -70394 -35195 5204 8465 -48350
5936 -48350 -94801 -64299 -21531 -38686 -25998 -40384 -31208 -72474 -64606 -5320 5418 -9745
5924i745O567K1011K602k8175k3599k0400l4785J7036J7026J7113m9918k5473
5912a10740N3111O3556O436p6458J076M2367P5608k7331m6464O083O4783m456
5900D7571k8990k1951n4180j204M5636M3238L1613L669p9934l5026n2755J5069
5888h7244n246M0390k8388Q263r503j6169k8670J5586L4743K7792L581P123N7290
5875A9548P7433m2368r1366O590N9474K4154m8874k9098l0146J5523R360L1171
5863A401M5391K6861k1158L586k8041j02377n2523Q700O1748R782j0382l1344
5851h8356L8838Q999O363l1905J8572P152o324m1077j0250m6497J6644N9598R844
5838e8399k9442K2319R793L7283L6819K250k0491k7673R999p3820q5507J7067
$$ plain form
5924 -9745 -3178 17833 20435 -7740 -31339 -51739 -86524 -69488 -52462 -35349 -85267 -110740
5912 -110740 -57629 5927 12363 -64095 -63019 -20652 54956 27625 -18839 -12756 52027 47571
5900 47571 18581 -3370 -57550 -58754 -13118 30120 61733 65402 -14532 -49558 -102313 -87244
5888 -87244 -92490 -52100 -80488 -72225 -81728 -97897 -126567 -110981 -76238 -48446 -44865 -37742 19548
5875 19548 96981 54613 -36753 -30163 29311 53465 4591 -24507 -54653 -39130 -29770 1401
5863 1401 46792 73653 52495 56081 28040 -74337 -126860 -118160 -56412 -46630 -57012 -88356
5851 -88356 -49518 -40519 -34156 -66061 -47489 -40337 -46661 -87738 -97988 -144485 -127841 -68243 -58399
5838 -58399 -87841 -65522 -55729 -18446 18373 20623 132 -27541 -17542 -91362 -176869 -159802
5826a59802J9740L7163K5346l641j7620j4011L4267N3467M2149J0147j7369l9972
5814c0136k8553l100P1686N5369k6723j6911J0547j293l2778n1656Q97M495R199
5801c8957m2102R717L7465M4436k7163m4597K8833n661m5166j3745J6593N3345
5789b7002J3796j8673q375l3118J7024L8976L9958L3642J7504n2730m3158j590
5777b3746O9007M0258o3008o6753j6926Q472P6402m792K3991K7315k6415j3527
5765C0278j9093M5075j3286O833r764l94n542l9407k498m4880o0347p352M1370
5752g9007K9689j3405l6252O6694M0301M843R421n6875k3331J1733N3581k9653
5740b2261j9784r866m142M7669L9183j2365j3269j9455K5232K7435k353P654j8741
$$ plain form
5826 -159802 -140062 -102899 -77553 -81194 -98814 -112825 -78558 -25091 17058 27205 9836 -30136
5814 -30136 -58689 -61789 9897 65266 38543 21632 32179 30886 -1892 -53548 -52651 -48156 -38957
5801 -38957 -81059 -71342 -33877 10559 -16604 -61201 -32368 -38029 -83195 -96940 -80347 -27002
5789 -27002 -13206 -31879 -40254 -73372 -56348 -17372 22586 56228 73732 21002 -22156 -23746
5777 -23746 45261 85519 22511 -44242 -61168 -52696 23706 18914 42905 70220 43805 30278
5765 30278 11185 56260 42974 49807 40043 39649 34107 -5300 -7798 -52678 -113025 -120377 -79007
5752 -79007 -49318 -62723 -98975 -32281 8020 12863 22284 -34591 -57922 -46189 7392 -22261
5740 -22261 -42045 -51911 -56053 -8384 30799 18434 5165 -14290 10942 38377 36024 43678 24937
5727B4937n5551m495j2838M419O4026J8352K6532r147k0616n9679K968k7588O0867
5714A2187K3979k9063m7363J9334j3547M1241L8596M97m7664K12K6825j3035l1475
5701a9276j2894L2855k107o0367M8176L9759j4778n5382l0585J3692L7524N053
5689a8330m490J6760N855K7765n5890k1371J7503K0610O7161J2286l0910k9821
5677G128l336L12m0238j5082K2873q315J1515k783O2503l2159l0036k6019K9472
5664b4165K6367m0988j3170l9624r352O426K1305M4038L9834L351o678k7168j7712
5651c7536P162J4284K7947k3697O483L2719L7980k3674l6412m0964m5296N750
5639g5254m557j8666K1471J8804L6661m742J3876j7804k5026J2783j2039m027
$$ plain form
5727 24937 -30614 -35109 -47947 -43528 20498 38850 65382 56235 35619 -24060 -21092 -48680 12187
5714 12187 36166 7103 -40260 -20926 -34473 6768 45364 45861 -1803 -1591 25234 12199 -19276
5701 -19276 -32170 685 -1422 -61789 -13613 26146 11368 -44014 -74599 -60907 -23383 -18330
5689 -18330 -22820 -6060 -205 27560 -28330 -49701 -32198 -11588 55573 67859 36949 7128
5677 7128 3792 4104 -36134 -51216 -28343 -36658 -25143 -27926 34577 2418 -27618 -53637 -24165
5664 -24165 2202 -38786 -51956 -91580 -100932 -94506 -73201 -29163 10671 14022 7344 -19824 -37536
5651 -37536 -30374 -16090 11857 -11840 -5357 27362 65342 41668 5256 -35708 -81004 -75254
5639 -75254 -79811 -98477 -77006 -58202 -21541 -26283 -12407 -30211 -55237 -42454 -54493 -58520
5627e8520N8503N278k3740O3492J4245j9657p605J8931q295J1661J8227l6536
5615C5984L1839L5816j0198q6339R183m395O633j6988K846k7101M6887m5321j0157
5602c1311O4529n3233k0154O5628P6764o9017k657L1902j3694p5834n8062P1698
5590a3441K3148K4871J7674K5159k4299k9902j3570k1642m1699L8634N0684m287
5578C1330L7809l4023l1344K987n28j3651N3047R099j22235Q116M4049l1200n2099
5565i8643J5698P2806M0207K3961o354m1629o141L3502k5111o7476k4160O3979
5553a9361N9896J9841q631q0997K4255M3675K102l6358J3206M60j5944p724K9349
5540B3769L984j6242o306q2322n5930P165P2661K6805L0630P7794J2432p010J7565
$$ plain form
5627 -58520 -17 5261 -18479 45013 59258 39601 31996 50927 42632 54293 72520 35984
5615 35984 67823 103639 93441 7102 16285 11890 18523 1535 4381 -22720 24167 -21154 -31311
5602 -31311 33218 -20015 -40169 25459 102223 33206 30549 62451 48757 -27077 -85139 -13441
5590 -13441 9707 34578 52252 77411 53112 23210 9640 -12002 -53701 -15067 35617 31330
5578 31330 69139 35116 3772 6759 6231 -7420 45627 54726 -67509 -59393 -15344 -46544 -98643
5565 -98643 -82945 -10139 30068 54029 47675 6046 -95 33407 8296 -59180 -83340 -19361
5553 -19361 40535 60376 51745 -29252 -4997 38678 40780 4422 17628 18088 2144 -5580 23769
5540 23769 27753 11511 5205 -77117 -133047 -125882 -53221 -26416 4214 82008 94440 87430 104995
5527A04995o0249n3640J8797k3643O786M2999k6481k1826j2972j41j5765J4580
5515b6560k5984j2575n263j1647k1226L924j5639K1023O1775k0032N226K7633
5503a9345k8558J4597J6235L5175j6648K7414L8580n4035j5562l9942J6377J3246
5491a2466K0395n117m5536n5087R759M5530L1593J1566K6582M492J2964k2490
5479B2185m2538K4470K3870K9546k418o518p7257m5250J05591N7925K2111k3230
5467H8487o3159m9933M6684J6587r032l9513P347o560q5773p122J3460l1364p384
5454a27275N5209N7827n3289j6138Q021L0956L2672j4381M3093K4227l2949m3358
5442c5385m3609l8066O9321K3184Q407M2034K5341R08Q4K1192O367j3506k6117
$$ plain form
5527 104995 44746 -8894 9903 -13740 -6954 36045 9564 -12262 -25234 -25375 -41140 -26560
5515 -26560 -52544 -65119 -70382 -82029 -103255 -99331 -114970 -93947 -32172 -52204 -46978 -19345
5503 -19345 -47903 -33306 -17071 18104 1456 28870 67450 13415 -2147 -42089 -25712 -12466
5491 -12466 7929 2812 -42724 -97811 -88052 -42522 -10929 637 27219 31711 44675 22185
5479 22185 -20353 4117 27987 57533 55115 48597 -28660 -73910 31681 89606 111717 88487
5467 88487 25328 -24605 22079 38666 29634 -9879 -2532 -9092 -94865 -101987 -88527 -119891 -127275
5454 -127275 -72066 -14239 -67528 -83666 -75645 -44689 -12017 -26398 16695 40922 7973 -35385
5442 -35385 -78994 -117060 -47739 -24555 -16148 25886 51227 52135 52219 73411 79778 66272 40155
5429D0155k9252m9985k9469j2552P618J4758m2333Q2145l0111k9594m3088j809
5417a23517Q4496m6618n7882N3809L4972k1197j0786j609L2773M5912M5361l821
5405C1893m0034r085n5116O8709J4769K1181j4143p21q0749k8162J9374o322l462
5392h1868K4899R2127K9869k1854j3199k4778j2981l9208Q866L1155L2172j1814
5380A3386l5296M2374j2610q527l07n4062l544l1097n269K8515Q1318J5180K7135
5367E7196l3497L2373j1788K5466J4949o2328K4071K3235M635k6935n8948L316
5355h255K4577n9778K6649M1649j9444j3300l299k0371m7443k0181K8036J7575
5343e3585K5212l5806P052N589k6021j7141R1561K6099p3248k6582N0232L676
$$ plain form
5429 40155 10903 -39082 -68551 -81103 -73485 -58727 -101060 -18915 -49026 -78620 -121708 -123517
5417 -123517 -39021 -85639 -143521 -89712 -54740 -75937 -86723 -88332 -55559 -9647 35714 31893
5405 31893 -8141 -17226 -72342 -3633 11136 32317 18174 17453 -63296 -91458 -72084 -78406 -81868
5392 -81868 -56969 35158 65027 43173 29974 5196 -7785 -46993 -38127 -6972 25200 13386
5380 13386 -21910 20464 7854 -673 -980 -55042 -58586 -89683 -94952 -66437 14881 30061 57196
5367 57196 23699 56072 44284 69750 84699 22371 46442 69677 74312 47377 -11571 -8255
5355 -8255 16322 -43456 -16807 24842 5398 -7902 -11201 -31572 -79015 -99196 -71160 -53585
5343 -53585 -28373 -64179 -57127 -51538 -77559 -94700 -3139 22960 -50288 -76870 -26638 -22962
$$ [...]
##END NTUPLES=NMR SPECTRUM
##END=
