##TITLE=Analysis number 310618
Compound Code cc 19409
Book Reference 382/78/1
Project Code adrs
Chemist Name simons
##JCAMPDX= 6.0         $$ Bruker NMR JCAMP-DX V2.0
##DATA TYPE= NMR SPECTRUM
##DATA CLASS= NTUPLES
##ORIGIN= Bruker BioSpin GmbH
##OWNER= NMR
$$ XWIN-NMR		Version 3.5
$$ Tue Jun 21 11:27:12 2005 GMT Daylight Time (UT+1h)  MAYBRIDGE\NMR@NMR_250MHZ
##.OBSERVE FREQUENCY= 250.131544655141
##.OBSERVE NUCLEUS= ^1H
##.ACQUISITION MODE= SIMULTANEOUS (DQD)
##.ACQUISITION SCHEME= undefined
##.AVERAGES= 16
##.DIGITISER RES= 18
##SPECTROMETER/DATA SYSTEM= dpx250
##.PULSE SEQUENCE= zg30
##.SOLVENT NAME= CDCl3
##.SHIFT REFERENCE= (INTERNAL, CDCl3, 0, 16.4486)
##AUDIT TRAIL= $$ (NUMBER, WHEN, WHO, WHERE, WHAT)
$$ ##TITLE= Audit trail, XWIN-NMR		Version 3.5
$$ ##JCAMPDX= 5.01
$$ ##ORIGIN= Bruker BioSpin GmbH
$$ ##OWNER= NMR
$$ C:\u/data/dgb/nmr/ADRS/4370/pdata/1/auditp.txt
$$ ##AUDIT TRAIL=  $$ (NUMBER, WHEN, WHO, WHERE, WHAT)
(   1,<2005-06-21 11:26:53.08 +100>,<MAYBRIDGE\NMR>,<NMR_250MHZ>,
      <created by zg, POWCHK disabled, PULCHK disabled
       configuration hash MD5:
       62 19 C7 07 E1 42 D1 B7 37 6C 3D D0 77 39 F9 E6
       data hash MD5: 64K
       A6 89 29 96 D7 53 6E 64 E2 75 18 65 3D B0 BC 94>)
(   2,<2005-06-21 11:27:04.52 +100>,<MAYBRIDGE\NMR>,<NMR_250MHZ>,
      <Start of raw data processing
       ef LB = 0.3 FT_mod = 6 PKNL = 1 SI = 32K 
       data hash MD5: 32K
       17 E3 72 DE 8A 30 D7 7C 6A B0 A5 60 5D 91 7F 92>)
(   3,<2005-06-21 11:27:06.41 +100>,<MAYBRIDGE\NMR>,<NMR_250MHZ>,
      <apk 
       data hash MD5: 32K
       D1 F4 E4 95 3D 38 09 9F 38 BC 8B 3D 81 B3 AA AC>)
(   4,<2005-06-21 11:27:07.07 +100>,<MAYBRIDGE\NMR>,<NMR_250MHZ>,
      <abs ABSG = 5 
       data hash MD5: 32K
       55 AB CA 65 C7 7B 4B B3 DC 83 3C 72 D8 F2 0E 17>)
$$ ##END=
$$ 
$$ hash MD5
$$ 8F 3D A0 4D 30 D3 6D 4A F2 42 29 6E 2C C3 FC 69
##$RELAX= 
##$RELAX= 
##$RELAX= 
##$RELAX= 
##$RELAX= 
##$RELAX= 
##$RELAX= 
$$ Bruker specific parameters
$$ --------------------------
##$DU= <C:\u>
##$EXPNO= 4370
##$NAME= <ADRS>
##$PROCNO= 1
##$TYPE= <nmr>
##$USER= <dgb>
##$AMP= (0..31)
100 100 100 100 100 100 100 100 100 100 100 100 100 100 100 100 100 100 
100 100 100 100 100 100 100 100 100 100 100 100 100 100 
##$AQSEQ= 0
##$AQ_mod= 3
##$AUNM= <au_zg>
##$AUTOPOS= <15 >
##$BF1= 250.13
##$BF2= 250.13
##$BF3= 250.13
##$BF4= 250.13
##$BF5= 500.13
##$BF6= 500.13
##$BF7= 500.13
##$BF8= 500.13
##$BYTORDA= 1
##$CFDGTYP= 0
##$CFRGTYP= 5
##$CHEMSTR= <none>
##$CNST= (0..31)
1 1 145 1 1 1 1 1 1 1 1 1 1 1 1 1 1 1 1 1 1 1 1 1 1 1 1 1 1 1 1 1 
##$CPDPRG= <>
##$CPDPRG1= <>
##$CPDPRG2= <>
##$CPDPRG3= <>
##$CPDPRG4= <mlev>
##$CPDPRG5= <mlev>
##$CPDPRG6= <mlev>
##$CPDPRG7= <mlev>
##$CPDPRG8= <mlev>
##$CPDPRGB= <>
##$CPDPRGT= <>
##$D= (0..31)
0 1 0 0 0 0 0 0 0 0.06 0 0 0 0 0 0 0.0002 0 0 0 0 0 0 0 0 0 0 0 0 0 0 
0 
##$DATE= 1119349612
##$DBL= (0..7)
120 120 120 120 120 120 120 120 
##$DBP= (0..7)
150 150 150 150 150 150 150 150 
##$DBP07= 0
##$DBPNAM0= <>
##$DBPNAM1= <>
$$ [...]
##$SUBNAM7= <"">
##$SUBNAM8= <"">
##$SUBNAM9= <"">
##$SW= 20.6930455092707
##$SWIBOX= (0..15)
0 0 3 0 0 0 0 0 0 0 0 0 0 0 0 0 
##$SW_h= 5175.983436853
##$TD= 65536
##$TD0= 1
##$TE= 295.16
##$TE2= 300
##$TE3= 300
##$TEG= 300
##$TL= (0..7)
0 120 120 120 120 120 120 120 
##$TP= (0..7)
150 150 150 150 150 150 150 150 
##$TP07= 0
##$TPNAME0= <>
##$TPNAME1= <>
##$TPNAME2= <>
##$TPNAME3= <>
##$TPNAME4= <>
##$TPNAME5= <>
##$TPNAME6= <>
##$TPNAME7= <>
##$TPOAL= (0..7)
0.5 0.5 0.5 0.5 0.5 0.5 0.5 0.5 
##$TPOFFS= (0..7)
0 0 0 0 0 0 0 0 
##$TUNHIN= 0
##$TUNHOUT= 0
##$TUNXOUT= 0
##$USERA1= <user>
##$USERA2= <user>
##$USERA3= <user>
##$USERA4= <user>
##$USERA5= <user>
##$V9= 5
##$VALIST= <valist>
##$VCLIST= <CCCCCCCCCCCCCCC>
##$VD= 0
##$VDLIST= <DDDDDDDDDDDDDDD>
##$VPLIST= <PPPPPPPPPPPPPPP>
##$VTLIST= <TTTTTTTTTTTTTTT>
##$WBST= 1024
##$WBSW= 4
##$XGAIN= (0..3)
0 0 0 0 
##$XL= 0
##$YL= 0
##$YMAX_a= 268055
##$YMIN_a= -375278
##$ZGOPTNS= <>
##$ZL1= 120
##$ZL2= 120
##$ZL3= 120
##$ZL4= 120
##$ABSF1= 16.44857
##$ABSF2= -4.244602
##$ABSG= 5
##$ABSL= 3
##$ALPHA= 0
##$AQORDER= 0
##$ASSFAC= 0
##$ASSFACI= 0
##$ASSFACX= 0
##$ASSWID= 0
##$AUNMP= <proc_1d>
##$AZFE= 0.1
##$AZFW= 0.1
##$BCFW= 0
##$BC_mod= 0
##$BYTORDP= 0
##$COROFFS= 0
##$CY= 12.5
##$DATMOD= 1
##$DC= 0
##$DFILT= <>
##$DTYPP= 0
##$F1P= 14.0000005364418
##$F2P= -0.99999901652339
##$FCOR= 0.5
##$FTSIZE= 32768
##$FT_mod= 6
##$GAMMA= 0
##$GB= 0
##$INTBC= 1
##$INTSCL= 1
##$ISEN= 128
##$LB= 0.3
##$LEV0= 0
##$LPBIN= 0
##$MAXI= 10000
##$MC2= 0
##$MEAN= 0
##$ME_mod= 0
##$MI= 0
##$NCOEF= 0
##$NC_proc= -3
##$NLEV= 6
##$NOISF1= 0
##$NOISF2= 0
##$NSP= 0
##$NTH_PI= 0
##$NZP= 0
##$OFFSET= 16.44857
##$PC= 1
##$PHC0= -82.60497
##$PHC1= 13.6426
##$PH_mod= 1
##$PKNL= yes
##$PPARMOD= 0
##$PSCAL= 4
##$PSIGN= 0
##$REVERSE= no
##$SF= 250.130018366108
##$SI= 32768
##$SIGF1= 0
##$SIGF2= 0
##$SINO= 400
##$SIOLD= 32768
##$SREGLST= <1H.CDCl3>
##$SSB= 0
##$STSI= 32768
##$STSR= 0
##$SW_p= 5175.98343685301
##$SYMM= 0
##$S_DEV= 0
##$TDeff= 65536
##$TDoff= 0
##$TI= <Analysis number 999999
Compound Code 99
Book Reference 9
Project Code 9>
##$TILT= no
##$TM1= 0
##$TM2= 0
##$TOPLEV= 0
##$USERP1= <user>
##$USERP2= <user>
##$USERP3= <user>
##$USERP4= <user>
##$USERP5= <user>
##$WDW= 1
##$XDIM= 32768
##$YMAX_p= 307890297
##$YMIN_p= -127508
$$ End of Bruker specific parameters
$$ ---------------------------------
##NTUPLES= NMR SPECTRUM
##VAR_NAME=  FREQUENCY,     SPECTRUM/REAL,   SPECTRUM/IMAG
##SYMBOL=    X,             R,               I
##VAR_TYPE=  INDEPENDENT,   DEPENDENT,       DEPENDENT
##VAR_FORM=  AFFN,          ASDF,            ASDF
##VAR_DIM=   32768,         32768,           32768
##UNITS=     HZ,            ARBITRARY UNITS, ARBITRARY UNITS
##FACTOR=    0.157963299565203, 1,           1
##FIRST=     4114.28117909512, 0,            0
##LAST=      -1061.70225775789, 0,           0
##MIN=       -1061.70225775789, -127508,     0
##MAX=       4114.28117909512, 307890297,    0
$$ Real data points
##PAGE= N=1
##DATA TABLE= (X++(R..R)), XYDATA
$$ [...]
##PAGE= N=2
##DATA TABLE= (X++(I..I)), XYDATA
16033g7835Q316L8528K8046L440l2357J2592K6096j5317j6905r18J7450k6218
$$ -77835 -69519 -30991 -2945 495 -31862 -19270 6826 -8491 -25396 -26314 -8864 -35082
16021c5082J3762O540K2245J2532j0271j3122m7148j5230J4881M1800K211J0590
$$ -35082 -21320 -14780 7465 19997 9726 -3396 -50544 -65774 -50893 -9093 -6882 3708
16009C708l1634k6506j3043j8434K3389K9254j4011k2036K9479M9800J3290n19
$$ 3708 -27926 -54432 -67475 -85909 -62520 -33266 -47277 -69313 -39834 9966 23256 22737
15997B2737K0132J6423o0200m1536N877k1392R81K0506K1874J8548j5190j8476
$$ 22737 42869 59292 -908 -42444 -36567 -57959 -56978 -36472 -14598 3950 -11240 -29716
15985b9716J9970l1654k3285K0276J9502j0117J536J3598j5112l1362M5739j0960
$$ -29716 -9746 -41400 -64685 -44409 -24907 -35024 -33488 -19890 -35002 -66364 -20625 -31585
15973c1585q48O738K4207J1938k4558l4641j9023M340l775J1690L9908N402j693
$$ -31585 -32433 -25695 -1488 10450 -14108 -48749 -67772 -63432 -67207 -55517 -15609 -10207 -11900
15960a1900J582R135K1181P717Q738q20L221k1708K9195j8749j3100j1564j1443
$$ -11900 -10318 -1183 19998 27715 36453 35633 38854 17146 46341 27592 14492 2928 -8515
15947h515J8376O326q109J979j3859j5892j3679m952j331J7377L5826K8075J1445
$$ -8515 9861 16187 8078 10057 -3802 -19694 -33373 -38325 -39656 -22279 13547 41622 53067
15934E3067k4389L931K7473J1484P465J4996K3095p427m7614j9192J7317q960
$$ 53067 28678 32609 60082 71566 79031 94027 117122 109695 62081 42889 60206 51246
15922E1246l2450J6981j4911L5989J2983k5150K1391l9414o5205j2869K0266m632
$$ 51246 18796 35777 20866 56855 69838 44688 66079 26665 -38540 -51409 -31143 -35775
15910c5775j1260J3592N2576L8742p382k4096j7030k3559L4729j1772K915K6930
$$ -35775 -47035 -33443 19133 57875 50493 26397 9367 -14192 20537 8765 11680 38610
15898C8610N1265J7986j3951l963j4522j9995K2668K8479j7563J4078J16j5015
$$ 38610 89875 107861 93910 89947 75425 55430 78098 106577 89014 103092 103208 88193
15886H8193k1813r715j3743k60R353K748j3900q735j2203M5594L7607j1053M644
$$ 88193 66380 56665 42922 42662 52015 54763 40863 32128 19925 65519 103126 92073 96717
15873I6717R9K1670L297l8808P67J0156k0414L451k9271k2388K7997J1661K2075
$$ 96717 96816 118486 121783 82975 83742 93898 73484 76935 47664 25276 53273 64934 87009
15860H7009J8732l8762N960l999K8493j2201j4018J3231J3460k5496N722J8547
$$ 87009 105741 66979 72939 68940 97433 85232 71214 84445 97905 72409 78131 96678
15848I6678l0930j4337K4577J9898J1509K0386j758o7129j2189J3683M364K5324
$$ 96678 65748 51411 75988 95886 107395 127781 126023 58894 46705 60388 64752 90076
15836I0076j311K596n952q816N0870R647j399K868p124k7751j0256J3774J225
$$ 90076 88765 91361 85409 76593 127463 137110 135711 138579 131455 103704 93448 107222 108447
15823A08447l8220j4756K2491K1277L8k2761j5769J2599M2864L0333j1557m308
$$ 108447 70227 55471 77962 99239 99277 76516 60747 73346 116210 146543 134986 130678
15811A30678J827k2017k933J0811N490n110j4577j4689L7223L0986O51k0983j254
$$ 130678 132505 110488 107555 118366 123856 118746 104169 89480 126703 157689 158340 137357 136103
15798A36103k1720k2069k4773J0475R810L4869K4703R449J1414l6477R200j6246
$$ 136103 114383 92314 67541 78016 87826 122695 147398 156847 168261 131784 140984 124738
15786A24738j9399J396j0955J3271P952n991K0110k2687k2498K788L507m060N127
$$ 124738 105339 106735 95780 109051 117003 111012 131122 108435 85937 88725 92232 88172 93299
15773I3299J7468m984K55j3964J1196J5021j5250K2318J715L381j8189M066K4539
$$ 93299 110767 105783 106038 92074 103270 118291 103041 125359 127074 130455 112266 116332 140871
15760A40871K3613k383R27q620K9351L1507k3376p3800n899J5962O0484M1342
$$ 140871 164484 162101 163028 154408 183759 215266 191890 118090 112191 128153 188637 229979
15748B29979J0951m251l1467k4543k5471m541K4427K4885o080J1892J5019k6407
$$ 229979 240930 236679 205212 180669 155198 150657 175084 199969 193889 205781 220800 194393
15736A94393k7216k34K3289M5044j7891l0972j2662k9539l468J3122R711N355
$$ 194393 167177 166943 190232 235276 217385 186413 173751 144212 140744 153866 163577 168932
15724A68932P876j2602J9253J3195k3683o073L044L9281M74k8451k941p841j6533
$$ 168932 176808 164206 183459 196654 172971 166898 169942 209223 209697 181246 178305 170464 153931
15711A53931J326o975j0573J2926J4859n570j2707k2708P050K0342M3709j4979
$$ 153931 155257 148282 137709 150635 165494 159924 147217 124509 131559 151901 195610 180631
15699A80631k8r689l727q323J3077N053R886j8102m802R882j1533o219J9594R035
$$ 180631 180603 170914 167187 158864 171941 176994 186880 168778 163976 173858 162325 156106 175700 184735
15685A84735J2732o101k1973J548j8495L5037K0338R111j6260j3706O28K5464
$$ 184735 197467 191366 169393 170941 152446 187483 207821 216932 200672 186966 187594 213058
15673B13058J5701j5770N699n713O634q892k009k0656j0298K0439K206j2902j345
$$ 213058 228759 212989 218688 212975 219609 210717 208708 188052 177754 198193 200399 187497 186152
15660A86152J7120l597O527J6163J6613Q089j6314R468o030o223j2082l434Q40
$$ 186152 203272 199675 206202 222365 238978 247067 230753 240221 234191 227968 215886 212452 213292
15647B13292j6849M5090o318l7778J730m625L8071J9715J7295K917R989J196j3557
$$ 213292 196443 241533 235215 197437 199167 194542 232613 252328 269623 272540 282529 283725 270168
15634B70168N098J8849P96l0541m3618L7187K8810q255p396L066N930L2229K994
$$ 270168 275266 294115 294911 264370 220752 257939 286749 278494 271098 274164 280094 312323 315317
15621C15317k4138k9135q955j6570K1157L4290l522j2866L2089J0078k7312r436
$$ 315317 291179 262044 253089 236519 257676 291966 288444 275578 307667 317745 290433 280997
15609B80997q969l8672N746M8478J6894j4246m5164q810R277J9559K061n424m0240
$$ 280997 272028 233356 239102 287580 304474 290228 245064 236254 245531 265090 267151 261727 221487
15596B21487l0630N730L8241K0939k258L1731J5439N712k0609R217J6032O066
$$ 221487 190857 196587 234828 255767 253509 285240 300679 306391 285782 294999 311031 317097
15584C17097P47j3411r811j0272J5197n862M061L7245L6099j6692m862P79k1863
$$ 317097 317844 304433 294622 284350 299547 293685 297746 334991 371090 354398 349536 350315 328452
15571C28452k4747l0971l0630J7638O516n049q51J4067J5313O813j416J4263P82
$$ 328452 303705 272734 242104 259742 266258 261209 260358 274425 289738 296551 295135 309398 310180
15558C10180k06N385M961l599L1885P769J1317J3563L577j4442k4521K6775j4519
$$ 310180 309974 315359 320320 316721 348606 356375 367692 381255 384832 370390 345869 372644 358125
15545C58125l2695k2172j8226K3704J4575J0062K0117j184n862p635m713k1681
$$ 358125 325430 303258 285032 308736 323311 333373 353490 352306 346444 338809 334096 312415
15533C12415m337r617K7471j077O841l185J4575M5854L2092l7833k2250l1193
$$ 312415 308078 298461 325932 324855 331696 328511 343086 388940 421032 383199 360949 329756
15521C29756K3605R653J6654J1572k7383J041j6871l25K0456N0462K5249m770
$$ 329756 353361 363014 379668 391240 363857 364898 348027 347702 368158 418620 443869 439099
15509D39099k0696k1318l0785R356P386J5893J5505P296K911q900k842k1482J0548
$$ 439099 418403 397085 366300 375656 383042 398935 414440 421736 424647 415747 412905 391423 401971
15496D01971J2491j8016o388K500k6497j8549J0319K3496K6553r504J2245l690
$$ 401971 414462 396446 390058 392558 366061 347512 357831 381327 407880 398376 410621 406931
15484D06931l7139K743J5785K0614Q708n941l1269r934J8318K0617K5240L275
$$ 406931 369792 372535 388320 408934 417642 411701 380432 370498 388816 409433 434673 437948
15472D37948P074l51k6515l4651j3893M5365J7378L7520P376M971J2975K9585
$$ 437948 445022 444671 418156 383505 369612 414977 432355 469875 477251 482222 495197 524782
15460E24782P960m1105l5879L624n563l9790M711k2284J0510K2695J8775j6725
$$ 524782 532742 491637 455758 459382 453819 414029 418740 396456 406966 429661 448436 431711
15448D31711K9527J7083k5550j5712K8798L024j0216j1112N485l32P634k0907
$$ 431711 461238 478321 452771 437059 465857 468881 458665 447553 453038 452706 460340 439433
15436D39433k272J6740K1836j5652r066L2209k423L63J4465J9742j5807p205r01
$$ 439433 437161 453901 475737 460085 451019 483228 480805 481168 495633 515375 499568 492363 491462
15423D91462M860j349m1136r061J6953L2307J8471M1725j7474m5474j0387N099
$$ 491462 496322 494973 453837 444776 461729 494036 512507 554232 536758 491284 480897 485996
15411D85996J9183k6651k9600J0175N3884j7063j6083K2981Q758L4142J6028j4764
$$ 485996 505179 478528 448928 459103 512987 495924 479841 502822 511580 545722 561750 546986
15399E46986J7425K6678l0293k7132j1223k0755L2819J2619j6609N799j0369P93
$$ 546986 564411 591089 560796 533664 522441 501686 534505 547124 530515 536314 525945 526738
15387E26738M7948P385o57L8781q555j0830J2247J2407k8507J0172K4311J4694
$$ 526738 574686 582071 581414 620195 611640 600810 613057 625464 596957 607129 631440 646134
15375F46134m392k4111o303j3572M928o89Q733J0658M0922J5919J0863k9484j8730
$$ 646134 641742 617631 611328 597756 602684 601995 610728 621386 662308 678227 689090 659606 640876
15362F40876j2017o96k2263j4522L2659O2982J0524p225r416j9797L386M1564
$$ 640876 628859 628163 605900 591378 624037 687019 697543 690318 680902 661105 664491 706055
15350G06055l2120l2921K444J8052K6059n543l1874r673K1138o158q866M3154
$$ 706055 673935 641014 643458 661510 687569 682026 650152 640479 661617 655459 646593 689747
15338F89747N3528l251j2328n72J8710j774L1943L6478j2886n7207M003K1394
$$ 689747 743275 740024 727696 727124 745834 744060 776003 812481 799595 742388 746391 767785
15326G67785O176M26k1172J651j4636P806M5545L6099j667Q57M141J0933L2029
$$ 767785 773961 774387 753215 754866 740230 748036 793581 829680 828013 828870 833011 843944 875973
15313H75973K3075l5123J7306L390l6086k0676K1011M081L1032M0461O916K3039
$$ 875973 899048 863925 881231 884621 848535 827859 848870 852951 883983 924444 931360 954399
15301I54399K350K1166K3407k0428l1595j3667J5786Q400K2878J3807K1997J3986
$$ 954399 956749 977915 1001322 980894 949299 935632 951418 959818 982696 996503 1018500 1032486
15289A032486K4533K0973j4586J386K9934o970J7161m398k5264j7773J2006L7271
$$ 1032486 1057019 1077992 1063406 1064792 1094726 1087756 1104917 1100519 1075255 1057482 1069488 1106759
15277A106759J4569L8981K0397L5537q231J7271K0716Q271J550K2914N3153R655
$$ 1106759 1121328 1160309 1180706 1216243 1208012 1225283 1245999 1254270 1255820 1278734 1331887 1341542
15265A341542K2109K6588L2601O289J3605Q478K8858N7752K6862O16M4478N7393
$$ 1341542 1363651 1390239 1422840 1429129 1442734 1451212 1480070 1537822 1564684 1565300 1609778 1667171
15253A667171N4910J1487M8054N0125O4689P1275O6134N9579O5385Q4811J16804
$$ 1667171 1722081 1733568 1781622 1831747 1896436 1967711 2033845 2093424 2158809 2243620 2360424
15242B360424Q6686N6601R2094J27087J27755K06428J81941J94082K56263K58311
$$ 2360424 2447110 2503711 2595805 2722892 2850647 3057075 3239016 3433098 3689361 3947672
15232C947672L52349M11492M41358L23966M1547l87703p82808j005945j134621
$$ 3947672 4300021 4711513 5152871 5476837 5518384 5130681 4347873 3341928 2207307
15223B207307j282795j394196j308522j028892o98918l45688j6814J95477K87705
$$ 2207307 924512 -469684 -1778206 -2807098 -3506016 -3851704 -3868518 -3673041 -3385336
15214c385336K91500K98389K38041K03408K10640J82857J43428J39449R3418P9283
$$ -3385336 -3093836 -2795447 -2557406 -2353998 -2143358 -1960501 -1817073 -1677624 -1584206 -1504923
15204a504923J19962J04137O3744P1613P5483P9253M0183K7931N2424P6378J5894
$$ -1504923 -1384961 -1280824 -1217080 -1145467 -1069984 -990731 -950548 -922617 -870193 -793815 -777921
15193g77921J4654K5842M5524M0741j3685o21N816L7114K9391l2411K0938J7375
$$ -777921 -763267 -737425 -691901 -651160 -664845 -665466 -659650 -622536 -593145 -625556 -604618 -587243
15181e87243P780J2450L8045L1503K6562K2135j9615k1159M2860L8644J865j161
$$ -587243 -579463 -567013 -528968 -497465 -470903 -448768 -468383 -489542 -446682 -408038 -406173 -407334
15169d07334M7792L656M5084K751j2790L5139K3597P980l247L9958K9885J740
$$ -407334 -359542 -355886 -310802 -308051 -320841 -285702 -262105 -254125 -257372 -217414 -187529 -185789
15157a85789j3448L5456J9501J1352r655N1433L298m4705l5954O007K8109K1003
$$ -185789 -199237 -163781 -144280 -132928 -142583 -91150 -87852 -132557 -168511 -162504 -134395 -113392
15145a13392q031N7052M6936j8500K1793K7515P87L53m112k2839r301M0370R496
$$ -113392 -121423 -64371 -17435 -35935 -14142 13373 14160 14513 10401 -12438 -21739 18631 28127
15132B8127K3393J3513l6625l5253q38L253K4066M243P555R978K84j466J9174
$$ 28127 51520 65033 28408 -6845 -7683 -4430 19636 23879 31434 41412 41696 40230 59404
15119E9404J9710m34m730J1315j2257k638L0181K4062J0406p172o998N449M089
$$ 59404 79114 78680 73950 85265 73008 70370 100551 124613 135019 127847 120849 126298 130387
15106A30387J2910J665K3791p051R93j0637J9218K9020q890K478J3338j3373p491
$$ 130387 143297 144962 168753 161702 162695 152058 171276 200296 191406 193884 207222 193849 186358
15093A86358L7022k8809j1138K4461L0232K5041L1163p898M9163m1865n9988l6110
$$ 186358 223380 194571 183433 207894 238126 263167 294330 286432 335595 293730 233742 197632
15081A97632K5799L8314L0381R295j6526n932j3450k6557j6638M792j4248k2429
$$ 197632 223431 261745 292126 301421 284895 278963 265513 238956 222318 227110 212862 190433
15069A90433L2325J6231K9584L1776K7138L9480K5127L722l9258m9055j2484L5269
$$ 190433 222758 238989 268573 300349 327487 366967 392094 395816 356558 307503 295019 330288
15057C30288M812J0229P138J6325K8687j6080J4769n750N403K9567k839q119m4258
$$ 330288 335100 345329 352467 368792 397479 381399 396168 390418 395821 425388 422549 414430 370172
15044C70172m2669q538J4796K8702j0134L502K3334J7187J5610n184Q980j0234
$$ 370172 327503 318965 333761 362463 352329 355831 379165 396352 411962 406778 415758 405524
15032D05524J4525J8832j6620o260L522n255j7440K4675N0681r248k1223r113
$$ 405524 420049 438881 422261 416001 419523 414268 396828 421503 472184 462936 441713 432600
15020D32600j8802J2370k0756j5584K0607K4219N157o359J5254p811J8009j90
$$ 432600 413798 426168 405412 389828 410435 434654 439811 433452 448706 440895 458904 458714
15008D58714l529l0241L1138M1972J5430j7831J80j1129j1323k5199J4322K4294
$$ 458714 455185 424944 456082 498054 513484 495653 495833 484704 473381 448182 462504 486798
14996D86798K447J0542o470n641J4695l096j8285p871J5008j2909o016L0127J1741
$$ 486798 489245 499787 493317 487676 502371 499275 480990 473119 488127 475218 469202 499329 511070
14983E11070J6396j471L910k1276P40Q04k5724P024J2330J8479o794K3214J2664
$$ 511070 527466 525995 529905 508629 509369 510173 484449 491473 503803 522282 515488 538702 551366
14970E51366j2456j8675J134l2650L31L2960n407J1914r30j6954j0927M2797M0176
$$ 551366 538910 520235 521369 488719 489050 522010 516603 528517 527587 510633 499706 542503 582679
14957E82679p837l825K7630j0323J0592J5104L300J007j5287j2663j6568k732
$$ 582679 574842 571017 598647 588324 598916 614020 617320 618327 603040 590377 573809 571077
14945E71077J6536J6966N377j4651j690J242L9988K5689k4731l9588m6452k930
$$ 571077 587613 604579 609956 595305 593615 594857 634845 660534 635803 596215 549763 546833
14933E46833j2932J7970K7186J8334M984J3089J644Q906L081j5451J8085q680
$$ 546833 533901 551871 579057 597391 602375 615464 617108 626014 629095 613644 631729 623049
14921F23049L3420L593j2677j8883q072J4404r746M648L4029q102K602p016j3903
$$ 623049 656469 660062 647385 628502 620430 634834 625088 629736 663765 655663 658265 651249 637346
14908F37346q495L3949Q667J416J3148j641K2900Q272K716Q629p910l0747r370
$$ 637346 628851 662800 671467 672883 686031 684390 707290 715562 718278 726907 718997 688250 678880
14895F78880l423k4150M0232M8315L091k7372J7657K0923K249Q856p472m564j4185
$$ 678880 675457 651307 691539 739854 742945 715573 733230 754153 756402 765258 757786 753222 739037
14882G39037j6695k6514m5211r913M13l2584J4601L5130j7614j0767K3869o56
$$ 739037 722342 695828 650617 640704 641117 608533 623134 658264 640650 629883 653752 653096
14870F53096K788O776K671N3053J7163j7568J1777k6225r972K950k3344k6602
$$ 653096 655884 662660 665331 718384 735547 717979 729756 703531 693559 696509 673165 646563
14858F46563j1946K2705K0590K0622J097J8917J1126N112p025k0502j6166l545
$$ 646563 634617 657322 677912 698534 699631 718548 729674 734786 727761 707259 691093 687548
14846F87548K2846K9805M622J9357L132j252n0955n456J2950O158K2295K3721
$$ 687548 710394 740199 744821 764178 767310 766058 715103 709647 722597 728755 751050 774771
14834G74771n354L4J2311k6301l651k7289N508M0639L3716k1854K136O019k350
$$ 774771 769417 769451 781762 755461 751810 724521 730029 770668 804384 782530 784666 790685 788335
14821G88335j6753J0799J2182l4805l4136L4280L1803J9251J9070k8056J5459
$$ 788335 771582 782381 794563 759758 725622 759902 791705 810956 830026 801970 817429
14810H17429N656K7805M785k1626j3178k6916q062L1216J2708m004L9273K817
$$ 817429 823085 850890 855675 834049 820871 793955 785893 817109 829817 825813 865086 867903
14798H67903j4530J3693k940J2717O249l3955k6955j2127K053K030K4225K721
$$ 867903 853373 867066 864126 876843 883092 849137 822182 810055 812108 814138 838363 841084
14786H41084L21k287K8974K0907k036j713l307q204K9734J9379k3635m848K6004
$$ 841084 841405 839118 868092 888999 886963 885250 881943 873739 903473 922852 899217 894369 920373
14773I20373j7789l5585k0991R997M1742N0519K7637K0703j2459m6973j2865m639
$$ 920373 902584 866999 846008 856005 897747 948266 975903 996606 984147 937174 924309 919670
14761I19670J4438L2614J3211J029j4659j5516J5312j9309O16K4071k689k073
$$ 919670 934108 966722 979933 980962 966303 950787 966099 946790 947406 971477 968788 966715
14749I66715l0151k3698R607J1749N297L1060J1786o966L7999k336j6681j5765
$$ 966715 936564 912866 922473 934222 939519 970579 982365 975399 1013398 1011062 994381 978616
14737I78616j1597K0461j0735l1051R068p691j4787J1852K9493L358N625k6643
$$ 978616 967019 987480 976745 945694 954762 947071 932284 944136 973629 976987 982612 955969
14725I55969K0660L4699K6050K3950J3632k2137j1648J0431K9880l3977l6771
$$ 955969 976629 1011328 1037378 1061328 1074960 1052823 1041175 1051606 1081486 1047509 1010738
14714A010738K213L1044J0688q981J4718J0537j0570o334K2229N895N298O176
$$ 1010738 1012951 1043995 1054683 1045702 1060420 1070957 1060387 1054053 1076282 1082177 1087475 1093651
14702A093651Q335l2275m3866j6714k4896J5945L4199k847m949L4462K0043J5049
$$ 1093651 1101986 1069711 1025845 1009131 984235 1000180 1034379 1031532 1026583 1061045 1081088 1096137
14690A096137Q974Q80k1381q898J5362N1091l060k497k9751Q478O332l487n02
$$ 1096137 1105111 1105991 1084610 1075712 1091074 1142165 1139105 1136608 1106857 1115335 1121667 1118180 1117678
14677A117678J4385j4336n585P340K7966J9475j6399m2000K7868L8792K2919k0820
$$ 1117678 1132063 1117727 1112142 1119482 1147448 1166923 1150524 1108524 1136392 1175184 1198103 1177283
14665A177283J1932K1340n1113l6515K5333L9709R093k6978j6084K4284K9437
$$ 1177283 1189215 1210555 1159442 1122927 1148260 1187969 1197062 1170084 1154000 1178284 1207721
14654A207721j1143q964J5843m2507j290L2903M7251K6471J210k0542L183o598
$$ 1207721 1196578 1187614 1203457 1160950 1159660 1192563 1239814 1266285 1267495 1246953 1250136 1243538
14642A243538m0479k9525q283L5552N4786J09J858M2663k269j4769J9395L3120
$$ 1243538 1203059 1173534 1165251 1200803 1255589 1255698 1257556 1300219 1297950 1283181 1302576 1335696
14630A335696L032O830j5486k149K5355j875m861m410K0232O395j5220l1063j3809
$$ 1335696 1338728 1345558 1330072 1327923 1353278 1351403 1346542 1342132 1362364 1368759 1353539 1322476 1308667
14617A308667K5602q96J6859j751J1439o624J4330K7411j0439l9956n094m755
$$ 1308667 1334269 1333373 1350232 1348481 1359920 1353296 1367626 1395037 1384598 1344642 1339548 1334793
14605A334793R430m92p431L9410l340m625O846M2859L6136N378k4265J919J809
$$ 1334793 1344223 1343731 1336300 1375710 1372370 1367745 1374591 1417450 1453586 1458964 1434699 1436618 1438427
14592A438427J2859j674J8457L8494J3074K9925K3179M776N024m0152k0612o547
$$ 1438427 1451286 1449612 1468069 1506563 1519637 1549562 1572741 1577517 1582541 1542389 1521777 1515230
14580A515230J6321J1664J3798j0183j0372j8970p237k81J6584j9440j4021m1942
$$ 1515230 1531551 1543215 1557013 1546830 1536458 1517488 1510251 1509970 1526554 1507114 1493093 1451151
14568A451151n5604m4363j2415P997p470P228j9719O168o289q331Q468M987K7688
$$ 1451151 1395547 1351184 1338769 1346766 1339296 1346524 1326805 1332973 1326684 1318353 1326821 1331808 1359496
14555A359496J9627J6722j084k5305p594j0939m519m141J4320j0454j107l616
$$ 1359496 1379123 1395845 1394761 1369456 1361862 1350923 1346404 1342263 1356583 1346129 1345022 1341406
14543A341406J4156L3850M9023j6032j8547K258k6562L1418Q684K7593K3872n627
$$ 1341406 1355562 1389412 1438435 1422403 1403856 1406114 1379552 1410970 1419654 1447247 1471119 1465492
14531A465492k6054L578P077l380L1622K4430J38j0508n1953j2501L3297N8238
$$ 1465492 1439438 1443016 1450093 1446713 1478335 1502765 1502903 1492395 1440442 1427941 1461238 1519476
14519A519476J6750j8576j968L0673J3212j4332J7972J0867K44L8297Q259J8886
$$ 1519476 1536226 1517650 1515682 1546355 1559567 1545235 1563207 1574074 1574318 1612615 1620874 1639760
14507A639760m435j8759L1639L2846k529J8800k0023K9267R353j3476k1341Q711
$$ 1639760 1635325 1616566 1648205 1681051 1678522 1697322 1677299 1706566 1715919 1702443 1681102 1689813
14495A689813J3342j5343J4404K4062p359o114K725j9920l315K813M5502P677
$$ 1689813 1703155 1687812 1702216 1726278 1718919 1712805 1715530 1695610 1692295 1695108 1740610 1748287
14483A748287J6784k836O744l344j8149J0347K1176r474j3946L6974L2304K6778
$$ 1748287 1765071 1762235 1768979 1765635 1747486 1757833 1779009 1769535 1755589 1792563 1824867 1851645
14471A851645j2857k6205k6323J5480K0656L6795J274o130p476J300K0948K3831
$$ 1851645 1838788 1812583 1786260 1801740 1822396 1859191 1860465 1854335 1846859 1848159 1869107 1892938
14459A892938L691J1374K1423R281J5607Q380J7081j1610Q14J7431N408J3764
$$ 1892938 1896629 1908003 1929426 1938707 1954314 1962694 1979775 1968165 1968979 1986410 1991818 2005582
14447B005582p202r548N2775K6823r355j7640j798J7046o387J3116J0119L6485
$$ 2005582 1998380 1988832 2041607 2068430 2059075 2041435 2039637 2056683 2050296 2063412 2073531 2110016
14435B110016J7660K7253k9868o541M2357j1987q334K0171K0288J9998p388j964
$$ 2110016 2127676 2154929 2125061 2118520 2160877 2148890 2140556 2160727 2181015 2201013 2193625 2191661
14423B191661j3915O672L9942Q734J2333J8848j0662L0817q263j1142K6644J3762
$$ 2191661 2177746 2184418 2224360 2233094 2245427 2264275 2253613 2284430 2276167 2265025 2291669 2305431
14411B305431j5428J8954M4303M907j924N828O40J7784J0673M912j4715J2940
$$ 2305431 2290003 2308957 2353260 2358167 2356243 2362071 2362711 2380495 2391168 2396080 2381365 2394305
14399B394305q789R4j6923j9158J3498L3688O3141K5678J2215k0318j2645r0K9772
$$ 2394305 2385516 2385610 2368687 2349529 2363027 2396715 2459856 2485534 2497749 2477431 2464786 2464696 2494468
14386B494468J9543K3298J728k0305q481R474K5522J3796R190K6641J7643k2162
$$ 2494468 2514011 2537309 2539037 2518732 2510251 2519725 2545247 2559043 2568233 2594874 2612517 2590355
14374B590355k6894J0664L888J9195J3430O218N4013L392j5290M805J4215Q673
$$ 2590355 2563461 2574125 2578013 2597208 2610638 2616856 2670869 2674261 2658971 2663776 2677991 2686664
14362B686664k1318J3411M5105J4003R656K55P820J4749K3793R649k936n338j8660
$$ 2686664 2665346 2678757 2723862 2737865 2747521 2747776 2755596 2770345 2794138 2803787 2800851 2795513 2776853
14349B776853L574M5411L6680K1038K855o327L724L4835N1211R35n0987j002O0261
$$ 2776853 2780427 2825838 2862518 2883556 2886411 2880084 2883808 2918643 2969854 2970789 2919802 2918800 2979061
14336B979061M860m5639N480K6922M1722M2313M4928J8036K758L43R200J8518
$$ 2979061 2983921 2938282 2943762 2970684 3012406 3054719 3099647 3117683 3120441 3120784 3129984 3148502
14324C148502J5866J2576L7682L9671J6937l7484M877M3295J917O625J8941L2847
$$ 3148502 3164368 3176944 3214626 3254297 3271234 3233750 3238627 3281922 3283839 3290464 3309405 3342252
14312C342252K0836K5171L4844J5309J2698k5374o63J5609L2802O5096K9661K8241
$$ 3342252 3363088 3388259 3423103 3438412 3451110 3425736 3425073 3440682 3473484 3538580 3568241 3596482
14300C596482K1856L1443J7753M2298L708J5525K2753J5626N706N893J4024R273
$$ 3596482 3618338 3649781 3667534 3709832 3713540 3729065 3751818 3767444 3773150 3779043 3793067 3802340
14288C802340K7505L4590K8109J8930N6019K9203J7163M1323J0803O3808K4308
$$ 3802340 3829845 3864435 3892544 3911474 3967493 3996696 4013859 4055182 4065985 4129793 4154101
14277D154101M1660K5289p103M7774N1152N0861r821j5727L8493N4087N3589K1569
$$ 4154101 4195761 4221050 4213947 4261721 4312873 4363734 4353913 4338186 4376679 4430766 4484355 4505924
14265D505924J5446L8513L8749M7491J6901K0894N8814O1535M1912M8335K8391
$$ 4505924 4521370 4559883 4598632 4646123 4663024 4683918 4742732 4804267 4846179 4894514 4922905
14254D922905L0546K0283K9850O8580N4982K4629L777N2870Q2960M6351L4740
$$ 4922905 4953451 4973734 5003584 5072164 5127146 5151775 5155552 5208422 5291382 5337733 5372473
14243E372473K2019L6968L4168L7115N9986M7666O3465P4389K9971N9931O1229
$$ 5372473 5394492 5431460 5465628 5502743 5562729 5610395 5673860 5748249 5778220 5838151 5899380
14232E899380J3318O4759Q3577M8159N5280P5150Q8468O5924O0942M1931L6136
$$ 5899380 5912698 5977457 6061034 6109193 6164473 6239623 6328091 6394015 6454957 6496888 6533024
14221F533024N3878J00690O6198N3710M9609P7398P0100Q7637R3056O9330M0960
$$ 6533024 6586902 6687592 6753790 6807500 6857109 6934507 7004607 7092244 7185300 7254630 7295590
14210G295590O5373Q8823O1370J09741J23303R5766Q1888P1680J14261J14715
$$ 7295590 7360963 7449786 7511156 7620897 7744200 7839966 7921854 7993534 8107795 8222510
14200H222510Q9581J10941J06835P2128R0244J18446J17615R0124J55380J30677
$$ 8222510 8312091 8423032 8529867 8601995 8692239 8810685 8928300 9018424 9173804 9304481
14190I304481J22162J51202J51848J30402J66625J43026J22470J83446K00147
$$ 9304481 9426643 9577845 9729693 9860095 10026720 10169746 10292216 10475662 10675809
14181A0675809J54017J29952J89892J63374K00065J91157K27960K11684K26541
$$ 10675809 10829826 10959778 11149670 11313044 11513109 11704266 11932226 12143910 12370451
14172A2370451K61689K74030K65427K63195K54524K79785K92883L08483L05933
$$ 12370451 12632140 12906170 13171597 13434792 13689316 13969101 14261984 14570467 14876400
14163A4876400K90543L21339L96483M10680L81479L94886M12122M77558M87244
$$ 14876400 15166943 15488282 15884765 16295445 16676924 17071810 17483932 17961490 18448734
14154A8448734M87956N00294N46388N49607O01435O05563O43964P05917P44562
$$ 18448734 18936690 19436984 19983372 20532979 21134414 21739977 22383941 23089858 23834420
14145B3834420P75090P57706P34716P71845P96467Q21317Q59617Q31553P72431
$$ 23834420 24609510 25367216 26101932 26873777 27670244 28491561 29351178 30182731 30955162
14136C0955162O80280O15718M74184K75441L2925l36331p50909j272129j856740
$$ 30955162 31635442 32251160 32725344 33000785 33033710 32697379 31946470 30674341 28817601
14127B8817601k491532l078882l690298m196550m607770m865851m976423m879341
$$ 28817601 26326069 23247187 19556889 15360339 10752569 5886718 910295 -3969046
14119c969046m613118m191106l707858l145367k550342j957337j408293r65833
$$ -3969046 -8582164 -12773270 -16481128 -19626495 -22176837 -24134174 -25542467 -26508300
14111b6508300n51051k76175n073K30666L62097M26065M76172N52083N98558O26248
$$ -26508300 -27059351 -27335526 -27340599 -27109933 -26747836 -26321771 -25845599 -25293516 -24694958 -24068710
14101b4068710O25602N87136N75553N27707N61737N34267M99510M63736M79328
$$ -24068710 -23443108 -22855972 -22280419 -21752712 -21190975 -20656708 -20157198 -19693462 -19214134
14092a9214134M72136M28560L62379L74075L21699L14887L04595K18355K05551
$$ -19214134 -18741998 -18313438 -17951059 -17576984 -17255285 -16940398 -16635803 -16417448 -16211897
14083a6211897K19961K37145K10582K02536K21142K17152K12766J92218K16834
$$ -16211897 -15991936 -15754791 -15544209 -15341673 -15120531 -14903379 -14690613 -14498395 -14281561
14074a4281561K03720J75465K18737K24367J89807J78628J77966J93919J72382
$$ -14281561 -14077841 -13902376 -13683639 -13459272 -13269465 -13090837 -12912871 -12718952 -12546570
14065a2546570J80505J88352K11979J78505J70928J64662J67133K01645J89393
$$ -12546570 -12366065 -12177713 -11965734 -11787229 -11616301 -11451639 -11284506 -11082861 -10893468
14056a0893468J25616J80411J51437J62329J48307Q5693J23725J16910R8243J35442
$$ -10893468 -10767852 -10587441 -10436004 -10273675 -10125368 -10039675 -9915950 -9799040 -9700797 -9565355
14046i565355J54717J39960J51211J18418J12599J21387J11399J06107J03102
$$ -9565355 -9410638 -9270678 -9119467 -9001049 -8888450 -8767063 -8655664 -8549557 -8446455
14037h446455J21241R3519R5858P8549J27183J27390J10552J11590P1719Q0890
$$ -8446455 -8325214 -8231695 -8135837 -8057288 -7930105 -7802715 -7692163 -7580573 -7508854 -7427964
14027g427964J09178J14260N3851M7545P2751P9158R5069O9340P9286Q7228O7958
$$ -7427964 -7318786 -7204526 -7150675 -7103130 -7030379 -6951221 -6856152 -6786812 -6707526 -6620298 -6552340
14016f552340Q3405R1402P0319Q0571M5123N6584N1716M2780N9034Q6769R3850
$$ -6552340 -6468935 -6377533 -6307214 -6226643 -6181520 -6124936 -6073220 -6030440 -5971406 -5884637 -5790787
14005e790787N2378O8254P2133O4664L0191L4591L7569L2968O6872L7719M0915
$$ -5790787 -5738409 -5670155 -5598022 -5533358 -5503167 -5468576 -5431007 -5398039 -5331167 -5293448 -5252533
13994e252533N7430N1238L4075L4998M7320M6650L7584j468N5742L1306M3700
$$ -5252533 -5195103 -5143865 -5109790 -5074792 -5027472 -4980822 -4943238 -4944706 -4888964 -4857658 -4813958
13983d813958L5014N2559N2003K2174r222L9603O5603N9233M7839J8626M1573
$$ -4813958 -4778944 -4726385 -4674382 -4652208 -4661430 -4621827 -4556224 -4496991 -4449152 -4430526 -4388953
13972d388953M8744L5039L9571K2022M5919N0185o865p967M3124O0631K9051K8715
$$ -4388953 -4340209 -4305170 -4265599 -4243577 -4197658 -4147473 -4154338 -4162305 -4119181 -4058550 -4029499 -4000784
13960d000784L1264N4923J6714j8516K5613J4436K5160L9271r828n0O2543K3006
$$ -4000784 -3969520 -3914597 -3897883 -3916399 -3890786 -3876350 -3851190 -3811919 -3821747 -3821797 -3759254 -3736248
13948c736248L2761K2794K4509N6432j2845j2119N5203N8397l505O252J1841J5651
$$ -3736248 -3703487 -3680693 -3656184 -3599752 -3612597 -3624716 -3569513 -3511116 -3514621 -3508369 -3496528 -3480877
13936c480877m708L5642O0715J5299K2728j0660J8834L0060K9558J1255J5397
$$ -3480877 -3485585 -3449943 -3389228 -3373929 -3351201 -3361861 -3343027 -3312967 -3283409 -3272154 -3256757
13925c256757l1902L351K8439M3398J2684j1722M0127K6852K0094J1557K767p083
$$ -3256757 -3288659 -3285308 -3256869 -3213471 -3200787 -3212509 -3172382 -3145530 -3125436 -3113879 -3111112 -3118195
13913c118195N200K6478r03j9365L7353M6284M488k0445R823K5560K1759J705
$$ -3118195 -3112995 -3086517 -3087420 -3106785 -3069432 -3023148 -3018660 -3039105 -3029282 -3003722 -2981963 -2980258
13901b980258j0891J6979M6164L0936M1327K7843J9482j6402m094n864J0281N0665
$$ -2980258 -2991149 -2974170 -2928006 -2897070 -2855743 -2827900 -2808418 -2824820 -2828914 -2834778 -2824497 -2773832
13889b773832L0778K2559j1594M8564L1334k7207n1547j9987J1297L9869M9411
$$ -2773832 -2743054 -2720495 -2732089 -2683525 -2652191 -2679398 -2730945 -2750932 -2739635 -2699766 -2650355
13878b650355M4403j6795L1678L8770Q591M506j159j829Q893L2193N894J3180
$$ -2650355 -2605952 -2622747 -2591069 -2552299 -2543708 -2539202 -2540361 -2542190 -2533297 -2501104 -2495210 -2482030
13866b482030N961m372J0344L029N3790K2942r270K1065j3129j9017j9555O0207
$$ -2482030 -2476069 -2480441 -2470097 -2467068 -2413278 -2390336 -2399606 -2378541 -2391670 -2410687 -2430242 -2370035
13854b370035M0426K91r995J067L3544J3305R947P33L0790k4436j1777j0728n087
$$ -2370035 -2329609 -2329318 -2339313 -2338246 -2304702 -2291397 -2281450 -2280717 -2249927 -2274363 -2286140 -2296868 -2301955
13841b301955j2099J7853L6925J8877L9994M2684J6525j9167k4748N026J2640
$$ -2301955 -2314054 -2296201 -2259276 -2240399 -2200405 -2157721 -2141196 -2160363 -2185111 -2180085 -2167445
13830b167445N3560O8709J2396n37o448p381K0113j5554q906n876N075K7917M1387
$$ -2167445 -2113885 -2045176 -2032780 -2033317 -2039765 -2047146 -2027033 -2042587 -2051493 -2057369 -2052294 -2024377 -1982990
13817a982990J0957J5975P678j9006n892o938L1437J6308j3185J8355J4276K094
$$ -1982990 -1972033 -1956058 -1948380 -1967386 -1973278 -1980216 -1948779 -1932471 -1945656 -1927301 -1913025 -1910931
13805a910931q482R754L925K3146j4178R083K4111o05K4830j6723j4428L6124
$$ -1910931 -1919413 -1909659 -1905734 -1882588 -1896766 -1887683 -1863572 -1864177 -1839347 -1856070 -1870498 -1834374
13793a834374K4003R919L6059R514k4276m8963m074L1375K7810L6788n336k3854
$$ -1834374 -1810371 -1800452 -1764393 -1754879 -1779155 -1828118 -1832192 -1800817 -1773007 -1736219 -1741555 -1765409
13781a765409p973L101K2656j0681J8392K6951J8783J318K157j2246J8762M0437
$$ -1765409 -1773382 -1770281 -1747625 -1758306 -1739914 -1712963 -1694180 -1692862 -1690705 -1702951 -1684189 -1643752
13769a643752M7493n37o720j6031j285K0397k745J2510K6165j5033p306o96J868
$$ -1643752 -1596259 -1596796 -1603516 -1619547 -1620832 -1600435 -1603180 -1590670 -1564505 -1579538 -1586844 -1587540 -1585672
13756a585672r819N87m126L937O856j0941J0527l589j8847m3692P170N0459O6272
$$ -1585672 -1595491 -1594904 -1599030 -1595093 -1588237 -1599178 -1588651 -1592240 -1611087 -1654779 -1647609 -1597150 -1530878
13743a530878K6568J279m528L387j2791Q686N1793J237k8180k9223J1475J5103
$$ -1530878 -1504310 -1503031 -1507559 -1504172 -1516963 -1508277 -1456484 -1455247 -1483427 -1512650 -1501175 -1486072
13731a486072J7922K8052O737k225j984j6605k7890J6521M7110J217j2198j2361
$$ -1486072 -1468150 -1440098 -1433361 -1435586 -1437570 -1454175 -1482065 -1465544 -1418434 -1417217 -1429415 -1441776
13719a441776J3174K168j6954K4922J1132N3937L7001j4733j3308q031L035j2801
$$ -1441776 -1428602 -1426434 -1443388 -1418466 -1407334 -1353397 -1316396 -1331129 -1344437 -1352468 -1349433 -1362234
13707a362234m540J8025N0587O867l259Q515J0717L140K7828L4405K8711p77n0371
$$ -1362234 -1366774 -1348749 -1298162 -1291295 -1294554 -1286039 -1275322 -1272182 -1244354 -1209949 -1181238 -1182015 -1232386
13694a232386k0428N6529J8350L447K9127R388j6561k3492K9318L0906L1780j9681
$$ -1232386 -1252814 -1196285 -1177935 -1174488 -1145361 -1135973 -1152534 -1176026 -1146708 -1115802 -1084022 -1103703
13682a103703j8361M0265N1024K2337J1358m632j0653k7702K1143L4775l1640
$$ -1103703 -1122064 -1081799 -1030775 -1008438 -997080 -1001712 -1012365 -1040067 -1018924 -984149 -1015789
13671a015789n0958m3307j8165k6777j7673r171k4629j3861j8840l6549m1526
$$ -1015789 -1066747 -1110054 -1128219 -1154996 -1172669 -1181840 -1206469 -1220330 -1239170 -1275719 -1317245
13660a317245L456J8775J7277P288l4166J9269L9720L3514j4523n7157K3883J3276
$$ -1317245 -1313789 -1295014 -1277737 -1270449 -1304615 -1285346 -1245626 -1212112 -1226635 -1283792 -1259909 -1246633
13648a246633l655k8958o109J4019L9228L2584n482J04j401j5272j5520K9654
$$ -1246633 -1250288 -1279246 -1285355 -1271336 -1232108 -1199524 -1205006 -1204902 -1206303 -1221575 -1237095 -1207441
13636a207441L2790J6040J194k7253p579L0463M6774Q391N941M953o535J5563
$$ -1207441 -1174651 -1158611 -1157417 -1184670 -1192249 -1161786 -1115012 -1106621 -1100680 -1095727 -1102262 -1086699
13624a086699J3179j8599j3018j6753J863L446J3565K8327j0768n024Q041J6220
$$ -1086699 -1073520 -1092119 -1105137 -1121890 -1120027 -1116581 -1103016 -1074689 -1085457 -1090481 -1082440 -1066220
13612a066220J122K249m203q141N777J838j2693Q735K0574P503J5532J7158L915
$$ -1066220 -1065098 -1062849 -1067052 -1075193 -1069416 -1067578 -1080271 -1071536 -1050962 -1043459 -1027927 -1010769 -1006854
13599a006854l7376r7L9463K1216J2409K9994j0032k0406k060k949j3552K526
$$ -1006854 -1044230 -1044327 -1004864 -983648 -971239 -941245 -951277 -971683 -973743 -976692 -990244 -987718
13587i87718j9330K6134P104j6788N9166M1360o784r584L2232j1667j3251L0724
$$ -987718 -1007048 -980914 -973810 -990598 -931432 -890072 -896856 -906440 -874208 -885875 -899126 -868402
13575h68402j555l3585k7362l4671Q807L8375N3534j239n916j614p335j822k200
$$ -868402 -869957 -903542 -930904 -965575 -956768 -918393 -864859 -866098 -872014 -873628 -880963 -882785 -884985
13562h84985J383p836m9479J4698M2927L3507M105k129L8027J8214l8085j4972
$$ -884985 -883602 -891438 -940917 -926219 -883292 -849785 -845680 -847809 -809782 -791568 -829653 -844625
13550h44625j3699K4846L1078J9233j6859l3446J124J4577Q084J2313K1731j6879
$$ -844625 -858324 -833478 -802400 -783167 -800026 -833472 -832348 -817771 -809687 -797374 -775643 -792522
13538g92522k9280J504J0055k399L434J4576k2001L278O797J8198K727M669k4076
$$ -792522 -821802 -820298 -810243 -812642 -809208 -794632 -816633 -813355 -806558 -788360 -785633 -780964 -805040
13525h05040l1921j2509J9219N0748J9563l9205P685R727K8329j490k1674K1090
$$ -805040 -836961 -849470 -830251 -779503 -759940 -799145 -791460 -781733 -753404 -754894 -776568 -755478
13513g55478p595m107J5912L9351k3952m0911j8384L2352k081j7156K0863L9660
$$ -755478 -763073 -767180 -751268 -711917 -735869 -776780 -795164 -762812 -764893 -782049 -761186 -721526
13501g21526L2300K7234O220O765l930m0986k0623K08J1622J0999k202J388K3916
$$ -721526 -689226 -661992 -655772 -649007 -652937 -693923 -714546 -714338 -702716 -691717 -693919 -692531 -668615
13488f68615N0145J2724k995J5126K5061P414K7932P796j3939l2573q920q056
$$ -668615 -618470 -605746 -608741 -593615 -568554 -561140 -533208 -525412 -539351 -571924 -580844 -588900
13476e88900k6139m1020k9972J254m9193m1721k4154l6963j7048q92l830J730
$$ -588900 -615039 -656059 -686031 -684777 -733970 -775691 -799845 -836808 -853856 -854748 -858578 -856848
13464h56848J5956J198J2689K5982j032k3764L407j626L05K8835j7358j3991Q815
$$ -856848 -840892 -839694 -827005 -801023 -802055 -825819 -822412 -824038 -823733 -794898 -812256 -826247 -817432
13451h17432L1704N323j288J0402J0663L8729k2496k7632o117O901M017J5235
$$ -817432 -785728 -780405 -781693 -771291 -760628 -721899 -744395 -772027 -778144 -771243 -767226 -751991
13439g51991J3638K0225Q67l8868k523L7943K467J0068L3716K1060P599m800j7393
$$ -751991 -738353 -718128 -717261 -756129 -758652 -720709 -718242 -708174 -674458 -653398 -645799 -650599 -667992
13426f67992l48M11J8955J9419k8248n3091m114J7658J6538J4137J5207j9437
$$ -667992 -668340 -667929 -648974 -629555 -657803 -710894 -715008 -697350 -680812 -666675 -651468 -670905
13414f70905m99j7006M739J5106K4705J363k2543p229K2629P156p633N933r61
$$ -670905 -671404 -688410 -683671 -668565 -643860 -642497 -665040 -672269 -649640 -642484 -650117 -644184 -645145
13401f45145K2307L3002l099k037J8090J0360j5191k7063j4257k8828P909L671
$$ -645145 -622838 -589836 -592935 -594972 -576882 -566522 -581713 -608776 -623033 -651861 -643952 -640281
13389f40281O436k0594j0654K4730J0131j6641O198J4270K1824J548l007J8687
$$ -640281 -633845 -654439 -665093 -640363 -630232 -646873 -640675 -626405 -604581 -603033 -606040 -587353
13377e87353K1953k4859j4820Q670K5589K4469J9914R869n7357j5011L3072J8850
$$ -587353 -565400 -590259 -605079 -596409 -570820 -546351 -526437 -516568 -573925 -588936 -555864 -537014
13365e37014k390j7862j1022J0089M3432L3739j013j3874J0581k5826R914r85
$$ -537014 -539404 -557266 -568288 -558199 -514767 -481028 -482041 -495915 -485334 -511160 -501246 -502231
13353e02231r967k4105J2282Q483J3502n837M7904O960n9964n12K6065j835k145
$$ -502231 -512198 -536303 -524021 -515538 -502036 -507873 -459969 -453009 -512973 -513485 -487420 -489255 -491400
13340d91400J738K515J7043J1975K9465j7470O165j4214j5883R291j2274R752
$$ -491400 -489662 -487147 -470104 -458129 -428664 -446134 -439969 -454183 -470066 -460775 -473049 -463297
13328d63297p59m2K9165J0117l9737q171J2512K1316j6809l916J5954o406P819
$$ -463297 -464056 -464098 -434933 -424816 -464553 -472724 -460212 -438896 -455705 -459621 -443667 -450073 -442254
13315d42254j9548j0767O690K56K6037Q260J8158k9528p978K6274Q404n823m6121
$$ -442254 -461802 -472569 -465879 -465623 -439586 -431326 -413168 -442696 -450674 -424400 -415996 -421819 -467940
13302d67940m771O1874N4423K7365m768n42j4783l3488j5346J8343l297J8481
$$ -467940 -472711 -410837 -356414 -329049 -333817 -334359 -349142 -382630 -397976 -379633 -382930 -364449
13290c64449J9919j5479j6354o754k8575m446L1697r573n352J1594Q128M618L139
$$ -364449 -344530 -360009 -376363 -383117 -411692 -416138 -384441 -394014 -399366 -387772 -379644 -375026 -371887
13277c71887J0329K7392K8366r587l6191l8671J9178L8741O85O423j2719M439
$$ -371887 -361558 -334166 -305800 -315387 -351578 -390249 -371071 -332330 -331645 -325222 -337941 -333502
13265c33502L0672j4942J0914P031k1016J068k9467j1746K7389J1693K0319J2765
$$ -333502 -302830 -317772 -306858 -299827 -320843 -319775 -349242 -360988 -333599 -321906 -301587 -288822
13253b88822l5848j1271K8588L658M215k7071k33L4118N6755J8367l1623j7088
$$ -288822 -324670 -335941 -307353 -303695 -299480 -326551 -326784 -292666 -235911 -217544 -249167 -266255
13241b66255m2183R875K8560Q659K4221L1829j2217J757J5606j0440k5672l0674
$$ -266255 -308438 -298563 -270003 -261344 -237123 -205294 -217511 -215754 -200148 -210588 -236260 -266934
13229b66934p494L690l768L561J0953K543J0516L2930j0604n8222O369l978J948
$$ -266934 -274428 -270738 -274506 -270945 -259992 -257449 -246933 -214003 -224607 -282829 -276460 -280438 -278490
13216b78490p159Q958m883K3278L8309K5180j1626j3977J8598J3452j125o140
$$ -278490 -285649 -276691 -281574 -258296 -219987 -194807 -206433 -220410 -201812 -188360 -189485 -195625
13204a95625J3469q744k7612p122j0134j5038n263N787J184Q61l083l697j1549
$$ -195625 -182156 -190900 -218512 -225634 -235768 -250806 -256069 -250282 -249098 -248237 -251320 -255017 -266566
13191b66566L922K1797L9498K4562K6376m341j0200j9298m0372l3357j8328J3048
$$ -266566 -262644 -240847 -201349 -176787 -150411 -154752 -164952 -184250 -224622 -257979 -276307 -263259
13179b63259L4010k1190J5018K8378J603k5808l244P428J3996N382l8083j4l985
$$ -263259 -229249 -250439 -235421 -207043 -205440 -231248 -234492 -227064 -213068 -207686 -245769 -245783 -249768
13166b49768K896J9513N0773N1285Q672j115n409K371K8569J6757R523l5903o0466
$$ -249768 -246872 -227359 -176586 -125301 -116629 -117744 -123153 -120782 -92213 -75456 -65933 -101836 -162302
13153a62302p9887n2116l7200R653L1315J1326j1773k8398J726K3152J717K5106
$$ -162302 -242189 -294305 -331505 -321852 -290537 -279211 -290984 -319382 -317656 -294504 -292787 -267681
13141b67681M9920K2245N134K1813n0495n310R039P929R542j1188j4328L4021
$$ -267681 -217761 -195516 -190382 -168569 -219064 -224374 -215335 -207406 -197864 -209052 -223380 -189359
13129a89359j1757k95P459p658K919j696R443L4752j2157j5544L2450K3030l602
$$ -189359 -201116 -201411 -193952 -201610 -198691 -200387 -190944 -156192 -168349 -183893 -151443 -128413 -132015
13116a32015L571J2030M8014P2521j0041m2051k0965p4750r7948l3699j0402k0809
$$ -132015 -128444 -116414 -68400 4121 -5920 -47971 -68936 -143686 -241634 -275333 -285735 -306544
13104c06544m0737P649K6790J4768O18J1264J3625K0144L7619M219Q018k2265
$$ -306544 -347281 -339632 -312842 -298074 -297456 -286192 -272567 -252423 -214804 -210585 -202567 -224832
13092b24832M30J6266K9895l8758r563K6769K6692J2751O326q245L5024K4438
$$ -224832 -224402 -208136 -178241 -216999 -226562 -199793 -173101 -160350 -154024 -162269 -127245 -102807
13080a02807l0898p631l050J029o887K5307j7780l5283O902L4259P128k1826K4489
$$ -102807 -133705 -141336 -144386 -143357 -150244 -124937 -142717 -178000 -171098 -136839 -129711 -151537 -127048
13067a27048N0114l0323l3853j8229J428P056k216k4067j4933P676N4647K6108
$$ -127048 -76934 -107257 -141110 -159339 -157911 -150855 -153071 -177138 -192071 -184395 -129748 -103640
13055a03640l8506j8568Q521K8516M0153o161l5642J471K7921L415J8678n137
$$ -103640 -142146 -160714 -152193 -123677 -83524 -89685 -125327 -123856 -95935 -92520 -73842 -78979
13043g8979k0862m1060J205J3663J2239q501L981K4862o697k0725J1355K3452
$$ -78979 -99841 -140901 -139696 -126033 -113794 -122295 -118314 -93452 -100149 -120874 -109519 -86067
13031h6067J6332J2206j0759j7055j502O818L426j15k867J6198k653k787K7849
$$ -86067 -69735 -57529 -68288 -85343 -86845 -80027 -76601 -76716 -79583 -63385 -66038 -68825 -40976
13018d0976J4728L863R628j1724m4538k1642q796J1932K2565Q414k151j2021j6064
$$ -40976 -26248 -22385 -12757 -24481 -69019 -90661 -99457 -87525 -64960 -56546 -58697 -70718 -86782
13005h6782J1873J8323L1731p234n696L81M42m054k2726l638J2459M582K8315
$$ -86782 -74909 -56586 -24855 -32089 -37785 -37404 -36962 -41016 -63742 -67380 -54921 -50339 -22024
12992b2024j4551K1608J0712P540j16J3633J7476j2478N640J2427P749j7794o881
$$ -22024 -36575 -14967 -4255 3285 3169 16802 34278 21800 27440 39867 47616 29822 22941
12979B2941J9538p774j7414m761N618m893n1116p428n974K2498J2119j8821j4037
$$ 22941 42479 34705 17291 12530 18148 13255 -37861 -45289 -51263 -28765 -16646 -35467 -49504
12966d9504K6675L4503Q270K84L0322K0898q404j845j1909k332l7280l2092L954
$$ -49504 -22829 11674 19944 20228 50550 71448 63044 61199 49290 46958 9678 -22414 -18460
12953a8460Q615j0301P405P045K3692M728R229J8345o444O471j3044m1569p815
$$ -18460 -9845 -20146 -12741 -5696 17996 22724 31953 50298 43854 50325 37281 -4288 -12103
12940a2103J8065N3053L5037j6858l2073r138K7142J2487k892j0767K5683k9949
$$ -12103 5962 59015 94052 77194 45121 35983 63125 75612 72720 61953 87636 57687
12928E7687j2317N408K3914N090O083j4320l5315q066M6571L8270J4019r25k4975
$$ 57687 45370 50778 74692 79782 85865 71545 36230 28164 74735 113005 127024 126099 101124
12915A01124m8044M3356J8311p261k256j5460n249J9154l582j7334k242r69j4129
$$ 101124 53080 96436 114747 107486 105230 89770 84521 103675 100093 82759 80517 79548 65419
12902F5419N685l652K0089M641j718K4184L4177q43m3424j6976J4540K418k8583
$$ 65419 71104 67452 87541 92182 90464 114648 148825 147982 104558 87582 102122 104540 75957
12889G5957j9079J6623M176J8576M428j0333j3760J3568J6870j873o575K5390
$$ 75957 56878 73501 77677 96253 100681 90348 76588 90156 107026 105153 98578 123968
12877A23968j7108M1193j1873j6880m712j2162J9923k11L5402n491j4099k237
$$ 123968 106860 148053 136180 119300 114588 102426 122349 122138 157540 152049 137950 135713
12865A35713Q315K7005K3869J0107k1143q789l785N041P590J1176J2603j7022
$$ 135713 144028 171033 194902 205009 183866 175077 171292 176333 183923 195099 207702 190680
12853A90680l2011j7207j8147l9129l1148j5335L7248K3875p466M418M0036J3314
$$ 190680 158669 141462 123315 84186 53038 37703 74951 98826 91360 95778 135814 149128
12841A49128r858K970j3327r053J0822L8152L2287Q666K24R897q254m560p232
$$ 149128 139270 142240 128913 119860 130682 168834 201121 209787 210011 219908 211654 207094 199862
12828A99862j09p955M466m550J8478r703J3421j9723L9133J5933k1530R504l259
$$ 199862 199753 191798 196264 191714 210192 200489 213910 194187 233320 249253 227723 237227 233968
12815B33968R507J023K377j1418k3184M5224L1505j44k3346n954k5383j1598p26
$$ 233968 243475 244498 246875 235457 212273 257497 289002 288858 265512 259558 234175 222577 221851
12802B21851J9760P980l5922k0988J6941r330k6555j1338J1988k1353K1776N342
$$ 221851 241611 249591 213669 192681 209622 200292 173737 162399 174387 153034 174810 180152
12790A80152P440l4160M573M6219K1501j5315Qj5520L0143j5055k3088m1438j9004
$$ 180152 187592 153432 158005 204224 225725 210410 210418 194898 225041 209986 186898 145460 126456
12777A26456L6797N1780P263O697p03N541J3346j4519J2233J5554R033j8433k1367
$$ 126456 163253 215033 222296 228993 228290 233831 247177 232658 244891 260445 269478 251045 229678
12764B29678Q011q783j562L1878M7173r815k396j1204Q206O871k5592j0139j839
$$ 229678 237689 228906 227344 259222 306395 296580 294184 282980 291186 298057 272465 262326 260487
12751B60487Q980m057J6079L5832N618K9222J6323l0989m5670Q955p365j1364
$$ 260487 269467 265410 281489 317321 322939 352161 368484 337495 291825 300780 293415 282051
12739B82051J395j951k5187Q708M2642M204O687m405K3705l9731n237K5230J6575
$$ 282051 283446 281495 256308 265016 307658 311862 318549 314144 337849 298118 292881 318111 334686
12726C34686j6306m5269j7983K7557L901m55M1545P833l2410k942o314r81O284
$$ 334686 318380 273111 255128 282685 286586 286131 327676 335509 303099 300157 293843 292862 299146
12713B99146O462k4940j6947J8117K6850j390j8069j6623J8874K5447k5491m02
$$ 299146 305608 280668 263721 281838 308688 307298 289229 272606 291480 316927 291436 291034
12701B91034J6076l2768J7331J6248K8036N598J1713J1422J7K643k5796m7644
$$ 291034 307110 274342 291673 307921 335957 341555 353268 364690 364707 367350 341554 293910
12689B93910N082J4643n902j4348J5802M2864K0294Q903l5174l142l4855K5492
$$ 293910 298992 313635 307733 293385 309187 352051 372345 381248 346074 342932 308077 333569
12677C33569M8751J5475N539m1717N27K667K0996Q631l6516j7985K3611J9532
$$ 333569 382320 397795 403334 361617 362144 364811 385807 394438 357922 339937 363548 383080
12665C83080j5977P539Q847J9656J554l0846m5538kJ2117k4812r311K5293O5352
$$ 383080 367103 374642 383489 403145 404699 373853 328315 328313 340430 315618 306307 331600 396952
12652C96952O482O196J3030J3750j2731J757l7876l0696J1877L2880q098L674
$$ 396952 403434 409630 422660 436410 423679 425436 387560 356864 368741 401621 393523 397197
12640C97197k3885K3919L0857M4544l101O609K60k2826j3308j7717k4091j1871
$$ 397197 373312 397231 428088 472632 469531 476140 476400 453574 440266 422549 398458 386587
12628C86587l5650P783M8804R559k951L906J0819M5358m197k5850j3504j8803
$$ 386587 350937 358720 407524 417083 414132 418038 428857 474215 470018 444168 430664 411861
12616D11861k0039j6078K7431K6625p092L0548M4539M412J4123J9141j9852k3519
$$ 411861 391822 375744 403175 429800 422708 453256 497795 502207 516330 535471 515619 492100
12604D92100k4652o630N538P443l4297R25p125J6135R070j3629K174j5149j156
$$ 492100 467448 460818 466356 473799 439502 440427 433302 449437 458507 444878 447052 431903 430747
12591D30747L0297J2331m95k417K354j442j0456R535K7372O271r502J785k5906
$$ 430747 461044 473375 472880 470463 472817 471375 460919 470454 497826 504097 494595 496380 470474
12578D70474J8463l63K1510K7939M523k9392k3631K1603Q320l573j9645Q535J6120
$$ 470474 488937 488574 510084 538023 542546 513154 489523 511126 519446 515873 496228 504763 520883
12565E20883J2733j84m660l0766P246L3641K08j7249L467Q890k7401m7892J4916
$$ 520883 533616 533432 528772 498006 505252 538893 539101 521852 525319 534209 506808 458916 473832
12552D73832M6078L5139K1753J4309l2819p508L109O392O811J3097K2628L903
$$ 473832 519910 555049 576802 591111 558292 550784 553893 560285 567096 580193 602821 606724
12540F06724l482J0179j9977J349Q257K8926M606l013J0165r755K5J1445N668
$$ 606724 603242 613421 593444 594793 603050 631976 636582 633569 643734 633979 634004 645449 651117
12527F51117j9488j248K0603k0877j5756J5121L6966N923j6002k6863m5130n377
$$ 651117 631629 630381 650984 630107 614351 629472 666438 672361 656359 629496 584366 578989
12515E78989p295k2475J0571R900Q117L1057P604j9349j788M0866J5488J7156
$$ 578989 571694 549219 559790 569690 577807 608864 616468 597119 595331 636197 651685 668841
12503F68841J180J916k3135k5900M088K193K4631K6897j3882l4188J1921k641
$$ 668841 670021 671937 648802 622902 626990 629183 653814 680711 666829 632641 644562 641921
12491F41921j305K6542J8295M192k8892K0680R152o800K637J2696j1777J9412
$$ 641921 640616 667158 685453 689645 660753 681433 690585 683785 686422 699118 687341 706753
12479G06753J1903o618r511J158K5475k0118l292l247L8919L2172l902o8269m2985
$$ 706753 718656 712038 702527 703685 729160 709042 705750 702503 741422 773594 769692 701423 658438
12466F58438q445K3468M3109J1917O949J3026L4855J0526j8949Q833j063j8937
$$ 658438 649993 673461 716570 728487 735436 748462 783317 793843 774894 783727 782664 763727
12454G63727q784j333K1634K1577J2974j7138j1026j701j039J2916R775Q061L1390
$$ 763727 754943 753610 775244 796821 809795 792657 781631 779930 778891 791807 801582 809643 841033
12441H41033L3553Q648J2239K8798O7951J555q593k8037l1241m7044n9544n7286
$$ 841033 874586 883234 895473 924271 992222 993777 985184 957147 925906 878862 819318 762032
12429G62032l2515n3731j4844o127j9602m795k3640L7861L2329m0351p133J6383
$$ 762032 729517 675786 660942 654815 635213 630418 606778 644639 676968 636617 629484 645867
12417F45867J7043J4441J4847P970M342r495q386K2530L0743J638m2380j8570
$$ 645867 662910 677351 692198 700168 704510 695015 686629 709159 739902 741540 699160 680590
12405F80590J8836J7727k0369L3580J8608L6772M112Q631K152K7913P908P129
$$ 680590 699426 717153 696784 730364 748972 785744 789856 798487 800639 828552 836460 843589
12393H43589j66k8503K3390K2847j3909l7685j4415J6943L173K0038k21K9063
$$ 843589 843423 814920 838310 861157 847248 809563 795148 812091 815264 835302 835081 864144
12381H64144L0277R149j3805O202k292l3565L2321J6567P600K3571L0794L5802
$$ 864144 894421 903570 889765 895967 893675 860110 892431 908998 916598 940169 970963 1006765
12369A006765l4888K6720L9769j8727j00235j33798p4074k7760k69K399J4089
$$ 1006765 971877 998597 1038366 1019639 919404 785606 711532 683772 683503 685902 699991
12358F99991N636J7706R203j5705L1913K4879J2604J4817k581K156n572j1430
$$ 699991 705627 723333 732536 716831 748744 773623 786227 801044 798463 800619 795047 783617
12346G83617K0765L1562M3859K4650j9911m312N560L83k208O517j5105J4073R278
$$ 783617 804382 835944 879803 904453 884542 880230 885790 886173 883965 890482 875377 889450 898728
12333H98728n755J5340j2495o126K372j0967J5022j1731k3685L4115J8843J6287
$$ 898728 892973 908313 895818 889692 892064 881097 896119 884388 860703 894818 913661 929948
12321I29948M274m5638j368L1474L0920K5752k5284l0453K425J8700o062J1968
$$ 929948 934222 888584 887216 918690 949610 975362 950078 919625 922050 940750 934688 946656
12309I46656L5788J298l286R717J156j0207R811l3030P831L5264j5203k1618J8939
$$ 946656 982444 983742 980456 990173 991329 981122 990933 957903 965734 1000998 985795 964177 983116
12296I83116L8242j3924k2716J6970K3108n362o162o993p210j7649J1180N978
$$ 983116 1021358 1007434 984718 1001688 1024796 1019434 1013272 1006279 999069 981420 992600 998578
12284I98578K7886K1290k4787k9562J4601Q845J6201o015J1797M462J2763R103
$$ 998578 1026464 1047754 1022967 993405 1008006 1016851 1033052 1027037 1038834 1043296 1056059 1065162
12272A065162P55J9090Q609Q503K3169M6402k3563J4583J8895q74q356k2761m6189
$$ 1065162 1065917 1085007 1093616 1102119 1125288 1171690 1148127 1162710 1181605 1180731 1172375 1149614 1103425
12259A103425K0457K6303K7917Q027P171J1235j8960p502j56j617N1519L6506
$$ 1103425 1123882 1150185 1178102 1186129 1193300 1204535 1185575 1178073 1177917 1176300 1227819 1264325
12247A264325p149k9734j5334N367J7746J1899k2669k4070k763M338J899r081
$$ 1264325 1257176 1227442 1212108 1217475 1235221 1247120 1224451 1200381 1197618 1201956 1203855 1194774
12235A194774J672K4533J5442Q391J5888J9771j8688m8698k1433K0573M2755P830
$$ 1194774 1196446 1220979 1236421 1244812 1260700 1280471 1261783 1213085 1191652 1212225 1254980 1262810
12223A262810j3954o519P059J1806J8186K644K0188j0311K4369K4957j4587j0712
$$ 1262810 1248856 1242337 1249396 1261202 1279388 1282032 1302220 1291909 1316278 1341235 1326648 1315936
12211A315936R58J3517J9453J4852K240j9540l5367k1867L078J9973L4888j4678
$$ 1315936 1316894 1330411 1349864 1364716 1366956 1347416 1312049 1290182 1293260 1313233 1348121 1333443
12199A333443J925M8677N730q323r518R404M5259J503k1194l2460J2166n070M041
$$ 1333443 1335368 1384045 1389775 1381452 1371934 1381338 1426597 1428100 1406906 1374446 1386612 1381542 1385583
12186A385583J7274K1425J8416N919P371K7002J4322j8021k2341j2005J9416K2298
$$ 1385583 1402857 1424282 1442698 1448617 1455988 1482990 1497312 1479291 1456950 1444945 1464361 1486659
12174A486659J1731P428m980j7336p126Q403M550O985j2609Q460l325P613j4168
$$ 1486659 1498390 1505818 1500838 1483502 1476376 1484779 1489329 1496314 1483705 1492165 1488840 1496453 1482285
12161A482285k6531l549Q532L9153N4079J1389j8438K674L966N595K9067L1945
$$ 1482285 1455754 1452205 1460737 1499890 1553969 1565358 1546920 1549594 1553560 1559155 1588222 1620167
12149A620167j6992k2877j0213k0725J6577N7891J7488K151L5244j1946n790j726
$$ 1620167 1603175 1580298 1570085 1549360 1565937 1623828 1641316 1643467 1678711 1666765 1660975 1659249
12137A659249M3086M7000L434n810K4320J7466M579r090m289j3376Q98Q746O263
$$ 1659249 1702335 1749335 1752769 1746959 1771279 1788745 1793324 1784234 1779945 1766569 1767467 1776213 1782476
12124A782476J2119J02l6998K775R056L0794n0904j2569R670j3628n934J396K7693
$$ 1782476 1794595 1794697 1757699 1760474 1769530 1800324 1749420 1736851 1746521 1732893 1726959 1728355 1756048
12111A756048N8370L0373L1304K8287k9238j9771J9788J7582l555L9809K0261
$$ 1756048 1814418 1844791 1876095 1904382 1875144 1855373 1875161 1892743 1889188 1928997 1949258
12100A949258k9037K8876L5386o19L358J565p131J041K6718J5632o908M446R245
$$ 1949258 1920221 1949097 1984483 1983864 1987222 1988787 1981656 1982697 2009415 2025047 2018139 2022585 2031830
12087B031830J2025Q937n727L6739M3235o316O026p958J1308q787L0365M8955
$$ 2031830 2043855 2052792 2047065 2083804 2127039 2120723 2126749 2118791 2130099 2121312 2151677 2200632
12075B200632K7130L4680J4389l3008l5603j4111L4403M3903L0399L9074P826
$$ 2200632 2227762 2262442 2276831 2243823 2208220 2194109 2228512 2272415 2302814 2341888 2349714
12064B349714K990k0852l4670P591N6711O0288j076j9962K1130M2424L8581J4176
$$ 2349714 2352704 2331852 2297182 2304773 2361484 2421772 2420696 2400734 2421864 2464288 2502869 2517045
12052B517045J3439j5936k8684N5325K1076p201L2655K4968P006L4144M0008L0640
$$ 2517045 2530484 2514548 2485864 2541189 2562265 2555064 2587719 2612687 2619693 2653837 2693845 2724485
12040B724485K8322M3168K7888J5195n600N3548L9487K0772k4854l5869j2010
$$ 2724485 2752807 2795975 2823863 2839058 2833458 2887006 2926493 2947265 2922411 2886542 2874532
12029B874532N7898M3230L4644N6720J2995K7573J2151J7109O572K0344R768L6679
$$ 2874532 2932430 2975660 3010304 3067024 3080019 3107592 3119743 3136852 3143424 3163768 3173536 3210215
12017C210215K8637L9372M6729K3258J0313K5239J9581R191O2472L8411P29J4071
$$ 3210215 3238852 3278224 3324953 3348211 3358524 3383763 3403344 3412535 3475007 3513418 3514147 3528218
12005C528218N3773L9917K5940M7534N6234J9371L0320K2943N4326O7750K2270
$$ 3528218 3581991 3621908 3647848 3695382 3751616 3770987 3801307 3824250 3878576 3946326 3968596
11994C968596J8403M1862L8167M3154M7946O8179L1348j1360J8788O8110Q1525
$$ 3968596 3986999 4028861 4067028 4110182 4158128 4226307 4257655 4246295 4265083 4333193 4414718
11983D414718O5107L2473O7623O4102J09380J00996M9707N6661N9196N7871P3930
$$ 4414718 4479825 4512298 4579921 4644023 4753403 4854399 4904106 4960767 5019963 5077834 5151764
11972E151764N6139L5251J05252J49020J08183R5016J13255R0843R7385Q0165
$$ 5151764 5207903 5243154 5348406 5497426 5605609 5700625 5813880 5904723 6002108 6082273
11962F082273Q2255J12335R6567J08403J28683J56067J32413J56307J61355R2287
$$ 6082273 6164528 6276863 6373430 6481833 6610516 6766583 6898996 7055303 7216658 7308945
11952G308945J52873K09308K11760K49102K47479K30694K32384K78790K88073
$$ 7308945 7461818 7671126 7882886 8131988 8379467 8610161 8842545 9121335 9409408
11943I409408L14416L59858L90019L81728M40375M65344N61597O33188O28838
$$ 9409408 9723824 10083682 10473701 10855429 11295804 11761148 12322745 12955933 13584771
11934A3584771P11624P89849P76880Q07989J021188J240989J470943J702792J950337
$$ 13584771 14296395 15086244 15863124 16671113 17692301 18933290 20404233 22107025 24057362
11925B4057362K249124K674669L301612L918640M157146L064366k591447j6609564
$$ 24057362 26306486 28981155 32282767 36201407 40358553 43422919 40831472 24221908
11917B4221908k7561130j9409615p964230j539444J575290K573009K549681K288687
$$ 24221908 -3339222 -22748837 -30713067 -32252511 -30677221 -28104212 -25554531 -23265844
11909b3265844K040532J871845J730503J483133J273881J065308R26818P23402
$$ -23265844 -21225312 -19353467 -17622964 -16139831 -14865950 -13800642 -12873824 -12150422
11901a2150422O87866O62119N92604N16537M44910L25590L45002L10851K41396
$$ -12150422 -11462556 -10800437 -10207833 -9691296 -9246386 -8920796 -8575794 -8264943 -8023547
11892h023547K22124K39043K60694K50146K45161K42116K17442J93143J53271
$$ -8023547 -7801423 -7562380 -7301686 -7051540 -6806379 -6564263 -6346821 -6153678 -6000407
11883f000407J27123J67080J33841M3476k5281J4211O4389N7018M1986K8573P6986
$$ -6000407 -5873284 -5706204 -5572363 -5528887 -5554168 -5539957 -5475568 -5418550 -5376564 -5347991 -5271005
11872e271005J19269M7179N4898J04517J03815O6088R9294R9571R3692P8228O3822
$$ -5271005 -5151736 -5104557 -5049659 -4945142 -4841327 -4775239 -4675945 -4576374 -4482682 -4404454 -4340632
11861d340632R3745J04578R5198R1991Q2177O6347O2747N9569P9343P6540N4524
$$ -4340632 -4246887 -4142309 -4047111 -3955120 -3872943 -3806596 -3743849 -3684280 -3604937 -3528397 -3473873
11850c473873N9102M1504K9165Q8262J03920P8895Q0010R3846M3428L2605N0005
$$ -3473873 -3414771 -3373267 -3344102 -3255840 -3151920 -3073025 -2993015 -2899169 -2855741 -2823136 -2773131
11839b773131N6774N3272L871M2654O9756K3374P8010M6721L7327L8203O5945
$$ -2773131 -2716357 -2663085 -2659214 -2616560 -2546804 -2523430 -2445420 -2398699 -2361372 -2323169 -2257224
11828b257224J7743J3494J6620P1371O9422M3173M2030L3447M2516O3527K1135
$$ -2257224 -2239481 -2225987 -2209367 -2137996 -2068574 -2025401 -1983371 -1949924 -1907408 -1843881 -1822746
11817a822746K4236M1696k914K709M0172Q340J3855L8646O3914L5991K2733L4181
$$ -1822746 -1798510 -1756814 -1759728 -1757019 -1716847 -1708507 -1694652 -1656006 -1592092 -1556101 -1533368 -1499187
11805a499187M0666M2719M0650O004k7498J8176N7919L5125M4421K3640K6584
$$ -1499187 -1458521 -1415802 -1375152 -1369148 -1396646 -1378470 -1320551 -1285426 -1241005 -1217365 -1190781
11794a190781M5041L9691J5707j3967l2314J2390L455l9170j4079K0371O5247
$$ -1190781 -1145740 -1106049 -1090342 -1104309 -1136623 -1124233 -1120778 -1159948 -1174027 -1153656 -1088409
11783a088409M3313M567K520L558M4727J0036J6520M7392L8454k2859J5102O1289
$$ -1088409 -1045096 -1040529 -1038009 -1034451 -989724 -979688 -963168 -915776 -877322 -900181 -885079 -823790
11771h23790M9814L4362j5179P563K6229K2935K4163N3376K843J7425n169j2046
$$ -823790 -773976 -739614 -754793 -747230 -721001 -698066 -673903 -620527 -617684 -600259 -605428 -617474
11759f17474J2332L5961J6636L2995R758J5580K4940l2989k9491M9R307K7594
$$ -617474 -605142 -569181 -552545 -519550 -509792 -494212 -469272 -502261 -531752 -531703 -522396 -494802
11747d94802L4677M6897K6930k437R759o403R462M0225J1657J8271J3231N302
$$ -494802 -460125 -413228 -386298 -388735 -378976 -385379 -375917 -335692 -324035 -305764 -292533 -287231
11735b87231k4192j1298j6725J7285K7959N5379J7865J9854K3566j7225k0063
$$ -287231 -311423 -322721 -339446 -322161 -294202 -238823 -220958 -201104 -177538 -194763 -214826
11724b14826l364M9316L2370j6886k3344J4176K5917L3838l1853L4834k73N702
$$ -214826 -218190 -168874 -136504 -153390 -176734 -162558 -136641 -102803 -134656 -99822 -100095 -94393
11712i4393k692l0J9673n378J8507m89j3786j7663J4564R725J3948K1916M17K0051
$$ -94393 -97085 -97115 -77442 -82820 -64313 -64802 -78588 -96251 -81687 -71962 -58014 -36098 -35681 -15630
11698a5630J1906J0422L3017J6139J6022L97j3240K4210L4180q026j4475m744
$$ -15630 -3724 6698 39715 55854 71876 72273 59033 83243 117423 109397 94922 90178
11686I0178j2181L7377N0502L1315P001j0988J2327J6271j1799K4607K9490j4914
$$ 90178 77997 115374 165876 197191 204192 193204 205531 221802 210003 234610 264100 249186
11674B49186j2189j509J9972K4478j8710m613J7249M191L2974J7169M631n004
$$ 249186 236997 235488 255460 279938 261228 256615 273864 278055 311029 328198 332829 327825
11662C27825K1415J2210j626o709j399L3952J2259k006J5412K1399k0325L405
$$ 327825 349240 361450 359824 353115 351716 385668 397927 395921 411333 432732 412407 415812
11650D15812K686K0272L5723K3079J5675K389m316M73O906l412n6782j7193j848
$$ 415812 418498 438770 474493 497572 513247 515636 511320 511793 518699 515287 458505 441312 439464
11637D39464K4193O856l6092l573K5493J0332L0399O432p1k5896L7676K425n075
$$ 439464 463657 470513 434421 430848 456341 466673 497072 503504 503433 477537 515213 517638 512563
11624E12563J1208M1790L4571K1466J7938l5333K1937N625j650j0344Q291K7009
$$ 512563 523771 565561 600132 621598 639536 604203 626140 631765 630115 619771 628062 655071
11612F55071L5874J2902k7889j7625M531k072M925N6886K6448k2320m1645P36
$$ 655071 690945 703847 675958 658333 662864 660792 665717 722603 749051 726731 685086 685822
11600F85822N8006J2286j6130n151j3317l133m402N690j424N473o447r130k0540
$$ 685822 743828 756114 739984 734833 721516 718383 713981 719671 718247 723720 717273 708143 687603
11587F87603P599O0960q731O388M8117K0582m185k5407j8313j340P207K039J0474
$$ 687603 695202 756162 747431 753819 801936 822518 818333 792926 774613 773273 780480 782519 792993
11574G92993R650J8751J0666J3390p210K1185L0971o615q192L232k1807K9038
$$ 792993 802643 821394 832060 845450 838240 859425 890396 883781 875589 878821 857014 886052
11562H86052L3522q680J5949r039K0159Q057j216K1801M1432j9956o773J0586
$$ 886052 919574 910894 926843 917804 937963 946020 944804 966605 1008037 988081 981308 991894
11550I91894o636j1156N433K4298L2434K4427K5230q049R041J1720Q006k0244
$$ 991894 985258 974102 979535 1003833 1036267 1060694 1085924 1077875 1086916 1098636 1106642 1086398
11538A086398l0658m261K104p727K4926L6753j1954L8495K7823L335L7986K4211
$$ 1086398 1055740 1051479 1053583 1045856 1070782 1107535 1095581 1134076 1161899 1165234 1203220 1227431
11526A227431J020k5829J3684L976M5142j5290n5881j6228o01L6000M3611J8583
$$ 1227431 1228451 1202622 1216306 1220282 1265424 1250134 1194253 1178025 1177424 1213424 1257035 1275618
11514A275618J4730o443P87j1688o585J9949K0670K10M059K5276k857k957K8967
$$ 1275618 1290348 1283905 1284692 1273004 1266419 1286368 1307038 1307248 1311307 1336583 1333726 1330769 1359736
11501A359736J4625m614K1069j1110l104J4602L1108J5558J995K3020L0688K7649
$$ 1359736 1374361 1369747 1390816 1379706 1376602 1391204 1422312 1437870 1439865 1462885 1493573 1521222
11489A521222j9857j4231O202J2477N187K3600j2218M1613K7012j5297k009J7522
$$ 1521222 1501365 1487134 1493336 1505813 1511000 1534600 1522382 1563995 1591007 1575710 1573701 1591223
11477A591223J9420L6084L429R92L2577K0665J555j0991L3677P9746K8009k7321
$$ 1591223 1610643 1646727 1650156 1651148 1683725 1704390 1705945 1694954 1728631 1808377 1836386 1809065
11465A809065o923n9534j16921o5959m1836k6041J1250L6130M6715J7551L2948
$$ 1809065 1802142 1742608 1625687 1559728 1517892 1491851 1503101 1539231 1585946 1603497 1636445
11454A636445N4327l605m725J2201K133L3162K1246j3535m251k5649j7856K9144
$$ 1636445 1690772 1687167 1682442 1694643 1696776 1729938 1751184 1737649 1733398 1707749 1689893 1719037
11442A719037L9432K0649J8221K6778o980K4312M5460K0283Q604N5024J1560J2053
$$ 1719037 1758469 1779118 1797339 1824117 1817137 1841449 1886909 1907192 1915796 1970820 1982380 1994433
11430A994433K4969Q146j014j1257M6918M9719L6729j504L0861K6713N0662O5648
$$ 1994433 2019402 2027548 2026534 2015277 2062195 2111914 2148643 2147139 2178000 2204713 2255375 2321023
11418B321023P9695P0080R2641Q9634Q1522K1952j38857m51827m87646k58382
$$ 2321023 2400718 2470798 2563439 2653073 2734595 2756547 2617690 2165863 1678217 1419835
11408A419835j59246n5711J6719N2663O9394P0556M4806L4542K4262N4409N1792
$$ 1419835 1260589 1204878 1221597 1274260 1343654 1414210 1459016 1493558 1517820 1572229 1624021
11397A624021K6540M2031J8524J0720M712L3811L4778J5731L7054k5850J6249
$$ 1624021 1650561 1692592 1711116 1721836 1726548 1760359 1795137 1810868 1847922 1822072 1838321
11386A838321M3441O783M60Q394J5279L0653q462L0049R033j2269K8517M4663
$$ 1838321 1881762 1888545 1889005 1897399 1912678 1943331 1934869 1964918 1973951 1961682 1990199 2034862
11374B034862J7558J0958M925J9026M2373K4436P633P78J2099q816p374K6608
$$ 2034862 2052420 2063378 2068303 2087329 2129702 2154138 2161771 2162549 2174648 2165832 2158458 2185066
11362B185066l57R194L8918Q737r821m608j0361J3531J1059J3623N1562J6947
$$ 2185066 2184709 2193903 2232821 2241558 2231737 2227129 2216768 2230299 2241358 2254981 2306543 2323490
11350B323490L6034k4284K644J1523J2842p741q851j8828M4695M9008J5932K4807
$$ 2323490 2359524 2335240 2337884 2349407 2362249 2354508 2345657 2326829 2371524 2420532 2436464 2461271
11338B461271j0900J7932M5723J9400K4890M9185K6977K0933J8207m6308q386
$$ 2461271 2450371 2468303 2514026 2533426 2558316 2607501 2634478 2655411 2673618 2627310 2618924
11327B618924K6072M4535j121J0440N3378K6349L2754J3475J7237J6840M8134
$$ 2618924 2644996 2689531 2688410 2698850 2752228 2778577 2811331 2824806 2842043 2858883 2907017
11316B907017K2866k9855l0126l4066o715K9519J5018j0951j6954J9108N3577
$$ 2907017 2929883 2900028 2869902 2835836 2829121 2858640 2873658 2862707 2845753 2864861 2918438
11305B918438J0317R008J2778J4018r169K0088J2986m688J949P835M5404N5847
$$ 2918438 2928755 2937763 2950541 2964559 2955390 2975478 2988464 2983776 2985725 2993560 3038964 3094811
11293C094811N0359R854l0235j088J2207J3412N4796O2037K0706K8429N953k8865
$$ 3094811 3145170 3155024 3124789 3123701 3135908 3149320 3204116 3266153 3286859 3315288 3321241 3292376
11281C292376Q354Q109J3920N8020J2355j3537J146L3372L3906K8434J7956L519
$$ 3292376 3300730 3308839 3322759 3380779 3393134 3379597 3380743 3414115 3448021 3476455 3494411 3497930
11269C497930K1894M8604J9710O130r05K3040l44J5205K1487K8532P889K2110
$$ 3497930 3519824 3568428 3588138 3594268 3593363 3616403 3616059 3631264 3652751 3681283 3689172 3711282
11257C711282k0298J579m5339k7937p673L9661P1388O6958L1132j1089j3826J8972
$$ 3711282 3690984 3692563 3647224 3619287 3611614 3651275 3722663 3789621 3820753 3809664 3795838 3814810
11245C814810j870J0903j6425J531K5396M3273M1321K0828J7775j8364J4306L3073
$$ 3814810 3812940 3823843 3807418 3808949 3834345 3877618 3918939 3939767 3957542 3939178 3953484 3986557
11233C986557L8614M0424K1244k653K0050N5499j5159M2002Q2779K6919K2142
$$ 3986557 4025171 4065595 4086839 4084186 4104236 4159735 4144576 4186578 4269357 4296276 4318418
11222D318418R70l452N9226L2979m447J0923N2867K0788L4442K8653O21J9644
$$ 4318418 4319388 4315936 4375162 4408141 4403694 4414617 4467484 4488272 4522714 4551367 4551988 4571632
11210D571632O4201Q952j6127L7538K2271M3605O1145O4744J2311K6301N188O885
$$ 4571632 4635833 4644785 4628658 4666196 4688467 4732072 4793217 4857961 4870272 4896573 4901761 4908646
11198D908646K7663L3233N7776M5553L5931K6329K2110J2065L3340L8585M9387
$$ 4908646 4936309 4969542 5027318 5072871 5108802 5135131 5157241 5169306 5202646 5241231 5290618
11187E290618K2939N2250K2036j3302p087M4298P5560N8166L4396L5375O3797
$$ 5290618 5313557 5365807 5387843 5374541 5367454 5411752 5487312 5545478 5579874 5615249 5679046
11176E679046J0628K6515M7809L1520M5607L2059l095N1466Q8005O8103K5598
$$ 5679046 5689674 5716189 5763998 5795518 5841125 5873184 5870089 5921555 6009560 6077663 6103261
11165F103261K5533J1889L0011M6056M9349Q5948M6899K6218M5004K9320M3521
$$ 6103261 6128794 6140683 6170694 6216750 6266099 6352047 6398946 6425164 6470168 6499488 6543009
11154F543009N8143O6561N2910M5367M0565N5336N8866M8863P0291O7329M7166
$$ 6543009 6601152 6667713 6720623 6765990 6806555 6861891 6920757 6969620 7039911 7107240 7154406
11143G154406L8495O2218R6208R9159Q8592R4949N4229p977m641N9740O7925N6655
$$ 7154406 7192901 7255119 7351327 7450486 7539078 7634027 7688256 7680279 7675638 7735378 7803303 7859958
11131G859958Q1682R0650N6049J00335J16457Q3178R7598O1748K9210N9398Q6153
$$ 7859958 7941640 8032290 8088339 8188674 8305131 8388309 8485907 8547655 8576865 8636263 8722416
11120H722416P1829Q9822N9896O7024M4277Q1768Q0183J09872Q4148R9515J08226
$$ 8722416 8794245 8884067 8943963 9010987 9055264 9137032 9217215 9327087 9411235 9510750 9618976
11109I618976J10098R0804J03017R0680J22608J13905J00316J31696J04766J07438
$$ 9618976 9729074 9819878 9922895 10013575 10136183 10250088 10350404 10482100 10586866 10694304
11099A0694304J09229P7452J06671J31110J35214J48319J04375J17967J44079
$$ 10694304 10803533 10880985 10987656 11118766 11253980 11402299 11506674 11624641 11768720
11090A1768720J61918J38924J39834J34574J40770J44031J43042J99254J68641
$$ 11768720 11930638 12069562 12209396 12343970 12484740 12628771 12771813 12971067 13139708
11081A3139708J59378J36342J42132J36194J70366J92018J91073K17981K23202
$$ 13139708 13299086 13435428 13577560 13713754 13884120 14076138 14267211 14485192 14708394
11072A4708394K20047K02345K48588K35221K50926K03239K20361L19811L08367
$$ 14708394 14928441 15130786 15379374 15614595 15865521 16068760 16289121 16608932 16917299
11063A6917299K65597K72957K69093L06654L01909L14843L21620K96799K95465
$$ 16917299 17182896 17455853 17724946 18031600 18333509 18648352 18969972 19266771 19562236
11054A9562236K93491L01058L58278L85805L77040M47258M87849M89760N44722
$$ 19562236 19855727 20156785 20515063 20900868 21277908 21725166 22213015 22702775 23247497
11045B3247497N48067N66387O08583O26693O54915P13239P53595P69995P75525
$$ 23247497 23795564 24361951 24970534 25597227 26252142 26965381 27718976 28488971 29264496
11036B9264496P83229Q96134J037276J119702J127559J097338J100884J187727
$$ 29264496 30047725 30943859 31981135 33100837 34228396 35325734 36426618 37614345
11028C7614345J330498J473651J395849J053689J110229J455664J724899K087182
$$ 37614345 38944843 40418494 41814343 42868032 43978261 45433925 47158824 49246006
11020D9246006K592844L024727L429767L851387M315416M843164N511707O307055
$$ 49246006 51838850 54863577 58293344 62144731 66460147 71303311 76815018 83122073
11012H3122073P268554Q382552R927914J1935076J4269355J6123697J6120868
$$ 83122073 90390627 98773179 108701093 120636169 134905524 151029221 167150089
11005A67150089R125129j9266033q1414493j03352767n9906468l2472040j2470844
$$ 167150089 176275218 157009185 75594692 -27758075 -87664543 -120136583 -132607427
10998a32607427K047734P715395R445740R363913Q575927P710288O961100O123473
$$ -132607427 -130559693 -122844298 -113398558 -104034645 -95458718 -87748430 -80787330 -74663857
10990g4663857N376314M698873M048534L568192L181719K829013K514818K265447
$$ -74663857 -69287543 -64588670 -60540136 -56971944 -53790225 -50961212 -48446394 -46180947
10982d6180947K083043J858449J668447J289583R12671R92789J038837J105046
$$ -46180947 -44097904 -42239455 -40571008 -39281425 -38368754 -37375965 -36337128 -35232082
10974c5232082J096999J038963R21189Q55079Q03558P39826O95837N32790K75236
$$ -35232082 -34135083 -33096120 -32174931 -31319852 -30516294 -29776468 -29080631 -28547841 -28272605
10965b8272605P3702L6363P9959R0972J55243K33821K65707L58803L51634L56098
$$ -28272605 -28198903 -28162540 -28082581 -27991609 -27836366 -27602545 -27336838 -26978035 -26626401 -26270303
10955b6270303L86274M22400L86426M00695L57982L44078L62972M05127L71753
$$ -26270303 -25884029 -25461629 -25075203 -24674508 -24316526 -23972448 -23609476 -23204349 -22832596
10946b2832596L73043L73396L66800L58059L34121L19407L39478K98271L00495
$$ -22832596 -22459553 -22086157 -21719357 -21361298 -21027177 -20707770 -20368292 -20070021 -19769526
10937a9769526K51772K50178K59914K53666K45467K56200K57440K12756K04427
$$ -19769526 -19517754 -19267576 -19007662 -18753996 -18508529 -18252329 -17994889 -17782133 -17577706
10928a7577706K28603K20954K32596K57917K49357K39056K09845J74028J96396
$$ -17577706 -17349103 -17128149 -16895553 -16637636 -16388279 -16149223 -15939378 -15765350 -15568954
10919a5568954J73496K11695K09302J53751J28297J91744K00558K24891J74592
$$ -15568954 -15395458 -15183763 -14974461 -14820710 -14692413 -14500669 -14300111 -14075220 -13900628
10910a3900628J57837J60929J77763J63836J17802J09736J24582J75463J47895
$$ -13900628 -13742791 -13581862 -13404099 -13240263 -13122461 -13012725 -12888143 -12712680 -12564785
10901a2564785J23695J33682J24178J36177J39384J03779J41302J31723J15018
$$ -12564785 -12441090 -12307408 -12183230 -12047053 -11907669 -11803890 -11662588 -11530865 -11415847
10892a1415847J23865J37550J24153J77781J47629J15216P6118N9764O1626P6655
$$ -11415847 -11291982 -11154432 -11030279 -10852498 -10704869 -10589653 -10513535 -10453771 -10392145 -10315490
10882a0315490J40325J76980J96904J57241O1815o0275n3106j947K5131k5806
$$ -10315490 -10175165 -9998185 -9801281 -9644040 -9582225 -9642500 -9695606 -9697553 -9672422 -9698228
10872i698228j461K1559J31876J41221J00426J16424P6503P8092Q4138N1537N3394
$$ -9698228 -9699689 -9678130 -9546254 -9405033 -9304607 -9188183 -9111680 -9033588 -8949450 -8897913 -8844519
10861h844519N7788P0794L5405O8901O7364N8441N2492K1244P8636J18442O7105
$$ -8844519 -8786731 -8715937 -8680532 -8611631 -8544267 -8485826 -8433334 -8412090 -8333454 -8215012 -8147907
10850h147907L2534R9203R1459O8973M5031M6198M6140N5874M3621K2653M7573
$$ -8147907 -8115373 -8016170 -7924711 -7855738 -7810707 -7764509 -7718369 -7662495 -7618874 -7596221 -7548648
10839g548648O0090P6044J0061M5819N9036N1888L2758R699P920K9303N8863O6392
$$ -7548648 -7488558 -7412514 -7402453 -7356634 -7297598 -7245710 -7212952 -7203253 -7195333 -7166030 -7107167 -7040775
10827g040775N2007M5228J8483Q574K7038N8152L8665O3268P3614M5681J0252
$$ -7040775 -6988768 -6943540 -6925057 -6916483 -6889445 -6831293 -6792628 -6729360 -6655746 -6610065 -6599813
10816f599813L665K6039K5655R7011M1766M207K3626m757M882K3024L9739L6783
$$ -6599813 -6596148 -6570109 -6544454 -6447443 -6405677 -6401470 -6377844 -6382601 -6377719 -6354695 -6314956 -6278173
10804f278173N267M1105P0800K0838k8689K191N5371L4153L646K4306N8360O4060
$$ -6278173 -6272906 -6231801 -6161001 -6140163 -6168852 -6166661 -6111290 -6077137 -6073491 -6049185 -5990825 -5926765
10792e926765K1788L9038K7780K0183K2749J9134K7854P645m618L6611M2566O7628
$$ -5926765 -5904977 -5865939 -5838159 -5817976 -5795227 -5776093 -5748239 -5740594 -5745212 -5708601 -5666035 -5598407
10780e598407O0930J1267j4947N196k9138L6147L7036K0808J9222L6490L0993
$$ -5598407 -5537477 -5526210 -5541157 -5535961 -5565099 -5528952 -5491916 -5471108 -5451886 -5415396 -5384403
10769e384403L6330N2617K6767J3397J4806l099N4703K7858j3402q774L0013O5336
$$ -5384403 -5348073 -5295456 -5268689 -5255292 -5240486 -5243585 -5188882 -5161024 -5174426 -5183200 -5153187 -5087851
10757e087851M3890K4143L0809j6602J9593J4371Q754N365P573K5124K3027j0127
$$ -5087851 -5043961 -5019818 -4989009 -5005611 -4986018 -4971647 -4962893 -4957528 -4949955 -4924831 -4901804 -4911931
10745d911931J9081J8250M2549J8225L775K3004K6589N5309K2337k4138k593K8079
$$ -4911931 -4892850 -4874600 -4832051 -4813826 -4810051 -4787047 -4760458 -4705149 -4682812 -4706950 -4709543 -4681464
10733d681464M9697L1133J9799J8478L3997K973k155J2197J3741K692L144M1772
$$ -4681464 -4631767 -4600634 -4580835 -4562357 -4528360 -4525387 -4527542 -4515345 -4501604 -4498912 -4495768 -4453996
10721d453996N3578L8110N983O096K2127K4418J8089q521j721J2743k1168p172
$$ -4453996 -4400418 -4362308 -4356325 -4350229 -4328102 -4303684 -4285595 -4294116 -4295837 -4283094 -4304262 -4311434
10709d311434L9811N4165J7858L1685L7197o448J4312L4189J2199K413K0569J2534
$$ -4311434 -4271623 -4217458 -4199600 -4167915 -4130718 -4137166 -4122854 -4088665 -4076466 -4074053 -4053484 -4040950
10697d040950O029N211J9304J4251K1665K6053N7311J7551M72K0694J6016K7015
$$ -4040950 -4034921 -4029710 -4010406 -3996155 -3974490 -3948437 -3891126 -3873575 -3873103 -3852409 -3836393 -3809378
10685c809378l06p35j2879m9468J013N4277O4519K756J5047L8619j433k9207L1855
$$ -3809378 -3809684 -3810419 -3823298 -3872766 -3871753 -3817476 -3752957 -3750201 -3735154 -3696535 -3697968 -3727175 -3695320
10672c695320N5262J8462K3088k3950k0486j3037m195k0395M852M7554L0971n202
$$ -3695320 -3640058 -3621596 -3598508 -3622458 -3642944 -3655981 -3660176 -3680571 -3675719 -3628165 -3597194 -3602396
10660c602396l570J3942M2984j7061M30K8636K3647K1054L490n933K307M5006
$$ -3602396 -3605966 -3592024 -3549040 -3566101 -3565671 -3537035 -3513388 -3492334 -3488844 -3494777 -3492470 -3447464
10648c447464L8230J0365k2742K2555L7852j178J2209K2312j1897J9729q464K7854
$$ -3447464 -3409234 -3398869 -3421611 -3399056 -3361204 -3362382 -3350173 -3327861 -3339758 -3320029 -3328493 -3300639
10636c300639O123m077j1913N793j7442K7018M1839M5716M8388k7337J631K2930
$$ -3300639 -3294516 -3298593 -3310506 -3304713 -3322155 -3295137 -3253298 -3207582 -3159194 -3186531 -3184900 -3161970
10624c161970N278j0373M3350N0546J0199K3369l7063p019k638K8649L8917J7511
$$ -3161970 -3156692 -3167065 -3123715 -3073169 -3062970 -3039601 -3076664 -3083683 -3086321 -3057672 -3018755 -3001244
10612c001244J8051O55j7660J6483M1116M9370N263q344L8019P5725n541J2946
$$ -3001244 -2983193 -2982538 -3000198 -2983715 -2942599 -2893229 -2887966 -2896310 -2858291 -2782566 -2788107 -2775161
10600b775161N7737N3264K2428M3112J06811N6883M4479J13043J17565N9714j48913
$$ -2775161 -2717424 -2664160 -2641732 -2598620 -2491809 -2434926 -2390447 -2277404 -2159839 -2100125 -2249038
10589b249038m53379m93462l06457j52943l7945J7199L4493N4165M4562J8219
$$ -2249038 -2702417 -3195879 -3502336 -3655279 -3693224 -3676025 -3641532 -3587367 -3542805 -3524586
10579c524586M5536O6172O6434N8876M1980N5692K5512j7120J1885K5845J2395
$$ -3524586 -3479050 -3412878 -3346444 -3287568 -3245588 -3189896 -3164384 -3181504 -3169619 -3143774 -3131379
10568c131379L4196L8855J967Q117K0344K99K7285L4672j6449L5846M65l0535
$$ -3131379 -3097183 -3058328 -3056361 -3048244 -3027900 -3027601 -3000316 -2965644 -2982093 -2946247 -2945782 -2976317
10556b976317k5022M700J5222J3498L2542L8384P547k9861j9072J3309K2193j7220
$$ -2976317 -3001339 -2996639 -2981417 -2967919 -2935377 -2896993 -2889446 -2919307 -2938379 -2925070 -2902877 -2920097
10544b920097P783N1793L1399k6276K0815J7676J0598J3833K545r201m843r227
$$ -2920097 -2912314 -2860521 -2829122 -2855398 -2834583 -2816907 -2806309 -2792476 -2789931 -2799132 -2803975 -2813202
10532b813202j4725K2587K3900J4476M763j9165M0584M6507n52k1427J3955K1533
$$ -2813202 -2827927 -2805340 -2781440 -2766964 -2762201 -2781366 -2740782 -2694275 -2694827 -2716254 -2702299 -2680766
10520b680766J7447K2803J3911p075l106k2063J5504K8457q876j8074J1363L7938
$$ -2680766 -2663319 -2640516 -2626605 -2633680 -2636786 -2658849 -2643345 -2614888 -2623764 -2641838 -2630475 -2592537
10508b592537K5340M5169P218k9386l4248j4860o266J1466M3321L5387L2569q50
$$ -2592537 -2567197 -2522028 -2514810 -2544196 -2578444 -2593304 -2599570 -2588104 -2544783 -2509396 -2476827 -2477677
10496b477677O774q300j4031P429K9546j4414Q202L5268L3718m564k9360l914
$$ -2477677 -2470903 -2479203 -2493234 -2485805 -2456259 -2470673 -2462471 -2427203 -2393485 -2398049 -2427409 -2431323
10484b431323K271p293l5942l54K745J3659Q410J8721K9275k518R712r967l774
$$ -2431323 -2429052 -2436345 -2472287 -2472641 -2469896 -2456237 -2447827 -2429106 -2399831 -2402349 -2392637 -2402604 -2406378
10471b406378J8473J1354M14k4468j5093J8163L4630k1864j0027J6799J7049L5638
$$ -2406378 -2387905 -2376551 -2376137 -2400605 -2415698 -2397535 -2362905 -2384769 -2394796 -2377997 -2360948 -2325310
10459b325310r916k6348p882L4650R938o912R999L8706M1803J204m1904J4983
$$ -2325310 -2335226 -2361574 -2369456 -2334806 -2324868 -2331780 -2321781 -2283075 -2241272 -2240068 -2281972 -2266989
10447b266989K1745K7185k0888j5875O133k193j4270k4423J3593m127K4139J9182
$$ -2266989 -2245244 -2218059 -2238947 -2254822 -2248689 -2250882 -2265152 -2289575 -2275982 -2280109 -2255970 -2236788
10435b236788J3226J7839L522l5039M176K0565R913r298K6790J3496J9633L777
$$ -2236788 -2223562 -2205723 -2202201 -2237240 -2233064 -2212499 -2202586 -2211884 -2185094 -2171598 -2151965 -2148188
10423b148188l204q681J7221m33R782k0712m0187J3853L1634J8324K8621K956
$$ -2148188 -2151392 -2160073 -2142852 -2143285 -2133503 -2154215 -2194402 -2180549 -2148915 -2130591 -2101970 -2099014
10411b099014j4859j8229o963K8605K9977N041L605J8475J6508J749l4901k1960
$$ -2099014 -2113873 -2132102 -2139065 -2110460 -2080483 -2075442 -2071837 -2053362 -2036854 -2035105 -2070006 -2091966
10399b091966K5191K6782M6945j6931m1654L8313K453j8137k622M138l749k0968
$$ -2091966 -2066775 -2039993 -1993048 -2009979 -2051633 -2013320 -2010867 -2029004 -2031626 -2027488 -2031237 -2052205
10387b052205n072K2060L4603j502J3230J882J962R122q242J1853M647m4645k4002
$$ -2052205 -2057277 -2035217 -2000614 -2002116 -1988886 -1987004 -1985042 -1975920 -1984162 -1972309 -1967662 -2012307 -2036309
10374b036309L3679M3449P346K6694J8260j5106Q409J7875J3463K5690R381J3957
$$ -2036309 -2002630 -1959181 -1951835 -1925141 -1906881 -1921987 -1913578 -1895703 -1882240 -1856550 -1847169 -1833212
10362a833212l6674j1397K2412k590J5167k229k4355j5356j1469L3934J6437M759
$$ -1833212 -1869886 -1881283 -1858871 -1861461 -1846294 -1848523 -1872878 -1888234 -1899703 -1865769 -1849332 -1844573
10350a844573j6993j9267J5013O1270M3289j2992r696k697N008K274k4376l891
$$ -1844573 -1861566 -1880833 -1865820 -1804550 -1761261 -1774253 -1783949 -1786646 -1781638 -1779364 -1803740 -1807631
10338a807631P930J3790J3756r096l1808J4492K653L0598m563k2008k1836J5770
$$ -1807631 -1799701 -1785911 -1772155 -1781251 -1813059 -1798567 -1795914 -1765316 -1769879 -1791887 -1813723 -1797953
10326a797953M7840K356l1433j9703k0883K7682K6696M8631J3042j172j7739j5478
$$ -1797953 -1750113 -1747757 -1779190 -1798893 -1819776 -1792094 -1765398 -1716767 -1703725 -1704897 -1722636 -1738114
10314a738114J6388L3743m279j9852p576o59L0005J1535l4275k4177P745L3596
$$ -1738114 -1721726 -1687983 -1692262 -1712114 -1719690 -1720349 -1690344 -1678809 -1713084 -1737261 -1729516 -1695920
10302a695920L2401K1740j3361k2579j0381M40M5347k3009L645j8183k5450Q005
$$ -1695920 -1663519 -1641779 -1655140 -1677719 -1688100 -1687660 -1642313 -1665322 -1661677 -1679860 -1705310 -1697305
10290a697305J436J6940J6684J5958J2183j0306J9261J0226J8723J0304K135J7198
$$ -1697305 -1695869 -1678929 -1662245 -1646287 -1634104 -1644410 -1625149 -1614923 -1596200 -1585896 -1583761 -1566563
10278a566563J1246j1775N991j0258j7205J6111j3483M927K9600L894q69r136
$$ -1566563 -1555317 -1567092 -1561101 -1571359 -1588564 -1572453 -1585936 -1581009 -1551409 -1547515 -1548384 -1557520
10266a557520k1339o136J4565K4825J1374Q539M8018j1110p101q599J117J6168
$$ -1557520 -1578859 -1584995 -1570430 -1545605 -1534231 -1525692 -1477674 -1488784 -1495885 -1504484 -1503367 -1487199
10254a487199R685r29l2578N922K8557r827k3643o533M843J5088K6759j1512k7419
$$ -1487199 -1477514 -1478443 -1511021 -1505099 -1476542 -1486369 -1510012 -1516545 -1511702 -1496614 -1469855 -1481367 -1508786
10241a508786l400P626K8190R412L0817K4488l712l4273l686k812j0957J563K186
$$ -1508786 -1512186 -1504560 -1476370 -1466958 -1436141 -1411653 -1415365 -1449638 -1453324 -1456136 -1467093 -1465530 -1463344
10228a463344m744P298O97r423K0257J6317r325q30K3179K0920k336l686k2881
$$ -1463344 -1468088 -1460790 -1460093 -1469516 -1449259 -1432942 -1442267 -1443097 -1419918 -1398998 -1401334 -1405020 -1427901
10215a427901j1204J7701L7888K6523j7531j4264N370L6780O270j196l399l766
$$ -1427901 -1439105 -1421404 -1383516 -1356993 -1374524 -1388788 -1383418 -1346638 -1340368 -1341564 -1344963 -1348729
10203a348729K2989k8496j247j1568L0172J8286j7475m6338j5670L8784L5910
$$ -1348729 -1325740 -1354236 -1355483 -1367051 -1336879 -1318593 -1336068 -1382406 -1398076 -1359292 -1323382
10192a323382L2366Q615J2274J1003j1698L000j1473J422K2737o745l0798N026
$$ -1323382 -1291016 -1282401 -1270127 -1259124 -1270822 -1267822 -1279295 -1277873 -1255136 -1261881 -1292679 -1287653
10180a287653N5396P356N678J2032k1593l2121N672P565N78L841O522j8151j200
$$ -1287653 -1232257 -1224901 -1219223 -1207191 -1228784 -1260905 -1255233 -1247668 -1247090 -1243249 -1236727 -1254878 -1256078
10167a256078R878K6332K9153J7667o905J3208r523p547q849j0311Q192J2832
$$ -1256078 -1246200 -1219868 -1190715 -1173048 -1179953 -1166745 -1176268 -1183815 -1192664 -1202975 -1194783 -1181951
10155a181951J5769J8512j4769N504J0177q883r503j1293m538J4319J9678K4329
$$ -1181951 -1166182 -1147670 -1162439 -1156935 -1146758 -1155641 -1165144 -1176437 -1180975 -1166656 -1146978 -1122649
10143a122649J9445M288K768j313q376j3162k1871P228j8318j7588L2281J2660
$$ -1122649 -1103204 -1098916 -1096148 -1097461 -1105837 -1118999 -1140870 -1133642 -1151960 -1169548 -1137267 -1124607
10131a124607N23J8266K8477J3663l7524J504K5938j8054K439M1890j9711K9022
$$ -1124607 -1124084 -1105818 -1077341 -1063678 -1101202 -1099698 -1073760 -1091814 -1089375 -1047485 -1067196 -1038174
10119a038174J5379r619K656j7396J894J8523Q42o526J1561K0420K5607K1499
$$ -1038174 -1022795 -1032414 -1029758 -1047154 -1045260 -1026737 -1025895 -1032421 -1020860 -1000440 -974833 -953334
10107i53334j6171m0978L463M4129j3307Q745Q933j6804M797j1150q85k690J6623
$$ -953334 -969505 -1010483 -1007020 -962891 -976198 -967453 -958520 -975324 -970527 -981677 -982562 -985252 -968629
10094i68629J0833P941m959N0336j7862j9179K1476R366R072n431l1782l1489
$$ -968629 -957796 -949855 -954814 -904478 -922340 -941519 -920043 -910677 -901605 -907036 -938818 -970307
10082i70307P873K2103j1319r308N233J9048n223J1899L2878K6189m2556J906
$$ -970307 -962434 -940331 -951650 -960958 -955725 -936677 -941900 -930001 -897123 -870934 -913490 -911584
10070i11584O8549L3197p033k3159j0755J6339M9658n359k3802m2051l0471J6880
$$ -911584 -843035 -809838 -816871 -840030 -850785 -834446 -784788 -790147 -813949 -856000 -886471 -869591
10058h69591J039K2310P1843O298j0196R01J5799K5036k2769R242O982M5721L6969
$$ -869591 -868552 -846242 -774399 -768101 -778297 -777396 -761597 -736561 -759330 -750088 -743106 -697385 -660416
10045f60416p7222j02960n4893j9471J1427M3437J7442m945K6587l5090o287K3839
$$ -660416 -737638 -840598 -895491 -914962 -903535 -860098 -842656 -847601 -821014 -856104 -862391 -838552
10033h38552L5381N865k809Q590M6212M2222J4881J7175j8414j7132l6793j6259
$$ -838552 -803171 -797306 -800115 -791525 -745313 -703091 -688210 -671035 -689449 -706581 -743374 -759633
10021g59633P575k3674n562k428L4531J3781k1483o108J7296M5784K3786k652
$$ -759633 -752058 -775732 -781294 -783722 -749191 -735410 -756893 -763001 -745705 -699921 -676135 -678787
10009f78787J4160q341K8531K8346j3096j2431J1402K4170J0021K3481n978K200
$$ -678787 -664627 -672968 -644437 -616091 -629187 -641618 -630216 -606046 -596025 -572544 -578522 -576322
9997e76322k0962k5754K5802K0388N990K5322J6383J8102R419J8301n875J3265
$$ -576322 -597284 -623038 -597236 -576848 -570858 -545536 -529153 -511051 -501632 -483331 -489206 -475941
9985d75941k0292N000K2141K1507j3820l0312j8541N201J4592K0153J4483j0157
$$ -475941 -496233 -491233 -469092 -447585 -461405 -491717 -510258 -505057 -490465 -470312 -455829 -465986
9973d65986j7469N7145K2848k2126P084L1371n2808m9426K1111J6622K0681L4295
$$ -465986 -483455 -426310 -403462 -425588 -418504 -387133 -439941 -489367 -468256 -451634 -430953 -396658
9961c96658J739m5151k577M5398J4000K190Q590K0038K1745Q621Q023j1524k1118
$$ -396658 -394919 -440070 -442647 -397249 -383249 -381059 -372469 -352431 -330686 -322065 -314042 -325566 -346684
9948c46684o692L5654K7811K423j2530r349j022j3008M070M1968K3593J5745L3981
$$ -346684 -353376 -317722 -289911 -287488 -300018 -309367 -310389 -323397 -319327 -277359 -253766 -238021 -204040
9935b04040J1112J1212m966r128k3212j3928M5088L2185K0160J9474j9450r514
$$ -204040 -192928 -181716 -186682 -195810 -219022 -232950 -187862 -155677 -135517 -116043 -135493 -145007
9923a45007J4313q653l6650K8243M8847Q226k8281J3727K1314J7538N047l987
$$ -145007 -130694 -139347 -175997 -147754 -98907 -90681 -118962 -105235 -83921 -66383 -61336 -65323
9911f5323R372M449k6355l900L1229J353L131N061Q873J1759J5039Q386k679m988
$$ -65323 -55951 -51502 -77857 -81757 -50528 -49175 -46044 -40983 -32110 -20351 -5312 3074 395 -4593
9897d593M547j4906J0536K1389J2414r127l576l953L5542N2971P943j6844n78
$$ -4593 -46 -14952 -4416 16973 29387 20260 16684 12731 48273 101244 109187 92343 91765
9884I1765M042J054L4503R334K8033M343k698K1402R169L8843M0914J0163j2164
$$ 91765 95807 96861 131364 140698 168731 173074 170376 191778 200947 239790 280704 290867 278703
9871B78703k1623J3379Q420M4978M2638L9390K8304K0307j7058j1968J8873N7061
$$ 278703 257080 270459 278879 323857 366495 405885 434189 454496 437438 425470 444343 501404
9859E01404M7084J6776P908L2345K2670O0150P8789O2811N1169P3747R1390N3453
$$ 501404 548488 565264 573172 605517 628187 688337 767126 829937 881106 954853 1046243 1099696
9847A099696j23388l35602m12329k94993j18112L4721P0806R5900M7141L2049
$$ 1099696 976308 640706 228377 -66616 -184728 -150007 -79201 16699 63840 95889
9837I5889J5813K3180L9556O1772P4734L6804L000J9159M280J3367M6284k223
$$ 95889 111702 134882 174438 236210 310944 347748 350748 369907 374187 387554 433838 431615
9825D31615N849J7524M1141M1996J9208l030K1292K7584M0040L567J7906J4601
$$ 431615 437464 454988 496129 538125 557333 554303 575595 603179 643219 646786 664692 679293
9813F79293R130K8772K7054P105l364J5466o224N661p477K3455J6387L9532P0189
$$ 679293 688423 717195 744249 751354 747990 763456 757232 762893 755416 778871 795258 834790 904979
9800I04979K2333k7213J151K2708R23l932K6651P1970K9420L8363L4739J321J351
$$ 904979 927312 900099 901250 923958 924881 920949 947600 1019570 1048990 1087353 1122092 1123413 1124764
9787A124764J7196K3146J5758K5375J6343L7967L9621k9524K0023Q0820L2822
$$ 1124764 1141960 1165106 1180864 1206239 1222582 1260549 1300170 1270646 1290669 1371489 1404311
9776A404311J6750J6031m904K7169L3311K3893J9238K5544M4879L1137K9896K6088
$$ 1404311 1421061 1437092 1432188 1459357 1492668 1516561 1535799 1561343 1606222 1637359 1667255 1693343
9764A693343L4295j3285J0450M0130N5353J9296L4391M3118Q178K6520Q04J6182
$$ 1693343 1727638 1714353 1724803 1764933 1820286 1839582 1873973 1917091 1925269 1951789 1952593 1968775
9752A968775K0850M0034K2024M5548O1279L8007J4011K6866L7690n470K7466M9266
$$ 1968775 1989625 2029659 2051683 2097231 2158510 2196517 2210528 2237394 2275084 2269614 2297080 2346346
9740B346346N9835L5621j050M3088O7877M3382K8601K9840K8128L7934K9703M2066
$$ 2346346 2406181 2441802 2440752 2483840 2551717 2595099 2623700 2653540 2681668 2719602 2749305 2791371
9728B791371L5466q919J9491M0100M9961M8762L8567K5008k851N6831N1550L8252
$$ 2791371 2826837 2817918 2837409 2877509 2927470 2976232 3014799 3039807 3036956 3093787 3145337 3183589
9716C183589K3249O4819N4319K4083K0963J340J6947J4184L2946K3155J1815K4910
$$ 3183589 3206838 3271657 3325976 3350059 3371022 3372362 3389309 3403493 3436439 3459594 3471409 3496319
9704C496319J6682M1855j8447j4942M015p517J9944j7730j2610j4812l3018J1379
$$ 3496319 3513001 3554856 3536409 3521467 3525482 3517965 3537909 3520179 3507569 3492757 3459739 3471118
9692C471118k4877k9714k7565j4133k6314k6872m0015k0505m3179n9896o9587
$$ 3471118 3446241 3416527 3388962 3374829 3348515 3321643 3281628 3261123 3217944 3158048 3088461
9681C088461r4559p4908o0670p0853p3144j13079j04833j33620j14511p1387j09716
$$ 3088461 2993902 2918994 2858324 2787471 2714327 2601248 2496415 2362795 2248284 2176897 2067181
9670B067181j64076j58009j26878j67968j54561j76066j53157j77141j78020j42508
$$ 2067181 1903105 1745096 1618218 1450250 1295689 1119623 966466 789325 611305 468797
9660D68797j18384j63735k36840k00897j96014j88646j60483j44761j64633j63329
$$ 468797 350413 186678 -50162 -251059 -447073 -635719 -796202 -940963 -1105596 -1268925
9650a268925j52396j45696j66471j90911j70807j44252j37513j37324j26961j35020
$$ -1268925 -1421321 -1567017 -1733488 -1924399 -2095206 -2239458 -2376971 -2514295 -2641256 -2776276
9640b776276j38170j29862j33944j04331r7527q4623j19504j13115j04144q1901
$$ -2776276 -2914446 -3044308 -3178252 -3282583 -3380110 -3464733 -3584237 -3697352 -3801496 -3883397
9630c883397o9681o7057q6488p2710n9876n8964o0788m5212l3523n2797o5813
$$ -3883397 -3953078 -4020135 -4106623 -4179333 -4239209 -4298173 -4358961 -4404173 -4437696 -4490493 -4556306
9619d556306n2367k7048m3831n3107j9758n07j4919J0434j7594l9226M598J6336
$$ -4556306 -4608673 -4635721 -4679552 -4732659 -4752417 -4752924 -4767843 -4757409 -4775003 -4814229 -4809631 -4793295
9607d793295R175l8061j1131q270l123J4171k0415L126J0615J9880M14P192J2135
$$ -4793295 -4784120 -4822181 -4833312 -4841582 -4844705 -4830534 -4850949 -4847823 -4837208 -4817328 -4816914 -4809722 -4797587
9594d797587J8070j6491k681M3517L3257j2630K1723M7817K6919J0637L9677K352
$$ -4797587 -4779517 -4796008 -4798689 -4755172 -4721915 -4734545 -4712822 -4665005 -4638086 -4627449 -4587772 -4585420
9582d585420o424K7626K807k2224O5457P0394M3681K7408J2017L492l487J8768
$$ -4585420 -4591844 -4564218 -4561411 -4583635 -4518178 -4447784 -4404103 -4376695 -4364678 -4361186 -4364673 -4345905
9570d345905N3905K2544J7202j491K4133N4372K1692J0948n628J7521L5138O60
$$ -4345905 -4292000 -4269456 -4252254 -4253745 -4229612 -4175240 -4153548 -4142600 -4148228 -4130707 -4095569 -4094909
9558d094909k543L8347K5112P1801K8033J0654K2412K8960l618J9639N0039Q702
$$ -4094909 -4097452 -4059105 -4033993 -3962192 -3934159 -3923505 -3901093 -3872133 -3875751 -3856112 -3806073 -3797371
9546c797371L013K8766K8309o273K0492J6930J3893Q37J1399L1913K4416L2446
$$ -3797371 -3794358 -3765592 -3737283 -3743556 -3723064 -3706134 -3692241 -3691404 -3680005 -3648092 -3623676 -3591230
9534c591230K4972N6775M094K2487J8175k317J0408L7425N877j3149J5236L8010
$$ -3591230 -3566258 -3509483 -3505389 -3482902 -3464727 -3467044 -3456636 -3419211 -3413334 -3426483 -3411247 -3373237
9522c373237L3413l2502k543L5620M3500K6058M4542k1121O817M8730M5632K8308
$$ -3373237 -3339824 -3372326 -3374869 -3339249 -3295749 -3269691 -3225149 -3246270 -3239453 -3190723 -3145091 -3116783
9510c116783J9007J5086l6710O929L2059j6204k3494O053N7563M8946J5803L3127
$$ -3116783 -3097776 -3082690 -3119400 -3112471 -3080412 -3096616 -3120110 -3114057 -3056494 -3007548 -2991745 -2958618
9498b958618k1536O379J4661J5222K1779J2426K976j61M0979M3383L115l3456
$$ -2958618 -2980154 -2973775 -2959114 -2943892 -2922113 -2909687 -2906711 -2906872 -2865893 -2822510 -2819395 -2852851
9486b852851r10K1636J4013j9596O309K8738R639l231P372L8157N0091K8912J930
$$ -2852851 -2853761 -2832125 -2818112 -2837708 -2831399 -2802661 -2793022 -2796253 -2788881 -2750724 -2700633 -2671721 -2669791
9473b669791n383n576L850J6002J2203Q730L0337J3582o466q164k6529O464K0383
$$ -2669791 -2675174 -2680750 -2676900 -2660898 -2648695 -2639965 -2609628 -2596046 -2602512 -2610676 -2637205 -2630741 -2610358
9460b610358J2054L9646L2681N235n960N4788K9375K2392k2974m4127j9895J568
$$ -2610358 -2598304 -2558658 -2525977 -2520742 -2526702 -2471914 -2442539 -2420147 -2443121 -2487248 -2507143 -2505575
9448b505575L3694L5637J8847J6431J7816M6193k002J9539O880j7184K4585R852
$$ -2505575 -2471881 -2436244 -2417397 -2400966 -2383150 -2336957 -2338959 -2319420 -2312540 -2329724 -2305139 -2295287
9436b295287J6958j786j3696K2413N569j4465j1970J0298J5211M7372J8721k862
$$ -2295287 -2278329 -2280115 -2293811 -2271398 -2265829 -2280294 -2292264 -2281966 -2266755 -2219383 -2200662 -2203524
9424b203524j1539m18l2443j8221M3877K0305M3541n963J1573q879j6711l2844
$$ -2203524 -2215063 -2215481 -2247924 -2266145 -2222268 -2201963 -2158422 -2164385 -2152812 -2161691 -2178402 -2211246
9412b211246M105M8613K5380J0307M3926L704J1967p808J715O311q88Q201R362
$$ -2211246 -2207141 -2158528 -2133148 -2122841 -2078915 -2075211 -2063244 -2071052 -2069337 -2063026 -2063914 -2055713 -2046351
9399b046351j358j9234j9668j3464K4406M0588k6080j1277M0965J2583K019L2004
$$ -2046351 -2047709 -2066943 -2086611 -2100075 -2075669 -2035081 -2061161 -2072438 -2031473 -2018890 -2016871 -1984867
9387a984867N7795m400J3403j2961j5361K3910K5871K9548k928R205J168m320
$$ -1984867 -1927072 -1931472 -1918069 -1931030 -1946391 -1922481 -1896610 -1867062 -1869990 -1860785 -1859617 -1863937
9375a863937k3676J4203j5707J0626K2952k3391L0185L7866j4039j6985q768K1630
$$ -1863937 -1887613 -1873410 -1889117 -1878491 -1855539 -1878930 -1848745 -1810879 -1824918 -1841903 -1850671 -1829041
9363a829041J1060p132j8988j3683N192K4085J605K9076L8744L2771K471J633
$$ -1829041 -1817981 -1825113 -1844101 -1857784 -1852592 -1828507 -1826902 -1797826 -1759082 -1726311 -1723840 -1722207
9351a722207Q77m5938l7396J3777J5520N868J0631L4154J4485l1263j4495J7083
$$ -1722207 -1721330 -1767268 -1804664 -1790887 -1775367 -1769499 -1758868 -1724714 -1710229 -1741492 -1755987 -1738904
9339a738904j415K6652K9853m340j8299j5163l723K542M7069j7670k4614j6133
$$ -1738904 -1740319 -1713667 -1683814 -1688154 -1706453 -1721616 -1725339 -1722797 -1675728 -1693398 -1718012 -1734145
9327a734145q871R6k2395P060J0129L0456m179K9971K1275K118J7453o030p7844
$$ -1734145 -1743016 -1742920 -1765315 -1758255 -1748126 -1717670 -1721849 -1691878 -1670603 -1668485 -1651032 -1657062 -1734906
9314a734906j9750o829R24M3245q478k1836O706J3201K289j2028j8017r503m0802
$$ -1734906 -1754656 -1761485 -1760561 -1717316 -1725794 -1747630 -1740924 -1727723 -1725434 -1737462 -1755479 -1764982 -1805784
9301a805784k3190K1653K0427K0561k1839M723j2949k9014l9761m2620L62J3932
$$ -1805784 -1828974 -1807321 -1786894 -1766333 -1788172 -1783449 -1796398 -1825412 -1865173 -1907793 -1907431 -1893499
9289a893499j9645j5197p428J0363L289j6689j9202q32l1445n390j9947p29Q367
$$ -1893499 -1913144 -1928341 -1935769 -1925406 -1922117 -1938806 -1958008 -1958840 -1990285 -1995675 -2015622 -2016351 -2007984
9276b007984k6805k3924k8403J8457J7372N372j7574j623j063R27n107Q054m6621
$$ -2007984 -2034789 -2058713 -2087116 -2068659 -2051287 -2045915 -2063489 -2065112 -2066175 -2065248 -2070355 -2062301 -2108922
9263b108922n4879j0362l626n9824j4349l2066j6698K8338J22k8341m5360J9589
$$ -2108922 -2163801 -2174163 -2177789 -2237613 -2251962 -2284028 -2300726 -2272388 -2272266 -2300607 -2345967 -2326378
9251b326378P319l0807m0555K269N321J0163m5211l2562K4811J4536k4725P453
$$ -2326378 -2319059 -2349866 -2390421 -2388152 -2382831 -2372668 -2417879 -2450441 -2425630 -2411094 -2435819 -2428366
9239b428366k0519j0750k3716o6205j3249K7019n203j9724l997j8351P329J53
$$ -2428366 -2448885 -2459635 -2483351 -2549556 -2562805 -2535786 -2540989 -2560713 -2564710 -2583061 -2575732 -2575579
9227b575579k2077k0792L4668P502n988p373M912l1895k1192N946k3035J223O768
$$ -2575579 -2597656 -2618448 -2583780 -2576278 -2582266 -2589639 -2584727 -2616622 -2637814 -2631868 -2654903 -2653680 -2646912
9214b646912k0996k8081m6412P318M5480K5005J2010O295n585M344K3413j2461
$$ -2646912 -2667908 -2695989 -2742401 -2735083 -2689603 -2664598 -2652588 -2646293 -2651878 -2647534 -2624121 -2636582
9202b636582j3579J923j4052l4279q982M6200J0577j1026l176k2256l005J7679
$$ -2636582 -2650161 -2648238 -2662290 -2696569 -2705551 -2659351 -2648774 -2659800 -2662976 -2685232 -2688237 -2670558
9190b670558n941k1637J1474o645k5388n597J0180j364L4255K338J2493K6500
$$ -2670558 -2676499 -2698136 -2686662 -2693307 -2718695 -2724292 -2714112 -2715476 -2681221 -2678883 -2666390 -2639890
9178b639890K1820j5546p408K8633r41j2573K904K7253j6214l1644L1660L5381
$$ -2639890 -2618070 -2633616 -2641024 -2612391 -2613332 -2625905 -2623001 -2595748 -2611962 -2643606 -2611946 -2576565
9166b576565r94Q521J5717o134k0921K831j0885M314K261J1658K1929j332J4719
$$ -2576565 -2577559 -2569038 -2553321 -2559455 -2580376 -2577545 -2588430 -2584116 -2581855 -2570197 -2548268 -2549600 -2534881
9153b534881n07l6920l2706L2229M9710L9409j0827l1718L684J7348m774J6582
$$ -2534881 -2535388 -2572308 -2605014 -2572785 -2523075 -2483666 -2494493 -2526211 -2522527 -2505179 -2509953 -2493371
9141b493371Q785l590O170K3028J5479p721p482o745K6997K6263K2185L2163l8944
$$ -2493371 -2484586 -2488176 -2482006 -2458978 -2443499 -2451220 -2458702 -2465447 -2438450 -2412187 -2390002 -2357839 -2396783
9128b396783l1142J23K0957k735l3286l349P0902M9467J9571k9407j7543j1651
$$ -2396783 -2427925 -2427802 -2406845 -2409580 -2442866 -2446215 -2375313 -2325846 -2306275 -2335682 -2353225 -2364876
9116b364876K7510K07j2660j6699m419L9070M7762J48o975K9666P987N801M421
$$ -2364876 -2337366 -2337159 -2349819 -2366518 -2370937 -2331867 -2284105 -2283957 -2290932 -2261266 -2253279 -2247478 -2243057
9103b243057M562L35J2536o079Q668O594p181j2773n739J6838N87l4950l4547
$$ -2243057 -2238495 -2238160 -2225624 -2231703 -2223035 -2216441 -2223622 -2236395 -2242134 -2225296 -2224709 -2259659 -2294206
9090b294206j345J4858M4895K5894N4548k2552p7554j0793K8724M667J0983L5498
$$ -2294206 -2295551 -2280693 -2235798 -2209904 -2155356 -2177908 -2255462 -2266255 -2237531 -2232864 -2221881 -2186383
9078b186383L3520o774p319n099P324M0646K079l5804P071O270l869K3577J2300
$$ -2186383 -2152863 -2159637 -2166956 -2172055 -2164731 -2124085 -2122006 -2157810 -2150739 -2144469 -2148338 -2124761 -2112461
9065b112461Q433L1965M3824j2956n644P96K719J110k813j4020J7928M36K3921
$$ -2112461 -2104028 -2072063 -2028239 -2041195 -2046839 -2046043 -2043324 -2042214 -2045027 -2059047 -2041119 -2040683 -2016762
9052b016762L7651J8691r79K798j7336o023J9758p040K1558L842k64P9n35l325
$$ -2016762 -1979111 -1960420 -1961399 -1958601 -1975937 -1981960 -1962202 -1969242 -1947684 -1943842 -1944106 -1944027 -1944562 -1947887
9038a947887o449k7237l3259j406J3986J5096M0057J6080k1382J048j2240j8039
$$ -1947887 -1954336 -1981573 -2014832 -2016238 -2002252 -1987156 -1947099 -1931019 -1952401 -1951353 -1963593 -1981632
9026a981632p561O231K0850O1864K254K3659L3155J3990p162j8561K8K4253L2583
$$ -1981632 -1989193 -1982962 -1962112 -1900248 -1897994 -1874335 -1841180 -1827190 -1834352 -1852913 -1852885 -1828632 -1796049
9013a796049J3560l3375j7247j3550k579L960m2551p5305J4641L4661N1203j8477
$$ -1796049 -1782489 -1815864 -1833111 -1846661 -1849240 -1845280 -1887831 -1963136 -1948495 -1913834 -1862631 -1881108
9001a881108m3924l5512l4176r506j4120j483r205N198P342M3631L1740Q361j3865
$$ -1881108 -1925032 -1960544 -1994720 -2004226 -2018346 -2019829 -2029034 -2023836 -2016494 -1972863 -1941123 -1932762 -1946627
8988a946627L2818j4596j9999L1755R175M4694K4833P461j8387j9822l573J3201
$$ -1946627 -1913809 -1928405 -1948404 -1916649 -1907474 -1862780 -1837947 -1830486 -1848873 -1868695 -1872268 -1859067
8976a859067M2060K023N960K6698j0359O700M0854j1770J0413j5701p3052m9379
$$ -1859067 -1817007 -1814984 -1809024 -1782326 -1792685 -1785985 -1745131 -1756901 -1746488 -1762189 -1835241 -1884620
8964a884620l97K3019J4443l0113k6782j4158m7926l6658k375j2796M801N151
$$ -1884620 -1885017 -1861998 -1847555 -1877668 -1904450 -1918608 -1966534 -2003192 -2005567 -2018363 -2013562 -2008411
8952b008411K1062J1537J7832K7989J8042J1258R565k3787j6m844J2779K0157
$$ -2008411 -1987349 -1975812 -1957980 -1929991 -1911949 -1900691 -1891126 -1914913 -1914929 -1919773 -1906994 -1886837
8940a886837N001J2921l1544K507K2877L7284K895J591j1026m173M3411l068J6243
$$ -1886837 -1881836 -1868915 -1900459 -1897952 -1875075 -1837791 -1834896 -1833305 -1844331 -1848504 -1805093 -1808161 -1791918
8927a791918j8903n486O281j715R258J0497j3331L913K7014p631P80j412j999
$$ -1791918 -1810821 -1816307 -1810026 -1811741 -1802483 -1791986 -1805317 -1801404 -1774390 -1782021 -1781241 -1782653 -1784652
8914a784652R196k573K3735M737k1982J0414J1071J1248Q270m8575k1681J5957
$$ -1784652 -1775456 -1778029 -1754294 -1749557 -1771539 -1761125 -1750054 -1738806 -1730536 -1779111 -1800792 -1784835
8902a784835M0781n272O464J0321R894L2378L153j6114K2571J3783j5112l6654
$$ -1784835 -1744054 -1749326 -1742862 -1732541 -1722647 -1690269 -1687116 -1703230 -1680659 -1666876 -1681988 -1718642
8890a718642n3079j946J0289Q947L1405j0227J7137M2069R105J176J708M980m22
$$ -1718642 -1771721 -1773667 -1763378 -1754431 -1723026 -1733253 -1716116 -1674047 -1664942 -1663766 -1662058 -1657078 -1657500
8877a657500n747k9828j9781O07K8964L1896p263J4515J2775o90k4729l2433l1134
$$ -1657500 -1663247 -1693075 -1712856 -1712249 -1683285 -1651389 -1658652 -1644137 -1631362 -1632052 -1656781 -1689214 -1720348
8864a720348j4648Q05M9564Q664k9626j6469J3342J0286K615J2551p892q15M1073
$$ -1720348 -1734996 -1734191 -1684627 -1675963 -1705589 -1722058 -1708716 -1698430 -1695815 -1683264 -1691156 -1691971 -1650898
8851a650898K9477L817K407M614j2513J492k4434O889j8630k3535J1861K5500
$$ -1650898 -1621421 -1617604 -1615197 -1610583 -1623096 -1621604 -1646038 -1639149 -1657779 -1681314 -1669453 -1643953
8839a643953K9384N127J1406L3644m3239o8058j251L0305L2925j4511k5338J956
$$ -1643953 -1614569 -1609442 -1598036 -1564392 -1607631 -1675689 -1676940 -1646635 -1613710 -1628221 -1653559 -1651603
8827a651603M8728R538Q377Q45K4565m194j6892o7183l7600N1431L8514K7784
$$ -1651603 -1602875 -1593337 -1584960 -1584115 -1559550 -1563744 -1580636 -1647819 -1685419 -1633988 -1595474 -1567690
8815a567690J9617l2457K0395j6073J2404j894j3663m333J2087r593j9657N50
$$ -1567690 -1548073 -1580530 -1560135 -1576208 -1563804 -1565698 -1579361 -1583694 -1571607 -1581200 -1600857 -1600307
8803a600307j6406q347K9541M1470n455O013K607o754l1154l0321J6746K9648
$$ -1600307 -1616713 -1625060 -1595519 -1554049 -1559504 -1553491 -1550884 -1557638 -1588792 -1619113 -1602367 -1572719
8791a572719K1038M5540J9933J1984l3381m2697L968n765p490N103J1467K1188
$$ -1572719 -1551681 -1506141 -1486208 -1474224 -1507605 -1550302 -1546334 -1552099 -1559589 -1554486 -1543019 -1521831
8779a521831l5881k4403K3297K6815j1831O614L7596K9244M34j0639K1533P845
$$ -1521831 -1557712 -1582115 -1558818 -1532003 -1543834 -1537220 -1499624 -1470380 -1469946 -1480585 -1459052 -1451207
8767a451207o519J060k488j0744k7291j3587P242J6665N654J806J1487R732k677
$$ -1451207 -1457726 -1456666 -1459154 -1469898 -1497189 -1510776 -1503534 -1486869 -1481215 -1479409 -1467922 -1458190 -1460867
8754a460867k7401j139l9155J6947M8403J4742k8868K8269K6791J1224p850k8022
$$ -1460867 -1488268 -1489407 -1528562 -1511615 -1463212 -1448470 -1477338 -1449069 -1422278 -1411054 -1418904 -1446926
8742a446926l0422j8896J6383J0883k7113J0715r996k1244J0272J3565M9514O29
$$ -1446926 -1477348 -1496244 -1479861 -1468978 -1496091 -1485376 -1495372 -1516616 -1506344 -1492779 -1443265 -1442636
8730a442636l0404k1715j4031M6787N6184P754k0911k1200J3809J9810l4216l520
$$ -1442636 -1473040 -1494755 -1508786 -1461999 -1405815 -1398061 -1418972 -1440172 -1426363 -1406553 -1440769 -1444289
8718a444289K5167K3546q228J567k459N186M4496j8286k1224n299l578m692P857
$$ -1444289 -1419122 -1395576 -1403804 -1402237 -1404696 -1399510 -1355014 -1373300 -1394524 -1399823 -1403401 -1408093 -1400236
8705a400236j6929M585J4900k581k1422L8731K7054l1088L645k4354l5187j3603
$$ -1400236 -1417165 -1412580 -1397680 -1400261 -1421683 -1382952 -1355898 -1386986 -1383341 -1407695 -1442882 -1456485
8693a456485K5079J0943J1915L2176J0325J0801K7542m494k0189J7011o947p75
$$ -1456485 -1431406 -1420463 -1408548 -1376372 -1366047 -1355246 -1327704 -1332198 -1352387 -1335376 -1342323 -1343098
8681a343098K4571J851j6771J6752j5043q422K6494J4858P784j584q095M995p770
$$ -1343098 -1318527 -1316676 -1333447 -1316695 -1331738 -1340160 -1313666 -1298808 -1291024 -1292608 -1300703 -1295708 -1303478
8668a303478M979R871J8924N0569j5122k0780k9835p022J0946K4062J683r219
$$ -1303478 -1298499 -1288628 -1269704 -1219135 -1234257 -1255037 -1284872 -1291894 -1280948 -1256886 -1255203 -1264422
8656a264422J748L5762L4152p42k921k3337L705N5292L7862k5864n1440r4694
$$ -1264422 -1262674 -1226912 -1192760 -1193502 -1196423 -1219760 -1216055 -1160763 -1122901 -1148765 -1200205 -1294899
8644a294899j20461l6778r630J4427K962P573J8742K4827J2183J8918L7210P058
$$ -1294899 -1415360 -1452138 -1461768 -1447341 -1444379 -1436806 -1418064 -1393237 -1381054 -1362136 -1324926 -1317868
8632a317868J6477K9159J5082J7298K4346J3043k3176j8032j1872J1762j0757
$$ -1317868 -1301391 -1272232 -1257150 -1239852 -1215506 -1202463 -1225639 -1243671 -1255543 -1243781 -1254538
8621a254538l840J9099J1352K3983L1643L5915K1902J8338k2489k1704M4932o665
$$ -1254538 -1258378 -1239279 -1227927 -1203944 -1172301 -1136386 -1114484 -1096146 -1118635 -1140339 -1095407 -1102072
8609a102072q977L3416M0725K382K5094L3843J2097M710m1678k25934k25157j29317
$$ -1102072 -1111049 -1077633 -1036908 -1034526 -1009432 -975589 -963492 -958782 -1000460 -1226394 -1451551 -1580868
8597a580868m9157k6660l4321k3906J4111l173K364j5894J4918M8876J5975j3171
$$ -1580868 -1630025 -1656685 -1691006 -1714912 -1700801 -1703974 -1701610 -1717504 -1702586 -1653710 -1637735 -1650906
8585a650906k2870p47K5460M1701Q230k147m045J3317K3626J0944L2937L5629
$$ -1650906 -1673776 -1674523 -1649063 -1607362 -1599132 -1601279 -1605324 -1592007 -1568381 -1557437 -1524500 -1488871
8573a488871j0143J624O753j7634j3759O780K3960K5690L4312j07n7974k2050
$$ -1488871 -1499014 -1497390 -1490637 -1508271 -1522030 -1515250 -1491290 -1465600 -1431288 -1431395 -1489369 -1511419
8561a511419K5335N5688K1512j3823O082m643m0022p8903p4133l0529L1403L0037
$$ -1511419 -1486084 -1430396 -1408884 -1422707 -1416625 -1421268 -1461290 -1540193 -1614326 -1644855 -1613452 -1583415
8549a583415l493n586J8043J1712K090J0218N794J5095J3655K2124k8002O512
$$ -1583415 -1586908 -1592494 -1574451 -1562739 -1560649 -1550431 -1544637 -1529542 -1515887 -1493763 -1521765 -1515253
8537a515253J8438k2292K317P391K5442J4104k2374J0659o229j0467r795N631
$$ -1515253 -1496815 -1519107 -1516790 -1509399 -1483957 -1469853 -1492227 -1481568 -1487797 -1498264 -1508059 -1502428
8525a502428N7654R777O220j9796k3070n564o430p480J1063j4554O161K2406K2360
$$ -1502428 -1444774 -1434997 -1428777 -1448573 -1471643 -1477207 -1483637 -1491117 -1480054 -1494608 -1488447 -1466041 -1443681
8512a443681r322j1261j387K6411q508J4193J3368m052L031J7820j013j6038j616
$$ -1443681 -1453003 -1464264 -1465651 -1439240 -1447748 -1433555 -1420187 -1424239 -1421208 -1403388 -1404401 -1420439 -1422055
8499a422055J5357K3313N516l344q549l1435j8557P742L345J9527K5908L2077
$$ -1422055 -1406698 -1383385 -1377869 -1381213 -1389762 -1421197 -1439754 -1432012 -1428667 -1409140 -1383232 -1351155
8487a351155L2795j0823j2990m850j664k2805j5583L0145J0587n0651j9091R587
$$ -1351155 -1318360 -1329183 -1342173 -1347023 -1348687 -1371492 -1387075 -1356930 -1346343 -1396994 -1416085 -1406498
8475a406498J7341K4816Q396m6187p187K6400L0654K9167k2915k07K0505m80K0882
$$ -1406498 -1389157 -1364341 -1355945 -1402132 -1409319 -1382919 -1352265 -1323098 -1346013 -1346220 -1325715 -1326195 -1305313
8462a305313k7811J1022J7769n423l4447l3908p896K6130M4641K773k2665k97
$$ -1305313 -1333124 -1322102 -1304333 -1309756 -1344203 -1378111 -1386007 -1359877 -1315236 -1312463 -1335128 -1335425
8450a335425o211j098n036l933Q966M1131P1K9992R396l8216j8758k8709P364
$$ -1335425 -1341636 -1342734 -1347770 -1351703 -1342737 -1301606 -1301535 -1271543 -1262147 -1300363 -1319121 -1347830 -1340466
8437a340466L9456L4046l124l354J8357m057k4298l5123J1630K7774M830k7032
$$ -1340466 -1301010 -1266964 -1270088 -1273442 -1255085 -1259142 -1283440 -1318563 -1306933 -1279159 -1274329 -1301361
8425a301361m223K3727K588j6597k5376k419k354J4874K0962J63K4925R314k8184
$$ -1301361 -1305584 -1281857 -1279269 -1295866 -1321242 -1323661 -1326015 -1311141 -1290179 -1290016 -1265091 -1255777 -1283961
8412a283961j1953R601k2317p111J3835O722K878M928n694r224k271J9151J9153
$$ -1283961 -1295914 -1286313 -1308630 -1315741 -1301906 -1295184 -1292306 -1287378 -1293072 -1302296 -1304567 -1285416 -1266263
8399a266263q798J8718K842R074K595q446q707J9710K6481l224k093J374Q887
$$ -1266263 -1275061 -1256343 -1253501 -1244427 -1241832 -1250278 -1258985 -1239275 -1212794 -1216018 -1218111 -1216737 -1207850
8386a207850p303n678k6991j1646K1240n668p631Q987K2127N320O399J3417m6751
$$ -1207850 -1215153 -1220831 -1247822 -1259468 -1238228 -1243896 -1251527 -1242540 -1220413 -1215093 -1208694 -1195277 -1242028
8373a242028k142L003j7475K8946K9357p4j762l4742p423K597j3828q498J1047
$$ -1242028 -1244170 -1241167 -1258642 -1229696 -1200339 -1200413 -1202175 -1236917 -1244340 -1241743 -1255571 -1264069 -1253022
8360a253022J9298J349R845K627J5165J672k0678n118O244k376j1308o519p342
$$ -1253022 -1233724 -1232375 -1222530 -1219903 -1204738 -1203066 -1223744 -1228862 -1222618 -1224994 -1236302 -1242821 -1250163
8347a250163j6423M7310J4140r596M0936J5773k3026J3294k2344J113j1832q575
$$ -1250163 -1266586 -1219276 -1205136 -1214732 -1173796 -1158023 -1181049 -1167755 -1190099 -1188986 -1200818 -1209393
8335a209393l636P463J1595L1715J9066L507l008j0674j2751l904k1916K263J2536
$$ -1209393 -1213029 -1205566 -1193971 -1162256 -1143190 -1139683 -1142691 -1153365 -1166116 -1170020 -1191936 -1189673 -1177137
8322a177137k5487k4070J2527K1389L6525J421q368J6142L2760j3404j0221k451
$$ -1177137 -1202624 -1226694 -1214167 -1192778 -1156253 -1154832 -1163200 -1147058 -1114298 -1127702 -1137923 -1140374
8310a140374j1085k8177o094j0251k4108J6627k3378k388j0790J6540K2853j0057
$$ -1140374 -1151459 -1179636 -1185730 -1195981 -1220089 -1203462 -1226840 -1229228 -1240018 -1223478 -1200625 -1210682
8298a210682k5488K1546o31j8578k472J3816L922Q916N680L897L064J5646q891
$$ -1210682 -1236170 -1214624 -1215255 -1233833 -1236305 -1222489 -1218567 -1209651 -1203971 -1200074 -1197010 -1181364 -1190255
8285a190255l3793J6342K0112j7245J0900r13j1990k5134L4977L0972J8994P243
$$ -1190255 -1224048 -1207706 -1187594 -1204839 -1193939 -1194852 -1206842 -1231976 -1196999 -1166027 -1147033 -1139790
8273a139790j8360m1810K3714J3509k5185K872J040M3144L3646M267m9466k3372
$$ -1139790 -1158150 -1199960 -1176246 -1162737 -1187922 -1185050 -1184010 -1140866 -1107220 -1102953 -1152419 -1175791
8261a175791k1455j5319J2198j9837k453L4099q82l2233j5777K6727L719K3719
$$ -1175791 -1197246 -1212565 -1200367 -1220204 -1222657 -1188558 -1189440 -1221673 -1237450 -1210723 -1207004 -1183285
8249a183285m2661j1920O462k167J9418K9523J1308K447J6537L8313K930l9534
$$ -1183285 -1225946 -1237866 -1231404 -1233571 -1214153 -1184630 -1173322 -1170875 -1154338 -1116025 -1113095 -1152629
8237a152629k3793l1878K6011N347j7484o015Q365l8350N644N9707J7112k8454
$$ -1152629 -1176422 -1208300 -1182289 -1176942 -1194426 -1200441 -1192076 -1230426 -1224782 -1165075 -1147963 -1176417
8225a176417l2853k5132N298j9649j0399k633K8478K3419R324j4212L326k041
$$ -1176417 -1209270 -1234402 -1229104 -1248753 -1259152 -1261785 -1233307 -1209888 -1200564 -1214776 -1211450 -1213491
8213a213491J4628Q661k5908p446J1245K24k697J23r734R23J8510M1692J2542
$$ -1213491 -1198863 -1190202 -1216110 -1223556 -1212311 -1212087 -1214784 -1214661 -1224395 -1223472 -1204962 -1163270 -1150728
8200a150728O309M849o538k573P530R150L063M728k0955k0507k932O62K88l3915
$$ -1150728 -1144419 -1139570 -1146108 -1148681 -1141151 -1132001 -1128938 -1124210 -1145165 -1165672 -1168604 -1167942 -1167654 -1201569
8186a201569j1876K2919R345P612l752j2930k003j9829l9404j0895L1908L4585
$$ -1201569 -1213445 -1190526 -1181181 -1173569 -1177321 -1190251 -1192254 -1212083 -1251487 -1262382 -1230474 -1195889
8174a195889K5784n251n4419k8899L3925j2180j8348L7502K9901l0601p851K1419
$$ -1195889 -1170105 -1175356 -1229775 -1258674 -1224749 -1236929 -1255277 -1217775 -1187874 -1218475 -1226326 -1204907
8162a204907n084K1595M7026k6898m2257L653j738j2418j6817J2435J1260N368
$$ -1204907 -1209991 -1188396 -1141370 -1168268 -1210525 -1206872 -1208610 -1221028 -1237845 -1225410 -1214150 -1208782
8150a208782L960J318l9343n506R180J9036P357K7677l22J6923r370n031N491
$$ -1208782 -1204822 -1203504 -1242847 -1248353 -1239173 -1220137 -1212780 -1185103 -1185425 -1168502 -1177872 -1182903 -1177412
8137a177412K768L829j103O204o116m5134k0165L683O030J0692J2915K174j4713
$$ -1177412 -1174644 -1170815 -1171918 -1165714 -1171830 -1216964 -1237129 -1233446 -1227416 -1216724 -1203809 -1201635 -1216348
8124a216348L800M428K4348Q323j9196q900J297K5597L099J1363j0878j9749j94
$$ -1216348 -1212548 -1208120 -1183772 -1175449 -1194645 -1203545 -1202248 -1176651 -1173552 -1162189 -1173067 -1192816 -1193010
8111a193010L352K2655N397l7997k072K7034K8790j0149l9288j383p330K8554
$$ -1193010 -1189658 -1167003 -1161606 -1199603 -1201675 -1174641 -1145851 -1156000 -1195288 -1196671 -1204001 -1175447
8099a175447Q168l8902p364M5332K4416k0754k0022l5142m63Q787J807l746L613
$$ -1175447 -1167279 -1206181 -1213545 -1168213 -1143797 -1164551 -1184573 -1219715 -1220178 -1211391 -1209584 -1213330 -1209717
8086a209717M4443K2349J3962R45p170P983k6613k239k163K4871j401l2806j6379
$$ -1209717 -1165274 -1142925 -1128963 -1128018 -1135188 -1127205 -1153818 -1156057 -1158220 -1133349 -1134750 -1167556 -1183935
8073a183935L1590l8130j2660K1555L4341J9375k0573j0170j1748k1294J2064
$$ -1183935 -1152345 -1190475 -1203135 -1181580 -1147239 -1127864 -1148437 -1158607 -1170355 -1191649 -1179585
8062a179585R891L5175M9216L933p232k4781j7505k9438j7090J6954J0153l495
$$ -1179585 -1169694 -1134519 -1085303 -1081370 -1088602 -1113383 -1130888 -1160326 -1177416 -1160462 -1150309 -1153804
8050a153804M0769J2041J7560M918k9880k0406j8417L977n638m3162j1002Q304
$$ -1153804 -1113035 -1100994 -1083434 -1078516 -1108396 -1128802 -1147219 -1143242 -1148880 -1192042 -1203044 -1194740
8038a194740R684J1088p189L4479R709K9735n057l4163k9096K7561J5824O601
$$ -1194740 -1185056 -1173968 -1181157 -1146678 -1136969 -1107234 -1112291 -1146454 -1175550 -1147989 -1132165 -1125564
8026a125564N689R76K2649m961r043J873J9658p995r46j4426L8583J7092l7248
$$ -1125564 -1119875 -1118899 -1096250 -1101211 -1110254 -1108381 -1088723 -1096718 -1097664 -1112090 -1073507 -1056415 -1093663
8013a093663q884P543K2304k5562l237L000K2662l3908j8124J5758m3836j8691
$$ -1093663 -1102547 -1095004 -1072700 -1098262 -1101499 -1098499 -1075837 -1109745 -1127869 -1112111 -1155947 -1174638
8001a174638L8737k289l355j6609R30n154k0251k8601j4742j4305j3036o153L2261
$$ -1174638 -1135901 -1138190 -1141545 -1158154 -1157224 -1162378 -1182629 -1211230 -1225972 -1240277 -1253313 -1259466 -1227205
7988a227205K7337J551M2290p357K0003K617n491J0105L957J0944m015k7213L9165
$$ -1227205 -1199868 -1198317 -1156027 -1163384 -1143381 -1140764 -1146255 -1136150 -1132193 -1121249 -1125264 -1152477 -1113312
7975a113312L3822J3617k288o040n023P599J2458j4478O801r29j5348k0382p90
$$ -1113312 -1079490 -1065873 -1068161 -1074201 -1079224 -1071625 -1059167 -1073645 -1066844 -1067773 -1083121 -1103503 -1104293
7962a104293O203J2988l1761l4134j1896p148j1182K1552J4007J698l3924j0348
$$ -1104293 -1098090 -1085102 -1116863 -1150997 -1162893 -1170041 -1181223 -1159671 -1145664 -1143966 -1177890 -1188238
7950a188238P599n330p821j685J0156r40J3345j1753L2290K1968J691k0237k1717
$$ -1188238 -1180639 -1185969 -1193790 -1195475 -1185319 -1186259 -1172914 -1184667 -1152377 -1130409 -1128718 -1148955 -1170672
7937a170672p499L2808K5024Q571n868k6604m928l3146K0735J2637l8050L5528
$$ -1170672 -1178171 -1145363 -1120339 -1111768 -1117636 -1144240 -1149168 -1182314 -1161579 -1148942 -1186992 -1151464
7925a151464K2110p791N673j796L432R999j2397m4495r558L771l104K3160J4950
$$ -1151464 -1129354 -1137145 -1131472 -1133268 -1129836 -1119837 -1132234 -1176729 -1186287 -1182516 -1185620 -1162460 -1147510
7912a147510P210j577K3703q323j0714j0837k596j2948J2060K2631P919J2487
$$ -1147510 -1140300 -1141877 -1118174 -1126497 -1137211 -1148048 -1150644 -1163592 -1151532 -1128901 -1120982 -1108495
7900a108495l6074j9850Q226J2224k3382k7608J423K3983L4038J3403R058l705
$$ -1108495 -1144569 -1164419 -1156193 -1143969 -1167351 -1194959 -1193536 -1169553 -1135515 -1122112 -1113054 -1116759
7888a116759j1269q963j025n199K569k2929m579K3139K9621J6498p590P103o872
$$ -1116759 -1128028 -1136991 -1138016 -1143215 -1140646 -1163575 -1168154 -1145015 -1115394 -1098896 -1106486 -1099383 -1106255
7875a106255l4325L57J7195j0221j9565p387J626M0962J490p232J4980K4746M0751
$$ -1106255 -1140580 -1140223 -1123028 -1133249 -1152814 -1160201 -1158575 -1117613 -1116123 -1123355 -1108375 -1083629 -1042878
7862a042878K7390q539m7281k8758K0048K3996r705j5516j4126k1122J0954j2204
$$ -1042878 -1015488 -1024027 -1071308 -1100066 -1080018 -1056022 -1065727 -1081243 -1095369 -1116491 -1105537 -1117741
7850a117741k6965n5962M976M7945J7107k972k1150J949K8923L5077k9918J6404
$$ -1117741 -1144706 -1200668 -1195692 -1147747 -1130640 -1133612 -1154762 -1152813 -1123890 -1088813 -1118731 -1102327
7838a102327J8178m706j3597J2242m101j7185K7441R636L5047M828R008l0783
$$ -1102327 -1084149 -1088855 -1102452 -1090210 -1094311 -1111496 -1084055 -1074419 -1039372 -1034544 -1025536 -1056319
7826a056319k9490J7510k5659q395L6633M4143J298l5635n070J8206K700K5671
$$ -1056319 -1085809 -1068299 -1093958 -1102353 -1065720 -1021577 -1020279 -1055914 -1060984 -1042778 -1040078 -1014407
7814a014407j1150j1169N219j5933m6073l4115m0830k4724p213J8208R696O098
$$ -1014407 -1025557 -1036726 -1031507 -1047440 -1093513 -1127628 -1168458 -1193182 -1200395 -1182187 -1172491 -1166393
7802a166393Q759J9843R706k3004k835k4046r575J5929J4037J7969r585OM0645
$$ -1166393 -1157634 -1137791 -1128085 -1151089 -1153924 -1177970 -1187545 -1171616 -1157579 -1139610 -1149195 -1149189 -1108544
7789a108544J8327j6013j8760J5899l06j9281O044N227K0803L414K4468K454J297
$$ -1108544 -1090217 -1106230 -1124990 -1109091 -1109397 -1128678 -1122634 -1117407 -1096604 -1093190 -1068722 -1066268 -1064971
7776a064971J7302j082j5031j6482q603k8536m1827j3705M8504N937k714j621
$$ -1064971 -1047669 -1048751 -1063782 -1080264 -1088867 -1117403 -1159230 -1172935 -1124431 -1118494 -1121208 -1122829
7764a122829k8290j3463o285J5445J9676k1980k9687k1644J1874J1215j0153L2756
$$ -1122829 -1151119 -1164582 -1170867 -1155422 -1135746 -1157726 -1187413 -1209057 -1197183 -1185968 -1196121 -1163365
7752a163365L4706p710J0656K5607J9494j1906l7926J8122j0522j766J473q656
$$ -1163365 -1128659 -1136369 -1125713 -1100106 -1080612 -1092518 -1130444 -1112322 -1122844 -1124610 -1123137 -1131793
7740a131793o225K3283q037j2026K5762j843n6420J9559J1696K1231K3278j1322
$$ -1131793 -1138018 -1114735 -1122772 -1134798 -1109036 -1110879 -1167299 -1147740 -1136044 -1114813 -1091535 -1102857
7728a102857j8354p316j2820p350k0197p948L3180M9827r530Q332R833J8249j0141
$$ -1102857 -1121211 -1128527 -1141347 -1148697 -1168894 -1176842 -1143662 -1093835 -1103365 -1095033 -1085200 -1066951 -1077092
7715a077092k3485j1911J4846J8881k873o57k7644l5195j1829l973l166L1047
$$ -1077092 -1100577 -1112488 -1097642 -1078761 -1081634 -1082291 -1109935 -1145130 -1156959 -1160932 -1164098 -1133051
7703a133051J0750J4156M1203J0770j3861l9108J444P386j1745J2721J8560p556
$$ -1133051 -1122301 -1108145 -1066942 -1056172 -1070033 -1109141 -1107697 -1100311 -1112056 -1099335 -1080775 -1088331
7691a088331J9933O516r768k3085J3491J4481R296J5720N084m0467J164K0927
$$ -1088331 -1068398 -1061882 -1071650 -1094735 -1081244 -1066763 -1057467 -1041747 -1036663 -1077130 -1075966 -1055039
7679a055039L0245n821m922J521j7555j5080j0209p510j7345J0211r196K1802
$$ -1055039 -1024794 -1030615 -1035537 -1034016 -1051571 -1066651 -1076860 -1084370 -1101715 -1091504 -1100700 -1078898
7667a078898L6571K0672j688l4754k8209j8408K1968K2185j5751K86k7439L1695
$$ -1078898 -1042327 -1021655 -1023343 -1058097 -1086306 -1104714 -1082746 -1060561 -1076312 -1076026 -1103465 -1071770
7655a071770J5828K208k3643M756K17j7403R56q445J9149J1239m4656N902N3853
$$ -1071770 -1055942 -1053734 -1077377 -1072621 -1072404 -1089807 -1088851 -1097296 -1078147 -1066908 -1111564 -1105662 -1051809
7642a051809j0787j3369J2519m7089j7777J0484j6206K4388L0698K0948L038k0986
$$ -1051809 -1062596 -1075965 -1063446 -1110535 -1128312 -1117828 -1134034 -1109646 -1078948 -1058000 -1054962 -1075948
7630a075948K298K3443J5879R553O295l6765p747J5803k5829k1389J7985J5493
$$ -1075948 -1073650 -1050207 -1034328 -1024775 -1018480 -1055245 -1062992 -1047189 -1073018 -1094407 -1076422 -1060929
7618a060929L4471J8135k1486j2051J6689l1807l2911O97L0474J5826j9480J7248
$$ -1060929 -1026458 -1008323 -1029809 -1041860 -1025171 -1056978 -1089889 -1089192 -1058718 -1042892 -1062372 -1045124
7606a045124p141q378N486L4404J2248O870N937q8113p584N6607J7259k4833L1536
$$ -1045124 -1052265 -1060643 -1055157 -1020753 -1008505 -1001635 -995698 -1083811 -1091395 -1034788 -1017529 -1042362 -1010826
7593a010826K1445k3797N619r902m5387k8999J882R613J6754J6586j7688K8735
$$ -1010826 -989381 -1013178 -1007559 -1017461 -1062848 -1091847 -1089965 -1080352 -1063598 -1047012 -1064700 -1035965
7581a035965J1431J9137R223k115N484k1928r076J4689j0429j8969J4663L1452
$$ -1035965 -1024534 -1005397 -996174 -998289 -992805 -1014733 -1023809 -1009120 -1019549 -1038518 -1023855 -992403
7569i92403l594r289r08o769O06k5615K6994K6743Q762k1561M548O941k1467p436
$$ -992403 -995997 -1005286 -1006194 -1012963 -1012357 -1037972 -1010978 -984235 -975473 -997034 -992486 -985545 -1007012 -1014448
7555a014448k8453l9492K8945K1182L9785K4557l2756j4518k875L419j6469k6633
$$ -1014448 -1042901 -1082393 -1053448 -1032266 -992481 -967924 -1000680 -1015198 -1018073 -1014654 -1031123 -1057756
7543a057756j234K1978j547j0074L210J7996n84L1629m601j8337j822K1257K7735
$$ -1057756 -1058990 -1037012 -1038559 -1048633 -1045423 -1027427 -1028011 -996382 -1000983 -1019320 -1021142 -999885 -972150
7530i72150k8281J8632L0093k6460k0896r572j4166k4688K6858N3000J5030K8416
$$ -972150 -1000431 -981799 -951706 -978166 -999062 -1008634 -1022800 -1047488 -1020630 -967630 -952600 -924184
7518i24184p283l1274q634n549j7414k255l093l7512j5874L0412K5869J4281K7236
$$ -924184 -931467 -962741 -971375 -976924 -994338 -996593 -999686 -1037198 -1053072 -1022660 -996791 -982510 -955274
7505i55274J4241k47l666l8547k4820K1987L2393J4390j9517r182k499r54j6593
$$ -955274 -941033 -941280 -944946 -983493 -1008313 -986326 -953933 -939543 -959060 -968242 -970741 -971695 -988288
7492i88288p406m3776K2182J3669k4636r999J7324p492J9193J9358o488J7036
$$ -988288 -995694 -1039470 -1017288 -1003619 -1028255 -1038254 -1020930 -1028422 -1009229 -989871 -996359 -979323
7480i79323n737J08j5082r848P236n970J2429O003J7760K3169N598k6559n711
$$ -979323 -985060 -984952 -1000034 -1009882 -1002646 -1008616 -996187 -990184 -972424 -949255 -943657 -970216 -975927
7467i75927J3051j9716l998k564K4251m839R875L1758l1747m0885j3721K9574
$$ -975927 -962876 -982592 -986590 -989154 -964903 -969742 -959867 -928109 -959856 -1000741 -1014462 -984888
7455i84888R752K475q17k0723J764O181m685l5632J3088J1807K512J5769M0572
$$ -984888 -975136 -972661 -973478 -994201 -992437 -986256 -990941 -1026573 -1013485 -1001678 -999166 -983397 -942825
7442i42825K499n380k9996n151r242J172K3033L2504j216k7556j0475J1951j6599
$$ -942825 -940326 -945706 -975702 -980853 -990095 -988923 -965890 -933386 -934602 -962158 -972633 -960682 -977281
7429i77281L117J0224k1731q076K7406n412j6478J876m684N341M2703j1893r509
$$ -977281 -974164 -963940 -985671 -993747 -966341 -971753 -988231 -986355 -991039 -985698 -942995 -954888 -964397
7416i64397k084j0442K0574M327J7919j9202j3533M0571k6553k4657n4266R315
$$ -964397 -966481 -976923 -956349 -952022 -934103 -953305 -966838 -926267 -952820 -977477 -1031743 -1022428
7404a022428L1144K0557k2550J3462L0514k6524j1437P023j0809j1868j2065J696
$$ -1022428 -991284 -970727 -993277 -979815 -949301 -975825 -987262 -980239 -991048 -1002916 -1014981 -1013285
7392a013285K4488O749K2937j4604k444K6064R400P449j2879l41L2049L7401j0210
$$ -1013285 -988797 -982048 -959111 -973715 -976159 -950095 -940695 -933246 -946125 -946466 -914417 -877016 -887226
7379h87226n9688k7598J1694J221K7966K1846M765l7074k8450J935J4942M1334
$$ -887226 -946914 -974512 -962818 -961597 -933631 -911785 -907020 -944094 -972544 -970609 -955667 -914333
7367i14333M3737m94m2456m9608m3566j7646Q692N3879J5093Q959k3864P745J8292
$$ -914333 -870596 -871090 -913546 -963154 -1006720 -1024366 -1015674 -961795 -946702 -937743 -961607 -953862 -935570
7354i35570m453o396Q74L5501K8338q804n851K4358l5288o6906r271J490K4359
$$ -935570 -940023 -946419 -945545 -910044 -881706 -890510 -896361 -872003 -907291 -974197 -983468 -981978 -957619
7341i57619J9245l449K5353L398K2889m962k5242Q822L1320K2172o132k0633J0093
$$ -957619 -938374 -941823 -916470 -913072 -890183 -895145 -920387 -911565 -880245 -858073 -864205 -884838 -874745
7328h74745k2312l7739J9591P006O161j4437J1016P567l6069j4638L4057j1216
$$ -874745 -897057 -934796 -915205 -908199 -902038 -916475 -905459 -897892 -933961 -948599 -914542 -925758
7316i25758k2578J0080M0118P905j9305l8760k6943j6142K3968K3104K3776m901
$$ -925758 -948336 -938256 -898138 -890233 -909538 -948298 -975241 -991383 -967415 -944311 -920535 -925436
7304i25436R142K1136j7864L033L2260k2961j4268K8473J4561k4929k2930J053
$$ -925436 -916294 -895158 -913022 -909989 -877729 -900690 -914958 -886485 -871924 -896853 -919783 -918730
7292i18730k5259j5123l7048J3143N1626o005j5281m318J0933r718o925q25L8607
$$ -918730 -943989 -959112 -996160 -983017 -931391 -937396 -952677 -956995 -946062 -955780 -962705 -963530 -924923
7279i24923l3363k5458M7030j0918J9013M827j4355M822J6116L1101K4995k4199
$$ -924923 -958286 -983744 -936714 -947632 -928619 -923792 -938147 -933325 -917209 -886108 -861113 -885312
7267h85312k6070r936m408q707l526K1461L6213L597j6935k9810J4695L693j7880
$$ -885312 -911382 -921318 -925726 -934433 -937959 -916498 -880285 -876688 -893623 -923433 -908738 -905045 -922925
7254i22925m0376k7400o618R856P025L0365R375k5655J3023M0133j066j3964n970
$$ -922925 -963301 -990701 -997319 -987463 -980438 -950073 -940698 -966353 -953330 -913197 -914263 -928227 -934197
7241i34197p806L3696O91L689n413j1028m399k7483l699R907K72J0299K4512q596
$$ -934197 -942003 -908307 -907616 -903927 -909340 -920368 -924767 -952250 -955949 -946042 -945770 -935471 -910959 -919555
7227i19555l0155N0806K5965j2237m3503L1295K5557l382m6189k3903j558J6781
$$ -919555 -949710 -898904 -872939 -885176 -928679 -897384 -871827 -875209 -921398 -945301 -946859 -930078
7215i30078K0847P548K1271P334r432J6302k2059l6791o452R876P282j3072K761
$$ -930078 -909231 -901683 -880412 -873078 -882510 -866208 -888267 -925058 -931510 -921634 -914352 -927424 -924663
7202i24663L8752N718J7225j7508l3635M50k4472K600M4427L6973K103J5254J8754
$$ -924663 -885911 -880193 -862968 -880476 -914111 -913661 -938133 -935533 -891106 -854133 -852030 -836776 -818022
7189h18022m6435m4969k0432P340J0263K6252K0356j6658m3776j4702L1944K3994
$$ -818022 -864457 -909426 -929858 -922518 -912255 -886003 -865647 -882305 -926081 -940783 -908839 -884845
7177h84845J9422m201J0925J0093j9019J4996K3590J8224j4665r354j0630j7164
$$ -884845 -865423 -869624 -858699 -848606 -867625 -852629 -829039 -810815 -825480 -834834 -845464 -862628
7165h62628m4189k4737J0494K6736J744j51j0178j3064J8220L1848j4967k7773
$$ -862628 -906817 -931554 -921060 -894324 -892580 -892731 -902909 -915973 -897753 -865905 -880872 -908645
7153i08645k454J3345k7996j1023J5061K118J0430O847K2280j1670K1481L7209
$$ -908645 -911099 -897754 -925750 -936773 -921712 -919594 -909164 -902317 -880037 -891707 -870226 -833017
7141h33017J2119k1703k7336j2967J7516M2097k4207p8258l1438L4700K2710J6383
$$ -833017 -820898 -842601 -869937 -882904 -865388 -823291 -847498 -925756 -957194 -922494 -899784 -883401
7129h83401J4383p076j9016j316J985J2604M6779j045k0104j1665J1991P474n86
$$ -883401 -869018 -876094 -895110 -896426 -894441 -881837 -835058 -836103 -856207 -867872 -855881 -848407 -848993
7116h48993J647L2637j5718k0630M740k7657k2102J6846L9399L4791L0348q245
$$ -848993 -847346 -814709 -830427 -851057 -846317 -873974 -896076 -879230 -839831 -805040 -774692 -782937
7104g82937j1021R284l9098j963J1097J1408l3118m0773J6146J5367m2604M575
$$ -782937 -793958 -784674 -823772 -825735 -814638 -803230 -836348 -877121 -860975 -845608 -888212 -883637
7092h83637J4256R6L0809N264l300q157k1915j3928k9314J0377J6239k1513m768
$$ -883637 -869381 -869285 -838476 -833212 -836512 -844669 -866584 -880512 -909826 -899449 -883210 -904723 -909491
7079i09491J3042n345J0678p943l497j5189j0424j4627P101K8800L209N667L4111
$$ -909491 -896449 -901794 -891116 -899059 -902556 -917745 -928169 -942796 -935695 -906895 -903686 -898019 -863908
7066h63908K6677j1863k9010o55J101J2365J8467k5908R88L0101j8360m968m952
$$ -863908 -837231 -849094 -878104 -878759 -877658 -865293 -846826 -872734 -871746 -841645 -860005 -864973 -869925
7053h69925L0360p736j4109j8882N007J3841m0662j6013J0176K4815p981N3184
$$ -869925 -839565 -847301 -861410 -880292 -875285 -861444 -902106 -918119 -907943 -883128 -891109 -837925
7041h37925J0155m3715p759M8238O073j545n577j3362k8039k7115j091L1438k9600
$$ -837925 -827770 -871485 -879244 -831006 -824933 -826478 -832055 -845417 -873456 -900571 -901662 -870224 -899824
7028h99824J4359M5276K4108M067l674k5248m8068l1563j9678K3487K3281J850
$$ -899824 -885465 -840189 -816081 -812014 -815688 -840936 -889004 -920567 -940245 -916758 -893477 -891627
7016h91627J5887Q937Q876K3721j4635k5073k1724k31L6432K2062L7284k0478
$$ -891627 -875740 -866803 -857927 -834206 -848841 -873914 -895638 -895869 -859437 -837375 -800091 -820569
7004h20569n7955j0852J0687q294J460l445j317k272K1207L8459m842k2176j1518
$$ -820569 -878524 -889376 -878689 -886983 -885523 -888968 -890285 -892557 -871350 -832891 -837733 -859909 -871427
6991h71427K4225J6485M109j8449J1261m935K958l30K297K5960j5864O43J557
$$ -871427 -847202 -830717 -826608 -845057 -833796 -838731 -835773 -836103 -833806 -807846 -823710 -823067 -821510
6978h21510L9063l872k3527n694J7255o2924l4822N466k432M6315M8419j9301
$$ -821510 -782447 -786319 -809846 -815540 -798285 -861209 -896031 -890565 -892997 -846682 -798263 -817564
6966h17564k1404J4615L2312j9905k5781K0699k5252l6505j2711L200K8365J8327
$$ -817564 -838968 -824353 -792041 -811946 -837727 -817028 -842280 -878785 -891496 -888296 -859931 -841604
6954h41604j1274o371L423m060K0823j6758L5307O595j1215j0124j894O322J0398
$$ -841604 -852878 -859249 -855826 -859886 -839063 -855821 -820514 -813919 -825134 -835258 -837152 -830830 -820432
6941h20432J4039J7139r11k6284j9763j3656l324M543K6420j5979Q837J4040J9328
$$ -820432 -806393 -789254 -790165 -816449 -836212 -849868 -853192 -848649 -822229 -838208 -829371 -815331 -796003
6928g96003R931m1701k3663J6975j784q341J5728o28l9706J7889j658K922p436
$$ -796003 -786072 -827773 -851436 -834461 -836245 -844586 -828858 -829486 -869192 -851303 -852961 -850039 -857475
6915h57475J345J1709j107M537M051r929R89M1801R711k3026K0145J9944P643
$$ -857475 -856130 -844421 -845528 -840991 -836940 -846869 -845880 -804079 -794368 -817394 -797249 -777305 -769662
6902g69662Q157O928J7053q082l0558j4265J6276o815J3952J57l9340K728N255
$$ -769662 -761505 -754577 -737524 -745606 -776164 -790429 -774153 -780968 -767016 -766859 -806199 -803471 -798216
6889g98216p878p884j106L599L3607M668l0942m4326k5712J027J8893L0413M272
$$ -798216 -806094 -813978 -815084 -811485 -777878 -773210 -804152 -848478 -874190 -873163 -854270 -823857 -819585
6876h19585k1600j6258J1296l486Q930M901k0783J1777K9846Q213J9774k8167
$$ -819585 -841185 -857443 -846147 -849633 -840703 -835802 -856585 -844808 -814962 -806749 -786975 -815142
6864h15142k292J6065N855p298l425j6578j7775n329J5057k3650L228L7996k047
$$ -815142 -817434 -801369 -795514 -802812 -806237 -822815 -840590 -845919 -830862 -854512 -851284 -813288 -815335
6851h15335j5925L316j0493J1222L0281r319j6726N58J587K8696M7922j3713l376
$$ -815335 -831260 -827944 -838437 -827215 -796934 -806253 -822979 -822421 -820834 -792138 -744216 -757929 -761305
6838g61305j8884M992j3829k5968p251L438J9183k399q757o524j299Q34J1868
$$ -761305 -780189 -775197 -789026 -814994 -822245 -818807 -799624 -802023 -810780 -817304 -818603 -817769 -805901
6825h05901j4045N359R743Q049j7701J0145k0564j3808p398J0134K8833k38k2391
$$ -805901 -819946 -814587 -804844 -796795 -814496 -804351 -824915 -838723 -846121 -835987 -807154 -807392 -829783
6812h29783K5406L6516J0449l6196q015m479j1161l609M038L2636J1498j3907
$$ -829783 -804377 -767861 -757412 -793608 -801623 -806102 -817263 -820872 -816834 -784198 -772700 -786607
6800g86607r527L93K9694J5157J702L7287J8053m8216n6158J5994j1820l2439
$$ -786607 -796134 -795741 -766047 -750890 -749188 -711901 -693848 -742064 -798222 -782228 -794048 -826487
6788h26487J7296k495J1168K3592j9873n702L2280M11k5392j1965J0649j5821
$$ -826487 -809191 -811686 -800518 -776926 -796799 -802501 -770221 -769810 -795202 -807167 -796518 -812339
6776h12339J3608M0383k2492J1356K4366k793m35J4806q727j7912K0165O540K4874
$$ -812339 -798731 -758348 -780840 -769484 -745118 -747911 -748346 -733540 -742267 -760179 -740014 -733474 -708600
6763g08600P651j1213l3158j8669k389m435L6195K0741P932J7088M310J7197J7244
$$ -708600 -700949 -712162 -745320 -763989 -766378 -770813 -734618 -713877 -705945 -688857 -684547 -667350 -650106
6750f50106J0733j9700k8147J706j0280j9391K714R340L787M244m164j1247N571
$$ -650106 -639373 -659073 -687220 -685514 -695794 -715185 -712471 -703131 -699344 -695100 -699264 -710511 -704940
6737g04940O140K2038L9030K9804l099Q607L9236K5093K8800K2983N2864M5604
$$ -704940 -698800 -676762 -637732 -607928 -611027 -602420 -563184 -538091 -509291 -486308 -433444 -387840
6725c87840L8996l7585p5542j68368k51455j84738q2355j0590K4250K0869L6349
$$ -387840 -348844 -386429 -461971 -630339 -881794 -1066532 -1148887 -1159477 -1135227 -1114358 -1078009
6714a078009R814J2665K3161J2750M456L4158J9957m009j3184J1660J41k1500
$$ -1078009 -1068195 -1055530 -1032369 -1019619 -1015163 -981005 -961048 -965057 -978241 -966581 -966440 -987940
6702i87940J8735L3744j6675M722L0694k1256J2050J898R852L0386p012j0320
$$ -987940 -969205 -935461 -952136 -947414 -916720 -937976 -925926 -924028 -914176 -883790 -890802 -901122
6690i01122n376M033K1472m002m666L554j4859k9459k6221R984j4693J813m21
$$ -901122 -906498 -902465 -880993 -884995 -889661 -886107 -900966 -930425 -956646 -946662 -961355 -959542 -959963
6677i59963l671M5568M5402l2976j5568n0349N189J9225J3564L8408M156k1552
$$ -959963 -963634 -918066 -872664 -905640 -921208 -971557 -966368 -947143 -933579 -895171 -891015 -912567
6665i12567J5321J4802O377r897j221M334j7632j8083J4063K7009J6196j995M502
$$ -912567 -897246 -882444 -876067 -885964 -887185 -882851 -900483 -918566 -904503 -877494 -861298 -863293 -858791
6652h58791j9384k0094k853M2948M0561n196P441k3069J4870j1863k0017K2468
$$ -858791 -878175 -898269 -901122 -858174 -817613 -822809 -815368 -838437 -823567 -835430 -855447 -832979
6640h32979O057K806J296j3826j7010J786q618k3124K8085L3050l7430k4859L5268
$$ -832979 -826922 -824116 -822820 -836646 -853656 -851870 -860488 -883612 -855527 -822477 -859907 -884766 -849498
6627h49498M258k0579K8465k5181k3239J6094R031J4579J6299J4300J1620k193
$$ -849498 -845240 -865819 -837354 -862535 -885774 -869680 -860649 -846070 -829771 -815471 -803851 -806044
6615h06044k467q754m2357q993K9103J4203P984n3196m7989M8317L7842o984k9957
$$ -806044 -808511 -817265 -859622 -868615 -839512 -825309 -817325 -870521 -918510 -870193 -832351 -839335 -869292
6602h69292R145r86K1661k609k766P514O819j6024J5817J5262L282o11L310K2420
$$ -869292 -860147 -861133 -839472 -842081 -844847 -837333 -830514 -846538 -830721 -815459 -812177 -812788 -809478 -787058
6588g87058N668m928l6001o272O385M5399L7923r397j2339k6768l0830J4290J4281
$$ -787058 -781390 -786318 -822319 -828591 -822206 -776807 -738884 -748281 -760620 -787388 -818218 -803928 -789647
6575g89647j441j8773j5759K38K5821K3070r952j9644k4842K6541J4646k6033
$$ -789647 -791088 -809861 -825620 -825382 -799561 -776491 -786443 -806087 -830929 -804388 -789742 -815775
6563h15775j0320O038K8354R910j4139j0966O755P839J6337J0346l1734R248J8682
$$ -815775 -826095 -820057 -791703 -781793 -795932 -806898 -800143 -792304 -775967 -765621 -797355 -788107 -769425
6550g69425J6609L3151J0804j1795P563l3502m5363l9832J4764J7108p253J2776
$$ -769425 -752816 -719665 -708861 -720656 -713093 -746595 -791958 -831790 -817026 -799918 -807171 -794395
6538g94395q758n134J2632k0482k1874J81J0536J148j5077Q55J5431K4956K5239
$$ -794395 -803153 -808287 -795655 -816137 -838011 -837830 -827294 -826146 -841223 -840368 -824937 -799981 -774742
6525g74742L0018J9805m1065n3620k0592J7858K4621l692R924j7914j6890L991
$$ -774742 -744724 -724919 -765984 -819604 -840196 -822338 -797717 -801409 -791485 -809399 -826289 -822298
6513h22298o1418j7266J5092L5190L1525K7851k192m8638j6933M9296k22k2501
$$ -822298 -883716 -900982 -885890 -850700 -819175 -791324 -793516 -842154 -859087 -809791 -810013 -832514
6501h32514R996K7869N026l4864k0J0914K3810J5097j3509j0917k3047J0395K0148
$$ -832514 -822518 -794649 -789623 -824487 -824507 -813593 -789783 -774686 -788195 -799112 -822159 -811764 -791616
6488g91616M519J1841k8599k6409J262M6483J173j4903j5778J5471J6840j2404
$$ -791616 -787097 -775256 -803855 -830264 -829002 -782519 -781346 -796249 -812027 -796556 -779716 -792120
6476g92120r135M6312j3440m6225Q018J7277J7853l5272k7145J4531m590j4406
$$ -792120 -801255 -754943 -768383 -814608 -806590 -789313 -771460 -806732 -833877 -819346 -823936 -838342
6464h38342R45J7308L8095j5147J2080R754R280J6804k35o4963P585J446p737
$$ -838342 -837397 -820089 -781994 -797141 -785061 -775307 -766027 -749223 -749458 -814421 -806836 -805390 -813127
6451h13127J8521N975K512L1012O069k8575J6014K5246k4087l9697J755P124P087
$$ -813127 -794606 -788631 -786119 -755107 -749038 -777613 -761599 -736353 -760440 -800137 -798382 -791258 -784171
6438g84171M0769K1859j8169l6508o236K4989p402m200k0472k5337j6912J6772
$$ -784171 -743402 -721543 -739712 -776220 -782456 -757467 -764869 -769069 -789541 -814878 -831790 -815018
6426h15018j2191r592N1475L7494j4911j7924N555K842p543j3138Q017L003J4593
$$ -815018 -827209 -836801 -785326 -747832 -762743 -780667 -775112 -772270 -779813 -792951 -784934 -781931 -767338
6413g67338k0794k6952N400k6415j9398J4020N0723j979J339L2541K382l2002
$$ -767338 -788132 -815084 -809684 -836099 -855497 -841477 -790754 -792733 -791394 -758853 -756471 -788473
6401g88473L4266N4322j1189l1952j0571k2522L5461K0968N321j6102K6449n414
$$ -788473 -754207 -699885 -711074 -743026 -753597 -776119 -740658 -719690 -714369 -730471 -704022 -709436
6389g09436m4822j7020r87L355R110k393J7268j065k0609q906r747J0623j865
$$ -709436 -754258 -771278 -772265 -768910 -759800 -762193 -744925 -745990 -766599 -775505 -785252 -774629 -776494
6376g76494j0936l3063K9371M9459N621M270l7383j4562K2823L9734L7227k5908
$$ -776494 -787430 -820493 -791122 -741663 -736042 -731772 -769155 -783717 -760894 -721160 -683933 -709841
6364g09841j1134k3072p269J4804k1369L586J5814q374q020J937j3025n15L437
$$ -709841 -720975 -744047 -751316 -736512 -757881 -754295 -738481 -746855 -754875 -752938 -765963 -766478 -763041
6351g63041j7819j6295K2878K4498M629j4584m7693j526M4049j764j2338j7002
$$ -763041 -780860 -797155 -774277 -749779 -745150 -759734 -807427 -808953 -764904 -766668 -779006 -796008
6339g96008J2959N806k8538K603L7857n33M565r457L737O659j3516j6790J0641
$$ -796008 -783049 -777243 -805781 -803178 -765321 -765854 -761289 -770746 -767009 -760350 -773866 -790656 -780015
6326g80015k7497n746Q520R899m514l523p927Q484K4823j550q773j3171J3005
$$ -780015 -807512 -813258 -804738 -794839 -799353 -802876 -810803 -802319 -777496 -779046 -787819 -800990 -787985
6313g87985M3033M4091j2591p111o738p597k2038l0817J5423K1031o881j3097
$$ -787985 -744952 -700861 -713452 -720563 -727301 -734898 -756936 -787753 -772330 -751299 -758180 -771277
6301g71277Q365j6542J6867k183J8861J2438J1113k1192j2900J4264p322j5060
$$ -771277 -762912 -779454 -762587 -764770 -745909 -733471 -722358 -743550 -756450 -742186 -749508 -764568
6289g64568j7792N080j521k0661m659K7988J8262R222K5449j5128j256R383k4147
$$ -764568 -782360 -777280 -778801 -799462 -804121 -776133 -757871 -748649 -723200 -738328 -739584 -730201 -754348
6276g54348r780n704m121K5295J88j5446j3765O086L3709J7102j2338j0041j7514
$$ -754348 -764128 -769832 -773953 -748658 -748470 -763916 -777681 -771595 -737886 -720784 -733122 -743163 -760677
6263g60677j2991J1316K4839R662O875m063M875m690j7051l1182P952K691Q003
$$ -760677 -773668 -762352 -737513 -727851 -720976 -725039 -720164 -724854 -741905 -773087 -765135 -762444 -754441
6250g54441J016j6451L366J2891J4789o993j5537p321L901k0105m353L3076K0381
$$ -754441 -753425 -769876 -766510 -753619 -738830 -745823 -761360 -768681 -764780 -784885 -789238 -756162 -735781
6237g35781J6962m373o506J1754p962n90k26J6119j6210o113J7770j6443j2439
$$ -735781 -718819 -723192 -729698 -717944 -725906 -726496 -726722 -710603 -726813 -732926 -715156 -731599 -744038
6224g44038J4538p776j899p173M245k8432k6419J3420m430R572K5440J6761o05
$$ -744038 -729500 -737276 -739175 -746348 -742103 -770535 -796954 -783534 -787964 -778392 -752952 -736191 -736796
6211g36796Q219k6693K422r756J8804n120k9221L1577N380L481p576R039M136
$$ -736796 -728577 -755270 -752848 -762604 -743800 -748920 -778141 -746564 -741184 -737703 -745279 -736240 -732104
6198g32104J0907k7360k099R747J0869J3272J3081k7144m4939o101M0203K1947
$$ -732104 -721197 -748557 -750656 -740909 -730040 -716768 -703687 -730831 -775770 -781871 -741668 -719721
6186g19721j3041l8216J9922K5775r843J1861l4777j0022J4526l4336k7222K4930
$$ -719721 -732762 -770978 -751056 -725281 -735124 -723263 -758040 -768062 -753536 -787872 -815094 -790164
6174g90164N1480O566l5269L7728M4789R800p053j0671j7514l0681j8058J8991
$$ -790164 -738684 -732118 -767387 -729659 -684870 -675070 -682123 -692794 -710308 -740989 -759047 -740056
6162g40056K1583j058J0705k0952K882k425j1335J2330J6941J9284j3615j1155
$$ -740056 -718473 -719531 -708826 -729778 -726896 -729321 -740656 -728326 -711385 -692101 -705716 -716871
6150g16871K0282Q624j1254Q054j4281k4922J4455N9217l89m5977k2266p13L8388
$$ -716871 -696589 -687965 -699219 -691165 -705446 -730368 -715913 -656696 -657085 -703062 -725328 -726041 -687653
6137f87653j1611k4454j4776J7492O416M245j7022l2576j9571L2999Q431J0095
$$ -687653 -699264 -723718 -738494 -721002 -714586 -710341 -727363 -759939 -779510 -746511 -738080 -727985
6125g27985J3428L2900j5979J7487L942k9197j1252K2143L4943m67j7665m6528
$$ -727985 -714557 -681657 -697636 -680149 -676207 -705404 -716656 -694513 -659570 -660037 -677702 -724230
6113g24230J447m644J6832K9710K0596k5701j5647j6548j7644K1738o481J119
$$ -724230 -722783 -727427 -710595 -680885 -660289 -685990 -701637 -718185 -735829 -714091 -720572 -719453
6101g19453R80j486k3407R494K8035j210n615j7700J4728L8513k382j8669l988
$$ -719453 -718473 -719959 -743366 -733872 -705837 -707047 -712662 -730362 -715634 -677121 -679503 -698172 -702160
6088g02160j2675m2222J2666K8335J0094j5559O77J5436r96J8141J2487P174n0065
$$ -702160 -714835 -757057 -744391 -716056 -705962 -721521 -720844 -705408 -706404 -688263 -675776 -668602 -718667
6075g18667k0623L3385J7369j5704n461k874j8542p104k7332j588K0636K6572
$$ -718667 -739290 -705905 -688536 -704240 -709701 -712575 -731117 -738221 -765553 -767141 -746505 -719933
6063g19933l4033k0283L8597k646j2803J0169k6691N834N5164K2750N667j9385
$$ -719933 -753966 -774249 -735652 -738298 -751101 -740932 -767623 -761789 -706625 -683875 -678208 -697593
6051f97593m934N288k4061J7487J4298k8431k1243l0384q398Q307L3475P86J4454
$$ -697593 -702527 -697239 -721300 -703813 -689515 -717946 -739189 -769573 -777971 -769664 -736189 -735403 -720949
6038g20949L3271p523m4122J3138J7659k6742L923O631l1084J5420K8557k898
$$ -720949 -687678 -695201 -739323 -726185 -708526 -735268 -731345 -724714 -755798 -740378 -711821 -714719
6026g14719L43Q054L1912J6298k587j6291l6860Q621o064J1172K414K5107l0000
$$ -714719 -714376 -706322 -674410 -658112 -660699 -676990 -713850 -705229 -711293 -700121 -697707 -672600 -702600
6013g02600P755L6056k1962m3116J6889J8531R27K0909j1091j4170l653j6868
$$ -702600 -694845 -658789 -680751 -723867 -706978 -688447 -687520 -666611 -677702 -691872 -695525 -712393
6001g12393l7752j1795K9697L0989q651l8624J9100J5436J9978J1858N011k3713
$$ -712393 -750145 -761940 -732243 -701254 -709905 -748529 -729429 -713993 -694015 -682157 -677146 -700859
5989g00859k1086p746J6234j910P303J8740j5258k79j0946k3585J6531K7923m056
$$ -700859 -721945 -729691 -713457 -715367 -708064 -689324 -704582 -704861 -715807 -739392 -722861 -694938 -698994
5976f98994L939R924q765J8296j0383m040j9647J7492o613k389L223j8508Q300
$$ -698994 -695055 -685131 -693896 -675600 -685983 -690023 -709670 -692178 -698791 -701180 -697957 -716465 -708165
5963g08165J0820M1008K544p726K8k66m1084j1166N898k2118j5374j8070L8532
$$ -708165 -697345 -656337 -653793 -661519 -661491 -661757 -702841 -714007 -708109 -730227 -745601 -763671 -725139
5950g25139j0864k2767P390L7979N0728J5107o040j6263j4137o87j849O308K561
$$ -725139 -736003 -758770 -751380 -713401 -662673 -647566 -653606 -669869 -684006 -684693 -686542 -680234 -677673
5937f77673p71k476K6357K3517k7447J1302r154o2522k3835M83j4990m285K1296
$$ -677673 -678444 -680920 -654563 -631046 -658493 -647191 -656345 -718867 -742702 -742219 -757209 -761494 -740198
5924g40198J3889k7949M1426K9472p191l129J7419j5572N4190J8830o6421k2793
$$ -740198 -726309 -754258 -712832 -683360 -690551 -693680 -676261 -691833 -637643 -618813 -685234 -708027
5912g08027m1710J9582L4807K4939K0298l0857k9506p763k428L543L9326K2626
$$ -708027 -749737 -730155 -695348 -670409 -650111 -680968 -710474 -718237 -720665 -717122 -677796 -655170
5900f55170k0105k4864J3397K3944L3539j5834o2235k5308j1858K3638R683n589
$$ -655170 -675275 -700139 -686742 -662798 -629259 -645093 -707328 -732636 -744494 -720856 -711173 -716762
5888g16762J5599j4345j4176k849K5176j1367r574J2211J4552J2345l036K5775
$$ -716762 -701163 -715508 -729684 -732533 -707357 -718724 -728298 -716087 -701535 -689190 -692226 -666451
5876f66451l5996Q232j7449j1637J124p148J1188K979j4048n491J5222l0888R669
$$ -666451 -702447 -694215 -711664 -723301 -722177 -729325 -718137 -715158 -729206 -734697 -719475 -750363 -740694
5863g40694K8801K7258L3780n580j5481j0657j5469l308J0231k0627r009J9207
$$ -740694 -711893 -684635 -650855 -656435 -671916 -682573 -698042 -701350 -691119 -711746 -720755 -701548
5851g01548j32j5905L1219K5934o555j0516J1409J8714j4381Q825j1381l9018
$$ -701548 -701680 -717585 -686366 -660432 -666987 -677503 -666094 -647380 -661761 -652936 -664317 -703335
5839g03335j0250K6805J3108m458r441J6670J9557n304j7282j9769j9307J9081
$$ -703335 -713585 -686780 -673672 -678130 -687571 -670901 -651344 -656648 -673930 -693699 -713006 -693925
5827f93925J7548K6020J649k9054N325r022l363J1971J6838p186l9564J0180J0458
$$ -693925 -676377 -650357 -648708 -677762 -672437 -681459 -684822 -672851 -656013 -663199 -702763 -692583 -682125
5814f82125r958J427J4913J5932l1343j7869R700N462J2005K7582o909Q706m110
$$ -682125 -692083 -690656 -675743 -659811 -691154 -709023 -699323 -693861 -681856 -654274 -661183 -652477 -656587
5801f56587j4897j4697J1649J9419q910r935J8960K1985K73j0378l4857m1899
$$ -656587 -671484 -686181 -674532 -655113 -664023 -673958 -654998 -633013 -632740 -643118 -677975 -719874
$$ [...]
##END NTUPLES=NMR SPECTRUM
##END=
