##TITLE=Analysis number 312693
Compound Code cc 20874
Project Code adrs
Chemist Name synnovation
##JCAMPDX= 6.0         $$ Bruker NMR JCAMP-DX V2.0
##DATA TYPE= NMR SPECTRUM
##DATA CLASS= NTUPLES
##ORIGIN= Bruker BioSpin GmbH
##OWNER= NMR
$$ XWIN-NMR		Version 3.5
$$ Thu Aug 11 10:10:49 2005 GMT Daylight Time (UT+1h)  MAYBRIDGE\NMR@NMR_250MHZ
##.OBSERVE FREQUENCY= 250.131544655141
##.OBSERVE NUCLEUS= ^1H
##.ACQUISITION MODE= SIMULTANEOUS (DQD)
##.ACQUISITION SCHEME= undefined
##.AVERAGES= 16
##.DIGITISER RES= 18
##SPECTROMETER/DATA SYSTEM= dpx250
##.PULSE SEQUENCE= zg30
##.SOLVENT NAME= DMSO
##.SHIFT REFERENCE= (INTERNAL, DMSO, 0, 16.522)
##AUDIT TRAIL= $$ (NUMBER, WHEN, WHO, WHERE, WHAT)
$$ ##TITLE= Audit trail, XWIN-NMR		Version 3.5
$$ ##JCAMPDX= 5.01
$$ ##ORIGIN= Bruker BioSpin GmbH
$$ ##OWNER= NMR
$$ C:\u/data/dgb/nmr/ADRS/7620/pdata/1/auditp.txt
$$ ##AUDIT TRAIL=  $$ (NUMBER, WHEN, WHO, WHERE, WHAT)
(   1,<2005-08-11 10:10:28.53 +100>,<MAYBRIDGE\NMR>,<NMR_250MHZ>,
      <created by zg, POWCHK disabled, PULCHK disabled
       configuration hash MD5:
       62 19 C7 07 E1 42 D1 B7 37 6C 3D D0 77 39 F9 E6
       data hash MD5: 64K
       CE E3 80 0B 4B 0B D5 A2 30 70 1E 51 7C 4F D6 74>)
(   2,<2005-08-11 10:10:41.42 +100>,<MAYBRIDGE\NMR>,<NMR_250MHZ>,
      <Start of raw data processing
       ef LB = 0.3 FT_mod = 6 PKNL = 1 SI = 32K 
       data hash MD5: 32K
       2C B4 43 47 86 BD 38 AA 6A 3C D2 07 14 7C DB 53>)
(   3,<2005-08-11 10:10:43.57 +100>,<MAYBRIDGE\NMR>,<NMR_250MHZ>,
      <apk 
       data hash MD5: 32K
       39 15 81 9E 49 2C 89 28 EB 6B 26 3B 31 9D A4 3F>)
(   4,<2005-08-11 10:10:44.43 +100>,<MAYBRIDGE\NMR>,<NMR_250MHZ>,
      <abs ABSG = 5 
       data hash MD5: 32K
       1C 6D DE C2 08 85 AF 43 A8 F8 C0 3D B7 55 3F 2D>)
$$ ##END=
$$ 
$$ hash MD5
$$ B3 2A FF FB D0 63 FE 99 1B F6 B3 98 B1 97 8C 57
##$RELAX= 
##$RELAX= 
##$RELAX= 
##$RELAX= 
##$RELAX= 
##$RELAX= 
##$RELAX= 
$$ Bruker specific parameters
$$ --------------------------
##$DU= <C:\u>
##$EXPNO= 7620
##$NAME= <ADRS>
##$PROCNO= 1
##$TYPE= <nmr>
##$USER= <dgb>
##$AMP= (0..31)
100 100 100 100 100 100 100 100 100 100 100 100 100 100 100 100 100 100 
100 100 100 100 100 100 100 100 100 100 100 100 100 100 
##$AQSEQ= 0
##$AQ_mod= 3
##$AUNM= <au_zg>
##$AUTOPOS= <11 >
##$BF1= 250.13
##$BF2= 250.13
##$BF3= 250.13
##$BF4= 250.13
##$BF5= 500.13
##$BF6= 500.13
##$BF7= 500.13
##$BF8= 500.13
##$BYTORDA= 1
##$CFDGTYP= 0
##$CFRGTYP= 5
##$CHEMSTR= <none>
##$CNST= (0..31)
1 1 145 1 1 1 1 1 1 1 1 1 1 1 1 1 1 1 1 1 1 1 1 1 1 1 1 1 1 1 1 1 
##$CPDPRG= <>
##$CPDPRG1= <>
##$CPDPRG2= <>
##$CPDPRG3= <>
##$CPDPRG4= <mlev>
##$CPDPRG5= <mlev>
##$CPDPRG6= <mlev>
##$CPDPRG7= <mlev>
##$CPDPRG8= <mlev>
##$CPDPRGB= <>
##$CPDPRGT= <>
##$D= (0..31)
0 1 0 0 0 0 0 0 0 0.06 0 0 0 0 0 0 0.0002 0 0 0 0 0 0 0 0 0 0 0 0 0 0 
0 
##$DATE= 1123751427
##$DBL= (0..7)
120 120 120 120 120 120 120 120 
##$DBP= (0..7)
150 150 150 150 150 150 150 150 
##$DBP07= 0
##$DBPNAM0= <>
##$DBPNAM1= <>
##$DBPNAM2= <>
$$ [...]
##$SUBNAM7= <"">
##$SUBNAM8= <"">
##$SUBNAM9= <"">
##$SW= 20.6930455092707
##$SWIBOX= (0..15)
0 0 3 0 0 0 0 0 0 0 0 0 0 0 0 0 
##$SW_h= 5175.983436853
##$TD= 65536
##$TD0= 1
##$TE= 295.16
##$TE2= 300
##$TE3= 300
##$TEG= 300
##$TL= (0..7)
0 120 120 120 120 120 120 120 
##$TP= (0..7)
150 150 150 150 150 150 150 150 
##$TP07= 0
##$TPNAME0= <>
##$TPNAME1= <>
##$TPNAME2= <>
##$TPNAME3= <>
##$TPNAME4= <>
##$TPNAME5= <>
##$TPNAME6= <>
##$TPNAME7= <>
##$TPOAL= (0..7)
0.5 0.5 0.5 0.5 0.5 0.5 0.5 0.5 
##$TPOFFS= (0..7)
0 0 0 0 0 0 0 0 
##$TUNHIN= 0
##$TUNHOUT= 0
##$TUNXOUT= 0
##$USERA1= <user>
##$USERA2= <user>
##$USERA3= <user>
##$USERA4= <user>
##$USERA5= <user>
##$V9= 5
##$VALIST= <valist>
##$VCLIST= <CCCCCCCCCCCCCCC>
##$VD= 0
##$VDLIST= <DDDDDDDDDDDDDDD>
##$VPLIST= <PPPPPPPPPPPPPPP>
##$VTLIST= <TTTTTTTTTTTTTTT>
##$WBST= 1024
##$WBSW= 4
##$XGAIN= (0..3)
0 0 0 0 
##$XL= 0
##$YL= 0
##$YMAX_a= 395688
##$YMIN_a= -427018
##$ZGOPTNS= <>
##$ZL1= 120
##$ZL2= 120
##$ZL3= 120
##$ZL4= 120
##$ABSF1= 16.522
##$ABSF2= -4.171173
##$ABSG= 5
##$ABSL= 3
##$ALPHA= 0
##$AQORDER= 0
##$ASSFAC= 0
##$ASSFACI= 0
##$ASSFACX= 0
##$ASSWID= 0
##$AUNMP= <proc_1d>
##$AZFE= 0.1
##$AZFW= 0.1
##$BCFW= 0
##$BC_mod= 0
##$BYTORDP= 0
##$COROFFS= 0
##$CY= 12.5
##$DATMOD= 1
##$DC= 0
##$DFILT= <>
##$DTYPP= 0
##$F1P= 14.0000005364418
##$F2P= -0.99999901652339
##$FCOR= 0.5
##$FTSIZE= 32768
##$FT_mod= 6
##$GAMMA= 0
##$GB= 0
##$INTBC= 1
##$INTSCL= 1
##$ISEN= 128
##$LB= 0.3
##$LEV0= 0
##$LPBIN= 0
##$MAXI= 10000
##$MC2= 0
##$MEAN= 0
##$ME_mod= 0
##$MI= 0
##$NCOEF= 0
##$NC_proc= -2
##$NLEV= 6
##$NOISF1= 0
##$NOISF2= 0
##$NSP= 0
##$NTH_PI= 0
##$NZP= 0
##$OFFSET= 16.522
##$PC= 1
##$PHC0= -94.94559
##$PHC1= 13.33255
##$PH_mod= 1
##$PKNL= yes
##$PPARMOD= 0
##$PSCAL= 4
##$PSIGN= 0
##$REVERSE= no
##$SF= 250.13
##$SI= 32768
##$SIGF1= 0
##$SIGF2= 0
##$SINO= 400
##$SIOLD= 32768
##$SREGLST= <1H.DMSO>
##$SSB= 0
##$STSI= 32768
##$STSR= 0
##$SW_p= 5175.98343685301
##$SYMM= 0
##$S_DEV= 0
##$TDeff= 65536
##$TDoff= 0
##$TI= <Analysis number 999999
Compound Code 99
Book Reference 9
Project Code 9>
##$TILT= no
##$TM1= 0
##$TM2= 0
##$TOPLEV= 0
##$USERP1= <user>
##$USERP2= <user>
##$USERP3= <user>
##$USERP4= <user>
##$USERP5= <user>
##$WDW= 1
##$XDIM= 32768
##$YMAX_p= 307848612
##$YMIN_p= -214316
$$ End of Bruker specific parameters
$$ ---------------------------------
##NTUPLES= NMR SPECTRUM
##VAR_NAME=  FREQUENCY,     SPECTRUM/REAL,   SPECTRUM/IMAG
##SYMBOL=    X,             R,               I
##VAR_TYPE=  INDEPENDENT,   DEPENDENT,       DEPENDENT
##VAR_FORM=  AFFN,          ASDF,            ASDF
##VAR_DIM=   32768,         32768,           32768
##UNITS=     HZ,            ARBITRARY UNITS, ARBITRARY UNITS
##FACTOR=    0.157963299565203, 1,           1
##FIRST=     4132.6476996994, 0,             0
##LAST=      -1043.33573715361, 0,           0
##MIN=       -1043.33573715361, -214316,     0
##MAX=       4132.6476996994, 307848612,     0
$$ Real data points
##PAGE= N=1
##DATA TABLE= (X++(R..R)), XYDATA
$$ [...]
##PAGE= N=2
##DATA TABLE= (X++(I..I)), XYDATA
21136 521389 522408 520091 525880 534749 529996 525813 525251 521986 520945 522096 518762 522217 529715 534185
21122 534185 539841 537185 535816 530054 535053 540831 539965 534056 528678 529944 522492 525116 529427 520609
21108 520609 518882 528017 519982 527245 536232 535098 531600 533949 539519 529986 528132 532656 529917 515216
21094 515216 521618 543299 550896 543043 536173 538322 542530 533168 527357 531063 532578 530971 525745 524748
21080 524748 535811 547820 554150 541547 533596 530108 528443 529663 524911 527302 526931 520150 512084 515026
21066 515026 527747 536785 537101 535377 537026 541013 543693 536065 533082 535917 543900 539750 531964 530501
21052 530501 530069 528687 523843 525205 531427 539957 548255 552011 543092 536727 541053 546018 545612 536807 530354
21037 530354 528949 534734 541586 541916 542200 533030 523499 528072 532274 532004 534955 540106 552103 549546 541535
21022 541535 536606 532175 541774 546176 550262 548265 546246 549451 549368 553686 554755 551186 550419 539274 530084
21007 530084 533178 544076 543786 536494 537505 545085 553339 545453 533755 532780 541447 549974 546739 550502
20993 550502 551514 555101 559613 560788 556435 550273 547997 548875 551238 553655 559873 563554 556475 552859
20979 552859 556145 561669 556980 555303 558671 551291 546272 535915 535069 536027 541395 543111 540480 545223
20965 545223 552264 539972 531138 533188 542600 551377 554262 555751 557522 563775 568220 573177 568999 553129
20951 553129 550336 544341 541130 544862 551798 557181 565775 571752 568915 563474 560169 553800 544372 538545
20937 538545 545008 550435 562628 572525 578761 573002 564619 564287 557838 557017 557633 554587 556672 558983 556277
20922 556277 558026 552338 555112 550601 546828 550634 564250 559063 560872 565471 558516 545452 536143 534797
20908 534797 550451 556721 560230 562353 571052 574049 564776 558425 558447 565780 574114 577637 576282 571650
20894 571650 562476 551264 550330 554740 562270 567619 564053 555203 557737 561022 560535 562113 558289 557416 567058
20879 567058 562717 557955 560054 571171 568368 571170 581520 585682 584002 578197 567738 564461 569414
20866 569414 576154 579779 582436 579464 577599 573866 575155 576509 577092 579093 575661 573169 573327 574872 573718
20851 573718 574724 582162 577706 576507 581919 585051 584612 583703 576642 569799 580251 584829 586601 586559 577486
20836 577486 574404 580986 581693 587951 582299 581997 575683 580838 589053 589619 587094 592479 591533 586579 584518
20821 584518 577349 576502 574263 579255 585406 588218 594867 585383 578533 588007 591720 596366 597127 586246
20807 586246 589486 594571 597073 594865 599583 605570 606258 603516 596623 593873 592689 591378 588874 586933
20793 586933 585506 591016 590989 580494 578605 584498 588463 580729 577474 572904 577007 574747 582371 592416
20779 592416 598234 599800 596860 592209 597134 590716 588810 581522 579593 578598 570407 564881 569695 580682
20765 580682 586765 597320 607269 595416 591864 592534 593188 589565 593095 590426 594045 591479 589248 593502
20751 593502 598377 601752 598879 597875 595541 595561 591085 589434 591803 588023 587449 594236 601139 600497 601108
20736 601108 595403 595710 590543 587655 591449 600002 612244 607035 604606 598876 597647 597007 590207 592249
20722 592249 600616 607783 602853 599081 602606 602000 595443 593240 595069 601606 601309 603354 611286 613819 606438
20707 606438 597072 599388 602109 598582 594210 597655 603553 604870 602032 599469 596845 598969 602196 598124
20693 598124 591202 589071 592511 595011 594624 592473 591993 582870 581618 596595 599302 607602 609859 608598
20679 608598 605742 615057 607058 598944 592189 579598 582965 588461 585498 593231 603915 605847 610196 608353
20665 608353 606879 603062 600102 608061 619079 619089 612498 614724 611102 623001 624591 624020 625046 621086
20651 621086 612140 613594 622903 623131 631842 631222 620279 620333 621108 621213 609457 606229 608843 602766 600265
20636 600265 601928 610265 619655 615684 615507 612849 619985 624379 634771 630051 632160 637750 636052 639423
20622 639423 628327 621171 623498 630585 636528 634482 634519 621920 620816 625525 627641 627703 634068 633305 624454
20607 624454 622114 627892 628341 627853 632781 635413 626225 626659 627034 627381 630890 630449 632466 629508 632872 629450
20591 629450 626297 635797 641479 637772 639437 641646 647407 643253 635726 634738 630513 630486 625397 623686 635428
20576 635428 639801 638663 647782 647909 642738 645654 638051 633117 634213 642038 652075 653360 645980 643738
20562 643738 642546 641287 643088 643324 637975 636076 632796 632884 635952 646376 655703 652677 652354 660037 661930
20547 661930 656263 639927 635124 645154 640054 636161 643699 657735 652670 640608 641563 641323 645649 657637
20533 657637 661727 663738 658365 655902 650346 646115 644642 646590 647011 641038 636465 636745 646382 649802 651650
20518 651650 652203 657085 655477 655309 651819 640358 640606 645675 646390 645686 646215 642747 642923 652188 657698 667002
20502 667002 661721 668199 674318 665318 664765 665436 666289 654941 649358 650743 644840 648023 657976 665092 672407
20487 672407 656628 648668 654937 665153 662097 663652 662711 671593 669569 667516 656090 661806 672566
20474 672566 681271 684067 677655 680985 683601 680680 680956 686581 683431 682629 676823 676625 675682 673290 674704
20459 674704 671565 676457 681758 673139 673392 673410 674140 676687 681121 693927 696248 695020 692440 689689 687896
20444 687896 684564 681329 682094 680308 673213 668234 669066 675886 681081 679658 679812 685774 680342 680505 679150
20429 679150 675883 676944 676954 676374 682453 685986 685892 689033 692101 687017 690532 687777 688645 690309 690672 687414
20413 687414 684672 685401 691096 695163 690709 691604 692198 693049 691234 693668 699233 687723 684318 690009 696398
20398 696398 702367 705707 701905 691829 691584 696542 704991 712145 707027 705218 707102 711027 716016 710502
20384 710502 707516 703948 700286 696124 688770 690914 697576 709337 720119 718871 715948 702700 703904
20371 703904 712481 715634 711754 705180 702479 701643 698244 707471 706619 695276 696194 700385 703733 709821 717477
20356 717477 714941 717154 725010 723475 718343 720280 725034 713049 712893 714508 705986 702777 709713 714952
20342 714952 712005 704790 708221 712305 715883 715010 724195 725929 716138 709687 718065 713789 702545 699161
20328 699161 702640 703567 703732 712248 716447 720644 725062 730611 737139 729562 716855 721899 729545 729305 724425
20313 724425 722667 724768 722097 720600 719899 718979 719069 711267 713458 721217 722926 728543 727483 723965 725768
20298 725768 723628 728343 730139 732859 732288 730118 724567 728953 726120 724760 723207 728170 732380 730760
20284 730760 738176 743948 745869 736715 733583 738179 744402 746921 742089 740837 740315 749526 745597 740782
20270 740782 740415 739585 744769 753627 748716 742708 737567 742402 746035 748658 750081 737069 732058 742108
20256 742108 748698 739071 733537 738670 744941 754212 755882 754949 758389 762925 763694 760569 754652 750309 756230
20241 756230 752182 746897 746563 755311 756794 758187 758977 761680 755691 749701 745597 745317 757495 765356 760139
20226 760139 756525 749526 759509 764716 763692 759020 747309 743094 755416 765893 765672 756878 763099 770635
20212 770635 773959 779939 775026 764776 760532 768710 773027 774963 772990 771682 772737 771177 768735 769596
20198 769596 769069 771699 771116 772852 765243 766002 775976 775180 777379 776045 777222 779711 775044 775838 790140
20183 790140 793339 790844 785908 782675 778783 769454 771552 773515 774671 777084 787402 790914 794401 791824
20169 791824 783721 787526 792277 792546 786636 781614 783259 783326 786662 780641 786752 790837 787664 787067 782690
20154 782690 787225 785654 776072 783189 797473 802929 796248 788418 789325 797050 801255 801262 798590 803213 802763
20139 802763 804997 802490 794888 794242 794452 788686 793378 792546 793239 786850 794939 798867 801077 796345 802841
20124 802841 809496 814151 818095 823789 823362 829507 825949 815093 819583 810926 801064 806384 809272 812097
20110 812097 815775 816086 814928 815184 813037 815745 822914 825607 818224 808977 804817 806090 811824 805699 802576
20095 802576 810282 823492 822191 819544 823963 827683 841827 844208 833966 822720 824083 819250 817423
20082 817423 826398 836593 839292 838470 838521 839667 829245 821724 829075 833798 834413 830465 828535 832494 839880
20067 839880 841692 843913 834336 823558 830488 840672 830039 831990 837685 837377 844691 845520 843645 838467
20053 838467 831832 833249 840115 852067 856485 854201 851362 853322 853172 853438 843102 839860 848015 843985
20039 843985 840263 844950 847580 852285 860311 862926 859625 863171 864287 864739 869536 869535 869778 869221 871736 864862
20023 864862 862525 859581 852146 851386 849195 854738 855418 859852 864336 860079 860127 868028 875839 868623 866338
20008 866338 871373 874411 878988 879549 877669 880876 877759 881802 883700 879544 869063 876727 877109 874588
19994 874588 869907 866970 882683 885791 883550 882726 888592 897113 900978 889258 875708 880148 882323 887724
19980 887724 889071 891686 890901 887395 893995 904690 900559 894772 900632 906313 895084 886379 888803 883842
19966 883842 886743 893975 898992 900480 902944 908711 913233 910201 916432 921719 922876 910887 900338 905083
19952 905083 912649 911175 920752 917697 907095 901127 901463 911516 916640 917914 917111 919314 919706 915038
19938 915038 909770 906734 907637 911430 916981 917271 917931 916477 913477 921616 931519 929777 932438 929261 916708
19923 916708 917687 920394 921624 927176 929178 934303 932816 927062 920937 915241 925038 932106 939109 951522
19909 951522 958001 953417 952538 945517 948312 961309 959164 953462 949165 943718 950292 948596 947322 951442
19895 951442 953237 950630 947383 941719 941281 943446 957851 962324 952474 947035 951112 951332 955111 953674
19881 953674 950625 954614 959278 961558 958062 947919 948104 953880 960461 958505 952784 962400 974770 977015
19867 977015 973339 975869 973028 965326 966314 976675 983753 989976 989793 980919 969376 969129 974197 973759 978690
19852 978690 989646 993895 982047 984327 989680 992137 994099 989702 995433 998372 996593 1000563 1007054 1005075
19838 1005075 1005056 998696 996650 986671 986553 994883 996180 1001385 998885 988346 991542 1005651 1009582 1014000
19824 1014000 1011258 1005379 1005649 1016914 1012423 1007725 1014467 1021625 1026058 1034197 1030316 1023690 1008645 1008133
19810 1008133 1020593 1023934 1020226 1021864 1020752 1018096 1024538 1029636 1029612 1027509 1023780 1022397 1021788 1026143
19796 1026143 1033484 1031762 1031961 1035484 1036252 1037709 1035501 1036561 1047120 1059298 1053979 1053146 1055586 1058408
19782 1058408 1059460 1056276 1053366 1047688 1045546 1049172 1056765 1053187 1055583 1054283 1056886 1061599 1066086 1072144
19768 1072144 1069533 1076743 1079352 1076337 1065208 1058880 1060565 1066564 1066874 1066610 1078865 1091781 1087986 1080757
19754 1080757 1066436 1070228 1075764 1072267 1058835 1053251 1064687 1082788 1080092 1079609 1084941 1080034 1082262
19741 1082262 1089971 1097655 1096782 1101197 1098320 1097121 1099063 1095885 1095092 1096874 1104766 1108953 1110994 1113303
19727 1113303 1104074 1093344 1096139 1103885 1108950 1112730 1114265 1109490 1108915 1104653 1111486 1109802 1110649 1118022
19713 1118022 1115110 1114590 1123238 1131047 1129680 1120793 1115112 1117564 1119042 1127709 1136379 1133190 1141481 1140798
19699 1140798 1133122 1134939 1136475 1139248 1141111 1139837 1139195 1153594 1151888 1144508 1149694 1154845 1155699 1169653
19685 1169653 1179946 1180758 1174937 1172188 1165238 1161328 1158236 1169961 1171877 1169221 1175000 1186639 1179521
19672 1179521 1185425 1195553 1202578 1207508 1206704 1199356 1198815 1197279 1195203 1195997 1193141 1194453 1207123 1218132
19658 1218132 1225326 1224486 1224186 1221244 1215406 1217806 1219922 1223148 1233180 1244656 1245594 1249286 1257833 1259791
19644 1259791 1267862 1269990 1270931 1267077 1270719 1277841 1278444 1289204 1304644 1322182 1332268 1338367 1345528
19631 1345528 1357436 1358706 1368130 1378091 1372340 1347778 1319255 1288137 1253060 1229917 1210706 1209294
19619 1209294 1215755 1235815 1245888 1248728 1250115 1232164 1208772 1179843 1150468 1120924 1104269 1089868
19607 1089868 1088241 1090940 1101095 1106601 1110169 1127552 1149131 1159569 1168930 1171676 1177049 1178018 1183237
19594 1183237 1189962 1202710 1213963 1203461 1194253 1206275 1220281 1222545 1221198 1229957 1230574 1238200 1235146
19581 1235146 1223687 1233226 1248753 1252688 1250518 1257018 1259678 1258750 1258409 1258645 1257214 1253616 1257874 1263803
19567 1263803 1267749 1270051 1270657 1274707 1279876 1287429 1286754 1287305 1281554 1286234 1296219 1299800 1295521 1300566 1308761
19552 1308761 1317259 1326879 1326448 1328420 1326277 1319197 1322899 1330259 1338349 1342010 1338309 1338437 1331621 1333338
19538 1333338 1336756 1340364 1345709 1343737 1344934 1344856 1348435 1355882 1361399 1357081 1372032 1379618 1381734 1383570
19524 1383570 1381607 1388591 1396218 1393186 1400109 1414853 1422786 1418383 1406783 1402205 1401214 1412267 1414060
19511 1414060 1410285 1420092 1425770 1428036 1436817 1438651 1429008 1424193 1422590 1427408 1430361 1438126 1444937 1454982
19497 1454982 1460600 1469823 1483523 1493848 1500293 1502966 1516051 1535789 1557081 1569073 1576241 1576772 1591637
19484 1591637 1603205 1595876 1560765 1521897 1479564 1437525 1414157 1422974 1437325 1449762 1464216 1486172
19472 1486172 1500054 1488904 1455852 1406805 1359795 1322165 1293008 1280388 1283044 1292481 1308551 1330635
19460 1330635 1347840 1361889 1366299 1374036 1379152 1387397 1387637 1393074 1401805 1415575 1430982 1436648 1432985
19447 1432985 1436306 1444222 1453176 1462001 1466001 1451282 1454727 1457506 1470293 1480202 1480740 1490832 1492046
19434 1492046 1495956 1500521 1500335 1492174 1488595 1490433 1501280 1514001 1525309 1527565 1531093 1543158 1548352
19421 1548352 1547020 1542429 1537070 1531432 1539663 1547356 1546084 1551678 1559065 1559371 1564696 1568164 1571663 1585043
19407 1585043 1595118 1599481 1599708 1605693 1617918 1622093 1615666 1614372 1618698 1620039 1618765 1613587 1617078 1623712
19393 1623712 1633980 1633852 1630912 1638113 1649499 1647994 1643768 1647035 1661022 1673021 1673960 1670106 1673665
19380 1673665 1679527 1686273 1693476 1690593 1692201 1699402 1695889 1701404 1710631 1716238 1720859 1718102 1715900 1719556
19366 1719556 1727425 1733454 1742214 1752161 1762319 1764026 1762524 1762160 1767408 1774720 1781635 1778348 1770190 1773417
19352 1773417 1776701 1780064 1789538 1793779 1796697 1798558 1809512 1817005 1813545 1815382 1820462 1815943 1820241 1824904
19338 1824904 1824610 1832535 1845343 1850015 1846621 1852426 1854224 1855787 1869453 1886791 1903044 1901772 1900657
19325 1900657 1897846 1894399 1891720 1903429 1910950 1926356 1933305 1933258 1927221 1926558 1929877 1937026 1943869 1946816
19311 1946816 1942010 1937820 1936507 1937491 1943219 1953043 1959514 1969517 1985411 1996590 1990351 1971059 1966535
19298 1966535 1971317 1977630 1991697 2005754 2009320 2019707 2022976 2024175 2028980 2038187 2042643 2046824 2054080
19285 2054080 2053103 2057493 2061640 2065311 2073427 2078463 2091845 2110386 2118183 2116157 2117599 2124443 2137642
19272 2137642 2137797 2147510 2147660 2156296 2168308 2173270 2176250 2184831 2194422 2198851 2201686 2200815 2204521 2214134
19258 2214134 2226291 2246884 2254569 2257229 2255757 2259855 2260480 2262096 2254702 2250787 2262089 2273236 2283434
19245 2283434 2292228 2308374 2318814 2325130 2334825 2336584 2341038 2349138 2363334 2369046 2370970 2386528 2397960
19232 2397960 2391867 2394968 2403521 2412387 2423306 2434260 2444981 2447780 2451941 2457234 2465965 2476034 2484366
19219 2484366 2489326 2497679 2515749 2527182 2530114 2531225 2529335 2525711 2538451 2543359 2546467 2552043 2569161
19206 2569161 2575144 2583829 2592848 2607901 2613545 2618886 2635509 2639563 2641135 2659216 2679409 2698817 2705352
19193 2705352 2706984 2710413 2717217 2726898 2746514 2764607 2780159 2792343 2797028 2813481 2841607 2853191
19181 2853191 2860542 2873566 2895105 2913632 2923318 2933210 2947289 2950468 2956477 2964920 2976752 2985488 3011778
19168 3011778 3028224 3046437 3075324 3082386 3085967 3086687 3093333 3100859 3105070 3111988 3117985 3118463 3130674
19155 3130674 3153338 3173345 3190616 3209298 3214498 3237953 3264084 3273190 3285001 3299985 3314510 3328569
19143 3328569 3342535 3352289 3370596 3393764 3409217 3423026 3446172 3470396 3486184 3495983 3521507 3545464
19131 3545464 3574433 3601545 3619198 3638165 3660688 3694719 3714374 3739637 3762462 3776544 3787292
19120 3787292 3795264 3796074 3800802 3820762 3842315 3853509 3874364 3907618 3931393 3954222 3979345 3996138
19108 3996138 4003650 4018229 4030314 4038214 4046225 4066068 4093370 4116438 4135684 4165538 4187193 4199182
19096 4199182 4235500 4281800 4323311 4363864 4402915 4440558 4473104 4499501 4528542 4555086 4589961
19085 4589961 4621737 4655695 4690548 4724328 4763100 4804754 4848958 4885009 4926603 4963885 5007363
19074 5007363 5060916 5106095 5142588 5183040 5221879 5264932 5315283 5361159 5410799 5461143 5512763
19063 5512763 5567948 5632100 5690061 5744272 5806928 5863587 5931461 6006126 6069111 6141027 6211213
19052 6211213 6288465 6359364 6429479 6506066 6582663 6645341 6723736 6815521 6910843 7006459 7100056
19041 7100056 7195899 7298225 7406830 7527364 7645119 7772170 7906372 8036491 8160163 8280696
19031 8280696 8409875 8560174 8718636 8882520 9052529 9225392 9406981 9582843 9763150
19022 9763150 9943614 10106652 10276323 10477978 10717720 10969696 11250672 11553872 11872132
19013 11872132 12206857 12557353 12914519 13288373 13685248 14098138 14547571 15048525 15615526
19004 15615526 16270545 17013589 17846141 18783623 19841240 21040201 22395892 23936581 25691072
18995 25691072 27663805 29857805 32221219 34530200 36296321 36590614 34250048 28646071
18987 28646071 20673380 11996017 4720247 491962 -518514 1055294 4263184 8094741
18979 8094741 11525583 13335796 12057730 6656112 -2284049 -12883635 -22809478 -29791099
18971 -29791099 -33226248 -33701651 -32225961 -29814514 -27160523 -24626384 -22349199 -20339778
18963 -20339778 -18587779 -17072678 -15745135 -14581651 -13555563 -12637720 -11829650 -11122725
18955 -11122725 -10495726 -9928603 -9399284 -8888939 -8405774 -7960061 -7545944 -7177225 -6840178
18946 -6840178 -6519820 -6203327 -5885811 -5591567 -5308270 -5034437 -4764576 -4523029 -4306736
18937 -4306736 -4101024 -3911451 -3750165 -3577151 -3402425 -3237194 -3065626 -2884174 -2708741
18928 -2708741 -2538283 -2364255 -2194722 -2017940 -1850975 -1698388 -1547924 -1402887 -1258835
18919 -1258835 -1110449 -976771 -837776 -690117 -557267 -420339 -283171 -153585 -27636
18910 -27636 110701 250528 377914 509717 639989 761050 886902 1022882 1155151 1277106
18900 1277106 1411333 1555035 1693746 1839932 1979009 2127461 2286979 2445398 2605164
18891 2605164 2767133 2912712 3072152 3249061 3423486 3605876 3801521 3992716 4188799
18882 4188799 4383140 4555051 4713695 4889768 5095548 5318053 5565673 5832427 6129705
18873 6129705 6440920 6754560 7094543 7449644 7789710 8115213 8447930 8816466 9201390
18864 9201390 9605609 10071263 10620804 11265193 11997958 12802821 13663084 14588727 15607669
18855 15607669 16791941 18184779 19790409 21660047 23859423 26477131 29595293 33193344
18847 33193344 37017748 40174174 40421360 34320326 20220364 2296128 -11835628 -18200069
18839 -18200069 -18116055 -14527863 -9508124 -4061175 1314517 5991812 8447988 5901344
18831 5901344 -3872327 -18548933 -31675737 -38783318 -40201889 -38382539 -35379836 -32262547
18823 -32262547 -29442465 -27027127 -24987804 -23264392 -21762660 -20429657 -19259984 -18235285
18815 -18235285 -17319651 -16492279 -15741167 -15053015 -14435482 -13902685 -13440648 -13023971 -12628025
18806 -12628025 -12222958 -11828995 -11469527 -11157342 -10895974 -10645955 -10385425 -10133145 -9874185
18797 -9874185 -9614585 -9356164 -9113570 -8892541 -8702827 -8539059 -8409162 -8313743 -8232991 -8134428
18787 -8134428 -8008957 -7872517 -7720965 -7567129 -7416400 -7275770 -7144074 -7028280 -6915966
18778 -6915966 -6814099 -6734573 -6654835 -6577879 -6491429 -6396395 -6300236 -6201985 -6113506 -6026679 -5948610
18767 -5948610 -5866050 -5786462 -5717130 -5644766 -5567678 -5489050 -5430799 -5371380 -5310548 -5260190 -5193646
18756 -5193646 -5126949 -5065393 -5007337 -4944708 -4889192 -4836651 -4793963 -4748066 -4703746 -4662586 -4614238
18745 -4614238 -4560818 -4515307 -4464825 -4417006 -4369014 -4321343 -4268625 -4226494 -4186837 -4152339 -4117612
18734 -4117612 -4078779 -4048238 -4021590 -3987774 -3949821 -3912947 -3876175 -3838890 -3803574 -3767063 -3737670
18723 -3737670 -3711596 -3688450 -3665506 -3650164 -3639690 -3623889 -3599153 -3568679 -3547271 -3522958 -3485436
18712 -3485436 -3458204 -3434747 -3407750 -3379889 -3355825 -3342590 -3325015 -3304374 -3269325 -3243107 -3224990
18701 -3224990 -3202092 -3182510 -3163642 -3147183 -3119639 -3094743 -3073008 -3046536 -3018365 -2996060 -2969837
18690 -2969837 -2943433 -2918632 -2901199 -2885630 -2884678 -2866001 -2839826 -2824431 -2807295 -2794816 -2778645 -2758088
18678 -2758088 -2743848 -2731636 -2717043 -2695902 -2671170 -2652448 -2645347 -2629121 -2608661 -2584740 -2563828
18667 -2563828 -2552550 -2553444 -2543002 -2528677 -2513541 -2499318 -2486056 -2476284 -2462844 -2443897 -2414340 -2394483
18655 -2394483 -2373846 -2356038 -2332037 -2306152 -2294607 -2293254 -2290344 -2280214 -2269664 -2259234 -2240958 -2226433
18643 -2226433 -2208491 -2193663 -2180117 -2161053 -2144751 -2136268 -2132035 -2134940 -2130509 -2106468 -2086573 -2069189
18631 -2069189 -2065397 -2054111 -2037259 -2035546 -2058150 -2090623 -2102003 -2090270 -2077800 -2061124 -2041081 -2031290
18619 -2031290 -2019861 -1995831 -1981668 -1974793 -1984941 -2009487 -2021772 -2026990 -2017109 -2004266 -1987022 -1971687
18607 -1971687 -1950896 -1936763 -1923971 -1910333 -1897416 -1889707 -1882829 -1870947 -1860264 -1853204 -1837300 -1824329
18595 -1824329 -1818361 -1811462 -1801256 -1794054 -1793279 -1783301 -1772040 -1773135 -1772155 -1762392 -1752019 -1731410 -1718485
18582 -1718485 -1718300 -1708189 -1698605 -1694869 -1688122 -1682191 -1681436 -1671970 -1662353 -1660374 -1662817 -1662540 -1651463 -1641217
18568 -1641217 -1632300 -1615124 -1605352 -1596916 -1591680 -1594511 -1586126 -1571157 -1561047 -1555674 -1548172 -1548057 -1549526
18555 -1549526 -1545239 -1543791 -1545601 -1541673 -1538269 -1527090 -1524145 -1512573 -1502813 -1492121 -1487298 -1485376 -1469769
18542 -1469769 -1466310 -1466068 -1455331 -1442584 -1437368 -1432448 -1419897 -1423425 -1428664 -1429764 -1420787 -1411223 -1410720 -1415079
18528 -1415079 -1418157 -1412586 -1406376 -1407159 -1398226 -1391666 -1386235 -1373740 -1364431 -1365382 -1365729 -1359027 -1356161 -1350771
18514 -1350771 -1337829 -1329076 -1329548 -1325898 -1312510 -1302957 -1303885 -1303791 -1296842 -1283652 -1277363 -1279507 -1274983 -1271099
18500 -1271099 -1258135 -1253962 -1260538 -1257962 -1260512 -1260078 -1250498 -1239507 -1229935 -1226198 -1218072 -1208978 -1206092 -1210321
18486 -1210321 -1212047 -1206781 -1199519 -1193136 -1183018 -1178887 -1175789 -1177214 -1176215 -1178696 -1163986 -1155819 -1150073 -1139137
18472 -1139137 -1126029 -1119999 -1118766 -1124134 -1130888 -1129074 -1122700 -1125651 -1122874 -1113610 -1103408 -1094673 -1101882
18459 -1101882 -1102149 -1088093 -1076378 -1075241 -1075563 -1074272 -1060516 -1056605 -1061532 -1061557 -1055841 -1046806 -1042487 -1039035
18445 -1039035 -1037442 -1037652 -1038262 -1040214 -1037984 -1033174 -1023418 -1015140 -1009996 -1005878 -1002087 -1002883 -999908 -1003135 -1009526
18430 -1009526 -1004934 -992881 -988286 -987131 -975844 -965150 -964188 -957946 -957850 -948268 -940996 -942928 -950584 -951024
18416 -951024 -945836 -935762 -930782 -934134 -928470 -922226 -915470 -920165 -915064 -912574 -907022 -902983 -903361 -905813
18402 -905813 -914617 -915366 -903855 -901958 -902357 -892743 -892042 -889912 -878099 -864728 -855786 -859058 -865268 -864501
18388 -864501 -852838 -848423 -845945 -844278 -853099 -851842 -834164 -827444 -833470 -840102 -840858 -840061 -832493 -825299
18374 -825299 -814992 -808223 -800743 -791717 -786875 -793303 -789469 -781007 -773541 -768667 -773318 -770065 -762968 -758654
18360 -758654 -759855 -748147 -728088 -721773 -712184 -703889 -697841 -685629 -669505 -664115 -652451 -656418 -645817
18347 -645817 -624949 -611503 -602080 -600996 -622129 -647675 -684420 -728747 -754408 -769571 -778446 -775781
18335 -775781 -770461 -758140 -743698 -742717 -742810 -761762 -798465 -828865 -854468 -880210 -897810 -903157 -901570
18322 -901570 -885413 -871053 -862563 -860044 -840780 -824764 -812107 -807034 -802767 -798393 -786623 -778608 -775899
18309 -775899 -766255 -758119 -754880 -757941 -761889 -759411 -750276 -745839 -736268 -730440 -719783 -723717 -727003 -728180
18295 -728180 -725811 -721086 -712868 -705739 -690280 -684995 -687380 -678047 -673056 -680235 -684504 -679775 -679501 -677952
18281 -677952 -683815 -685971 -684694 -676406 -666893 -673978 -672330 -668763 -664396 -664609 -660675 -654497 -644659 -638327
18267 -638327 -633463 -635120 -640582 -643682 -635603 -613787 -599530 -596671 -607226 -610756 -597086 -595136 -594765
18254 -594765 -601565 -598143 -593339 -598047 -598561 -588858 -584601 -582920 -586341 -588424 -584518 -593619 -594226 -582910
18240 -582910 -572450 -562783 -557421 -561812 -565676 -563232 -558837 -560715 -559445 -550935 -539519 -529158 -530706
18227 -530706 -532789 -530240 -529621 -526126 -517513 -512866 -512589 -504081 -498810 -495701 -490492 -486510 -484321 -485433 -482074
18212 -482074 -474934 -461007 -457449 -450422 -435339 -427150 -422885 -414717 -404693 -390565 -371344 -363971 -360624
18199 -360624 -380687 -421114 -475945 -521063 -555993 -574181 -569159 -557504 -546801 -522853 -504861 -495289
18187 -495289 -502038 -528131 -576613 -628836 -659062 -680881 -684360 -682050 -665710 -647467 -640183 -639509 -636815
18174 -636815 -636595 -620528 -604753 -594485 -586623 -583795 -569155 -560530 -559755 -557414 -556271 -548221 -534931
18161 -534931 -540625 -548711 -544010 -530909 -533579 -525780 -517785 -516948 -514009 -508854 -500716 -493610 -486647 -498338
18147 -498338 -505352 -506830 -504399 -505144 -506737 -498920 -486283 -476211 -473324 -473129 -477118 -478428 -475905 -471540
18133 -471540 -474879 -463694 -468173 -462408 -455918 -455208 -456321 -463159 -458635 -454785 -458057 -463057 -459614 -455391
18119 -455391 -454680 -453840 -443614 -433890 -434041 -441323 -444376 -448907 -445483 -449405 -451433 -448836 -437449 -431854
18105 -431854 -432360 -426473 -436765 -440513 -434057 -431397 -431048 -428171 -422476 -412638 -416353 -410143 -407089 -413268
18091 -413268 -418281 -415925 -417293 -425654 -428435 -430365 -428846 -413758 -408931 -411148 -410415 -408503 -406821 -414211
18077 -414211 -421635 -419624 -404811 -392550 -392235 -389722 -386592 -388148 -383732 -382263 -381047 -373074 -370015 -374881
18063 -374881 -379567 -376318 -375030 -369726 -364975 -362926 -365153 -372629 -367035 -361789 -361517 -364748 -358074 -358954 -355097
18048 -355097 -351703 -355089 -359776 -363693 -363522 -366845 -359591 -352772 -353051 -353774 -366486 -371520 -361123 -354102
18034 -354102 -355124 -352967 -352366 -347736 -350644 -355949 -353109 -341925 -333075 -324306 -325420 -333581 -342904 -327363
18020 -327363 -321380 -320598 -325987 -329060 -329954 -321585 -320608 -326197 -331311 -325933 -321330 -312995 -312761 -317559 -321124
18005 -321124 -319652 -316918 -319454 -319209 -317706 -312087 -317041 -319331 -311184 -310859 -314183 -311322 -297951 -279679
17991 -279679 -280661 -293812 -299876 -303863 -307164 -305561 -303123 -303467 -304066 -309045 -306970 -304286 -302123 -291674
17977 -291674 -299182 -306286 -303761 -300686 -294131 -302885 -297347 -291930 -302993 -311511 -309164 -302483 -299420 -289982
17963 -289982 -279526 -272420 -270762 -270078 -268926 -274197 -274473 -279264 -285988 -286128 -288849 -285775 -278318 -274704 -274150
17948 -274150 -271332 -270843 -267169 -256132 -257652 -271229 -277193 -264654 -254307 -261408 -262525 -258558 -263262
17935 -263262 -263451 -261844 -263118 -263014 -253885 -247280 -246615 -246411 -245198 -241627 -235919 -235429 -236265 -243548 -252137 -251043
17919 -251043 -251542 -246844 -244154 -240677 -232554 -225517 -225268 -229136 -227825 -227417 -226050 -230665 -241858 -237775 -231398
17904 -231398 -238258 -234805 -223976 -223370 -233911 -233843 -231378 -229282 -228910 -227378 -220239 -219086 -221021 -223462 -228153
17889 -228153 -227092 -225940 -222403 -228534 -222534 -218155 -218802 -207626 -204539 -205497 -207458 -207095 -210044 -209920 -203338
17874 -203338 -196015 -193907 -191892 -204550 -220155 -217525 -216820 -221120 -216859 -203965 -198928 -210523 -206510
17861 -206510 -199379 -199274 -207023 -201541 -194883 -204504 -207299 -200592 -192834 -184807 -191737 -197328 -194386 -200562
17847 -200562 -197323 -194945 -187075 -182860 -188680 -190936 -182081 -185737 -188237 -191518 -191725 -192736 -188745 -185216
17833 -185216 -184990 -169996 -162916 -162478 -164556 -172517 -168996 -164686 -167847 -161203 -165114 -168319 -172247 -172069 -169674
17818 -169674 -171893 -168713 -172560 -167099 -161757 -166714 -159821 -152722 -149069 -151623 -169035 -168414 -163626 -166587
17804 -166587 -164786 -164116 -156773 -154119 -165345 -168248 -164583 -157819 -151318 -156082 -154042 -151690 -151452 -152100 -152226
17789 -152226 -156992 -158533 -160201 -157791 -161656 -162265 -155271 -154979 -155033 -151994 -146056 -139470 -138588 -130073 -123159
17774 -123159 -127746 -136382 -145600 -148346 -156266 -156272 -152160 -148684 -142705 -138399 -138759 -140694 -134561 -125814 -124306
17759 -124306 -130489 -130991 -124567 -120482 -121865 -127738 -127769 -126491 -123658 -121039 -125795 -133590 -138262 -138589 -137952
17744 -137952 -140427 -130076 -127034 -121358 -118282 -120586 -124133 -129443 -129971 -124323 -119695 -117893 -117280 -115747
17730 -115747 -109596 -112102 -110523 -106078 -103266 -108184 -115424 -114970 -112417 -118621 -119248 -111036 -114144 -112440 -111845
17715 -111845 -106429 -96910 -94477 -95057 -93323 -92743 -98247 -98655 -91302 -90014 -94277 -94326 -88708 -72286 -67678
17700 -67678 -78569 -87550 -86005 -88541 -91071 -91867 -85406 -75131 -78328 -91166 -92395 -90890 -97150 -96944
17686 -96944 -90861 -91536 -84364 -89137 -90156 -88951 -85580 -84347 -81505 -81651 -101643 -107262 -96373 -84454
17672 -84454 -87332 -86592 -89505 -98769 -109249 -101259 -90415 -85521 -90907 -94212 -84072 -79663 -73752 -71211
17658 -71211 -79093 -78828 -67454 -54166 -54362 -59870 -63759 -66367 -64591 -67026 -66312 -62807 -59287 -64163 -66943
17643 -66943 -64072 -61432 -55752 -52723 -54675 -52353 -54710 -59409 -61869 -59275 -50509 -52024 -54415 -57018
17629 -57018 -53485 -49642 -51884 -63079 -65490 -52987 -43591 -50133 -61304 -65407 -62785 -52625 -46271
17616 -46271 -58883 -61520 -53536 -44213 -38811 -43496 -52769 -54047 -58332 -53289 -48844 -31786 -21975 -25750
17602 -25750 -40318 -40207 -34050 -38015 -42581 -31456 -39919 -40717 -41586 -43942 -34432 -33058 -32418 -29358 -31278
17587 -31278 -25451 -20222 -20118 -20234 -28129 -41523 -44406 -44465 -41617 -43139 -40141 -32613 -28936 -22375 -23195
17572 -23195 -30341 -27973 -24486 -25437 -29746 -31371 -19277 -11363 -13387 -10788 -6658 -2670 -9121 -15024
17558 -15024 -21413 -24623 -24679 -25178 -18700 -27383 -30469 -23632 -19136 -12341 -9108 -7439 -10478 -12023 -21485
17543 -21485 -21024 -20907 -14261 -9608 -15151 -9367 3191 6849 -433 -11644 -8936 705 -4872 1731
17529 1731 7071 7629 6384 2381 2663 -1486 -9783 -10241 -12472 -5609 -7129 -10623 -11169 -4779 1086 1696
17513 1696 1096 2364 12251 9875 7089 10879 7664 8499 8738 6541 7668 13813 5024 808 -1069
17498 -1069 6113 4454 8471 12273 12211 16684 18090 11614 13577 18788 20123 21318 32026 27924 15182
17483 15182 9143 16111 25022 26718 20826 21750 17180 17697 20093 31822 31631 26532 21279 23962 25179
17468 25179 34820 34767 33665 32548 37405 32972 27286 21821 18247 20534 18724 20939 24680 20911 21272
17453 21272 33157 38698 36496 36682 34838 33465 38982 35272 35720 38915 37083 44227 46761 39650 36513
17438 36513 37452 39528 38687 37411 38755 31719 24744 30095 33908 36159 34835 33712 30077 27722 33778
17423 33778 39247 44342 45876 30853 35016 43373 45545 56926 59582 60332 60355 54595 47758 38577 39591
17408 39591 45777 41368 37475 41734 45260 49775 57064 50770 52647 54893 49431 49790 44752 40439 47344
17393 47344 55729 54949 49526 49451 50979 58833 63963 60857 58423 56065 59045 56301 66154 69511 61793
17378 61793 58798 60005 59685 55636 54967 55758 57286 63705 59201 57034 54358 56569 57956 70625 74008
17363 74008 75443 76073 69636 72371 77856 81108 76853 66459 55935 59739 65385 62755 58781 64496
17349 64496 66908 63363 56837 58143 59822 69933 76389 74762 77406 76372 75456 90294 96614 89444
17335 89444 81352 80250 82258 81402 91384 88148 94351 110361 103032 94366 98265 101233 101222 101491 101913
17320 101913 98936 99731 99217 96482 91094 90978 82744 82736 98583 109594 101162 89724 88353 91313 96824
17305 96824 88112 87922 92403 89988 91281 104423 104789 95316 89903 91172 91064 96370 95597 101742 105642
17290 105642 100722 92191 98535 99430 100965 98220 97709 101747 102896 106638 111405 116957 120371 118010 112172
17275 112172 109614 108183 105393 100881 100511 105758 107865 102864 113328 116816 113582 116075 112686 109519
17261 109519 108738 118158 121144 122220 116587 105592 104985 114486 113244 109490 107041 104564 108644 106688
17247 106688 111343 110658 104099 109870 119813 128461 132557 126765 131628 131059 128211 129021 121216 122745 135030
17232 135030 140791 134431 135173 127492 125656 124840 130621 127991 131163 143301 142441 134672 131741 132106 137403
17217 137403 141400 138105 133108 131482 129357 127289 128606 124297 130146 129153 129540 140067 155967 145679
17203 145679 127421 127490 124062 130257 133475 131978 136834 141365 144398 137854 139411 144206 148938 153869
17189 153869 161674 163210 163781 161853 152665 146462 149445 149910 147823 143951 140351 148168 154308 152779 141286
17174 141286 142561 150320 163011 162082 152609 151093 150871 148318 151287 150057 153987 144827 147182 162141
17160 162141 167109 170749 168969 180455 172729 160387 156911 156985 165566 171956 178375 177007 161783 164802
17146 164802 167478 163856 165009 160687 165220 178504 179769 175538 171727 178947 174645 160958 155524 153840
17132 153840 168205 173532 175192 166224 167093 166675 165474 172337 182626 176984 169851 164827 166270 169375
17118 169375 176225 184943 186361 186664 185110 178181 170140 171530 172080 174680 178707 178856 174554 172209 169806
17103 169806 177784 185506 177079 175200 181999 180858 193265 193017 182681 179628 177208 177032 176730 175352
17089 175352 173867 176649 183159 189763 192294 191323 190800 196882 192900 181407 173688 180210 191070 200941
17075 200941 196009 194353 189763 195523 203301 199455 198535 203396 202444 201620 207677 209892 205066 206265 203730
17060 203730 201494 198565 198872 195749 200076 201072 204338 202079 205775 201562 189350 186682 192470 198106
17046 198106 199367 198454 206291 208875 203314 197976 195929 189766 190332 197852 203814 210589 207724 199164 204886
17031 204886 206115 209640 212818 208885 195866 202229 211639 212536 216082 220562 218294 211905 211146 208261
17017 208261 212440 218247 212190 205272 209303 216281 220665 214093 205687 204239 213530 210693 204563 208623
17003 208623 205708 206659 215014 216668 215381 208700 217850 224746 215503 211706 212209 210309 206025 204767 217883
16988 217883 223069 227427 234267 234919 230174 223624 220385 223407 227111 226387 229597 223278 229126 225514 222683
16973 222683 217264 225621 237570 244336 238299 233495 240846 237280 235208 237598 239656 241054 234471 233331
16959 233331 235937 242313 242504 244453 242859 242047 251500 249788 237084 229064 230593 229825 235102 246815
16945 246815 247344 245568 243278 239430 242260 242293 231382 234593 232524 228940 231582 234115 240302 243577 243098
16930 243098 244425 247017 248337 244105 250082 245844 244312 247253 242461 235952 232873 245319 249044 252648
16916 252648 256493 266293 270015 263155 255323 258111 256022 246444 248814 253684 248491 243281 241068 240665
16902 240665 245191 250844 261519 262358 268049 273964 277439 279164 275370 271444 275368 279144 277221 270067
16888 270067 263438 265712 274356 276636 274779 269750 263356 257476 263526 271275 270220 267457 252530 246741
16874 246741 245794 254150 262279 267104 272910 272586 270240 260614 259561 263582 260028 258205 268699 269807
16860 269807 274818 277918 270028 263591 265550 270985 273828 281185 285319 279314 277199 278833 277255 271972
16846 271972 274761 274218 276709 268583 269351 274945 275897 278774 287717 285602 279486 280500 291908 294964 291812
16831 291812 285649 285720 287419 295911 289744 280399 278345 289137 285821 282564 289390 296550 290808 284817
16817 284817 278242 266968 265065 276470 285541 288111 289372 282141 277580 283389 284009 294609 297095 299454
16803 299454 297207 299080 295000 299580 303700 306491 291316 280516 278770 289012 286762 279535 289850
16790 289850 288935 292531 295770 302865 309905 310957 307726 298403 296067 295745 296670 297432 305186 310106 302810
16775 302810 297244 295713 304070 311549 313548 314944 310055 298652 301914 317354 318128 310868 316373 315983
16761 315983 316952 310210 312485 309958 307628 306118 311394 313831 305657 305569 305118 304688 310502 312355 310929
16746 310929 307675 307448 310972 316323 319138 318478 322134 324777 317063 319526 328107 324175 320469 319119 319959
16731 319959 320396 323456 325966 331296 335496 334008 326823 324754 322181 319987 321647 323276 321949 315983
16717 315983 317644 317524 314626 316869 321058 314159 319617 319160 330010 340074 343188 340322 346395 351183
16703 351183 347011 347459 352122 338941 335210 331482 335794 334970 333911 338573 339734 341973 347262 349078
16689 349078 342425 333815 339362 342132 336368 336758 336057 337259 345590 346979 344031 344702 354517 355895 353838
16674 353838 345479 340997 345586 348670 362209 360303 358687 352501 347423 350388 352162 345898 349094 346330
16660 346330 340328 350838 346981 345035 339938 343543 343521 341871 348436 355423 357092 357745 359196 358845 349979
16645 349979 351971 358025 363364 362777 366437 368458 363859 364098 355172 357794 366900 365211 356737 355842 359283
16630 359283 369780 387131 390203 392041 381935 369332 367955 374768 379387 384461 390771 386938 371924
16617 371924 364131 368000 375720 376149 378364 373591 374303 375155 370492 375675 382287 381922 379584 378465 378102
16602 378102 377034 377698 386872 391369 394577 402786 407904 394900 378740 374753 374876 385447 395285 400251
16588 400251 400118 400783 398933 390412 380161 378164 379606 381362 387896 389087 386586 393299 392765 386626 384269
16573 384269 394447 393917 392025 393911 391256 384791 385653 392756 396641 388245 386773 390252 391480 390178
16559 390178 395090 400459 403394 398238 395592 397615 395467 398489 388903 390326 398912 402837 406735 418667
16545 418667 424618 416158 396513 399169 392392 393981 404576 416623 416193 409348 401032 390849 389094
16532 389094 399557 403058 408063 410205 409615 402325 401986 406598 405064 407588 409204 410656 403126 406370
16518 406370 408640 412922 425278 426407 425688 417212 417123 410668 406088 416348 425761 423508 421609 418718
16504 418718 417183 416184 415078 422907 431525 435984 442487 432722 435496 432639 430835 429766 427408 430775
16490 430775 434805 430365 429097 432489 425682 423792 419522 421881 425141 429173 424214 421703 423561 424673
16476 424673 420809 420787 428161 433174 434943 440092 438960 440328 431522 430350 436549 436444 433334 427874 422413
16461 422413 424952 430021 431713 434995 436743 436538 444133 438164 434539 433433 427286 430929 443145 443284
16447 443284 445674 454353 447183 446264 450220 449721 455153 450507 446499 438561 432048 428345 435505 444270 449226
16432 449226 438064 438655 439179 439855 440249 445339 450978 458843 457648 445700 442092 449008 455133 459777 466705
16417 466705 470842 464425 459485 464663 465861 469811 468194 469274 475171 474552 488594 485271 466270 465559
16403 465559 468623 472740 466609 465776 473188 474576 476606 476315 476539 478657 478225 487200 496423 487199 481835
16388 481835 477077 476249 481274 477995 473056 472628 468142 462363 466871 479449 471494 466544 477264 471549
16374 471549 465165 470684 476666 477609 483370 481247 482614 479985 486381 487781 491249 490333 496015 492798 490657
16359 490657 492136 497560 496066 479362 473242 478889 472271 471705 479828 482506 480864 471709 467372 467003
16345 467003 482416 490477 499469 499263 493306 489505 495494 495871 494423 495546 503239 497166 498246 502134
16331 502134 498501 495889 496148 496820 492977 492457 493537 494527 500578 501346 500333 504293 497747 495908 504688
16316 504688 501075 506310 506155 511520 518418 519775 514443 514240 515919 510985 514608 514403 516306 518195 515455
16301 515455 513769 513134 508006 499872 495877 498812 506294 504954 510376 507622 506019 500456 503553 508819
16287 508819 509894 513748 511742 526131 535393 532087 524556 522346 519265 518450 526191 521384 519610 516250
16273 516250 521732 526421 521227 519834 523416 524270 528118 531221 528429 533230 536834 537220 534869 533501 531952
16258 531952 528326 534522 537899 540444 535361 536945 540014 544445 550999 550160 550711 552573 548865 546946 548431
16243 548431 541423 537017 532215 531905 537927 535686 535740 538169 543241 544690 549001 539736 529811 525428 524257
16228 524257 544322 551647 549383 548851 551033 548640 552819 565905 567291 560041 558784 559211 548693 540779
16214 540779 547587 554677 552511 546273 546463 550636 557507 559307 562556 562655 562074 559643 563080 560800 563296
16199 563296 565430 566524 569295 559923 559068 558830 562557 563012 567353 568005 572460 574822 579501 576693 574311
16184 574311 579977 579310 575738 577101 582598 580096 568606 571666 576196 581189 585729 586987 582109 578486
16170 578486 579028 580521 576378 585509 596116 594834 601443 602151 590060 592040 590245 589509 586216 582015
16156 582015 579633 574200 576928 581723 585431 583792 593893 595425 595512 588397 589309 584811 582448 579224 583512
16141 583512 588125 591317 594494 598490 596734 590080 583695 588702 596184 599781 606036 602766 600866 598237
16127 598237 600825 602953 605410 607205 616803 628241 628287 619700 611216 603803 612541 612895 601940 597557
16113 597557 606123 615258 622291 622213 619710 623776 623319 621775 629995 630334 628339 624604 619172 627589 630826
16098 630826 620374 615287 604001 602114 613238 619820 626737 632395 638964 638421 638637 637463 642778 641617
16084 641617 646494 653161 654413 654614 653793 647637 643939 647968 639637 634705 642419 648210 643285 642681 642665
16069 642665 641804 650653 646236 646273 651510 648845 654697 650993 641411 636522 633586 632716 639627 653330 656752
16054 656752 661302 656547 659022 667643 669403 667552 667642 663019 658053 660572 664104 662178 661381 651220 652736
16039 652736 654973 653600 651505 654476 665235 663703 659467 665454 663919 664533 660153 660904 666519 669379
16025 669379 677277 686834 694070 698036 688893 670846 662040 658151 668994 680334 680688 682709 688246 684665
16011 684665 680562 669613 663000 674571 692425 690342 685848 681478 676131 680543 684008 686828 680389
15998 680389 671005 673057 674824 672009 672426 686570 694769 692570 694985 691934 695092 702903 707800 706845
15984 706845 708360 710393 707363 709922 706441 692938 692213 693978 704424 715337 712806 709955 707228 707724
15970 707724 700992 712989 717579 717753 713173 713318 709667 711396 711738 722773 729367 735054 738961 731118
15956 731118 719372 715454 729354 730865 728875 726406 726934 733736 728014 719112 723366 736462 739171 737048
15942 737048 737423 741268 742924 742662 743088 739475 728526 729610 731750 734045 731905 733236 731572 737620 744766
15927 744766 747426 750150 754561 755482 752897 747423 757638 760370 765216 770928 764702 755195 752630 764865
15913 764865 763947 765279 768280 768807 765881 758627 762922 766866 760378 765481 764845 768178 764194 768206 777329
15898 777329 776060 776897 779390 779005 766648 754274 757590 762095 773436 776299 782858 785721 777246 769011
15884 769011 768604 773134 775593 774428 782211 789851 787254 783478 787506 784287 785205 784816 788079 792775 798857
15869 798857 800125 795920 794890 793597 793473 796295 797656 797235 809435 813089 803496 799543 802304 803776
15855 803776 799055 800287 798274 797386 799886 799042 802570 805006 812571 817889 813249 803172 804452 804719 810120
15840 810120 813847 816193 822743 825729 821726 820010 822563 827470 829647 825203 825377 824948 830159 837367 837583
15825 837583 836180 831451 831361 837075 842841 841904 844649 847201 844054 847326 847214 848846 849734 842341 836726
15810 836726 839317 841904 846660 856031 860949 860544 854501 856680 862029 865350 872014 868127 862251 860929
15796 860929 860423 865239 866071 866447 868830 873903 870803 870233 871790 875379 873575 869213 864031 867066 869952
15781 869952 875213 872032 864622 864983 864014 863800 868792 875539 881026 885617 885124 892051 896577 896148 893505
15766 893505 888243 886926 888352 893648 891377 891729 905118 906198 895550 897169 889210 893525 908011 917855
15752 917855 921311 916807 922516 925817 925562 917487 910943 906923 905289 900780 908115 915791 919461 917861
15738 917861 921532 920336 919817 923938 921627 919920 932404 933298 927467 925427 935139 935250 933166 929905 930852
15723 930852 932144 935173 947608 944055 937058 937323 944191 953416 965053 959660 955251 953942 955096 958599
15709 958599 955159 964111 958694 947275 946171 947665 955160 967663 973405 973458 974840 967743 975284 979502
15695 979502 972427 973553 970829 973464 970648 978457 983384 983582 980787 982116 986476 991443 998233 998613 1001286
15680 1001286 995944 988027 987569 989999 998245 994822 982912 973687 978736 987964 993829 996718 1002555 1009234
15666 1009234 1016637 1008143 1005976 1003965 1005114 1016411 1024558 1013143 996701 995587 1004785 1010784 1018597
15653 1018597 1028128 1033803 1029226 1032401 1032522 1036656 1039376 1041667 1039924 1038396 1037124 1056732 1058278 1048924
15639 1048924 1043092 1041089 1045321 1049411 1047003 1053476 1066799 1075157 1069301 1066190 1057511 1054323 1059498 1066686
15625 1066686 1068087 1069889 1069062 1062626 1057585 1058269 1066444 1078357 1081798 1084392 1082879 1077521 1071836 1080818
15611 1080818 1084138 1089988 1098227 1105168 1102100 1099077 1099898 1090842 1091539 1095614 1098736 1097683 1091686 1093172
15597 1093172 1089706 1085764 1094244 1097905 1095119 1089118 1094535 1104215 1100891 1105859 1121299 1128663 1124913 1121390
15583 1121390 1124029 1129551 1125279 1121877 1121742 1123026 1127007 1128090 1124734 1137961 1136743 1144688 1151225 1145425
15569 1145425 1154235 1158247 1163901 1174912 1184132 1185794 1171956 1169306 1165374 1161425 1155575 1152736 1147375
15556 1147375 1151708 1154587 1159397 1166699 1170192 1178606 1185540 1180984 1182284 1181270 1181634 1187761 1184465 1188081
15542 1188081 1195647 1198068 1203271 1203990 1202644 1200236 1199171 1198435 1203913 1208608 1213849 1214277 1223816 1222634 1214864
15527 1214864 1215798 1222532 1231294 1229536 1228121 1231164 1232857 1226445 1226438 1227258 1237094 1240945 1235596 1241239 1246351
15512 1246351 1244200 1255237 1267180 1264244 1265509 1265496 1260509 1254541 1255627 1265030 1271332 1277527 1269983 1271467
15498 1271467 1280422 1284641 1286833 1291230 1292051 1289947 1296398 1302039 1302802 1305140 1300334 1301858 1302162 1302534 1299824
15483 1299824 1305254 1310055 1311884 1320900 1324813 1332010 1332931 1333894 1336499 1339142 1342536 1349158 1360436 1356495
15469 1356495 1343710 1342661 1357731 1372506 1374711 1368891 1367502 1365226 1373705 1377996 1380269 1380569 1379944 1381801
15455 1381801 1390060 1393802 1402270 1400829 1395824 1399604 1401912 1402783 1410355 1406069 1407803 1413540 1421086 1425527
15441 1425527 1433321 1442786 1447111 1442447 1438885 1440434 1450969 1459364 1464141 1469996 1470027 1469963 1479801 1493194
15427 1493194 1503519 1507345 1508099 1507131 1513096 1516567 1520336 1532014 1532814 1540690 1547778 1551358 1545654 1541218
15413 1541218 1557165 1571350 1574361 1580215 1596042 1608557 1616603 1628460 1631191 1643359 1654639 1661583
15401 1661583 1668385 1677380 1687468 1703397 1713328 1723509 1746219 1768263 1795526 1826855 1857896 1883776
15389 1883776 1906432 1924714 1920389 1883830 1811366 1691108 1541688 1394875 1273589 1201781 1167499
15378 1167499 1167943 1177912 1198102 1217609 1244034 1262619 1289743 1306452 1324442 1336113 1345915 1353580
15366 1353580 1373274 1391154 1402619 1415538 1424090 1431781 1443203 1464243 1471963 1463087 1454073 1461133
15354 1461133 1461655 1461269 1454045 1447335 1457551 1469614 1477606 1477993 1484555 1499048 1519034 1535728 1542735
15341 1542735 1551597 1559515 1560204 1564352 1572498 1570958 1574843 1583794 1593775 1600464 1603298 1600738 1593897 1591434
15327 1591434 1598562 1608782 1620210 1620595 1622195 1628127 1644024 1654994 1661961 1668558 1666636 1660133 1675557
15314 1675557 1689373 1692328 1688936 1692531 1697849 1706061 1717060 1721452 1718444 1723655 1724516 1735977 1737564
15301 1737564 1736290 1744146 1749068 1749533 1761904 1773137 1788369 1797077 1793974 1790170 1795162 1799722 1804675
15288 1804675 1806751 1810400 1815227 1819133 1827619 1832043 1828644 1836421 1853249 1860703 1857134 1849594 1847014 1859805
15274 1859805 1872575 1879764 1890751 1892250 1894617 1902682 1911928 1914933 1916884 1919783 1925478 1934676 1940735
15261 1940735 1944963 1940723 1944944 1950943 1963212 1968816 1969888 1971119 1976763 1989183 1989797 1992969 1996096 1994873
15247 1994873 2002952 2010805 2010093 2013718 2019862 2030623 2036098 2042807 2055079 2064433 2071226 2082741 2090057
15234 2090057 2086400 2086675 2095591 2107102 2111755 2114748 2125361 2133542 2128200 2132489 2137761 2137534 2138554 2153406
15220 2153406 2170656 2180212 2188507 2197730 2195760 2197010 2193818 2201464 2214768 2220826 2225991 2238008 2246328
15207 2246328 2252694 2253517 2259086 2269325 2265295 2262921 2261332 2268545 2264450 2263460 2277967 2292503 2309916
15194 2309916 2326520 2336266 2349016 2358511 2372204 2389624 2389287 2398370 2414144 2427981 2431667 2434574 2451860
15181 2451860 2458685 2456567 2460940 2471578 2476450 2483178 2487318 2488989 2487829 2494425 2500538 2518756 2535715
15168 2535715 2555576 2564667 2563134 2567204 2577718 2586621 2592298 2612134 2615231 2619518 2630859 2636030 2649442
15155 2649442 2659963 2665865 2683010 2696387 2703168 2705754 2715760 2731339 2741518 2743366 2748512 2754342
15143 2754342 2767033 2776541 2781751 2784034 2795623 2804963 2806454 2815797 2830188 2847786 2862934 2878022
15131 2878022 2886545 2894456 2906622 2911362 2915068 2919575 2915905 2927815 2942299 2950114 2962854 2973662 2992528
15118 2992528 3010888 3025658 3040461 3053330 3066570 3081673 3083475 3090087 3094995 3103318 3122037 3139610
15106 3139610 3141593 3147924 3161562 3186374 3214016 3225629 3240778 3260459 3267987 3283671 3306313 3323351
15094 3323351 3344819 3364858 3374161 3392466 3413276 3436771 3452527 3476168 3498194 3530930 3553595
15083 3553595 3579943 3601021 3622322 3652837 3691579 3744979 3791677 3820646 3825032 3823478 3827496 3829727
15071 3829727 3829543 3836279 3851405 3866210 3874827 3882332 3900554 3920175 3938633 3957400 3973728 3984147
15059 3984147 3997428 4023399 4048155 4070668 4086166 4107891 4136010 4173200 4208009 4228017 4248708
15048 4248708 4272396 4307375 4337907 4379536 4419240 4444464 4488015 4526130 4551891 4579067 4604854
15037 4604854 4615658 4633030 4667978 4702190 4736712 4784848 4819149 4860928 4908300 4948981 4972698
15026 4972698 5003605 5043883 5100442 5151103 5203947 5247790 5268140 5254677 5221231 5185316 5148054
15015 5148054 5138244 5143188 5154177 5166916 5185404 5215315 5260006 5326205 5404319 5485226 5551520 5613209
15003 5613209 5676097 5721634 5756109 5799204 5860143 5917990 5954586 5988312 6035504 6090799 6156140
14992 6156140 6221145 6289608 6359305 6419272 6479099 6544838 6603850 6671843 6744127 6821059 6892371
14981 6892371 6956548 7026672 7092576 7168047 7256459 7344981 7417482 7487826 7559904 7646031 7728990
14970 7728990 7812732 7901999 7988934 8081813 8181087 8283740 8399601 8514243 8625006 8736441
14960 8736441 8855843 8979139 9095009 9211563 9342763 9474359 9611979 9746459 9887781
14951 9887781 10027476 10171822 10324619 10481389 10633270 10794361 10966090 11141508 11323495
14942 11323495 11503554 11689876 11891642 12104512 12342182 12583945 12839331 13095112 13352247
14933 13352247 13630357 13910404 14209783 14512227 14819913 15148975 15494609 15866940 16266505
14924 16266505 16688179 17132934 17596083 18073289 18571778 19103768 19670716 20282201 20932509
14915 20932509 21620127 22356385 23122743 23950033 24834432 25784923 26820366 27958277 29207261
14906 29207261 30574196 32067877 33699114 35429898 37264988 39265100 41504921 44083518
14898 44083518 47111164 50666761 54800195 59551092 64955490 71024081 77696055 84779806
14890 84779806 91656939 96648600 96154857 84616960 57514305 17038311 -26577202 -61791293
14882 -61791293 -83011188 -91348488 -91070279 -86345909 -79983039 -73433463 -67264881 -61665212
14874 -61665212 -56680177 -52280856 -48409698 -45023733 -42078705 -39544182 -37388471 -35547307
14866 -35547307 -33914132 -32399972 -30963174 -29590727 -28294476 -27089305 -25961280 -24916671
14858 -24916671 -23953030 -23061342 -22234531 -21458057 -20753857 -20090714 -19469697 -18877428 -18315104
14849 -18315104 -17788185 -17301131 -16847725 -16410077 -15997978 -15605631 -15225642 -14862618 -14511200
14840 -14511200 -14170277 -13847777 -13540502 -13239866 -12963288 -12694324 -12434795 -12204427 -11988206
14831 -11988206 -11775839 -11562238 -11348888 -11143754 -10940564 -10736683 -10538296 -10350923 -10174180
14822 -10174180 -9990344 -9822730 -9649780 -9485487 -9330720 -9189715 -9058180 -8926961 -8796967
14813 -8796967 -8668234 -8543632 -8428008 -8311444 -8188473 -8069877 -7965080 -7871195 -7782026 -7694558
14803 -7694558 -7612310 -7515558 -7404687 -7299650 -7199322 -7108769 -7016768 -6927178 -6842371 -6759147 -6688795
14792 -6688795 -6609058 -6530429 -6457896 -6391855 -6325244 -6247678 -6174950 -6106856 -6046249 -5986385 -5916683
14781 -5916683 -5852907 -5787859 -5727012 -5660892 -5615914 -5568515 -5520911 -5472446 -5425492 -5382403 -5324769
14770 -5324769 -5267301 -5212470 -5154464 -5099832 -5051233 -5016635 -4986733 -4967898 -4948617 -4937542 -4928014
14759 -4928014 -4918600 -4899307 -4866125 -4825160 -4786816 -4752629 -4726117 -4690092 -4631519 -4573087 -4506226
14748 -4506226 -4439953 -4371219 -4311221 -4275844 -4238713 -4198180 -4167901 -4135800 -4096770 -4062763 -4035714
14737 -4035714 -4008918 -3975612 -3936333 -3913484 -3880817 -3839948 -3804451 -3772720 -3755293 -3727615 -3693358
14726 -3693358 -3674108 -3665568 -3654431 -3637183 -3612356 -3594633 -3583457 -3560476 -3529473 -3506414 -3483285
14715 -3483285 -3456270 -3435657 -3411206 -3388304 -3372025 -3353539 -3322804 -3289754 -3261035 -3231206 -3208748
14704 -3208748 -3175038 -3148411 -3120826 -3095726 -3074907 -3037199 -2997453 -2960651 -2941792 -2916226 -2888444
14693 -2888444 -2872359 -2860939 -2864383 -2869276 -2867480 -2865263 -2852334 -2849374 -2849090 -2837164 -2824021 -2813614 -2798298
14680 -2798298 -2785860 -2771031 -2752302 -2739867 -2732292 -2718205 -2702686 -2688143 -2676325 -2662082 -2642662
14669 -2642662 -2633024 -2627505 -2622157 -2612433 -2604133 -2591075 -2574091 -2543155 -2528930 -2522331 -2513062 -2501412 -2477313
14656 -2477313 -2457201 -2437857 -2424825 -2412780 -2396077 -2378484 -2376672 -2375437 -2372262 -2360966 -2340613 -2326869
14644 -2326869 -2304431 -2285046 -2271179 -2258479 -2254668 -2251365 -2236937 -2234457 -2219385 -2199456 -2195125 -2186842
14632 -2186842 -2175697 -2173722 -2170687 -2159404 -2147541 -2127658 -2110951 -2106263 -2102272 -2098535 -2092279 -2080570
14620 -2080570 -2068110 -2058200 -2040393 -2021533 -2011457 -2005915 -1996777 -1982357 -1970506 -1973094 -1965865 -1951107
14608 -1951107 -1941578 -1939006 -1931157 -1925823 -1914119 -1897633 -1876895 -1864100 -1859600 -1868160 -1865372 -1847861 -1839495
14595 -1839495 -1828337 -1817107 -1806747 -1797262 -1794188 -1790210 -1782126 -1764849 -1760851 -1751798 -1743411 -1735308 -1737077
14582 -1737077 -1737432 -1725884 -1717779 -1706612 -1694900 -1682099 -1685694 -1690729 -1685620 -1690073 -1694982 -1679700 -1662381
14569 -1662381 -1653553 -1639568 -1621910 -1615784 -1609818 -1600793 -1584138 -1573516 -1571280 -1567375 -1566281 -1558629 -1553817
14556 -1553817 -1548135 -1543370 -1534339 -1528848 -1525259 -1513495 -1499277 -1488930 -1486736 -1483523 -1475816 -1458218 -1444073
14543 -1444073 -1430753 -1431172 -1431657 -1428259 -1419284 -1426353 -1425949 -1420244 -1418346 -1404449 -1386062 -1377061 -1367920 -1368354
14529 -1368354 -1368213 -1358450 -1340885 -1342866 -1343376 -1340845 -1334236 -1325720 -1321825 -1318298 -1314714 -1308170 -1292340 -1286142
14515 -1286142 -1300611 -1297889 -1287370 -1281807 -1276201 -1271136 -1267972 -1251034 -1253219 -1252783 -1243474 -1243113 -1237452 -1235442
14501 -1235442 -1240199 -1226105 -1223695 -1214846 -1207935 -1209494 -1213916 -1209438 -1192317 -1177224 -1174051 -1163812 -1167439
14488 -1167439 -1165450 -1160121 -1162404 -1161824 -1160434 -1142686 -1131409 -1127622 -1127168 -1120159 -1113738 -1119795 -1129496 -1133842
14474 -1133842 -1122876 -1107823 -1099205 -1094281 -1087474 -1077554 -1072935 -1063314 -1064005 -1072048 -1074256 -1061223 -1048974
14461 -1048974 -1046009 -1047703 -1043470 -1040078 -1027894 -1018507 -1018923 -1016819 -1013975 -1013864 -1004824 -1001603 -996776 -992457
14447 -992457 -993745 -999217 -997143 -1001604 -988607 -974952 -970437 -957875 -941792 -940839 -935051 -927593 -917640
14434 -917640 -911825 -907473 -907225 -904673 -905622 -910562 -908900 -907418 -909404 -901832 -905255 -904243 -902097 -903059 -888856
14419 -888856 -884014 -890246 -879806 -863292 -837203 -821966 -809202 -794865 -784085 -776635 -772763 -761258
14407 -761258 -744863 -729754 -724023 -726297 -721787 -716224 -713294 -707436 -690039 -681905 -670118 -651632 -637821
14394 -637821 -626852 -610370 -599138 -579588 -560626 -539451 -518499 -497048 -470567 -447793 -417944
14383 -417944 -399956 -414701 -467188 -562447 -699028 -866614 -1016813 -1109217 -1143562 -1151758 -1148398
14372 -1148398 -1124628 -1104168 -1077122 -1053176 -1042463 -1022555 -998541 -984699 -970286 -956805 -940008
14361 -940008 -925106 -908070 -900122 -889300 -873937 -858053 -847310 -845538 -844548 -830665 -808797 -803681
14349 -803681 -803080 -800168 -795587 -786828 -787872 -790093 -780520 -769580 -765767 -762800 -757340 -756951 -759441 -756055
14335 -756055 -751015 -747172 -740056 -727104 -728020 -731145 -722884 -713783 -710112 -716141 -714394 -708701 -701828 -696427
14321 -696427 -694329 -691090 -689773 -678451 -671805 -670953 -673595 -670974 -663108 -658498 -662989 -660994 -660650 -657109
14307 -657109 -656168 -649012 -642516 -641826 -637955 -633148 -625285 -619240 -614322 -614545 -616621 -605942 -600628 -594120 -597342
14292 -597342 -596190 -594413 -593408 -584274 -589598 -594583 -598048 -590358 -580630 -586250 -579245 -569721 -566911 -556977
14278 -556977 -553781 -557359 -556488 -545434 -541876 -543237 -535607 -530681 -531437 -526983 -533514 -537777 -538542 -528679 -519667
14263 -519667 -523436 -521254 -522002 -523118 -521380 -523052 -516283 -507301 -503249 -497034 -490716 -485502 -489841 -493267
14249 -493267 -487335 -480569 -472940 -460803 -455909 -470033 -476512 -477899 -483391 -470640 -458695 -457593 -457076
14236 -457076 -451434 -446241 -447474 -450795 -443951 -437066 -436777 -425398 -426903 -432193 -431270 -426466 -420523 -419287
14222 -419287 -414933 -407821 -404441 -408286 -397739 -391832 -404898 -406653 -393600 -388563 -392242 -390608 -380074
14209 -380074 -374387 -366248 -365760 -361628 -362224 -351241 -338701 -339676 -344461 -340110 -328995 -313852 -308883 -303645
14195 -303645 -299352 -287695 -283077 -276217 -268116 -249659 -234495 -218562 -199486 -194552 -208013 -251889
14183 -251889 -322099 -393654 -463481 -510578 -522057 -509286 -496955 -484739 -472370 -461277 -450429
14172 -450429 -443868 -427521 -416202 -405909 -403964 -401349 -390749 -388297 -384089 -380869 -373444 -368701 -367860
14159 -367860 -362007 -351004 -347853 -346083 -340842 -339724 -344134 -334624 -325850 -321459 -321666 -321628 -325963 -319750 -315380
14144 -315380 -307886 -308507 -315639 -317556 -310056 -308955 -312037 -308888 -302534 -286645 -282674 -293955 -305250 -305226
14130 -305226 -295677 -276141 -269456 -268267 -267712 -255341 -252738 -253431 -260327 -256238 -262237 -263314 -257927 -261788
14116 -261788 -267985 -264557 -262558 -260463 -260232 -255844 -257046 -256400 -253277 -248755 -242430 -234180 -228350 -228027 -230977
14101 -230977 -234019 -220689 -214325 -206539 -207140 -218102 -223702 -222759 -212760 -210536 -212011 -204897 -197148 -193797
14087 -193797 -193246 -193719 -194323 -193824 -191929 -195693 -202538 -192055 -185822 -170295 -163121 -163768 -165806 -167352 -161939
14072 -161939 -165326 -166032 -166626 -172075 -172483 -183248 -186048 -180611 -170576 -159598 -152207 -157532 -159698 -154899
14058 -154899 -143778 -138675 -138558 -143304 -147081 -148628 -143801 -148086 -145859 -141162 -134003 -129478 -118266 -120391
14044 -120391 -127254 -133438 -128764 -115826 -112433 -116557 -110970 -112093 -120529 -119595 -121051 -116512 -105262 -103973
14030 -103973 -110159 -103197 -92065 -94632 -101016 -95746 -87067 -89785 -92066 -80743 -77545 -77798 -87014 -95263
14016 -95263 -87828 -87816 -87172 -80422 -83506 -79168 -69914 -74561 -79534 -75674 -75273 -72073 -71298 -66983 -63139 -63287
14000 -63287 -57768 -50082 -50532 -60036 -63221 -54953 -49306 -54294 -50117 -39221 -36958 -34787 -30514 -31889
13986 -31889 -40092 -47024 -45521 -32126 -23541 -21902 -20685 -25562 -26011 -20457 -14307 -16728 -17664 -13077 -11335
13971 -11335 -9437 -10045 -3912 3208 -2932 -10128 -709 10557 10738 8045 11927 15273 8066 7501 10552
13956 10552 8711 17072 17921 13255 13992 21751 24068 26297 29138 22345 18556 27124 29745 25154 25173
13941 25173 26488 28383 32213 37267 48026 51761 51956 54165 54276 54241 60482 63591 67320 58783 52126
13926 52126 51120 58029 66790 63602 54782 47809 59071 65048 79386 81909 80036 76419 65176 73399
13912 73399 77816 78345 89550 90891 88618 90660 96212 94020 87989 85973 90054 94956 106052 110636
13898 110636 111733 112442 107491 97150 93561 98433 107178 109012 108838 111573 117404 118950 119767 131558
13884 131558 131555 125661 124759 124586 121196 119939 125900 136233 137211 138175 141849 143094 138848 142586 146564 145404
13868 145404 139311 136112 136909 139953 143216 137749 130697 132694 140751 144846 149014 146516 154624 156812
13854 156812 162962 169512 171714 172214 179216 172286 178887 182013 183669 180104 169317 172970 180698 187280
13840 187280 185832 187581 196885 197546 204101 198773 193910 203319 210809 202144 205736 211630 215375 216212 207491
13825 207491 205199 205603 204976 198403 198228 199149 202954 202612 204635 216234 219920 221628 222670 219333 222301
13810 222301 225679 227143 219375 224807 225683 229080 229408 234443 243721 251721 260821 263558 252496 252039 259217
13795 259217 263083 265220 263717 263097 255483 254422 250679 256765 270932 265384 260510 263815 268566 266340
13781 266340 271716 279188 271836 277919 283708 289470 292074 286114 282785 284584 289488 295610 287709 287289
13767 287289 289445 298240 308962 309009 307661 315399 312170 313274 310060 310364 316105 319718 318553 315372 320619
13752 320619 319411 330285 338474 343855 336754 337442 334646 337326 337744 344937 348911 358119 357455 362605 364001
13737 364001 366750 362488 361647 360004 359079 361164 360738 349779 345285 352728 350493 352770 356020 352676 351921
13722 351921 363283 377970 380826 384861 387129 391127 386816 382197 392082 387392 385906 384869 379287 387180
13708 387180 395608 399996 401733 402649 407488 412662 414253 416786 413160 408095 410051 404973 410565 416221
13694 416221 424398 430098 432560 429070 427216 429361 431726 432372 435601 432497 426609 432386 438175 439574
13680 439574 442429 440335 442063 452416 461162 463072 460578 455238 457134 455212 452259 458649 467446 472554
13666 472554 478817 480001 486482 484000 475707 473942 479256 484121 482726 485282 489317 493625 499239 491971
13652 491971 483343 482027 492184 504731 503135 498905 490196 496736 503364 503379 504023 512423 507823 495135
13638 495135 495448 511990 519699 521731 518160 524193 531687 528497 522850 524345 531314 538377 542517 539447
13624 539447 542425 539026 538233 548830 553257 550300 545197 554048 554791 555287 555193 548928 547808 544983 556850
13609 556850 575432 572613 572338 576167 573766 580121 586861 587878 584558 587743 595329 592858 589873 592088
13595 592088 595355 593873 584922 583370 593853 605089 615148 619549 618462 614034 612445 606113 599603
13582 599603 605083 607945 614826 629958 641347 634568 631962 641249 642678 633409 654020 663738 660323
13569 660323 653160 647218 659829 668838 671846 671896 670178 670546 668396 673171 669071 662282 662996 662577 663902
13554 663902 674790 676107 673596 667545 672829 689056 697602 700288 705766 710654 705836 699344 708667 709469
13540 709469 711168 709963 709706 713695 720876 718084 717314 726397 723691 716234 715957 718930 721191 731343 737865
13525 737865 745044 744696 748253 743328 744323 742686 742853 746976 751246 758024 760061 755120 757228 772589 779963
13510 779963 778476 776718 772881 769966 759608 761439 781199 798874 810946 811914 812963 819102 827096
13497 827096 826172 822831 821050 819467 819160 820725 822176 817019 822214 831465 825421 824561 826209 831742 829943
13482 829943 833527 843287 843161 849556 852802 844720 849798 857507 861026 857592 860409 868853 870965 872077
13468 872077 872281 880679 882296 863499 856335 862969 873761 890987 888977 890190 893307 895148 898613 899038
13454 899038 905982 907324 913956 912089 911944 913416 909351 915735 926560 933730 940962 937387 932358 936271
13440 936271 944048 943105 940391 946552 943227 946051 956375 962134 965088 970313 978428 977411 976215 980029
13426 980029 979689 985113 996294 1002746 1003935 1010660 1012917 1017712 1015704 1009255 1001797 1006369 1014432 1011842
13412 1011842 1014372 1031329 1032900 1036168 1041362 1041184 1049143 1042912 1039524 1041103 1048461 1056095 1055725 1049427
13398 1049427 1053504 1058544 1065811 1068038 1066829 1066338 1078391 1088643 1086331 1082616 1079253 1085690 1097639
13385 1097639 1108218 1113361 1117832 1117881 1113567 1115450 1114184 1123289 1134111 1136410 1135086 1133914 1147889 1159195
13371 1159195 1159823 1160044 1165711 1169184 1165418 1176203 1185038 1175173 1168794 1170975 1175078 1183705 1186715 1189144
13357 1189144 1193334 1198789 1205856 1210876 1217262 1212873 1217580 1230553 1234061 1244041 1251022 1256736 1251941 1255350
13343 1255350 1252543 1246266 1243615 1242830 1250879 1258849 1268139 1276510 1283082 1280361 1277120 1278170 1276087 1291489
13329 1291489 1303144 1298771 1292866 1293528 1298059 1300560 1310066 1318560 1330798 1343636 1349643 1348126 1347236 1368035
13315 1368035 1375771 1375678 1374653 1379212 1385294 1395141 1401922 1403350 1409893 1413291 1412825 1422241 1426055 1435565 1442535
13300 1442535 1445614 1445373 1441928 1447308 1447986 1449367 1445575 1457726 1465107 1468515 1474172 1483350 1491179 1496560
13286 1496560 1497162 1498530 1510472 1523786 1537336 1552422 1551747 1539507 1544586 1554392 1561510 1563052 1567702
13273 1567702 1573122 1575918 1581886 1592708 1604430 1607041 1612700 1625662 1642531 1650549 1652093 1655073 1654253
13260 1654253 1661763 1685385 1698825 1702365 1710740 1717931 1731600 1749724 1765136 1780445 1790072 1800188
13248 1800188 1815704 1832588 1830385 1820599 1817335 1822188 1840643 1867305 1897653 1935257 1976706 2030613
13236 2030613 2095201 2154471 2207353 2281938 2382940 2468214 2514168 2469531 2290731 1963656 1552643
13225 1552643 1191360 970885 895744 912928 960454 1018145 1075120 1127361 1174519 1220935 1270071
13214 1270071 1311876 1345930 1379261 1408137 1435036 1455395 1490396 1521340 1540720 1547738 1554517 1571733
13202 1571733 1581133 1590997 1607610 1622256 1647629 1658482 1664716 1670235 1681237 1696541 1707657 1719279
13190 1719279 1728695 1739271 1739488 1746852 1767709 1781624 1781938 1791749 1799006 1803795 1815958 1822010 1827271
13177 1827271 1833818 1835691 1848968 1864286 1879543 1887666 1890228 1898680 1909236 1917410 1927042 1929999 1930998
13164 1930998 1944490 1958198 1971887 1985015 1995127 2005967 2019272 2028492 2027543 2018289 2021135 2031916
13152 2031916 2045818 2051114 2057269 2073541 2095348 2103370 2112794 2105332 2103033 2115887 2123021 2134898 2146858
13139 2146858 2165051 2178400 2184460 2192373 2198558 2208137 2212985 2219537 2218775 2227279 2237143 2243729 2257299
13126 2257299 2270758 2280707 2280035 2290114 2300209 2310493 2321166 2329101 2334092 2342252 2362125 2377693
13114 2377693 2381149 2393213 2406029 2416559 2426919 2438872 2436452 2435479 2445347 2458691 2474316 2490912
13102 2490912 2496834 2512160 2523935 2529756 2546672 2561550 2569176 2569103 2575304 2572493 2565249 2554167 2545288
13089 2545288 2541023 2550418 2578338 2601421 2628795 2657016 2674629 2688332 2693579 2697981 2709385 2735437
13077 2735437 2749326 2764141 2777093 2790293 2806104 2821298 2832567 2835954 2841038 2856052 2864946 2870258
13065 2870258 2882608 2903228 2919290 2932017 2942461 2954828 2968502 2984480 3004849 3018069 3023704
13054 3023704 3036278 3058356 3074334 3092435 3101203 3118803 3135729 3152875 3171042 3194538 3205483
13043 3205483 3217764 3227237 3224030 3228192 3252697 3275207 3293101 3305679 3314002 3321888 3325813 3322964 3328514
13030 3328514 3348797 3368768 3395282 3410945 3425418 3457693 3476063 3495634 3511674 3525300 3538410
13019 3538410 3537566 3539213 3553201 3558465 3570949 3586629 3592464 3597989 3621903 3643306 3658476 3674902
13007 3674902 3696930 3715637 3738958 3751614 3760319 3782569 3803550 3818765 3842981 3858383 3878242
12996 3878242 3901575 3930919 3954434 3977943 3998588 4016730 4046301 4085903 4119637 4136171 4158234
12985 4158234 4182827 4206394 4230676 4248746 4279904 4304343 4331559 4369060 4403037 4437691 4470600
12974 4470600 4508249 4540352 4572547 4610197 4666615 4748276 4837424 4900218 4924724 4910477 4898496
12963 4898496 4902060 4915057 4920188 4927421 4942019 4967489 4990861 5011512 5039148 5057262 5069846 5086164
12951 5086164 5105749 5131872 5158013 5185269 5230063 5271530 5307179 5346552 5384455 5426203 5467586
12940 5467586 5512070 5551340 5603516 5663240 5718943 5772432 5825531 5878472 5925321 5973627 6007343
12929 6007343 6044751 6079351 6115275 6157396 6205025 6248683 6311914 6383510 6454161 6509404 6557236
12918 6557236 6595632 6645689 6728403 6818700 6921000 7020162 7087380 7101066 7072248 7006188 6933418
12907 6933418 6871364 6838746 6839343 6863227 6882347 6908190 6941012 6986479 7067692 7190062 7337706
12896 7337706 7483751 7619233 7705999 7751832 7782520 7840424 7920604 7993265 8044479 8087202 8142200
12885 8142200 8223650 8341606 8468723 8589167 8690889 8786506 8881196 8964919 9052841 9150378
12875 9150378 9250416 9351238 9451231 9545080 9650151 9759317 9863547 9973476 10091674 10210379
12865 10210379 10333522 10453091 10571255 10697178 10823773 10950019 11077986 11211235 11367169
12856 11367169 11535759 11712419 11892642 12072914 12242252 12406758 12577965 12750707 12925766
12847 12925766 13118122 13316553 13525651 13735623 13942313 14154067 14368818 14586645 14813040
12838 14813040 15049853 15296285 15554960 15808908 16074862 16349826 16625231 16921900 17248575
12829 17248575 17596253 17959538 18339283 18725083 19120367 19528697 19946829 20384111 20839958
12820 20839958 21311064 21800804 22325422 22876422 23472478 24093036 24746268 25434629 26160926
12811 26160926 26923282 27725908 28570188 29476904 30455551 31495212 32605676 33779033 35009067
12802 35009067 36323704 37737607 39281427 40986377 42878801 44951981 47234596 49767413
12794 49767413 52587489 55732298 59220898 63098406 67425814 72191119 77410194 83264372
12786 83264372 90134750 98517536 108805633 121226552 135729422 151664895 166468882
12779 166468882 172726067 156247906 105745246 28025935 -55279499 -120050002 -153142206
12772 -153142206 -159442798 -151474978 -138548686 -125175689 -113031223 -102544672 -93734643
12765 -93734643 -86459677 -80398168 -75139270 -70364129 -65956875 -61918740 -58283685 -55037026
12757 -55037026 -52132272 -49525576 -47168818 -45027887 -43062728 -41242810 -39555790 -37978574
12749 -37978574 -36522603 -35191291 -33971615 -32848191 -31810533 -30830632 -29899385 -29023246
12741 -29023246 -28194574 -27422604 -26687845 -25991222 -25346453 -24727497 -24143762 -23590099 -23054030
12732 -23054030 -22526012 -22016300 -21531391 -21077617 -20632379 -20215526 -19824561 -19459823 -19118965
12723 -19118965 -18779129 -18455441 -18131679 -17801800 -17479175 -17155684 -16859042 -16578335 -16297394
12714 -16297394 -16033485 -15778486 -15528278 -15286301 -15049717 -14812768 -14588277 -14383087 -14171657
12705 -14171657 -13978662 -13795597 -13616681 -13433247 -13253125 -13075102 -12905593 -12751223 -12607882
12696 -12607882 -12468421 -12325010 -12189955 -12053180 -11915262 -11764980 -11608455 -11462415 -11313260
12687 -11313260 -11174401 -11049324 -10924612 -10809456 -10695999 -10579102 -10465182 -10368768 -10263589
12678 -10263589 -10157459 -10042709 -9922083 -9802891 -9690246 -9587242 -9479475 -9372495 -9264067
12669 -9264067 -9159762 -9060916 -8970154 -8887210 -8791518 -8699366 -8635051 -8629763 -8667803 -8713147 -8740006
12658 -8740006 -8726164 -8677569 -8623788 -8575508 -8534981 -8502504 -8475459 -8449822 -8409732 -8349203 -8290161
12647 -8290161 -8237500 -8176158 -8123574 -8065674 -8003063 -7927415 -7833902 -7719631 -7618113 -7522369 -7438158
12636 -7438158 -7374521 -7314797 -7253102 -7196545 -7140029 -7092930 -7038940 -6995093 -6958335 -6908630 -6865270
12625 -6865270 -6822681 -6765613 -6697215 -6639433 -6585679 -6536279 -6504749 -6487596 -6464997 -6452153 -6429642
12614 -6429642 -6393538 -6342797 -6298091 -6266846 -6243282 -6220383 -6187496 -6151888 -6120451 -6090187 -6058627
12603 -6058627 -6021086 -5983616 -5961196 -5929927 -5881243 -5837508 -5799555 -5745626 -5696098 -5648491 -5610954
12592 -5610954 -5571384 -5529700 -5490036 -5446818 -5384228 -5319141 -5253157 -5203122 -5178454 -5197373 -5230131
12581 -5230131 -5249939 -5244947 -5220114 -5210362 -5203243 -5185914 -5170069 -5161624 -5154008 -5132908 -5111685 -5098280
12569 -5098280 -5077314 -5056242 -5020554 -4994495 -4977398 -4955004 -4926065 -4901208 -4887659 -4870169 -4853751
12558 -4853751 -4848148 -4829918 -4813620 -4799079 -4777901 -4756996 -4733500 -4711387 -4687561 -4654623 -4631031
12547 -4631031 -4614535 -4606042 -4580165 -4550166 -4523439 -4511331 -4494254 -4479405 -4451755 -4427209 -4407588
12536 -4407588 -4395835 -4381382 -4369340 -4360008 -4333647 -4313069 -4301847 -4286501 -4269141 -4249499 -4227634
12525 -4227634 -4217702 -4210052 -4191026 -4167622 -4154682 -4143424 -4124338 -4115206 -4105038 -4087846 -4067100 -4058453
12513 -4058453 -4053162 -4034276 -4023881 -4007624 -3993504 -3975712 -3960754 -3949454 -3943788 -3931824 -3910550 -3900230
12501 -3900230 -3891415 -3871959 -3855094 -3850113 -3837343 -3816480 -3795105 -3779100 -3774921 -3766512 -3756283 -3750677
12489 -3750677 -3736640 -3725230 -3713703 -3697966 -3675046 -3659284 -3649204 -3633254 -3618455 -3618275 -3615952 -3603492
12477 -3603492 -3601526 -3594249 -3582628 -3567396 -3551527 -3539405 -3521661 -3511381 -3499728 -3486969 -3489605 -3498025
12465 -3498025 -3504118 -3503979 -3503241 -3488959 -3466560 -3436004 -3412770 -3388852 -3361742 -3349704 -3340224 -3331695 -3323004
12452 -3323004 -3320455 -3309988 -3295224 -3281485 -3274356 -3278691 -3273666 -3251480 -3232527 -3223772 -3216877 -3209541 -3203825
12439 -3203825 -3189707 -3177462 -3168375 -3157665 -3155910 -3146667 -3133824 -3128324 -3124193 -3114438 -3108836 -3099292 -3080537
12426 -3080537 -3069269 -3057859 -3051486 -3038068 -3029519 -3021438 -3020360 -3015524 -3006519 -2986247 -2972611 -2961025
12414 -2961025 -2952007 -2957639 -2959433 -2954872 -2943227 -2930531 -2929944 -2925642 -2922388 -2908418 -2886251 -2878205 -2872124
12401 -2872124 -2860901 -2856621 -2857046 -2844989 -2833101 -2832753 -2826304 -2814739 -2806212 -2798059 -2791801 -2779427 -2770884
12388 -2770884 -2764930 -2755756 -2745000 -2737905 -2746812 -2745586 -2730741 -2721610 -2719768 -2709690 -2699875 -2692604 -2675439
12375 -2675439 -2662601 -2652097 -2648630 -2647786 -2636948 -2627731 -2621404 -2618640 -2614155 -2611286 -2606286 -2595341 -2584181
12362 -2584181 -2573298 -2564685 -2552421 -2553411 -2546730 -2539395 -2521622 -2497102 -2482955 -2479547 -2469981 -2456093 -2454990
12349 -2454990 -2447380 -2433765 -2423232 -2415252 -2407204 -2402790 -2394506 -2383128 -2374963 -2355446 -2338786 -2322357
12337 -2322357 -2305942 -2302792 -2292343 -2272723 -2236131 -2209213 -2175377 -2133935 -2090047 -2046742 -2004504
12326 -2004504 -1952307 -1890737 -1817782 -1739114 -1669500 -1628666 -1655137 -1821262 -2144564 -2546428 -2921529
12315 -2921529 -3162962 -3257683 -3267454 -3225889 -3163047 -3103361 -3040085 -2978102 -2909331 -2847885 -2797615
12304 -2797615 -2758107 -2723933 -2701715 -2673270 -2644228 -2623741 -2603849 -2595416 -2582253 -2572164 -2555268
12293 -2555268 -2534143 -2517249 -2498122 -2489433 -2484924 -2480517 -2481383 -2471712 -2454641 -2445428 -2439556 -2432672 -2425299
12280 -2425299 -2415324 -2401252 -2397727 -2390857 -2379523 -2372791 -2368357 -2365746 -2358259 -2342850 -2340830 -2334125 -2327637
12267 -2327637 -2315856 -2305761 -2307891 -2301473 -2290039 -2277399 -2273252 -2271328 -2269730 -2273685 -2266381 -2262738 -2254899
12254 -2254899 -2242931 -2231305 -2232591 -2235025 -2227772 -2228105 -2221518 -2211026 -2206219 -2207460 -2202645 -2196689 -2194067
12241 -2194067 -2192082 -2181123 -2171337 -2172958 -2173739 -2160888 -2152535 -2159257 -2168590 -2172458 -2168111 -2156073 -2143036
12228 -2143036 -2133144 -2131521 -2121236 -2110599 -2110384 -2110090 -2104184 -2101445 -2095930 -2087825 -2090822 -2095497 -2086896 -2074704
12214 -2074704 -2064084 -2067794 -2058490 -2059477 -2064267 -2059272 -2055434 -2056481 -2056613 -2051624 -2042141 -2040446 -2043119 -2043686
12200 -2043686 -2037436 -2027093 -2005240 -1997555 -1999327 -1999552 -1991112 -1985360 -1987582 -1986199 -1989286 -1983250 -1971930
12187 -1971930 -1965182 -1950361 -1950985 -1954039 -1969960 -1970172 -1963828 -1958483 -1954542 -1955753 -1954679 -1945340 -1942371 -1943299
12173 -1943299 -1943754 -1937380 -1927125 -1919977 -1909380 -1904853 -1903115 -1898505 -1891107 -1891145 -1887680 -1889789 -1886273 -1888497
12159 -1888497 -1887392 -1882209 -1883242 -1894867 -1892284 -1877167 -1862846 -1863542 -1865778 -1860761 -1859247 -1857592 -1861834
12146 -1861834 -1856708 -1856046 -1849541 -1838968 -1828910 -1822744 -1825947 -1830674 -1836021 -1830695 -1813158 -1804063 -1808162
12133 -1808162 -1808047 -1800278 -1796979 -1799066 -1796320 -1783794 -1777149 -1768636 -1769116 -1765210 -1755702 -1748946 -1741796 -1738356
12119 -1738356 -1751482 -1768982 -1789525 -1802974 -1802143 -1799786 -1793116 -1780467 -1781160 -1780575 -1773677 -1765564 -1768841
12106 -1768841 -1767450 -1759991 -1750831 -1745980 -1749676 -1740823 -1725998 -1724502 -1722589 -1716358 -1723171 -1718832 -1713750 -1705179
12092 -1705179 -1703475 -1696591 -1681216 -1677106 -1680966 -1672957 -1672545 -1678473 -1670591 -1654664 -1640915 -1638464 -1633587
12079 -1633587 -1611226 -1583000 -1557342 -1552202 -1574528 -1629924 -1690482 -1736192 -1752191 -1750442 -1734829 -1727892
12067 -1727892 -1727514 -1728913 -1721706 -1704010 -1699711 -1701903 -1694080 -1681741 -1677923 -1671879 -1661214 -1656296 -1653423
12054 -1653423 -1640048 -1632797 -1635554 -1634568 -1630672 -1621699 -1614965 -1612309 -1612861 -1614737 -1606791 -1603093 -1598959 -1582307
12040 -1582307 -1565179 -1561422 -1561662 -1556700 -1553123 -1547448 -1529603 -1506680 -1492373 -1492053 -1537000 -1610348 -1655448
12027 -1655448 -1683671 -1691566 -1685905 -1664256 -1646382 -1646771 -1647363 -1630166 -1624106 -1618620 -1603802 -1593632 -1591578
12014 -1591578 -1596505 -1588823 -1581286 -1582973 -1579189 -1568117 -1555384 -1545852 -1550117 -1549241 -1548056 -1553248 -1547276 -1544828
12000 -1544828 -1543876 -1544974 -1544051 -1535761 -1524697 -1520935 -1511369 -1501398 -1498599 -1502364 -1502240 -1500046 -1497565 -1497980 -1510557
11985 -1510557 -1542206 -1560442 -1562752 -1557422 -1552087 -1545220 -1539357 -1538139 -1528768 -1526898 -1527865 -1519072 -1518614 -1508015
11971 -1508015 -1495747 -1485867 -1486539 -1492959 -1482948 -1483899 -1493485 -1486847 -1478477 -1481148 -1474067 -1472690 -1478189 -1477000
11957 -1477000 -1475612 -1476034 -1462272 -1448560 -1447808 -1449488 -1443293 -1448208 -1452021 -1447577 -1437719 -1431731 -1430059 -1431639
11943 -1431639 -1445817 -1461039 -1462737 -1454706 -1451264 -1446245 -1439989 -1434229 -1420647 -1419824 -1424827 -1421660 -1425233
11930 -1425233 -1428194 -1421833 -1407744 -1401510 -1403861 -1404236 -1411211 -1417367 -1414845 -1409000 -1406352 -1404249 -1395623 -1395063
11916 -1395063 -1407526 -1401807 -1397042 -1397909 -1398602 -1395236 -1389465 -1390066 -1391823 -1403620 -1401174 -1391962 -1384398 -1385954
11902 -1385954 -1392294 -1386662 -1392523 -1391751 -1392087 -1388355 -1386793 -1378131 -1364611 -1361293 -1374894 -1386541 -1378584 -1368894
11888 -1368894 -1366227 -1362297 -1345916 -1337864 -1345816 -1356378 -1359414 -1357206 -1348112 -1348342 -1350022 -1347512 -1339281 -1337237
11874 -1337237 -1336761 -1336427 -1337694 -1337152 -1332933 -1332967 -1333988 -1331484 -1334994 -1337918 -1328165 -1325103 -1328361 -1324545 -1320034
11859 -1320034 -1311286 -1314890 -1325106 -1326373 -1327272 -1326954 -1321363 -1313468 -1307581 -1309458 -1308371 -1303950 -1305193 -1298560
11845 -1298560 -1297727 -1303597 -1304770 -1306607 -1300445 -1298779 -1290651 -1287209 -1286001 -1278557 -1278569 -1286560 -1292740 -1290197 -1282584
11830 -1282584 -1287836 -1293327 -1294762 -1291779 -1286733 -1283287 -1276504 -1267816 -1272670 -1275135 -1273840 -1271576 -1268820 -1253255
11816 -1253255 -1247584 -1247186 -1255825 -1254963 -1253590 -1255179 -1260738 -1266509 -1258111 -1256933 -1247909 -1246469 -1255622 -1250159
11802 -1250159 -1250819 -1244839 -1244281 -1246709 -1253881 -1256966 -1247642 -1244760 -1243009 -1246464 -1252515 -1249156 -1237220 -1236078
11788 -1236078 -1237177 -1240788 -1239783 -1239299 -1244177 -1232440 -1220861 -1225873 -1219325 -1207435 -1200189 -1199546 -1211854
11775 -1211854 -1211909 -1203069 -1202404 -1202315 -1204551 -1217091 -1214150 -1202792 -1203799 -1199087 -1192593 -1179009 -1178760 -1178951 -1192431
11760 -1192431 -1201758 -1206128 -1200730 -1198716 -1202154 -1202518 -1199783 -1192325 -1185950 -1181930 -1187366 -1189195 -1189712 -1184537
11746 -1184537 -1176527 -1170600 -1172896 -1175035 -1174547 -1182260 -1176879 -1170002 -1166798 -1165309 -1168851 -1170750 -1170448 -1169457 -1168720
11731 -1168720 -1166055 -1159399 -1162497 -1167665 -1167515 -1168597 -1161567 -1163944 -1166055 -1161325 -1158246 -1152780 -1146485 -1141676
11717 -1141676 -1141528 -1141755 -1147396 -1151367 -1155750 -1156630 -1145978 -1140384 -1134639 -1141013 -1137706 -1133303 -1128195 -1131377
11703 -1131377 -1130745 -1139680 -1136195 -1138206 -1134380 -1133294 -1139387 -1146691 -1137511 -1118428 -1108282 -1113875 -1122920 -1125118
11689 -1125118 -1119558 -1118919 -1126719 -1119505 -1107619 -1107080 -1104021 -1101678 -1111337 -1121752 -1124196 -1121049 -1119371 -1121843
11675 -1121843 -1113048 -1104497 -1100905 -1093345 -1094217 -1093261 -1098645 -1100925 -1100414 -1097163 -1096721 -1089297 -1082040 -1092454 -1104973
11660 -1104973 -1103674 -1094387 -1083887 -1064394 -1062412 -1073212 -1092440 -1100885 -1096992 -1092002 -1088476 -1084841 -1079160
11647 -1079160 -1074972 -1078689 -1078226 -1077902 -1078849 -1075406 -1064215 -1054455 -1049489 -1050440 -1057063 -1055659 -1056546 -1064090 -1067046
11632 -1067046 -1064680 -1061353 -1051889 -1045243 -1049104 -1046929 -1052646 -1061492 -1061322 -1054564 -1051204 -1038342 -1028555 -1046742
11618 -1046742 -1052505 -1043662 -1034159 -1031009 -1034471 -1037064 -1033023 -1031236 -1037611 -1029864 -1023942 -1028411 -1039010 -1039596
11604 -1039596 -1037700 -1032917 -1020004 -1014131 -1017644 -1017040 -1021775 -1028952 -1034355 -1032051 -1027367 -1012721 -1008607 -1006826
11590 -1006826 -1000130 -1012764 -1013546 -1013779 -1016869 -1012464 -1004628 -1004975 -1003511 -1003952 -1001426 -1006525 -1013903 -1021930 -1031200
11575 -1031200 -1021988 -1012287 -1002258 -993679 -995920 -998288 -1000739 -1001293 -994229 -992803 -994371 -997597 -1006859 -1005775
11561 -1005775 -999830 -1004144 -1006324 -988650 -975263 -976111 -980735 -990940 -993341 -1001898 -1007307 -1007343 -1001244 -999512
11547 -999512 -996113 -987930 -972447 -966598 -969967 -972040 -969123 -966745 -970495 -974300 -975672 -973247 -972204 -967838
11533 -967838 -962036 -963853 -969724 -966721 -966964 -966032 -958456 -958619 -957804 -961266 -963992 -959788 -955134 -956446 -958288
11518 -958288 -958787 -963291 -959567 -954246 -946480 -946847 -950746 -949911 -953928 -954037 -952216 -949434 -950605 -959377 -951504
11503 -951504 -942647 -938613 -941103 -929003 -930573 -936400 -941258 -940503 -933904 -929434 -934750 -934513 -932619 -927399
11489 -927399 -927149 -931575 -934971 -941469 -938166 -928307 -934149 -937032 -920521 -911934 -918825 -922389 -920032 -930752
11475 -930752 -932280 -923862 -916100 -917001 -919312 -920828 -913326 -904828 -907992 -907238 -903665 -915811 -917778 -915510
11461 -915510 -911260 -910093 -913714 -915048 -906350 -906433 -908941 -907396 -896822 -893840 -899857 -909891 -912857 -907405
11447 -907405 -901091 -904166 -903074 -900639 -901826 -901646 -894469 -898915 -897264 -900462 -900968 -892965 -896830 -903734 -904938
11432 -904938 -903561 -910574 -912849 -900401 -893217 -886689 -884376 -875996 -878951 -883805 -879691 -872879 -871129 -869395
11418 -869395 -867190 -876001 -880423 -880526 -876942 -875518 -879484 -880720 -870021 -862683 -860091 -863345 -872948 -869244
11404 -869244 -864879 -861396 -861108 -863607 -864158 -858892 -851731 -856398 -858150 -852102 -848691 -852186 -844070 -837492 -840454
11389 -840454 -837608 -839317 -847326 -848149 -846781 -846851 -844527 -842901 -844475 -839134 -841201 -839723 -836452 -835636 -832687
11374 -832687 -833599 -839736 -846251 -847038 -850230 -856313 -852706 -849583 -848022 -845601 -846851 -846745 -845369 -836774 -829568
11359 -829568 -836764 -839341 -841923 -832905 -827946 -825162 -828630 -840680 -835799 -819745 -811345 -818153 -824886 -819375
11345 -819375 -813087 -813968 -814212 -812701 -813873 -815383 -820448 -821854 -822868 -823969 -825202 -823130 -830858 -828914 -827624
11330 -827624 -827944 -823100 -817574 -806978 -806602 -803922 -810043 -816224 -811141 -800069 -795269 -794776 -798267 -792984
11316 -792984 -786735 -787568 -786909 -792337 -798349 -796036 -798837 -797302 -790663 -784199 -783847 -790079 -790517 -790183 -796496
11301 -796496 -795664 -790356 -789828 -784546 -788503 -791499 -786728 -780620 -774117 -777739 -786640 -788396 -786168 -778477 -781682
11286 -781682 -782412 -776246 -773141 -776685 -768415 -764532 -765627 -774629 -778582 -778163 -783503 -791195 -783933 -768787
11272 -768787 -772799 -768653 -769198 -771736 -763969 -759648 -758758 -755232 -754300 -757654 -764077 -771597 -764212 -751175 -750728
11257 -750728 -761240 -759646 -747697 -742614 -744107 -746076 -736703 -733340 -738432 -750648 -757753 -759717 -752864
11244 -752864 -735489 -725898 -718396 -727296 -733102 -738942 -741365 -737003 -730556 -731879 -735681 -732491 -732344 -730746
11230 -730746 -727654 -732235 -730242 -722673 -721688 -727605 -727349 -727905 -727946 -725713 -725021 -719992 -718422 -720141 -721031 -718659
11214 -718659 -715672 -714862 -712016 -705819 -706617 -701956 -696638 -699068 -704218 -712099 -710495 -711424 -695771 -682921
11200 -682921 -695190 -703737 -706876 -701495 -704278 -704987 -702148 -697608 -696575 -698381 -700289 -698937 -692154 -690759
11186 -690759 -694364 -691051 -690891 -696621 -695490 -695178 -694447 -694628 -688722 -687330 -689722 -691161 -685981 -686790 -689915
11171 -689915 -687148 -680556 -675732 -683265 -682694 -678538 -674339 -669432 -669899 -665413 -668210 -668982 -663378 -659110 -665982
11156 -665982 -663934 -652264 -656881 -662847 -661470 -664960 -665760 -661103 -661523 -657409 -659615 -654929 -657121 -654525
11142 -654525 -643272 -638992 -643971 -653989 -662488 -658940 -655390 -646770 -644189 -645310 -638844 -637394 -638370 -639807
11128 -639807 -643667 -641739 -641818 -644290 -636504 -630366 -633614 -634579 -641514 -633817 -632981 -633248 -632349 -623904 -618110 -612071
11112 -612071 -618956 -628465 -628873 -630312 -626757 -621441 -616794 -611620 -611856 -609380 -608012 -609037 -606233 -613901 -611131
11097 -611131 -611717 -602038 -589092 -582464 -590629 -595215 -589531 -587634 -592152 -595496 -595706 -601631 -603238 -606639
11083 -606639 -614459 -611800 -605399 -598279 -595803 -593320 -599267 -596665 -600937 -598886 -592154 -577590 -567731 -577488
11069 -577488 -579201 -569968 -567662 -572082 -566656 -565460 -567554 -565278 -563819 -561938 -562799 -567378 -562652 -565101
11055 -565101 -558916 -555472 -556701 -554455 -555212 -552230 -556494 -548102 -543132 -527304 -526460 -526610 -527729 -532132 -543128
11040 -543128 -542427 -527718 -515645 -504010 -502303 -504851 -514184 -520876 -530947 -537970 -540070 -543377 -543143 -541921
11026 -541921 -542450 -544177 -543357 -540172 -539393 -540685 -547251 -560290 -563371 -568073 -564094 -558548 -555389 -564629 -555089
11011 -555089 -548564 -555671 -569795 -570427 -573278 -577176 -582233 -583840 -578529 -570702 -566313 -571118 -568931 -559235
10997 -559235 -550478 -552739 -558255 -561949 -561540 -560961 -548535 -539863 -542483 -537810 -536498 -532425 -529580 -525674
10983 -525674 -526157 -525362 -519272 -516784 -510693 -511248 -505762 -505242 -504120 -496089 -499768 -503102 -500708 -498899 -496735
10968 -496735 -493343 -487793 -482700 -475400 -478789 -479554 -483882 -489686 -503644 -505384 -491407 -481296 -480044 -480112
10954 -480112 -476310 -478948 -481309 -485979 -481088 -480450 -477009 -465563 -455681 -454633 -456088 -459486 -455246 -448632
10940 -448632 -449423 -456449 -457611 -450745 -447433 -443924 -445098 -447667 -443393 -441294 -444852 -454108 -461507 -460410
10926 -460410 -446949 -446046 -448028 -452143 -452968 -438055 -431503 -425185 -421971 -424138 -424898 -423894 -415838 -411707
10912 -411707 -414056 -415998 -413308 -414598 -406123 -407941 -414017 -404523 -404181 -401880 -396854 -389412 -379845 -372112
10898 -372112 -375016 -371792 -371120 -366586 -361855 -367616 -378921 -372914 -370855 -375084 -372305 -362175 -360032 -364572
10884 -364572 -374441 -377000 -370235 -371398 -374251 -365049 -356869 -346118 -339765 -340091 -337831 -337593 -337483 -337017 -329328
10869 -329328 -321387 -319003 -317787 -313133 -313705 -313883 -311444 -315354 -320105 -318567 -319378 -311598 -308545 -302957 -293419
10854 -293419 -295056 -287936 -289878 -297294 -296413 -286333 -276305 -273461 -273240 -276095 -271661 -264932 -260653 -264749
10840 -264749 -270936 -271867 -269124 -261528 -257784 -259616 -260264 -265572 -258293 -254419 -256153 -255530 -245782 -239696 -234043
10825 -234043 -232545 -237328 -235594 -234307 -223115 -212219 -210059 -212735 -219704 -223765 -218303 -198255 -194916
10812 -194916 -198654 -197770 -199078 -202390 -203558 -197897 -189695 -174565 -169489 -161164 -159972 -163999 -169162 -167678
10798 -167678 -160404 -159930 -150011 -137299 -132554 -125539 -117999 -111442 -119788 -114910 -109213 -103157 -106177 -92387
10784 -92387 -82975 -83937 -78469 -70168 -66956 -63218 -68295 -78677 -79916 -74700 -64059 -60792 -54040 -53497
10770 -53497 -36693 -26379 -21103 -21848 -22428 -17360 -11064 -4326 -804 10793 12219 14021 22729 26253
10756 26253 26516 26009 37649 36926 37143 51377 67683 77481 78139 74188 80323 90809 102759 111131
10742 111131 117709 119585 128461 136526 149430 149352 147570 151643 161312 168857 176434 186356 196062 199633
10728 199633 203558 204800 208350 220110 217516 223327 239623 245982 249590 252733 262412 261296 265964 270328
10714 270328 283693 302359 308394 312472 316834 330113 339886 352367 364915 370338 377885 392220 407408
10701 407408 418337 425609 428776 440132 447693 464677 478869 495355 506685 523675 539099 559072
10689 559072 575225 588499 604625 618049 629945 638790 650095 669069 686895 698734 733919 753139
10677 753139 773648 801935 812196 835482 854210 879828 905907 924167 938782 952738 956765 961184
10665 961184 985832 1018095 1045543 1077969 1115698 1145543 1169047 1205022 1239892 1269441 1299446
10654 1299446 1339771 1375308 1419879 1451354 1481563 1522660 1573882 1614875 1669289 1727597 1779123
10643 1779123 1838648 1897179 1960724 2021959 2087713 2164107 2233801 2315366 2401460 2488669 2579632
10632 2579632 2684628 2797204 2914338 3025465 3144209 3282111 3449868 3622703 3808390
10623 3808390 4018711 4266036 4529766 4821137 5153775 5493317 5810324 6059231 6149980 6002649
10613 6002649 5619983 5148012 4776858 4638897 4747935 5063257 5519277 6055430 6578797
10604 6578797 6922501 6859549 6159221 4846201 3333643 2181680 1640691 1664388 2075212
10595 2075212 2698123 3387429 3972270 4214570 3770160 2369225 148287 -2202856 -3929928
10586 -3929928 -4750955 -4824714 -4445155 -3836443 -3189373 -2663261 -2444253 -2745945 -3719980 -5178203
10576 -5178203 -6604968 -7535058 -7859416 -7721318 -7322086 -6833724 -6356419 -5988288 -5799528
10567 -5799528 -5859748 -6183546 -6652929 -7090346 -7326276 -7340087 -7187796 -6930283 -6632546 -6329303
10557 -6329303 -6042241 -5768878 -5523983 -5318996 -5140399 -4967356 -4800695 -4641434 -4502613
10548 -4502613 -4375724 -4260494 -4158356 -4057511 -3957518 -3864186 -3785013 -3704930 -3625201 -3551812
10538 -3551812 -3487680 -3415564 -3354768 -3296576 -3241377 -3193191 -3139378 -3091628 -3048808 -3010550 -2971863
10527 -2971863 -2914801 -2862623 -2822092 -2785552 -2756679 -2720628 -2690301 -2660280 -2631640 -2597167 -2573523
10516 -2573523 -2551763 -2521406 -2496103 -2463538 -2437991 -2410870 -2391927 -2372368 -2342358 -2327629 -2302949
10505 -2302949 -2281215 -2255838 -2235762 -2215556 -2193233 -2181896 -2168713 -2159033 -2147650 -2129544 -2109754
10494 -2109754 -2091242 -2077467 -2063791 -2051410 -2040851 -2021469 -2001365 -1977323 -1972885 -1966270 -1949695 -1929175
10482 -1929175 -1917467 -1913237 -1907981 -1901200 -1893998 -1880707 -1861350 -1849129 -1840019 -1827079 -1802579 -1791372
10470 -1791372 -1789277 -1787508 -1780686 -1781690 -1782678 -1780702 -1764136 -1749718 -1737948 -1725338 -1711511 -1696187 -1682796
10457 -1682796 -1683906 -1685811 -1674580 -1663341 -1648547 -1635654 -1632077 -1625971 -1622390 -1624267 -1620423 -1615004 -1615103
10444 -1615103 -1603979 -1592347 -1573944 -1572731 -1569667 -1564635 -1553920 -1545604 -1527837 -1522369 -1521811 -1511892 -1509150
10431 -1509150 -1508611 -1497745 -1495652 -1498012 -1491579 -1481237 -1472313 -1471420 -1453356 -1441503 -1437112 -1433674 -1438426
10418 -1438426 -1438822 -1434510 -1422638 -1410591 -1409962 -1403585 -1403921 -1401745 -1407698 -1409414 -1396180 -1393462 -1393807 -1391804
10404 -1391804 -1382814 -1376765 -1364071 -1350923 -1347924 -1346602 -1345930 -1341543 -1326075 -1321831 -1319301 -1315338 -1318470
10391 -1318470 -1315381 -1305266 -1297859 -1289332 -1286101 -1291377 -1294784 -1292611 -1298748 -1304466 -1296984 -1293473 -1288203 -1282013
10377 -1282013 -1279270 -1277383 -1284150 -1287524 -1277707 -1265630 -1269224 -1272953 -1271792 -1258704 -1255163 -1246959 -1246894 -1245074
10363 -1245074 -1235628 -1229057 -1229404 -1235843 -1231137 -1222455 -1219250 -1222739 -1215162 -1213297 -1205776 -1195989 -1199680 -1203166
10349 -1203166 -1200750 -1188931 -1186167 -1188788 -1190928 -1187047 -1185076 -1181556 -1178283 -1184217 -1179796 -1179214 -1171611 -1165505
10335 -1165505 -1164664 -1167450 -1169975 -1164894 -1158092 -1160949 -1161314 -1163231 -1165284 -1170742 -1163978 -1155140 -1149051 -1141981
10321 -1141981 -1139423 -1130608 -1133272 -1138590 -1131092 -1125096 -1126406 -1126798 -1119035 -1115898 -1119641 -1121593 -1116855 -1110520
10307 -1110520 -1103080 -1098279 -1106856 -1112320 -1110254 -1103848 -1106416 -1110520 -1109848 -1108928 -1103627 -1085751 -1075248 -1081647
10293 -1081647 -1094373 -1090796 -1091667 -1097664 -1100162 -1094257 -1085591 -1084168 -1069652 -1070376 -1070627 -1066261 -1059721 -1053062
10279 -1053062 -1045292 -1044784 -1047346 -1048045 -1059163 -1059464 -1056274 -1053122 -1051430 -1055885 -1060807 -1055671 -1052308 -1053312
10265 -1053312 -1053969 -1047635 -1042484 -1040206 -1036943 -1036110 -1030113 -1032100 -1043957 -1040030 -1025952 -1022385 -1027413 -1027626
10251 -1027626 -1023172 -1019745 -1012812 -1017449 -1026018 -1028221 -1022579 -1012805 -1010380 -1007423 -1009441 -1008839 -1007320 -1000370
10237 -1000370 -997694 -991583 -991056 -990537 -988793 -993575 -994306 -998767 -990517 -987836 -991873 -984302 -979911 -978846 -984593
10222 -984593 -985116 -987246 -984583 -990710 -993798 -980081 -969394 -964987 -952076 -946900 -958630 -962908 -966675
10209 -966675 -973711 -970469 -970324 -973374 -969664 -955741 -945235 -943757 -944880 -949188 -954505 -950891 -947842 -938962
10195 -938962 -939184 -937874 -931405 -930670 -939242 -940964 -935756 -926590 -931209 -931237 -924089 -923955 -921149 -913434 -904308
10180 -904308 -911316 -918315 -910870 -903231 -903766 -905782 -907153 -908881 -915812 -914303 -903420 -902171 -903725 -910227
10166 -910227 -906573 -906960 -909304 -914777 -926556 -927230 -913732 -894980 -887045 -892195 -895496 -905140 -912515 -917213
10152 -917213 -921704 -922210 -932102 -946586 -943008 -948390 -948892 -945264 -932273 -913402 -907539 -921431 -937858
10139 -937858 -953393 -954417 -961043 -966048 -966219 -970407 -959446 -948692 -946581 -943720 -942204 -946998 -943104 -937176
10125 -937176 -930509 -925649 -931594 -936092 -935922 -916705 -912791 -913194 -914375 -915736 -915100 -910466 -909986 -913190 -909316
10110 -909316 -897363 -894216 -902772 -902463 -897720 -891254 -887488 -893384 -908169 -908216 -903351 -893882 -893752 -889073 -885968
10095 -885968 -889458 -896859 -895287 -896582 -892474 -886524 -889753 -895509 -887971 -882706 -885602 -884015 -887845 -887058
10081 -887058 -883735 -871685 -865359 -873516 -878457 -870076 -865557 -866658 -869142 -869228 -860635 -860811 -864937 -864678 -870241
10066 -870241 -868286 -861455 -857806 -856516 -857594 -858819 -861697 -866218 -868993 -868859 -868578 -872829 -865519 -857603 -855009
10051 -855009 -854526 -861892 -867927 -867015 -853922 -847584 -846353 -851619 -859362 -859302 -858888 -858478 -860958 -859669 -852688
10036 -852688 -844763 -836525 -834093 -837244 -844288 -843773 -847181 -845025 -848593 -851125 -848420 -841841 -836339 -835035
10022 -835035 -837377 -842794 -841786 -830600 -827447 -835876 -841969 -835915 -834421 -830880 -822743 -825340 -828162 -830927
10008 -830927 -831190 -829329 -832043 -836040 -830496 -834584 -834540 -835670 -834319 -823007 -821587 -821997 -824986 -829255 -818691
9993 -818691 -810633 -806428 -808555 -807560 -801124 -803702 -811178 -811843 -815840 -816116 -811475 -811923 -805714 -804203 -803184
9978 -803184 -806539 -813733 -807503 -805865 -809075 -809002 -809921 -814311 -811904 -805989 -811308 -811669 -801184 -794322 -791377
9963 -791377 -797035 -800779 -809178 -800612 -801395 -805211 -810071 -809623 -802589 -797988 -802534 -804136 -802703 -796418 -799463
9948 -799463 -793539 -791716 -797936 -797637 -799501 -791656 -787510 -787813 -791822 -799387 -797631 -795703 -799317 -801666 -795333
9933 -795333 -798095 -802553 -802197 -794607 -785963 -784608 -784505 -779437 -770588 -773965 -786140 -798111 -796296 -790285
9919 -790285 -787072 -787507 -787304 -788544 -786579 -776966 -776122 -773465 -778693 -778304 -776684 -776149 -779451 -782071 -784605 -783815
9903 -783815 -787095 -782533 -777999 -778488 -784200 -783398 -778819 -776621 -770569 -764516 -766922 -760616 -759773 -761698 -760252
9888 -760252 -758660 -768344 -766521 -765256 -774562 -776581 -763947 -766484 -762476 -761313 -760563 -761942 -762916 -761839 -762098
9873 -762098 -772158 -770467 -770026 -771057 -764983 -759433 -762916 -763251 -764463 -759314 -745833 -742194 -735617 -733336
9859 -733336 -750655 -761047 -765658 -757361 -753818 -756583 -760772 -753082 -748739 -751646 -757844 -755825 -753025 -754680
9845 -754680 -754032 -748260 -745975 -755576 -763304 -767609 -767912 -761819 -756578 -747829 -745903 -748353 -753517 -754861 -744002
9830 -744002 -745801 -749091 -747775 -746798 -741779 -735562 -728796 -727357 -729874 -736962 -739334 -736571 -736095 -737390 -740584
9815 -740584 -746481 -744012 -743073 -738419 -735749 -742956 -748870 -748047 -742641 -739449 -741984 -736957 -734015 -730854 -729807
9800 -729807 -735451 -736929 -732450 -727322 -727884 -735725 -732256 -727314 -738147 -736637 -735189 -737616 -735475 -738242
9786 -738242 -735603 -730145 -730282 -725420 -725097 -735169 -727375 -730513 -731486 -726090 -721702 -721495 -722357 -721858 -720770 -721365
9770 -721365 -720033 -715249 -714511 -720029 -718739 -720261 -722337 -720798 -727475 -730697 -727848 -728935 -724248 -718629 -719336
9755 -719336 -717356 -723229 -729412 -720229 -723146 -718976 -722056 -734243 -732631 -720596 -710211 -713405 -714546 -706530
9741 -706530 -706565 -701735 -706691 -703615 -705036 -709619 -709676 -704916 -705446 -697791 -693675 -695153 -696296 -694370 -702351 -703852
9725 -703852 -703613 -699793 -698364 -707904 -703521 -699434 -701921 -702495 -703227 -702336 -703969 -704595 -711257 -701471 -694798 -697780
9709 -697780 -688476 -686768 -692768 -700750 -700838 -704669 -703295 -699047 -694106 -695324 -697980 -701954 -688924 -690840 -693150
9694 -693150 -694552 -687651 -680796 -685425 -696313 -701387 -702752 -695774 -694702 -702033 -700274 -700713 -694127 -681327
9680 -681327 -683024 -691315 -690227 -684516 -688277 -688347 -688943 -681274 -682489 -669904 -664265 -670835 -683352 -688209 -684718
9665 -684718 -689626 -690222 -691406 -693460 -687042 -683657 -683950 -682409 -682342 -682065 -671528 -682652 -684266 -685217 -682792
9650 -682792 -677155 -678818 -671160 -654097 -645949 -662205 -685264 -710576 -726169 -721200 -714343 -708316 -702976
9637 -702976 -701405 -698194 -696896 -706564 -704185 -696231 -701613 -702067 -703756 -707808 -704107 -693563 -687425 -687521 -685204
9622 -685204 -682413 -663115 -653570 -665654 -682383 -689033 -687824 -676941 -679515 -688160 -685206 -686513 -689763
9609 -689763 -686104 -680479 -675246 -665152 -660592 -657258 -658063 -658937 -664125 -665183 -668255 -681321 -681538 -678255 -676458
9594 -676458 -677412 -673400 -668925 -670017 -665719 -661412 -664974 -671858 -675393 -679365 -675614 -674259 -680616 -677043 -669815
9579 -669815 -674257 -675162 -673183 -679123 -682321 -672138 -655300 -646823 -651476 -658310 -653251 -656570 -658823 -656457
9565 -656457 -660588 -657553 -656223 -659109 -661763 -668192 -669601 -669865 -663932 -664030 -667701 -664469 -662239 -660017 -646440
9550 -646440 -642994 -649855 -653715 -657911 -657413 -665398 -662951 -661592 -663569 -665702 -659151 -660831 -661815 -659704 -659648
9535 -659648 -659951 -659979 -656244 -655607 -659719 -651949 -650758 -649012 -651189 -643165 -646475 -657238 -661061 -654994 -647080
9520 -647080 -641478 -647339 -649153 -652719 -649189 -637441 -635727 -638852 -642367 -655924 -661195 -656671 -646540 -643010
9506 -643010 -642033 -641445 -646334 -651769 -660819 -661387 -656085 -656298 -663943 -666666 -661453 -659438 -653165 -649566 -641907
9491 -641907 -636626 -636988 -640821 -641396 -640238 -642457 -644198 -641236 -630233 -624707 -630949 -629977 -637281 -641127 -647743
9476 -647743 -652350 -647008 -643917 -638953 -630295 -626524 -626146 -637226 -636325 -633161 -637644 -632902 -625598 -630845 -633756
9461 -633756 -635178 -634258 -629262 -629672 -639801 -647668 -641688 -639259 -644367 -642669 -636748 -621221 -609302 -613606
9447 -613606 -624628 -630808 -639526 -642792 -642146 -646003 -648266 -639072 -637477 -636823 -632567 -624270 -625869 -632548 -640895
9432 -640895 -645007 -642758 -635563 -628091 -629710 -630684 -632232 -627405 -630205 -627502 -625450 -617796 -612414 -617182 -622537
9417 -622537 -642014 -642044 -631841 -620316 -622674 -623260 -624895 -628127 -620202 -616882 -612668 -614103 -619767 -623915
9403 -623915 -628794 -628686 -623772 -619989 -620505 -621063 -621327 -618010 -619793 -623489 -619074 -618777 -621322 -624785 -615888 -606315
9387 -606315 -613459 -622100 -623214 -623853 -626822 -625287 -624128 -626325 -628117 -623613 -625562 -624573 -614079 -607360 -607231
9372 -607231 -608266 -608135 -605628 -605082 -599555 -592352 -598688 -608687 -617095 -614437 -614242 -613806 -615141 -611758 -608730
9357 -608730 -611161 -609889 -608052 -607279 -615873 -615755 -617584 -618125 -602847 -597765 -599749 -603242 -610098 -621169 -624875
9342 -624875 -620891 -612824 -600615 -598235 -608022 -610664 -618674 -621414 -611483 -607495 -601760 -598987 -611572 -610789
9328 -610789 -606407 -603500 -606078 -609724 -600548 -595296 -597003 -598214 -595919 -605024 -617735 -618290 -608771 -601632
9314 -601632 -599610 -610658 -610136 -608287 -609060 -603536 -590140 -586847 -595056 -601904 -610386 -606502 -606649 -612761 -608039
9299 -608039 -599756 -602269 -599952 -599893 -594695 -592167 -587319 -587504 -593792 -600467 -610823 -610876 -601051 -600723 -602036 -604281
9283 -604281 -605117 -604878 -602982 -605612 -603875 -605336 -609239 -603288 -605452 -611318 -607127 -605182 -602038 -598990 -591020
9268 -591020 -585274 -592687 -591728 -584998 -591731 -588836 -585077 -593727 -598139 -598261 -601526 -607867 -610075 -609243 -611682
9253 -611682 -612294 -611040 -607633 -600221 -596768 -593543 -593652 -588229 -579996 -581825 -584427 -582344 -588515 -595961 -605415
9238 -605415 -603261 -592493 -598054 -593729 -598936 -599186 -593081 -589753 -586789 -587729 -591309 -585705 -588628 -590138 -590002
9223 -590002 -602519 -611980 -604176 -606971 -604257 -598078 -598921 -598978 -597570 -603447 -601880 -599888 -597644 -586371 -575130
9208 -575130 -577389 -584113 -582060 -588428 -594975 -589710 -577491 -575648 -580168 -587215 -592167 -593545 -584445 -585438
9194 -585438 -586398 -580482 -569631 -565974 -570820 -584992 -591385 -585351 -584493 -584300 -584289 -587455 -591802 -602627 -600873
9179 -600873 -585922 -571288 -570078 -575284 -573980 -571555 -567150 -574533 -578355 -572693 -571017 -579392 -585096 -585008
9165 -585008 -582877 -584914 -583106 -574924 -574511 -572659 -565373 -561103 -573658 -577033 -558193 -559294 -572561 -571774
9151 -571774 -566986 -569240 -567685 -561992 -566542 -575366 -576583 -578434 -580251 -583611 -585345 -583881 -583879 -586385 -580330
9136 -580330 -574252 -569697 -563048 -568159 -571490 -577004 -576304 -578304 -573880 -567522 -563668 -562604 -565625 -565400 -570765
9121 -570765 -579857 -582668 -572727 -562566 -560102 -561491 -560386 -571232 -581429 -586267 -585731 -580560 -572370 -577832
9107 -577832 -579475 -577163 -573362 -565574 -565685 -564644 -563821 -563192 -560827 -554223 -556877 -560028 -561917 -558986 -554086
9092 -554086 -560236 -560652 -562521 -566774 -569857 -574849 -575023 -566753 -564595 -563453 -563442 -559794 -558365 -559838 -551465
9077 -551465 -555475 -551577 -548799 -546536 -542375 -545741 -556287 -555284 -560526 -557531 -555890 -564131 -564323 -559661
9063 -559661 -568220 -567190 -561426 -558928 -554130 -556396 -565006 -569201 -557846 -560794 -564969 -571416 -573933 -569641
9049 -569641 -563622 -557726 -550040 -551001 -545458 -545256 -549537 -551455 -557535 -556955 -554502 -560382 -565371 -555010 -544584
9034 -544584 -540325 -548662 -558608 -567779 -558613 -561287 -563094 -563615 -559791 -557809 -559194 -557204 -564145 -568136 -563126
9019 -563126 -563239 -561287 -563892 -574466 -571436 -561613 -553600 -548001 -549626 -558147 -560928 -559575 -558398 -561095
9005 -561095 -557313 -547648 -551997 -559634 -552300 -548086 -555708 -557978 -557382 -547258 -544922 -546113 -547316 -544298
8991 -544298 -545307 -543760 -555153 -564923 -562184 -568348 -572001 -563693 -554200 -548238 -554365 -556977 -554059 -542170
8977 -542170 -540280 -549087 -542941 -534761 -537684 -542014 -549477 -545939 -535451 -531052 -528638 -538230 -552722 -558229
8963 -558229 -558440 -551881 -557430 -553561 -555533 -560047 -546464 -537493 -529755 -536509 -545690 -547970 -548105 -544129 -541535
8948 -541535 -537154 -541250 -549228 -549796 -546445 -550248 -557807 -560368 -558217 -561145 -558141 -555529 -552926 -549258 -543956
8933 -543956 -540549 -542077 -546094 -545799 -547975 -550588 -547851 -541162 -539416 -544392 -543582 -534462 -531140 -531712 -535289
8918 -535289 -538644 -546952 -548959 -538606 -538191 -542474 -544659 -535624 -530302 -529392 -523346 -528603 -530227 -529508 -526070
8903 -526070 -536676 -532698 -529920 -532261 -532382 -526390 -527999 -530231 -531532 -526046 -519678 -523665 -530229 -533650
8889 -533650 -531854 -521342 -517797 -522257 -526633 -533284 -535851 -541435 -545241 -546267 -545153 -544483 -537726 -540580
8875 -540580 -534735 -526864 -523957 -524084 -533136 -541506 -541436 -527464 -513767 -516131 -521540 -518507 -517122 -518043 -513334
8860 -513334 -512932 -523116 -532584 -534046 -523499 -509727 -507818 -512825 -529598 -535348 -536272 -532911 -523570 -514569
8846 -514569 -517740 -521871 -521578 -508763 -506082 -504868 -504065 -513075 -538747 -558566 -565246 -560752 -547169 -540634
8832 -540634 -529048 -529235 -540010 -543392 -539133 -534514 -536365 -535543 -535923 -541179 -544482 -543626 -546544 -541676 -546785
8817 -546785 -558619 -551120 -548758 -541332 -539279 -537731 -529878 -527914 -530588 -533434 -541259 -538538 -528820 -526816
8803 -526816 -525748 -530269 -528074 -533745 -533737 -520666 -519186 -525078 -522060 -517855 -528233 -544157 -549393 -547745
8789 -547745 -547368 -546473 -538737 -539972 -530542 -532289 -535729 -533741 -530842 -519923 -522927 -531309 -514648 -510477
8775 -510477 -516271 -528529 -522781 -517179 -520180 -517671 -517192 -510402 -506774 -510896 -508976 -507573 -512554 -515315
8761 -515315 -510202 -510943 -514101 -516703 -512713 -507231 -509793 -514129 -520197 -526972 -525817 -531106 -531747 -534120 -537467
8746 -537467 -539739 -536067 -525601 -520665 -517630 -512063 -510253 -506013 -508869 -519376 -526164 -514657 -500213
8733 -500213 -498185 -506224 -515966 -521665 -520452 -509093 -504031 -508605 -511289 -508288 -511466 -515775 -516351 -511869
8719 -511869 -512324 -509112 -511395 -512129 -516077 -519795 -520200 -507693 -506874 -509282 -507008 -505341 -502832 -496285 -490227
8704 -490227 -487263 -495628 -509037 -505332 -501836 -511953 -520579 -525341 -519257 -510577 -506702 -510966 -514479 -513607
8690 -513607 -501837 -503528 -499990 -503025 -512267 -505589 -513284 -511121 -499969 -503788 -507476 -516170 -518191 -519912
8676 -519912 -520692 -518428 -516564 -514508 -513428 -518085 -525798 -527499 -528727 -525211 -522815 -517192 -514025 -509403 -508424
8661 -508424 -506746 -508582 -504806 -498144 -509293 -510627 -505513 -507471 -510214 -503400 -508210 -512251 -511543 -514701
8647 -514701 -519495 -506478 -498660 -498209 -505460 -507458 -506917 -506143 -496856 -499040 -502548 -500296 -500259 -505001 -505854 -507929
8631 -507929 -499129 -494422 -495605 -491463 -486985 -492295 -494385 -501753 -502992 -497388 -499062 -504255 -502564 -495184
8617 -495184 -492910 -491384 -493900 -490781 -491658 -496303 -494632 -496809 -505433 -508258 -504304 -499366 -488626 -486208
8603 -486208 -502403 -507217 -510111 -505291 -495332 -493556 -495685 -491179 -484748 -485982 -485268 -487500 -489864 -488681
8589 -488681 -479343 -485546 -491396 -483055 -486362 -495804 -498982 -495195 -488737 -489382 -498812 -501453 -498040 -499778 -498669
8574 -498669 -497573 -503585 -499873 -497820 -488778 -489893 -485184 -489205 -490327 -489859 -489365 -496973 -509094 -514666 -508596
8559 -508596 -509026 -495430 -485303 -484047 -485574 -481532 -477836 -477358 -477040 -480255 -484488 -483602 -482004 -479126 -480926
8544 -480926 -477680 -482275 -477647 -476478 -475248 -477071 -478537 -480271 -474530 -474277 -477681 -487009 -487845 -480395 -477298
8529 -477298 -475823 -471489 -474822 -481589 -479108 -478831 -485915 -485103 -485375 -488269 -487499 -486381 -493631 -493960 -498645 -492626
8513 -492626 -478659 -479436 -476463 -479451 -482506 -484859 -485896 -486115 -487292 -494204 -496992 -498877 -503208 -505013 -498374
8498 -498374 -489977 -474452 -472089 -470405 -475224 -476160 -478955 -479721 -479795 -476128 -486826 -484771 -491010 -489463 -487390
8483 -487390 -490903 -495248 -485007 -477588 -477748 -480565 -478329 -481970 -476158 -477632 -483204 -483773 -475879 -475849 -471457
8468 -471457 -472138 -480757 -471951 -463308 -460045 -458288 -460921 -461122 -468342 -472464 -474728 -470441 -467067 -470885 -465613
8453 -465613 -462083 -456945 -455428 -460061 -467923 -471638 -470281 -464800 -459571 -450735 -457095 -460162 -457608 -460672
8439 -460672 -464984 -460852 -458416 -453926 -461844 -472464 -472919 -471363 -465989 -456586 -458290 -461314 -468063 -474296
8425 -474296 -471013 -460277 -454941 -455989 -464491 -466538 -467413 -473711 -478814 -476975 -492109 -493187 -487399 -480939
8411 -480939 -475766 -475857 -478439 -476286 -482970 -487929 -478177 -465751 -465491 -469382 -467067 -473612 -475677 -470718 -467510
8396 -467510 -473069 -467375 -458732 -460939 -468453 -471154 -465256 -469494 -469706 -470256 -471685 -466830 -454435 -451270 -449341
8381 -449341 -451230 -452957 -446249 -446675 -452791 -465231 -466341 -459751 -453022 -454500 -456542 -459196 -450338 -446686
8367 -446686 -448397 -451904 -443354 -447093 -448549 -454290 -453902 -447088 -451412 -447804 -441399 -446223 -449034 -451846 -448171
8352 -448171 -445733 -442099 -435505 -435883 -436106 -427506 -435112 -439267 -439588 -441574 -449206 -439255 -432380 -426581 -429137
8337 -429137 -416230 -412906 -413074 -425344 -438017 -443585 -438085 -431011 -425540 -426397 -424060 -407778 -392759 -372870
8323 -372870 -359393 -346562 -356835 -419846 -495771 -538223 -549795 -537391 -531802 -530353 -528684 -513564
8311 -513564 -493843 -491607 -491708 -488047 -490584 -481630 -469704 -464867 -455099 -452047 -465237 -466255 -460856 -460007
8297 -460007 -446823 -437975 -428957 -428427 -429105 -423652 -421552 -424078 -420604 -409738 -408332 -401517 -384558 -377280
8283 -377280 -373424 -353657 -338929 -313844 -286699 -255665 -264505 -362789 -502603 -620192 -670604 -663839
8271 -663839 -630640 -607138 -601982 -597079 -587546 -570044 -555270 -545177 -535491 -520298 -511408 -522155 -528344
8258 -528344 -520748 -512360 -510724 -514003 -513449 -512316 -511773 -505617 -501775 -495652 -488261 -486172 -482574 -480104 -479592
8243 -479592 -480397 -482935 -476066 -466273 -450223 -437227 -423815 -402532 -390397 -382849 -378511 -415952 -485981
8230 -485981 -549863 -593388 -600138 -586573 -573812 -552590 -546890 -544671 -531905 -528174 -523742 -515822 -508928
8217 -508928 -515219 -510424 -513495 -516055 -506995 -512022 -506976 -505918 -511177 -505706 -497308 -494644 -497113 -497428 -498927
8202 -498927 -503890 -503254 -504545 -506679 -501769 -502367 -496706 -491173 -489885 -490804 -488782 -493208 -497927 -505107 -504174
8187 -504174 -492564 -487436 -498994 -501034 -495778 -495997 -495054 -494779 -495763 -485928 -474309 -479544 -481176 -485870 -479921
8172 -479921 -477276 -488853 -491662 -489153 -481538 -486412 -486684 -486792 -486380 -487213 -477988 -476970 -477309 -479548 -482456
8157 -482456 -484242 -487776 -490738 -487990 -486619 -487151 -486698 -482363 -480794 -483438 -486967 -493383 -494853 -487971 -483305
8142 -483305 -475343 -469520 -466413 -467342 -464949 -468563 -466617 -470740 -477508 -480834 -484091 -479611 -474733 -474412 -473284
8127 -473284 -466567 -473599 -482183 -484619 -475371 -470849 -466738 -453451 -454479 -464890 -464592 -460282 -462743 -465265
8113 -465265 -469359 -476035 -474523 -478099 -475213 -469472 -471253 -475566 -470569 -462304 -469455 -472364 -475632 -474165
8099 -474165 -476940 -480477 -489425 -482944 -479839 -467567 -471777 -474023 -475330 -475717 -468028 -465072 -459200 -456830
8085 -456830 -454306 -454491 -457153 -456087 -460298 -462410 -458078 -456798 -453356 -453541 -454349 -458426 -461130 -452415 -455993
8070 -455993 -460633 -460932 -466146 -463806 -459994 -462680 -472768 -469872 -467225 -456635 -461089 -460629 -459247 -457476
8056 -457476 -458787 -460822 -460196 -454463 -456822 -465430 -464096 -460116 -462668 -462109 -461783 -458724 -463248 -465763 -454423
8041 -454423 -456519 -465234 -463077 -457428 -458600 -468472 -471135 -466772 -458854 -450967 -441152 -443802 -449770 -458327
8027 -458327 -461239 -464027 -462223 -452204 -452607 -453563 -446152 -448302 -463847 -476227 -473753 -465288 -462864 -457752
8013 -457752 -457141 -456742 -456299 -451937 -457252 -461114 -461512 -460704 -455208 -448630 -442558 -437610 -445643 -446707 -437496 -433720
7997 -433720 -441341 -445786 -450888 -444855 -448099 -461094 -457070 -451239 -454950 -459259 -466927 -467937 -466563 -459862
7983 -459862 -452780 -453825 -458819 -457497 -451560 -458894 -455976 -457872 -459037 -453231 -445091 -446087 -452379 -453310 -449864
7968 -449864 -455821 -454353 -453458 -452342 -448487 -449068 -451247 -456936 -455112 -450364 -453512 -444986 -443429 -454952 -464449
7953 -464449 -462250 -454125 -458443 -455825 -453091 -445648 -448519 -461353 -466943 -459996 -454625 -452894 -456300 -452310
7939 -452310 -441964 -438981 -436305 -443405 -450712 -451650 -447439 -442026 -436113 -437559 -435784 -427582 -423289 -425366
7925 -425366 -432448 -432883 -436357 -449386 -451945 -441699 -427557 -428329 -432030 -427271 -428488 -435193 -437686 -447612
7911 -447612 -449599 -443398 -443293 -447188 -449234 -451800 -454541 -450577 -446691 -445209 -448987 -454324 -454448 -449962 -451932
7896 -451932 -450791 -447129 -442777 -444555 -452649 -457289 -453340 -453538 -458410 -459148 -457715 -449601 -452608 -452075 -445864
7881 -445864 -444913 -445272 -451138 -452191 -453922 -458814 -458885 -454809 -446091 -447267 -440005 -431837 -438762 -449345 -450206
7866 -450206 -448675 -449258 -448393 -440035 -441799 -440463 -434740 -433411 -435298 -430884 -429591 -430711 -429040 -435860 -445459
7851 -445459 -447088 -446347 -449675 -444999 -436694 -444410 -452089 -448861 -438226 -442437 -452833 -452917 -453943 -451089 -452721
7836 -452721 -454089 -442789 -434492 -441950 -448261 -448303 -445767 -433420 -429190 -429471 -432189 -431959 -429316 -433519 -441323
7821 -441323 -442343 -435253 -434998 -433036 -427908 -431127 -435831 -434077 -435712 -430115 -434807 -439452 -439820 -444595 -440119
7806 -440119 -434349 -425059 -425465 -438487 -439974 -441640 -443820 -439961 -436199 -441025 -451521 -451866 -444918 -437530
7792 -437530 -435881 -438455 -445296 -443028 -432436 -427468 -434939 -434079 -436200 -432612 -427811 -427062 -432245 -433473 -423008
7777 -423008 -424510 -426505 -424958 -430542 -428840 -427025 -433886 -441399 -445551 -439061 -437785 -442409 -444724 -445888
7763 -445888 -433194 -431681 -425652 -428090 -423854 -424482 -426096 -423986 -427318 -428249 -424022 -425788 -431323 -436929 -439230
7748 -439230 -440170 -448411 -441683 -437069 -441575 -438303 -443520 -453330 -452081 -449148 -436110 -432925 -440396 -437985
7734 -437985 -426004 -425386 -439356 -444830 -446880 -435040 -430225 -428949 -424080 -427047 -430203 -428128 -428891 -433457
7720 -433457 -441786 -439464 -431258 -423828 -423066 -422822 -421542 -421888 -421297 -423444 -421232 -421804 -424020 -425420 -429790 -427285
7704 -427285 -421769 -417138 -409247 -411413 -405894 -403435 -414694 -419274 -423348 -414768 -414337 -418279 -416859 -420137
7690 -420137 -425444 -422108 -427472 -429399 -433389 -441157 -432635 -429823 -423410 -414571 -415415 -415792 -413228 -414106 -424090
7675 -424090 -427875 -433397 -431346 -420307 -417869 -419502 -424571 -417314 -421951 -421719 -422866 -423690 -428353 -425724 -416152
7660 -416152 -410488 -419588 -421500 -417982 -420748 -428039 -437031 -439224 -434355 -433613 -433698 -421504 -415827 -420626 -421872
7645 -421872 -415359 -416222 -418956 -411628 -407490 -409643 -414024 -415354 -417161 -426851 -424478 -419948 -424360 -421662 -409653
7630 -409653 -406606 -400146 -393528 -404046 -410107 -414556 -409320 -403113 -410542 -414075 -418964 -419578 -434348 -444201
7616 -444201 -442434 -438364 -419350 -415556 -416392 -410804 -411668 -414390 -413970 -422737 -426739 -419726 -411986 -413983 -411506
7601 -411506 -403187 -408385 -410753 -418516 -418702 -409551 -408052 -414374 -418667 -423156 -420575 -411493 -414042 -415643 -414073
7586 -414073 -409738 -414157 -414522 -413968 -408700 -408861 -411712 -413091 -409858 -414097 -422704 -419598 -412799 -414066 -411370
7571 -411370 -408104 -410728 -412713 -408616 -407952 -415260 -424416 -426859 -429288 -425569 -414861 -406805 -403369 -399631
7557 -399631 -397632 -400180 -399097 -405791 -405661 -401309 -409538 -405474 -389556 -391918 -390126 -402460 -414469 -409831
7543 -409831 -411122 -414024 -411823 -408175 -410448 -420693 -423815 -419912 -415830 -421210 -413213 -416328 -415703 -414111
7529 -414111 -417533 -421957 -424667 -413582 -407025 -409908 -416907 -424455 -418745 -403598 -398092 -408558 -413875 -415193
7515 -415193 -422059 -418331 -408590 -409843 -423823 -434799 -430380 -425824 -428208 -425611 -425656 -416525 -416969 -418006 -415264
7500 -415264 -418010 -417013 -413736 -415942 -410615 -410117 -414393 -416110 -419503 -421463 -423552 -421003 -418758 -408733 -410465
7485 -410465 -410765 -416122 -419518 -424678 -421589 -411324 -405710 -396911 -398443 -401766 -403787 -405809 -407278 -408418
7471 -408418 -404177 -399653 -395585 -406191 -420464 -420877 -408687 -403130 -404771 -414547 -406391 -400797 -399448 -401884
7457 -401884 -402854 -403490 -399749 -389765 -392746 -399610 -407656 -413560 -410814 -406691 -402371 -412010 -413128 -413864 -414041
7442 -414041 -408583 -412617 -404991 -404198 -403272 -398935 -401284 -408333 -406962 -402038 -394316 -392324 -393978 -395454 -401769
7427 -401769 -406534 -408188 -412115 -415569 -420187 -418474 -415898 -417018 -416387 -409479 -408094 -406651 -412744 -416221 -402342
7412 -402342 -398063 -399586 -400344 -409710 -411954 -410114 -406380 -400364 -400075 -399616 -403246 -400800 -398107 -404851 -410658
7397 -410658 -402460 -407202 -415437 -418102 -411752 -404649 -399015 -404261 -409728 -401029 -385661 -393533 -399679 -394877
7383 -394877 -399493 -394112 -393376 -394887 -390972 -396353 -395918 -393586 -396169 -402935 -395111 -407041 -404904 -398821 -391957
7368 -391957 -395484 -395741 -389750 -391489 -398253 -400976 -402447 -391771 -393057 -388802 -391315 -394673 -394747 -400524 -399330
7353 -399330 -399643 -392215 -392375 -397139 -404014 -405564 -407276 -404366 -402207 -408322 -402005 -397395 -402541 -405471 -400284
7338 -400284 -400441 -398826 -394112 -397627 -401154 -400356 -397802 -395561 -401734 -400854 -391212 -390938 -392078 -402122 -408513
7323 -408513 -414774 -412095 -399524 -396672 -402472 -404623 -409672 -402058 -396958 -404072 -408183 -405295 -391050 -391578
7309 -391578 -391093 -398504 -395393 -387796 -391885 -394557 -393850 -383254 -379593 -380867 -392564 -392315 -391158 -393182 -394503
7294 -394503 -385534 -379349 -383905 -394541 -396563 -396828 -396070 -392214 -392305 -386188 -388579 -401340 -401690 -403084 -405932
7279 -405932 -396966 -390033 -390288 -397516 -392547 -386803 -386403 -385178 -378451 -375067 -382190 -387609 -384489 -384136 -400068
7264 -400068 -410445 -407264 -400798 -391342 -388681 -393404 -401782 -399199 -388276 -387520 -385821 -385688 -382975 -385410
7250 -385410 -394449 -397303 -395541 -392607 -394306 -395016 -401999 -405369 -399235 -388185 -391282 -402190 -399449 -394555
7236 -394555 -388013 -381495 -384986 -394604 -391257 -394721 -397544 -387797 -383479 -381779 -392491 -388901 -393775 -398226
7222 -398226 -384359 -384253 -382522 -378508 -382267 -385192 -394734 -404428 -397714 -391011 -386884 -401805 -397435 -389542
7208 -389542 -392228 -396593 -403205 -413299 -402514 -397186 -396697 -395411 -389491 -393078 -390133 -390742 -400304 -397655
7194 -397655 -398596 -392607 -394177 -393579 -398758 -400750 -395875 -394673 -391726 -392623 -385418 -380959 -369697 -365791 -380043
7179 -380043 -384264 -382740 -394728 -393833 -393661 -394220 -398677 -401513 -402424 -402710 -401241 -391223 -393307 -401050 -400048
7164 -400048 -398603 -395573 -393002 -385005 -387649 -391325 -391122 -395064 -391349 -382557 -381584 -390269 -388036 -390600 -397793
7149 -397793 -399710 -398523 -409661 -401748 -389969 -393642 -385925 -387802 -380852 -382928 -381454 -383768 -389788 -391776
7135 -391776 -397374 -397567 -396553 -396144 -396729 -388237 -388621 -392484 -389854 -394313 -399060 -388788 -392652 -394812 -388293
7120 -388293 -379234 -376288 -380376 -378555 -380005 -375176 -379806 -374240 -372870 -383683 -386220 -384024 -386075 -376527
7106 -376527 -384882 -389391 -387211 -385673 -384862 -377308 -374374 -378968 -384587 -376481 -376644 -378288 -375127 -378763 -389612
7091 -389612 -395590 -395838 -398603 -400917 -398318 -381976 -369371 -374786 -375336 -377096 -388415 -391696 -393198 -391715
7077 -391715 -386603 -385410 -391169 -394917 -391297 -383264 -395162 -393797 -388209 -382058 -381327 -385826 -390862 -395748
7063 -395748 -396422 -394950 -394221 -386704 -366908 -368417 -373686 -375927 -380220 -383397 -389697 -383891 -382047 -383633 -384652
7048 -384652 -384604 -383931 -382551 -378908 -372712 -369729 -369485 -382278 -384042 -379248 -376452 -374964 -377884 -386472 -385504
7033 -385504 -379741 -370030 -366794 -358092 -362921 -375858 -377175 -376721 -376962 -377888 -376392 -372065 -381622 -385885 -373451
7018 -373451 -373492 -375455 -379350 -382361 -382496 -381907 -378736 -381990 -386410 -382752 -379601 -381155 -380010 -380330 -383086 -372948
7002 -372948 -372990 -371550 -369852 -379031 -379578 -377189 -374776 -373891 -371175 -364251 -365761 -368167 -363939 -363456 -365520 -368121
6986 -368121 -381015 -390774 -396057 -389383 -379975 -379854 -384657 -384029 -381738 -384865 -383861 -389306 -392187 -385639 -382759
6971 -382759 -383643 -382248 -380332 -374253 -370388 -377209 -382061 -385411 -389669 -384595 -389967 -393481 -384521 -373001
6957 -373001 -367528 -364397 -374221 -369227 -371522 -372014 -372894 -375111 -372948 -372665 -380822 -387982 -385749 -388043 -391389
6942 -391389 -378819 -374761 -375405 -381746 -378004 -371102 -374423 -375136 -383192 -386733 -386354 -386338 -384641 -374888 -367511
6927 -367511 -371901 -376571 -376492 -374332 -373378 -373136 -370155 -368374 -366923 -366078 -359768 -361070 -369705 -369254 -370038 -371092
6911 -371092 -377131 -381236 -379693 -375554 -372686 -368501 -365710 -369493 -378314 -382780 -381783 -373205 -368773 -371148 -371109
6896 -371109 -366023 -368521 -366775 -374779 -377264 -376084 -376696 -376553 -369709 -367579 -365320 -363679 -369417 -377027 -373756
6881 -373756 -373344 -376979 -377614 -373346 -369441 -373479 -375565 -371078 -371199 -371099 -363098 -366807 -370904 -370955 -367949 -375228
6865 -375228 -381542 -378095 -374411 -376348 -382572 -383935 -374838 -369821 -356496 -355976 -363472 -370726 -380761 -379478
6851 -379478 -375001 -376211 -379331 -380582 -374500 -367019 -362367 -369112 -368787 -367804 -368766 -360935 -372600 -370831 -370182
6836 -370182 -375032 -377187 -386119 -387534 -371699 -363334 -366280 -372262 -375381 -374440 -375685 -378487 -377877 -369036 -367662
6821 -367662 -369242 -371865 -368812 -363255 -363915 -365094 -376928 -370326 -371891 -377490 -372037 -370306 -372175 -377199
6807 -377199 -388246 -387961 -384047 -381483 -371788 -370627 -372185 -371949 -368787 -367456 -368289 -367121 -367302 -369415 -366758
6792 -366758 -366140 -362483 -363983 -378022 -380452 -376224 -372190 -375361 -370752 -369425 -372064 -376972 -376481 -375669 -374266
6777 -374266 -374457 -370256 -372261 -378489 -373677 -363267 -357838 -355912 -369177 -368089 -363188 -364816 -355549 -352370
6763 -352370 -360486 -363177 -364608 -369321 -377329 -381324 -376251 -376291 -372226 -365197 -363107 -367530 -376861 -367072 -361654
6748 -361654 -360027 -357839 -364936 -368380 -372307 -374627 -369823 -368157 -369184 -363307 -364538 -358637 -349179 -351073
6734 -351073 -355354 -354198 -361130 -373098 -371574 -365464 -361884 -362661 -366006 -365359 -364651 -359701 -358044 -357595 -369111
6719 -369111 -373113 -371643 -371879 -367726 -364120 -359252 -347668 -343122 -344931 -358718 -371529 -382658 -378757 -381156
6705 -381156 -377365 -369806 -370503 -363959 -367962 -364267 -365846 -378817 -384014 -379233 -383658 -384774 -374032 -366754
6691 -366754 -364981 -363026 -359763 -359304 -364732 -372677 -368284 -358795 -362136 -370358 -366600 -368346 -370212 -365539 -363783
6676 -363783 -360286 -360083 -366068 -374570 -380811 -377582 -373294 -370975 -380428 -379019 -382262 -378753 -371045 -369444 -373611
6661 -373611 -372213 -376218 -374309 -373479 -370220 -355497 -345908 -349970 -355121 -361450 -361818 -354450 -354005 -349474 -344196
6646 -344196 -345961 -358377 -357616 -348357 -347031 -357090 -356451 -343174 -344615 -353327 -360086 -364975 -364285 -361294
6632 -361294 -360431 -360708 -364189 -367034 -363997 -351868 -344116 -345591 -352055 -355797 -348904 -348255 -349212 -341739 -345249
6617 -345249 -355021 -360032 -356964 -351569 -362774 -376793 -388462 -381934 -370591 -370992 -367448 -363872 -354664 -357631
6603 -357631 -365663 -371458 -369593 -374758 -369254 -353177 -345356 -340202 -342669 -343440 -355617 -356530 -352364 -353646
6589 -353646 -349968 -347622 -351045 -349286 -354156 -354804 -353435 -348191 -345467 -344115 -349665 -347783 -355745 -368471
6575 -368471 -372951 -377142 -362963 -358965 -362435 -359241 -349715 -345646 -346246 -346853 -342701 -346998 -353205 -353362 -359916
6560 -359916 -359676 -367317 -355462 -358352 -362173 -363289 -351583 -356654 -354734 -347157 -344355 -344280 -351407 -352966 -355846
6545 -355846 -361335 -367570 -368034 -366226 -359038 -364750 -362282 -359724 -358409 -359735 -361581 -350225 -345822 -350100
6531 -350100 -359787 -358263 -349648 -349106 -344604 -336179 -335261 -342198 -349058 -350568 -350746 -350936 -347841 -342562 -348298
6516 -348298 -353252 -354720 -354310 -355838 -352491 -355948 -343967 -345286 -350116 -355406 -354463 -353989 -353839 -358219 -360868
6501 -360868 -352136 -351284 -359880 -361939 -351477 -348537 -359170 -356424 -353386 -350622 -356849 -366630 -374049 -369209
6487 -369209 -367552 -361318 -363967 -362114 -361454 -369860 -359614 -359273 -361460 -355429 -350835 -360360 -357225 -349108 -350010
6472 -350010 -356017 -356696 -355643 -364128 -365752 -350483 -337769 -335519 -337996 -333640 -335335 -340963 -343003 -352014
6458 -352014 -343710 -343011 -341427 -342999 -347845 -357513 -349665 -345911 -351412 -350262 -355412 -358169 -346166 -343512
6444 -343512 -349492 -354371 -352665 -354767 -351053 -354075 -357848 -354866 -356161 -358025 -361719 -361511 -357858 -357491 -357334
6429 -357334 -361692 -359006 -357546 -358567 -357006 -358610 -354116 -353796 -356197 -351354 -354170 -364174 -367433 -358853
6415 -358853 -347620 -348024 -350573 -353592 -359858 -352471 -346795 -348025 -351387 -349014 -344104 -343684 -350982 -344710 -348434
6400 -348434 -352832 -348797 -350949 -358777 -358986 -357779 -353671 -356716 -358310 -352600 -341440 -336916 -341236 -348420
6386 -348420 -340972 -332154 -335089 -348778 -350626 -348104 -346047 -351138 -350244 -340031 -339957 -347910 -357681 -356273 -353659
6371 -353659 -352232 -341831 -339481 -340669 -344116 -343798 -352543 -353521 -351345 -346243 -342520 -338648 -336357 -338517 -342765
6356 -342765 -347028 -352987 -360946 -355441 -349307 -356102 -357857 -360607 -355732 -348805 -350340 -352101 -342602 -344364
6342 -344364 -351127 -343834 -337002 -329520 -334372 -336254 -345762 -354049 -351655 -354278 -362099 -358320 -337530 -331207
6328 -331207 -340334 -347910 -349078 -348189 -340215 -339208 -340916 -343005 -347432 -342800 -337537 -344040 -344406 -341987 -340023
6313 -340023 -343560 -338430 -349270 -364603 -362844 -352667 -346646 -348840 -344802 -344730 -346087 -345319 -344799 -342738 -340731
6298 -340731 -339035 -344149 -345458 -348892 -351483 -351375 -347816 -339671 -335612 -337088 -335768 -330477 -335320 -333543 -331478
6283 -331478 -326475 -337273 -342740 -337427 -335444 -339557 -343586 -342168 -350815 -349027 -346948 -343742 -346462 -344911
6269 -344911 -337624 -333383 -335445 -346594 -351698 -355056 -354564 -343905 -336882 -331225 -334732 -346971 -349503 -352279
6255 -352279 -348644 -345005 -338950 -338669 -344539 -343242 -322180 -318906 -324204 -332619 -341725 -350708 -347960 -336949
6241 -336949 -329041 -328632 -333201 -332279 -333696 -346474 -356449 -357171 -349130 -341082 -337005 -334940 -339014 -339310 -344782
6226 -344782 -340207 -329509 -330693 -339998 -341643 -346393 -349162 -339193 -335262 -343061 -357137 -355500 -350361 -347744
6212 -347744 -339994 -337369 -338652 -337427 -334468 -331030 -342982 -339734 -341489 -354774 -347933 -342311 -338176 -345150
6198 -345150 -347319 -351223 -344867 -349092 -352714 -358635 -353354 -343627 -338971 -340444 -342900 -346977 -351229 -352924
6184 -352924 -350702 -354978 -350956 -352929 -349153 -344158 -340389 -333874 -334541 -338693 -345522 -348536 -344158 -341831 -337512
6169 -337512 -340714 -343859 -334962 -327987 -326503 -336127 -350728 -343462 -327392 -323777 -322695 -323890 -318516 -319740
6155 -319740 -328177 -327149 -327913 -332553 -331295 -326178 -326210 -325661 -326944 -339587 -352222 -352957 -338550 -333293 -331181
6140 -331181 -328630 -337240 -339913 -342493 -344347 -343816 -334985 -333608 -326997 -314501 -311607 -308493 -319273 -331169
6126 -331169 -325270 -320618 -322743 -333188 -341991 -348901 -344043 -341667 -335177 -333850 -337275 -330509 -330239 -338452
6112 -338452 -338091 -335338 -340491 -343585 -327768 -318549 -320815 -327050 -336101 -335944 -331513 -335884 -340419 -340466 -331433
6097 -331433 -335958 -334167 -329614 -335098 -335044 -341041 -347410 -346297 -333881 -334680 -339615 -327323 -328580 -344355
6083 -344355 -347956 -332906 -331699 -338415 -350247 -346208 -339755 -335728 -333980 -328849 -322060 -327795 -336305 -342020
6069 -342020 -340265 -337637 -336516 -333328 -326268 -317857 -317465 -330841 -344812 -352099 -337610 -327259 -329720 -339275
6055 -339275 -334706 -326869 -324957 -333094 -332770 -334540 -339655 -348359 -350354 -340873 -334380 -331207 -332074 -336944 -337563
6040 -337563 -338458 -324973 -321417 -326152 -333054 -336431 -336379 -338784 -336226 -327331 -324119 -319195 -321907 -329883 -332030
6025 -332030 -330367 -329732 -331814 -344392 -344921 -343385 -338208 -339291 -337520 -334773 -330006 -319297 -308911 -311028
6011 -311028 -325951 -329469 -325450 -318070 -318409 -326836 -322764 -322248 -326340 -333869 -335503 -339336 -336667 -324804
5997 -324804 -330927 -340438 -347078 -340952 -340101 -335490 -328129 -329082 -329150 -326616 -325431 -325084 -320427 -330010 -338735 -336994
5981 -336994 -326860 -335198 -340159 -336993 -323078 -326457 -328264 -321252 -321670 -324852 -325770 -331969 -331204 -332064 -329510
5966 -329510 -326494 -321035 -323371 -336596 -337833 -328293 -318069 -323838 -323533 -324867 -324295 -330036 -328981 -321703
5952 -321703 -324476 -325218 -327632 -332804 -334285 -336538 -340562 -330166 -318381 -328714 -325747 -316460 -306527 -307639
5938 -307639 -309630 -314199 -317909 -329044 -325005 -324522 -320362 -327516 -330727 -328537 -334990 -339102 -342743 -350012
5924 -350012 -346997 -337036 -333221 -338052 -334559 -338832 -336079 -331859 -341531 -349079 -337697 -325880 -319675 -322100
5910 -322100 -324588 -328903 -329224 -320220 -324184 -327364 -321612 -316075 -315821 -320438 -320937 -330947 -334079 -331301 -334230
5895 -334230 -336551 -337343 -322213 -324882 -331880 -341442 -342341 -332904 -332736 -331066 -327912 -328801 -336406 -343563 -347296
5880 -347296 -344917 -334884 -322473 -314721 -310523 -312372 -322542 -324173 -321823 -321087 -330929 -333252 -325523 -324526
5866 -324526 -321871 -318277 -326002 -330825 -322661 -330459 -327958 -318235 -318565 -327660 -336565 -337817 -339203 -332821 -326907
5851 -326907 -317696 -312217 -321548 -331844 -327790 -326394 -332690 -335838 -338942 -332549 -328693 -330691 -332263 -326370
5837 -326370 -332619 -321810 -317512 -319706 -317470 -311520 -306322 -302793 -306467 -321534 -326544 -324332 -322137 -320612
5823 -320612 -316932 -324545 -335600 -347460 -345026 -340083 -331465 -317249 -312345 -323953 -329826 -329201 -324846 -323935
5809 -323935 -330340 -328587 -321414 -312237 -314962 -325858 -327239 -324571 -325742 -323654 -321332 -328245 -325300 -322143
5795 -322143 -322264 -325698 -323349 -322264 -315756 -309822 -307074 -316418 -325706 -319984 -323473 -320486 -321935 -331967
5781 -331967 -320523 -313028 -317754 -316624 -317813 -317108 -311637 -307591 -303288 -300381 -309230 -313426 -310135 -314293
5767 -314293 -311220 -317614 -324486 -327611 -325365 -318708 -316184 -321609 -333302 -329682 -314795 -313180 -323184 -320005
5753 -320005 -323959 -328091 -334932 -332269 -322843 -322208 -321475 -318750 -319622 -319652 -318594 -317461 -323211 -326311 -323597 -318487
5737 -318487 -317052 -313836 -313407 -317861 -316349 -313261 -316036 -326088 -329621 -328006 -321243 -308233 -299426 -299032
5723 -299032 -305160 -306264 -308510 -314944 -322928 -324607 -322992 -323105 -315114 -315406 -319999 -323599 -314485 -307092 -307503
5708 -307503 -304792 -310541 -317346 -318269 -326947 -327000 -322292 -315164 -310762 -315497 -310000 -306634 -306086 -314973 -321842
5693 -321842 -319763 -310553 -312799 -312566 -317080 -315853 -311738 -312406 -319341 -325473 -331842 -326166 -320978 -316293 -324541
5678 -324541 -329082 -326623 -327229 -318861 -314587 -317522 -321295 -321052 -333543 -334383 -328935 -323303 -327241 -332107 -327106
5663 -327106 -327380 -322403 -318005 -322459 -330934 -324383 -320828 -314622 -311226 -318772 -319318 -318623 -317276 -317867 -317184 -319590
5647 -319590 -312871 -308195 -304894 -304534 -317843 -328909 -327959 -321543 -315326 -313847 -314506 -321969 -327131 -325684 -316698
5632 -316698 -322651 -331831 -326725 -323098 -315337 -309658 -323043 -330263 -326223 -321532 -317823 -309176 -302747 -304963
5618 -304963 -302240 -306000 -310061 -305442 -300810 -298400 -292770 -293313 -299466 -300240 -302064 -309877 -310866 -315825 -315419
5603 -315419 -307678 -309452 -315228 -311783 -307705 -305191 -315092 -311772 -302139 -303248 -314083 -322667 -326001 -329403
5589 -329403 -332601 -321216 -319707 -323811 -312359 -306884 -311868 -316864 -313407 -308011 -303051 -312644 -313189 -304601
5575 -304601 -312588 -328487 -319442 -306212 -310169 -304655 -297606 -296502 -303468 -305977 -304690 -308739 -316180 -318350
5561 -318350 -310817 -311374 -316560 -314359 -305582 -298233 -293603 -293773 -305200 -307590 -306692 -305311 -301934 -306778 -318625
5546 -318625 -324158 -324236 -313292 -314124 -311748 -314907 -308289 -309200 -322264 -321998 -316689 -317230 -314860 -314541 -317818 -317876
5530 -317876 -316798 -320758 -315603 -313488 -316217 -319336 -312528 -309146 -301090 -291944 -303227 -307051 -304493 -313426
5516 -313426 -322325 -323352 -315822 -309599 -305126 -306776 -308595 -320462 -322471 -325729 -325602 -319296 -324342 -328223
5502 -328223 -331155 -328064 -314269 -308541 -311369 -309870 -308795 -306512 -305562 -315930 -317581 -319978 -327708 -319464
5488 -319464 -317105 -322278 -325199 -320587 -312448 -313831 -325145 -328507 -314456 -308735 -303183 -304528 -306157 -307019
5474 -307019 -310227 -312765 -308366 -296759 -299128 -301912 -301520 -310671 -312835 -311551 -306667 -305183 -308350 -306877
5460 -306877 -308701 -308265 -315965 -329874 -335663 -324915 -315629 -319084 -324858 -317530 -313794 -319076 -321728 -311170
5446 -311170 -309792 -309459 -305735 -305407 -304953 -308481 -310118 -307551 -308285 -312155 -308317 -304564 -299474 -294359 -294892 -292318
5430 -292318 -292020 -303732 -307661 -315873 -318624 -319783 -310756 -305999 -307813 -307980 -304358 -300967 -289801 -292571
5416 -292571 -302724 -304336 -295969 -291268 -289853 -292979 -305864 -310814 -308691 -313903 -314977 -313407 -309246 -310668
5402 -310668 -307211 -310364 -313425 -313997 -313225 -311326 -308616 -312809 -312439 -302922 -306424 -314103 -314829 -304416 -300889
5387 -300889 -302273 -299613 -295041 -294325 -298597 -303402 -306362 -312785 -310765 -301558 -305020 -304678 -305251 -305583 -300954
5372 -300954 -294991 -300765 -308851 -305963 -305947 -305594 -306731 -317738 -318547 -321754 -321372 -319057 -315912 -310840 -315021
5357 -315021 -313669 -301739 -298695 -300351 -306807 -308963 -312219 -307177 -314759 -325759 -310022 -301685 -300605 -305765
5343 -305765 -311860 -306833 -305427 -311103 -309859 -316328 -314622 -305141 -301041 -302633 -301126 -303087 -314850 -325435
5329 -325435 -318514 -306036 -301795 -300605 -298267 -298885 -303676 -302821 -304910 -305154 -301468 -294731 -289186 -286514 -292650
5314 -292650 -293794 -296805 -291880 -289499 -292179 -296570 -287371 -287097 -286552 -295311 -301607 -305065 -304147 -302909 -306842
5299 -306842 -306607 -311571 -312383 -303190 -303595 -309491 -307511 -302703 -302911 -294682 -289911 -287712 -286592 -290607 -292866
5284 -292866 -296035 -298877 -301874 -308058 -312018 -307029 -304120 -296533 -292160 -284411 -292056 -306511 -305802 -303014
5270 -303014 -302505 -307834 -312887 -310211 -311921 -320079 -312079 -315876 -311856 -307992 -307595 -314392 -307205 -315613 -321928
5255 -321928 -306645 -302636 -310518 -313012 -307759 -301954 -302124 -301132 -302051 -295929 -293928 -303561 -305602 -312847 -309959
5240 -309959 -303634 -301655 -308733 -312650 -308351 -296666 -286080 -280047 -290874 -297629 -301356 -306758 -312779 -312869
5226 -312869 -310235 -310586 -305166 -298116 -292752 -293026 -295074 -285368 -282305 -291745 -303087 -301744 -294644 -297228 -300256
5211 -300256 -298829 -296360 -297756 -300302 -303599 -312139 -310995 -301292 -295707 -296562 -300241 -303745 -302571 -304806 -311629
5196 -311629 -319043 -317736 -315975 -313010 -303926 -297018 -294185 -290655 -292365 -301961 -311830 -318714 -319463 -311329 -310461
5181 -310461 -317014 -313616 -306861 -307456 -308635 -308142 -307547 -312317 -312003 -301882 -290083 -294406 -290431 -288906 -292681
5166 -292681 -290963 -290934 -287899 -292058 -296254 -298362 -303984 -299062 -295700 -298680 -303713 -294649 -296562 -303855 -311386
5151 -311386 -309828 -308082 -309782 -309628 -305598 -306340 -305632 -313778 -309571 -300591 -305839 -308725 -304756 -302979 -315003
5136 -315003 -317233 -302920 -294261 -287716 -292913 -304945 -303338 -293430 -298128 -301232 -304095 -301163 -304285 -298370
5122 -298370 -297509 -304458 -306571 -308810 -302794 -301118 -310321 -320391 -314176 -303801 -294343 -288882 -288811 -293554 -295267
5107 -295267 -297591 -303154 -300009 -299892 -307526 -308870 -310068 -308130 -295126 -301912 -299734 -299017 -291198 -293906 -296553
5092 -296553 -299614 -306470 -303270 -302918 -299455 -295594 -296331 -296907 -303723 -307929 -307677 -312381 -308770 -298938 -294466
5077 -294466 -298491 -302413 -300008 -300881 -308359 -301691 -296570 -296307 -294943 -290428 -292884 -298934 -293023 -301649 -306905
5062 -306905 -301228 -294816 -296265 -302868 -312390 -315421 -307066 -289343 -293131 -300587 -304740 -308612 -312916 -314766
5048 -314766 -307121 -296258 -297163 -299275 -306036 -302492 -300198 -307700 -308627 -304468 -298796 -302431 -305993 -292093
5034 -292093 -289042 -293793 -294898 -293215 -300986 -300257 -297777 -297963 -302951 -303742 -307013 -310431 -301292 -298969 -307097
5019 -307097 -308861 -300948 -297358 -298566 -303683 -307150 -314228 -302592 -287304 -285259 -285729 -289365 -289046 -286003
5005 -286003 -290722 -297990 -297318 -295795 -294885 -294414 -299890 -298967 -292683 -291185 -293702 -292681 -295700 -284922 -279453
4990 -279453 -285756 -294583 -294968 -292066 -293436 -303937 -299792 -296855 -296992 -294622 -284504 -281880 -293734 -295360
4976 -295360 -300222 -296833 -290554 -291067 -292636 -287426 -285544 -290289 -292876 -290937 -297854 -304833 -306140 -304455 -300026
4961 -300026 -297831 -300799 -303700 -307204 -309692 -305992 -301718 -304200 -314099 -308209 -302304 -300473 -302265 -302411 -298847
4946 -298847 -298037 -297360 -298158 -292286 -294085 -293355 -292071 -289421 -283051 -281713 -291074 -294896 -281740 -272539 -278517
4931 -278517 -281298 -292990 -298311 -295456 -294331 -294123 -284256 -282065 -282612 -284917 -288341 -289788 -294881 -296306 -292135
4916 -292135 -295677 -297547 -291549 -290939 -286053 -292235 -298994 -299351 -297159 -295352 -293363 -293113 -290917 -287736 -294451
4901 -294451 -296785 -299484 -299781 -298767 -294091 -282366 -274129 -277819 -282314 -282408 -282943 -282591 -289160 -287449 -290809
4886 -290809 -293370 -281826 -280408 -285862 -291080 -287957 -285953 -294203 -288789 -290687 -289335 -283549 -291216 -293555
4872 -293555 -297090 -303565 -294907 -289671 -282567 -278299 -279224 -292958 -294011 -287660 -284748 -285659 -285301 -280178 -288490
4857 -288490 -296413 -304042 -296376 -285432 -282257 -284851 -292886 -293119 -278093 -264394 -269181 -277833 -286462 -292167
4843 -292167 -300587 -297245 -287833 -285318 -292861 -292537 -295170 -292185 -302042 -303186 -296090 -292211 -289993 -286411 -280765
4828 -280765 -282891 -283282 -281186 -280966 -282786 -279872 -268487 -268378 -280126 -280423 -280633 -288998 -291709 -286068 -289872
4813 -289872 -292337 -293227 -290588 -292316 -290108 -293944 -305177 -307450 -308327 -311383 -311653 -313240 -313786 -301966 -298491
4798 -298491 -303338 -290764 -282287 -282729 -282268 -287784 -295581 -292398 -293197 -297235 -294373 -280730 -273745 -286553
4784 -286553 -291664 -289864 -287114 -289200 -287929 -292517 -294549 -295371 -291857 -282668 -286346 -296521 -288351 -282589
4770 -282589 -281148 -292873 -295389 -301004 -301620 -299139 -299416 -292850 -290955 -290063 -290952 -287852 -288029 -288585 -296897 -292631
4754 -292631 -285241 -276969 -281538 -285948 -290086 -288946 -278387 -271179 -274460 -276906 -277016 -272799 -279208 -276340
4740 -276340 -278810 -285492 -291483 -302663 -293591 -282793 -284884 -292833 -300896 -296601 -285833 -276394 -283712 -294029
4726 -294029 -296065 -295322 -294598 -290322 -290100 -297651 -298210 -286924 -288505 -297933 -297131 -287937 -290210 -293596 -287695
4711 -287695 -282947 -284011 -291210 -303281 -300548 -300373 -299140 -291437 -285197 -280855 -280503 -278561 -282647 -276221 -274654
4696 -274654 -278285 -285655 -288122 -283625 -276148 -276250 -279165 -288040 -286841 -286356 -278004 -281232 -289671 -287269 -287722
4681 -287722 -283586 -277414 -281909 -291835 -292208 -297069 -303718 -305717 -302344 -303384 -298877 -293041 -295029 -296127 -287585
4666 -287585 -287606 -291328 -293424 -283529 -277410 -282011 -285798 -291704 -292238 -288304 -280936 -269723 -261815 -268935 -279272
4651 -279272 -293455 -290726 -277461 -271654 -270285 -274916 -283615 -288816 -289500 -281942 -279747 -283514 -285722 -280459
4637 -280459 -276859 -279883 -284216 -273414 -267008 -270326 -277362 -285107 -274208 -269272 -275116 -284648 -287009 -286121
4623 -286121 -288310 -278416 -271600 -269149 -275168 -286026 -287969 -288090 -296408 -295388 -292775 -295641 -298661 -286947
4609 -286947 -274850 -261541 -268386 -287346 -288943 -290789 -292845 -289278 -284629 -278222 -273058 -271543 -271535 -280094
4595 -280094 -283135 -284919 -286141 -291741 -297407 -300240 -287582 -278181 -276572 -278090 -284754 -287639 -291201 -289052
4581 -289052 -284971 -288198 -289929 -285911 -280285 -281802 -287842 -287500 -286719 -281631 -276345 -273666 -276746 -282373 -290449
4566 -290449 -280979 -279431 -285819 -289982 -292147 -293451 -290695 -289945 -295846 -287827 -281093 -280903 -283353 -283225 -279041
4551 -279041 -290910 -294389 -287875 -282957 -279765 -282414 -281532 -288191 -292175 -290252 -280221 -273040 -278103 -278254
4537 -278254 -279782 -280146 -283604 -281686 -274219 -282843 -284606 -281814 -276161 -278937 -276110 -286303 -287435 -291646
4523 -291646 -292425 -292894 -297719 -292230 -289298 -284492 -286314 -285440 -282953 -287442 -291851 -287139 -292949 -293821 -277838
4508 -277838 -276068 -273116 -273522 -270340 -263343 -268442 -274767 -277615 -279214 -275545 -278828 -273763 -271413 -273542 -275142
4493 -275142 -277855 -273436 -275903 -288555 -282053 -276868 -274796 -278883 -283351 -278543 -281733 -285940 -283409 -275375
4479 -275375 -285564 -294108 -294014 -289394 -287485 -286180 -296597 -300756 -301156 -295811 -292112 -290071 -277831 -266687
4465 -266687 -267030 -273640 -278911 -286464 -290730 -296393 -290769 -285466 -276144 -269241 -272571 -283940 -294524 -290381
4451 -290381 -267636 -265601 -268816 -269422 -272321 -276407 -279517 -274277 -269064 -275171 -277465 -269998 -268964 -263169
4437 -263169 -264043 -274800 -278021 -280238 -285767 -283853 -277603 -274005 -276415 -281084 -280407 -279253 -274396 -274053 -274813
4422 -274813 -285998 -294287 -283417 -278477 -274913 -277826 -277862 -274777 -270603 -271154 -277724 -270291 -267098 -273185 -281907
4407 -281907 -276992 -276331 -275898 -273676 -275212 -282312 -289118 -282185 -265885 -261130 -273281 -274561 -268953 -264483
4393 -264483 -268242 -274214 -271749 -271601 -274582 -285810 -295121 -287871 -280344 -282773 -278272 -281870 -276594 -278817
4379 -278817 -280327 -274474 -276563 -277967 -262200 -249355 -253879 -268824 -273653 -272003 -274095 -278363 -278164 -273998
4365 -273998 -272936 -281258 -283844 -280975 -273570 -264890 -264798 -260790 -260536 -260977 -261826 -268824 -269155 -275023 -279107 -285285
4349 -285285 -289509 -287433 -282861 -274892 -264854 -271666 -276317 -272854 -276475 -273045 -261803 -267639 -271949 -264818
4335 -264818 -266642 -274962 -270169 -265329 -273908 -274578 -276526 -278062 -278899 -278610 -269158 -265238 -264505 -268160 -261589
4320 -261589 -253453 -251324 -263146 -273877 -278828 -282296 -286671 -285259 -273627 -269845 -267038 -268447 -278741
4307 -278741 -286347 -287064 -290221 -275673 -272771 -272823 -275157 -271855 -274655 -279033 -272493 -270276 -265075 -274071 -273838
4292 -273838 -266080 -267374 -272588 -271180 -272599 -270578 -271049 -272289 -279748 -279307 -283769 -277370 -277490 -280912 -278282
4277 -278282 -268684 -275674 -280307 -282478 -271912 -262744 -263524 -269681 -267070 -268106 -274159 -275783 -280626 -279181
4263 -279181 -265516 -262580 -261752 -269008 -273306 -274466 -272725 -269578 -269901 -273291 -274706 -275580 -288338 -295546 -294499
4248 -294499 -297722 -291974 -280085 -276968 -278270 -271008 -267527 -266093 -260685 -256668 -265520 -266719 -269153 -270631
4234 -270631 -274560 -259701 -253961 -264750 -276442 -284280 -283595 -274646 -268972 -269423 -267472 -259274 -259563 -275921
4220 -275921 -281326 -273209 -271565 -274464 -275912 -273807 -271037 -265280 -268781 -269430 -264376 -265496 -265352 -278594 -281486
4205 -281486 -276633 -274149 -274070 -264795 -253784 -249295 -263517 -269687 -267093 -263994 -262361 -260637 -255675 -251233
4191 -251233 -250176 -263525 -269988 -276357 -288053 -280692 -265737 -258023 -262513 -259968 -264601 -265898 -267026 -262606
4177 -262606 -261970 -265486 -265513 -267636 -268644 -279567 -286193 -279064 -264498 -261823 -262129 -267908 -265167 -263755 -274985
4162 -274985 -285796 -283922 -273553 -257975 -252456 -244704 -242102 -247647 -249138 -250429 -250301 -248545 -259705 -274116
4148 -274116 -278007 -282145 -284249 -290705 -283822 -274374 -278039 -274565 -271134 -268321 -266825 -267379 -270936 -261352 -254314
4133 -254314 -260590 -272020 -276851 -273203 -273785 -278083 -269697 -269076 -278650 -273627 -271981 -273611 -269559 -269044 -265457
4118 -265457 -259619 -258215 -264531 -271490 -272039 -260164 -254426 -265151 -273039 -270817 -269895 -269108 -264920 -270905 -274578
4103 -274578 -281179 -277077 -274464 -259803 -259532 -262786 -262640 -258061 -265953 -274915 -275533 -281193 -286974 -283846 -273964
4088 -273964 -271429 -270617 -261362 -264554 -266441 -256933 -257966 -266864 -275631 -276489 -279823 -280224 -274626 -276673 -276262
4073 -276262 -276908 -278104 -274207 -265833 -263345 -265992 -266644 -274527 -276271 -274857 -273514 -270071 -266062 -266202 -270986
4058 -270986 -270177 -268002 -268300 -275838 -275985 -270829 -269445 -270455 -272946 -266874 -263653 -260595 -256718 -249764 -250156
4043 -250156 -249123 -254438 -248470 -240240 -236846 -228708 -231923 -244359 -250592 -253861 -256160 -250178 -251064 -257586
4029 -257586 -254391 -257779 -268910 -265680 -260985 -257024 -252539 -243780 -247524 -252482 -258924 -264281 -279212 -282236
4015 -282236 -278095 -274262 -274188 -269489 -271478 -272299 -268701 -260919 -253862 -261265 -269707 -286732 -294543 -293047 -287866
4000 -287866 -274145 -268581 -267779 -267159 -271297 -269268 -267452 -262593 -265010 -263728 -256160 -255510 -265678 -268190 -260330
3985 -260330 -262409 -263541 -261346 -262031 -262112 -257563 -255004 -255336 -260336 -258657 -259651 -266500 -275144 -271147 -267580 -266783
3969 -266783 -261631 -255785 -253843 -250708 -247864 -256320 -262219 -271615 -281589 -284496 -277583 -263553 -253736 -262061
3955 -262061 -260085 -259990 -271119 -273244 -265782 -258628 -259168 -255878 -258527 -263211 -272836 -269963 -267339 -257747 -254651
3940 -254651 -251736 -255645 -265887 -265119 -264295 -263058 -258158 -252563 -259047 -269328 -273498 -275648 -279512 -271813
3926 -271813 -273619 -282479 -288380 -282783 -277269 -273080 -269846 -270100 -267735 -258337 -255984 -259552 -267447 -267801 -264618
3911 -264618 -264780 -260763 -264272 -268584 -263524 -256629 -254737 -258269 -258658 -257340 -262258 -260835 -255660 -256493 -257903
3896 -257903 -259191 -255751 -254680 -253354 -256043 -265013 -265568 -265723 -252632 -250860 -246188 -237383 -239535 -245186 -249857
3881 -249857 -257219 -260267 -264827 -266493 -265194 -259301 -256027 -253818 -265701 -277040 -271942 -261109 -254350 -258134
3867 -258134 -267964 -270477 -270054 -269248 -273690 -272335 -267432 -268185 -268370 -265890 -268364 -259228 -256886 -261734 -267814
$$ [...]
##END NTUPLES=NMR SPECTRUM
##END=
