##TITLE=Analysis number 309900
Compound Code cc 21701
Book Reference 440/20
Project Code adrs
Chemist Name craigr
##JCAMPDX= 6.0         $$ Bruker NMR JCAMP-DX V2.0
##DATA TYPE= NMR SPECTRUM
##DATA CLASS= NTUPLES
##ORIGIN= Bruker BioSpin GmbH
##OWNER= NMR
$$ XWIN-NMR		Version 3.5
$$ Tue Jun  7 14:20:15 2005 GMT Daylight Time (UT+1h)  MAYBRIDGE\NMR@NMR_250MHZ
##.OBSERVE FREQUENCY= 250.131544655141
##.OBSERVE NUCLEUS= ^1H
##.ACQUISITION MODE= SIMULTANEOUS (DQD)
##.ACQUISITION SCHEME= undefined
##.AVERAGES= 16
##.DIGITISER RES= 18
##SPECTROMETER/DATA SYSTEM= dpx250
##.PULSE SEQUENCE= zg30
##.SOLVENT NAME= DMSO
##.SHIFT REFERENCE= (INTERNAL, DMSO, 0, 16.522)
##AUDIT TRAIL= $$ (NUMBER, WHEN, WHO, WHERE, WHAT)
$$ ##TITLE= Audit trail, XWIN-NMR		Version 3.5
$$ ##JCAMPDX= 5.01
$$ ##ORIGIN= Bruker BioSpin GmbH
$$ ##OWNER= NMR
$$ C:\u/data/dgb/nmr/ADRS/3910/pdata/1/auditp.txt
$$ ##AUDIT TRAIL=  $$ (NUMBER, WHEN, WHO, WHERE, WHAT)
(   1,<2005-06-07 14:19:55.62 +100>,<MAYBRIDGE\NMR>,<NMR_250MHZ>,
      <created by zg, POWCHK disabled, PULCHK disabled
       configuration hash MD5:
       62 19 C7 07 E1 42 D1 B7 37 6C 3D D0 77 39 F9 E6
       data hash MD5: 64K
       F1 17 AB E9 5F CA A3 42 40 B0 01 85 D7 7C B8 FF>)
(   2,<2005-06-07 14:20:07.65 +100>,<MAYBRIDGE\NMR>,<NMR_250MHZ>,
      <Start of raw data processing
       ef LB = 0.3 FT_mod = 6 PKNL = 1 SI = 32K 
       data hash MD5: 32K
       F5 21 C1 6D 31 BE F9 E0 71 96 AC 79 D7 75 8E 63>)
(   3,<2005-06-07 14:20:09.45 +100>,<MAYBRIDGE\NMR>,<NMR_250MHZ>,
      <apk 
       data hash MD5: 32K
       8C 11 73 CD 79 E4 57 97 AD 37 4D 6C 60 90 EB C7>)
(   4,<2005-06-07 14:20:10.32 +100>,<MAYBRIDGE\NMR>,<NMR_250MHZ>,
      <abs ABSG = 5 
       data hash MD5: 32K
       0B F7 BE D9 E5 B5 33 1F 8B AC DC 7D 3E F2 B8 95>)
$$ ##END=
$$ 
$$ hash MD5
$$ 6F 32 44 9D FB 43 8F D2 D8 94 14 C1 C9 43 28 4D
##$RELAX= 
##$RELAX= 
##$RELAX= 
##$RELAX= 
##$RELAX= 
##$RELAX= 
##$RELAX= 
$$ Bruker specific parameters
$$ --------------------------
##$DU= <C:\u>
##$EXPNO= 3910
##$NAME= <ADRS>
##$PROCNO= 1
##$TYPE= <nmr>
##$USER= <dgb>
##$AMP= (0..31)
100 100 100 100 100 100 100 100 100 100 100 100 100 100 100 100 100 100 
100 100 100 100 100 100 100 100 100 100 100 100 100 100 
##$AQSEQ= 0
##$AQ_mod= 3
##$AUNM= <au_zg>
##$AUTOPOS= <27 >
##$BF1= 250.13
##$BF2= 250.13
##$BF3= 250.13
##$BF4= 250.13
##$BF5= 500.13
##$BF6= 500.13
##$BF7= 500.13
##$BF8= 500.13
##$BYTORDA= 1
##$CFDGTYP= 0
##$CFRGTYP= 5
##$CHEMSTR= <none>
##$CNST= (0..31)
1 1 145 1 1 1 1 1 1 1 1 1 1 1 1 1 1 1 1 1 1 1 1 1 1 1 1 1 1 1 1 1 
##$CPDPRG= <>
##$CPDPRG1= <>
##$CPDPRG2= <>
##$CPDPRG3= <>
##$CPDPRG4= <mlev>
##$CPDPRG5= <mlev>
##$CPDPRG6= <mlev>
##$CPDPRG7= <mlev>
##$CPDPRG8= <mlev>
##$CPDPRGB= <>
##$CPDPRGT= <>
##$D= (0..31)
0 1 0 0 0 0 0 0 0 0.06 0 0 0 0 0 0 0.0002 0 0 0 0 0 0 0 0 0 0 0 0 0 0 
0 
##$DATE= 1118150394
##$DBL= (0..7)
120 120 120 120 120 120 120 120 
##$DBP= (0..7)
150 150 150 150 150 150 150 150 
##$DBP07= 0
##$DBPNAM0= <>
##$DBPNAM1= <>
$$ [...]
##$SUBNAM7= <"">
##$SUBNAM8= <"">
##$SUBNAM9= <"">
##$SW= 20.6930455092707
##$SWIBOX= (0..15)
0 0 3 0 0 0 0 0 0 0 0 0 0 0 0 0 
##$SW_h= 5175.983436853
##$TD= 65536
##$TD0= 1
##$TE= 295.16
##$TE2= 300
##$TE3= 300
##$TEG= 300
##$TL= (0..7)
0 120 120 120 120 120 120 120 
##$TP= (0..7)
150 150 150 150 150 150 150 150 
##$TP07= 0
##$TPNAME0= <>
##$TPNAME1= <>
##$TPNAME2= <>
##$TPNAME3= <>
##$TPNAME4= <>
##$TPNAME5= <>
##$TPNAME6= <>
##$TPNAME7= <>
##$TPOAL= (0..7)
0.5 0.5 0.5 0.5 0.5 0.5 0.5 0.5 
##$TPOFFS= (0..7)
0 0 0 0 0 0 0 0 
##$TUNHIN= 0
##$TUNHOUT= 0
##$TUNXOUT= 0
##$USERA1= <user>
##$USERA2= <user>
##$USERA3= <user>
##$USERA4= <user>
##$USERA5= <user>
##$V9= 5
##$VALIST= <valist>
##$VCLIST= <CCCCCCCCCCCCCCC>
##$VD= 0
##$VDLIST= <DDDDDDDDDDDDDDD>
##$VPLIST= <PPPPPPPPPPPPPPP>
##$VTLIST= <TTTTTTTTTTTTTTT>
##$WBST= 1024
##$WBSW= 4
##$XGAIN= (0..3)
0 0 0 0 
##$XL= 0
##$YL= 0
##$YMAX_a= 306167
##$YMIN_a= -314802
##$ZGOPTNS= <>
##$ZL1= 120
##$ZL2= 120
##$ZL3= 120
##$ZL4= 120
##$ABSF1= 16.522
##$ABSF2= -4.171173
##$ABSG= 5
##$ABSL= 3
##$ALPHA= 0
##$AQORDER= 0
##$ASSFAC= 0
##$ASSFACI= 0
##$ASSFACX= 0
##$ASSWID= 0
##$AUNMP= <proc_1d>
##$AZFE= 0.1
##$AZFW= 0.1
##$BCFW= 0
##$BC_mod= 0
##$BYTORDP= 0
##$COROFFS= 0
##$CY= 12.5
##$DATMOD= 1
##$DC= 0
##$DFILT= <>
##$DTYPP= 0
##$F1P= 14.0000005364418
##$F2P= -0.99999901652339
##$FCOR= 0.5
##$FTSIZE= 32768
##$FT_mod= 6
##$GAMMA= 0
##$GB= 0
##$INTBC= 1
##$INTSCL= 1
##$ISEN= 128
##$LB= 0.3
##$LEV0= 0
##$LPBIN= 0
##$MAXI= 10000
##$MC2= 0
##$MEAN= 0
##$ME_mod= 0
##$MI= 0
##$NCOEF= 0
##$NC_proc= -4
##$NLEV= 6
##$NOISF1= 0
##$NOISF2= 0
##$NSP= 0
##$NTH_PI= 0
##$NZP= 0
##$OFFSET= 16.522
##$PC= 1
##$PHC0= -82.45525
##$PHC1= 13.92271
##$PH_mod= 1
##$PKNL= yes
##$PPARMOD= 0
##$PSCAL= 4
##$PSIGN= 0
##$REVERSE= no
##$SF= 250.13
##$SI= 32768
##$SIGF1= 0
##$SIGF2= 0
##$SINO= 400
##$SIOLD= 32768
##$SREGLST= <1H.DMSO>
##$SSB= 0
##$STSI= 32768
##$STSR= 0
##$SW_p= 5175.98343685301
##$SYMM= 0
##$S_DEV= 0
##$TDeff= 65536
##$TDoff= 0
##$TI= <Analysis number 999999
Compound Code 99
Book Reference 9
Project Code 9>
##$TILT= no
##$TM1= 0
##$TM2= 0
##$TOPLEV= 0
##$USERP1= <user>
##$USERP2= <user>
##$USERP3= <user>
##$USERP4= <user>
##$USERP5= <user>
##$WDW= 1
##$XDIM= 32768
##$YMAX_p= 452060864
##$YMIN_p= -463431
$$ End of Bruker specific parameters
$$ ---------------------------------
##NTUPLES= NMR SPECTRUM
##VAR_NAME=  FREQUENCY,     SPECTRUM/REAL,   SPECTRUM/IMAG
##SYMBOL=    X,             R,               I
##VAR_TYPE=  INDEPENDENT,   DEPENDENT,       DEPENDENT
##VAR_FORM=  AFFN,          ASDF,            ASDF
##VAR_DIM=   32768,         32768,           32768
##UNITS=     HZ,            ARBITRARY UNITS, ARBITRARY UNITS
##FACTOR=    0.157963299565203, 1,           1
##FIRST=     4132.6476996994, 0,             0
##LAST=      -1043.33573715361, 0,           0
##MIN=       -1043.33573715361, -463431,     0
##MAX=       4132.6476996994, 452060864,     0
$$ Real data points
##PAGE= N=1
##DATA TABLE= (X++(R..R)), XYDATA
$$ [...]
20172 -109250 -52185 -57324 -137938 -123028 -66096 -35380 18214 -45968 -17291 3214 -68142 -133169
20160 -133169 -154187 -68904 -50031 -141756 -136944 -61140 -42317 -90981 -142457 -49765 71084
20149 71084 87952 60411 86023 21812 -11086 -54469 -107879 -175736 -175765 -121025 15576 77827
20137 77827 103257 126812 89485 114734 65717 -68694 -66659 8860 45597 -63953 -157707
20126 -157707 -158011 -87379 -42382 -27927 -164537 -164178 -166279 -205454 -213589 -129846 -55524 -40357
20114 -40357 -33453 -102372 -116800 -137432 -142809 -115871 -38833 -9242 -65983 -100761 -57214 -92330
20102 -92330 -54636 -95735 -123119 -47014 1706 -32518 -8740 48871 20809 43240 37414 5470
20090 5470 -50109 -81288 -10005 74986 87786 104827 97165 143660 144322 101797 105682 111035 110017
20077 110017 204472 220174 132127 32881 56419 118839 24975 -40025 -101467 -44803 -14512
20066 -14512 -12042 7395 13771 35791 63111 42466 124030 183220 80403 82481 125791 32130
20054 32130 -29405 -40366 -28626 -26743 41951 -4889 -48278 -26017 -95868 -79895 86944 200597
20042 200597 23230 -63624 -56789 -187907 -177601 -17689 25450 -31351 2736 22875 12405
20031 12405 51704 151575 188890 278640 290376 361686 549860 708758 941216 1297080 1665691
20020 1665691 1959895 1998226 1935906 2072343 2117777 2448305 2954355 3212015 3161698 2811125
20010 2811125 2379453 2086228 1894322 1868160 2060860 2154814 1900084 1529573 1157310 879750
20000 879750 728115 621506 638529 564427 488707 398853 360150 470409 483428 430334 383920
19989 383920 349834 395932 497029 481011 515052 584247 599168 652649 865281 1212198 1576226
19978 1576226 1997718 2167550 2109204 2012698 2153297 2387281 2854124 3277895 3494784 3437029
19968 3437029 3005307 2537602 2212021 2091615 2121633 2267955 2150701 1882587 1568582 1246385
19958 1246385 987723 795543 706152 543568 459001 383962 412728 348964 269078 344140 412784
19947 412784 324894 319223 339293 342157 258126 260014 263404 227820 175827 -1354 -46881 -29517
19935 -29517 -12451 89873 115083 167578 179513 96523 46848 110324 169931 100636 73864
19924 73864 42167 60583 65085 53191 50331 79209 118166 85833 42751 35445 103774 74610
19912 74610 130393 63546 -2669 109919 168934 131582 132087 54441 22257 -52356 3614 31051
19900 31051 9142 -34491 -11093 -19019 -92401 -6734 15923 28178 74335 128599 175103 170911
19888 170911 87518 -920 -72454 -48427 -69652 17940 -17147 -99332 -159782 -130094 -17233
19877 -17233 -53454 -88203 -52072 -77599 -28342 -13240 -103912 -108131 -165449 -137004 -73855 54528
19865 54528 62450 -26790 -94975 -12879 -18806 -11510 -45976 -166532 -171198 -95745 -61616 22853
19853 22853 -75880 -111724 -91177 -94118 -54764 -54199 -116906 -115556 -108524 -83584 -8072 -59716 5670
19840 5670 123669 35437 -73875 -105120 -120595 -57868 35251 74693 100789 130458 84469
19829 84469 -18384 -35981 -56330 -129117 -130813 -111036 -93446 -83370 -20123 -176676 -278839
19818 -278839 -223509 -160823 -208559 -216744 -202812 -150044 -106530 -68439 -66186 -98886 -50833 -15507
19806 -15507 -65591 -38350 -32284 -30211 -87167 -83867 -29092 -21941 -67322 -120083 15301 55823
19794 55823 -89271 -155353 -141822 -152342 -201207 -130598 2674 -55794 -183776 -224729 -164067
19783 -164067 -77578 -62627 -90120 -50588 -8583 -24676 -85217 -93928 -63297 23609 50483 -39063
19771 -39063 -66840 -63662 -15612 410 -20088 55860 80526 9742 -1174 2047 51664 80440
19759 80440 112986 53995 41366 28388 -3362 -74556 -90486 -110668 -92649 -134967 -115635 -138323
19747 -138323 -72435 -62616 -41671 21330 37935 -67448 -139775 -123989 -94645 -21015 29072
19736 29072 -30624 -34561 1638 -6492 -66499 -113278 -149340 -80050 -9072 -10725 -88603 -180545
19724 -180545 -213311 -237448 -147847 -90279 -118481 -213712 -162353 -18625 5709 -87684 -134141
19713 -134141 -47028 6968 123071 46398 -22724 -45955 68907 43298 49831 89082 95249
19702 95249 83293 72826 97578 38453 12127 10932 -104256 -143046 -134696 -114041 -20851 54417
19690 54417 -16426 -168478 -268633 -334923 -285248 -143707 -37330 -68781 -10807 93146 83961
19679 83961 -37999 -112483 -67682 -46832 -29000 11146 24526 -904 -106724 -178134 -203667
19668 -203667 -176614 -95010 -88320 -109415 -112544 -82758 -27909 30410 10133 -8898 -123210 -188606
19656 -188606 -253167 -214603 -196114 -183361 -183539 -111940 -83026 -71082 -36267 47161 90860 25504
19644 25504 -12077 30359 17211 -36472 -84391 -94956 -89264 -190800 -191039 -138980 -126505 -101494
19632 -101494 -78625 -59963 23546 -100345 -63772 52598 45001 59353 17536 -29965 8358
19621 8358 -1221 -88892 -136215 -140850 -196644 -126781 -43181 93874 87363 111957 75040 -8034
19609 -8034 52982 120658 165613 163449 70725 1800 -23636 16406 67907 185307 149603 45616
19597 45616 -9461 35191 83074 130952 200772 92849 108685 111782 69544 48467 -27959 21335
19585 21335 40050 45602 596 74423 110803 45399 -24619 -69588 -14772 43492 -105990 -212554
19573 -212554 -181548 -91650 -54136 30671 54906 -14813 -36418 -28370 88778 148284 60295
19562 60295 -91737 -123441 -164408 -183464 -97929 -19538 -48967 -70952 -114624 -136620 -104058
19551 -104058 -105437 -104004 -31118 1767 -69826 -146074 -99142 -106242 -28334 -43699 -99325 -51533
19539 -51533 -12258 -51372 -94232 -79763 -42480 -30614 28122 203239 339440 382877 327020
19528 327020 259116 190405 71080 -79942 -119845 -219839 -227114 -182383 -107380 -81825 -62973
19517 -62973 -28175 -33893 -96952 -158938 -190968 -96602 4312 -7554 -100817 -166379 -133683 38349
19505 38349 136201 68343 31030 25540 -46575 -46217 -3030 -54373 -71275 -39766 -25338 -134302
19493 -134302 -52073 -4438 29112 11932 -62972 -73441 -61808 -129699 -153804 -138006 -109582
19482 -109582 15783 21883 -34945 -25869 37550 81284 -89478 -190906 -272228 -253854 -152555
19471 -152555 -13924 22777 18901 7841 -48308 -116303 -107530 -161952 -177420 -108483 -29265 -59464
19459 -59464 -21668 37595 100171 70342 44640 43131 44566 70511 29132 70958 17078 -149574
19447 -149574 -243020 -213549 -67416 -7471 -60247 -14158 -30510 -60955 15069 75101 -1726
19436 -1726 6671 27288 -55397 -77698 -25364 3992 -88043 -24073 -20454 7190 18083 -20147
19424 -20147 -9638 71386 115863 108469 73248 33849 -6958 59402 47525 53251 -24098 -155064
19412 -155064 -232027 -162327 -110159 -80281 -82037 -114324 -112523 -136209 -139553 -142315 -46746 -17880
19400 -17880 14172 -38761 -154065 -140764 7073 -32062 -158928 -118607 -115878 -85106 -4710
19389 -4710 -18622 -55806 -31278 -9194 35770 93084 159491 136561 59669 134575 94930 123059
19377 123059 82153 11177 -62959 -68720 -83185 -64797 38717 96575 152997 42787 -32926
19366 -32926 -11163 28784 50286 109672 136933 92522 131324 120080 69488 6087 -38275 -115027
19354 -115027 -60752 60899 -7390 64378 122705 86459 -33862 34983 108647 55015 -110210
19343 -110210 -158095 -118302 -92526 15932 -17546 -91225 -117628 -150632 -170541 -162718 -125359
19332 -125359 -116352 -74637 -113723 -154164 -80165 -67202 -24669 -27659 9062 8076 6000 73259
19320 73259 68489 6097 29621 113828 47486 -88019 -154257 -124267 -40441 61380 133112
19309 133112 97950 73181 198218 43405 -66022 -94514 -128918 -82039 -51648 19871 44999
19298 44999 33549 59240 75000 87843 62831 4911 39288 58714 59104 86733 98258 83854
19286 83854 80198 16094 13277 107626 112666 143845 136965 28774 61448 41254 55098 11795
19274 11795 -117505 -38207 85266 121060 24817 -1483 11462 -16011 -1549 74846 19393
19263 19393 -18740 -51978 1871 38726 69113 20988 24786 82425 33668 20451 26213 14387
19251 14387 40630 4786 -24624 56265 171743 189427 251437 281938 201899 152127 189421
19240 189421 227950 162829 86212 86131 188884 222780 221954 73112 -103255 -41642 18993 16323
19228 16323 6451 51745 67992 7346 -78425 -85106 -39619 72905 95300 70402 67572 65665
19216 65665 35154 22556 55354 70392 74544 -1094 -110301 -121315 -94970 -66415 -61199 -53395
19204 -53395 10607 -6150 -32508 -102978 -115614 -88225 -65069 -62919 -72450 -78775 -139934 -193765
19192 -193765 -196850 -180568 -182111 -104064 -49702 -136325 -135767 -37591 -46108 -91625 -138134 -120291
19180 -120291 -82827 -19235 -102624 -54209 64916 -31174 -40076 -115795 -168381 -76567 -4505
19169 -4505 -26606 -52146 -57949 -94200 -127355 -48500 33425 50587 1811 -11773 12104 104118
19157 104118 44033 -50703 -67135 -171790 -115349 -153593 -185566 -222354 -86175 42670 89865
19146 89865 113932 148143 141221 80994 18005 -35285 86185 104548 22146 -24571 35088 55244
19134 55244 27969 -25191 -89844 -135460 -112791 -119763 -24013 36465 17657 20344 155031 110990
19122 110990 115687 144974 86392 1714 5823 32726 26400 53894 182165 271855 161575 67952
19110 67952 120137 172901 174662 110733 112425 187158 120723 44908 -10053 -17423 -14631 -137442
19098 -137442 -127799 -74310 -76708 -87132 -92659 -186790 -224867 -208120 -294250 -307349 -217021 -101890
19086 -101890 17184 22094 -50613 -51773 38711 121666 108579 60794 134236 176671 255152 217964
19074 217964 228625 229524 256594 210545 84415 42261 -17530 -3167 108368 165581 111354
19063 111354 18264 34995 13055 -62138 9467 63917 71494 10308 257 58488 112507 -3150
19051 -3150 -33951 -100816 -34882 38818 27035 -6968 -51079 -19425 21850 16639 24659 19808
19039 19808 -1098 24479 -41778 -20508 -26610 -6530 28825 -6601 -27608 -123841 -51372 -27497
19027 -27497 91371 218376 264172 228874 239269 193931 158806 124829 127957 250033 194908
19016 194908 60483 45342 -11173 -163433 -159713 -16900 -99175 -75904 71794 67369 57939
19005 57939 25048 27481 42196 34927 41767 15806 -4845 22770 16311 -13209 -42071 13264
18993 13264 23842 -23099 -30736 -37470 232 37653 32796 -6476 90463 147435 105043 103166
18981 103166 183826 133897 74567 87036 144124 244025 250785 225652 210543 241639 217368 221229
18969 221229 238163 273616 162911 97544 26634 -49413 -76319 629 33059 101737 104425
18958 104425 104186 136798 137992 171146 84012 -3068 6678 81176 140613 162713 212601 182364
18946 182364 65684 1753 -12642 44297 28463 36495 52548 74632 6417 -3737 -63311
18935 -63311 -90549 24133 65530 134406 183793 197741 171189 125081 140707 159749 157010 209663
18923 209663 202851 125305 54196 94013 23191 -37220 -10450 56481 101598 75391 83158 80223
18911 80223 -11925 -84856 -157992 -115649 -48254 -38759 11237 76875 123931 171095 182369 263340
18899 263340 294085 282586 196557 156978 154875 219194 213037 128238 45604 -2225 26181 44171
18887 44171 -39755 -84519 -74508 -64097 32387 -30806 -97002 -94460 -144951 -114493 -151593 -143420
18875 -143420 -63548 -9517 -23004 14478 -18494 -56118 -115740 -90518 -45293 -1572 -7855 63050
18863 63050 162704 161924 234202 193350 208786 273491 210086 230533 266875 232230 142678 94153
18851 94153 123990 131641 105479 148710 108085 110167 197632 242561 342124 315622 292953 285133
18839 285133 251992 338650 426159 455423 349770 197980 225583 262123 288843 321797 327520
18828 327520 301361 316718 312833 305546 178719 64681 -23050 79050 278568 384146 314885
18817 314885 223613 252156 273975 206200 240827 117768 201083 271860 297795 449709 556576
18806 556576 444673 481109 536044 529022 462026 490719 573583 644902 691304 773092 856991
18795 856991 820548 831441 858116 928757 1037352 1070619 1158959 1281200 1469652 1627843 1819713
18784 1819713 2202027 2693277 3295063 4106832 4984149 6195193 7830694 9949909 12444043
18775 12444043 15724456 19652648 23218144 25200068 25743042 26169171 27651988 30646802
18767 30646802 34479448 37923667 39798110 39246378 36176833 31912158 28392855 26371912
18759 26371912 25845380 25989563 24958653 21956811 18021964 14591418 12041619 10051638
18751 10051638 8624415 7678699 6928790 6301307 5805332 5436667 5089224 4782371 4598544
18742 4598544 4444201 4297951 4294087 4352166 4315169 4289009 4189159 4202948 4288199 4369936 4384429
18731 4384429 4450988 4666638 4927660 5237484 5510928 5903346 6478177 7289704 8419229
18722 8419229 9908225 12033994 15016521 18940337 23910968 29710953 34299426 35901871
18714 35901871 35608293 35875376 38403586 43457396 50010094 55024273 56211514 53285664
18706 53285664 47676923 41983257 37933524 36272198 36447745 36527554 34183974 29186083
18698 29186083 23662135 19088129 15658158 13149599 11324785 9924566 8844221 7912951
18690 7912951 7237366 6803880 6338735 5906361 5715379 5438750 5263945 5145505 4892651
18681 4892651 4568198 4455191 4388758 4336348 4296166 4205899 4051809 3829244 3725385 3655993
18671 3655993 3559361 3320780 3274551 3266354 3166353 2992691 2769293 2610069 2517001 2425750
18661 2425750 2294952 2101473 1897993 1825174 1746725 1749518 1755367 1757413 1768685 1789498 1694352
18650 1694352 1631794 1542305 1386433 1274154 1283387 1193172 1257000 1361350 1376127 1185408 1034979
18639 1034979 972671 934667 875798 965209 948263 833153 736177 654705 690216 701376 570260
18628 570260 569762 504689 523926 591190 638143 620772 623345 638523 611027 605142 617591 580931
18616 580931 468439 387987 314093 272868 351333 352738 351544 396053 495957 525597 496793 487774
18604 487774 421368 415334 353583 393342 414959 367287 455313 485292 471889 418630 332761 323918
18592 323918 386035 432072 402239 389005 438814 432176 461484 517338 466277 519649 614889 694765
18580 694765 715884 696193 782525 809283 786964 770766 814038 879423 999205 967536 953608
18569 953608 958241 1026038 1146820 1241671 1292151 1345928 1428665 1582109 1802651 2111987 2487295
18558 2487295 2998686 3598347 4395375 5452542 6938409 9122382 11938456 15685223 20469669
18549 20469669 25169469 27190969 25504444 22307389 20019951 19515425 20611398 23139371
18541 23139371 26658831 28855570 27137564 22406379 17377978 13514593 10880359 8948445
18533 8948445 7594943 6686244 5894016 5249180 4903036 4706182 4548251 4347332 4177118
18524 4177118 4140804 4082435 4144338 4197032 4368986 4515304 4682891 4989523 5265446 5603821
18514 5603821 6331277 7264425 8559171 10243183 12411706 15486008 19630717 24914507
18506 24914507 30533471 33567571 32116153 28483725 25662309 24739502 25721525 28316671
18498 28316671 32210107 35439751 35607075 33033656 30218375 28739426 27770504 25716192
18490 25716192 22676479 19895869 17950933 17282740 17721834 19051331 20753171 21038623
18482 21038623 18925537 15630936 12760907 10636603 9185888 8140264 7300826 6747546
18474 6747546 6363160 6054553 5788717 5544020 5245227 4940050 4781441 4658891 4644513 4642890
18464 4642890 4566621 4589969 4632455 4622634 4653652 4771305 4987611 5361828 6045151 6924662
18454 6924662 8010862 9613907 11868826 14807267 18603424 21918068 22504814 20409909
18446 20409909 17763088 16096379 15690687 16546799 18556341 21081742 22017053 20016610
18438 20016610 16355999 12826453 10150034 8359056 6997983 5971572 5128130 4517864
18430 4517864 4123944 3806712 3519381 3327622 3352405 3345818 3450607 3622445 3682406 3728339
18420 3728339 3861371 4012135 4113152 4265188 4354930 4450475 4475778 4399254 4244890 4169381
18410 4169381 4244738 4169502 3949378 3659621 3358671 3146320 2992609 2786846 2572292 2311195
18400 2311195 2119565 1949608 1751757 1684027 1583299 1449108 1420184 1310112 1179412 1100268
18390 1100268 1122263 1196943 1246653 1128734 1085671 997436 875568 883727 896254 866624 943842
18379 943842 994863 917549 779027 717081 712603 734037 847211 812965 702370 779296 812704
18368 812704 891348 1136032 1495812 1795950 2012532 2192893 2345048 2527037 2756957 3032794
18358 3032794 3208158 3358592 3344579 3281441 3273854 3322014 3272238 3154545 2962863 2718805
18348 2718805 2415912 2213723 2085751 1992375 1796164 1539323 1165456 933028 854168 750930
18338 750930 799843 703511 722214 730119 647887 686269 718033 648210 519930 538613 579417
18327 579417 562515 470811 339896 336115 453382 543925 469650 368328 320495 240042 237532
18316 237532 383655 451860 467790 438538 402517 491953 429174 313080 277552 248402 196913
18305 196913 169128 212947 296098 327001 246874 228572 192631 157637 153361 152441 189428 184216
18293 184216 92353 25015 71983 149358 152279 172278 265370 196978 97115 37116 29043 111387
18281 111387 113956 90556 170014 222967 144190 8356 12900 -20693 94142 210469 185708
18270 185708 107510 32482 36632 98817 185599 184658 225580 260855 205411 152793 66176 12358
18258 12358 22510 80157 117445 118099 84640 106663 88910 -15018 -30974 29415 68053 -2422
18246 -2422 -21203 83242 131296 75378 37424 67986 114947 193524 247250 222859 257744 221501
18234 221501 138768 164030 178662 155642 243149 319798 355623 386935 405558 362808 255492
18223 255492 294696 282410 285254 343711 379351 383718 318462 209029 186997 134889 23635
18212 23635 36917 145948 206129 228836 245960 182062 127055 38891 -4500 54625 -9224
18201 -9224 -58658 24811 149550 168026 88844 53719 -58264 -34394 88384 128092 50386
18190 50386 34305 -5742 52319 132409 182444 240216 138593 -24623 -49543 5178 120804
18179 120804 111213 69892 155501 203719 153304 291098 316369 273862 252225 359132 298518
18168 298518 150275 132751 80590 90151 89165 146399 201984 254887 258743 222579 265618 250309
18156 250309 206749 198619 122974 36565 -7412 92872 192179 228342 191210 108800 77325
18145 77325 238764 234317 104404 -86608 -72602 -38242 -37136 16749 91192 54334 -77489
18134 -77489 -165895 -171069 -144024 -111681 -42083 43364 57405 71557 148375 127034 96399 68671
18122 68671 8443 -28017 -17015 -88955 12798 58222 73833 45135 27070 94393 76854
18111 76854 10128 -4514 56174 89010 94821 48835 111127 178525 201558 138066 71439 38547
18099 38547 56188 111294 184474 223050 142580 17192 -3411 10986 7465 62475 73813 6482
18087 6482 29606 134153 145565 124982 41982 85792 95704 198158 165498 109356 46857 90734
18075 90734 73655 -17166 -7176 77922 2541 -86372 -96691 12409 81106 135787 181513 153969
18063 153969 214769 197243 166240 188880 148471 152866 229926 240605 241476 132478 108325 113599
18051 113599 202685 244367 200335 137474 106053 182266 224885 313016 254516 85082 -101085
18040 -101085 -49358 64152 4295 16578 50679 108369 138462 151878 121661 188204 247342
18029 247342 223473 117442 195675 200565 150200 130560 147213 84123 226648 447357 483167
18018 483167 581447 810621 1008265 1208478 1667686 1979507 2136764 2072633 1793294 1602779
18008 1602779 1538092 1642264 1924119 2196509 2317366 2227540 1923051 1534071 1331188 1224210
17998 1224210 1215102 1142751 1045342 1100799 1223935 1270826 1339443 1308442 1322039 1350962 1475554
17987 1475554 1644337 1818620 1860941 2023819 2187312 2377890 2712850 3184452 3830387 4652931
17977 4652931 5573702 6818053 8625692 10995552 14050504 17855289 22075393 25264793
17969 25264793 25746563 23909557 21641139 20124218 20037407 21285180 23702776 26378630
17961 26378630 27297745 25233789 21380980 17517015 14422141 12111175 10459402 9262976
17953 9262976 8245996 7490886 6971397 6510521 6245191 6294753 6369233 6249010 6025623 5843571
17943 5843571 5699884 5697262 5775016 5873271 6065189 6437244 6957707 7593423 8650748 9940260
17933 9940260 11706403 14199443 17600741 21988144 27566685 34251532 40688192 44348310
17925 44348310 43667699 40127188 36588242 34865876 35370928 37905748 41809420 45204071
17917 45204071 45071239 40583441 33938746 27663210 22820731 18954346 15884657 13681726
17909 13681726 12007619 10852284 10079034 9563167 9121748 8782433 8295899 7754419 7296189
17900 7296189 6937194 6654625 6443664 6327275 6201457 6058740 6141216 6330047 6593089 6968625
17890 6968625 7636615 8515187 9692330 11361481 13592899 16468218 19662778 22282503
17882 22282503 22969855 21571506 19454846 17810837 17347239 17981240 19562535 21583665
17874 21583665 22434077 21091675 18070557 14718219 11892767 9772867 8149241 6964053
17866 6964053 6138035 5471409 4922033 4462113 4040454 3695190 3527666 3390515 3231156
17857 3231156 3096692 2974466 2890572 2785457 2625877 2472819 2395728 2363067 2352996 2337135
17847 2337135 2252764 2131333 2039461 2102144 2054086 1907353 1764896 1697953 1602124 1537534 1619639
17836 1619639 1530791 1445126 1320927 1198586 1118726 1061650 1080141 1134265 1202342 1113438 1044928
17825 1044928 993572 947917 881685 833549 837778 832348 760000 710731 708990 782141 765304 673271
17813 673271 600508 604264 508687 360454 456521 403012 455371 496599 474144 411388 379633
17802 379633 460900 436881 439490 435652 492004 441270 345744 320217 279398 334506 332067 277962
17790 277962 301957 397370 279000 186914 213814 296230 284233 270889 305680 268660 209172
17779 209172 150730 88111 135537 175689 120316 176630 134492 111420 56460 99315 164368
17768 164368 181778 133622 115336 241427 229899 176018 137012 148356 208332 263269 174184
17757 174184 89191 173754 204792 182255 155943 116497 160098 218608 201949 178085 135206
17746 135206 147154 133380 76891 180133 107120 67441 74154 152580 189454 228645 234917 258518
17734 258518 206803 161191 262887 277026 173243 142721 49867 23548 86833 26153 17542
17723 17542 165133 238661 229489 238529 281672 226826 135604 34566 35864 83264 214481 275917
17711 275917 247903 202896 201730 214097 155913 136026 128939 93529 81452 144404 170061 169553
17699 169553 64647 -79580 -37126 86920 107185 80349 94893 35590 83612 127150 72174
17688 72174 -10043 -93712 -75264 -34157 24632 125556 214139 235378 216417 209480 115013 56409
17676 56409 80452 102843 147606 124685 88933 96102 29354 17521 29942 38193 1534 39147
17664 39147 3365 -19866 -37608 -82206 -64700 -13463 -11122 -58879 -42972 -69370 -49877 -4823
17652 -4823 63656 50151 32530 51683 43375 32820 106412 189036 174060 182965 66188 -14926
17640 -14926 93943 91934 -25230 -57480 -73100 -91957 -165503 -106728 31533 35358 -49077
17629 -49077 -47946 -26624 36526 42364 67693 78932 71847 -29486 -134630 -105960 666 7307
17617 7307 -43236 17734 142691 63423 13262 83701 -17104 -33137 16422 158410 240997
17606 240997 216449 150575 106251 28371 -41506 -29787 -70833 -43916 -37315 -125787 -123271 -83790
17594 -83790 -132673 -109469 -25373 -48736 -103413 -25073 19932 28428 24754 -35040 -58476 3325
17582 3325 -23885 -4134 31287 45357 9160 -91712 -143615 -98057 -66669 -142225 -155355 -126823
17570 -126823 -171767 -205523 -110259 -28248 -39840 -2393 51341 -6289 -52264 -66661 -28042
17559 -28042 9284 -38059 -92243 -153862 -196338 -112798 60305 97583 36600 6645 14847 -35363
17547 -35363 -42742 53913 66297 77329 -80914 -147233 -82566 -63908 -94817 -111944 -133274 -38771
17535 -38771 -10535 52394 100014 152063 83098 94880 28590 -24062 5346 87280 118841 76474
17523 76474 69523 14105 51020 104454 43350 -16260 -88803 -37077 -38473 -18896 28894 -52163
17511 -52163 -137186 -35374 -3662 -10138 -4957 7060 -25058 47547 102043 40179 35221 41606
17499 41606 -58707 -175977 -170366 -144783 -167837 -135689 -73499 8744 35242 10847 -55573
17488 -55573 24291 59608 76740 35828 53007 13056 34044 -52450 -16538 -39245 -48744 93159
17476 93159 39569 -102617 -150910 -71047 20760 121177 211735 140012 143897 181768 188715 177478
17464 177478 311800 466433 570730 667308 883270 1231861 1509708 1767387 1879812 1760585
17454 1760585 1594751 1527015 1503470 1599368 1775601 1797132 1689143 1478207 1258092 1066759
17444 1066759 925591 779583 550719 478197 508649 527696 520407 574265 522665 526015 440035
17433 440035 392976 438482 547086 474732 415010 449765 485340 552552 560209 592717 624495
17422 624495 656617 671177 791563 1081616 1367290 1757329 2239701 2687278 3004879 3215158
17412 3215158 3163898 2869653 2535831 2472925 2666264 3041961 3264220 3125714 2650169 2167249
17402 2167249 1809037 1491626 1233815 1084991 981338 951648 922424 815855 796202 772266
17392 772266 709382 623372 593411 576044 583956 538375 502152 541438 566414 489942 477003 550998
17380 550998 676614 698235 608662 607640 768219 932280 1074227 1190057 1421586 1626387
17370 1626387 1559448 1458988 1391958 1355316 1407302 1539945 1654631 1622146 1588999 1414265
17360 1414265 1151670 930167 714108 523595 361563 337855 271707 286919 265097 222431
17350 222431 229756 346534 301702 292054 361880 272385 246479 266989 313222 302286 304865 369997
17338 369997 403715 294032 224896 236129 226885 293298 424424 406367 309712 206721 171162
17327 171162 171703 213671 207589 117950 30189 71814 74124 64698 128928 149114 110566 154292
17315 154292 55060 -38779 -2395 -34665 -75792 -11137 -59011 -71857 -96937 37842 144953
17304 144953 98047 136743 105940 6770 -95410 -144947 -135992 -139813 -105596 -70697 -3469 12258
17292 12258 67128 -7601 -65847 -86972 -45068 -55320 16627 -20291 -8193 19317 40526 73337
17280 73337 -5962 -27514 37529 60824 62622 112012 95668 69590 -17169 -8390 130129 126571
17268 126571 122078 144328 104671 16345 -13312 -17789 19454 84142 -2908 -25598 43699 31994
17256 31994 -82115 -104311 -1549 13766 -26798 -14669 -32899 -29602 -61817 -88747 -135594
17245 -135594 -151623 -147450 -137081 -47046 41881 9079 7428 32806 -10019 -42246 -55335 -61251
17233 -61251 -71667 -78642 -127827 -196563 -98026 33533 162814 147963 107806 59000 50939 3505
17221 3505 49155 129839 141693 108188 10791 -41272 8944 33343 22798 73207 157362 136089
17209 136089 138523 86451 70086 87520 60088 10008 -55088 -5000 54398 63101 -20462 -27094
17197 -27094 -93150 1205 74126 20037 -15757 -6661 -45001 -1879 57292 -7079 -24260 27015
17185 27015 56219 29129 -120883 -110765 -68972 -111822 -114779 -117584 -146839 -127037 -69810 -71619
17173 -71619 98546 184636 86458 9708 -46273 -82447 -68157 32642 75536 58835 13863
17162 13863 55831 35287 56853 34559 49077 -18157 -164758 -115334 -130863 -136223 -111843 -60411
17150 -60411 -62311 -81266 -101095 22062 117980 93264 22838 -10446 -80114 -57753 -70360 -120273
17138 -120273 -166203 -140169 -75050 -127244 -165548 -41818 43361 -46724 -45238 -10973 -78412
17127 -78412 -46891 10676 27364 67815 10479 -98170 -51253 4566 -16530 34391 -28018
17116 -28018 -39342 -9017 107240 151973 53562 17047 53638 -9256 -35617 -53031 -54967 -82843
17104 -82843 -66968 -9791 32236 27903 -30590 -45580 -16052 -3381 -98751 -160745 -87051 6068
17092 6068 37145 -46924 -89929 48865 38932 3867 12185 -106166 -151108 -128130 -69105 -107393
17080 -107393 -130863 -49373 -8132 105942 132954 128843 86305 -19351 -51838 -62662 -28773
17069 -28773 -1592 -78550 -102014 -194001 -167645 -60190 11047 49019 -7678 -23187 8946
17058 8946 14359 19195 55601 69233 43288 9823 40920 6704 -111366 -57354 -35983 -59115
17046 -59115 -180173 -198770 -139988 -160037 -154086 -41386 -133801 -145526 -121152 -147090 -137296 -173309
17034 -173309 -111780 -81130 -44264 -79739 -93303 -96702 -59814 -22268 -45055 -49184 63201 81740
17022 81740 24067 16048 26481 49889 98321 142993 109602 79879 61135 16970 12341 57775
17010 57775 168802 202596 110436 82111 120291 126753 132431 108972 37172 -19972 -38820 -10
16998 -10 8201 1093 -14487 -47856 -4669 -8908 28368 39926 41343 47470 52374 23312 46277
16985 46277 52348 33198 46803 40215 61147 21056 -20112 16768 29984 36195 -47696 -23729
16973 -23729 53544 44074 30053 -3348 -16676 -45321 -76840 -37243 61698 61940 57926 66202 2014
16960 2014 -104024 -139277 -218313 -186125 -98033 -119963 -137372 -136978 -98180 -183362 -238135 -133705
16948 -133705 -55040 6926 22787 -22789 17442 81806 73010 -37314 -130140 -145585 -170957
16937 -170957 -184548 -217640 -212450 -130606 -152264 -154976 -105087 -102831 -194610 -198875 -120294 -28249
16925 -28249 -29715 39587 131738 135478 88969 162437 120848 123741 94401 7964 27375 22954
16913 22954 -92567 -86638 -33719 116753 187644 181738 47774 -13131 51831 26999 100196
16902 100196 101905 11146 -33440 -127155 -112860 -38534 113425 82929 21603 63173 3841
16891 3841 -22848 953 -923 -35505 -23300 -8381 -32302 -154273 -176724 -141376 -83114 -12262
16879 -12262 72307 189526 217690 116783 -12261 -53167 -53925 -52846 -99097 -83752 -143417 -148455
16867 -148455 -30888 -41552 2290 41489 85103 35159 113758 66626 1857 -44433 -25777
16856 -25777 78078 73054 -20926 -34661 79913 48661 42597 33447 100658 159992 50062 -10302
16844 -10302 20226 75125 147905 199130 201656 211964 98846 5933 -32076 -26220 29910 94836
16832 94836 -27102 -16879 -41792 -140936 -173197 -99350 -146084 -168349 -129397 -95031 29606
16821 29606 3753 -68686 -66539 1489 -10789 -45520 -9971 11665 85238 86068 38805 59334
16809 59334 12091 -55445 -24383 52232 32716 -12546 12889 11761 59601 12853 -57312 -136794
16797 -136794 -55915 -3606 69447 115371 61374 9519 -127321 -157103 -84270 -68312 -29507
16786 -29507 -2991 -69497 15163 66239 34070 35636 31176 -110696 -159826 -193703 -198734 -117028
16774 -117028 956 -42114 -20291 44002 115208 -21980 -87839 -36387 70676 32339 -67666
16763 -67666 -100161 -152822 -97932 -26528 10521 37304 -63972 -47581 -5002 60222 131443
16752 131443 68261 -38622 -44695 -62972 -85937 -88242 -151889 -216394 -133515 -47405 -139563 -119134
16740 -119134 -20104 51203 15658 -110 -22282 -37492 -102459 -119965 -157632 -114806 -65668
16729 -65668 -110342 -72462 -52421 -105046 -149851 -110607 -125371 -113329 -120581 -152416 -163357 -40196
16717 -40196 -57005 -21566 85852 91984 48413 156479 93449 11999 -37748 -2209 -23706
16706 -23706 -98077 -42983 115095 176967 195936 174926 25781 -14667 24283 -61056 -178574
16695 -178574 -180409 -30810 12857 45733 -27241 -4202 70725 53182 99099 6154 -89866
16684 -89866 -108030 -57974 8488 23148 -89939 -182214 -168899 -169556 -210932 -175333 -125462 -128481
16672 -128481 -90183 -97145 -92890 -112465 -72321 -44352 45967 99117 113118 94021 12019 10002
16660 10002 -97770 -7051 -69261 -80505 -47738 1638 49496 141172 181640 78778 31653
16649 31653 98246 174263 46855 -114250 -52449 -36074 -24340 24879 -50561 -109236 -131905
16638 -131905 -168260 -60376 3182 -86850 -55553 -6962 -41451 3748 15462 2456 8610
16627 8610 -64805 -95151 -105946 -125240 -61061 -54048 -29708 -115623 -136682 -93653 -57172 37171
16615 37171 40284 -24128 23742 -25784 -16894 -32776 -3122 -27864 -49076 -43664 -54184 -34495
16603 -34495 4146 -25516 -23523 -44756 7803 100083 67626 53410 -5522 6530 26355 85086
16591 85086 82005 34585 79505 45305 -52202 -158027 -270141 -207628 -135782 -116688 -56418
16580 -56418 -15532 -24494 -39995 -128783 -199351 -188509 -109280 32204 103302 -2899 33656
16569 33656 146386 126865 112247 130911 120793 134610 23941 -28072 -24865 47112 127922
16558 127922 121685 59395 73596 -16348 25866 50145 -19918 9062 16457 81871 49607 76623
16546 76623 57066 66321 134106 6348 -33286 3759 -8750 13559 58413 -41416 -146536
16535 -146536 -144075 -114199 -54656 18187 52381 34360 -37750 -53510 -21513 -39640 -174902
16524 -174902 -136667 -21763 -11592 -21891 -5989 41410 16612 -22616 850 -6564 22378
16513 22378 23695 18790 -3877 34620 -107319 -173947 -100115 15198 91584 30502 -60128 -37090
16501 -37090 -94996 -119849 -187134 -282050 -228346 -198002 -125644 -74990 -35610 13645 44983 89710
16489 89710 90251 94524 111617 59178 98753 185229 91506 -34713 -101785 -138305 -74701 -23208
16477 -23208 2414 16860 -14582 -99760 -95704 -18579 -27535 38591 125805 66107 -7028 -99453
16465 -99453 -47864 60174 125859 122647 110108 88677 79820 50995 62390 -968 -12246 25845
16453 25845 -22720 -34619 -21323 -61004 -128336 -158291 -96618 92600 151774 31625 -43534
16442 -43534 9179 106304 85721 57697 8097 9857 -6551 -74946 -148257 -48376 -9917 -25223
16430 -25223 -26780 29692 64671 50558 61422 215610 226068 141220 68946 -34335 -182445
16419 -182445 -221747 -182279 -51652 -26667 -3432 -64204 -115506 -71548 -45961 -8707 61283
16408 61283 104907 195177 212388 174476 127610 59347 974 21599 22863 -80325 -12312 132417
16396 132417 203299 230809 125455 111796 142595 64144 -46997 -106085 -113627 -223774 -327148
16385 -327148 -266034 -100243 -96391 -195147 -104492 -23461 -10561 40490 7234 31487 -14834
16374 -14834 63240 1805 -161162 -212618 -94345 -108683 -81879 -38744 2176 -47118 -94678
16363 -94678 -38425 -33592 -50490 -60851 17340 45351 -49564 -115535 -67470 -151599 -210401 -153754
16351 -153754 -189288 -93024 -31915 -28559 37598 -11856 -108043 -101942 -164953 -183085 -130779 -75650
16339 -75650 -45325 -30797 -74116 -47888 -94427 -106693 -41810 -20173 -337 -12784 -24484 30019
16327 30019 66822 -75353 -104411 43251 181240 124151 -26108 -129333 -147903 -86504 -43582
16316 -43582 -137028 -145650 -73578 -2835 -4172 15435 -68197 -74988 -73126 -144270 -203450 -236098
16304 -236098 -237205 -189042 -239768 -171079 -15318 -73762 -137194 -56282 -56588 -36511 17693 35704
16292 35704 31431 -7864 15800 -24105 -70352 -13976 37513 -26836 -42021 -42694 -44982 -56615
16280 -56615 17469 20477 50961 96936 63844 39511 89999 131804 131666 96005 16403 -64729
16268 -64729 4365 153615 135097 52145 -123080 -158231 -72767 -61882 -106185 -212204 -175233
16257 -175233 -150608 -132194 -113396 -102717 -117701 -83331 -11225 51534 22886 1455 -85739
16246 -85739 -201241 -176751 -89145 -116955 -238288 -201494 -237710 -272303 -192775 -209523 -114367
16235 -114367 -34126 -63641 -59519 -3097 17108 -22611 -20552 -20649 -76193 -56167 36957 -51456
16223 -51456 -121377 -119508 -110398 -79567 -20348 -133713 -110365 -132050 -142040 -183037 -222993 -188896
16211 -188896 -163888 -114584 -109986 55228 43838 49222 41394 16517 -33199 -3577 51610 52487
16199 52487 -2829 -126812 -139185 -85152 16166 26135 61712 91760 141519 48332 -27892
16188 -27892 -3222 44890 37902 72688 16711 28408 88077 65364 20351 -7339 -46138 -154837
16176 -154837 -210938 -104547 -96611 -153309 -182528 -151621 -75911 -33659 -91153 -75182 -3562
16165 -3562 -27690 -7150 -106344 -220408 -86636 25395 -44000 -89233 -4511 5446 -12392
16154 -12392 -35903 59511 66534 -11280 -24279 -61963 -59099 -79455 -64020 -13248 73658 65409
16142 65409 83699 101989 118920 146138 81400 -38876 -171278 -120955 -6664 65577 118487
16131 118487 162362 116011 114633 107209 49774 42401 -15588 -38611 -73354 -79823 -108017 -156661
16119 -156661 -90498 -66493 -193 46759 -8021 -87834 -125634 -85544 -95527 -141261 -78133 -43670
16107 -43670 14823 41953 -17087 41741 84594 120734 16343 -39462 -36353 11655 4835 19736
16095 19736 80750 68185 -26016 56030 43561 6557 48225 24399 29387 56814 152059 211873
16083 211873 115300 42252 84277 64769 70389 45107 25353 76650 7619 33589 90469 145578
16071 145578 174381 257845 257859 204724 154137 155349 98189 88940 102395 41788 -28382 12393
16059 12393 -4024 -5445 -29174 -90136 -82164 25812 60282 -14258 -29540 -38650 -72021 -48704
16047 -48704 -86058 -2240 -1222 -7927 -7253 44932 10303 -65375 -155941 -217778 -206049 -157524
16035 -157524 -165145 -211094 -59809 41826 10876 42679 9387 -53822 -67841 4423 118474
16024 118474 108042 173513 113912 14711 13228 5703 9727 16335 -3885 31723 32915 58527
16012 58527 71675 -12456 -86908 -38621 -6622 -69097 -69796 -30048 -104331 -61838 -76512 -60909
16000 -60909 -15864 -22383 32447 60906 -1486 -36930 14183 -19390 85014 90297 28750 118395
15988 118395 169568 155889 32536 -72248 -69917 -61771 -109258 -85308 -52430 27771 -7933
15977 -7933 -38340 -30208 45495 57655 8004 -51560 -154294 -273173 -240737 -153354 -69450 -38281
15965 -38281 -35629 -81275 -35824 -110692 -130309 -66712 -87077 -68624 -83288 -95254 -89606 -125838
15953 -125838 -79436 -62873 -46517 -35990 -19067 110539 173683 192574 190409 51010 52210
15942 52210 92260 87253 -16763 -50474 1281 34129 15872 -49369 -25233 -72372 -25496 65787
15930 65787 2015 43561 21271 62612 37030 11392 -40441 -34179 87439 167160 131394 95712
15918 95712 69097 18626 -24287 -23103 55246 101393 97119 59656 27341 -79233 8067 -6154
15906 -6154 -49149 94821 29004 -50430 -69657 -23734 26672 51029 67147 79462 -6868 -80099
15894 -80099 -47459 -8187 75167 65708 149005 164791 120797 24399 -20416 -18648 -29126 9158
15882 9158 9093 -72322 -210402 -191896 -165491 -139532 -48905 48412 -798 -32782 14684 111677
15870 111677 158160 47745 43714 16683 11889 61963 54988 95325 108484 -4055 -64653 -53497
15858 -53497 -26443 -51778 -6960 24173 -13366 4392 15565 89085 90176 55045 47009 37787
15846 37787 -61232 -185962 -191985 -217112 -180109 -72222 -70498 14490 28174 64419 72702 1620
15834 1620 48856 28186 -9961 66735 64804 16795 49685 33253 -5096 -111470 -188343 -165305
15822 -165305 -53607 12811 30893 21997 38008 -11815 -76931 -103520 -102789 -174683 -239087 -119222
15810 -119222 59489 34668 -40817 -74127 -76477 -33746 75731 36908 89765 126436 29347
15799 29347 10610 -28314 -30721 -17083 -48373 -126785 -126085 4962 -20333 14839 191135 115655
15787 115655 -16009 -54389 7310 79985 59309 -7872 -6786 -178357 -205713 -186583 -137974
15776 -137974 -72032 44321 26176 26688 20498 -45610 -91224 -84352 -98612 -138505 -163913 32670
15764 32670 53598 95767 89053 38064 19179 105557 115474 -43666 -208727 -201706 -42562 -13303
15752 -13303 -66302 -40399 35144 45322 59857 25526 52542 117649 92415 66077 93039 58890
15740 58890 10133 -55456 -77971 -163798 -144696 -87884 -29326 9907 72372 75722 -4837 20775
15728 20775 33535 43745 -84777 -250003 -244485 -271739 -213208 -257121 -188428 -62730 -74108
15717 -74108 -91812 -118699 -96904 -50602 -66682 -63481 -101246 -114907 -193053 -217050 -104631 -24468
15705 -24468 31750 30503 -35182 -107078 -69342 -81983 -34335 -47998 -15649 70389 152858 144282
15693 144282 27370 -41809 -89350 -145333 -92908 -96218 -83893 -36296 -70364 -46216 -1255
15682 -1255 129329 120821 74557 79003 87740 50364 125589 136745 89228 77345 64561 -48457
15670 -48457 -138599 -122554 -196310 -203554 -148248 -144020 -114441 17131 106367 84593 1381 -98379
15658 -98379 -100129 -88868 -50328 -85224 -61482 -92554 -42505 -105051 -68242 45191 64042 90185
15646 90185 88565 73808 18181 66929 118896 79692 96631 64254 50583 34491 43316 -4116
15634 -4116 25244 48612 9202 -44254 -38963 -39256 12048 60159 72075 125516 120573 8324
15622 8324 -51599 -149224 -209243 17715 127443 100066 72793 24199 -74437 -63792 -31667
15611 -31667 68497 120353 43409 17383 -37146 -62824 12989 93947 44829 30941 -87433
15600 -87433 -217949 -157786 -47586 -15868 -27966 -38550 -65213 -114242 -19749 151632 218313
15589 218313 104718 86821 35452 -45976 -106195 -113692 -50070 -41222 3175 -35721 -39652 -8092
15577 -8092 -29445 -49230 -48021 -48989 21001 26514 -8283 15273 86209 36053 27537 -63884 -131359
15564 -131359 -145025 -118450 -146132 -189629 -183010 -128637 -58591 19156 -1236 14564 -46753 -75904
15552 -75904 -105371 -116498 -39011 -126342 -245724 -188373 -83214 -123574 31859 107378 82416
15541 82416 107712 -32390 -116044 -123820 -88931 -38362 25958 11998 -67070 -73381 -77146 -188223
15529 -188223 -182807 -156605 -171141 -117756 -1873 76747 56105 95992 130598 159957 101545
15518 101545 199911 284192 201229 132971 80907 -22597 54960 60778 135008 133604 42415 -46110
15506 -46110 -172442 -191054 -148320 -100208 -150484 -177555 -156678 -53575 -99061 -127905 -44366
15495 -44366 -72931 -71787 -15554 -50500 -109426 -169902 -163292 -106454 -89231 -69318 -63447 -97280
15483 -97280 -141598 -147146 -197836 -185448 -31010 69636 36799 85827 199044 113097 77668
15472 77668 71033 -65744 -66213 -86670 -166417 -84326 -46703 -138715 -119682 -128104 -177548 -128713
15460 -128713 -85420 -120258 -99166 -66164 -67980 -57064 69469 59609 -9267 -38463 -57360 -113494
15448 -113494 -116568 -93592 -12432 62389 93037 19024 -20034 22390 -58040 -93971 -84702 -67096
15436 -67096 -19128 -12916 -113538 -92810 -131651 -139195 -131034 -110744 -112092 -102400 -128788 -71606
15424 -71606 -143574 -117418 -8132 -25626 -20372 -34434 -77630 -83705 -116231 -48314 -35926 -34322
15412 -34322 -22644 47842 -61328 -42306 247 61796 -2228 81350 81577 58351 7678 -22861
15400 -22861 -13104 -55716 -148480 -161806 24616 126993 91165 72504 99913 105575 86389 89835
15388 89835 4412 -48485 -108304 -27005 69093 2801 -53442 -53276 -24337 24905 27043 -44603
15376 -44603 -166251 -216290 -159332 -140217 -150966 -51208 43491 -45679 -104280 -106350 -56054 8976
15364 8976 24534 33385 70972 56247 -22932 -26008 -141436 -234638 -259502 -220233 -215728 -128827
15352 -128827 -51255 -46750 -32812 -72340 -85226 -47546 -56213 -158713 -165262 -59816 92569
15341 92569 127648 88846 5524 -32627 7002 90798 74115 56179 39637 -22576 -46389 -87179
15329 -87179 -136906 -23271 18464 -22017 -51501 -93760 -140799 -73570 -148 -81662 -123216
15318 -123216 -108195 -97912 -45549 -84032 -71703 -25647 7055 38529 110988 158076 80021
15307 80021 -19950 2319 33893 10714 -29707 -60719 39433 107877 77631 461 -128715
15296 -128715 -83022 -63020 -30393 -11461 26062 69571 43842 -7392 -50551 -106758 -79665
15285 -79665 34936 58855 -35794 -127038 -151870 -147935 -137833 -161693 -204357 -206185 -192399 -153774
15273 -153774 -156726 -158332 -114026 27475 88208 83711 84540 46856 74238 12760 30699 71803
15261 71803 10281 6279 -79691 -10196 36574 31666 56677 57306 -14388 -73546 -1038 -13422
15249 -13422 -24026 -73295 -19443 -42027 -67738 -169237 -257946 -230042 -198748 -207479 -137537 -135316
15237 -135316 -81324 -13035 43562 13095 -84411 -101495 -207144 -164625 -138254 -54907 -35075
15226 -35075 -157507 -249531 -172549 -32347 41250 64628 91333 108064 7830 -140589 -186614
15215 -186614 -212669 -199456 -160070 -95218 -74637 -52176 -66924 -74602 -65318 -52396 -79140 -58405
15203 -58405 -8003 472 -22978 -106958 -42873 26969 65446 -41965 -91173 -83643 -111518 -110072
15191 -110072 -91782 -149794 -167144 -119912 -61058 -118761 -112665 -145552 -157574 -77022 20308 192393
15179 192393 143936 84478 -25046 -34882 53724 116062 111109 -21568 -155265 -129841 -102033
15168 -102033 -162355 -122734 -84324 -5681 74223 118494 124706 110990 92394 147872 33628
15157 33628 -10338 40255 -67960 -135387 -167549 -123770 -105748 -137756 -114345 -97341 -129946
15146 -129946 -138569 -162718 -251510 -177143 -75864 -96124 -48533 -72596 -59152 54351 198359
15135 198359 255352 224915 175814 205290 212661 185890 110357 15589 7251 49114 53023 -51465
15123 -51465 -147624 -201841 -175496 -124277 -96495 -85598 -207709 -238379 -109382 -21706 -58310
15112 -58310 -146735 -161712 -90731 -44905 -36573 -11113 -34945 -5135 101726 91087 -27630
15101 -27630 -22335 71089 114580 122578 160813 117072 40106 -7272 -55149 39568 2153 -72854
15089 -72854 -157108 -132213 40528 154559 101828 94739 28611 -39914 8502 49280 -43028
15078 -43028 -143392 -105762 -13703 -52525 4212 -27506 -95934 -167575 -140874 -110724 -115208 -7716
15066 -7716 22329 1158 -30148 -67452 -137056 -203529 -186293 -124629 -88141 -98921 -25167 27619
15054 27619 32411 58456 43150 -48559 -82572 -127114 -50635 -60612 -39265 41648 41262 -42945
15042 -42945 -69809 -34708 33689 -22385 -64311 -138363 -134524 -105703 -54730 -73967 -29284 20779
15030 20779 -22501 -78511 -71551 -65651 -23487 -8681 55066 76443 96160 123733 134487 50953
15018 50953 -32630 -141736 -152784 -102980 -79390 -34465 35642 58000 5366 17489 17279 -10096
15006 -10096 -61296 -69528 -125164 -125028 -100026 -5519 123868 110569 126927 106289 12119 -47247
14994 -47247 -29402 40068 82909 -27115 3149 71659 -12293 -80818 -116309 -142136 -111117
14983 -111117 -110033 -218203 -150519 -126815 -105321 -45917 -2419 -8923 -46068 -53797 7314 65678
14971 65678 71924 73456 3498 48616 10099 -128454 -259037 -328347 -316293 -241062 -127430
14960 -127430 -53308 38106 57356 126637 142325 80321 6513 -115162 -95453 -109952 -216370
14949 -216370 -83725 -22795 9129 53841 38319 34674 51473 -39749 -60034 -35679 -92069
14938 -92069 -94984 -47787 14158 10146 -45428 -93931 -144201 -175034 -86837 -44539 -32727 -15614
14926 -15614 -39494 94373 145478 18985 -146198 -271550 -266847 -161660 -153936 -112981 -141567
14915 -141567 -32392 -50495 3467 74449 183321 201437 139778 61235 71827 42967 -2898
14904 -2898 -56032 -28682 -10864 -94804 -115632 -113561 -100754 -78494 -103467 -64076 -60287 -71538
14892 -71538 -111849 -146605 -149451 -109957 -109480 -145852 -51224 35326 26066 -56925 13964 107499
14880 107499 74738 -42245 -176941 -229316 -169162 -97029 -64575 -4046 50221 -18787 -116500
14869 -116500 -106819 -81814 -150727 -79958 -52416 -82906 -84247 37735 50873 -17060 -95976 -25533
14857 -25533 38489 62661 92820 75948 593 21989 43628 66306 103403 150280 128447 118537
14845 118537 210059 117318 -1049 -23310 -6318 60229 58297 95179 78149 77738 54465 23373
14833 23373 30842 -4427 -15768 464 48132 23942 12243 26818 70035 65202 -19312 213
14821 213 65636 94897 64747 -24030 -77252 17324 110588 99241 -43193 -95125 -59514 -4113
14809 -4113 89587 48960 -27507 -32194 -98010 -127195 -14588 14025 51100 67117 -868 -54463
14797 -54463 -35018 -25457 -44629 -112815 -109896 -56902 21726 41149 -2932 -55551 -40118 74675
14785 74675 135535 120371 51295 70550 147640 158218 153759 78598 10906 6931 52122 75933
14773 75933 94186 10667 -13160 440 -92063 -107371 -117816 -57921 -34873 42324 33149 -21769
14761 -21769 47345 157788 126107 49675 45845 118289 145516 82480 -37657 -59137 -32474
14750 -32474 -39851 1475 -40618 -149242 -145719 -40774 -99391 -208364 -179773 -78803 45633
14739 45633 34283 22851 109714 142030 79090 49411 79470 64011 95542 26847 54507 56381
14727 56381 17855 -17285 -13520 -50266 -97873 -66190 -22248 20252 27255 13195 33968 104963
14715 104963 91514 138773 109769 -301 29215 217538 303341 193251 131091 145693 136299
14704 136299 90649 137795 229425 236337 127146 75851 -13031 3530 100686 134834 -27480
14693 -27480 -127348 -170880 -110271 -33307 11866 -39483 -96258 54595 155764 118027 178689
14682 178689 214068 169188 55408 -40782 22967 138023 125027 56062 62562 122890 100442
14671 100442 75152 34471 93579 55115 -21035 29494 44944 35185 41602 -17022 -5765 76300
14659 76300 102811 124147 117872 36460 -21242 -46884 -118646 -133357 -75542 -77421 -79868 -110022
14647 -110022 -116274 -53814 73024 28937 -25212 -24262 -20254 -44906 -86753 -83939 -145834 -136835
14635 -136835 -153255 -149093 -110248 -55286 69479 14480 -65363 -45453 10238 5285 -4512 85571
14623 85571 98255 72345 2851 -31873 -58080 -66691 -129419 -104260 -52748 -86294 -33605 -37085
14611 -37085 2498 18231 -50375 -110387 -157338 -30302 3930 -49846 -135350 -144259 -119387 -94555
14599 -94555 -32992 77873 9505 34820 78633 19395 -109871 -55055 -69054 -67322 -90771
14588 -90771 -27640 75106 130266 171608 75320 14925 8440 24413 -70552 -150503 -198686 -213737
14576 -213737 -167101 -159349 -170606 -169205 -47023 9274 3159 -36148 -101257 -123446 -89360 -47707
14564 -47707 59406 40457 2483 414 14310 -61921 -60139 33673 62976 135240 136787 86427
14552 86427 116676 19022 11179 -15679 -5831 -39846 -187911 -165772 -49259 10989 35883 -95955
14540 -95955 -169482 -133058 -92582 -12140 112980 169529 62045 -59440 -104854 -114593 -100045
14529 -100045 -113981 -79502 -91862 -57195 -7799 32427 7337 29854 -25999 -12271 63015
14518 63015 46957 83735 134544 36360 -13833 43246 27731 76185 134551 169049 148741 74209
14506 74209 3403 -34991 -47601 20418 29979 27465 99116 96660 48782 38616 72763 19549
14494 19549 75464 125417 108785 52568 -44024 -48434 -8313 1079 16005 -5090 -10710 -44873
14482 -44873 38427 11480 -87753 -97702 32954 12658 -50364 -21310 84274 102936 19798
14471 19798 -48306 -109200 -190939 -100408 -46480 -32895 3765 27591 33371 26948 102218 156934
14459 156934 59999 114702 86196 47922 27626 2566 -9465 49485 63562 65098 -22630 -1930
14447 -1930 49077 25343 7126 16609 50810 37398 -33607 -56078 3970 -5652 -62667 -102288
14435 -102288 -49209 36114 -20161 76089 123502 -38506 -111801 -179895 -167615 -100217 33073
14424 33073 55972 -24796 5756 23242 31647 94952 119658 136479 12047 -25830 -19497 22772
14412 22772 -39638 -98929 -94831 -127796 -26087 78836 134319 197996 206632 159645 96950 46107
14400 46107 45149 1795 51534 -16292 -35061 -12714 69714 39078 17722 -14967 -26554 52794
14388 52794 114921 95565 118507 141151 113542 156187 145805 150171 57949 -66365 -17683 39136
14376 39136 11150 105464 141926 133255 32334 1152 -35362 -103333 -59491 -30996 -14680 41628
14364 41628 52758 57842 99444 84297 32095 20017 60199 71127 124577 70420 110191 139395
14352 139395 69825 -28738 70378 140856 158370 204159 194805 86315 55998 -57967 -101532
14341 -101532 -38465 48509 -20942 -55981 -154064 -275603 -215501 -175441 -209768 -142027 49448
14330 49448 -36503 19582 11961 37725 17268 -131993 -183527 -56716 67312 114040 -10993
14319 -10993 -42537 -17826 -40397 -11850 53375 8300 5838 -5785 -52633 21426 -59973 -26024
14307 -26024 147310 150379 56983 42165 113970 85772 -38733 -106633 -100234 -35804 -3585 -28202
14295 -28202 -46153 -104280 -92568 -70400 -5034 127448 120828 85342 64879 -41158 -84948
14284 -84948 -44445 -22616 44045 -7444 -106304 -205430 -237166 -235243 -267366 -138944 -50717 -39101
14272 -39101 -13128 -62493 -114393 -90763 -55264 -52044 -91763 -88829 -78014 -62068 -95820 -45692
14260 -45692 -30348 -78182 -43866 31211 -27550 -99973 -181190 -142212 -120535 -138207 -216261 -217408
14248 -217408 -102708 -41797 -69002 -198292 -262853 -279495 -196883 -156262 -20585 74973 120656
14237 120656 79993 -54779 -89044 -32806 65417 131925 170292 135226 140249 125818 107212
14226 107212 191843 222867 188331 195257 93268 20845 49498 94970 11788 31563 52827
14215 52827 58985 110372 72562 -49138 -107297 -20907 43859 -49802 -117752 -40154 -27183 6514
14203 6514 4630 84356 48683 -9495 16789 69295 24405 -50072 -118220 -30062 114801 181684
14191 181684 131262 116433 117577 50684 -19288 -27692 31684 9265 -45334 -82203 -25373 -840
14179 -840 55771 25549 6273 -52651 76541 139084 76937 40462 94193 144317 106117 128157
14167 128157 108871 144314 176519 76076 156732 200279 206542 102079 132317 143943 76916
14156 76916 105397 159427 73078 12935 -44925 -55950 -43548 -93833 -68464 -139591 -56542 35572
14144 35572 26466 28952 10028 -34022 15873 19602 74369 76826 66375 10480 -44817 -61062
14132 -61062 -132053 -81973 -100257 -36188 105859 169577 130353 89358 108854 159513 130109
14121 130109 101720 119767 120365 118020 86633 88443 138702 81984 -28259 -87832 715 -21827
14109 -21827 -105756 -26798 88986 20177 -23303 -68496 -12797 5913 -39471 -63041 -83054
14098 -83054 5277 9984 36643 61201 84200 147786 105501 117816 160863 77642 -45599 -9789
14086 -9789 -66410 -78590 -69191 -86553 -100815 -77055 -38101 -25685 -55864 28247 65125 53826
14074 53826 -15659 -813 40315 63607 154313 150103 116780 98232 120139 156634 135271 112377
14062 112377 137645 101020 88793 101856 113941 -14729 -131660 -201011 -225134 -324487 -232513
14051 -232513 -139973 -29020 29820 23712 72971 43953 -9107 20307 -14355 53585 20003
14040 20003 -42948 32137 146867 222357 218490 154823 85819 35732 3463 20376 47786 -28946
14028 -28946 -93823 -67107 6577 -39568 -128833 -88958 -125194 -129674 -66119 15760 63513 44514
14016 44514 -13711 10773 43345 -2408 -24165 -792 10775 34025 12468 6594 1409 -7918
14004 -7918 -148040 -176852 -69028 1247 69827 25005 -7702 66438 -32890 -28744 -30925 -72710
13992 -72710 -3926 119215 133538 77769 -24733 -11073 -27096 2083 34450 55471 35101
13981 35101 68348 88982 142820 125682 105480 28054 -41828 26558 67073 57367 35891 49239
13969 49239 43652 -89160 -89213 -113950 -160131 -128891 -40118 -5574 -11477 -86046 -92399 -90029 -150662
13956 -150662 -109768 -139898 -150246 -130636 -12971 -21605 -107814 -117712 -83641 -92665 -6356 -34686
13944 -34686 -44182 -52100 -97846 -57626 -79744 -26712 65784 83397 -484 -31827 12559 -28988
13932 -28988 12755 79314 18735 26677 2234 50301 118681 203363 186313 156188 165469 175529
13920 175529 131028 45263 37403 102951 133775 -24561 -87562 -21821 -100937 -41193 -24554
13909 -24554 47353 90558 79756 11905 41132 133761 160530 50541 -18158 -44500 -152494
13898 -152494 -107475 -48023 -73020 -51701 58901 132307 232948 250672 190824 107936 146309
13887 146309 157415 135345 102096 28859 22713 79792 82971 68896 31766 140687 192056 107904
13875 107904 87987 227354 223832 160723 9662 -123500 -200353 -176902 -152050 -119914 -99517
13864 -99517 -188 -48628 -91663 -97215 -57787 -126926 -196871 -176805 -85314 -76248 -85719 71274
13852 71274 90455 -10809 -42746 -26045 89001 52505 -5316 -63449 26897 109390 90081
13841 90081 97532 61377 22134 54871 119667 -6661 -52816 -66271 -38489 62866 122388
13830 122388 84952 94033 8525 47289 75935 151419 277577 260441 172890 41221 -10790
13819 -10790 990 -6654 8214 -5633 -36368 16824 78445 26104 -1142 -66988 -26361 15964
13807 15964 23498 9359 -11185 4783 78342 63709 66102 -8162 51890 135423 51778 -29090
13795 -29090 40986 47553 16337 70752 57354 -13314 36133 98001 68215 105101 144481 67089
13783 67089 57627 60973 14941 -45472 -89460 -45213 -21505 -116034 -99895 -66714 52106 88933
13771 88933 18587 27971 60690 136706 120278 63458 147783 174860 75274 7679 -34175 47027
13759 47027 54374 22910 60665 128180 151916 127687 117043 39747 84954 88928 70273 99253
13747 99253 59466 -23815 -76031 -93302 14691 109457 102843 33412 46440 -10234 -92647 -119723
13735 -119723 -142789 -156526 -100732 -43068 20892 -70393 -35564 -47954 -47073 16254 73554 79570
13723 79570 -27362 -77196 5496 -33169 -5379 4702 25172 59630 64825 21199 -49070 -48848
13711 -48848 87524 187392 233907 259544 197438 99712 33250 -5168 85139 101056 37221
13700 37221 49556 70486 11166 17028 -95894 -86843 -44474 -23263 41229 82571 26530 97318
13688 97318 134254 44054 38702 48150 92566 106630 108967 59757 -234 -97510 -163525 -134845
13676 -134845 -74201 32861 68361 166891 185014 62334 64413 81278 145944 230827 239263
13665 239263 148682 83683 146069 177837 170479 100135 29808 64418 81182 155267 134209 -529
13653 -529 10511 -35 -47685 -144737 -136610 -3776 20874 -73565 -5498 -41407 -59343 -38298
13641 -38298 47135 118466 103227 64682 -33461 -52137 -43218 2085 -34677 -26963 26094 34343
13629 34343 49189 38299 31090 52524 70220 36365 109904 192965 100101 33414 -2746 -58424
13617 -58424 -115062 -157289 -33173 6037 -23626 15476 36599 123044 33841 47831 118706
13606 118706 71281 -9612 48716 38034 -11101 -2486 -37731 -61695 -13665 18378 -21160 -69844
13594 -69844 -20385 41554 66176 11130 10777 112028 157297 116793 32435 43568 52491 29305
13582 29305 67111 134661 109907 46527 71719 140377 87409 116912 145606 95730 75902 11353
13570 11353 -16214 -128274 -66122 -38157 43541 136732 78953 8916 -15717 -4527 24899
13559 24899 122601 152989 157707 106093 127227 243768 274561 220958 174582 43007 -50755
13548 -50755 -26588 55237 33564 -25965 9804 52500 23219 71288 102401 149668 302121
13537 302121 249415 232275 133825 47380 66030 65543 34367 27784 114404 149078 56056 280
13525 280 -11255 37537 53833 -18761 36311 -4258 22445 4018 5428 -32883 -18075 21643
13513 21643 32991 13244 25521 27243 17009 79420 98845 147250 166257 8530 -91724
13502 -91724 -79264 -4238 -39126 -79242 -72058 -28033 -39672 -90644 -69800 -27349 70873 192173
13490 192173 106244 50672 100794 135838 137415 41732 7127 111802 146595 53011 -7329
13479 -7329 40865 31032 52764 87347 12235 7894 67527 88949 68658 46675 30517 91825
13467 91825 83011 111874 106446 71164 92156 194930 227598 204985 152553 114512 7509 43126
13455 43126 68719 53424 1769 -14910 54359 70371 46790 103710 92378 63353 40631 -1612
13443 -1612 75280 127769 81925 93418 103959 83177 118118 84242 9602 41279 62586 69861
13431 69861 61581 38546 -31135 -114634 -110019 -49137 -3814 34908 20067 20595 114982 100525
13419 100525 -10932 -77884 -167655 -160274 -155429 -137968 -63150 -39298 -10854 47969 98868 1525
13407 1525 -77403 -17011 55484 176805 118126 103796 70513 77801 -12254 -50571 32916 -15939
13395 -15939 -70350 -40120 -120347 -216516 -137657 2483 117469 147583 56164 -53697 -75299
13384 -75299 -82296 -46033 23016 14774 46529 35208 76208 122025 159358 100574 110004 78
13372 78 -57572 -121840 -37589 49230 38504 59102 144878 176417 269373 255768 233866 253539
13360 253539 229995 187601 92978 26729 -32745 -87891 -175743 -172380 -76524 -27480 95761
13349 95761 20255 -75949 -21570 45183 92601 139872 61358 76761 36842 -24438 50826 135872
13337 135872 121053 79779 51808 19786 6352 46520 91778 118852 45426 -18223 65313
13326 65313 160533 233009 140541 -8913 7448 -3479 72697 136909 195285 272122 164910
13315 164910 172091 146650 90728 66487 39292 -67648 -96056 -26190 -48586 -85048 -12270
13304 -12270 37643 15281 20529 31197 68561 230003 193423 121293 155494 212323 106158
13293 106158 61135 35959 52053 77697 83973 139344 178552 170140 131567 163890 219027 234264
13281 234264 178805 158786 114776 84837 126449 100485 -12863 -20206 -58653 -91410 53747
13270 53747 129547 150814 137829 156337 93664 121008 177057 134267 102955 100255 104201 53852
13258 53852 -41770 -67900 -42361 10705 108186 167124 84514 68152 62443 89647 81828 175292
13246 175292 183911 178053 157365 152399 161987 199335 195310 111339 175728 219467 150243 118226
13234 118226 147034 166027 113040 44019 97949 175891 288861 215642 164447 190132 160248
13223 160248 163336 138053 20879 -34538 40975 133598 120009 86385 108154 75010 62595
13212 62595 54254 -20474 -159096 -114463 -65713 30403 117753 99235 -17496 -23372 11021 63338
13200 63338 95579 33376 10806 51531 106835 130486 189828 209024 172366 13296 25650
13189 25650 41702 125985 188243 164066 204530 307413 283449 290785 192490 116858 58909 131067
13177 131067 190496 89914 26849 50792 119348 154982 226020 251286 220084 229840 241387
13166 241387 219441 158549 244654 257662 150018 34678 77356 121288 75618 89669 90879
13155 90879 126317 64910 58101 16128 46956 111851 92595 138362 116405 110092 160415 154198
13143 154198 153577 136339 52677 35227 12083 32556 168074 226796 162354 213440 175914 172745
13131 172745 262246 238538 200295 263733 281371 200826 156598 89910 74907 23805 -22268
13120 -22268 -12675 -43886 -31764 -19778 71898 88876 88903 183645 151850 84292 71803 134143
13108 134143 126927 129350 107313 171245 110786 77971 121984 147903 104479 103257 185130 263435
13096 263435 278930 210223 172985 192169 182532 249446 300428 269231 293961 232736 133496 103144
13084 103144 64294 28153 147165 164729 220213 322292 301168 185352 135338 153629 256719
13073 256719 308203 387152 419789 369699 236593 82838 27168 37524 130582 127974 22109
13062 22109 67888 120017 109258 109998 137287 111737 90591 20941 50450 89072 85692 65624
13050 65624 152309 92465 63871 38986 104856 224286 319583 334275 338374 344132 247933 199180
13038 199180 170233 120843 47778 93408 83204 37360 48889 83387 75634 121575 37733 129381
13026 129381 188116 129379 106206 107645 62708 88031 100918 133627 256968 336211 315716
13015 315716 217430 276081 286748 176288 124738 109267 183960 189383 182600 173505 185985 182686
13003 182686 183698 177433 251461 305948 282682 257524 265544 279499 338074 312024 264614 291093
12991 291093 262861 277493 330011 339819 288130 174260 145013 214710 328665 271647 223284
12980 223284 255446 221010 184354 92655 114116 117650 122014 151161 159548 215661 237188 219557
12968 219557 163536 143586 116655 147594 95050 91083 209357 257840 210909 214812 192853 128770
12956 128770 123344 157179 73108 3346 -41479 -16179 88591 170876 171857 248830 244218 152317
12944 152317 139548 189923 234024 254360 228509 217172 229635 289300 258168 330470 280267
12933 280267 202504 176199 223152 301479 363707 253698 283720 241559 251731 276608 282538
12922 282538 328729 345077 342471 357065 248081 210053 228065 424808 506719 337911 211377
12911 211377 233618 277591 310524 314334 298373 268458 264018 238449 227825 211051 248625 264057
12899 264057 222940 190750 266787 280602 248663 399654 423175 398652 386793 291464 367840
12888 367840 399183 395512 377060 318222 337837 270491 179263 123459 204910 222479 215536 157210
12876 157210 51634 24795 80250 244236 341185 377478 336300 326119 365192 372004 313882
12865 313882 234617 113635 113862 182682 286679 253051 209071 187215 264007 351253 373140
12854 373140 359785 318856 383233 346285 368741 422050 387921 215715 216902 318615 372288
12843 372288 336644 360033 362784 331168 348749 341824 348485 281836 195779 220712 272330 292268
12831 292268 338244 258017 288543 438588 420611 412019 465507 527920 497565 362981 312659
12820 312659 346622 285711 340001 382171 367284 304678 276670 240498 219638 296776 250708
12809 250708 269568 302060 268545 204573 202679 312168 359915 267868 277395 329618 360716 362428
12797 362428 368381 393857 409393 284150 250414 282190 236017 231620 302671 250035 322070 363668
12785 363668 501761 398110 365476 376259 378373 337306 346745 283293 400767 494725 540246
12774 540246 534360 562068 490596 384055 361589 410133 368553 271368 232567 331958 359123
12763 359123 335315 289265 337561 310044 352131 417642 513354 481309 448761 526597 491922
12752 491922 494581 478317 487273 534593 391460 377395 358945 378815 382355 331334 401424 441058
12740 441058 516555 490665 436831 409746 435482 393049 384803 417618 448852 423028 400012 444802
12728 444802 484802 358205 369245 448191 494202 520892 488684 515429 553412 580650 571596
12717 571596 457415 423569 438219 473239 515462 534455 480205 455920 431661 413569 437830
12706 437830 347713 220142 306582 371272 352154 393616 461461 456661 391686 425967 405179
12695 405179 356448 393503 463925 484221 418337 294444 326705 402700 404799 449949 495331
12684 495331 604079 576514 573311 537746 553962 563807 472894 415360 511536 614348 641418
12673 641418 566182 513471 484210 553899 624310 595847 632847 650259 729139 739557 719692
12662 719692 743388 704485 602111 520268 441995 439501 429939 444793 468140 444199 410233 454025
12650 454025 412111 379469 317583 325080 324558 268080 388974 463239 386286 396629 489783 531176
12638 531176 601332 607803 643683 621583 644174 623651 601720 589578 607792 557173 575234 555734
12626 555734 430189 444970 502079 580647 642999 604988 576579 590552 636450 621649 611080
12615 611080 580291 540628 589409 613846 697223 807689 777756 660738 597223 632044 593032
12604 593032 657689 673136 659229 638376 597059 587097 581147 634700 571174 505858 533891 577384
12592 577384 604472 568673 630581 694857 669154 571104 521102 593917 565378 539904 642352
12581 642352 725287 792259 794011 725030 573838 491012 539003 613422 583988 588289 620627 664224
12569 664224 660969 683761 740689 797168 792422 786654 807042 717383 539792 522912 590982 688404
12557 688404 666072 690214 720379 733464 733970 672181 664844 717405 750545 744417 627587 613985
12545 613985 677381 779546 840113 902670 906473 769861 700740 749335 798723 808268 752483
12534 752483 683552 695301 713526 708754 689979 699493 616681 517927 600237 645875 733604 798978
12522 798978 792289 759217 720066 744727 782360 742669 777381 697637 655211 661244 667074 767526
12510 767526 862800 929951 965661 935211 846241 780496 771147 820673 861395 796392 866162 866197
12498 866197 912055 935404 901889 866050 773947 785831 825548 839559 808596 839875 844187 838221
12486 838221 854599 881647 904505 937312 850931 724551 754114 732877 749601 780460 888470
12475 888470 878708 857431 911619 999201 1025563 1035199 985524 946799 881892 880617 918933 986167
12463 986167 1041633 968638 912411 1012239 1062685 983102 935773 864346 904143 1035895 1124584
12452 1124584 1046032 1000040 1030471 1048606 1090024 1018560 1039061 1051829 1062120 1007742 1034519
12441 1034519 993587 836717 738963 718571 772415 857347 864374 798411 744145 737204 732663 897573
12429 897573 1016123 1029987 994504 1090883 1141524 1137464 1090532 1052211 931127 1033890 1037417
12418 1037417 1146430 1187915 1093530 1173972 1241540 1166157 1111430 1036229 995190 991942 1081024
12407 1081024 1105517 1109204 1138839 1000288 1041937 1018869 896201 997366 1033207 1184876 1245858
12396 1245858 1263344 1283286 1274798 1322665 1410409 1418277 1316935 1229518 1198665 1241691 1308713
12385 1308713 1376219 1332674 1393616 1330970 1313880 1336544 1287062 1222140 1250180 1233274 1247904
12374 1247904 1285122 1324722 1386288 1379146 1277783 1298899 1318576 1327992 1285832 1312995 1322700 1331306
12362 1331306 1358488 1346706 1409270 1430394 1496003 1585668 1526461 1449014 1375607 1311464 1362010
12351 1362010 1350947 1374756 1392627 1337665 1384705 1404231 1490225 1544513 1570458 1606525 1600274
12340 1600274 1570493 1469196 1512130 1626247 1596176 1560231 1592359 1499678 1372437 1292987 1288329
12329 1288329 1315322 1446870 1573584 1620522 1679406 1642783 1539007 1560466 1654659 1702493 1633626
12318 1633626 1621557 1556407 1605127 1470140 1368375 1420213 1496716 1500112 1426542 1485465 1447088
12307 1447088 1370635 1401411 1491330 1459686 1457710 1510496 1520263 1530364 1512912 1502972 1510936 1535087
12295 1535087 1614084 1641229 1622923 1710338 1777382 1744002 1669680 1699173 1734893 1709621 1702192
12284 1702192 1835764 1888649 1878779 1902861 1880604 1865519 1820340 1841742 1793241 1889454 1987819
12273 1987819 2011521 2021000 1941644 1838376 1810222 1898622 2024090 2123349 2148485 2080816 2104438
12262 2104438 2149357 2175924 2205708 2240315 2171832 2231417 2309448 2267982 2228532 2143862 2122133
12251 2122133 2121665 2085277 2114482 2121495 2114463 2194855 2297029 2250651 2279870 2358989 2301657 2256130
12239 2256130 2246720 2288843 2359045 2335718 2201862 2215392 2285764 2295657 2329796 2313509 2335739
12228 2335739 2341443 2389821 2414069 2368205 2324833 2216198 2249035 2283067 2332613 2315540 2479768
12217 2479768 2555126 2578561 2559883 2549970 2470795 2397140 2436696 2472290 2565391 2611964 2555900
12206 2555900 2500495 2491569 2533841 2613022 2562394 2574074 2576912 2693936 2754400 2693570 2623497
12195 2623497 2613022 2617281 2709229 2813352 2834226 2721131 2802494 2943118 2949174 2835798 2813621
12184 2813621 2920396 2939500 2922269 2945959 2830797 2818949 2798139 2829762 2859614 2867302 2903770
12173 2903770 2914414 2960139 3010874 3062823 3187418 3188818 3057632 3016314 3129478 3205418 3229089
12162 3229089 3239689 3161919 3171906 3247930 3338148 3304800 3307656 3338956 3299161 3362535 3393626 3387589
12150 3387589 3397469 3343451 3307307 3415304 3565386 3558232 3517779 3474165 3492731 3459717 3404982
12139 3404982 3344636 3432304 3557013 3615657 3558684 3522809 3640514 3679380 3650710 3761195 3796272
12128 3796272 3838876 3869218 3872798 3825030 3718566 3705659 3709961 3852289 3951543 3918824 3867922
12117 3867922 3889054 3927337 3927424 3891183 3852455 3792214 3813021 3897674 3992322 3944818 3931178 3987870
12105 3987870 4053930 4068546 4092029 4099552 4150514 4189891 4203629 4201211 4228789 4283956 4374610 4422782
12093 4422782 4387025 4356850 4443967 4404200 4422520 4439996 4371796 4286706 4331599 4363111 4435289
12082 4435289 4571142 4643763 4782675 4783516 4773051 4776964 4640254 4614941 4636940 4675381 4695854
12071 4695854 4693501 4707228 4658688 4621762 4608516 4679957 4741766 4810243 4744181 4687752 4735644
12060 4735644 4847442 5005980 5112507 5161665 5159624 5147882 5050968 5043488 5060601 5103228 5129605
12049 5129605 5108670 5240417 5302504 5265965 5257090 5289994 5414567 5375242 5397551 5498639 5547281
12038 5547281 5437379 5348761 5459213 5600520 5556762 5640262 5710649 5669455 5602225 5518435 5463700
12027 5463700 5456838 5505008 5457607 5443108 5608793 5698753 5723555 5666550 5684524 5783470 5779692
12016 5779692 5832349 5882740 5895293 5873244 5883708 5900419 5913382 5961268 6027281 6037353 5818080
12005 5818080 5751300 5865087 6053027 6050752 5960681 5976586 6072599 6090340 6123039 6134964 6111321
11994 6111321 6169659 6209913 6227782 6243107 6285551 6279582 6271364 6320886 6320188 6290532 6360769 6473900
11982 6473900 6489236 6470684 6388598 6404745 6445755 6412961 6403702 6558903 6605409 6602513 6447541
11971 6447541 6409317 6463927 6481096 6400986 6405665 6500844 6608477 6688644 6774561 6777436 6771071 6768859
11959 6768859 6757574 6709239 6689291 6654699 6647400 6664268 6797907 6832408 6838422 6795621 6719879
11948 6719879 6658294 6632861 6728721 6882766 6944235 6859674 6723227 6686221 6731478 6733351 6667854
11937 6667854 6609405 6642984 6651404 6703674 6831180 6844297 6792509 6741580 6729937 6751452 6760064
11926 6760064 6754881 6776245 6741077 6702743 6656420 6628014 6694422 6709300 6741472 6851466 6863795
11915 6863795 6816602 6830510 6815393 6695948 6623218 6679531 6790491 6855896 6724383 6710574 6742823
11904 6742823 6732764 6699499 6652547 6632882 6723885 6642470 6564729 6571839 6619087 6560297 6602003
11893 6602003 6618853 6597574 6566078 6577959 6635818 6638958 6626335 6606808 6622166 6609107 6586877
11882 6586877 6599637 6639339 6592378 6553110 6560995 6515984 6505132 6489875 6475864 6476176 6468115 6381035
11870 6381035 6322417 6395984 6405244 6409371 6405355 6423403 6447847 6418402 6282867 6196779 6191369 6219403
11858 6219403 6173825 6102735 6169730 6253561 6277668 6174897 6167653 6195059 6153365 6121145 6110784
11847 6110784 6057453 5977075 6014935 6187032 6140200 6013764 5988336 6066935 6098240 6055962 5983828
11836 5983828 5953352 5922618 5878838 5806216 5684438 5712549 5682949 5647176 5616667 5521893 5565220
11825 5565220 5589318 5571199 5582488 5575259 5530528 5496237 5423109 5351944 5287024 5250163 5284573
11814 5284573 5310628 5353157 5432397 5394468 5383382 5385858 5293536 5080787 5019553 5149870 5160690
11803 5160690 5064080 5053181 5106457 5095691 5031645 4947621 4960345 5045290 5100138 5194358 5078083
11792 5078083 4923798 4875602 4863763 4852120 4823896 4834544 4850189 4849427 4773171 4709183 4698689
11781 4698689 4641805 4589240 4580484 4654947 4706934 4723268 4760321 4637308 4504951 4508018 4555981
11770 4555981 4473621 4430543 4477771 4505543 4468075 4309336 4290317 4332231 4366154 4429541 4375785
11759 4375785 4359465 4386146 4214175 4203961 4202678 4235848 4144430 4170716 4198051 4234155 4196508
11748 4196508 4087442 4032460 4046031 3999679 3973882 4007917 4019723 3988784 3818413 3776159 3957229
11737 3957229 4035387 4059445 4020781 4019013 4049738 3964226 3850688 3857142 3781499 3723130 3709825
11726 3709825 3731433 3868954 3818406 3695400 3653397 3717887 3825364 3815678 3699246 3511384
11716 3511384 3522001 3487866 3478144 3463085 3405880 3391080 3363006 3386291 3436545 3407938 3359597
11705 3359597 3398503 3309024 3263211 3311379 3321218 3298394 3307836 3185089 3183183 3205867 3234921 3238665
11693 3238665 3211781 3192770 3231653 3188312 3123256 3096223 2969814 2975354 3013512 3041731 3023068
11682 3023068 2949070 2912136 2867936 2885149 2867623 2840310 2756361 2819932 2860637 2789160 2793808
11671 2793808 2790403 2682421 2753725 2862221 2845345 2757639 2711458 2683389 2608727 2559464 2676089
11660 2676089 2699614 2729824 2713733 2693220 2654076 2600899 2543439 2537615 2517725 2529060 2536484 2507667
11648 2507667 2534665 2562888 2584416 2589081 2683080 2617256 2566778 2574286 2558040 2517394 2416875
11637 2416875 2392233 2426533 2387020 2397091 2358845 2423035 2449825 2395950 2308149 2328525 2372086
11626 2372086 2309188 2323799 2292211 2272128 2332628 2307857 2241305 2173596 2230009 2293210 2297099
11615 2297099 2286742 2373023 2454223 2398439 2361017 2337444 2287510 2264950 2179603 2220304 2206083
11604 2206083 2219552 2172240 2144055 2160912 2043174 2158295 2148806 2047314 2059729 2053610 2013711
11593 2013711 1972274 1920571 1893824 1981764 1989783 1941748 1900776 1971630 1988757 1967042 1941447
11582 1941447 1907183 1841613 1885186 2027040 2008847 1944498 1884394 1874889 1954720 2021449 2060511
11571 2060511 2011557 2012013 2015579 1969217 1925308 1831469 1866526 1894498 1962308 1905193 1750845 1756233
11559 1756233 1641043 1559283 1531521 1526896 1572374 1613024 1666236 1550977 1444346 1447843 1426032
11548 1426032 1473859 1554046 1587800 1533741 1534145 1530362 1616353 1561800 1581786 1615600 1682014 1665545
11536 1665545 1634318 1587199 1540519 1468458 1486954 1398030 1355553 1410490 1425296 1421531 1437876
11525 1437876 1382857 1337572 1278327 1304834 1395884 1443392 1421935 1444408 1412567 1455325 1524453
11514 1524453 1537427 1486872 1372355 1368355 1453241 1457319 1419566 1423633 1322443 1211905 1202365
11503 1202365 1172894 1235713 1439891 1482607 1374731 1390414 1347294 1373670 1412563 1464156 1407203
11492 1407203 1312564 1296254 1275348 1351131 1452905 1301638 1180635 1207785 1181418 1083432 1160305
11481 1160305 1236115 1274109 1210149 1039278 1051999 1152130 1183834 1231994 1137593 1137988 1171513
11470 1171513 1092371 1046845 1050235 1136635 1213558 1340024 1310641 1278071 1231427 1240557 1241488 1118504
11458 1118504 1035373 1084789 1160371 1139935 1099616 1073852 1002877 1122869 1276949 1257238 1228363
11447 1228363 1209724 1195203 1142630 1118010 1052146 984597 999558 945079 964579 915528 991785
11436 991785 965790 943928 982936 968111 968016 979018 902340 861124 904559 894337 873823 842046
11424 842046 807898 836665 814100 769614 923865 996655 981220 942486 974293 1009456 1058281
11413 1058281 1071066 1069451 988218 960643 881942 876182 896153 948743 966788 997904 960545 881221
11401 881221 807810 816269 836430 754536 755583 818668 934476 917955 874461 832202 780726 780380
11389 780380 900789 911666 831552 795680 771583 824491 907287 850037 766904 731878 719679
11378 719679 817173 800194 830039 867118 880235 913253 836844 774484 700658 744547 867459
11367 867459 890086 814255 762304 771738 712303 609001 560070 649656 685157 721707 705703
11356 705703 798127 790965 642819 545021 547618 574369 591375 617549 611389 602360 670116 869787
11344 869787 826972 734167 736997 739004 672452 639802 698523 658569 615012 630547 757840 759741
11332 759741 759479 748367 743867 774199 798255 757954 642532 563389 555418 609553 618604 669300
11320 669300 646112 631902 632909 587290 484805 460577 466355 480459 511212 593671 674040 636982
11308 636982 622025 583439 735218 844037 808194 854502 821922 846620 792097 698337 624887
11297 624887 588080 580790 562250 502885 538114 504382 480622 520514 490887 503980 554863 593165
11285 593165 538268 562012 586024 526516 508330 648867 691179 759951 735972 623050 547422
11274 547422 527449 448065 471725 512495 499286 470251 513030 558401 621765 618504 555288 491963
11262 491963 427407 416572 525346 636116 510946 474057 490025 481591 428215 393642 358483
11251 358483 357637 296029 282921 250034 410175 565705 582425 538665 447982 372792 339110
11240 339110 427981 423593 400654 400502 372148 305125 209009 165168 136373 234121 312580 350352
11228 350352 307977 362753 432527 434624 428857 399908 349096 323196 374470 415347 395602 338796
11216 338796 249510 215132 265404 352726 305054 232385 291486 343472 324918 345158 442670
11205 442670 397231 245686 214140 266877 271333 360267 371517 402578 399246 418204 393392 358655
11193 358655 297648 288977 271949 262675 329854 320369 273819 287181 337145 269529 231276 265985
11181 265985 291345 250071 246342 296563 341539 365844 375504 430890 428764 427187 358996 330485
11169 330485 323341 304144 342883 301096 427723 471842 321178 248116 316859 280120 403283
11158 403283 508418 511498 464385 437239 561274 712968 852392 1052628 1267273 1482482
11148 1482482 1872897 2271829 2545275 2652356 2419449 2174831 1792754 1425238 1163166
11139 1163166 1030871 903108 806600 873700 829160 767583 693014 603636 532457 443781 427926
11128 427926 387352 328666 319557 350038 315091 303284 310847 307460 284778 283385 243554 340714
11116 340714 369009 331503 388676 336839 334774 408031 348420 268518 302326 345984 493311
11105 493311 574979 498651 455153 389337 305483 288094 355213 278547 288199 346319 301252 279723
11093 279723 268631 314035 286824 194028 137744 164346 280913 327669 375919 340082 381783
11082 381783 511182 489930 315660 266315 285607 160848 -21176 -218191 -182351 -145595
11072 -145595 -103147 -90444 -6779 4844 40937 63128 25990 -55846 -111060 -34416 42553
11061 42553 69709 28181 -36321 -57843 -154067 -109991 -58812 21456 136952 185704 164169
11050 164169 98437 154959 215068 281905 265216 188963 202169 178707 237283 316863 312676 297490
11038 297490 375357 461089 424765 501552 567981 576331 608270 593641 522746 522649 523139 493963 504077
11025 504077 497991 557243 689909 678905 706414 626922 739470 780918 739481 643190 540326
11014 540326 461227 460552 470433 462056 563533 684112 647667 634959 655936 618096 606561 573162
11002 573162 586063 596831 558919 654444 699700 677539 635234 624428 619488 620418 541360 449910
10990 449910 443132 381104 106504 3074 60038 118713 184628 277597 303539 260256 224558
10979 224558 150172 191099 245654 302609 296828 239854 131788 66978 186000 196996 153712
10968 153712 156314 153754 251128 153303 42058 -98654 -93005 -7572 79347 121472 234910
10957 234910 202630 103522 112842 139025 65374 10381 12032 123784 95288 -5631 26803
10946 26803 -4998 10651 36814 30188 38429 -6163 2004 -58460 -107331 -145763 -175645 -123777
10934 -123777 5816 1310 31747 40893 44493 32976 -759 -15189 -57598 -77327 -86139 -22736
10922 -22736 19938 -92023 -132345 -93942 -72313 -96996 -70073 -52308 -126547 -176994 -204319
10911 -204319 -298310 -293967 -235294 -210146 -166299 -75074 -753 19712 37268 8039 -97626
10900 -97626 -163887 -136106 -168446 -109496 -106848 -71741 -24824 -90079 -149474 -102030 -164847 -157326
10888 -157326 -212793 -207972 -43518 3009 84352 -17775 -79738 2462 -1904 -12268 -4179 66450
10876 66450 86727 -23131 1990 42848 144070 291697 437072 376943 312616 194913 65684
10865 65684 -10666 -164601 -131725 -166567 -201550 -162534 -138051 -148514 -144567 -125079 -174934 -162134
10853 -162134 -294983 -463431 -446225 -412695 -343721 -297636 -195265 -123376 -111746 -73406 -31282
10842 -31282 -59305 -6651 87742 114867 48786 57202 -10454 -63782 -114991 -187170 -271283 -262022
10830 -262022 -225478 -187495 -120827 -55772 10213 79245 115069 123028 179112 208401 210259 155478
10818 155478 75236 11581 77850 163605 209193 152707 160442 244116 254510 202872 193807 219867
10806 219867 276534 306056 297491 245708 188777 143629 133727 263872 365547 341040 371051
10795 371051 409048 553730 574994 594334 584861 589255 672932 783293 758331 731150 749231
10784 749231 998773 1093623 1087910 1193797 1332973 1403843 1519771 1633444 1823328 2028083
10774 2028083 2089102 2210299 2539150 2936994 3380893 3913049 4461552 5041758 5721207 6632796
10764 6632796 7581857 8323796 8942722 9610899 10568324 12027449 13888040 16354936 19636779
10755 19636779 24040815 29806880 36997188 46063885 57631614 72829626 93292093 120912041
10747 120912041 157738500 206213850 269313074 346698479 421388926 452060864 416084824
10740 416084824 341176142 266170285 206843798 163154538 131322546 108072030 90822809
10733 90822809 77569603 67136566 58759958 51988581 46619092 42364197 38995701 36297214
10725 36297214 33956823 32057031 30579685 29462391 28633126 27815077 26963925 25924704
10717 25924704 24846647 23892573 23211583 22611801 22127164 21749430 21547124 21467122 21339289
10708 21339289 21041653 20520204 19672893 18808868 17964240 17148321 16371740 15743522 15052066
10699 15052066 14331810 13594999 12910379 12284864 11675279 11193133 10703331 10120043 9655658
10690 9655658 9258918 8870940 8471658 8145190 7771079 7444206 7210322 6914819 6621768
10681 6621768 6342711 6163112 5973889 5740572 5566885 5385057 5155926 4972604 4840032
10672 4840032 4714322 4582236 4368625 4188559 4070837 3999418 3825167 3755319 3691729 3539117
10662 3539117 3435944 3357119 3197848 3169424 3195260 3188213 3142758 2979769 2922691 2844010 2633396
10651 2633396 2549419 2530540 2561931 2625417 2504637 2318627 2235902 2151973 2130997 2146936 2174904
10640 2174904 2134466 2255547 2304297 2389698 2418523 2519345 2660796 2770489 2905862 3110738
10630 3110738 3444323 3735026 3968133 4344306 4805602 5362928 6098205 7017278 8197676
10621 8197676 9788873 11841377 14239664 17441332 21414373 26362051 31876132 37292044
10613 37292044 41567455 43809414 43991374 43417512 43327414 44317051 46967257 51581085 58260333
10604 58260333 67170364 77862572 88347636 95302454 96429639 92717439 87470125 83362168
10596 83362168 81751524 83151511 87930409 95965017 107035730 119923590 131512654 136775240
10588 136775240 133107963 122906877 110765644 100418921 93165543 89297336 88579968 90785162
10580 90785162 95520553 101520435 106250164 106517920 100862405 91153212 80691771 71851750
10572 71851750 65427760 61204444 58977289 58271984 58682905 59450126 59402806 57392050 53123400
10563 53123400 47578002 41937811 36806462 32555111 29262567 26650355 24489963 22792006
10555 22792006 21424766 20235567 19112538 18187821 17325968 16527962 15939139 15384874 14806046
10546 14806046 14252083 13726579 13267890 12853231 12355424 11883705 11533043 11065248 10637784
10537 10637784 10262185 9895538 9571673 9269962 8900231 8629764 8360127 8086110 7714962
10528 7714962 7346270 7058176 6852710 6639751 6353939 6088662 5916893 5776818 5469477
10519 5469477 5232076 5110626 4969740 4754968 4617784 4522290 4385201 4196949 4056469 3893227
10509 3893227 3772292 3702383 3695855 3580229 3465330 3387134 3380225 3248272 3116615 2947154
10499 2947154 2852650 2865533 2832353 2771529 2724785 2694490 2683076 2580973 2522568 2417337 2416478
10488 2416478 2329535 2306459 2314911 2307030 2364348 2328530 2264472 2142258 2123696 2134634 2022323
10477 2022323 1868448 1885754 1918675 1948817 1948516 1937363 1874746 1776311 1746592 1751449 1831858 1895643
10465 1895643 1858630 1821186 1772872 1757866 1752757 1564392 1476305 1487137 1517614 1537056 1427647
10454 1427647 1275753 1334035 1325330 1269465 1222401 1134426 1200892 1289541 1317133 1295470 1296488
10443 1296488 1302906 1238044 1212446 1186340 1138073 1086232 991367 997483 971556 1093570 1112004
10432 1112004 1025453 995176 1007432 1006198 978770 1060955 1203791 1183287 1177865 1145030 1097953
10421 1097953 1117420 1193092 1210382 1233868 1285669 1258101 1240564 1292503 1321350 1367590 1463532
10410 1463532 1458452 1423666 1300489 1239129 1105760 1114194 1146083 1137463 978199 910322 954612
10399 954612 940409 887089 934793 972367 991416 903804 800211 814475 848879 817455 868794
10388 868794 976051 1011418 912602 742085 785420 801756 824762 813690 821255 935926 965251
10377 965251 996347 1001779 784016 758213 769000 818982 796776 822828 767738 908788 938507
10366 938507 807318 867518 894501 880031 854726 807108 737460 779569 862940 811013 779540
10355 779540 816710 754529 794941 838849 863228 760617 747642 820878 860935 869669 966346
10344 966346 1033282 1087407 1201189 1313554 1436480 1663266 1882713 2133775 2414650 2765056
10334 2765056 2982850 2984089 2732177 2335074 2052938 1795285 1599192 1469829 1373376 1341654
10324 1341654 1413619 1465618 1429965 1535544 1667559 1814345 2104382 2298155 2471236 2801409
10314 2801409 3530734 4349086 5346353 6683281 8660800 11471988 15431804 20207498 23645954
10305 23645954 23753741 22245162 21498600 22655040 24543291 23851933 20149973 15818627
10297 15818627 12239895 9633971 7839989 6642743 5865259 5178793 4547119 4030632 3664944
10288 3664944 3417151 3254747 3156606 3141763 3052073 2878577 2811214 2725123 2624375 2548537
10278 2548537 2517160 2484030 2395073 2445141 2448929 2365017 2296033 2326288 2348694 2279078 2196099
10267 2196099 2167833 2064219 1958127 1794420 1699468 1697983 1705890 1755478 1751170 1691704 1586258
10256 1586258 1518444 1552476 1632762 1631468 1516587 1284807 1256765 1265165 1140604 1060210 1028476
10245 1028476 998781 1034610 1014726 999239 1061359 1068906 956460 896252 904007 980647 852829
10234 852829 835715 914705 948267 929467 874263 801093 750371 735996 748399 666085 568940
10223 568940 483338 418743 477945 574078 590186 596152 645987 633130 663226 665738 687969 670541
10211 670541 563233 530143 586677 610130 538386 393837 358112 470729 640479 611670 485957
10200 485957 419701 473946 606486 698940 674298 600150 624502 585985 511924 472508 409589
10189 409589 366133 428374 509880 591584 576663 690193 649142 614043 674404 738068 715905
10178 715905 686381 716282 754735 724256 649918 522498 583144 663078 701475 807581 835675
10167 835675 808379 800547 777528 726650 739261 778582 814541 777936 740941 825906 966815
10156 966815 996701 1043469 1128090 1164675 1165686 1149071 1065169 1037704 975918 888885 964539 997153
10144 997153 973603 966498 927683 963180 1041791 982429 848948 840796 846173 810979 886191 895023
10132 895023 834972 789538 848313 790666 727021 750414 782565 671732 530616 492561 443919
10121 443919 502785 558143 572725 541819 469829 414651 414388 480128 594548 579916 508889 467166
10109 467166 479817 416146 366022 393392 385899 358469 405529 370004 367898 381515 403202 454941
10097 454941 498173 451988 454674 427625 400371 457290 526959 604038 544812 491176 502626 526726
10085 526726 448318 359779 335937 345885 384344 281567 223161 252860 213448 220014 374115
10074 374115 330735 217256 261298 311890 328671 383096 352972 294535 244056 201648 311419
10063 311419 392706 375119 474610 466073 448005 505714 466720 477219 461167 465255 443605 376021
10051 376021 378544 298850 299622 410544 450425 391205 303213 300152 301021 358969 323550 376176
10039 376176 349009 277370 223492 204195 276352 397391 524184 443994 279256 266095 255375
10028 255375 201508 193936 229071 360604 338073 304544 354626 278564 254372 338797 362548
10017 362548 434146 467456 407891 427469 476403 404245 351111 330593 201165 205868 240249
10006 240249 288843 368463 280157 155239 165118 259460 328111 333859 278001 298257 273846 282737
9994 282737 305916 301194 342917 427680 491037 509326 462262 430341 366743 282293 355655 488223
9982 488223 437807 387891 321745 270614 220896 261828 302550 268996 210715 116085 83349 49463
9970 49463 91754 160951 305612 321492 477297 446674 362556 344635 390491 395039 400502 455971
9958 455971 541083 491849 347985 283945 206599 169610 135093 78074 101117 87488 115184
9947 115184 163796 156163 106254 232164 232868 189056 262130 343207 328816 328905 374079 312897 253649
9934 253649 196278 224687 294781 261912 280836 434329 522713 440758 389847 358484 330656
9923 330656 372047 353606 357918 249606 203882 169731 134488 118494 159996 270095 368223
9912 368223 372665 328219 338978 388053 397710 366683 265837 202278 306381 345747 333261 263119
9900 263119 251420 267300 263991 270756 357580 371412 333409 361540 319241 267024 359079 382798
9888 382798 235982 65322 4334 67451 134970 191592 187561 188879 109719 59664 127252 217931
9876 217931 178005 192497 159593 218714 205197 168894 197229 274850 246242 251791 300817 246892
9864 246892 238815 229203 187184 174506 258115 473909 488981 338595 310352 335003 313093 223914
9852 223914 140744 119384 64594 41997 153279 173759 137784 206205 267019 205271 79871
9841 79871 -27134 14037 105837 108256 80565 177521 244657 332774 357206 312584 272854 167496
9829 167496 262474 420985 419838 283535 201656 168612 169360 198267 274069 333064 310405 292843
9817 292843 303144 359057 358920 209667 70542 46010 200476 296959 256602 268213 303620
9806 303620 205171 159039 121470 169327 243909 224483 175652 185737 262177 194107 186204 217403
9794 217403 152639 64872 53490 52628 84469 143764 117751 -10000 35196 158543 117128 102394
9782 102394 55789 151124 224156 173984 118934 93994 86552 42547 94245 131830 201607 163774
9770 163774 12743 17000 82764 79099 67417 64631 151646 210317 136609 223668 260645 172619
9758 172619 148952 186782 205240 207490 144106 154024 194551 208773 243499 329894 370672 261787
9746 261787 264422 256611 245319 262560 201461 208560 234467 256274 243680 309690 245949 189713
9734 189713 125825 133787 155725 134670 175303 248885 199810 198655 304325 305815 172610 130753
9722 130753 221967 218381 217307 157138 72930 105107 201797 257320 156022 76186 73563 21565
9710 21565 11130 -21824 32405 184372 186244 99444 134510 72956 -40974 8801 114536
9699 114536 178189 202265 247121 251770 226377 219298 149966 115753 210818 172670 3843 -17773
9687 -17773 125448 114492 113569 124273 69441 75316 82181 98815 55303 61141 186369 216767
9675 216767 255616 167983 127303 154170 200183 158362 69190 98074 115383 64163 77178 129151
9663 129151 162969 222951 245696 215284 226581 198863 35141 47650 167863 334056 356010
9652 356010 369734 421033 524806 616118 493256 344913 370994 315698 305121 135487 125330
9641 125330 180962 205174 172472 177900 209591 218085 215538 231272 279912 276531 261768 191351
9629 191351 132108 104002 63173 111277 244665 211042 154341 185211 169936 105200 42436
9618 42436 8164 88242 248334 270855 282259 326655 380673 312409 190267 36062 -25788
9607 -25788 17533 129052 235491 242502 256117 312397 333670 231789 169351 178475 182497 97489
9595 97489 61238 -5782 -3393 47896 21010 24542 75694 134534 170325 255792 271876 128720
9583 128720 133252 134871 97197 181204 225629 233252 154179 161773 194467 170454 198206 169746
9571 169746 157678 126047 123701 57475 -11317 90670 189732 229774 228643 238061 228318 292792
9559 292792 311615 168874 103260 168909 115208 174904 201950 294145 313051 224864 109643
9548 109643 148184 231937 199942 161906 189034 129055 20591 -15401 -13058 -23590 7334 -23489
9536 -23489 14949 25755 41412 93873 177417 208113 143905 170627 166029 76428 20992 123213
9524 123213 194720 175971 119329 118517 64542 10823 33959 90548 72658 106889 156187 176847
9512 176847 176575 176719 170945 173445 162506 171448 198385 241769 181318 183734 191274 174654 147878
9499 147878 105271 94008 191292 128060 124869 145801 182930 258477 213152 82804 98801 3470
9487 3470 -15959 76412 166832 205712 240815 208825 107881 144661 165687 153383 170217 205834
9475 205834 167202 146051 164784 108483 120032 164785 157793 126330 26176 -37841 -72308 -41359
9463 -41359 475 21297 61356 -52453 22601 49581 69260 41147 25949 148936 143052 28254
9451 28254 -84998 -69465 -82438 -6618 40498 3322 6124 18648 27255 75180 200525 298717
9439 298717 294520 235368 238726 215002 134198 55221 149365 182405 182192 148994 191969 276810
9427 276810 310784 275983 249422 224110 201149 250535 201442 237158 134152 74843 129257
9416 129257 118579 171785 215009 150330 214726 266566 276753 212789 258854 228352 168756 193013
9404 193013 167601 56801 22851 69333 101656 138716 133718 151378 160012 200043 183133 113562
9392 113562 88610 -13022 -17963 115660 42091 42821 71782 69455 106305 107720 107108 52565 133405
9379 133405 227917 198965 131672 55171 41165 82818 94776 111722 63723 -12478 -31934 -23771
9367 -23771 -26246 12370 11968 -25768 -110044 -74936 30686 80292 92049 91671 155873 132815 97199
9354 97199 58398 71101 124086 228058 152660 23919 21522 53546 -22494 -82600 -22301 854
9342 854 83316 50957 3076 50873 70561 34736 139024 159781 40440 72774 174407 121842
9330 121842 12340 27303 4320 -13537 19660 122396 144573 25169 -79759 -1026 62105
9319 62105 25631 -40833 64245 67721 117216 90242 44740 169146 226780 235909 246706 213385
9307 213385 115605 22005 -15628 -7178 -6928 75810 207159 190156 212399 197994 135146 87508
9295 87508 76664 124680 192565 150268 161067 145680 83738 63929 107788 39300 40663 67908
9283 67908 28151 -49711 -41620 -72884 -25834 11148 60651 118956 78765 53177 -6675 13050
9271 13050 -103466 -108755 60791 194067 194403 100144 78590 48741 124240 132510 83817 50451
9259 50451 94903 94690 129294 163190 123581 84542 108798 162847 177985 159259 154912 199019
9247 199019 241423 243937 228437 197051 158694 129969 167232 151411 135630 84848 108591 136551
9235 136551 105241 152987 110865 95624 193776 194550 116023 121767 96047 119132 139351 101946
9223 101946 39233 19598 15264 91217 118095 130359 152624 222765 239499 124995 37353 30931
9211 30931 121833 174633 188527 172037 101099 10798 58622 70675 74349 90560 34489 96152
9199 96152 165981 210622 155638 83284 44061 -11687 52584 140181 104109 132758 119371 175015
9187 175015 265545 361738 343688 257259 191062 102344 57523 63603 102046 9233 -34081 -7414
9175 -7414 50396 73570 116349 79523 89206 128198 135440 109124 -6578 64662 164453 230542
9163 230542 186745 222840 192268 109676 16840 -6943 -10691 70937 173391 220550 211470 229691
9151 229691 212095 137062 123144 97897 85979 113698 104981 88646 140293 150366 161640 131331
9139 131331 206024 205223 46446 -21785 61971 105887 60549 -7098 -52634 -19914 40485 -29105
9127 -29105 -17285 77834 145132 128960 169432 207689 166875 97947 122297 105039 77289 -80074
9115 -80074 -64586 87108 118387 101191 130154 168007 96647 98533 113468 84102 143322 149830
9103 149830 104575 244746 293262 209452 163766 108386 12016 15814 128963 137276 79308 11540
9091 11540 8495 20731 -24037 127430 202769 116305 -17278 -44044 -80068 -64108 3554 90113
9079 90113 111682 194477 169843 157739 149019 177635 144630 112095 176701 138569 45834 113574
9067 113574 54170 42373 -9932 -73551 -47072 8642 49796 24644 75815 192670 188615 122853
9055 122853 47564 49956 82207 24281 79023 51655 1470 18564 -30919 -109795 -120461 -136929
9043 -136929 -103307 -65427 -6580 34798 23476 -37492 -73853 -35584 39241 74494 116710 166039
9031 166039 147894 111022 79870 101383 88598 61559 -78891 -152235 46654 145187 61796
9020 61796 26830 123118 23043 -97571 -121049 -95396 -38692 65727 16613 -68117 -210252
9009 -210252 -187417 -64079 -72042 5476 66658 39898 34950 6006 -59272 -93359 26081 -13896
8997 -13896 -109068 -95707 -46458 17607 -15410 57496 21246 19445 -6949 -139399 -110869 49119
8985 49119 130559 80319 15014 70763 19998 3871 24804 78838 151281 184142 185507 57226
8973 57226 2197 -3946 34031 -24513 547 -17874 54290 99289 65319 149558 175636 147342
8961 147342 148024 158350 48103 18707 90191 97363 166151 197086 217260 117309 34593 -43975
8949 -43975 51274 55542 -16812 -36505 -900 77632 243817 328106 267254 221900 157851 101382
8937 101382 10081 24862 187900 191683 43467 11250 47768 85261 147098 149329 3739
8926 3739 -37276 28466 178632 240862 262919 179691 136145 28092 -30541 25452 61392 112531
8914 112531 117235 44555 -32372 55837 56237 -1827 -30179 14051 19208 78209 63118 105624
8902 105624 53753 78671 86947 90427 59758 6390 -153 -50544 -99067 -90303 -17065 45080
8890 45080 143249 169185 158057 162503 178788 219185 173938 25619 86426 76512 51041 16601
8878 16601 -76529 -6892 38004 50835 44446 120344 89224 -28801 -102059 -171169 -117724 -46989
8866 -46989 62433 131662 149027 110205 78146 -57424 -196091 -254369 -219012 -169070 -66177
8855 -66177 30377 89355 -56342 -76180 -11951 -35930 -16376 -29362 -17140 18107 60302 95179
8843 95179 113552 52159 -2966 2655 53295 79040 69154 -22378 -125723 -141240 -119015 -120716
8831 -120716 18796 184885 225753 101071 50512 90241 34194 -1108 -36643 -56315 -44540
8820 -44540 -82122 -45355 32500 48235 -29614 -3315 -41285 -29260 -99590 18363 88576 44015
8808 44015 30841 90510 128469 104576 57953 32688 -26223 -131583 -71945 -22241 -2860 62450
8796 62450 88784 17900 -80112 -108345 -33624 -50973 -5575 39861 31034 81808 99411 61560
8784 61560 113893 219187 165423 139627 69325 6480 108313 187342 191528 242678 243214 154887
8772 154887 118825 113608 128546 137574 108707 55147 14282 -35905 -91441 -97631 -101999 32519
8760 32519 134152 176335 94256 34394 -11249 -107883 -53759 93071 99372 71092 79935 16413
8748 16413 -10509 -10328 17725 -34843 -103963 -50681 28227 141431 130273 14497 -45006 -11679
8736 -11679 -56720 -33631 -36637 3622 92769 130713 86121 7452 21587 76088 147329 181094
8724 181094 156473 35263 -83514 -204105 -179553 -122831 -130348 -185114 -158630 -171911 -161004
8713 -161004 6926 -2362 -55584 -80877 -45325 -76937 -20842 -26799 -80160 -93086 -121323 -120129
8701 -120129 -86478 -43676 8714 38994 20888 42404 72345 143698 99394 88746 145714 116434
8689 116434 25224 71916 187991 194088 157924 159513 162261 125187 96384 69578 111903 74743
8677 74743 -779 32346 29389 74327 151392 197294 196025 97689 71576 59404 74468 46768
8665 46768 -55513 52374 144798 135466 159400 179851 146952 56900 -99906 -120446 -32054
8654 -32054 31919 69959 17820 51604 209465 267584 242658 153320 17782 -31832 23383
8643 23383 -31926 -62004 4610 63770 101206 58445 85126 141048 53575 81500 135060 118761
8631 118761 126445 25653 -36004 -42176 -56113 -16843 -75339 -60733 -15426 72220 101558 123273
8619 123273 95208 118273 44957 -60158 33650 76380 -23609 -15072 72847 139131 87382 -11286
8607 -11286 24709 149743 181541 180621 159295 88928 22278 -81979 -23305 -59328 -124336 -98434
8595 -98434 -83311 6779 26900 -57646 -64867 -6826 80744 -13145 -88646 -141321 -123502 -63612
8583 -63612 -105792 -83132 -69672 -1611 132213 231735 198242 218827 163125 162422 231265 309782
8571 309782 262787 255056 244548 197594 63280 -31795 -46285 57609 158009 21805 -79419
8560 -79419 -140030 -43067 69639 117157 180902 218954 226441 283522 251700 210355 178218 159271
8548 159271 225221 199870 180630 174273 139802 141499 44813 -41099 -42406 -18206 60800 52200
8536 52200 -41825 -56310 7495 70529 67855 -22896 8325 -18046 -68180 -24085 -19210 -71700
8524 -71700 -181479 -222417 -134374 -29304 160366 177950 98068 67173 119159 116987 -12152
8513 -12152 -94477 -23355 75238 144323 85625 -7048 -31178 -67925 -15612 24194 -28954 -116609
8501 -116609 -98149 -51687 -57842 -24980 -40398 10203 40108 7170 -6665 62726 16668 -11361
8489 -11361 35847 51593 58858 55675 131643 152224 126055 78259 40272 52780 107017 103414
8477 103414 148340 122563 85430 141015 275549 305864 275980 177598 57583 -46736 -56554
8466 -56554 -117621 -32445 -29599 -105972 -143237 -108257 -56794 -118906 -163510 -6962 3206 -101253
8454 -101253 -141173 -159481 -107215 -87887 -17603 46970 -55643 -3846 143543 157429 71341
8443 71341 39721 74361 182502 173433 57892 54701 38578 15249 14033 85823 196368 197829
8431 197829 182745 133195 120786 101706 50692 40860 49554 23829 73492 127419 129507 66717
8419 66717 34662 -11842 10846 45620 93972 132229 78849 104455 101343 217625 263773 133421
8407 133421 84652 29147 -50370 -60817 -95466 -90366 -16971 -12649 -52526 -47853 40185 118297
8395 118297 73386 -12634 -73557 -193526 -192360 -191662 -210425 -135592 -49733 -37200 -111391 -82098
8383 -82098 10534 -42002 -111615 -130933 -132796 -65574 -50379 -34260 4528 -5142 -47558 -2664
8371 -2664 -24993 -79863 -39806 -9315 -12873 -12944 -33243 -120798 -136597 3217 199941 312820
8359 312820 134475 98992 110519 64506 -65402 -45811 -51051 -49316 -78642 -31444 -17012 -29717
8347 -29717 24718 123321 2755 -141477 -93367 -37266 -1814 -15450 7174 40094 24121
8336 24121 -47290 -131992 -148328 -154322 -96106 75832 154811 89643 66424 104623 82192 52551
8324 52551 21651 -26356 41121 26621 21886 89534 105117 117625 42536 47164 20535 -27864
8312 -27864 18825 3726 58132 115403 111497 -5135 -5866 -13873 -40024 27099 114973 132500
8300 132500 122252 9824 24589 77282 97918 87561 27233 -9610 -14782 -48303 -40344 -84680
8288 -84680 -181137 -137357 -87678 -202494 -189116 -112798 -10436 84726 105189 94085 14973
8277 14973 7348 -37756 -59549 -146316 -79830 -21728 -37429 -121341 -160544 -141785 65220 103029
8265 103029 114291 78336 18529 37310 -33215 -61767 186 -20928 -52811 -74954 -79921 -29442
8253 -29442 -102451 -119356 -73979 38111 120054 63247 38147 92314 78789 -15488 -21043 -61371
8241 -61371 -28844 45179 -42744 -127802 -51397 33531 79486 52599 -13849 -5415 70710 85044
8229 85044 71097 26418 38188 7427 -37879 -112436 -138455 -152228 -84545 25970 121906 52723
8217 52723 -34053 24115 82426 33086 33359 -19561 7258 -32422 -47865 -19710 -112582 -180625
8205 -180625 -72265 -57203 -91397 -82493 -59721 32199 75559 818 -8339 36531 67510 -2668
8193 -2668 34147 75442 9660 55709 49993 19285 94800 159265 183644 200259 208501 185405
8181 185405 145269 67394 -471 35934 71719 47364 -588 15259 -33822 -18161 37155 -22276
8169 -22276 4631 -63920 -87099 12 -34776 775 -40562 -2966 14338 -6642 7659 124429
8157 124429 38518 -21073 -54849 -107826 -163191 -94865 24141 -20485 -77510 9270 81715
8146 81715 95894 79583 36087 2457 -56789 -158552 -184329 -99409 135402 118054 26343
8135 26343 -35710 -67689 -47270 -96988 -101675 -91969 -142739 -113501 -86371 -59689 39197 136588
8123 136588 240917 162609 60594 152781 207687 244629 110383 4244 -53724 10481 111840
8112 111840 29830 48796 91770 110395 72262 183572 231225 193310 116117 10817 -146718
8101 -146718 -146615 -135570 -77907 4579 -34153 79562 186561 162505 64792 31761 -19182 111506
8089 111506 113185 125600 149485 96153 53289 11981 -86121 -56509 -101661 -111355 -36124 46981
8077 46981 18336 19407 -41468 -77072 6637 17719 -5714 -2330 -56434 -92433 -57493 -83674
8065 -83674 47729 68535 28883 52120 41125 46801 29090 51008 102987 144433 23190 -86806
8053 -86806 -66640 -98192 -118168 -67019 -9975 -70688 -672 31785 -28430 -161392 -159457 -105761
8041 -105761 -147810 -24142 18840 18286 81607 118872 97042 100221 113157 143052 171125 161747
8029 161747 151924 146093 116155 21104 22591 24352 116365 103967 39380 27741 57237 65725 107657
8016 107657 86703 -16170 10 -6710 -31108 -77985 -150830 -138160 -171596 -167632 -179784 -163278
8004 -163278 -39362 95014 168201 149119 159633 187302 64652 -88994 -56159 -31421 -13896
7993 -13896 -773 69162 159013 145859 102523 37166 -112190 -150160 -131409 -107873 1971
7982 1971 67415 155913 124042 85623 136420 67886 55722 79099 69163 117579 117539 67887 77875
7969 77875 86801 55020 20999 -65046 -153812 -125707 -33473 10692 37198 101555 216251 310755
7957 310755 232074 59666 -35011 -7490 29840 -76981 -97818 -74461 47171 48677 6794
7946 6794 14454 12047 -1214 -10516 -68136 -91012 -66407 -81790 -39123 50331 -23087 -74552 -74209
7933 -74209 -41352 -107950 -107856 -137660 -35011 95871 112618 224427 226113 84451 21566 76007
7921 76007 114877 -6663 -115957 -153224 -159402 -82739 -120647 -228827 -233532 -197662 -128805 -82017
7909 -82017 -172892 -274807 -157582 -113825 -124333 -197314 -126316 64979 -36317 -79532 -44036
7898 -44036 -11944 9742 92906 83900 53821 114775 170836 118866 66472 80946 -49322 -84506
7886 -84506 16272 -16955 -126268 -34689 25442 6738 95746 29307 51233 18423 6992
7875 6992 21373 37317 23675 58717 73772 69512 60562 -1373 15060 37818 44395 94945 118736
7862 118736 177138 234338 135326 168094 228823 219993 41530 -73292 -156455 -126012 -39380
7851 -39380 -56153 -91538 -43957 31967 30269 -57268 -87649 -125145 -205344 -199177 -76589 -94581
7839 -94581 -114758 -39113 79795 -37741 -64565 -50815 -55004 -128364 -178662 -78086 -20544
7828 -20544 -93645 -78326 -131005 -84150 -43753 3821 106907 98852 133326 78013 12207 -108464
7816 -108464 -109249 5173 8921 44847 110749 140208 157095 128358 89314 133561 86131 39564
7804 39564 74350 88340 50016 20032 10771 74348 88501 59542 121134 150492 95391 63179
7792 63179 57382 40753 -2561 -31038 -123489 -134513 -119307 -43096 -51993 -49712 -28848 23969
7780 23969 28723 25110 45487 -51737 -184961 -121511 -8271 37646 159882 173020 80792 -1711
7768 -1711 -73628 -81109 -1159 -31731 -63225 -86433 -5089 -1641 -83922 -148935 -15812 22497
7756 22497 105194 120323 34448 -76787 -145207 -204735 -86688 -9948 -25884 -49259 -28669
7745 -28669 -12558 25101 53654 -9922 -34674 -131684 -177571 -108815 40434 48683 111271 102315
7733 102315 30966 9036 -19840 47553 114496 197836 154121 9616 -3019 65061 113028
7722 113028 162049 116769 18945 36863 108603 149316 223951 121867 45747 -35273 -105007
7711 -105007 -85305 -37630 7388 82387 54117 22425 43514 44783 17316 -60866 -44099 -30881
7699 -30881 -60669 -112520 -108594 44627 152046 192571 187948 91614 2919 83948 68811 -49105
7687 -49105 -127109 -72957 -18871 32352 155363 180596 98865 -4656 -23322 -88741 -38734
7676 -38734 -40151 17868 50233 23114 17199 -6751 -12999 28449 35167 6175 68609 141977 136141
7663 136141 5768 -64490 -57377 -71614 -77247 -114289 32506 54500 -3065 -47608 -37817 108684
7651 108684 135031 142900 60783 8285 16628 -36000 2532 52284 19575 -74205 -115507 -89460
7639 -89460 -77347 -23664 15343 -3136 -38719 -8682 61444 68345 96176 100421 -24355 -146559
7627 -146559 -124420 -136486 -87748 22865 -19743 -19895 -34276 -31738 -7717 53520 95026 29957
7615 29957 -66342 -187994 -197853 -70044 -13066 -76133 -131841 -78640 -31566 -83673 -103215 -146840
7603 -146840 -198462 -163874 -128194 -104041 -34562 -111352 -149690 -132594 -166538 -174581 -104605 -14743
7591 -14743 -27346 -67221 -68838 -20511 -98808 -28768 82368 159830 108905 -3703 -29871 7497
7579 7497 71018 86143 14440 -74087 -122875 -73990 -31127 13716 53054 64229 71528 38450
7567 38450 31008 47137 35743 35691 9882 -41187 9510 59986 39189 -26589 -49791 -75503 -9558
7554 -9558 -90623 -159367 -245843 -369420 -316049 -225993 -277499 -228062 -146144 -117054 -72410 -7157
7542 -7157 122097 144378 91138 19055 27363 114548 105233 73044 89540 93072 112819 -23524
7530 -23524 -81960 -62105 9185 9660 -36624 -136639 -123588 -117448 -168504 -202206 -122153 -191567
7518 -191567 -86951 -53353 -75866 -59203 -5403 35083 12612 -1288 36736 47109 110608
7507 110608 93651 29269 91976 155848 49681 36836 77920 46695 84977 23218 272
7496 272 -19475 39405 -3212 -22415 -3778 156702 176656 110348 69747 26360 -39727 14680
7484 14680 81440 169894 92739 -64649 -161461 -115735 -150864 -128082 -175234 -170603 -68295 -34894
7472 -34894 -121721 -119067 -131177 -80163 13270 114452 81757 17788 -12622 -18357 22415 3112
7460 3112 95774 96276 65815 -6765 -37139 -34450 -106535 -115373 -92779 -41206 -75278 3512 56407
7447 56407 -45051 -106227 -190254 -115689 -6424 47579 78735 31441 12042 -2558 -55936
7436 -55936 -20034 28408 -45005 -21185 -4559 44972 197708 219473 178883 42645 83787
7425 83787 91011 80275 73576 -5651 -804 -15834 -59618 -75866 -121817 -189353 -196268 -225762 -241073
7412 -241073 -316025 -272140 -234915 -197554 -119193 -196262 -165926 -139056 -191069 -156203 -60164 -32654
7400 -32654 -48413 -4708 -10629 -40455 -23985 -51483 -145447 -183823 -67795 -18613 29562 39128
7388 39128 -35839 -98995 22044 40371 -26380 8590 119598 121795 163009 107582 56960 126683
7376 126683 150593 72128 23352 31806 15365 50328 94170 -12894 -51905 -11204 -179380
7365 -179380 -226121 -99271 -20741 -24979 -83889 -67861 -42238 -102754 -149902 -55678 -8601 -68983
7353 -68983 -86512 -99338 -140570 -169805 -97733 28113 112274 671 -95690 -186916 -154131
7342 -154131 -151953 -109553 -75887 -134753 -106331 -105151 -110297 -90046 1871 100152 67231 48424
7330 48424 30848 -64680 -93998 -105409 -91324 -47631 9142 -13257 -107582 -174047 -186972 -278294
7318 -278294 -258089 -169897 -20819 14272 -46880 25657 33550 86236 164922 118364 76769 89459
7306 89459 134304 27709 -2665 -24770 -45749 -49821 -13646 -63717 -71150 -42409 -89219 -105756
7294 -105756 -81907 -124003 -40808 47451 -74550 -96469 -138033 -89143 -13660 107972 57419
7283 57419 -40259 22574 69858 8850 -40741 -33399 -101658 -64145 -99524 -14764 94326 63653
7271 63653 49774 59127 83009 18641 -59525 -90289 75503 84768 -61435 -144277 -112356 14707
7259 14707 106080 203567 142560 148563 225818 78176 33734 -31162 -69494 -201565 -111387 -91783
7247 -91783 -90070 -87450 -67852 -73605 -172201 -208743 -194498 -125597 -196919 -199648 -150562 -121297 -31433
7234 -31433 86188 47569 -14696 28429 82152 868 -108335 -139903 -87632 -54611 -32830
7223 -32830 -3708 26295 63392 28977 -6275 108222 84954 -48475 -99336 -92382 -44960 -73720
7211 -73720 -82921 -178141 -107704 -36299 -15974 -32264 -22908 -7448 3367 73921 25936 -25507
7199 -25507 -31663 -114615 -115983 -164558 -142038 -128107 -161678 -133831 -70598 -187 10358 24872
7187 24872 -23707 -37004 -110292 -115433 -27834 -12276 -123849 -81657 -31540 18031 20242 94442
7175 94442 95883 127064 102761 -116640 -175339 -42609 18816 26239 -61219 -118265 -80416 -48031
7163 -48031 -19927 -16754 6866 -23267 -28871 -71375 -95851 -113536 2180 11389 2659 34526
7151 34526 16209 -6971 -867 -18930 -126328 -147769 -131216 -233922 -231163 -198006 -116304 -168011
7139 -168011 -160993 -113516 -119680 -100890 -103873 -50554 -45328 20761 -49949 -108253 -162262 -93254
7127 -93254 -44217 14766 117798 76334 -52998 -138326 -50182 -4137 -45501 -99696 -58576
7116 -58576 -142692 -217058 -158247 -72366 -52158 -7093 12278 34731 32684 65788 111263 124036
7104 124036 110862 26984 -40086 57911 121347 12826 60497 192728 159210 11251 -51573
7093 -51573 -11941 -44019 44048 131772 132748 94648 96040 123860 112076 31761 -23954 -68295
7081 -68295 -82237 -111540 -237656 -131442 -3986 -3282 -11330 -27345 24076 10185 9860 21057
7069 21057 -76781 -118933 -80664 -34293 -63765 -59692 -101047 -102347 -132311 -188164 -199727 -153610
7057 -153610 -90203 49259 62400 -82975 -79783 -129653 -169024 -70965 -38138 52523 2755
7046 2755 -4494 26867 -14116 -74044 -31213 48286 58678 -61790 -170173 -177415 -88347 -46127
7034 -46127 70205 68771 32267 -32035 -2352 60484 129273 194584 178030 135136 94326 173418
7022 173418 247533 181373 100085 33401 -8158 983 27467 18999 -59884 -104875 -94155 -65647
7010 -65647 -25811 -8493 -26185 -101689 -102977 -49220 2672 -8872 54214 69880 68003 83488
6998 83488 43698 19927 78008 74834 13489 78106 92261 -43446 -119700 -196701 -225112 -137395
6986 -137395 -65375 -73414 -87037 -60493 -7507 -18455 -31068 29740 112078 110289 146300 166704
6974 166704 131143 51103 8273 17192 43515 16847 -14760 -47404 87022 101540 29236 51566
6962 51566 7726 -38811 -101275 -93971 -68173 7014 3566 20268 6256 -81341 -76625 -160856
6950 -160856 -95782 -37018 -58253 -31620 -123761 -112863 -91188 -73470 -34063 -60001 -154114 -151326
6938 -151326 -129654 -148860 -165372 -164497 -116324 -7933 32943 70330 44959 -37228 -94658 -31433
6926 -31433 -104216 -75816 -114229 -132924 -48357 3169 -25268 -79219 -64652 -114394 -194462 -206683
6914 -206683 -57211 12431 18982 -99591 -169984 -131422 -181771 -102201 -68198 -141172 -123270
6903 -123270 5495 41325 22314 -54133 -77341 -86032 -23227 -12715 -22523 22297 56674 154958
6891 154958 162268 210504 101588 -72879 -102263 -6624 -135189 -156795 -152541 -195651 -233439
6880 -233439 -132012 -42221 2369 100718 132423 106381 -4883 -63873 -18450 -112140 -195946
6869 -195946 -153513 -88206 -51021 -135128 -125122 -101491 -61349 26637 105761 178292 115583 51744
6857 51744 5982 33374 86194 112645 126129 115644 9425 -28879 72941 73315 36650 66442
6845 66442 -26783 -117404 -62269 35148 43736 73850 109685 150883 128503 138224 99047 80658
6833 80658 61160 -5472 -70609 -21397 46645 18511 -26157 -8476 -32075 -69869 -68426 -101212
6821 -101212 10583 93284 19735 -18143 -125589 -163115 -125317 -95105 -87577 -123267 -41217
6810 -41217 -84069 -77803 -136620 -188607 -73368 8302 1861 -93860 -92378 -40613 -91847 -112317
6798 -112317 -72386 1849 45988 11207 -9106 -77229 -28959 30110 43206 3592 54732 103295
6786 103295 115311 196675 152439 94632 82652 39426 2166 -71835 -12965 31907 28945 -11062
6774 -11062 -6675 -8486 39477 -20480 -31181 -16336 -127464 -204826 -201581 -166690 -84811 -129668
6762 -129668 -131284 -46971 -98430 -172267 -119969 -13532 171028 176822 17877 -26615 -11589
6751 -11589 73366 134060 98556 -2268 -2446 -31474 -51611 -14561 5269 -55821 -14377 4634
6739 4634 11887 40711 -12107 -44625 -51031 8530 -12111 -85755 -146721 -128046 -43252 -24275
6727 -24275 -16685 36621 112806 74006 -4219 8530 108857 122093 98382 126770 130654 109971
6715 109971 105269 48766 6636 34032 -49436 -97330 -110213 -175115 -205142 -227150 -228254 -185530
6703 -185530 -176497 -82456 368 43501 -17366 -21645 -19978 42508 60778 45683 65095 -13117
6691 -13117 -74124 -66514 -36905 -46336 -88333 -93635 -123974 -226158 -280591 -183176 2706 66466
6679 66466 26587 94617 81016 61382 22824 -12447 -68066 34600 17149 -7346 15773 -28389
6667 -28389 -13076 16591 -8457 39020 100441 119555 70384 -22609 -76395 -121917 -107532 -100705
6655 -100705 -48364 22053 -12757 6219 39306 56491 68819 1658 -63922 -112521 -13573 139415
6643 139415 158307 84533 28295 7834 -4940 -17165 -92378 -116208 -40182 -62516 -58639 10309
6631 10309 35608 -11800 -91107 -107497 -64721 -154159 -144140 -103399 -49192 -2242 -31488 -43302
6619 -43302 -12586 22181 11270 -167480 -181185 -59921 -5904 -41478 -83249 -66129 -60795 36678
6607 36678 87657 75942 93854 98682 78649 80546 19947 -61844 -88878 -10319 48766 59334
6595 59334 -60760 -40706 -4270 58808 46505 -41124 -59346 -35398 -14707 -5577 69000 47192
6583 47192 -3270 9827 -7676 -62867 -110106 -164302 -169571 -245714 -234626 -273223 -231850 -138960
6571 -138960 -196499 -178140 -76191 -99675 -118526 -58641 718 -14511 -78414 -111808 -147648
6560 -147648 -172004 -230292 -189272 -80998 11798 48945 -15769 -4604 25794 -18375 -36522
6549 -36522 37996 285 -30028 -19266 51132 -57826 -147619 -69870 -8370 89008 168555 149721
6537 149721 -62889 -134110 -46652 -54236 -164229 -130017 -87319 70234 116198 63078 74098
6526 74098 114678 136009 85097 13858 54734 -27010 -35653 -63293 -68758 50123 105791 84431
6514 84431 10310 -103801 -154771 -179522 -252247 -144154 -134951 -42536 42119 123728 139196 63856
6502 63856 12945 22536 21328 13584 -5091 -65483 -48261 -6984 -1231 -117720 -121511 -29154 -64336
6489 -64336 -9678 61135 5971 -65449 -85380 -194159 -184421 -26726 69532 101889 -20176
6478 -20176 -46085 -34128 3035 3467 -110483 -197160 -170762 -39360 21195 -52324 -186218 -214189
6466 -214189 -59710 -74112 -46445 -1311 -70459 -123660 -164784 -94156 54778 89840 -32139
6455 -32139 -94789 -112966 -180311 -120128 -19374 -100862 -168424 -188853 -84538 -32925 -125743
6444 -125743 -116277 -52893 -53800 -68704 4695 139269 149182 23264 -78047 -63276 -26075 -20607
6432 -20607 -111294 -203819 -280561 -178625 -94580 -91967 -91491 -64196 -83072 -110188 -165067 -138886
6420 -138886 -129195 -160579 -123279 -64126 -133924 -143050 -137940 -105618 -60324 -86440 -69605 -35929
6408 -35929 -36332 -24430 -84334 -90739 4409 160104 90882 100338 115347 55915 -29756 -80438
6396 -80438 -86525 -70854 -6664 7958 -88147 -50804 -30167 34064 101239 96447 18525 -20841
6384 -20841 75760 119357 129155 114728 154476 122789 42097 -35591 -22392 24680 -59392 -155113
6372 -155113 -211566 -169904 -33472 -29696 -73919 -26811 -26470 -107094 -142719 -79079 -49924 -6076
6360 -6076 75308 33755 -9138 -14055 13629 37075 -37896 -1329 17798 55894 77511 -21849
6348 -21849 -86704 -87049 -80370 -31844 -37722 -30750 -27771 -72821 -132269 -149893 -99367 -43215 -5844
6335 -5844 22396 -60673 -97929 -5972 31302 57250 34148 27414 15720 -9222 -128278 -185339
6323 -185339 -221764 -136263 -89146 -110026 -155703 -169988 -151867 -147400 -138172 -51214 -7541 -43367
6311 -43367 -8332 66746 153811 103483 21387 367 -38325 -104892 -38922 9532 -32924 -2564
6299 -2564 -38011 12044 122883 124021 67228 49844 31217 -117759 -157392 -73164 20210 -10104
6287 -10104 -30722 30459 24400 -73748 -116893 -118193 -42180 -11927 -74372 -85481 -105990 -161562
6275 -161562 -118117 -102438 -31018 -17665 20653 94232 116909 35190 -78153 -113940 -111532 -153402
6263 -153402 -88054 -86200 -17958 -9529 -28973 -75097 -130713 -102961 -164969 -195783 -168217 -17550
6251 -17550 -14787 46686 98981 97128 51533 -85527 -116580 -33293 -65858 -40592 -55242 20779
6239 20779 85927 -90404 -135837 -96640 24257 150226 163286 190207 288404 106207 -3400
6228 -3400 50244 115818 54810 -69108 -73214 -47133 163093 87899 1452 41818 215942 164052
6216 164052 21309 81314 151434 91498 63652 -78704 -183093 -239804 -198109 -105038 -53031
6205 -53031 -53230 -102524 -98489 -119470 -189163 -108580 -59130 -41044 -21988 15957 68379 153363
6193 153363 127985 72353 78770 49013 41976 31350 49186 -8116 -9065 -13641 14366 -6802 -105996
6180 -105996 -126417 -24984 27188 79159 31116 -6427 58480 42502 14665 -121434 -72816
6169 -72816 37367 21477 -1907 -1645 -74977 -129100 -87057 -6113 -72872 -129090 -112920 -43454
6157 -43454 -60690 -51494 -29094 -61126 -22389 12578 89640 108017 122623 109262 94714 71031
6145 71031 -42801 -20630 -61236 117701 216439 150695 148143 40880 -15883 81423 67996
6134 67996 16015 14562 54214 117850 182295 243178 104119 69186 18816 -24842 -27583 -93153
6122 -93153 -90876 -99319 19078 132038 51407 23945 -24142 -124111 -104685 -22958 16298 62470
6110 62470 139445 113892 119561 58657 -88398 -55073 11621 -49174 -15074 2013 70765 66370
6098 66370 54407 112194 66121 -46913 -82662 -89240 -53016 -131995 -254167 -217472 -148725 -118938
6086 -118938 -96484 -92225 -77202 -13641 12383 -62197 -86949 -131725 -142588 -213920 -196275 -192434
6074 -192434 -217802 -139143 -111169 -73603 -23560 -7248 8315 -55550 -103136 -39484 -75271 11877
6062 11877 108331 42203 1317 -65671 -19050 68855 60909 78799 92732 92661 133441 64498 -3382
6049 -3382 18445 46644 12384 -51889 -82474 -134960 -111168 -19006 28536 -46452 -120387 -101948
6037 -101948 -35862 -6176 50960 84049 117714 -21334 -49268 -6026 -29263 -123409 -125109 -107591
6025 -107591 -158423 -129712 -163046 -181437 -219743 -188142 -96103 -104774 -70751 51004 61681 5628
6013 5628 -19069 -26593 -49169 -66125 -82871 -105291 -141646 -175010 -126314 -69188 4547 -50745
6001 -50745 -57275 -99877 -207141 -177695 -29723 36990 -108738 -122711 32260 188795 98980
5990 98980 27934 52811 -41589 -94073 -61729 68214 184656 218317 160988 -11656 -52929
5979 -52929 -80519 -60631 -61458 -133633 -156869 -101316 -98961 -81119 -69822 -27052 -6355 -1125 5976
5966 5976 -20132 3305 83489 89982 32266 -85746 -96916 -19520 -27629 -61092 -103801 -128435
5954 -128435 -27892 -7467 -148698 -177237 -139025 -85147 -79343 -118675 -127326 -147606 -94527 -19257
5942 -19257 57451 -2281 39015 6027 4359 18235 -43431 -147452 -222949 -239090 -299213 -231172
5930 -231172 -204901 -174360 -65504 -56179 28835 38302 4133 -21214 -53736 35266 28591 35452
5918 35452 -47900 -32994 61768 60737 101750 159520 273161 331796 234262 130007 68063 57566
5906 57566 13698 -19801 -41427 -25476 -63476 -136162 -150664 -168431 -148707 -125501 -66026 -51649
5894 -51649 -57865 -88560 -72614 -15397 27145 58624 109396 122169 94720 81852 67390 59540
5882 59540 26368 28507 -26783 -41642 -34768 -128963 -239051 -209318 -180034 -154084 -106009 -63960
5870 -63960 38904 52465 -35276 -80272 -151004 -153364 -124748 10083 134027 135388 167449 134058
5858 134058 46660 22647 -28036 22715 95374 17991 -111706 -65655 -114883 -104184 -82702
5847 -82702 -51503 19697 -44636 -38578 -131357 -161460 -124563 -93368 -87487 30063 -12350 32140
5835 32140 70704 -21442 21812 12620 -7865 -24969 48039 71458 11116 -31032 -92980 -72914
5823 -72914 -85497 -69292 -68090 2935 84121 90427 120559 58004 -34903 -63294 -143245 -197515
5811 -197515 -87420 -14699 23138 -132406 -199659 -114519 -57285 -47008 -29068 24250 -13002
5800 -13002 25348 21864 12377 1108 -153638 -206125 -171707 -196664 -130266 -120056 -70750 -13419
5788 -13419 -3396 -104579 -102106 -86070 -52789 -42661 11503 34401 20207 -33805 -12856 -19742
5776 -19742 -107942 -198162 -158629 -92423 -16373 -29302 -100928 -142021 -186894 -137276 -36063 -38424
5764 -38424 -80053 -63246 -165693 -107493 -36286 -4489 96639 118101 -46016 -143743 -92017
5753 -92017 -16440 41214 128945 36702 -27842 -48917 -38628 -86543 -107443 -58076 -87118 -69064
5741 -69064 -89917 -105584 -102128 -81916 -171394 -49122 37310 77642 18392 38710 64698 103031
5729 103031 58076 31042 -10587 -126395 -123237 -108211 -77560 -97115 -153883 -195365 -208291 -230604
5717 -230604 -159998 -121200 -90083 -113238 -159093 -184162 -164201 -134162 -35732 4249 50118 73031
5705 73031 -45888 -34199 39709 -28082 -91668 25906 59580 -98091 -128993 -102119 -122076
5694 -122076 -108626 4129 76024 91485 54464 54367 42363 85649 85692 67301 63746 94592 95962
5681 95962 118316 93045 142784 125680 92577 -14219 -66446 -76754 39797 59430 51954 69508
5669 69508 32294 39211 65773 -17751 -35352 33369 -7353 32862 22211 -24822 -49480 -66385
5657 -66385 -64684 44630 144785 48790 15495 94015 94436 28705 22994 -21924 -79442 -84772
5645 -84772 -125033 -174497 -172272 -66949 6799 42067 131577 71992 24326 12132 -27623 -115915
5633 -115915 -169471 -102337 -44597 -56519 -63466 -82132 -29034 -14097 -89442 -114316 -118777 -118080
5621 -118080 -96317 -12736 27829 67070 212 -34549 -10939 57035 44221 14262 9471 -6739
5609 -6739 -14453 -21736 -3006 67484 94782 34844 20772 40296 -4874 -25531 63721 39938
5597 39938 -26751 -92341 -150589 -157086 -82298 34173 -60813 -77383 -7632 30295 29987 -6969
5585 -6969 21036 22318 15715 72307 51346 53489 33483 -242 -122583 -185710 -158170 -144680
5573 -144680 -78682 -19505 -25525 62882 32031 -70339 -115792 -102150 -57733 -24097 -11067 506
5561 506 -60052 -17533 -72059 -107626 -70364 -59606 -136870 -97501 -114058 -193700 -175604 -139378
5549 -139378 -67508 -30271 -88758 -2413 117960 83821 41205 55460 67535 43788 72251
5538 72251 1874 9556 -105322 -112315 6275 -20099 -75504 -138019 -67118 -62891 -109786 -78554
5526 -78554 -18166 38569 -14315 -26418 -74939 -16849 9789 -57107 -162457 -225063 -208516 -219638
5514 -219638 -168620 -67956 -69234 -60905 -44141 -14689 35833 82465 97876 95381 15704 -53962
5502 -53962 -99842 20650 27368 -29910 -27983 -19026 -45343 -74617 -62791 -120614 -178964 -202800
5490 -202800 -157746 -248266 -227051 -227485 -280355 -254524 -113840 -68516 -49749 -103416 -76776 -59169
5478 -59169 -109148 -91309 -101416 44776 41385 11197 -5604 -69749 -30991 47433 -5581 -65726
5466 -65726 -127094 -92186 -96466 -126839 -133094 -148030 -135245 -113448 -149495 -154132 -125325 -143362
5454 -143362 -148115 -128410 -68055 -145732 -144467 -53517 52082 49676 68486 39643 -32617 30512
5442 30512 76541 144771 102422 6087 49829 122621 83053 9908 -101984 -100679 -128847 -216879
5430 -216879 -165120 -153229 -99958 -82986 -131108 -172918 -131847 -143369 -132534 -66513 -85406 -78763
5418 -78763 -169428 -212273 -43909 78930 15847 19257 31724 64397 118746 87885 29714 17786
5406 17786 47994 19228 71345 86625 58685 28994 -44503 -82547 652 70588 38754 -20691
5394 -20691 -87502 -114738 31604 37175 -189639 -253543 -256053 -206219 -122017 -80357 -190470 -175868
5382 -175868 -141352 -86679 -74462 -230213 -291056 -180092 -139833 -169506 -131343 -10742 -13891
5371 -13891 -75839 -25107 32322 19268 117299 85526 90395 50347 96186 856 10048 9921 2387
5358 2387 59762 -24061 -94515 -117913 -81129 11076 81166 18352 -30288 -146818 -62727 48805
5346 48805 38274 -59335 -31635 -13873 -5658 -1058 26023 -7351 -20768 -96978 -167409 -138406
5334 -138406 -225740 -242061 -233287 -192183 -136796 -124454 -124256 -143271 -189243 -94225 -96951 -48521
5322 -48521 -111013 -196413 -92234 71562 9239 -110282 -167779 -114671 -75138 -150636 -152396
5311 -152396 32569 126934 31900 775 -65514 -105749 -101048 -181177 -116509 -59909 -172103
5300 -172103 -263202 -229098 -197096 -157788 -131526 -109962 -50276 -24536 -28771 -57931 -78512 -43369
5288 -43369 3259 -13574 -3854 30165 38126 -112246 -64891 19162 79442 79524 102388 174597 233068
5275 233068 197799 163078 146107 137354 14733 -65079 -85102 -72238 -10008 -15970 -123844 -81766
5263 -81766 16770 65949 48306 -35406 -127527 -144729 -123535 -514 2207 -40180 -29039 7152
5251 7152 -17027 -59805 -103156 -108127 -93891 -90571 -98343 -122323 -97711 -70130 -51596 2096 -15956
5238 -15956 -27267 -85366 -54603 -10408 -36641 33741 -48806 -165110 -138471 -105764 -21492 76978
5226 76978 155978 78797 -152915 -183366 -110919 -35606 8452 99005 73583 4912 19550 -86772
5214 -86772 -145698 -50047 -39635 -55455 -57091 -151494 -156718 -109712 -48745 -73819 -2647 29153
5202 29153 106189 11714 -67193 -110619 -58933 1906 4164 43318 126700 52666 -19644 106869
5190 106869 123408 113560 62596 101613 123932 134659 164805 155473 38928 -115667 -133834 -71019
5178 -71019 -51386 -83797 -96177 -110978 -132674 -157538 -124543 -81320 -48068 -28358 -45263 -135149
5166 -135149 -213567 -121918 -87851 -72434 -96864 -90075 -208872 -206422 -103636 -76664 -72890 -58776
5154 -58776 -119315 -105197 4286 156910 129476 80671 88919 -22494 -141164 -183917 -94040
5143 -94040 -40854 -65845 -106945 -86536 14090 20716 88578 37075 -70603 -78579 -98428 -26951
5131 -26951 -12353 15607 -72246 -116345 -112375 -55253 1000 -47881 -60672 -35390 -75068 -39324
5119 -39324 -5956 -33160 -106248 -116170 -59975 130206 196626 104934 -48297 -128657 -172582 -166737
5107 -166737 -149673 -66467 12983 -12665 22207 -9497 -88497 -169164 -86443 -114336 -67432 -23108
5095 -23108 -37374 -1814 -103291 -153630 -174570 -170683 -150025 -95524 -82851 20667 110861 112890
5083 112890 177262 238228 118611 16174 53261 48864 80601 86070 3551 -73186 -27001 -45311
5071 -45311 -70685 -30412 5141 19072 100862 189466 187854 37661 -21919 113721 139110 34681
5059 34681 48798 20882 27858 -46570 -97219 -111609 -170554 -231684 -244523 -181355 -72439 73482
5047 73482 114560 51715 -28613 6953 -34228 -79001 -145531 -104512 -58514 -112361 -154444 -94050
5035 -94050 -124479 -78839 -31681 -37609 -65494 -4529 10237 -40764 -70737 -104583 -243485 -293566
5023 -293566 -141279 -50937 -13922 -20299 2380 -37247 -6193 -122977 -125216 -2880 -2113 10054
5011 10054 -41845 33527 97628 98422 159223 224842 128364 56321 72190 105992 112682 21422
4999 21422 -37759 24032 91866 140394 165070 75739 20940 26293 3334 -29711 -18695 -14497
4987 -14497 27577 71933 46733 61785 -10164 -47627 -6310 41081 -4739 -56995 -62900 -81624
4975 -81624 -89503 -90514 -27706 -45302 -160624 -113075 -37691 -22347 24541 -52680 -123611 -177549
4963 -177549 -200250 -129116 -88813 -43245 -55036 -35202 2110 35301 66650 95043 85552 -26635
4951 -26635 -45676 -67212 -54884 -61902 -23269 -17888 -96212 -59804 -138536 -76519 -9160 -9045 -19665
4938 -19665 -17792 -57803 -110748 -89242 -168654 -177054 -166031 -176780 -78334 27467 108735 62291
4926 62291 -46858 -147267 -241181 -246121 -145443 -135183 -132120 -135434 -145169 -145285 -120165 -140774
4914 -140774 -59596 -52269 -25871 -72782 -66903 37121 57747 140899 84604 5985 -12586 -62524
4902 -62524 -54722 -65918 -172180 -227587 -301396 -358600 -319109 -201048 -114470 -153375 -208977 -150215
4890 -150215 -79481 -24397 88274 64363 1632 23056 114222 111296 23566 -64412 -109701 -68210
4878 -68210 -76836 -114059 -93136 -13235 -3215 24226 -45483 -54235 -91556 -86502 -75217 -81267 -64967
4865 -64967 -41537 -3859 -46634 -137140 -143116 -66616 -29978 -52479 1740 11575 44918 -15112
4853 -15112 -154675 -141801 -125799 -109785 -28884 38791 90922 20713 47240 45030 129203 150165
4841 150165 16232 9013 1171 -2200 -44683 -129364 -41610 76997 104961 -42509 -64727 2015
4829 2015 68771 -46052 -139295 -139545 -85045 -23122 1713 -97613 -172920 -241174 -272207 -225562
4817 -225562 -195952 -174667 -118753 -166538 -240120 -190395 -78903 76762 34933 -334 15254
4806 15254 -52762 -120060 -54221 -73628 -158052 -123994 27327 -6345 -51799 -141043 -67127 -792
4794 -792 -46943 -107008 -146009 -88989 -110270 -126189 -221367 -173250 -129586 -64200 -48785 -24743
4782 -24743 50670 45675 -41299 -48647 -28953 129714 77638 -57151 -20315 -5385 -81625 -123631
4770 -123631 -66742 58748 43171 -9218 37638 52926 1952 -73395 -61654 -65951 -139245 -248674
4758 -248674 -299061 -247741 -166975 -130083 -132621 -117755 -74439 -38250 55394 15049 30966 13150
4746 13150 -5759 -24640 -8274 12024 -16703 -128647 -122593 -47687 22939 115007 122592 -2755
4734 -2755 -78089 -191301 -163130 -50837 -45891 -125878 -62168 24490 77354 -2445 -83268 -167942
4722 -167942 -161241 -57150 65845 49099 23381 4644 37436 15941 -29291 -50311 -20318
4711 -20318 -28135 -6869 13001 107775 137505 28743 -92915 -121108 -76930 -76652 -8640 50528
4699 50528 54878 68803 72965 118891 129312 138266 124796 41935 -67259 -103659 -26548 -94642
4687 -94642 -183941 -140792 -152420 -160065 -105720 -99160 -81621 -26992 -42277 -147796 -166279 -19627
4675 -19627 14880 20664 35047 -3501 74904 82263 40618 -40791 -97149 -152498 -86670 -101410
4663 -101410 -177652 -256829 -230562 -122975 -110800 -59689 -14520 -5747 81004 100347 9969 -25921
4651 -25921 30603 1977 37727 78212 -12992 -106708 -274846 -279687 -235252 -76096 -10372 -37950
4639 -37950 -31773 4496 -65084 -19252 26015 19161 -19886 -12944 28081 15148 53964 55854 89622
4626 89622 66844 99464 108811 98474 78527 -11436 -77892 -148022 -202349 -203913 -135413 -63612
4614 -63612 -133513 -197460 -211648 -206277 -110589 -150209 -148716 -106423 -112288 -104699 -82846 -134935 -162882
4601 -162882 -246194 -211819 -49051 31149 51186 16790 1107 -12339 -12124 -71902 -54196 -50534
4589 -50534 3497 10771 -41954 -36804 2030 18811 -17355 -114493 -120474 -75909 -97145 -118400
4577 -118400 -94500 -158719 -37680 38830 101577 113308 34994 -46833 -118014 -157922 -99429
4566 -99429 -122492 -145306 -165939 -79437 -24040 -6170 -8042 20818 4376 6072 18320 2066
4554 2066 55404 131269 116008 79758 59485 -17435 -71729 -2167 60686 116715 61846 -27314
4542 -27314 -67962 -210480 -205152 -157161 -169850 -198712 -161771 -135583 -148798 -168339 -94392 -159548
4530 -159548 -148251 -195788 -128111 -43542 -69676 -45784 -61911 -114478 -87811 25000 -28224
4519 -28224 -43405 -25742 -130411 -150296 -22048 9764 13916 22520 -60819 -16475 -25511 -41107
4507 -41107 -4086 -6888 24149 78351 38269 -88026 -171805 -34113 34395 77422 95849 20763
4495 20763 -36996 -102770 -155829 -162672 -57412 9589 90791 100446 35249 66060 134767 213353
4483 213353 137119 25988 -102457 -155238 -126550 -42689 -24622 -38363 -76909 -73670 -70133 -49576
4471 -49576 -55624 -110964 -35835 -64865 -47258 -25905 -108841 -125789 -43425 -40924 -44927 -50927 -94520
4458 -94520 -150630 -253270 -264930 -232040 -117819 32038 -21193 -103111 -61823 -32335 -39296
4447 -39296 47877 92172 46423 25329 12264 85590 83834 -24983 -93766 -109277 -167481 -169992
4435 -169992 -131985 -104171 -32091 424 36762 -80882 -110537 -71395 -96937 -46461 -183793
4424 -183793 -272510 -154327 -129936 -137241 -124215 -102359 25246 -23739 -27560 -13750 64870 91261
4412 91261 63114 -40873 -113142 -127344 -81249 -130933 -46690 -27078 -72913 -114674 -66010 -104009
4400 -104009 -56038 51988 60752 -20829 -49280 9843 -4551 -12591 -4701 -22917 42990 48262
4388 48262 -48813 -59585 -76190 -29679 17274 71786 43733 -71064 -81209 -64133 -19979 22749
4376 22749 41178 72615 159521 41558 -58881 -73804 -38898 -33439 -123901 -212322 -147669 -80883
4364 -80883 -94292 -177360 -222831 -207578 -151287 -87182 -44264 -12676 -18046 -75755 8315 -46074
4352 -46074 -73788 4452 -61439 -145644 -20160 -13538 16379 70040 37768 3215 -71163 -7302
4340 -7302 29105 12787 36564 63668 43392 36497 -56793 -158108 -132932 -80908 -38417 14364
4328 14364 44211 36149 86656 24383 -64904 -85507 -88154 -112083 -83888 -45862 -57790 -37687
4316 -37687 -13997 37695 -44423 -120973 -92004 -66653 -78459 -34633 -109438 -127963 -74629 42897
4304 42897 70000 -32867 8120 123399 84772 79684 100207 110533 102037 81356 -46475 -40818
4292 -40818 24565 46468 93442 134702 54753 -2874 48767 120567 192605 127831 -71465 -54988
4280 -54988 -38434 -5587 -32941 -66347 -145983 -121315 -76786 -106011 -88091 -107858 -40696 -115886
4268 -115886 -95123 -17071 21326 -4036 -120249 -109162 -157928 -100343 -57782 2071 3867 63438
4256 63438 100439 142620 67508 64325 145229 159791 136746 142989 55158 -10258 -40993 -93417
4244 -93417 -142599 -99293 -25901 44642 8888 -64860 -70699 -121802 -109574 -28633 85617 79729
4232 79729 39818 23305 -66323 -103244 20449 -7823 -121022 -81463 -85381 -70048 -32705 -63836
4220 -63836 28204 28175 17855 87195 32179 40859 24207 -27312 -118969 -140773 -60350 -8031 31443
4207 31443 21413 -100214 -199147 -83447 -38963 -95836 -9394 59087 -29313 -144352 -140011
4196 -140011 -65780 40991 -67850 -135824 -58089 -89893 -92521 -3621 -46519 1714 -56841
4185 -56841 -75034 -126350 -173886 -160331 5804 58016 101250 -15970 -77326 78811 146517
4174 146517 90634 105953 117119 74127 66464 47824 32285 4614 -29265 -40680 -44141 6270
4162 6270 1640 45691 155426 206960 228942 152677 137285 148323 77894 -44954 -32611 -25128
4150 -25128 -18052 55273 78493 55224 -59301 -74083 -48983 22874 62229 59617 104241 130253
4138 130253 80400 92679 17664 -32161 11099 59308 86927 104986 24114 15965 37328 -87728
4126 -87728 -145875 -122861 -122634 -126013 -59103 -43829 -54131 -130065 -95693 -63934 -106886 -138147
4114 -138147 -69903 51956 88843 40827 38352 16713 18348 19102 51011 102891 44525 95146
4102 95146 49763 -3204 -64102 33196 62605 34399 82652 74433 66261 96432 110655 141899
4090 141899 101542 -54186 -63196 -29729 -5104 -27188 23470 29588 -53716 -25572 13314 78385
4078 78385 47940 -53104 -44219 26790 50383 111042 127089 62950 36145 82989 83100 105644
4066 105644 115807 121657 111750 68906 65757 -25060 -19362 -67801 -110495 -155455 -146671 -219622 -234034
4053 -234034 -310490 -284739 -192533 -105178 -108250 -92338 -39731 -45061 -28908 45571 33161 -7655
4041 -7655 -13674 -105721 -153715 -165261 -154005 -70815 -21087 13948 26390 -37217 -69898 -51977
4029 -51977 -107200 -141663 -143498 -185072 -157482 -105079 26694 188857 219636 109069 98569
4018 98569 141288 141904 101451 74935 -19527 -24996 -43441 -125237 -120709 -19766 89965 55875
4006 55875 -27490 -56205 -62247 -50592 -137629 -114416 -53159 80078 90332 44889 -7539 -27486
3994 -27486 -5402 123937 125046 40180 46439 1305 -17228 11386 -32124 -46037 -74574 -37933
3982 -37933 62729 188917 178813 74418 119456 38727 -51323 -36286 12637 111165 145915
3971 145915 52537 12127 -18794 -13685 -58380 -130582 -164232 -149760 -95813 -74062 -83711 -105833
3959 -105833 -116387 -78188 -78968 -144277 -127072 -15912 -82534 -63463 -42907 -51777 -78977 -48177
3947 -48177 -59576 -112908 -12777 30311 5179 -33485 -135739 -205188 -120116 -122865 345
3936 345 125649 220405 197165 133143 67711 -26758 -70560 -82754 -145979 -74102 -68805 -62832
3924 -62832 -100377 -148295 -163416 -94560 -55513 44023 62605 28364 -68821 -97352 -56018 -47811
3912 -47811 -35223 -22280 -14620 -43238 -120152 -133760 -132645 -16428 132537 143978 193176 81519
3900 81519 39388 -29734 -22380 14202 128116 166729 180715 93386 120592 165751 249584 166045
3888 166045 54528 57668 65044 7027 -53548 -73832 -50807 -69953 -9472 -33955 -111429 -153307
3876 -153307 -91864 -81318 -75361 -34555 -27070 -50914 -7105 -568 -78675 -68348 -27992 -15792
3864 -15792 -1899 44880 -22231 -90777 -117283 -108331 -92798 -89798 -58604 -44793 -33634 36229
3852 36229 64238 56324 81914 85236 89158 122144 140128 90593 10339 42907 19498 -39437
3840 -39437 -111544 -90887 -34245 -106173 -191184 -162614 -121913 -86924 -16694 50602 30249 -59387
3828 -59387 -138303 -129155 -57377 46465 40286 -9516 -26125 -54830 -90008 -97389 -48987 1222
3816 1222 -62943 -6288 93165 107707 107721 25975 53070 65411 74384 77485 70885 19565 -42093
3803 -42093 -28149 -11665 12209 -26088 -13153 -66156 -47619 31508 -40146 -46373 -13698 19259
3791 19259 33411 -36252 -109277 -94492 24663 89756 -20287 -84411 -33798 -25376 32871 347
3779 347 28383 -37124 -61455 20225 60230 -64841 -155066 -41570 -37753 -126173 -232869 -276569
3767 -276569 -225993 -144239 -139165 -128852 -71208 -65327 -114143 -91673 -2746 2448 -47155 -32277
3755 -32277 39573 95994 57376 100975 74773 33621 42413 -50807 -167051 -305001 -232770 -179564
3743 -179564 -197370 -76542 -23787 -42734 -100359 -114151 -188628 -165605 -102618 -40954 39971
3732 39971 -3372 -102101 -192328 -201880 -115012 -129657 8924 3098 -116245 -93597 -46949 -26279
3720 -26279 -58581 -126739 -163922 -212021 -211380 -156935 -133316 -79430 103586 211610 146117 -15654
3708 -15654 -33277 -29637 36934 58871 1196 -71270 -116486 -136525 -106717 -79509 -187550 -174092
3696 -174092 -136894 -59694 -88257 -91906 -203869 -283574 -277987 -204753 -144817 -104212 -126728 -207151
3684 -207151 -304642 -241455 -148483 -56394 51517 68566 53248 43190 76838 57720 89555
3673 89555 175358 90675 56062 70047 93500 33133 -54117 -69956 -82658 -59927 -52469 -31383
3661 -31383 -68795 -75555 -26157 -13231 71967 101718 67970 -76752 -92214 -5153 -65346 -47745
3649 -47745 -23387 11497 118021 110237 -66658 -135300 -156225 -117797 -122441 -86264 -16727 2275
3637 2275 -138353 -162945 -118508 -121964 -103188 -84602 -39696 81157 141265 39258 28601 34514
3625 34514 -35611 -46633 -6555 62890 23206 -29235 -89536 -51030 -52478 22701 -9738 -66455
3613 -66455 -100266 -30554 -7194 -53907 -12717 70451 56092 59805 1830 -82905 -27989 -3666
3601 -3666 -156158 -173753 -80564 -202772 -190562 -103175 -66681 -55485 -81424 -130140 -18668
3590 -18668 44210 39641 101118 108338 -75556 -131608 -133888 -206598 -128904 -132384 -158136 -49122
3578 -49122 26922 -47613 -41420 9988 101012 67568 36318 -16454 1123 -104082 -175018 -162868
3566 -162868 -26324 -37990 28348 28120 69196 128516 107950 105263 100456 60551 61921 116619
3554 116619 81384 -32799 -120246 -207988 -261170 -179646 -50849 73378 62246 -5741 52221
3543 52221 30735 7333 -18599 40385 10070 -82974 -84480 -74137 -74950 -64090 -17176 59627
3531 59627 127787 61917 -30520 -7469 -9573 -57756 -5354 72226 30712 -88258 -143544 -111283
3519 -111283 -17096 -12723 -78417 -67660 -162265 -201296 -154571 -96937 -28569 55095 100410 76110
3507 76110 14497 -69017 -165303 -32707 68014 -6886 5871 -62713 -99047 -131338 -117533
3496 -117533 -54414 49809 1887 -130378 -285987 -196438 -130448 -153973 -136666 -68683 -8857
3485 -8857 69287 116904 13370 -58911 -64252 -22398 -26192 -98963 -79232 -60240 -112939 -43453
3473 -43453 8598 -33894 23551 72957 21735 18843 49678 142614 153755 161610 105738 -10489
3461 -10489 33889 81412 103946 125837 81206 -23209 23078 1232 -95235 -152221 -70551 -33264
3449 -33264 -76804 -43857 41986 93548 139490 121399 95370 -803 -68490 -63365 -64464 -43508
3437 -43508 -56106 86985 158092 133134 4348 49444 37149 88 5538 26997 66758 -17473
3425 -17473 -73790 -94683 -55618 52493 113744 67183 -81920 -134998 -15036 94618 80344
3414 80344 120167 65548 9636 -88556 -83597 -9989 9303 -18042 -7135 20388 -20142 -80480
3402 -80480 -30263 -24110 -10958 28899 119950 142839 88564 -14523 -7545 -66526 -119751 -38624
3390 -38624 24955 59447 -36151 -146925 -67019 69690 60187 63753 153161 141024 110079 15189
3378 15189 -4811 3241 63291 80678 125875 92658 44637 34369 51902 62296 197147 284262
3366 284262 266827 35523 -97922 -121941 -147559 -166098 -114485 -31092 -34593 -41712 -18949 -65450
3354 -65450 -27182 50111 -6620 -44511 -115684 -12726 8079 35978 193056 136055 18273
3343 18273 -52968 -53233 -104748 -145088 -83122 18611 35931 -56131 -130586 -16071 -10579 43927
3331 43927 20984 20458 128484 197482 117586 59966 -8395 -38383 9368 -47375 -97718 21071
3319 21071 61812 17855 51630 26183 -10295 -40145 20479 -11642 -60311 -142875 -86005 12379
3307 12379 58707 -6269 7413 31239 -22945 -99123 -113030 -62209 -25607 -59768 -156641 -129645
3295 -129645 -166724 -275757 -226565 -108973 -60919 -68344 -55111 -149677 -247828 -146640 -144613
3284 -144613 -179103 -166724 -122599 -44127 -3473 -6211 22755 -43940 -3648 109863 92797 42917
3272 42917 -52964 -121269 -161544 -82504 -14801 -27960 49005 120487 155004 90899 56767 -6225
3260 -6225 -56267 7499 102465 91660 42006 48376 10905 -77913 14075 57850 -8646 -74177
3248 -74177 -6832 -5437 1001 -89633 -130397 -57103 -28794 17912 24105 -24418 -72190 -6477
3236 -6477 3763 29406 48368 98262 163448 157341 108356 -7461 -37905 31180 29600 -64136
3224 -64136 -34426 -53749 18592 90963 69527 34223 34090 48216 93859 13297 -94719 -101971
3212 -101971 -76764 -63432 -32928 114170 67192 -31466 -130240 -159879 -46613 78070 61648
3201 61648 -85569 -115077 -84776 -74126 -58290 -46382 -3330 -103444 -213951 -90086 -58210
3190 -58210 4198 69548 47303 15370 31694 -58983 -59331 75962 -22946 -136275 -113014 -56213
3178 -56213 -632 27850 77348 34908 -89895 -105600 -60858 -13250 -42732 -36225 -22086 -33762
3166 -33762 -76966 -121103 -64483 -75353 -94630 -224294 -257935 -136715 -53976 -81577 -83345 17772
3154 17772 16764 58372 37603 -10370 -42602 8183 -30026 -120764 -154841 -277229 -215357 -79394
3142 -79394 -148478 -144936 -113620 -24566 85597 66200 -89097 -126340 -117082 -82725 -105336 -115083
3130 -115083 -68717 -34856 65611 88962 53569 -30548 -18756 -28720 89034 137510 87853
3119 87853 23102 2818 93904 130348 41321 -64898 -98290 -29271 32172 83833 40131 66460
3107 66460 99681 44556 40622 8814 -6645 -28930 -38687 -13609 -7173 74805 67664 72584 78175
3094 78175 12245 -35166 -70423 -136218 -77496 5583 33679 -13386 -76498 27327 22626 -196553
3082 -196553 -114173 -27842 -134574 -56404 26981 84627 20534 7077 -19837 -25555 -151351
3071 -151351 -58337 42206 33266 37574 59223 155866 92655 -43776 -27010 -21223 42649 14618
3059 14618 38883 56654 77715 87678 142531 99859 -6459 -93939 -109732 -66162 16808 57850
3047 57850 83631 121306 81574 101565 75632 55132 -337 24770 40582 -10686 -153436 -163141
3035 -163141 -49720 52994 22198 1694 24610 68117 43546 13396 -89648 -102681 -80949
3024 -80949 -68933 -184729 -169551 -196607 -139144 -22876 -21063 -36779 -88305 -183857 -218028 -264691
3012 -264691 -206197 -143368 -122038 -100690 -78905 8239 17937 37503 78318 4959 -54760 -40178
3000 -40178 -52174 -120295 -162270 -90452 29716 -26209 -50627 -76319 -134159 -153302 -119041 -132231
2988 -132231 -164665 10870 98255 24874 12285 19121 -44492 -86796 -50458 -59740 -89128 -138430
2976 -138430 -128811 -36303 6815 6703 -101033 -57288 31260 4048 109094 214968 126927 101714
2964 101714 98407 83283 63447 85755 178261 37527 -35501 -5776 -80638 -48065 6843 -34350
2952 -34350 -103258 -142496 -128135 -4182 196297 233794 157950 127392 20157 -37151 -42988
2941 -42988 35724 61720 182379 166354 92999 64880 32306 16732 96432 94506 10767 -83852
2929 -83852 -17128 -22131 -33538 24996 -61570 -129813 -58826 -40739 -93549 -125748 -45418 25512
2917 25512 26892 -20928 17460 15070 -44389 -41368 -27589 -35602 -2489 -31302 2526 57279 31838
2904 31838 30935 -34082 -47273 11491 45074 96983 204738 118434 33970 25013 -25886 434
2892 434 67800 68816 -26862 13508 7353 -6498 -16268 -64726 -18648 4226 46055 55990 16051
2879 16051 -24694 -84022 -99636 -59486 -63741 -214556 -218138 -128397 -89962 -34393 -40833 -24081
2867 -24081 31901 85241 132381 58238 6276 18663 105539 60749 -43036 -11903 -256 52341
2855 52341 48877 -37618 -61829 -23165 119502 208006 183590 107423 58522 76342 23796 59556
2843 59556 114090 144224 50348 58486 166854 220149 171232 141416 116092 72465 9575 18642
2831 18642 122852 42474 1309 -72849 -158604 -85473 -39812 -39223 -81256 -142934 -147371 -67123
2819 -67123 -7882 -42910 3485 -100186 -107710 -55623 -2355 -12134 12786 -13602 -23542 -89948
2807 -89948 -88562 -37574 -1587 150781 142109 -35990 55280 162705 131246 167715 188318 96648
2795 96648 59063 15458 -37889 -45470 18674 100177 37607 -57768 37870 65415 97785 63993
2783 63993 27662 70985 51062 -16395 -39667 -30045 -16771 -36102 25968 59046 90446 63072
2771 63072 130091 98567 -20767 -121614 -123682 -230937 -185173 26206 85216 1749 82074
2760 82074 131340 57972 48512 30521 -7442 76293 106009 54113 -2339 -39406 -79873 -103248
2748 -103248 -133776 -88602 -106319 -28683 139880 113182 88194 116748 -12308 -34373 97640
2737 97640 192068 260101 298433 147269 116432 79211 -8484 19898 -23780 -17408 25157 72866
2725 72866 111574 6555 5850 31846 41139 -80167 -126610 -124284 -90403 9355 86002 16904
2713 16904 36682 -8081 -47409 -109517 -107679 -45896 61452 106696 126535 61733 -29478 379
2701 379 56879 86614 26967 -8414 -860 25519 78675 122968 64358 13667 -137203 -139270
2689 -139270 -143646 -63917 -57463 -13788 37364 39550 -3003 38146 61977 26579 62001 29598
2677 29598 73500 69523 97385 180038 169874 199875 227658 96160 -21992 -64678 -81631 -69046
2665 -69046 -45150 -58238 -12638 107222 97433 64074 62447 -8298 -61821 -38107 -65348 38257
2653 38257 191695 84573 86689 26090 8898 56095 29594 -20746 12910 -16154 48135 61461
2641 61461 -25830 -16421 -30035 -42174 96776 104850 28552 31906 84606 70963 86592 89032
2629 89032 40076 -50463 20105 36899 133328 106439 36866 56920 94469 135833 78468 42167
2617 42167 65538 82905 32297 77788 105628 39655 75481 71841 36683 7660 75204 173298
2605 173298 160607 116868 -10901 -19153 63253 146801 70235 -22384 -9969 81666 93240 20772
2593 20772 54922 53123 90513 121527 103926 125217 44311 -23027 -74515 -92708 -77932 -11702
2581 -11702 30657 -56680 -19064 52661 52605 19084 58768 54098 52382 40689 131493 121169 40778
2568 40778 56153 18473 -13528 33426 55518 -76204 -220743 -181884 -74838 30017 -5620
2557 -5620 16275 58563 29298 128855 232152 135364 56056 45398 8327 377 106420 194854
2545 194854 138746 126159 148404 90800 -19920 -70028 7520 54469 6902 -53576 -76964
2534 -76964 14902 60589 25250 -67392 -8672 61700 113910 28896 24172 -14351 -67711 -118008
2522 -118008 -108020 12342 55175 45318 74896 143331 92201 4487 -38630 -94529 -45699 -36708
2510 -36708 107217 43534 -1818 -8117 54432 21827 -69072 -57970 -9673 15381 -55126 -125262
2498 -125262 -146094 -139734 -115823 -163260 -218620 -114535 -24439 37888 157407 177501 96999
2487 96999 81801 -41240 -161118 -120777 -23795 -33894 -22514 20677 -44588 -75099 -88037
2476 -88037 -58225 -189062 -159993 -73536 -37468 -25220 18144 16477 29964 110245 210382 148978
2464 148978 40730 45072 99346 128209 40602 34593 867 -15771 -46080 -115705 -74229 24757
2452 24757 -1266 -5037 31109 35888 99769 56381 -20143 -2036 41263 3824 -89198 -45832
2440 -45832 22812 85055 10647 -59863 60944 6882 130099 177749 119288 111244 55125 17700
2428 17700 42853 46303 76603 16310 20788 83659 141865 275732 274002 168824 139594 60872
2416 60872 62834 132396 238977 269002 148244 16990 8156 -20628 28087 107061 5038
2405 5038 7174 137456 208961 108062 17546 -3591 -13546 -4804 -11979 -18488 -63885 -111451 -36450
2392 -36450 43788 55025 -76522 3303 68027 19915 12286 77578 20264 -13282 65634 54071
2380 54071 -16335 32789 34983 9205 -34148 10425 56849 140698 182350 112995 49259 -9335
2368 -9335 28308 17785 -9599 -22049 -5695 -67560 -25290 -57439 -51666 -2202 -57493 -116369
2356 -116369 -53430 -65632 -40122 26176 -21260 -18184 -22625 -75217 -57198 11345 22144 -65010
2344 -65010 -56002 -36744 -67731 -28616 -26604 -21042 738 -3646 -30071 57740 12194 -5955 75477
2331 75477 74570 45104 45739 17418 66410 100350 110392 93436 108994 7468 -73658 -81243 -55046
2318 -55046 159458 201647 112676 109597 73137 -6643 -37672 -28109 -452 -23855 -4506 87215
2306 87215 -15250 -132033 -149089 -73636 -55510 -98409 -100666 -45671 -58777 -52636 -43847 62415
2294 62415 128690 174734 146979 56499 25275 40939 34538 3830 -43262 -56446 33730 106650
2282 106650 146529 105046 647 -54706 23638 53908 11401 -64582 -127493 -138726 -100250
2271 -100250 -158172 -223484 -232086 -223618 -139107 -51192 44029 25724 51588 -123375 -217634 -159061
2259 -159061 -113610 -157586 -48348 -1470 -45821 -13968 43568 106691 135368 118253 43722
2248 43722 -65703 -94247 -71533 -17809 14302 16118 -60888 -31041 -28594 29971 69672 11926
2236 11926 -526 -36670 -58384 -58754 -25165 52368 -17467 -62391 -50592 -55000 -41111 19745
2224 19745 35566 45982 -43922 -86061 -91985 -92447 -59079 -128193 -123851 5722 7391 -101324
2212 -101324 -83939 -45697 -27443 42161 78023 92306 97713 77389 80955 11517 -5131 -130275
2200 -130275 -128786 -82262 2132 29416 77382 101464 79857 1484 13871 -68926 -135628 -95034
2188 -95034 -94212 -46336 -25388 -12571 -12578 -32746 -25996 -111107 -88201 -26830 -72821 -5665 48903
2175 48903 -2795 13049 -13469 -6879 -36266 -54974 -21532 -64062 -32698 37897 136273 191365
2163 191365 178124 64329 13700 -21516 44280 96082 102840 11921 10130 29887 27056 -61453
2151 -61453 58674 70354 16940 -34063 -38903 -36573 -65946 -51521 -36505 4441 57609 56408
2139 56408 65005 11944 -3892 11678 11429 23771 -65888 -55562 -16020 37455 -83769 -68012
2127 -68012 -19433 -41592 -47962 100773 138386 -6475 12872 108036 88116 59040 29047 -20014
2115 -20014 -79791 -154693 -144650 -77213 -18688 -17573 30377 1064 -30382 77350 83204 49816
2103 49816 -25296 12464 27140 72822 77641 89127 64039 179859 86219 -11325 8221 69044
2091 69044 121678 133359 96596 119200 117113 140954 80183 52880 19091 68063 118564 42910
2079 42910 -54739 -75444 -85895 -92815 -108703 -122119 -120122 -83370 39838 9644 19869 -32987
2067 -32987 -50828 -76295 2407 213 6487 55449 -768 -64505 -65995 -74006 -39634 -71516 -55274
2054 -55274 -52913 -90334 -46556 66334 111275 36684 -51644 -92381 44477 89726 17528 -37471
2042 -37471 -27847 -33126 52689 60224 21477 8317 -48220 -75447 -66298 -45940 10144 -60382 -73511
2029 -73511 -76379 -96057 -52099 81856 151314 158514 111910 108802 73007 37613 -31207 -28079
2017 -28079 -8560 -12235 24869 14368 -52526 17743 133712 34628 -80073 -110868 -45280 39064
2005 39064 53351 90297 76537 116792 121857 121391 84508 23013 -113348 -61525 -31896 -51881
1993 -51881 -81984 -38578 -26255 34722 863 -134719 -27601 28394 -42366 -114160 -106130 -4832
1981 -4832 67732 49650 -32166 -111599 9935 111322 21723 -20529 -99000 -26534 81931
1970 81931 36529 -72719 -64441 -80034 1862 85469 160308 170102 180174 64814 33156 119100
1958 119100 84835 82822 67344 96167 136579 124311 133562 166294 230674 176751 156866 84881
1946 84881 -45889 -35628 -78167 -28704 -12236 61926 130165 109643 46307 -42702 -33209 19242
1934 19242 115256 88464 51339 35376 46210 -61353 -54452 20324 119900 66077 23801 51072
1922 51072 89423 -17204 -113350 -135552 -52372 -64718 -116999 -29474 6461 25241 103455 166129
1910 166129 114151 41618 105383 182946 122786 120179 93016 62736 64162 81017 185258 129532
1898 129532 110140 46486 69051 33462 -30806 -58142 -77026 -36474 12206 12102 -22761 7006
1886 7006 -17748 -117847 -16668 22435 -8818 -16408 -20527 -37628 -56308 80734 27938 39640
1874 39640 77354 -11634 50079 50672 36375 56074 76480 20473 8924 9298 36861 17315 17337
1861 17337 -44592 8384 32916 23393 -22884 30749 37712 15313 17750 -34080 -59165 -25882
1849 -25882 -57025 -73334 -90325 -62910 -100292 -186297 -257855 -194518 -123839 25179 33812 -105850
1837 -105850 -15194 -2214 -22892 -34790 12419 83110 141807 214546 216571 151109 58915 -15188
1825 -15188 -74456 -57666 -42584 -23997 45053 -18150 23405 38367 52377 -27621 -92821 -48378
1813 -48378 55830 103527 121058 155852 106443 89762 75888 91802 37150 -12806 6490 -9335
1801 -9335 45646 63557 24663 57601 130359 120042 105172 46632 31387 28962 58466 8270
1789 8270 -77429 -7073 -23087 -23099 -61031 -47678 -31561 -32186 -40764 21187 9947 -12222 -52808
1776 -52808 -14372 -19724 -49365 -63611 -36217 5487 5324 27918 53601 96719 59414 61996 -43518
1763 -43518 -38236 56596 92787 47135 90829 105404 65727 59533 55623 50344 1320 -692 29706
1750 29706 1126 6328 -36275 -17937 30178 11685 -6296 -105709 -130290 -108339 -18295 27033
1738 27033 95151 185855 232633 138472 71285 32458 37494 51053 66686 157093 101956 147330
1726 147330 121193 206539 344790 288051 262822 216141 63947 -35968 -100736 -59367 49638
1715 49638 37681 -23554 -117095 -114975 -84455 -53714 -38527 22846 78514 1753 -60396 -33666
1703 -33666 46089 124682 65288 28389 -64839 -60923 52182 60621 72099 99199 133267 74362
1691 74362 54826 -3605 23356 149330 140454 26085 -24525 -82288 -3612 15795 -35701 -49959
1679 -49959 -117287 -91896 -25011 -55796 -65138 5683 -42356 -74562 -48165 6113 30847 7692
1667 7692 5473 -14284 -25277 -45183 -158505 -203776 -77539 -89365 -94832 -21154 -50005 -147367
1655 -147367 -145337 -80618 -33668 78663 49196 18934 102715 42685 36924 27814 7348 -81504
1643 -81504 -142880 -61755 51264 90677 117033 82673 51313 44825 9443 -34585 -25231 55528
1631 55528 157582 122922 72380 -5501 28597 114817 221624 320662 238981 250324 219034
1620 219034 167109 147753 131505 96009 45403 46585 129826 189643 222789 142433 110605 -2439
1608 -2439 -54390 -3530 -40260 -12087 54818 -22945 -65734 21602 54823 176407 213158 231522
1596 231522 89188 94435 143127 141780 147407 186639 219284 204541 189962 179041 138074 73864
1584 73864 60973 -47772 -33157 18861 35445 -25589 -115965 -28582 73764 51825 41769
1573 41769 64441 129314 96755 119827 81489 30035 -112955 -69410 -54444 -34359 55513 66445
1561 66445 31453 -30490 -31242 -70606 23164 48182 125153 128074 10406 -8390 -66602 -36348
1549 -36348 10418 56429 163758 205183 172534 146707 34500 -62781 -33849 -43883 -39598 65810
1537 65810 26593 2591 46384 78449 39695 -5575 -21942 1604 29121 3052 -103295 -114733
1525 -114733 -32352 -12440 44059 71784 18292 -1854 101540 102366 21920 -76808 -77043 -2249
1513 -2249 136730 179790 164278 50307 -111099 -97149 26064 162166 146071 65807 19170
1502 19170 90080 63352 57867 42381 101977 78565 148250 232488 104832 3437 -22874 18434
1490 18434 57312 54125 65077 49741 64038 74109 78234 51796 92174 180865 135851 125817
1478 125817 143116 154133 101171 37291 37637 71853 132168 122086 113114 127025 68706 -31092
1466 -31092 -29704 25847 17688 -110342 -96865 47571 87104 70744 89023 120264 88562 86972
1454 86972 112715 178437 237465 183179 267431 236615 73927 82344 126946 53091 -161553 -209981
1442 -209981 -172616 -181535 -158201 -56334 -43940 -102175 -8914 40832 4007 -5573 78718 155211
1430 155211 199436 88302 140993 119306 -8375 -77778 -48917 37910 167977 156403 79967
1419 79967 40896 73368 54725 9817 13094 -50602 -40624 -35877 -887 13511 28543 45536
1407 45536 126211 169056 177319 139127 143488 101342 36579 155840 177611 175905 164560 195750
1395 195750 188423 54581 -9184 102265 78317 -3968 -71441 -56540 5649 94617 98606 -36785
1383 -36785 -45368 26814 33095 12902 19166 -25391 -27556 102543 129587 195558 142251 56050
1371 56050 366 17468 43232 60196 -6993 -1449 -16262 38479 -7008 26135 114665 132570
1359 132570 155499 80187 -11330 -11480 63870 97671 40260 -25920 -33582 -75043 -65371 -5630
1347 -5630 2536 -2996 49117 61986 -9340 4988 -67048 -112965 -61510 -42884 -95821 -93564 7061
1334 7061 -9248 -40084 -19258 124133 211115 229395 183071 131756 144379 117942 96569 70368
1322 70368 143965 174063 98769 9521 -6170 -47115 71848 55254 12481 -30011 -68732 -4839
1310 -4839 43689 23975 96591 143436 107462 9538 -44774 -101983 -90069 -50508 -80971 -28161
1298 -28161 86639 86829 114886 116825 10352 -58823 29114 91177 171824 173088 153079 84081
1286 84081 136226 177471 115468 35188 42709 67072 137446 164957 225067 194357 187551 121461
1274 121461 21649 66680 26386 73379 193494 183015 96642 107065 26181 94164 177815
1263 177815 171996 120907 37159 -4412 -45442 -59946 -24890 4931 69903 39921 6549 -91840
1251 -91840 -122889 -93356 20006 38990 75976 107964 151393 169486 103121 35726 31972 10739
1239 10739 -16887 -113607 -95545 -55680 31024 58474 -15598 -40787 107107 263009 132563
1228 132563 49725 24659 18176 76896 59535 159386 102728 5545 36712 23242 -84520 -123639
1216 -123639 -156001 -145012 -71251 -66074 -17167 -46766 -42563 52540 90560 54207 15543 41867
1204 41867 50672 79625 -17063 -89291 -117476 -20489 52026 34531 8043 30625 37644 38318 -12351
1191 -12351 -95133 -87752 -81816 -19798 54726 68963 102061 120118 93098 74237 -2574 -101623
1179 -101623 -52224 -17825 32050 -67813 -139978 -115890 -37796 -95053 -97320 -6930 70493 149771
1167 149771 70667 92312 77505 45689 20484 56081 100271 68180 31507 14965 -30075 -88144
1155 -88144 -80778 -29959 49683 16356 5400 -2300 23685 -8131 58471 194119 250803 126507
1143 126507 -46057 -22962 36137 127690 133584 152289 126973 54336 60981 88829 162941 184873
1131 184873 124808 41714 45726 61702 154605 72277 21761 -91829 -40960 -87095 -139515 -9452
1119 -9452 144052 170116 141952 84807 64040 62293 65846 80860 236386 267534 123033 32310
1107 32310 -29955 30279 52236 62353 21890 -25356 5744 35479 1529 -8721 8282 6409
1095 6409 116897 51528 102665 97107 150009 179886 155147 78129 109213 142108 145406 115643
1083 115643 64564 25576 110461 183276 230349 179573 95077 88717 111146 109091 57521 79331
1071 79331 20170 -4942 -9022 27462 124214 205540 180373 104236 146490 195378 303745 330012
1059 330012 183479 73868 39771 2438 -29796 29511 7729 26244 116274 65123 -38429
1048 -38429 -43420 -124929 -197895 -134511 -107132 -20363 -13024 83580 41077 23039 105846 84560
1036 84560 -84874 1193 -3626 49493 118699 54761 49870 77576 17081 92612 257830 283120
1024 283120 350330 258096 107158 47985 -1500 3019 95859 104075 88822 57654 -2189 16443
1012 16443 99640 102071 52779 -3763 6111 -4698 -15002 -21772 -25919 54802 -38946 -82400 17941
999 17941 124968 119691 74970 42924 -73666 -85661 -49993 -13326 51272 96672 62908 29905
987 29905 83334 -5369 -75678 -72495 79284 162643 210200 206743 153545 139643 120678 125530
975 125530 112705 75624 51677 147162 218207 250932 183385 136068 74147 31471 16813 69420
963 69420 11561 15374 79317 103772 93423 43657 -49324 -53497 -33206 -82346 42979 166303
951 166303 227547 249745 121303 51174 4385 69495 46963 63492 131481 211039 231705 187782
$$ [...]
##END NTUPLES=NMR SPECTRUM
##END=
