##TITLE=Analysis number 308992
Compound Code cc 21704
Book Reference 440/18
Project Code adrs
Chemist Name craigr
##JCAMPDX= 6.0         $$ Bruker NMR JCAMP-DX V2.0
##DATA TYPE= NMR SPECTRUM
##DATA CLASS= NTUPLES
##ORIGIN= Bruker BioSpin GmbH
##OWNER= NMR
$$ XWIN-NMR		Version 3.5
$$ Thu May 26 11:19:54 2005 GMT Daylight Time (UT+1h)  MAYBRIDGE\NMR@NMR_250MHZ
##.OBSERVE FREQUENCY= 250.131544655141
##.OBSERVE NUCLEUS= ^1H
##.ACQUISITION MODE= SIMULTANEOUS (DQD)
##.ACQUISITION SCHEME= undefined
##.AVERAGES= 16
##.DIGITISER RES= 18
##SPECTROMETER/DATA SYSTEM= dpx250
##.PULSE SEQUENCE= zg30
##.SOLVENT NAME= CDCl3
##.SHIFT REFERENCE= (INTERNAL, CDCl3, 0, 16.4627)
##AUDIT TRAIL= $$ (NUMBER, WHEN, WHO, WHERE, WHAT)
$$ ##TITLE= Audit trail, XWIN-NMR		Version 3.5
$$ ##JCAMPDX= 5.01
$$ ##ORIGIN= Bruker BioSpin GmbH
$$ ##OWNER= NMR
$$ C:\u/data/dgb/nmr/ADRS/3570/pdata/1/auditp.txt
$$ ##AUDIT TRAIL=  $$ (NUMBER, WHEN, WHO, WHERE, WHAT)
(   1,<2005-05-26 11:19:33.35 +100>,<MAYBRIDGE\NMR>,<NMR_250MHZ>,
      <created by zg, POWCHK disabled, PULCHK disabled
       configuration hash MD5:
       62 19 C7 07 E1 42 D1 B7 37 6C 3D D0 77 39 F9 E6
       data hash MD5: 64K
       34 64 E7 63 4A 09 66 0F 5A 6A 84 44 42 89 A9 2A>)
(   2,<2005-05-26 11:19:46.43 +100>,<MAYBRIDGE\NMR>,<NMR_250MHZ>,
      <Start of raw data processing
       ef LB = 0.3 FT_mod = 6 PKNL = 1 SI = 32K 
       data hash MD5: 32K
       A1 F2 68 88 B7 78 DA A0 CB 60 91 AB 98 C1 BC 45>)
(   3,<2005-05-26 11:19:48.35 +100>,<MAYBRIDGE\NMR>,<NMR_250MHZ>,
      <apk 
       data hash MD5: 32K
       3F 82 2D F2 33 46 41 D7 9A C9 FF BC 24 D1 33 46>)
(   4,<2005-05-26 11:19:48.99 +100>,<MAYBRIDGE\NMR>,<NMR_250MHZ>,
      <abs ABSG = 5 
       data hash MD5: 32K
       97 09 03 C8 50 F3 77 06 96 73 CD CD 86 D5 05 DA>)
$$ ##END=
$$ 
$$ hash MD5
$$ CD EC 30 08 6F AE B9 91 89 83 96 27 F4 C4 9B 88
##$RELAX= 
##$RELAX= 
##$RELAX= 
##$RELAX= 
##$RELAX= 
##$RELAX= 
##$RELAX= 
$$ Bruker specific parameters
$$ --------------------------
##$DU= <C:\u>
##$EXPNO= 3570
##$NAME= <ADRS>
##$PROCNO= 1
##$TYPE= <nmr>
##$USER= <dgb>
##$AMP= (0..31)
100 100 100 100 100 100 100 100 100 100 100 100 100 100 100 100 100 100 
100 100 100 100 100 100 100 100 100 100 100 100 100 100 
##$AQSEQ= 0
##$AQ_mod= 3
##$AUNM= <au_zg>
##$AUTOPOS= <14 >
##$BF1= 250.13
##$BF2= 250.13
##$BF3= 250.13
##$BF4= 250.13
##$BF5= 500.13
##$BF6= 500.13
##$BF7= 500.13
##$BF8= 500.13
##$BYTORDA= 1
##$CFDGTYP= 0
##$CFRGTYP= 5
##$CHEMSTR= <none>
##$CNST= (0..31)
1 1 145 1 1 1 1 1 1 1 1 1 1 1 1 1 1 1 1 1 1 1 1 1 1 1 1 1 1 1 1 1 
##$CPDPRG= <>
##$CPDPRG1= <>
##$CPDPRG2= <>
##$CPDPRG3= <>
##$CPDPRG4= <mlev>
##$CPDPRG5= <mlev>
##$CPDPRG6= <mlev>
##$CPDPRG7= <mlev>
##$CPDPRG8= <mlev>
##$CPDPRGB= <>
##$CPDPRGT= <>
##$D= (0..31)
0 1 0 0 0 0 0 0 0 0.06 0 0 0 0 0 0 0.0002 0 0 0 0 0 0 0 0 0 0 0 0 0 0 
0 
##$DATE= 1117102772
##$DBL= (0..7)
120 120 120 120 120 120 120 120 
##$DBP= (0..7)
150 150 150 150 150 150 150 150 
##$DBP07= 0
##$DBPNAM0= <>
##$DBPNAM1= <>
$$ [...]
##$SUBNAM7= <"">
##$SUBNAM8= <"">
##$SUBNAM9= <"">
##$SW= 20.6930455092707
##$SWIBOX= (0..15)
0 0 3 0 0 0 0 0 0 0 0 0 0 0 0 0 
##$SW_h= 5175.983436853
##$TD= 65536
##$TD0= 1
##$TE= 294.16
##$TE2= 300
##$TE3= 300
##$TEG= 300
##$TL= (0..7)
0 120 120 120 120 120 120 120 
##$TP= (0..7)
150 150 150 150 150 150 150 150 
##$TP07= 0
##$TPNAME0= <>
##$TPNAME1= <>
##$TPNAME2= <>
##$TPNAME3= <>
##$TPNAME4= <>
##$TPNAME5= <>
##$TPNAME6= <>
##$TPNAME7= <>
##$TPOAL= (0..7)
0.5 0.5 0.5 0.5 0.5 0.5 0.5 0.5 
##$TPOFFS= (0..7)
0 0 0 0 0 0 0 0 
##$TUNHIN= 0
##$TUNHOUT= 0
##$TUNXOUT= 0
##$USERA1= <user>
##$USERA2= <user>
##$USERA3= <user>
##$USERA4= <user>
##$USERA5= <user>
##$V9= 5
##$VALIST= <valist>
##$VCLIST= <CCCCCCCCCCCCCCC>
##$VD= 0
##$VDLIST= <DDDDDDDDDDDDDDD>
##$VPLIST= <PPPPPPPPPPPPPPP>
##$VTLIST= <TTTTTTTTTTTTTTT>
##$WBST= 1024
##$WBSW= 4
##$XGAIN= (0..3)
0 0 0 0 
##$XL= 0
##$YL= 0
##$YMAX_a= 356247
##$YMIN_a= -359460
##$ZGOPTNS= <>
##$ZL1= 120
##$ZL2= 120
##$ZL3= 120
##$ZL4= 120
##$ABSF1= 16.46271
##$ABSF2= -4.230463
##$ABSG= 5
##$ABSL= 3
##$ALPHA= 0
##$AQORDER= 0
##$ASSFAC= 0
##$ASSFACI= 0
##$ASSFACX= 0
##$ASSWID= 0
##$AUNMP= <proc_1d>
##$AZFE= 0.1
##$AZFW= 0.1
##$BCFW= 0
##$BC_mod= 0
##$BYTORDP= 0
##$COROFFS= 0
##$CY= 12.5
##$DATMOD= 1
##$DC= 0
##$DFILT= <>
##$DTYPP= 0
##$F1P= 14.0000005364418
##$F2P= -0.99999901652339
##$FCOR= 0.5
##$FTSIZE= 32768
##$FT_mod= 6
##$GAMMA= 0
##$GB= 0
##$INTBC= 1
##$INTSCL= 1
##$ISEN= 128
##$LB= 0.3
##$LEV0= 0
##$LPBIN= 0
##$MAXI= 10000
##$MC2= 0
##$MEAN= 0
##$ME_mod= 0
##$MI= 0
##$NCOEF= 0
##$NC_proc= -2
##$NLEV= 6
##$NOISF1= 0
##$NOISF2= 0
##$NSP= 0
##$NTH_PI= 0
##$NZP= 0
##$OFFSET= 16.46271
##$PC= 1
##$PHC0= -75.67212
##$PHC1= 8.541633
##$PH_mod= 1
##$PKNL= yes
##$PPARMOD= 0
##$PSCAL= 4
##$PSIGN= 0
##$REVERSE= no
##$SF= 250.130014829936
##$SI= 32768
##$SIGF1= 0
##$SIGF2= 0
##$SINO= 400
##$SIOLD= 32768
##$SREGLST= <1H.CDCl3>
##$SSB= 0
##$STSI= 32768
##$STSR= 0
##$SW_p= 5175.98343685301
##$SYMM= 0
##$S_DEV= 0
##$TDeff= 65536
##$TDoff= 0
##$TI= <Analysis number 999999
Compound Code 99
Book Reference 9
Project Code 9>
##$TILT= no
##$TM1= 0
##$TM2= 0
##$TOPLEV= 0
##$USERP1= <user>
##$USERP2= <user>
##$USERP3= <user>
##$USERP4= <user>
##$USERP5= <user>
##$WDW= 1
##$XDIM= 32768
##$YMAX_p= 278499806
##$YMIN_p= -308105
$$ End of Bruker specific parameters
$$ ---------------------------------
##NTUPLES= NMR SPECTRUM
##VAR_NAME=  FREQUENCY,     SPECTRUM/REAL,   SPECTRUM/IMAG
##SYMBOL=    X,             R,               I
##VAR_TYPE=  INDEPENDENT,   DEPENDENT,       DEPENDENT
##VAR_FORM=  AFFN,          ASDF,            ASDF
##VAR_DIM=   32768,         32768,           32768
##UNITS=     HZ,            ARBITRARY UNITS, ARBITRARY UNITS
##FACTOR=    0.157963299565203, 1,           1
##FIRST=     4117.81775308639, 0,            0
##LAST=      -1058.16568376662, 0,           0
##MIN=       -1058.16568376662, -308105,     0
##MAX=       4117.81775308639, 278499806,    0
$$ Real data points
##PAGE= N=1
##DATA TABLE= (X++(R..R)), XYDATA
$$ [...]
17326c3290K100J4037j187p025o600J0719k697Q436j7m82P170l357m956k469J5321
$$ -33290 -31190 -17153 -18340 -25365 -31965 -21246 -23943 -15507 -15524 -16006 -8836 -12193 -17149 -19618 -4297
17311d297J0685l515N197l108R62J525J3569K0464J7438N000l429J7940j3261
$$ -4297 6388 2873 8070 4962 5924 7449 21018 41482 58920 63920 60491 78431 65170
17298F5170j3169M531Q336m734j7849p987R914j0597o614K15n383j1987n671k894
$$ 65170 52001 56532 64868 60134 42285 34298 44212 33615 27001 27216 21833 9846 4175 1281
17284A281k0736p375L798J5058K0213n946N534N231J1429J0688n741o187k974
$$ 1281 -19455 -26830 -23032 -7974 12239 6293 11827 17058 28487 39175 33434 27247 24273
17271B4273j3523j4135j2045Q476L091O165R454J2015J7906Q550J6782K0735J2261
$$ 24273 10750 -3385 -15430 -6954 -3863 2302 11756 23771 41677 50227 67009 87744 100005
17258A00005J5133N07j0279p504L834J184r966m855K52m199j6159p160r418K165
$$ 100005 115138 115645 105366 97862 101696 102880 92914 88059 88311 84112 67953 60793 51375 53540
17244E3540k5671j8478J2536Q262L770o980l344k309O52o374J252j8610j5993
$$ 53540 27869 9391 21927 30189 33959 26979 23635 21326 21978 15604 16856 -1754 -17747
17231a7747L804L472K384m69O954Q584N871k075N15L696J1984k975o775j586J3745
$$ -17747 -13943 -10471 -8087 -8556 -1602 6982 12853 10778 11293 14989 26973 23998 17223 15637 29382
17216B9382O228Q527l589K257q086J318r34n064J2435K908j402j3036j3538n303
$$ 29382 35610 44137 40548 42805 34719 36037 35103 30039 42474 45382 43980 30944 17406 12103
17202A2103j0046j4098O779M699M677n460J922R028o947j5702J0202N924j0803
$$ 12103 2057 -12041 -5262 -563 4114 -1346 576 9604 2657 -13045 -2843 3081 -7722
17189g722m171q295J2702n883j1889M198j037N86J967n135j8016r67K1792K035
$$ -7722 -11893 -20188 -7486 -13369 -25258 -21060 -22097 -21511 -19544 -24679 -42695 -43662 -21870 -19835
17175a9835j6299J5982J5067J0862O472P572l388m040r851J597r57r917n62J5917
$$ -19835 -36134 -20152 -5085 5777 12249 19821 16433 12393 2542 4139 3182 -6735 -7297 8620
17161H620r167j2639j745N150n40L831r372m189N816J1835J0231j990m933J7057
$$ 8620 -547 -13186 -14931 -9781 -10321 -6490 -15862 -20051 -14235 -2400 7831 5841 908 17965
17147A7965J7128O4J8523K8403L0981J9967J6322J116N138J1081R723N464o727
$$ 17965 35093 35157 53680 82083 113064 133031 149353 150469 155607 166688 176411 181875 175148
17134A75148k7703l4314m0253j8651l563j1922j6767j3565N37L1336R380j2338
$$ 175148 147445 113131 72878 54227 50664 38742 21975 8410 8947 40283 49663 37325
17122C7325k4461R014n152j1430Q439L250Q485J6829J0768O922L4114M4906K7792
$$ 37325 12864 21878 16726 5296 13735 16985 25470 42299 53067 59989 94103 139009 166801
17109A66801O26j4709o61R959J4141K0763M159r365k3951o803K651O132P448J2929
$$ 166801 167427 152718 152057 162016 176157 196920 201079 191714 167763 160960 163611 169743 177191 190120
17095A90120j6946k7381l882o425J5557K6366O157l4554l3314k5636j4733p357
$$ 190120 173174 145793 141911 135486 151043 177409 183566 149012 115698 90062 75329 67972
17083F7972j4064k5416p945p157k345J1530R829J2227q037j0051m3R902Q833j906
$$ 67972 53908 28492 20547 13390 11045 22575 32404 44631 36594 26543 26500 36402 45235 43329
17069D3329Q882j0150J5409K5261M1026M9679J1037R91k7624r120K1195J2700
$$ 43329 52211 42061 57470 82731 123757 173436 184473 185464 157840 148720 169915 182615
17057A82615q544k8913n0453l4701j1690r556j5440n192l378n967J377P671J832
$$ 182615 174071 145158 94705 60004 48314 38758 23318 18126 14748 8781 10158 17829 19661
17044A9661j6287q977m937l806Q247J1458N738m430K883j562o12n380j0824K042
$$ 19661 3374 -5603 -10540 -14346 -6099 5359 11097 6667 9550 7988 7376 1996 -8828 -6786
17030f786J5975J1688l980o648m723R51q255p877J0133r35k250l609l439J3063
$$ -6786 9189 20877 16897 10249 5526 6477 -1778 -9655 478 -457 -2707 -6316 -9755 3308
17016C308j5099j5024P059K38n800j0207n914N071K2567R32O209K4188r838l808
$$ 3308 -11791 -26815 -19756 -19518 -25318 -35525 -41439 -36368 -13801 -12869 -6660 17528 7690 3882
17002C882o690J1440J0323j644j874k692N017r407l85j608R434j763o028l115
$$ 3882 -2808 8632 18955 17311 15437 12745 17762 8355 7970 6362 15796 14033 8005 4890
16988D890m51o260q215P503p71l663n537K881J5033R107j5521j8704k183N621
$$ 4890 4439 -1821 -10036 -2533 -3304 -6967 -12504 -9623 5410 14517 -1004 -19708 -21891 -16270
16974a6270l683J1760J571r86j1412n496Q762L287J1856J5715l863n335p150l421
$$ -16270 -19953 -8193 -6622 -7608 -19020 -24516 -15754 -12467 -611 15104 11241 5906 -1244 -4665
16960d665p449j8797p768l689J524L962J0867P925M113r97J165N249j444j3319
$$ -4665 -12114 -30911 -38679 -42368 -40844 -36882 -26015 -18090 -13977 -14974 -13809 -8560 -10004 -23323
16946b3323j1853J8704P729o818m98j1720K768J1974O726Q761K076j0899k934
$$ -23323 -35176 -16472 -8743 -15561 -16059 -27779 -25011 -13037 -6311 2450 4526 -6373 -9307
16933i307p394J297J0820Q646K68J1400P660M952L807J3767J023j2285j0132k62
$$ -9307 -16701 -15404 -4584 4062 4330 15730 23390 28342 32149 45916 46939 34654 24522 24260
16919B4260K4047K8422K9241L8125O4203Q689l898J0015M2425O2729M4051m709
$$ 24260 48307 76729 105970 144095 208298 216987 213089 223104 265529 328258 372309 367600
16907C67600m7473n2047k8833Q038O944k2340l5612m0029l3615k2814l2535k8983
$$ 367600 320127 268080 239247 247285 254229 231889 196277 156248 122633 99819 67284 38301
16895C8301k994k320J970J2765m621j0175j7154L157q331k14P313L273p44j125
$$ 38301 35307 32987 34957 47722 43101 32926 15772 18929 10598 10384 17697 20970 20226 19101
16881A9101p859p285L536p430k958L45J0729K067N30o130Q110p903j1356Q104
$$ 19101 11242 3957 7493 63 -2895 -2550 8179 10246 10776 4646 12756 4853 -6503 1601
16867A601J7616K0282M0782L2310K8463M7579J4374m951K2764N1338N2974K6762
$$ 1601 19217 39499 80281 112591 141054 188633 203007 198056 220820 272158 325132 351894
16855C51894l2992m8199l3993j0667p081j9248l6173m6793l9812l0977j3059j3292
$$ 351894 318902 270703 236710 226043 218962 199714 163541 116748 76936 45959 32900 19608
16843A9608r365P446K169l917P015K109L91o746o986J524j3909j3006J531n93
$$ 19608 10243 17689 19858 15941 22956 25065 25456 18710 11724 13248 -661 -13667 -12136 -12729
16829a2729J6606M310O096j7160j1614p477J0300K0582q171j5426L495N039J5463
$$ -12729 3877 8187 14283 -2877 -14491 -21968 -11668 8914 743 -14683 -11188 -6149 9314
16816I314j692J0874L508n843n518m476J5244O337j3548j1825j1879P034L910
$$ 9314 7622 18496 22004 16161 10643 6167 21411 27748 14200 2375 -9504 -2470 1440
16803A440L360j580o495o216n760k377J0741j41j120j1375p043J668r685k879
$$ 1440 4800 3220 -3275 -9491 -15251 -17628 -6887 -7028 -8148 -19523 -26566 -24898 -34583 -37462
16789c7462J6078J0682J191R575O198P111o54q557j3394r14K3799J939r957j4159
$$ -37462 -21384 -10702 -9511 64 6262 13373 12719 4162 -9232 -10146 13653 15592 5635 -8524
16775h524J0119J5506l047o77l017n202r746K812N475J8399l429j8456m513J1621
$$ -8524 1595 17101 14054 13377 10360 5158 -4588 -1776 3699 22098 18669 213 -4300 7321
16761G321J3095L067j391m702r747m206o32J076m825j2457m603R460N953m447
$$ 7321 20416 23483 22092 17390 7643 3437 2805 3881 -944 -13401 -18004 -8544 -2591 -7038
16747g038l385J567k305m723P516k66r431o671M724q312R788N778Q28p974p218
$$ -7038 -10423 -8856 -11161 -15884 -8368 -8634 -18065 -24736 -20012 -28324 -18536 -12758 -11930 -19904 -27122
16732b7122O612J9296K597P89q009j2307j1195L750J0881m123M635K5385O275
$$ -27122 -20510 -1214 1383 2172 -5837 -18144 -29339 -25589 -14708 -18831 -14196 11189 17464
16719A7464m012Q354N994J3160P823m170j5485l798j715j7150J753j0469J1498
$$ 17464 13452 21806 27800 40960 48783 44613 29128 25330 23615 6465 8218 -2251 9247
16706I247N841j319l836j9240R188O975P303J1651J3129j4158j4662N02n788j995
$$ 9247 15088 13769 9933 -9307 -119 6856 14159 25810 38939 24781 10119 10621 4833 2838
16692B838O653q295j6718q890N65k21N578k628r208M198N029k473N364K312J6813
$$ 2838 9491 1196 -15522 -24412 -23847 -24068 -18490 -21118 -30326 -26128 -21099 -23572 -18208 -15896 917
16677I17O849n005n23M429j256j525M088j4528p345m271K306q2J0985Q670O85
$$ 917 7766 2761 2238 6667 5411 3886 7974 -6554 -13899 -18170 -15864 -15946 -4961 3709 4394
16662D394P63p074j3388J776O138j594J954r374J1001O649R806j5725J205R007
$$ 4394 5157 -1917 -15305 -13529 -7391 -8985 -7031 -16405 -5404 1245 11051 -4674 -3469 5538
16648E538m194j4286j0319p3M305N217k309M779K808r030J4686J8741l731o639
$$ 5538 1344 -12942 -23261 -23334 -19029 -13812 -16121 -11342 -8534 -17564 -2878 15863 12132 5493
16634E493k981N88J851k431M92j2799M688P589J086J533j8294n393n303j1244
$$ 5493 2512 3100 4951 2520 3012 -9787 -5099 2490 3576 5109 -13185 -18578 -23881 -35125
16620c5125j205M774N712P032J3210r82R905L174L34j8745J43N935j3353L118
$$ -35125 -36330 -31556 -25844 -18812 -5602 -6584 3321 6495 6829 -11916 -11773 -5838 -19191 -16073
16606a6073K0744L030k8689j1110J1254O370n130J5122o603J0480j2679l1799
$$ -16073 4671 7701 -20988 -32098 -20844 -14474 -19604 -4482 -11085 -605 -13284 -45083
16594d5083r558K0772L1337J5513q047q818J2208L356r432l335r568j5685O235
$$ -45083 -54641 -33869 -2532 12981 4934 -3884 8324 11680 2248 -1087 -10655 -26340 -20105
16581b0105R400j2255J0305R979N021J438o656j434n388l97O001N32l458J31j8189
$$ -20105 -10705 -22960 -12655 -2676 2345 3783 -2873 -4307 -9695 -10092 -4091 -3559 -7017 -6886 -25075
16566b5075k0246M386K1600K5276j074J5637p116j5654R633j1478L019J484j224
$$ -25075 -45321 -40935 -19335 5941 4867 20504 13388 -2266 7367 -4111 -1092 392 -832
16553h32m081O781N93j730j841m513L325Q13l16n014j594o436P707Q243o451j1547
$$ -832 -4913 1868 2461 731 -1110 -5623 -2298 -1485 -1801 -6815 -8409 -14845 -7138 1105 -5346 -16893
16537a6893j3509O065J1088J0970J744j920R396k54N869j446j4256k0179j1273
$$ -16893 -30402 -24337 -13249 -2279 -535 -2455 6941 6687 12556 11110 -3146 -23325 -34598
16524c4598j604P841L975J3806R075k3j5770j5172L565Q151K2394J3041j3862
$$ -34598 -36202 -28361 -24386 -10580 -1505 -1528 -17298 -32470 -28905 -20754 1640 14681 819
16511H19j3226o115n115J9309j740j5737j1872n953N37L972J7929R935k634M216
$$ 819 -12407 -18522 -23637 -4328 -6068 -21805 -33677 -39630 -39093 -35121 -17192 -7257 -9891 -5675
16497e675j6243k38L992R397P635J0167k826j4353j0245o566j5130q569j785n
$$ -5675 -21918 -22156 -18164 -8767 -1132 9035 6209 -8144 -18389 -24955 -40085 -48654 -50439 -50444
16483e0444K53J6697n52m816J468P156J2144K162r979R56J028J793q549k447l943
$$ -50444 -50191 -33494 -34046 -38862 -37394 -30238 -18094 -15932 -25911 -24955 -23927 -22134 -30683 -33130 -37073
16468c7073j886P889K4833N455j9270r231j0066N154O22r643O068P490J3370l189
$$ -37073 -38959 -31070 -6237 -782 -20052 -29283 -39349 -34195 -33573 -43216 -37148 -29658 -16288 -19477
16454a9477M31J9166j462L037Q015r615j1916j1565J919J6629q615p68K0154R827
$$ -19477 -19046 120 -1342 1695 9710 95 -11821 -23386 -21467 -4838 -13453 -14221 5933 15760
16440A5760k734k4644o448N877k34r531n276O964J0648L310J2475j0170q231q652
$$ 15760 13026 -11618 -18066 -12189 -12423 -21954 -27230 -20266 -9618 -6308 6167 -4003 -12234 -20886
16426b0886J591l327M396K863k611j657k449N302J8215L44m927j3039r312R68
$$ -20886 -19295 -22622 -18226 -15363 -17974 -19631 -22080 -16778 1437 1781 -3146 -16185 -25497 -24529
16412b4529l223p774J0998P578o57Q204K517o497j910p245l218K1859O259j5648
$$ -24529 -27752 -35526 -24528 -16950 -17607 -9403 -6886 -13383 -15293 -22538 -25756 -3897 2362 -13286
16398a3286L457o118L091n084Q78J177P619L736R19N611O129M837K0478m525k4868
$$ -13286 -9829 -15947 -12856 -17940 -17062 -15885 -8266 -4530 -3611 2000 8129 12966 33444 28919 4051
16383D051j0541N118N24j258j0677K697q538o752N695L492K34K251O859k278r366
$$ 4051 -6490 -1372 -848 -2106 -12783 -10086 -18624 -25376 -19681 -16189 -15955 -13704 -6845 -9123 -18489
16368a8489q864J2421K2235n762j366Q075O326j2391n767M988o219j2916j1863
$$ -18489 -27353 -14932 7303 1541 175 8250 14576 2185 -3582 1406 -4813 -17729 -29592
16355b9592q412K3550L599j0964J1775n536J326J7028P800K139m482j5610j946
$$ -29592 -38004 -14454 -10855 -21819 -10044 -15580 -14254 2774 10574 12713 8231 -7379 -9325
16342i325K221R690r48L915M144k845j6440q439L977J2425l250Q910O545r556
$$ -9325 -7104 2586 1638 5553 9697 6852 -9588 -18027 -14050 -1625 -4875 4035 10580 1024
16328A024p918J6642r222M157M856R00J745J44m536k4983j422J0382j154J289
$$ 1024 -6894 9748 526 4683 9539 10439 12184 12328 7792 -17191 -18613 -8231 -9385 -8096
16314h096N547k883n477J2499q934k4330l252J2200o886J4938J2857k0052j5207
$$ -8096 -2549 -5432 -10909 1590 -7344 -31674 -34926 -22726 -29612 -14674 -1817 -21869 -37076
16301c7076M641J1487o48j948L669O139K845K791l550J555n962J144J3629N623
$$ -37076 -32435 -20948 -21596 -23544 -19875 -13736 -10891 -8100 -11650 -10095 -16057 -14913 -1284 4339
16287D339N544l509j5652j1156j1554J2211p020j908q735N89j542K1216J3982
$$ 4339 9883 6374 -9278 -20434 -31988 -19777 -26797 -28705 -37440 -36851 -38393 -17177 -3195
16274c195l056p837J2106O119o167K027j030N286J2918r266j5143j0961r42O448
$$ -3195 -6251 -14088 -1982 4137 -2030 -3 -1033 4253 17171 7905 -7238 -18199 -19141 -12693
16260a2693l41j06R433l812r187n311j7522K8J4725O597O642Q419R902l201j4096
$$ -12693 -13034 -13140 -3707 -7519 -16706 -22017 -39539 -39511 -24786 -18189 -11547 -3128 6774 3573 -10523
16245a0523n03J1630j237K06M030M063k1791l753J6106k650p02p127M437J4612
$$ -10523 -11026 604 -633 -427 3603 7666 -14125 -17878 -1772 -4422 -5124 -12251 -7814 6798
16231F798l824o142n381N737R98q90n336n677J6L57J8144J2787q930r251j5869
$$ 6798 2974 -3168 -8549 -2812 -1814 -2704 -8040 -13717 -13701 -13344 4800 17587 8657 -594 -16463
16216a6463r116k113Q009J3042Q614j3065q842L764M79J233M879q781m976J069
$$ -16463 -25579 -27692 -19683 -6641 1973 -11092 -19934 -16170 -15691 -14458 -9579 -18360 -23336 -22267
16202b2267J8707l959L654r644j0820J3861k627K445M304q201N086R651p087r178
$$ -22267 -3560 -7519 -3865 -13509 -24329 -10468 -13095 -10650 -6346 -14547 -9461 190 -6897 -16075
16188a6075J41j2462j7049N499R718J948M423J4027J0553j400j1025m500j0164
$$ -16075 -15934 -28396 -45445 -39946 -30228 -28280 -23857 -9830 723 -677 -11702 -16202 -26366
16175b6366q79k305P498l578L92O50O134J0419n265O179j507r700O507Q357j8384
$$ -26366 -27245 -29550 -22052 -25630 -25238 -24588 -18454 -8035 -13300 -7121 -8628 -18328 -11821 -3464 -21848
16160b1848j2567J4723J5316q22j210J2751J7628k049j3401j2745k3592Q441K0598
$$ -21848 -34415 -19692 -4376 -5198 -6408 6343 23971 21922 8521 -4224 -27816 -19375 1223
16147A223M87K93q84l213l703J732O484J4358j3372k123K628O137p607n109K695
$$ 1223 1710 2003 1119 -2094 -5797 -4065 2419 16777 3405 1282 3910 10047 2440 -2669 26
16132B6q053o57M386M30P397l06J1427j41j2351m32L901j355N160l458j2280O443
$$ 26 -8027 -8684 -4298 -3868 3529 3223 14650 14509 2158 1726 5627 4272 9432 5974 -6306 137
16116A37J239l085o019n109j5850J2207L703k097O76j554j5913r81J2112J7322
$$ 137 1376 -1709 -7728 -12837 -28687 -16480 -12777 -14874 -14198 -15752 -31665 -32646 -20534 -3212
16102c212P811L473j978k777j1173J1990K1742j1699j0628l18j056J849j1476
$$ -3212 4599 8072 6094 3317 -7856 4134 25876 14177 3549 3231 2175 4024 -7452
16089g452j9687M166R105m20R93m719J5138P119l096r306j0236q541p839O54l728
$$ -7452 -27139 -22973 -13868 -14288 -13295 -18014 -2876 4243 1147 -8159 -18395 -26936 -34775 -34121 -37849
16074c7849P915P197P832J0349J897J301J262j2245k644q78K774O904l531J1421
$$ -37849 -29934 -22737 -14905 -4556 -2659 -1358 -96 -12341 -14985 -15863 -13089 -6185 -9716 1705
16060A705K053J2565O20j9074j3528k14M596M069M51K73j5795p050j294l566K098
$$ 1705 3758 16323 16943 -2131 -15659 -15873 -11277 -7208 -6757 -6484 -22279 -29329 -30623 -34189 -32091
16045c2091K1616J9081J4873j2805q289m862j316l62r85j2579K740J4823R078
$$ -32091 -10475 8606 23479 10674 2385 -2477 -3793 -4155 -5140 -17719 -14979 -156 8922
16032H922m852J333p605j0540j43j1648j3756J8865J4148J2159O442j053J3938
$$ 8922 4070 5403 -2202 -12742 -12885 -24533 -38289 -19424 -5276 6883 13325 12272 26210
16019B6210j5772r357J756j0912j2190P83L055R875L710j3503O506j0534N55M560
$$ 26210 10438 1081 2837 -8075 -20265 -19482 -16427 -6552 -2842 -16345 -9839 -20373 -19818 -15258
16005a5258k945L910n331r220o881J577J2003J5355m431R997J5819N915M856O0
$$ -15258 -18203 -14293 -19624 -28844 -35725 -34148 -22145 -6790 -11221 -1224 14595 20510 25366 25426
15991B5426j4426j1561J0039P715p273J117J5516k0167j2148K078O588l321m532
$$ 25426 11000 -561 9478 17193 9920 11037 26553 6386 -5762 -3684 2904 -417 -4949
15978d949j2102m651j055J0608K0442M935j6904j5489k835L231J0848l400P965
$$ -4949 -17051 -21702 -22757 -12149 8293 13228 -3676 -19165 -22000 -18769 -7921 -11321 -3356
15965c356K603J0720p794j2893q333j422J1223J5704j322m802j961K968m516J3757
$$ -3356 -753 9967 2173 -10720 -19053 -20475 -9252 6452 5130 328 -1633 1335 -3181 10576
15951A0576N683L484j6756r700J6185J3244q121k483j8130K562o968Q413M024
$$ 10576 16259 19743 2987 -6713 9472 22716 14595 12112 -6018 -3456 -10424 -2011 2013
15938B013q870j4025J2662J1261k276j2308O148M108L964M655o708L038O056p324
$$ 2013 -6857 -20882 -8220 3041 765 -11543 -5395 -1287 2677 7332 624 3662 9718 2394
15924B394O710j4609q695r411k257R5J307J5253J3606J3068l573k2039r449J4368
$$ 2394 9104 -5505 -14200 -23611 -25868 -25773 -24466 -9213 4393 17461 13888 -8151 -17600 -3232
15910c232m684k1087r593K630J32J295J6420J2917N40j1999K596J102l126O54
$$ -3232 -7916 -29003 -38596 -35966 -35834 -34539 -18119 -5202 -4662 -16661 -14065 -12963 -16089 -15435
15896a5435p868j36P705J1443o92j0197m00J4014K866j673j1507l382K604N488
$$ -15435 -23303 -23439 -15734 -4291 -4983 -15180 -15580 -1566 1300 -373 -11880 -15262 -12658 -7170
15882g170K442r112j1749j647J1835N31Q182k652j378m014j150l098l291L002
$$ -7170 -4728 -13840 -25589 -27236 -15401 -14870 -6688 -9340 -10718 -14732 -15882 -18980 -22271 -19269
15868a9269J0165j666m003K044p717L141J4593j6833q714L398J6039o87M306j5017
$$ -19269 -9104 -10770 -14773 -12729 -20446 -17305 -2712 -19545 -28259 -24861 -8822 -9509 -5203 -20220
15854b0220k492J3724j010l456j841R328J3069Q938j5441p609m305j42j410j1440
$$ -20220 -22712 -8988 -9998 -13454 -15295 -5967 7102 16040 599 -7010 -11315 -11457 -12867 -24307
15840b4307m607N637n887k351J6941J1350j0988O479p03N10m343k501k830J1774
$$ -24307 -28914 -23277 -29164 -31515 -14574 -3224 -14212 -7733 -8436 -7926 -12269 -14770 -17600 -5826
15826e826M402l267j0219j2373J2002K559n870J6525P257j6408k340K367l178
$$ -5826 -1424 -4691 -14910 -27283 -15281 -12722 -18592 -2067 5190 -11218 -13558 -11191 -14369
15813a4369j62j0534j785j2723r87Q246J2140J7621J9242p992j4851n755R631
$$ -14369 -14531 -25065 -26850 -39573 -40560 -32314 -20174 -2553 16689 8697 -6154 -11909 -2278
15800b278N823K733n664j0635l953l93K989L051n919J533L176J8317K297o320
$$ -2278 3545 6278 614 -10021 -13974 -14367 -11378 -8327 -14246 -12713 -9537 8780 11077 4757
15786D757L472J1081l456j7615j3440j928R579M161L829j1205N506J6206K240
$$ 4757 8229 19310 15854 -1761 -15201 -17129 -7550 -3389 440 -10765 -5259 10947 13187
15773A3187j9404j3210J7408N810N153n537j0725j574pM852L507O17n766j0344
$$ 13187 -6217 -19427 -2019 3791 8944 3407 -7318 -8892 -8899 -4047 -540 77 -5689 -16033
15759a6033l651Q074Q95p769K892J2758J501n094J3025J6752J2996k944p765k1219
$$ -16033 -19684 -11610 -10715 -18484 -15592 -2834 -1333 -6427 6598 23350 36346 33402 25637 4418
15745D418j0521O508R617J437l385k644L672p965P588M428p056J090P212J566
$$ 4418 -6103 405 10022 11459 8074 5430 9102 1137 8725 13153 6097 7187 14399 15965
15731A5965K581j1598p711R810l057j2251j0215j46J2225l95k769j1045J11M755
$$ 15965 18546 6948 -763 9047 5990 -6261 -16476 -16622 -4397 -4792 -7561 -18606 -18495 -13740
15717a3740r083j7101J3673K2992L739k891r41j5484p27Q799n344n032n851n262
$$ -13740 -22823 -39924 -26251 -3259 480 -2411 -3352 -18836 -19563 -10764 -16108 -21140 -26991 -32253
15703c2253J3984J4576l205o126O132O86l94N727P425K726m183q445r006J1504
$$ -32253 -18269 -3693 -6898 -13024 -6892 -6206 -6600 -873 6552 9278 5095 -3350 -12356 -852
15689h52J1814P211j1109j0630j4118M149J0441N833M001m476j5653P810o984
$$ -852 10962 18173 7064 -3566 -17684 -13535 -3094 2739 6740 2264 -13389 -5579 -12563
15676a2563J5285m9J275j307O185j548p720o687M137j499l711L432L974J2132
$$ -12563 2722 2673 3948 2641 8826 7278 -442 -7129 -2992 -4491 -8202 -4770 -796 11336
15662A1336L046n031k228J397l191m105j9230p900n14J1315K780J2882N10m444
$$ 11336 14382 9351 7123 8520 5329 1224 -18006 -25906 -26420 -15105 -12325 557 1067 -3377
15648c377j1750K020O332P730J3409q238j9480q280P894N833J6829m962p194k770
$$ -3377 -15127 -13107 -6775 955 14364 6126 -13354 -21634 -13740 -7907 8922 3960 -3234 -6004
15634f004M353J0765j947j2397l786J8997P087k0719J453M231L094j6931r476
$$ -6004 -1651 9114 7167 -5230 -9016 9981 17068 -3651 -2198 2033 5127 -11804 -21280
15621b1280K7790J247l280N729L629p455P367p022j495L591J929n26J472j3535
$$ -21280 6510 7757 4477 10206 13835 6380 13747 6725 5230 8821 10750 10224 11696 -1839
15607a839n290J4609j19k630n857k379J0933K360o438M398Q104l939k1480j2488
$$ -1839 -7129 7480 7361 4731 -1126 -3505 7428 9788 3350 7748 15852 11913 -9567 -22055
15593b2055J888N322L810p118r37N591q896n186K915M172K045L657m434O923J6849
$$ -22055 -20167 -14845 -11035 -18153 -19090 -13499 -22395 -27581 -24666 -20494 -18449 -14792 -19226 -12303 4546
15578D546M615O15j2915j2334l177O766J1806l075j2245L09N256j443J0396L337
$$ 4546 9161 9776 -3139 -15473 -18650 -11884 -78 -3153 -15398 -15089 -9833 -11276 -880 2457
15564B457l501o380K732o730n969j0062R903R276J0338k07k2247J451P902O580
$$ 2457 -1044 -7424 -4692 -11422 -17391 -27453 -17550 -8274 2064 1857 -20390 -18939 -11037 -4457
15550d457J480l354N162M305P801n335m063K160Q185L005j4399j0077m053j540
$$ -4457 -2977 -6331 -1169 3136 10937 5602 1539 3699 11884 14889 490 -9587 -13640 -15180
15536a5180p928j2474j1732P196K2678J0296k660p966j525o65j86R755N950j2253
$$ -15180 -23108 -35582 -47314 -40118 -17440 -7144 -9804 -17770 -19295 -19960 -20146 -10391 -4441 -16694
15522a6694q681R204L344q970L009k763L86k544r580M203O84k587Q167M128j2605
$$ -16694 -25375 -16171 -12827 -21797 -18788 -21551 -21165 -23709 -33289 -29086 -28402 -30989 -22822 -18694 -31299
15507c1299M067M17Q291J3224M897P6k033O253P647n813o633o884M051K0086m693
$$ -31299 -27232 -26815 -18524 -5300 -403 -327 -2360 3893 11540 5727 -906 -7790 -3739 16347 11654
15492A1654o610o93O737p618Q772J0710q319j1754J4388J9353j1087j2241p576
$$ 11654 5044 4351 11088 3470 12242 22952 14633 2879 17267 36620 25533 13292 5716
15479E716n084O231m56K279k252J959p600m207R151L967j789l5p950L049k379
$$ 5716 632 6863 6407 8686 6434 8393 793 -3414 5737 9704 7915 7880 -70 2979 600
15464F00N139P740j0184j1025J812R313l182l575k824J0082L042j558j0685Q931
$$ 600 5739 13479 3295 -7730 -5918 3395 213 -3362 -6186 3896 6938 5380 -5305 3626
15450C626J3174m128l0688J6493P278r043m843L10Q741N088n504j0995n811J4681
$$ 3626 16800 12672 -18016 -1523 5755 -3288 -8131 -7821 920 6008 504 -10491 -16302 -1621
15436a621J2816L749n034J050o390o738J0797L728j7338l450l656R577k309m080
$$ -1621 11195 14944 9910 10960 4570 -2168 8629 12357 -4981 -8431 -12087 -2510 -4819 -8899
15422h899N038J7855N013m836l823r662m577l028j2757J4328M570J4623J438k659
$$ -8899 -3861 13994 19007 14171 10348 686 -3891 -6919 -19676 -5348 -778 13845 15283 12624
15408A2624Q610j790l399N493o035o408O085n033j1968l730R721r419q009J6674
$$ 12624 21234 19444 16045 21538 15503 9095 15180 10147 -1821 -5551 4170 -5249 -13258 3416
15394C416O296l697j839j8664p727j3184J0159J9605J0904O313k104K113j1775
$$ 3416 9712 6015 4176 -14488 -22215 -35399 -25240 -5635 5269 11582 9478 11591 -184
15381a84r322J0636n887n491K153r075m993J3295L083Q740J7427j521j0195N345
$$ -184 -9506 1130 -4757 -10248 -8095 -17170 -22163 -8868 -5785 2955 20382 18861 8666 14011
15367A4011Q512l268k3946q063j010P578J4081L960p250l072K717n059k651r32
$$ 14011 22523 19255 -4691 -12754 -13764 -6186 7895 11855 4605 1533 4250 -809 -3460 -4392
15353d392M985k2188p251K0823J6846L790r192J570N499J0027k100o322r46L739
$$ -4392 593 -21595 -28846 -8023 8823 12613 3421 4991 10490 20517 18417 12095 11149 14888
15339A4888L715n591J78q436k1850Q285J4606N047o614K388k004L6J178j6675
$$ 14888 18603 13012 13190 4754 -17096 -8811 5795 10842 4228 6616 4612 4648 5826 -10849
15325a0849j8112M703J8017Q156J0186q89r968n215J8063j2811j7597j2911o904
$$ -10849 -28961 -24258 -6241 1915 12101 11212 1244 -3971 14092 1281 -16316 -29227 -36131
15312c6131m812N851K0897Q388O555P098J6318j0179o453j3212j4911n103l368
$$ -36131 -40943 -35092 -14195 -5807 748 7846 24164 13985 7532 -5680 -20591 -25694 -29062
15299b9062l787N707Q618j6168m075J5572R899R736m414o142p537L161P64m588
$$ -29062 -32849 -27142 -18524 -34692 -38767 -23195 -13296 -3560 -7974 -14116 -21653 -18492 -17728 -22316
15285b2316L911K5029J157j0903n246l618N977M042m764j1234M853j0778Q641
$$ -22316 -18405 6624 7781 -3122 -8368 -11986 -6009 -1967 -6731 -17965 -13112 -23890 -15249
15272a5249J5082P960r544l163N491j1137j0889J1392R375K98K061M214o063L102
$$ -15249 -167 7793 -1751 -4914 577 -10560 -21449 -10057 -682 -384 1677 5891 -172 2930
15258B930q810n375R147J318J0654N439j1318j8288j4830n563q49n622J1690J7732
$$ 2930 -5880 -11255 -2108 -790 9864 15303 3985 -14303 -29133 -34696 -35545 -41167 -29477 -11745
15244a1745J3893m14j5550j0459N780Q407l520l597j448n836m745k245m901J0132
$$ -11745 2148 1734 -13816 -24275 -18495 -10088 -13608 -17205 -18653 -24489 -29234 -31479 -36380 -26248
15230b6248J7609k522l570L247N507l783k0365k704k510J2159J0859N008m430
$$ -26248 -8639 -11161 -14731 -11484 -5977 -9760 -30125 -32829 -35339 -23180 -12321 -7313 -11743
15217a1743J623J495N45J60P995J599P784J733j0009L370R761j1627k318J918
$$ -11743 -10120 -8625 -8080 -7920 75 1674 9458 11191 1182 4552 14313 2686 368 2286
15203B286L550Q191J917O683p338l378Q444j4709n163r42J3553K059j2463J1389
$$ 2286 5836 14027 15944 22627 15289 11911 20355 5646 483 -459 13094 15153 2690 14079
15189A4079j210q571j4992K748m53J286q34m737J6810n079j5061q068l976J8147
$$ 14079 12869 4298 -10694 -7946 -8399 -7113 -7947 -12684 4126 -953 -16014 -24082 -28058 -9911
15175i911P508j5119o814J9329J9664m217M68R723j6768n885j0862O894n198L040
$$ -9911 -2403 -17522 -24336 -5007 14657 10440 10908 20631 3863 -2022 -12884 -5990 -11188 -8148
15161h148K291j4546j5360N562O762M523K386J8228J961N10M026o164l24q089
$$ -8148 -5857 -20403 -35763 -30201 -23439 -18916 -16530 1698 3659 4169 8195 2031 1707 -6382
15147f382M770j298J8074J2441j1925j1337m953O450n577K679j3950J366O60n658
$$ -6382 -1612 -2910 15164 27605 15680 4343 -610 5840 263 2942 -11008 -9642 -8982 -14640
15133a4640O57J6269N054o881j0340j269n130j1158Q505K5199J954L047k777j2411
$$ -14640 -13983 2286 7340 459 -9881 -11150 -16280 -27438 -18933 6266 8220 11267 8490 -3921
15119c921N576M038j3117m476R088J1595n894O137R368r520K796j3366j601n821
$$ -3921 1655 5693 -7424 -11900 -2812 8783 2889 9026 18394 8874 11670 -1696 -3297 -9118
15105i118j1235j3487l799Q34J967J2250M599Q690m199J6253L626k992n84r64
$$ -9118 -20353 -33840 -37639 -36805 -34838 -22588 -17989 -9299 -13498 2755 6381 3389 2805 1841
15091A841m194J5699R984k670j5278k250n583n151N388j0055M16R364J1513L546
$$ 1841 -2353 13346 23330 20660 5382 3132 -2451 -7602 -2214 -12269 -11853 -2489 9024 12570
15077A2570k1647o139N406Q76J647J7834K005j2526Q706O66j9423M26N880l504
$$ 12570 -9077 -15216 -9810 -8934 -7287 10547 12552 26 8732 9398 -10025 -9599 -3719 -7223
15063g223k229M198O940j644m212K193p409l634j5565J9042o27m749K4980J0752
$$ -7223 -9452 -5254 1686 42 -4170 -1977 -9386 -13020 -28585 -9543 -10170 -14919 10061 20813
15049B0813N561J585K0455o597r122q889j1764Q541m464o028j2952L65J1855N290
$$ 20813 26374 27959 48414 41817 32695 23806 12042 20583 16119 10091 -2861 -2496 9359 14649
15035A4649q169k1951l612k15k34R83L777N692r97O027K0134j3231K022Q454R505
$$ 14649 6480 -15471 -19083 -19298 -19532 -18549 -14772 -9080 -10077 -4050 16084 2853 4875 13329 22834
15020B2834j3550j8790n972p193n515J0881P871J484j789J6600J3258o358n375
$$ 22834 9284 -9506 -15478 -22671 -28186 -17305 -9434 -7950 -9739 6861 20119 13761 8386
15007H386m847l008r22j833l187O82K0879l460j231j5068m869L469j2092r340
$$ 8386 3539 531 -391 -2224 -5411 -4729 16150 12690 11459 -3609 -8478 -5009 -17101 -26441
14993b6441n729L229J5019J0212K906j658k791r806J3935R985j4976L264j178
$$ -26441 -32170 -28941 -13922 -3710 -804 -2462 -5253 -15059 -1124 8861 -6115 -2851 -4029
14980d029o854P6K522J2203R88j499q403r234j1998o399J0887J5014m974J2973
$$ -4029 -10883 -10807 -8285 3918 4906 3407 -4996 -14230 -26228 -32627 -21740 -6726 -11700 1273
14966A273j464k613N796k374j0804J0762j374N388p207k61L599l663j717O84m931
$$ 1273 -191 -2804 2992 618 -10186 576 -798 4590 -2617 -2878 721 -2942 -4659 -3975 -8906
14951h906n643k43k26L000J7225J7982O880j0024n255m435O007p483j4355o669
$$ -8906 -14549 -14792 -15018 -12018 5207 23189 30069 20045 14790 10355 16362 8879 -5476 -12145
14937a2145N136J0783N078n24q099M322p965j7435J2424N207N121l938k630J3303
$$ -12145 -7009 3774 8852 8328 229 4551 -3414 -20849 -8425 -3218 1903 -2035 -4665 8638
14923H638p455j3347j3314J7944Q954l990J756N683k812j8293p161n13J6285K380
$$ 8638 1183 -12164 -25478 -7534 1420 -2570 -814 4869 2057 -16236 -23397 -23910 -7625 -5245
14909e245M309J068q470o65N278J5564m579q268R506Q182l309P53o630j6452r978
$$ -5245 -936 132 -8338 -9003 -3725 11839 7260 -1008 8498 16680 13371 14124 7494 -8958 -18936
14894a8936p996j721J4247J2678k649o524N684J832L978Q450J497p748j5980n403
$$ -18936 -26932 -28653 -14406 -1728 -4377 -10901 -5217 -3385 593 9043 10540 2792 -13188 -18591
14880a8591j169J4384K2359K5j5278k1383r399m710l501k915J188M013K55K533
$$ -18591 -19760 -5376 16983 17008 1730 -19653 -29052 -33762 -37263 -40178 -38990 -34977 -34722 -32189
14866c2189J4796J5034m727n048R230k527P755o721j121K978j7500j1455J6576
$$ -32189 -17393 -2359 -7086 -12134 -2904 -5431 2324 -4397 -5518 -2540 -20040 -31495 -14919
14853a4919K5506J0351r850j2711o56j0678J399J7067M065j6374j415J1768K0189
$$ -14919 10587 20938 11088 -1623 -2279 -12957 -11558 5509 9574 -6800 -8215 3553 23742
14840B3742n119r072r083q581j3480j289L215L550o62r603n123R862Q112l724
$$ 23742 18623 9551 468 -8113 -21593 -22882 -19667 -16117 -16779 -26382 -31505 -21643 -13531 -17255
14826a7255j1657J3300P073m855k343O574M62Q314M105r933l905n454M327Q444
$$ -17255 -28912 -15612 -8539 -13394 -15737 -9163 -8701 -387 3718 -6215 -10120 -15574 -11247 -2803
14812b803l905j216M454o41r887Q04l590q44K1298N977L682k056o063L241R392
$$ -2803 -6708 -7924 -3470 -4111 -13998 -13194 -16784 -17628 3670 9647 13329 11273 5210 8451 17843
14797A7843j31m612j2749k2946m50J0407k028K852P618N07j476q237J238P607
$$ 17843 17712 13100 351 -22595 -23045 -12638 -14666 -11814 -4196 -3689 -5165 -13402 -12164 -4557
14783d557j2596j4681K32J5721J780n808j8963j600M034J4284R818J3804P031
$$ -4557 -17153 -31834 -31602 -15881 -14101 -19909 -38872 -40472 -36438 -22154 -12336 1468 8499
14770H499M789q465n615J126J0574M151r35k657O158J709J001p989j9851m484
$$ 8499 13288 4823 -792 334 10908 15059 14124 11467 17625 19334 20335 12346 -7505 -11989
14756a1989O88J1132j691r73L150J543N876N56M724J335j3433o078k664r044N278
$$ -11989 -11301 -169 -1860 -2833 317 1860 7736 8292 13016 14351 918 -5160 -7824 -16868 -11590
14741a1590M056k165n615M083J3776J7933n909o512j0235O16j2239m148J4466
$$ -11590 -7534 -9699 -15314 -11231 2545 20478 14569 8057 -2178 -1562 -13801 -17949 -3483
14728c483M798J5258J340j9284q708J2375L305M125m133Q6J0623Q650q872k972
$$ -3483 1315 16573 17913 -1371 -10079 2296 5601 9726 5593 5679 16302 24952 16080 13108
14714A3108L649j1714m696p413j294R191J5961j8341j777N428k233p362j0162
$$ 13108 16757 5043 347 -7066 -8360 831 16792 -1549 -3326 2102 -131 -7493 -17655
14701a7655J824j662Q269P200Q457P841P537J2950j5872j0713m222j5081l828
$$ -17655 -15831 -17493 -9224 -2024 6433 14274 21811 34761 18889 8176 3954 -11127 -14955
14688a4955J2226M056j0286O119P807K1542n528q357K759n53M322n265j0498K295
$$ -14955 -2729 1327 -8959 -2840 4967 26509 20981 12624 15383 14830 19152 13887 3389 5684
14674E684l721j353j0520q318J3368R344K91l888j2510n646k396l304J0288R850
$$ 5684 1963 610 -9910 -18228 -4860 4484 4775 887 -11623 -17269 -19665 -22969 -12681 -2831
14660b831O520j690n641m31K573R439l289o954k043k520k167j174m010j3613J742
$$ -2831 3689 1999 -3642 -4073 -1500 7939 4650 -2304 -4347 -6867 -9034 -10208 -14218 -27831 -26089
14645b6089J2022N52l867P049M395L780j0190R233O531J0386p937j2205m073r883
$$ -26089 -14067 -13515 -17382 -10333 -5938 -2158 -12348 -3115 3416 13802 5865 -6340 -10413 -20296
14631b0296l892P889j932K2819J6063r215j1937q072R926J0065o050r955J2999
$$ -20296 -24188 -16299 -18231 4588 20651 11436 -501 -8573 1353 11418 5368 -4587 8412
14618H412j1739o365K757K610l522j9289j1507J205O954R012j414n713J1870P153
$$ 8412 -3327 -9692 -6935 -4325 -7847 -27136 -38643 -37438 -30484 -21472 -22886 -28599 -16729 -9576
14604i576L920k461o42O416J1054J2589k54j4037J513K868l802r644L936o739
$$ -9576 -5656 -8117 -8759 -2343 8711 21300 21046 7009 8522 11390 7588 -2056 1880 -4859
14590d859K570q725o141Q461J9173J0867k0870j2814J3067K272j616J901n887
$$ -4859 -2289 -11014 -17155 -8694 10479 21346 476 -12338 729 3001 1385 3286 -2601
14577b601P443j999J544n70m44r575m876K2834n648N836J0487m351p215k080j77
$$ -2601 4842 2843 4387 3817 3373 -6202 -11078 11756 6108 11944 22431 18080 10865 8785 8608
14562H608J8033J4819k55r774j2712J831n618K321j2484j625q40j3062J1677k076
$$ 8608 26641 41460 41205 31431 18719 20550 14932 17253 4769 3144 2304 -10758 919 -1157
14548a157J577L209j7991o16J7634K4020L792l224j1542k0103l217k660j859J3678
$$ -1157 420 3629 -14362 -14978 2656 26676 30468 27244 15702 -4401 -7618 -10278 -12137 1541
14534A541J869j8816p880K0638R280L046m732o118J995L274K0225J76j1108j96
$$ 1541 3410 -15406 -23286 -2648 6632 9678 4946 -1172 823 4097 24322 24498 13390 13194
14520A3194p058j1388N580L472m553j520J2268j0800j3705R29n532J1139J1269
$$ 13194 6136 -5252 328 3800 -753 -2273 9995 -805 -14510 -13581 -19113 -7974 3295
14507C295r339K1386K1445K496K68j2664l278j0425j6125j6662r809n71N910J3295
$$ 3295 -6044 15342 36787 39283 39551 26887 23609 13184 -2941 -19603 -29412 -29983 -24073 -10778
14493a0778P035N670m148r584m908Q574k651j5453k460q66M107J58Q912N966O734
$$ -10778 -3743 1927 -2221 -11805 -16713 -8139 -10790 -26243 -28703 -29569 -25462 -25304 -16392 -10426 -3692
14478c692R669N31n019r549j543J0101L538J149m533j2285n806k234m14J7322
$$ -3692 5977 6508 1489 -8060 -9603 498 4036 5185 652 -11633 -17439 -19673 -20087 -2765
14464b765J0568l979P174O346j2120k302J5241q428j7666M586j2692J347O838
$$ -2765 7803 3824 10998 17344 5224 2922 18163 9735 -7931 -3345 -16037 -14690 -7852
14451g852J1894j264k002K971J410j582j7589k643l127l714J3089J0256l993j7236
$$ -7852 4042 2778 776 3747 5157 3575 -14014 -16657 -19784 -23498 -10409 -153 -4146 -21382
14437b1382j944O415L039k049J1213J3605p185Q105K814J667K712j9381p796J1454
$$ -21382 -23326 -16911 -13872 -15921 -4708 8897 1712 9817 12631 14298 17010 -2371 -10167 1287
14423A287P027q706p137j4022m854J5607L750j8650o135j993m47J4148J5298P609
$$ 1287 8314 -392 -7529 -21551 -26405 -10798 -7048 -25698 -31833 -33826 -34273 -20125 -4827 2782
14409B782l769J0836k204k3660J2850R381o329J11k0339N278J4355R679p904j537
$$ 2782 -987 9849 7645 -16015 -3165 6216 -113 -2 -20341 -15063 -708 8971 1067 -470
14395d70J1314n549Lo441j1108j4870O793r593q497J1278J374q180l737P388j579
$$ -470 10844 5295 5298 -1143 -12251 -27121 -20328 -29921 -38418 -27140 -25766 -33946 -37683 -30295 -31874
14380c1874m825m881Q13J2597J6581m948P03N087O708N968M619o133J79q731Q62
$$ -31874 -36699 -41580 -40767 -28170 -11589 -16537 -15834 -10747 -4039 1929 6548 415 594 -8137 -7275
14365g275k328n388M047M413O022O230p086p335m314R465L676N792p248j2503
$$ -7275 -9603 -14991 -10944 -6531 -509 5721 -1365 -8700 -13014 -3549 127 5919 -1329 -13832
14351a3832m514q348R082L990N348J613M968M660O204O51j0438o900m508Q60J3299
$$ -13832 -18346 -26694 -17612 -13622 -8274 -6661 -1693 2967 9171 9822 -616 -7516 -12024 -11164 2135
14336B135O909o592o152j190P198r78L827k008o332L310K564O270m132j0346k30
$$ 2135 9044 2452 -3700 -4890 2308 1330 5157 3149 -3183 127 2691 8961 4829 -5517 -5747
14321e747o748J2727o195j971L601o017O126O092m828K000J747Q166L178p006
$$ -5747 -12495 232 -5963 -7934 -4333 -10350 -4224 1868 -2960 -960 787 8953 12131 5125
14307E125J060J875J41j5965P026J2145p412q649J5803j6335r374R721J4590m81
$$ 5125 6185 8060 8201 -7764 -738 11407 3995 -4654 11149 -5186 -14560 -4839 9751 9270
14293I270j2608J558J4575l661j739J436M709k298L956J2008K280O92J277k458
$$ 9270 -3338 -1780 12795 9134 7395 8831 13540 11242 15198 27206 29486 30178 31455 28997
14279B8997r459l493l062j5175q746J4158P271j7552o231J6751k844k673J2522
$$ 28997 19538 16045 12983 -2192 -10938 3220 10491 -7061 -13292 3459 615 -2058 10464
14266A0464l208j558n362j2151K838K756n311R763M09N58J1455j842m447K72L634
$$ 10464 7256 5698 336 -11815 -8977 -6221 -11532 -1769 -1360 -802 10653 8811 4364 4636 8270
14251H270J3169j867P620P897j647R37O437j4713j1704j3692n605P99p185m322
$$ 8270 21439 19572 27192 35089 33442 34379 40816 26103 14399 707 -4898 -4099 -11284 -15606
14237a5606J0718n470N007m081j190P55K762J6296R250j5546j2804q284K479j108
$$ -15606 -4888 -10358 -5351 -9432 -10622 -9867 -7105 9191 18441 2895 -9909 -18193 -15714 -16822
14223a6822q417m262J790k344J2825K1168K810m254j0605l388r903P273R581r461
$$ -16822 -25239 -29501 -27711 -30055 -17230 3938 6748 2494 -8111 -11499 -21402 -14129 -4548 -14009
14209a4009q035m552p350R391N389P360K078P715k883j4902M984L760n558J737
$$ -14009 -22044 -26596 -33946 -24555 -19166 -11806 -9728 -2013 -4896 -19798 -14814 -11054 -16612 -14875
14195a4875J2696J564l969O977j435r602L312r297q268q727j19M859O715j7178
$$ -14875 -2179 -615 -4584 2393 958 -8644 -5332 -14629 -22897 -31624 -31743 -26884 -20169 -37347
14181c7347M078J2852J2386R100j1029r673j790P662P380L258R47K036r43K492
$$ -37347 -33269 -20417 -8031 1069 -9960 -19633 -21423 -13761 -6381 -3123 -2176 -140 -1083 1409
14167A409m806q33J2914R662j785j3713j1249j3412n231j923J8968p768J511P105
$$ 1409 -3397 -4230 8684 18346 16561 2848 -8401 -21813 -27044 -28967 -9999 -17767 -16256 -9151
14153i151O671J3287m70P698m557j0381J21j2145q349M344Q879o586j09j267J1827
$$ -9151 -2480 10807 10337 18035 13478 3097 3218 -8927 -17276 -12932 -4053 -10639 -10748 -12015 -188
14138a88L504L109P049J410k4260J966J1562L17P405l065Q35n627k947K17N564
$$ -188 3316 6425 13474 14884 -9376 -7410 4152 4469 11874 8809 9644 4017 1070 1287 6851
14123F851k837q685M129J0349J364j816j2468R667O273j2297j6774L640P970J218
$$ 6851 4014 -4671 -542 9807 11171 9355 -3113 6554 12827 530 -16244 -12604 -4634 -3416
14109c416K386R066p832l82r440L003J6421L218l18K219j1115O409J645r985m384
$$ -3416 -1030 8036 204 -178 -9618 -6615 9806 13024 12706 14925 3810 10219 11864 1879 -2505
14094b505N322k864l946J4525j1425j5860M250n351Q581P094k052o163p34m172
$$ -2505 2817 -47 -3993 10532 -893 -16753 -12503 -17854 -9273 -2179 -4231 -10394 -11128 -15300
14080a5300k8L375j5236R781J8389q058k044J4085p837n549Q170k599P988J4169
$$ -15300 -15328 -11953 -27189 -17408 981 -7077 -9121 4964 -2873 -8422 -252 -2851 5137 19306
14066A9306j286k8609p210J4406N272o87j4086l552R193J5221j0517j1856M231
$$ 19306 18020 -10589 -17799 -3393 1879 1192 -12894 -16446 -7253 7968 -2549 -14405 -10174
14053a0174L268P762N180j0318j3731L936P109P011p371Q16K243Q997k471O740
$$ -10174 -6906 856 6036 -4282 -18013 -14077 -6968 43 -7328 -6512 -4269 4728 2257 8997
14039H997k569j0571M849L463J581n926M540O294j270n610j2317O792J4294r724
$$ 8997 6428 -4143 706 4169 5750 -176 4364 10658 9388 3778 -8539 -1747 12547 2823
14025B823R13K926k883K253K3865K141j3774n745p610m449k136K814p785j1722
$$ 2823 3736 6662 3779 6032 29897 32038 18264 12519 4909 460 -1676 1138 -6647 -18369
14011a8369j509Q927q44O562Q846R116k838M32K160m186l686l451n929R573r275
$$ -18369 -19878 -10951 -11795 -5233 3613 12729 9891 10323 12483 8297 4611 1160 -4769 4804 -4471
13996d471Q203J6244p343o450L979n170N98m771j4222J055K1137R009M159K35
$$ -4471 3732 19976 12633 6183 10162 4992 5590 819 -13403 -12348 8789 17798 21957 22192
13982B2192o444j5598l172j311r815j0340k863J3597J6053J799k713n566J997
$$ 22192 15748 150 -3022 -4333 -14148 -24488 -27351 -13754 2299 4098 1385 -4181 -2184
13969b184l348J20J482K461R201J4725P481p198J711J0877R229o771r242j8889
$$ -2184 -5532 -5412 -3930 -1469 7732 22457 29938 22740 24451 35328 44557 37786 28544 9655
13955I655k23N757l500P94o501k864N693K889M35j5922q996M890k436r32J2993
$$ 9655 9432 15189 11689 12483 5982 3118 8811 11700 12135 -3787 -12783 -7893 -10329 -11261 1732
13940A732P340P816J204j5805n914L479J16L721M524Q670o104j960O255J0474
$$ 1732 9072 16888 18092 2287 -3627 -148 -32 3689 8213 16883 10779 8819 15074 25548
13926B5548k2245j030K1549p598N492n195n083O646J0477r182L506n506m216j316
$$ 25548 3303 2273 23822 16224 21716 16521 11438 18084 28561 19379 22885 17379 13163 11847
13912A1847n025m618P811R589N48N805n26k108L553O320J546K261l872J927o178
$$ 11847 6822 2204 10015 19604 20152 25957 25431 23323 26876 33196 34742 37003 33131 35058 28880
13897B8880k2022r024J467J0885N555j2040P734J9884R602R41k2144l168M554
$$ 28880 6858 -2166 -699 10186 15741 3701 11435 31319 40921 41862 19718 16550 21104
13884B1104l685n788R3J472O963j36j0523K543J4275P362j0088j1429j0149Q551
$$ 21104 17419 11631 11724 13196 20159 20023 9500 12043 26318 33680 23592 12163 2014 10565
13870A0565P212l918M755M587N25l988J343O350J6433K886j6864o970m926N483
$$ 10565 17777 13859 18614 23201 23726 19738 21081 27431 43864 46750 29886 22916 17990 23473
13856B3473m032J1460K1657O690j0308J2025J2664P197K303k5084p061j1613j9941
$$ 23473 19441 30901 52558 59248 48940 60965 73629 80826 83129 58045 50984 39371 19430
13843A9430j4627P39K0938J4104p732m249l322R844M959j3074q193j117J0421
$$ 19430 4803 5542 26480 40584 32852 28603 25281 35125 40084 27010 18817 17700 28121
13830B8121K3906j350j2500J601n147n756q793J1370P675n968q09n804j599M416
$$ 28121 52027 50677 38177 39778 34631 28875 20082 31452 39127 33159 32350 26546 24947 29363
13816B9363N16N988L377o512J9189P944l843j4740q570J1177M797P435k320r466
$$ 29363 29879 35867 39244 32732 51921 59865 56022 41282 32712 43889 48686 56121 53801 44335
13802D4335P223K860n04P326l828j125N618N504P947N177j4377j9811K024O642
$$ 44335 51558 54418 53914 61240 57412 56287 61905 67409 75356 80533 66156 46345 48369 55011
13788E5011k413J9645J6681j6312j1605R504J4427Q328p292j5786r033r82L277
$$ 55011 52598 72243 88924 72612 61007 70511 84938 93266 85974 70188 61155 60173 63450
13775F3450N847M617l018M55l182j448n105J580P342r625k3355k148J6152K6135
$$ 63450 69297 73914 70896 71351 68169 66721 61616 63196 70538 60913 37558 35410 51562 77697
13761G7697J004M517J579J34O501N701j0116k3386Q569J9967k873J437O022J9647
$$ 77697 78701 83218 84797 84931 91432 97133 87017 63631 72200 92167 89294 90731 96753 116400
13747A16400Q062j6220N887j701j3905j3454m464J4187J5182m372r904j1177r851
$$ 116400 124462 108242 114129 112428 98523 85069 80605 94792 109974 105602 95698 84521 74670
13734G4670q131Q72p024O154J9736P528R195r337j2214j1185j0128J559J6950
$$ 74670 66539 67411 60387 66541 86277 93805 103000 93663 81449 70264 60136 61695 78645
13721G8645K0752j0061j0157j2289J834m443k0578J0241J9272N098R39p718J087
$$ 78645 99397 89336 79179 66890 68724 64281 43703 53944 73216 78314 79253 71535 72622
13708G2622n572J633Q143j2908Q694j69j657K887P98J0357K675j8924j6016j0052
$$ 72622 67050 68683 76826 63918 72612 72443 70786 73673 74471 84828 87503 68579 52563 42511
13694D2511N65O655J2213o927k555P279K7029K762j2538r657j59k802o16J4633
$$ 42511 43076 49731 61944 55017 52462 59741 86770 89532 76994 67337 67178 64376 63760 78393
13680G8393l319l061M509n13K381k5357k7468n64J1375Q861r465J177J1502k318
$$ 78393 75074 72013 76522 76009 78390 53033 25565 25001 36376 45237 35772 36949 48451 46133
13666D6133j0969l276J343R892J6558o527n110j7944J134p290Q035O418m457Q73
$$ 46133 35164 31888 33231 43123 59681 53154 48044 30100 31234 23944 31979 38397 33940 34813
13652C4813J4293O638j7952j2594j129K1785j1764RJ213M845n873L2q391j0921
$$ 34813 49106 55744 37792 25198 24069 45854 34090 34099 35312 40157 34284 34316 25925 15004
13638A5004J4271R242k812N881J908p883j4638r408p561O211k046J3632J5500
$$ 15004 29275 38517 35705 41586 43494 35611 20973 11565 4004 10215 8169 21801 37301
13625C7301k3462j4414j1527J535K845n736P398K0903J6358J2008j6773n34R239
$$ 37301 13839 -575 -12102 -10567 -7722 -13458 -6060 14843 31201 43209 26436 25902 35141
13612C5141j1060o413O833l606O674o087j2653n22M022K774j0145n569J4154O829
$$ 35141 24081 17668 24501 20895 27569 21482 8829 8307 12329 15103 4958 -611 13543 20372
13598B0372j4564j994M355j1425M857O334J2863J3748M480j5283r39q431r365
$$ 20372 5808 3814 8169 -3256 1601 7935 20798 34546 39026 23743 22804 14373 5008
13585E008n414K792p820O972r496R935J7003P768o366j707j2265q43K1443l825
$$ 5008 -406 2386 -5434 1538 -7958 1977 18980 26748 20382 18675 6410 5567 27010 23185
13571B3185j0901N694K1160j4595k466l496r331q254P86p81n288r660q159J0404
$$ 23185 12284 17978 39138 24543 22077 18581 9250 996 1782 1001 -4287 -13947 -22106 -11702
13557a1702R066J923m223J713o25q9Q062J519n495J414N199P016r166o782m131
$$ -11702 -2636 -713 -4936 -3223 -3848 -3937 4125 5644 149 1563 6762 13778 4612 -2170 -6301
13542f301M073N528J755j2612J2320L904p562M904o294O76o277J1285J3638k252
$$ -6301 -2228 3300 5055 -7557 4763 8667 1105 6009 -285 391 -5886 5399 19037 16785
13528A6785O41m74l401l149K532k127J139j433Q496R967p600p811l934n2p639
$$ 16785 17426 16952 13551 10402 12934 10807 11946 10513 19009 28976 21376 13565 9631 9579 1940
13513A940j3825j911J3567N664m860j4249P94K040q302M164O867J4942K1060n849
$$ 1940 -11885 -13796 -229 5435 575 -13674 -12880 -10840 -19142 -14978 -8111 6831 27891 22042
13499B2042o637O008k293j3870q595R452P719J0679k14p651p623l481n550j400
$$ 22042 15405 21413 19120 5250 -3345 6107 13826 24505 24291 16640 9017 5536 -14 -1414
13485a414Q540n773r736j831m597J8392J8735j226n649o258j3914P110R74k0182
$$ -1414 7126 1353 -8383 -10214 -14811 3581 22316 21090 15441 9183 -4731 2379 3353 -16829
13471a6829J1893M175J9514R181j856j9713m564r689O390q054q017J0940J0910
$$ -16829 -4936 -761 18753 27934 26078 6365 1801 -7888 -1498 -9552 -17569 -6629 4281
13458D281n88m570R45o349Q582l125M649j1516k039J133j2178Q451M588J0577
$$ 4281 3693 -877 68 -6281 2301 -824 3825 -7691 -9730 -8597 -20775 -12324 -7736 2841
13444B841K566L258k136J638K904m209n045N875J69j425n401o895M126m04j149
$$ 2841 5407 8665 6529 8167 11071 6862 1817 7692 7861 6436 1035 -5860 -1734 -2138 -3287
13429c287l662J0032L914j5421p157j339J2079l843J0148J0093R195m12j5315
$$ -3287 -6949 3083 6997 -8424 -15581 -16920 -4841 -8684 1464 11557 20752 20340 5025
13416E025l769l782j2943J589N197J0767P863k221p167j3406j9873K147L0009
$$ 5025 1256 -2526 -15469 -13880 -8683 2084 9947 7726 559 -12847 -32720 -30573 -564
13403e64k395J0102O378j9696L661O319P384J8280j1078k2356o221L734j77P922
$$ -564 -2959 7143 13521 -6175 -2514 3805 11189 29469 18391 -3965 -10186 -6452 -6629 1293
13389A293N397j3393O742J8365o537j0027R114j4012m411o82j740R40J8135J6342
$$ 1293 6690 -6703 39 18404 11867 1840 10954 -3058 -7469 -8151 -9891 -8951 9184 25526
13375B5526r345j3871L501m341r89J1077j583m51l547k1357k105k643k223p848
$$ 25526 16181 2310 5811 1470 481 11558 9975 9524 5977 -15380 -17485 -20128 -22351 -30199
13361c0199K0616N779m109k280O440m872k190n168R086J4133J6648m60k873q182
$$ -30199 -9583 -3804 -7913 -10193 -3753 -8625 -10815 -15983 -6897 7236 23884 23424 20551 12369
13347A2369r034o342l774J1056k491O12L449o651q275N808r751j704J7987J0860
$$ 12369 3335 -3007 -6781 4275 1784 2396 5845 -806 -9081 -3273 -13024 -14728 3259 14119
13333A4119N937o130k545p174j2262m806J4824J0568P610Q259m81j4359q315J210
$$ 14119 20056 13926 11381 4207 -8055 -12861 1963 12531 20141 28400 27919 13560 5245 6455
13319F455r98K160j4398n907j909J4165J8078J645P63M312j2824j1748J1476k756
$$ 6455 5457 7617 -6781 -12688 -14597 -432 17646 19291 20054 24366 11542 -206 11270 8514
13305H514L4j6159q581l286j710k122J0943O028J0955m560j0103J076K255K112
$$ 8514 8548 -7611 -16192 -19478 -21188 -23310 -12367 -6339 4616 56 -10047 -8971 -6716 -4604
13291d604K0223j74r349m228l319j3392j2284J6248N852N189k109J1103M372J0999
$$ -4604 15619 15445 6096 1868 -1451 -14843 -27127 -10879 -5027 162 -1947 9156 13528 24527
13277B4527j1666j2272j549l833P018L513j4612m327p36J1002J1927q694j1294
$$ 24527 12861 589 -960 -4793 2225 5738 -8874 -13201 -13937 -2935 8992 298 -10996
13264a0996k430q92r697n755N254J7247J0252L73N208o293o326K89o189q812P466
$$ -10996 -13426 -14318 -24015 -29770 -24516 -7269 2983 3356 8564 2271 -4055 -3766 -9955 -18767 -11301
13249a1301J2144K874P75j274J1571o973q128j3594o932N807M770n047n780M366
$$ -11301 843 3717 4492 3218 14789 7816 -312 -13906 -20838 -15031 -10261 -15308 -21088 -16722
13235a6722m704m198J1506J1904N319L490j610N102n382l729K805l806M42m656
$$ -16722 -21426 -25624 -14118 -2214 3105 6595 4985 10087 4705 976 3781 -25 417 -4239
13221d239k490J0327j7048n266J8280J1950j5769q797R794N770N311L415l175
$$ -4239 -6729 3598 -13450 -18716 -436 11514 -4255 -13052 -3258 2512 7823 11238 8063
13208H063J8819J0170P080j3216q026k456m949P62N800l843k033J073p213K670
$$ 8063 26882 37052 44132 30916 22890 20434 15485 16247 22047 18204 16171 17244 10031 12701
13194A2701j5216o366m483J390J2208J0753J353O742p794j0353O711N467o093
$$ 12701 -2515 -8881 -13364 -11974 234 10987 12340 19082 11288 935 7646 13113 7020
13181G020l175J7640P512K174l543m052O332m286j0721j3859n896R336m48K2368
$$ 7020 3845 21485 28997 31171 27628 23576 29908 25622 14901 1042 -4854 4482 4034 26402
13167B6402l568k853j6259k1418R62J5738j727P23O754k440o02P49L015r508j6393
$$ 26402 22834 19981 3722 -17696 -16734 -996 -2723 -2000 4754 2314 1712 2461 5476 -4032 -20425
13152b0425K166J0236L65j2819R12R238L818l424J1550O148Q691o076j9747Q162
$$ -20425 -18259 -8023 -7658 -20477 -19565 -10327 -6509 -9933 1617 7765 16456 10380 -9367 -1205
13138a205L0383K8899L4469N1315J8778j2118j3183k6600k9061k1720k5300j6084
$$ -1205 29178 58077 92546 143861 162639 150521 137338 110738 81677 59957 34657 18573
13126A8573j5821j599N011j479r215k554m990J1000q214j0000P225P713j425J3682
$$ 18573 2752 1153 6164 4685 -4530 -7084 -12074 -1074 -9288 -19288 -12063 -4350 -5775 7907
13112G907M090j3307n891k889J059O023r963j5566L693J6984P229K40M524P950
$$ 7907 11997 -1310 -7201 -10090 -9031 -3008 -12971 -28537 -24844 -7860 -631 -391 4133 12083
13098A2083J2997L507m739J0913O805K206J1102K6835L2858K5949J0663n682k4916
$$ 12083 25080 28587 23848 34761 41566 43772 54874 81709 114567 140516 151179 145497 120581
13085A20581k9386k6053k7291j9114o962j4643P290J496p856j917K3l616K2729
$$ 120581 91195 65142 37851 18737 11775 -2868 4422 5918 -1938 -3855 -3832 -7448 15281
13072A5281j865j2527K089j029m945j071q70J8506O065o494j1818j1468J6007
$$ 15281 13416 889 2978 1949 -2996 -4067 -4937 13569 19634 13140 1322 -10146 5861
13059E861J9337o478k0018j0998K0955R919o7r694o217j119p537J443K0059K5654
$$ 5861 25198 18720 -1298 -12296 8659 18578 18511 8817 2600 1481 -6056 -4613 15446 41100
13045D1100J7654J3226k975m357N284j6005j6851j0525j4389j2569o457K055P71
$$ 41100 58754 71980 69005 64648 69932 53927 37076 26551 12162 -407 -6864 -4809 -4038
13032d038j1250m531j4858o647M372K1417m637k0030R942J0252J5096J6576l075
$$ -4038 -15288 -19819 -34677 -41324 -36952 -15535 -20172 -40202 -30260 -20008 -4912 11664 8589
13019H589j8827J950j222P133J209n433p357r205q895O506J3145L079j5149l329
$$ 8589 -10238 -8288 -9510 -2377 -1168 -6601 -13958 -23163 -32058 -25552 -12407 -9328 -24477 -27806
13005b7806K815N966J3368M639q225Q410Q420o233m255j2116L539J5634J3245
$$ -27806 -24991 -19025 -5657 -1018 -9243 -833 7587 1354 -2901 -15017 -11478 4156 17401
12992A7401j698j2978k2529k838R323J6523J1105q753l19n549j0115J76J7072
$$ 17401 15703 2725 -19804 -22642 -13319 3204 14309 5556 5237 -312 -10427 -10251 6821
12979F821J1521l869o793N497Q246K599j4243j6389m151l191J139j148P319J336
$$ 6821 18342 14473 7680 13177 21423 24022 9779 -6610 -10761 -13952 -12813 -13961 -6642 -5306
12965e306J1408J8272P684j1995q530l341k580p512K9K1004J012j8833j3847k548
$$ -5306 6102 24374 32058 20063 11533 8192 5612 -1900 -1871 19133 20145 1312 -12535 -15083
12951a5083n695K632K470Q65Q598r84j3136k717J0590J8437p298j7887k973J3185
$$ -15083 -20778 -18146 -15676 -14811 -6213 -7197 -20333 -23050 -12460 5977 -1321 -19208 -22181 -8996
12937h996j391L805O789P642j573M780p32R126m567k0304M005L238n193j2959
$$ -8996 -10387 -6582 207 7849 6276 11056 10324 19450 14883 -5421 -1416 1822 -3371 -16330
12923a6330p903q372N889N816o528J6443N815m541j667M074J1013m613p68j184
$$ -16330 -24233 -32605 -26716 -20900 -27428 -10985 -5170 -9711 -11378 -7304 3709 -904 -1672 -2856
12909b856l590J7296J2038M152o342j9851j4582l076J3638J6192L557n327j2073
$$ -2856 -6446 10850 22888 27040 20698 847 -13735 -16811 -3173 13019 16576 11249 -824
12896h24j1922L573N412J2537n003J3283j645q56k0482o464J0119m224q924L951
$$ -824 -12746 -9173 -3761 8776 3773 17056 15411 14555 -5927 -12391 -2272 -6496 -15420 -11469
12882a1469J0473j943r080r152J8278J0036j243q955L14q197j575K524M26O407
$$ -11469 -996 -2939 -12019 -21171 -2893 7143 5900 -3055 -2741 -10938 -12513 -9989 -9563 -3156
12868c156R505j16j905P20l18l704Q01k197L404p113k532N039J0137J7729J767
$$ -3156 6349 6233 4328 5048 4730 1026 1827 -370 3034 -4079 -6611 -1572 8565 26294 28061
12853B8061j544r843k1752p467J5154Q438p223o149j4696K205P359q592J3265
$$ 28061 26517 16674 -5078 -12545 2609 11047 3824 -2325 -17021 -14816 -7457 -16049 -2784
12840b784P544J4618J439j7760k545j0318j708N20N871l188m080j0205K7539l935
$$ -2784 4760 19378 20817 3057 512 -9806 -11514 -10994 -5123 -8311 -12391 -22596 4943 1008
12826A008p847K583K2033K091k439L557j6547j5832K422M559p331M29J404P678
$$ 1008 -6839 -4256 17777 19868 17429 20986 4439 -11393 -8971 -4412 -11743 -11314 -9910 -2232
12812b232L964m925N373J0838K743j0656r687L767J5771j401q875j282l017N579
$$ -2232 1732 -3193 2180 13018 15761 5105 -4582 -815 14956 13555 4680 3398 381 5960
12798E960M240k1926j1531J0071P244m190q536M150k378r771J15J6308N9M292
$$ 5960 10200 -11726 -23257 -13186 -5942 -10132 -18668 -14518 -16896 -26667 -26552 -10244 -10185 -5893
12784e893Q835k189p441j279N24O851r911j2363m833R356J2508L717o946O510
$$ -5893 2942 753 -6688 -7967 -7443 -592 -10503 -22866 -27699 -18343 -5835 -2118 -9064 -2554
12770b554j152p552J712K0765O126o084o024o505J709l552k1885j5935r89L0011
$$ -2554 -3706 -11258 -9546 11219 17345 11261 5237 -1268 441 -3111 -24996 -40931 -41920 -11909
12756a1909P617K328M45M582j7803j1315J4791J0357J368o664r390J449N744L508
$$ -11909 -4292 -1964 -1519 3063 -14740 -26055 -11264 -907 461 -6203 -15593 -14144 -8400 -4892
12742d892p388j206M790p34Q68J5206J741P977N865l624j7501P56m024j4501Q589
$$ -4892 -12280 -13486 -8696 -9430 -8562 6644 8385 16362 22227 18603 1102 1858 -2166 -16667 -8078
12727h078P959k1K2860n983K628j732r556k7052J589P801q129M206k715k737R053
$$ -8078 -119 -140 22720 16737 19365 17633 8077 -18975 -17386 -9585 -17714 -13508 -16223 -18960 -9907
12712i907n315L173k605r820J903O121K197K3693Q451q572r411j3503o189J771
$$ -9907 -15222 -12049 -14654 -24474 -22571 -16450 -14253 9440 17891 9319 -92 -13595 -19784 -18013
12698a8013P247j4788J0308p7n79N668M439P316l406l903K554P147M059j7820
$$ -18013 -10766 -25554 -15246 -15323 -15902 -10234 -5795 1521 -1885 -5788 -3234 3913 7972 -9848
12684i848j3541O381K844n668k890k122j022O432P018l055J020m527q325j292
$$ -9848 -23389 -17008 -14164 -19832 -22722 -24844 -25866 -19434 -12416 -15471 -14451 -18978 -27303 -28595
12670b8595N238J7204J5807n373k338l996N388k597o26O005j9590o89K2599O962
$$ -28595 -23357 -6153 9654 4281 1943 -2053 3335 738 112 6117 -13473 -14162 8437 15399
12656A5399p179J674N67o151j3896J361J8938J3505j2250o137j1391r935m034
$$ 15399 8220 9894 10461 4310 -9586 -8225 10713 24218 11968 5831 -5560 -15495 -19529
12643a9529P865J4901l836j6945J0308J5147P990P568n267j5804K509o792j0881
$$ -19529 -11664 3237 -599 -17544 -7236 7911 15901 23469 18202 2398 4907 -1885 -12766
12630a2766N707p895j6673N676N274K607m827J0710O371o418l041o369o564J0773
$$ -12766 -7059 -14954 -31627 -25951 -20677 -18070 -22897 -12187 -5816 -12234 -15275 -21644 -28208 -17435
12616a7435J2616j788M936Q819p168j4476K33r937r68J0872R379J336J041j3249
$$ -17435 -4819 -6607 -1671 7148 -20 -14496 -14263 -24200 -25168 -14296 -4917 -3581 -2540 -15789
12602a5789k504O040J0579N857L651K1084j223k2855j013j0006m46R806M135p535
$$ -15789 -18293 -12253 -1674 4183 7834 28918 27695 4840 3827 -6179 -6625 3181 7316 -219
12588b19j2467N769J0665R288m046Q30K175k2989k437J4333J9023J26j2781L256
$$ -219 -12686 -6917 3748 13036 8990 9820 11995 -10994 -13431 902 19925 20051 7270 10526
12574A0526o441m988j3586q143p826M086J1560J675J6734J250l703J670l088R662
$$ 10526 4085 -903 -14489 -22632 -30458 -26372 -14812 -13137 3597 4847 1144 2814 -274 9388
12560I388J1343o129j6421j5001M914J850j1208Q220p53P197l935J1250J1623
$$ 9388 20731 14602 -1819 -16820 -11906 -10056 -21264 -13044 -13797 -6600 -10535 715 12338
12547A2338L216q301P98K438J4971j0241j3457j2473R788J061n303J3007m695
$$ 12338 15554 7253 8051 10489 25460 15219 1762 -10711 -923 138 -5165 7842 3147
12534C147j7360K979R306J146K267k984n29m993m942l008j9715J964O715M766
$$ 3147 -14213 -11234 -1928 -782 1485 -1499 -2028 -7021 -11963 -14971 -34686 -32722 -26007 -21241
12520b1241p63J4584N891n25M995Q99L204p418N267l124j5582m997R905J3623
$$ -21241 -22004 -7420 -1529 -2054 2941 3840 7044 -374 4893 1769 -13813 -18810 -8905 4718
12506D718k503k615O88N111k839m583J0176j153j5085L418K587P057R957j8046
$$ 4718 2215 -400 288 5399 2560 -2023 8153 7000 -8085 -4667 -2080 4977 14934 -3112
12492c112l659J2407J0005m360o283P193J1061m506P9J1164J882m169j8597j6064
$$ -3112 -6771 5636 15641 11281 4998 12191 23252 18746 18825 29989 31871 27702 9105 -6959
12478f959j3986r124J567Q120O626n299r927J7513O814K340l96P62k500J823p84
$$ -6959 -20945 -30069 -28502 -20382 -13756 -19055 -28982 -11469 -4655 -2315 -2711 -1949 -4449 -2626 -3410
12463c410r71q379k0187M854J6958J625Q315J108R564K738j3746n085j2014K502
$$ -3410 -4381 -12760 -32947 -28093 -11135 -9510 -1195 -87 9477 12215 -1531 -6616 -18630 -16128
12449a6128k844P289M573o417n118O542j3935L826L863K332j558J8587J740j0279
$$ -16128 -18972 -11683 -7110 -13527 -18645 -12103 -26038 -22212 -18349 -16017 -17575 1012 2752 -7527
12435g527m035m083J979J4640P066m802R146o700N277R70j6268R03J0989L616
$$ -7527 -11562 -15645 -13666 974 8040 3238 12384 5684 10961 11931 -4337 -3434 7555 11171
12421A1171O405j4752K472J771k755r234J404N708l328J696q927L911J4755J1147
$$ 11171 17576 2824 5296 7067 4312 -4922 -3518 2190 -1138 558 -8369 -4458 10297 21444
12407B1444k2374L495K252j0812L673J0689L474l28L884Q382l926k19k946O98
$$ 21444 -930 2565 4817 -5995 -2322 8367 11841 11513 15397 23779 19853 19634 16688 17386
12393A7386n585p813l150m551O285J3484k665j8091O555R88j648J058O715J927
$$ 17386 11801 3988 838 -3713 2572 16056 13391 -4700 1855 2843 1195 2253 8968 10895
12379A0895P05L56m926j052J5450Q848j0544Q054J0984j2483j3363j5467k021
$$ 10895 11600 11956 7030 5978 21428 30276 19732 27786 38770 26287 12924 -2543 -4564
12366d564J3677N526J4412k26k2461l244K27j496J783r131Q398n395K791R826
$$ -4564 9113 14639 29051 28825 6364 3120 3347 1851 3634 -5497 2901 -2494 297 10123
12352A0123l420l362J3558l252p499j7547N147J6634P367q212m56q674j3327N057
$$ 10123 6703 3341 16899 13647 6148 -11399 -6252 10382 17749 9537 9081 407 -12920 -7863
12338g863j8867K15J740J3723J717J3821J684R44R801o423j2289R100M361m644
$$ -7863 -26730 -26515 -24775 -11052 -9335 4486 6170 7114 16915 10492 -1797 7303 11664 7020
12324G020o100j132k874o127Q949k213r012l576O637J8884Q277j4031j5991m90
$$ 7020 920 -212 -3086 -9213 -264 -2477 -11489 -15065 -8428 10456 18733 4702 -11289 -11779
12310a1779m59o094K0139J535M372Q880J971N18j1050m456l925L836M381n473
$$ -11779 -12238 -18332 1807 3342 7714 16594 18565 19083 8033 3577 -348 3488 7869 2396
12296B396r317J109R206Q307j0471L489L111o562K5794J2523l184j6778n583o539
$$ 2396 -6921 -5812 3394 11701 1230 4719 7830 1268 27062 39585 36401 19623 14040 7501
12282G501j4831K626M267N005M663p301j657j9559N034k845n858k059M439J0442
$$ 7501 -7330 -4704 -437 4568 9231 1930 273 -19286 -14252 -17097 -22955 -25014 -20575 -10133
12268a0133j0564P647K1358J3456j6993l524R748n62l329J0471q318L982L386
$$ -10133 -20697 -13050 8308 21764 4771 1247 10995 10433 7104 17575 9257 13239 16625
12255A6625M262o032o182j361r986N760l72O171j9903j1832R357Q154r356p706
$$ 16625 20887 14855 8673 7312 -2674 3086 2714 8885 -11018 -22850 -13493 -5339 -14695 -22401
12241b2401l554j928R670J1395q98J6849Q216k260m842j2462O068N891n753j1792
$$ -22401 -25955 -27883 -18213 -6818 -7716 9133 17349 15089 10247 -2215 3853 9744 3991 -7801
12227g801m218R729J1107M2j3216Q723J0134L373m684j0288p546J8390O782o436
$$ -7801 -12019 -2290 8817 8859 -4357 4366 14500 17873 13189 2901 -4645 13745 20527 14091
12213A4091j3066k588r139n847n672o489J9177J0430o957l810l656o34p016K040
$$ 14091 1025 -1563 -10702 -16549 -22221 -28710 -9533 897 -6060 -9870 -13526 -14160 -21176 -19136
12199a9136j92J1169J9166j4889j0040O301R103n833j80J6177J321p331j02J088
$$ -19136 -19328 -8159 11007 -3882 -13922 -7621 1482 -4351 -4531 11646 12967 5636 5534 6622
12185F622O847m592j6584n520L65J238K150r320P755O222q205k460J13m415p347
$$ 6622 13469 8877 -7707 -13227 -12862 -11624 -9474 -18794 -11039 -4817 -13022 -15482 -15369 -19784 -27131
12170b7131O372k685o338j720O347J5356P21p906k412p569j8125N320Q858M693
$$ -27131 -20759 -23444 -29782 -31502 -25155 -9799 -9078 -16984 -19396 -26965 -45090 -39770 -30912 -26219
12156b6219o83J880Q050N669M338j31m332j7214r242J5414J0652J8037M173k4550
$$ -26219 -26902 -25022 -16972 -11303 -6965 -7096 -11428 -28642 -37884 -22470 -11818 6219 10392 -14158
12142a4158q136Q068O165J608j3121j239n76J023N600J257J10L476j779m679p739
$$ -14158 -22294 -14226 -8061 -6453 -19574 -20813 -21389 -20366 -14766 -13509 -13399 -9923 -11702 -16381 -24120
12127b4120Q494p668R257J9158O734j2421o391J2407O510m921q440J1234J788
$$ -24120 -15626 -23294 -14037 5121 11855 -566 -6957 5450 11960 7039 -1401 9833 11621
12114A1621n983o52O866j4610o433L927l760P363J7501j3449j1037J4104R353
$$ 11621 5638 4986 11852 -2758 -9191 -5264 -9024 -1661 15840 2391 -8646 5458 14811
12101A4811o149k430P581K654j1419J585j5607p152J142j3071k654J6615Q26P745
$$ 14811 8662 6232 13813 16467 5048 6633 -8974 -16126 -14984 -28055 -30709 -14094 -13268 -5523
12087e523n13L47N991Q639R68k842j3402P988L902p555m757k271q133O35K4156
$$ -5523 -6036 -5689 302 8941 9909 7067 -6335 1653 5555 -2000 -6757 -9028 -17161 -16526 7630
12072G630N888n503m512n300j458N40j504K664j0932L402K841m228O187n114n65
$$ 7630 13518 8015 3503 -1797 -3255 -2715 -4219 -1555 -12487 -9085 -6244 -10472 -4285 -9399 -9964
12057i964P332J0681J850R008n496P97N391k3635k142r146k981K081M954P639
$$ -9964 -2632 8049 9899 18907 13411 14208 19599 -4036 -6178 -15324 -18305 -16224 -11270 -3631
12043c631J1659L399p949l470N309n127r574R188M359k408q743M17r092J6497
$$ -3631 8028 11427 3478 8 5317 190 -9384 -196 4163 1755 -6988 -6571 -15663 834
12029H34m426j3737Q116L22J2534J3544K160j108j3031l7421j8761O906K6612
$$ 834 -3592 -17329 -9213 -8891 3643 17187 19347 18239 5208 -32213 -50974 -44068 -17456
12016a7456J8000O143J5494J8172l1535j5833j5095O412J4317R423n273O788K172
$$ -17456 544 6687 22181 40353 8818 -7015 -22110 -15698 -1381 8042 2769 9557 11729
12003A1729j0878j446K819J899j9451j453J5246K978p174Q933p336O684O126J969
$$ 11729 851 -595 2224 4123 -15328 -16781 -1535 1443 -5731 3202 -4134 2550 8676 10645
11989A0645k20r203O827k379n213J3937M373j425o245j5950j0083o60J9199l869
$$ 10645 10425 1222 8049 5670 457 14394 18767 17342 11097 -4853 -14936 -15596 3603 -266
11975b66m425j018K010O474q734l737q947J5995J6029k021N676J3688J763k2911
$$ -266 -4691 -5709 -3699 2775 -5959 -9696 -18643 -2648 13381 11360 17036 30724 32487 9576
11961I576m125R828n830j997k80o179j0410Q536N818m284o276k293m851J3577
$$ 9576 5451 15279 9449 7452 7172 993 -9417 -881 4937 653 -5623 -7916 -12767 810
11947H10K4117p312p449J467k955L95p837J390Q280p584N74p827K298o860n524
$$ 810 24927 17615 10166 11633 8678 9073 1236 2626 10906 3322 3896 -3931 -1633 -8493 -14017
11932a4017m253L468n182J2419J2646K842O196k974o519p107J9165l859j6175
$$ -14017 -18270 -14802 -19984 -7565 5081 7923 14119 11145 4626 -2481 16684 12825 -3350
11919c350j462P472Q403J5005J4650j987j5236j1166p151p171m134K747M455Q021
$$ -3350 -4812 2660 11063 26068 40718 38731 23495 12329 5178 -1993 -6127 -3380 1075 9096
11905I096O177j4669j8878L645M752p27M890O778j3073K4Q258O851L653m708o530
$$ 9096 15273 604 -18274 -14629 -9877 -10604 -5714 1064 -12009 -11985 -3727 3124 6777 2069 -4461
11890d461j110j8025L83K4403J2748j5643M548N615j1191j831q720J5574J5097
$$ -4461 -5571 -23596 -23213 1190 13938 -1705 2843 8458 -2733 -4564 -13284 2290 17387
11877A7387k043J630k14n607m69k689l450j8352n626J971J923P645o111q076o47
$$ 17387 15344 16974 16760 11153 10684 7995 4545 -13807 -19433 -17462 -15539 -7894 -14005 -22081 -22728
11862b2728L578Q29K922R434J0074k465k758j5259M785p67p554j1161J360N216
$$ -22728 -19150 -18321 -15399 -5965 4109 1644 -1114 -16373 -11588 -12355 -19909 -31070 -29710 -24494
11848b4494L226R331P795J1394l10N275r771j9688l928L047j444J658j395N419
$$ -24494 -21268 -11937 -4142 7252 6942 12217 2446 -17242 -21170 -18123 -19567 -17909 -19304 -13885
11834a3885P597n961k98k597j3372M873J1482L245J0369R75m777j6133p502Q17
$$ -13885 -6288 -12249 -12547 -15144 -28516 -23643 -12161 -8916 1453 2428 -2349 -18482 -25984 -25167
11820b5167M367Q233q689k090J517j876N590j51J0068r397J030K1892Q524m141
$$ -25167 -20800 -12567 -21256 -23346 -21829 -23705 -18115 -18266 -8198 -17595 -16565 5327 13851 9710
11806I710m786k5324r026J44J2282J0923J115n53R692K795n923j1241j0366j395
$$ 9710 4924 -20400 -29426 -29282 -17000 -6077 -4962 -5515 4177 6972 1049 -10192 -20558 -21953
11792b1953J0264P939M496r059j0654J3340Q842J1510Q458n389j8624M123K536
$$ -21953 -11689 -3750 746 -8313 -18967 -5627 3215 14725 23183 17794 -830 3293 5829
11779E829L664J3291j8697j3895j417n115M764K532m159N105R503L551J7576M727
$$ 5829 9493 22784 4087 -9808 -11225 -16340 -11576 -9044 -13203 -8098 1405 4956 22532 27259
11765B7259r012j5768k310j8308N436N463M077k5K966J6572J680p745j3777N641
$$ 27259 18247 2479 169 -18139 -12703 -7240 -3163 -3188 -222 16350 18030 10285 -3492 2149
11751B149m219J331n603r677N218k96l90K347J7013m1J066N445L674o93N983j0011
$$ 2149 -2070 -739 -6342 -16019 -10801 -11097 -11487 -9140 7873 7832 8898 14343 18017 17324 23307 13296
11735A3296j5154r35K375J089J435L153j053m938K028j0543p152m880O479m75
$$ 13296 -1858 -2793 -418 671 2106 5259 4206 -732 1296 -9247 -16399 -21279 -14800 -15275
11721a5275K774J7195L317j133L057L687q257j0975p509L324J2063J0321L5k3223
$$ -15275 -12501 4694 8011 6878 9935 13622 5365 -5610 -13119 -9795 2268 12589 12624 -10599
11707a0599o398j1466k302L95R746J5053k768k75K547L057L246n562r567r219
$$ -10599 -16997 -28463 -30765 -30370 -20624 -5571 -8339 -8614 -6067 -3010 236 -5326 -14893 -24112
11693b4112j2119K2173Q643L404N687m929J3068o130k19j3079p148j90J4116m036
$$ -24112 -36231 -14058 -5415 -2011 3676 -1253 11815 5685 5466 -7613 -14761 -14951 -835 -4871
11679d871n939J5915L998N982j642J734o526p597Q736j468k592k282q646q249
$$ -4871 -10810 5105 9103 15085 13443 15177 8651 1054 9790 8322 5730 3448 -5198 -13447
11665a3447N573J0464O682K870Q173p178Q74M690P467J790n399j0818j6057o62
$$ -13447 -7874 2590 9272 12142 20315 13137 14011 18701 26168 27958 22559 11741 -4316 -4978
11651d978J2377J4252j455M299O39P451m988j2695j255k457P196J985j1630K143
$$ -4978 7399 21651 20196 24495 25134 32585 27597 14902 13647 11190 18386 20371 8741 10884
11637A0884J1518j2185k2991o097M379j1778M993N141N777P697P429J1277m977
$$ 10884 22402 10217 -12774 -18871 -14492 -26270 -21277 -16136 -10359 -2662 4767 16044 11067
11624A1067q037j2122j26J369j640O939k280p61J4036J3519k363m602L193j860
$$ 11067 3030 -9092 -9218 -7849 -9489 -2550 -4830 -5591 8445 21964 19601 14999 18192 16332
11610A6332N435n140k2778j2743N233L428R358J2622J0356j0212l358l970n635
$$ 16332 21767 16627 -6151 -18894 -13661 -10233 -875 11747 22103 11891 8533 4563 -1072
11597a072j858Q499N756J812j1650k0418J0551J6854J6438N388j6225j3607n604
$$ -1072 -2930 5569 11325 13137 1487 -18931 -8380 8474 24912 30300 14075 468 -5136
11584e136O658K641o805Q092j192o08J2002Q701l617Q473K07n864L626J2355j908
$$ -5136 1522 4163 -2642 5450 4258 3650 15652 24353 20736 29209 29416 23552 27178 39533 37625
11569C7625j2334L927L625R70j5426q767M621J1788r513p829n438k682J981j9916
$$ 37625 25291 29218 32843 33813 18387 9620 14241 26029 16516 8687 3249 567 2548 -17368
11555a7368k362J3176J5824J2050J0480k255j646j7039j0294J9486J2082n66r509
$$ -17368 -19730 -6554 9270 21320 31800 29545 27899 10860 566 20052 32134 31568 22059
11542B2059p772K998j1143O04J4343r626K67J039M04q89o49j2788j838N010J6359
$$ 22059 14287 17285 6142 6746 21089 11463 11730 12769 13173 12284 11635 -1153 -2991 2019 18378
11527A8378P948o937j0864m947M710N595m032M97J0283Q806j5656r478P246N162
$$ 18378 26326 19389 8525 3578 8288 13883 9851 10348 20631 29437 13781 4303 11549 16711
11513A6711K812O766K803j8980j0488k732J1008O223j3074k23p048j1449J1728
$$ 16711 19523 26289 29092 10112 -376 -3108 7900 14123 1049 826 -6222 -17671 -5943
11500e943J7758k796q2N460m180R288m28k865q236j5858j8153N557J4834Q884
$$ -5943 11815 9019 8937 14397 10217 19505 19077 16212 7976 -7882 -26035 -20478 -5644 3240
11486C240M708n212o046J78R431O409k711q222K73m832m303J9283J1904N270Q565
$$ 3240 7948 2736 -3310 -3132 6299 12708 9997 1775 2048 -2784 -7087 12196 24100 29370 37935
11471C7935o696r887L930l418n758r476q759l223J2111k087M882R755L363j7397
$$ 37935 31239 21352 25282 21864 16106 6630 -2129 -5352 6759 4672 9554 19309 22672 5275
11457E275p921R028O800k230J0300N485p845K92k373p823l151j0079j1664j730
$$ 5275 -2646 6382 13182 10952 21252 26737 18892 19184 16811 8988 5837 -4242 -15906 -17636
11443a7636J1403J3035O315J6832J3912r187j4458o125q534r590j5521q49K3597
$$ -17636 -6233 6802 13117 29949 43861 34674 20216 14091 5557 -4033 -19554 -20403 3194
11430C194J2982p15j149J3334n954o313J0053O191l395j0155K616J6783J099j3261
$$ 3194 16176 15461 14312 27646 21692 15379 25432 31623 28228 18073 20689 37472 38571 25310
11416B5310K031M876j9078k119J7704l468n62L310j7030l364Q035m841M398P526
$$ 25310 27341 32217 13139 11020 28724 25256 24694 28004 10974 7610 15645 10804 15202 22728
11402B2728J0175J028j1421j746j823R983Q733k682j3153k287K295p766K376k329
$$ 22728 32903 33931 22510 20764 18941 28924 37657 34975 21822 19535 21830 14064 16440 14111
11388A4111Q150K803j1388k793r447m805k944m565Q654R728P47P607j1336j3621
$$ 14111 22261 25064 13676 10883 1436 -3369 -6313 -10878 -2224 7504 8251 15858 4522 -9099
11374i099L527P604O421O299k236N258j844J066J3550J254j3959N48J6971R624
$$ -9099 -5572 2032 8453 14752 12516 17774 15930 16996 30546 31800 17841 18389 35360 44984
11360D4984K682j6254o425l124j2720O393K1230l148l445M478L624l320j1270
$$ 44984 47666 31412 24987 21863 9143 15536 36766 33618 30173 34651 38275 34955 23685
11347B3685p946J2502J2144p547j9272J5910M871r170j2155P219Q72j0043K481
$$ 23685 15739 28241 40385 32838 13566 29476 34347 25177 13022 20241 21113 11070 13551
11334A3551K2271m30p884q970N428J1238J1345l011m287L472J3311J7521J4424
$$ 13551 35822 35392 27508 18538 23966 35204 46549 43538 39251 42723 56034 73555 87979
11321H7979J9170R862J0445L6726K2628K5244M4760R2607J38908K06657K87323
$$ 87979 107149 117011 127456 164182 186810 212054 256814 349421 488329 694986 982309
11310I82309L14929K11605J2869j54949k73433k83446k06644j42742r1261p0924
$$ 982309 1297238 1508843 1521712 1366763 1093330 809884 603240 460498 369237 298313
11300B98313o6414l1682k2772l678k5118k5118p355K462m896k1588q858J3819
$$ 298313 231899 200217 177445 173767 148649 123531 116176 118638 113742 92154 83296 97115
11288I7115J093q645r86N103o36k5144k7445j111R935k109P746K734m240j0020
$$ 97115 98208 89563 88577 93680 93044 67900 40455 39344 49279 47170 54916 57650 53410 43390
11274D3390l687k10J0807J5101l284m858R226K5240P157q211j7399r701N448O386
$$ 43390 39703 39493 50300 65401 62117 57259 66485 91725 98882 90671 73272 63571 69019 75405
11260G5405j672l149K1930L098j558P151K56M291J1533J5002J6953J9863O419
$$ 75405 73733 70584 92514 95612 94054 101205 101461 105752 117285 132287 149240 169103 175522
11247A75522J7786K6507M2711N4924N9541M9531j2559o0971r8980j12407p4344
$$ 175522 193308 219815 262526 317450 376991 426522 413963 352992 254012 141605 67261
11236F7261m2035k2925k330O582p586p620R478k008n381q090J7362P05J0813J87
$$ 67261 25226 2301 -29 6553 -1033 -8653 825 -1183 -6564 -14654 2708 3413 14226 14413
11222A4413j1654M490O324J3293J6136l976k4199l0523j8486j7845j6191K2080
$$ 14413 2759 7249 13573 26866 43002 39026 14827 -15696 -34182 -52027 -68218 -46138
11210d6138K850k813K750J4368J0490J1126J6812Q444o589j8980j6905o96O186
$$ -46138 -43288 -46101 -43351 -28983 -18493 -7367 9445 17889 11300 -7680 -24585 -25281 -19095
11197a9095K1676J0932j1025L753J5629L824j0556L570k12O53j1458N443J0166
$$ -19095 2581 13513 2488 6241 21870 25694 15138 18708 18496 19149 7691 13134 23300
11184B3300J514n475p879J040l598k42j4536j2923J0699J3545P540N590P792p392
$$ 23300 24814 19339 11460 12500 8902 8660 -5876 -18799 -8100 5445 12985 18575 26367 18975
11170A8975k0178j9335j5954K276K6597L1031K1267K2988L4406K9028K9507L3434
$$ 18975 -1203 -20538 -36492 -34216 -7619 23412 44679 67667 102073 131101 160608 194042
11158A94042M1205K6326R974j8879m7240k9455l0765l2305j6735k7183j6859Q705
$$ 194042 235247 261573 271547 252668 205428 175973 145208 112903 96168 68985 52126 60831
11146F0831j586j9112k3554l644L13J7132L24J8683J4727q876o767L14p7n979
$$ 60831 59245 40133 16579 12935 13248 30380 30704 49387 64114 55238 48471 48785 48708 42729
11132D2729L448O312r670r646n76p304o484K548L367m528L4J1591J7125P994N83
$$ 42729 46177 52489 42819 33173 32597 25293 18809 21357 24724 20196 20230 31821 48946 56940 57523
11117E7523R366m112j1787J3392J3037K971q470L612l320j791j7873k5941r91
$$ 57523 66889 62777 50990 64382 77419 80390 71920 75532 72212 70421 52548 26607 25616
11104B5616n136n185j387O138J4890J3325q7J5990L226J1872J1844j1208j0914
$$ 25616 20480 15295 13908 20046 34936 48261 48174 64164 67390 79262 91106 79898 68984
11091F8984M076K546K57j1299L287K5897Q017K857K493j3139j8772k274J1037
$$ 68984 73060 75606 75863 64564 67851 93748 101765 104622 107115 93976 75204 72930 83967
11078H3967J2426j886M670J1004K899k184J3999k1082k6578m678Q214m268o932
$$ 83967 96393 94507 99177 110181 113080 110896 124895 103813 77235 72557 80771 76503 69571
11065F9571j2736N671J0987O334J2623R028M326n355j6994m273Q924O90P928J683
$$ 69571 56835 62506 73493 79827 92450 101478 105804 100449 83455 79182 88106 88796 96724 98407
11051I8407j140j2679P590Q19j2535k9596j5193Q626R135R44J2011J2908J6480
$$ 98407 97267 84588 92178 92997 80462 50866 35673 44299 53434 54378 66389 79297 95777
11038I5777J9659J3563M7104M4696L9722M0323L4109J6470j8440n9897n3542n0738
$$ 95777 115436 128999 176103 220799 260521 300844 334953 351423 332983 273086 219544 168806
11026A68806k3314M639P112j1543j7355j578K70J0545L146J5732J7777R420M393
$$ 168806 145492 150131 157243 145700 128345 126767 127037 137582 140728 156460 174237 183657 188050
11013A88050o38r899m61O747j988m472P898L769J0264L279j212J4278K760n249
$$ 188050 187412 177513 177052 183799 181811 177339 185237 189006 199270 202549 201337 215615 218375 213126
10999B13126N403R608N452J2j9926k5457l830N923J9960J2078q884L855k611J1743
$$ 213126 218529 228137 233589 233601 213675 188218 184388 190311 210271 222349 213465 217320 214709 226452
10985B26452K6939R128J0181J0715J0155J8074J6579J2138P19j73O063M56K098
$$ 226452 253391 262519 272700 283415 293570 311644 328223 340361 341080 340907 346970 347426 349524
10972C49524L1137K0440K9442L1427K5483K0725K8137K8010Q271R480L3133K3939
$$ 349524 380661 401101 430543 461970 487453 508178 536315 564325 572596 582076 615209 639148
10960F39148L0070K1158L2241K8529J9735K8354K0784L2053N0184L5369N0694
$$ 639148 669218 690376 722617 751146 770881 799235 820019 852072 902256 937625 988319
10949I88319M9344M5638M9344N5600N6106P6471Q2742O8429Q8217J26115J48388
$$ 988319 1037663 1083301 1132645 1188245 1244351 1320822 1403564 1471993 1560210 1686325 1834713
10938A834713J70378J83723J59809J68036J68535J76905K15780K60275L59455
$$ 1834713 2005091 2188814 2348623 2516659 2685194 2862099 3077879 3338154 3697609
10929C697609M76566O02358O44757N72706M07799K66616K61539M37681O82528
$$ 3697609 4174175 4776533 5421290 5993996 6401795 6668411 6929950 7367631 8050159
10920H050159R58815J258383J630530K116074K782415L521033M421977N731239
$$ 8050159 9008974 10267357 11897887 14013961 16796376 20317409 24739386 30470625
10912C0470625P919652J1685281J8074563K8473846M3101961N6042445N3918769
$$ 30470625 38390277 50075558 68150121 96623967 139725928 195768373 249687142
10905B49687142K8812664r566002m1073245n2578812m6736966l4564171k3898882
$$ 249687142 278499806 268933804 227860559 175281747 128544781 93980610 70081728
10898G0081728j6029844j0694076p564182n972389n078758m309870l464279k667989
$$ 70081728 54051884 43357808 35793626 29821237 24742479 20432609 16968330 14300341
10890A4300341k065994j607498j233550r48022p33354n41098m12137m26225n14470
$$ 14300341 12234347 10626849 9393299 8445277 7711923 7170825 6758688 6332463 5817993
10881E817993n77015n98078n61288m80198l96384l14009k46424k23505j83512
$$ 5817993 5240978 4642900 4081612 3601414 3205030 2891021 2644597 2421092 2237580
10872B237580j26851r1656o3781q1081r4594q3302q9193r1762r3627p1320o5317
$$ 2237580 2110729 2019073 1955292 1874211 1779617 1696315 1607122 1515360 1421733 1350413 1285096
10861A285096n7151l8618m9234n8058n6651m2725k9871j4820k4486m7690m7043
$$ 1285096 1227945 1189327 1140093 1082035 1025384 982659 952788 937968 913482 865792 818749
10850H18749k5652p276k6718k3549k6871j6206j5390n593k9209j1594P379J0467
$$ 818749 793097 785821 759103 735554 708683 692477 677087 671494 642285 630691 638070 648537
10838F48537j0691k0330j8930j7989j9658P374j727k9336k8422k2919j4374n594
$$ 648537 637846 617516 598586 580597 560939 568313 566586 537250 508828 485909 471535 465941
10826D65941q98L523J0331L426o251l649n710j5064p536Q792j9836k7823j9822
$$ 465941 465043 468566 478897 482323 476072 472423 466713 451649 444113 452905 433069 405246 385424
10813C85424j4084l828l537M803l0322l8872l149N664N04J6545n712q663m604
$$ 385424 371340 367512 363975 368778 338456 299584 296435 302099 302603 319148 313436 304773 300169
10800C00169j0357L663k409o520m543N348r592p825O217k458j0215k866k269R729
$$ 300169 289812 293475 291066 284546 280003 285351 275759 267934 274151 271693 261478 258612 256343 266072
10786B66072O588M557L252L172n926q49k4061k1022k5542l2645j5073r168k6598
$$ 266072 272660 277217 280469 283641 277715 276866 252805 231783 206241 173596 158523 149355 122757
10773A22757r069K0622J2743J9144Q589j844J1837K798J501Q332q433m313q00
$$ 122757 113688 134310 147053 166197 174786 172942 184779 187577 189078 197410 188977 184664 183864
10760A83864k012n047j3587p777k972L518n422o288j5583n689J648Q137J2649
$$ 183864 181852 176805 163218 155441 152469 155987 150565 144277 128694 123005 124653 132790 145439
10747A45439J5608J0723O41k2502j4510q021m785n531O292l612o745J2259P849
$$ 145439 161047 171770 172411 149909 135399 127378 122593 117062 123354 119742 112997 125256 133105
10734A33105J6670J9025L2967L9374O921j1581k4298l6102k9585k3583k4613o453
$$ 133105 149775 168800 201767 241141 248062 236481 212183 176081 146496 122913 98300 91847
10722I1847K2891J5l582J6837P470J7481J6800j3798n353l482j6560j0219J2383
$$ 91847 114738 114753 111171 128008 135478 152959 169759 155961 150608 147126 130566 120347 132730
10709A32730K149p95k82K090k733r057j377j7788j1882p680k5640k383M962J628
$$ 132730 134879 134084 133802 135892 133159 124102 122725 104937 93055 85375 59735 57352 62314 63942
10695F3942J6672R101Q903K942Q22K700n989j0919j889J067K1691O617o496n085
$$ 63942 80614 89715 98618 101560 102382 105082 99093 88174 86285 87352 109043 115660 109164 104079
10681A04079j761m983R55l278j074n42m501j2006l152n616j061L544k534Q568
$$ 104079 102318 97335 98290 95012 93938 93396 88895 76889 73737 68121 67060 70604 68070 76638
10667G6638K4849R779M900M223N447J0902n279j5014O12k224j0644k6720j2135
$$ 76638 101487 111266 116166 120389 125836 136738 131459 116445 117057 114833 104189 77469 65334
10654F5334M350L673O942R933J2049l971j3114m537j2324O339J3600K0972L320
$$ 65334 69684 73357 80299 90232 102281 98310 85196 80659 68335 74674 88274 109246 112566
10641A12566L282j547j9566m50J933k645p938r07J492j0136n266K35R099R429
$$ 112566 115848 114301 94735 94285 96218 93573 85635 84728 86220 76084 70818 71053 80152 89581
10627H9581Q791P409n625Q10J0764m591k1397j2184r530O827J0398K778O642N250
$$ 89581 98372 105781 100156 100966 111730 107139 85742 73558 64028 70855 81253 84031 90673 95923
10613I5923m193p173k125O708P241J8346k633j0630q305K7462K2413j781m595
$$ 95923 91730 84557 82432 89140 96381 114727 112094 101464 93159 120621 143034 141253 136658
10600A36658k210m512k523o90J6752q778l5589l1191m888M200J0440p891J1218
$$ 136658 134448 129936 127413 126723 143475 134697 99108 67917 63029 67229 77669 69778 80996
10587H0996J4600K0512J9317K862q195m868j509j9383K91J6254J2155N154k337
$$ 80996 95596 116108 135425 138287 130092 125224 123715 104332 104623 120877 133032 138186 135849
10574A35849j0969l2344p8888r7116j04185q4775l5677R475N3693N4321L7605
$$ 135849 124880 92536 13648 -83468 -187653 -272428 -308105 -298630 -244937 -190616 -153011
10563a53011N1748K8226J2084J8359M5863L9791K3448J0683Q28j1862k5981q150
$$ -153011 -101263 -73037 -60953 -42594 3269 43060 66508 77191 78019 66157 40176 32026
10551C2026p064m278O826L157o535p803k0351j548J5205J4472J6691L245m480
$$ 32026 24962 20684 27510 30667 24132 16329 -4022 -5570 9635 24107 40798 44043 39563
10538C9563R622J6929j978j0764J906J4668N686J5076L841O152J1668K208J6355
$$ 39563 49185 66114 64136 53372 55278 69946 75632 90708 94549 100701 112369 114577 130932
10525A30932M008K646N792L176k5760j7541o620m969k483o60p664r102K793J4609
$$ 130932 134940 137586 143378 146554 120794 103253 96633 91664 89181 88521 80857 71755 74548 89157
10511H9157K3647J5976J8568K0734N456P306K9921N1813M2074N4899Q8813J34328
$$ 89157 112804 128780 147348 168082 173538 180844 210765 262578 304652 359551 448364 582692
10499E82692K12933K87314K85189J73436k7908j92992k76445k53246j89642j33819
$$ 582692 795625 1082939 1368128 1541564 1513656 1320664 1044219 790973 601331 467512
10489D67512r1174n8325n1219m0546l9972l4216q259N225N4m250j7274o611P627
$$ 467512 376338 318013 266794 226248 186276 152060 143801 149026 149080 144830 127556 120945 128572
10476A28572K962n727k1580N994j5812q091r803J043M859R572J93o125k341j8774
$$ 128572 131534 125807 104227 110221 94409 86318 76515 77558 82417 91989 92182 86057 83716 64942
10462F4942j069Q945j0123P080J2342L305M040J0732j0800j8826J996j957O801
$$ 64942 63873 72818 62695 69775 82117 85422 89462 100194 89394 70568 72564 70607 77408
10449G7408p978M786P448j9821J168P612M507Q004J0672J792J3037l193j0401
$$ 77408 69430 74216 81664 61843 63011 70623 75130 83134 93806 95598 108635 105442 95041
10436I5041r181o258r906N861J8O31j1649k710J0668J3652l105K887K947p805
$$ 95041 85860 79602 69696 75557 75575 76206 64557 61847 72515 86167 83062 85949 88896 81091
10422H1091K728r833J2818J1755J2392j995o507K354l637P28K699J0109l508r017
$$ 81091 83819 73986 86804 98559 110951 108956 102449 104803 101166 101894 104593 114702 111194 102177
10408A02177j0142J2423L034j3002k956n512m321J2170K2173m640p891l382K776
$$ 102177 92035 104458 107492 94490 91534 86022 81701 93871 116044 111404 103513 100131 102907
10395A02907J5179l54J215j2338m884o99o790N294N332l919K337K817n729m497
$$ 102907 118086 117732 118947 106609 101725 101026 94236 99530 104862 100943 103280 106097 100368 95871
10381I5871N464O828r046q6L668n134j4097P194K2281O660J4k741j1578o307Q058
$$ 95871 101335 108163 99117 99031 102699 97565 83468 90662 112943 119603 119617 116876 105298 98991 107049
10366A07049o256M996L689j1447q39O882n431P012o903q993P280O009O512n827
$$ 107049 100793 105789 109478 98031 97192 104074 98643 105655 98752 89759 97039 103048 109560 103733
10352A03733K751K085j8259q278J8039R017o335M367J011o173P29J0936L749N185
$$ 103733 106484 108569 90310 82032 100071 109088 102753 107120 108131 101958 102687 113623 117372 122557
10338A22557k362m297j6367J601J9164J3679j0257r298j7449J664Q812M593J628
$$ 122557 120195 115898 99531 101132 120296 133975 123718 114420 96971 98635 107447 112040 113668
10325A13668K521L220m422p324p508q962J1451o522J240O477J397M548K71K5358
$$ 113668 116189 119409 114987 107663 100155 91193 102644 96122 97362 103839 105236 109784 110055 135413
10311A35413L332k0997j2841r327K447Q521l494Q490J2509l46P262R283j2076
$$ 135413 138745 117748 104907 95580 98027 106548 103054 111544 124053 123707 130969 140252 128176
10298A28176k210M546j4584q604J7622R152j057N558k0709j6341J3687K430p640
$$ 128176 125966 130512 115928 107324 124946 134098 133041 138599 117890 101549 115236 117666 110026
10285A10026j1303J0618J4356m151q148J5298p689j0143k788k204J3074O46j0325
$$ 110026 98723 109341 123697 119546 111398 126696 119007 108864 106076 103872 116946 117592 107267
10272A07267J0101M136j599o481n48p396j5044R819J4446J3743o261O93K327L313
$$ 107267 117368 121504 119905 113424 112876 105480 90436 100255 114701 128444 122183 122876 125203 128516
10258A28516j1700J5554J6109j4458j0084K220k817j1235R127K610l488P191O274
$$ 128516 116816 132370 148479 134021 123937 126157 123340 112105 121232 123842 120354 127545 133819
10245A33819Q211J693j2001L58L699J057O067q942p584q689Q054N453m163m090
$$ 133819 142030 143723 131722 132080 135779 136836 142903 133961 126377 117688 125742 131195 127032 122942
10231A22942J890m294K772L325O082R247J0340L314m978N230O374j0038L923L00
$$ 122942 124832 120538 123310 126635 132717 141964 152304 155618 150640 155870 162244 152206 156129 156429
10217A56429j5932j981q353q825J1897J3056m90L847N319j868Q52J2386L829o201
$$ 156429 140497 138516 130163 121338 133235 146291 145801 149648 154967 153099 153951 166337 170166 163965
10203A63965j4573q154M695J631K547n09P76q027Q423o151m441n933L635J1113
$$ 163965 149392 141238 145933 147564 150111 149602 150378 142351 150774 144623 140182 134249 137884 148997
10189A48997P938l759O219k7048j6430J0500J5832N371J2498o575J480K588N4
$$ 148997 156935 153176 159395 132347 115917 126417 142249 147620 160118 153543 155023 157611 157665
10176A57665L834K382j5610n693K140Q745R982j0870j9863l037j267J1224O474
$$ 157665 161499 163881 148271 142578 144718 153463 163445 152575 132712 129675 128408 139632 146106
10163A46106l690Q77m215Q33K2202J938l357p07k459m733r354j5200O421J5118
$$ 146106 142416 143293 139078 139911 162113 164051 160694 159987 157528 152795 143441 128241 134662 149780
10149A49780o912O656J1201Q760K557k587p370J1292R696j626L385j2427P76P824
$$ 149780 142868 149524 160725 169485 172042 169455 162085 173377 183073 181447 184832 172405 173181 181005
10135A81005M348Q03M32l295k0253q949k21j29N047j3628J0541N333J450n010
$$ 181005 185353 186156 186588 183293 163040 154091 153870 153741 158788 145160 155701 161034 162484 157474
10121A57474Q527J4167o155m793J5668p97Q078L503R127l06n257k514M21J643
$$ 157474 166001 180168 174013 169220 184888 184091 192169 195672 204799 204493 199236 196722 197143 198786
10107A98786L45l735K2402Q290J3114J3634L0798P3981J08717J44135J62056J14529
$$ 198786 199131 195396 217798 226088 239202 252836 283634 357615 466332 610467 772523 887052
10095H87052M814j07027j46288j27792r6529n9376l7870l8642l6930j3241j6811
$$ 887052 891866 784839 638551 510759 414230 354854 316984 278342 241412 228171 211360
10084B11360p510j4236j4676j5401P922m66K605M881p840k347j1870p559L538
$$ 211360 203850 189614 174938 159537 167459 166993 169598 174479 166639 164292 152422 144863 148401
10071A48401N823o046J4004K560j3186m109l20K039J3795n820o09p13O617P254
$$ 148401 154224 148178 162182 164742 151556 147447 147127 149166 162961 157141 156532 155819 162436 169690
10057A69690M977k1197j4682J3258Q244o882l041n212p010J97k703J86N581j1463
$$ 169690 174667 153470 138788 152046 160290 153408 150367 145155 138145 138342 135639 135825 141406 129943
10043A29943l851o244n692O297N333p315R411J0639k365k64q961j3094M251n574
$$ 129943 126092 119848 114156 120453 125786 118471 127882 138521 136156 135892 126931 113837 118088 112514
10029A12514N518J6136P30m338M530j304r424p52M504j32J0272j758M010J2109
$$ 112514 118032 134168 134898 130560 135090 133786 124362 123610 128114 127982 138254 136496 140506 152615
10015A52615j6054n844m88j5454M836J3152o437k072J4603o370j3324Q883J8921
$$ 152615 136561 130717 130229 114775 119611 132763 126326 124254 138857 132487 119163 128046 146967
10002A46967P430K355k8973j2256m642J0045Q935P24K481N226j5110L052K641
$$ 146967 154397 156752 127779 115523 110881 120926 129861 130585 133066 138292 123182 126234 128875
9989A28875j1647k264m407O564J5859k5340j0613J3924Q272J0859k168L162O61
$$ 128875 117228 114964 110557 117121 132980 107640 97027 110951 119223 130082 127914 131076 131737
9976A31737L790O8j0039nJ0344L257r284o23j1902o688O053O056Q831Q199l839
$$ 131737 135527 135595 125556 125551 135895 139152 129868 129245 117343 110655 116708 122764 131595 139794 135955
9961A35955j0845p607O616J050k311J0239j710J2028o469K385N705R890J943P274
$$ 135955 125110 117503 124119 125169 122858 133097 131387 143415 136946 139331 145036 154926 156869 164143
9947A64143J3691M774J7212P430J6787K4777K8796M5411N5205J07270J65613K67961
$$ 164143 177834 182608 199820 207250 224037 248814 277610 323021 378226 485496 651109 919070
9935I19070L63051L67869J64599j22543l27578l47070k51440j81104j48213q6653
$$ 919070 1282121 1649990 1814589 1692046 1364468 1017398 765958 584854 436641 349988
9925C49988l3100k9094k5382k9433k6543k3528q66P553j0590j1581r471q23q130
$$ 349988 316888 287794 262412 232979 206436 182908 182042 189595 179005 167424 157953 157130 149000
9912A49000r53M047k0666j7803p689L824q308j0580J328K5178J3753M835Q359
$$ 149000 148047 152094 131428 113625 105936 109760 101452 90872 92200 117378 131131 135966 144325
9899A44325M221K1200J9602J506j5654l644q975o650k0581R22p089k3941p086
$$ 144325 148546 169746 189348 190854 175200 171556 162581 155931 135350 136272 129183 105242 98156
9886I8156o889j324J0919J6769J0071j0183k4090k6412J0389J5173R347n678R72
$$ 98156 91267 89943 100862 117631 127702 117519 93429 67017 77406 92579 101926 96248 97220
9873I7220n180N869K0083P368j3681p114p24Q973J014j2137k457R186Q276Q780
$$ 97220 92040 97909 117992 125360 111679 104565 103841 112814 113828 101691 99234 108420 116696 125476
9859A25476j969k381M491j5415j1190j195q649J0874n246J558J6770r002J1457
$$ 125476 123507 121126 125617 110202 99012 97817 89168 100042 94796 96354 113124 104122 115579
9846A15579R746j0408j8511j5372j5992J6279J7798J3120J5040J1005J0329n932
$$ 115579 125325 114917 96406 81034 65042 81321 99119 112239 127279 138284 148613 142681
9834A42681L632K1482L2694M2178O9627J11487J65844J60201Q1600j9319j23762
$$ 142681 146313 167795 200489 242667 312294 423781 589625 749826 831426 812107 688345
9823F88345j66726j35738q6178n9002m1772l5309j5768j4889r857J1653K977r119
$$ 688345 521619 385881 299703 240701 198929 163620 147852 132963 123106 134759 137736 128617
9811A28617q464l497o775k856p093j7621j3464M474m032O754R241N209j2190R638
$$ 128617 120153 116656 109881 107025 99932 82311 68847 73321 69289 76043 85284 90493 78303 87941
9797H7941P154j0529j1297K203m123K795n155q143R783K1197L674m855j2746o458
$$ 87941 95095 84566 73269 75472 71349 74144 68989 60846 70629 91826 95500 90645 77899 71441
9783G1441l61Q166J0725L231l356n554r094J764O582P431O844j984N933Q149Q205
$$ 71441 71080 79246 89971 93202 89846 84292 75198 76962 83544 90975 97819 95835 101768 109917 118122
9768A18122O426J2657J0653q594o49n755j4052j8348p156l79K037o762o010o909
$$ 118122 124548 137205 147858 139264 138615 132860 118808 100460 93304 92925 94962 88200 82190 75281
9754G5281j0066J543k250J439Q259r376o062j182l699Q238R459L424L234q399
$$ 75281 65215 66758 64508 65947 74206 64830 58768 57586 53887 62125 71584 75008 78242 69843
9740F9843P478k195M54l471q608K259J8116N447q66r225l722j2843J279Q074L852
$$ 69843 77321 75126 75580 72109 63501 65760 83876 89323 88457 79232 75510 62667 63946 72020 75872
9725G5872p796j42R872J7027Q436L475j5573k1701m156j3590R94l920r5j0826
$$ 75872 68076 67934 77806 94833 103269 106744 91171 69470 65314 51724 52718 48798 48703 37877
9711C7877j4926Q547m520K69L818P079N381j5567R173K6496J0947j8038q086N79
$$ 37877 22951 31498 26978 27247 31065 38144 43525 27958 37131 63627 74574 56536 48450 49029
9697D9029M345o468o648J104p566J0549Q237J6489n638m638j077L208P661J72
$$ 49029 53374 46906 40258 41362 33796 44345 52582 69071 63433 58795 57718 60926 68587 68759
9683F8759j3748o822N641j6107j0134R586q471j380J0623P684l817j3188P418
$$ 68759 55011 48189 53830 37723 27589 37175 28704 27324 37947 45631 41814 28626 36044
9670C6044M715K751k876k366R30M195J9583n67j275p590M501J0417P3j1650j7947
$$ 36044 40759 43510 40634 38268 39198 43393 62976 62409 61134 53544 58045 68462 68535 56885 38938
9655C8938m327J3014J0437q022j63P933Q121j0916j3285j8743K500M072j1430
$$ 38938 34611 47625 58062 50040 49877 57810 65931 55015 41730 22987 25487 29559 18129
9642A8129m826J3013o54L366J4542P334l230L014J8903j415j3588P75p157p534
$$ 18129 13303 26316 25662 29028 43570 50904 47674 50688 69591 68176 54588 55363 48206 40672
9628D0672j0913l549K375J2788j4197O598L005p679L719j30O899o330N579K313
$$ 40672 29759 26210 28585 41373 27176 33774 36779 29100 32819 32689 39588 33258 38837 41150
9614D1150o407J7076j449q037J658l102j7958j0336J2124J2102p578r086p7P914
$$ 41150 34743 51819 50370 42333 43991 40889 22931 12595 24719 36821 29243 20157 20080 27994
9600B7994N697j267k44J6500K434n198j8538O697R217m297J841J1790j702p485
$$ 27994 33691 32424 32180 48680 51114 45916 27378 34075 43292 38995 40836 52626 50924 43439
9586D3439P06j0840j0402k760j0749J3015J9411l89q621j404p035l119Q475J3546
$$ 43439 44145 33305 22903 20143 9394 22409 41820 41431 32810 31406 24371 21252 29727 43273
9572D3273j331J280j0432p320K073j354J9492J621j7814K747J7786j485j9103
$$ 43273 41942 43222 32790 25470 27543 26189 45681 47302 29488 32235 50021 48536 29433
9559B9433j6441r810J0136K1626L293m725m701J1494n827K461J1118n153o008
$$ 29433 12992 3182 13318 34944 38237 33512 28811 40305 34478 36939 48057 42904 36896
9546C6896l390p285N889J0540j842k2622m52J6016j2025j1723J5042O830r190
$$ 36896 33506 26221 32110 42650 40808 18186 17734 33750 21725 10002 25044 31874 22684
9533B2684N612P841l177j780j4075L107p925J579J604J7930O665j960l143J404
$$ 22684 28296 36137 32960 31180 17105 20212 12287 13866 15470 33400 40065 38105 34962 36366
9519C6366N454n513n909q941p93r084k0932p839J0022O072Q490J3999P033j1110
$$ 36366 41820 36307 30398 21457 20664 11580 -9352 -17191 -7169 -1097 7393 21392 28425 17315
9505A7315j0661J8721O079j0179j2769M021J492J4463j425j2285p624q050L679
$$ 17315 6654 25375 31454 21275 8506 12527 14019 28482 27057 14772 7148 -902 2777
9492B777l589R352J5150Q379n630q795j839N235P353L931j5157J04J089J994O579
$$ 2777 -812 8540 23690 32069 26439 17644 15805 21040 28393 32324 17167 17271 18360 20354 26933
9477B6933K639Q129j735j2072l863m822p067P304N280p139j2713O149N870J9267
$$ 26933 29572 37701 35966 23894 20031 15209 8142 15446 20726 13587 874 7023 12893 32160
9463C2160R974o483q328P514r738q760R34l997R138Q237l995J153j825o08P81
$$ 32160 42134 35651 27323 34837 25099 16339 17273 13276 22414 30651 26656 27809 25984 25376 26157
9448B6157q680k749J5696R421K782j0621l564N991j1997L145Q728R526l005j4976
$$ 26157 17477 14728 30424 39845 42627 32006 28442 34433 22436 25581 34309 43835 40830 25854
9434B5854r135J016J1672O397p570Q498J4341o235k6764p092n171q373M149P591
$$ 25854 16719 17735 29407 35804 28234 36732 51073 44838 18074 10982 5811 -2562 1587 9178
9420I178o192m560P494J8914P66j3517q152j4212K251N517j943P48J4280J9048
$$ 9178 2986 -1574 5920 24834 25600 12083 3931 -10281 -8030 -2513 -4456 -3708 10572 29620
9406B9620N968n322J159O688j0258j7006p411q609M784Q573J7216K787J506j453
$$ 29620 35588 30266 31425 38113 27855 10849 3438 -5171 -387 8186 25402 28189 29695 28242
9392B8242n365m066K578m934j043J1321J1296J337j0666Q811j166k492J485p477
$$ 28242 22877 18811 21389 16455 15412 26733 38029 39366 28700 37511 36345 33853 35338 27861
9378B7861o967J056J1158K341N687J5478p226K434J692k3571L29j82k779o846
$$ 27861 20894 21950 33108 35449 41136 56614 49388 51822 53514 29943 30272 30090 27311 20465
9364B0465O018j846l584n973R668l398q938M956L60R620O704J0627j1855j004
$$ 20465 26483 24637 21053 15080 24748 21350 12412 17368 17728 27348 34052 44679 32824 31820
9350C1820N267n121l986q058j284M466J8306K240j8771n161R190k587j891j700
$$ 31820 37087 31966 27980 19922 18638 23104 41410 43650 24879 19718 28908 26321 24430 22730
9336B2730j331K274l216q817j2033j3988J0567K3524P268j6002o844J8360K634
$$ 22730 21399 23673 20457 11640 -393 -14381 -3814 19710 26978 10976 4132 22492 25126
9323B5126j8438k866J6746J6965m349K859N668q015j0960L448O373O742k567r370
$$ 25126 6688 3822 20568 37533 33184 36043 41711 33696 22736 26184 32557 39299 36732 27362
9309B7362p246p672n114n032j6748J0109o111P28R377k90L730Q05J2462J191o412
$$ 27362 20116 12444 7330 2298 -14450 -4341 -10452 -9724 -347 -637 3093 3898 16360 17551 11139
9294A1139j403r539M296O612L957J760M747N875k825K066J1697k325m337r117
$$ 11139 9736 197 4493 11105 15062 16822 21569 27444 24619 26685 38382 36057 31720 22603
9280B2603K18n102J1707L455Q762k998k446P081O311p682l960L156q121j1422
$$ 22603 22821 17719 29426 32881 41643 38645 36199 43280 49591 41909 37949 41105 32984 21562
9266B1562l053M63l774n958K0052R285k310o487q745N458K361K987L171O480J6169
$$ 21562 18509 18972 15198 9240 29292 38577 36267 29780 21035 26493 28854 31841 35012 41492 57661
9251E7661J4455m615J1163O54M392J665j3763j1130j3001K02r80O813J6734N23
$$ 57661 72116 67501 78664 79318 83710 85375 71612 60482 47481 47683 46703 53516 70250 70773
9237G0773N756k937m526j8454l200J0389r789o083j503k564K56P808j7084j3198
$$ 70773 76529 73592 69066 50612 47412 57801 48012 41929 40426 37862 38118 45926 28842 15644
9223A5644J0186M881m458j2956K746R960n574M055M131N094L038L16k0470j2262
$$ 15644 25830 30711 26253 13297 16043 26003 20429 24484 28615 33709 36747 37063 16593 4331
9209D331n920m022K745P005m432J0480K0890J054j0743J82m999O184j726o104
$$ 4331 -1589 -5611 -2866 4139 -293 10187 31077 32131 21388 21570 16571 22755 21029 14925
9195A4925J729l09K317p768m616R501P44k2745l32J2704J3815k074o945o818k716
$$ 14925 16654 16345 18662 10894 6278 15779 16523 -6222 -6554 6150 19965 17891 10946 4128 1412
9180A412k02L123o477L514R988Q997K506r544q140r939L099j5647P11N046L519
$$ 1412 1210 4333 -2144 1370 11358 20355 22861 13317 5177 -4762 -1663 -17310 -16599 -11553 -8034
9165h034J0048J7921Q728o892j328m524q132j99J0390q438M841l222O140N511
$$ -8034 2014 19935 28663 21771 20443 15919 7787 7588 17978 9540 14381 11159 17299 22810
9151B2810p003p776L597k545o778O463l933K1496j124o985j5244N973P834K498
$$ 22810 15807 8031 11628 9083 2305 8768 4835 26331 25207 18222 2978 8951 16785 19283
9137A9283M095J2267j842j56J0423P12k860n45N741j7K463J4512j292O23J3281
$$ 19283 23378 35645 33803 33647 44070 44782 41922 41377 47118 47101 49564 64076 62784 63407 76688
9122G6688J0104j3882r36J017k3636j2847N055P588J0044J8460m236P512K177
$$ 76688 86792 72910 71974 72991 49355 36508 41563 49151 59195 77655 73419 80931 83108
9109H3108P909p865k7891j4730J4487O180O276k60l657q525K235L057P656n447
$$ 83108 91017 83152 55261 40531 55018 61198 67474 67214 63557 55032 57267 60324 67980 62533
9095F2533m735j2104n141R625l180j1234n799m020N15j5024k3607j1156P616L794
$$ 62533 57798 45694 40553 50178 46998 35764 29965 25945 26460 11436 -12171 -23327 -15711 -11917
9081a1917J2726k803M32J1481J3924J712M602R290k583J742n615J81J418j3059
$$ -11917 809 -1994 -1562 9919 23843 25555 30157 39447 36864 38606 32991 33172 34590 21531
9067B1531j8578J910J9627P66o980j2886j0214L818P111N800O555J1139q888j0916
$$ 21531 2953 4863 24490 25256 18276 5390 -4824 -1006 6105 11905 18460 29599 20711 9795
9053I795j1092l870M040J0049J691m980m25j243l219J0314L527J0719R447M233
$$ 9795 -1297 -5167 -1127 8922 10613 5633 5208 3965 746 11060 14587 25306 34753 38986
9039C8986j5833j0467O250J596j952n617K730n919N960J3303N739K347N318o863
$$ 38986 23153 12686 18936 20532 18580 12963 15693 9774 15734 29037 34776 37123 42441 35578
9025C5578K6390J2228l643O63J3865O380j0557q518j2112j3648p52r345j8848
$$ 35578 61968 74196 70553 71216 85081 91461 80904 72386 60274 46626 45874 36529 17681
9012A7681j1637P40J3761J1549q770j7369K005J3980J6521r7n856r313L527J835
$$ 17681 6044 6784 20545 32094 23324 5955 7960 21940 38461 38364 32508 23195 26722 28557
8998B8557j7036j1118P000J693M315J0014J7204Q561J0478j735k3126l1211J69
$$ 28557 11521 403 7403 9096 13411 23425 40629 49190 59668 57933 34807 3596 3765
8985C765J3368L439J495N611L699j6891k216M855J4950l178p090r366J2319j0332
$$ 3765 17133 20572 22067 27678 31377 14486 12270 17125 32075 28897 21807 12441 24760 14428
8971A4428j475J1717j552j1099P035k093K954J4210o173j7532p470o710r171Q083
$$ 14428 12953 24670 23118 12019 19054 16961 19915 34125 27952 10420 2950 -3760 -12931 -4848
8957d848Q280j778o721j0864n555R687K427J9281J8662R002n689j4112J1434Q377
$$ -4848 3432 1654 -5067 -15931 -21486 -11799 -9372 9909 28571 37573 31884 17772 29206 37583
8943C7583j4311p596j167K188o162L847l71p433j247Q697m186j4574l311J0893
$$ 37583 23272 15676 14509 16697 10535 14382 14011 6578 5331 14028 9842 -4732 -8043 2850
8929B850K161K653J1804o081j0745P018j36N259O761R530O422M411Q687j3618
$$ 2850 5011 7664 19468 13387 2642 9660 9524 14783 21544 31074 37496 41907 50594 36976
8915C6976p902q672j1908j0315P768J7208o557R801J7154p182n929M721q731j34
$$ 36976 29074 20402 8494 -1821 5947 23155 16598 26399 43553 36371 30442 35163 26432 26298
8901B6298l570N034K69J1345J2358j6328M137J8638J811j4307m536n716j899j4033
$$ 26298 22728 27762 28031 39376 51734 35406 39543 58181 59992 45685 41149 35433 33534 19501
8887A9501N59P383M512l06j081m220N855O445k57Q328k0121j3035P350J2953J7208
$$ 19501 20060 27443 31955 31649 30568 26348 32203 38648 38391 46719 26598 13563 20913 33866 51074
8872E1074j0679j8012j3504K312J4500J1432n966j3043Q361J0460J4765j4107
$$ 51074 40395 22383 8879 11191 25691 37123 31157 18114 26475 36935 51700 37593
8860C7593k2616j9900J6735J2433l11n306K776j1356j7839O849J2760N417J035
$$ 37593 14977 -4923 11812 24245 23934 18628 21404 10048 -7791 -942 11818 17235 18270
8847A8270P001Q09r598n827J8616k786K40j386p984l743K614n070O242j903j2809
$$ 18270 25271 26080 16482 10655 29271 26485 26725 25339 17355 13612 16226 11156 17398 15495 2686
8832B686q125J985o603M050J2712k693j537K5733Q315n525RJ572p24k299o85q59
$$ 2686 -5439 -3454 -10057 -6007 6705 4012 2475 28208 36523 30998 31007 32579 31855 29556 28871 28012
8816B8012J8468o655l853Q855p917q196j6960j3523J5333J2589J01l650m614k312
$$ 28012 46480 39825 35972 44827 36910 28714 11754 -1769 13564 26153 26254 22604 17990 15678
8802A5678q37O186j489k3626k858J2212r682O54R205K197l6J450J1340P582M039
$$ 15678 14841 21027 19538 -4088 -6946 5266 -4416 -3762 5443 7640 7604 9054 20394 27976 32015
8787C2015N103o349k1885p118L12K544m042K2083K8936P91q852k1577k356r254
$$ 32015 37118 30769 8884 1766 2078 4622 580 22663 51599 52390 43538 21961 19605 10351
8773A0351q404j200M308J1610J4284R068j0874j488j804N783n114k1908k857Q883
$$ 10351 1947 747 5055 16665 30949 40017 29143 27655 25851 31634 26520 4612 1755 10638
8759A0638m9l205J638R817m72q380M901N894j1550o529j052q80j5224Q498Q824
$$ 10638 10589 7384 9022 18839 18367 9987 14888 20782 9232 2703 1651 771 -14453 -5955 2869
8744B869O764N798L252O19l009j8435R071M819q524M36j5234q689R422J2798J6623
$$ 2869 9633 15431 18683 19302 16293 -2142 6929 11748 3224 3660 -11574 -20263 -10841 1957 18580
8729A8580K299k16P188J1186N181Q018q933j7364j2453j459R159J169O392J2527
$$ 18580 20879 20663 27851 39037 44218 52236 43303 25939 13486 12027 21186 22355 28747 41274
8715D1274q199l1564J741J1423O785L932N766m685o63j9345P210K676K987J0530
$$ 41274 33075 1511 3252 14675 21460 25392 31158 26473 25810 6465 13675 16351 19338 29868
8701B9868n41p07R117J5167K800o548J9098J742k2833p91N011P449M404j6079
$$ 29868 29327 28620 37737 52904 55704 49156 68254 69996 47163 46372 51383 58832 63236 47157
8687D7157j2391L417R968l311R092j0705l205O483J5793k356n648O390j8022n383
$$ 47157 34766 38183 48151 44840 53932 43227 40022 46505 62298 59942 54294 60684 42662 37279
8673C7279J3262J6172N711j1933j6802r533J3871l976j074L082J1537M361n551
$$ 37279 50541 66713 72424 60491 43689 34156 48027 44051 42977 46059 57596 61957 56406
8660E6406K143M441j6359k3152l305M820l541k780L290J0046R823l267Q513J0560
$$ 56406 58549 62990 46631 23479 20174 24994 21453 18673 21963 32009 41832 38565 47078 57638
8646E7638M794m620n697m123N990J3810J2432K284j2599j6189J3266K0893O487
$$ 57638 62432 57812 52115 47992 53982 67792 80224 82508 69909 53720 66986 87879 94366
8633I4366o452M724P575L63K309K9368K4928L6138L6015K3907J290p589k8778
$$ 94366 87914 92638 100213 100576 102885 132253 157181 193319 229334 253241 254531 246942 218164
8620B18164l1198r200r420o970j5787r697j0067L000l904j2985o004J514Q141
$$ 218164 186966 177766 168346 161376 145589 135892 125825 128825 124921 111936 105932 107446 115587
8607A15587p826o937M165l167p399L393L304J379K1123O675j2193J2367L815j4859
$$ 115587 107761 100824 104989 101822 94423 97816 101120 102499 123622 130297 118104 130471 134286 119427
8593A19427O959R654L793L016J4053K9977L2657J7337K7491L0801J9147L6691
$$ 119427 126386 136040 139833 142849 156902 186879 219536 236873 264364 295165 314312 351003
8581C51003P9569J15576R2660K3541m8089o7169l5681l346q158j379J3234J8400
$$ 351003 430572 546148 638808 662349 614260 547091 511410 508064 499906 498527 511761 530161
8569E30161K2422K7733J8602J2969l2850o2984n6779m1501m0652m0967l7841l3877
$$ 530161 552583 580316 598918 611887 579037 516053 459274 417773 377121 336154 298313 264436
8557B64436k6363k0874q996k4221k3124o37r862J91k579K859j9199p850p369l831
$$ 264436 238073 217199 208203 183982 160858 160221 150359 150550 147971 150830 131631 123781 116412 112581
8543A12581J2834J0992o79j4495J604K1924K4180K4412L6617L3710M434k4239
$$ 112581 125415 136407 135728 121233 122837 144761 168941 193353 229970 263680 268114 243875
8531B43875l4002k2494k9119l0382l6086k4667K2805R782k1632r653N014J585
$$ 243875 209873 187379 158260 127878 91792 67125 89930 99712 78080 68427 73441 75026
8519G5026N787J8414p290j2777j9877M921R607K082q74M003j056M697P964J786
$$ 75026 80813 99227 91937 79160 59283 64204 73811 75893 75019 79022 77966 82663 90627 92413
8505I2413k0779r264J690O187R73J786p64q80K900j855m425j0959P0J6657Q921
$$ 92413 71634 62370 64060 70247 71220 73006 72242 71362 74262 72407 67982 57023 57093 73750 82671
8490H2671K674r521j9059j5429J450L293J2755J1735r255j1474J1639Q806q923
$$ 82671 85345 75824 56765 41336 42786 46079 58834 70569 61314 49840 61479 70285 61362
8477F1362j3279J8397J5775q731J513J4405k355j7766l205r741j4396j0387P803
$$ 61362 48083 66480 82255 73524 75037 89442 87087 69321 66116 56375 41979 31592 39395
8464C9395o063q076K860k943k111p219n655J4282N808m94n579L616J404r06R361
$$ 39395 33332 25256 28116 25173 23062 15843 10188 24470 30278 29784 24205 27821 29225 28319 37680
8449C7680R275N299j313N796n031j3146Q16p944q277q443R653J412j3087Q207
$$ 37680 46955 52254 50941 56737 51706 38560 39376 31432 23155 14712 24365 25777 12690 20897
8435B0897m512n015O478J529J1057J542j7638o935O305l29o451L956J0686n768
$$ 20897 16385 11370 17848 19377 30434 31976 14338 7403 13708 13379 6928 10884 21570 15802
8421A5802Q668J5354j2694J4522J0997m34j2491o628r633M448Q377p764P49K342
$$ 15802 24470 39824 27130 41652 52649 52215 39724 33096 23463 27911 36288 28524 29273 31615
8407C1615l013J550p597K703J1566M732J7783k498j2570L450k29j4011j1168P245
$$ 31615 28602 30152 22555 25258 36824 41556 59339 56841 44271 47721 47492 33481 22313 29558
8393B9558L486r954K895P122j5519M02j553K788J3614p519p145J5780Q756K242
$$ 29558 33044 23090 25985 33107 17588 17990 16437 19225 32839 25320 18175 33955 42711 44953
8379D4953j0586P445n327L702j5483k8574j0355M373J5734R762L000r281o101
$$ 44953 34367 41812 36485 40187 24704 -3870 -14225 -9852 5882 15644 18644 9363 3262
8366C262n520M653N357L839l522M866K283p15l773J1182J0826n780j9698j321
$$ 3262 -2258 2395 7752 11591 8069 12935 15218 14503 10730 21912 32738 26958 7260 5939
8352E939J3483n727j1921k23j16k522l17K073N709l015M786J5220m32j965j335
$$ 5939 19422 13695 1774 1551 1435 -1087 -1404 669 6378 3363 8149 23369 22937 20972 19637
8337A9637K316k517J7768n56j2741p912j2689O565P726L310K689P267J4808r165
$$ 19637 21953 19436 37204 36648 23907 15995 3306 9871 17597 20907 23596 30863 45671 36506
8323C6506j2947O33K06m582m390K631J1917P544o385j7289j2932J1322j106O546
$$ 36506 23559 24192 24398 19816 15426 18057 29974 37518 31133 13844 912 12234 11128 17674
8309A7674O418o867M951J5488m121q112m147m744R993Q11K155k112J5611o819
$$ 17674 24092 17225 22176 37664 33543 25431 21284 16540 26533 27344 29499 27387 42998 36179
8295C6179n974k885j0574J3084P052N60j1459o767r679Q118j027L834M776j209
$$ 36179 30205 27320 16746 29830 36882 37442 25983 19216 9537 17655 16628 20462 25238 24029
8281B4029n661m296q171M546J4358M428p789r993l152L907r105o058J922R190
$$ 24029 18368 14072 5901 10447 24805 29233 21444 11451 8299 12206 3101 -2957 -1035 8155
8267H155M856J5048o75k159q448j0899l447J1526N292R61R42n1m504q897J604
$$ 8155 13011 28059 27384 25225 16777 5878 2431 13957 19249 20210 21152 21101 16597 7700 9304
8252I304L503l050m410q642Q945k936Q929L631n728j7522j3184j564m44J4674
$$ 9304 12807 9757 5347 -3295 5650 2714 11643 15274 9546 -7976 -21160 -22724 -23168 -8494
8238h494J407j276p509L213L025Q333n158j618r35n026j840m351N177n107P834
$$ -8494 -7087 -8363 -15872 -12659 -9634 -1301 -6459 -8077 -9012 -14038 -15878 -20229 -15052 -20159 -12325
8223a2325m70j282Q574J4272R120P157L82o521N758j547j1087j6142j1148k587
$$ -12325 -12795 -14077 -5503 8769 17889 25046 25428 18907 24665 23118 12031 -4111 -15259 -17846
8209a7846Q574R963J255J0633J5508N809j6661q839j3925Q705J5292K401k119
$$ -17846 -9272 691 1946 12579 28087 33896 17235 8396 -5529 3176 18468 20869 18750
8196A8750L677J1995l075o656o051J1775l758q100l873l413k959k143O18n800
$$ 18750 22427 34422 31347 24691 18640 30415 26657 18557 14684 11271 8312 6169 6787 987
8182I87O423N30M836j4221O763q342R701Q509k27P072q030p385j0857J343n77
$$ 987 7410 7940 12776 -1445 5318 -3024 6677 15186 14959 22031 14001 6616 -4241 -2898 -3475
8167c475p72K6867J9666q839o375n402p69r473j2959L532J3438K337j1845l535
$$ -3475 -4247 22620 42286 33447 27072 21670 20901 11428 -1531 2001 15439 17776 5931 2396
8153B396j4622N462o903m66n413l078P483J4039Q265Q41L594K651Q346L732r718
$$ 2396 -12226 -6764 -13667 -14133 -19546 -22624 -15141 -1102 7163 8004 11598 14249 22595 26327 16609
8138A6609j0506j2856L163m913J7859J751j0100m317R141J0198p299J090J4422
$$ 16609 6103 -6753 -3590 -8503 9356 11107 1007 -3310 5831 16029 8730 9820 24242
8125B4242r310n457k939M056j970N784K913n890j8789j9132P162N11R200K4639
$$ 24242 14932 9475 6536 10592 8622 14406 17319 11429 -7360 -26492 -19330 -18819 -9619 15020
8111A5020R774M711m383n832L026J168k263l6p941j2612K784P199P928l387r795
$$ 15020 24794 29505 25122 19290 22316 23484 21221 21185 13244 632 3416 10615 18543 15156 5361
8096E361Q675P71q415o15k286J832o950R678J0694r47o694o027O07q201n13q368
$$ 5361 14036 14807 6392 5777 3491 5323 -1627 8051 18745 17798 11104 5077 5684 -2517 -3030 -11398
8080a1398N388J8439O643J7272J727j2562j0815k068J6093J0300L993p934j7971
$$ -11398 -6010 12429 19072 36344 38071 25509 14694 12626 28719 39019 43012 35078 17107
8067A7107p812o308r395o008j736J0124J3526k214j0375N887N902p526j25L038
$$ 17107 9295 2987 -6408 -12416 -14152 -4028 9498 7284 -3091 2796 8698 1172 1047 4085
8053D085n280P36n787j967O741k385O944J2763J600M280k375n202J2551J4399
$$ 4085 -1195 -459 -6246 -8213 -1472 -3857 3087 15850 17450 21730 19355 14153 26704 41103
8039D1103K403r70n793n119j2666R351l174Q417L873J574J1505m593l831J3303
$$ 41103 43506 42536 36743 31624 18958 28309 25135 33552 37425 38999 50504 45911 42080 55383
8025E5383N693p315o327m982K254k427R98j4490O773Q882J0059r655n907J6498
$$ 55383 61076 53761 47434 42452 44706 42279 43277 28787 35560 44442 54501 44846 38939 55437
8011E5437j026R275k481j949k943q169N545n425q431J0640J1097m74J079J89l535
$$ 55437 54411 63686 61205 59256 56313 48144 53689 48264 39833 50473 61570 61096 62175 62364 58829
7996E8829m855k528o45O399K378j040J6665N648O067j664J080N920p512J378k954
$$ 58829 53974 51446 50801 57200 59578 58538 75203 80851 86918 85254 86334 92254 84742 86120 83166
7981H3166j0282q32r87J1274J6427j2398K162R250j0723j0426O083J7039P430
$$ 83166 72884 72052 71065 82339 98766 86368 88530 97780 87057 76631 82714 99753 107183
7968A07183j5695j9813j6402J6554N074j2874j3621j6034P257J3996r416O422
$$ 107183 91488 71675 55273 71827 76901 64027 50406 34372 41629 55625 46209 52631
7956E2631M954j3993L729J6723J0581R809o022j8722l564j077J593L131m441j0331
$$ 52631 57585 43592 47321 64044 74625 84434 78412 59690 56126 55049 56642 59773 55332 45001
7942D5001l345m52J3365R394K184n074Q826K998P182J0598j378k554p548O390
$$ 45001 41656 41204 54569 63963 66147 61073 69899 72897 80079 90677 89299 86745 79197 85587
7928H5587n722p501J615q997J343K892k662P321o981j1848l450q41K944j0350
$$ 85587 79865 72364 73979 64982 66325 69217 66555 73876 66895 55047 51597 50756 53700 43350
7914D3350o252n181J0044M003j5370L245J3370J4703r508R86j3709k0097o258
$$ 43350 37098 31917 41961 45964 30594 33839 47209 61912 52404 53390 39681 19584 13326
7901A3326Q257M872J0419J0041N044n256O596M920p162j4870o745J7098o171p353
$$ 13326 21583 26455 36874 46915 51959 46703 53299 58219 51057 36187 29442 46540 40369 33016
7887C3016J0569M604j7871o432J0212O473j3713o619l755M376j4819r009K4568
$$ 33016 43585 48189 30318 23886 34098 40571 26858 20239 16484 20860 6041 -2968 21600
7874B1600K221o58o858L751q176k209J8100J5495O886j1984r32l569k1682j3531
$$ 21600 23821 23163 16305 20056 11880 9671 27771 43266 50152 38168 37236 33667 11985 -1546
7860a546J0436O61J0052R17M341P638N28k759j0489K879n671O054k977P734q171
$$ -1546 8890 9551 19603 20520 24861 32499 33027 30268 19779 22658 16987 23041 20064 27798 19627
7845A9627j6822n482J599J2776J0652L662m742l359K030o052k0512p680J4673
$$ 19627 2805 -2677 -1078 11698 22350 26012 21270 17911 19941 13889 -6623 -14303 370
7832C70P337m859k841J0068n089q466K922K837K0621Q20p750k2704j3956l799
$$ 370 7707 2848 7 10075 4986 -3480 -558 2279 22900 23720 15970 -6734 -20690 -24489
7818b4489J499J1874Q666Q583R398j741O89P506J855M21m708n788L339r935j3866
$$ -24489 -22990 -11116 -2450 6133 15531 13790 14479 21985 23840 24261 19553 13765 17104 7169 -6697
7803f697L598K1119J1365j2554j9132j3791K420j023L578k645J5925K251Q108
$$ -6697 -3099 18020 29385 16831 -2301 -16092 -13672 -14695 -11117 -13762 2163 4414 12522
7790A2522m880p121L916j6308K986Q389J326R450p207q362R56K6887M174n14n439
$$ 12522 7642 521 4437 -11871 -8885 -496 830 10280 3073 -5289 -4333 22554 26728 26214 20775
7775B0775j0891o481N387J0196o718p708j6268m024m454P774P888j355J274J4791
$$ 20775 9884 3403 8790 18986 12268 4560 -11708 -15732 -20186 -12412 -4524 -5879 -4605 10186
7761A0186M670K175j628j9712j5835O7N700J17J8147K475Q430l122o838N911K744
$$ 10186 14856 17031 15403 -4309 -20144 -20077 -14377 -14260 3887 6362 14792 11670 4832 10743 13487
7746A3487Q974L268N577J699r343j4780j1755J1812J175m859l942q764J2252J0244
$$ 13487 22461 25729 31306 33005 23662 8882 -2873 8939 10114 5255 1313 -7451 4801 15045
7732A5045k419k0979j5169K558J1572J901j0657J101P538N847P380J1271K519
$$ 15045 12626 -8353 -23522 -20964 -9392 -7491 -18148 -17047 -9509 -3662 3718 14989 17508
7719A7508p40Q237O156O728o429l901j140j9909n904K4261j030j1463q100K666
$$ 17508 16768 25005 31161 37889 31460 27559 26419 6510 606 24867 23837 12374 4274 6940
7705F940r659n825j07R881M237j803k797k837J6140o116k094k059K071j2876j1257
$$ 6940 -2719 -8544 -8651 1230 5467 3664 867 -1970 14170 8054 5960 3901 5972 -6904 -18161
7690a8161M399J7696P118M908k872j3316m181k294j109R999P563j0719l338j6790
$$ -18161 -13762 3934 11052 15960 13088 -228 -4409 -6703 -7812 2187 9750 -969 -4307 -21097
7676b1097r360N340p17J9487N072o04J0n35q933J1928o371N131O485j4769j6688
$$ -21097 -30457 -25117 -25834 -6347 -1275 -1879 -1869 -2404 -11337 591 -5780 -649 5836 -8933 -25621
7661b5621K541J4832m280l490Q477k002O12J3163J4516n810j7850l654q204r126
$$ -25621 -23080 -8248 -12528 -16018 -7541 -9543 -8931 4232 18748 12938 -4912 -8566 -16770 -25896
7647b5896K751N235J3309J0554J1315j6011j679J8649j1522q903M260o485L438
$$ -25896 -23145 -17910 -4601 5953 17268 1257 -422 18227 6705 -2198 2062 -4423 -985
7634i85n36K633k709l405m644J1662o856M087N978J550m381p868J8590J0635o824
$$ -985 -1521 1112 -1597 -5002 -9646 2016 -4840 -753 5225 6775 2394 -5474 13116 23751 16927
7619A6927O605j164j6173N982n448q152k30P008J2366J4151p995q28o721j5155
$$ 16927 23532 22368 6195 12177 6729 -1423 -1653 5355 17721 31872 23877 23049 16328 1173
7605A173q765J5190j5312m208O47L294N786J7060O966r807L615r356o267n183
$$ 1173 -7592 7598 -7714 -11922 -11275 -7981 -2195 14865 21831 12024 15639 6283 16 -5167
7591e167K339Q059R397Q94L122j430k0207m333J4099J1138q596k327j685l501
$$ -5167 -2828 5231 14628 15522 18644 17214 -2993 -7326 6773 17911 9315 6988 5303 1802
7577A802j1874k32Q909O583o360o256J1947J2383O966j0141p491N31j2865K464
$$ 1802 -10072 -10304 -1395 5188 -1172 -7428 4519 16902 23868 13727 6236 6767 -6098 -3634
7563c634M517L084J0469j783l193n280N582k349M006K709p304P638q239n382P721
$$ -3634 883 3967 14436 12653 9460 4180 9762 7413 11419 14128 6824 14462 6223 841 8562
7548H562p940q807J0054N941M80k074P97r565j2317j1077m638J1257p367j3316
$$ 8562 622 -8185 1869 7810 8290 6216 7013 -2552 -14869 -25946 -30584 -19327 -26694 -40010
7534d0010l40J1858J58O46N833M601J0536K883o015j8132M040J6443L717k480
$$ -40010 -40350 -28492 -28334 -27688 -21855 -17254 -6718 -3835 -9850 -27982 -23942 -7499 -3782 -6262
7520f262k387M922J654n733l442K888o14J741k17q226J2907J3007Q365k762o809
$$ -6262 -8649 -3727 -2073 -7806 -11248 -8360 -8974 -7233 -7450 -15676 -2769 10238 18603 15841 9032
7505I032J967k22j9256M724j0309j1200k800J3654N137O368J1085r389n100m882
$$ 9032 10999 10777 -8479 -3755 -14064 -25264 -28064 -14410 -9273 -2905 8180 -1209 -6309 -11191
7491a1191O181Q479j0911o371R121J6229j490p182j5036o132q485j533K019r184
$$ -11191 -5010 3469 -7442 -13813 -4692 11537 10047 2865 -12171 -18303 -26788 -28321 -26302 -35486
7477c5486J3209J5472j531N179J4422J1356j1735j1454j1087M675J8176J99k1888
$$ -35486 -22277 -6805 -8336 -3157 11265 22621 10886 -568 -11655 -6980 11196 11395 -10493
7464a0493J39J3557r579r78J381p900L221K206m522O385K0591J3854O748j5060
$$ -10493 -10354 3203 -6376 -7354 -5973 -13873 -10652 -8446 -12968 -6583 14008 27862 34610 19550
7450A9550l8055j8441j73Q789k263m587J7805K7235R845j5521j0708P056K762
$$ 19550 -18505 -36946 -37119 -28330 -30593 -35180 -17375 9860 19705 4184 -6524 532 3294
7437C294J64m092J4438p163j6951n783Q806k20o608l351k561M491N647R763K581
$$ 3294 3458 -634 13804 6641 -10310 -16093 -7287 -7507 -14115 -17466 -20027 -15536 -9889 -126 2455
7422B455n782k132R198j6000j0049L323J4712K12J3850J318j9096N85J106M65
$$ 2455 -3327 -5459 3739 -12261 -22310 -18987 -4275 -4063 9787 11105 -7991 -7406 -6300 -5835
7408e835k034q062J887O621J1918J155Q358N131q694n197n482j2459p846P509
$$ -5835 -7869 -15931 -14044 -7423 4495 5650 14008 19139 10445 5248 -234 -12693 -20539 -13030
7394a3030p703j9760l051J0819J5413Q671k577l508M771R207J711r068O06l17
$$ -13030 -20733 -40493 -43544 -32725 -17312 -8641 -11218 -14726 -9955 -748 963 -8105 -7499 -7816
7380g816j5485r253K995K834J2641J0952M865l609j2014j865J3182J5082P529
$$ -7816 -23301 -32554 -29559 -26725 -14084 -3132 1733 -1876 -13890 -15755 -2573 12509 20038
7367B0038n350m919Q058K387N398j7664j3860j3796q04R085n294J457R801J0351
$$ 20038 14688 9769 17827 20214 25612 7948 -5912 -19708 -20512 -11427 -16721 -15264 -5463 4888
7353D888k154q155j0605j599J661J3353K538j2535o561o146q993j3361N68n800
$$ 4888 2734 -5421 -16026 -17625 -15964 -2611 -73 -12608 -19169 -25315 -34308 -47669 -47101 -52901
7339e2901J3422K086J4529M176J4708J7669j714J947K052j4723j7602j0013j531
$$ -52901 -39479 -37393 -22864 -18688 -3980 13689 11975 13922 15974 1251 -16351 -26364 -27895
7326b7895L539m247N452L40j2209o215J5522M521j1109k005J2259J382M862J3577
$$ -27895 -24356 -28603 -23151 -22811 -35020 -41235 -25713 -21192 -32301 -34306 -22047 -20665 -15803 -2226
7312b226k876M773P964j9328J9191K534n582r719m717N910j648j1668j0485K2415
$$ -2226 -5102 -329 7635 -11693 7498 10032 4450 -5269 -9986 -4076 -5724 -17392 -27877 -5462
7298e462o755j035Q168P866j5447j8841N106J0495o877m850L681L092L988k753
$$ -5462 -12217 -13252 -5084 2782 -12665 -31506 -26400 -15905 -22782 -27632 -23951 -20859 -16871 -19624
7284a9624K984p676r677Q671l678J0275J3028j3582r037j423J0327R659m166R309
$$ -19624 -16640 -24316 -33993 -25322 -29000 -18725 -5697 -19279 -28316 -29739 -19412 -9753 -13919 -4610
7270d610N617l864r7R221K887o082n232P013Q787R251o69j4625L710K903q230
$$ -4610 1007 -2857 -2954 6267 9154 3072 -2160 4853 13640 22891 22222 7597 11307 14210 5980
7255E980j0256J808o274n710N54J998R446n89k885R84m860N098L424j1490p277
$$ 5980 -4276 -2468 -8742 -14452 -13898 -11900 -2454 -3043 -5928 -4944 -9804 -4706 -1282 -12772 -20049
7240b0049k630P132k134P495r029m803J1662R538k757j6919J3761J0927M394J001
$$ -20049 -22679 -15547 -17681 -10186 -19215 -24018 -12356 -2818 -5575 -22494 -8733 2194 6588 7589
7226G589j0078j340j765R762q713j7962j5520j332L641P159k580k387k204N558
$$ 7589 -2489 -3829 -5594 4168 -4545 -22507 -38027 -39359 -35718 -28559 -31139 -33526 -35730 -30172
7212c0172N219q12J7818J4926J1086o087k738j0666J114J3157k473j1327q040
$$ -30172 -24953 -25765 -7947 6979 18065 11978 9240 -1426 -312 12845 10372 -955 -8995
7199h995k683r87R034J1210M674q222K780M58Q922k3082k503O866J4560j3923
$$ -8995 -11678 -12665 -3631 7579 12253 4031 6811 7269 16191 -6891 -9394 -2528 12032 -1891
7185a891n347o274P040m336j4915Q892J705l207N937k566j7265J751O584P646
$$ -1891 -7238 -13512 -6472 -10808 -25723 -16831 -15126 -18333 -12396 -14962 -32227 -30476 -23892 -16246
7171a6246O849J5106m832j704j88k1959j4887K399J1085M892J0384Q621L004r960
$$ -16246 -9397 5709 877 -827 -1015 -22974 -37861 -35462 -24377 -19485 -9101 -480 2524 -7436
7157g436p784J1063J4384o43j0031k318L007j520L345j5200q246M531j866j517
$$ -7436 -15220 -4157 10227 9584 -447 -2765 242 -1278 2067 -13133 -21379 -16848 -18714 -20231
7143b0231J1124K0565M478j7720m989M469K541m722j3640L88R750p311p517l082
$$ -20231 -9107 11458 15936 -1784 -6773 -2304 237 -4485 -18125 -17737 -7987 -15298 -22815 -25897
7129b5897J1744K8155J801l992n607q067M958J709j8426n063J683K169J0132k748
$$ -25897 -14153 14002 15803 11811 6204 -1863 3095 4804 -13622 -18685 -17002 -14833 -4701 -7449
7115g449J1880O067O14j992j0907k378M537o742j764L923N631j573J616R412P144
$$ -7449 4431 10498 11112 9120 -1787 -4165 372 -6370 -8134 -4211 1420 -153 1463 10875 18019
7100A8019n321k1106J368J0970p972n442p79j5237r202R964P624J0785L406o915
$$ 18019 12698 -8408 -7040 3930 -4042 -9484 -10263 -25500 -34702 -24738 -17114 -6329 -2923 -9838
7086i838m07R704J4009o388m258R927Q742L395K261Q857J5318j1150j1325k43
$$ -9838 -10245 -541 13468 7080 2822 12749 21491 24886 27147 36004 51322 40172 28847 28604
7072B8604J3510Q896L872j7903j4818q513n588J6391q229l223J2316J621j0017
$$ 28604 42114 51010 54882 36979 22161 13648 8060 24451 16222 12999 25315 26936 16919
7059A6919j1261j9658N312K521q776J1414K1677P067M272k239n613j0371p030
$$ 16919 5658 -14000 -8688 -6167 -14943 -3529 18148 25215 29487 27248 21635 11264 4234
7046D234N812k2513j4184J0989J8415M088m310j794j1605j14R169K1274J0438
$$ 4234 10046 -12467 -26651 -15662 2753 6841 2531 737 -10868 -10982 -1813 19461 29899
7033B9899n902M67L084M743k741j1505j3468P284R684j0338k1603k30o877J1427
$$ 29899 23997 24464 27548 32291 29550 18045 4577 11861 21545 11207 -10396 -10626 -17503 -6076
7019f076l890q104J2408k746r051j5040m400K4128L527p057N691k744p73J3113
$$ -6076 -9966 -18070 -5662 -8408 -17459 -32499 -36899 -12771 -9244 -16301 -10610 -13354 -14127 -1014
7005a014J0080p322Q439r286l750R173J755R522o190m841M502k830O75l371l168
$$ -1014 9066 1744 10183 897 -2853 6320 8075 17597 11407 6566 11068 8238 8913 5542 2374
6990B374N435L414l879k036q808J0421k737j1483M430j0659j1058n784L74N156
$$ 2374 7809 11223 7344 5308 -3500 6921 4184 -7299 -2869 -13528 -24586 -30370 -29996 -24840
6976b4840K998l335L614P988J5360L576m173J798j2561k4101N542J4973J4244
$$ -24840 -21842 -25177 -21563 -13575 1785 5361 1188 2986 -9575 -33676 -28134 -13161 1083
6963A083j6370j8812J5367J8101R186n87o069k54l70l440k873K873N149P982Q199
$$ 1083 -15287 -34099 -18732 -631 8555 7968 1899 1645 1275 -2165 -5038 -2165 2984 10966 19165
6948A9165j802q518r527m012j2671j0989J2240K095j440m22j361K47j3126Q953
$$ 19165 17363 8845 -682 -4694 -17365 -28354 -16114 -14019 -15459 -15881 -17242 -16995 -30121 -21168
6934b1168n80J969k194O785O77L544J1551k562j078L457N12j0575p510J2909J2592
$$ -21168 -21748 -19779 -21973 -15188 -14511 -10967 584 -1978 -3056 401 913 -9662 -17172 -4263 8329
6919H329J0793K642j1596p631j5664m308J6571o872m007M669p30k828O56j2362
$$ 8329 19122 21764 10168 2537 -13127 -17435 -864 -7736 -11743 -7074 -7804 -10632 -9976 -22338
6905b2338m781N58K0192Q389j153K2666j3486k3876o596J0143K769l878j155O049
$$ -22338 -27119 -26561 -6369 2020 867 23533 10047 -13829 -20425 -10282 -7513 -11391 -12546 -6497
6891f497J725k083j1660r42K413K3509M529m841n305P773M177m212M797j2438
$$ -6497 -4772 -6855 -18515 -19457 -17044 6465 10994 6153 848 8621 12798 8586 13383 945
6877I45n414J025P375J34M103l785n816r44n724q709n75J0138N475o17K840R765
$$ 945 -4469 -3444 3931 4065 8168 4383 -1433 -2377 -8101 -16810 -17385 -7247 -1772 -2389 451 10216
6861A0216L745j607j2038j6278L485l937R283P638m096J4990K419n401r812K376
$$ 10216 13961 12354 316 -15962 -12477 -16414 -7131 507 -3589 11401 13820 8419 -1393 983
6847I83j0530j2123n062L096Q217O875o774R162N943j3821j850J5880k647K740
$$ 983 -9547 -21670 -26732 -23636 -15419 -8544 -15318 -6156 -213 -14034 -15884 -4 -2651 89
6833H9p435o909M965Q180J8490k140J540L935j792j195j2198p371o903L517K0546
$$ 89 -7346 -14255 -9290 -1110 17380 15240 16780 20715 18923 17728 5530 -1841 -8744 -5227 15319
6818A5319J1028J181K264N140o249p990J3880k224k056m289l009j7023j0317r465
$$ 15319 26347 27528 29792 34932 28683 20693 34573 32349 30293 26004 22995 5972 -4345 -13810
6804a3810L39O263P283j2060r64O730O607J707j1555j620l476J2711J4329l951
$$ -13810 -13471 -7208 75 -11985 -12949 -6219 388 2095 -9460 -11080 -14556 -1845 12484 8533
6790H533k923j4685N537J1708K215j4582k228r256n197J1534O617J392J850q800
$$ 8533 5610 -9075 -3538 8170 10385 -4197 -6425 -15681 -20878 -9344 -2727 -1335 515 -8285
6776h285K780J4292j0171r087L907J7248J7581K066j8043n699R610r604n947J3337
$$ -8285 -5505 8787 -1384 -10471 -6564 10684 28265 30331 12288 6589 16199 6595 648 13985
6762A3985K4198J1234k610k291j9065r459P106J9246n404j0173o129J8527J7033
$$ 13985 38183 49417 46807 44516 25451 15992 23098 42344 36940 26767 20638 39165 56198
6749E6198P442L453m782o130L167Q490j3567j5278J559N443J4810K5180K0656
$$ 56198 63640 67093 62311 56181 59348 67838 54271 38993 40552 45995 60805 85985 106641
6736A06641J2966J6231p58J2018R178L612J0523K1172J7345L4650P0563J09770
$$ 106641 119607 135838 135080 147098 156276 159888 170411 191583 208928 243578 314141 423911
6724D23911R5128O2546L2232l0957o7231n1058k8657k5154L785L1573L7425N6406
$$ 423911 519039 581585 613817 582860 515629 464571 435914 410760 414545 446118 483543 539949
6712E39949Q0256Q6693J20654J54496K08997K95175M04719O10579Q85411J281613
$$ 539949 620205 706898 827552 982048 1191045 1486220 1890939 2501518 3386929 4668542
6702D668542J841771K346174K164890Q40752r00813k104251k249342j741351j284113
$$ 4668542 6510313 8856487 11021377 11862129 10961316 8857065 6607723 4866372 3582259
6693C582259q99499o20162m40049l17218k35374j70571j38034j15633p8891o0300
$$ 3582259 2682760 2062598 1622549 1305331 1069957 899386 761352 645719 566828 506528
6683E06528n0880k3626k0892j7995P72K5208L5725J4474k1593n2386o1589n3025
$$ 506528 455648 432022 411130 393135 393907 419115 454840 469314 447721 395335 333746 280721
6671B80721o0379l6843l6230l1158M279J2695K623r414j0264J7522J3727J1051
$$ 280721 220342 183499 147269 116111 120390 133085 135708 126294 116030 133552 147279 158330
6659A58330r42k2349k2716k2828j4472J249m063j6709j5411N600K518Q831n975
$$ 158330 157388 135039 112323 89495 75023 76272 72209 55500 40089 45689 48207 57038 51063
6646E1063L174p412n510o582L439N521j3832L7K542j3638J1087R475j3673j898
$$ 51063 54237 46825 41315 34733 38172 43693 29861 29898 32440 18802 29889 39364 25691 23793
6632B3793k505m437J0388j879P866Q036r633j89R181J7096p600n680n369M176
$$ 23793 21288 16851 27239 25360 33226 41262 31629 31440 40621 57717 50117 44437 39068 43244
6618D3244J153j2560o146K702k168o343j2223q357P907J1508o228M520J978o306
$$ 43244 44397 31837 25691 28393 26225 19882 7659 -698 7209 18717 12489 17009 18987 12681
6604A2681L781L171m927o736o2k027q55j2299l575K0683j755M0n6r844M903q671
$$ 12681 16462 19633 14706 7970 7908 5881 5026 -7273 -10848 9835 8080 8120 8064 -1780 3123 -5548
6588e548J051K691M480o347J7111J4366P157q163j3965j2131o119J2473J5930
$$ -5548 -4497 -1806 2674 -3673 13438 27804 34961 26798 12833 702 -5417 7056 22986
6575B2986J543j6019k219M337j2594L005P803j148j3928P367P329j068o207l036
$$ 22986 24529 8510 6291 10628 -1966 1039 8842 7694 -6234 1133 8462 7394 1187 -1849
6561a849m785L4J378O129j517L84j2363p500j46o258R089O957K792L039J0914
$$ -1849 -6634 -6600 -5222 907 -610 -226 -12589 -20089 -20235 -26493 -17404 -10447 -7655 -4616 6298
6546F298j117P475J0313j7248p032m375J1872L176N246j1028n844o440K336K0907
$$ 6298 5181 12656 22969 5721 -1311 -5686 6186 9362 14608 3580 -2264 -8704 -6368 14539
6532A4539q736m808o257J333J8538Q618p688j6165p403M507Q01j3186J911M973
$$ 14539 5803 995 -5262 -3929 14609 23227 15539 -626 -8029 -3522 -2721 -15907 -13996 -9023
6518i023l211J5762M37j1068n191J809R497P827P35l457p0j2700J774j5036q744
$$ -9023 -12234 3528 3965 -7103 -12294 -10485 -988 6839 7574 4117 4047 -8653 -6879 -21915 -30659
6503c0659n718J6966J6193o810j920j1737j341R445P744m981K661J926J0618N077
$$ -30659 -36377 -19411 -3218 -10028 -11948 -23685 -25026 -15581 -7837 -12818 -10157 -8231 2387 7464
6489G464O098O310r677m594p096j4838l272q614J9075O101N322J3000n655k1694
$$ 7464 13562 19872 10195 5601 -1495 -16333 -19605 -28219 -9144 -3043 2279 15279 9624 -12070
6475a2070J019O722N288l978r401q042J0049j15k075j751j5894J9642J0629L208
$$ -12070 -11051 -4329 959 -3019 -12420 -20462 -10413 -10528 -12603 -14354 -30248 -10606 23 3231
6461C231k330P721k366j035r472m379J7616K272k3676q720L56k242P177M888J219
$$ 3231 901 8622 6256 5221 -4251 -8630 8986 11258 -12418 -21138 -20782 -23024 -15847 -10959 -9740
6446i740N793J465Q699j7608q852L997K2869R842n120K014M23j6434j002k884
$$ -9740 -3947 -2482 6217 -11391 -20243 -16246 6623 16465 11345 13359 13782 -2652 -3654 -6538
6432f538l215P71J2748J591k81M616j112l069K331j081j3023o090M927P246n093
$$ -6538 -9753 -8982 3766 5357 5076 9692 8580 5511 7842 6761 -6262 -12352 -7425 -179 -5272
6417e272K837j369l006P362K3630k229o669j7387j2772j1519R541j4159l825L838
$$ -5272 -2435 -3804 -6810 552 24182 21953 15284 -2103 -14875 -26394 -16853 -31012 -34837 -30999
6403c0999J0997r188m186K1361J7386m044N168n868j3397l697N290P530J2285
$$ -30999 -20002 -29190 -33376 -12015 5371 1327 6495 627 -12770 -16467 -11177 -3647 8638
6390H638K20q902m73K89K2117j178j4733o846j66j1104k573N039J5052K1955j5401
$$ 8638 8858 -44 -517 -228 21889 20711 5978 -868 -1034 -12138 -14711 -9672 5380 27335 11934
6375A1934k1102O345J2609r573k4982J299J6701J7407n805j8276j1504n687j4908
$$ 11934 -9168 -2823 9786 213 -24769 -23470 -6769 10638 4833 -13443 -24947 -30634 -45542
6362d5542O272J1377J9778J9055j0550j7437N14L266P420J4343K2778m973j9767
$$ -45542 -39270 -27893 -8115 10940 390 -17047 -16533 -13267 -5847 8496 31274 26301 6534
6349F534q667L987j2085o234O728L955M735K22p98J2309O188Q363k028r341j2032
$$ 6534 -2133 1854 -10231 -16465 -9737 -5782 -1047 -825 -1623 10686 16874 25237 23209 13868 1836
6334A836j0686N7n80J5227J5991q596Q609J3035N46j805m592M931L073p684o838
$$ 1836 -8850 -8793 -9373 5854 21845 13249 21858 34893 35439 33634 29042 33973 37046 29362 22524
6319B2524p562L029j4804o857J901K0910M706k778n540l073n027k4436r274K1630
$$ 22524 14962 17991 3187 -3670 -1769 19141 23847 21069 15529 12456 7429 -17007 -26281 -4651
6305d651P157O371l333k2920j0757M762J1198N503m238J891Q893K738l95j976
$$ -4651 2506 8877 5544 -17376 -28133 -23371 -12173 -6670 -10908 -9017 -124 2614 2219 243
6291B43J146J1262j769O187J5445Q840o905j4692l0885j707J6918J2198j6124
$$ 243 1389 12651 10882 17069 32514 41354 34449 19757 -11128 -12835 4083 16281 157
6278A57m544q344j658P737K853j898j8049J4105R150j0901r142m728J0125J4081
$$ 157 -4387 -12731 -14389 -6652 -3799 -5697 -23746 -9641 -491 -11392 -20534 -25262 -15137 -1056
6264a056P694L898q06L827j3828r034n463L970N602M07L252P765J0006N041j4929
$$ -1056 6638 10536 9730 13557 -271 -9305 -14768 -10798 -5196 -4789 -1537 6228 16234 21275 6346
6249F346o315L169R393J931l978r856J301l942r885q274O395J4652Q554J776l992
$$ 6346 31 3200 12593 14524 10546 690 1991 -1951 -11836 -20110 -13715 937 9491 11267 7275
6234G275k2937o298K745K595J6906N974j0683Q667J573L904J5059M468l665j4395
$$ 7275 -15662 -21960 -19215 -16620 286 6260 -4423 4244 5817 9721 24780 29248 25583 11188
6220A1188n986J2731O3j0466K610L92R820N908r907j515q77n251k6373j5269P479
$$ 11188 5202 17933 17996 7530 10140 10532 20352 26260 16353 14838 13961 8710 -17663 -32932 -25453
6205b5453L967K186K779m121O889J2372M432q011n654M763j6323j1141Q891J1843
$$ -25453 -21486 -19300 -16521 -20642 -13753 -1381 3051 -4960 -10614 -5851 -22174 -33315 -24424 -12581
6191a2581J0818q453L563K462K861j1846j0243l574J6736J2689N680Q661j908
$$ -12581 -1763 -10216 -6653 -4191 -1330 -13176 -23419 -26993 -10257 2432 8112 16773 14865
6178A4865j7712O801Q974j6358l1052L667J9041J9678j351J281M434n838o826
$$ 14865 -2847 3954 12928 -3430 -34482 -30815 -11774 7904 6553 7834 12268 6430 -396
6165c96j6875l92K007K417J3636q227J288R946K741M683N126K93N011M939j7848
$$ -396 -17271 -17663 -15656 -13239 397 -7830 -6542 3404 6145 10828 15954 16247 21258 26197 8349
6150H349j4015j4429J4005K162k267J0780m621o139r347P101L235k939q408J902
$$ 8349 -5666 -20095 -6090 -3928 -6195 4585 -36 -6175 -15522 -8421 -5186 -8125 -16533 -14631
6136a4631R091L264l508p798k494N755J1043P923p823o684O41P806P790q702l957
$$ -14631 -5540 -2276 -5784 -13582 -16076 -10321 722 8645 822 -5862 -5221 2585 10375 1673 -2284
6121b284J251q56O598N090J823L462J170N427J1265q621L409R386N125j8477n893
$$ -2284 -1033 -1889 4709 9799 11622 15084 16254 21681 32946 24325 27734 37120 42245 23768 17875
6106A7875N93j455j7778l854J7086j1496r531J7239J2270O685j1064j4776Q850
$$ 17875 18468 17013 -765 -4619 12467 971 -8560 8679 20949 27634 16570 1794 10644
6093A0644j5821j698J6698P830k0354o510P848K681j4854k465R647J6405r979
$$ 10644 -5177 -6875 9823 17653 -2701 -9211 -1363 1318 -13536 -16001 -6354 10051 72
6080G2j024L989m864m389q338L335N376j4188r355m785J2466K811n784J2073J3287
$$ 72 -952 3037 -1827 -6216 -14554 -11219 -5843 -20031 -29386 -34171 -21705 -18894 -24678 -12605 682
6065F82R077j444j1719m673O020k42P19j3454o844Q644K371l984L234k007L993
$$ 682 9759 8315 -3404 -8077 -2057 -2299 -1580 -15034 -21878 -13234 -10863 -14847 -11613 -13620 -9627
6050i627M989j334p951j5053L406J7192J843l832L213J551l320m041K189M271
$$ -9627 -4638 -5972 -13923 -28976 -25570 -8378 -6535 -10367 -7154 -5603 -8923 -12964 -10775 -6504
6036f504P144L912J3874n163j5128j1833j1033J821j140l306K09J3515J1233K829
$$ -6504 640 4552 18426 13263 -1865 -13698 -24731 -22910 -24050 -27356 -27147 -13632 -2399 430
6022D30n112l011m236p633J415n420J366n029O813J288R171K68j5401J176J6451
$$ 430 -4682 -7693 -11929 -19562 -18147 -23567 -22201 -27230 -20417 -19129 -9958 -9690 -25091 -23915 -7464
6007g464N302L734J6403O197j4946j0270k671j721Q447q796l3J3537K997P762
$$ -7464 -2162 1572 17975 24172 9226 -1044 -3715 -5436 3011 -5785 -5818 7719 10716 18478
5993A8478k164l67p02j6366m817P780m261J107m39n886n831O080L870m692l992
$$ 18478 16314 15947 15245 -1121 -5938 1842 -2419 -1312 -1751 -7637 -13468 -7388 -3518 -8210 -12202
5978a2202O973M04J2879k797k0579l149k163m462J6431N956m506p368q833j6993
$$ -12202 -5229 -4825 8054 5257 -15322 -18471 -20634 -25096 -8665 -2709 -7215 -14583 -23416 -40409
5964d0409N609O507J4447Q790N438q93n689p741P453M357j5930j0184k640J2388
$$ -40409 -34800 -28293 -13846 -5056 382 -511 -6200 -13941 -6488 -2131 -18061 -28245 -30885 -18497
5950a8497O904O712o697M966M319q299k572Q585j6374j6293J2202J6476O963O160
$$ -18497 -11593 -4881 -11578 -6612 -2293 -10592 -13164 -4579 -20953 -37246 -25044 -8568 -1605 4555
5936D555J2706J0333M139j996j6893j1761J0685N936m683k284O70j4882j5763
$$ 4555 17261 27594 31733 29737 12844 1083 11768 17704 13021 10737 11407 -3475 -19238
5923a9238P596J10N424J5637O706j936j225L76q403j4270r882q347J2913N789
$$ -19238 -11642 -11532 -6108 9529 16235 14299 13074 13450 5047 -9223 -19105 -27452 -14539 -8750
5909h750J1956o242r323k5337J30J2978N716J3431O212l27R465j0568n921K700
$$ -8750 3206 -3036 -12359 -37696 -37566 -24588 -18872 -5441 771 444 9909 -659 -6580 -3880
5895c880K678N538K564L507k386j0791r970o680Q506J0389q738k1225k275J8205
$$ -3880 -1202 4336 6900 10407 8021 -2770 -12740 -19420 -10914 -525 -9263 -30488 -32763 -14558
5881a4558J1700P211o660N481m498j715L636J377Q102l6m986J1060M785r270n219
$$ -14558 -2858 4353 -2307 3174 -1324 -3039 597 1974 10076 10040 5054 16114 20899 11629 6410
5866F410o293M538N689o134j4569o886m533M471J3340N251l524J7198M595j0835
$$ 6410 117 4655 10344 4210 -10359 -17245 -21778 -17307 -3967 1284 -2240 14958 19553 8718
5852H718j6711p020J0368J040M358L130p144J0123j4593r603Q414J3892J7411
$$ 8718 -7993 -15013 -4645 -3605 753 3883 -3261 6862 -7731 -17334 -8920 4972 22383
5839B2383O513j1760r800p885K048j688P932j0735r434K1266K3423n098j4613
$$ 22383 28896 17136 7336 -549 1499 -189 7743 -2992 -12426 8840 32263 27165 12552
5826A2552o652p056r960k547J0546Q314M162l526j2194j1375n263J1838R579L12
$$ 12552 5900 -1156 -11116 -13663 -3117 5197 9359 5833 -6361 -17736 -22999 -11161 -1582 -1270
5812a270j0876n970Q13J0899N922j776M353p503o18k841n401k250k192J828N95
$$ -1270 -12146 -18116 -17303 -6404 -482 -2258 2095 -5408 -6026 -8867 -14268 -16518 -18710 -16882 -16287
5797a6287L922j09K719K138L484P046q329j4966M14m04J7957J2491J482P170k252
$$ -16287 -12365 -12474 -9755 -7617 -4133 2913 -5416 -20382 -19968 -20372 -2415 10076 11558 18728 16476
5782A6476n807j1351J4772J018l178n812j1684n524R764L10k5116R578Q202M828
$$ 16476 10669 -682 14090 15108 11930 6118 -5566 -11090 -1326 -1016 -26132 -16554 -8352 -3524
5768c524j8147P58l977q98J2569j4300L069J1068l291j323l009Q516N724k125
$$ -3524 -21671 -20913 -24890 -25788 -13219 -27519 -24450 -13382 -16673 -17996 -21005 -12489 -6765 -8890
5754h890n839j1362j843K301o912M770l985M810J2986O292j026N226J030M429
$$ -8890 -14729 -26091 -27934 -25633 -32545 -27775 -31760 -26950 -13964 -7672 -8698 -3472 -2442 1987
5740A987R103N399j1365M617p483o629k285p019j2701Q838N262K385K922k734
$$ 1987 11090 16489 5124 9741 2258 -4371 -6656 -13675 -26376 -17538 -12276 -9891 -6969 -9703
5726i703j2271N080J2304N456L866j976j5237q326J5002J646K001N140j0561n421
$$ -9703 -21974 -16894 -4590 866 4732 2756 -12481 -20807 -5805 -4159 -2158 2982 -7579 -13000
5712a3000l879L769j7182J85N670J4054k526J064j215J218j1958n844J5747N691
$$ -13000 -16879 -13110 -30292 -30107 -24437 -10383 -12909 -11845 -13060 -11842 -23800 -29644 -13897 -8206
5698h206o713j745R745M971k555m390J984Q177k431M003k158m787P081P60j5927
$$ -8206 -14919 -16664 -6919 -1948 -4503 -8893 -6909 1268 -1163 2840 682 -4105 2976 3736 -12191
5683a2191N130o712j0031N459J0604k202n300J039L920J2657N492J79k567P548
$$ -12191 -7061 -13773 -23804 -18345 -7741 -9943 -15243 -14204 -10284 2373 7865 8044 5477 13025
5669A3025Q176j374o953m553K570k874j5283p701p468L781L415l727r095l94J3659
$$ 13025 21201 19827 12874 8321 10891 8017 -7266 -14967 -22435 -18654 -15239 -18966 -28061 -28455 -14796
5654a4796J4505J3809K348j0271p7L200k868L900K444j960m320j569j4159n839
$$ -14796 -291 13518 15866 5595 5518 8718 5850 9750 12194 10234 5914 4345 -9814 -15653
5640a5653N585j1002j074O823Q853J4378o98j6251j2928q34J0861J2142N786j8343
$$ -15653 -10068 -21070 -22144 -15321 -6468 7910 7212 -9039 -21967 -22801 -11940 202 5988 -12355
5626a2355j6268K763P014R922K730M626j2869o650j265J0466N612p406L842N737
$$ -12355 -28623 -25860 -18846 -8924 -6194 -1568 -14437 -21087 -22352 -11886 -6274 -13680 -9838 -4101
5612d101q334N189N404M80J109K184n349O155J9591p49j5923k883Q03L847p031
$$ -4101 -12435 -7246 -1842 -1362 -253 1931 -3418 2737 22328 21579 5656 2773 3576 7423 392
5597C92k4084J3692L152Q839j2244L918J514j308J4420Q64j533P757K631k120
$$ 392 -23692 -10000 -6848 1991 -10253 -6335 -4821 -6129 8291 9155 7622 15379 18010 15890
5583A5890n999r615L392k561p290m603J407J2000p805k1549J336R864k444K878
$$ 15890 9891 276 3668 1107 -6183 -10786 -9379 2621 -5184 -26733 -25397 -15533 -17977 -15099
5569a5099N347J3480O7L393N215j0640j6202j642O527J6334J5998j6156o645J449
$$ -15099 -9752 3728 3795 7188 12403 1763 -14439 -16081 -9554 6780 22778 6622 -23 1426
5555A426m848j2129P362J8941j354k1477k210J2652J249J795K928j3514j972N872
$$ 1426 -3422 -15551 -8189 10752 9398 -12079 -14289 -1637 -388 1407 4335 -9179 -11151 -5279
5541e279J444l565n057J0028J7049j434o403j3436J702O306m45J696Q082j6133
$$ -5279 -3835 -7400 -12457 -2429 14620 13186 6783 -6653 -4951 1355 910 2606 10688 -5445
5527e445k4255k537L26J979M218J3554Q5L792J7804O785R58m99j8309O245R298
$$ -5445 -29700 -32237 -31911 -29932 -25714 -12160 -12075 -8283 9521 16306 17264 16765 -1544 4701 13999
5512A3999j2601j2173Q895J4427L019l778M180M45j1719j3360j6958M935J716
$$ 13999 1398 -10775 -1880 12547 15566 11788 15968 16413 4694 -8666 -25624 -20689 -18973
5499a8973K545M075l466m601p373R347J1562k171O446K357p702j4721N159J2333
$$ -18973 -16428 -12353 -15819 -20420 -27793 -18446 -6884 -9055 -2609 -252 -7954 -22675 -17516 -5183
5485e183o480l181O118N476k675l579j458L006O576j3737l404N248q91K012J9554
$$ -5183 -11663 -14844 -8726 -3250 -5925 -9504 -10962 -7956 -1380 -15117 -18521 -13273 -14164 -12152 7402
5470G402J3193m439j2628j4817K944l197n189O916O531o7J6797o733j5518L444
$$ 7402 20595 16156 3528 -11289 -8345 -11542 -16731 -9815 -3284 -3351 13446 6713 -8805 -5361
5456e361N876q422M812J1591J0066N656j4332j0282q647l806K3R852j164q51r025
$$ -5361 515 -7907 -3095 8496 18562 24218 9886 -396 -9043 -12849 -12826 -2974 -4138 -4989 -14014
5441a4014N290R627m190l259N171r92j0565J8547P633p974j9630o381J0808K872
$$ -14014 -8724 903 -3287 -6546 -1375 -2367 -12932 5615 13248 5274 -14356 -20737 -9929 -7057
5427g057P209R366m637m054l469O081N70K884p646r253J204M006K544P130R795
$$ -7057 152 9518 4881 827 -2642 3439 4009 6893 -753 -10006 -8802 -4796 -2252 4878 14673
5412A4673r654j0154J6039m277r892p356j0638m575p704k563n695o115J9283R531
$$ 14673 5019 -5135 10904 6627 -3265 -10621 -21259 -25834 -33538 -36101 -41796 -47911 -28628 -19097
5398a9097Q272J0496n497j7382J057J0400L953Q901l715q357l169O889P704J2070
$$ -19097 -10825 -329 -5826 -23208 -22151 -11751 -7798 1103 -2612 -10969 -14138 -7249 455 12525
5384A2525r547p941q304J3458N66p985j1758Q712N979k883n206o880J2372M475
$$ 12525 2978 -4963 -13267 191 757 -7228 -18986 -10274 -4295 -7178 -12384 -19264 -6892 -2417
5370b417l478M409o671L399K701j078p58J3758j489j4205K872j029n976r195J1049
$$ -2417 -5895 -1486 -8157 -4758 -2057 -3135 -3893 9865 8376 -5829 -2957 -3986 -9962 -19157 -8108
5355h108Q679j8218q548J533J028P553N26l568M571P43m933j0706J7696J040O855
$$ -8108 571 -17647 -26195 -24662 -23634 -16081 -15555 -19123 -14552 -13809 -18742 -29448 -11752 -10712 -3857
5340c857J3825K253l519j0781m363J1216N272N710R627m19k423q858j9544P506
$$ -3857 9968 12221 8702 -2079 -6442 4774 10046 15756 25383 24964 22541 13683 -5861 1645
5326A645j680k435j699o701j534J3240R073r826Q114l108k653O607j9303j673
$$ 1645 -35 -2470 -4169 -10870 -12404 836 9909 83 8197 5089 2436 9043 -10260 -11933
5312a1933R32r739M607J3160J2952q283j5029qL54J2029j2542p856J0499L234
$$ -11933 -11001 -20740 -16133 -2973 9979 1696 -13333 -13341 -12987 -958 -13500 -21356 -10857 -7623
5298g623n005K437R383L704k505j359p034L573O799P975j611n117p389p135M867
$$ -7623 -12628 -10191 -808 2896 391 -968 -8002 -4429 2370 10345 8734 3617 -3772 -10907 -6040
5283f040R426k857J625j0241J6319J0365n132J895J314J432j4184j3726J0681
$$ -6040 3386 529 2154 -8087 8232 18597 13465 15360 16674 18106 3922 -9804 877
5270H77j378l887L407P278q010J4467r30j3351N28K724K1467j419j9210l806P78
$$ 877 -501 -4388 -981 6297 -1713 12754 11824 -1527 -999 1725 23192 21773 2563 -1243 -465
5255d65j2993n137J787n867m68Q293n727l315J021q408L029K5077O702K421m712
$$ -465 -13458 -18595 -16808 -22675 -23143 -14850 -20577 -23892 -22871 -31279 -28250 -3173 3529 5950 1238
5240A238o8m011j867p400O0N237J309j5713P784J0911j434j1227L124m295M095
$$ 1238 1170 -2841 -4708 -12108 -12048 -6811 -5502 -21215 -13431 -2520 -3954 -15181 -12057 -16352 -12257
5225a2257j754R862j1586j4711p889J5123M449j2501P350J3680N213j312L421
$$ -12257 -14011 -4149 -15735 -30446 -38335 -23212 -18763 -31264 -23914 -10234 -5021 -6333 -2912
5212b912J5309L689k3045P208J1875n34l410j0108K624N73r274L3N527J438p665
$$ -2912 12397 16086 -6959 249 12124 11590 8180 -1928 696 1269 -8005 -7972 -2445 -1007 -8672
5197h672l782n376K184K061R228J9830m902j3581n603K298K258O771q232J0777
$$ -8672 -12454 -17830 -15646 -13585 -4357 15473 10571 -3010 -8613 -6315 -4057 2714 -5518 5259
5183E259J2126p001m580j628r014n363k895O431r882j2869m029R917L757l961
$$ 5259 17385 10384 5804 4176 -4838 -10201 -13096 -6665 -16547 -29416 -33445 -23528 -19771 -23732
5169b3732J251K0548J8035j2819j0702J0512P46L989k42j262L421J0869j4995
$$ -23732 -22481 -1933 16102 3283 -7419 3093 3839 7828 7586 6324 9745 20614 5619
5156E619k4724j1473P595J2704L474M513k67k07Q16K1032N596Q494j7555j0143
$$ 5619 -19105 -30578 -22983 -10279 -6805 -2292 -2559 -2766 -1950 19082 24678 33172 15617 5474
5142E474K853J817j5213J494R679L544L544N693j5477j4467L308K1029P77j6285
$$ 5474 8327 10144 -5069 -3575 6104 9648 13192 18885 3408 -11059 -7751 13278 14055 -2230
5128b230O027L231k450j5387r058n642n103Q169J4010k277j0768M162O082R182
$$ -2230 3797 7028 4578 -10809 -19867 -25509 -30612 -22443 -8433 -10710 -21478 -17316 -11234 -2052
5114b052r435q651m218P562p907k819J3603P495J5730J4589j2273j1822n068M300
$$ -2052 -11487 -20138 -24356 -16794 -24701 -27520 -13917 -6422 9308 23897 11624 -198 -5266 -966
5100i66P155J519j4120L002M648j061N507Q893p093j2842j2290M153j1300J334
$$ -966 6189 7708 -6412 -3410 1238 177 5684 14577 7484 -5358 -17648 -13495 -24795 -23461
5086b3461Q399r404J5857K557l610L009J2227K966j2590n605J7338O651j8946
$$ -23461 -15062 -24466 -8609 -6052 -9662 -6653 5574 8540 -4050 -9655 7683 14334 -4612
5073d612o619R802m95Q579R35q370L262r157j4425K0898O220j0871q727n551M188
$$ -4612 -11231 -1429 -1924 6655 7590 -780 2482 -6675 -21100 -202 6018 -4853 -13580 -19131 -14943
5058a4943o194k4270m486P911M161J0083O226J4605J725J8412N430K089j277j0045
$$ -14943 -21137 -45407 -49893 -41982 -37821 -27738 -21512 -6907 -5182 13230 18660 20749 19472 9427
5044I427m099K740k349K446k006j7864l459k443J4204j0687r069Q600O06r518
$$ 9427 5328 8068 5719 8165 6159 -11705 -15164 -17607 -3403 -14090 -23159 -14559 -13953 -23471
5030b3471J9795J2007K309q931m335j2555k81r19Q789k149L602l768P495O939
$$ -23471 -3676 8331 10640 1709 -2626 -15181 -15462 -16381 -7592 -9741 -6139 -9907 -2412 4527
5016D527o988m068k520q137J2711M439l875P938n69j0445M216p452n409p932m991
$$ 4527 -2461 -6529 -9049 -17186 -4475 -36 -3911 4027 3458 -6987 -2771 -10223 -15632 -23564 -28555
5001b8555K91L005J0638M666r39j655K973K677j295k3153J0601J731J0576J1196
$$ -28555 -28264 -25259 -14621 -9955 -10894 -12549 -9576 -6899 -8194 -31347 -20746 -19015 -8439 2757
4987B757m397r549j212m063J7476J2242k778j1054j3066J245n064j062l981m091
$$ 2757 -1640 -11189 -12401 -16464 1012 13254 10476 -578 -13644 -12399 -17463 -18525 -22506 -26597
4973b6597n910p338J0697M464M11J0782J9053R29k1752M050J4277r066k333l750
$$ -26597 -32507 -39845 -29148 -24684 -24273 -13491 5562 6491 -15261 -11211 3066 -6000 -8333 -12083
4959a2083n176N656n008l847k6J3438r56p084m463M238K0525O189j1114j3440
$$ -12083 -17259 -11603 -16611 -20458 -20484 -7046 -8002 -15086 -19549 -15311 5214 11403 289 -13151
4945a3151o354K64K924O166Q148K860j213j6836P69J4903m232n616r963j1175
$$ -13151 -19505 -19241 -16317 -10151 -2003 857 -356 -17192 -16423 -1520 -5752 -11368 -21331 -32506
4931c2506J2446K1284J1989j304R643j768j2525J840j2126l245k529j466r300
$$ -32506 -20060 1224 13213 11909 21552 19784 7259 9099 -3027 -6272 -8801 -10267 -19567
4918a9567j1283j1275M004J6007L968n48J4676Q339j2640L64J8969j093M72p854
$$ -19567 -30850 -42125 -38121 -22114 -18146 -18694 -4018 4321 -8319 -7955 11014 9921 10393 2539
4904B539j518J0683m180o776J746o128j798l348Q242M166j6762k106M794r07J3533
$$ 2539 1021 11704 7524 748 2494 -3634 -5432 -8780 -538 3628 -13134 -15240 -10446 -11353 2180
4889B180O065J7785J2429p503r734M231j248r049o556M61O306j9868j6079L45
$$ 2180 8245 26030 38459 30956 21222 25453 24205 15156 8600 9061 15367 -4501 -20580 -20235
4875b0235N984Q553L093o693m491m067L684J5595L496O838j7111n577L042m5J910
$$ -20235 -14251 -5698 -2605 -9298 -13789 -17856 -14172 1423 4919 11757 -5354 -10931 -7889 -7934 -6024
4860f024p970R451O071m800O377K140n265M076J1188L784P532p628j780q434M936
$$ -6024 -13994 -4543 1528 -3272 3105 5245 -20 4056 15244 19028 26560 18932 17152 8718 13654
4845A3654q403j9716M007R309K414kQ000o102l927J2412m740j4453j45J0975j4110
$$ 13654 5251 -14465 -10458 -1149 1265 1263 9263 3161 -766 11646 6906 -7547 -7692 3283 -10827
4830a0827p092J3437j229p07N080L664j260j3691m935J5975R022J4190m979q200
$$ -10827 -17919 -4482 -5711 -6418 -1338 2326 1066 -12625 -17560 -1585 7437 21627 16648 8448
4816H448q292j966R567K585r563j7707n733n217m370J010k049l545J3780Q780
$$ 8448 156 -1810 7757 10342 779 -16928 -22661 -27878 -32248 -31238 -33287 -36832 -23052 -14272
4802a4272j1596j7355L483J3665l443j09M776l749m931M803O676o372j384J3160
$$ -14272 -25868 -43223 -39740 -26075 -29518 -29627 -24851 -28600 -33531 -28728 -22052 -28424 -29808 -16648
4788a6648J5296O789q162O403P477j1116K911m444l8K6060J3719k0318j3971j896
$$ -16648 -1352 5437 -2725 3678 11155 39 2950 -1494 -1532 24528 38247 17929 3958 2062
4774B062j1896p056J0878O608L281j2217j0883m365K102N525L456J3454K595q551
$$ 2062 -9834 -16890 -6012 596 3877 -8340 -19223 -23588 -21486 -15961 -12505 949 3544 -5007
4760e007O39O304k891k1055q951J5373L293n500j3013k023J5750J4483O744P546
$$ -5007 -4368 1936 -955 -22010 -30961 -15588 -12295 -17795 -30808 -32831 -17081 -2598 4146 11692
4746A1692o534k7690q529M504J6030l962r092l16O614K716j0792p04J5413M223
$$ 11692 5158 -22532 -31061 -26557 -10527 -14489 -23581 -23897 -17283 -14567 -25359 -26063 -10650 -6427
4732f427n257R52m91j0767N910J7540k548j5789K786J6386K549l340r378N997
$$ -6427 -11684 -10732 -11223 -21990 -16080 1460 -1088 -16877 -14091 2295 4844 1504 -7874 -1877
4718a877K849q636O455r042L489j293p784M042K0978O225l544J3156n431j5382
$$ -1877 972 -7664 -1209 -10251 -6762 -8055 -15839 -11797 9181 15406 11862 25018 19587 4205
4704D205J693Q890J1924o753q642o836p857j0408j1365K706O341n478P281J0379
$$ 4205 5898 14788 26712 19959 11317 4481 -3376 -13784 -25149 -22443 -16102 -21580 -14299 -3920
4690c920J0651L142k377r971K597J7786n571l177j418p430q087j3622P135L645
$$ -3920 6731 9873 7496 -2475 122 17908 12337 9160 7742 312 -7775 -21397 -14262 -10617
4676a0617p070L950M486r84m44K931Q723j2598j0712p050J0017J329M767J8874
$$ -10617 -17687 -13737 -9251 -10235 -10679 -7748 975 -11623 -22335 -29385 -19368 -18039 -13272 5602
4662E602J1823j6634j0677K593J3366R558P211m694r643p536j0487j411O477j169
$$ 5602 17425 791 -9886 -7293 6073 15631 22842 18148 8505 969 -9518 -10929 -4452 -5621
4648e621j4186p587Q944k915p699P777J1674j3306O486J5667p83J543N402j3950
$$ -5621 -19807 -27394 -18450 -21365 -29064 -21287 -9613 -22919 -16433 -766 -1549 -6 5396 -8554
4634h554R50M702k646j125j3691j488O783K195K926o919q246o634J2724r995P136
$$ -8554 -7604 -2902 -5548 -6673 -20364 -21852 -15069 -12874 -9948 -16867 -25113 -31747 -19023 -29018 -21882
4619b1882J6861j5450j3550L031J0400m650Q290J6810J937J2356J86j4826q944
$$ -21882 -5021 -20471 -34021 -30990 -20590 -25240 -16950 -140 1797 14153 14339 -487 -9431
4606i431j2981M287J9087N494N00K757N647q007j7506q230O348M696L047o702
$$ -9431 -22412 -18125 962 6456 6956 9713 15360 7353 -10153 -18383 -12035 -7339 -4292 -10994
4592a0994J1015Q1j0580k143L814o597J967J0550j2528N008m263P554J4601k684
$$ -10994 21 102 -10478 -12621 -8807 -15404 -13437 -2887 -15415 -10407 -14670 -7116 7485 4801
4578D801L8j0228l208O831M281j5791r008o365k421J3220J4064K812k0733R53
$$ 4801 4839 -5389 -8597 -1766 2515 -13276 -22284 -28649 -31070 -17850 -3786 -974 -21707 -20754
4564b0754R062j2600J079Q287J582n70p080K386Q825O899k141o723q944l204K0962
$$ -20754 -11692 -24292 -23213 -14926 -13344 -13914 -20994 -18608 -9783 -2884 -5025 -11748 -20692 -23896 -2934
4549b934J2793l244q460m948m091p126N370P388L636K938k546J3849m942Q44m34
$$ -2934 9859 6615 -1845 -6793 -10884 -18010 -12640 -5252 -1616 1322 -1224 12625 7683 8527 8093
4534H093j5986j1364K231M196L387k997P200P984L230O191J5390k0312Q414P515
$$ 8093 -7893 -19257 -17026 -12830 -9443 -12440 -5240 2744 5974 12165 27555 7243 15657 23172
4520B3172r44k733j0427j9803k271O651p404k12L097R045N452Q52P20l378M470
$$ 23172 22228 19495 9068 -10735 -13006 -6355 -13759 -13971 -10874 -1829 3623 4475 5195 1817 6287
4505F287J449k898r586R361R497j881l88m204q603j920l501R889o064j580Pn561
$$ 6287 7736 4838 -4748 4613 14110 12229 11841 7637 -966 -2886 -6387 3502 -2562 -4142 -4135 -9696
4489i696J6282o598m34J9006j5076K186k077j0525N676R45j811p346m3j091j616
$$ -9696 6586 -12 -446 18560 3484 5670 3593 -6932 -1256 -311 -2122 -9468 -9511 -10602 -12218
4474a2218K571M805R745l430j3400o007j2032O08J332J1396m86J430l094O698
$$ -12218 -9647 -4842 4903 1473 -11927 -17934 -29966 -29358 -28026 -16630 -17116 -15686 -18780 -12082
4460a2082k872R84O764n293k447Q748J3767M31j7311N000o968q909L870N774m65
$$ -12082 -14954 -13970 -7206 -12499 -14946 -6198 7569 8000 -9311 -4311 -11279 -20188 -16318 -10544 -11009
4445a1009o785L279O694m686m118j1958m99J1067j531k708m602J3460N022l971
$$ -11009 -17794 -14515 -7821 -12507 -16625 -28583 -29082 -18015 -19546 -22254 -26856 -13396 -8374 -12345
$$ [...]
##END NTUPLES=NMR SPECTRUM
##END=
