##TITLE=Analysis number 307864
Compound Code cc 21709
Book Reference 440/10
Project Code adrs
Chemist Name craigr
##JCAMPDX= 6.0         $$ Bruker NMR JCAMP-DX V2.0
##DATA TYPE= NMR SPECTRUM
##DATA CLASS= NTUPLES
##ORIGIN= Bruker BioSpin GmbH
##OWNER= NMR
$$ XWIN-NMR		Version 3.5
$$ Mon May 16 15:43:26 2005 GMT Daylight Time (UT+1h)  MAYBRIDGE\NMR@NMR_250MHZ
##.OBSERVE FREQUENCY= 250.131544655141
##.OBSERVE NUCLEUS= ^1H
##.ACQUISITION MODE= SIMULTANEOUS (DQD)
##.ACQUISITION SCHEME= undefined
##.AVERAGES= 16
##.DIGITISER RES= 18
##SPECTROMETER/DATA SYSTEM= dpx250
##.PULSE SEQUENCE= zg30
##.SOLVENT NAME= DMSO
##.SHIFT REFERENCE= (INTERNAL, DMSO, 0, 16.522)
##AUDIT TRAIL= $$ (NUMBER, WHEN, WHO, WHERE, WHAT)
$$ ##TITLE= Audit trail, XWIN-NMR		Version 3.5
$$ ##JCAMPDX= 5.01
$$ ##ORIGIN= Bruker BioSpin GmbH
$$ ##OWNER= NMR
$$ C:\u/data/dgb/nmr/ADRS/3030/pdata/1/auditp.txt
$$ ##AUDIT TRAIL=  $$ (NUMBER, WHEN, WHO, WHERE, WHAT)
(   1,<2005-05-16 15:42:58.12 +100>,<MAYBRIDGE\NMR>,<NMR_250MHZ>,
      <created by zg, POWCHK disabled, PULCHK disabled
       configuration hash MD5:
       62 19 C7 07 E1 42 D1 B7 37 6C 3D D0 77 39 F9 E6
       data hash MD5: 64K
       2D 32 2F BC A5 42 94 CA 38 74 B3 43 B2 3C C6 96>)
(   2,<2005-05-16 15:43:13.34 +100>,<MAYBRIDGE\NMR>,<NMR_250MHZ>,
      <Start of raw data processing
       ef LB = 0.3 FT_mod = 6 PKNL = 1 SI = 32K 
       data hash MD5: 32K
       C9 A0 81 0C 44 20 C3 66 9B 5E 92 26 6E 2E D5 44>)
(   3,<2005-05-16 15:43:17.26 +100>,<MAYBRIDGE\NMR>,<NMR_250MHZ>,
      <apk 
       data hash MD5: 32K
       D9 D5 ED 1D E0 7D FE 80 23 99 4D 6B 06 C2 69 11>)
(   4,<2005-05-16 15:43:18.37 +100>,<MAYBRIDGE\NMR>,<NMR_250MHZ>,
      <abs ABSG = 5 
       data hash MD5: 32K
       D2 5C 05 E5 99 C6 34 D8 C1 CE 87 82 EC DD 83 29>)
$$ ##END=
$$ 
$$ hash MD5
$$ 38 93 2B F4 77 09 69 36 A9 77 06 BC B4 F2 65 3E
##$RELAX= 
##$RELAX= 
##$RELAX= 
##$RELAX= 
##$RELAX= 
##$RELAX= 
##$RELAX= 
$$ Bruker specific parameters
$$ --------------------------
##$DU= <C:\u>
##$EXPNO= 3030
##$NAME= <ADRS>
##$PROCNO= 1
##$TYPE= <nmr>
##$USER= <dgb>
##$AMP= (0..31)
100 100 100 100 100 100 100 100 100 100 100 100 100 100 100 100 100 100 
100 100 100 100 100 100 100 100 100 100 100 100 100 100 
##$AQSEQ= 0
##$AQ_mod= 3
##$AUNM= <au_zg>
##$AUTOPOS= <3 >
##$BF1= 250.13
##$BF2= 250.13
##$BF3= 250.13
##$BF4= 250.13
##$BF5= 500.13
##$BF6= 500.13
##$BF7= 500.13
##$BF8= 500.13
##$BYTORDA= 1
##$CFDGTYP= 0
##$CFRGTYP= 5
##$CHEMSTR= <none>
##$CNST= (0..31)
1 1 145 1 1 1 1 1 1 1 1 1 1 1 1 1 1 1 1 1 1 1 1 1 1 1 1 1 1 1 1 1 
##$CPDPRG= <>
##$CPDPRG1= <>
##$CPDPRG2= <>
##$CPDPRG3= <>
##$CPDPRG4= <mlev>
##$CPDPRG5= <mlev>
##$CPDPRG6= <mlev>
##$CPDPRG7= <mlev>
##$CPDPRG8= <mlev>
##$CPDPRGB= <>
##$CPDPRGT= <>
##$D= (0..31)
0 1 0 0 0 0 0 0 0 0.06 0 0 0 0 0 0 0.0002 0 0 0 0 0 0 0 0 0 0 0 0 0 0 
0 
##$DATE= 1116254577
##$DBL= (0..7)
120 120 120 120 120 120 120 120 
##$DBP= (0..7)
150 150 150 150 150 150 150 150 
##$DBP07= 0
##$DBPNAM0= <>
##$DBPNAM1= <>
$$ [...]
##$SUBNAM7= <"">
##$SUBNAM8= <"">
##$SUBNAM9= <"">
##$SW= 20.6930455092707
##$SWIBOX= (0..15)
0 0 3 0 0 0 0 0 0 0 0 0 0 0 0 0 
##$SW_h= 5175.983436853
##$TD= 65536
##$TD0= 1
##$TE= 296.16
##$TE2= 300
##$TE3= 300
##$TEG= 300
##$TL= (0..7)
0 120 120 120 120 120 120 120 
##$TP= (0..7)
150 150 150 150 150 150 150 150 
##$TP07= 0
##$TPNAME0= <>
##$TPNAME1= <>
##$TPNAME2= <>
##$TPNAME3= <>
##$TPNAME4= <>
##$TPNAME5= <>
##$TPNAME6= <>
##$TPNAME7= <>
##$TPOAL= (0..7)
0.5 0.5 0.5 0.5 0.5 0.5 0.5 0.5 
##$TPOFFS= (0..7)
0 0 0 0 0 0 0 0 
##$TUNHIN= 0
##$TUNHOUT= 0
##$TUNXOUT= 0
##$USERA1= <user>
##$USERA2= <user>
##$USERA3= <user>
##$USERA4= <user>
##$USERA5= <user>
##$V9= 5
##$VALIST= <valist>
##$VCLIST= <CCCCCCCCCCCCCCC>
##$VD= 0
##$VDLIST= <DDDDDDDDDDDDDDD>
##$VPLIST= <PPPPPPPPPPPPPPP>
##$VTLIST= <TTTTTTTTTTTTTTT>
##$WBST= 1024
##$WBSW= 4
##$XGAIN= (0..3)
0 0 0 0 
##$XL= 0
##$YL= 0
##$YMAX_a= 328891
##$YMIN_a= -473208
##$ZGOPTNS= <>
##$ZL1= 120
##$ZL2= 120
##$ZL3= 120
##$ZL4= 120
##$ABSF1= 16.522
##$ABSF2= -4.171173
##$ABSG= 5
##$ABSL= 3
##$ALPHA= 0
##$AQORDER= 0
##$ASSFAC= 0
##$ASSFACI= 0
##$ASSFACX= 0
##$ASSWID= 0
##$AUNMP= <proc_1d>
##$AZFE= 0.1
##$AZFW= 0.1
##$BCFW= 0
##$BC_mod= 0
##$BYTORDP= 0
##$COROFFS= 0
##$CY= 12.5
##$DATMOD= 1
##$DC= 0
##$DFILT= <>
##$DTYPP= 0
##$F1P= 14.0000005364418
##$F2P= -0.99999901652339
##$FCOR= 0.5
##$FTSIZE= 32768
##$FT_mod= 6
##$GAMMA= 0
##$GB= 0
##$INTBC= 1
##$INTSCL= 1
##$ISEN= 128
##$LB= 0.3
##$LEV0= 0
##$LPBIN= 0
##$MAXI= 10000
##$MC2= 0
##$MEAN= 0
##$ME_mod= 0
##$MI= 0
##$NCOEF= 0
##$NC_proc= -3
##$NLEV= 6
##$NOISF1= 0
##$NOISF2= 0
##$NSP= 0
##$NTH_PI= 0
##$NZP= 0
##$OFFSET= 16.522
##$PC= 1
##$PHC0= -81.84315
##$PHC1= 7.567969
##$PH_mod= 1
##$PKNL= yes
##$PPARMOD= 0
##$PSCAL= 4
##$PSIGN= 0
##$REVERSE= no
##$SF= 250.13
##$SI= 32768
##$SIGF1= 0
##$SIGF2= 0
##$SINO= 400
##$SIOLD= 32768
##$SREGLST= <1H.DMSO>
##$SSB= 0
##$STSI= 32768
##$STSR= 0
##$SW_p= 5175.98343685301
##$SYMM= 0
##$S_DEV= 0
##$TDeff= 65536
##$TDoff= 0
##$TI= <Analysis number 999999
Compound Code 99
Book Reference 9
Project Code 9>
##$TILT= no
##$TM1= 0
##$TM2= 0
##$TOPLEV= 0
##$USERP1= <user>
##$USERP2= <user>
##$USERP3= <user>
##$USERP4= <user>
##$USERP5= <user>
##$WDW= 1
##$XDIM= 32768
##$YMAX_p= 392462322
##$YMIN_p= -167671
$$ End of Bruker specific parameters
$$ ---------------------------------
##NTUPLES= NMR SPECTRUM
##VAR_NAME=  FREQUENCY,     SPECTRUM/REAL,   SPECTRUM/IMAG
##SYMBOL=    X,             R,               I
##VAR_TYPE=  INDEPENDENT,   DEPENDENT,       DEPENDENT
##VAR_FORM=  AFFN,          ASDF,            ASDF
##VAR_DIM=   32768,         32768,           32768
##UNITS=     HZ,            ARBITRARY UNITS, ARBITRARY UNITS
##FACTOR=    0.157963299565203, 1,           1
##FIRST=     4132.6476996994, 0,             0
##LAST=      -1043.33573715361, 0,           0
##MIN=       -1043.33573715361, -167671,     0
##MAX=       4132.6476996994, 392462322,     0
$$ Real data points
##PAGE= N=1
##DATA TABLE= (X++(R..R)), XYDATA
$$ [...]
20332 45770 44273 29774 1983 -9186 1828 -5070 -33636 -49229 -60579 1478 33698 -2466
20320 -2466 -12088 33232 72930 87754 38090 -21725 -60920 -27310 -25121 -4290 22716 42674
20308 42674 71385 38087 53765 91597 73497 33434 15456 1182 -3667 -48176 -101124 -101246
20296 -101246 -58560 -18552 -28213 26573 26933 29802 33828 1676 -3669 18819 -9116 25504 28525
20283 28525 5785 -1041 31945 37005 11890 -13011 4082 53554 79659 66586 57917 10235
20271 10235 -21817 -24289 16291 29011 65916 70851 24484 26860 9139 4356 14973 13367 19222
20258 19222 13790 -157 -26150 -35428 -42894 -5111 -17060 -54192 -86893 -66861 -51125 -75960
20246 -75960 -41718 -8627 -9593 -4459 -19625 15672 47991 19424 433 -4086 -28784 -29931 -33272
20233 -33272 -30848 -60206 -64292 -20390 -5260 -37566 -63847 -60140 -26995 -18790 -29801 -47451
20221 -47451 -64919 -9563 49234 51940 39193 22854 29549 13499 8974 -26197 -24141 -19026 1635
20208 1635 -25294 -55701 -1993 8842 -30147 -22293 -31412 -48632 -11355 -13651 -25008 -11475
20196 -11475 12453 18623 6804 5866 21667 23662 19583 -19641 -52980 -96 -3189 15475 -2934
20183 -2934 69 44504 65345 73364 45759 32014 35529 71310 98432 77668 68716 36989 11553
20170 11553 16548 37612 27253 8523 -59 1889 -4419 21960 31436 28000 116 -17122 -15659
20157 -15659 -7428 -4335 17311 31814 -9886 -26827 -45252 10535 32514 29006 37212 52647
20145 52647 25300 45941 61191 18336 -23290 -21376 13995 36393 6128 516 7554 1215
20133 1215 -29171 -53048 -62922 -69769 -25615 -7303 2576 18721 -4760 -4169 29776 14781 -18202
20120 -18202 19980 85980 85966 103290 92858 84609 46475 35997 26408 -5378 -5296 17590 40030
20107 40030 55474 40641 36112 31518 -6512 -8695 12419 34998 27338 -25134 -45746 12526
20095 12526 55821 55659 50492 10404 -15940 -19756 17836 65812 84504 68432 54953 12815
20083 12815 35692 37971 57496 83426 90560 97615 66122 48595 29043 56887 42500 42500 31682
20070 31682 4704 -1272 29870 24190 25191 46995 69366 61401 65211 63759 51310 17347 54808
20057 54808 84229 90951 78413 14959 34822 58119 25515 37059 36234 40385 38191 65266 69913
20044 69913 41208 12530 6720 -1314 -9884 -12566 25870 70376 78358 53362 35376 30211 33441
20031 33441 6558 -9110 11358 43533 49211 30418 21228 23660 19417 26234 36606 30070 23666
20018 23666 21696 74183 92676 107549 80218 40877 24765 15435 26413 11400 19460 24726
20006 24726 38093 83367 109589 107976 102278 84183 61001 57551 96161 140624 92620 21187
19994 21187 21556 56051 69478 57027 71602 65554 53068 24892 5463 40629 60227 52295
19982 52295 26552 41103 34834 12147 23156 12304 -15183 -21559 -38769 -37806 -2040 34072
19970 34072 83305 86959 70810 47424 44776 71614 74633 49044 58522 82041 83724 29019 15923
19957 15923 71903 107548 106777 114038 103923 104677 112948 85513 89764 83982 108449 89369 11202
19944 11202 -18618 23605 51474 53217 44621 63728 76254 93661 74318 60163 71825 73931
19932 73931 100005 89163 75591 55216 73728 106332 104925 47945 50122 27080 -17136 -2638
19920 -2638 63657 101281 146687 139939 91882 50202 28250 19474 9047 14247 42132 67181
19908 67181 67198 57754 27525 24916 61382 49226 55666 109398 141478 150370 157102 167493 165104
19895 165104 138350 100154 77948 65437 53939 30202 21194 56019 96482 120905 124393 109423
19883 109423 126256 157039 128367 130677 115655 107833 169856 207214 225028 267604 282671 283400
19871 283400 244910 232091 245544 248135 202240 194256 222536 260135 263995 261350 254787 222601
19859 222601 219233 267194 327668 356955 365414 310860 324904 319542 343944 346496 344069 378416
19847 378416 390927 415226 459351 502692 536825 567266 615454 663605 673841 693117 729706
19836 729706 769074 800840 838906 916550 1040752 1148849 1248359 1420443 1531268 1629257 1739054
19825 1739054 1888129 2096121 2383088 2777671 3242693 3759696 4431898 5423296 6854125
19816 6854125 9038469 12236103 16183588 19725408 21466747 21300352 20567600 20952114 23452787
19807 23452787 28091099 33330535 36571771 36082062 32214080 27272634 23346971 21624809
19799 21624809 21982907 22965229 22537930 19954940 16149409 12415952 9502250 7502289
19791 7502289 6113078 5119658 4451374 3952377 3598354 3392027 3269318 3242200 3276069 3287380
19781 3287380 3345293 3436939 3607680 3976761 4445982 5032504 5906883 7176280 9141850
19772 9141850 12147569 16188822 20326568 22832044 23057452 22153979 22007380 23928578 28248096
19763 28248096 33697469 37640542 37885562 34418524 29229490 24690293 22182158 21946917
19755 21946917 22889563 22935941 20798829 16981142 12934597 9684307 7365065 5728609
19747 5728609 4584972 3808586 3202310 2733581 2324105 2007597 1751383 1566484 1423975
19738 1423975 1316616 1210233 1052060 907874 828285 781517 722016 648308 603975 579874
19728 579874 518809 497793 442922 385770 365107 319951 328176 342143 323746 326283 304634 248723
19716 248723 240784 251804 243342 213571 219984 210933 214141 219456 210916 216378 215131 188818 186309
19703 186309 170123 151959 144858 121160 93852 118943 143752 83846 35643 52228 57195 79584
19691 79584 116752 108799 78645 82699 93605 101788 100514 100898 85458 90348 96952 110761 107019
19678 107019 82050 70734 77668 59982 32943 17205 37460 33638 18131 1951 24618 45351
19666 45351 35464 27962 16110 66294 92334 90933 83954 50506 27906 35110 49439 42002 73083
19653 73083 91442 38639 16122 31503 32587 6554 20044 29205 37929 42868 34619 5019 -44598
19640 -44598 -58308 -36909 -37256 -81607 -95626 -38771 13084 42532 33673 30412 38249 30889 44163
19627 44163 29428 21981 55462 52849 47340 71674 80615 74294 71345 41014 25250 15190 32623
19614 32623 38872 29385 -10885 -13014 26636 3627 3131 -1349 -33345 -36508 -21454 -22200 -13610 5936
19600 5936 12169 14190 23583 31169 18473 32087 29987 20000 32016 25842 42181 63464 61683
19587 61683 67343 79739 32560 2019 -7843 19475 -9045 -29327 -18784 14593 9403 -1929
19575 -1929 18413 32738 35484 -13822 -30126 -19042 -67991 -108270 -103555 -94347 -45320 -65562
19563 -65562 -79001 -60776 -36699 6821 22326 17092 26959 2460 -2762 -5323 -24749 -17220 -1877
19550 -1877 11363 -22341 -59639 -79328 -92581 -86855 -61462 -57131 -56922 -52068 -43118 -35876 -7769
19537 -7769 -7876 -20397 -19493 -18487 -32654 6112 19099 21015 61507 35098 5964 -19323 -53212
19524 -53212 -84510 -93094 -67559 -56332 -21225 39964 49226 -9338 -22330 -22643 -60857 -58399 -27260
19511 -27260 -13892 -51984 -47114 -16073 1915 339 -6742 -21289 -14202 5652 55658 110780
19499 110780 96383 45797 7768 -55033 -97006 -89009 -98092 -72214 -50295 -4891 33882 4178
19487 4178 -4482 -40897 -42238 -12323 -5620 -26325 -39955 -30705 28656 48084 5739 -17024 28413
19474 28413 65930 40431 57268 25404 8547 24940 8734 -15311 -16947 -15949 -38106 -51446
19462 -51446 -28300 -5004 5017 6727 -3419 1741 -9123 -36893 -41735 -32616 -30081 -85533 -101909
19449 -101909 -54583 -53517 -39912 -15397 -32851 -40123 -52228 -40409 -23423 -53436 -63640 -85708
19437 -85708 -106981 -74043 -44945 -28521 -43218 -8844 15930 1956 -16390 -17484 -20436 -35454
19425 -35454 -47377 -71817 -68185 -60050 -53884 -34461 -32962 -56973 -82229 -61165 -66155 -4912 -18792
19412 -18792 -68439 -72093 -65216 -45260 -10749 11446 17104 41517 19463 -25336 -29691 -47799
19400 -47799 -32653 12777 24827 -7778 -10012 -45771 -62953 -43754 -35807 -31737 -11994 36486
19388 36486 32446 45280 48161 7363 -39833 -58912 -70998 -37689 -1611 8892 30788 -20430
19376 -20430 -82194 -66977 -57757 -44034 -35811 -1236 52345 73288 55842 10666 -14721 -45797
19364 -45797 -64125 -8123 26831 5666 -10771 -20242 -30596 -34944 9660 48485 52917 41865
19352 41865 -14604 -50642 -55808 -45220 4652 31584 23906 -6616 -24427 -39375 -59942 5142
19340 5142 31758 18127 -31837 -28977 -1146 34919 32460 -267 -5738 -12492 13446 26072 23558
19327 23558 -3234 -42340 -50780 -43730 -38945 -45283 -15525 8682 8473 5654 28427 9229 23948
19314 23948 -9669 -53487 -57987 -47826 -21717 8769 -29140 -42282 -33533 -20198 -5924 -19628
19302 -19628 -28620 -19685 33912 26211 -5138 -14176 11993 27657 37037 27944 33313 18691 9407
19289 9407 4485 -3462 2288 29852 35065 44967 64147 24977 -26560 -35580 -35058 -10304 -16435 -13893
19275 -13893 -51291 -75107 -27486 8871 18446 51624 45741 54740 38254 -35520 -76312 -59121
19263 -59121 -61859 -45916 -55684 -43529 -66096 -78279 -48149 -50158 -38761 -42433 -36987 -6456 -6125
19250 -6125 26852 42286 21272 -11149 -17984 47351 60415 44347 6913 -48128 -57902 -13651
19238 -13651 5690 16614 26518 -5990 -27396 -38048 -41524 -37028 -8995 -22052 -32923 35064
19226 35064 52249 48487 87867 94336 107368 104266 126325 169755 183258 143119 129261 132434
19214 132434 130141 125934 172343 192858 164836 167221 140949 96608 95597 123057 61798 2538
19202 2538 933 53208 55165 35699 23567 14850 36405 38947 42103 12288 -7227 31218 69680
19189 69680 65969 53506 30330 37632 39657 47661 47288 82330 97345 93992 85162 102315 137175
19176 137175 168918 157092 189377 193305 153596 133812 101202 92948 91982 90010 118721 99791
19164 99791 89341 93066 88235 85316 57291 31870 44782 28045 -17358 -9346 -12909 704 -15920
19151 -15920 11476 16908 2791 2268 6717 7660 198 -10084 -13565 -38139 -49544 -61118 -81344
19138 -81344 -65897 -49534 -40734 8238 44567 36358 -6703 -17263 31645 43046 32305 53720
19126 53720 45647 31283 -18333 -70104 -83618 -45663 -10871 -21096 -27639 -30946 -29648 -32938 -13842
19113 -13842 -15934 -37504 -42303 -14906 13256 23186 47900 91174 54274 14911 -24230 -36896
19101 -36896 -54782 -47589 -2596 60518 56835 57495 63644 49917 55072 8686 -9133 -31782 -45686
19088 -45686 -49916 4144 44367 41124 15687 5956 -15934 -43256 -14409 26150 21743 -725
19076 -725 -33057 -42956 -37901 -73024 -42609 -39715 -8715 -5290 303 22967 63731 57843 44057
19063 44057 48555 67952 96200 101256 91377 101065 65348 49034 64664 51227 40534 58302
19051 58302 9117 -43964 -60005 -21113 -9669 -21299 -27923 6096 3489 17377 13611 24065
19039 24065 36108 60197 37294 -8558 -8843 19961 58991 50340 216 -19962 2188 19808
19027 19808 736 -56947 -64755 -72181 -57831 -42659 -6730 13600 57251 24192 -2987 -29144
19015 -29144 -27523 8200 11800 -1922 -3686 -3421 54781 84603 57086 40586 33819 10945 -8960
19002 -8960 -17281 -28111 -43810 -42023 -38007 -14384 28567 82414 81637 58619 41409 2364 -25197
18989 -25197 -21426 1642 2888 -36460 -23928 -20667 -7987 -7132 -35115 -56003 -31283 -5982 34823
18976 34823 38183 64261 79426 129448 128471 151065 149509 108254 179669 189448 148223 136444 163469
18963 163469 192920 192985 194571 177911 157158 119117 91793 78234 60299 26456 47467 32869
18951 32869 975 6030 25467 7650 -8826 10330 10106 10197 54215 87688 99008 81988 87891
18938 87891 129583 112575 40274 -5003 -35995 -4187 37897 48373 20263 11618 -22028 -32602
18926 -32602 4490 17068 40083 57502 79960 116790 111242 110445 121671 121231 96758 117619 142554
18913 142554 156170 174252 216267 218124 205212 220612 182075 184747 174013 161591 184332 191500
18901 191500 143272 77336 65393 33573 45268 27896 31730 34672 80711 155433 204977 162608
18889 162608 129920 116909 161378 136433 159027 196979 195443 226837 288670 268560 215945 157881
18877 157881 119896 144963 179457 197854 206590 147404 114418 107456 68111 35888 18569 47682
18865 47682 106566 118850 61659 -8039 -55334 -18616 -4091 14287 38289 34401 8581 16015
18853 16015 17658 -13579 -24981 -45126 -86855 -41012 -22652 -28800 -28190 -49145 -27539 17299
18841 17299 13627 30512 48328 20502 -13433 -32969 -18198 10327 27310 48870 71340 54687
18829 54687 32517 -6114 -79005 -53644 -22675 -6811 8606 -11154 -26323 31323 84081 83485
18817 83485 70181 69668 79453 84968 85997 123310 124581 119571 100440 96249 51422 35794 44953
18804 44953 47411 49998 51399 77490 80536 90241 44570 25038 59483 57611 42730 38568 53692
18791 53692 65898 63974 60656 22164 -4930 23699 41963 19992 54772 48679 38368 17585
18779 17585 2830 -4800 17562 23963 -14201 5139 11456 16001 26907 65297 94478 87382 67911
18766 67911 61138 78062 66332 74656 64840 89332 119007 112229 88598 41870 49181 48362 31425
18753 31425 -5722 28160 60863 72387 28662 7813 16850 31331 3320 -7957 5987 37370
18741 37370 97452 93189 33435 33764 31187 -6825 7874 59477 83747 70970 64617 48523 43654
18728 43654 58268 47479 55595 53638 60068 64568 22480 3595 -30919 -2106 27818 47337
18716 47337 40851 72972 69217 55422 67253 58025 52177 89609 119815 129606 118347 147184 143664
18703 143664 142030 145839 121155 154219 174645 146356 104189 75715 38036 35773 16059 -34502
18691 -34502 -30962 -12110 33007 108601 144470 127222 97332 72560 43745 33286 56001 74980
18679 74980 57265 21638 13239 2870 15558 80791 108555 109641 91828 92219 90829 90434 66823
18666 66823 40527 -14875 -40308 -22940 -44199 -27465 -9129 28762 2743 6943 1709 42053
18654 42053 34962 16925 36732 25545 8239 -9582 -18197 12850 19983 44348 51688 77731
18642 77731 82388 63877 74405 58070 76127 73592 3374 -32283 1116 51924 57730 63546
18630 63546 52848 59373 46884 36047 4846 49988 88233 34607 -1880 22262 50936 67493
18618 67493 50480 40318 53914 58319 65360 106626 104906 118432 104644 121312 106719 97407
18606 97407 109628 126135 127326 134062 154954 160154 80709 30937 33197 63822 74325 80676 60004
18593 60004 68044 89306 76770 70839 90975 104585 104497 124131 104239 48634 31068 44591 64308
18580 64308 42396 -1040 34563 47723 64702 98050 143545 111859 62103 75838 79761 102179
18568 102179 144245 149145 114192 84455 97822 117773 156910 155426 180148 166827 162960 166327
18556 166327 206151 237814 209520 164911 132314 118599 123071 167717 193405 210233 227364 227784
18544 227784 180274 136950 132993 124701 120771 101183 98072 88516 49116 48416 94685 81402 70719
18531 70719 92822 86447 104671 86742 66065 95991 92038 84224 107740 149380 144871 120197
18519 120197 143740 183220 202462 192291 215101 255454 272215 259979 272871 293429 270823
18508 270823 238030 249427 295491 298242 298901 290586 305113 303081 304151 289364 311596 329505 310179
18495 310179 280155 259102 266025 230529 256966 316461 370033 404178 356936 343775 358925 393457
18483 393457 456068 496490 507027 517219 543472 565622 594450 634598 652988 691953 760763
18472 760763 804669 855931 908735 964389 1029706 1154485 1284435 1435208 1635431 1864200
18462 1864200 2115440 2375593 2744380 3232290 3937520 4985844 6594220 8984216 12397474
18453 12397474 16201587 18717032 19052011 18215639 17904372 19544509 23597836 29114060
18445 29114060 33205027 33135523 29212609 24074599 20209797 18683732 19221570 20307686
18437 20307686 19702543 16888288 13142036 9816746 7406557 5763217 4588391 3727267
18429 3727267 3121143 2743426 2470585 2267312 2062565 1877125 1762201 1679760 1614265 1595167
18419 1595167 1578157 1566614 1602639 1654248 1689876 1738245 1783403 1865860 1964722 2078104 2184611
18408 2184611 2360082 2562423 2779872 3036049 3363249 3809401 4404998 5288306 6672084
18399 6672084 8719288 11861935 16456569 21821509 25588873 26222319 24972232 24139518
18391 24139518 25899020 31079502 38511106 44319395 44663903 39653573 32720551 27211604
18383 27211604 24682947 25033950 26367201 25849587 22489186 17596108 13007099 9557015
18375 9557015 7180488 5568568 4427832 3603133 3033411 2627266 2335295 2035119 1794201
18366 1794201 1585700 1419333 1307737 1266396 1179999 1044727 975812 921375 868173 789780
18356 789780 745932 748484 724338 634253 550066 514003 504644 498463 424224 364996 324555 295382
18344 295382 303926 348895 381665 387064 369336 335909 319190 304250 268537 257511 235205 251686
18332 251686 278574 290926 304790 322312 291198 194783 189464 224946 228611 227101 227313 227986 221881
18319 221881 230232 190066 127860 132518 153052 173559 150744 124339 97336 81258 81251 95661 87392
18306 87392 91589 133980 170541 170800 156431 146620 153758 139927 113913 103547 137042 153530 171652
18293 171652 167683 173817 175398 175496 157154 114434 132462 208002 207786 161619 145370 115860 104334
18280 104334 106210 113319 136561 123076 73035 41261 65730 119745 115826 101871 92309 88841
18268 88841 58409 286 6265 51746 68726 68941 66349 47744 42094 95141 99835 66703 82307
18255 82307 115038 104539 84993 70005 80915 72366 72660 67872 54260 70067 72857 94954 122906
18242 122906 151208 146920 111195 106241 119301 126856 140193 100290 62925 110728 108114 66361
18230 66361 66458 80757 105094 106472 105334 91470 101908 87278 75262 78815 91037 95326 74757
18217 74757 25636 1750 -19584 4232 11107 14346 38088 76460 81033 79280 73785 63845 41861
18204 41861 61002 75108 76391 103086 134232 151149 129364 94091 95111 78896 64082 29219
18192 29219 35 28339 79197 92080 74187 85813 129386 126034 50421 8577 8277 38553
18180 38553 38935 48865 63205 34905 17312 36797 85043 130963 131240 117420 112013 73700 70207
18167 70207 96617 115667 119305 106532 128888 162309 172069 172562 153481 101000 103909 133098 224993
18154 224993 252807 218710 202293 196596 216573 224965 179368 143755 140856 172029 179953 202475
18142 202475 245952 254485 214751 153680 129708 140821 146367 162526 197507 195820 183809 186657
18130 186657 239865 245462 228834 205169 221204 257558 258371 283218 306404 388740 497424 567266
18118 567266 635402 631508 572913 571708 569205 596885 692661 811910 884944 895779 883704 873902
18106 873902 844819 875958 931564 990997 1104463 1211178 1307413 1466606 1721382 1987440
18096 1987440 2312666 2777618 3408157 4299218 5700018 8012168 11657237 16543798 20678703
18087 20678703 21458663 19178596 15893002 13535459 12897578 14213664 17509775 21318268
18079 21318268 22502145 20019698 15639412 11448154 8367366 6249192 4876222 3973490
18071 3973490 3337946 2898783 2598621 2348674 2189652 2070553 2021444 2006158 2026749 2056793
18061 2056793 2109665 2181844 2268032 2385747 2574356 2797243 3034046 3388807 3869747 4460002
18051 4460002 5321144 6655042 8807814 12286886 17460239 23290098 26397677 25177524
18043 25177524 21453369 17869477 16128863 16557151 19203370 23503152 26769092 26384716
18035 26384716 23250338 19825680 18118838 18647113 19845356 19475474 17248949 14296633
18027 14296633 12035849 11117173 11646563 13745686 16432405 17445659 15802561 12551790
18019 12551790 9270172 6785624 5161869 4168060 3528530 3061675 2706845 2397543 2160116
18010 2160116 1961870 1818512 1731474 1690828 1645759 1600565 1537283 1512530 1588683 1642583 1704014
17999 1704014 1800643 1989362 2243973 2540795 2961978 3585234 4534624 6100485 8600829
17990 8600829 12401263 16941328 19682633 18998799 16120213 13159073 11503364 11508514 13273153
17981 13273153 16419799 18967308 18584912 15438993 11393814 8021711 5712596 4245948
17973 4245948 3253691 2530346 2027870 1706663 1466935 1276014 1095868 953764 907858 848141
17963 848141 770876 692816 672445 633512 600223 578530 545807 543493 522430 475239 437034 397647
17951 397647 384326 358374 341692 310100 291431 261829 214765 230944 211768 176152 140284
17940 140284 166641 210789 228986 214042 178623 169460 167175 202100 171631 139247 162809 156768
17928 156768 117950 111620 95332 75194 75181 96062 127487 110591 103356 112167 132284 186055 195418
17915 195418 191225 208980 180731 185404 202224 240934 303148 316095 311564 281075 257258 222554
17903 222554 191722 180992 168758 169836 193596 188193 153439 117884 60111 24667 38155 55277
17891 55277 68673 60782 42304 58141 32003 31743 47180 1727 -29577 -40831 -21417 3676
17879 3676 33889 29300 53900 57350 66444 83048 62929 21918 15792 34867 44855 31624 40106
17866 40106 75605 57972 59578 60729 66887 110606 119291 123359 128688 149184 153018 134204 130515
17853 130515 134965 134376 163474 220338 192367 128488 140769 127638 105437 108449 114621 74242
17841 74242 48965 31246 -1741 5988 22757 10 23150 55698 60293 54245 46404 36691 61804
17828 61804 86694 64083 64268 66755 37394 33782 27288 58901 66973 11591 -16407 -27465 -13353
17815 -13353 13022 34466 4086 -35563 -8481 25727 70197 57778 30995 46621 20447 16321
17803 16321 40760 31654 13762 -44175 -27574 17058 13399 -25056 -41314 -57750 -22948 3
17791 3 3883 -4771 21030 14204 -15809 -40469 -46439 -25564 -20423 6349 27815 62337 67419 45130
17777 45130 40725 39845 33325 18252 16352 49620 46575 26576 71269 98312 90768 44027 2921
17764 2921 -24664 -39593 -50089 -22260 -13034 -22343 -1798 6497 7078 22429 36698 9394 -23572
17751 -23572 -56171 -63776 -41860 208 38074 25924 28274 48695 11933 42546 83129 45737
17739 45737 -1955 -31831 -30617 26618 70359 100060 96837 55865 -5265 26235 44373 54840
17727 54840 60408 96248 104806 100351 74991 30219 1591 36895 72341 92306 62508 39613
17715 39613 24628 8740 5862 2545 1372 -1599 9835 9417 -6184 18845 28204 17323 13669
17702 13669 -7612 -16634 26940 31672 17096 31758 35511 37652 30519 21546 36 25452 68659
17689 68659 29431 62064 60696 55432 36874 24039 25537 50950 38797 43974 21845 27671 31844
17676 31844 43856 42665 14598 18899 54258 101912 75811 74670 65752 80433 85931 110571 86233
17663 86233 58966 56288 104604 157363 164925 153478 134937 77347 59164 96724 126502 165014
17651 165014 141062 98857 68764 33306 35898 74168 111880 109578 119282 115166 121279 98576
17639 98576 105106 103737 82875 62391 97298 88976 55624 78175 115500 103755 117832 109718
17627 109718 104486 135777 156335 138786 130304 172987 186968 219296 230004 211504 190659 219974
17615 219974 277607 283021 263252 292921 285314 294181 327572 341134 349807 368074 374022 396076
17603 396076 419235 498155 563213 602648 658835 696143 749578 796962 825295 873438 960188
17592 960188 1094573 1209485 1306902 1394245 1465449 1577394 1740112 1993010 2305830 2697141
17582 2697141 3259025 3968989 4996968 6600259 8967294 12364109 16593002 20088173
17574 20088173 21059275 19502135 16917380 15059440 14797754 16356281 19145058 21346503
17566 21346503 20948851 18025039 14032688 10448110 7843448 6082219 4897653 4124805
17558 4124805 3587797 3236253 2987140 2755918 2613060 2515089 2575053 2663987 2750507 2907935
17548 2907935 3035582 3155103 3292404 3428956 3572146 3779905 4150557 4640107 5323742
17539 5323742 6279112 7605345 9586515 12550155 17001131 23371446 30845525 36418787
17531 36418787 37345000 34197114 29757244 26780451 26655468 29606719 34355004 37505385
17523 37505385 36061905 30535040 23560952 17378024 12849457 9774131 7700370 6288011
17515 6288011 5252755 4472225 3899603 3450399 3107523 2873728 2743113 2675792 2641616 2589466
17505 2589466 2522998 2465528 2400260 2375511 2449474 2541021 2663461 2842840 3143793 3539517
17495 3539517 4121924 5061591 6467981 8616079 11689762 15213679 17577838 17513700 15644941
17486 15644941 13445741 12141878 12292385 13873226 16147781 17277624 16116500 13230022
17478 13230022 9996930 7324242 5388982 4086564 3183755 2571417 2155594 1795278 1546802
17469 1546802 1365646 1238489 1114525 1003573 939952 888643 815933 743543 674909 580617
17459 580617 509417 493433 451228 431714 451557 423450 395300 383030 318334 298261 268000
17448 268000 243790 219691 210437 225975 250048 252151 223070 173265 193744 206466 195564 230424
17436 230424 224845 187640 197927 210825 208255 152364 102630 137534 165960 146716 123501 134441
17424 134441 142861 105298 75384 111903 138980 146784 101751 69038 53256 25610 20979 21763
17412 21763 32992 67479 67646 51998 53060 54531 29615 12413 24153 55086 82078 76437 99700
17399 99700 117783 116679 103991 93438 68616 72117 44037 41632 42797 78037 90342 29220
17387 29220 3294 20606 6325 29968 16331 -14277 7691 31247 21727 19805 -31119 -41909
17375 -41909 -20133 18364 65905 84565 94011 52236 73567 85726 75279 44660 54037 39963
17363 39963 31808 24614 32287 32438 22480 -720 -22103 -9067 5658 -23740 9785 8539 13196
17350 13196 -8048 -11533 11270 -1005 -24079 -15277 3134 -15422 -7256 -5576 -4187 -2970 8888
17337 8888 -14915 -36875 8234 65051 64209 77596 46369 -1503 -6076 -3934 -29877 -13709 -13842
17324 -13842 -23702 -22685 -36628 -16290 -282 6175 -2602 13854 4739 8254 44661 46201 43558
17311 43558 37882 12245 29539 -14610 -32890 -14985 380 10115 17382 -14637 -40326 -1387
17299 -1387 3291 -8074 -47754 -46907 2486 -28185 -55897 -30371 -22654 -31019 -23635 15318 22136
17286 22136 7611 29769 35102 9762 -46382 -44754 -3491 38874 -9996 -9829 19358 37383
17274 37383 26037 2565 -3751 18792 24152 9143 2442 14180 14363 18087 -2985 -9776 1165
17261 1165 6310 27290 53510 25442 -25571 -68097 -48983 -18752 -9237 -10498 -13742 -86111 -102244
17248 -102244 -75864 -67553 -21853 28790 17988 18925 32554 29487 7167 17575 -3246 -21088
17236 -21088 -30820 -54431 -62998 -47127 -40207 -66395 -100514 -76527 -56810 -63200 -71796 -56705 -80656
17223 -80656 -95563 -66672 -22558 15668 16562 -36281 -65635 -47393 -3164 -9149 -17775 -11711 -1849
17210 -1849 5292 -5120 -16242 -33195 -26248 -19979 -36749 -52658 -117931 -98472 -50163 -49603 -42770
17197 -42770 -71148 -71453 -33267 -23326 -35328 -40115 -29007 -11911 -2956 -29 4312 12390 -3670
17184 -3670 -34925 -18217 12406 24113 33704 39607 32489 49001 42052 11552 6657 -15580 -46877
17171 -46877 -62895 -89074 -87194 -67360 -31914 -1656 4798 11445 -28276 -30104 -28590 -68278 -71866
17158 -71866 -84116 -89568 -57985 -69722 -61942 -71230 -65907 -69709 -58086 -27564 17072 -2007 -35574
17145 -35574 -53065 -39595 -57963 -65991 -58032 -53897 -77409 -45171 -75257 -60451 -16978 6702
17133 6702 18772 38505 4946 -48795 -83974 -60926 3758 4874 11741 40936 8112 -18676
17121 -18676 -39934 -34096 -17291 -26067 -74958 -74610 -62123 -40947 -5949 3249 -7449 -8933 -6934
17108 -6934 -14661 -5915 -1536 12362 654 6254 1545 11286 1584 -22100 6962 19851 20742 13816
17094 13816 -27516 -25656 -19679 -12860 22500 24499 3155 -7536 -3697 9395 6732 142 -44124
17081 -44124 -65380 -32478 -5725 14519 20592 24335 -3704 -9184 8111 -18721 -37408 -41988
17069 -41988 -35439 6845 -20073 -41383 35060 53222 58843 58257 20327 16830 25444 32598 -17017
17056 -17017 -25524 -18443 19514 10153 30483 51703 60193 64709 57547 54214 48720 88667 108311
17043 108311 114135 104458 99415 91899 70188 63788 92642 132123 57879 22277 32538 19160
17031 19160 -37329 -45888 -30420 13407 4644 19628 21639 -20761 -19020 -7897 -25500 -26157 -59966
17018 -59966 -59197 -58115 -33542 -29675 -28915 -10718 13501 56440 39209 994 -9245 -7523 1723
17005 1723 -18407 32959 105758 147867 160216 161468 155721 133650 102784 93332 143063 156574
16993 156574 152807 135534 108564 82413 47667 55525 41541 4629 -5055 -10812 -21518 -18274
16981 -18274 23309 39965 28152 -17256 -46234 -45549 -25285 -52855 -102782 -119380 -82221 -43721
16969 -43721 -38013 -64161 -43398 -22704 -22963 39691 69534 35825 44046 67138 71873 85729 63501
16956 63501 33102 -20859 -9139 16078 42789 -7161 -2776 34429 48615 96 10695 53704
16944 53704 15984 -42384 -42698 -50274 -55028 -53634 -32928 -12699 -32680 -64965 -69934 -92861 -107741
16931 -107741 -82090 -28674 -40846 -95320 -103223 -85771 -67908 -13668 3921 17424 20575 11581
16919 11581 19389 -28058 -103983 -58324 -52786 -48778 -43358 -30593 -22039 -37851 -40540 -25229 -49320
16906 -49320 -82184 -62531 -49114 -13866 36033 24566 27156 35693 -5297 1943 3971 35112
16894 35112 28661 -51536 -68175 -74507 -73154 -77663 -76353 -110659 -101613 -66128 -24839 5140 2357
16881 2357 -16434 -32899 -66551 -65459 -60132 11751 -612 -30242 -41033 -68421 -50047 -15053
16869 -15053 -3679 -20245 -577 9845 -4436 -28405 -60567 -73695 -75162 -42187 12451 6153
16857 6153 9653 -4991 -32894 -58594 -103474 -82716 -42746 -20933 4317 -10669 -27883 -4878
16845 -4878 -27462 -45224 -31553 -7191 -53706 -59827 -29893 -77 16121 -4367 3041 8
16833 8 4860 -21058 -13344 -21380 -44957 -17771 -14179 -18640 -8618 4910 6364 -6904 -7466 -30372
16819 -30372 -48460 -18676 -45928 -54387 -41599 -24891 -50325 -39334 -17070 -49432 -69514 -31146
16807 -31146 -30916 -53543 -36752 -8031 17574 55942 54720 36846 24661 -1742 -23063 -53997
16795 -53997 -73139 -83544 -74659 -46452 -15082 -11757 -44633 -62017 -42308 -52755 -61256 -50265
16783 -50265 -15309 24700 1974 17104 9946 23784 -500 6466 38140 58878 36119 9116
16771 9116 -8359 -19911 1476 10780 2070 32153 67202 27214 2264 -3886 -152 -4483 -15197
16758 -15197 -14539 -1778 -13682 -11011 -25609 -39720 -1931 353 -13409 -15805 -39190 -30778 -13882
16745 -13882 -13108 17774 515 -22397 -29178 -40025 -47117 -76344 -65393 -59056 -59147 -48186 -30297
16732 -30297 -43293 -54043 -27797 -1204 -3398 -17072 -10245 -47431 -52475 -61202 -52097 -33823 -15800
16719 -15800 -6167 13186 37353 57526 40215 26618 4751 -37029 -49082 -75574 -90462 -71604
16707 -71604 -93302 -72404 -7976 8147 -6609 -13520 -14460 -35519 -70023 -66802 -59617 -49298 -59793
16694 -59793 -59418 -50397 -23434 -25774 -23532 -25040 -22530 -47450 -55842 -38979 -7727 -8077 13726 14166
16680 14166 -16234 -17196 -25801 -12611 16568 38258 17997 -9752 880 3338 4575 -16924 -70543
16667 -70543 -65233 -44562 -59573 -87631 -91080 -76929 -70547 -73420 -89178 -108116 -84042 -4357
16655 -4357 6077 -7056 -21665 -20988 -14798 -19334 -31199 -53309 -36906 -15495 32083 34532 26384
16642 26384 12878 2044 -6534 -20142 -18898 -44827 -78837 -67133 -6457 37841 24534 18468
16630 18468 7207 13938 22892 6544 -45827 -65368 -41161 -2126 -3684 -25917 -12859 -6446
16618 -6446 -15657 -9071 14347 5571 -4923 -25465 1882 34385 37352 -7871 10057 -1901 -8738
16605 -8738 6305 -988 9187 -13292 -50962 -49662 -44985 -20574 10132 33001 15584 9883 -13679
16592 -13679 -3610 19440 7491 -1593 -20243 -20559 -28777 -38987 -31890 -29365 -45556 -30515 -68939
16579 -68939 -62695 -39973 -37671 -17193 -8485 -10714 8354 -32890 -80717 -62197 -69905 -63475 -43787
16566 -43787 -40387 -33769 -7692 -21763 -5301 -1932 -23860 -1391 47712 28375 -19108 -25168
16554 -25168 -46059 -57506 -53270 -26549 -71377 -75320 -53611 -34588 -25389 -5848 -289 7136 -39998
16541 -39998 -59873 -57626 -70781 -68117 -47284 -45722 -66620 -54005 9762 -3814 -77922 -81031
16529 -81031 -36498 -42410 -45590 -85337 -80215 -69958 -63368 -77395 -112732 -60761 -25903 -34138 -45805
16516 -45805 -24819 -11591 6393 4013 -6297 -31766 -88446 -70327 -72274 -67304 -55842 -47365
16504 -47365 -21316 15632 19282 -34542 -65172 -25032 -8025 8607 13951 9471 -16092 4748
16492 4748 47767 27559 -57088 -71621 -40598 -12688 5407 -3621 -18196 -33440 -56974 -57891
16480 -57891 -35411 -55492 -42063 -43437 -43854 -71052 -56712 -39684 -15349 8440 22094 -5101
16468 -5101 -11819 -14036 -12255 -356 -12512 -70530 -89502 -98359 -122934 -73931 -26314 -1717 -44679
16455 -44679 -63122 -62386 -47772 -11873 -34523 -35899 -15526 4365 -4910 -34856 -40078 -21014 -3033
16442 -3033 12049 9053 22496 23910 56069 43311 -750 11995 -25135 -47696 -37207 -46033
16430 -46033 -41671 -11846 -19448 -12179 -3702 -26094 -57087 -95650 -102237 -101015 -83373 -52934 -52756
16417 -52756 -62267 -72938 -21506 10078 -56821 -72485 -52156 -45929 -54959 -84699 -73303 -31022
16405 -31022 15979 17879 10462 -14255 9230 34720 13258 6345 -18904 -387 18001 32830
16393 32830 21325 -16136 -4526 8029 3638 -39085 -32280 -69696 -88363 -87312 -70662 -74349
16381 -74349 -76201 -50357 4943 -19115 -34142 -62082 -53967 -39355 -26254 -56275 -114473 -85314
16369 -85314 -61170 -72951 -39876 -41221 -94656 -104062 -74434 -53221 -63684 -38078 -6078 20039
16357 20039 -24165 -74146 -67385 -46583 -66478 -73128 -44316 -23971 88 11456 20410 2734
16345 2734 -40229 -61892 -62452 -24293 -11366 -56604 -90727 -39837 -34973 -37800 -37274 -43700 -67621
16332 -67621 -66563 -47118 -29799 -31018 -37773 -15762 -9493 409 21516 16915 -23528 -31816 -41401
16319 -41401 -32300 -33866 -33617 -53610 -45864 -11428 -21916 -28165 -10898 3995 37100 40657 58720
16306 58720 82590 60868 40024 10558 -2927 -33499 -62719 -66699 -49876 -30831 -10207 -14483
16294 -14483 -29858 -22309 15452 23687 9341 -28536 -32085 -17339 -38269 -19759 -9364 -9300 -50568
16281 -50568 -64782 -86224 -65770 -41272 -51005 -47852 -20364 -12808 -13284 -33230 -71723 -63549 -48636
16268 -48636 -35298 -51198 -76144 -97567 -100184 -63081 -9024 -23145 -35264 -40596 -34561 -31708
16256 -31708 -49738 -24156 13334 10626 -20205 -38465 -59333 -103527 -101607 -94678 -36420 5054
16244 5054 -9027 14902 33404 33204 33337 8331 -17234 -65288 -48748 251 10247 -7887 3612
16231 3612 20838 -24303 -14676 -6966 -1411 -25347 -25725 -18853 -5415 20126 23456 29156 15300
16218 15300 11354 -6238 -20282 -20465 -3874 20258 -488 -26431 -41656 -48632 -39120 -44687 -35821
16205 -35821 -4874 -13738 -44418 -32093 -17494 -56473 -52733 -12740 30085 29523 -2357 -46894
16193 -46894 -39634 -8277 8421 38 4070 3693 1764 20903 17366 12215 -29978 -75660 -69454
16180 -69454 -27547 -15864 -35293 -17699 14113 27442 40909 37244 20807 36740 18412 -20222
16168 -20222 -35921 -32990 -26725 -6695 29928 29868 56289 64973 44856 23565 41170 27367 6507
16155 6507 -12190 6319 10904 7948 6929 -19726 -30570 -2618 -1456 36493 70694 51879 65194
16142 65194 78737 79033 99511 128970 125234 108977 92415 87094 98144 117668 107543 90166
16130 90166 70448 78002 77032 38675 7840 47102 37497 21944 -1357 1934 18427 -753 -2112
16117 -2112 -670 929 -9709 24528 42503 8757 -31046 9826 19898 43463 36928 44682 60914
16104 60914 62773 67172 53203 58653 69658 106706 114222 111729 140322 147087 143068 144295 134437
16091 134437 155375 196516 220983 251444 280673 298400 309523 327857 372334 411621 480801
16080 480801 543873 514270 478806 525561 580960 628778 719508 817330 854115 879009 915382
16069 915382 973317 1077159 1260704 1570023 1933533 2213764 2343780 2340711 2265139 2145844
16059 2145844 2083708 2186019 2424662 2628414 2607484 2386383 2103847 1795867 1538340 1368196
16049 1368196 1242183 1115413 997476 850737 780585 725461 647278 595750 570719 518607
16039 518607 445864 377530 309510 270371 264428 222714 187639 224559 232859 249562 224870 153965
16027 153965 113372 110692 132694 71354 63427 103251 96133 83249 92774 82823 82286 50773 56354
16014 56354 17875 -5914 -16114 -4209 25032 59252 55204 54804 56687 86158 100527 116090
16002 116090 109931 51445 -3365 -13652 5758 -3573 24339 43333 47685 67487 88126 87668
15990 87668 86751 100472 156348 126033 80665 110098 135285 170267 144808 153794 122943 84583
15978 84583 64301 42535 34061 7646 17018 76248 110954 104854 83573 96094 89962 78416
15966 78416 55046 40775 29869 15878 32174 28176 -17768 958 -10711 -62313 -88242 -54086
15954 -54086 -43497 -19933 -26135 -33544 -11685 22544 1343 9333 -27346 -45181 -55628 -67566
15942 -67566 -24608 22990 20193 13551 1542 14099 15175 -4238 -3314 3361 -15371 -1258 9188
15929 9188 -4221 -44476 -23679 3604 -12136 -6135 26974 43303 46806 32532 12580 -32558
15917 -32558 -67621 -50748 -42592 -8194 16382 6355 8677 3681 55105 62167 26476 -5674
15905 -5674 -18536 -8776 -14441 2098 -13330 -15325 13333 26264 16038 11403 10103 -12219 13885
15892 13885 9178 3684 21365 -4967 35518 35215 -21435 -25779 -16617 -2487 -16258 -22935 -29233
15879 -29233 -24470 -17259 -13886 -18483 15072 -17762 5081 13376 -22222 745 23745 26147 49731
15866 49731 -15658 -44842 -85661 -52823 -14633 -18742 -22722 -37168 -14306 961 -25579 -12155
15854 -12155 -23392 -19859 6189 -15080 -33658 -21936 -48648 -48733 -57173 -48964 -31543 -35500 -21625
15841 -21625 -24383 -56932 -51733 -59232 -59211 -59043 -27068 -19580 -10702 35843 16873 -60264 -61981 -38446
15827 -38446 -47996 -61706 -64512 -91947 -92125 -72341 -42159 -61175 -41658 -24184 -56580 -58663 -7105
15814 -7105 1691 37852 68705 82091 59110 13357 -41824 -37475 -12390 -17142 -11582 -21058 -64841
15801 -64841 -64092 -52266 -43693 7682 -24670 -23315 -22679 -29850 -49628 -48223 -26714 -28761 -6410
15788 -6410 1714 -26899 -31035 -25623 -3688 -20297 -10988 1333 -7520 5390 10897 12389 -6627
15775 -6627 -6224 -10443 -8221 6823 26538 30804 -8016 -38078 -9717 25606 30272 37316 -9727
15762 -9727 -19432 -2804 -21352 -14757 -43456 -45851 -42573 -36357 19376 34832 33116 -12141 -5543
15749 -5543 11884 52163 65965 46984 43982 41462 32318 42715 40490 34751 25726 13963 -2063
15736 -2063 -7371 1324 6367 -23487 -36125 25836 76280 52581 -21990 -72946 -30730 -20380
15724 -20380 -10642 -8141 -13079 -3706 20888 884 -26725 -47109 -36797 -14599 -43010 -62480
15712 -62480 -43837 -19233 -19863 -4921 28373 12567 10882 19568 1105 -24693 -15014 -6232 -3216
15699 -3216 -30771 -27680 -25452 -20606 -22986 -32751 -19202 -21107 -33336 -23828 20957 7991 -10704
15686 -10704 -3494 -22845 -40746 -60909 -70836 -40028 -27780 -42594 -47961 -15255 -15599 -4758 -11632
15673 -11632 -14290 -27012 -43299 -45655 -15571 11178 33923 10423 -979 40418 56868 24601
15661 24601 -5320 -1285 -4603 -34254 -31151 -13670 12643 19959 -6977 -6303 -26115 -10862 786
15648 786 -22232 -30520 -30834 -35474 -12457 -1829 -45326 -48201 -14201 -8078 -15136 24507 15644 2920
15634 2920 -342 24486 9084 -9147 -6202 -15774 -2782 -7528 -19594 -26706 -12262 -6081 -10520
15621 -10520 -23167 -26770 -6892 36215 57684 55861 38582 14190 -14132 2741 23151 -2483
15609 -2483 19877 88958 105073 58937 13046 5351 4434 5418 -16387 -29855 -15790 34555 66771
15596 66771 53172 7321 -34513 -68939 -100154 -124942 -95677 -40230 -33150 -37376 -38051 -20447
15584 -20447 21920 -19349 -76036 -35238 8245 -10888 -1707 21932 11220 -18216 -40655 -15135
15572 -15135 -17240 -9381 -23722 -37562 -13013 8217 19964 13610 -29381 -72164 -90291 -62045
15560 -62045 -34585 3854 19702 22906 9107 28540 24859 -2404 -20480 -10438 -68389 -66808
15548 -66808 9111 6424 -32745 -66813 -56211 -7058 882 13069 16615 4967 -12106 41731
15536 41731 45448 14123 9617 3096 -65718 -70723 -36206 14774 55218 53860 17066 -8794 17437
15523 17437 32274 19545 18758 11994 31856 30007 8772 -12807 -15663 16055 22146 9601 -8320
15510 -8320 -6414 -27861 -1593 8588 25500 -1222 -39658 -17603 7149 -6044 -30384 -17618
15498 -17618 21403 10120 1924 7287 46850 45519 53362 33433 -19528 -63128 -76676 -94019
15486 -94019 -51885 -50736 -51415 -43594 -22011 -7291 3020 -22175 -17447 -23706 -10063 -23416 -19640
15473 -19640 -4080 14699 7584 -774 28066 31407 -18774 -63927 -38290 -28046 15794 -5274
15461 -5274 -34139 -55544 -40755 -30574 -35672 18973 21898 24933 -36168 -87209 -67541 -24182
15449 -24182 -1865 14323 22585 35311 28192 -7449 2374 -10059 -19829 2441 20294 20389 55833
15436 55833 29724 -25792 -62306 -58960 -48091 -48229 -68356 -76115 -52521 -10472 -26703 -35307 -59293
15423 -59293 -44767 -13844 12685 1405 -19264 -29812 -34571 -66116 -62306 -13639 -47130 -68634
15411 -68634 -73048 -47362 -38879 -38318 21209 42944 28648 -6565 -17569 11973 13190 20642 24032
15398 24032 42837 47349 56033 10733 -8209 -4735 3695 7806 -22610 -34097 -40997 -31106 -21791
15385 -21791 -44273 -29036 -22182 -34010 -59976 -67928 -74535 -84134 -54688 -50212 -51868 -49822 -20617
15372 -20617 14807 21026 5095 -5258 -25882 -26345 -18131 -6437 -3079 -15820 7510 22622 42811
15359 42811 71833 93647 29962 -32718 -3352 30409 -1696 -8995 2368 76601 59828 30367
15347 30367 -9315 -25611 -48728 -34086 -18332 -52654 -29043 19754 -11 -10959 -13321 5473
15335 5473 -6949 -56352 -65900 -33390 -32450 -33452 -40800 3838 -7175 -23550 -34154 -48387 -26658
15322 -26658 -19832 -13950 19814 43013 25783 11909 29752 36859 17009 -43015 -64213 -65746
15310 -65746 -61477 -25917 -51705 -31243 -19200 -27566 -20628 -29529 -31504 -83463 -74534 -83703 -50644
15297 -50644 -23631 -18175 1568 4817 22542 18948 37034 37715 -11029 -13069 -11199 6883 20982
15284 20982 10974 -3258 7274 23187 24395 47980 33677 40380 45753 12800 23881 21982
15272 21982 617 1780 -26482 -23061 -13774 6168 -29396 -58188 -28585 -20431 -51113 -38352
15260 -38352 -22213 -8760 -1741 -9505 -41659 -14185 12670 -8319 -36713 -22153 -3761 -45884
15248 -45884 -42787 -17146 15882 33095 31668 -271 -2158 -3379 -30839 -31385 -13759 3556 -1892
15235 -1892 -1805 17740 55701 76602 70852 62997 78250 85663 68393 19306 40716 25681 43475
15222 43475 54873 29979 -2133 -5184 -32866 9651 19300 -10580 -26258 -27788 9568 37247
15210 37247 58963 71732 27825 -11176 -61863 -42618 -4208 -37637 -13893 -7366 -739 -5508
15198 -5508 17486 40648 48510 24876 -3477 -5417 -14228 41152 109026 66829 63837 35491 2292
15185 2292 -28484 -28752 -36817 -22592 -3561 -5160 -27660 -16895 22838 24216 18304 23455 5946
15172 5946 -748 2130 561 -25877 -39405 -17666 -21320 -17730 -14181 3861 46668 21002 37756
15159 37756 36188 35931 32099 48975 46010 22997 -6881 -2069 -8472 -33633 -49437 -80485 -48002
15146 -48002 -20767 -23589 -55252 -36797 5403 16382 -20691 -32168 -902 -5547 -16480 10986
15134 10986 18461 41637 14871 32957 25463 24218 5609 -2142 27426 44552 -6968 -25273
15122 -25273 701 988 10556 -34 -17856 -44334 -29390 -21435 -31891 -27270 -23646 -34112 -7721
15109 -7721 15106 18115 -8091 -18517 -44061 -75723 -45287 -7638 31129 -13629 1243 46450
15097 46450 31395 39843 25329 32549 21786 34884 30221 25986 26840 4943 -17309 -30230 40543
15084 40543 75761 64134 30001 31808 42613 -18622 -54747 -56494 15037 67392 62891 31361
15072 31361 463 -12311 -809 -32337 -29599 13116 26765 28897 22176 7567 60405 52749
15060 52749 21102 12547 -13676 -7892 -20340 -7649 -22349 -1305 28888 69887 88825 78613
15048 78613 41918 52150 79393 82401 48358 11772 22877 39967 48308 77432 108925 52834
15036 52834 18909 28335 7209 -10164 17357 49853 67035 33084 12316 16623 33851 88781
15024 88781 88317 51702 25259 22901 28630 83764 103553 116376 106469 56830 51784 61755 61865
15011 61865 52122 11241 18629 63271 70087 83942 81091 39403 41128 53758 32650 64743 39675
14998 39675 6581 9860 24452 8159 -15710 -22691 -6533 5079 93719 159782 151970 114896
14986 114896 73261 60584 61404 31328 12495 17770 41137 42319 39597 7220 -12931 35024
14974 35024 68269 50489 21264 117 -15745 -13778 15094 28699 -12426 -15621 17703 37475
14962 37475 37192 41611 45294 34656 5434 11379 60367 88641 67589 29389 16020 14178 12360
14949 12360 38283 71721 78430 89892 108665 130678 89856 21727 -38716 -24097 -34248 -8993
14937 -8993 -11207 13098 68230 54038 16307 40096 48501 -21775 -43720 3179 16836 53
14925 53 20739 59890 94671 98640 22986 8911 44380 110075 122274 136105 133988 78281 41154
14912 41154 58648 114884 124276 78408 50902 4862 -26685 -6976 25216 30709 65078 91899
14900 91899 86112 78991 62748 82017 93311 78517 51910 32257 14024 33171 38246 5659
14888 5659 30782 19926 24843 35547 56612 46788 44315 26572 9444 7105 28698 55671 11900
14875 11900 32066 34404 35464 59559 21089 28730 71327 51237 -2926 15419 52699 80978
14863 80978 84691 69383 84967 113110 94956 64969 49808 70036 73331 82264 29269 1598
14851 1598 32779 83733 56481 5690 11960 36646 51675 60198 76200 111427 124102 69619
14839 69619 53954 79819 88733 70885 59037 9948 13036 27719 11431 -19644 6066 22443
14827 22443 42607 22385 31066 59267 71767 38031 29949 55349 97404 135856 135320 107121
14815 107121 96978 74221 45271 71187 89977 61752 52098 121503 131801 115720 99399 65635
14803 65635 58545 51069 92914 68795 51375 86062 128798 175714 170106 161842 159005 139247 186585
14790 186585 201400 201681 157846 135895 173337 171608 150867 167100 164471 184182 238265 262069
14778 262069 227198 191247 185867 225289 240974 233972 221805 196949 184401 178468 165263 224842
14766 224842 228341 261268 270486 209124 200984 225828 243984 235999 244927 296901 331209 320622
14754 320622 301957 312445 319210 325797 342330 326464 318331 334581 330157 372323 395862 410323
14742 410323 409238 446939 494939 497306 481246 485719 568396 671774 767368 810419 838486 899442
14730 899442 941702 987665 1088497 1165473 1239234 1322141 1398261 1458901 1604514 1759234 1910991
14719 1910991 2093704 2325124 2611664 2926227 3256521 3653278 4049553 4520442 5129538
14710 5129538 5802438 6584195 7468431 8449223 9449535 10405329 11287000 11940447 12343685
14701 12343685 12455454 12283205 11995278 11523641 10994935 10406245 9813569 9311172 8895151
14692 8895151 8556318 8296153 8096275 7961692 7908351 7957139 8085648 8311722 8624744 9030293
14682 9030293 9595243 10321319 11143640 12125972 13343267 14906920 16754111 18835015 21281691
14673 21281691 23986863 26759787 29379369 31563582 32906538 33138080 32246113 30386980
14665 30386980 27934237 25215812 22517787 20006283 17772771 15866267 14259937 12933554
14657 12933554 11874135 10972631 10295141 9766428 9365174 9063265 8872745 8791685 8815403
14648 8815403 8895390 9107306 9429193 9806270 10325619 10926915 11597418 12347180 13184329 13976475
14638 13976475 14714416 15283751 15606652 15607451 15215647 14528679 13585225 12450303 11255280
14629 11255280 10082344 8957074 7936640 7056964 6283051 5634598 5052452 4530432 4100701
14620 4100701 3728241 3398363 3122704 2859654 2624072 2389251 2201631 2031044 1857783
14611 1857783 1739862 1605945 1456008 1377520 1275160 1202698 1125830 1049925 1011336 983444
14601 983444 967670 935694 879523 820032 765505 700408 660022 616312 569760 561962 567328 586702
14589 586702 570186 554249 514508 489298 511905 550434 576106 542462 543644 553652 537552 523445
14577 523445 479379 455014 440884 434679 401752 365098 330555 306064 316146 311799 280285 232904
14565 232904 233286 236295 222701 266533 303589 327044 305409 331117 308710 250877 221358 221625
14553 221625 167301 158337 157029 156930 158299 146319 149220 106974 91376 94521 123902 137783 132314
14540 132314 132689 112560 117334 147313 168782 170805 136938 98241 102325 124645 128593 84127 77351
14527 77351 92887 107986 121173 128920 99679 114746 131561 147597 187508 168031 132103 134465
14515 134465 169881 191130 177183 109263 117765 109848 64808 47168 72196 82497 86597 119908
14503 119908 128111 124524 149313 167359 167640 116105 76360 56976 50835 141119 203236 213453
14491 213453 188714 152099 152626 160465 153027 130770 119673 141255 165401 155515 126029 149672
14479 149672 135405 137684 115096 114461 156329 154739 164575 166583 152427 131562 93309 102138 98353
14466 98353 102592 105655 120221 129619 147266 126330 116977 105328 104986 150526 106508 63161 66361
14453 66361 86396 118499 168624 136646 88021 121405 125411 90619 101119 87519 86652 102545
14441 102545 86332 58198 43841 64790 123136 143220 141899 133761 115862 78119 81465 94815
14429 94815 114472 88510 54976 69705 85917 113561 123531 112804 115715 140380 164989 166237
14417 166237 140485 156650 152199 146976 141627 171291 223142 218625 194135 215451 173725 148391
14405 148391 129956 144651 165750 174412 155814 143461 138700 120050 106423 139886 132337 104476
14393 104476 65465 85053 69087 80076 140250 137972 124683 115109 150519 148256 162829 137208
14381 137208 78815 71436 114407 141421 158362 149707 133221 132481 140550 112241 111206 150439 134443
14368 134443 110882 90595 84984 105870 72873 110818 138088 110125 112005 120141 150917 185303
14356 185303 209413 235905 241766 245329 246606 218343 204590 183116 143873 153420 126566 106827
14344 106827 126223 146715 179656 177173 164850 121760 100723 119969 112219 107774 94929 99767
14332 99767 135149 156241 146409 158098 184879 185063 227380 211011 185213 170208 162350 158306 194590
14319 194590 233870 274814 283898 279661 289826 264708 269412 271302 298229 337213 361430 368786
14307 368786 361848 356410 357237 373756 437165 505677 536951 517860 536119 524701 532202 567462
14295 567462 577886 562395 511435 494976 488555 513251 567589 558511 533464 526776 540063 529652
14283 529652 543412 535163 532145 543180 544818 545969 520887 514441 503357 535689 588520 640077
14271 640077 659574 658610 705591 768543 853192 897970 953132 1013063 1117234 1177150 1231763 1263803
14259 1263803 1261239 1199591 1144510 1088389 1058376 1029260 960809 908866 901796 893721 842182 790678
14247 790678 814145 858134 815925 830208 824094 789575 757391 807640 881816 940041 976457 1028529
14235 1028529 1065146 1065426 1124219 1183303 1251655 1342121 1461330 1513921 1537140 1575584 1606153
14224 1606153 1606186 1619438 1677098 1730522 1758346 1813193 1880085 1935978 2012281 2079818 2165415 2288858
14212 2288858 2430085 2558907 2718868 2931884 3131179 3383616 3671047 3967187 4299175
14203 4299175 4675403 5078192 5564564 6188353 6927155 7728092 8619241 9685547 10873572
14194 10873572 12277514 14020892 16106610 18646241 21637278 25178476 29447411 34489274
14186 34489274 40226977 46446543 52775860 58612350 63336808 66381880 67356645 66296668
14178 66296668 63556649 59620674 54994880 50261683 45813114 41816308 38386624 35502605
14170 35502605 33129896 31206600 29691784 28490410 27645940 27125256 26886859 26955118 27371023
14161 27371023 28088630 29040198 30424583 32249432 34503067 37222921 40386218 44035498
14153 44035498 48048133 52081070 55793932 58742399 60390084 60317165 58370342 54732023
14145 54732023 49811938 44246247 38553524 33199215 28409031 24185811 20607493 17677180
14137 17677180 15230544 13145742 11430181 9982264 8789425 7760385 6889783 6121691
14129 6121691 5434107 4850254 4410842 4020401 3669064 3385214 3135113 2905043 2679842
14120 2679842 2498692 2348444 2190143 2075724 1928820 1792286 1657515 1583029 1537516 1393331
14110 1393331 1254975 1177971 1137178 1119769 1086557 1033901 980930 956870 914992 856476 807891
14099 807891 810183 755052 743816 776287 718403 676357 651610 633214 594441 607453 603339 590812
14087 590812 586750 599192 563216 532663 535287 493202 447216 465357 463605 437786 430732 413802
14075 413802 389551 328319 306502 255705 216244 210041 212181 235471 291803 313681 292198 275904
14063 275904 271637 286666 328030 333897 291801 282274 288411 314067 309007 300812 300816 252397 201911
14050 201911 189042 197639 216342 244015 243105 231604 230907 205308 194206 187842 167967 183481 181491
14037 181491 219918 234689 221264 246835 280937 235623 214549 194326 174511 148442 150491 172906
14025 172906 197339 165451 145639 124141 140168 140285 149321 119072 80698 76411 81247 83942 88305
14012 88305 84719 123133 168233 132452 102541 145170 151935 126951 128368 109003 92949 104005
14000 104005 110980 119084 126073 111911 107141 89978 67634 81754 86373 62681 72875 107983
13988 107983 136020 123748 51081 -51627 -82092 -43041 -21403 -6990 5129 -6558 -8885
13977 -8885 3016 27730 47192 38925 1927 5847 12879 23810 40874 54842 38473 56558
13965 56558 31885 14065 28684 47036 68353 65910 83471 86020 83168 56464 26993 41432
13953 41432 23295 34897 32341 5303 32877 53661 47019 32728 17348 7450 16413 42066
13941 42066 42587 47393 52440 53935 52943 66962 73289 70648 53646 533 -32286 8048 14210 -3232
13927 -3232 -11295 -28279 -58900 -38418 8962 43123 53428 -5658 -19472 5127 59708 71161
13915 71161 85578 81694 42548 29678 -5462 -43264 5523 34396 26654 38265 29431 -3355
13903 -3355 2209 -17576 23363 49201 16492 25383 31129 -16439 -51461 -24453 -5948 -5670 6815
13890 6815 12656 -6132 -8014 17227 48665 23863 20094 26706 4737 -35273 -63816 -18272 503
13877 503 -19620 -29239 -4895 25299 17638 43501 58070 56979 2224 -31540 -11798 -14179 8134
13864 8134 32942 23286 -10320 -19462 14524 37052 32907 -11523 26526 44889 45084 17723 -11167
13851 -11167 3399 26508 18270 -4698 -8963 1613 19199 73426 104375 98569 55801 38845
13839 38845 57280 53429 54101 25694 52 -16210 32862 64293 95395 130931 133028 137072 152131
13826 152131 146875 193746 233241 223274 241500 268309 285541 326842 348327 354591 413072 433624
13814 433624 416137 434866 419628 433658 529751 617432 633589 637425 642045 647389 615399 594416
13802 594416 567136 567791 533897 454368 446255 440304 425431 489160 550769 528616 462642 410854
13790 410854 395286 427682 441186 424346 482371 524350 584908 659874 734719 789906 855260
13779 855260 919638 967112 1065852 1224275 1312457 1401728 1505222 1522393 1563161 1578369 1552147
13768 1552147 1554843 1512813 1386108 1235270 1097685 1001902 932817 872128 795494 684051 593862
13757 593862 546914 514934 482018 429268 408334 390108 339158 331347 333760 357734 371604 407851
13745 407851 490854 584517 642808 713135 811971 905493 967298 1050643 1138903 1160266 1175593
13734 1175593 1146678 1124152 1117720 1097609 1092021 983107 864135 771338 722016 665086 591398
13723 591398 499098 426571 399110 353080 365868 367189 298153 246594 190142 185526 208597 219421
13711 219421 252842 287792 277709 294849 290267 272974 269797 289897 272242 304630 317245 308520
13699 308520 333763 350830 363119 365979 353489 326122 294788 273266 232506 202247 187451 173116
13687 173116 181862 164400 140064 91930 58278 109188 124222 96149 101418 93641 85362 12222
13675 12222 -2229 51363 77973 68119 59001 52956 68647 41634 48816 70054 20705 31210
13663 31210 61701 59311 102882 136558 150062 132913 112165 119496 121336 97519 90792 44231
13651 44231 -836 7475 25019 18930 45058 82210 68636 55270 63716 69691 72326 54733 89583
13638 89583 132380 166258 172075 183614 169289 139928 98886 81121 66594 44634 50615 79713
13626 79713 74615 91594 76043 84264 96374 99088 99033 99202 84967 54803 27796 45131 63741
13613 63741 113893 117028 108202 124112 105413 85551 115886 141233 147582 157874 197557 227443
13601 227443 197024 226591 244311 254045 300200 301150 315496 363548 406931 453120 551814 626096
13589 626096 685010 817956 970506 1099854 1312566 1515598 1698782 1850206 1978148 2084904
13579 2084904 2072176 1973362 1862600 1713602 1538696 1355857 1202719 1071047 988630 945926
13569 945926 863236 823599 787921 761030 760227 753691 741070 771230 841523 895506 898046 950247
13557 950247 1029636 1131871 1241362 1367501 1545716 1725965 1864745 1965776 2026593 2022178
13547 2022178 1941152 1794572 1649651 1500120 1294509 1120012 974173 812776 664231 568635
13537 568635 520981 447896 411382 391460 385979 393209 370179 360125 328017 321315 345856 374351
13525 374351 354865 304964 296102 279657 251223 243026 214406 178521 171022 142265 101134 89375
13513 89375 120692 106487 82709 55648 78569 83956 33894 63970 110936 104220 70222 65532
13501 65532 69534 60341 52951 46493 47012 55295 49529 72361 54409 37586 59847 52241 39481
13488 39481 23914 20815 12429 19806 22403 11892 -18873 -17676 -10135 -9328 11853 56382 4187
13475 4187 -35815 -33802 32466 61014 37281 34627 34694 40459 56247 43973 2278 -12857 -18804
13462 -18804 -21566 1971 -715 -11663 186 13055 20332 -8524 -30621 -19307 -6296 46711
13450 46711 35659 -12970 -15323 12020 -23273 -86128 -75291 -17307 13033 14 303 -31482
13438 -31482 -37833 -14254 -59965 -63685 -35535 -19402 41370 55247 32764 -7065 -53162 -33363
13426 -33363 15660 59223 23244 32204 29343 -1130 1224 -31136 -10159 29440 49954 33091
13414 33091 39379 14863 -5399 -10042 -14964 -7906 -43157 -78572 -80586 -71020 -30997 -19368 -25181
13401 -25181 12941 42744 13208 2651 -13101 -51927 -52923 4023 19599 -6672 -44274 -23349
13389 -23349 8079 -19335 -58342 -56787 -46883 -33291 -59189 -77972 -49037 -473 17571 17765
13377 17765 -20702 -3042 23708 3370 -32691 -46229 -18810 -36682 -55374 -59150 -59682 -32837
13365 -32837 7965 42513 11115 -18495 17784 26016 11473 -40681 -64523 -63235 -21487 5451
13353 5451 -5703 -32705 -65789 -74890 -51995 -11782 -10100 6019 30823 -17740 -48828 -54509
13341 -54509 -84049 -60131 6535 29962 21467 42285 63829 72882 44930 59318 62621 74548
13329 74548 40887 22712 -12785 4410 50115 34743 30480 64625 52668 21631 4951 -9163
13317 -9163 11915 -309 -36964 -79655 -65912 -70594 -47833 -31190 -36084 -59786 -48151 -34396
13305 -34396 -29498 -46942 -37691 254 5048 4434 27032 35932 33843 37349 4770 9128 28712
13292 28712 10362 -20553 -31394 -33088 -7970 -39656 -18726 108 -5572 9071 -6706 26990
13280 26990 35083 35398 1656 -74662 -55883 -64030 -53008 -30322 -49002 -73820 -83005 -63958 -53605
13267 -53605 -34419 4825 28003 25734 -26939 -91018 -82053 -69459 -67348 -29872 951 -10194
13255 -10194 -26284 -24407 -18260 -22807 -12619 19179 8312 -20215 -44687 -36607 -67283 -104677
13243 -104677 -68031 -14729 -26307 -9592 -4102 20854 21328 3119 -11611 -57867 -36492 1123
13231 1123 5154 -22366 -19830 9122 29873 21879 5792 -23701 -20527 5477 5109 -13561 -30053
13218 -30053 -51539 -68404 -66500 -51055 -8834 29900 9564 3464 2858 11609 7777 -48608 -60291
13205 -60291 -66841 -49546 -20595 -18325 14888 -1791 -31477 -18501 14010 23378 12366 -7614
13193 -7614 3081 21211 7039 -17457 -15409 7839 -1221 19458 50514 42683 29846 40606
13181 40606 67768 89975 88135 48459 44499 7774 -8176 -6761 37724 47352 -4874 -29551
13169 -29551 -9967 -8792 -12490 -45414 -43692 -20244 -21888 -14294 -7884 -2319 -14834 -25054 12629
13156 12629 -24201 -19102 -4206 -1196 236 -27382 -79071 -115336 -93950 -67814 -69189 -67382 -22972
13143 -22972 35101 31021 3653 -23793 -16916 -10740 -7383 21909 27618 9430 50747 49751 -24861
13130 -24861 -41560 -15754 19048 21495 14802 1483 -41108 -41293 -1483 10952 6126 -17558 -51411
13117 -51411 -42335 -14203 30562 27067 12213 -11922 -17842 -950 14076 9353 26052 33262 351
13104 351 -19578 -40925 -29656 1496 8236 35071 88018 69379 28711 -4702 9495 34941
13092 34941 62472 24509 4211 21774 5373 -23045 -16655 -26849 -36708 -82233 -85066 -56457
13080 -56457 -12468 15653 14405 22814 27481 33948 23379 3725 -7187 3617 13642 31640
13068 31640 71075 28939 34401 20210 31776 29489 -3135 -9217 -17662 -24568 -1622 20193 -5240
13055 -5240 -37568 -44934 -70386 -31340 41186 70442 14732 -26390 -30212 -22680 -64821 -49299
13043 -49299 15840 46809 47564 36531 12916 -28512 -13330 -2458 -4007 -4319 -8630 -22530 11960
13030 11960 25728 11531 3475 21002 19830 29304 13934 6247 -7919 -23090 -29940 -40299 -36201
13017 -36201 -17945 9901 -1661 7248 18829 17744 -201 -18628 -30338 -27522 -11960 11593
13005 11593 14699 25675 16102 -33393 -58320 -18244 9507 65545 53089 12546 -3133 8054
12993 8054 46957 31006 28525 20790 -43702 30767 62673 73855 62204 46880 32720 20895
12981 20895 -16778 -19975 439 28679 43903 35160 33576 16228 22740 -20469 -5814 31754
12969 31754 46972 52288 37807 11465 15323 -36127 -50858 -45064 -36660 -1670 1905 -4024 9686
12956 9686 26319 785 -13048 -12684 -44250 -12001 23086 26151 19998 18983 19766 43917 67679
12943 67679 41449 -9828 -765 -26336 -22952 -22288 -40777 -40037 -39578 -13602 -4259 -9178 2133 -12733
12929 -12733 -11182 4397 23937 16946 24609 19093 -5492 20747 88826 85429 74864 58232 44422
12916 44422 82630 59103 15822 -3264 -25349 -13708 -13717 -16080 -24429 7285 8528 16602 53629
12903 53629 44008 32726 38462 24381 15061 14534 6975 5595 -4906 -32383 -19390 5227 14449
12890 14449 11545 19529 50935 24092 4471 2310 -13125 -5564 10698 14334 3654 7845 -3634
12877 -3634 -6010 14453 30172 32332 13720 3703 27783 3263 -17308 12114 11467 -38968 -52721
12864 -52721 -7609 -15734 -38378 -43858 -12926 481 14444 22723 28350 -3562 3275 67291 80980
12851 80980 57738 81483 94324 76935 59083 31134 23827 22183 8308 -12643 -2751 -5485
12839 -5485 -40399 -45112 -13293 25048 732 -34510 -42999 -12070 35349 12656 28916 45371
12827 45371 51146 63612 85433 85633 66799 45112 45869 31041 30966 20778 4616 19453 5746
12814 5746 -25255 -52678 -50348 -30444 -43545 -79511 -60025 -33179 2831 20560 9126 48977
12802 48977 55006 -15559 -52526 -75552 -71025 -14135 34071 64593 64573 49846 71072 19696 701
12789 701 10068 -40133 -87479 -78235 -70021 -48190 3731 52416 60003 28344 -4100 -8077 23207
12776 23207 49292 12310 -48895 -25470 30567 58443 23131 -35427 -52480 -58472 -48025 -27020
12764 -27020 -14424 12867 -9397 20291 15856 -5090 27968 29910 -19330 -16541 -598 -54 -21309
12751 -21309 -26332 1527 17357 -14390 -40884 -62213 -15473 25321 -16 -36740 -41669 -49084
12739 -49084 -16817 -6760 -14598 -1425 12290 -3223 -6854 14313 33512 34315 2323 -7149 -5834
12726 -5834 -278 -31609 -38389 7260 39766 55596 69906 39155 10037 -23189 -28479 -41994
12714 -41994 -40427 -9441 -7483 25081 -11159 -26671 -39788 -54412 -6660 19752 1950 49924
12702 49924 93668 62023 45777 45572 40370 22937 -13706 -10883 4771 12890 23080 43099 34503
12689 34503 70038 116325 114680 73876 38820 50970 79857 60592 46549 51184 49509 12530
12677 12530 -16125 -11978 -939 37284 35821 45422 5148 15755 23518 7934 -139 5666 22255
12664 22255 37658 41797 71063 77301 32968 -12150 20923 63656 69380 60765 79865 79687 85841
12651 85841 87341 67748 39225 30383 47459 41659 20209 -19182 -42015 -51559 -48732 -11658 18144
12638 18144 -4760 3268 36340 24114 41683 92106 61480 47049 54667 57228 61103 64755 9484
12625 9484 10920 12437 36434 16213 -8364 28274 21095 -3882 15761 68412 88271 73978
12613 73978 31890 2348 11572 5811 2237 18310 33196 37947 -16510 -5007 24907 11306
12601 11306 -19545 -12932 27462 59421 57765 32903 46683 45211 30712 53513 82934 115335
12589 115335 131314 106738 117710 139312 130988 92761 30689 37489 62143 96878 79538 88510
12577 88510 86343 44608 18206 87292 137721 96612 14072 -12763 -3512 20009 3317 70913
12565 70913 67850 6058 10254 937 -1001 47284 81481 76824 57937 81846 121613 102864 96901
12552 96901 103206 101274 90035 75774 38949 -18032 -42230 -15531 46206 -5626 -78144 -49399
12540 -49399 623 53622 72599 71487 65412 40353 61203 50790 38598 18497 11809 203
12528 203 -10087 8828 51036 66340 16831 26874 -16118 -25639 -36740 -18450 -34540 -1163
12516 -1163 39745 45922 33649 16607 31159 24422 -5947 2014 -6741 -16347 -7631 -29477 -27289
12503 -27289 -28417 -17257 16842 27368 28262 2693 -22691 -15738 -35121 -13485 -14116 -26457 15530
12490 15530 36767 27434 45144 52660 11432 4888 75543 98113 83566 33415 18529 30063
12478 30063 20775 -6595 -53326 -108602 -114218 -89530 -76360 -40841 -34560 -39286 -38447 -41632 -44675
12465 -44675 2318 8809 -30674 -49790 -26793 -3079 1030 7246 18262 3996 -23214 -27587
12453 -27587 -54224 -102044 -82909 -28293 -26185 -31113 -44704 -24154 -3386 -17291 -43416 -72404
12441 -72404 -52167 -55114 -69301 -45278 5620 23611 37407 73944 100007 86933 63512 60883
12429 60883 32595 13244 15175 17433 8631 -1162 27957 9979 -26900 -9674 -13560 -15709 -41183
12416 -41183 -55481 -46118 -37600 -7264 14545 4658 -1197 -35256 -416 20536 6931 -18477
12404 -18477 -12454 -8819 26 34870 62810 41771 18101 -6991 -21430 13892 6077 29216
12392 29216 42926 13094 -5466 7491 -11293 12485 25035 1885 -11352 -20096 -36248 -15923
12380 -15923 -9513 -10746 -26312 -46658 -45905 -38191 5501 30361 -24210 1147 932 4855 -25125
12367 -25125 -21694 31346 16776 -17167 -16459 -1016 10419 9524 28441 51628 47579 39665 14624
12354 14624 24561 5771 6789 37877 13194 4965 -3278 1979 -27622 -39811 -31081 -20761 -26902
12341 -26902 -40831 -18642 -1432 -9637 -56514 -65920 -66012 -54942 -90143 -37786 4926 14479 24890
12328 24890 34223 -9207 -40730 -11772 26812 5016 9455 23508 -7805 2794 8373 24818
12316 24818 25711 52494 81019 63842 69256 73297 70723 60367 62453 41644 7406 -35850 -48598
12303 -48598 -24778 -17717 -27238 -52722 -56837 -36302 -12821 -1234 20922 66198 47300 21110
12291 21110 14401 6700 -3594 -6601 -28275 -52368 -13512 6829 42970 46839 -9128 -7171 8267
12278 8267 8670 34219 34795 21713 31880 16349 48127 51417 11977 34217 33982 22508 17091
12265 17091 8931 -3502 -16672 6598 40232 50137 19909 13090 4199 8866 9078 -13674 -4967
12252 -4967 27804 29291 45592 59589 56653 40927 44439 24616 15453 21110 31727 21355 29546
12239 29546 49533 41380 -7787 -46548 -7591 44064 60657 33551 9447 -11842 -14837 -14486
12227 -14486 31764 52600 30660 39850 71995 27291 -13810 -11268 21445 55672 88444 54591
12215 54591 11996 1343 36228 68264 73175 47772 42741 42931 51007 37833 25344 22453 22966
12202 22966 34867 2300 -10531 5192 57538 88652 82479 76296 69270 25432 -9128 6194
12190 6194 20396 19899 44661 43134 36237 82199 103774 130657 142769 159330 134507 113454 131186
12177 131186 133082 140321 137667 130276 115879 70505 62759 45599 20100 -15011 -3928 34471
12165 34471 71453 77120 38392 30415 14008 -9251 -1493 9675 -29410 -42910 8541 5158
12153 5158 -49777 -35379 -16510 -24930 -11247 -2082 -2738 14195 29198 33685 4915 6801 10493
12140 10493 4867 25059 5525 9543 71517 93082 93525 80169 32210 -2863 2285 43416 86038
12127 86038 101191 127500 105918 108227 113973 152543 146210 118113 61846 19455 7465 14058
12115 14058 -19503 -11272 -13655 2178 -5649 4762 45537 71412 72083 104799 84321 44093 62544
12102 62544 59278 54529 23245 26564 13272 58811 60498 11632 24491 6149 14235 30066 5457
12089 5457 4928 -18533 9382 37930 66499 62461 59598 46459 42373 73052 75383 51631 27810
12076 27810 22913 38928 81366 93537 108782 113120 74369 56966 98050 92737 81997 126697
12064 126697 169724 158473 114787 100894 139366 128031 78535 114571 119738 138696 170975 189315
12052 189315 165992 174619 211768 209321 202997 191710 202027 222714 192514 194318 206797 239909
12040 239909 184634 106415 98070 112463 123875 175771 211835 227173 260394 277309 244782 255813
12028 255813 293477 318053 276580 248924 217106 194134 204519 219423 198993 203855 221316 208274
12016 208274 207635 233458 270589 281372 278573 249254 256996 239030 266226 300390 295951 303178 331379
12003 331379 392292 401462 389528 361837 319418 328206 376936 398043 421584 464816 462292 442013
11991 442013 481926 459720 456440 482118 505066 529123 540750 493769 535607 631938 647797 650816
11979 650816 683844 748746 791565 814264 840807 920390 966053 996875 1000919 1035196 1143345
11968 1143345 1210402 1254359 1301659 1354679 1411985 1481742 1570222 1657250 1737076 1850458 1978016
11957 1978016 2143691 2303984 2423046 2589848 2829217 3024793 3224429 3456208 3766109
11948 3766109 4097065 4505487 4941774 5450872 6050533 6717895 7477977 8367885 9442618
11939 9442618 10784278 12426928 14509640 17173415 20559950 25047869 31050568 39294256
11931 39294256 50851528 66918272 88369645 113756919 136716019 147677463 141650195
11924 141650195 122385987 98210723 75911566 58152098 44843164 35108390 27987453
11917 27987453 22701712 18656709 15579007 13239566 11352000 9886491 8687227 7708210
11909 7708210 6863482 6154861 5596093 5143848 4793825 4476557 4190574 3970029 3831930
11900 3831930 3700422 3576259 3480958 3396383 3302559 3209065 3093176 2974094 2907551 2887835
11890 2887835 2905925 2842297 2715804 2569566 2400597 2182031 1981788 1858269 1778182 1679946
11880 1679946 1574490 1498191 1405458 1371476 1374454 1335044 1344826 1378249 1426319 1451625 1439590
11869 1439590 1466431 1507428 1521765 1559623 1657529 1795081 1916020 1903940 1831876 1780891 1716475
11858 1716475 1675267 1650210 1718821 1775081 1795603 1700748 1566668 1429315 1309241 1236302 1199318
11847 1199318 1092714 1029198 945792 881630 808637 805882 769690 763831 763502 797308 810416 788325
11835 788325 778417 770003 793124 789546 790768 782850 806708 800876 800571 772195 730807 709519 672973
11822 672973 675230 664304 635376 627841 650550 642332 610705 552211 501880 494903 517032 538153
11810 538153 512658 497249 453444 401589 386284 360874 333981 268896 233867 289088 319040
11799 319040 313555 295704 270179 240994 233485 216540 217651 217843 174497 150445 179739 152792
11787 152792 122900 183133 204128 167989 167668 156922 116246 86319 88191 81436 54027 91454
11775 91454 108267 128331 105604 122389 142199 159414 174983 160993 185316 143768 131396 161976
11763 161976 200645 202681 184766 163118 116969 88381 68585 81032 85826 76496 82849 81875 91564
11750 91564 97051 97224 81008 119810 106952 99608 81533 69827 33874 10603 37622 74469
11738 74469 69529 44733 8686 9432 15238 18993 17837 15414 15654 18881 31684 46457 50176 101354
11724 101354 68728 18152 48399 83091 79424 105321 113404 98724 84110 72002 40588 27846
11712 27846 28681 10527 54268 61551 36136 51964 48562 20968 62391 44129 20099 -29788
11700 -29788 -1525 32453 26328 37728 44116 9506 602 10997 55804 87664 121598 88926
11688 88926 13950 17528 59350 79985 77317 63742 55133 25700 39487 42497 18352 10093 25158
11675 25158 41438 45474 53354 33919 31763 62458 60138 46993 10519 3856 -5346 -42869 -63100
11662 -63100 -35858 37361 8884 -14971 20130 39760 52030 51192 57135 80753 94084 54254
11650 54254 31114 70909 110909 73134 5268 -11193 -21040 -24113 -40431 -21622 -14920 23371
11638 23371 28015 -6986 -6255 -468 13381 -18624 -50770 -64776 -21817 -9182 14169 10757 32838
11625 32838 55067 -6017 -48489 -51453 -24275 -9555 11684 21427 38076 94109 60538 8751
11613 8751 -2651 -24614 17782 64371 54995 9240 -24054 2804 23995 17406 4830 -17835
11601 -17835 -14372 3443 3858 15879 23289 841 -9931 8061 6742 26156 17040 61538 114071
11588 114071 98049 71375 27972 -6902 -43028 -30148 -9067 625 9227 10143 -11810 -20562
11576 -20562 -39 53442 58309 58894 43850 13278 9567 12589 21537 10312 -17183 -32983 -16392
11563 -16392 -1714 387 -18050 -12542 11738 -9458 -20482 10343 29010 37665 45986 26042
11551 26042 22582 9090 -41215 -59433 -32527 -7801 -13895 -5552 -5991 4295 -7974 -10626 -5009
11538 -5009 2660 17164 -11567 7863 20140 -31406 -36169 -33385 -42542 -35064 5631 78238 84701
11525 84701 77873 38463 17895 40971 64699 41052 55959 67436 31074 27077 537 -22370
11513 -22370 -70758 -42967 -25900 -1644 21406 57821 18042 -13966 20017 36120 34912 36759
11501 36759 18876 34025 63527 51794 67793 91793 107112 80428 47641 -5636 -22070 2315
11489 2315 -20955 -2522 9400 1418 21829 28535 12953 19710 -7525 13673 24201 16204 -5366
11476 -5366 23808 42801 45857 21489 30877 26757 38817 67206 59266 11396 37735 40586 43322
11463 43322 26486 48728 67679 68393 53315 92623 116752 68211 41395 23430 -23391 -55455
11451 -55455 -76103 -53888 4345 5245 20780 -19662 -33143 -32801 -8400 11389 12412 -13802 -7248
11438 -7248 19124 -38662 -85899 -82538 -36326 -15518 -13464 -15397 -32638 -48241 -30109 -37884 -32556
11425 -32556 -14857 7991 13059 48515 42865 29825 31244 16409 12147 20067 75187 71523 43662
11412 43662 22019 32613 28224 56152 25539 19071 35343 65922 36200 15066 5088 -8393
11400 -8393 -5452 19121 46772 34110 66385 92134 63805 76543 102569 84139 45306 30672
11388 30672 57847 99284 90979 70820 67716 54709 24020 10788 39925 11074 -19697 -35940
11376 -35940 -15725 34538 59481 22219 -13441 3970 35893 40859 52208 90575 48016 36040
11364 36040 13073 -52862 -55124 -41326 -35084 -56544 -7623 7792 -13643 -13948 21223 10925
11352 10925 13353 24273 6030 -28681 -17047 8344 -39392 -17465 2514 13004 19621 18583
11340 18583 9531 23283 11878 -29730 -41681 -22225 -27166 -14787 11609 -13384 -5030 -27259
11328 -27259 -9524 -248 -6450 13202 33287 2075 -29465 -30277 -26542 -41952 -59162 -36799 -12507
11315 -12507 17218 43833 82557 5958 -27751 -39767 -20945 7991 48208 38024 28293 5864
11303 5864 4134 -16810 -22241 7293 20896 54518 108530 81669 68251 47416 18189 -1659
11291 -1659 -18313 -16599 -8774 15402 17264 -15510 -35049 -28257 -25606 -13889 -16017 -39633 4093
11278 4093 51643 54982 39499 13549 2381 -8701 -13428 -8373 -8265 -25528 -39597 -48620 -76215
11265 -76215 -63929 -2138 370 -7360 -2261 -18761 -12547 1286 28406 9291 -5176 -3591 -14427
11252 -14427 -27907 -39533 -37712 -59843 -99974 -88444 -75814 -63377 -47545 -20293 -19329 -31059
11240 -31059 -36104 -32127 -17982 -11882 -52463 -57904 -44934 -53246 -40963 -27895 -16002 -44470 -55360
11227 -55360 -27280 -1593 -38308 -90507 -105080 -84825 -71115 -60659 -31617 44321 100518 79866
11215 79866 37108 26040 18355 10085 -11316 -7438 -39813 -14427 -41165 -86279 -58549 -35306
11203 -35306 -32114 -8382 -1855 -27634 -17646 5603 39382 20863 3954 -15572 -24979 -52408
11191 -52408 -42395 -48529 -21596 29368 -7987 -41243 -81524 -54235 -3421 17287 -5108 -23437
11179 -23437 -3448 19504 18423 -3412 -6642 -12307 9906 19150 -31380 -49055 -81087 -82584 -91367
11166 -91367 -32675 -29015 -80927 -54460 -10978 -1602 7725 5123 11878 37810 74409 32189 -18945
11153 -18945 -43132 -46636 -52694 -55467 -23671 -7074 12165 11546 4024 8904 12121 -791 -12437
11140 -12437 28488 43212 22462 20667 73238 56028 -5910 -50396 -60143 -26927 -17873 -20294
11128 -20294 30213 63878 49313 14501 25692 11488 1509 10272 8026 21648 9206 -12022
11116 -12022 -56448 -29456 -15769 4041 -4453 7996 27686 31237 34753 -10553 24518 60287
11104 60287 51960 17334 21081 34337 53348 82133 68037 21469 -5095 20338 -16270 2729
11092 2729 -3892 25510 75580 58510 49948 10749 47552 50497 62578 38085 -29988 -16099
11080 -16099 -16804 -42960 -51902 -42905 10223 51425 51701 53474 23934 -34392 -24458 2491 -3723
11067 -3723 -24857 4996 8597 -25962 -8867 -3441 10298 59539 77621 32834 -40210 -50533
11055 -50533 10416 45773 56996 78433 49197 44186 27135 17659 28246 54709 62408 78096
11043 78096 112133 145149 185610 201490 186796 164403 144239 107368 56085 103391 150322 199401
11031 199401 254955 277588 221919 180641 117841 162526 196968 204912 245538 287941 290571 311813
11019 311813 344028 355543 359986 307946 207703 159361 136989 137616 171214 175533 216800 218848
11007 218848 189282 187101 172661 176846 170825 121918 113962 119784 164854 174397 146169 133675 123008
10994 123008 139910 162249 123210 97474 54698 52788 60297 95983 83681 65926 58085 89398
10982 89398 75213 41120 80339 56924 20226 27061 38594 80070 92338 68461 12363 -19667
10970 -19667 2120 -13495 -23888 35366 71043 65338 38521 5836 -10696 -27372 -2731 8079
10958 8079 15165 7592 -17225 -26127 17820 53299 48871 65150 82791 103266 70891 47791 25085
10945 25085 20215 -33770 -42723 -24069 28243 77700 62968 40924 14212 21208 -4835 -20055
10933 -20055 -18737 31753 50697 67167 63461 23705 33206 36716 77002 83742 70456 46343 40355
10920 40355 68763 72305 63462 55496 60907 53689 39804 23642 52076 76284 69083 86449 67384
10907 67384 43094 23793 32894 87097 88714 75565 67621 65343 97569 109262 83701 34434
10895 34434 1403 -6404 9728 7687 12134 28596 35340 15645 -5838 -14589 -9299 18213 76485
10882 76485 62628 12844 35888 56124 44531 19169 4677 19710 27270 58663 60320 77269
10870 77269 97241 71554 50901 10987 9731 47659 27557 17011 51041 43376 15363 37901
10858 37901 81151 113431 116577 116649 107157 89329 51054 80272 119982 97564 54253 78378 59391
10845 59391 58627 89085 92180 100983 115142 89964 86631 116815 139272 101977 104634 112467 99741
10832 99741 132623 108403 71206 90715 132981 140888 107815 122402 143925 146937 173426 259990
10820 259990 370719 469655 608930 894873 1203696 1506866 1628134 1538560 1277234 933523
10810 933523 695386 535130 427316 355009 288650 271420 244681 209548 205488 147673 103572
10799 103572 90419 72752 42291 62104 75530 61864 80463 87026 105791 124576 96392 77835
10787 77835 79935 68842 97105 65286 69749 82578 59729 63514 76614 75622 71123 79102 81815
10774 81815 71376 59804 62101 81624 84180 90313 103169 112388 109439 112386 112430 98480 64444
10761 64444 84131 114995 124720 107495 129463 154050 129592 121306 110778 94590 96480 106918
10749 106918 127056 125536 107809 144407 149010 105638 98768 83611 74893 80419 38736 52344
10737 52344 93179 99933 122314 97240 100370 186668 241288 267721 284919 322788 398269 459922
10725 459922 591749 786699 1063479 1420723 1844576 2119802 2087771 1831479 1448691 1141087
10715 1141087 884634 659934 530485 417587 383493 374184 353426 339461 300856 279417 289391
10704 289391 269225 233699 223067 206125 189043 219085 232112 243906 213065 184772 165165
10693 165165 148380 143083 179030 218661 237701 238100 232980 249043 270074 235922 225223 192037
10681 192037 198511 234212 283138 295172 239316 207461 176156 184265 240349 270013 278062 256353
10669 256353 196783 181620 192501 186320 192163 239938 232954 212040 210225 226824 260275 254187
10657 254187 233820 261932 296051 292084 312295 333393 357280 402777 454100 517818 582500 620603
10645 620603 654479 671856 673901 609385 584290 615498 630821 681635 702606 776427 866214 895448
10633 895448 944536 1034651 1181959 1326613 1452797 1561978 1634363 1710454 1914581 2165147
10623 2165147 2442538 2803774 3262007 3914383 4820412 5961818 7465230 9448885 11860721
10614 11860721 14454501 16655268 17906040 18116691 17619457 16966051 16569780 16874170 18083216
10605 18083216 20342905 23818828 28464337 33553730 37522276 38909817 37621492 34826152
10597 34826152 31873006 29771162 29056937 29948081 32572102 37010678 42980080 49111663
10589 49111663 53089971 53093662 49261227 43469107 37741578 33215642 30345534 29170734
10581 29170734 29603058 31566108 34566833 37551295 38921776 37564566 33770277 28883238
10573 28883238 24281646 20715868 18286232 16967747 16541971 16778295 17461239 18043193 17866823
10564 17866823 16592938 14470747 11954777 9594556 7624544 6074767 4926137 4053529
10556 4053529 3373369 2901170 2534952 2213787 1990075 1776713 1593838 1455242 1337784
10547 1337784 1203548 1130257 1071423 983911 935813 890106 847182 828055 789039 761884 713138
10536 713138 689942 686525 690225 659781 604993 523293 496862 533353 511284 449466 424843 432106
10524 432106 402451 404754 434356 429078 435835 499461 527809 506499 461133 457632 447675 368162
10512 368162 322726 310769 289422 250606 251813 220307 217865 272859 275933 244050 216380 192504
10500 192504 193584 224841 243367 241407 213700 254291 248041 232513 216442 212177 231463 234645
10488 234645 235860 223610 245475 280831 278329 258838 246341 247809 248207 223404 219339 217663 249249
10475 249249 249695 240349 272924 242065 231769 265005 286185 279776 267103 280092 268431 213751
10463 213751 231374 307283 349448 338644 338891 293027 310166 340547 359446 367180 372124 334314
10451 334314 287456 273942 264229 303255 346494 376316 400539 428523 439571 409413 409107 390144
10439 390144 355955 358540 357370 397498 384445 352207 375905 405931 391154 380153 394355 411207
10427 411207 391082 381466 403182 477397 485234 448213 420407 436115 411252 420458 427815 399015
10415 399015 416599 416348 422276 442338 484530 500980 479292 491673 517618 555774 532823 515807
10403 515807 520630 550398 558217 557991 593739 605542 612545 589145 577535 571448 601915 645810 666075
10390 666075 722564 759929 740334 750366 762614 755516 740380 754512 776675 807736 846368 855839
10378 855839 927349 982118 1042202 1069480 1147386 1216175 1285147 1290875 1346786 1448408 1543348
10367 1543348 1616201 1716024 1842232 1955364 2036114 2117344 2242187 2318963 2419285 2564931
10357 2564931 2725747 2852496 2994186 3220686 3485569 3732418 3999460 4284805 4646808
10348 4646808 5076040 5582240 6234337 7058476 8013543 9016382 9976534 10748186 11431296
10339 11431296 12173078 13161794 14519394 16343567 18722711 21575803 24865436 28849895
10331 28849895 34071996 41200622 51081729 65262530 86485890 119096272 168897863
10324 168897863 239664213 322212737 384477693 392462322 345787836 271887579 199795680
10317 199795680 143656400 104381354 77771377 59636186 47024150 38107028 31657059
10310 31657059 26857029 23042940 19806621 17021300 14708870 12910876 11556668 10615603
10302 10615603 10000395 9607644 9153704 8537982 7669628 6805823 6032085 5392813 4886366
10293 4886366 4517042 4182219 3881240 3620936 3387222 3190331 2988669 2826196 2633216
10284 2633216 2450422 2312567 2235432 2140824 2037728 1923706 1859671 1796485 1776495 1710970
10274 1710970 1628760 1526188 1501781 1452747 1417069 1413140 1388371 1311598 1228546 1190067 1184669
10263 1184669 1170046 1157844 1129756 1062076 970058 970845 921078 869144 835642 822229 791482 770458
10251 770458 785981 772342 719560 697006 697966 693305 679064 729338 720938 673933 645400 681720
10239 681720 688461 654675 602280 558180 556347 527574 532820 519938 493905 468955 451297 433020
10227 433020 382916 368996 368418 357718 346831 324143 329582 380513 391349 374109 335857 279591
10215 279591 275456 282322 322560 367477 331182 266622 242776 250568 292012 305364 298000 309793
10203 309793 325931 338983 299653 275594 301796 411346 428741 450174 506636 551665 512194
10192 512194 465075 469652 446443 404718 387576 413750 378861 332096 347248 390986 391772 360992
10180 360992 355161 348186 330905 317216 308662 290676 298120 331716 354418 340755 313062 357107
10168 357107 382638 403495 377728 384250 453610 488312 432716 382829 350828 308615 279672 302055
10156 302055 319230 384516 472512 492793 515402 502009 458053 425097 419344 373346 362043 376310
10144 376310 361812 375713 364084 330145 289546 285117 291912 295051 272586 250858 246070 227415
10132 227415 240655 239577 192777 141631 112437 110113 84112 54617 23459 33387 52430 79561
10120 79561 109953 112361 140000 131717 106092 86708 97621 74854 70132 64686 72809 92499 70576
10107 70576 52853 101766 112570 116149 105728 112318 111555 161098 142176 64206 32206 58901
10095 58901 93147 78653 39851 7904 37242 58839 56779 95537 64478 82963 126594 125332
10083 125332 75920 47290 36825 45183 110593 110599 71118 42016 5808 23455 31829 44624 63346
10070 63346 71724 103549 126157 124086 122961 115727 119433 97483 120703 132253 144890 136489 79613
10057 79613 97238 88547 64405 86790 121561 122827 84189 28398 33466 38779 57176 68415
10045 68415 74481 60784 40441 37599 70740 62026 30432 14545 27756 34956 52374 69704
10033 69704 60592 77176 82569 21414 33124 69000 56674 52550 82962 53504 37247 54214
10021 54214 70028 83327 61594 68068 70290 102709 76529 51091 31236 29895 35262 25569 4407
10008 4407 4415 -1083 -33679 18401 37270 11362 -272 6638 22495 23422 33366 28301 42791 31657
9994 31657 58076 46371 -6239 4159 37804 83149 150932 163277 198505 239114 257031 270338
9982 270338 303612 332421 317202 278510 201881 133152 109612 105185 114656 104122 113271 110277
9970 110277 110938 110602 113026 100827 79890 103976 93695 61225 71618 101753 119972 136988 144254
9957 144254 174846 191426 228667 211072 188608 192651 231339 278766 259769 215884 138721 143844
9945 143844 190846 219886 212103 153670 123011 147890 167420 186276 186195 189105 221691 263678 319402
9932 319402 322990 335582 417174 446994 435380 397549 452083 543114 627117 764823 993144
9921 993144 1305650 1680981 2047081 2296555 2258725 1980005 1576307 1206705 925382 741438
9911 741438 640151 546835 515771 494505 468667 422911 415162 429088 444629 457219 440382 435658
9899 435658 510029 571191 623133 690162 737651 777944 810516 916838 1118001 1363646 1706726
9888 1706726 2228654 2990528 4116403 5677567 7624310 9470149 10499447 10265900 8891115
9879 8891115 7027172 5253283 3867201 2878292 2207398 1748013 1383103 1127232 957814
9870 957814 861939 751081 652271 576230 484637 429966 397180 402287 397516 389962 383105 382429 354484
9857 354484 270203 257511 263605 217037 175397 137306 159679 190958 199837 203905 176688 144724
9845 144724 167539 162027 132419 110986 131017 103161 81627 94096 127155 92033 70846 103698
9833 103698 135409 159617 111666 87770 118140 121260 102382 72870 75313 59028 55217 49220
9821 49220 61521 71539 84778 47301 64701 95584 99904 157337 121760 84634 88575 85810
9809 85810 52539 11576 10376 24228 45214 49297 58647 99822 88718 57127 11392 19027 53856
9796 53856 73702 78672 104608 114897 141357 99983 87446 80783 38697 29750 20650 -6463 12670
9783 12670 35855 51217 39487 103243 104246 74774 59450 52005 43765 74322 76026 89144 81461
9770 81461 122728 122877 71920 97780 97652 97737 89569 52194 73737 96443 126325 99187 108557 119402
9756 119402 85247 63072 74168 69270 26959 -11912 26655 108716 101143 45437 46483 66460
9744 66460 96569 81207 89752 97752 106960 122772 113101 92766 56787 34945 54065 52547 68681
9731 68681 82496 116265 86987 61551 41150 30413 32438 23058 48660 92204 75715 30924
9719 30924 38511 44191 18857 -38445 -36246 7305 29533 15953 25011 27466 59229 79968 64946
9706 64946 53856 78461 88700 93729 96567 103258 56968 47883 81131 82205 63523 44939 23688
9693 23688 -2890 -18321 10632 18155 6305 14538 15889 27405 47502 67789 48035 36683
9681 36683 43925 38913 25064 29869 32958 9440 -22964 8406 3964 15050 -19070 -47122 16107
9668 16107 53731 92876 53325 60151 35737 16711 37162 61286 71399 61265 41842 52068
9656 52068 60348 61477 32551 -153 -4541 -4160 -4393 -11579 -7414 -10988 -11640 65726 75653 90695
9642 90695 79266 82848 60014 73436 88260 65774 79886 85446 88585 44649 -2967 -12952 26203
9629 26203 44624 15648 -16946 -44811 -9080 13634 -19250 -20229 -14 8336 11937 3283 39632
9616 39632 19405 -12029 -36654 -17770 -13622 39780 61952 25129 -42350 -41999 -15500 17919
9604 17919 41089 24978 46676 56276 30561 30187 28214 -1980 -18951 -58944 -42657 -12742 -2409
9591 -2409 13092 64824 56396 8620 3586 3974 -12762 -13835 5586 19234 21503 25835 42385
9578 42385 26253 15794 5294 -2711 11733 18883 -15981 -10468 26780 40659 -2301 219 23781
9565 23781 -2036 -22103 -32259 -40368 -70591 -58500 13824 78167 62802 29036 11926 -4945
9553 -4945 -29777 -8275 -22884 -19090 26483 12558 -16555 -18615 4918 13476 44229 35347 35945
9540 35945 15109 13611 42625 26106 -21726 20377 45354 54388 67367 91015 63520 49560
9528 49560 17664 -46315 -92949 -64189 -12918 1952 3433 -2471 -9301 -22061 -33986 -50413
9516 -50413 -13471 -17483 -68274 -67359 -30151 -7905 -23084 -29027 -19424 -4037 27153 33882 42952
9503 42952 -1500 -29620 -51991 -63756 -55645 -57355 -38307 -19139 -34740 1825 16963 5820
9491 5820 -6261 8022 1511 -40069 -63876 -42213 7676 33215 61299 84423 42360 51911
9479 51911 65940 54183 59246 64601 57654 53226 36829 68086 89961 70123 30826 10603 -11737
9466 -11737 -110 22365 32019 11764 -6974 -62644 -83014 -75380 -76522 -71256 -11361 12664 10140
9453 10140 27291 -20231 -6184 9239 -13021 -20991 -31655 -41090 -26611 -23575 -11049 -381
9441 -381 4980 20376 18360 38693 63844 95240 96475 25747 -7033 -4207 8850 8184 -17608
9428 -17608 -14598 -53336 -48817 -51699 -50013 -58326 -66203 -35017 26185 19404 27405 -18916 -23029 -32001
9414 -32001 -56921 -43463 -17597 -12952 -14756 -52568 -76605 -61929 -2477 16172 26767 45122
9402 45122 60529 28797 38470 86629 96383 97779 108409 94575 51246 5948 39608 66013
9390 66013 48239 43312 49500 59679 39903 31854 32176 14541 6788 35559 33586 17315 10238
9377 10238 3623 12255 27822 22136 -14740 -46832 -63173 -42313 1049 30045 39697 1446 -23328
9364 -23328 -20184 -42760 -58566 -45929 -15394 -42221 -19981 23749 26276 7931 -39890 -75255
9352 -75255 -69924 -54327 2743 30393 29589 1668 17381 16887 15229 37430 34067 10461 9054
9339 9054 24151 -4857 -39611 -54279 -44545 -56812 -50495 -22540 -19693 -26927 -23785 -18710 221
9326 221 10822 -29805 -36581 7140 30051 31355 -15563 -33646 -27042 -13503 15899 51222 48729
9313 48729 47660 30164 16400 -5922 -34267 -31507 4348 -7795 -319 5491 27887 31353 34706
9300 34706 10890 23980 21740 -8070 11821 11960 -7612 -15962 16061 34068 52978 83457 55439
9287 55439 1530 -16276 11342 40781 31596 13640 -23879 6959 40310 20703 -4917 11013
9275 11013 13491 -4404 -8406 23506 -27830 -97292 -125363 -66321 -13433 -8317 -36558 -62047
9263 -62047 -89267 -73773 -35596 -19108 -19172 5733 16050 -525 6688 25239 9235 -2457 11355
9250 11355 15592 44683 5376 3319 -3493 -41108 -34356 -51755 -24512 -39254 -59224 -49188 -37994
9237 -37994 -33995 -41234 -49425 -77957 -55989 -43676 -58999 -61506 -45812 -5068 -5965 9555 56621
9224 56621 71052 51483 51398 24044 -30595 -52773 -76079 -85350 -72763 -58301 -28928 -11290 -13510
9211 -13510 -20230 -55226 -54082 9786 6671 -12552 -49 23791 18767 -2147 5722 22169 -27518
9198 -27518 -78854 -59327 -21746 -53754 -53361 -40112 -33357 -15105 9036 25754 24852 7877 -6765
9185 -6765 8952 5937 -13375 -349 -5130 4732 44598 26146 28656 42819 23466 -6045 -8984
9172 -8984 6888 19280 49030 43185 26979 49596 32817 41271 17748 -39554 -41171 -51530 -48734
9159 -48734 -20868 18997 19094 46355 39911 15221 16560 1695 -31889 26968 66641 19528 -30881
9146 -30881 -52912 -9678 14738 -10952 -25271 -15822 -26921 -23367 621 -4939 -25506 -40059
9134 -40059 -42286 -52005 6628 56133 87663 85573 22258 14174 8966 -6608 -47165 -93841 -98677
9121 -98677 -73562 -105392 -91565 -28145 -8286 35460 82589 80419 84949 63146 58242 15955
9109 15955 -17843 -12848 18469 14047 7965 10800 -6955 -15328 -26956 -39505 -32153 11277 48551
9096 48551 14851 -1330 3782 -20726 -35653 -33914 -12321 6316 24632 41083 25300 18332
9084 18332 53834 -7345 -45787 -4438 4381 -24042 -20626 -3505 -28236 -27242 -21039 -37530 -40576
9071 -40576 -50614 -32708 -46611 -49826 -30471 -10607 -5296 8766 55707 23278 -22580 -47062
9059 -47062 -22919 -14826 -8746 -13554 -24732 -13878 -31037 -16533 9274 -3056 -31826 -38877 -11942
9046 -11942 -24029 -24772 -42569 -48960 -37175 -33708 21935 42426 21749 -18190 -27377 -35900 -23868
9033 -23868 -23558 -43442 -59926 -36925 -54788 -80363 -76440 -66782 -66209 -64102 -27879 -33073 -39774 -15100
9019 -15100 -13877 -16654 1330 -10646 7508 -20576 -12653 11112 -4290 -14308 29400 47036
9007 47036 30812 79972 89023 39884 12496 -26261 -63893 -52699 -30460 3194 38245 -6619
8995 -6619 -41750 -30002 -10127 5552 12370 -24738 -10617 27674 33697 1106 -8298 -33415 16268
8982 16268 75320 88523 78979 31851 1870 8302 -18430 5953 -20109 -2545 28461 8806
8970 8806 -6359 -13886 14079 19969 -29473 -60987 -22474 3310 -4128 -11827 -16739 -45349 -62499
8957 -62499 -54855 -15690 -4616 -3067 -53455 -49974 -37844 -33183 -9675 -19277 -46901 -31722 -4257
8944 -4257 5766 -2757 -23480 -26639 -19690 -33892 -33252 -57736 -51685 -26409 -19837 -33960 -87996
8931 -87996 -86760 -60636 -73629 -48966 -20079 -22215 21065 -1125 -19817 -60028 -42597 -24886
8919 -24886 -8047 -3721 189 -1781 18610 41418 16010 16487 35921 -18188 -24384 -44418 -37995
8906 -37995 -38814 -35361 11413 6852 -36568 -57326 -64451 -31272 -24075 -33057 -18864 -53655 -55848
8893 -55848 -7806 8078 42942 30499 16584 4398 -42607 -27165 -57672 -64028 -31199 -8488
8881 -8488 22746 27994 42564 17295 -21601 -41623 -70786 -75767 -70294 -40682 -37476 -64252 -60284
8868 -60284 -39439 22419 39862 2909 -11088 -38864 -41058 -7959 -7244 3711 -21060 -61758
8856 -61758 -57222 -50652 -83619 -55577 -70532 -47298 -28003 -41429 -17201 15628 17449 49463
8844 49463 58536 24984 -442 40443 38616 -13455 -70418 -95321 -53730 -12151 -2671 17938
8832 17938 7846 7094 -28473 -46002 -53031 -18447 38288 26019 22262 21535 52535 44495 30518
8819 30518 60685 66452 42894 8269 -38162 -52005 -13145 34087 -14283 -43180 -3908 8863
8807 8863 7120 -3285 3603 19296 19378 44903 78912 107028 63717 6950 9644 -15299 -23053
8794 -23053 -11171 4528 30795 63834 62787 62107 26092 -12897 1853 951 -10479 -64729 -76454
8781 -76454 -67814 -50958 -49221 -57774 -61706 -29891 -18978 -46372 -78532 -99183 -63889 -3025 23979
8768 23979 10805 15655 7175 39232 36226 774 -17081 -38191 -49117 -11015 -8810 -26315 -8612
8755 -8612 14297 4142 2426 23137 31665 20572 35440 49742 83319 41449 -19538 -3744
8743 -3744 -9643 -10457 20993 21915 2857 -18529 -32822 -3036 8568 16844 18491 28494 56913
8730 56913 80776 35564 10619 -5793 -24444 -6556 -16044 -1735 -5463 -27393 -11569 11527
8718 11527 44187 37248 17342 -5964 -39687 -96610 -76385 -11447 -8673 -59996 -77485 -64856
8706 -64856 -34902 -11296 15639 32064 54118 45369 41114 7580 -31022 -11679 12721 -5888
8694 -5888 -36408 -60084 -59970 -47492 -26869 -27189 -34067 -14952 -3075 -10667 -8419 -5451 -37636 -76710
8680 -76710 -63609 -17003 28351 31302 -10663 13653 -5530 -17235 -51681 -27967 -3419 -34471
8668 -34471 -9614 -24913 -47061 -66592 -51379 -85906 -101517 -57679 -26121 -9101 -5013 -31653
8656 -31653 -39011 -9309 -37800 -76599 -72759 -17472 19718 29008 4665 -51397 -38827 3069
8644 3069 -25076 -39250 -19233 -5610 -33825 -51603 -65642 -94087 -70989 -15984 11305 -6973
8632 -6973 -10044 -28172 -40368 -55847 -45711 -68913 -64015 -55883 -32344 -64652 -56031 -34306 -54429
8619 -54429 -57022 -50615 -65236 -64285 -48901 -51979 -78796 -76204 -28605 18932 5808 -4210 -26351
8606 -26351 -19855 -6662 -37534 -34886 -33549 -13550 7684 -33253 -42113 -19803 -26156 -3893 -61
8593 -61 13199 40873 34268 -3826 -19126 -29489 -40363 -29952 -26232 -7627 19867 25284 25389
8580 25389 22112 25278 -11124 -31228 -38857 -8759 -5257 -7489 -30920 -66418 -60640 -8004 8112
8567 8112 11060 -6626 -32519 -22375 -4762 6207 32912 57996 65450 43472 -1108 12671
8555 12671 34838 29828 20316 43173 48704 10696 34080 47555 77873 109108 102337 53670 29098
8542 29098 26980 12307 -11523 -11986 -2475 5054 3604 17980 26848 -19970 4700 17511 -6682
8529 -6682 -5504 9441 -7920 -1061 23964 37522 37904 20953 -3366 -3710 -50291 -68109 -23944
8516 -23944 10379 28471 42575 34123 34488 21646 40595 56834 39097 -18509 -14580 7779 10237
8503 10237 27462 -10617 -22243 -19185 -10655 11898 3631 14345 14762 -6460 -60249 -51539 -25812
8490 -25812 -29475 -21075 -14021 13731 -19689 -52165 -46297 -51023 -58939 -56237 -13794 -10684 -5546 22062
8476 22062 6154 -34763 -18506 -51073 -56268 -16949 -2943 -19075 -31582 -4079 -44641 -71234
8464 -71234 -71811 -65396 -62794 -54551 -41207 -22310 -6045 -53699 13037 69011 52688 31332 14694
8451 14694 -26948 -35145 -3068 41666 27436 -855 29662 54225 24719 3144 -1097 10258
8439 10258 20526 -23557 -20571 -24608 -7450 -7707 2594 6324 -12614 10382 17615 21497 -5861
8426 -5861 1342 3747 -25771 -46975 -82386 -108876 -92320 -70816 -7101 -10536 -8133 -11489 -30418
8413 -30418 -21874 -20036 46347 86645 69572 47667 58651 56556 38756 61842 61980 25763 -9222
8400 -9222 -19310 4217 -1265 -21566 -42338 -36322 -27076 -20554 -34310 -62281 -42769 -12230 15604
8387 15604 54534 40861 -18384 -48067 -51587 -74432 -21635 32980 9482 17551 86890 74907
8375 74907 48716 23110 19415 2622 6986 4024 14385 25690 59564 55960 39707 61872 34452
8362 34452 20266 -7589 30067 71959 107863 97958 72963 65464 9239 -5305 27318 59145
8350 59145 39110 26637 9415 -9945 -3640 -22543 -16582 -31073 -34063 -21749 -29518 -42493 -32906
8337 -32906 10096 -16561 -21150 12856 74289 60679 24808 23704 27307 5286 -11152 -16806 27951
8324 27951 33139 29221 35188 40330 44729 61728 73192 42948 24709 1806 7427 2066 -671
8311 -671 -7615 -16069 -15994 1485 35785 85792 96238 107734 128776 131724 88398 65797 116157
8298 116157 163505 229015 288453 358781 460237 699445 1050855 1648772 2307317 2502101
8288 2502101 2153418 1591474 1058342 745917 544809 395327 259606 188247 181029 154684
8278 154684 137247 109713 95205 78384 60493 39976 41668 34501 43553 48601 59520 68660 88208
8265 88208 94908 79761 87797 95042 68499 130452 225618 272925 375629 473961 590181 836056
8253 836056 1249820 1913592 2476462 2453999 1956714 1352720 918956 642432 486370 344787
8243 344787 240865 168652 120565 114383 109960 85993 71052 115145 167180 182166 156051 129092
8231 129092 99577 114938 121450 115743 116809 104268 81798 83297 28373 -13213 -6452 -23824 -53728
8218 -53728 -19257 45013 32031 10465 6646 350 -31407 -19599 274 19228 36123 19170
8206 19170 15017 20262 12990 -1209 25004 94219 69856 39435 45534 55852 38275 27053 20422
8193 20422 20629 28318 27096 18726 -13468 -22143 -36712 -32912 -45915 -15033 14164 -5557 -44193
8180 -44193 -33776 -13998 -41678 -85670 -89183 -39761 -21071 -22440 -40739 -36013 -2440 35492
8168 35492 26293 -29068 -16174 32448 54808 37950 27565 13115 11199 37046 -3094 -33431
8156 -33431 -10795 -16540 -16062 37462 53885 28767 49250 53925 45669 40006 24021 20818 22025
8143 22025 8819 1383 45190 76289 67440 46677 629 682 50846 58812 28551 26739 42346
8130 42346 28953 -2967 -8196 14092 3603 -22770 -16229 -538 4648 22738 16586 32669 29923
8117 29923 8647 1436 -3101 25484 56403 57795 44329 45969 67619 59356 37654 24121 9546
8104 9546 -10732 -14647 -1200 1725 31072 44912 33555 29592 47310 59046 76524 72842 43065
8091 43065 24646 3770 1231 47567 82530 23129 -28223 -23807 -32042 -6664 -7005 3642 37501
8078 37501 31435 16016 23170 -5496 -8981 -12609 -50150 -48897 -24130 -6483 -5488 3075 3754 -23130
8064 -23130 -78672 -82721 -58760 -49354 -15415 13546 -9711 10322 -5513 -25501 -6212 2034
8052 2034 -16656 48410 64152 -5134 -52492 -59008 -13380 18204 15404 -712 -3961 5709 21819
8039 21819 8776 3806 39950 27306 -6916 -47355 -42639 -22931 -5630 15645 -5548 14641
8027 14641 24585 -18947 -45566 -51020 -12189 -26867 -37775 7910 22727 14512 19442 18224 829
8014 829 -823 144 -9401 -24062 -33641 -48559 -74141 -38654 28556 44605 17087 -38131 -51020
8001 -51020 -33618 -23521 -22993 -4655 21513 26523 19499 -11249 -2000 30497 4695 -13346 -13297
7988 -13297 -30645 -51080 -35761 6173 9635 -36534 -23059 4691 12030 -2413 -3794 1982 11428
7975 11428 -30039 -13175 45654 28705 -17102 -52976 -55541 -17157 2767 -5455 -23131 18863
7963 18863 -2907 -52561 -43952 -37021 -13856 -3652 -52111 -63398 -2972 71626 95128 62271
7951 62271 48953 25100 -23375 -19148 -6648 -5912 -32767 -32320 9309 6818 -6502 2599 -2302
7938 -2302 19916 61034 56770 48262 46805 38197 7790 29758 30320 -35702 -61278 -35605 9477
7925 9477 -2060 1040 -15879 -40192 -70135 -82991 -55984 -31676 -31173 -25962 -52510 -80965 -88489
7912 -88489 -79998 -49503 -25644 -39153 -42540 -7439 8657 6171 -20426 -25331 19679 58715 29659
7899 29659 -32752 -37412 -21409 6609 32331 27414 27935 56932 54955 20839 13111 4353 -10826
7886 -10826 -21921 -13007 33257 17050 -8434 -11706 -18433 9933 9778 54300 30576 5027 -4586
7873 -4586 -22552 -53163 -58790 -54680 -50353 -56695 -36658 5294 3898 -15443 -28518 -50870 -69071
7860 -69071 -71132 -55166 -60890 -44486 -32718 -46554 -51906 -17093 -7423 -27883 -16537 10063 26338
7847 26338 31595 9517 26352 -7607 5095 46633 23714 -10474 6137 10719 8507 -4628
7835 -4628 10120 16809 -29813 -53982 -87396 -81507 -42853 -41616 -10499 3736 4354 -16032 -11893
7822 -11893 7381 41569 57948 44424 27237 20981 32278 26275 35945 -23871 -42942 -61026
7810 -61026 -67915 -30540 -7381 -5085 -11022 -6686 7880 -3954 -23020 -26544 -51726 -65434 -42835
7797 -42835 -24053 -5527 8758 19508 14697 23505 26836 -2558 -63191 -66821 -6531 -16514 4208
7784 4208 242 -24595 -2086 6491 41871 22911 5763 40825 30589 -801 -6844 -15687 -9019
7771 -9019 -24397 -41129 -31138 -10908 -46570 -37551 -22502 15560 56664 57119 47321 30368 5430
7758 5430 -36337 -7156 -3821 -58382 -100990 -74804 -36478 -17385 1978 22370 15080 12948 -6806
7745 -6806 2784 15661 16754 -8335 -47649 -51682 -50920 -29855 -39566 -64696 -44149 -9051 -2854
7732 -2854 -10511 -34015 -52495 -70124 -20904 -23545 -4247 11705 8266 -16899 -15480 -8275 -1410
7719 -1410 1019 -8242 -5114 37239 622 -52554 -63958 -45260 -6746 -14283 7571 38215 15750
7706 15750 24474 27511 -10212 36657 79333 75497 41200 29 -11340 14632 35122 21294
7694 21294 24949 19517 19280 -20238 -32479 -2536 1565 -7514 -60 -1844 -32629 -38144 -49453 -26983
7680 -26983 5694 -24903 -45950 -14359 -12736 11606 -8044 -12802 -19792 27927 28024 10236 17482
7667 17482 15171 65349 73706 7136 -30704 -31213 -42286 -7039 1403 4879 -35602 -48753 -12587
7654 -12587 11736 -29537 -37105 -36490 -58567 -19760 257 -48301 -52209 -62154 -23831 -18816 -24722
7641 -24722 -36734 -49217 -26968 5211 5618 -12816 -59244 -49877 14732 32534 27393 20884 -22540
7628 -22540 -2530 37787 56844 59330 55399 42943 24429 8064 1784 6790 15095 26768 35713
7615 35713 42762 37395 21636 18911 3881 -28992 -28734 1490 -13364 -54276 -66132 -54357 -78155
7602 -78155 -67118 -51472 -57490 -32134 -17846 -28602 -36443 -30046 -50304 -47983 -26226 -43534 -64584
7589 -64584 -55532 -8203 -5764 -56521 -74048 -28632 -3467 -36078 -62041 -55557 10105 12757 -23784
7576 -23784 -19204 6938 25111 6031 6051 28595 10657 -21047 -39208 276 43484 45525 52364
7563 52364 46656 8928 -7294 -41120 -27598 -34269 -38072 -18899 13494 25996 24383 18229 -2028
7550 -2028 -3395 26303 29514 44911 28725 5752 6883 17006 -2450 -2515 -10021 -33854 -46516
7537 -46516 -19107 -28995 -62086 -27053 -8458 -4872 23661 26558 18582 16838 -4163 -38406 -75291
7524 -75291 -30090 -4395 -2833 -6010 -17279 -50994 -30690 -17308 -21771 3586 18155 5968
7512 5968 -22781 -49739 -23781 14284 17134 17886 -26848 -53970 -54208 -7027 23082 18901 -34185
7499 -34185 -54392 -39127 -33272 -6424 -19576 3180 38042 66909 44480 33187 -10085 -13196
7487 -13196 -9850 22847 23745 34129 62615 69889 82296 83572 11954 10621 102674 110045 41578
7474 41578 5134 31276 33721 24607 54575 43053 27422 -18104 -36092 -8025 40706 54476
7462 54476 51962 33525 53816 38303 15893 -25160 -58295 -71054 -29836 -7389 -36569 -64460
7450 -64460 -64215 -36078 -7523 -8547 -45334 -84019 -83509 -24173 -11949 16164 7954 -37395 -13928
7437 -13928 15113 38606 91026 96491 91901 56671 55610 55348 88748 90209 49661 49763 21860
7424 21860 2604 -3383 -21425 -33283 -40321 -59604 -112403 -140812 -127925 -73586 -9204 -6402
7412 -6402 -20886 -59334 -41552 -25268 -12235 8437 -18556 -39617 -25893 -35549 -30027 -34575 -45596
7399 -45596 -44233 -28665 -4672 -12223 -39791 -48445 -50523 -79544 -58409 -42242 -67916 -70400 -41962
7386 -41962 -22425 -32202 -42374 -46744 -54184 -95969 -72689 -31224 -35050 -47599 -49736 -32375 1037
7373 1037 9435 963 -13099 -11610 -277 26265 50549 70163 26469 -49202 -21777 -36202 -33863
7360 -33863 -25662 -6340 2872 18526 9715 13756 22846 8175 -3531 -24521 -5867 18270 12542
7347 12542 -21401 -1280 15665 -13891 -38449 -48601 -40379 -17413 -37702 -82874 -82301 -38316
7335 -38316 -21216 1425 -43026 -67441 -38534 -16353 -27886 -60088 -43825 -66069 -99553 -117117
7323 -117117 -85034 -36223 -14413 1339 976 3997 -32230 -23707 -9998 10603 -11740 -6946 -9074
7310 -9074 -10907 146 -10669 -48714 -65142 -44298 -20301 -8918 7413 -10395 -12073 -24131
7298 -24131 990 27696 24843 461 9058 22685 41315 27601 34574 64733 47214 -48071
7286 -48071 -49523 -43362 -5077 23138 24028 10851 -11446 -8917 7900 22129 36427 22712 34893
7273 34893 34344 -17775 -26819 -18604 13738 50671 55500 52732 26989 -4969 -106 43456 77023
7260 77023 59195 51441 5119 -18666 -31711 -15360 2674 -4768 -49233 -55376 -42630 -74800
7248 -74800 -43486 -59375 -54295 13969 35770 41512 57286 35428 1221 -11318 -19337 -40305
7236 -40305 -51568 -55423 -47659 -41658 -36437 -27998 -41241 -51755 -42834 -10341 6616 -2971 -10934
7223 -10934 -39758 -54441 -45774 -7655 -9761 -31779 -40261 -42084 -67070 -49308 -34997 -50489 -43819
7210 -43819 -18521 -17391 -28785 -36338 -26163 -12578 -35810 -42565 -6834 4558 38025 12117
7198 12117 -1932 -29390 -48974 -24208 -32452 -41780 -5055 9486 26666 1889 39768 57248
7186 57248 49738 9442 -4548 4141 24688 1781 -11832 8524 23819 13937 30044 37780 41102
7173 41102 37248 21795 -8531 -18484 -9006 -14983 -30488 -46099 -33695 37922 51772 45177 23948
7160 23948 6435 4684 17094 23346 -2091 -21193 3946 25090 31178 2696 -54047 -81200
7148 -81200 -69355 -87837 -129421 -97001 -66154 -54397 -38624 10979 40616 56759 52806 57528
7136 57528 18189 20931 55876 61929 25608 21566 13048 -14211 -2774 -2679 -19082 -2996 -8933
7123 -8933 -34742 -37459 -10275 37991 33633 31566 18447 26276 20158 -6497 10026 -730 -25635
7110 -25635 -22103 -8959 6084 14588 -16481 5620 10895 5033 52675 28825 -404 25822 27539
7097 27539 -13050 -26080 26587 53811 52406 -18308 -59333 -43270 4544 25745 44785 13514
7085 13514 -7902 -37838 -72301 -64307 -30449 -39579 -54018 -89105 -81980 -81152 -85559 -38131 -28697
7072 -28697 -3037 9603 4142 10349 22896 26019 10954 31204 35027 51894 52794 48129 13368
7059 13368 -5963 -34222 -28987 -54825 -75913 -90191 -70320 -42293 -2723 5321 8997 14863 59369
7046 59369 88591 52835 32450 5000 -18920 26528 29839 5019 -22599 -29036 -15760 -25414
7034 -25414 -13169 11483 -4690 26641 57466 63654 38744 -18527 -33476 8322 28433 14189
7022 14189 15586 14507 28902 28120 -3680 -20291 8304 38634 47183 22385 -36868 -37895 -39987
7009 -39987 -43405 -24216 -33487 -46314 -38403 -22924 -3513 30881 28541 32956 19910 -2276 2202
6996 2202 31597 39381 -675 -10004 -3661 -33971 -6917 -13549 -1366 17709 32244 34986 28688
6983 28688 23387 28698 15359 11982 19031 34810 11006 -28548 -4904 35177 14666 -7271 -14951
6970 -14951 3890 11721 21110 18817 26224 53707 21766 6641 -7454 -729 -13336 -25691 7426
6957 7426 37572 33734 34338 23645 12097 10918 26174 33058 38619 47022 78619 86617 66194 61326
6943 61326 41675 -33123 -47644 -24434 -23177 -25401 -8013 -47861 -49056 -29114 -35274 -74609 -77143
6930 -77143 -83013 -86206 -70970 -14435 -12663 -21214 -23992 -46517 -77412 -30124 -2963 -8488 -19139
6917 -19139 -52023 -28753 -19197 7222 -10929 -6258 -1989 -32129 -44670 -13808 18639 -1757
6905 -1757 -57107 -78047 -85140 -56345 -25800 4996 -21703 -32649 -55690 -64567 -6434 979 23638
6892 23638 33268 32373 47147 48021 66815 66126 17973 31184 38663 -21451 -66146 -48806 -28967
6879 -28967 -5946 4022 26383 26612 -7712 -23439 -22612 -62607 -17624 15374 26860 16656 -25008
6866 -25008 -48625 -41838 -54228 -69911 -46206 19654 45756 45529 52853 -156 17709 39647 38355
6853 38355 38195 -16376 -6094 -12753 -39116 -25328 -15914 9160 -10020 -15663 -40241 -28700 -36429
6840 -36429 -21446 -42943 -48196 -59579 -62288 -33811 -32309 -61316 -80559 -61965 -7341 2853
6828 2853 1285 143 -3891 -39046 -46573 -64739 -61619 -40233 -36512 -34291 -23440 -8680 -29582
6815 -29582 -79390 -72306 -51108 -29670 12986 70171 57109 34409 6387 9395 -1555 -20707
6803 -20707 4284 36955 35696 3271 12604 40629 43881 43704 38729 41234 -421 -32529 -34669
6790 -34669 -55657 -87839 -38567 26573 36586 16894 23455 39964 16320 -36779 -43886 -29450
6778 -29450 -25608 -2003 -15902 14112 67733 8044 -22394 -39496 -37484 -7518 10881 -6970
6766 -6970 -16603 7114 -4128 5339 -17819 -1855 -16154 -30780 -29973 -46996 -67994 -74348 -67419
6753 -67419 -38472 -25218 -39247 -15040 5741 -52746 -66883 -56574 -60519 -49637 7869 18895
6741 18895 12064 -11462 -23995 -26139 -38132 -47449 -5212 35023 71033 88346 47709 46394 58650
6728 58650 42217 22539 29713 21058 -9473 -48259 -38410 25080 38364 1110 -33720 -35469 8678
6715 8678 13293 -6163 -18858 -61733 -80944 -73535 -41393 -54332 6121 21694 5666 -40474
6703 -40474 -75614 -55216 -44447 -43978 -49824 -56595 -15940 28608 34812 38948 10133 -31382 -31008
6690 -31008 -54242 -68765 -35810 -17376 -29250 -46491 -57959 -69431 -62731 -50579 -25085 -9724
6678 -9724 -25716 -68583 -67526 -61107 -40994 -58246 -42956 -32405 -8036 12705 -25964 -38245
6666 -38245 -65996 -48728 -2943 -824 -3211 10260 1940 6837 -3505 -36480 -50040 -58016 -10003
6653 -10003 -2060 5074 5540 11910 49853 23451 -10939 -11960 -16456 -4781 12469 2571 -11320
6640 -11320 -20241 -30530 -18081 3176 5731 12511 -22050 -25667 -32877 -7906 43277 31977 24368
6627 24368 26055 21567 -14917 17903 49283 45857 57431 29106 37892 16418 -3014 -19512 -19051
6614 -19051 -40678 -24106 12047 9601 -4633 -37423 -64351 -39592 10259 1669 -6375 35282
6602 35282 32060 33979 20344 32283 39299 18835 -4535 -4956 -5493 896 2742 -15684 -32600 15368
6588 15368 20709 7474 15078 16183 33295 51646 -19469 -39756 -37339 -38618 -85011 -82011 -46446
6575 -46446 -31074 -47720 -51610 -16431 30456 73362 70396 58845 41991 3609 12960 39257
6563 39257 15649 36835 22178 -1134 -33220 -76160 -49303 -17868 -24622 -32487 -29334 -20498 13454
6550 13454 33670 18225 21953 -16680 -11917 692 13655 17041 55289 48224 47128 68686 16258
6537 16258 13092 22384 30366 35321 50475 58742 45242 307 8142 16129 17590 9310 -15486 -14154
6523 -14154 -13965 13037 19235 8149 5972 -7259 -3844 10862 51681 75526 41860 -37551 -91120
6510 -91120 -43053 -22513 -21399 -16385 -39784 -48573 -27032 11212 19593 56816 72825 51350 33234
6497 33234 5368 3417 13165 39727 31969 -981 -25307 -4902 -4086 23102 3261 -2290 14159
6484 14159 26655 29579 6051 -23799 -55952 -60174 -46473 -18523 -2802 5462 -13275 -17765 -15496
6471 -15496 -6061 -21705 -41219 -4070 30285 14737 16661 -796 -1222 -9075 -24231 -22130 10691
6458 10691 22557 36909 50666 32715 -30406 -72590 -76007 -36818 1989 -16931 -56296 -50868
6446 -50868 -11118 1627 13868 7352 -13436 -32155 6995 33347 54591 24346 -11072 -29679
6434 -29679 -1158 16136 -30227 -18604 -358 -9698 -37854 -51598 -59725 -82506 -47501 -23104
6422 -23104 -45214 -47674 -67837 -54004 -34790 -3027 2583 10419 7892 40128 52444 90779 64719
6409 64719 40199 37215 53834 41922 45670 27179 33605 -25230 -90084 -52024 -26177 -6472
6397 -6472 11523 18938 -19908 -14897 -27551 -32256 -26403 -13116 -20261 -31416 -42308 -53827 -29202
6384 -29202 -1754 27270 27489 27852 42102 76911 91021 49308 10302 -29078 -67731 -36281 9292
6371 9292 -13016 -54384 -14475 46082 60273 23978 24692 3436 -7144 -27589 -41065 -55855
6359 -55855 -51779 -11313 3358 17688 23126 15488 38845 58668 17481 -20708 -37472 -61078
6347 -61078 -53504 -40688 -8964 -2916 -14511 6088 47060 61583 57092 40417 3413 -20431
6335 -20431 -36671 -43813 -28736 -31285 -34597 -39086 -89207 -75035 -73012 -46037 -31372 -1980 19932
6322 19932 -8887 -30472 5731 -11908 -27783 -50149 -59724 -51244 -86076 -115580 -108541 -37786
6310 -37786 -30922 -15687 14340 23466 31545 2195 -13376 -19868 -21651 -5015 -6606 -10018 -20992
6297 -20992 7146 3989 -20160 16526 43577 54261 49850 42084 -5788 -3745 11203 33573 55
6284 55 15532 67679 53016 43739 61941 85607 81752 39926 -33826 -65721 -76638 -73597 -48000
6271 -48000 -63916 -48654 -65782 -74354 -69816 -69566 -42549 -11797 38121 27546 -4314 -10787 -11178
6258 -11178 -39650 -61164 -87785 -75583 -94502 -57914 -32484 -36510 -26959 15784 23923 15663 -14614
6245 -14614 -33074 -31526 2073 12299 25330 12162 -13414 -46542 -54236 -52645 -38556 -19432
6233 -19432 -3080 -12206 -29167 -36072 -16989 -31302 -4041 -3721 -43904 -37721 -51268 -67257 -61698
6220 -61698 -46748 -45255 -65356 -77530 -44802 -62860 -46416 -28632 -48181 -53948 -41611 -38420
6208 -38420 -41217 -42951 -53519 -44503 10334 22984 -29619 -54742 -63541 -50637 -12466 -41851 -90460
6195 -90460 -113653 -110875 -104516 -84451 -75081 -63325 -81456 -49324 -37921 -16049 -3696 21431
6183 21431 64940 35793 12985 18931 23599 5572 -802 -11169 -15688 -25298 -40135 -1411 30336
6170 30336 27804 -7900 -32511 -70050 -51478 -17163 4870 37163 15075 -39068 -59214 -58011
6158 -58011 -33212 24839 40068 34352 12870 -18953 -26488 -42673 -75499 -104986 -117675 -51958
6146 -51958 -23115 -12248 -16994 -39898 -31390 -24395 3457 7175 7469 62273 75995 29188 2938
6133 2938 -47460 -67915 -50571 -62634 -113708 -105852 -73706 -71290 -54499 -12778 -1020 -41542
6121 -41542 -53111 -35005 1758 24813 60549 78177 82255 62767 34195 -10859 -2480 41489
6109 41489 37328 4240 -6664 2522 -27977 8648 26680 16115 -15943 -48326 -40442 -53118
6097 -53118 -38465 -49656 -75780 -94283 -114534 -103722 -72613 -58237 -31750 -20381 -11784 20795
6085 20795 21585 -1164 -20327 -20159 -38182 -73128 -111171 -129407 -102792 -80200 -28167 6213 30943
6072 30943 47586 47053 12434 20123 -8447 -19650 -39440 -40899 -28 -28668 -27040 8463 -8592
6059 -8592 -10876 10780 26530 38027 12772 9374 23331 13021 -20192 796 5786 -11025 -22053
6046 -22053 -19018 5254 20043 25722 4925 -38886 -53703 -45884 -63779 -44301 -53515 -55214 -18451
6033 -18451 -2606 -44069 -37901 -15317 -9141 11695 18776 19317 2440 -49710 -58891 -47702 -58147
6020 -58147 -32233 24668 30872 -15623 -9250 29876 1333 -13704 8128 17121 13975 201 -5537
6007 -5537 6405 64301 57260 12187 11748 -15376 -19591 15636 9795 -19961 -12943 21875 14702
5994 14702 -33834 26667 15139 -45859 -21177 15422 34365 36022 9176 -34569 -36407 10004
5982 10004 31856 11842 -22175 -73193 -63967 -38815 -1938 25467 45989 65280 68830 38972
5970 38972 45299 57875 23735 -6298 -35916 -33799 -16347 -8293 1759 28977 37389 48519 62389
5957 62389 45311 23391 14324 -6351 13722 8616 -27188 -13025 20920 36335 -1883 1802
5945 1802 -9606 13791 57960 38104 37381 104261 108417 89660 64025 15867 32000 35306 33119
5932 33119 15855 -29234 -41352 -15907 -21787 3518 17872 24455 44933 34540 22077 18998
5920 18998 -7968 -17463 -9616 34807 12581 -29547 -37603 -34349 -46775 -67517 -51527 -40278 -24294
5907 -24294 -11182 -5114 -37813 -46845 -6659 38010 22720 25645 15116 11617 -9537 11052 48120
5894 48120 23311 31511 39243 45360 42131 15511 54888 87465 86199 39445 -29768 -56560 -39301
5881 -39301 -23722 1803 16802 186 -19074 -36653 -46865 7101 52468 66045 77247 67563
5869 67563 37965 20544 22026 43261 -14827 -69507 -45781 -54785 -89828 -107667 -84451 -43552
5857 -43552 -26295 -36845 -62868 -43373 2756 9645 -9807 -50640 -29792 10083 32024 48716
5845 48716 67857 59524 22954 -17096 -44647 -26755 18163 40150 19271 2276 -2819 -31411
5833 -31411 -36584 -50077 -43651 -29584 -55245 -35103 -29572 -15629 -15532 -33611 -35634 -54199 -48824
5820 -48824 -31827 -365 -42195 -52301 -39978 -32128 -42584 -68668 -91342 -20643 14001 10667
5808 10667 -25219 -12968 2079 -14489 -14619 12457 -15210 -56898 -81885 -74154 -37713 -32856 -57382
5795 -57382 -48961 -17943 10687 2672 -15692 -7755 -11333 -14412 16934 15183 5683 5523 16568 -27577
5781 -27577 -56257 -35165 -5755 13995 34829 56513 50029 10560 -14823 -20814 -9638 -4759
5769 -4759 36533 48567 54773 41380 36964 62631 85618 115439 63105 -27292 -61314 -45754
5757 -45754 -12671 -3665 -12113 19170 13250 5148 -31633 -41009 12968 65792 53277 48274 84115
5744 84115 106650 99788 59733 38236 34910 11253 -1304 -7764 -16943 -13140 -33165 -51103 -42507
5731 -42507 -17378 -42764 -35101 -35830 -5536 33499 29133 46151 56842 37765 -1652 -13512 -16311
5718 -16311 -13687 -32194 -41929 -25425 -61105 -63993 -44120 -50856 -19566 -6274 -69 21746 51274
5705 51274 70271 34694 23531 32297 42019 45299 11538 -6103 -10747 -2005 6276 2452 4433
5692 4433 -13766 1187 3958 43126 41444 30323 -6669 25678 21495 16085 16432 17103 -18959 -16742
5678 -16742 -5321 -25021 8613 21169 5579 -14581 -29626 -37143 -16014 -31470 -46228 -93312
5666 -93312 -80182 -2126 2559 3404 40685 2851 -59934 -75306 -48391 -28767 -24021 -34626 -47204
5653 -47204 -3683 7086 -26046 -38146 -18005 -24136 -4022 -36076 -21414 -21318 -16866 -22444 -26578
5640 -26578 -37634 -41132 1241 -22015 4748 42995 54744 36968 13444 9011 20320 23862
5628 23862 6391 1306 10520 -18684 -51959 -34461 -37288 -54636 -73221 -82689 -65070 -36703 -23365
5615 -23365 15638 48970 35118 43728 57149 11466 -50761 -78599 -69854 -51847 21676 59007
5603 59007 34917 -7513 -19350 3986 -23889 3779 26080 8694 -8378 -18818 -41381 -59231
5591 -59231 -41393 42427 76864 79834 38461 19562 15593 15296 27688 12239 -3796 -10083 -12295
5578 -12295 32486 57917 57493 23556 17265 8867 2926 11890 -40215 -58678 -11389 -50835 -52714
5565 -52714 -9952 18151 40382 46922 32486 20881 29434 16363 -11047 2233 54357 37547
5553 37547 -23480 -18104 1362 -6237 -10554 -41960 -34032 -10062 -6648 -12580 -34894 -22276 -8331
5540 -8331 -26706 -8586 -2272 -12871 -40654 -17055 -10905 -24728 683 41172 51161 47183 60916
5527 60916 58108 48500 1584 -22360 -32153 -50495 -52320 -57097 -44395 -13544 5685 42326 20416
5514 20416 -13856 -47060 -69440 -82011 -84996 -96101 -53621 -36227 -26103 -8714 -39638 -61966
5502 -61966 -38824 -33784 -16909 -1479 -16536 4595 19153 701 348 -9922 39743 80205
5490 80205 83823 58462 63108 44345 17313 40532 10288 10825 6319 -23690 -13178 24116 62511
5477 62511 63197 14132 -12582 46 22547 23081 43815 791 -49402 -49900 -6996 14099 54058
5464 54058 79610 75250 3153 -32891 -46428 -32409 13748 38616 -193 -20329 -21744 2426
5452 2426 5519 9835 25189 9749 10844 17931 43652 67362 80908 66446 16019 -19588 -24177
5439 -24177 -28361 -37348 -9681 9523 -15901 14698 46409 35709 28258 11002 27707 31510 40110
5426 40110 19280 -17027 2071 -4327 -18863 -7022 23062 53294 36673 20538 2280 -11129
5414 -11129 -22280 -37268 -53759 -75741 -63163 -32366 -24855 -73144 -56977 16453 54219 18326
5402 18326 4359 -11982 -13312 -37140 -77385 -56385 -58938 -42018 -5461 36665 21122 -7293
5390 -7293 2256 -22975 2387 61686 56009 43729 13163 -12584 -1406 -33184 -46987 -60636
5378 -60636 -48309 -25267 -1749 44042 54099 43352 61922 29648 -17113 -6937 17008 54765
5366 54765 15385 -18841 -25789 -1170 63657 60227 53149 57068 38455 31245 64029 64063 60571 33150
5352 33150 -5855 -13180 -4422 12442 -2475 -22664 -54773 -22834 13126 11306 -39689 4103
5340 4103 29163 15121 24686 22666 2565 -62468 -104941 -87169 -53030 -68526 -87391 -78588 -49798
5327 -49798 13162 -13135 -31414 27160 50460 12236 -5612 -16282 -17888 -20804 2846 27209
5315 27209 -6484 -36259 -42620 21444 44694 1040 -12898 -7898 8889 16118 27183 -12675
5303 -12675 -34356 -40414 -65798 -60907 -58499 -52017 -35734 -349 34555 16760 -16266 1474 -9462
5290 -9462 -9322 111 -28903 -19447 -11012 18015 40144 40364 7560 -72920 -98237 -90713 -54469 -30090
5276 -30090 -42670 -21943 -35074 -23769 16104 19571 11325 -23489 -42985 -14132 29503 29896 21407
5263 21407 33597 37314 68768 62557 47493 38759 60724 92707 70803 19018 24909 9650 -1759
5250 -1759 38564 55650 37780 26074 27986 36951 47291 34177 4361 20064 35921 41789 32103
5237 32103 -2625 -34620 4720 -20858 -26935 -31885 -32925 -61651 -86590 -47065 -16487 7226
5225 7226 40581 10244 -48973 -102577 -112458 -85390 -74229 -57570 -34351 -34411 -9372 8593 18497
5212 18497 41996 34132 -2716 15657 -3098 -66582 -66411 -55157 -21306 -18243 11905 56080 15361
5199 15361 -25332 -19215 -26255 -67078 -74081 -53603 -52478 -37187 -57082 -46324 8378 -10596 -1551
5186 -1551 41252 -4647 -17767 -8940 -4305 -4915 -15989 5426 -3063 -14460 3112 -4293 -17509
5173 -17509 -28027 -37217 -33647 11777 -5831 -5409 23132 -12362 -11318 -1913 -9008 -23607 -28686
5160 -28686 3369 9516 -5298 -20907 3673 -8022 -14369 12173 26436 18299 28357 47074
5148 47074 40494 21986 41259 48313 -26649 -44657 -5876 11153 14082 -5318 30883 38144 58725
5135 58725 79513 15622 615 -10378 -25926 -30079 -27522 -59023 -61408 -54391 -29412 -10425 15619
5122 15619 -4623 -141 44724 66689 43513 -17941 -23849 -45678 -63490 -98933 -105788 -76258
5110 -76258 -35721 -14462 -67658 -108061 -90789 -90882 -104026 -74894 -31749 -10524 -13321 -1419 66140
5097 66140 88055 80790 42545 16951 30844 12595 -8886 -23705 -28112 3654 4592 -5725 -3321
5084 -3321 -5608 -30303 -49806 -21572 6738 4307 -25046 -5090 -45960 -90036 -76029 -35382
5072 -35382 -20588 6294 14357 34820 3813 -16377 -26033 6036 2201 11682 44244 62605 40257
5059 40257 58909 73119 52708 47658 50472 16153 -5509 -47746 -4746 16521 -6005 71
5047 71 4371 41228 44776 35964 22477 3160 5082 27717 32705 59553 47176 69783 67007 54443
5033 54443 19640 15787 22677 56299 80541 89764 67811 23200 5535 20325 5193 -45500
5021 -45500 -32946 24012 49612 48074 41065 -1453 -13934 -6363 -27754 -54826 -35337 -26389 2085
5008 2085 27152 20695 63698 72875 22137 -18188 -36213 -45235 -63755 -31771 -7112 2602 -37772
4995 -37772 -67527 -66807 -81306 -49759 38799 47033 10777 -21127 -26117 -17596 6674 24526 26594
4982 26594 41969 66865 56232 17143 6544 12424 25366 1587 -130 7773 -19552 -33802
4970 -33802 -65624 -78242 -52550 -50485 -6484 17104 31596 30974 3718 -26661 -52655 -42238
4958 -42238 -39148 -67475 -79415 -59456 -35667 -15713 -34384 -46733 -13520 -22675 -56574 -40484
4946 -40484 19077 -17379 -38540 -39802 -7454 19870 -8120 -30342 -1487 55724 67103 39013
4934 39013 34026 39335 5511 28214 27107 17991 21856 -18856 -14906 20196 23473 5650 -4603
4921 -4603 19898 44826 29990 43668 37313 -19962 -43234 -64066 -41024 -20095 -36347 -18406
4909 -18406 33246 29776 51175 43402 27944 27062 1594 -13203 12749 -828 31563 71193 80623
4896 80623 47048 40964 23071 25995 29747 15187 -3614 -16343 -19644 -25370 956 -18633 -17783
4883 -17783 -11582 -22259 -54458 -75370 -21297 -2200 -20932 -12206 5621 -18567 -6157 38011
4871 38011 5661 -12180 -38040 -30375 -6661 25781 -9211 -16950 -51095 -12600 -2535 -23919
4859 -23919 -39247 -29834 -11682 -21124 -13964 -16221 6839 14494 -19331 -23147 15880 26847 -26350
4846 -26350 -64348 -59686 -40219 7126 10497 31259 8310 15911 31550 31962 7451 -5069 2855
4833 2855 -2611 -2316 -7663 9283 -30301 -70146 -46699 -13964 -12474 -19436 -12823 -36655 -16417
4820 -16417 -6809 6866 10727 7976 12979 19841 1614 20150 26293 3374 -31391 24159 74577
4807 74577 96175 71657 54780 30001 -1381 11642 -3566 -18391 20928 24367 50526 42689
4795 42689 37719 56797 45419 30670 5808 14109 664 48137 83996 62439 81778 50748
4783 50748 20952 13424 22889 49194 86667 80611 49374 52935 46666 8839 -6110 15215 -9806
4770 -9806 7011 20658 18615 -13708 -23932 -2859 50202 58252 58580 45633 59678 80432 75966
4757 75966 51303 55326 10143 2783 -1233 9581 33588 45180 42186 -10106 22464 43006 73051
4744 73051 53907 33355 31958 40176 -4428 -2603 -24305 -14237 8849 -31877 -44786 -35582 -53588
4731 -53588 -8484 20733 19929 -32680 -44929 -51514 -25648 -2698 103 15558 3555 -74590 -83718
4718 -83718 -30566 -2449 -7166 12368 4345 3338 31111 45980 45267 -2730 -29081 -38464 -38609
4705 -38609 -64984 -81221 -108773 -73297 -9306 4551 -7039 1037 -15477 3133 37975 33148
4693 33148 11696 -7518 -13505 -21348 -34716 -33116 -28754 4895 46153 64936 42694 62778 36974
4680 36974 -9209 -32762 -18306 23138 61252 21133 54168 52784 3656 10699 15082 26081
4668 26081 13558 6932 -7995 12548 17586 14079 11695 -17096 -11070 -24075 -24861 13184 17511
4655 17511 13085 31695 14287 7279 4869 22625 47328 44066 26978 -12864 -33252 -10525 14472
4642 14472 -13363 -17294 -31116 -15876 331 -15335 -17473 -12934 18686 25040 25566 64873 77046
4629 77046 51300 23429 10880 33010 22779 19964 12676 11460 15940 3434 28150 64805 66814
4616 66814 47224 36107 21653 17250 -11293 -26965 -57498 -46870 -28770 -3297 30130 58956
4604 58956 27557 -1756 -16741 -25114 4965 12660 -20050 -59148 -72013 -32767 -22261 6938
4592 6938 8137 450 -4080 -12938 -11959 -8973 -9045 -20321 1594 34777 31092 48743 35217 14606
4578 14606 -29697 -27060 2162 9295 -33394 -42151 -52912 -37870 -41184 -28133 -20928 11646 -19100
4565 -19100 -61728 -73892 -75089 -100686 -116604 -89503 -58187 -51573 -28011 -21466 -1531 -32021
4553 -32021 -31073 -29586 -48046 -58839 -68217 -9497 -2275 9545 5769 26005 37209 56387 55146
4540 55146 41595 57233 48604 22990 48295 38319 28315 29793 -3705 -36468 -77638 -63387
4528 -63387 -56487 -46875 -39069 -38267 -41215 -27691 8648 -9641 -19865 2630 21095 24539 11071
4515 11071 26059 7325 -1418 18922 7769 -16561 -28235 -19378 6666 5120 -9742 1518
4503 1518 2229 -18960 -10226 -470 12672 21107 6728 -37096 -37322 -4867 4629 8786 14611 4062
4489 4062 28462 94719 85536 5213 -30365 -28400 -13301 25205 14127 -8882 -6359 37582 70955
4476 70955 90131 103909 95085 53909 34388 24786 6872 4612 17923 36518 32220 5927 -3199
4463 -3199 -29245 -32674 -58888 -34638 -12633 36989 48279 21610 -12301 -34303 -2340 -7404
4451 -7404 -3979 40606 17149 15368 51628 84402 51095 9743 -18879 9176 6340 8208 4275
4438 4275 -41342 -50820 -20410 32378 32640 31448 28518 12664 -4499 -5264 -19333 -29942 -35306 -11873
4424 -11873 -4463 -22035 -16589 -36162 -29482 -10727 -12037 -21339 -23671 -5139 9183 -1031 10188
4411 10188 -6161 -4776 17759 -804 -41209 -44443 -22650 -1674 -3525 -25783 -9493 -737 -14907
4398 -14907 -41105 -36928 -13878 29740 36236 34301 48840 51505 29623 20661 15761 29636 23942
4385 23942 17594 -4500 33578 55483 18633 -24505 -7667 17263 29049 14203 27728 67398
4373 67398 62265 90604 133179 111194 59212 49040 41025 9524 4957 17860 3029 -31112
4361 -31112 -9791 781 -20384 -33959 -47366 -51890 -63145 -53709 -52182 -61302 -87110 -46287 -27335
4348 -27335 -13855 -4647 -155 10940 -22994 -37238 -52690 -50440 -31095 -2749 41598 67052
4336 67052 52068 35878 33226 28527 37244 35587 15410 -255 21509 33420 6617 1724 -12319
4323 -12319 -38068 58 -17122 -16333 -44224 -16381 -42065 -33738 -1229 51185 89255 116691
4311 116691 83838 50666 24079 -1612 6851 25386 48629 31048 -11306 -10407 7831 -41835
4299 -41835 -82747 -64432 -31122 -11261 5777 7690 -21394 -21512 -24480 -46278 -34433 -32423 -43039
4286 -43039 -36527 -12868 -2872 -2474 -37629 -39816 -49488 -46932 -55417 -59333 -44642 -8543 -9904 -16551
4272 -16551 -29944 -28953 -13042 -29952 -17487 -28449 -41156 -57983 -66862 -68472 -48532 -7191 519
4259 519 17104 3975 -8657 -17478 -12307 1961 35840 32210 -1490 -14812 -13657 -29692 -43835
4246 -43835 -37558 -45106 -45358 -35813 -41534 -32814 -26412 -57802 -113452 -88093 -77447 -46609 -30016
4233 -30016 -44534 -54098 -56052 -30255 -14476 15691 33831 24922 11547 -20062 -3717 11591
4221 11591 -10517 -33356 -22642 -54990 -65665 -29743 -23731 -3609 35527 39842 64624 60714
4209 60714 -7596 -23401 -34980 -34884 -25808 -36602 -52030 -12874 12921 35986 51460 15423 -11831
4196 -11831 7378 22725 19133 -7809 -32880 -34698 -38343 -59312 -65592 -21688 22995 39712 17562
4183 17562 -11656 -27127 -29398 -47267 -55528 -41786 -50191 -63910 -20565 -4274 -17718 -30350
4171 -30350 -1600 -26535 -58030 -40674 19787 22080 -16746 -38721 -44121 -25444 -15756 -13548 -23617
4158 -23617 -3069 -726 -25374 33292 64674 36068 7 -14297 -23022 -57952 -59510 -46522
4146 -46522 -43718 -39212 -56711 -47294 527 25593 53828 52972 39195 41748 21828 27408 23358
4133 23358 25568 -27513 -43577 -45341 -38734 -13488 12843 -18246 8588 17784 27151 23067 -7465
4120 -7465 -18555 -2066 -27682 -60289 -77786 -51313 -51872 -5493 16914 10322 20193 -41228 -56927
4107 -56927 -29600 -36784 -23912 3208 14209 25327 50440 40971 3753 18765 6595 8743
4095 8743 19464 43957 29211 28761 38246 56559 68954 28280 3329 46798 45390 -12149 -56374
4082 -56374 -49975 -28501 -49935 -79173 -69826 -69838 -80265 -92030 -65621 -27850 -27596 -40960 -50141
4069 -50141 -49340 -54632 -26225 31466 -6491 -10566 -26842 -39106 -40112 -3324 26592 60686 33033
4056 33033 -3331 -12932 -13058 4263 6627 10110 -2272 -8953 -53852 -35576 -8954 -1077 21286
4043 21286 50936 50574 11059 -5847 -34745 -27226 8629 46727 26777 -16658 -7877 21512 31041
4030 31041 21807 35767 42010 -6844 -8532 42313 65185 44287 27277 1336 -34822 -6783
4018 -6783 -14662 395 7773 -3727 13644 -8022 -16817 23668 20653 -2699 2399 11835 9269
4005 9269 4066 -2817 -9885 -20394 15961 -14374 -11784 32847 27373 13830 12691 19535 29879
3992 29879 12541 -3096 -22640 -21326 1332 -9965 -32183 -70319 -70510 -56850 -37288 -29308 -61759
3979 -61759 -34444 -13539 5688 29329 15457 -23216 -49653 -100299 -48749 -2629 6153 21989
3967 21989 16920 39360 49224 -2309 12730 35340 27934 -19438 -14739 -15803 -17922 13808 32017
3954 32017 30683 36326 -4959 -13906 -6040 -28291 5693 25509 -3503 1759 -8659 -56504 -50121
3941 -50121 -18183 15301 43905 7409 -46414 -38228 -16614 23130 46331 59801 41695 18923
3929 18923 20942 28412 43718 33307 -3288 -28517 -18330 -19321 -39800 -9548 9740 9483 -3424
3916 -3424 -5600 -24764 6158 67549 100720 78071 55754 33385 9692 -8580 -10585 -2023 -25959
3903 -25959 -15378 197 -9158 7739 26820 -11703 4377 34061 13066 12669 16170 29657 46276
3890 46276 22434 28638 50662 52182 16206 6118 37310 55114 74722 109147 103983 77769
3878 77769 42183 35097 27404 8768 -11056 6950 22387 19924 34465 31665 -31599 -29244 -46405
3865 -46405 -52890 -24931 -25245 -36763 -16508 -27390 -42114 -41304 -39241 -22004 -15349 11086 10850 12110
3851 12110 28748 31249 38664 11544 14728 45866 59874 58307 35101 59403 42605 59380 64993
3838 64993 18600 15097 25548 4641 -41012 -32864 -14741 -21834 -45823 -72656 -77042 -62307 -25528
3825 -25528 3659 3087 24742 70710 62292 59737 43956 44617 29188 887 -29782 -22588 -12212
3812 -12212 -1791 -27828 -24102 -16083 -8324 -9696 -18764 -36318 -32248 -23946 -16573 -30309 -30916 -7898
3798 -7898 -26756 -32668 -30532 -20601 2087 16289 15268 -19906 -34938 -31422 -38544 -26873 -20436
3785 -20436 5398 27363 -4336 -13762 3204 26106 26413 -2266 10872 16780 32839 51575 24342
3772 24342 14354 49212 44775 29331 48759 23354 40859 9149 -19288 -2557 865 -1469 -16722
3759 -16722 -23034 -41034 -72395 -45211 -34437 -35044 1293 4551 23064 39785 22118 -13793 14599
3746 14599 16911 -21957 3494 -22208 -34490 -10060 10316 -13346 -38833 -42482 -3732 7559
3734 7559 -12272 -6056 -898 17299 15712 3822 833 -24989 -61831 -57170 -47628 -38171 -51183
3721 -51183 -17632 20095 -5896 -843 -8242 -13482 11653 53372 2499 -38345 -17845 -24057 -37852
3708 -37852 -24670 -51013 -89092 -63961 -42822 -40452 -1248 13183 785 -11318 -16393 17315
3696 17315 -16395 -2755 23671 37044 43647 4396 -43488 -532 12937 3655 -14521 -16902
3684 -16902 10048 2088 27541 33152 27869 47101 30656 21670 45381 56953 58648 40906 38976
3671 38976 15168 -13010 -6747 -32654 -56703 -35554 22921 45366 28357 18233 -28133 -47873
3659 -47873 -47940 -52991 -73543 -66535 -73399 -24967 -6236 15678 40486 65762 58508 6847 -32801
3646 -32801 -18328 -7830 -9403 -3781 9809 13813 -6392 -7642 1689 1338 -52776 -33363 43416
3633 43416 69862 60751 9267 8675 24833 24256 21710 -15122 -3291 46707 34653 11071 52663
3620 52663 48101 59781 63267 57334 51607 34634 14278 25841 25975 6354 36912 67465 76858
3607 76858 80702 36947 39337 51491 29961 24613 69539 95257 73593 58481 47706 45562 26597
3594 26597 17000 13448 -15042 -27653 -22672 16402 49011 80958 85132 34767 5115 29497 67952
3581 67952 80664 45227 -14389 -48909 -36543 16439 54418 30664 -9251 10059 58330 35886
3569 35886 27628 29487 -10328 -51839 -63965 -30462 2941 64 -22183 -41951 -53119 -21929
3557 -21929 -1121 37008 -16597 -34907 -8055 17114 24877 12473 6584 16128 5861 959 13166
3544 13166 14494 -20519 -40493 -40428 -22731 208 33274 10598 -32554 -34761 10844 23258 -8290
3531 -8290 -20271 -12703 18590 54235 72278 47649 14312 8959 28380 22174 -5680 -7226 21653
3518 21653 23308 13912 44167 43876 17371 1511 -30650 -54055 -31726 -7509 -23682 -45050 -58837
3505 -58837 -55159 -80009 -39920 -11925 -3449 2376 15799 59573 30800 32896 47067 25631 18390
3492 18390 32328 -468 -6273 11031 23453 -9151 -16932 -3183 -26896 -33421 2429 18057
3480 18057 -20439 -42931 -49258 -34483 17465 -7240 -37971 -53276 -57628 -22179 3252 -9035
3468 -9035 -12694 -3882 12206 34081 58982 72548 64154 86762 85805 43806 -2553 16790 1548
3455 1548 -40139 -63114 -52380 -13346 13147 -1663 -30051 7061 49208 56980 48624 40750 10246
3442 10246 9483 1193 36815 17744 -20472 -59295 -36074 -5641 11228 13840 6765 16640 19218
3429 19218 12285 -19376 -42927 -46607 -53163 -27567 -24386 -19304 -12728 19081 -8722 6328 3882
3416 3882 -26914 -15204 -15639 -15024 11641 17407 -3648 6506 57592 56608 26177 -31865 -26632 6266
3402 6266 28835 16424 -18826 -39777 -92173 -59936 -42333 -19801 -26875 -40292 -41096 -58284 -25063
3389 -25063 -8534 -41632 -89643 -62285 -36466 -159 42284 32253 8713 1302 7525 35953
3377 35953 30898 -20724 -49044 -39233 -27260 -1577 -10902 -27365 -41199 -32424 -22627 -39571 -48931
3364 -48931 -16316 -6497 9497 4524 22922 43271 39305 9506 -23909 -37718 -21896 -14988 -3921
3351 -3921 -1198 11263 20932 -27370 -43476 -38028 2860 -3158 -16345 -48679 -68592 -50061 17532
3338 17532 20020 44568 48770 34378 52520 58667 14701 1688 23455 54957 38809 19031
3326 19031 18832 10200 46008 58124 44145 48439 -5118 -35568 -6090 19973 26162 -12188 -46662
3313 -46662 -49793 -33705 14602 6803 13081 9863 18752 23931 -2584 25095 18709 8886 13899 18911
3299 18911 42336 31521 -5962 -23913 -31836 25870 35296 1758 -3598 -890 -5611 -24758 -37783
3286 -37783 -24241 4513 49704 56907 30191 15583 15571 -2427 -15090 -11594 -516 37885 -659
3273 -659 -28577 -44077 6225 -11085 -55616 -86254 -67776 -34269 -44846 -9223 -27234 3682
3261 3682 -9927 11592 45643 88310 43244 20146 51785 56961 63114 16847 -5236 -31929
3249 -31929 -37220 -52589 -41390 -35991 -33390 -17855 28658 52784 52130 25869 8252 37503 61005
3236 61005 29792 -8492 11386 -17289 -19154 -22154 756 8597 11246 -19543 -18348 -24837 -13212
3223 -13212 31855 38396 22186 12049 -9735 -12831 -2236 2822 16936 33252 23178 28963 73580
3210 73580 56494 13749 -20692 2796 40194 29805 9784 51589 86293 68701 19927 -29131
3198 -29131 -42534 2464 13780 -15323 -24861 6835 9228 37666 34772 31072 42637 41478 2726
3185 2726 -29149 -42110 -19876 -36111 -16521 7570 5220 32881 -12868 -26006 -22354 -34045
3173 -34045 -4683 -27180 -42210 -78131 -95783 -77150 -45681 33214 -10477 -24282 -3950 19120
3161 19120 45128 48589 13527 -32751 -24750 39629 97526 84557 38221 9078 94 7359 -30039
3148 -30039 -8303 13027 17940 6935 21065 9065 6857 105 4408 -6730 9208 6326 -6212
3135 -6212 15922 38977 10052 -58979 -64538 -9565 25943 32885 30384 18072 14755 11453 34020
3122 34020 38811 39019 67310 61667 79291 81343 77103 103647 116340 88403 2108 10858 20114
3109 20114 -2168 -19183 -29693 -41274 -50491 -50844 -62631 -36999 -63686 -53436 -39854 -40867 -15895
3096 -15895 -31344 -53268 -52437 -30207 16580 10885 -69 38048 41479 22157 11722 -23575 -16866
3083 -16866 -22848 -22573 15753 56132 95239 84133 65332 67942 33266 40973 62354 50958 37786
3070 37786 7643 -1410 36567 38656 30608 284 -21488 -15987 -24501 -16620 26722 26198 17166 33085
3056 33085 46474 51587 15478 -30812 -57418 -53688 -30603 -44331 -14402 -5143 -32846 -31978 -14929
3043 -14929 657 -40104 -43881 -22549 34877 21829 -273 6451 25905 18687 14624 708 -14385
3030 -14385 -5412 26042 39405 71392 85690 73288 85108 52842 75520 76099 58857 53581 42575
3017 42575 19005 -19490 2264 -4830 -68057 -65342 7953 47505 29567 -40 13838 7753
3005 7753 12960 -3190 -22710 3701 -13623 -3811 -10150 3980 -59457 -88807 -73279 -26701 18222
2992 18222 -9246 -42958 -21840 -21607 -61784 -72362 -33980 1173 269 -315 9940 -1527 -29168
2979 -29168 -41841 -26611 -18303 -43434 1165 34126 17420 38064 33014 -6295 599 5200 30648
2966 30648 58739 46084 30302 12301 -300 -25981 -48533 -39798 6960 -28072 -91865 -82014
2954 -82014 -39860 -18128 18265 36428 13288 13081 -2145 -2726 937 18863 37222 47491 21892
2941 21892 371 24250 24714 34516 15861 -20126 29411 56441 34689 31836 35098 53962 48708
2928 48708 49364 27814 14791 45066 51772 82523 63879 49264 61524 23186 21657 71303 101253
2915 101253 57686 32029 -16650 -39737 -5555 -56500 -57973 -47559 6597 12071 -20561 -32526
2903 -32526 -54701 -55223 -60896 -46689 -55000 -58613 -95237 -91927 -56630 -61038 -66008 -7158 7228
2890 7228 46031 38146 6729 3494 27368 27764 25997 4990 -28772 -55712 -43520 -35903 1916
2877 1916 14027 -29282 -45576 -38110 -8092 13249 72173 67378 18040 -25393 -45542 -65384
2865 -65384 -64567 -66891 -32530 -42462 -50900 -39351 -35578 -19913 934 -9235 -33498 -21741 -7617
2852 -7617 15298 21969 19723 11074 10279 7257 22897 23547 6585 1515 13686 12261 -10147 -27392
2838 -27392 -89786 -90052 -67803 -71185 -74278 -30134 -31727 -18573 15743 16455 16670 7907 12933 38520
2824 38520 45159 24388 51804 12474 -28497 -65724 -72511 -45631 -43322 -23667 -12719 -18220 -3911
2811 -3911 -4128 10244 25445 43710 64464 49558 10263 -17779 -30593 -5971 60563 88747
2799 88747 68917 59099 19437 -4450 -51548 -33704 -5287 20147 14437 21862 4498 10691 19115
2786 19115 -30354 -35618 -19880 1486 8001 -4216 -19084 25069 -11023 -68630 -75948 -42801
2774 -42801 -28432 -27001 -39393 -60067 -26757 -30262 -70777 -73052 -35770 5658 1896 -8009 -64314
2761 -64314 -112262 -31631 25321 26848 34079 18824 19134 -4136 -6316 6106 -7506 13432 17324
2748 17324 -8644 -2106 -8426 -20752 -59229 -44420 -63962 -48556 1663 10663 21247 12814 4359
2735 4359 32762 63012 33663 -5621 -29574 -34311 -36524 -2926 4695 50355 33917 24876 27537
2722 27537 9853 6744 62443 57048 61506 25804 -7974 -15499 -15101 -42719 -57934 -4439 34495
2709 34495 56003 39640 -28387 -51021 -28152 -15851 5568 29054 32396 29252 -3669 -32434
2697 -32434 -28984 5638 19720 17740 39934 -19301 -56559 -47915 -36504 -39879 -28099 -19697 -14582
2684 -14582 -41268 -31482 -15950 6176 16623 22483 -13094 8130 7331 -14961 -26495 21706 -24381
2671 -24381 -67696 -26991 11996 18441 29562 45524 11537 13550 47925 26640 -10419 -18117
2659 -18117 21775 36243 -19897 -25728 6317 43926 53701 80591 109445 81473 54557 49367
2647 49367 56120 18225 -11572 12017 39454 37044 44125 32721 11640 16781 35324 49362 47617
2634 47617 27420 32346 46165 49789 -20448 -37692 268 56331 64430 25876 1449 21140
2622 21140 21393 39822 41917 29483 30777 46423 82803 44406 -4370 -34217 -37190 -23960 -1833
2609 -1833 -38470 -85157 -64475 -36471 -17798 -29186 -33569 2837 37713 65336 71867 91077
2597 91077 88496 88774 50697 -16309 -40949 21712 41315 -8523 1568 -3429 35750 55773 56097
2584 56097 32938 13277 3200 -20502 1685 22765 27083 23681 10384 7436 -18469 -30973
2572 -30973 -40791 -10829 -7504 -32103 -27640 -19360 -1118 11033 29597 8998 -35021 -29608 -22615
2559 -22615 -13466 -4721 604 -7854 17740 62238 25289 -35791 -16986 9338 19983 34693 43542
2546 43542 -4208 -5198 8689 2749 -24668 -11222 3060 31879 -4988 -16240 15079 29036
2534 29036 7767 -5107 -17535 -24023 13590 20444 20796 45026 37865 35741 19020 29514 -6241
2521 -6241 -57498 -49448 20640 72647 48312 -8576 -19689 -20478 -11669 16635 40613 36509 12550
2508 12550 -8787 -41670 -50348 -52526 -62612 -61810 -24246 -27253 -42442 -82480 -85872 -91464 -55671
2495 -55671 -13963 11949 9430 -27102 -8655 12461 45111 54449 9750 18980 43095 54470
2483 54470 85344 69286 48806 26118 39954 40726 22365 27542 11011 -8864 10070 9042 710
2470 710 8382 25397 18569 27181 680 -27277 -42633 3155 3104 10442 30805 34079 27392 41680
2456 41680 36881 13211 -2122 50793 56607 15412 20849 44780 46276 18896 -4098 -5766 -14692
2443 -14692 -24986 -30732 -32299 -19167 -1308 26425 29876 3157 -15674 3271 26651 28204 15150
2430 15150 -34637 -48421 -42628 -51291 -47331 4342 29080 40757 15619 14042 -13598 -64098 -45722
2417 -45722 -50810 -77397 -52302 7608 1242 -31272 -31252 -8910 12523 22152 41160 56547 65584
2404 65584 34262 -8755 -5471 28089 -33128 -61319 -68352 -61233 -45221 -42621 -60667 -61292 -37285
2391 -37285 453 9459 -5861 5523 15693 15561 9532 -2000 -6674 3128 9233 30844 57387
2378 57387 41972 8771 -6358 -38277 -36051 -29163 20516 23735 22768 23190 39752 45366 21301
2365 21301 3077 -2743 -3976 -4793 -14923 7620 -15594 -39167 -46412 -36411 18546 57729 42359
2352 42359 38542 50313 16538 20613 31559 6668 -15406 1036 45768 48336 8077 11845 44940
2339 44940 70776 47285 21742 32290 26032 21598 27508 17574 18888 19879 52142 35169 6314
2326 6314 15327 14186 -1157 3057 30590 49769 67094 67691 47779 10580 -6152 -17310 -32940
2313 -32940 -51456 -38599 -3076 -20269 -15720 20905 48311 45788 30505 70803 89348 38429
2301 38429 14681 43540 69491 82980 81412 59969 1550 6671 -5373 -26195 -48489 -33695
2289 -33695 -11088 6014 -20672 -14699 -886 1733 32004 19147 15358 32822 48831 92673
2277 92673 98122 90613 79699 83178 81143 92236 85093 37820 49269 74911 78681 55817 59732
2264 59732 42498 36593 8270 -17260 20353 24053 12378 15974 19154 16625 31071 62465 63511
2251 63511 3504 -53547 -80197 -27789 40384 48455 15233 -29350 -49229 -66847 -78197 -36564
2239 -36564 4456 1851 -23779 -30943 -31485 -49398 -36727 -28963 -63593 -81676 -83976 -52327 -25136
2226 -25136 6847 6462 7520 -11584 -51263 -86465 -73612 -23161 13657 45921 39800 -5966 -9383
2213 -9383 -16347 -10028 -6766 -4600 -17928 -1316 14296 16802 22634 23262 50076 58175 68206 77185
2199 77185 42041 -9979 -7473 -5053 2352 -15788 -6354 -21044 -33784 -60309 -43484 -19562 22006
2186 22006 10590 -15356 -7576 29305 64296 45724 29528 6297 -5962 -311 20699 17182
2174 17182 16063 8373 47147 29937 4395 9800 18541 -10627 -20195 -18395 -22500 16517 11972
2161 11972 -31038 -59416 -81719 -33320 12800 17961 19519 27995 30545 8665 40609 45774 5349
2148 5349 -30226 13498 9324 -7850 -20462 29200 59510 39389 27731 -1515 -28369 -29823
2136 -29823 -37437 33826 41526 6297 -7966 -43505 -15034 38374 63415 53128 32252 12222
2124 12222 13551 14592 46149 60785 54702 25307 -26162 -55464 -64088 -51160 -76447 -105464 -117743
2111 -117743 -83787 -82703 -80029 -45034 22453 47848 21822 -17931 -45497 -50842 9696 891
2099 891 -19954 -930 12689 27300 53985 87140 96960 77487 38786 25439 5889 2499 3384
2086 3384 -39705 -11851 17576 24948 26093 31862 38157 11250 -17059 -23553 -31729 -16309 7400
2073 7400 18485 33392 29944 -17580 -24354 -36381 -1066 45961 16356 -20563 -35630 -32390 -35317
2060 -35317 -29273 10170 15490 -25031 -15646 -3002 -5047 -18033 -11486 6454 9692 34902 45267
2047 45267 25928 49098 47052 38099 31445 45119 4855 -19963 2013 7813 -19498 -43046 -51983
2034 -51983 -74822 -60626 1376 4315 -52993 -62537 -86525 -76595 -86701 -80562 -37221 13489 55597
2021 55597 38534 -31000 -76674 -91179 -79595 -59370 -84683 -84096 -21209 -24981 7635 70205
2009 70205 78065 41903 25654 -18008 -61113 -67436 17112 31033 -4455 -21677 -9414 34638
1997 34638 91269 84129 59821 52096 48846 11803 171 2627 9098 19435 18993 -16091 -38335
1984 -38335 6963 11057 -8900 -19454 -13493 14047 -11244 -10697 -20330 -56654 -19982 -28079 -26927
1971 -26927 13983 18542 -428 26 16402 -9714 -53894 -52796 -27364 135 26335 29678 36791
1958 36791 34249 3851 40295 21192 9685 3514 -15428 -21683 -13724 -564 -16413 -18023 -1463
1945 -1463 27141 20454 -9421 -22662 -41275 -44354 -57825 -62286 -12783 21288 29316 -11907 49291
1932 49291 88956 34395 11502 -431 -27376 -21126 9446 23509 54932 40684 8656 -4661
1920 -4661 -33016 -4323 34917 31198 50172 29407 31255 32770 25832 5351 -4617 -4937 6728
1907 6728 41998 39831 22646 -6449 -11874 -3241 -14135 2775 48827 110777 86316 64044 27643
1894 27643 15052 46129 63491 49862 58940 43970 62853 69183 62156 38949 14278 -1380
1882 -1380 -26983 -12677 5352 -34200 -26960 -9514 -25334 -29227 4929 21204 62231 68802 19284
1869 19284 3486 22011 -6176 -212 35168 41165 69543 40938 19828 11934 -24119 -44743
1857 -44743 -3287 26414 10453 -9122 -40646 -59126 -44974 -38807 -66821 -64046 -15453 15475
1845 15475 51461 91545 56457 23789 -9823 -87288 -75608 -23596 8792 8105 37205 -2356
1833 -2356 -32475 4545 39463 21594 3461 -22739 -49186 -61087 -46141 -24765 -13476 30595
1821 30595 8527 35942 25962 28999 37032 17730 -17829 -20574 -11900 13362 58364 85024 84304
1808 84304 31424 -22863 -36810 -83975 -117744 -58551 -49913 -105118 -117966 -118836 -129017 -116615
1796 -116615 -46918 -46461 -61653 -51646 -32914 22846 43210 38802 24518 -22966 -3885 -11554
1784 -11554 -48858 -37278 6653 28819 -4868 25477 37536 31568 31111 32850 -16723 -12936 20617
1771 20617 -2962 -25369 -48675 -61078 -60995 -71058 -74551 -15560 572 41693 42265 51625 60173
1758 60173 53835 35907 -35698 -66181 -41426 -16487 -52229 -71675 -45416 -41002 -8593 21314
1746 21314 20829 -183 21380 24819 45966 73722 48649 48635 33229 -17632 -33908 -43018 -28259
1733 -28259 -4198 -36768 -46560 -28608 -17442 -21588 13361 3669 19729 2484 -35448 -28183 -6109
1720 -6109 -8014 14247 10599 -14470 -46156 -45608 -64811 -56696 -19574 25531 -473 13204 41215
1707 41215 27474 39538 23662 19101 -9565 -50547 -36799 -12571 -23137 -34638 -14594 9611
1695 9611 17632 33222 54431 48303 53988 38062 24454 -11089 -11346 6958 -30529 3302 19029
1682 19029 25541 16204 -6393 -54753 -110109 -134874 -92657 -42886 -51291 -67694 -55204 -47273 -39807
1669 -39807 -79347 -51276 -49829 -37391 -16869 -4315 -18018 2801 -19666 -28575 -42869 -63826
1657 -63826 -63153 -66272 -29625 -18118 18665 41380 36974 5711 405 16310 -2051 1874 7785
1644 7785 22996 23328 17587 12206 -14987 -17044 8816 5049 -43488 -88134 -109046 -72652 -65850
1631 -65850 -94638 -90103 -50811 -5422 17900 17501 -66 -13191 -20123 -47748 -57663 -37185 -22098
1618 -22098 -15250 -21081 19532 38562 33975 -2360 -20357 -15631 -24348 -3972 1039 10389 8692
1605 8692 4634 26805 60848 68660 41672 26927 32360 50303 50737 68291 43469 -9055 -18117
1592 -18117 17146 40400 29844 17963 21824 48848 5235 -40672 -43457 -47004 -41233 -45148 -46808
1579 -46808 -5960 29003 35102 6375 12675 2596 -20135 1121 14487 38954 44596 29464
1567 29464 42586 80389 55513 30573 -2781 -13176 -1014 10025 29483 17356 9172 -12210
1555 -12210 -22919 -28766 -62858 -33151 -3572 -8546 -18726 -49416 -27546 -18359 -4700 -32339
1543 -32339 -3636 6909 1421 14644 7111 40237 58213 40274 19280 7323 31095 41407
1531 41407 -3609 -35132 -45894 -11362 -22175 -56441 -5425 25112 46226 71067 27362 2927
1519 2927 19470 13240 3367 -17808 -43383 -53737 -32775 20657 29439 -9554 -15016 -44333 -7910
1506 -7910 2935 2879 29343 60154 49779 39540 61007 27265 -15808 -37982 -70776 -35211 16400
1493 16400 48903 71559 85708 51590 33659 27998 20693 13476 14490 -8473 -20224 27098 25518
1480 25518 10764 -11418 11915 31573 -863 -4979 14222 -8004 36843 51674 38441 48548
1468 48548 32463 3092 39254 62046 18634 -1381 4787 8394 26127 -3279 -13771 -24554
1456 -24554 -81154 -63236 -24565 -42993 -79487 -70728 -36352 -21141 -15733 -77045 -78548 -34173
1444 -34173 -34 23932 25671 7868 24069 23715 21826 43215 18920 -11559 -6753 -9653 6711
1431 6711 3564 -36446 -72772 -85433 -67933 -1602 6553 -2206 5728 20126 22177 -22211 -20677
1418 -20677 -3959 -2282 -20672 -7331 -30 -10768 1866 -10960 -33569 -35932 -27888 8880 35205
1405 35205 28219 34306 23100 41712 63861 58182 39745 53674 63727 18437 -1274 -6470 9966
1392 9966 8482 -19797 -14220 5987 -33468 -14894 24676 883 -33764 -38263 -5751 -10353 -16007
1379 -16007 -7080 -20152 -36984 -50340 -26418 -6298 17872 38510 30656 -4852 -31173 -38055
1367 -38055 -13694 16162 8781 -9267 -22866 -36885 250 -9261 -5205 -7550 -4096 47180 21567
1354 21567 -31711 -14796 22180 30648 -1517 10531 -14123 -40395 -748 15046 14163 28741
1342 28741 12623 31060 42008 36416 17693 25795 33824 28288 41376 49137 74570 67819 13035
1329 13035 -11376 -34101 -27056 -5451 -42496 -45511 -53189 -36094 -29141 -25539 -16381 6986 28817
1316 28817 -13271 -23564 -24917 -19208 -20027 16942 18688 -953 -22083 -18000 -25069 1639 8782
1303 8782 -17861 -27732 -14840 14413 41143 93493 48129 -22047 23444 25977 54254 14323
1291 14323 -9658 -25066 -26599 -16050 -5565 -37896 -35082 -27477 5258 12852 -29432 -12932 42667
1278 42667 40467 4317 -43364 -59942 -24750 -18794 -8154 -28392 -47367 -50608 -14359 -12741 -38020
1265 -38020 -17101 -11101 -7596 23506 47368 41248 38149 9014 1881 22232 30300 30850 17723
1252 17723 11364 -2132 -24858 -54438 -27512 -9110 -13985 -13994 4576 32428 11406 -8021 -49022
1239 -49022 -59962 -66770 -78752 -27944 11180 14981 5517 -6534 8389 -2428 15723 -24149
1227 -24149 -41233 -23795 26363 60861 55701 32907 2904 -33730 -22757 -22677 -22139 -30697 -51228
1214 -51228 -53591 -16843 7733 14993 18226 40483 61528 78899 78082 68251 79274 71736 26783
1201 26783 -39444 -34832 10806 24317 -40120 -55373 -12841 -2362 -21214 -46986 -10583 -28878
1189 -28878 -7962 26027 24091 2754 -19733 -80883 -51692 -27538 -979 392 30384 57234
1177 57234 31488 -8974 276 11834 -30152 -61284 -36468 -7888 -31762 -40890 -20563 18529
1165 18529 33545 30324 18134 11892 7578 -23273 -42927 -16278 -19160 -59480 -80369 -95924 -57902
1152 -57902 -35411 -6397 -22767 -19514 -19726 -12406 32429 38378 -9785 -22007 -20022 -12134 12600
1139 12600 33137 50829 59043 30460 -16750 -15325 -1200 37030 -8622 5158 36314 66790
1127 66790 69521 53931 35247 59324 32247 21422 9063 27126 20523 -441 3272 46936
1115 46936 70324 57765 23780 -28619 -41085 -34248 8011 -13357 -13301 -13468 16728 8945 -4298
1102 -4298 -28415 -43995 -50263 -64204 -38903 -53930 -45384 -16215 12886 14912 -5085 5796 -783
1089 -783 -28358 8007 13903 6839 14933 35674 32538 29504 10173 44406 55510 27268 -33031
1076 -33031 -54568 -38394 -18335 17505 28996 62177 48087 -8810 -18226 -10145 -25621 -61845
1064 -61845 -28149 -26975 -30755 -38075 -15616 26549 21360 5637 -5614 12270 21189 -11605 -23432
1051 -23432 24766 28748 11709 -8076 -20436 -55544 -13244 1761 20775 9671 5861 7796
1039 7796 45874 70448 46570 43732 1848 9542 37451 33594 14608 -53711 -50390 -23315 3589
1026 3589 30036 17297 -11274 -18431 -691 -9435 -13614 -20219 -33702 -20420 -2289 -6386 -29929
1013 -29929 -49766 -82979 -38950 -11741 21576 44035 42612 19508 11908 15370 32245 39697 5812
1000 5812 -21320 5929 16356 5571 -4225 -33834 8064 44409 34202 20229 27710 19697 -15546
987 -15546 -11892 -14124 -2821 25223 -4732 -16242 -11755 10389 15598 -576 -17961 -48115 -44000
974 -44000 -20205 -28327 -50528 -48359 -47233 -66919 -64964 -16834 697 28475 41131 99930 145859
961 145859 136794 132186 76864 27686 13858 50042 44592 46928 38934 24961 17217 24834 -2675
948 -2675 11970 -7438 -61456 -15101 46946 58831 56444 51836 51270 20869 33450 60529 44689
935 44689 22148 -2474 -8257 -24024 -26012 -436 1730 -50241 -65939 -60982 -38041 -76381 -81464
922 -81464 -66321 -15258 1558 -31394 -37895 -21061 -5326 25753 14109 20391 41703 34509 22295
909 22295 27218 19395 -27428 -35515 -14831 1556 30218 81552 63009 7134 -10301 -20921 41225
896 41225 79425 74734 43904 33706 38716 54928 41766 6960 6347 17754 38731 62771 36563
883 36563 -46637 -36108 19577 47104 10252 -35805 -11027 10478 30494 20093 18972 -1133
871 -1133 -11749 -17861 -22428 -13830 21811 28678 -9691 -40729 -22947 329 23190 49736 61883
858 61883 52598 25644 -3189 -1721 -8240 2648 40180 17868 2817 -11444 -25093 -49168 -26541
845 -26541 -2008 -4528 1213 -28507 -23108 28168 20231 -41342 -15464 -29173 -52126 -17407 -28586
832 -28586 1636 83464 66414 61971 41147 2183 -2955 -3654 -14389 -29655 -12975 -21518 -66291
819 -66291 -56847 -23039 -14592 -30983 -23707 -40624 -11790 -4839 -36939 -29620 -7074 -5863 -37925
806 -37925 -27067 6193 8519 6981 -13135 6070 27825 3535 -22485 -48856 -14207 4483
794 4483 14691 55515 82603 96091 106354 71642 32014 -3997 -32033 -30583 -4349 28415
782 28415 9187 -10296 4545 17644 27118 21351 13767 -12185 -17968 -22436 -10869 27782 42736
769 42736 7609 -13714 -16570 -10439 9148 -15500 -35280 -8447 -7150 -10923 -29870 -31929 -17226
756 -17226 -28598 16906 66638 88803 75680 41675 44373 60392 18980 -11555 -19589 -16676 -12389
743 -12389 -6066 5785 7973 -7497 -36774 -40063 -25566 -32320 -51645 -34690 -13200 -33102 -30469
730 -30469 -28751 -46082 -35973 343 -1110 17986 15585 2236 -23285 -10187 -18587 -41187 -73560
717 -73560 -74147 -62477 -72868 -64538 -31886 -61687 -79672 -50233 -20535 -10705 -37013 -55661 -86100
704 -86100 -65147 -32145 -16883 13545 18277 -8088 -8720 53767 73891 69504 36106 -11660 -7270
691 -7270 -1416 -30152 -42845 -34734 17714 30304 647 -49686 -37018 -25239 -23228 -45910 -75164
678 -75164 -32646 -4303 -34551 -28966 13930 -15294 -51019 -51463 -39189 -20986 -23291 -5460 2757
665 2757 -13879 -7439 9227 57979 73495 19341 -33835 -79293 -64017 -67166 -34208 9446 50188
652 50188 41726 23315 -16261 -18539 8842 -18133 -55901 -43158 -17809 -17236 -38057 -89933 -99774
639 -99774 -69634 -39868 17051 33822 32350 -10307 -41618 -28249 -9416 35898 41977 11799
627 11799 -8472 -12324 19283 37569 23293 -7643 740 45183 91992 125355 93777 73035
615 73035 57382 66117 48626 45777 18626 13676 -5930 7451 26654 22143 21958 17640 18704 8085
601 8085 21689 16574 22697 64382 92982 99061 81574 54481 1264 -9890 -32770 -16510 -19155
588 -19155 -23494 -15484 -24243 -25556 -28996 -37192 -22959 10534 -5893 -24172 -18653 30207 38621 -8095
574 -8095 -50390 -29920 18032 51233 22733 -3068 -3140 5703 18010 18106 7769 -16446 -23208 -3697
560 -3697 28368 28844 68073 58123 -5917 -26548 -12479 -1081 -15132 3120 16704 16143 14468
547 14468 18332 38389 15369 -39194 -72403 -58605 -59857 -62753 -3173 14907 16516 37906 9375
534 9375 8471 13213 10371 -13800 -20670 -31543 -41085 -37883 -5418 -10070 16016 26709 21404 20078
520 20078 413 -24463 -5693 9095 6646 -36421 -15764 11431 -16153 7454 19452 -1031
508 -1031 -52065 -87563 -70420 -56503 -76255 -77789 -49171 -46110 -85561 -61854 -80024 -81548 -82303
495 -82303 -90448 -94219 -76352 -50509 -28467 -27362 532 9407 -5886 21744 -3576 -29964 -61078
482 -61078 -29841 -7267 -15397 -15993 -12241 -28082 -20845 -3593 -12411 21073 26440 -9093 39894
469 39894 105900 87270 63603 13786 2681 -24095 -43409 -13294 3868 3192 24969 78759
457 78759 104790 76196 47924 32416 5266 -34847 -52616 -53003 -31806 8098 837 -51626 -62638
444 -62638 -59587 -92805 -70534 -49726 -6487 -15501 6042 -22282 -24427 45037 71161 76569 83166
431 83166 59873 81386 56963 45881 73955 78967 83640 29043 -22276 -26497 -1861 -27987 -12000
418 -12000 20025 5956 -6475 18013 8990 3486 -1160 6817 42195 42155 8262 -9629 10860
405 10860 -23461 -65111 -67987 -65368 -75717 -65091 -73755 -50687 -21841 45870 45238 13613 34906
392 34906 22991 1349 -14954 -4134 10167 3459 -1269 48765 76849 83337 36325 -7471 7451
379 7451 -1600 -16847 -47133 -74696 -87525 -64652 -22185 13152 17760 6874 1762 38030 35302
366 35302 12807 11160 -830 -19733 -44359 -59002 -36389 -6133 10290 12441 -14477 -52953
354 -52953 -48113 -19996 13732 -18879 -3594 20771 35822 43858 42159 3656 42015 35386 -11457
341 -11457 1613 41391 23659 12523 17272 16075 -18308 -36662 -46939 -43794 -35637 -36030 -24076
328 -24076 -42272 -85632 -131164 -86253 -37450 -17205 -8257 9650 -25656 -27800 -34651 -59466 -53837
315 -53837 -26887 12056 9931 9717 -10066 -2245 -12794 -41270 -13742 -6836 14527 41233 39330
302 39330 32250 34588 36125 14224 20840 -117 -35721 -48126 -64799 -48222 -433 35633 33835
289 33835 9933 26279 39580 -13960 -61923 -55400 -8374 10115 12031 -5346 -25967 -23375 5381
276 5381 -24815 -40232 5483 1874 -31358 -17496 -14533 -37036 -41961 -21920 9112 28175 41949
263 41949 15138 -6711 -39249 -43695 -16369 -6162 -31900 -22150 6407 -5384 -13010 -17993 -29918
250 -29918 -16277 -44177 -27497 12854 25699 15592 43581 39457 295 14115 34676 52561
238 52561 36997 8486 17368 14977 30601 10993 22041 6321 9400 15411 -4023 -9503 -53059
225 -53059 -46615 411 10952 -12752 -42058 -51813 -62713 -48676 -55234 -59695 -27145 -22925 -31928
212 -31928 -23210 -5881 -48708 -16511 -6273 -23969 -39313 -24978 10782 10066 28863 30498 17375
199 17375 16555 -10819 -25194 -4737 8395 5509 43906 47885 40457 34395 49407 55414 20007
186 20007 5446 12979 11448 2405 -4293 -11447 -17270 1874 -10447 -26697 -15610 -5805 11348
173 11348 10812 4167 6028 -6761 4259 19119 -3932 -14856 28862 35399 19965 27916 19085
160 19085 26882 -2516 -13268 9270 46709 71275 74386 78210 73327 46759 17360 -2070 -1821
147 -1821 2118 -26992 -53884 -19937 -23256 -6431 -5614 -5491 -12283 -30844 -36580 -26961 -10012 -33131
133 -33131 -29068 -44981 -33794 -14829 -36331 -40853 -16841 -16982 -20332 10908 16192 -507 -29703
120 -29703 -37198 -35048 -32480 -21728 -21062 -55105 -56296 -11353 -22983 -10628 -19390 -60544 -54849 -19444
106 -19444 -32983 -4400 9305 24040 43090 42881 49591 49988 51962 18704 -7833 239 4490 6670
92 6670 3 -16674 -46481 -9847 -23697 -58171 -55613 -18611 41142 30610 27174 50880 40748
79 40748 28340 49585 55004 44703 39332 22688 -13650 -9825 -19231 -38768 -23964 2303 21143
66 21143 11429 -35808 -41520 -49935 -33157 -7974 -7150 -31160 -38188 -35011 -4636 892 -9110 -10847
52 -10847 -36590 -34440 -53714 -26237 -10213 -23315 -13497 22877 45964 33961 18276 320 -9387
39 -9387 -20849 13730 26735 19496 21755 4829 -24750 -35773 -1863 5233 20060 19721 2636
26 2636 -25358 -7843 29201 33544 34071 9575 20503 -5727 -7060 -10541 -2273 -23262 -23445 -4608
12 -4608 -20953 -12648 -5644 -10109 7441 11325 -23658 -8429 -699 3056 -5244 -48275
0 -48275
$$ Imaginary data points
##PAGE= N=2
##DATA TABLE= (X++(I..I)), XYDATA
32767 127191 133911 119462 105212 87719 68646 63374 101139 102806 92679 95934 84194 83288 93960
32754 93960 98038 86133 112390 151257 131631 99333 65912 68261 77534 58505 42941 64204
32742 64204 83899 79346 73233 71924 86453 100225 138340 115616 99035 87560 100571 105809
32730 105809 90641 112382 108927 102729 84253 79085 58051 66091 84327 74805 85523 82503 80387
32717 80387 75517 85062 106468 111749 116981 111155 123564 110473 124450 122444 119480 135347 156397
32704 156397 135075 137391 135112 123554 130925 125836 101348 102912 151959 149736 161139 175041 170530
32691 170530 158513 144588 143466 149398 154073 158459 149243 125645 114855 121899 134214 134479 126688
32678 126688 134528 138471 152394 150346 125460 134555 128713 138945 140686 105892 122683 138967 133719
32665 133719 125783 115128 152829 181604 174710 172794 150304 162641 166636 138119 135944 148148
32653 148148 171936 195099 193273 191333 171476 171520 200142 225740 222279 196127 209542 197352 206473
32640 206473 216774 209750 200868 185311 170583 188118 194618 189645 176459 155126 153026 154402 172065
32627 172065 183018 184835 181026 170130 164330 157521 172651 185668 234607 230718 236991 217412 194044
32614 194044 187171 190787 196373 208257 227376 230616 241717 251162 236520 202265 209997 200675 212658
32601 212658 228005 245410 238716 248397 202441 157650 178778 216593 227010 244708 256728 236464
32589 236464 209517 225735 231602 220875 232628 220859 236700 242725 254573 258222 276621 267265
32577 267265 266443 260383 250713 236917 246499 259056 262058 231658 212438 215902 210815 225927 228290
32564 228290 241039 271187 261453 241979 246168 227579 229784 241222 249308 242700 229987 199356
32552 199356 182799 179034 215588 272350 283858 266392 247758 253417 262023 282753 291137 289383
32540 289383 243211 239966 243070 245117 243552 258960 232906 235511 283824 306579 295069 292311 295142
32527 295142 269049 221217 240347 268980 245732 245683 262197 248073 232730 231821 241307 260289 291821
32514 291821 292560 296841 284604 266306 255853 291793 307322 332118 320418 273643 266823 273439
32502 273439 275871 274764 273143 259492 235385 240292 240049 268919 286711 279456 283925 312860 341679
32489 341679 315926 288964 303247 326804 326709 318040 283430 272030 280054 244798 227681 246673
32477 246673 245375 243443 244966 229850 252155 293872 313375 327570 295407 262930 265666 260951
$$ [...]
##END NTUPLES=NMR SPECTRUM
##END=
