##TITLE=Analysis number 309968
Compound Code cc 21710
Book Reference 440/4
Project Code adrs
Chemist Name craigr
##JCAMPDX= 6.0         $$ Bruker NMR JCAMP-DX V2.0
##DATA TYPE= NMR SPECTRUM
##DATA CLASS= NTUPLES
##ORIGIN= Bruker BioSpin GmbH
##OWNER= NMR
$$ XWIN-NMR		Version 3.5
$$ Wed Jun  8 12:42:10 2005 GMT Daylight Time (UT+1h)  MAYBRIDGE\NMR@NMR_250MHZ
##.OBSERVE FREQUENCY= 250.131544655141
##.OBSERVE NUCLEUS= ^1H
##.ACQUISITION MODE= SIMULTANEOUS (DQD)
##.ACQUISITION SCHEME= undefined
##.AVERAGES= 16
##.DIGITISER RES= 18
##SPECTROMETER/DATA SYSTEM= dpx250
##.PULSE SEQUENCE= zg30
##.SOLVENT NAME= CDCl3
##.SHIFT REFERENCE= (INTERNAL, CDCl3, 0, 16.4555)
##AUDIT TRAIL= $$ (NUMBER, WHEN, WHO, WHERE, WHAT)
$$ ##TITLE= Audit trail, XWIN-NMR		Version 3.5
$$ ##JCAMPDX= 5.01
$$ ##ORIGIN= Bruker BioSpin GmbH
$$ ##OWNER= NMR
$$ C:\u/data/dgb/nmr/ADRS/3960/pdata/1/auditp.txt
$$ ##AUDIT TRAIL=  $$ (NUMBER, WHEN, WHO, WHERE, WHAT)
(   1,<2005-06-08 12:41:41.43 +100>,<MAYBRIDGE\NMR>,<NMR_250MHZ>,
      <created by zg, POWCHK disabled, PULCHK disabled
       configuration hash MD5:
       62 19 C7 07 E1 42 D1 B7 37 6C 3D D0 77 39 F9 E6
       data hash MD5: 64K
       0C 9A C7 7C 85 C8 BA 51 27 84 1B CA 44 C8 60 9D>)
(   2,<2005-06-08 12:41:56.45 +100>,<MAYBRIDGE\NMR>,<NMR_250MHZ>,
      <Start of raw data processing
       ef LB = 0.3 FT_mod = 6 PKNL = 1 SI = 32K 
       data hash MD5: 32K
       77 F0 E1 7B 1E 38 5E 94 C9 30 DC EC 60 1C CB A5>)
(   3,<2005-06-08 12:42:00.00 +100>,<MAYBRIDGE\NMR>,<NMR_250MHZ>,
      <apk 
       data hash MD5: 32K
       21 9B BF C5 24 A2 CF 1A FA 1C 5B CE EA 5B E9 F5>)
(   4,<2005-06-08 12:42:01.09 +100>,<MAYBRIDGE\NMR>,<NMR_250MHZ>,
      <abs ABSG = 5 
       data hash MD5: 32K
       72 BB 08 14 1B 6A E8 D7 5F 07 92 8F CA 8D B7 9C>)
$$ ##END=
$$ 
$$ hash MD5
$$ F7 D8 A9 B7 4F E7 EF C2 78 44 88 32 FA F0 DC 58
##$RELAX= 
##$RELAX= 
##$RELAX= 
##$RELAX= 
##$RELAX= 
##$RELAX= 
##$RELAX= 
$$ Bruker specific parameters
$$ --------------------------
##$DU= <C:\u>
##$EXPNO= 3960
##$NAME= <ADRS>
##$PROCNO= 1
##$TYPE= <nmr>
##$USER= <dgb>
##$AMP= (0..31)
100 100 100 100 100 100 100 100 100 100 100 100 100 100 100 100 100 100 
100 100 100 100 100 100 100 100 100 100 100 100 100 100 
##$AQSEQ= 0
##$AQ_mod= 3
##$AUNM= <au_zg>
##$AUTOPOS= <27 >
##$BF1= 250.13
##$BF2= 250.13
##$BF3= 250.13
##$BF4= 250.13
##$BF5= 500.13
##$BF6= 500.13
##$BF7= 500.13
##$BF8= 500.13
##$BYTORDA= 1
##$CFDGTYP= 0
##$CFRGTYP= 5
##$CHEMSTR= <none>
##$CNST= (0..31)
1 1 145 1 1 1 1 1 1 1 1 1 1 1 1 1 1 1 1 1 1 1 1 1 1 1 1 1 1 1 1 1 
##$CPDPRG= <>
##$CPDPRG1= <>
##$CPDPRG2= <>
##$CPDPRG3= <>
##$CPDPRG4= <mlev>
##$CPDPRG5= <mlev>
##$CPDPRG6= <mlev>
##$CPDPRG7= <mlev>
##$CPDPRG8= <mlev>
##$CPDPRGB= <>
##$CPDPRGT= <>
##$D= (0..31)
0 1 0 0 0 0 0 0 0 0.06 0 0 0 0 0 0 0.0002 0 0 0 0 0 0 0 0 0 0 0 0 0 0 
0 
##$DATE= 1118230899
##$DBL= (0..7)
120 120 120 120 120 120 120 120 
##$DBP= (0..7)
150 150 150 150 150 150 150 150 
##$DBP07= 0
##$DBPNAM0= <>
##$DBPNAM1= <>
$$ [...]
##$SUBNAM7= <"">
##$SUBNAM8= <"">
##$SUBNAM9= <"">
##$SW= 20.6930455092707
##$SWIBOX= (0..15)
0 0 3 0 0 0 0 0 0 0 0 0 0 0 0 0 
##$SW_h= 5175.983436853
##$TD= 65536
##$TD0= 1
##$TE= 295.16
##$TE2= 300
##$TE3= 300
##$TEG= 300
##$TL= (0..7)
0 120 120 120 120 120 120 120 
##$TP= (0..7)
150 150 150 150 150 150 150 150 
##$TP07= 0
##$TPNAME0= <>
##$TPNAME1= <>
##$TPNAME2= <>
##$TPNAME3= <>
##$TPNAME4= <>
##$TPNAME5= <>
##$TPNAME6= <>
##$TPNAME7= <>
##$TPOAL= (0..7)
0.5 0.5 0.5 0.5 0.5 0.5 0.5 0.5 
##$TPOFFS= (0..7)
0 0 0 0 0 0 0 0 
##$TUNHIN= 0
##$TUNHOUT= 0
##$TUNXOUT= 0
##$USERA1= <user>
##$USERA2= <user>
##$USERA3= <user>
##$USERA4= <user>
##$USERA5= <user>
##$V9= 5
##$VALIST= <valist>
##$VCLIST= <CCCCCCCCCCCCCCC>
##$VD= 0
##$VDLIST= <DDDDDDDDDDDDDDD>
##$VPLIST= <PPPPPPPPPPPPPPP>
##$VTLIST= <TTTTTTTTTTTTTTT>
##$WBST= 1024
##$WBSW= 4
##$XGAIN= (0..3)
0 0 0 0 
##$XL= 0
##$YL= 0
##$YMAX_a= 359553
##$YMIN_a= -315989
##$ZGOPTNS= <>
##$ZL1= 120
##$ZL2= 120
##$ZL3= 120
##$ZL4= 120
##$ABSF1= 16.45552
##$ABSF2= -4.237652
##$ABSG= 5
##$ABSL= 3
##$ALPHA= 0
##$AQORDER= 0
##$ASSFAC= 0
##$ASSFACI= 0
##$ASSFACX= 0
##$ASSWID= 0
##$AUNMP= <proc_1d>
##$AZFE= 0.1
##$AZFW= 0.1
##$BCFW= 0
##$BC_mod= 0
##$BYTORDP= 0
##$COROFFS= 0
##$CY= 12.5
##$DATMOD= 1
##$DC= 0
##$DFILT= <>
##$DTYPP= 0
##$F1P= 14.0000005364418
##$F2P= -0.99999901652339
##$FCOR= 0.5
##$FTSIZE= 32768
##$FT_mod= 6
##$GAMMA= 0
##$GB= 0
##$INTBC= 1
##$INTSCL= 1
##$ISEN= 128
##$LB= 0.3
##$LEV0= 0
##$LPBIN= 0
##$MAXI= 10000
##$MC2= 0
##$MEAN= 0
##$ME_mod= 0
##$MI= 0
##$NCOEF= 0
##$NC_proc= -3
##$NLEV= 6
##$NOISF1= 0
##$NOISF2= 0
##$NSP= 0
##$NTH_PI= 0
##$NZP= 0
##$OFFSET= 16.45552
##$PC= 1
##$PHC0= -68.76357
##$PHC1= 5.612754
##$PH_mod= 1
##$PKNL= yes
##$PPARMOD= 0
##$PSCAL= 4
##$PSIGN= 0
##$REVERSE= no
##$SF= 250.130016626713
##$SI= 32768
##$SIGF1= 0
##$SIGF2= 0
##$SINO= 400
##$SIOLD= 32768
##$SREGLST= <1H.CDCl3>
##$SSB= 0
##$STSI= 32768
##$STSR= 0
##$SW_p= 5175.98343685301
##$SYMM= 0
##$S_DEV= 0
##$TDeff= 65536
##$TDoff= 0
##$TI= <Analysis number 999999
Compound Code 99
Book Reference 9
Project Code 9>
##$TILT= no
##$TM1= 0
##$TM2= 0
##$TOPLEV= 0
##$USERP1= <user>
##$USERP2= <user>
##$USERP3= <user>
##$USERP4= <user>
##$USERP5= <user>
##$WDW= 1
##$XDIM= 32768
##$YMAX_p= 462665146
##$YMIN_p= -165345
$$ End of Bruker specific parameters
$$ ---------------------------------
##NTUPLES= NMR SPECTRUM
##VAR_NAME=  FREQUENCY,     SPECTRUM/REAL,   SPECTRUM/IMAG
##SYMBOL=    X,             R,               I
##VAR_TYPE=  INDEPENDENT,   DEPENDENT,       DEPENDENT
##VAR_FORM=  AFFN,          ASDF,            ASDF
##VAR_DIM=   32768,         32768,           32768
##UNITS=     HZ,            ARBITRARY UNITS, ARBITRARY UNITS
##FACTOR=    0.157963299565203, 1,           1
##FIRST=     4116.01964875381, 0,            0
##LAST=      -1059.9637880992, 0,            0
##MIN=       -1059.9637880992, -165345,      0
##MAX=       4116.01964875381, 462665146,    0
$$ Real data points
##PAGE= N=1
##DATA TABLE= (X++(R..R)), XYDATA
$$ [...]
$$ plain form
16435 -11782 4120 24503 31818 44206 59733 41846 41480 26876 36189 24559 22304 9330 7660
16422 7660 23 -57836 -49402 -73519 -86258 -71552 -31679 -2017 26146 -9473 -57656 -60010
16410 -60010 -28553 -7717 -48653 -73000 -66145 -41629 -4839 -6150 -52403 -79435 -66964 -41510
16398 -41510 2385 -23466 -49245 -52141 -14517 32617 18499 -25123 16601 30321 14625 43575
16386 43575 12240 6431 27020 28055 8262 23562 10178 9835 33513 32816 36335 27645 19421
16373 19421 24428 27104 38474 34646 49477 73680 50630 -17766 14118 27166 1423 -345
16361 -345 -43160 -23736 -15491 -25716 -49807 -13264 27952 26067 -5120 -11285 -11735 10198 -2468
16348 -2468 -24128 51222 72512 70917 37727 37591 15323 -29241 -27666 -25245 -41741 -49257 -69930
$$ packed form
16435a1782J5902K0383P315J2388J5527j7887l66j4604R313j1630k255j2974j670
16422G660p637n7859Q434k4117j2739J4706L9873K9662K8163l5619m8183k354
16410f0010L1457K0836m0936k4347O855K4516L6790j311m6253k7032J2471K5454
16398d1510M3895k5851k5779k896L7624M7134j4118m3622M1724J3720j5696K8950
16386D3575l1335n809K0589J035j9793J5300j3384l43K3678o97L519q690q224
16373A9421N007K676J1370l828J4831K4203k3050o8396L1884J3048k5743j768
16361c45m2815J9424Q245j0225k4091L6543M1216j885l1187o165m50K1933j2666
16348b468k1660P5350K1290j595l3190j36k2268m4564J575K421j6496p516k0673
$$ plain form
16335 -69930 -83542 -36402 -28872 -13850 8693 51242 45330 -7040 -48824 -74879 -37334 -18581
16323 -18581 630 -7734 -27968 -21266 -44540 -54215 -51697 20309 31571 -30409 -11398 7642
16311 7642 -36420 -57113 -86365 -86255 -33798 -16611 14154 13411 -20102 -14847 -9871 -10951 3557
16298 3557 12834 11190 -38230 -46008 -79945 -103696 -123875 -93758 -71057 -61818 -62833 -78034 -67229
16285 -67229 -51563 -29839 -48253 -51476 -69062 -76971 -30807 5019 -9889 19067 45382 49436
16273 49436 73319 75389 58479 37220 52828 18873 3216 22398 13886 -23470 -45084 -65215
16261 -65215 -97101 -100819 -106512 -82679 -32939 -10744 -14187 2695 28284 35316 -19531 -36239
16249 -36239 -49357 -45272 -57803 -66106 -66853 -52861 -33934 -26626 -12011 -43383 -45736 -48428 -39252
$$ packed form
16335f9930j3612M7140P530J5022K2543M2549n912n2370m1784k6055L7545J8753
16323a8581J9211q364k0234O702k3274r675K518P2006J1262o1980J9011J9040
16311G642m4062k0693k9252J10N2457J7187L0765p43l3513N255M976j080J4508
16298C557R277j644m9420p778l3937k3751k0179L0117K2701R239j015j5201J0805
16285f7229J5666K1724j8414l223j7586p909M6164L5826j4908K8956K6315M054
16273D9436K3883K070j6910k1259J5608l3955j5657J9182q512l7356k1614k0131
16261f5215l1886l718n693K3833M9740K2195l443J6882K5589P032n4847j6708
16249c6239j3118M085j2531q303p47J3992J8927P308J4615l1372k353k692R176
$$ plain form
16236 -39252 -52492 -33404 -15202 21747 19096 -19907 -23463 -52324 -27640 1106 -7087 -27924
16224 -27924 -46739 -64334 -78187 -85530 -94258 -98107 -58889 -51896 -48399 -35667 -45894 -57840 -59963
16211 -59963 1347 -10102 -23820 13019 6403 12544 25302 30485 22335 28348 13832 -86 -1123
16198 -1123 -1063 7593 7107 -23021 -51142 -56100 -39729 -40292 -67067 -48868 -44293 -16509 9745 31609
16184 31609 33507 46810 40677 6337 -12631 10814 20561 32187 24573 47131 62817 35149
16172 35149 4182 19193 24895 -16829 -67808 -79459 -55515 -41398 -5927 21784 17473 -9630
16160 -9630 -9329 -24458 -20090 -32236 -32536 -28072 25791 53134 26362 -52166 -91929 -50627 -55919
16147 -55919 -34517 18004 49325 19450 -46158 -60110 -53706 -35250 -56105 -60950 -47975 -13180
$$ packed form
16236c9252j3240J9088J8202L6949k651l9003l556k8861K4684K8746q193k0837
16224b7924j8815j7595j3853p343q728l849L9218O993L497J2732j0227j1946k123
16211e9963O1310j1449j3718L6839o616O141J2758N183q150O013j4516j3918j037
16198a123O0Q656m86l0128k8121m958J6371n63k6775J8199M575K7784K6254K1864
16184C1609J898J3303o133l4340j8968K3445R747J1626p614K2558J5686k7668
16172C5149l0967J5011N702m1724n0979j1651K3944J4117L5471K7711m311k7103
16160i630L01j5129M368j2146l00M464N3863K7343k6772p8528l9763M1302n292
16147e5919K1402N2521L1321k9875o5608j3952O404J8456k0855m845J2975L4795
$$ plain form
16135 -13180 888 -4681 -4961 17082 3234 -30303 -19622 -5947 13087 12362 -24289 -45918 -52760
16122 -52760 -40845 -35453 10249 12935 -19824 -54488 -68676 -90589 -107395 -80940 -56443 -24061
16110 -24061 -58431 -88172 -33235 -256 -16680 -67608 -87109 -103472 -44133 -14174 -30022 -48354
16098 -48354 -48352 -50683 -41666 -39667 -24338 -11660 -5604 5323 -4596 -26675 -52333 -32061 -43922
16085 -43922 -59606 -51724 -36305 -36451 -15840 -166 15555 12932 -18372 -28501 11335 35711
16073 35711 21816 16138 19343 8924 -8978 23398 8525 9325 14716 -7613 -27127 -50171 -76690
16060 -76690 -53666 -43242 -47698 -45173 -4774 20606 28272 37682 13964 21677 6219 1244 5071
16047 5071 22203 25979 14068 -3203 3827 12527 -11833 -8671 -15926 -32161 -22435 -75625 -105328
$$ packed form
16135a3180J4068n569k80K2043j3848l3537J0681J3675J9034p25l6651k1629o842
16122e2760J1915N392M5702K686l2759l4664j4188k1913j6806K6455K4497L2382
16110b4061l4370k9741N4937L2979j6424n0928j9501j6363N9339K9959j5848j8332
16098d8354Kk331R017J999J5329J2678O056J0927r919k2079k5658K0272j1861
16085d3922j5684P882J5419j46K0611J5674J5721k623l1304j0129L9836K4376
16073C5711j3895n678L205j0419j7902L2376j4873Q00N391k2329j9514k3044k6519
16060g6690K3024J0424m456K525M0399K5380P666R410k3718P713j5458m975L827
16047E071J7132L776j1911j7271P030Q700k4360L162p255j6235R726n3190k9703
$$ plain form
16034 -105328 -92297 -54601 -53144 -42950 2266 -5690 -17341 11748 -2735 -8739 18025 13016
16022 13016 -2285 -24734 -6781 22337 34902 -6974 -34892 -19379 -48687 -54996 -36970 -17640
16010 -17640 -33344 -83368 -78670 -41669 -18756 -12342 -44065 -616 39156 -16718 -12947 -18095
15998 -18095 -60163 -64032 -46517 -76914 -81230 -73957 -91951 -116710 -63679 -19185 17290 -10180
15986 -10180 -7904 4175 28883 18563 -6928 -18174 -46558 -47074 6005 10644 26273 9251
15974 9251 -33040 -39825 -42380 -32414 -54898 -59237 -51925 -63484 -68900 -60499 -15097 25443 36683
15961 36683 7682 34628 25522 -21533 -11825 -4800 -10965 -59503 -83181 -77910 -44150 -23545 -2660
15948 -2660 -3930 -21829 -69915 -95422 -29783 -14941 -42421 -56905 -21814 -3992 16272 -42093
$$ packed form
16034a05328J3031L7696J457J0194M5216p956j1651K9089j4483o004K6764n009
16022A3016j5301k2449J7953K9118J2565m1876k7918J5513k9308o309J8026J9330
16010a7640j5704n0024M698L7001K2913O414l1723M3449L9772n5874L771n148
15998a8095m2068l869J7515l0397m316P273j7994k4759N3031M4494L6475k7470
15986a0180K276J2079K4708j0320k5491j1246k8384n16N3079M639J5629j7022
15974I251m2291o785k555R966k2484m339P312j1559n416Q401M5402M0540J1240
15961C6683k9001K6946r106m7055R708P025o165m8538k3678N271L3760K0605K0885
15948b660j270j7899m8086k5507O5639J4842k7480j4484L5091J7822K0264n8365
$$ plain form
15936 -42093 -69774 -26210 -42583 -26744 -28444 -25548 33243 74168 58836 31616 12205 24625
15924 24625 35970 -1005 -20820 -13139 9490 37224 35534 -1697 -12682 -5426 4690 4173 26858
15911 26858 51125 74335 44511 8588 -22113 -21919 -15100 21458 51981 36453 42703 3886
15899 3886 -32231 -42629 -1921 16704 -26454 -32949 -848 27777 20382 -14304 -24101 -13069
15887 -13069 19270 53309 94561 109956 97435 63557 38399 2698 -181 -18265 -64631 -25252
15875 -25252 30061 12654 -6632 -10010 16084 20611 -3393 3221 8174 4423 -35709 -14346 -19541
15862 -19541 -35370 -10154 5897 -10849 -9511 7187 16984 5479 -17465 -36644 -32632 -7914
15850 -7914 23163 -797 -21458 -34243 -8226 1750 -7728 -25301 -50367 -41179 -65774 -50536
$$ packed form
15936d2093k7681M3564j6373J5839j700K896N8791M0925j5332k7220j9411J2420
15924B4625J1345l6975j9815P681K2629K7734j690l7231j0985P256J0116n17K2685
15911B6858K4267K3210k9824l5923l0701J94O819L6558L0523j5528O250l8817
15899C886l6117j0398M0708J8625m3158o495L2101K8625p395l4686r797J1032
15887a3069L2339L4039M1252J5395j2521l3878k5158l5701k879j8084m6366L9379
15875b5252N5313j7407j9286l378K6094M527k4004O614M953l751m0132K1363n195
15862a9541j5829K5216J6051j6746J338J6698R797j1505k2944j9179M012K4718
15850g914L1077k3960k0661j2785K6017R976r478j7573k5066R188k4595J5238
$$ plain form
15838 -50536 -21620 -12436 -2675 -26779 -38007 24990 18016 -14072 -8801 7657 49564 42084 35758
15825 35758 16071 729 -15135 4569 32343 21446 5021 -391 -24506 -59189 -18028 12973
15813 12973 -8768 -39389 -62343 -61791 -101317 -93372 -25519 -5797 -5451 12215 24827 25698 8371
15800 8371 8401 15442 54992 94792 71152 29047 -9289 -538 5767 19104 62334 88271 88793
15787 88793 37993 23667 -1305 -45576 -27457 -13987 -3314 -16927 -5714 -18925 -36978 -38709
15775 -38709 -9889 -28480 14072 49555 41290 -18290 -39344 -59413 -56700 -25877 19937 39261
15763 39261 31843 -6050 -35725 -48480 -77012 -95835 -112540 -81091 -55798 -23048 13291 31846
15751 31846 -21840 -23586 -62563 -66017 -832 3048 -55457 -32494 -8954 -50900 -52416 -56736 -14563
$$ packed form
15838e0536K8916R184R761k4104j1228O2997o974l2088N271J6458M1907p480o326
15825C5758j9687j5342j5864J9704K7774j0897j6425n412k4115l4683M1161L1001
15813A2973k1741l0621k2954N52l9526P945O7853J9722L46J7666J2612Q71j7327
15800H371L0P041L9550L9800k3640m2105l8336Q751O305J3337M3230K5937N22
15787H8793n0800j4326k4972m4271J8119J3470J0673j3613J1213j3211j8053j731
15775c8709K8820j8591M2552L5483q265n9580k1054k0069K713L0823M5814J9324
15763C9261p418l7893k9675j2755k8532j8823j6705L1449K5293L2750L6339J8555
15751C1846n3686j746l8977l454O5185L880n8505K2963K3540m1946j516m320M2173
$$ plain form
15738 -14563 -7416 30199 43592 26382 5521 -40169 -40898 -37617 -34069 -32818 -16318 -22886 7594
15725 7594 23501 4905 -40026 -34531 -6502 -1452 -15632 -28611 -1947 -41327 -66224 -53930
15713 -53930 -6751 -7371 6475 8611 -3979 12889 3549 -9818 12341 33470 22143 2922
15701 2922 4112 -12128 -5793 -19393 19 -18849 -1320 -12974 -16336 5795 -30196 -44097
15689 -44097 28562 46381 -17027 -30652 14961 21758 -11547 -73401 -92206 -96360 -39779 4466
15677 4466 19495 30003 18511 20593 1578 -38836 -36165 -15642 -30630 -46920 -50710 -17043
15665 -17043 -18293 -44280 12596 5522 12870 -6707 -13426 26348 47279 52101 41141 17434 -23521
15652 -23521 -65387 -51533 -36254 -62375 -51058 -19993 -18158 -18174 -17396 -44445 -63318 -34638 -26102
$$ packed form
15738a4563P147L7615J3393j7210k0861m5690p29L281L548J251J6500o568L0480
15725G594J5907j8596m4931N495K8029N050j4180j2979K6664l9380k4897J2294
15713e3930M7179o20J3846K136j2590J6868r340j3367K2159K1129j1327j9221
15701B922J190j6240O335j3600J9412j8868J7529j1654l362K2131l5991j3901
15689d4097P2659J7819o3408j3625M5613O797l3305o1854j8805m154N6581M4245
15677D466J5029J0508j1492K082j9015m0414K671K0523j4988j6290l790L3667
15665a7043j250k5987N6876p074P348j9577o719L9774K0931M822j0960k3707m0955
15652b3521m1866J3854J5279k6121J1317L1065J835j6P78k7049j8873K8680Q536
$$ plain form
15639 -26102 -7705 -7047 -26106 -14583 -11633 -29838 -58139 -34729 29288 35704 24162 63684
15627 63684 83223 44063 -13381 -27373 -2644 -23084 -35698 -11087 -499 45029 42292 3611
15615 3611 -25607 -28502 -20554 -16013 -25908 -45467 -23186 -2399 -8165 17839 26874 2601 -2065
15602 -2065 -32797 -30220 26126 8744 -2176 -84442 -68032 -11686 27943 57451 34942 2238
15590 2238 25386 36951 47350 64832 36319 -15712 -39611 -53577 -52940 -30720 -7257 12635
15578 12635 78654 75581 60992 40653 42059 42327 27640 27155 39059 39380 41190 32154 23165 38173
15564 38173 58840 29436 44754 73411 58183 25819 7630 4161 -6184 -14654 -39601 -57085
15552 -57085 -65312 -67847 -68499 -74487 -87637 -75977 -46693 -28042 -3825 -12484 11130 -6223 -47809
$$ packed form
15639b6102J8397O58j9059J1523K950j8205k8301K3410O4017O416j1542L9522
15627F3684J9539l9160n7444j3992K4729k0440j2614K4611J0588M5528k737l8681
15615C611k9218k895P948M541r895j9559K2281K0787n766K6004R035k4273m666
15602b065l0732K577N6346j7382j0920q2266J6410N6346L9629K9508k2509l2704
15590B238K3148J1565J0399J7482k8513n2031k3899j3966O37K2220K3463J9892
15578A2635O6019l073j4589k0339J406K68j4687m85J1904L21J810r036q989J5008
15564C8173K0667k9404J5318K8657j5228l2364j8189l469j0345q470k4947j7484
15552e7085q227k535o52n988j3150J1660K9284J8651K4217q659K3614j7353m1586
$$ plain form
15539 -47809 -74820 -48210 -18325 -18571 -5140 11810 -15695 -18291 -11876 29669 24566 5307 -20396
15526 -20396 -48727 -82443 -55422 -62846 -86676 -67234 -40018 -38933 6829 15251 1661 -8414
15514 -8414 -29648 -23968 749 8653 25569 63181 18459 -25986 -27971 -24196 -33481 -25795 -25862 -43175
15500 -43175 -22173 -9124 927 9333 -26814 -54314 -44125 -52948 -25984 10651 -29861 -26645
15488 -26645 -23483 -37169 -17105 15573 21885 12555 3700 -62821 -80245 -58102 -72604 -68266 -6079
15475 -6079 19494 25407 11900 -10491 -14790 33310 51337 40658 12653 -10859 2938 -13455
15463 -13455 -64305 -56718 -39734 -51523 -20555 -15630 3215 13352 14049 -35520 -79227 -59019
15451 -59019 -30936 -63619 -28805 -32252 -41573 -60415 -80760 -28763 3157 21885 34450 27073
$$ packed form
15539d7809k7011K6610K9885k46J3431J6950k7505k596O415M1545n103j9259k5703
15526b0396k8331l3716K7021p424k3830J9442K7216J085M5762Q422j3590j0075
15514h414k1234N680K4717P904J6916L7612m4722m4445j985L775r285P686o7j7313
15500d3175K1002J3049J0051Q406l6147k7500J0189q823K6964L6635m0512L216
15488b6645L162j3686K0064L2678O312r330q855o6521j7424K2143j4502M338O2187
15475f079K5573N913j3507k2391m299M8100J8027j0679k8005k3512J3797j6393
15463a3455n0850P587J6984j1789L0968M925J8845J0137O97m9569m3707K0208
15451e9019K8083l2683L4814l447r321j8842k0345N1997L1920J8728J2565p377
$$ plain form
15439 27073 -157 -116 -20996 -41442 -58309 -42075 -24068 15357 -2508 -66526 -85998 -75498
15427 -75498 -78573 -106681 -71004 -36785 -54016 -77750 -93619 -67677 -48619 -15233 1861 13271
15415 13271 32056 10255 -18169 -8255 11967 13489 49855 28754 10330 7621 -1283 -13907
15403 -13907 -10785 -6045 -22722 -26760 -36230 -80450 -108849 -79216 -96003 -127080 -112500 -55288
15391 -55288 -15633 -15260 550 47785 36960 9953 15539 25174 13078 -15807 -19844 2278 -6692
15378 -6692 70 18219 23041 38549 1957 -31170 -24373 -27152 -49907 -41780 -17870 2175 11836
15365 11836 -27982 -52299 -21534 9440 22167 -129 -3427 -21309 -24765 -12518 -4675 16416
15353 16416 39681 63582 72577 47098 8995 28186 582 -10101 -10095 -8061 -5627 -3892 -35552
$$ packed form
15439B7073k7230M1k0880k0446j6867J6234J8007L9425j7865o4018j9472J0500
15427g5498l075k8108L5677L4219j7231k3734j5869K5942J9058L3386J7094J1410
15415A3271J8785k1801k8424R914K0222J522L6366k1101j8424k709q904j2624
15403a3907L122M740j6677m038r470m4220k8399K9633j6787l1077J4580N7212
15391e5288L9655L73J5810M7235j0825k7007N586R635j2096k8885m037K2122q970
15378f692O762J8149M822J5508l6592l3127O797k779k2755Q127K3910K0045R661
15365A1836l9818k4317L0765L0974J2727k2296l298j7882l456J2247P843K1091
15353A6416K3265K3901Q995k5479l8103J9191k7604j0683OK034K434J735l1660
$$ plain form
15340 -35552 -57831 -83266 -56481 -8005 1965 -36660 -54995 -43027 -9007 -14022 -29161 -40691
15328 -40691 -31048 -5123 -67387 -47332 -21770 -34495 -36833 -25296 -14814 336 -9904 -28819
15316 -28819 36280 62836 56027 55841 17651 -3599 7517 1652 5539 6762 -15328 -20086 15653
15303 15653 31487 39903 84119 86421 44663 -14408 -43657 -21447 6732 32231 6382 -14207
15291 -14207 -29089 -33353 -42952 -4179 55850 46357 -7612 -18630 -35304 -37012 -58766 -49586 -23540
15278 -23540 -31518 -66419 -59477 -39785 -14457 -241 38282 64908 -4861 -28603 -43018 -29203
15266 -29203 -18903 -25824 -38863 -40783 -24427 -26374 -2815 -23356 -14419 -14092 -35518 -2417 22917
15253 22917 29249 9271 -13953 -13817 13378 -1781 10000 16451 36737 34304 6727 -16943 -41460
$$ packed form
15340c5552k2279k5435K6785M8476R970l8625j8335J1968L4020n015j5139j1530
15328d0691R643K5925o2264K0055K5562j2725k338J1537J0482J5150j0240j8915
15316b8819O5099K6556o809j86l8190k1250J1116n865L887J223k2090m758L5739
15303A5653J5834Q416M4216K302m1758n9071k9249K2210K8179K5499k5849k0589
15291a4207j4882m264r599L8773O0029r493n3969j1018j6674j708k1754R180K6046
15278b3540p978l4901O942J9692K5328J4216L8523K6626o9769k3742j4415J3815
15266b9203J0300o921j3039j920J6356j947K3559k0541Q937L27k1426L3101K5334
15253B2917O332j9978k3224J36K7195j5159J1781O451K0286k433k7577k3670k4517
$$ plain form
15240 -41460 -16666 20695 1542 -829 18503 -9306 -31785 -47336 -66768 -80553 -65870 -81546
15228 -81546 -59153 19744 16583 -1749 -10347 -44608 -77254 -86309 -122068 -127269 -108265 -33629
15216 -33629 -1632 10212 1719 10463 31024 23879 -22022 -45694 -37211 -16634 13983 8470 17456
15203 17456 23435 7847 13084 29533 -23347 -13682 -19184 -55992 -78261 -52899 -47594 -58057 -57463
15190 -57463 -73173 -42240 -34649 -46398 -40295 -37090 -8561 22730 3157 -9866 -28035 -26685
15178 -26685 3511 17973 46596 37357 20460 14221 16111 17934 16826 10876 -14485 -11523 25518
15165 25518 47594 16948 -30837 -29009 -53432 -62807 -71411 -75853 -46408 -38909 -29842 -22729 -13532
15152 -13532 -25704 -53276 -30082 -4494 21976 41415 -6618 -17583 -37989 -16590 -407 23144
$$ packed form
15240d1460K4794L7361j9153k371J9332k7809k2479j5551j9432j3785J4683j5676
15228h1546K2393P8897l161j8332q598l4261l2646r055l5759n201J9004P4636
15216c3629L1997J1844q493Q744K0561p145m5901k3672Q483K0577L0617n513Q986
15203A7456N979j5588N237J6449n2880R665n502l6808k2269K5362N305j0463N94
15190e7463j5710L0933P591j1749O103L205K8529L1291j9573j3023j8169J350
15178b6685L0196J4462K8623r239j6897o239J890J823j108n950k5361K962L7041
15165B5518K2076l0646m7785J828k4423r375q604m442K9445P499R067P113R197
15152a3532j2172k7572K3194K5588K6470J9439m8033j0965k0406K1399J6183K3551
$$ plain form
15140 23144 51282 18829 -5519 -247 -736 -23457 -27149 -53923 -37502 -57826 -42215 -2918
15128 -2918 34724 33967 5518 -23847 -8232 -2269 -52081 -57587 -49209 -31067 -4880 -11410 583
15115 583 15603 19529 -13166 1226 -24918 -49382 -21880 -22926 -66642 -70628 -103988 -87914 -54555
15102 -54555 -33452 -44553 -38304 -1313 22482 39156 35418 32502 53982 44614 29001 2674
15090 2674 16804 -3497 -12445 -24412 -34660 7537 7207 37122 69484 30196 3516 -17680
15078 -17680 -21766 -13630 -13138 -39883 -13619 38833 28029 13346 -4588 -2522 -9834 -39369 -35612
15065 -35612 -52828 -62844 -73584 -4634 61815 54831 26504 27434 29099 37363 60526 65993 51759
15052 51759 26101 21754 -40550 -117817 -120515 -56031 -8399 -5521 -38726 -21509 -7197 -495
$$ packed form
15140B3144K8138l2453k4348N272m89k2721l692k6774J6421k0324J5611L9297
15128b918L7642p57k8449k9365J5615N963m9812n506Q378J8142K6187o530J1993
15115E83J5020L926l2695J4392k6144k4464K7502j046m3716l986l3360J6074L3359
15102e4555K1103j1101O249L6991K3795J6674l738k916K1480r368j5613k6327
15090B674J4130k0301q948j1967j0248M2197l30K9915L2362l9288k6680k1196
15078a7680m086Q136M92k6745K6264N2452j0804j4683j7934K066p312k9535L757
15065c5612j7216j0016j0740O8950O6449o984k8327R30J665Q264K3163N467j4234
15052E1759k5658m347o2304p7267k698O4484M7632K878l3205J7217J4312O702
$$ plain form
15040 -495 -28904 -19635 -12492 -24857 -57905 -43839 -73781 -131141 -109514 -80023 -68806 -33033
15028 -33033 -26056 5914 9651 17488 39232 32377 -38552 -66722 -64451 -51661 -68512 -55299 -10529
15015 -10529 22119 34877 -10525 21266 32573 16314 39864 42195 2687 -48726 -77371 -50134
15003 -50134 -54262 7742 18867 28914 53006 34017 422 36018 45473 64755 74723 49787
14991 49787 38995 40942 44419 -2950 -32349 2214 -22608 -3575 11958 22810 44573 30263
14979 30263 -4191 -54262 -60124 -19405 1177 -12938 -21904 -37089 -47987 -55646 -83043 -82304 -37783
14966 -37783 14223 -6557 -49031 -30845 19151 47534 10466 -52515 -86554 -34963 -28250 -47312
14954 -47312 -45552 17607 49807 9774 -31702 -8819 11742 13434 909 -15850 -11405 -33910
$$ packed form
15040d95k8409R269P143j2365l3048J4066k9942n7360K1627K9491J1217L5773
15028c3033O977L1970L737P837K1744o855p0929k8170K271J2790j6851J3213M4770
15015a0529L2648J2758m5402L1791J1307j6259K3550K331l9508n1413k8645K7237
15003e0134m128O2004J1125J0047K4092j8989l3595L5596R455J9282R968k4936
14991D9787j0792J947L477m7369k9399L4563k4822J9033J5533J0852K1763j4310
14979C0263l4454n0071n862M0719K0582j4115q966j5185j0898p659k7397P39M4521
14966c7783N2006k0780m2474J8186M9996K8383l7068o2981l4039N1591O713j9062
14954d7312J760O3159L2200m0033m1476K2883K0561J692j2525j6759M445k2505
$$ plain form
14942 -33910 32647 95449 100860 44156 -2982 -29699 -34106 -43660 -29455 -12169 -4447 874 33009
14929 33009 -7011 -24654 -4769 6304 2275 5533 44062 44518 35305 18175 5149 -9172 -11582
14916 -11582 15189 -16011 -18623 -5002 43840 56891 78846 54386 639 2557 7480 -11940
14904 -11940 -9326 7289 34563 40583 53574 25870 8869 9414 2585 29033 61906 85484 88251
14891 88251 34946 -2629 -44301 -56370 -35215 413 -49116 -57265 -4155 18102 -3753 -8655
14879 -8655 -1546 19687 50831 45439 1006 -8854 -44600 -61802 -38436 -47753 -83831 -101838 -58438
14866 -58438 -36957 -10813 -18695 -31727 -59456 -58418 -52213 -38133 25448 41205 20013 -18405
14854 -18405 4162 -10148 -18927 -53532 -70447 -82123 -52767 -18493 -40325 -32435 -16790 -44130
$$ packed form
14942c3910O6557O2802N411n6704m7138k6717m407r554J4205J7286P722N321L2135
14929C3009m0020j7643J9885J1073m029L258L8529M56r213j7130j3026j4321k410
14916a1582K6771l1200k612J3621M8842J3051K1955k4460n3747J918M923j9420
14904a1940K614J6615K7274O020J2991k7704j7001N45o829K6448L2873K3578K767
14891H8251n3305l7575m1672j2069K1155L5628m9529q149N3110K2257k1855m902
14879h655P109K1233L1144n392m4433r860l5746j7202K3366r317l6078j8007M3400
14866e8438K1481K6144p882j3032k7729J038O205J4080O3581J5757k1192l8418
14854a8405K2567j4310q779l4605j6915j1676K9356L4274k1832P890J5645k7340
$$ plain form
14842 -44130 -109804 -118321 -62269 -33120 -78379 -93655 -51744 -29053 -29570 -35250 -3310 23427
14830 23427 41278 50069 17026 -28375 -30384 -22769 -19898 -39720 -56067 -58215 -58393 -52994 435
14817 435 4375 -34337 -45742 -2867 19562 12015 11131 9395 22951 15560 21760 402 -63038
14804 -63038 -72779 -65789 -84363 -51663 -15819 -35037 -23827 -10733 12276 59503 60557 60897 68629
14791 68629 64021 5907 -22562 -25888 -19221 -20042 -10020 8877 22033 58785 61065 25924 35216
14778 35216 57006 57416 10473 -2113 25450 5480 28735 52079 100083 103058 68617 51040
14766 51040 71497 63708 55488 -6226 295 27125 3436 -58957 -43344 22059 -7122 -44755
14754 -44755 -39098 -42061 -54266 -15085 19490 -5660 -31547 -27467 -27750 -39598 -26306 -18393 -44660
$$ packed form
14842d4130o5674q517N6052K9149m5259j5276M1911K2691n17n680L1940K6737
14830B3427J7851Q791l3043m5401k009P615K871j9822j6347k148j78N399N3429
14817D35L940l8712j1405M2875K2429p547q84j736J3556p391O200k1358o3440
14804f3038r741O990j8574L2700L5844j9218J1210J3094K3009M7227J054L40P732
14791F8629m608n8114k8469l326O667q21J0022J8897J3156L6752K280l5141R292
14778C5216K1790M10m6943j2586K7563j9970K3255K3344M8004K975l4441j7577
14766E1040K0457p789q220o1714O521K6830k3689o2393J5613O5403k9181l7633
14754d4755N657k963j2205L9181L4575k5150k5887M080k83j1848J3292P913k6267
$$ plain form
14741 -44660 -15092 -12409 8343 7209 18512 10569 -35506 -46905 -67065 -72185 -34616 -12181
14729 -12181 50640 82822 55129 49915 35609 45601 68414 22010 -17917 -51390 -57246 -5154
14717 -5154 38824 5559 -31520 -45279 -15307 29293 33293 29701 20215 9875 -11757 8192
14705 8192 15534 5894 -10338 -5417 -23473 -19755 -13723 -3960 -12686 -32642 -30675 -37981 -38805 -25072
14691 -25072 -19253 -53089 -45846 -17330 -9758 985 -283 -16091 -17406 -24194 -15594 -7129 27814
14678 27814 37366 24394 -12598 11349 18289 2618 19330 1465 7645 8839 9809 54567 65139
14665 65139 63673 -262 -38666 -38670 -32537 -15216 -9354 -61597 -46776 -52812 -41217 -13394 -33075
14652 -33075 -12472 23212 24957 39704 24694 -8561 -5397 -47454 -51139 -6547 8450 -11861
$$ packed form
14741d4660K9568K683K0752j134J1303p943m6075j1399k0160n120L7569K2435
14729a2181O2821L2182k7693n214j4306R992K2813m6404l9927l3473n856N2092
14717e154M3978l3265l7079j3759K9972M4600M000l592r486j0340k1632J9949
14705H192P342r640j6232M921j8056L718O032R763q726j9956J967p306q24J3733
14691b5072N819l3836P243K8516P572J0743j268j5808j315o788Q600Q465L4943
14678B7814R552j2972l6992K3947O940j5671J6712j7865O180J194R70M4758J0572
14665F5139j466o3935l8404mO133J7321N862n2243J4821o036J1595K7823j9681
14652c3075K0603L5684J745J4747j5010l3255L164m2057l685M4592J4997k0311
$$ plain form
14640 -11861 -62180 -76879 -67260 -51737 4920 35919 -5553 -53229 -104943 -114378 -98490 -55873
14628 -55873 -27639 -11951 14750 59979 78082 16235 -24695 -10508 11413 18293 34297 50404
14616 50404 26506 -26619 -54092 -32055 -7027 -20636 -23328 7919 25971 -10151 -836 23672
14604 23672 39327 31201 10370 41823 71038 77649 108187 88184 47876 36387 58163 53692
14592 53692 56904 60283 49297 35834 32993 52063 68414 35892 58099 68540 22149 8917
14580 8917 12100 8288 9645 -36728 -78918 -116437 -95980 -45263 -43082 -23220 24456 37734 55915
14567 55915 25396 11638 41300 41033 35777 327 -30659 -64891 -36121 -2023 -15980 -1776
14555 -1776 25489 28737 -7255 -8900 -36041 -32343 -51331 -27915 -33735 -38192 -20463 -65 1603
$$ packed form
14640a1861n0319j4699R619J5523N6657L0999m1472m7676n1714r435J5888M2617
14628e5873K8234J5688K6701M5229J8103o1847m0930J4187K1921O880J6004J6107
14616E0404k3898n3125k7473K2037K5028j3609k692L1247J8052l6122R315K4508
14604B3672J5655q126k0831L1453K9215O611L0538k0003m0308j1489K1776m471
14592E3692L212L379j0986j3463k841J9070J6351l2522K2207J0441m6391j3232
14580H917L183l812J357m6373m2190l7519K0457N0717K181J9862M7676J3278J8181
14567E5915l0519j3758K9662k67n256l5450l0986l4232K8770L4098j3957J4204
14555a776K7265L248l5992j645k7141L698j8988K3416n820m457J7729K0398J668
$$ plain form
14542 1603 -23774 -35640 -49586 -37599 -25278 -32824 -38117 -24497 -366 44275 57888 8896
14530 8896 -7238 -18287 -31676 -10759 4454 10296 42290 91725 74234 46260 -5309 25855
14518 25855 25227 -15636 -21360 13394 -6623 -30014 -47011 -44926 -13002 10963 -12087 -15870 -18343
14505 -18343 -8285 -14097 -42658 -46260 -15119 -35096 -76008 -117842 -77924 -39680 -31465 -19964
14493 -19964 -32879 -11816 -7388 -9940 -32455 -11067 -6320 -28924 -20099 -16408 -29932 -38761 -26276
14480 -26276 -197 -4300 -64877 -26625 30302 24177 24814 12655 11176 32431 26080 15577 2149
14467 2149 22362 34242 34862 1977 -33222 -24632 -29960 1349 -17654 12917 8106 -22065 -7933
14454 -7933 -1050 -52420 -36568 3647 48276 79836 47328 -16708 -24633 -1945 2133 24967
$$ packed form
14542A603k5377j1866j3946J1987J2321p546n293J3620K4131M4641J3613m8992
14530H896j6134j1049j3389K0917J5213N842L1994M9435j7491k7974n1569L1164
14518B5855o28m0863n724L4754k0017k3391j6997K085L1924K3965k3050l783k473
14505a8343J0058n812k8561l602L1141j9977m0912m1834L9918L8244Q215J1501
14493a9964j2915K1063M428k552k2515K1388M747k2604Q825L691j3524q829J2485
14480b6276K6079m103o0577L8252N6927o125O37j2159j479K1255o351j0503j3428
14467B149K0213J1880O20l2885l5199Q590n328L1309j9003L0571m811l0171J4132
14454g933O883n1370J5852M0215M4629L1560l2508o4036p925K2688M078K2834
$$ plain form
14442 24967 45376 31083 -19344 -7990 13712 18319 -818 29430 71732 53567 50171 35443
14430 35443 35249 43923 51231 60723 29481 19612 60023 67716 55691 62616 71480 40291 -3016
14417 -3016 -42966 -29276 8993 1373 -19672 -17319 -9324 -5424 -12594 11915 37112 61162 51522
14404 51522 -11979 -23201 -8464 45851 67524 40105 37067 -3313 -12331 13125 -263 -14791
14392 -14791 -13643 -14909 -1818 -7247 -34324 -34093 -30797 37481 74069 33689 4143 -23648 -18690
14379 -18690 -24891 -20698 -1402 34233 27844 -3124 21262 29348 30828 16092 2881 -6660 3652
14366 3652 53665 44573 54145 64097 60668 41814 -13103 -7025 -20699 -6541 8330 8547 -3984
14353 -3984 194 -1534 -1624 8370 33096 18429 -974 -11433 -23184 -82686 -76619 -66271 -83502
$$ packed form
14442B4967K0409j4293n0427J1354K1702M607j9137L0248M2302j8165l396j4728
14430C5443j94Q674P308R492l1242r869M0411P693j2025O925Q864l1189m3307
14417c016l9950J3690L8269p620k1045K353P995L900p170K4509K5197K4050r640
14404E1522o3501j1222J4737N4315K1673k7419l038m0380r018K5456j3388j4528
14392a4791J148j266J3091n429k7077K31L296O8278L6588m0380k9546k7791M958
14379a8690o201M193J9296L5635o389l0968K4386Q086J480j4736j3211r541J0312
14366C652N0013r092R572R952l429j8854n4917O078j3674J4158J4871K17j2531
14353c984M178j728r0R994K4726j4667j9403j0459j1751n9502O067J0348j7231
$$ plain form
14340 -83502 -60902 -31790 -34661 -16034 -32449 -1306 -1243 -12654 9603 31017 716 11114
14328 11114 22855 5952 -2213 19196 14071 -8343 -8648 -5213 29869 34820 6928 10710 37367
14315 37367 10594 -4931 24191 54310 26000 5433 -17050 -8282 8637 18830 -51147 -68530
14303 -68530 -37897 -30024 -16251 -24084 5445 8455 13062 46155 30413 -19573 -63304 -51669
14291 -51669 -15268 2767 -1875 49203 38028 -44585 -57074 -55749 -52539 -66495 -68857 -55560
14279 -55560 -50729 -32640 -40814 -35809 -51185 -72107 -46395 -1381 9 -24958 -21108 -31221 2652
14266 2652 -4820 1614 8859 28160 14336 6783 25757 39260 36742 11015 15253 64956 39486
14253 39486 -12246 -8886 13831 1136 4396 55674 74977 73200 61663 54502 48676 63692 66715
$$ packed form
14340h3502K2600K9112k871J8627j6415L1143O3j1411K2257K1414l0301J0398
14328A1114J1741j6903q165K1409n125k2414l05L435L5082M951k7892L782K6657
14315C7367k6773j5525K9122L0119k8310k0567k2483Q768J6919J0193o9977j7383
14303f8530L0633P873J3773p833K9529L010M607L3093j5742m9986m3731J1635
14291e1669L6401J8035m642N1078j1175q2613j2489J325L210j3956k362J3297
14279e5560M831J8089q174N005j5376k0922K5712M5014J390k4967L850j0113L3873
14266B652p472O434P245J9301j3824p553J8974J3503k518k5727M238M9703k5470
14253C9486n1732L360K2717j2695L260N1278J9303j777j1537p161n826J5016L023
$$ plain form
14240 66715 52063 34970 22914 35670 25183 -1710 -17232 7016 18221 -3721 1696 18208
14228 18208 13189 41537 17783 -5738 1040 -1008 -20043 -28632 -47454 -25282 -25020 -55390 -19382
14215 -19382 24395 76516 42874 8536 -8071 16492 16122 17596 25830 32999 28485 32207 -7376
14202 -7376 -5315 26402 -921 -5234 16322 21511 13876 40980 19124 4234 9836 31336 -13638
14189 -13638 -24691 -33823 -42532 -60389 -41403 -13234 16170 36491 13477 -4284 -7880 -6350
14177 -6350 -20453 -54096 -61148 -38903 -2071 15365 -7261 -11673 343 -41044 -39900 16254
14165 16254 44409 41055 48391 74951 45859 58003 51341 13531 -53395 -35812 -5827 23434
14153 23434 21120 39362 6535 -6576 -1852 10594 12969 -10957 -9803 25115 36632 13212
$$ packed form
14240F6715j4652j7093j2056J2756j0487k6893j5522K4248J1205k1942N417J6512
14228A8208n019K8348k3754k3521O778k048j9035q589j8822K2172K62l0370L6008
14215a9382M3777N2121l3642l4338j6607K4563l70J474Q234P169m514L722l9583
14202g376K061L1717k7323m313K1556N189p635K7104k1856j4890N602K1500m4974
14189a3638j1053r132q709j7857J8986K8169K9404K0321k3014j7761l596J530
14177f350j4103l3643p052K2245L6832J7436k2626m412J2016m1387J144N6154
14165A6254K8155l354P336K6560k9092J2144o662l7810o6926J7583K9985K9261
14153B3434k314J8242l2827j3111M724J2446K375k3926J154L4918J1517k3420
$$ plain form
14141 13212 -13043 -14310 -12221 -21068 12776 15459 -10172 19551 86477 79930 63874 6895 -16453
14128 -16453 -8741 4240 19971 46164 40358 45786 38940 -7215 -26978 -50101 -54931 -54376 -38513
14115 -38513 -75352 -95769 -106070 -106396 -76149 -89066 -118468 -104465 -40283 16339 -8243 -9445
14103 -9445 12095 16108 22364 20464 28416 19663 -6364 -19729 7576 26129 31692 20704 -2447
14090 -2447 -27654 -27501 -6436 20176 -4291 -4629 19020 20836 29656 13629 -4983 -11659 -34093
14077 -34093 -4315 2054 -54199 -61928 -36003 -31596 -11154 -23835 -17298 -4541 -11016 -9326 -20045
14064 -20045 -39857 -48024 -46840 -43012 -20536 14449 -30187 -72608 -33838 -18681 -33068 -18723
14052 -18723 12917 12464 1224 -46483 -64197 -37190 22380 5893 43705 59500 70768 44508
$$ packed form
14141A3212k6255j267K089q847L3844K683k5631K9723O6926o547j6056n6979k3348
14128a6453P712J2981J5731K6193n806N428o846m6155j9763k3123m830N55J5863
14115c8513l6839k0417j0301l26L0247j2917k9402J4003O4182N6622k4582j202
14103i445K1540M013O256j900P952q753k6027j3365K7305J8553N563j0988k3151
14090b447k5207J53K1065K6612k4467l38K3649J816Q820j6027j8612o676k2434
14077c4093K9778O369n6253p729K5925M407K0442j2681O537J2757o475J690j0719
14064b0045j9812q167J184L828K2476L4985m4636m2421L8770J5157j4387J4345
14052a8723L1640m53j1240m7707j7714K7007N9570j6487L7812J5795J1268k6260
$$ plain form
14040 44508 40293 40990 1326 3407 -24512 -57049 711 52624 286 -45591 -66577 -63545 -19742
14027 -19742 21137 7520 -6867 -12023 4436 -9710 -16460 -24520 1408 -985 -29528 -15677
14015 -15677 15827 25026 21529 45118 36626 27766 4328 -118 -11311 -6761 12727 28772 40842
14002 40842 10004 -9960 -47374 -32998 -29410 -32869 -8161 -25818 -17874 4390 4236 -4601 19338
13989 19338 38870 66969 86187 104530 71654 36848 34689 31975 46835 67207 95560 64927
13977 64927 40204 23572 -9193 -19614 -21391 -28650 -42862 -52981 -50001 -49452 -29055 -16514 -124
13964 -124 36391 61407 15022 10566 -11769 -41739 -41511 -27402 -14356 -17515 -36046 -29656 -2937
13951 -2937 18218 -18210 -27544 -5590 -27668 -16993 -8911 -5015 -9293 967 22343 11596 23214
$$ packed form
14040D4508m215O97l9664K081k7919l2537N7760N1913n2338m5877k0986L032M3803
14027a9742M0879j3617j4387n156J6459j4146o750q060K5928k393k8543J3851
14015a5677L1504R199l497K3589q492q860k3438m446j1193M550J9488J6045J2070
14002D0842l0838j9964l7414J4376L588l459K4708j7657P944K2264j54q837K3939
13989A9338J9532K8099J9218J8343l2876l4806k159k714J4860K0372K8353l0633
13977F4927k4723j6632l2765j0421j777p259j4212j0119K980N49K0397J2541J6390
13964a24L6515K5016m6385m456k2335k9970K28J4109J3046l159j8531O390K6719
13951b937K1155l6428r334K1954k2078J0675Q082L896m278J0260K1376j0747J1618
$$ plain form
13938 23214 55153 8487 -767 32343 35668 4388 -27655 -41464 -45450 -15897 -36839 -34688
13926 -34688 -17082 -23559 -21036 -20546 -51852 -68300 -49784 -23789 -17187 4241 8127 -7605 2857
13913 2857 17267 32286 -334 -1905 1300 31231 41885 38378 70394 110158 72935 46545
13901 46545 -14813 -1121 41339 45602 70564 49730 8774 -16559 -43686 -37934 -15300 21768
13889 21768 46907 50120 33631 11524 -51597 -46570 -13260 4068 26059 28141 12672 -13685
13877 -13685 -20337 -24289 -51794 -72072 -83744 -89634 -70662 -32449 -50065 -81600 -92458 -86274
13865 -86274 -61188 -58548 -54950 -9316 24533 21124 43433 46889 -6566 -54260 -86098 -66281
13853 -66281 6460 -1438 -7452 -24050 -39226 -31422 -27867 -20154 -33251 -21950 17000 52041 37456
$$ packed form
13938B3214L1939m6666r254L3110L325l1280l2043j3809l986K9553k0942K151
13926c4688J7606o477K523M90l1306j6448J8516K5995O602K1428L886j5732J0462
13913B857J4410J5019l2620j571L205K9931J0654l507L2016L9764l7223k6390
13901D6545o1358J3692M2460M263K4962k0834m0956k5333k7127N752K2634L7068
13889B1768K5139L213j6489k2107o3121N027L3310J7328K1991K082j5469k6357
13877a3685o652l952k7505k0278j1672n890J8972L8213j7616l1535j0858O184
13865h6274K5086K640L598M5634L3849l409K2309L456n3455m7694l1838J9817
13853f6281P2741p898o014j6598j5176P804L555P713j3097J1301L8950L5041j4585
$$ plain form
13840 37456 15937 -12108 -26257 -28916 -50147 -17541 -18647 -46931 -39013 -17538 -30358 -54297
13828 -54297 -60305 -58671 -64911 -44132 -62309 -54053 -29505 -25743 -55759 -50606 26699 106582 119622
13815 119622 87367 8977 -21107 16667 -3055 783 20051 58058 65716 54181 65978 76364
13803 76364 74694 47281 53960 39120 24956 47973 37012 36047 39451 79266 123042 91987 60371
13790 60371 54346 38494 -24345 -46291 -44774 -2948 19936 15139 31131 40037 19415 -16848
13778 -16848 3427 25161 38935 64294 59117 63310 33501 -52183 -58032 -16946 -15156 -17360 -13080
13765 -13080 -7891 -474 18018 23577 10176 -46708 -93671 -116623 -118107 -110565 -68859 -42752 -207
13752 -207 22702 32322 4911 -13585 2472 -25644 -56207 -52332 12864 26371 20700 38338 50837
$$ packed form
13840C7456k1519k8045j4149k659k1231L2606j106k8284P918K1475j2820k3939
13828e4297o008J634o240K0779j8177Q256K4548L762l0016N153P7305P9883J3040
13815A19622l2255p8390l0084L7774j9722L838J9268L8007P658j1535J1797J0386
13803G6364j670k7413O679j4840j4164K3017j0961r65L404L9815M3776l1055l1616
13790F0371o025j5852o2839k1946J517M1826K2884m797J5992Q906k0622l6263
13778a6848K0275K1734J3774K5359n177M193k9809q5684n849M1086J790k204M280
13765a3080N189P417J8492N559j3401n6884m6963k2952j484P542M1706K6107M2545
13752b07K2909R620k7411j8496J6057k8116l0563L875O5196J3507n671J7638J2499
$$ plain form
13739 50837 33918 -7245 -8611 -11676 -47695 -54549 -47160 -61357 -63682 -63897 -26735 42573 29408
13726 29408 15771 19825 -3246 -24028 -34761 -32384 -30829 -26751 -20257 -34080 -74459 -33866 5723
13713 5723 14677 19493 62669 33152 15920 5330 -20889 -46124 -12909 -3288 -33230 -5593
13701 -5593 9278 3531 -5708 -27682 2012 10610 -20310 -3368 8146 45484 45538 28583 -20870
13688 -20870 -45416 -66260 -39261 1058 9737 25219 14458 6677 2718 15042 -3908 -945
13676 -945 -18020 -67548 -77897 -57423 -27892 25436 22173 -9530 9624 8976 -32437 -43203 -21747
13663 -21747 -41837 -28810 8589 18551 -17815 -17708 -1804 -3352 -10112 -20045 -28554 -17390 41614
13650 41614 64002 47583 65945 39052 18945 13876 8153 8060 13871 27021 12300 -3898 13837
$$ packed form
13739E0837j6919m1163j366l065l6019o854P389j4197k325k15L7162O9308j3165
13726B9408j3637M054k3071k0782j0733K377J555M078O494j3823m0379M0593L9589
13713E723Q954M816M3176k9517j7232j0590k6219k5235L3215R621k9942K7637
13701e593J4871n747r239k1974K9694Q598l0920J6942J1514L7338N4j6955m9453
13688b0870k4546k0844K6999M0319Q679J5482j0761p781l959J2324j8950K963
13676i45j7075m9528j0349K0474K9531N3328l263l1703J9154o48m1413j0766K1456
13663b1747k0090J3027L7399R962l6366J07J5904j548o760r933q509J1164N9004
13650D1614K2388j6419J8362k6893k0107n069n723r3N811J3150j4721j6198J7735
$$ plain form
13637 13837 -3583 -41730 -10784 19910 2777 28231 807 -11070 -20814 -7284 -42326 -56686
13625 -56686 -63592 -65276 -10256 11092 13739 1350 -7833 -26395 -6158 23934 20637 49548 57180
13612 57180 74017 62303 32396 33152 23313 36311 38203 58290 62296 39200 -4449 -50515 -80531
13599 -80531 -36795 18807 7489 15311 3963 18209 33287 -12546 21365 53061 55985 33432
13587 33432 60302 18625 -45775 -45023 -3176 -11762 -3204 -7767 -13792 -38101 -22173 -24158 9887
13574 9887 4746 -25091 -25056 -29612 -32698 -46223 -50228 -33799 -27872 -43242 -40865 -37122 -50583 -30364
13560 -30364 -162 26219 28962 23191 6551 -5072 28213 77342 48331 2161 14298 -5207
13548 -5207 -1571 5990 25475 39587 41595 7724 -34253 -37709 -25805 -28501 -23242 -15764 -3284
$$ packed form
13637A3837j7420l8147L0946L0694j7133K5454k7424j1877r744J3530l5042j4360
13625e6686o906j684N5020K1348K647j2389r183j8562K0237L0092l297K8911P632
13612E7180J6837j1714k9907P56r839J2998J892K0087M006k3096m3649m6066l0016
13599h0531M3736N5602j1318P822j1348J4246J5078m5833L3911L1696K924k2553
13587C3432K6870m1677o4400P52M1847q586Q558m563o025k4309J5928j985L4045
13574I887n141k9837L5m556l086j3525m005J6429N927j5370K377L743j3461K0219
13560c0364L0202K6381K743n771j6640j1623L3285M9129k9011m6170J2137j9505
13548e207L636P561J9485J4112K008l3871m1977l456J1904k696N259P478J2480
$$ plain form
13535 -3284 -6414 14012 -12599 -99962 -105647 -90453 -95429 -50550 -44383 -46603 -32342 -17873 -22695
13522 -22695 -52260 -90074 -116548 -42788 27234 37563 18750 -14292 -21880 -24992 -20514 -602
13510 -602 39993 29792 10133 6675 -14001 8827 76263 126255 115367 63713 46534 48325
13498 48325 54188 42957 42644 8511 -3352 27035 52965 15584 2883 30163 72649 95336
13486 95336 103063 62082 19738 22080 7033 -2179 12893 -21377 -11936 9775 17879 16781 6851
13473 6851 5827 11658 -15858 -40111 -18136 -4048 -26597 -24580 -23310 -28537 -31886 -68773 -85911
13460 -85911 -20752 41686 16184 -45766 -47538 -34272 -7524 21271 6466 -21672 -55352 -22848
13448 -22848 -29263 -46252 -35533 -32728 138 14639 24472 -18961 -15706 -34841 -8469 1540
$$ packed form
13535c284l130K0426k6611q7363n685J5194m976M4879O167k220J4261J4469m822
13522b2695k9565l7814k6474P3760P0022J0329j8813l3042p588l112M478J9912
13510f02M0595j0201j9659l458k0676K2828O7436M9992j0888n1654j7179J791
13498D8325N863j1231l13l4133j1863L0387K5930l7381j2701K7280M2486K2687
13486I5336P727m0981m2344K342j5047r212J5072l4270R441K1711Q104j098r930
13473F851j024N831k7516k4253K1975J4088k2549K017J270n227l349l6887j7138
13460h5911O5159O2438k5502o1950j772J3266K6748K8795j4805k8138l3680L2504
13448b2848o415j6989J0719K805L2866J4501R833m3433L255j9135K6372J0009
$$ plain form
13436 1540 7261 -2197 29266 27741 -7270 -9878 -22243 -4002 22260 33444 37370 4440 16044
13423 16044 26615 13242 14184 -23899 -35936 -23285 -50030 -53288 -33737 -56720 -68167 -74972
13411 -74972 -39210 -62081 -81606 -56418 -7660 41482 30907 17517 -20549 -43583 -81372 -42008
13399 -42008 -8697 6804 21341 17974 -36061 -42130 -30705 -10714 34274 51060 35483 11657
13387 11657 -1967 -11185 8390 13005 -19934 -34527 4295 50241 32396 -13575 -9785 -20154
13375 -20154 -27796 -37356 -4472 -26168 -51364 -98676 -65829 -24099 11550 27147 32508 11325
13363 11325 27479 12223 -34433 -56059 -59057 -38826 -4978 -9782 17288 21911 24332 17856 7020
13350 7020 25057 49944 59268 9927 -7327 -25852 -8221 -24644 -37131 -7419 -23921 -61147
$$ packed form
13436A540N721r458L1463j525l5011k608j2365J8241K6262J1184L926l2930J1604
13423A6044J0571j3373R42l8083j2037J2651k6745l258J9551k2983j1447o805
13411g4972L5762k2871j9525K5188M8758M9142j0575j3390l8066k3034l7789L9364
13399d2008L3311J5501J4537l367n4035o069J1425J9991M4988J6786j5577k3826
13387A1657j3624r218J9575M615l2939j4593L8822M5946j7845m5971L790j0369
13375b0154p642r560L2884k1696k5196m7312L2847M1730L5649J5597N361k1183
13363A1325J6154j5256m6656k1626k998K0231L3848m804K7070M623K421o476j0836
13350G020J8037K4887R324m9341j7254j8525J7631j6423j2487K9712j6502l7226
$$ plain form
13338 -61147 -49953 -55073 -70625 -84280 -105999 -51339 -21409 -28364 -31933 -45883 -68531 -110332
13326 -110332 -121017 -87844 -66796 -54768 -71831 -19557 31012 2369 -31486 -21026 -17414 -12606
13314 -12606 -27740 -14733 -3438 -24975 -38192 -76096 -72266 -62098 -36367 -2241 8992 23874
13302 23874 25827 30897 41171 26507 -25503 -46258 -64102 -75046 -31265 -3827 5964 28597
13290 28597 21543 1608 -36345 -33797 -28404 -12697 25995 48863 37869 33512 1196 -14567
13278 -14567 -3681 -12736 680 -22964 -37312 23876 1474 -20206 7459 19215 35082 44202
13266 44202 30499 893 -10781 -45904 -58588 -58442 -36833 -14716 -3824 20462 19384 41461
13254 41461 38923 25373 41198 43509 9488 -26943 -37426 -7752 -4318 -19051 -26112 -7859
$$ packed form
13338f1147J1194n120j5552j3655k1719N4660K9930o955l569j3950k2648m1801
13326a10332j0685L3173K1048J2028j7063N2274N0569k8643l3855J0460L612M808
13314a2606j5134J3007J1295k1537j3217l7904L830J0168K5731L4126J1233J4882
13302B3874J953N070J0274j4664n2010k0755j7844j0944M3781K7438R791K2633
13290B8597p054j9935l7953K548N393J5707L8692K2868j0994m357l2316j5763
13278a4567J0886r055J3416k3644j4348O1188k2402k1680K7665J1756J5867R120
13266D4202j3703k9606j1674l5123j2684J46K1609K2117J0892K4286j078K2077
13254D1461k538j3550J5825K311l4021l6431j0483K9674L434j4733p061J8253
$$ plain form
13242 -7859 1883 4163 30972 30948 40642 69226 34812 23474 26226 41249 21611 -13454 3871
13229 3871 -5960 53089 63217 10154 8374 21088 31106 30625 7384 48734 99479 105993 54918
13216 54918 50103 59456 39058 42028 1617 -35154 -19022 -8367 -11401 15431 26967 -8880
13204 -8880 3288 21495 46930 29490 1540 -4493 23438 54756 18194 1476 20888 2848
13192 2848 8731 56745 33540 25689 32335 46756 59811 46544 16898 -300 26733 58583
13180 58583 53747 23039 -3158 8839 22525 55366 91512 45006 15688 -6932 -854 32497
13168 32497 49507 48755 5826 -19817 -25070 -5437 -8046 -19313 -33267 -36316 -55266 -53377 -36519
13155 -36519 -25504 -42496 -44572 -38313 -49703 -49756 -28135 -2140 -11904 -29240 9799 65561 317
$$ packed form
13242g859R742K280K6809k4R694K8584l4414j1338K752J5023j9638l5065J7325
13229C871r831N9049J0128n3063j780J2714J0018m81k3241M1350N0745O514n1075
13216E4918m815R353k0398K970m0411l6771J6132J0655l034K6832J1536l5847
13204h880J2168J8207K5435j7440k7950o033K7931L1318l6562j6718J9412j8040
13192B848N883M8014k3205p851O646J4421J3055j3267k9646j7198K7033L1850
13180E8583m836l0708k6197J1997J3686L2841L6146m6506k9318k2620O078L3351
13168C2497J7010p52m2929k5643n253J9633k609j1267j3954l049j8950J889J6858
13155c6519J1015j6992k076O259j1390n3K1621K5995r764j7336L9039N5762o5244
$$ plain form
13142 317 -20124 -15498 3244 -9943 -15421 -15829 -23360 -25369 -31711 -55432 -53415 -76844 -69250 -46577
13128 -46577 -42951 -24483 -6973 10180 12321 17256 -3435 8988 14941 28543 24243 26690 23247
13115 23247 20905 -19291 -41563 -39587 -79892 -87804 -97744 -77264 -23868 -28496 9679 13803 18752
13102 18752 36784 4158 -13629 8569 73599 43968 -4975 -987 959 6808 22200 -6115
13090 -6115 21199 20277 -35330 -34011 -74311 -86225 -60899 -25217 -34921 -30090 -19296 29270 55626
13077 55626 -2049 -19569 -8613 7365 3172 -16900 -22422 -87658 -85547 -4034 13413 5965
13065 5965 -17494 -42892 -43925 -2367 13776 55800 43198 11673 -983 -2477 2592 -5210 -10567
13052 -10567 -684 6730 13198 -3789 -46007 -57921 -33647 -18466 -61710 -75589 -39860 -40468 -37861
$$ packed form
13142C17k0441M626J8742j3187n478m08p531k009o342k3721K017k3429P594K2673
13128d6577L626J8468J7510J7153K141M935k0691J2423N953J3602m300K447l443
13115B3247k342m0196k2272J976m0305p912r940K0480N3396m628L8175M124M949
13102A8752J8032l2626j7787K2198O5030k9631m8943L988J946N849J5392k8315
13090f115K7314r22n5607J319m0300j1914K5326L5682r704M831J0794M8566K6356
13077E5626n7675j7520J0956J5978m193k0072n522o5236K111Q1513J7447p448
13065E965k3459k5398j033M1558J6143M2024j2602l1525j2656j494N069p802n357
13052a0567R883P414O468j6987m2218j1914K4274J5181m3244j3879L5729o08K607
$$ plain form
13039 -37861 465 36712 61002 19249 6839 27379 19902 4255 -26065 -71278 -49498 6764
13027 6764 -18631 -70659 -28991 -8903 -23505 -6055 -7560 -4638 -29360 -30281 -9319 -20110 -14660
13014 -14660 -19700 -30844 -42633 -30128 -7294 24732 -6542 -4654 20844 65080 61275 7294
13002 7294 -26787 -8818 34015 29120 -23216 -28307 -49178 -46042 -7498 10600 2685 11344 -2625
12989 -2625 -18814 4942 28530 67247 81601 45304 39266 87962 65088 3605 -825 4113
12977 4113 15330 20930 3309 279 -5295 -29246 -28019 -24338 -41291 -22953 -27733 15498 21656
12964 21656 9257 29763 40903 3821 10328 46485 71895 74316 53279 40308 21931 -8618
12952 -8618 -54389 -49600 -46223 -78148 -76939 -51878 -40934 -54895 -50864 -43967 -39268 -1700 -7496
$$ packed form
13039c7861L8326L6247K4290m1753j2410K0540p477j5647l0320m5213K1780N6262
13027F764k5395n2028M1668K0088j4602J7450j505K922k4722r21K0962j0791N450
13014a4660n040j1144j1789J2505K2834L2026l1274J888K5498M4236l805n3981
13002G294l4081J7969M2833m895n2336n091k0871L136L8544J8098p915Q659j3969
12989b625j6189K3756K3588L8717J4354l6297o038M8696k2874o1483m430M938
12977D113J1217N600j7621l030n574k3951J227L681j6953J8338m780M3231O158
12964B1656j2399K0506J1140l7082O507L6157K5410K421k1037j2971j8377l0549
12952h618m5771M789L377l1925J209K5061J0944j3961M031O897M699L7568n796
$$ plain form
12939 -7496 -21817 -5276 17526 8908 27151 55530 3487 -8424 1076 -13416 -8498 16799
12927 16799 18783 6726 25615 57624 82047 94003 64555 33294 71115 82204 51884 52520
12915 52520 50150 27531 -20279 -21746 -44085 -11598 64515 76125 78283 64750 30328 -65131
12903 -65131 -107216 -73616 -28500 -14745 -18176 -11854 -34640 -45399 -29833 -11818 -9623 2805
12891 2805 20227 19926 13792 980 -2765 33672 47556 38927 -846 -21053 -20522 -34542 -1304
12878 -1304 20803 4791 -4377 -1504 42917 14548 -24853 -21979 -35877 -32066 16126 25845 -13598
12865 -13598 -28822 -25362 -59308 -74098 -69182 -46069 -11945 -9147 -44795 -64274 -47355 -67524
12853 -67524 -51722 -12730 -12072 -16514 -12565 -21946 -12734 -11076 -54382 -42163 26470 28575 -6422
$$ packed form
12939g496j4321J6541K2802q618J8243K8379n2043j1911R500j4492M918K5297
12927A6799J984j2057J8889L2009K4423J1956k9448l1261L7821J1089l0320O36
12915E2520k370k2619m7810j467k2339L2487P6113J1610K158j3533l4422r5459
12903f5131m2085L3600M5116J3755l431O322k2786j0759J5566J8015K195J2428
12891B805J7422l01o134j2812l745L6437J3884q629l9773k0207N31j4020L3238
12878a304K2107j6012r168K873M4421k8369l9401K874j3898L811M8192R719l9443
12865a3598j5224L460l3946j4790M916K3113L4124K798l5648j9479J6919k0169
12853f7524J5802L8992O58m442L949r381R212J658m3306J2219O8633K105l4997
$$ plain form
12840 -6422 -66743 -26758 -8013 -8650 -1320 38253 28919 46829 60072 7572 -37669 -48894 14693
12827 14693 37716 56916 15468 -5565 -5528 -169 -16540 -29163 -16793 -29827 -50652 -35904
12815 -35904 -4235 3916 -17880 -8718 7361 28991 -33019 -93519 -81496 -63560 -80222 -69003
12803 -69003 -43950 -10204 -15107 6992 6924 -2362 148 -9817 -7697 -30063 -65594 -54594 -20324
12790 -20324 26536 29517 6387 -30074 -46158 -36389 -5866 -920 40072 47006 42515 24910 72051
12777 72051 97206 65359 36052 22724 -5116 17217 47517 48691 63314 88370 99134 69823
12765 69823 50564 88345 123008 120232 47934 22932 29959 38893 40027 51765 46728 78392 80773
12752 80773 103470 123085 202513 189330 169096 164787 155214 120500 108995 80401 37255 18229
$$ packed form
12840f422o0321L9985J8745o37P330L9573r334J7910J3243n2500m5241j1225O3587
12827A4693K3023J9200m1448k1033L7N359j6371j2623J2370j3034k0825J4748
12815c5904L1669Q151k1796R162J6079K1630o2010o0500J2023J7936j6662J1219
12803f9003K5053L3746m903K2099o8r286K510r965K120k2366l5531J1000L4270
12790b0324M6860K981k3130l6461j6084R769L0523M946M0992O934m491j7605M7141
12777G2051K5155l1847k9307j3328k7840K2333L0300J174J4623K5056J0764k9311
12765F9823j9259L7781L4663k776p2298k5002P027Q934J134J1738n037L1664K381
12752H0773K2697J9615P9428j3183k0234m309r573l4714j1505k8594m3146j9026
$$ plain form
12740 18229 64960 24926 -13106 -34871 -64301 -70226 -72949 -21468 -2585 -12682 14437 32463
12728 32463 1055 36307 66819 55772 48051 27918 14860 15386 -11930 -43502 -62898 -45602
12716 -45602 -28433 -6725 -1339 1049 10311 -31685 -34497 -32080 -47080 -51571 -21773 12979 -4984
12703 -4984 -20517 -7892 15841 74436 64730 31023 30993 -19783 -36443 -6128 -2547 -1637 -22357
12690 -22357 -15136 -4442 25027 22037 37324 46182 72355 51447 36292 61383 55849 11435
12678 11435 25746 52135 62305 28875 -20219 -29374 -44774 -44147 -6498 -20269 -73130 -84303
12666 -84303 -65200 -68337 -62545 -60826 -76036 -87277 -16318 7441 -34127 -75557 -59969 -27611
12654 -27611 -33692 272 11890 3777 -1557 317 1706 22988 51667 45520 25870 26522 75502
$$ packed form
12740A8229M6731m0034l8032k1765k9430n925k723N1481J8883j0097K7119J8026
12728C2463l1408L5252L0512j1047p721k0133j3058N26k7316l1572j9396J7296
12716d5602J7169K1708N386K388R262m1996k812K417j5000m491K9798L4752j7963
12703d984j5533J2625K3733N8595r706l3707l0n0776j6660L0315L581R10k0720
12690b2357P221J0694K9469k990J5287Q858K6173k0908j5155K5091n534m4414
12678A1435J4311K6389J0170l3430m9094r155j5400O27L7649j3771n2861j1173
12666h4303J9103l137N792J719j5210j1241P0959K3759m1568m1430J5588L2358
12654b7611o081L3964J1618q113n334J874J389K1282K8679o147j9650O52M8980
$$ plain form
12641 75502 79698 41932 -7665 -2920 -23900 -24730 -12229 11940 39778 59739 70196 41248
12629 41248 40140 69417 70474 62054 52139 7125 -42835 -24419 49358 116562 130425 71575
12617 71575 106943 107950 101912 46617 47316 55281 40276 -9591 -19038 -66452 -82880 -41490 -953
12604 -953 -11262 -74590 -58389 -17741 16214 38464 53046 17359 27216 53507 2817 -49834
12592 -49834 -73568 -47787 -42206 -20621 4154 36784 16720 19493 2982 12732 2619 -27139
12580 -27139 -24222 -18791 -12553 -36252 -11823 -9439 -25450 -40683 -36627 -46571 -20042 -16118 -47470
12567 -47470 -63881 -72116 -63800 -29270 -21711 -806 -2491 -23048 -66786 -24636 15387 14712 4491
12554 4491 13188 35023 84556 86610 46523 35374 17365 -31063 -16155 -1673 -48750 -52837
$$ packed form
12641G5502M196l7766m9597M745k0980q30J2501K4169K7838J9961J0457k8948
12629D1248j108K9277J057q420r915m5014m9960J8416P3777O7204J3863n8850
12617G1575L5368J007o038n5295O99P965j5005m9867r447m7414j6428M1390M0537
12604i53j0309o3328J6201M0648L3955K2250J4582l5687R857K6291n0690n2651
12592d9834k3734K5781N581K1585K4775L2630k0064K773j6511R750j0113k9758
12580b7139K917N431O238k3699K4429K384j6011j5233M056r944K6529L924l1352
12567d7470j6411q235Q316L4530P559K0905j685k0557m3738M2150M0023o75j0221
12554D491Q697K1835M9533K054m0087j1149j8009m8428J4908J4482m7077m087
$$ plain form
12542 -52837 -14045 -37331 -21601 14809 10628 -6700 -17970 -43072 -13005 36100 56206 33738
12530 33738 2243 -9719 2658 51586 55714 -6799 -8279 34778 914 -41059 -38646 -11455
12518 -11455 -1359 16990 41538 23890 -36235 -23660 -3811 15132 -41220 -66631 13774 39784
12506 39784 22863 17853 32434 28105 24210 24344 10419 20461 20597 -6908 14614 31669 18738
12493 18738 20 -15705 -30838 -71714 -55262 -26642 -32691 -48602 -90485 -87675 -66260 -56101
12481 -56101 -31490 -9557 -2575 -28379 -3769 -22684 -34645 -12661 -1290 -1278 29672 29164 -2550
12468 -2550 -9188 23130 48473 76956 66473 26185 -2897 -3129 -24056 -66042 -29866 16265
12456 16265 51077 86220 79271 35977 41036 42538 34998 34707 69775 93853 80230 85100 62791
$$ packed form
12542e2837L8792k3286J5730L6410m181j7328j1270k5102L0067M9105K0106k2468
12530C3738l1495j1962J2377M8928M128o2513j480M3057l3864m1973K413K7191
12518a1455J0096J8349K4548j7648o0125J2575J9849J8943n6352k5411Q0405K6010
12506C9784j6921n010J4581m329l895J34j3925J0042J36k7505K1522J7055j2931
12493A8738j8718j5725j5133m0876J6452K8620o049j5911m1883K810K1415J0159
12481e6101K4611K1933O982k5804K4610j8915j1961K1984J1371J2L0950n08l1714
12468b550o638L2318K5343K8483j0483m0288k9082k32k0927m1986L6176M6131
12456A6265L4812L5143o949m3294N059J502p540k91L5068K4078j3623M870k2309
$$ plain form
12443 62791 49001 37021 12663 16963 15295 15812 -26966 -65553 -66826 -44436 -11830 -14891 -31095
12430 -31095 -24975 -15127 761 -11495 -1817 -22242 -46753 7259 28038 -5526 15310 47602
12418 47602 90450 81423 42361 22599 64376 66675 22268 12538 -3980 -14278 40720 37065
12406 37065 -24213 -38310 -30772 -34820 -47174 -46357 -15294 67822 90303 52824 22515 13279 -6723
12393 -6723 20916 17905 -63912 -66508 -24638 -14121 -45523 -17452 2964 -42681 -20800 -2378
12381 -2378 7770 10026 -14485 -58710 -53284 -9601 1172 13213 43656 3455 -21186 -19326
12369 -19326 30306 27343 11532 -16245 -3145 6046 38700 37137 34302 62505 49501 23911
12357 23911 -3765 -16227 2749 36147 -7337 -43647 -41521 -12181 -10059 -3888 -4108 -24532 -47527
$$ packed form
12443F2791j3790j1980k4358M300j668N17m2778l8587j273K2390L2606l061j6204
12430c1095O120R848J5888j2256R678k0425k4511N4012K0779l3564K0836L2292
12418D7602M2848r027l9062j9762M1777K299m4407r730j6518j0298N4998l655
12406C7065o1278j4097P538m048j2354Q17L1063Q3116K2481l7479l0309r236k0002
12393f723K7639l011q1817k596M1870J0517l1402K8071K0416m5645K1881J8422
12381b378J0148K256k4511m4225N426M3683J0773J2041L0443m0201k4641J860
12369a9326M9632k963j5811k7777J3100R191L2654j563k835K8203j3004k5590
12357B3911k7676j2462J8976L3398m3484l6310K126K9340K122O171k20k0424k2995
$$ plain form
12344 -47527 -5843 2286 -141 -63395 -63529 -19306 -47636 -73301 -64767 -72539 -55645 -48547 -12943
12331 -12943 14501 -16497 -29968 -31056 -48556 -8146 -273 15087 51727 48845 34827 8554
12319 8554 -8130 17927 25601 25803 16440 1640 3894 -7809 -15548 -18079 -33598 13846 46046
12306 46046 17569 -25801 -42395 -59925 -77267 -30894 -16496 -25461 20344 56623 58874 35922
12294 35922 34461 6034 10819 6948 -43451 -42979 -22839 6497 -3891 -5882 -24541 -6380 2734
12281 2734 12517 53984 18020 -10499 -5339 352 -27539 -21869 -37233 -15504 49168 72224 82923
12268 82923 66003 46195 85952 73380 45811 -14045 -21415 7541 32474 46552 14615 -11662
12256 -11662 -29422 -18147 -580 -13508 7415 17128 25478 -3193 20272 7029 -15964 11000
$$ packed form
12344d7527M1684Q129k427o3254j34M4223k8330k5665Q534p772J6894P098L5604
12331a2943K7444l0998j3471j088j7500M0410P873J5360L6640k882j4018k6273
12319H554j6684K6057P674K02r363j4800K254j1703p739k531j5519M7444L2200
12306D6046k8477m3370j6594j7530j7342M6373J4398q965M5805L6279K251k2952
12294C5922j461k8427M785l871n0399M72K0140K9336j0388j991j8659J8161R114
12281B734R783M1467l5964k8519N160N691k7891N670j5364K1729O4672K3056J0699
12268H2923j6920j9808L9757j2572k7569n9856p370K8956K4933J4078l1937k6277
12256a1662j7760J1275J7567j2928K0923R713Q350k8671K3465j3243k2993K6964
$$ plain form
12244 11000 32548 29455 47118 72628 68783 56411 58145 59469 42039 13374 10203 56549 69663
12231 69663 32045 49862 75129 87628 71327 76131 47431 10984 8727 -10513 -37575 -85211
12219 -85211 -73414 -54621 -31167 -9837 -4267 23712 -6134 -34371 -26521 -68509 -85830 -16921
12207 -16921 22412 51591 69058 50756 22404 4370 -9635 -23703 -35595 -48388 -50702 -48347
12195 -48347 -27756 -14649 19129 39201 75103 46032 20131 24547 21911 -6037 -12648 -6014
12183 -6014 -6973 2283 18244 4707 3115 352 -7129 -44199 -41048 -26914 -5314 8587 -39702
12170 -39702 -32602 -26412 -34434 -17902 -10811 -18699 -8905 -33727 -47660 -72978 -74012 -27185 5539
12157 5539 -5760 23480 20526 2712 14362 13996 22860 -1869 21723 32160 10562 33926 46757
$$ packed form
12244A1000K1548l093J7663K5510l845j2372J734J324j7430k8665l171M6346J3114
12231F9663l7618J7817K5267J2499j6301M804k8700l6447k257j9240k7062m7636
12219h5211J1797J8793K3454K1330N570K7979k9846k8237P850m1988j7321O8909
12207a6921L9333K9179J7467j8302k8352j8034j4005j4068j1892j2793k314K355
12195d8347K0591J3107L3778K0072L5902k9071k5901M416k636k7948o611O634
12183f014r59R256J5961j3537j592k763p481l7070L151J4134K1600J3901m8289
12170c9702P100O190q022J6532P091p888R794k4822j3933k5318j034M6827L2724
12157E539j1299K9240k954j7814J1650l66Q864k4729K3592J0437k1598K3364J2831
$$ plain form
12144 46757 26569 35699 50069 2740 -4058 20481 38059 19526 -13549 -34471 -38501 -61368
12132 -61368 -43662 -2774 -15789 -50144 -44139 562 10754 -8989 -23694 -27894 -38643 -71821
12120 -71821 -58715 -17946 -755 -2493 -46101 -50039 -30933 -42991 -57707 -23877 -8985 -5402
12108 -5402 -10819 21079 67734 54046 27845 32076 32422 8352 32499 43448 60160 14151 3790
12095 3790 17855 28113 45785 14998 -16756 -52520 -68984 -102227 -108187 -79836 -46405 -28684
12083 -28684 13164 15339 -4057 -2764 -12731 7424 -38714 -49218 -17809 3100 71693 72551 65995
12070 65995 51484 13383 -815 10266 52814 79620 89427 62417 -4572 -41500 -38216 -63115
12058 -63115 -71396 -62171 -29114 7347 -6491 -2088 -8036 -18596 -58213 -66515 -39146 -1841 6492
$$ packed form
12144D6757k0188R130J4370m7329o798K4539J7578j8533l3075k0922m030k2867
12132f1368J7706M0888j3015l4355O005M4701J0192j9743j4705m200j0749l3178
12120g1821J3106M0769J7191j738m3608l938J9106j2058j4716L3830J4892L583
12108e402n417L1898M6655j3688k6201M231L46k4070K4147J0949J6712m6009j0361
12095C790J4065J0258J7672l0787l1754l5764j6464l3243n960K8351L3431J7721
12083b8684M1848K175j9396J293r967K0155m6138j0504L1409K0909O8593Q58o556
12070F5995j4511l8101j4198J1081M2548K6806R807k7010o6989l6928L284k4899
12058f3115q281R225L3057L6461j3838M403n948j0560l9617q302K7369L7305Q333
$$ plain form
12045 6492 -15989 2937 24410 1345 -996 8604 9166 -23754 -36102 -71252 -79892 -75469 -40456
12032 -40456 -75092 -84843 -67918 -46917 -14916 20009 53009 50132 32538 742 -12712 -32914
12020 -32914 -33638 -22010 5300 33561 2441 -14069 -17221 -12148 -24205 -23331 -22257 -3604 -14597
12007 -14597 -44806 -60005 -24766 -28118 -48838 -12457 4927 -30053 -21867 -54373 -47959 -28234
11995 -28234 -33612 -41177 14305 10607 -20723 -57103 -82578 -104573 -37117 29009 68647 47831
11983 47831 21601 16392 -6774 -11344 36838 60457 35708 23730 30608 20541 12155 -13640
11971 -13640 -11489 8395 16616 19258 33293 1478 31088 -15203 -21003 20943 6190 17779
11959 17779 9220 -6558 -32293 -52083 -31333 -53901 -27265 -20297 -38519 -41119 -31876 -34806 -45295
$$ packed form
12045F492k2481J8926K1473k3065k341R600N62l2920j2348l5150q640M423L5013
12032d0456l4636r751J6925K1001L2001L4925L3000k877j7594l1796j3454k0202
12020c2914p24J1628K7310K8261l1120j6510l152N073j2057Q74J074J8653j0993
12007a4597l0209j5199L5239l352k0720L6381J7384l4980Q186l2506O414J9725
11995b8234n378p565N5482l698l1330l6380k5475k1995O7456O6126L9638k0816
11983D7831k6230n209k3166m570M8182K3619k4749j1978O878j0067q386k5795
11971a3640K151J9884Q221K642J4035l1815K9610m6291n800M1946j4753J1589
11959A7779q559j5778k5735j9790K0750k2568K6636O968j8222k600R243k930j0489
$$ plain form
11946 -45295 -57532 -63593 -64883 -32490 -2564 -15436 8478 37523 48639 8569 -12231 -12757
11934 -12757 -46339 -56983 -40222 -13134 -33723 -17339 41453 70329 37473 26050 4111 -36891
11922 -36891 -51862 -46915 -9025 26948 40587 22061 -15006 40735 71343 58074 24833 -565
11910 -565 17712 49505 49547 37492 55536 60609 66622 62657 16085 14532 -6964 -4039 -20611 -16299
11896 -16299 16906 23844 3788 30516 -18268 -60762 -35455 -6262 -4917 -18253 -33054 -22521
11884 -22521 -15077 939 27644 28553 -17321 -31148 -28822 -31815 -44086 1013 32305 81632 93342
11871 93342 54741 49110 27446 16397 20835 -22348 -64510 -60018 -39228 -24623 -18128 3452
11859 3452 -1553 -36631 -41285 -35791 -15430 -7287 25385 19517 210 -852 23341 37726 -8804
$$ packed form
11946d5295j2237o061j290L2393K9926j2872K3914K9045J1116m0070k0800n26
11934a2757l3582j0644J6761K7088k0589J6384N8792K8876l2856j1423k1939m1002
11922c6891j4971M947L7890L5973J3639j8526l7067N5741L0608j3269l3241k5398
11910e65J8277L1793M2j2055J8044N073O013l965m6572j553k1496K925j6572M312
11896a6299L3205O938k0056K6728m8784m2494K5307K9193J345j3336j4801J0533
11884b2521P444J6016K6705R09m5874j3827K326k993j2271M5099L1292M9327J1710
11871I3342l8601n631k1664j1049M438m3183m2162M492K0790J4605O495K1580
11859C452n005l5078m654N494K0361Q143L2672n868j9307j062K4193J4385m6530
$$ plain form
11846 -8804 -12718 -11936 -1635 15777 10998 -1288 -45738 -69465 -43162 10405 41394 26018 6850
11833 6850 11313 20757 47438 34545 19651 52086 53298 55373 10652 -8743 2890 -2868 -8558
11820 -8558 2940 54634 1749 -37528 -46853 -36849 -36129 -34292 -27676 -4798 36774 20865 -51592
11807 -51592 -26504 52354 68875 62426 4791 1848 5572 -818 9816 8255 -25754 -26658 -40126
11794 -40126 -30375 -25847 -16211 15499 22173 -7106 -27632 -44866 -28899 -30846 -27636 -8599 -19765
11781 -19765 -43961 7711 50599 53735 35598 1704 -24518 -7044 -11058 -3817 -13024 -49950
11769 -49950 -59059 -60322 -65466 -60215 -67235 -17475 14429 -21233 -38677 -40421 -41910 -67133 -54174
11756 -54174 -947 21847 56666 63348 51120 73769 61940 55847 74661 78894 61061 25203
$$ packed form
11846h804l914P82J0301J7412m779j2286m4450k3727K6303N3567L0989j5376j9168
11833F850M463R444K6681j2893j4894L2435J212K075m4721j9395J1633n758n690
11820h558J1498N1694n2885l9277r325J0004P20J837O616K2878M1572j5909p2457
11807e1592K5088P8858J6521o449n7635k943L724o390J0634j561l4009r04j3468
11794d0126R751M528R636L1710O674k9279k0526j7234J5967j947L210J9037j1166
11781a9765k4196N1672M2888L136j8137l3894k6222J7474m014P241r207l6926
11769d9950r109j263n144N251p020M9760L1904l5662j7444j744j489k5223J2959
11756e4174N3227K2794L4819O682j2228K2649j1829o093J8814M233j7833l5858
$$ plain form
11744 25203 -12698 -4993 756 -39611 -71543 -73098 -11433 -8264 23734 70967 55319 40571
11732 40571 9937 55924 84586 85272 37949 32411 13125 -5908 13733 29851 13238 -6014
11720 -6014 -693 -11485 -12063 -27593 -25594 -76482 -55009 32704 66609 64640 68652 21377 -35942
11707 -35942 -56527 -21744 31397 19049 -9404 19471 53646 39330 10689 -21164 -2817 -15488
11695 -15488 -35818 -40678 -23611 -1491 6870 13889 8292 21313 44615 57110 51860 -2469 3159
11682 3159 36229 32852 26642 -10720 -23158 13241 35079 38570 52030 33733 83019 90569 60844
11669 60844 14758 18187 -6135 -26245 -18093 -18644 8181 -17033 -23984 -15933 -5154 -49207 -66527
11656 -66527 -37896 -22537 -22654 -29067 -22851 -31044 -39240 -49717 -35084 -29554 -8469 -18952 -62294
$$ packed form
11744B5203l7901P705N749m0367l1932j555O1665L169L1998M7233j5648j4748
11732D0571l0634M5987K8662O86m7323n538j9286j9033J9641J6118j6613j9252
11720f014N321j0792n78j5530J999n0888K1473Q7713L3905j969M012m7275n7319
11707c5942k0585L4783N3141j2348k8453K8875L4175j4316k8641l1853J8347j2671
11695a5488k0330m860J7067K2120Q361P019n597J3021K3302J2495n250n4329N628
11682C159L3070l377o210l7362j2438L6399K1838L491J3460j8297M9286P550k9725
11669F0844m6086L429k4322k0110Q152n51K6825k5214o951Q051J0779m4053j7320
11656f6527K8631J5359j17o413O216q193q196j0477J4633N530K1085j0483m3342
$$ plain form
11643 -62294 -28447 12944 18769 26277 29933 42316 25465 24191 41304 -17624 -31563 7983
11631 7983 15990 13259 8003 60502 48730 5551 -19539 -20717 -21486 -38534 -9291 9221 28725
11618 28725 22417 35050 79745 61984 95081 54950 3703 25084 40334 6832 -19884 -24139
11606 -24139 -5000 6356 1718 -27533 -6626 45793 61140 77189 71747 50055 42335 50942
11594 50942 40824 14176 -33472 -51336 -19449 244 -24735 -19591 -28433 -3113 -3852 -55783
11582 -55783 -61390 -59906 -27562 1169 -12017 -48798 -45935 10352 49210 32732 5883 -37672
11570 -37672 -57196 -56447 -38235 -60539 -56174 -53419 -48584 2010 -849 20859 15548 30075 22623
11557 22623 33548 58111 82130 93995 69256 29863 37083 28428 42780 14737 -38724 -30864
$$ packed form
11643f2294L3847M1391N825P508L656J2383j6851j274J7113n8928j3939L9546
11631G983Q007k731n256N2499j1772m3179k5090j178p69j7048K9243J8512J9504
11618B8725o308J2633M4695j7761L3097m0131n1247K1381J5250l3502k6716m255
11606b4139J9139J1356m638k9251K0907N2419J5347J6049n442k1692p720Q607
11594E0942j0118k6648m7648j7864L1887J9693k4979N144q842K5320p39n1931
11582e5783n607J484L2344K8731j3186l6781K863N6287L8858j6478k6849m3555
11570c7672j9524P49J8212k2304M365K755M835N0594k859K1708n311J4527p452
11557B2623J0925K4563K4019J1865k4739l9393P220q655J4352k8043n3461P860
$$ plain form
11545 -30864 3866 6678 15672 40729 3197 -8781 6666 26553 23638 28024 -2398 -21509
11533 -21509 -19478 5784 9821 -2019 -13045 -296 -6089 17561 -6123 -39632 -34403 -8131
11521 -8131 30763 34755 -1214 -2627 48313 42421 44773 50255 50457 27152 22848 11714 -21640
11508 -21640 -13456 16841 26928 17189 53201 79219 43619 10256 28453 -3692 -36455 -53828
11496 -53828 -32835 -9975 -11418 1741 18352 8006 -27169 -9017 -8709 -47609 -8362 14768
11484 14768 6697 -44961 -19528 23832 10345 -32402 -7154 48620 77877 47353 31373 13539
11472 13539 -1245 -13172 24873 20019 -23471 -49986 -42145 -45085 -18627 -16294 -11757 -38976 -13454
11459 -13454 6258 37887 60067 20151 10272 29402 18292 6928 -18601 -28158 -43420 -22081
$$ packed form
11545c0864L4730K812Q994K5057l7532j1978J5447J9887k915M386l0422j9111
11533b1509K031K5262M037j1840j1026J2749n793K3650k3684l3509N229K6272
11521h131L8894L992l5969j413N0940n892K352N482K02k3305m304j1134l3354
11508b1640Q184L0297J0087r739L6012K6018l5600l3363J8197l2145l2763j7373
11496e3828K0993K2860j443J3159J6611j0346l5175J8152L08l8900L9247K3130
11484A4768q071n1658K5433M3360j3487m2747K5248N5774K9257l0524j5980j7834
11472A3539j4784j1927L8045m854m3490k6515P841k940K6458K333M537k7219K5522
11459a3454J9712L1629K2180l9916r879J9130j1110j1364k5529r557j5262K1339
$$ plain form
11447 -22081 5074 3285 39689 64429 42296 33304 32789 38682 4235 15174 8322 22727 28857
11434 28857 15770 -14310 -27704 -33022 -2416 14209 -758 -44817 -21297 12905 21052 24215
11422 24215 17382 4984 -23399 -53420 -62549 -28592 12311 9221 -48405 -52204 -19820 -14018 -6785
11409 -6785 17551 28295 53184 41682 40739 78536 80686 71714 51735 27138 7261 -4985 -21082
11396 -21082 -9263 39846 75068 59853 33686 39935 12833 4323 23615 44595 33323 -13572
11384 -13572 9800 18510 39717 46061 43263 27812 39547 64488 110122 92984 86937 81166 42111
11371 42111 13980 28997 68437 70531 90085 56550 43973 10967 3384 -20470 -47613 -82368
11359 -82368 -69743 -15980 5712 -1745 9448 30981 28263 31309 15797 1625 -17238 -7433
$$ packed form
11447b2081K7155j789L6404K4740k2133q992n15N893l4447J0939o852J4405O130
11434B8857j3087l0080j3394n318L0606J6625j4967m4059K3520L4202Q147L163
11422B4215o833j2398k8383l0021r129L3957M0903l090n7626l799L2384N802P233
11409f785K4336J0744K4889j1502r43L7797K150q972j9979k4597j9877j2246j6097
11396b1082J1819M9109L5222j5215k6167O249k7102q510J9292K0980j1272m6895
11384a3572K3372Q710K1207O344k798j5451J1735K4941M5634j7138o047n771l9055
11371D2111k8131J5017L9440K094J9554l3535j2577l3006p583k3854k7143l4755
11359h2368J2625N3763K1692p457J1193K1533k718L046j5512j4172j8863R805
$$ plain form
11347 -7433 13660 2143 -37341 -57275 -19779 35309 31432 4085 -5182 -3498 -3411 -26346 976
11334 976 33774 30069 569 -44826 -31121 -30478 15369 57968 66384 48495 45114 32275 9790
11321 9790 20452 15471 -28517 -48716 -19455 -10740 -12683 -29350 3782 619 -32977 -66581 -56901
11308 -56901 48035 78933 24028 -9697 20323 19684 24595 15758 19294 31914 34496 -16759 -62061
11295 -62061 -33695 12265 40053 4654 -12985 28037 33199 43525 48116 51980 41754 26871
11283 26871 52446 45892 30758 27023 7284 -8042 -15885 -49899 -77527 -87216 -68639 -22874
11271 -22874 12928 55400 47669 3524 19278 52722 60216 41315 32477 33812 62378 86027
11259 86027 89561 49768 8527 -8290 -34086 -24866 24925 41773 24096 6188 18746 14432
$$ packed form
11347g433K1093j1517l9484j9934L7496N5088l877k7347r267J684Q7k2935K7322
11334I76L2798l705k9500m5395J3705O43M5847M2599Q416j7889l381j2839k2485
11321I790J0662m981m3988k0199K9261Q715j943j6667L3132l163l3596l3604R680
11308e6901J04936L0898n4905l3725L0020o39M911q837L536J2620K582n1255m5302
11295f2061K8366M5960K7788l5399j7639M1022N162J0326M591L864j0226j4883
11283B6871K5575o554j5134l735j9739j5326p843l4014k7628r689J8577M5765
11271b2874L5802M2472p731m4145J5754L3444P494j8901q838J335K8566K3649
11259H6027L534l9793m1241j6817k5796R220M9791J6848j7677j7908J2558m314
$$ plain form
11247 14432 -44370 -61764 -43556 -22410 -39203 -58270 -49928 -52472 -55011 -13974 25277 63743
11235 63743 60720 41580 50774 31431 -7814 5037 2644 -5999 11875 2629 9446 14893 48459
11222 48459 75495 83112 110576 101440 62853 36816 20034 14802 14835 20578 59892 35233 19487
11209 19487 53782 60584 16800 -20155 -23521 -26902 -27796 9575 63130 64061 70465 65560 88132
11196 88132 107676 121368 92058 20537 46605 26597 -5526 -18761 8927 14217 28599 49356
11184 49356 62314 39956 10412 32724 55840 50090 40500 -22657 -5186 11811 21356 34851
11172 34851 17846 24215 36432 29213 62069 65600 64501 66514 50989 59505 72785 90686 72631
11159 72631 46118 44076 30376 35432 30426 64491 62638 60781 46279 34414 46004 78474 120298
$$ packed form
11247A4432n8802j7394J8208K1146j6793j9067Q342k544k539M1037L9251L8466
11235F3743l023j9140R194j9343l9245J2851k393q643J7874r246O817N447L3566
11222D8459K7036P617K7464r136l8587k6037j6782n232L3N743L9314k4659j5746
11209A9487L4295O802m3784l6955l366l381q94L7371N3555R31O404m905K2572
11196H8132J9544J3692k9310p1521K6068k0008l2123j3235K7688N290J4382K0757
11184D9356J2958k2358k9544K2312K3116n750r590o3157J7471J6997R545J3495
11172C4851j7005O369J2217p219L2856L531j099K013j5525Q516J3280J7901j8055
11159G2631k6513k042j3700N056n006L4065j853j857j4502j1865J1590L2470M1824
$$ plain form
11146 120298 156467 136392 135564 123925 97388 49155 31456 12038 -283 29159 -4877 -25482
11134 -25482 -2909 13655 41205 20216 -51197 -42534 -5611 21023 -7363 -15432 13091 7905
11122 7905 29803 36609 33468 -1625 -9352 -11674 18400 65663 78933 84402 90086 73989 64507
11109 64507 100738 78098 34005 -18261 -7711 42479 55736 102268 112616 68006 54299 55306
11097 55306 59989 66650 78991 112873 122732 125629 107677 82884 96532 104790 119530 103867 53312
11084 53312 52405 53636 41717 23163 31660 15712 5153 3697 -8097 -14041 12385 24634 23206
11071 23206 10823 -11442 16247 57951 67182 80731 91951 89665 58325 55507 57816 83047
11059 83047 65616 26568 -3197 -695 40011 32670 16097 50141 67299 80973 81236 62823
$$ packed form
11146A20298L6169k0075q28j1639k6537m8233j7699j9418j2321K9442l4036k0605
11134b5482K2573J6564K7550k0989p1413Q663L6923K6634k8386q069K8523n186
11122G905K1898O806l141l5093p727k322L0074M7263J3270N469N684j6097r482
11109F4507L6231k2640m4093n2266J0550N0190J3257M6532J0348m4610j3707J007
11097E5306M683O661J2341L3882R859K897j7952k4793J3648Q258J4740j5663n0555
11084E3312r07J231j1919j8554Q497j5948j0559j456j1794n944K6426J2249j428
11071B3206j2383k2265K7689M1704R231J3549J1220k286l1340k818K309K5231
11059H3047j7431l9048k9765K502M0706p341j6573L4044J7158J3674K63j8413
$$ plain form
11047 62823 85108 90144 94239 102098 120546 147638 125697 101139 57485 72754 98397 91774
11035 91774 26830 15564 24892 26390 52925 46435 40048 8492 2398 -6265 -25159 -31720 -27829
11022 -27829 -5950 1516 40544 29076 45221 42851 52842 75412 56403 57314 89922 111973 98073
11009 98073 94247 61206 39977 12853 15921 -3761 -10577 2186 41715 29381 -21705 8012
10997 8012 83242 107789 73910 78780 115302 127020 115659 122331 124523 93119 30138 -7672
10985 -7672 32841 82332 37499 22308 6329 39008 45584 44070 88336 102633 70160 94711
10973 94711 116203 169762 167523 126789 98213 109003 116011 118128 109124 70362 37569 24339
10961 24339 -4497 38179 52052 51432 52159 51592 57637 36808 40889 69537 29225 13564 38649
$$ packed form
11047F2823K2285N036M095P859J8448K7092k1941k4558m3654J5269K5643o623
11035I1774o4944j1266R328J498K6535o490o387l1556o094q663j8894o561L891
11022b7829K1879P466L9028j1468J6145k370R991K2570j9009R11L2608K2051j3900
11009I8073l826l3041k1229k7124L068j9682o816J2763L9529j2334n1086K9717
10997H012P5230K4547l3879M870L6522J1718j1361O672K192l1404o2981l7810
10985g672M0513M9491m4833j5191j5979L2679O576j514M4266J4297l2473K4551
10973I4711K1492N3559k239m0734k8576J0790P008K117r004l8762l2793j3230
10961B4339k8836M2676J3873o20P27n67O045k0829M081K8648m0312j5661K5085
$$ plain form
10948 38649 61716 64743 77223 75063 45510 49996 64292 103590 131718 158859 130337 97329
10936 97329 114465 94910 99867 67659 57018 66993 81592 100538 154849 203021 212183 181860
10924 181860 153520 163548 202472 255652 239855 244756 285192 343067 417849 472394 561526 733592
10912 733592 989959 1362639 1892392 2372078 2585270 2512481 2299251 1960867 1605023 1223681
10902 1223681 939853 727612 586365 463238 368861 304773 291544 272171 246327 251724 263301
10891 263301 294306 302662 291858 267874 284404 269517 266787 247353 236606 225474 194003 197245
10879 197245 220593 203331 201663 223240 220775 184241 113351 97707 103542 118752 136824 156446
10867 156446 154823 148061 119028 123730 168742 196157 155644 156191 154191 121967 117100 104401 88028
$$ packed form
10948C8649K3067L027J2480k160k9553M486J4296L9298K8128K7141k8522l3008
10936I7329J7136j9555M957l2208j0641R975J4599J8946N4311M8172R162l0323
10924A81860k8340J0028L8924N3180j5797M901M0436N7875P4782N4545Q9132J72066
10912G33592K56367L72680N29753M79686K13192p2789k13230l38384l55844l81342
10902A223681k83828k12241j41247j23127r4377o4088j3229j9373k5844N397J1577
10891B63301L1005Q356j0804k3984J6530j4887k730j9434j0747j1132l1471L242
10879A97245K3348j7262j668K1577k465l6534p0890j5644N835J5210J8072J9622
10867A56446j623o762k9033M702M5012K7415m0513N47k000l2224m867j2699j6373
$$ plain form
10854 88028 90233 145481 122280 110254 113326 92903 73106 65161 74807 76403 86363 52202 51412
10841 51412 63468 95060 150985 141058 93057 68157 40324 4531 3187 48796 85186 69874
10829 69874 55875 26413 -5029 15334 65483 62159 68062 72860 95663 107092 79144 60934
10817 60934 59917 42548 47141 58491 103854 132194 166411 185030 172269 125361 111246 75694
10805 75694 75780 96086 110166 140333 128618 132373 100369 86849 101110 105222 114944 117200 125819
10792 125819 131924 113322 110473 77672 111617 116799 91870 82517 96121 122753 128861 174433
10780 174433 212983 220519 172406 126010 120373 120573 204830 227375 236211 217433 191475 211837
10768 211837 249173 259628 298785 327042 400271 491699 571230 602652 566263 566635 573986 570659
$$ packed form
10854H8028K205N5248k3201j2026L072k0423j9797p945R646J596R960l4161p90
10841E1412J2056L1592N5925r927m8001k4900k7833l5793j344M5609L6390j5312
10829F9874j3999k9462l1442K0363N0149l324N903M798K2803J1429k7948j8210
10817F0934j017j7369M593J1350M5363K8340L4217J8619j2761m6908j4115l5552
10805G5694Q6K0306J4080L0167j1715L755l2004j3520J4261M112R722K256Q619
10792A25819O105j8602k849l2801L3945N182k4929r353J3604K6632O108M5572
10780A74433L8550P536m8113m6396n637K00Q4257K2545Q836j8778k5958K0362
10768B11837L7336J0455L9157K8257P3229R1428P9531L1422l6389L72P351l327
$$ plain form
10756 570659 582922 570349 506547 402730 349321 324625 264842 237981 224836 217885 223184 226480
10744 226480 220992 189123 189386 201284 179951 178198 218422 222740 215432 186990 168740 153599 179468
10731 179468 176900 168301 172420 159188 80373 65330 97048 135065 140414 114397 96625 103941
10719 103941 117226 128399 124076 97639 104544 105066 126776 110149 126423 107572 111300 129485
10707 129485 139031 179014 172866 125948 120458 118490 137575 146260 146850 96325 58851 25196 -17105
10694 -17105 -10904 14064 47531 79481 90787 168229 239036 268146 251960 225352 260194 289428
10682 289428 326578 310163 286135 294762 315577 314305 299955 273094 287223 312114 316105 319363
10670 319363 269324 245287 233902 301272 302330 237267 214007 222488 256410 246101 209882 226189
$$ packed form
10756E70659J2263j2573o3802j03817n3409k4696n9783k6861j3145o951N299L296
10744B26480n488l1869K63J1898k1333j753M0224M318p308k8442j8250j5141K5869
10731A79468k568q599M119j3232p8815j5043L1718L8017N349k6017j7772P316
10719A03941J3285J1173m323k6437O905N22K1710j6627J6274j8851L728J8185
10707A29485R546L9983o148m6918n490j968J9085Q685N90n0525l7474l3655m2301
10694a7105O201K4968L3467L1950J1306P7442P0807K9110j6186k6608L4842K9234
10682B89428L7150j6415k4028Q627K0815j272j4350k6861J4129K4891L991L258
10670C19363n0039k4037j1385O7370J058o5063k3260Q481L3922j0309l6219J6307
$$ plain form
10658 226189 266837 286944 318142 305621 275892 252575 245688 300613 341628 340303 334802 329077
10646 329077 341519 385877 365098 353197 344030 406160 473150 513795 589136 650245 728324 798758
10634 798758 856148 881556 781013 694829 611512 519719 425509 359221 327042 312098 329027
10623 329027 343789 362487 341303 336598 323434 308284 316489 294301 305059 339200 353924 356651
10611 356651 386189 398006 366995 396729 395578 411013 434441 462031 506709 535986 539066 539206
10599 539206 558611 594322 612874 683951 727941 742993 757117 742444 756693 797433 802124 793221
10587 793221 839237 876334 883726 935396 1027800 1044513 1075400 1119627 1148381 1183668 1177536 1194287
10575 1194287 1196797 1197596 1213468 1228010 1276258 1322150 1378291 1447796 1507726 1581892 1659081 1683047
$$ packed form
10658B26189M0648K0107L1198j2521k9729k3317o887N4925M1015j325n501n725
10646C29077J2442M4358k0779j1901r167O2130O6990M0645P5341O1109P8079P0434
10634G98758N7390K5408j00543q6184q3317r1793r4210o6288l2179j4944J6929
10623C29027J4762J8698k1184m705j3164j5150Q205k2188J0758L4141J4724K727
10611C56651K9538J1817l1011K9734j151J5435K3428K7590M4678K9277L080J40
10599E39206J9405L5711J8552P1077M3990J5052J4124j4673J4249M0740M691q903
10587G93221M6016L7097P392N1670R2404J6713L0887M4227K8754L5287o132J6751
10575A194287K510P99J5872J4542M8248M5892N6141O9505N9930P4166P7189K3966
$$ plain form
10563 1683047 1782540 1833868 1784324 1781886 1787133 1819509 1823199 1857371 1868425 1878068 1937886 2051464
10551 2051464 2105881 2165688 2267878 2361633 2446684 2550007 2667843 2856831 3004970 3127348
10541 3127348 3245862 3437935 3687709 3964441 4246760 4558657 4886991 5241114 5630295
10532 5630295 6156400 6751980 7611568 8714998 9830447 10764643 11595673 12574963 13766066
10523 13766066 15123001 16490191 17918571 19694420 22088668 25302671 29734830 35975673
10515 35975673 44573954 55908774 70290604 88830955 114519307 152448908 210286073
10508 210286073 294865958 394792734 460147404 462665146 429714196 380245255 315190321
10501 315190321 244400706 184347821 141209229 111590673 90901855 75974918 64881776
$$ packed form
10563A683047R9493N1328m9544k438N247L2376L690L4172J1054R643N9818J13578
10551B051464N4417N9807J02190R3755Q5051J03323J17836J88988J48139J22378
10541C127348J18514J92073K49774K76732K82319L11897L28334L54123L89181
10532E630295N26105N95580Q59588J103430J115449R34196Q31030R79290J191103
10523A3766066J356935J367190J428380J775849K394248L214003M432159O240843
10515C5975673Q598281J1334820J4381830J8540351K5688352L7929601N7837165
10508B10286073Q4579885R9926776O5354670K517742l2950950m9468941o5054934
10501C15190321p0789615o0052885m3138592k9618556k0688818j4926937j1093142
$$ plain form
10494 64881776 56567282 50351033 45660262 42047920 39114794 36521266 34079350 31918269
10486 31918269 30146076 28765703 27670002 26551261 25400111 24272927 23167385 22112702
10478 22112702 21231247 20494918 19878495 19461219 19202672 19098786 19149710 19302621 19451515
10469 19451515 19580047 19476400 19081546 18401979 17584062 16715496 15818691 14910398 14105681
10460 14105681 13370657 12689094 12039151 11483068 10934083 10379860 9766035 9233283 8724554
10451 8724554 8226104 7744770 7253248 6912918 6653415 6382353 6081687 5805588 5525201
10442 5525201 5264391 5040394 4811893 4604420 4363630 4148876 3990021 3818376 3632378
10433 3632378 3478445 3344377 3209071 3103761 2990735 2878414 2756038 2643847 2550584 2414807
$$ packed form
10494F4881776q314494o216249m690771l612342k933126k593528k441916k161081
10486C1918269j772193j380373j095701j118741j151150j127184j105542j054683
10478B2112702q81455p36329o16423m17276k58547j03886N0924J52911J48894
10469A9451515J28532j03647l94854o79567q17917q68566q96805r08293q04717
10460A4105681p35024o81563o49943n56083n48985n54223o13825n32752n08729
10451H724554m98450m81334m91522l40330k59503k71062l00666k76099k80387
10442E525201k60810k23997k28501k07473k40790k14754j58855j71645j85998
10433C632378j53933j34068j35306j05310j13026j12321j22376j12191r3263j35777
$$ plain form
10423 2414807 2289237 2179890 2040622 1925281 1842643 1770586 1690614 1616982 1541481 1455828
10413 1455828 1407834 1388847 1325541 1270087 1221684 1158825 1109608 1127528 1123083 1091387 1080158
10402 1080158 1055916 1019252 947680 925398 876760 872665 865607 871007 807733 781418 802089 838861
10390 838861 865239 947137 1025149 1103408 1190343 1266346 1352313 1346694 1157966 896902 698220
10379 698220 548314 477379 470366 474754 433958 412333 367797 395945 363673 317278 239675 176174
10367 176174 151278 97141 63691 75637 77961 45844 90910 101492 127948 78227 88152 81762
10355 81762 42652 18173 -5869 30790 58520 77590 76545 74593 109643 170665 138187 128303
10343 128303 107228 74529 52760 59554 126602 153844 201983 230415 242470 262707 330619 367810
$$ packed form
10423B414807j25570j09347j39268j15341q2638p2057p9972p3632p5501q5653
10413A455828m7994j8987o3306n5454m8403o2859m9217J7920m445l1696j1229
10402A080158k4242l6664p1572k2282m8638m095p058N400o3274k6315K0671L6772
10390H38861K6378Q1898P8012P8259Q6935P6003Q5967n619j88728k61064j98682
10379F98220j49906p0935p013M388m0796k1625m4536K8148l2272m6395p7603o3501
10367A76174k4896n4137l3450J1946K324l2117M5066J0582K6456m9721R925o390
10355H1762l9110k4479k4042L6659K7730J9070j045j952L5050O1022l2478r884
10343A28303k1075l2699k1769O794O7048K7242M8139K8432J2055K0237O7912L7191
$$ plain form
10331 367810 365901 344812 313616 311072 301298 288179 283451 289351 302017 313500 318638 351697 423651
10318 423651 455539 456990 426319 412279 419251 424214 424799 434485 404466 380730 361099 352055 357673
10305 357673 305208 282707 304971 354659 344879 340661 305212 284685 255520 268516 278205 258744
10293 258744 286622 310064 260901 284102 315156 317546 302297 303778 285282 256621 267934 259321
10281 259321 228312 248300 253375 222742 217318 221810 266447 286131 278332 243261 225108 194946
10269 194946 174732 156464 115223 79564 73820 99764 102367 148561 182305 154497 146494 174882
10257 174882 191416 192850 209864 197164 176180 159356 106750 72331 81025 64050 62882 110178
10245 110178 145971 160154 158509 141201 137073 99985 56848 55126 54528 53649 126 14426 48575
$$ packed form
10331C67810j909k1089l1196k544r774j3119m728N900J2666J1483N138L3059P1954
10318D23651L1888J451l0671j4040O972M963N85R686l0019k3736j9631r044N618
10305C57673n2465k2501K2264M9688r780m218l5449k0527k9165J2996R689j9461
10293B58744K7878K3442m9163K3201L1054K390j5249J481j8496k8661J1313q613
10281B59321l1009J9988N075l0633n424M492M4637J9684p799l5071j8153l0162
10269A94946k0214j8268m1241l5659n744K5944K603M6194L3744k7808q003K8388
10257A74882J6534J434J7014j2700k0984j6824n2606l4419Q694j6975j168M7296
10245A10178L5793J4183j645j7308m128l7088m3137j722n98q79n3523J4300L4149
$$ plain form
10232 48575 57799 59693 53547 41546 6878 -3099 64467 126939 127952 69033 32249 45336 53681
10219 53681 46904 36909 43516 63907 74230 52046 13496 -26891 -16422 11898 37019 74606
10207 74606 89053 96384 56668 53682 86596 99615 126602 66049 -11479 -1034 36652 102920
10195 102920 135399 110380 113138 127441 110211 77322 74060 86659 79980 76114 98844 112475
10183 112475 113190 141299 186931 206976 160784 144510 120692 113935 132813 129101 113668 81972
10171 81972 82307 92578 107807 49764 28213 27761 27205 43684 40433 53727 19761 13957 53281
10158 53281 66483 74406 101310 121469 105583 74283 100825 157564 135878 102703 42344 23832
10146 23832 18147 44513 35519 43659 37722 27784 30783 56959 38246 34551 41855 65516 77058
$$ packed form
10232D8575R224J894o146j2001l4668r977O7566O2472J013n8919l6784J3087Q345
10219E3681o777r995O607K0391J0323k2184l8550m0387J0469K8320K5121L7587
10207G4606J4447P331l9716k986L2914J3019K6987o0553p7528J0445L7686O6268
10195A02920L2479k5019K758J4303j7230l2889l262J2599o679l866K2730J3631
10183A12475P15K8109M5632K0045m6192j6274k3818o757J8878l712j5433l1696
10171H1972L35J0271J5229n8043k1551m52n56J6479l251J3294l3966n804L9324
10158E3281J3202P923K6904K0159j5886l1300K6542N6739k1686l3175o0359j8512
10146B3832n685K6366q994Q140n937r938K999K6176j8713l695P304K3661J1542
$$ plain form
10133 77058 89668 86308 67176 61149 42626 58666 69628 87655 103005 110647 66987 86720
10121 86720 72758 40619 43677 19366 44418 78103 111079 72293 78008 101027 125475 138520
10109 138520 195894 228883 282667 312462 404887 532958 676533 892851 1220217 1639702
10099 1639702 2122682 2479313 2505050 2308193 2024286 1670516 1337506 1000440 759156 605313
10089 605313 499535 442715 351009 312171 283956 232560 236168 224424 219994 207816 233598 221650
10077 221650 186083 138031 107178 92190 111389 129088 99179 63226 64187 99831 67781 64758
10065 64758 84669 130896 135778 94349 88626 126110 172072 196550 205832 202152 202387 150764 115847
10052 115847 115311 159076 189128 158529 132094 149269 140354 113633 75358 33822 -9005 -36604
$$ packed form
10133G7058J2610l360j9132o027j8523J6040J0962J8027J5350P642m3660J9733
10121H6720j3962l2139L058k4311K5052L3685L2976l8786N715K3019K4448J3045
10109A38520N7374L2989N3784K9795R2425J28071J43575K16318L27366M19485
10099A639702M82980L56631K5737j96857k83907l53770l33010l37066k41284j53843
10089F05313j05778n6820r1706l8838k8215n1396L608j1744m430j2178K5782j1948
10077B21650l5567m8052l0853j4988J9199J7699k9909l5953R61L5644l2050l023
10065F4758J9911M6227M882m1429n723L7484M5962K4478R282l680K35n1623l4917
10052A15847n36M3765L0052l0599k6435J7175q915k6721l8275m1536m2827k7599
$$ plain form
10040 -36604 -6385 22178 18473 7115 -15816 -1665 -1930 -8323 -17453 -6861 -23699 -5341 17615
10027 17615 20593 26780 68328 58252 21403 8767 -8190 6259 29678 46889 1735 5911
10015 5911 55400 46027 26641 -3236 -15895 -36098 -43377 -35136 -26994 -40545 -33003 -39175 -50245
10002 -50245 -30130 -18437 -25812 1678 30839 22538 24286 -3503 -35863 -29054 -6336 -16307 -17717
9989 -17717 20506 -5664 -51205 -12173 11276 14547 12044 7513 -30016 -51826 -76653 -55400
9977 -55400 6387 -2357 -48151 13806 11175 21966 18420 17091 -5722 -27697 3216 4437 -23996
9964 -23996 -32870 -16632 17368 37143 24283 32879 55816 50897 22782 3668 25 -46929 -62125
9951 -62125 -75616 -41638 -5712 -8192 -23949 -48666 -21463 -55329 -69360 -36909 1849 -18943
$$ packed form
10040c6604L0219K8563l705j1358k2931J4151k65o393r130J0592j6838J8358K2956
10027A7615K978O187M1548j0076l6849j2636j6957J4449K3419J7211m5154M176
10015E911M9489r373j9386k9877j2659k0203p279Q241Q142j3551P542o172j1070
10002e0245K0115J1693p375K7490K9161q301J748k7789l2360O809K2718r971j410
9989a7717L8223k6170m5541L9032K3449L271k503m531l7529k1810k4827K1253
9977e5400O1787q744m5794O1957k631J0791l546j329k2813k1975L0913J221k8433
9964b3996q874J6238L4000J9775j2860Q596K2937m919k8115j9114l643m6954j5196
9951f2125j3491L3978L5926k480j5757k4717K7203l3866j4031L2451L8758k0792
$$ plain form
9939 -18943 -21176 -15613 -37204 -12277 12058 -27918 -39584 -19265 49174 13821 -5 213 45669
9926 45669 32265 8772 -1180 -41933 -71944 -65023 -11684 39159 49993 67076 47138 -10257
9914 -10257 -32006 -41786 -56603 -53878 -50726 -49864 -23742 6571 -1050 4554 -5507 -19802 38237
9901 38237 87270 95007 43696 -3892 -67260 -18029 13863 -8362 -30619 -10537 -16222 25117
9889 25117 63751 96447 106377 54036 16758 48072 71699 72481 50155 -6970 -28010 -22076 -25014
9876 -25014 -42578 -39391 -22431 -14328 5276 36119 21639 48041 17524 8806 -6848 -76743
9864 -76743 -23984 7707 4432 35032 66210 19120 14 13507 51249 28042 -25390 -24584
9852 -24584 -17330 -11132 -14524 -26572 -55986 7915 36884 52954 59358 45373 69585 81322 97235
$$ packed form
9939a8943k233N563k1591K4927K4335l9976j1666K0319O8439l5353j3826K18M5456
9926D5669j3404k3493r952m0753l0011O921N3339N0843J0834J7083j9938n7395
9914a0257k1749r780j4817K725L152Q62K6122L0313p621N604j0061j4295N8039
9901C8237M9033P737n1311m7588o3368M9231L1892k2225k2257K0082n685M1339
9889B5117L8634L2696R930n2341l7278L1314K3627P82k2326n7125k1040N934k938
9876b5014j7564L187J6960Q103J9604L0843j4480K6402l0517q718j5654o9895
9864g6743N2759L1691l275L0600L1178m7090j9106J3493L7742k3207n3432Q06
9852b4584P254O198l392j2048k9414O3901K8969J6070O404j3985K4212J1737J5913
$$ plain form
9839 97235 73036 74502 57310 19021 -52713 -37706 -7773 31720 27576 4557 49513 24736
9827 24736 -9123 -31130 36458 67513 53344 32597 11122 -8572 -7722 41332 58268 40462
9815 40462 38695 33045 5428 -3022 -21192 -22852 3661 -1316 -9563 6980 -17920 -26014 -9352
9802 -9352 -4444 -44568 -22074 3096 21753 13187 -30460 -37846 -36053 -44751 -41559 -12128 37100
9789 37100 21561 25021 24077 7128 -7950 -3127 43843 47575 18123 -9786 8971 5496 11202
9776 11202 30594 17866 4378 -9127 4167 6474 35348 27009 27884 55698 25336 6601 11305
9763 11305 26639 28265 31498 32808 47892 -40512 -61683 -57699 -13228 8720 -9000 -32686 6299
9750 6299 43933 50943 72443 88510 62016 35899 4448 -5480 32527 61846 57648 72700 69702
$$ packed form
9839I7235k4199J466j7192l8289p1734J5007K9933L9493m144k3019M4956k4777
9827B4736l3859k2007O7588L1055j4169k0747k1475j9694Q50M9054J6936j7806
9815D0462j767n650k7617q450j8170j660K6513m977q247J6543k4900q094J6662
9802i352M908m0124K2494K5170J8657q566m3647p386J793q698L192K9431M9228
9789C7100j5539L460r44j6949j5078M823M6970L732k9452k7909J8757l475N706
9776A1202J9392j2728j3488j3505J3294K307K8874q339Q75K7814l0362j8735M704
9763A1305J5334J626L233J310J5084q8404k1171L984M4471K1948j7720k3686L8985
9750F299L7634P010K1500J6067k6494k6117l1451r928L8007K9319m198J5052k998
$$ plain form
9737 69702 59188 28695 18436 -20754 9359 16140 -1823 15577 25888 45867 5254 -21912
9725 -21912 -68606 -36462 16188 80402 94218 89348 63028 43546 20088 21673 19091 -4777
9713 -4777 -13018 13907 -382 -41197 -19182 21161 38707 25580 16247 -10083 -5262 34268 -18155
9700 -18155 -7101 37498 19756 20103 37988 54955 49870 65212 75742 43082 9116 60528
9688 60528 94611 81684 31540 25480 76356 124223 145051 103300 86043 83253 68660 24128
9676 24128 33045 32442 18719 11602 20072 28842 94292 117348 84805 53428 22519 14073 33369
9663 33369 72630 54642 45312 60421 82512 91372 123325 141914 152644 117032 116782 102649 102980
9650 102980 85216 123551 136894 110885 90884 70711 82651 107771 142638 153419 137948 133370
$$ packed form
9737F9702j0514l0493j0259l9190L0113O781j7963J7400J0311J9979m0613k7166
9725b1912m6694L2144N2650O4214J3816m870k6320j9482k3458J585k582k3868
9713d777q241K6925j4289m0815K2015M0343J7546j3127r333k6330M821L9530n2423
9700a8155J1054M4599j7742L47J7885J6967n085J5342J0530l2660l3966N1412
9688F0528L4083j2927n0144o060N0876M7867K0828m1751j7257k790j4593m4532
9676B4128Q917o03j3723p117Q470Q770O5450K3056l2543l1377l0909q446J9296
9663C3369L9261j7988r330J5109K2091Q860L1953J8589J0730l5612k50j4133L31
9650A02980j7764L8335J3343k6009k0001k0173J1940K5120L4867J0781j5471m578
$$ plain form
9638 133370 144545 157664 192016 205287 190839 132859 129214 130760 112606 98175 131337 160503
9626 160503 187534 224836 264076 280287 289585 275420 227610 283433 355608 349287 337871 360441
9614 360441 364939 351620 332800 348050 376238 370863 403831 393372 395468 425445 470079 526100
9602 526100 529913 528785 551432 587304 639041 629914 655556 757304 775352 760614 813603 849334
9590 849334 892396 969091 1046442 1115181 1192952 1260189 1319450 1398902 1530256 1701438 1831076
9579 1831076 1988650 2127709 2244209 2412377 2631605 2843195 3066822 3275122 3531887 3787472
9569 3787472 4082157 4317992 4491650 4669337 4804641 4904514 4996788 5008252 4958686 4908632
9559 4908632 4824374 4699345 4501803 4311780 4104375 3895591 3708215 3451913 3220548 3023011
$$ packed form
9638A33370J1175J3119L4352J3271j4448n7980l645J546j8154j4431L3162K9166
9626A60503K7031L7302L9240J6211R298j4165m7810N5823P2175o321j1416K2570
9614C60441M498j3319j8820J5250K8188n375L2968j0459K096K9977M4634N6021
9602E26100L813j128K2647L5872N1737r127K5642J01748J8048j4738N2989L5731
9590H49334M3062P6695P7351O8739P7771O7237N9261P9452J31354J71182J29638
9579A831076J57574J39059J16500J68168K19228K11590K23627K08300K56765K55585
9569C787472K94685K35835J73658J77687J35304R9873R2274J1464m9566n0054
9559D908632q4258j25029j97542j90023k07405k08784j87376k56302k31365j97537
$$ plain form
9549 3023011 2836235 2663039 2542441 2414351 2297716 2155094 1979370 1876766 1798643 1716522
9539 1716522 1626379 1523425 1436200 1361073 1324335 1283982 1233909 1188184 1141444 1122665 1095868
9528 1095868 1058465 1025345 982067 980302 950315 889400 895464 898201 837166 768105 711100 657843
9516 657843 629164 631259 633778 623165 620109 618941 570436 524196 522596 539755 535474 522552 506034
9503 506034 487349 478606 399537 396806 378630 361124 375154 403217 376395 346214 342335 323884
9491 323884 256765 227696 228700 205432 188560 200958 227325 231736 200205 186864 189557 179728
9479 179728 166155 199424 191339 149321 147537 174498 148884 152858 164175 157945 161905 164060 157660
9466 157660 134905 121952 99750 85153 71358 94624 121519 135932 135356 102075 81291 56765
$$ packed form
9549C023011j86776j73196j20598j28090j16635j42622j75724j02604p8123q2121
9539A716522r0143j02954q7225p5127l6738m0353n0073m5725m6740j8779k6797
9528A095868l7403l3120m3278j765k9987o0915O064K737o1035o9061n7005n3257
9516F57843k8679K095K519j0613l056j168m8505m6240j600J7159m281j2922j6518
9503E06034j8685q743p9069k731j8176j7506J4030K8063k6822l0181l879j8451
9491C23884o7119k9069J004k3268j6872J2398K6367M411l1531j3341K693r829
9479A79728j3573L3269q085m2018j784K6961k5614L974J1317o230L960K155o400
9466A57660k2755j2953k2202j4597j3795K3266K6895J4413n76l3281k0784k4526
$$ plain form
9454 56765 62260 69619 107510 113314 80239 55960 49600 63147 68780 62916 11068 -6371 -15454
9441 -15454 3883 33679 84828 118428 79550 47039 14322 7587 44823 85564 117400 119779
9429 119779 135395 113743 108777 92154 72788 60298 84278 65819 77379 80878 66978 85632
9417 85632 65230 64916 68238 38040 8895 -2634 30057 35474 18515 -14636 -20267 6716 -200
9404 -200 27077 31828 28504 41309 99204 79201 73490 104409 123864 98920 60234 34822 14900
9391 14900 -1798 4413 6254 -7639 -3604 -32457 2724 32593 -15184 -44554 3934 61926
9379 61926 74322 55195 45304 32642 296 2492 29385 49773 47351 11032 17094 -9457 -28445
9366 -28445 -18425 12805 44650 39469 10796 -17038 -36571 -12885 24427 29253 17919 11447
$$ packed form
9454E6765N495P359L7891N804l3075k4279o360J3547N633n864n1848j7439r083
9441a5454J9337K9796N1149L3600l8878l2511l2717o735L7236M0741L1836K379
9429A19779J5616k1652m966j6623j9366j2490K3980j8459J1560L499j3900J8654
9417H5632k0402l14L322l0198k9145j1529L2691N417j6959l3151n631K6983o916
9404b00K7277M751l324J2805N7895k0003n711L0919J9455k4944l8686k5412j9922
9391A4900j6698O211J841j3893M035k8853L5181K9869m7777k9370M8488N7992
9379F1926J2396j9127r891j2662l2346K196K6893K0388k422l6319O062k6551j8988
9366b8445J0020L1230L1845n181k8673k7834j9533K3686L7312M826j1334o472
$$ plain form
9354 11447 -17332 -40912 -45366 -11603 6626 21430 20754 -203 -8486 7496 12783 -24402 -55745
9341 -55745 -90767 -97582 -70537 -56703 -49776 -20102 -2298 -64641 -80204 -70062 -34050 1833
9329 1833 -11506 -47780 -55164 -38727 -6057 -15467 -34535 -6089 42999 80688 40002 32196 45995
9316 45995 56762 26334 26820 34346 10221 12345 67477 42933 37117 42245 20413 61826 73004
9303 73004 63465 28756 35471 33493 38045 40327 34799 4950 -12935 22350 44512 39516 48893
9290 48893 38464 30297 34809 36895 90749 119265 63278 32573 23943 -4959 3317 28914 103712
9277 103712 92043 18206 14916 50678 63473 8361 -19861 18462 53203 35090 25593 31632
9265 31632 43388 70851 92115 86416 92008 65461 17553 14635 2451 51940 79306 69576 47018
$$ packed form
9354A1447k8779k3580m454L3763J8229J4804o76k0957q283J5982N287l7185l1343
9341e5745l5022o815K7045J3834O927K9674J7804o2343j5563J0142L6012L5883
9329A833j3339l6274p384J6437L2670r410j9068K8446M9088L7689m0686p806J3799
9316D5995J0767l0428M86P526k4125K124N5132k4544n816N128k1832M1413J1178
9303G3004r539l4709O715j978M552K282n528k9849j7885L5285K2162m996R377
9290D8893j0429q167M512K086N3854K8516n5987l0705q630k8902Q276K5597P4798
9277A03712j1669p3837l290L5762J2795n5112k8222L8323L4741j8113r497O039
9265C1632J1756K7463K1264n699N592k6547m7908k918j2184M9489K7366r730k2558
$$ plain form
9252 47018 20208 20873 19286 20619 26339 -21183 -63831 -92182 -59584 2857 1216 -11843 -8422
9239 -8422 -5181 27321 14173 36733 9819 -30353 -24496 -15049 -33240 -23550 -23537 -22744 7317 -28404
9225 -28404 -34522 -17415 -30817 -41493 -20684 3610 12154 6182 35412 -7067 -52151 -82757
9213 -82757 -113404 -91910 -61896 -35395 -21319 -10224 -3248 2757 31802 10778 -60640 -44635
9201 -44635 396 -25902 -6331 6107 54725 43124 21469 -40409 -55864 -76664 -76345 -38714
9189 -38714 -37492 -64670 -46104 -7702 4698 25678 63749 20959 13170 -7933 -6025 -20881
9177 -20881 -17894 8443 -22142 -75227 -71985 -18790 13410 -35737 -65036 -31403 12687 29378
9165 29378 59854 42526 10562 -23040 -19979 -18923 -49083 -39527 -37525 -39299 -55190 -28787 -9764
$$ packed form
9252D7018k6810O65j587J333N720m7522m2648k8351L2598O2441j641j3059L421
9239h422L241L2502j3148K2560k6914m0172N857R447j8191R690J3P93L0061l5721
9225b8404o118J7107j3402j0676K0809K4294Q544n972K9230m2479m5084l0606
9213h2757l0647K1494L0014K6501J4076J1095O976O005K9045k1024p1418J6005
9201d4635M5031k6298J9571J2438M8618j1601k1655o1878j5455k0800L19L7631
9189c8714J222k7178J8566L8402J2400K0980L8071m2790p789k1103J908j4856
9177b0881K987K6337l0585n3085L242N3195L2200m9147k9299L3633M4090J6691
9165B9378L0476j7328l1964l3602L061J056l0160R556K002j774j5891K6403J9023
$$ plain form
9152 -9764 1511 -26453 -45823 -37667 -70428 -93638 -93415 -85430 -72343 -8245 49443 58192 33967
9139 33967 -38936 -63538 -62907 -54592 -61470 -62518 -60391 -27338 -47491 -24154 33869 74594 38481
9126 38481 23019 6567 -13173 -8444 10887 17944 -19823 -11996 -29928 -58399 -30820 -14390
9114 -14390 12034 10589 52538 103173 94530 75076 59217 66595 60150 49644 4881 40562 46628
9101 46628 8342 -17285 -48133 10451 56785 25153 5138 31234 47666 48339 15682 20214
9089 20214 68885 119321 128228 125181 70978 39396 51315 36661 30055 13134 -15756 -11502 -27220
9076 -27220 -19360 11084 45535 20493 34776 74411 70830 62866 77534 51886 -19749 -25391 -8410
9063 -8410 -22579 -14457 11406 49995 15827 -7091 -34453 -33364 -43769 -40465 -61236 -80833 -55918
$$ packed form
9152i764J1275k7964j9370Q156l2761k3210K23P985J3087O4098N7688Q749k4225
9139C3967p2903k4602O31Q315o878j048K127L3053k0153K3337N8023M0725l6113
9126C8481j5462j6452j9740M729J9331P057l7767P827j7932k8471K7579J6430
9114a4390K6424j445M1949N0635q643j9454j5859P378o445j0506m4763L5681O066
9101D6628l8286k5627l0848N8584M6334l1632k0015K6096J6432O73l2657M532
9089B0214M8671N0436Q907l047n4203l1582J1919j4654o606j6921k8890M254j5718
9076b7220P860L0444L4451k5042J4283L9635l581p964J4668k5648p1635n642J6981
9063h410j4169Q122K5863L8589l4168k2918k7362J089j0405L304k0771j9597K4915
$$ plain form
9050 -55918 -68866 -88258 -48512 -39724 -34651 -1944 21428 7450 1724 25641 45463 11243
9038 11243 24938 32576 45257 15245 14282 -9312 -59478 -70056 -35727 -22842 -19058 -31338 -31993
9025 -31993 -24614 -50613 -26170 -2771 -21419 -12955 -14267 -10436 -16617 -48981 -52712 -9642 18744
9012 18744 17679 39959 27927 2992 -22719 -35490 -33246 -24238 -17037 -29532 -51196 -25166 8086
8999 8086 25763 35822 24229 33940 22259 12193 6058 -4896 45177 52961 47501 55705 36062
8986 36062 6335 3369 12261 49642 37691 35199 51141 46479 28458 7476 32893 64693 77440
8973 77440 33473 -29611 -48564 -28563 -20119 21185 14644 197 6120 19532 26202 21986 37009
8960 37009 50099 52911 85194 48939 11883 8143 25227 41660 30007 14253 16050 25230 23427
$$ packed form
9050e5918j2948j9392L9746Q788N073L2707K3372j3978n726K3917J9822l4220
9038A1243J3695P638J2681l0012r63k3594n0166j0578L4329J2885L784j2280o55
9025c1993P379k5999K4443K3399j8648Q464j312L831o181l2364l731M3070K8386
9012A8744j065K2280j2032k4935k5711j2771K244R008P201j2495k1664K6030L3252
8999H086J7677J0059j1593R711j1681j0066o135j0954N0073P784n460Q204j9643
8986C6062k9727k966Q892L7381j1951k492J5942m662j8021k0982K5417L1800J2747
8973G7440m3967o3084j8953K0001Q444M1304o541j4447N923J3412O670m216J5023
8960C7009J3090K812L2283l6255l7056l740J7084J6433j1653j5754J797R180j803
$$ plain form
8947 23427 11034 -4448 2770 -6544 1366 4047 16426 63746 76180 20497 -19433 -7618 -18915
8934 -18915 -10966 16538 13642 -2501 26644 60957 25240 -38132 -48712 -20929 1938 -13709
8922 -13709 -10921 58088 75623 86484 62501 11062 -30000 -48874 13534 19531 16870 13737 2830
8909 2830 -37788 -20481 -28864 -41978 -14444 4823 19358 14271 10887 14430 21276 3183 9629
8896 9629 22881 38081 82955 116841 144317 118996 85638 61569 19872 4224 2521 13375
8884 13375 56472 32904 -7374 -4793 278 8847 6586 -20161 3747 3856 49466 66393 50493
8871 50493 8082 -4810 45231 95589 51767 36568 15350 -12679 -34403 -49053 -36072 12885
8859 12885 5986 -10528 -40071 -50457 -46393 -35578 -14560 -27464 8287 38747 65778 81243
$$ packed form
8947B3427j2393j5482P218r314P910K681J2379M7320J2434n5683l9930J1815j1297
8934a8915P949K7504k896j6143K9145L4313l5717o3372j0580K7783K2867j5647
8922a3709K788O9009J7535J0861k3983n1439m1062j8874O2408N997k661l133j0907
8909B830m0618J7307q383j3114K7534J9267J4535n087l384L543O846j8093O446
8896I629J3252J5200M4874L3886K7476k5321l3358k4069m1697j5648j703J0854
8884A3375M3097k3568m0278K581N071Q569k261k6747K3908J09M5610J6927j5900
8871E0493m2411j2892N0041N0358m3822j5199k1218k8029k1724j4650J2981M8957
8859A2885o899j6514k9543j0386M064J0815K1018j2904L5751L0460K7031J5465
$$ plain form
8847 81243 61619 42584 20587 13254 -1492 -35175 -20104 -19333 21130 24496 35136 39615 42981
8834 42981 32296 16936 21406 28404 38859 56307 81286 94936 46356 -12534 -54857 -91866
8822 -91866 -68520 -48178 -16201 10667 34328 86029 80456 64788 967 7937 74787 31522
8810 31522 -609 26084 35232 7408 8733 -30990 -41147 -25633 -2339 -16598 -42127 -20555
8798 -20555 -26177 -37302 -37350 -47531 -72340 -62071 -52820 -42613 -20093 17881 39406 61625 28026
8785 28026 -17145 -34438 1763 20193 5051 18443 39129 32874 38879 49934 25712 -228
8773 -228 -5394 28534 52345 59325 4921 -31869 -28779 20862 8472 -23619 -31897 27525 53752
8760 53752 28444 43109 32102 38705 60 171 32893 54366 52302 49766 33056 -1149 14292
$$ packed form
8847H1243j9624j9035k1997p333j4746l3683J5071P71M0463L366J0640M479L366
8834D2981j0685j5360M470O998J0455J7448K4979J3650m8580n8890m2323l7009
8822i1866K3346K0342L1977K6868K3661N1701n573j5668o3821O970O6850m3265
8810C1522l2131K6693R148k7824J325l9723j0157J5514K3294j4259k5529K1572
8798b0555n622j1125m8j0181k4809J0269R251J0207K2520L7974K1525K2219l3599
8785B8026m5171j7293L6201J8430j5142J3392K0686o255O005J1055k4222k5940
8773b28n166L3928K3811O980n4404l6790L090M9641j2390l2091q278N9422K6227
8760E3752k5308J4665j1007O603l8645J11L2722K1473k064k536j6710l4205J5441
$$ plain form
8747 14292 38278 43557 45827 23574 -11498 -13130 -11793 -38554 -78581 -60265 1106 14551 -1479
8734 -1479 -48886 -24367 26025 27893 28919 56616 67159 77707 55954 25477 -20337 -18889 -765
8721 -765 3831 -9904 -59 37428 17160 -21325 -10245 -33441 -38389 1364 43047 29624 52107
8708 52107 69609 33008 -29824 -27996 35103 61819 35538 9041 -5155 -10114 -4939 930 6066
8695 6066 34207 30102 20310 14035 15672 20222 64156 80434 85161 71517 50232 29389 22733
8682 22733 519 18399 4610 12824 50390 66397 50131 42941 34062 1373 -1415 -30434 -42758
8669 -42758 -53529 -33926 -47577 -42492 -9411 21825 2187 -6712 24454 28755 750 -27614
8657 -27614 2756 43469 56292 37566 15907 39458 23498 48998 71121 69792 85398 53309
$$ packed form
8747A4292K3986N279K270k2253l5072j632J337k6761m0027J8316O1371J3445j6030
8734a479m7407K4519N0392J868J026K7697J0543J0548k1753l0477m5814J448J8124
8721g65M596j3735R845L7487k0268l8485J1080k3196m948L9753M1683j3423K2483
8708E2107J7502l6601o2832J828O3099K6716k6281k6497j4196m959N175N869N136
8695F066K8141m105r792o275J637M550M3934J6278M727j3644k1285k0843o656
8682B2733k2214J7880j3789Q214L7566J6007j6266p190q879l2689k788k9019j2324
8669d2758j0771J9603j3651N085L3081L1236j9638q899L1166M301k8005k8364
8657b7614L0370M0713J2823j8726k1659K3551j5960K5500K2123j329J5606l2089
$$ plain form
8645 53309 77811 107663 111527 50539 21 320 18493 44508 82300 93831 74705 84827
8633 84827 83620 112935 127422 88982 73564 95748 80187 45819 53769 116732 116734 107121 134970
8620 134970 91548 62331 -7741 11417 91261 117138 120054 128215 118059 97108 63837 62221
8608 62221 42672 31562 28348 19322 64757 80745 98092 111781 100802 116953 155701 161882
8596 161882 130204 115120 95281 114862 126412 112341 124442 144193 193078 227366 242242 277868
8584 277868 307424 282676 295718 295137 266712 223538 227551 207453 229851 225976 200772 168787
8572 168787 160584 172000 129966 93463 84406 113966 116669 116143 98361 85996 121119 127777 162014
8559 162014 170544 162679 129870 94868 76789 66248 65350 85533 66310 61167 57353 33597 132
$$ packed form
8645E3309K4502K9852L864o0988n0518K99J8173K6015L7792J1531j9126J0122
8633H4827j207K9315J4487l8440j5418K2184j5561l4368P950O2963Kr613K7849
8620A34970m3422k9217p0072J9158P9844K5877K916Q161j0156k0951l3271j616
8608F2221j9549j1110l214r026M5435J5988J7347J3689j0979J6151L8748O181
8596A61882l1678j5084j9839J9581J1550j4071J2101J9751M8885L4288J4876L5626
8584B77868K9556k4748J3042n81k8425m3174M013k0098K2398l875k5204l1985
8572A68787q203J1416m2034l6503r057K9560K703n26j7782j2365L5123O658L4237
8559A62014Q530p865l2809l5002j8079j0541q98K0183j9223n143l814k3756l3465
$$ plain form
8546 132 -6601 8937 28510 47072 58976 50170 24216 20194 60705 60172 56710 65475 40980 58497
8532 58497 90228 57610 20515 10527 -2866 -19459 4767 33872 41238 45299 65712 43897
8520 43897 -11520 4774 -1087 350 14174 24680 52068 42700 10095 33604 52374 25518
8508 25518 -36609 -4540 66645 79481 60604 10071 -27177 -18531 -2987 48699 55925 20810
8496 20810 10250 26221 73059 41290 14273 36732 43843 23708 49394 73838 39516 19116
8484 19116 24840 20009 27899 25637 44567 49457 28148 8614 -12811 -32826 -37343 -13905 4732
8471 4732 -36416 -61352 -25523 -1797 9791 -33118 3678 50389 80027 70741 62777 79417
8459 79417 91390 70474 70347 63320 53544 7074 8435 3858 21433 52875 34699 37734 33151
$$ packed form
8546A32o733J5538J9573J8562J1904q806k5954m022M0511n33l462Q765k4495J7517
8532E8497L1731l2618l7095r988j3393j6593K4226K9105P366M061K0413k1815
8520D3897n5417J6294n861J437J3824J0506K7388r368l2605K3509J8770k6856
8508B5518o2127L2069P1185J2836j8877n0533l7248Q646J5544N1686P226l5115
8496B0810j0560J5971M6838l1769k7017K2459P111k0135K5686K4444l4322k0400
8484A9116N724m831P890k262J8930M890k1309j9534k1425k0015m517K3438J8637
8471D732m1148k4936L5829K3726J1588m2909L6796M6711K9638r286p964J6640
8459G9417J1973k0916j27p027r776m6470J361m577J7575L1442j8176L035m583
$$ plain form
8446 33151 5897 -10374 -27178 -18386 27977 30941 31588 20612 34861 23726 25702 48767 37943
8433 37943 37475 94139 76486 50863 76470 66111 14060 -29574 -16278 -4003 19786 34338
8421 34338 31718 10521 6718 -13002 20149 25445 15748 -1718 2785 -1203 33863 15948 -18918
8408 -18918 -29497 9217 63524 57751 23668 23812 63087 94590 58417 -9181 -2578 -731 -6728
8395 -6728 13489 11858 -8760 -9281 -27031 -56562 -63713 -23133 21182 38560 86300 35986 -8924
8382 -8924 -9179 7884 -27664 -35757 4847 34773 57256 77214 103118 65398 24035 33038 40741
8369 40741 47377 312 -39773 -40155 -23205 -25270 23528 28363 10774 -28963 -58188 -50189 -45728
8356 -45728 -64700 -40805 -13413 1561 19014 33329 4300 3914 7236 35359 56577 10505
$$ packed form
8446C3151k7254j6271j6804Q792M6363K964O47j0976J4249j1135J976K3065j0824
8433C7943m68N6664j7653k5623K5607j0359n2051m3634J3296J2275K3789J4552
8421C4338k620k1197l803j9720L3151N296r697j7466M503l988L5066j7915l4866
8408a8918j0579L8714N4307n773l4083J44L9275L1503l6173o7598O603J847n997
8395f728K0217j631k0618n21j7750k9531p151M0580M4315J7378M7740n0314m4910
8382h924k55J7063l5548q093M0604K9926K2483J9958K5904l7720m1363R003P703
8369D0741O636m7065m0085l82J6950k065M8798M835j7589l9737k9225P999M461
8356d5728j8972K3895K7392J4974J7453J4315k9029l86L322K8123K1218m6072
$$ plain form
8344 10505 -24620 -49340 -36438 -43749 -50996 -9055 -27640 -64522 -24010 26104 -3644 -23125
8332 -23125 2213 23299 11103 -10828 -68358 -67965 -19987 38352 49070 35514 10000 -2400
8320 -2400 -19139 15098 26369 21392 45756 57149 38656 24772 5923 34058 31410 59748
8308 59748 50529 -3742 41537 51534 -55 -26930 -15515 -40230 -93840 -111076 -48032 4510
8296 4510 -13725 -28148 -38925 -7974 -5222 34105 37368 -21 -26986 -37815 -42508 -10687 -21737
8283 -21737 -53462 -44011 11668 15426 3737 -13187 -19586 -7246 20825 40744 40632 -23016 -34847
8270 -34847 -15713 -31057 4011 -4525 -4586 18324 15337 -22123 -58591 -41740 -28413 -4279 961
8257 961 -6133 3090 20833 11942 -55160 -51524 -15982 6548 -14959 9355 45510 28049 5707
$$ packed form
8344A0505l5125k4720J2902p311p247M1941j8585l6882M0512N0114k9748j9481
8332b3125K5338K1086j2196k1931n7530L93M7978N8339J0718j3556k5514j2400
8320b400j6739L4237J1271m977K4364J1393j8493j3884j8849K8135k648K8338
8308E9748r219n4271M5279R997n1589k6875J1415k4715n3610j7236O3044N2542
8296D510j8235j4423j0777L0951K752L9327L263l7389k6965j0829m693L1821j1050
8283b1737l1725R451N5679L758j1689j6924o399J2340K8071J9919j12o3648j1831
8270c4847J9134j5344L5068q536o1K2910k987l7460l6468J6851J3327K4134N240
8257I61p094R223J7743q891o7102L636L5542K2530k1507K4314L6155j7461k2342
$$ plain form
8244 5707 -5495 -8243 7550 25215 7917 -233 -23877 -30497 -35650 -41453 12308 17366 -28070
8231 -28070 -19976 6412 439 16351 13329 20620 38155 35229 1706 -468 4211 18859 69008
8218 69008 99920 123819 96317 14283 -30669 -31965 -38816 -1647 -14079 -33016 -7178 -4533
8206 -4533 -16586 466 35234 71945 4960 -16610 12956 28048 39160 34437 -2305 -32450
8194 -32450 -3477 33864 14560 -9983 -16087 -31822 -45957 -57099 -30626 39616 53970 18194
8182 18194 -32405 -29047 -16318 4088 15306 26993 61861 61271 27315 7973 23916 56560
8170 56560 57644 53452 14368 -57904 -57898 -26285 -38345 -35834 -32453 -28936 -21322 -40819 -41401 -46040
8156 -46040 -23862 32735 17605 -7600 -67279 -57466 -11555 -3854 -9073 -54482 -75284 -24266
$$ packed form
8244E707j1202k748J5793J7665j7298q150k3644o620n153n803N3761N058m5436
8231b8070Q094K6388n973J5912l022P291J7535k926l3523k174M679J4648N0149
8218F9008L0912K3899k7502q2034m4952j296o851L7169j2432j8937K5838K645
8206d533j2053J7052L4768L6711o6985k1570K9566J5092J1112m723l6742l0145
8194c2450K8973L7341j9304k4543o104j5735j4135j1142K6473P0242J4354l5776
8182A8194n0599L358J2729K0406J1218J1687L4868n90l3956j9342J5943L2644
8170E6560J084m192l9084p2272OL1613j2060K511L381L517P614j9497n82m639
8156d6040K2178N6597j5130k5205n9679R813M5911P701n219m5409k0802N1018
$$ plain form
8144 -24266 31192 68694 28188 -32357 -15235 29764 57007 39689 -34088 -53838 -6966 -2969
8132 -2969 -781 -8806 -6349 -9037 -9022 -15255 -71496 -45968 8811 40044 42843 11312 -13368 -4400
8118 -4400 -32189 -74537 -107868 -80429 -44400 -44356 -17439 1523 45619 16909 -25135 -27589 -45890
8105 -45890 -38443 -21675 -14916 -6721 5181 -16694 -14490 -58396 -49755 -20236 -29796 -53466 -33312
8092 -33312 -47685 -70564 -40610 519 7596 15103 -15533 -24148 -2408 -36522 -69143 -74399 -31201
8079 -31201 -2624 2101 19927 34405 -8936 -28081 -30503 -2891 35843 27575 21738 -8893 -35142
8066 -35142 -15519 -21560 5527 6719 6132 -9484 -53766 -64306 -40426 -3394 -2673 50365 75424
8053 75424 55578 15204 8025 29176 36223 1892 27415 57070 21978 -15952 -57072 -67055
$$ packed form
8144b4266N5458L7502m0506o0545J7122M4999K7243j7318p3777j9750M6872L997
8132b969K188q025K457k688J5o233n6241K5528N4779L1233K799l1531k4680Q968
8118d400k7789m2348l3331K7439L6029M4K6917J8962M4096k8710m2044k454j8301
8105d5890P447J6768O759Q195J1902k1875K204m3906Q641K9519r560k3670K0154
8092c3312j4373k2879K9954M1129P077P507l0636q615K1740l4114l2621n256M3198
8079c1201K8577M725J7826J4478m3341j9145k422K7612L8734q268n837l0631k6249
8066c5142J9623o041K7087J192n87j5616m4282j0540K3880L7032P21N3038K5059
8053G5424j9846m0374p179K1151P047l4331K5523K9655l5092l7930m1120r983
$$ plain form
8041 -67055 -36234 -32714 -11544 -18785 174 -10210 -1326 16807 16760 -33014 -38662 -58638 -77234
8028 -77234 -50310 -32189 -193 3200 -16038 -35973 -37037 9658 69372 101700 72674 39473
8016 39473 60977 75835 55893 80978 89990 105834 133364 125747 86924 59302 24324 -7274
8004 -7274 14726 27247 3745 8663 26141 23687 11794 20861 45823 77692 110624 100946 25677
7991 25677 -20673 4319 52501 61284 35673 34396 53107 85737 63733 45561 45905 74720 87265
7978 87265 56350 23309 25631 66316 95257 101878 103418 72651 63692 84635 56670 32028 19734
7965 19734 29487 11070 -17528 -26963 -42969 -26190 -28125 -6216 38921 54459 6269 16882
7953 16882 46192 21753 62463 80742 14329 16723 60983 79105 82241 77727 51654 13369
$$ packed form
8041f7055L0821L520K1170p241J8959j0384Q884J8133m7m9774n648j9976j8596
8028g7234K6924J8121L1996L393j9238j9935j064M6695N9714L2328k9026l3201
8016C9473K1504J4858j9942K5085R012J5844K7530p617l8823k7622l4978l1598
8004g274K2000J2521k3502M918J7478k454j1893R067K4962L1869L2932r678p5269
7991B5677m6350K4992M8182Q783k5611j277J8711L2630k2004j8172L44K8815J2545
7978H7265l0915l3041K322M0685K8941O621J540l0767q959K0943k7965k4642j2294
7965A9734R753j8417k8598r435j6006J6779j935K1909M5137J5538m8190J0613
7953A6882K9310k4439M0710J8279o6413K394M4260J8122L136m514k6073l8285
$$ plain form
7941 13369 -845 31165 37455 16364 -11128 9577 -515 -1387 12804 4275 38493 86671 122183
7928 122183 86757 41107 -20682 5241 52630 40122 43294 53926 46196 21964 11554 43274
7916 43274 66619 108648 88384 65850 53426 62582 64462 46948 32197 17917 7373 62740
7904 62740 74608 44612 83897 87212 64017 18306 -4003 -3821 11348 -1863 -15582 -18892 -62904
7891 -62904 -83825 8854 11037 29349 65984 66804 56453 41097 53451 26407 -12850 -19515 26125
7878 26125 60444 43380 -13112 -20598 -33450 4024 55972 58240 516 -19396 4167 33955
7866 33955 32130 2701 -4875 -11660 462 27645 29550 -18550 -38497 -36951 51 30713 40249
7853 40249 44318 12498 4041 3622 -48515 -58623 -62024 -19206 -21710 -58718 -63574 -75103 -78445
$$ packed form
7941A3369j4214L2010O290k1091k7492K0705j0092q72J4191q529L4218M8178L5512
7928A22183l5426m5650o1789K5923M7389j2508L172J0632p730k4232j0410L1720
7916D3274K3345M2029k0264k2534j2424R156J880j7514j4751j4280j0544N5367
7904F2740J1868k9996L9285L315k3195m5711k2309J82J5169j3211j3719l310m4012
7891f2904k0921R2679K183J8312L6635Q20j0351j5356J2354k7044l9257o665M5640
7878B6125L4319j7064n6492p486j2852L7474N1948K268n7724j9912K3563K9788
7866C3955j825k9429p576o785J2122K7183J905m8100j9947J546L7002L0662R536
7853D0249M069l1820q457m19n2137j0108l401M2818k504l7008m856j1529l342
$$ plain form
7840 -78445 -67063 -44398 -8950 -17604 -42895 -43360 -9974 27753 36664 -24501 -78733 -72873 -44317
7827 -44317 -6416 -10591 -1580 -10749 -28518 33294 28375 -8408 -10665 -18037 1247 13287 9888
7814 9888 23049 -15434 -24008 21599 5877 7453 -13106 -24276 -33258 -34017 -25760 -37006 -8020
7801 -8020 -22068 -41118 -45578 -74495 -57393 -13128 2651 -20501 -44668 -38194 -32353 -19547 -49108
7788 -49108 -58384 -30357 -14552 -1395 17421 54167 22380 -32153 -8286 16171 -1706 11760
7776 11760 34902 31983 22718 44987 35319 38979 44734 75485 74802 55789 42569 55557 14938
7763 14938 18452 863 -33328 -61548 -37581 -2414 22675 49365 52783 -7746 -21800 37748
7751 37748 65729 31896 11572 -2469 -1908 10002 -8519 -3453 8359 37284 28918 35360 37434
$$ packed form
7840g8445J1382K2665L5448q654k5291m65L3386L7727Q911o1165n4232N860K8556
7827d4317L7901m175R011r169j7769O1812m919l6783k257p372J9284J2040l399
7814I888J3161l8483q574M5607j5722J576k0559j1170q982p59Q257j1246K8986
7801h020j4048j9050m460k8917J7102M4265J5779k3152k4167O474N841J2806k9561
7788d9108r276K8027J5805J3157J8816L6746l1787n4533K3867K4457j7877J3466
7776A1760K3142k919r265K2269r668L660N755L0751o83j9013j3220J2988m0619
7763A4938L514j7589l4191k8220K3967L5167K5089K6690L418o0529j4054N9548
7751C7748K7981l3833k0324j4041N61J1910j8521N066J1812K8925q366O442K074
$$ plain form
7738 37434 7500 -24355 -28931 26475 12625 -8654 -48996 -34890 -8407 -3863 -8662 -1818 50470
7725 50470 33349 11557 14319 -38971 -82846 -43590 1772 -3406 -19714 29760 17689 -23608
7713 -23608 -3606 -30662 -73706 -43200 -45571 -23016 2708 -6490 -21007 6062 9032 22164
7701 22164 29589 31421 18549 -27052 -25189 -28326 -37099 -30153 -61341 -67073 -103507 -52740 -693
7688 -693 8866 -29797 -36285 -29113 -83687 -101153 -61847 -34102 -22153 -42595 -52457 -59550 -52015
7675 -52015 -49791 -32344 -4113 -10483 -17150 -36965 -57115 -15237 8101 15998 8920 -8687 20155
7662 20155 43237 16948 35087 34697 40762 31253 7012 -5071 -21464 13251 65709 42624 61962
7649 61962 61244 48330 73496 64001 48254 33490 -2677 -27692 -20649 -22100 -12875 32118 -14776
$$ packed form
7738C7434k9934l1855m576N5406j3850k1279m0342J4106K6483M544m799O844N2288
7725E0470j7121k1792K762n3290m3875L9256M5362n178j6308M9474j2071m1297
7713b3608K0002k7056m3044L0506k371K2555K5724r198j4517K7069K970J3132
7701B2164P425J832j2872m5601J863l137q773O946l1188n732l6434N0767N2047
7688f93R559l8663o488P172n4574j7466L9306K7745J1949k0442r862p093P535
7675e2015K224J7447K8231o370o667j9815k0150M1878K3338P897p078j7607K8842
7662B0155K3082k6289J8139l90O065r509k4241j2083j6393L4715N2458k3085J9338
7649F1962p18j2914K5166r495j5747j4764l6167k5015P043j451R225M4993m6894
$$ plain form
7636 -14776 -41441 -64021 -52913 -34642 -40933 -22628 -42106 -43002 -950 -22954 -42393 -70088
7624 -70088 -37558 -38644 -86341 -96045 -99693 -43981 -22204 -46966 -44487 -27600 -22980 -33437 -32118
7611 -32118 -22771 -49071 -69163 -84474 -103104 -98090 -47365 -58894 -49739 -12595 42267 40762 16712
7598 16712 51166 67632 4094 -11315 -16786 -36052 -44727 -4243 5049 -17252 26914 23567 10784
7585 10784 -7168 -11290 -40013 -47603 -31216 24876 46567 68814 86375 97935 50331 34987
7573 34987 29936 2009 24429 46333 43992 39078 51022 52943 29764 23482 59676 57950 49832
7560 49832 15065 -2934 -9167 -40303 9548 36862 12740 -14995 -13983 21070 51064 27583
7548 27583 13464 -28593 -47595 -62508 -63668 -46453 -11895 36668 40425 15797 5958 -24286
$$ packed form
7636a4776k6665k2580J1108J8271o291J8305j9478q96M2052k2004j9439k7695
7624g0088L2530j086m7697r704l648N5712K1777k4762K479J6887M620j0457J319
7611c2118R347k6300k0092j5311j8630N014N0725j1529R155L7144N4862j505k4050
7598A6712L4454J6466o3538j5409n471j9266q675M0484R292k2301M4166l347j2783
7585A0784j7952m122k8723p590J6387N6092K1691K2247J7561J1560m7604j5344
7573C4987n051k7927K2420K1904k341m914J1944J921k3179o282L6194j726q118
7560D9832l4767j7999o233l1136M9851K7314k4122k7735J012L5053K9994k3481
7548B7583j4119m2057j9002j4913j160J7215L4558M8563L757k4628r839l0244
$$ plain form
7536 -24286 -22582 -39789 -31575 -2717 -15016 -59917 -46376 19126 26789 18733 -4967 -6397 50753
7523 50753 81361 77792 72462 93225 77667 49990 10713 21149 29215 87 819 -6058 18744
7510 18744 23565 17578 -26829 -70794 -72391 -31002 -27453 -24925 -26738 -3166 9620 15360 -108
7497 -108 8694 30423 28337 5369 -17133 -34572 -52571 -18292 -20489 -16651 -2578 -2484 -14887 7812
7483 7812 7966 -21500 817 -25028 -28009 -30226 -29463 -9532 2754 5334 -4571 -55 34154 58417
7469 58417 43903 10115 17621 27900 40984 42389 59608 55266 51944 80098 26558 18231 -16791
7456 -16791 -1215 19576 4537 -36884 -56980 -79632 -38613 -15827 -28883 -63926 -36468 -31584
7444 -31584 -58631 -67685 -33602 -26528 -10886 -12140 -22114 -4220 4486 6385 -14765 21968 1467
$$ packed form
7536b4286J704j7207Q214K8858j2299m4901J3541O5502P663q056k3700j430N7150
7523E0753L0608l569n330K0763j5558k7677l9277J0436Q066k9128P32o877K4802
7510A8744M821n987m4407m3965j597M1389L549K528j813K3572J2786N740j5468
7497a08Q802K1729k086k2968k2502j7439j7999L4279k197L838J4073R4j2403K2699
7483G812J54k9466K2317k5845k981k217P63J9931J2286K580r905M516L4209K4263
7469E8417j4514l3788P506J0279J3084J405J7219m342l322K8154n3540q327l5022
7456a6791J5576K0791j5039m1421k0096k2652M1019K2786j3056l5043K7458M884
7444c1584k7047r054L4083P074J5642j254r974J7894Q706J899k1150L6733k0501
$$ plain form
7431 1467 -4124 -17519 -3750 -4238 5858 -17468 -11724 8816 -4182 -40176 -29692 -34818 -60353
7418 -60353 -65926 -44157 -53150 -69371 -77747 -48181 -24919 -42439 -80407 -69484 -28978 -10632
7406 -10632 -72728 -76940 -96986 -89014 -80422 -28174 -24523 -55858 -10632 -8212 -35966 -23753 -1484
7393 -1484 20860 15270 12214 3222 -13360 12808 14025 11110 55394 52651 20575 -344 -20930
7380 -20930 -8671 -6077 16557 47898 35728 14206 -9804 -1415 -3426 17906 9119 -2996 -7689
7367 -7689 1113 515 -6499 -11869 -31596 -14463 34227 23082 -24867 -98211 -74288 -35466 -21189
7354 -21189 -17301 22012 34359 31824 16090 32386 28908 1091 -32404 -35198 1400 49184 81804
7341 81804 53665 37257 10812 10919 26028 39951 22039 66420 66509 36355 42719 19048 5054
$$ packed form
7431A467n591j3395J3769m88J0096k3326N744K0540j2998l5994J0484n126k5535
7418f0353n573K1769q993j6221q376K9566K3262j7520l7968J0923M0506J8346
7406a0632o2096m212k0046P972Q592N2248L651l1335M5226K420k7754J2213K2269
7393a484K2344n590l056q992j6582K6168J217k915M4284k743l2076k0919k0586
7380b0930J2259K594K2634L1341j2170k1522k4010Q389k011K1332q787j2115m693
7367g689Q802n98p014n370j9727J7133M8690j1145m7949p3344K3923L8822J4277
7354b1189L888L9313J2347k535j5734J6296l478k7817l3495k794L6598M7784L2620
7341H1804k8139j6408k6445J07J5109J3923j7912M4381Q9l0154O364k3671j3994
$$ plain form
7328 5054 34487 77734 70890 31710 22625 14155 1306 21181 37198 35876 -14434 -34033 -36846
7315 -36846 -50722 -8937 14262 3749 -40462 -51777 -18406 -18409 -20788 -66057 -75978 -41399 16949
7302 16949 25663 46809 23280 -9441 -71775 -72324 -61516 -59857 -37788 -32746 -40668 -30933 -39446
7289 -39446 -77772 -107340 -119973 -89806 -85326 -82652 -93977 -79008 -87142 -78889 -16073 17754 34957
7276 34957 25975 4424 8801 36203 -7146 -61408 -83237 -51139 -3560 -3489 -22118 -46035 -67848
7263 -67848 -28207 4395 6292 7303 10012 44928 71897 47663 46056 51394 36474 77056 101835
7250 101835 105148 93472 71105 49822 60374 52912 30834 6079 -15276 37395 33846 28077
7238 28077 21189 23744 -14750 -31691 -21470 43848 31873 20520 25030 3080 -24441 -27423 -15692
$$ packed form
7328E054K9433M3247o844l9180r085q470j2849J9875J6017j322n0310j9599k813
7315c6846j3876M1785K3199j0513m4211j1315L3371lk379m5269r921L4579N8348
7302A6949Q714K1146k3529l2721o2334n49J0808J659K2069N042p922R735q513
7289c9446l8326k9568j2633L0167M480K674j1325J4969q134Q253O2816L3827J7203
7276C4957q982k1551M377K7402m3349n4262k1829L2098M7579P1j8629k3917k1813
7263f7848L9641L2602J897J011K709L4916K6969k4234j607N338j4920M0582K4779
7250A01835L313j1676k2367k1283J0552p462k2078k4755k1355N2671l549n769
7238B8077o888K555l8494j6941J0221O5318j1975j1353M510k1950k7521k982J1731
$$ plain form
7225 -15692 -27056 -7482 -25384 7331 -439 -5540 -10755 -21027 -16444 -10962 -23981 -55345 -58207
7212 -58207 -93994 -48218 -39630 -35603 -31780 -26251 -44287 -84534 -77210 -58787 -35256 -73 11609
7199 11609 37551 25906 -15803 -46068 -11627 42780 40697 3480 5763 37333 38987 19985
7187 19985 27790 50705 11286 -62847 -91847 -77200 -62613 -48592 -21901 -10623 5415 68113
7175 68113 59214 24459 30471 -6220 -19607 11976 35091 78919 57587 768 -13421 -34658
7163 -34658 -44912 -16001 22498 -19695 -49532 -38191 -26074 -26294 -27281 -86527 -94181 -64148 -54683
7150 -54683 -65116 -56016 -8449 -21307 -79375 -53482 -69529 -87571 -66791 -28886 -44566 -63975
7138 -63975 -22549 27270 12436 -2153 15052 36900 44897 7561 -27030 -33707 -76106 -90043
$$ packed form
7225a5692j1364J9574j7902L2715p770n101n215j0272M583N482j3019l1364k862
7212e8207l5787M5776Q588M027L823N529j8036m0247P324J8423K3531L5183J1682
7199A1609K5942j1645m1709l0265L4441N4407k083l7217K283L1570J654j9002
7187A9985P805K2915l9419p4133k9000J4647J4587J4021K6691J1278J6038O2698
7175F8113q899l4755O012l6691j3387L1583K3115M3828k1332n6819j4189k1237
7163c4658j0254K8911L8499m2193k9837J1341J2117k20r87n9246p654L0033R465
7150e4683j0433R100M7567j2858n8068K5893j6047j8042K0780L7905j5680j9409
7138f3975M1426M9819j4834j4589J7205K1848P997l7336l4591o677m2399j3937
$$ plain form
7126 -90043 -89468 -77458 -57693 -36158 -15072 -243 11324 25320 -10366 -53651 3139 30603
7114 30603 22434 -1677 -7567 -18498 -54939 -55861 9168 20249 15209 1783 6074 15054 8725
7101 8725 -23094 -36068 -28242 -33812 -3605 -3986 -63463 -69769 -41312 -12786 -38239 -67124 -85399
7088 -85399 -60893 -92824 -76977 -56755 -56530 -11287 24840 6071 -14492 -33604 -24908 -31749 -44045
7075 -44045 -67488 -83045 -66114 -41148 -57752 -74070 -42956 -7467 11749 4748 -25314 -46613
7063 -46613 -55754 9584 65296 39578 12863 -3412 -51538 -71081 -42655 -13462 14983 30295
7051 30295 19756 -5592 -3344 -18056 -6769 -10769 -15180 2521 18280 6045 -4301 -69818
7039 -69818 -69121 -67723 -49632 -55611 -65891 -41766 2482 8806 9409 22754 -11480 -16261 -10382 14572
$$ packed form
7126i0043N75J2010J9765K1535K1086J4829J1567J3996l5686m3285N6790K7464
7114C0603q169k4111n890j0931l6441r22O5029J1081n040j3426M291Q980o329
7101H725l1819j2974P826n570L0207l81n9477o306K8457K8526k5453k8885j8275
7088h5399K4506l1931J5847K0222K25M5243L6127j8769k0563j9112Q696o841j2296
7075d4045k3443j5557J6931K4966j6604j6318L1114L5489J9216p001l0062k1299
7063d6613r141O5338N5712k5718k6715j6275m8126j9543K8426K9193K8445J5312
7051C0295j0539k5348K248j4712J1287m000m411J7701J5759j2235j0346o5517
7039f9818O97J398J8091n979j0280K4125M4248O324O03J3345l4234m781N879K4954
$$ plain form
7025 14572 9111 -20786 -34327 -31389 -16903 11426 -10952 -15521 -66114 -103447 -75797 -87821
7013 -87821 -112336 -81115 -45440 -13683 -47552 -33287 -36496 -65736 -60103 -30846 -25953 -32407 -26043
7000 -26043 -45704 -52030 -54628 -73536 -60755 -13613 12411 17012 -11580 6812 32844 38548 15563
6987 15563 3713 10682 22642 -33855 -69894 -43240 -25298 -18624 -27398 -9263 -8830 -12525 649
6974 649 8812 21384 -22265 -25394 -27591 -43264 -58181 -47657 7336 -10441 -44559 -21569 -29904
6961 -29904 -68275 -76646 -76296 -24569 -38668 -77583 -72455 -43407 -76697 -95037 -107689 -129154 -128283
6948 -128283 -97448 -45289 -3908 -3281 19131 10963 8025 39239 71116 50071 33923 -125
6936 -125 -42107 -23627 -22962 -41203 -51561 -6475 28030 50136 50637 45044 51406 47504 -966 -27089
$$ packed form
7025A4572n461k9897j3541K938J4486K8329k2378m569n0593l7333K7650j2024
7013h7821k4515L1221L5675L1757l3869J4265l209k9240N633K9257M893o454O364
7000b6043j9661o326k598j8908J2781M7142K6024M601k8592J8392K6032N704k2985
6987A5563j1850O969J1960n6497l6039K6654J7942O674q774J8135M33l695J3174
6974F49Q163J2572m3649l129k197j5673j4917J0524N4993j7777l4118K2990q335
6961b9904l8371q371L50N1727j4099l8915N128K9048l3290j8340j2652k1465Q71
6948a28283L0835N2159M1381O27K2412q168k938L1214L1877k1045j6148l4048
6936a25m1982J8480O65j8241j0358M5086L4505K2106N01n593O362l902m8470k6123
$$ plain form
6922 -27089 -35935 -34722 -26074 -13502 -39345 -3140 17143 31065 56861 27118 1980 -4000 7534
6909 7534 -22932 -14746 23139 30624 -8192 -27933 749 504 -14060 1736 28691 44194 47187
6896 47187 64907 38806 14368 -22941 -25272 -25238 -36418 -44868 -43661 -23240 -37255 -61241 -36549
6883 -36549 -11585 11170 31883 -21081 -32486 -40772 -68850 -28395 8743 -21461 -22822 4306
6871 4306 33019 -13695 -35092 -26264 -11160 3812 -1989 3669 -37969 -86863 -112690 -94242 -43521
6858 -43521 -17929 -6696 63358 32500 9098 9110 24645 22805 19077 61409 73137 43204 -5261
6845 -5261 -3604 18633 14833 -29840 -39133 -33564 11487 7161 1744 -10990 -5711 13395 23666
6832 23666 14388 9151 -10892 -31735 -4641 -28876 -29378 6183 -16982 -32476 17913 56135 48311
$$ packed form
6922b7089q846J213Q648J2572k5843L6205K0283J3922K5796k9743k5138n980J1534
6909G534l0466Q186L7885P485l8816j9741K8682k45j4564J5796K6955J5503K993
6896D7187J7720k6101k4438l7309k331L4j1180q450J207K0421j4015k3986K4692
6883c6549K4964K2755K0713n2964j1405q286k8078M0455L7138l0204j361K7128
6871D306K8713m6714k1397Q828J5104J4972n801N658m1638m8894k5827J8448N0721
6858d3521K5592J1233P0054l0858k3402J2J5535j840l728M2332J1728k9933m8465
6845e261J657K2237l800m4673r293N569M5051m326n417j2734N279J9106J0271
6832B3666r278n237k0043k0843K7094k4235n02L5561k3165j5494N0389L8222p824
$$ plain form
6819 48311 43840 27139 31785 71001 63714 25889 4379 6514 25721 13925 -13925 -10977 -21709
6806 -21709 -11138 -20331 -33044 -13490 14851 30084 20460 10791 -36971 -28312 -15566 -13488 3386
6793 3386 11734 14918 26108 45053 23465 7164 18529 20772 33610 44836 39614 50224 30655
6780 30655 19649 16158 43841 49613 51043 62528 71256 74878 70033 70485 61227 4808 -34428 -55569
6766 -55569 -21976 -2021 -3518 21344 45529 15062 -12851 -26973 -20854 -16745 -30330 -27358 -11208
6753 -11208 -29881 -44264 -32299 -31524 -5996 -5064 46659 83612 73341 35371 44535 46814 17151
6740 17151 30705 35700 50319 53920 61723 58431 45985 36939 42074 33899 -13307 -37531 -26891
6727 -26891 25926 16839 27824 62394 68785 35582 33159 25729 46862 124004 182897 248971 347938
$$ packed form
6819D8311m471j6701M646L9216p287l7825k1510K135J9207j1796k7850K948j0732
6806b1709J0571r193j2713J9554K8341J5233r624r669m7762Q659J2746K078J6874
6793C386Q348L184J1190J8945k1588j6301J1365K243J2838J1226n222J0610j9569
6780C0655j1006l491K7683N772J430J1485Q728L622m845M52r258n6419l9236k1141
6766e5569L3593J9955j497K4862K4185l0467k7913j4122O119M109j3585K972J6150
6753a1208j8673j4383J1965P75K5528R32N1723L6953j0271l7970R164K279k9663
6740A7151J3554M995J4619L601P803l292j2446r046N135q175m7206k4224J0640
6727b6891N2817r087J0985L4570O391l3203k423p430K1133P7142N8893O6074R8967
$$ plain form
6714 347938 444223 564924 699877 717674 728884 635748 533126 438660 362782 250486 198693
6703 198693 166369 98274 41385 46135 41572 -4962 -1447 12176 47454 91273 65991 29979
6691 29979 -2913 -16780 -17641 22753 30880 21678 -8596 -21719 -9756 -14688 14153 35603 16789
6678 16789 17548 -14649 -56744 -34409 -20541 4298 10487 37140 37974 13324 -8522 -28171 -36357
6665 -36357 -34259 -8805 33710 47032 -9268 -27575 -10652 -24721 -6225 -1179 -25712 -13328
6653 -13328 -1644 31812 45274 8105 -24522 -42681 -71880 -32854 7609 10686 30459 6970
6641 6970 -29079 -24300 20323 7679 5252 -27803 -12154 1707 12798 -9097 -23394 -61979
6629 -61979 -47118 -3271 67010 93996 62886 37009 -11492 -1448 -3614 -11381 -27543 -16430
$$ packed form
6714C47938R6285J20701J34953J7797J1210r3136j02622r4466p5878j12296n1793
6703A98693l2324o8095n6889M750m563m6534L515J3623L5278M3819k5282l6012
6691B9979l2892j3867q61M0394Q127r202l0274j3123J1963m932K8841K1450j8814
6678A6789P59l2197m2095K2335J3868K4839O189K6653Q34k4650k1846j9649q186
6665c6357K098K5454M2515J3322n6300j8307J6923j4069J8496N046k4533J2384
6653a3328J1684L3456J3462l7169l2627j8159k9199L9026M0463L077J9773k3489
6641F970l6049M779M4623j2644k427l3055J5649J3861J1091k1895j4297l8585
6629f1979J4861M3847P0281K6986l1110k5877m8501J0044k166p767j6162J1113
$$ plain form
6617 -16430 -7499 -11234 -36496 -46006 -43750 -20606 -24528 -53894 -73229 -37680 28033 25604 32388
6604 32388 17478 -23309 -30792 -33205 -22485 -28986 -44090 -16428 -5955 -10221 -32336 -52579 -21361
6591 -21361 -8234 -11032 -9218 -20095 -52201 -90734 -67311 -6895 -3954 3028 19980 26752 44964
6578 44964 55173 41341 12293 20266 33068 22873 18874 38986 41040 17685 4710 -3518 -4452
6565 -4452 -15074 -39557 -9726 -8110 -23265 -10255 6436 10102 36524 48075 50488 14157 -30815
6552 -30815 -24986 -24882 -11430 -41954 -65693 -100559 -83449 -15675 24758 24655 49854 78607 48123
6539 48123 30594 25794 -15383 -24158 13974 17377 7564 46295 52470 43658 66589 70971 55141
6526 55141 52493 27565 31904 72255 109891 106477 61932 18715 21587 2933 -33282 -58846 -13801
$$ packed form
6617a6430Q931l735k5262r510K256K3144l922k9366j9335L5549O5713k429O784
6604C2388j4910m0787p483k413J0720o501j5104K7662J0473m266k2115k0243L1218
6591b1361J3127k798J814j0877l2106l8533K3423O0416K941O982J6952O772J8212
6578D4964J0209j3832k9048P973J2802j0195l999K0112K054k3355j2975q228r34
6565d452j0622k4483K9831J616j5155J3010J6691L666K6422J1551K413l6331m4972
6552c0815N829J04J3452l0524k3739l4866J7110O7774M0433j03K5199K8753l0484
6539D8123j7529m800m1177q775L8132L403r813L8731O175q812K2931M382j5830
6526E5141k648k4928M339M0351L7636l414m4545m3217K872j8654l6215k5564M5045
$$ plain form
6513 -13801 31498 56878 84578 8650 -2339 10646 4357 -12098 6192 -3952 -16493 11060
6501 11060 -44068 -72212 -36011 -42140 -52821 -24924 -17675 -18227 -12702 8178 -26760 -29246 2214
6488 2214 -1492 -29795 -39882 -55399 -65855 -45617 3858 4352 -33 -11526 -2283 42170 52207
6475 52207 29336 17155 15882 13751 23099 12051 4041 -3561 10322 23803 36420 23591 48625
6462 48625 75263 58999 21679 21613 16435 8063 20596 22964 10053 8011 23118 -43443 -90449
6449 -90449 -65160 -43644 -73796 -50222 -26514 -36127 -34653 -1860 5641 15701 -21741 -51215
6437 -51215 -44785 -12693 -25360 -61117 -69766 -410 -7429 -44045 -66892 -77648 -77592 -75428 -62304
6424 -62304 -25554 -23227 -53233 -92386 -93514 -84233 -62461 -59317 -35402 -31451 -37946 -20193 16928
$$ packed form
6513a3801M5299K5380K7700p5928j0989J2985o289j6455J8290j0144j2541K7553
6501A1060n5128k8144L6201o129j0681K7897P249n52N525K0880l4938k486L1460
6488B214l706k8303j0087j5517j0456K0238M9475M94m385j1493R243M4453J0037
6475E2207k2871j2181j273k131R348j1048q010p602J3883J3481J2617j2829K5034
6462D8625K6638j6264l7320o6n178q372J2533K368j2911k042J5107o6561m7006
6449i0449K5289K1516l0152K3574K3708r613J474L2793P501J0060l7442k9474
6437e1215O430L2092j2667l5757q649O9356p019l6616k2847j0756N6K164J3124
6424f2304L6750K327l0006l9153j128R281K1772L144K3915L951o495J7753L7121
$$ plain form
6411 16928 16707 2157 28849 28938 3418 -20556 -43837 -8619 21478 -2291 -17484 -4614 -735
6398 -735 11133 4383 -13407 -11563 -40542 -34361 -12959 25899 9186 -3298 -3816 -26582 -47414
6385 -47414 -24441 -27453 31252 52799 11908 -5561 -50541 -41778 2428 32728 13486 -8385
6373 -8385 -17911 -29306 -41459 -55846 -43132 -7943 -22075 -2091 -11105 -43965 -25627 7164
6361 7164 -5489 -17343 -940 -13628 -11613 4732 -15697 -14936 13066 36474 22164 28818 40156
6348 40156 63937 80154 95165 49154 -28547 -46355 -36299 -38205 -33857 -25455 -51486 -48174 -29337
6335 -29337 -12777 -44582 -45897 -11361 17078 54677 42348 25139 -37405 -45993 -15251 10521
6323 10521 48868 49441 54316 65957 68565 55532 46051 9142 -8119 -1779 4996 -10321 6980
$$ packed form
6411A6928k21j4550K6692Q9k5520k3974k3281L5218L0097k3769j5193J2870L879
6398g35J1868o750j7790J844k8979O181K1402L8858j6713j2484n18k2766k0832
6385d7414K2973l012N8705K1547m0891j7469m4980Q763M4206L0300j9242k1871
6373h385r526j1395j2153j4387J2714L5189j4132J9984r014l2860J8338L2791
6361G164j2653j1854J6403j2688K015J6345k0429P61K8002K3408j4310O654J1338
6348D0156K3781J6217J5011m6011p7701j7808J0056j906M348Q402k6031L312J8837
6335b9337J6560l1805j315L4536K8439L7599j2329j7209o2544q588L0742K5772
6323A0521L8347N73M875J1641K608j3033r481l6909j7261O340O775j5317J7301
$$ plain form
6310 6980 25833 20222 -3931 -30399 -96294 -99813 -72308 -11761 24563 27201 39060 23358 -36820
6297 -36820 -113193 -65113 -40771 -42803 -21709 -24633 -19718 -8305 14991 40849 5096 4489 -3829
6284 -3829 8608 3839 14671 4210 -13686 -33985 -30313 -8914 -24766 -60293 -30114 -10334
6272 -10334 15381 34066 29595 28347 19264 44473 76931 73707 45023 48993 30780 19569 25691
6259 25691 39277 29412 7904 11549 19242 -1797 1701 -14609 -44603 -75879 -58234 -33215 -28427
6246 -28427 -22252 -42100 -32605 -41114 -68288 -108448 -127186 -118883 -92254 -81257 -110254 -85280 -51052
6233 -51052 -6522 10616 13357 -35397 -14432 -17586 -56456 -31640 -57391 -44406 -17250 -991
6221 -991 3497 -7269 -20205 -17007 -10226 -7274 -20174 -1671 20969 11065 32118 16119 10201
$$ packed form
6310F980J8853n611k4153k6468o5895l519K7505O0547L6324K638J1859j5702o0178
6297c6820p6373M8080K4342k032K1094k924M915J1413K3296K5858l5753o07q318
6284c829J2437m769J0832j0461j7896k0299L672K1399j5852l5527L0179J9780
6272a0334K5715J8685m471j248r083K5209L2458l224k8684L970j8213j1211O122
6259B5691J3586r865k1508L645P693k1039L498j6310k9994l1276J7645K5019M788
6246b8427O175j9848R495q509k7174m0160j8738Q303K6629J0997k8997K4974L4228
6233e1052M4530J7138K741m8754K0965l154l8870K4816k5751J2985K7156J6259
6221i91M488j0766j2936L198O781K952j2900J8503K2640r904K1053j5999n918
$$ plain form
6208 10201 19669 -14951 -4540 -2293 -31108 -11857 6467 46845 36034 24541 16209 31401
6196 31401 38389 44146 58312 88147 38807 23567 56986 75837 42262 16663 -27315 -38708
6184 -38708 -19198 -27185 -9394 10388 5890 -8726 -44335 -51456 -28873 -9371 -7365 -13851 -51269
6171 -51269 -28853 -26999 -26280 -16098 18955 23145 40024 33350 -43001 -51003 -38239 -13251 -20071
6158 -20071 -42040 -23958 -20145 -41803 -45469 -30436 -15358 -21387 -13092 2386 22855 4847 -11443
6145 -11443 -14199 17743 16190 42990 1442 -18942 8479 44180 -10531 -36562 13810 48665
6133 48665 84792 59077 17052 -2080 1857 -20442 -33265 -47267 -37594 -23520 -34476 -72460
6121 -72460 -74076 -74700 -79024 -78858 -71612 -62863 -50102 -43813 -28736 3740 30323 9208 2755 18764
$$ packed form
6208A0201R468l4620J0411K247k8815J9251J8324M0378j0811j1493q332J5192
6196C1401O988N757J4166K9835m9340j5240L3419J8851l3575k5599m3978j1393
6184c8708J9510p987J7791J9782m498j4616l5609p121K2583J9502K006o486l7418
6171e1269K2416J854P19J0182L5053M190J6879o674p6351q002J2764K4988o820
6158b0071k1969J8082L813k1658l666J5033J5078o029Q295J5478K0469j8008j6290
6145a1443k756L1942j553K6800m1548k0384K7421L5701n4711k6031N0372L4855
6133D8665L6127k5715m2025j9132L937k2299j2823j4002R673J4074j0956l7984
6121g2460j616o24m324J66P246Q749J2761O289J5077L2476K6583k1115o453J6009
$$ plain form
6107 18764 20004 4164 -22647 -33430 -81091 -86516 -81843 -64016 -61027 -38267 -710 24043 18706
6094 18706 -37544 -54387 -61682 -17813 11162 8970 13188 -10122 13554 -15290 14998 48676
6082 48676 68201 62654 34137 20960 12967 21958 4048 -22983 -28140 -91676 -87992 -57414 -43294
6069 -43294 -19971 -3968 -29620 -13562 50384 64478 53511 29607 34383 -8994 -32587 -26262
6057 -26262 -11303 -855 -33675 -46056 -64661 -109311 -83005 -63223 -20383 -11967 -52997 -77127
6045 -77127 -72345 -64342 -51622 -11861 -18291 -24361 -40250 -46574 -56055 -79095 -72642 -7366 -57082
6032 -57082 -92419 -32661 -9480 -33482 -36868 -15621 -7845 -29488 -39248 -59849 -52365 -50357 -46238
6019 -46238 -20222 3880 39461 57740 -729 -15730 -7111 1812 13303 29838 22206 -10376
$$ packed form
6107A8764J240j5840k6811j0783m7661n425M673J7827K989K2760L7557K4753n337
6094A8706n6250j6843p295M3869K8975k192M218k3310K3676k8844L0288L3678
6082D8676J9525n547k8517j3177p993Q991j7910k7031n157o3536L684L0578J4120
6069d3294K3323J6003k5652J6058O3946J4094j0967k3904M776m3377k3593O325
6057b6262J4959J0448l2820j2381j8605m4650K6306J9782M2840Q416m1030k4130
6045g7127M782Q003J2720L9761o430o070j5889o324r481k3040O453O5276m9716
6032e7082l5337N9758K3181k4002l386K1247P776k1643r760k0601P484K008M119
6019d6238K6016K4102L5581J8279n8469j5001Q619Q923J1491J6535p632l2582
$$ plain form
6007 -10376 -21216 -32788 -47608 16511 33847 5224 -21664 -3243 38985 54680 67981 26163
5995 26163 26095 75142 73462 52026 21167 16110 28407 29774 28930 23353 19294 -9234 9102 17219
5981 17219 4447 -30056 -71922 -73967 -47905 -28792 -29009 -48226 -25659 -6454 418 20042 43705
5968 43705 53290 47579 -18134 -38904 -20450 -15056 -30263 -36732 -37065 -15808 -27264 -52192 -24669
5955 -24669 9632 -14715 -27660 -21999 -10801 -18580 -46176 -1989 15072 12121 32999 27877 9767
5942 9767 21440 32038 41602 -4131 -54620 -37436 -40867 -71315 -35396 14972 51952 34092
5930 34092 -5544 3393 -5139 -17561 -68880 -68443 -28517 8582 43562 35213 24350 10215 28773
5917 28773 46154 38679 22406 27917 20208 -9662 -23844 -30359 -43301 -69297 -67270 -52626 -38857
$$ packed form
6007a0376j0840j1572j4820O4119J7336k8623k6888J8421M2228J5695J3301m1818
5995B6163o8M9047j680k1436l0859n057J2297J367q44n577m059k8528J8336Q117
5981A7219j2772l4503m1866k045K6062J9113k17j9217K2567J9205O872J9624K3663
5968D3705R585n711o5713k0770J8454N394j5207o469l33K1257j1456k4928K7523
5955b4669L4301k4347j2945N661J1198p779k7596M4187J7061k951K0878n122j8110
5942I767J1673J0598R564m5733n0489J7184l431l0448L5919N0368L6980j7860
5930C4092l9636Q937q532j2422n1319M37L9926L7099L4980q349j0863j4135J8558
5917B8773J7381p475j6273N511p709k9870j4182o515j2942k5996K027J4644J3769
$$ plain form
5904 -38857 -63694 -33518 -42368 -49865 -36085 -17952 -19015 -18096 -9151 21881 31336 -7467 -50006
5891 -50006 -39335 -44382 -47007 -36659 -73554 -80841 -83460 -83060 -58444 -62002 -52847 -13678 7685
5878 7685 37937 18413 -5856 6197 33362 4552 3020 -16409 -17031 -36823 -52646 -48018 -40656
5865 -40656 -41544 -38944 -20213 -48013 -79212 -77344 -67001 -61372 -37931 -11994 -16603 -14782 -26162
5852 -26162 -65106 -36132 -28540 -50450 -29634 -13137 9598 -8530 -19452 6283 -4711 3077
5840 3077 21487 27546 9309 -23660 36221 79354 85645 38418 22272 42775 46208 40688 6365
5827 6365 2374 4024 -11556 -14655 -9870 6822 -25186 -26550 -6115 -10550 -1826 -35019 -43490 -36095
5813 -36095 -24122 -45401 7308 26472 5681 -5693 -5494 -14281 -59626 -50506 -53598 -42317 31461
$$ packed form
5904c8857k4837L0176q850p497J3780J8133j063R19Q945L1032R455l8803m2539
5891e0006J0671n047k625J0348l6895p287k619M00K4616l558R155L9169K1363
5878G685L0252j9524k4269J2053K7165k8810j532j9429o22j9792j5823M628P362
5865d0656q88K600J8731k7800l1199J868J0343N629K3441K5937m609J821j1380
5852b6162l8944K8974P592k1910K0816J6497K2735j8128j0922K5735j0994P788
5840C077J8410O059j8237l2969N9881M3133O291m7227j6146K0503L433n520l4323
5827F365l991J650j5580l099M785J6692l2008j364K0435m435Q724l3193q471P395
5813c6095J1973k1279N2709J9164k0791j1374J99q787m5345R120l092J1281P3778
$$ plain form
5800 31461 54079 12521 39634 65399 13858 4555 20190 2359 25824 -11445 -6159 -28581
5788 -28581 -55629 -81464 -115674 -83283 -69487 -28908 -17162 -16028 -18399 -10193 -16238 15938 35927
5775 35927 54065 54990 26794 -12483 -6748 -9014 4768 33662 14778 -460 -16002 -61228 -45753
5762 -45753 -4537 18912 -120 -33777 -61582 -48167 -45877 -25945 -4341 27066 55157 -1077
5750 -1077 -12264 -35797 -40545 -45203 -72420 -58890 -6925 5421 -2825 -11993 -26940 -16252 16226
5737 16226 21353 40602 29401 -10650 -34994 -49577 -23579 55000 79296 60380 -4886 -36502
5725 -36502 19124 60478 42803 8137 -23448 -25738 -15474 -11618 -21157 -10554 21813 27900 25603
5712 25603 48905 -6297 -17712 -28221 -22732 -21854 -54658 -20528 -30223 -2752 6331 -11919 -10867
$$ packed form
5800C1461K2618m1558K7113K5765n1541r303J5635j7831K3465l7269N286k2422
5788b8581k7048k5835l4210L2391J3796M0579J1746J134k371Q206o045L2176J9989
5775C5927J8138R25k8196l9277N735k266J3782K8894j8884j5238j5542m5226J5475
5762d5753M1216K3449j9032l3657k7805J3415K290J9932K1604L1407K8091n6234
5750a077j1187k3533m748m658k7217J3530N1965J2346q246r168j4947J0688L2478
5737A6226N127J9249j1201m0051k4344j4583K5998P8579K4296j8916o5266l1616
5725c6502N5626M1354j7675l4666l1585k290J0264L856r539J0603L2367O087k297
5712B5603K3302n5202j1415j0509N489Q78l2804L4130r695K7471R083j8250J052
$$ plain form
5699 -10867 -25412 3719 20631 -2032 -33072 -61478 -10413 36311 29092 9505 -14020 -19033
5687 -19033 -1176 -7558 -10733 -9713 -32642 -41974 -25015 -24322 -1424 -3647 -10597 4906 11181 319
5673 319 -3947 19295 -28664 -111104 -128584 -106135 -100944 -60436 -73550 -54539 -19797 -58695 -100160
5660 -100160 -84137 -73480 -46909 -21062 -12857 7994 -19906 -45428 -58390 -51388 -47913 -60707
5648 -60707 -32658 -10908 -3090 9988 -6640 7056 15569 27991 -6686 -55319 -64060 -94628
5636 -94628 -84124 -101536 -134342 -111739 -57158 -40522 -32928 -61620 -47295 -60861 -53780 -51079
5624 -51079 -19344 -19624 -48852 -74022 -22575 -35472 -37633 -12313 3818 18068 23874 4214 17961
5611 17961 39894 -7713 -65406 -56325 -29607 -43329 -77396 -47521 -32426 -23160 -35879 -22285
$$ packed form
5699a0867j4545K9131J6912k2663l1040k8406N1065M6724p219j9587k3525n013
5687a9033J7857o382l175J020k2929r332J6959O93K2898k223o950J5503O275j0862
5673C19m266K3242m7959q2440j7480K2449N191M0508j3114J9011L4742l8898m1465
5660a00160J6023J0657K6571K5847Q205K0851k7900k5522j2962P002L475j2794
5648f0707K8049K1750P818J3078j6628J3696Q513J2422l4677m8633q741l0568
5636i4628J0504j7412l2806K2603N4581J6636P594k8692J4325j3566P081K701
5624e1079L1735k80k9228k5170N1447j2897k161K5320J6131J4250N806j9660J3747
5611A7961K1933m7607n7693R081K6718j3722l4067K9875J5095R266j2719J3594
$$ plain form
5599 -22285 -10227 -3285 -24763 -63615 -54156 -21817 -48750 -67596 -100285 -116834 -61610 5400
5587 5400 -7656 -14575 35899 -300 -36785 -16196 28642 19490 11285 228 -6157 2492 27826
5574 27826 42208 11485 24309 31710 -10401 -9704 -12037 -16154 -710 2154 15108 57143 52578
5561 52578 20620 25735 24143 12236 -10199 -3382 -9345 -24627 8764 -45040 -80134 -51272 -29769
5548 -29769 -2727 15479 378 2721 19295 20552 21907 38141 31228 42405 48945 24671 -6803
5535 -6803 -18543 -83356 -75873 -69651 -78623 -38346 -45130 -44550 -45049 -37736 -28703 6962 24219 -1253
5521 -1253 -24490 -49712 -74113 -38686 4562 1664 -14487 -14610 -40449 -38996 -38596 -27514 -10813
5508 -10813 -9954 -41617 -48720 -27969 -49660 -41862 2777 17264 2808 -9659 -11526 -12454 -49825
$$ packed form
5599b2285J2058O942k1478l8852R459L2339k6933j8846l2689j6549N5224O7010
5587E400j3056o919N0474l6199l6485K0589M4838r152q205j1057o385Q649K5334
5574B7826J4382l0723J2824P401m2111O97k333m117J5444K864J2954M2035m565
5561E2578l1958N115j592j1907k2435O817n963j5282L3391n3804l5094K8862K1503
5548b9769K7042J8206j5101K343J6574J257J355J6234o913J1177O540k4274l1474
5535f803j1740o4813P483O222q972M0277o784N80m99P313R033L5665J7257k5472
5521a253k3237k5222k4401L5427M3248k898j6151j23k5839J453M00J1082J6701
5508a0813Q59l1663p103K0751k1691P798M4639J4487j4456j2467j867r28l7371
$$ plain form
5495 -49825 -44596 -30535 -36199 -40975 -71445 -90233 -102197 -80193 -2469 10368 9916 30214 64944
5482 64944 52678 14282 -20212 2590 -18856 -11750 23444 -6516 18331 16623 -292 -6040
5470 -6040 22504 -9271 -82698 -71770 -51672 -11151 -2602 -40693 -45194 -10246 5173 -38592
5458 -38592 -41058 771 10120 23757 -24605 -10250 17271 -15316 -43532 -90292 -56575 -64890
5446 -64890 -97464 -84241 -68539 -17687 -22762 -22056 -31023 -33605 -62997 -74012 -52679 21582 15971
5433 15971 12266 -2356 -34827 -77901 -63984 -31445 -25533 -18586 -20094 -18026 -15673 16435 12529
5420 12529 -30597 -61580 -25480 12099 -12874 5445 53984 81301 10107 -14027 -3205 -5178
5408 -5178 -75361 -66395 -36961 -61062 -86816 -82990 -83642 -31871 -908 -19073 -21117 -11282 991
$$ packed form
5495d9825N229J4061n664m776l0470j8788j1964K2004P7724J2837m52K0298L4730
5482F4944j2266l8396l4494K2802k1446P106L5194k9960K4847j708j6915n748
5470f040K8544l1775p3427J0928K0098M0521Q549l8091m501L4948J5419m3765
5458c8592k466M1829R349J3637m8362J4355K7521l2587k8216m6760L3717q315
5446f4890l2574J3223J5702N0852n075P06q967k582k9392j1015K1333P4261n611
5433A5971l705j4622l2471m3074J3917L2539N912O947j508K068K353L2108l906
5420A2529m3126l0983L6100L7579k4973J8319M8539K7317p1194k4134J0822j973
5408e178p0183Q966K9434k4101k5754L826o52N1771L0963j8165k044R835J2273
$$ plain form
5395 991 10773 11306 -7919 -629 27138 22459 -349 -52795 -82587 -68588 12254 27265 43424
5382 43424 28860 23595 31149 43101 67939 93969 47431 -2578 -58234 -79768 -59726 -47420
5370 -47420 -16487 977 31374 16789 1648 -5529 -11854 -18914 -25602 -45218 -26483 -9030 9152
5357 9152 -15214 36005 28719 40621 40032 15703 8699 27193 15435 19608 77539 81658 79873
5344 79873 74445 37644 14871 -37743 -33649 -18166 -12280 -25576 -16091 -18184 -40705 -11316 -3154
5331 -3154 12612 41918 20499 -13919 -56799 -84408 -70176 -53689 -103670 -99674 -44771 -72057
5319 -72057 -87300 -19701 13237 478 -23695 -33465 -44082 -39088 -41551 -54527 -47831 -33438 -46045
5306 -46045 -66224 -17096 17055 -35625 -78516 -61494 -37480 -1568 -5570 -13620 -19827 33423
$$ packed form
5395I91R782N33j9225P290K7767m679k2808n2446k9792J3999Q0842J5011J6159
5382D3424j4564n265P554J1952K4838K6030m6538n0009n5656k1534K0042J2306
5370d7420L0933J7464L0397j4585j5141p177o325p060o688j9616J8735J7453J8182
5357I152k4366N1219p286J1902n89k4329p004J8494j1758M173N7931M119j785
5344G9873n428l6801k2773n2614M094J5483N886j3296R485k093k2521K9389Q162
5331c154J5766K9306k1419l4418m2880k7609J4232J6487m9981L996N4903k7286
5319g2057j5243O7599L2938j2759k4173r770j0617M994k463j2976O696J4393j2607
5306d6045k0179M9128L4151n2680m2891J7022K4014L5912m002q050o207N3250
$$ plain form
5294 33423 72111 44881 -7356 -15618 -19631 11670 4220 -8423 32594 15898 33240 12192
5282 12192 694 23474 66462 73369 49587 27396 27970 74353 50902 25247 9872 597 -7399
5269 -7399 -15430 -2288 4212 2649 20415 13770 26519 8627 -34139 -4007 -14771 -84468 -91655
5256 -91655 -42572 9756 40720 29033 30807 50992 52150 38820 -7729 -12425 6223 15247 24668
5243 24668 181 -5806 19968 -6230 -34093 -48153 -24479 -18615 -194 -27162 -18663 -7618
5231 -7618 -40523 -27705 -18925 38310 43831 22159 13477 -35668 -66211 -66400 -34592 -19342 16793
5218 16793 4726 -12434 -20911 -18533 -5666 8119 -18111 -9517 -29723 -39429 -58924 -43060 9553
5205 9553 58835 44363 47429 53842 44083 39634 33990 25549 15841 22 -19683 -13281 -11830 4914
$$ packed form
5294C3423L8688k7230n2237q262m013L1301p450j2643M1017j6696J7342k1048
5282A2192j1498K2780M2988O907k3782k2191N74M6383k3451k5655j5375r275p996
5269g399q031J3142O500j563J7766o645J2749j7892m2766L0132j0764o9697p187
5256i1655M9083N2328L0964j1687J774K0185J158j3330m6549m696J8648R024R421
5243B4668k4487n987K5774k6198k7863j4060K3674N864J8421k6968Q499J1045
5231g618l2905J2818Q780N7235N521k1672q682m9145l0543j89L1808J5250L6135
5218A6793j2067j7160q477K378J2867J3785k6230Q594k0206r706j9495J5864N2613
5205I553M9282j4472L066O413r759m449n644q441r708j5819j9705O402J451J6744
$$ plain form
5191 4914 5224 25149 -3515 -24683 -11936 7247 44856 20200 -14889 -36725 -58259 -47141
5179 -47141 -47759 -22747 19060 27717 51171 56664 40885 27514 16014 25319 18779 -2431 -9249
5166 -9249 -2969 -1648 -9180 2508 -17708 -39012 -21487 838 -25743 -5705 24506 46219 5208
5153 5208 -6547 42707 27061 6544 -10215 -18591 -33431 -56798 -43023 -40177 -3733 -16836
5141 -16836 -70016 -76233 -60572 14340 67753 61979 30204 26999 17662 1377 33948 44732 13975
5128 13975 -6262 855 12996 25385 -20428 -21341 4919 17123 16944 -6194 20322 29701 22284
5115 22284 40632 51421 71057 86732 54380 39246 46934 34409 885 -23225 1094 44413
5103 44413 81240 30664 -17352 -18004 -299 32926 68376 95365 81963 -5922 -55742 -32792
$$ packed form
5191D914L10J9925k8664k1168J2747J9183L7609k4656l5089k1836k1534J1118
5179d7141o18K5012M1807Q657K3454N493j5779j3371j1500R305o540k1210o818
5166i249O280J321p532J1688k0216k1304J7525K2325k6581K0038L0211K1713m1011
5153E208j1755M9254j5646k0517j6759q376j4840k3367J3775K846L6444j3103
5141a6836n3180o217J5661P4912N3413n774l1775l205r337j6285L2571J0784l0757
5128A3975k0237P117J2141J2389m5813r13K6260J2204j79k3138K6516R379p417
5115B2284J8348J0789J9636J5675l2352j5134P688j2525l3524k4110K4319M3319
5103D4413L6827n0576m8016o52J7705L3225L5450K6989j3402q7885m9820K2950
$$ plain form
5091 -32792 -35779 -70031 -41482 -24161 -22969 -31447 -19082 5623 -4374 -8588 -59479 -72042 -49773
5078 -49773 -33916 -22675 -7100 1947 22213 13790 -36368 -18854 -1960 -4934 2509 -21409 -27281
5065 -27281 -29999 -10275 -1426 7249 10806 30354 29848 57575 125414 80420 36425 26381 24716
5052 24716 2363 -20836 -5160 -5072 -37913 -53765 -51678 -25440 -35979 -44505 6747 27716 44112
5039 44112 20634 -24089 -68413 -66374 -406 11583 18589 22100 2037 -24858 -62165 -68785 -14424
5026 -14424 23823 66469 64891 49218 -20013 -76225 -75737 -46395 -55343 -70790 -58547 791 43125
5013 43125 -14890 -34400 75 15154 21335 -2239 32745 63891 23209 3185 19068 -34397
5001 -34397 -39811 -1378 -16279 -5924 5772 -8111 4190 -8091 -6761 -18496 17193 48154
$$ packed form
5091c2792k987l4252K8549J7321J192q478J2365K4705r997m214n0891j2563K2269
5078d9773J5857J1241J5575R047K0266q423n0158J7514J6894k974P443k3918n872
5065b7281k718J9724Q849Q675L557J9548n06K7727O7839m4994m3995j0044j665
5052B4716k2353k3199J5676Q8l2841j5852K087K6238j0539q526N1252K0969J6396
5039D4112k3478m4723m4324K039O5968J1989P006L511k0063k6895l7307o620N4361
5026a4424L8247M2646j578j5673o9231n6212M88K9342q948j5447J2243N9338M2334
5013D3125n8015j9510L4475J5079O181k3574L4984L1146m0682k0024J5883n3465
5001c4397n414L8433j4901J0355J1696j3883J2301j2281J330j1735L5689L0961
$$ plain form
4989 48154 19162 -20182 -56521 -47168 -43528 -10913 -8633 7383 13798 -30 8002 23135 29513
4976 29513 58366 59340 54856 23390 27259 24876 39857 -15078 -42997 -10679 12304 15589 -5854
4963 -5854 -21470 -21299 -4312 18458 26719 10839 13561 12361 21348 -14479 -58913 -56252 -72136
4950 -72136 -61752 -46224 -16148 19148 7902 -38583 -38616 7299 -4439 -29786 -19374 10775
4938 10775 -3048 -7816 -6315 -25551 -57917 -52939 -40411 -8367 6879 -24784 -49997 -43372 -17643
4925 -17643 -13273 -24428 -11057 -29008 -48232 -28167 -32308 -18562 -13317 611 -5418 -272 22673
4912 22673 -4236 -59416 -57346 -9978 -26709 -26305 -77016 -85549 -74745 -74332 -54759 -31701 -5603
4899 -5603 -36338 -76060 -77681 -58599 -71848 -118562 -106763 -58918 -3545 3180 38429 71051
$$ packed form
4989D8154k8992l9344l6339R353L640L2615K280J6016O415j3828Q032J5133O378
4976B9513K8853R74m484l1466L869k383J4981n4935k7919L2318K2983L285k1443
4963e854j5616J71J6987K2770Q261j5880K722j200Q987l5827m4434K661j5884
4950g2136J0384J5528L0076L5296j1246m6485l3M5915j1738k5347J0412L0149
4938A0775j3823m768J501j9236l2366M978J2528L2044J5246l1663k5213O625K5729
4925a7643M370j1155J3371j7951j9224K0065m141J3746N245J3928o029N146K2945
4912B2673k6909n5180K070M7368j6731M04n0711q533J0804M13J9573K3058K6098
4899e603l0735l9722j621J9082j3249m6714J1799M7845N5373O725L5249L2622
$$ plain form
4887 71051 63352 29578 34081 21325 -3608 6202 36738 20021 -9430 -15628 -5513 14754 30143
4874 30143 45874 -3438 -38043 -41134 -36776 -933 22166 41745 38484 12341 -8795 -28165
4862 -28165 -30626 -7913 6078 -2437 16103 -20106 -29417 22991 21017 -19829 2287 30537 -20249
4849 -20249 -10435 -28406 -50217 -45593 -51541 -55240 -21925 -54479 -45995 -36911 -66289 -46508 -70813
4836 -70813 -79255 -69342 -33085 21103 8120 -51794 -21249 16746 12595 -24765 -37826 -20405
4824 -20405 -11728 -32024 -21491 -56231 -41079 -7361 21303 85529 49230 33859 60787 47617
4812 47617 -10962 -21912 -58122 -122187 -123811 -69927 -24792 8205 -9563 -28283 -7995 38040
4800 38040 35385 -9589 -27789 -35937 -41165 -57925 -34968 -15287 -32993 -54038 -65978 -35701
$$ packed form
4887G1051p699l3774M503j2756k4933R810L0536j6717k9451o198J0115K0267J5389
4874C0143J5731m9312l4605l091M358L5843K3099J9579l261k6143k1136j9370
4862b8165k461K2713J3991q515J8540l6209r311N2408j974m0846K2116K8250n0786
4849b0249R814j7971k1811M624n948l699L3315l2554Q484R084k9378J9781k4305
4836g0813q442R913L6257N4188j2983n9914L0545L7995m151l7360j3061J7421
4824b0405Q677k0296J0533l4740J5152L3718K8664O4226l6299j5371K6928j3170
4812D7617n8579j0950l6210o4065j624N3884M5135L2997j7768j8720K0288M6035
4800C8040k655m4974j8200q148n228j6760K2957J9681j7706k1045j1940L0277
$$ plain form
4788 -35701 -2426 -28141 -5742 19707 28025 6196 14287 7575 13215 33269 28386 -10546 -6877
4775 -6877 -16697 -30743 -32026 -45921 -59107 -40920 -28783 -7919 27468 19473 2374 -62837 -82333
4762 -82333 -101223 -90571 -94126 -81509 -22598 18408 17204 2981 11343 22579 12911 -27389 -41945
4749 -41945 -59928 -42341 25551 58726 35584 9695 12276 36092 52799 52573 46466 54523 45266
4736 45266 66857 63563 38932 17610 45867 42569 -8123 -33597 -18302 4955 9876 -345
4724 -345 -30557 -50598 -61297 -45233 -18194 -5592 -10064 -24358 -15236 10495 -6975 -21755 -8001
4711 -8001 -23551 -48715 -63320 -46818 -21040 -18208 -4366 9014 40822 59313 38721 2041
4699 2041 -5024 -8741 -3481 21625 42537 23570 -10620 25104 62332 82882 88089 63819 54695
$$ packed form
4788c5701L3275k5715K2399K5449Q318k1829Q091o712N640K0054m883l8932L669
4775f877r820j4046j283j3895j3186J8187J2137K0864L5387p995j7099o5211j9496
4762h2333j8890J0652l555J2617N8911M1006j204j4223Q362J1236r668m0300j4556
4749d1945j7983J7587O7892L3175k3142k5889K581K3816J6707k26o107Q057r257
4736D5266K1591l294k4631k1322K8257l298n0692k5474J5295K3257M921j0221
4724c45l0212k0041j0699J6064K7039J2602m472j4294R122K5731j7470j4780J3754
4711h001j5550k5164j4605J6502K5778K832J3842J3380L1808J8491k0592l6680
4699B041p065l717N260K5106K0912j8967l4190L5724L7228K0550N207k4270r124
$$ plain form
4686 54695 75771 73495 48067 14732 595 -28142 -25585 -7264 5578 6587 -3616 -23828
4674 -23828 -20448 -9824 -9949 20890 30895 60176 79717 62485 68900 65337 39159 53951 72436
4661 72436 62306 65470 77652 42166 32440 47297 29363 -5003 -40063 -88825 -93431 -63202
4649 -63202 -22493 -14761 -35507 -9112 -40192 -32023 -15753 19982 45118 58457 17656 -16617
4637 -16617 -2731 -723 -8924 32838 28306 -23603 -83228 -70081 13500 15955 41744 84255 70047
4624 70047 70505 27093 35111 56002 46472 56185 40882 -764 -11249 -41707 -42763 -24495 25290
4611 25290 68999 76008 60805 27610 -29625 -54522 -11231 30963 31414 22434 17962 -17083 -13958
4598 -13958 15358 50351 32652 26731 40076 44212 42266 44195 15496 4538 -23487 -21246 -10703
$$ packed form
4686E4695K1076k276k5428l3335j4137k8737K557J8321J2842J009j0203k0212
4674b3828L380J0624j25L0839J0005K9281J9541j7232O415l563k6178J4792J8485
4661G2436j0130L164J2182l5486r726J4857j7934l4366l5060m8762m606L0229
4649f3202M0709P732k0746K6395l1080Q169J6270L5735K5136J3339m0801l4273
4637a6617J3886K008q201M1762m532n1909n9625J3147Q3581K455K5789M2511j4208
4624G0047M58m3412Q018K0891r530R713j5303m1646j0485l0458j056J8268M9785
4611B5290M3709P009j5203l3195n7235k4897M3291M2194M51q980m472l5045L125
4598a3958K9316L4993j7699n921J3345M136j946J929k8699j0958k8025K241J0543
$$ plain form
4585 -10703 27982 35375 17350 -6791 -9432 9071 14473 26638 6205 4181 30398 45082 14611
4572 14611 -42639 -12099 -24346 12260 23279 28434 41605 321 -43553 -48872 -65967 -50463
4560 -50463 12063 13914 15345 -2259 -2052 -21742 -26307 -59828 -79088 -69585 -27281 14628 21707
4547 21707 -3936 -5465 26414 20105 9763 37166 61085 10543 -32493 -6079 13520 34452
4535 34452 30741 23943 4301 -32957 -30799 9992 47051 671 -46322 -44478 -41982 -875 16596
4522 16596 28580 47756 44395 31778 12687 -18441 -30600 -51225 -37316 -5299 -1947 -13217
4510 -13217 -39352 -21396 -4304 -2678 22916 35294 30248 28485 34930 55135 60131 57957 26635
4497 26635 643 -5977 -30767 -31353 6413 52627 45610 11308 -8166 -24822 -18029 -32111 -69604
$$ packed form
4585a0703L8685P393j8025k4141k641J8503N402J2165k0433k024K6217J4684l0471
4572A4611n7250L0540j2247L6606J1019N155J3171m1284m3874n319j7095J5504
4560e0463O2526J851J431j7604K07j9690m565l3521j9260R503M2304M1909P079
4547B1707k5643j529L1879o309j0342K7403K3919n0542m3036K6414J9599K0932
4535C4452l711o798j9642l7258K158M0791L7059m6380m6993J844K496M1107J7471
4522A6596J1984J9176l361j2617j9091l1128j2159k0625J3909L2017L352j1270
4510a3217k6135J7956J7092J626K5594J2378n046j763O445K0205M996k174l1322
4497B6635k5992o620k4790n86L7766M6214p017l4302j9474j6656O793j4082l7493
$$ [...]
##END NTUPLES=NMR SPECTRUM
##END=
