##TITLE=Analysis number 310269
Compound Code cc 21746
Book Reference 440/24
Project Code adrs
Chemist Name craigr
##JCAMPDX= 6.0         $$ Bruker NMR JCAMP-DX V2.0
##DATA TYPE= NMR SPECTRUM
##DATA CLASS= NTUPLES
##ORIGIN= Bruker BioSpin GmbH
##OWNER= NMR
$$ XWIN-NMR		Version 3.5
$$ Wed Jun 15 13:53:57 2005 GMT Daylight Time (UT+1h)  MAYBRIDGE\NMR@NMR_250MHZ
##.OBSERVE FREQUENCY= 250.131544655141
##.OBSERVE NUCLEUS= ^1H
##.ACQUISITION MODE= SIMULTANEOUS (DQD)
##.ACQUISITION SCHEME= undefined
##.AVERAGES= 16
##.DIGITISER RES= 18
##SPECTROMETER/DATA SYSTEM= dpx250
##.PULSE SEQUENCE= zg30
##.SOLVENT NAME= CDCl3
##.SHIFT REFERENCE= (INTERNAL, CDCl3, 0, 16.4642)
##AUDIT TRAIL= $$ (NUMBER, WHEN, WHO, WHERE, WHAT)
$$ ##TITLE= Audit trail, XWIN-NMR		Version 3.5
$$ ##JCAMPDX= 5.01
$$ ##ORIGIN= Bruker BioSpin GmbH
$$ ##OWNER= NMR
$$ C:\u/data/dgb/nmr/ADRS/4080/pdata/1/auditp.txt
$$ ##AUDIT TRAIL=  $$ (NUMBER, WHEN, WHO, WHERE, WHAT)
(   1,<2005-06-15 13:53:36.64 +100>,<MAYBRIDGE\NMR>,<NMR_250MHZ>,
      <created by zg, POWCHK disabled, PULCHK disabled
       configuration hash MD5:
       62 19 C7 07 E1 42 D1 B7 37 6C 3D D0 77 39 F9 E6
       data hash MD5: 64K
       AC CD 4E C2 29 40 B9 D7 95 76 83 08 DE 50 5F 39>)
(   2,<2005-06-15 13:53:48.86 +100>,<MAYBRIDGE\NMR>,<NMR_250MHZ>,
      <Start of raw data processing
       ef LB = 0.3 FT_mod = 6 PKNL = 1 SI = 32K 
       data hash MD5: 32K
       AA 3D 4A 88 04 B5 C7 84 45 02 D6 EA E3 9D 57 DC>)
(   3,<2005-06-15 13:53:50.68 +100>,<MAYBRIDGE\NMR>,<NMR_250MHZ>,
      <apk 
       data hash MD5: 32K
       FA 90 3B 30 90 DD E4 47 AC 41 49 94 26 6B 1B 7B>)
(   4,<2005-06-15 13:53:51.38 +100>,<MAYBRIDGE\NMR>,<NMR_250MHZ>,
      <abs ABSG = 5 
       data hash MD5: 32K
       82 5B 19 70 81 D0 6F 63 78 CD 52 57 6D 1D 40 AD>)
$$ ##END=
$$ 
$$ hash MD5
$$ 6C FC 52 55 5E D5 93 72 3F 69 A3 96 CC EF 97 C1
##$RELAX= 
##$RELAX= 
##$RELAX= 
##$RELAX= 
##$RELAX= 
##$RELAX= 
##$RELAX= 
$$ Bruker specific parameters
$$ --------------------------
##$DU= <C:\u>
##$EXPNO= 4080
##$NAME= <ADRS>
##$PROCNO= 1
##$TYPE= <nmr>
##$USER= <dgb>
##$AMP= (0..31)
100 100 100 100 100 100 100 100 100 100 100 100 100 100 100 100 100 100 
100 100 100 100 100 100 100 100 100 100 100 100 100 100 
##$AQSEQ= 0
##$AQ_mod= 3
##$AUNM= <au_zg>
##$AUTOPOS= <20 >
##$BF1= 250.13
##$BF2= 250.13
##$BF3= 250.13
##$BF4= 250.13
##$BF5= 500.13
##$BF6= 500.13
##$BF7= 500.13
##$BF8= 500.13
##$BYTORDA= 1
##$CFDGTYP= 0
##$CFRGTYP= 5
##$CHEMSTR= <none>
##$CNST= (0..31)
1 1 145 1 1 1 1 1 1 1 1 1 1 1 1 1 1 1 1 1 1 1 1 1 1 1 1 1 1 1 1 1 
##$CPDPRG= <>
##$CPDPRG1= <>
##$CPDPRG2= <>
##$CPDPRG3= <>
##$CPDPRG4= <mlev>
##$CPDPRG5= <mlev>
##$CPDPRG6= <mlev>
##$CPDPRG7= <mlev>
##$CPDPRG8= <mlev>
##$CPDPRGB= <>
##$CPDPRGT= <>
##$D= (0..31)
0 1 0 0 0 0 0 0 0 0.06 0 0 0 0 0 0 0.0002 0 0 0 0 0 0 0 0 0 0 0 0 0 0 
0 
##$DATE= 1118840015
##$DBL= (0..7)
120 120 120 120 120 120 120 120 
##$DBP= (0..7)
150 150 150 150 150 150 150 150 
##$DBP07= 0
##$DBPNAM0= <>
##$DBPNAM1= <>
$$ [...]
##$SUBNAM7= <"">
##$SUBNAM8= <"">
##$SUBNAM9= <"">
##$SW= 20.6930455092707
##$SWIBOX= (0..15)
0 0 3 0 0 0 0 0 0 0 0 0 0 0 0 0 
##$SW_h= 5175.983436853
##$TD= 65536
##$TD0= 1
##$TE= 295.16
##$TE2= 300
##$TE3= 300
##$TEG= 300
##$TL= (0..7)
0 120 120 120 120 120 120 120 
##$TP= (0..7)
150 150 150 150 150 150 150 150 
##$TP07= 0
##$TPNAME0= <>
##$TPNAME1= <>
##$TPNAME2= <>
##$TPNAME3= <>
##$TPNAME4= <>
##$TPNAME5= <>
##$TPNAME6= <>
##$TPNAME7= <>
##$TPOAL= (0..7)
0.5 0.5 0.5 0.5 0.5 0.5 0.5 0.5 
##$TPOFFS= (0..7)
0 0 0 0 0 0 0 0 
##$TUNHIN= 0
##$TUNHOUT= 0
##$TUNXOUT= 0
##$USERA1= <user>
##$USERA2= <user>
##$USERA3= <user>
##$USERA4= <user>
##$USERA5= <user>
##$V9= 5
##$VALIST= <valist>
##$VCLIST= <CCCCCCCCCCCCCCC>
##$VD= 0
##$VDLIST= <DDDDDDDDDDDDDDD>
##$VPLIST= <PPPPPPPPPPPPPPP>
##$VTLIST= <TTTTTTTTTTTTTTT>
##$WBST= 1024
##$WBSW= 4
##$XGAIN= (0..3)
0 0 0 0 
##$XL= 0
##$YL= 0
##$YMAX_a= 392272
##$YMIN_a= -513668
##$ZGOPTNS= <>
##$ZL1= 120
##$ZL2= 120
##$ZL3= 120
##$ZL4= 120
##$ABSF1= 16.46417
##$ABSF2= -4.229002
##$ABSG= 5
##$ABSL= 3
##$ALPHA= 0
##$AQORDER= 0
##$ASSFAC= 0
##$ASSFACI= 0
##$ASSFACX= 0
##$ASSWID= 0
##$AUNMP= <proc_1d>
##$AZFE= 0.1
##$AZFW= 0.1
##$BCFW= 0
##$BC_mod= 0
##$BYTORDP= 0
##$COROFFS= 0
##$CY= 12.5
##$DATMOD= 1
##$DC= 0
##$DFILT= <>
##$DTYPP= 0
##$F1P= 14.0000005364418
##$F2P= -0.99999901652339
##$FCOR= 0.5
##$FTSIZE= 32768
##$FT_mod= 6
##$GAMMA= 0
##$GB= 0
##$INTBC= 1
##$INTSCL= 1
##$ISEN= 128
##$LB= 0.3
##$LEV0= 0
##$LPBIN= 0
##$MAXI= 10000
##$MC2= 0
##$MEAN= 0
##$ME_mod= 0
##$MI= 0
##$NCOEF= 0
##$NC_proc= -3
##$NLEV= 6
##$NOISF1= 0
##$NOISF2= 0
##$NSP= 0
##$NTH_PI= 0
##$NZP= 0
##$OFFSET= 16.46417
##$PC= 1
##$PHC0= -75.8521
##$PHC1= 4.732919
##$PH_mod= 1
##$PKNL= yes
##$PPARMOD= 0
##$PSCAL= 4
##$PSIGN= 0
##$REVERSE= no
##$SF= 250.130014463422
##$SI= 32768
##$SIGF1= 0
##$SIGF2= 0
##$SINO= 400
##$SIOLD= 32768
##$SREGLST= <1H.CDCl3>
##$SSB= 0
##$STSI= 32768
##$STSR= 0
##$SW_p= 5175.98343685301
##$SYMM= 0
##$S_DEV= 0
##$TDeff= 65536
##$TDoff= 0
##$TI= <Analysis number 999999
Compound Code 99
Book Reference 9
Project Code 9>
##$TILT= no
##$TM1= 0
##$TM2= 0
##$TOPLEV= 0
##$USERP1= <user>
##$USERP2= <user>
##$USERP3= <user>
##$USERP4= <user>
##$USERP5= <user>
##$WDW= 1
##$XDIM= 32768
##$YMAX_p= 265408282
##$YMIN_p= -81276
$$ End of Bruker specific parameters
$$ ---------------------------------
##NTUPLES= NMR SPECTRUM
##VAR_NAME=  FREQUENCY,     SPECTRUM/REAL,   SPECTRUM/IMAG
##SYMBOL=    X,             R,               I
##VAR_TYPE=  INDEPENDENT,   DEPENDENT,       DEPENDENT
##VAR_FORM=  AFFN,          ASDF,            ASDF
##VAR_DIM=   32768,         32768,           32768
##UNITS=     HZ,            ARBITRARY UNITS, ARBITRARY UNITS
##FACTOR=    0.157963299565203, 1,           1
##FIRST=     4118.18319427067, 0,            0
##LAST=      -1057.80024258234, 0,           0
##MIN=       -1057.80024258234, -81276,      0
##MAX=       4118.18319427067, 265408282,    0
$$ Real data points
##PAGE= N=1
##DATA TABLE= (X++(R..R)), XYDATA
$$ [...]
16517a1736r305q023N898N555j1751R032m249l307N976j4024O964l29j0835J3225
16503b6909N746P672J3682K5756J4305j5614q682j3995l126J7880R571j5449j3065
16490b228l623L0830J0363k1062j0740r998j6998q557J9907P070J5551O115j3449
16477C181k1719J5189J4609j7457M88J1555L496P180K907j0534j8723j629Q250
16464c207m895q115k1491J1860N629J1928O374j4902j45L338p559p78q511Q882
16450b1592l756l917N156L748n064Q005J2232Q199K098j3054j5027k746N394J0026
16436a0298l437o841K0361Q807M937M189o36l046k1241n01J966o4j2965l530K2648
16421C49L748q161M564P465j6948j6670Q659J2408l081J0607J6476N854k9786
$$ y = [-11736, -21041, -29064, -23166, -17611, -29362, -20330, -24579, -27886, -21910, -35934, -28970, -29299, -40134, -26909, -21163, -13491, 191, 25947, 40252, 24638, 15956, 1961, -1165, 16715, 26286, 10837, -2228, -5851, 24979, 35342, 14280, 3540, -6458, -23456, -32013, -12106, -5036, 10515, 16630, 3181, -18538, -3349, 11260, -6197, -5709, 5846, 9342, 16522, 19429, 8895, -9828, -11457, -3207, -8102, -16217, -37708, -25848, -20219, -8291, -1917, -16819, -16964, -13626, -21185, -21963, -30474, -21592, -25348, -29265, -24109, -20361, -25425, -17420, -5188, 3011, 5109, -7945, -22972, -25718, -20324, -10298, -13735, -20576, -215, 8592, 13529, 17718, 17082, 14036, -7205, -7706, -5740, -5804, -18769, -22299, 349, 4097, -4064, 500, 7965, -8983, -25653, -16994, -4586, -7667, 2940, 19416, 25270, -4516]
16408d516J524M468M949R80k3814k997J6428q068k4408L130Q159J2221k554j5835
16394c0333M126o3J0077m525j5140J3159J5313O927J3028j2841q750j0368j2436
16381c1826N104J2676L733O175r994n706l784J0681K2164J1110k2915k1155j1036
16368c4773L0303J7816r969j1607n668K218p422R315r583p111l616J9875J5835
16355E613p631L177j4459r455j686O381j0843Q171K0431Q256l586p634n258P594
16341i29K687O384n898R269j7030k927J678j4610j1574N909L690o973O603M090
16327a9631J2258J065l594r088o494J004q424L549m596Q545q014N514K4890j2403
16313a5419p445L795L866L14o860q116Q36k842l998J4125J0060R59q039J268J5020
$$ y = [-4516, -2992, 1476, 6425, 7405, -16409, -19406, -2978, -11046, -35454, -32324, -24165, -11944, -14498, -30333, -26207, -26270, -16193, -20718, -35858, -22699, -7386, -459, 12569, -272, -9022, -19390, -31826, -26722, -14046, -10313, -4138, -14132, -19838, -23622, -12941, 9223, 20333, -2582, -23737, -34773, -4470, 13346, 3377, -8230, -13898, -11680, -19102, -9787, -19370, -26481, -30097, -10222, 5613, -2018, 1159, -13300, -22755, -24441, -18060, -28903, -20732, -301, 7955, 4369, -3265, -8523, -929, 1758, 8142, 2244, 11513, -5517, -8444, -6766, -21376, -32950, -27041, -23351, -30324, -23721, -19631, -7373, -6308, -9902, -18990, -25484, -24480, -32904, -29355, -33951, -25406, -33420, -27906, -3016, -15419, -22864, -19069, -15203, -14889, -21749, -29865, -29029, -31871, -35869, -21744, -11684, -10725, -18764, -17496, -2476]
16298b476J2963j1523k012k6605j8544j0606K3240K2860J9303m918j2509n97K219
16285i205q384R459N862j4275k597k039j3047m045R337O553N441R400p720n476
16271b0736j3855L192J5835J3685j1774J0253k911n628M457N009o356J7J5925
16258G113r150O526o920j1092J3597j0081L187L847J2498k39j1478o530q66l197
16244a2785p120k358j7912j0450P238J3060K387J0892n068O231l033p980j8670
16231d5568J149J4321J0729J5252J0608O333n191K108j8411k1426q471J386L297
16218c3884J984R092J7776L984o010r818m424L837L303N822P780r511K0742R948
16204B0621j3293j2416j281j7942K7713L1626L471k0022j6776q217j5877l818
$$ y = [-2476, 10487, -1036, -3048, -29653, -48197, -58803, -35563, -12703, 6600, 1682, -10827, -11424, -9205, -17589, -8130, -2268, -16543, -19140, -21179, -34226, -38271, -28934, -22381, -16940, -7540, -15260, -20736, -34591, -31399, -15564, -1879, -13653, -3400, -6311, -11939, -7482, -2473, -8829, -8812, 7113, -2037, 4489, -2431, -13523, 74, -10007, -6820, -2973, 9525, 9286, -2192, -8722, -9588, -12785, -19905, -22263, -40175, -50625, -43387, -30327, -27940, -17048, -22116, -15885, -18918, -26898, -45568, -44419, -30098, -19369, -4117, 6491, 12824, 7633, 9741, -8670, -30096, -38567, -37181, -33884, -31900, -22808, -5032, -1048, -7058, -16876, -21300, -17463, -14160, -8338, -558, -10069, 10673, 20621, 7328, -5088, -6369, -24311, 3402, 35028, 38499, 18477, 1701, -6516, -22393, -26211]
16192b6211J2199n87j9467Q026P612l168Q134m593J12Q160L913r925j270J0250
16178f815Q946P762M090k8026j1540J1715J3048j445K968P471Q919j4857j1862
16165i626q311l950N775R904P732n439R183j0312j544k188m005j1164j8240J8514
16151b3671N842l166R657J4740J9160j4387k3896q773J9255J83r644j194o938
16138b2832j2412j1469K0175J355r0K7260q297j1597P755L619J7418J2728o83
16125B2930q469o63P55M31n656q739m372J6165L269j9118j117k792j0801k919
16111b1096J5595L94P685Q654p169L081n200m146J6989Q929p984j3795l320N91
16097g92j7052Q805J3387n98q331O862K883J6698R86r212j1092o836q52O362J4621
$$ y = [-26211, -14012, -14599, -34066, -26040, -18428, -21596, -13462, -18055, -17943, -9783, -5870, -15795, -17065, -6815, 2131, 9893, 13983, -14043, -25583, -13868, -820, -2265, 703, 8174, 17093, 2236, -9626, -17937, -21887, -16112, -6208, 1524, -3915, 5268, -5044, -6588, -8776, -12781, -23945, -42185, -23671, -17829, -20995, -11338, 3402, 22562, 8175, -15721, -24494, -5239, -5056, -14700, -15894, -22832, -35244, -46713, -26538, -25183, -25273, 1987, -6310, -17907, -10152, -6533, 10885, 23613, 22930, 14461, 13798, 14553, 14984, 9328, 589, -3783, 12382, 15651, -3467, -4584, -7376, -18177, -21096, -5501, -5107, 2578, 11232, 4063, 7144, 1944, -2202, 14787, 23716, 15732, 1937, -1383, -792, -17844, -9039, 4348, 3750, -4581, 2281, 5164, 21862, 22848, 13636, 2544, -4292, -5144, 1218, 15839]
16082A5839L851l763M246o459k2268n637O077J1773P346R398k98Q847j2581n688
16068A0683L838K492o759j3552l0883q717O996Q92P847K0564R63j2637j4640R776
16054b3137J5936L705m511k4385n821l69R123J7798J1785K6656j0888p132k644
16041F116l114Q74n070M86J2713N342r642j8653N388Q889K2346P831P02j4456
16027A9752k1940m091K2096Q771j1804p908R910j5808o734Q127Q033L41P866K643
16013A9254q863K29R092N852l426k7212o885j0143j7760O977J201m435J621Q711
15999b5787j279k814J8043J5069n910k177L0780K212k0001L700q272k6881r387
15986c2704O228M7j1744J6129P955J651L869L671o565k935L212O194j613J190
$$ y = [15839, 19690, 15927, 20173, 13714, -8554, -14191, -8114, 3659, 11005, 20403, 20105, 28952, 16371, 10683, 14521, 17013, 10254, -3298, -34181, -42898, -35902, -35010, -27163, -6599, -5636, -18273, -32913, -23137, -7201, -3496, -8007, -32392, -38213, -38582, -29459, -11661, 124, 26780, 15892, 8760, 6116, 3002, 3876, -1194, -708, 12005, 17347, 7705, -10948, -5560, 3329, 25675, 33506, 34208, 19752, -2188, -6279, 15817, 24588, 12784, 4876, 14786, -1022, -7756, 371, 8404, 8745, 16611, 19254, 10391, 10620, 19712, 25564, 22138, -5074, -11959, -22102, -39862, -32885, -31684, -36119, -34498, -25787, -27066, -29880, -11837, 3232, -2678, -4855, 25925, 28137, 8136, 11836, 3564, -23317, -32704, -26476, -26429, -38173, -22044, -14089, -12438, -8569, -4898, -11463, -14398, -11186, -4992, -6605, -5415]
15972e415j4559J0582P866k2409k4395o067K8750n62Q645l041L354P19k062J4849
15958c745K610n87m294J4754Q293q813J914R581k2626k8897J4611N736k3957P814
15944b7606o145K3887K4190K660j5407J881l742j529l676j967j5477k0994N15
15931d3410P032R155J3025O096o605j4177j6961R751K748J1415J8248J5282p049
15918D550k1354l045P682J4290J535R38K1104j2750m782L66j0966J0818j3306
15905d920l71K985N862J1950n217n037q471j4217l625L726l198J3317J6574q23
15891H535q491j3526J1346J2314j4480k116n52J080k317O43q434q607n629J6600
15877a3634N893j5586J4005J2106N951k0445j9385N225N218j3405q30K2198J0129
$$ y = [-5415, -19974, -9392, -1526, -23935, -48330, -54397, -25647, -26209, -17564, -20605, -17251, -16532, -18594, -3745, -1135, -1722, -6016, 8738, 17031, 8218, 10132, 19713, -2913, -31810, -17199, -11463, -35420, -27606, -33751, -9864, 14326, 16986, 1579, 3460, -282, -1811, -5487, -7454, -22931, -43925, -43410, -36378, -27223, -14198, -8102, -14707, -28884, -45845, -36094, -33346, -21931, -3683, 11599, 4550, -16804, -19849, -12167, 2123, 3658, 4596, 25700, 12950, 8168, 8534, -2432, 8386, -4920, -5291, -2306, 3556, 15506, 10289, 5252, -3219, -17436, -21061, -17335, -20533, -7216, 9358, 8535, 44, -13482, -2136, 10178, -4302, -6418, -6970, -5890, -8207, -7564, -15998, -24605, -30234, -13634, -7741, -23327, -9322, 2784, 8735, -11710, -31095, -25870, -20652, -34057, -34887, -12689, -2560]
15864b560p570k249m944N286k3988k4868j8015J7222K5873J0237Q960m263j1056
15851c1935j911O539o631j496J1781M137j2879J429N530j391O852l676P850p706
15837b3507q679J452L973R563k606J8537N366j5308j754o170K160J9103J7906
15824B0036p137K835j224l436j7559r345o76j343O407j2576J096P163l261J3020
15810f000k623k0638m69P293Q333J150K793J899N350J003J1897o602Q626m458
15796G554j8102q859R328K5733J6773n148j1998n693q93k6747P286J0756J0029
15783A0019J3065j4773k3097o430K328M659J654l239j7668j4823L131K8063N989
15770a1122N302r006o245O217m04j1025j259j6836L709M799R045R541l405J0003
$$ y = [-2560, -10130, -12379, -17323, -12037, -36025, -60893, -78908, -61686, -35813, -25576, -16616, -20879, -31935, -33846, -27307, -33938, -35434, -23653, -19516, -32395, -30966, -25436, -26827, -19975, -23651, -15801, -23507, -32186, -30734, -26761, -17198, -19804, -1267, 4099, -11209, -12963, -19133, -16973, 2130, 20036, 12899, 15734, 14510, 11074, -6485, -15830, -16506, -17849, -11442, -24018, -22922, -15759, -19020, -6000, -8623, -29261, -29730, -22437, -14104, -12954, -10161, -8262, -2912, -1909, 9988, 3386, 12012, 7554, -10548, -19407, -10079, 15654, 32427, 27279, 15281, 9588, 8695, -18052, -10766, -10, 10019, 23084, 8311, -14786, -21216, -18888, -14229, -12575, -15814, -33482, -48305, -45174, -17111, -11122, -5820, -14826, -21071, -14854, -15258, -26283, -27542, -44378, -40669, -35870, -26825, -17284, -20689, -10686]
15756a0686O460p410J422Q043q332o079k2637p98O097J6150J2225q060j2778j4591
15742d0974r70l110K015K6186R431j7278p405J9104N735r659k612J15p943J121
15728b6244m648j3344J3948J0996J0798J336j892J0456J6049R859P714p789j7840
15715I399j1787k0223l17j358n425l110q901o759o33K2720K425Q197j07k0135
15701c6014l868J1141N10K340K888K62R176J2660p560m79m417q075P099R364M835
15686a38L793n013j0771N526K060n949m190K72L59P250R189k1359n474J2968R532
15671a945m83j3141j7095J5350N985k371J0830K6094j1015N400Q154j1448j3419
15658H96M346J3618J595j1700j2979k344j4914R685Q504m250l960k6645N498J3587
$$ y = [-10686, -4226, -11636, -10214, -2171, -10503, -16582, -39219, -40017, -33920, -17770, -5545, -13605, -26383, -40974, -41944, -45054, -43039, -16853, -7422, -24700, -32105, -13001, -7266, -16925, -19537, -19422, -27365, -26244, -30892, -44236, -30288, -19292, -8494, -7158, -9050, 1406, 17455, 27314, 35028, 27239, 9399, -2388, -22611, -22928, -24286, -29711, -32821, -41722, -48481, -49114, -26394, -23969, -15772, -15879, -36014, -39882, -28741, -28231, -25891, -23003, -22741, -13565, -905, -8465, -8944, -13361, -21436, -14337, -4973, -138, 3655, -1358, -12129, -6603, -4543, -10492, -14682, -14410, -14051, -6801, 2388, -18971, -24445, -11477, -1945, -2428, -15569, -32664, -17314, -11329, -13700, -2870, 23224, 12209, 17609, 25763, 14315, 896, 5242, 18860, 20455, 8755, -4224, -6568, -21482, -11797, -3293, -7543, -11503, -38148, -32650, -19063]
15644a9063n554m400l261J9029L259j6630m29J3222O459K331K206m28r952r860
15630b3071j4878j5979L506J3557K964j295m899p585N465J2986K3504K961K1467
15617A8703J32j5259j8715k3741L80L286J1041J1738N767J0081k943k2166j1823
15604c3519M261J4926R189J1359O538k4324K43R002J788j0392m678L260j2347
15591b4694m753J2457J465k435J1773j0119m771K8187J6696j9107k7842r208M385
15578b7966J1223M70j4054K715J7223M563N040J9804O469m090M021k834Q25k671
15564B0738K081P304m445r036j1084q524m547l198J0159j1093q750N282P349J53
15550g611K397n447M320Q809N502q956l183J5978J0618j6528J965P507j0981J1595
$$ y = [-19063, -24617, -29017, -32278, -13249, -9990, -26620, -27049, -13827, -7368, -5037, -2831, -3259, -13211, -23071, -37949, -53928, -50422, -36865, -33901, -35196, -40095, -47680, -42215, -29229, -5725, -2764, 18703, 18835, 3576, -15139, -38880, -38500, -35214, -24173, -12435, -6668, 3413, 470, -21696, -33519, -29258, -14332, -5143, 6216, 12754, -11570, -11327, -2325, -537, -10929, -15607, -12347, -24694, -29447, -16990, -15525, -17960, -6187, -16306, -21077, 7110, 23806, 4699, -23143, -32351, -27966, -16743, -16273, -30327, -27612, -10389, -5826, -786, 19018, 25487, 21397, 25418, 22584, 23409, 20738, 22819, 30123, 25678, 16642, 5558, -2966, -7513, -10711, -552, -11645, -20395, -15113, -7764, -7611, -5214, -10661, -6341, 2468, 7970, -986, -4169, 11809, 22427, 5899, 7864, 15371, 4390, 15985]
15536A5985Q580j7653N581L716J140j6324j8479P02J6055l539K522Q168q386q952
15522a0884L374R9R415l777j9816l121j7962L405J9760J0291Q725m093O599O150
15508H165M21Q954j217q590p614Q556N552j3230n943J342J6932J3736k4247j0336
15494g519r479J61Q687P847N635j1476n398o269K668N82K821j5515J1910q82m885
15479b1112K3886n06k874j897j7885k187J2610m077o45l740N347k870j9846o263
15465d2059q085K0027K4503N422R710J350j1594k0875j56j3468k1767J7503K4549
15452a4940J7510O896j012O00k068q178J428k864j70K1776m992p399M312J0432
15438B1331j4510o952L378J5983M052J3811J049k1461j2938o304J1889P43r009
$$ y = [15985, 24565, 6912, 12493, 16209, 17349, 1025, -17454, -16752, -697, -4236, -1714, 6454, -1932, -10884, -7510, -7411, 2004, -1773, -21589, -24710, -42672, -39267, -19507, -9216, -491, -4584, 2015, 8165, 8586, 17540, 16323, 7733, 119, 8675, 14227, 997, -4946, -3604, 13328, 27064, 2817, -7519, -16998, -16837, -8150, -303, 5332, -6144, -11542, -17811, -15143, -14561, -11740, -27255, -15345, -16227, -21112, 2774, 2268, -606, -2503, -20388, -22575, -9965, -14042, -14687, -18427, -13080, -15950, -35796, -42059, -50144, -30117, -5614, -192, 9518, 10868, -726, -21601, -21757, -35225, -56992, -39489, -14940, 2570, 9466, 8454, 9054, 6986, -1192, 236, -2628, -2798, 18978, 13986, 6587, 10899, 21331, 6821, -131, 3247, 19230, 23282, 37093, 38142, 16681, 3743, -2561, 9328, 10071, 1062]
15425A062P563r068k7194n931Q331K5312J4995P296k436j704j986j25J3723n502
15411B4336j5185P752J3623n825j8779J0772j2300l009L931O707j1411J4543K5634
15398D0789p307j4993j0278j0738J2426N986j6258m653j0954R073J8223J0641
15386B1957K525M821P12j1144P868J6488R24P747m240l494j165Q035j4054j0898
15372B6082o630O416K9898j847n819j9370O022J3946M878j8631j7705N133K0261
15359D2634K0235K47O03l648J022n802j4259r26j33Q955N776L483k059P734M730
15344F8592j32J881K165o594K991M289k006j5174J4159N562K1916n780o493N387
15330I0763p477J4275j2781k9770J2028J7168R139j3957K499R49M39J2200j4499
$$ y = [1062, 8625, -443, -27637, -33568, -25237, 75, 15070, 22366, 19930, 18226, 16240, 16115, 29838, 24336, 9151, 16903, 30526, 24701, 5922, 16694, 4394, 1385, 5316, 12023, 612, 15155, 40789, 33482, 18489, 8211, -2527, 9899, 15885, -373, -5026, -15980, -6907, 11316, 21957, 24482, 29303, 30015, 18871, 26739, 43227, 44151, 51898, 47658, 44164, 42999, 51034, 36980, 26082, 19452, 25868, 55766, 53919, 48100, 28730, 34752, 48698, 53576, 34945, 17240, 22373, 42634, 62869, 63116, 63719, 60071, 61093, 55291, 41032, 40106, 39973, 48928, 54704, 58187, 56128, 63862, 68592, 68460, 70341, 72506, 65912, 68903, 73192, 71186, 56012, 70171, 75733, 97649, 91869, 85376, 90763, 83286, 97561, 84780, 55010, 67038, 84206, 93345, 79388, 81887, 82836, 83275, 95475, 80976]
15317H0976Q518K695l625k0060o290J5296K8983R988j7267j1521j2468Q389O686
15304I0300r174R292Q308R807M036J143J3754J962j5377L881J785j9480j638M550
15290A03149N698j1068n975j418j0640J7722J8801q138J476J66j6609J3621M403
15277A11188j6436n84J1052p830j811p087M911J1776O707j6076j775J4396Q885
15264A17316j7005j3313J7784K039k4004j9173R382j036n261K0637Q114N00k1119
15251G4861l686l854J0196k208J0572k1682J98N038R053J2303j8505j2333n655
15238E4298J2328J2480J7390j3349j6642L097j5988k978J0001P49j1186o689m867
15225C8644k119O50M446N620j508M735P936j0065Q469r402J134n482P398p266
$$ y = [80976, 89494, 92189, 88564, 68504, 62214, 77510, 106493, 116481, 99214, 87693, 75225, 83614, 90300, 81126, 90418, 98726, 108533, 112569, 113712, 127466, 129428, 114051, 117932, 119717, 100237, 98599, 103149, 108847, 97779, 91804, 90386, 79746, 97468, 116269, 108131, 109607, 109773, 93164, 106785, 111188, 94752, 94168, 105220, 97390, 95579, 88492, 93403, 105179, 111886, 95810, 94035, 108431, 117316, 100311, 86998, 104782, 106821, 82817, 63644, 73026, 71990, 66729, 87366, 95480, 95980, 74861, 71175, 67321, 77517, 75309, 85881, 64199, 64397, 69435, 78488, 90791, 72286, 59953, 54298, 66626, 79106, 96496, 83147, 66505, 69602, 53614, 50636, 60637, 61386, 50200, 43511, 38644, 36525, 37175, 41621, 47241, 45733, 50468, 58404, 48339, 56808, 47406, 48540, 43058, 50456, 43190]
15211D3190l613j1274j0101m049k5288M562L0484K900j431o297j0533p363k083
15198h96R59p617K220J2670R709J8260k590k9187j2967J5809J3011Q893J5416
15185D3690j6282k4283J4809M661j2710l325J6282J9549Q902j8027k0704j8837
15173f275o208J6477L6071J3687j4642j5934j8822O725J6946K151j4137l1284
15161a5245m102O914J91P08l508j2894P024J3465l512L834R634P644L21K2324
15147C2798k4041k8987J970K5754L482j0516j2913l320j8835r223N819q909N138
15134d1783k08q17K1740Q674L021K6778N577j8707m03q645q747o592J6051J1787
15120G726J0210q246K881J193J552j951l5417J1681Q454J1852J0168j050j1642
$$ y = [43190, 39577, 28303, 18202, 14153, -11135, -6573, 23911, 26811, 25380, 19083, 8550, 1187, -896, 63, -7554, -5334, 7336, 17045, 35305, 32715, 3528, -9439, 6370, 19381, 28274, 43690, 27408, 3125, 17934, 22595, 9885, 6560, 22842, 42391, 51293, 33266, 12562, -6275, -12483, 3994, 40065, 53752, 39110, 23176, 4354, 11079, 28025, 30176, 16039, -15245, -19347, -12433, -12242, -11534, -15042, -27936, -20912, -7447, -10959, -7125, 2509, 10153, 10474, 32798, 8757, -20230, -18260, 7494, 10976, 460, -12453, -15773, -34608, -43831, -38012, -46921, -41783, -41991, -42808, -21068, -12394, -9373, 17405, 22982, 4275, 3872, -4773, -13520, -20112, -4061, 7726, 17936, 9690, 12571, 13764, 15316, 13365, -22052, -10371, -1917, 9935, 20103, 19053, 7411]
15107G411p417J640J4089J3430j1142j285J0432j2984k0422m378L880m210J3556
15094B600J0345J0074R305j4716k8508l53P221r168k760J1796j1311k617K0862
15081B770J353q386j4513j8377P895J9218J5384K1235j3063N381k415k3278r481
15068a6277j1524L4140J4948k2839j0149l978J567J3198o686l947j890j895j1318
15055b6650q888k255J7480m551j3139K4618j2546q949M82p546J4518J5410J61
15042a1855k98J3540N370l842k736J4038M723k114j9439j9484K81R336N813n325
15028a1992j2435j8882k071J4471J3845J30o541Q871N770m280M65L12O855l522
15014i004Q203m019j98j268K483r663k1524M181P359P420M229m481M403L044n443
$$ y = [7411, -6, 1634, 15723, 29153, 18011, 16726, 27158, 14174, -6248, -10626, -6746, -10956, 2600, 12945, 23019, 32324, 17608, -10900, -11253, -4032, -13200, -15960, -4164, -15475, -18092, 2770, 4123, -4263, -18776, -37153, -29258, -10040, 5344, 26579, 13516, 18897, 16482, -6796, -16277, -27801, 6339, 21287, -1552, -11701, -15679, -14112, -914, -7600, -11547, -13437, -15332, -26650, -35538, -37793, -20313, -24864, -38003, -13385, -25931, -34880, -34398, -41944, -27426, -12016, -11855, -12153, 1387, 6757, 2915, 179, 14217, 18940, 16826, -2613, -22097, -21816, -12480, -6667, -11992, -24427, -43309, -45380, -30909, -17064, -16934, -23475, -14604, -8834, -13114, -12649, -12337, -5482, -9004, -801, -4820, -5018, -6286, -3803, -13466, -34990, -30809, -23450, -16030, -11801, -16282, -11879, -8835, -14278]
14999a4278k208l789J0013J334l907k437O588j4158j7143J8811o707j1836R777
14986b9940K2978M860j284q985j0746J3838J5115M710J3337j9219r101p915J0770
14973a582l348j504p011j970j32j4917J1196J7083j2076J228Q724k107r68O499
14959h85q999j1642K523R856J553L120r250j2400k858N168M627J7588J5076M601
14945A8078p301o445j1624m050M113j2342j0694K694p773j0348n087N509K4853
14932b0417J0675n191J0527n872j75J2891N447q626o820M113j4185P502K008k308
14918a0431J481k225O521q33J831j320q823o038o74l084l224M564N607O01j2372
14903b8419J592J5400J1810k0049j5893R191L2719K6993j2260r897O12L074Q895
$$ y = [-14278, -16486, -20275, -10262, -8928, -12835, -15272, -8684, -22842, -39985, -21174, -27881, -39717, -29940, -6962, -2102, -3386, -12371, -23117, -9279, 5836, 10546, 23883, 4664, -4437, -12352, -1582, -4930, -6434, -13445, -15415, -15547, -30464, -19268, -2185, -14261, -13033, -4309, -6416, -7384, -885, -9884, -21526, -19003, -9147, -7594, -4474, -13724, -26124, -28982, -23814, -19187, -1599, 13477, 18078, 10777, 4332, -7292, -11342, -7229, -19571, -30265, -27571, -35344, -45692, -50779, -45270, -20417, -9742, -14933, -4406, -10278, -10453, 2438, 7885, -741, -7561, -3448, -17633, -10131, -8123, -10431, -8950, -11175, -4654, -5487, -3656, -4976, -13799, -19837, -20511, -23595, -26819, -22255, -16648, -16047, -28419, -26827, -11427, 383, -19666, -35559, -26368, 6351, 33344, 21084, 11187, 11799, 14873, 23768]
14890B3768j6192k385K314k5518K89J0951O911O249n503P107j0904k41l370P273
14876G49o156j3794M069k735r474M419O658K389K1353j3081r602J7989M792k582
14862D994J3028J6267j0080j353q751q839j0109N363m181k759j3188k559J4086
14849h081P652l928j837K712P009j539j7340L844k2648k0447J4167J7086j2063
14836c5413O375q67j0822J3026M569J0020L860J798M937J611J1296J7226j6852
14823A0764o661p548J754r088k0054N311j0330K716P080O571K5495K1830J211
14810B9051j389j7030j0855o98p94O005O165N700r356l78j838l609j422P691k823
14795D420o510N660J7188p795k4623p750J5901J2812j1405l515l206j1285o444
$$ y = [23768, 7576, 5191, 7505, -18013, -17724, -6773, 138, 6387, 884, 7991, -2913, -3154, -6524, 749, -5407, -19201, -15132, -17867, -27341, -22922, -16264, -13875, 7478, -5603, -15205, 2784, 7576, 4994, 18022, 34289, 24209, 22856, 14105, 5266, -4843, 520, -3661, -6420, -19608, -22167, -8081, -429, -4357, -6194, -3482, 3527, 1988, -15352, -11508, -34156, -54603, -40436, -23350, -35413, -29038, -29905, -40727, -27701, -23132, -13112, -9252, -7454, -2517, -906, 10390, 27616, 10764, 4103, -3445, -1691, -10779, -30833, -25522, -35852, -33136, -26056, -19485, 6010, 27840, 29051, 27662, 10632, -223, -921, -1715, 4290, 10455, 16155, 6799, 6421, 4583, 974, -448, 7243, 4420, -2090, 3570, 20758, 12963, -11660, -19410, -3509, 9303, -2102, -5617, -8823, -20108, -26552]
14782b6552l934k693K5100r031r090K1039J1979k520p583L288j0449M721l146
14769h871J0390J0556q905r768k0093K135J1377r044q76j7741J3636P182J7699
14756b323J2645j2339j6120j530J3496J5772q229k6937k3762m546K377J4738P808
14743b8950L096j2526K1205J3409J6806P652L074J3170n787j0809j2569j2593
14731d822K107J0896k669j3931m015j415R334J02l730l173K949k134R77l509r50
14716a3983l09j735M428j1734L221k951j3297O360P582P457N603N332P995j6458
14702a2489l520K178j2409m593J737L308m656J8630J2177M149j2813j0998p933
14689b7232q448J8759J4182j800q599J2126O05j2944J7681J4934m89K047m787
$$ y = [-26552, -30486, -33179, -8079, -17110, -26200, -5161, 6818, 4298, -3285, 3, -10446, -5725, -8871, 1519, 12075, 3170, -6598, -26691, -24556, -13179, -22223, -23099, -40840, -27204, -20022, -2323, 10322, -2017, -18137, -19667, -6171, 9601, 1372, -25565, -49327, -53873, -51496, -36758, -28950, -25854, -38380, -17175, -3766, 13040, 20692, 23766, 36936, 31149, 20340, 7771, -4822, -2715, 8181, 5512, -8419, -12434, -13849, -4515, -4413, -8143, -11316, -8367, -10501, -9524, -13033, -13983, -14292, -16027, -11599, -23333, -20112, -23063, -36360, -30000, -22418, -14961, -9358, -4026, 3969, -12489, -16009, -13831, -26240, -30833, -29096, -25788, -30444, -11814, 363, 4512, -8301, -19299, -27232, -35680, -16921, -2739, -4539, -13138, -1012, -407, -13351, 4330, 19264, 18775, 20822, 16035]
14676A6035k0328j4281J1769J9446O31o974J3324k370j9092n209M61j3441O623
14663a3406j555l377L0972o8k2502p807j0190l3030k0313K4579O652O732L532
14650c9781J5399R419q837j5059R51L955J2697L010M447P614k0550o20k530N554
14636b4331J3616K180m346l638N293J0463R623J5565k4698j0529M502j2135j7199
14623c5634j8275L512j152k424K5846J1838k383m365r82r634M76L528j2273O576
14609c5346L2671L260o14J2405J83j005N137k3333k1185p157J891J1300K1376
14596d17j3454k6409K1572L890J4371L893J6922R098J0270q693j5649l3947j2192
14583c0745K166J2489J8751J1947k2744n721j1034n150j4177q316J4750J7381
$$ y = [16035, -4293, -18574, -6805, 12641, 13272, 6298, 19622, 17252, -1840, -7049, -6588, -20029, -13406, -14961, -18338, 12634, 12566, -9936, -17743, -27933, -60963, -81276, -56697, -50045, -43313, -39781, -24382, -14963, -23800, -38859, -37908, -33953, -21256, -18246, -13799, -6185, -26735, -27355, -29885, -24331, -10715, -8535, -12881, -16519, -11226, -763, 8860, 24425, -273, -10802, -6300, -18435, -35634, -53909, -50397, -51549, -53973, -28127, -16289, -18672, -23037, -24019, -33653, -33177, -29649, -41922, -35346, -2675, 585, -29, 12376, 12559, 11554, 16691, -6642, -27827, -34984, -33093, -21793, -417, -13871, -40280, -18708, -14818, -447, 3446, 20368, 29466, 39736, 31043, 15394, -18553, -30745, -28579, -16090, 2661, 14608, -8136, -13857, -24891, -30041, -44218, -52534, -37784, -20403]
14571b0403O979j0781N036J0256R925L135j152r3j3838j0057j5327j0000J432
14558d4888O168K1196J4434n772J141J3070K149J7828N128r36J768N00L59J81
14544C2326o36k1494k9811o046Q810J6377L3086j974q733q757q09J0552Q187Q988
14530D0066j4940o359R474k304j4672L437J8499o97l446O810J6808R574j3696
14517D8554k4668j7375o739n731K156J0829P716j4105k4765l087J5180J2527Q223
14504H715O835J2185J2573M120n338j4647q783j0904j8066J3775J8735j0508o497
14491B195K4128L825p164k26M010N440n260p122l084n17p454m304P614q007j328
14476B746q581P216J5610Q318L055J7659L563j8742j3687J800j1327m116J6168
$$ y = [-20403, -13424, -24205, -19169, -8913, 1012, 4147, 2995, 2902, -10936, -20993, -36320, -46320, -44888, -38720, -17524, -3090, -8862, -7721, 5349, 7498, 25326, 30454, 29518, 31286, 31786, 32145, 32326, 31690, 10196, -19615, -25661, -16851, -474, 32612, 30638, 21905, 13148, 12339, 22891, 31078, 40066, 25126, 18767, 28241, 25937, 11265, 14702, 33201, 32504, 29058, 35868, 52676, 62250, 48554, 23886, 6511, -228, -5959, -3803, 7026, 14742, 637, -24128, -27215, -12035, 492, 8715, 15550, 27735, 40308, 44428, 39090, 24443, 15660, 4756, -13310, 465, 19200, 8692, 2195, 26323, 30148, 22984, 22758, 26768, 32208, 26948, 19826, 16742, 16225, 8771, 4467, 12081, 4074, 2746, -5835, 1381, 16991, 25309, 28364, 46023, 49586, 30844, 17157, 18957, 7630, 3514, 19682]
14463A9682M035k371j4280N930l230J228k707j1408j812K0059J7295J0378j7182
14450B5617j2717l199j1658k64m31N027K80J7545J2900J7811J9743K1922r417
14437H3159J849K5725J3755j331J3185K3526N1137O1299O2177M2242M1045L4352
14425D52120K2022k889l4545m8751n2972p5850o2241k8717k7043k4111j3647k0616
14413H2760q464P857j7946j08o18O619m724j4769k374j1424j2663l319O357J1859
14399C9043L63J691L100N761P782k0559k63l951Q763P355q006K704r233r194J626
14384B6982P928Q043j3796j5278P43J0762l319Q05M693q323r408m367Q623R047
14370B3135n907l53J1230J5666n400l957j1252n343R32O129K4812L0775L0356
$$ y = [19682, 23717, 21346, 7066, 12996, 9766, 10994, 8287, -3121, -4933, 15126, 32421, 42799, 25617, 12900, 9701, -1957, -2221, -2652, 2375, 2655, 20200, 33100, 50911, 70654, 92576, 83159, 85008, 110733, 124488, 123157, 136342, 159868, 211005, 272304, 334481, 376723, 417768, 452120, 474142, 471253, 436708, 387957, 334985, 259135, 196894, 168177, 141134, 117023, 103376, 82760, 74296, 82153, 64207, 64099, 63481, 70100, 65376, 50607, 48233, 36809, 24146, 20827, 27184, 39043, 39406, 41097, 44197, 49958, 57740, 37181, 36918, 32967, 41730, 49085, 41079, 43783, 34550, 25356, 26982, 34910, 42953, 29157, 13879, 14622, 25384, 22065, 22870, 27563, 19240, 9832, 5465, 14088, 23135, 17228, 16875, 28105, 43771, 38371, 34414, 23162, 17819, 18751, 24880, 49692, 80467, 110823]
14357A10823K4166K2792L1125K8208K3585j4481l51m03j1158j3316k3959k5891
14345A51140j8587j0476k6766j1414j9290j1519j8592O002Q645p093j8174l1081
14333g205J377N351J5294J3304j905O496l785J8094N736K185j0043j9300P785
14320C3384K628J810M505n617q126l155J237K614L01k3214o033j290J7636J6435
14306C3115O651j5444R22j385J708n635m583r02M351p041j7756J1492L580J4081
14292B3154r013n850K2670j1378k3726k369J3792J2038n391N300j3980J0162N412
14279B0821J0511J5548m662m218l192J6049K3320J1115M608L9096K5342O781L0901
14266A92020L4918N9325K6247R333Q098q093l2854j1122j4437l4529l2413m0700
$$ y = [110823, 134989, 157781, 188906, 217114, 240699, 226218, 225867, 225464, 214306, 200990, 177031, 151140, 132553, 122077, 95311, 83897, 64607, 53088, 34496, 40498, 49143, 42050, 23876, -7205, -5828, -477, 14817, 28121, 26216, 32712, 28927, 47021, 52757, 54942, 44899, 25599, 33384, 36012, 37822, 42327, 36710, 28584, 25429, 26666, 29280, 29581, 6367, 334, -956, 16680, 33115, 39766, 24322, 25244, 23859, 25567, 19932, 15349, 14447, 18798, 11757, -5999, 5493, 9073, 23154, 14141, 8291, 30961, 19583, -4143, -6512, 7280, 19318, 13927, 19227, 5247, 15409, 20821, 31332, 46880, 42218, 38000, 34808, 50857, 74177, 85292, 89900, 128996, 154338, 161119, 192020, 226938, 286263, 312510, 321843, 329941, 321848, 288994, 277872, 263435, 228906, 196493, 155793]
14254A55793k5496j7734k499o359J5925J3163K066j1659j9871J1776N306K1511
14242A41922k64q404J7530K5443J2532j055L0386J3592L0121M8045N0707J4915
14230C75470k321M506j7032k2823m8767m2867k4671k0655k6822k6306j1829l560
14218A32323l3073l0325j9769R871J0832j0404M950r08k1676p260R512J4540J2572
14205G1185p773j9365j4580q23J5749q92m347N954P135k1091k1083j0082J3469
14192A3456K5210j2333k7334n336J8152Q175l388R672j2855j5752L314R557j2703
14179b165J2349Q176n257j0304J3R614O497j553j2183J886j1135r984q471J2562
14165i955L4960Q202k2722o706j2272j3146q581M734K204K3936O525r365P074
$$ y = [155793, 130297, 112563, 110064, 103705, 119630, 132793, 134859, 123200, 103329, 115105, 120411, 141922, 141658, 133254, 150784, 176227, 188759, 187704, 218090, 231682, 261803, 309848, 360555, 375470, 373149, 377655, 360623, 337800, 289033, 246166, 221495, 200840, 174018, 147712, 135883, 132323, 99250, 68925, 49156, 59027, 69859, 59455, 64405, 63497, 41821, 34561, 44073, 58613, 71185, 63412, 44047, 29467, 28644, 44393, 43501, 39154, 45108, 52243, 31152, 10069, -13, 13456, 38666, 26333, -1001, -6337, 11815, 19990, 16602, 26274, 13419, -2333, 981, 10538, -2165, 10184, 18360, 13103, 2799, 2812, 12426, 18923, 17370, 5187, 7073, -4062, -14046, -22517, -9955, 25005, 33207, 10485, 3779, -8493, -21639, -30220, -25486, -23282, 654, 7179, -2186, 4888]
14152D888O704L467r900j3096M567J8440Q368j0088j699L967J959o249j1563O640
14138F405R658J0155m017q884O078M825j6916j1309o845N423j386l073n030P769
14124g147J867j213N259K8485p286j4448j253J4086J059k3454j237J7330q82j41
14110A1025q449j1069K8214L378l9748l0508Q782J6439L773P791J9466Q131m083
14097A3142q468r852j8264m918J6401l822j6824j3124Q162K0695J5082L49q494
14084i935J1282K180j1288N709M663j1078j2595m476n578J3547l131j0225J4837
14071a6088O449R41m221K866N49p920O729o932K1901L834J1492m257m922p555
14057B866J0766m602k404J0334J0962J2887p840o086j0903J2724Rj4898l54m027
$$ y = [4888, 11592, 15059, 5159, -7937, -3370, 15070, 23438, 13350, 11651, 15618, 17577, 11328, -235, 6405, 16063, 26218, 22201, 13317, 19395, 24220, 7304, -4005, -10850, -5427, -6813, -9886, -14916, -7147, -5280, -6493, -1234, 27251, 19965, 5517, 4264, 18350, 19409, -4045, -5282, 12048, 11166, 11025, 2576, -8493, 19721, 23099, -16649, -47157, -38375, -21936, -18163, -10372, 9094, 17225, 13142, 4674, -5178, -23442, -28360, -11959, -15781, -32605, -45729, -37567, -16872, -1790, -1441, -9935, 1347, 3527, -7761, -2052, 2611, -8467, -21062, -25538, -31116, -17569, -20700, -30925, -16088, -9639, -8698, -12919, -10053, -9504, -17424, -10695, -17627, 4274, 8108, 19600, 15343, 10421, 2866, 13632, 9030, 6626, 16960, 27922, 40809, 32969, 26883, 15980, 28704, 28713, 13815, 13461, 9434]
14043I434L176J114j5507J1j0731k303J9544J1826N685R439k1654q503O109j1881
14029d241l897J3571K587j4815k991K91r748J3892J2326n510M529K052R077J1392
14015B8515K107J9832N604j0037o785J83m364k0894O822O801p338j8407r4j053
14001H92O833K5689L031j2045n981j2697k702R59J9985O628j1055K318n85k227
13987A9043J4281q127j8608j1644p999J357m208J2902Q386K227K135P333j3000
13974D078q080K996L673J7411J018J701j0747j1613l882j6016q65N143m226j2862
13960c2271J3600K7345J3003k777j8856p351q585N033R842J1324j0774j1311K516
13947i262J34j3023P595l665O80N409j524q041L432M874L99l104J0687q231j545
$$ y = [9434, 12610, 13724, -1783, -1772, -12503, -14806, 4738, 16564, 22249, 31688, 10034, 1531, 7640, -4241, -8138, 5433, 8020, -6795, -9786, -9495, -19243, -5351, 6975, 1465, 5994, 8046, 17123, 28515, 30622, 50454, 56058, 46021, 39236, 39419, 35055, 14161, 20983, 27784, 20446, 2039, 1945, 892, 7725, 33414, 36445, 24400, 18419, 5722, 3020, 3979, 23964, 30592, 19537, 21855, 21270, 19043, 33324, 25197, 6589, -5055, -13054, -11697, -15905, -3003, 5383, 7610, 9745, 17078, 4078, -4002, -1006, 2667, 20078, 21096, 22797, 12050, 437, -3445, -19461, -20326, -15183, -19409, -32271, -18671, 8674, 21677, 18900, 44, -7307, -15892, -10859, -1017, 10307, -467, -11778, -9262, -9128, -22151, -14556, -18221, -17541, -12132, -13656, -21697, -18265, -13391, -12992, -16096, -5409, -13640, -15185]
13932a5185l981O616J4453J534j7949k348P761J7384P012j0317j5345M060K1230
13919A4925k985j6519P672L2478Q910k2603r446J7746J9233k1102j6777N280m76
13906A6336j851q935l319m321j395R330n9j8696q566J0866j6229r306J363J5683
13892a9099J8781K19J0234R43k3591q705J0403K6608J6954R122L011P914j1955
13879D0839j1546m475m481L957O198l09j068k838j2750j3597m388J1277m109j9137
13865a6427q765K6287J1010k435j5530p565J8747n646j1817K0569R198K1621q714
13852C0533k6744o949J2923o417k695O726M284n907J2773J7880J2891j1037q152
13839C0109K403J8020j3006k3588l26J323l225N787n204p692j91L460K8758P539
$$ y = [-15185, -19166, -12550, 1903, 3437, -14512, -16860, -9099, 8285, 15297, 4980, -10365, -6305, 14925, 11940, -4579, 3093, 35571, 44481, 21878, 12432, 30178, 49411, 28309, 11532, 16812, 16336, 14485, 5550, 2231, -2090, -3485, 5845, 5786, -12910, -21476, -10610, -26839, -36145, -34782, -19099, -318, -99, 10135, 11078, -12513, -21218, -10815, 15793, 32747, 41869, 44880, 52794, 40839, 29293, 24818, 20337, 24294, 30492, 30183, 29115, 26277, 13527, -70, -4458, 6819, 2710, -16427, -25192, 1095, 12105, 9670, -5860, -13425, 5322, -324, -12141, 8428, 17626, 39247, 30533, 3789, -3160, 9763, 3346, 651, 7377, 11661, 5754, 18527, 36407, 49298, 38261, 30109, 32512, 50532, 37526, 13938, 13612, 14935, 11710, 17497, 12293, 4601, 4410, 7870, 36628, 44167]
13825D4167L016j8066j9122J9937R065m799q185J64L785j3522P042K3283k228
13812D4537j7609j6045m05N192L5846l310R85j8620j8075J9766J3736J719j1171
13799C6546j1077K854k6627K940j3487j4357J7074J3120P279r748K518j412j1088
13786e465m214M915K7814K5606q346l1181j1748J6784J2946P24Q95L962j8026
13773A4666K150P434q37J5466L037q986k1774j8055j1007J2229K9550K0939p978
13760C6834n650R046k894J4089J0438q417o586j1513K052J0441j0965k771j238
13747C2866J4105J9619J992k677n229j6473j0162K0225K391p688J7020J1942l911
13734G4020j3940J2305J6226j0541r22N733K8958r330k1238J2322m35m724M653
$$ y = [44167, 47183, 29117, 9995, 29932, 38997, 34198, 26013, 26177, 29962, 16440, 23482, 46765, 44537, 26928, 10883, 10478, 15670, 51516, 48206, 49191, 30571, 12496, 32262, 45998, 47717, 36546, 25469, 28323, 1696, 4636, -8851, -23208, -6134, 6986, 14265, 4517, 7035, 5623, -5465, -9679, -4764, 23050, 48656, 40310, 9129, -2619, 14165, 27111, 27835, 28730, 32692, 14666, 16816, 24250, 23413, 38879, 41916, 32930, 11156, -6899, -17906, -5677, 23873, 44812, 36834, 31184, 40230, 37336, 51425, 61863, 53446, 46860, 35347, 37399, 47840, 36875, 34104, 32866, 46971, 66590, 68582, 65905, 60676, 44203, 34041, 54266, 56657, 48969, 65989, 77931, 74020, 60080, 72385, 88611, 78070, 77148, 82881, 111839, 102509, 81271, 93593, 93158, 88434, 93087]
13721I3087O147o998J3298M970j3551L923N086K806J729J0803r720j975k90J9438
13707A28753J4186j0264j1248j2667m488j389K1536J5449m435j8320P821p39N512
13694A29707P081K968K740p022j8680J2269K0139K3525q533j7924l096P986J4728
13681A65888Q811j2323j5812k0336L320R491J921Q441n479o174M112o078P552
13668A43334r2k1621L034K730M146P648j8592m194R195j3525L173Q869L633K267
13654A30005m719Q087P854j0665P827J3081O415k772J4609m527m750J0917N036
13641A76398k598j433n887O031j2573q295j6545P879J1070j3053l93L382k719
13628A41264k1987r428J7699J6244L1969j297k1231r187L664r711J7154k31j570
$$ y = [93087, 99234, 92236, 105534, 110504, 96953, 100876, 105962, 108768, 110497, 121300, 111580, 109605, 109315, 128753, 142939, 132675, 121427, 108760, 104272, 102883, 124419, 139868, 135433, 117113, 124934, 124195, 129707, 136788, 139756, 142496, 135474, 116794, 129063, 149202, 172727, 164194, 146270, 143174, 151160, 165888, 174699, 162376, 146564, 126228, 129548, 139039, 140960, 149401, 143922, 137748, 141860, 135782, 143334, 143242, 121621, 124655, 127385, 131531, 139179, 120587, 116393, 125588, 112063, 115236, 124105, 127738, 130005, 125286, 133373, 141227, 130562, 138389, 151470, 157885, 155113, 169722, 165195, 160445, 171362, 176398, 173800, 172367, 166480, 172511, 159938, 151643, 135098, 142977, 154047, 140994, 140601, 143983, 141264, 119277, 109849, 127548, 143792, 175761, 174464, 153233, 144046, 147710, 137999, 155153, 154922, 153352]
13615A53352q900L37K486j1169J5775j5799K2J2523M877M280k2444k1178l553
13602A10609K2956J5372Q77K0421K3440K8307K3783L5127L3786M988r14J8384
13590C37136j3500j1667J8166K30k2380l3218j8035m185j6551j5442o810k786
13578B10958L11J5113O675Q351J6011J4496J0162P166m620j718L270K3910K025
13565C12110j3171l7639j9376j2337k1572j3698o430K273j4008j7994J877J5128
13553A75163k0428l1529J0117K487l4286Q275J6352n20l893j4890j8937r10J836
13540H8837j2190j4027K324L729q21L46p057Q292n140N312J3978O396p160j6330
13526F6489K311J7435P971k6845j0094q3j0338J906J3012l146j7315K1770K0495
$$ y = [153352, 144452, 144789, 147275, 136106, 151881, 136082, 136104, 148627, 153504, 157784, 135340, 114162, 110609, 133565, 148937, 149814, 170235, 193675, 221982, 245765, 280892, 314678, 319666, 318752, 337136, 323636, 311969, 330135, 330365, 307985, 274767, 256732, 252547, 235996, 220554, 213744, 210958, 211269, 226382, 233057, 241408, 257419, 271915, 282077, 289243, 284623, 282905, 286175, 310085, 312110, 298939, 261300, 241924, 229587, 208015, 194317, 187887, 190160, 176152, 158158, 160035, 175163, 154735, 123206, 133323, 135810, 101524, 109799, 126151, 125631, 121738, 106848, 87911, 87001, 88837, 76647, 62620, 64944, 68673, 67852, 68198, 61141, 69433, 64293, 69605, 83583, 89979, 82819, 66489, 68800, 86235, 94206, 67361, 57267, 57184, 46846, 48752, 61764, 58618, 41303, 63073, 83568]
13513H3568J0887J0081J1961j807J394j6740K982K6822m939l035J5357J2262K3935
13500A72728R006Q143M4449L7158J5745N904L577K4307J0818M019P573j357l8959
13487C03111m1403k6710P373K066q876J888J769m967j6971J1924L1470J3007R799
13474B83480K3205J4170j376j059J1875P40p790j2194k1449k2394l4483j4816
13462B17909o178k9575m2636j2506k0516j4039j7021n211J6591J1429J1518j2629
13450I7136K325r517N546K7991j5845l4535r899J4880J5272o710j9506L816N516
13437G6470j1851j1650j6478p426O891J2761R061r34q693n688J4325K1587j82
13424G8193m752k1840j0805J1926p884oR733N306L444J5309n467m291O574k424
$$ y = [83568, 94455, 104536, 116497, 114690, 116084, 99344, 102326, 129148, 124209, 121174, 136531, 148793, 172728, 181734, 189877, 234326, 271484, 287229, 293133, 296710, 321017, 331835, 335854, 343427, 342070, 303111, 261708, 234998, 242371, 244437, 235561, 237449, 239218, 234251, 217280, 229204, 260674, 273681, 283480, 306685, 320855, 319479, 318420, 330295, 331035, 323245, 311051, 289602, 267208, 232725, 217909, 211731, 182156, 139520, 127014, 106498, 92459, 75438, 70227, 86818, 98247, 109765, 97136, 99461, 89944, 95490, 123481, 107636, 73101, 63202, 78082, 93354, 86644, 67138, 70954, 76470, 64619, 52969, 36491, 29065, 35956, 48717, 57778, 56844, 48151, 42463, 56788, 78375, 78193, 73441, 51601, 40796, 52722, 44838, 44832, 54565, 59871, 63315, 78624, 73157, 68866, 75440, 73016]
13410G3016j4604n823j1722k5007J4071Q594r244J3749L285n981M343j1355K837
13397C6159L4023J0256o145Q90J1392J3273o587L1897L0638J8818J9018J4571
13385B08203K3921M2723O2370M4993O5132P9636Q2362Q3334N3465J3369j3766
13374G45742o1671p7560p9564p9662o4466o3810n8222l3848l3784k0753k0421
13363A51981o577p003j2221k0415k9179q057K0461n581L940P610J4705J0066j5856
13350A03874J6370O103r634j3750J1172k332j176p487q340R641N013m285j4997
13337I0172j9902n839M946P308J041j0468p090N593P363l051j865j0582J41J6358
13323G4125K1532j1103j3044j750m837Q845K760q509j3334p3k326J0223P599j6302
$$ y = [73016, 58412, 52589, 40867, 15860, 29931, 38525, 29281, 43030, 46315, 40334, 44677, 33322, 36159, 70182, 80438, 74293, 75183, 86575, 99848, 93261, 125158, 155796, 174614, 193632, 208203, 232124, 274847, 337217, 382210, 447342, 526978, 609340, 692674, 746139, 759508, 745742, 684071, 606511, 526947, 447285, 382819, 319009, 260787, 226939, 193155, 172402, 151981, 145404, 138401, 126180, 105765, 76586, 68529, 88990, 83409, 87349, 94959, 109664, 119730, 103874, 120244, 126347, 116713, 102963, 114135, 111803, 110627, 103140, 94800, 104441, 109454, 105169, 90172, 70270, 64431, 69377, 76685, 77726, 67258, 60168, 65761, 73124, 70073, 68208, 57626, 57767, 74125, 95657, 84554, 71510, 69760, 64923, 73768, 76528, 68019, 54685, 54612, 52286, 62509, 70108, 53806]
13309E3806K272R541j6800j2932J0297J0462J0831j1983j2145p51K3538K749J361
13296G0246q715J50K747Q552o85k0919k0303Q549j722j4807k131j1033K3129K3506
13282E6564K0479J53j5351n111j0208k787o204m320j7043l360Q950p013J727J1072
13268B7548P697Q403J3697m229p529m077L119j931j5419Q78p846j2864J4037K3504
13254D4988m496k6753n875J3032K4898R961j827l99o785l405k301j3237k353J4215
13240C9663K829J0775K2098L675R133l702n241j5921p287J4170J9861o1k0468
13227F9524k87K6202J5016K812O061J8546K0255L827r411J3467r126N62J9284
13214A76732J8886J6569J340j2845j3019p483L964k7293k5497O710q790j4970
$$ y = [53806, 56078, 65619, 48819, 35887, 46184, 56646, 67477, 55494, 43349, 42598, 66136, 68885, 70246, 61531, 61681, 64428, 72980, 72295, 51376, 31073, 39622, 37900, 23093, 20962, 9929, 33058, 56564, 77043, 77196, 61845, 56734, 46526, 43739, 37535, 33215, 16172, 12812, 21762, 14749, 16476, 27548, 35245, 43648, 57345, 53116, 45587, 41510, 44629, 42698, 27279, 28157, 20311, 7447, 21484, 44988, 40492, 13739, 7864, 20896, 45794, 55755, 53928, 53529, 46744, 43339, 41038, 27801, 25448, 39663, 42492, 53267, 75365, 79040, 88173, 84471, 79230, 63309, 56022, 70192, 90053, 89992, 69524, 69237, 95439, 110455, 113267, 119328, 137874, 158129, 161956, 152545, 166012, 156886, 157448, 176732, 195618, 212187, 213527, 200682, 187663, 180180, 184144, 156851, 131354, 138064, 129274, 114304]
13202A14304L969J167j8103k9239q111j9772N371J6551N925j1877o48n144p356
13189D7037N067O900k40J8591n361m641l648r757m463R176J0981L741P367L752
13175H4502k007M677j584j1515j3340j642P300N530K5869Q367j2408j7539K7691
13162A03901J4736j2794n905m841j9777K175J0302L134j0305K556k127M254m448
13149H0861O589P978L906J8917j6779j5679L126J7254J0073J4766j206j6165j2309
13136A01332Q806K0470k926r308J0653J3956k834j6129j4628K5558Q201L858j2584
13123A34425j3095j0344k613J3046K436j1013j2602j2846j6393Q975M038n999
13111G8015J8316J4739k6468k4958L0666J6354O013M850M932J0026J1261J3912
$$ y = [114304, 118273, 119440, 101337, 72098, 63987, 44215, 49586, 66137, 72062, 60185, 59537, 54393, 47037, 52104, 59004, 58764, 77355, 71994, 67353, 63705, 53948, 49485, 58661, 69642, 73383, 80750, 84502, 82495, 87172, 85588, 74073, 60733, 59091, 66391, 71921, 97790, 106157, 93749, 76210, 103901, 118637, 105843, 99938, 95097, 75320, 77495, 87797, 90931, 80626, 83182, 81055, 85309, 80861, 87450, 95428, 99334, 118251, 101472, 85793, 88919, 106173, 116246, 131012, 129806, 113641, 101332, 110138, 130608, 127682, 118374, 129027, 142983, 140149, 124020, 109392, 134950, 143151, 147009, 134425, 121330, 110986, 108373, 121419, 123855, 112842, 100240, 87394, 71001, 79976, 84014, 78015, 96331, 111070, 84602, 59644, 90310, 106664, 112677, 117527, 122459, 132485, 143746, 157658]
13099A57658L711j832j842J1799Q371j1186k101L2169J2647J5184J6921l822j0534
13086B27143P767J3942J4792J4331k1262o050N166j0309j2717N804Q051p641j7244
13073B21773Q106J691j764p385j3014p307j005K8659K3644k378K59J173Q796k501
13059B58747m705Q472J0856L2799J0651j1718K09M138K663R855J5110J7899J2933
13046C67909R199J7618K5024J8003J5169K2823P459O982K398k969K5047P285R917
13033E31864K9428N736P479L1638L0793J6350R781L5138K1292J8983J3729p57
13021G51454J0077K5514L6951J6308j2465K4041M5642L9179L9346O4325P3241
13010A113613L7148N3634O4932P7825N4147M9456M7239J6209M795J0883Q786K6444
$$ y = [157658, 161369, 159537, 157695, 169494, 177865, 166679, 164578, 196747, 209394, 224578, 241499, 237677, 227143, 234910, 248852, 263644, 277975, 256713, 250663, 255829, 245520, 232803, 238607, 246658, 239017, 221773, 229879, 231570, 229806, 222421, 209407, 202100, 201095, 229754, 253398, 251020, 251279, 252452, 261248, 258747, 254042, 262514, 273370, 306169, 316820, 305102, 305311, 309449, 312112, 321967, 337077, 354976, 367909, 377108, 394726, 419750, 437753, 452922, 475745, 483204, 490186, 492584, 489615, 514662, 521947, 531864, 561292, 567028, 574507, 606145, 636938, 653288, 663069, 698207, 719499, 738482, 752211, 751454, 761531, 787045, 823996, 840304, 827839, 851880, 897522, 936701, 976047, 1040372, 1113613, 1150761, 1204395, 1269327, 1347152, 1401299, 1450755, 1497994, 1514203, 1518998, 1529881, 1538667, 1565111]
12998A565111K9286N3228L8923O2376O3881Q6391J05824J23652J44713J32429
12988B405814J41516J25969J29149J79417J96958K38252K51329L16354L77237
12979D361995M35476N30560O48829P96183R69380J163663J416924J712958K018711
12970A4054679K290853K635884L084055L614031M350261N399668O846127Q724256
12962E0999814J1065753J3637051J5882853J6800589J5437117J1572998N720454
12955A41116629r71505p333080j2454558j5702756j6785964j5909570j3641149
12948E8318047j0877485q268026o196720m661436l532760k702875k122656j710663
12940A8245426j448477j241416j078804r40024q27462p40409o43386n39693m26281
$$ y = [1565111, 1594397, 1647625, 1686548, 1748924, 1812805, 1899196, 2005020, 2128672, 2273385, 2405814, 2547330, 2673299, 2802448, 2981865, 3178823, 3417075, 3668404, 3984758, 4361995, 4797471, 5328031, 5976860, 6773043, 7742423, 8906086, 10323010, 12035968, 14054679, 16345532, 18981416, 22065471, 25679502, 30029763, 35429431, 42275558, 50999814, 62065567, 75702618, 91585471, 108386060, 123823177, 135396175, 141116629, 140145124, 132812044, 120357486, 104654730, 87868766, 71959196, 58318047, 47440562, 39172536, 32975816, 28314380, 24781620, 22078745, 19956089, 18245426, 16796949, 15555533, 14476729, 13536705, 12709243, 11968834, 11325448, 10785755, 10359474]
12931A0359474m04189l52943k57567j84316j64994j37182j04346p2922p5779o1333
12921H543903q1623j19441j81994k30280k76159k88921l10369l21482k97466k98547
12911F137621k67046k70252k66794k30655k31318k23309k31155k25733k20186
12902C971173k10657j84960j69802j73996j47153j56373j51174j44096j34651
12893B498311j35097j30991j00560r1683p6225j02156q6595q0348p3965r0528
12883A530163o5944n2624n0049n6353l7924m4837n8519n0610o5664n2519l2070
12872I63050n01j1920k9118l0253l5127l6127l1281k2653k6862k1369j5516l5311
12860F67012j3502K6571P76O005J1172M119k0149M080k4680j9473k2853p0513
$$ y = [10359474, 9955285, 9602342, 9344775, 9160459, 8995465, 8858283, 8753937, 8681015, 8605236, 8543903, 8462280, 8342839, 8160845, 7930565, 7654406, 7365485, 7055116, 6733634, 6436168, 6137621, 5870575, 5600323, 5333529, 5102874, 4871556, 4648247, 4417092, 4191359, 3971173, 3760516, 3575556, 3405754, 3231758, 3084605, 2928232, 2777058, 2632962, 2498311, 2363214, 2232223, 2131663, 2039980, 1963755, 1861599, 1775004, 1694656, 1620691, 1530163, 1464219, 1411595, 1361546, 1305193, 1267269, 1222432, 1163913, 1113303, 1047639, 995120, 963050, 962549, 950629, 921511, 891258, 856131, 820004, 788723, 766070, 739208, 717839, 702323, 667012, 653510, 680081, 680857, 686862, 698034, 702153, 682004, 686084, 661404, 641931, 619078, 548565]
12848E48565n9395k0453k5378l1424j3656j026q781j2842K2195R94j8379R334
12836C89754K1506K550L949J2106p459l3457k7410k6162m0910l3745R699k304
12824B68117j8058j3360k7157j8879p290q180j0845j2075O472K537j2261M467
12812A53488M193l956j469J897N933j772J3561J4057K6677J1131l36j1231j3317
12799A98856l8425k499J4701J0304L602k3202p962O022O66l256Q061J5014j1301
12786A70581J9431K1377m63j2848p067j0027l413R306r099j2971p460j0782J1061
12773A57626N989M599l912J844J4010J3586J0000p747k596J2550K1404R807p413
12760B29747k4566j6039N988Q458R609k4937k0522P421o418J8804P341j3467m617
$$ y = [548565, 489170, 468717, 443339, 411915, 398259, 397233, 388452, 375610, 397805, 398799, 380420, 389754, 411260, 413810, 417759, 429865, 422406, 388949, 361539, 335377, 294467, 260722, 270421, 268117, 250059, 236699, 209542, 190663, 183373, 175193, 164348, 152273, 158745, 161282, 149021, 153488, 157681, 153725, 152256, 154153, 160086, 158314, 171875, 185932, 212609, 223740, 223404, 212173, 198856, 160431, 157932, 172633, 182937, 186539, 163337, 155375, 161397, 162063, 158807, 166868, 181882, 170581, 190012, 211389, 210926, 198078, 191011, 180984, 177571, 186877, 177778, 164807, 157347, 146565, 157626, 163615, 168214, 164302, 166146, 180156, 193742, 203742, 195995, 193399, 205949, 227353, 237160, 229747, 205181, 189142, 195130, 203588, 213197, 188260, 167738, 175159, 168741, 187545, 194886, 181419, 176802]
12747A76802N146m671R209L143k222L237j3584r388n525N285p763j2566r89p248
12733A38866L161K2755q783l1612j1948J7331J678j0509P542j145o371K5180k633
12720A43512P939j4100l7008q606N488J1236L960Q060J8957r120p728J7114K0776
12707A60480J605n387q932j1738j1003j4785L827j4159l2855k2358r19P521J3956
12694F5253j3046j3397j2822j127O550j655L915l05P601q388j3203J0124P100
12681C6600q465l583J1137K1715J0223j7442r812j643J3148k09k942r047p439
12668C2241M318n813R901M940k4134j1166m902K0127K0073l144o344k7973n976
12655B148P194r642Q950k709k918q311J0918J7259P259R099R080N06j447m756
$$ y = [176802, 181948, 177277, 186486, 189629, 187407, 190644, 177060, 167672, 162147, 167432, 159669, 147103, 146114, 138866, 142027, 164782, 155999, 124387, 112439, 129770, 131448, 120939, 128481, 127336, 120965, 146145, 143512, 151451, 137351, 100343, 91737, 97225, 108461, 112421, 120481, 139438, 130318, 122590, 139704, 160480, 162085, 156698, 147766, 136028, 125025, 110240, 114067, 99908, 67053, 44695, 43776, 51297, 65253, 52207, 38810, 25988, 24861, 31411, 29756, 33671, 33366, 40967, 32579, 19376, 29500, 36600, 28135, 24552, 35689, 57404, 67627, 50185, 40373, 38730, 51878, 51669, 48727, 39680, 32241, 36559, 30746, 40647, 45587, 21453, 10287, 5385, 25512, 45585, 42441, 36097, 8124, 2148, 9342, -300, 8650, 5941, 3023, -5288, 5630, 22889, 30148, 39247, 48327, 48833, 47386, 42630]
12641D2630L81K0179K3031J933l769P885L998j0052o307j0430j1407j0486p577
12628D0009j689q83K8968O928m033K951o13J733J4207K738j5222n753J2872J0302
12614I2515r709M257K051J0280j1740j3261n88o819m104j7701p289n192M328J6401
12600E3429J0507O501O847r561k0352J4920o426J589p655O580M617p738j263Q702
12586F0697L93J0994M039P276N669l895j1058k4395k90J7793Q885j036o567j9753
12572D8752p985R084l733j4089J7778R891o10o600M702L030P056j6937n392J5468
12558F0415l827R796l22m378M665K2860j1451N271R027P722J4166J6306K9838
12545A60088L2072K163J5885K7230M2478M8129N2374M1146L4515M3530M1321N9614
$$ y = [42630, 43011, 63190, 86221, 88154, 84385, 92270, 96268, 86216, 79909, 69479, 58072, 47586, 40009, 38320, 37437, 66405, 73333, 69300, 72251, 71638, 73371, 87578, 90316, 75094, 69341, 82213, 92515, 82806, 87063, 89114, 99394, 87654, 74393, 73805, 66986, 62882, 45181, 37892, 32700, 37028, 53429, 63936, 70437, 77284, 67723, 47371, 62291, 55865, 57454, 49799, 56379, 60996, 53258, 51995, 60697, 61090, 72084, 76123, 83399, 89068, 85173, 74115, 49720, 49430, 67223, 76108, 75072, 68505, 48752, 40767, 49851, 46118, 32029, 49807, 59698, 59088, 52488, 57190, 60220, 67276, 50339, 44947, 60415, 56588, 66384, 66062, 61684, 66349, 89209, 77758, 83029, 92056, 99778, 113944, 130250, 160088, 192160, 194323, 210208, 237438, 279916, 328045, 380419, 421565, 456080, 499610, 540931, 600545]
12533F00545N5319O3763N9034N2950K1867k4914m9517p2248q1388p9789o8496
12522D77126p5199o7638n4884m2839j1715J3681J6094J3553j3300p2L744j6600
12510B41951N818J3845m046j413J5668K5241J7575K3794L6866M9744J6331K2351
12498D63725N7908P3474J03368J02575J22195J21601J44391J98091K25095K25512
12488A837935K13517J95725J35369O4402k0193r5695j67198k05128k41637k47981
12478A469116k14602j69782j10469j06035j23296q3622r5335q0885n1984j9522
12468D13584j4733j8206j5802l9465l1667j4642j289O552j5339l7705j5901L706
12456B19093Q10o282q179J3956J1915k319k1633K928j663k428o110j2112j5281
$$ y = [600545, 655864, 719627, 778661, 831611, 853478, 828564, 779047, 706799, 625411, 545622, 477126, 401927, 334289, 279405, 236566, 224851, 238532, 254626, 268179, 254879, 254807, 258551, 241951, 247769, 261614, 257568, 256155, 271823, 297064, 314639, 338433, 375299, 425043, 441374, 463725, 521633, 595107, 698475, 801050, 923245, 1044846, 1189237, 1387328, 1612423, 1837935, 2051452, 2247177, 2382546, 2446948, 2426755, 2331060, 2163862, 1958734, 1717097, 1469116, 1254514, 1084732, 974263, 868228, 744932, 661310, 565975, 485090, 433106, 413584, 398851, 380645, 364843, 325378, 293711, 279069, 277780, 284332, 268993, 231288, 215387, 219093, 219903, 213621, 205442, 219398, 231313, 228994, 207361, 210289, 208626, 206198, 200088, 187976, 172695]
12443A72695o673J5009j1279n252r890q351l704k7742o234j2701p693K5176O908
12430A20269j1278j4258n043j7881O343n8j5004L191Q241J2790p330L678j7272
12417F6388j9341j2588J0174J554K318R164J4833M625K189o241j0333J0480N513
12404G8735p738j7460k1311M047p371j5834q123P857J2899J1282j1148J1646l162
12391C4319l998J5509K1377J7218j2708k6048k8047J9132J7874K1065o604n217
12379F3872K3137J703m725J6101j608R689J0862j7520N821L1353J6400K1786K2121
12366A98992K5863K6805K6907N6967N8016M7222P1386P1488O6585O9265M6865
12355G66361K0446m733n6456q3640q6181r4997r4642m8782n1117l7831j8331k4787
$$ y = [172695, 166022, 181031, 169752, 164500, 154610, 146259, 142555, 114813, 108579, 95878, 88185, 113361, 120269, 108991, 94733, 89690, 71809, 78152, 78094, 63090, 66281, 74522, 87312, 79982, 83660, 66388, 47047, 34459, 44633, 46187, 48505, 57669, 72502, 77127, 79316, 73075, 62742, 73222, 78735, 70997, 53537, 32226, 36273, 28902, 13068, 4945, 12802, 25701, 36983, 25835, 37481, 34319, 30321, 45830, 67207, 84425, 71717, 45669, 17622, 36754, 54628, 75693, 69089, 63872, 87009, 88712, 83987, 100088, 98480, 108169, 119031, 101511, 107332, 138685, 155085, 176871, 198992, 224855, 251660, 278567, 335534, 393550, 440772, 512158, 583646, 650231, 719496, 766361, 786807, 782074, 725618, 641978, 555797, 460800, 366158, 317376, 266259, 228428, 210097, 185310]
12343A85310j5075n890j1640O216n905r713k7525k2807k7261j644k687J4084J567
12330G7030j7030J180K6611J7046N98k0383k484K249q959j8186j895M24O178J2127
12316G4506j165k0108j2603J3359M324j8642k4826J5830N388m747r673l122l371
12303A5150P515J7593M748l083j4110N490L226j1243P807R309J0308q133N915
12290E0492Q943L73j1811N736k0340m812P715J4752k409k3852j1860j6470J69
12277c374p661J0280J557o32j747J5415L330k490J177r942N933Q645l122K997
12263B0366N277q604o567R438n968k608J9780r497j7121L608l772j629J0853J0066
12249B3622j0707N794R615N051j0614O539n949j1402l42p72j0709j151J3784J2150
$$ y = [185310, 170235, 164345, 152705, 158921, 153016, 143303, 115778, 92971, 65710, 64066, 61379, 75463, 77030, 60000, 61180, 87791, 104837, 105435, 85052, 82568, 84817, 75858, 57672, 55777, 56201, 62379, 74506, 73341, 53233, 40630, 53989, 58313, 39671, 14845, 30675, 36063, 31316, 21643, 18521, 15150, 22665, 40258, 45006, 41923, 27813, 33303, 36529, 25286, 33093, 42402, 52710, 44577, 50492, 59435, 59808, 47997, 53733, 33393, 28581, 36296, 51048, 48639, 24787, 12927, -3543, -3374, -11035, -755, 802, 170, -1577, 13838, 17168, 14678, 15855, 5913, 11846, 20491, 17369, 20366, 25643, 17039, 10472, 19910, 13942, 11334, 31114, 21617, 4496, 8104, 4332, 2703, 13556, 23622, 12915, 18709, 28324, 33375, 22761, 29300, 23351, 11949, 11607, 10835, 126, -1025, 12759, 24909]
12235B4909L774j1897j7626j2123k067Q930J1051K711K5688J444r555m690n53
12222A9996o300Q677j8515M52P810k830N737P909j0670k01J659Q891J357j1773
12208A2199k0547o418J5472K628p836M860K0803o13n378r677j0143r60R411L169
12194F970J3759K034p304m743l355q300j7167J3326J8929N693N050N350p064j6033
12180G145n875o185o588J8936K3568q489k1460j4794R893K9995J8869m015M537
12167D5537o776j5751r009o699j259o188q444J1937K3040n803R876R81j9172n359
12153F911O153j333j6931j0036J3107J56J423O675m843l113J8466O25o786M79
12139A0953J9602M492k3904j4685K833J5708j221r46m960k474r209J8021m708
$$ y = [24909, 28683, 16786, -840, -12963, -15030, -6100, 4951, 7662, 33350, 34794, 25239, 20549, 19996, 13696, 22373, 3858, 4310, 12120, 9290, 15027, 22936, 12266, 12065, 13724, 22615, 23972, 12199, -8348, -14766, 706, 3334, -4502, 358, 21161, 20548, 15170, 5493, -4650, -5610, 3801, 6970, 20729, 22763, 15459, 10716, 7361, -939, -18106, -4780, 14149, 19842, 24892, 30242, 23178, 7145, 1270, -4915, -11503, 7433, 31001, 22512, 1052, -13742, -3849, 26146, 45015, 41000, 45537, 38761, 23010, 14001, 7302, 6043, -145, -8589, 3348, 26388, 20585, 30461, 31442, 12270, 6911, 13064, 11731, -5200, -15236, -2129, -1973, -550, 6125, 1282, -1831, 16635, 17260, 10474, 10953, 30555, 35047, 11143, -3542, -709, 14999, 13778, 12832, 7872, 5398, -3811, 14210, 9502]
12126I502k6828r549K9752K4375m89j9014l6327P42J2056J9478L715r103j4960
12113a6650p566m673J4370J4772R648m773j3286O54J570J5396o091j862K91N255
12099G055j403P70p752L212p874Q598P348l324O772J3571k137j023L886k2025
12085E674j9572J1871J0675q778P111k25l724J2878P262J2436N886m866J552r086
12071B9094J07l0171p834L606j376J1428L0280M457j6418P779M057j782Q208o382
12057C5053j2202m433O79K230j0764r411J415r80J8427J3485M461j9980o816r65
12043A0199J1633l606K465L9293K018l3092j6859p565r010O675J966m055k309
12030b247M445J049k609J1423l890O723J9274r509l873o97J6249n69M049J4941
$$ y = [9502, -17326, -26875, 2877, 27252, 26763, 7749, -28578, -27836, -15780, 3698, 7413, -1690, -16650, -24216, -28889, -14519, 253, 9901, 5128, -8158, -7504, -5934, 9462, 3371, 1509, 1800, 7055, 5652, 6422, -1330, 1882, -5992, 2606, 9954, 6630, 13402, 26973, 24836, 23813, 27699, 5674, -13898, -2027, 8648, -130, 6981, 6756, 3032, 15910, 23172, 35608, 41494, 36628, 38180, 29094, 29201, -970, -8804, -5198, -6574, 4854, 35134, 39591, 23173, 30952, 35009, 33227, 41435, 35053, 22851, 18418, 19097, 21327, 10563, 1152, 2567, 1587, 20014, 33499, 37960, 17980, 11164, 10199, 21832, 18226, 20691, 59984, 62002, 28910, 12051, 4486, -4524, 2151, 4117, 62, -2247, 2198, 3247, 638, 12061, 8171, 14894, 34168, 24659, 20786, 20089, 36338, 35769, 39818, 54759]
12016E4759L264j3467k0677j8818l443P799J0161J9576P993j239j9107j3928m563
12003H310j2711k1280j828K571J5874J6168J0262k094L786r966M75n018j4038
11990i489j420J5209K1013k334j7143j3318k1643p108J2998j714J1779K4097k3970
11977a3043o247L2037R904q3O36Q972m54q305o883j1243j2979r118M073m407k67
11962a7407j3156J2522P93O271K084p67J4690J4596J972j3040j5275j0803j890
11949a9410p115L73P084J9215J0685n232K535M250J4341L928j0344k1095j2296
11936a3081r87n558J8937J9359l425j5007K7K4752j6305j1637Q004O677j0533
11923A223M66k138O420N540j082n40N030M716M079j6201r965q164j4790L698J0154
$$ y = [54759, 58023, 44556, 23879, 5061, 1618, 9417, 19578, 39154, 47147, 45908, 26801, 12873, 8310, -4401, -25681, -27509, -24938, -9064, 7104, 17366, 15272, 19058, 9092, 9567, 4549, -9489, -10909, 4300, 25313, 22979, 5836, -7482, -29125, -36233, -23235, -24949, -13170, 10927, -13043, -19290, 12747, 22651, 22568, 23204, 32176, 31722, 23417, 16534, 5291, -7688, -16806, -12733, -17140, -17407, -30563, -18041, -17248, -10977, -8893, -9660, 5030, 19626, 21598, 8558, -6717, -17520, -19410, -26525, -26152, -19068, 147, 10832, 5600, 8135, 12385, 26726, 30654, 20310, -785, -13081, -14068, -19626, -689, 18670, 15245, 238, 265, 25017, 8712, -2925, 5079, 11756, 1223, 1689, -449, 5971, 11511, 10429, 9889, 14919, 19635, 23714, 7513, -2452, -10616, -25406, -21708, -11554]
11908a1554l075K778J1457J5045L147o246J142j4916o953N897r70j74K7517R66
11894B4061k1459N224l002m292L519J0063n708M289K68o511p25L1031o669k6757
11880C332m39J6P161J0035K358j5090k3291L148K2154J9491o814l623m673k660
11866A1105K63o98l418p256k0712K4801O495Q397K154n328j523p24J710r94j0832
11851C440n878J876J0429r336K0528J0091j2025j9040J0504R808l574R108q456
11838A7475J7778R914M79m341j3049r102J1111J1662l15o048j5838j190J1380
11825B9916J2218j1880j2838K0895q345m744l702l949K5152j012k451J897j2146
11812B9011p940O197L371L688k4256j7098M942J6094J8208j7688k8472j479K185
$$ y = [-11554, -14629, -11851, -394, 14651, 17798, 11552, 12694, -2222, -9175, -3278, -4248, -4422, 23095, 24061, 2602, 7826, 4824, 532, 4051, 14114, 8406, 12695, 12963, 6452, 5727, 36758, 30089, 3332, 2893, 2909, 10070, 20105, 22463, 7373, -15918, -12770, 9384, 28875, 22061, 18438, 13765, 11105, 11368, 10670, 7252, -4, -20716, 4085, 10580, 18977, 21131, 15803, 14280, 13556, 15266, 14272, 3440, -2438, -562, 9867, 531, 21059, 31150, 19125, 85, 10589, 20397, 16823, 25931, 17475, 35253, 45167, 45646, 41305, 28256, 19154, 30265, 41927, 41612, 35564, 19726, 18536, 29916, 42134, 30254, 17416, 38311, 29966, 25222, 21520, 17571, 42723, 41711, 39260, 41157, 29011, 21071, 27268, 30639, 34327, 10071, -7027, -2085, 14009, 32217, 14529, -13943, -15422, -13237]
11799a3237J2734k230m808R102J338k079K750R542j4607Q226J1757k944l621J5144
11785B7067J2404k2910l0057PL606l660j7993m18J0536J2398J5553J842n75J0447
11771A8247J4048J1725n900j2018m661j1050j1933j855j5589o201K2885J1002
11759H700r417O76Q00J4514J9877J4110k965k0727M56J3276p582j1560l068N951
11745B3041j025j4071O692l194q156K942J3401M318k469j7111J7993L499r549
11732A6311N526j2912p524J9537L296j0765k903N619n898J3905K2456l309j5634
11719B7705j6092P069l086J402j1423j2585K295m190K3429O682k829j2141M856
11706A1092J3718j4977j1040m63o348J1641J0937k758R44j60r891R488m690l932
$$ y = [-13237, -503, -2733, -7541, 1561, 2899, 820, 3570, 13112, -1495, 6731, 18488, 15544, 11923, 27067, 39471, 16561, -13496, -13489, -9883, -13543, -31536, -31954, -21418, -9020, 6533, 8375, 7800, 18247, 32295, 44020, 38120, 26102, 21441, 10391, -1542, -3397, -18986, -25187, -2302, 8700, -717, -41, 759, 15273, 35150, 49260, 46295, 25568, 26024, 39300, 31718, 20158, 17090, 23041, 22016, 7945, 14637, 11443, 3287, 6229, 19630, 23948, 21479, 4368, 22361, 25860, 16311, 21837, 8925, 1401, 20938, 24234, 13469, 10566, 16185, 10287, 24192, 46648, 43339, 27705, 11613, 18682, 15596, 16998, 5575, -7010, -4715, -8905, 14524, 21206, 18377, 6236, 11092, 24810, 9833, -1207, -1670, -8018, 3623, 14560, 11802, 12746, 12586, 2695, 12183, 7493, 3561]
11692C561J3124p517L434K2037J0696p127j3824Q27k4258L736J1781j6335K112
11679B247O6M424J070P678j427O76L332N785O834j4609P5J6682R932j2633j3012
11664A7120o666Q22J8154Q261k218l933l203K630M447M610k0377n632j0129j3910
11650a0024J3105R138r01p899m460J7355J6951J4440k7354k2355J7031j722r107
11637D198m314L879N432j0300q227J0395J3429R6N844J2678j2220j6535k1332
11624a6977k230J2078J2296o691J0503J4239J1114R259j3495j0112l595j659N045
11611A9775j2721N118J3484l209k621K0686P0R063J827k5471j1411Q680j3818
11598I452q757N793K164p929r670Q269r177j0017J6558r432J885J3119J4750K127
$$ y = [3561, 16685, 9168, 12602, 34639, 45335, 38208, 24384, 25211, 953, 4689, 16470, 135, 2247, 2313, 6737, 7807, 15485, 14058, 14734, 18066, 23851, 30685, 16076, 16151, 32833, 42765, 30132, 17120, 10454, 11276, 29430, 37691, 35473, 31540, 28337, 30967, 35414, 40024, 19647, 14015, 3886, -10024, 3081, 12219, 11318, 3419, -1041, 16314, 33265, 47705, 20351, -2004, 15027, 13305, 4198, -116, 3763, 9195, -1105, -9332, 1063, 14492, 14588, 20432, 33110, 20890, 4355, -16977, -19207, -7129, 5167, -1524, 8979, 23218, 34332, 43591, 30096, 19984, 16389, 14730, 19775, 7054, 12172, 25656, 22447, 19826, 40512, 40582, 49645, 51472, 26001, 14590, 23270, 9452, 695, 6488, 8652, 723, -8947, -678, -9855, -19872, -3314, -12746, -10861, 2258, 17008, 19135]
11584A9135J2243K0069O910j5361o382j2926n405n357J791L172q268L984P781
11571B1386J4640O778M706N5j4864j1109m500M581Q27m672J7146p931j2595K507
11557A6955R521r45N074P97K938P188k74j030q924m483J0391K89p291N568J623
11542C7397J046j2612Q48K064j299q30M008K50k3417j278K1426J4796j1564j2851
11528A7984j4349j0792R938Q005R525N430o560K5626L3444J882j6890j8324p254
11515C7665j5723k306M21j68n341J2273Q312j2404L201J4528k2903K144J2100
11502C1799k992o904J6740l254k985r717Q945J790p052k243j4852J6209J4271
11489C9755j9671k745k605r425O035J4303J283O364Q195J1097J332q796j7722
$$ y = [19135, 31378, 51447, 58357, 42996, 36614, 23688, 18283, 12926, 14717, 17889, 9621, 13605, 21386, 36026, 42804, 47510, 47565, 32701, 21592, 17092, 21673, 22500, 17828, 34974, 27043, 14448, 16955, 26476, 25531, 30605, 31402, 34340, 41528, 41254, 40224, 31300, 26817, 37208, 37497, 30206, 35774, 37397, 38443, 25831, 26679, 28743, 27444, 26614, 30622, 30872, 7455, 6177, 27603, 42399, 30835, 17984, 3635, -7157, 2781, 10786, 20311, 25741, 19181, 44807, 78251, 80133, 63243, 44919, 37665, 21942, 19636, 20057, 19889, 14548, 26821, 35133, 22729, 25930, 40458, 17555, 19699, 31799, 28807, 21903, 38643, 35389, 32404, 22687, 31632, 33422, 26370, 24127, 9275, 25484, 39755, 20084, 17339, 14734, 5309, 11344, 25647, 26930, 33294, 41489, 52586, 53918, 45122, 27400]
11476B7400j6546N801J1319j1357j0725R628K1156p350j3718L077J893O699J7907
11463D5184k1307L041P515j277q529p794N227J985n764N964J7300N453O691K691
11449E6380k539J5508J6797p950j9183k985l83q345j499K1942K6296J9156J77
11436A13372J389J8205K5588J4330K8739L2671N876J1636K0717L8880N6267O4660
11424D32330O3855P4141R3853J32705J17249J27151J15520Q0758L5701k6020p3634
11413A173609q3818j12329j47250j11397j08710j05249n7696m8269l5923l5771
11403C27197m5006k4525j4213j1982r718l981k407O348k5272k7161k7108j0965
11391A31207J4545j9059k5991j4653J1224Q860P355J7480m455J6576j149j1239
$$ y = [27400, 10854, 16655, 27974, 16617, 5892, 15520, 36676, 29326, 15608, 18685, 20578, 27277, 45184, 23877, 26918, 34433, 33156, 24627, 16833, 22060, 24045, 18281, 24245, 41545, 46998, 53689, 56380, 53841, 69349, 86146, 78196, 59013, 56028, 55645, 47300, 45801, 67743, 94039, 113195, 113372, 114761, 132966, 158554, 172884, 201623, 234294, 240170, 251806, 272523, 311403, 367670, 432330, 496185, 570326, 664179, 796884, 914133, 1041284, 1156804, 1237562, 1273263, 1247243, 1173609, 1089791, 977462, 830212, 718815, 610105, 504856, 447160, 398891, 362968, 327197, 282191, 257666, 243453, 231471, 221753, 217772, 215365, 221713, 196441, 169280, 142172, 131207, 145752, 126693, 100702, 86049, 97273, 106133, 113488, 130968, 126513, 143089, 141940, 130701]
11379A30701j6632J0401j764r611j4366k470j0506k3428Q745Q994k0025P295O004
11366G3338Q234k63q019K933O848j2341n044j1106j0668R10Q931O128K5879k1008
11352F4752k0813j3936m259o426J0704k0456O123P385O657J4619J2096o422j8942
11339C1082L339L690J2229M194L507J0465L36l592j7244j6961j9161r21J3637
11326B4600J4433J1723j0j0996l868P347N112j91K0348J8106j7718j3300K279
11313E7865q03r762q99N387q081j2865L832K987J0825P951L796L790r529O117
11299F0611j3224k9375j1849J0739K0927K1301j4879j6603r452K342o866L538
11287A7210j7409l29J2669J4980k766j280J0861R153j288k1713n607L095J7935
$$ y = [130701, 114069, 124470, 122706, 113095, 98729, 96259, 85753, 62325, 71070, 80064, 60039, 67334, 73338, 81572, 81309, 73290, 76223, 83071, 70730, 65686, 54580, 43912, 44822, 53753, 59881, 85760, 64752, 43939, 30003, 25744, 19318, 30022, 9566, 15689, 23074, 29731, 44350, 56446, 50024, 31082, 34421, 38111, 50340, 54534, 58041, 68506, 68842, 65250, 48006, 31045, 11884, 10963, 24600, 39033, 50756, 50746, 39750, 35882, 43229, 48341, 48150, 68498, 86604, 68886, 55586, 57865, 57062, 47300, 46401, 51788, 43707, 30842, 34674, 37661, 48486, 56437, 60233, 64023, 54494, 60611, 47387, 18012, 6163, 16902, 37829, 59130, 44251, 27648, 18196, 20538, 13672, 17210, -199, -528, 12141, 27121, 24355, 23075, 33936, 43089, 41801, 20088, 14481, 17576, 35511]
11274C5511N766J2890n031L306l22P268n285k898o799l626J0062O888p226j890
11260D8614p041J7836K0400J2191r037m373r046q277L454l5L847j8589Q453J6885
11246G5282P452p879r620p631N847j4622M27l626k246p07j4433J4183J2610M840
11232E9877P38j0311o213k045K779l300J3152j3135j5883J1158J4514J4678J0245
11219G6254k1923n141o211j7098P945J0137M78R602M438k1239N113K2014o283
11206E8086j0833r598R032M985J5997o262L875j2778k8060r564J0333J0900J8011
11193E4124J634P71M685J05j4486j052j3218q777J9682L5568J2012k3099j2372
11180E5577M642M32O294N527j7476p530J2834P054R6r200j7329J3249J5315m348
$$ y = [35511, 41277, 54167, 49136, 52442, 52120, 59388, 54103, 51205, 44406, 40780, 50842, 57730, 50504, 48614, 41573, 59409, 79809, 92000, 82963, 78590, 69544, 61267, 64721, 64686, 68533, 49944, 58397, 75282, 82734, 74855, 65235, 57604, 63451, 48829, 49256, 45630, 43384, 42677, 28244, 42427, 55037, 59877, 60615, 50304, 44091, 42046, 44825, 41525, 54677, 41542, 25659, 36817, 51331, 66009, 76254, 54331, 49190, 42979, 25881, 33826, 43963, 44441, 54043, 58481, 37242, 42355, 64369, 58086, 47253, 37655, 46687, 51672, 67669, 61407, 65282, 52504, 24444, 14880, 25213, 36113, 54124, 55758, 56529, 61214, 61319, 46833, 45781, 32563, 23786, 43468, 79036, 91048, 67949, 55577, 60219, 60651, 66945, 72472, 54996, 47466, 60300, 67354, 67450, 58250, 40921, 54170, 69485, 65137]
11166F5137J3409n062k7040m572q762k921L641J9434J444n497K994o55J2798k889
11152F1459M223n57J613n4Q424n125j1666k1714M600l01N37L800m278n045R301
11137D5217M943o772O807Q765O149k0J0848p105J797j6660j1081N122J5732o723
11123E7019j8663j2348J7008K0162p564j7837K211K6150J1283j7689P979j1245
11111E6466k6690M635P923P811M935J1773J9817J4231l914j2215J139O349L515
11098I5775l238J1022J9649L7429L7754L9057N4221K5839K5836J9896L4322J6005
11086D13567j0879m6628k9678k2158m0469l2046j4192k4352k7357l5272j4580
11075A15956L138k752j2178n166o723l865n352O3j4606j4251K5445K0701L997
$$ y = [65137, 78546, 73484, 46444, 41872, 33110, 30189, 33830, 53264, 54708, 49211, 52205, 51550, 64348, 61459, 65682, 65125, 66738, 66684, 75108, 69983, 58317, 36603, 41203, 40902, 41439, 45239, 40961, 35916, 45217, 50160, 43388, 50195, 58960, 65109, 65089, 75937, 68832, 70629, 53969, 42888, 48010, 63742, 57019, 38356, 26008, 43016, 63178, 55614, 37777, 39988, 66138, 77421, 59732, 67711, 56466, 29776, 34411, 42334, 50145, 55080, 66853, 86670, 100901, 96987, 84772, 85911, 92260, 95775, 92537, 103559, 123208, 160637, 198391, 237448, 291669, 317508, 343344, 363240, 397562, 413567, 402688, 356060, 326382, 304224, 263755, 231709, 217517, 193165, 165808, 130536, 115956, 119094, 116342, 104164, 98998, 92275, 88410, 83058, 83121, 68515, 54264, 79709, 100410, 104407]
11062A04407r50o459Q020l356Q333K0372j0624L146Q428K3590r87j1263j0037
11049A32620l7074n963J6403k1270q67K3132J378j5691n725m110p300l600l610
11036F8323Q154J1301R991j82K0350J9345K211m035j1788j592K2025K9132J3132
11023A86367K2352J5854P746J0682J2475j1301o273l4013o969K008j3633j3640
11011A71655J6142r577j5270j1746r838J3726J224j1639N27q874J817J3760m83
10998A51424K0821O001L845J0837M536K6327K9244K3923j6756l0335j6799K217
10986B15285p767k2776r921k3669j284j104j792m968k4266j8668L816P705o858
10973A03733j563J3526N639Q441J3456j1526q604j1327J1011l7m534r293l965
$$ y = [104407, 103457, 96998, 105018, 101662, 109995, 130367, 119743, 122889, 131317, 154907, 153920, 142657, 132620, 95546, 89583, 105986, 84716, 83849, 106981, 108359, 92668, 86943, 82833, 75533, 71933, 68323, 76477, 87778, 97769, 97587, 117937, 137282, 139493, 135458, 123670, 122078, 144103, 173235, 186367, 208719, 224573, 232319, 243001, 255476, 244175, 237902, 203889, 196920, 198928, 185295, 171655, 187797, 178220, 162950, 151204, 141366, 155092, 156316, 144677, 145204, 136330, 138147, 151907, 151424, 172245, 178246, 182091, 192928, 197464, 223791, 253035, 276958, 260202, 229867, 213068, 215285, 207518, 184742, 174821, 151152, 149868, 148764, 146972, 142004, 117738, 99070, 102886, 110591, 103733, 102170, 115696, 121335, 129776, 143232, 131706, 123102, 111775, 122786, 122749, 118215, 108922, 104957]
10960A04957P175Q113L671o842J221J4006J6029q758m743o979O204m265j940J1052
10946A38901m856j6461l5055K027K9290N448N640Q675L752J2058q566k0286m060
10933A16507K068m683P487J1396L272k2793o685O28P931q444j5201p906K924n018
10919H1483K0259P114n260j1137N792k123K6328J6132M414q167K091n910k567
10906A28449L126j757j619m545J2172p269j8426n771J9822J4106J8289K9864P429
10893A93870J7227J5750O510Q578J358n288o468K4836R244K5703M5519L1665M4022
10880D12526N5886O9373R5727J23019J32444J75908K45073L07037L31461L03085
10870B251539K19369J20615M086j36037k45259l10497l20268l08576k31721j68627
$$ y = [104957, 112132, 120245, 123916, 117074, 118295, 132301, 148330, 139572, 134829, 127850, 134054, 129789, 127849, 138901, 134045, 117584, 82529, 84556, 113846, 119294, 124934, 133609, 137361, 149419, 140853, 120567, 116507, 118575, 113892, 121379, 132775, 136047, 113254, 106569, 107197, 115128, 106684, 91483, 83577, 86501, 81483, 101742, 108856, 103596, 92459, 98251, 96128, 122456, 138588, 143002, 134835, 136926, 131016, 128449, 131575, 129818, 128199, 123654, 135826, 128557, 110131, 104360, 124182, 138288, 156577, 186441, 193870, 211097, 226847, 233357, 241935, 243293, 238005, 231537, 256373, 265617, 291320, 336839, 368504, 412526, 468412, 537785, 633512, 756531, 888975, 1064883, 1309956, 1616993, 1948454, 2251539, 2470908, 2591523, 2595609, 2459572, 2214313, 1903816, 1583548, 1274972, 1043251, 874624]
10860H74624j33740j17999p4456l1014m3632m4165k0424j6330j4438j5126q62
10849C62438r083j9118k1030j8537J0244J5448M146R96k9476k2551J3109O762
10837B93348N723M919j0858R751J268k8273j0291p205O144l622n388N428o96j1036
10823B49212l3640j4102r434J0273L935j0960J93j0010n876O665P863L202L711
10810B01032J8317m18j4006r057q366j0495k3648j0055J1986J9126j4944Q483
10798A67955Q647P728J6597n862J882m889p440R099j3007k8271r361J026r818
10785A34286n043n563J5480K8082J1690M501L138q26p311j5239N172K4049L21
10772A92737k7225P14P320J0532P304k157J2907K171J3084j824m639n883K7o432
$$ y = [874624, 740884, 622885, 548429, 517415, 473783, 429618, 409194, 392864, 378426, 363300, 362438, 353355, 334237, 313207, 294670, 304914, 320362, 324508, 325504, 296028, 273477, 286586, 293348, 299071, 303990, 293132, 302883, 304151, 275878, 265587, 258382, 264526, 260904, 255516, 260944, 260248, 249212, 215572, 201470, 192036, 202309, 206244, 195284, 195477, 185467, 179591, 186256, 194119, 197321, 201032, 219349, 218931, 204925, 195868, 187502, 177007, 153359, 143304, 155290, 174416, 159472, 167955, 176602, 184330, 200927, 195065, 196947, 192058, 184618, 193717, 180710, 152439, 143078, 144104, 134286, 129243, 123680, 139160, 167242, 178932, 183433, 186571, 185745, 178434, 163195, 168367, 192416, 192737, 165512, 166226, 173546, 184078, 191382, 189225, 202132, 204303, 217387, 215563, 210924, 205041, 205068, 198636]
10758A98636m529p835m5j7244k3335J0349K5581O883M473N209N17j7196p9j871
10744A79514J5392J8049j6578P258j502j8569j442j864L5596K4986j57J0117K4155
10731B74955K5655J5704K0363K6926K8761J5478O49K7934J6635j9815q141r205
10719D15899j70j1999j4070R354N03o7J3785J1704J3072K0071N064Q598J9040
10706D90784j1473j9676k8856k8378k772j7769j6330m105m147k0884k9003k239
10694C05152j410j4804l299l516k234J5044N95j7044p129q655M206j390o873k3243
10680B35400k1393M99J9060K1623K246j884O13K68J9012L880j184J089J283k714
10666B77798j869j657K0120j1613j2960N696K6209L0614J6791J6101K1225K0925
$$ y = [198636, 194107, 186272, 186227, 168983, 145648, 155997, 181578, 188461, 192934, 198143, 198660, 181464, 181385, 179514, 194906, 212955, 196377, 203635, 202133, 183564, 182122, 180258, 215854, 240840, 240683, 250800, 274955, 300610, 316314, 336677, 363603, 392364, 407842, 408491, 436425, 453060, 433245, 425104, 415899, 415729, 403730, 389660, 399014, 399517, 399450, 413235, 424939, 438011, 458082, 463146, 471744, 490784, 479311, 459635, 430779, 402401, 399629, 381860, 365530, 361425, 357278, 336394, 307391, 305152, 303742, 288938, 285639, 282123, 279889, 294933, 295528, 278484, 271355, 262700, 266906, 265516, 258643, 235400, 214007, 214506, 233566, 255189, 257435, 255551, 256164, 256432, 275444, 279324, 278140, 279229, 280512, 277798, 275929, 274272, 294392, 282779, 269819, 275515, 301724, 332338, 349129, 365230, 386455, 407380]
10654D07380L570r695J460J1167R977q532j1445j1586j0411k8777N525J9615N817
10641C84065l397K182L6587M8872N3494J8444j633Q59M165M789P658K3711j4244
10628E65552K3445K7817J5564M9620N8679M0916M9287J04260J29501J57608J52430
10617A374679J50491J45412J08618O5567m378l7697q8771j27419j39851j44311
10607A302340q8920p4174p0144o8334n1218k6182K9943M3987L1531M4403P1753
10596A144985P2525P3308R5731R7290N8801O1759K3576P431Q615p221J699M5685
10584A684184R7106J21854J30807J41467J29135R2479L8129j6659n0680j27018
10574B240804j39248j47624j45093j06512j05755q6447p0023m3625k6500p405
$$ y = [407380, 410950, 401255, 402715, 413882, 423859, 415327, 403882, 392296, 381885, 353108, 358633, 378248, 384065, 380668, 382850, 419437, 468309, 521803, 540247, 538614, 539473, 543638, 548427, 556085, 579796, 565552, 588997, 616814, 632378, 681998, 740677, 781593, 830880, 935140, 1064641, 1222249, 1374679, 1525170, 1670582, 1779200, 1844767, 1840389, 1802692, 1713921, 1586502, 1446651, 1302340, 1213420, 1139246, 1069102, 1000768, 949550, 923368, 953311, 997298, 1028829, 1073232, 1144985, 1217510, 1290818, 1386549, 1483839, 1542640, 1604399, 1627975, 1635406, 1644021, 1636800, 1638499, 1684184, 1781290, 1903144, 2033951, 2175418, 2304553, 2397032, 2435161, 2418502, 2367822, 2240804, 2101556, 1953932, 1808839, 1702327, 1596572, 1510125, 1440102, 1396477, 1369977, 1362572]
10564A362572L2696K2424M3396O2760M4776J5218N191j6115k5628l7104m4905
10553A465281j9264j5550K6740K1377p7K9046L9963K4430K3697L9026M4456N0623
10541A729748L1288O4970O1813P2728O7805O5027P0123M0278P1611O7314P4767
10530B417472R2722J46378J87626K54363K55177K39292J85327Q6573L0069k7206
10520C867793n2188l8029j6634N3314R8275J29611K11510K96538L75582M94516
10510E420288O01651O74161O38851M30531J58231o1273k05163l70981m28450l54345
10500F503501k10237n6905O1970K03641K93955L75863M61925N96698P00791Q30626
10490I761828R04594R64944J069666J277816J551306J931728K475119L135330
$$ y = [1362572, 1395268, 1417692, 1461088, 1523848, 1568624, 1583842, 1589033, 1572918, 1547290, 1510186, 1465281, 1446017, 1430467, 1457207, 1478584, 1478507, 1507553, 1547516, 1571946, 1595643, 1634669, 1679125, 1729748, 1761036, 1826006, 1887819, 1960547, 2028352, 2093379, 2163502, 2203780, 2275391, 2342705, 2417472, 2510194, 2656572, 2844198, 3098561, 3353738, 3593030, 3778357, 3864930, 3894999, 3867793, 3815605, 3777576, 3760942, 3814256, 3912531, 4042142, 4253652, 4550190, 4925772, 5420288, 6021939, 6696100, 7334951, 7765482, 7923713, 7862440, 7657277, 7286296, 6857846, 6503501, 6293264, 6236359, 6298329, 6501970, 6795925, 7171788, 7633713, 8230411, 8931202, 9761828, 10666422, 11631366, 12701032, 13978848, 15530154, 17461882, 19937001, 23072331]
10482B3072331L760409M323125M909777N789432P146575R014413J1514619J5074161
10474H4604842K0377284K7438411L4808113L8436236L3416344J8939269K080313
10467B60100812j0755899k0719096k9777883l2972133k8594441k0435833j2136774
10460A04708753n137229O75725N756072J1089904J7690836K5806091L3663002
10453A94253154L6109212K6761294Q284622o963780j5510946k5328419l5745292
10446A81859845l6920160l0128018k2128696j5911680j1577068q537381o339687
10439E0317155m744869l540173k571085j824921j317089r88532q59157q42400
10431C3628929q27203p79584p29633p12408p59408r04428j075507j172780j226077
$$ y = [23072331, 26832740, 31155865, 36065642, 41855074, 49001649, 58016062, 69530681, 84604842, 104982126, 132420537, 167228650, 205664886, 239081230, 258020499, 260100812, 249344913, 228625817, 198847934, 165875801, 137281360, 116845527, 104708753, 99571524, 100247249, 106003321, 117093225, 134784061, 160590152, 194253154, 230362366, 257123660, 265408282, 258444502, 242933556, 217605137, 181859845, 144939685, 114811667, 92682971, 76771291, 65194223, 56656842, 50317155, 45572286, 42032113, 39461028, 37636107, 36319018, 35330486, 34471329, 33628929, 32801726, 32022142, 31292509, 30580101, 29820693, 28916265, 27840758, 26667978, 25441901]
10422B5441901j281497j237924j050634q38664o39151n42483n18362n28996n85956
10413A8218234o88774p57043p78897p60023p66385p55204p19351o94565o53980
10404A1644012o08967n73429n21348n18759m75190m24099m04627l67700l43681
10395G406212l26145l04033k79480k67988k58343k54391k44774k40603k47135
10386D983320k54739k32935k14527j94091j77947j56168j52085j52978j43632
10377C304218j40603j33216j37545j31383r2410j14640j10616j01390j00016r7914
10367B144485o8346p3245p9285o2465p2850o8203n7505n3585m4213m2317o7724
10356A454747m0474k8675m0749j3276J3886N822m997Q96J3122J3863K9862K5674
$$ y = [25441901, 24160404, 22922480, 21871846, 21033182, 20394031, 19851548, 19333186, 18804190, 18218234, 17529460, 16772417, 15993520, 15233497, 14467112, 13711908, 12992557, 12297992, 11644012, 11035045, 10461616, 9940268, 9421509, 8946319, 8522220, 8117593, 7749893, 7406212, 7080067, 6776034, 6496554, 6228566, 5970223, 5715832, 5471058, 5230455, 4983320, 4728581, 4495646, 4281119, 4087028, 3909081, 3752913, 3600828, 3447850, 3304218, 3163615, 3030399, 2892854, 2761471, 2669061, 2554421, 2443805, 2342415, 2242399, 2144485, 2076139, 2002894, 1923609, 1861144, 1788294, 1720091, 1662586, 1609001, 1564788, 1522471, 1454747, 1414273, 1385598, 1344849, 1331573, 1345459, 1351281, 1346284, 1347180, 1360302, 1374165, 1404027, 1429701]
10344A429701k0407o1845k2607K4566O2491R6014J10910O7727p52m3371q7134
10333A555293j14143j23699q3182o8278p1139m4657m9827n3019n4143p4200n7843
10322G61163j7553j1095j3712k4186r102k2884j1130k4790k3995q882j6274k2374
10310E55186l1464j4608j0065j6630j2778M0093K3643K8806L4946L0969L0042
10299F58140k092L668K5910k5030l8099l8413q508J3703n291j2002j2111k6335
10287E33540j1348l700N76P404P973J9538M1418K9846J342j579K2696n22l013
10274F44171m16k5231q466k9730l0206p782p861J941j3101j1243J1129J6807J7246
10261E57258K6616K0933J1698k120n819j7548k0617j0755j2486j9006j4727k743
$$ y = [1429701, 1409294, 1347449, 1324842, 1349408, 1411899, 1507913, 1618823, 1686550, 1685798, 1642427, 1555293, 1441150, 1317451, 1234269, 1165991, 1094852, 1050195, 1000368, 947349, 893206, 819006, 761163, 743610, 732515, 718803, 694617, 685515, 662631, 651501, 626711, 602716, 593834, 577560, 555186, 523722, 509114, 499049, 482419, 469641, 509734, 533377, 562183, 597129, 628098, 658140, 656048, 659716, 685626, 660596, 622497, 584084, 575576, 589279, 583988, 571986, 559875, 533540, 522192, 518492, 519068, 526472, 534445, 553983, 595401, 625247, 626589, 625010, 647706, 647184, 644171, 643755, 618524, 610058, 580328, 550122, 542340, 534479, 536420, 523319, 512076, 523205, 540012, 557258, 583874, 604807, 616505, 614385, 608566, 591018, 570401, 559646, 547160, 528154, 513427, 510684]
10249E10684j2226m656j355J3175j3012k586q085J1005J187m832M979m128k6000
10236D64150o125j7519k8419J1976J1422J7518J4013n258k9694k3661L88J3662
10224D22453P86r194J2214M154J327M746j2611o32r764j7745k6789o615J3568
10211C75898p920j2775n075O27r119j2946m865l585k4871J497R001J3890J291
10198C21048J8862L425j4299k4677j7396j8249r940j3364J284M982j1735R151
10186B49092M950J380n821j0029l3091l633j365j832K1787M869j3543j3875j0393
10173A88496J739j4438j977J1524J0024L375j3961K439Q459J7066J0840p890P590
10160B23286N839J669q27l906j372K3627K4991K2637O970L459K8967L8127N320
$$ y = [510684, 498458, 493802, 492447, 505622, 492610, 490024, 481939, 492944, 494131, 489299, 494278, 490150, 464150, 458025, 440506, 412087, 424063, 435485, 453003, 467016, 461758, 432064, 408403, 408791, 422453, 423239, 414045, 426259, 430413, 431740, 436486, 423875, 423243, 413479, 395734, 368945, 362330, 375898, 367978, 355203, 350128, 350755, 341636, 328690, 323825, 320240, 295369, 296866, 305867, 319757, 321048, 339910, 343335, 329036, 304359, 286963, 268714, 258774, 245410, 246694, 251676, 239941, 249092, 254042, 255422, 249601, 239572, 206481, 202848, 201483, 199651, 221438, 226307, 212764, 198889, 188496, 190235, 175797, 173820, 185344, 195368, 198743, 184782, 187221, 195680, 212746, 223586, 215696, 223286, 229125, 230794, 229967, 226061, 224689, 248316, 273307, 295944, 302914, 306373, 335340, 373467, 378787]
10147C78787j1856R892L0658q690p208m808l350L229K2023L195j8580n126N582
10134C93748O590Q61m374R413K047J9808K994n006J3932J7728J1237N9421N2460
10121E80859L1660L1907L3208M4378O8692J06638J43218J62403K20172K69211
10111A692346L29728L25411K64675J21361j9669j30840k47235l29919l32974k87517
10101A385367k16260j67232j08829o9031o4134n7023k4623k7262l5612j1880j4517
10090E88964L870n851K408j04j4034N688o294L995J8913L5328M0905K1590L8136
10077G33514P5134Q1783P3771P4340J01976J33180J62346J98009K45028L07686
10067B186767L49766L92666M05858L89028L56957L51523L21818K79676J77875
$$ y = [378787, 366931, 376823, 407481, 398791, 391583, 386775, 383425, 386654, 408677, 411872, 393292, 388166, 393748, 400338, 401199, 396825, 406238, 408285, 428093, 431087, 426081, 440013, 457741, 468978, 528399, 580859, 612519, 644426, 677634, 722012, 790704, 897342, 1040560, 1202963, 1423135, 1692346, 2022074, 2347485, 2612160, 2733521, 2713852, 2583012, 2335777, 2005858, 1672884, 1385367, 1169107, 1001875, 893046, 824015, 759881, 702858, 678235, 650973, 615361, 603481, 588964, 592834, 586983, 589391, 589287, 575253, 580941, 574647, 578642, 597555, 632883, 673788, 695378, 733514, 808648, 890431, 964202, 1038542, 1140518, 1273698, 1436044, 1634053, 1879081, 2186767, 2536533, 2929199, 3335057, 3724085, 4081042, 4432565, 4754383, 5034059, 5211934]
10058E211934L8021j48250l00248m23866n14666n47960m98467m25887l44855k76248
10048A769508k28059j79319j33434p9672o8347o1144l1991j1983k5285q557k4039
10037I17678m060K564K0084K3400L6981P1388Q2774J20591J70684J72182J51725
10026A765991Q2976K072p0832j06994j62504j89103j74121j34539r1886p1105
10016H49955o4263p9055o3939m4441m0580j3875o145p369J2835q489l5148k9673
10004D69813p166j1155j430r081j9087j4783O052N454k929j6150j5987n162j0561
9991C67828m684m501r674k872L611P77m91j303m729j7367j0350L133K815o430
9977C15763j4092j3605m835r440j0411J824J4143K2854K1171K375j2362l017K4702
$$ y = [5211934, 5249955, 5101705, 4801457, 4377591, 3862925, 3314965, 2816498, 2390611, 2045756, 1769508, 1541449, 1362130, 1228696, 1149024, 1080677, 1019533, 987542, 975559, 950274, 941717, 917678, 913618, 916182, 936266, 959666, 996647, 1068035, 1150809, 1271400, 1442084, 1614266, 1765991, 1848967, 1851039, 1780207, 1673213, 1510709, 1321606, 1147485, 1012946, 921060, 849955, 785692, 706637, 642698, 598257, 557677, 543802, 537657, 530288, 543123, 534634, 499486, 469813, 462647, 451492, 450062, 440981, 421894, 407111, 413163, 418617, 415688, 399538, 383551, 378389, 367828, 363144, 358643, 348969, 346097, 349708, 350485, 349994, 348691, 343962, 326595, 316245, 319378, 322193, 315763, 301671, 288066, 283231, 273791, 263380, 265204, 279347, 302201, 323372, 325747, 313385, 310368, 335070]
9964C35070K6090L7344L7220L6162M5883M8822K7669j617k3446l2157n1706m5962
9952D39372n1414l4385j7619j9767j5237n937j3234j9879p352o868J2359J0934
9940B70973p31m25p251j0111J8173J1553k5057j5616O309j8550j4525n996M042
9927B12788j3248p604M286L379J1332J6488m476j266p528j2035L898J3690l496
9914B16208M750n359O27J5123K61j279n156k761J600j511J9849P778J453n351
9900B46232J7654q937o561J7906O452r612m165K850M598l844j1267j3444p488
9887B30374k0906L199R656Q480Q88p604L458R17o969M682O172J149k144j0203
9873B21149j0068K3240J8983J5655p703j1448r733J8704O04Q032N554J1489K736
$$ y = [335070, 361160, 398504, 435724, 471886, 517769, 566591, 594260, 592643, 569197, 537040, 485334, 439372, 387958, 353573, 335954, 316187, 300950, 295013, 281779, 261900, 254548, 247680, 260039, 270973, 270242, 269817, 262566, 252455, 270628, 282181, 257124, 241508, 247817, 229267, 214742, 208746, 212788, 199540, 191936, 196222, 199601, 210933, 227421, 222945, 221679, 214151, 202116, 206014, 219704, 216208, 220958, 215599, 216226, 231349, 231610, 230331, 225175, 222414, 224014, 222503, 242352, 250130, 251583, 246232, 263886, 254949, 248388, 266294, 272746, 263134, 258969, 261819, 266417, 262573, 251306, 237862, 230374, 209468, 212667, 222323, 230803, 231691, 224087, 227545, 228462, 221493, 226175, 232347, 233496, 231352, 221149, 211081, 234321, 253304, 268959, 261256, 249808, 240075, 258779, 259383, 267415, 272969, 284458, 287194]
9860B87194J2560K390M512q481j8042K127j0051l753j8279L908Q981o88o849J1482
9846B67011J9255j8309k1081N96J8937J0009J6414l71N919k874j0370N033n587
9833B84582N386P224j866n963o528J197j2913M453J2216J2419Q537O403J0489
9820C25636J8105J0512q499j4738j4141L402k8162l5203p366J9610O91L667K162
9807B75676J8140J5452J648J241j4672o499K907m625q60p426n401P106P985j249
9793B89423q727J8685N54l188R423R381r776m510l008Q112q494j1867R733j331
9779B94410j3572j2033J5016J0467K401j3460J539R121j118K0886j209m753L805
9766C11500N452q722k9801Q366O548K3825K4925j7123r167j879K372J361r840
$$ y = [287194, 299754, 302144, 306656, 298175, 280133, 282260, 272209, 268456, 250177, 254085, 263066, 262378, 255529, 267011, 286266, 267957, 246876, 247472, 266409, 276418, 292832, 292461, 298380, 295506, 285136, 290169, 284582, 289968, 297192, 295326, 289363, 282835, 284032, 271119, 275572, 287788, 300207, 308744, 315147, 325636, 343741, 354253, 345754, 331016, 316875, 320277, 292115, 256912, 249546, 269156, 269847, 273514, 275676, 293816, 309268, 310916, 312157, 297485, 290986, 293893, 289268, 288408, 280982, 275581, 282687, 290672, 289423, 280696, 299381, 299935, 296747, 306170, 315551, 305775, 301265, 298257, 306369, 297875, 286008, 295741, 294410, 280838, 268805, 283821, 294288, 296689, 283229, 284768, 293889, 292771, 313657, 312448, 307695, 311500, 316952, 308230, 278429, 286795, 293343, 317168, 342093, 324970, 315803, 313924, 316296, 317657, 307817]
9753C07817P94p441j475n955J1452o125r041J0580P853J8139m926q00j807q336
9739C10729O702J7257N472k728J580j5956m997o32J5769J3472Q432J4096o77M341
9725C72860m138k0072j6137M479J8854j4322O83M852R493K1774P785J0109K4467
9712D20687M043j2283R222J1221K3027K2876K2577L1843M6049L5458K3252n11
9700F37461K2903J666p687k4615l6184n8204n3016j0078j4343j7219o265j600
9688D32819J1938j0120j251O773j1611p315L748J0827J360J0554l611J8452O206
9675D68769K590n668q921k680O175K3433N670j0746j7924n436R464O639k376j3022
9661D55967n500M734o197r486j8041O395K7568J1474P710K514j3628n738l948
$$ y = [307817, 308611, 301170, 299695, 293740, 305192, 299067, 290026, 300606, 308459, 326598, 321672, 320872, 319065, 310729, 317431, 334688, 340160, 337432, 339012, 323056, 318059, 317427, 333196, 346668, 355100, 369196, 368519, 372860, 368722, 348650, 332513, 336992, 355846, 341524, 342207, 347059, 356552, 378326, 386111, 396220, 420687, 424730, 412447, 421669, 432890, 455917, 478793, 501370, 533213, 579262, 614720, 637972, 637461, 660364, 662030, 654343, 629728, 593544, 535340, 482324, 472246, 457903, 440684, 434419, 432819, 444757, 434637, 433386, 440159, 428548, 421233, 424981, 435808, 437168, 447722, 444111, 462563, 468769, 471359, 465691, 456770, 454090, 460265, 483698, 489368, 478622, 460698, 455262, 464726, 471365, 468989, 455967, 450467, 455201, 449004, 439518, 421477, 427872, 455440, 466914, 474624, 477138, 463510, 457772, 453824]
9648D53824O74J6401J7710P07j3104J9889K8665o010j6039N770K1556q845j3085
9635E08113J086J6171L843J7161K739p723P239J562j219j761o812J42j9259m585
9621E16697K6667O532J1749J9046L170j7559N216J321r10j3033L270M140M569
9608E70875J5776O002M125p484k62P922J814r479J3921J926J4740J2198J0415
9595F42489P748L173j1539o669j8540K0229k446j8934K0068K0168J0643J4174
9583F80564j764Q454q322j6274j0943O024K7034n18J0668k153O595J0136J76J2836
9569G22513J5523J1794n328j3177L705Q049J7272M899r404l929O230K137N897
9556G66181J2802j6624j6405O781J7039M0212J7762j4829O987K0110J1020J6058
$$ y = [453824, 454498, 470899, 488609, 489316, 476212, 496101, 524766, 518756, 502717, 508487, 530043, 521198, 508113, 509199, 525370, 529213, 546374, 549113, 541390, 548629, 550191, 548972, 547211, 540399, 540541, 521282, 516697, 543364, 549896, 561645, 580691, 583861, 566302, 571518, 572839, 571929, 558896, 562166, 566306, 570875, 586651, 592653, 596778, 589294, 589032, 596954, 598768, 589289, 603210, 605136, 619876, 632074, 642489, 650237, 653410, 641871, 635202, 616662, 636891, 634445, 615511, 635579, 655747, 666390, 680564, 678800, 687254, 678932, 662658, 651715, 657739, 684773, 684255, 694923, 692770, 699365, 709501, 709677, 722513, 738036, 749830, 744502, 731325, 735030, 743079, 760351, 765250, 755846, 751917, 758147, 760284, 766181, 778983, 762359, 745954, 752735, 769774, 809986, 827748, 812919, 819906, 840016, 851036, 867094]
9544H67094P742J4317k676n322p877o573Q926K0298L061M526o10J3769P183j0118
9530I13740j1594p007m305K3064K4399K5740m214o068J2592J5838J0331q738l677
9517I80101n15L060R201J8483J8497R023J459K1779K2566J7439L722j5240l128
9504A086447K03O108P761M731Q574R920L5025J5135j108N372J8307K2034J3372
9491A231881J8588Q91p881M154J6692n475J6640J6899K0808K1279m242k696K8388
9478A355926K2873J6338l430J0165K8660J9991O8N027K935N607J5679J4601K7778
9465A522218R613J7401J2809O427L591J2874J3262K8290J2462J1451K8724K6180
9453A705302J8353J1947N651J4649K3744K5331J4546O718J2807J6929K8804L4947
$$ y = [867094, 874836, 889153, 886477, 881155, 873278, 866705, 875631, 895929, 898990, 903516, 902906, 916675, 923858, 913740, 902146, 895139, 890834, 913898, 938297, 964037, 959823, 953755, 966347, 982185, 992516, 983778, 980101, 979586, 982646, 991847, 1010330, 1028827, 1037850, 1039309, 1061088, 1083654, 1101093, 1104815, 1089575, 1086447, 1086650, 1092758, 1100519, 1105250, 1113824, 1123744, 1158769, 1173904, 1172796, 1178168, 1196475, 1218509, 1231881, 1250469, 1251360, 1243479, 1247633, 1264325, 1258850, 1275490, 1292389, 1313197, 1334476, 1330234, 1327538, 1355926, 1378799, 1395137, 1391707, 1401872, 1430532, 1450523, 1450591, 1455618, 1458553, 1464160, 1479839, 1494440, 1522218, 1531831, 1549232, 1562041, 1568468, 1572059, 1584933, 1598195, 1626485, 1638947, 1650398, 1679122, 1705302, 1723655, 1735602, 1741253, 1755902, 1779646, 1804977, 1819523, 1826241, 1839048, 1855977, 1884781, 1919728]
9441A919728J3414K409J3989L0706J9489J1587M946k130J4972L6316K7204J8280
9429B110910L6267L4303J4989J8296K3584J1706L3507L6828K5033K4422M6109
9418B415954L5909M9841N0906q148j3153L6825L0321L0426N0329M1956J6099J7598
9406B754863L2757K8871J0500K2717M7166M3562M0569M3451K5639K5583L5102
9395C110780L0091K5656M5336O6495L7685K0919M6445L7391M2294M3451M9701
9384C556244P3489N6126L6431L1443M1320M1231L6513P1325Q0304M7022N0041
9373D121489M7203L9375N1350N6192N8233M9824K5565M6481P7306P3146M4331
9362D690495N4872O6552N8300P3169Q4915O1003M5107N7875N9560N0482O6690
$$ y = [1919728, 1933142, 1935551, 1949540, 1980246, 1999735, 2011322, 2016268, 2014138, 2029110, 2065426, 2092630, 2110910, 2147177, 2181480, 2196469, 2214765, 2238349, 2250055, 2283562, 2320390, 2345423, 2369845, 2415954, 2451863, 2501704, 2552610, 2544462, 2531309, 2568134, 2598455, 2628881, 2679210, 2721166, 2737265, 2754863, 2787620, 2816491, 2826991, 2849708, 2896874, 2940436, 2981005, 3024456, 3050095, 3075678, 3110780, 3140871, 3166527, 3211863, 3278358, 3316043, 3336962, 3383407, 3420798, 3463092, 3506543, 3556244, 3629733, 3685859, 3722290, 3753733, 3795053, 3836284, 3872797, 3944122, 4024426, 4071448, 4121489, 4168692, 4208067, 4259417, 4315609, 4373842, 4423666, 4449231, 4495712, 4573018, 4646164, 4690495, 4745367, 4811919, 4870219, 4943388, 5028303, 5089306, 5134413, 5192288, 5251848, 5302330, 5369020]
9351E369020Q5855O1317Q9307R1003Q9924O2926O1625P3451P5980Q0048Q2176
9340F222632Q3149P3267Q4455P7646P1185P6946R0834R4545J15199Q9140O1475
9329G140473O3794Q6484Q3278Q4385Q5019J04222R2412Q4196Q1415P0761O9655
9318H046094P7138Q6003R2565P9989O6074P9848Q2504Q0972O2529N8473Q8404
9307H900593Q0793O5129N7215O3183Q4624N9711P5430O7552M6899N4672O3608
9296I619409M6449M2746K8553N9647M6184M6766L2827L7583L8461K4284K3949
9285A0046858J3221k893k417j9002q162J7096Q227N338L216l0900k4498j6406
9273I989678j9582k1113l0930l0320k1386m0794l3505m4556n1549n4049m7307
$$ y = [5369020, 5454875, 5516192, 5605499, 5696502, 5786426, 5849352, 5910977, 5984428, 6060408, 6140456, 6222632, 6305781, 6379048, 6463503, 6541149, 6612334, 6689280, 6780114, 6874659, 6989858, 7078998, 7140473, 7204267, 7290751, 7374029, 7458414, 7543433, 7647655, 7740067, 7824263, 7905678, 7976439, 8046094, 8123232, 8209235, 8301800, 8381789, 8447863, 8527711, 8610215, 8691187, 8753716, 8812189, 8900593, 8981386, 9046515, 9103730, 9166913, 9251537, 9311248, 9386678, 9454230, 9501129, 9555801, 9619409, 9665858, 9708604, 9737157, 9796804, 9842988, 9889754, 9922581, 9960164, 9998625, 10022909, 10046858, 10060079, 10057186, 10054769, 10035767, 10027605, 10044701, 10052928, 10058266, 10061482, 10030582, 10006084, 9989678, 9970096, 9948983, 9918053, 9887733, 9866347, 9825553, 9792048, 9747492, 9695943, 9641894, 9594587]
9262I594587l1762m3284n1741o0040o6078o7435o0651o3505p0031o8316o7585
9251H944159p3375o8807o3643o2303p0486o1135q4968q1751p8028p4510o9454
9240H155699q3136r3535r0511q1959q1923o5995r4508q7553o8949o3342n1064
9229G293224q2283r4326q4109p8706q7015q0251p8976p7484r4905q2590q1560
9218F371019o3602o3589q4340r0079n7385m7253o0087p6469q0378p8772p2112
9207E596953n3464p4999p8166n0886n4861p3615q9259n0212n4595n2231n2972
9196D911693p1228o2829o0921m4087o8183o4087o6214n7994n5745o3574n3456
9185D243375m2209l8866n0347m8438n9523l8111l1353m2483m4801n8282n2902
$$ y = [9594587, 9562825, 9519541, 9467800, 9407760, 9341682, 9274247, 9213596, 9150091, 9080060, 9011744, 8944159, 8870784, 8801977, 8738334, 8676031, 8605545, 8544410, 8459442, 8377691, 8299663, 8225153, 8155699, 8072563, 7979028, 7888517, 7806558, 7724635, 7658640, 7564132, 7476579, 7407630, 7344288, 7293224, 7210941, 7116615, 7032506, 6953800, 6866785, 6786534, 6707558, 6630074, 6535169, 6452579, 6371019, 6307417, 6243828, 6159488, 6069409, 6012024, 5964771, 5904684, 5828215, 5747837, 5669065, 5596953, 5543489, 5468490, 5390324, 5339438, 5284577, 5210962, 5121703, 5071491, 5016896, 4964665, 4911693, 4840465, 4777636, 4716715, 4672628, 4604445, 4540358, 4474144, 4416150, 4360405, 4296831, 4243375, 4201166, 4162300, 4111953, 4063515, 4003992, 3965881, 3934528, 3892045, 3847244, 3788962, 3736060]
9174C736060o5802o5263m4345j5885k6242n0668n3982l3035m5868l4517m0658
9163C259795m1037j7615m1938o1579m6535l2783k894l5093l1341k0828m7981n4692
9151B825479k9766m397r636n2603n7177m1816j4122k810k9504m3348k1185k8863
9139B490252l7791l5126j5558j3038k2529k1516j8532k9132n7049l5758j3062
9128B191161j6139j9678j6765k0860j6876l194k6762l1083j5538k7098l8058j8042
9116A941068j4365j4327j6881p23q05M228k2808l4668m3310k1775o132k6184l311
9103A740007l439j9816q831j9329j9740j3379N205k6957k9876j5035o723j0051
9091A572036k4578k1510j7582j0788j7242j7845j6905l1679O46R608j6935k1565
$$ y = [3736060, 3670258, 3604995, 3560650, 3544765, 3518523, 3467855, 3413873, 3380838, 3334970, 3300453, 3259795, 3218758, 3201143, 3159205, 3097626, 3051091, 3018308, 3015414, 2980321, 2948980, 2928152, 2880171, 2825479, 2795713, 2791316, 2781680, 2729077, 2671900, 2630084, 2615962, 2613152, 2583648, 2540300, 2519115, 2490252, 2452461, 2417335, 2401777, 2388739, 2366210, 2344694, 2326162, 2297030, 2239981, 2204223, 2191161, 2175022, 2155344, 2138579, 2117719, 2100843, 2097649, 2070887, 2039804, 2024266, 1997168, 1959110, 1941068, 1926703, 1912376, 1895495, 1894772, 1893967, 1898195, 1875387, 1840719, 1797409, 1775634, 1769502, 1743318, 1740007, 1736568, 1716752, 1707921, 1688592, 1668852, 1655473, 1660678, 1633721, 1603845, 1588810, 1582087, 1572036, 1547458, 1525948, 1508366, 1497578, 1480336, 1462491, 1445586, 1413907, 1414553, 1424161, 1407226, 1385661]
9079A385661m5205j5547P970m738L991r859l1101P150j0128p104j3427l487k876
9066A261300J5934j0665l5537k3164k4156q996k0730j3695O856j7220j6176m997
9054A108754N507j2718j5517j4861j1109J126J8373Q264j6409k8948j2815J2219
9042A041866k313q359q728j4988j9096j9207j6186K348l796L915q6j3992j4376
9029I27002P462j376o969j2626j8305Q62p129j2467j5714j8476j1802J7124K968
9016H50554n122L090q96m719k352J0191q489k2248n354J042Kl6035j6301p270
9002G56093n994J5885P956J1013l685p130j5662j5028M87j2434j1685j8468J0488
8989G11836k857p9m158q251p144N889j3654j0853J151l801L419k882p027m523
$$ y = [1385661, 1340456, 1324909, 1332879, 1328141, 1332132, 1322273, 1291172, 1298322, 1288194, 1281090, 1267663, 1264176, 1261300, 1277234, 1266569, 1231032, 1207868, 1183712, 1174716, 1153986, 1140291, 1147147, 1129927, 1113751, 1108754, 1114261, 1101543, 1086026, 1071165, 1060056, 1061182, 1079555, 1087819, 1071410, 1042462, 1029647, 1041866, 1039553, 1031194, 1022466, 1007478, 988382, 969175, 952989, 955337, 951541, 955456, 955370, 941378, 927002, 934464, 933088, 926119, 913493, 895188, 896050, 888921, 876454, 860740, 842264, 830462, 847586, 850554, 845432, 848522, 847626, 842907, 840555, 850746, 842257, 820009, 814655, 815697, 815699, 779664, 763363, 756093, 750099, 765984, 773940, 784953, 781268, 774138, 758476, 743448, 743935, 731501, 719816, 701348, 711836, 708979, 708900, 704742, 696491, 689347, 695236, 681582, 670729, 671880, 668079, 671498, 668616, 661589, 657066]
8975F57066r378j4735M436J3761n386j6355J1089J19k7765j4746K528o454j782
8962E92398j966K505J729j0511M481J0589M138p582p242o803L440j358r876k64
8948E73678m30m799j2406J0073P59k4981j6850J974M70j5701j5202j911J0193
8935E04867j9094j5304J632L0128J1786J614j7836j2773R618J1370o278j0756
8923D88974j9330L810k695j60J7290j5061k2078p046o567Q06K292m804J642O995
8909D44068n256q41K0401n077j731j0533m211K819J94k4296n245J5071j0461j8276
8895C96626K824J1768n362J1308k373O463N459q51M64k4974j5631K402j464J0244
8881C96903o548j4269j6377J5121L476o648j5861j635K0779m752R992j3248P607
$$ y = [657066, 647688, 632953, 637389, 651150, 645764, 629409, 640498, 640617, 612852, 598106, 600634, 594180, 592398, 590432, 592937, 594666, 584155, 588636, 599225, 603363, 595781, 588539, 581736, 585176, 583818, 573942, 573678, 573248, 568449, 556043, 566116, 566875, 541894, 525044, 527018, 527488, 511787, 496585, 494674, 504867, 485773, 470469, 472101, 502229, 514015, 515629, 497793, 485020, 494638, 506008, 499730, 488974, 469644, 473454, 470759, 470599, 487889, 472828, 450750, 443704, 437137, 437943, 440235, 435431, 437073, 444068, 438812, 437971, 458372, 453295, 451564, 441031, 436820, 439639, 439833, 415537, 410292, 425363, 414902, 396626, 399450, 411218, 405856, 417164, 414791, 421254, 426713, 425862, 426326, 401352, 385721, 388123, 386659, 396903, 390355, 376086, 359709, 374830, 378306, 371658, 355797, 354162, 374941, 370189, 380181, 366933, 374540]
8868C74540Q708p059k1384J7382j145q368J2270L146j7054Q489J3983L08j9462
8855C64354k2165r33j0137n531M041O878l815K836n292l827j1050O522K712J0427
8841C35020m301j3569j8189J2881Q783q786L66N110j9227O107Q253j0440J8210
8828C20218r886k7658r476K358j3050K411l423O531k906r645M16p580J8162K5856
8814B92328K769n642j3672N524J2368n054Q936R856r696l152n201q618P4j907
8800B78913n751N549K335R449J481n032J4521k0478j0777j0406m245M481J5458
8787B75498q840p338k0708j2005J80K3145J5207n545J2054j1657j3053N659P978
8774B60575o893j1127l429r643j0790K278n746K0596K0236n25p63k422N484l790
$$ y = [374540, 383248, 376189, 354805, 372187, 371042, 362674, 374944, 378090, 361036, 369525, 383508, 383816, 364354, 342189, 341256, 331119, 325588, 329629, 336507, 332692, 335528, 330236, 326409, 315359, 321881, 324593, 335020, 330719, 317150, 298961, 311842, 320625, 311839, 312205, 317315, 298088, 304195, 312448, 302008, 320218, 310332, 282674, 273198, 275556, 262506, 264917, 261494, 268025, 265119, 255474, 255890, 248310, 266472, 292328, 295097, 289455, 275783, 281307, 293675, 288621, 297557, 307413, 297717, 294565, 289364, 280746, 280820, 278913, 273162, 278711, 281046, 290495, 291976, 286944, 301465, 280987, 270210, 259804, 255559, 260040, 275498, 266658, 259320, 238612, 226607, 226787, 249932, 265139, 259594, 271648, 259991, 246938, 252597, 260575, 253682, 242555, 239126, 229483, 218693, 220971, 215225, 235821, 256057, 255532, 254769, 252347, 257831, 254041]
8760B54041j5949j2567J7974Q708p297M656J5890p842l390k4579j62J819K6102
8747B57404M554j4323j2853L037m387j0162q854J6331L541k5882q321k263j1101
8734A86721o727j832P291j4988P618J5841J1370k5283k3938K942K3044J4240j3575
8721A82724j1543O966O614m508j1572p324p970p85o02l163K8000J7187J6100J2247
8707B22371M667j6637k1331j1643o592M523J6375J4758j181q37j4190N546k241
8694A93588j5383o126R279l926P55J0968K1868j7685N069o852r719L39q480j0121
8680A63574N4P505K1584J9222K2876r474j6670k0937o257J7334L410q475j1811
8667A81935k22J6639L105j0377P907j0459j3634K808J8864o219j3969P52K117
$$ y = [254041, 238092, 225525, 243499, 252207, 244910, 249566, 265456, 257614, 254224, 229645, 229483, 231302, 257404, 261958, 247635, 234782, 237819, 233432, 223270, 214416, 230747, 234288, 208406, 200085, 197822, 186721, 179994, 178162, 185453, 170465, 178083, 193924, 205294, 180011, 156073, 159015, 182059, 196299, 182724, 171181, 178147, 184761, 180253, 168681, 161357, 153387, 152602, 152000, 148837, 176837, 194024, 210124, 222371, 227038, 210401, 189070, 177427, 170835, 175358, 191733, 206491, 205310, 204473, 190283, 195829, 193588, 178205, 172079, 181358, 177432, 178187, 189155, 211023, 193338, 198407, 191555, 181836, 182175, 173695, 163574, 163628, 171133, 192717, 211939, 234815, 225341, 208671, 187734, 181477, 198811, 202221, 193746, 181935, 181713, 198352, 201457, 191080, 198987, 188528, 174894, 177702, 196566, 190347, 176378, 177130, 179247]
8654A79247R443j3624o041K2789n144n510K162R125J121j7328k5864p918J5330
8641A57788j820k7960o245M639K2477J3669j09P425K656k4613k537K3739K720
8628A71829K2836K750j0794j3862p391n579q49J3039k854j7247M37J2556M137
8615A69008j8548j4967P000r768o093J4152O361r954j5490K814J1718k018k923
8602A31292J019J3899K3351J0217j0737j3050j1242n039K072J4814l541k7064
8590A25991q63J7064M931j949J8001J6071r706r123N457J0416J3284j6694r197
8577A63683R230J5730m501K385K0009m440K864j0097j2750J0332J1329J4791j051
8564B17514j2203r771j6895k4239k0126r264j262K2266j2984k9515J3873K4606
$$ y = [179247, 188690, 175066, 169025, 191814, 186670, 181160, 183322, 192447, 193568, 176240, 150376, 142458, 157788, 155968, 128008, 121763, 126402, 148879, 162548, 162439, 169864, 172520, 147907, 145370, 169109, 171829, 194665, 197415, 186621, 172759, 165368, 159789, 158940, 171979, 169125, 151878, 152315, 164871, 169008, 150460, 135493, 142493, 132725, 126632, 140784, 147145, 137191, 121701, 124515, 136233, 134215, 131292, 132311, 146210, 169561, 179778, 169041, 155991, 144749, 139710, 141782, 156596, 153055, 125991, 125128, 142192, 147123, 145174, 163175, 179246, 169540, 160417, 165874, 176290, 189574, 172880, 163683, 172913, 188643, 184142, 186527, 206536, 202096, 204960, 194863, 182113, 192445, 203774, 218565, 217514, 205311, 195540, 178645, 154406, 134280, 125016, 123754, 146020, 133036, 103521, 117394, 142000]
8552A42000J6000q33m890P294j1131j0118k762L469J904K525N718L955J1402j0250
8538A54283n757J5677J2920p280o922j6009J937N304j7238j6721J606J9331l018
8525A38113o017q840j1641J4451p596J159R882k096K736q589j7602k3393M002
8512H4569K3815J296m632L927K496O576k387k2647j2466R961M430p44J3795J1305
8498A19294j5438p304j0139o769p9J5684k44O554O294M607O0j4472R086M085L279
8483A14498O254j016j7486L949l067q940J3748P453O377k3620o135J1821k365
8470A01471J578r978P590q879J2648J1136j5673j0178j7497l133o144N234O788
8457G4963J6751R754N662J0114m983j6229j3866N368p614R437K922l559p346K1671
$$ y = [142000, 158000, 157167, 152277, 159571, 148440, 138322, 135560, 139029, 140933, 143458, 149176, 153131, 164533, 154283, 148526, 164203, 177123, 169843, 162921, 146912, 148849, 154153, 136915, 120194, 121800, 141131, 138113, 132096, 123256, 111615, 126066, 118470, 119629, 129511, 127415, 130151, 121562, 103960, 80567, 84569, 108384, 109680, 105048, 108975, 111471, 118047, 115660, 93013, 80547, 90508, 94938, 94194, 107989, 119294, 103856, 96552, 86413, 79644, 79565, 95249, 95005, 101559, 107853, 112460, 112520, 98048, 107134, 111219, 114498, 120752, 119736, 102250, 106199, 103132, 94192, 107940, 115393, 121770, 98150, 92015, 103836, 101471, 103049, 93071, 100661, 91782, 104430, 115566, 99893, 89715, 72218, 69085, 62941, 68175, 74963, 91714, 101468, 107130, 117244, 112261, 96032, 82166, 87534, 79920, 89357, 92279, 88720, 81374, 103045]
8443A03045K4760j540j7483k3608k64k071l817J2543K7170j56q18k0884k5837
8430G1040j538k081J240K0661k265l845R743j5783j4939L768o644J1111L805p690
8416F6583O497O599j0506P893J3002J7424r302j6614l252o562L213J8473J0866
8403A04314l925j3953r283j9346M162J7581K439j967K25M499Q968j3974p594M036
8389G6182R09L772r439o95p128m851P577J1820J7786j4437j2113N79J8240J6680
8375A04882K49j677k4680j028k543j1232j1793n733J721J6299j072R571K2472
8362I5436L633k5977k4745k039N268J4395Q058j1244l890r698j2872J322M544
8349D2191m688j025K368K4941O884o807q005Q979J5020j5366r471M567O456N60
$$ y = [103045, 127805, 126265, 108782, 85174, 84910, 82839, 79022, 91565, 118735, 118579, 117761, 96877, 71040, 69502, 67421, 68661, 89322, 87057, 83212, 92955, 77172, 62233, 66001, 59357, 70468, 74273, 66583, 73080, 79679, 69173, 77066, 90068, 107492, 98190, 81576, 78324, 71762, 74975, 93448, 104314, 100389, 86436, 77153, 57807, 61969, 79550, 81989, 80022, 80247, 84746, 93714, 79740, 72146, 76182, 77091, 80863, 71424, 70729, 63601, 58750, 66327, 78147, 95933, 81496, 69383, 69962, 88202, 104882, 105131, 103454, 78774, 77746, 75203, 63971, 52178, 46445, 48166, 64465, 63393, 72964, 95436, 99069, 73092, 48347, 46308, 51576, 65971, 74029, 62785, 58895, 49197, 36325, 37647, 42191, 37503, 36478, 38846, 63787, 70671, 63864, 55859, 64838, 79858, 64492, 55021, 59588, 66044, 66604]
8335F6604r786n541J2998Q306L755q685J4914K9723J635l0153j6060P384J1524
8322H6618J3696j2287j6823q165K1046J0597j2910m776J0212N26q407m879j2799
8309F1649L909k168n619k158M3059J3343j1642j2462k7478q216j7248j610N715
8296C9074J9688j191J814n322j2270O155P735j8833M55J154J4646J6844J8216
8283H8165R300k153l211n745Nj4000j1406J0232R078j3263j7163L888q148K546
8269D8125N446j2859N688O525N963J33K5291O978j231k6741j7018j8876M341P806
8255C9571l111j443J7550J4474k015p008Q541m2j6418J3630J8683p197k4603J2132
8241F2744J3280k899R224n4j0871J2051P263j2938p043N99j5029j2711N008o449
$$ y = [66604, 56818, 51277, 64275, 72581, 76336, 67651, 82565, 112288, 113923, 83770, 67710, 75094, 86618, 100314, 88027, 71204, 63039, 84085, 94682, 81772, 76996, 87208, 87734, 79327, 74448, 61649, 65558, 63390, 57771, 55613, 98672, 112015, 100373, 87911, 60433, 52217, 34969, 33359, 39074, 58762, 57571, 59385, 54063, 41793, 47948, 55683, 36850, 37305, 38459, 53105, 69949, 88165, 97465, 95312, 92101, 86356, 86361, 72361, 60955, 71187, 80265, 67002, 49839, 53727, 45579, 48125, 53571, 40712, 46400, 52925, 58888, 59021, 84312, 91290, 90059, 63318, 46300, 27424, 31765, 39571, 36460, 35017, 52567, 67041, 65026, 58018, 66559, 66517, 50099, 63729, 82412, 75215, 50612, 62744, 76024, 73125, 82349, 82295, 71424, 83475, 90738, 77800, 70757, 71356, 56327, 43616, 48624, 42175]
8227D2175r015J2483N280k276m957j2560m357P306M478j477O028P523J1458j8156
8213D3933j2623J1602J9339j3691L354J3833K866j2164n864j1650R539Q858r821
8200D7511j3419k677J1038m365n844L855K0774J6993l02j6497r038j346m347L283
8186D5619N55j928j969J7177K3166M725k2223k1298j223o90j4350L38N746K852
8172C6497J1144L850M753p521J7530J3404k6588k0597n617j185n760R06L927P400
8158C2143j216Q836J2910Q444K021j677l865N55n204k3281J6930r507j9806J0896
8144B8179K1269J8669j8632p4n678j9805O714L63P26j8008l296n314O066K3363
8130C4542O82j2322L943L7552J412k8218r076j1460L017R942L412n388k128M43
$$ y = [42175, 33160, 45643, 50923, 48647, 43690, 31130, 26773, 34079, 38557, 37080, 43108, 50631, 62089, 43933, 31310, 42912, 62251, 48560, 51914, 65747, 68613, 56449, 50585, 38935, 48474, 57332, 47511, 34092, 31415, 42453, 38088, 32244, 36099, 56873, 73866, 73564, 57067, 48029, 46683, 42336, 45619, 46174, 44246, 42277, 59454, 82620, 87345, 65122, 43824, 42601, 41911, 27561, 27899, 33645, 36497, 47641, 51491, 56244, 48723, 66253, 79657, 53069, 32472, 26855, 25670, 19910, 20816, 24743, 32143, 30927, 39763, 52673, 61117, 63138, 61461, 57596, 58151, 52947, 29666, 46596, 37089, 17283, 28179, 49448, 68117, 49485, 49411, 43733, 23928, 30642, 31005, 31731, 13723, 10427, 5113, 11179, 34542, 35224, 22902, 26845, 64397, 65809, 37591, 28515, 17055, 20072, 30014, 33426, 28038, 25910, 26353]
8116B6353R450R406o421K591m489j976R242P405J2898j2838l0756j0149J1857
8103B2573J9402M844j1615N240o34k504j6830R31J5946N769m19J437q678j4618
8089B0844n890p969L556M118N018k05J5531K954J1547Q40l223r78K0686L165j5424
8074E4570p950l353M546J84j498r184l055J0548m020j1965q659l432k854L304
8060A7182n401Q769K46N974J4196k699l303J4871j1364j7349j0988l284L395j594
8046H651m016J3814n50n944L787J2818J7981K201j3508j2726J8429l161k2818
8033A4958j5239J1713J8388o894m441J9279Q220Q917p08k9797M548J5632q007
8020C6569p976l575n962K538K8418O882m46k1973l775Q898L378j9315k531M707
$$ y = [26353, 35803, 45209, 38788, 41379, 36890, 34914, 44156, 51561, 64459, 51621, 20865, 10716, 22573, 41975, 46819, 35204, 40444, 39810, 37306, 20476, 21407, 37353, 43122, 42703, 44140, 35462, 20844, 14954, 6985, 10541, 14659, 19677, 19472, 35003, 37957, 49504, 50344, 47121, 46143, 66829, 69994, 54570, 46620, 43267, 47813, 47997, 46499, 37315, 34260, 44808, 40788, 28823, 20164, 16732, 13878, 17182, 11781, 20550, 20796, 26770, 40966, 38267, 34964, 49835, 38471, 21122, 10134, 6850, 10245, 8651, 4635, 18449, 17899, 11955, 15742, 28560, 46541, 48742, 35234, 22508, 40937, 37776, 14958, -281, 11432, 29820, 22926, 18485, 37764, 45984, 54901, 54193, 24396, 28944, 44576, 36569, 28593, 25018, 19056, 21594, 50012, 56894, 56448, 34475, 30700, 39598, 42976, 23661, 21130, 25837]
8006B5837k765o921j2167J1111P28P882j0474J2797l134j854J0643J2544M562
7993D8789j4774O526o99j2202J959M363Q550r893j9736Q970K0458J1428R383j9906
7979D3216L989O569o952k0354j6409N427M62L5394J5627N251o211j9706N383J6322
7965F8008L424m701j2912R415r452k0837j2571j3646p732J2921R03K465K1139
7952C6424J3417n024j8908J874K7680l489k0608r148J514J9204K3006O476l8135
7939C4283j5644K1421N200P481J5136J7508j8189p413L191l1165j9012k777R105
7926A9125j4698O771L5385J727k141n71j5160j2398N036N841K460J2019r55K525
7912D4966p190P699j1290k3000l799J5603J5206J270j7975j5368M83l631k3763
$$ y = [25837, 23072, 16151, 3984, 15095, 15823, 23705, 13231, 26028, 22894, 21040, 31683, 44227, 48789, 34015, 40541, 39842, 27640, 29599, 33962, 42512, 32619, 12883, 21853, 42311, 53739, 63122, 43216, 47205, 53774, 46822, 26468, 10059, 15486, 15948, 51342, 66969, 72220, 66009, 46303, 51686, 68008, 71432, 66731, 53819, 63234, 53782, 32945, 20374, 6728, -1004, 11917, 12820, 15285, 36424, 49841, 44817, 25909, 27783, 55463, 51974, 31366, 22218, 23732, 42936, 65942, 72418, 34283, 18639, 40060, 45260, 52741, 67877, 85385, 67196, 59783, 62974, 31809, 12797, 10020, 19125, 4427, 11198, 46583, 48310, 46169, 45598, 30438, 18040, 23076, 28917, 31377, 43396, 42441, 44966, 37776, 45475, 34185, 11185, 7386, 22989, 38195, 39465, 21490, 6122, 6605, 2974, -20789]
7899b0789L1900J7867k620n321J0056q416k569Q623J0162N321k3340k3289Q638
7886F223Q262m854J2596J4723J2683R359o356j8942j9575j3318J1086J6412j628
7873B6671R906k0163l171q378R55K0367O427j3544j2610q583j3939J0725K1404
7860A6067K4592J201j2288J666M141j9545j0082J9627N610J2924M953r98J4605
7847F2473O828l903p973J173k4917k3197J3488R766j3145l876O451L725m034l031
7833A9828L826N798K135k5358k1203j0851M434K7606j700P98R754J7287m646k3806
7819C902j0925L319l738N017k897M647j4505k083J3695N952q989k3303Q653J3670
7805g585K0421J184j8030p411J1566O742J0215k5618j8560R817J19J069J6035
$$ y = [-20789, 11111, 28978, 26358, 21037, 31093, 22677, 20108, 28731, 38893, 44214, 20874, -2415, 6223, 14485, 9631, 22227, 36950, 49633, 58992, 52636, 33694, 14119, 801, 11887, 28299, 26671, 36577, 16414, 13243, 4865, 5820, 26187, 32614, 19070, 6460, -2123, -16062, -5337, 16067, 40659, 41860, 29572, 31238, 35379, 15834, 5752, 25379, 30989, 43913, 48866, 47868, 62473, 69301, 65398, 57425, 58598, 33681, 10484, 23972, 33738, 20593, 16717, 23168, 26893, 22859, 19828, 23654, 29452, 31587, 6229, -14974, -25825, -21391, 6215, 4515, 5313, 15067, 32354, 27708, 3902, -7023, -3704, -7442, -2425, -5322, -675, -15180, -17263, -3568, 2384, -6605, -29908, -21255, -7585, 12836, 14020, -4010, -11421, 145, 6887, 17102, -8516, -27076, -17259, -17140, -16071, -36]
7792c6P211O632l216o682r898O637J4209J6585N5L401j323K166r991m307j2343
7777I100j3315k985l418Q110Q386n482n185j018L801p29k841J720m358p040O155
7762i099K620J2047J3572j0365k1642K4150K0172L565M810K274j9170j8026r062
7749d154L549N819J576m723M641O092k6042L502J1953M185o924J330K436o371
7735c131J3140J738K0997o298p700k558j0564j193l41n21N257j6062j6083J4118
7721i201o45J736J3587J6529m066j503J2862j2124m927l24R277q393j9252j971
7707h415J1687L123p788k486m826l412M540J7182R807P81m747r68p439m746k8836
7692b6543q255R672m55Q619K350m380M778N396J3901J1053J2356q738l2247l363
$$ y = [-36, 7175, 13807, 10591, 3909, -5989, 648, 14857, 31442, 31497, 34898, 33575, 35741, 25750, 21443, 9100, -4215, -7200, -10618, -2508, 5878, 396, -4789, -5807, -2006, -2735, -5576, -3856, -8214, -15254, -9099, -6479, 5568, 19140, 8775, -12867, 11283, 31455, 35020, 39830, 42104, 22934, 4908, -4154, -605, 5214, 6790, 2067, 6708, 12800, -13242, -9740, 2213, 6398, -526, 804, 3240, -3131, 10009, 11747, 32744, 26446, 18746, 16188, 5624, 4431, 4090, 3569, 8826, -7236, -23319, -9201, -9846, -8110, 5477, 22006, 17940, 16437, 29299, 17175, 12248, 11924, 21201, 12808, -6444, -8415, 3272, 6395, -1393, -3879, -8705, -12117, -7577, 9605, 19412, 20193, 15446, 14478, 7039, 2293, -26543, -34798, -25126, -25581, -16962, -14612, -18992, -14214, -8818, 5083, 16136, 28492, 19754, -12493, -15856]
7678a5856J4882J8446j3716J2033R752L994j5402j6512J0924l668j1383O334l278
7665c450l424N224k484p454M490o83K0810K853p129n322J0146p554R051K6757
7651D1831n403j1144r433M38j4241j6258q878l389R308J1210J0145J6432K399
7638B3017j3444O896Q345O986J682j2491k5595j3852m724J3363j00n76Q786M202
7624B495J1943P485P01o631m651p104P272J2780J8352m251p665q344N72j0697
7610A2257j6828j0944J3632K1937N20p498l2726K511N817p60J1819J8767J7165
7597C5669j4000j5745j8158J437P880M561l232r414R613K012J1270K1732p644
7584B5981k639p188J0082P845p541j5307N222J851j502k005j1116J5485Q568j868
$$ y = [-15856, -974, 17472, 3756, 15789, 25541, 29535, 14133, -2379, 8545, 4877, -6506, -172, -3450, -6874, -1650, -4134, -11588, -7098, -7781, 13029, 15882, 8753, 3431, 13577, 6023, 15074, 41831, 36428, 25284, 15851, 16289, 2048, -14210, -23088, -26477, -17169, -5959, 4186, 20618, 23017, 9573, 16469, 24814, 31800, 33482, 20991, -4604, -18456, -23180, -9817, -9917, -10493, -1707, 2495, 14438, 21923, 22624, 15993, 11342, 4238, 11510, 24290, 42642, 38391, 30726, 22382, 22954, 12257, -4571, -15515, -1883, 20054, 20574, 13076, -19650, -17139, -11322, -12082, -263, 18504, 35669, 21669, 5924, -12234, -10797, -2917, 1644, -1588, -11002, -1389, 623, 11893, 33625, 25981, 23342, 16154, 26236, 34081, 26540, 11233, 16455, 18306, 16804, 14799, 3683, 19168, 27736, 25868]
7570B5868J4184J3890M780k6261k1645o076n648o378Q046R956J1511r615l261
7557I351k08k195r78l440j9707j3833M311j368J7818Q279Q93P237J0122L25J038
7542A7645K3040M462j8938o332M961l553j5617o235M062m454o795P448Q442m866
7528C270j8400J0680Q298p707q89m835J0441j192k0454o422l465J4636R097O52
7514f290N809R912J1262J952N471J3109j7707l1735j3261q431k554K0174Q552
7501c737l316n961J060k780o998M2j9017M014J4913J7931L572r6J1257j7421l62
7486f899r010o232J2179R40o63J898L460N176k5175Q778k397m800P13Q169Q544
7471e319j2499l3439L867K4407J0750P281K0568p585j0701K028J4342j2991k869
$$ y = [25868, 40052, 53942, 58722, 32461, 10816, 4740, -908, -7286, 760, 10716, 22227, 12612, 9351, 9143, 6948, 5970, 2530, -17177, -31010, -26699, -28067, -10249, -1970, -1077, 6160, 16282, 16607, 17645, 40685, 45147, 26209, 19877, 24838, 21285, 5668, -567, 3495, -959, -7754, -306, 8136, 3270, -15130, -4450, 3848, -3859, -4748, -9583, 858, -334, -20788, -27210, -30675, -16039, -6942, -6290, -481, 9431, 20693, 22645, 28116, 41225, 23518, -8217, -21478, -29909, -32463, -12289, -3737, -7053, -13014, -11954, -14734, -21732, -21690, -40707, -36693, -21780, -3849, -277, -373, 10884, -6537, -6899, -15909, -22141, -9962, -9022, -9685, -7787, -4327, 849, -24326, -15548, -17945, -22745, -22032, -13863, -5319, -17818, -51257, -47390, -22983, -12233, -4952, 15616, 8031, -2670, -642, 13700, 709, -2160]
7458b160p294k600N322K584N95J1840J288j3728j3784j5074N406K3434J6644j563
7444A0910j4739k003p742L630j1344q452K062K5982M430j7047k799L1530j0746
7431C672p794j4116J1652j623K4805m35k1065r957O241j0783J781K1845K0439
7418B4662M956j0535j1582k1205q302j917J4214J6446j8290J964k2695M95J5707
7405a6082J6672n857j1675R131o346J9375L885l132R183K84N665j1597n115q407
7391d016k0810N839J1185l287O583K7006L655m235m720o620K3654m218j4070j4150
7377A796r057l285O355M377j1303K85j644q901j4298L473K0736J1186j8672K389
7363a6563L260N517K265J3908m108j4791j4056J0111M369r468p296J3789Q427
$$ y = [-2160, -9454, -12054, -6732, -4148, -3553, 8287, 9575, -4153, -17937, -33011, -27605, -4171, 12473, 10910, -3829, -5832, -13574, -9944, -21288, -29740, -27678, -1696, 2734, -14313, -17112, 14418, 3672, -4122, -18238, -6586, -8209, 16596, 16161, -4904, -14861, -8620, -19403, -17622, 4223, 24662, 29618, 19083, 7501, -13704, -22006, -23923, -9709, 6737, -11553, -9589, -32284, -31789, -16082, 590, -5267, -16942, -7811, -14157, 5218, 9103, 5971, 15154, 15438, 21103, 9506, 4391, -4016, -24826, -18987, -7802, -11089, -4506, 22500, 26155, 21920, 17200, 10580, 34234, 30016, 15946, 1796, -7261, -10546, -4191, 186, -11117, -10832, -12476, -21377, -35675, -32202, -11466, -280, -18952, -16563, -13303, -7786, -5521, 8387, 4279, -10512, -24568, -14457, -10088, -19556, -26852, -13063, -4636]
7350d636O405j2075L343J271k331m644r143J1613K2438L397O3Q577K397K097J15
7335B8887k2417k0300J0464K936Q042J6764N381j0666q656j0855K107o92J8359
7322A9354J0565k038j2228k0796j2026n466r414J1785J6694K0300j2955j3866
7310a0091j1836P632J0460N673K637R367O238r611j8280l853L320P368R152q232
7296e6l0319n15L2285J3002M144j6581r296o65P316k103J2495J2847j1172L53
7282A1735k067M151R109j0703P054p605j5541L82J126J0270j9344K300K3686J6079
7268C0632j6582j2086p778K466R049P268j0147q659J3977j8166O297J8723j672
7255A3322o938K190n536j1906O8o715m942q797J790K8630J8092P193k469o426
$$ y = [-4636, 1769, -10306, -6963, -5692, -8023, -12667, -21810, -10197, 12241, 15638, 15701, 24278, 26675, 28772, 28887, 6470, -13830, -3366, -430, 7612, 24376, 29757, 19091, 10435, -420, 1687, 995, 19354, 29919, 27881, 15653, -5143, -17169, -22635, -32049, -20264, -3570, 16730, 3775, -10091, -21927, -14295, -3835, 1838, 4475, 13842, 20080, 10469, -7811, -11664, -8344, -976, 8176, -56, -30375, -30890, 1395, 14397, 18541, 1960, -7336, -8001, -685, -2788, 9707, 22554, 11382, 11735, 9668, 13819, 22928, 12225, 19279, 11674, -3867, -3485, -2359, 7911, -11433, -9133, 14553, 30632, 14050, 1964, -5814, -3348, 5701, 12969, 2822, -5837, 8140, -10026, -3729, 14994, 13322, 6384, 8574, 3038, -8868, -8800, -15515, -20457, -29254, -27464, 1166, 19258, 26451, 23982, 17556]
7241A7556j982j325j8831j5031J1025M73o431J194Q458R278Lk810j2158j725N658
7226f648j1M163K711j3470r699N925J6060n906k628K2008M681n505k4964m605
7212a7888J8981Q540r050m700k0863j1279N250j014R71m308K0773K521Q476q61
7198d451j197J3839Q036l99j2098j1102k016J4936M299q575M081l109p185K894
7184b047j1294l756k027k2391l182J4556J912j2576J0985j5383K410J9583J7207
7171f003K3520J0720K918j6475m221o407M093N105j3706k0842R556K0143j2176
7158c775J0631o348j0722O025j6584j1103j0018K520L181L9005J6553j1409j4604
7145f648J5789K616j5649R336K1262Q430k1418l259L038N297l166O006l84K160
$$ y = [17556, 15574, 14249, -4582, -19613, -8588, -8115, -14546, -13352, -4894, 4384, 4387, 1577, -10581, -12306, -6648, -6659, -2496, 215, -13255, -22954, -17029, -969, -6875, -9503, 12505, 17186, 11681, -13283, -17888, 1093, 9633, 583, -4117, -24980, -36259, -31009, -32023, -31052, -35360, -14587, -12066, -3590, -4451, -5648, 8191, 16227, 15828, 3730, -7372, -9388, 5548, 9847, 1272, 5353, 2244, -4941, -2047, -13341, -17097, -19124, -41515, -44697, -30141, -28229, -40805, -29820, -45203, -42793, -23210, -6003, 17517, 28237, 31155, 14680, 10459, 4052, 8145, 13250, -456, -21298, -11742, 8401, -3775, 6856, 508, -10214, -4189, -20773, -31876, -41894, -39374, -36193, 2812, 19365, 7956, -6648, 9141, 11757, -3892, 5444, 26706, 35136, 13718, 10459, 13497, 18794, 15628, 21634, 21250, 23410]
7131B3410L447m846R79j821L393L415o893O842r476J3667L744j8575k5955j4566
7117b3235L64J2206P299J7785j669k2754n713P946m037n511J8674P859j3855j4340
7103a8981q598M450J7461k62Q707L024k62l784K183J694p122k0884r640Q196K2154
7088a664k094k1188M251J3348M675J3490l308q534n710P776J2891k1716o188P774
7074f197K6880J3784r215k7050k347J3606k653r629l373Q644p014K384O82M121
7060B623J0570Q637j432j3712p853J15j4367O564N722K4671J3203j0674q566j1060
7046D441l765j0301r285N95J7208K1646l059o954k675j0797o6J1736J2829K847
7032B4400q05j2556j1069J353L092m185j9698K0057K2114q764j1528r34J7918
$$ y = [23410, 26857, 22011, 22990, 21169, 24562, 27977, 21084, 27926, 18450, 32117, 35861, 17286, -8669, -23235, -22871, -10665, -3366, 14419, 12750, -10004, -15717, -7771, -11808, -17319, 1355, 9214, -4641, -18981, -27579, -23129, -5668, -5930, 2777, 5801, 5539, 1755, 3938, 5632, -1490, -22374, -32014, -23818, -1664, -3758, -24946, -20695, -7347, -2672, 10818, 7510, -1024, -6734, 1042, 13933, -7783, -13971, -6197, 20683, 34467, 25252, -1798, -4145, 9461, 6808, -2821, -6194, 2450, -4564, -2180, -1498, 2623, 13193, 21830, 20398, 6686, -1167, -1052, -15419, -8855, -3133, 21538, 34741, 24067, 15501, 4441, 676, -9625, -18910, -18315, -1107, 20539, 17480, 10526, 7851, -2946, -3012, 8724, 21553, 24400, 23595, 11039, -30, 1323, 4415, 230, -19468, 589, 22703, 13939, 2411, 1477, 19395]
7019A9395j454m465O870J2184q384j552J8917k188k096j6195j0557o123J2764
7006A7116J2401q805p488R583N917q484J123L606j5364r238q14q913j8369j702
6992b9431j1484J2189L0090J2024j0422j0443M250Q374K854m213N335K210N568
6979A6901J2352o133k2801k872j2745J6381K347o660J3530j0022k5505K0827J5605
6966A1205O813M466k2545q896J1095J007j9158N764n95J7800J0008O883j2649
6953A1198N282Q666J0079O117q986j3975k958j3710j6711j271L3101K774o604
6940A3002n069R33R601M408k0896R189M163r825r037O488J7955k337j9120j389
6926a934J1112J0900Q037p043j5929j3649J1739P537K641K815L153l495j6774
$$ y = [19395, 17941, 13476, 20346, 32530, 24146, 22594, 41511, 39323, 37227, 21032, 10475, 4352, 17116, 29517, 20712, 13224, 22807, 28724, 20240, 21363, 24969, 9605, 367, -447, -9360, -27729, -29431, -40915, -28726, 1364, 13388, 2966, -7477, -3227, 5147, 8001, 3788, 9123, 11333, 16901, 29253, 23120, 319, -2553, -15298, 1083, 3430, -3230, 10300, 278, -25227, -4400, 11205, 18018, 22484, -61, -8957, 2138, 3145, -16013, -10249, -10844, 6956, 16964, 23847, 11198, 16480, 25146, 35225, 41342, 32356, 18381, 15423, 1713, -14998, -16269, 16832, 19606, 13002, 7933, 8866, 18467, 22875, 1979, 11168, 15331, 5506, -3531, 2957, 20912, 18575, -545, -1934, 9178, 20078, 28115, 21072, 5143, -8506, 3233, 10770, 13411, 16226, 19379, 15884, -890]
6913h90j2215J4474M242j8755R217P334N220Q948l112k3322j8035m542J6262J690
6899a3484J3634p114L143n153J703m119J1277r489J629P897j1557K201J3966J3238
6885A7772j1998l982r783M292q6J6181O656j4909m15Q197n719r491J73J8912P828
6870B3628k2605o072K1819J2056l808K04J756J553k1088j5444L029J180p40K1460
6856A6928p682J474P958m959J7146N901j1230j704J205J607j8130L427j2017j3682
6842a3758p867m391J0391M400J924m922J0324P694J729N727k690m073n446j1433
6828a2391M331J418q17j371J0392M632J532k651M057N150N945k6126k7490O885
6814b6504K6551Q220M673j4123j4683J908J5302K416j2358L884K0548J0901j819
$$ y = [-890, -13105, 1369, 5611, -13144, -3927, 3407, 8627, 17575, 14463, -8859, -26894, -31436, -15174, -13484, 150, -6964, -3821, -8974, -7271, -11390, -113, -9602, -7973, -76, -11633, -9432, 4534, 17772, 5774, 1792, -7991, -3699, -3785, 12396, 19052, 4143, 3728, 11925, 6206, -3285, -3112, 15800, 23628, 1023, -5049, 16770, 28826, 25018, 25222, 26978, 28531, 7443, -8001, -4972, -3792, -4532, 16928, 9246, 10720, 18678, 13719, 30865, 36766, 25536, 23832, 25037, 26644, 8514, 11941, -76, -13758, -21625, -26016, -15625, -11225, -9301, -14223, -3899, 3795, 5524, 11251, 8561, 4488, -958, -12391, -8060, -6642, -7459, -8830, 1562, 6194, 7726, 5075, 9132, 14282, 20227, -5899, -33389, -26504, 47, 8267, 12940, -1183, -15866, -13958, 1344, 3760, -8598, -4714, 15834, 26735, 24916]
6801B4916K294p798k116k4919M935K0854O823j1k4112j0141R718j526n493J3635
6787G059O781k32j5811n277J3423L31j1114M414J0649p578j9572M933n853P001
6773a0846k904q019p26O23J290J417J0385J3059Q19m98q149m438R650j2928p655
6758a8920J0755M627J0053k4815M704q967N859J9957J2887q822j8255J3284K2772
6745B5119J2609k526p67k941M138j2447k2754J6522O065O845P402m156m340O896
6731C5665m48j2081j3130J0226J3016J0774K5191J2305J9356J2469q663J48J9168
6718A23996Q582l214N334p609R136J1404r759K1873K5954J7060L1998N1522M4471
6705C30748N6762P7712J15093J31871J72796K51643K94006K67329J27687l1518
$$ y = [24916, 27210, 19412, 17296, -7623, -2688, 18166, 24989, 24978, 866, -9275, 443, -1083, -6576, 7059, 13840, 13608, -2203, -7480, 5943, 6274, -4840, -426, 10223, 2645, -16927, -11994, -17847, -10846, -13750, -21769, -22495, -21872, -20582, -19165, -8780, 4279, 5098, 4600, -3549, -7987, 1663, -11265, -18920, -8165, -3538, 6515, -18300, -13596, -22563, -16704, 3253, 16140, 7318, -10937, 2347, 25119, 37728, 35202, 34435, 31494, 35632, 23185, 431, 16953, 23018, 29863, 37265, 33109, 28769, 35665, 35217, 23136, 10006, 20232, 33248, 44022, 69213, 81518, 100874, 113343, 104680, 104828, 123996, 132578, 129364, 134698, 127089, 136225, 147629, 137870, 159743, 185697, 202757, 234755, 286277, 330748, 387510, 465222, 580315, 712186, 884982, 1136625, 1430631, 1697960, 1825647, 1794129]
6695A794129j09551j53481k40646k87139k50533j83310j22942r9621o8087j7441
6685B61378k0152l1057j6402k5099j2572j1113K300j2958o285N000l656j3696
6673A15688M128J6251j179j2791q706q84q335l64k1542q73J8046k984j0550J348
6659H7253j0709J7479Q757m125j2052j9070j7520K411k740L096p810j7373Q040
6646C5637k083n00J1258j824k7815q823K067Q588J6619N002J6361o189n354j1415
6632C1529j0562K801M393j1670q990q122J1113N603M935j0739n374J3792M529
6619B3238j863j490j911j5951M873N354J4916k70j4660k478O362M833k459l141
6605A5353j6698j5138J2919K8829N039j2515l1878k2634L686J1091O884J037R407
$$ y = [1794129, 1684578, 1531097, 1290451, 1003312, 752779, 569469, 446527, 346906, 278819, 261378, 241226, 210169, 193767, 168668, 156096, 144983, 147283, 134325, 128040, 133040, 129384, 115688, 119816, 136067, 134888, 122097, 113391, 112507, 104172, 103808, 82266, 81393, 99439, 96455, 85905, 87253, 76544, 94023, 102780, 98655, 86603, 67533, 50013, 52424, 49684, 52780, 44970, 27597, 35637, 33554, 33054, 44312, 42488, 14673, 5850, 7917, 16505, 33124, 38126, 54487, 48298, 42944, 31529, 20967, 23768, 28161, 16491, 7501, -621, 10492, 16095, 21030, 10291, 4917, 18709, 23238, 21375, 19885, 17974, 2023, 6896, 12250, 27166, 26896, 12236, 9758, 16120, 20953, 18494, 15353, -1345, -16483, -3564, 25265, 30304, 17789, -14089, -36723, -33037, -21946, -15062, -14025, -4618]
6592d618J7878j57o957Q876n908n502J2106n153R530K2189j5413j8065J311J0203
6578B0320j101Q20l789P137J552k879j6134K152l827m598p750K866L630k2774
6564b4375j0279J7094P335J9636M37r713K450J2135K301q863K38J5400q419k4356
6550h979k2142j334J1320O062j24K958P179n273j2894J3486L834m400j2043K984
6536a9366K0838p842j0238Q214L871o609r731Q378n199m865m28K2627o498j4206
6522b1054O061n016o279l762Q089J8828J1936j932k315o086j6366j3886J8358
6509a3424K5835O257q774J230k2973k762R195k393j0477O136J5568p537R279J2842
6495A8002J488j1514o711R966q64p625k0768p57k917j803R708L973K2361J2534
$$ y = [-4618, 13260, 13103, 6146, 15022, 9114, 3612, 15718, 10565, 20095, 42284, 26871, 8806, 10117, 20320, 19219, 20039, 16250, 23387, 24939, 22060, 5926, 8078, 4251, -347, -8097, -5231, -1601, -24375, -34654, -17560, -10225, 9411, 9848, 135, 2585, 14720, 17021, 8158, 8396, 23796, 15377, -8979, -31121, -32455, -21135, -15073, -15197, -12239, -5060, -10333, -23227, -9741, -5907, -10307, -22350, -19366, 1472, -6370, -16608, -8394, -4523, -11132, -20863, -12485, -17684, -22549, -22977, -350, -6848, -21054, -14993, -20009, -26288, -30050, -21961, -3133, 8803, 6871, 4556, -1530, -17896, -31782, -13424, 12411, 18668, 9894, 11124, -11849, -14611, -5416, -7809, -18286, -12150, 3418, -4119, 5160, 18002, 19490, 7976, 1265, 11231, 10367, 2742, -18026, -18783, -21700, -23503, -13795, -9822, 12539, 25073]
6481B5073j6301J484R792j1191j605k013O51Q30N362j4064j0881q325r74M483
6467a7679J8284m46N292j1346j0558N711p170m24r472q40l418m384J4537N654
6453a6259P882J1670M342O70j3239p413p951l059l59J0170J518j7648p701J3056
6439b4321Q512m235q000J4038Q893K047l608n168j3247J3976L0543j920M884J8100
6425D0494r245j6883j9978j6399J644J3322l675O593K6021o461o459j6192j6011
6412b3229O765J0476O682K3006N122j1296j2553O40o375L230J0388J410j1072
6399C194q320M544J880k3665r671r947J1114J1114j3591J3087K5257O439o262
6386E173P391n378K477L362Q988O512J0925o378k0148q273R489M530j5184j9857
$$ y = [25073, 8772, 10256, 20048, 8857, 7252, 5239, 5890, 6720, 12082, -1982, -12863, -21188, -22162, -17679, 605, 159, 5451, -5895, -16453, -10742, -17912, -18336, -27808, -28648, -32066, -36450, -21913, -16259, -8377, 3293, 7635, 8305, -4934, -12347, -20298, -23357, -23716, -13546, -12028, -29676, -37377, -24321, -15809, -20044, -28044, -14006, -5113, -3066, -6674, -11842, -25089, -11113, 19430, 17510, 22394, 40494, 31249, 14366, -5612, -22011, -20367, -7045, -10720, -4127, 21894, 15433, 8974, -7218, -23229, -16464, -5988, 694, 23700, 28822, 17526, 4973, 5613, -762, 2468, 12856, 14266, 3194, -5126, -582, 1298, -22367, -32038, -41985, -30871, -19757, -33348, -20261, 4996, 11435, 5173, 12564, 7186, 9663, 13025, 22013, 28525, 39450, 33072, 12924, 4651, 14140, 18670, 3486, -16371]
6372a6371j872q252J3558J9458j2366o525M563q068L608r39m22J5203r226O865
6358g86k539J682P553J951r534l060j1154p197K379P11n126k285M592P849J0097
6343d867j7792J0733J1228k628l140m179R675K1123J0289k3389m045L445Q068
6330A4521l163q951L916J2210p833q727p404k0298J0540L047J9152K5622J2837
6317D5469K81j8562j5161j3796J438R331n929k0002J2832J7023K696p547j1161
6304c088j5918o829O726l77Q758J116k0007j0755R497L0549J5247M466j5979j4775
6290a1369j3394M615L086L39l822o346j5539k625M242M881Q574P968q971J4201
6276a4160R795N554J285J451n417o014O476p386o915j345k121K7147m211N852
$$ y = [-16371, -18243, -26495, -12937, 6521, -5845, -12370, -7807, -15875, -12267, -13206, -13628, 1575, -7651, -786, -3325, -1643, 5910, 7861, -1673, -4733, -15887, -23084, -20705, -19994, -25120, -27405, -22813, -14964, -4867, -22659, -11926, -698, -3326, -6466, -10645, -970, 20153, 30442, 7053, 3008, 6453, 14521, 11358, 2407, 6323, 18533, 10700, 1973, -5431, -25729, -15189, -12142, 7010, 32632, 45469, 45750, 27188, 12027, -1769, -331, 9000, 3071, -16931, -4099, 12924, 15620, 8073, -3088, -19006, -25835, -19109, -19486, -10728, -9612, -29619, -40374, -30877, -328, 14919, 19385, 3406, -11369, -24763, -20148, -17062, -16723, -20545, -26891, -42430, -45055, -40813, -35932, -27358, -19390, -28361, -14160, -4365, 1189, 2474, 3925, -1492, -7506, -1030, -8416, -15331, -16676, -18797, 8350, 4139, 9991]
6262I991j2422j5548J783r14J1631J3739j4694k0386k810n242R82J7271K7851
6249A1232j2776o60k2924j7658m667K3730k056J658J959J200L606P673P361L123
6235H01j61J3877j0410L297n20Q466mJ1308j4024j6882l595j5472K430N886K039
6220a2964l976J1043j656Q752O509n740j8560j5671P058j3287N091Q82Q345O946
6206a7228L278n23j721j6329k00J1436j0923M300J2291K7438M990J4791r847j0457
6192A1296o227M573J4111q270l936LJ0683M382k0137j4981j1067j0913J6759J9514
6178E790R906N8j158q381J1200j6148m305K2132N554k0451k4155q762J0262J7975
6164d83Q575k7895O348K5795r154j0592M552j6804j4409M671J676j5660L906O254
$$ y = [9991, -2431, -17979, -16196, -17110, -5479, 8260, -6434, -26820, -29630, -34872, -33890, -16619, 11232, -1544, -2204, -25128, -42786, -47453, -23723, -25779, -24121, -22162, -20962, -17356, -9683, -2322, 801, 640, 14517, 4107, 7404, 6884, 15350, 15346, 26654, 12630, -4252, -7847, -23319, -20889, -15003, -12964, -16940, -5897, -7553, 1199, 7708, 1968, -16592, -32263, -25205, -38492, -33401, -32519, -24174, -17228, -13950, -14473, -16194, -32523, -32723, -21287, -32210, -27910, -15619, 11819, 16809, 31600, 21753, 11296, 5069, 9642, 23753, 15483, 11547, 11550, 22233, 26615, 6478, -8503, -19570, -30483, -13724, 5790, 15696, 15754, 14596, 6215, 17415, 1267, -3038, 19094, 24648, 4197, -19958, -28720, -18458, -483, 8092, -19803, -13455, 12340, 3186, -7406, -2854, -19658, -34067, -29396, -27720, -43380, -39474, -33220]
6150c3220r088j8393k338k204M901L8065J1768j914r577m337J5531J1329P316
6137G839J1740J4093p749r390L987q354Q190M004k8951q423J4718N87N567R289
6123A7147N881r691J362o967j4152O835M986m061J925P061P70j3048r495l200
6109a4647L033q26N66j8281J347J0366j535k4679K604J3022K2918l743j7783J3175
6095a4463J8917n398K1547K066j3498o534j472n268L634j435q604m90k089K9143
6081A6056j878j9731P029n109j5904J8785J0100l950j0944n266l584K2123P828
6068A5555j5348j5493l622Q9n569J5465J5626n480j447K171r529k2799k719k499
6054c5599M121l459l237O857K0400J5404P375q06l6986n320K4379o391R409L739
$$ y = [-33220, -42308, -60701, -63039, -65243, -60342, -22277, -10509, -12423, -22000, -26337, -10806, 523, 7839, 19579, 33672, 25923, 16533, 20520, 12166, 20356, 24360, -4591, -13014, 1704, 2291, 7858, 17147, 23028, 13337, 14699, 7732, -6420, 415, 5401, 1340, 3265, 10326, 11096, -1952, -11447, -14647, -11614, -12440, -11874, -30155, -28808, -18442, -19977, -44656, -42052, -29030, -6112, -9855, -27638, -14463, 4454, -944, 20603, 22669, 9171, 2637, 1165, -4103, -469, -1904, -10508, -10998, -13087, 16056, 14178, -5553, 1476, -3633, -19537, -752, 9348, 5398, -5546, -10812, -14396, 7727, 15555, 207, -15286, -18908, -18819, -24388, -8923, 6703, 1223, -224, 1947, -7582, -30381, -33100, -35599, -31478, -34937, -38174, -31317, -10917, 4487, 11862, 11056, -25930, -31250, -6871, -13262, -3853, -114]
6040a14k2280k122O815J210j0521l214r426j971M619J5802K2852J664k095K283
6026C502N194P957N906j9316n128K078k436m641N347l195k268J2880M758p74M93
6011A0357j7112j0263o85J8474K26k1484r181j9101l773L548K4930q890J8850
5998a4104m041J177L1252M03r67k1081k123p634j4965m253L142j0548O590O704
5984c0448J3699j800M786O070P314j329J459K245j2385l010r691r051J3157J062
5970a7922j5790L641L924J7296P835m06j2418q56J8402O144m647r882j7669O266
5956a6082J4802l950L802o433j0895m602J5775J6937J365Q652J94j1133j6840
5943h408L217o069M292j1622q905j4466P522K1824K275J350N365K951l23r768
$$ y = [-114, -22394, -24516, -17701, -16491, -27012, -30226, -39652, -41623, -37004, -21202, 1650, 3314, 1219, 3502, 8696, 16653, 22559, 3243, -1885, 193, -2243, -6884, -1537, -4732, -7000, 5880, 10638, 9864, 10357, -6755, -17018, -17703, 771, 997, -20487, -29668, -48769, -52542, -48994, -24064, -32954, -14104, -18145, -16968, 14284, 14687, 13720, -7361, -9484, -17118, -32083, -36336, -33194, -43742, -37152, -30448, -16749, -18549, -13763, -7693, -379, -1708, -249, 1996, -10389, -13399, -23090, -32141, -18984, -17922, -33712, -30071, -26147, -8851, -1016, -1422, -13840, -14696, 3706, 9850, 5203, -4679, -22348, -16082, -1280, -5230, -1428, -7861, -18756, -23358, -7583, 9354, 10719, 19371, 19565, 8432, -8408, -5191, -11260, -6968, -18590, -27495, -41961, -34439, -12615, -10340, -8990, -3625, -674, -997, -10765]
5929a0765l070j1515J6726J0756Q003p380p12K390K2195J2j8135j8798n026J5853
5915E34k1713j7928q930K8664J4941K603N391k43k5722r678J3458M695J1048J9267
5901A6387O225J3961l13j2084k7118j2735Q641O639k912J6231N273k2515J505
5888b815J2975k790j306J1094P379p712K038n722l0446k2925J5372J5036J3152
5875C330j788o712q112j3118k099j2658J838J9597p278j2265K2086l993k975p668
5861c1815Q679R846J8273K035j0904j8427J7007J951l979P392J4860j9026j5670
5848a9778O371j780r0L739n784m280J0938P00J1092r588j323J3506J1521r751
5834E493m993J5722j1891k1339j473K0195L968j3236k0772Q870m483j7106l771
$$ y = [-10765, -13835, -25350, -8624, 2132, 10135, 2755, 2043, 4433, 26628, 26640, 8505, -10293, -15319, 534, -21179, -39107, -48037, -19373, -4432, -1829, 3562, 3319, -22403, -32081, -18623, -13928, -2880, 16387, 22612, 36573, 36260, 24176, -2942, -15677, -7036, -397, -3309, 12922, 18195, -4320, -2815, 10160, 7370, 6064, 17158, 24537, 16825, 18863, 13141, -17305, -40230, -24858, -9822, 3330, 1542, -5170, -13282, -26400, -28499, -41157, -39319, -19722, -27000, -39265, -17179, -21172, -24147, -31815, -23136, -13290, 4983, 7018, -3886, -22313, -5306, -3355, -7334, 58, 14918, -4108, -19778, -13407, -15187, -15277, -11538, -17322, -21602, -10664, -9964, 1128, -8460, -9783, 3723, 15244, 5493, 500, 16222, 4331, -17008, -18481, 1714, 5682, -7554, -28326, -19456, -23939, -41045, -44816]
5821d4816j45L992j2275R295J9228j22o840J004L200J9832k223k8481j591Q927
5807c1015J2237N852J6123o996j4266j404q996j486L775J4553J341q131J9111
5794F98l86j0323J6083j3278r70R103k313j6821m124j0446m541P784J6528L5480
5780B2474K128qk389j5189l236K274K752l499r392k2470O336o401N413R133k652
5765a4726o693O139J0785K2981J953M171q76j4319O095J0076j6474k680k229j5233
5751a1030j227N25j24J2128j4390m276j8990p606R434J4079j2768J8162K6575
5738A0492J3410j4301m140J3265J8809k6783j9180M164J4813N248j8486k577P343
5725B077N59M378J2944L407j9484k4618J0785K8248K89p402n081k1192q534Q009
$$ y = [-44816, -44961, -40969, -53244, -43949, -24721, -24843, -31683, -30679, -27479, -7647, -9870, -38351, -39942, -31015, -18778, -12926, 3197, -3799, -18065, -19469, -28465, -29951, -26176, -11623, -10282, -18413, 698, 312, -10011, 6072, -7206, -8176, 927, -1386, -18207, -22331, -32777, -37318, -29534, -13006, 22474, 24602, 24594, 22205, 7016, 3780, 6054, 8806, 5307, -4085, -26555, -20219, -26620, -21207, -12074, -14726, -21419, -15280, -4495, 18486, 20439, 24610, 23734, 9415, 15510, 25586, 9112, 6432, 4203, -11030, -12257, -11732, -11856, 272, -14118, -18394, -37384, -44990, -35556, -21477, -34245, -16083, 10492, 23902, 9601, 5461, 18726, 37535, 10752, -8428, -4264, 10549, 15797, -2689, -5266, 2077, 2636, 7014, 19958, 23365, 3881, -20737, -9952, 18296, 18585, 11183, 6102, -15090, -23624, -15615]
5711a5615M779P535k0503j8474J376K1599M705J54m751j635N984L3824j4011k1737
5697a6770q954k286o036N184P305n044J628M394L939l412j116j130j924J1036
5683a3186k429K28O512m0O79R572K9117m585k6925n461j8202q39r863p419O28
5668d2213r527J6290K8310l837l128j3844r18j056J6688J6358l46J3971J6026
5655C2774L93q343o220q274p865p643K684j2202o532J4643k335J130j0241J081
5641a6950L670R030R814j3900q059P700O102Q081R421R123j3160r167k6692o74
5627b5661L635K9209P647k4282k8489j0678J9207K1827J657j1678L637P904M835
5614a230k2m716o391J6409o221J256K524K564K2472j6321k5214j2841l317J3158
$$ y = [-15615, -10836, -3301, -23804, -42278, -40902, -19303, -14598, -14444, -19195, -20830, -14846, 18978, 4967, -16770, -25724, -28010, -34046, -28862, -21557, -26601, -24973, -20579, -16640, -20052, -21168, -22298, -24222, -13186, -15615, -15387, -8875, -8915, -8236, 1336, 30453, 25868, -1057, -6518, -24720, -25559, -35422, -42841, -42213, -51740, -35450, -7140, -10977, -14105, -27949, -28867, -29923, -13235, 3123, 2777, 16748, 32774, 33167, 24824, 18604, 10330, 2465, -5178, -2494, -14696, -21228, -6585, -8920, -7790, -18031, -16950, -13280, -4250, 5564, -8336, -16395, -8695, -2593, 5488, 14909, 24032, 10872, 1705, -24987, -25661, -22026, 7183, 14830, -9452, -37941, -48619, -29412, -7585, -5928, -17606, -13969, -6065, -1230, -1252, -5968, -12359, 4050, -2171, -915, 1609, 4173, 26645, 10324, -14890, -27731, -31048, -17890]
5600a7890N110o570n522p594O016J0131J6651o577R051j678j12J4163J2162l447
5586B3894K219L23L457n606j5544M610J4575k991j4436k6967J520k3515o010J8726
5572b5745J6866p034L226Q594J296J1913J746m484R408J7724q463k319Q971k6356
5558E343r391J1244j5840n618K0894K8682j350L852r965r383k097q287p970J1297
5544A1411J74M975p447L81J3339k338k9763k301M874r454Q257o146j9731r777
5530d3546J795K5891J2426j449J3288J3572q201Q997j619p984q086L18j39N041
5516A0304j0053j6255j1756k1361n899K8555J9706J5193p13m815K555L908o928
5503B441k75P470j0905j9806n884J2624K719k4251k133o951J8367L3217J3093
$$ y = [-17890, -12780, -19350, -24872, -32466, -26450, -16319, 332, -6245, 2806, 1128, 1016, 15179, 27341, 23894, 26113, 26436, 29893, 24287, 8743, 13353, 27928, 24937, 10501, -16466, -14946, -38461, -44471, -25745, -8879, -15913, -12687, -4093, -2797, 9116, 10862, 6378, 15786, 33510, 25047, 22728, 31699, 5343, -4048, 7196, -8644, -14262, 6632, 35314, 33964, 37816, 27851, 18468, 16371, 8084, 114, 11411, 11585, 16560, 9113, 9494, 22833, 20495, -9268, -11569, -6695, -16149, -7892, -14038, -33769, -43546, -41751, -15860, -3434, -4883, 8405, 21977, 13776, 22773, 21154, 13170, 5084, 5402, 5263, 10304, 251, -16004, -27760, -49121, -55020, -26465, -6759, 8434, 7721, 2906, 5461, 9369, 2441, 2166, 9636, -1269, -21075, -26959, -14335, -11616, -35867, -38000, -44951, -26584, 6633, 19726]
5490A9726j2961k8773j1349o560j0946j63P944J9871L999j2871q822l533p496
5477e1934R706K7201L08q186j668m999l174P572J7643j239P482j567r96q789j4816
5462b7456k3179J7514L88k0255J2712j151j612o504Q427K2892J8050J555o11r876
5448i106o008n612r115R923m994K679L956R729M502J0922J975N451j5850k08P212
5433E456k1186l915r091Q578K1980J0887j6435j4963j2628q361J140M760O907
5420b6871j2925j7097L3367L8988M996k3252j6086j331J204k787P621m508N33
5407a8148J8931O718j37k2162j7355J9928O220O138m598N325J0842k320p561L258
5393E079O030J059J0006N582k0875l164P684j2361j4626J242N300J3795P319j4833
$$ y = [19726, 6765, -22008, -33357, -39917, -50863, -51026, -43082, -23211, -19212, -32083, -40905, -44438, -51934, -42228, -15027, -14719, -22905, -24573, -29572, -32746, -25174, -7531, -8770, -1288, -2855, -3851, -12640, -27456, -50635, -33121, -32733, -52988, -40276, -41427, -43039, -49543, -41116, -18224, -174, 1381, 770, -9106, -15114, -20726, -29841, -19918, -24912, -22233, -18277, -8548, -4046, 6876, 8851, 14302, -1548, -1756, 5456, -15730, -19645, -28736, -20158, 1822, 12709, -3726, -18689, -31317, -39678, -38538, -33778, -26871, -39796, -56893, -23526, 15462, 20458, -2794, -18880, -20211, -19007, -21794, -14173, -18681, -18148, 783, 7501, 7364, -14798, -32153, -12225, -6005, 133, -4465, 860, 11702, 9382, 1821, 5079, 11109, 12168, 22174, 27756, 6881, 3717, 11401, -960, -15586, -14344, -9044, 4751, 12070, -2763]
5379b763L88K372R343L841k352P564K126J4307j6740j6288J0404p642M28l151
5365A837J9545J095o336l490k5708O844n483j1466l005Q893J2871J3254j6596
5352g745p080L486j5215j5763O78J8220j937M414N995J0162L127O187j4321n848
5338a5640M761R508q565o079N083Q409k274L49k369R665J1444o349N623J0433
5324B3999r648J5560K1205k6577j9554m512j4584N854L430q356j273k977m314
5311b1747J0747o517p51m961L300o973l133L98J8649L080J5778j590l0727j8209
5297d2656m021R985O403K660k6989J7119K2101Q826m966P636N461Q20M652m180
5283B851m779J379j1596Q994p241k0427M071J6096p468j885J4304Q319N8J19j0003
$$ y = [-2763, -2375, -3, 9340, 13181, 10829, 18393, 20519, 34826, 18086, 1798, 12202, 4560, 4988, 1837, 21382, 22477, 16141, 12651, -13057, -6213, -11696, -23162, -26167, -17274, -4403, 8851, -7745, -14825, -11339, -26554, -42317, -41639, -23419, -25356, -20942, -14947, -4785, -1658, 4529, -9792, -15640, -10879, -1371, -9936, -16015, -10932, -2523, -4797, -4448, -6817, 2848, 14292, 7943, 13566, 23999, 14351, 29911, 51116, 24539, 4985, 473, -14111, -8257, -4827, -13183, -14456, -17433, -21747, -11000, -17517, -18268, -23229, -19929, -26902, -30035, -29637, -10988, -7908, 7870, 6280, -24447, -42656, -46677, -36692, -30289, -27629, -54618, -37499, -15398, -6572, -11538, -3902, 1559, 2379, 7031, 2851, -1928, -549, -12145, -3151, -10392, -30819, -26748, -10652, -18120, -20005, -5701, 2618, 2676, 2795, -7208]
5268g208j3079J4095J1730J1220O343l0916j0122j8164K0206K9425J3272j4091
5256A2711j0471m474N583R163p214p509n727l477j2962n282J3835J8478r994n549
5242a2889j0992J7272M880r173K0885Q635l894L166k318Q59j2500j2534j0062
5229a8665q872o890o417J4314J4929R345m130j6342R236J0407J6576j0348j3362
5216a0219m223j19J4751J7002M322O402N295j8760q678N5O602N818n765k844r632
5201Go820n300r077j53J225J5050j816L230J5450o864o292J4998Q332j3966L323
5186A1327o156j3086p080O978j2501r212J3291J4461o424m117J74q472Q935P280
5172d602m657O144j1430k785L940p684N347R940J2609n804r199N381J4034l166
$$ y = [-7208, -20287, -6192, 5538, 16758, 23101, -7815, -17937, -36101, -15895, 13530, 26802, 12711, 2240, -2234, 3349, 12512, 5298, -2211, -7938, -11415, -24377, -29659, -15824, 2654, -7340, -12889, -23881, -6609, -1729, -10902, 9983, 18618, 14724, 17890, 15572, 16431, 3931, -8603, -18665, -27537, -34427, -40844, -26530, -11601, -2256, -6386, -22728, -13492, -3085, 13491, 3143, -10219, -14442, -14561, 190, 17192, 21514, 27916, 33211, 14451, 5773, 5828, 12430, 18248, 12483, 9639, 7, -6813, -12113, -21190, -21343, -20118, -5068, -6884, -3654, 11796, 4932, -1360, 13638, 21970, 8004, 11327, 5171, -7915, -14995, -8017, -20518, -29730, -16439, -1978, -8402, -12519, -12345, -20817, -11882, -4602, -9259, -3115, -14545, -17330, -13390, -21074, -15727, -5787, 6822, 1018, -8181, -2800, 11234, 8068]
5158H068j2949l802Q548J5353O31l323J0731j3588k0723q660k806P583P199J2678
5144D940j8036O253J0060K1300m592j4335j2339L479j127n992L440k73j752j066
5130a0040j0912j6882O169K5252k444n048J4515K5419Q138q577k2958k1016J0456
5117g928J607o159R627K2624k0383j2510N243L837J1414J8803n597m384j4632
5104A562M218p91o800N821k0984k281K80K0874K0596j917p254k79O679j5214Q37
5089E347O479p483j1820o984j0176k346J145n571K241J2983J372j0184n141J7483
5075a2655J0890j504l506l753K582n076J4424R164j3617m346n614R63J3147l126
5061b027j1666L824K3442Q098j708j2361M190l78P67j6109o983m734j5798k364
$$ y = [8068, -4881, -8683, -135, 15218, 15849, 12526, 23257, 9669, -11054, -19714, -22520, -14937, -7738, 4940, -13096, -6843, 3217, 24517, 19925, 5590, -6749, -3270, -4397, -10389, -6949, -7222, -8974, -10040, -20952, -37834, -31665, -6413, -8857, -13905, 610, 26029, 34167, 25590, 2632, -18384, -7928, -6321, -12480, -2853, 19771, -612, -13122, -7879, -4042, 7372, 26175, 20578, 16194, 1562, 5780, 4989, -1811, 4010, -16974, -19255, -18975, 1899, 22495, 20578, 13324, 13045, 19724, 4510, 5347, 11826, 4343, -7477, -14461, -24637, -26983, -25838, -31409, -29168, -16185, -14813, -24997, -30138, -12655, -1765, -3269, -6775, -10528, -7946, -13022, 1402, 10566, -3051, -7397, -13011, -12048, 1099, -2027, -13693, -9869, 13573, 21671, 19963, 7602, 11792, 11414, 12181, -3928, -10911, -15645, -31443, -33807]
5047c3807J0868m649Q23J4092q705k367n148n740r974l36O688J4122N242N09L485
5032a4897k3190P101P761j322J782q896P105o425P557j598K1075R519J217L167
5018I956j3773J1734o894j1337j6772O96J3558K1953L697L293j0857j0633N756
5005C77Q456j8886R255J2726J5955L303k874n676L009j8378k077M78L610n610
4991C668P931n206k5232j5794J6721J7420J5590J208q501P406j7641n404j6802
4978b4636q46J1491Q960Q858J1390J0013k056j5131j7483J4538R981n892o091
4965C096j1260k1596P329K2343N667r378o446j2254L672J0950N814j790j4j445
4951e312j1247m764J5072N367j2439P538P102j0382n801P394m332j136R31J735
$$ y = [-33807, -22939, -27588, -26765, -12673, -21378, -23745, -28893, -34633, -44607, -44943, -38255, -24133, -18891, -18382, -14897, -38087, -30986, -23225, -24547, -22765, -31661, -24556, -30981, -23424, -25022, -3947, 5572, 6789, 9956, -3817, 7917, 1023, -10314, -27086, -26390, -12832, 9121, 12818, 16111, 5254, -5379, 377, 8833, -10053, -798, 11928, 27883, 31186, 28312, 22636, 25645, 7267, 5190, 5668, 9278, 3668, 11599, 6393, -18839, -34633, -17912, -492, 15098, 16306, 7805, 15211, -2430, -7834, -24636, -25482, -13991, -5031, 3827, 15217, 25230, 23174, 8043, -9440, 5098, 15079, 9187, 3096, -8164, -29760, -22431, -88, 5579, -3799, -10245, -22499, -18827, -7877, -2063, -3853, -3867, -5312, -16559, -21323, -6251, -884, -13323, -5785, 1317, -9065, -14866, -7472, -11804, -12940, -12009, -10274]
4937a0274l808N54j1505k265K4694j853K674L51N696J6301P13k2707j8463J3824
4923f068k304m047k554J092j372J8752J1090J2170q517r319o220n707L913r619
4909h710l947P023J9071m96j5503n445o039k54Q92J0754q075k928K3349J056j1761
4894a013J3459p523K415J6968k296p54o971J172P973O925Q685j6807j2230j0911
4880i08j1058R29J3952K6656K4686j8144k6445j181j2543j371N03N777J5172n113
4866A0912j4261p729M456o134r952M772J295J6184O22r261J4354P271r504j3825
4852a0800r416J5711m77m488J1563K974m768K9036R097k1919k4314r873k601p75
4838b1050M047Q91J0100j134M14P216J049N52L942j0122Q466O211j3219k73J4508
$$ y = [-10274, -14082, -13528, -25033, -27298, -2604, -4457, -1783, -1432, 4264, 20565, 21278, -1429, -19892, -6068, -8372, -12419, -14973, -13881, -15253, 3499, 14589, 26759, 18242, 8923, 2703, -3004, 909, -8710, -12657, -5634, 13437, 12941, -2562, -8007, -14046, -14300, -13408, -2654, -10729, -13657, 9692, 10748, -1013, 12446, 4923, 7338, 24306, 22010, 21256, 14285, 15457, 23430, 30355, 39040, 22233, 10003, -908, -11966, -11037, 2915, 29571, 54257, 36113, 9668, 8487, -4056, -5427, -4924, 853, 16025, 10912, -3349, -11078, -6622, -12756, -22708, -17936, -16641, -457, 165, -9096, 5258, 12529, 3025, -10800, -20216, -4505, -4982, -9470, 2093, 5067, 299, 29335, 38432, 16513, -7801, -17674, -20275, -21050, -17003, -16112, -6012, -7146, -6732, 484, 1533, 2085, 6027, -4095, 4371, 10582, -2637, -2910, 11598]
4823A1598J61q969k905L002j5499J9399K6764j1425k8236J2072R680m714j4640
4810c712J4120R553j3014k3421j7057J9300J2240n877m470K243J1301k73q352
4797g419j5379N245Q447Q697J9196o136o439J590n296j929j431o832r017L181
4783a3522K358j0521r215N458k725K3963J1132J2254Q88M264J591O648j8947j6077
4769b451L667J9268r978r636P061m712L542L106n269J1373j71p747j6513M550
4755c910J3834L314l251p013J84N812k655j2565J88L598j705Q332R510K403n572
4740A0504R377j032j7843q977K427J9198L884p98p75l1303j5965M209J5613K6031
4726A4550M809k3145j5475p01k236K193R763n063j8794j136J1602j8105K403n352
$$ y = [11598, 11759, 2790, -115, 2887, -12612, 6787, 33551, 22126, -6110, 5962, 15642, 10928, -3712, 10408, 19961, 6947, -16474, -33531, -14231, -1991, -7868, -12338, -10095, 1206, 933, -7419, -22798, -17553, -9106, -409, 18787, 12651, 6212, 7802, 2506, 577, -854, -7686, -16703, -13522, -11164, -21685, -30900, -25442, -28167, -4204, 6928, 19182, 20070, 24334, 25925, 32573, 13626, -2451, 1216, 20484, 10506, 870, 7931, 3219, 6761, 9867, 4598, 15971, 15800, 8053, -8460, -3910, 9924, 13238, 9987, 2974, 3158, 8970, 6315, -6250, -6062, -2464, -4169, 4163, 13673, 16076, 10504, 19881, 18849, 1006, -7971, -5544, 13654, 17538, 16740, 15965, -15338, -31303, -27094, -11481, 14550, 19359, -3786, -19261, -19962, -22198, -20005, -10242, -15305, -34099, -35235, -23633, -41738, -39335, -44687]
4712d4687n903k932L511K0768J5982J5514P021o041P903j9923p117P978K129Q679
4698B882j9648k1362R09m921J8388J16m810K5862J6241r625j7002J9155J2942
4685A9127Q499j0172q195J77l867k3295n344p068J6824J441j2729M159l278n513
4671b9234K4067R550K141j0412j2551J0344j996J747j3376q53K1073O070O094
4658A2664j1345j8958K031J1137O1m188o486J3252K0049o297l387J0420j883j703
4644A5367k390j8345j0649j3344j353O031O45l766J9736K7482j4880j9111k398
4631a6975Q574M583K1047L818j5181K089k912k001m150M390r840q089l52J7788
4617B789r33k470r371M323J890J5757j2744j4465j92J3414J5485j554j9705K763
$$ y = [-44687, -50590, -53522, -50011, -29243, -13261, 2253, 9274, 3233, 11136, -8787, -15904, -7926, -5797, 2882, -16766, -38128, -37219, -42140, -23752, -23636, -28446, -2584, 13657, 4032, -12970, 6185, 19127, 27626, 17454, 9259, 9436, 5569, -17726, -23070, -30138, -13314, -11873, -24602, -20443, -23721, -29234, -5167, 4383, 6524, -3888, -16439, -6095, -8091, -6344, -19720, -20573, 500, 6570, 12664, 1319, -17639, -15608, -4471, -4410, -8598, -15084, -1832, 18217, 11920, 8533, 18953, 17070, 15367, 12977, -5368, -16017, -29361, -30714, -24683, -24038, -27804, -8068, 19414, 4534, -14577, -16975, -8401, -3818, 17229, 21047, 5866, 7955, 5043, 3042, -1108, 3282, -6558, -14647, -14999, 2789, 1856, -614, -9985, -5662, -3772, 11985, -759, -15224, -15416, -2002, 13483, 11929, -7776, -5013]
4603e013r643j7585R344R916R79o826o499O7J5907Q931O003k516K2170J2673j3694
4588B4214M911J7403n854J1394n437k4332r120M916j5563J968R070n090j692j820
4574D968K784J3998J6875m909j311l933j6844J3612k475r935m137J079K144j4234
4560b318j791L515j0497j6491J1281K5801J5985p181q530L360n942j5581k088
4547a0477K711k516j9529P409J2307J2817O018r833j3442J2710Q388J3759j076
4534A9246r85j9341m560m903q639k2866J2573O133j873J9074o964l512N164n366
4520a6819k467n11P979L13L051l880J0742J2863K353j2154L935k2589k4488J4337
4506b7335J9561M832N009r168p017M68l148r14P267J2702L782o831J2378j921
$$ y = [-5013, -14656, -32241, -22897, -12981, -12002, -18828, -25327, -25260, -9353, -422, 5581, 3065, 25235, 37908, 24214, 29125, 46528, 40674, 52068, 46631, 22299, 13179, 18095, 2532, 4500, 13570, 8480, 6788, 4968, 7752, 21750, 38625, 33716, 32405, 28472, 11628, 25240, 22765, 12830, 8693, 9772, 11916, -2318, -4109, -594, -11091, -27582, -16301, 9500, 25485, 18304, 9774, 13134, 7192, -8389, -10477, -7766, -10282, -29811, -22402, -10095, 2722, 8740, -1093, -14535, -1825, 6563, 20322, 19246, 18261, -1080, -5640, -10543, -19182, -42048, -29475, -23342, -25215, -6141, -13105, -16617, -11453, -16819, -19286, -19797, -11818, -11505, -8454, -12334, -1592, 11271, 13624, 1470, 5405, -17184, -41672, -27335, -7774, -2942, 2067, -7101, -14118, -13650, -16798, -17712, -10445, 2257, 6039, -792, 11586, 9665]
4492I665j3755p520N67K491o853K300N829L514j029j1333J7555m394j1875J167
4478a3671K766m436K275K26j9001n077J3163J5958O408q230J224j0994j487K78
4464b0598o18n668J2182J0405J3775Q412l25k7332k2360N890J9314J9669J621
4451A4367M587J2019m451k2753j1521n453j0939n048J0228J3182j50J059L244
4438a629j1867n03J2622K3645k183L647r906j4370K345m228m232O908l023Q095
4424E321Q230l891m059q21k713j3044M383J5486o909p951o410j5377q855J6462
4410b0148J6878J5019j1121k1766O148P965P148K132M711N081o725j2695l511
4397a0884J13j2779O55n894P844J8392M036N388p91P91N896k353j5916J2524o606
$$ y = [9665, -4090, -11610, -11043, -8552, -15405, -13105, -7276, -3762, -4791, -16124, 1431, -2963, -14838, -13671, -10905, -15341, -13066, -12840, -31841, -36918, -23755, -7797, -1389, -9619, -8395, -19389, -20876, -20598, -21216, -26884, -14702, -4297, 9478, 17890, 17565, -9767, -32127, -26237, -6923, 12746, 14367, 18954, 30973, 26522, 3769, -7752, -13205, -24144, -29192, -18964, -5782, -5932, -4873, -1629, -13496, -13999, -1377, 22268, 20085, 23732, 13826, -544, 1801, -2427, -6659, 249, -2774, 5321, 13551, 9660, 5601, 4780, 2067, -10977, -6594, 8892, 1983, -5968, -12378, -27755, -36610, -20148, -3270, 11749, 628, -21138, -14990, -7025, 123, 2255, 6966, 12047, 5322, -7373, -10884, -10771, -23550, -22895, -28789, -20945, -2553, 1483, 6871, 6080, 6871, 12767, 10414, -5502, 7022, 416]
4382D16m901J1538O92p242k3073J0043N125o313p261j0652j0326N407J3J1200
4368b5334O35R866P143J121J3544J2113j0990j104r794k8815J619J0949q351J0073
4354a7325J8146o961k7625M028J9582M248k336j3658n143n37R927j2960j1305
4341d1919J9851N095j0952l757O486J475k086L033p370l861J0063K6876L663l951
4327B646m21m852j0495n67J1324P725p492J3176Q562j0076j7891K362J3863K99
$$ y = [416, -4485, 7053, 7745, 503, -22570, -12527, -7402, -13715, -20976, -31628, -41954, -36547, -36534, -25334, -24699, -14833, -7690, -6569, 6975, 19088, 8098, 6994, -2800, -31615, -29996, -19047, -27398, -17325, 821, -6140, -33765, -29737, -10155, -5907, -8243, -21901, -27044, -27581, -17654, -30614, -41919, -22068, -16973, -27925, -31682, -25196, -23721, -25807, -22774, -30144, -34005, -23942, 2934, 6597, 2646, 2225, -2627, -13122, -13689, -2365, 5360, -2132, 11044, 19606, 9530, -8361, -5999, 7864, 8163]
$$ [...]
##END NTUPLES=NMR SPECTRUM
##END=
