##TITLE=Analysis number 307263
Compound Code cc 21752
Book Reference 332/196
Project Code adrs
Chemist Name craigr
##JCAMPDX= 6.0         $$ Bruker NMR JCAMP-DX V2.0
##DATA TYPE= NMR SPECTRUM
##DATA CLASS= NTUPLES
##ORIGIN= Bruker BioSpin GmbH
##OWNER= NMR
$$ XWIN-NMR		Version 3.5
$$ Fri Apr 29 11:30:22 2005 GMT Daylight Time (UT+1h)  MAYBRIDGE\NMR@NMR_250MHZ
##.OBSERVE FREQUENCY= 250.131544655141
##.OBSERVE NUCLEUS= ^1H
##.ACQUISITION MODE= SIMULTANEOUS (DQD)
##.ACQUISITION SCHEME= undefined
##.AVERAGES= 16
##.DIGITISER RES= 18
##SPECTROMETER/DATA SYSTEM= dpx250
##.PULSE SEQUENCE= zg30
##.SOLVENT NAME= DMSO
##.SHIFT REFERENCE= (INTERNAL, DMSO, 0, 16.522)
##AUDIT TRAIL= $$ (NUMBER, WHEN, WHO, WHERE, WHAT)
$$ ##TITLE= Audit trail, XWIN-NMR		Version 3.5
$$ ##JCAMPDX= 5.01
$$ ##ORIGIN= Bruker BioSpin GmbH
$$ ##OWNER= NMR
$$ C:\u/data/dgb/nmr/ADRS/2570/pdata/1/auditp.txt
$$ ##AUDIT TRAIL=  $$ (NUMBER, WHEN, WHO, WHERE, WHAT)
(   1,<2005-04-29 11:30:00.49 +100>,<MAYBRIDGE\NMR>,<NMR_250MHZ>,
      <created by zg, POWCHK disabled, PULCHK disabled
       configuration hash MD5:
       62 19 C7 07 E1 42 D1 B7 37 6C 3D D0 77 39 F9 E6
       data hash MD5: 64K
       B7 9D 6D 1C D8 A6 1A 31 01 93 68 10 10 6B 67 F2>)
(   2,<2005-04-29 11:30:11.88 +100>,<MAYBRIDGE\NMR>,<NMR_250MHZ>,
      <Start of raw data processing
       ef LB = 0.3 FT_mod = 6 PKNL = 1 SI = 32K 
       data hash MD5: 32K
       DE A3 19 96 3E 31 02 AF EE 89 DC C7 E2 D8 CA 78>)
(   3,<2005-04-29 11:30:13.56 +100>,<MAYBRIDGE\NMR>,<NMR_250MHZ>,
      <apk 
       data hash MD5: 32K
       05 BF 93 4B 99 F8 CF 6F DD F5 18 73 0E 6C F6 32>)
(   4,<2005-04-29 11:30:14.27 +100>,<MAYBRIDGE\NMR>,<NMR_250MHZ>,
      <abs ABSG = 5 
       data hash MD5: 32K
       CC 2C 56 B9 4E 0A 9C F5 B2 65 F0 60 E5 9A CF 13>)
$$ ##END=
$$ 
$$ hash MD5
$$ 38 CA 0F F4 DF A6 29 2B C7 7B 9D 42 9A D1 66 0D
##$RELAX= 
##$RELAX= 
##$RELAX= 
##$RELAX= 
##$RELAX= 
##$RELAX= 
##$RELAX= 
$$ Bruker specific parameters
$$ --------------------------
##$DU= <C:\u>
##$EXPNO= 2570
##$NAME= <ADRS>
##$PROCNO= 1
##$TYPE= <nmr>
##$USER= <dgb>
##$AMP= (0..31)
100 100 100 100 100 100 100 100 100 100 100 100 100 100 100 100 100 100 
100 100 100 100 100 100 100 100 100 100 100 100 100 100 
##$AQSEQ= 0
##$AQ_mod= 3
##$AUNM= <au_zg>
##$AUTOPOS= <20 >
##$BF1= 250.13
##$BF2= 250.13
##$BF3= 250.13
##$BF4= 250.13
##$BF5= 500.13
##$BF6= 500.13
##$BF7= 500.13
##$BF8= 500.13
##$BYTORDA= 1
##$CFDGTYP= 0
##$CFRGTYP= 5
##$CHEMSTR= <none>
##$CNST= (0..31)
1 1 145 1 1 1 1 1 1 1 1 1 1 1 1 1 1 1 1 1 1 1 1 1 1 1 1 1 1 1 1 1 
##$CPDPRG= <>
##$CPDPRG1= <>
##$CPDPRG2= <>
##$CPDPRG3= <>
##$CPDPRG4= <mlev>
##$CPDPRG5= <mlev>
##$CPDPRG6= <mlev>
##$CPDPRG7= <mlev>
##$CPDPRG8= <mlev>
##$CPDPRGB= <>
##$CPDPRGT= <>
##$D= (0..31)
0 1 0 0 0 0 0 0 0 0.06 0 0 0 0 0 0 0.0002 0 0 0 0 0 0 0 0 0 0 0 0 0 0 
0 
##$DATE= 1114770599
##$DBL= (0..7)
120 120 120 120 120 120 120 120 
##$DBP= (0..7)
150 150 150 150 150 150 150 150 
##$DBP07= 0
##$DBPNAM0= <>
##$DBPNAM1= <>
$$ [...]
##$SUBNAM7= <"">
##$SUBNAM8= <"">
##$SUBNAM9= <"">
##$SW= 20.6930455092707
##$SWIBOX= (0..15)
0 0 3 0 0 0 0 0 0 0 0 0 0 0 0 0 
##$SW_h= 5175.983436853
##$TD= 65536
##$TD0= 1
##$TE= 295.16
##$TE2= 300
##$TE3= 300
##$TEG= 300
##$TL= (0..7)
0 120 120 120 120 120 120 120 
##$TP= (0..7)
150 150 150 150 150 150 150 150 
##$TP07= 0
##$TPNAME0= <>
##$TPNAME1= <>
##$TPNAME2= <>
##$TPNAME3= <>
##$TPNAME4= <>
##$TPNAME5= <>
##$TPNAME6= <>
##$TPNAME7= <>
##$TPOAL= (0..7)
0.5 0.5 0.5 0.5 0.5 0.5 0.5 0.5 
##$TPOFFS= (0..7)
0 0 0 0 0 0 0 0 
##$TUNHIN= 0
##$TUNHOUT= 0
##$TUNXOUT= 0
##$USERA1= <user>
##$USERA2= <user>
##$USERA3= <user>
##$USERA4= <user>
##$USERA5= <user>
##$V9= 5
##$VALIST= <valist>
##$VCLIST= <CCCCCCCCCCCCCCC>
##$VD= 0
##$VDLIST= <DDDDDDDDDDDDDDD>
##$VPLIST= <PPPPPPPPPPPPPPP>
##$VTLIST= <TTTTTTTTTTTTTTT>
##$WBST= 1024
##$WBSW= 4
##$XGAIN= (0..3)
0 0 0 0 
##$XL= 0
##$YL= 0
##$YMAX_a= 298746
##$YMIN_a= -219762
##$ZGOPTNS= <>
##$ZL1= 120
##$ZL2= 120
##$ZL3= 120
##$ZL4= 120
##$ABSF1= 16.522
##$ABSF2= -4.171173
##$ABSG= 5
##$ABSL= 3
##$ALPHA= 0
##$AQORDER= 0
##$ASSFAC= 0
##$ASSFACI= 0
##$ASSFACX= 0
##$ASSWID= 0
##$AUNMP= <proc_1d>
##$AZFE= 0.1
##$AZFW= 0.1
##$BCFW= 0
##$BC_mod= 0
##$BYTORDP= 0
##$COROFFS= 0
##$CY= 12.5
##$DATMOD= 1
##$DC= 0
##$DFILT= <>
##$DTYPP= 0
##$F1P= 14.0000005364418
##$F2P= -0.99999901652339
##$FCOR= 0.5
##$FTSIZE= 32768
##$FT_mod= 6
##$GAMMA= 0
##$GB= 0
##$INTBC= 1
##$INTSCL= 1
##$ISEN= 128
##$LB= 0.3
##$LEV0= 0
##$LPBIN= 0
##$MAXI= 10000
##$MC2= 0
##$MEAN= 0
##$ME_mod= 0
##$MI= 0
##$NCOEF= 0
##$NC_proc= -4
##$NLEV= 6
##$NOISF1= 0
##$NOISF2= 0
##$NSP= 0
##$NTH_PI= 0
##$NZP= 0
##$OFFSET= 16.522
##$PC= 1
##$PHC0= -78.01292
##$PHC1= 1.140474
##$PH_mod= 1
##$PKNL= yes
##$PPARMOD= 0
##$PSCAL= 4
##$PSIGN= 0
##$REVERSE= no
##$SF= 250.13
##$SI= 32768
##$SIGF1= 0
##$SIGF2= 0
##$SINO= 400
##$SIOLD= 32768
##$SREGLST= <1H.DMSO>
##$SSB= 0
##$STSI= 32768
##$STSR= 0
##$SW_p= 5175.98343685301
##$SYMM= 0
##$S_DEV= 0
##$TDeff= 65536
##$TDoff= 0
##$TI= <Analysis number 999999
Compound Code 99
Book Reference 9
Project Code 9>
##$TILT= no
##$TM1= 0
##$TM2= 0
##$TOPLEV= 0
##$USERP1= <user>
##$USERP2= <user>
##$USERP3= <user>
##$USERP4= <user>
##$USERP5= <user>
##$WDW= 1
##$XDIM= 32768
##$YMAX_p= 346644359
##$YMIN_p= -508402
$$ End of Bruker specific parameters
$$ ---------------------------------
##NTUPLES= NMR SPECTRUM
##VAR_NAME=  FREQUENCY,     SPECTRUM/REAL,   SPECTRUM/IMAG
##SYMBOL=    X,             R,               I
##VAR_TYPE=  INDEPENDENT,   DEPENDENT,       DEPENDENT
##VAR_FORM=  AFFN,          ASDF,            ASDF
##VAR_DIM=   32768,         32768,           32768
##UNITS=     HZ,            ARBITRARY UNITS, ARBITRARY UNITS
##FACTOR=    0.157963299565203, 1,           1
##FIRST=     4132.6476996994, 0,             0
##LAST=      -1043.33573715361, 0,           0
##MIN=       -1043.33573715361, -508402,     0
##MAX=       4132.6476996994, 346644359,     0
$$ Real data points
##PAGE= N=1
##DATA TABLE= (X++(R..R)), XYDATA
$$ [...]
16492b44077j6260N4826k1163l1593J41563L3743j4396K264L7191K8912j0525
16481c9515O9015O4676K3369j94816k6740P2036k0292r7427K1231k0082J6807
16470a31738J2730M6238K4252J8652L1956M0788q37n1238p404O0930P9489q0434
16458D3384o0184p598l5811K1018l3838m9799m5003J1649J6919O9926L8771j21246
16446a51812L2190Q0436L0519J23397j7342j21197j13924j616l8300m0766N0137
16435a68278n2724K0390N9540L9608L5453L5321n412j18640j13341K5499J67476
16424g5108J42154L4947p5463n8300K3462j0786p5123j06281j9877L5949P6769
16413a07657R8259j1185j8663Q9608O1129q0748j45658K4933K3846M1267O5151
$$ y = [-244077, -260337, -205511, -226674, -258267, -116704, -82961, -97357, -95093, -57902, -28990, -39515, 29500, 94176, 117545, -77271, -104011, -31975, -52267, -149694, -128463, -148545, -131738, -119008, -72770, -48518, -29866, 2090, 42878, 42041, -9197, -16601, 44329, 123818, 43384, -16800, -24398, -60209, -39191, -73029, -122828, -167831, -156182, -139263, -69337, -30566, -151812, -119622, -39186, -8667, 114730, 97388, -23809, -137733, -139349, -177649, -218415, -168278, -221002, -200612, -141072, -101464, -66011, -30690, -36102, -154742, -268083, -242584, -75108, 67046, 101993, 26530, -31770, -8308, -19094, -94217, -200498, -220375, -184426, -107657, -9398, -20583, -39246, 50362, 111491, 30743, -114915, -89982, -66136, -24869, 40282]
16402D0282K4885k6772q6053o5809k5395j9014l0982n7737P7666j2778P6239Q3257
16390b2211n9326K846J8165R933n5620k7697J13926L6627p4524o6656O119M863
16378a13555j2733j4783M4582O4653l1816k41Q146m87J9345J00820p167n3775
16366B989K9742N8q3122J3364R254k2048q874j563J980j4922K0175O1833R7072
16353A05938K0922m9336m6893J3819o001k7742N3600n1774o1783l8461j1753k254
16341a01718M4754M1390n87J5536l872K379m2456j26399l1491O6876M6343J3864
16329g5381j6359m1525k4258L6752j3463n3730K0640j0082O7339M9440K4108q9955
16317a26474j7650P4634O5994K7464M1842M4218M3645j6871n1752N438l6037k9933
$$ y = [40282, 65167, 38395, -47658, -113467, -138862, -157876, -188858, -246595, -168929, -181707, -105468, -22211, -81537, -78691, -60526, -50593, -106213, -133910, -19984, 16643, -57881, -124537, -118418, -113555, -126288, -141071, -96489, -31836, -63652, -63893, -55747, -56234, -36889, 63931, 56764, 2989, 32731, 32789, -50333, -36969, -27715, -49763, -58637, -60200, -58220, -73142, -52967, 8866, 105938, 126860, 77524, 30631, 44450, 38449, 10707, 64307, 12533, -49250, -87711, -99464, -101718, -56964, -15574, -16161, -625, -4497, -2118, -44574, -170973, -202464, -135588, -89245, -75381, -91740, -133265, -157523, -120771, -134234, -187964, -167324, -177406, -110067, -60627, -36519, -126474, -144124, -69490, -3496, 23968, 65810, 110028, 153673, 136802, 85050, 90488, 54451, 24518]
16305B4518j8212l4105k0783o6742P0916k0321r2820n1331Q1404O3229L8826P570
16293a7851n1729M0168J07481M3464o4373j09541L6832k5955N0239k2171J7336
16282C900O178l4419j12510p8846O0052J12295L0538N2167m968o0317j7209Q9699
16270D6560n8621j06611j11123n7879P2844Q9888L1122m2900r005q21O367r1374
16258b31553L4907J24169N5213K6326j11518j8591j1885R5507K7687l8903J377
16247d7264p1370p0866N6169J78974K9384p7579o4623J1497P1179j4237N514J03724
16235A10502M7367p5902r4745l6594M3650K936n7833m8393L6222j6245l0904J7693
16223a02246o0740O8727O1540o5304J08933j6842K7498N6599m5297k8125j7022
$$ y = [24518, 6306, -27799, -48582, -115324, -44408, -64729, -157549, -208880, -127476, -64247, -25421, -17851, -69580, -29412, 78069, 121533, 57160, -52381, -15549, -41504, 8735, -13436, 3900, 10078, -24341, -136851, -215697, -155645, -43350, -12812, 39355, 34387, -25930, -43139, 46560, -12061, -118672, -229795, -287674, -214830, -124942, -93820, -136720, -145725, -146546, -140179, -231553, -196646, -72477, -17264, 9062, -102456, -121047, -132932, -37425, -9738, -48641, -47264, -118634, -189500, -133331, 45643, 75027, -2552, -67175, -55678, 15501, 1264, 6778, 110502, 157869, 81967, -12778, -49372, -5722, -2786, -60619, -109012, -72790, -89035, -119939, -102246, -162986, -94259, -32719, -98023, 10910, -5932, 21566, 78165, 32868, 4743, -12279]
16212a2279K3834k5321K8801K8317l7143o8709l1042J06750O8040j43504j6411
16201g8667j1300M3537p0723j50249p0915O8114K21030N9748j12043K3302j913
16190h0079m3384R4267L5876J6919o1706m7695n3278q155R8027l0675m5408N8487
16178f6804L2417J3953p0872M6932J01906p1624l4749N6839l3919r4923m3289
16167a64133K2609j2969O5251J24073J5414n9990j30453r436O1769P9866Q1879
16156G3880N0519j29126j43169m0195M4848o725N1793N7933l9142O6580M9372
16145C6568O967k474J0603j920o6253m0634L4326o8761j8359m0787Q8469J00038
16133C7783k0386l9205j3097p6258k0644J2794r0729j5011O8653L8829O2791J201
$$ y = [-12279, 11555, -13766, 15035, 43352, 6209, -62500, -93542, 13208, 81248, -62256, -78667, -89967, -46430, -117153, -267402, -338317, -270203, -49173, 10575, -101468, -78166, -80079, -123463, -29196, 6680, 23599, -38107, -85802, -139080, -147235, -49208, -79883, -125291, -66804, -34387, -20434, -91306, -44374, 57532, -14092, -48841, 7998, -25921, -120844, -164133, -141524, -154493, -89242, 34831, 50245, -9745, -140198, -149634, -87865, -7999, 73880, 124399, -4727, -147896, -188091, -143243, -149968, -98175, -40242, -79384, -12804, 36568, 43535, 41061, 51664, 49744, -16509, -57143, -22817, -91578, -109937, -150724, -62255, 37783, 17397, -21808, -34905, -111163, -131807, -119013, -209742, -224753, -156100, -117271, -54480, -53279]
16121e3279j65165k7427M8651k578K6805J41067M6163n7329j13299r451R5241
16110g0601M8268l4732l6604l1807P7896M6791M8124m1884n1810M7647O6587J5940
16098H3815j7706l6540p6759o7926p0298p5385m5173P0810J03644M317L1345R345
16086h6511j1820m1360r931L077L1241m204J7063K9613m5039P9549K0444j0886
16074b8764J5287q0807m9237P5643l3077m4721K6957R8k8214R2890O971Q6277
16062C9303Q6695Q214M6858k5242o4240n6911j9248k7304O7012q4772j05345k9208
16050a64188N2526N9324J3646m1807o613N657J112O0639L5430P1262M8766j894
16038A33860k5627n8429j22252k6822N2431R0024M380J2247K4464P675j4936l0287
$$ y = [-53279, -218444, -245871, -197220, -199798, -172993, -31926, 14237, -43092, -156391, -165842, -70601, -22333, -57065, -93669, -125476, -47580, -789, 47335, 5451, -46359, 1288, 67875, 83815, 66109, 29569, -47190, -115116, -185414, -260799, -305972, -235162, -131518, -127201, -95856, -86511, -98331, -139691, -149622, -146545, -115304, -119508, -102445, -72832, -117871, -38322, -17878, -28764, -13477, -94284, -143521, -67878, -100955, -145676, -118719, -118621, -146835, -53945, -46974, 39303, 125998, 134212, 181070, 155828, 91588, 34677, 15429, -11875, 55137, -29635, -134980, -164188, -111662, -52338, -38692, -80499, -87112, -81455, -80343, -19704, 15726, 86988, 135754, 133860, 108233, 49804, -72448, -99270, -46839, 43185, 47565, 59812, 84276, 91951, 77015, 46728]
16026D6728j17501l4798o33J27186J25998q2424J3445j4307o1565r1062J305M1424
16014d6204P0016P896L4138K8461K1748m4088L8790j6259R556o9507N437M5134
16002H5118j25551j57538N5386J20421J20965N7174j7326L06j03923l9887M6531
15991D1676J5447j8588l253L5538P3017m2441k7974k073m2474k7297l1487k7981
15979e7890J3197P5445L1249K7373k214j28098q8333R8348M6953n175m1074l2387
15967f2606Q1071M1555n0589K1396R3678r223J3634O9381K2999m0141m3218p2877
15955F5060p267j1127r4066j3742J45247N730n2118M6979P6065o1560J5350j4246
15943A00305K975j13051m0079J8190p258K7710N7220r3484j3762O4398m454M1168
$$ y = [46728, -70773, -105571, -106204, 20982, 146980, 64556, 78001, 63694, 2129, -88933, -87628, -46204, 23812, 31708, 65846, 94307, 116055, 71967, 110757, 94498, 104054, 34547, 39984, 85118, -40433, -197971, -142585, -22164, 98801, 155975, 138649, 138955, 35032, -4855, 41676, 57123, 38535, 35282, 70820, 143837, 101396, 73422, 71349, 28875, 1578, -29909, -57890, -44693, 30752, 62001, 89374, 87160, -40938, -129271, -30923, 16030, 10855, -30219, -62606, 18465, 60020, 9431, 30827, 124505, 115282, 128916, 198297, 221296, 181155, 137937, 65060, 57793, 46666, -47400, -61142, 84105, 89835, 37717, 84696, 160761, 99201, 114551, 100305, 103280, -9771, -49850, -31660, -38918, -11208, 46012, -47472, -61234, 3164, -1290, 39878]
15931C9878M8566m4848j29315o3825M7516J11261P5243j4266p3984j14590P5019
15920d3345M4803L9759p4373j06975K9232j9520N9234J09833q815n011l0086o4799
15908g0063p2034K2190J01443k5650J3468P2399m8910o1118m4674p4363K7028
15897a60284J40308O2265k0046l5277p925L8615O1220M3752K3410L853J0847k0629
15885A40109q101l9893j6129K3383p7655Q52K3637n5021o1094n982Q802K2532
15873d4560q469J704K8759K4082o6783q5868L2805J18290J01630n2754J8787o4620
15861C003p6164R365O215P8122p2843k891L8514K7709j6728n5238j9570J0564
15849f9942P2553n5419L7929p3951L0438p3582k539m8083J2121Q943P5311R0832
$$ y = [39878, 88444, 43596, -85719, -149544, -102028, 9233, 84476, 70210, -3774, -118364, -43345, 1458, 41217, -33156, -140131, -110899, -130419, -71185, 38648, 29833, 24822, -5264, -70063, -142097, -119907, -18464, -44114, -30646, 41753, -7157, -68275, -112949, -187312, -160284, -19976, 42289, 22243, -13034, -20959, 17656, 78876, 122628, 146038, 149891, 160738, 140109, 132008, 92115, 75986, 99369, 21714, 22566, 46203, -8818, -69912, -75894, -67092, -44560, -53029, -51325, -22566, 1516, -65267, -151135, -118330, -40, 101590, 48836, 67623, 3003, -73161, -63796, -57581, 20541, -52302, -55193, -16679, 11030, -5698, -60936, -80506, -69942, 2611, -52808, -14879, -88830, -58392, -131974, -134513, -182596, -170475, -161532, -86221, 4611]
15837D611J38768j04451n3071o5760r2300j8636M6595N5695R8283n9336o6297
15826a15899L7866P4471L7389O264N8834o415j61606o4581n8113K902R2316J5712
15814h0860j6748j3379r3779Q6821P7257P5392N2054Q9182N3311J6676j59439
15803H6488o6075L6263m6524N7408o4255o985L1645j3714l608m0812p1964K0975
15791h1158N5205J12108L2152p7496M8770o7769M9014L8604n053k2775o0760o1773
15779d0931l9450N7994O4045K0535m1739j01844J08421J04505J6590l3041J6633
15768A31718l6964n2881p1050j449p982K7964O2519P6614p4701J7440L8432m0656
15756F9004L9357k0490o6796J64o5988n6393j5969J2566J46942l6849l6532L0083
$$ y = [4611, 143379, 38928, -14143, -79903, -172203, -190839, -144244, -88549, 9734, -49602, -115899, -78033, -3562, 33827, 40091, 98925, 92510, -69096, -133677, -191790, -188888, -96572, -80860, -97608, -110987, -204766, -117945, -40688, 34704, 86758, 175940, 229251, 245927, 86488, 20413, 56676, 10152, 67560, 3305, -3680, 27965, 14251, 10643, -30169, -102133, -81158, -25953, 86155, 118307, 40811, 89581, 21812, 70826, 109430, 104377, 81602, 20842, -40931, -80381, -22387, 41658, 62193, 20454, -81390, 27031, 131536, 148126, 115085, 131718, 94754, 41873, -29177, -30626, -38608, -10644, 51875, 128489, 53788, 71228, 109660, 69004, 108361, 87871, 21075, 21239, -44749, -101142, -117111, -104545, 42397, 5548, -30984, -901]
15744i01k7834K4975l0836n1204k5996n53R3330R0154P8318J2105J7579o6222
15732A12915j55490j8844N6826L9971p214P1085o7208L9995R1672j15074k479
15721D6155J4366n0186n2532q060p39J9818P5197L8497J445l144O3478N132R02
15708A50329j06466l5091N0431k0851p5681j08926k0845l3479J6232O7436k2961
15697a39872o5579R8816Q6622J6019m1791q9141q874J49534J35904j3044r1167
15686C7427j32859Q3760M0988K5713L2454p7714L3641P5898j9321o9081n2718
15675b1812r944L2519l6225j02635p404o3189k0419J6299j461J0368O4864L9621
15663i9418L6545l3216O0938N586q4773j0460J8Q9714L5448K101K4509O3801K5611
$$ y = [-901, -28735, -3760, -34596, -85800, -111796, -112349, -19019, 71135, 149453, 161558, 179137, 112915, -42575, -61419, -4593, 35378, 28164, 99249, 32041, 72036, 163708, 48634, 46155, 60521, 10335, -42197, -50257, -50996, -31178, 44019, 82516, 83961, 80817, 144295, 149427, 150329, 43863, 8772, 59203, 38352, -37329, -146255, -167100, -200579, -184347, -116911, -139872, -205451, -106635, -20013, -3994, -45785, -134926, -143800, 5734, 141638, 128594, 37427, -95432, -11672, 29316, 55029, 87483, 9769, 43410, 119308, 99987, 30906, -21812, -31756, 763, -35462, -138097, -145501, -208690, -229109, -212810, -214271, -203903, -139039, -99418, -62873, -96089, -35151, -29565, -114338, -124798, -124780, -35066, 382, 2483, 26992, 90793, 116404]
15650A16404m9338j10829o2646J834m7493n4125R5554P3141k4927J5160q968O635
15638d9598K4330J6452Q8714p2983o6277M1300n888j18007O220R4888M6815l2649
15626b6683q458J29030L0189p7968j37508m1733J54506O1834p3442n4495l672
15615d8400M6744O086K5918J00028l0177j06833o4740M4333j8956p2638l0232
15604a48867R5693L5751K0596q7085l0199N7151K2678j7985N3979J751m3779j8602
15592e8918K5210m2776k4803P6368M8400L821m0294p6617n9436q3375O1699L6816
15580a33905R3319j9731p7862R3618q5161o5462o377N7787p5918O024k638L1683
15568a84623Q4345K042N9133l4206j36626k6859J30966J3368j9773K8378O0580
$$ y = [116404, 67066, -43763, -106409, -104575, -152068, -206193, -110639, -37498, -62425, -47265, -56233, -49598, -25268, -8816, 79898, 6915, -59362, -18062, -23950, -141957, -135737, -40849, 5966, -26683, -35141, 93889, 124078, 46110, -91398, -133131, 21375, 83209, 9767, -44728, -48400, -1656, 4430, 30348, 130376, 100199, -6634, -71374, -27041, -45997, -118635, -148867, -53174, -17423, 3173, -83912, -114111, -56960, -34282, -52267, 1712, 3463, -40316, -58918, -33708, -76484, -101287, -24919, 23481, 27302, -12992, -89609, -149045, -232420, -170721, -133905, -40586, -60317, -138179, -44561, -129722, -195184, -201561, -143774, -219692, -213668, -216306, -184623, -100278, -98236, -39103, -73309, -209935, -236794, -105828, -92460, -112233, -83855, -23275]
15557b3275N5665Q7293l0936k8974m7852o086m8682K7393L6417m3250m230n2785
15545g9302k2160r322l151N9047j6196K0752p1767L8090R4656m3580l7514O8590
15533a857P5866o7776p3141j4783J07803O0836l4206q8179j5990Q1455K1883j00172
15521d8261m984M0398N9288N0893K1052j09868j60004L5001M5448K713N663q1620
15509a44281m9449O3430L9595N8173J0466k4638J0104M6077M8911j3147j0559
15498C4682J5993m2540j5574o5955m2807q060J24088J18730m4714j26096m0221
15487i2474L0551R0006P0875M9508J02742p7747n9871j0965L1392r7912j02825
15476f6720p4549j6501J70576Q2903Q9855J6787q3033o7438j50519M642J00301
$$ y = [-23275, 32390, 119683, 88747, 59773, 11921, 5835, -42847, -15454, 20963, -22287, -26517, -79302, -101462, -110784, -113935, -54888, -71084, -50332, -122099, -84009, 10647, -32933, -70447, -1857, 74009, 6233, -66908, -81691, 26112, 86948, 52742, -35437, -51427, 30028, 51911, -48261, -53245, -12847, 46441, 97334, 118386, 8518, -151486, -116485, -71037, -68324, -62661, -144281, -193730, -130300, -90705, -32532, -22066, -46704, -36600, 9477, 58388, 45241, 34682, 50675, 8135, -7439, -73394, -116201, -124261, -173, 118557, 73843, -52253, -92474, -61923, 28083, 98958, 148466, 251208, 173461, 113590, 102625, 134017, 36105, -66720, -141269, -157770, 12806, 95709, 185564, 202351, 119318, 51880, -98639, -93997, 6304]
15465F304P0607m4223r8567o0514L4951J4673O0890M0970k3142K6894N6629j02089
15453a6617L1810p278L0370m44m4287o0581m2066M9894O7745J02352p4314p3387
15441c6803Q8977j7605j17063m2094L3320r9003n415O7284k9467o6198K2712k006
15429b03361O2826L0962J62476N4665l7737j3926Q1358N8542j08044q0579p6623
15418f9441p467L9268O84J3428j1145j1379J6315m1392l02K7316P7361J16713
15406A49959Q1035l7576r8284l3530J5260n9865n4365o8294L6026j47227o754
15395b23615Q0284N5072J2576q6853n2447N2737Q7774O4148J2356m4248k2980
15384f5196l0948m957n825k7897k3943J04320M9747K4120j16048m454J01647K9066
$$ y = [6304, 76911, 32688, -65879, -126393, -91442, -76769, -15879, 25091, 1949, 28843, 85472, -16617, 15193, 7915, 38285, 37841, -6446, -67027, -109093, -59199, 8546, 110898, 36584, -36803, 52174, 34569, -82494, -124588, -91268, -190271, -195686, -128402, -157869, -224067, -201355, -203361, -140535, -109573, 52903, 107568, 69831, 55905, 137263, 195805, 87761, 7182, -69441, -76908, -37640, -36956, -23528, -34673, -46052, -29737, -71129, -71431, -44115, 33246, 149959, 230994, 193418, 95134, 61604, 76864, 16999, -37366, -105660, -69634, -216861, -223615, -143331, -88259, -75683, -162536, -214983, -162246, -74472, -10324, 2032, -42216, -65196, -96144, -101101, -106926, -134823, -158766, -54446, -4699, 19421, -96627, -101081, 566, 29632]
15372B9632o1592o2685K8921M5446J42001M9468j118j7430K0421j1422M6538j16944
15360I1236N797N5338j1832q7513l2619N9677j2035k5194n0549J27152K637n8637
15348F3458L4052M2923n4721J4575M6100m9136q3706p2858n4065O8408N2950k1533
15336a3553k0796M1210L4178m2729m2883K7844l4991l1278j265J32268l0748j21920
15324a04663j8509M6563n79P2430k8442k4772L4073K452K0510m844m9663L7697
15312a7747j322p330O650j8143l9375N3326O3991M6425K0724q8279r8939J0592
15300f9427L7963l6772n8414N911J02182J7856k5855l6584l0985k5976j4840K469
15288a32472P115K5525Q769j1423O7943J13640N929O0508J3459r5176L649j5654
$$ y = [29632, -31960, -94645, -65724, -20278, 121723, 171191, 170073, 152643, 173064, 161642, 208180, 91236, 97033, 152371, 140539, 53026, 20407, 80084, 68049, 42855, -7694, 119458, 122095, 63458, 97510, 140433, 85712, 100287, 146387, 97251, 13545, -59313, -113378, -44970, 7980, -13553, -34349, 6861, 41039, -1690, -44573, -16729, -51720, -82998, -84263, 48005, 17257, -104663, -123172, -76609, -77188, -4758, -33200, -57972, -23899, -21447, -937, -5781, -55444, -17747, -19069, -26399, -19749, -37892, -77267, -23941, 40050, 86475, 107199, 18920, -80019, -69427, -31464, -68236, -126650, -120739, -18557, -701, -26556, -63140, -94125, -120101, -134941, -132472, -125357, -99832, -91063, -102486, -34543, 79097, 85026, 145534, 158993, 63817, 67466, 51812]
15276E1812l2297L8220k0588p3027j14210K0967M0370K9009m2419j07584m0676
15265b50423k8718N225R4046J66611l826j18505K4901K6897K06O0064J6215J04047
15253I6740L0006m9827j3975r107n749o0390o2640o5849M0020O5155N7982O5903
15241H8269L9122l5982q9470O1370O5621j28458q6580J27959O3169l2788p4564
15230b332p3350l8177K6304K3968q305N7394M0154k7278n0722k6156J27447K7073
15218G6020O921o5705j39051P0295J62322N2058r9860j2563Q6270O726n5271l6825
15206E1337l1426L2169L4169L6364O1262L5391j74237j1734J10036n762j10572
15195B6997n203J4874r2165Q57L7164K5954K9182Q13n6603M5051k7640l2413k101
$$ y = [51812, 19515, 57735, 37147, -35880, -150090, -129123, -88753, -59744, -102163, -209747, -250423, -279141, -273916, -179870, -13259, -17085, -135590, -110689, -83792, -83586, -23522, -7307, 96740, 126746, 76919, 62944, 53837, 48088, -12302, -74942, -140791, -100771, -35616, 22366, 88269, 127391, 91409, 1939, 63309, 128930, 472, -86108, 41851, 105020, 72232, -2332, -75682, -113859, -87555, -63587, -71892, -14498, 25656, -1622, -52344, -78500, 48947, 76020, 82941, 17236, -121815, -51520, 110802, 162860, 63000, 50437, 136707, 143433, 88162, 51337, 19911, 52080, 86249, 122613, 183875, 219266, 45029, 33295, 143331, 137569, 26997, 21794, 36668, -55497, -54640, -17476, 8478, 37660, 38473, -18130, 26921, -719, -33132, -35233]
15182c5233O1054J2726j1856P243k4691J6061o9923o5084n65L4817j00726R6866
15170g9311Q9981J8279j1238l4494l0835L5637N4577Q3295j1622K711k0677n6807
15158C9496j25238q3763N1412N3768l3481K8563k827L9043P9281j4315l9364m962
15146a2387L2471K787J5575M8965P5645N629L192l2152j293m3100j2310M7080
15134A30102l3302o4640j28135n8549P928P8446K9565j265l0401M4100O1501m882
15122C0468j8026M7936n5658J2635K3700k5219k3342M579K7905J1494L0358m927
15110F1903j12495n370n0905O8117Q6377j8040q6430m0094N8738k0411q417j7180
15098h4207p364J66568Q4898P8110n1214j17848L792k7790J2333J15044r3246
$$ y = [-35233, 25821, 38547, 26691, 33934, 9243, 25304, -44619, -109703, -110268, -75451, -176177, -79311, 10670, 28949, 17711, -16783, -47618, -11981, 42596, 125891, 114269, 116980, 96303, 39496, -85742, -169505, -118093, -64325, -97806, -69243, -72070, -33027, 46254, 31939, -7425, -12387, 20084, 22871, 38446, 87411, 163056, 168685, 171877, 139725, 138432, 95332, 83022, 130102, 96800, 32160, -95975, -154524, -146596, -68150, -38585, -39850, -70251, -26151, 35350, 30468, 12442, 60378, 4720, 17355, 41055, 15836, -7506, -2927, 24978, 36472, 66830, 61903, -50592, -55962, -106867, -38750, 47627, 29587, -56843, -96937, -38199, -58610, -67027, -84207, -91571, 74997, 159895, 238005, 186791, 68943, 72735, 44945, 57278, 172322, 79076]
15087G9076r0873m4014J5149J71709Q1250q078k5111k363k605m0509p5967r6553
15075c8889m4888J6760O0706J20921R1732l2239r5631j35016n1241k2659Q159
15064a22285O1603N8643p692j9656l1306K1333R3104o4197K2925J2852k9391O2677
15052E8610J493q287o9636m6576L6436N2796p664J1569k9281k2506n3239m9359
15040a25644L8100O9331l3068k329k8494P631M3126R5171P3690j18270r8077p6437
15028a55270J19649J45732k8502k3203j8450P4406L5795j0028q5944J6950p2739
15017a604m2547l4279K1550J49093N8865P1879m4437n4033o6495L092p4388m9358
15005f2662M2990k9130O7667L2100M4455k6858j4353k2781J2542l9799L4070p7702
$$ y = [79076, -11797, -55811, -40662, 131047, 212297, 204219, 179108, 176745, 174140, 133631, 57664, -38889, -83777, -67017, -6311, 114610, 206342, 174103, 78472, -56544, -107785, -130444, -122285, -60682, -2039, -9731, -29387, -60693, -39360, 53744, -10453, 12472, 25324, -4067, 58610, 60103, 51816, -17820, -64396, -27960, 24836, 17172, 28741, -540, -23046, -76285, -125644, -87544, -18213, -51281, -53610, -82104, -74473, -31347, 63824, 137514, 19244, -78833, -155270, -35621, 110111, 81609, 58406, 39956, 114362, 150157, 140129, 54185, 71135, -1604, -44151, -78430, -56880, 92213, 151078, 222957, 178520, 124487, 57992, 61084, -13304, -62662, -19672, -48802, 18865, 50965, 95420, 68562, 54209, 31428, 43970, 4171, 38241, -39461]
14993c9461R0860J79076o0227j04584p8132m9661m0176M3096O8145N6968n2777
14982A3127j9014o877j2313m0952j0185K1006L4588K1908k9589j5187L5925k4090
14970c1653K8979J0703K3939j0145m7947k2740p4885m5278M3240J2127L0005M7752
14958c5903N9790r6219o1009K8918q412K1278J08348l3969n2899j12512N0333
14947a32256N42Q501R5831J60629o6184j03458q5317K1387M5348P242N9527N0885
14935F2677j0078j27215o1150P6160L4377Q6110k2718O5220P8558q6557r9613
14924d229m1913l7781j11485q0324J48706Q1820Q7799N7413m807m9540M1184L1017
14912A17860J6047j1711n0815k8834r3902Q7924Q3687K5598j15205j0984N8794
$$ y = [-39461, 51399, 230475, 170248, 65664, -12468, -62129, -102305, -59209, 8936, 65904, 13127, -5887, -12764, -25077, -66029, -76214, -55208, -20620, 1288, -28301, -43488, -7563, -31653, -2674, 8029, 31968, 21823, -26124, -48864, -123749, -169027, -125787, -113660, -83655, -35903, 23887, -72332, -133341, -104423, -112835, -91557, 16791, -17178, -70077, -182589, -132256, -131714, -123213, -27382, 133247, 67063, -36395, -121712, -100325, -54977, -47735, 11792, 62677, 52599, -74616, -135766, -59606, -25229, 60881, 38163, 103383, 181941, 95384, -4229, -46142, -83923, -195408, -275732, -127026, -45206, 42593, 100006, 95199, 45659, 86843, 117860, 133907, 122196, 71381, 42547, -51355, 36569, 120256, 145854, 30649, 19665, 78459]
14901G8459N3326k4492n3588O997p9207j16527J7302O8868P1778o946j8004J0720
14889H686l2437k5124N0869n304l5840P497j3231l2256K981P5204K6800j6000
14877A1845M5383K2348l8432P99J0026k071o3009p2948L3585J6189Q23M589Q4507
14864E3634o2145q729k813J8985K5354l1949k5276k9404J19867J5623o1947o8592
14852e7392R1786Q4285R0j17110O0023O7997L1257o5555M8767J14238m0698n0807
14840A66881N287p844o572j1760l2423L7979O4204N8890j0496L2662l9051p59
14828B56998j333R6299R8444P6586K9099n784l244J19194J79955K06479J94584
14817A247277J02465J06288J72027K74051K46943L11050L83758L11703J67183
$$ y = [78459, 131785, 107293, 53705, 60702, -18505, -135032, -117730, -48862, 22916, 15970, -2034, 8686, -23751, -48875, 1994, -3310, -39150, -31653, -44884, -77140, -74159, 1045, 27845, 11845, 57228, 79576, 41144, 41943, 51969, 49898, -13111, -86059, -52474, -36285, -35462, -30873, 53634, -8511, -17240, -20053, -1068, 24286, -7663, -32939, -62343, 57524, 73147, 11200, -57392, 34394, 118679, 118769, 1659, 61682, 129679, 160936, 95381, 144148, 258386, 217688, 166881, 172168, 164324, 157752, 145992, 113569, 151548, 215752, 274642, 264146, 296808, 257757, 256998, 255665, 351964, 450408, 526994, 556093, 550309, 547065, 666259, 846214, 1052693, 1247277, 1349742, 1456030, 1628057, 1902108, 2149051, 2460101, 2843859, 3155562, 3322745]
14808C322745j03051k39132k58884k39119k68415k87457j87101k36720j71678
14799A331188j16739n2450O017p1163n4339o6701j10719j08038j11836p511p4705
14788E63004j00511r5142J5757L4787k7921J2649n4405j60170q2720J8300N5823
14777A79451J8469j12124L1381R2325K4497n8043k0969N407o0979k8907k5487
14766D5021m0204N6485M4009L5389j0278Ll4496O8226P397p8528j6436J6938L6735
14753A30261Q060n8567m7990L4726R6067M5059o1631r6783L9505O6952l191P0468
14741B22936j04564q8226n6053M7156L717N5872J19880J4015q237k4736j14959
14730F6801j2401L1494R2104o099k8737N7504L3837m6614j03790p5612q407K0501
$$ y = [3322745, 3219694, 2980562, 2721678, 2482559, 2214144, 1926687, 1739586, 1502866, 1331188, 1214449, 1161999, 1168016, 1096853, 1042514, 975813, 865094, 757056, 645220, 637709, 563004, 462493, 367351, 383108, 417895, 389974, 402623, 348218, 188048, 105328, 123628, 179451, 197920, 85796, 117177, 209502, 233999, 175956, 154987, 160394, 99415, 70508, 45021, 4817, 61302, 105311, 140700, 130422, 130425, 95929, 164155, 171552, 93024, 76588, 93526, 130261, 138321, 79754, 31764, 66490, 162557, 207616, 145985, 49202, 88707, 155659, 152468, 222936, 118372, 30146, -25907, 21249, 24966, 80838, 200718, 214733, 206496, 181760, 66801, 54400, 85894, 177998, 171899, 143162, 200666, 234503, 187889, 84099, 8487, 80, 20581]
14718B0581M2014N0449p9531k8563N8928m811o4678q2365L2253J3010J3366J0536
14706a8811K1899P026j9565P509J2725n7087N6335q021J1200j2186J9927Q1102
14694A02053P7224j20644j6144R8333k2585p3763K5727R623J0692n0985j6157
14683B3374P6551N3401j9782L4434q5152n7537P8045Q4372k3046j83264o1498
14672h0102j4188O355J47606o5787q0980L9131N8320Q901J6957M192o1033m4341
14660f4969Q557j5477K7785m6341J0140K9986N9303k4203k0716M7059N5624K0053
14648H6801j23403m7198K564l1192m3002O9054L095K0719M6564N9374L5215M0550
14636A19141K9192q066k8558l8151q1979p4542j531J2759P769j76J552N4854J8074
$$ y = [20581, 62595, 113044, 33513, 4950, 63878, 59067, -5611, -87976, -55723, -42713, -29347, -18811, 3088, 10114, -9451, -1942, 10783, -46304, 10031, 2010, 13210, 1024, 20951, 102053, 179277, 58633, 42489, 140822, 118237, 44474, 70201, 79824, 90516, 39531, 23374, 99925, 153326, 133544, 167978, 82826, 25289, 103334, 187706, 164660, -18604, -80102, -94290, -87935, 59671, -6116, -87096, -47965, 10355, 19256, 36213, 40405, -20628, -64969, -56412, -71889, -44104, -90445, -80305, -50319, 8984, -15219, -35935, 11124, 66748, 86801, -36602, -83800, -81236, -112428, -155430, -86376, -83281, -62562, -15998, 43376, 78591, 119141, 148333, 140267, 111709, 73558, -8421, -82963, -84494, -71735, -63966, -64142, -62590, -7736, 10338]
14623A0338K4138j6466j6505m5698P384M2326j9588o7875L8222K9211m8729l3494
14611i6736N9880J9919j8857n6068Q7494k5643N2071m4021l6130J38549J6416
14600I6874j1296m0914o6574p8875P5316q263n7079m382J9880M538Q735o864L8124
14587c0780N3029k5598M0231j3682J5921l9326J5389J17756K1700q870j7325J8714
14575A47159K363m6130p9851o7371k1097K3676J5917l4592R4737P4881j16791
14564g099l2184n5168J12561P5395N5536L5355q1688j59414j4550N2341j3630
14553c2545n356j1266q769J06948L301k9195l546Q2625O2189J2237m2301j1131
14541A23191l1083o5153l1997M0988N4972j728p8067k9212l778p4299R2501m279
$$ y = [10338, 34476, 18010, 1505, -44193, -36809, 5517, -14071, -81946, -43724, -14513, -63242, -96736, -36856, -16937, -35794, -91862, -4368, -30011, 22060, -21961, -58091, 80458, 96874, 85578, 44664, -21910, -100785, -25469, -33732, -90811, -95193, -75313, -70775, -62040, -68904, -30780, 22249, -3349, 36882, 23200, 39121, -205, 15184, 132940, 154640, 145770, 128445, 147159, 149522, 103392, 23541, -43830, -64927, -41251, -25334, -59926, 34811, 109692, -7099, -39283, -94451, 18110, 93505, 149041, 184396, 102708, -56706, -71256, -18915, -32545, -37901, -49167, -57936, 49012, 52313, 23118, 19572, 102197, 164386, 176623, 134322, 123191, 92108, 26955, -5042, 35946, 90918, 89190, 11123, -18089, -21867, -96166, -3665, -7944]
14529g944l1838K0435j5504N6385O858R212N8340q3061n6408R2483L4043k9749
14517E3252L1812p4513o2932J6774k4002o517J08270l0713O3835R6424q5393m6095
14505D0202J40486N2042K3141o8590j32126o5575o1561K4427M3370l3526K4858
14494a2852j8016K9848m5680k8421P6620J487k9119Q037j5881O1685m7926n3678
14482g3896O820J11823N1904q1086k6578n9610k6896Q6836J1282p4214r2630m628
14470a70873n3863J25007J14733l9471n9004j50522K8224J95345J56401q9211
14460E6766n1713L7442P3546J25224P6394n0535n2873j20316r2985L2304j4237
14449A9017n7296m2573n2581L858K7411O460m5202r1940J38870P9037O9616l5070
$$ y = [-7944, -39782, -19347, -34851, 21534, 28392, 37604, 95944, 12883, -43525, 48958, 83001, 53252, 85064, 10551, -52381, -35607, -59609, -66126, 42144, 11431, 75266, 171690, 86297, 40202, 180688, 232730, 255871, 187281, 55155, -10420, -71981, -47554, -4184, -37710, -12852, -30868, -1020, -46700, -75121, 1499, 2986, -26133, -18096, -33977, 27708, -20218, -73896, -67076, 44747, 96651, 15565, -11013, -70623, -97519, -10683, 599, -73615, -166245, -170873, -224736, -99729, 15004, -24467, -83471, -233993, -205769, -10424, 145977, 56766, 5053, 42495, 116041, 241265, 317659, 267124, 214251, 93935, 950, 33254, 19017, -38279, -80852, -133433, -129575, -102164, -95704, -140906, -232846, -93976, -14939, 54677, 19607]
14437A9607N207n6587n4865j5131o6360K1405j5249P2992J70186J9792j3282k1129
14425F6586J2001k63l2591n5779K3953J16385p794j27198N1619o7064q7998M2015
14413f6128M5031j03540J6254J21015J0954j6885J14429K2141l1821r0832l9158
14402a8540R7370j6980j0032M8402M1865k9495p7026N3925L5627k23107j32130
14391b30121R0101Q8460n0280K8365R0195O7286k0720M507j5681l1067p9625q6425
14379a45005J01866j787l9560K1738n734K1180j30447k5047M757p783Q1204J0418
14367a14200Q904k7651o5662N7677J19991k179r0165j0422K3873k4410R5042J11812
14355H2610K1306J2207o9154K8642M1120J7357j08385p7736Q8568Q4443o7184
$$ y = [19607, 24814, -31773, -86638, -101769, -168129, -146724, -161973, -88981, 81205, 100997, 87715, 66586, 78587, 78324, 45733, -10046, 13907, 130292, 122498, -4700, 46919, -20145, -108143, -66128, -21097, -124637, -108383, 12632, 23586, 6701, 121130, 143271, 111450, 20618, -18540, 78830, 61850, 51818, 100220, 142085, 112590, 35564, 89489, 125116, -97991, -230121, -140020, -51560, -101840, -73475, 16720, 84006, 63286, 67793, 52112, 21045, -58580, -145005, -43139, -44926, -84486, -62748, -68482, -47302, -177749, -202796, -198039, -205822, -124618, -114200, -105296, -132947, -198609, -140932, -20941, -23120, -113285, -123707, -99834, -124244, -29202, 82610, 103916, 116123, 46969, 75611, 116731, 134088, 25703, -52033, 36535, 120978, 53794]
14344E3794Q662L0275M3810j6381J024Q995o5658j9214K5397N6299N1491P6355
14332B54849j2710M8952m4651q9742q8305p3483K324N5655M2230P5446O2844l7593
14320A95816o7532l7069j05876q7666L9730j2922k7547P0195k0842o9011L0742
14309i1982J5899M6220J1056L7682P2083l8615j080Q435N3012m5519Q3717M6428
14297A97336n8711J9338l3240n8758K1667r2453m5846J33057O6857K5539l1672
14286A43114o749N3663J959j11070q2599m8914n2989L3996J05591J2504K7326
14275G5832J3395O240N4025l7242p7692L9060L490p1760K6854j7443k6354R1660
14263H0065k6554L6341m4306k7464m440J5705J1o8025m7714o7698J18839K6696
$$ y = [53794, 62456, 92731, 136541, 120160, 121184, 130179, 64521, 45307, 70704, 127003, 178494, 254849, 242139, 291091, 246440, 156698, 68393, -5090, -2766, 52889, 95119, 170565, 233409, 195816, 128284, 91215, -14661, -102327, -62597, -75519, -103066, -32871, -53713, -122724, -91982, -76083, -29863, -18807, 18875, 90958, 52343, 51263, 59698, 112710, 67191, 150908, 197336, 138625, 157963, 124723, 65965, 87632, -4821, -50667, 82390, 149247, 174786, 143114, 136365, 190028, 191987, 80917, -1682, -50596, -103585, -69589, 36002, 48506, 75832, 89227, 95467, 149492, 112250, 34558, 73618, 77108, 5348, 32202, 14759, -11595, 80065, 53511, 89852, 45546, 18082, 13642, 29347, 29358, -38667, -86381, -154079, -35240, -8544]
14251h544Q2357J1775k1947l5114n5821K7480j7715O7020M7955J4489P5934J4956
14239B02825M1516l333k3554o0950k7461Q8647r4607j14756p8541L7481k6126
14228e8859k6956L2551P4049J12652M4578r9816j30548j3358Q1331N944K5969
14217D7537L0999O8530O5938q4361j12866L5575N8859J2903l0358k5631K2673
14206H9798J00291P411j05519n0447M4664O2250l1450j08764J6558M7845n0548
14195B2089r2767j7971N7067p8172L9685L3914Q0521M5382N952J17144R20m7197
14183A66567n8155j38028n1162N597m6539k8206n8518K3212J35959L2692J03399
14172H6818l7063L6686N827j06714o3494Q2934J25047o9703j40108M6932R7522
$$ y = [-8544, 73813, 85588, 63641, 28527, -27294, 186, -17529, 49491, 97446, 111935, 187869, 202825, 244341, 241008, 217454, 156504, 129043, 217690, 123083, 8327, -70214, -32733, -58859, -85815, -53264, 20785, 133437, 178015, 78199, -52349, -65707, 15624, 21568, 47537, 78536, 147066, 213004, 128643, 15777, 51352, 110211, 123114, 92756, 67125, 89798, 190089, 197500, 91981, 41534, 86198, 148448, 116998, 8234, 24792, 72637, 22089, -70678, -88649, -31582, -109754, -70069, -36155, 44366, 89748, 95700, 212844, 213764, 166567, 108412, -29616, -80778, -75181, -121720, -149926, -208444, -185232, -49273, -16581, 86818, 49755, 86441, 92268, -14446, -77940, 4994, 130041, 60338, -79770, -32838, 64684]
14161F4684J33254O2785r7617p0417n9660m5222r8650K0593J07503Q4618p009
14150I4862j03530n7248L7909L4758n7555r2282L8166P310N358m497m0035M5292
14138i1492N2364Q9035J6720j40350M0648K0062L9939O4173L3568K8671j37589
14127A5749o8021J6327O9743R522q6410k2885J6703j824m7049M7382m0004M6878
14115d3889k7973k6156p906l0128M8472N8809K881r2509j17556N8557O1063O4203
14103e2132L0693R3849J8263P140m8469O8492J00531m7713k4218r16j1816L5706
14091A69410q7470n3939j9082K0015J00435m3766p6414j1857o1638n3132P3927
14080d3511L6272j0664N8751P9764l3675j12334K1087p996n0311P922l357q1756
$$ y = [64684, 197938, 260723, 163106, 92689, 33029, -12193, -110843, -90250, 17253, 101871, 94862, -8668, -65916, -28007, 6751, -50804, -143086, -104920, -97610, -92252, -96749, -136784, -91492, -39128, 49907, 66627, -73723, -33075, -13013, 26926, 91099, 124667, 153338, 15749, -52272, -35945, 33798, 43320, -43090, -65975, -49272, -51096, -98145, -50763, -90767, -43889, -71862, -98018, -105924, -136052, -87580, -28771, -25890, -118399, -235955, -177398, -116335, -52132, -21439, 72410, 90673, 97813, 49344, 117836, 218367, 170654, 146436, 145520, 133704, 169410, 81940, 28001, 8919, 28934, 129369, 85603, 9189, -2668, -64306, -117438, -43511, -7239, -17903, 40848, 120612, 86937, -25397, -4310, -12306, -62617, -54695, -58052, -139808]
14068a39808L4361O9305M8363k5840K9984J05781N6258M4197q7597K0144l6722
14057A18426Q455M8630P852n5482P6332P5405n0782j997j3840l4424o085l063
14045A69427l5958o1133R488K1954k5197k8217L0010p1497O3664m2355k0069L7436
14033D7553o5089j6102k3563j13436m1999Q5621J54514k3099m2895n196k5115
14022f8806l5379P5421O9576l2928q8497J56945Q1628q477Q8894r3859n6956N4289
14010A41851j5504N432q4042K5518J5147j8889q7406r3232K656K7806l6371M7992
13998f9042M1069k4529O9881l7374q5224l4474k33l5607j3734O7286Q9415J3069
13986a9497j6398M7039o081m509o334M9857q1185m0266N2799M1830J4772o3151
$$ y = [-139808, -105447, -36142, 12221, -13619, 16365, 122146, 178404, 222601, 135004, 155148, 118426, 126881, 175511, 183363, 127881, 204213, 279618, 228836, 226839, 212999, 178575, 172490, 169427, 133469, 72336, 81824, 103778, 78581, 50364, 80374, 8877, 72541, 30186, 10117, 47553, -17536, -33638, -57201, -170637, -212636, -127015, 27499, 4400, -38495, -43691, -68806, -104185, -28764, 40812, 7884, -80613, 76332, 157960, 149483, 238377, 144518, 87562, 141851, 126347, 131779, 47737, 73255, 88402, 69513, -17893, -111125, -108469, -80663, -117034, -69042, -27973, -52502, 17379, -19995, -105219, -139693, -139926, -175533, -189267, -121981, -32566, -19497, -35895, 11144, 5063, 554, -5780, 44077, -37108, -77374, -24575, 17255, 32027, -31124]
13974c1124n8955Q2909n6963n6305k0549J8478P2208O6021R846k7257J3774k0045
13962g962M9231j7735M7441l1757J308j3046l1020Q3030p1553l3409K9589j1736
13950g619l1331r8025k3300k2319O0593J60603N7493J1663p0985O565J05154Q948
13938A57440j01657L9201j3076l7626P6943L9513j4843m4932m8244k9242k1668
13927A809M1344K5614r382m9984k3755l5478m7338M0415N1021L6441O465k9423
13915G749K2139M5996Q2625J4819J911m1161l9620k2628J8103N5935j3157l6182
13903I6529l4606l3504L3684P6958r6200l5501L9182m4743R5525J4871k4280J0151
13891I8066O803P3082j8980J0863l7090n0750p5583n785O4097O389L3190O6264
$$ y = [-31124, -90079, -7170, -64133, -120438, -140987, -122509, -50301, 15720, 25566, -1691, 12083, -7962, 41269, 23534, 70975, 39218, 40526, 27480, -3540, 79490, 7937, -25472, 4117, -7619, -38950, -136975, -160275, -182594, -122001, 38602, 96095, 107758, 36773, 43338, 148492, 157440, 55783, 94984, 81908, 44282, 121225, 160738, 145895, 100963, 52719, 23477, 1809, 43153, 68767, 59385, 9401, -14354, -49832, -97170, -56755, -5734, 30707, 37172, 7749, 29888, 75884, 158509, 173328, 175239, 134078, 94458, 71830, 89933, 145868, 132711, 96529, 61923, 28419, 62103, 139061, 42861, 7360, 46542, 1799, 97324, 112195, 87915, 98066, 104869, 177951, 158971, 169834, 132744, 81994, 6411, 626, 64723, 71112, 104302, 170566]
13879A70566P77j01291K5252n5074K3218L1237O4426M3271r4342L804M0980n5152
13867I7672j4244M2532n0463r2118q581L9665J18798J3417m2475r139q237L7071
13855A23898p3834K9310n0853N056L0418m6836k0808P3277L5330O320J4636k8353
13843I7561l4671K6439k9047J8867k4973l5973r5948j543l8206k5902N3636J46199
13831E6439M1815P438m0636J2908M1698j2834k1609l6976l6254m784N8000k9716
13819C5489n0800Q956N3647L5582j34333p2489O1742O5162L8627N8804M8386m3666
13807A05107j08893K518J6836K654o5771m5920M0586R6862j13Q2553L9236N6677
13795B22332j4886k6537q5324m792J6227o6618l1439N4055j9785K9661L2263P9902
$$ y = [170566, 171343, 70052, 95304, 40230, 63448, 94685, 159111, 202382, 108040, 111844, 152824, 97672, 83428, 125960, 75497, -16621, -25202, 14463, 133261, 146678, 104203, 95064, 86827, 123898, 50064, 79374, 28521, 33577, 63995, 17159, -3649, 69628, 104958, 111278, 125914, 97561, 62890, 89329, 60282, 79149, 54176, 18203, -77745, -79288, -117494, -143396, -89760, 56439, 98254, 105692, 65056, 77964, 119662, 106828, 85219, 48243, 11989, 7205, 65205, 35489, -15311, -6355, 47292, 82874, -51459, -123948, -62206, 2956, 41583, 100387, 148773, 105107, -3786, -1268, 15568, 18222, -47549, -93469, -52883, 43979, 43866, 126419, 165655, 222332, 207446, 180909, 95585, 90793, 107020, 40402, 8963, 63018, 43233, 72894, 105157, 185059]
13783A85059K3005O1727j09198n2947O5301N3594o6136j50003k3689M639J02546
13772I3898l6827j10338N1895J2925K9141m1721j14117q024Q9321k269m439j0991
13760e1546r26Q831n4425P2383P9585M2127n0212r9888O2840R7667R040n3965
13748F1511O6954m7220n1277m205R2417N2812l0009r0457p743j6185J3231j5161
13736B4668N084P7939r1625j9808O3944M5278L5553r5452n350Q9952O0770q6368
13724A04585K4500o7113K5791l6335p643R402m935l305n4945P1576J34407o072
13712A89913n5952K0990r653J6508k8484o0820j498j1562l9912L1461k1050j28159
13700i8218j0780N4987P9365K961J1793P3416P7668o1599p9942k2049K1405n8419
$$ y = [185059, 208064, 269791, 160593, 107646, 172947, 226541, 160405, 10402, -13287, -8648, 93898, 57071, -53267, -1372, 11553, 40694, -1027, -115144, -123168, -33847, -36116, -40555, -51546, -52472, -43641, -98066, -25683, 53902, 96029, 45817, -54071, 8769, 106436, 115476, 61511, 128465, 81245, 29968, 25763, 118180, 170992, 140983, 50526, 42783, 26598, 39829, 24668, 29752, 107691, 16066, -3742, 60202, 105480, 141033, 45581, 40231, 130183, 190953, 104585, 129085, 61972, 87763, 51428, 43785, 53187, 48252, 44947, -9998, 61578, 195985, 189913, 133961, 154951, 145298, 161806, 133322, 72502, 71004, 59442, 19530, 50991, 29941, -98218, -108998, -54011, 25354, 28315, 40108, 113524, 191192, 129593, 49651, 27602, 49007, -9412]
13688i412J3756L5209p871j09672m6942R0848N8874L2491r1405n9662K4279O8426
13676a081J6473L292o714P0869K3027P4687l9536j27113l9026k8474l6021J03951
13664A4334p0163J8457J58255K3113M3029n7493r6061m7819O7898J23645K9485
13653B06680m3892p1240n883l2342k0183J23K9293k4263L3030n0125n3777P1676
13641C9097K8607m0779p8691J1242k9396M1849O8194k9203k1793R952Q4805k549
13629H1335p1361L1643M9314L1952J1043M0797n370J2733k4623p8883j6160k8887
13617C3533o2345L7128P7648k8406J2458l6961j2538q146p22J5585N9682J07407
13605A94323n854r8598N4507O8058m8439q5669L5230R0495m8484j92779j8121
$$ y = [-9412, 4344, 39553, 31682, -77990, -124932, -34084, 24790, 57281, -34124, -93786, -69507, -1081, 15392, 18684, 11970, 82839, 105866, 180553, 141017, 13904, -25122, -53596, -89617, 14334, -55829, -37372, 120883, 143996, 187025, 129532, 33471, -14348, 53550, 177195, 206680, 162788, 91548, 85665, 53323, 33140, 33263, 62556, 38293, 71323, 21198, -32579, 39097, 67704, 26925, -51766, -40524, -69920, -28071, 40123, 10920, -10873, -921, 83884, 81335, 9974, 41617, 90931, 122883, 133926, 174723, 169353, 182086, 157463, 78580, 62420, 33533, -28812, 8316, 85964, 57558, 70016, 33055, 20517, 12371, 11649, 27234, 86916, 194323, 188469, 89871, 144378, 212436, 163997, 78328, 113558, 204053, 155569, -37210, -55331]
13594e5331l778L1524J28434J30304k8933o2762p0550l8186J3512J2561O1972
13583A18767R702o313N95l9288Q3890J636m1603n1068k2455Q1799m2198j2668
13571H0796M623N8200J8841r7906l5131M5975j5119K8255j18893n6497J05570
13560A8714M9522q1336M6597n719j00N0182o7494k0692N1225j27518o7368R6043
13548e7944J06279K1718n7238j0299J3415J113M7428J30217k0698k6324J936k8253
13536A21350m7477J5464j04603j5688J05646j4773m385j0659p7133m0003J22020
13525D9759Q4846M400j42265l2564L3583Q9603q752L5121R214M5266l2257r2190
13513D3764q5012l4868J03294M2041J01707Q0167n0680k8427M0986j4366j01581
$$ y = [-55331, -59109, -27585, 100849, 231153, 202220, 139458, 68908, 30722, 44234, 56795, 118767, 128469, 122156, 122751, 83463, 167353, 168989, 127386, 76318, 53863, 135662, 93464, 80796, 85419, 143619, 162460, 64554, 29423, 75398, 60279, 88534, -30359, -86856, 18714, 68236, -13100, 33497, 27778, 27678, 77860, 10366, -10326, 40899, -86619, -153987, -57944, 48335, 70053, 12815, 2516, 15931, 17044, 64472, 194689, 173991, 147667, 149603, 121350, 73873, 89337, -15266, -30954, 74692, 59919, 55534, 44875, -32258, -72261, 49759, 134605, 139005, -3260, -35824, -2241, 87362, 78610, 113731, 122945, 168211, 135954, 43764, -41248, -76116, 27178, 69219, 170926, 251093, 200413, 171986, 212972, 198606, 97025]
13502I7025n3968O9308o7153o3907L2938l1311o120J2206J9512M6818O6700l6677
13490H5371j71533l387P1973M638M8073M5865m2396k1430k135o2560M592J44978
13478A02049J51142J09387J4612k1833j14518k0707J09866p5533m4429j04503
13468A05533k203q261m917j0812J9520j6359q9546M8792M8778j0157o2215k0613
13456b460M320J64447l7853m7559o8118m881m7629O1263Q53q6117J09020Q9210
13444A34496m7700O3578K9768q7217j15048q1990L054j472n68q7889m8510j6256
13432b55754J53501j7163l1356J89801N7325j265k3240l4810K6665l073r5537
13421c4906j6154Q1011J6441N237L5422j828q027l7744J4820l0846o7226N1352
$$ y = [97025, 43057, 112365, 45212, -18695, 14243, -17068, -23188, -10982, 8530, 55348, 122048, 85371, -86162, -89549, -17576, -12938, 35135, 81000, 38604, 17174, 15039, -47521, -42929, 102049, 253191, 362578, 377190, 355357, 240839, 220132, 329998, 254465, 210036, 105533, 103330, 95069, 90152, 79340, 98860, 82501, -7045, 41747, 90525, 80368, 18153, -2460, 1860, 166307, 128454, 80895, 12777, 7896, -39733, 21530, 22383, -63734, 45286, 134496, 86796, 150374, 180142, 92925, -22123, -104113, -101059, -102531, -103099, -190988, -239498, -255754, -102253, -119416, -150772, 39029, 96354, 95089, 71849, 37039, 63704, 60631, -34906, -51060, 29951, 46392, 51629, 87051, 85223, 77196, 39452, 54272, 23426, -43800, 7552]
13409G552m502P6387J61769r648r1702k217j06362o7212O4960J25470L5239k9783
13397A59951o7984l5906l8020K3459K0858K2566P439m1023p5261J3448m2967p5059
13385a28499m1257N2313m3583N2533O1911k6624l0881J828m3109k1575Q2752Q146
13373g6045J05513O6815o8792n763R2885j4246l835K0961n0913j5053N5832L1542
13361A38901M2112j30837L2430M0446L4448l8683l1682m0865j43382P1188N4755
13350B8831j8593K6505j4964N5451K7666o326O871K4938j08478j36439O5365J7684
13338c1489J3004N9976O628m2992J8691L792j032n4098q2379J34700M7421o9629
13326B593l2128M1779M4098p7226m4002N0453L9523R9108M3044m5952j7399k2227
$$ y = [7552, 3050, 79437, 241206, 231558, 139856, 137639, 31277, -35935, 29025, 154495, 189734, 159951, 91967, 56061, 18041, 41500, 62358, 84924, 92363, 51340, -23921, -10473, -53440, -128499, -169756, -117443, -161026, -108493, -46582, -73206, -104087, -102259, -145368, -166943, -84191, -76045, 29468, 96283, 27491, 21728, 114613, 100367, 96532, 117493, 66580, 51527, 107359, 138901, 181013, 50176, 82606, 123052, 157500, 118817, 87135, 46270, -97112, -25924, 28831, 10238, 36743, 21779, 77230, 104896, 98570, 105441, 130379, 21901, -114538, -49173, -31489, -18485, 41491, 48119, 5127, 23818, 27610, 26578, -27520, -109899, 24801, 72222, 2593, -29535, 12244, 56342, -20884, -64886, -14433, 25090, 124198, 167242, 121290, 103891, 81664]
13314H1664K7728L0980L2232m0514n9465J4390j0432q1851L7125j777m9142j11964
13302a31026Q0404R0170O9894n8030n6835K3709J3131M1253P706m7399j2604J6182
13290C6555l9491l2745l3912M4249K9515k6520M8474J3649O477J9859K0566J2128
13278I8804N1811m7052n7439m7897p255L7964J8224J6351k4215k7582Q6602J9300
13266A17616j16440J8461j0600M9087R3009Q4821J5462q4313m6766p5165p6916
13255c1744j3278K7259j4291j8893P4068j3152L6991N3288m1070K5312Q362K9906
13243A22758j060M6878r9312o1106Q835j3730J7180K3315K726r3633k9710Q1419
13231D560J20471L3137J9904K1145p1345o7489n0965r0483O8841Q118J5051O7195
$$ y = [81664, 109392, 140372, 172604, 132090, 72625, 87015, 76583, -5268, 31857, 30080, -19062, -131026, -50622, 39548, 109442, 51412, -5423, 18286, 31417, 72670, 80376, 32977, 20373, 36555, -2936, -35681, -69593, -25344, 4171, -22349, 26125, 39774, 46251, 66110, 86676, 98804, 150615, 103563, 46124, -1773, -9028, 28936, 47160, 63511, 39296, 11714, 98316, 117616, 1176, 19637, 9037, 58124, 151133, 235954, 251416, 167103, 120337, 45172, -31744, -45022, -17763, -32054, -50947, 23121, 9969, 46960, 100248, 59178, 84490, 92852, 122758, 121698, 168576, 69264, 8158, 16993, 3263, 20443, 43758, 46484, -47149, -76859, 4560, 125031, 158168, 178072, 199217, 127872, 60383, 9418, -81065, -12224, -4106, 10945, 78140]
13219G8140k2284r0583j26264K6478R0448k2482M0235O1567n5705M1284J01598
13208A22432K9135m6040j1425l7652m7693J0365J02566O6364m1670L1285j22637
13197E5030j17938m0559M977R1940r07j3893k1413k8240j28642O9703J69028l6707
13185B379j1904J89455M9139p4124m3708j43682J8126O6559O0163l4305l5413
13174D2685j3486L9298Q8600L2049O6851j18744j05896M4216Q4146j4144p092
13163A38483J2994l8996m0636j717Q5567K2869R2474j12537j39248O7057M5402
13152A31712J7203l2754n674n9600q8882o1327j20945M6924J42135N9576n7354
13141b8986q479J4755K1006L3693J51662J37794l9186j05801j27528j11184l6489
$$ y = [78140, 55856, -34727, -160991, -134513, -44065, -66547, -26312, 35255, -20450, 20834, 122432, 151567, 105527, 94102, 56450, 8757, 19122, 121688, 188052, 146382, 177667, 55030, -62908, -103467, -98490, -6550, -7457, -21350, -42763, -71003, -199645, -129942, 39086, 2379, -9525, 179930, 229069, 154945, 111237, -32445, -14319, 52240, 112403, 78098, 42685, 29199, 68497, 157097, 189146, 255997, 137253, 31357, 75573, 159719, 145575, 138483, 151477, 112481, 71845, 70128, 155695, 178564, 271038, 158501, 19253, 86310, 131712, 148915, 116161, 110487, 50887, -37995, -99322, -220267, -173343, -31208, 28368, -28986, -37465, -22710, -1704, 31989, 183651, 321445, 282259, 176458, 48930, -62254, -98743]
13130i8743j825m5043P49l6112J02771J63796Q5684N8375j276o5580j3353L9401
13118A88844R538j6565l2892l4136L9552K8197q3166k1420J24305l3036n844P945
13106A71322j12479L4915p2619M8586n098q5141J1360Q2177P0717Q8430K2783
13095B54953p2850q0108p128N0705k7808n6932n2493K6388L6573Q075J3524n2081
13083D0818N6493R3892L8873Q147m9991j00897n6993K9333L8138K6041N9451N743
13071A89048j43567m0763O5654K5874l191j6098q40O095K5228m9899L0m2887q4733
13058g0049j0101J39547J5037j16290o9255P715J44220N9235l589P2883n895o2132
13046A01326n4351O3319N534J9663N0593m8204q7313k9745j26526k4059P5564
$$ y = [-98743, -100568, -145611, -144862, -180974, -78203, 85593, 171277, 229652, 228376, 162796, 149443, 188844, 198382, 181817, 148925, 114789, 154341, 182538, 99372, 77952, 202257, 169221, 163377, 171322, 58843, 93758, 21139, 69725, 64627, -20514, -9154, 73023, 143740, 232170, 254953, 182103, 101995, 94867, 145572, 117764, 60832, 8339, 34727, 71300, 79375, 92899, 40818, 97311, 191203, 230076, 238223, 188232, 87335, 30342, 59675, 97813, 123854, 183305, 189048, 45481, 4718, 70372, 96246, 93055, 76957, 76117, 82212, 107440, 57541, 57571, 14684, -70049, -80150, 59397, 74434, -41856, -111111, -103396, 40824, 100059, 96470, 169353, 163458, 101326, 46975, 110294, 115828, 135491, 186084, 137880, 50567, 20822, -105704, -129763, -54199]
13035e4199P7319P0570N9977L939r4298J0503Q5738J01126J6850j41695p9822
13024E6008K3295M2660l7267k6711J0373j999M6007L9285J063O4292j26553r3496
13012c043M4489k1196Q7905n084q7823k0469k2206Q0238J45443O6173J3734m4587
13000B33574q0160o5434j57873l7917J1434J14669J06473m9416K803M5390M8940
12989A72483l588n5344m3945L7144L0515J06899J2847j01927r9498j2560M0368
12978H3394K4749m1954k4220M7153M6075k7779l2900L6132m6331o0950p3516l4515
12966a04662R1183J76949Q5749l0429r577Q861k285J212k8358m9780j23887n3261
12954c8285O7784R2765M3862M0727r9695m2460J5823k8212p0765q8833N0523N4077
$$ y = [-54199, 23120, 93690, 153667, 157606, 63308, 73811, 159549, 260675, 277525, 135830, 56008, 79303, 121963, 84696, 57985, 68358, 66359, 112366, 151651, 152714, 217006, 90453, -3043, 41446, 20250, 108155, 103071, 15248, -5221, -27427, 52811, 198254, 264427, 278161, 233574, 153414, 87980, -69893, -107810, -96376, 18293, 124766, 75350, 78153, 123543, 172483, 168895, 113551, 69606, 106750, 137265, 244164, 257011, 155084, 55586, 43026, 83394, 108143, 66189, 41969, 89122, 135197, 107418, 74518, 110650, 64319, 3369, -70147, -104662, -13479, 163470, 249219, 218790, 209213, 218074, 215789, 217001, 188643, 138863, 14976, -38285, 29499, 122264, 166126, 206853, 107158, 64698, 80521, 52309, -18456, -107289, -56766, -2689]
12942b689O8840J16630r3931p6714j9283J0349R1333K2588n3305Q8632N5239r5692
12930A11997R8783o6601j05022J096L7680O5921o517J20297L2274r6962o9003
12919A23943m0146J366K7562q1051p1997j358j8630K4920M5981N5013J16560M0993
12907B23156P846n4351j4079p0228k654q762m5825l0051L6068K386k3751L7290
12895E7045N62J4015j6802J6889K3961m7972P0919l3079q9161L4092p5998M3129
12883b400M9655l93j91M2798K5094r3748L0851J6684J5082r1002n9046M2668O7745
12870D3797K1606N2398K006N9408M801n5441p066O1918L9411J8824l281n2226
12858A86155j12872q2595O799K6554P7152j7480J4230R7180L1762p0133r5624
$$ y = [-2689, 66151, 182781, 88850, 12136, -7147, 3202, 94535, 117123, 63818, 152450, 207689, 111997, 210780, 144179, 39157, 40253, 77933, 143854, 137337, 257634, 289908, 192946, 123943, 83797, 85163, 112725, 31674, -40323, -41681, -60311, -35391, 10590, 65603, 182163, 223156, 231002, 176651, 162572, 92344, 89690, 80928, 35103, 5052, 41120, 43506, 19755, 57045, 57607, 71622, 54820, 71709, 95670, 47698, 118617, 85538, -3623, 30469, -45529, -2400, 47255, 46862, 46671, 89469, 114563, 20815, 51666, 68350, 83432, -7570, -66616, -23948, 43797, 65403, 117801, 119807, 179215, 184016, 128575, 121509, 183427, 222838, 241662, 238381, 186155, 73283, -9312, -2513, 24041, 101193, 83713, 97943, 195123, 226885, 156752, 61128]
12847F1128j6218M4269j6941J603k3704P3625o955r1910j3911K572k5578l6215
12835d8235l8160Q2828l6774k0978p3591O1811J7902N4199M5609Q582K120p0876
12823a5563L8998O4220J6648j4443N2862K8417n8924l1309J3415j9459k1366J13624
12811A67120J39992J14340j68107j93608O145j09403l4914J54998R3057Q2566
12801B52186j7504j40008q3416O9801J37294L2438L783k0626l7138j03285m1366
12790E2159o5882J10329N9009k5210l4303K0022N642j11808l1125P1165O7231
12779A17229m4059p9659j3923L8891j1699N4902l0953M1713P4313n5359L3702
12768A25098R4716M2288j28327q6766O5325J08509j11117j9824L2957O2875j2468
$$ y = [61128, 44910, 89179, 72238, 73841, 50137, 123762, 116807, 24897, 10986, 13558, -12020, -48235, -86395, -3567, -40341, -61319, -134910, -73099, -55197, -998, 44611, 53193, 55313, -15563, 23435, 87655, 104303, 89860, 142722, 171139, 112215, 80906, 94321, 74862, 53496, 167120, 307112, 421452, 253345, 59737, 65882, -43521, -78435, 76563, 169620, 252186, 234682, 94674, 11258, 81059, 218353, 250791, 254574, 233948, 196810, 93525, 52159, -13723, 96606, 155615, 130405, 96102, 116124, 121766, 9958, -21167, 49998, 117229, 73170, -6489, -20412, 18479, 6780, 61682, 30729, 72442, 146755, 91396, 125098, 219814, 262102, 133775, 47009, 112334, 220843, 109726, 89902, 122859, 185734, 173266]
12757A73266k5153M2039N1928M2116j05441o422L9995n5910j2197l3210R7250
12746B08261Q183n5648q9671p8816q1409J3985N9361K1435R2433J11902l3355
12735A76661k8816O3855r0074j02672N9155K0607N5612N5898p9226l6718L4073
12724A28355N2398L8237N0196p4064j25137O7352J6502j3867M5555K8136k077
12713B11586l6917o2458o9873m0667l3404Q1004n0196k4753K2733R4928l2025
12702E9958K8178M6448m252N604n0021j2756L3068J1166l1097k3049P494L1353
12690A02094m132n5866R1983L17o5820q2864q3211k8330J2151J50426k3660n2312
12678c9224R2369M2677j12886o042M6865M1345Q2769l4324r189K9573n2177r3424
$$ y = [173266, 148113, 190152, 242080, 284196, 178755, 172333, 212328, 156418, 144221, 111011, 208261, 216444, 160796, 71125, -7691, -89100, -75115, -15754, 5681, 98114, 210016, 176661, 147845, 211700, 121626, 18954, 78109, 98716, 154328, 210226, 131000, 94282, 128355, 180753, 218990, 269186, 195122, 69985, 137337, 153839, 139972, 185527, 213663, 211586, 174669, 112211, 42338, 1671, -31733, 49271, -925, -25678, -2945, 91983, 59958, 88136, 134584, 130332, 135936, 85915, 73159, 106227, 117393, 86296, 63247, 70741, 102094, 97962, 42096, 134079, 134396, 68576, -14288, -97499, -125829, -113678, 36748, 13088, -39224, 53145, 95822, -17064, -23106, 23759, 65104, 147873, 113549, 104360, 133933, 81756, -11668]
12666a1668M5797J2736P9723q8236j09950O0465M9566M2241o1963N858k1205k6193
12654b2829m3424k7985R817J10181N956n5414M9650J9071N4898N5927k2671n410
12642A27767N5630j1176j22534J043N6327O7102j17648L0051J25819P9877m4637
12631B47621n3233k5150p2112l5402K8710O5408q938r8896l7099P7610M4789M3440
12619A76748l4816o944l6366n3155o2400N5780O6524O0423r406p2770J4098P3921
12607A71637l3444m941N7544n0962L3981K1075m9136j27494o7370K124L6025j9947
12595c0908k8719o7797M2926M3041M4779J53828N86j1224j5026j19058m7108o1882
12583i6562m2122J00131M0146j6948J2592M036M664M5320J5199K6462l7614l0513
$$ y = [-11668, 34129, 46865, 126588, 38352, -71598, -11133, 38433, 80674, 18711, 24569, 3364, -22829, -66253, -94238, -84421, 25760, 31716, -23698, 25952, 45023, 99921, 155848, 133177, 127767, 183397, 172221, 49687, 50730, 107057, 174159, 56511, 86562, 212381, 292258, 247621, 194388, 169238, 97126, 61724, 90434, 155842, 146904, 48008, 10909, 88519, 133308, 176748, 141932, 134988, 98622, 45467, -16933, 38847, 105371, 165794, 156388, 83618, 97716, 171637, 138193, 133252, 190796, 139834, 173815, 194890, 145754, 18260, -49110, -46986, -10961, -30908, -59627, -127424, -84498, -41457, 3322, 157150, 157736, 146512, 131486, 12428, -34680, -96562, -138684, -38553, 1593, -15355, -2763, 1273, 5937, 51257, 66456, 92918, 55304, 24791]
12571B4791o13k0538K4374L2009M1324l3253l5671L7067O0001K0952p3318j04956
12559b7831l4437K8504N7986O1324J0684N410P8350j0043r8387m7950L6878N2476
12547A12964k8990r8269m030M6157m5169o223J25865J02551k2589l6063r5103
12536E1101r0248n101P8976J3061k0585n0108O5570L7590j278M0953R5533l8690
12524A76774O3914N4485j18403l4393l1466k9265m0558k1411m029P309Q4359M2826
12512A50142q3982m1907L3358R071M2816J8764J0451L8657R2067M275n9661k7948
12500A86103j49613K3662M3082j20277K0790N9529k7390J01159O6217p2104j9109
12489A12049L2815o9582o1429l152m0675P8957J5370j8166L2299M027M0933l691
$$ y = [24791, 24178, 3640, 28014, 60023, 101347, 68094, 32423, 69490, 129491, 150443, 77125, -27831, -62268, -33764, 24222, 85546, 96230, 101640, 179990, 169947, 71560, 23610, 60488, 112964, 83974, -14295, -18325, 27832, -17337, -23560, 102305, 204856, 182267, 146204, 51101, -39147, -44248, 34728, 47789, 27204, -22904, 42666, 80256, 78978, 119931, 215464, 176774, 240688, 295173, 176770, 142377, 110911, 81646, 41088, 19677, 15648, 22957, 107316, 150142, 66160, 24253, 57611, 66682, 109498, 128262, 138713, 177370, 269437, 273712, 214051, 186103, 36490, 60152, 103234, -17043, 3747, 63276, 35886, 137045, 203262, 131158, 112049, 144864, 75282, 13853, 10701, -29974, 48983, 64353, 46187, 78486, 82513, 123446, 119755]
12477A19755j0738R2258R7243M2759j0556j2741K2504M1395O280r9496j25362
12466A63301p1581j73600k3662J21384Q3191k4010R7827m2379M2201N2935p5905
12455A49702q0828j0674J55Q932m948L0654k9114p2082p981n2709R505P5921J9936
12442C6469P7002O0658p4791N813J2419k8404l606J16008J7309j31144m2877L3289
12430G8145k8160R4895P476J72O0314j1845o2703n6657L9548k3889q5470L0753
12418D2579Q5658N8388l8542M1514n666q974k1724q851p1237o6891l1005m1540
12406f6291N102N2608R9275l3273o5634K8636P753n9882j3556M9216p9274k8009
12394a03329O837J34245J6654p1947r78L7571M3008q633j7666P18Q471P9715K4790
$$ y = [119755, 109017, 201275, 298518, 341277, 330721, 317980, 340484, 381879, 388159, 288663, 163301, 91720, -81880, -105542, 15842, 99033, 75023, 172850, 130471, 172672, 225607, 149702, 68874, 58200, 58355, 67287, 62339, 92993, 63879, -8203, -16184, -68893, -59388, 16533, 36469, 113471, 174129, 99338, 105151, 117570, 89166, 85560, 201568, 218877, 87733, 44856, 78145, 49985, 144880, 152356, 152528, 212842, 200997, 138294, 81637, 121185, 97296, 11826, 42579, 128237, 186625, 148083, 189597, 183931, 174957, 153233, 144382, 73145, 6254, -24751, -66291, -61189, -8581, 90694, 57421, -8213, 20423, 28176, -31706, -45262, 3954, -75320, -103329, -96492, 37753, 54407, -17540, -18518, 19053, 62061, 53428, 35762, 36480, 44951, 124666, 149456]
12381A49456r6277N2260J2543q0002N717l2823N8370M9509K1021n4465k1599l6959
12369B6751M9586K9829M6865M2456R69J9287P3675m3241q6834m1227l4035J1553
12357I5634N0979L8541k2108q4199r6739L4680R657K4430L1426l6275R1976J32183
12345B70185p1544k5495m3817P785R9059L3555l1274k6686j14770p3850o0070
12334c6922N3102J4845J00139R413m0598M5317k9523m6135k8782m8087L5219k3806
12322D182m0420N759K1026O9523J58834J46395p4142p6368p6504L2798K6430J4407
12310B11920J7202m0607M4910o2290m9522L6080R6625r1727n8902O040n4902J5180
12298G0007O1847K8523K8805K1991Q1405n0180n7763l6203K2007J5915j23866
$$ y = [149456, 53179, 105439, 117982, 37980, 43697, 10874, 69244, 118753, 139774, 85309, 63710, 26751, 76337, 106166, 153031, 195487, 196456, 215743, 289418, 246177, 159343, 118116, 84081, 95634, 146613, 185154, 163046, 78847, -17892, 16788, 26445, 50875, 82301, 46026, 138002, 270185, 198641, 173146, 129329, 137114, 236173, 269728, 238454, 211768, 96998, 23148, -36922, 16180, 31025, 131164, 140577, 99979, 145296, 115773, 69638, 40856, -7231, 27988, 4182, -36238, -30479, -9453, 60070, 218904, 365299, 291157, 214789, 138285, 171083, 197513, 211920, 229122, 188515, 233425, 171135, 121613, 157693, 254318, 162591, 103689, 109729, 54827, 70007, 131854, 160377, 189182, 211173, 292578, 242398, 184635, 148432, 170439, 186354, 62488]
12287F2488q2178p667J17926O3346o7499M9962R3778J6834M406m9543j02884j3742
12275H5227j5421O1924N9990j05062l1384O5080q6221j13875l1370J10883Q6267
12264H6038j1764J5570k6951L808P8040j988J26228j9462j12368k5240o2482Q1014
12252A30443L8448j09907k3712Q5562J08888K9340j15003j25533J3144K1121m6405
12241F386J6513J2160n8669J6613O8543M9501L7604o7357k974N7644L843K2123
12229A61930p4679j03356l6116L7434N941M2078O0358K5169j0277k3130p561L3753
12217A11544j6853Q1069q1039m4541P0358r4199Q1177M3519m2296j899j2002L8951
12205A33789l6981O0742J7162n0581L7852R0409N4890j22400r7188m9154l6377
$$ y = [62488, -19690, -27357, 90569, 153915, 86416, 136378, 230156, 246990, 251396, 201853, 98969, 85227, 69806, 131730, 191720, 86658, 55274, 120354, 34133, -79742, -111112, -229, 86038, 74274, 89844, 62893, 66701, 144741, 142753, 268981, 249519, 137151, 111911, 49429, 130443, 168891, 58984, 35272, 120834, 229722, 259062, 144059, 18526, 31670, 52791, 6386, 22899, 35059, -23610, -6997, 61546, 111047, 148651, 81294, 78320, 135964, 139807, 161930, 87251, -16105, -52221, -14787, -8846, 33232, 93590, 118759, 108482, 85352, 77791, 111544, 94691, 175760, 94721, 50180, 120538, 26339, 107516, 151035, 108739, 106840, 94838, 133789, 96808, 157550, 174712, 124131, 161983, 252392, 307282, 184882, 87694, 38540, 2163]
12194B163J24356L5849O7597O2695Q246l2932p1066m266J1039j06162k424J11048
12182B06143L5669N7265P840q6860k9677K8001K6287J02406o419j75258o2913
12171A02484j9834m682J38547L0986j19809o755j08489k5240p850M8937J20921
12160A49216m1515K0621P0119n9198J8537k7851P063l5917M8755L1190K4431K6743
12148B32194p7140r6053L5612J19862L171k9006J6450j992l877P421k4710k5013
12136A56919l5228P7438J441m1737m1327m4877L154L9338o0942J6848L9891M4614
12124A55532M3022p6977k7080J08745R4092q0975l2504m6645k1539J27966L8248
12113B81885j24574j36692M0477M2599K6127J09299M3291l9440m8763q511n6379
$$ y = [2163, 126519, 162368, 229965, 292660, 300906, 267974, 196908, 192642, 203681, 97519, 95095, 206143, 241812, 299077, 306917, 220057, 190380, 218381, 244668, 347074, 340655, 165397, 102484, 82650, 77968, 216515, 247501, 127692, 120937, 12448, -12792, -20642, 28295, 149216, 107701, 128322, 198441, 139243, 157780, 129929, 136992, 101075, 149830, 181020, 205451, 232194, 155054, 59001, 94613, 214475, 217646, 188640, 205090, 203098, 199221, 206642, 181932, 156919, 121691, 199129, 200570, 158833, 117506, 72629, 75783, 115121, 54179, 71027, 110918, 155532, 198554, 121577, 94497, 203242, 297334, 216359, 183855, 137210, 115671, 243637, 281885, 157311, 20619, 61096, 103695, 129822, 239121, 282412, 242972, 194209, 185698, 129319]
12102A29319M204P1273P0030j3919N6744m3186j67738j2207n540j0635Q9342o2945
12090A04742m0730K9361P9760K6338r134j2084o4626o2174k4450P800j3375N124
12078B6552K4867n6467m4911K4382O3113M7297J45346R656j1528L9406j0886M0579
12066B97406n7194J5617j2548j55119p0564K3215K6087J02454J36987l1050j15591
12055A59700j6928O489M3007L1145P2104J28412O7619q8172j45171m2027j4639
12044B01539n010K3803K1584J6764p6103l0938O7402P47J0546O6356n5355r4280
12032A47055j3136N1540k4003l9777l8544K8366L5375j29041N9358J02664P6667
12021B56524o4431k7987k0324l3212l7160k5008J5123K9573J16642N9412r9660
$$ y = [129319, 133523, 204796, 274826, 260907, 317651, 274465, 106727, 94520, 88980, 78345, 167687, 104742, 64012, 93373, 173133, 199471, 190337, 178253, 113627, 51453, 27003, 34803, 21428, 26552, 51419, -5048, -49959, -25577, 37536, 84833, 230179, 239835, 228307, 267713, 256827, 297406, 240212, 255829, 243281, 88162, 17598, 40813, 66900, 169354, 306341, 275291, 159700, 142772, 149261, 192268, 223413, 295517, 423929, 491548, 403376, 258205, 216178, 201539, 196529, 220332, 241916, 258680, 182577, 151639, 219041, 219788, 230334, 296690, 241335, 147055, 133919, 185459, 161456, 121679, 83135, 111501, 146876, 17835, 77193, 179857, 256524, 192093, 164106, 143782, 110570, 73410, 48402, 63525, 93098, 209740, 269152, 169492]
12010A69492m8651r8226j6291L9544J12146O0122k5081P6808J14256q1021p422
11999B95676o5296q4966K0118r153K3789o4925L664j05564q9614K789J10279M217
11987D1014K7732N1091N2119m6057L552n4543P6492M4533K4957l9110J9396K9148
11975B30324J4517m7726j6373N9709o3395J3687R9668O1392J12222o9940j74895
11964B19190j17193N358k658M9979l4539m1915J6851M0401m7721O7562M4424r5243
11952A04496j3847J14197n7669l7164J7823q721K3073j2572q4041k9373K9553
11941D5755j3856L4243n1956J0664N9675k7291Q0333P4129J2987k308p4504j7668
11929A30203M6720P3264L5933k4436p536r358j08496k5140K7826o9723o0568l8745
$$ y = [169492, 120841, 22615, 6324, 45868, 158014, 218136, 193055, 269863, 384119, 303098, 295676, 230380, 145414, 165532, 156379, 180168, 115243, 118907, 13343, -76271, -73482, 36797, 41014, 68746, 119837, 171956, 125899, 129451, 74908, 151400, 195933, 220890, 181780, 201176, 230324, 244841, 197115, 180742, 240451, 177056, 190743, 290411, 351803, 464025, 394085, 219190, 101997, 107355, 104697, 154676, 120137, 78222, 95073, 135474, 87753, 155315, 199739, 104496, 90649, 204846, 147177, 110013, 127836, 119115, 142188, 129616, 45575, 16202, 45755, 31899, 66142, 14186, 24850, 84525, 57234, 137567, 211696, 224683, 222375, 147871, 130203, 176923, 250187, 286120, 261684, 254148, 244790, 136294, 111154, 138980, 69257, 8689, -30056]
11917c0056O8177J9564p5880N7117N4863R7248J0762p680r3662M1718j683N8602
11905A99090P4518L4369k018m2935j15256r9203O4537j8497K7056L6222N5838
11894B13721L2845K8725m6602l0096K2768N2810r971q1111L1584K7210j3458N8576
11882B87001o6918L419k1835o9405K4454o5194k9515M0312J12192P1436l3592
11871B52355k6157m372k2087O9881L3309Q064r8182l2493M2705l1856K5766P7265
11859B94198l422n890o3581p1792O1180N1771k8483n975K5202k04N634o678n3314
11846A98646N847l3653M441j49879j75044Q0350J14756L2901j6077M3302J36276
11835B41866J4683j03930j42032N1584o472N3158J34009L9431m1118l4899M8853
$$ y = [-30056, 38121, 57685, -18195, 38922, 93785, 191033, 201795, 194115, 100453, 142171, 140488, 199090, 273608, 307977, 305959, 263024, 147768, 48565, 113102, 94605, 121661, 157883, 213721, 246566, 275291, 228689, 198593, 221361, 274171, 264200, 183089, 214673, 241883, 228425, 287001, 220083, 223502, 201667, 132262, 156716, 91522, 62007, 102319, 214511, 285947, 252355, 226198, 221826, 199739, 269620, 302929, 310993, 212811, 180318, 223023, 191167, 216933, 294198, 290776, 284886, 221305, 149513, 210693, 262464, 233981, 228006, 253208, 253004, 258638, 251960, 198646, 204493, 170840, 175281, 25402, -149642, -69292, 45464, 78365, 62288, 105590, 241866, 256549, 152619, 10587, 62171, 55699, 108857, 242866, 282297, 241179, 206280, 255133]
11824B55133J2115r3764p5503j8299J44684L3265p7714l8561Q321k849K0292Q3677
11812B50797j9703m4185j28128o6522J102J01368J18097r9094j42523L7534J8477
11801B7220j2449J30605o8219n4973m4071K4223O7042o135J09692J33090P189
11790C13214p7281j15986M8342j1179N304O5088J9726k1641j141k1746p2289j8421
11778A11990P8369m1968l2904P3666Q7847j00298n5462k0211K559q660N6715N2577
11766B04220l0051k488l7701l4082j6208N3488O5768k7121P5508J349l5982j6363
11754B00337k1622p3261J074N1066k5119m1934m1570K240q6282M9147J45522L6298
11742A95896k0827k5035J8689J33277N5j19249J7656P1648m5192p4105N7340L7809
$$ y = [255133, 267248, 173484, 97981, 79682, 224366, 257631, 179917, 141356, 149677, 146828, 167120, 250797, 231094, 186909, 58781, -7741, -6639, 94729, 212826, 113732, -28791, 8743, 27220, 14771, 145376, 77157, 22184, -21887, 2336, 69378, 63243, 172935, 306025, 313214, 235933, 119947, 168289, 157110, 162414, 227502, 247228, 225587, 224446, 202700, 130411, 111990, 190359, 148391, 115487, 189153, 277000, 176702, 121240, 101029, 103588, 94928, 151643, 204220, 174169, 171681, 133980, 99898, 83690, 137178, 202946, 175825, 251333, 252682, 216700, 200337, 178715, 105454, 106528, 157594, 132475, 90541, 48971, 51211, -35071, 14076, 159598, 195896, 175069, 150034, 168723, 302000, 302055, 182806, 200462, 272110, 226918, 152813, 210153, 247962]
11730B47962J1230J6985j4349p1965j00855J8220k345Q2236M6717M0780Q4746
11719C59362r535l2655o5417K3822o0733M8764N4845J5360n421L9351m9917m4698
11707B73128j00708P588M3880j2368O5992l2678l2505l7757M4986N0507m1441
11696B28624k9586M8970r4184n5864M9972J3423j9936N1290N1854O5729l1414
11685B78878r4227R4753J21074n6071j08401r3248n2389P5948J13412l2941L859
11674B50647k5347Q8421O0195j3072k5327j7679n8187l3796M6802l0457O5145
11663C07345M279k8268n991k9600k5410k9370K3419N188j23180p2528L3797O6314
11651A25995K8639k379L8902M4794K38J16460L8047j6802m6071n6299m0317m2736
$$ y = [247962, 259192, 276177, 261828, 189863, 89008, 107228, 104883, 187119, 233836, 274616, 359362, 349827, 317172, 251755, 275577, 214844, 263608, 318453, 333813, 328392, 367743, 317826, 273128, 172420, 180008, 223888, 211520, 277512, 244834, 212329, 174572, 219558, 270065, 228624, 199038, 248008, 153824, 97960, 147932, 161355, 141419, 192709, 244563, 310292, 278878, 184651, 279404, 400478, 344407, 236006, 142758, 90369, 166317, 279729, 246788, 250647, 225300, 313721, 373916, 360844, 335517, 317838, 259651, 225855, 272657, 242200, 307345, 311624, 283356, 277365, 247765, 222355, 192985, 216404, 221592, 98412, 25884, 59681, 125995, 154634, 152255, 191157, 235951, 236189, 352649, 390696, 373894, 327823, 271524, 231207, 188471]
11639A88471J37112Q3532k5321j24538j31567M1650J23535j4426j37216n0390
11629I0842m4936Q6817R2348m9840q4756m980Q4292K2215K3055j6897M7394J5462
11617B61016m5107j3527K4971K7838L4056l0975n3010O1143Q4557N0887J7448
11606D19297L4358q2620j83738M8090Q6017J02538L2178m1074r2220j8162O182
11595C10846j2501J9821l0789p130K0463J5566L4126M233j3675l2491j1236m4254
11583B52979j3557K7513P2642K8103p3026j18177j413L9671P0915N961l4453N151
11571B62309L7777J4545p8789L3094M645p342J1969m3814J8910m8025P6962N4612
11559C36853l1440k321J4629M3382K5753q4995j22692l7511K5848R3030K6460
$$ y = [188471, 325583, 409115, 383794, 259256, 127689, 169339, 292874, 278448, 141232, 90842, 45906, 132723, 225071, 175231, 90475, 85495, 169787, 192002, 215057, 198160, 245554, 261016, 215909, 202382, 227353, 255191, 289247, 258272, 205262, 266405, 350962, 401849, 419297, 453655, 371035, 187297, 235387, 321404, 423942, 456120, 415046, 322826, 304664, 310846, 298345, 318166, 287377, 280247, 300710, 316276, 350402, 354635, 340960, 308469, 297233, 252979, 239422, 266935, 339577, 367680, 294654, 176477, 175064, 214735, 285650, 291611, 257158, 262309, 300086, 314631, 235842, 268936, 273581, 266239, 278208, 234394, 253304, 205279, 282241, 336853, 305413, 303092, 317721, 361103, 386856, 301861, 179169, 141658, 167506, 260536, 286996]
11548B86996j9248J4657P2878O881n2468j0603K825P7403j8674m8639N9655J1303
11536C82966n5563m324o3596m4988K2269M0002M8146o4353l636J258K5458O5774
11524C49413L8611J30959L4770j48294p8861P7024m4106K00K0648j01241P852
11513B86975K4895k6012o800l7770K6451N9457r3706J00239J35360j33649q7297
11502B48143M7863J6126M636j0552N5175M6473l2461n9167p4018j731j4306J7049
11490B43230J3309P5321R8896o0203p5304p8660M4465J42417Q2947Q5713K0656
11479E92787q0668o8331k2526K7733r1884l0483j0556j60243K5268P5312R6537
11468C52946k9141m2389l0720j7307O1033P1961L8182N7888M9212q138n3048m6148
$$ y = [286996, 267748, 282405, 355283, 362164, 309696, 299093, 301918, 379321, 360647, 312008, 371663, 382966, 327403, 323079, 259483, 214495, 236764, 276766, 324912, 260559, 256923, 258181, 283639, 349413, 388024, 518983, 553753, 405459, 326598, 403622, 359516, 359716, 380364, 279123, 286975, 311870, 285858, 279058, 241288, 267739, 327196, 233490, 333729, 469089, 335440, 248143, 296006, 312132, 316768, 306216, 361391, 407864, 375403, 316236, 242218, 240487, 226181, 243230, 256539, 331860, 430756, 370553, 295249, 216589, 261054, 403471, 486418, 572131, 592787, 512119, 443788, 421262, 448995, 357111, 326628, 316072, 155829, 181097, 256409, 352946, 323805, 281416, 250696, 233389, 294422, 366383, 404565, 462453, 511665, 503527, 450479, 404331]
11456D04331m4403j30979m7328O1693N0114J27865R1508k907l1358o9810q4828
11445C23898m4926R3535L1446J6828L4m3272n9694L8538P2647L472O454j3792
11433D25168p3766j6844M6892K6481n9464l4438J31146Q5579l8592m6303m992
11422D40867m9351o007M4498Q1988N3207J89M9206M2443p316k5632l8024J243
11410E87311l2328L6502N5708O0179q4547o8602R0537Q0426K8753K1716J23410
11399H99065J18327P9025K19516L01734K95728K12747R1764n5161j33545k30893
11389A798307k57128k19908k07412j02299l6898p3281m3369n3115p8608r8141
11379F28148J2125q893m5622o2379Q9363J29317O540k456q746l0210j6867j8241
$$ y = [404331, 359928, 228949, 181621, 243314, 293428, 421293, 512801, 509894, 478536, 408726, 323898, 278972, 372507, 403953, 420781, 420815, 377543, 317849, 356387, 429034, 432506, 438960, 425168, 351402, 334558, 381450, 407931, 348467, 314029, 445175, 530754, 492162, 445859, 440867, 391516, 385509, 430007, 511995, 565202, 565391, 614597, 657040, 649724, 624092, 586068, 587311, 554983, 591485, 647193, 707372, 622825, 554223, 644760, 725186, 753939, 775655, 899065, 1017392, 1096417, 1315933, 1617667, 1913395, 2126142, 2217906, 2162745, 2029200, 1798307, 1541179, 1321271, 1113859, 1011560, 974662, 901381, 858012, 804897, 726289, 628148, 640273, 631380, 585758, 523379, 612742, 742059, 748599, 746143, 737397, 707187, 690320, 672079]
11367F72079m841L3765r0643q3318l7697L658J4725N2557M3306J514j60513j19585
11355C25007j344L6981J8496N4722O4982O7019J2982j11940k4843K3668o2649
11344D03081J0803P8898P4378q6806k6932P4146M637l6479L8321K5822O6865l0426
11332E96308r4371J5073l0192n7024o4371m1347P8366R2390N1924K0821L9523
11321F07100N3117k536q6882p323J32793J09229M9847q5502p7515l7880j4020
11310F40428L8612j3099J0269l1223l8423N440l6518M2565k6852q7234j1533O5245
11298E57677l9835l1909j7843J1881O4867K0982P4727L4068q6643o5021R0017
11287F12968O0456N2269j49905m0291M8485r624p8810l7953N5608P7324l14k293
$$ y = [672079, 667238, 701003, 610360, 527042, 489345, 493003, 507728, 560285, 603591, 605105, 444592, 325007, 323663, 360644, 379140, 433862, 498844, 565863, 578845, 466905, 442062, 465730, 403081, 413884, 492782, 567160, 480354, 453422, 527568, 532205, 495726, 534047, 559869, 626734, 596308, 501937, 517010, 486818, 429794, 365423, 324076, 402442, 494832, 546756, 567577, 607100, 660217, 657681, 570799, 563476, 696269, 805498, 855345, 769843, 692328, 654448, 640428, 679040, 665941, 676210, 644987, 606564, 612004, 575486, 618051, 591199, 503965, 492432, 557677, 517842, 485933, 468090, 479971, 544838, 565820, 640547, 674615, 587972, 522951, 612968, 673424, 725693, 575788, 535497, 583982, 574358, 495548, 457595, 513203, 590527, 590213, 587920]
11275E87920K1525j6342n2415n9406P9070K4060j02525k6152j1351J8162J18962
11264E81508Q3140j7989M240J1718p7647o3130P9038N1933l9417p5606L6157L776
11252E77721N8215K3068K9960K9969J2811k8781Q2752K00268P0228m6960j0319
11241I98932R1825J11084l8234m8891m9824p3495j09847n3854o1618l2647P6194
11230H09625k7785k6025J6357n9205n7524J3750M5715L9915O01n3335n4920L182
11218F50351N5321O7313K8661j07732j279r4083l3524J21220R2081O237j4398
11207G70168j2758L0275K7494N041K390p3605L4469J09161l6389Q86P7713n9813
11195H75032q611L7182j18119L7606l760o5737p3386L9265m323n954R6050J5139
$$ y = [587920, 609445, 593103, 540688, 481282, 560352, 584412, 481887, 455735, 444384, 462546, 581508, 664648, 646659, 650899, 662617, 584970, 521840, 600878, 652811, 613394, 537788, 573945, 577721, 635936, 659004, 688964, 718933, 731744, 702963, 785715, 985983, 1056211, 1009251, 998932, 1090757, 1201841, 1163607, 1114716, 1064892, 991397, 881550, 827696, 766078, 733431, 809625, 781840, 755815, 772172, 712967, 655443, 669193, 714908, 754823, 755424, 702089, 647169, 650351, 705672, 772985, 801646, 693914, 692635, 598552, 565028, 686248, 778329, 784566, 770168, 757410, 787685, 815179, 820220, 822610, 749005, 783474, 892635, 856246, 857132, 934845, 875032, 866421, 903603, 785484, 823090, 819330, 753593, 680207, 719472, 715149, 709195, 805245, 820384]
11183H20384K1346n023l714J06276l81J09634k6860j45983p8576J6114Q9884K6789
11171I29890J2527n2748l6216N3615j6770p0839o2476L0978O991o3187k4742J0502
11159G17525L6188J9927J02443J17248k0330K008r199k8442O2526J2605k088K0037
11147A030448n0089p6214L4262L3421Q9744R0578j3244o2995k2228k9228n5921
11136I68534l0389L4273P4237O6124m6161r219j3850l1589m4484O7861k2251K2644
11124A035730p8172p7808O7686N6675Q6112K4669J05427k8721J0509r6977o2875
11113A042255j9749J7334M6332O6027R1710k6481q7061j05058K1874R7733J53179
11102A298095J32371N4462r455J31912R716l8171M7144L2348M6191j5025K638
$$ y = [820384, 841730, 836707, 832993, 939269, 938888, 1048522, 1021662, 875679, 797103, 813217, 903101, 929890, 942417, 889669, 853453, 907068, 890298, 819459, 756983, 787961, 794952, 731765, 707023, 717525, 753713, 773640, 876083, 993331, 973001, 975009, 965810, 937368, 999894, 1012499, 1010411, 1030448, 980359, 904145, 938407, 971828, 1061572, 1152150, 1138906, 1075911, 1053683, 1024455, 968534, 938145, 972418, 1046655, 1112779, 1066618, 1057399, 1043549, 1011960, 967476, 1035337, 1013086, 1035730, 957558, 879750, 947436, 1004111, 1090223, 1114892, 1220319, 1191598, 1202107, 1105130, 1042255, 1022506, 1039840, 1086172, 1152199, 1243909, 1217428, 1130367, 1025309, 1047183, 1144916, 1298095, 1430466, 1484928, 1475473, 1607385, 1617101, 1578930, 1626074, 1658422, 1704613, 1689588, 1692226]
11091A692226m802j3408Q0398j5531k0938m1764N7323P379J3266O7299l0243O294
11079A797499Q8846M6143J6565P2112M6910Q5759P4447N9931o7817m127l5849
11068B180419n3273R178R1530l8920M6811M4689k4685M4219N8644J67007J82440
11057B708059k165o4412l3028O455J34398M6051J20158Q8151m6556N6552M8764
11046C062427O6488P5663J25594J26195K38291J43686K0530J35343J89968J96023
11036D380208J98370M0106J52599K03784K06799J28213J17759K25509K41558K08488
11026F103393K92307K61414K30341L33356M50246M03509M04619M32876M63862
11017I375923N02341O01025P59959Q73822J073124J383872J583378J944555K247025
$$ y = [1692226, 1687424, 1674016, 1754414, 1738883, 1717945, 1676181, 1733504, 1740883, 1754149, 1821448, 1791205, 1797499, 1886345, 1932488, 1949053, 2021165, 2068075, 2153834, 2228281, 2288212, 2220395, 2216268, 2180419, 2127146, 2136324, 2227854, 2188934, 2235745, 2280434, 2255749, 2299968, 2358612, 2525619, 2708059, 2705894, 2641482, 2608454, 2614909, 2749307, 2795358, 2915516, 3003667, 2957111, 3013663, 3062427, 3128915, 3204578, 3330172, 3456367, 3694658, 3838344, 3858874, 3994217, 4184185, 4380208, 4578578, 4618684, 4771283, 4975067, 5181866, 5310079, 5427838, 5653347, 5894905, 6103393, 6395700, 6657114, 6887455, 7220811, 7671057, 8074566, 8479185, 8912061, 9375923, 9878264, 10479289, 11239248, 12113070, 13186194, 14570066, 16153444, 18097999, 20345024]
11008B0345024K618075L045807L297963L006817J811038M15577n59632j056607
11000C2924062j138072p81582j26108O23947J262061K045664K789668L577527
10992D1177167M472471N545226O686565Q457691J0964469J4441756J9291997K5619562
10984A36656904L4066017M3734808N1887741N1020797K9278092l240416k7202118
10977C16201825m2063595m7796359m2785972l3426791k4938889j8283758j3447816
10970I3458645r786728p093518n209125m144141l791079m107192m499130m629267
10962E0198465m499479m072975l572339l248627k974255k703155k500507k361987
10954B4265141k327218k091876j873163j780081j785034j455832j187488j110425
$$ y = [20345024, 22963099, 26008906, 29306869, 32313686, 34124724, 34540301, 33980669, 32924062, 31785990, 31004408, 30878300, 31502247, 32764308, 34809972, 37599640, 41177167, 45649638, 51194864, 57881429, 66339120, 77303589, 91745345, 111037342, 136656904, 170722921, 214457729, 266345470, 317366267, 346644359, 343403943, 316201825, 274138230, 226341871, 183555899, 150129108, 125190219, 106906461, 93458645, 83671917, 76578399, 71369274, 67225133, 63434054, 59326862, 54827732, 50198465, 45698986, 41626011, 38053672, 34805045, 31830790, 29127635, 26627128, 24265141, 21937923, 19846047, 17972884, 16192803, 14407769, 12951937, 11764449, 10654024]
10946A0654024q52719n97037n99582m33054k13064L5304K79236M98940L99237
10937I171285J25583k39783o46576p91012r37886j047034o83374m64053m01195
10928D085955l93925m07847l58338k18102k19862j17658r6792p1833j12109q1883
10918B007606j46423j60015q8416j10203j05651o1210q5901j18000j27484r7533
10908I06770o6115j2936J619j66597p1549l2399j7166n3690K2292P4909n5222
10897E29916j24768n3272l5071M7844L1757l1331L8186J7519r5924r6631K5288
10886B53513M5140K8692m3954r5085p2223R9019j830O1768J5837r8832q9387l4537
10874F8121M5275P7932N9078k4860o0323R6169O0523j3964O2260l2429m3986n6148
$$ y = [10654024, 9801305, 9204268, 8604686, 8171632, 7958568, 7993872, 8273108, 8772048, 9171285, 9296868, 9057085, 8410509, 7619497, 6681611, 5634577, 4951203, 4487150, 4085955, 3692030, 3284183, 2925845, 2707743, 2487881, 2370223, 2273431, 2201598, 2089489, 2007606, 1861183, 1701168, 1612752, 1502549, 1396898, 1335688, 1249787, 1131787, 1004303, 906770, 840655, 827719, 829338, 662741, 591192, 558793, 541627, 487937, 510229, 585138, 529916, 405148, 351876, 316805, 364649, 396406, 365075, 403261, 420780, 324856, 228225, 253513, 298653, 327345, 283391, 188306, 116083, 215102, 213272, 275040, 290877, 192045, 102658, 68121, 113396, 191328, 250406, 225546, 165223, 261392, 321915, 307951, 370211, 337782, 293796, 237648]
10862B37648m8542K5556m1566N3330J92313J09644J08855N6296Q52o3954m1473
10851E88959m1567j2423p8353M5873P3693k1098K2661q4870j572L618l5350R1666
10839E51237m9896J4339L5247J1256k7940q5797L3110P3517l1556M8333J03447
10828F75297j8409k4718j5381j8423p5713l9365l0674k646k6214l9668m7801r9589
10816B36696n080Q9131K0811j15437k19311K6888Q9128L0367J21953K8850n6105
10805B47891q2681m340R9633P5670q397J00188L9864P5403R1654O557p0186K4836
10793E96092P2920n4161n3588O8569J1855j42313q9803j122J6903p3794p2809
10782B78749j8297k0595j9776M1734J0501J05412n384j12116M7046j2592j53986
$$ y = [237648, 189106, 214662, 173096, 226426, 418739, 528383, 637238, 693534, 694386, 630432, 588959, 547392, 534969, 456616, 502489, 576182, 555084, 577745, 492875, 491303, 494921, 459571, 551237, 501341, 515680, 550927, 562183, 534243, 448446, 481556, 555073, 523517, 571850, 675297, 656888, 632170, 616789, 598366, 522653, 483288, 452614, 449968, 423754, 384086, 336285, 236696, 231616, 320747, 341558, 226121, 6810, 33698, 122826, 153193, 275146, 303996, 247891, 165210, 160870, 260503, 336173, 327776, 427964, 467828, 543231, 634885, 641442, 571256, 596092, 669012, 614851, 561263, 629832, 641687, 499374, 409571, 408449, 425352, 351558, 278749, 260452, 239857, 220081, 261815, 272316, 377728, 372344, 260228, 307274, 294682, 140696]
10771A40696p194J04389R2630l5227o6588J7020N0619p4523k7549P1337Q9636
10760C55246J0728p5109J8124K5747K1189m0266j4950r7029n43O1786M6281O422
10748C17626J4466p2955k0176j0101p7819J3427Q8837n5131M2477M8026l5739
10737B52938o1337k0918p2248N9209J53830N7612M0360J1127l4260L6244l2452
10726C90105L8716N6395j6931J6451L2583r1060k9360J04402J51386O8206K8534
10715G49427M7729l1295o4341Q0016l4880p6602o6355J2163J2148q3274q0189
10704D64547P1496R4425J04997J7451K1714K385M0068n9709M6007J20822J3329
10693I37532P54J844k78l727k2057k6373N87N6681O7810N4329r775P3659o4981
$$ y = [140696, 133502, 237891, 330521, 295294, 228706, 245726, 296345, 221822, 194273, 265610, 355246, 365974, 290865, 308989, 334736, 355925, 315659, 300709, 203680, 203137, 264923, 311204, 317626, 332092, 259137, 238961, 228860, 151041, 164468, 253305, 198174, 240651, 288677, 252938, 191601, 170683, 98435, 157644, 311474, 369086, 409446, 420573, 386313, 422557, 390105, 428821, 485216, 468285, 484736, 517319, 426259, 396899, 501301, 652687, 720893, 749427, 797156, 765861, 701520, 781536, 746656, 670054, 603699, 615862, 628010, 544736, 464547, 536043, 630468, 735465, 752916, 774630, 777015, 817083, 757374, 803381, 924203, 937532, 938286, 940130, 939852, 936125, 914068, 887695, 888282, 944963, 1012773, 1067102, 1057327, 1130986, 1066005]
10680A066005J3296j8560q5158n4311j0063P5272N0356O4737m8276q787P9904
10669A124415M0200l9647p7611M7648N7497P1790J40203M3970M9450J0878J68206
10658A636999l1297m0685Q9448M2655P0393O3357J176J3701N2204J09059K5549
10647B032559L8072k5754L9597K3483J04459R5556J41087J32369K17771J52402
10637B951601L5525k6181J09567K23353K33137M11688K74983K65995M25536L79752
10627E284956L86936M89295O30011P30821R14548J194841J424369J833170K347277
10618A5236224K961140L856100M356996M396843L785861K590351J402092N21534
10610C9107141J40844N20610J498504K991026M721186O454457Q092855Q364305
$$ y = [1066005, 1079301, 1060741, 975583, 921272, 911209, 986481, 1036837, 1101574, 1053298, 1044511, 1124415, 1164615, 1124968, 1047357, 1095005, 1152502, 1224292, 1364495, 1408465, 1457915, 1468793, 1636999, 1605702, 1565017, 1654465, 1697120, 1767513, 1830870, 1832046, 1845747, 1897951, 2007010, 2032559, 2070631, 2044877, 2084474, 2107957, 2212416, 2307972, 2449059, 2581428, 2799199, 2951601, 2987126, 2960945, 3070512, 3293865, 3527002, 3938690, 4213673, 4479668, 4905204, 5284956, 5671892, 6161187, 6791198, 7522019, 8436567, 9631408, 11055777, 12888947, 15236224, 18197364, 22053464, 26410460, 30807303, 34593164, 37183515, 38585607, 39107141, 39247985, 39768595, 41267099, 44258125, 48979311, 55433768, 63526623, 71890928]
10602G1890928O615811L498554J02814k343886l236509k754326q88863J741671
10594G4626194M632830P385062R238394R003703N783491P85466l786708o920794
10586A00747638q292264p592946n407285k569041J31106K464060L730277L475875
10578H6687420J185306k182714n152579o927620p485104o872098n369402l771274
10570E0111935k025137p71883k66091l65702j108085k338728l507479m232187
10562C5496643m362435m282978l664506l160757k704507k172057j858988j570724
10554A1719691j191689r85562r03602r01860q57467p06580o44517o71738o38592
10545D218084n48142m35878m92258n04526k97342l79614k96279j52306q7381j80256
$$ y = [71890928, 78506739, 82005293, 82108107, 79764221, 76527712, 73773386, 72884523, 74626194, 79259024, 86644086, 95882480, 104886183, 110669674, 111455140, 107668432, 100747638, 92455374, 84862428, 79455143, 76886102, 77017208, 79481268, 83211545, 86687420, 87872726, 85690012, 80537433, 73609813, 66124709, 59252611, 53883209, 50111935, 48086798, 47314915, 47048824, 46683122, 45575037, 43236309, 39728830, 35496643, 31134208, 26851230, 23186724, 20025967, 17321460, 15149403, 13290415, 11719691, 10528002, 9542440, 8638838, 7736978, 6879511, 6172931, 5528414, 4856676, 4218084, 3669942, 3234064, 2741806, 2237280, 1939938, 1560324, 1264045, 1111739, 1024358, 844102]
10535H44102j73763j437j0460k45970k27423j37595R627Q4208o4121j45983j02750
10524a71565J775n6917n6033l9708l184O688O3226j9672n4361P4197Q0825J4400
10512a60329m4187n1450r1846m7390k6959j1014J6190k2841Q761j3316Q1042J7520
10500c45819m9067n695m7137r482k5962k5240J4570M4027K5167K7055M3241O1818
10488b92524O626j20439k6869N0185L4982m4016k6624O5665M8262K9029m1779
10477c17502p9500L1517J885j09133K1761R4096J9989j05911L0044K0661J28272
10466b63821J54847M7319k9881j01894p7010L2070J2000p903k8290N4928l4918
10455b42553k9013O3141J19801J11106J5359j66586p9231J2366k795j5864j00757
$$ y = [844102, 670339, 668902, 658442, 412472, 185049, 47454, 57081, 141289, 77168, -68815, -171565, -169790, -226707, -282740, -322448, -325632, -318944, -255718, -275390, -329751, -255554, -174729, -160329, -204516, -255966, -347812, -395202, -422161, -433175, -416985, -439826, -431065, -444381, -363339, -345819, -394886, -400581, -447718, -457200, -483162, -508402, -493832, -449805, -424638, -397583, -354342, -292524, -285898, -406337, -433206, -383021, -348039, -392055, -418679, -353014, -304752, -275723, -317502, -397002, -365485, -363600, -472733, -450972, -356876, -336887, -442798, -412754, -392093, -263821, -108974, -61655, -91536, -193430, -270440, -238370, -226370, -234273, -262563, -207635, -242553, -271566, -208425, -88624, 22482, 37841, -128745, -207976, -195610, -198405, -214269, -315026]
10444c15026J2863K7759J20313R2425m4189q7598n0015N6917L8014K6432O291
10433a15814l4597j0372J9084R4n4423l2479J7026l6145j09119k0968O2484o2008
10421c77237l1546O1798R347J0439n8220r818J11885l6561L0904P9527j5611l9
10409b25132q8233l0216p9599L4084J07303l308j29638m483R6323n1336n369P5018
10397c04586l5050j19974J07682P8937J15531L206o0565l9775J4655Q4914o3388
10386b18413m9580k8290j8344k6644k702q2087o3399O2043K5297P0487l1420r1368
10374d54420l6378L7977R5601K6055O2227k3462m7883O418l6200L541j4174k2817
10362d03515K1944M3356P2922n5033L255k8832l7565L0340j07813l851R9221N5032
$$ y = [-315026, -302163, -274404, -154091, -61666, -105855, -193453, -243468, -186551, -148537, -122105, -115814, -150411, -160783, -141699, -141605, -196028, -228507, -211481, -247626, -356745, -377713, -315229, -377237, -408783, -346985, -337638, -327199, -385419, -395237, -283352, -319913, -289009, -209482, -225093, -225132, -313365, -343581, -423180, -389096, -281793, -285101, -414739, -419222, -322899, -374235, -379604, -304586, -339636, -459610, -351928, -272991, -157460, -154254, -214819, -254594, -239939, -155025, -218413, -267993, -296283, -314627, -341271, -343973, -426060, -489459, -427416, -402119, -331632, -363052, -454420, -490798, -452821, -357220, -331165, -268938, -292400, -340283, -333865, -370065, -366524, -380698, -403515, -381571, -338215, -265293, -320326, -317071, -345903, -383468, -353128, -460941, -464792, -365571, -310539]
10350c10539k4168k8337M103M5620K3620K6799L990j4244k8054q4810L1221l6733
10338c91532k8332n6709j9987P2624R4277n2969k1571o4110N4972R2029K6760
10327b94548m0377K9838k6793O214n9795O2453J31092L4610j2604J1483j4664
10316a73091K0374l7072M2728J4616M1422l050k71336j03007q630L7045Q3465
10305c56536O7554O1829J3841n0852P6436R2896L1230j37205l8384j9617j5316
10294b74124r896L0358J07341L4942j08210J1209L0515L0286N212O4302Q4922
10283F857k893O0776L5578n7128r9928l864n255R0139k144M3847P6755j8745n2315
10270G1680R6989J95618K14822K29824K63869L52804M24707M30094L58486L15816
$$ y = [-310539, -334707, -363044, -358941, -313321, -289701, -262902, -258912, -273156, -301210, -386020, -354799, -391532, -419864, -476573, -496560, -423936, -329659, -382628, -404199, -468309, -413337, -321308, -294548, -334925, -305087, -331880, -325666, -385461, -323008, -191916, -157306, -169910, -158427, -173091, -152717, -189789, -147061, -132445, -91023, -94073, -365409, -468416, -477046, -440001, -356536, -288982, -227153, -213312, -264164, -187728, -94832, -63602, -200807, -239191, -258808, -274124, -284020, -253662, -146321, -111379, -219589, -208380, -177865, -147579, -142367, -78065, 6857, 3964, 64740, 100318, 43190, -56738, -60602, -65857, 24282, 22138, 65985, 142740, 123995, 71680, 168669, 364287, 579109, 808933, 1072802, 1425606, 1850313, 2280407, 2638893, 2954709]
10260B954709K92423K25430j7181j37082j68556k55197l49871l79986k34200k97994
10250A632495l87285k99263k36407j68493j61438o6531j55416K6602K6309N594
10240B16167j22928n7533M136n2016N5667m589L24L1982r0446j06029J7859k0979
10228a28385j7537J8441j9164n3737j01022n4297J52387J01347J5943m5698R4982
10217c6740Q8105k5030p0802k2226j32432j45326j1694O8973P754j1974J486N128
10205b84778N7291M506J0317P2909J418K6379k6200l2504J9034j3031J5708O1034
10193h7917M884J6385l2880l3221m2449K3463P4050L5245j6629L2419l9708m7305
10181a13663m3375l0902O3716Q5432m6487l7158k2013m5157L1889p101O6262J431
$$ y = [2954709, 3247132, 3472562, 3455381, 3318299, 3149743, 2894546, 2544675, 2164689, 1930489, 1632495, 1245210, 945947, 709540, 541047, 379609, 313078, 157662, 184264, 210573, 216167, 93239, 35706, 39842, -12174, 43493, 38904, 39228, 71210, -19236, -125265, -107406, -128385, -145922, -127481, -146645, -200382, -301404, -355701, -203314, -101967, -86024, -131722, -36740, 51365, 26335, -44467, -66693, -199125, -344451, -356145, -287172, -279418, -291392, -289906, -284778, -227487, -222981, -212664, -139755, -138337, -111958, -138158, -170662, -151628, -164659, -148951, -87917, -83033, -66648, -99528, -132749, -175198, -151735, -77685, -42440, -59069, -26650, -66358, -113663, -157038, -187940, -124224, -38792, -85279, -122437, -144450, -189607, -157718, -164819, -98557, -97126]
10169i7126k0529J48012J08235N8424j3218l8281q3363j8567n902M9636P3417
10158A60738o497j0291K9188R0066Q8918O9900l0490J0654r2693O066j7457k0451
10146B77651j20370k04Q3967M3098J01383L526l9190p9953K4480j21196j10137
10135F3055K127K8223l0716K6317J3595o3200j8694M4598n1624J2773j00418j7439
10123i1403K9075J1796N5349r5182N0221N8957N321j25537p2435k9656j360r132
10111b13986j25975O359j811k2283Q9553O9439j7061J0792k0676k9792O6444Q6981
10099a02016j2700j24384r6399p4013Q8686J24692O1867r6922l1774q9300N580
10088c46683L4041J19095N1365N6038n6641m6299j31930q6415O7923J43815j1486
$$ y = [-97126, -117655, 30357, 138592, 197016, 183798, 145517, 62154, 43587, 37685, 87321, 160738, 154241, 143950, 173138, 263204, 352122, 422022, 391532, 402186, 309493, 315559, 298102, 277651, 157281, 157077, 241044, 284142, 385525, 389051, 349861, 269908, 294388, 173192, 63055, 65182, 93405, 62689, 89006, 102601, 39401, 20707, 65305, 13681, 26454, -73964, -91403, -62328, -50532, 4817, -90365, -40144, 18813, 24134, -101403, -173838, -203494, -204854, -213986, -339961, -333602, -335413, -357696, -268143, -198704, -215765, -204973, -225649, -255441, -188997, -102016, -114716, -239100, -335499, -409512, -320826, -196134, -134267, -231189, -262963, -352263, -346683, -312642, -193547, -142182, -86144, -142785, -189084, -321014, -407429, -339506, -195691, -207177]
10077b07177m1765J6561L3068k457Q3402n5004o0033j4761m3930k3531k0323J25448
10065b10502J247o9155q8491L4914K0966j3168o824P3219Q3090K7180l2605m3973
10053b24102p3480j12080K3960J13552J09478j6060r0710k5516K6500M9167j4684
10042b33975K5585l1135P5251M0789M274l5965j19802j3780K8855j706J1145J78369
10030g2095P8585o3419j28509n3944M4423K7530O5077l4722l0714o7250K9702
10019b05336M3161K2871k1513K4303L3775p9383K1875O379l364m3396m0772J22811
10007a18589J742n1620l2215p7794K6167Q8646Q0067j2615j18953j16578k3001
9996c54743n9014R1417R3750N2109p2231l3465M7047R2713L3876n6373l8269l2905
$$ y = [-207177, -248942, -232381, -199313, -201770, -118368, -173372, -233405, -248166, -292096, -315627, -335950, -210502, -209255, -278410, -366901, -331987, -311021, -324189, -331013, -257794, -174704, -147524, -180129, -224102, -297582, -409662, -385702, -272150, -162672, -178732, -269442, -294958, -268458, -219291, -233975, -208390, -239525, -164274, -123485, -119211, -155176, -274978, -288758, -259903, -261609, -250464, -72095, 6490, -56929, -185438, -239382, -194959, -167429, -102352, -137074, -167788, -235038, -205336, -162175, -139304, -160817, -136514, -102739, -182122, -160247, -153868, -157232, -200628, -241400, -118589, -116847, -168467, -200682, -278476, -252309, -163663, -83596, -96211, -215164, -331742, -354743, -413757, -322340, -228590, -176481, -248712, -282177, -235130, -142417, -108541, -164914, -203183, -236088]
9984b36088k145R1879L8890o4491n6721O582K4804J312N2127N6266J13028o0441
9972c4998r0434n9778L0689N7966j7531n2902m7002n2527P7160J8193O04N2556
9960a18004N0266J6827o6237K1214L0310j06369j33322j4210k775J3564J18336
9949a90400N1659K440K9461j8975l1566k8581j0087k7326Q582L5236j3796P5159
9937a18194N840p223m8912p0904j3292L4409L7432P3241l0487j2490Q5350N0686
9925a4544j8873L2920J6315n7597l6087k0599j22552l8792J11399Q4463o3151
9914a27098j2160k5951l1K8862K1871K8454p700r1115N1197J1241q4968j11995
9902c19393R218P8402n6242Q600k9188K0375J51505M9281q6536J3674n9512o6259
$$ y = [-236088, -238233, -146354, -107464, -171955, -228676, -222094, -197290, -195978, -143851, -87585, 25443, -34998, -125432, -185210, -154521, -96555, -114086, -166988, -213990, -266517, -189357, -171164, -170560, -118004, -67738, -50911, -117148, -95934, -65624, -171993, -305315, -319525, -322300, -308736, -190400, -138741, -136301, -106840, -125815, -157381, -185962, -196049, -223375, -214793, -179557, -193353, -118194, -112354, -119577, -168489, -239393, -252685, -218276, -180844, -107603, -138090, -150580, -65230, -14544, -33417, -497, 15818, -41779, -77866, -98465, -221017, -259809, -148410, -63947, -127098, -139258, -165209, -165240, -136378, -114507, -86053, -93753, -184868, -133671, -122430, -207398, -319393, -310175, -231773, -288015, -279415, -308603, -288228, -136723, -87442, -173978, -160304, -219816, -286075]
9890b86075Q744J1502O7207K5212o866J24272M554j20883L8320Q1415o6851q7907
9878b07356L1901M2018n3420m695l3479N5861O0735J3670L9017j2659k7576L0999
9866f4984j5612q577M2150P8078K2027K043r3845o3246j45868q9349L6480N7606
9854b43097M1268K5789K4311N1976M1646r5260q0588P8772O1683k1157p6479L8027
9842a53109J520j2567n2773N463q532k1499J10875L5235p0542l7300Q6893M2008
9830g4328J0997M988n9145o0411N9934J7975J682K53l304o0453J896N6607L6959
9817f6350K6043j9065m7809O395p9889l4651J0108K5848J05155p6165o6924k108
9805b19412n840j2688p793R0204L8832J3300j76035L2198O2418L4873N4324J8564
$$ y = [-286075, -277331, -265829, -198622, -173410, -180276, -56004, -51450, -172333, -134013, -52598, -119449, -207356, -175455, -133437, -186857, -191552, -225031, -169170, -108435, -94765, -55748, -68407, -95983, -64984, -80596, -89173, -47023, 31055, 53082, 55125, -38720, -101966, -247834, -337183, -300703, -243097, -201829, -176040, -151729, -99753, -58107, -153367, -233955, -155183, -93500, -114657, -191136, -153109, -151589, -164156, -216929, -211466, -219998, -241497, -130622, -95387, -165929, -203229, -116336, -74328, -63331, -58343, -117488, -177899, -117965, -99990, -98308, -98055, -101359, -161812, -159916, -103309, -66350, -40307, -59372, -107181, -100786, -180675, -215326, -205218, -179370, -74215, -150380, -217304, -219412, -225252, -237940, -245733, -155529, -116697, -103397, -279432, -247234, -184816, -149943, -95619, -77055]
9793g7055L0623M962j6798n7578r0149L8713O1480l9486m415N3528M5726r8566
9781a49015j09577J01196r928r0811J7829j243J03192r175j3701l8476l598r365
9769b12672J3579o576K0695J07071q7410j64956O7159Q8657L4216Q486p0121p4308
9757b76180j1648m2035k8012o6368K4704J34244J50770m896o4797m1641M863J1007
9745b09989M6505O1983K788o0302k124j6672P4016m6128j07345L1327J42651K9001
9733e4289o6925j05978p193L9401k8479P4202O0817l4748L3734q8761j8965N7605
9721a39579l4158O673l1585J6795K7680Q8354k1867n6876k020l0813Q8022J9375
9709f9999m6091P0708P3126o58k4660j37335j07321j6195O8228j285N2344l6145
$$ y = [-77055, -46432, -41470, -58268, -115846, -205995, -167282, -105802, -145288, -149703, -96175, -50449, -149015, -258592, -157396, -167324, -258135, -240306, -241549, -138357, -147532, -161233, -199709, -203307, -212672, -199093, -205669, -184974, -77903, -165313, -330269, -263110, -174453, -140237, -131751, -201872, -276180, -287828, -329863, -357875, -424243, -399539, -265295, -114525, -119421, -184218, -225859, -220996, -209989, -163484, -101501, -98713, -159015, -161139, -177811, -103795, -149923, -257268, -225941, -83290, -54289, -121214, -227192, -234385, -194984, -223463, -149261, -88444, -123192, -89458, -178219, -197184, -139579, -173737, -167064, -198649, -181854, -154174, -65820, -87687, -144563, -146583, -177396, -89374, -69999, -116090, -45382, 27744, 27086, 2426, -134909, -242230, -258425, -190197, -191482, -139138, -175283]
9697a75283O8690L0788M3758m4326j84374j9875J9953N0188J5393k5002r6092
9686c16182L5073r782L5029J02560O1969J9632J7006J4076p9492j4917p3685k102
9674b10815N6543j7634j8296J0723J62397n6807j07100O1645J50141J2106k5438
9663A7465k5984m560j3988l8967J0609M7730j5972j3582n0183N2391R0766N5247
9651A10972o8353j01397K7063L6505M0856p8034K4798N1351m446k96l7227n8434
9639e6642L7477l3233m1493p2830n9861l5197l0931J7648k0138J9448J30689k883
9627a47946j3536N3716L3887j4797m6077M8645K0874J5236l8018P1303k5063n6999
9615i8775m2271N4625Q3217q1362q6133N556K0715J0811K9995J30984M6016j5323
$$ y = [-175283, -106593, -75805, -32047, -76373, -260747, -280622, -260669, -210481, -195088, -220090, -316182, -281109, -290891, -255862, -153302, -91333, -71701, -54695, -40619, -120111, -135028, -208713, -210815, -154272, -171906, -190202, -179479, -17082, -73889, -180989, -119344, 30797, 42903, 17465, -8519, -13079, -27067, -66034, -55425, -7695, -23667, -37249, -87432, -35041, 55725, 110972, 42619, -58778, -31715, 4790, 45646, -32388, -7590, 43761, 39315, 39019, 1792, -56642, -19165, -52398, -93891, -166721, -226582, -261779, -292710, -275062, -295200, -275752, -145063, -147946, -161482, -107766, -73879, -88676, -134753, -86108, -65234, -49998, -88016, -16713, -41776, -98775, -141046, -86421, -3204, -84566, -170699, -165143, -144428, -133617, -103622, 27362, 73378, 58055]
9603E8055n5708P2K0499n852r7765r5367J2462J7350J57623j8771o4719J0492
9591f1629J4302N7834p2309k2304m962n4416k0220o884k6781o68N8633N5859J681
9578h1864n8909j0316J46220N3726m9431j3600n4265j0166m9919j43148Q259K0815
9566b42598J15650M4222N335P2670j04782j9336J19452R8272M8191l8535n1368
9555D7173P876J9847n9681k6120q275k1778j11028p0027o2773N3653P5906O5352
9543h9875L734k9588j6762J8509j448R2291L799m3978j2023O2317J5605L7641
9531D0222O4464j59565m3805J2113k259N2866q4534N0817N8340L8724j4189N6458
9519F9652K2476q5932k1306n140O233K316j30665j6516J12701j1044K9230M4503
$$ y = [58055, 2347, 2419, 22918, 17066, -80699, -176066, -163604, -146254, 11369, -7402, -72121, -61629, -47327, 10507, -61802, -84106, -89068, -143484, -163704, -170588, -197369, -198037, -139404, -83545, -81864, -140773, -151089, -4869, 48857, -574, -14174, -68439, -78605, -128524, -271672, -263413, -242598, -126948, -82726, -77391, -4721, -109503, -128839, -9387, 88885, 137076, 98541, 47173, 55049, 74896, 15215, -10905, -19180, -40958, -151986, -222013, -284786, -231133, -155227, -89875, -86141, -115729, -132491, -113982, -115430, -23139, -19340, -63318, -75341, -13024, 2581, 40222, 104686, -54879, -98684, -86571, -88830, -35964, -120498, -69681, -11341, 27383, 13194, 69652, 92128, 6196, -15110, -20250, -14017, -11701, -142366, -158882, -46181, -57225, -27995, 16508]
9507A6508o4912k8575q784N9674J8535L2269n2884R048J6162N2475m319m6829
9495a632l92o285J0300L810m5429L474o5389j00155o442q2030m8265R1927N6533
9482a89975K9369J16642m5608k7188R606L0942l1681K1042N9897m4835j04909
9471a76698j2651M0639R3514o7650r5566n4732L8846O5692K8643L3865m4561l5995
9459a86654j8180M2586K4975J9302n604l546R5193m8280Q292J8332M1290j2673
9447b4967k4706k9973O105O9468L3043o5125m5462N0746m7090N6047K7352r925
9435d487l285k4997j3594K2650j04055M7372R3267j9149j9528K9936Q211j2353
9423a2m2195j04079o2567J8880j9493J19149M3102O8288r027o2515k2040n0413
$$ y = [16508, -48404, -76979, -85763, -26089, -7554, 24715, -28169, -19121, -2959, 49516, 45197, -1632, -2024, -8309, 1991, 5801, -39628, -36154, -101543, -201698, -208140, -290170, -338435, -246508, -189975, -160606, -43964, -89572, -116760, -107154, -76212, -107893, -86851, -26954, -71789, -176698, -189349, -148710, -55196, -122846, -218412, -273144, -234298, -168606, -139963, -106098, -150659, -186654, -204834, -162248, -137273, -117971, -123575, -127121, -31928, -80208, -71916, -53584, -12294, -24967, -49673, -79646, -73541, -4073, 28970, -36155, -81617, -30871, -77961, -21914, 5438, -4487, -7772, -32769, -46363, -23713, -127768, -80396, 12871, -6278, -25806, 4130, 12341, -12, -42207, -146286, -208853, -189973, -209466, -90317, -47215, 21073, 12046, -50469, -72509, -122922]
9411a22922n721p8724K1115j0600K9555m7385J07703M8895L9680j2541O539o0650
9399h5056k2317K1944o1442M2650O6945j0834k2799J01173k4493j11442m4749
9388a50420L7517l0537k1115M9117r1546M5914N7734Q929K1704k9176m0571l4964
9376a77414n4014Q9622J24760l965K8134j7258n3673L5631k5836L9726R1205l9311
9364C7607j44728M138j9942j5179N8000j2942j48407N6995L1555k9184N4319m5369
9352a73137J24656J1117j10199N1403N633n6640N7029j7348K1251R726l1106j1162
9340a18777o3693n0742j6555J27846K5383K5365p868N358m5280J17107J1210K4398
9328C3752J4232q266O837j42081q6773l6937K1276n2687j13354j2744J6502P2025
$$ y = [-122922, -128643, -207367, -186252, -196852, -167297, -214682, -106979, -58084, -18404, -30945, -24406, -85056, -107373, -85429, -146871, -104221, -37276, -48110, -70909, 30264, 5771, -105671, -150420, -112903, -143440, -164555, -115438, -206984, -161070, -103336, -94407, -72703, -101879, -142450, -177414, -231428, -141806, -17046, -21011, 7123, -10135, -63808, -28177, -54013, -14287, 76918, 37607, -107121, -102983, -122925, -138104, -80104, -93046, -241453, -184458, -152903, -182087, -127768, -173137, -48481, -37364, -147563, -96160, -90527, -147167, -90138, -107486, -86235, -76509, -107615, -118777, -182470, -233212, -249767, -121921, -96538, -71173, -79041, -73683, -118963, -1856, 9354, 33752, 47984, 39718, 46555, -95526, -182299, -219236, -197960, -250647, -364001, -376745, -360243, -288218]
9316b88218R6149P1100M9435J9540n5173m7261J6762L3496J05336n612r9740n7523
9304a61709R0366K4714j299K3014K2922m6358l4945R9588m9712j447j2480N9600
9292A2254n2224j56966n6077L4921L4335P3578P1113K5768J0717m1507l6993n8491
9280a39572m7366N1428N7231J28773l534l5284l7740r9785k3138K3878j1723J11524
9268b5308k742p3248m1770L3718P5933K4376j8572J3704l6123q8698m0204P8890
9256a00044n6820l7627l1776R5362M5060q2067M2207L5966O8403K1847j2712k4212
9244c6413p016n8636Q1038N118j11233m5635O5988L2581N1539N6123L0118L5188
9232I8760l2091j16559M014j20606o7599J5963N3225K8439n3551Q4878K351m1949
$$ y = [-288218, -192069, -120969, -71534, -51994, -107167, -154428, -137666, -104170, 1166, -4446, -104186, -161709, -71343, -46629, -47928, -24914, -1992, -48350, -83295, 16293, -33419, -34866, -47346, 12254, -39970, -196936, -253013, -218092, -183757, -110179, -39066, -13298, -2581, -44088, -81081, -139572, -186938, -135510, -78279, 50494, 46960, 11676, -26064, -125849, -148987, -125109, -136832, -25308, -28050, -101298, -143068, -109350, -33417, -9041, -27613, -13909, -50032, -138730, -178934, -100044, -156864, -194491, -226267, -130905, -85845, -167912, -125705, -89739, -21336, 511, -12201, -36413, -43429, -102065, -21027, -15909, -127142, -172777, -106789, -74208, -22669, 33454, 63572, 98760, 66669, -49890, -45876, -166482, -234081, -218118, -164893, -136454, -190005, -105127, -102776, -144725]
9220a44725K7644n5489q1388k7462J17796J24540j3768K8686P9917j25779o6631
9209a36659Q128l0310N179M6693j1709L5610K8455k4465j6815p3965K5672K1512
9197a22674K1735M6810j5704l3350L0617K4285K8909P8815j1326n2801N431j14343
9185a13596L0062J2273N1176K7793p5111l7197J9591K6558J8939K204p7156j5356
9173a29820J38223L0172j4830m5308j40228R1459P6905J5299j1800J2180p6239
9162e3987J800R0743l7916l5242K1529R267P21k5957K5199K261p8603L0565J69480
9149A19860M3312m546l394j62104j21602J8855j7837j24308q135P8572J34431
9138d6896K6256N2288O3952n337L740m0737q5509J6935l7483k7352M3240Q160
$$ y = [-144725, -117081, -172570, -253958, -281420, -163624, -39084, -52852, -24166, 55751, -70028, -136659, -128531, -158841, -153662, -106969, -118678, -83068, -54613, -79078, -95893, -169858, -144186, -122674, -100939, -54129, -69833, -103183, -72566, -48281, -19372, 59443, 48117, -4684, 747, -113596, -83534, -71261, -20085, 7708, -67403, -104600, -85009, -58451, -39512, -37308, -114464, -129820, 8403, 38575, 23745, -21563, -161791, -70332, 6573, 21872, 10072, 22252, -53987, -52187, 38556, 640, -34602, -13073, -3806, -3085, -29042, -3843, -1582, -80185, -49620, 119860, 163172, 158626, 155232, -6872, -128474, -109619, -127456, -251764, -259899, -181327, -46896, -20640, 31648, 95600, 90263, 94003, 53266, -32243, -15308, -52791, -80143, -36903, -28743]
9126b8743K8171J5902o0322p2813P3371k4254N1538o965J5812M3327j17828o7640
9114a50444j6911J8670j5641K8913M4926J29956L9495p2360j37423r2943J53518
9103g0244Q2674l6952j20827L5392l0710K7294j2018L5715K2476L2662K3910j02446
9091a13074q6448M497k6743N4993P1043m2491o105P5405N8507l0134p0659J03443
9079g766q453J5702Q2688j4676o8398q5648j40560K2395J57638J27626o8032q7540
9067g5024r4813L1674J50574k5650j31627K7761J07199j05895P609J42486N8727
9056I3021l451j99083k0872m4470J1621P9000R9852K9292K2800q7126j26818r4698
9044b40932m4829J31930J39651j3716M3410J2964l0367j6404J4164K6598R8218
$$ y = [-28743, -572, 15330, -44992, -117805, -44434, -68688, -17150, -24115, -8303, 35024, -82804, -150444, -167355, -148685, -164326, -135413, -90487, 39469, 78964, 6604, -130819, -223762, -70244, 12430, -24522, -145349, -109957, -140667, -113373, -125391, -89676, -67200, -34538, -10628, -113074, -199522, -195025, -221768, -166775, -95732, -138223, -144328, -68923, -10416, -40550, -111209, -7766, -16219, -517, 82171, 67495, -903, -86551, -227111, -204716, -47078, 80548, 12516, -75024, -169837, -138163, 12411, -13239, -144866, -117105, -9906, -115801, -108192, 34294, 93021, 89570, -109513, -130385, -174855, -163234, -84234, 15618, 44910, 67710, -19416, -146234, -240932, -285761, -153831, -14180, -27896, 15514, 28478, -1889, -18293, -4129, 22469, 120687]
9033A20687O7118q8092n0974J9780K484p9981p8077r932O003m0639n3487M9718
9021a35392R2156r8396m4696N4749L7159K8060j11226n1093O918m447K9455J13327
9009h3426P6738q0093J0646n3805O7649O4066m8044m9614l7588l6J0710J02657
8997b0140L2216m5008j570P8913P6103j9996o1612J8761O4941K9625j37411o4641
8985d9819n8720Q7320L864k2751M1705L0980M8262l7753k6697k6982j16269M9959
8973g6901P6792O9716j7665l5888R2118K7073N87j46386j34581N3449J26874q7403
8961e2215j05400K6735P8857R441m2833Q8892N9744J0780O353R265n7287n0470
8949a8138N2995Q9026k2246m7742n3643k4117l7484r2466L0387J13992j9751j42443
$$ y = [120687, 187805, 99713, 48739, 68519, 71003, -8978, -87055, -96987, -90984, -131623, -185110, -135392, -43236, -141632, -186328, -131579, -94420, -66360, -177586, -228679, -221761, -226208, -196753, -83426, -6688, -86781, -76135, -129940, -62291, 1775, -46269, -95883, -133471, -133507, -122797, -20140, 12076, -32932, -34502, 44411, 120514, 100518, 38906, 57667, 122608, 152233, 14822, -49819, -108539, -21219, -17355, -40106, 1599, 32579, 80841, 43088, 16391, -10591, -126860, -76901, -109, 69607, 51942, 16054, 108172, 135245, 135832, -10554, -145135, -91686, 35188, -52215, -157615, -130880, -52023, -42582, -85415, 3477, 63221, 74001, 80354, 89619, 32332, -18138, 34857, 123883, 101637, 53895, 252, -23865, -61349, -153815, -123428, -9436, -29187, -171630]
8937a71630J9971j2239J4783R2642R2118o108K3528j3221j6673k0041o5267o2247
8925a24384L680M437K2866M7915k1341Q0656J38583M8085o8362j21034k6472l1602
8913d6973n2318J2372K6350o2030R0847M9591q609n6261r3246r8394K5185M6149
8901a67337K2828N4622O9032j7743k5903J228M9477P9090O1483p4856J551O2912
8889A16384o2507j16286j445n292M4816k8732K2042Q5669N6126p7631k8176K1586
8877B6554o0684Q158j4234n3053l8939Q1624J8446M247J168k4590j9535K796M9461
8864a8581J344J9295j7117p0519n0382K0728J33373L2766n0619q0833O562q711
8852h2694M4119N494r2437P1465l6227n2143R1178Q6655j48209l7326L2389R9695
$$ y = [-171630, -151659, -163898, -149115, -56473, 35645, 29537, 53065, 39844, 23171, 3130, -62137, -124384, -120704, -116267, -93401, -45486, -66827, 13829, 152412, 200497, 132135, 11101, -15371, -46973, -99291, -86919, -60569, -122599, -31752, 17839, 9230, -47031, -140277, -238671, -213486, -167337, -144509, -89887, -20855, -38598, -64501, -63273, -13796, 65294, 126777, 51921, 53472, 116384, 53877, -62409, -63854, -69146, -24330, -53062, -31020, 54649, 110775, 33144, 4968, 26554, -34130, -25972, -40206, -93259, -132198, -50574, -32128, -27881, -26713, -51303, -70838, -68042, -18581, -17237, 2058, -15059, -85578, -135960, -115232, 18141, 50907, 288, -80545, -73983, -82694, -38575, -33081, -125518, -54053, -90280, -142423, -51245, 35410, -112799, -150125, -117736, -18041]
8840a8041J23691j281m6011j56755q0983Q2686J08028q445r1342J9839J60756
8829I2142R3695l2976j6088o0952n0444k0824J5904j5235k8901k015O176r4574
8817a14092r6652J79875O4170J295Q3402Q5625q9099r9932m1437N0366N34R22
8805B4977J740p2610o7055J4319j0859M0909Q4032O6147l1802j32530L5883Q9109
8793D2260M3326L4647n4447n6165j26529l7425o2661J0064K7067L8347J5794l6091
8781a61813Q8474J00571k2352P7021L2932J0364r1075j17895L6857O8181j09640
8770h8375k7242m4375N1026J26746j091n8647L8600l9547O401J2828J05882J09151
8758A91357m8159l4149n7619j31920k07N4696k6547n8455m5793p2150P0505J07173
$$ y = [-18041, 105650, 104369, 58358, -98397, -179380, -96694, 11334, 2889, -88453, -68614, 92142, 185837, 152861, 136773, 75821, 25377, 4553, 20457, 5222, -23679, -25694, -19518, -114092, -210744, -30869, 33301, 34596, 117998, 203623, 114524, 14592, -26845, 23521, 24055, 24977, 26717, -45893, -112948, -98629, -109488, -68579, 15453, 81600, 49798, -82732, -46849, 42260, 85586, 120233, 65786, 9621, -116908, -154333, -216994, -206930, -179863, -141516, -125722, -161813, -73339, 27232, 4880, 81901, 114833, 125197, 34122, -83773, -46916, 21265, -88375, -115617, -159992, -108966, 17780, 16689, -41958, -3358, -42905, -36504, -23676, 82206, 191357, 143198, 109049, 51430, -80490, -80697, -26001, -52548, -111003, -156796, -228946, -158441, -51268]
8746e1268k5281j8555K4416o3967L3803m668R0902k4238K4k7068j1116K3581N9391
8733E956J2681m5053K5564K37p933K9149k8588L5996k6434j9620q2571r4418m8870
8720b43904l0259K3604M7125J630L9526m0898M3207j1733l7736j8108O4338M6113
8708a17095N1587k4883n7345J1741L0993J14385O4235j0223l0393j05305o3118
8697a35421J01599N2346p7418j5861L5644Q4074M023l0638l1935L2576k9419r6846
8685a07276L6642O7378l1891r97o471m4942K9528K0950j37611n2527O0124N7412
8673a09681R28J6399N876l1564J2518K9317J5983m8968p28M5952K8672j1050L4494
8660a1852O0004n4116j08862o5193J3286K4889j9835Q1274L8978j6477l6742r939
$$ y = [-51268, -76549, -95104, -70688, -134655, -100852, -105520, -14618, -38856, -38832, -65900, -77016, -53435, 5956, 18637, -26416, -852, -615, -8548, 20601, -7987, 28009, 1575, -18045, -100616, -195034, -243904, -274163, -250559, -203434, -201804, -162278, -203176, -159969, -171702, -209438, -227546, -163208, -117095, -65508, -90391, -147736, -135995, -105002, 9383, 73618, 63395, 33002, -72303, -135421, -33822, 18524, -58894, -74755, -39111, 44963, 48986, 18348, -13587, 18989, -10430, -107276, -70634, -3256, -35147, -36144, -42615, -87557, -58029, -37079, -174690, -227217, -167093, -109681, -108753, -92354, -86478, -118042, -105524, -76207, -60224, -109192, -109920, -63968, -35296, -46346, -11852, 48152, -5964, -114826, -180019, -166733, -141844, -161679, -80405, -41427, -57904, -94646, -104585]
8648a04585K6182J8993j15587l7015J00162M1090L1037J9034L9205N5611J6159
8637I0286n9047m4082k9628o1942n1011O1516N5638j7486J6347j0644m9873l3841
8625a33767M3722J24670O4198n5169m9392q260K3448l6438M599m5491N2587Q9678
8613G4385J3528j01113L7234J14462j8045m9640j792l2035M877m3774l1156N7787
8601B4718j1667P6559k041l89K6667J3054n703j0397j5335L6723M2542J8038n213
8588A87556l1577k834j41o358o3772l3061j607j8322O3423O9245J9116k3373p978
8575A50317L1313k8262j7028N543R61K1953j3660o3083K1267M3755M5379r0988
8563A07467q081l4231j2878l012M4965L0078M2179p1608k0769m1616o9469k6550
$$ y = [-104585, -78403, -59410, -174997, -212012, -111850, -70760, -39723, -20689, 18516, 74127, 90286, 31239, -12843, -42471, -104413, -155424, -93908, -38270, -55756, -39409, -50053, -99926, -133767, -90045, 34625, 98823, 43654, -5738, -13998, 9450, -26988, -22389, -67880, -15293, 74385, 87913, -13200, 24034, 138496, 120451, 70811, 69019, 36984, 41861, -1913, -33069, 24718, 13051, 89610, 87569, 87180, 113847, 126901, 121198, 110801, 95466, 132189, 174731, 192769, 187556, 155979, 153145, 153004, 146646, 82874, 49813, 48206, 29884, 93307, 162552, 181668, 158295, 150317, 181630, 153368, 136340, 141883, 142844, 164797, 151137, 88054, 109321, 153076, 198455, 107467, 99386, 65155, 52277, 49265, 94230, 124308, 166487, 94879, 74110, 32494, -36975, -63525]
8551f3525O480k8559m9449L2903j4861J43870R149q187k7030p7513q1069q27k3655
8538a82273q971L1937l6022J16483J01576K7656N7047p0679j0592l5270N1913
8527D2805L0841J239n3175L1898L8144j9989k2730o925p6894m6636k0961M5968
8515e6415q180l115J0937K4630l296m4866J1256j5142K8398k0234l5174k8444
8503a39645J9356j9358q129n0979K811L3042J67614J05770l7178J35315J03105
8492C11724K9545j67947j67852M5402m6413r0118N9051R4734p255L0321q5164
8481F028p3515r0062J03859K5842n7343M9893J8390o6091l4746m734j416K2504
8469a01391J4930O0485L0306m7127j06447N0960N9461P6102K9015k4262l0750
$$ y = [-63525, -57045, -85604, -135053, -102150, -117011, 26859, 36008, 27821, 791, -76722, -157791, -158618, -182273, -191244, -159307, -195329, -78846, 22730, 50386, 107433, 36754, 26162, -9108, 42805, 73646, 74885, 21710, 53608, 91752, 71763, 49033, 42108, -34786, -81422, -102383, -56415, -64595, -67710, -56773, -32143, -35439, -80305, -69049, -84191, -55793, -76027, -111201, -139645, -120289, -139647, -147776, -198755, -195944, -162902, 4712, 110482, 73304, 208619, 311724, 341269, 173322, 5470, 50872, 4459, -85659, -26608, 68126, 60871, 91192, 6028, -67487, -157549, -53690, -27848, -85191, -35298, -16908, -82999, -117745, -122479, -123895, -101391, -86461, -25976, 4330, -42797, -149244, -98284, -38823, 37279, 66294, 42032, 11282]
8458A1282M6909l5152n9094N4070J1486K618p6330q3513l5132P7012J22156Q2199
8446A18511L2330L3529q7659l5537N06o054K4517l4313l3415m7254p0833K5798
8434g9874L3046p1718m9293J14462K3209O3241P0595K6883r0141j02315o953Q6727
8422A7869Q9963O3652R629l0953J6501l2706n2052K9025r1605m2606Q556O8197
8410E3470J20846k0826j80059l8973L6223P5141k4684j09410m8210q4510J9062
8399b01930R8128O8468l2914J9111N6313J6923K8112O9341m5469j10270j4428
8388d8615j25K4113k2789J6121o787n493K2756p638j1903J29776P451j17481n0957
8375g1571K9376J02309k9033n1263m3616o2971R770O6901m851J14429O2673n6513
$$ y = [11282, 58191, 23039, -36055, 18015, 29501, 32119, -44211, -127724, -162856, -85844, 36312, 118511, 150841, 184370, 96711, 61174, 61680, 55626, 80143, 45830, 12415, -34839, -105672, -79874, -46828, -118546, -167839, -53377, -30168, 33073, 103668, 130551, 40410, -61905, -68858, 17869, 107832, 171484, 181113, 150160, 166661, 133955, 81903, 110928, 19323, -23283, -14727, 53470, 174316, 153490, -26569, -65542, -29319, 45822, 21138, -88272, -136482, -220992, -201930, -103802, -35334, -68248, -49137, 7176, 24099, 52211, 121552, 76083, -34187, -48615, -48740, -24627, -47416, -31295, -38082, -43575, -20819, -28457, -40360, 89416, 96867, -20614, -71571, -42195, 60114, 31081, -20182, -63798, -126769, -116999, -50098, -54949, 59480, 122153, 65640]
8363F5640j25256q4600M134k4590N7165P560Q2112j8606K6585p8300l2215O3229
8351e7142j3323o6362L2042L6864M6443J2750q5303q66P0276P2968j01690n6011
8339a09354O3933n0231k9396K3574n6872N3406M0343p8761N851R7877O3991M5502
8327F9863p6422Q7460M6593o5622r6080l3173j8171M1412J7179o6088j47570J5107
8315b25512J03633M0322Q8823J2522n3386l0213l0293N3113P8017m1357N0647
8304D6316K0460K3623o2745l3802n574j03554N9185Q1229L2951q458L6299l270
8292H2660n5471R882Q548m901l7273L2549j4646J28370O0758k6998l7820j83875
8280c8217n5002P1516R3971J03320j17063j00408P6143P5185p679p4779q0206
$$ y = [65640, -59616, -144216, -140082, -164672, -107507, -99947, -17835, -36441, -9856, -88156, -120371, -57142, -70465, -136827, -104785, -67921, -21478, -8728, -94031, -94897, -24621, 48347, -53343, -109354, -45421, -95652, -125048, -101474, -158346, -104940, -64597, -143358, -137507, -39630, 24361, 69863, -6559, 80901, 127494, 61872, -34208, -67381, -85552, -44140, -26961, -93049, -240619, -225512, -121879, -81557, 7266, 19788, -33598, -63811, -94104, -40991, 37026, -4331, 46316, 66776, 90399, 27654, -6148, -11722, -115276, -56091, 25138, 58089, 49631, 85930, 82660, 27189, 37071, 45619, 40718, 3445, 35994, 21348, 149718, 210476, 183478, 145658, -38217, -93219, -21703, 72268, 175588, 58525, -41883, 34260, 109445, 101766, 26987, -53219]
8269e3219M6927N2890Q302l2146O44l3676l4372n1162l542J29549k2381P2624
8257H0438Q5833R902j00343q3544m4186L5659N1476K5881K257O3p8121o3750o8083
8244a46518J15815K9683m7172m7341j0114l1554P8733n6129o8298J23503j2620
8233g2012N9437Q0264j1046r5761k144j91j5086L2608O8053O6304K4430l7016
8221I7840j26427L1906N164n0427N3112n229q5856l0113j0445j7780l020L2671
8209a08604P7333L8795N5208j12910o0255p4605Q2362J28839O6024q7927l9317
8198c5057L1034n1509m5464o244L1005J4881M2209o6684q788R9479M9447L0186
8186H4495K8503k9646m5943q085l129n5989j5650J13102O1513l1277j9876m7042
$$ y = [-53219, -6292, 46598, 54900, 22754, 23398, -10278, -44650, -95812, -99354, 30195, 7814, 80438, 166271, 176173, 75830, -7714, -51900, -16241, 35235, 61116, 63373, 63436, -14685, -78435, -146518, -30703, -1020, -48192, -95533, -105647, -137201, -58468, -114597, -182895, -59392, -72012, -12575, 67689, 56643, -39118, -41262, -41453, -56539, -23931, 44122, 110426, 134856, 97840, -28587, 3319, 8483, -41944, 11168, 5939, -79917, -110030, -120475, -138255, -141275, -108604, -31271, 7524, 62732, -50178, -110433, -185038, -102676, 26163, 92187, 4260, -35057, -4023, -55532, -100996, -107240, -76235, -61354, -19145, -85829, -94617, 4862, 54309, 84495, 112998, 83352, 37409, 29324, 26195, -29794, -45444, 67658, 129171, 97894, 78018, 30976]
8174C0976q5749o281N4244m718K3326o0199l2303P9611l4497J2214P722J07356
8162I1702J7364k8921p8823n0406k562l879L011l2112o4318n7408N7327P3011
8150g6014P9029J3589j3379q188K9184n0205j312o0882o8411R2593Q0381N9269
8138G5654l7758k8511J4205o9740r898R8967R1083r3025j08254P6906J14359R724
8126A33712p7926n1589r5217J7323Q5904r8595l690r0523n3316N0120r975N9497
8114a34275Q0422J08705L477j30458P734P1681N49p8853m048P9365K94p4990k8519
8101i8916Q8155N1044k9526o130q619l6073J67887K3909J6949L4905m2243q2609
8089G8733j81679j5298J23391O5114J8076N4749l5225K4014m0649l6100k5425
$$ y = [30976, -54773, -61054, -6810, -11528, 11798, -48401, -80704, -1093, -35590, -23376, -15654, 91702, 109066, 80145, 1322, -49084, -51646, -55525, -52514, -84626, -148944, -206352, -149025, -76014, 3015, 16604, 3225, -4963, 24221, -25984, -27296, -88178, -156589, -63996, 16385, 75654, 37896, 9385, 23590, -46150, -56048, 42919, 134002, 40977, -67277, 9629, 123988, 133712, 55786, 4197, -91020, -73697, 12207, -86388, -90078, -180601, -233917, -183797, -193772, -134275, -53853, 54852, 58329, -72129, -64395, 7286, 7835, -71018, -75066, 4299, 4593, -70397, -98916, -10761, 40283, 10757, 4627, -3992, -40065, 127822, 151731, 168680, 203585, 161342, 78733, -102946, -118244, 5147, 70261, 88337, 143086, 107861, 131875, 91226, 55126, 29701]
8078B9701l4822K0978N5855L6994j0632k8577m2994o196m2312j3834l0943m8808
8066a15590P7645J25917K2409k2714n4888q8354L2759K6768o053k384O967K4353
8054B6835m9328m8778J00957K6957n8416j1520J0354l2240j26355q2706l8263
8043b82503J16567M9543k4105K1258R653J0665o8847j6246K4262L6180R8691K3423
8031a459J19425O3929J3665q8161n2929M0320o3648j10240l5781P9933O1425M417
8019C0896m8642j7993m9211O069K9879J1340J64094p7067n2514q5824m5636k5005
8007a59614L0221M7961R420L0746k0557m285j1665M4300L643k6553K3620J145
7995c1618Q2702m3800q5312n3468j8104N3499K5315M0485K990Q029p2705L7635
$$ y = [29701, -5121, 15857, 71712, 108706, 98074, 69497, 26503, 20307, -22005, -35839, -66782, -115590, -37945, 87972, 110381, 87667, 32779, -55575, -22816, 3952, -2101, -4485, 2482, 26835, -22493, -71271, 29686, 56643, -1773, -13293, -2939, -35179, -161534, -244240, -282503, -165936, -116393, -140498, -119240, -109587, -98922, -167769, -184015, -159753, -123573, -24882, -1459, 117966, 181895, 195560, 107399, 54470, 94790, 31142, -79098, -114879, -34946, 26479, 30896, -17746, -35739, -84950, -78881, -49002, -37662, 126432, 49365, -3149, -88973, -134609, -159614, -129393, -81432, -72012, -41266, -61823, -66108, -77773, -33473, -29830, -56383, -32763, -31618, 51084, 7284, -78028, -131496, -149600, -96101, -70786, -30301, -27311, -19282, -91987, -54352]
7983e4352J41439Q8552J0296O174k4452j6466L1550Q8599J0715j8298j50722p536
7971A05499o2376j6588k1864K5078P7621l1488M3873J6379k3591l4028k8753J563
7959E1325r2592j23422J41900J5488n6239l4729K352J24964q967n6360l1833l3362
7947a01475O755L622l8413N2647J9294m332k9022Q4698j1590J3977P1657R8168
7935A65986N7836K3861o7345K5084L2814N7023J3955l7096l839p283N4111l496
7923C11611j1138j42006p2764l9115N823j7615j1421n0301o5041j6521O1342N400
7911d1746J6331M5998m0527m986N7227J8719r100m2634J16291k561n7090n7681
7899a759o1165K4122M8690n7511k1468O0719J654j8944Q3023O4105j0685L5513
$$ y = [-54352, 87087, 175639, 185935, 192109, 167657, 151191, 182741, 271340, 282055, 263757, 113035, 105499, 43123, 26535, 4671, 29749, 107370, 75882, 119755, 136134, 112543, 78515, 49762, 51325, -41267, -164689, -22789, -7301, -63540, -98269, -95917, 29047, 20080, -36280, -68113, -101475, -94720, -91098, -129511, -76864, -57570, -61902, -90924, -6226, -17816, -3839, 67818, 165986, 223822, 247683, 180338, 205422, 238236, 295259, 309214, 272118, 268279, 260996, 315107, 311611, 300473, 158467, 85703, 46588, 52411, 34796, 23375, -26926, -91967, -108488, -47146, -41746, -25415, 20583, -19944, -24930, 32297, 51016, 41916, -718, 115573, 113012, 55922, -1759, -62924, -38802, 9888, -47623, -69091, -8372, -6718, -25662, 57361, 121466, 110781, 146294]
7887A46294j3520k4492q5321J9567J08191N9823o4173j11423j65632p2791K4177
7876a79300N9012J14011M6140j7560M8253P3299j2866o4553o1276n0165j3712
7865e8717k9326k6452N2698j4764k9977Q3154r838O4926N8171o2225o9243L6259
7853e334l3061o7737M4495o3734Q1517N0803k7130J02172M8122r5701j36334p5160
7841a77082k315Q3378K758N5226N8049o7538J365J05258k1344N814R7699N8273
7829A99541J7974j49637k7402J6416M3062J6979j09338p8236l5545n9708J7178
7818a48716q641J16340M6297j1302L476N3569j6113n0690M5606O7333q0673j69562
7806a53076O2565Q5270M6122l2134k1134J366k5596q9633K0393O4654M0079J8813
$$ y = [146294, 132774, 108282, 22961, 42528, 150719, 210542, 146369, 34946, -130686, -203477, -179300, -120288, -6277, 39863, 22303, 70556, 143855, 130989, 66436, 5160, -45005, -58717, -88043, -114495, -61797, -76561, -106538, -23384, -33222, 31704, 89875, 27650, -41593, -5334, -38395, -106132, -61637, -125371, -43854, 6949, -20181, 81991, 130113, 34412, -101922, -177082, -179397, -96019, -93261, -38035, 20014, -47524, -46159, 59099, 37755, 43569, 141268, 199541, 217515, 67878, 40476, 56892, 99954, 116933, 7595, -70641, -106186, -165894, -148716, -157357, -41017, 5280, -6022, -2546, 51023, 34910, -15780, 29826, 97159, 16486, -153076, -90511, -5241, 40881, 8747, -12387, -11021, -36617, -126250, -105857, -41203, -1124, 17689]
7794A7689Q1398j480M6159j05451r2300j0739r538P6604P098L0163N3420N4836
7782A47859k4470j96725l7932M3095J194L1736M169j37948q1359N4174L7235o367
7770a65339R3720j8525k2176N7504K7893p2599n9245P7981L3148l3149j2191l4453
7758a27431L7116k4624M3454k4555P7844r1068J7048N5616n982l5979N7400O3825
7746D2664K9774k8186m9713n0678j1601N3850N4569N5441k088L2335j25642n9268
7734e8543k8681Q4579J1593N1853j143O410j7766Q5036n4623j04185K3563l2205
7722c4112N1860O6718r465n7911k0259J100l9424J1969M0980M2909l1610J7905
7710D0660J5727m8517p3683M8168J5804N6006K782L1674M953j51679q1752K3460
$$ y = [17689, 99087, 97607, 143766, 38315, -53985, -64724, -74262, 2342, 9440, 39603, 93023, 147859, 123389, -73336, -111268, -68173, -66979, -35243, -31074, -169022, -250381, -196207, -158972, -165339, -71619, -90144, -112320, -54816, -26923, -99522, -158767, -80786, -47638, -80787, -92978, -127431, -90315, -114939, -71485, -96040, -18196, -109264, -92216, -36600, -42582, -78561, -21161, 42664, 72438, 44252, -5461, -56139, -67740, -13890, 40679, 96120, 94032, 126367, 725, -58543, -87224, -2645, 8948, 60801, 59658, 66068, 48302, 133338, 78715, -25470, -1907, -34112, 17748, 84466, 75001, 17090, -3169, -2069, -41493, -29524, 11456, 54365, 22755, 40660, 56387, 7870, -65813, -17645, -1841, 54165, 56947, 88621, 93574, -58105, -139857, -116397]
7698a16397L012O2681j7269j38395m4888M6512Q4881K6888P8813N6981r4990l3920
7686h6091Q2649o1689m6671L9651J9887L2187K000j7206o599J7398P4560n4714
7674d638r0894K7712o00O5629l8062O4771n9709l3139r2505J048m5831M8471J11543
7661d6204L6097J9527O701J6227j0302l848q4002k7039Q2849J14496M1268L2760
7649A78530K228r4315r9523L3897N9374l9312p39r7848m2136L9333M1871l5806
7637e4446k9644N5729O5172K7880o5032L4398m1592J3736K2390l6709k4010K9678
7625b450P8170r2346n3027Q06K8780L0290O3553n3787j4009J7017L865O4337M1426
7612A12625L2996m7891j22368M9364R3619J0842p1585r4234K7102O1734j5644
$$ y = [-116397, -113385, -50704, -67973, -206368, -251256, -204744, -119863, -92975, -14162, 42819, -52171, -86091, -3442, -65131, -111802, -72151, -52264, -20077, -18077, -35283, -41882, -24484, 50076, -4638, -95532, -67820, -68420, -2791, -40853, 23918, -35791, -68930, -161435, -160387, -206218, -157747, -46204, -10107, 9420, 16121, 32348, 22046, 18198, -65804, -92843, -9994, 104502, 145770, 178530, 180758, 86443, -13080, 20817, 80191, 40879, 40140, -57708, -99844, -60511, -18640, -54446, -84090, -28361, 36811, 64691, -341, 34057, -7535, 6201, 28591, -8118, -32128, -2450, 75720, -16626, -69653, -68847, -40067, -9777, 53776, -11, -14020, 2997, 6862, 71199, 112625, 145621, 97730, -24638, 24726, 118345, 129187, 57602, -36632, -9530, 52204, 36560]
7601C6560q3088l4753L80P4117N2876K7789q6250m2680O6099j9871M2963k3007
7589A1135l6184K0733L6152K8834K7417m0646N485m9406N98M471P3077M5942p2056
7576E5552q5749J9892N408j3533R0805L3468L1736m1088n9095l6783o3438L4240
7564b8585N7972J4096L911M2717N7863M2609m0965k6747m9367j25875k1656K01974
7552A27947O2149n7716k0800r5912N905J9908Q348j37254j42015L7837J41624
7541d9979L9259O4465K0502j13682q7155N3207k1387o1048k9501N7766J10651
7530a6902J5583K2943J25681M7408p1936k08835r7809p304L9489k745l6550N5694
7518a35283R1298K1466n5741L4215n5O869j4342m1442m2071N4077M4751P6684
$$ y = [36560, -46528, -81281, -80901, -6784, 46092, 73881, -12369, -55049, 11050, -8821, 34142, 11135, -25049, -4316, 31836, 60670, 88087, 47441, 52926, 3520, 4118, 8589, 81666, 127608, 55552, -30197, -10305, -4897, -18430, 72375, 105843, 137579, 96491, 37396, 613, -62825, -28585, 29387, 43483, 47394, 90111, 147974, 190583, 149618, 122871, 73504, -52371, -74027, 127947, 190096, 132380, 111580, 15668, 21573, 41481, 49829, -87425, -229440, -191603, -49979, -10720, 53745, 74247, -39435, -126590, -73383, -94770, -155818, -185319, -127553, -16902, -1319, 21624, 147305, 194713, 122777, -86058, -183867, -191171, -151682, -154427, -190977, -135283, -43985, -22519, -78260, -44045, -44100, -37231, -51573, -93015, -135086, -81009, -36258, 40426]
7506D0426l378K2824k8854n6771m4218J3334O7019O3362o7143R079J8381l3057
7494A004p2362R8661J9148O605j37947M205O0315M2353M9535N9678J3351m2072
7482A02474n640Q1578l1287j50631m7779L7060O8465J1720J6749k0725N500o586
7470F0898j01636o817K3182L5427R0641N5665o0028q7042l9855J3880L813k5918
7458c7790M1826R853k5341l057O0204M2236N896j4447k22408j4240m629o2052
7446b23949K8490O2405k8441J05828L4322J5316L8761K7747j30927l9330J5763
7435i4015m804p7189R435O3480J04963O2767k9807r5988n4322l6407R0039O6761
7423D913n2879j38737q01J38487m797P3232J33558m2885L8426N8604r308j21771
$$ y = [40426, 37048, 59872, 31018, -25753, -69971, -56637, 10382, 73744, 6601, 15680, 34061, 1004, -71358, 27303, 46451, 53056, -84891, -80686, -20371, 21982, 71517, 131195, 144546, 102474, 96834, 178412, 147125, -3506, -51285, -14225, 54240, 65960, 82709, 61984, 67484, 60898, -40738, -47555, -24373, 11054, 101695, 157360, 97332, 10290, -29565, -15685, -11872, -37790, 4036, 13889, -11452, -14509, 45695, 87931, 93827, 79380, -143028, -157268, -161897, -223949, -195459, -133054, -161495, -55667, -21345, -6029, 32732, 60479, -70448, -109778, -94015, -98819, -176008, -166573, -103093, 1870, 64637, 34830, -61158, -115480, -151887, -61848, 4913, -47966, -186703, -187504, -49017, -53814, 19418, 152976, 110091, 148517, 207121, 197813, 76042]
7411G6042q2569p694K7980n0875k0803P3239j8210M0126j23116j1957J37914J9940
7399F0017j28612K0847m0607l604J05082l2055k0183n9231j5297n8573J5906J32585
7387b3725J51538L6305Q4053m3416r4607M3843J07902L1916r4714j11077k6575
7376F1443k0342o4223Q1767P6846L5624p606q5569j12172j0123p9889q0444M9477
7364a55211J15202J8222k2938N1247M984r0712l6125K7993N8108J32697n859q4440
7352A3168l7509l3838o1111L0605Q0684j5547j5243j2028j3227p3190J05190n1389
7340h3435J5418J01316l3206o2064O7720j7502j0922p5881j15439N5456P8618
7329g9921P4217L014O8317n8202L3192m3514n5521K6107K8772p2325N638m9385
$$ y = [76042, -6527, -14221, 13759, -37116, -57919, 15320, -2890, 37236, -85880, -97837, 40077, 60017, -68595, -47748, -88355, -91959, 13123, -18932, -39115, -98346, -113643, -172216, -156310, -23725, 127813, 164118, 248171, 204755, 110148, 153991, 261893, 293809, 199095, 88018, 61443, 41101, -23122, 58645, 135491, 171115, 163509, 77940, -34232, -44355, -124244, -204688, -155211, -40009, -21787, -44725, 6522, 11506, -79206, -115331, -87338, -29230, 103467, 97608, 13168, -24341, -58179, -119290, -88685, -8001, -23548, -38791, -50819, -64046, -137236, -32046, -83435, -68017, 33299, 93, -61971, 5749, -11753, -22675, -98556, -213995, -158539, -79921, -5704, -2690, 65627, 7425, 40617, -2897, -58418, -32311, -3539, -75864, -70226, -119611]
7317a19611r4566J13183J36375j5851o6197l0448p6468Q2526K0917L0172L0027
7306A0059K4081J3108p397K3100j4443m8392n4327L5849n5577O3828M3692q9967
7294e6386k4801K3507j0255m4556K6313L0314K7296O7390J17782J0852j12811
7283E4645k6668o131J2265l3681j18591J1200M1234M8268o5932r3713L0716N6852
7271h9536N7802L1671l9134L9467L4364J0949K7937m4758J607p3928l5245R4550
7259A5746L4456P4874l0838j05435q2889K465N6446j5054j2650N3193N1942L7530
7247G9786o4652j02873p3803j7119P1820K4M5204P7169J4390M6599n1953L2520
7235E7112o6468j6429R4273J39489j9633m5601j4760J8483N1914m4227q8222M1732
$$ y = [-119611, -214177, -100994, 35381, 19530, -46667, -77115, -153583, -71057, -50140, -19968, 10059, 34140, 47248, 39851, 62951, 48508, 116, -54211, -18362, -73939, -10111, 33581, -56386, -81187, -57680, -67935, -112491, -86178, -55864, -28568, 38822, 156604, 167456, 54645, 27977, 21846, 34111, 430, -118161, -106961, -65727, -17459, -83391, -177104, -146388, -89536, -31734, -63, -39197, 270, 34634, 45583, 73520, 28762, 30369, -43559, -78804, 15746, 50202, 125076, 94238, -11197, -94086, -91621, -35175, -50229, -62879, -9686, 42256, 79786, 15134, -87739, -161542, -178661, -106841, -106817, -61613, 15556, 29946, 76545, 24592, 57112, -9356, -25785, 68488, 207977, 188344, 142743, 127983, 146466, 198380, 154153, 65931, 107663]
7223A07663n475m6895n8579J4904r4795R618N9643O0228k2490q8857N4688k3818
7211c4165p5080l4329j07923L3742j5574L5273M6754j0201J6256J03144K1198
7200b0905k9834M1339J16702O0685j13247n9898O7730N355N062J2716K4044m008
7188A05741l4099k2320m2467Q0291L1569p6719L1946L2987k3728q6826J5375M7582
7176E9332L7127l3032l8599N2469P3368r6646j2960L5315O6584o8907m9261N5278
7164H0068n2476k490q2947j06033L0129O9979J07504O2955q3225j07913L1580
7153e2869J7802l6371K1097K6605j2261l0380K3966N6038M9006J03862n617l8787
7141A22091m4465q8432M818M524j0623L8638o54k0037j1389J9116M0006j351o255
$$ y = [107663, 102188, 55293, -3286, 11618, -83177, -73559, -13916, 46312, 23822, -65035, -10347, -34165, -109245, -143574, -251497, -217755, -233329, -198056, -151302, -161503, -145247, -42103, -20905, -50739, -9400, 107302, 167987, 54740, -5158, 62572, 67927, 72989, 85705, 109749, 105741, 71642, 49322, 6855, 87146, 118715, 41996, 73942, 106929, 83201, -3625, 11750, 59332, 96459, 63427, 24828, 77297, 150665, 54019, 41059, 76374, 142958, 74051, 24790, 80068, 27592, 25102, -57845, -163878, -133749, -63770, 43734, 106689, 23464, -84449, -52869, -35067, -71438, -50341, -23736, -35997, -66377, -42411, 13627, 62633, 166495, 160878, 122091, 77626, -10806, -5988, -1464, -12087, 26551, 25897, 5860, -5529, 13587, 53593, 52242, 45987]
7128D5987l517m0365o9732J2452o849j12721L2539J18042N4121Q6948l7187k5342
7116E4376l0442o475M2753M1766l5653r0205n8148k4295j2577r152N4650Q4932
7104A1530O2204L3072K976M3952j1915o5792J4300k7905j29131j1473K9747K5998
7092b2437M1049r0802J1567k2998L7167L6937J4642N4716J0594n6667m3744L9595
7080I619K7253p3450o7797p8520k1473p6283N7396J05121p481l2373J7202O1396
7068g9390j6482J2221K14J08589P9414N7953M6217q1114k8641n9880n7823J3664
7056e058L2641l3323k2913J9122r002m2435j1024p979q3605L7339J04613R0159
7044F8535r6391j53014p0800J22415R9917J2741N7034j13701q8683K6385J15055
$$ y = [45987, 42470, 2105, -67627, -55175, -62024, -174745, -142206, -24164, 29957, 116905, 79718, 54376, 23934, 17459, 60212, 101978, 66325, -23880, -82028, -106323, -118900, -128052, -73402, 11530, 73734, 106806, 109782, 153734, 141819, 76027, 90327, 62422, -66709, -78182, -48435, -22437, 18612, -72190, -60623, -83621, -46454, -9517, 5125, 59841, 70435, 13768, -29976, 9619, 36872, -36578, -104375, -182895, -204368, -280651, -223255, -118134, -125615, -157988, -140786, -79390, -95872, -83651, -83437, 25152, 104566, 162519, 208736, 127622, 98981, 39101, -18722, -5058, 27583, -5740, -28653, -9531, -18533, -60968, -71992, -79971, -163576, -126237, -21624, 68535, -27856, -180870, -251670, -129255, -29338, -16597, 40437, -73264, -161947, -135562, -20507]
7033b0507L4542j00887j8046l2919K6310l265N8067O6459O5768k662l3167l0999
7021H694k1414r7231m0739L5014J0139m2693o631M038j6688O7626J05968J4453
7009B0536o1599q5066M8114J06577j4744j4418k2571j2779K9580Q2616j18499
6998d2253j5841M4866m210o4275L054m062N4007L8149o2202L1776n624k4492k7064
6985g8171M0045M7452P4956l9597n4478K4832N7355o5974J2851j0108j62646L8851
6973a14632M395L4473P0613L2505P0850M366J0734l9424p9741l7215o5978J6751
6961i2303j1057p0762L6186P9831J0443N897L0163j14872o3913R8882R7621J6508
6949B2624q3080o9785l4939Q2189K719j447m6956p1549P0710P5183P7807l8236
$$ y = [-20507, 14035, -86852, -104898, -137817, -111507, -114772, -56705, 9754, 75522, 72860, 39693, 8694, -12720, -109951, -150690, -115676, -105537, -148230, -154861, -150823, -167511, -99885, 6083, 20536, -41063, -126129, -78015, 28562, 13818, -600, -23171, -35950, -6370, 76246, -42253, -58094, -13228, -17438, -81713, -78659, -82721, -28714, 9435, -52767, -20991, -26615, -51107, -78171, -38126, 9326, 84282, 44685, -9793, 15039, 72394, 6420, 19271, 9163, -153483, -114632, -110237, -75764, -5151, 27354, 98204, 102570, 113304, 73880, -5861, -43076, -109054, -92303, -103360, -174122, -137936, -58105, -47662, -41765, -11602, -126474, -190387, -91505, 6116, 22624, -60456, -130241, -165180, -82991, -80272, -81719, -128675, -200224, -129514, -54331, 23476, -14760]
6937a4760p3308K3318p6193o342j3162R7019K0129k6281o0187J1638Q7632Q6573
6925E6076N119m4870Q074l3063L1790q0158Q367p8109k6011j3857K823J19787
6913d4032O6468k9845n172K3319L8139n8462j15883J0961m505K5839N7120M4702
6901H649k7834p1080j59079q4810R1315Q6005J14200p6716K873J6816Q2237K6290
6889H866M1852j684j37149j16594J6350L430Q6549P4802L8299Q8425j23643M862
6877a5635K5368M653p4128j0854K8294l2621k8693N1510J07291Q0723q2402r0656
6865c7150o2113O7293L3556L828r415m2532j78186k4943N396N6727J44218J23848
6853H0527K3423Q2840n5659j10781j8312k9122L8132J831r9608j230J36166O144
$$ y = [-14760, -88068, -64750, -140943, -147285, -160447, -63428, -43299, -69580, -129767, -118129, -30497, 56076, 61195, 16325, 24399, -8664, 23126, -57032, -48665, -126774, -152785, -166642, -163819, -44032, 22436, -7409, -12581, 10738, 48877, -9585, -125468, -114507, -119012, -93173, -36053, 8649, -19185, -90265, -249344, -334154, -242839, -156834, -42634, -119350, -116477, -99661, -17424, 8866, 50718, 49034, -88115, -204709, -188359, -184929, -98380, -23578, 14721, 103146, -20497, -15635, 9733, 14386, -59742, -70596, -42302, -74923, -103616, -52106, 55185, 135908, 53506, -37150, -99263, -31970, 1586, 5414, -4001, -46533, -224719, -249662, -244266, -187539, -43321, 80527, 103950, 186790, 131131, 20350, 2038, -27084, 11048, 12879, -86729, -87959, 48207, 54351]
6841E4351q5801P8087J0784l4418N9978K3499m3714J9152m1969P051o7350k2188
6829d2538k9023o3740J03679k7911L7571j13510o6725M9814J6497J4909R4462
6818b6515N6084N1144N168p6562R370r29M3772O1030O8734M5870p6802n7323j33086
6805c0045o9499P7346M5902M1547J5161j00029k753m0329J1655L2857M8598l2735
6793b324P649K7661P5549l1776n0056o0789r690J60719n9075j24924q1016l4212
6781a82284K8217J04971J05639L5347q914P1020J3878q8551j29992l6817P4164
6770a3322J05907p7721j30064n7420R5850M831j0374L4051Q5077K5224q5876o8240
6758i2077m7011M6858J06412Q1264j3104j8704r257k0948M8400k0588m8433m7239
$$ y = [54351, -31450, 46637, 57421, 23003, 82981, 106480, 62766, 81918, 39949, 47000, -20350, -42538, -71561, -135301, -31622, -59533, -21962, -135472, -202197, -152383, -135886, -120977, -26515, 29569, 80713, 85881, 9319, 18689, 17760, 61532, 122562, 191296, 237166, 160364, 103041, -30045, -99544, -22198, 23704, 65251, 80412, -19617, -22370, -62699, -51044, -18187, 30411, -2324, 5325, 32986, 108535, 76759, 26703, -34086, -43776, 116943, 57868, -67056, -148072, -182284, -154067, -49096, 56543, 91890, 82976, 153996, 167874, 79323, -50669, -87486, -13322, 92585, 14864, -115200, -172620, -76770, -71939, -82313, -48262, 36815, 62039, -23837, -92077, -139088, -92230, 14182, 95446, 82342, 63638, 54381, 33433, 81833, 61245, 12812, -34427]
6746c4427l5288p0522P5336Q8424o6453N4332Q1805k9158q9423o65m7977l2096
6734a06112N4422P2787r0328j3090M0111M4593J04552j8494j07218K4809J8419
6723B4451K1244k4149P9060p8281j15918N6231P9310l4261o9179r2787n5228L9626
6711a69881N4444L2134k2809j06146k7757O6963R6472J3735n8193J03400R3214
6700G5576n3488k7034P0513L0766L7356M3002M8900J7316j27406M3077l6152o3607
6688E8819l3882m6711k907l9226J5176q1082n9811k1560M4879M832J8300J8346
6676a24827O4729J6412K2425P269l3676L021k9139o2275K608K8803L264o324K7996
6663g9714Q2108m6049n3946J11388J18682n6462j52511l7144J42228k3691n1273
$$ y = [-34427, -69715, -140237, -64901, 23523, -42930, 11402, 93207, 64049, -25374, -26039, -74016, -106112, -51690, 21097, -69231, -82321, -42210, 2383, 106935, 88441, -18777, 6032, 24451, 45695, 21546, 100606, 22325, -93593, -37362, 41948, 7687, -61492, -154279, -209507, -169881, -115437, -83303, -106112, -212258, -240015, -173052, -76580, -62845, -121038, -17638, 75576, 22088, -4946, 65567, 96333, 133689, 176691, 225591, 242907, 115501, 158578, 122426, 58819, 24937, -21774, -24681, -63907, -48731, -129813, -189624, -211184, -166305, -161473, -143173, -124827, -60098, -43686, -21261, -13992, -47668, -44647, -73786, -136061, -133453, -104650, -101386, -107710, -79714, 2394, -43655, -97601, 13787, 132469, 76007, -76504, -113648, 28580, 4889, -46384]
6652d6384K9071J15430q3436J2768k2766j5124m4314p2565O4344R4552J0841m4506
6640b089n467J8165K7663L4412K9344q615j09689j12094n7389J39546J58569l1676
6628H0680q4915J1103k3430K6472n1000k0585m163k9328O1491J9282P5728K9478
6616I0813j53364O9903M6303O0889J18962m1733j8719j950r5408j37702l5868
6605i7874K4020j751L1772R3300J31103M1205n9406p5663l2932L6722k1508j4954
6593E4034n9098J152m446p3562L7241k3998j7085q934j6963k2180K0552P0629
6581d2658R4275J0262O5395K0625j61567m9594O0827J36k5255J0985k4395P8960
6569C7996K503r079j2822N6481m5630o4325o2615L6409K1868J1082M6607P0635
$$ y = [-46384, -17313, 98117, 14681, 27449, 4683, -10441, -54755, -127320, -62976, 31576, 42417, -2089, -7556, 10609, 38272, 72684, 102028, 93413, -16276, -128370, -185759, -46213, 112356, 80680, -4235, 6868, -16562, 9910, -41090, -61675, -65838, -95166, -33675, -14393, 61335, 90813, -62551, 7352, 53655, 114544, 233506, 191773, 173054, 171104, 75696, -62006, -97874, -73854, -75605, -43833, 49467, 180570, 221775, 162369, 86706, 53774, 90496, 68988, 54034, -5064, -3912, -8358, -81920, -44679, -68677, -85762, -94696, -111659, -133839, -113287, -42658, 51617, 61879, 127274, 147899, -13668, -63262, -2435, -2299, -27554, -16569, -40964, 37996, 40499, 31420, 18598, 75079, 29449, -34876, -97491, -61082, -39214, -28132, 18475, 89110]
6557H9110L4661J1370j8419j2582l0653k8408Q0954j9641q9517o6783k0038q491
6545g8437j2937R7208P1392o7332J3618O0413L5195r1133j08486L1746J3500M2696
6533G443J7054N1338l3098j5338K7515m9752o0628N4273O7164N308l757K6324
6521I3846q0175K5994J7360j01258M6847k229j36937k6347M3125p488O6919J44304
6509H3961P0897l8947k0672q8497o1217L3977M6427n9044p9656O9149m3456l8967
6497a26045k6787O0094l6244j2655Q9007l7236l6774k8105P4770Q944L2164J15174
6485G6307n4310p1032k6117j3648l0034M3608J48160J434j8885R0796l224j07107
6473C5948j10903k2450J24599R5474r8478r7376K3793O622j939P9669K6403j5646
$$ y = [89110, 123771, 135141, 116722, 104140, 73487, 45079, 126033, 106392, 16875, -49908, -69946, -78437, -91374, 5834, 77226, 9894, 23512, 83925, 119120, 27987, -80499, -48753, -35253, 7443, 24497, 75835, 42737, 27399, 54914, 5162, -55466, -1193, 65971, 71279, 67522, 93846, 13671, 39665, 57025, -44233, 2614, 385, -136552, -162899, -119774, -127262, -60343, 83961, 154858, 115911, 95239, 6742, -54475, -20498, 25929, -33115, -112771, -43622, -87078, -126045, -152832, -92738, -128982, -141637, -52630, -89866, -126640, -154745, -79975, -71031, -38867, 76307, 21997, -49035, -75152, -88800, -118834, -75226, 72934, 74368, 55483, 146279, 143055, 35948, -74955, -97405, 27194, 122668, 24190, -73186, -49393, -42771, -44710, 34959, 61362, 45716]
6461D5716r5408m0102K813j1688p792n486n0225O5241N9534n5547r5297m7459
6449b35700J15979Q7555M6739n6523o4515J4856p9683k1613R1419O6398J9530
6438a5558J07303k0543k6950k8301O163p8768O7268J29452j06799j00620j9982
6427h7335M4644R6612q2229j01472m006j6376N0114L2829J6167r0160o0041o5888
6415b67141L5045N4540P5668J0967M4579Q7814j2978N6522m5852N615p0522J15288
6403H9545j8536q9538r5139M7536R64j09686J27920J51589l239j8189L5758m479
6391A14506q5847q9937l8738J17483J39265J2838l4125p562p5517n6520K0797
6380A6643j2644l1335l9963L7548o5024O2162K8756n2555m9347L6354Q6735j59971
$$ y = [45716, -49692, -89794, -86981, -98669, -106461, -111947, -162172, -96931, -37397, -92944, -188241, -235700, -119721, -32166, 14573, -41950, -106465, -91609, -171292, -192905, -101486, -35088, -15558, 91745, 71202, 44252, 15951, 22114, -56654, 10614, 140066, 33267, -67353, -87335, -42691, 53921, -28308, -129780, -133786, -150162, -100048, -67219, -51052, -141212, -201253, -267141, -232096, -177556, -101888, -90921, -46342, 41472, 28494, 85016, 39164, 44779, -25743, 89545, 71009, -18529, -113668, -66132, -65168, -174854, -46934, 104655, 101416, 83227, 118985, 114506, 28659, -61278, -100016, 17467, 156732, 169570, 135445, 127883, 52366, -4154, 16643, 3999, -27336, -67299, -29751, -94775, -32613, -3857, -56412, -105759, -69405, 17330, -142641]
6368a42641j00865O8218N8327n373j42525J7325O3772J28670J08004J8133K1911
6357I2956p8375n4233l6941N3535q9438L5982k4283N7972J3219j23650L6583L355
6345a13318J5171J14273J3477R741P6705L3491r9050k4797J9120K1105J5541r9691
6333a8232J685N597j9867M2287M7978M0315k3991K1731K2697j1241n9400O9521
6321A19080O463q3349p5323o1992R3166k9116L3875K0999l2810o5343J5134P4659
6309A5443M9450k7089m6112M1090M7092q704j39850k2411j4189l9095L1165N8828
6297e4382j070L6119L417r5124j8759K5369J0650q02M7371Q6912k9604N592Q9677
6284A05366j08938j064l144L2673J054r6815p3619m0857J21742M6805M5221L7147
$$ y = [-142641, -243506, -175288, -116961, -122334, -264859, -247534, -183762, -55092, 52912, 71045, 92956, 14581, -39652, -76593, -23058, -112496, -76514, -100797, -42825, -29606, -153256, -116673, -113318, -98147, 16126, 29603, 39344, 116049, 149540, 50490, 25693, 44813, 65918, 81459, -18232, -16547, -10950, -30817, 11470, 59448, 99763, 75772, 97503, 120200, 108959, 49559, 119080, 125543, 42194, -33129, -95121, -1955, -31071, 2804, 23803, -9007, -74350, -59216, 15443, 64893, 37804, -8308, 32782, 79874, 71170, -68680, -91091, -105280, -144375, -113210, -54382, -55452, -19333, -15916, -111040, -129799, -104430, -93780, -94582, -47211, 39701, 10097, 15689, 105366, -3572, -4636, -7780, 24893, 25947, -70868, -144487, -185344, -63602, -16797, 28424, 65571]
6272F5571n8210j2763Q5927O0352Q8807J0234q1463j26498o8991P464L7781m4940
6260c6729l8587j4115k766P6130P1042J3420j5733M209R107k810l9853j22297
6248i8982Q8728n7758j7949Q9726n1461J087M7113R2603J11765p4957r210j8302
6236A02403L5760k7930p4602P4886K1148J0262q1427m3940l4369n8826l1715J3116
6224i5234j610N4223J11144r411r1558l0752N0502m2986r9576k7637Q0515Q7096
6212a5284j7420m934R6853J454o2152q1022R1719M8557o5358N212J2247K7787
6200C7659k3467O057J8654N3581J3146l0300M545j4586p4076Q4450k4452j6658
6188C4553j896O8565J903k9107q8716O0481m100K5447J7238J4288m838O351o3253
$$ y = [65571, 7361, -5402, 80525, 140877, 229684, 239918, 158455, 31957, -37034, -29570, 8211, -36729, -75316, -89431, -92197, -16067, 54975, 68395, 52662, 56871, 65978, 63168, 23315, -98982, -10254, -68012, -85961, 3765, -47696, -46609, 504, 93107, 204872, 129915, 120705, 102403, 138163, 110233, 35631, 110517, 131665, 141927, 60500, 16560, -17809, -76635, -108350, -95234, -96844, -42621, 68523, 59112, -32446, -63198, -12696, -55682, -155258, -182895, -102380, -15284, -32704, -37638, 59215, 60669, -1483, -82505, 9214, 57771, -7587, -2375, 9872, 37659, 14192, 20249, 38903, 92484, 105630, 75330, 79875, 65289, -8787, 75663, 51211, 34553, 32657, 101222, 103125, 74018, -14698, 45783, 41683, 67130, 84368, 98656, 93818, 100169, 36916]
6175C6916j2511j7494k4043l1907j8463p6838j5305M6207m8350j0243k4722Q5146
6163a11607J35571K1508p8187L1582N9252J30906K5520n2089r064j81437n6517
6152h4562n9405l9261k1339J3619M6996P9414N9786n562m7911K339Q547l730j402
6139e2471J12651j7801o6861M6866n1190p5731L8029J1615O0099K7082j57090
6128a24802l9510J14387R3640O2393M9196l0397L0578J9623r5376o534R798n871
6116G7125j11223L4679L7581n5228K6046k814K6927j5662L9018l5950O4919p589
6104G7829l1279o9819j03752k8325R3115N7647M4381K1999J6196l6978m2560j7627
6092a9173j17258Q214M3861J04666k7840l5155O8220k8856j2551k8000K1068j7046
$$ y = [36916, 24405, 6911, -17132, -49039, -67502, -144340, -159645, -113438, -161788, -172031, -196753, -111607, 23964, 45472, -32715, -1133, 58119, 189025, 214545, 162456, 153392, -28045, -84562, -143967, -183228, -204567, -190948, -143952, -64538, -4752, -10314, -58225, -55886, -47339, -51069, -52471, 60180, 42379, -24482, 22384, -28806, -104537, -66508, -54893, 5206, 32288, -124802, -164312, -49925, 43715, 106108, 155304, 124907, 155485, 175108, 79732, 73198, 82996, 77125, -34098, 581, 38162, -17066, 8980, 6166, 33093, 17431, 56449, 20499, 85418, 77829, 46550, -23269, -127021, -155346, -62231, -4584, 39797, 61796, 77992, 41014, -1546, -19173, -136431, -128217, -84356, 20310, -7530, -42685, 25535, -3321, -15872, -43872, -22804, -39850]
6080c9850k7234K2326R8367J1022q1604M3944J04466n0275j17110n8375N5553
6069c8770Q9322N7734K8318o6852l2602L7797j9292m9475Q0272O7140k2434l4019
6057I7139R84j3972l9436k7547j2925N594O4691l0397l0275K7008M5381k027L434
6044H7652l958k2521K413P1209Q1981O7184l5766j04175p4098Q3960K1962j16943
6032E8900j4915L6109O4231l2546o984l1322n6358L2831k611k9442J9742R7695
6020A35330J00837p2723j73023r4064N5926l185L9037P2408R6015N0389j07676
6009I9271j27488o490J12755J0081q6782J4750l536L1303k9801m0179J6596k6133
5997c5653k6625j9603N0950J16775K6801J0808j45301n0506l5423L2007N8167
$$ y = [-39850, -67084, -44758, 53609, 64631, -16973, 26971, 131437, 81162, -35948, -94323, -38770, 50552, 108286, 136604, 69752, 37150, 74947, 55655, 6180, 86452, 153592, 131158, 97139, 98123, 84151, 44715, 17168, 4243, 9837, 74528, 44131, 13856, 40864, 86245, 84218, 87652, 83694, 61173, 63586, 134795, 216776, 283960, 248194, 144019, 69921, 153881, 175843, 58900, 43985, 80094, 144325, 111779, 104795, 73473, 17115, 49946, 47335, 17893, 37635, 135330, 236167, 163444, -9579, -103643, -47717, -50902, -11865, 60543, 156558, 206947, 99271, -28217, -34707, 78048, 88129, 1347, 16097, 12561, 43864, 14063, -26116, -9520, -35653, -62278, -81881, -30931, 85844, 112645, 123453, -21848, -72354, -107777, -75770, -17603]
5986a7603n2424L2268L2120q2051R226M09q9809q474J72919P8810k283p4137m94
5973a523j691j14480m6725K4243n517l4114M5530O3895Q199j2896j8671J18375
5961B4625j9823N489L1210K6939l1508K3429R4121r706J2026j01542K8581m6598
5949C7243q141k2276p4381m9084J86001J05908L3889M4325o3737j16423m8160
5938B5164k869K3202J7714N6607Q1966n0887j3606o8026k7326Q8488M5473k4927
5926A50973j09150o7958j8372Q042j9689p845N8008Q5779q1041j4382K635j02689
5914a15689j5352L9740R7140k1445M9524m11q394P0299n4805l4574Q9386Q2463
5902A77882n4224r1075J1726k4861L4588R4186m7956m1515m0480j4034q5183K2616
$$ y = [-17603, -70027, -37759, -5639, -87690, -78464, -78055, -167864, -176338, -3419, 75391, 73108, -1029, -1523, -3214, -117694, -164419, -140176, -145693, -179807, -134277, -70382, -62183, -75079, -93750, 24625, 4802, 10291, 41501, 68440, 36932, 60361, 154482, 144776, 156802, 55260, 83841, 37243, 29102, 6826, -67555, -116639, 69362, 175270, 209159, 253484, 189747, 73324, 25164, 22295, 45497, 63211, 119818, 201784, 150897, 137291, 69265, 41939, 130427, 175900, 150973, 41823, -26135, -44507, -36465, -56154, -63999, -5991, 79788, -1253, -15635, -13000, -115689, -131041, -91301, 5839, -15606, 33918, 33507, 25113, 95412, 40607, 6033, 95419, 177882, 123658, 32583, 44309, 19448, 54036, 148222, 100266, 58751, 18271, 4237, -80946, -58330]
5890e8330l4814j6646N9362L6220P0543q2285j9326J2560O4860M5759J0709n9865
5878B8747M7332L1816m1519n8542j6927P7169j641j9809n5753L8004J2700j0414
5866C1163o894P9435J08353n2487j30734m1435Q445o175Q48K6886R3555M8127
5854A59087j27565p0423k7912m4827L6314K6772N6586R7597m3368p0319r238l6708
5842e4004J4766Q5413J02248o3783j9829L9053q5665o0960K157R097M4916M1021
5830E4430k6648P8639L8779l6336p4320j57252j41546K0345M2105R3420J26789
5819A8405j7445n4764Q7177j536r1415l5618Q4796R6110N9588N5400m3042M0315
5807A97971O1432j38912m6694L50q6803N748M5930O7162P336o056O0987p0432
$$ y = [-58330, -93144, -109790, -50428, -14208, 56335, -25950, -45276, -32716, 32144, 77903, 88612, 28747, 76079, 107895, 66376, 7834, -9093, 68076, 66435, 46626, -9127, 28877, 41577, 31163, 24269, 103704, 212057, 159570, 28836, -12599, -4154, -10329, -9481, 17405, 110960, 159087, 31522, -38901, -66813, -111640, -75326, -48554, 8032, 105629, 62261, -8058, -17296, -54004, -39238, 46175, 148423, 84640, 64811, 103864, 18199, -42761, -40604, -31507, 13409, 54430, 27782, 106421, 145200, 108864, 34544, -122708, -264254, -243909, -201804, -108384, 18405, 960, -53804, 33373, 31837, -59578, -95196, -10400, 85710, 145298, 200698, 157656, 197971, 259403, 120491, 73797, 74147, -12656, -6908, 39022, 106184, 113520, 107464, 168451, 98019]
5795I8019m9602n6065m6333J9858P8543J5443r4519J4343m2974L611l8316Q0819
5783a7173L020k2117n270K9301j7362o0869O559l7235p5156m1386O8647m368Q2577
5770i0832J3143M5678N812j0180R5292J96305O8020j09264j94343o6341R8150
5759E1440oj19901N548P4209M0892K8504j00098K3360J25313j2216L6688K0000
5747A73733n0175k8052K2411j06273n6209k0105O9199M0170l6947n4036N3178
5736F894L8193Q1933J1344r8857o6206r7525K5781J31410n4125l8286M7610M7000
5724C5166l8555p3183n1032K0608O0068K0734J10888P0546K5130r5202j36426
5713e1258j3922R1387K4870L2678P7492n9246l9675L2512o101m0943m8994q8432
$$ y = [98019, 48417, -7648, -53981, -34123, 44420, 59863, -34656, -20313, -63287, -59676, -97992, -17173, -14153, -36270, -41540, -12239, -29601, -90470, -83911, -121146, -196302, -237688, -169041, -173409, -90832, -77689, -32011, -26199, -36379, 58913, 255218, 323238, 213974, 19631, -46710, 51440, 51434, -68467, -62919, 11290, 52182, 80686, -19412, 3948, 129261, 117045, 153733, 173733, 123558, 95506, 117917, 11644, -44565, -64670, 4529, 44699, 7752, -46284, 6894, 45087, 127020, 138364, 39507, -26699, -124224, -98443, 32967, -21158, -59444, -11834, 35166, -3389, -76572, -127604, -106996, -46928, -26194, 84694, 155240, 180370, 85168, -51258, -65180, 26207, 51077, 83755, 161247, 102001, 62326, 94838, 88737, 47794, -1200, -89632]
5701h9632l9290O0707L9633j8294m1819K9036O2383M1407J09467n8487j88164
5690i3053k8610J38329P3419n4771m6263m3790M4395n396R8726M4617Q367q4221
5678E1749j31445J774N9144O1022J917K4576K2244k2659n9540m2620P000O9225
5666D2387K5958l5929m5618O5087K8565m0187n038l6027m7092l7890O2822R2614
5654F9652O8233k0126M6981K5816l1306q0827l3126k0477J42073k5051k1554l5145
5642H5143m1933m3312q5209K2934O3057n5521q0870j1l0381J35963J10618Q8616
5630A69094L3451j03678j09274j21219j5564N8788L0707j0337n397p021J9452
5619f0998N1459j9360P765k949l3045L8218L4035o8927j2873K408N5311P8480
$$ y = [-89632, -128922, -68215, -28582, -46876, -88695, -59659, 2724, 44131, 153598, 95111, -93053, -121663, 16666, 90085, 35314, -10949, -54739, -10344, -15740, 82986, 127603, 135970, 51749, -79696, -77922, -18778, 42244, 44161, 68737, 90981, 68322, 8782, -33838, -26838, 42387, 68345, 32416, -13202, 51885, 80450, 40263, 35225, -802, -47894, -85784, -22962, 69652, 137885, 117759, 164740, 190556, 159250, 78423, 45297, 24820, 166893, 141842, 120288, 85143, 43210, -102, -85311, -62377, 680, -54841, -135711, -135722, -166103, -30140, 80478, 169094, 202545, 98867, -10407, -131626, -147190, -88402, -57695, -68032, -73429, -80450, -60998, -9539, -28899, -21134, -24083, -57128, -18910, 15125, -53802, -66675, -64267, -8956, 69524]
5607F9524M8747k5511O6071J7121j32550r7945J56729P5876j6550p6519j26404
5596d1411L9399M4303n0596k4121L3030L5539L5894o7911Q832l0320n8805N3255
5584b2912k1094k1353j8618P429j7529J34513J09358k7816n1041k9901N022O951
5572E3009K2334j9232q579N9992L7262j26109j28505r142j0414N41N7095N1647
5560b0101N1683M5441j6388k4376j1041k7106J60152K7435m0460j01579m6480
5549b820k5974P3929Q126m9552m0080o6910L3726J8272k8929M7533M8556P977
5537B3854j23656p8353J78858J56132K4060l0175m5510j46255Q895M3537L6254
5526D7641l3239n4611k43o6362P3319N740n7989M8726J31548N183l0433n7257
$$ y = [69524, 118271, 92760, 158831, 175952, 43402, -54543, 102186, 178062, 161512, 84993, -41411, -2012, 42291, -8305, -32426, 604, 36143, 72037, 4126, 12958, -17362, -76167, -22912, -44006, -65359, -83977, -76548, -94077, 40436, 149794, 121978, 70937, 41036, 46058, 53009, 75343, 56111, 47532, 107524, 144786, 18677, -109828, -118970, -129384, -128843, -71748, -20101, 31582, 77023, 60635, 36259, 25218, -1888, 158264, 185699, 145239, 43660, -2820, -28794, 45135, 53261, 3709, -36371, -103281, -69555, -51283, -80212, -32679, 15877, 23854, -99802, -178155, 703, 156835, 180895, 150720, 105210, -41045, -32150, 11387, 47641, 14402, -40209, -40452, -106814, -33495, -27755, -85744, -37018, 94530, 99713, 69280, 12023]
5514A2023n8864O1495R3267M8540r1001K551K7182J439l434k4179o4029n6339
5502e1349M8311R4206M510p4356j5799l2133p0319p0138K3806N1660n6966J338
5490a47229Q3704n837l440N1937J61861K0566j15494p1258L1155r9609M0351J26342
5478G3049L016J7200K9074k6313o4957o9440Q2402K422M6367J6708K9009k3956
5466A14581p6199J1611K2789o219j901n3786q4703K3513M7119N3849r3451m2235
5454h5032J03215R0513M8992j01563n7849n8451n6501Q0429N3568j4192j05444
5443a02315N6043J43556n3821o5986l4031k1835L8411l1551J0774J18320j5070
5432D2495N6248o069n3548n5175K4297k884o7166M4861J9264N3091q206o5063
$$ y = [12023, -46841, 14654, 107921, 156461, 65460, 68011, 95193, 96632, 93198, 69019, 4990, -51349, -3038, 91168, 95678, 21322, 5523, -26610, -96929, -167067, -143261, -91601, -148567, -147229, -63525, -69362, -72802, -20865, 140996, 161562, 46068, -25190, 5965, -93644, -53293, 73049, 76065, 93265, 122339, 96026, 31069, -38371, 44031, 46453, 92820, 109528, 138537, 114581, 38382, 49993, 72782, 66563, 64662, 10876, -73827, -50314, -3195, 50654, -42797, -85032, 18183, 108696, 157688, 56125, -1724, -60175, -116676, -36247, 17321, 3129, -102315, -46272, 97284, 43463, -22523, -56554, -78389, -39978, -71529, -60755, 57565, 42495, 98743, 92674, 39126, -16049, 8248, 5364, -61802, -16941, 2323, 55414, 47208, -17855]
5420a7855J4865L2992J4469l4317O1480m2329r8019r0664p6130j3729J21026J50980
$$ y = [-17855, -2990, 30002, 44471, 10154, 71634, 29305, -68714, -159378, -235508, -249237, -128211, 22769]
$$ [...]
##END NTUPLES=NMR SPECTRUM
##END=
