##TITLE=Analysis number 310908
Compound Code cc 21906
Book Reference 441/79
Project Code adrs
Chemist Name colinb
##JCAMPDX= 6.0         $$ Bruker NMR JCAMP-DX V2.0
##DATA TYPE= NMR SPECTRUM
##DATA CLASS= NTUPLES
##ORIGIN= Bruker BioSpin GmbH
##OWNER= NMR
$$ XWIN-NMR		Version 3.5
$$ Fri Jun 24 12:33:31 2005 GMT Daylight Time (UT+1h)  MAYBRIDGE\NMR@NMR_250MHZ
##.OBSERVE FREQUENCY= 250.131544655141
##.OBSERVE NUCLEUS= ^1H
##.ACQUISITION MODE= SIMULTANEOUS (DQD)
##.ACQUISITION SCHEME= undefined
##.AVERAGES= 16
##.DIGITISER RES= 18
##SPECTROMETER/DATA SYSTEM= dpx250
##.PULSE SEQUENCE= zg30
##.SOLVENT NAME= CDCl3
##.SHIFT REFERENCE= (INTERNAL, CDCl3, 0, 16.522)
##AUDIT TRAIL= $$ (NUMBER, WHEN, WHO, WHERE, WHAT)
$$ ##TITLE= Audit trail, XWIN-NMR		Version 3.5
$$ ##JCAMPDX= 5.01
$$ ##ORIGIN= Bruker BioSpin GmbH
$$ ##OWNER= NMR
$$ C:\u/data/dgb/nmr/ADRS/4830/pdata/1/auditp.txt
$$ ##AUDIT TRAIL=  $$ (NUMBER, WHEN, WHO, WHERE, WHAT)
(   1,<2005-06-24 12:33:12.47 +100>,<MAYBRIDGE\NMR>,<NMR_250MHZ>,
      <created by zg, POWCHK disabled, PULCHK disabled
       configuration hash MD5:
       62 19 C7 07 E1 42 D1 B7 37 6C 3D D0 77 39 F9 E6
       data hash MD5: 64K
       46 F7 B2 2E DA 8C 21 22 36 5D 42 A3 B3 FC 7D 20>)
(   2,<2005-06-24 12:33:23.46 +100>,<MAYBRIDGE\NMR>,<NMR_250MHZ>,
      <Start of raw data processing
       ef LB = 0.3 FT_mod = 6 PKNL = 1 SI = 32K 
       data hash MD5: 32K
       91 E9 E9 A0 50 2E 32 98 E2 94 4A C2 9D 84 71 A6>)
(   3,<2005-06-24 12:33:25.25 +100>,<MAYBRIDGE\NMR>,<NMR_250MHZ>,
      <apk 
       data hash MD5: 32K
       31 A9 31 A1 FA 55 3C DA 08 9E 60 5C E3 9B 76 DF>)
(   4,<2005-06-24 12:33:26.02 +100>,<MAYBRIDGE\NMR>,<NMR_250MHZ>,
      <abs ABSG = 5 
       data hash MD5: 32K
       EE E1 85 82 82 4F 81 00 BB AB 9C 05 9A F4 58 C2>)
$$ ##END=
$$ 
$$ hash MD5
$$ 62 AF A1 82 98 60 F5 73 07 C2 AA E3 AF E9 CE 46
##$RELAX= 
##$RELAX= 
##$RELAX= 
##$RELAX= 
##$RELAX= 
##$RELAX= 
##$RELAX= 
$$ Bruker specific parameters
$$ --------------------------
##$DU= <C:\u>
##$EXPNO= 4830
##$NAME= <ADRS>
##$PROCNO= 1
##$TYPE= <nmr>
##$USER= <dgb>
##$AMP= (0..31)
100 100 100 100 100 100 100 100 100 100 100 100 100 100 100 100 100 100 
100 100 100 100 100 100 100 100 100 100 100 100 100 100 
##$AQSEQ= 0
##$AQ_mod= 3
##$AUNM= <au_zg>
##$AUTOPOS= <28 >
##$BF1= 250.13
##$BF2= 250.13
##$BF3= 250.13
##$BF4= 250.13
##$BF5= 500.13
##$BF6= 500.13
##$BF7= 500.13
##$BF8= 500.13
##$BYTORDA= 1
##$CFDGTYP= 0
##$CFRGTYP= 5
##$CHEMSTR= <none>
##$CNST= (0..31)
1 1 145 1 1 1 1 1 1 1 1 1 1 1 1 1 1 1 1 1 1 1 1 1 1 1 1 1 1 1 1 1 
##$CPDPRG= <>
##$CPDPRG1= <>
##$CPDPRG2= <>
##$CPDPRG3= <>
##$CPDPRG4= <mlev>
##$CPDPRG5= <mlev>
##$CPDPRG6= <mlev>
##$CPDPRG7= <mlev>
##$CPDPRG8= <mlev>
##$CPDPRGB= <>
##$CPDPRGT= <>
##$D= (0..31)
0 1 0 0 0 0 0 0 0 0.06 0 0 0 0 0 0 0.0002 0 0 0 0 0 0 0 0 0 0 0 0 0 0 
0 
##$DATE= 1119612791
##$DBL= (0..7)
120 120 120 120 120 120 120 120 
##$DBP= (0..7)
150 150 150 150 150 150 150 150 
##$DBP07= 0
##$DBPNAM0= <>
##$DBPNAM1= <>
$$ [...]
##$SUBNAM7= <"">
##$SUBNAM8= <"">
##$SUBNAM9= <"">
##$SW= 20.6930455092707
##$SWIBOX= (0..15)
0 0 3 0 0 0 0 0 0 0 0 0 0 0 0 0 
##$SW_h= 5175.983436853
##$TD= 65536
##$TD0= 1
##$TE= 295.16
##$TE2= 300
##$TE3= 300
##$TEG= 300
##$TL= (0..7)
0 120 120 120 120 120 120 120 
##$TP= (0..7)
150 150 150 150 150 150 150 150 
##$TP07= 0
##$TPNAME0= <>
##$TPNAME1= <>
##$TPNAME2= <>
##$TPNAME3= <>
##$TPNAME4= <>
##$TPNAME5= <>
##$TPNAME6= <>
##$TPNAME7= <>
##$TPOAL= (0..7)
0.5 0.5 0.5 0.5 0.5 0.5 0.5 0.5 
##$TPOFFS= (0..7)
0 0 0 0 0 0 0 0 
##$TUNHIN= 0
##$TUNHOUT= 0
##$TUNXOUT= 0
##$USERA1= <user>
##$USERA2= <user>
##$USERA3= <user>
##$USERA4= <user>
##$USERA5= <user>
##$V9= 5
##$VALIST= <valist>
##$VCLIST= <CCCCCCCCCCCCCCC>
##$VD= 0
##$VDLIST= <DDDDDDDDDDDDDDD>
##$VPLIST= <PPPPPPPPPPPPPPP>
##$VTLIST= <TTTTTTTTTTTTTTT>
##$WBST= 1024
##$WBSW= 4
##$XGAIN= (0..3)
0 0 0 0 
##$XL= 0
##$YL= 0
##$YMAX_a= 523078
##$YMIN_a= -343980
##$ZGOPTNS= <>
##$ZL1= 120
##$ZL2= 120
##$ZL3= 120
##$ZL4= 120
##$ABSF1= 16.522
##$ABSF2= -4.171173
##$ABSG= 5
##$ABSL= 3
##$ALPHA= 0
##$AQORDER= 0
##$ASSFAC= 0
##$ASSFACI= 0
##$ASSFACX= 0
##$ASSWID= 0
##$AUNMP= <proc_1d>
##$AZFE= 0.1
##$AZFW= 0.1
##$BCFW= 0
##$BC_mod= 0
##$BYTORDP= 0
##$COROFFS= 0
##$CY= 12.5
##$DATMOD= 1
##$DC= 0
##$DFILT= <>
##$DTYPP= 0
##$F1P= 14.0000005364418
##$F2P= -0.99999901652339
##$FCOR= 0.5
##$FTSIZE= 32768
##$FT_mod= 6
##$GAMMA= 0
##$GB= 0
##$INTBC= 1
##$INTSCL= 1
##$ISEN= 128
##$LB= 0.3
##$LEV0= 0
##$LPBIN= 0
##$MAXI= 10000
##$MC2= 0
##$MEAN= 0
##$ME_mod= 0
##$MI= 0
##$NCOEF= 0
##$NC_proc= -5
##$NLEV= 6
##$NOISF1= 0
##$NOISF2= 0
##$NSP= 0
##$NTH_PI= 0
##$NZP= 0
##$OFFSET= 16.522
##$PC= 1
##$PHC0= -72.10925
##$PHC1= -5.920875
##$PH_mod= 1
##$PKNL= yes
##$PPARMOD= 0
##$PSCAL= 4
##$PSIGN= 0
##$REVERSE= no
##$SF= 250.13
##$SI= 32768
##$SIGF1= 0
##$SIGF2= 0
##$SINO= 400
##$SIOLD= 32768
##$SREGLST= <1H.CDCl3>
##$SSB= 0
##$STSI= 32768
##$STSR= 0
##$SW_p= 5175.98343685301
##$SYMM= 0
##$S_DEV= 0
##$TDeff= 65536
##$TDoff= 0
##$TI= <Analysis number 999999
Compound Code 99
Book Reference 9
Project Code 9>
##$TILT= no
##$TM1= 0
##$TM2= 0
##$TOPLEV= 0
##$USERP1= <user>
##$USERP2= <user>
##$USERP3= <user>
##$USERP4= <user>
##$USERP5= <user>
##$WDW= 1
##$XDIM= 32768
##$YMAX_p= 508983617
##$YMIN_p= -420733
$$ End of Bruker specific parameters
$$ ---------------------------------
##NTUPLES= NMR SPECTRUM
##VAR_NAME=  FREQUENCY,     SPECTRUM/REAL,   SPECTRUM/IMAG
##SYMBOL=    X,             R,               I
##VAR_TYPE=  INDEPENDENT,   DEPENDENT,       DEPENDENT
##VAR_FORM=  AFFN,          ASDF,            ASDF
##VAR_DIM=   32768,         32768,           32768
##UNITS=     HZ,            ARBITRARY UNITS, ARBITRARY UNITS
##FACTOR=    0.157963299565203, 1,           1
##FIRST=     4132.6476996994, 0,             0
##LAST=      -1043.33573715361, 0,           0
##MIN=       -1043.33573715361, -420733,     0
##MAX=       4132.6476996994, 508983617,     0
$$ Real data points
##PAGE= N=1
##DATA TABLE= (X++(R..R)), XYDATA
$$ [...]
27327 16361 35383 23146 698 -5601 68973 138557 136179 211544 179969 74141 61795 135161
27315 135161 91235 11849 -121546 -121978 -102453 -159306 -37506 -82855 -139838 -238389 -140837
27304 -140837 -44267 72527 70128 17181 -57220 -127173 -169074 -254142 -292942 -181073 -28023
27293 -28023 48533 27504 -84779 -109690 -66274 -102410 46497 70339 90168 55445 -63388
27282 -63388 -64278 7169 70952 67488 14455 -99516 -138599 -170331 -206321 -166481 -139555 -80306
27270 -80306 -28158 -30477 -6124 52251 -51421 -4189 -61324 -17004 148676 145971 79885 -73284
27258 -73284 -127978 -26696 43628 12652 -16982 10329 -47915 -119493 -62353 -11761 -34014
27247 -34014 -100850 -78364 -87733 -97387 -105391 -136146 18054 110263 112595 19717 4630 -31340
27235 -31340 -98604 -109064 -24683 100186 184637 203079 138880 64601 39805 27744 -71942
27224 -71942 -79574 -109907 -99320 34348 102321 59576 8490 -22805 -63057 -100692 -43384 84615
27212 84615 137504 149694 52538 -63722 -21137 3207 95542 121353 20726 -14151 -86291
27201 -86291 -68803 -37828 40193 19944 -47795 -22481 647 34144 69520 13110 -60120 102319
27189 102319 173100 144252 121904 87007 13169 -2276 33224 145248 166040 200140 120899
27178 120899 65121 2790 -10138 50102 -2482 39665 55564 -43473 15440 37140 45871 76476
27166 76476 159568 42499 -86621 -64507 -16266 16602 -20258 -6959 123663 138634 84412
27155 84412 -34400 -3595 33572 -710 34409 941 -64092 -10685 8669 -57715 -49526 -57945
27143 -57945 5425 27821 10922 4535 -10147 -54624 -99905 -73988 -91214 -77886 62815 51083
27131 51083 20286 28931 29256 66794 -32281 -56608 -34523 -32114 -120507 -113838 -45738 -99998 -108048
27118 -108048 -24282 -40157 40079 71539 65956 26038 17058 -19509 -88349 -62921 -119083 -50480
27106 -50480 39306 144039 176466 48859 -79972 -112272 -49959 -26999 -6749 126122 150923
27095 150923 45600 -58066 -106600 -35693 -17064 -113751 -51398 -8465 3476 10604 -85368
27084 -85368 11163 26106 -22377 -100026 -183857 -181949 -102167 -64268 12631 40821 137883 199166
27072 199166 254188 127731 99035 30105 68984 88807 59277 127092 145481 66469 21546
27061 21546 -15115 14171 -48388 -14750 -61542 -91070 17056 5148 -52109 -69200 83586
27050 83586 110633 188096 240433 193584 138448 101734 26592 -40075 -48462 -40433 -19591 -108750
27038 -108750 -78524 -172468 -161695 -79187 -30234 -116932 -132043 -40382 -46125 7589 157429
27027 157429 174840 -21381 -149042 -186071 -148458 -22429 33477 81514 103176 25930 -125390
27016 -125390 -106455 79585 136691 93267 79346 35027 -72156 -101644 -93728 -77539 -52324
27005 -52324 -48250 -132558 -122894 -97081 -66587 -101067 -56552 -29265 6723 -41527 -79406 -11513
26993 -11513 48553 104714 43445 112133 156400 125141 86477 -11245 -11869 153807 192679 246935
26981 246935 194359 55985 104479 136040 60121 32177 -55577 -134282 -133384 -69574 -78298 -81939
26969 -81939 -82308 -68831 -85589 -101352 27182 -2568 -58682 -8956 120516 189410 175580 215382
26957 215382 200623 229304 276060 186424 93191 -35530 70799 123533 91844 96259 105272
26946 105272 48057 -28171 -74165 -127782 -172922 -149033 -38600 23833 -9227 -15799 141953
26935 141953 308406 205038 51077 17667 -20190 -193090 -282429 -271478 -224208 -111110
26925 -111110 79940 113171 -40404 -34267 41799 148766 73742 20925 -16655 21112 49971
26914 49971 5633 -49109 -90626 -103231 -68394 -122776 -145172 -73261 -23069 116696 107250 135404
26902 135404 165866 103665 117113 38183 21488 -55947 -93219 -106152 -110835 -95224 -30908 55917
26890 55917 6692 -15523 -15829 -44605 -16544 39683 52258 82015 197151 191662 93633 40751
26878 40751 79652 123180 71329 48585 48802 30495 51981 -44574 -75494 18582 27486 4171
26866 4171 92474 152841 211524 138116 81601 44490 18783 25466 42764 98107 48421 120666
26854 120666 181168 118030 6121 29513 63206 70609 46905 -13505 -65581 -84903 -15396
26843 -15396 -11356 16959 6659 8193 -48299 -87408 -110020 -168429 -150868 -34417 -102955 -163148
26831 -163148 -44048 -1907 122950 92627 62564 96133 95731 172063 151824 -4250 -136599
26820 -136599 -118404 -12585 -12256 6987 23088 99771 -2667 -36708 -112920 13834 185613
26809 185613 106923 18044 41338 39013 -91119 -129326 -130225 -64005 -58313 -128054 -166391 -165944
26797 -165944 -103059 -150095 -195502 -213172 -34377 96658 64171 95563 156770 131041 76170
26786 76170 128922 111276 66345 37267 62182 -1568 59123 96539 124301 29187 -77978
26775 -77978 -88825 -79402 54592 132553 133895 89161 -28132 -77942 -30807 -10604 -71471 -92047
26763 -92047 59698 90211 30477 -94115 -111236 -78324 5130 168524 223051 125453 98912
26752 98912 35243 -49168 -116409 -49514 27065 81869 154790 185693 47266 -85307 -127700
26741 -127700 -45764 -39507 73014 151395 68480 76882 118192 138952 79804 9212 42462 -42168
26729 -42168 -104091 -130010 -73733 132874 287177 313063 267813 147647 -7534 -107325 -61947
26718 -61947 -32699 -45648 -39703 -80867 -36651 -63081 -55376 -56500 -109760 -137035 -56593 -50496
26706 -50496 42144 121187 114309 68249 -36233 -44568 45905 91542 50333 -40456 -126178 -144921
26694 -144921 -136095 -110889 -67675 -12151 68122 80065 -26978 -11803 42475 77245 61435
26683 61435 -140908 -178534 -96268 -108160 -19579 -4017 -30424 65082 124546 114240 50231
26672 50231 46683 154930 211303 163762 21924 -13565 -5185 -55388 -140076 -150366 10652
26661 10652 43017 75984 201703 256828 237225 139419 31168 -32156 -91145 -170826 -89781
26650 -89781 29395 37319 -10246 -7981 -34302 78580 69609 -27362 -94877 3071 -45912 -73045
26638 -73045 -137528 -176365 -155151 -147172 -89843 -106751 -25802 24829 110043 87924 77858 85994
26626 85994 -205 -83700 -50569 65425 113347 -15250 -144454 -113012 -23873 -74979 -131058
26615 -131058 -208425 -187162 -76331 -10593 -17880 -28080 -33249 14356 96316 97470 -33652 -19229
26603 -19229 64669 67339 49492 -34519 5643 37871 15542 -3142 -42441 -94635 -92365 -61920
26591 -61920 -43975 -54003 4035 132043 178258 90902 100495 25609 38822 44376 107965 197213
26579 197213 251714 139275 69165 48136 125165 136069 29648 -14734 -100738 35026 140655
26568 140655 105104 48014 48444 41005 -78575 -88287 -30015 -120977 -99916 -60325 -147640 -165553
26556 -165553 -150167 -74339 -7566 71060 148614 141783 49354 118665 169163 105880 103277 48794
26544 48794 -19561 -128214 -84897 -59403 -109831 -184211 -98956 -128672 -120688 -89423 -86105 -44829
26532 -44829 -76160 7976 98768 101451 7419 -6519 95785 44414 -89996 -37011 106583
26521 106583 168244 191370 177132 139373 73299 -15699 -63183 -46807 -89468 -151749 -157993 -48751
26509 -48751 128039 126365 113375 103906 17295 8755 -6038 -60465 -36251 77063 129129 44869
26497 44869 27501 60124 -34336 5775 -26369 -79536 -80597 -116989 -124046 -40010 78919 124765
26485 124765 60434 53547 81400 35798 -117590 -281063 -223143 -53726 2234 6211 61553
26474 61553 139756 142299 43104 94681 166596 181312 91367 24797 14471 21839 4270 -20517
26462 -20517 -14703 2047 62640 109500 192628 126059 128771 117405 115116 -2293 -56935 -87341
26450 -87341 -114278 -40602 82871 131054 40210 50028 -691 -124677 -177220 -79819 -58407
26439 -58407 -2985 -73433 -56916 -98043 -101268 -161950 -82419 -29688 -48817 -42677 -38692 -108153
26427 -108153 3256 135088 67739 20255 29419 -57815 -151645 -84721 -77043 -158194 -74022
26416 -74022 -55460 -99966 -126315 -148765 -177169 -222565 -214216 -165806 -147595 -99785 -94963 -67156
26404 -67156 10858 -34253 -73024 -173713 -102055 -116774 -100058 -72663 -47536 28457 -5135
26393 -5135 30632 151980 254165 269705 73116 -23017 -24056 -43178 2530 -45666 3872
26382 3872 -33529 -123563 -87989 -115288 -80514 48196 77214 68607 125533 213195 206982 85980
26370 85980 -27307 -69101 -30257 -70511 -51357 24092 15034 -36860 -21358 144828 221001
26359 221001 129137 59250 45664 27055 -50152 -1432 -62706 -93708 28162 25718 -73774
26348 -73774 -155585 -148428 150756 337859 272449 136733 85048 144546 123392 93701 59326
26337 59326 11029 -46273 -26165 -18007 -57983 18767 70609 67763 -27778 15329 92503 1879
26325 1879 7249 20527 107145 124245 96693 118517 26665 -84098 -74323 15220 18319 -4332
26313 -4332 -28514 -66387 -122852 -52106 -940 109885 47156 -57692 -29947 -33268 -20406 -62299
26301 -62299 -95375 -80539 -7067 -70775 -45546 -44458 -6018 -112848 -227337 -264772 -239181
26290 -239181 -141381 -202820 -45472 69560 57545 -15713 -37373 118270 218468 167250 207994
26279 207994 131479 -99051 -165052 -127907 -4055 48039 -14691 -74995 -1213 55775 29427
26268 29427 6819 18611 -32740 -66018 22003 -31279 -8943 73928 70037 75403 -1508 7526
26256 7526 129148 59643 -32457 -44416 14741 75634 52498 -49876 8699 111308 52997
26245 52997 -16796 -52767 -85631 -4113 97888 80771 73222 55550 49058 61896 25474 12362
26233 12362 -8518 -15404 101079 102211 103387 76930 174606 159530 -17302 -1881 39865 132660
26221 132660 130847 73863 131821 106412 -19808 -23224 104580 107842 68749 48575 -109791
26210 -109791 -187172 -210382 -235315 -145617 -91789 -106361 -164868 -179647 -187298 -197170 -88830 -25153
26198 -25153 15106 60491 111089 31062 27787 -18845 59110 55920 10424 -3240 -75382 6709
26186 6709 11439 -15877 11433 42095 20895 20524 -6001 2296 51990 46813 50067 23137 67207
26173 67207 33427 -13321 -134718 -51847 54209 141894 58796 31503 51593 -15197 -188963
26162 -188963 -308507 -199140 6360 185822 207495 148190 131418 84793 -59099 -63870 -93819
26151 -93819 -65144 -5871 -37227 -47313 -24730 -22522 32822 102942 121969 27440 15717 239405
26139 239405 242976 131906 -28038 -55218 -52594 -29213 58839 67334 82526 98358 120920 68863
26127 68863 57940 90427 43039 31775 76060 81953 87874 34047 -15347 40160 71272 147620
26115 147620 171328 88030 11543 97274 102224 10078 23221 44037 157200 173804 84562
26104 84562 117078 43399 6923 14584 101091 131826 143174 131918 83171 22608 3459 69698
26092 69698 52932 72095 71259 24499 39648 131220 117149 65857 -21054 -4361 14334 -153369
26080 -153369 -191892 -85558 -37748 132840 168838 179951 115398 -52939 -140590 -70736 16806
26069 16806 86446 39802 -10720 56628 36252 -45100 -101050 -136913 -84673 60591 71532
26058 71532 34921 -89794 -118373 -158468 -191621 -184585 -84881 91144 125132 110918 134284
26047 134284 71527 -45147 -35319 -82488 -89298 -151162 -210537 -214183 -173446 -89873 -86555 -44957
26035 -44957 98733 73804 10142 28776 68945 25577 25886 42850 44044 -2853 -51636 -52782
26023 -52782 -23215 -21901 20354 88760 66966 -88137 -264946 -198227 -99106 -92554 -34972 12445
26011 12445 80162 150506 110511 157374 59312 97941 97714 201140 243907 205549 184365 98397
25999 98397 64987 12555 -53478 -164472 -153890 -24480 32430 110530 60630 28857 123996
25988 123996 157788 146115 50877 -79887 -58986 23785 209303 220401 225165 296027 235743
25977 235743 137528 65217 114092 36912 -28119 -26833 -142019 -203076 -211925 -156484 -107330 -7145
25965 -7145 71263 135178 186341 75093 -17012 4298 67520 122739 75003 -107758 -101945 -59064
25953 -59064 20489 68954 78178 -10466 -60466 -80411 -107176 -120701 -184532 -30358 45663 21016
25941 21016 -49429 -135598 -112603 -91243 -106516 -71687 5234 9882 30870 68923 49005 79081
25929 79081 51071 -49752 78967 182790 161558 49372 -59048 -90095 -86530 -28265 -18239
25918 -18239 -128137 -123184 -70982 -49154 -71879 -81323 -29152 -26568 57007 136193 78828 88998
25906 88998 128024 38605 -4773 -24750 -12730 6024 -29136 -98670 -98754 -86733 -36759 72922
25894 72922 64407 -39387 -42927 17014 52540 59342 87631 13382 5984 28378 -36564 -59604
25882 -59604 -94574 -23824 -6790 -40597 -81036 -65647 -42692 5217 -81758 -133194 -119179 -48710
25870 -48710 81372 181778 240203 208114 282368 239353 220893 144792 -19858 -44689 18939
25859 18939 36545 -7704 -39913 10645 32732 21551 -2685 -46535 -115096 -134087 1813
25848 1813 127918 245648 185873 70340 7135 45780 27615 41907 -102243 -28852 -7295
25837 -7295 -132185 -169728 -115886 -17889 36608 16964 -18363 -47654 -63003 -44549 2690 20164
25825 20164 1309 20493 22796 33412 66820 38569 20491 13892 -13287 -30123 -35451 -38418
25813 -38418 -12801 44597 110365 137704 26439 -7838 26991 81589 37449 -71151 -22533
25802 -22533 -3780 -11060 -52350 25776 -6506 69809 167111 268188 279846 169198 40981
25791 40981 74406 44658 22665 32304 -39473 -59912 -35429 -24065 87753 221279 175061
25780 175061 104206 80217 193013 142048 -38906 -108258 -194749 -184481 -87931 14639 -9910
25769 -9910 -48493 -48437 -43018 67511 148538 84839 121015 181090 144576 77141 33155 -51809
25757 -51809 -8338 79850 158053 174636 88024 32208 13356 -15478 5624 -11411 -43367 5307
25745 5307 84451 118391 83870 -80620 -62310 6119 -29738 21934 39955 54160 143265 98362
25733 98362 50798 15474 54518 22446 108090 60109 -34572 77915 258172 182850 168248
25722 168248 255973 202821 193759 98053 49211 54868 28193 76530 75592 110993 131157 75746
25710 75746 -12636 -90781 -54950 -122551 -133894 -31669 -228080 -364867 -359009 -230473 -153399
25699 -153399 -81422 -45137 -20839 -38562 -95681 -141324 -175926 -153294 25937 168394 176769
25688 176769 132428 103313 165157 63551 -65243 -8783 127481 136802 102112 54080 -6508
25677 -6508 -53599 -54520 -19284 -80875 -119977 -144664 -190767 -73431 46613 92431 47385 -7822
25665 -7822 -63268 -69653 -109905 -107039 -138525 -75443 -94550 -121061 -173539 -177620 -154501 -36285
25653 -36285 4511 -104599 -95474 73939 50034 -45707 -137176 -34320 160865 137007 21945
25642 21945 -70820 -150454 -169441 -111103 -83385 -103531 -124948 -163706 -64940 -135339 -157854 -105919
25630 -105919 -123788 -80397 27274 39873 -38122 -45357 -115 33798 114477 69362 28401
25619 28401 -22146 22296 -29935 -147734 -149718 -113849 -54560 -72233 -61133 -60109 -112844 -157768
25607 -157768 -235931 -202097 -219159 -116706 -57383 -92424 -100756 -103197 -10682 87987 46457 65187
25595 65187 157512 82757 -48131 -138881 -121314 -100761 -86970 -43872 -596 -54743 -121911
25584 -121911 -142183 -206194 -196887 -179680 -130960 -100560 -147924 -250693 -314914 -274958 -157682
25573 -157682 -11687 16618 -53150 42641 72501 78390 143646 94910 -43803 -36875 -8227
25562 -8227 -60684 -13642 68063 41289 -23451 -53240 -46046 -10196 51135 118613 32845 -93637
25550 -93637 -166558 -126846 -53765 -4522 739 -22225 -124023 -273541 -221129 -52503 -47491
25539 -47491 -55255 -66474 -32339 -20830 -61158 -7805 63648 -14323 -109029 -191718 -141970 -95131
25527 -95131 33548 44361 92552 198836 214867 141675 64061 -78855 -107385 -92216 -127497
25516 -127497 -60866 -11780 -26594 -27495 -9199 -50121 -47176 -81339 23608 18026 -25305 -58498
25504 -58498 -81358 -85324 -13509 -2477 65589 37448 95963 191468 61562 53412 103312 120332
25492 120332 106549 15444 57657 66988 57333 102183 168747 130628 76008 98633 62936 3752
25480 3752 -47109 -148776 2516 25283 -1857 -80666 -155839 -81176 49524 102147 56288
25469 56288 -81197 -178354 -200968 -136898 -51743 -19171 65311 93443 121863 54046 -168188
25458 -168188 -142885 -45618 -815 43273 43427 29232 -24407 37710 159619 48875 27541
25447 27541 100113 24147 -59836 43733 -10214 -64667 -64388 79470 65328 -53230 -78765
25436 -78765 -37829 63661 100310 72590 4590 -45973 41866 72743 -58912 -164416 -71378
25425 -71378 -29401 -121149 -74086 72230 185288 207995 185608 69980 43532 -30878 -71331
25414 -71331 -29295 41805 137365 144936 104609 48540 58284 71051 33448 40280 -6869 16209
25402 16209 75509 20043 -74260 -117482 -69577 -86083 -43415 -12638 49454 -19503 43781 170719
25390 170719 16604 -66053 22757 187845 113891 93600 144836 111762 126148 47772 11039
25379 11039 -27442 -18963 7 96060 113287 23857 9159 66173 -12199 65848 108290 25621
25367 25621 -44732 595 83465 -4193 8376 81196 201858 162583 129351 58780 -4031
25356 -4031 17621 73336 16459 47800 -729 -55340 -84715 -121034 -51621 9489 90668 153821
25344 153821 163701 150874 122105 155500 106437 57063 47917 61754 -25067 -105141 -87824 -23509
25332 -23509 27670 29007 72625 105229 183505 152406 121102 13649 7933 151351 183607 101740
25320 101740 53731 7220 26808 -44139 -34105 116529 119256 102052 -75471 -40522 35249
25309 35249 7748 -9677 14792 30433 32697 93267 64037 -46132 -96584 -71598 -24973 -78704
25297 -78704 -91970 -82497 -43132 -7709 -2314 37419 32129 3847 25787 33228 110861 142387
25285 142387 268850 212035 85359 39164 4151 -19489 -53675 -45219 12106 70042 45842
25274 45842 -31011 -97992 -35448 19865 21826 12807 -47128 -160342 -58920 -51505 -37667 53949
25262 53949 43296 12744 -26800 -13396 -120628 -115031 -32410 -19039 -1299 -144282 -109591
25251 -109591 -56323 -51232 -17663 35002 82323 -61429 -219827 -182725 -83818 -73101 -24779
25240 -24779 11676 -31847 33042 130591 134457 72945 39296 62283 41433 135189 177771 210309
25228 210309 217639 132501 61186 33854 92751 150866 166506 119124 52181 100670 168608 120879
25216 120879 8396 -48789 -116998 28284 131587 114122 28267 52261 92201 24493 15485
25205 15485 48458 82020 82399 15368 -143424 -51347 12766 79052 80869 30196 -133344 -263334
25193 -263334 -281744 -92275 -38442 -105780 -57642 2109 98669 86497 89218 60382 -16710
25182 -16710 12915 8150 -89998 -25700 10402 -9884 -25819 -86237 -44911 -8236 -112868 -139906
25170 -139906 -153128 -142087 -172488 -74997 108864 113964 206124 250682 160348 53627 56956
25159 56956 45487 104317 126592 48502 -27291 -40875 -116298 -149842 -149442 -118327 -179964 -161933
25147 -161933 -194976 -226736 -302469 -242720 -195777 -121688 -116932 -133045 -42319 65703 8854
25136 8854 19775 -101255 -158427 -193606 -219963 -208390 -26644 141249 41259 -66566 -8643
25125 -8643 78 -64517 -85074 -60693 -42757 -17064 11457 39135 -46629 -54938 -56504 -118132
25113 -118132 -102719 -41602 50914 136000 71721 64542 94046 95545 42906 -16933 -43308 17944
25101 17944 35510 109639 92201 85608 -34605 -118136 -151609 -123639 -54716 -47163 -37944 -43050
25089 -43050 -106006 -152550 -92918 -48724 59912 26936 -79604 -99266 -125445 -90341 -1946
25078 -1946 85693 92091 70513 31898 -35558 -41467 -149576 -130704 -107704 -4 -5191 33182
25066 33182 87449 56913 -90198 -77597 -60437 -39224 -24999 -17062 -14567 28555 147898 246168
25054 246168 210049 139396 42992 -42521 -14004 58179 120838 149019 80447 97700 123773
25043 123773 81332 107852 67789 41133 81251 101287 113636 96388 151119 155702 184423 180314
25031 180314 94832 13489 44822 47336 75676 14983 7406 60062 1354 -66651 -101975 25162
25019 25162 51093 8228 -33537 8845 66093 42576 23406 39452 7364 32982 58288 39433
25007 39433 54032 49606 102065 78873 117250 214652 162566 33336 -72431 -135249 -87348
24996 -87348 46843 64277 96611 50536 -25579 83348 199651 175730 82357 -74461 -111272
24985 -111272 -79702 -97839 -51366 89783 109542 37914 -42216 -131604 -78266 -64420 -77306
24974 -77306 -20430 13205 112320 220712 133401 37249 24259 10152 -70923 -37524 5671
24963 5671 -76852 -89201 -184387 -214066 -16468 193398 92527 -61456 -237030 -222455 -121286
24952 -121286 -94228 -94987 -117384 -109709 -39038 4879 57061 23406 134029 143419 131723 121322
24940 121322 62936 62340 -4691 -61982 6827 -6314 -15381 7660 20962 -53735 -111306 -20351
24928 -20351 31602 -64327 -99288 -151178 -83252 -122592 -109705 40315 14752 74624 148697
24917 148697 105953 27827 -63203 -2242 54284 18685 -42833 -94605 5392 102341 218690
24906 218690 148384 47592 -14153 -79584 -141305 -48112 41696 116539 139141 83859 -18198
24895 -18198 11554 -5923 -140882 -151716 -67798 -47483 -76155 -202909 -192151 -151420 -219631
24884 -219631 -200038 -184631 -123714 -43937 -7981 20151 112731 88209 -70857 9996 71193
24873 71193 -6046 -62170 -53597 -98510 -67338 -83879 -4319 -58525 -67268 -150175 -92339 -84958
24861 -84958 -101511 -60961 29165 56876 18477 -27535 -37657 -63388 -105506 -143387 -38871
24850 -38871 66462 -44065 -116451 -148819 -105520 -7651 -33161 -47546 6270 678 -23747
24839 -23747 -31443 -543 54091 108677 -3998 -22559 -36893 -38499 -26674 -11545 -25714 -40915
24827 -40915 -111649 -87266 -4868 18676 91001 94345 47720 -101536 -192681 -103608 -79693 -95195
24815 -95195 -67271 -33467 -141179 -100882 -283 13666 -35678 -14857 -59783 -77098 -94530
24804 -94530 -198206 -105289 13014 46827 -23229 -35134 6535 41880 122125 141852 123662
24793 123662 162275 114793 -93942 -219050 -260019 -172400 -153845 -104120 -52736 -16523 34011
24782 34011 99159 101584 69168 26148 25301 -71171 -36197 96344 34730 -10221 38014 27550
24770 27550 -98513 -131207 -76257 -3697 12048 92105 35236 39296 71529 53472 153426 101778
24758 101778 21758 81593 230618 213989 31302 9172 -11365 3733 90006 108432 7357
24747 7357 3423 32415 64648 8362 31954 -2247 12132 42223 -8719 324 115817 138766
24735 138766 124437 19550 -31258 -108851 -26785 3632 25340 9365 -1327 -19953 -58159
24724 -58159 -65988 -93161 -94251 33289 68365 -5320 65958 100870 133633 50420 97988 95427
24712 95427 -25107 -53354 -19286 -59139 -80413 -80982 -38269 100335 66037 8616 -62487 -103709
24700 -103709 -26204 122437 153589 59384 -12076 -126353 -181752 -137114 -141889 -174873 -118095
24689 -118095 -29657 39878 59471 91481 49138 -58899 -92313 -38860 49926 38134 -39190
24678 -39190 -74088 -3926 -66941 -37269 -19987 22043 82367 158195 125 -49163 11912
24667 11912 -39046 -113907 -4475 62334 -20193 26787 61255 -104759 -221605 -161732 -55128
24656 -55128 31741 -45370 -130814 -72113 9168 -36703 -76141 -87225 -139207 -161755 -224508 -231199
24644 -231199 -235071 -138880 -59785 -28473 55191 104351 50322 109543 65345 -35561 -77675
24633 -77675 -123757 -114180 -98543 -87629 9010 78494 -4009 -18415 16879 -80000 5042 41660
24621 41660 -37113 -10886 36387 91195 13517 -34916 -11276 94267 47919 -12602 -50728
24610 -50728 -101654 -80777 -12303 66389 34239 -67838 -24158 4819 -61888 39936 98005
24599 98005 161843 197364 55845 -33641 139791 169894 86058 -5016 -94131 -54531 -7637
24588 -7637 19956 68172 26748 -8041 -56485 -64202 -115321 -177907 -199040 -116717 -36819 -53467
24576 -53467 38472 115794 -7872 -129021 -169289 -20074 14143 6563 7028 -58325 -63314 -3079
24564 -3079 40812 -8271 4447 -74245 -187795 -30802 -22136 44695 121603 143912 18204
24553 18204 22416 34506 36975 83925 43068 -6587 -55586 -99608 -110018 -88272 -139200 -128122
24541 -128122 -113869 -90129 37700 53833 -53039 -164878 -116976 -73660 -132900 -203572 -228564
24530 -228564 -118303 3141 -14714 -82214 -155105 -188713 -33410 31187 110200 60162 -59128
24519 -59128 -120068 -62306 -27905 51363 -16155 -164807 -127933 -31723 21357 49813 -6976
24508 -6976 -35694 126339 165301 -10217 -112390 -106561 -150190 -93901 -39325 -6225 5092
24497 5092 122762 95148 47579 77833 50499 13203 25204 75605 4088 -47489 -69015 -48357
24485 -48357 -108942 -156718 -76827 -164438 -198689 -166504 -157918 -104378 -73880 -135994 -135478 -147754
24473 -147754 -82091 -117347 -169561 -161968 -242811 -222690 -150175 -142369 -158299 -118556 -94097 -102422
24461 -102422 -109821 -97621 5544 107203 83610 98470 172348 179631 125341 91989 144866
24450 144866 83045 63714 133611 130323 114636 71196 19052 -13517 25542 16085 19675 21157
24438 21157 53222 145054 73232 44597 48216 -64569 -53875 -24236 6105 -25540 -70669 -24523
24426 -24523 -66437 -36375 -45370 -7605 -20716 -90338 -80064 -166466 -188300 -143029 -52921 36733
24414 36733 5640 30441 34854 -70000 -46497 -98856 -94956 -94552 -109102 -116486 -78383 1032
24402 1032 22082 -32588 -77194 -74802 -94881 -9512 -31720 -120601 -50678 -77177 -42086 -6880
24390 -6880 -17478 2875 48707 91408 37952 -16158 -17065 -51791 -113526 -162890 -90539 -110746
24378 -110746 -146686 -107579 -99660 -16258 46790 69699 95579 227386 261057 193151 58425
24367 58425 1011 62818 175921 157652 168642 178102 194740 177097 82402 4342 1771 -44527
24355 -44527 -101381 -100575 -54322 273 19681 -25204 -54739 -95580 -43425 -43569 -138662 -89204
24343 -89204 -366 -23866 -13801 -89459 -150810 -149641 -79194 -87801 -72498 -25795 -286 -8006
24331 -8006 47307 -9311 -146123 -230597 -152476 -212624 -209197 -218881 -97968 -63538 -84588 -127630
24319 -127630 -72761 -54157 -130708 -105389 -73477 -82527 -33822 -64755 -5674 -31077 -28627 51085
24307 51085 146712 49853 7043 116632 18141 -70846 -28783 465 -41941 -39105 -134121 -153023
24295 -153023 -45924 27074 95591 28925 -81204 -134087 -116928 -99528 -88864 -31178 22482
24284 22482 142914 59196 5668 61414 41069 -42500 48067 205780 91689 -10900 23861
24273 23861 104308 137652 157683 182614 158794 100313 135512 119982 71440 -99494 -28131
24262 -28131 21541 -25975 49270 79789 -15311 -110282 -72183 -35247 -123098 -225806 -184928
24251 -184928 -201143 -190411 -180271 -36319 -243 -56204 -122847 -182429 -126199 -66086 52535
24240 52535 102699 51907 -64283 41401 133032 111958 72275 -53036 -40327 24033 10713
24229 10713 -17342 -38641 -104305 -12632 -6137 -38940 5939 -11419 -86011 -32726 -23631 -60538
24217 -60538 -81996 -47078 -76465 -140478 -114108 -31971 31441 48477 -52740 -188590 -175010
24206 -175010 -86222 -14644 -18212 51233 95427 68927 162841 189302 162492 82350 69169 186647
24194 186647 129015 58397 163015 206381 162308 31028 -4941 44564 95278 159666 114826
24183 114826 134776 147609 77270 40604 24919 16047 38674 93972 93637 -83970 -116389 -118440
24171 -118440 -101071 -73309 -51127 93761 106191 127491 197408 100185 59904 65724 112804
24160 112804 163485 88597 24119 12044 -26850 52863 93066 105747 68358 59611 123305 216269
24148 216269 133821 8448 -61204 -28853 -41189 -44749 -110929 -92966 15093 63436 111292
24137 111292 58070 -53598 -18874 -58102 -143356 -107615 -45203 49786 49234 55460 58346 -40336
24125 -40336 -55130 -10174 -52403 -44653 -1957 -30564 -30061 55049 90292 55874 126228 124442
24113 124442 -23270 -119162 20959 139692 107204 -59559 -60418 349 8413 54958 64204
24102 64204 95221 145784 111734 83526 156445 229892 264327 274950 233373 132287 104319
24091 104319 189836 129051 56437 -55907 -105943 -15059 30335 51135 49899 6015 60398
24080 60398 50020 106406 71112 23659 53957 83108 -42881 -144223 -184567 -284621 -220079
24069 -220079 -148072 -96967 -170031 -272903 -177338 -107599 -40479 -15675 -25326 -31809 -38710 -14131
24057 -14131 38157 22538 -116008 -178062 -73637 70048 88796 47719 -2235 -41508 -13540
24046 -13540 -163637 -93809 -30928 -91785 -175291 -191695 -107567 -41608 -12983 -105421 -77329
24035 -77329 76359 114480 9286 5108 -23248 -124836 -102145 -96802 -143632 -105471 -23425
24024 -23425 74234 22980 9035 3272 26866 76083 99400 85591 88994 103094 -11372 -78860
24012 -78860 -60848 19153 89732 -49915 -92166 -75269 -75235 -21461 -35939 -50067 46073 132634
24000 132634 137941 95899 -26797 -24040 -27760 -1449 56038 54234 -36260 -86736 -103815 -75974
23988 -75974 -93777 -95604 -56035 -111938 -139449 -130951 -91684 55590 45909 29053 -41322 -38636
23976 -38636 -111460 -185339 -266066 -203602 -126209 9558 66034 54741 -39166 -29948 5432 95036
23964 95036 83725 61907 93762 13430 -122512 -103838 -58381 -49865 -30445 -11841 -23116 10949
23952 10949 37098 57172 76112 39767 120087 133657 144566 52358 26828 -1514 21252 4977
23940 4977 52299 121124 131794 188864 94085 -2609 -19032 34855 198986 192579 81487 -34788
23928 -34788 -70382 -93705 -41214 64898 138579 101364 34664 -37445 -72895 23534 45821
23917 45821 23167 9478 -126810 -149200 -84105 5442 4624 69431 -6376 -23824 -7931 -110390
23905 -110390 -118630 -93222 -7656 114848 118913 23821 -74918 -78293 -67895 12388 -117186 -207632
23893 -207632 -221179 -142645 -53170 -108365 -96066 -48167 -13890 13389 -38211 -36402 63596 33268
23881 33268 -56971 -38866 -102980 -169652 -98244 -102288 -25599 13990 13843 -45427 -5946 -11064
23869 -11064 -140400 -157740 -137553 -57623 94115 151784 34582 -7668 -8657 -4926 21559 -11020
23857 -11020 32299 -78430 -126799 -70573 18143 94414 -8153 -81411 -6752 -4027 65672
23846 65672 65724 1850 -64698 -140514 -154751 -169339 -153875 -129353 24830 85129 -36430 -61844
23834 -61844 -9436 100887 148445 90604 32366 -51726 -112064 -14255 120462 93213 70057
23823 70057 -9055 -20528 -55460 -60305 30430 7384 -51597 22244 137579 111960 -11722
23812 -11722 -4581 38795 -13568 -118221 -93269 -53812 -74920 -75356 -117504 -55975 -16812 -20278
23800 -20278 -73353 -16198 100819 134040 154342 181269 247024 184543 96808 5027 -28622
23789 -28622 -8290 23306 75755 -2275 -149423 -123605 -49013 64841 150909 152563 85716
23778 85716 28885 44384 89506 76428 22155 -25688 -42560 28645 17345 -31420 76058
23767 76058 157738 94760 97827 2500 -19346 20579 -21145 -98564 -111650 -95879 -65000 15305
23755 15305 71368 -82414 -117508 1266 -2815 21000 40298 126661 113141 154223 131780
23744 131780 132664 85678 -28690 -56403 -84231 11493 27935 51616 2718 -43287 -73675 -75327
23732 -75327 -90649 -85077 -110012 -99787 -50249 73986 35350 -88099 -41167 -24920 -72957
23721 -72957 -88768 -121933 -92463 -10587 -13543 -55359 -66040 -83467 -31206 80335 107691 43038
23709 43038 103313 93419 112674 81458 69330 168203 143689 -3817 -77021 -42741 5053 -12797
23697 -12797 11910 54542 107573 81239 -77697 -83508 42722 49297 78494 91415 89541 48980
23685 48980 37782 52706 49856 -73227 -103336 -30262 -36016 3716 -24926 -86928 -101072 10221
23673 10221 18322 -76967 -168097 -43143 60195 29580 -300 70282 119462 151465 171706
23662 171706 152310 56595 67553 102039 20038 -4502 -41785 -3969 -13640 -60942 13457 42323
23650 42323 14663 -74265 -141496 -72616 -130522 -115771 -41248 -42357 -52189 44861 104161 30872
23638 30872 8283 -33970 -74912 -61877 -7238 -17356 18215 87498 38282 -28333 -97156 -89923
23626 -89923 -5427 84860 79740 -6217 5145 54694 95292 120591 97937 2706 -29774 -60071
23614 -60071 -33618 40056 5121 -89165 -119473 -68304 -65100 -30216 -17606 53891 61887 71708
23602 71708 119369 115007 -11519 -36381 80966 20316 -5379 75302 134007 182210 109841
23591 109841 -10545 -31857 47428 90654 94452 29664 -70507 -42755 -5868 -24207 -119787
23580 -119787 -141279 -67291 -95538 -31465 -63350 -75471 -16359 63967 12598 40235 132580
23569 132580 128329 33490 14966 -7750 -3449 60505 -50517 -137646 -187608 -149839 -103795 -15580
23557 -15580 94861 6488 -1643 15546 59361 91851 148687 153651 116273 88262 49944 73756
23545 73756 113810 83672 70890 69272 14277 -29486 14943 98506 121649 25457 -85048 -96481
23533 -96481 -52039 -52876 3925 89858 142961 153734 42277 -7813 -56331 -88314 -17852 28778
23521 28778 27499 14864 -36813 71854 38444 -7600 -11036 -72678 -87223 -52825 -34311 -56530
23509 -56530 -34564 21601 -65867 -38558 -30628 -14734 33183 -55198 -63332 -4463 32225 56889
23497 56889 -13902 -91967 -53677 -94837 -125007 -54998 -99934 -78072 24924 28372 47461 -15834
23485 -15834 -26695 -102681 -230457 -186557 -215846 -240957 -47650 131835 78747 -101542 -69903
23474 -69903 126981 218894 132175 116811 51292 -58883 -149425 -244561 -207823 -147082 -99551
23463 -99551 -163738 -214872 -188180 -22714 104302 129369 169019 127732 73111 21340 -38802
23452 -38802 -20221 -49351 -131047 -88236 62470 12170 -21299 -46462 -132283 -91711 -121088
23441 -121088 -81690 -116488 -169515 -195015 -98051 -72823 -57153 4164 -74027 -60758 -30391
23430 -30391 51566 61710 10143 36654 129266 229557 169144 59752 49003 57350 97726
23419 97726 20963 45131 87374 120778 160382 85120 -2830 -66718 -101084 -12194 -44857 -36837
23407 -36837 87585 59338 34150 46636 32983 102146 102028 20827 -78572 -155555 -34768 -43671
23395 -43671 16154 100902 63943 49651 18134 19253 -62238 -77347 -74376 -151089 -109661 -1116
23383 -1116 -31971 -35451 -4602 -35004 27776 12028 16799 38519 159800 170926 112592 26396
23371 26396 -69645 -121135 -165353 -174425 -44802 -56300 1073 -19304 -63265 4225 72464 130374
23359 130374 139361 65525 71700 25195 72897 38831 30016 59377 14654 -57682 -15293 -2380
23347 -2380 3034 -32445 22909 20457 1209 -64731 35132 119540 28638 3053 56275 26708
23335 26708 -73572 -138227 -32785 98629 77606 103085 63460 -18050 -3972 100607 16623
23324 16623 29199 36071 2497 -54102 -60257 -118750 -196414 -163189 -147649 -97261 -177154 -190794
23312 -190794 -61433 -31543 15538 -27606 -49257 -94248 -51715 -64189 -7399 25061 35451
23301 35451 129909 179058 174143 100643 -94424 -276904 -263699 -207292 -78471 -5563 3464
23290 3464 15239 14142 35942 99671 118200 48365 64843 77304 27254 -129320 -79280 -141564
23278 -141564 -240956 -143395 -103024 -57825 -31653 -128341 -121911 -59613 43651 114469 50068
23267 50068 -113214 -196075 -82477 -56627 -35150 -33467 -34571 -141100 -80547 -17745 14387
23256 14387 57927 78942 -38901 -55321 10757 -31048 -37109 -17996 19874 -18572 -115797 -112259
23244 -112259 -83310 -83881 -76846 -66074 -76579 -46343 -42477 -84937 -150263 -163391 -207348 -141606
23232 -141606 -121504 -143897 -70569 16586 -29262 -70124 -132427 -82483 -131449 -95897 -26172
23221 -26172 83622 32613 -50666 -46669 32501 122950 98261 -7469 -2637 62861 118146 154938
23209 154938 154813 64600 -16683 165546 207836 32051 45550 33632 -35937 -17336 -51668
23198 -51668 -49243 32945 110072 146772 -44139 -148533 -68669 -41193 -799 82675 127669
23187 127669 57148 81219 10715 -9791 6000 19853 4570 19038 -37636 13913 -10325
23176 -10325 41669 -25037 -79379 27687 72127 -4191 31566 93681 1706 -94282 -109431
23165 -109431 -40996 -3314 -47630 -81400 -68550 42959 133223 78844 95352 84113 -63753
23154 -63753 -146609 -127056 -121032 -52875 64153 -12962 -83074 -15803 -11689 71241 84714 73824
23142 73824 67165 117015 165027 35105 -21649 -72591 -47009 49523 -10216 -13701 42286 -47886
23130 -47886 -2616 97531 36569 -68138 -142665 -139935 -125973 -12569 -16263 -83188 -52369
23119 -52369 60973 47384 27996 111121 108551 15699 45516 99374 75091 37538 95782 166901
23107 166901 106955 85909 72518 -28178 -73632 -13502 79460 32551 -2247 12 -83388
23096 -83388 -30638 15286 27886 90609 51435 133063 175810 108573 49043 6247 -12955 -72942
23084 -72942 -68488 -106762 -180682 -156244 -109329 32884 162788 240129 355701 283659 176839
23073 176839 49096 -13001 -25364 74228 8036 -48476 -78099 -102266 -114303 -61897 -27765
23062 -27765 -30600 116632 238030 146279 89739 83479 30746 -39606 -71831 38844 233160
23051 233160 248032 202969 52915 -35491 -145924 -224891 -218423 -213855 -160594 -85276 -132279
23040 -132279 -106021 -59078 -85767 -22305 -70720 -109915 10813 107368 103665 5109 -19393
23029 -19393 -75837 -30110 -9133 97607 250082 126347 41874 88811 77524 53650 73934
23018 73934 69772 -27011 -67062 -92358 -27989 -26226 -127138 -178615 -188861 -159157 26837 109161
23006 109161 58668 10981 5388 9686 -12369 26942 143441 134690 152377 56013 18203 29942
22994 29942 19563 -61174 -93266 -146297 -233339 -186535 -71336 -50829 -110723 -123034 -59412
22983 -59412 -73287 -199734 -218032 -127908 -45883 -38203 -7496 -70490 -136115 -135122 -124709 -72214
22971 -72214 -40074 -75383 -20737 -1444 -29881 -166502 -167050 -154068 -169428 -178935 -170891 -110080
22959 -110080 -104050 -155994 -102664 -22534 -70137 -138651 -58336 100464 134000 28080 -12281
22948 -12281 24046 -11069 -116563 -162381 -139760 -104447 -142945 -108609 -7686 -22544 -28292
22937 -28292 52957 45519 93292 19272 -42521 9311 3187 -10161 27098 105457 -29809 -112189
22925 -112189 -149185 -166982 -88664 -19532 -7684 72898 129369 134563 87691 14432 -91457
22914 -91457 -80650 -39685 70511 97623 31526 54137 66597 -32685 25703 -35231 -176616
22903 -176616 -226411 -218735 -112527 -45770 16875 98737 121542 185389 214575 96730 -36286
22892 -36286 -29259 -6919 -97151 -49510 -123622 -65405 -66881 -49041 3588 78729 58302 -12684
22880 -12684 81501 93147 82810 46537 67065 -5115 14622 23029 -55362 -48199 -68267 -63011
22868 -63011 -45368 26026 76364 102589 8278 -44107 -127795 -126132 -86208 -79849 -27525 -68007
22856 -68007 -39850 -47741 10502 -27876 -83903 -78644 -73238 -89319 -19982 -47870 -163530 -190075
22844 -190075 -136472 -88927 -52184 -113066 -62571 -35916 -72075 -99576 -58530 20772 102071
22833 102071 29585 -69091 -97175 675 -86467 -95850 -50962 -104888 -85412 -97378 -98534 -128798
22821 -128798 -115120 -66011 49376 33395 -9395 -44337 15170 4984 119565 104449 47294
22810 47294 -39871 -15525 42586 56529 -13976 -90823 12578 9926 -58144 4824 61560 134708
22798 134708 79178 8341 -49118 -87879 -143804 -80896 35323 57761 21560 -6550 49788
22787 49788 104728 55143 45117 38839 36290 101480 75495 64557 104451 73515 20533 -17049
22775 -17049 21266 -55079 -109995 -58557 -89467 -39241 -36243 -119757 -156145 -147549 -1652 -5957
22763 -5957 -136581 -33834 42215 105973 107981 98407 -25482 -70225 -71894 -86685 -96504 -156618
22751 -156618 -58332 57649 -10818 -49466 -57235 49935 79406 128915 58523 133474 34278
22740 34278 -129593 -125003 -92551 -123408 -67807 -10386 -119355 -39711 26611 124997 106892
22729 106892 130349 127415 134368 119306 18818 59931 194277 202605 46087 58086 135490
22718 135490 109569 106185 155964 224832 301037 155208 94894 207193 180780 183998 202699
22707 202699 241400 216659 148207 107472 94835 83560 -24825 4514 -78703 -152157 -133245
22696 -133245 -153220 -125586 -44732 -114546 -145853 -132836 -49697 -61232 -53536 -31831 -76213 -73812
22684 -73812 -111358 -129271 -73148 91446 162778 118892 89674 104124 57562 -1285 -206068
22673 -206068 -304122 -231616 -155743 -91971 17173 102144 -18842 -93241 -93618 -105187 -87699
22662 -87699 -72533 -39760 -46336 -26036 -45022 51945 95806 23960 -77254 -49319 -86372 -165247
22650 -165247 -167368 -151943 -58237 -23114 -12634 -39178 -47659 -51268 36724 32411 -41852 -90061
22638 -90061 -63982 221 -17771 79193 57014 37065 -77250 -95267 -205176 -227853 -113077
22627 -113077 -44972 21665 26324 -70075 -87111 -101408 -101271 -65392 -48907 -80851 -77732 -160151
22615 -160151 -244415 -175011 -51615 25005 24027 -20435 84746 146311 4697 -73250 -71086
22604 -71086 -50975 -59821 -82728 24861 126147 212666 230792 103848 93221 102922 31686
22593 31686 -71614 -111752 -33961 30470 71927 21133 5869 8774 -10366 4603 -6255 -136140
22581 -136140 -117255 -134070 -147549 -55291 -34685 14578 -35658 27005 29140 -3794 -67707 -94647
22569 -94647 3627 -70426 -62789 11105 74702 165811 223775 161187 91880 46733 14910 -25602
22557 -25602 -47266 -45759 55926 111914 103768 110385 72906 30585 15939 77651 37710 6208
22545 6208 -27171 46317 48858 -35993 -60425 39069 177512 2471 -157156 -155603 -99946 -77062
22533 -77062 -69749 -94955 -91281 -59051 -170716 -260023 -178985 -23056 180163 232094 242909
22522 242909 217079 14581 -53723 2574 -36413 -42855 -48071 -4412 -36385 -37555 -81112 -191838
22510 -191838 -104438 67215 101907 71470 -4330 -81149 -71495 -91002 -25010 -35461 39383
22499 39383 82698 99163 87006 49365 -7994 -18692 -99526 -183009 -194154 -147197 -80276 -10408
22487 -10408 -3009 -7521 22101 11644 47215 32550 -118140 -232401 -102934 84851 -38504
22476 -38504 -55303 119223 162863 50249 -95901 -260970 -248261 -109278 -8425 37705
22466 37705 -20302 -126207 -193015 -165463 -60708 104898 172915 144282 39694 16357 7053
22455 7053 -42574 -70724 -50358 -62825 -143888 -56062 19314 -90382 -139440 -91193 -44668 -137355
22443 -137355 -239977 -176862 -157488 -172758 -143212 -105405 -41769 -106637 -91215 -106074 -127040
22432 -127040 -119858 -175396 -86956 -28992 19517 -983 -63852 -85621 -66035 -49034 -458 -89840
22420 -89840 22431 129340 9676 -61949 9228 -90849 -140818 -101339 -115520 -165906 -158990
22409 -158990 -64834 14077 -50524 -127242 -106778 -154548 -111055 -20102 -79546 -33818 6083
22398 6083 75782 135401 131781 129167 132748 122549 78429 -51697 -143824 -105217 -206871 -187541
22386 -187541 -205582 -162382 -171183 -161889 -173659 -13925 111752 78174 28857 -148074 -125450
22375 -125450 -6639 31212 83332 202448 209332 161642 130928 126204 68124 34145 -108731
22364 -108731 -121887 -76855 -41808 -53653 -77843 -143651 -108012 -123214 -31779 -34636 -81104 -72258
22352 -72258 -132739 -118789 -167485 -170373 -208135 -271192 -268053 -169812 -91174 133073 292220 173146
22340 173146 97032 14782 -108225 -78452 -65854 -78589 -11799 -34422 -8513 -26295 -17816
22329 -17816 10474 89661 143171 140677 45227 -5291 -67233 -100516 -163991 -139809 -79472 -32789
22317 -32789 -66808 -4581 31998 132997 91408 36455 -34900 -39414 -42802 -1885 -24273 -18984
22305 -18984 88335 139237 56383 -125011 -202589 -316341 -224722 -106353 -19961 -73414 -151137
22294 -151137 -176324 -124894 -91554 -111785 -132144 -160823 -166348 -169222 -32539 -29436 -57242 -93178
22282 -93178 -132677 -168569 -168227 -57230 -49244 -86438 -5650 58495 -60305 -81125 -61303 -147875
22270 -147875 -205194 -207876 -250172 -232964 -259458 -233681 -147787 -20315 -43187 -76447 -76325 -31789
22258 -31789 -105653 -212965 -154297 -88234 -175381 -140135 -117596 -164128 -85855 -87482 -161875 -121734
22246 -121734 -148718 -147949 -52294 -81357 -63307 -19440 -47517 -124096 -159934 -135777 -56102 -29465
22234 -29465 24545 93375 61299 -34591 -36373 53672 89170 100844 162008 131277 75755 9659
22222 9659 -108861 -121193 -60790 -37036 -87210 -145682 -82597 -74834 -75841 -72914 -54552 -15051
22210 -15051 -75195 -28917 -24309 53241 189626 104524 3230 -19062 -24342 82466 64924
22199 64924 -17420 30480 29114 8295 41503 14090 31628 172697 -5863 -55450 -110771
22188 -110771 37658 111518 25482 -47891 -82501 -34039 5675 -156 -78891 -96598 -60946
22177 -60946 -45615 5311 50440 107038 103383 64073 -80760 -168384 -167219 -261577 -224911 -116466
22165 -116466 -72206 -52621 -84473 -65704 -163885 -237585 -116126 -99483 -181727 -182491 -41027
22154 -41027 -6899 -77233 -112320 21750 7121 -10073 -40007 -119568 -23592 -3911 -52396
22143 -52396 16987 28772 -23301 -60237 -109532 -80060 31714 -52737 -170753 -90328 -117204
22132 -117204 -203027 -261155 -328024 -353074 -233044 -108580 -89092 -65841 57717 196753 207437
22121 207437 131609 39130 61249 81392 161352 158961 175829 215753 193485 80326 7982
22110 7982 50795 -9976 57528 129246 181446 102715 85448 20208 -16161 -20591 -2329 -54592
22098 -54592 -148414 -132996 -111487 -96384 -138680 -150685 -77140 22346 1390 15009 121522
22087 121522 159855 208913 129240 60234 19154 -14925 -17841 17999 -2411 -99145 -173212 -116825
22075 -116825 47695 134037 21217 -22954 107949 137445 59236 62318 -509 -4068 38377
22064 38377 45140 -9150 -79256 -59297 -47353 -18999 -77633 -157271 -166300 -75500 -96539 -133487
22052 -133487 -78252 14115 13128 1999 -16514 -45549 -27372 54798 120859 112924 152243 223643
22040 223643 148001 49149 -24960 -7092 96316 18940 -10503 15796 5233 -43591 -115528
22029 -115528 -117626 -246463 -197276 -79639 -10661 -6284 70401 22341 -63967 12191 27671
22018 27671 29768 78752 46668 -23929 -88593 -151738 -88558 -73653 -117310 -65251 -58636 -58148
22006 -58148 -80130 -157399 -258857 -219341 -66232 57853 128351 80576 19833 -64632 -114765
21995 -114765 -64946 -134560 -126554 -84249 99525 181657 169637 107235 -50782 -25246 69931
21984 69931 93159 -44425 -171957 -166860 -154693 -201102 -202820 -175072 -179389 -143363 -44901 -9593
21972 -9593 20972 -2250 -40124 49764 29382 -12180 -13241 -62085 52613 158076 134749 96822
21960 96822 90267 -7929 -62312 -36938 -95391 -22448 -11645 -8139 88445 132950 117305 192683
21948 192683 172201 62815 -82501 -61082 -33913 59662 131715 177247 151786 59430 66312
21937 66312 82271 -19446 -102674 -107774 -142692 -111763 -57410 142171 201447 202196 143079 -5557
21925 -5557 -134841 -72512 -49769 -83748 -86523 -90792 -79171 -113585 -180396 -136448 -129881 -13468
21913 -13468 40195 19926 44458 7961 -68867 -92076 -89771 -70506 -122869 -144794 -181475 -222514
21901 -222514 -197510 -88030 88833 152918 48368 27808 -2710 -81677 -126930 -133336 -105305
21890 -105305 -102697 -110047 -114094 -73967 -83757 -49396 -99927 -118495 -68443 -65714 -33048 5585
21878 5585 -18917 63793 82585 95281 40695 111356 22187 69625 59108 12740 -37325 -101403
21866 -101403 -165919 -88847 8875 26327 -53210 -98251 -129588 -132740 -25817 74858 146146
21855 146146 80351 -96170 -181433 -177092 -112628 -79503 -89939 -194670 -197011 -201784 -176132 -123401
21843 -123401 -22507 -18771 -22574 -68281 -135152 -92937 -40175 23200 116421 49642 -118466
21832 -118466 -107001 -7645 79066 173174 132916 147015 98093 102602 27382 37954 29826 -22235
21820 -22235 -102145 -157086 -141936 -136432 -121780 -187355 -190916 -101816 -126316 -77085 69850 166836
21808 166836 119760 83817 118214 56537 9277 -15728 -83740 -144884 -85099 -16378 63476
21797 63476 -7618 -17761 31535 7400 -62963 -35232 64081 -25662 -77110 -44498 -41618 -60423
21785 -60423 -34296 -50280 -41019 20184 108169 118401 165888 139165 85391 96807 67933 7137
21773 7137 -72122 -79377 -124518 -176688 -256255 -215600 -88271 -54723 -128158 -153723 -84018 -38097
21761 -38097 -3443 23160 -8278 -30189 20007 108330 147598 6754 -124377 -110968 -100853
21750 -100853 -90237 -71856 -16663 -1993 -118086 -125161 -115559 -149133 -185242 -90628 -18398 -82869
21738 -82869 -92493 -129027 -92378 -90825 -24837 -50426 -154103 -227310 -304054 -144380 -48396 78871
21726 78871 189115 255556 291925 261548 153651 54163 29331 -5678 -8344 56574 43729
21715 43729 -15981 65835 70233 20016 32186 -12653 82159 181144 107397 65830 6997 -11567
21703 -11567 -62476 54204 172944 104415 10431 -47799 -40083 -86644 -109386 -143120 -127343
21692 -127343 -172766 -140376 -71847 -121199 -129816 -179358 -244193 -135798 16698 104457 180045
21681 180045 165867 146715 78095 12510 -74731 -123572 -154984 -170894 -71592 50655 48619
21670 48619 144824 197502 116156 75195 -20655 -51017 -2565 -29694 -70606 -78357 -559 -9072
21658 -9072 -78297 -90260 -27116 -109810 -206959 -112797 44166 112053 5178 -77062 -67405 -125836
21646 -125836 -106277 -20150 -67822 -129329 -51977 8008 1484 64447 -42932 -35062 21088 38373
21634 38373 -15707 -43445 -127751 -115232 -129860 -154472 -102575 -130709 -16251 77038 25843
21623 25843 -33371 -46952 -44445 -43302 6379 -9501 46131 150110 146682 39204 36824 -43838
21611 -43838 16423 121451 112868 -71169 -70513 -127051 -276940 -174652 -77132 -58391 -132489
21600 -132489 -80299 -6912 -18497 -26390 55006 85422 112504 169661 183638 18472 48956
21589 48956 16487 -95680 -122651 -100430 -26602 29242 14043 72956 92432 53213 -37509
21578 -37509 -148139 -147829 -88067 -91498 -60780 59631 29234 -32972 -77243 -51185 -58387 -15008
21566 -15008 71718 37320 -16342 -52795 -110947 -85006 -73374 -113462 -38861 -32034 27877 85534
21554 85534 29419 -164455 -213753 -191613 -110102 -164125 -148116 -63332 -34837 -69679 -50007
21543 -50007 -26170 -110432 -187311 -112551 -15374 92224 25800 -132015 -164355 -139628 -181733
21532 -181733 -207085 -172702 -98729 -84083 -2828 35923 24902 83200 69836 34174 17598
21521 17598 42438 -121318 -177828 -187735 -107831 -2020 -40723 -85701 -134533 -115246 -74834
21510 -74834 -16566 -125009 -147407 -169904 -43948 34083 26827 55139 112517 219839 134990
21499 134990 8425 -17367 -95659 -162625 -95892 -29135 -103325 -42914 73692 183243 119669
21488 119669 81934 56217 -28498 -195208 -232648 -101620 -80989 -90400 -148847 -95261 22055
21477 22055 -13884 12216 77448 26568 -41647 -164713 -133199 -92153 -22799 56314 2394
21466 2394 14923 -39109 -185658 -101656 54290 -62060 -210305 -228207 -112227 29289 80896
21455 80896 120520 99690 19868 -66102 -101709 -75648 -92117 -118464 8280 68881 56091
21444 56091 -39348 -154608 -162000 -165281 -121475 -128559 -34838 -65198 -95044 -105130 -169218 -163789
21432 -163789 -71108 32717 10836 48883 99269 105171 72190 4294 -79261 -178972 -179604 -178779
21420 -178779 -178662 -79492 -175055 -147045 -66675 -21412 -16666 -17571 54082 55553 57136 13753 -87140
21407 -87140 -574 107819 96290 128807 165187 135939 26383 -22585 -19652 -55306 -69896
21396 -69896 -8234 -36042 -94267 -129941 -114514 -72263 -8887 -23724 -47009 -131165 -108505 -94557
21384 -94557 -118362 -23541 -16997 12533 26803 33666 -12025 21995 4589 -67411 52563 140453
21372 140453 122048 110613 61121 -15325 58900 72484 40116 55432 105111 6587 -133080
21361 -133080 -110819 -87991 -26999 8872 -128252 -172582 -91632 -103502 -129821 -34219 51468
21350 51468 3592 -96886 -119981 -73006 -128672 -241807 -264020 -184087 32716 67831 108961
21339 108961 57196 96656 186294 193600 175647 162493 87300 7342 7958 -5839 43382 106505
21327 106505 67042 11691 -16565 -43826 -62296 -134700 -9517 182875 171680 53056 -30452
21316 -30452 -76742 -86295 6385 148065 90844 -7040 -2519 2315 3290 -26856 -54066 -91195
21304 -91195 -69895 53783 4040 -40917 -43903 46329 176963 169036 134067 64511 28726 -11331
21292 -11331 -35539 -99901 -82735 -56143 -33435 -42454 -93597 -48033 -39473 -133709 -191352 -52281
21280 -52281 33193 6733 -10368 -24562 13786 32247 -121400 -134501 -99179 -77805 -77202 -8919
21268 -8919 42912 60407 21829 -10062 -33469 -33999 -106371 -162947 -205796 -103601 -16826 -24342
21256 -24342 -35819 -10936 63741 80874 35612 -9745 -38488 2227 62668 127568 98097 139529
21244 139529 139301 109864 37579 -9511 27858 106434 107352 55940 25859 6688 46995 55643
21232 55643 64043 -38061 -10196 24040 -83038 -144381 -37718 -107601 -234950 -128557 49629
21221 49629 45079 -6969 -60857 -50774 -28796 -79576 -49527 -88586 -31703 -74878 -82023 -18592
21209 -18592 -2854 -1539 -23700 -143022 -247364 -133197 -162247 -180527 -225040 -187667 -165165
21198 -165165 -214649 -78737 48530 69480 72303 8913 3834 -36004 -18645 17812 65037
21187 65037 -53434 -145944 -126804 -65125 -29877 -50872 -66280 -106858 -108840 33871 180842
21176 180842 141154 -66766 -119630 -145960 -76796 -72088 -74170 5842 20459 -89473 -161091
21165 -161091 -69824 47907 153940 128934 60078 -19040 -129382 -160465 -127343 -159404 -134811
21154 -134811 -1071 64962 15713 -46551 -69084 -35058 -81020 -103468 -22645 -10845 -98957
21143 -98957 -115089 -23169 -91319 -193559 -204474 -109712 -95927 -30032 104407 118348 65222
21132 65222 99300 127141 107372 130444 125393 49930 91935 126213 43214 16580 6928 -78902
21120 -78902 -210661 -176451 -127697 -42276 2755 -84152 -46968 53916 60974 109579 98977
21109 98977 62869 45333 899 -28727 -31293 -58898 -112745 -193853 -121902 -115568 -88163 -56120
21097 -56120 26967 102171 153265 116023 4534 -39623 -56628 -78010 -45183 21932 -11212
21086 -11212 -194745 -188152 -94822 -73770 -200996 -187066 -78060 -38204 37098 -11958 -34673
21075 -34673 -142879 -147812 -147943 -106268 -191700 -160871 -25424 82517 102103 -9764 -51698
21064 -51698 79897 46558 -63099 807 -13266 33844 67729 80296 60030 95632 -38431
21053 -38431 -86697 -47565 -47676 -143416 -111796 -30979 -21054 2754 25456 61135 190518 186105
21041 186105 51827 5471 -107068 -202497 -78392 -13713 -25350 -50172 -27943 -42558 14036
21030 14036 -59267 -194407 -120440 -5855 54416 71778 -87227 -113786 -86082 -24008 1544
21019 1544 24768 17017 29764 -22484 -2646 -23694 -51996 -33571 -13109 86063 131829 176090
21007 176090 141633 207457 124472 -24661 -164497 -208130 -74990 -3374 -23829 21173 15104
20996 15104 -40883 43961 33461 -21852 -93474 -89352 -54031 -59856 -108672 -70459 -14794 -14774 37982
20983 37982 54781 68588 22875 -44264 -104476 -198956 -201990 -198089 -239460 -168508 -80928 -114671
20971 -114671 -172172 -98870 5335 -22234 -66943 -79486 -106196 -133008 11424 100532 31281
20960 31281 -15806 -12122 43605 41806 82599 124018 151808 16027 -93906 -49965 44471 -8390
20948 -8390 92231 217169 206741 86267 -105014 -140499 -91723 -22225 29368 39467 45818
20937 45818 11597 -9143 69636 99403 103792 14794 -14790 -85073 -121886 -106437 -74767 -66882
20925 -66882 -66277 -16020 61084 163792 158050 249705 151351 117401 43034 40193 -63259 -151508
20913 -151508 -114606 -31868 -47753 -99252 -106555 -57475 62987 116694 27384 6601 -11090
20902 -11090 42680 72306 15904 -71859 -140256 -71724 13820 -9234 -45321 -47052 18546 13970
20890 13970 -9322 -31831 -80124 -69232 -117914 -106533 -45640 -1452 27029 -49152 -136319 -101090
20878 -101090 20813 -27338 -232150 -236654 -139511 -100703 -107118 -108655 -94527 -106169 -158442 -242620
20866 -242620 -170272 -142401 -129474 -42525 54833 110539 136596 80380 19087 40140 106176
20855 106176 122065 145572 89540 -584 -2695 50736 1331 -98714 -14175 13370 -26106
20844 -26106 -102709 -49326 67135 85863 93345 74377 -32776 5482 67705 166181 302891
20833 302891 260690 103488 -17166 -42734 -33565 -51678 8706 102576 50663 -9859 61826
20822 61826 124726 31024 12671 -26596 -117254 -207028 -156006 -122295 -180277 -139393 -65548 -44127
20810 -44127 -17955 34502 90284 15615 93800 117234 26014 63081 64424 -92554 -108465 -133919
20798 -133919 -148303 -180372 -120467 -62766 -96746 -127950 3793 100169 88487 55280 -60333
20787 -60333 -37266 95022 112826 136781 43394 -41912 -19871 -42848 -77900 -30101 36916
20776 36916 15552 -60622 -96036 -145641 -132203 -101436 -48402 17742 72134 114820 100217 43822
20764 43822 57338 90136 10360 -46217 -3706 28666 -21720 -50465 -79940 -25563 -18975 -39464
20752 -39464 -83740 -25136 -43904 -44130 -101748 -26674 65537 62837 -42273 -225368 -211067 -89560
20740 -89560 84000 22100 12251 52561 24293 37174 10475 82908 81483 3718 -134787 -186360
20728 -186360 -34251 64296 -78913 -153085 -135065 -72427 12076 47507 59648 14149 -77716
20717 -77716 -213671 -241168 -110385 -53905 -23039 18039 2800 -65702 -38971 -2314 -5085
20706 -5085 29448 84777 93460 46839 41750 143036 202645 115109 -21365 -84817 -80276 -8605
20694 -8605 31716 79847 169366 172552 155945 144213 96116 21380 -2963 -56897 -185230 -225535
20682 -225535 -217930 -75182 -82458 -103394 -212991 -167083 -147959 -127714 -19057 19635 -37548
20671 -37548 -108048 -106629 16300 37984 -14212 56125 44373 -22347 -67122 -75343 -19480 -79310
20659 -79310 -29168 -44815 -47957 -24747 45176 85537 60537 -26440 -97063 -20970 31908 -82152
20647 -82152 -166667 -152173 -179743 -180877 -101861 -51000 136244 221480 222072 120596 -12264 -83347
20635 -83347 -134166 -200111 -121985 -62632 -22743 12160 -4634 -1518 -16795 -112084 -227862 -171172
20623 -171172 -136746 -221099 -129074 -41815 -80087 -68638 -86387 -110920 -105769 -126586 -140537 -104304
20611 -104304 -28696 115925 124738 -31897 -32288 14979 17630 30493 26716 -44651 -35474 -19655
20599 -19655 -37875 76324 77826 28705 2330 -41260 -86585 -156413 -241588 -146768 3828
20588 3828 88914 121148 86527 73082 4853 12915 50901 81153 168329 164722 139009 89989
20576 89989 -26255 -77334 -67094 94860 135212 77062 77474 -18494 -66493 -66768 -9813 142285
20564 142285 173827 174873 171400 125812 101536 118757 30365 -64259 -81715 -133034 -115547 -68995
20552 -68995 -83486 -148904 -54583 4034 -29704 9673 30628 -28159 -76235 -113947 -115956 -114046
20540 -114046 -203021 -244936 -204422 -107872 25946 -35114 27371 -36891 6856 -22932 -177057
20529 -177057 -115929 -62191 -58992 -74501 -60212 -51831 -5868 -102850 -32362 220759 213852 21014
20517 21014 -57115 -70091 -122418 -116901 -77772 -47405 26874 98729 126448 35675 -70987 -107519
20505 -107519 -108145 -86961 -52073 -19535 49710 8345 -48809 28685 122528 92440 93284 138881
20493 138881 126687 89043 43064 17413 -41195 -76998 -101443 -28390 -32087 12174 74824 4177
20481 4177 -170213 -90501 -24560 -77235 -136719 -107114 -64605 -52337 -61231 -130236 -155714 -182038
20469 -182038 -148918 -53636 -40516 -49926 30879 39852 18053 12277 1729 -4419 -102728 -116832
20457 -116832 -2616 65454 21592 16289 6227 -41354 -39640 -16888 -43058 -5290 28377 64907
20445 64907 59769 -22125 -190579 -216186 -79228 85727 157579 85835 -21929 32362 69570
20434 69570 83904 34329 -39485 -137525 -140246 -97520 -167936 -168745 -60930 -81241 -118937 -119058
20422 -119058 -108166 -71687 30099 85412 42908 -101401 67991 151626 27106 -52770 23807
20411 23807 63107 15262 -27093 21813 -56250 -125188 -112459 5218 78535 171847 185779
20400 185779 121116 65060 40826 -49488 -48784 -127291 -135892 -81326 -84114 -117651 -137417 -210639
20388 -210639 -151809 -90740 -31923 65931 167856 91461 -23803 -89521 14150 67441 86381
20377 86381 49684 5785 12304 36493 -53074 -55516 -52115 -135006 -201101 -257997 -265200 -174838
20365 -174838 -124172 -109366 -85208 -103127 -148411 -114629 -117709 -71704 -2518 115880 77977
20354 77977 -20627 -105723 -126685 -90471 8426 44758 72033 2550 -97360 -81687 -101556 -91122
20342 -91122 -69017 -78482 -39603 -61621 -101247 -60860 -99757 -87334 -80098 -40309 119682 158849
20330 158849 227100 169843 125540 100981 15414 -26408 -5589 19032 69779 155994 236024
20319 236024 131085 -25576 113496 144305 56298 -42932 -6363 72985 67393 40621 35304
20308 35304 -54048 -59945 -15325 76907 127033 186517 229714 109512 117264 169339 279213 284223
20296 284223 216266 182993 206989 155953 17556 51403 107173 87673 30590 70480 58780
20285 58780 75127 134807 164814 125956 66665 72287 94873 38467 40359 78250 8690 -2363
20273 -2363 94757 31369 -38256 9744 179802 132363 150452 114404 70381 41647 47521 125807
20261 125807 62978 38489 -40040 -2151 71100 66445 106287 163299 172926 52520 62752 98908
20249 98908 197307 180675 110636 81074 55639 -42307 -52714 54203 103505 12648 8707 66946
20237 66946 65646 110919 22711 -115169 -174295 -145959 -197061 -107908 -84559 -54951 -9145 -26467
20225 -26467 40501 7144 14076 36128 115697 98040 67638 53834 19115 35662 39438 -24495
20213 -24495 -90565 -140417 -50147 185077 255469 235431 167593 122103 156743 254902 243453
20202 243453 142328 60043 -60975 -22004 36005 28076 -19627 60572 137721 98311 89338
20191 89338 84691 61448 -13435 -62134 -58325 -89526 -119845 -123703 -181747 -171785 -226700 -239220
20179 -239220 -177468 -119736 -109553 -106632 -122449 -87252 -53608 -102891 -70886 -68544 -37319 -125116
20167 -125116 -113040 -110993 -64383 7989 -40085 -145964 -204779 -245370 -178177 -184046 -172779 -166952
20155 -166952 -70868 -36455 -77319 -123165 -153890 -154304 -169190 -104496 -61686 -168355 -171824 -136113
20143 -136113 -38053 12420 -41342 -8904 16726 789 118047 93443 31875 46098 29486
20132 29486 -39669 -67676 -43501 -116469 -94664 -94406 -199651 -231940 -88637 -13458 -79994 -40439
20120 -40439 -63527 -1212 6629 -187781 -180537 -106631 -67777 -15712 548 -61763 -145998 -70746
20108 -70746 -43104 -51888 12644 -2965 -35080 -154963 -225289 -215829 -244857 -143482 -48750 -47496
20096 -47496 -76963 -151183 -246771 -146512 -11838 -529 -69018 -64109 -26417 120960 199894
20085 199894 128348 69186 -19454 -76204 -66376 -13206 50469 -1835 23473 57146 222891
20074 222891 273396 184847 175440 36854 10984 39136 -23155 51795 58885 140231 119492 55635
20062 55635 57677 -18294 -97310 -123804 -55794 7605 7429 -17155 -35615 -56207 -74713 -69645
20050 -69645 10643 82818 35355 -50325 -42716 -30719 82870 127947 56519 -86403 -23394
20039 -23394 83074 154287 142597 90783 -28888 -155689 -335499 -280415 -175722 -107714 -37589
20028 -37589 -5894 -47239 -173488 -138682 -155881 -106394 -175632 -245524 -237786 -172345 -103665 -55940
20016 -55940 -12077 -43688 -128585 -148271 -17039 -69258 -88776 -20505 99124 118561 53523
20005 53523 -2810 -118609 -86749 -25489 -44905 -65170 -11461 58070 108774 90290 -133476
19994 -133476 -105323 -28045 -22434 -7322 -26420 -87467 37102 160411 104489 24984 29774
19983 29774 40814 72887 166228 175605 99708 -47919 -90377 -34148 -38551 -4545 -11526 3478
19971 3478 -2067 41507 36310 141192 116774 74712 84362 96808 26639 15964 57656 -17651
19959 -17651 -16028 67511 37897 -61277 -77424 -80913 -125803 -145678 -74843 78262 72586 24388
19947 24388 -5127 -17527 -5736 -75826 -135943 -66916 -22564 -119910 -121117 -220688 -197496 -140469
19935 -140469 -97015 22846 8937 -56470 -44363 21584 31003 409 90167 67654 55644
19924 55644 -15495 -78989 -30236 -43995 -48923 10918 -5 -12872 -4942 -11937 15565 32809
19912 32809 56509 43783 54929 117774 150448 84787 71396 104962 218668 163919 125982
19901 125982 115642 70446 63460 87963 28641 -111827 -112953 -57780 -50829 -64637 -40990 -59173
19889 -59173 -209303 -236447 -63094 -39165 -36327 -97605 -136664 -142152 -35748 -8459 -14733 -43799
19877 -43799 -90157 -972 55276 -52465 -51094 -141702 -83638 -40782 -92585 -237542 -167878
19866 -167878 -71949 -81277 -146029 -220704 -210763 -137316 -150940 -76516 -74654 -46827 -53379 -123236
19854 -123236 -289135 -292842 -141687 -58669 -75451 -29745 63889 72269 4345 98122 114742
19843 114742 69458 26920 -1328 -34638 54169 4245 1286 44492 -46862 -153092 -172311
19832 -172311 -63749 63747 42525 -59253 -167337 -158607 -141500 -197736 -201828 -75810 36927
19821 36927 29450 55087 87693 23076 -72776 862 104617 205140 82249 -67079 -20
19810 -20 56541 10336 53307 -41112 16542 48032 -21391 -129818 -139942 -189501 -159750 -177993
19798 -177993 -147643 -176292 3230 79205 29334 32948 -42704 -80603 -16532 50433 144039
19787 144039 -15548 -105282 -167103 -124266 -126247 -141638 -79665 -45722 1577 127220 197979
19776 197979 172020 22814 -62444 -70406 56536 104562 122679 -3248 -95698 -159182 -186043
19765 -186043 -134370 -13153 102047 179251 185862 163167 169752 179223 111067 73432 23566 -58603
19753 -58603 -49015 28123 61316 -27501 -26871 -52135 -78593 -44790 100419 209983 173575 121257
19741 121257 55401 5686 -6815 -110541 -62058 -27243 -29133 -43296 -136719 -50795 -32998
19730 -32998 -109060 -69384 -109497 -100881 -94859 -47157 -17579 -21155 61861 113082 106453 75529
19718 75529 -30129 -84222 93637 164994 97352 118798 79371 54294 30030 -53011 -16624
19707 -16624 -3429 -12716 -78007 20740 -9592 86554 115956 86978 10043 -30247 -13415 43609
19695 43609 40861 71158 -43517 -101279 -7340 47884 -28657 -113170 -91252 -93399 -52518 21747
19683 21747 3741 -7785 34633 31521 22850 28443 116884 128551 61705 41994 161746 175001
19671 175001 101170 45503 33955 83216 167258 136166 51064 -27767 -86835 -103864 80957
19660 80957 228520 249433 335299 246479 105378 100929 75954 117669 166635 225479 174073
19649 174073 81647 83585 115378 47979 -24839 -74814 -131015 -108313 7415 64463 3582
19638 3582 -18143 -27245 -62550 -7927 77302 23394 -18818 -9973 -20974 -15751 -111880 -77393
19626 -77393 -204775 -171377 -83954 -90613 -48458 -47512 -108675 -35310 -15046 43130 -773 -91926
19614 -91926 6994 98243 123414 24989 32295 29769 49444 -15405 -67175 -26779 142351 216282
19602 216282 92327 16334 -10103 16699 136765 103103 42884 -17109 -139642 -61335 48463
19591 48463 -18601 -90261 -82840 -155147 -144546 1957 13939 102944 181878 111972 69987 47964
19579 47964 53540 80844 44391 3755 -36631 81612 116643 63421 -21890 14517 83692 107667
19567 107667 44229 -10435 -40788 -61943 -116300 -146464 -6257 104273 109234 32020 -47325
19556 -47325 -36026 -18539 -11500 -94545 -143263 -134356 -56812 6395 58182 -7492 -2533 31418
19544 31418 58849 91215 92785 58492 -43704 50871 117790 -21754 57318 72563 35043
19533 35043 -44649 -110568 50728 150137 223211 214569 164259 160017 178817 72477 54781 -5305
19521 -5305 -30433 -27016 -9550 -46215 -14854 -114929 -155532 -142872 -123754 -195894 -251886 -203357
19509 -203357 -158654 -114004 -40146 -78595 -117435 -188446 -16252 53102 85663 66776 38731
19498 38731 75381 91266 -80616 -98742 -35679 -14990 -65802 -49594 -11356 -7674 94763
19487 94763 164925 155680 4122 -135215 -207514 -163887 -99486 -79965 -75821 -72302 -12701 -38568
19475 -38568 -17362 15197 77320 106649 47700 66083 47648 23610 -41959 -118234 -104217 -84128
19463 -84128 -58559 30674 116014 56686 -13320 -49497 19528 -43378 -32940 -30235 -63673 7523
19451 7523 -21875 -37184 26959 37884 -16836 -129551 -133164 -13285 105661 195606 135987
19440 135987 143063 167447 139512 50508 -15454 32325 84787 75616 65839 188819 205655 178036
19428 178036 156357 148994 -30967 -89419 -83597 -203804 -159375 -171454 -57005 -14804 -16274
19417 -16274 -38103 -116978 -137026 -112102 7064 109095 217805 102837 -41235 8637 -7994
19406 -7994 -46513 -107819 -97233 -177145 -190929 -86590 21449 -14237 -107832 -137664 -5877
19395 -5877 106482 99259 84310 86591 148708 151928 118560 61222 20026 -50451 -89427 -42656
19383 -42656 5139 14468 -72122 -81858 12846 95502 93490 34446 13256 79220 57936 8052
19371 8052 66641 113995 18093 -16007 57506 -17656 -46595 -38341 -65463 -105227 -81859 -765
19359 -765 -47689 -21987 74090 32554 -18407 15802 34018 4962 90850 140011 79148 18131
19347 18131 -58467 -35486 -58509 64596 122917 110674 163281 12838 -80383 -3956 -3912 -11770
19335 -11770 -30098 -3668 23273 89912 105732 78608 -17726 -3698 4841 72693 95535 112666
19323 112666 97826 51978 89274 192909 168899 45031 26400 50386 94000 106444 124936
19312 124936 188766 179293 95720 97330 97837 99392 104839 10677 -66240 23818 103230 101819 108051
19299 108051 -32266 -153056 -42874 -36088 -141125 -131700 -95150 -68682 -64562 -19023 -10057
19288 -10057 -24936 9075 59821 -53284 -34516 14135 81100 113923 69474 111378 109073 15459
19276 15459 -1675 -26978 -23421 104458 84636 143251 175097 168159 117854 -11761 -32587 23454
19264 23454 20056 62746 87 -37244 -80099 -2495 74943 141856 99672 -46170 -37929 54054
19252 54054 38394 40068 -25645 42785 53555 50254 63497 44002 84637 68397 19021 -7738
19240 -7738 61166 116920 115761 72758 99058 96415 91452 216432 268332 229948 61389 -52832
19228 -52832 -116751 -46767 -43933 18419 136947 203804 230284 167325 97267 87400 84285 137321
19216 137321 80243 -17331 9870 15094 8566 -32253 -27201 -95186 36030 173298 110877 6064
19204 6064 44900 92199 29213 39778 191771 140624 -6870 -3425 161104 166518 80247 31395
19192 31395 90831 131784 104322 13447 -46643 -112074 -149481 -35539 20828 67046 76333 37357
19180 37357 52396 75302 61917 37535 97262 106424 -31435 -44682 31891 108632 22374 156101
19168 156101 206457 132378 100817 61453 78904 47685 -4577 -6164 31603 -46177 -125163 -114311
19156 -114311 -144981 -132291 -141300 -28157 109520 196042 21375 -154331 -133199 -32683 4340
19145 4340 -58137 -113457 -15007 29945 69188 98514 70371 26200 33589 -29054 -29007 1110 28714
19132 28714 -14804 23844 77491 36561 -25615 -20366 55359 185654 112191 105758 98072 126088
19120 126088 115978 19984 56200 -24479 -23994 4815 48070 19101 -89900 -105528 15817
19109 15817 142513 237721 180603 98059 85091 5949 -78120 -124928 -54067 2447 55050
19098 55050 30791 25958 7069 16577 70502 18576 -57608 -81486 -159024 -208500 -111338 -85612
19086 -85612 -58490 115541 165071 156183 178969 169999 102567 103979 122955 59323 41310 23582
19074 23582 35407 78143 121008 196214 204055 131848 176837 181067 105563 18932 284 99484
19062 99484 155167 118094 70808 44417 64247 68084 73097 -14861 10068 50800 149401 158131
19050 158131 184958 95219 7327 42234 51097 32840 89226 51958 63007 160202 147279 65947
19038 65947 31786 125926 157948 137854 30763 -18689 -47158 -106238 -64891 -13666 145174
19027 145174 97214 76712 134238 121278 14188 13277 89751 112977 91761 143127 332254
19016 332254 348550 311160 346514 249768 85097 117016 127301 82062 70291 128089 76777
19005 76777 118321 127915 172380 186893 253031 286952 274532 228325 166419 215018 134388 149890
18993 149890 252393 223306 61487 -52312 -78574 71894 32846 -62568 -131619 -82994 -9222
18982 -9222 -5274 -32680 -14492 -15251 -6428 31982 17555 -56042 16297 -84928 -98566 -50131
18970 -50131 54987 86736 77369 11447 -91561 -89101 -55615 17390 38290 117374 103031 -20773
18958 -20773 -62033 -38458 28466 -15305 -47652 -36930 -12871 -74956 12993 76772 -30092
18947 -30092 25157 129745 190803 211970 84919 94609 123020 62314 117865 90469 121780
18936 121780 137734 28218 19487 26876 121932 102321 38887 22497 116950 122366 116129 47233
18924 47233 -27316 37800 65648 74424 108756 107928 154282 180210 107766 133878 274962 280609
18912 280609 211462 191492 125108 22605 101206 165417 202147 203595 26950 -36349 20306
18901 20306 -42499 -83729 -165422 -215748 -189771 -121928 4084 -22572 -26991 2327 85729 136395
18889 136395 51245 64321 45045 46385 86285 98631 60003 59205 142844 121173 158215 147914
18877 147914 69578 70015 -16338 -27858 34038 109911 36648 -63271 -39065 17308 111326 236760
18865 236760 203316 189676 192920 76573 33222 262 26567 53640 33311 97930 106065 125557
18853 125557 102259 46448 18790 31636 123391 178350 193534 178545 199485 195309 209886 246361
18841 246361 322445 451290 586272 746946 802128 720988 672617 590306 511087 523521 548980
18830 548980 526324 378115 280342 268717 258377 183322 141552 195724 178643 172890 190090
18819 190090 294287 349939 302948 249610 204844 185194 212685 267193 236895 146507 146521 117033
18807 117033 199985 157653 39696 51433 135093 239104 322465 391577 407236 378011 427801
18796 427801 456219 490322 564305 551946 669683 911329 1156463 1396396 1586866 1640761
18786 1640761 1513738 1374330 1196955 922461 639722 571082 523234 514037 428354 381994
18776 381994 418220 475245 532860 503869 542760 527153 565902 646244 735538 918331 1021772
18765 1021772 894754 635678 541566 609412 600842 443088 369706 397820 324594 298407 276135
18754 276135 256654 195642 256021 280360 311372 304702 288334 269182 322514 348916 336439 338707
18742 338707 422795 548849 666816 831913 1004737 1006391 990418 984447 982576 935388 917297
18731 917297 854872 705044 613089 439783 338691 318625 307269 175509 114585 104288 145347
18720 145347 184089 129588 65870 109841 186421 186111 50456 65328 169473 275700 238478
18709 238478 220463 162227 131355 199832 118832 73612 82233 100164 120940 91372 112173 20935
18697 20935 41921 79674 61012 58655 143907 177426 182086 248332 301484 249873 221228 243226
18685 243226 310681 305811 246401 172293 123717 181004 202496 293381 287611 231955 187891 134899
18673 134899 104568 47653 77373 175117 78101 84407 95452 153624 193368 267670 244000 296375
18661 296375 322648 282523 298279 326195 365669 373555 233436 165422 192651 313145 356241
18650 356241 303495 171882 273752 268189 165424 85650 77330 58896 48577 142228 242397
18639 242397 233924 142720 89205 92470 135168 239993 252886 236220 212098 291324 275475 279047
18627 279047 296988 255608 290164 261673 221555 267369 373791 458617 549718 530154 556155
18616 556155 582943 711582 785825 789284 668703 597809 630877 655982 623974 692333 717689
18605 717689 735907 893050 976124 870402 795208 695567 696710 707653 638998 536545 582975
18594 582975 602749 519243 440763 418811 374541 333052 325351 498901 519624 449109 448086 492143
18582 492143 477930 436549 405082 376759 378374 331343 398077 361559 298950 313239 397133 524930
18570 524930 596789 684624 728307 779551 801251 744644 803376 781529 741729 752355 737908
18559 737908 786062 804730 800322 809894 800996 863945 936731 872332 777504 789685 873298 952327
18547 952327 950938 805792 714868 659494 570599 646459 618946 445179 462869 552577 505691
18536 505691 607237 595818 578052 631490 620490 645923 678411 657472 676044 677921 636934
18525 636934 707315 692433 661411 675801 725121 643728 539955 487560 473763 422657 414271
18514 414271 392531 465201 590542 511719 455757 410920 353905 312464 330677 365359 365393 356940
18502 356940 258553 320441 397539 467185 450022 288376 308966 358750 422643 405073 375620
18491 375620 355899 405258 444566 491004 464071 410046 416549 430185 437271 554345 674085
18480 674085 770884 815511 770073 811115 801259 702474 641793 734628 722845 664054 574406 541992
18468 541992 528543 456495 389510 395885 439933 519762 581925 556483 484893 454179 451527 442741
18456 442741 505495 613948 639512 597661 581792 489598 462961 497688 494227 519434 490082
18445 490082 433048 449168 453135 423964 375658 384630 434946 497229 553097 452020 466493 464840
18433 464840 468855 471943 506587 602449 515697 554575 654102 726044 851820 802864 850238 1046929
18421 1046929 1162310 1264042 1496999 1652946 1715857 1665534 1647128 1840771 1917011 1939512
18411 1939512 2004889 2101009 2201097 2448064 2800402 3154013 3487502 3896173 4140547 4085400
18401 4085400 3835388 3640821 3618821 3596024 3456344 3410527 3387763 3333859 3440486 3729189
18391 3729189 3969212 4121759 4241262 4199906 3998634 3754501 3670810 3434855 3255527 3124451
18381 3124451 2893810 2761362 2851667 2920650 3055395 3201779 3196105 3006871 2863004 2875059
18371 2875059 2839518 2676328 2745624 2976758 3254081 3471177 3604526 3731817 3921803 3969678
18361 3969678 3946706 3983461 4006657 3998878 3985657 3980584 3996458 4069867 4177731 4185064 4294232
18350 4294232 4324527 4519100 4726230 4958280 5221740 5510466 5964622 6492610 7146378 8221328
18340 8221328 9801271 11863764 14605372 18345182 23565962 30863954 41081364 55144516
18332 55144516 71036532 82920598 87637619 88603842 83334672 70777023 57688431 47164663
18324 47164663 39610846 34147823 30250514 27311812 25087069 23408471 22060444 21116282
18316 21116282 20425060 19884810 19551916 19196353 18772651 18424956 17959678 17465975 17121247
18307 17121247 16900563 16670885 16568520 16549090 16648020 16812368 17099521 17534424 18029394 18519083
18297 18519083 18939993 19317336 19716098 20420428 21478514 23085739 25192976 28207674 32277841
18288 32277841 37852596 45671208 56484796 71471078 92626479 121277282 155220834
18281 155220834 188282370 215186908 229147504 225281262 209225621 182595502 150827778
18274 150827778 123615403 103229346 88514903 77662199 69336639 62733325 57557729
18267 57557729 53514982 50332735 47731372 45485032 43457419 41829883 40287959 38832524
18259 38832524 37606665 36543770 35616961 34802847 34084797 33648432 33517778 33641559 33920500
18250 33920500 34386946 34848568 35174540 35302963 35327811 35181434 34950218 34822593 35043264
18241 35043264 35684946 36772717 38551600 41045754 44635505 50019666 57665576 68608255
18233 68608255 84328822 106787352 134917630 159834131 171877827 174994325 169847803
18226 169847803 150163287 123998772 101294609 84370745 72340084 63528863 56785897
18219 56785897 51531991 47207895 43509652 40544873 38101849 35891740 34170476 32763939
18211 32763939 31343950 30171215 29135759 28128400 27208691 26381464 26031907 25610436 25155860
18202 25155860 24927263 24948633 25114286 25440987 25565613 25564468 25370671 24706633 23838559 23099600
18192 23099600 22338664 21644813 20945912 20289362 19826651 19225717 18348945 17432285 16473921
18183 16473921 15590649 14863143 14130681 13451204 12803073 12190002 11666337 11341649 10972531
18174 10972531 10504547 10238454 9947220 9547495 9147612 8860492 8698172 8502373 8399315
18165 8399315 8155267 7906664 7699438 7524795 7441493 7354257 7303972 7314519 7299763 7230404
18155 7230404 7106993 6966787 6918340 6774372 6546876 6381006 6281678 6238905 6145047 6150269
18145 6150269 6100207 6020691 5948009 5917716 5859768 5868220 5854930 5818320 5971526 6151374 6220828
18134 6220828 6153200 6199509 6345301 6509263 6802351 7171017 7514928 7922371 8323385 8606962
18124 8606962 9037694 9594148 10329688 11185403 12349702 13755957 15687913 18350447 21918709
18115 21918709 26754125 33484179 42496215 55151246 73456660 100120221 131623494
18108 131623494 150838381 143393107 129008197 122685758 126122991 133488652 135257079 128895554
18100 128895554 121618020 119614959 124941386 136190927 146223790 146166491 137230036 128475740
18092 128475740 125753318 131043912 142853705 154399357 156451737 148900094 140823738 138687017
18084 138687017 144100751 154201229 159780690 151850059 133901854 115551051 101019619
18077 101019619 90355944 82408945 76292327 71542286 67845028 64938264 62586804 60664027
18069 60664027 58877945 57324227 55931882 54691682 53762719 52914927 52064205 51135288 50423498
18060 50423498 50109203 50459273 51498225 53190212 55714727 59492723 65191439 73480301
18052 73480301 83735040 91800797 92869332 88452335 84265267 83372471 86628677 92405692
18044 92405692 96268504 94401610 89219398 85790093 86707390 92670127 101888390 108503647
18036 108503647 106624428 99145828 92844704 91016668 94006393 98950309 99338545 91303066
18028 91303066 79211749 68129259 59529093 53312990 48583423 44892622 41976771 39740401
18020 39740401 37881567 36201658 34722161 33297480 32116692 31168855 30421545 29677518
18012 29677518 28802765 27812076 26985618 26285990 25557822 24936306 24400317 23846602 23227359
18003 23227359 22413203 21688572 21086966 20470228 19896035 19218636 18631415 17978458 17237186
17994 17237186 16584593 15970615 15365223 14687434 14030581 13387515 12736570 12283148 11831913
17985 11831913 11342490 10927010 10621972 10314032 9988123 9708920 9337030 8888747 8579943
17976 8579943 8322980 8220112 8148004 7994476 7860940 7691897 7535437 7387756 7186826 7032203
17966 7032203 6862103 6646561 6395750 6422397 6415502 6228641 6223182 6193989 6222027 6235027 6143314
17955 6143314 6130225 6081359 6051135 6086407 5975658 5805945 5834172 5886223 5897290 5965435 6009438
17944 6009438 6046228 6072777 6082109 6198027 6316184 6429630 6483056 6463450 6430170 6452565 6550408
17933 6550408 6629712 6844770 7075680 7157440 7291084 7612463 8004961 8341951 8728135 9077692
17923 9077692 9386295 9710703 10210573 10830477 11442293 12126163 12997961 14075966 15422451
17914 15422451 16967279 18797263 21261985 24498630 28818197 34413798 42003782 52512198
17906 52512198 66828147 85729699 107099307 125064080 135821672 140606569 137882503
17899 137882503 127195253 115037187 107338540 105867206 110975798 123164695 143399737
17892 143399737 172809823 208435731 240598586 260239374 266639053 259277986 236380319
17885 236380319 205009510 176203629 155377003 142944482 137638790 138484864 145575892
17878 145575892 158104632 172008301 180952870 182519526 178158981 166603070 148825431
17871 148825431 130710102 115773008 104336718 95859145 89566316 84767533 81153708
17864 81153708 78339850 75911795 73783969 71850403 70260102 68798974 67376744 66055183
17856 66055183 64745491 63438077 62421902 61729152 61429904 61337216 60871033 59879096 58393186
17847 58393186 56929088 55660397 54571671 53848797 53632381 53762526 54325217 55424291 57196605
17838 57196605 59767936 63109428 67238581 72641933 80004700 90558258 105741896 127462517
17830 127462517 158457340 202607927 259215723 309192504 319649953 290283229 253685086
17823 253685086 226495465 209262664 199456257 198372014 207849191 229399773 265784435
17816 265784435 320175291 390177022 459387130 503460740 508983617 478006274 423161410
17809 423161410 361882323 311272923 276785417 257215927 250077979 254054602 267625051
17802 267625051 289079319 320681760 364334085 404374422 406881160 364155898 309125899
17795 309125899 262602034 228369372 203869885 186011287 172734105 162616754 154798947
17788 154798947 148546523 143054208 137886500 132908333 128131542 123758617 119874464 116344847
17780 116344847 112973575 109545041 106379742 103674595 101412075 99128769 96812193 94281759
17772 94281759 91204318 87871765 84729192 81993131 79228296 76397453 73391125 70481174
17764 70481174 67786148 65061777 62360779 59950102 57669167 55248643 52676716 49980396
17756 49980396 47289753 44842530 42590584 40409213 38283294 36302626 34545666 32834155
17748 32834155 31213795 29769768 28383442 27095687 25831553 24651696 23558953 22437587
17740 22437587 21344326 20457400 19625280 18882849 18177317 17408374 16760462 16142009 15459971
17731 15459971 14979781 14548016 14083132 13560458 13202827 12775990 12415003 12206839 12119196
17722 12119196 12000271 11868964 11820311 11850499 11814898 11734928 11751140 11836305 12098709 12263226
17712 12263226 12430932 12683611 12857971 12867292 12940480 13386200 14127594 15137252 16460435
17703 16460435 18255834 20597251 23860176 28271905 34103027 42184815 53575767 69365365
17695 69365365 88522843 103390050 105201861 98955113 94546413 96233330 105192428 118270028
17687 118270028 126243928 122328413 113946961 109733479 112975806 121882096 128088398 123969769
17679 123969769 114485377 107609395 106394942 111124161 117968594 118102904 107052878 92269565
17671 92269565 79463080 69897142 63096992 58241358 54669128 51904223 49714197 48047398
17663 48047398 46594396 45235180 44010427 43066198 42427967 42134471 42050280 42136321 42354275
17654 42354275 42897186 43892888 45481113 47874575 51517913 56467002 63323578 73267752
17646 73267752 87387297 103016354 111585618 108328079 101659735 98458315 101005230 109553596
17638 109553596 119645545 122561039 116185422 109091080 107052318 111574740 119186224 121558608
17630 121558608 114493733 105270496 99606251 99490628 104290206 109158231 106072241 94229831
17622 94229831 80993863 70313182 62515970 56740393 52383995 48998854 46339400 44209874
17614 44209874 42295602 40498907 38765557 37276588 36017259 34962571 34121947 33419897
17606 33419897 32553466 31726332 30749219 29714615 28934114 28219226 27486037 26641608 25886957
17597 25886957 25105958 24307259 23607185 22974305 22274665 21532878 20744126 19771248 18977447
17588 18977447 18302276 17642141 16909009 16296998 15676892 14983014 14370475 13687788 12977816
17579 12977816 12264629 11680861 11290508 10857875 10398943 9933127 9606844 9150743 8666294
17570 8666294 8239954 7882403 7683448 7609503 7383099 6948290 6637250 6214748 5864825 5611339
17560 5611339 5393157 5131933 4856945 4585182 4385780 4220981 4081168 3806745 3662707
17551 3662707 3617575 3536019 3342612 3222758 3110103 2990869 2836071 2717734 2464541 2252527
17541 2252527 2253337 2335048 2291301 2281867 2314376 2351058 2296431 2295668 2240277 2186204 2093183 2087563
17529 2087563 2087504 2032439 1902992 1853901 1938678 2035104 2124888 2248849 2335034 2223095 2074294
17518 2074294 2116164 2155488 2185467 2235273 2242335 2131407 2015905 1979165 2156176 2351599 2467895
17507 2467895 2462172 2386348 2212143 2159006 2162319 2174582 2071209 1992678 1871151 1810779 1802965
17496 1802965 1885623 1979329 2102207 2110113 1992879 1941062 1941924 1880659 1766367 1708566 1761850
17485 1761850 1811983 1994923 1919887 1783849 1784572 1836460 1767727 1798153 1824898 1845503 1846243 1861032
17473 1861032 1946962 1923944 1916341 1869808 1833111 1755148 1751648 1786338 1836839 1869001 1883861 1892963
17461 1892963 1845008 1844400 1783239 1722323 1637273 1624215 1502464 1475049 1563274 1735038 1797063
17450 1797063 1739148 1843408 1948915 1859190 1757971 1720370 1814351 1959304 2032398 1998283
17440 1998283 1877134 1716468 1707185 1654893 1603053 1605523 1481030 1397339 1343227 1355975 1301013
17429 1301013 1253976 1194268 1099353 1083501 1132345 1229077 1228789 1223446 1201340 1128839 1100432 1040769
17417 1040769 1050149 957136 887614 896469 847308 906171 922090 885082 778245 614946 662435
17406 662435 826574 817130 776508 745541 790442 773425 817047 781914 682656 624440 632461 693201
17394 693201 682635 721588 832589 815965 894194 1031320 1201622 1252705 1411653 1474792 1406294
17383 1406294 1403587 1401612 1346017 1242107 1267511 1352467 1530715 1623256 1761435 1917399 2098883
17372 2098883 2166719 2166080 2021259 1810556 1590258 1436950 1350252 1419964 1460923 1592311 1674891
17361 1674891 1642829 1744725 1769341 1734210 1707054 1591530 1491396 1352372 1273368 1341303
17351 1341303 1341949 1245111 1132185 1060143 1124074 1182523 1256400 1300297 1237125 1188342 1243381
17340 1243381 1309908 1299288 1301282 1270875 1175712 1131048 1136241 1147669 1079908 980915 1013372 1053521
17328 1053521 1158891 1217911 1139157 994391 964958 914930 877116 976208 1034439 934723 886014
17317 886014 882051 860275 772391 756685 785912 825027 675850 575135 612944 647816 734940
17306 734940 764117 790539 743335 718406 770251 850054 844711 750068 656391 486649 468587
17295 468587 536609 484254 520846 507966 426184 523425 603425 631707 755002 720684 642464
17284 642464 644218 567478 444611 486183 440622 457491 495027 520476 458808 376245 498293
17273 498293 617447 707457 742125 625932 685349 747655 808340 932132 1080491 1115097 1219012
17262 1219012 1333678 1338664 1210680 1039514 1095246 1172459 1154580 1188954 1229720 1250984 1406959
17251 1406959 1581717 1721891 1792761 1850459 1908818 2108522 2246393 2338500 2536377 2668075
17241 2668075 2666350 2553476 2476329 2384902 2454211 2542605 2721101 2915123 3057452 3162291
17231 3162291 3344705 3622634 3973329 4105422 4154750 4112561 3851174 3499853 3189585 2947946
17221 2947946 2722307 2683295 2779520 3004053 3325131 3674760 3945477 4165258 4114911 3954631
17211 3954631 3502031 3093496 2802629 2645807 2569368 2468057 2523522 2482498 2480273 2602788
17201 2602788 2612529 2515210 2326302 2227229 2123909 2022886 1890093 1817467 1656221 1463611
17191 1463611 1407281 1349230 1350121 1421737 1453471 1436450 1384335 1219891 1128309 1133496 1003501
17180 1003501 1036264 1049879 1007654 1128567 1207927 1168590 1149754 1287183 1362403 1404504 1286036
17169 1286036 1095722 1028641 1079043 1028447 955595 1014129 980429 951731 1093199 1155530 1156682
17158 1156682 1144102 1070525 954621 905487 869954 873421 879244 783441 692306 644503 533718
17147 533718 487531 593504 673921 662374 712269 727989 803598 777390 634340 662285 667882
17136 667882 579227 634420 592418 594096 650125 605434 560858 535897 546000 618428 703209 695322
17124 695322 737281 800728 952952 1018745 1081195 1093173 1062343 1091674 1144971 1108350 1127891
17113 1127891 1149865 1065682 1074055 1069799 1094615 1057247 966785 923119 802474 802177 802137 793564 750734
17100 750734 781186 687615 547656 638546 677352 624261 564084 572586 567152 563629 586259 688463
17088 688463 724265 678650 697721 667899 629043 563600 481530 480064 553807 618378 591937 564360
17076 564360 473675 458513 417675 386847 374807 392190 449136 412770 417113 519622 599867
17065 599867 596730 509473 426727 354810 305282 314441 318616 327341 335379 323646 284838 330119
17053 330119 289825 236220 209291 303139 258583 190960 210163 221726 346001 382010 412944
17042 412944 467379 475294 432648 458786 483357 552935 596454 562044 463847 400300 413016 324707
17030 324707 228832 170684 212024 225432 328262 315335 315213 353198 193763 220882 279994
17019 279994 173933 50414 98095 37136 -60990 11386 81958 138481 158257 151586 99985
17008 99985 67148 20578 121950 162431 119800 70194 881 3386 113509 218388 205137
16997 205137 279766 275212 407689 565505 547177 487759 490599 413532 331976 345518 364939
16986 364939 309769 392028 393701 497502 620049 686087 791628 685278 581655 670656 676198
16975 676198 631594 619055 564939 619557 613679 539352 568582 680370 780562 871222 1066691
16964 1066691 1055791 1145465 1185120 1156096 1062918 1029522 1080466 1111075 1100606 1231508 1307294
16953 1307294 1326456 1315253 1283108 1288055 1301738 1391578 1399367 1402407 1386393 1266301 1309835 1274562
16941 1274562 1099631 974763 1084990 1172794 1255958 1277602 1272195 1157494 1092892 1145935 1074780
16930 1074780 1095306 976651 954319 1036621 1065343 1104985 958770 814011 823963 768726 645821
16919 645821 675941 746903 772332 843881 837436 724020 588072 663819 819029 781701 696874
16908 696874 628298 676165 718507 791498 773258 689128 655012 620669 688497 790174 767299
16897 767299 743314 664028 631653 660478 732203 764940 750468 773265 760353 780293 843352
16886 843352 788300 795266 778449 783639 671088 610183 666998 655405 665345 670715 678081 612261
16874 612261 650188 693891 765673 789137 731187 741067 804056 857030 903464 790515 725969
16863 725969 654955 666856 701321 685575 670507 720553 764654 887593 844339 785037 690292
16852 690292 678138 682677 675376 603044 501918 540253 633270 706564 812903 903261 935401
16841 935401 961747 958720 986508 1081760 1182599 1154648 1079500 1113893 1125857 1189838 1176276
16830 1176276 1191109 1299219 1422444 1479171 1463701 1549013 1566550 1432200 1392705 1505422
16820 1505422 1576979 1524859 1462858 1409800 1506947 1549341 1599635 1707914 1851557 1958517 1991240
16809 1991240 1934023 1831594 1835444 1886100 1879548 1804487 1791376 1913558 2062739 2159605 2166526
16798 2166526 2198356 2310970 2485520 2675141 2739684 2857143 2951699 3048379 3158803 3185353
16788 3185353 3296660 3417208 3607666 3765678 3951573 4111072 4197074 4389310 4465319 4588758
16778 4588758 4589790 4661932 4863022 4995470 5166723 5255082 5331454 5353339 5342875 5285242 5424040
16767 5424040 5584867 5712841 5869028 6052918 6181419 6275532 6317500 6359955 6420718 6438061
16757 6438061 6433977 6509384 6626773 6688136 6778286 6952084 7114313 7491769 7758109 7925979
16747 7925979 8065766 8206038 8364674 8598605 8921051 9360303 9768119 10323204 10973524
16738 10973524 11761887 12912948 14228003 15501482 16433575 17078629 17353101 17483366 17745292
16729 17745292 18232562 19075339 20198470 21723051 23747297 26333448 29602758 33616518
16721 33616518 38359409 44088141 51184626 60506399 73153541 90621687 114586383 147437456
16713 147437456 191971447 245841835 292609339 306555065 284905978 251874449 224383518
16706 224383518 205790760 195515989 194459723 203938472 225190784 260273316 310498573
16699 310498573 372150085 432834166 475879898 487950307 464268195 414093378 356815341
16692 356815341 308277688 273990584 253453834 245193743 247282921 257922314 276407945
16685 276407945 304118685 340683823 372717601 375457230 342661599 296216453 254143410
16678 254143410 221403958 197224475 179488909 166263341 156107699 148162796 141778054
16671 141778054 136546762 131783483 127283000 123153661 119304554 115703943 112195104 108593540
16663 108593540 104952276 101529149 98502092 95875461 93468174 91142111 88746918 86098095
16655 86098095 83060437 80011644 77040463 74085526 71112025 67969114 64814527 61809582
16647 61809582 59067934 56623769 54291832 52022689 49770685 47426193 44996056 42585827
16639 42585827 40242262 38236216 36206806 34209979 32349226 30565047 28823979 27218055
16631 27218055 25758403 24342887 23066966 21884246 20738870 19606927 18587203 17556434
16623 17556434 16584786 15770575 14983383 14219113 13490061 12797881 12091570 11405729 10748322
16614 10748322 10170052 9520438 8989925 8519413 8117083 7757911 7409468 6975988 6501046
16605 6501046 6103991 5832193 5557965 5239088 4998925 4657863 4440415 4324876 4117657
16596 4117657 3918167 3689851 3463830 3353714 3221237 3104315 3073734 2968114 2823105 2614663
16586 2614663 2559085 2426940 2317277 2167085 1941650 1857730 1758239 1710565 1631388 1579143
16576 1579143 1643095 1604768 1626721 1635532 1562337 1569133 1633501 1577484 1462086 1342286 1177997
16565 1177997 1071195 1074721 1218031 1348352 1262879 1237601 1253152 1143873 1089047 1087462 1034268
16554 1034268 976805 1011970 1034010 902918 846512 894944 991522 1107572 1149803 1154326 1210490
16543 1210490 1211655 1189703 1159794 1139920 1125300 1205349 1209827 1304787 1314623 1310230 1520839 1606810
16531 1606810 1718026 1828539 1877415 1843574 1905856 1882822 1946108 2037459 2074954 2072383 2162440
16520 2162440 2227977 2173732 2053007 1987877 2021792 2059138 2081081 2043173 2059836 2080141 2019833
16509 2019833 1996445 1905412 1747486 1747729 1873359 1878950 1783618 1797546 1749317 1704422 1742757
16498 1742757 1694268 1667844 1620928 1595640 1606658 1598064 1615692 1697844 1683680 1602830 1548292
16487 1548292 1498722 1374174 1186794 1115812 1175747 1135560 1134076 1140846 1179970 1219535 1193550
16476 1193550 1120828 1052561 1003569 919758 904412 981666 985075 977661 1008640 1062383 1072492 993167
16464 993167 908951 770628 660215 745013 874116 951271 899439 812092 813256 834558 678691
16453 678691 592954 530281 535605 626531 671572 615233 628094 658498 600418 665347 707838 673306
16441 673306 588660 565590 481886 345757 283617 298211 302338 263991 284877 235896 171435
16430 171435 182547 128972 75838 32514 48265 21325 137494 231084 113811 -65155 -100662
16419 -100662 -124163 -117008 -189889 -139281 -122661 -80500 98180 -57714 -16843 70134 -9033
16408 -9033 -47500 18823 153298 271949 298947 257688 102126 131464 198875 263185 279310
16397 279310 249148 272003 402862 561150 639565 670935 782028 708959 662942 643944 624859
16386 624859 496752 560816 546217 515711 443220 390420 472665 546197 614124 616448 653626
16375 653626 614833 566991 581297 636503 697818 668754 526470 534810 715285 722141 656572
16364 656572 620491 536456 521252 544241 509967 633863 663038 605552 584954 482334 373528
16353 373528 393598 425688 448792 476840 474748 471833 431408 373380 460035 558052 566407 559580
16341 559580 584656 466314 329177 204265 219239 315595 297959 399615 501275 494176 521895
16330 521895 436320 406904 313875 188446 258823 301140 310629 188654 93963 179770 257818
16319 257818 344419 330391 196977 139625 24143 108940 216223 172997 130796 88839 75083
16308 75083 186784 347958 277291 218556 167237 134971 209994 180865 172203 227983 187774
16297 187774 62091 152135 215001 170619 72935 -54526 -65036 -107983 -64384 -38844 -17663
16286 -17663 -25225 -109524 -192435 -171139 -83125 -17077 43098 45808 55982 17793 80812 116860
16274 116860 206578 128164 93452 174339 183912 224165 205470 130962 96970 -7501 13092
16263 13092 129248 245261 202283 105985 163494 189002 107068 173482 325616 304880 182799
16252 182799 91674 69858 147959 153277 227470 293450 291982 290278 364088 333246 312191 420540
16240 420540 480527 444258 404629 389709 316030 300123 415955 427420 461548 456694 424903
16229 424903 516364 532687 422155 403909 452396 351117 234198 240942 322175 298351 323387
16218 323387 309034 281275 218639 288914 381955 367971 333361 348768 396743 451291 433512
16207 433512 486141 398732 403313 384238 240759 115172 146427 204132 280564 354891 325816
16196 325816 240344 357829 463050 469516 433998 336536 363548 337039 230712 252915 266421
16185 266421 348509 406796 384378 417327 415250 472014 597720 656052 806168 900173 1017210
16174 1017210 1030853 930144 776139 704224 640181 424721 426914 693839 845067 860977
16164 860977 927419 1140227 1415215 1630767 1665277 1635395 1558215 1420405 1414180 1444852 1477746
16153 1477746 1517348 1481078 1473049 1436480 1454707 1493684 1630619 1688151 1689970 1605290 1509291
16142 1509291 1462947 1535069 1725915 1826272 1898645 1838663 1701452 1557808 1367777 1243042
16132 1243042 1170797 1175557 1165039 1170025 1173887 1214145 1304261 1323419 1426827 1381994 1136057
16121 1136057 987410 884770 791636 716894 667191 643022 718325 822818 859875 779728 627944
16110 627944 428976 304145 431356 547341 554695 529441 581930 596110 588542 600341 481126
16099 481126 309904 308116 438684 443847 439544 484543 448130 333776 380977 330633 331733 324376
16087 324376 209076 226931 375179 304544 270319 236037 203774 247921 171474 153521 252917
16076 252917 206774 94949 211977 440360 432994 219113 177255 240294 242561 248241 299193
16065 299193 302501 251282 222150 99944 94168 77691 48342 26445 69521 90162 -22180
16054 -22180 -106821 -85339 -73399 11237 -35694 73884 176328 100084 -24715 51866 172804
16043 172804 106851 51848 -33042 -78777 -14332 -16243 -47801 6090 -15332 -22866 50789 109178
16031 109178 146684 243619 210879 58466 43167 21514 -50286 -127582 -148497 -105940 -145412
16020 -145412 -158771 -258096 -320998 -298267 -197085 -43601 28245 28547 10593 -83073 -160577
16009 -160577 -202765 -224863 -109167 -61253 -9059 67029 30452 -29964 -34393 -80518 -52583
15998 -52583 20642 75906 67064 67220 -1130 71474 124870 15884 -43854 -39923 -35503 -66435
15986 -66435 -32878 72269 39905 14333 88491 105625 84686 -45120 -81648 -76047 5114
15975 5114 -7421 14823 106748 80852 19423 -41153 -16342 -14467 72915 145820 141172 73446
15963 73446 22156 -1013 62530 76371 15698 -6014 48562 35394 31526 26595 -73213 -85812
15951 -85812 -24815 50149 47351 -17818 18436 -88667 -107728 -29559 13903 -46307 -13843 86996
15939 86996 94669 81419 133624 108645 29403 -64133 -154648 -139029 -68822 -8994 4471 -34226
15927 -34226 -27293 94815 165911 74363 83921 55736 56208 119206 101408 59052 44019 75372
15915 75372 169273 180212 101016 13840 -14935 -41429 31221 86341 98593 71456 -39830
15904 -39830 -130401 -111959 9433 27696 14491 2482 -9410 -5852 54167 -44597 -85064 -111280
15892 -111280 -113241 32699 113447 19142 -8864 59818 -10436 -54016 -37168 -147554 -92359
15881 -92359 -28533 -155704 -257954 -140004 -102882 -192433 -157502 -24019 36344 53000 35042
15870 35042 -4741 -48370 -153586 -160576 -45587 -49423 -95107 21569 26564 36677 50877 53974
15858 53974 -83803 -98479 -29023 12256 117004 78330 64687 108155 134360 97742 102807
15847 102807 4648 12800 80310 48879 21928 -26314 -131278 -122282 -44810 -84459 -67983 16663
15835 16663 63725 61372 12699 -69795 -24880 105575 217904 228056 201634 269171 227699
15824 227699 120894 72747 24247 34650 9397 -26701 2190 57386 68256 72768 48175
15813 48175 29945 36453 176921 229703 233961 84475 -68880 -85680 -44536 -5539 -12710 54936
15801 54936 -75798 -126831 -127901 -169274 -161112 -78935 -31770 68413 90178 67560 90498 82531
15789 82531 76673 2762 4249 8939 35356 140317 188070 174022 94548 15158 -10632 -7676
15777 -7676 12419 -51671 -212889 -314608 -290168 -172831 -38087 17910 41811 -3103 -59234
15766 -59234 -91360 -49492 -50722 -126178 -62728 -31577 -74197 -19657 -34897 -158226 -196821 -200408
15754 -200408 -72020 -104059 -1854 114049 48892 59015 -12175 -47040 -100109 -163929 -81661
15743 -81661 -55997 -80446 -150200 -34144 77074 82454 -40045 -165599 -169991 -189894 -190461 -115446
15731 -115446 -80425 -131233 -126984 -26664 27369 -12191 -46982 -11257 -26043 -54546 -57326 9923
15719 9923 11032 -93660 -98210 -124763 -83976 -46085 4739 38680 -101346 -135891 -163444 -156134
15707 -156134 -71550 -1344 51801 120063 121656 121790 48648 -69542 -115657 -116033 -166696 -139537
15695 -139537 -97298 -87574 -120019 -115254 -90824 -42668 -54316 -19838 74239 118409 88778 -25070
15683 -25070 35804 30121 69533 -41652 -79793 -67140 -25747 -22113 -104503 9928 85019 17116
15671 17116 3620 -1458 -40199 -8966 47202 50364 -47783 25422 112420 118077 -13781 30945
15659 30945 123781 123892 109386 171292 155202 180328 205889 135470 125887 96570 -11783 -113422
15647 -113422 -234200 -179424 -112919 -102023 -73028 -44898 -154800 -91210 -23901 56754 32263
15636 32263 115793 131756 112626 87484 110805 24592 7083 19476 40192 -66438 -185109
15625 -185109 -135551 -129036 -53629 107689 90339 51320 4648 -7848 17948 7305 -90862
15614 -90862 -113674 -81034 -74586 -124946 -105275 -96427 -36798 56944 104194 69619 33878 -31332
15602 -31332 -24104 -7537 52348 156275 230220 229751 229882 136659 164268 171932 -1377 -58115
15590 -58115 49548 35332 33887 54202 63385 74672 -24804 11941 42356 95846 57400 21780
15578 21780 -25358 -147949 -151075 1253 11708 -58414 -70486 -116136 -99730 1619 148933
15567 148933 207180 254785 218529 92822 9037 -49126 -140128 -156801 -126512 -56121 -83481
15556 -83481 -11400 96799 13752 -42026 54838 103643 80781 44412 97554 97009 7450 7939
15544 7939 8431 44040 -30570 -115324 -104178 32045 -81727 -127206 -142974 -125334 -9103 9876
15532 9876 16793 95741 46990 -53201 -30185 13073 68197 60603 -25733 -46743 -41238 -17401
15520 -17401 -157585 -290281 -240794 -120221 -155216 -139111 -83524 -143119 -219341 -195625 -151476
15509 -151476 -5954 96021 22497 62622 68254 -2641 706 64218 40290 -73661 -60348
15498 -60348 7073 80022 42347 -81463 -52444 -89320 -15955 68940 -54750 -148270 -153751
15487 -153751 -57810 -3470 70430 136401 112368 28894 1579 21901 -75090 -109293 -122145
15476 -122145 -80790 -88433 -164500 -172961 -66567 -102865 -154332 -138124 -165634 -109232 -45747 32168
15464 32168 175177 63725 69751 60668 -6655 -125826 -237524 -126479 -36420 -57905 -44615
15453 -44615 -52401 -115678 -199859 -143319 -74143 -95926 -100008 -99139 -83389 -60484 88783 144089
15441 144089 166806 113636 135170 135941 67248 -76987 -3413 134374 74052 -38452 59166
15430 59166 119410 -32517 -40976 32150 62853 53561 54971 9245 56001 49733 54553 58578 25460
15417 25460 74403 120738 172933 29529 -24731 -15352 -10317 252 40718 88844 20685 50517
15405 50517 122764 40710 -65775 48200 263407 309442 98461 -79003 -108692 -58174 -1217
15394 -1217 29424 139946 161577 241563 204316 87247 28267 15546 -24443 -9163 19973
15383 19973 30660 7918 -19350 -32242 -110143 -111243 -83175 -82243 -83300 -113902 -170500 -94304
15371 -94304 -6429 26185 10030 -11116 -28983 -5792 -116944 -147081 -167122 -99177 -20222
15360 -20222 19250 115382 131975 -66702 -124506 -68021 -341 -33879 -114943 -74166 56264
15349 56264 117937 46199 -5384 -16737 -112757 -80247 10390 -128726 -133556 -112056 -60196 294
15337 294 100794 94953 82780 119166 141815 106707 49493 1219 91352 46160 -10550 40036
15325 40036 74622 103749 96265 19014 19496 83792 96990 39346 42980 53294 78625 42975
15313 42975 -6257 -38483 -4528 11595 -44653 -27235 -8422 38173 37020 19424 -17585 -69219
15301 -69219 -168053 -246801 -72388 138333 98100 67649 45842 -13769 -91170 -95492 30388
15290 30388 6584 -109789 -100201 -168124 -228104 -227990 -222689 -249505 -181443 -65975 -10484 45325
15278 45325 -17999 -55732 80966 127487 129695 106612 86701 96220 1570 32405 118783 74036
15266 74036 1175 -34257 -76775 -63885 -63580 1684 14321 -66936 -29253 167765 83659 15736
15254 15736 -7285 44607 121615 70589 108516 151813 140550 143410 164669 168223 69181 40115
15242 40115 -63318 -175050 9779 117820 166888 190141 162997 211045 71182 67634 99405
15231 99405 118687 18753 -38189 84914 72119 27244 -41240 -53398 -18590 -1234 -1297 22548
15219 22548 -11349 123966 176765 75109 13320 -115870 -163983 -110893 -152250 -174426 -140352
15208 -140352 -115253 -106082 -52670 -26922 -101673 -141160 -148101 -92100 -8348 80380 140962 220270
15196 220270 231218 218990 172972 117433 132346 68295 31675 20488 -102767 -115240 -72647
15185 -72647 1784 119023 135793 122151 39997 -179449 -249871 -163952 -38790 -93330 -64310
15174 -64310 28656 40205 38130 68682 34946 -7076 -32888 -98608 -95956 159160 210497 166076
15162 166076 40296 80020 127391 116483 -47606 -48299 -72435 -18532 50751 1627 -27610
15151 -27610 -170014 -209574 -55469 8577 -70122 -126631 -245071 -205301 -101233 -88217 -198807
15140 -198807 -213118 -215925 -237317 -216234 -70019 1601 -87550 -90802 -61791 -9239 61970 -151
15128 -151 -15680 -16735 67086 52467 11200 -54181 -142050 -188403 -187565 -152519 -143884 -75914 -127559
15115 -127559 -55887 53718 -50848 -99131 -95266 -86796 -68989 -48693 24157 82295 46071
15104 46071 -13692 -90647 -109000 -54195 61631 39804 34466 -17745 17426 62062 116860 86841
15092 86841 -28844 -45702 14696 35363 253 -24934 -65021 12534 25038 -40678 -61884
15081 -61884 -40228 36271 106072 52227 -3868 9150 21097 10301 -14325 -50639 -15236 32386
15069 32386 46215 106666 145070 168912 149685 69313 13931 -22196 -27714 -25950 1479 -304
15057 -304 4607 43076 65554 31025 -97657 -102346 -16291 -81826 -165469 -179268 34100 253489
15045 253489 317013 265912 219213 208751 37292 -64124 -74579 -103764 -90140 -45521 -43193
15034 -43193 66485 126944 67731 67326 93847 101173 107994 77001 122112 94862 45790 95333
15022 95333 191485 244851 182218 202869 183242 172022 149117 38564 10485 38302 -1676
15011 -1676 32169 66528 126059 160877 110158 -9590 -3996 21806 -87570 -162907 -235985 -138119
14999 -138119 -134698 -126996 -53745 -108899 -126137 -140143 -90768 -1187 -117713 -192763 -49409
14988 -49409 21067 44760 -48365 -18090 -34199 42094 60345 16710 75742 88596 55395 56942
14976 56942 91173 43711 -43386 -114121 -54749 -24696 37724 134569 133274 19880 68029 44265
14964 44265 15506 47041 36442 -43728 -70988 83156 126594 78871 10643 -38719 4839
14953 4839 77793 124280 100946 81619 81239 40507 -45637 -9335 34776 4309 -30093 95071
14941 95071 -20769 -44850 -17424 -47106 -66444 -100241 3492 -26407 -141567 -189208 -110461
14930 -110461 -20574 19701 -33071 -25784 19891 38577 32283 -17121 48239 69251 41630 -6455
14918 -6455 -76968 -49017 -69332 -164198 -72971 -111964 -105847 -62828 -19420 50183 112464 73411
14906 73411 113971 171609 64266 85982 87081 44964 9624 -37129 -81644 -159992 -173903 -184270
14894 -184270 -180796 -139068 -74177 -15513 -28513 -70355 -142601 -178613 -101149 -69702 -61810 -148027
14882 -148027 -122372 -77657 -105876 -97501 -144860 -88327 -4177 -6642 157 -39955 -102549 -36851
14870 -36851 51330 -4464 -85807 -83534 -86934 -24975 -18267 131229 324016 230613 117350 60114
14858 60114 -25328 -78152 38706 205275 119727 -55024 -132767 -193285 -139172 -41719 -30645
14847 -30645 -30047 -57420 -65894 -136997 -161102 -121790 -40526 -9184 50510 140456 205067 14400
14835 14400 -61041 42473 143348 188195 198224 98861 41726 40087 30349 79195 77498 22087
14823 22087 56352 59536 54120 -30930 -40354 113525 182673 179283 58952 -27160 -142123 -167612
14811 -167612 -119663 -85328 -181785 -213886 -114736 -70766 -41331 10502 157933 132400 39418
14800 39418 -2880 -91786 -125589 -167782 -126366 -38205 11438 -10016 -2262 -1033 -15697 10389
14788 10389 25960 -53978 -40735 -29296 62529 29282 45263 -73286 -124035 -75679 9812
14777 9812 84076 66451 70389 74923 47167 67638 94705 73898 1305 -91318 -34209 124022
14765 124022 138493 151208 132683 75038 96014 16444 -94978 -119208 -132741 -102576 -96727
14754 -96727 -65273 12000 39638 -75206 -208438 -204037 -90205 -5258 61345 109339 182106
14743 182106 185852 95029 8948 -4453 114408 216579 221278 156931 17296 3534 36098
14732 36098 80939 143452 85621 -35342 -114545 -55767 -50371 -46270 38927 53389 -89434 -151784
14720 -151784 -130528 -73870 -71969 -83043 -167047 -65109 8272 81824 89556 149940 174719 132088
14708 132088 73262 23656 -14501 -47028 -86225 -265508 -287999 -236735 -158001 -59139 -21117
14697 -21117 24336 -25475 -127560 -88111 -63902 -177851 -104770 -20506 -13194 22243 -37561
14686 -37561 -60221 -38779 -48771 6763 79465 42993 22520 11003 63445 129704 152024 184209
14674 184209 142389 92505 132944 93646 60210 22377 -9377 -17254 -38738 -241 -18490 -20196
14662 -20196 -64229 -36382 -71957 -79941 15042 110715 146778 93859 96749 33269 64921 -17463
14650 -17463 -148335 -135824 -140433 -77051 -35955 -64504 -141130 -139663 -26825 -125774 -122055 -63263
14638 -63263 -138012 -77319 -45258 -94210 -8580 44695 79124 78074 -46632 -64807 -100067 -105212
14626 -105212 -78646 -87258 -126538 -135521 -150898 -98045 -180428 -110955 -43388 -25086 21959 -53116
14614 -53116 -32816 -53140 14148 209825 180249 142548 105263 -19475 -37294 78992 167511
14603 167511 204642 77924 23995 -52959 -37168 133950 152947 95536 1109 -37846 -20782
14592 -20782 -8295 -73005 -128503 -127106 -9636 81692 130931 98101 41495 -28199 -72124 -105378
14580 -105378 -175866 -114893 -49864 17371 188226 150887 206441 248094 141059 33134 -32220
14569 -32220 -23821 88089 31579 38499 9301 -61622 -54055 26331 94145 74678 65729 122876
14557 122876 93027 49066 -80728 -124858 -34483 130510 221917 234219 157821 89146 75252
14546 75252 -13601 -85243 -130237 -138687 -75176 -121458 -250428 -98175 -29403 59708 109761
14535 109761 120509 111964 45554 2528 61861 95302 123251 65580 34218 31785 33190 18531
14523 18531 -102113 -174308 -151654 -47060 -36622 60710 110500 38074 94175 97742 63921
14512 63921 122317 143675 28487 42556 94672 89936 54413 -9055 -100801 -122614 -128448 -72956
14500 -72956 14057 107218 110321 41335 -127483 -69482 44696 84464 113474 97294 91063 54392
14488 54392 -31717 -66552 -36045 -62211 -78993 -121599 -145743 -92516 -47579 38618 132913 149510
14476 149510 123426 61831 145704 117380 41561 17085 88103 38060 -64100 -103979 -72684
14465 -72684 48195 143235 141203 116111 117276 137096 42703 -437 82440 135237 88852 80178
14453 80178 165900 98213 30862 -31369 56286 183749 233508 144406 69535 54478 2970
14442 2970 -15392 -81078 -157411 -166027 -211108 -188885 -130758 -129269 -44190 59206 86252 117725
14430 117725 111484 42529 -41589 715 28866 -45576 -84501 -6890 102544 125117 -20121
14419 -20121 -138535 -180329 -111497 -24162 -31262 -64907 -57972 54849 84574 -6870 -18702 -62203
14407 -62203 -70239 21857 142595 199239 64672 8180 68861 -67151 -111834 -158536 -171083
14396 -171083 -47180 29098 48148 -113579 -206788 -141770 -107764 -52217 -8705 59692 93024
14385 93024 94570 50551 44352 113575 129162 59426 -25261 -62607 -18686 -17448 62963 74678
14373 74678 75192 55848 70324 65265 47659 74429 80928 104630 123491 126203 233765 222000
14361 222000 146613 105906 140825 149236 92354 171617 210079 151890 168286 169799 212103 120871
14349 120871 68231 27931 -83768 -188421 -172701 -148637 -14212 -12770 -10136 36000 119395
14338 119395 108214 -59434 -88970 -17301 70300 105754 -55776 -135597 -39909 51710 39791
14327 39791 113430 137988 6167 -75718 -94007 -144482 -85336 -62794 -68510 -21344 34730 5894
14315 5894 75906 70943 -51963 -97703 -64124 -49076 -22964 -43814 6042 67081 67237 76908
14303 76908 87819 120246 81025 32987 5377 55671 56092 7818 -117624 -120170 -75609 -116529
14291 -116529 -180242 -216861 -186613 -109951 -68506 -71738 -79395 -54214 -115158 -126724 -67443 -36011
14279 -36011 39150 12040 -8825 16217 64563 97178 106203 89451 66366 -22913 13332 33278
14267 33278 -6736 -29242 5648 94947 71655 80639 43192 33876 70222 40884 -74872 -26965
14255 -26965 -78356 -120278 -21399 17398 -16444 -72882 -96594 -69450 -72541 -114430 -59148 15342
14243 15342 68948 62569 -3850 3912 4658 951 -27569 32439 8944 -39726 -38752 -10745 -26443
14230 -26443 14845 66695 24951 10165 -62878 34873 170108 234034 272980 158431 105511
14219 105511 153971 105972 49703 -65660 -62333 -2511 128855 29503 -58305 -18994 18945
14208 18945 2111 -14339 -19668 37493 125172 64407 -119114 -118043 -98920 -116545 -94857 76165
14196 76165 77563 10020 -61437 -76117 -47546 84902 79538 59009 6831 -102414 -100378 9141
14184 9141 153913 181076 39305 92889 202628 155018 67579 30664 12314 -20121 -60549
14173 -60549 25911 35788 -46588 -171580 -179475 -74354 49498 28101 -35805 -48338 -72661
14162 -72661 -5271 -5264 -68127 46223 108825 13923 -47083 -58064 -78490 -31574 57345 59860
14150 59860 30745 12319 -15644 51970 93076 87687 51905 14539 82452 66266 -9149 52852
14138 52852 100658 163393 162948 193026 197641 172768 76667 -7595 -72849 43208 120102 165107
14126 165107 222102 92674 -4789 -94407 -100557 -140904 -44734 107552 239207 310911 123447
14115 123447 96628 146178 85701 72713 60430 -56531 -123634 -135437 -98702 -113096 -91867
14104 -91867 15209 -26034 -5686 77885 71734 -26349 -12696 -22511 -3115 -67227 -88298 -41966
14092 -41966 30900 62869 5721 -35739 -44210 -72865 12277 -68636 -139758 -10461 -2997 52614
14080 52614 61551 -87643 -147326 -29592 123983 156940 135293 46679 44696 92857 172679
14069 172679 125399 23638 34900 131536 130372 93168 -41969 -99425 -9337 -79558 -181376
14058 -181376 -135569 -108015 -63441 10699 21247 -131813 -153720 -92991 -53730 -34983 24083
14047 24083 130035 136650 98475 -14707 -49331 -130506 -157771 -74621 -19542 -138473 -180666
14036 -180666 -192616 -187352 -145389 -142875 -107760 -178899 -212086 -175999 -132601 -199187 -213879 -104544
14024 -104544 -107162 -70961 -63372 -46553 -70711 -10867 -32728 88298 76087 35073 9199 48765
14012 48765 -8337 -68196 -131087 -168968 -172603 -196029 -125061 -134675 -156491 -105686 -58759 -61802
14000 -61802 -174394 -142289 -39181 777 43012 94342 82657 71225 -17428 -56396 -2019
13989 -2019 41121 14136 -309 -47864 -14951 109073 12057 -66481 -48857 -61904 -29327 -53543
13977 -53543 -113147 -72320 -24096 -17404 61497 27280 -28960 -11446 -67337 -89036 -106098 -63711
13965 -63711 -63517 -75946 -64502 -12311 78158 10009 -20475 132447 96489 7484 -37426 18163
13953 18163 -39081 -46084 -10778 27822 125372 120472 33731 63123 -27886 13788 49314 -8759
13941 -8759 9211 31736 49499 -41342 713 -15656 24678 9853 4547 -26248 -49704 -55370
13929 -55370 -48737 -99720 -115124 -81109 -62601 16660 -11413 -40867 -99331 -151427 -86346 -36951
13917 -36951 40068 -26998 -23919 -15677 -62898 -63011 -89930 -87035 -28503 27059 25085 51087 52067
13904 52067 -49550 -22541 3296 -59687 -19062 -4680 13991 5615 -7958 8163 -35826 711
13892 711 77399 4259 -36762 -28001 -38448 -29747 100248 160988 137559 116777 149033 47448
13880 47448 17964 -19289 -1160 37343 -128301 -187920 -176385 -59461 -11001 -17856 64670
13869 64670 96045 83639 85185 45450 -15567 70133 94518 89077 56621 28059 10951 40077
13857 40077 8367 -59750 -88267 -99938 -192716 -236539 -154109 15423 107068 -7407 -116888
13846 -116888 -42355 -22088 40084 -7689 4235 64569 89090 41053 53706 3517 -45986
13835 -45986 -11606 -52124 25639 29309 9734 -58326 -159710 -76394 -58241 125003 183404
13824 183404 92309 65262 89024 -59604 -77749 1691 -40341 -29708 -37703 -174973 -150990
13813 -150990 10929 -27442 -73620 1058 -35039 5834 98807 138378 177625 273400 198294
13802 198294 132476 108663 -32601 -26377 21508 87216 144330 126438 157996 60827 39467
13791 39467 77912 106983 127034 132073 34439 -50593 -52480 -41091 -131337 -38281 20536 92344
13779 92344 21985 -82062 -97102 -80652 -116166 -65267 -81989 -117634 -169790 -180079 -127443
13768 -127443 -115269 -2750 117394 3678 -113486 -82894 -95292 -148397 -107609 -196939 -166410
13757 -166410 -74047 -146939 -69567 14678 37594 -97382 -172924 -111379 -40364 60360 49746
13746 49746 87382 117101 -97693 -98396 -24991 -49052 -26255 -8779 46482 6926 1576 -3163
13734 -3163 27371 58750 86524 60038 -15513 88808 48879 -5445 76162 70634 61219 -6106
13722 -6106 -128724 -199114 -159505 -168601 -162930 -113025 -41825 98669 100268 -18750 63349 23337
13710 23337 -9583 -137570 -79119 32789 2320 -40253 -60992 -6448 42861 107043 74345
13699 74345 10460 -33080 11894 -25050 -51452 -116173 -62333 -102863 -125221 -109131 -42580 -57145
13687 -57145 -54792 -120350 -49055 -30709 73062 183457 215143 172086 70330 35404 22853
13676 22853 26899 -36937 -53624 -105329 -131844 -178314 -96486 37285 52054 -102923 -211312
13665 -211312 -189461 -129096 -159260 -281209 -162307 -77675 -29149 58381 65920 27796 28690 46243
13653 46243 37758 169942 185361 78536 51112 -59754 -8240 33790 144653 138728 91116
13642 91116 119826 151799 14563 -38282 17649 168668 127631 -39376 -189369 -203799 -57486
13631 -57486 -59942 -151140 -200594 -192796 -144326 -148681 -88003 -7871 25911 23397 -65934 -137483
13619 -137483 15354 12660 -128365 -158852 -132264 -33299 56102 62772 -5920 4159 72770
13608 72770 151577 189357 139712 32012 39661 45884 5376 44803 72556 73551 45761 -16459
13596 -16459 18696 56642 131248 153178 141396 104988 136098 139576 92657 42291 -56466 -152284
13584 -152284 -120742 17895 -5151 55342 70412 -20555 13361 -4564 -27311 20648 41741
13573 41741 -16355 -69344 -61225 -71331 6168 13644 -52742 -109055 -28043 101569 209800 225824
13561 225824 188773 52654 70838 128491 130346 79698 37465 86421 12854 31537 106184
13550 106184 119039 146676 35243 -106450 11411 51614 73133 74973 110945 200535 202002
13539 202002 167034 108535 49080 52814 97079 139418 110123 -1360 -32280 -24717 11229 5485
13527 5485 106781 77963 104827 140032 13562 -109187 -106796 -8764 -60918 -172848 -217482
13516 -217482 -118461 -67512 -125230 -100445 -138422 -71903 -233524 -271507 -59154 -6049 -44860
13505 -44860 71417 108257 98325 -13578 -115268 -82543 -77288 -159374 -226695 -163504 -94633
13494 -94633 -69971 -188448 -209034 -28373 77267 94830 -40973 -134975 -152767 -96435 -72589
13483 -72589 -59591 -102885 -66407 -68054 -141113 -156347 -118288 -81411 -69258 -69699 -12028 -35011
13471 -35011 -62675 -68790 -81754 -73704 -43452 72429 138314 142061 136386 145451 135382 81664
13459 81664 63446 -12845 -21433 -52107 -12870 36245 36839 -61263 -108678 8216 110235 130800
13447 130800 112624 97480 7801 27423 -78482 -144984 -155403 -133796 -115103 -43844 34063
13436 34063 27203 -47287 -79878 -35580 -23105 -43813 21338 16127 68139 64862 -34922 34905
13424 34905 34208 -45581 -63394 -117677 -185534 -78776 -27038 -27389 80085 133041 91250 20750
13412 20750 -26474 -64339 -132242 -53311 -65252 -191117 -153467 -96458 -61868 -17776 -28861
13401 -28861 34963 130535 44246 12006 19824 53088 51162 28336 47018 180170 173317 25054
13389 25054 -39691 103395 126257 -49025 -119301 -108518 28123 154177 174620 135189 148142
13378 148142 67686 -49539 -54354 -38628 49856 96601 50007 42038 26639 -27340 9635 138387
13366 138387 93733 48730 -63828 -103367 -67266 -44517 -48832 -47797 1220 -44708 -16534 50639
13354 50639 -28576 -68644 -41352 -21278 61538 194507 175420 157740 196340 164993 103364
13343 103364 -18476 -83279 89333 109243 53807 89270 150392 192133 119457 129989 123271
13332 123271 64743 51338 121032 153292 130330 115811 -28258 -94909 -88284 -42204 37035
13321 37035 49276 -13682 37239 145289 190720 182035 123139 97780 -4152 -150860 -179269
13310 -179269 -129505 -98682 -44831 30169 44242 -15022 -32506 -82607 -123554 -17668 83531
13299 83531 149518 24299 -36020 64895 67738 20941 117483 102035 56529 58629 68925 37572
13287 37572 48067 -1273 -3050 7249 48310 47414 -96533 -224826 -77600 -44037 -94312 -71514
13275 -71514 -36048 -85235 -135080 -42496 -26706 32710 73669 -5420 -8792 93359 -9760
13264 -9760 -35617 -64063 29431 20181 26454 -42729 -32115 71918 -42409 -99840 -101003 -99659
13252 -99659 -61617 -40062 33273 -21203 3324 -28664 -75946 -61357 -54444 -108021 -94562 -33878
13240 -33878 -36013 106618 50770 -190651 -172904 -94086 2645 59602 -390 -9982 -27076 -1294
13228 -1294 -67465 -5250 -13411 -52980 30563 38071 92097 63408 4640 -25437 -12833 -18565
13216 -18565 -26575 -99500 -171736 -137564 -83595 28116 58860 98915 76452 64270 56116 66555
13204 66555 61600 70959 6103 22616 39742 53401 83107 -73122 -87520 56976 109973 179659
13192 179659 110655 -46288 45338 92257 16233 -43521 -94442 -58282 -29781 -4202 -51955
13181 -51955 -89334 -149759 -175351 -224236 -223859 -211822 -118939 -138427 -165529 -140127 -102233 -105383
13169 -105383 -174242 -138737 -109475 -176074 -196279 -229823 -265499 -237450 -171760 -224657 -234996
13158 -234996 -209480 -173429 -158146 -198161 -152634 -133272 -105898 -26202 -16759 -48052 -49007 -87630
13146 -87630 -47939 37143 46714 80199 131251 52704 -41267 -94945 -102835 -91327 -52839 -74600
13134 -74600 -14594 62655 21319 92252 191494 71704 81098 220772 169680 -45360 -126979
13123 -126979 -89231 -33618 60123 86922 133779 136230 921 -94241 -42553 -4729 -5422 -61329
13111 -61329 87429 88540 47502 14832 13531 -157582 -241947 -132096 -78891 -36673 12682
13100 12682 19003 59854 90263 -13560 -39003 -75225 -16365 164543 201989 69465 -58592
13089 -58592 -124939 -116578 -57159 10799 100805 138052 129382 138254 137206 141142 100102 136931 158603
13076 158603 191086 241068 191432 58800 37844 95387 147823 124465 106338 91182 9160
13065 9160 -36886 -144942 -6807 32065 37602 55306 31484 -11611 -132923 -125708 -31512 -84870
13053 -84870 -102008 -124514 -73809 7688 -50477 -46980 -50761 -87831 -76239 -93432 -61051 -90488
13041 -90488 -225996 -204636 -175126 -71339 22038 28530 111112 94162 121724 119909 66342 -146570
13029 -146570 -267122 -169570 -132164 -80339 -51503 -21652 -20451 -21334 -11574 -65847 -69186 -141765
13017 -141765 -230139 -225686 -169012 -139994 -149965 -45523 -14477 -9448 12206 -37472 -13405 68898
13005 68898 85235 -15597 -106732 -67064 -136016 -174088 -96515 -58894 13073 29442 -17606
12994 -17606 -148053 -83016 1763 11799 -22316 4729 -289 -484 -91997 -136979 -86417 29016
12982 29016 126757 189867 88844 -22314 -85624 -103249 -119905 35836 69315 -29864 -60004
12971 -60004 -43218 -140782 -135086 -121557 43415 27846 -123800 -170757 -56807 82493 43276
12960 43276 -109796 -152132 19130 21943 -122178 -165828 -127039 -58698 -14556 23615 124858
12949 124858 184917 195077 184413 214941 170174 182096 108726 105827 193824 196222 86899 -88147
12937 -88147 -166023 -163508 -116624 -84377 -5467 -26560 48822 22159 -53812 -129991 -142584 -110259
12925 -110259 -81860 -24676 16946 75772 78973 40726 12986 -23097 -60198 36433 56235 -18365
12913 -18365 7324 39035 -57315 -90564 -26614 85382 11307 -51461 -32631 -19290 -72408
12902 -72408 -81336 -71097 -85119 19707 41428 -951 -1678 -125053 -137517 -29820 -68819 -120536
12890 -120536 -64835 -106178 -85162 13031 -53741 -59153 -47922 34680 55831 32973 63404 76324
12878 76324 -72342 -140132 -125392 -102069 38061 67716 33974 110180 97091 90018 99717 50143
12866 50143 33877 6004 20222 43546 156088 211578 101482 57371 95575 55424 58182
12855 58182 98959 105348 111533 141831 102171 49791 117227 192276 157195 52956 -34102 -67396
12843 -67396 -5004 69766 63825 87387 62526 94461 17384 -44359 1739 104580 53586 -24029
12831 -24029 -166360 -218854 -225980 -180724 -126016 -98219 -53117 -123609 -226700 -161628 -69822
12820 -69822 -45014 -145052 -189435 -103696 -51148 -12209 -48194 -121182 -113160 67922 55882
12809 55882 -34110 3076 -38373 -45397 -21358 -44485 -5070 -27285 36682 97823 101193 156923
12797 156923 111265 95259 57894 7 -43848 -88513 -122632 -109087 -42965 -24406 88513
12786 88513 122176 58460 -65337 70147 88947 -17424 -86189 -98948 -35972 -112046 -123827
12775 -123827 -120309 -58252 -45627 -66376 -14345 -69844 -125753 -112065 -106260 -37154 22150 15084
12763 15084 7322 -12854 -3062 -72893 -161042 -197253 -145797 -74853 -102092 -62952 54608 -16800
12751 -16800 -12545 -17558 -10695 43137 2118 -78369 -56259 -37548 16182 -10856 691 14712
12739 14712 -74276 -110044 -208123 -134705 -26585 -11250 -72633 2711 75219 -34284 -18893
12728 -18893 82339 31852 -11110 28983 111728 55008 -94620 -30389 64978 38475 2216
12717 2216 41150 -16934 14657 -5455 -46082 -89835 -58023 33564 106952 188920 156046 138137
12705 138137 80360 126346 33740 -9623 9862 72257 66457 -14940 -39942 -84320 -132694 -55017
12693 -55017 -21248 -178321 -126905 -82142 -78788 -75798 -108626 -41339 -27493 5274 19040 -54574
12681 -54574 -145876 -145096 -48830 23719 14693 27010 -7085 -13268 -61425 -99559 -79494 86021
12669 86021 169319 114599 156497 153093 64590 42642 -53645 -92541 -134734 -124668 30966 65472
12657 65472 3147 50968 38213 38551 55870 -56575 -3990 3464 37148 106987 82898 632
12645 632 -85782 -119947 -213537 -128140 -32652 -20243 -32885 12708 122185 101049 36318 19296
12633 19296 -13792 -14922 -39416 857 79925 91836 77332 38433 48400 83864 155347 115213
12621 115213 47977 -57759 -11681 3390 30055 17407 56303 65023 -56029 -1321 76547
12610 76547 116862 45825 -10982 -99805 -131502 -76008 4120 25443 26995 52116 92771 176104
12598 176104 230656 295264 230639 101952 -9611 -12257 512 -31521 -110611 18925 69463
12587 69463 51937 36773 23896 72551 130176 -46584 -191063 -82215 83126 42325 -10163
12576 -10163 -31456 20864 126865 102230 108070 110908 73024 -97168 -226503 -158169 -93052
12565 -93052 -80824 -3254 19996 78551 80754 -1121 -114618 14329 150745 114994 64427
12554 64427 2654 -66873 -30841 -12850 43612 -42565 -119389 -140038 -124019 -97126 -79075 -18838
12542 -18838 27073 71641 23585 -84636 -23177 62766 -41802 -91298 -1167 -16171 -66529
12531 -66529 16322 -60576 -36632 -24039 -16845 -36937 -14232 70572 115784 100069 145331 134496
12519 134496 82408 29071 -45021 -16511 -23377 -67150 -48639 -9239 -60211 -79519 43496
12508 43496 101660 107432 57628 1762 413 -37014 -45125 -57512 -110941 -255381 -290780 -258671
12496 -258671 -193552 -154630 -117288 -52773 -6753 15972 -68257 -79918 -23953 -6348 26031
12485 26031 108338 154372 73953 43450 -38575 -83624 -135558 -72421 -8257 7490 70921 75925
12473 75925 72607 15091 32869 -9895 -120480 -40901 18923 13662 75517 107733 55015 12102
12461 12102 96763 135945 67435 -13706 -96675 -146313 -74732 -52473 -138599 -166337 -140202 -101013
12449 -101013 -70787 -137282 -68205 -48803 41464 98832 -26111 -11217 45659 138573 103747
12438 103747 102021 189150 138945 -3015 -56398 -50347 -76952 -169015 -106767 -55800 -22779 52215
12426 52215 96007 94241 86804 10375 -35 29740 73530 110906 53516 42004 62308 113890
12414 113890 75421 -5543 5 -59035 -230877 -173854 -58603 125302 270880 171681 -3047
12403 -3047 -34506 -25651 -24012 -79157 11026 98756 72037 130339 123629 80439 58851 102675
12391 102675 75381 44941 84287 39475 -72888 -63186 82637 78717 64700 -43155 -193567
12380 -193567 -238522 -248489 -227591 -164496 -142062 -155542 -120301 -94149 -26785 -26753 -59597 -66753
12368 -66753 -6990 36576 94247 44760 149231 219061 159140 156621 44338 5057 6144 -100241
12356 -100241 -52707 -64084 -18091 32418 66810 79268 -11508 -51513 -45940 41537 76961 14775
12344 14775 73383 76654 22905 52522 104156 102530 30444 -109654 -97377 -3515 -26898 -67594
12332 -67594 56145 185915 121102 59243 16348 4108 -59746 -69411 -74684 -133415 -96595 -102142
12320 -102142 -161639 -97104 -43723 -34578 -38483 112016 130967 50778 11848 70918 179214
12309 179214 181437 106139 154126 221791 298419 164659 10069 -65655 -77357 -60874 2665
12298 2665 37334 12713 -19096 82267 -12255 -134460 -89465 -19886 87843 148442 207648
12287 207648 228199 122601 22216 -21371 -11851 -27300 58465 166767 100230 109801 127397
12276 127397 20450 7059 27192 -41369 -19702 -14458 -123445 -190125 -136512 -110425 -165478
12265 -165478 -303196 -221166 -117532 -176640 -110024 -7690 -5130 -80865 -138876 -118542 -37759
12254 -37759 -52214 -33149 12881 115023 167473 133832 26033 -34050 -39355 -6168 9561
12243 9561 -9819 110160 147006 152906 105206 -18092 -148092 -123150 -130463 -157230 -78276 -42966
12231 -42966 -27278 -52729 -31012 -30125 -65350 -2485 53111 70825 69220 28966 -46470 -43477
12219 -43477 4009 49724 76687 -22576 -76297 -17755 -66879 -60871 -35122 10245 48448 123536
12207 123536 36997 45415 68651 94356 166957 148044 19044 4021 95552 127691 70633
12196 70633 96104 187392 236785 244190 239736 190904 154443 53122 -99859 -61194 -68580 -36267
12184 -36267 -46003 -25768 -109180 -187558 -163484 -63148 -17934 -28605 -88073 -158929 -229907 -232584
12172 -232584 -168453 -36413 82395 70888 48085 89301 177873 222654 136378 162489 155530
12161 155530 9208 -96535 -155746 -98625 665 -34227 101121 98970 34447 8059 30461
12150 30461 119345 127138 111446 -20115 -84521 -43828 -118236 -46550 42216 -3600 80880 91148
12138 91148 52840 68221 -22258 -30714 -8723 41272 10197 -69463 -118400 -142165 -150957 -156947
12126 -156947 -110698 -23625 35302 -3240 -96492 -97901 -106964 -127044 -192853 -265318 -280653 -262932
12114 -262932 -156890 -2364 7886 23290 -41455 -197067 -201666 -140858 -112769 -123112 -90865
12103 -90865 -67560 3193 -22803 24609 171429 75751 -24695 13071 19147 16375 23823 27445
12091 27445 -24779 8448 96939 78423 17151 -39762 -5702 49572 93946 120483 219084 193288
12079 193288 41178 -3370 1440 62656 -64360 -118152 -31429 -67279 -171618 -132328 408
12068 408 -62800 -50325 90870 86521 48254 -86054 -212681 -139127 -91556 -82099 -99573 -160268
12056 -160268 -98906 -1383 45413 111043 10335 -125346 -92681 -5005 49732 51664 -51544
12045 -51544 -94688 9236 180957 135854 95067 116483 104902 114351 83159 150344 228729
12034 228729 159824 75395 -40711 -12622 -4802 -56938 -35558 -57382 -26126 -106936 -96048
12023 -96048 -112822 -137249 -149818 -69998 52368 62599 31664 -30438 -8542 -68981 -86632
12012 -86632 -81709 -26481 24391 18895 67415 14698 19108 123805 204046 193094 159377 43700
12000 43700 -30856 -61467 -2746 -27597 -24025 38099 -16856 -23828 -43847 -98960 -133305 -156284
11988 -156284 -157005 -69947 -84859 -39687 -38631 -98590 -241473 -260944 -68922 -20625 -99656 -112694
11976 -112694 -146423 -115968 -55192 21267 5423 -38640 -72268 -96728 -162064 -98747 -28877
11965 -28877 7389 10918 -18087 -109602 -57980 98210 160001 72322 44446 136052 187939 149676
11953 149676 114858 67802 34906 -12246 13986 45180 11967 5783 -80557 -84748 -64977 -13197
11941 -13197 63763 143768 54306 -7965 83175 13544 -123467 -167886 -205471 -108459 -42669
11930 -42669 -77158 -98046 -105255 -47591 95662 97013 88098 111477 -60099 -119062 74895 109402
11918 109402 79347 137489 92028 22716 134204 231888 218058 178117 21693 -2425 145051
11907 145051 239869 284660 238609 117480 -3635 -40107 -164127 -190884 -103623 -70319 -35527
11896 -35527 -121446 -142330 28733 33447 24272 -44500 -958 -85976 -159454 -151961 -153792 -172088
11884 -172088 -93695 -81581 28829 2401 -24801 -19101 -35971 -11379 -33805 -100484 -80576
11873 -80576 16123 -18615 -67339 15069 24158 14921 -28389 41274 113394 43431 -40675 -55506
11861 -55506 -7516 -792 -168147 -117310 6495 97879 83375 97099 36364 -41157 -38498 12837
11849 12837 31434 43578 -29289 16760 66083 -10384 -65568 -76555 -154704 -125653 -66392 -11724
11837 -11724 58884 61233 -22790 -93270 30950 -5022 -28671 13193 91354 -2941 -70221 -142352
11825 -142352 -109676 -54421 -32600 60438 -8031 19181 24027 984 -7460 -12107 -89269 -104187
11813 -104187 -99221 -32996 -26911 -31012 -10078 -826 -23981 -30071 -21779 91623 137826 -19758
11801 -19758 -33473 12335 -30689 -43675 -105852 -1913 74000 93376 41441 13739 -60403
11790 -60403 -128454 -122643 -31294 2095 -35882 17009 46953 12761 -71437 -126977 -95545 85703
11778 85703 46377 -73587 -82714 49331 35311 -17584 -56382 -52284 -13357 35414 76556 -55954
11766 -55954 -50273 81918 46629 46982 44706 12003 12217 37782 123643 160629 64987 -71023
11754 -71023 -127123 -86712 -37036 -59995 -49869 39205 13630 -2753 28410 -104726 -136954
11743 -136954 -52260 -62559 -77281 -43068 -68846 -35623 -6768 19002 47972 60437 97163
11732 97163 36671 7510 -1628 -44357 -29494 -30209 -36269 44089 -53603 -171361 -90686 -40014
11720 -40014 -52374 -58650 -36149 45222 12675 -58432 -120811 -16322 31290 -5830 -78576 -61993
11708 -61993 -5376 -4893 -24905 -173694 -210731 -174308 -114601 -72787 16116 110884 53351 -18963
11696 -18963 -42925 -34730 20218 85227 -16730 -44469 -31339 32945 37400 44787 41656 -69719
11684 -69719 -23565 -89849 -14600 -56834 -163398 -140568 -129799 -155401 -118886 -143366 -204382
11673 -204382 -100666 -14927 -22152 -40358 -274 -6686 -7954 -39170 -62150 29918 66639 -27115
11661 -27115 -4309 31699 -18351 41275 165139 165406 24218 25505 31771 130420 101446 51083
11649 51083 60430 46506 55525 54116 -5241 -137561 -137519 -178284 -226915 -150485 -59270 -88944 -128330
11636 -128330 -54054 -78387 -105298 -72061 -104295 -30701 -39705 -95876 -61223 -147919 -182982 -143072
11624 -143072 -127782 -119561 -92992 -15833 -980 -62907 -66170 -71463 -184668 -173835 -105663 -86905
11612 -86905 -785 64635 67775 11264 -83074 -105961 -59741 -115411 -163945 -140995 -172572 -64799
11600 -64799 17151 60500 56828 67560 32904 53566 -19125 -66007 -105816 -104836 -37510 41825
11588 41825 16098 -56468 86643 184943 141260 64469 90934 65041 -39737 -67823 -7999
11577 -7999 23374 49154 83777 -729 -75044 -12280 13866 105353 150849 122571 -80122 -197785
11565 -197785 -156520 -79066 16473 -12362 -92232 24270 108529 84505 9457 -2592 8642
11554 8642 -11139 4634 -33322 -1451 36117 1943 -97428 -90223 38755 55883 44357 -13305
11542 -13305 -68258 57822 111035 45153 64827 164603 196399 203101 142471 75172 -26161
11531 -26161 -106650 -7212 87085 -57947 -87896 -115658 -206036 -164899 -65055 -14484 -95020
11520 -95020 -147695 -112518 -30827 -115 -17125 -65610 -51333 -27714 -95265 -134872 -64041 31416
11508 31416 -83952 -37486 26588 -78739 -108741 -85983 -53981 -30477 27100 46100 59807
11497 59807 108822 49753 39229 29217 1604 -110861 -160802 -122256 -57724 20053 34853
11486 34853 -67012 -131760 -97102 -74307 -172789 -180766 -110821 -94653 -24446 73518 10191 -27901
11474 -27901 12805 135777 136669 -15281 -100343 -78779 -36979 -34378 43280 40459 29795 46737
11462 46737 40424 61975 64598 -7368 -44041 -51992 -85905 -52245 -3793 64399 73868 -40862
11450 -40862 -136963 -206674 -278431 -253607 -158544 9112 151227 116099 -12343 -84080 -89538
11439 -89538 -25769 26752 6086 -37956 -153591 -186240 -107404 -99587 -97780 -91429 -10084 27807
11427 27807 -77903 -40504 12813 -333 12179 121492 238208 155706 58575 7666 23632
11416 23632 65876 83576 128757 142607 179485 97508 16461 7456 29621 72094 -7442 -41817
11404 -41817 68914 142826 125200 93151 90214 73277 48702 107364 175575 165957 124515 163219
11392 163219 192798 132850 116423 130291 145529 -3504 -61616 -46013 -45023 -110800 -126695 -24759
11380 -24759 -276 -26762 -38823 -77117 -73388 -22814 110601 63714 51089 34892 -61482 -109219
11368 -109219 -65862 -56756 -99893 -6581 51845 71578 -85505 -145164 -25870 65250 79003
11357 79003 1735 -14693 18373 -10913 -6459 225 -46949 21789 19090 -10815 -62169 -113696
11345 -113696 -219833 -224286 -172199 39792 72022 -75612 -107812 -29146 -51314 -46902 -146670
11334 -146670 -144142 -52123 841 -2362 -46570 -11025 13483 17315 47669 38874 85589 26024
11322 26024 5290 2069 -18324 -51103 -99145 -105271 -5181 46207 88634 106346 88793 162646
11310 162646 178401 117408 -15407 -103679 -60649 -47440 94844 160501 85821 6900 3446
11299 3446 -12135 -14823 -72419 -153399 -99910 -103314 -182035 -254829 -239994 -190898 -193346 -174838
11287 -174838 -151832 -72977 -23544 36149 172261 357847 310898 178414 112590 177477 185885
11276 185885 90033 38226 23171 8772 -6974 -139839 -118772 -175971 -173707 -99355 -58138
11265 -58138 -47772 -120362 32014 148873 111607 43307 -16621 -36279 19822 39785 12300
11254 12300 -47641 -56756 13084 51832 28025 32887 35564 91525 163003 59933 -118887 -123810
11242 -123810 -26565 56731 71008 50661 -6686 -26174 23606 42101 41978 49 -100113 -67513
11230 -67513 40733 186899 195741 117094 100020 99051 109283 87741 -11660 -39446 -29103 93149
11218 93149 41486 -17748 -143954 -178780 -40771 49498 57005 25129 14447 5561 -8149 -25142
11206 -25142 20113 91811 25009 44137 83104 80814 -15895 -16301 -23356 49588 19845 -60556
11194 -60556 -9252 60628 -2709 -87918 -61381 -41169 -51872 -1605 -108956 -169501 -131968
11183 -131968 -97125 -66869 -75792 -64763 -102549 -145836 -64449 91428 83349 64739 140552 157496
11171 157496 158314 102048 12546 -143863 -43700 24823 111040 39722 32499 22755 25732 104060
11159 104060 142247 122047 101467 89909 65571 38671 37786 60654 -65859 -130788 -165869 -156934
11147 -156934 -159104 -112600 -3176 48998 20462 -31253 -66951 -45164 -33559 -8135 -5858 -9999
11135 -9999 -61073 -89251 -186196 -191297 -66125 -44059 -87185 -35334 -44973 -148750 -174714 -85940
11123 -85940 -910 21589 61679 40202 8052 -38028 -48037 -54899 -51954 53508 112329 64179
11111 64179 -71014 -85025 9844 29184 -22106 -87231 -71279 -63058 -49989 -97796 -74655 4224
11099 4224 55346 36676 -57380 -92534 11272 89831 65931 -21904 45600 51784 54968 64098
11087 64098 60432 -13399 70482 30070 17460 -52119 -119114 -100077 -106782 -13024 51913 -92756
11075 -92756 -142759 -184687 -116966 5985 -22219 -49402 -29299 -1758 65721 80397 -15406
11064 -15406 -34833 -35778 -63498 -133428 -133646 14797 54663 103496 29195 18436 13994 68772
11052 68772 85545 5508 26928 113172 102544 18786 -32877 -38207 97187 138326 101297 193877
11040 193877 215391 104597 46126 76666 -65696 -120726 -69994 -13645 35987 37571 -71490
11029 -71490 -147767 -180702 -132915 63860 60978 -24184 -33456 -21886 -24363 -21493 -32184 -68821
11017 -68821 -56699 -11201 15963 6833 -58362 -14408 73100 82357 5572 -39935 -111862 -98920
11005 -98920 -141481 -140740 -219406 -175491 -37435 12746 81433 24563 -17692 -106580 -47082 -47868
10993 -47868 -33071 8324 37879 -20672 -18756 -1722 -85573 -132497 -146351 -138648 -167174 -143903
10981 -143903 -66758 -22355 8415 69328 7621 11427 -141302 -171490 -61705 -10394 -81667
10970 -81667 -96282 -112469 -29998 37337 -56944 -122295 -159466 -97861 66405 123215 15733
10959 15733 -24201 -23299 112234 203645 220144 268402 208485 119251 129330 78838 10483 46718
10947 46718 67119 6853 -514 -7879 930 -19632 -68177 -84883 -76973 -129690 -175973 -145364
10935 -145364 -92579 -55847 -22477 -83085 -21285 66578 -5383 37596 -64201 -89246 -101321
10924 -101321 -18913 -124775 -221134 -165543 -117753 -96548 -222171 -206883 -157324 -80388 -69442
10913 -69442 -25918 101792 23628 -9199 -81567 -102051 -110263 -10525 -39963 -13499 19141 -45473
10901 -45473 -86499 -46360 -1329 36778 53566 71356 61629 -14532 50829 -28446 -87555 -98410
10889 -98410 -154910 -98898 -79006 -66974 -71618 -117842 -109455 -19507 6758 3829 -23694 20073
10877 20073 17772 37224 41684 -12001 -53511 -1458 -1661 -99375 -219937 -215277 -81285 -8776
10865 -8776 -40622 -56425 -39623 -81416 -18618 -27463 -84945 -35625 30086 43813 -49250 -19639
10853 -19639 -46405 -61225 -50979 19805 64866 135395 -27559 -165891 -132955 -128523 -59739
10842 -59739 -141062 -208404 -165989 -109118 5974 17297 -45769 -25490 35924 98597 46553
10831 46553 -75798 -9951 -76123 -60876 151458 176375 117716 135368 27509 -31225 -82267
10820 -82267 -82991 -140776 -135058 -172087 -200737 -154160 -46713 21169 46494 -4974 -20756 -34962
10808 -34962 62439 96897 23786 65177 31001 -66861 -32177 10968 17646 -50939 -70833 21780
10796 21780 19262 -52332 -21185 -21157 76717 117672 176484 205956 129991 -49877 -27589 -9967
10784 -9967 14907 20812 34479 -17309 -41272 40720 -20682 -80490 -90188 -108348 -147252 -172279
10772 -172279 -109135 37123 120542 114924 89391 190661 241244 255759 181346 66677 4985
10761 4985 -19776 56317 68867 50749 41356 57345 -94585 -185921 -92560 -80459 -113023 -178118
10749 -178118 -168161 -125685 -15583 70083 277040 221168 164641 99012 57534 39451 26185
10738 26185 87119 81543 120583 32521 49607 5422 -89007 -18121 138674 89040 105929 82516
10726 82516 22467 134053 67773 -117709 -295165 -385151 -390448 -226277 -84494 -14852 41433
10715 41433 -98197 -191154 -202997 -138544 -75836 -8025 -60290 -81416 -11715 22533 79665
10704 79665 31590 -104538 -11832 59883 134238 172171 122675 -21176 -126088 -115752 14621
10693 14621 122108 -35208 -102364 -65476 -66179 -141324 -103649 7324 -50922 71675 105779
10682 105779 61041 26779 68534 106314 135720 179510 283435 206246 118722 18953 -21915
10671 -21915 18799 34626 16392 72961 -5618 -133887 -160861 -133877 -25474 94078 149357
10660 149357 145785 161018 156972 209336 158207 127687 51926 22471 90668 153677 105587 -16208
10648 -16208 -73602 -167087 -127617 -102620 -138606 -114340 -81696 -69833 -88422 -62864 -79868 447
10636 447 65117 95921 89899 28955 86382 166774 255913 282802 274192 167593 37444 -12300
10624 -12300 -74541 -56644 -9471 -9933 -46369 -48890 -2188 68937 101535 25939 23501 9699
10612 9699 9939 44932 33984 -23824 -53398 -22220 169447 195139 161318 34081 121925 24531
10600 24531 -34106 -26697 -1340 74561 59926 -62610 -45962 -83696 -128935 -105597 -161138 -166940
10588 -166940 -120210 -164246 -107549 -106428 -85858 -110433 2431 137614 140771 222889 251346
10577 251346 195415 150763 186345 265448 176948 183543 149293 117902 49509 -87923 -146045
10566 -146045 -86096 -129298 -199981 -210343 -82784 96615 144275 110726 168136 156386 92771
10555 92771 -29485 -104875 -2251 -36594 -122972 -78647 -31983 -61473 -74597 5578 14345
10544 14345 -5351 -118483 -115225 -101893 -82027 -98056 -199999 -180740 -90017 11396 10668 7352
10532 7352 -89591 -198063 -155331 -89814 -38541 -18424 -13941 -1198 -10730 -27317 -15497 -64785
10520 -64785 -131657 -188226 -57912 -20887 -42580 -79054 -55240 -50786 -68677 -14745 -86215 -112538
10508 -112538 -77037 -131308 -74809 -29715 -67934 -126142 -163828 -188441 -77525 -40744 1193
10497 1193 57095 95578 66219 -61473 -107915 -134857 -28021 9429 39612 -2980 -82267
10486 -82267 3946 -88271 -89510 -48009 -145993 -88318 40053 9110 -87569 -62223 -49723 -32284
10474 -32284 -79241 -34010 80506 57815 627 125053 150659 110521 73954 38404 50273
10463 50273 551 -72682 -30834 70989 91957 -15502 -83852 -103158 -169784 -86341 -55899
10452 -55899 -163396 -190305 -89120 -76049 -39767 29990 42536 -33724 -110520 -37676 34880
10441 34880 11218 -50636 -54588 -43948 -66859 -35843 -69413 -58589 -7745 60249 780 65843
10429 65843 43416 -77538 -143649 -64833 20341 2037 -19790 -27015 80515 98463 6828
10418 6828 -18797 -103874 -41375 13539 -78823 -117204 22980 -24131 -54504 -43392 -14743 -75267
10406 -75267 -89364 -9390 19751 62524 82682 -36486 -63329 -75635 25737 159367 195937
10395 195937 90226 -42736 -45764 -12167 30687 123988 150144 190176 193849 99546 -73951
10384 -73951 -168282 -199066 -153200 -166980 -110483 -55247 -32928 60900 75633 60785 76653 73378
10372 73378 32264 64889 -231 -41134 -81505 -115697 -70291 28171 74824 85429 -23075
10361 -23075 11935 153101 156118 140655 113673 109920 105640 99093 71809 -55349 -102153 -44156
10349 -44156 -19880 -117027 -104192 -81730 -190296 -156084 -14815 -61464 -71509 -16194 -55392
10338 -55392 -108019 -216705 -146220 -126480 -150854 -69901 -115069 -50773 72905 68506 98537
10327 98537 33810 12704 52715 107553 71014 -35652 -16162 -8867 77855 197724 229204
10316 229204 155927 73248 55895 -22070 -130355 -107531 -112962 -108832 -3575 155262 132490
10305 132490 -11171 -64375 -59314 -147238 -155427 -136788 -91333 -9369 26664 -83916 -96803
10294 -96803 -125684 -59822 -24273 -12672 -61166 -58640 69194 -18190 -70095 -44532 -132352 -199631
10282 -199631 -107972 -89384 -150130 -205031 -180139 -79677 18834 91719 102777 -7865 -28498
10271 -28498 -44024 -115384 -97636 -60967 -9883 -71526 -83899 -102821 -135382 -50830 -28954 -6088
10259 -6088 17717 -36827 -52405 -31598 -41579 -38311 -4467 -6462 -44787 -31572 -124256 -207506
10247 -207506 -229183 -212502 -187969 -150962 -67939 -87951 -38381 53178 104594 33873 1981
10236 1981 53736 74082 118716 62430 21305 24848 119 -28883 -30406 59792 16833 15627
10224 15627 98432 87016 89815 42943 -85271 -105802 -54587 -43238 -79455 -65845 123852
10213 123852 141181 83300 4767 -48730 7924 -29447 -17814 -64957 -99428 27707 134708
10202 134708 282332 250353 103564 104103 174398 194850 224506 166380 78148 17105 -3429
10191 -3429 32372 36167 73554 120754 124783 112378 22313 -35577 4529 20635 -25353 -18509
10179 -18509 117644 146152 39655 13974 14205 -19274 -65706 -106647 -108076 12832 139965
10168 139965 14262 -86079 -11274 -39891 -192792 -287662 -207925 -90747 80552 -5426
10158 -5426 -35590 -70416 -45046 36825 58509 42446 22136 24132 62592 7214 -53893 -38683
10146 -38683 29362 824 -5709 -78948 -59562 13289 -62024 -191402 -249863 -239459 -162036 -115959
10134 -115959 -48588 -29675 -68693 15288 82393 45598 26639 69960 105759 93744 -729
10123 -729 -80593 -92016 -41519 -76604 -86377 -20359 7010 45747 116534 100885 109960 95492
10111 95492 85584 4284 -32857 -14965 -34439 -9691 74158 140357 205802 144888 137645 162931
10099 162931 189799 83136 12951 10073 32457 -3944 -121966 -183431 -206686 -117062 -33882
10088 -33882 15892 41563 75033 69947 64944 18103 -847 -47344 -39420 -51083 -114293 -40794
10076 -40794 -99021 -200980 -220882 -127839 -80963 -132290 -259809 -241693 -157525 -33176 114889
10065 114889 130773 127488 -20738 -101070 -172913 -93981 67501 78985 134608 158313 103665
10054 103665 69445 93224 41155 29838 40997 46357 108151 101068 -8607 -14168 21274 36311
10042 36311 139103 112569 25274 -110840 -147924 -135428 -30721 -28766 -99940 4293 82969
10031 82969 222860 162100 38780 -14458 -30150 -117270 26819 160932 140188 23007 6840
10020 6840 41130 32196 155098 149084 57980 -15863 -17511 23994 68143 78109 13578 -42175
10008 -42175 -50702 39406 45726 -46755 -51153 -38704 -48039 -51823 -23609 -32855 -21204 31247 22362
9995 22362 119570 131001 72932 41690 102112 -11048 -68869 -64274 -26635 -41631 -11693 78150
9983 78150 171443 140429 136554 160198 111471 17054 -80748 -176315 -113189 -60662 -21286 8265
9971 8265 -12969 90665 167731 137652 9693 -68393 -77809 -81740 -45712 -68541 -51503 168704
9959 168704 205647 139427 33764 87989 44928 -81004 -180447 -163854 -56412 -33057 -56632
9948 -56632 -14488 -73228 -58276 -68585 -81093 -19203 12088 38755 -2631 -9132 2148 -38935
9936 -38935 37743 46225 61428 70141 44660 4705 16604 -124356 -143518 -82752 66988 39987
9924 39987 -78160 -22066 39818 -12943 31946 -88381 -186917 -166866 -160599 -14016 72184
9913 72184 71657 52526 39408 108598 84197 -54068 -15310 91585 167087 174904 149215 103258
9901 103258 116638 49694 57697 -19719 -50462 -43505 -23122 121335 109144 30593 -18167 -49565
9889 -49565 -21168 2924 -66099 -92075 -58595 -686 71624 80382 1637 -71335 -120041 -72973
9877 -72973 43463 77823 109323 34586 -63991 -83465 -1596 101331 126451 68311 26589
9866 26589 -47852 -81926 -75486 -96617 -149878 -26528 42959 133548 67601 -112382 -175165 7599
9854 7599 53894 44715 -36863 10924 20005 -1171 -208373 -137312 -41229 32385 -10190 20272
9842 20272 43360 -45953 -16433 -2679 -68245 -145958 -137262 -83366 57474 54948 -152566 -204789
9830 -204789 -31754 18829 21245 57970 -806 -80397 -76376 4058 67101 33500 -16980 -44627
9818 -44627 -17975 -55983 -54932 13958 60097 -1162 -119213 -126294 -87826 -77906 -47297 4986
9806 4986 -39944 -38893 -90040 -120910 -110354 -57545 -67336 -149253 -117793 -112873 -205227 -103374
9794 -103374 -121835 -38992 36060 34647 45662 -31234 -44565 55555 68025 137397 111920 -46839
9782 -46839 -79190 -4338 12219 41326 178586 110937 -31950 -107435 -79554 -58689 -40186
9771 -40186 -27618 22429 40991 19648 24806 -30172 -47516 -100651 -58868 -9405 98903 97669
9759 97669 128230 109714 106099 63520 68534 35562 -127357 -161163 229 68377 750 -50746
9747 -50746 16040 79351 119326 42884 51175 80365 -1289 -28523 -33601 -68119 -15279 70333
9735 70333 -32412 -115351 -107185 -139301 -150291 -126591 -132037 19320 13317 -95097 -100104 -88558
9723 -88558 -29525 47660 26703 33295 48657 -39490 -22776 -42958 -26715 45839 119786 157666
9711 157666 174565 141716 118220 10410 51928 45726 -104658 -124705 -48482 -104407 -140719
9700 -140719 -82547 -31454 52946 -7034 -56656 -41838 58624 -27170 -155354 -57905 -18250
9689 -18250 -65165 -72568 -22375 -29770 -7472 1685 -43898 -79188 -141972 -98127 -99260 -138665 -243759
9676 -243759 -297645 -271057 -208103 -103173 -51687 28018 115479 -5578 -39760 -93883 -51768
9665 -51768 14636 -32159 58874 152817 125980 1145 -137762 -143992 -177295 -70611 -38400
9654 -38400 -148970 -89491 -52799 -30708 29767 29511 10653 70616 152908 231952 169552 122741
9642 122741 111740 99311 100438 126221 63489 44366 61167 50355 -55602 -147865 -124423 -95973
9630 -95973 -70960 -34912 -50499 18045 71815 13659 -15055 65300 41792 -38585 -11136 -48789
9618 -48789 -1945 35588 12243 20194 51984 173863 212121 68990 -61060 -53212 -4149 -42975
9606 -42975 -164541 -131492 -167115 -227817 -206547 -165933 -166156 -162026 -243503 -213328 -131502 -41567
9594 -41567 -9064 23737 100885 85222 -37009 -23754 -8959 -17126 -94476 -152416 -92177 -75509
9582 -75509 -26036 -62671 -126395 -105440 -91923 26232 49921 55816 -17849 114100 233358
9571 233358 229420 133889 20465 10350 -29407 44547 -34668 -171801 -118118 -93892 -79546
9560 -79546 -30017 39520 62067 3772 -6079 102701 87867 -45696 -87824 -18889 55431 49251
9548 49251 13811 -23380 -18779 -6293 -105492 -149720 -136148 -120506 -57830 31649 42583 -17419
9536 -17419 -69455 -34791 -121419 -73707 -83091 -111141 -34558 -18017 50967 61340 40403 23232
9524 23232 -43377 -7053 -120261 -103002 -58146 -38402 -9274 11778 4817 -25365 45216 65526
9512 65526 130704 38277 2700 -1170 -87158 19591 87247 44014 20283 -60193 -64289 37366
9500 37366 79638 115202 94160 33599 -15720 -25717 739 -36988 -118606 -195697 -206107 -175487
9488 -175487 -178178 -177413 -210334 -264775 -279141 -147155 -111636 -112968 -95572 -97742 -126806 -95163
9476 -95163 -111624 -63406 -65573 59277 90990 91380 46349 31386 16992 29567 78704 11883
9464 11883 -98760 44987 162230 128512 77340 70065 113943 144522 90397 35521 17467
9453 17467 16006 63797 167945 172983 77404 157026 103233 44283 52685 -34775 -60854 -2070
9441 -2070 69338 47384 120998 214070 224220 214531 103269 57570 121695 175404 173656 163561
9429 163561 83623 91719 103624 5885 -33706 -1402 40545 72939 -7068 -30482 -38596 -57842
9417 -57842 -26021 -44003 -67826 -69926 -33546 33522 -51324 -54890 -46930 -94480 -58735 18198
9405 18198 57254 4573 -26513 9631 114711 114237 187697 168115 187801 111548 93238 62229
9393 62229 136240 106515 112491 213386 229153 166483 73245 43289 118637 108995 110977 173278
9381 173278 72247 -70394 -101720 -74185 -85676 -138266 -32456 94413 102884 92004 -6517
9370 -6517 -27379 -25246 74555 28644 -128776 -197204 -147657 -53770 -56605 -88420 -38762 26989
9358 26989 29610 -43357 -639 24337 15586 -21412 -84370 -120162 -83059 2304 -4359 5064 12506
9345 12506 35907 -80349 -93733 -10912 62484 32609 -110849 -237911 -226015 -129780 -79203
9334 -79203 -11001 99166 141734 162395 133613 63410 89595 75899 151989 169653 114171 25371
9322 25371 110941 215701 100845 71866 14068 76828 184372 226304 279708 325147 292421
9311 292421 225622 174600 209237 219133 193064 88882 124458 164128 75111 56427 31566 27870
9299 27870 -19067 -43237 26603 121968 103349 124686 170263 187476 190839 208408 167624 134988
9287 134988 113121 75128 85848 54026 70386 27746 60328 46927 76951 2322 -98908
9276 -98908 -97398 37273 131723 146548 118702 77410 75764 6973 -28526 11657 42220 65122
9264 65122 136774 124708 57818 39406 10193 19006 56811 85757 80125 21431 29446 165922
9252 165922 252691 197734 150308 145203 90449 58151 154538 234042 208708 132112 109738 228928
9240 228928 239497 202668 168696 118332 46373 25299 39336 -57817 -37649 30141 6646 -60648
9228 -60648 -45392 -56748 -29621 32263 31243 29260 16999 -10208 5607 97798 109949 71686
9216 71686 102838 138411 41186 136400 181621 154639 130023 105823 60022 87110 158277 189052
9204 189052 151068 -2001 50529 119369 129792 137501 111431 77514 104322 147331 56943 57139
9192 57139 110823 222145 369333 359924 374361 325719 226768 123119 211020 272874 282196 256807
9180 256807 199657 122096 157756 257999 319223 299005 231320 181469 196884 254356 391285
9169 391285 352258 184770 159787 171422 208534 225672 165473 129789 21 -98183 30524
9158 30524 180058 147132 -3129 76159 180060 215979 149672 86368 122029 118886 182435
9147 182435 213095 146403 83072 83005 211084 307910 302827 274519 210363 233177 197670 192632
9135 192632 233873 346533 405545 507459 448778 399904 435033 529577 500392 446773 418331
9124 418331 415473 340747 311814 332916 389298 362744 383965 378547 481813 439078 426094 399880
9112 399880 373861 349678 391553 420759 442952 450162 464082 521445 525262 522026 467467 338962
9100 338962 248458 290343 279642 266869 333353 412431 494278 552947 578871 602285 585707 603298
9088 603298 632781 614112 672357 692754 722890 731493 807146 800912 773007 824213 807788 910772
9076 910772 1095925 1230976 1198183 1240569 1355429 1591374 1744990 2001335 2319635 2718415
9066 2718415 3242364 3838209 4771090 6205185 8251668 10923511 14755557 20381524 28529558
9057 28529558 37736460 41727541 35693528 27112036 20383313 15724635 12650161 10677523
9049 10677523 9298722 8225131 7394891 6709501 6168537 5827120 5398346 5025693 4733031
9040 4733031 4499747 4229688 4057299 4082256 3921437 3749566 3741464 3808882 3653836 3484470
9030 3484470 3440392 3363798 3327856 3448088 3527780 3600870 3431365 3302923 3275100 3230801 3024889
9019 3024889 2843583 2900558 2927419 2898249 2871500 2640882 2435108 2212714 1999609 1866379
9009 1866379 1725141 1571845 1469516 1321790 1240475 1190751 1111046 1126237 1094726 936089
8999 936089 891315 848122 821277 724571 633619 529813 468088 516703 466267 463357 425249 390714
8987 390714 370395 331335 414512 443028 367610 341316 259827 157670 154838 120373 132303 201819
8975 201819 285784 317525 274973 308502 359232 335634 160596 11909 5963 77633 2212
8964 2212 -116892 -142088 -97228 -117099 -112362 -54467 -6485 52574 94010 63432 -13672 -55262
8952 -55262 -124298 -169457 -173529 -60898 72243 66575 15900 -6659 -79780 -158043 -47545 42547
8940 42547 -68522 -220610 -129569 -21172 156464 175127 68260 -77537 -75732 53008 7730
8929 7730 -12305 -30137 -18002 13017 62512 65765 37874 -40695 -50765 80601 92953 79888
8917 79888 155672 110776 -1691 -6065 -45123 39216 10977 -92842 -123790 -174752 -142821 -93162
8905 -93162 -106639 -111265 -154335 -44688 -93280 -92227 -111067 -73282 24036 151569 63324 -35985
8893 -35985 -74260 -6896 31389 21182 69845 102675 97208 49513 91566 31121 20137 28160
8881 28160 -31986 -22304 46021 63646 -12926 -3438 -36782 -99943 23081 78890 76017 40446
8869 40446 -10115 -17391 -140237 -140494 -74916 -19324 12571 18763 16150 37663 178742 163443
8857 163443 102166 62577 115989 211162 136713 -52016 15441 121497 125198 164131 116492
8846 116492 -2169 -17351 -16281 -20026 41404 99762 140135 81224 -11712 -17938 30978 11227
8834 11227 -3875 -40588 -55118 -38642 -44891 -49680 -85290 -124912 -78691 3313 143931 149788
8822 149788 131725 127945 25094 3780 29284 17545 -12208 28896 197759 316128 194803
8811 194803 39237 -64823 21202 -19839 -123791 -83068 -9107 34497 -57418 -211742 -163199
8800 -163199 -32402 46725 142041 138486 79707 63743 45708 67965 62332 111259 16181 -8599
8788 -8599 58362 -8319 -42180 -27094 -24856 38940 106777 69474 13236 -71882 -6751 11270
8776 11270 -30302 -86431 -40218 -36050 -94362 -149971 -87721 20580 26143 39730 88165 60984
8764 60984 11446 -14765 76721 112958 75355 100118 48153 -42991 -25530 2953 53595 36862
8752 36862 -76337 -110674 44521 76439 95287 68940 -73050 -111160 -37625 54216 41937
8741 41937 1065 63937 164030 204702 289338 265662 186785 237365 176695 127699 76715 154614
8729 154614 91199 -19973 -32225 -46359 -97926 -80862 -70605 4332 -125428 -117948 -77874
8718 -77874 -62908 2772 35570 27332 52995 42692 137255 148010 67722 37483 8854 -29012
8706 -29012 236 30293 16460 16095 33580 10057 -97013 -126484 -38671 -61870 -105407 -86279
8694 -86279 -58419 32577 28242 6980 -19730 -156478 -180190 -111456 -59947 -58155 -142011 -157693
8682 -157693 -74892 72863 150097 192114 173741 140581 125290 184313 174418 184374 137829 116593
8670 116593 172449 102368 116975 122501 41621 25222 86256 55930 74040 130475 88410 58050
8658 58050 114192 117494 123045 141174 134973 119507 171370 130615 154701 143655 111630 11036
8646 11036 15849 -36459 -36817 47372 194497 121562 116284 155761 185521 169615 110288 140035
8634 140035 74516 55268 89714 154435 161384 202192 261386 316699 309656 278453 268808 285232
8622 285232 298392 351105 394399 259535 254100 280548 260311 194640 229237 215009 216298 222537
8610 222537 122735 -13134 42463 188676 180819 215236 211967 130092 44622 -16578 -72287 -19578
8598 -19578 72209 117144 93192 74495 150900 190708 170551 231504 239476 255004 287964 314259
8586 314259 242369 203946 157253 8117 -139938 -89530 -78762 -136898 -162862 -83004 32785
8575 32785 136003 107434 167051 54008 10105 131265 119652 105075 36952 -64312 -51969
8564 -51969 28178 -13315 -66271 -21392 -40986 -25361 39165 36223 84164 120456 148979 37141
8552 37141 -30366 -96178 -50971 28024 73500 136831 148974 4557 -11895 -3475 8276 -11478
8540 -11478 -32583 29340 7696 -13707 -11020 39858 3798 -82410 -33305 136463 107391 52268
8528 52268 59872 67887 13804 -99122 -142731 -175135 -205618 -91580 51875 167095 256016
8517 256016 174539 93634 13074 -70301 -121061 -124661 -125644 -94269 -91827 -75832 64883 169330
8505 169330 78717 75163 76392 -96218 -75573 -7505 185665 122258 43707 30505 107477 157308
8493 157308 126903 78932 54073 62726 15918 -29973 15273 -82276 -165280 -172632 -104841 -66334
8481 -66334 -235069 -204906 -220850 -215540 -259209 -152818 -44842 -46705 -30152 10229 -113152
8470 -113152 -226794 -129623 -36941 -35017 29573 28508 29526 66226 38104 -17218 8924 50293
8458 50293 136682 114131 47832 -7862 -59129 -1394 86126 98195 61772 44086 -55925 -86330
8446 -86330 2866 131045 151691 47549 -50862 -102783 -17148 -34443 26765 37501 -155631
8435 -155631 -301207 -283503 -140224 -87279 -60723 -113500 -124314 -119418 -99561 -99396 -13052 66654
8423 66654 126189 155162 88866 119128 161820 228700 211870 246537 164454 113381 79019 43668
8411 43668 39979 21086 -24952 -36267 70102 101626 85089 160986 288198 283903 263124 160181
8399 160181 38816 -79968 -120258 42257 115165 141297 134596 68115 -7263 42505 -5879
8388 -5879 -65602 -57273 -67211 -71712 -59040 -91759 -88130 -2660 86921 122379 21907 26687 60149
8375 60149 -9367 -125392 -137706 -80489 -23621 -79060 -68628 -87126 -92007 -108550 -142049 -144510
8363 -144510 -31247 82606 72894 12488 -66887 -132417 -55208 -127410 -217316 -239777 -272300
8352 -272300 -177138 -138500 -40344 31843 -87361 -162424 -53812 39487 -33953 -76041 2099
8341 2099 38065 63836 118219 169058 73084 8963 22420 88 -10746 20588 60888 47536
8329 47536 -80464 -22104 13008 -58641 -76429 -27697 -5262 -45191 48416 195671 154906
8318 154906 115365 119949 50561 23528 107015 118714 108435 -9042 -101681 -106140 5243 25706
8306 25706 140830 214589 118574 -27562 -132319 -70100 -46147 2379 199313 269760 168491
8295 168491 110094 40704 113018 128820 46291 78009 26381 -3096 -52200 -108280 -50591 -91190
8283 -91190 -151865 -125679 15025 6379 -50363 -95843 -142918 -75176 -4153 10821 38555 41717
8271 41717 -89843 -5300 -20948 19196 72454 118779 172014 220466 107207 17863 -12593
$$ [...]
##END NTUPLES=NMR SPECTRUM
##END=
